##TITLE=Analysis number 327834
Compound Code cc 23804
Book Reference 486/136
Project Code adrs
Chemist Name simons
##JCAMPDX= 6.0         $$ Bruker NMR JCAMP-DX V2.0
##DATA TYPE= NMR SPECTRUM
##DATA CLASS= NTUPLES
##ORIGIN= Bruker BioSpin GmbH
##OWNER= nmr
$$ XWIN-NMR		Version 3.5
$$ Wed Apr 11 17:16:02 2007 GMT Daylight Time (UT+1h)  MAYBRIDGE\nmr@NMR_250MHZ
##.OBSERVE FREQUENCY= 250.131544655141
##.OBSERVE NUCLEUS= ^1H
##.ACQUISITION MODE= SIMULTANEOUS (DQD)
##.ACQUISITION SCHEME= undefined
##.AVERAGES= 16
##.DIGITISER RES= 18
##SPECTROMETER/DATA SYSTEM= dpx250
##.PULSE SEQUENCE= zg30
##.SOLVENT NAME= CDCl3
##.SHIFT REFERENCE= (INTERNAL, CDCl3, 0, 16.4503)
##AUDIT TRAIL= $$ (NUMBER, WHEN, WHO, WHERE, WHAT)
$$ ##TITLE= Audit trail, XWIN-NMR		Version 3.5
$$ ##JCAMPDX= 5.01
$$ ##ORIGIN= Bruker BioSpin GmbH
$$ ##OWNER= nmr
$$ C:\u/data/dgb/nmr/ADRS/1090/pdata/1/auditp.txt
$$ ##AUDIT TRAIL=  $$ (NUMBER, WHEN, WHO, WHERE, WHAT)
(   1,<2007-04-11 17:15:42.78 +100>,<MAYBRIDGE\nmr>,<NMR_250MHZ>,
      <created by zg, POWCHK disabled, PULCHK disabled
       configuration hash MD5:
       49 4B E0 1D 92 C2 6B 37 9F E6 65 BC 52 41 86 1D
       data hash MD5: 64K
       63 E1 8A 83 71 7C 64 C3 1D D8 8E D9 53 72 78 DA>)
(   2,<2007-04-11 17:15:53.80 +100>,<MAYBRIDGE\nmr>,<NMR_250MHZ>,
      <Start of raw data processing
       ef LB = 0.3 FT_mod = 6 PKNL = 1 SI = 32K 
       data hash MD5: 32K
       DB FA 16 3F FA F6 3A 3B BE 72 56 80 27 0B 5D AF>)
(   3,<2007-04-11 17:15:55.47 +100>,<MAYBRIDGE\nmr>,<NMR_250MHZ>,
      <apk 
       data hash MD5: 32K
       87 98 B9 52 10 A1 61 5A E4 C1 10 A9 F7 17 1E 30>)
(   4,<2007-04-11 17:15:56.16 +100>,<MAYBRIDGE\nmr>,<NMR_250MHZ>,
      <abs ABSG = 5 
       data hash MD5: 32K
       4F 86 5B C6 D0 63 8B 03 D2 BD 2C F8 AB 22 88 18>)
$$ ##END=
$$ 
$$ hash MD5
$$ C7 CC D3 D6 CE 12 5A FC D8 0F 4F E9 9C 7E 64 32
##$RELAX= 
##$RELAX= 
##$RELAX= 
##$RELAX= 
##$RELAX= 
##$RELAX= 
##$RELAX= 
$$ Bruker specific parameters
$$ --------------------------
##$DU= <C:\u>
##$EXPNO= 1090
##$NAME= <ADRS>
##$PROCNO= 1
##$TYPE= <nmr>
##$USER= <dgb>
##$AMP= (0..31)
100 100 100 100 100 100 100 100 100 100 100 100 100 100 100 100 100 100 
100 100 100 100 100 100 100 100 100 100 100 100 100 100 
##$AQSEQ= 0
##$AQ_mod= 3
##$AUNM= <au_zg>
##$AUTOPOS= <49 >
##$BF1= 250.13
##$BF2= 250.13
##$BF3= 250.13
##$BF4= 250.13
##$BF5= 500.13
##$BF6= 500.13
##$BF7= 500.13
##$BF8= 500.13
##$BYTORDA= 1
##$CFDGTYP= 0
##$CFRGTYP= 5
##$CHEMSTR= <none>
##$CNST= (0..31)
1 1 145 1 1 1 1 1 1 1 1 1 1 1 1 1 1 1 1 1 1 1 1 1 1 1 1 1 1 1 1 1 
##$CPDPRG= <>
##$CPDPRG1= <>
##$CPDPRG2= <>
##$CPDPRG3= <>
##$CPDPRG4= <mlev>
##$CPDPRG5= <mlev>
##$CPDPRG6= <mlev>
##$CPDPRG7= <mlev>
##$CPDPRG8= <mlev>
##$CPDPRGB= <>
##$CPDPRGT= <>
##$D= (0..31)
0 1 0 0 0 0 0 0 0 0.06 0 0 0 0 0 0 0.0002 0 0 0 0 0 0 0 0 0 0 0 0 0 0 
0 
##$DATE= 1176308141
##$DBL= (0..7)
120 120 120 120 120 120 120 120 
##$DBP= (0..7)
150 150 150 150 150 150 150 150 
##$DBP07= 0
##$DBPNAM0= <>
##$DBPNAM1= <>
$$ [...]
##$SUBNAM7= <"">
##$SUBNAM8= <"">
##$SUBNAM9= <"">
##$SW= 20.6930455092707
##$SWIBOX= (0..15)
0 0 3 0 0 0 0 0 0 0 0 0 0 0 0 0 
##$SW_h= 5175.983436853
##$TD= 65536
##$TD0= 1
##$TE= 683.16
##$TE2= 300
##$TE3= 300
##$TEG= 300
##$TL= (0..7)
0 120 120 120 120 120 120 120 
##$TP= (0..7)
150 150 150 150 150 150 150 150 
##$TP07= 0
##$TPNAME0= <>
##$TPNAME1= <>
##$TPNAME2= <>
##$TPNAME3= <>
##$TPNAME4= <>
##$TPNAME5= <>
##$TPNAME6= <>
##$TPNAME7= <>
##$TPOAL= (0..7)
0.5 0.5 0.5 0.5 0.5 0.5 0.5 0.5 
##$TPOFFS= (0..7)
0 0 0 0 0 0 0 0 
##$TUNHIN= 0
##$TUNHOUT= 0
##$TUNXOUT= 0
##$USERA1= <user>
##$USERA2= <user>
##$USERA3= <user>
##$USERA4= <user>
##$USERA5= <user>
##$V9= 5
##$VALIST= <valist>
##$VCLIST= <CCCCCCCCCCCCCCC>
##$VD= 0
##$VDLIST= <DDDDDDDDDDDDDDD>
##$VPLIST= <PPPPPPPPPPPPPPP>
##$VTLIST= <TTTTTTTTTTTTTTT>
##$WBST= 1024
##$WBSW= 4
##$XGAIN= (0..3)
0 0 0 0 
##$XL= 0
##$YL= 0
##$YMAX_a= 283033
##$YMIN_a= -460595
##$ZGOPTNS= <>
##$ZL1= 120
##$ZL2= 120
##$ZL3= 120
##$ZL4= 120
##$ABSF1= 16.45035
##$ABSF2= -4.242823
##$ABSG= 5
##$ABSL= 3
##$ALPHA= 0
##$AQORDER= 0
##$ASSFAC= 0
##$ASSFACI= 0
##$ASSFACX= 0
##$ASSWID= 0
##$AUNMP= <proc_1d>
##$AZFE= 0.1
##$AZFW= 0.1
##$BCFW= 0
##$BC_mod= 0
##$BYTORDP= 0
##$COROFFS= 0
##$CY= 12.5
##$DATMOD= 1
##$DC= 0
##$DFILT= <>
##$DTYPP= 0
##$F1P= 14.0000005364418
##$F2P= -0.99999901652339
##$FCOR= 0.5
##$FTSIZE= 32768
##$FT_mod= 6
##$GAMMA= 0
##$GB= 0
##$INTBC= 1
##$INTSCL= 1
##$ISEN= 128
##$LB= 0.3
##$LEV0= 0
##$LPBIN= 0
##$MAXI= 10000
##$MC2= 0
##$MEAN= 0
##$ME_mod= 0
##$MI= 0
##$NCOEF= 0
##$NC_proc= -4
##$NLEV= 6
##$NOISF1= 0
##$NOISF2= 0
##$NSP= 0
##$NTH_PI= 0
##$NZP= 0
##$OFFSET= 16.45035
##$PC= 1
##$PHC0= 230.0588
##$PHC1= 8.657309
##$PH_mod= 1
##$PKNL= yes
##$PPARMOD= 0
##$PSCAL= 4
##$PSIGN= 0
##$REVERSE= no
##$SF= 250.130017920307
##$SI= 32768
##$SIGF1= 0
##$SIGF2= 0
##$SINO= 400
##$SIOLD= 32768
##$SREGLST= <1H.CDCl3>
##$SSB= 0
##$STSI= 32768
##$STSR= 0
##$SW_p= 5175.98343685301
##$SYMM= 0
##$S_DEV= 0
##$TDeff= 65536
##$TDoff= 0
##$TI= <Analysis number 999999
Compound Code 99
Book Reference 9
Project Code 9>
##$TILT= no
##$TM1= 0
##$TM2= 0
##$TOPLEV= 0
##$USERP1= <user>
##$USERP2= <user>
##$USERP3= <user>
##$USERP4= <user>
##$USERP5= <user>
##$WDW= 1
##$XDIM= 32768
##$YMAX_p= 548694697
##$YMIN_p= -241380
$$ End of Bruker specific parameters
$$ ---------------------------------
##NTUPLES= NMR SPECTRUM
##VAR_NAME=  FREQUENCY,     SPECTRUM/REAL,   SPECTRUM/IMAG
##SYMBOL=    X,             R,               I
##VAR_TYPE=  INDEPENDENT,   DEPENDENT,       DEPENDENT
##VAR_FORM=  AFFN,          ASDF,            ASDF
##VAR_DIM=   32768,         32768,           32768
##UNITS=     HZ,            ARBITRARY UNITS, ARBITRARY UNITS
##FACTOR=    0.157963299565203, 1,           1
##FIRST=     4114.72629220514, 0,            0
##LAST=      -1061.25714464787, 0,           0
##MIN=       -1061.25714464787, -241380,     0
##MAX=       4114.72629220514, 548694697,    0
$$ Real data points
##PAGE= N=1
##DATA TABLE= (X++(R..R)), XYDATA
$$ [...]
22703 185159 147068 118559 141251 92445 29466 -2874 50549 2116 -55594 -58807 -82461 -68430
22691 -68430 39279 98280 65944 32171 -9071 8581 25137 -44181 -41509 -36082 -33757 39452
22679 39452 59872 7765 15819 68680 83420 66128 74497 33527 20720 94257 101191 140460
22667 140460 181060 165298 125925 111080 94234 51426 55973 126862 154587 184347 180170 181501
22655 181501 148899 179152 218985 185981 153577 128230 150686 140110 112095 127823 91965
22644 91965 108333 73086 57420 70419 122600 181577 195816 107623 136612 164461 211876 215917
22632 215917 143325 76690 18635 86606 159276 220533 227363 150382 91367 66359 119658 97742
22620 97742 87494 156577 159455 141799 123962 121741 146855 257799 351872 335744 304727 309757
22608 309757 330768 354542 374040 424759 420371 414959 401360 485013 577303 622666 578283 609793
22596 609793 630123 676692 740129 736352 704985 731575 686405 656508 690431 684055 588395 502395
22584 502395 475771 490731 508983 478577 393030 383450 387178 320556 322125 338373 385935 416266
22572 416266 354361 295798 323030 372542 409356 407789 414702 392270 355300 373555 363936 404199
22560 404199 453353 494298 506886 500261 445758 419562 470920 431283 410517 434128 447323 496994
22548 496994 477700 430826 435070 490639 488913 489757 513669 513753 542600 589140 574515 606904 731951
22535 731951 800845 912792 1133194 1302606 1351599 1333021 1347487 1256765 1145798 1041990
22525 1041990 902899 852555 806595 765522 787328 750571 689417 735265 801339 795708 768294
22514 768294 806812 902440 937487 935313 947090 914376 958144 1039496 1089671 1099949 1176674 1283130
22502 1283130 1311669 1370967 1446250 1529410 1591432 1694271 1753052 1814189 1859276 1878967 1945583
22491 1945583 2030417 2137081 2316748 2525338 2657549 2819340 3017514 3270653 3521064 3834688
22481 3834688 4166195 4626464 5046533 5531484 6098783 6793189 7626809 8629350 9862663
22472 9862663 11325712 13114734 15249725 17803204 20968146 24867160 29730372 35997088
22464 35997088 44293985 55619392 70734567 89664207 111166905 133316574 153668094
22457 153668094 168417145 173454910 168379069 153402981 129704161 103876521 80004568
22450 80004568 60017320 46067686 37089094 30952253 26474299 23046248 20373168 18364668
22442 18364668 16777615 15482330 14393011 13529012 12801952 12160060 11472067 10770464 10213480
22433 10213480 9695360 9156610 8663468 8180290 7785850 7425854 7143043 6863310 6602342
22424 6602342 6380331 6144480 5901922 5766790 5706673 5614630 5508957 5334288 5229510 5146366
22414 5146366 5116286 5082984 4992021 4872797 4759014 4623665 4556672 4511280 4419548 4337703 4322793
22403 4322793 4285595 4246871 4268147 4247323 4182416 4102827 4058471 4037840 4051264 4055852 4018455
22392 4018455 3978355 4022362 4055161 4023384 4054204 4135565 4224935 4349965 4475980 4567264 4737558
22381 4737558 4860773 4888881 4900800 4851567 4788332 4743627 4612411 4403785 4284442 4120208
22371 4120208 3981572 3863090 3764027 3666709 3517572 3284967 3231603 3168701 3043125 2911018
22361 2911018 2878004 2849495 2826299 2674175 2525332 2471593 2411978 2296342 2174059 2107394
22351 2107394 2059604 1930259 1849236 1815370 1783627 1756316 1748088 1748807 1669767 1602549 1575211 1603071
22339 1603071 1579391 1581752 1558235 1571245 1549180 1471490 1396863 1345574 1369125 1324269 1313529
22328 1313529 1336325 1288385 1264692 1232635 1198063 1132885 993051 903448 775734 730814 752222
22317 752222 738714 700657 599645 547202 562525 505492 428873 391984 406815 378736 331276
22306 331276 351603 281204 268906 318798 308812 241931 248779 275143 264389 227848 216342 246354
22294 246354 249704 236391 263869 313104 261457 204357 166753 182266 189624 175905 136008 147714
22282 147714 108715 133463 143153 211397 193075 136442 134675 97291 47098 6612 13681 21998
22270 21998 -51626 -24838 88163 144367 146683 149647 159721 159201 138778 120949 137187 134754
22258 134754 57187 106924 97671 88915 88397 57396 101860 154390 139832 136436 202700 210160 242969
22245 242969 232466 180954 149636 192274 216742 203610 202545 207568 207187 197283 234266 268771
22233 268771 310481 284520 250965 213249 211989 270957 282146 243035 241108 256954 228891 246031
22221 246031 247635 224445 246338 243251 244739 267691 237667 243098 224269 200522 202435 227550
22209 227550 240914 266654 288856 249397 185865 159760 162406 195612 181109 176969 145196 163873
22197 163873 240495 261707 296546 259544 185291 177504 172324 140192 168279 158356 142127 154231
22185 154231 165564 127418 128215 117378 153525 180782 143015 142291 133957 95758 120311 205518
22173 205518 203758 178423 111855 36237 45863 74123 111671 94195 45744 -3132 -43485 17417
22161 17417 26421 11124 27140 33425 77169 87100 80640 106294 88403 74476 17424 41617
22149 41617 112036 105013 46238 50184 60258 34420 15943 49010 138468 77288 -16093 -11383
22137 -11383 -54964 -31703 23780 38635 37454 20231 40992 84615 45682 4852 13612 33521
22125 33521 18395 -7670 1967 59568 72799 23473 -13259 31315 104410 97452 50318 -5048
22113 -5048 -22493 11134 -11030 -34735 -25675 51357 84700 72582 35233 78851 148834 147688
22101 147688 10366 61034 100923 171401 153680 105491 17400 89402 111636 115247 102705
22090 102705 155665 155878 120367 60794 -40390 -64810 -16409 -14508 2770 20484 -13574 56166
22078 56166 48407 15504 6182 -8842 -14933 26378 58676 68279 23341 1863 42802 85326
22066 85326 117235 68435 1511 -32940 -20731 41337 98781 137446 133008 120239 91027 12674
22054 12674 -5305 -38422 -32964 474 33441 56208 38217 59979 53041 38510 82238 51102
22042 51102 46290 60011 44654 36139 -39639 -103764 -96580 35073 67766 32046 -16630 -24068
22030 -24068 -7207 -10656 -31961 -22097 -14670 7530 103546 79490 10672 -13394 -14210 -41214 -44229
22017 -44229 -35119 41664 -13500 -79449 -87250 -31995 -6927 -51079 -81203 22081 73108 75598
22005 75598 69687 70274 89834 113316 168917 220855 213196 204680 128186 30661 89616 113535 86702
21992 86702 60739 51080 5174 -11062 -1381 10227 -901 32658 53959 64677 59551 62970
21980 62970 94016 45679 36176 44536 36747 12665 -3262 35430 107972 130725 42109 26539
21968 26539 6151 -47561 -47970 -39806 -25773 62509 79663 60194 71339 34882 -48193 -57823
21956 -57823 -39194 3496 74170 130202 134511 96662 96981 8551 -27302 9998 19553 16368 -745
21943 -745 -26959 4621 58614 74930 -10137 -37357 -23051 16416 25074 51375 50034 62358
21931 62358 46467 27543 -40534 -74300 -4350 15519 53208 66573 79709 124614 104750 66063
21919 66063 101746 117772 134497 156116 207606 186887 135266 175042 222342 267949 391847
21908 391847 456750 512207 687603 798267 878322 947671 942657 904173 851291 644089 530104
21897 530104 465658 370566 326511 250741 132402 79546 66181 60525 99360 62082 10487
21886 10487 26812 47878 56423 64604 120858 162458 159713 94685 71129 26120 29414 31090 31955
21873 31955 48415 18287 -34306 10833 29552 88213 74496 57856 77252 58341 73501 85671
21861 85671 63561 -10275 -19190 21809 -27175 -92810 -38492 30954 44824 597 -14401 -27766
21849 -27766 -11302 24567 49600 15858 9963 -30472 -38722 -20566 -20461 -10231 10835 28144
21837 28144 10968 -20147 -69149 -43765 -30780 -38576 -41529 -59307 -12606 27837 39204 6289
21825 6289 -16544 -64350 -63439 -28600 11290 79510 69523 28791 27036 -15902 -22449 17152 -3218
21812 -3218 -69310 -103910 -93675 -83279 -23569 35951 -42192 -132401 -127612 -31681 -371 17877
21800 17877 48666 59475 46317 46046 37997 -14746 -39158 -4771 259 26111 -22785 -81107
21788 -81107 -50165 21181 74476 76096 28579 11287 -24258 -58075 -31270 47961 63354 28763
21776 28763 -46180 -98692 -46295 -21937 -8138 14432 10421 489 10226 -30930 -75664 -43554
21764 -43554 -13710 34579 74827 18638 -59531 -55293 -38669 -26686 -8378 9305 -49161 -51338
21752 -51338 -63226 -113153 -128456 -108219 -86622 -100473 -96059 -43363 -19470 -30530 -52188 -9923
21740 -9923 -3957 -23311 -61968 -38457 15640 20884 20665 44281 48718 -12828 -1675 14779 25752
21727 25752 50739 19083 69646 54039 1742 -18819 -19971 57665 95004 91148 84861 25027
21715 25027 27468 26239 39174 -5676 24796 57058 48191 52075 8400 10392 -57760 -62621 -80183
21702 -80183 -52591 -56722 -77740 -103450 -99038 -25478 27079 20124 4248 -34545 -66164 -79071
21690 -79071 -35566 -273 5380 -58202 -92647 -67034 -91385 -123179 -109974 -45841 14895 -6548
21678 -6548 -73946 -93007 -74793 -15738 43737 25686 29591 19630 -22720 -62767 -81754 -26837
21666 -26837 -17375 -54707 -73721 -47163 -115564 -105049 -64291 -17546 22259 17296 -14128 15943
21654 15943 88500 39011 23137 23103 41395 27799 6073 -48302 -102099 -75570 -57169 -51761
21642 -51761 -78661 -156160 -116556 -64067 -82382 -47195 -42213 -31883 86845 103127 41024 -27190
21630 -27190 -51867 -34151 -36611 8199 24055 46044 77846 48993 64345 14255 -32854 -31489
21618 -31489 -27797 -46886 -41269 -66669 -103725 -62115 -30929 -54890 -80552 -42223 -35752 -23507
21606 -23507 -17176 -23306 -69377 -96289 -109082 -118058 -135329 -124729 -101846 -60202 -43756 -36592
21594 -36592 -39255 -7962 -23633 -7524 54658 69424 33744 -8211 23366 45757 38308 51898
21582 51898 56423 20752 10240 9956 -20109 -53518 -114290 -93217 -86819 -67671 -26763 4911
21570 4911 -15050 -32276 -55948 -40562 -57675 -45889 -60869 -114348 -171152 -107000 -56922 -4766
21558 -4766 36316 -6204 -12959 30770 26247 -17905 -18049 -40666 -37153 -36069 6859 35603 50105
21545 50105 29615 -36010 -132244 -80845 10830 15542 67677 90596 36712 5139 -14165 16694
21533 16694 -13051 -55847 -16676 7236 -10767 -95942 -138133 -107024 -78741 -92067 -67148 -9233
21521 -9233 6100 5388 56946 92158 122598 15811 -17193 19921 -11258 -1990 -51975 -72226
21509 -72226 -96622 -118359 -58019 10032 70138 79267 25750 38374 -7515 1325 -14533 -7486
21497 -7486 -40256 -115894 -105616 -66637 -100263 -81181 -52456 -61547 -24385 4612 5534 -16914
21485 -16914 -77673 -93146 -56749 46460 -9909 -48953 -16245 7943 -15348 -61283 -44465
21474 -44465 -7498 -378 8708 -14708 -55831 -104930 -75486 -81501 -24809 655 -48521 -65757
21462 -65757 -68210 -81106 -10509 45597 54527 45194 -13728 -17486 -29470 -42654 -40023 -5586 36651
21449 36651 -28847 -40025 -64481 -14405 -2077 201 -7800 -35675 -20798 38833 -9845 -38127
21437 -38127 -77260 -49376 -65477 -119371 -109135 -51872 3859 42749 -38743 -33458 36908 62933
21425 62933 43548 29767 16451 66642 43628 26966 -3099 -14249 -68247 -110569 -125802 -96784
21413 -96784 -63246 6657 67722 789 -59877 -6478 36304 34146 -29919 -50435 -22662 -12524
21401 -12524 -27815 -26638 -4376 -20533 -9004 32728 43833 27981 14127 -37635 8408 -37865
21389 -37865 -53728 -21279 12282 -14011 -98755 -129874 -102918 -106606 -87524 -17059 28549 26409
21377 26409 47202 30121 11227 45083 12554 44027 43771 24143 17750 -28292 -40642 -22142
21365 -22142 -48000 12369 64506 38613 72399 78174 33864 -3195 -35380 -55633 -12915 9682
21353 9682 27401 32387 8669 -18455 -17401 -21720 22044 66721 67653 56371 14959 -70631 -70317
21340 -70317 -33772 -38586 -47246 -11901 30780 13130 42586 49994 51916 1201 -26296 19923
21328 19923 49207 24207 -13349 -54803 -40145 -44258 -29573 -43993 -70465 3685 29454 -11197
21316 -11197 -1104 -11408 39344 56598 46190 15757 59494 17649 -52703 -39487 -1970 -34643
21304 -34643 -74189 -87377 -75391 -88751 -86718 -30096 -7855 -35456 -35921 7477 72240 63733
21292 63733 7170 27655 1161 -21594 -35971 -59439 -88567 -70130 -37229 -35531 -69472 -82755
21280 -82755 -73936 -134146 -139900 -140643 -107604 -22352 11028 -82355 -118732 -52340 5526 -5413
21268 -5413 -17251 -34763 -28372 42782 67576 44832 13372 62130 27378 45517 67967 50319
21256 50319 49977 34626 15249 25482 30609 16485 13373 -17948 -22735 -22986 -4461 13037 -10625
21243 -10625 -11642 29877 26301 -32356 -61769 -35938 -7182 -4998 -42259 -91446 -69720 -48935
21231 -48935 -27235 -61059 -96899 -16039 -3083 -12226 -31171 -17681 17844 41925 55979 72598
21219 72598 108675 113970 70602 -1681 54654 101903 69507 25052 64804 33839 -26882 -50653
21207 -50653 -44873 -40714 -58871 -66861 -77212 -70330 -44210 -32552 -34684 -15080 38222 75282 105185
21194 105185 87667 67982 35190 5311 -56679 -60864 -58460 -57347 -80926 -67470 -36210 -35188
21182 -35188 -1662 19861 17494 -55159 -76540 -85990 -102650 -73624 -69334 -47426 -17169 20687
21170 20687 70988 43845 50474 6323 -45732 -22595 13055 -59374 -154661 -143289 -171506 -142793
21158 -142793 -19770 26108 -11406 3545 29832 37259 -30084 -50795 -47606 -79474 -83599 -51399
21146 -51399 -8286 -22050 -43398 -22307 -19529 -29362 -36096 20210 45021 67306 27145 -33144
21134 -33144 -18209 -25715 -6697 -7299 -39224 -5862 -35042 -109630 -134253 -100541 -108304 -97255
21122 -97255 -30553 39683 -14972 -37921 -3431 -41730 -44679 -53718 -53386 -13643 -14625 -52669 -50573
21109 -50573 -53447 -91920 -96226 -136406 -115919 -45190 -38267 -66719 -29366 20455 5460 -3936
21097 -3936 1538 13194 -7053 6571 19273 -24328 -37246 -6047 17129 -32159 965 79370
21085 79370 77322 -4058 -92399 -100615 -90312 -31681 -18459 -45911 -15684 -11877 6186 29198
21073 29198 74463 106514 71797 7246 -19869 -37246 -21758 -46518 -34170 9184 37654 57846
21061 57846 81230 55638 -4875 -55451 -51162 -41218 -30433 -34363 -78934 -64930 -11954 21404
21049 21404 4636 15782 -12968 -15004 9541 44859 7939 -49611 -81997 -80836 26970 3136
21037 3136 38206 74128 94094 74360 62678 107227 44944 -7593 -37001 -12560 -30276 14966
21025 14966 47189 38118 -820 -18977 -22435 -16664 -10733 30728 64888 -8558 -37470 35107
21013 35107 61734 20661 -43978 -67323 -73147 -37595 -15479 -10298 -38276 -84141 -108268 -97880
21001 -97880 -74639 -80445 -46314 -38287 -75517 -49665 17413 -5690 -36713 -32356 -57886 -90909
20989 -90909 -82998 -61199 -42597 41506 42994 9033 -22694 -62971 -90185 -115138 -108943 -102776
20977 -102776 -93214 -13283 -34387 -97501 -144213 -110976 -96784 -55267 -39178 -40992 4165 -31695
20965 -31695 -84727 -94338 -65955 -28324 -22377 -3242 -34627 -42040 -16473 -22165 46439 38663 2050
20952 2050 40135 42569 17608 -11787 -21347 -7101 31717 -3655 10623 53728 42823 -9268
20940 -9268 -58761 3911 2791 7067 49321 18672 18698 -11135 -58683 -73986 -57979 -70058 -73417
20927 -73417 -8209 -4577 -9773 3157 -26550 -59104 -96804 -107017 -70329 -59838 -57475 2954
20915 2954 -898 18900 80085 104900 120142 58607 21216 33739 26367 58920 45653 46658
20903 46658 89447 80956 47757 32414 38550 76622 76707 9904 -55885 -114495 -121634 -81508 -75127
20890 -75127 17507 28495 28576 46689 25657 -3686 -39818 -4920 11634 -35996 -12331 38429
20878 38429 5913 -34592 -16143 76746 121427 107498 41519 -53433 -104201 -101378 -38944 40
20866 40 -29135 -76128 -116243 -72446 9819 -11369 -31689 -17209 24301 -21168 -70674 -19466
20854 -19466 21778 22157 7477 4442 56011 76940 -33686 -9241 31543 86005 107712 64919
20842 64919 -37090 -86164 -15515 18555 -42481 -55416 -48645 -30011 46118 112683 57816 38207
20830 38207 38309 41547 20753 -24611 -42980 -55814 -29354 -31907 -23 -2619 -53459 -54550 -71933
20817 -71933 -80803 -70580 -23555 15163 912 3928 -37035 -80624 -68878 -89575 -83038 -60649
20805 -60649 -54066 -55340 -12878 -25977 -108218 -107290 -78335 -101878 -82443 -35928 8635 703 24460
20792 24460 76172 67947 29645 27274 -7929 17162 83714 97297 29379 -23398 -25352 -16232
20780 -16232 11348 30644 54997 115461 111410 45327 56817 13771 -22543 -32372 -3316 -14036
20768 -14036 129 7030 -34046 -26686 6890 77004 99179 118980 75864 37532 49747 59966
20756 59966 48376 16504 37273 15045 34289 56090 43937 58234 80125 36772 82775 114583
20744 114583 57971 34044 15295 1831 22720 21878 49039 62974 96644 82773 103009 88998
20732 88998 60875 18550 8600 52119 69039 56532 4950 -3268 18992 98548 135184 116674
20720 116674 34713 38433 62598 -42300 -53421 -46545 -27872 13920 61466 74322 51858 57477
20708 57477 36974 -5338 9539 25223 -12370 8165 -48831 -86265 -106875 -179228 -140449 -60219
20696 -60219 -41173 10957 -13792 -52377 -31574 -30631 -18588 14020 20792 14282 34562 54525
20684 54525 12605 -38654 -27741 -7731 5563 -40085 3335 19317 -36275 -60156 34572 103206
20672 103206 105773 101243 61188 11882 -33193 -58270 -65004 -6525 -23343 -55238 -54089 -33873
20660 -33873 22479 14442 34141 31152 -45144 -102604 -59858 -13508 -14444 198 8833 -5239 12349
20647 12349 -4416 47574 61116 16843 38048 101769 112961 107228 42266 1609 -13896 -2741
20635 -2741 -32827 -13733 -62657 -75826 -54010 -64663 -29116 -12519 -28665 -97711 -94450 -24190
20623 -24190 13859 854 -7326 -9000 -31509 -72143 -100298 -117035 -52435 2066 -29565 -52453
20611 -52453 -67819 -67448 -57662 -5624 -21981 -9608 13158 -41566 -56376 -16896 -12500 15645
20599 15645 81276 61030 29908 32214 95975 132914 99999 57338 35485 -4287 -28274 -11933
20587 -11933 46045 40255 24840 16400 32560 8142 16112 -33776 -66026 -31514 -7926 12380
20575 12380 -6852 -14126 -36745 -54385 -13851 8856 -62331 -19193 50157 61487 13928 -13349
20563 -13349 8574 -52402 -53690 3665 49742 7155 -16137 27583 34113 20374 -8227 -57779
20551 -57779 -57166 41138 133494 90812 71318 19973 -27156 -37077 -44601 -61489 -52952 -21973 19911
20538 19911 49685 33693 42738 -7427 -12829 24569 49487 36508 71993 67875 34421 45197
20526 45197 39755 15592 25194 54864 66693 76554 73143 7755 -37955 -54568 -113080 -141759
20514 -141759 -96741 -74499 -114702 -120798 -146848 -149668 -106301 -59041 14933 7300 1739 -55099
20502 -55099 -35579 12263 2070 16365 -9234 -47718 9456 -9110 -12519 34338 61335 11467
20490 11467 -13353 10146 53448 77763 31216 68523 79704 20233 -55857 -106415 -64366 -43054
20478 -43054 -24872 -2248 8826 -2279 8976 28699 19082 -18352 -77869 -90097 -78980 -53033
20466 -53033 -91420 -112445 -52464 -38084 -81550 -60289 -21202 -28065 -58463 -86041 -71847 -22360
20454 -22360 -3723 -737 18268 15356 1503 51313 23989 -35410 11027 54322 23844 41344
20442 41344 95983 61977 -14484 -43522 -61845 19386 71430 45877 52620 133829 71445 74462
20430 74462 45978 30527 3690 -42221 -46901 -16169 -11840 -23172 -98310 -122809 -96467 -38096
20418 -38096 -6946 6866 18370 -36623 -18851 -51260 -74487 -90053 -41892 11700 30076 20622
20406 20622 17620 44798 -1363 -4495 26726 14009 21499 51177 39197 87012 85931 27978
20394 27978 46005 53284 44840 27790 11491 47064 98207 81565 26072 -17708 -92251 -100937
20382 -100937 -57127 -26834 28144 30689 46493 80321 85574 85847 82434 64133 -20448 27601
20370 27601 96196 87405 54737 30283 43489 -8523 4961 6705 10852 -40423 -44179 -29775
20358 -29775 -62280 -126114 -135491 -78054 -25938 72943 104915 112327 114119 119398 78336 77420 21435
20345 21435 6648 -3615 13614 73651 97066 142495 145385 54706 -39296 -50283 -25613 -59877
20333 -59877 -89479 -100355 -70136 -50058 -74948 -79120 -95654 -137601 -63133 22129 5050 1416
20321 1416 28043 15114 8109 6276 -60911 -94786 -58447 -12647 -22133 -20157 -34530 -14801 18919
20308 18919 -11604 -48981 -44594 -33881 -35931 -65008 -40485 -33213 12538 26501 13434 97096
20296 97096 148534 116506 95628 43131 46909 64562 5259 -22462 -30940 -30613 -48636 -41309 11921
20283 11921 19445 -24699 -21017 -11508 -37011 -49199 -41823 -28671 16448 68209 75360 8701 -13099
20270 -13099 -14024 -49568 -75966 -81665 -93934 -56919 -47616 -40039 -86548 -38106 -6204 -57462 -63596
20257 -63596 -76535 -101910 -80869 -88828 -74191 -41158 -27039 -20883 -68574 -130684 -107643 -12548
20245 -12548 32013 72853 16104 -8545 19656 -12188 18177 23077 23284 -34991 -61538 -29964
20233 -29964 -25568 -51307 -110850 -112091 -85763 -16526 16881 53607 42898 -14540 -13545 28217
20221 28217 35959 9397 -15731 -81788 -89873 -76715 -83977 -87053 -44466 -61218 -41188 2828
20209 2828 29258 67218 44976 -39994 -66083 -43089 -13940 3007 65502 75741 75761 72536 67018
20196 67018 94056 101201 87028 30808 33061 18131 -21928 -8876 47730 85563 91226 86552
20184 86552 52269 7406 -7250 31488 22624 -13151 -53750 -92444 -55090 -55643 -41950 2450
20172 2450 63287 72397 42514 -11075 -99109 -73699 -72619 -56886 -26056 -48842 -39500 -46191 -34996
20159 -34996 -9672 -2596 40353 -4282 -49060 -13849 -26874 -30643 -16912 46635 131346 134289
20147 134289 99942 51036 34291 48023 64943 77973 84689 93530 59116 24751 -23976 -1666
20135 -1666 30675 59557 66693 45772 50406 39688 -24190 31161 69265 70263 58549 82818 48709
20122 48709 55502 32898 -25597 -21652 -2476 -6428 31250 51609 27648 73843 87006 73890
20110 73890 23620 -5213 -21607 -56856 -10780 4637 -39802 5998 3677 -34327 -24119 7500
20098 7500 -14438 -31755 18235 27685 1408 -60000 -31034 -38351 -35114 46830 46018 26751 20781
20085 20781 -24502 22856 46401 24551 -25501 -37611 -92181 -93719 -38793 -68917 -87580 -87237
20073 -87237 -70700 -23726 -1283 45307 26725 18962 15420 -35039 3483 66182 80613 45419
20061 45419 34241 62649 145549 119684 33061 -41737 -48527 -19210 61115 124423 55839 2650
20049 2650 52 5252 -4242 -33237 -28580 -52452 -43257 -5104 37287 68844 31177 17786 19222
20036 19222 -13521 -48354 -42522 -27518 31472 21543 32568 77035 78643 15782 -4206 13335
20024 13335 44814 80202 37958 -13513 8270 79734 112738 84217 66857 66208 94798 127648
20012 127648 110091 56435 -13115 -17798 -13084 -53400 -19750 -30214 -17856 9463 54233 44338
20000 44338 396 23520 13545 3730 -35476 -53541 -105541 -74122 -60897 -63464 -27123 3510
19988 3510 1587 44810 69907 70961 69071 132713 130759 115713 43355 41422 -57633 -69424 -22135
19975 -22135 14261 7768 27980 25592 25489 28076 -4030 -56742 -4705 49527 40730 23146 6599
19962 6599 64976 106201 136640 154563 109925 36024 32454 43769 28082 82982 65320 70009
19950 70009 105173 60576 26411 40227 67899 98879 85292 141869 112683 103991 140046 146811
19938 146811 124927 70690 51934 29458 10411 -34909 -109379 -124243 -97761 -89632 -58186 -18743
19926 -18743 -58762 1928 48018 15299 60622 98532 75003 61035 79988 147677 106726 66691
19914 66691 2395 -39966 -31013 -48794 -18189 19002 -5979 -25650 -11311 -8937 55453 85356
19902 85356 91656 74722 69869 74946 81570 135134 135987 69096 71934 82826 89447 100430 98492
19889 98492 107042 65412 13454 -22385 26435 29972 -14745 -9855 -31748 -54265 -19571 -8633
19877 -8633 -18688 -19906 -29728 -10924 20808 47128 79733 121792 105940 106433 111984 87639 84739
19864 84739 55638 38234 53205 71430 136454 129457 106796 89992 84493 86554 41473 38399
19852 38399 16817 17632 51553 42420 53961 47580 63653 102661 138120 134362 173045 195279 139686
19839 139686 57060 29483 -8433 -46584 -67136 -27369 -10974 54684 73998 55178 -9090
19828 -9090 42440 21903 -34492 -14562 56236 100575 102316 32058 17198 21319 41456 26690
19816 26690 -8080 -42871 -6498 27253 31866 68015 -24268 -62186 -4346 23969 1565 5151
19804 5151 61977 127298 126168 62828 29789 -9747 32621 107203 88504 86272 92945 83009 33906
19791 33906 -31984 -32505 -10161 24182 81030 169518 130763 36851 38418 62219 86660 131946
19779 131946 159963 150296 136424 123592 107109 132538 102285 47005 107447 164144 128243 68871
19767 68871 113318 157243 177947 153030 141899 98958 88981 183968 330067 494247 540477
19756 540477 516631 495123 483876 505185 462778 442120 420813 400048 416542 428577 489718
19745 489718 521072 528045 535224 523687 485750 474041 440514 472801 457399 440225 433462 384164
19733 384164 329922 308133 224806 180089 101590 183879 287474 283180 259726 310092 262867
19722 262867 221534 249983 202279 152377 167215 152659 153567 201641 224738 194360 209805 252197
19710 252197 299112 325493 302997 317971 312800 298802 372604 443395 458729 525136 594300 602127
19698 602127 640825 682565 691156 698610 706993 627699 587998 621772 614905 594667 547518 494511
19686 494511 437677 383460 329324 265614 316130 303352 297896 293689 225923 218146 280198 332851
19674 332851 356509 402349 454582 456145 413355 353865 335104 329802 319389 349878 404210 479788
19662 479788 578467 619869 593903 588876 578513 615967 624596 615971 617325 587252 551426 538356
19650 538356 494724 490382 453864 366085 239921 166333 181680 256804 271323 228675 215453
19639 215453 244586 246745 265961 256316 270601 276968 273874 246372 157809 176955 245890 319221
19627 319221 362949 313492 252482 257047 256462 266473 304259 329406 292763 267784 366423 448046
19615 448046 506123 525986 533962 535360 512712 460297 531963 637678 656148 610116 563779 539658
19603 539658 542930 478444 544312 616850 624163 642142 700153 744987 772951 672800 573774 480940
19591 480940 420182 337394 362059 395125 361499 350023 327741 299549 251344 255501 288832 268265
19579 268265 231252 144882 91675 76147 130958 197244 200714 205726 213165 258166 250253 155979
19567 155979 116170 140872 173070 156409 195357 187693 121824 131668 167184 116584 70859 72274
19555 72274 70371 45470 81948 115921 140616 161487 163797 167201 103581 90995 132467 109137
19543 109137 21216 -6420 38081 121037 89152 49785 127447 132071 62410 -13383 -40212 23033
19531 23033 65705 59846 36202 55464 65511 88634 101472 96441 128406 145484 147852 120132
19519 120132 71880 32516 92531 103987 59028 80812 84849 135136 133165 133825 77181 48351
19507 48351 114609 138451 129145 101527 91250 106352 119349 100774 169426 231014 207447 227946
19495 227946 212213 176448 203228 195406 182013 146075 159880 190821 166217 189995 206548 224228
19483 224228 266873 307503 327465 314806 345144 389610 375581 352915 388957 449774 449294 353662
19471 353662 265358 263153 275279 266012 311540 296565 281233 251620 189488 188519 260381 268307
19459 268307 167016 137074 161988 241120 238787 215813 232947 290431 319745 309035 285800
19448 285800 334740 385355 390440 418546 407077 383815 367656 311397 299030 321785 387489 404682
19436 404682 495782 531526 475140 459446 444561 464025 470168 471368 447548 380435 424282 421163
19424 421163 446609 478375 541056 588191 604945 561033 508369 510967 567782 583184 567574 502721
19412 502721 489367 486919 444181 481077 495487 468309 437486 477624 515179 509748 487356 452482
19400 452482 486829 532481 545237 528535 500592 469776 490138 513720 533876 582472 577917 549121
19388 549121 510975 511229 520564 589674 563796 534111 568936 620333 607232 569881 536772 532457
19376 532457 524863 533714 558597 582834 481389 437179 500069 539768 578437 577882 571264 591409
19364 591409 562606 557321 579693 561898 560780 574904 616126 626396 647785 699778 714940 742891
19352 742891 791863 763929 770994 768063 744255 753931 858049 913149 975293 963361 915425 875250
19340 875250 880881 913659 997156 1036733 1020965 1010575 1113979 1214268 1193205 1173910 1201554
19329 1201554 1237584 1295129 1309629 1273848 1213812 1204269 1194404 1139365 1168755 1140610 1093527 1048901
19317 1048901 1043311 1073730 1057854 1079077 1051334 1068338 1036221 1059904 1039108 1013809 1042687
19306 1042687 1076357 1038080 966738 1014835 1082211 1160626 1174642 1188776 1278865 1358649 1386914
19295 1386914 1426915 1490361 1531611 1594669 1652218 1697936 1729881 1731961 1861690 1977579 2032413
19284 2032413 2055546 2146207 2267754 2341449 2418163 2564209 2640095 2721760 2853607 2969544
19274 2969544 3063887 3182674 3295269 3434551 3661476 3915766 4227139 4477771 4771944 5140190
19264 5140190 5614570 6105621 6718336 7507629 8385434 9497983 10890584 12477661 14285591
19255 14285591 16302585 18507118 20958609 23728232 27285009 31943924 37452069 43485850
19247 43485850 49611698 55432306 59922915 61703043 60912007 58431517 54366700 50007172
19239 50007172 45935394 42310958 39373156 36584644 34408654 33292093 32695445 31850512
19231 31850512 30035293 27481994 24682618 21643630 19043959 17210917 16024779 15301797
19223 15301797 14801888 14538459 14474010 14545155 14794905 15183174 15746414 16479562 17453745 18655746
19213 18655746 20200479 22222164 24810001 28084473 32298159 37297575 42643510 47840451
19205 47840451 52617334 56454650 58807999 60388097 61997809 64595861 70146877 79972846
19197 79972846 94325866 112710894 134025703 156687191 178008373 193806325 201495920
19190 201495920 200688308 190301395 172299451 150518975 129154372 109703007 93670873
19183 93670873 81644940 71814652 63005985 55032880 47676935 41804752 37629324 34601646
19175 34601646 32420538 30772040 29528546 28601338 27862563 27361646 27002324 26751616 26536653
19166 26536653 26334628 26281803 26349236 26469979 26713814 27285167 28170229 29434942 31102844
19157 31102844 33339017 36213895 39892025 44706715 50987876 58798978 67749397 77458205
19149 77458205 88310733 101817391 118037063 135639062 154710099 175074579 194520991
19142 194520991 209732928 215280617 207571154 189299693 164893015 137789985 111036978
19135 111036978 90087430 76646176 68995177 65100362 63877969 64101525 64223712 63550025
19127 63550025 62175736 59359983 53861366 46827239 40939845 36896267 34092862 31907012
19119 31907012 30236628 28891588 27815158 26852756 26078646 25438886 24908991 24651322 24594305
19110 24594305 24704180 24980900 25447490 26210170 27349520 29103180 31446106 34353937 37385285
19101 37385285 40042652 42254735 44061710 45138637 45192583 45481050 47512652 50883612
19093 50883612 54784935 59155476 64431382 69264853 71055810 69947072 68116170 66324694
19085 66324694 62368431 53961153 44161925 37043308 32794546 30092533 28120291 26531185
19077 26531185 24971757 23096461 21138991 19549861 18367666 17475801 16834661 16291900
19069 16291900 15804754 15365798 15004579 14639919 14291815 13951827 13625515 13335780 13009806
19060 13009806 12681296 12328098 11981902 11562071 11205788 10884444 10454032 10053875 9743779
19051 9743779 9458015 9138751 8852454 8621330 8404763 8213816 8050862 7842740 7669365
19042 7669365 7389697 7101761 6901291 6745454 6576840 6410883 6356057 6258643 6155847 6080569
19032 6080569 5971073 5838079 5738388 5637510 5453267 5336477 5295834 5227974 5182835 5179291
19022 5179291 5156521 5113892 5037182 4996285 4928443 4837800 4735501 4639860 4561289 4488873 4479954
19011 4479954 4476777 4425593 4291197 4132431 4030621 3914002 3802824 3676189 3580119 3478772
19001 3478772 3354982 3237175 3146991 3017184 2933390 2895705 2849324 2788610 2621552 2471182
18991 2471182 2376266 2304789 2217261 2180954 2153614 2084094 2048243 2002078 1973010 1917094 1888977
18980 1888977 1896803 1885629 1836288 1769166 1663756 1672066 1714002 1687735 1655652 1655725 1667119 1687293
18968 1687293 1685884 1595780 1557542 1596039 1574813 1513562 1493270 1476818 1496438 1503768 1505986 1499610
18956 1499610 1527590 1546465 1527715 1621565 1673724 1641350 1573586 1486317 1427053 1363406 1284626
18945 1284626 1230009 1222703 1213063 1227518 1221367 1235589 1266550 1284483 1349912 1382313 1336137 1317153
18933 1317153 1245494 1145474 1038325 970810 988740 1005072 992572 1013933 963469 939073 1026042
18922 1026042 1022915 937568 900659 909673 909430 884376 871035 794029 756896 794507 851897 837572
18910 837572 744842 742347 751297 739642 706681 687419 719192 741530 794218 777807 709254 763953
18898 763953 765531 728394 752576 785336 740163 712715 655002 605952 671119 691539 686422 725285
18886 725285 719200 692042 705865 729267 689983 655329 625256 605376 576361 557739 574213 611923
18874 611923 625804 663143 696693 686662 645761 693519 684960 652520 600292 626820 624982 570964
18862 570964 548743 602981 597473 580301 550456 511724 485164 502259 469528 425975 423163 411349
18850 411349 435393 439984 496076 550151 516636 487213 534347 529393 531771 508100 528081 505346
18838 505346 464947 454923 387815 313219 322766 383169 477940 519459 512637 450101 482589 509291
18826 509291 455580 441183 473229 454602 401119 437646 492163 525177 505744 458636 396214
18815 396214 333534 378395 433795 379193 409816 438077 442260 434539 434255 410709 368620 358006
18803 358006 306689 236036 266877 265395 236727 323097 405332 351573 332952 326143 350900 361343
18791 361343 334579 318398 282350 315660 357712 389283 371772 307268 274788 329110 357934
18780 357934 407908 437684 400936 375469 442929 513738 519539 517658 494356 516648 567628 627443
18768 627443 721399 812176 852411 862853 831670 758451 674371 564456 500982 472871 550041
18757 550041 533100 435690 408550 449535 457426 473323 445248 409853 449192 472300 458381 414495
18745 414495 372587 357605 387558 390347 368027 399581 437235 477976 511514 415197 332797 377963
18733 377963 445727 521009 595019 675630 754503 850851 858163 780076 766183 752080 696011 658098
18721 658098 718172 794720 834592 925451 982698 929421 822989 782102 767908 664583 601644
18710 601644 555206 549598 558649 536133 490336 467819 456206 442006 414611 375964 363056 338200
18698 338200 292771 272841 287586 331681 338475 344364 345343 337345 354143 362110 375552 347070 376957
18685 376957 445949 486361 521655 543346 535027 553352 586695 564096 535188 530388 583410 617861
18673 617861 710682 787868 850229 809740 791915 766810 739208 670127 612636 610784 608247 676566
18661 676566 644252 657884 707913 664805 600352 581653 566086 531783 445909 404995 461408
18650 461408 475041 463963 438499 426081 450048 514862 582071 653553 757905 855722 909950
18639 909950 898132 914069 918944 905907 891823 884682 931144 949435 953051 1000305 1037866 1012647
18627 1012647 979153 872688 770918 685868 587059 532859 471948 379949 332766 346844 409845
18616 409845 426895 425922 460430 474142 445479 422560 465949 493529 476199 463015 413387 378017
18604 378017 414367 373624 358460 401138 437245 472785 489026 513604 453848 466544 608468
18593 608468 691994 712331 720298 636490 590946 602959 541344 508964 566214 636779 556752 602573
18581 602573 625541 598931 559402 572263 565333 638623 702744 705943 648699 581717 503823 446706
18569 446706 399781 405225 401610 402537 347048 305620 292267 338898 396538 376493 345946 352657
18557 352657 335858 374555 353978 321324 276301 272793 253881 260091 236927 282454 300173 257813
18545 257813 229323 281520 289611 304344 300173 328638 297110 238801 222860 232907 242544 255534
18533 255534 226434 238283 255952 234632 217737 251760 272676 218212 194707 227582 285044
18522 285044 308831 287112 318849 371906 469118 528914 527941 506971 438836 368079 380377 404125
18510 404125 453623 458878 488692 530869 570803 591753 637457 644700 643211 609236 643716 633851
18498 633851 598337 489712 476537 516446 603085 655471 635260 599756 592952 590278 589090 546992
18486 546992 485865 468350 502306 503898 501451 536819 564459 562986 524775 503390 446697 425751
18474 425751 418153 403042 352305 332420 439543 483789 428504 366167 340426 285282 289691 325093
18462 325093 352097 377487 374956 378007 413690 380504 327568 331426 313051 269603 241191 283004
18450 283004 307424 343137 343054 306111 314076 339088 352870 368013 402297 364204 379988 406379
18438 406379 453084 454223 494285 506311 459225 453487 478748 540351 618405 647993 608888 573352
18426 573352 641334 709424 738118 768630 727414 712344 706366 763828 826428 876363 866064 905375
18414 905375 970975 1019846 1088451 1149236 1218999 1286018 1289271 1313510 1334657 1372488 1478546
18403 1478546 1536152 1590221 1673680 1794176 1943907 2130127 2375900 2605603 2753422 2988646
18393 2988646 3196170 3431840 3687730 3834827 3953196 4177016 4466160 4780672 5232416
18384 5232416 5777751 6389723 7198314 8180343 9324525 10656796 12265652 14134091 16318753
18375 16318753 19127733 22815456 27736831 34278306 42677332 52765122 63659033 74168597
18367 74168597 82887417 88469615 89683901 85715193 78395400 69076616 59567548 52581189
18359 52581189 48953656 48999085 52401358 58624170 66913661 76047254 84508011 90610471
18351 90610471 93012514 90423799 82784537 72222310 59634739 47531211 37722519 30482696
18343 30482696 25437808 21953130 19455982 17530378 16021432 14803822 13804176 12972040
18335 12972040 12184346 11494184 10965823 10532528 10038657 9614350 9277447 8951422 8690143
18326 8690143 8460748 8179416 7851826 7555457 7260542 6948454 6657982 6326964 6068534
18317 6068534 5854270 5724999 5630816 5492018 5322852 5197950 5098649 5012607 4926327 4915414
18307 4915414 4863480 4771699 4701405 4702052 4712084 4671223 4552284 4431507 4360734 4322484 4338617
18296 4338617 4304286 4250696 4250304 4251668 4216407 4203655 4199873 4161682 4145114 4119397 4135993 4146913
18284 4146913 4156243 4155266 4089648 4067963 4065727 3986012 3941918 3894322 3845980 3845237 3787270 3719845
18272 3719845 3740581 3709333 3594578 3501459 3416586 3331792 3260786 3197451 3116029 3026387 2999651
18261 2999651 2970249 2885110 2777413 2670785 2647550 2648368 2556689 2479710 2455172 2424498 2385875
18250 2385875 2284452 2237286 2193222 2106835 2059306 1992138 1993228 1986015 1930932 1875745 1831179
18239 1831179 1790522 1727471 1713589 1694753 1663497 1614944 1570756 1550210 1496171 1417867 1374991
18228 1374991 1314558 1266814 1196504 1165978 1170481 1071001 995905 938811 938930 950620 894816 869284
18216 869284 835279 791671 779588 690661 607570 626699 618927 584202 568268 535152 565998 567008
18204 567008 510773 497571 444147 360534 347710 376882 400641 400555 377019 382796 379492 366512
18192 366512 333048 340796 357271 247414 215836 234206 249292 194357 162838 185250 216305
18181 216305 181275 173631 213186 247697 306340 342893 298097 267957 251699 242461 198940 216197
18169 216197 196296 229872 284029 303984 295921 309702 333308 382338 363226 353140 332469 357636
18157 357636 425347 419192 424237 443108 492810 514215 475869 434266 462951 455346 452024 487885
18145 487885 611149 679236 699152 740112 808649 776938 846918 955594 1054605 1084241 1144592
18134 1144592 1231442 1294033 1383141 1485591 1630516 1779158 1956928 2103220 2291883 2580365
18124 2580365 2909841 3231088 3690376 4259949 4835510 5639876 6595544 7796799 9358380
18115 9358380 11278307 13887762 17692920 23424350 31547950 40935440 48715098 52922012
18107 52922012 55089348 56494880 50713501 36192289 24231346 17465419 13612153 11095185
18099 11095185 9307720 7960146 6960486 6179841 5628815 5264012 4986110 4626344 4319002
18090 4319002 4094041 3917973 3786783 3598840 3347408 3162984 2976566 2759220 2547426
18081 2547426 2375116 2281709 2212623 2135931 2070982 2028506 1977174 1904427 1837662 1836785 1774653
18070 1774653 1704155 1690289 1655359 1629343 1561533 1522521 1500910 1521945 1508540 1423398 1365319
18059 1365319 1354533 1443524 1474669 1426592 1420281 1386595 1348906 1339850 1355142 1356327 1286103 1314141
18047 1314141 1303181 1240005 1215533 1172964 1157475 1153292 1170418 1229365 1189083 1166403 1176609
18036 1176609 1154484 1194029 1229713 1200496 1197584 1212091 1208003 1231845 1246887 1303562 1298820 1271310
18024 1271310 1235494 1190328 1179060 1192042 1170307 1072328 1089845 1073040 1001278 967121 910299
18013 910299 906963 941741 895770 773470 687607 648153 605519 547903 607435 649149 643210 696053
18001 696053 716275 734163 687277 639162 597255 635431 596229 511214 447588 444270 501169 605218
17989 605218 653492 668679 662864 625943 627168 669650 676338 606028 532656 575862 555870 513522
17977 513522 508179 502870 478320 526641 474691 367643 307293 298723 329303 331404 324643 376461
17965 376461 352076 307223 302380 247097 229987 227738 292778 256242 263193 284893 216290 229185
17953 229185 270076 253720 218435 233372 242019 243445 225436 250147 221369 115020 114477 171501
17941 171501 163643 104590 84523 71599 73052 98380 122817 171297 174013 164979 157054 172465
17929 172465 188536 207195 182438 106212 73745 193151 213455 192292 164882 127531 108426
17918 108426 102825 79732 86091 106472 90982 53634 96021 141248 120139 115314 101197 153099
17906 153099 176261 141722 117833 103668 58648 83302 131785 66797 7498 61645 70736 69909
17894 69909 103129 76296 40393 50270 32279 8869 58850 106508 114575 109648 100103 23857
17882 23857 27857 40102 29122 11268 -3673 -18004 35954 33322 91820 179054 91995 67445
17870 67445 128031 116394 79544 39653 -24345 -46272 -11797 8974 54694 99530 126649 135104
17858 135104 172221 149439 103007 94658 94257 76061 68818 131660 125610 144524 146570 108785 80419
17845 80419 71253 59964 77232 91994 88294 79387 115919 152813 117857 95483 87304 106241
17833 106241 134414 126045 85069 122171 127616 93251 89120 127431 123900 85461 120462 117806
17821 117806 109058 140371 181976 170218 131501 61175 43567 23415 71914 83961 60846 93736
17809 93736 88201 64687 84696 56110 26562 4719 632 -21460 -18600 -3064 26622 60592
17797 60592 73827 90154 94765 38624 58293 51862 33073 69897 126321 96186 108222 122721
17785 122721 104008 115843 128290 187013 210423 177060 180537 247703 327078 384533 408112 460101
17773 460101 461359 476962 482660 535568 481799 351898 307569 255020 261661 262819 286992 320932
17761 320932 397457 377314 350303 407182 410454 336281 284446 328601 307188 236969 179855 129338
17749 129338 122696 91515 89289 89201 111022 126199 115012 154984 183646 220680 163118 48150
17737 48150 11411 13100 78762 102870 129493 115929 142664 144580 72835 23845 25932 -26040
17725 -26040 -11304 5353 -41299 -63839 -8503 47191 73325 102663 121804 44528 37430 -10373
17713 -10373 -21575 -3292 -2580 16889 6039 -22647 -6190 17965 101858 118691 104217 140492
17701 140492 154754 134329 132447 107233 98871 78872 38062 50489 46924 101174 124576 71018
17689 71018 44457 83393 126572 115789 121679 155562 170525 209328 234021 248828 373030 490191
17677 490191 599461 665996 646629 601514 524918 447245 395633 335621 297922 327444 394464
17666 394464 446752 461505 486008 531842 643598 702219 649354 529604 384727 291405 226062
17655 226062 198837 220922 211890 166425 200320 205332 190279 145670 158185 216140 152745 64180
17643 64180 17547 27996 26691 37482 44521 45864 50093 49335 69646 131759 162965 104502 30422
17630 30422 27851 36432 16606 -73261 -75665 -24451 25929 72918 90794 38150 16429 -31008
17618 -31008 -39056 -19784 8715 50484 42765 39456 61595 100105 104728 45902 74006 102479
17606 102479 78928 66632 131080 109279 46039 11271 39899 32351 47516 43263 61816 53017
17594 53017 53082 62722 48501 76828 42480 18778 -322 -1929 -11139 -31861 -56285 -24076 -28827
17581 -28827 -11079 1014 -18425 -36429 -45110 -46688 -69626 -65971 -36101 52328 110424 117169
17569 117169 104033 123980 101697 114549 94755 80771 44415 6373 -8578 22509 52177
17558 52177 75646 71172 52820 60073 -2765 12347 15889 -17202 6581 27344 7431 -4001
17546 -4001 -6159 23662 10627 14794 57148 36180 49483 51869 26641 32019 65842 44146 -9552
17533 -9552 -64404 -47436 -19952 -34750 -105836 -104963 -36397 18895 24333 -10912 -10952 -67596 -44489
17520 -44489 30566 -8074 -46975 -7154 35294 57217 24213 42183 17825 -33413 -16805 -1274
17508 -1274 10665 3016 24731 56806 76977 124844 167848 146452 129955 81893 47880 26587
17496 26587 86250 61651 42857 -12845 -43065 -48912 -37734 40770 88023 47025 -35210 -128618
17484 -128618 -116864 -73388 -60650 -94244 -53362 1429 23843 -28226 -74029 -94975 -19523
17473 -19523 18156 26718 60816 -10837 -88422 -94275 -86319 -48656 45453 17777 4381 33048
17461 33048 39298 -36111 -30857 -6481 -2187 -16857 -39033 -26621 -23948 -74872 -52683 -19389
17449 -19389 -27109 3343 14327 83883 162476 197539 194819 192674 228044 310459 361565 288866
17437 288866 168793 117355 63298 53660 41530 11471 20774 11926 3045 -62645 2117 57747
17425 57747 63571 26347 -40345 -22716 21753 11591 8145 870 32789 23963 -3431 51588
17413 51588 90032 66029 6349 -57167 -55603 10651 19372 -4208 -6147 16271 57392 65154
17401 65154 -6425 -51593 -39754 -27186 -13485 40491 54689 41174 72998 30847 -433 2124
17389 2124 59526 84604 89216 142116 136433 108671 173872 132128 115746 96563 119572 107522
17377 107522 77176 105574 122335 69538 88202 135856 122846 35969 44557 100728 97816 88851
17365 88851 77499 51023 33667 79527 97025 172295 192897 149977 112427 126958 137366 138257
17353 138257 135994 71362 2698 -14122 4920 51337 52661 38023 63210 68162 111575 121155
17341 121155 113549 56291 -3367 -15755 -28058 12565 11757 52057 48508 34710 36053 8450
17329 8450 19855 -5835 22548 -6804 28503 55663 39490 28749 -1570 11574 15702 27096
17317 27096 62320 44475 55395 16764 -5046 5297 58059 72772 101363 72106 39562 24405
17305 24405 8848 26937 36040 52432 24257 27974 93529 82069 81482 95480 66741 92771
17293 92771 161785 190701 172349 134441 110076 158762 195114 220349 255280 289908 258156 167009
17281 167009 161114 170793 204955 213831 165307 179752 195879 202528 261537 276679 247424 238129
17269 238129 274253 376125 405520 364969 429208 474878 485294 460185 468253 462126 514465 566026
17257 566026 531200 552196 523817 478904 435289 457406 451726 397850 439305 500956 536500 458401
17245 458401 400418 460180 475630 449590 441905 411696 436499 393436 309276 334053 340818 336550
17233 336550 285994 208306 257983 245972 223158 273349 245530 142244 82428 129142 227761
17222 227761 268315 307281 324068 241415 172353 168067 119643 154200 215484 194006 228634 248274
17210 248274 254704 270635 227568 221494 200196 204784 246489 253159 229834 220940 204678 246276
17198 246276 375182 406300 382055 364985 312538 315683 344608 389152 366734 369601 426015 433096
17186 433096 471787 555654 565637 551898 603175 644602 588978 576330 652303 707532 719014 757444
17174 757444 793385 802942 783507 799415 824097 889237 927758 969128 1087408 1148587 1185746
17163 1185746 1220509 1311356 1396598 1476297 1550018 1662049 1704099 1792199 1992997 2169031 2299556
17152 2299556 2538929 2738588 2994908 3261793 3472808 3729634 3998230 4301335 4698380
17143 4698380 5142601 5654970 6263910 6974559 7794301 8812747 10068926 11553970 13200926
17134 13200926 15110533 17526422 20646452 24657480 29908365 37267292 47704050 61155096
17126 61155096 75598146 87633235 95301901 99693760 100057546 90466023 72758670 57520545
17118 57520545 48627662 44627550 43935652 46150780 51522724 60418595 72244054 84232427
17110 84232427 92971673 97529418 99172518 94978335 80060720 60353615 45083170 35383724
17102 35383724 29099566 24687079 21427485 19020340 17199660 15841115 14768663 13901600
17094 13901600 13180811 12555637 11955341 11350522 10762535 10103070 9571863 9129305 8721073
17085 8721073 8396629 8066711 7751002 7460690 7316044 7213173 7046469 6863413 6608711
17076 6608711 6308755 6059823 5918323 5834651 5686642 5499035 5322698 5238695 5124272 4987662
17066 4987662 4920174 4915406 4859071 4827889 4787339 4691138 4641490 4626346 4624644 4583630 4540954 4477658
17054 4477658 4475401 4455023 4455383 4438117 4366903 4314912 4319692 4321946 4315101 4385452 4473710 4452547
17042 4452547 4384485 4381512 4355046 4268279 4109946 4080865 4033428 3961593 3854570 3821456 3825102
17031 3825102 3812143 3764711 3740542 3673553 3607222 3542673 3422078 3333618 3270011 3171240 3071114
17020 3071114 3008211 2898214 2838970 2718747 2620555 2572231 2480165 2414696 2341582 2296828 2229498
17009 2229498 2173405 2129381 2013591 1913158 1886337 1842980 1810843 1776438 1763877 1714924 1703095
16998 1703095 1702110 1614447 1496983 1540081 1549778 1505131 1504773 1493058 1472024 1420777 1301152 1280870
16986 1280870 1295825 1295492 1248372 1204812 1132685 1074982 991865 1008220 965192 910838 894163 857333
16974 857333 799282 727777 667905 598024 536868 463238 444502 492350 512615 481610 410146
16963 410146 410843 389744 357138 312862 238159 237435 214316 225244 279356 232682 208553 180538
16951 180538 178484 215672 205221 203164 225187 183122 162183 202361 203384 204687 162296 114540
16939 114540 117804 169837 148584 157362 189070 178274 143256 197976 215845 196587 225715 227110
16927 227110 208491 137489 56939 53973 91603 114577 99601 56921 1379 57858 45071 83071
16915 83071 139245 130774 127832 158924 174922 217614 264312 312397 329665 256996 208782 232318
16903 232318 281066 276935 258223 223554 198780 187128 186779 258558 237679 213446 217120 285391
16891 285391 331300 300797 273785 252059 214488 221558 250008 309808 296282 293618 267341 243782
16879 243782 266328 268332 215141 170710 203973 276361 254783 187553 153126 182117 214080 222915
16867 222915 188707 204162 193757 184069 222655 210474 229582 163870 132855 179090 187664 199388
16855 199388 214746 218481 183014 122119 142404 149876 186743 199331 158654 122756 160527 199756
16843 199756 149144 131433 209931 234426 199213 203985 218582 212516 138586 93450 141523 177154
16831 177154 124688 121861 124467 119315 73369 75213 33687 36444 60118 112186 164451 136041
16819 136041 127230 102680 62725 29565 42403 76996 123600 162453 159428 177589 174040 129051
16807 129051 93140 61573 42154 61027 103387 60562 43940 18420 -51991 11804 40542
16796 40542 70241 12990 26314 28838 -4700 -29064 -17597 -27556 27572 65966 21311 -12538
16784 -12538 -29365 -31315 -43763 -60759 -27943 -31416 -48221 -90470 -98248 36304 114685 94269
16772 94269 93466 60402 81288 68309 308 3082 6641 75095 68142 35793 21240 91948 179121
16759 179121 247340 202656 133385 156899 123284 92314 116602 89573 115876 95717 59907
16748 59907 44750 110680 183507 205860 153992 120043 65024 5829 2243 39082 47987 23966
16736 23966 8665 -20801 -19773 63252 69543 26612 20035 44636 47677 68845 52024 62495
16724 62495 55532 73607 112784 137225 137288 112014 162837 164980 75230 12636 -8258 -41715 -95260
16711 -95260 -42319 50784 80386 78217 121651 117982 42590 21883 3028 -32257 -61764 -60518
16699 -60518 -64357 -11210 43662 54907 62385 99283 42633 62589 111359 74557 23632 85715
16687 85715 119155 110461 36930 41202 49981 48168 62030 43026 -34644 -42682 33571 119237 132811
16674 132811 96522 66301 71124 14646 28654 8319 -16720 -12215 38084 71328 54856 24730
16662 24730 22141 14589 3835 37281 75640 48508 11968 6620 -21467 -14344 -63075 -102597
16650 -102597 -97475 -47052 -53498 -50009 -12290 -32000 -42671 -18042 -37262 -26484 -20128 48034
16638 48034 79905 -38730 -74127 -56222 1087 6026 13034 50213 98024 64983 45658 10350
16626 10350 -58070 -41770 -16714 36283 63234 77577 36675 34224 -3520 -18567 39616 23118
16614 23118 -94440 -86761 -24806 -20966 -60929 -72821 -93539 -47550 13794 13843 11081 22492 1716
16601 1716 22043 13194 -25842 -42737 -19871 -10750 3240 15427 -19835 -16092 10504 22285
16589 22285 17237 8601 4154 -6973 53684 97707 127399 103261 90111 42396 6708 20555
16577 20555 23781 55336 104405 51402 57062 88663 141592 222546 300222 320611 334381 426978
16565 426978 496966 483940 504381 462355 380146 331660 296618 289844 313834 297180 324806 363602
16553 363602 423076 476762 512387 511669 503269 494730 449101 386178 292396 192114 101927 78940
16541 78940 100792 95177 66978 85698 119735 31807 -17551 10366 2260 -41464 -39337 -13529
16529 -13529 49673 27282 19625 -458 48823 47943 43743 30496 -8398 -25266 -8487 36911
16517 36911 23276 26638 50267 94972 52118 -13175 -28471 38233 75785 53817 15777 15623
16505 15623 -14072 -31161 -54766 -62829 -70399 -55968 -33905 -40119 -47087 -46895 -78168 -57845 -16095
16492 -16095 -63254 -74255 -34083 37298 76422 80257 103396 61753 40951 25399 -56466 -60258
16480 -60258 -4494 12638 2713 63880 84113 88201 71668 43558 48028 63803 22838 31036
16468 31036 84843 67958 3126 20544 56092 57872 -3073 -7890 34498 17621 21828 30492
16456 30492 2916 14284 -4570 -86839 -59013 -55002 -69892 -17879 45609 58360 24094 -98718
16444 -98718 -127652 -130113 -51543 -53613 -81563 -22605 -30774 -60129 -98821 -145566 -130434 -103472
16432 -103472 -68439 -57560 3242 3831 29751 60598 19110 -26725 -13515 -63220 -49006 -30072
16420 -30072 -67309 -39492 -15483 -41135 -7511 63260 92780 75552 59403 60631 55577 76643
16408 76643 61650 31843 -15746 -31560 -125689 -104211 -39704 10939 35597 27026 -13253 -56550
16396 -56550 -103536 -98642 -1524 77782 92897 63306 22269 -21092 -55627 -64234 -39653 -43388
16384 -43388 -11431 23963 -1978 -10298 -26546 -66153 -87943 -70807 -67079 -53406 -39059 -31370
16372 -31370 16917 90726 147605 131700 38420 -20561 -29986 -3955 -16659 -21933 -1520 3763
16360 3763 76 17503 -10784 -1665 23932 -38950 -57991 -67417 -139225 -182343 -139663 -11463
16348 -11463 5766 80670 60141 12564 -36846 -41873 -88379 -58208 -35556 -44718 -44494 -35704 -8853
16335 -8853 -2691 -28549 23798 70113 63283 70828 38288 40240 37519 -28871 -65094 -90502 -74335
16322 -74335 -32448 -38267 24344 35104 -42221 -51141 -85224 -116240 -47455 51666 41112 10808
16310 10808 -34869 -57573 -87755 -106082 -106708 -48389 14617 941 -20492 -41632 -41607 -25971 -37571
16297 -37571 -83912 -90608 -50381 1126 14705 44990 68011 82307 102224 95167 64596 22530
16285 22530 37126 15449 13934 -142 11393 65158 39148 -27775 -72955 -77800 -30683 -23798
16273 -23798 -21983 24300 47689 59790 454 -21403 45764 21379 3186 7570 -22436 -64249
16261 -64249 -38243 -4579 -39097 -812 57732 40967 14884 -76232 -66929 -40135 -51506 -59850
16249 -59850 -26227 45769 47430 34071 27927 -26506 -76859 -37453 27414 1253 -34176 12562
16237 12562 82013 49532 37843 10396 -31736 -133027 -170542 -138109 -49779 33965 102217
16226 102217 78078 62437 64769 37955 -2436 688 27390 15753 14018 40036 -5063 -41221
16214 -41221 -27931 -19491 -34590 -8108 18401 -8599 -38071 -47490 -105436 -116087 -99770 -71567
16202 -71567 -40869 -4550 -14949 -52747 -60686 13958 -1619 -49857 -60035 -81958 -80030 -58303
16190 -58303 5367 63320 88346 1613 -63971 -58233 -18816 -25760 -61698 -42457 -7608 -33068
16178 -33068 -3270 -3417 15051 5572 2359 -19075 -12545 -58626 -41191 -36379 -63543 -46944 -75637
16165 -75637 -89348 -70413 -60050 -44469 -29421 -21812 7437 -46350 -99291 -34134 32640 43844
16153 43844 21576 32717 -7076 15596 15958 -9253 -10388 342 -4877 28871 -6246 12135
16141 12135 63853 67631 20713 -8784 -9341 40860 50632 104390 113999 32405 55445 69509 51713
16128 51713 14277 25163 -1955 8084 37412 39958 101874 136003 137286 111510 94851 65726
16116 65726 4181 -26969 -25526 -46628 -33518 -44257 22064 61507 84672 141079 94343 52191
16104 52191 39446 -10590 -64744 -58553 26261 95196 80999 50205 21351 64148 33300 30303
16092 30303 96045 147393 114253 55218 14124 36706 -23732 -93616 -134008 -122776 -115192 -101026
16080 -101026 -50094 -41809 7266 8275 -50526 -16861 13888 10131 -40658 -95848 -87510 -77578
16068 -77578 -75252 -10938 27585 56938 24826 14864 45110 -5508 5382 3782 11654 -36528
16056 -36528 -7850 37014 -25937 -60029 -88425 -110903 -42501 29086 21499 -7697 -53618 -93443
16044 -93443 -65583 -21735 -24731 -41995 -38884 -35383 -12119 15387 -24451 -19414 -5545 23859
16032 23859 -9684 -69625 -63462 -51671 -41288 -25050 -72645 -47416 -24733 -25978 -84435 -103574
16020 -103574 -85183 -31720 5618 -33269 -47339 17379 64387 21635 -24148 -72724 -92900
16009 -92900 -123408 -135721 -165961 -139255 -89830 -60649 -97400 -101352 -22429 42304 24109 9792
15997 9792 -13447 -76551 -73073 -48290 -36989 -80041 -89865 -64961 33515 30944 -9764 -65171
15985 -65171 -44724 28930 -3806 -46966 -66647 -31620 -20032 -69276 -47597 -12467 12044 7259
15973 7259 -3014 -88334 -88564 -58372 -79457 -80027 -72095 -43517 -38761 -86226 -51778 -48263 -31628
15960 -31628 -62985 -75071 -79027 -73230 -28907 477 -13133 -30802 -57312 -57563 -75350 -87958
15948 -87958 -106442 -95061 -87886 -80393 -91251 -121285 -83898 -74539 -70918 -94264 -94331 -77084 -104078
15935 -104078 -60107 11669 -28855 -81465 -22170 39719 33751 -2515 -30029 18617 43963 49647
15923 49647 46584 -9400 -53320 -50905 -20426 -13280 -14300 -39395 -32938 -67497 -101006 -59743 -62619
15910 -62619 -46294 -81637 -82376 -31068 23934 28712 -18539 -47448 -71257 -71220 -53252 -57854 -72399
15897 -72399 -22265 -53523 -119830 -111077 -132144 -101479 -60709 -34759 -38661 8509 9474 17520 1874
15884 1874 11964 -13415 -10479 -16479 -69857 -76341 -85083 -3643 34998 92676 75365 5278 -111
15871 -111 46552 9462 12998 10068 -17877 2180 35031 -18006 -50964 -56614 -53939 -9553 40149
15858 40149 43953 -7621 -63623 -58402 9953 53784 25558 23384 -13567 43411 26598 -1482
15846 -1482 -37309 -66583 -65113 -63229 -95974 -46298 -37481 -123018 -129215 -122567 -135840 -127156 -113854
15833 -113854 -70975 -88554 -151731 -153003 -106742 -124422 -84753 -67812 -89684 -93853 -114123 -74722
15821 -74722 -28112 2180 7823 11433 -30697 -14015 13345 4508 -25173 -5176 54960 -17562
15809 -17562 -49485 -21559 -11492 -22949 14266 -3141 -26476 -13059 8268 20271 57098 100208
15797 100208 89159 -4932 -82544 -123190 -74617 -2210 33747 12475 -27524 -73787 -98988
15786 -98988 -74572 -35474 43508 58796 44539 55874 12910 15310 -2909 -56327 -14299 21396
15774 21396 -13420 -78315 -102650 -112179 -33532 54194 -8801 -39545 24940 43985 52768 83491
15762 83491 61756 50144 11936 -65686 -45306 -53966 -48980 -25315 -30099 -67396 -128027 -131779
15750 -131779 -113808 -85036 -73216 -31021 -90607 -93492 -48751 -39373 -66495 -66686 -65515 -90161
15738 -90161 -76062 -74010 -43959 -14654 -40914 -115321 -143114 -96162 -116257 -139829 -98586 -52319
15726 -52319 1934 728 -40150 -79108 -112632 -33770 -52882 -49003 -32198 -43819 -84751 -57397
15714 -57397 -25531 -19098 -35377 -123467 -61159 -30539 -77770 9457 71512 54501 65039 61061
15702 61061 9249 -68336 -52147 -38767 26603 78049 83084 31615 -25849 -25282 -29526 -34119 -40932
15689 -40932 -73698 -78161 -125259 -143903 -92945 -66534 -42855 23847 10974 -20935 -81816 -90643
15677 -90643 -22293 -18479 -86433 -79117 -28746 -1040 -44625 -102542 -94065 -116439 -51447 2496
15665 2496 -37851 -46338 -44093 -40733 -64293 -63705 -66179 -47027 -5462 2060 13659 8321 -19772
15652 -19772 -61413 -41610 9828 10775 -27853 -38019 -56173 -34631 -47675 21257 30906 26272
15640 26272 52569 58393 17831 19897 -21459 -89855 -96155 -26477 -25038 3308 -1104 -6663 -52424
15627 -52424 -53542 -46173 -48088 -35264 -84981 -95007 -133679 -168639 -165598 -161984 -119301 -103407 -75770
15614 -75770 -96153 -114678 -113803 -104705 -96192 -42130 -175 -8203 -58815 -50109 -13420 -10279 8884
15601 8884 -4513 -3794 23490 58747 47703 39830 -6050 -3440 -8563 -11871 -9056 -17652 6553
15588 6553 78206 15467 -30973 -58724 -59456 -11112 -54128 -99005 -60648 -1167 15294 13888
15576 13888 13829 39193 31800 397 -29174 -1065 -928 -24346 -59659 -66369 -79480 -56514 13694
15563 13694 35361 -10148 -55656 -40264 -5592 12651 8208 -22907 -30369 -82653 -101627 -11700
15551 -11700 46038 -29832 -47293 -51109 -67466 -80643 -62667 -79047 -63311 -22566 14612 17292
15539 17292 15784 -52767 -108674 -97324 -79958 -80672 -59975 -44553 -41412 45002 25675 20219 57472
15526 57472 59604 -15081 -68318 -54060 -15898 -47861 -109174 -36493 22732 -18648 -78270 -103912
15514 -103912 -74935 -46938 147 1387 53945 83223 95545 63435 15928 24429 19632 3049
15502 3049 35672 69431 131362 105214 5931 -31820 -44764 -93749 -63634 -28681 23238 54632
15490 54632 39636 -6048 7796 -36503 -89374 -68706 -70529 -90779 -72179 5073 32208 -11511
15478 -11511 -114061 -97748 -17355 6462 12494 5853 31715 54000 54294 19779 -27187 -39577
15466 -39577 -13088 30106 -18817 -53549 -84576 -93971 -108838 -77474 -64359 18373 32892 -45
15454 -45 -52812 -38540 -46660 -66239 -32398 -12384 -6857 -82483 -65409 -22726 15735 7570 29867
15441 29867 47889 69402 78147 15308 -36879 -58938 -16949 -31848 -31001 -1074 63981 59407
15429 59407 29922 62734 31244 -43174 -78885 -52151 -64492 -81556 -31780 -8031 -67237 -109463
15417 -109463 -118547 -90074 -71127 -22532 -34103 -126923 -111988 -49567 -28471 -24120 12433 28642
15405 28642 39222 77559 79240 78639 27710 -14234 -14422 15669 40762 -13611 -6171 -10945 -25486
15392 -25486 -57884 -99351 -113336 -111264 -108249 -103685 -51632 -45454 -41371 -47631 -42287 -47408 -30394
15379 -30394 -8372 -95988 -158005 -173334 -158439 -115679 -97775 -98949 -59656 -13717 1976 2290
15367 2290 -59563 -79082 -93984 -113404 -152489 -146088 -132273 -124807 -69967 28661 580 -27270
15355 -27270 -10551 7025 42026 22072 -7246 58000 50153 -32497 -48186 -20764 -22032 -36386
15343 -36386 -61777 -26390 11320 -10025 915 -8808 -43291 -21975 6113 -2092 -28277 -24896
15331 -24896 -28123 -58370 -25759 40728 68624 23401 -1781 -48088 -34173 -54950 -61952 -22050
15319 -22050 -37734 -28221 -8266 -45580 -63876 38551 88740 -1203 -50083 -62798 -101767 -104252
15307 -104252 -60273 -48246 -21513 -66864 -87900 -86695 -65543 -53254 -53759 -79536 -97652 -88090
15295 -88090 -57205 -60583 -119011 -159375 -158320 -123445 -70875 -31070 -8544 -37470 -26201 -60541
15283 -60541 -83433 -46999 -1032 48382 44834 79166 66191 67619 70394 -5667 -3266 -26384
15271 -26384 -14023 16034 42568 28130 35809 47221 23927 -22681 15526 14365 4568 -5121
15259 -5121 -24099 -40929 -86334 -78132 21494 43999 35410 3871 2789 -41607 -86605 -51983
15247 -51983 31581 79198 47244 32581 50686 24827 -21303 -12092 -29350 15177 28752 -1946
15235 -1946 -30122 -36890 -59820 -58922 -29013 -21254 -9466 -2052 1480 2757 5412 -55967 -127505
15222 -127505 -107445 -103251 -108607 -103277 -92994 -61183 -51844 5445 65756 48373 24658 3486
15210 3486 4638 38691 14678 12152 -41972 -147070 -133151 -80790 -9102 55871 38332 2868
15198 2868 -30051 -47910 -25114 25847 53683 30472 14664 -2990 -9659 -35780 13682 19469
15186 19469 -9279 -15670 -58782 -79277 -63509 -68357 -84074 -27824 19535 17377 -38508 -42959
15174 -42959 -99575 -110690 -71022 -90066 -122530 -132234 -147827 -74386 -18985 14282 12345 -33446
15162 -33446 -1446 -6431 -3433 -9362 2214 -17311 -56439 -57307 -74295 -106537 -74996 -67516 -122180
15149 -122180 -82359 -35852 -55859 -68126 -50275 -1569 -20774 -58622 -70396 -47398 -19273
15138 -19273 36278 68987 47214 31930 -50775 -98382 -88007 -90819 -50699 -47559 -91771 -151301
15126 -151301 -145394 -104988 -67915 -19317 38404 55728 -20812 -20409 -70878 -102578 1338 -39500
15114 -39500 -102554 -54723 -25655 -18997 -71460 -91581 -108509 -104200 -58560 -17675 12049 -62210
15102 -62210 -150205 -133668 -73930 -72197 -78054 -44531 32041 57539 8350 -79637 -120464 -76337
15090 -76337 -80144 -103771 -64826 -60579 -119634 -84057 19159 82547 72706 61422 69316 36408
15078 36408 -33157 -86700 -104490 -84198 -46151 -55740 -78329 1991 16712 50 25726 20952
15066 20952 -1425 2085 22270 28851 44702 2581 956 9757 -3407 -34489 -15434 14456
15054 14456 58509 105052 123265 94252 106359 75692 -23660 -26775 -76471 -108571 -102938 -82169
15042 -82169 -138889 -111440 -75699 -79108 -46086 -21565 -11015 -33831 -75699 -59346 -44102 -2307
15030 -2307 39806 55970 -11120 -75635 -128381 -76668 -49523 -78769 -83533 -65949 15531 10872
15018 10872 -33936 -74412 -51591 -9821 20825 19386 -33525 -87480 -94124 -140620 -135469 -69242
15006 -69242 -73909 -117207 -69861 -66252 -74272 -59747 -34832 43846 48595 -13729 53780 74658
14994 74658 63764 88854 76510 49759 46653 44029 29672 32139 7329 20144 18420 51864
14982 51864 37716 1344 -49624 -83583 -51040 9359 -49224 -104704 -53963 1525 7865 36834
14970 36834 62721 46125 8907 -42124 -109593 -100925 -111725 -107580 -89894 -49292 -50345 -25984
14958 -25984 5397 41830 42578 12648 -45287 -109110 -113052 2800 74267 41029 8991 -32329
14946 -32329 -105929 -71569 -13663 -51843 -30528 -9512 31186 35751 31601 62535 48599 -2906
14934 -2906 -16697 2789 51501 34541 -38238 -45516 -106574 -121551 -144818 -160289 -110305 -74118
14922 -74118 -55255 -36381 14643 -15472 -34336 -20046 -12986 -27744 2576 -18304 -23518 -19559
14910 -19559 34251 53235 63205 84959 58230 52989 40511 23055 -8205 10044 -11775 8030
14898 8030 25031 -50176 -85302 -76689 -43682 -32212 -16100 -8163 49720 40518 -29136 -34641 -18278
14885 -18278 -9086 7430 -4035 -49639 -59246 -39459 -54704 -48237 -43258 -42411 -33557 -63753 -37586
14872 -37586 -11660 -16628 43677 35835 14427 -15376 -35739 -91152 -107014 -91576 -58255 -42937
14860 -42937 -84053 -58447 7428 20892 -38314 20067 3342 -14013 5166 39919 51808 56842
14848 56842 71028 20775 15243 5104 48903 92021 68833 75924 47731 14870 36479 17315
14836 17315 13606 22196 23227 -13155 -43359 -55345 -59627 -56253 -61116 -45639 -53703 -23940 36875
14823 36875 2861 -28195 18948 12637 21130 43141 -13206 -73853 -31937 21319 35082 -71471
14811 -71471 -141516 -95612 -73163 -60375 -81859 -105192 -37248 -798 -55449 -99392 -117121 -93105
14799 -93105 -23561 54521 55504 82140 55744 21211 23300 23601 24382 -49288 -19036 26603 -3263
14786 -3263 -2184 19090 -7211 -39283 -71486 -54544 -15757 -9663 -18109 -57412 -74865 -81501 -60535
14773 -60535 32178 6757 -48725 -70379 -37554 -37415 -44430 -15204 -960 -6356 45706 52986 29344
14760 29344 50372 50899 27080 44030 52068 89918 72576 12350 -51830 -97240 -115470 -97381
14748 -97381 -102147 -60567 17112 48258 13656 -23849 -41520 -27470 -29296 53165 85553 51001
14736 51001 21076 3581 -10848 -23688 -4973 344 -20623 -45612 -70776 -44586 -44124 -22748
14724 -22748 -13561 -95485 -71564 -62705 -45729 -59509 -101036 -80158 -48177 -29636 -34637 -57239
14712 -57239 -4856 40904 52800 12741 -2827 3651 5242 -4862 12380 32702 9831 9684
14700 9684 -4 -26027 -67005 -83306 -43604 14461 50217 66342 74111 75386 105995 98960 55837
14687 55837 51137 21638 -18975 -50808 -77003 -122146 -176733 -135169 -84059 -72370 -42990 -55068
14675 -55068 -53470 -53149 -42337 -15239 -52311 -32947 13896 -12647 -24027 28310 -13957 -15074
14663 -15074 -24452 -65359 -107835 -139141 -105676 -61161 -56588 -95196 -67781 -37680 -51655 -36992
14651 -36992 9568 15502 19572 21887 41896 4800 10525 22786 20395 16973 4595 12470 63309
14638 63309 51169 8195 -34611 -55537 -78356 -79469 -76277 -95236 -78616 -94117 -133312 -129782
14626 -129782 -66004 -16710 -18748 -736 16251 72342 34861 -4073 -16932 -25525 -18447 -43084
14614 -43084 -55474 -121681 -116090 -76608 -22653 -28710 -7335 -8641 -28030 -31606 -38998 -64252 -109681
14601 -109681 -66648 -30466 9993 42573 44547 26729 52053 98783 114594 97604 -2875
14590 -2875 10673 -43481 -26477 -6087 -75054 -91448 -51357 2099 49126 46718 64975 42337
14578 42337 12867 -47820 -84341 -13488 52937 74573 95041 89675 11889 2596 -16099 -32369
14566 -32369 -45544 -19737 -31419 29172 58733 -129 -172 310 -20749 -24458 -4248 -42467 -24370
14553 -24370 -17196 -2480 20845 6032 18098 12871 1699 30516 69954 70530 46302 6976
14541 6976 -48481 -82829 -52289 -21879 -15593 -5381 -16931 -26947 35908 31452 55201 -373
14529 -373 -38983 -54581 -28517 -501 -5571 8060 16691 14534 -21327 11255 34184 -14815 -14145
14516 -14145 8459 39480 8742 15580 13647 65630 94476 106295 49232 28845 5434 13076
14504 13076 37716 66608 44017 -17589 -24407 -51287 -21090 -1742 -3890 12645 50777 65231
14492 65231 32853 11780 18183 7217 -14538 -44369 -23772 1475 -25710 -10932 3715 -70579
14480 -70579 -102489 -94571 -45621 -23085 3179 -921 28591 68360 73592 18225 -1437 -14286
14468 -14286 -27230 -18767 -9497 34973 4209 -34975 -33711 -17148 -5721 -26392 -42901 -1780
14456 -1780 -11690 -78270 -87240 -31458 17089 27019 7588 -28871 8615 41801 926 -35924
14444 -35924 -68630 -78703 -94013 -49268 -53910 -89230 -43501 -47851 -6949 -23849 -31503 -22613
14432 -22613 -30518 -56634 -98260 -93002 -67929 -12366 -37594 -7957 18015 17075 -38762 -34578 31603
14419 31603 85791 55314 19686 -14570 -10028 28695 53216 12938 -11068 -7957 -45797 -70017
14407 -70017 -33896 -18269 -21491 -26317 20485 95441 118102 143978 146436 96560 80094 74270
14395 74270 62292 57046 6240 -15173 9619 -34972 -77809 -81179 -67523 -37669 -24598 27822
14383 27822 -26691 -35867 50264 121340 126819 85390 55999 84056 75586 102062 85161 90710
14371 90710 102253 108941 130508 97906 72665 106201 78554 59470 47648 5187 38368 62345
14359 62345 53991 74524 37298 -33712 -40499 -48185 -22457 43872 71768 96187 106409 33077
14347 33077 -11449 -16310 5757 24233 3762 22978 29142 -28719 -66473 -36849 -9088 16562
14335 16562 18855 -42596 -27390 -26136 -13311 -40973 -69847 -54498 -159 36314 42548 -8389
14323 -8389 -28280 -40796 -24037 47908 18820 -39773 -33622 25245 20323 81500 76622 48183
14311 48183 21102 14220 57685 38352 -15274 -21052 7114 63099 69417 47866 88204 101225
14299 101225 36708 26085 43364 511 -35091 -5569 8099 -20566 -6077 2177 -28618 10893
14287 10893 57734 46740 34137 32114 -1102 -20346 -45053 -41337 -38135 7286 -17011 -77223
14275 -77223 -49427 36638 -9440 -41148 -63615 -65208 -43886 -31506 22531 -2159 52594 29660
14263 29660 -57177 -40952 -42243 -72189 -118098 -69839 -672 18646 41507 30929 49973 63009
14251 63009 41723 -26638 -12658 2051 -7219 28822 38864 -71415 -122452 -57498 2017 24758
14239 24758 42590 66655 80855 94852 77198 5523 -25349 -9113 -6475 45854 37140 13301
14227 13301 1460 -82113 -40065 -8369 -375 -4578 -31794 -65579 10676 68640 65473 44170
14215 44170 -57462 -16748 -17695 -45459 -25539 18047 20205 -10309 34610 26868 10585 -4957
14203 -4957 -15218 -10108 -18193 -29729 -11331 -18113 -83398 -87027 -48532 1868 -28881 -85057 -74489
14190 -74489 -74587 -38968 13017 37410 80265 40839 2559 13866 12778 -58044 -108762 -69760
14178 -69760 -12784 16505 31100 -40758 -121507 -103960 -86064 -65565 -35146 -13743 17784 55135
14166 55135 103595 117580 77520 10669 5158 35924 29760 -63849 -75658 -23796 8456 42597
14154 42597 8263 -5409 -37088 -74959 -44486 15373 53760 4310 -28582 -1836 -26567 -66923
14142 -66923 -59342 -37538 -19108 -9403 -555 -35361 -48282 -30711 3165 17523 38354 -23898
14130 -23898 -49888 -29614 49696 85055 74572 65261 65358 53853 76659 75013 65597 2539 -29305
14117 -29305 -64664 -145644 -111659 -110228 -106943 -90978 -21856 2571 -49908 -91662 -52158 8431
14105 8431 -8676 -48179 -163762 -146115 -108296 -34404 42473 49435 9565 364 44483 82723
14093 82723 59188 28290 45573 52505 83864 -12540 -41273 -70269 -102631 -84031 -103913 -59037
14081 -59037 9269 69457 107691 70587 19465 51610 96538 47277 1455 -74946 -67917 -39373
14069 -39373 -7629 -53312 -33170 -44795 -59448 -40293 -18017 51326 61567 -8827 -37830 -20460
14057 -20460 17678 22468 1606 5554 16507 5123 5041 30177 5817 -25466 -3465 -2861 23732
14044 23732 77122 51421 6304 -3249 -12138 -26507 -23772 11745 -34475 668 5213 -130 -3618
14031 -3618 64011 60688 31772 25572 17732 5211 1393 -16124 -17700 25199 12479 -39053 -68463
14018 -68463 -16486 -23859 -40395 13910 17048 -14081 -59401 -76829 -46815 -68744 -58823 -53365
14006 -53365 -40612 -65533 -88235 -42421 -10887 -67009 -53915 -42868 24207 31149 -18080 -21676
13994 -21676 26148 -6817 -16546 -110514 -88407 -11536 -3485 -19392 -44405 -13729 17350 -58054
13982 -58054 -27002 21234 22445 48907 23521 65789 89093 119542 154383 112949 58963 88342
13970 88342 78403 72053 40918 39987 35248 48284 5113 -14265 -14593 -5720 -8733 -22347 -20412 50675
13956 50675 58758 -31482 -84844 -14225 16080 -22188 -23700 -22961 -17977 -33150 -86069 -68773 -3550
13943 -3550 26278 77330 80695 44179 56885 51142 22798 24283 76622 5786 -70091 -69519 -34621
13930 -34621 -28670 82988 85294 87738 82410 -12615 13436 4898 -45853 -14903 -18844 -109186 -84064
13917 -84064 3660 -44268 -17830 -16092 28255 57033 -6548 -76626 -109678 -71972 -35215 -20923
13905 -20923 78600 72907 11989 -44942 -97732 -54009 -16304 -32497 -82660 -125934 -107945 -80059
13893 -80059 -56793 -77087 -125037 -74864 -65616 -27069 -22086 -65097 -47172 21943 32474 8661
13881 8661 -12252 -10116 19459 -34199 -94189 -18917 68399 99761 131554 32171 -31238 -42325
13869 -42325 -66792 -54033 -40265 -41954 -46546 -19970 -15840 277 34239 45662 70083 123569
13857 123569 90036 41392 15074 -1429 35852 20648 -42878 -62350 -42363 -18467 13598
13846 13598 -1521 -21208 -34086 -55240 -36203 -47059 -5899 30484 78274 105937 73653 76091
13834 76091 41835 66076 122234 106348 102183 151093 123591 76738 55389 41545 5920 47501
13822 47501 71879 84500 58573 47980 23920 9958 44052 56591 -158 -39337 -18623 -22322
13810 -22322 -74031 -111839 -93760 -64621 -55820 -48732 -37592 -64337 -84310 -33766 -28097 -54903
13798 -54903 -25954 14986 52201 78104 26387 23940 34110 -22566 -15504 -23263 -23135 1689 -16449
13785 -16449 -69331 -34210 -15132 -55751 -60936 -41122 -89950 -118071 -55855 -28306 28544 52108
13773 52108 30905 42705 -48721 -54828 -89087 -125802 -119299 -83626 -56516 -51448 -50371 10600
13761 10600 29466 -83096 -163268 -79936 -1969 -2144 -5825 12634 44137 -12173 14798 57588
13749 57588 78268 79667 16484 -34436 3155 -38610 -59810 -95803 -119809 -91366 -62989 -7310
13737 -7310 35443 69223 68695 44337 -5546 27665 53559 46061 8469 7725 -17607 -62669 -91576
13724 -91576 -101312 -51612 8537 15725 29995 22486 -3597 -5319 812 -13237 -20198 -53229 -35368
13711 -35368 31728 41262 61265 21902 -15479 -29220 -47339 -44622 -28866 -23490 -1382 -123
13699 -123 7132 -17279 -19930 -30691 -24107 6481 12580 -46975 -80856 7615 50663 -17076 -14549
13686 -14549 -5129 -32673 -29240 30815 75592 83713 39499 56268 33877 -29143 -36201 -57608
13674 -57608 -86407 -129905 -91869 -36743 -43708 -43643 -16026 -32626 -1324 1154 18632 37109 87447
13661 87447 103831 124245 124069 64350 28074 -18607 -53980 -13345 -2900 26538 14968 56441
13649 56441 36335 -12872 -55646 -34656 13264 36584 11040 20579 46839 42756 -7471 -15974
13637 -15974 30147 46301 77573 23063 -34927 -40095 -12470 -25030 -49740 -113813 -67657 -20660
13625 -20660 -2476 25878 -51270 -55776 -32191 -31234 -54506 -53532 4137 10147 -66452 -19109 19960
13612 19960 -6589 -1690 -20901 -54642 -55312 -17077 -44832 -40132 39557 105741 102177 66105 50689
13599 50689 3258 -59400 -41915 -15094 -13045 -37787 -23440 -63109 -129690 -87952 -102153 -99053
13587 -99053 -94331 -63461 -71357 -116602 -105950 -94470 -14428 52228 11825 -33009 -9097 -64401
13575 -64401 -46813 37559 70023 58490 58783 64682 15932 74790 87784 63796 59427 67371 27269
13562 27269 -74939 -64271 -45461 -91798 -123434 -84554 -37505 11501 -38775 -102991 -110250 -82605
13550 -82605 -24944 18879 63243 106124 80122 73349 8929 -44695 -27694 -30187 -32816 70649
13538 70649 76704 72546 144951 169051 186814 168778 141921 90504 97794 77855 65735 27054
13526 27054 43690 2798 17651 55270 84054 121746 129786 84786 41123 -133 3541 60462
13514 60462 16515 25318 92554 80638 77360 63498 35560 49640 84658 64275 16372 -13750
13502 -13750 -6978 -12603 -16047 3889 -8748 8168 52045 3898 26485 -5160 -65670 -20056
13490 -20056 -28678 -75240 -63105 -27355 55196 66920 61248 84790 83272 8475 -22697 -437
13478 -437 50420 106789 128149 48424 8228 -16085 -66771 -67491 -45158 -17033 18740 64537
13466 64537 -978 -25317 -43246 22532 96750 112399 81532 32134 -1479 51009 47074 -15746
13454 -15746 -50851 -18019 18790 10396 -39906 -83672 -89822 -59425 -64801 -22489 48995 89082
13442 89082 97683 103593 59886 -9143 -69063 -14519 8005 85695 91980 53148 59388 80344
13430 80344 117110 177315 107775 89321 66369 18507 76670 115132 111715 91596 114367 126991
13418 126991 111562 114676 73877 63025 91310 50409 25715 31294 32090 18717 18886 68527 36295
13405 36295 34789 92684 63022 12711 31670 96290 145720 95047 50178 54297 6842 -5237
13393 -5237 -8172 27002 35308 58901 40549 -39425 5951 84471 134949 47642 -45997 6770
13381 6770 19588 71636 85955 85399 97810 131066 90553 72926 78306 75210 97523 99517 81344
13368 81344 120363 130335 92966 104359 157507 204507 215641 297600 301780 294253 316350 501917
13356 501917 652800 794480 979931 1164589 1455789 1793367 2136912 2464106 2733432 2844748
13346 2844748 2723774 2404259 1944103 1535065 1139931 933088 771856 642126 526675
13337 526675 457996 430711 343181 324037 305849 269839 197481 189326 198251 128465 113924 160396
13325 160396 194032 250662 228198 180098 130497 148979 159122 132969 125689 165362 204116 134533
13313 134533 142864 156080 172177 184541 148226 162531 122396 91177 88060 93826 100152 107356
13301 107356 102069 66475 49065 92500 113905 118567 182369 143747 76275 100336 167770 130639
13289 130639 115362 77660 107703 131165 131408 115261 54900 62279 97432 149869 178120 155281
13277 155281 137558 93035 45710 8983 -38995 -56700 -37057 27477 49610 33264 67260
13266 67260 97833 177231 149585 57067 32363 -8747 -41206 -7479 -19240 -18912 -10454 -24969
13254 -24969 -10044 -61441 -88003 -10402 36119 -38330 -18787 -41140 -98940 -79205 -36210 18703
13242 18703 -1492 -18199 113954 122434 110355 89810 53 -68464 -66287 -70312 -94437 -56193
13230 -56193 -34086 -7974 12059 -16762 7085 13921 -59480 -99553 -77205 -74372 -129025 -74608
13218 -74608 -56544 -68303 18499 12649 18190 30766 31508 118461 129524 69366 32409 104620
13206 104620 157722 152981 73489 39698 19648 60297 119912 118765 132897 96967 77396 71463
13194 71463 129581 132333 79899 85969 137206 123672 77954 108420 147329 128114 124728 153953
13182 153953 173118 201907 184144 196978 169348 187939 231426 231753 209717 173386 146753 152305
13170 152305 137740 140180 135973 143897 148185 153617 189211 125178 99530 128958 197602 258574
13158 258574 238927 184730 156942 144524 140137 115366 88004 51304 27222 30096 47383 57484
13146 57484 15938 -115 -13271 -44521 -14606 -31148 -25717 37503 60409 114116 134638 152891
13134 152891 171199 144639 71047 35815 -18431 -29474 -67656 -99807 -82475 -33295 -24056 20575
13122 20575 75222 82077 65394 121685 127333 90729 42109 15019 113108 204998 239356 181396
13110 181396 71920 23152 41919 95356 91266 49380 61431 131232 105673 110923 73544 60170
13098 60170 54930 76775 58813 66080 104119 95719 140176 188069 208600 196143 200286 205047 234870
13085 234870 246181 219018 226200 291103 267366 261541 284927 319793 309299 330545 383676 360971
13073 360971 309347 304615 247426 222054 244589 306534 399643 442719 494193 534442 605629 670718
13061 670718 713320 853454 976087 1062926 1122541 1141066 1134026 1114410 1199585 1342592 1463566
13050 1463566 1504142 1619336 1708602 1786461 1794235 1782925 1775797 1782013 1825103 1702971 1576283
13039 1576283 1424047 1301229 1169486 1126654 1064483 1034727 1041774 1064506 1036677 976239 980098
13028 980098 962812 898583 815662 743124 686485 613169 552016 514154 502790 517991 571387
13017 571387 569168 572396 498603 415217 405252 398192 434000 455877 465622 435266 433928 464835 547400
13004 547400 559910 631527 640503 618423 601562 623843 665914 685463 694917 665322 636654 661361
12992 661361 667569 653398 670505 695485 737603 819926 872457 818380 799098 768823 842856 867438
12980 867438 912341 1001689 1120325 1196831 1240333 1279280 1351168 1459282 1563875 1605614 1627868
12969 1627868 1691435 1787820 1898290 1961147 1960564 1971533 2055626 2249677 2418274 2551247 2672276
12958 2672276 2812306 2911035 3028555 3201164 3382875 3484615 3592850 3808534 4006168 4187859
12948 4187859 4328404 4471590 4720362 4996730 5258891 5505339 5805833 6198209 6702347
12939 6702347 7263094 7829251 8424705 9141761 9865330 10694445 11565895 12589841 13812801
12930 13812801 15256868 16989128 19036466 21397266 24275683 27705001 31735324 36637467
12922 36637467 42591865 49808014 58496326 69001725 81909841 98020597 118733189
12915 118733189 146265719 184275088 236794280 304518515 380289398 451516384 508338451
12908 508338451 545400410 548694697 506248262 433162381 339844440 249822032 187290643
12901 187290643 147979024 121917054 103310744 89279384 78416755 69858205 63019116
12894 63019116 57729199 53556142 50089620 47139349 44530532 42140055 39890657 37692317
12886 37692317 35604408 33538902 31556158 29721216 28020636 26501232 25146012 23931479
12878 23931479 22997587 22221561 21571161 20972797 20389796 19828362 19366297 18933884 18492992
12869 18492992 18041148 17680012 17342357 16996412 16762504 16495401 16219960 15903555 15675599
12860 15675599 15475117 15270137 15167377 15105026 14999175 14918867 14872575 14729908 14549115 14277855
12850 14277855 13959767 13696451 13528161 13369800 13221586 13103440 12962064 12776612 12690205
12841 12690205 12569864 12495921 12510127 12557655 12529439 12558128 12583570 12597319 12620486 12704388 12757894
12830 12757894 12887935 13063128 13232558 13307335 13319734 13233928 12997308 12734456 12388391 12017079
12820 12017079 11696155 11268693 10845563 10549199 10325958 10041860 9693815 9388179 9065694
12811 9065694 8772823 8509900 8215711 8028131 7776638 7567338 7345144 7113642 6857080
12802 6857080 6623091 6424965 6228164 6055407 5980055 5887007 5801804 5682613 5607366 5535063
12792 5535063 5476131 5420279 5364363 5349504 5298729 5229568 5217876 5159846 4990916 4825742 4755294
12781 4755294 4647505 4597126 4520338 4420502 4287551 4143848 3944077 3677290 3427124 3209834
12771 3209834 3056623 2885666 2675191 2433447 2215294 2163433 2087825 1960766 1817388 1721757
12761 1721757 1559288 1432744 1339234 1270847 1244371 1247737 1226714 1216002 1176861 1141136 1067113
12750 1067113 968696 1003067 1048400 1014955 998230 951729 899730 831557 753315 677746 650506
12739 650506 651125 629445 597390 550892 509101 490372 474121 488909 536544 515293 525272 531130
12727 531130 542830 573461 549276 488276 434685 392786 421050 438953 515553 514908 482028 422662
12715 422662 410636 394233 456040 492263 531912 531012 542114 563879 641883 690428 629909 600044
12703 600044 576390 550506 617341 684655 752150 758949 763423 817698 837578 836131 811368 798178
12691 798178 801212 813129 839322 810233 802408 869965 911122 957055 975581 973768 968545 915045
12679 915045 903860 948360 992022 956491 954954 979750 957719 972130 1019504 1062889 1026343 1010036
12667 1010036 979008 990297 972188 949144 963667 985025 1046218 1023629 957737 961957 947696
12656 947696 938842 957841 958080 939747 969219 1026723 1011990 951568 918225 898018 841613 868656
12644 868656 861908 808985 792224 806126 829189 822340 824778 863135 793916 712559 742410 725385
12632 725385 691260 686095 661608 613082 555158 580701 612394 569910 504461 460432 442459 461132
12620 461132 423809 434296 491137 415934 388746 360069 399958 348166 300074 288630 295361 307963
12608 307963 283702 325229 362437 351792 346895 388942 411498 356629 363423 401153 421134 450659
12596 450659 411896 380079 350575 393390 396152 369036 354232 326424 226516 188530 216089 264603
12584 264603 238900 254471 269300 224581 213867 279116 261915 210574 185072 142665 73819
12573 73819 100084 149176 171585 159188 129359 156600 218226 197956 141246 183008 195187 202243
12561 202243 258392 259207 249040 267268 219808 249554 261038 269674 207059 169523 158159 179016
12549 179016 211048 233917 184508 191332 242226 261463 344758 367115 363582 335724 283136 260963
12537 260963 346169 363769 372163 378928 322283 324459 345350 391348 389356 399094 385873 405811
12525 405811 446866 481994 441059 449424 422135 421311 420002 406359 364003 305913 325922 323781
12513 323781 364455 400490 372220 413632 407635 457355 533539 531960 458736 432645 429946 419490
12501 419490 400486 362574 328777 370302 438731 449597 459517 465385 450191 412568 365275 408507
12489 408507 415647 379886 359663 402135 394780 423266 434023 472523 468139 488223 472339 410503
12477 410503 414566 442335 498635 570768 594791 611617 666903 816552 983166 1207922 1526472
12466 1526472 1805037 2101540 2422044 2732311 2972183 3088900 2967088 2634615 2221648
12457 2221648 1693238 1366960 1126603 930882 835332 798141 688252 628116 567073 492509
12447 492509 446411 409784 361976 319353 282582 300108 366325 362497 288475 268028 314023 332047
12435 332047 292899 263621 255847 301860 350855 358225 323724 278257 235331 235486 236133 245032 254629
12422 254629 324079 272407 223014 250731 261272 260107 273354 284669 308480 297482 286175 203008
12410 203008 194640 250944 281141 307822 268425 221369 215955 221920 242709 232066 247952 220738
12398 220738 198523 167012 185585 207689 264520 230911 167652 112007 83764 149496 195209
12387 195209 229949 208454 156419 104979 136113 128259 162891 169847 144423 185337 218998 200791
12375 200791 198548 254635 221738 233056 256692 285226 277212 257964 235348 205765 203701 195560
12363 195560 182992 146230 144927 145506 197990 221406 218900 211399 209447 218111 213140 218212 179941
12350 179941 166868 178328 162314 157841 145122 106301 85519 108704 109933 129616 92324 46520
12338 46520 11255 -18595 12477 88389 118576 143493 126217 109838 108884 88793 125291 202237
12326 202237 170369 100754 55438 79619 123878 200130 181676 80428 61060 116699 108611
12315 108611 137674 190373 164369 116272 103586 101292 94241 70353 73558 97265 105208 72301
12303 72301 79959 111792 76165 60247 53060 89528 87322 105952 82576 46324 27912 73978
12291 73978 66723 49207 35712 106040 112150 88398 46150 19957 37350 112991 145142 160594
12279 160594 151258 99046 127365 142924 130498 113618 129102 91191 68657 20186 7898 27715
12267 27715 18041 22928 39345 83446 81027 129099 137016 205702 186407 147399 107685 61461
12255 61461 93156 101055 130087 174366 155614 110751 92066 117630 91816 115801 105724 66921
12243 66921 72932 54858 65398 57924 64670 61443 77655 109165 175220 160704 127560 83616
12231 83616 96709 134122 126070 124378 76617 17151 11998 26751 11751 44133 50306 47310 20754
12218 20754 46578 78137 116174 78157 45916 56988 61964 96196 138008 116746 104929 26104
12206 26104 -20907 2717 67419 149983 141257 138353 147801 155056 114555 63016 29487 71094
12194 71094 145178 178131 104562 56029 59181 47233 36538 85216 71464 55733 100667 125475
12182 125475 102826 106439 171866 206651 157251 82577 45961 61726 162015 235016 205337
12171 205337 138756 94188 57829 63778 120525 104601 102220 80389 118650 152606 156895 131181
12159 131181 103647 85533 76771 64798 43664 -19001 -42568 -56019 1605 16862 21128 2211
12147 2211 3646 16262 46851 77186 55642 36261 97511 114439 102394 34508 12305 31473
12135 31473 66874 75457 31321 52253 -1993 -38043 -32757 38261 103822 66611 56559 88903
12123 88903 69899 73571 35721 -1737 23056 27822 64239 97340 114993 103728 99211 55965
12111 55965 -12354 19739 59464 19037 -60123 -97699 -95354 -63202 -27752 8133 32364 107479
12099 107479 154451 122810 106284 83399 73876 86169 113819 117539 110777 69978 24608 62063
12087 62063 69871 123373 119587 91488 93820 101136 57437 50655 59226 55085 40478 65318 47440
12074 47440 -32140 -11697 27136 55101 143915 169940 155619 115616 100805 123875 158061 174993
12062 174993 126548 29313 -8747 88805 140018 117262 42609 43479 73761 51274 41795 13621
12050 13621 -8167 19733 37401 4875 47004 53956 4418 36154 51671 9782 27024 84184
12038 84184 123666 137344 165196 116309 89053 50201 38198 93884 154682 172631 117239 37855
12026 37855 21887 48470 18307 32539 -11100 -66544 -15202 25810 82552 53237 18114 52559
12014 52559 75462 97683 64220 45232 40723 92422 119382 76107 17869 -26578 -61212 -44594
12002 -44594 -46981 -16343 15231 -9099 25193 81710 17475 -27380 -45807 -77921 -86896 -68208
11990 -68208 -56061 -53410 -84509 -85909 -45716 -39013 -54840 -77493 -62053 14726 8445 -3034
11978 -3034 21715 8908 9582 50099 108871 104416 78856 92202 73837 -31589 -90647 -65765
11966 -65765 -23267 -12547 -36955 -52520 -41541 -1643 35255 41970 -20642 16695 54742 68575
11954 68575 56324 91587 115131 106516 78994 21384 55274 41105 18289 -4546 -18270 -15119
11942 -15119 7145 14918 49237 15001 -74900 -116992 -56548 37135 105415 103499 94424 64546
11930 64546 15278 30855 85460 75692 71039 38162 56095 25601 10427 16333 37063 66307
11918 66307 54396 -3065 -41538 12732 20424 -14306 10180 22841 13353 12554 3337 -4070 17170
11905 17170 66653 83059 77161 62235 53096 26526 -35093 -49275 -22724 42703 18020 11882
11893 11882 9168 4573 -649 -30100 -45693 -15630 49582 50605 43844 20468 3059 -26858 -26706
11880 -26706 -1230 11502 13976 23275 54458 41014 47811 62747 82226 77484 16135 21996 37670
11867 37670 13044 -9027 -22029 -15684 -34845 -55086 -70531 -31484 7574 23888 809 27016
11855 27016 112086 138938 53165 81138 120685 103179 34770 14225 54797 80924 37967 20408
11843 20408 -13775 -90047 -95068 -14715 37934 48305 38998 -32678 2356 33289 10473 23882
11831 23882 27452 37334 40246 -12445 -23624 5127 -29759 -38534 -41065 -14553 25754 27332 55285
11818 55285 45731 -20862 14678 86329 73800 48825 4579 4735 -1510 57356 105237 95328 97748
11805 97748 121658 103241 107141 73157 55050 67005 89712 72988 46429 114066 165243 151865
11793 151865 137010 85852 23489 32626 20537 91431 87748 78524 69914 33865 70450 36375
11781 36375 33695 11637 -40258 -22599 31125 37884 -41473 -64688 -54351 -56684 45229 105662
11769 105662 75750 47171 61179 101659 119679 53604 46839 79757 68609 125150 116160 98742
11757 98742 11604 -4497 31528 32494 -3851 -48737 -56284 -26460 -11151 -1841 21779 60235
11745 60235 34779 -37012 9209 41208 20456 31359 57815 93108 120502 52652 -4426 -13206
11733 -13206 21227 106001 86316 33912 36352 26083 -3228 -65678 -79349 -57066 -12074 2940
11721 2940 -20400 -43513 -41366 -18081 -39509 -38099 -36573 -30612 11286 20691 8675 -18164 -75772
11708 -75772 -15363 41817 25275 -14222 12421 20768 70437 86541 20385 28167 43901 -15644
11696 -15644 -86297 -63791 23770 38400 34348 56311 30358 -1328 -13105 10977 -2613 -26062
11684 -26062 -7816 60024 -1599 20199 25370 33038 32747 29608 -9958 -63147 -19269 -23709 -8467
11671 -8467 -30569 -41712 -77694 -133374 -109896 -60453 -41675 -64903 -73047 -68467 -127016 -164250
11659 -164250 -120113 -90272 -59524 -40544 -71794 -87647 -66320 -98424 -66900 -23134 -13642 14261
11647 14261 -2876 -26340 -2626 68279 18452 -38972 -70925 -109467 -68279 -28789 -34661 -48310
11635 -48310 -47919 -59758 -20444 3217 38316 19598 -29114 -10779 82309 77738 93376 98823
11623 98823 119522 112386 101770 59217 32752 47783 39636 5332 -27972 -42793 3524 -36837
11611 -36837 10162 24411 20163 -44475 -39149 -22965 -77060 -77846 -40566 -53773 -74610 -100105
11599 -100105 -107541 -65028 -46841 -8685 14793 51121 84925 62817 -7791 -28503 -34480 29197
11587 29197 49628 -9339 -55285 -56744 -65956 -64569 -49302 -18293 13156 -26323 -60169 -88937
11575 -88937 -39144 -36416 -40457 -21203 25056 36719 -12022 -47069 -35274 9284 -10307 -38575
11563 -38575 -46893 -35990 14174 37451 25756 -16944 -37772 -12109 9084 -6302 -68727 -103081
11551 -103081 -79833 -63695 -16260 39900 35780 30614 -19850 -53693 -53247 -5634 18060 27480
11539 27480 19766 17503 -3737 7114 44138 70803 71872 99458 93823 75429 81449 74455 45371
11526 45371 -22295 -65664 -58147 -50501 -45764 11185 -20983 -90238 -145782 -126081 -49874 -26016
11514 -26016 1979 24296 27205 27903 56885 30021 55603 56570 55305 68912 57207 -25351 5033
11501 5033 6418 -67797 -15420 10267 -29122 -18055 20930 -953 14600 45964 77106 59358
11489 59358 39372 -4031 -49600 -81513 -80150 -12076 -33095 -76649 -40575 1971 -14558 -36747
11477 -36747 -27962 -51881 -135570 -156765 -102925 -46536 -540 -8596 -18520 -8542 15096 -58938
11465 -58938 -134334 -128124 -153178 -120583 -62833 -71243 -46533 -10886 4020 -18546 13371 -10265
11453 -10265 -112323 -94829 -33083 -24842 -29199 22357 22829 6396 56146 43069 13137 -12233
11441 -12233 18213 20493 30491 75545 125973 127692 96576 107439 77499 59979 55668 11642
11429 11642 -31314 -9783 65675 98403 124694 115792 66995 14945 -14459 -10771 35460 -20273
11417 -20273 -82645 -113319 -113753 -50007 19648 73819 98850 85074 74847 132857 106396 -15549
11405 -15549 -46313 -29230 10594 7855 20587 1318 -51427 -76147 -36148 -23329 29250 34169
11393 34169 2122 6388 -4767 956 -26841 -40700 -45319 -77388 -44541 -85305 -91959 -91481 -46872
11380 -46872 12651 51056 -20983 -93804 -85095 18022 43500 -19101 -39466 28621 40555 78569
11368 78569 82343 31752 4309 3447 61174 47626 1999 -7975 14017 17719 -10528 -39509 -13696
11355 -13696 2174 -4003 -11843 33459 18953 17050 47482 42302 21788 17457 41406 50745 109430
11342 109430 114975 55119 49558 108895 112360 47062 -1025 -82370 -86486 276 -582 -27136 27584
11329 27584 22220 87343 125610 87641 67153 43427 88892 122283 149669 200514 192249 156690
11317 156690 42186 -59190 -28744 43021 90525 96165 51341 39045 143 210 33920 24840
11305 24840 25969 26371 -13095 -30478 -61978 -27451 46375 68504 33655 3731 -29491 -44374
11293 -44374 -44642 -8298 52007 17567 5639 644 4293 44687 44202 30086 -18100 17660 68175
11280 68175 61262 49521 132717 139105 104841 93490 45450 45671 -8524 -25410 -14467 -79365
11268 -79365 -106247 -44733 -13308 21566 71433 53635 42676 97393 81073 27816 -20586 -19679
11256 -19679 -21405 30355 36017 40846 3719 -52068 -92857 -62316 -16758 -25463 34185 40802 10538
11243 10538 33616 -26162 -36298 -9245 111201 73850 22989 22432 -18952 4135 44574 50891
11231 50891 23533 -42592 -79978 -94433 -78967 -111148 -80080 -40182 -72589 -69129 -11053 22049
11219 22049 5987 11363 33639 -12297 -66870 -69492 -71394 -80073 -112583 -108289 -104329 -103402 -116963
11206 -116963 -124769 -67347 -73731 -34155 -13352 -93396 -131564 -65345 -29294 -3755 54535 47095
11194 47095 57142 147802 196973 139868 99198 151911 121488 61708 76811 62774 15248 73692
11182 73692 120553 127890 111854 99641 65135 30181 45101 64814 28840 32807 4953 4201
11170 4201 71838 108668 161951 214440 179586 135142 153044 194700 126760 82997 119060 55942
11158 55942 43454 97670 57220 20346 -8921 -52370 -41968 -48147 -35003 -4627 -24454 -13834
11146 -13834 28640 42286 18199 -16242 -67367 -54834 -35498 -31771 -2020 1258 39606 20026
11134 20026 22527 -18004 -38884 -68138 -93564 -57560 -17689 15631 16226 -29399 -20 32515
11122 32515 24115 22824 -12138 -2185 57035 101289 81184 76104 -30823 -54406 -92225 -90561
11110 -90561 10699 38267 -9337 -46270 18069 57492 35831 21585 -33415 -36951 5701 -2029
11098 -2029 38523 41450 -13384 -24922 -12930 -45832 -16943 1963 -87220 -124511 -101909 -87893
11086 -87893 -15907 30525 -24771 -97737 -99291 -41866 30203 68308 60845 58027 62076 3595
11074 3595 -25049 -54861 -95160 -145238 -75100 -31294 -79291 -72227 -37891 -11910 16565 9727
11062 9727 -16727 -22995 -17682 -7333 -1214 -10438 -75795 -121770 -65232 -59305 -45536 -37177 2791
11049 2791 42090 37159 -30733 -40361 -131337 -117833 -54635 -58115 -60173 -26636 -65967 -23045 -10073
11036 -10073 30618 24704 -21316 -27687 -19863 -2707 -43336 -48091 -26694 -11354 -25296 -32526 -5696
11023 -5696 -17475 -20515 -17072 -27411 437 -75806 -73957 1535 -445 83157 121542 103773 82918
11010 82918 44811 8141 -15454 -276 35490 73174 10130 -43232 -58378 95 4288 -23681
10998 -23681 -58519 -40797 34549 25587 12609 26889 61244 63405 -523 -37211 -37446 36471
10986 36471 58721 39910 34543 -6553 -13415 -26258 2605 10919 -30556 -6385 39414 48920
10974 48920 28436 -62612 -64309 -41073 -24998 -40378 -50237 -19082 -1624 -37587 -41381 -46052
10962 -46052 -45083 -85157 -117262 -71637 -67633 -107786 -43086 -8931 -48768 -94008 -94735 -79646 -8798
10949 -8798 9262 -8103 -17150 -38002 -36178 -88464 -118195 -122824 -86620 -50235 -147 47634
10937 47634 18563 59668 34563 26964 54438 49762 28252 -10139 -48075 -12278 -71 32176
10925 32176 11357 45557 62972 2505 4851 35372 -4024 563 -20434 -36048 -32579 -22562
10913 -22562 -7907 2513 -44991 -71909 -60018 -44300 -54169 -44371 -23990 -8940 18140 -66163
10901 -66163 -119692 -141811 -114902 -88170 -88991 5603 -7429 -15022 -77228 -85722 -97455 -98328 -97350
10888 -97350 -47805 -33591 -29679 54250 70531 366 -40014 -43983 36258 71234 61098 -1440
10876 -1440 -13144 4131 17955 114 25087 1798 -24695 21513 31361 50645 41166 -391
10864 -391 12815 37497 -12613 -51844 -35631 3719 -7089 24651 45140 -6431 -52826 -82615
10852 -82615 -14811 61851 30013 72664 18699 -93996 -108922 -71044 -24203 -9563 -43985
10841 -43985 -34867 2924 -32780 -94040 -97812 -122005 -82295 -17948 -12998 -22373 -27039 -5745 36291
10828 36291 60369 24729 7646 23226 -10265 -15408 45406 35305 36578 -30537 -42767 -39995
10816 -39995 -14357 -60124 -60210 -51303 24304 7367 -4835 -76245 -113127 -62129 -53109 -61811 -59132
10803 -59132 -76296 -64184 -19769 -44942 -30513 30741 32401 -29315 -26911 -10213 23976 2513
10791 2513 -10852 -10725 33173 82504 -15268 -70822 -25940 -11055 -13921 -41149 -77999 -83960 -54697
10778 -54697 -43407 -33218 -46394 -42363 -36643 -53076 -32610 -3620 60279 46139 1298 8681
10766 8681 -15586 -48382 -44689 -27307 -47688 -14847 7336 864 -1135 1630 13303 9492 70714
10753 70714 155147 100487 56332 40612 25169 41555 29477 15261 85069 163694 235505 209067
10741 209067 133907 148465 137085 92551 81236 42610 -36320 20981 71455 84988 66688
10730 66688 106789 133880 88900 55898 -5446 -27741 1639 3466 17168 73222 62082 -16404
10718 -16404 -56015 -64534 -40341 9892 50549 68371 10380 -47842 -39734 -18348 -18382 -58956 -13205
10705 -13205 21380 51198 9895 -58372 -38960 -24642 -16466 -21178 -13491 32998 36802 21034
10693 21034 70001 75350 87328 95555 45680 37055 31338 30821 64129 53283 -18635 -48881 -53898
10680 -53898 -148268 -146692 -96242 -31986 9043 33798 10572 -436 4288 -36371 -33245 -14213
10668 -14213 -8621 -21210 -31291 -52005 -60894 -42149 46605 38163 16409 -46526 -97237 -113258
10656 -113258 -81706 848 33755 22055 42564 -8051 -35193 -55169 -45779 -45391 -46504 11941
10644 11941 -10005 -26161 29568 55897 54646 -4132 -28550 22519 -12096 -50385 -33563 -43010
10632 -43010 25141 19662 3372 -20173 60054 75287 89903 138239 88971 -21260 -79240 -48977
10620 -48977 -107367 -81854 -41474 -4440 13521 6120 29721 15517 13398 5736 -22034 -27635
10608 -27635 6765 20383 17759 49587 80455 26520 19386 50964 16941 42034 60743 62975
10596 62975 36493 -36016 -27013 5260 -26436 -54347 -54888 22310 47491 50214 29755 21161 5412
10583 5412 15204 39460 20669 -14756 -22848 -59592 -56015 -40699 -66998 -56118 -9765 -275 -42493
10570 -42493 -32326 -37902 -61023 -65576 -86279 -108847 -98220 -73659 -31874 13652 8215 -6455
10558 -6455 -53890 -97379 -79181 -22299 -12999 -13619 32984 -8370 -24206 28539 28371 10567 -8793
10545 -8793 -98809 -126793 -120625 -79135 -19189 -22442 -32843 -52056 -102178 -82912 -43269 -32763
10533 -32763 8900 27216 16898 18751 -657 -4748 12511 -20070 28430 9464 -43510 -15222
10521 -15222 12236 28184 40551 112446 68491 42073 45823 13056 -74722 -102110 -46439 -19543
10509 -19543 18410 50005 13460 -11126 -30485 -24882 -40453 -73171 -96056 -12922 12836 21045
10497 21045 33799 11934 -47675 -77197 -57417 -17802 -788 15016 45166 51519 89876 79875
10485 79875 6138 6714 53925 137234 105431 -10345 -30391 61520 91447 64048 1488 -10510
10473 -10510 20176 24823 34625 10657 -53222 -118115 -30795 32169 52459 62851 17765 34002
10461 34002 42908 -23319 -56490 -12725 -8308 -6965 -31705 -38521 -61944 -74788 -25119 -34620 -44128
10448 -44128 -28411 -76686 -76402 -34960 18324 -16036 -5606 31358 34434 15942 -35655 -58978
10436 -58978 -42004 -12779 -18727 -69526 -25637 18040 -5403 15136 -2620 13739 53750 80905
10424 80905 79175 42195 12656 12884 25293 47928 65112 27307 7684 -40860 -115428 -160585
10412 -160585 -94126 -27433 128 -78429 -64802 -44595 -31794 -47435 -81379 -53429 24418
10401 24418 30631 -37121 -121197 -130426 -92424 -30053 8993 50496 22326 -19633 8907 7012
10389 7012 -1966 -19233 -62081 5862 50471 12082 -38054 -78149 -122851 -126834 -79608 -49409
10377 -49409 12051 50102 47303 87108 82242 11900 -49731 -69881 -68578 -80229 -61634 -4806
10365 -4806 47260 24927 56255 98300 66631 1716 -68747 -110349 -137579 -75115 -8675 110090
10353 110090 123433 50295 4237 16387 39860 40646 19467 59468 76405 89775 75224 38590
10341 38590 41746 90737 132287 97911 37815 20853 51855 50029 16793 46197 45394 30628
10329 30628 29779 -39813 -101037 -64436 -34554 -18657 25705 26146 -38057 -7369 99335 69414
10317 69414 20497 5085 41413 77970 -1314 -28962 8231 39268 40264 23616 -16056 -27154
10305 -27154 30505 -4983 -60372 -78895 -20654 14812 47438 71536 101477 84325 82130 47018
10293 47018 46815 27653 39831 67994 38631 20710 -44581 -78558 -71379 -47462 -17160 34384
10281 34384 63195 48178 -30930 -76783 -80660 -34604 34866 -27615 -75920 -97683 -73085 -14556
10269 -14556 -20494 -59552 -16999 20360 15960 2731 -10533 -44629 -55870 -70302 -50374 -61974
10257 -61974 -61505 -70967 -97730 -132913 -112278 -25789 829 40142 40773 -13286 -23899 3100 6472
10244 6472 -15944 -371 24306 34178 9204 -160 -135 -14703 38653 79020 80250 7936 6492
10231 6492 54555 14875 -57793 -34725 1623 31158 7753 36645 60337 83859 52930 4806
10219 4806 42684 5256 12970 12173 2628 -722 18669 33140 36525 19016 24770 33938 125493
10206 125493 136747 78525 20056 28921 -28950 -71820 -67614 -50794 -49284 5691 -19933 -20222
10194 -20222 28303 23025 3495 25374 40475 49103 20163 9284 24910 9641 23335 3403
10182 3403 -46376 8777 32848 -371 37635 33383 2709 -24970 -13495 -35847 -15145 -15787
10170 -15787 -67222 -71262 -65603 -106140 -71379 20272 -558 -47915 -27768 -7795 11210 -8282
10158 -8282 -22325 -32701 -30082 -30356 -11573 -13970 -14085 -24583 -33320 -70026 -13016 -27296 -16295
10145 -16295 55320 49878 42988 -12188 -43690 -9645 -65315 -83788 -55863 -33918 -62200 -83313
10133 -83313 -75644 -69858 -45882 -17280 70828 74602 -19374 -53937 -18692 29482 -56340 -87788
10121 -87788 -41466 -13696 -10792 -27876 -42264 -57386 -75933 -79598 -29317 34232 48790 9441
10109 9441 17422 29771 25132 22982 18753 9334 -8563 -68531 -62394 -59478 -85746 -110879 -86120
10096 -86120 -76323 -19310 28182 -26087 -34328 42526 24841 -28243 -39512 27757 52764 38698
10084 38698 66441 45975 -17587 -52905 -32712 32913 80585 49908 88294 120161 77981 12694
10072 12694 -35165 -18314 -53141 -63015 -97173 -80577 -36762 -41187 -59983 -83036 -74545 -95696
10060 -95696 -108885 -116040 -119137 -69926 11127 37738 -25505 41379 130421 112481 40144 -20614
10048 -20614 -12866 2614 7261 20333 -43069 -83965 -88814 -32092 -16355 -1861 -4447 26733
10036 26733 -33488 -7138 107755 104888 53368 38511 -12434 70007 85420 96170 49836 15800
10024 15800 3158 32277 86035 99103 16141 26724 35503 35963 32341 44902 57829 40201
10012 40201 45331 98725 76228 6487 -59082 -53593 -13789 -3045 -5962 17159 -13824 -16259
10000 -16259 23943 61649 31006 5875 -28277 26527 70769 23666 -10376 -36785 -60525 -93944
9988 -93944 -73822 -65435 -57061 -80730 -84561 -73870 -83795 -99570 -65622 -30291 3862 -51318 -56923
9975 -56923 -65948 -40192 -46060 -55154 -159 -40588 -55998 -19107 58373 13920 1355 29833
9963 29833 22526 7395 -43039 -66242 -50428 -43761 -71998 -82732 -35261 15480 71735 48432
9951 48432 17729 33746 45623 92890 91928 73678 48027 63533 25431 -49686 2874 34270
9939 34270 42653 97665 93030 80444 69294 50066 72600 39973 -34245 -27689 -7400 28758
9927 28758 -18281 -52070 36608 27297 27726 6721 -23733 -17613 -73446 -103900 -101333 -113034 -100549
9914 -100549 -76654 -50635 -12983 -21844 -6437 61829 8420 15049 38565 19743 -16887 -10929
9902 -10929 -55781 -78849 -51651 30871 42540 4437 89009 110183 35934 -51339 -45638 -12076
9890 -12076 4460 -5894 26986 110701 119623 119664 110389 133294 100199 86352 72549 19723 -24280
9877 -24280 -26722 -35942 -36679 -69380 -53197 -45314 -163 2093 26613 -2384 31271 24513 13671
9864 13671 81251 150171 108797 75228 59088 10900 -20278 -12127 -28731 14674 -1432 -5044
9852 -5044 -11663 -2244 23503 48449 72832 82419 64602 9449 -18148 7041 13647 46801 19717
9839 19717 -39368 -18291 -49188 -98388 -96377 -64435 -31719 -16426 -6296 -6584 47963 32925
9827 32925 53876 72542 65594 25687 15223 99167 59412 21803 15027 415 -26788 -50938
9815 -50938 -48068 -41580 -53769 -42212 -15838 -13683 -43593 -40356 -75258 -127342 -126462 -32256 -53380
9802 -53380 -23810 65784 66166 28193 -24720 -84787 -98583 -80340 -51688 -23906 45286 -2899
9790 -2899 4465 45475 52782 87265 66426 45748 16639 8192 -4259 -50741 -79188 -23312 2023
9777 2023 -17223 -80751 -74120 -52874 -38857 2426 -29077 -19251 -41581 -12898 38219 43514 45579
9764 45579 42545 22991 14498 46395 39832 55908 31962 9125 25418 22879 -13416 48003 39554
9751 39554 44816 34175 23186 -27746 -70276 -32823 -18493 -22474 29783 45205 39063 79441
9739 79441 78612 79585 85794 62595 76202 137919 190879 86264 -59261 -85271 -89021 -85240 -2813
9726 -2813 29930 45784 43503 53732 33700 70939 77979 6947 -34618 -49193 -14036 10402
9714 10402 526 -15635 -49375 -66340 -101409 -106175 -82950 -109868 -76490 12166 111643 113724
9702 113724 64584 35373 -20660 1735 17536 46000 28252 34166 24202 -53087 -89499 -99620
9690 -99620 -101687 -103221 -94104 -121202 -104153 -125633 -85254 -56198 -56861 -77732 -69115 -18764 10985
9677 10985 37624 22582 38358 -30106 -54676 -49859 -37846 -56523 -14566 9950 200 -50589
9665 -50589 -49856 -8527 -12294 33828 38736 36173 10106 -41362 10466 62055 56545 44093 4567
9652 4567 -66524 -69117 16192 115526 113032 50008 36809 -20300 -51622 -41008 -21852 16942
9640 16942 -17657 -20339 36748 56251 76898 16542 13111 30047 -8289 -18578 -17158 -3947
9628 -3947 -17236 11371 -4878 -57614 -47193 -82055 -90724 -51786 -75772 -68509 21049 84681
9616 84681 75697 -4398 -73152 -80122 -23853 3456 8297 19173 -44778 -76709 -76038 -88358 -78024
9603 -78024 -115487 -78364 -47588 -52423 16331 25153 44911 62584 93102 84483 75148 91231 72492
9590 72492 72977 88890 94770 49914 2392 -33590 -38208 -62234 -54565 -28052 10924 84061 75443
9577 75443 69279 38686 68913 15468 23994 42548 60312 41573 -25480 -56634 -69032 -30267
9565 -30267 -797 -39133 -28923 -40989 -21496 6999 -4368 -76434 -129195 -111848 -55289 -60682
9553 -60682 -71875 -46213 -13944 65320 105280 63819 39390 72723 63776 48407 2892 35561
9541 35561 64486 49790 49248 66798 8446 -55666 -92726 -85351 -30035 -41406 -58069 -55025 -71119
9528 -71119 30186 76808 72402 72598 44211 59941 87127 140321 108428 101569 115451 74001
9516 74001 66365 9546 -43269 -103077 -112990 -62813 28094 75458 103394 86130 52385 71182
9504 71182 34509 6949 23614 20660 75533 116204 109717 63832 -6269 -44287 -24288 48088
9492 48088 134911 175177 126846 99515 47890 24892 35320 42837 22334 -33860 18361 31909
9480 31909 18027 9659 3526 -25010 -80195 -57083 -63853 -6455 47022 22079 39124 47296 -22233
9467 -22233 -51678 -35977 -69421 -42308 -37216 -56241 296 28086 9387 -9810 35076 59037
9455 59037 37737 84474 28858 22180 68003 56580 29740 67244 101611 113297 110181 77489
9443 77489 81191 82100 52446 29839 86367 136307 122560 189484 233511 209941 134097 110370
9431 110370 128323 118613 104937 111253 110342 105070 87486 77310 130072 120354 97283 78849 98170
9418 98170 153086 216301 248271 176745 163999 159755 131990 99253 143637 142844 119879 173050
9406 173050 169293 124843 81037 102158 184770 216234 181242 186357 192432 234280 224640 176556
9394 176556 162680 207384 175738 197545 230790 210745 149579 188129 202622 175813 205183 178811
9382 178811 112640 86953 103712 143124 168728 134359 109269 79889 116390 153672 252193 288660
9370 288660 313398 263522 225279 194081 154370 198269 220637 235360 257267 234195 224769 272814
9358 272814 280210 254887 175310 186581 212013 172350 163122 217806 246732 258284 263631 277677
9346 277677 280667 295754 323067 336399 375477 463262 446006 431253 379287 351060 368504 377770
9334 377770 335736 329891 377301 404574 407453 382284 429134 431049 411109 465408 539521 560818
9322 560818 543374 615513 709219 714088 721297 773803 737313 797415 806915 800154 780151 804208
9310 804208 798775 795699 897216 919206 906704 962951 957352 1013213 1124196 1119830 1137176 1182614
9298 1182614 1205200 1260481 1366003 1421544 1475721 1544428 1610171 1647792 1709812 1785743 1818568
9287 1818568 1851790 1950570 2083699 2169548 2263911 2305586 2411314 2536752 2568402 2591495 2655608
9276 2655608 2770769 2936374 3023386 3073369 3138385 3230178 3339077 3382025 3481998 3560776 3612803
9265 3612803 3655128 3728300 3834850 3915367 3949119 3978944 3944441 3869643 3824740 3821601 3821456 3727007
9253 3727007 3667741 3613313 3532696 3447571 3334411 3252209 3210666 3182503 3165518 3105226 2982582
9242 2982582 2886415 2816383 2755712 2725869 2584734 2506659 2423494 2343130 2351542 2290912 2148310
9231 2148310 2073739 1965612 1910112 1887545 1858568 1860990 1832263 1788423 1751865 1659092 1566672
9220 1566672 1536428 1472231 1438573 1470194 1467108 1411339 1347969 1303745 1313505 1229902 1223020 1249834
9208 1249834 1190688 1138130 1134503 1126300 1118186 1124727 1120048 1088047 1018005 1057393 1043553 990156
9196 990156 941623 948115 928868 945495 965023 910353 864355 845677 816685 777884 804980 823633
9184 823633 740745 667954 622365 602291 623924 683752 685361 696078 699099 740358 721455 701621
9172 701621 674798 686880 681470 616430 580055 589619 572620 559767 569863 614287 548475 515695
9160 515695 531559 475476 446323 482855 520820 545665 501184 490008 527641 537898 495113 425870
9148 425870 408942 396781 407400 355843 304465 285202 312830 389566 441787 432868 424168 452693
9136 452693 479462 396575 338425 369209 375241 375500 394829 362363 330270 299901 297772 324700
9124 324700 332347 278831 241149 288875 305654 298731 277465 247935 279152 290202 267054 206971
9112 206971 160852 173828 195199 180988 211926 239563 236213 175171 95500 116634 195720 195008
9100 195008 174607 164233 161727 143299 136638 170232 185378 214201 224556 203482 182699 159920
9088 159920 124823 96099 108335 67981 69129 86869 64009 96277 140485 156246 204473 234354
9076 234354 168706 122471 79460 58652 137167 191571 192742 146377 136898 96389 149509 163190
9064 163190 148177 143507 140871 155102 154052 176204 228606 213541 178006 141401 140114 194445
9052 194445 227326 211330 171555 138113 123228 59981 62090 110701 178498 234226 198425 143396
9040 143396 104860 102276 145327 179339 204921 136184 63725 69484 97514 120321 100404 87142
9028 87142 76789 50724 85949 75649 50050 65799 58537 89623 107634 83761 75729 123321
9016 123321 139267 133577 116644 100088 72226 59950 83239 72107 104699 93046 32269 -28345
9004 -28345 -17592 89158 207356 213981 159152 149496 133190 109396 121289 77105 74826 100240
8992 100240 122936 132666 77801 59581 27839 29296 54807 42297 71816 48084 53865 48373
8980 48373 30036 15903 49720 38235 -4545 36338 13921 27325 29233 57572 58448 43664
8968 43664 27425 18484 30491 77186 95655 124882 122556 87205 43551 67548 21278 -29233
8956 -29233 -8045 54071 25893 56668 95242 149308 138594 84495 58390 53921 26301 49326
8944 49326 68674 71866 43930 65468 65432 -15024 15725 52324 102992 118023 80169 76396 78526
8931 78526 99648 43553 19248 -6183 -7072 46312 92561 92006 85835 13179 -51938 1802 48998
8918 48998 82210 73632 80509 43471 -16633 -32531 8960 35015 72295 65328 36538 68279
8906 68279 65828 93278 110075 62871 22005 11702 12734 33959 41003 98935 147038 80873
8894 80873 14769 24804 45684 34947 68776 97483 107884 95946 89486 68718 77723 110846
8882 110846 189096 197668 87966 75296 134508 230653 207723 188916 136095 117749 158597 134692
8870 134692 88928 62599 13230 -39857 -73402 -2585 91471 114218 115964 95476 93346 137926
8858 137926 131904 126920 108423 59791 85447 54910 57071 45919 2856 -26777 -15697 13042
8846 13042 24936 57517 91126 50332 74594 111910 73092 -11281 -56321 -29730 47724 144622
8834 144622 117871 94085 128992 156007 197282 127181 138603 131865 97716 53711 -10234 -41830
8822 -41830 -41865 -43277 -83463 -109658 -107059 -5577 42932 31030 74686 101484 151075 157919 131006
8809 131006 69848 89111 47884 53349 91422 62229 86597 50090 56712 71556 45836 -5395
8797 -5395 12854 50964 114712 122809 73999 -22616 -44808 -71881 -41479 -10393 7906 53900
8785 53900 93356 117644 127896 124799 85475 109760 69663 22440 54035 56377 17622 2225
8773 2225 -10726 53784 50521 22359 46549 74206 30653 39558 53635 42915 27435 29259 27530
8760 27530 71311 96608 75306 28700 29095 49241 97629 52809 -13877 -31671 -60887 -52091
8748 -52091 5521 24608 48095 7219 18995 20171 45321 23459 29034 -10529 -34313 -6801
8736 -6801 31186 -51295 -73136 -35483 25004 52346 12217 -20950 14910 39551 51955 49786
8724 49786 -21470 -39852 29119 48166 68927 51062 87126 121803 120886 55797 36057 8382
8712 8382 70348 47437 12688 20721 28498 35679 68038 128383 149746 129280 119872 115361 70952
8699 70952 12384 -10893 -59939 -89499 -53153 -39746 -54770 -49301 -36668 -55749 -59309 -51514
8687 -51514 -25653 61428 80244 60580 105980 131162 68947 48458 57305 26473 56444 78030
8675 78030 153992 152069 69126 64892 21878 -35521 -30496 6323 37683 57814 82867 125262
8663 125262 90902 74551 57639 117766 137629 112100 119243 126998 101235 78023 95878 102272
8651 102272 115972 101343 156993 176186 115657 87495 81630 13469 -34633 -97453 -46418 31929
8639 31929 33399 17812 51794 96811 93473 98766 58548 96851 127294 93341 48367 48281 99285
8626 99285 112515 63797 73289 64990 48096 45900 9406 6038 11840 60524 88296 114913 174146
8613 174146 201272 136939 151931 106076 69526 57656 82299 104161 123912 49836 22258 20506
8601 20506 3400 39573 70172 92058 56694 111182 127336 124236 102204 90148 46855 32602
8589 32602 9897 36904 88532 103057 110287 103277 119164 138427 100587 96286 129186 122922 72532
8576 72532 42954 20190 7784 50645 71955 79611 129721 213569 215026 203406 157435 131932
8564 131932 138437 125786 86377 91709 100631 74831 117280 162582 195652 139027 58986 67587
8552 67587 131155 104799 59903 7068 16007 -16147 -4913 4671 6173 39150 59950 33370
8540 33370 4687 3410 32596 53940 46545 30748 74326 170108 222728 176670 68023 29443
8528 29443 35388 122672 124623 128225 172624 167507 146428 109131 40669 24630 5599 -9382 29711
8515 29711 54397 -9712 -39916 23549 32328 -32166 -50786 -50289 -17501 -918 -19386 -52730
8503 -52730 -60424 -71079 -8414 2141 94 1234 30577 40579 30288 -58844 -37598 16162
8491 16162 35760 27017 23871 -20633 -21099 -12899 -23209 18507 71238 20967 -4763 -14093 2383
8478 2383 10325 14519 23007 37916 47531 76966 85652 65102 52424 23771 -18990 3262 43995
8465 43995 35196 -4599 -5223 9879 38116 42042 43133 14365 16012 -4594 -31072 7594 488
8452 488 22359 937 -3358 -29560 -53391 -30021 -70129 -71157 -44628 -4445 39294 -8752 -29979
8439 -29979 -61034 -37301 3770 23442 12242 -14884 -25674 -28699 -18311 -5243 -21858 56868
8427 56868 96121 90513 36646 37794 77036 93198 56909 739 -21841 -24954 -37506 -75139
8415 -75139 -81076 -32375 26935 84404 96817 43276 -12924 -25506 -17184 -26308 -57934 -60967 -49795
8402 -49795 -10044 17097 72218 48362 29581 67068 67927 48547 26731 -3284 71108 71259 22825
8389 22825 45237 61987 48094 39601 40498 19311 28226 22897 26736 77688 97489 77275 -15776
8376 -15776 6547 672 -26921 -66690 -42152 -29831 -45967 -28511 -35910 -56698 -77252 -41163
8364 -41163 -97646 -111385 -52518 26127 29787 3728 -9042 -15034 39833 70895 -5572 -38242
8352 -38242 -69901 -60723 -38410 -27452 -21439 -32800 -32632 -10731 23323 334 -30490 -50154 -31095
8339 -31095 -20927 -24005 8169 33771 -8531 -41865 -14639 -30425 -3532 -41709 -18318 47974
8327 47974 60459 73520 55666 33348 41374 47860 1483 -452 -27300 -29822 -29200 -28234 -24162 37448
8313 37448 -3117 -59397 -50134 18372 14915 32758 40186 45719 45790 28670 -46920 -59286 -1622
8300 -1622 -22970 -4192 14795 25237 -23716 -55173 -45371 -9057 -3066 -8798 -20233 -33499 -44695
8287 -44695 -44483 -59343 -60611 -73063 -86557 -92271 -83670 -97218 -49179 -16419 -28087 -52727 -79577
8274 -79577 -49016 -38102 -8684 15898 39166 18172 -21365 -23602 -35550 -47162 -23699 -56095
8262 -56095 -64562 -11177 46149 71143 9557 -33713 -39351 -73954 -102587 -82969 -51335 -49614
8250 -49614 -3444 42555 40178 -4442 -33780 -42084 -1719 -65907 17521 36593 17442 -6169
8238 -6169 -4040 36232 60710 63575 49543 36616 36902 47500 3361 -24050 -63215 -46902 -51844
8225 -51844 -30433 6088 43398 63083 88695 39195 36819 24978 -2689 -56786 -60735 -67242
8213 -67242 -41718 -33618 955 31751 29570 -16121 -63060 -23739 819 -23845 -16340 -47374
8201 -47374 -64887 -101473 -96693 -34072 588 -38711 -44134 -2672 21354 49634 67581 78751
8189 78751 68061 51017 88893 76689 -19566 -71416 -30868 40758 49510 32269 61321 49350
8177 49350 46808 66264 73334 -8294 -79162 -34466 9613 37315 -26906 -32530 -30121 20686 38518
8164 38518 13241 4456 31320 -30131 -39185 -28497 -57701 -60251 10860 -3563 -69280 -43191
8152 -43191 -35758 -43918 -30909 -6004 17163 -18387 11016 -8913 -47262 -78787 -62401 -101398
8140 -101398 -58147 10963 55610 76266 61887 65295 134386 97667 21665 -18786 -39632 -22765
8128 -22765 12026 -9958 -24571 4259 -15519 -41816 -30198 10320 32471 23392 77359 96037
8116 96037 52495 35661 5975 47246 43354 12273 19628 -41653 -44647 -36389 -8964 27619 36783
8103 36783 32929 11810 -40179 -12176 25888 47623 57838 46255 28815 63910 74838 62385
8091 62385 107382 78828 81663 33389 -21576 1342 33133 41323 3372 -18383 1211 25030
8079 25030 66789 44453 20816 10204 -20667 -26714 -9027 9320 37115 37100 75545 122898 98592
8066 98592 78785 81983 114501 132203 89256 52538 4722 -22305 -7549 -36409 -89603 -9635
8054 -9635 -24262 -34291 -12841 -40412 -41554 -11037 5155 -21659 -3502 -17710 -61078 -45220
8042 -45220 14788 38697 77212 28193 -18020 -79992 -80557 -57151 2167 2683 7130 68382 31376
8029 31376 -629 -2263 -20337 -34376 -9002 48614 30312 -1018 -3591 24321 75237 104194
8017 104194 105372 62810 -15600 -35834 -20339 -28188 621 36079 82127 114050 50093 1591
8005 1591 -23042 15027 25968 13 29558 45649 6561 29587 88294 100244 91138 77099
7993 77099 41978 13697 -16741 -6555 9073 32823 41331 42664 45432 71124 38826 30066 43734
7980 43734 -6775 -5682 26345 66971 88839 84856 38310 15228 5489 38395 49511 37559
7968 37559 34545 36439 18883 -26840 36921 34295 18728 19703 -25964 -54030 -29379 -277 55488
7955 55488 140135 79996 30114 -30793 -39446 -73298 -38675 909 12492 15215 40871 30607
7943 30607 86726 134496 113162 64519 89304 73233 83148 49231 55535 26789 24212 41067
7931 41067 -17900 -54970 -40557 -14414 26033 38735 48491 33052 -37079 -71427 -45125 -9953
7919 -9953 -9150 3054 68157 53489 -8902 -4020 35669 38292 61240 117441 92865 9403 -38994
7906 -38994 -2262 -12779 39957 44147 1292 -34787 -24865 21853 62161 85980 94987 67785
7894 67785 17741 -21370 -33337 -2413 60479 43199 12379 29791 43109 -49492 -61906 -64475
7882 -64475 -60326 -32584 12629 5291 32749 81606 90140 68132 39322 3421 -6123 -34732 -32976
7869 -32976 -49171 -42643 10873 -2123 -6882 -298 333 -8873 -48660 35092 91016 114911 60157
7856 60157 87997 63675 2276 -27504 37183 96148 63358 34267 -19812 -42778 -54781 -30827
7844 -30827 8723 12901 -23315 -28840 20718 42095 27583 53718 46724 -4753 -33898 -45978
7832 -45978 -27621 4247 497 24005 35851 37008 51580 79780 77508 100559 100366 102656 127510
7819 127510 114175 100456 36742 -59452 -109523 -107452 -73874 -25038 -29463 -34348 -32461 -47726
7807 -47726 -37025 -36455 -23176 -23755 -24998 32227 43174 67110 54214 -1369 -34395 -41174 -12871
7794 -12871 13876 10384 -44866 -107188 -119616 -116707 -146918 -112913 -33606 28497 39732 119147
7782 119147 160735 91234 8904 16334 37505 18463 -71488 -74217 -42172 37799 88700 36074
7770 36074 -1042 2419 -16710 -34877 -63245 -11738 55158 7993 -62146 -66775 40158 68929
7758 68929 96841 100928 74666 21556 -29376 -108450 -141124 -71895 502 -39926 -58998 -62181
7746 -62181 -69277 -46046 2255 12651 -13627 8865 -52344 -114943 -38720 -40435 -15882 -6012
7734 -6012 29291 33139 59885 79848 73049 35871 12895 -45028 -69185 -101155 -94035 -57333 1903
7721 1903 50662 -9349 -81444 -105081 -64553 -79669 -56702 26478 33726 19688 36125 71147
7709 71147 88211 73853 46576 15709 19120 32957 63719 69092 82204 100278 42589 -12440
7697 -12440 -23914 -11891 9730 -22150 -18203 -8929 -78725 -151271 -71397 -29861 -6360 -13777
7685 -13777 -15032 -40204 -49098 -45483 43613 80839 62121 85983 93822 69354 62058 31597 -56791
7672 -56791 -103267 -101346 -53281 -49769 -25808 2559 -20752 -79283 -144926 -177073 -154071 -115367
7660 -115367 -93525 -101294 -82873 -95510 -123570 -116022 -94920 -58743 13268 44796 20542 15362
7648 15362 -4381 -50882 -66871 -115843 -151422 -85638 -63674 5080 58139 43657 43704 57814
7636 57814 52763 38998 -26727 -12240 25419 59584 107740 99542 45377 33045 27481 -13775
7624 -13775 -42236 -56631 -42792 -13861 -21859 -54094 -100512 -101137 -94454 -77556 -90540 -100917 -77665
7611 -77665 -79625 -16021 131294 98357 -3381 -44407 -66694 -59663 -30249 22764 31564 14695
7599 14695 -3833 9187 12443 -13633 -20356 -14936 -48476 -88467 -31980 7207 -19987 -29412 3237
7586 3237 -18128 696 25455 100017 81924 -32046 -73865 -995 13929 42925 39077 -8021
7574 -8021 -39751 -37026 -34646 -84281 -116187 -66190 -43147 -19036 7736 -24587 -23433 39691 57981
7561 57981 18456 21990 68193 57293 53874 38988 18071 -4772 -50714 -39056 -958 -42511
7549 -42511 -51834 -70644 -97699 -100760 -95283 -123801 -99891 -91519 -67064 -78902 -93642 -142935 -56346
7536 -56346 18202 -9816 39596 18999 -20355 -65290 -113820 -76909 -98756 -46678 2182 -2548
7524 -2548 -24532 -48670 -62756 -64811 7808 -34760 -89923 -104135 -66963 -47895 -48588 -39475 -4436
7511 -4436 5413 -31545 -50613 -67438 -102579 -82542 -70894 -44815 10835 -22008 -76039 -95614
7499 -95614 -108192 -15229 9016 34973 -10337 -89992 -89315 -16127 207 26612 13625 5076
7487 5076 -12335 -67260 -91902 -63491 -76488 -61679 29294 46645 1172 -32355 -35009 -1751
7475 -1751 7244 -7349 -49456 -100599 -98073 -41890 -5362 24791 11895 -46998 -134732 -132262 -86244
7462 -86244 -48914 42361 73020 52156 34208 16450 16467 7400 23833 60015 74325 62017 55908
7449 55908 -3537 1583 41339 23660 -3670 -21725 29256 31257 36102 -7595 15188 -30396
7437 -30396 -1038 23361 -36029 -26295 1791 70039 55952 51665 -63530 -93343 -63553 -16066
7425 -16066 -63594 -134697 -126868 -91537 -69875 -57682 -15837 356 -12769 -9706 -42433 -84077
7413 -84077 -13689 60117 75433 57607 -12791 38330 16127 -11072 -18778 17505 53034 36422
7401 36422 -18001 -59217 -70806 36641 52478 12961 37375 31654 -11083 19073 41931 43892
7389 43892 45138 104149 125973 140707 127173 60895 21470 9647 -17339 -53072 -25131 -27513
7377 -27513 -87910 -73160 -10483 -65117 -116957 -127446 -94048 -50399 -42207 -79026 -64414 -1651
7365 -1651 14751 19136 -17928 378 34759 64088 39290 371 11684 48938 68465 83995
7353 83995 25883 23011 -27049 -52324 -30543 -58300 -84309 -115223 -148449 -124863 -117930 -80566
7341 -80566 -71453 -91435 -82347 18394 -38762 -78819 -65890 -61691 -17779 -1638 39086 38275 20146
7328 20146 37028 46407 33783 15422 36084 -4954 -72904 -82686 -85089 -75204 -13726 10456 796
7315 796 -20255 -23452 28798 10090 9617 28648 -60270 -60075 -25210 32089 -4411 -60485 -104829
7302 -104829 -141356 -194919 -146986 -68517 -39140 -31991 -39755 -35061 -118896 -133716 -55827 -15716
7290 -15716 20126 21809 21375 45751 98624 137019 131066 74109 39001 8291 5833 40832 2407
7277 2407 -19318 7796 35170 54879 -12428 -44548 -29119 -20361 -12681 -64515 -80356 -56847
7265 -56847 -23245 -26578 -29649 -683 -37185 -102502 -68948 -9027 -2425 -37760 -56095 -44599
7253 -44599 -91996 -173452 -173321 -157151 -99297 -50582 -47615 -54566 -57096 9555 44595 81584 46417
7240 46417 81309 87212 70432 15967 12804 47889 31385 -42526 -59037 -58580 9052 4257 30538
7227 30538 28320 17229 -8085 -71805 -73340 -84948 -10954 47847 93829 73040 49028 -39151
7215 -39151 -68456 -65892 -70763 -88788 -116077 -64293 -47918 -79347 -141092 -117942 -77116 -87160
7203 -87160 -27670 -32215 -64128 -34218 -58806 -41268 -41304 -33376 -56274 -60388 -38768 -47419 -31838
7190 -31838 1818 -4539 -46518 -76097 -87029 -73365 -86818 -89813 -158219 -175333 -99503 -73736
7178 -73736 -12478 12524 -75698 -130545 -137719 -94816 -53457 -45096 -72699 -70254 -45779 -72618
7166 -72618 -90061 -67887 -74880 -99996 -123897 -129307 -74688 -53081 -60625 -71062 -81653 -68685
7154 -68685 -11144 -14878 -28463 -24458 -7916 -1512 -21521 -40493 -62752 -51389 -99176 -155038
7142 -155038 -93940 -36316 -18932 -14547 5947 39156 50299 31129 2516 -46064 22924 34278
7130 34278 32666 1167 1310 10257 -7307 -22965 -35230 -60966 -53771 -30161 -21825 -19944 -5199
7117 -5199 -36881 -90934 -127019 -57331 -74605 -149613 -127358 -92021 -100856 -28515 1758 45012
7105 45012 46988 67904 24412 44193 -5672 -37813 -38968 -47015 -5616 53123 78143 80541 52043
7092 52043 36964 18995 -4853 -2558 33537 -12363 -55955 -44627 23747 25710 -45156 -56868
7080 -56868 -27954 6650 32256 51566 36284 25056 65010 82803 51545 30845 42693 14692
7068 14692 22109 87209 65050 11972 51254 23433 41913 33609 43581 74040 109742 92735
7056 92735 31983 -52844 -85295 -28226 -58292 -108369 -37153 -53796 -48831 -21519 48017 85532
7044 85532 54967 27303 19031 -24427 -81876 -120244 -113886 -59378 -41725 -54662 -49476 -15550
7032 -15550 12667 -6656 -60732 -62821 -94176 -74259 -19226 -10211 4820 30294 41065 8055
7020 8055 -74951 -47752 -20435 -54482 -93049 -135251 -143681 -70094 -49239 -245 -15678 -26243
7008 -26243 -11485 -3159 -17281 -65259 -41052 40260 76405 32343 -34649 -18816 30330 64367
6996 64367 67587 47877 70195 87077 58916 62930 36712 30644 -2510 -1138 -5989 -24086 -29289
6983 -29289 -7289 44830 91532 74012 30536 -13779 -21682 7839 1294 -17432 -91218 -55416
6971 -55416 15400 25998 -14339 -24319 -33671 -40091 -77507 -75550 -146697 -89772 -54591 -65302 -80896
6958 -80896 -13211 -7655 3374 -26255 -30743 -44238 -56263 -42171 -8588 20276 15757 43321
6946 43321 70582 10149 22399 28811 -64390 -128092 -114569 -32563 -22817 -73392 -77209 -75479 -54601
6933 -54601 774 30256 41882 21871 6792 -7476 11515 19639 37692 27725 28126 18926 19813
6920 19813 -19021 -68931 -90663 -39331 -2956 -477 -7473 -22253 4951 7156 -20878 -46575
6908 -46575 -6985 6797 37523 29858 36532 56752 30663 10116 -32594 -25002 15293 83509
6896 83509 32051 19771 11620 -42696 677 44483 24070 56813 10873 -90343 -149946 -143523
6884 -143523 -102938 -109686 -53701 -4750 11981 -23354 -47438 -92929 -102280 -121749 -96204 -52891
6872 -52891 9078 -32930 -79296 -72786 -70732 -45324 -59434 -78924 -20724 -35423 -62542 -51516
6860 -51516 -17000 23547 97561 147890 197836 143376 118190 44845 40743 70551 69824 -8185
6848 -8185 -17938 13443 32330 9320 31197 40957 29195 19783 1711 -11879 -6135 48564 25071
6835 25071 11599 32080 -1559 -27261 -20073 51302 102415 53327 25082 22898 10547 -14968
6823 -14968 -57100 -81132 -31289 -13434 -16393 -29493 33298 64922 40425 11021 2291 25712
6811 25712 48643 91529 33989 -30846 -38572 -13430 -8878 -80210 -145193 -115632 -53273 -17904
6799 -17904 34809 79884 69495 137389 165576 73437 -6285 20969 75131 78385 50275 42229
6787 42229 -32296 -44956 -67431 -26934 33109 42937 73967 40989 2814 -86062 -58207 19233
6775 19233 1433 8320 69010 80210 86172 97111 94016 50172 -18848 -35374 14812 42057
6763 42057 89633 127014 150621 210927 187010 191129 219765 285697 291046 275405 320046 428408
6751 428408 463668 483913 621029 720479 823915 874884 954177 1012928 1016476 1049650 1048070 990505
6739 990505 973368 998625 1001038 1084084 1163484 1329005 1577282 1865641 2138939 2397185 2796125
6728 2796125 3376792 4057648 4840273 6070775 7676199 9723947 12086613 14167063 15472201
6719 15472201 16038220 15987694 14634281 11701494 8612337 6459459 5122731 4180570 3525774
6710 3525774 2958211 2544143 2213479 1957580 1831254 1696375 1635151 1576799 1478336 1453034
6700 1453034 1460235 1443711 1416206 1386813 1371165 1384489 1293162 1177697 1041914 950688 927523
6689 927523 920081 899819 848620 807483 766407 766839 780335 794572 799861 727811 696630 655088
6677 655088 622779 568071 533465 501526 494448 549155 597061 637584 551785 465716 438470 399563
6665 399563 483530 507553 515775 539987 558630 464892 371613 344698 360634 358257 340761 356965
6653 356965 376327 382892 371091 356409 378165 400492 434507 450371 424980 415775 387838 415473
6641 415473 426898 362925 355367 346133 371248 398099 481000 462329 391706 319594 339323 366396
6629 366396 399474 452591 432776 416120 395862 257535 180919 176237 159614 174280 232991 225243
6617 225243 184842 155591 101853 136863 200550 195864 170821 149248 100491 61033 101885 154466
6605 154466 209596 240225 177007 122029 83954 97958 161223 179951 106730 102122 79962 83569
6593 83569 87372 118784 127207 95258 132947 138281 96147 92499 192958 264587 217916 229629
6581 229629 142979 64293 74141 91674 107951 91769 72670 13899 5786 32193 32666 24787 31048
6568 31048 44381 101419 131203 22033 -60641 18426 12738 -6346 17202 52884 43689 26444
6556 26444 101506 25943 -6119 31508 32122 45169 12340 12073 13664 -12603 -20412 24448 46836
6543 46836 16446 -41688 -55392 -37666 -20539 -71473 -63541 -46387 -40621 8679 18970 -2779
6531 -2779 45136 72255 26727 -14923 -2196 61487 12239 -10415 18469 -8268 9055 5373
6519 5373 737 -31476 -122096 -123648 -119567 -85173 -19277 36516 93314 48094 -16731 7724 54032
6506 54032 45182 69026 -2454 -53051 -37012 -23250 17510 31755 -29616 -41167 -32299 48746
6494 48746 70052 36904 14397 31113 -3291 -15643 14761 95152 93696 71332 43496 2845
6482 2845 12385 58319 57981 30181 39414 -2408 -15150 42642 76367 69101 68090 38708 42218
6469 42218 -20287 -29394 24609 -23627 -25348 -8694 -11653 13755 51990 50695 28460 30261 29035
6456 29035 8485 13252 83286 92263 125654 129726 23415 -18335 -34235 -22113 -18147 -6740
6444 -6740 32676 70191 12294 20473 39167 -4638 38480 -19595 2228 -24213 -61474 -75153
6432 -75153 -45705 51594 73046 80277 89054 72515 92994 73347 26343 27836 44979 -30489
6420 -30489 -25482 15585 59697 88314 50355 86666 79961 69725 71509 44468 9053 -45961
6408 -45961 -34355 21360 68763 66609 37233 4029 53828 74294 74105 30291 26570 15402 -6185
6395 -6185 -30871 8513 32172 22851 25090 702 -5028 -17123 157 -8104 -11968 -27982 -54275
6382 -54275 -80672 -147788 -113776 -68260 -51985 -728 74276 78862 50662 41084 68540 64575
6370 64575 33660 44589 731 -48028 24876 36412 36420 25981 35983 65821 68053 11799 -81423
6357 -81423 -52417 -9483 -3216 28355 56147 86681 88280 95170 49500 25285 31792 42315 89121
6344 89121 161838 117282 94191 102943 86815 47724 9350 755 -11525 -63067 -47970 245
6332 245 13003 -15109 10342 43571 2147 -34830 -66495 6565 90810 132236 105816 52811
6320 52811 26471 4828 -19490 -35294 -82938 -149713 -122738 -84258 -51246 -17742 -22092 -46094
6308 -46094 -64119 -19722 26858 98465 109373 -6923 -92322 -105462 -79499 -51145 -47747 -69858
6296 -69858 -77840 -69556 -78606 -64543 -34475 -28148 8962 28861 30106 -54456 -54839 -50424 -6474
6283 -6474 -15251 -35470 -24294 -11714 14516 -66588 -86092 -59231 -75299 -109507 -97326 -32964
6271 -32964 -5866 2631 45940 -11175 -10893 8773 2052 -10919 1422 8247 -20211 -69297 -77383
6258 -77383 -61595 -38236 32534 69043 67824 61076 47017 35783 23445 -11095 -52809 -34218
6246 -34218 -86251 -121825 -126598 -61314 -4503 15412 24415 36547 23530 -29836 -98781 -93655
6234 -93655 -44440 17110 37827 23533 -38843 -101335 -115434 -129321 -118320 -76792 7725 10734
6222 10734 -47011 -90468 -67643 -25677 -1274 -3976 15946 43920 72152 57424 32091 53202
6210 53202 18575 -31732 -55379 35623 23169 -66392 -92404 -85854 -26847 -4111 -45906 -65236
6198 -65236 -64651 -61975 -29842 26549 3771 -43495 -61409 -55228 -25213 -12771 -43784 -39854 -66919
6185 -66919 -106943 -96688 -49855 -34885 -36468 -37933 -104208 -102418 -34142 -8438 -18270 -71620 -65989
6172 -65989 -64399 -58351 -59463 -59075 -28658 8351 -20645 -55409 -111779 -73848 24575 76872 38624
6159 38624 29990 13986 13770 42653 4797 42139 85432 19983 -23028 -24495 -59171 -81070 -102644
6146 -102644 -107564 -129350 -113739 -108465 -46147 17726 -12072 -26469 12449 -65598 -107779 -108052
6134 -108052 -59854 -37081 -19656 -33565 -19791 4986 28478 17534 -24796 -18909 28123 26807
6122 26807 -9497 18502 -21255 -37613 -49354 -37526 -38089 -7976 2370 -33624 -93463 -46138
6110 -46138 -83132 -96227 -66626 -22555 3783 62301 62726 26112 -8078 -3015 19503 1443
6098 1443 7023 -17536 -79936 -83997 -81193 -84292 -49234 -8985 28053 21951 -30630 -55903 -78503
6085 -78503 -138101 -111799 -70493 -17407 40859 35998 22098 28022 37876 55386 41001 31229 1212
6072 1212 28906 8661 -25162 -19430 -36267 -20447 4710 -21037 -33519 -47489 -35480 -46817
6060 -46817 -9329 7907 23457 37572 25417 -7423 -38641 -65100 -107919 -152966 -113994 -112043
6048 -112043 -69310 -40597 -16154 -1584 1735 -1317 -11192 -5659 24579 58357 74007 82672 59238
6035 59238 66967 66704 13184 19287 31924 7455 -25810 -49568 -20227 22640 70837 52434 56900
6022 56900 46826 39189 30905 -2545 -67972 -60228 -83054 -60831 -53078 36644 64858 13089 -5491
6009 -5491 -13125 9522 54761 49495 73979 72992 45525 25304 9495 -34665 -10549 26255 12645
5996 12645 72528 106786 42934 -30280 -11961 2152 8504 -18872 -46216 22299 -8070 -16513
5984 -16513 -36460 -29902 -43145 -23200 -39562 -34805 -28977 -73999 -64096 -47604 -75955 -50768 -29943
5971 -29943 -35472 -76072 -71039 -83192 -70571 -18975 -18172 -69626 -59282 -39141 -15053 -4048 -32582
5958 -32582 -31002 -2404 33424 14907 36269 20664 3461 2156 11052 6793 -15624 -10286 -22750
5945 -22750 -34531 -65082 -76618 -60510 -42418 -12222 46439 26097 -18874 -17225 -38471 -40059
5933 -40059 -49669 -41715 -31847 -3065 -39053 -98885 -7193 27002 81593 65172 25005 -51444
5921 -51444 -72646 -66064 -81515 -94458 -63751 -5245 -1222 -59086 -56656 -2016 32057 13228
5909 13228 51621 59425 16203 -4490 48823 42323 59577 66771 90897 33191 -8262 19652
5897 19652 25283 52790 32426 14059 -30530 -46364 -35356 -46905 -71951 -45482 -16480 -13942
5885 -13942 -51504 -106019 -100786 -26396 62900 10075 -62911 -60053 -12380 -22250 -5738 -18819
5873 -18819 -19227 13894 32977 35959 6377 -8360 -31528 -24800 24461 2583 -55615 -82093 -97194
5860 -97194 -114504 -104516 -110515 -63277 -81231 -58361 -19477 -4825 12449 50739 58507 21846
5848 21846 -1212 9989 15719 15222 68224 131174 79529 52051 76386 29596 54449 93510
5836 93510 54450 41651 1950 -57032 -104520 -85528 -49173 -2782 18546 44332 19537 -15992
5824 -15992 1290 40360 42190 -15583 -35534 -14942 -6643 -10030 -32142 14898 62059 54832 14513
5811 14513 -37365 5588 59520 67497 27918 -30498 -51701 -39817 -86281 -100316 -23165 6223
5799 6223 -30495 -10675 -59983 -66719 -82930 -77203 -58529 -47847 -19826 -46984 -60514 -81744
5787 -81744 -65230 -18578 16095 6448 -25336 8563 47906 26440 4772 43803 97350 23456
5775 23456 -49332 -3683 -2769 -54981 -13682 83636 58159 26400 29008 54073 98732 27941
5763 27941 -61257 -22172 61063 66235 44965 -7001 8455 31711 8574 1266 -12050 14035
5751 14035 51839 79738 58306 47734 3063 -40201 -170311 -188479 -151905 -119834 -34197 -35918
5739 -35918 -93206 -74788 -59858 -58755 -12009 22808 26198 23263 -38565 -84000 -121961 -95615
5727 -95615 -43854 -1418 13833 -33497 -38298 -61032 -92185 -108222 -72636 -39744 842 57202
5715 57202 68127 -9157 -2910 -20844 8853 12158 31236 58000 17345 27667 48989 -678
5703 -678 -5768 -34729 -8810 -30433 10577 58512 131739 109712 38846 30160 16986 20606 81115
5690 81115 11705 -21134 -53154 -43694 -30744 12597 42615 33179 18389 3554 24573 19158
5678 19158 -38612 -73206 -84493 -29765 -15572 22894 27924 -1617 -850 -1719 16504 -8558 -11542
5665 -11542 -5873 1285 -10766 -2962 -1075 18395 57886 59013 24546 33040 15674 -18216 -34103
5652 -34103 -5700 30617 29749 54067 100432 112000 66888 61935 49977 49671 34368 36625 75207
5639 75207 68546 38078 -4165 -26522 35966 58456 -33191 -31641 -10031 -30923 2111 12140
5627 12140 -39089 -45351 -24719 11946 13625 16817 -9556 17327 -1288 6550 85355 58209 -63525
5614 -63525 -132644 -83783 -80918 -6964 39586 57684 96790 71508 41261 2672 -28074 -42904
5602 -42904 -32084 -45195 -80942 -128243 -126889 -100953 -70671 -39895 -32700 -28002 -10098 39136
5590 39136 -46262 -11279 29866 65507 64049 10475 -23597 -69493 -26060 27849 -9945 12085
5578 12085 -31908 -15903 16446 3469 13987 42715 21276 -1919 11300 -45649 -90336 -31160
5566 -31160 35817 -7121 5594 27727 45062 38260 5792 -37992 -45097 54463 111090 79768
5554 79768 20602 74877 87404 44766 1278 68629 58131 -5050 15158 34325 -17418 -67414
5542 -67414 -15012 7128 -23338 -53718 -16287 10758 -10121 -48226 -19235 -72568 -96813 -78273
5530 -78273 -94548 -134383 -129255 -119798 -111323 -30757 21151 8325 -37196 -38397 15564 57673 89533
5517 89533 48772 26126 -31995 -14897 -10498 -55767 -46558 -50760 -49438 -42541 -71213 -103629 -78683
5504 -78683 -81698 -112377 -72352 -56507 -91320 -40457 -16473 -40631 -70134 -81406 -48376 -30682
5492 -30682 5173 3121 -25476 -50900 -37865 -26371 -23083 -30635 -39344 -44156 -2792 -12077 5678
5479 5678 50995 55633 2548 43892 93230 79854 30492 17156 39390 19939 -46179 -50998
5467 -50998 -53694 -42821 -73748 -76714 8299 57369 77201 1166 -99318 -112645 -72117 -14293
5455 -14293 -17993 -27962 -13521 -34084 7554 22952 15748 -2027 -50004 -55440 -62525 -46117 -44022
5442 -44022 35468 21758 -30951 -27170 -37975 -11142 -11599 -60939 -37647 -3030 32678 20520
5430 20520 -63840 -92078 -5398 -1807 3612 23863 18558 19866 50610 42831 -21862 -88637 -48335
5417 -48335 31587 39553 42024 14607 10709 -54372 -73916 -20756 -37996 -67707 -96462 -75125
5405 -75125 -18328 5465 -36637 -20163 768 -63264 -26405 -4591 15153 37632 21899 -10460
5393 -10460 -31286 -27519 30859 -1746 28843 54344 35988 55022 92027 119042 130789 87221
5381 87221 36473 14925 25003 13028 14388 29168 38835 68605 66607 28476 53290 56896 51424
5368 51424 -2652 -15179 -41854 -5538 34484 13471 16984 14968 -62579 -98399 -110639 -64803
5356 -64803 5536 17283 11993 9748 -13885 -16582 -65094 -89431 -68567 -31388 25995 79497
5344 79497 32044 6217 53949 72332 -4648 -34915 330 -8469 -37071 -41365 55488 68712
5332 68712 59853 42226 7371 397 25260 24363 45309 56686 50890 34320 -17297 -41437 31073
5319 31073 91662 75513 -7416 15840 -18294 -59377 -31928 -43252 -55512 -60032 -94051 -91302
5307 -91302 -85760 -85362 -34342 1165 2581 15866 -1659 -801 -23197 -83744 -87526 -48841 -28450
5294 -28450 -44182 108 23305 14315 -37263 -57576 -16439 590 -47600 -48532 -14281 -38726
5282 -38726 -74399 -68202 -9143 26503 -22833 -53996 -19314 -2239 -14087 22535 34822 -8588
5270 -8588 -25647 20497 35730 52957 23985 -5094 -16396 -5913 10868 -1067 991 37936
5258 37936 40098 28692 25949 61558 26175 3525 -7465 41528 25256 -70242 -55925 -29236
5246 -29236 -37476 15382 60189 52648 13246 9025 -7213 -56718 -58510 -15537 8365 -58277 -87442
5233 -87442 -22288 -29724 3549 60580 23396 -95625 -79262 -59525 -103383 -64393 13642 45592
5221 45592 71464 17680 -11115 -45328 -28068 -5965 15666 5507 15170 22320 -57680 -26903
5209 -26903 8500 44761 12060 -6516 -34057 -14449 -15777 -58270 -24320 22412 20221 30401
5197 30401 41356 -35464 -50706 -49509 -75457 -53815 -70120 -40728 11088 15097 48571 66828
5185 66828 7733 5883 -36772 -81255 -28922 -3874 -9377 -6801 51233 40684 51520 57796 6364
5172 6364 -21387 9324 24401 -29185 -24433 16035 18759 8292 -12179 -19740 -26261 -94479 -108356
5159 -108356 -47020 -41637 -39046 13145 21897 -14788 -12125 20869 10303 33883 31747 45640 84701
5146 84701 63402 -2243 -113998 -113827 -48738 -21567 54688 71688 7742 43445 -20432 -60018
5134 -60018 -41192 35881 40384 84950 45340 15503 41709 35755 57442 83650 41594 -4244
5122 -4244 -17442 -26835 -24210 -52259 13472 -15818 -60695 -22866 -42409 -44278 -56291 -112570 -73544
5109 -73544 -39791 -42750 -85311 -64973 -76545 -38321 -13774 6711 -37959 -32243 -48759 -42434
5097 -42434 -60684 -86214 -50290 -23942 -34323 199 34344 32637 35092 12570 23332 61413
5085 61413 30192 -15286 -8274 -16752 -16481 41496 70256 26924 -6073 -37973 -2102 1610 -10348
5072 -10348 -16632 -56347 -94380 -133631 -106880 -57095 -23240 -4515 20315 -22693 -91132 -96313
5060 -96313 -147144 -187106 -158145 -108486 -84824 -86258 -72462 -68207 -32680 -74087 -82463 -73987 -4951
5047 -4951 29951 49851 62196 -2302 44192 93491 42744 24843 17997 1546 -18760 -11452
5035 -11452 12786 4035 81019 118802 89965 20585 3629 62527 8125 -92267 -117871 -130786
5023 -130786 -96398 -35611 -4286 -44649 -25085 31164 82518 58248 63341 36311 10291 -23835
5011 -23835 -80104 -72586 -82479 -70560 14688 54694 40977 14936 50276 93716 82440 21478
4999 21478 -11996 21059 55905 91886 66612 35784 -56409 -135809 -82032 5253 16703 -6372
4987 -6372 -20017 -47110 -85636 -106018 -64626 -66242 -22567 -55641 -88438 -72820 -74574 -85123
4975 -85123 -132826 -50010 44147 74379 78690 79001 35466 15613 55546 38993 13450 4465 8793
4962 8793 20113 -2024 -24216 -46742 -58832 -13409 16626 33366 -30270 -53201 -13201 14420
4950 14420 32727 80539 53037 28568 53023 18648 -29287 -64603 -42091 53536 116616 81090
4938 81090 29522 19209 2607 -8049 53668 74685 90621 139130 95314 98544 25763 -6956
4926 -6956 -15460 -16639 11339 13889 31836 71481 98922 55806 64310 137104 122424 43619 8761
4913 8761 -35575 -60891 -39541 2566 35154 63889 66416 20080 -54426 -43860 4890 -33909
4901 -33909 -90032 -84646 -18469 -15879 -49369 -18316 -62633 -32111 -24613 -18859 -51251 -68560 -59593
4888 -59593 -9583 -10379 -2912 -37531 -51028 -47308 -51328 -60457 -32152 44334 96326 125758 89031
4875 89031 76615 58157 -291 -67417 -63213 -53746 -42920 -1632 47114 53334 -303 -31293
4863 -31293 -44677 -136198 -132715 -89786 -62890 -98618 -81254 -22151 -314 -18096 -8024 2780
4851 2780 -13151 -52086 -49008 -78659 -132104 -30801 63988 22325 -22781 -51134 -43925 -32274
4839 -32274 -73851 -73434 -9545 -39854 -66771 -16851 41397 -15699 -18766 -36671 -24637 1448
4827 1448 27401 46282 65374 143778 146755 54649 8256 -26235 -30483 35418 59320 47951
4815 47951 57183 687 7712 30388 14651 22686 46704 58162 81625 66800 27609 29473 31214
4802 31214 32081 47757 22481 -23667 -29239 5894 34080 15316 -548 9218 -27142 -26284 16496
4789 16496 13509 68355 102312 97750 43003 -5783 24551 53988 17200 -58972 -89843 -7167
4777 -7167 85045 104521 79512 43131 -37226 -63144 -58525 -55211 -65233 -23134 20556 -30524
4765 -30524 -74867 -54054 -19870 -42890 -124139 -97817 -57509 -57436 -71857 -67439 -35949 25960 -34606
4752 -34606 -81404 -90449 -95471 -65461 -7011 13472 30916 64736 60040 14613 -19046 -20367 -66377
4739 -66377 -68505 12399 -6488 -29959 -29756 -57633 -33561 50942 105335 106797 70648 46764 20257
4726 20257 41696 35364 40718 54265 55678 66364 11228 19901 59914 39841 45426 31110 -23389
4713 -23389 -75571 -128501 -106629 -117930 -100416 -120771 -122731 -159167 -151526 -68272 -19661 -20068 -17970
4700 -17970 43059 84429 45857 -274 8697 -31419 -102762 -91910 -68380 -27477 29857 24037
4688 24037 60838 41168 -4232 -13737 -23434 -18233 -11801 11051 -906 -47783 -104187 -107223 -48145
4675 -48145 -9328 23332 27760 53389 47361 -27844 -78038 -74028 -72480 -65649 -46923 -43524 -62147
4662 -62147 -68548 -36054 2662 20833 -5586 -42048 -55956 -59157 -5481 40697 69961 93680
4650 93680 111794 67294 53198 -16286 -32444 6171 -9342 -18816 -10503 -21079 -15667 -17013 -38421
4637 -38421 -65766 -33832 -66533 -67382 -103523 -83723 -3307 69430 59798 19118 36683 51308
4625 51308 30993 11818 28134 8637 12990 1834 281 16189 -4149 8211 24954 59018
4613 59018 47120 23183 53164 64262 5662 -35506 -30019 -14147 27411 70243 53953 64977
4601 64977 20819 3963 -691 37262 91891 85432 27075 -46866 -54115 -50215 -47876 16493 114908
4588 114908 104120 74280 -313 -27937 -33889 -15609 -49478 -60791 -78967 -39079 48826 29503
4576 29503 21897 1566 -55808 -59414 -29340 -17094 -34344 -19419 17761 -45239 -20579 -62134
4564 -62134 -105404 -85007 -62780 -43859 -9096 681 -33394 -2419 12465 -4410 427 9613
4552 9613 -19691 -17695 3859 40363 45611 48891 37514 5069 -25392 10855 25811 20542 -2666
4539 -2666 -3328 -2500 -2485 42851 548 -6424 -21610 -19008 28382 17997 -39591 -24774 -4747 65935
4525 65935 77037 75450 44402 26356 -18801 9283 47876 80171 102526 34181 -12673 3478
4513 3478 32349 53421 46922 33697 72404 88994 59499 40495 79125 120395 52974 8653
4501 8653 -5536 -21789 -33316 -19183 -29122 -62485 -59862 -39178 20864 25721 52012 30876 55277
4488 55277 -1792 -29128 -33268 -17662 -10901 -34618 -29737 -12014 -31483 5815 46870 -5128
4476 -5128 4301 22713 -884 6066 -1679 -50526 -39299 -9758 -59744 -92301 -91436 -112234 -17726
4463 -17726 38268 28687 -43447 -89023 -24470 7820 -25771 -67812 -139736 -155760 -126537 -79310
4451 -79310 -28409 -34118 -74450 -79722 -51732 -1039 51106 36212 -38181 -32886 -41687 -1615 -7120
4438 -7120 -10085 -25422 -61196 -73237 -31425 -9903 2582 -51652 -22908 29014 92486 86806
4426 86806 82481 31357 32889 24525 -45518 -81794 -63804 -105140 -174797 -133627 -74275 -83981 -86312
4413 -86312 -71787 -48293 -36110 -75147 -47441 -1908 -7324 24490 17491 -15674 -6796 35333
4401 35333 108946 90765 67946 99914 51130 -21513 11248 37826 -11056 -75529 -100179 -70591
4389 -70591 -47913 -55923 -67054 -31579 -23239 -25006 -13940 -22599 9443 39290 45760 62490 117916
4376 117916 64985 9774 -8369 -16817 -34446 -48859 -85464 -31370 -4653 -17805 -31752 -20961
4364 -20961 -54316 -65059 -27863 19475 45856 58203 70898 64174 23311 -29920 -46217 -5939
4352 -5939 -45246 -94719 -81302 -40267 5859 47279 37473 84213 76034 14301 47683 56816 19121
4339 19121 26183 72496 12334 -57727 -50183 -10684 8144 55613 38033 32317 31269 17903 -9694
4326 -9694 -4244 -39144 -35276 -46711 -71630 -64992 -42533 -17511 -52377 -37208 -12743 12618 5220
4313 5220 34602 59774 31502 29639 6656 -50001 -52176 13575 -8097 -80729 -109395 -70077
4301 -70077 -4083 -22581 -17059 -25371 -17666 4107 -5324 -4780 11600 52492 57123 42103 -382
4288 -382 18116 46592 45089 -4724 -45030 -32105 -23225 -17488 9478 86039 116101 43371 -7857
4275 -7857 3574 -13600 36837 8183 -23888 -27948 -21812 3674 -7653 1365 -58193 -62467 -33559
4262 -33559 9433 40088 59670 77135 73041 80874 70097 -5384 -23332 -21990 -19321 23405 64929
4249 64929 51989 34747 20635 -4929 -18676 22933 36929 -61339 -127708 -15524 56141 69063
4237 69063 60890 16157 17942 57728 73483 -15885 -96492 -92927 -32682 30113 40587 23395
4225 23395 6548 -10061 51919 66573 46089 24700 8312 -263 -82178 -47534 -36150 16094
4213 16094 33613 48649 62370 102609 118669 46899 6584 20154 67636 59199 11603 -2774
4201 -2774 31257 8716 3528 -44298 -65592 -16044 65510 112061 74562 -41395 -83812 -104105
4189 -104105 -66744 -18213 39874 55207 -1834 -12629 4607 -22114 8446 34753 -4742 -87426
4177 -87426 -154583 -241380 -208942 -63221 -56382 -25269 -74268 -47272 9185 30045 4405 14266
4165 14266 28423 22833 64697 -328 -43819 -62423 -7470 24867 17453 12483 31959 34016 -49587
4152 -49587 -89366 -93121 -114626 -92164 -98716 -68480 -46021 -16524 60861 37503 4828 20537
4140 20537 58802 70315 31706 -16987 -24021 -23724 -64124 -10077 -4005 -17879 -32165 -38264 -35251
4127 -35251 -61759 -15237 4676 -18416 -14993 -23092 5817 12048 14108 -52603 -114857 -101948 -25355
4114 -25355 3808 -15871 -11931 -29458 -20846 -17976 36877 54570 48299 43934 15560 74315 127315
4101 127315 59997 -28582 -43490 -45731 -39397 -82621 -37505 69246 104399 32456 -16512 5915
4089 5915 -20266 -67324 -55898 -8459 -29559 -42024 -40279 -34901 -81534 -80391 830 72849 40886
4076 40886 13523 46197 56263 66573 85842 81915 108255 80438 85449 124815 112823 57690
4064 57690 35404 63325 32335 -36136 -55418 -10358 38436 64 -31492 -35799 14460 86454
4052 86454 104363 51468 -8770 -60069 -63181 -21184 -37523 -18029 -26123 -100806 -147733 -110083
4040 -110083 -97866 -74382 -37062 -17151 -8552 -38396 -20315 -85954 -29063 -16279 -27715 -43089
4028 -43089 24437 37568 -490 -46185 -47411 -54512 -76152 -35150 777 33784 50056 59392
4016 59392 47622 3561 6406 14286 22020 -18811 -34247 -49698 -13023 34306 26635 -48006 -63366
4003 -63366 -79821 -45383 -80797 -101908 -104370 -90984 -72577 -60152 -5890 56163 70539 70223
3991 70223 44774 -10131 2114 -49064 -75414 -85196 -101577 -103361 -67778 -50383 -10026 -26852
3979 -26852 -27085 -21832 -20184 19682 38956 9276 -25019 -7898 -19844 -7333 -38520 -21746 11664
3966 11664 15443 -7099 -65883 -67561 -21325 -7839 -64254 -157350 -138960 -49249 -51318 -59722 -74058
3953 -74058 -40817 -50868 -20957 21790 -47530 -50995 -9150 16143 -21749 -31400 -3520 13849
3941 13849 48199 50086 41302 4795 -95332 -86569 -1728 -4399 -3143 5380 -69060 -159557 -150477
3928 -150477 -122769 -145681 -130487 -145736 -163307 -136150 -82291 -33460 253 28595 50925 70758
3916 70758 51676 -9569 -20609 -29247 -5237 4399 38565 67041 47794 53359 87579 121227
3904 121227 138042 86218 70579 53674 16807 9665 -24125 -48644 -61858 -7699 1714 15987
3892 15987 -3787 33671 45667 38298 2713 -18170 -8311 -22154 -12088 17227 -16474 -7410
3880 -7410 63738 33448 6650 1960 -30016 -4858 1577 21256 33322 33887 76087 75329 69821
3867 69821 25436 -1116 4644 41058 47124 17512 8548 20209 43759 873 9581 26345 38813
3854 38813 31853 2056 -34513 12519 43840 10668 -6481 23985 57659 105660 127431 83656
3842 83656 23661 -27756 -83276 -13215 32031 10798 12802 -27040 -23573 -11775 19547 -1806
3830 -1806 -10933 -20883 -16224 -29273 -82927 -97794 -48005 -53865 -53384 -33622 10277 31269 -8043
3817 -8043 -60664 -42287 -60312 -40639 -62991 -60714 -48615 -31437 -14461 -7024 36784 57684
3805 57684 7454 -43460 -37179 467 31456 41449 53986 1400 -24698 -53607 -4414 11506
3793 11506 -27549 -30536 -15308 -42476 -24792 -55199 -83726 -76272 -6403 24426 39028 23629
3781 23629 -12443 9398 7667 -12900 -50371 -36242 -4679 32241 14467 -49513 -85856 -70776
3769 -70776 -78424 -65052 -57392 38110 8036 -36229 -45944 -29575 -2983 3928 535 18710 -29768
3756 -29768 -26951 -35593 -65407 6160 61362 25318 -61437 -100056 -100849 -79637 -56409 -59719 -67046
3743 -67046 -19487 -40833 -81310 -64116 -596 -9135 5381 46613 32747 -47798 -42062 -13947
3731 -13947 -7543 -42841 -119249 -126204 -67253 -43409 -54228 -41566 -8705 16058 23817 53670
3719 53670 103328 118105 59913 -5358 -12533 17132 -25964 -916 -13996 -32904 -49469 -55593
3707 -55593 -78959 -101016 -60299 -69210 -52390 -91298 -67504 -17676 36703 60449 50551 68626
3695 68626 54658 -1337 -10017 -22629 -31031 -24587 -113280 -104548 -58091 -62590 -48258 3220 -22665
3682 -22665 -75131 -35511 -34080 -67064 -70972 -21463 -37506 -85244 -108947 -70930 -62653 -62070 -37157
3669 -37157 -52286 -75171 -28512 16966 -5396 -47238 -48946 -38843 -44912 -78740 -63170 -32082
3657 -32082 -4471 -12762 -5801 14727 64778 30800 17621 70184 56299 7354 -59348 -97830
3645 -97830 -102284 -112017 -67051 -56688 -59590 -74271 -102104 -90045 -52890 19095 88473 32249
3633 32249 -21457 -27245 -11300 -9519 -35431 -20818 18893 -33968 -61007 -17381 31256 55575
3621 55575 65915 79773 37090 33286 2409 -51984 -57088 -65306 -29092 -36097 -85274 -63382 -24902
3608 -24902 -3989 -24369 6794 54806 35243 71441 28558 -12545 -45306 -66931 -98589 -43015
3596 -43015 -26035 50739 82447 125028 143271 135921 70287 -37217 -84134 -61744 -70321 -50081
3584 -50081 -66933 -41246 -26025 -19962 -56996 -31515 32017 93220 51261 -2679 356 -34848
3572 -34848 -63991 -103752 -105659 -95252 -124973 -122876 -71284 -69874 -44168 27445 43052 43526 66097
3559 66097 69641 47280 44469 23423 44283 76042 102650 81061 19174 -46374 -34528 3663
3547 3663 7321 50611 66159 -6158 -35545 -51972 -58927 -23613 39739 59378 70277 4541
3535 4541 50873 53087 -946 -28912 -37534 -28957 14941 18614 29979 22562 17890 36215 33769
3522 33769 53340 39287 -20680 -66231 -67266 -73338 -125302 -116616 -43451 -52930 -47659 -12918 24401
3509 24401 84030 9092 -56987 -55967 -19204 39834 5068 -37250 9240 85653 97905 37533
3497 37533 -316 -12205 2582 7708 -8493 42085 29124 -34393 11307 13952 7611 36143
3485 36143 29280 -26767 -14668 72131 50595 -14873 -62124 -69553 50477 83255 32712 48774
3473 48774 43508 45219 14222 28096 -1679 -18490 -27653 46060 -26173 -124810 -103468 -103050 -142789
3460 -142789 -145276 -113143 -99407 -81294 -15493 -23033 -83729 -105039 -113437 -105244 -75640 -60808
3448 -60808 -53836 -31778 269 28266 58325 49670 -901 4663 25453 30633 42475 2160 -60735
3435 -60735 -48968 -8351 -32729 21985 66823 88015 127505 106545 45079 56102 44454 -57843
3423 -57843 -39440 2219 27061 24520 15616 -7139 -58158 -71209 -8613 -25311 -107451 -121329
3411 -121329 -79998 -74791 -61684 -47104 -42051 -95268 -138253 -102554 -38350 4085 -15317 -6402
3399 -6402 31702 12761 -32945 -37653 4369 45706 73066 63365 80995 66284 -9557 -24025
3387 -24025 -62659 -66556 -37962 -676 2756 -30205 2627 -14782 -17761 -27210 -28140 -10721 -21799
3374 -21799 -67115 -62570 -38846 -24468 -49423 -6498 29737 -9818 -11157 45349 4565 30674
3362 30674 54363 41925 56693 59968 24482 -12499 18550 35722 -39959 -52511 -11738 21880
3350 21880 -21351 -41611 -8484 26674 4937 -60162 -77309 -36940 -26560 -46379 -23001 22978
3338 22978 55669 61453 53871 43336 -398 -36596 -42572 -83481 -125300 -156751 -123719 -72181
3326 -72181 -51149 -27816 -34831 -11728 18947 67245 -8632 -66061 -17371 20954 7361 -7029
3314 -7029 8483 -20995 -3286 23309 3228 -9795 38885 21310 6235 -15593 -49895 -114102
3302 -114102 -110166 -83612 -34717 -48025 -46586 3257 44575 18134 25988 -3919 -889 -11960
3290 -11960 -820 21999 -11871 7211 9829 -4762 -6780 8564 15505 40028 36786 13669 21884
3277 21884 92271 60130 47206 28638 11982 -9616 1805 21652 38308 -12103 -4988 1656
3265 1656 -43132 -10336 6923 1899 -22608 21691 9570 -30809 -10060 -529 -30327 15713
3253 15713 193 -22135 -26582 -2053 -943 -44988 -26562 12950 55915 92502 81235 31422
3241 31422 -3845 -51528 -14547 38881 101494 133722 134419 116449 135605 82656 77013 32519
3229 32519 -9618 -52031 -126033 -67756 -75815 -69651 -45143 -27881 -5354 -16327 -9862 64369
3217 64369 35487 30687 16689 -5786 -12295 -2903 -21626 -60124 -84742 -80394 -41021 -12544 44389
3204 44389 55781 55662 20582 25052 38228 4073 3373 20749 52588 36410 16326 31154 23916
3191 23916 11896 -8111 65777 104659 69083 -8747 13045 50166 31979 -2720 -63168 -42970
3179 -42970 -22541 42100 112245 123818 96058 68258 10869 -2003 23553 346 24078 -12583
3167 -12583 -24818 -37454 -70330 -71685 -40692 14121 73606 61142 54257 55946 105254 170708
3155 170708 72023 5923 -8778 -33149 -66719 -33375 90813 113534 56363 -3147 -25482
3144 -25482 30568 43016 32342 -30720 -87626 -66015 -1562 62387 23058 8397 -3742 4288
3132 4288 -28174 -97180 -122682 -124192 -93163 -85893 -84672 -52026 -4277 435 17731 37606 47891
3119 47891 49361 61665 -48462 -114340 -105133 -104360 -41860 7679 -1444 1487 13210 -12 -24847
3106 -24847 -85453 -113730 -122729 -124163 -156918 -122261 -108829 -71940 -67827 -90774 -130924 -90651
3094 -90651 -91709 -54828 -42958 -76499 -125596 -115061 -99315 -33773 -19463 -53738 14902 33579
3082 33579 -6911 -57345 -76625 -59017 -78373 -89074 -100041 -98250 -127632 -148718 -108068 -5624
3070 -5624 21549 -11503 -31092 -4806 28072 65383 63873 27329 -24993 -51285 -42280 -29113
3058 -29113 -26883 -38514 -19424 24687 43087 63322 87710 63281 51513 27915 2662 3570
3046 3570 -31348 -56935 -75236 -112733 -79601 -67593 -78943 -77938 -10899 71140 64584 30406
3034 30406 83963 60221 46178 2975 -60096 -43172 -29486 9164 27292 -23559 -43616 -29792
3022 -29792 -39402 -50012 -15740 32468 50952 66868 60166 49270 83479 33063 22361 31944
3010 31944 -2055 34382 23535 13936 -8918 41984 92394 76515 32181 59346 37667 36629
2998 36629 29709 2844 -4081 50454 52467 -3571 7520 52599 84693 48103 56720 4206 -46985
2985 -46985 -47549 -39602 -39740 -76575 -127507 -134482 -49537 -5040 31159 57492 36889 -5460 5761
2972 5761 -29433 -25352 31817 -7014 -45308 -26798 -7590 15914 19439 71519 73256 11891 -29369
2959 -29369 17079 40410 31082 -11864 -373 39745 41076 12796 -46516 -61568 7243 30919
2947 30919 27401 6216 -9430 -25532 -42932 -120692 -116469 -60320 -60288 -52494 -28085 15297 8462
2934 8462 -22441 -42186 -17876 7098 -11700 -36426 -33435 -16827 -20246 -27893 -13411 -24064 -19152
2921 -19152 5270 29204 -10684 -30613 -32159 -32586 -46229 -93216 -54586 -12423 -35050 -36781 52822
2908 52822 7939 -15623 -32773 -81225 -88183 -101059 -84921 -56576 -31447 -18751 -72465 -80177
2896 -80177 -80740 -55119 23340 -3175 -35986 -5580 27283 50056 32498 19070 -4089 -44481
2884 -44481 -95858 -47609 -11187 -10273 -23878 -59419 -83729 -56423 7992 20082 1610 -30097
2872 -30097 -25421 -35632 -53008 37344 120092 119300 101415 106218 116003 92746 24324 12942 14202
2859 14202 27379 88928 94028 89038 112075 78925 63439 73771 28398 26202 51267 22393
2847 22393 12597 -1542 14457 47578 4434 -19422 10974 36707 27557 76859 45688 13310
2835 13310 12974 21137 23383 15706 42979 71303 63255 34506 48771 105206 89062 25238 49424
2822 49424 -36898 -68019 -30069 1411 20955 22244 29791 23656 -48124 -40102 -21112 -44213 -31633
2809 -31633 -38673 -36687 -8253 -30267 -56365 -35153 -30307 37427 109929 69187 47671 5245
2797 5245 -1475 27872 35682 39137 58332 11479 -43219 -3513 59198 12335 6291 85952 76393
2784 76393 67721 -2818 -53163 -13703 -1904 -23021 10427 45448 108069 87600 57023 64915
2772 64915 64410 563 -1117 -7380 19784 15048 -21109 -60405 -96559 -123155 -110026 -69273 -64897
2759 -64897 -42907 -14087 5688 -21220 39897 63363 51128 30498 36700 27711 -16721 -28155
2747 -28155 -11688 -53415 -9425 66917 47907 -3184 -7604 -77 9567 16260 59487 75592 108997
2734 108997 91575 64786 34253 25205 66356 42589 37344 115496 167901 115575 23578 25593
2722 25593 53957 69150 57993 26845 -32510 -50194 -57418 -27063 96642 62679 12926 -5825
$$ [...]
##END NTUPLES=NMR SPECTRUM
##END=
