##TITLE=Analysis number 328033
Compound Code cc 23806
Book Reference 486/146
Project Code adrs
Chemist Name simons
##JCAMPDX= 6.0         $$ Bruker NMR JCAMP-DX V2.0
##DATA TYPE= NMR SPECTRUM
##DATA CLASS= NTUPLES
##ORIGIN= Bruker BioSpin GmbH
##OWNER= nmr
$$ XWIN-NMR		Version 3.5
$$ Fri Apr 27 08:58:36 2007 GMT Daylight Time (UT+1h)  MAYBRIDGE\nmr@NMR_250MHZ
##.OBSERVE FREQUENCY= 250.131544655141
##.OBSERVE NUCLEUS= ^1H
##.ACQUISITION MODE= SIMULTANEOUS (DQD)
##.ACQUISITION SCHEME= undefined
##.AVERAGES= 16
##.DIGITISER RES= 18
##SPECTROMETER/DATA SYSTEM= dpx250
##.PULSE SEQUENCE= zg30
##.SOLVENT NAME= CDCl3
##.SHIFT REFERENCE= (INTERNAL, CDCl3, 0, 16.522)
##AUDIT TRAIL= $$ (NUMBER, WHEN, WHO, WHERE, WHAT)
$$ ##TITLE= Audit trail, XWIN-NMR		Version 3.5
$$ ##JCAMPDX= 5.01
$$ ##ORIGIN= Bruker BioSpin GmbH
$$ ##OWNER= nmr
$$ C:\u/data/dgb/nmr/ADRS/3160/pdata/1/auditp.txt
$$ ##AUDIT TRAIL=  $$ (NUMBER, WHEN, WHO, WHERE, WHAT)
(   1,<2007-04-27 08:58:04.56 +100>,<MAYBRIDGE\nmr>,<NMR_250MHZ>,
      <created by zg, POWCHK disabled, PULCHK disabled
       configuration hash MD5:
       76 6E 9A 78 1E 09 19 81 EC 84 63 8F B0 6A 59 2D
       data hash MD5: 64K
       A4 3B 38 3D F1 9F 45 BB 83 BA FF ED FA 21 05 94>)
(   2,<2007-04-27 08:58:24.69 +100>,<MAYBRIDGE\nmr>,<NMR_250MHZ>,
      <Start of raw data processing
       ef LB = 0.3 FT_mod = 6 PKNL = 1 SI = 32K 
       data hash MD5: 32K
       AE 12 1E 69 29 08 97 24 85 9C 82 15 68 49 D5 9C>)
(   3,<2007-04-27 08:58:26.49 +100>,<MAYBRIDGE\nmr>,<NMR_250MHZ>,
      <apk 
       data hash MD5: 32K
       92 1D 37 99 83 41 B8 15 26 1E B5 07 5A A9 CA 0D>)
(   4,<2007-04-27 08:58:27.36 +100>,<MAYBRIDGE\nmr>,<NMR_250MHZ>,
      <abs ABSG = 5 
       data hash MD5: 32K
       56 A7 11 62 8B 3F 58 8C E0 5D 95 B1 C6 60 8E E7>)
$$ ##END=
$$ 
$$ hash MD5
$$ EE 30 19 B7 E5 9D FD 23 1B C9 AE 3D BF 23 4D 23
##$RELAX= 
##$RELAX= 
##$RELAX= 
##$RELAX= 
##$RELAX= 
##$RELAX= 
##$RELAX= 
$$ Bruker specific parameters
$$ --------------------------
##$DU= <C:\u>
##$EXPNO= 3160
##$NAME= <ADRS>
##$PROCNO= 1
##$TYPE= <nmr>
##$USER= <dgb>
##$AMP= (0..31)
100 100 100 100 100 100 100 100 100 100 100 100 100 100 100 100 100 100 
100 100 100 100 100 100 100 100 100 100 100 100 100 100 
##$AQSEQ= 0
##$AQ_mod= 3
##$AUNM= <au_zg>
##$AUTOPOS= <2 >
##$BF1= 250.13
##$BF2= 250.13
##$BF3= 250.13
##$BF4= 250.13
##$BF5= 500.13
##$BF6= 500.13
##$BF7= 500.13
##$BF8= 500.13
##$BYTORDA= 1
##$CFDGTYP= 0
##$CFRGTYP= 5
##$CHEMSTR= <none>
##$CNST= (0..31)
1 1 145 1 1 1 1 1 1 1 1 1 1 1 1 1 1 1 1 1 1 1 1 1 1 1 1 1 1 1 1 1 
##$CPDPRG= <>
##$CPDPRG1= <>
##$CPDPRG2= <>
##$CPDPRG3= <>
##$CPDPRG4= <mlev>
##$CPDPRG5= <mlev>
##$CPDPRG6= <mlev>
##$CPDPRG7= <mlev>
##$CPDPRG8= <mlev>
##$CPDPRGB= <>
##$CPDPRGT= <>
##$D= (0..31)
0 1 0 0 0 0 0 0 0 0.06 0 0 0 0 0 0 0.0002 0 0 0 0 0 0 0 0 0 0 0 0 0 0 
0 
##$DATE= 1177660683
##$DBL= (0..7)
120 120 120 120 120 120 120 120 
##$DBP= (0..7)
150 150 150 150 150 150 150 150 
##$DBP07= 0
##$DBPNAM0= <>
##$DBPNAM1= <>
$$ [...]
##$SUBNAM6= <"">
##$SUBNAM7= <"">
##$SUBNAM8= <"">
##$SUBNAM9= <"">
##$SW= 20.6930455092707
##$SWIBOX= (0..15)
0 0 3 0 0 0 0 0 0 0 0 0 0 0 0 0 
##$SW_h= 5175.983436853
##$TD= 65536
##$TD0= 1
##$TE= 683.16
##$TE2= 300
##$TE3= 300
##$TEG= 300
##$TL= (0..7)
0 120 120 120 120 120 120 120 
##$TP= (0..7)
150 150 150 150 150 150 150 150 
##$TP07= 0
##$TPNAME0= <>
##$TPNAME1= <>
##$TPNAME2= <>
##$TPNAME3= <>
##$TPNAME4= <>
##$TPNAME5= <>
##$TPNAME6= <>
##$TPNAME7= <>
##$TPOAL= (0..7)
0.5 0.5 0.5 0.5 0.5 0.5 0.5 0.5 
##$TPOFFS= (0..7)
0 0 0 0 0 0 0 0 
##$TUNHIN= 0
##$TUNHOUT= 0
##$TUNXOUT= 0
##$USERA1= <user>
##$USERA2= <user>
##$USERA3= <user>
##$USERA4= <user>
##$USERA5= <user>
##$V9= 5
##$VALIST= <valist>
##$VCLIST= <CCCCCCCCCCCCCCC>
##$VD= 0
##$VDLIST= <DDDDDDDDDDDDDDD>
##$VPLIST= <PPPPPPPPPPPPPPP>
##$VTLIST= <TTTTTTTTTTTTTTT>
##$WBST= 1024
##$WBSW= 4
##$XGAIN= (0..3)
0 0 0 0 
##$XL= 0
##$YL= 0
##$YMAX_a= 375963
##$YMIN_a= -523572
##$ZGOPTNS= <>
##$ZL1= 120
##$ZL2= 120
##$ZL3= 120
##$ZL4= 120
##$ABSF1= 16.522
##$ABSF2= -4.171173
##$ABSG= 5
##$ABSL= 3
##$ALPHA= 0
##$AQORDER= 0
##$ASSFAC= 0
##$ASSFACI= 0
##$ASSFACX= 0
##$ASSWID= 0
##$AUNMP= <proc_1d>
##$AZFE= 0.1
##$AZFW= 0.1
##$BCFW= 0
##$BC_mod= 0
##$BYTORDP= 0
##$COROFFS= 0
##$CY= 12.5
##$DATMOD= 1
##$DC= 0
##$DFILT= <>
##$DTYPP= 0
##$F1P= 14.0000005364418
##$F2P= -0.99999901652339
##$FCOR= 0.5
##$FTSIZE= 32768
##$FT_mod= 6
##$GAMMA= 0
##$GB= 0
##$INTBC= 1
##$INTSCL= 1
##$ISEN= 128
##$LB= 0.3
##$LEV0= 0
##$LPBIN= 0
##$MAXI= 10000
##$MC2= 0
##$MEAN= 0
##$ME_mod= 0
##$MI= 0
##$NCOEF= 0
##$NC_proc= -4
##$NLEV= 6
##$NOISF1= 0
##$NOISF2= 0
##$NSP= 0
##$NTH_PI= 0
##$NZP= 0
##$OFFSET= 16.522
##$PC= 1
##$PHC0= 155.394
##$PHC1= 2.568003
##$PH_mod= 1
##$PKNL= yes
##$PPARMOD= 0
##$PSCAL= 4
##$PSIGN= 0
##$REVERSE= no
##$SF= 250.13
##$SI= 32768
##$SIGF1= 0
##$SIGF2= 0
##$SINO= 400
##$SIOLD= 32768
##$SREGLST= <1H.CDCl3>
##$SSB= 0
##$STSI= 32768
##$STSR= 0
##$SW_p= 5175.98343685301
##$SYMM= 0
##$S_DEV= 0
##$TDeff= 65536
##$TDoff= 0
##$TI= <Analysis number 999999
Compound Code 99
Book Reference 9
Project Code 9>
##$TILT= no
##$TM1= 0
##$TM2= 0
##$TOPLEV= 0
##$USERP1= <user>
##$USERP2= <user>
##$USERP3= <user>
##$USERP4= <user>
##$USERP5= <user>
##$WDW= 1
##$XDIM= 32768
##$YMAX_p= 420092835
##$YMIN_p= -55400
$$ End of Bruker specific parameters
$$ ---------------------------------
##NTUPLES= NMR SPECTRUM
##VAR_NAME=  FREQUENCY,     SPECTRUM/REAL,   SPECTRUM/IMAG
##SYMBOL=    X,             R,               I
##VAR_TYPE=  INDEPENDENT,   DEPENDENT,       DEPENDENT
##VAR_FORM=  AFFN,          ASDF,            ASDF
##VAR_DIM=   32768,         32768,           32768
##UNITS=     HZ,            ARBITRARY UNITS, ARBITRARY UNITS
##FACTOR=    0.157963299565203, 1,           1
##FIRST=     4132.6476996994, 0,             0
##LAST=      -1043.33573715361, 0,           0
##MIN=       -1043.33573715361, -55400,      0
##MAX=       4132.6476996994, 420092835,     0
$$ Real data points
##PAGE= N=1
##DATA TABLE= (X++(R..R)), XYDATA
$$ [...]
18690A199349l8981l0045j6383j2401p090q723j3225j8071j0951k0173j7749j4445
18678I91112j8178j5223r088m71r387k0404k9719j6586M966L322q95M641J4023
18665H98113K4283J1850K2707K1868J6974J8539J185n118m034k288l840k252R8
18652I98085j3833q188k2381l0316k5924l4715l2225j8594j4162k2815k6201k5261
18640G23470k5636l2291k3617o670j4840j6826q881j0523j2314r271K560J992
18628E67153O518O502O914K03o265r666j1552r250o432j330j688j2870j5766q460
18614E04011j1728k786j7860j4966J3354J2096j9560j5434R436P411L315l619
18602D63670n42P516l893Q849r80j918R754N383K217M824J7990J6869N760R229
$$ y = [1199349, 1160368, 1130323, 1113940, 1101539, 1094449, 1085726, 1072501, 1054430, 1043479, 1023306, 1005557, 991112, 972934, 957711, 948623, 948152, 938765, 918361, 888642, 872056, 877022, 880344, 879449, 884090, 898113, 922396, 934246, 956953, 978821, 995795, 1014334, 1015519, 1010401, 1006367, 1004079, 1000239, 997987, 998085, 984252, 976064, 953683, 923367, 897443, 862728, 830503, 811909, 797747, 774932, 748731, 723470, 697834, 665543, 641926, 635256, 620416, 603590, 594709, 584186, 571872, 562601, 565161, 567153, 573671, 580173, 587087, 587290, 581025, 571359, 559807, 550557, 544125, 542795, 541107, 528237, 512471, 504011, 492283, 489497, 471637, 456671, 470025, 482121, 462561, 447127, 456563, 463974, 467289, 463670, 463128, 470644, 466751, 475600, 474620, 472702, 482456, 487839, 490056, 494880, 512870, 529739, 535499, 544728]
18588E44728N984K4965J4109R227L773n36L037P818J2304K1672K4954L2112L8554
18575G42701M4665M2194M5228N7637M3399L0074J9941P910O926k985J610k843
18563A036457J478M204n357R581L656L251j8483m0429m5895m6964n1120n1045
18551G99334l5199k1888k2348j0028o789p903q321r040m959k1637k5608j2909
18539F12705j614K680m87p958Q608Q458L787J0897J2903O858M824O130J2470J8229
18525F98490J4516J5572K0310L6053N0245O4808Q1787J00260J30477J53009J87552
18514A553079K03264J80906J56693J13771J4899p3214j21694j45213j20953m9265
18504A712273K4760O7884R5739J07680Q9057M9912l4453j17691j72268k05566
$$ y = [544728, 550712, 575677, 589786, 599013, 602786, 602250, 605287, 613105, 625409, 647081, 672035, 704147, 742701, 787366, 829560, 874788, 932425, 975824, 1005898, 1025839, 1033749, 1040675, 1037690, 1039300, 1036457, 1037935, 1042139, 1036782, 1046363, 1050019, 1053270, 1034787, 994358, 948463, 901499, 850379, 799334, 764135, 742247, 719899, 709871, 703082, 695179, 686858, 677818, 672859, 651222, 625614, 612705, 611091, 613771, 613284, 605326, 613934, 622392, 626179, 637076, 649979, 656837, 661661, 667791, 680261, 698490, 713006, 728578, 748888, 784941, 835186, 899994, 981781, 1082041, 1212518, 1365527, 1553079, 1756343, 1937249, 2093942, 2207713, 2222612, 2149398, 2027704, 1882491, 1761538, 1712273, 1737033, 1804917, 1900656, 2008336, 2097393, 2147305, 2112852, 1995161, 1822893, 1617327]
18494A617327j85984j35645r7627o7029m1066l5187k7180l6297l0279j6587j9674
18483I24772k1423j8858k4045j0428p069q210k127j9127j8187k1446j9404j5354
18471G39094q660j6293J463J4667K5360J0184q08Q537n023j9407m850J6365M520
18458G65149J3962L4020M5723N0470Q2229Q2208Q0693P0310L9123L858k4286n3756
18446A189703n0124m1618k5329k5383j9621j6398j5024k6215k0617j8513j942
18435I28919q478j3748j2042j8688k0601k5462j9815k5920m0347l2881k2952k3196
18423F64789k5052j0750K788L514L843j033R976J7575Q827R707R603K3470J9302
18410G36559J9823K3617L7433K7472P595J8233K0320J0943K7625N2340N4609O5696
$$ y = [1617327, 1431343, 1295698, 1198071, 1131042, 1089976, 1054789, 1027609, 991312, 961033, 944446, 924772, 903349, 884491, 860446, 850018, 842949, 834739, 832612, 813485, 795298, 773852, 754448, 739094, 730434, 714141, 715604, 730271, 755631, 765815, 765007, 773544, 768521, 749114, 744264, 760629, 765149, 779111, 813131, 858854, 909324, 991553, 1073761, 1154454, 1224764, 1263887, 1267745, 1243459, 1189703, 1139579, 1097961, 1072632, 1047249, 1027628, 1011230, 996206, 969991, 949374, 930861, 928919, 920441, 906693, 894651, 875963, 855362, 829900, 810085, 784165, 743818, 710937, 687985, 664789, 639737, 628987, 631775, 635289, 639132, 638099, 648075, 665650, 674477, 684184, 693787, 717257, 736559, 756382, 779999, 817432, 844904, 852499, 870732, 891052, 901995, 929620, 981960, 1036569, 1102265]
18398A102265P6753O3758M1211L3512P518k4640l6683m9195l8337k8671j6823
18387A130668k373J9742K1777K6034L4824M4941O5776P6199Q3835P3665O4751
18376A639839N9766N0180M3215M0275K8063J5854M126J0372K2737K1701L2236
18365A968364K4479J6517l860k5262k5961k5897k6376j8206k6144m1052l5235
18354A781367q546j0469k248M011j7905k3131k7990l9735l1609k9425l6866k3410
18342A534044k8428l9104m2455k3340j2709l969J3J8311L3348L5200M2301O7320
18330A580532Q5747R0238Q4572R8312R8732P6996Q4346Q6030O8348O1508L9205
18319B454566L1604K5120L1463L6795J0733r467k2919k2784r320J9051M4862N5020
$$ y = [1102265, 1179018, 1242776, 1283987, 1317499, 1325017, 1300377, 1263694, 1214499, 1176162, 1147491, 1130668, 1128295, 1148037, 1169814, 1195848, 1230672, 1275613, 1341389, 1417588, 1501423, 1575088, 1639839, 1699605, 1749785, 1793000, 1833275, 1861338, 1877192, 1881318, 1891690, 1914427, 1936128, 1968364, 1992843, 2009360, 2005500, 1980238, 1954277, 1928380, 1902004, 1883798, 1857654, 1816602, 1781367, 1772821, 1762352, 1760104, 1764115, 1746210, 1723079, 1695089, 1655354, 1623745, 1594320, 1557454, 1534044, 1505616, 1466512, 1424057, 1400717, 1388008, 1384039, 1384052, 1402363, 1435711, 1470911, 1513212, 1580532, 1666279, 1756517, 1841089, 1939401, 2038133, 2115129, 2199475, 2285505, 2353853, 2415361, 2454566, 2486170, 2511290, 2542753, 2579548, 2590281, 2580814, 2557895, 2535111, 2525791, 2544842, 2589704, 2644724]
18307B644724O2451O2743N6224L9331K2957Q999j5752n7726q5721j01848r0053
18296B546329p4833m8127m2501k9058l0325k9838j9909p181P536L2815O1549P6520
18284B442977R2129J19892J50638J65580J70267J74209J66846J64767J82284K04647
18274D034236K42967K71112L20146L89912M42738M93006N69393O05721O66585
18265H035816P69599R56135J268709J746075K421813L380723M607437N985507
18257B9171814P336716Q288247Q536834Q016453O601498M938838L627211K651933
18249G9169544K442543K852361L304546L807574M196980M298011L972781K952320
18241A06996660J328991m33626k054436l314770l419647k894336k113496j045701
$$ y = [2644724, 2707175, 2769918, 2826142, 2865473, 2888430, 2897429, 2881677, 2823951, 2738230, 2636382, 2546329, 2471496, 2423369, 2380868, 2351810, 2321485, 2291647, 2271738, 2264557, 2272093, 2304908, 2366457, 2442977, 2535106, 2654998, 2805636, 2971216, 3141483, 3315692, 3482538, 3647305, 3829589, 4034236, 4277203, 4548315, 4868461, 5258373, 5701111, 6194117, 6763510, 7369231, 8035816, 8805415, 9761550, 11030259, 12776334, 15198147, 18578870, 23186307, 29171814, 36508530, 44796777, 53333611, 61350064, 67951562, 72890400, 76517611, 79169544, 81612087, 84464448, 87768994, 91576568, 95773548, 100071559, 104044340, 106996660, 108325651, 107892025, 105837589, 102522819, 99103172, 96208836, 94095340, 93049639]
18233I3049639k22338M4686j41475r37364k356044m346691o687880q694419r852252
18224E9855862r938457q874558o994496n086933l515235k385452j663206j208249
18216B0189276r63614q71820q57528q84876r09109r13975r03865q44542p39510
18207A2300437o36984n47425m73101m18257l90603l96309m04270m40853m68286
18198H124349m90349n08048m83213m25885l38054k57142k18108k03440j87144
18189E012966j54015j57152j50145j47621j58446j51990j44250j34466j27893
18180C686988j06516j07462r7791r9137r9682r0951r5906r5593r0642r0002q7632
18169B625674q2358q0414r2886r8545r4328q0767p9144q1182p8447p3052o9123
$$ y = [93049639, 92827301, 92871987, 92730512, 91793148, 89437104, 85090413, 78402533, 69708114, 59855862, 49917405, 41042847, 34048351, 28961418, 25446183, 23060731, 21397525, 20189276, 19225662, 18353842, 17496314, 16611438, 15702329, 14788354, 13884489, 13039947, 12300437, 11663453, 11116028, 10642927, 10224670, 9834067, 9437758, 9033488, 8592635, 8124349, 7634000, 7125952, 6642739, 6216854, 5878800, 5621658, 5403550, 5200110, 5012966, 4858951, 4701799, 4551654, 4404033, 4245587, 4093597, 3949347, 3814881, 3686988, 3580472, 3473010, 3375219, 3276082, 3176400, 3085449, 2989543, 2893950, 2803308, 2713306, 2625674, 2543316, 2462902, 2370016, 2271471, 2177143, 2096376, 2017232, 1936050, 1857603, 1784551, 1715428]
18158A715428o5497p8605p2626p6980q0258q4507p2248o1280n5504m7397l7544
18147I82982l8583l1917k1864j4946k2428j5778k0642k3814r842j2617n273k793
18135G62485n541L62O909N592J1865K5500K5680K6356L3857K5184K2709J7944
18123I58902K4719L5149M1902M5846P7972R9724J28196K01463L05672M73717P22278
18112C115540J097303J587860K019816K248902J934891R63875o44695k209450
18104A0114042k838232k308490j276359p23837m60495l17819k21953j64250j27183
18095A675424r7298p9999o1542m6252l4481l0372j2206q075p802l747k7092m6203
18083A220355m4376n7610n5335m2563m6607l1915j9260k5245k1577j9909j1311
$$ y = [1715428, 1649931, 1571326, 1498700, 1421720, 1341462, 1256955, 1184707, 1123427, 1067923, 1020526, 982982, 944399, 912482, 890618, 875672, 853244, 837466, 816824, 793010, 783168, 770551, 765278, 762485, 756944, 757306, 764215, 769807, 781672, 807172, 832852, 859208, 893065, 918249, 940958, 958902, 983621, 1018770, 1060672, 1106518, 1184490, 1284214, 1412410, 1613873, 1919545, 2393262, 3115540, 4212843, 5800703, 7820519, 10069421, 12004312, 12968187, 12323492, 10114042, 7275810, 4967320, 3690961, 2967124, 2506629, 2188810, 1966857, 1802607, 1675424, 1578126, 1498127, 1436585, 1390333, 1355852, 1325480, 1313274, 1305199, 1297397, 1293650, 1266558, 1220355, 1175979, 1118369, 1063034, 1020471, 973864, 941949, 922689, 897444, 875867, 855958, 844647]
18072H44647L866j382n194O074n497r411J1954J9680J5900K8037J7853P652J7473
18059I51652J080N508J0179J7118K9473M6439N9642R9421J47061J72992J81053
18048A721618J70804J40536P2528o111r1763j74061k06907j89979j59172j16026
18038A161467p8262l5588j3970o783q770j5664l3666n0374o2874o2076n3974m7597
18026F91869l1055j7991j5766r909n501j900p596q69N07l84M873J4983J0421J1679
18012F43361J2957K1736M0510M8020L9676M7483O1376N1847L3110O371j0250k867
18000I93330K2183N9205J02011J30721J40903J44139J26992Q8229L6136k7345
17990A816504j01788j57310j76018j83401j56099q6179m5574l8996l3471k3897
$$ y = [844647, 848513, 847131, 841937, 848011, 842514, 833103, 845057, 864737, 880637, 908674, 926527, 934179, 951652, 952732, 958240, 968419, 985537, 1015010, 1061449, 1121091, 1220512, 1367573, 1540565, 1721618, 1892422, 2032958, 2105486, 2099375, 2007612, 1833551, 1626644, 1436665, 1277493, 1161467, 1083205, 1047617, 1033647, 1026864, 1018094, 1002430, 968764, 918390, 855516, 793440, 739466, 691869, 660814, 642823, 627057, 617148, 611647, 609747, 602151, 601282, 601789, 601405, 606278, 621261, 631682, 643361, 656318, 678054, 718564, 766584, 806260, 853743, 915119, 966966, 1000076, 1006447, 996197, 993330, 1015513, 1074718, 1176729, 1307450, 1448353, 1592492, 1719484, 1807713, 1843849, 1816504, 1714716, 1557406, 1381388, 1197987, 1041888, 955709, 910135, 871139, 837668, 813771]
17980H13771j9466r594j0410k82r52o597p769r215l625Q971m764k1539O849J4531
17966G49909J1641J4910J3380K6732L2040N1639N0513L6511L2488K8346L3931
17955A082040L4752L3652N7893O5015R4190J19893J30547J39484J33090J04371
17945A994927M9616J7119J2268l450j1531J140J5939K9374L7270L5428L9173L1007
17933B248280J4036k4138p3326j19772j18391j11011j03622r2086o0686l5020
17923A524264j0549K173r627q218m425q097j8238j7942j7629m874K166J3852L0825
17910A473681L4831M7768O4782O2729N9840O3447O3464N9250O0628P1841O9273
17899B131534Q2163J13141J37159J45528J46997J50872J33198J26002J16518R2985
$$ y = [813771, 794305, 784711, 774301, 774019, 773067, 766470, 758701, 749486, 745861, 754832, 750068, 728529, 735378, 749909, 761550, 776460, 789840, 816572, 848612, 900251, 950764, 987275, 1019763, 1048109, 1082040, 1116792, 1150444, 1208337, 1273352, 1367542, 1487435, 1617982, 1757466, 1890556, 1994927, 2044543, 2061662, 2073930, 2070480, 2058949, 2060089, 2076028, 2105402, 2142672, 2178100, 2217273, 2248280, 2262316, 2238178, 2164852, 2045080, 1926689, 1815678, 1712056, 1619970, 1559284, 1524264, 1513715, 1515888, 1506261, 1498043, 1493618, 1485521, 1467283, 1449341, 1431712, 1426838, 1429004, 1442856, 1473681, 1508512, 1556280, 1621062, 1683791, 1743631, 1807078, 1870542, 1929792, 1990420, 2062261, 2131534, 2213697, 2326838, 2463997, 2609525, 2756522, 2907394, 3040592, 3166594, 3283112, 3376097]
17889C376097P4149O4119Q0331J05452J43538J90827K46628L10838L59154L86632
17879E337765M32402N05638O60787Q66869J110356J437211J729638J804723J736206
17870A5621595J526741J119701R91127J284436J674880K115443K550306L221984
17862C0106213M298565N761825P731302J0361577J2940359J4261422J4422902
17855I9884165J2390329Q309029O403891O003750N285306M700478L487706K221957
17847A48686611M72956l944204j0159952j4334098j4241709j2529189j1294061
17840H2656354r303131o291874l765748k265557j702119j763084k068213k873164
17832E2623464m423199n850977n985773m782397l377924k372108j701598j216575
$$ y = [3376097, 3450246, 3514365, 3594696, 3700148, 3843686, 4034513, 4281141, 4591979, 4951133, 5337765, 5770167, 6275805, 6936592, 7803461, 8913817, 10351028, 12080666, 13885389, 15621595, 17148336, 18268037, 19259164, 20543600, 22218480, 24333923, 26884229, 30106213, 34404778, 40166603, 47897905, 58259482, 71199841, 85461263, 99884165, 112274494, 120583523, 126987414, 132991164, 138276470, 142976948, 146464654, 148686611, 149159567, 145215363, 135055411, 120721313, 106479604, 93950415, 82656354, 73353223, 67061349, 63295601, 61030044, 59327925, 57564841, 55496628, 52623464, 48200265, 42349288, 36363515, 31581118, 28203194, 25831086, 24129488, 22912913]
17824B2912913q25932m92449j68317J89001O34091J221821J942472K739316L395614
17815C1548530L640980L512037L052298K300316K153290K931995M106785N482725
17807E8728956O896376Q292270R527492J0142352R652732P927187O263849N708979
17799A23140193L827988J305024J143295J476360J220029o74310m467917p890846
17791A19079816j0310779j3412627j6346399j6052185j1592185o985204m260246
17784D0120191k969112k311271j684351j191747r28373q86236j031258j238012
17776B7879831j607266k206455k707600k728100k225421j671491j302912j061556
17768A2369030q96230p70374o88363o19770n57395n00820m49178m32753m46571
$$ y = [22912913, 22086981, 21594532, 21426215, 21615216, 22249307, 23471128, 25413600, 28152916, 31548530, 35189510, 38701547, 41753845, 44054161, 46207451, 49139446, 53246231, 58728956, 65625332, 73917602, 83445094, 93587446, 103240178, 111167365, 117431214, 123140193, 126968181, 128273205, 129416500, 130892860, 132112889, 131438579, 126970662, 119079816, 108769037, 95356410, 79010011, 62957826, 51365641, 44380437, 40120191, 37151079, 34839808, 33155457, 31963710, 31035337, 30149101, 29117843, 27879831, 26272565, 24066110, 21358510, 18630410, 16404989, 14733498, 13430586, 12369030, 11472800, 10702426, 10014063, 9394293, 8836898, 8336078, 7886900, 7454147, 7007576]
17759G007576m53225m39616m36415m03760l67425l31747k96525k63314k22231
17750C793318j99454j81237j75162j60388j62555j51758j40169j31472j29618
17741B361505j18308j05130r8709r2967q5954q3708p9738o1803n0083m0787m3740
17730A500578l7274j8988k6445m4018m1131m8185n4965m9578m6654l8707k7529
17719A067104k8671k7412l1005k9822j5826k9938l4095j8458j1257j8910p526
17708H14184j5058j1446j7289k1601j0035n274r651J285k380l390j6139j1405
17696F91801L977p826j2486n09N472L314J2817P073p076j654N636q953k2691k949
17682F65946K932j190K731N737J6735K3761R319M288N193n03r068j1239j4588
$$ y = [7007576, 6554351, 6114735, 5678320, 5274560, 4907135, 4575388, 4278863, 4015549, 3793318, 3593864, 3412627, 3237465, 3077077, 2914522, 2762764, 2622595, 2491123, 2361505, 2243197, 2138067, 2039358, 1946391, 1860437, 1776729, 1696991, 1635188, 1585105, 1544318, 1500578, 1463304, 1444316, 1417871, 1373853, 1332722, 1284537, 1229572, 1179994, 1133340, 1094633, 1067104, 1038433, 1011021, 980016, 950194, 934368, 904430, 870335, 851877, 840620, 821710, 814184, 799126, 787680, 770391, 748790, 738755, 733481, 723830, 725115, 722735, 719345, 703206, 691801, 695778, 687952, 675466, 674957, 680429, 683743, 696560, 703633, 696557, 694903, 700539, 691586, 668895, 665946, 668878, 667688, 670419, 676156, 692891, 716652, 725971, 730259, 735452, 734949, 725881, 714642, 700054]
17669G00054n500Q381K3646J6029K9569L0582K0343K4650J5567J6278J6489J5210
17657I11298Q579O725K3197K1032J9476K7796J8474J7189j311r821j4659p470
17645A020505k8476k2457j4973j0749J443q868m333j4895k5419l0881m7062m9155
17633G64680n6967m8290l6862l3348l6765k9848j8149j7653r830m143o989o820
17621D59016j4263p501j2399m743n086j5299j4743l309K394j8349j1448r735p002
17608C37533J280L873N206j1005j988n712n403k140n858r011r941p995M270J678
17594B94787r436l816m527j6030j4203j1738l515k883K16N906j534O32q471m243
17580B21145O78N891J0869l590l118K0134O124o242j5071j0128O068M713R250
$$ y = [700054, 694554, 702935, 726581, 742610, 772179, 802761, 823104, 847754, 863321, 879599, 896088, 911298, 919877, 926602, 949799, 970831, 990307, 1018103, 1036577, 1053766, 1052455, 1042634, 1027975, 1020505, 992029, 969572, 954599, 943850, 945293, 936425, 932092, 917197, 891778, 860897, 813835, 764680, 707713, 659423, 622561, 589213, 552448, 522600, 504451, 486798, 476968, 472825, 465836, 459016, 444753, 437252, 424853, 420110, 415024, 399725, 384982, 381673, 384067, 365718, 354270, 344535, 337533, 338813, 342686, 347892, 336887, 334899, 329187, 323784, 321644, 315786, 306775, 296834, 288839, 293109, 294787, 285351, 281535, 277008, 260978, 246775, 235037, 231522, 228639, 228855, 234761, 233227, 233859, 225388, 221145, 221823, 227714, 238583, 234993, 231875, 252009, 258133, 251891, 236820, 226692, 232760, 237473, 246723]
17567B46723N955K796M025Q28M33L957P019o833j1839l640J1251L012o537K254
17553B59404R301J4525j020k157J16n354M231K047Q25j1766o838r104k0981k302
17539B30927k694q371r684o538o780m017p925k582p86k215r895k889P60Q76Nq486
17523A59706p861K454R679K492n710p622j820k696O295O091n652k377K344L17
17509A55640o90R037O983J018l45n93l167J1555K668j260K986r608J315J0420
17495A85959L673J470k946M643L198j6750k5346m703n430n186n066q666M191K882
17481A31923j5284q183k962j1196p929N668P387M194M866r841r903n642L971K150
17467H9219j0637K262n432j730N999R548k272o715m870k021J3332Q395M065M150
$$ y = [246723, 252678, 255474, 259499, 260327, 260760, 264717, 271736, 264903, 253064, 249424, 260675, 263687, 257150, 259404, 268705, 283230, 282210, 280053, 280169, 274815, 279046, 281093, 281918, 270152, 263314, 254210, 233229, 230927, 228233, 219862, 210178, 203640, 196860, 192843, 184918, 182336, 181550, 179335, 169440, 166551, 167311, 168187, 168192, 159706, 151845, 154299, 163978, 166470, 160760, 153138, 151318, 148622, 154917, 161008, 155356, 152979, 155323, 155640, 154950, 163987, 170970, 171988, 171643, 171050, 167883, 179438, 182106, 180846, 183832, 174224, 175539, 185959, 189632, 191102, 188156, 192799, 195997, 179247, 153901, 149198, 143768, 138582, 133516, 124850, 129041, 131923, 116639, 108456, 105494, 94298, 86369, 92037, 99424, 103618, 108484, 98643, 88740, 83098, 87069, 89219, 78582, 80844, 75412, 73682, 79681, 89229, 86957, 80242, 75372, 73351, 86683, 95078, 99143, 103293]
17453A03293Q915J341p681P033P978K4237L0886K2703L3294N8219P3758P3480
17441D37456O3435O7903N2332K0630J6079J5343J7274J468k1651l1628n4868m9267
17429E34506j1676P217K3185K7890K9643K1831J3562J3074J2698J117k7419n0503
17417E95125q0776j05584q1389n4806l8311j9083j1550k1312j0502n282j7858
17406A48672j2196j0414m151o919j0995l340K4n056j3703m046m719N003l259N78
17392G5479R144P534M791O862P483l684M595L544K922j0887n539R108J1837r4
17378A23095j2629l299P686K541m140j3734n031M140J3962J2640o294j2085l705
17365A03147K54J0987O416n448j1995j2105R068Q392J1769J4083L906J4148J5138
$$ y = [103293, 112208, 113549, 105868, 112901, 120879, 145116, 176002, 198705, 231999, 290218, 363976, 437456, 500891, 568794, 621126, 641756, 657835, 673178, 690452, 691920, 670269, 638641, 583773, 534506, 522830, 530047, 553232, 581122, 610765, 632596, 646158, 659232, 671930, 673047, 645628, 595125, 514349, 408765, 327376, 272570, 234259, 215176, 203626, 182314, 171812, 166530, 148672, 136476, 126062, 121911, 114992, 103997, 100657, 100681, 95625, 81922, 77876, 73157, 78160, 74901, 75479, 84623, 92157, 96948, 103810, 111293, 107609, 112204, 115748, 118670, 107783, 102244, 111352, 123189, 123095, 110466, 107167, 114853, 117394, 113254, 99520, 94489, 98629, 112591, 125231, 118937, 106852, 103147, 103401, 114388, 120804, 115356, 103361, 91256, 100324, 108716, 120485, 134568, 138474, 152622, 167760]
17352A67760K4463K1923K3211J6994L0381L3611K7794L4334L3992L5041N1000
17341E00504N1167M4541K9023J4322J7802J0341L031O950J6110M494j0316j3533
17329F74436k3347l4273j6872J351o79j3526l0021m6246n5024n0998k8141j9414
17317C57246j7862j2335j2959o669n183j2788q271J557q203j6004j3917j515q314
17304B34783k203N567J6479J2900J8106L3591M0330K9201K9620K8194L7706L9540
17292E23814L8501K4551J1982N032P892j1915o456j0519q375j0805j8312j7914
17280E27476k4342k0321P46K4951J1404J3105J2723r60M775L424m422j5415j8429
17267E14715k8494l6785n1291n1073n5302m3264k4833j2405k1711j9476j2614
$$ y = [167760, 192223, 214146, 237357, 254351, 284732, 318343, 346137, 380471, 414463, 449504, 500504, 551671, 596212, 625235, 639557, 657359, 667700, 670731, 677681, 693791, 698285, 687969, 674436, 651089, 616816, 599944, 601295, 600616, 587090, 557069, 510823, 455799, 404801, 376660, 357246, 339384, 327049, 314090, 307421, 302238, 289450, 281179, 282736, 274533, 258529, 244612, 243097, 234783, 232580, 238147, 254626, 267526, 285632, 319223, 359553, 388754, 418374, 446568, 484274, 523814, 562315, 586866, 598848, 603880, 611772, 599857, 593401, 582882, 574507, 563702, 545390, 527476, 503134, 482813, 483559, 508510, 519914, 533019, 545742, 544782, 549557, 552981, 548559, 533144, 514715, 486221, 449436, 398145, 347072, 291770, 248506, 223673, 211268, 189557, 170081, 157467]
17256A57467N298L363j3164p238N457J4770N657R529J0999M994j511n482m494
17243A85645M814n323K765N960j1961n191q171n526L881j449Q504J6504l869j38
17229A86445O525K780m292K98J380N055m984r861q963k537l055m125M535n388
17215A63813p264j480J027j2520j6040j094l284L396K833O04n096n459n618Q589
17201A22407K454m07o480j2778j0258q279p535l571K820L609k681q514n803R153
17187G4137O401Q97J667k200l071q571o259M584J38K299j0135j2485q716j344
17173C7342L528p190Q255l21N880P535P140K146j330M685m129J42O26j2351N854
17158E7812L778n331m982K040L854J6152Q829M668J0750j055J2139J5673K2688
$$ y = [157467, 162765, 166128, 152964, 145726, 151183, 165953, 171610, 181139, 192138, 197132, 195621, 190139, 185645, 190459, 185136, 187901, 193861, 181900, 176709, 168538, 163012, 166893, 165444, 173948, 190452, 186583, 186445, 192970, 195750, 191458, 191756, 193136, 198191, 193207, 183346, 174383, 171846, 168791, 164666, 169201, 163813, 156549, 155069, 156096, 143576, 127536, 126442, 123158, 126554, 129387, 129991, 124895, 119436, 113818, 122407, 124861, 124454, 117974, 105196, 94938, 86659, 79124, 75553, 78373, 81982, 79301, 70787, 64984, 74137, 80538, 81435, 83102, 80902, 77831, 69260, 63001, 67585, 67723, 70022, 59887, 47402, 38686, 37342, 40870, 33680, 41935, 41614, 47494, 55029, 62169, 64315, 62985, 67670, 63541, 63683, 64309, 51958, 57812, 61590, 56259, 51277, 53317, 57171, 73323, 82152, 86820, 97570, 96515, 108654, 124327, 147015]
17145A47015K1002Q273O169P328M496l464j1532j7717J78J314p010o576O762J5421
17131A71659K2005J5603K796N400J213j4389l2740k3900m757l117r638j4099j9334
17118I6702p202q755k408l500Q47L552j081l945k40Q521l098m676J844K084O931
17103H5576n928J1264L517L367J4103L824o363N088O254l47k667j63m793k483
17089A10249R72Q62O533P121J2515J3408J5730J3019J2830Q414j0704q237M996
17076A87708Q736K889j0926n704N282Q86n935j652R926J5642Q292l682k560J4032
17062B22934O787j090l773p755o64k414M843R260P508J0399J5769J5167L0966
17049C07937L2645K9812K0292K1020K0910R462o52j7681j7595j6557k3916j9254
$$ y = [147015, 168017, 176290, 182459, 189787, 194283, 190819, 179287, 161570, 161748, 163062, 156052, 149476, 156238, 171659, 193664, 209267, 212063, 217463, 218676, 204287, 171547, 147647, 142890, 139773, 130135, 116036, 96702, 89500, 80745, 78337, 74837, 75684, 79236, 78155, 74210, 73970, 82491, 79393, 74717, 76561, 78645, 85576, 79648, 90912, 94429, 97796, 111899, 115723, 109360, 114448, 120702, 120355, 117688, 117525, 112732, 110249, 111221, 112083, 118616, 125737, 138252, 151660, 167390, 180409, 193239, 201653, 190949, 182712, 187708, 196444, 199333, 188407, 182703, 187985, 188871, 182936, 181284, 191210, 206852, 215144, 211462, 208902, 222934, 229721, 228631, 224858, 217103, 216439, 214025, 218868, 228128, 235636, 246035, 261804, 276971, 307937, 340582, 370394, 390686, 411706, 432616, 442078, 441426, 423745, 406150, 389593, 365677, 346423]
17037C46423p465O290J5317K4802K1516J5856P917k741r596K83j4821j4838j9516
17024C69427j6261j0986n148M512R454K0987K9649J3985J0344K760l761r906j7245
17011C97811k6185o397Q289K3477K4544M0022M6025L4126K0865R880j199j8356
16999E52902k5807k0831l1891j7491k896j846J7400K1842K6637J4462J3439J5883
16987E61803J6991J0727N577m162M177K1537P876R026R346J1710J5682K9139K8575
16974G28004K2728L4111M5067L9374J9100K6516K4363P262n693J0997J0007J874
16962I63710L283p525m242Q711J5986K0794J8296K0839K1480R983J9002J3853
16950A104170J3967m905l714J089J3020L6874L7798L0038M6429M8539M8791N2524
$$ y = [346423, 338958, 345248, 360565, 385367, 406883, 422739, 430656, 427915, 418319, 418602, 403781, 388943, 369427, 353166, 342180, 337032, 341544, 350998, 371985, 401634, 415619, 425963, 428723, 424962, 415056, 397811, 371626, 365229, 373518, 396995, 421539, 461561, 507586, 541712, 562577, 572457, 571258, 552902, 527095, 506264, 474373, 456882, 453986, 452140, 469540, 491382, 518019, 532481, 545920, 561803, 578794, 589521, 595098, 590936, 595113, 616650, 624526, 633552, 642898, 654608, 670290, 699429, 728004, 750732, 784843, 829910, 869284, 888384, 914900, 939263, 946525, 940832, 951829, 961836, 963710, 966993, 959468, 955226, 963937, 979923, 1000717, 1019013, 1039852, 1061332, 1071315, 1090317, 1104170, 1118137, 1113232, 1109518, 1110607, 1123627, 1160501, 1198299, 1228337, 1274766, 1323305, 1372096, 1424620]
16938A424620M2816M4252N2829N1857M5944K4258J8115K4749L9001L1678K2356
16927A822475K1623L6091N7674Q8770J02976J17574J35157J38827J47102J68043
16917B836312J92939K05627K28077K37887K37700K39070K53791K85712L17183
16908E034298L27291L42789L52499L61441L79370M34454N06927O51763Q66533
16899I257365J188909J594974K191636L097900M373141O150139Q481508J0956961
16891D7292533J2461104J2356144J1340680Q726784N352317M314411M592159L913525
16883A10349657J752824j216496n428717r661984j0753673o074886J103221N631664
16875H5701610P299962O955314M407123K502292K598344K529111Q80013k070001
$$ y = [1424620, 1467436, 1511688, 1564517, 1616374, 1662318, 1686576, 1704691, 1729440, 1768441, 1800119, 1822475, 1844098, 1880189, 1937863, 2026633, 2129609, 2247183, 2382340, 2521167, 2668269, 2836312, 3029251, 3234878, 3462955, 3700842, 3938542, 4177612, 4431403, 4717115, 5034298, 5361589, 5704378, 6056877, 6418318, 6797688, 7232142, 7739069, 8390832, 9257365, 10446274, 12041248, 14232884, 17330784, 21703925, 27854064, 36335572, 47292533, 59753637, 72109781, 83450461, 92177245, 97529562, 101843973, 106436132, 110349657, 112102481, 110885985, 105457268, 95795284, 85041611, 78966725, 80069946, 85701610, 93001572, 99956886, 104364009, 106866301, 109464645, 111993756, 112873769, 110803768]
16867A10803768o271133j1972897j6823529j7539715j3366538q652178n594396
16860C0583382l832854k740648j976492j458868j139446r21383p51144o62930
16852A7099617o92845q10785r59156j038813j018969r27046q34902p51394o60685
16843I405022n68021m99860m45416m13156l99502l93885m02263l94197l69405
16834E519317l36840k90763k67389k47822k25883k05525j93100j79333j61108
16825C411554j37462j47657j39024j23519j12231r7803q2605p8049p5527n8731
16815B358946o6721m9553n0828m2360m7211m8879n6418o3709n9245m3644n4855
16804A775523o5975q0610j00467r8052p9629o2484l8286j6156j3678j2J491p269
$$ y = [110803768, 104532635, 92559738, 75736209, 58196494, 44829956, 36177778, 30583382, 26750528, 24009880, 22033388, 20574520, 19435074, 18513691, 17762547, 17099617, 16406772, 15595987, 14636831, 13598018, 12579049, 11652003, 10817101, 10065707, 9405022, 8837001, 8337141, 7891725, 7478569, 7079067, 6685182, 6282919, 5888722, 5519317, 5182477, 4891714, 4624325, 4376503, 4150620, 3945095, 3751995, 3572662, 3411554, 3274092, 3126435, 2987411, 2863892, 2751661, 2653858, 2571253, 2493204, 2417677, 2358946, 2292225, 2242672, 2191844, 2149484, 2102273, 2053394, 1996976, 1933267, 1874022, 1830378, 1775523, 1709548, 1628938, 1528471, 1430419, 1350790, 1288306, 1250020, 1233864, 1220186, 1220174, 1221665, 1214396]
16792A214396j9528j6096l1853n5566p5763j02504r3129p2644o2498n2126m3802
16781E88887l7045j9946j2154k1594k2219o576o241k1426j8873n907j1700p543
16769C97663j6277r715o288J0344J8465J4015K1933J0387p661r909m070j1881
16757D07006q959j6053j4257Q81q425j1133Q0J3734K1830J6639Q382q135j3244
16744C88346j0639l76L389j634j0869j4139j8351l775m130j990j2846o412L840
16731C10414O455O692P753Q74m461q38l722j66o028j2254p023L598m749m621K117
16716B94041K679j819L69K636q686r904Q303j769j2055o047j4839k1183M728J172
16702B37626P112r003j9926J985K68m307o403r242m846o076l899j0340J480J1074
$$ y = [1214396, 1194868, 1178772, 1146919, 1091353, 1015590, 913086, 819957, 747313, 684815, 632689, 588887, 551842, 531896, 519742, 498148, 475929, 469353, 463112, 441686, 422813, 416906, 405206, 397663, 381386, 371671, 365383, 375727, 394192, 408207, 430140, 440527, 432866, 422957, 418887, 407006, 398047, 381994, 367737, 368618, 360193, 349060, 349140, 362874, 384704, 401343, 409725, 401590, 388346, 377707, 377331, 380720, 379086, 368217, 354078, 335727, 331952, 327822, 325832, 312986, 306574, 310414, 316869, 323561, 331314, 332188, 327727, 326889, 323167, 323001, 316973, 304719, 297696, 301294, 296545, 291924, 294041, 296720, 294901, 295270, 297906, 289220, 279316, 287619, 285850, 273795, 267748, 252909, 231726, 236454, 237626, 244738, 235735, 215809, 217794, 218062, 213755, 207352, 198110, 193264, 187188, 183289, 172949, 174429, 185503]
16688A85503k673o939J483l493j4150m937q63j0642n785o899r08Q40l881m616
16674A22040l900l105Q167K474j3408m897K010k678J0300N440j5950j1132r866
16661H5495k82m973N77P379J455q324J602N067N569j2057P069O515L987j3387
16647H5692k111M856J7959P037n526j2776L285L981P075n549q198q340O455J1884
16633A05724Q128p969j3701P76Q782k20J615K684J709l635n67n993q33P268Q262
16618A12030q713m6j424O174K230j3140m741j282M377J0083q074M31N74J374m671
16603I5182j964N171J637k07J0081J7831R187l816k821O355N526j455m648M909
16589A40968R906R24R420J3691J5636J3822J2646P925N393K460J0585J5854K3697
$$ y = [185503, 182830, 175891, 177374, 173881, 159731, 154794, 153931, 143289, 137504, 130605, 129697, 130537, 126656, 122040, 118140, 115035, 123202, 125676, 112268, 107371, 109381, 106703, 117003, 122443, 106493, 95361, 85495, 85213, 80240, 80817, 88196, 89651, 81327, 82929, 87996, 93565, 81508, 88577, 95092, 99079, 85692, 83581, 88437, 106396, 113433, 107907, 95131, 98416, 102397, 109472, 103923, 95725, 87385, 93840, 105724, 113852, 105883, 92182, 92958, 101740, 101520, 103135, 105819, 107528, 103893, 103326, 97333, 96500, 103768, 112030, 103317, 103271, 101847, 108021, 110251, 97111, 92370, 91088, 95465, 105548, 97474, 97905, 98479, 99853, 95182, 93218, 98389, 100026, 99819, 109900, 127731, 136918, 133102, 130281, 136636, 142162, 140707, 136059, 140968, 150874, 151798, 161218, 174909, 190545, 204367, 217013, 224938, 230331, 232791, 243376, 259230, 282927]
16576B82927M0382O8518Q7964J07379J25868J39109J27807J09412Q7373O2385
16566A239124L2435p852m4063p6136q6547p2335j6287M0839O1323P3818N1566
16555A195885L3329K603l0650q1886j37681j66942j71986j34728q1792n5626n4018
16544C16508l5932k6258j2613r247j7637j4801r821j107k978p289N538m963j3975
16531A65425p506j2378j0659o416J007p216j1040P768J678J367K889k079J937
16518A24777q084j2074l201J4803J6785J2948J3224J1033J4065J194o39N578q903
16505A81506p234o357r789p666j901j601L657J6027Q717j2183r858q941q960p646
16491A27771k3692j0662m940j2664j3000k910M465o07q741j2255n579o249o977
$$ y = [282927, 323309, 391827, 479791, 587170, 713038, 852147, 979954, 1089366, 1176739, 1239124, 1271559, 1263707, 1219644, 1143508, 1056961, 984626, 968339, 1009178, 1070501, 1144319, 1195885, 1229214, 1231817, 1201167, 1119281, 981600, 814658, 642672, 507944, 426152, 370526, 316508, 280576, 254318, 241705, 232458, 214821, 200020, 190199, 189092, 186114, 178825, 184363, 179400, 165425, 157919, 145541, 134882, 128466, 129473, 122257, 111217, 118985, 120663, 122030, 124919, 122840, 124777, 116693, 104619, 101418, 116221, 133006, 145954, 159178, 170211, 184276, 185470, 184831, 190409, 181506, 174272, 167915, 158126, 150460, 148559, 146958, 150615, 166642, 175359, 163176, 153318, 144377, 135417, 127771, 104079, 93417, 88477, 75813, 62813, 59903, 64368, 63761, 55020, 42765, 37186, 30937, 23960]
16478B3960K855p48R944J965J339m705l614K331j5614m341M261j602r36p430k205
16463E460P983K998q188M253J472N459J314j3847j1221n821Q806N731J928K174
16449H501L945M437l27n992o852l27O19q83j1551o914j971o68Jm654j1844k36
16433c4716K511n551O786J1750j356j283P798N050k917J2452L830o77m522j291
16419b136j585j621n834N233K825j2589o209J1215J1527N499j929M707Q471K190
16405A9764M069k233j3054l293k260Q460O276o975r963n032N722N711l267R94
16391D919R121Q961r19J387N9m943q385j0623J057N989P637k714n235r421j20
16376c230L474N778J6032M526l478j1316o662m563N09J192o028N226R695J0186
$$ y = [23960, 26815, 26067, 36011, 37976, 39315, 34610, 30996, 33327, 17713, 13372, 17633, 16031, 15095, 7665, 5460, 13443, 16441, 8253, 12506, 13978, 19437, 20751, 6904, -4317, -10138, -1332, 4399, 6327, 8501, 12446, 16883, 16556, 10564, 3712, 3385, 4004, 3121, -8430, -15344, -17315, -17983, -17982, -22636, -34480, -34716, -32205, -37756, -30970, -19220, -20576, -21859, -14061, -9011, -11928, 524, 4354, 3677, -845, -2136, -3721, -5342, -11176, -5943, -3118, -15707, -21916, -10701, 826, 6325, 4396, 9103, 17574, 19764, 23833, 21600, 8546, 5253, 2993, 11453, 17729, 10754, 791, -4241, 1481, 7192, 3925, 4919, 14040, 23001, 22082, 23469, 23528, 18585, 10200, -423, 634, 6623, 14260, 11546, 6311, -3110, -3230, 244, 6022, 22054, 26580, 23102, 11786, 5124, 561, 1070, 2262, -3766, 1460, 11155, 21341]
16362B1341K012n207o649l657n696N686m655M024J620M767R034O117o144N53q489
16347A4657R354R010J8304J614n614K414J3888J0905O272J7530K8928L1432M1560
16334B00254N8000O6930O2690O8033L3331K0993K8280K7774J4292O252K431k1615
16322E67645m6998m7021l2390L049K3990L7994L7264J5013P108J1259R912K164
16310E88989j4819m0313o4410q6313q4447p1832m4073k1527j4917j2838j6236
16299A17264j2619p66M018q294J209p078r542m394n790n298l660N988r086j3663
16285D8289j3129j0769m579Q090J3587J271J988k828j6308k402J840P156N063
16272C7269l136j4488p70J225m026Q055N815L581k276j3197n596l531O315J2662
$$ y = [21341, 23353, 18146, 11497, 7840, 2144, 7830, 3175, 7199, 8819, 13586, 22620, 28737, 22593, 23146, 14657, 24011, 33021, 51325, 52939, 47325, 49739, 63627, 74532, 80804, 98334, 127262, 158694, 200254, 258254, 325184, 387874, 455907, 489238, 510231, 538511, 566285, 580577, 586829, 589260, 567645, 520647, 473626, 441236, 444285, 468275, 506269, 543533, 558546, 565654, 576913, 586825, 588989, 574170, 533857, 469447, 383134, 298687, 226855, 182782, 161255, 146338, 133500, 117264, 104645, 103879, 107897, 99603, 100812, 93734, 84192, 79798, 74008, 68710, 65050, 71038, 61952, 48289, 35160, 24391, 19812, 27902, 41489, 42760, 44748, 41920, 25612, 23210, 25050, 32206, 37269, 34133, 19645, 18875, 20100, 16074, 24129, 29944, 33525, 31249, 18052, 12456, 8925, 15240, 27902]
16258B7902M489j323j10K022m47J1760J1447m218p053N979K4571J0567J741j056
16244H6271O825P076M331p97k083j4281l465n197J924j3909j5805l38K325L861
16230E6738p843j0174J149Q236o297K015j106o869n652l831J0125Q937P034l508
16216D8954M61J0995M364J187O745L735Q122J4958K205j995J5935J1978m009p252
16202A16383j3742p469L494j855l993j2550R93L216r665j3551o629J2707L04m81
16188F7162m618L136K1711L911n507M881M099L01l806m778k179o240m210N540
16174G9403j7550j9596o535J3204N380j1434p695q522k942J292J21N74K78J083
16160B7061M570P95Q061M324l730l205K606J3934O286j24R314P336p25O251R144
$$ y = [27902, 32391, 31068, 30958, 32980, 32533, 44293, 55740, 51522, 44469, 50448, 75019, 85586, 87327, 86271, 93096, 100172, 104503, 103706, 101623, 87342, 83877, 78680, 80604, 66695, 50890, 50552, 52877, 56738, 48895, 38721, 39870, 48106, 41809, 43824, 42718, 35849, 30197, 26366, 36491, 45428, 52462, 48954, 49415, 60410, 64774, 65961, 72706, 76441, 84563, 99521, 101726, 99731, 115666, 127644, 123635, 116383, 102641, 95172, 98666, 96811, 92818, 80268, 81261, 84477, 74812, 61261, 54632, 67339, 67643, 67162, 62544, 65680, 87391, 91302, 85795, 90676, 94775, 95076, 91270, 86492, 84313, 78073, 73863, 79403, 61853, 42257, 35722, 48926, 54306, 42872, 35177, 26655, 23713, 25005, 25126, 25700, 25978, 27061, 31631, 32426, 40487, 44811, 41081, 37876, 40482, 54416, 60702, 60578, 69892, 77228, 76503, 82754, 91898]
16145I1898r208l495q43J029P006l782j7979j6175n978j1727r777m462N943l897
16131A8553L60p373r075o807m281O718K80O608Q407L515N604m639r245q935j7608
16116a7918J132P414k492m360m79J1512M848m04l954p521M135O508L228o216n684
16101a0251r31L220k207N890j615n299L785m663k403l387K738J456R480K815n039
16086f411J953q719J325k97Q832j923r582k214K399K127L173L149M573m610m350
16071a0575J41n752Q392L672k461J975l036N423N015n443J052J55l103j328L393
16056b480J0286j435l507L236j088N052j139L920q400R98k96K640k842k348m782
16041b185N027n99o13l168o239k347J836L03k432N004o065N293m037K475K158
$$ y = [91898, 82690, 79195, 78352, 79381, 86387, 82605, 64626, 48451, 42473, 30746, 20969, 16507, 22450, 18553, 18913, 11540, 2465, -4342, -8623, -1905, -1625, 4983, 13390, 16905, 22509, 17870, 8625, -310, -17918, -16786, -9372, -11864, -16224, -16703, -5191, -343, -747, -4701, -12222, -8087, -1579, 1649, -4567, -10251, -11182, -7962, -10169, -4279, -5894, -11193, -7408, -12071, -14474, -17861, -15123, -13667, -4187, -1372, -6411, -4458, -13177, -11852, -12149, -3317, -5240, -14822, -17036, -14637, -12510, -9337, -6188, -1615, -6225, -10575, -10434, -16186, -7794, -4122, -6583, -4608, -7644, -2221, 2794, -2649, -1597, -1442, -4545, -5873, -2480, 7806, 6371, 2864, 6100, 5012, 10064, 8925, 12845, 4445, 5443, 5147, 7787, 4945, 2597, -2185, 2842, 2243, 1630, -1538, -7777, -10124, -8288, -7985, -10417, -5413, -11478, -6185, -10222, -7747, -5589]
16026e589o770K996K616J776L403N777M427m166j2116M186N468N676R234M300
16012B1218L63k985q320k060R01q428j1885k855J7426J631o823O279J3539p92
15998A7209o070l405M662N001N137l66J920l093O157o822k435M023m361K973J695
15983B2225K576l767p56q873l770N18N17j2041J765J4968k905q550m995M039N163
15968F114m376o410N776M407o353o834J668L079J3400L682m354k356M728n040
15954G131j0106P913O363J2602P457R141j320r920k045K1369O304r224k185Q137
15940E1617J3300N103K880l436j8787n808k102n482O748R925n963m497q851j172
15926C3475j183M125K367r416q901m90n773L713j232k05J4765M844r245r01j729
$$ y = [-5589, -12359, -9363, -6747, -4971, -1568, 4209, 8636, 4470, -7646, -3460, 2008, 7684, 16918, 21218, 21581, 18596, 10276, 8216, 9117, 689, -11196, -14051, 3375, 5006, -1817, 4462, 18001, 17209, 11139, 7734, 12396, 17397, 22534, 22168, 24088, 20995, 27152, 20330, 17895, 21918, 17557, 20530, 22225, 24801, 21034, 20278, 11405, 7635, 8153, 8670, -3371, -1606, 13362, 10457, 1907, -3088, 951, 6114, 1738, -4672, 1104, 5511, -842, -7676, -6008, -2929, 10471, 14153, 9799, 7443, 12171, 7131, -2975, 4938, 11301, 23903, 31360, 40501, 39181, 29261, 27216, 48585, 54889, 45665, 43480, 51617, 64917, 70020, 72900, 69464, 50677, 44869, 42767, 37285, 44033, 53958, 47995, 43498, 34647, 33475, 32292, 36417, 38784, 29368, 20467, 19977, 14204, 17917, 16685, 16480, 31245, 36089, 26844, 25943, 24214]
15911B4214p604m049j0215j7606j2446J0260J6986k496q670q705Q711N787Q836
15898C003R603K085j043R847L407l075m191q249p021m480J8887N619p11k696k449
15883A8536Q625m732j039J1532m275j6227m277r61r307o159n388J982M842m835
15869a1683R82J707j094j684J0914J0786L321j344Q338o151p024j3889j847l941
15855a2609P307j828q428o181P317Q493L324r155m155L799k03R04P770J3667J879
15840A1901j1858j0207p96n362m563j243p868K402P325K067O756Q601J0512m228
15826C439j0562p197l107R308l276l688k611m763k180J713N068n092o156J118
15812b7986P138M499q284j332R289Q510l704r072r67l657J714P708J0411o364
$$ y = [24214, 16610, 12561, 2346, -15260, -27706, -17446, -460, -2956, -11626, -20331, -11620, -5833, 3003, 12606, 14691, 13648, 23495, 26902, 23827, 19636, 11387, 4366, -114, 18773, 24392, 23681, 20985, 18536, 27161, 22429, 21390, 32922, 28647, 12420, 8143, 7182, -2125, -8284, -13672, -11690, -6848, -11683, -10701, -8994, -10088, -11772, -858, 9928, 13249, 11905, 20243, 14092, 7068, -6821, -8668, -12609, -5302, -7130, -15558, -21739, -14422, -5929, -2605, -11760, -15915, -12116, -12319, -11415, -3645, 10022, 11901, 43, -10164, -10960, -16322, -20885, -22128, -29996, -27594, -20269, -18202, -11446, -2845, 7667, 3439, -7123, -14320, -17427, -8119, -11395, -15083, -17694, -22457, -24637, -22924, -17856, -22948, -29104, -27986, -20848, -16349, -24633, -25965, -16676, -8166, -11870, -20942, -21909, -25566, -23852, -16144, -5733, -12097]
15798a2097k160K250n721K860M552j4258M779K358m738o85O11J315r493q79P093
15783b4213J0111O73k409P063k545O821K566o297j2145n902L986M331N217M070
15769h673K344M140J498p130n315n035r32J44l664N190J1108q295k471K138r829
15754b4782k194K687J767P619k572J915O211M727o057l995N077M994r611J729
15740a2485L117M362M962j0351j1591M515l757p163O975J7370k986L415P893j0360
15726f084n639L259j4393j1706o545N807J7628J9752j665j4571q260k20M460O229
15712a1948n173r30n14l79L531k348L633N956l821L849k620m542n055J1432k16
15697i145p440J159j486J803L337j880q568N509N631k199l555K323J549J483j368
$$ y = [-12097, -14257, -12007, -17728, -14868, -10316, -24574, -19795, -17437, -22175, -22860, -22249, -20934, -30427, -31306, -24213, -14102, -13429, -15838, -8775, -11320, -4499, -1933, -8230, -20375, -26277, -22291, -17960, -12743, -8673, -6329, -2189, -691, -7821, -13136, -18171, -19103, -18959, -22623, -17433, -6325, -14620, -17091, -14953, -24782, -26976, -24289, -22522, -14903, -17475, -15560, -9349, -4622, -10679, -14674, -9597, -4603, -14214, -12485, -9368, -5006, -44, -10395, -21986, -17471, -21228, -28391, -21416, -4046, -7032, -3617, 4276, -6084, -11723, -8464, -22857, -34563, -41108, -35301, -17673, 2079, 414, -14157, -22417, -22637, -18177, -11948, -17121, -18051, -18565, -18944, -15413, -17761, -14128, -8172, -11993, -8144, -10764, -15306, -20361, -8929, -9145, -16585, -15426, -16912, -15109, -11772, -13652, -22220, -16711, -11080, -13279, -16834, -14511, -12962, -11479, -12847]
15682a2847K299O575m089n70M206q223k014j1006m850P987K298J430O125O249
15668f430L827m261L004O82j439k879j703L952p915J879n868j4974M662J2611
15654a4852N046J693k66n130Q96O417n2m997O808Q48R0m288J084R435k704j2029
15638a2001n906O747j568M283M323L080k11o570J398k209m695j1121l943j828
15624c0221M430l17L012J3714l487K339k710k791L854M340K986o222j881l498
15610a6452M977j303o670q554m941N674K975P881J0301K690j08j175M572K441
15596B308j0930K08M427J437m520n711M361M640J938m852j2105j3686n128R183
15582b8430J0279O669K224m848k56k912m817J3822K746o218K736q770m547J2070
$$ y = [-12847, -10548, -3973, -8062, -8632, -4426, -12649, -14663, -25669, -30519, -22532, -20234, -18804, -12679, -6430, -2603, -6864, -3860, -3178, -4617, -7496, -9199, -5247, -13162, -11283, -17151, -32125, -27463, -14852, -9806, -8113, -8379, -13509, -12613, -6196, -6248, -11245, -4437, -3589, -3499, -7787, -6703, 2732, 28, -12001, -17907, -11160, -12728, -8445, -4122, -1042, -1253, -7823, -6425, -8634, -13329, -24450, -28393, -30221, -25791, -26108, -23096, -9382, -12869, -10530, -13240, -16031, -12177, -7837, -4851, -11073, -12954, -16452, -11475, -12778, -19448, -28002, -32943, -27269, -24294, -16413, -6112, -3422, -3530, -4705, -133, 2308, -8622, -8414, -3987, -2550, -7070, -12781, -8420, -3780, -1842, -6694, -18799, -32485, -37613, -28430, -18151, -11482, -9258, -14106, -14362, -17274, -22091, -8269, -5523, -11741, -9005, -17775, -22322, -10252]
15568a0252Q161m934k398k312j418J417L544Q395K388m912m307Q257q67m368m370
15553g976n541O840J761m276M675J447q472j2851n57L722L201J129n33J6501l5
15538i65J928q509r005O410L452r320p429K129N141j01N338R091N494l149n166
15523d661n201M993r35L944P65j1373M775l702l050R39R986n456j1544K025K795
15508a5700l567n954O678J600J261j866P869M017k0r212r716R6L584P832L572
15493i526J1775q979l607o837o635J0217J1092j4965L319K682o73M186l178n832
15479a6961M74j663O925P788k946r766j600m488o248K57J1365N965K700k153m612
15464a4963P328O182m245m51L38P043R99n630p095M374P904m77m952m633r113
$$ y = [-10252, -2091, -7025, -9423, -11735, -13153, -11736, -8192, 203, 2591, -2321, -6628, 1629, 762, -3606, -7976, -13517, -6677, -4916, -9192, -4517, -3070, -11542, -24393, -24950, -21228, -18027, -16898, -17431, -930, -965, 963, -7546, -16551, -10141, -6689, -16009, -23438, -21309, -16168, -16269, -10931, -1840, 3654, 505, -4661, -9862, -4869, -5804, -1860, -1095, -12468, -7693, -11395, -14445, -13506, -3520, -8976, -20520, -18495, -15700, -19267, -25221, -18543, -16943, -15682, -17548, -9679, -5662, -5682, -14894, -24610, -24514, -20930, -13098, -9526, 2249, -6730, -10337, -17174, -23809, -13592, -2500, -17465, -14146, -11464, -12137, -7951, -11129, -16961, -16487, -18150, -11225, -3437, -6383, -16149, -17749, -22237, -28485, -28228, -16863, -10898, -8198, -10351, -14963, -7635, -1453, -5698, -6149, -5811, 1232, 2231, -3399, -10494, -6120, 1784, 1307, -3645, -8278, -17391]
15449a7391k927M696N50l16P213J514m853n312K1k317r654L045N685K40J787K008
15433a6011J986j76J0857K541m680k013N248L92m802p62r593m268J4106L69l467
15418a0273m110J033J877J3167M692l980j5807r957J877R026O317O141p622j145
15404h764j106j3030m413Q159q97K131O510j64j1850Q624P280M800q069O102l670
15389h357m565P93j142n201k264Q550J724m629K995l482o079N04O999J771P27
15374a1656p044Q39M640J0544m758m500j0558k661L625p183M355J4772J0169j144
15360e60O54j227r786j1641K047M679m224m065M88L84J102j334n365J433O575
15345b0840M551N715p578J707N593J4941J3150j1263j4184O623M659M775p321
$$ y = [-17391, -20318, -15622, -15072, -15388, -8175, -6661, -11514, -16826, -16805, -19122, -28776, -25731, -20046, -19806, -18019, -16011, -14025, -14201, -3344, -803, -5483, -7496, -2248, -1856, -6658, -7420, -17013, -21281, -7175, -6806, -10273, -14383, -13350, -11473, 1694, 6386, 2406, -13401, -23358, -21481, -12455, -6138, 3, -7619, -8764, -9870, -22900, -27313, -19154, -20051, -17920, -11410, -11574, -23424, -14800, -7520, -2720, -10789, -4687, -8357, -12922, -12129, -13271, -18472, -20736, -12186, -10462, -15091, -12096, -15578, -21657, -21153, -14154, -12383, -11656, -18700, -17861, -13221, -2677, -7435, -11935, -22493, -25154, -21529, -28712, -24357, -9585, 584, -560, 94, -1133, -10919, -22560, -20513, -15834, -20058, -24123, -23635, -23251, -22149, -23483, -28848, -27415, -20840, -16289, -10574, -18152, -16445, -10852, 4089, 17239, 5976, -8208, -1585, 3074, 7849, 528]
15332E28j1124l073P571R478n336j699p467m167J0700J902K342o501q805j415
15318a7066R429O531K807N628j1715l989n035N011p7j1887j0189O959K368l264
15304b4489O948K735K263j82M840P529M171n219j0151n98P340k936J0220L049
15290E520o331Q362L191P856J101K054p742l144O189n921q849L446k095l941k007
15275b311j135m170k597k889L604O590Q541K650m345l369J922J269K514N039j909
15260I404k78R22K879q289l58J0440P795j815r580j2434o745J5466J3028p209
15246A3226o801m469j854M685P968n251p908q65R156k097l120o360L237j88M11
15231b30Q405P929l140M796p268m817M311K028R474L619J4314N486l974k976p933
$$ y = [528, -10596, -13669, -6098, 3380, -1956, -3655, -11122, -15289, -4589, -2687, -345, -6846, -15651, -17066, -7637, -1106, 1701, 7329, -4386, -8375, -13410, -8399, -8476, -20363, -30552, -23593, -21225, -24489, -17541, -14806, -12543, -12725, -7885, -356, 3815, -1404, -11555, -12153, -4813, -7749, 2471, 5520, -811, 7551, 10742, 18598, 19699, 21753, 14011, 10867, 17056, 11135, 2286, 5732, 3637, -304, -2311, -3446, -7616, -10213, -13102, -9498, -2908, 5633, 8283, 3938, 569, 2491, 3760, 6274, 11313, 9404, 9126, 10048, 12927, 4638, 4280, 14720, 22515, 20700, 11120, -1314, -8059, 7407, 20435, 13226, 6425, 1956, 102, 4787, 12755, 7504, -404, -1269, 7887, 5790, 2670, -3690, -453, -641, -230, 8175, 16104, 12964, 17760, 10492, 5675, 9986, 12014, 21488, 25107, 39421, 44907, 40933, 37957, 30024]
15216C0024p636J069N868L766j1118j2779N799N614J419j0355n488R5N379Kl429
15201H230n52p96K102n302M223J4426M277j937j2384j3010o385K186R314l238
15187A154l680j285j172l175m740p499L531J1302M698J2745K313r768l640J472
15173B256J729k31M459l783j2152j800J434p307K747Q425m723J4143N758q730
15159B225o438L250k62K406N206J819L148n765N89l520m270p191o330l523J5030
15144c626Q156k439k549k857j0526J3416K958K366n533o138L933L620L213o259
15130b265n414J3414j792o419O62L136k369k548l411k65p46O970O811k153n548
15115a937j0926J574J2282k907o323l986N60J1938P854o549j3646L47L997R5M869
$$ y = [30024, 22388, 23457, 29325, 33091, 21973, 9194, 14993, 20607, 22026, 11671, 6183, 6278, 11657, 11659, 8230, 7678, 6882, 8984, 3682, 7905, 22331, 26608, 24671, 12287, -723, -7108, -4922, 4392, 1154, -2526, -3811, -4983, -8158, -12898, -20397, -16866, -5564, -866, 11879, 14192, 4424, 784, 2256, 3985, 3754, 8213, 4430, -7722, -9522, -8088, -15395, -12648, -4223, -8946, 5197, 10955, 2225, -4213, -963, -1225, 1181, 6387, 8206, 11354, 5589, 6178, 2658, -1612, -8803, -15133, -18656, -3626, 4530, 2091, -458, -3315, -13841, -425, 2533, 4899, -634, -6772, -2839, 781, 3994, -2265, -7679, 5735, 3943, -2476, -1814, 1322, -1047, -3595, -7006, -7271, -8017, -1047, 5764, 3611, -1937, -12863, -11289, 993, -1914, -8237, -12223, -11663, 275, 8129, 1580, -12066, -11719, -7722, -7627, -2758]
15100b758J861P85j836J343o302l764P573P288l769q745j0709K22o724j0096K720
15085c2911J2693n284j367J611K567K768L260k856Q668M396j167Q827r6r065j1123
15070a9079O842J0915O671R69o278q596Q854J0118J627o097r810j0996j775R862
15056f773J0992R272j511r693j1004j1336m966Q057K191N043r81n034J0257O568
15042A082J583j1969j972J0381q751j1664k185P568J3007k778j1439l212M930
15029a5419k64l708o225Q289P794N037K73N309N359l170m165n348J41j440m039
15014a1576l661R697R476J1015k388j2529J99L718K368p504m618N237J160K98
15000H92L705n731q44l078J685j212K62p485n653L897K074J0213O739o104j4133
$$ y = [-2758, -897, -112, -1948, -605, -6907, -10671, -3098, 4190, 421, -8324, -19033, -18811, -25535, -35631, -32911, -20218, -25502, -26869, -25258, -22691, -19923, -16663, -19519, -10851, -6455, -7622, 1205, 1109, -7956, -19079, -12237, -1322, 5349, 6318, 40, -8556, 298, 10416, 12043, 5946, -3864, -14860, -16635, -6773, 4219, 13491, 11980, 2287, -8717, -20053, -25019, -16962, -14771, -9728, -10709, -15743, -5486, 1082, 2665, -9304, -11276, -895, -9646, -21310, -23495, -15927, -2920, -5698, -17137, -20349, -15419, -15683, -19391, -25616, -17327, -9533, -4496, -4223, 1086, 6445, 3275, -890, -6238, -6097, -7537, -11576, -15237, -5540, 3936, 14951, 12563, 34, 233, 3951, 6319, -1185, -5803, -566, 594, 892, 4597, -1134, -1978, -5056, -3371, -4583, -4321, -11806, -17459, -13562, -11488, -1275, 5464, -640, -14773]
14985a4773P481J5951R77N63J1153K782j0979l962J796N851R76j492l018j3519
14971b13j252k722O136j32N599P116R83l952k276k02M487K087K358K100l559q101
14955H457P347O595l686l876m399j1621M206J0463p93J029o352j96q43O498Q728
14940B1557Q375j72j308l246j926L079P591R635J1406N611k690k23R124N473k154
14925G0132Q528J5614J1836M030j102n817K971K296J889q654j5197r718j1235
14912F5573o881q296n515m373p812J929o171l105R14K194J2941M863o748l829
14898C5684m95M616Q62J616N680O398M528k377J891N838J2798J4469J7513J1275
14884A20296J3448P933J3189N479R668J627j2011j1947m395L314j570j1487j9107
$$ y = [-14773, -7292, 8659, 9636, 10199, 21352, 24134, 13155, 9193, 10989, 16840, 17816, 16324, 13306, -213, -1465, -4187, 1949, 1817, 7416, 14532, 15515, 11563, 9287, 9085, 13572, 15659, 18017, 20117, 16558, 8457, 15804, 22399, 18713, 14837, 10438, -1183, 3023, 13486, 12693, 13722, 7370, 7174, 6331, 12829, 21557, 29932, 29760, 28452, 25206, 23280, 26359, 33950, 43585, 54991, 60602, 57912, 57689, 66813, 72286, 70132, 78660, 94274, 106110, 110140, 109038, 103221, 106192, 108488, 110377, 101723, 86526, 76808, 65573, 58692, 50396, 44881, 40508, 32696, 34625, 28454, 25349, 26263, 28457, 41398, 46261, 39513, 35684, 35189, 39805, 40667, 42283, 47963, 54361, 58889, 56512, 58403, 64241, 77039, 91508, 109021, 120296, 133744, 141677, 154866, 160345, 170013, 171640, 159629, 147682, 143287, 146601, 145031, 133544, 114437]
14871A14437k2334j8284l490K233J856r631q502j123M767m216m391M559j3210
14858D2671p640J359l160n653n00K914K019O829P818P059P288J3554L324M333
14844H2215P51P000J1299P392P074j132m044k704l902o07p969p024n064k027j0452
14829G0806j0404o040l824m535m974m982M84L436j3069o676L519k105l337R217
14815B7516J4272K261N900j1663n779n83n175M890j32J738J743j066q388R342
14801C4876J1002M490Q15N810o664p784k250M058o817j1234m408j268Q53J58O928
14786B8565J1855n422j572K376l761n016o523j3392l342L872r776j0844P247n06
14772f239n679O246J6434M134p379j0036k204k12o68Q972J2622K026N13p32O599
$$ y = [114437, 92103, 73819, 70329, 72562, 74418, 64787, 56285, 55162, 59929, 55713, 51322, 55881, 42671, 35031, 36390, 33230, 27577, 27077, 29991, 32010, 38839, 46657, 53716, 61004, 74558, 77882, 82215, 82966, 89966, 101265, 108657, 115731, 114599, 110555, 107851, 103949, 103342, 95373, 88349, 83285, 81258, 70806, 60402, 54362, 50538, 46003, 41029, 36047, 36531, 39967, 26898, 20222, 23741, 21636, 18299, 27516, 41788, 44049, 49949, 38286, 32507, 31924, 26749, 31639, 31507, 33245, 34988, 33922, 25534, 34876, 45878, 50368, 51183, 56993, 50329, 42545, 40295, 44353, 37536, 26302, 21894, 20626, 21479, 21637, 28565, 40420, 34998, 33426, 35802, 32041, 27025, 20502, 7110, 3768, 7640, -2136, -12980, -5733, -6239, -11918, -5672, 10762, 14896, 7517, -2519, -4723, -4935, -5603, 3369, 15991, 18017, 18530, 17798, 24397]
14757B4397L893n24j380r991K442M054j4506o085k256N075M929N528R176j687
14743B3065N899j395o01M479j5484j0188l75r28m200L147J876k08J0468N516J867
14728B2938M04q958k072J470j192k850n043j539k685k790p675l823J679L015P08
14713h413j570M776N522N281R39M519N357j360n111l940o894K534P019J206m476
14698E389k636N35N759l157k840k990q032N014p77O831k140m953n203K416J1044
14683D260J0261J60L399k21P345J0537R316k170j0059J390P712L666J764m421
14669D2939m666o633k321J436N824K122K462m169m944P53M561M637M974P184P051
14654F1210j506K344O352K675P19m717o753M074k920j1889J165p491q225j387
$$ y = [24397, 28290, 27766, 26386, 16395, 18837, 22891, 8385, 2300, 44, 5119, 10048, 15576, 24752, 23065, 28964, 27569, 26968, 31447, 15963, 5775, 5400, 4472, 272, 3419, 5295, 5087, 15555, 21071, 22938, 23342, 14384, 12312, 13782, 12590, 9740, 4697, 3158, 473, -2317, -9992, -13815, -12136, -9121, -8413, -9983, -5207, 315, 5596, 6535, 11054, 16411, 15051, 9940, 6000, -894, 1640, 8659, 9865, 5389, 2753, 3288, 9047, 5890, 3050, 60, -7972, -2958, -3735, 3096, 956, -3997, -9200, -6784, 4260, 14521, 14681, 18080, 17859, 25204, 35741, 45057, 42887, 32828, 34218, 41930, 45596, 47360, 42939, 38273, 31640, 29319, 30755, 36579, 38701, 41163, 36994, 32050, 32803, 37364, 42001, 46975, 54159, 61210, 59704, 62048, 68400, 71075, 71794, 67077, 60324, 64398, 61478, 49589, 50754, 43263, 35038, 33651]
14640C3651K785n123M368J0229L649m491n065j949o696j0194J451J7981R982J849
14626E2427n450j866m06p422j2291l373L606j408q106p157M634l461q131Q899
14612A0495Q906n604p541m57O1j572M950J1263m29m352k472o468K091m573p295
14597b997J0363k484k459p45L98J710K864j0305K873O792M255J699O599p22Q447
14582B6288K17p068j94N699k514J574M874n562o979p117p415R932J776r684N953
14567I780N426j982m172r161r768N751P82J318N353O471P454m198j372M521O992
14552B3195J2496L043r681L208O38k836m877l157n85K375J331M713q443n884n52
14537A4984j308J0710M798N560M62q618L367m960n216k535k926l418N626R627
$$ y = [33651, 36436, 31313, 35681, 45910, 49559, 45068, 40003, 38054, 31358, 21164, 22615, 40596, 50578, 52427, 46977, 45111, 44705, 37283, 24992, 21619, 25225, 23817, 15711, 8554, 13188, 9727, 1596, 10495, 19401, 13797, 6256, 5799, 5860, 4288, 9238, 20501, 20072, 15720, 13248, 6780, 8871, 4298, -2997, 7366, 4882, 2423, 1678, 2076, 3786, 6650, -3655, -782, 6010, 10265, 11964, 18563, 17841, 26288, 26505, 19437, 19243, 24942, 22428, 24002, 28876, 23314, 16335, 9218, 1803, 11735, 13511, 3827, 9780, 15206, 13224, 9052, -109, -9877, -4126, -3344, -2026, 3327, 9798, 17252, 13054, 11682, 16203, 23195, 35691, 38734, 29053, 32261, 32899, 30063, 25186, 22029, 21444, 23819, 25150, 29863, 21420, 15536, 14984, 13676, 24386, 29184, 34744, 35206, 26588, 29955, 24995, 19779, 17244, 14318, 10900, 16526, 26153]
14523B6153O370l724p534o529j2972m626l722m352O808P293Q124K375J3751m013
14509B3402K332q563m446l214R220J2070q350j6657j443m450R41P606j603N245
14495A2090P194M118Q896K080M518K225l64L724q4j4024j6154j5070k457J0566
14481G258k03o856o0l109K950M702L942J1397L296Q46j0401q215M635R349R548
14466B9079N009j610j2446j2040q336m645l544j700j772r118n01J1143Q282M135
14452A936j0898m29L03k187J2726J864q359m32m09R408J3288k469J580M675K889
14437B3486N482J752p803L18Q15j3076j956O324J86k796O05P895J0786K758R39
14422C5715K554o06j3494p343l896k946O704p886l280P30j006L820k7m76K447
$$ y = [26153, 32523, 28799, 21265, 14736, 1764, -2862, -6584, -10936, -4128, 3165, 11289, 13664, 27415, 23402, 25734, 17171, 12725, 9511, 18731, 30801, 22451, 5794, 4351, -99, 842, 8448, 6845, 12090, 19284, 23402, 32298, 34378, 38896, 41121, 40757, 44481, 44397, 30373, 14219, -851, -3308, 7258, 7055, 199, 139, -2970, -20, 4682, 8624, 20021, 23317, 24163, 13762, 5547, 10182, 19531, 29079, 34088, 32478, 20032, 7992, -344, -4989, -8533, -10233, -12005, -21123, -21624, -10481, -2199, 1936, -8962, -9391, -9088, -11275, 1451, 3315, -5044, -5476, -5885, 3523, 16811, 14342, 15922, 20597, 23486, 28968, 30720, 22917, 23235, 24050, 10974, 9018, 15342, 15528, 12732, 13337, 21232, 32018, 34776, 35715, 38269, 37663, 24169, 16826, 12930, 9984, 16688, 8802, 5522, 6252, 5246, 9066, 9039, 8563, 11010]
14407A1010l942M95J510k967J476K103L796O477j235j027N238j231K689J423q34
14392B4981r62k255m686N724j080L648O484o025J0251L69p719r826n79o146p482
14377D697m401j36J439j778M910J529k203O056J0118k537j706N52l35P522J48
14362B3875o355O04Q947N759j082M672O065p28O87L244P119n184j6184L35Q807
14347D0581o98n084J1041o920K842m987R52J115J794N077O050M461n546j477o823
14332D2378j0263N719n596k823M329J615p977n641j340n4N972N517N701P117r137
14317C5517m282M682M638J854N747O46k649L238O309L654M428q344j1006n083
14303C9349O506L981O554k523j1293K204K611k843l485l034o253J077Q975Q202
$$ y = [11010, 7068, 7563, 9073, 6106, 7582, 9685, 13481, 19958, 18723, 17696, 22934, 21703, 24392, 25815, 24981, 24019, 21764, 17078, 22802, 21722, 25370, 31854, 25829, 36080, 36449, 28730, 18904, 18325, 12179, 4697, 296, 160, 1599, -179, 4731, 6260, 4057, 10113, 20231, 17694, 15988, 16540, 16205, 23727, 23875, 17520, 18124, 27071, 32830, 31748, 36420, 42485, 41757, 42444, 45688, 52807, 47623, 31439, 31774, 40581, 39883, 34799, 45840, 38920, 41762, 36775, 37727, 38842, 40636, 45713, 51763, 56224, 50678, 49201, 42378, 32115, 37834, 32238, 29415, 33744, 35359, 27382, 21741, 20401, 20347, 26319, 31836, 37537, 44654, 35517, 31235, 35917, 40555, 42409, 48156, 48802, 46153, 49391, 55700, 59354, 63782, 55438, 44432, 39349, 45855, 49836, 56390, 53867, 42574, 44778, 47389, 44546, 41061, 38027, 31774, 32851, 41826, 50028]
14289E0028L945J089L454o921r64j889r129R2j6j327K976J484l015j601L405l622
14273C7989M384J794O000n275j021J850Q688O051M836R158N729l742j3696l916
14259E8829P296l11L754K196k475K865J481L45j884k574j2464k243P814m796N56
14244E8389N527l337n496L229N778m466n083j069p644O066L456n145M893O270
14230F1368O135r25N803l835r177o233J1795O965M00P415J039n588J84m672O137
14215G6811p7j1499l856j568j382N247k272j2199j0675M599L284q136q471l407
14201B6399l823R796K076J915O414l14l790k396J0460j984j8048K245R350K883
14187D1183P489l899m700j286n719q93l57n606M207j170M612l290L437J2162L674
$$ y = [50028, 53973, 55062, 58516, 51595, 50631, 48742, 39613, 39705, 39689, 38362, 41338, 42822, 39807, 38206, 41611, 37989, 42373, 44167, 50167, 44892, 43871, 45721, 54409, 60460, 65296, 74454, 80183, 76441, 62745, 58829, 66125, 65814, 69568, 71764, 69289, 72154, 73635, 73980, 72096, 69522, 57058, 54815, 62629, 57833, 58389, 63916, 60579, 55083, 58312, 64090, 59624, 54541, 53472, 45828, 51894, 55350, 50205, 55098, 61368, 67503, 66578, 72381, 68546, 59369, 53136, 64931, 71896, 72296, 79711, 80750, 75162, 75346, 70674, 76811, 76734, 65235, 61379, 59811, 58429, 63676, 61404, 49205, 38530, 43129, 46413, 38277, 29806, 26399, 22576, 32372, 34448, 36363, 42777, 42463, 38673, 36277, 46737, 44753, 26705, 28950, 38300, 41183, 48672, 44773, 40073, 38787, 33068, 32175, 31818, 26212, 30419, 29249, 33861, 30571, 34008, 46170, 49844]
14172D9844j591m252p238q646j609K69J863N361P76k213J708N948l156j7681r891
14157I492O85J3997L748J093m478o585n849R909Q041l773N04K157k735j4744r769
14142A693Q325J6459j066J856P498J90Q173K725j1086L827L225r475j1851j2699
14128G794N0O285l120R2m498M864M993Q038l051r737N097m023L205o92L970o398
14112A2869k050L283k925l819l407J2046J0354p919j1874J2199p17p744j507Q02
14098I591J538j122k000L080L892N201m442p621K316j550m720l594J452J0077
14084A2098O232j409K239k066j404q955N956P591M966M584j0317m91k009l88j6132
14069D95K918P111k596O091j0165m577R301P16q57J1798L743n762n670R911j648
$$ y = [49844, 48253, 44001, 36763, 28117, 26508, 26777, 28640, 34001, 34777, 32564, 34272, 40220, 37064, 19383, 9492, 10177, 24174, 27922, 29015, 24537, 17952, 12103, 22012, 30053, 26280, 26784, 28941, 26206, 11462, 1693, 10018, 26477, 25411, 27267, 34765, 34955, 43128, 45853, 34767, 38594, 41819, 32344, 20493, 7794, 7844, 14129, 11009, 11101, 6603, 11467, 16460, 24498, 21447, 11710, 16807, 12784, 15989, 15297, 19267, 12869, 10819, 14102, 11177, 7358, 3951, 15997, 26351, 18432, 6558, 18757, 18040, 10296, 8789, 9591, 11129, 10007, 8007, 11087, 14979, 20180, 15738, 8117, 10433, 8883, 4163, 569, 2021, 12098, 18330, 16921, 19160, 17094, 15690, 6735, 12691, 20282, 25248, 29832, 19515, 19024, 17015, 16627, 495, 3413, 10524, 7928, 14019, 3854, -723, 8578, 9294, 8437, 20235, 23978, 18216, 12546, 22457, 20809]
14054B0809K621L650j7826P097J1499o901j2514k063N058J945K601K906N850k822
14040B1910q312K815R473J4962rj8176q896J2256o317q849J194l972J407l048
14026F438J169k865n792j725J075m525R029J056K778O967P931J606j4350n405
14012C387J55L688P238N642O299N023K731J604j1583Q90J0035p301k113m61L015
13997B8249M573J579j0040l398P651N915n180P55Q855O366q513o372o71j798m578
13982B3393N734m06O081L511p517L342O063m991m183l034l485J386P718M133L00
13967C8045L309K190m134n341l494N694n515k858L446j958K458k803q72J0979
13953C9146L411M178J548n218q338j449Q720J0322l451j2157n091J1704N118R42
$$ y = [20809, 23430, 27080, 9254, 16351, 27850, 20949, 8435, 6372, 11430, 13375, 15976, 18882, 24732, 21910, 13598, 16413, 25886, 40848, 40839, 22663, 13767, 26023, 19706, 10857, 12051, 8079, 9486, 6438, 7607, 4742, -1050, -2775, -1700, -6225, 2804, 3860, 6638, 13605, 21536, 23142, 8792, 3387, 3542, 7230, 14468, 20110, 26409, 31432, 34163, 35767, 24184, 25074, 35109, 27808, 25695, 25234, 28249, 32822, 34401, 24361, 20963, 28614, 34529, 29349, 30104, 38959, 45325, 36812, 30440, 29769, 27971, 23393, 29127, 28721, 34802, 38313, 30796, 34138, 40201, 35210, 31027, 27993, 24508, 25894, 33612, 37745, 38045, 41354, 43544, 39410, 34069, 30575, 36269, 30754, 27896, 31342, 29384, 31842, 29039, 28167, 39146, 42557, 46735, 48283, 43065, 34727, 33278, 41998, 52320, 48869, 36712, 31621, 43325, 48443, 49385]
13939D9385n88p273R12O059m871q597p150j066l065j459M74J5567J3171L58j1296
13924D0561j2272j971O513R197J1162L684l616P501j406O416o403k136j255Q33
13910E6808O773O293p941K168P720r62O707P775M145l621m313m438l712n30k170
13895G0702m65N694j650O217P804p488n042Q80m450K441Q884j479K881m924N432
13880H5437J7159L972N406O125Q63P779N342o822J0034O603K31j1716n138o652
13866A18623n362j2217j5637j5542p589N34L899p903j2040l370m200N065J3055
13853E7316M628j07n953k173j577O185Q022q13j1091j0828q281j3879q771p860
13839D818p718K870J4071J4671N954j83M450k68J4265j258n812j81l700J967M930
$$ y = [49385, 48797, 41524, 42436, 48495, 43624, 35027, 27877, 26811, 23746, 22287, 22761, 38328, 51499, 51857, 40561, 28289, 26318, 32831, 42028, 53190, 56874, 53258, 60759, 59353, 65769, 59366, 57230, 55975, 56808, 63581, 69874, 61933, 64101, 71821, 70859, 77566, 85341, 89486, 85865, 81552, 77114, 73402, 72872, 70702, 70237, 75931, 74281, 80498, 88302, 80814, 75772, 76652, 72202, 74643, 83527, 82048, 84929, 80005, 85437, 102596, 106568, 111974, 118099, 118962, 126741, 132083, 125261, 135295, 141898, 142129, 130413, 125275, 118623, 113261, 101044, 85407, 69865, 62276, 62810, 66709, 58806, 46766, 43396, 39196, 44261, 57316, 61944, 61837, 55884, 53711, 52134, 58319, 66341, 65528, 54437, 43609, 35328, 21449, 12678, 4818, -2900, -30, 14041, 28712, 34666, 34483, 38933, 38665, 52930, 51672, 45860, 45679, 41979, 43946, 48876]
13824D8876J5339J3691J1060L243j3158j2291p68l053m110j1846j5807l999J3414
13811D0591O718K668O538k513j9444j2695J95O778J2210P920O120m506k574k729
13797D5277J222o282o762j2987K724Q05K973k169J77o170M974M140j156P023R451
13782D3240R857R908N102q770o100j3382k907M112J0405L454m177j962O456K958
13768E8194J204k777m978p252n374j836k611L766N064N856M116k236o980k4653
13754A9503o838J8049O183j2825m253m636J9k426q024j689M001N568L405m204
13740A1833L444J3113Q001P649q030o720O491J2112L11r042m731o594N283k390
13726C0730pr978n741m977n114J5960J2605J1839J484p652m301q49L39o998J6579
$$ y = [48876, 64215, 77906, 88966, 92209, 79051, 66760, 65992, 62939, 58829, 46983, 31176, 27177, 40591, 47309, 49977, 56515, 54002, 34558, 21863, 22058, 28836, 41046, 48966, 55086, 50580, 48006, 45277, 46499, 40217, 33455, 20468, 23192, 23997, 26970, 24801, 24978, 18808, 23782, 27922, 26766, 33789, 43240, 53097, 63005, 68107, 59337, 53237, 39855, 36948, 41060, 51465, 54919, 50742, 48780, 55236, 58194, 59398, 56621, 51643, 44391, 39017, 37181, 34570, 38336, 43400, 49256, 53372, 51136, 44156, 19503, 12665, 30714, 36897, 24072, 19819, 15183, 15202, 12776, 4752, 3063, 7064, 12632, 16037, 11833, 15277, 28390, 36391, 44040, 36010, 29290, 35781, 47893, 48204, 39162, 34431, 27837, 33120, 30730, 30723, 20745, 15004, 10027, 4913, 20873, 33478, 45317, 46801, 39149, 34848, 33999, 34338, 27340, 43919]
13711D3919N892o864r264p481K195j217n244O600P439m919o342k886q02m583j779
13696A4664L518J2045J0595M862J822j65q360K393L467q666l594Q471L939m8p834
13681C7109r885N3J0235o05k453K113m908n734l961O902P132m874O335N226N995
13666D8680O710p759o005K582K365k403K196p103p504M104O918M169m446P379
13652D9883j898q728m006j093n168p579M552P257R792J252L826o911j9250K297
13638B4226J1681K113l701l638L037L966M937K620O499O410k922p058q026l540
13624C6604L104j4406j1278N151O945J0220o463N08J1208O25l499J476p80m271
13610C5144j7747K716P626P952J1272K990n381k374o895L637O976L857o878k959
$$ y = [43919, 49811, 42947, 33683, 26202, 28397, 27180, 21936, 28536, 35975, 31056, 24714, 21828, 21026, 16443, 14664, 18182, 30227, 40822, 45684, 47506, 47341, 38981, 41374, 44841, 36175, 32581, 41052, 44991, 44943, 37109, 27224, 27277, 37512, 36907, 34454, 36567, 31659, 25925, 21964, 28866, 35998, 31124, 37459, 42685, 48680, 55390, 47631, 41626, 44208, 46573, 44170, 46366, 39263, 31759, 35863, 42781, 46950, 42504, 49883, 47985, 39257, 35251, 34158, 28990, 21411, 25963, 33220, 43012, 44264, 48090, 41179, 21929, 24226, 35907, 38020, 34319, 30681, 33718, 37684, 42621, 45241, 51740, 58150, 55228, 48170, 40144, 36604, 39708, 25302, 14024, 19175, 26120, 36340, 29877, 30385, 41593, 42218, 38719, 40195, 39415, 35144, 17397, 20113, 27739, 35691, 46963, 49953, 44572, 42198, 35303, 38940, 45916, 49773, 42895, 39936]
13596C9936j092j28m869m197J1766o99j742k53o157R128Q031j760K539l87j0529
13581C9587q624r5m52O373N64J0790N858o503k232J2737J5911l182j0718j960
13567E8054K178k951n163k844L423L216M333p149p078m135P079J4990L082K232
13553F9267l212l24n311r027l623M993k4Q314r28n261k431o60K357j166n270m687
13537D3007m464K086L43Q10N89Q640J3493K820m067l926n013L937k825L212O877
13522F5519o112j378N008p130k665n514k863k786j069M579R718n783Q42M016m022
13507E0360p874J243P919J464p432K289L842M996j452M091O504O343l099L092
13493G2286M171O931n50n180n068O1L876L085j988j975J1781K917k934o933L163
$$ y = [39936, 38844, 38716, 33847, 29650, 41416, 40717, 38975, 38722, 32565, 41693, 49724, 47964, 50503, 50116, 39587, 30963, 30868, 30416, 36789, 37353, 48143, 54001, 47498, 45266, 58003, 73914, 70732, 60014, 58054, 60232, 57281, 52118, 49274, 52697, 55913, 60246, 53097, 46019, 41884, 48963, 63953, 67035, 69267, 66055, 65731, 60420, 51393, 47770, 52763, 52739, 61053, 60125, 54864, 52433, 51773, 54130, 52964, 47694, 43007, 38543, 40629, 40972, 41782, 42371, 51011, 64504, 67324, 63257, 59331, 54318, 58255, 55430, 58642, 65519, 59407, 58029, 63037, 55907, 53242, 47728, 44865, 42079, 41010, 45589, 55307, 49524, 50366, 54382, 50360, 42486, 43729, 51648, 53112, 45680, 47969, 51811, 56807, 55355, 59446, 65950, 72293, 69194, 72286, 76457, 83388, 82838, 77658, 72590, 72651, 76527, 79612, 77624, 75649, 87430, 90347, 87413, 80480, 83643]
13478H3643J772l016k538p058l636Q095L508m331m188J515J0171P926N766O4l100
13463I4593r073j459Q814N635j078l807L293m489o088N13P71L562K45m469k762
13448H4201l506Q114j409J3805J7476L55l967K213L766j068M3k259j3800k0621
13434H3343l538J7084J0140N557M892J0349r25k0180k736J944n354J2099k163
13421A10512j0056J206K481N179n593P623l770j3062m957o382m637j728P12l104
13407G4424m735r06J0057J2937N097n328k146n170J97J157J936k944j378j870
13393H1328n70J889J965O827l576j6779J163L013N71j1636j65m62p739l46J859
13378E7342K131N529K236N532N048M417P575R558j2052r097N977N296p180m54
$$ y = [83643, 85415, 82399, 79861, 72803, 69167, 77262, 80770, 76439, 72251, 73766, 83937, 91863, 97629, 97693, 94593, 85520, 84061, 92875, 98510, 97432, 93625, 96918, 92429, 86341, 86854, 87625, 91187, 91432, 86963, 84201, 80695, 88809, 87400, 101205, 118681, 119036, 115069, 117282, 121048, 119980, 120023, 117764, 103964, 83343, 79805, 96889, 107029, 112586, 117478, 127827, 126902, 106722, 103986, 105930, 100576, 112675, 110512, 100456, 101662, 104143, 109322, 103729, 111352, 107582, 94520, 89563, 83181, 78544, 76816, 77528, 74424, 69689, 68783, 78840, 91777, 96874, 91546, 89400, 84230, 84427, 85584, 87520, 84576, 83198, 81328, 80758, 82647, 84612, 91439, 87863, 71084, 72247, 75260, 75831, 64195, 64030, 63568, 55829, 55483, 57342, 59473, 65002, 67238, 72770, 77818, 82235, 89810, 99368, 87316, 78219, 84196, 89492, 82312, 81858]
13364H1858J866K459L825L418J1382Q035j1320m872Q01O4j0492r620o88K695l159
13349G6252K75R245N258m881l608M822K46K888J1028m548o704j157N020O219R935
13334A10290L794J057r69o318J382o944j283k353J462K584O60p702p860Q311K710
13319I8821J929L219J3131M848j576k561N301P365N96j784L74Q927N893j259J664
13304A44888O284Q809j072k832N191j208m714l978M734o138p21q83L117J02J657
13289A53236m419q652r339N480o156k670Q457R248q958J3903J4352j1231r267
13276A43984p681k2893o927J0724m3K812N608J3423j819j0032J517J0838L542
13263A43053J4301K3190J9521K3745J7965K2627K1191K2377K5080L9750L8641
$$ y = [81858, 83724, 86183, 90008, 93426, 104808, 112843, 101523, 96651, 97452, 97516, 87024, 77404, 76716, 79411, 76252, 76527, 85772, 91030, 86149, 82541, 87363, 87609, 90497, 101525, 96977, 90273, 89116, 94136, 100355, 110290, 114084, 115141, 114172, 107854, 109236, 102292, 101009, 98656, 100118, 102702, 103362, 95660, 87800, 96111, 98821, 100750, 103969, 117100, 121948, 120372, 117811, 123112, 130477, 131073, 129289, 129663, 138590, 144483, 143224, 144888, 151172, 159981, 158909, 156077, 161268, 160060, 155346, 151368, 156102, 149964, 149243, 148360, 151477, 151579, 153236, 148817, 140165, 130826, 136306, 130150, 127480, 135937, 145185, 136227, 150130, 164482, 153251, 143984, 136303, 113410, 106483, 117207, 117164, 119976, 125584, 139007, 137188, 127156, 128673, 139511, 143053, 157354, 180544, 200065, 223810, 241775, 264402, 285593, 307970, 333050, 372800, 411441]
13252D11441M7087N7087Q1510J11077J75914K26669K62622K75911K57872K16846
13242B124036J47764O2687K5760N083Q201Q632K8430M3883K8294N654R098l1010
13230B466512p1649j42899k26365k93154l04192k65789k04013j44697q5294n1890
13220F76570l5161k8072l6816m2743k9705k8948k3194j3864j1934k0952j7444
13209C87737j5954r342n307m699l06l837k196q683j6071J726k017j4743j0493
13196B95815K682n100o93J251r999o947J475K168r10P33R717k755j0173j8663
13182B58601r329K09j1866o534J495p762k619m746l866o823M77R11q178M124P977
13167B12071Q96r466r291q100j612J6510O979l622P562J0498P560L759j642l430
$$ y = [411441, 458528, 515615, 597125, 708202, 884116, 1110785, 1373407, 1649318, 1907190, 2124036, 2271800, 2334487, 2360247, 2365330, 2373531, 2382163, 2410593, 2454476, 2482770, 2488424, 2497522, 2466512, 2394863, 2251964, 2025599, 1732445, 1428253, 1162464, 958451, 813754, 728460, 676570, 641409, 613337, 576521, 533778, 504073, 475125, 451931, 438067, 426133, 405181, 387737, 371783, 362441, 357134, 352435, 352129, 348292, 346096, 337413, 321342, 323068, 321051, 306308, 295815, 298497, 293397, 292704, 293955, 283956, 277009, 278484, 280652, 279742, 280475, 290192, 287437, 277264, 258601, 249272, 249481, 237615, 231081, 232576, 224814, 222195, 217449, 213583, 206760, 207237, 208148, 199970, 204094, 212071, 212967, 203501, 194210, 186110, 184498, 201008, 207987, 204365, 211927, 222425, 229985, 233744, 232102, 228672]
13153B28672O154J2270J4384Q411j126j1036o690J492N674k118n350L040M060
13140B57837k12o795l10J531k2Q16L056Q803J6335P189j337n228p945O536J2640
13125B92894q798M564J4927J652j1737k814o948M474J0594l138j2678j5607j4128
13112B53257k3280k9259j7680k1999p602j2086r293j6807j8595j5580r562j8575
13100E2939q474L722n370K313j587K253k871p25Q9L150N383J0975J2296J0940
13086H5033J5615K690O584M197p704N057J1330P163M253J0177O275L439M012J1397
13072A69518J9876K2277J0255J6776J9058K5084K3262L3266N1298O4638P1847
13061E27155Q5448R7203Q6550N6853J7464j6227l2026l6438m2738l9615m2912
$$ y = [228672, 234826, 247096, 261480, 269891, 268765, 257729, 251039, 252531, 258205, 256087, 250737, 253777, 257837, 257625, 250830, 250520, 252051, 252029, 252845, 255901, 264704, 281039, 288228, 286891, 281663, 273718, 280254, 292894, 284096, 288660, 303587, 305239, 293502, 290688, 283740, 288214, 298808, 295670, 282992, 267385, 253257, 229977, 200718, 183038, 161039, 153437, 141351, 132058, 115251, 96656, 81076, 71514, 52939, 44465, 48187, 42817, 45130, 43543, 45796, 42925, 42200, 42289, 45439, 50822, 61797, 74093, 85033, 100648, 103338, 109922, 114119, 106415, 111472, 122802, 129965, 134218, 144395, 150670, 154109, 158121, 169518, 189394, 211671, 221926, 238702, 257760, 282844, 306106, 339372, 390670, 455308, 527155, 612603, 709806, 796356, 853209, 870673, 854446, 822420, 785982, 743244, 703629, 660717]
13050F60717l5965l0020k8905l5776l3434l0722k1311l1282l7038k7512k2929
13039C25823j9378r636K36r536j6501l639r105o724o478j0707r667R38L632L413
13025B32671O148J4749L10M605R744R132J5465J2603O452r82J0959M337R572Q846
13011C44611R725J7420P618J1757O459N603Q911Q557O577n65N010J2299J1165
12998D55147J6015k500r646N000O059l37L120m01q972J0052J0125K751R737J2545
12984E08695L148O752K825q382j1472m565J635O570o485O394J5564k421r852J5571
12970E23977M746n074J321k234l952m246Q603o716r483n325p503j1875j015J5339
12956D96563N221o784k742N740q577p373j2802n519j13L222J5952P269Q036J2249
$$ y = [660717, 624752, 594732, 565827, 530051, 496617, 465895, 444584, 413302, 376264, 348752, 325823, 306445, 296809, 297045, 287509, 271008, 267369, 258264, 251540, 245062, 234355, 224688, 225626, 229258, 232671, 238819, 253568, 253878, 258483, 268227, 277359, 292824, 305427, 311879, 310897, 321856, 326193, 335765, 344611, 354336, 371756, 379374, 391131, 397590, 403193, 412104, 420661, 427238, 426673, 431683, 443982, 455147, 471162, 468662, 459016, 464016, 470075, 469738, 472858, 472457, 463485, 473537, 483662, 486413, 496150, 508695, 511843, 518595, 521420, 513038, 501566, 497001, 498636, 505206, 498721, 505115, 520679, 518258, 508406, 523977, 528723, 523649, 524970, 522736, 518784, 514538, 523141, 516425, 506942, 501617, 494114, 482239, 481224, 496563, 501784, 495000, 492258, 497998, 489421, 482048, 469246, 463727, 463614, 466836, 482788, 490057, 498093, 510342]
12942E10342Q000J085J4762K7174L5445K6579M6902O4901P3787P1249M7979J0911
12930I39116j6210l2409l8713n0681l9101j5603n019N535J1651K3341L3179K9442
12918H44528L8021M4738M5158L8543K6707L6260K5241J5154M5495O0721N6964
12907A277530N0289O2218O6058O7313O2441O3140O0628N7938O6653N7711M1967
12896A933886M7489L7917L0057K0457J8759M0015L2921J5267J9552O397k923L04
12884B200098K1502K5812M3916M2001L4225M0390M3796L8783L6288M6505N3680
12873B626996O3685O0955P3531R4060J01975J27756J39632J44218J55043J51849
12863C739700J52100J62703J48671J46714J52745J52647J47592J38084J26981
$$ y = [510342, 518342, 519427, 534189, 561363, 596808, 623387, 670289, 735190, 808977, 880226, 928205, 939116, 922906, 890497, 851784, 801103, 762002, 746399, 741380, 746915, 758566, 781907, 815086, 844528, 882549, 927287, 972445, 1010988, 1037695, 1073955, 1099196, 1114350, 1159845, 1220566, 1277530, 1327819, 1390037, 1456095, 1523408, 1585849, 1648989, 1709617, 1767555, 1834208, 1891919, 1933886, 1981375, 2019292, 2049349, 2069806, 2088565, 2128580, 2161501, 2176768, 2196320, 2202717, 2199794, 2200098, 2221600, 2247412, 2291328, 2333329, 2367554, 2407944, 2451740, 2490523, 2526811, 2573316, 2626996, 2690681, 2751636, 2825167, 2919227, 3021202, 3148958, 3288590, 3432808, 3587851, 3739700, 3891800, 4054503, 4203174, 4349888, 4502633, 4655280, 4802872, 4940956, 5067937]
12854E067937J16036J01400R3344Q7352R1023R3747R6414R5110R1005P2420P5005
12843F080793Q1606Q9880R7954J29535J48767J75931K20466K61077L22347L83189
12833G991545M57223N39899O09959O71135P40173P95058Q75434R62651J063310
12824A4706387J207189J354350J526924J716287J942921K240087K602680L095898
12816C0392723L812092M814780O256605Q383191J1431006J5772915K1868331K9915744
12808A32647387L9230190M7386384N1057832M8367796L7949175K2822378J0776009
12801C90237151K804007n5412J300653M308364O169248O980080N922898K425846
12793D20092835j523669n076266j0762782k3399524l9667815n2206369n6410025
$$ y = [5067937, 5183973, 5285373, 5378717, 5466069, 5557092, 5650839, 5747253, 5842363, 5933368, 6005788, 6080793, 6162399, 6252279, 6350233, 6479768, 6628535, 6804466, 7024932, 7286009, 7608356, 7991545, 8448768, 8988667, 9598626, 10269761, 11009934, 11804992, 12680426, 13643077, 14706387, 15913576, 17267926, 18794850, 20511137, 22454058, 24694145, 27296825, 30392723, 34204815, 39019595, 45276200, 53659391, 65090397, 80863312, 102731643, 132647387, 171877577, 219263961, 270321793, 318689589, 356638764, 379461142, 390237151, 393041158, 392985746, 394286399, 398594763, 404764011, 411744091, 417666989, 420092835, 418569166, 413492900, 402730118, 379330594, 339662779, 287456410, 231046385]
12786B31046385m9038846l4956671k2720461j4997457j0477459q021154o899410
12779H3934927o516676o394164o148980n680471n109991m533536l984518l503406
12771D2063185l104322k753118k441488k166212j936560j724353j539431j391070
12763B5006631j240692j103173j001339r12349q45370q25208q12435p96244p85403
12754A6684418p65892p64106p63106p51346p25009o79748o37299n94163n63665
12745A0440084n62825n59221n62861n65643n31611m62842m12460l74503l50956
12736F057162l32719l13052k90965k78224k81469k79894k51755k07538j61418
12727C660128j17347p6616l7383n641N6219J55611K56454L69378M74958N11390
$$ y = [231046385, 182007539, 147050868, 124330407, 109332950, 98855491, 90834337, 83934927, 77418251, 71024087, 64875107, 59194636, 54084645, 49551109, 45566591, 42063185, 38958863, 36205745, 33764257, 31598045, 29661485, 27937132, 26397701, 25006631, 23765939, 22662766, 21661427, 20749078, 19903708, 19078500, 18266065, 17469821, 16684418, 15918526, 15154420, 14391314, 13639968, 12914959, 12235211, 11597912, 11003749, 10440084, 9877259, 9318038, 8755177, 8189534, 7657923, 7195081, 6782621, 6408118, 6057162, 5724443, 5411391, 5120426, 4842202, 4560733, 4280839, 4029084, 3821546, 3660128, 3542781, 3466165, 3428782, 3423141, 3479360, 3634971, 3891425, 4260803, 4735761, 5247151]
12717E247151M69516L51105J56516K1023K1977P2057J01154P2395j2936r0030
12707F409928j66725k87642n31791p58488p67168n80814l70068k43703j57032
12698B546497j26461j25076j01839q4163q2656p5309q2665q6146q7640p0836p0510
12687A553196o5608o9457n7705m7559j4917K3537N8153Q6327Q7017O5577K4467
12676A643028j8523o7211j12950j18806q5495p3929o0626l0740k3337j1069K318
12665A042660O970R882n017k6396m6859m7352k5611j8224r610O941J1912M111
12653I03407Q767K0014J4343O955j178n158k959j2167q257M837n417m819q002
12640I10366o817o899j2908q511j2415j4476k0391k3967l2240k9104j5864n841
$$ y = [5247151, 5716667, 6067772, 6224288, 6245311, 6267288, 6339345, 6440499, 6512894, 6499958, 6409928, 6243203, 5955561, 5423770, 4665282, 3898114, 3317300, 2947232, 2703529, 2546497, 2420036, 2294960, 2193121, 2108958, 2026302, 1950993, 1868328, 1782182, 1694542, 1623706, 1553196, 1487588, 1418131, 1360426, 1312867, 1297950, 1321487, 1379640, 1465967, 1552984, 1618561, 1643028, 1624505, 1557294, 1444344, 1325538, 1240043, 1166114, 1105488, 1074748, 1051411, 1040342, 1042660, 1049630, 1059512, 1054495, 1028099, 981240, 933888, 908277, 890053, 880443, 887384, 899296, 903407, 912174, 932188, 946531, 953486, 952308, 947150, 944191, 932024, 923767, 928604, 923187, 918368, 910366, 903549, 896650, 883742, 875231, 862816, 848340, 827949, 803982, 771742, 742638, 726774, 720933]
12628G20933q149m261j0868r144j7480k8189j9621j3371j4379k3458j5291q131
12616E48591j1402j5527k0181j2635j9762k4392j5274r465j2840q383J0731J0119
12604D19580q410l895j4866r937l041j6000k0625P55j0407j4480j248M028N815
12591C27269l008j7918j7545r645k1664j819k577j0158K03j2689r037n283j523
12578B14606o63o55J0879J1883J0024J287n427r368p87o57n301n27P226m125k404
12563B25991J4326L280N392R292L650J0259K0707K8358K0663J8635Q296l837P58
12550C65770j1842q452n828j598j5021n388r455j1229j1618M395m681j7881j4944
12537B52228p156p866j0228M548m350j0168m645n65Q382J0696K750l689L763K751
$$ y = [720933, 712784, 708523, 697655, 688511, 671031, 642842, 623221, 609850, 595471, 572013, 556722, 548591, 537189, 521662, 501481, 488846, 469084, 444692, 429418, 419953, 407113, 398730, 409461, 419580, 411170, 407275, 392409, 382472, 379431, 363431, 342806, 343561, 333154, 318674, 317426, 321454, 327269, 324261, 306343, 288798, 279153, 257489, 255670, 253093, 242935, 243138, 230449, 221412, 216129, 214606, 213943, 213288, 224167, 236050, 246074, 247361, 241934, 232566, 231779, 231122, 225821, 225294, 232520, 228395, 225991, 240317, 243597, 248989, 258281, 261931, 272190, 292897, 321255, 341918, 360553, 368849, 365012, 365770, 353928, 345476, 339648, 338050, 323029, 317641, 308186, 296957, 285339, 289734, 285053, 267172, 252228, 245072, 237206, 226978, 231526, 227176, 217008, 212363, 211798, 220180, 230876, 233626, 229937, 233700, 236451]
12523B36451J7099R047J1188O338Q728M411j208M64L161P345J6022M311o081p153
12509C10123J4881Q869K214J2730J9683O478Q121J3761Q60J621k00J755L322J2204
12495D16422j4N372m933r341j5408k2712k5308k5257k2697k8043k5032j6487j7105
12482B09457k3703k9343k4239j8284j2667j0263p729j2842p728j4264N68q908
12470D0055m257j812j0075m341K549l606j2336m306k311L3Q431k337q598k633
12456e544l710p84j827k171n80P17l475J918L995m271p7J211m502n02j1839j099
12440c2540R059J1523m640p465n684j183J0311M670N661R560L981j0157K246J4854
12426A0196o324K863R243J1871Q207J0304L040J764O101N354N565J36l528m886
$$ y = [236451, 253550, 262597, 273785, 280123, 288851, 293262, 292054, 292518, 295679, 303024, 319046, 323357, 317276, 310123, 325004, 333873, 336087, 348817, 368500, 374978, 383099, 396860, 397720, 399341, 399141, 400896, 404218, 416422, 416408, 421780, 416847, 407506, 392098, 369386, 344078, 318821, 296124, 268081, 243049, 226562, 209457, 185754, 156411, 132172, 113888, 101221, 90958, 83229, 70387, 62659, 48395, 48963, 40055, 35798, 33986, 23911, 19570, 22119, 18513, 6177, 1871, -440, -407, 8024, 5687, -2911, -5544, -9254, -10038, -11865, -14036, -14616, -13899, -17374, -15456, -11461, -15732, -15809, -14598, -19100, -19602, -31441, -32540, -23481, -11958, -16598, -24063, -29747, -30930, -20619, -15949, -10288, -728, 3253, -6904, -4658, 10196, 3872, 6735, 15978, 27849, 36056, 46360, 49400, 51164, 57265, 62619, 68184, 68320, 64792, 59906]
12412E9906p645n531N86J629J406j0083j8574m708k015J701q058k772K653n906
12398B589j3567Q598M128m707k35N33J466M225j604L415J4703P870J973Q674J1876
12383D9937Q622M399J3103J4628R047J7154P036Q223L215N357J0005Q913Q186
12370A67825K2525K7109K8502L8405O2294Q8232J16767J59733K01548K52172K77983
12359A443095K56105J91502J24477N8682J4076j802M77J3608J4458K6187K9416
12348B170281J4565j7814k6414n0601j42586k37456k98215k97475k42288j67920
12338G04077r0239n4382m9699m2822k1691j4620p334j5016k4915k4617k9862k6096
12326C02784j1300j5523k4636k2052j4237j5180j1633p860j6314q958j1303n857
$$ y = [59906, 52261, 46730, 47316, 48945, 50351, 40268, 21694, 16986, 14971, 16672, 8614, 5842, 8495, 2589, -10978, -2380, 1748, -2959, -3194, -2661, -1195, 3030, 1426, 4841, 19544, 27414, 29387, 38061, 49937, 58559, 62958, 76061, 90689, 99736, 116890, 123926, 132149, 135364, 140721, 150726, 159639, 167825, 190350, 217459, 245961, 284366, 346660, 434892, 551659, 711392, 912940, 1165112, 1443095, 1699200, 1890702, 2015179, 2073861, 2087937, 2086135, 2086612, 2100220, 2114678, 2140865, 2170281, 2184846, 2167032, 2140618, 2090017, 1947431, 1709975, 1411760, 1114285, 871997, 704077, 613838, 559456, 509757, 466935, 445244, 430624, 423290, 408274, 383359, 358742, 328880, 302784, 291484, 275961, 251325, 229273, 215036, 199856, 188223, 180363, 164049, 155091, 143788, 137931]
12314A37931q567j1073j0352r321q364k515l335q114r119j818j206j972K201m283
12300F0093R11k805l7n011l239Q534L796n466j572j3495l38j963j5217L573L139
12285C0903O092N915o064m941k831m308N814k911r949q057r82L907R487R359O84
12270C2118P099p260p772M89L305j066r468k668j088L544J4553Q962p42m758m043
12255C1205o697o370N195N09k726q4j1376p532k242K284K222m34p102j2347l040
12240a8535L030P293K464r864O481O872l651k957J582j499R057M228O352Q742
12226A9595j1322m674O790N192k542J108J387n406K479J2898p20l208n07O731
12212B7801j533p667M39L395k593J284j3839P756K048j425J181j5080j0335Q563
$$ y = [137931, 129364, 118291, 107939, 98618, 90254, 87739, 84404, 76290, 67171, 65353, 64147, 62175, 64376, 60093, 61004, 58199, 58162, 53151, 49912, 58446, 62242, 56776, 55204, 41709, 41371, 39408, 24191, 27764, 30903, 36995, 42910, 36846, 31905, 29074, 24766, 30580, 27669, 17720, 9663, 8681, 12588, 22075, 31434, 32118, 39217, 31957, 24185, 24674, 27979, 26913, 17445, 14777, 13689, 17233, 31786, 40748, 40006, 35248, 31205, 24508, 18138, 23333, 23842, 21116, 21032, 9656, 2124, -118, 2166, 4388, 3954, -3148, -15495, -18535, -15505, -8212, -5748, -15612, -9131, -2259, -5910, -8867, -7285, -8784, 273, 4501, 10853, 19595, 8273, 3599, 10389, 15581, 13039, 14147, 15534, 10128, 12607, 25505, 24785, 21577, 21070, 27801, 26268, 18601, 19040, 22435, 19842, 21126, 7287, 15043, 17091, 15666, 16847, 1767, -8568, -5]
12198eJ4984L084o052j4598j0960k623P146J117n891q251n387O828j791M583P114
12183a0702m500n783m139O986Q902K321J064p284o112K838N32n586M100j148J066
12168a7445O850n953O998L428J0759K424k374j733j4934Q384J1812R027m339j2958
12154e4j1295j3327j946J0218R020m128o995M604J187k88Q909l618o367O99O401
12139f980L819M137K625R634j424p789k184k121N127P560l422r792j049l155J371
12124c643L221R042p457M794l540r904q53o530O406R118K438o945j206j6R317
12109D242L434r232j276O346Q60p858L016R490J022p026K857N876p996K66J1530
12094A5551n251m823l925r964P053R328o570j165O60N390P1o729L043K343N900
$$ y = [-5, 14979, 18063, 12011, -2587, -13547, -16170, -9024, -7907, -13798, -22049, -27436, -20608, -22399, -17816, -10702, -15202, -20985, -25124, -18138, -9236, -6915, -5851, -13135, -19247, -16409, -15877, -21463, -17363, -18511, -17445, -10595, -16548, -9550, -6122, 4637, 7061, 4687, 2954, -11980, -3596, 8216, 17243, 12904, -54, -11349, -24676, -26622, -16404, -7384, -11512, -18507, -13903, -12716, -13004, -4095, -7713, -14080, -13381, -6980, -3161, 976, 3601, 13235, 11811, 4022, 1838, -283, 4844, 12404, 8982, -810, -1859, -5014, -3643, -422, 8620, 1163, 5957, 2417, -7487, -8340, -14870, -8464, 654, 3092, -3853, -5059, -5075, 4242, 7676, -1556, -2832, 3514, 4374, -3484, -468, 9022, 10044, 3018, 5875, 11751, 3755, 4021, 15551, 10300, 5477, 1552, -8412, -1359, 7969, 1399, 234, 894, 6284, 6355, -374, 2669, 5012, 10912]
12079A0912M8l740L070J0347Q5K363P311j2641p923M758M566p626j250j730m308
12064D242l152N061M741J375p961n424J748m470q166Q072M257N319J879L152J268
12049A1941K740o20n254l02n35o439J2617K140j0038k710P591n061j094N077J122
12034A1175q395l722K206N765M253n41J125J400l308J979O083Q113J980m495o692
12019A6926L036M10l597r948j0164j196N176K061N7Q334J151Q226O41j412l407
12004A6294j781K789n76M795N199PQ365P315n87p094m939j325J0685J3549k462
11989E0234m553o734m084j855j327k125q737m6M178L583j42K272M550L603M820
11974D3637J242J580j930j732m926j270n596Q661m073k102J944J1856o029n811
$$ y = [10912, 10960, 7220, 10290, 20637, 20722, 23085, 30396, 17755, 9832, 14590, 19156, 11530, 10280, 8550, 4242, 1090, 6151, 10892, 12267, 4306, -1118, 630, -3840, -12006, -3934, 323, 5642, 7521, 10673, 11941, 14681, 14061, 8807, 8505, 7970, 1531, 14148, 16288, 6250, 3540, 11131, 6070, 4976, 10053, 11175, 2780, -942, 1264, 7029, 11282, 10741, 11866, 13266, 9958, 11937, 18020, 26133, 28113, 23618, 16926, 19962, 20372, 16775, 6827, -3337, -4533, 643, 2704, 2761, 11095, 12246, 20472, 21113, 19701, 16294, 14513, 17302, 16726, 21521, 26720, 26727, 35092, 42407, 41820, 34726, 29787, 28462, 39147, 52696, 50234, 45681, 38947, 34863, 33008, 31681, 29556, 20819, 20773, 24951, 28534, 28392, 30664, 35214, 38817, 43637, 44879, 46459, 44529, 42797, 37871, 36601, 31005, 39666, 35593, 33491, 35435, 47291, 41262, 35451]
11960C5451Q260J2242M390O062O22L194K542P396L446K828o858l289L432P33K284
11945H2735l511J051j0852m087R211j363j3286o578N938Q643Q06p05j7R79L319
11930G2283m530n329L382K01J084k218l709K093p7j537r669J71k204J976K446
11915E4363k24j084J936L730l964Q627N580l639r89J903K74J562l245o659P310
11900F5481R445M556q493j665m473J662m050n573k863n90J1704o334o312J0597
11886F3092K937M518P993L22j2662j2337p0K425J429n976L106M355N913J136L457
11871F9638j4713l666J249M60N552n233q739N997J1239O880M444m052j7347j1091
11857D0618J2140j196L386l408q200n006M216O690K796n239J635L799O49Q112
$$ y = [35451, 43711, 55953, 60343, 66405, 67027, 70221, 72763, 80159, 83605, 86433, 79575, 76286, 79718, 80451, 82735, 79224, 80275, 69423, 65336, 74547, 73184, 59898, 53320, 59258, 67901, 68707, 68002, 67985, 68964, 72283, 67753, 62424, 65806, 66007, 67091, 64873, 61164, 63257, 63180, 61643, 51974, 52145, 49941, 51917, 54363, 54139, 53055, 54991, 58721, 54757, 63384, 68964, 65325, 64336, 66239, 66513, 68075, 64830, 58171, 65481, 74926, 79482, 70989, 69324, 64851, 66513, 62463, 56890, 54027, 53437, 65141, 58807, 52495, 63092, 66029, 70547, 78540, 78862, 66200, 53863, 53793, 56218, 57647, 51671, 54777, 59132, 65045, 66181, 69638, 54925, 51259, 52508, 52968, 58520, 53287, 44548, 50545, 61784, 68664, 73108, 69056, 51709, 40618, 52758, 51562, 54948, 51540, 43340, 38334, 42550, 49240, 52036, 46797, 48432, 52231, 52880, 60992]
11843F0992j559L302j638j0952n944J8290J0663J1533j420l740q173R33Q327R848
11829I0462J4297J1696j4531k2646o864O148N01l915l493p088n206J52M561L3
11815F4107p728n858p50k800k4781l991O803O780k224O681J6699P099J11n808
11801E4340n09m168R235J562N931J1416L107r298O578Q443j772m408j1788j816
11787F6853P536o245m268l365j721J2224R328j0798j1576j0221l792N567P927
11774E7449P276P544K395j402r143o680p158p093M166m85o123q554m14J0903r456
11759C3225q465j879n499j188K043j870J0387J3112M503O796N111Q459M949q13
11745F8871r327p643L91K79k48M67l447o737j404o254k776o937n97J930L486q413
$$ y = [60992, 59433, 62735, 61097, 50145, 44201, 62491, 73154, 84687, 83267, 79527, 71354, 72287, 80614, 90462, 104759, 116455, 101924, 79278, 72414, 78562, 79063, 75148, 71655, 64567, 59361, 59513, 64074, 64107, 56379, 50521, 49771, 46971, 22190, 18199, 25002, 31782, 29558, 36239, 52938, 60037, 60148, 54340, 53831, 49663, 58898, 60460, 66391, 77807, 80914, 71616, 78194, 86637, 84865, 80457, 68669, 66853, 74389, 68144, 63876, 60511, 58790, 71014, 80342, 69544, 57968, 47747, 43955, 49522, 57449, 64725, 72269, 74664, 73262, 64119, 57439, 50281, 43188, 47354, 46869, 40746, 32192, 31778, 42681, 33225, 24760, 22881, 17382, 16194, 18237, 16367, 26754, 39866, 44369, 51165, 56276, 64735, 69684, 68871, 59544, 51901, 52292, 52571, 52323, 52790, 49343, 42606, 41202, 34948, 32172, 25235, 24638, 26568, 30054, 21641]
11729B1641j778M655L517J0275n13m490l135o92N97K383L853n771l938l137n305
11714A8162R174M32j3284R47L750P896j904J598r97K754L347j717j2640l565L416
11699A7369K875r97k763o34M574m455j683J6367R588m901K712k670r346p474l848
11684A4714N911J970j2839K445l749J014p06l576N35P988K714k49P439l309P603
11669B7905R9j2038j2306R001j659l034K171N194k95m641Q960M123k331j0448
11655A0701M201L989l065l589L906J0408k682j570o513r146k869J0483M918r187
11641I985l228N83k407J09M147M18l0j5690J077J260K247Q692j956n813M22M968
11625D784n23J1053K113j6239L133K653N648m148K93M086M73p04n050P638J4422
$$ y = [21641, 19863, 24518, 28035, 38310, 37797, 33307, 30172, 29480, 30077, 32460, 36313, 30542, 26604, 23467, 18162, 27336, 27768, 14484, 15431, 19181, 27077, 25173, 26771, 25774, 28528, 31875, 30158, 17518, 13953, 17369, 20244, 19247, 16484, 15850, 20424, 15969, 14286, 30653, 40241, 35340, 38052, 35382, 26036, 18562, 14714, 20625, 22595, 9756, 12201, 8452, 9466, 8760, 5184, 5719, 13707, 16421, 16172, 23611, 20302, 27905, 28004, 15966, 3660, 12661, 11002, 7968, 10139, 15333, 15038, 10397, 19357, 23480, 21149, 10701, 14902, 18891, 15826, 12237, 16143, 26551, 23869, 22299, 15786, 6640, 3771, 14254, 19172, 9985, 6757, 7340, 4933, 5042, 9189, 9607, 9577, -6113, -5036, -3776, -1529, 7163, 5207, -606, -184, 4784, 4261, 15314, 17427, 1188, 4321, 6974, 12622, 8474, 8767, 12853, 13326, 12622, 7572, 15210, 29632]
11610B9632o091p818j377N014J037l97p472r852J007M097m435O129Q265M212j2349
11595I602j8818l630N318P151m324m871m669n929M144M195O270m92K336k733l540
11580i990L847M28m135k1n821M630M225O548L846P98M59q093q317j1R362N732
11564C487P730n68J155N664Q54j1279q191m984q824P243P954O065J897p308p398
11549f503M604J4310N129n662k241j5355n305m272K682j277r97L968Q357M480
11535A918J0614o212J211r36L175k804M331m3L089J88j5188m549P409k802L894
11520C295P797J2369k172P366J2553P057r590j0899J780M714M035J2075L77Q637
11506E9394J4955J936p278p95k425O589J580N05M250j624q687k35n73o650M952
$$ y = [29632, 23541, 15723, 14346, 19360, 20397, 20000, 12528, 2676, 3683, 7780, 3345, 9474, 17739, 21951, 9602, -9216, -12846, -7528, -377, -4701, -9572, -14241, -20170, -16026, -11831, -5561, -6053, -3717, -6450, -9990, -6143, -5715, -9850, -9871, -15692, -11062, -6837, -289, 3557, 4355, 4814, -3279, -11596, -11607, -2245, 3487, 11217, 10649, 11804, 17468, 18322, 7043, -1148, -6132, -14956, -7713, 241, 6306, 8203, 895, -6503, -1899, 12411, 17540, 11878, 9637, -5718, -11023, -15295, -12613, -13890, -14887, -10919, -2562, 1918, 12532, 6320, 7531, 6595, 9770, 6966, 11297, 11254, 14343, 14531, -657, -5206, 2203, -599, 3295, 11092, 23461, 21289, 28655, 41208, 48265, 38675, 27776, 29556, 34270, 38305, 50380, 50757, 59394, 74349, 76285, 69007, 68212, 65787, 72376, 73956, 74461, 78711, 77087, 68400, 68165, 67592, 60942, 65894]
11491F5894l471N008O666J0983n643q006J272J0957n866j049n938R050m23p226
11477G2208j8005N408J875j325L324N524O88J896L439j2349r385n205L334J3268
11463F4695j143l942l715L070O510Q059Q035p456p498M183l437K742R043J2555
11449I1701O541N224K310K686J7139L613L655J1591J5300J5849K490l077j0571
11436A64451J992L089K442J1669J0855J758p057q966n031Q51l151p735J370L42
11422A66879P692j716N199l477n603J330l291O758N332Q355J261J659J0677J37
11408B01192o007j2793j0788j28P742R184L61J2560J1669O228m695J7466K1102
11395B53093K182K358M62l938Q60Q527P217J367r799j6744o197p224m579m153
$$ y = [65894, 62423, 67431, 74097, 85080, 79437, 71431, 72703, 83660, 77794, 76745, 70807, 79857, 79434, 72208, 54203, 59611, 61486, 60161, 63485, 69009, 69697, 71593, 75032, 62683, 53298, 48093, 51427, 64695, 63552, 59610, 55895, 58965, 65475, 73534, 81569, 74113, 66615, 70798, 67361, 70103, 79146, 91701, 98242, 103466, 105776, 108462, 125601, 129214, 132869, 144460, 159760, 175609, 178099, 175022, 164451, 166443, 169532, 171974, 183643, 194498, 196256, 189199, 180233, 175202, 176053, 172902, 165167, 166537, 166879, 174571, 172855, 178054, 174577, 168974, 170304, 167013, 173771, 179103, 187458, 188719, 190378, 201055, 201192, 195185, 182392, 171604, 171476, 179218, 188402, 188763, 201323, 212992, 219220, 214525, 231991, 253093, 255275, 257633, 258095, 254157, 255017, 263544, 270761, 272128, 262329, 245585, 239388, 232164, 227585, 223432]
11381B23432j0176n331l001K114q768o326Q364r158r636m054j6140M504J4495
11368A80319L422M950M091J937R220k134p044j810l847j0618l197R511O522K308
11354A93630J923N197M442n747Q204q860j3487k7o62L845m526p678O967j6836
11340A66385j9266j0229o059j9841j8552m585J0184n998j8873k60R25J050M883
11327G9764k389k071o682n902j68P769J919n591j928r690q089M715L973l671O125
11312E8084O686j791k852n042k672q93n589K09m556r778q331N004M252M362r503
11297B7590r386n902n062n497O224R76l435o721j914O161K757p748p817L095k586
11282i265k712P75L931Q848J852l106K702M777n978n551J003j2019n413K354j947
$$ y = [223432, 213256, 207925, 204924, 207038, 198270, 191944, 200308, 191150, 181514, 177460, 161320, 165824, 180319, 183741, 188691, 192782, 194719, 203939, 201805, 194761, 192951, 189104, 178486, 175289, 184800, 191322, 193630, 195553, 200750, 205192, 199445, 207649, 198789, 185302, 185275, 184613, 188458, 183932, 176254, 183221, 166385, 147119, 136890, 130831, 110990, 92438, 87853, 98037, 92039, 73166, 72906, 73831, 74881, 79764, 77375, 75304, 68622, 62720, 62552, 70321, 72240, 66649, 64721, 55031, 46942, 51657, 55630, 51959, 58084, 64770, 62979, 60127, 55085, 52413, 51520, 45931, 46140, 41584, 31806, 23475, 28479, 32731, 37093, 27590, 18204, 12302, 7240, 1743, 7967, 8943, 5508, -1213, -3127, 3034, 5791, -1957, -9774, -6679, -9265, -11977, -11202, -7271, 1577, 3429, 323, 3025, 7802, 1824, -3727, -2724, -14743, -20156, -17802, -19749]
11267a9749l042Q96N807k012m688O080m249O208J2900J0754M181j3310j1722K405
11253i541L398r66L412q199j755j1347k758N175O622k585l52J078j0105p570M747
11238c0746P501k899j0454p687l555K404K665O564P403l975l494p5J771M208l048
11223c3417M516O071m375j4337n040Q799P264R173L102n090m011J2455L275O299
11209e316N344O857l574j237p116j469J266q863o256o400p395J869O059M919p280
11194b8592m343Q048k427r466J355k91M129j4024l654R565N849k495k537M920
11180c3963l615m626N199K1197L621j6598p079k526r58l052O158J3915L571p578
11166b6334P09k595m62L504R80k154O652K466n066K36l845j7947q022K410Q540
$$ y = [-19749, -22791, -21895, -16088, -18100, -22788, -16708, -20957, -14749, -1849, 8905, 13086, -224, -11946, -9541, -6143, -7109, -3697, -11896, -13651, -24998, -27756, -22581, -15959, -18544, -18896, -17818, -27923, -35493, -30746, -23245, -26144, -36598, -44285, -47840, -45436, -42771, -36207, -28804, -32779, -36273, -36348, -34577, -30369, -33417, -28901, -22830, -27205, -41542, -46582, -37783, -30519, -21346, -18244, -23334, -27345, -14890, -11615, -5316, 28, 6885, 3311, 2074, -5042, -6511, -5245, -14108, -20364, -26764, -34159, -32290, -26231, -21312, -28592, -32935, -24887, -27314, -36780, -35425, -35716, -31587, -45611, -49265, -39700, -33851, -36346, -38883, -33963, -37578, -42204, -37005, -15808, -12187, -28785, -35864, -38390, -39348, -42400, -36242, -22327, -18756, -26334, -25625, -28220, -28682, -25178, -24198, -26352, -19700, -17234, -22300, -22064, -25909, -43856, -51878, -49468, -40928]
11151d0928J0721P570O476K402o51p512J746m586p193M568M149K295K308P880
11137a0755J359p756L20n963j231R065P709j697o224P443K250n493j718J671l41
11122a1361k747l208o757j0314m753N198N075Q613J72Q227l731K478O432K70k311
11107h717n015n91N582J3605q18m326n331Q021N762n598q294M807J531q398J234
11092f546k986K111J157j4613o63o282j3446N48J4823J555N120R416L336J172
11078e298q008q494j2416O986O535m41p415p471L222M022J999M540k355j022j161
11063b6777O196P944P055m659J259J1518j828o234o047M025J369m620R99L977
11049e823k346M84p807l406P972Q432K408L816J603J461M513R925l398q449l437
$$ y = [-40928, -30207, -22637, -16161, -13759, -14410, -21922, -20176, -24762, -31955, -27387, -23238, -20943, -18635, -10755, -9396, -17152, -16832, -22795, -24026, -14961, -7252, -8949, -15173, -7730, -5480, -10973, -12691, -11020, -11361, -14108, -17316, -24073, -34387, -39140, -33942, -28867, -20254, -20082, -11855, -15586, -13108, -6676, -6406, -8717, -13732, -14323, -8741, 4864, 4046, -280, -5611, 2410, 8172, 2574, -5720, -913, 618, -7780, -6546, -9532, -7421, -6264, -20877, -21540, -27822, -41268, -40720, -25897, -24342, -19222, -9806, -6470, -5298, -13306, -21800, -34216, -27230, -20695, -21136, -28551, -36022, -32800, -28778, -26779, -22239, -24594, -25616, -26777, -20581, -12637, -5582, -10241, -8982, 2536, 708, -5526, -11573, -7548, -6179, -10799, -9800, -5823, -8169, -7685, -15492, -18898, -10926, -2494, -86, 3730, 5333, 6794, 11307, 21232, 17834, 9385, 5948]
11034E948j07J216J5j0223j0393q72J0682j000q363r090o846p812L654J3976N617
11019a3598P456O366q942p05L665K027N940l39n540O580o465k508O050O994j0987
11004d006m649K536J4351P65o339O628n381j3719k031J868P290M515q269p757
10990a4198k218N893N841R176M894m264Q24l64j0015n781L174O298M787n553j682
10975c188k954O135m027j1329k419K729M266Q496K098r496m53O773L326K093q09
10960A241n09O530N411q201j5587J461R331P037K469J552q459k746N447q81n123
10945a027r90r222j5747L886R321q987l464R980L121l561J547J587M683o061J799
10930a3135M429K227m021p205K338N744N053Q592P456k2167J250J5680L4Q975
$$ y = [5948, 5841, 7057, 7072, -3151, -13544, -14416, -3734, -4734, -13097, -22187, -29033, -36845, -33191, -19215, -13598, -6142, 224, -8718, -9423, -5758, -3731, 2209, 1870, -3670, 2910, -3555, -6063, -13, 6981, -4006, -8655, -6119, 8232, 8997, 2658, 9286, 3905, -9814, -11845, -9977, -2687, 1828, -6441, -14198, -16416, -10523, -4682, 4494, 9388, 5124, 5948, 5584, -4431, -10212, -7038, -740, 4047, -1506, -3188, -6142, -7, -4034, -15363, -17782, -15053, -10787, -2291, -193, -9689, -10142, -3369, -43, 2050, 1241, 732, 7262, 12673, 4472, -11115, -9654, -323, 6714, 9183, 10735, 2276, -470, 4977, 4096, -1027, -2017, -11239, -26986, -23100, -13779, -22766, -26230, -16250, -13129, -16690, -15143, -13556, -8873, -14934, -13135, -8706, -6479, -10500, -17705, -15367, -9623, -4570, 4022, 11478, -10689, -9439, 6241, 6275, 15250]
10916A5250k900j0600J076j836r585l219K462j16k685J09P054N9n413k444O586
10901f202L693M007L295m16j0185p329L891M19n495P456J675K715K554K803k434
10886D47N09J415o489j2870q109j2414j986J3083O516j91n79M465N124R117J4195
10871A2233P982r155q473n194p178P628o100m015K572p074k76r294r064J6508
10857a8900J6400N74o025l958l580J928K978j747j1555o508K616J394O089N807
10843a4487k552k533P514N951o45K225L85J835p643o871j5700k998R375P560k58
10828a8842o5l329l828j844l053R281O486P05m501K465M434k724P37Q386O896
10813A204p939j4561K728L909N551K170M96j064r983r80J607j876M880J0783J875
$$ y = [15250, 12350, 1750, 2826, 990, -8595, -11814, -9352, -9468, -12153, -12044, -4990, -4931, -10344, -12788, -6202, -2509, 1498, 4793, 4377, -5808, -13137, -9246, -8827, -14322, -6866, -5191, -2476, 78, 2881, 447, 956, 2371, -4118, -16988, -25097, -37511, -39497, -26414, -19898, -20089, -20668, -16203, -11079, -1962, 12233, 20215, 11060, 2587, -2607, -9785, -2157, -8257, -12272, -9700, -16774, -17050, -26344, -35408, -18900, -2500, -1926, -7951, -11909, -15489, -13561, -10583, -12330, -23885, -30393, -27777, -26383, -20294, -14487, -17039, -19572, -12058, -6107, -6752, -4527, -4142, -2307, -9950, -16821, -32521, -35519, -26144, -18584, -18842, -18907, -22236, -26064, -27908, -30961, -21680, -15194, -14489, -18990, -16525, -12091, -14815, -14078, -5692, 1204, -6735, -21296, -18568, -14659, -9108, -6938, -6442, -7506, -17489, -18469, -16862, -18738, -13858, -3075, -1200]
10798a200o699j001j5449q010M258N534O040q617k002N162O770J58Q108J3649
10784F701l713l656j478q308N05j497j6964j1487n307n062n134O066O395J5295
10770b7644K761J011j607q41k266J842m209J570M830O713k79M972j650L668p28
10755a1857k160l930m312M81J2079N486j1407k1337j0641j936J576K563J0146
10742c5249Q237J294O865P212P969j509r19r585j6064K148J505j0455K815M876
10728c0860J0030j30o821m260J339m940N033J1386J230j573q916p144k561J1343
10714b6844O390L663N118j393O202N06l594k607k510N064m984p682o072L731Q494
10699a6518P318L739k032r782n562K975J2004l00K264j327p281j052N725Q377
$$ y = [-1200, -7899, -8900, -24349, -32359, -28101, -22567, -16527, -25144, -27146, -21984, -15214, -15056, -6948, 6701, 2988, -668, -2146, -10454, -9949, -11446, -28410, -39897, -45204, -50266, -55400, -49334, -42939, -27644, -24883, -23872, -25479, -26320, -28586, -26744, -30953, -29383, -24553, -17840, -18119, -13147, -14797, -11129, -11857, -14017, -17947, -22259, -21778, -9699, -4213, -15620, -36957, -47598, -49534, -47958, -45395, -35249, -27012, -25718, -18853, -11641, -3672, -5181, -6100, -15685, -31749, -29601, -28096, -38551, -35736, -30860, -20830, -20960, -27781, -32041, -30702, -35642, -30609, -19223, -17993, -19566, -28482, -35626, -38187, -26844, -20454, -16791, -11673, -13066, -6864, -6358, -9952, -12559, -15069, -10005, -14989, -22671, -28743, -25012, -16518, -9200, -5461, -7493, -17275, -22837, -19862, -7858, -8158, -5894, -7221, -14502, -15554, -9829, -1452]
10685a452J894j5141J027m704K832k20k03J1549n350j0488L760K410L979P755
10671b352K113l570N717o383r257m492q01M048J935J943m917j0754j701L623N439
10656a9409O127M741j844L703l060n713j267J912n924P63J2335R185J3031K39
10642A4819j232q637j862r105K407N376n554j0668P85M636K280L292N777k247
10628F7n497O395k133m053j124l984K865m444K724L458L650M874J672l822j0303
10613i655M656o216n293R427J2139J2495n649j3960j4880p593J4005o31q30K169
10599i816L849K624M477k607K079J1032O30m555p629J1662J634m232j757Q121
10585A5512R093J208n756m237O08J0739J603j3253j3016j1705j18M21M147Q588
$$ y = [-1452, 442, -14699, -13672, -18376, -15544, -15764, -15967, -4418, -9768, -20256, -16496, -14086, -10107, -2352, -239, -3809, 1908, -4475, -13732, -18224, -19025, -14977, -13042, -11099, -16016, -26770, -28471, -24848, -19409, -13282, -8541, -10385, -6682, -9742, -15455, -16722, -14810, -20734, -19971, -7636, 1549, 14580, 14819, 13587, 4950, 3088, -6017, -3610, 1766, -3788, -14456, -13671, -9035, -6755, -3463, 2314, 67, -5430, 965, -1168, -5221, -6345, -10329, -7464, -11908, -9184, -5726, -2076, 2798, 4470, 648, -9655, -4999, -11215, -16508, -7081, 5058, 17553, 11904, -2056, -16936, -24529, -10524, -11155, -11985, -9816, -5967, -3343, 1134, -1473, 606, 11638, 12268, 7713, 84, 11746, 13380, 9148, 7391, 15512, 24605, 25813, 20057, 15820, 16428, 27167, 28770, 15517, 2501, -9204, -9322, -8901, -4754, 3834]
10571C834M730k062j64M876k861o294J49P193K074j0171j5689L108R632L642j6641
10556a4644r905P827j86M304O540l26M952M42J271L532R711K051k084j223k571
10541I691o394n574M171m100n570L148M711k142j136k092O060J0573J606j3616
10527f64n011J332m192r393J410P203j67j762L040m239n349P659P839J1339o888
10512B157k184L984N698j0232m74o996K384J898O108J1699m757j3646m731L288
10498e804Q835P595K853O247m296m291n037N283j575J881j605O799j87p493q408
10483G97R105M127j594K733j7888p555k198q570N472N489n557J393m667p00l229
10468b2842M685n23j2132J3703K1679J533r745o300l819q495Q007P80r22P783
$$ y = [3834, 8564, 6502, 6338, 11214, 8353, 2059, 2208, 9401, 11475, 1304, -14385, -11277, -1645, 1997, -14644, -24549, -16722, -16908, -12604, -6064, -6390, -1438, -996, 275, 3807, 13518, 15569, 13485, 12262, 9691, 3297, -2277, 1894, -2206, -7776, -4628, 83, -2059, -3195, -5287, 773, 11346, 12952, -664, -5675, -4343, -8535, -17928, -16518, -9315, -9482, -11244, -8204, -12443, -17792, -10133, -2294, 9045, 2157, -27, 3957, 9655, -577, -1051, -8047, -5663, -3765, 2343, 14042, 9285, -4361, -9092, -5804, 3031, 10626, 13479, 19726, 15430, 11139, 6102, 11385, 9810, 11691, 10086, 16885, 16698, 9205, 797, 9902, 14029, 12435, 15168, -2720, -10275, -12473, -21043, -15571, -10082, -15639, -14246, -18913, -19613, -22842, -18157, -18680, -30812, -17109, 4570, 6103, -3642, -9942, -13761, -22256, -14249, -13469, -14391, -6608]
10454f608L499l263n600n265j0223k76N023J0920O150M31K856L351p468j164q01
10439h438l449Q263K999p411n265o8M099M287j352R22K561K397o663m756Q846
10424c028R426o47j755k240q044m454r320l499M394J5007J1994k466q200n789
10410h621j99n08r43P091M915j28k847J073O331J4197L853q73Q84o67O51j842
10394B2367l883k234r752l881R03P680J093Q654M072j0069j0639M23J296j5288
10380i258j3506N210K1153N109p6K721l701L70m702o413K861N97L649j822r170
10365f978j180k735q471R65n92p903p591J0276R068J372J549K602R398N366p925
10350b779j174k508J823L828N382R382m602j3776q13N069o746q28n545Q767J0776
$$ y = [-6608, -3109, -6372, -11972, -17237, -27460, -27736, -22713, -11793, -5643, -5212, -2356, 995, -6473, -7637, -8438, -11887, -3624, -625, -8036, -13301, -13369, -9270, -4983, -6335, -5413, -2852, -455, -7118, -11874, -3028, 6398, 5751, 3996, 1756, -6288, -10742, -20062, -23561, -19167, -4160, 7834, 5368, -2832, -8621, -8820, -9328, -10271, -3180, 1735, 1607, -1240, -167, 6164, 20361, 24214, 23341, 24225, 23558, 24209, 22367, 18484, 16250, 6498, 2617, 3520, 11200, 12293, 20947, 25019, 14950, 4311, 4734, 6030, -9258, -22764, -17554, 3599, 8708, 8632, 11353, 7652, 8022, 3320, -3093, -232, 365, 4014, 2192, -6978, -8158, -10893, -19364, -18399, -18991, -26894, -34485, -24209, -15141, -13769, -12220, -9618, -220, 5146, -2779, -3953, -6461, -4638, -810, 4572, 13954, 9352, -4424, -5237, -168, -6914, -7742, -13287, -4520, 6256]
10335F256O888j7442j0555j110J7085J023K100K273n904n370o919j963o980M573
10321a6045L557N102N051m417l190L93K213J0010o123Q87j584M263M866m247n237
10306d501L235N28O793q394j0712Q102R699n607m143Q671p241j919M463N853J1798
10291A6625O413j2588j1912P819O142m432m612m667K410k171M146O23O977r657
10277A116j0828J68O930K859Q270p623k706K260K777O94J647p583o85M520p617
10262e801n720N109n63j087j988l781J740J355O219k193M703m659m315N203r763
10247a5541o621R44Q567K418k079n260o33O998L924R45M82l129j758q125j333
10232b0201O119L346J0880P9m399n796L41j1462O617j445K283P31M672o971l776
$$ y = [6256, 13144, -4298, -14853, -15963, 1122, 2145, 4245, 6518, 614, -4756, -11675, -13638, -20618, -16045, -12488, -7386, -2335, -6752, -9942, -9549, -7336, 2674, -3449, -2562, -4146, 117, 4983, 736, -4501, -1266, -738, 6055, -2339, -13051, -4949, 4750, -857, -5000, 3671, -3570, -5489, -1026, 4827, 16625, 23038, 10450, -1462, 6357, 12499, 8067, 3455, -1212, 1198, -973, 3173, 3796, 10773, 1116, -9712, -9544, -2614, 245, 8515, 892, -1814, 446, 3223, 3917, 5564, -2019, -2704, 1816, -5801, -11521, -6412, -6975, -8062, -10050, -13831, -12091, -10736, -4517, -6710, -2007, -6666, -10981, -5778, -15541, -22162, -21218, -12651, -10233, -12312, -17572, -18205, -11207, -7283, -6338, -5856, -8985, -10743, -18868, -20201, -14082, -10736, 144, 223, -4176, -9972, -9631, -21093, -14476, -15921, -13638, -12907, -8235, -15206, -18982]
10217a8982J2237K765j828q508O202J652o577O26O865N760m205j077j2351J832
10203a5589K594j990P22k931o411J708L338M503J1230J1830K430K934n921q676
10189b29j1412k81j943j4368P9Q699R929J150l936j589N792p074J739j584l86
10174a5414l985M06K834j42o29k703k006k485L606o763o438K184R832J1000O794
10159c909l762r642o855n288j595Q029N195m691N232o387r430O335J8675Q570
10145D77r053n944m41j307Q64j23J316O207l879P752J3499k233j1635j3622J18
10130a8004n999M79L934Q83l76L634K183K833K309O059J2614m394p843j3216p120
10115b2024p92N073l155o770l531M087J0885N090r910j441N783P14O612q101l393
$$ y = [-18982, -6745, -3980, -5808, -14316, -8114, -6462, -13039, -12413, -5548, 212, -3993, -5070, -17421, -15589, -12995, -14985, -14263, -17194, -23605, -21897, -18559, -14056, -2826, 9004, 11434, 14368, 8447, -229, -11641, -11922, -13865, -28233, -28154, -19455, -9526, -8376, -12312, -13901, -8109, -15183, -13444, -15028, -15414, -19399, -18993, -16159, -16301, -16930, -19633, -21639, -24124, -20518, -27281, -33719, -31535, -21703, -10703, -3909, -7671, -17313, -24168, -29456, -31051, -23022, -17827, -22518, -17286, -23673, -33103, -26768, -8093, 477, -8576, -14520, -14961, -16268, -15404, -15527, -14211, -8004, -11883, -4131, 9368, 7135, -4500, -18122, -18004, -24003, -23524, -19590, -18707, -19083, -15449, -13266, -10433, -8124, -2065, 10549, 6155, -1688, -14904, -22024, -22816, -17743, -20898, -27668, -31199, -27112, -16227, -11137, -21047, -22488, -16705, -15991, -9379, -17480, -20873]
10100b0873O036J737R207K221m265p360q434J940K3p285j102M285k544L099J226
10085b2089O388n291l514L708P132J631o90K433O51p398n664P675l260n439N404
10070a8323K153N655m972j53L655J672J502r084k634k602Q077J2963N947l076
10056G80Q06K235O05m468n262N389n29p058k756J3079O040J0140M02n178K773
10041A6998k303l657n158M141j195q349m389l588j586O669o37J935M758M480m750
10026C369q12J0789j971M061K622P259K545P320o062j232J0711M395M300J6097
10012F3391J8966J7801K5208J5296P968P739l986o36Q2J909N603J4935R481n864
9998A77893L590p043k5955l3549l2246j8271j0103n773J828o70J582p36o005J13
$$ y = [-20873, -14837, -13100, -3893, -1672, -5937, -13297, -21731, -19791, -19768, -27053, -28155, -23870, -26414, -23315, -22089, -15701, -20992, -24506, -20798, -13666, -12035, -12725, -10292, -9641, -17039, -22703, -15028, -18288, -23727, -18323, -16170, -10515, -15487, -15640, -11985, -10313, -8811, -17895, -20529, -23131, -15054, -2091, 3856, 780, 1586, 3821, 4426, -42, -5304, 85, -444, -7502, -10258, 2821, 8861, 19001, 19403, 14225, 16998, 14695, 11038, 5880, 10021, 8826, 477, -3912, -7500, -9086, -2417, -3054, -1119, 3639, 8119, 3369, 2557, 13346, 11375, 15436, 18058, 25317, 27862, 35182, 29120, 27888, 38599, 42994, 47294, 63391, 82357, 100158, 125366, 140662, 148630, 156369, 152383, 151747, 151829, 153738, 159341, 174276, 183757, 177893, 181483, 174440, 148485, 114936, 82690, 64419, 54316, 48543, 50371, 49701, 51283, 50547, 44542, 44655]
9984D4655p527j0797n020L270p7j928m397j937M317k41k430J003o185J172J0147
9969B4025M651j2090p464l541Q250N236P384J313l262K134n309k554j243Q739
9955B6269Q000j905q808j821r192J265J352o48l129r320M057j493k132Q334Q511
9940A9340j191j0644M003K62O387Q770j0438j5130l902Q010N188J663R086m710
9926A6694l249L976l272m060k959M686J820k884m48M916O328n885j022O79L987
9911A9307N380L302p323j1032o933J777M205j047P0O964L818n452k69l145N163
9896A4785J734J696k929L420j14r571l140r35k458M25J782j862p573k741j588
9881i069P604J3384J1537o777l697l254J199k993k006k923j389J4384J2219K490
$$ y = [44655, 37128, 26331, 21311, 24581, 24504, 22576, 18179, 16242, 20559, 20318, 17888, 18891, 12706, 13878, 24025, 28676, 16586, 9122, 5581, 13831, 19067, 26451, 27764, 24502, 26636, 21327, 18773, 17530, 26269, 34269, 32364, 23556, 21735, 12543, 13808, 15160, 14512, 11383, 2063, 6120, 4627, 2495, 10829, 19340, 18149, 7505, 11508, 11770, 18157, 26927, 16489, 1359, -2543, 5467, 10655, 12318, 21404, 16694, 13445, 17421, 14149, 10089, 7130, 11816, 13636, 10752, 10304, 15220, 21548, 15663, 14641, 15320, 19307, 24687, 27989, 20666, 9634, 2701, 4478, 8683, 7636, 7706, 14670, 18488, 13036, 12767, 9622, 14785, 16519, 18215, 15286, 18706, 18592, 9021, 5881, 4946, 2488, 2913, 4695, 2833, -4740, -7481, -9069, -1465, 11919, 23456, 16679, 12982, 9728, 10927, 7934, 5928, 3005, 1616, 16000, 28219, 30709]
9867C0709o222j3469q135n564j50n020j688r001P238P438J901n878j0018J604
9853a6255l3N95J1506r37k897Q545j225n029M279P46L482J829j0486m58om28n503
9836a2275J264R961N736r992m857O145n799n43k03K810O844m88R15J0956N65m772
9820F267r521l026R340j121l718o87j938L139N831J155n677m824k032l465k779
9805a3056Q947P292j1830q448N985K297L272j470J24L674n919L432P68K004o972
9790i900J2618Q631l572n077N503m171l248j4766p559j047K4J0662J0915L276
9776B289l982m923J225O788J320o966M240O053l088m171M086M5o22k491L884R245
9760A2932K257l02k38p554K752N542N961J668L627R356J6070N379m695N531l178
$$ y = [30709, 24487, 11018, 2883, -2681, -2831, -7851, -9539, -18540, -11302, -3864, -1963, -7841, -17859, -16255, -16288, -15693, -4187, -5124, -8021, 524, -701, -5730, -1451, -705, 2777, 4606, -5880, -6338, -6344, -6772, -12275, -11011, -1050, 4686, -5306, -10163, -4018, -9817, -10360, -10563, -7753, -909, -1397, -482, 10474, 11039, 6267, -3254, -6280, 3060, 1939, -1779, -2466, -4404, -1265, 4566, 5721, 44, -4780, -6812, -10277, -13056, -4109, 3183, -8647, -17095, -11110, -8813, -5541, -7011, -6887, -3213, -9132, -5700, -4932, -2928, -9900, 2718, 11349, 7777, 2700, 8203, 4032, 784, -13982, -21541, -22588, -22564, -11902, -987, 2289, -1693, -6616, -5391, 1397, 2717, -4249, -9, 6044, 2956, -1215, 2871, 2916, 2294, -197, 3687, 12932, 15189, 14887, 14649, 7095, 9847, 15389, 21350, 23018, 26645, 36001, 52071, 57450, 52755, 58286, 55108]
9745E5108J160P171P995M007Q572J3838O011L084m964o874o775r66m4o517j195
9730G9611n056n460N57m242j7403N647j0235o650j030L520J745O267k135j0094
9716C5042j0657r929j342O440k531p926q257k225k901o991l220Q935L336J826
9702d00J923J1111o78O37N78l876K158L421k343k780m303o971m688K29P637L011
9686D666O32O075M678m100j4642q921N737M706K587L248r65j309J755k362N816
9671G601L58N087M506N80n450j0502Q5O588o61j2497K934J0329j135Q542K970
9656A9335j0050m105r4R06J1054j018m372j4599K110L887j77N94k779r461p92
9641i561R30N179J1076J506J889K616j020L053k71J0095n26l920M231j615m035
$$ y = [55108, 56268, 63439, 71434, 75441, 84013, 97851, 103862, 106946, 101982, 95108, 88333, 87367, 87323, 80806, 79611, 74555, 69095, 69652, 65410, 48007, 53654, 43419, 36769, 35739, 39259, 41004, 47271, 45136, 35042, 24385, 14456, 13114, 19554, 17023, 9097, 840, -1385, -4286, -11277, -14497, -5562, -2226, -400, 1523, 12634, 11956, 12593, 13171, 9295, 11453, 14874, 12531, 9751, 5448, -1523, -6211, -5982, 1655, 4666, 5298, 11373, 16051, 11951, -2691, -11612, -5875, -1169, 1418, 4666, 3701, 2392, 4147, 1785, 7601, 7959, 13046, 17552, 18132, 12682, 2180, 2265, 8853, 8192, -4305, -1371, 8958, 7823, 16365, 19335, 9285, 5180, 5086, 5992, 17046, 16028, 11656, -2943, -833, 3054, 2877, 3471, 692, -8769, -9561, -8631, -3452, 7624, 9130, 11019, 13635, 12615, 15668, 15397, 25492, 24966, 21046, 25277, 23662, 19627]
9626A9627m156K793o759m323m475k941K338K097L757J2483O048m71o422q630l775
9611G191j306k04L273M432M671L814l040m366j0444j614J2694N890j068o82N225
9596B4466o753o309m194j1125p324P335J2261j863j15J325k296L037p955o273
9582e783j053N955P408j883q97J322j676j0809p935L679J1085Q800P838q234n218
9567B599n516l493O651J8723N40j4159o182P26J597k920o015P233J2345j7343
9553e214j1755M989J1676O766r497m785K228L571L62J1064N854m472j1058m076
9539d347K047J962M35P204p55k423k810p59k527L301P961j936o821n436M25K538
9523a941J248J2301Q816o473m001r889M033l893p511o847J222j211k157M119J162
$$ y = [19627, 15471, 18264, 11505, 7182, 2707, -234, 2104, 4201, 7958, 20441, 26489, 26018, 19596, 10966, 7191, 5885, 5681, 8954, 13386, 18057, 21871, 18831, 14465, 4021, 2407, 15101, 20991, 19923, 19241, 24466, 17713, 11404, 7210, -3915, -11239, -3904, 8357, 6494, 6379, 7704, 5408, 8445, 490, -5783, -6836, -881, 6527, 4644, 3747, 5069, 3393, -7416, -15351, -11672, -587, 8213, 16051, 7817, 2599, -2917, -6410, 241, 18964, 19504, 5345, -837, -111, 1486, -1434, -7449, -216, 12129, -5214, -16969, -11980, -304, 6462, -3035, -7820, -5592, -2021, -1659, 9405, 15259, 10787, -271, -4347, -2300, -338, 97, 7301, 6546, 4123, 1313, 554, -1973, 1328, 9289, 7353, 532, -4904, -4479, -1941, -693, 11608, 20424, 13951, 9950, 61, 4094, 201, -7310, -14157, -12935, -14146, -16303, -12184, -11022]
9508a1022J160J3943Q924M126o216n846K382O758k22j0408k448k26m022l951Q936
9493A868Q0l031j5053o224P602J2536K397j3054M490m83j802K848J326M941m661
9478f220N746O445K818j5663l592J0013J712J548O553j0829j738n041J479K820
9464c949j897l169L621N493P209N45o100N367l410j505n51n745j469J114M797
9449C51J64K679J5901n829q856j866q572M708K730o910q580n836M304N525j0164
9434b0251k517M369K441o426m296N975m35l60R188j923J900N101Q335J0409j20
9419A1390j0756P679p458n04R24l695k081j2576K059J1119M474N06q659K126L780
9404a672n724k743R949n251k350O320n26n694m480Q372k161j0990l968r3l469
$$ y = [-11022, -9862, 4081, 13005, 17131, 10915, 5069, 7451, 14209, 13987, 3579, 1131, 905, -3117, -7068, 1868, 1948, -1083, -16136, -22360, -14758, -2222, 175, -12879, -8389, -8872, -10674, -7826, -6500, -1559, -6220, -474, 5971, 8789, -6874, -10466, -453, 1259, 2807, 9360, -1469, -3207, -8248, -6769, -3949, -5846, -9015, -5394, 99, 7308, 7853, 1753, 7120, 3710, 2205, 1654, -4091, -5560, -4446, 351, 515, 3194, 19095, 13266, 4410, 2544, -6028, -1320, 1410, -5500, -14080, -19916, -15612, -10087, -20251, -22768, -18399, -15958, -22384, -26680, -20705, -21140, -21500, -12312, -14235, -12335, -7234, 1101, 11510, 11390, 634, 8313, 855, 351, 1275, -2420, -4501, -17077, -15018, -3899, 575, 1081, -7578, -5452, -1672, -7396, -10139, -190, -5441, -7791, -1471, -1997, -7691, -12171, -3799, -5960, -16950, -20918, -21011, -24480]
9389b4480k42J1158O707k973Q11k303J0398P510j0118l222N148l390J072K896
9375a028Q041n568r496p809k582O550Q197M595q8M845q597p176k052l857O93j737
9359a7069j099J5829j0r505K398O308k032l278Q769k709o126J341p238J102J84
9344a3135m081K370j464J2280M246q625O499J1594K153J864K400l370j0097r346
9330f712k416o02J2191l080p8j08k970r495p868K0806R331r837n745l530M810
9315e303J990J0902Q047R96m354q083l268K190K782o614r48l18l813N135k713
9300c372M848J1198N970L912j1173j6078P728J603k233J1224Q903p678p125J26
9286G853P373j923k327l674j218P867O372N38j0326N566K886R26n059O539n980
$$ y = [-24480, -24722, -13564, -6857, -9830, -9019, -11322, -924, 6586, -3532, -6754, -1606, -4996, -3924, -1028, 7013, 1445, -8051, -15860, -18442, -11892, -3695, 900, 812, 5657, -2940, -10116, -12168, -16025, -15332, -17069, -18168, -2339, -2349, -11854, -9456, -3148, -5180, -8458, 311, -2398, -8524, -7183, -14421, -13319, -13135, -17216, -14846, -16310, -4030, 216, -8409, -1910, 9684, 11837, 13701, 16101, 12731, 2634, -6712, -9128, -9730, 2461, -619, -697, -805, -3775, -13270, -21138, -332, 8999, -838, -6583, -10113, -5303, -3313, 7589, 15636, 16632, 12278, 4195, 927, 3117, 5899, -715, -1663, -1981, -5794, -659, -3372, 1476, 12674, 18644, 22556, 11383, -4695, 3033, 4636, 2403, 13627, 22530, 14852, 7727, 7853, 15226, 13303, 10976, 7302, 6084, 13951, 20323, 20861, 10535, 16101, 18987, 19913, 14854, 21393, 15413]
9271A5413k296M613M958J1216k047p884j2875q047n005L114R958O155j578j183
9257A4512m451n913o978L988J3534P617N547J0075j027j3705j0184m459N04k91
9243H769q359r971N098J2223n638m773N972M232N783m051k044l58N462J816R57
9228A5118M518o64p642k586Q961N275l899j122l996j121p443m429j233N787o844
9213a320l368o407m746P705l84L402L941R542j106K775n855M433J056j99R44r044
9197A369O120J4342k294j0625r496o636J1208R156O923K845J0578L91j5198j492
9183A7191N232Q316Q985m129m413j060j1433K487K352J30J575n02j0157q505Q059
9168A4128L147n770j164M480R00l234O98m970L098L77m028m05J1503k127q055
$$ y = [15413, 13117, 17730, 22688, 33904, 31857, 23973, 11098, 3051, -1954, 1160, 11118, 17273, 15695, 14512, 10061, 4148, -2830, 1158, 14692, 22309, 27856, 37931, 36904, 23199, 13015, 8556, 9060, 8769, 410, -9561, -4463, 7760, 2122, -2651, 3321, 7553, 13336, 9285, 7241, 6883, 12345, 14161, 15118, 19636, 18972, 11330, 8744, 17705, 22980, 19081, 17959, 13963, 12842, 5399, 970, -263, 5524, -1320, -4688, -11095, -15841, -8136, -8520, -5118, -1177, 8365, 7259, 10034, 4179, 8612, 9668, 9469, 10413, 1369, 7489, 21831, 19537, 8912, -584, -7220, 3988, 13144, 20067, 22912, 33490, 33881, 18683, 17191, 22423, 30739, 39724, 35595, 31182, 30122, 18689, 21176, 23528, 23658, 25233, 24731, 14574, 6069, 14128, 17275, 11505, 10341, 14821, 15721, 12487, 13185, 8215, 11313, 11690, 7662, 7257, 18760, 16633, 8578]
9153H578p027m636p104N823k736R936L654O390j559J473o749l517M186K048J078
9138I838N38R908J044J0297o6j292o019o778L919j428l233J729j125m822k424
9123A0086L569K983m367k659m325j096N172O511j408N083q972p512o481p673P399
9108c690N696L089p937p298j861R620J3813P420L799j0840r322l689N421n56J056
9093D721O645m034k885j2395O008P715L912j0318m223j2769n906Q258J2236P700
9079D665J2995L797l780m402q473M827K506p204p342J725P537Q783P823q495r205
9064E757k631l016J1809L645p369O794J871m12k243m44O254j43n877k43N994n345
9048A4401n173j581n809j126o523J4525P465l043K741L550n360l541o211q012
$$ y = [8578, 1551, -3085, -10189, -4366, -7102, 2834, 6488, 12878, 11319, 12792, 6043, 2526, 6712, 8760, 9838, 10376, 20284, 21328, 31625, 31559, 30267, 24248, 17470, 21389, 19961, 16728, 18457, 17332, 12510, 10086, 13655, 16638, 12271, 9612, 5287, 4191, 9363, 15874, 14466, 19549, 10577, 3065, -3416, -11089, -3690, 2006, 5095, -2842, -10140, -12001, -2381, 11432, 18852, 22651, 11811, 2489, -1200, 4221, 3665, 4721, 11366, 7332, 4447, -7948, -1940, 5775, 9687, -631, -4854, -17623, -23529, -15271, -3035, 4665, 17660, 21457, 17677, 13275, 4802, 9629, 12135, 4931, -2411, -686, 6851, 15634, 23457, 14962, 5757, 3126, 110, 11919, 15564, 8195, 14989, 16860, 16448, 14205, 13761, 20015, 19872, 13995, 13752, 19746, 14401, 9228, 7647, 1838, 712, -5811, 8714, 16179, 13136, 15877, 19427, 14067, 10526, 4315, -3697]
9034c697L910j340M920K421J09L11N632j347k595l037J719J428l70k861o187o692
9018g676K569R968J3688L617L802P483O287l009j0704j608J0014L008j4466n043
9004A7930J313j233k475O232k744m061l88J741o055K745K185L74J016l984P541
8989B0137J1736J194m441q892l5q62N7j179j0476Q543Q489J408m256j0769N353
8974A6007J2209R389k890m514o919o596N76k86l633k524L568Q355m644N48m064
8959A4582m8J6820N216p311q935j498k576l081k184N109R911l662o517r63j536
8944A3327L052J2769K995k93M146l19k689p883j0584O239P30l757R37k617N141
8929B1194M15Q36J1471R225l180P496L702l160j4628j049o1o11p281N050J0211
$$ y = [-3697, 213, -1127, 3793, 6214, 6323, 6634, 12266, 10919, 8324, 5287, 7006, 8434, 8064, 5203, -984, -7676, -5107, 4861, 18549, 22166, 25968, 33451, 39738, 36729, 26025, 24417, 34431, 37439, 22973, 17930, 19243, 18010, 15535, 21767, 19023, 14962, 14574, 16315, 10260, 13005, 15190, 15564, 16580, 12596, 20137, 31873, 33067, 28626, 19734, 19699, 18837, 18894, 17715, 7239, 15782, 24271, 25679, 21423, 10654, 16007, 28216, 37605, 34715, 30201, 23282, 16686, 17262, 16976, 13343, 10819, 14387, 22742, 18098, 18646, 14582, 14534, 31354, 36570, 29259, 20324, 18826, 16250, 13169, 10985, 16094, 26005, 22343, 15826, 14863, 13327, 16379, 29148, 32143, 31850, 35996, 35677, 32988, 25105, 14521, 20760, 21490, 17733, 18670, 16053, 21194, 21609, 22445, 33916, 43141, 39961, 47457, 51159, 47999, 33371, 32322, 32261, 31650, 24369, 29419, 39630]
8914C9630J1050q13j647r905o560J055M004m184N3N23Q848j496l064L015L585
8899D4094n52j109n84j374k182p51L744l53K2n434L286L864L502r590k702m070
8883B9811j396J9247J1191M23L988N766Q410M869l227j2856J512Q749l527j7733
8869E5227P95o97K199q314n226P818k455N591P906k779p193P007J0854Q2j3065
8854E7750N211P968o13n511m21K962k649j1631n904L650J0897J225J114l116K675
8839F3607J2271p512p012j4520j719N999j380j2997j0067Q179J1355P657k421
8826E1440r5k842K700R005Q508K003n445k403Q134J0330O921l570O029M023J0574
8811A05312R528J8542J3553M965K0819J3678J8491K7570K3428L2775K8888L0561
$$ y = [39630, 50680, 49867, 48220, 38315, 31755, 32810, 36814, 32630, 32683, 33206, 42054, 40558, 37494, 40509, 44094, 43542, 42433, 41849, 40475, 38293, 37542, 41286, 40933, 40955, 35521, 38807, 42671, 46173, 36583, 33881, 29811, 28415, 47662, 58853, 59276, 63264, 69030, 77440, 82309, 79082, 66226, 67738, 76487, 72960, 55227, 56022, 55325, 57524, 49210, 43984, 51802, 49347, 54938, 62844, 60065, 52872, 59879, 70733, 70815, 57750, 62961, 70929, 70316, 64805, 64384, 67346, 64697, 53066, 47162, 50812, 61709, 62934, 64048, 60932, 63607, 75878, 68366, 61354, 46834, 45115, 51114, 49734, 36737, 26670, 34849, 46204, 53861, 51440, 51345, 48503, 51203, 60208, 68716, 70719, 65274, 62871, 71005, 81335, 88256, 84686, 90715, 94738, 105312, 114840, 133382, 146935, 151900, 172719, 186397, 204888, 232458, 255886, 288661, 317549, 348110]
8799C48110J4183N957M289L895J5001J5264J3473k925q192J538P668l632K894
8786D17523J62J795n036q285j4341k5467j6771j0893k5730k8037k2163j0958j1987
8773B39812k1404j5646l219k073j794J522q04Q660J2833J8252J1630R486L3482
8760B90737L8188M7124N8652O7626O1859N5237M5056L5331L3463K4985Q284J0275
8748G76817N172j655r830k197J1416l458n762j0833q704o164n422q154k5696l6153
8734F69377l9928n3288m9438m2876l8496m0655m2550l0778j5708p205p529j6127
8722B84799j3859o360n778j4642P136J4808J4826L467R800J0715J0076K6868L6113
8709C77969L5823K8627J6340m79l926j007Q710O723m677n041p728o988J687M898
$$ y = [348110, 362293, 368250, 372539, 376434, 391435, 406699, 420172, 417247, 409055, 410593, 418261, 414629, 417523, 417685, 419480, 414444, 406159, 391818, 366351, 349580, 338687, 312957, 284920, 262757, 251799, 239812, 218408, 202762, 199543, 197470, 195676, 197198, 196394, 205054, 217887, 236139, 247769, 257255, 290737, 328925, 376049, 434701, 502327, 564186, 619423, 664479, 699810, 733273, 758258, 766542, 776817, 781989, 780334, 770504, 768307, 779723, 776265, 770503, 759670, 750966, 744802, 739380, 731226, 705530, 669377, 629449, 576161, 526723, 483847, 445351, 404696, 362146, 331368, 315660, 308455, 300926, 284799, 270940, 264580, 258802, 244160, 251296, 266104, 280930, 284397, 294197, 304912, 314988, 341856, 377969, 413792, 442419, 458759, 458280, 454354, 453347, 462057, 468780, 464103, 459062, 451334, 444346, 446033, 450931]
8695D50931J0479l505q354K665r831j2933j9589k2683k8268j4395n080l435l070
8682C32932o931p982j4217j2905j4774j3809Q232o058j1921q630o316j4325j5481
8669B07815o203K000o656j6950k057O746N347k1881j6158j799j285P38J1845P784
8655A69286r13O935K2227J6062K0098K2013K1296K4384K0030Q923J0686J4806
8643C55833O748K8830K1831O518l422j3766j751o321j4924k3971j7731j3172m630
8630C20072o792m72n296j4572r924o808L753J3686J865j278K944P355Q485J2120
8616C25138M345L26K2331K3359J7722J7499J4582J4815K0992K8973K1096O425
8604E17603K852l259j5536j3938p382j9762j8418j2106k6424k7934k5385j2347
$$ y = [450931, 461410, 457905, 449551, 452216, 442385, 429452, 409863, 387180, 358912, 344517, 339437, 336002, 332932, 326001, 318019, 303802, 290897, 276123, 262314, 270546, 264488, 252567, 243937, 237621, 223296, 207815, 201612, 203612, 196956, 180006, 177949, 184695, 190042, 168161, 152003, 150204, 148919, 149657, 161502, 169286, 168373, 175308, 197535, 213597, 233695, 255708, 277004, 301388, 321418, 330341, 341027, 355833, 362581, 391411, 413242, 419760, 416338, 402572, 400821, 394500, 379576, 355605, 337874, 324702, 320072, 313280, 312808, 307512, 292940, 283016, 276208, 279961, 293647, 295512, 294234, 297178, 304533, 313018, 325138, 329483, 329809, 352140, 375499, 393221, 410720, 425302, 440117, 461109, 490082, 511178, 517603, 520455, 517196, 501660, 487722, 480340, 460578, 442160, 430054, 403630, 375696, 350311, 337964]
8592C37964k7109k8624k4038m82p055k1777m583o758j1931j3502o398O645k624
8579A89728m181r15P214J955N518j4464j8132r081L993K699k990Q030R172l122
8565A75424r864J313J3122J079q682L734K085m321m019l423R685l369n873n923
8551A60968R544Q199j584j0646p438j090q062K709M048r384m128l778j371l392
8537A34595j387P578J0602J0627Q877M320J2502N958O964O482J5006J7228O708
8524B46060J127r673m779Q883L057M682N124N407n008K740n441K332J3737J0799
8510B79047J1707K0972K2594J5113K1993J5509K1523J6695P829L397N868M604
8498D46851n564j5133p177j7086m060Q06M006n189p796J0590J5462K7691K5868
$$ y = [337964, 310855, 282231, 258193, 257711, 250656, 228879, 224296, 217538, 205607, 192105, 185707, 192352, 189728, 185547, 184632, 191846, 193801, 199319, 184855, 166723, 157642, 161635, 164334, 161344, 169374, 178546, 175424, 165560, 166873, 179995, 181074, 172392, 176126, 178211, 173890, 169871, 166448, 176133, 172764, 166891, 160968, 170512, 178711, 177127, 166481, 159043, 157953, 149891, 152600, 156648, 147264, 143136, 139358, 137987, 134595, 133208, 140786, 151388, 162015, 170892, 175212, 187714, 193672, 200636, 207118, 222124, 239352, 246060, 247187, 237514, 232735, 241618, 244675, 249357, 254481, 259888, 254880, 257620, 252179, 254511, 268248, 279047, 290754, 311726, 334320, 349433, 371426, 386935, 408458, 425153, 432982, 436379, 442247, 446851, 441287, 426154, 418977, 401891, 397831, 398637, 402643, 397454, 389658, 400248, 415710, 443401, 469269]
8485D69269K1815J6663L4070K4260J9887K0778K0720O423M243m801m858n104m350
8472F19015j785n008j8785j8234j1451q633m0k440J721J002l99L417n806p484
8458E45090p481p930j0382j080j9652k0864k576j828k3440j5816r561l264O680
8445D27896J8468J6684J0632J4748K9031L2780J7926K0429J7783J3865J6078K8
8433F36348l666j231J086k3384j1389j9764k7321j7072j7682k2274j9489j8151
8421D56011j0855j3502k0892k2488k1574k9547l3022k4108j3472j2614j0651j4333
8409B28953j4892r974q147o924L78o71k405p003m542L287p736j640m133L621N525
8394A73697J091P6l679N21J7168M103Q951o670j1868o90k524J268L395N850m83
$$ y = [469269, 491084, 507747, 541817, 566077, 585964, 606742, 627462, 633885, 638128, 633327, 628469, 623365, 619015, 617230, 612222, 593437, 575203, 563752, 555119, 555079, 552639, 554360, 555362, 554963, 558380, 552574, 545090, 537609, 529679, 519297, 518217, 498565, 477701, 475125, 473297, 449857, 434041, 424480, 421216, 427896, 446364, 463048, 473680, 488428, 517459, 550239, 568165, 588594, 606377, 620242, 636320, 636348, 632682, 631451, 632537, 609153, 597764, 578000, 550679, 533607, 515925, 493651, 474162, 456011, 445156, 431654, 410762, 388274, 366700, 337153, 304131, 280023, 266551, 253937, 243286, 228953, 214061, 204087, 195940, 189016, 189394, 188723, 186318, 179315, 174773, 178060, 170324, 168684, 164551, 168172, 173697, 174788, 174864, 171185, 171706, 188874, 192977, 201928, 195258, 183390, 182700, 180176, 181444, 184839, 190689, 190206]
8379A90206K163m170q816r219j6607q949p808n743n634j0071Q18l110k833q492
8365A01735m558P473n171p803q413r757k794J0273j187O296O774o704j4308m012
8351F7844q73p840N012k146r729m466l830L623J049M249K237m684m849l194J750
8336D4153n360K922M811j39K91m828j983L798j62j0456P082R031N034m670M680
8321E4204l800j3180M093J873j136q657j404j90n710O294M937j937j132J0973
8307D5228K635m051L87l341k921M186q56l980o398N277P459j180l754o628L229
8292C5292J0570J961j412j1856J1197J0424n128l380m778J232j943m416q954j035
8278B7774K810K473J144n683n624K724K002J504P98k738K982K68N110j229m34
$$ y = [190206, 192369, 188199, 179383, 170164, 153557, 144608, 136800, 131057, 125423, 115352, 116170, 113060, 110227, 101735, 97177, 104650, 99479, 91676, 83263, 73506, 70712, 80985, 79798, 86094, 92868, 86164, 71856, 67844, 66971, 59131, 64143, 61997, 52268, 47802, 43972, 47595, 48644, 52893, 55130, 50446, 45597, 42403, 44153, 38793, 41715, 46526, 46387, 46678, 41850, 39867, 43665, 43503, 33047, 40129, 49160, 54194, 49524, 54204, 50404, 37224, 41317, 43190, 42054, 33397, 31993, 31803, 26093, 32387, 37324, 35387, 34255, 45228, 47863, 43812, 44199, 40858, 37937, 42123, 41267, 37287, 30889, 36166, 43625, 42445, 38691, 32063, 35292, 45862, 47823, 46411, 34555, 45752, 56176, 51048, 47668, 42890, 44122, 42179, 37763, 28809, 27774, 30584, 33057, 34201, 28518, 22894, 25618, 27620, 29124, 29922, 27184, 30166, 30434, 35544, 34315, 33881]
8263C3881o669J887J703j175n419N622l168K95P225j992R20l504o662m060r043
8248I841N593p180m941L846R042k438P871L332R38Q106p216l220J426J218L677
8233B9895J714o704o93j328N81J1214O89K152j63l304q419k342P087k110n412
8218B2857q065J395J761j605k736m620P398R856M06N063L260k918q248N033j386
8203B7451p211j328J316O924O47n589P278P25j784J2886m985m958J002p645J317
8188B6046P641o82m296O494l934j3645m924K795M837R45J750R39K501P301l888
8173B9880j4949P13R756P827K659o876m231P869O109j495n217O43k545N378N013
8158D0534o225j092r224K602N145J0539k318o728M933j81j1169K37P948K095L176
$$ y = [33881, 27212, 29099, 30802, 29627, 24208, 29830, 26662, 26957, 34182, 32190, 33110, 29606, 22944, 18884, 9841, 15434, 8254, 3313, 7159, 16201, 13763, 21634, 24966, 25904, 34010, 26794, 23574, 25000, 26218, 29895, 31609, 24905, 24212, 22884, 23465, 34679, 35368, 37520, 37357, 34053, 25634, 23292, 30379, 28269, 22857, 14792, 16187, 17948, 16343, 13607, 8987, 16385, 26241, 26647, 31710, 34970, 32052, 23804, 28837, 27451, 20240, 18912, 20228, 27152, 27799, 22210, 29488, 30213, 28429, 41315, 36330, 31372, 32374, 24729, 26046, 33687, 33005, 28709, 35203, 31269, 17624, 12700, 15495, 20332, 21277, 23027, 23966, 26467, 33768, 29880, 14931, 15644, 25400, 33227, 35886, 29010, 24779, 32648, 38757, 37262, 32045, 32688, 30143, 35521, 40534, 34309, 33217, 23993, 26595, 31740, 42279, 39961, 33233, 38166, 37985, 26816, 27053, 35001, 37096, 40272]
8143D0272Q675m502m211J2678o877k977M530M841o925j2192r14K536M691l080
8129C6545N717R967Q729J96J061N637J0698N661L083k213J0093L315n151O655
8115I9993N827o707m041r034j1091j398N562P223M014O341m652o949r781J560
8101G6867L124K041K952q492j0195o768K504J1227J351K373n881L40P854J97M773
8086H4267J1059n304L585J2867O571J1237K1896R717P323J6509J3538P72J203
8073A95240k014j402m394n685j1877p632j3536j7206n397o27L040j2028l929m19
8059A12134N446l720n328n717o940m472j743K975L176N711o00m779J5707J280
8045A13130n909R62J912O932R638R709K278q012k533k527l537Q56J4043Q144l90
$$ y = [40272, 48947, 44445, 40234, 52912, 46035, 43058, 47588, 52429, 45504, 33312, 32398, 34934, 39625, 36545, 42262, 52229, 60958, 61154, 62215, 67852, 78550, 84211, 87294, 85081, 95174, 98489, 93338, 99993, 105820, 99113, 95072, 86038, 74947, 73549, 79111, 86334, 90348, 96689, 92037, 85088, 75307, 76867, 79991, 82032, 84984, 76492, 66297, 59529, 62033, 73260, 74611, 76984, 71103, 71443, 79297, 79494, 84267, 95326, 90022, 93607, 106474, 113045, 124282, 146178, 155895, 163218, 179727, 193265, 194037, 195240, 193226, 191824, 187430, 181745, 169868, 162236, 148700, 131494, 126097, 125470, 128510, 116482, 112553, 112134, 117580, 113860, 108532, 102815, 95875, 91403, 89660, 92635, 95811, 101522, 100922, 96143, 111850, 113130, 107221, 108183, 110095, 117027, 126665, 136374, 138652, 130640, 128107, 125580, 122043, 122899, 136942, 145086, 144696]
8030A44696l102O07j869k134J817L635L24M916J433o92k382o350l129J187o921
8015A32036j181l337l940n998k512O297J340j444l499j4279j1523n447n390j67
8001H0956L534M701Q08J279M736J0027J162o772j0335k718M450j715M140J0015
7987A04268P755k097j423o024J627k087m95k476L242k611N483O638m302O062l911
7972A09649q065o644J14o65m965l194L76r95p523m512l115R58J825l089N948O351
7956H2454N228j4l996p922q314J161J164p91j024o713L044K753n760K121J992
7941F5383j013M720j2493N30J1146p531q965J947N16M4J965J466L953M793k892
7926F3569L89o215o196k973m483p611K248L693K826J910j0890j0007J852P819
$$ y = [144696, 141594, 142201, 140332, 138198, 140015, 143650, 143974, 148890, 150323, 149631, 147249, 140899, 137770, 138957, 132036, 130855, 127518, 123578, 117580, 115068, 121365, 122705, 121261, 117762, 103483, 91960, 86513, 81123, 80956, 84490, 89191, 89999, 91278, 96014, 106041, 107203, 100431, 90096, 87378, 91828, 90113, 94253, 104268, 112023, 109926, 108503, 102479, 104106, 102019, 101524, 99048, 102290, 99679, 105162, 111800, 107498, 113560, 109649, 101584, 94940, 95054, 94389, 89424, 86230, 86606, 85611, 78088, 73576, 70461, 71419, 73244, 70155, 76103, 82454, 87682, 87668, 83672, 75750, 67436, 68597, 69761, 68970, 67946, 61233, 64277, 67030, 61270, 63391, 65383, 64370, 69090, 56597, 57127, 68273, 60742, 51777, 53724, 54240, 54284, 56249, 57715, 61668, 66461, 63569, 63958, 57743, 51547, 48574, 44091, 36480, 38728, 42421, 45247, 47157, 36267, 26260, 28112, 35931]
7912C5931J7532m135p683l733J92K664m974j784L077O153L006Q080k048p215p540
7897C7523Q69j1644j5018P824J5641P301r114J238n676j4609N638P978j3157o63
7883A4131M568m039j2021L467P779M853K998j3830l306J0305m92J537R977M674
7869C0601p14n780p869P876K898m894m61j0137p3K817L851M132K942L441n758
7854B2872r017q29L21j3921j0395L23Q467P597M434N166j0297j3159l3Q816Q441
7839H786p508J2155m347l258Q32K067Q686K460j0260k293K321k105M386K672q358
7824F236O417l131n089m161J825L321r003o982l367K2078L778n809j8594k919
7810a5400R825Q319J4558k08j171l957M239o941n823J971L422K2017K280j2097
$$ y = [35931, 53463, 49328, 41645, 37912, 38104, 40768, 35794, 34010, 37087, 43240, 46246, 54326, 52278, 45063, 37523, 38392, 26748, 11730, 19554, 35195, 42496, 33382, 34620, 28944, 14335, 19973, 27951, 14794, 14131, 18699, 14660, 2639, 6106, 13885, 18738, 21736, 7906, 4600, 14905, 14413, 15950, 25927, 30601, 29887, 24107, 16238, 24114, 27012, 22118, 21657, 11520, 11447, 14264, 18115, 22247, 25189, 28630, 22872, 13855, 13026, 13347, -574, -10969, -10646, -2179, 5418, 9852, 15018, 4721, -8438, -8471, 345, 8786, 1278, 13433, 9086, 5828, 6660, 8727, 17413, 19873, 9613, 7320, 9641, 7536, 11922, 14594, 6236, 12653, 9522, 4433, 272, 2097, 5418, -3585, -10567, -13934, 8144, 11922, 6113, -12481, -15400, -5575, 2744, 17302, 17094, 15923, 11966, 16205, 9264, 3441, 5412, 8834, 30851, 33131, 21034]
7796B1034q088M387M090R787m816k040K146J832r308j1885m408l254O867M977
7782A1321j2023r257L201P42q461n224M256n893k672J0425Q485Q317o330l557
7768f670L942N190k196P36N583K388q090o647m957o580Q17N674O438k625L156
7753c841L842j450j460J5806K065n036o776q859j993R41J1288K505k149n600M344
7738C627j0924O27J366j883L371j920p922j0054L758J5944K78r730J432K774L049
7723f207k053l635j336M816J5435n45r314k527p243p095r258R837O841k758k676
7708a7718R849J104j2881m074J2398j535m295j79l598r87O932N903p899n166j0070
7693c2216j473R81P080K129Q79P626M158K32o153j3710l285J1210O211J725M003
$$ y = [21034, 12946, 17333, 21423, 31210, 26394, 24354, 26500, 28332, 19024, 7139, 2731, -523, 6344, 11321, -702, -9959, -6758, -6016, -14477, -19701, -15445, -21338, -24010, -13585, -5100, 3217, -3113, -6670, -2728, 2462, 266, 1002, 6585, 8973, 883, -5764, -10721, -17301, -16484, -10810, -4372, -6997, -3841, 1, -1449, -2909, 12897, 14962, 9926, 3150, -5709, -7702, -6761, 4527, 7032, 4883, -717, 3627, -7297, -6670, -5304, -7187, -3816, -5736, -13658, -23712, -19954, -4010, -3732, -13462, -12030, -9256, -6207, -8260, -11895, -13231, -8415, 7020, 6475, -2839, -5366, -12609, -19704, -28962, -19125, -12284, -15042, -17718, -7869, -6765, -19646, -23720, -11322, -12857, -17152, -17331, -20929, -21916, -14984, -9081, -16980, -22146, -32216, -33689, -32708, -25628, -23499, -22620, -14994, -10836, -10604, -16757, -30467, -33752, -22542, -16331, -14606, -10603]
7678a0603M235k309K548n643r073k877J1959O641K433p296K202N157j70l439K330
7663c905P902m189k568m00J946J720o653N05r66n747M697m585m874N035K438J850
7647g794m165J258m0p559j832p79O68R032L724j562p454J063m617o167N158K163
7631a8903J028O018p3l669L721O81L934K845r30M165N311o41q198j4174k212M760
7615a6337r43J551J0773L333J420k328j0239j846q9m150m781J25P497l237r20
7600b0171j007P778Q431j2318p440M619o085N429L584J565q418j0629J806O204
7586b6652O197r178r64M079K693J546j44K686Q67O995O505J978k281j868j1289
7571a8830l171j59o09J890p680k4r09q47M377M23K03k154N603M234m87m821O572
$$ y = [-10603, -6368, -8677, -6129, -11772, -20845, -23722, -11763, -5122, -2689, -9985, -7783, -2626, -2796, -6235, -3905, 3997, -192, -2760, -3160, -1214, 506, -6147, -5642, -6608, -12355, -7658, -12243, -17117, -12082, -9644, -7794, -11959, -10701, -10741, -18300, -20132, -20911, -20243, -11211, -7487, -9049, -16503, -15440, -20057, -26224, -21066, -18903, -17875, -11857, -11930, -15599, -11878, -11197, -7263, -4418, -5348, -1183, 4128, 3487, -4711, -18885, -21097, -16337, -17280, -15729, -4956, -1623, -203, -2531, -12770, -14616, -14705, -18855, -23636, -23511, -16014, -19251, -20171, -21178, -13400, -4969, -17287, -24727, -20108, -26193, -20764, -17180, -15615, -24033, -34662, -32856, -26652, -20455, -29633, -30597, -26518, -23825, -22279, -22423, -19737, -18870, -11875, -5370, -3392, -5673, -7541, -18830, -22001, -22160, -22769, -20879, -28559, -28583, -29492, -30339, -25962, -25539, -25336, -27490, -21887, -17653, -18140, -22961, -16389]
7554a6389J400O004L902k568J966N609P43l467o862l894Q3j041L128R27n881j373
7538a7713k985k01P944J4511N035j1158K696q914p969O915m410K136j149j1367
7524b6629J0413P505J026q532l915R3J856K627K32l762J084l325q824m05O186
7509b4370M677K64m426o504k132J480J3500Q157K806J576j3072p188k847n629
7495c3708j706Q346L432N143J739L514J0346n052l310M631p573k802k28j313R959
7480h582K152p858R041O474L650J113j0144p368n393l432P681q962j1286Q010
7466b4904J1874K831j0175j0972N225O586J1956n523K283L683L928J298P035m577
7452E48j264J570j26j2657k980K703M045K423M407M691J84l567o411k252J0345
$$ y = [-16389, -14989, -8985, -5083, -7651, -5685, -76, 667, -2800, -9662, -13556, -13473, -14514, -11386, -10459, -16340, -17713, -20698, -20899, -12955, 1556, 6591, -4567, -1871, -10785, -18754, -11839, -16249, -14113, -15262, -26629, -16216, -8711, -7685, -16217, -20132, -20039, -18183, -15556, -15324, -19086, -18002, -21327, -30151, -30556, -24370, -19693, -19429, -23855, -30359, -32491, -31011, -17511, -9354, -6548, -4972, -18044, -25232, -28079, -33708, -35414, -27068, -23636, -18493, -16754, -13240, -2894, -7946, -11256, -6625, -14198, -17000, -17228, -18541, -8582, -6430, -14288, -5247, 1227, 4877, 5990, -4154, -11522, -16915, -20347, -12666, -21628, -32914, -24904, -13030, -10199, -20374, -31346, -26121, -19535, -7579, -13102, -10819, -7136, -3208, -1910, 5125, 548, -716, 854, 728, -11929, -14909, -12206, -8161, -5738, -1331, 3360, 3544, -23, -6434, -8686, 1659]
7437A659l850m960p417m167L799m289O048P921k574J558L282k061k880j96k943
7422a1070j0705M36O25l504j339P342m971M269R296L174l951k985l517n812l983
7407b6695j931p151L702Q425o12N431o41M85m215M689K129k897M020J7N085p702
7391a7861p81R051l61L680M198m010p438j295q189J591N518K296j435J650M742
7376h644j2948q665p314M837J2259R541R413m15J1353m077m307M356J261l775
7362B875k647l885l424P907M152QL54K092L320M42l492j4144l282J0983K208l135
7346C32m349j564R260P350p147n860P748m705j3060k805M631Q651l171j799p453
7331a3941q99j003L020L919P99M69n131m212q597O349J1176j886J901K247q00
$$ y = [1659, -2191, -7151, -14568, -18735, -14936, -19225, -13177, -5256, -7830, -6272, -2990, -5051, -7931, -8127, -11070, -21775, -21339, -20714, -24218, -25557, -18215, -23186, -18917, -9621, -6447, -10398, -13383, -16900, -22712, -26695, -28626, -35777, -32075, -23650, -24262, -18831, -19472, -18987, -23202, -18513, -16384, -19281, -15261, -15244, -10159, -17861, -18642, -9591, -9952, -6272, -2074, -6084, -13522, -14817, -23006, -21415, -15897, -13601, -15036, -13386, -8644, -21592, -30257, -37571, -32734, -20475, -10934, -1521, -1936, 9417, 5340, 1033, 5389, 6650, 2875, 228, -3657, -7081, 826, 4978, 4986, 5340, 7432, 10752, 11194, 7702, -6442, -9724, 1259, 3467, 332, -4017, -5581, 3679, 11029, 3882, -1978, 5770, 1065, -11995, -14800, -10169, -1518, -4689, -6488, -13941, -14840, -15843, -12823, -8904, -8105, -7636, -12767, -16979, -25576, -19227, -8051, -9937, -8036, -5789, -6589]
7316f589l843o743o888M035K725r132l683M469N204O149K524k633J273K860p384
7301a7656K018k348l748P416R32P718n293L14L717N542r672j4312O337O48M818
7286a3569J1679j1649Q29J556J0792q0m210R314L739l006P4m540m248K379j537
7271b477l484J159j455o037K651n48k027k825M823J1118O67Q90l350m543l321
7256h759L98l012R139M851l232l062R67r137j5332J519P081M126J0118K55m864
7241h944n121n206n791J5807M757Q396j0793q291J192r520m762j130J3113N144
7227a1149P222r023l576L688j989p129L935j21K34K900N751k830k935p063P39
7212b1346k071L554J665Q834m701j452P199j905J000M065q473K531k546o110P91
$$ y = [-6589, -10432, -17175, -24063, -20028, -17303, -26435, -30118, -25649, -20445, -14296, -11772, -14405, -13132, -10272, -17656, -15638, -17986, -21734, -14318, -13386, -5668, -10961, -10647, -6930, -1388, -11060, -25372, -19035, -18387, -13569, -1890, -13539, -12710, -11154, -362, -442, -4652, 4662, 8401, 5395, 5469, 929, -3319, -940, -2477, -5961, -4802, -6257, -12294, -9643, -10191, -12218, -15043, -10220, 898, 1565, 2455, -895, -5438, -8759, -8361, -11373, -2234, 2617, -615, -3677, -2710, -11847, -27179, -25660, -18579, -14453, -4335, -4080, -8944, -14065, -19271, -25062, -9255, -4498, 3898, -6895, -15186, -13994, -23514, -28276, -29406, -16293, -11149, -3927, -12950, -16526, -12838, -14827, -21956, -18021, -18142, -17908, -15008, -9257, -12087, -15022, -22085, -21346, -23417, -19863, -18198, -9364, -14065, -15517, -8318, -10223, -9223, -5158, -13631, -11100, -13646, -19756, -18965]
7197a8965M785J583m04o815j651n07l628J789Q199J0181m692L842L05q388L029
7182a1337m836L469l737Q800J165J150J140r988o272N38q461q069l791L602L991
7167c2636J483J728R023M090J122L631n209l967m892J241O090J477L638J828n653
7152a7006j600m466J645N534o277l376Q014Q212O182K020j871L853k666J835p92
7137g59K467n866m717j735q215j7549k613P796O234N575O23j460q877l386P447
7122b5035M040K540k873L46K175J473N36N038N267L729J864j2470R809j18o192
7107i871k714K354J43J74k195l780l550j776L168P930P728J956k924L397j0083
7092a0043p881K548K477n116P151R709P591p332r123n491n673R601L513j0277
$$ y = [-18965, -14180, -12597, -13001, -19816, -21467, -21974, -25602, -23813, -15614, -5433, -10125, -6283, -5978, -14366, -11337, -16173, -12704, -16441, -7641, -6476, -5326, -4186, -14174, -20446, -19908, -28369, -36438, -40229, -36627, -32636, -31153, -29425, -20402, -16312, -15190, -11559, -16768, -20735, -25627, -24386, -18296, -16819, -13181, -11353, -17006, -18606, -23072, -21427, -15893, -22170, -25546, -17532, -9320, -3138, -1118, -2989, 864, -1802, 33, -759, 1708, -4158, -8875, -10610, -18825, -36374, -38987, -31191, -24957, -19382, -18759, -20219, -29096, -32482, -25035, -20995, -18455, -21328, -20982, -18807, -17334, -16798, -11760, -6493, -2764, -900, -13370, -3561, -3679, -9871, -12585, -10231, -10088, -9914, -12109, -15889, -19439, -21215, -18047, -10117, -2389, -433, -3357, 40, -10043, -17924, -15376, -12899, -18015, -10864, -1155, 6436, -896, -10019, -15510, -21183, -11582, -8069, -18346]
7078a8346n431k938M859o50K498K084P507K845l994p103P941P184L51o475J0580
7063I12k690q104r61P846l212j2430m986P440m196J457m733L62K771N436j694
7048a6782m434l330O753P662Q171j1633q315k236N493L554J973J484L390L922
7034d328Q566L540m641n034o473o003l211J0973J96J601m041k282j422o72L769
7019i462j025O818M532N354M865j4482j2801R66J391L445o670M016l36K624m68
7004a1233q55N425P769M065o255p44o368j7510M003Q494q7l682J317p836l356
6989b6853j56J1553M429M67Q570M095P71j0485N49M803j370n560k302j699k954
6974a6142j494R4K316M299O725P038n584N00N116R93m351N563o709j445r463n772
$$ y = [-18346, -23777, -26715, -21856, -22506, -20008, -17924, -10417, -7572, -11566, -18669, -10728, -3544, -3193, -9668, 912, -1778, -9882, -10843, -2997, -6209, -18639, -23625, -16185, -20381, -18924, -23657, -23295, -20524, -15088, -16782, -21216, -24546, -17793, -10131, -1960, -13593, -21908, -24144, -18651, -15097, -13124, -11640, -8250, -4328, 4238, 7778, 3137, -1897, -8370, -14373, -17584, -6611, -6415, -4814, -8855, -11137, -12559, -13231, -9462, -10487, -3669, 863, 6217, 11082, -3400, -16201, -15235, -13844, -10399, -17069, -13053, -13389, -10765, -11233, -12088, -6663, 1106, 5171, -1084, -1828, -8196, -25706, -21703, -13209, -13296, -16978, -15661, -23497, -26853, -27009, -15456, -11027, -10560, -1990, 2105, 2876, -7609, -7060, -2257, -3627, -9187, -11489, -13188, -16142, -17636, -17542, -15226, -10927, -4202, 2836, -2748, -2248, 2868, 3861, -490, 5073, -1636, -3081, -12544, -18316]
6958a8316j57k436K339Q023n486M735R035n169j4470j5794Q449J3900j459K741
6944a4065N903M54J0625J7176o190j1822o53o413N624o507r154j559N350R366
6930a865J621n431q717J323J147R57N059m493q350M294N177L685K40O98n94q400
6914a3649k955L313n45K03J5472O754l496M989J143p883r921k685M000m773m217
6899a4250k750R219m523p820M153M483l462L186J679K992j4736p498q64J622J2688
6884a5881O394p066j168N330q150P471R62P024M150o907k972J560o874l168M859
6869a4436N211K441m662j142j056j877J652m354j95Q527n891j714R802N488j635
6854c841q440J004J947l653n00M918l046J1634n117J761J0005l242o03m691L855
$$ y = [-18316, -18473, -20909, -18570, -10547, -16033, -11298, -2263, -7432, -21902, -37696, -29247, -15347, -16806, -14065, -8162, -7708, 2917, 20093, 13903, 2081, 1428, -4985, 639, -5868, -15022, -16581, -11231, -1865, -244, -5675, -14392, -13069, -11922, -10965, -5906, -10399, -18749, -14455, -9278, -5593, -5353, -4655, -5249, -13649, -16604, -13291, -13836, -13633, 1839, 8593, 5097, 10086, 11229, 3346, -6575, -9260, -5260, -10033, -14250, -17000, -7781, -12304, -20124, -15971, -11488, -14950, -11764, -10085, -7093, -21829, -29327, -30191, -28569, -15881, -9487, -16553, -17721, -12391, -20541, -13070, -12108, -5084, -934, -7841, -10813, -9253, -16127, -19295, -14436, -9225, -6784, -11446, -12588, -13644, -15521, -13869, -18223, -18418, -9891, -15782, -17496, -7694, -2206, -3841, -12281, -11277, -9330, -12983, -13483, -8565, -11611, 23, -5094, -3333, 6672, 3430, 2827, -1864, 1991]
6839A991R487P385L87l078l176o009j4105K134l978n823j548q402n859N135O866
6824a8593O969m505L511R872K725j208o919j014Q89n76N903P90M934R051l843
6809G986n487J3260o0l476P21J308j8910l505m984J5660J4755o999j0068n508
6795e307j982l004N71N360o110M072l429L943O947m275n960J4573J0352j0535
6781E216N736Q16P549K8075K5676K5721L4103J7858J3952J9199J6537J6655J8885
6768B35978m705l9096m2429k6648k3374j2490p793j6619q097q004k7428j7101
6756B194j5475n737J0000P809R530L65M218j649R82j236p48J0085j3033j1409
6742d104l041l513o963J3406k824m966P077O812m175q537l125J676k912l232P753
$$ y = [1991, 11478, 18863, 19250, 16172, 12996, 6987, -7118, -4984, -8962, -14785, -16333, -24735, -30594, -25459, -18593, -11624, -16129, -12618, -2746, -21, -1229, -8148, -9162, -8273, -8849, -2946, -2156, 2778, 11829, 7986, 2499, 15759, 15699, 12223, 12944, 14252, -4658, -8163, -13147, 2513, 17268, 10269, 201, -5307, -7289, -10293, -9722, -4362, -10472, -6400, -9829, -5886, 1061, -3214, -9174, 5399, 15751, 5216, 10952, 11768, 19317, 47392, 73068, 98789, 132892, 150750, 164702, 183901, 200438, 217093, 235978, 231273, 192177, 149748, 123100, 99726, 87236, 79443, 62824, 54727, 46723, 19295, 2194, -13281, -19018, -9018, -1209, 8321, 8686, 12904, 11255, 12237, 11001, 10253, 20338, 7305, -4104, -7145, -10658, -17621, -4215, -7039, -12005, -4928, 1884, -2291, -10828, -13953, -12277, -15189, -18421, -10668]
6727a0668L354P838R108l456N228J1257J2535l532q154o540o048n855l22j0269
6713e524J981J0643p28l153k171j1720L623Q461l988o269p985m264p04N607P261
6698h930L742j2419p55q9R064k61J906L87K293j94m785J306J1421k630m158m783
6682h885n205k46k839j331M263j131O161M68O58j604K177L653m034r28j960L345
6666g438m26j241L200L540L207j779k021K608O794K331q682j552K107L884n35
6651C997k396k075m314m93P92k305k761J2102j112k37j3344m823n033J595R359
6636a1048m389o68O413L46p521O388n288O726Q591R37l248P631M455n372m345
6621c92P44m052q936j535J938o72O209j492n109K897M818l339m375m841O799M849
$$ y = [-10668, -7314, 524, 9632, 6176, 11404, 22661, 35196, 31664, 23510, 16970, 10922, 5067, 4745, -5524, -3543, 7100, 6372, 3219, 1048, -10672, -7049, 1412, -2576, -8845, -16830, -21094, -21798, -16191, -8930, -5188, -17607, -18362, -18451, -9387, -9648, -7742, -7355, -5062, -5256, -10041, -8735, 2686, 56, -4102, -8885, -14090, -14336, -17175, -18506, -14243, -15374, -9213, -8745, -8087, -9691, -7514, -3861, -7895, -8823, -10783, -7438, -7864, -9105, -5905, -2365, 842, -937, -2958, -350, 6444, 8775, 93, -1459, 648, 4532, 3997, 1601, -474, -4788, -5281, -4489, -6794, -9555, 2547, 1435, 1198, -12146, -16969, -22002, -20407, -11048, -15437, -16105, -9692, -9346, -16867, -10479, -15767, -9041, -450, 487, -2761, 4870, 9325, 3953, -392, 352, -3700, -12636, -14171, -12233, -12905, -6696, -8188, -13297, -10400, -5582, -8921, -13296, -18137, -11338, -6489]
6605f489l866k600n046J309L43Q055M472k745p631M794J162l061j2190N083Q420
6590i990L756J749q66r829l050L225K98J287n70m636j45M580Q131r034q052N449
6574a7697J136K080N777O569J997k458j0184q533N237r684j571K027N080j0876
6560c1100p38J4617L243m38m183J582o124o62q404K079R568J1093j360L582p782
6545a5027k448J6972p257j0043j256l55K869k809j536N195L09M771J167n867J0317
6530d998Q117r403l550p24k050p757M497K674k24L707J3969m338q533J898J077
6515e638l018N259j997o219M356J3502P806m287k105l127p841j456o958r587j544
6500b2854k331M055J0939R209M244k054l923M851k85L006l1k988j5169j0685Q071
$$ y = [-6489, -10355, -12955, -18001, -16692, -16349, -8294, -3822, -6567, -14198, -9404, -8242, -11303, -23493, -18410, -9990, -6234, -4485, -5351, -15180, -18230, -15005, -14707, -13420, -13990, -18626, -18771, -14191, -6060, -15094, -23146, -17697, -16561, -14481, -8704, -2135, -138, -2596, -12780, -21313, -16076, -25760, -27331, -25304, -20224, -31100, -31838, -17221, -13978, -14416, -18599, -17017, -23141, -23803, -32207, -30128, -20560, -9467, -10827, -7245, -15027, -17475, -503, -7760, -17803, -19059, -19414, -16545, -19354, -20890, -15695, -15386, -10615, -9448, -15315, -4998, 3119, -6284, -9834, -10558, -12608, -20365, -15868, -13194, -13418, -9711, 4258, -80, -8613, -6715, -5638, -8656, -3397, -5394, -11613, -7257, 6245, 14051, 9764, 7659, 4532, -3309, -4765, -11723, -21310, -22854, -25185, -21130, -10191, -982, 3262, 1208, -2715, 2136, 1851, 4857, 4826, 1838, -13331, -24016, -15945]
6485a5945n200k596m063k689J2872L816j1288K193R36K483P364J4488J547O803
6471A0721L997j0716q10L82j7641q141J272R140Q380J221o05l776q932m751k38
6456b0497K353M01j134P38N017k354p105K1L097j16P151L499K234k545p327n198
6440b1765k414R373K383L581L004j393J107N723o01j1282n066j02R750k379p157
6425a7238M282m108l18J756L587K781M196l47o51J042n72M508m501m73q784L986
6409a0854J3054J5028j075m698j782j4876r422J525M634k798k335K387J0959o33
6395h86m786m498p949m790K061L388R550P742J1754m782q004l594j008J703j1550
6380a5649J539N120K375o411n524J94q004L994K326j337R867J038Q391Q422m258
$$ y = [-15945, -21145, -23741, -27804, -30493, -17621, -13805, -25093, -22900, -21964, -19481, -12117, 2371, 3918, 10721, 14718, 4002, 3192, 3574, -14067, -22208, -20936, -11796, -3416, -2195, -2800, -6576, -15508, -20259, -20497, -18144, -17743, -18877, -18139, -13122, -15476, -22581, -22560, -19463, -19579, -12428, -8929, -6695, -9240, -16567, -21765, -24179, -14806, -12423, -8842, -5838, -7231, -6124, -401, -1002, -12284, -17350, -17452, -7702, -10081, -17238, -12956, -17064, -17382, -15626, -12039, -9258, -5062, -5409, -6060, -5018, -5590, -1082, -5583, -6056, -14840, -10854, 2200, 17228, 16153, 11455, 9673, -5203, -14625, -13100, -8466, -11264, -13599, -11212, -253, -886, -5672, -10170, -18119, -22909, -20848, -17460, -7910, -168, 11586, 6804, -1200, -4794, -5802, -4099, -15649, -14110, -8990, -6615, -13026, -18550, -18356, -26360, -22366, -20040, -21377, -11510, -10472, -2081, 6341, 2083]
6365B083p338M644O175Q32n045p004l328J904L869j1350j1169R814k840j3118
6351c1871N689Q089J3848l340n46r263l389P352O916o457P646N299q523r974j759
6336b0283P968r512j967j012K095R717J3252Q938p654n823K102j1398j2024N73
6322b5028j655N325o94K038P060J1855M85J752n988j0021J3822Q701O88r682j1113
6307a2455k297K359N432L51L575j47o093n160M356n61j4948N570K535Q106O794
6292b583j0759q380N912J032j769K55M16n502k715l73R74M297N088J0240J531
6277b336k86o791q716j0220J844K0382N654n260p090l085P158n47J216p43k530
$$ y = [2083, -5255, -611, 5564, 6396, 1351, -5653, -8981, -7077, -3208, -14558, -25727, -15913, -18753, -31871, -26182, -18093, -4245, -7585, -8131, -17394, -20783, -13431, -6515, -12972, -5326, -27, -8550, -18524, -20283, -12315, -21827, -23794, -24806, -22711, -12994, 258, 9196, 1542, -4281, -2179, -13577, -25601, -25028, -26683, -21358, -22052, -20014, -12954, -1099, -614, 1138, -4850, -14871, -1049, 7652, 8340, -1342, -12455, -14752, -12393, -6961, -6610, -3035, -3182, -9275, -14435, -10079, -10640, -25588, -20018, -17483, -9377, -2583, -13342, -21722, -15810, -14778, -16547, -16292, -15876, -21378, -24093, -24466, -23492, -19195, -14107, -3867, -2336, -2622, -9413, -18129, -28349, -26505, -6123, -469, -5729, -12819, -15904, -8746, -9293, -8077, -8820, -11350]
$$ [...]
##END NTUPLES=NMR SPECTRUM
##END=
