##TITLE=Analysis number 327686
Compound Code cc 23809
Book Reference 486/132
Project Code adrs
Chemist Name simons
##JCAMPDX= 6.0         $$ Bruker NMR JCAMP-DX V2.0
##DATA TYPE= NMR SPECTRUM
##DATA CLASS= NTUPLES
##ORIGIN= Bruker BioSpin GmbH
##OWNER= nmr
$$ XWIN-NMR		Version 3.5
$$ Fri Mar 30 14:21:58 2007 GMT Daylight Time (UT+1h)  MAYBRIDGE\nmr@NMR_250MHZ
##.OBSERVE FREQUENCY= 250.131544655141
##.OBSERVE NUCLEUS= ^1H
##.ACQUISITION MODE= SIMULTANEOUS (DQD)
##.ACQUISITION SCHEME= undefined
##.AVERAGES= 16
##.DIGITISER RES= 18
##SPECTROMETER/DATA SYSTEM= dpx250
##.PULSE SEQUENCE= zg30
##.SOLVENT NAME= CDCl3
##.SHIFT REFERENCE= (INTERNAL, CDCl3, 0, 16.522)
##AUDIT TRAIL= $$ (NUMBER, WHEN, WHO, WHERE, WHAT)
$$ ##TITLE= Audit trail, XWIN-NMR		Version 3.5
$$ ##JCAMPDX= 5.01
$$ ##ORIGIN= Bruker BioSpin GmbH
$$ ##OWNER= nmr
$$ C:\u/data/dgb/nmr/ADRS/2810/pdata/1/auditp.txt
$$ ##AUDIT TRAIL=  $$ (NUMBER, WHEN, WHO, WHERE, WHAT)
(   1,<2007-03-30 14:21:29.36 +100>,<MAYBRIDGE\nmr>,<NMR_250MHZ>,
      <created by zg, POWCHK disabled, PULCHK disabled
       configuration hash MD5:
       49 4B E0 1D 92 C2 6B 37 9F E6 65 BC 52 41 86 1D
       data hash MD5: 64K
       AE 1C 62 5F 12 A5 15 5B 50 9A C2 02 4E 09 B6 9A>)
(   2,<2007-03-30 14:21:46.11 +100>,<MAYBRIDGE\nmr>,<NMR_250MHZ>,
      <Start of raw data processing
       ef LB = 0.3 FT_mod = 6 PKNL = 1 SI = 32K 
       data hash MD5: 32K
       42 0F 15 8C A6 6F 3B 4F BD 5F 86 70 15 02 09 9A>)
(   3,<2007-03-30 14:21:49.28 +100>,<MAYBRIDGE\nmr>,<NMR_250MHZ>,
      <apk 
       data hash MD5: 32K
       9C 36 CA BC EE C5 69 50 55 0F 3E F0 DB 93 1E 16>)
(   4,<2007-03-30 14:21:49.96 +100>,<MAYBRIDGE\nmr>,<NMR_250MHZ>,
      <abs ABSG = 5 
       data hash MD5: 32K
       94 34 37 24 8E 77 5D D4 88 1A 87 48 18 1B 23 23>)
$$ ##END=
$$ 
$$ hash MD5
$$ 1C AD 35 F9 0F B4 9E 03 84 BA 2C 5E 57 11 FF 1B
##$RELAX= 
##$RELAX= 
##$RELAX= 
##$RELAX= 
##$RELAX= 
##$RELAX= 
##$RELAX= 
$$ Bruker specific parameters
$$ --------------------------
##$DU= <C:\u>
##$EXPNO= 2810
##$NAME= <ADRS>
##$PROCNO= 1
##$TYPE= <nmr>
##$USER= <dgb>
##$AMP= (0..31)
100 100 100 100 100 100 100 100 100 100 100 100 100 100 100 100 100 100 
100 100 100 100 100 100 100 100 100 100 100 100 100 100 
##$AQSEQ= 0
##$AQ_mod= 3
##$AUNM= <au_zg>
##$AUTOPOS= <22 >
##$BF1= 250.13
##$BF2= 250.13
##$BF3= 250.13
##$BF4= 250.13
##$BF5= 500.13
##$BF6= 500.13
##$BF7= 500.13
##$BF8= 500.13
##$BYTORDA= 1
##$CFDGTYP= 0
##$CFRGTYP= 5
##$CHEMSTR= <none>
##$CNST= (0..31)
1 1 145 1 1 1 1 1 1 1 1 1 1 1 1 1 1 1 1 1 1 1 1 1 1 1 1 1 1 1 1 1 
##$CPDPRG= <>
##$CPDPRG1= <>
##$CPDPRG2= <>
##$CPDPRG3= <>
##$CPDPRG4= <mlev>
##$CPDPRG5= <mlev>
##$CPDPRG6= <mlev>
##$CPDPRG7= <mlev>
##$CPDPRG8= <mlev>
##$CPDPRGB= <>
##$CPDPRGT= <>
##$D= (0..31)
0 1 0 0 0 0 0 0 0 0.06 0 0 0 0 0 0 0.0002 0 0 0 0 0 0 0 0 0 0 0 0 0 0 
0 
##$DATE= 1175260887
##$DBL= (0..7)
120 120 120 120 120 120 120 120 
##$DBP= (0..7)
150 150 150 150 150 150 150 150 
##$DBP07= 0
##$DBPNAM0= <>
##$DBPNAM1= <>
$$ [...]
##$SUBNAM7= <"">
##$SUBNAM8= <"">
##$SUBNAM9= <"">
##$SW= 20.6930455092707
##$SWIBOX= (0..15)
0 0 3 0 0 0 0 0 0 0 0 0 0 0 0 0 
##$SW_h= 5175.983436853
##$TD= 65536
##$TD0= 1
##$TE= 683.16
##$TE2= 300
##$TE3= 300
##$TEG= 300
##$TL= (0..7)
0 120 120 120 120 120 120 120 
##$TP= (0..7)
150 150 150 150 150 150 150 150 
##$TP07= 0
##$TPNAME0= <>
##$TPNAME1= <>
##$TPNAME2= <>
##$TPNAME3= <>
##$TPNAME4= <>
##$TPNAME5= <>
##$TPNAME6= <>
##$TPNAME7= <>
##$TPOAL= (0..7)
0.5 0.5 0.5 0.5 0.5 0.5 0.5 0.5 
##$TPOFFS= (0..7)
0 0 0 0 0 0 0 0 
##$TUNHIN= 0
##$TUNHOUT= 0
##$TUNXOUT= 0
##$USERA1= <user>
##$USERA2= <user>
##$USERA3= <user>
##$USERA4= <user>
##$USERA5= <user>
##$V9= 5
##$VALIST= <valist>
##$VCLIST= <CCCCCCCCCCCCCCC>
##$VD= 0
##$VDLIST= <DDDDDDDDDDDDDDD>
##$VPLIST= <PPPPPPPPPPPPPPP>
##$VTLIST= <TTTTTTTTTTTTTTT>
##$WBST= 1024
##$WBSW= 4
##$XGAIN= (0..3)
0 0 0 0 
##$XL= 0
##$YL= 0
##$YMAX_a= 200882
##$YMIN_a= -352777
##$ZGOPTNS= <>
##$ZL1= 120
##$ZL2= 120
##$ZL3= 120
##$ZL4= 120
##$ABSF1= 16.522
##$ABSF2= -4.171173
##$ABSG= 5
##$ABSL= 3
##$ALPHA= 0
##$AQORDER= 0
##$ASSFAC= 0
##$ASSFACI= 0
##$ASSFACX= 0
##$ASSWID= 0
##$AUNMP= <proc_1d>
##$AZFE= 0.1
##$AZFW= 0.1
##$BCFW= 0
##$BC_mod= 0
##$BYTORDP= 0
##$COROFFS= 0
##$CY= 12.5
##$DATMOD= 1
##$DC= 0
##$DFILT= <>
##$DTYPP= 0
##$F1P= 14.0000005364418
##$F2P= -0.99999901652339
##$FCOR= 0.5
##$FTSIZE= 32768
##$FT_mod= 6
##$GAMMA= 0
##$GB= 0
##$INTBC= 1
##$INTSCL= 1
##$ISEN= 128
##$LB= 0.3
##$LEV0= 0
##$LPBIN= 0
##$MAXI= 10000
##$MC2= 0
##$MEAN= 0
##$ME_mod= 0
##$MI= 0
##$NCOEF= 0
##$NC_proc= -4
##$NLEV= 6
##$NOISF1= 0
##$NOISF2= 0
##$NSP= 0
##$NTH_PI= 0
##$NZP= 0
##$OFFSET= 16.522
##$PC= 1
##$PHC0= 233.2092
##$PHC1= 12.94615
##$PH_mod= 1
##$PKNL= yes
##$PPARMOD= 0
##$PSCAL= 4
##$PSIGN= 0
##$REVERSE= no
##$SF= 250.13
##$SI= 32768
##$SIGF1= 0
##$SIGF2= 0
##$SINO= 400
##$SIOLD= 32768
##$SREGLST= <1H.CDCl3>
##$SSB= 0
##$STSI= 32768
##$STSR= 0
##$SW_p= 5175.98343685301
##$SYMM= 0
##$S_DEV= 0
##$TDeff= 65536
##$TDoff= 0
##$TI= <Analysis number 999999
Compound Code 99
Book Reference 9
Project Code 9>
##$TILT= no
##$TM1= 0
##$TM2= 0
##$TOPLEV= 0
##$USERP1= <user>
##$USERP2= <user>
##$USERP3= <user>
##$USERP4= <user>
##$USERP5= <user>
##$WDW= 1
##$XDIM= 32768
##$YMAX_p= 534683288
##$YMIN_p= -315049
$$ End of Bruker specific parameters
$$ ---------------------------------
##NTUPLES= NMR SPECTRUM
##VAR_NAME=  FREQUENCY,     SPECTRUM/REAL,   SPECTRUM/IMAG
##SYMBOL=    X,             R,               I
##VAR_TYPE=  INDEPENDENT,   DEPENDENT,       DEPENDENT
##VAR_FORM=  AFFN,          ASDF,            ASDF
##VAR_DIM=   32768,         32768,           32768
##UNITS=     HZ,            ARBITRARY UNITS, ARBITRARY UNITS
##FACTOR=    0.157963299565203, 1,           1
##FIRST=     4132.6476996994, 0,             0
##LAST=      -1043.33573715361, 0,           0
##MIN=       -1043.33573715361, -315049,     0
##MAX=       4132.6476996994, 534683288,     0
$$ Real data points
##PAGE= N=1
##DATA TABLE= (X++(R..R)), XYDATA
$$ [...]
18340A7352220K254247J978936J824418K393675L889613O037596Q412644R903855
18332E4047204R373534R441782J1362180J1448227N383451j470826l483938m027459
18324I2074155p232315j0238270j0164972p886469n950670m910334l618066j788149
18316D0284910o23292j082412k166525k359494j969350j754393j262148m15966
18308B8651330J143820L405563O214450R216092J1626534J2232604R354154L807756
18300H5652303k428437q647811j1205951j1069978q082835l993227J7811L725034
18292D3966909P204762J0391638J2893482J4687104J3825458Q462533J319779
18285A12751665o204882r678955r709769p772990m187726P67002M821993M381418
$$ y = [17352220, 19606467, 21585403, 23409821, 25803496, 29693109, 35730705, 44143349, 54047204, 63420738, 72862520, 84224700, 95672927, 101056378, 99585552, 96101614, 92074155, 84841840, 74603570, 64438598, 56552129, 50601459, 45691125, 42073059, 40284910, 39661618, 38579206, 36412681, 34053187, 32083837, 30329444, 29067296, 28651330, 29795150, 33200713, 39415163, 48631255, 60257789, 72490393, 81844547, 85652303, 83223866, 74576055, 63370104, 52300126, 44217291, 40224064, 40241875, 43966909, 51171671, 61563309, 74456791, 89143895, 102969353, 111431886, 112751665, 106546783, 96867828, 87158059, 79385069, 75197343, 75964345, 80786338, 85167756]
18277H5167756J078631P61515J645839j664975q087215j0746726r817416q340134
18269D9997275q321567p856054o461251m467929k709613j550282j085332j285768
18261A6259479j468305j488093j460197j507988j519953j337602j121006q99252
18253E457083o58662n44015l80569k13272k15097k33887k95149k62650k14986
18244B438796k42645k41572k01822j44126j04827p6204j02430p6025J0330j367
18234A258108p3235p0486n0442k1884n6268q3598j30051n3548P7972K1693J669
18223H19930L4474J3633n2581P0407N7736j02436r0623O3971r152l8887j1567
18212G54905j9293l8823r629r52N1020L2037j5494m6116O456L651J4351j05980
$$ y = [85167756, 86246387, 87007902, 88653741, 86988766, 78901551, 68154825, 58337409, 49997275, 41675708, 33819654, 27358403, 22890474, 20180861, 18630579, 17545247, 16259479, 14791174, 13303081, 11842884, 10334896, 8814943, 7477341, 6356335, 5457083, 4798421, 4254406, 3873837, 3660565, 3445468, 3211581, 2916432, 2653782, 2438796, 2196151, 1954579, 1752757, 1608631, 1503804, 1427600, 1325170, 1249145, 1259475, 1258108, 1184873, 1114387, 1063945, 1042061, 985793, 902195, 772144, 718596, 796568, 818261, 819930, 854404, 868037, 815456, 885863, 943599, 841163, 750540, 814511, 805359, 766472, 754905, 735612, 696789, 687160, 686208, 737228, 769265, 753771, 707655, 714111, 717762, 732113, 626133]
18200F26133q0339L7535P602j8656l2430n194j7825l5466m0037J276k375L6657
18188D76881J8359O0609o027l1552O905j9722J3064J6587M0688k732J3406p477
18176E78989j23747m822J45775k1646K1928k461m3809l4169o8905O8382P9918
18165E95433k7380J1612J2129k5175K0059O9110j1947n0367O6725J16067L8200
18154H14466K0415n3291Q077J8068m4575q2308m0189Q1989O8006K3496l5897J15158
18142H93415N3856K8524J1264L7337J29709J09646K1461L0720P5083L3791Q4798
18131A509604P4176O9785K16355K36254J81332J73848J84043L93293O35764P36220
18121D410674P37206R15561J222646J508291J904265K865609M174166N728343
$$ y = [626133, 545794, 583329, 590931, 572275, 539845, 534651, 516826, 481360, 441323, 442599, 440224, 476881, 495240, 555849, 549822, 518270, 525175, 505453, 518517, 535104, 575792, 573060, 586466, 578989, 455242, 450420, 596195, 574549, 596477, 594016, 550207, 516038, 447133, 515515, 595433, 568053, 579665, 591794, 566619, 586678, 655788, 643841, 593474, 660199, 776266, 814466, 834881, 781590, 789667, 807735, 763160, 680852, 640663, 722652, 790658, 814154, 778257, 893415, 947271, 975795, 987059, 1024396, 1154105, 1263751, 1285212, 1315932, 1391015, 1424806, 1509604, 1583780, 1653565, 1869920, 2106174, 2287506, 2461354, 2645397, 3038690, 3674454, 4410674, 5147880, 6063441, 7286087, 8794378, 10698643, 13564252, 17738418, 23466761]
18113B3466761P406863R930563J5454460K6276852M0290464L7740641K59837l1529001
18105A29297440m3030943l3453859j8671299j0125348o042635m022816k861086
18098A1089454k107625j571874j284973q46715o26184n09104m42594l36305l03051
18089C061029l53496l54024k55072k39015j40732k10571j91727m5857j12588j61056
18079I96891j32325n0421j9875M5562k2556j16680j03090m1175l854k9931P709
18068E30255M0768J6022M3935K4929R755j36544r4415m3940l8128o583l2565o4764
18056B48725m7681J3909l2484l9864P262M5334J3875J89k5026O1616J14504K7926
18044C88285j39832l7151N2839o641J4127M5239j9480k0817o4926R9350J5082
$$ y = [23466761, 30873624, 40804187, 56258647, 82535499, 122825963, 160566604, 160826441, 129297440, 86266497, 52812638, 34141339, 24015991, 17973356, 13950540, 11089454, 8981829, 7409955, 6124982, 5278267, 4652083, 4142979, 3700385, 3364080, 3061029, 2707533, 2353509, 2098437, 1859422, 1718690, 1508119, 1316392, 1270535, 1157947, 996891, 864566, 814145, 794270, 839832, 817276, 700596, 597506, 556331, 552477, 522546, 530255, 571023, 587045, 630980, 655909, 665664, 529120, 434705, 390765, 352637, 346054, 313489, 248725, 201044, 214953, 182469, 142605, 149867, 195201, 209076, 209265, 184239, 245855, 360359, 388285, 248453, 211302, 264141, 257500, 271627, 316866, 297386, 276569, 211643, 310993, 326075]
18033C26075r0663N164j8165n632M6480O6922k7154n2713L8079j07410j22753
18022E8230J5472j6914J13740O6522q6002n2216J06590N1033k2793j5667j1847
18011B06148k8774J2551m9959N4714M2812k5220N5139n84q0777K3330Q2178M3351
17999C34909K0989L8720J8570l1225o725k1219q045J0634j8879m611j1749k1536
17987B99833o7210n0791K2313J3761n8771m2811j8696k4841n118R180N5249L8620
17975A70718j3711j45328j53593O7675N1632J1247J4994k0946M6187J02586J0464
17964A41925j63695p7330O2363k0693j2203J2006N0746M7765J2727r1360M9059
17953A1310P4602O1028j7396K7410K3562R904m4935m7707k8999l2693o7766M159
$$ y = [326075, 235412, 240576, 222411, 216779, 263259, 330181, 303027, 250314, 288393, 180983, 58230, 73702, 56788, 170528, 237050, 151048, 98832, 205422, 256455, 233662, 217995, 206148, 177374, 189925, 139966, 194680, 237492, 212272, 267411, 266827, 186050, 209380, 291558, 334909, 355898, 394618, 413188, 381963, 375238, 354019, 345974, 356608, 337729, 333118, 321369, 299833, 232623, 181832, 204145, 217906, 159135, 116324, 97628, 72787, 67669, 76849, 132098, 170718, 157007, 11679, -141914, -74239, -22607, -11360, 3634, -17312, 28875, 131461, 141925, -21770, -99100, -36737, -57430, -69633, -57627, -6881, 40884, 53611, -37749, 11310, 85912, 146940, 129544, 156954, 180516, 190420, 145485, 97778, 68779, 36086, -31680, -27521]
17941b7521N228q031L7995O396p7048m5192L5613O4003L6935k5768m667j9680
17929b1737R9155j0383o3130p8108r194K7621m7444j2962K900L0530N3561N8814
17917B9623J5015N5559K4091k0011O584p0536N694N0319p0022n2629L882M110
17905a8321j6573M357N550n6666k0443L4281j0165J710K0179L2548L4613N48j2712
17892a094R3851L6518r4080o3177N8775M5651k7895M4000K1520r9916j20014k2015
17880a27876K6573J36R0071M3808L843J4952n2361p0953k058Q9088Q1384n7447
17868C9160J11532n064k5420m6009L6144l0798r9956j29361m2458O669Q3098P1737
17856c0726M9543l5325n0362j31486M2846J04676J04316r569N2895r3190r3353
$$ y = [-27521, -22293, -30324, 7671, 14067, -62981, -108173, -72560, -8557, 28378, 2610, -2057, -21737, 77418, 67035, 3905, -74203, -83397, -55776, -103220, -116182, -113282, -82752, -29191, 29623, 44638, 100197, 124288, 104277, 110861, 40325, 46019, 96338, 26316, -26313, -22431, -18321, -34894, -30537, -24987, -81653, -102096, -67815, -77980, -76270, -56091, -23543, 11070, 11618, -1094, 92757, 129275, 35195, -27982, 30793, 76444, 48549, 92549, 114069, 14153, -105861, -127876, -101303, -101167, -11096, 32712, 36555, 51507, -854, -71807, -73865, 15223, 96607, 39160, 150692, 145628, 120208, 74199, 110343, 79545, -20411, -149772, -192230, -185561, -102463, -30726, 18817, -16508, -66870, -198356, -155510, -50834, 53482, 43913, 96808, 3618, -89735]
17845h9735l5668J1609l2241P7882N9421L7869N3390Q3523n9098m6721P3663J29455
17833B63349k8196l6325K3985J8195M2196p697P799N0277J30580k2763l57l2670
17821D08373L757K9584L5570q2511p8781r1842j311J5548l0220m3949j17833k9280
17809A7105k4369R410O0518j6159J4828K1072m1381l4540J4352J572J4608o6090
17797b9074K4394L2578m7466k8485J14035J9127o8573L6879R8962K9811o1529
17786A20659M4900R7894q4253m2354R7644Q9020L0190k0413o3707m0228p2346
17775A57006n1687J958n8516k0454m059k1856r98J40622J37010l252j11006l6891
17763A27877J0277N4375O8206l3168q8781K8021l0688l3165p5998p8682L7992
$$ y = [-89735, -125403, -113794, -146035, -68153, -8732, 29137, 82527, 166050, 106952, 60231, 133894, 263349, 235153, 198828, 222813, 241008, 283204, 275507, 283306, 333583, 464163, 441400, 441043, 408373, 412130, 441714, 477284, 394773, 315992, 224150, 222839, 238387, 208167, 164218, 46385, 17105, -7264, 2146, 62664, 46505, 61333, 82405, 41024, 6484, 20836, 22408, 37016, -29074, -4680, 27898, -19568, -48053, 65982, 85109, 16536, 53415, 152377, 182188, 120659, 165559, 263453, 179200, 136846, 234490, 323510, 353700, 333287, 269580, 229352, 157006, 105319, 107277, 48761, 28307, 24248, 2392, 1394, 142016, 279026, 275774, 164768, 127877, 138154, 192529, 260735, 227567, 138786, 166807, 136119, 102954, 26956, -51726, -13734]
17752a3734O36K0187m9206m7932N1998k2359P138L4548Q7177p0197j01552J06073
17740B777O0274j3594J6668j7755p338j6026M4927l4573j5302o4386j5783N614
17728e4497N1026p279p7376o0374l8283M8113q271L0306P8631m8954k1510M7632
17716f0836N8262M2086N737L9571Q8882J14560M3296k04m0711n1798p0260k8337
17704A40248J1050k5890l7425q788N9144J19876M8095J28207K5853M0091m9311
17693D51150j26156j81290l1732K5737j2217k9731K984m362p3575o0583m84M4333
17681D074K0582o4581N710Q89l2919k4000N1757M0249K7196n9818l7603N2721
17669a5743M3005p186M0933j195l0023n8516j2600j30j7080n5191O9364O8200
$$ y = [-13734, -13098, 7089, -42117, -90049, -38051, -60410, -53272, -18724, 68453, -1744, -103296, 2777, 63051, 49457, 66125, 48370, 41032, 25006, 69933, 35360, 20058, -44328, -60111, -54497, -3471, -10750, -88126, -148500, -186783, -138670, -146941, -116635, -38004, -86958, -108468, -60836, -2574, 39512, 45249, 84820, 173702, 288262, 331558, 331354, 290643, 238845, 168585, 140248, 151298, 125408, 87983, 79195, 138339, 258215, 306310, 434517, 460370, 500461, 451150, 324994, 143704, 111972, 137709, 125492, 95761, 98745, 94383, 20808, -39775, -40259, 4074, 24656, -39925, -34215, -33326, -66245, -90245, -38488, 1761, 28957, -30861, -68464, -15743, 27262, 20076, 61009, 59814, 29791, -28725, -41325, -41455, -58535, -113726, -44362, 23838]
17657B3838L8472m1066J0013k6010k5681o7749M9189O1628K0965m4294j80570
17646a81265N592Q8962N2036k1416p3648N6439M4938p446J4159n5866j5848L27
17634i3036m3726J04933l9588L5731j9810O6611N6514n9505m8487p5549j3872
17623a29784J7310K7004K2360j0689L2321j1365o9121J3754P9381k4461r8594
17612a51884L6167N2230j0668M0704k5712j3378L1255J23884k1272j42413j06321
17601a87408K8224J12058L7735j8030N6641n2373m7506M5925N0090J7971J0371
17590E3698J2603k6173j04954j0486N6471o4378o9254J7167j9808Q3016L7688
17579c4410O205M6964L5865J8101n2868j11395K2418P1648l7112J195Q6545j6493
$$ y = [23838, 62310, 21244, 31257, 5247, -20434, -88183, -38994, 22634, 43599, -695, -181265, -175673, -86711, -34675, -56091, -129739, -73300, -28362, -35808, -21649, -77515, -93363, -93036, -136762, -31829, -71417, -35686, -55496, 11115, 67629, 8124, -40363, -115912, -129784, -112474, -85470, -63110, -73799, -41478, -52843, -121964, -108210, -28829, -53290, -151884, -115717, -63487, -74155, -33451, -59163, -72541, -41286, 82598, 61326, -81087, -187408, -159184, -47126, -9391, -27421, 29220, -23153, -70659, -24734, 25356, 43327, 53698, 66301, 40128, -64826, -75312, -18841, -83219, -152473, -135306, -155114, -72098, -34410, -28205, 18759, 54624, 72725, 19857, -91538, -69120, 2528, -34584, -33389, 53156, 36663]
17567C6663l4350J0807L4509J7931K135m3844o7835l0546m986P34L2969N3951
17555H138M1555J2446l8038J2363L1996r5430j25697M2436L1900K9584N1001J06248
17543A08502r48r9046J8519L7207j7210j17640l3234O6316O9385j3414j09756
17532i1319N728Q1029M5055J53127Q593l0513N6684j2953J169N4040Q6233M8139
17520D05012O3907o5953j84717j61360m5645Q8055p4683q5195M4157P3005J24674
17509A81257P2310J22008J04829P093J0950q6174j6474p6075p4803p2147m1963
17498A30811M87j16217l6482O6337n2229j11171L130R4551J22920j0155o4040
17487B7942j03639L933M1792L5478J18232m4117o0679N8878M9769l2536K7846
$$ y = [36663, 2313, 13120, 47629, 65560, 67695, 23851, -43984, -74530, -79516, -78782, -45813, 8138, 49693, 62139, 24101, 36464, 68460, -26970, -152667, -110231, -78331, -48747, 2254, 108502, 107554, 8508, 27027, 64234, 47024, -70616, -103850, -37534, 31851, 18437, -91319, -85591, -4562, 40493, 193620, 202213, 171700, 228384, 215431, 216600, 270640, 356873, 405012, 468919, 402966, 218249, 56889, 11244, 99299, 24616, -60579, -16422, 56583, 181257, 253567, 375575, 480404, 487497, 498447, 412273, 395799, 319724, 244921, 172774, 130811, 131298, 15081, -21401, 44936, -7293, -118464, -115334, -20783, 102137, 91982, 27942, -75697, -71764, -29972, 5506, 123738, 79621, 18942, 77820, 127589, 95053, 122899]
17476A22899m2247l4114M134j17282m0488J19219O6L0923n6692l7099l2560j3153
17464i6394K6203n9843p5048n0981N6120K9313N9598N0804l2532J5191J55160
17453G7591Q877k7570l6083j11146l3688O0547R6812Q5949J17572K15789J33406
17442E88056J96075J05310j26942k09413k72040k74559n4715J0216m962J5639
17432b7335n786l2422p5816M2498L0503L9681L0601K6470P269j9379p1987J6948
17420c8755P5352q146l8081m0412j6425j5811L0017q0129j0998O5013L4181j2502
17408e6696o170J347L0632n3853j16357O61O2173j5575K6972N4071n1688K6742
17396i7741J06896k7780M1702M1533O5142k4547k0748K858J1815J7937q1695p3661
$$ y = [122899, 80652, 46538, 50672, -66610, -107098, 12121, 12187, 43110, -13582, -50681, -83241, -96394, -70191, -130034, -205082, -256063, -199943, -170630, -111032, -60228, -92760, -77569, 77591, 86468, 58898, 22815, -88331, -122019, -61472, 35340, 121289, 238861, 454650, 588056, 784131, 889441, 762499, 553086, 281046, 6487, -48228, -38012, -42974, -27335, -33121, -65543, -141359, -98861, -68358, -28677, 1924, 28394, 35663, 16284, -55703, -38755, 36597, 28451, -9630, -50042, -66467, -82278, -52261, -132390, -143388, -78375, -44194, -56696, -62866, -61519, -30887, -84740, -201097, -200436, -138263, -153838, -126866, -72795, -124483, -97741, 9155, -18625, 23077, 64610, 129752, 105205, 84457, 87315, 99130, 117067, 35372, -38289]
17384c8289j06206J1038j6799K1852K6696R8655r447p3990n4961L9843J21422
17373A9814J203K857J4167K3345p3206K0125J02648m7160p2889k6356j2408J4682
17361c3178L1665K3298M7258k1195M29m5722N0089Q5214p1q8169j50190k1628
17349a22200O7589P4619M4856n220k0604k7192J8476M5473j1150k7778R7243N7116
17337A91228p4608j8469n5259J395n7675P0011K0452p4977n5857j08346r541O0181
17325a11465k2208L9816J14651N7343p6624q9716j4912J2953P5863L6110p9610
17314e7799l6174M0534J0347n3097m1760M1560N3351K3525q799J13754K8241l0528
17302H3155j7799o4253n9930k9692j9462n3096n415P7558M1724L3184M1744k8709
$$ y = [-38289, -144495, -133457, -150256, -128404, -101708, -3053, -12500, -86490, -141451, -101608, 19814, 21017, 23874, 38041, 61386, -11820, 8305, 110953, 63793, -9096, -35452, -47860, -33178, -1513, 21785, 69043, 47848, 48277, 2555, 52644, 137858, 137787, 49618, -100572, -122200, -54611, 20008, 64864, 59644, 39040, 11848, 30324, 75797, 64647, 36869, 134112, 191228, 116620, 98151, 42892, 44287, -13388, 56623, 77075, 2098, -53759, -162105, -171646, -111465, -133673, -93857, 20794, 78137, 1513, -88203, -103115, -90162, -14299, 21811, -57799, -93973, -53439, -43092, -96189, -137949, -96389, -43038, -19513, -28312, 85442, 113683, 83155, 65356, 1103, -58827, -88519, -107981, -161077, -166492, -88934, -47210, -14026, 27718, -991]
17290i91m8777M4795k8010K5549R8053O39J2092p3507j01326R145Q4289O3233
17278H5184O3076o907m3256j01053k6792o7268j6209O0398N4778P0817k3236l7351
17266A2181K6087O509J2887K3386r3451k7644O1081n286o372R589N131o373k5289
17253g564J44210J2985k4717O7368k9195j13767L9588K035J4551J02735L6256
17242B44485m7450m4909n8680o4523m584M1859K5144L486k4531r904O6273m3843
17230H2823K7712O3078k9624l9981q5962O947k2865l8819l056j8932j7844l8867
17218a15390O9175O1452K5864K6384k4223L00m1637o5537n9351L5198N4618O0578
17206B7431O414j9662r548N501m1436n7548L784N507k3753O1478M5932N984M0700
$$ y = [-991, -49768, -4973, -32983, -7434, 90619, 91258, 103350, 29843, -71483, -62338, 21951, 85184, 148260, 141353, 98097, -2956, -29748, -97016, -113225, -52827, 1951, 72768, 49532, 12181, 38268, 44777, 57664, 81050, -12401, -40045, 21036, 15750, 9378, 18967, 24098, 17725, -7564, 136646, 149631, 124914, 192282, 163087, 49320, 88908, 90943, 105494, 208229, 244485, 197035, 152126, 93446, 28923, 24339, 66198, 91342, 94828, 70297, 60393, 126666, 82823, 110535, 173613, 143989, 104008, 18046, 24993, 2128, -36691, -39747, -58679, -76523, -115390, -46215, 15237, 41101, 67485, 43262, 43562, 1925, -63612, -122963, -87765, -33147, 27431, 33845, 14183, 4635, 10136, -31300, -88848, -85064, -79557, -103310, -41832, 4100, 10084, 50784]
17193E0784j3049q0171J4513L253k716O9258O0606q8707p1979J9949Q2878j5518
17181B9101O2038k1004n583J3332l0989m9275r2259N3517J47125M493j4810n4086
17169D1600n5597M8487O8437P7826q756l6727r8971m2644K0350O8272L8311k5450
17157I5138K1491p263N4197P028J6674m6341J110q6825l1339K5398q065J6164
17145E7367P1066O5038K2603r4069j04606j974n3302p2110N3888J31936K1280
17134I7117J4745M8368J310j01963N6904P9742q264r2735m4630n147K5365K3927
17122I4739m3961n2983J5695k1945n1828J9093J1300m6797N9160O7840m242m5348
17110G23q5999L1941N4550n309q690j5814R5683J29138L6313J01162J6586k8212
$$ y = [50784, 37735, -42436, -27923, -24670, -27386, 41872, 102478, 13771, -58208, -38259, 44619, 29101, 91139, 70135, 64552, 77884, 46895, -2380, -94639, -41122, 106003, 110496, 95686, 41600, -13997, 34490, 102927, 180753, 171997, 135270, 36299, -6345, 14005, 82277, 120588, 95138, 116629, 109366, 163563, 170591, 187265, 140924, 142034, 55209, 23870, 49268, 41203, 57367, 128433, 193471, 216074, 122005, 17399, 15425, -37877, -109987, -56099, 75837, 97117, 111862, 160230, 161540, 59577, 116481, 196223, 187959, 95224, 50594, 45447, 70812, 94739, 50778, -2205, 13490, -8455, -60283, -41190, -29890, -76687, -17527, 50313, 46071, 723, -85276, -53335, 1215, -4094, -12784, -28598, 67085, 196223, 232536, 333698, 350284, 322072]
17098C22072j1218J875n335q0572m0997L1583j1076r0628q9518k4696N4595K6175
17086H2260R7650R6446o240r5558q1991k550N5863R8178M5830J589L3199m125
17074C20551m9942r5934o7155n0242n53J07674k1616o7563P8683J6756k2254p6533
17062G1872l8295O1844P7823k5453m426K1825M4006j7534n3499P5931J1525m8821
17050A76798r6123N8675P5032M0277J21443n1866o4169k3121j5494n281O2758
17039B78929O2525j2522l4229m1804m3696M6164R2954J3623o3980l2719n0388
17028B14857L0418l2147M453j3245L773R214P3809L9419J1521K9321Q509K2129
17016D02031J2623L268J9724n7830O158O3902J9682P6643O1328Q7232M1749j8146
$$ y = [322072, 310854, 312729, 307394, 226822, 185825, 217408, 206332, 115704, 26186, 1490, 56085, 82260, 179910, 276356, 270116, 174558, 92567, 90017, 145880, 244058, 289888, 291477, 324676, 320551, 270609, 174675, 107520, 57278, 56725, 164399, 142783, 75220, 153903, 170659, 148405, 71872, 33577, 95421, 173244, 147791, 143365, 165190, 209196, 191662, 138163, 214094, 225619, 176798, 80675, 139350, 214382, 254659, 376102, 324236, 260067, 236946, 221452, 216171, 278929, 341454, 328932, 294703, 252899, 209203, 255367, 348321, 361944, 297964, 265245, 214857, 245275, 213128, 217581, 204336, 208109, 217323, 291132, 330551, 342072, 371393, 379902, 402031, 414654, 417922, 437646, 379816, 385974, 449876, 469558, 546201, 607529, 694761, 736510, 718364]
17004G18364N0007R2263Q1116P2965J25000N6615j7006K08652J43688J19984J79900
16993A831548J00767J8836L8673J05202J55643J70391K65502K96914N13700P04399
16983D201575O65349O71534R01632J073487J318847J873848K628451L521654M855763
16974B1712140O457003R497835J4719313K0772664K0358419N998669j1984382
16967H7531661k0840635j9457149j2465532o651659k744630j78666J840839L757516
16959C0791745O302329J0628876J6759606K0374194J2659872n832124j8897233
16952G2787265k1910226j6671642j0393312o249028m025074k753651k033920j445385
16944G305027r75159p91108n53420l15615l14346m06264l72634l43690l32385
$$ y = [718364, 768371, 860634, 941750, 1014715, 1139715, 1196330, 1179324, 1387976, 1531664, 1651648, 1831548, 1932315, 1951151, 1989824, 2095026, 2250669, 2421060, 2686562, 2983476, 3497176, 4201575, 4866924, 5538458, 6440090, 7513577, 8832424, 10706272, 13334723, 16856377, 21712140, 28169143, 37666978, 52386291, 73158955, 93517374, 99516043, 87531661, 66691026, 47233877, 34768345, 28116686, 25372056, 25193390, 27034229, 30791745, 37094074, 47722950, 64482556, 84856750, 97516622, 91684498, 72787265, 50877039, 34205397, 23812085, 17563057, 13537983, 10784332, 8750412, 7305027, 6329868, 5538760, 4985340, 4669725, 4355379, 3949115, 3576481, 3232791, 2900406]
16935B900406l19155l23745k52116j41971r9786j89968r3736m8786p5305n9418
16925A296420j02302r1658q4494j02597j50086j26252j50329n6225L4741k0520
16915D46698O303O2898m6912r2727l0370k333p2263n9070l4148M478P9486P4229
16903C36269o248j433j1338j10857m6943M0730n3220r975M1932J4431J7151K0334
16891B30833j3563p4173k8762N2820k4427M3046M3410J6610K5074L2896n3117
16880B50647p3331L83J5820P5027l0756J5124k8184L7089q2924j07354O1906N9267
16868A92714J0605k4640j8835p364N6690j6779o1005j7339j0588k0871m4120J7197
16856E5665J8399l0394j9380M5642k0755o3941J6567Q6662j9526J0558P0828k1605
$$ y = [2900406, 2581251, 2257506, 2005390, 1863419, 1763633, 1573665, 1479929, 1431143, 1355838, 1296420, 1194118, 1102460, 1017966, 915369, 765283, 639031, 488702, 432477, 467218, 446698, 453001, 515899, 468987, 376260, 345890, 343557, 271294, 212224, 178076, 182554, 262040, 336269, 330021, 328588, 317250, 206393, 159450, 200180, 146960, 136985, 178917, 193348, 210499, 230833, 217270, 143097, 114335, 167155, 142728, 185774, 229184, 245794, 270868, 303764, 250647, 177316, 177699, 193519, 268546, 237790, 252914, 224730, 261819, 178895, 71541, 133447, 192714, 203319, 178679, 159844, 152480, 209170, 192391, 131386, 114047, 103459, 82588, 38468, 55665, 74064, 43670, 24290, 69932, 49177, -14764, 1803, 88465, 68939, 79497, 150325, 128720]
16844A28720m3442O2207M0796j29963o8522M4249O218m8627k301Q288n8448q3973
16832a44798K3220P590k4085N1347J10401Q9370k3293R64p2016M7334P8728q3605
16820F1157k8060K1281N648k0760O24p1879j5476P4706K1452k8974o0515J8268
16808b2528M9471N9763l9535j1937m3751N7656Q1473P886J262j7925p3486J4142
16796F2491j231j4550j3748N4416k1158j8449n7660K202M8744q4586n4955N988
16784i2496J32669l3536l6130k5056k5035m8150L6520N9078P4526M6645L5279
16773A24314n3544l9005o785M8364l9844n5633j2430M9452l3974n0721M338j4128
16761g9596K0573n9273m1955l0968l0118P7375M4301k8717l9551K905Q9220P8037
$$ y = [128720, 85278, 147485, 188281, 58318, -10204, 34045, 40263, -8364, -10665, -2377, -60825, -144798, -121578, -113988, -138073, -86726, 23675, 113045, 89752, 90716, 18700, 66034, 144762, 61157, 33097, 54378, 60026, 39266, 39890, -31989, -47465, 27241, 48693, 19719, -40796, -22528, 26943, 86706, 47171, 35234, -8517, 49139, 130612, 138498, 139760, 121835, 48349, 62491, 61260, 46710, 32962, 87378, 66220, 47771, -9889, -7687, 41057, -43529, -98484, -92496, 40173, 6637, -29493, -54549, -79584, -127734, -91214, -32136, 42390, 89035, 124314, 70770, 31765, 24980, 73344, 33500, -22133, -34563, 14889, -19085, -69806, -65468, -79596, -59023, -118296, -160251, -191219, -221337, -143962, -99661, -128378, -167929, -165024, -75804, 2233]
16749B233N5974p0050K5633Q1165k5173j23378k0123L8993m5278M7804L1925O400
16737F125l0j3777j6236l8015j0630N9684P6790l489n5896k6865O4848N110j10627
16724f3008R304l4451j1960J8651J9552j9370o7074n8347M7888J54348M6932k8488
16712A3977L0829o7182P4004M1466n9917J6998N298p5839j7212n2678M0404K5041
16700b4811p9160n2360L3471N6631K6896J0537L4558l5026p7649L8271N5448N9147
16688D5953j7521J6909j8549n6120P389K6950J1653l3721J2493J9041P0274Q0818
16676A65569n0528L2847q4470o0379O3551M1911l6244j08257j42297J83N436L7362
16664a35316N0030L9162j1624k4555n8413L7171M2760J0237P7581O3110o3132
$$ y = [2233, 58207, -11843, 13790, 94955, 69782, -53596, -73719, -34726, -80004, -32200, -275, 6125, 6095, -7682, -23918, -61933, -72563, -12879, 63911, 60422, 4526, -22339, 42509, 47619, -63008, -53704, -88155, -100115, -81464, -61912, -81282, -148356, -206703, -158815, -4467, 42465, 13977, 44806, -22376, 51628, 93094, 33177, 50175, 55473, -20366, -37578, -90256, -49852, -24811, -103971, -156331, -122860, -66229, -39333, -28796, 5762, -29264, -106913, -68642, -13194, 45953, 28432, 45341, 26792, -29328, -21939, 5011, 16664, -17057, -4564, 14477, 84751, 165569, 115041, 147888, 63418, 3039, 66590, 108501, 72257, -36000, -178297, -178114, -172678, -135316, -85286, -46124, -57748, -82303, -140716, -103545, -60785, -50548, 27033, 90143, 27011]
16653B7011L1584P4171K0815j1503j11840r3387l8107N6406j2023k1265N591N510
16641f7037j6330n0175M4516k1363L9493K8185m2452J9931O1132J38804k2052
16630A12652J0773l7937n0038K697K4572k7135p0688n7550K9712O7986o4668Q3766
16618B4142J02080K4432m9729o3421j3211l8181l3942J6155P1968N733L7183L1381
16606A14590j9673L1938N5452m5003J201k9031j6314j91l7493n3728m3768K1660
16594b0360L9454R9344J4908Q863J0310m6793o4157L6272M3739O7865j07740j35606
16582e3901o4836O4722J0954m2547J0075N7246k695L9983n085j624r6516n0177
16570a34401O2073N3422L8158k5266j4701l2431j3134K9112L2972j1710p4348
$$ y = [27011, 58595, 132766, 153581, 142078, 30238, -63149, -101256, -44850, -56873, -78138, -72547, -67037, -83367, -133542, -89026, -110389, -70896, -42711, -85163, -65232, -4100, 134704, 112652, 123425, 85488, 35450, 38147, 62719, 35584, -35104, -92654, -62942, 5044, -59624, 24142, 126222, 150654, 100925, 37504, 24293, -13888, -47830, -31675, 40293, 46026, 83209, 114590, 94917, 126855, 182307, 137304, 138505, 109474, 93160, 92969, 55476, 1748, -42020, -20360, 19094, 118438, 133346, 142209, 152519, 105726, 41569, 77841, 121580, 189445, 81705, -53901, -118737, -54015, -43061, -85608, -75533, -18287, -20982, 19001, 13916, 12292, -84224, -134401, -72328, -18906, 19252, -6014, -20715, -53146, -66280, -37168, -4196, -15906, -90254]
16559i0254n1139M9753m6894P728j9019l8132n7765N2313J72037N3062o4262n9490
16547i2062j8241O0379N4280l6005J7208l9686m6797j23363J18443Q0947l6168
16536f1065J01166p895M3507j25588j12173k3829Q6632r125M5306O9446k531k9294
16524b5443p2458m527j5060o0475P620P4053M1707l984o7085N4620Q0404k3016
16512a3644L5306L7079L565O9746O974j80752p3313j9434M1225L3257k1262M3892
16500c7361P8725m6130j7733j46665o9033P158M8999J1284J4962Q5375M3621O943
16488a9855N3770j1921j08847n3830N2034j0011R76p5293L5736J40538O2572r906
16476E5963M0433k2228l9956j109n7606n6107k2288j4015L5171J5734k8185n7987
$$ y = [-90254, -141393, -91640, -138534, -130806, -149825, -187957, -245722, -193409, -21372, 31690, -32572, -92062, -110303, -49924, 4356, -31649, -14441, -54127, -100924, -224287, -105844, -24897, -61065, 40101, 32206, 75713, -49875, -162048, -185877, -99245, -108370, -63064, 6382, 3851, -25443, -97901, -102428, -117488, -177963, -170343, -96290, -54583, -58567, -125652, -71032, 9372, -13644, 21662, 58741, 62306, 132052, 139026, -41726, -115039, -134473, -93248, -59991, -81253, -37361, 41364, -4766, -22499, -169164, -238197, -231039, -182040, -170756, -155794, -70419, -26798, -19855, 33915, 21994, -86853, -140683, -88649, -98660, -97684, -172977, -137241, 3297, 65869, 55963, 96396, 74168, 34212, 33103, -24503, -80610, -102898, -116913, -81742, -66008, -94193, -152180]
16464a52180k175L096J8815J0175M1644P4097N6169J4872k3837N5781l0929p631
16452E7897J2091J6047p9042j433q5408N4062m4931K9449m975J3473k1304Q2538
16440B8464M5401Q13L7771k0563j0797k3299M1060j3021r8500l6243J1481K9346
16428h087J26052L1834j24031l1259J00968n7654L1370N877L580Q6271q3085r9530
16416a7694R9704P3277R4868O9378Q9656N9687q2822r5926j38548j25225J8814
16405D5169K0223M6337M6978J02204J37721J8594J0983N9628j4825o9525j00905
16394C02582l6968q8648p3447j53721l9864P9671o5437j6400L4173K165n0833
16383a06727J4839P9411m4607l9279j1091P1632j399m475L0113j7641n603P1099
$$ y = [-152180, -154355, -151259, -132444, -122269, -80625, -6528, 49641, 64513, 40676, 96457, 65528, 57897, 69988, 86035, 6993, 5560, -79848, -25786, -70717, -41268, -46243, -32770, -54074, 28464, 73865, 74678, 112449, 91886, 81089, 57790, 98850, 85829, -12671, -48914, -37433, -8087, 117965, 149799, 25768, -5491, 95477, 37823, 69193, 75070, 78650, 164921, 81836, -17694, 82010, 155287, 250155, 319533, 409189, 468876, 386054, 290128, 151580, 26355, 45169, 65392, 111729, 158707, 260911, 398632, 417226, 428209, 487837, 473012, 403487, 302582, 265614, 176966, 103519, -50202, -90066, -10395, -75832, -92232, -58059, -55894, -106727, -91888, -12477, -57084, -96363, -107454, -35822, -37221, -41696, -11583, -29224, -34827, 36272]
16371C6272l0033P334k0705l3226j7947j0262Q6204N6209r045L0307M0807L876
16359A39791p511j11538l6176m0330J9446M2087j13911j6681R6173L3269L6368
16348D0987N0043n4905l5656P8659m0282p7657N0307k1462l5559k2226m1331R3582
16336a5500K7473j05342m4352K0343M8408J905m3037O561q07R568M9182K063R8033
16323E4498J44974l6574j21101o9554k1945j3129M6154Q977r2372n9571M3457
16312a16186K7956l5806O6992O6325j3623j4092p2493l5935l6394N099l7840r548
16300b05545J18578K7774R340l7210K2531J0775j4482K512m1425O3592M552L4146
16288d862j06283l8476j7K7940j4153k8030N1179M3478m91q4973k2968Q2561M4626
$$ y = [36272, 6239, 13573, -7132, -40358, -58305, -68567, 17637, 73846, 64801, 95108, 135915, 139791, 132280, 20742, -15434, -55764, -36318, 5769, -108142, -124823, -28650, 4619, 40987, 91030, 36125, 469, 79128, 38846, -38811, 11496, -9966, -45525, -67751, -109082, -15500, 11973, -93369, -137721, -117378, -68970, -67065, -110102, -103541, -104348, -94780, -45598, -43535, 54498, 199472, 162898, 41797, -27757, -49702, -62831, -16677, -7700, -100072, -159643, -116186, -88230, -124036, -57044, 9281, -4342, -18434, -90927, -126862, -163256, -158157, -195997, -205545, -86967, -59193, -49853, -87063, -64532, -53757, -68239, -65727, -107152, -43560, -39008, -4862, -111145, -149621, -149638, -121698, -135851, -163881, -112702, -69224, -69715, -154688, -177656, -95095, -50469]
16275e0469j6429r22m002L8316O259O3107L9862j7675l9068K3726n22j6533m5182
16262a9532O119r5756l6162J51934L9557n595m9515k2826m2044r1988M5450Q2296
16250c8062n1370J1373j8530q5252m6717Q8298Q9869K2920j7053k2409j1062L7296
16238d0699P2005O3266j8094p6116k1052r542J2129l7945J8420M4115J5121J1111
16226C2719L7854J6711L4605k4226j7963m6916k7362r58m7723N0541Q5214n8197
16214C4299j08211K195J294P515Q779M8663j05847o1253j0554P345Q5032L4367
16202e6376k3061l1295q6919O3835P4771J8763k393O9784j8808o7058l7932N4459
16190d2230m0395k2256J17560o0479r2754m5697L5946J34267Q0296O9225J5201
$$ y = [-50469, -66898, -67820, -71822, -33506, -27247, 35860, 75722, 58047, 18979, 42705, 42183, 25650, -19532, -13413, -109169, -145331, 6603, 46160, 40565, -8950, -31776, -73820, -165808, -120358, -38062, -89432, -78059, -96589, -181841, -228558, -140260, -50391, -27471, -44524, -66933, -77995, -40699, 31306, 94572, 76478, 362, -20690, -30232, -18103, -56048, -37628, 6487, 21608, 32719, 70573, 87284, 121889, 97663, 79700, 32784, 5422, 4464, -43259, 7282, 92496, 34299, -73912, -71717, -70423, -62908, -54129, -5466, -111313, -172566, -183120, -175775, -90743, -56376, -79437, -110732, -197651, -133816, -59045, -40282, -42675, 27109, 8301, -58757, -96689, -42230, -82625, -104881, 12679, -47800, -140554, -186251, -150305, -16038, 64258, 133483, 148684]
16179A48684p2971q7877o8460Q70k5518p8549R5628J06498J8949l065m5345q7636
16167i8792L4820O7268Q003k4057r0650Q073j2222N565M069M0648o15K4075O6447
16154C2632J32684N270o9767q3146J6772J0035j18527q5210m8920Q496k3469O5756
16142a57394Q3764P8826P8281J7819k5043j20037p3106k1880L2276Q1575n5864
16131h0783J6919k1646k052O5867L1838l082n1295J6208j7899n4467n2070J5801
16119a36661P1291j4458m3888N4465m0538Q1757L6776j3720N1032Q468j8039n7546
16107b1061J9100K4412P3816l8965k9762l7365m4510L0534p636k4620O7585J4972
16095B6500k3349o1792l3629K3791M7210M6437M8813j07181k3205L5250L3703
$$ y = [148684, 75713, -12164, -80624, -79754, -105272, -183821, -88193, 18305, 37254, 34189, -11156, -98792, -63972, 3296, 11299, -12758, -103408, -95335, -107557, -101992, -97923, -57275, -57890, -33815, 32632, 165316, 170586, 100819, 17673, 34445, 44480, -74047, -159257, -208177, -199681, -223150, -157394, -73630, 5196, 83477, 101296, 76253, -43784, -116890, -138770, -106494, -24919, -80783, -63864, -85510, -87562, -21695, 10143, 7061, -44234, -28026, -45925, -100392, -152462, -136661, -65370, -79828, -123716, -69251, -109789, -28032, 8744, -4976, 46056, 54524, 36485, -21061, -1961, 22451, 96267, 57302, 27540, -9825, -54335, -23801, -31437, -56057, 11528, 26500, 3151, -58641, -92270, -68479, -21269, 25168, 73981, -33200, -56405, -21155, 12548]
16084A2548k0886p2366r3179j736J5701k1246K7365R2198O5044l4877M4554n9422
16072d6302j60850j07897R0667J32296J72224O3624L183q660M9031j01116r8503
16061a2303j7810k266j4033k5518l0426j5671K2504K6699j6705P3675p552n0889
16049g0295r5376k7613L9167J37077M4327n5939J9086N1997n6432P2732N174j07283
16037d3378L37J2021k1738m0520Q05L8000P9980L5119K6480N1789K1150l9396
16025A20649q6872r1746M9869P0174J413m0842n301N3743q2209m1276J0124L8231
16013d043k3389o384K2297k4332o4566K037J2704k1754O3550L7808l8959O117
16001c8914N7576L4308o0830N0627Q1205j1190j1742m0278j09240k2217R1735
$$ y = [12548, -8338, -80704, -173883, -175619, -159918, -181164, -153799, -61601, 3443, -31434, 13120, -46302, -207152, -315049, -224382, -92086, 80138, 143762, 146945, 138285, 187316, 86200, -12303, -30113, -32379, -46412, -71930, -102356, -118027, -95523, -68824, -85529, -11854, -19406, -70295, -165671, -193284, -154117, -17040, 27287, -28652, -9566, 42431, -14001, 58731, 63905, -43378, -43041, -31020, -52758, -93278, -92473, -54473, 25507, 60626, 87106, 138895, 160045, 120649, 33777, -57969, -8100, 62074, 63487, 22645, 17344, 71087, -11122, -52398, -42274, -4043, -27432, -33816, -11519, -35851, -100417, -98380, -85676, -107430, -43880, -6072, -45031, -38914, 18662, 52970, -7860, 42767, 123972, 112782, 101040, 60762, -48478, -70695, 21040]
15990B1040P931m2862R5137J6860O4239m9840r0995p3703N0838J06570K0339r7586
15978B7968m0534r4143m9392L2624k6299M1372l4888r2039L1523P254q349J1689
15966a93214Q7118n4486R025J20924R9045m1491j954l3579q6963o7363K8006N0624
15954h4308K8158O7979N3619j0309p6110n0139Q6361k5589P306J6276k1933o2766
15942g1455M3930N584J680L8453M6333K2168l6015k3754j625o3297N3043K0763
15930C5808j00344K2094M3330l2740L4314j8451J1139n7633o1934L1818R7948
15919E349K6994k0368K0579J17347P001k3477j24402k53l3115j2749j8101N1811
15907c384K064j29556k2425O2711O3208q781o8505q962O2794j382J27830P6994
$$ y = [21040, 28971, -13891, 81246, 98106, 162345, 112505, 21510, -52193, -1355, 105215, 125554, 27968, -12566, -106709, -156101, -123477, -149776, -108404, -143292, -235331, -203808, -196554, -204903, -193214, -106096, -160582, -151557, -30633, 68412, 26921, 24967, -8612, -95575, -162938, -134932, -84308, -56150, 11829, 65448, 55139, -20971, -71110, 15251, -10338, -3032, 13244, -8689, -71455, -27525, -21941, -20261, 18192, 64525, 86693, 50678, 26924, 25299, -37998, 15045, 35808, -64536, -42442, 888, -31852, 2462, -15989, -4850, -62483, -124417, -92599, 5349, 32343, 11975, 32554, 149901, 156902, 133425, 9023, 8770, -24345, -37094, -55195, -3384, -1320, -130876, -153301, -90590, -27382, -36163, -104668, -113630, -50836, -52218, 75612, 152606]
15895A52606l0884j0032j7885n5929o532J3158k1412p5022m7706L9300M9039M6493
15883C5194O2917M6051K2199r0098j06708o762K9869J4585j0519J3362J2336n2800
15871c0374P7520O2830J1937l2029r6999j5008q9526n1929j8089k084J11648J31436
15859E9333l7217o5148r394J7418M6818J2900J1027L5113M8128Q566r3286p5059
15847d0801o7106K6909N5843l5485L1318K7051j04559m4800J6222K8728k4358
15836a31038n0884K0517M1719R7477j6214N1576O9061l9257L0909l9103p0775
15825c6012k2496J4601K3320J4322k625L87m4974q1022k9895l4006J00032P8142
15813b0226m685k1042O7188K0017p4330k1951M4643q0176q0564j7086P5114J46195
$$ y = [152606, 121722, 111690, 93805, 37876, 31344, 44502, 23090, -51932, -99638, -60338, -11299, 35194, 98111, 144162, 166361, 76263, -30445, -37207, -7338, 7247, -3272, 10090, 22426, -30374, 47146, 109976, 121913, 89884, -7115, -22123, -111649, -163578, -181667, -183751, -72103, 59333, 22116, -43032, -52426, -35008, 11810, 24710, 35737, 70850, 118978, 127544, 34258, -40801, -107907, -80998, -25155, -60640, -29322, -2271, -106830, -151630, -135408, -106680, -131038, -181922, -161405, -119686, -22209, -38423, 13153, 82214, 42957, 73866, 34763, -36012, -58508, -43907, -20587, -6265, -8890, -8503, -53477, -134499, -164394, -198400, -98368, -20226, -24911, -45953, 21235, 41252, -33078, -55029, -10386, -90562, -171126, -188212, -113098, 33097]
15801C3097P934M0628N4063m5816n1545K0335N5792j5792q0277J1962l1051j4870
15789a5540M6385l479m934n6608K671M9907j5281l167j05403L6722J1311j8164
15777g5580N7663M4312J0475n1952l1742K7241m4047j4115M2606R2837k066o8216
15765a2584m2402N6175K9792j05847j0460l3846n869K5686O5205N0369k398m9848
15753c6027j35103j5128K2305N3341O3776j8543J168j3844L1534L3297o8190o8740
15741a50154m6113N192O8629M0025O6218J2848m0057m0771P3538M0649L1320k8957
15729C2367q0866o2691M2547J0743n1851M3810M0626J18350L17q9009q7527o3088
15717a46272L1253M4439R1741O7487o2599j17252m3929R4252N3841K264M8979
$$ y = [33097, 41031, 81659, 135722, 89906, 38361, 58696, 114488, 98696, 18419, 30381, -670, -15540, 30845, 27366, 22432, -34176, -31505, 18402, 3121, -46, -105449, -68727, -57416, -75580, -17917, 26395, 36870, -15082, -46824, -19583, -63630, -77745, -35139, 57698, 55632, -12584, -54986, 1189, 30981, -74866, -85326, -119172, -125041, -99355, -34150, 16219, 13821, -36027, -171130, -186258, -163953, -110612, -46836, -65379, -64211, -78055, -46521, -13224, -81414, -150154, -196267, -191075, -122446, -82421, -16203, -3355, -43412, -84183, -10645, 30004, 61324, 32367, -48499, -111190, -68643, -57900, -109751, -65941, -25315, 93035, 93352, 4343, -83184, -146272, -115019, -70580, 21161, 88648, 26049, -91203, -135132, -40880, 12961, 15225, 64204]
15706F4204J6058j14956j01391J13896K6261p1658L1686P940k2961J6482J618
15695c2821K3871q3362N9681k0177o5485K4876N7395Q397l0406k8867L0151J3967
15683d2780p6145n7685P0248n817L4007o7678K354J38582N7713j06637l8596M6730
15671d5704O2651j02402j1931J97254R5002R034m1397j21701n5072L4515K1399
15660D1648m2421o9106K4897L5373p182j0847l6371l5777J948J6788j4604j7112
15648a12766M2767L7226o7430m8656o9519p411O4313J14562J4534k9116L0149
15637c1347L2524l2914L720L2412M6219J6474L8424M8626o6626l3502J4388m0946
15625B7452o4484P5536j3762M57L6153J5687l0533K2402O7846o141n7881q4306
$$ y = [64204, 80262, -34694, -136085, -22189, 4072, -67586, -35900, -27960, -50921, -34439, -32821, -8950, -92312, -32631, -52808, -118293, -93417, -36022, -27625, -58031, -86898, -56747, -42780, -118925, -176610, -106362, -112179, -78172, -145850, -143496, -4914, 52799, -53838, -92434, -45704, 16947, -85455, -97386, 99868, 194870, 203904, 162507, 40806, -14266, 20249, 41648, -773, -69879, -44982, -9609, -16791, -27638, -64009, -99786, -97838, -81050, -95654, -112766, -69999, -32773, -100203, -148859, -218378, -225789, -161476, -46914, -32380, -61496, -31347, 1177, -31737, -28017, 4395, 50614, 67088, 105512, 154138, 87512, 54010, 68398, 27452, -37032, 38504, 24742, 25199, 61352, 77039, 46506, 68908, 136754, 130613, 72732, -11574]
15613a1574j22140K7936p272R090k5844K8381N8213k055p2362j981m566K1112
15601a03062j6962j6285Q0514M2882j5765k108P3575L8787j23095j10516Q706
15590a43329j3721j9645M5520K2163j7104N2417Q014L1804N1916j00734m4340
15579a27039L9894N3414o0204k0175j2347n810O8761J0650k4039l3866N9193k8467
15567h0035p6815M0542j1432N9795m451m5900M2324O2417Q548J1073p6901K06
15555g0629O9419k7106p2701Q121l624N1706N461o2869O5055j2957P756K1340
15543b1028M2753r039k6582L0559M9986N7074k1633n5564m0740m374K6201k1822
15531E791n9769k8601L0905M3471l5528m2810L6829N158k7312j0708L1580l7837
$$ y = [-11574, -133714, -105778, -113050, -103960, -129804, -101423, -43210, -45265, -117627, -119608, -124174, -103062, -120024, -136309, -55795, -12913, -28678, -30786, 42789, 81576, -41519, -152035, -143329, -157050, -176695, -131175, -109012, -126116, -73699, -65685, -33881, 18035, -82699, -127039, -87145, -33731, -93935, -114110, -126457, -132267, -63506, -52856, -76895, -110761, -51568, -80035, -156850, -116308, -127740, -67945, -72396, -118296, -75972, -13555, -5007, 6066, -70835, -70629, -1210, -28316, -101017, -92896, -96520, -44814, -39353, -102222, -37167, -50124, -42368, -21028, 21725, 12686, -13896, 16663, 66649, 123723, 102090, 46526, 5786, 1412, 27613, 5791, -53978, -82579, -51674, -8203, -43731, -86541, -49712, -44554, -71866, -82574, -50994, -88831]
15519h8831P8715Q6833M1901l5017p3357K3675M5208q3669j9145O7550k7992k318
15507A3553q9808l130J51036J09710q6587j30566k5309J9800k5196N6158M1587
15496C1248o6431L4002K5310L5492o1029o8330R2105P4018k3403J97K9646m8967
15484E3858j27129p0126o62L0177m2708j4074k2869l9697N4099o904M7877j0371
15472a48529P6339Q5361l4281n9729k8472N1910L1870J2586K2688Q714k2168k6347
15460c0058k2318j6690J5123K6545L1323n7857r3187k1481k2420J137N5029J2274
15448a22580L5915j1660K5622N4859M8472n2433M1751P4546q1481j24412K1746
15437h9655J37592O2533M6419m1556j68147j15483K1885P3722k4459m4086j0150
$$ y = [-88831, -10116, 76717, 118618, 83601, 10244, 33919, 79127, -4542, -23687, 43863, 15871, 13553, -76255, -79385, 71651, 181361, 94774, -35792, -61101, -41301, -66497, -10339, 31248, -35183, -1181, 24129, 59621, -1408, -69738, 22367, 96385, 72982, 73179, 102825, 53858, -73271, -143397, -144059, -113882, -156590, -170664, -193533, -233230, -179131, -186035, -138158, -148529, -72190, 13171, -21110, -80839, -109311, -57401, -25531, -12945, 9743, 18457, -3711, -30058, -52376, -69066, -53943, -27398, 3925, -53932, -147119, -168600, -191020, -189883, -134854, -122580, -86665, -98325, -72703, -17844, 30628, -21805, 19946, 94492, 13011, -111401, -89655, 47937, 110470, 156889, 115333, -52814, -168297, -146412, -72690, -97149, -141235, -151385]
15426a51385J2689Q2732P4994Q6375n3701j33657l3683N0350J7248n6493N1806
15415e2725P0075r9241l4166j14038L2822J45703J704m7982l1408j6035p4034
15404b19325J9497J08983O6104P2728Q361l949J6653k4343n0510n9264j0563M5388
15392c0240K5914J238K8435j2194j39518N2499J08699M7516L2006j4074l1877
15381F8404o9510m1661J2375L1446m85O158l2539J12356j1385o4143M490P4308
15369H9814p299L1057p8015p0790n588k7633J6675m9990Q8494R2667j5713j254
15357F2425m1727J9056j832N6603J9449o829j04531j0343M3300L1322Q369n9362
15345A5900o9764K065k9634R8413K8681j04955j69455j8789N8423J42167n409
$$ y = [-151385, -138696, -55964, 19030, 105405, 51704, -81953, -115636, -65286, -48038, -104531, -52725, 17350, -81891, -116057, -230095, -197273, -51570, -49866, -97848, -129256, -145291, -219325, -199828, -90845, -24741, 47987, 56348, 52399, 69052, 44709, -5801, -65065, -75628, -30240, -4326, -3088, 25347, 13153, -126365, -73866, 34833, 82349, 114355, 100281, 68404, -1106, -42767, -30392, 1054, 569, 6727, -25812, 86544, 75159, 11016, 15506, 89814, 82515, 113572, 35557, -35233, -40821, -68454, -51779, -101769, -13275, 79392, 63679, 62425, 20698, 39754, 37922, 94525, 113974, 107145, 2614, -7729, 35571, 66893, 75262, 15900, -53864, -51799, -81433, 16980, 45661, -59294, -228749, -247538, -189115, -46948, -52357]
15334e2357j3969J58O7657O0379o8292J5266j3652j2344p9088m8836M2992L6253
15322f5833l153K7587l407k5589q136J2224m3307M799J05875m5749J914l3584
15310g6359l4738O5868M5627J3697J2943K1315o900q043l8879k692Q7939K2147
15298A01925n3214l2531l9827K2700L7020j3436q9301j6484N1584J5006m877N2451
15286C1016J0404O7453J8444m4409p2337n9256k1936J4948m2630m6461j0212o73
15274a55649J1333M7845L3914J2903m3772J00993N0170L2226l9661M262K0037
15263G4601N1756l6772k0270n5041k5857J9737k4936L5103M9833j24369r5214
15252a51429K8563P5028l9193q4973m9489j1642J00093J48810m2248q4518P9289
$$ y = [-52357, -66326, -66168, 1489, 61868, -6424, 8842, -4810, -17154, -96242, -145078, -102086, -65833, -68986, -41399, -44806, -70395, -78531, -66307, -109614, -104815, 1060, -44689, -42775, -76359, -111097, -45229, 398, 14095, 27038, 48353, 41453, 33410, -5469, -8161, 79778, 101925, 48711, 16180, -23647, -947, 36073, 22637, -66664, -83148, -31564, -16558, -21435, 31016, 41420, 108873, 127317, 82908, 10571, -48685, -70621, -55673, -98303, -144764, -154976, -155649, -144316, -96471, -62557, -49654, -93426, 7567, 57737, 89963, 50302, 54564, 74601, 126357, 89585, 69315, 14274, -11583, 8154, -16782, 18321, 68154, -56215, -151429, -122866, -47838, -87031, -172004, -221493, -233135, -133042, 15768, -26480, -110998, -31709]
15241c1709j3495P740O5970J5215j4952O8689k8182j04500j20253n8038M7138
15230a66377K6879o308m2780P1901J30024P0766o2911l8058r019j2179J8598K2766
15218C302j378P7212N1294q8601p313l5736m1038n3317L5259Q1863m7461L7574
15206A1660J5157K929M3835M7191j07145l1361K8678j3865P7121l7663M825L5050
15194G6412j33748p1348J21175N2919k8099n6679j17387J2104j7137J1759J8272
15183a31757n314R5177N8273J1801l4296K1495J05635J2054j6334m3129p1250
15172B355m2002J0602N2338l7853n5751o3105l2577L0703N9216R7507M6585l2432
15160C5586r0837p2815o304O2469L993M139n5191k8795m1252J2796R9958J0014
$$ y = [-31709, -45204, -37464, 28506, 43721, 28769, 97458, 69276, -35224, -155477, -213515, -166377, -139498, -145806, -188586, -116685, 13339, 84105, 21194, -16864, -25883, -38062, -19464, 3302, 1924, 79136, 130430, 41829, 34516, -1220, -42258, -95575, -60316, 21547, -25914, 11660, 26817, 29746, 73581, 120772, 13627, -17734, 10944, -2921, 74200, 36537, 41362, 76412, -57336, -128684, -7509, 45410, 17311, -39368, -156755, -144651, -161788, -150029, -131757, -137071, -41894, 16379, 28180, -6116, 15379, 121014, 133068, 116734, 73605, 2355, -39647, -29045, 23293, -14560, -70311, -133416, -165993, -135290, -76074, 21433, 68018, 35586, -55251, -128066, -134370, -71901, -67908, -63769, -118960, -147755, -189007, -176211, -76253, -66239]
15148f6239K6365K8667n8196J420K3223N9625j7002j6925k522J4440l1056l0745
15136f8945K4084j7313k9634m8836R584P1107l1088K1746P6730K4689j47928k8477
15124a44281R6185L8447l1390j14367m9486L7452Q2569P2654O9943j9551m0767
15113b592p184m2043o3128m7062n6217k5558J11853P1295P1923R4637k4812j10197
15101b9085l9702M486N0674J5485l2478n3986M5050j4921j0706O6218m2152k6345
15089f7462p5108O3909Q1129k4292j6258P1265P5343J3018j01605r7357L9710
15078c7708k5995J0680L5277L7597k1633l2923n1860j6484q121k7705P1592o732
15066g4015O1726O2397K1071O7318n694j5921m9264k3129j5641M3714n8355j71899
$$ y = [-66239, -39874, -11207, -69403, -67983, -44760, 14865, -2137, -19062, -21584, -7144, -38200, -68945, -44861, -62174, -91808, -140644, -131060, -59953, -91041, -69295, 7435, 32124, -115804, -144281, -48096, -9649, -41039, -155406, -204892, -167440, -84871, -12217, 57726, 38175, -2592, -9776, -51819, -114947, -162009, -218226, -243784, -131931, -60636, 11287, 105924, 81112, -29085, -68787, -64301, -13627, 1858, -30620, -84606, -39556, -54477, -65183, 1035, -41117, -67462, -142570, -78661, 2468, -21824, -38082, 33183, 108526, 121544, 19939, -77418, -37708, -63703, -53023, -17746, 19851, -1782, -34705, -86565, -103049, -111170, -138875, -67283, -74015, -12289, 50108, 71179, 138497, 132803, 116882, 67618, 44489, 28848, 72562, 14207, -157692]
15054a57692l2108J1844L9628k1314J10475R6826o3705q4290l3343M2730k6218
15043a17167L9051j4744J5407J253K8427l243L0948J0162L6880n5854R426P3655
15031E4201m5892L9762Q4231l0803q9770o7843n3603O8941J08301k7243m7484
15020g202P2068K7170j5202j172K3074n5418k2090m1622o1245N6678J02982k8177
15008D9844m7555k0403J5580L1096Q4434j06181m0806J1664M1080k1477L6436
14997C3712p2455Q803M2672J2559K9489j11515j03404r055j4859J72661J10398
14986I9006M614m1999r6826k0956M8874k8769J8865k6265M132K0480j910N5530
14974C4776k0913l7086M1984J04919l1736n2563j31260j7165R2734l0984N6952
$$ y = [-157692, -189800, -177956, -138328, -159642, -49167, 47659, -16046, -100336, -133679, -90949, -117167, -78116, -92860, -77453, -76200, -47773, -51016, -20068, -9906, 26974, -28880, -19454, 54201, 8309, 48071, 132302, 101499, 11729, -56114, -109717, -40776, 67525, 40282, -7202, 64866, 92036, 76834, 75662, 98736, 43318, 21228, -20394, -81639, -24961, 78021, 49844, 2289, -18114, -2534, 28562, 112996, 6815, -33991, -22327, 18753, -2724, 33712, -38743, -29940, 12732, 25291, 54780, -56735, -160139, -169194, -184053, -11392, 99006, 103620, 61621, -35205, -56161, -7287, -36056, -17191, -43456, -39324, -18844, -20754, 34776, 13863, -23223, 18761, 123680, 91944, 39381, -91879, -109044, -16310, -47294, 9658]
14963I658O7059l4250M5027k905k2863p3874o6719l6625k00P4292j709k187j2082
14950e7378j1124J2607r929q4389K4098N6222O7067L7838l6504j33739l0818o5809
14938b31858J1885L2000J1519Q8375J66165J9914o6848l1078k2091j7097Q646
14927c0468L0349n2075K7039j3697L892m3722M02l635R5885k5145p0614J9451
14915f2338K9419l8216j407K1298Q4447N5809k3307L3421p4920l8940L4815K2823
14903D2904k4740l1889P1577j3478j18850m5712M7158N2808J7743n832j2784j6198
14891c7293n3964l8621P2022n920J1210M495L9521j7337M1005N4719q849r2158
14879c1170q2237M1631L0573k644P3487k4344j1451R992K6183l9331P2231l165
$$ y = [9658, 76717, 42467, 87494, 84589, 61726, -12148, -78867, -115492, -115692, -41400, -43109, -45296, -57378, -68502, -55895, -65824, -150213, -126115, -69893, -2826, 35012, -1492, -135231, -166049, -231858, -219973, -187973, -176454, -88079, 78086, 98000, 31152, 74, -22017, -39114, -30468, -119, -52194, -25155, -38852, -34960, -78682, -78280, -81915, 13970, -11175, -81789, -62338, -32919, -71135, -72542, -51244, 33203, 89012, 65705, 99126, 24206, -14734, 20081, 42904, 18164, -13725, 57852, 44374, -74476, -120188, -73030, -20222, -2479, -8311, -21095, -37293, -91257, -129878, -57856, -63776, -52566, -48071, -8550, -25887, 15118, 69837, 60988, -31170, -113407, -71776, -41203, -43847, 29640, 5296, -6155, 3837, 30020, -9311, 62920, 59755]
14867E9755m3999K8692N6844N4185o6894m0130j0458j01914p0432k6329M3748
14856a16932J21870L9398J4080M2443j8278k9910n2476K3595O1540n1731K3466
14845E7065m929m2705j9134m4261L5906q12l5804o6660Q569L3408O4074r304k1836
14832d6423j13777J8509P7087L8813R817J1929N3473p0692j6133j629k3986N585
14820e7427L7200L1183o6406K8759K5584R624J18922M7568o3013j14354K34L4530
14808C2404N0360p0686J7063n9845p4962M4850P3661L935j5844O4600N7201j7784
14796A04953j37042n6254O8426L280n7942M0221m4070k8087Q8086J24318J0570
14785A16459l9582p1570J3060m8795l2388j4472O5506L0158l2874j23787j5623
$$ y = [59755, 15756, 44448, 101292, 155477, 88583, 48453, 37995, -63919, -134351, -160680, -116932, 4938, 44336, 58416, 100859, 82581, 52671, 195, 23790, 85330, 33599, 57065, 52136, 9431, -9703, -53964, -18058, -18870, -54674, -121334, -112765, -79357, -15283, -24587, -46423, -160200, -141691, -64604, -25791, -15974, -4045, 49428, -21264, -37397, -39026, -63012, -57427, -20227, 10956, -55450, -26691, -1107, 8517, 127439, 175007, 111994, -2360, -2126, 32404, 82764, 12078, 29141, -30704, -105666, -60816, 12845, 16780, 936, 65536, 122737, 104953, -32089, -88343, -19917, -16637, -74579, -34358, -78428, -106515, -18429, 105889, 116459, 76877, 5307, 18367, -30428, -62816, -77288, -11782, 18376, -14498, -138285, -153908]
14774a53908R2940O6468j08134O9197Q7202p738m7561P3102R017l2959k2125m4973
14762a9472n6608L3538J0752Q8625N7736o732j11622o6816M1596R276P3923M6869
14750A01065m207o1218n9275p0732j3608R1579Q0744J4094m6082L839p4340p0649
14738a08790m9594J31632J07856k4649o9977o868j7086K701l0330K7769N5567
14727A8231R4192j40505o6664l1925N2020N9024Q768P9332J9865j5244l9781l2254
14715E059K2337L8449L3050r9120o5685K6634R1623j1438k063l6291k7589M5717
14703B0683L4945k4761o6930k9807J63827n7547j17161q5980L5468R8652J3730
14692a4881j60869J6923L2149M6292O5946k656R0779k5221l2942O9178o8075m7803
$$ y = [-153908, -60968, 5500, -102634, -33437, 53765, 46027, -1534, 71568, 80585, 47626, 25501, -19472, -76080, -42542, -31790, 56835, 114571, 107839, -3783, -70599, -29003, -19727, 54196, 101065, 96858, 35640, -23635, -94367, -107975, -16396, 64348, 78442, 32360, 36199, -38141, -108790, -158384, -26752, 81104, 56455, -13522, -20390, -37476, -34775, -65105, -37336, 18231, 112423, -28082, -94746, -126671, -74651, -15627, -6859, 72473, 92338, 77094, 37313, 5059, 27396, 65845, 98895, -225, -65910, -39276, 52347, 40909, 38846, 2555, -25034, 20683, 55628, 30867, -36063, -65870, 97957, 40410, -76751, -162731, -127263, -28611, -14881, -175750, -158827, -126678, -80386, -14440, -17096, 73683, 48462, 15520, 84698, 16623, -31180]
14680c1180J7295Q5348J6457R180j5959k8898j8231r1821M0592L2368m4246j4945
14668d4040P4915N9518n7539n6331l0404o2894l4582Q7378R27q882K0329M8884
14656b721k0830K6532N573q5743L4212m6165R5101P9642k5021p4919k6819O779
14644c4379n6324k8346m0532o9044O4538R4830M3238R7237N4095o6707j58841
14633a00235J885Q7035M8831O429j2033N0022K870k3992j8418q3671q2381K2432
14621a01226Q9461R7783m599n4048K8929K7124m2018k7699P58l7922k96Q8525
14609F4772k4891l2714m5674k3708R234L4911L0391L4720n2232j139R190M2207
14597D5067j0319n0898j6469k8203L5457j0438j457j2315K0237n7025o484J14519
$$ y = [-31180, -13885, 71463, 87920, 97100, 81141, 52243, 34012, -57809, -17217, 15151, -29095, -44040, 30875, 90393, 32854, -23477, -53881, -116775, -151357, -63979, -63052, -71934, -51605, -2721, -23551, 2981, 8554, -77189, -42977, -89142, 5959, 85601, 60580, -14339, -41158, -34379, -90703, -119049, -159581, -228625, -164087, -69257, -26019, 71218, 125313, 58606, -100235, -98350, -11315, 37516, 43945, 31912, 81934, 84804, 60812, 42394, -41277, -123658, -101226, -11765, 86018, 81419, 27371, 56300, 83424, 41406, 13707, 14465, -23457, -23753, 64772, 39881, 7167, -38507, -62215, -52981, -18070, 12321, 47041, -5191, -6330, 2860, 45067, 34748, -16150, -32619, -60822, -25365, -35803, -37260, -49575, -29338, -86363, -92847, 21672]
14585B1672J157K5088n0023n1298K944Q7269J7406j4495j8611R7685Q9306k2539
14573A85561j02471k0404P3722O076n836k3799l5510k3516p8912O064L7674L3672
14561E2321m015Q544n1257q756m4461q13J4229j7830m0498M2545J25511Q4956
14549A60476o2022K8781j1496m0389o0419K3694J2450Q7856J12189j067k9522
14538B20531j2653O3879K1980k1200R1532J26941k9577j0103j6158j7741Q240
14527D25671k12L1617L2606L3575l0530j3366n2172q0006m8649j1151J6876n1182
14515B53077k4888k5534l1486l5798l8690K1664M4351J7371O0348L2156o046k8211
14503B38314K6722K8567O2762q846n6835m1632O0257O1188k1328M5718k100o3807
$$ y = [21672, 22829, 47917, -2106, -53404, -50460, 36809, 54215, 39720, 21109, 118794, 208100, 185561, 83090, 62686, 136408, 142484, 136648, 112849, 77339, 53823, -25089, -19025, 18649, 52321, 48306, 56850, 5593, -3163, -47624, -48437, -34208, -52038, -92536, -49991, 75520, 160476, 98454, 127235, 115739, 75350, 14931, 38625, 51075, 138931, 251120, 250053, 220531, 207878, 271757, 293737, 272537, 364069, 491010, 461433, 451330, 435172, 417431, 425671, 425459, 457076, 489682, 523257, 492727, 479361, 427189, 347183, 298534, 287383, 304259, 253077, 228189, 202655, 171169, 135371, 96681, 118345, 162696, 180067, 240415, 272571, 266525, 238314, 265036, 293603, 356365, 347519, 290684, 249052, 309309, 370497, 349169, 394887, 392787, 328980]
14491C28980k6312m6528N137K783o0199N442l003l7118j47231j8595M9761P2408
14479A25525J7301l2853J6019p2636R1489m8667p9051o9310o6571k4243P1121
14468g1876J7419l9791Q36k0364M3012m8794J5106O3102l0694j1800J8964n4017
14456a18897o5151L4890Q7672O8846k6803k6839P4665p74p943M8505l7007n862
14444B5302n1543L9198k9482P738n1367K8810L9319o3627l9537O3674l7607P0308
14432A186J20588k1393o9339r538q5523n982J1312j9124j5187M1535J17389L7586
14420A03510m7488k4438j0442j9643K2144L1015j21100p8835J2646M3996J11880
14409B3245P2951n5641j3937k6004l6072k2695M7943K9462L934J4827k706m5624
$$ y = [328980, 302668, 256140, 261277, 264060, 203861, 209303, 206300, 169182, 21951, 3356, 53117, 125525, 142826, 109973, 125992, 53356, 144845, 96178, 17127, -52183, -118754, -142997, -71876, -54457, -94248, -93412, -113776, -70764, -119558, -104452, -41350, -72044, -83844, -64880, -118897, -184048, -149158, -61486, 7360, -19443, -46282, 28383, 27609, 19666, 68171, 31164, 25302, -26241, 12957, -16525, -8787, -60154, -31344, 7975, -55652, -95189, -31515, -69122, 1186, 121774, 100381, 31042, 21504, -64019, -70001, -58689, -77813, -93000, -51465, 65924, 103510, 56022, 31584, 21142, 1499, 23643, 54658, -66442, -145277, -132631, -88635, 23245, 96196, 40555, 26618, 614, -35458, -58153, -10210, 19252, 23186, 38013, 35307, -10317]
14397a0317M6825N4978J717k4251q9k1932l9185k9219L6443K1157J2904j6287
14385C2744p1501n8551K8921N2552l2443K9547l9988l2131J3833P0206M5375k3774
14373A4790j5859m1691N3330L9005q8914k7962R107L577n0006J02404N9353m8581
14361H553j8241j896m1737N0777p408J8825o1546N5803J09617L8867P7313k2647
14349B06280j14534j6663P7766n4590K3306N9189m1764r7769j31678j24075K2095
14338a92437R8787R0202N9287n8555p4991m9202J2364O4626O9656N1039K1630
14327I2406j9947m2576p599l3621k3299n0918J6098J5857P7622L3349p030n9104
14315h762q5711p8777J27942J12626j03927L8656L2812n8083L5425L4766n6272
$$ y = [-10317, 36508, 91486, 93203, 68952, 68863, 46931, 7746, -21473, 14970, 36127, 49031, 32744, -38757, -97308, -68387, -15835, -48278, -18731, -58719, -90850, -77017, -6811, 38564, 14790, -1069, -42760, 10570, 49575, -39339, -67301, -58194, -54617, -104623, -2219, 57134, 8553, -9688, -11584, -53321, -2544, -9952, 8873, -52673, 3130, 112747, 151614, 228927, 206280, 91746, 75083, 152849, 98259, 121565, 180754, 138990, 41221, -90457, -214532, -192437, -93650, -3448, 55839, -2716, -77707, -126909, -114545, -49919, 19737, 70776, 92406, 72459, 29883, 22284, -11337, -34636, -85554, -69456, -53599, 24023, 57372, 50342, -8762, -94473, -173250, -45308, 67318, -36609, 2047, 34859, -23224, 12201, 46967, -9305]
14304i305l2426j8294L9794L1268M166j183p3093m7772L2751J49760M1373N3115
14292A70154n5364r3265j9188K1952J12186k0396n6851q6202K2383P6700P8759
14281A50868n474k6682J6186p0082j7219M208J5616j3023K3051K7450o257R8211
14269A96853L7102j9527K3787K8190p0015n7815K0461o0372k1623O2270R2103
14258B31414J1797k0960m0791p2626q9234N1195P0197n8790l6255L6075L2916
14247A14938j6251L1624J7764m1107k3199K2255L5948m2989m6302j5664l6599
14236D18j25370q8493L1468Q6623M7574L105l0079K2681L9421j2187J4487j8593
14224b8945j4912j3056J6758J9683J39047K8718j5804n7670k6184o397L928k2696
$$ y = [-9305, -41731, -60025, -20231, 11037, 15203, 14020, -59073, -106845, -74094, 75666, 117039, 170154, 114790, 21525, 2337, 24289, 136475, 116079, 59228, -26974, -4591, 72109, 150868, 145394, 118712, 134898, 64816, 47597, 51805, 67421, 54398, 77449, 104899, 98642, 196853, 233955, 214428, 238215, 266405, 196390, 138575, 159036, 98664, 77041, 139311, 231414, 243211, 222251, 181460, 108834, 19600, 70795, 140992, 82202, 45947, 82022, 114938, 98687, 130311, 148075, 106968, 83769, 106024, 141972, 98983, 52681, 37017, 418, -124952, -213445, -181977, -95354, -47780, -44675, -74754, -52073, -12652, -24839, -10352, -28945, -43857, -56913, -40155, -20472, 118575, 147293, 131489, 73819, 47635, 41238, 45166, 22470]
14212B2470m0834j5621Q1001M1329k5677j9760j2139o8471j3124J6383k5969J1934
14200d8478J37699K9093l4756M4023j3942M7993M9466Q670j8149K0491l3886O044
14188A94268n5349k6028O516K800K4219K3776N4700Q1791K2322M7422k9924L2914
14176C79427J7551m9845p7493n6648j124J37452J74440j4270n9904R643m7196
14165D12033k0713L1650j931M9583n5940k9555K1133N3398K241m8206jN4504L0393
14152D98589J963O3477L5235q5981l1473L7716L4270o8340K5526M5865K9730n81
14140E85996J14067R7438J5158k728K5112K1883R3661P5462L4338M7463L1205
14129A139055J8104O7467J5839q0826N6281P6717Q6893J8550O8970J03028J52229
$$ y = [22470, -18364, -33985, 47016, 88345, 62668, 42908, 30769, -37702, -50826, -34443, -60412, -48478, 89221, 118314, 83558, 127581, 113639, 161632, 211098, 219768, 201619, 222110, 188224, 194268, 138919, 112891, 119407, 122207, 146426, 170202, 224902, 306693, 329015, 376437, 346513, 379427, 396978, 347133, 269640, 212992, 211868, 349320, 523760, 509490, 449586, 459229, 412033, 391320, 422970, 421039, 470622, 414682, 385127, 406260, 459658, 461899, 413693, 413692, 468196, 498589, 500552, 564029, 599264, 513283, 481810, 519526, 553796, 485456, 510982, 556847, 586577, 585996, 700063, 797501, 812659, 809931, 835043, 856926, 950587, 1026049, 1060387, 1107850, 1139055, 1157159, 1224626, 1240465, 1159639, 1215920, 1292637, 1379530, 1398080, 1467050, 1570078, 1722307]
14118A722307P9144N1835J90225J34587J16659J10483K58680K80436K52513K50757
14108C447626L32056K81468M02502N69613O24926N22898O07012Q01752Q67165
14099H457018R44237J186860J336448J445361J657413J881430K208610K442194
14091B1559571K862969L116814L423306L645997L804158M029309M002822L759251
14083E0204197L442934L070804K511784J840310J159808N34526j12480o54699
14075F1997184r99124j323447j489452j556286j591162j489106j305202j230872
14067E1012533j007260p31780n39383l22959k7877K45033M53516P93289J031379
14058E0906491J275491J420707J581253J725736J755602J637447J522076J184953
$$ y = [1722307, 1801451, 1853286, 2043511, 2178098, 2294757, 2405240, 2663920, 2944356, 3196869, 3447626, 3779682, 4061150, 4463652, 5033265, 5658191, 6181089, 6788101, 7589853, 8457018, 9401255, 10588115, 11924563, 13369924, 15027337, 16908767, 19117377, 21559571, 24422540, 27539354, 30962660, 34608657, 38412815, 42442124, 46444946, 50204197, 53647131, 56717935, 59229719, 61070029, 62229837, 62764363, 62651883, 61997184, 60998060, 59674613, 58185161, 56628875, 55037713, 53548607, 52243405, 51012533, 50005273, 49273493, 48734110, 48411151, 48383274, 48628307, 49081823, 49875112, 50906491, 52181982, 53602689, 55183942, 56909678, 58665280, 60302727, 61824803, 63009756]
14050F3009756P28401K51818k91516q93110j617824k317815k923473l273939l591141
14041D9081157l823300l956776l905485l787515l548142l223257k956155k646865
14033B1233662k315982k104635j793395j497527j331527j198770j157538j003858
14025H830430q57511p74342o46993n74319m97557m14377m34477m16539k31105
14016C983210k29392k16755j91853j86652k33876k76268k06804j11574l8425j44154
14006B147457q1515j00542q3458k9543j25918j30308l1421n9150o2706n6387j7045
13995A369464N689o0891p3160o6580N983m6204K886j03109m4944R740J9461K2841
13983A041176k9578p4657m0536k7267j8748m3345o0646N6139p258J0436P013k0793
$$ y = [63009756, 63738157, 63989975, 63698459, 62805349, 61187525, 58869710, 55946237, 52672298, 49081157, 45257857, 41301081, 37395596, 33608081, 30059939, 26836682, 23880527, 21233662, 18917680, 16813045, 15019650, 13522123, 12190596, 10991826, 9834288, 8830430, 7972919, 7198577, 6551584, 5977265, 5479708, 5065331, 4630854, 4214315, 3983210, 3753818, 3537063, 3345210, 3158558, 2924682, 2648414, 2441610, 2330036, 2291611, 2147457, 2065942, 1965400, 1881942, 1852399, 1726481, 1596173, 1564752, 1505602, 1442896, 1386509, 1369464, 1375153, 1314262, 1241102, 1174522, 1180505, 1134301, 1137187, 1034078, 989134, 998874, 1018335, 1041176, 1011598, 936941, 896405, 869138, 850390, 807045, 746399, 802538, 795280, 805716, 812729, 791936]
13971G91936o6891m4193m7640K6162K8956L587o1728r4220N6747m298p1075k95
13959E17048N0913L2124K354j20910o2811P1831Q4694J0940J1476k7161P14k0069
13947E51143J8027n7242p6085j2789J4938o207K7774j7493m7436L0523P1520J4547
13935E11220k8736m6903K5327m2963J2153P0967j00371j06026J1289O3805N280
13924C75042L546r6507j38132K7202J7170l5554O8462J75372P77p2270k2819L9514
13912C41803J8569k5253p4569L2812K0003l1663M0628j820m5636M674q7448p0473
13900A21627m7428Q021L1551M3785J178l6586N089L003L3886k6487l5753m6290
13888E5596J10518J05091K2612j32916o6344k8843j7496J01050k9848j41448k8011
$$ y = [791936, 725045, 680852, 633212, 659374, 688330, 691917, 630189, 535969, 592716, 588418, 517343, 517048, 567961, 600085, 602439, 481529, 418718, 490549, 575243, 586183, 597659, 570498, 571212, 551143, 569170, 511928, 435843, 423054, 437992, 431785, 459559, 442066, 394630, 425153, 496673, 511220, 482484, 435581, 460908, 417945, 430098, 501065, 400694, 294668, 305957, 369762, 375042, 378588, 282081, 143949, 171151, 188321, 152767, 221229, 396601, 397378, 325108, 302289, 341803, 360372, 335119, 260550, 293362, 313365, 281702, 322330, 320510, 274874, 279548, 192100, 121627, 74199, 82220, 113771, 157556, 158734, 122148, 127237, 130240, 164126, 137639, 101886, 55596, 166114, 271205, 293817, 160901, 94557, 65714, 48218, 149268, 119420, -22028, -50039]
13877e0039O3721N2672R2033N0814J7810k5207j26212o0383M2885M3085L2491
13866A33670k8912o3909m372p6834L7957N8274M3312n8624p021J2622k3274m1930
13854a9041l1061O3366P3229L1459K7316r053p1620p5200k1129L0820l4813q3107
13842a18834j7265k8636j0246J4104J49719J34937K4327o5410K190m33k642J9675
13830A01486m3836p2550n9898P5081J8699r2269n878j3206K4148N0224N6685k1216
13818A7470K6825j0575J9613J4650N7256m899k4089m3310L7755N1635r8522o3399
13806a9590J4438o322k4486k7747L1707N6005N1448p0068J8791J46967K5635k4045
13794A72733n1737p1913L7976n8431M0409O1419k7754j0573P384n1826M920K225
$$ y = [-50039, 13682, 66354, 158387, 209201, 227011, 201804, 75592, 15209, 58094, 101179, 133670, 104758, 40849, 36477, -40357, -2400, 55874, 99186, 40562, 33541, 46163, 22889, -19041, -50102, 13264, 86493, 117952, 145268, 136215, 64595, -10605, -31734, -914, -35727, -118834, -136099, -164735, -174981, -160877, -11158, 123779, 148106, 82696, 84886, 84453, 81811, 101486, 57650, -14900, -74798, 283, 18982, -73287, -79165, -92371, -68223, -17999, 38686, 17470, 44295, 33720, 53333, 67983, 125239, 120340, 96251, 52941, 90696, 142331, 43809, -19590, -5152, -11474, -35960, -63707, -32000, 24005, 75453, 5385, 24176, 171143, 196778, 172733, 120996, 49083, 87059, 28628, 69037, 130456, 102702, 92129, 99513, 47687, 52607, 54832]
13782E4832k5116j9220P7637j2606m1850M4644J12896l5216o3583j4155R49j5447
13770F3765J3306N4087k215L3390j8302k5179J9565n395l7624K8123k1533l5174
13758F6814O2317J9794n0840j18082J05526P5450L0002J8531o7640k3986l3702
13747H4184P45o3252l5979k010L751Q6186r350m5522L8189J9954J6813l9342k1701
13734C2666p5408L4286j2314l1832O8217k3047K8797N1693q3746m9193o8054J8899
13722a09036J18456J53089k0523M744k7021p5774l0557K1664o6360m5289J2254
13711f4353k1769L8512M3646p675k0797K6076L5255R1619j7932p261m2813j08064
13699e5556m3573L8634J6352j1818M5913P788o9665J759O2146P2182K7144q4793
$$ y = [54832, 29716, 10496, 88133, 75527, 33677, 78321, 191217, 156001, 92418, 78263, 79212, 63765, 77071, 131158, 128943, 162333, 144031, 118852, 138417, 133022, 95398, 123521, 101988, 66814, 129131, 148925, 98085, -19997, 85529, 160979, 190981, 209512, 141872, 117886, 84184, 84929, 21677, -14302, -16312, -12561, 73625, 64275, 18753, 56942, 76896, 93709, 54367, 32666, -42742, -8456, -20770, -52602, 15615, -7432, 21365, 73058, -10688, -59881, -127935, -109036, 9420, 162509, 141986, 146730, 119709, 43935, 13378, 35042, -31318, -76607, -64353, -86122, -47610, -3964, -11639, -32436, -6360, 28895, 120514, 102582, 95321, 52508, -55556, -99129, -60495, -44143, -55961, -10048, -2260, -71925, -70166, -8020, 64162, 91306, 6513]
13687F513K4039K5944m0203j6772L667K8336J68697N0099o237j01566j02912J8123
13675E7728l2881n7816m6466R4593J11860k2518j5170o1111r4357m5672R3514
13664a8296L1675O8593J11917J5026j15481L0262J01860r7353k3282L0395j1650
13653A23666l7741k929p1548k0552J12N7075N2932J9264m3156n221R421J01802
13641A83125J6168n5592q4412L3550N8702k4317m7578O1955J18628P0629J11456
13630D42314j805K8445o783P7725J2536j61008l7535n2861L9181O1207j332m3906
13618C56178q1267p7522L4627K4915N7273m7013L586k3343r364L8599j5943j8758
13606B41968k461K8336J3407K3236l0187J0102Q3746r863p9595l3057M4106N9512
$$ y = [6513, 30552, 56496, 16293, -479, 3188, 31524, 200221, 250320, 244083, 142517, 39605, 57728, 24847, -32969, -79435, 15158, 127018, 104500, 89330, 28219, -66138, -111810, -18296, 13379, 81972, 193889, 208915, 93434, 123696, 225556, 128203, 104921, 135316, 123666, 85925, 82996, 11448, -9104, -8992, 48083, 101015, 120279, 77123, 71902, 81323, 183125, 199293, 143701, 59289, 92839, 151541, 127224, 79646, 141601, 260229, 330858, 442314, 440509, 468954, 462171, 539896, 552432, 391424, 353889, 301028, 340209, 401416, 400084, 356178, 274911, 197389, 232016, 256931, 314204, 267191, 270777, 247434, 238070, 276669, 260726, 241968, 239507, 267843, 281250, 304486, 274299, 284401, 368147, 358284, 278689, 245632, 289738, 349250]
13594C49250L4896K2944p7065k05710j19735j0324J24582J02261j2237j012J5499
13583B23349n168n9948j4763L0465o8226k4951o433l1102L1489M8640k6562O9612
13571A66402l8751q6066n8393p0003N0629P4250m9654O211r783M7557N7190n4743
13559C4846l5278K6485P4895J0193l1044N329l8191j12990M4505M1134Q8674L3896
13547A42454q7755q5827l8072M4094P1683n4632k4845J08482K3764n5221j30852
13536h6727q2599K1974M6719J7928R5449o709n824m2001K9787j3805Q5362N5509
13524A15063Q590j16508l1838M8629r775k8554p5539k5928J1314L3331P4230N429
13512H444m3247l8827P6897M901j3174M7175n1428q8442l0038O1493M0163P786
$$ y = [349250, 384146, 407090, 330025, 124315, 4580, -5744, 118838, 221099, 208862, 207850, 223349, 218181, 158233, 143470, 173935, 105709, 80758, 74325, 43223, 74712, 123352, 96790, 166402, 127651, 41585, -16808, -86811, -36182, 38068, -11586, -5375, -15158, 32399, 89589, 34846, -432, 26053, 100948, 111141, 80097, 85426, 47235, -65755, -21250, 19884, 108558, 142454, 54699, -31128, -69200, -25106, 46577, -8055, -32900, 75582, 99346, 44125, -86727, -169326, -147352, -100633, -82705, 12744, 6035, 211, -41790, -12003, -25808, 59554, 115063, 123653, 7145, -24693, 23936, 14161, -14393, -89932, -115860, -104546, -71215, 3015, 8444, -34803, -73630, 3267, 8168, -5006, 42169, -9259, -97701, -127739, -66246, -26083, -18297]
13500a8297k8884j3009L0778J2897J828m5088O744l489O593K7510J03772o606
13488G4749p9620N7251l2647J4624O7284M7957o0266p0210p1069o391N1363j0752
13476a7727j9516K9852J4856J5065P7030l0123l7355K5745K8021J4146L2521n8608
13464G3907j01161o1031O2408N1910J9022N924M2513L767m3167m5465o562k262
13452a97K7416j4487j912P364k7410Q5377O3762N8609q3772o3093m4169r4344
13440h6856N3052L4733p938p5115j5595K6774M3371J06592j0542J5129j01153
13429a7548l4151P2675N3503J3601q1687m0357L4918P133K3642l0888o6422n4144
13417a19725L3552M9417P4337K9496M8987M9830l1100m6934j01327m2437O5304
$$ y = [-18297, -47181, -60190, -29412, -16515, -14687, -59775, -53031, -56520, -49927, -22417, 81355, 74749, -4871, 52380, 19733, 34357, 101641, 149598, 89332, 19122, -51947, -58338, -6975, -17727, -37243, -7391, 7465, 22530, 99560, 69437, 32082, 57827, 85848, 99994, 132515, 73907, -27254, -88285, -25877, 26033, 45055, 50979, 93492, 97259, 54092, 8627, 2065, -197, 27219, 12732, 10820, 18184, -9226, 76151, 139913, 198522, 114750, 51657, 7488, -86856, -33804, 929, -7009, -82124, -97719, -70945, -27574, 79018, 68476, 83605, -17548, -51699, 20976, 74479, 88080, 6393, -33964, 954, 8087, 31729, 841, -65581, -119725, -86173, -36756, 37581, 67077, 116064, 165894, 134794, 87860, -13467, -55904, 9400]
13406I400K1063l3398k7459M9938R0540m6212j19258k3471p0751q1173J4272R1831
13394a24678R2725P5229R254M209O204Q826L2374m0666o8832L2713L7360K7491
13382I2209m502l9969k5316K022n3766j3228N018J5605m823M178p1498K2528P2751
13369A209k1945K1417j4805O7567m8640r948n3743n1592O8420O1506L8896p2022
13357a3680k1078n2622k2064K095J0361K6100j8162O4695K7909l6210M0542o8090
13345f0204j94M8776m3585j0021j7334m3677P4227Q118P4954L2797L866N3632
13333A21355O8155n8000l4245K885J06574o9910q8503l8135N128L852P080J22367
13321A48603k2443n039N4538J03779q035l9039Q1954J76233J52403J70362K21136
$$ y = [9400, 30463, -2935, -30394, 19544, 110084, 63872, -55386, -78857, -149608, -230781, -216509, -124678, -31953, 43276, 52530, 56739, 62943, 71769, 104143, 63477, -5355, 27358, 64718, 92209, 87707, 47738, 22422, 24444, -29322, -42550, -37532, -21927, -26750, -22572, -94070, -71542, 1209, -20736, 681, -14124, 53443, 4803, -5145, -58888, -110480, -42060, 19446, 58342, -13680, -34758, -87380, -109444, -107349, -96988, -70888, -89050, -24355, 3554, -32656, 7886, -60204, -60398, -11622, -55207, -65228, -82562, -126239, -52012, -43894, 31060, 63857, 67723, 121355, 189510, 131510, 97265, 100150, 206724, 136814, 48311, 10176, 15304, 19156, 26236, 148603, 126160, 121121, 175659, 279438, 271403, 232364, 314318, 490551, 642954, 813316, 1034452]
13310A034452M04482N28340N00494K47115j21187m66916n37430m67354l11970
13301H10026k35671k46967r019J7843o4649o0059m8977m9798P9075K3291J8199
13290B33294k6448j04139o8545n1407p3575o1867J4631Q5499J09156N829n8455
13279C973p5978P17N7009L5322P2793j6006l6948n4003j8456K4612K5118P9643
13267I7796K344m3166q226J7157P3800n6618m1297J04938l4345j53484p0168M1497
13255f9772k2452m9824k8745N8515K1857N7767M2025j4081N6385p8099j9793l0943
13243g7160K8777N8157L5193j3755M727p6013n6456Q8582P3499p3136N0839J0041
13231E3295n3054J97n5387l6042M0187p1706O128o5078L8516M4206M3949M5912
$$ y = [1034452, 1438934, 1967274, 2467768, 2714883, 2593696, 2126780, 1589350, 1121996, 810026, 574355, 327388, 318369, 336212, 271563, 211504, 162527, 112729, 191804, 215095, 233294, 206846, 102707, 34162, -17245, -90820, -152687, -138056, -52557, 56599, 62428, 3973, -72005, -71288, -14279, 21043, 93836, 77830, 40882, -13121, -31577, -6965, 18153, 97796, 100140, 56974, 48748, 65905, 139705, 83087, 41790, 146728, 112383, -41101, -111269, -69772, -92224, -142048, -170793, -112278, -90421, -32654, 9371, -4710, 51675, -26424, -46217, -77160, -48383, 9774, 44967, 31212, 35939, -40074, -96530, -7948, 65551, -7585, 43254, 53295, 241, 438, -54949, -90991, -50804, -122510, -116382, -181460, -142944, -98738, -54789, -8877]
13219h877Q1242N8234j8038n6574m2708J0612l5160O4006k8988J0652m2062J7386
13207I725M9103k8015n7539N8692N0566l106k8685j9866m5001M7620o7277k2781
13195e6564Q9323j4134r801m3808J5669M9341q153n0646j853J7418L3024O4621
13183H4437N6201K1042j16344q282j0535R3095L3481l121q5836n5475j958l2787
13171b6082q0805j3543Q3545l113o5526j3467j9395N5038Q7014K7437q847p5340
13159e3084j5388O0047O2933l8478o350L6057j2119j1885K5627J1027j3979M167
13147D8575J0640k9177m8528L0907k6717L1004L6427l867p218l1924n9774O0602
13135A0950j7053l0474q32L1187K137l2098L8393O8837n4218J8808l8567j24706
$$ y = [-8877, 72365, 130599, 112561, 55987, 13279, 23891, -11269, 52737, 23749, 34401, -7661, 9725, 58828, 30813, -26726, 31966, 82532, 79426, 50741, 30875, -14126, 33494, -33783, -56564, 32759, 18625, 8824, -34984, -19315, 30026, 21873, -28773, -30626, -13208, 19816, 84437, 140638, 161680, 45336, 37054, 26519, 119614, 153095, 149974, 64138, 8663, 6705, -26082, -106887, -120430, -36885, -39998, -105524, -118991, -138386, -83348, 3666, 31103, 22256, -53084, -68472, -8425, 54508, 16030, 9680, 45737, 33618, 21733, 47360, 58387, 44408, 48575, 59215, 30038, -18490, 12417, -14300, 16704, 53131, 49264, 42046, 10122, -49652, 10950, -6103, -36577, -37409, -6222, -4085, -36183, 2210, 71047, 16829, 35637, -2930, -127636]
13123a27636o582L2590k5819o130Q4590N6149J00418L4530J2049j0553r7190j1303
13111C5113l4190l7450r495J276l6702j2876K5569P6889J07754L073j08218l5953
13099b5210L1529K255K5428L1089K8185N0324J8610j13512p7408J1556J9149k274
13087b79L0925k8662j3982L0392J25051l399j7387j4945n5159N138M8870O1963
13075A68526Q4415p139l1024o0741L7902M9567O3035J1018j4098n925N0539J8416
13063C64491j24387j27504o0499j15262j1265k7615l798P7880J6589N700L2737
13052B7067m1009m5422K6512M0823R8618R4628L573l3145p6070l8721k78j1243
13040D5333k9924j6792p3164l6523L1810O6854k4006k3947K7454K9931n9792r0922
$$ y = [-127636, -134218, -101628, -127447, -133577, -48987, 7162, 107580, 142110, 154159, 143606, 46416, 35113, 923, -36527, -46022, -44746, -81448, -94324, -68755, 8134, 115888, 118961, 10743, -25210, 6319, 8574, 34002, 65091, 93276, 143600, 162210, 48698, -28710, -17154, 1995, -279, 30646, 1984, -11998, 18394, 143445, 140046, 122659, 107714, 52555, 57693, 106563, 168526, 252941, 245802, 214778, 154037, 191939, 241506, 304541, 315559, 301461, 295536, 346075, 364491, 240104, 112600, 52101, -63161, -74426, -102041, -105839, -27959, -11370, -5670, 27067, -13942, -59364, -32852, 7971, 106589, 201217, 204790, 171645, 95575, 56854, 56576, 45333, 15409, -1383, -74547, -111070, -79260, -12406, -36412, -60359, -32905, -2974, -62766, -153688]
13028a53688R6719J0734k4340K3232O1235L334m253n6944J8478K6765K4498M1797
13016F7567l5063o593N677P2247n4558j12127N0046o863k6059P3341l3119K806
13004b698m7295O7250o743O825J3100P6263M8602r2171k8302J7764K172K9270
12992H4037m7172j5941o6995J9620k9801p5443P8188M3818N9897Q9152J3797m5241
12980A07916q2808N5547R0877j8105J4521R7616P5125r0451k9262O1217k1956
12969B60237j9878n9568k281J58120N4764k5785o1273m4920N7726J3470k400k7515
12957C00697p440k1106K0203k5049n0348r8251J3664K6913J9411L2255N3600j2360
12945B52189n6747j3258L8626M5341m3546l5466p741J5316N4318R2663L9420o4088
$$ y = [-153688, -56969, -46235, -70575, -47343, 13892, 17226, 12973, -43971, -25493, 1272, 25770, 67567, 32504, 25911, 31588, 103835, 49277, -62850, -12804, -19667, -45726, 27615, -5504, -2698, -49993, 17257, 10514, 17339, 30439, 106702, 155304, 63133, 34831, 52595, 54767, 84037, 36865, 20924, -46071, -26451, -56252, -131695, -53507, -9689, 50208, 139360, 153157, 107916, 25108, 80655, 171532, 153427, 167948, 265564, 340689, 250238, 220976, 282193, 260237, 240359, 180791, 178510, 336630, 391394, 365609, 304336, 259416, 317142, 330612, 328212, 300697, 293257, 272151, 292354, 267305, 216957, 118706, 132370, 159283, 178694, 210949, 264549, 252189, 195442, 182184, 220810, 266151, 222605, 187139, 179398, 194714, 249032, 341695, 381115, 317027]
12933C17027Q3904R507m0518K6566J12333N6531j7906J872P9461J14144M954K572
12921G50447N5869R9768P9866J17899P8924j8397m767J06467J18318O690K5716
12910A416800R7417J05120J48692J35935R9960J21031J34803J00300J90833K38401
12900B789292J28509J84209K42445L14006L06451K35194K56611K73422L63029
12891E093168M95624N31550O15958O32150Q34625J199480J591024J921901K479037
12882A5394517L190770L982755M972075O475829Q674000J1826531J5992923K1012981
12874I1522381K7881277L9377728N9436174Q8168112J07562328Q7384784L3350504
12867E34683288l6094056r6754269j10180444r3333684o1647506l6802992k2865235
$$ y = [317027, 400931, 410438, 369920, 396486, 508819, 565350, 547444, 549316, 628777, 742921, 747875, 750447, 806316, 906084, 985950, 1103849, 1182773, 1164376, 1159609, 1266076, 1384394, 1391084, 1416800, 1514217, 1619337, 1768029, 1903964, 2003924, 2124955, 2259758, 2360058, 2550891, 2789292, 2917801, 3102010, 3344455, 3658461, 3964912, 4200106, 4456717, 4730139, 5093168, 5588792, 6120342, 6736300, 7368450, 8203075, 9402555, 10993579, 12915480, 15394517, 18585287, 22568042, 27540117, 34015946, 42689946, 54516477, 70509400, 91522381, 119403658, 158781386, 218217560, 306385672, 413948000, 501332784, 534683288, 498589232, 401834963, 291654519, 198320835, 136673329, 99870337, 77005102]
12860G7005102j5647310j1565189q985691p035223n365002l977660k976240k359352
12852A9093435j967626j756641j613905j349909j222463j082260q56480q08967
12844H435184q30778o25310m67788n13456m55857m03122l42368k80280k81861
12835D234364l08841k28290j44845r6359j38489j63286j87342j54553j42742q4911
12825B584706j16823n1896j05826j85632j38064r8300l4386P5583q2325j60842
12815A686195m7403M2299J2230j7620o9527k9101j03630n7411j0431K4559K1946
12804A452106m6846n6172L460n3167j0174N0584M8996n7631o3149k5903m7463
12793A194641n6871j03440j1380k3275o5145k4801J2939k5337O4005L1160M4133
$$ y = [77005102, 61357792, 49792603, 40806912, 33771689, 28406687, 24429027, 21452787, 19093435, 17125809, 15369168, 13755263, 12405354, 11182891, 10100631, 9244151, 8435184, 7604406, 6979096, 6511308, 5997852, 5541995, 5138873, 4796505, 4516225, 4234364, 3925523, 3697233, 3552388, 3456029, 3317540, 3154254, 2966912, 2812359, 2669617, 2584706, 2467883, 2415987, 2310161, 2124529, 1986465, 1888165, 1853779, 1929362, 1847037, 1686195, 1638792, 1681091, 1693321, 1675701, 1606174, 1577073, 1473443, 1416032, 1405601, 1430160, 1452106, 1405260, 1349088, 1352548, 1299381, 1289207, 1339791, 1388787, 1331156, 1268007, 1242104, 1194641, 1137770, 1034330, 1022950, 999675, 934530, 909729, 922668, 897331, 961336, 992496, 1036629]
12782A036629o3282o7465p14N9910K2592m003L1672J3211L7161j936K9190K4736
12770A117701L6749J45379L11788K88965K50809K1280k39171l56106k08713k08638
12760A160043k02506j00914O2581J7049k5109l7123o9530L6327L9338n6918j54984
12749F68254p0892n1589m955o1927j5409j0754n1712m0319K960k2426p5155k2782
12737B43294Q8352J02945l626J1614P8949k5036j07070p053L5204K5999J04324
12726E47896O212o6680L0403K5231P9587k2587o4218j42695L473k0924N579J3327
12714C94604N7699M7436k9969q9118o5776j1357r236J5225j6116j8363l8616J4818
12702B51231N0846J3565k6867J6158P8841k9475j10979L152m9595K8864J9602
$$ y = [1036629, 973347, 905882, 905168, 965078, 987670, 983667, 1015339, 1028550, 1065711, 1063775, 1092965, 1117701, 1154450, 1299829, 1611617, 1900582, 2151391, 2172671, 1933500, 1577394, 1368681, 1160043, 957537, 856623, 919204, 936253, 911144, 874021, 804491, 840818, 880156, 823238, 668254, 597362, 545773, 540818, 478891, 463482, 452728, 401016, 360697, 363657, 341231, 266076, 243294, 331646, 434591, 430965, 442579, 521528, 496492, 389422, 382369, 417573, 443572, 547896, 554108, 487428, 517831, 543062, 622649, 600062, 535844, 393149, 396622, 375698, 381277, 394604, 452303, 499739, 469770, 380652, 314876, 303519, 294283, 309508, 293392, 275029, 236413, 251231, 302077, 315642, 288775, 304933, 383774, 354299, 243320, 246472, 196877, 225741, 245343]
12691B45343J562J7811Q382L085M8714L4322J6710q0936r0387L7306m1158O729
12679B07483J03901L6093J4623O7800p928j28827j20873o3189K6419O5212r0702
12668A10012K3019N6822J7927J8335P91k5617p5574J3694P4629N866m1628l6802
12656A41474k2283J3993K490P0389j1891N4902L8755N946k135O0033o3778j41947
12644A45948j15857J8903J01849R533J2714O2295m352j5250m7580q2498l0489
12633E5216j583K5284K0687K1997n4100l183J3118K8019O3522K1131j0539K7503
12621B07072o2903n3375m0091q904N7076q159j2069L9764L3248N3009n3045j4144
12609A37479l969l6493o3476j2378k1986q0178Q071O0897Q5797J9914L8307L4865
$$ y = [245343, 246905, 264716, 273098, 276183, 324897, 359219, 375929, 294993, 204606, 241912, 200754, 207483, 311384, 347477, 362100, 429900, 421972, 293145, 172272, 109083, 135502, 200714, 110012, 133031, 189853, 207780, 226115, 226906, 201289, 125715, 139409, 214038, 219904, 178276, 141474, 119191, 133184, 135674, 206063, 194172, 249074, 287829, 293775, 291640, 351673, 287895, 145948, 30091, 48994, 150843, 160376, 173090, 235385, 231033, 215783, 168203, 85705, 55216, 53633, 78917, 99604, 121601, 67501, 64318, 77436, 105455, 168977, 190108, 179569, 207072, 144169, 90794, 50703, 41799, 98875, 90716, 78647, 118411, 151659, 204668, 151623, 137479, 133510, 97017, 33541, 21163, -823, -81001, -72930, -12033, 73764, 93678, 131985, 166850]
12597A66850K2357l0495k2641n367m5236K4127Q227j1493M9194l6947N175O2293
12585A86044k1707r2686m3739P4944N6201j5269K7781k7739m7646r9639M0085
12574C6630L7034M2111J2214J7973O4302N9550M2035k1286j00799q6488N7630
12563A60906M7985q1132q7324q9054o8460j4393N4806N5520L2170m3135K6498
12552e613Q3680J3702K5164n1418N497j1367Q5191L3432n8581L3916o0016P546
12540A01133M3384J13340l0662m4615j376k7930j2541j3883K4838m7047R214R9692
12528B13547l8745R5115m2639q1118j3859n7804J3146j7558l0817k18J8388K3732
12516H1170P1993q0130k9034p1130K6911N431N9398n0694L1329k9924J1224O2897
$$ y = [166850, 189207, 158712, 136071, 130704, 85468, 109595, 117822, 106329, 155523, 118576, 123751, 186044, 164337, 71651, 27912, 102856, 159057, 143788, 171569, 143830, 96184, -3455, 36630, 73664, 115775, 127989, 145962, 210264, 269814, 311849, 290563, 189764, 103276, 160906, 208891, 127759, 40435, -48619, -117079, -131472, -76666, -21146, 11024, -32111, -5613, 78067, 91769, 116933, 65515, 71012, 59645, 144836, 178268, 119687, 153603, 93587, 101133, 144517, 257857, 227195, 182580, 181204, 153274, 140733, 126850, 151688, 104641, 113855, 213547, 174802, 269917, 227278, 146160, 132301, 74497, 87643, 70085, 39268, 39050, 57438, 81170, 153163, 73033, 43999, -27131, -220, 5211, 64609, 13915, 45244, 15320, 26544, 89441]
12504H9441j8489m7115K562J1524J5981j2523L1788M5452m051P5458J9305J6271
12492B25604l6857m1479l2949j0999l8595o693J5737m899k4719q69Q6725L5533
12480A65540o3158J0242p3996J1184P7799J18585p5603m4270k6001l2287j24745
12469e6710L8859J02185Q9828q7825p2156M5203j5736N0610L8907K998L3924j9868
12457A50219o9585l8866L454k3221o3170k1714J0029J631k1324Q193M8835Q411
12445g108M0954J7901Q9141K5038Q676r7911Q475j8662M3327P3513j4465L3445
12433B02324N3907J01869J30907J5690L7743K00290K87031L27291N54178N73910
12423B485140L65013n2701l50875m87671n39415m41264l31179k31473j23442l6468
$$ y = [89441, 70952, 23837, 26399, 37923, 53904, 41381, 73169, 118621, 114570, 190028, 209333, 225604, 188747, 147268, 114319, 103320, 64725, 58032, 73769, 68870, 44151, 43282, 130007, 165540, 102382, 112624, 38628, 49812, 127611, 246196, 170593, 126323, 100322, 68035, -56710, -17851, 84334, 174162, 86337, 14181, 59384, 43648, 94258, 133165, 136163, 170087, 150219, 80634, 41768, 45222, 22001, -41169, -62883, -52854, -51223, -72547, -64354, -15519, -7108, 33846, 51747, 140888, 165926, 174602, 76691, 85166, 66504, 109831, 183344, 168879, 202324, 256231, 358100, 489007, 504697, 542440, 742730, 1029761, 1357052, 1911230, 2485140, 2850153, 2797452, 2446577, 1958906, 1419491, 978227, 647048, 415575, 292133, 255665]
12413B55665l7492K1422l2301m0403p8032m9884j5515n6275r6862q58K3011L9349
12401f8175P4832M7304p9594j26353M6703O3924J8192j19620K4529J45489J13846
12390A41077L8938L0204r6527j573j6591j1365m6192p7084j0024L9182n2674L7626
12378b5003K6198J5603K3365k9571l2943L7635M4695P235j1225J0681k6921m6658
12366f909K1458J1470O0914k1897n9916q8493M5178O8494r944k1246N9057K5913
12354H4079P4530J182j75070k2542O433M017L2329N5978o0724P3413P2320m7741
12342I8204M1339k2554l6489L0803r0005j40624p7077N3506M9864o7793L6193
12331a24633O4670n4610K9235M6316N9890j4114o514k7761M141J2636K2592o2682
$$ y = [255665, 218173, 239595, 207294, 166891, 88859, 38975, 23460, -32815, -129677, -130535, -107524, -68175, 6657, 53961, -25633, -151986, -105283, -41359, -23167, -142787, -118258, 27231, 141077, 180015, 210219, 113692, 112119, 95528, 84163, 37971, -39113, -49137, -9955, -62629, -25003, 1195, 16798, 40163, 10592, -22351, 15284, 59979, 67214, 55989, 66670, 39749, -6909, 14549, 26019, 86933, 65036, 5120, -83373, -38195, 30299, 20355, -891, 58166, 84079, 158609, 159791, -15279, -37821, -31388, -27371, 4958, 60936, 212, 73625, 145945, 98204, 139543, 116989, 80500, 111303, 21298, -119326, -196403, -142897, -93033, -160826, -124633, -59963, -114573, -85338, -39022, 20868, 6754, 240, -27521, -23380, -10744, 11848, -50834]
12319e0834l5759m7444P0355Q363K7346O4609M8457Q4578n2340p2431l8361r716
12307c177P942M4858N0238N5959l9664l0134o0004l9794j4187l1781k6643k8942
12295a15329J8947M5187L6435m6000m0682N2507M7759j056N1705N214K4639k6709
12283E2617j7368p2872L2506L486J1778O223L5740o8364M5598R2146L809l9170
12271H6129n9798l0104N4298N2524M8906j2482k6909m5793R74M5192n3235m9714
12259I988J6426P4345k0511j62209o6552N3615J3229M6825R7788L7674j7784n7591
12247B5243q1804j7520m983M0722k3009O7095M0839j7958L5432M991L2190K7357
12235A28595p0841J12922M7162o2495j19125l831R6350J5142j21655j1914N2934
$$ y = [-50834, -86593, -134037, -63682, -55319, -27973, 36636, 85093, 169671, 117331, 44900, 6539, -3177, 4765, 49623, 99861, 155820, 116156, 86022, 26018, -13776, -27963, -59744, -86387, -115329, -96382, -51195, -14760, -60760, -101442, -48935, -1176, -2232, 49473, 54687, 79326, 52617, 35249, -37623, -5117, -1631, 10147, 16370, 52110, -16254, 29344, 121490, 125299, 86129, 26331, -3773, 50525, 103049, 151955, 139473, 112564, 66771, 67745, 112937, 59702, 9988, 26414, 100759, 80248, -81961, -148513, -94898, -81669, -34844, 62944, 100618, 82834, 25243, -56561, -74081, -79064, -38342, -61351, 5744, 46583, 28625, 64057, 69048, 101238, 128595, 57754, 170676, 217838, 155343, 36218, 32387, 128737, 143879, 22224, 10310, 63244]
12224F3244L922m5609R9065L3824m7979k8825L6448J9357n6590O829N8239o5314
12212G6611p1186O3504l1602p4268J12859N9385j8841l4709M8529l4535p7032
12201A8715m8089J3740q0091k4533M9401j1303R1338R8038P1887k3120n3985m1399
12189F0599k7135n4005q4521k4896R3359K4450K6739l6466m8682j9163L7645J4673
12177c7403P2857l0414k775J7242p4134O703Q915l2727K8509Q7412L7980J0222
12165I2387M7289K8455L6862l0473n9359q7016l9868P5860L5880j3124m585K0055
12153A02363O530l7679O3505n5344p0326J7932j620J6433l2407l6960j2296k4558
12141f4427n738O6358K8716o3996q0066K9876Q7155O9968j2846o1516k2600P4828
$$ y = [63244, 67166, 21557, 120622, 154446, 106467, 77642, 114090, 133447, 76857, 83686, 141925, 76611, 5425, 68929, 37327, -36941, 75918, 135303, 116462, 81753, 130282, 95747, 18715, -29374, -15634, -95725, -120258, -70857, -82160, 9178, 107216, 179103, 155983, 101998, 60599, 33464, -20541, -105062, -129958, -36599, -12149, 14590, -21876, -70558, -89721, -52076, -37403, 35454, 5040, 2265, 19507, -54627, -47924, -39009, -71736, -43227, 44185, 82165, 92387, 139676, 168131, 204993, 174520, 115161, 28145, -11723, 64137, 100017, 86893, 82308, 102363, 108893, 71214, 134719, 79375, 9049, 26981, 25361, 41794, 9387, -27573, -39869, -64427, -70165, -3807, 24909, -39087, -119153, -89277, -2122, 67846, 55000, -6516, -29116, 45712]
12129D5712M295o5459j314N8586J3167m4180k7815K0572K0882K3905K7680L8877
12117A14908l5802j320l1329R1844J8848p5897r1047m7647J0122M7457k902J1742
12105H977O1782J9058l2586j23708r3138N2850K3506O0392k2654j3605k1496N432
12093g5190k3110M2862Q6444Q0628j28985m3098j0286K4644q0610L2979Q5892
12082g830O956l7415q110N6148K7047l3046m4263j23753m2297N2908L0981J1394
12070a11280L2658J0916k6061J38931N1096n525p6639K5M6586k7689p74m9791
12058a7547k7026k6228K8334L5012j5797k2828q25k7287J478L9854M8617n6639
12046d0882k1313J5807l1469J3684j0199K7578N8360L7638j2698l9693j21634
$$ y = [45712, 50007, -15452, -16766, 41820, 54987, 10807, -17008, 3564, 24446, 48351, 76031, 114908, 79106, 77786, 46457, 138301, 157149, 81252, -9795, -57442, -47320, 137, -2765, 8977, 70759, 89817, 57231, -66477, -159615, -106765, -83259, -22867, -45521, -59126, -80622, -75190, -98300, -55438, 31006, 111634, -17351, -60449, -70735, -46091, -126701, -93722, -7830, -874, -38289, -46399, 9749, 36796, 3750, -40513, -164266, -206563, -153655, -122674, -111280, -78622, -67706, -93767, 45164, 96260, 90735, 14096, 14121, 60707, 33018, 32244, -17547, -44573, -70801, -42467, -7455, -23252, -46080, -46905, -74192, -72714, -32860, 15757, -40882, -62195, -46388, -77857, -64173, -74372, -46794, 11566, 49204, 36506, -3187, -124821]
12035a24821n6555N5691P9132K9476o4996J0590N569k345k8082k4873K8338j128
12023i4004k9638K2093q3064J27453J36782Q5175L0324l8055j33218N8405O5269
12012A47522l2622p041L4535l5732l1617k0908L6764l9600J0973j18149j31871
12001a87746p630Q1749N4576J33308K3736m0014K8093m3875n3875p6054o9257
11990a56989K1562O2451q355n725M5094R8248Q277l2931j00926p2510N9274R9065
11978A6535M6854q2305j8827K0030J5635k4286M2609P663R308J018q5043J04800
11966E3991J31179j9515n6987l6966K4549J02016J5052m0582p8559l2046M9646
11955A11778m1764J05492N2851j17885p9468j133p932j04443N5982M5651J9182
$$ y = [-124821, -181376, -125685, -46553, -17077, -82073, -71483, -65914, -68259, -96341, -121214, -92876, -94004, -123642, -101549, -184613, -57160, 79622, 164797, 195121, 157066, 23848, 82253, 147522, 114900, 107859, 142394, 106662, 75045, 54137, 90901, 51301, 62274, -55875, -187746, -195376, -113627, -59051, 74257, 97993, 57979, 86072, 42197, -11678, -87732, -156989, -135427, -72976, -81331, -87056, -41962, 56286, 64563, 31632, -69294, -141804, -82530, 16535, 63389, -18916, -37743, -17713, -2078, -26364, 16245, 23908, 33216, 34234, -50809, 53991, 185170, 165655, 108668, 71702, 96251, 198267, 213319, 172737, 94178, 62132, 111778, 70014, 175506, 228357, 110472, 31004, 29871, 21939, -82504, -26522, 19129, 38311]
11944C8311k8429m0490j4130J0958j0634o674j8990L9658J8536k2497L3979k6297
11932b6699p0248o4309P0446K2797K8689N1094M4082k1565o7217j7199l8763j2964
11920a01856J1875J5028p3108J1187N6930j2712J0853P5255l5612l1874J7057
11909e6977K1950N086L3695r614L5670O6206m2178J08045L5599o8271q7686j479
11897D0046m1283q1330q3524J585K259P0861M5755O378J76276L3939r1960o2026
11885A6976J4148k6130k2232l5487J08747P3519R25l9430k6937L0924K8409j7106
11873A06326j07225L5176P7724m4436K2982n3326R904j1455k1468p627M7801P3500
11861A27876m3042p1885J6079K9186J8132L0331L4271j328p5307j7712O8174O0499
$$ y = [38311, 9882, -30608, -44738, -33780, -44414, -51088, -70078, -30420, -11884, -34381, -402, -26699, -96947, -161256, -90810, -68013, -39324, 11770, 55852, 34287, -32930, -50129, -88892, -101856, -89981, -74953, -148061, -136874, -79944, -92656, -81803, -6548, -42160, -74034, -56977, -35027, -29941, 3754, -5860, 29810, 96016, 53838, 161883, 197482, 129211, 41525, 40046, -1237, -82567, -166091, -164506, -162247, -91386, -45631, -39253, 137023, 170962, 79002, 16976, 31124, 4994, -17238, -52725, 56022, 129541, 130466, 91036, 64099, 95023, 123432, 106326, -899, 34277, 112001, 67565, 90547, 37221, 47125, 35670, 14202, 6575, 54376, 127876, 84834, 12949, 29028, 58214, 76346, 106677, 140948, 139620, 64313, 46601, 114775, 175274]
11849A75274n2177r3786K415P7461j3746J7379q8809O879j6664m4485N6026Q8008
11837A13775k7700j04111r3018p208N3333R3145j4592m4519M7984n9875L4293
11826h493N0705N0776K3558q2543J2378L3658l3552n1540L1920K7440m5874J7767
11814B6200p657o0830J4506O2197o755l8676L7589M0872k1507J17906k1814k0708
11802A21323k7199r4796r9749q9M7161J7245K6458k1319R7430P8697M3387p6569
11790A11980l7409n6206r5321L2154J31288k9261l1575o30q8747r681N2325Q1952
11778F0869o3609p8887J08611O191o5053L4114J8465k0559j1717m1190k227L575
11766e1417P8723O8887P41J3071r9994k8882l4935m3688n1914n8553N3720R5590
$$ y = [175274, 123097, 29311, 31726, 109187, 95441, 112820, 24011, 30890, 14226, -30259, 25767, 113775, 86075, -18036, -111054, -118262, -64929, 28216, 13624, -30895, 17089, -42786, -8493, 42212, 92988, 116546, 34003, 46381, 80039, 46487, -5053, 26867, 54307, 8433, 26200, 18543, -42287, -27781, 34416, 27661, -11015, 26574, 67446, 45939, 163845, 142031, 121323, 94124, -672, -100421, -100510, -53349, -36104, -9646, -30965, 66465, 145162, 188549, 111980, 74571, 18365, -76956, -44802, 86486, 57225, 25650, 25020, -63727, -73408, -21083, 60869, -2740, -81627, 26984, 33175, -31878, 2236, 20701, 142, -11575, -52765, -54992, -51417, 27306, 96193, 96934, 110005, 10011, -18871, -53806, -97494, -149408, -207961, -154241, -58651]
11754e8651J46996k8929L2902n5830o1886K0170M7485L2555n8936j8906n1344
11743e4374J4501J5341Q955M4518q412R896p5844l8820P0594N0150J9949O6048
11731A22502j6819j2747j7359m0535j12161j27147O1405N0379L9037J642n066
11720e6869J1930J5611j5982L2659j4636J5736K8026m278M1337K4039p4475j1298
11708h200O8645j2731q3666q0159R2507J20613q0682l9602J3084K5773K6674J362
11696D3618M3840P724m8333j00328m475N4642K0902l5264j9417P1366R169j1245
11684C2199j4165k1613r1574l5847L5581M3400m023O5470M8433j549P6965j2954
11672A20323l9516p1123j25800L9302R60K4631P265k9882k2669O6467J57121J3053
$$ y = [-58651, 88345, 59416, 92318, 36488, -25398, -5228, 42257, 74812, 15876, -3030, -54374, -39873, -24532, -15577, 28941, 20529, 30425, -45419, -84239, -13645, 36505, 56454, 122502, 105683, 92936, 75577, 35042, -77119, -204266, -142861, -92482, -53445, -51803, -56869, -44939, -29328, -45310, -12651, -27287, -11551, 16475, 12197, 53534, 77573, 3098, -8200, 60445, 47714, -35952, -116111, -23604, 97009, 16327, -23275, -10191, 15582, 42256, 43618, 87458, 95182, 46849, -53479, -57954, -3312, 17590, -17674, -37091, 34275, 43444, 32199, 18034, -3579, -95153, -131000, -95419, -52019, -56042, 9428, 57861, 56312, 133277, 120323, 80807, 9684, -116116, -76814, -75854, -51223, -43958, -73840, -96509, -30042, 127079, 140132]
11660A40132r3866k4419M4344Q6646J3743q5491R125J06467k7879q0763q1693
11649F346m0513M168n529k3097M2043R515K86m1893O858J4557q7947o8316J17274
11636f6248O7216j999k679L1862J679m0617P7078j9578k7470O2885j1977K0689
11624I0841q4806j4242l4937j8597J7494N571l3227J2182O9036k3668o4729k3316
11612a02398P4870K629l1115l0564p3784J1086J19585l4692J1608M7468K5982
11601B0675J475L3162p9680N4731k9690j1433l1667k2225n762Q960p1764K0756
11589a12462N2332O1405k3723j09341O9285J08765n3620j00674N484J9781M1633
11578d1135P732q4905L43l1449J3411N8933O9950R2522k1127o9057m843r3751
$$ y = [140132, 46266, 21847, 66191, 152837, 166580, 81089, 90214, 196681, 168802, 88039, 6346, -34167, -29999, -35528, -58625, -16582, -7067, -6781, -48674, -41816, -27259, -115206, -183522, -66248, 968, -1031, -3710, 28152, 29831, -10786, 66292, 46714, 19244, 82129, 70152, 90841, 6035, -8207, -43144, -61741, -44247, -38676, -71903, -59721, 9315, -14353, -79082, -102398, -27528, -24899, -56014, -86578, -160362, -149276, -29691, -64383, -52775, -5307, 20675, 22150, 55312, -24368, 30363, 673, -10760, -42427, -64652, -70414, -61454, -133218, -112462, -60130, 1275, -22448, -131789, -62504, 46261, -7359, -108033, -102549, -82768, -41135, -33403, -118308, -117965, -149414, -136003, -77070, -7120, 85402, 64275, -4782, -9625, -103376]
11566a03376m4821n5118j1818N5229J24721K1192q6493p918R2706R3699O4516
11555A42519k2810m6940n7350r8110n9640K8197K9733m773N4605K8157J5369M6780
11543E5737L2394J8784m7474J9602n5358j8022N3416k6917l422l2027n5648q0951
11531a39886K9215K018l1057L9704Q0660K7788O4783m2784J6500L0965n4053q5205
11519f1352p5693J5101J14762K910l5905n2453q403m6348R7566R8624L7409q5772
11507D46r4723J0231M1367J3232l381M9522O3051l2585m557L6214o672p3852k8082
11494b9789N9758Q203J3095o9993l8219K2623k2290n9549R340n367L791j4188
11482a22585K9834J0120j2676q642J34L5191L3775j3379p1010L8080o858J05201
$$ y = [-103376, -148197, -203315, -215133, -159904, -35183, -13991, -100484, -108402, -15696, 78003, 142519, 119709, 72769, 15419, -82691, -142331, -114134, -84401, -89174, -34569, -6412, 8957, 55737, 88131, 106915, 59441, 79043, 23685, 5663, 59079, 32162, 28740, -3287, -58935, -139886, -110671, -108653, -139710, -100006, -19346, 8442, 73225, 30441, 46941, 77906, 23853, -61352, -137045, -121944, -7182, -4272, -40177, -92630, -101033, -147381, -49815, 48809, 86218, 446, -94277, -84046, -42679, -29447, -32828, 16694, 79745, 47160, 42603, 78817, 72145, -1707, -29789, 29969, 38172, 51267, -18726, -56945, -34322, -56612, -116161, -106821, -112188, -108397, -122585, -92751, -82631, -95307, -103949, -103815, -68624, -34849, -48228, -119238, -81158, -88016, 17185]
11470A7185J0606j01159j00097l9718P0842K5161J6346O6331L1704j4324k456
11459a9579J9152K0890J4115j02704m8658K5038r020J3299j8710J6835k4700k6932
11447a40974L8850J08149P6716K5141j9155l5698k3020k8881j3210R444J8722
11436A6084o3941L929k2029m9576m0286L8605J56663N4386n1458p4826m8585J0809
11424g0225j763m7866N9165K4252j8548K1567J1376j2174p4646j2077r287J4986
11412a15240N5945J08968L6556j2723p248j6352j5718M2251j6213l3043p2474
11401d5291m65o267r148m120l64N8224p2803l6152J02271k489q0990m1644P646
11388a31592O1117O3229j16211p9739j4373M3478P0420k7534J3966M4316J3606
$$ y = [17185, 27791, -73368, -173465, -213183, -142341, -117180, -100834, -34503, -2799, -17123, -19579, -427, 20463, 34578, -68126, -116784, -91746, -100766, -87467, -106177, -89342, -114042, -140974, -102124, 6025, 82741, 107882, 88727, 53029, 30009, 1128, -12082, -2638, 16084, -47857, -43928, -65957, -115533, -155819, -117214, 39449, 93835, 42377, -32449, -81034, -70225, -71988, -119854, -60689, -36437, -54985, -33418, -22042, -34216, -108862, -120939, -130226, -115240, -59295, 49673, 86229, 73506, 66258, 49906, 34188, 76439, 60226, 27183, -45291, -45756, -52023, -61171, -65291, -65655, -7431, -80234, -116386, -14115, -16604, -97594, -139238, -131592, -70475, -7246, -123457, -203196, -217569, -174091, -103671, -131205, -117239, -72923, -59317]
11377e9317P4699R4321r202q2338j26564r785N034P0209J7222j1201r643J7882
11365b8683J9113K6555O3817l8744j01944o9046O8148p515l1139J8536L3797j4517
11353f1622o4402n2200P9739J01309k8906m2598j9178J7301N2042O057L3599k3109
11341a968k1570o2533p8954J08818O3084j7964K1102J9090L1057m1004m3317l449
11329b7608Q673Q2443R3496k9153K3257j6366m2189k7913l444o45j9452J0742
11317E1841q320M58Q754k4762j3378Q347k0636m3552J9568j1719O8848O0933l0385
11304F5997J1000K1087p0489j30251p5805n188J16233M8441K841P3192m2735l0179
11292a5856l492k2894p8670K9480K4241Q0927R814N8523r7900m1560J8962k5248
$$ y = [-59317, 15382, 109703, 100501, 18163, -108401, -118186, -113152, -42943, -25721, -36922, -46565, -28683, -9570, 16985, 80802, 42058, -59886, -128932, -60784, -68299, -99438, -80902, -47105, -61622, -126024, -178224, -98485, 2824, -26082, -68680, -87858, -70557, -18515, -12458, 21141, -1968, -23538, -86071, -165025, -56207, 6877, -11087, 10015, 29105, 60162, 19158, -24159, -27608, -18935, 63508, 157004, 127851, 151108, 134742, 92553, 64640, 61196, 60551, 41099, 51841, 43521, 43979, 52733, 27971, 14593, 22940, 2304, -41248, -21680, -33399, 35449, 96382, 65997, 76997, 98084, 27595, -102656, -178461, -183649, -67416, -18975, -16134, 57058, 14323, -15856, -19348, -42242, -120912, -91432, -67191, 13736, 23550, 82073, -15827, -57387, -38425, -63673]
11280f3673j8128O568k5570o1757L3683J14691O8877l1523j05969m8218J6607
11269a14412N4805L069k7303J01509M8780L056L2020J8360N651q0850N446R5210
11257A45341n3063m994L863n8333l3917p2217J175j1723l8150J4552L6374L7435
11245c3657K4064N7038P9769L1849K7751m9076l4487k8548N905k5139l6383n241
11233A3845j2040L667r0038N431L7947J8973k0297l3149m958M3145J3871L1734
11221H131K0645K1409m4853j279J3970l481O914n2980k9076J8325J4371L4641
11209F737M9197l471n8995m8290j7147m2310n6064M3050P1306k0625r5010k975
11197a74597N7831P4739j3807l3572M1550J66327R1089o9114j34409L596Q0329
$$ y = [-63673, -81801, -75233, -100803, -162560, -128877, -14186, 54691, 23168, -82801, -131019, -114412, -59607, -56538, -83841, 17668, 66448, 69504, 101524, 119884, 125535, 44685, 50131, 145341, 92278, 87284, 91147, 32814, -1103, -73320, -72145, -83868, -122018, -107466, -71092, -33657, -9593, 47445, 127214, 159063, 186814, 137738, 103251, 74703, 80608, 55469, 19086, 13845, 1805, 5472, -84566, -79135, -41188, -22215, -42512, -75661, -80619, -37474, -23603, 8131, 28776, 50185, 5332, 4053, 18023, 14542, 21456, -31524, -60600, -42275, -27904, 6737, 55934, 52463, -6532, -54822, -71969, -114279, -170343, -127293, -55987, -76612, -171622, -174597, -116766, -42027, -55834, -89406, -47856, 118471, 209560, 140446, 6037, 9633, 89962]
11186H9962k9273j705j0666J4957O7826o978k4327l9100J0887K5214n3806M839
11174D7830Q1298j8941j08126n9591M2824j0299N0174r01m9574M754M1440p703
11162A3185P4255R7092o8506k4092o5332n8684O2380J0694l9810O273M0616k5390
11150B2681m971M8605N408l2711j3712q011Q4105l1114l7995J5990M5505n9912
11138C3868o5597m2107K6816l6807l6472J5913k357J31587J8263j4964J2472l4226
11126F389m0738r4044l6766R9214L6742P8423k7806m0676l9518o3495o045O4044
11114f4276L4130K1572L839k3421n209j5289l809P3379k876j7281O5626m578l9936
11101B1871j8561m475J7776r367p6996R179l0173k5063m0759R2340R1660L2865
$$ y = [89962, 60689, 58984, 48318, 63275, 131101, 124123, 99796, 60696, 71583, 96797, 42991, 47830, 129128, 110187, 2061, -57530, -14706, -25005, 25169, 24268, -25306, -20552, 20888, 13185, 87440, 184532, 116026, 91934, 26602, -32082, 30298, 40992, 1182, 7455, 48071, 22681, 17710, 66315, 71723, 39012, 25300, 17289, 101394, 70280, 32285, 48275, 93780, 33868, -31729, -73836, -47020, -83827, -120299, -104386, -106743, 24844, 43107, 28143, 40615, 6389, -34349, -128393, -165159, -65945, -29203, 49220, 21414, -19262, -58780, -122275, -128320, -64276, -30146, -8574, -4735, -28156, -33365, -48654, -52463, 20916, 18040, 759, 66385, 61807, 21871, 3310, -1165, 16611, 7244, -69752, -60573, -90746, -115809, -156568, -64228, 27432, 60297]
11089F0297M7749j0508o1541p4050L3446K9076r7814m0550N4649O6751K1952k0221
11077I236K4283M308J2891k7756k9879M9431l231k9238P920J1561L8220k2809
11065D4937l7062l7888j8411q731j8767K7097M9630N6311l569o7407m8381K0935
11053d1306M7950O6659o4699p9485o751L7117J22791l1336p8724K3226j0017r8138
11041a12713J0262k4303n1152R3105R6655J9807j7061l2448n5336K0223O9361
11030A6400q711J9888l175m0209j0393j3345l8323o533J7500Q2335L4381o6715
11018a6900q224K6091O3390L2945K5880L3446j00156j0608O6474P5828o0752q8615
11006C8799j03396P7903J1660q8101N925l4055p8810O0027L6132n205J7427N2971
$$ y = [60297, 108046, 97538, 35997, -38053, -4607, 24469, -73345, -113895, -59246, 7505, 29457, 9236, 33519, 37827, 50718, 22962, -6917, 42514, 39283, 10045, 17965, 29526, 67746, 44937, 7875, -30013, -48424, -57155, -75922, -48825, 805, 57116, 53547, -13860, -62241, -41306, 6644, 73303, 8604, -70881, -77632, -40515, 82276, 50940, -27784, -4558, -14575, -112713, -102451, -126754, -177906, -84801, 11854, 31661, 14600, -17848, -73184, -52961, 16400, 7689, 27577, 24402, -15807, -26200, -39545, -77868, -84401, -66901, 15434, 49815, -16900, -25124, 967, 64357, 97302, 123182, 156628, 56472, 45864, 112338, 188166, 127414, 38799, -64597, 13306, 24966, -63135, -57210, -91265, -170075, -110048, -73916, -79121, -61694, -8723]
10994h723N9655L883m8773n576n6773J4018J3912k7915m3678L7408p5733j0020
10982a48315Q7117j9277J4533J5345O525M6789M543M3656q1424k7055j34339q8136
10970b80038N902O8638J45739N0434K050l1018k0399M6785l7979m4329M6273K3153
10958b4789K0769j2655O605J6132j0806k5718l5831n4631j1777l387L628M9368
10946h3092k1894o701R8255Q0860j10571l6172Q0034k1453O9136Q6887K9639J8982
10934A83910q8607n2087O963o2243j3239L2873j8260j5639M4591L2510n566j5170
10922C0036j6376m5977n2894n4580P3708m5697J7098J1713J9825N0238K1044r6914
10910h8776n6411M7912M747q607L2580k5227j9975K5123J2661j9715k8130k6319
$$ y = [-8723, 50932, 54815, 6042, 466, -56307, -42289, -28377, -56292, -99970, -62562, -138295, -148315, -61198, -80475, -65942, -50597, -44072, 2717, 7260, 50916, -30508, -57563, -191902, -280038, -274136, -205498, -59759, -9325, -7275, -38293, -58692, -11907, -49886, -94215, -47942, -24789, -4020, -16675, -10070, 6062, -4744, -30462, -66293, -120924, -132701, -136088, -132460, -83092, -104986, -111687, -13432, 67428, -43143, -79315, 719, -20734, 48402, 135289, 164928, 183910, 95303, 43216, 50179, -12064, -25303, 7570, -10690, -26329, 18262, 50772, 45206, 30036, 13660, -32317, -85211, -139791, -66083, -111780, -94682, -82969, -63144, -12906, 8138, -88776, -145187, -97275, -92528, -101135, -68555, -93782, -113757, -88634, -75973, -95688, -123818, -150137]
10898a50137J43531J00096P704p4072m7561M8275j25476k5843O912J30633M0195
10887E4257p4596j4456N4765K9304o2527k9391N1162j5908J4541K9906l1212J3164
10875A9009J9770M074J6616L1707n3402p3546o8224k002M4128k571R24J06228
10863D2711l5853j05659K148N8422n3786R7295J32174R479r0922j08607N4899
10852B301M5994k0145l0128l4497J9800n2405L117O1577j6773K9381P0937o2450
10840A6709M389O1076N663k5625j5373j4982o1261o8733J69087L0901l3958L5230
10828A03123n72q3660j317P1720r875n7802j1020L7114K2902l3350N004m049m5209
10815f991q0323O9938L3389L6248k8852L3447k3432n0415L6751M4900M446l8113
$$ y = [-150137, -6606, 93490, 101194, 27122, -20439, 27836, -97640, -123483, -116571, 14062, 54257, -20339, -34795, 19970, 49274, -13253, -42644, 8518, -7390, 7151, 37057, 5845, 19009, 38779, 42853, 59469, 91176, 37774, -35772, -103996, -105998, -61870, -64441, -63517, 42711, 6858, -98801, -96653, -38231, -92017, 5278, 137452, 146931, 56009, -52598, 2301, 48295, 28150, -1978, -36475, -16675, -69080, -65963, -4386, -21159, 8222, 79159, 16709, 21098, 82174, 87837, 62212, 46839, 31857, -29404, -98137, 70950, 101851, 67893, 103123, 102551, 18891, 17574, 89294, 79419, 21617, 10597, 47711, 70613, 37263, 42267, 38218, -6991, -87314, -17376, 16013, 52261, 23409, 56856, 33424, -16991, 19760, 64660, 69106, 30993]
10803C0993M410m7999k8710K0150J4898j5108J3862O1261K6368m3298q6219J7346
10791c2046J13941p725j18191j3312l8579K9128M9788L4414N2705j01169M2035
10780A0989R0854l9404k1198j2409K3001L77j3202q2573r435J6387n2184k5684
10768a14481J45878M5305M177o5595k501l8232m5121l1702o3986j04020M4106
10757b26172J06330K8300K1659J9923n0471R0607J5557n0026o8060N0695m2981
10746a04639o0662N2286N4903L0446l9116J8252m2739o5141N5896O2610l4147
10735g2051L3195j3711o4970P1778k5976l18K6569N8553Q6229K663p0895r6675
10723f5609K4074j8190N5314n180l5003j5911l8064l1694L4096J6586l4013L5784
$$ y = [30993, 35403, -12596, -41306, -21156, -6258, -21366, -7504, 53757, 80125, 36827, -49392, -32046, 81895, 74170, -44021, -57333, -95912, -66784, -16996, 17418, 70123, -31046, 10989, 101843, 62439, 41241, 28832, 51833, 52210, 39008, -43565, -53000, -36613, -88797, -114481, 31397, 76702, 80879, 15284, 12783, -25449, -70570, -102272, -166258, -270278, -226172, -119842, -91542, -69883, -49960, -100431, -9824, 5733, -44293, -112353, -61658, -104639, -165301, -113015, -58112, -27666, -66782, -48530, -91269, -156410, -100514, -37904, -72051, -38856, -52567, -117537, -45759, -71735, -72053, -45484, 13069, 99298, 101961, 31066, -65609, -41535, -59725, -4411, -9591, -44594, -60505, -98569, -130263, -96167, -79581, -113594, -77810]
10711g7810J6290p6199J3453P7965R5191N658j5655m0764P782J9781J5828j6812
10699B4708Q4586j1403j39858k9837P597J0945J6684p844l3410J4450L6259Q858
10687a8265J0462L96o2814k8733k4533L6406L6418M7102J935O3164L0807L6703
10675A29048q2350q8466r6780m3578L2243M6639K9328L872N778k5830k8119K6306
10663i1909n8397o0062Q54P5919k8545m3610J7313P0761O0424L6774j1060L8929
10651G391l4070M8902O1874j39569j13818m7663K0027R7688N4995L0130j8528
10640c2641K19L4709K1856r6778j0857q2736j12487J2076J55223N2907P500j4689
10628f5698L7449R7459N0369k9766m2934M6947k0058N537k623o9411K435K8187
$$ y = [-77810, -61520, -137719, -124266, -46301, 48890, 54548, 38893, -1871, 5911, 25692, 41520, 24708, 109294, 97891, -41967, -71804, -64207, -53262, -36578, -44422, -77832, -63382, -27123, -18265, -7803, -7407, -70221, -98954, -123487, -87081, -50663, -3561, -1626, 61538, 92345, 129048, 46698, -41768, -138548, -182126, -149883, -103244, -73916, -70044, -64266, -90096, -118215, -91909, -150306, -210368, -209514, -133595, -162140, -205750, -188437, -117676, -57252, -20478, -31538, 7391, -26679, 22223, 84097, -55472, -169290, -216953, -196926, -99238, -44243, -14113, -32641, -32422, 2287, 24143, -72635, -83492, -166228, -278715, -266639, -111416, -58509, -51009, -65698, -28249, 69210, 119579, 89813, 46879, 93826, 73768, 79305, 76682, 7271, 9706, 37893]
10616C7893Q221M7656j5407L5202n2289j17512M8213J59884m548o9659j6051L482
10604F5085K3516L6985l8355o087L9597K519O653n3535J4276l4050N7439k6931
10592H7112j07470l5935n0163P2544q3503L343M9023M7466N5247k0078m2545N6062
10580C1103N8869O3841O7461J9587q2712q2206q5503n481M3215J4669o4039p0613
10568i1809O2228J12037j5630l617K0552k1181O9965M6920j1744n3734L72r5341
10556A9018o3577l3780M8084J187M0956K980k3868l978j6896K4969o4157K8150
10544d0912P9885l9441o4321l2712j982j1323N4919R0690J3688J6616l2487J6921
10532D9541j7889j18642p6155M6864K8576j8462L8085Q9855l3249k8136M2253
$$ y = [37893, 46114, 93770, 78363, 113565, 61276, -56236, -8023, 151861, 147313, 77654, 61603, 65085, 88601, 125586, 87231, 81144, 120741, 123260, 129913, 76378, 90654, 56604, 114043, 87112, -20358, -56293, -106456, -33912, -117415, -114072, -65049, -17583, 37664, 17586, -24959, 31103, 89972, 153813, 221274, 240861, 158149, 75943, -9560, -15041, 28174, 42843, -21196, -91809, -29581, 82456, 66826, 63209, 83761, 62580, 132545, 179465, 167721, 113987, 114359, 19018, -44559, -78339, -30255, -29068, 11888, 14868, -9000, -12978, -29874, -4905, -69062, -40912, 38973, -468, -64789, -97501, -99483, -110806, -55887, 34803, 48491, 65107, 32620, 49541, 31652, -86990, -163145, -116281, -87705, -106167, -68082, 21773, -11476, -39612, 2641]
10521B641j6480Q0283L6555N0784K5621q6298j5879m7603p7567O6039N5837n9852
10509A4081k4767N5710K3275L629m9775o5398l9365M4064j2472j6534j4091j0592
10497i2235L3934M4417m8834J6891M4004k9096n1006K9930N8310l3545L2215J204
10485F189n6436r1082M3336Q354N5584l6706o9875Q3893Q2954k5047l1804J0401
10473b0239O3m7345L6046M737o997O19l4803J49339J3816R03n354q000k3151n6155
10459C479J0600p3918m1852L9306L9193J8468o20l1870j7689J2271N6902Q137
10447B2407l7196P501J9011L2630k2907m8882N390M1644M9402l8884l1537M3741
10435D2320P8572Q7639m1082j02705j2191L5365o7903K4830P7708j8683m2570
$$ y = [2641, -13839, 66444, 102999, 153783, 179404, 93106, 77227, 29624, -47943, 18096, 73933, 14081, -10686, 45024, 68299, 71928, 22153, -43245, -82610, -38546, -51018, -67552, -81643, -92235, -58301, -13884, -62718, -45827, -1823, -30919, -81925, -51995, 6315, -27230, 4985, 6189, -50247, -141329, -97993, -89639, -34055, -70761, -140636, -56743, 26211, 1164, -30640, -20239, -20176, -67521, -31475, -26738, -33735, -33116, -67919, 81420, 95236, 96139, 90785, 82785, 59634, 3479, 14079, -59839, -101691, -62385, -23192, -4724, -5344, -37214, -54903, -42632, 14270, 22407, -14789, -7288, 11723, 44353, 21446, -27436, -22046, 19598, 69000, 30116, -1421, 42320, 120892, 208531, 167449, 64744, 52553, 87918, 20015, 44845, 122553, 103870, 61300]
10424F1300K8288O342k2403l0554o3974n7244o8585o1331j8649J3626J6063K5944
10412a71177R4077O4446n9812m265K3916Q4965j4943m511r343O1595N7231n0427
10400G1752k1987m927q111n3212o4648M9230P8173j152K8454m4163l9852R2854
10388H2411j2961j8739K4579j4375p2260k3019K958J2975k2684Q176N3910L7989
10376E8960m4969l252m4096q6890o354O9190q6686p8691Q6634O1133k7386M7101
10364e5306n6468L8589J20063L4986Q1090R7317j6335o1556m2455M2268J1742
10353A93935L648Q5176j1797n4077N6017P116j0890N6458M7988L2366M7771q4367
10341C69344q3526j16019J7199J6796p7673q898n9792j37J20797o718q4191n5152
$$ y = [61300, 89588, 95930, 73527, 42973, -21001, -78245, -146830, -208161, -226810, -213184, -197121, -171177, -77100, -12654, -72466, -76731, -52815, 32150, 17207, 12696, 3353, 64948, 122179, 71752, 49765, 44838, 36727, -16485, -81133, -31903, 46270, 45118, 73572, 29409, -10443, 82411, 69450, 50711, 75290, 60915, -11345, -34364, -31406, -18431, -41115, -32939, 20971, 58960, 13991, 10739, -33357, -120247, -126601, -57411, -144097, -222788, -136154, -75021, -102407, -55306, -111774, -73185, 46878, 81864, 162954, 260271, 243936, 182380, 139925, 182193, 193935, 197583, 282759, 270962, 216885, 272902, 280018, 269128, 325586, 373574, 405940, 453711, 369344, 285818, 169799, 186998, 203794, 126121, 117223, 57431, 57294, 178091, 171373, 87182, 32030]
10329C2030J3947k4160K0634J6149k7885r693q6983R000R4035J08004R87L5450
10317A81515l3322o4569k1109j2241o8209M368P7277J1973m0190k3105P2383K8569
10305A13340p7583o6107J6195M2812N2054O2101o5574k2526l3710o3409k444L1221
10293a3630R917K4845L1499M8590L7747m0742p9661L2587P2318R951M0730j3794
10281A60357q7501k8197K5374j234m6165O7294O6302j30177l9595K6514p4983
10270f2011n211M3560P663n1273O3600k67o1717m790j685p346m1723n1567L0295
10257a42472N0590K1866l5631L4665j1987P5742L3965K7794p8756n8982j6487
10246i9693J8671L6919K7404k0738L9261L7405K9900k0232o56o2687j04700L7098
$$ y = [32030, 45977, 21817, 42451, 58600, 30715, 21022, -65961, -56961, 37074, 145078, 146065, 181515, 148193, 83624, 62515, 50274, -17935, -13567, 63710, 75683, 35493, 12388, 84771, 113340, 35757, -30350, -14155, 28657, 80711, 142812, 77238, 54712, 21002, -42407, -44851, -13630, -3713, 21132, 52631, 101221, 138968, 98226, 18565, 51152, 123470, 133421, 174151, 160357, 72856, 44659, 70033, 68799, 22634, 89928, 156230, 26053, -13542, 12972, -62011, -67222, -23662, -15999, -67272, -3672, -3939, -65656, -70446, -72131, -79477, -121200, -172767, -142472, -91882, -70016, -105647, -70982, -82969, -7227, 26738, 54532, -24224, -83206, -99693, -81022, -44103, -16699, -37437, 1824, 39229, 69129, 48897, 48241, -14446, -119146, -82048]
10234h2048L6227P8087J05560N1086k994r028j9576o5644r1621r858N5965j01928
10222e5772q0827l760L7841l7038k9842N9483P9447N0271K3992L1270J7700p4522
10210A8243n9522l9788l3433K7363k805k0575R5860O2139L1138k6402k0650p261
10198B4307p0286k8478p8551L2868J722L3020Q6036J0687O3085n157j3369m869
10186E1015K0333o0132l5289o3804M6351L4956q8441p2132J263J18416K3365L4119
10174A0020M0212o0151j51384l1649r7975P8772J06870J1730M3260L777j858m0572
10162h8948q487N1270Q5511k0168o9997R227N059k8427N8265j7542J6486n3724
10150f1475L6995L8238j788o513k9864J7819l084N8002J2324p5442o6944O2734
$$ y = [-82048, -45821, 32266, 137826, 188912, 185918, 176890, 157314, 91670, 49, -9809, 46156, -55772, -136599, -140359, -102518, -139556, -169398, -109915, -30468, 19803, 43795, 75065, 92765, 18243, -41279, -81067, -114500, -87137, -89942, -110517, -14657, 47482, 78620, 52218, 31568, 24307, -45979, -74457, -153008, -120140, -118418, -85398, 638, 11325, 74410, 69253, 55884, 51015, 71348, 11216, -24073, -87877, -41526, -6570, -95011, -167143, -165880, -47464, -24099, 10020, 50232, -9919, -161303, -192952, -290927, -212155, -105285, -93555, -50295, -46518, -48376, -88948, -97435, -46165, 39346, 19178, -50819, -41592, -36533, -64960, -6695, -24237, -7751, -61475, -24480, 13758, 11970, 5457, -24407, -6588, -9672, 48330, 60654, -14788, -81732, -18998]
10138a8998R907L314M5243N8753p3950r0197L1766K6916O8216l6247n6957k6890
10126e9124K9823K2763p0298J0314L3056o414K090n4791J8724L0327k3486n7479
10114a24495N2209R7302k6021K3079J7052o3517o1013p6201j9294N6559J36619
10103A2279L4286j2544j1211o1629p6534J5119L6675K7971K9166j3863l734q725
10091c2744L906L410n7900K2107N8051l7326j5559j45598o745J42642J27763L3668
10079I5675L7789j6963j43077r3347j7216j2435q643O1753J27608L3097n8599
10068E642O605N6500j3788K2429r68p4387m5380p7585J12652J15015l0336O1806
10056A38205n8877j41510j463J5243J5400N6641M7073Q420K0777L5850P8877p7405
$$ y = [-18998, -9091, -5777, 39466, 98219, 24269, -65928, -34162, -7246, 60970, 24723, -32234, -59124, -29301, -6538, -76836, -66522, -33466, -39880, -37790, -92581, -73857, -43530, -67016, -124495, -72286, 25016, -1005, 22074, 39126, -24391, -85404, -161605, -180899, -124340, 12279, 46565, 34021, 22810, -38819, -115353, -100234, -63559, -35588, -6422, -20285, -24019, -32744, -28838, -25428, -83328, -61221, -3170, -40496, -56055, -201653, -208398, -65756, 62007, 95675, 133464, 116501, -26576, -119923, -137139, -149574, -158217, -96464, 31144, 64241, 5642, 12247, 68747, 54959, 77388, 76420, 2033, -43347, -120932, -8280, 106735, 76399, 138205, 79328, -62182, -63645, -48402, -33002, 23639, 70712, 79132, 99909, 135759, 214636, 137231]
10044A37231j27490Q3988J41930j4875m7760p6679k8933n8928k3718N8287r068
10033C3985p5769M1795K0890k0373K5740m2782r7607R558J38025J6548O247Q8791
10021A45048l693q965P0321m0331l4605Q4675j8900J2666n7306p3524J1384N4791
10009A41561m9499p4398o0370n4740j06553l758R1656m8272k5719o516K3892P4257
9997i8459Q4316J6717l8750K6581M7767l0441L573k6329m2479q283L6291N5434
9985B5938n846l6076J13925N3248q5363j1132P6525k9988o1088n0266j238M4008
9973C2647P0453n374k7313J2018J3055r8226J3020K2393l1828r6721n149k0321
9961a21346l6313k4695N1068O3948j437k1733r840L5738k9493L7127j2708n1341
$$ y = [137231, 9741, 93729, 235659, 220784, 173024, 96345, 67412, 8484, -15234, 43053, 33985, -41784, 11, 20901, 528, 26268, -16514, -114121, -104563, 33462, 50010, 56257, 145048, 141355, 132390, 202711, 162380, 127775, 212450, 193550, 206216, 148910, 75386, 86770, 141561, 92062, 17664, -42706, -97446, -203999, -207757, -116101, -164373, -190092, -196608, -172716, -98459, -14143, 2574, -36176, -9595, 38172, 7731, 11304, -15025, -57504, -65787, -29496, 25938, 20092, -15984, 97941, 151189, 65826, 54694, 131219, 101231, 40143, -10123, -11361, 32647, 103100, 97726, 70413, 82431, 95486, -2740, 10280, 32673, 845, -95876, -101025, -121346, -157659, -182354, -131286, -67338, -68775, -90508, -100348, -64610, -94103, -56976, -69684, -121025]
9949a21025M0671L8397M569j5583p7858N8105J3084m2073j10675l4487J41858
9938a05017R933K5497j1702K0956L3102J3582k1001J5257k2712m0060j3050l5673
9926a30888L0354m5547J2115Q8534N2126j9214M2974M7420M515N9765k403n8852
9914H0899m3753L1967P792k1159K0983n0685l6405m0194Q8P979L0528r376L5858
9901A4522J37436l8993l4693M9481N3831K684k5245j5782j03379q626j8626j9929
9889g319K5251M7709o3503o9960l5113n965K5585M3959m1327m985J01119j6805
9877a354K2338L1209P7696n551k9519l6096l5352M3946j0220P345O3179n6690
9865G0931o2428Q088r454l1259J06873l3662j4188J10979J02165J7159j6494j39699
$$ y = [-121025, -80354, -41957, -37388, -52971, -130829, -72724, -59640, -101713, -212388, -246875, -105017, -95084, -69587, -81289, -60333, -27231, -13649, -34650, -19393, -42105, -82165, -95215, -130888, -100534, -146081, -133966, -45432, 6694, -12520, 30454, 77874, 82389, 142154, 139751, 80899, 37146, 69113, 76905, 55746, 76729, 26044, -10361, -50555, -50467, -42488, -11960, -21336, 14522, 151958, 112965, 78272, 127753, 181584, 184268, 159023, 143241, 39862, 31236, 12610, -7319, 17932, 65641, 2138, -67822, -102935, -108900, -83315, -39356, -80683, -85668, 15451, -1354, 20984, 52193, 129889, 124338, 94819, 58723, 23371, 67317, 57097, 64442, 127621, 70931, 8503, 16591, 7137, -24122, 82751, 49089, 34901, 145880, 248045, 265204, 248710, 109011]
9853A09011j17284l6836j9020Q3739r524q3432J2222J9147M7803l5992j25619
9842a55785k4974L4011L7529K5830M2294J8485L8104l6964l9976n9787j6009Q2180
9830e5062P4791N7786l7791n6709n3096m0156j11287R6551M730j0879j8133P3387
9818g5868J9339O6955K1003p8077p6170O5386k009L0986l8169L46J6151N595M4987
9805D55O4907k9729M65J2122n9417K2246N1044o6908q4818N5002K917J5439J489
9792a4786k3829r212K1551Q464L9147J3768p6738q8176l8166O6260n042l6763
9780a43522J5062P4428Q9886j23205J0060p2597P3041N9869L2791m147j27191
9769a15525L4878K9856O8826J8049k4629r633N860O6138J7303k5434k2992m718
$$ y = [109011, -8273, -45109, -64129, 19610, 10086, -73346, -61124, -41977, 5826, -30166, -155785, -180759, -146748, -109219, -83389, -41095, -22610, 15494, -21470, -61446, -121233, -137242, -55062, 19729, 77515, 39724, -16985, -70081, -110237, -221524, -124973, -120243, -131122, -149255, -75868, -56529, 10426, 31429, -46648, -122818, -57432, -59441, -28455, -66624, -66278, -50127, -44532, 455, 65362, 35633, 36098, 48220, -11197, 11049, 62093, -4815, -89633, -34631, -31714, -16275, -14786, -38615, -47827, -26276, -17812, 21335, 35103, -41635, -129811, -167977, -101717, -106759, -143522, -128460, -54032, 35854, -87351, -77291, -149888, -76847, -16978, 15813, 11666, -115525, -80647, -50791, 18035, 36084, 11455, 1822, 7682, 73820, 91123, 65689, 42697, 37979]
9757C7979K5932k6338n4606n177L117r2m5269P0415O0754q119n0693j5481j5951
9744b3529J12807L3771j44854o4672m8130p222J0743R62M2522N9299J232k3115
9732e0186O6421O8848N855n8272J5119k4775j9599L1855O9893O7648l2352r3831
9720D6624L3422p3218m3171m7407p046M1319M8131M6882k6368j3993j1477J2701
9708F399O8631N0446L90p0558n2829q570L0587J901P1745j6796O7033J1707k7332
9695A32754p5433J5696M2528l2202r804o264o0827K5708O8843m748p0415J7778
9683D3614o4645o372Q3293J1260K2065j1525j8905J7468l745o9303L0514J0546
9671D4265l8483q12M4305J4985j0480k6683j9736J7263J976k4592q311L469L6960
$$ y = [37979, 63911, 37573, -17033, -22210, -19093, -19185, -64454, 5961, 66715, 58596, 7903, -7578, -23529, 89278, 123049, -21805, -86477, -134607, -141829, -131086, -130124, -87602, -28303, -27071, -50186, 16235, 85083, 90938, 32666, 47785, 23010, 3411, 35266, 105159, 172807, 140455, 46624, 80046, 6828, -36343, -83750, -90796, -49477, -1346, 45536, 19168, 5175, -6302, 6399, 75030, 125476, 125866, 55308, 2479, -6091, 24496, 26397, 98142, 81346, 148379, 160086, 132754, 57321, 73017, 115545, 83343, 73539, 67275, 6448, 32156, 100999, 96251, 25836, 43614, -21031, -27403, 55890, 67150, 89215, 77690, 58785, 76253, 72508, 3205, 33719, 44265, 5782, 4970, 49275, 64260, 53780, 27097, 7361, 24624, 26600, 2008, -6303, -2834, 34126]
9658C4126O7056K1584N5758J01224k0767P6848K555m8195q8171j56750l8366J5387
9646B2289N7035J3524Q3386j0154k8539M3499j0301o6809M3327N5115k1829k9034
9634A51509K6627K6001n2256l4286J7886L7203n1320m4910k369L6668M9608K3654
9622A84015j13293k3120L5593O2673M1563Q26J7866P5502J20794m5864j1452R4404
9610D39507M635j08836j6783k8865j808n0191k9752K5802j6030m2662O124L1326
9598B12467M3064J9752K5718j9789L2642M3011l593j4325q7470j7635L7368J12354
9586C83564n8456m8980n1807P2254M248j8383J14169L6362M7449k3004K3389J4919
9574D95724M5007Q9796P4627J8721p810k7386J145j207Q793k0737k8757j5557
$$ y = [34126, 101182, 122766, 178524, 279748, 258981, 335829, 338384, 290189, 202018, 45268, 6902, 22289, 79324, 92848, 176234, 166080, 137541, 181040, 170739, 103930, 147257, 202372, 180543, 151509, 178136, 204137, 151881, 117595, 135481, 172684, 121364, 76454, 74085, 110753, 160361, 184015, 70722, 47602, 83195, 145868, 187431, 188257, 206123, 281625, 402419, 356555, 345103, 439507, 444142, 335306, 318523, 289658, 287850, 237659, 207907, 233709, 217679, 175017, 181141, 212467, 255531, 275283, 301001, 281212, 313854, 356865, 353272, 338947, 251477, 233842, 271210, 383564, 325108, 276128, 224321, 296575, 300823, 282440, 396609, 432971, 480420, 457416, 480805, 495724, 540731, 630527, 705154, 723875, 716065, 688679, 689824, 688617, 697410, 676673, 647916, 632359]
9562F32359k5021K9024Q3601j952M707J507J04636Q1210l3861n0532Q5035N9096
9550I69809J1093o234O7172j0959O8587J19004l6082J1067R2780r0560L7587J91204
9538A424468R6205J07121P3149l7325j4439J11756P3247J03372J56336J64725
9528B258615J55827J27241J66729J97457K56368J02167O6333J62216K84755L55901
9518D133609L75224K98282L50449L73120M53768M48600N01446M30499N15143M68537
9508H348677N05787N32274M95348N18269M89403M28340L29067K93913K87592J37154
9498A2365824L4616n0083K2779o4245l7982M7156p1336o3964r3737j33098k7920
9487A1928010k4231N5817J38168J95311K98581K87612K98334M29327M07848M84827
$$ y = [632359, 607338, 636362, 719963, 718011, 722718, 724225, 828861, 910071, 876210, 825678, 910713, 969809, 980902, 974668, 1041840, 1030881, 1099468, 1218472, 1182390, 1193457, 1286237, 1195677, 1233264, 1424468, 1520673, 1627794, 1700943, 1663618, 1649179, 1760935, 1834182, 1937554, 2093890, 2258615, 2414442, 2541683, 2708412, 2905869, 3162237, 3264404, 3330737, 3492953, 3777708, 4133609, 4508833, 4807115, 5157564, 5530684, 5984452, 6433052, 6934498, 7364997, 7880140, 8348677, 8854464, 9386738, 9882086, 10400355, 10889758, 11318098, 11647165, 11941078, 12228670, 12365824, 12400440, 12350357, 12373136, 12308891, 12270909, 12318065, 12246729, 12182765, 12089028, 11955930, 11928010, 11903779, 11959596, 12097764, 12293075, 12591656, 12879268, 13177602, 13606929, 14014777, 14499604]
9477A4499604O39138O11675O22909P90822Q06189P99957Q05100Q07695Q52203
9468B1235292P49342O83752N20687L87519J17134r6206j45892k85412m90460o71964
9458B2003792p60678q25578r06966q47568q42578r31134q70077p51609o25425
9449A4642179o48438n09847m34187m50811l52757m17164k85311j67209j13187
9440A1263268o9789p5487j22555l1668p7475L9328M2692J37206J20516L9807O4783
9429A1330626J7079j9946o5255j20541k11055l32632l38404l52313l49606m45523
9419I112430m78819m13950l66847l74892n03059m83761l64408k66338l60900k77052
9409E222404l18962k34225k97184k32637j63247k11826j93441j82935j60083j31727
$$ y = [14499604, 15138742, 15750417, 16373326, 17164148, 17970337, 18770294, 19575394, 20383089, 21235292, 21984634, 22668386, 23189073, 23576592, 23693726, 23597520, 23451628, 23166216, 22675756, 22003792, 21243114, 20417536, 19510570, 18663002, 17820424, 16889290, 16019213, 15267604, 14642179, 13993741, 13483894, 13049707, 12598896, 12246139, 11828975, 11543664, 11376455, 11263268, 11193479, 11117992, 10995437, 10963769, 10886294, 10925622, 10968314, 11105520, 11226036, 11265843, 11330626, 11347705, 11327759, 11262504, 11141963, 10930908, 10598276, 10259872, 9907559, 9557953, 9112430, 8633611, 8219661, 7852814, 7477922, 6974863, 6491102, 6126694, 5860356, 5499456, 5222404, 4903442, 4669217, 4372033, 4139396, 3976149, 3764323, 3570882, 3387947, 3227864, 3096137]
9399C096137k05242j88909j45810j02869j19921j30142r4515n3872q9705o9483
9389A895669q763j01068p4395o0929J7448n7303k2093l0835j91890j25034k797
9378A238010m2202j0384N4210N1268L7207p2223p3807j19345K1237Q8489n4398
9367A118062j10942m2745j1589j634q4673m408N2477k5160r1944m4830o0656J0836
9355G02794J3864p2416o7678l8732J26416J21342O76j36056q0269K9131r5641
9344E03431q2422O3330M3598l5100N2864n4502P513J31582n88j00428n5610M654
9332D78322L7437P636K2337O7739n2953q3715O445J8851j3350l4488p2993n4274
9320C26994l5476n6047R076N6118J9235K7447P0161P1390m4705o0129J3950L5726
$$ y = [3096137, 2890895, 2701986, 2556176, 2453307, 2333386, 2203244, 2108729, 2054857, 1965152, 1895669, 1886906, 1785838, 1711443, 1650514, 1667962, 1610659, 1588566, 1557731, 1365841, 1240807, 1238010, 1195808, 1185424, 1239634, 1290902, 1328109, 1255886, 1182079, 1062734, 1083971, 1172460, 1118062, 1007120, 964375, 952786, 951152, 866479, 862071, 914548, 889388, 797444, 752614, 691958, 702794, 716658, 644242, 576564, 537832, 664248, 785590, 786266, 650210, 569941, 599072, 503431, 421009, 484339, 527937, 492837, 545701, 491199, 498712, 630294, 629706, 529278, 473668, 478322, 515759, 523395, 545732, 613471, 560518, 476803, 483248, 502099, 488749, 454261, 381268, 326994, 291518, 235471, 244547, 300665, 319900, 347347, 417508, 488898, 444193, 384064, 398014, 433740]
9308D33740k0454j8096j04455j8501J22990l2058N5513O5707k6097K1409N323
9297D85021R972k6172R161j03788o602j4627j1493M6198K5703m1982k2853M38
9285C48976j04567k5677k2124k2387K8044L4986O5727N3598N0005k6619J1248
9274C91210k8827M650L4926M6446k3624k7962n0303J3349k2184r7411L8684R1090
9262C70044r0852q1529K7886j1083O973J7630J15255O4626n1797o8220m0533J9141
9250B77541M6039P1790n2210n70n3411m6171P5141O8578n9211J4837J3600m0805
9238C15148j5443l8305J40979Q0596J5594q1262n4613o5205N4854J15375J2823
9227D80541n5553m5373p910J6169P8706k7130n5807l3879J7572J7869L6812J11557
$$ y = [433740, 413286, 395190, 290735, 272234, 395224, 363166, 418679, 484386, 458289, 479698, 485021, 494993, 468821, 477982, 374194, 367592, 352965, 341472, 387670, 413373, 371391, 348538, 348976, 244409, 218732, 196608, 174221, 202265, 237251, 302978, 356576, 406581, 379962, 391210, 362383, 367033, 401959, 448405, 424781, 396819, 346516, 359865, 337681, 240270, 278954, 370044, 279192, 197663, 225549, 214466, 221439, 239069, 354324, 418950, 367153, 298933, 258400, 277541, 323580, 395370, 343160, 342590, 289179, 243008, 318149, 386727, 327516, 342353, 355953, 315148, 299705, 261400, 402379, 482975, 498569, 417307, 362694, 297489, 352343, 467718, 480541, 424988, 379615, 371705, 387874, 466580, 439450, 383643, 349764, 367336, 385205, 422017, 533574]
9215E33574P8233r4219r5091J8220N8318O1426K5603m7892p511K6227J2140J056
9203E70084J10808J39181J10509P5117j9978M698O1877L2867o712J52875J94319
9192A425645J10677P4993J40366K40278K20072J67741J45268K45781L32271L14397
9182C417489M92206M73818M38595O10326P01646R47151J117917J250590J384487
9173A0834225J557809J697800J837966J821820J588514J157749L28320m37467
9165B0386736j115023j598186j900176j982021j844688j633648j389388j112396
9157G811210j022296q56396o66133n33494m64852l99135l77674l08560l20093
9148B862577l01050k17222k20071j76162j08107j27594j79098j29839j16105r2675
$$ y = [533574, 611807, 517588, 422497, 440717, 499035, 560461, 586064, 538172, 530661, 556888, 569028, 570084, 680892, 820073, 930582, 1005699, 985721, 990419, 1052296, 1085163, 1078451, 1231326, 1425645, 1536322, 1611315, 1751681, 1991959, 2212031, 2379772, 2525040, 2770821, 3103092, 3417489, 3909695, 4383513, 4822108, 5432434, 6134080, 7081231, 8199148, 9449738, 10834225, 12392034, 14089834, 15927800, 17749620, 19338134, 20495883, 20824203, 20386736, 19271713, 17673527, 15773351, 13791330, 11946642, 10312994, 8923606, 7811210, 6788914, 5932518, 5266385, 4732891, 4268039, 3868904, 3491230, 3182670, 2862577, 2561527, 2344305, 2124234, 1948072, 1839965, 1712371, 1533273, 1403434, 1287329, 1194654]
9138A194654J4975j7960j12000n7257k9590j09225j59079l7689L7757K8011m5077
9127G07520j22729J7822M1688L7334o775k9066j5797n2376p4887k2524O3196k9720
9115E13686j5972n1283q1776l1231o06M4304o0208n5810P3071N6692M8902m8221
9103C91548l9705m254k3878l3281j62192j7946N5330R8853M0885o9470o3128P9170
9091B51932j1001l9699K0607K2532K3385K0050L2109n5919n1371n2919R5570N193
9079B60469m4903p0k0767L2653o4253K610j721j9465O277M4780K0341J5866J35023
9066C66840n184j21061l6410J1645J5433J5993K4376k2378o7837n5133k2615k6961
9054G6708L4497M7917J8026K0123O6790r3166n2909J2144j1807j5382L4180K0686
$$ y = [1194654, 1209629, 1191669, 1079669, 1022412, 992822, 883597, 724518, 686829, 724586, 752597, 707520, 584791, 602613, 644301, 681635, 674860, 645794, 629997, 577621, 502734, 480210, 543406, 513686, 497714, 446431, 364655, 333424, 332818, 377122, 316914, 261104, 334175, 390867, 439769, 391548, 351843, 347589, 323711, 290430, 128238, 110292, 165622, 264475, 305360, 235890, 172762, 251932, 240931, 201232, 221839, 244371, 267756, 287806, 319915, 263996, 212625, 159706, 255276, 260469, 215566, 215496, 194729, 227382, 163129, 165739, 164018, 144553, 150830, 195610, 215951, 231817, 366840, 361656, 240595, 204185, 215830, 231263, 247256, 271632, 249254, 181417, 126284, 103669, 76708, 111205, 159122, 177148, 197271, 264061, 170895, 117986, 130130, 118323, 102941, 137121, 157807]
9042A57807p1086o3415J00692m7108m3065M9799J1429j3037j7473k0375m6991
9031b823n329J0148L0759L1731K9015O2996J13682J6998r8402j35532M1600M1625
9019A36468p3733o3762k9347Q5696K3438j06932k2732J34787J09145Q4105R3780
9008C70913o1789l0845j0316N680r4045m7497P9811O7654k8392o3799n2451r7271
8996C7653L935K4137K0702N3466K8838n2237q5076J3451J07956O0745J7632o6720
8984A64482r6307n8101O4764m5046k7048R5737P4611m7830m3559K1227p073J2251
8972A08108N8354L1864j2810p521j1394r2517k9568N947l1915N0681J6847q7885
8960a809j7181M082L0024m4595O5147Q4239Q9263k5651l799n1716r073k2246l852
$$ y = [157807, 86721, 23306, 123998, 76890, 33825, 83624, 95053, 82016, 64543, 44168, -2823, -8152, 1996, 32755, 64486, 93501, 156497, 270179, 287177, 188775, 53243, 94843, 136468, 62735, -1027, -30374, 55322, 78760, -28172, -50904, 83883, 193028, 277133, 370913, 309124, 278279, 267963, 273643, 179598, 132101, 211912, 279566, 251174, 187375, 134924, 37653, 41588, 65725, 86427, 139893, 168731, 116494, 31418, 44869, 152825, 213570, 231202, 164482, 68175, 10074, 74838, 29792, 2744, 98481, 173092, 125262, 81703, 102930, 95857, 108108, 166462, 198326, 185516, 177995, 166601, 74084, 44516, 50463, 18548, 69229, 86076, -1809, -18990, -14908, 15116, -29479, 35668, 119907, 209170, 183519, 179720, 128004, 118931, 96685, 92833]
8947I2833L0266J5761m944n4498J1814Q6090K5686j5083O6734k9099q8260n051
8935A32249Q899P6803n8034j42711l7022M2912l5578j4661k6268k561J6627M3365
8923D020R6342P6391j5844r954o5289k4333q8259j01055j2145L7449J27775O8640
8911I3738O2514j7734K074k815p3070O0139P2622J7032m2469j2383L9150L4734
8899B33532k03j58918l4914K6187M0163J6175n3876j30073k4548M5039M6603K5049
8887C0216L5748j9913k0077j1869M4870o5952p7550R364K952K3365M2269P8800
8875G2223Q8710m0170M665o2580o1436j0633N7466l6709k9102m418K8784n9183
8863e2383O2645K7724m9389M7984R265M7707L0430k6396R701k2024n0585k8495
$$ y = [92833, 123099, 138860, 133916, 79418, 91232, 177322, 203008, 187925, 254659, 225560, 137300, 132249, 141148, 217951, 159917, 17206, -19816, 23096, -12482, -27143, -53411, -55972, -39345, 4020, 100362, 176753, 160909, 150955, 85666, 61333, -26926, -127981, -140126, -102677, 25098, 93738, 156252, 138518, 140592, 137777, 64707, 124846, 197468, 214500, 172031, 159648, 198798, 233532, 233329, 74411, 39497, 65684, 105847, 122022, 68146, -61927, -86475, -41436, 5167, 30216, 65964, 46051, 25974, 14105, 58975, -6977, -84527, -75163, -72211, -48846, -6577, 72223, 160933, 120763, 125428, 62848, 1412, -9221, 48245, 11536, -17566, -21984, 6800, -52383, 10262, 37986, -11403, 36581, 45846, 93553, 123983, 97587, 107288, 85264, 34679, 6184]
8851F184N168M4088J19873q3728r9991K4865L0106N9795M4912n9279q9939m9822
8839d7768J3576R0592k7517l8575K2727P8698O4944o2636n6004p7984m4926k2061
8827a06934p6364j138M0207J32968Q8651M6628M0764k7174M9510q6106p5068L7259
8815F3203J1598m3281p671j1032K9555r859l1476J7379J9175J0756m8725m6723
8803d7101J3517n841p2524N8184K8931l9718n653M3111Q0709Q1442n3194n801
8791G6062P6232P9519L8678k0339q5972p2731M8563M7563k5600q0567n6962q42
8779B3604n7041K2548M8596J6976k2476j7686p4086K6664m2439J12194J21777
8768A58631L5148m2996q6324p5187m1072q890p079M7988L0879O2821P204M3565
$$ y = [6184, 11352, 55440, 175313, 91585, -8406, 16459, 46565, 106360, 151272, 91993, 2054, -47768, -34192, 56400, 28883, -9692, 13035, 91733, 156677, 94041, 38037, -39947, -84873, -106934, -183298, -184436, -144229, -11261, 77390, 124018, 164782, 137608, 187118, 101012, 25944, 63203, 74801, 31520, 23849, 12817, 42372, 32513, 1037, 18416, 37591, 48347, -378, -47101, -33584, -39425, -111949, -53765, -24834, -64552, -70205, -27094, 53615, 135057, 81863, 76062, 152294, 231813, 270491, 250152, 164180, 91449, 140012, 187575, 161975, 81408, 24446, 23604, -33437, -10889, 37707, 54683, 32207, 14521, -59565, -32901, -75340, 36854, 158631, 193779, 150783, 64459, -10728, -51800, -60690, -67769, -19781, 11098, 73919, 81123, 124688]
8756A24688K9274r840k7666L7714p798j24103L0541P9769r073k2730j88249M0618
8744d6855N4867M3030p1653j47251O7440J21313l3482k9354O1822O2938J0348
8733I3163j7503K7236m9122J937O9445J4877J9348n6785o8367p5260j7787P1497
8721A2679N4126l8464l0902M8869P9937K09J4474j7555m1156j0606J1194j7626
8709F5179p3338l5386l4566k4326K3890N2059L5257k0713L400m1997n5159j5779
8697a21479j6383N1006J24039j8440O592j7602K6484K3918p0262Q4286P1125k7488
8685A15796q8471R676j26589o1706q0856K6444O7929L2219N0609Q2788k320j1101
8673A4418m7495J1576l6643N7255M8391j02245r2740J20310J04045l2190O0423
$$ y = [124688, 153962, 144122, 116456, 154170, 146372, 22269, 52810, 132579, 123506, 100776, -87473, -46855, 8012, 51042, -20611, -167862, -100422, 20891, -12591, -41945, 19877, 82815, 93163, 75660, 102896, 53774, 55711, 125156, 140033, 159381, 102596, 34229, -41031, -58818, 12679, 66805, 28341, -2561, 46308, 126245, 126454, 140928, 123373, 82217, 71611, 82805, 65179, -8159, -43545, -78111, -102437, -78547, -26488, 8769, -11944, -8544, -50541, -105700, -121479, -137862, -86856, 37183, 18743, 25335, 7733, 34217, 58135, -12127, 72159, 143284, 115796, 27325, 37001, -89588, -151294, -232150, -205706, -137777, -105558, -54949, 27839, 25519, 14418, -33077, -21501, -58144, -889, 47502, -54743, -147483, -27173, 76872, 44682, 105105]
8662A05105N5571n0092m3661q3176q637k231K3086L7536J4805n8220r5406M265
8650a01055J56285J00026j17q914p2900k6554k5999n5426O1248O6439q9230Q735
8638A2538N7651L7383n76Q749m6749K1913l7651m6341q9317N8265M1183K3963
8626D1011L6009j8820j2154l8612J9348k6461K4952N0120M7752M1076k5976k1754
8614A16491m6421k095L3469l0998o0343l6644N366P5923K6631j5510J7809K4949
8602A08627K6528L2701l0981K6285Q7813P914p0584p3882N155J0420J8427K0404
8590A68827j3926j23705o3847L9890m1095J0260J6478n886O880o108K4640k8400
8578a5992m6472N9901L7999k3466l0026J856J8461k2611K8742P2959J2846j5755
$$ y = [105105, 160676, 110584, 66923, -16253, -24890, -27121, -4035, 33501, 48306, -9914, -105320, -101055, 55230, 155256, 155139, 146225, 73325, 46771, 20772, -34654, 26594, 93033, 3803, 12538, 70189, 107572, 106996, 115745, 68996, 90909, 53258, 6917, -82400, -24135, 17048, 41011, 77020, 58200, 46046, 7434, 26782, 321, 25273, 75393, 123145, 164221, 138245, 116491, 70070, 67975, 101444, 70446, 10103, -26541, -21175, 54748, 81379, 65869, 83678, 108627, 135155, 167856, 136875, 163160, 250973, 258887, 188303, 114421, 119576, 129996, 148423, 168827, 154901, 31196, -32651, 7239, -33856, -23596, -7118, -13004, -6124, -12232, 12408, -15992, -62464, -2563, 35436, 11970, -18056, -16200, 2261, -20350, 8392, 81351, 94197, 78442]
8566G8442j01242m1985K710P0524P2721n0643J7860K8315p7047m5604J3699N1534
8554A9284O9776O7046O4693P410o6646j36660o8762Q5988n224q2648l2611O0248
8542a8106J1507r8439r0600K7476Q4670Q1211O5075k9669P924k2235K5708O939
8530E1461K5885J1072l6889j1471r7953o4350K5284p625k9000J6712P0119R2955
8518D6200J0325l4730k7504J6298r721q8097N8340J1923M0536O7935n9615l3176
8506a286J50K7934p5885J787J7517k4148J07746O3543R567k7075j8653l897j4856
8493F2444j9569m4996m5884J1161K0617l7248j9639L2848N2372L8058P8399j9319
8481A09244j53699p796P4256k1988j113L499p834m9097N2543O8504n1439k592
$$ y = [78442, -22800, -64785, -62075, 8449, 81170, 30527, 48387, 76702, -345, -45949, -32250, 19284, 89060, 156106, 220799, 228209, 161563, 24903, -43859, 42129, 36905, -45743, -78354, -18106, -6599, -105038, -195638, -168162, -83492, -2281, 62794, 33125, 41049, 18814, 44522, 51461, 77346, 88418, 51529, 40058, -57895, -122245, -96961, -104586, -133586, -116874, -46755, 46200, 56525, 21795, -5709, 10589, 868, -87229, -28889, -16966, 23570, 91505, 31890, -1286, -1136, 26798, -49087, -47300, -29783, -53931, 53815, 117358, 126925, 99850, 81197, 77300, 62444, 42875, -2121, -48005, -36844, -16227, -53475, -73114, -40266, 12106, 50164, 128563, 109244, -44455, -52251, 22005, 17, -1096, 2403, -5431, -54528, -1985, 66519, 15080, 12488]
8469A2488n4695N6145K8825o5760l1386O9777O4515m2237k9083O144L5907K1363
8457G2003k642L3799K0783k0143j27252J1585O1148j465r9540k5968R2245n8456
8445d3903n0947M6137J7670o2655K9567J3249m7187m3708j6782L9978m470k7048
8433a50099M4811n1042l4607Q9815L0888l078N1840K9427J8663k404o4291p6571
8421a16648m3947J12491O2722J658j9955L1252p427j7217O936J0992m0123j27652
8409a46918m8288J01180R5776p684r4883m0672J25704J25304M008m2293k7660
8398D3574m7984n7645m0327o0430P5417N7792J6182m2979L101M3615k3018J32005
8386I9303J05517q2348r4670j11599n5226O4410L3409J7862K597j3603K0460j32133
$$ y = [12488, -42207, 13938, 42763, -22997, -54383, 15394, 79909, 37672, 8589, 14733, 50640, 72003, 69361, 103160, 123943, 103800, -23452, -11867, 49281, 47816, -51724, -77692, 14553, -43903, -94850, -48713, -31043, -93698, -64131, -50882, -98069, -141777, -158559, -118581, -123051, -150099, -105288, -156330, -190937, -101122, -70234, -73312, -21472, 7955, 26618, 24214, -40077, -116648, -160595, -48104, 14618, 16276, -3679, 27573, 20146, 2929, 9865, 20857, -19266, -146918, -195206, -94026, 1750, -5934, -100817, -141489, -15785, 109519, 113527, 71234, 43574, -4410, -62055, -102382, -162812, -87395, -29603, -13421, -56400, -53299, -9684, -32702, 99303, 204820, 122472, 27802, -83797, -139023, -74613, -41204, -23342, -20745, -34348, -13888, -146021]
8374a46021l0146J00783P5471O6348N5695N4119L628l6514r4732k1970P6639R8554
8362B01854m1693r9039j1435l6322p1354m7990M7074M4308L1488o3490p2207l4566
8350a53372N1741P828K546J35649J7335j8325L7832M8863j2428l4756j9742M6567
8338A09738J6354n9757n0014M9953N8683J3382n4377p7203p323j23426j0132P2050
8326f2072O3452L2323M4715J1412N4409p8584m1592J8793k3448L1112K7648Q164
8314H6332j8803j7262J8124k9526q0215N1472K8458M9832O9709m0580q9326p711
8302B0504m011o0460l5216L5159K6973K942K7440J13604L6892m9720O790J1096
8290A31993n3550l5123r3600L4277O5897R394o090Q09n5462L2046O9748K9843
$$ y = [-146021, -176167, -75384, 87, 66435, 122130, 176249, 179877, 143363, 48631, 26661, 103300, 201854, 160161, 61122, 49687, 13365, -57989, -105979, -58905, -14597, 16891, -46599, -118806, -153372, -101631, -93803, -91257, 44392, 61727, 43402, 81234, 130097, 117669, 82913, 63171, 109738, 126092, 66335, 16321, 66274, 124957, 138339, 83962, 6759, -564, -123990, -134122, -62072, 1380, 33703, 78418, 89830, 144239, 65655, 24063, 42856, 19408, 50520, 78168, 86332, 67529, 50267, 68391, 38865, -41350, 10122, 38580, 88412, 158121, 117541, 28215, 20504, 16493, -43967, -79183, -44024, -17051, -14109, 13331, 126935, 163827, 114107, 120897, 131993, 78443, 43320, -50280, -16003, 49894, 59288, 53198, 54007, -1455, 30591, 100339, 130182]
8278A30182l2036j04037p8470R913J00591J13779J2417p6992K8249k9321q927
8267F5348N1694o3755m1468M2866k1637o4946J6533J4277K9687M3413O0546J3635
8255A46193n5379K1701K1324j9109K401p1117m3444L1356N133j2213l1965j6963
8243b2082j1554J7269O730O9426k4408l171m4753q02k1908n6354M2608O6323k8925
8230a1601P372k1919N1286P443Q0798L3369r6426o3981o7235L7889M9566L1216
8218C7777N583k9137M5166Q9779p9915j26592L468K3215J5048J2160O7262N1654
8206A15468p1640l4215j3955o0056q9887k6816J89219J19507o3645n7531J3500
8195A9949k467L3960J3082p4423K860O2694L69o3358l3134n1231O0544L1126q4980
$$ y = [130182, 98146, -5891, -84361, -74448, 26143, 139922, 152339, 75347, 103596, 74275, 65348, 117042, 53287, 11819, 54685, 33048, -31898, -15365, -1088, 28599, 72012, 132558, 146193, 90814, 112515, 133839, 114730, 117131, 46014, 2570, 33926, 39059, 26846, -5119, -22082, -33636, -16367, -9637, 59789, 35381, 32210, -12543, -13345, -35253, -91607, -48999, 17324, -11601, -4229, -26148, 25138, 32581, 113379, 146748, 50322, -13659, -80894, -43005, 6561, 37777, 43360, 14223, 59389, 149168, 69253, -57339, -53871, -30656, -15608, -3448, 63814, 115468, 43828, 9613, -4342, -64398, -154285, -181101, 8118, 127625, 63980, 6449, 19949, 17482, 51442, 64524, -9899, -7039, 55655, 56024, -7334, -40468, -91699, -31155, -29, -85009]
8182h5009N708O8123P38j8412P758o440q8681L8191P1049O5789k8178k2823Q498
8169A6311N9276L1740l724K224k1293p7427p209M2196L022p4246M4134n8290m8082
8156i1368J9928j0560K0419L1633K9202M4694m4346j14160o6776K57L4259O3388
8144h3430L2597R0726m6926r6958p969P1196r6579K7103O6196k047l5406L7170
8132d4327M8912N1738J1771j2020r7871k2872J31613J9503J7053o824P9065o5749
8120A09992r122n5503l5737k1879m0843q5030m3902J514M3169P9199P6998M5068
8108F3924k5383k2886J030J3415M2485N1177o785L0698p3702j515M8557k1642
8096I9373m5864l8281j50142q6491R1155J30612O1869P439l5311q5984p7491l487
$$ y = [-85009, -79301, -11178, -10440, -28852, -21094, -27534, -116215, -78024, -6975, 58814, 30636, 7813, 16311, 75587, 107327, 103603, 105827, 84534, 7107, -102, 42094, 45116, -29130, 15004, -43286, -91368, -71440, -82000, -61581, -29948, -746, 43948, -398, -114558, -181334, -181077, -146818, -83430, -50833, 39893, -7033, -103991, -111960, -40764, -137343, -110240, -44044, -46091, -81497, -44327, 4585, 56323, 68094, 56074, -41797, -64669, 66944, 86447, 103500, 96676, 175741, 109992, 100870, 45367, 9630, -12249, -53092, -138122, -182024, -180510, -137341, -58142, 18856, 63924, 38541, 15655, 16685, 30100, 72585, 123762, 116977, 147675, 73973, 72458, 121015, 99373, 53509, 15228, -134914, -221405, -130250, 362, 62231, 69670, 34359, -51625, -129116, -132603]
8084a32603P3343J368O7315K495n1730n7666n5500L2582J23728l5113j82069m1267
8072b55117J7410K9757M6206P0457J26643l6815J3556n904q741l1244J701J1321
8060b0770j8787m3925M3593M7332k1819K7076j5924M4274r625N8791m9065q062
8048C3089J8555m3109M4699m7966j3827P5014n7629n6027M3194k9367j6151M8389
8036a136L9141R6766j07838k6328N6266J4157N1963n500o5947J434N4380L4754
8024A42112L167K6340q9760j31586k5041K410P3764j4506k6614J345k242j01695
8012a42306n5050M615Q7426P3761L5728M7447k0902L6220l531p485n0681p3235
8000f7993q5758K7356L7665M7725O7741N236M0233M7561M5943O3031q881j06627
$$ y = [-132603, -59260, -57892, 9423, 11918, -39812, -97478, -152978, -120396, 3332, -31781, -213850, -255117, -237707, -207950, -161744, -91287, 35356, -1459, 12097, 6193, -2548, -33792, -32091, -20770, -39557, -83482, -39889, 7443, -14376, 12700, -3224, 41050, 31425, 90216, 41151, 33089, 51644, 8535, 53234, 5268, -8559, 66455, 8826, -47201, -4007, -33374, -49525, -1136, 38005, 134771, 26933, 605, 56871, 71028, 122991, 117491, 51544, 52978, 107358, 142112, 145279, 171619, 81859, -49727, -74768, -72358, 1406, -13100, -39714, -38369, -40611, -142306, -197356, -192741, -105315, -31554, 4174, 51621, 30719, 66939, 63408, 55923, 5242, -67993, -153751, -126395, -88730, -41005, 26736, 31972, 72205, 119766, 165709, 228740, 219859, 113232]
7988A13232m4431j24544n4438L0410O3946P1250J6703n284K006k6415q3711j5804
7976e7080o0972J8381M5747N2966R1867L9320p753p6295P747l5126l8722L3299
7964A3379k107k9044m8268m3776J04979J9434N2191j675r3327O2349k0034n1064
7952c6963J8114O9157j2792K7229p9975p3463K2870M5901K5343R0012k104N7149
7940A50478j2645K408n3382m9222o1222p6617Q322M8106q554N0001p487k0282
7928c0096k4809N8247J2911Q3557R1530P2336m6431j48528p4797K6070N5217k6704
7916D8503K6200k806o9943L2919K6047j97985l0331K9411N4625J29994O7340o7654
7904D6320m6087l477O460p2845m127L7607k7075K5963J12841K7017r8936j2784
$$ y = [113232, 68801, -55743, -110181, -79771, -15825, 55425, 72128, 66844, 68850, 42435, -41276, -57080, -118052, -99671, -53924, -958, 90909, 130229, 122476, 46181, 53928, 18802, -19920, 13379, 11272, -17772, -66040, -109816, -4837, 14597, 66788, 65113, -28214, 34135, 14101, -36963, -18849, 50308, 37516, 64745, -15230, -88693, -65823, -19922, 5421, 95433, 93329, 150478, 137833, 140241, 86859, 37637, -23585, -100202, -91880, -43774, -52328, -2327, -9814, -30096, -54905, 3342, 16253, 99810, 191340, 263676, 217245, 68717, -6080, 19990, 75207, 48503, 74703, 71897, 1954, 34873, 60920, -137065, -167396, -137985, -83360, 46634, 113974, 46320, 233, -3244, 3216, -69629, -73756, -36149, -63224, -37261, 75580, 102597, 3661, -9123]
7892i123k2878n0374M9469J10233P743N0937J7244K2604J0035j9406m0908J5431
7880A41007r2925q2860q7556l0844K531J19881M8980o493j1372P7845O1961r0756
7868D9399p2108p809O8001Q449m0551m572O5489l6617j02892L4255n8712k7286
7856a24954R0599M3714J7408P1919j9253j5480o2507o0904q5508L7265l7236J6850
7844a28087Q8517k445Q2379N4393m6901j4783n1716M6726P8194K0o1497l594O1672
7831A02878J8286q5407m953K6041k7372j4680J798K4481k928m7271p4454l3875
7819a17456P4380N4926J0123q293o1284o7544Q4153R5907K4217K4056l832q3303
7807B6050j6827l753k2008J5877R4777n790j01871k9042L5676O7232k91p8960
$$ y = [-9123, -32001, -82375, -32906, 77327, 85070, 136007, 153251, 175855, 185890, 166484, 125576, 141007, 48082, -34778, -122334, -153178, -150647, -30766, 18214, 11721, 349, 78194, 140155, 49399, -22709, -30518, 37483, 45932, 5381, 809, 66298, 29681, -73211, -38956, -97668, -124954, -34355, 9359, 26767, 98686, 79433, 63953, 1446, -59458, -144966, -107701, -144937, -128087, -39570, -42015, 40364, 94757, 47856, 33073, -18643, 28083, 106277, 106297, 44800, 41206, 102878, 121164, 35757, 30804, 56845, 29473, 14793, 16591, 41072, 38144, -9127, -83581, -117456, -43076, 11850, 21973, 13680, -47604, -115148, -30995, 64912, 89129, 113185, 109353, 26050, 9223, 5470, -16538, -661, 94116, 88326, -13545, -42587, -6911, 60321, 60030, -18930]
7795a8930r8652k9903n648K1274n4787P3338K2750M2497M4308M2793j2184r6627
7783f9771q8769P0106j739r9272L9001M9286N9455L2465j6059n7417J6378L1230
7771c5106n8499n7378L3340J81960R8958j29081r1110M6749J9096o8522M0133
7760a9460N4892P0467l595m5644J2415l213n0036J1192M5690Q5999q5133j13755
7748d0181K9493O4309j02855l1641J6026O1822J2105n1052M3420k8884J5625M0890
7736B9077l377n5287n8348n1869j14144O3734P2625J00624O7463j8192p5526l2494
7724g5714J6097n2357K5461o458l2844k6177L1824J16695J09594Q7713k5594p0858
7712I7382m7920q694o0516k9474L8796L9203k2022M5978p0108q4613k7539N2490
$$ y = [-18930, -117582, -147485, -153133, -131859, -186646, -113308, -90558, -48061, -3753, 39040, 26856, -69771, -158540, -88434, -90173, -189445, -150444, -101158, -41703, -9238, -25297, -82714, -66336, -35106, -93605, -150983, -117643, 64317, 163275, 34194, -56916, -10167, 8929, -59593, -19460, 35432, 105899, 102304, 56660, 69075, 65862, 15826, 27018, 72708, 158707, 73574, -40181, -10688, 53621, -49234, -80875, -64849, -3027, 9078, -41974, 1446, -27438, -11813, 29077, 25700, -29587, -87935, -139804, -253948, -190214, -117589, -16965, 50498, 32306, -43220, -75714, -59617, -111974, -86513, -92971, -125815, -151992, -120168, -3473, 106121, 193834, 168240, 97382, 49462, 40768, -19748, -49222, -10426, 28777, 6755, 52733, -17375, -101988, -129527, -77037]
7700g7037J826q6883p4850J5931L8346N7348k984J01787O6529r105K4604n4510
7688A002j02628j0663M1502M8472j6206q4571k3501K8784J9792J2535N188K1959
7676e8335M6822R0774P345r6057q957j9919J7665L0447m8669l8392o578O5166
7664a8688J5537K3448J421l2519M9460K5728m4228m4650l9375m6573O4164q907
7652e5182l9737K5469K0443R4615R3636O3768p9839j30760j05189J531k646j6955
7640a30846k2670M5343N1159J3011n7127J1246J29518p4401j189R3886o845j05966
7628e4881k4957P2734k0265J2079N3267m7504l2586l8010k2220N0823P2489l6284
7616a5315l4208L6049M0414m4085n1351K2987O1887L480l3122J4293q0n2280o9465
$$ y = [-77037, -75211, -162094, -236944, -221013, -182667, -125319, -128303, -26516, 40013, 30908, 55512, 1002, -101626, -112289, -70787, -22315, -38521, -123092, -146593, -117809, -98017, -85482, -80294, -58335, -11513, 79261, 86606, -9451, -18408, -38327, -20662, 9785, -38884, -77276, -83854, -18688, -3151, 20297, 21718, -10801, 38659, 64387, 20159, -24491, -63866, -110439, -46275, -55182, -94919, -69450, -49007, 45608, 139244, 203012, 123173, -7587, -112776, -111245, -113891, -130846, -153516, -108173, -57014, -44003, -101130, -89884, 39634, -34767, -35956, 57930, 51085, -54881, -79838, -7104, -27369, -15290, 37977, -9527, -42113, -80123, -102343, -51520, 20969, -15315, -49523, -13474, 26940, -17145, -68496, -45509, 16378, 19858, -13264, 1029, 949, -51331, -120796]
7603a20796j27n8727J4025Q7921J26917K5700m3643n0575P3009L2420O1171J0431
7591A57726q1500j36926n0766N190O6958l4940Q9560K860m0495j0626l7242J8161
7579e2040K3291m0558P2001M7905p3476o8004k7180Q6159K2731m0675k7387j07010
7567a84243L2972J57705R2119J9327m9248k0057J2125j9206j1535R903L668n585
7555C7945l6352M4874M5409l4988O706k6481j41624m6338P0070N7045J7536n0724
7543e6922m9810K0639J5313K5507n6034k4574K5090K5970R049M2076P1442K1759
7531F9505k9424q575r3388q4978L8982M8758l8587l7842O532J10664M5382k3131
7519C898O371O409K4595n529K1128J0368l1366M2708p0153R25q3218m4316Q2794
$$ y = [-120796, -120923, -179650, -165625, -77704, 49213, 74913, 31270, -19305, 53704, 86124, 147295, 157726, 76226, -60700, -111466, -106276, -39318, -74258, 15302, 18162, -22333, -32959, -70201, -52040, -28749, -69307, 2694, 50599, -22877, -90881, -118061, -31902, -9171, -49846, -77233, -184243, -151271, 6434, 98553, 117880, 68632, 48575, 60700, 41494, 29959, 39862, 43530, 37945, 1593, 46467, 91876, 56888, 63594, 37113, -104511, -150849, -80779, -23734, -6198, -56922, -106732, -86093, -70780, -45273, -101307, -125881, -100791, -74821, -65772, -23696, 47746, 69505, 40081, 31506, -61882, -146860, -107878, -59120, -97707, -135549, -129017, -18353, 27029, 3898, 10269, 16678, 41273, 35744, 56872, 67240, 35874, 78582, 8429, 9354, -73864, -118180, -35386]
7506c5386R5276O509k0632k9560O1763l2184N0438J6214o4758m395N6651J5379
7494A15315j460m6263j01132r078L8102k6408p1723k2981M1524O4490l704j6335
7482c9653L4920K9955k8663l3214J0986k808K7494K0257P351R547l5486J2011
7470A2697J2579m1284j9548J4276J2372p96O3304K2545L566k8927N9109q8269
7458B1624n0986M3121m1292r3453K6306O9400J36388N0950o2466j06805q3078
7447i0291J4740M8596m076k309Q056K5863l4770l7693N1979M9338P495K2434J0442
7434F9804n8216j14006M5989K6452L0535M7008L9353L6365j16783q3739P2279
7423d959k5413p223J47546K6165n3651L7780k625J9342O215q2960m724N7833J3090
$$ y = [-35386, 59890, 66399, 45767, 16207, 77970, 45786, 96224, 112438, 47680, 43285, 99936, 115315, 113855, 67592, -33540, -42618, -4516, -30924, -102647, -125628, -84104, -19614, -23318, -39653, -4733, 25222, -3441, -36655, -25669, -28477, -983, 19274, 26625, 36172, 686, 12697, 25276, -16008, -35556, -21280, -8908, -9704, 53600, 76145, 79711, 50784, 109893, 21624, -29362, 13759, -27533, -120986, -94680, -25280, 111108, 162058, 99592, -7213, -90291, -75551, -26955, -31031, -33340, -25284, 579, -34191, -71884, -19905, 29433, 36928, 59362, 69804, 11588, -102418, -56429, -29977, 558, 47566, 86919, 123284, 6501, -77238, -4959, -30372, -37595, 109951, 136116, 82465, 120245, 117620, 136962, 143177, 60217, 55493, 113326, 126416]
7410A26416l8473l4148R828O357N8670J1072k8119j9779p3852m7285q896n0205
7398h8414K5463N8216J0417j8148N2255O7383o6166q7026k2767r721J4932j2032
7386g5608J881L3652O6442n321L9776m0640k3579k5717O7244J6103l8483o7880
7374e2130O9947L9899m7011J7911M6550K4757m6202p516J7746m0960l4775K7759
7362A5975l6509N3959J7414m4301q177k8689n572M2651j2549P2096q661o6126
7350h489p6861M0075k0663n5815l3596O6921R3816N6095K8888k1111p8777M5984
7338C6467P0077o230L822L2927m5402r1508N4336k5259J2101l185q8176N4375
7326D345j693o8146j2080L5148O453l4766l5225J2401l2246o683K3692j1466J786
$$ y = [126416, 87943, 53795, 63623, 69980, 128650, 139722, 111603, 91824, 17972, -29313, -38209, -88414, -62951, -4735, 5682, -12466, 39789, 107172, 41006, -46020, -68787, -78508, -63576, -75608, -73727, -40075, 26367, 21046, 60822, 20182, -3397, -29114, 38130, 54233, 15750, -52130, 17817, 57716, 10705, 28616, 75166, 99923, 53721, 46205, 63951, 22991, -11784, 15975, -20534, 33425, 50839, 6538, -1639, -30328, -35900, 6751, -5798, 66298, 57637, -8489, -85350, -45275, -65938, -121753, -155349, -88428, 5388, 61483, 90371, 69260, -9517, 36467, 106544, 100314, 104136, 137063, 91661, 153, 54489, 29230, 41331, 38146, -50030, 4345, 2652, -65494, -77574, -42426, -35973, -70739, -105964, -93563, -125809, -132492, -108800, -120266, -118480]
7313a18480O0478Q7294L7811l4980j3019q5558j6483J27202R087q3515J1392J6039
7301b732J01693j6764j19699J9310N124J2884L8082j5529K0973M4919n7778k9123
7289A360m820n6736k7864l0106L8761J6553L965Q026n0476o010o4546L26k9771
7276b01338O4004J60740k1985k1312l2320q8928K7097K8840k6687n3648M7652
7265a17885Q9589J24862l2631q1182M5676j3664P540m4673n9349P8908P8042N9117
7253A34350M6218n469m9849m4000k5269k0977j07974l5730p5901Q2814L3561J32040
7241F3814K0986j0870j1089j38721P613k2729K224L9294O7259p672m9740m0704
$$ y = [-118480, -58002, 29292, 67103, 32123, 19104, -66454, -82937, 44265, 53352, -30163, -18771, -2732, 98961, 82197, -37502, -18192, -13068, -184, 37898, 22369, 43342, 88261, 30483, 1360, -3460, -60196, -88060, -118166, -79405, -62852, -58887, -50861, -101337, -107347, -171893, -171567, -201338, -137334, 23406, 1421, -19891, -52211, -141139, -114042, -85202, -111889, -165537, -117885, -28296, 96566, 63935, -17247, 28429, 14765, 22305, -22368, -81717, -2809, 75233, 134350, 180568, 175099, 125250, 81250, 55981, 35004, -72970, -108700, -184601, -101787, -68226, 63814, 84800, 73930, 62841, -75880, -68267, -90996, -88772, -49478, 17781, 10109, -39631, -80335]
$$ [...]
##END NTUPLES=NMR SPECTRUM
##END=
