##TITLE=Analysis number 327655
Compound Code cc 23813
Book Reference 486/134
Project Code adrs
Chemist Name simons
##JCAMPDX= 6.0         $$ Bruker NMR JCAMP-DX V2.0
##DATA TYPE= NMR SPECTRUM
##DATA CLASS= NTUPLES
##ORIGIN= Bruker BioSpin GmbH
##OWNER= nmr
$$ XWIN-NMR		Version 3.5
$$ Thu Mar 29 13:21:05 2007 GMT Daylight Time (UT+1h)  MAYBRIDGE\nmr@NMR_250MHZ
##.OBSERVE FREQUENCY= 250.131544655141
##.OBSERVE NUCLEUS= ^1H
##.ACQUISITION MODE= SIMULTANEOUS (DQD)
##.ACQUISITION SCHEME= undefined
##.AVERAGES= 16
##.DIGITISER RES= 18
##SPECTROMETER/DATA SYSTEM= dpx250
##.PULSE SEQUENCE= zg30
##.SOLVENT NAME= CDCl3
##.SHIFT REFERENCE= (INTERNAL, CDCl3, 0, 16.522)
##AUDIT TRAIL= $$ (NUMBER, WHEN, WHO, WHERE, WHAT)
$$ ##TITLE= Audit trail, XWIN-NMR		Version 3.5
$$ ##JCAMPDX= 5.01
$$ ##ORIGIN= Bruker BioSpin GmbH
$$ ##OWNER= nmr
$$ C:\u/data/dgb/nmr/ADRS/2550/pdata/1/auditp.txt
$$ ##AUDIT TRAIL=  $$ (NUMBER, WHEN, WHO, WHERE, WHAT)
(   1,<2007-03-29 13:20:41.72 +100>,<MAYBRIDGE\nmr>,<NMR_250MHZ>,
      <created by zg, POWCHK disabled, PULCHK disabled
       configuration hash MD5:
       49 4B E0 1D 92 C2 6B 37 9F E6 65 BC 52 41 86 1D
       data hash MD5: 64K
       3E B3 0C EB 6A 86 2A 02 F9 35 57 4A 1B B4 3F 36>)
(   2,<2007-03-29 13:20:56.30 +100>,<MAYBRIDGE\nmr>,<NMR_250MHZ>,
      <Start of raw data processing
       ef LB = 0.3 FT_mod = 6 PKNL = 1 SI = 32K 
       data hash MD5: 32K
       14 7A 0C D7 F8 DF 39 19 D8 F4 15 03 21 1A 7B B4>)
(   3,<2007-03-29 13:20:57.97 +100>,<MAYBRIDGE\nmr>,<NMR_250MHZ>,
      <apk 
       data hash MD5: 32K
       41 A3 2F F5 9A 48 15 F9 E9 B5 BB 4B E8 54 AE 38>)
(   4,<2007-03-29 13:20:58.71 +100>,<MAYBRIDGE\nmr>,<NMR_250MHZ>,
      <abs ABSG = 5 
       data hash MD5: 32K
       39 17 98 F3 99 29 80 3A 7F 7A 10 F2 99 5E 0C DE>)
$$ ##END=
$$ 
$$ hash MD5
$$ A9 4A 54 FE 8D B0 F0 2E D8 14 3E E5 1D 14 3D 19
##$RELAX= 
##$RELAX= 
##$RELAX= 
##$RELAX= 
##$RELAX= 
##$RELAX= 
##$RELAX= 
$$ Bruker specific parameters
$$ --------------------------
##$DU= <C:\u>
##$EXPNO= 2550
##$NAME= <ADRS>
##$PROCNO= 1
##$TYPE= <nmr>
##$USER= <dgb>
##$AMP= (0..31)
100 100 100 100 100 100 100 100 100 100 100 100 100 100 100 100 100 100 
100 100 100 100 100 100 100 100 100 100 100 100 100 100 
##$AQSEQ= 0
##$AQ_mod= 3
##$AUNM= <au_zg>
##$AUTOPOS= <30 >
##$BF1= 250.13
##$BF2= 250.13
##$BF3= 250.13
##$BF4= 250.13
##$BF5= 500.13
##$BF6= 500.13
##$BF7= 500.13
##$BF8= 500.13
##$BYTORDA= 1
##$CFDGTYP= 0
##$CFRGTYP= 5
##$CHEMSTR= <none>
##$CNST= (0..31)
1 1 145 1 1 1 1 1 1 1 1 1 1 1 1 1 1 1 1 1 1 1 1 1 1 1 1 1 1 1 1 1 
##$CPDPRG= <>
##$CPDPRG1= <>
##$CPDPRG2= <>
##$CPDPRG3= <>
##$CPDPRG4= <mlev>
##$CPDPRG5= <mlev>
##$CPDPRG6= <mlev>
##$CPDPRG7= <mlev>
##$CPDPRG8= <mlev>
##$CPDPRGB= <>
##$CPDPRGT= <>
##$D= (0..31)
0 1 0 0 0 0 0 0 0 0.06 0 0 0 0 0 0 0.0002 0 0 0 0 0 0 0 0 0 0 0 0 0 0 
0 
##$DATE= 1175170836
##$DBL= (0..7)
120 120 120 120 120 120 120 120 
##$DBP= (0..7)
150 150 150 150 150 150 150 150 
##$DBP07= 0
##$DBPNAM0= <>
##$DBPNAM1= <>
$$ [...]
##$SUBNAM7= <"">
##$SUBNAM8= <"">
##$SUBNAM9= <"">
##$SW= 20.6930455092707
##$SWIBOX= (0..15)
0 0 3 0 0 0 0 0 0 0 0 0 0 0 0 0 
##$SW_h= 5175.983436853
##$TD= 65536
##$TD0= 1
##$TE= 683.16
##$TE2= 300
##$TE3= 300
##$TEG= 300
##$TL= (0..7)
0 120 120 120 120 120 120 120 
##$TP= (0..7)
150 150 150 150 150 150 150 150 
##$TP07= 0
##$TPNAME0= <>
##$TPNAME1= <>
##$TPNAME2= <>
##$TPNAME3= <>
##$TPNAME4= <>
##$TPNAME5= <>
##$TPNAME6= <>
##$TPNAME7= <>
##$TPOAL= (0..7)
0.5 0.5 0.5 0.5 0.5 0.5 0.5 0.5 
##$TPOFFS= (0..7)
0 0 0 0 0 0 0 0 
##$TUNHIN= 0
##$TUNHOUT= 0
##$TUNXOUT= 0
##$USERA1= <user>
##$USERA2= <user>
##$USERA3= <user>
##$USERA4= <user>
##$USERA5= <user>
##$V9= 5
##$VALIST= <valist>
##$VCLIST= <CCCCCCCCCCCCCCC>
##$VD= 0
##$VDLIST= <DDDDDDDDDDDDDDD>
##$VPLIST= <PPPPPPPPPPPPPPP>
##$VTLIST= <TTTTTTTTTTTTTTT>
##$WBST= 1024
##$WBSW= 4
##$XGAIN= (0..3)
0 0 0 0 
##$XL= 0
##$YL= 0
##$YMAX_a= 297095
##$YMIN_a= -430355
##$ZGOPTNS= <>
##$ZL1= 120
##$ZL2= 120
##$ZL3= 120
##$ZL4= 120
##$ABSF1= 16.522
##$ABSF2= -4.171173
##$ABSG= 5
##$ABSL= 3
##$ALPHA= 0
##$AQORDER= 0
##$ASSFAC= 0
##$ASSFACI= 0
##$ASSFACX= 0
##$ASSWID= 0
##$AUNMP= <proc_1d>
##$AZFE= 0.1
##$AZFW= 0.1
##$BCFW= 0
##$BC_mod= 0
##$BYTORDP= 0
##$COROFFS= 0
##$CY= 12.5
##$DATMOD= 1
##$DC= 0
##$DFILT= <>
##$DTYPP= 0
##$F1P= 14.0000005364418
##$F2P= -0.99999901652339
##$FCOR= 0.5
##$FTSIZE= 32768
##$FT_mod= 6
##$GAMMA= 0
##$GB= 0
##$INTBC= 1
##$INTSCL= 1
##$ISEN= 128
##$LB= 0.3
##$LEV0= 0
##$LPBIN= 0
##$MAXI= 10000
##$MC2= 0
##$MEAN= 0
##$ME_mod= 0
##$MI= 0
##$NCOEF= 0
##$NC_proc= -3
##$NLEV= 6
##$NOISF1= 0
##$NOISF2= 0
##$NSP= 0
##$NTH_PI= 0
##$NZP= 0
##$OFFSET= 16.522
##$PC= 1
##$PHC0= 228.7157
##$PHC1= 10.73253
##$PH_mod= 1
##$PKNL= yes
##$PPARMOD= 0
##$PSCAL= 4
##$PSIGN= 0
##$REVERSE= no
##$SF= 250.13
##$SI= 32768
##$SIGF1= 0
##$SIGF2= 0
##$SINO= 400
##$SIOLD= 32768
##$SREGLST= <1H.CDCl3>
##$SSB= 0
##$STSI= 32768
##$STSR= 0
##$SW_p= 5175.98343685301
##$SYMM= 0
##$S_DEV= 0
##$TDeff= 65536
##$TDoff= 0
##$TI= <Analysis number 999999
Compound Code 99
Book Reference 9
Project Code 9>
##$TILT= no
##$TM1= 0
##$TM2= 0
##$TOPLEV= 0
##$USERP1= <user>
##$USERP2= <user>
##$USERP3= <user>
##$USERP4= <user>
##$USERP5= <user>
##$WDW= 1
##$XDIM= 32768
##$YMAX_p= 336553728
##$YMIN_p= -67193
$$ End of Bruker specific parameters
$$ ---------------------------------
##NTUPLES= NMR SPECTRUM
##VAR_NAME=  FREQUENCY,     SPECTRUM/REAL,   SPECTRUM/IMAG
##SYMBOL=    X,             R,               I
##VAR_TYPE=  INDEPENDENT,   DEPENDENT,       DEPENDENT
##VAR_FORM=  AFFN,          ASDF,            ASDF
##VAR_DIM=   32768,         32768,           32768
##UNITS=     HZ,            ARBITRARY UNITS, ARBITRARY UNITS
##FACTOR=    0.157963299565203, 1,           1
##FIRST=     4132.6476996994, 0,             0
##LAST=      -1043.33573715361, 0,           0
##MIN=       -1043.33573715361, -67193,      0
##MAX=       4132.6476996994, 336553728,     0
$$ Real data points
##PAGE= N=1
##DATA TABLE= (X++(R..R)), XYDATA
$$ [...]
23520 -7619 -17791 -15027 -9587 -9432 1301 2029 -1146 -4365 -18077 -10264 -14615 -10425 -19339 -33058
23506 -33058 -22712 -4571 -3425 -10317 -13531 -7973 -2424 9617 7222 1871 7361 -3885 -3981 1251
23492 1251 150 14444 9636 -5910 -17128 -28060 -21836 -11529 -17817 -7947 -12170 -8120 2603
23479 2603 5781 7329 7807 21998 31596 19804 -1011 -9664 -2658 3012 41 -4202 -7461 -14587
23465 -14587 -5399 -13626 -13989 -14104 -5652 -7101 9268 20805 15188 -211 -7417 -14737 -23925 -17603
23451 -17603 -10399 -1650 1714 4552 1855 3500 -4398 2369 7919 2043 1272 10788 13698 18238 13488
23436 13488 4140 -12820 -7915 -7413 4568 6609 -5624 -9950 -25202 -17208 -4912 -1043 1049
23423 1049 -24263 -28605 -6579 9828 3289 -3720 -13317 -18065 -8169 4428 -2923 7493 20214
23410 20214 14392 12054 9809 18503 13347 11646 3329 -3879 2420 11784 -11459 -28238 -25237 -13517
23396 -13517 -10813 -4947 9023 20158 16746 -2715 -9110 883 9567 9266 10384 12731 17649 8925
23382 8925 -10927 -18189 -32024 -20634 -11367 -8845 -10539 -13011 -19056 -8480 1707 6312 18162
23369 18162 10609 -4520 -5709 -5934 -12876 -860 -1868 -9007 -21419 -16805 -1367 -11736 -13189
23356 -13189 -3701 1243 -2707 -2670 -3087 4978 7639 8241 18595 17610 -8507 -18213 -3185 -4936 -2198
23341 -2198 -4874 -14610 -12259 -14750 218 11201 12483 22638 23223 19755 10706 -7169 4541 12968
23327 12968 22977 23658 14853 15926 5278 -1574 -2269 11834 9988 12845 24040 18848 6910 -1280
23313 -1280 -6036 -15093 -26795 -34604 -19250 -7830 -1432 3223 21396 15060 9710 -3767 -15937
23300 -15937 -12637 -3960 3371 5643 4053 -15443 -19576 -12118 -172 15053 10661 17281 7331 -5701
23286 -5701 -11483 4347 7232 -931 -14609 -30501 -26994 -10973 -9730 -15608 -8430 3539 13446
23273 13446 12647 3959 -268 1716 -595 -8674 -7142 -13286 -15251 -4393 6830 7014 -946 -7568
23259 -7568 -15489 -5818 -5988 -2996 1356 4421 14640 17634 21057 25892 16609 21572 30737 13616
23245 13616 9497 753 -11209 -12459 -10349 -16691 -16951 -3526 -9578 -15316 -14645 -6547 3209 8256
23231 8256 5466 11367 -2591 -14198 -9195 593 1513 4673 4218 -1283 -1295 -9413 -21831 -19370 -7592
23216 -7592 -2942 -903 -4816 -9916 -13088 -5875 -321 -1230 2863 57 -3656 -15653 -18286 -20032 -13202
23201 -13202 -6868 -8202 -14737 -11251 -5441 1639 10973 10171 -2375 -1466 -2048 -5936 3831 7241 2679
23186 2679 47 -8303 -13224 -17249 -16383 -8912 -4862 5412 -1712 -801 1410 1777 -3885 522 4469
23171 4469 -9152 -18779 -12989 -17110 -11124 -275 7543 3179 -2179 -2560 7 6289 -5565 -17172
23157 -17172 -20062 -11799 -13648 -2663 7249 -2767 -3669 -19595 -25614 -12827 722 4335 -1296
23144 -1296 6566 5768 -1613 -263 -2715 13122 19906 5537 -14769 -13781 -8997 -6249 5984 9633
23130 9633 6872 11877 4526 -3505 -7912 -2289 19224 14832 6435 10401 13080 -5347 -16614 -19378
23116 -19378 -13349 7983 8013 -1558 -10556 -147 10795 5386 -10034 -15858 -4489 4714 6831 15044
23102 15044 16307 23671 11444 10269 3459 -453 -6242 -2818 -1516 9319 3082 174 2433 -3352
23088 -3352 -1108 -78 2227 5925 15953 11800 5303 -3612 -6974 -16875 -20599 -16807 -14576 -9859
23074 -9859 -10773 -15019 -6250 1874 -1150 389 4201 395 -16894 -19971 -10154 -17319 -12357 6498
23060 6498 15486 5534 5794 3996 12765 25723 27584 28367 13186 -7264 -9693 -9160 -3144 -4579 6806
23045 6806 -4164 -13147 -13974 -14729 -12541 1322 3772 -2175 -12043 -12211 -2834 17394 20342 12961 7923
23030 7923 6289 2002 -765 -8462 -10631 -5289 10981 22894 13107 6499 320 -10775 -22232 -32191
23016 -32191 -31247 -19674 7031 6696 -2704 13142 26658 21450 6007 -11163 -11279 3229 15712
23003 15712 22466 30522 21094 14537 29090 27216 15963 17488 25637 25039 18489 5875 683 7769
22989 7769 3125 10276 20878 21476 20745 14701 -5121 -13102 -13178 -14758 -5023 1844 8842 4255 920
22974 920 -2931 -8699 -21600 -19563 -22391 -32176 -24163 -13931 -6617 3786 -4772 -7557 -3469 -1406
22960 -1406 -5554 -8636 -72 4750 11321 14502 6626 7009 8370 6277 15180 19084 14719 8381 -6152
22945 -6152 -2974 -9012 -11826 -14291 -20825 -25899 -25722 -19673 -341 6808 4279 11369 -378 -12005
22931 -12005 6375 14840 12664 1629 -2828 -2841 11482 29094 30847 20818 9434 2303 8130
22918 8130 12054 -309 -8664 -2334 -5657 -18112 -28094 -26516 -29453 -27969 -23973 -37869 -41896 -29289
22904 -29289 -23387 -8443 2772 -2993 3752 -1611 -14364 -13615 -15880 -9967 -9486 -7559 -11460 -21417
22890 -21417 -18670 -20194 -11910 -8263 -11341 -4556 676 -6296 -2112 -2511 -2607 6194 12110 9175 6128
22875 6128 3667 -5453 -5898 911 1182 4048 14763 22652 11930 -7908 -13607 -8089 -14404 -19648
22861 -19648 -28269 -29502 -21895 -6803 4093 2464 6910 -491 -2978 -4828 -10200 -26722 -27577 -10354
22847 -10354 -2497 -4391 -14384 -10466 -16678 -24794 -2240 11433 31051 29102 15706 5194 9876
22834 9876 12250 16268 4659 -18296 -7222 -372 -3467 2307 4046 4181 -674 1473 2381 5977
22820 5977 14081 20026 14906 -1904 -1906 792 6463 7332 -5998 -5616 -5934 -11888 -10890 -11322 -10934 -17075
22804 -17075 -8118 2878 11639 8950 -2553 -17883 -17239 -8669 -9887 -8356 -12016 -24710 -34065 -410
22790 -410 17201 9304 5020 204 -6706 -4269 -15009 -19036 -14598 -14872 -14283 -14666 -13864 -5519 -110
22775 -110 -268 -1525 -7623 -8655 5106 8553 7209 -10514 -27767 -21077 6862 14788 13502 9855
22761 9855 8113 1776 -5225 -7087 -3044 -5371 -7736 -4576 4381 9043 11708 -12388 -29700 -21208
22747 -21208 -10106 1428 7321 5142 -8719 -14521 -24889 -18098 -24506 -23041 -20290 -12136 -3878
22734 -3878 -7034 -7213 -13190 -11415 -14340 -16112 -7511 -7545 -2545 -9897 -18723 -19489 -21670 -2690 17199
22719 17199 5441 -10650 -2808 -11144 -5053 10244 947 -10190 -8963 -6780 -6920 -18554 -17588 -16138
22705 -16138 -15459 -5597 22897 15458 3467 -8795 -14853 -27358 -27310 -14638 -12616 3349 18387
22692 18387 11048 4415 16678 12892 5488 -4301 -11436 -2224 10010 13647 20003 19953 7058 -8934
22678 -8934 686 -753 339 13059 4238 -7007 -2027 1704 181 10465 19845 12167 19189 27753
22664 27753 20227 1941 -5705 -127 19449 21471 20202 7993 7957 14301 10570 4929 -9233 -10594
22650 -10594 -3732 296 4513 11898 4754 4116 10175 6639 9964 21751 37930 42020 36688 30339
22636 30339 35535 33784 25193 27817 33581 38071 28138 3716 -3555 -6524 11659 17193 10568 -5828
22622 -5828 -10966 -3799 -14877 -24165 -17504 3978 28156 15495 4543 -18109 -18023 -15998 -20169 -25075
22608 -25075 -23221 -29086 -18503 -10705 -896 -14982 -10449 -12394 -12236 -17315 -22520 -27108 -27214 -31147
22594 -31147 -15853 -6222 -5565 -8635 -3297 -7329 -6320 -5411 -5354 5262 -3744 -10495 -11131 -21389 -23171
22579 -23171 -14400 -17541 -29909 -17636 -14056 -5331 -205 -3469 2811 12416 16330 18155 6066 868
22565 868 3798 4914 6010 -9006 -20388 -10373 2198 3773 -4030 -2774 -7957 -15223 -12834 -91
22551 -91 -2735 -12084 -14560 -10290 -4279 -5661 -7381 96 5202 6088 2759 -1984 -1002 3003 -1565 5495
22535 5495 21587 21607 10563 8421 9030 7347 318 2167 -1784 -8568 -17951 -22648 -19244 -20955 -33194
22520 -33194 -29199 -13808 -7143 4920 6864 -7846 -1710 -5123 -10840 -2581 -2566 -784 -1373 369
22506 369 -3910 8895 11642 12263 14690 6361 -1171 1221 4972 6864 -4853 -9571 4195 14699
22492 14699 8053 -2959 -8329 -2949 1413 3866 4029 10606 21528 -349 -9489 -4654 935 9948
22478 9948 17222 16188 10517 -4714 -8415 -7202 -10679 -11886 -8622 1362 8010 5230 7631 9216
22464 9216 -129 -2994 -10084 -1386 -1651 -18426 -15263 -12474 63 11028 13712 11039 7792 -1826
22450 -1826 -7398 -9136 -3829 3451 11481 15261 18210 13239 15659 12321 9518 10355 1803 -14680 -11197
22435 -11197 -21672 -17786 -8336 2780 3681 -4670 -4971 -7214 8014 8545 8697 3458 466 -10596
22421 -10596 -9797 -15727 -14760 438 -3199 -11225 2717 7697 1243 -4244 2298 4579 9504 22986
22407 22986 27027 19479 15738 12842 19194 16409 394 -734 13226 15253 14096 6551 14859 15463
22393 15463 3553 -3192 -24148 -12981 4772 -4033 -18305 -10557 -582 7490 16822 12957 5548
22380 5548 13034 8209 -8301 -2653 1038 -11266 -8141 266 -6979 -8178 2788 8967 7637 3393
22366 3393 4818 -6432 8024 11263 -2192 -3881 -4491 -4122 -3684 1546 199 -13834 -7894 2025
22352 2025 6 -23365 -31082 -28253 -22635 -21563 -15442 -18295 -21683 -21439 -15280 -20795 -19780 2080
22338 2080 11382 8126 2533 9693 15009 12597 12245 1245 -2316 -6200 -2740 -4626 -18025 -20768
22324 -20768 -11666 -14003 -11657 -10204 -16072 -16854 -12829 -1210 14497 30673 30701 11218 -12132 -13809
22310 -13809 -16878 -19446 -16830 -16307 -27020 -22085 -6203 19281 35231 33827 19931 13535 5431
22297 5431 3685 7316 19292 19334 5391 -6238 -8704 4358 3439 -7753 1053 839 8664 19742
22283 19742 29299 30942 34994 27781 17263 13726 -3929 -12332 -13216 -11348 -2695 5745 -3711 -3955
22269 -3955 -2994 -10649 -11275 -11395 -9716 -7923 -2364 -494 104 -9138 -27328 -19315 -8634 -4445 1875
22254 1875 521 -9317 -5811 -12264 -6007 -6123 -5838 -6744 -1370 -14094 -15780 -3843 12346 22624
22240 22624 9369 -2968 -12906 -9441 1231 1461 -436 -1857 3639 3229 1994 5079 -1050 4631
22226 4631 6721 1923 -4104 -4797 -2422 2366 -8402 3208 6245 16631 19787 9548 3012 -4316
22212 -4316 7415 16116 15516 2190 -8767 -4414 -18858 -36351 -44657 -34021 -22245 -5261 4331
22199 4331 7131 21352 32490 30118 16063 4138 2451 3966 5373 -5324 9481 20950 11189
22186 11189 -13807 -23926 -42371 -43148 -34004 -21209 -10157 -2343 11423 20863 5336 -890 -11106
22173 -11106 -18372 -2545 5873 6865 9676 7920 -4862 -18649 -31314 -28449 -17450 -11860 -266
22160 -266 -2457 -2768 -2325 428 12727 33531 24603 -4737 -24565 -11322 -2298 7898 13744 14318
22146 14318 9233 4619 -6039 -8835 -21081 -19394 -12016 -6074 -7643 -21162 -29423 -40389 -35703
22133 -35703 -22991 -16550 3934 28165 14720 9705 -2528 -6735 -6696 -15319 -10763 2923 14330
22120 14330 6470 6871 6069 -7960 -13800 -10536 -3362 -4763 1046 2493 5876 4841 999 -6673 -2565
22105 -2565 6552 450 -4378 -12050 -23660 -19615 -10239 -3919 -8870 -6940 -7095 -19739 -16608 -9989
22091 -9989 -10326 -3900 -5013 -927 8699 5955 13215 11264 2433 -8771 -7787 -6680 -5077 -6402 -11129
22076 -11129 -18978 -16546 -18090 -5603 -165 -5993 -10100 -2479 4244 3270 1566 -4731 -8542 -3742
22062 -3742 4220 -6472 -15477 -23906 -20520 -17668 -28891 -37553 -31778 -20621 -17925 -3408 3281 -3987
22048 -3987 -28936 -33082 -17818 2247 6052 16322 21550 26607 19501 4199 -4978 130 5077
22035 5077 2381 5988 2146 -7239 -17706 -25487 -15365 -8232 -4608 -4687 -9208 -22129 -18144 -4578
22021 -4578 -17789 -16352 -11479 -8520 -1057 -8320 -15026 -10461 4095 2991 108 6301 469 -3378
22007 -3378 -6898 5091 -11002 -16866 -11672 -8132 4048 5943 2065 -1587 6231 5188 -9043 681
21993 681 -6403 -18806 3822 12236 4483 -3481 -16499 -25768 -15907 -5166 1422 9164 22623 17876
21979 17876 -810 -9539 6044 10631 25926 29425 35559 30026 16564 -5465 -10891 -26323 -23956
21966 -23956 -8438 -4344 -10910 -2987 9954 5559 8138 -1796 -8995 -9895 -12185 -4690 -2545 -5741
21952 -5741 -2042 -4325 -3179 -11377 -23383 -25252 -19729 -9920 1718 -5729 -9475 -9107 -7781 -10991
21938 -10991 -106 9407 23253 27956 14833 -4035 -25754 -31508 -24848 -10011 -2057 11253 16719
21925 16719 6642 7184 14781 9048 -1746 -4693 -5887 -12485 -3271 4383 7728 14188 20239 26876
21911 26876 8856 4019 9056 25140 33358 36744 19570 -2552 -1400 -6058 -17209 -16329 -7646
21898 -7646 -1222 -770 -2384 1559 5893 8446 -5924 -8598 4879 11714 12074 9983 3253 -4230 5638
21883 5638 15310 -827 -4534 -1071 -6125 -14320 -1111 12741 18650 13637 11861 18163 23276 19221
21869 19221 6462 -5431 -18437 -20503 -7874 -4133 -2539 7766 354 -3653 9966 14902 14365
21856 14365 -6272 -7910 -15370 -13615 -3041 6690 8039 1036 5000 2852 1081 -17 -8303 -13674
21842 -13674 -4275 3083 10525 2262 -2651 1901 -793 -5174 -3452 -9394 -13213 -15713 -13533 1487
21828 1487 -968 -12037 -15465 -19817 -20966 -14461 -7196 2591 17338 19973 14437 14335 12500 21785
21814 21785 10235 -3034 -3638 1860 11138 3770 -2146 -9504 -18369 -4485 638 -15001 -13779 -12727
21800 -12727 -11459 -5717 1679 4320 1006 -8365 -13375 -22113 -16812 -17929 -23942 -21805 -27180 -26351 -25632
21785 -25632 -16066 -18855 -8297 -10413 -9110 -2531 -3294 -10328 -10444 -20759 -24556 -21326 -16978 -17130 -1870
21770 -1870 -5762 -17568 -36633 -34518 -21160 -11401 -5589 -3563 3709 -6286 -8921 -13115 -9627 -2046
21756 -2046 -4644 -13972 -10350 -6751 -11322 -9003 -3465 -816 6661 2491 8785 26024 21700 9340
21742 9340 6346 2706 -10492 -4163 8583 10949 -93 -4633 -10594 -12225 -17940 -16684 -9084 -689
21728 -689 -813 -4090 -11113 -23898 -27066 -17030 -12023 -8219 -11752 -19004 -24917 -16059 -11736 -28856
21714 -28856 -29418 -7903 7498 -9243 -14610 -6713 -4172 -4895 -15471 -15455 -10041 -8225 -13438 -16897
21700 -16897 -17689 -12149 -11415 -17081 -29315 -22563 -12129 -10367 -6317 -5208 5505 13423 529 -22234
21686 -22234 -16874 -13522 -17599 -12426 28 11604 139 -4888 -8502 -5183 480 3976 5011 13850
21672 13850 8325 -2101 4166 8720 88 -2008 -15993 -17328 -2420 1761 -1087 -2075 -1600 2601
21658 2601 -1221 -121 -2379 7357 18667 12189 -1745 -410 -6911 -10766 -1266 5010 2884 -581
21644 -581 9641 19188 1551 -12513 -5776 3001 2320 3872 4576 5962 5270 3079 -5200 -5879 -6712
21629 -6712 -8841 -3340 -8375 -7197 -5795 -5662 -6504 1791 5124 11079 9647 -4535 -10268 -8339 -2034
21614 -2034 8940 11884 -862 -5975 -5198 -17039 -19093 -9944 -11992 -18687 -16251 -7953 -3405 -14952
21600 -14952 -15723 -15397 -30790 -29236 -3826 -1663 761 3876 -1697 -15591 -18769 -22039 -13981 -10608
21586 -10608 1200 7570 21563 15346 3595 -1643 6845 15177 17443 27909 12684 -7097 -16723
21573 -16723 -21405 -14778 6030 2825 -3098 -15416 -9965 -923 1801 -1644 -777 17203 18431 11492
21559 11492 3387 -611 1301 -2212 -3065 -453 -2415 -5154 4589 24654 34850 26891 8174 -14080
21545 -14080 -23086 -27436 -9968 14646 14966 1977 -11488 -16587 -12847 -15685 -16270 -3951 9619
21532 9619 12522 12437 17976 14061 12225 7861 4934 14706 16467 7169 4072 -5622 -4959 1968 -3364
21517 -3364 -9986 -4148 -6233 -22085 -32423 -19579 -25554 -23936 -22346 -19333 -6343 -5727 -7728 -3172
21503 -3172 -3233 -8993 -9044 -6963 -11678 -10353 -19018 -7751 10689 5627 7609 9934 19241 14012 -5247
21488 -5247 -7040 283 4051 10642 14559 12332 21959 32533 20463 17951 6148 -19778 -22419 32
21474 32 23554 28250 6544 1706 -11923 -2047 3113 4860 2227 -2038 87 -9841 -17511 -14206
21460 -14206 -12878 -6464 -15924 -10551 1187 -10719 -23907 -11362 -903 -6861 -18415 -19630 -25679
21447 -25679 -33307 -25485 -23448 -26206 -39388 -27244 -12592 1731 4397 8260 17749 22134 10639
21434 10639 4507 7620 9704 -378 -231 -3784 -7475 -6507 -159 -5914 -14248 -14733 -3153 8787
21420 8787 -3052 -15441 -16407 -9484 -5637 -1319 -3754 -3484 -684 -7416 -6240 -4392 1376 816 6729
21405 6729 5277 9191 10510 -3193 -1935 1462 3369 -1388 -11505 -25543 -18302 -27615 -12458 390
21391 390 2425 97 -8057 -21794 -35234 -10503 16974 13028 21950 31886 35821 25649 20590 10941
21377 10941 4422 -6427 -3229 -8534 -21279 -21247 -23796 701 16065 13415 -1764 -15538 784
21364 784 15079 11953 8674 -9485 -15513 -11289 -12381 -11964 5910 1853 -3701 -14263 -14882 -9744
21350 -9744 -3884 -24159 -18407 -9410 -8191 -4153 3681 3384 4268 23768 15986 12881 7372 7954 16480
21335 16480 17845 2163 -8675 -8725 -13384 -20602 -40674 -35559 -19728 -13048 -14495 -20114 -27962 -22228
21321 -22228 -3173 -2134 11668 8559 -5576 -20881 -14627 -14652 -13374 -1618 -11572 -568 7184
21308 7184 11551 10780 8291 3123 -1750 7819 -382 -9453 -18246 -15259 -10277 -12820 -4591 -3394 1526
21293 1526 1697 -8534 -8744 909 -11313 -19391 -254 3636 -8306 -2049 11557 16716 -7540 -26537
21279 -26537 -26386 -16245 -14133 2314 13790 3633 681 -11571 -20697 -7838 -15083 -24404 -25900
21266 -25900 -11803 -7385 2739 3864 14184 25291 13112 435 5972 6240 11157 20339 14948
21253 14948 19199 9390 8360 10336 12067 10958 1876 4396 6039 7524 2313 -9428 -9430 5959 903
21238 903 -6487 -13783 1807 10873 18030 25623 22371 14449 19385 17915 22939 13827 13272 6963 8556
21223 8556 12992 -7005 -21929 -9112 11428 16528 13578 4512 12310 14673 4880 3989 8762 12015
21209 12015 17223 12476 -469 -6614 -4684 -2653 3029 16667 32200 27472 9918 4550 19406
21196 19406 11473 7406 8983 -2003 -4035 -4260 3615 11410 13266 10188 -3966 432 2157 533
21182 533 2281 -2863 7849 -9986 -6552 966 -14072 -15769 -7946 -11421 -7877 -16290 -5377 -9844
21168 -9844 -22259 -21207 -1964 7866 12194 6019 -1758 2480 -4928 1058 -7526 -18728 -7226 3452
21154 3452 4394 -3267 1237 1913 7246 5424 759 -7850 -5645 5976 -1882 -9151 -14043 -15716 -5015
21139 -5015 11100 18132 16967 1772 -3180 14964 18395 11878 -96 -3829 3084 -9224 -14271
21126 -14271 -11899 -13634 -14223 -6773 5220 -1231 -9736 274 7812 10250 12593 23752 16919 -7895
21112 -7895 -22104 -23079 -25344 -10262 -8346 -4405 -10826 -6100 -4622 -10730 -11679 -13444 -4292 8420
21098 8420 1802 -10162 -2438 -2561 2251 -16042 -18749 -6106 5862 11443 21731 25159 16302 21832
21084 21832 24162 17529 8161 -2860 -5267 -225 8324 7242 5195 14202 7272 -4301 -10035 6717
21070 6717 16037 15613 11134 419 -4172 -6500 -10924 -4400 -9827 -16180 -27055 -32691 -33982 -26901
21056 -26901 -27721 -40065 -20839 -6133 4658 -9193 -20439 -2692 7889 -7744 -4867 -12657
21044 -12657 -12153 -8538 -7998 -18394 -22795 -10099 -19392 -43994 -33323 -21009 -12000 -15195 -29522
21031 -29522 -24666 -2220 6602 5634 11119 21929 19263 14331 9952 8838 10188 17762 13135 -1365
21017 -1365 -9887 -10567 -12324 677 13225 8238 10457 6203 5313 6677 19689 19215 20926 17392 1856
21002 1856 2739 12800 13883 732 -3381 5922 4113 -6749 2206 4054 7020 -2724 -5314 -3644
20988 -3644 -6077 -6367 -5477 475 3661 7088 12651 16568 15303 12287 13668 -6080 -3941 21379 36913
20973 36913 48270 31892 1854 -18280 -20205 -7073 -3699 -8803 -8637 -20843 -25012 -12867 896
20960 896 4464 5833 3972 -11114 -787 8541 -1422 -7751 10548 21718 15976 1915 -18678
20947 -18678 -24722 -31194 -15369 -10801 -12937 5894 8281 4627 3216 8503 7548 11606 14636 18575
20933 18575 19529 8581 936 3951 11763 4508 3812 6975 -11003 -3512 -1700 -2055 -3057 -3817 -19416
20918 -19416 -35164 -33944 -21508 -5720 -10869 -8909 -15942 -8119 2961 8039 19627 15096 3896
20905 3896 -9031 -16335 -14353 -17314 -17258 -15235 -1595 6004 -4021 -2745 8408 21390 26143 28088
20891 28088 32820 34926 25849 14791 21261 22599 8304 11318 15090 10533 8650 -3397 3645 9675
20877 9675 -708 -13697 -5715 4262 9346 8130 -375 3362 8772 -6912 -9952 -7674 -15193 -4665
20863 -4665 1815 4388 15444 23944 16547 23932 28983 27888 31880 26665 12987 7212 -2789 -17707
20849 -17707 -16871 2529 -3170 -103 7474 3755 1927 -8125 -12816 -5390 -10507 -11754 -23653 -26484
20835 -26484 -19307 -23003 -30607 -27113 -15164 -15094 -24163 -35026 -24506 -22390 -16814 -12145 -991 -3399
20821 -3399 -8107 -15027 -5068 -6389 2203 13630 29294 24918 15182 -5634 2747 11625 4604 -746
20807 -746 956 16844 18557 20302 13120 -5050 -27949 -22779 -26370 -25051 -8625 3007 8679 15021
20793 15021 13782 -8284 -24755 -17171 -13665 -16199 -9750 -9767 -9084 -6706 -495 1476 6730 12209 1798
20778 1798 7032 12168 3941 -3125 6008 16208 14802 8764 -3151 -242 9871 -3600 -9542 -2030
20764 -2030 -3826 -10313 -10533 -11053 150 7605 8387 -590 -18612 -10690 512 11792 18827 10792
20750 10792 9617 1716 -6403 -9602 -2348 2828 1292 1014 5050 9978 -1835 -10056 3283 6957
20736 6957 -2342 500 11219 18367 8581 -2541 -122 1658 -2556 -714 3092 14668 14319 2497
20722 2497 10583 1896 5760 3157 -9944 -23354 -22463 -15873 -28532 -17796 5943 -473 -2314 5051
20708 5051 2430 -7491 -8536 -7870 -6851 4281 11657 4585 2966 6389 6586 -4832 -6573 -1482 -7527
20693 -7527 -15464 -27963 -17449 -9720 -3243 4229 10883 15333 21367 10714 2522 -10723 -21355
20680 -21355 -17866 -4379 131 -6420 5053 8173 1174 7451 12522 4688 17546 21609 19561 17351
20666 17351 21322 -5103 -19286 -4068 14170 11280 16476 9289 1642 6223 452 845 10666 6266
20652 6266 1627 13482 22817 14126 15747 16120 12314 14683 9618 14441 16278 14917 15905 13095 13756
20637 13756 7992 8936 15896 11785 -2937 -21811 -26902 -15313 -7418 4775 19435 10307 608
20624 608 -12585 -15614 -14778 -4889 -5298 -14082 -7955 -11455 1353 12583 17332 9086 -884 -15321
20610 -15321 -12112 -8141 14305 22938 20149 9991 1019 -4879 -10886 -12595 -7104 -4474 4091 -4404
20596 -4404 -9222 -7334 4451 88 -8118 3707 9433 5204 14316 2803 -6297 -3288 2413 6118
20582 6118 10171 7677 7886 -3387 -1927 8366 11016 11564 9792 7318 3983 5085 -5650 -3154
20568 -3154 4163 -4409 3186 11106 3043 -9802 -10921 9566 15058 26831 20483 16381 13652 -2722
20554 -2722 -8737 -3540 6931 15391 26783 13436 -10289 -15415 7286 34329 33535 17008 14189
20541 14189 22973 23612 19504 14565 7471 4376 19279 33088 23808 12368 4598 16307 14259 -945
20527 -945 -10067 -11739 -7253 -6252 2917 9539 12144 14453 11061 15868 18568 24999 16376 21092 13282
20512 13282 1092 664 8166 10167 15079 12598 -10295 -20075 2683 12316 10981 -225 -10122 -9977
20498 -9977 1855 339 -9630 -13903 -1268 -3484 920 5897 4739 20499 22140 4881 -10689
20485 -10689 -23625 -30384 -31836 -18623 -17030 -1008 15975 10344 -98 2279 12588 533 7670
20472 7670 -2741 -8330 -1130 5552 6123 12592 -1329 -1140 -13388 -14277 49 7409 5022 1176
20458 1176 724 -5874 -9714 -17299 -12030 -8498 -269 -8717 5710 15235 -417 -8316 -18438 -23032
20444 -23032 -17687 -15286 -17298 -13229 11357 9084 -15109 -28902 -19180 -14049 -19014 -18348 -1286 4616
20430 4616 -3006 -10551 -23533 -29895 -20258 -15529 -10705 -5443 -12216 -20987 -24219 -16567 -6026 -13363
20416 -13363 -15848 3508 994 1341 -3732 562 8628 13302 17482 9788 16028 21248 6519 -10652
20402 -10652 -9851 -8978 6045 11107 10041 5403 -4272 -7481 1842 3843 5371 -5770 -12392 -1432
20388 -1432 -4617 -6196 2115 -409 2962 8951 5480 5165 -260 -2472 -11712 -20396 -14457 -3575 -1539
20373 -1539 -6747 -12021 -13067 -2140 4617 2958 10244 18007 10947 1550 1979 15982 29067 32090
20359 32090 28210 27328 16638 13257 15741 -437 -18268 -20198 -20889 -20558 -11958 -7509 2788 14399
20345 14399 15256 9140 5553 20275 27291 12241 11080 5416 2581 1881 -5030 -4302 -769 1081 10591
20330 10591 20450 18148 12023 6054 -18084 -29120 -23667 -10420 3808 -371 -8334 -15456 -6385
20317 -6385 -4374 -5668 -2935 6776 13200 6569 3763 6280 10495 2145 -10649 -14662 -3286 489
20303 489 -4931 -933 -204 -6596 8264 14949 7488 3657 11741 -2544 -14301 -10551 3432 1569
20289 1569 -15737 4433 23156 17297 1008 6082 5698 6583 10467 11764 6235 330 12508 4021
20275 4021 -1246 -3935 -10908 -12457 -23949 -26291 -17859 -4361 11633 16783 7070 688 -12367 -1402
20261 -1402 -5157 -7639 -3617 -6556 -9374 -12870 -4375 -1570 -7648 359 3445 1210 -166 5050 -3193
20246 -3193 -11071 -15884 -9933 8725 11326 6681 16306 18351 5075 6732 5628 -1538 -2913 6937
20232 6937 5447 -11978 -20973 -26696 -28885 -31746 -23384 -13577 -3699 3019 19064 14425 7476 4537
20218 4537 12385 27433 25323 16169 21861 18036 2663 -12848 -5245 -3479 4979 -1159 -2954 5305
20204 5305 7562 17925 14070 13528 8638 -4251 3385 9715 4365 -10886 -8945 6753 22282 16452
20190 16452 374 -8045 1221 467 -12611 -20146 -15469 -12693 7743 14519 2728 473 7889 18456
20176 18456 11538 -9011 3772 8433 6706 17298 21817 23633 2367 -6427 6029 6939 2743
20163 2743 13862 29955 43582 45268 20811 -5605 -5741 7967 21598 22012 19333 16157 18249
20150 18249 18777 7169 7412 12275 14407 13843 14956 16836 11348 -2107 -8122 -25722 -35506 -22305
20136 -22305 1737 4295 7848 19033 18258 11722 1952 3154 10648 13860 9439 625 -5948 -4011
20122 -4011 -2923 3228 10655 12766 15464 25743 29003 24660 5298 176 4207 8559 -2418 51
20108 51 11270 18538 5362 -3991 11558 12282 -4010 -9541 -8749 -1040 4014 -1303 2468 10376 12980
20093 12980 17599 4921 -958 -12246 -13809 -9710 -6204 -1065 -1470 -8908 -477 7264 7509 2880
20079 2880 2454 -4666 -12368 -15324 -20335 -27713 -18791 -5095 -1422 -7759 -4216 -2612 -4996 -6036 1349
20064 1349 9068 2133 -5042 -468 -385 5693 930 -16160 -9970 -6288 -2729 11590 4081 -3020 -966
20049 -966 -2900 3792 1275 -8680 -2683 -5765 -5750 3576 5632 9398 -625 2138 -11966 -7620 3855
20034 3855 -1706 -2656 -8861 -4165 9518 5943 4571 9533 9026 4350 1169 -2328 -1251 3751 -1846
20019 -1846 -4158 -7594 -12833 -5557 -2097 -1717 -5570 -12464 -14847 -19269 -7950 2797 9371 7570
20005 7570 12086 18022 -442 1367 -5558 -13131 951 4666 7984 2270 -5681 5950 19834 6065
19991 6065 -3245 4069 -2910 -12297 -15191 -14443 -14956 -8140 -6324 -3848 6082 8171 -1349 8126 28119
19976 28119 23559 33367 37273 20414 9858 26812 45061 50380 40719 27112 34091 23847 13075
19963 13075 10823 18610 19662 23429 32095 29332 16248 20816 12483 14963 12355 17530 12466 4708
19949 4708 -76 15493 27471 20292 1412 -6062 2381 15651 22529 32219 24647 14984 12861 2287
19935 2287 3111 -2624 -1544 -2328 12732 33446 19370 15297 11703 419 2566 24705 29305 34190
19921 34190 44566 33979 31738 41846 46887 41442 32712 28498 50362 82157 100142 93929 93750
19908 93750 106202 114815 118671 132938 155102 178615 192322 194641 205945 203587 192001 172640
19896 172640 146103 142586 148543 142632 132297 125399 112006 96838 67868 41188 39233 27996
19884 27996 11897 15653 7212 5419 15054 16106 8819 6439 923 14572 9393 1783 -7201 -15615
19870 -15615 -7389 -1186 -5173 -14439 -2768 12403 20337 19940 24870 11206 634 6230 16598
19857 16598 16077 17560 11709 2614 8989 21289 21541 17031 -6966 2777 2278 -5190 1264 17264
19843 17264 19868 9855 5198 -4228 -12277 -19921 -6896 8422 23256 20978 24133 17894 15389
19830 15389 15107 928 -2271 -9744 759 9965 15903 19002 18594 20103 12079 8311 4165 10922
19816 10922 22330 19224 4415 2894 27991 22115 12769 3866 12816 11200 5921 24552 32099
19803 32099 8477 -8984 7905 16293 13256 -681 -4603 2185 15696 24536 15052 9001 16990
19790 16990 13653 13212 22629 7636 1522 12734 18376 22434 22811 9746 5505 13675 28350 38360
19776 38360 34302 26300 28406 28925 24033 11537 14498 23001 14687 568 -2776 2596 -14983 -12465
19762 -12465 -7312 434 1832 -6635 8182 29670 39326 26941 19643 18770 10610 11744 20180 19074
19748 19074 13501 9153 274 -7240 -7103 -10029 -1285 3839 4733 11570 4176 12781 24984 33261 18468
19733 18468 1268 4093 -6618 -12423 -7790 -7781 -7795 5989 7372 13808 10475 17137 13751 1055 -13041
19718 -13041 -15380 -1637 1065 619 4956 10979 5141 -2441 2368 -2592 13845 19510 9032 9466
19704 9466 14585 14478 26368 36127 24406 17286 12885 5077 -1160 -9761 -10402 -1478 17651 25718
19690 25718 14631 21788 28215 20419 7318 -3137 3598 6053 5008 -3800 4732 9699 12010 -8348
19676 -8348 -7993 -4037 1241 3797 10017 8928 12637 13243 13328 24317 21896 8379 -8545 -11030 -10171
19661 -10171 4993 11403 11979 10849 10214 9152 11172 6233 47 -17482 -17371 -5916 13816 19494
19647 19494 6284 -2824 4640 8377 -4155 8892 19122 3658 -7375 6289 15900 28186
19635 28186 29225 26783 13231 13552 23372 36794 32815 31583 22182 3161 -1866 401 11775 7446
19621 7446 8733 12618 13821 15415 8637 4384 15855 17085 21818 10226 -898 4825 23228 18338
19607 18338 10066 4924 6786 8370 17270 24092 26790 30169 18553 9493 5286 17339 24288 26019
19593 26019 24835 21279 19312 34210 34724 41749 31047 27593 20626 29774 36255 36079 42253 52781
19579 52781 46729 45808 46945 40242 47147 39137 30726 19973 31042 41180 43298 50435 43300 31834
19565 31834 34152 39962 46304 31836 31194 30034 18951 24116 37330 34984 32416 25966 29453 28384
19551 28384 32841 32403 31329 24578 4551 -2056 11273 15289 17079 23485 28826 27668 9512 -6090
19537 -6090 2071 -1018 -8971 -6061 -9153 -6523 5455 19765 10493 -1780 -5048 -12857 -6084 -5998
19523 -5998 11275 24925 21580 15606 9671 13402 12179 16022 -407 -962 18971 20376 10963 5065
19509 5065 1531 -8200 -10032 -12750 -18848 -9094 11212 27786 27939 29373 26410 14703 4282 21580
19495 21580 32266 28091 20177 34529 33538 34416 42242 36391 24150 19318 19740 30004 35920 53198
19481 53198 43530 36562 24600 27654 27187 27493 18509 23257 16145 25291 19598 8375 16084 16932 26687
19466 26687 42537 47910 32437 23900 15661 7978 10085 27934 29104 32993 39040 54634 49928
19453 49928 32360 24366 31240 42582 41053 34172 36430 37688 30368 35277 32918 39981 52592 54351
19439 54351 49211 60777 61738 50332 35791 33764 38432 43858 59348 72806 93210 108312 140309
19426 140309 176097 190928 216122 242611 260379 249135 226320 214891 176517 155331 161104 159754
19414 159754 171853 190699 203626 233122 261377 259507 226983 203282 202775 202608 190564 169934
19402 169934 151338 129546 102047 78890 55828 54157 45834 50176 65189 56514 58638 65777 71140
19389 71140 78613 71767 70401 76882 78767 80793 85929 101636 108717 110034 94843 75383 75172 64481
19375 64481 65588 86394 116695 136554 168164 216076 260573 282326 295290 301773 291267 290493
19363 290493 269020 257550 243306 220730 224643 237079 246903 228393 198958 181207 165766 149942
19351 149942 128002 100775 93421 90294 82363 80307 78012 56155 34281 18349 21010 31233 47807
19338 47807 46988 44958 39100 46878 48103 38287 28223 25195 19752 13936 28227 20479 14579 20109
19324 20109 22287 26262 15461 12520 29491 31199 36677 44163 39632 44575 48626 40311 32719 45245
19310 45245 29383 16088 21325 18449 28374 41455 43884 30304 27681 30565 31013 38368 49941
19297 49941 43891 27864 27531 29552 16636 -1765 6625 10749 18880 24703 33235 31492 24799 35827
19283 35827 35644 38746 23792 23171 29084 38326 53928 73545 69647 61529 50033 49876 49794 42567 36048
19268 36048 27725 17057 23016 33926 47494 61956 62710 45668 48541 44842 36546 32204 29174
19255 29174 25002 33251 37585 43174 37866 34967 42520 45328 60108 67256 63640 69086 54336 39873
19241 39873 42365 53125 52317 51758 51278 57154 67252 62829 60793 70914 82972 79826 77118 79272
19227 79272 89551 95975 92897 98600 95768 87601 82225 66774 62344 57229 64900 62896 56403 61164
19213 61164 73035 74735 70487 72679 74406 67326 59263 49402 42430 52668 58343 64132 75051 70222
19199 70222 62135 67179 65025 63005 58532 66993 88778 88301 75747 82337 77967 85842 102910 104514
19185 104514 99822 103962 99445 88267 77601 76620 83784 87776 93815 106352 113173 130791 139751
19172 139751 143046 135331 123100 121156 125269 130591 121931 108409 107203 109302 103018 111910 109031 109309
19158 109309 124435 135241 126550 122888 126484 121602 113818 104383 99713 95388 101297 109463 103211 96554
19144 96554 103857 112857 110798 109777 107361 90243 83772 87584 103570 120798 123617 121727 127911 125644
19130 125644 123922 117258 124759 122421 127767 134914 131763 135544 149337 160138 168420 170047 170981 169133
19116 169133 157527 157331 156040 159076 157315 151450 147945 145699 144491 137260 137293 142022 127064 120982
19102 120982 110109 105939 106017 104995 100316 102306 113019 121539 113526 130949 135575 142713 152817 157491
19088 157491 158370 160133 149603 156928 159748 159652 174231 181664 181201 189030 190665 199904 210971 235347
19074 235347 274466 307847 319647 313569 296434 284722 299593 302377 284373 266053 250301 240769
19062 240769 239446 254384 260148 266689 288270 294549 282956 281835 271561 266193 240073 233963 229990
19049 229990 234846 247551 258791 258888 251699 264147 279591 289074 294635 296449 296756 302136 299045 302051
19035 302051 309922 318033 320568 324421 330950 315997 300887 293545 299806 307172 327306 367359 414083
19022 414083 479195 567635 663904 754736 809503 816039 806251 756436 693521 623087 558560 512418
19010 512418 468641 429061 411010 390303 380257 371933 348395 353235 356490 349680 345819 362431
18998 362431 374380 392200 416669 461975 534039 583237 626159 672027 735692 792832 822656
18987 822656 816220 777952 721040 662815 592187 512616 445856 413235 410462 412413 412886 424158
18975 424158 432458 436409 440973 446619 449222 435878 422056 422837 427280 446101 458157 482868 501996
18962 501996 519174 540500 567419 611449 649015 678248 719067 763036 812980 861351 889031
18951 889031 917691 971471 1039741 1127345 1249455 1379255 1540715 1732449 1925709 2112228
18941 2112228 2275339 2458291 2633386 2815674 3031251 3349569 3854349 4584927 5594164
18932 5594164 6857468 8237493 9413094 10107241 10324729 10270784 10318840 10926276 12504334
18923 12504334 15513329 20566285 28149425 37969691 48709111 58017718 63310414 64345622
18915 64345622 61381686 55349747 47639431 39669618 32440205 26897284 23531275 22318723
18907 22318723 22666691 23562503 23828123 22776591 20448099 17289366 14034623 11202569
18899 11202569 9001688 7443910 6406988 5743168 5352636 5155484 5069625 5047753 5063170
18890 5063170 5092385 5124047 5162572 5224853 5358985 5628634 6140726 6993783 8347256 10369765
18880 10369765 13193003 16655952 20236901 23102584 24491339 24444273 23496052 22662654 23101313
18871 23101313 25713543 30997665 38791675 48487744 58722261 68009321 74829557 76905298
18863 76905298 72859286 64041783 52223232 40101847 29915233 22475673 17730159 15131351
18855 15131351 14039297 13823319 13900520 13681743 12818615 11395382 9629256 7883950 6398016
18846 6398016 5252079 4438079 3889796 3529048 3271881 3056749 2854317 2644829 2424956
18837 2424956 2190133 1983826 1779979 1578245 1400260 1258678 1160900 1073169 1000983 926667
18827 926667 852843 779173 734347 681416 637930 600034 568739 556326 544190 542554 536548 535589
18815 535589 531067 513067 494329 472032 462600 463138 448157 428515 421949 414166 424858 433852 429918
18802 429918 413146 404057 403535 418533 428400 452068 462089 456258 444359 436291 432581 412137 392060
18789 392060 372382 341603 312965 302669 295441 289068 279209 282015 295685 282136 290265 275252
18777 275252 267295 237101 234345 230123 216369 212900 220968 239243 261135 279721 290124 285056 258514
18764 258514 215118 167049 138955 124208 110441 120510 130167 134713 142825 146372 152752 154324 140778
18751 140778 133470 141728 139301 144670 131197 126964 136051 138411 136641 144131 148737 163249 176247
18738 176247 175741 186178 226739 260647 291816 321047 332175 336814 341165 329949 309732 308203
18726 308203 308142 280953 267722 279181 290792 289534 293672 297724 291334 286261 289842 267588 247242
18713 247242 224044 195952 163563 148363 141096 140567 145439 135171 120940 122658 107144 103665 105321
18700 105321 114164 111188 109520 93095 96941 102913 97807 102510 114589 117491 133762 142230 141281 135814
18686 135814 140463 147480 153502 152873 165943 176504 196847 218235 248345 266758 278690 278470 292094
18673 292094 301510 313725 306836 286353 281917 289810 286860 267586 267455 264135 239249 204216 178024
18660 178024 164817 147844 156079 159268 155892 146118 144164 135480 130857 121191 100442 100329 99255 96033
18646 96033 100753 110064 108824 102743 91071 89376 101256 102827 98896 93841 98832 109309 114649 124062
18632 124062 123110 128040 144576 145640 136567 139275 127030 111669 112632 122811 138107 149688 157693
18619 157693 163374 172313 173670 161710 155025 141936 138059 125002 110815 109409 100638 101735 93722
18606 93722 98323 102807 115042 123427 121753 113812 116853 120033 126967 133086 110881 111343 134694 138954
18592 138954 151265 164998 161670 160175 144184 147299 141961 137015 155811 167924 158512 150796 149326
18579 149326 156676 153436 168145 170399 149583 153218 156350 155754 152501 147746 144669 143337 155882 160572
18565 160572 148117 140614 132593 128314 129457 122042 124992 129265 138755 139666 146930 133742 118322 140430
18551 140430 162588 174547 169058 149924 147191 161808 166387 156107 154596 164143 180700 176982 178715
18538 178715 169092 150763 154028 167463 170874 180322 176934 171344 174316 179249 193930 206879 197935
18525 197935 194483 187524 186806 184402 175454 187538 194371 200478 200522 218688 251615 265797 269203 289904
18511 289904 325718 369602 411304 487225 603777 771316 992691 1280737 1566260 1706524
18501 1706524 1653576 1484262 1235479 991413 852042 810437 835199 941918 1123836 1390367
18491 1390367 1665221 1787609 1719384 1509234 1228883 966053 752300 594959 498155 425452
18481 425452 377025 322658 293429 279718 263248 260665 255197 242789 236430 231785 225668 220004 216326
18468 216326 213236 203347 192829 191601 181461 178116 175968 174407 199483 202544 181052 172783 163604
18455 163604 162425 159304 182862 184706 196118 197747 194219 209075 219504 244674 250847 236716 232356
18442 232356 226769 234171 238603 238456 237797 229485 226199 237083 246664 251488 274156 272286 267947 261982
18428 261982 252581 272312 289147 300591 314998 338424 338792 346202 354369 362024 364471 390963 409321
18415 409321 418614 422999 422883 425654 433387 442734 444797 447062 432993 395876 369686 358825 359684 352760
18401 352760 342958 348930 353510 356589 355926 353017 353108 359008 359481 356258 359178 371615 375673 383452 402004
18386 402004 423630 424388 414104 418194 420995 419486 418010 429863 450975 490737 518296 562141 631844
18373 631844 687040 738503 781845 783622 789005 797755 785594 787935 775103 739230 717146 707356
18361 707356 694143 686657 693243 712659 757730 796820 825231 825435 787070 738784 680921 631880
18349 631880 611216 595088 583820 586117 586678 577425 576793 583455 591373 608822 626243 661983 708614
18336 708614 734114 745187 759646 780761 803749 834208 870722 930026 996587 1069760 1177191
18325 1177191 1300563 1454735 1681223 2004926 2453964 3056727 3812120 4693138 5633094
18316 5633094 6521553 7277232 7864639 8309999 8606868 8605848 8140554 7179114 5962808 4767618
18306 4767618 3769956 3071083 2657181 2442382 2351399 2338607 2364401 2407134 2426287 2447189
18296 2447189 2446062 2417879 2409718 2406429 2433383 2492237 2597021 2727790 2889981 3106379 3359467
18285 3359467 3644176 3985301 4369963 4822110 5422538 6265664 7519302 9431339 12388914
18276 12388914 16885919 23209319 31135705 39838258 46917995 51113854 51487791 47225599
18268 47225599 40738593 33318011 26732631 22133682 19766291 19655468 21814664 26317616
18260 26317616 32904837 40934525 48603504 53559282 55362820 52275914 45907553 38224065
18252 38224065 30627439 24642561 20492846 17953422 16759764 16427606 16410709 16482236 16833476
18243 16833476 17679020 19333341 22227263 26711636 32303424 38060073 44470686 52058692
18235 52058692 59004614 62604922 63667658 63381146 60854993 56008019 50270858 44412518
18227 44412518 38783096 33952779 30187825 27426658 25647309 24452961 23068648 21348206
18219 21348206 19460881 17392512 15216676 13070232 11076859 9338092 7958850 6974603
18211 6974603 6288285 5832766 5547501 5362055 5250881 5207867 5251913 5362416 5573840 5961817
18201 5961817 6582684 7549973 8918289 10600054 12350801 14147501 16143210 18196263
18193 18196263 19827617 21006869 22227842 23843415 26003199 28615186 32038753 36838047
18185 36838047 42321383 46624212 49673267 52636950 54582360 53361916 49541429 44661886
18177 44661886 38934424 32845998 27170824 22288434 18142511 14961381 12879471 11648382
18169 11648382 10856147 10069432 9200495 8336458 7452598 6551952 5685450 4888893 4204717
18160 4204717 3650708 3210346 2870065 2621575 2405669 2211795 2054027 1904145 1759872
18151 1759872 1638020 1523380 1414425 1322533 1243571 1167453 1101543 1047527 1006976 959261 914510
18140 914510 879286 839646 807097 799010 796050 785965 784840 780467 780180 788318 777236 790767 816066
18127 816066 846023 864725 879376 903762 948863 1007088 1058665 1142550 1244809 1381825 1583939
18116 1583939 1893061 2389754 3170808 4386330 6359384 9628626 15093776 22246504 25547690
18107 25547690 23625149 19904908 14215935 9133655 5983965 4167508 3094036 2419712
18099 2419712 1972946 1667131 1435777 1250628 1101665 993902 889010 801529 743167 686579
18089 686579 633315 585593 555868 519233 484000 454229 428319 385539 354907 345608 329915 314337
18077 314337 305071 290999 291163 282898 287074 283594 273746 257643 239369 225376 218814 222079 221601 219641
18063 219641 231154 239381 254366 254986 242149 246349 248935 244746 217367 207295 226259 230542 225109
18050 225109 224138 218276 207080 197153 184634 186642 179947 181641 178716 162856 151917 139921 125701
18037 125701 113288 107690 111454 115139 123498 118402 100516 81267 60751 60556 61945 65964 62656
18024 62656 80679 99550 106615 109576 101925 95099 90453 108587 106356 94123 99910 93026 101668
18011 101668 108426 108708 114928 118152 122698 120869 123913 126271 129111 127675 121528 114795 115447 119613 122206
17996 122206 128631 128303 124203 109538 98024 96046 98681 94377 89600 97764 121469 139180 138807 146942
17982 146942 137874 123387 119786 112135 98196 94592 95499 92637 77050 77032 87130 97491 113693
17969 113693 123172 122857 123089 108863 93731 92578 96714 112869 115605 115882 105869 102342 96425 80189
17955 80189 77917 78989 75569 79242 79021 70804 72427 68281 61940 58513 54132 65785 62225 65306
17941 65306 76518 92066 92903 77832 63249 64750 55862 51836 78012 88974 78715 70621 75913
17928 75913 71583 55881 43668 46560 44739 43809 52039 56223 57093 71601 73807 73314 74062 75503 71494
17913 71494 72459 80519 87848 79380 69437 68264 54327 55957 57880 44735 45451 57411 57675 49902
17899 49902 51726 56569 56180 59451 53012 52357 56096 54932 48041 39076 36454 40939 46994 49441 53652
17884 53652 43351 48504 46220 58310 67947 71146 56553 52398 52808 43743 39869 35812 36312 45130
17870 45130 36168 24349 34425 51858 37391 27318 23659 31543 45848 49490 52242 52067 53115
17857 53115 41212 41888 63350 62803 47269 33381 35253 47970 52568 41404 34182 33746 38738 41073
17843 41073 28756 35405 41518 45260 51275 52494 52899 69064 69414 74433 77323 77206 70681 67244 75969
17828 75969 82708 87550 86930 80169 76012 70590 60161 44018 40861 46106 47920 37053 33396 34894
17814 34894 40590 39604 39620 46003 41270 65968 73050 68359 65231 62281 44295 51831 50507 43765 12388
17799 12388 3701 15087 21133 19014 38749 53146 44978 45858 40528 34463 38290 37909 32670 32650 32303
17784 32303 34817 24864 25355 26907 26061 23154 24209 17208 19861 29809 41208 45611 30428 15950
17770 15950 19493 24453 26160 39132 53467 50386 36247 31128 46501 52502 46216 45916 50405 51962
17756 51962 61852 57809 60696 74539 87494 78526 74224 75600 90277 103187 119141 135148 142874
17743 142874 169255 185104 188481 192079 203291 213584 236165 250755 241220 248265 235233 241151
17731 241151 246577 244736 239020 223309 207625 185668 164410 133823 108356 115050 114316 103192 78295
17718 78295 76153 80719 94482 87575 69921 57995 57871 56122 61057 50349 39957 51359 60825
17705 60825 59070 47318 43059 47708 61297 78915 95386 98062 112914 146726 162051 167785 191136
17692 191136 226474 238970 245779 239460 242563 237911 236113 250041 282815 321408 361819 396921
17680 396921 403202 378674 354360 347949 340129 313948 288202 283359 278931 281797 289494 309238 323785
17667 323785 339093 365591 368461 350410 324058 318236 331801 362902 395533 418175 404576 394661
17655 394661 404358 403573 378086 340996 285573 233503 198003 170265 135495 106100 84400 68427
17643 68427 53182 44358 40391 34518 27428 22287 12917 19150 27503 40340 42935 31608 22561 20035
17629 20035 25695 16961 11424 -1371 -1378 3241 8651 23675 30309 22146 13839 13224 12049 14626 30668
17614 30668 35163 22815 21071 22408 13956 9907 8250 -863 1585 6546 20165 3199 -8159
17601 -8159 2734 656 -13808 -5141 3558 5346 4043 986 2694 15466 15251 3387 -3034 2776
17587 2776 11929 18932 11771 2275 -4683 -793 -8998 -3399 -3573 -1 -15394 -22945 -16736 -15028 -12730
17572 -12730 -26163 -33419 -25498 -26833 -22043 -19955 -10662 1874 -787 -14135 -22690 -22824 -20455 -9645
17558 -9645 -6445 -12409 -15794 -18775 -17559 -18146 -27100 -23019 -28316 -22521 -16687 -22945 -24439 -31199 -30672
17543 -30672 -21829 -13303 -7893 -5310 9314 6763 10756 17666 -7421 -16894 -18980 -20986 -7905 7345
17529 7345 3908 -6798 -2067 10833 8262 -815 -16808 -21494 -17404 -10668 -18873 -18182 2562 7198
17515 7198 -7289 -13473 -10690 -11933 -15327 -20155 -17619 -1812 17060 21221 36500 24356 5581
17502 5581 16323 14385 19723 31592 41395 25891 28224 58189 107213 166138 228701 272025 305955
17489 305955 310013 265141 201113 142791 102779 78083 70857 80817 96629 123629 152737 197773
17477 197773 253004 297461 296129 249573 196342 143166 109335 92108 66577 38250 16891 23878
17465 23878 32069 34184 17939 15072 16550 11594 5552 13680 15173 11485 9781 7137 7000 9919
17451 9919 786 8959 15310 19547 25741 29699 45040 72236 109650 144481 156615 151301 121368
17438 121368 64985 15468 -4656 -8148 -7047 -10668 -17773 -820 13451 11269 12852 23953 20887
17425 20887 4382 1549 -3879 -3366 5950 10720 4424 -4938 -2776 6640 3886 4842 6928 849 5725
17410 5725 15356 4207 -2424 -10431 -17576 -11037 1087 16244 5985 -1276 -7676 -22677 -5688
17397 -5688 5399 11293 12242 10908 8146 2647 2729 7607 2551 -6168 -22100 -32695 -36373 -31413 -29731
17382 -29731 -25641 -21350 -19411 -8275 -9509 -16935 -10999 -503 6236 1167 -18654 -24543 -23057 -26714
17368 -26714 -35313 -43492 -29550 -16370 -8946 -2471 -16511 -19350 -14756 -3991 -1857 -9777 -12217
17355 -12217 -7032 -13967 -6892 4818 -10975 -23827 -33256 -22144 -2828 7895 11020 9144 -6623
17342 -6623 -8591 -4444 3833 10572 -1871 -27877 -26824 -15036 -15055 -6920 563 11553 28753 32661
17328 32661 23546 9114 1714 9229 12596 16964 30602 26385 10704 7998 1986 -7177 -3867 2222
17314 2222 -130 -4427 -8225 90 3744 5131 2644 7651 11516 1847 -6979 -1634 -8696 -2219 259
17299 259 6121 12372 160 2276 5195 12794 12336 6563 3888 10581 13429 7351 10942 8701 -9906
17284 -9906 -33176 -21072 -6303 10718 13801 9014 4362 -18146 -9569 -14977 -13370 -4856 -4983 1939
17270 1939 6746 6518 8046 -7089 -11695 -7601 -2950 -4450 -4517 768 15945 11526 -3412 -9059 1762
17255 1762 17016 20127 5484 -4232 4584 13517 23192 21350 30904 32116 10459 7971 21542 10289
17241 10289 4481 16708 21736 19710 8228 5449 22683 32555 39381 27684 21446 9105 5717
17228 5717 1061 19431 24969 26070 11452 5241 -866 -4635 301 2430 -8385 -15899 -6537 -11185
17214 -11185 -16379 -242 -13068 -14477 -9479 1494 1255 6779 4951 3211 17090 26048 21698 14361
17200 14361 28693 36020 37373 41139 56304 58092 76492 73938 59713 64790 70129 60340 49382
17187 49382 38534 38396 49003 45894 38290 30224 37755 46474 43406 41240 39509 39529 38014 26796
17173 26796 24808 17638 10597 17710 17979 17542 15596 1928 -6439 -10583 -10297 -5161 13199 21830 36169
17158 36169 33132 28882 11611 8489 15392 16227 18445 21372 44522 44299 37743 36365 29256 30453
17144 30453 34744 38980 40157 44570 39977 35882 32397 22926 21523 37514 34857 27714 30800 33856
17130 33856 38404 46194 45844 41848 37206 33549 32236 21232 6519 6910 20390 34665 32714 37152
17116 37152 35613 28844 27770 29242 23348 47168 60569 66633 72597 67861 65314 65274 52664 56164
17102 56164 68661 67366 66875 67421 64785 78117 93660 107927 97024 87107 84355 79783 74172 59992
17088 59992 51990 56870 73537 70247 71349 76685 73536 69637 85622 101209 107009 110696 109101 102873
17074 102873 89065 80605 91040 112713 119391 118975 102089 123123 153183 150989 124617 109395
17062 109395 98214 80849 86856 101046 102420 108266 124488 128980 115565 117760 130323 147934
17050 147934 151448 140880 130344 133030 147148 154059 160528 156743 159658 159089 163991 166742 167737 181681
17036 181681 196659 231104 308996 376131 401864 399353 381675 357604 317689 271639 246320 227977
17024 227977 216212 218024 228397 261664 293338 336625 399418 423185 401185 354365 302178 253910
17012 253910 223874 186362 171609 172924 181538 174314 167084 163479 181308 193022 192912 189900 192046
16999 192046 190214 188191 198063 206304 217543 224543 219180 220122 233679 247129 240019 246545 272527
16986 272527 278919 293219 300436 310753 323961 331219 330001 340581 359776 392845 418806 434044
16974 434044 451615 481148 516775 543476 585217 645085 732960 827030 929220 1028123 1092524
16963 1092524 1132463 1153507 1200555 1296406 1381826 1485952 1619288 1782286 1985755 2257267
16953 2257267 2574895 2922099 3324299 3776872 4284904 4968282 6011296 7617755 10095760
16944 10095760 13903746 19832881 29076061 42526378 56812798 62797984 59226484 50385819
16936 50385819 38319346 27589608 20542975 16624162 14908927 14938108 16655994 20442440
16928 20442440 27141814 37879548 51804469 61470267 60658578 53293219 41713593 29450343
16920 29450343 20259325 14337228 10613491 8209777 6603127 5483713 4682475 4122457
16912 4122457 3724235 3453022 3231384 2982935 2691122 2388085 2105094 1862876 1635035
16903 1635035 1455607 1322381 1192891 1107200 1050456 1023795 1016669 1003188 955317 886904 802794
16892 802794 723648 661462 600149 552148 520348 484886 459057 428782 406850 392401 379229
16881 379229 364432 343363 317383 303752 293148 280316 264502 259963 256212 259061 261942 259778
16869 259778 237552 214235 214846 222040 210340 195015 187818 192524 184822 167458 161427 168664 171315
16856 171315 151739 136750 143290 151510 155516 157052 153034 140755 113960 114869 105158 110386 121949
16843 121949 130472 121769 124762 131175 131100 122020 121292 111190 94062 85267 74187 80013 89144 81822
16829 81822 79489 89728 110706 110814 95202 82827 76838 79633 64456 64307 63171 53986 60405 74763
16815 74763 62052 61163 66415 57419 40268 44054 48906 42489 44605 53557 50967 69499 80787 55297
16801 55297 46021 46895 34911 16624 9922 10171 15753 20945 19512 21625 17173 782 -15182 -25537
16787 -25537 -19113 -25249 -31137 -49397 -55869 -48064 -39934 -26472 -22239 -16468 -10696 -14567 -26800 -51393
16773 -51393 -66435 -67193 -53578 -45862 -32811 -18451 -167 18681 16105 21224 17149 16477 1475
16760 1475 -3260 5735 16604 19411 21585 21268 19948 26436 30029 36328 35273 38899 35665 37561 43968
16745 43968 34240 29885 30899 28936 24644 20775 11597 -5725 -19932 -12858 1280 6200 9915 16366
16731 16366 16455 13530 12163 10312 5046 1240 1571 -959 -11490 -8507 -14472 -11386 -2019 5806 4130
16716 4130 1813 19951 18127 8072 475 10324 22147 22150 20829 16732 3491 12286 19033 1840
16702 1840 5808 4392 -5694 -9415 -6849 3063 -4647 -13129 -22528 -5936 13372 16981 9003 15346
16688 15346 10785 7955 14569 5867 -1463 1858 7495 7418 8933 -1934 -2192 3271 -92 1190 10475
16673 10475 15694 16330 14887 21463 35239 36521 19044 22282 21085 12074 7872 -14462 -21042 -16292
16659 -16292 -122 6158 9120 11252 14860 18406 12375 2902 2513 2093 -458 -11018 -16661 -10134
16645 -10134 2811 6692 1400 -6185 -3909 -3952 -5499 451 8155 10604 2734 1734 -1866 -8699 -17013
16630 -17013 -27871 -27872 -40279 -30963 -11601 -569 14565 13685 12485 9797 -2022 -1324 -23723 -35221
16616 -35221 -39874 -29855 -20737 -21840 -30314 -25769 -8830 13105 18779 28131 37536 40520 35353 38000
16602 38000 47711 42870 38947 45811 44728 61478 67508 58117 59951 66024 70292 90156 110813 115959
16588 115959 123338 147172 182868 240888 337082 486738 710786 1051936 1443654 1696803 1681931
16577 1681931 1499278 1204810 912040 699932 589585 576170 648967 818092 1110064 1475392
16567 1475392 1702093 1662313 1453037 1135415 796024 560363 409274 318606 264102 210804
16557 210804 156929 129367 111168 90226 67708 60354 56661 58314 58382 40767 26771 27838 24887
16544 24887 21050 25081 32704 33252 37032 40637 46814 23991 22815 24131 21277 24376 17402 17261 13089
16529 13089 1706 -577 -8887 3118 5968 8386 9103 10140 4800 4280 2848 -1423 1869 19038
16515 19038 36156 28918 23187 26721 29164 24452 12801 10838 12872 23764 29567 27734 16663
16502 16663 12711 -3113 -20150 -12418 -10274 -20618 -20655 -1976 14718 12640 14438 -1927 -9769
16489 -9769 -13240 -13113 -2944 -28773 -27273 -17399 -3749 -4571 -19085 -13636 2478 14401 13706 8983
16475 8983 6823 -5615 -3344 1895 -344 -10096 -4920 -3545 2624 -1283 -7536 -8927 4264 11914
16461 11914 11953 20480 6722 3101 41 -8569 -414 254 -13485 -25026 -22008 7074 20294 32798
16447 32798 25779 5877 4084 6081 15496 11383 -5615 -18777 -28895 -31503 -30237 -12113 -5810
16434 -5810 -7573 -2008 -15521 -15244 -19157 -9930 1999 -3439 -9295 -15293 -23211 -17500 5303 7135
16420 7135 3826 -2296 -18926 -14028 -19414 -10105 -1116 2466 -8329 -12056 -16004 -4924 -2956 -7696
16406 -7696 -8190 5383 20138 22882 9060 -4802 -10626 -9667 -10906 -16457 -15955 -1292 15068 7966
16392 7966 3783 -381 8043 13513 29376 48663 83823 130187 173903 224616 285448 300333 271597
16379 271597 219861 164102 125090 102828 79220 71610 74048 94762 113835 153598 216273 291370
16367 291370 310397 281322 240486 199489 156146 118508 74486 51920 41475 39116 39420 34791
16355 34791 36899 33388 24100 12760 13149 7950 -1406 -662 -5811 -5382 -8028 -622 -11669 -24586
16341 -24586 -18684 -3852 -17567 -16268 -12106 -16261 -11844 -8680 -17065 -32139 -34149 -26648 -21797 -15369
16327 -15369 -9588 -5520 2724 -7790 -3132 -6103 -9711 -13227 -25080 -16184 -25490 -14523 -795
16314 -795 -7194 -21906 -15316 3968 7323 -731 -9150 -20726 -22798 -31277 -31510 -22223 -20117 -27134
16300 -27134 -13933 -4613 -589 -3216 -7496 -12547 -7595 -6380 -6895 -12973 -17426 -26136 -26329 -33040 -38056
16285 -38056 -38723 -40542 -38835 -33240 -32189 -24134 -14623 -8210 -8005 5760 -3770 3400 2812 -12079 -26329
16270 -26329 -30122 -33013 -41466 -29329 -25580 -28370 -28408 -13701 -3820 -3059 -14176 -23781 -27608 -9962
16256 -9962 1653 5093 2750 -6747 -6880 4694 11911 5529 -1471 -7842 -19954 -16154 -10897 -11756
16242 -11756 -6001 -201 -6598 -25309 -31631 -25802 -8751 -19134 -32239 -29474 -5385 -5046 -7227
16229 -7227 -6444 -9876 -1230 6497 3263 6402 8356 6966 -1819 2201 9718 4692 -21999 -21077 -10659
16214 -10659 6078 15007 11706 5632 -3276 -10596 -8485 -10998 -1628 2067 -1549 -9023 -11783 -8998
16200 -8998 -5715 730 -1346 -6300 -9776 -8247 -8081 -8209 -3825 -6455 -30194 -31404 -16099 -22992 -30919
16185 -30919 -25748 -23325 -17567 -15724 -24104 -12122 -12354 -22117 -16507 -17480 -24447 -28079 -26158 -24528 -25494
16170 -25494 -7627 -6714 -12086 -17606 -19956 -11218 -15010 -14268 -24679 -29623 -25029 -14919 -15720 -23048
16156 -23048 -18260 -11188 -4804 -8388 -3783 -11151 -20339 -27726 -28922 -23861 -19502 -5498 -15168 -31405
16142 -31405 -35642 -27888 -18333 -19898 2455 6021 13953 -4690 -6264 4143 -573 5566 -9976
16129 -9976 -16393 -9709 -20097 -21604 -63 11012 4034 9409 10567 26797 26107 29175 27903 17533
16115 17533 3748 -4744 -12838 -18384 -10006 -1349 -552 -5851 -4363 -7850 -23960 -35398 -42164 -34960
16101 -34960 -20011 -19501 -25165 -14433 -14423 -23516 -22330 -15836 -9476 1086 -12360 -27932 -41874 -25107
16087 -25107 -22584 -18794 -10689 -9425 -14913 -13211 -3199 -14539 -14111 -12762 -5675 -10789 -12496 -13065
16073 -13065 3516 9983 6798 -2315 -1031 5156 -4941 -16370 -10144 542 4140 -2035 -8070
16060 -8070 -18821 -13399 -10310 -16639 -16639 -11595 -2706 3538 2720 10744 15159 8902 -11138 -208 10029
16045 10029 17390 14959 11491 -8518 -22950 -18504 -12266 -8165 -4864 -1758 -1925 -929 -569 -14665
16031 -14665 -28897 -27483 -5898 3434 -1685 5289 7355 4141 14478 16848 11527 -6572 -3868
16018 -3868 -6319 -998 -8323 -12742 -15943 -9931 -3928 -20436 -10394 -1014 5912 6308 12169 13928
16004 13928 3745 1770 1298 -4902 -2185 -7808 -530 688 -2680 -3777 -4515 -3520 -618 -3535 -3625
15989 -3625 -158 -7968 2913 19564 32576 26280 25048 32625 15577 10711 3301 -8467 -2804
15976 -2804 3034 -4294 3973 16663 10146 3267 -6554 -18666 -12253 -6489 3973 2776 -10496 -23254
15962 -23254 -24994 -14200 -453 4306 -9644 -17405 -16797 -21680 -17695 -1410 6564 3420 8059 -2312
15948 -2312 -6320 1414 5690 8121 -6347 -8791 -10456 -11591 -6091 1384 -18209 -10325 -6104 -7575
15934 -7575 -561 -12028 -17264 -14433 -10982 -2673 -19713 -15353 -5498 -9127 -14870 -26574 -37324 -31946
15920 -31946 -25075 -28264 -17207 -8898 -11848 1217 -198 5290 12947 6627 -1301 8389 13523 2056
15906 2056 -7600 -21257 -15205 -6243 -14796 -11684 -1328 -3773 -9456 -3375 9763 16146 10725 5428
15892 5428 -1776 -5490 -6810 -1890 2024 2186 -1881 -10966 -14443 -13494 -17841 -7651 -2568 -7835 -8723
15877 -8723 -5445 3234 -9262 -6118 9231 12036 -6287 -16555 -30816 -29372 -19030 -5117 -735
15864 -735 -20424 -6988 4681 -6491 -9311 -17158 -34433 -28936 -25917 -11514 -2200 3476 -4828
15851 -4828 -5876 -14994 -19392 -11471 -7789 -6271 2107 17560 18529 279 -3150 -2592 -6413 -15933 -12141
15836 -12141 -13953 -23619 -34978 -44115 -45314 -25705 -13072 -11317 -11809 -2794 -512 -7854 -26079 -29705
15822 -29705 -26695 -11910 -7455 -14811 -10617 -6684 -2313 -374 2283 -4929 3400 9625 1412 -1608
15808 -1608 -606 5494 1625 3941 6572 -913 -7970 1386 7521 5678 10382 865 -14013 -12599
15794 -12599 -8387 -4584 -16262 -23259 -38350 -30522 -10268 -11845 -24616 -17394 -9341 -12209 -17923
15781 -17923 -17792 -7384 -11814 -26129 -11292 6134 8625 20623 16566 6271 6799 16939 26139
15768 26139 24006 7364 -5787 -18395 -22943 -10406 -1826 -7726 -13794 -9780 -11441 -3370 -3479 -4492
15754 -4492 9734 6670 -6270 343 9667 16363 11531 -1735 2320 1798 -5387 -9148 3782 -729
15740 -729 -8608 -14155 -11537 -13312 -14758 -4973 -1944 2887 1330 1297 -3183 401 1890 -534 -4932
15725 -4932 -8905 -3140 2680 -3425 -22643 -34791 -30477 -20017 -19697 -33799 -46003 -25151 -15021
15712 -15021 -14726 -17005 -13854 -13562 -9253 -18290 -23820 -13313 -4751 -7493 -10989 -25855 -14976 1823
15698 1823 3074 6044 8062 -4393 -1529 -862 -5043 -16186 -12847 -5798 -5668 -9690 -17128 -17511 -21160
15683 -21160 -13795 -5649 -19034 -18597 -9511 -10459 -24103 -23800 -11999 1130 -1964 2680 2261 -6918
15669 -6918 -10100 -4444 -611 -1270 -16893 -22051 -10462 -15059 -30728 -13697 9724 6847 -23184
15656 -23184 -28170 -23540 -21129 -21050 -8586 12261 15842 7143 599 -3914 968 11893 -3521 -23910
15642 -23910 -25127 -1917 6227 -9392 -24747 -16676 -12490 -1779 9912 9214 15480 10577 -8950
15629 -8950 -8178 3516 -468 -17963 -29756 -20380 -22897 -26456 -22703 -24641 -37243 -30059 -22976 -26483
15615 -26483 -32164 -32582 -15840 -7577 -5193 -2933 -5585 -4450 -5807 -3379 2445 -7366 -13499 -19190
15601 -19190 -8609 -5862 -10452 1062 -7481 -26008 -24933 -30809 -34873 -15884 -8706 -1869 -538
15588 -538 -6956 -3005 2216 4510 -997 -6873 144 -2127 -9410 -11645 -19077 -8986 889 5736 -14153
15573 -14153 -25409 -25235 -16116 -19685 -25515 -27300 -15927 -12599 -5976 -5664 -13668 -11003 -13778 -26239
15559 -26239 -25263 -36257 -40703 -28575 -24091 -28951 -32081 -34287 -28742 -30396 -24709 -24679 -33990 -38800 -18595
15544 -18595 1591 1856 4646 -7609 -23609 -32211 -48193 -38073 -11970 -12552 -3271 6294 2421
15531 2421 -9196 -13958 -19572 5983 9813 -4996 -8012 -15641 -26441 -20538 -16584 -22740 -31964 -30358
15517 -30358 -22697 -8640 -4608 -3790 -960 -1623 -4991 6022 20502 10754 -5478 6906 708 -18318
15503 -18318 -9642 3160 8233 5269 1256 -1742 -5634 -10306 -6471 5320 5991 -2802 -9035 2912
15489 2912 3849 2394 3547 14598 15069 9399 4947 3314 -15269 -17376 -18604 -19633 -15212 -5048
15475 -5048 -14730 -10304 -15862 -16579 -10939 -9566 -5496 -7049 -7697 -11659 -7762 -2946 -10041 -23458 -24293
15460 -24293 -34849 -38238 -29628 -27748 -22154 -21761 -23847 -29280 -18522 -8010 -11973 -7997 -1852 791
15446 791 -5892 -12912 -15979 -22997 -19049 -20919 -10539 -18995 -25360 -29942 -31162 -20583 -2939 9812
15432 9812 5529 -80 1097 12419 1774 -14530 -9687 -11763 -26596 -25559 -28843 -27134 -14364
15419 -14364 -8174 -4092 9123 1871 -9042 -21636 -21765 -18143 -6512 1109 -972 -1982 -16606
15406 -16606 -13041 -4623 -1470 -488 -15444 -15012 -15426 -19963 -20751 -12819 -4054 3752 -543 -8708 -13088
15391 -13088 -15582 -3883 5809 -9592 -10310 -16187 -23206 -10763 -9964 -33365 -32892 -17116 -3401 372
15377 372 137 5937 -6501 -28099 -26623 -21987 -8556 -6756 -19087 -26190 -23511 -17576 -6759 13550
15363 13550 11060 14672 11053 14926 17126 16780 4993 -10828 -8395 -7666 -9418 -12 826 -2965 -11138
15348 -11138 -11568 -17264 -22174 -15178 -10106 1520 3852 3800 -11082 -14828 -17528 -10778 -3512 -1904 -7631
15333 -7631 -6067 467 -417 180 -10387 -11852 -26185 -28526 -16305 -14702 -22814 -23930 -31782 -20319
15319 -20319 4981 -2408 -16943 -16787 -11990 -9832 -16169 -17422 -10639 -19499 -24915 -14150 -2490 -2237
15305 -2237 -9902 -23976 -19917 -12336 -10360 -2747 -405 -11295 -14272 -6357 -5099 -10305 -22145 -28648
15291 -28648 -34693 -38960 -38289 -34293 -22689 -19641 -18683 -29830 -29053 -13878 5159 9062 1231 2738
15277 2738 -8576 -19134 -18346 -20680 -30268 -20524 -11498 -2910 3811 633 -3625 -6185 -4075 -12076
15263 -12076 -9236 -2728 -10158 -20253 -24519 -16475 -12307 -10167 -2745 6786 3261 2762 2968 6742 -13729
15248 -13729 -22093 -9234 -928 -3929 -7994 -14927 -5822 10562 9730 -7867 -12713 -7764 -1821 4612
15234 4612 2792 7852 -3348 -21250 -44738 -33215 -21002 -14960 -15388 -23971 -28789 -22953 -18041 -14772
15220 -14772 -24602 -29971 -28733 -18178 -10322 -3147 2142 -7793 -15220 -12256 662 -1549 -24770 -32228
15206 -32228 -32367 -26675 -7516 1294 -20768 -24464 -23144 -9046 -988 -7798 -14990 -18750 -10626 -5827
15192 -5827 -12265 -20305 -10273 -2173 -6797 -7991 -9295 1218 3168 -5441 -14198 -9071 -14123 -21393
15178 -21393 -10925 -7594 -15676 -16101 -10250 -8578 -7766 10531 20487 20996 17266 22645 7360 -7446
15164 -7446 -13242 -14123 -9678 -9920 -721 -2035 -18135 -27698 -28876 -18874 -7725 -21559 -36476 -34213
15150 -34213 -26749 -4352 4060 -1138 -7519 -11939 -15690 -18663 -23360 -12363 -23904 -33060 -39748 -34136
15136 -34136 -30619 -52001 -48933 -28831 -26532 -33728 -42973 -38208 -32064 -32799 -44527 -23066 -1478
15123 -1478 -3285 -5104 -2638 3515 14186 -13755 -29885 -33751 -42776 -51348 -44595 -14685 -3480
15110 -3480 4937 -4349 -10392 -14086 -18049 -20937 -28435 -26353 -19230 -18680 -19918 -18392 -24898 -34070 -29708
15095 -29708 -23315 -7482 -19400 -30258 -34895 -17986 -1058 2697 575 -4937 -9969 -22601 -40353
15082 -40353 -41290 -36607 -42768 -35629 -27766 -30782 -20970 -13863 -7228 -28095 -51935 -49616 -32940 -15310
15068 -15310 -3803 -12585 -11360 -9186 -1003 2070 -4492 -11630 -14009 -18718 -19111 -8723 -8655 -12396 -11304
15053 -11304 -11662 -23799 -21492 -20283 -23870 -19628 -15927 -17635 -22233 -16590 -16432 -18370 -17448 -17615 -5229
15038 -5229 4915 -1594 -14438 -26616 -22571 -12569 -8917 -11444 -20365 -17888 -34366 -35174 -19949
15025 -19949 -13291 -18199 -12306 -1683 -6404 -18356 -16728 -9953 2563 11580 -3121 -26223 -24033
15012 -24033 -11459 7651 5952 -10676 -18224 -27079 -30912 -22840 -15571 -21718 -18020 -14480 -2441
14999 -2441 -14519 -25490 -22037 -7942 -12604 -13799 -20216 -25955 -22127 -24363 -21453 -17259 -5423 6829
14985 6829 -149 -3823 3798 6486 5752 6608 9136 2359 -13902 -3471 -1509 -7143 3145 7555
14971 7555 5566 3523 -333 -3361 -11545 -15739 -23383 -33048 -31020 -17135 -14525 -17058 -18920 -13286
14957 -13286 5977 3792 -704 5821 -1785 -14564 -22021 -21738 -18101 -25786 -15702 -22103 -20924 -9931
14943 -9931 -4630 -19317 -16203 -13132 -20758 -29277 -28302 -31718 -34937 -22905 -25388 -21055 -16674 -8140
14929 -8140 -10835 -14158 -9415 -14283 -16770 -32925 -21595 -12581 -19594 -26819 -30371 -14798 -20813 -30231
14915 -30231 -36347 -32408 -33166 -21947 -23207 -16371 -19890 -22935 -18466 -25758 -33508 -45071 -31931 -30565
14901 -30565 -28484 -14086 -11717 -21072 -35615 -36089 -22692 -11024 -867 -1489 -17066 -20690 -12748
14888 -12748 -10990 -11778 -23439 -25331 -10884 2377 -12792 -19273 -24759 -35404 -27299 -13205 -6718
14875 -6718 -12499 -14263 -7779 -17530 -13160 -18242 -31685 -37949 -30675 -30962 -26168 -24274 -13763 -14977
14861 -14977 -11622 1934 5278 -4837 -16374 -25034 -29323 -25965 -18388 -6374 -14150 -16406 -19135
14848 -19135 -24676 -13623 -8925 -11617 -16548 -21099 -23314 -15439 -16314 -11615 -3296 -4190 -9161 -4241 1883
14833 1883 -13071 -15925 -9452 -1932 -4545 -9566 -19107 -11837 -13863 -14290 2737 7123 -2861 -11728
14819 -11728 -14211 -26246 -22702 -13705 -6479 5478 7797 4643 -4475 -9003 -15736 -4989 6475
14806 6475 1083 -14236 -14115 -25827 -32462 -27709 -12837 -22912 -6340 -5237 -8819 1097 7810 6332
14792 6332 -11389 -24486 -29566 -22541 -22036 -16297 -7156 -7613 -14372 -15147 -14911 -8650 4631 -7194 -24759
14777 -24759 -18029 -14384 -10445 -12387 -3903 6315 11073 6871 1025 -7561 -20632 -24455 -33124 -24396
14763 -24396 -14507 -11640 -10818 -6661 -14620 -24255 -23169 -11298 -21770 -25907 -25387 -15909 -9660 -10769
14749 -10769 -28000 -26453 -20083 -17796 -4223 -4433 -2712 -2829 -7979 -13172 -14348 -20616 -26160 -15911
14735 -15911 -9359 -8999 -8333 4201 -4783 -7803 4700 18739 33034 26254 13505 11179 12376 5675
14721 5675 -272 -4626 -11708 -14551 -13486 -17139 -6191 -5854 -7385 -1905 2893 1802 -12143 -20298
14707 -20298 -29202 -12908 -14946 -19441 -12051 -5767 1407 -3758 -1582 3964 1494 -2700 -4948 -8183
14693 -8183 4618 14682 9101 -68 -2350 -3583 -5325 -5758 -25439 -36104 -36616 -19166 -10333 -2608
14679 -2608 -11899 -39 5117 7623 6005 9242 -2595 -13699 -7583 -4341 1767 3473 4055 4076 4231
14664 4231 -3661 1626 5272 -7993 -9604 -13642 -467 9036 -6284 -6815 -9265 -4013 -4440 -9714
14650 -9714 -10480 -12667 -25969 -36003 -39977 -28455 -24279 -14612 -25621 -27279 -26463 -30104 -31226 -32889
14636 -32889 -33083 -21495 -13664 -12137 -9933 -13158 -13048 -443 4784 -373 -10401 -8096 -5858 -11886
14622 -11886 -12741 -11306 -365 -4296 -7641 1160 -7415 -17506 -17831 -12664 -12348 -11505 -18630 -16979 -11272
14607 -11272 -8743 -9053 -14396 -13217 -10503 -12082 -18482 -14402 -3335 -2593 -1170 10839 -7292 -21121
14593 -21121 -7294 962 5692 7650 8049 1322 4089 -10253 -21258 -8312 -6598 -2436 3289 -1197
14579 -1197 -2292 -8985 -10869 3013 1167 5679 -2960 -18691 -25409 -12498 -3747 12320 15479 4837
14565 4837 5994 8918 2407 4919 8091 3786 8454 17852 5523 1486 5767 6706 -436 9782
14551 9782 10541 3958 1952 1460 13106 18730 4399 -12981 -12878 1258 14670 -1191 -20853 -26656
14537 -26656 -16142 -8988 -8892 -14324 791 -3776 -10740 -9133 -2293 -343 -9850 -13887 -8334 -11914
14523 -11914 -20904 -17139 -6484 -16943 -26609 -27499 -12607 3954 19278 37094 24315 12783 4836
14510 4836 6467 19740 21496 15693 16326 24709 25456 23780 24652 23928 26791 27605 35468 47231 24581
14495 24581 11398 12679 -8430 -6016 -16684 -22747 -10164 2825 23828 23462 3881 -9293 -13958
14482 -13958 -9910 -14945 -30735 -33298 -22214 -23656 -28562 -25172 -18299 -7810 -164 8780 184 -17965
14468 -17965 -29360 -22751 -23472 -12700 -11395 -14391 -8790 -4957 -8872 1933 12588 -1121 -6241
14455 -6241 -9808 -11584 -7777 2539 3241 -431 -13238 -8922 230 -4144 -16573 1579 -70 -857
14441 -857 -4748 -13822 -24664 -15355 -10604 -18988 -21533 -10509 -9898 -15683 -15653 -8870 -35 3025 -8744
14426 -8744 -22657 -32833 -23827 -12073 -11788 -11488 -19459 -20077 3340 10082 9124 -3634 -17637 -18945
14412 -18945 -17810 -13773 9725 6703 6364 1336 4221 1983 513 1292 -10957 -5315 -5503 -20017
14398 -20017 -21268 -26907 -26898 -13617 -2750 -9698 -5516 -10524 -14221 -11304 3287 1470 -8156 -7013
14384 -7013 -1492 -9695 -21407 -18374 -10183 -4182 -6368 -12026 -18130 -24198 -21885 -6110 -5264 -8640
14370 -8640 -18012 -25722 -29204 -31303 -18421 -3564 4374 14363 13026 -3214 -7120 -18946 -29945
14357 -29945 -25074 -10004 -13340 -9603 4262 10091 2067 1141 11645 18052 -8948 -24068 -24398 -9764
14343 -9764 -6860 2220 -14101 -11546 8887 6816 7855 24033 17022 15147 3176 7805 12362 6883
14329 6883 -17060 -32042 -26151 -15247 6966 8088 18623 35510 34162 27167 31926 27513 9790
14316 9790 5587 6965 1896 9390 18350 12069 20207 33117 40761 28249 16090 11212 16585 12648
14302 12648 13816 14630 16004 30022 30264 15415 16644 27083 34078 45705 54338 50138 38902 40704
14288 40704 57727 63112 81195 114189 157589 181317 205708 243517 268096 282993 301084 318777
14276 318777 340395 355818 364384 368833 377857 376855 364409 335135 317579 289832 264992 222018
14264 222018 187494 165421 125018 96083 85875 77381 65609 48954 35616 29305 36818 36011
14252 36011 34431 41715 45964 36377 33279 32356 36398 36412 25962 19949 15884 13908 18641 21492 3563
14237 3563 3523 25343 29767 6257 4485 7245 5405 14379 17768 12280 13476 19808 17269 17380 16155
14222 16155 7439 1004 5716 5158 -8305 -7946 3554 13679 7298 -4921 -14260 -6181 2428 8054
14208 8054 1070 1752 -5349 -15457 -16653 3929 12453 10064 810 -4230 67 -4905 -19802 -7466
14194 -7466 4193 1231 -8548 -4960 -4874 -6287 -6028 6183 11380 11861 7406 -9807 -15002 -20156 -15974
14179 -15974 -8152 4944 8509 -11614 -19614 -14408 -12567 -12658 -5975 4421 -5024 -7615 527 -1016
14165 -1016 -2818 -2877 -5150 -10757 -1673 6806 -3066 -20904 -34691 -39618 -31213 -12756 -13230 -24963
14151 -24963 -15063 -27351 -37075 -34130 -31711 -24799 -14548 5556 5385 -2410 -6979 -10773 -11597 -9449
14137 -9449 -17418 -18418 -18807 -23351 -34594 -37474 -37249 -26468 -31460 -23066 -2610 9767 22254 12256
14123 12256 5887 -2090 5796 10586 6957 12134 11018 -8313 -12490 -2594 -6034 -5706 -10714 -11752
14109 -11752 -4825 10353 12215 9069 5249 14534 7538 -12268 -16912 -15802 441 5089 -3093 -8400
14095 -8400 -8141 5277 16262 32311 44398 28734 21254 31981 27617 31767 32634 34624 41713 37189
14081 37189 14251 -1643 -13808 -13734 -2204 2102 -1633 -8690 -19799 -30020 -25086 -25925 -22527 -11930
14067 -11930 10850 16781 27091 15418 11951 20569 28160 38787 60519 67774 78907 87042 103512
14054 103512 101004 87230 65120 41163 21260 15943 12209 5762 7769 1677 1756 14765 30674
14041 30674 23220 14623 5247 -5295 -2506 16198 35536 52190 61239 60349 58309 59932 61909 94391
14027 94391 137054 173694 211295 259938 294326 306041 290756 288236 290126 267801 233631 197300
14015 197300 158234 131740 107953 85293 71316 54846 46225 41970 41956 48939 48222 34265 25105
14002 25105 31797 23868 16757 20962 31901 34535 27865 19002 21206 34626 64459 67350 73746 85744
13988 85744 107980 137781 179989 210774 227734 238903 246169 225314 202347 179876 152352 133118
13976 133118 115296 95788 66130 42761 42671 39467 33562 34232 25871 13531 11678 5048 -2825 15540
13962 15540 36485 33833 35447 30870 8117 7114 6719 8693 15106 20885 17641 10338 -375 -6459
13948 -6459 -7710 -3623 1871 11448 15677 6827 6132 14511 22211 17692 4262 839 -1348 795 -8324
13933 -8324 -7655 2941 712 7441 16009 11525 -2662 12213 9247 16700 22750 15992 12959 19220
13919 19220 18380 7973 5097 3889 5478 9911 10610 367 752 12848 21727 28230 19059 13032
13905 13032 -7225 -20537 -17444 -20470 -9234 -3801 -1837 4129 7423 1523 -8014 -16192 -9992 3654
13891 3654 9115 25418 16879 -1916 -10806 -11018 -10320 1717 9229 9966 21781 20130 11999 2152
13877 2152 6081 13243 18738 24111 12928 20948 27940 32055 42078 32297 23363 21374 26522 28913
13863 28913 24107 24228 24645 30289 35073 37991 31719 18880 9377 15875 27520 19241 1639 9991
13849 9991 13787 17974 3267 -2173 511 1743 6075 12588 19847 20975 18843 10683 19262 22984
13835 22984 31370 28745 34094 28001 25013 11939 2295 13481 23846 11415 1541 -2351 -5914
13822 -5914 -2456 5054 3588 -10236 -5988 -22 -3651 -6534 -5684 -16990 -13862 -14902 -20592 -4991
13808 -4991 7865 5631 8375 4339 5153 13245 16479 16924 12826 13102 17223 19896 21188 12672 5866
13793 5866 5075 11308 7195 10236 12551 12887 11786 10422 -515 13555 28446 12567 7952 8554
13779 8554 8414 -799 -10535 -25458 -14603 -2504 -3589 -2936 5225 20081 24833 28513 24084 22415
13765 22415 11284 6789 9861 12839 4052 26 7370 9042 2155 -2008 5263 -3960 -20488 -17933
13751 -17933 -11964 -8825 -5082 -22922 -26298 -20519 -15917 -2434 9676 12799 18989 7190 -2322
13738 -2322 1891 954 -3717 2527 -13001 -25213 -21602 -11176 -5486 -5923 5830 11325 17409 11543
13724 11543 3449 5491 -559 -11684 -14029 -9297 -3789 -7134 -6433 7550 19804 10385 10308 6291
13710 6291 8901 12782 18912 17769 13684 17366 10859 23546 27200 13478 20687 40909 43274 40659
13696 40659 41152 46561 59288 68917 73105 64617 64314 68724 86706 101183 100728 113681 130810 143518
13682 143518 152183 146876 144717 147379 164868 178240 170537 159934 139634 131608 134643 155578 163473
13669 163473 148645 147777 140924 124015 110282 98945 89273 75161 68208 72711 81086 79428 69688
13656 69688 57339 53841 42706 50510 48610 47000 36968 34442 41614 53932 63172 58457 51495
13643 51495 66793 75354 81375 82088 65848 50314 52874 63459 61991 59424 49152 49615 48235 47485
13629 47485 38523 6273 -5977 5470 10384 -6558 -20493 -27075 -23970 -8006 6289 22265
13617 22265 24472 27027 31766 22321 9458 19109 30478 25878 41658 58986 66208 69968 62971
13604 62971 41797 46345 46408 42645 48262 51087 48730 38982 30473 27576 17578 10734 13638 2372
13590 2372 -3162 -9020 -5756 -5286 5815 12502 8994 7697 16864 23992 17090 -4174 -3648 -16070
13576 -16070 -17688 630 20475 31398 28603 19974 2838 5615 1964 -329 665 -4429 6078
13563 6078 9748 12523 15487 18163 4864 1069 2596 18380 21440 15219 8243 -5746 -16300 -19963
13549 -19963 -11497 -3871 919 2864 10434 26400 24573 26969 15231 22427 17573 5741 5813 11623
13535 11623 5315 5632 -6885 -15044 7504 15576 11461 15056 7640 6107 3922 3717 6602 602
13521 602 -10607 -9207 2611 6071 16008 7553 8067 6980 11628 10936 1259 -5988 -15394 -16260 -5074
13506 -5074 -3534 28 9234 18751 12076 9616 20045 22024 4578 7126 8821 -2622 -6918 -3352
13492 -3352 -9983 -12762 -17886 -13001 -1445 6598 18412 18343 16678 11622 63 -1862 12668 24005
13478 24005 16535 6470 7372 4432 9719 -1990 -21760 -19839 -9960 -9369 -17786 -381 23727 7718
13464 7718 -2791 1810 -1838 -11952 -14607 -10488 -10923 -17839 -8508 7939 101 -7300 1416 9248
13450 9248 16777 16822 11822 9146 -5498 -20466 -18191 -16879 -2306 3646 -4204 -3711 -2973 1024 4705
13435 4705 2256 -10614 -10367 3199 6675 13324 24905 14257 3040 -9179 -18932 2155 29448
13422 29448 19221 -2992 2236 132 -1023 4074 -2504 -13558 -11388 -9461 -7366 2122 -2861 -4914
13408 -4914 -7168 -13096 -10294 6331 8705 1833 -6452 -1093 12158 21024 22889 17988 19913 809
13394 809 -6519 -7031 -8027 -13893 -5249 -4427 3359 2780 -1138 -17290 -16227 -6622 -5067 -4261 -6832 -5998
13378 -5998 -22072 -27438 -22398 -13328 -5943 -7920 3774 322 6644 4023 -8021 -8857 -7754 -9550
13364 -9550 -10989 -8124 -12867 -17159 -23086 -15066 -9316 -6692 -2262 7623 11423 21119 20064 8171
13350 8171 16588 15279 5434 17897 16481 12943 13320 3139 12027 8799 2870 6462 4635 -4526
13336 -4526 -7776 3901 -4408 -6650 13305 35616 27587 27729 25663 28845 24330 19051 23965 12146
13322 12146 1647 3222 14245 24865 30734 27666 23730 16672 -6481 261 9733 14715 -8928
13309 -8928 -18632 -16018 -32252 -46688 -47962 -55897 -54436 -25034 4062 30908 28497 26441 25932 38320
13295 38320 47255 60132 76192 95103 129278 182885 231326 304462 404790 573505 825003
13284 825003 1148080 1491445 1726733 1806353 1666685 1379878 1049723 759347 533769 377181
13274 377181 282234 234274 203546 170010 150905 130965 121158 106188 97884 91908 82496 63842
13262 63842 56747 57903 55966 56877 44499 36269 46739 48928 53654 53523 64819 64183 59213 62843
13248 62843 70700 64396 47472 45319 68624 55140 39690 36202 25537 26195 25263 22984 33343
13235 33343 38079 30881 28883 22308 10645 8497 20230 25616 36910 42134 37715 25119 8664
13222 8664 18588 28791 21643 13842 7897 16962 22780 10877 13573 14949 -1231 4482 5424 14107
13208 14107 25875 22140 8253 -1187 -514 12631 41697 54270 66145 85124 95598 93055 87016
13195 87016 72391 58742 57541 64325 69289 65466 70375 80965 89422 94158 99023 95403 86928 93206
13181 93206 102690 114774 123451 146996 185942 224859 254585 274453 304275 340619 376206 394712
13169 394712 423786 449048 463146 481236 489262 470908 437849 412017 400329 380454 345484 321745
13157 321745 304220 289982 278663 274026 267073 263787 272886 258196 235081 203699 177372 138871
13145 138871 118146 125348 127447 131211 122673 111914 99675 98798 92356 91799 89403 81420 72432 77398
13131 77398 78498 68880 68688 69246 73200 81529 78058 68887 68622 65044 68649 66508 69985 79386 82136
13116 82136 74888 75768 75984 67628 67763 78118 74899 65175 56035 60322 84277 95676 123164 130207
13102 130207 139413 164756 195824 250937 293396 315448 316480 281003 202990 168914 156067 140514
13090 140514 119367 116260 103706 108099 113108 99048 84492 92903 110272 129413 136206 154340
13078 154340 175587 189621 191392 179906 165749 144765 107193 87230 89216 79451 71110 58553
13066 58553 57641 76278 93480 111833 130350 124556 128359 139048 135233 134471 129603 130535 132092 130635
13052 130635 125333 127883 138835 140582 146436 158717 161333 149834 138448 123724 101104 72811
13040 72811 59276 57887 54944 70728 99401 142548 164478 171953 185228 169641 136220 103293
13028 103293 77196 72869 69348 58593 46314 33041 44989 65810 83446 111717 114023 108438
13016 108438 121394 143239 140375 144216 136347 141646 167628 176941 177863 178507 199703 220699 237713
13003 237713 259144 298727 334897 369201 413381 461832 500307 511665 495238 458302 398918
12992 398918 351564 311275 278452 264210 249093 238789 231054 226456 219022 216267 212523 216430 216614
12979 216614 206370 205014 223956 279947 345388 392407 426778 467178 521636 545513 554920 519291
12967 519291 442646 346186 287339 261586 232849 218807 191180 176706 178705 175743 156687 140466
12955 140466 127431 122111 131025 155707 177808 186045 189837 203767 202364 204494 208607 209815 226267
12942 226267 238703 252058 246878 249904 255961 258335 281021 287247 299508 311838 311087 293174 275333
12929 275333 262409 247889 232682 238968 254246 259779 263265 270780 287367 305964 345286 376166
12917 376166 405842 429864 456967 484239 499416 506241 526255 535011 540797 544247 572422 610324
12905 610324 635731 662558 690470 710563 725826 746363 763709 770606 809380 839082 881831 947898
12893 947898 1004923 1070619 1128992 1173884 1224533 1279914 1353802 1449952 1551081 1603979 1658107
12882 1658107 1721238 1804783 1884837 1957812 2029567 2107943 2187445 2307820 2462753 2669461 2894529
12871 2894529 3137446 3389430 3625810 3867992 4146865 4503760 4987029 5612684 6325699
12862 6325699 7043107 7699413 8249861 8806094 9501489 10497013 11962952 13998271 16755958
12853 16755958 20491393 25572850 32737251 43139817 58722543 82777238 120444139
12846 120444139 177388746 247196901 304210646 336553728 330831270 284887916 225603222
12839 225603222 165695339 116548519 83457193 62567906 48969247 39635324 32819167
12832 32819167 27640611 23629424 20530706 18194950 16435882 15085735 13990984 13054451
12824 13054451 12181836 11331431 10477469 9632238 8786265 7962162 7190042 6509936 5955368
12815 5955368 5519008 5164197 4874239 4604307 4353792 4122241 3920514 3742737 3605534
12806 3605534 3480113 3362304 3258661 3174668 3087646 3013182 2965800 2959712 2953925 2965014 2994693
12795 2994693 3023731 3064549 3108231 3148892 3179261 3203986 3262530 3312211 3360457 3417049 3489185
12784 3489185 3544219 3621273 3713088 3838880 3952214 4099155 4250525 4424169 4637486 4871868
12774 4871868 5114503 5397303 5728095 6086598 6517965 7025177 7604956 8267774 9058226
12765 9058226 9993234 11154773 12644759 14599035 17282193 20924163 24912759 27518923
12757 27518923 28737228 29392292 29911842 31216895 33727370 37322901 41852090 47166031
12749 47166031 53074189 59341691 65654494 71672235 77004193 81255536 84115252 85347752
12741 85347752 84835104 82649837 78994261 74153281 68468734 62303778 56041338 49971938
12733 49971938 44305333 39198706 34686158 30729146 27300055 24352195 21808904 19594741
12725 19594741 17672877 16012327 14570568 13299941 12188288 11197787 10305830 9497869
12717 9497869 8760603 8113218 7526963 7007193 6564221 6174229 5828893 5531241 5235588
12708 5235588 4968995 4716466 4467963 4250754 4039547 3840413 3651468 3473165 3316743
12699 3316743 3174494 3028572 2899068 2776032 2660985 2521722 2387689 2246571 2137963
12690 2137963 2060012 1982546 1944682 1930975 1910170 1885364 1844150 1797285 1750661 1707746 1655561
12679 1655561 1607898 1569107 1554554 1529923 1495838 1448705 1422502 1407881 1389715 1359689 1325185
12668 1325185 1307682 1303306 1300302 1301580 1298914 1292497 1301197 1297629 1292207 1309075 1334003 1354820 1375655
12655 1375655 1402165 1428278 1446063 1439834 1389628 1326323 1280883 1243008 1191935 1140727 1070824
12644 1070824 1005131 949596 905117 869350 834063 809156 805150 792316 783406 784757 788218 792502
12632 792502 776626 758342 750432 735030 719613 714757 713610 712261 699869 684888 672778 687925
12620 687925 709919 713745 727490 754613 779634 777510 742390 697305 660704 618853 608764 588700
12608 588700 553953 551810 566056 577316 574870 557393 548431 533965 522590 497603 474242 470565
12596 470565 449265 442096 432960 431550 420350 414229 431470 422413 414282 388946 364090 361862 368907
12583 368907 366437 373916 381003 386272 398824 408489 424039 425906 440870 482414 523399 590676 685619
12570 685619 741008 738691 706456 669037 668150 658506 652698 628059 609648 583211 559383 565918 583686
12557 583686 602262 623408 648127 654078 651854 641044 634329 636046 627213 613888 608912 622693 661060
12544 661060 676552 669793 658878 629558 593312 577696 564441 553613 547528 553232 574622 640505
12532 640505 711333 804535 953252 1123405 1245852 1252410 1179566 1050154 930802 829411
12522 829411 775398 737543 702936 668054 637078 622865 594499 590126 615833 616762 601003 559451
12510 559451 518568 487620 480804 460923 449859 452079 445913 443367 445130 434372 428029 416243 397149
12497 397149 381489 395626 413273 433444 457519 481660 502175 514158 509870 526266 580892 610775
12485 610775 591931 567350 511805 441380 390459 356296 344478 324972 314380 321382 312634 285056
12473 285056 259568 255795 248629 252172 237269 240831 245392 243842 251722 245589 244482 239471 246330 242583
12459 242583 248494 244292 216155 200545 209068 221435 223472 233679 231858 220695 219202 209163 196522
12446 196522 197373 190722 175704 175816 182973 193111 180608 183192 206927 215995 236260 255703 259679
12433 259679 263827 266419 281636 276704 266462 273321 276765 275828 273687 291385 310290 335526 345608
12420 345608 357441 395693 447178 521530 594723 707036 895384 1152483 1418812 1638830
12410 1638830 1732960 1667529 1506793 1329224 1195586 1120379 1121816 1195110 1346968 1598052
12400 1598052 1978137 2358958 2630935 2751051 2614076 2354544 2055279 1807542 1646306
12391 1646306 1575451 1562057 1558195 1539230 1517984 1503711 1479408 1451656 1456291 1495906 1566787 1664947
12379 1664947 1800483 2034795 2392907 2868057 3363924 3726962 3849138 3682880 3298990
12370 3298990 2840259 2400577 2035790 1765259 1568752 1461043 1395227 1368220 1380351 1408727
12360 1408727 1437476 1420511 1378492 1325432 1253273 1190585 1144096 1112297 1100384 1087553 1049411
12349 1049411 986806 919573 891893 876192 867469 883140 915936 971834 1059565 1189471 1383696
12338 1383696 1598592 1757718 1780319 1639498 1404657 1141180 904200 732445 621307 544284
12328 544284 493166 456975 445355 450504 449634 466601 489021 519139 546950 581746 608702 637538
12316 637538 652326 671055 706654 727543 721964 714607 666448 623719 580551 533251 497507 458896
12304 458896 424376 403464 388919 363097 332234 308530 303246 293656 285439 275353 249383 237067
12292 237067 229659 222959 225736 210909 213722 228283 209420 206111 192258 190486 195371 201158 206104
12279 206104 219764 221152 208753 185817 174639 175228 167536 153495 152036 149666 152483 154277 162231
12266 162231 159598 163965 169338 178310 170551 159261 160788 161718 149086 133248 128270 130306 117167
12253 117167 105017 111810 126727 138898 148962 163906 169903 163716 151062 143098 138731 148127 157536
12240 157536 152075 155944 145301 152068 158369 150314 137963 124393 116477 113090 111666 117827 112419
12227 112419 116014 116261 114595 114620 98034 100440 110817 110614 110458 120527 121039 123192 121548 110720 126030
12212 126030 133892 150274 158036 155442 152130 146259 140080 136726 141841 136848 123911 105068 100563
12199 100563 100031 96831 95729 102130 93710 86423 78072 79726 100642 93414 85606 74296 73849 79364
12185 79364 60513 66065 84263 84176 76950 88902 113568 131413 125576 132894 114082 101026 102331
12172 102331 106640 106126 97775 63966 49799 56053 50009 52482 61324 69525 62146 52092 48739 49141
12158 49141 47139 54610 53635 57158 52298 39157 32335 46673 50808 42129 46652 51662 51780 49327
12144 49327 42333 36087 34759 35888 42386 39100 37921 47078 54033 47568 42349 50204 48606 39619
12130 39619 29914 15873 16651 17960 12545 22201 37203 43006 37359 46123 48551 54571 51555 47712
12116 47712 42804 59470 65296 69577 61149 53442 53219 61562 52193 58347 54966 46941 45533 40192
12102 40192 25868 28403 34572 39229 38975 31112 23297 15268 5885 10791 33123 38137 41233 38012
12088 38012 49158 39082 37673 37362 30889 31921 29710 26637 27914 37494 41348 45196 36770 26626
12074 26626 30570 36437 47089 44501 51060 57159 68872 63234 47174 54583 57150 63325 59741 48194
12060 48194 49711 41530 39402 32765 34446 34266 40378 29112 23349 23248 28401 33221 26192 12628
12046 12628 16140 36993 46767 54853 58909 52172 55081 56376 52820 36786 42485 42879 36437 26394
12032 26394 26492 30206 30893 29486 29315 26194 32964 31290 24106 29769 26120 29296 42262 43150 30928
12017 30928 29761 30466 35681 32722 32839 35837 33707 22585 12427 16263 26958 32637 30670 31348
12003 31348 29580 26361 21838 19687 32608 37831 36549 39526 47463 44562 35109 23864 16970 22644
11989 22644 20097 15878 11336 8281 19404 35393 42966 53146 32846 40339 40336 32612 26143 25403
11975 25403 34370 29404 25457 28430 24822 22860 26832 39031 42068 39282 38490 34158 27680 20247
11961 20247 19502 29356 28950 31027 26986 1431 -4929 -7466 11665 22599 19261 8190 18514 35313
11947 35313 44659 32142 13668 10685 15550 15151 17850 10862 16057 20814 26906 32509 34629 41010
11933 41010 49174 40185 21404 20381 34431 36102 30010 20797 27197 45915 50478 41869 33088 41001
11919 41001 58027 60840 47735 44888 46990 29780 15999 2465 8107 16369 28709 38708 34076
11906 34076 30724 30752 30605 18539 12971 11959 21308 40358 41075 40770 41963 28809 27864 26751 17230
11891 17230 21721 22145 30334 39556 36787 37028 35094 23824 11740 25482 37330 23146 11555
11878 11555 11108 21797 20548 21814 25491 23449 26051 34806 23443 13556 3182 3225 12881 19104
11864 19104 21359 18190 17087 28238 26103 17654 32573 42068 34238 29253 12449 5394 17464
11851 17464 33590 34836 32877 18515 13287 14887 7899 5214 -500 4336 1988 7778 7546 10766
11837 10766 14995 18942 17949 18314 14474 7878 8170 15426 18653 9326 17823 34123 35481 18283 9375
11822 9375 11290 21213 25270 21970 13460 16472 13090 7668 4502 -8456 -2821 15791 27785 24824
11808 24824 32334 33437 13220 1864 7009 10080 -6243 649 15001 23416 16021 16097 27853 25236
11794 25236 26545 18552 18163 21372 16707 10565 11309 24120 44587 55134 64352 46655 27925 18911
11780 18911 11874 5763 -683 10226 18801 9146 6209 14460 6736 -1309 4879 13573 20167 17059
11766 17059 22129 23898 29542 33239 28016 23644 19037 20319 16805 17601 26474 25236 23204 22781 19472
11751 19472 20456 25244 10015 3527 7410 8560 14570 17862 16052 16956 15570 16552 27917 45540
11737 45540 56472 51656 45834 39614 35643 35253 31785 28064 6193 15351 31383 19537 17694 22890
11723 22890 25832 26434 38393 39228 29368 23715 23021 23270 23283 13397 11663 9951 16130 21026 12107 14107
11707 14107 12806 7109 14982 5859 3829 2127 -2115 3598 6048 17740 9070 -12263 -22018 -21618
11693 -21618 -12075 -3813 -4688 4 16028 14018 8392 17503 10681 5264 13401 32875 26361 22177
11679 22177 19938 18494 10522 9054 10626 13324 -2232 -4666 11486 26798 26679 13365 16276 24917
11665 24917 17547 7228 9847 22614 32660 31249 27379 30514 24405 17064 13916 12705 11993 16148
11651 16148 15633 6750 247 1630 -2505 7364 8426 6249 4541 -3495 -3546 9808 18926 16731 7765
11636 7765 -9913 -2675 8689 20267 25577 24806 23094 26040 31225 18681 7658 17982 29018
11623 29018 36420 33470 26001 13898 9758 17769 36003 35058 20493 8135 5821 -1998 13854
11610 13854 22203 23436 15729 8401 2236 -3828 1365 5490 5274 257 583 11206 18112 24863 24247
11595 24247 24247 26293 33538 34917 31552 28356 29229 35696 20444 7982 9242 -2348 -7385 -5012 3805
11580 3805 6114 1557 696 9313 7105 18357 13571 13164 5545 -27 6947 15744 9513 3052 -10391
11565 -10391 -2105 1299 13040 16538 9689 -1190 -2978 4872 8867 7623 16598 24862 20784 16074
11551 16074 15077 6893 -16044 -13142 -8923 -7332 9677 13532 11336 20229 15664 5649 4267 2862
11537 2862 11965 20616 13576 13461 8529 7499 4725 7210 8056 -5313 -1979 156 -12073 -11727 -8666
11522 -8666 -10756 1741 9823 15093 12570 11569 10965 8015 -7913 -6032 14499 18874 17371 8733
11508 8733 -20807 -11569 12911 19642 24340 17918 22430 28980 34071 24852 19250 25517 32183 35332
11494 35332 25479 7554 1041 11489 17845 15698 6434 3152 3957 -522 5780 13668 6671 5739
11480 5739 8231 27637 31164 16821 1008 381 3356 2418 19276 15436 3397 1034 10851 13909
11466 13909 15932 15837 16129 11890 -2284 528 8261 6921 8416 20720 28061 42120 39991 30159
11452 30159 36231 31828 22743 17538 14191 2123 17895 18648 15117 17567 14827 11955 11134 7338
11438 7338 706 7351 10222 24090 24281 15614 21591 22607 27820 23981 28589 13969 -3374 -20261
11424 -20261 -12394 734 6598 1760 10463 13629 10060 11559 5665 -8437 -2908 8490 14963 24937
11410 24937 18821 21675 17864 23007 20529 6604 17485 24989 8848 -2084 2585 9290 16548
11397 16548 25540 28826 24501 23715 25417 15710 74 -5328 -11783 -12291 -10051 7021 25481 24856
11383 24856 12309 20649 21327 13863 12884 14362 26804 15093 4954 18563 13946 15753 6079 2239
11369 2239 8911 16322 5441 -2839 -3278 4908 1 -4288 788 8444 14374 23723 14651 -966
11355 -966 12959 28372 25024 12057 3410 -4052 5060 20605 31429 30790 32811 17990 17555 24652
11341 24652 11687 5367 -2194 -13316 -2709 250 -10395 -5682 707 -3958 -4344 9286 31974
11328 31974 17815 -2573 -13992 -15674 -16243 -7855 7073 14997 7835 13567 12826 21825 27740 24482
11314 24482 17029 19761 31880 32065 20884 17101 23211 21775 20246 2229 -4701 1878 -1978 -901
11300 -901 55 9567 17188 17012 24078 24871 10844 10692 23233 28864 20894 29132 36032 29989 20729
11285 20729 12942 17514 11075 3527 16636 20807 27093 31195 20641 1358 2331 11349 5147 11591
11271 11591 25034 24791 22072 24523 18581 12261 12112 2792 -4963 -2661 10503 17980 26214 25017
11257 25017 28483 44646 43846 22231 5417 11370 6801 9006 13144 15226 17938 13618 12058 12542
11243 12542 12342 16809 13664 21181 44238 43253 30242 25054 18819 2182 -14724 -9674 -7691 -5296
11229 -5296 -4488 2598 3396 10322 23672 30325 37450 30612 20780 13597 13255 32111 40542 33143 33459
11214 33459 46233 37663 31373 28839 17927 25675 24932 6856 4518 -3636 1288 8704 22165 22913
11200 22913 7621 7011 18965 32856 28812 32084 36699 33536 30223 36473 29707 24375 23627 22208
11186 22208 1142 -9267 -6847 -12045 -4893 -7674 -11912 2539 16714 21519 15339 12519 21221
11173 21221 23760 24306 36706 25775 27624 23865 17775 17340 19261 19004 11787 3176 -5411 -4516 4443
11158 4443 5007 6615 -8546 -3242 16808 11439 -4109 2546 12814 10394 -360 -4607 5391 10598
11144 10598 25660 26196 25612 12608 23392 28043 23958 32563 21499 7133 -4052 -8916 -7314
11131 -7314 9220 28591 27929 15905 12769 -4299 3939 7444 -5316 -10022 -2781 -2232 -10655 4613
11117 4613 16576 17214 21990 19239 29060 30863 13481 8347 8732 20463 25943 29070 14482 -6261
11103 -6261 -2543 16192 34137 49153 53759 47023 55140 70946 66336 59418 61404 42315 34473
11090 34473 32363 26028 16103 13000 9168 11205 25162 14024 14711 25301 42415 54607 55896
11077 55896 52452 40412 31812 26108 28840 32801 42294 42628 30630 17425 16984 10042 24907 39563
11063 39563 31249 32422 31690 33115 23848 16470 2378 1447 14605 29823 43099 41526 41140 26286
11049 26286 25341 32343 27353 18400 17527 15427 20074 16298 16558 14690 14332 5749 -397 -1125 11396
11034 11396 22772 33439 26522 13798 5091 4733 4325 3761 8958 1675 13369 29578 29818 11616
11020 11616 -888 -473 10004 12700 7708 12594 22084 9602 -3393 223 2618 -1338 -11835
11007 -11835 -15463 2326 9712 5961 17632 33069 32436 30888 26984 21764 9166 -5840 -8093
10994 -8093 -4272 9805 19792 18874 19250 32391 37223 37999 32555 30540 24085 22374 32084 42365 37559
10979 37559 32148 24635 19506 21939 24809 24917 10399 9704 8921 432 362 6753 7831 9533 -522
10964 -522 -6082 -1616 -5531 -295 4837 895 4692 4369 -6969 -9425 2678 12006 10753 3904 9661
10949 9661 19100 13056 20762 23429 9911 -1112 10751 14057 16546 17935 8364 -2395 16215
10936 16215 25110 9041 -1298 1183 16466 7426 2032 -12039 -742 1142 986 -2052 -14131
10923 -14131 -15231 -16084 -5102 8536 19583 18650 22318 8219 -4108 4108 5065 6320 19859 32230
10909 32230 44359 49888 40130 24396 9629 10847 25157 26762 17521 25625 33858 44075 42474
10896 42474 32004 35314 29431 31654 41247 50054 50802 40605 43986 49135 56127 51723 41938 50829
10882 50829 53172 57543 54371 50829 38109 42059 43425 36522 27239 10362 14362 27510 41912
10869 41912 46572 36330 31334 30641 36220 49059 63297 61839 46478 43036 31876 31332 38982 60168
10855 60168 58848 48611 42417 32363 32786 30106 22282 18475 24160 24291 34682 46552 53922 46533
10841 46533 37805 28343 25356 24259 24938 30168 34306 24896 21752 26308 30702 27760 22429 23052 23048 14519
10825 14519 17789 33118 41508 39674 38299 37212 27261 25303 22235 10699 5588 10350 12509 23296
10811 23296 27944 24644 22649 18972 14954 18022 7514 9181 19422 13667 9618 14662 22871 21791
10797 21791 6967 -1439 14330 26852 26278 25643 16843 1637 2895 -10915 -22274 -5051 -6132
10784 -6132 -7886 518 18223 29107 21683 15946 21218 22361 20740 22570 6717 4135 16022 22811
10770 22811 21125 21104 34184 31660 7896 7564 10490 -1459 -7858 1069 11051 5879 3166 -3612
10756 -3612 -4025 6375 -2088 -9024 7994 15891 22070 20085 17268 10162 14904 23326 26568 10231
10742 10231 -156 2574 6697 6457 -1814 -453 10173 14207 19929 24357 17644 16724 14830 16614
10728 16614 12062 9299 1340 -491 1034 -3789 2528 15598 22071 21287 26107 19061 7336 9128
10714 9128 11912 15045 23113 22046 902 -13167 -9376 -1007 7304 -7143 -16372 -15853 -282 804
10700 804 -2297 -5924 -13381 6439 14878 17429 18543 10402 2275 -19431 -20416 -10794 -12080 -6105 -2351
10685 -2351 -5811 -11813 1564 11273 -6014 -9979 -6580 -2050 -2477 -13123 -5582 2478 17555 41672
10671 41672 46662 27755 6370 13715 13454 1784 -6928 -9868 -17248 -19893 -12905 -3704 4609 16937
10657 16937 7157 2878 -3949 1251 7089 -344 -6930 7970 23322 22502 9880 7919 1422 2442
10643 2442 7871 17807 32578 45208 46501 42622 29177 21296 21904 14977 10439 6697 13791 28866
10629 28866 36029 34846 29621 9677 994 20378 26668 11956 12569 16879 14629 3733 952 5689
10615 5689 13571 6588 6301 16208 13324 24613 29912 21765 17872 14455 25407 23563 24006 19390 21314
10600 21314 23099 6344 -4139 3470 14030 19482 15089 19631 19324 20543 33971 35637 22181
10587 22181 20461 19649 30650 28318 15520 16955 6687 3436 14692 18104 11209 18163 25174 26666
10573 26666 29396 41108 42331 36271 25845 7690 12724 30812 21500 6035 11040 6615 5135
10560 5135 26310 40025 44688 37769 25149 27198 19937 10979 24276 29560 25876 13476 6355
10547 6355 6534 27370 28445 11688 17311 20614 34320 43437 52725 59587 60331 53370 44927 43111
10533 43111 50288 37721 33016 37155 28786 15394 13673 19278 23872 19331 20086 28354 44471 54539
10519 54539 57795 57473 56979 50689 46222 50011 47315 54244 76960 74107 74154 83796 82029 77748 84366
10504 84366 103274 117880 122590 135237 163717 201726 237189 265380 283007 284368 283921 274585 251987
10491 251987 209429 180760 146679 112478 83049 62757 52767 45396 41893 43649 41565 35412 34623
10478 34623 37097 34110 35094 30106 22410 32057 41455 31067 21966 28586 25773 17146 11682 22920
10464 22920 35946 39084 49549 52366 39408 35568 37153 48158 39619 24594 10361 8942 12673
10451 12673 18182 20935 29272 38782 47931 40226 38146 38025 41784 42263 31958 40075 42484 45785 46254
10436 46254 49492 41109 41052 46352 55700 52160 55327 45342 32871 37971 35814 35104 48857 56042 41304
10421 41304 22470 11132 30857 26840 27136 32931 32890 19473 8949 16360 12054 -629 -5007 3297
10407 3297 9456 7294 17539 25694 41216 25157 11085 15493 15380 10352 14586 12019 11379 6235
10393 6235 -2229 -1318 13054 15761 30175 29677 22132 20619 11101 17439 14471 9551 16598 17432 17635
10378 17635 23794 28147 31013 31960 38940 37272 38906 47512 47493 35405 22425 27881 21588 10660
10364 10660 -3206 -6032 324 14898 13115 13535 5634 16970 29874 39565 51468 40759 32241
10351 32241 34770 38854 53155 47172 40377 41240 36197 34761 40078 47893 58126 53296 52190 57981
10337 57981 60413 51437 59434 61011 46219 28923 25177 31658 29440 22275 24290 34125 42123 37769
10323 37769 43494 46110 40727 44660 55043 46123 34186 37587 39664 49808 42952 34565 41666 39545
10309 39545 31118 35580 44087 41894 31416 29549 38818 30641 36239 37000 37085 47465 50808 66537
10295 66537 81836 94000 97458 91871 94052 83830 74824 67190 70301 77088 62342 53737 54466 56468
10281 56468 53052 48906 34156 43525 49968 53908 59732 62962 62343 67500 72008 63327 55201 62182
10267 62182 61879 75975 84197 82064 84030 86095 82530 84581 93938 97257 101717 99784 99255 96522 103269
10252 103269 103429 107890 96714 95370 115016 110376 88020 98931 90814 75352 77003 86929 74502
10239 74502 75123 68841 69459 73458 87089 90948 68501 56245 57681 63792 62973 70575 68177 56479
10225 56479 73716 78827 92108 81785 68232 59276 58916 70018 78710 75331 71249 65343 69464
10212 69464 75419 83542 108980 130470 161395 210081 281799 365138 441954 499195 564121 637653
10200 637653 687360 672679 629869 587545 508583 421194 348692 276109 224333 183666 143085
10189 143085 129873 126256 120167 103897 97545 85384 91764 110634 125532 119943 113328 115472 112943
10176 112943 114944 126413 133472 156029 191947 237870 295770 368664 494875 675327 929233
10165 929233 1193065 1331979 1285434 1101064 846588 603628 424625 321969 264328 216511
10155 216511 184107 159089 123954 108370 100258 96145 87514 87602 92334 99003 94175 91738 86404 76997
10141 76997 65757 66511 73806 74009 71905 64897 61577 65414 71850 77865 79242 86636 81514 61831
10127 61831 55173 55890 55175 47493 40823 50743 58151 49105 33467 35188 37042 39903 46380 52791 57604
10112 57604 48433 36010 39792 54684 68477 60258 60150 52146 36409 30258 38272 44802 28225
10099 28225 18974 25454 39799 52901 51521 37410 43531 59090 56615 40640 39903 53277 47794
10086 47794 56839 63846 54641 51595 35774 42325 35520 24037 39073 48509 61220 69270 71572
10073 71572 69757 59763 51488 43599 42620 47851 46001 48599 35307 43197 53801 66868 76621 67631
10059 67631 59112 66829 81567 81582 75530 67678 75997 78590 73529 67589 64158 50541 39159 54830
10045 54830 65608 69750 75461 55247 48282 44101 42718 51626 55043 47815 62269 79615 74468
10032 74468 89720 120926 161985 206676 221543 220150 178187 119750 93646 84412 71900 57041
10020 57041 57570 49621 41936 39800 28700 18618 20537 32778 44703 50492 65346 61431 52060
10007 52060 37189 24693 22886 38441 58716 69459 53058 41732 40044 30827 27175 44242
9995 44242 41977 38669 31793 43579 53754 51888 52354 40095 27731 22474 31733 25000 38826 56424
9981 56424 57304 57391 58963 53737 47940 57685 69058 75835 81405 84047 80266 66991 49947 41726 39698
9966 39698 31858 47945 55064 50071 50092 51152 60307 69688 73638 72723 65803 60140 50410 52075 48597
9951 48597 56413 69119 83375 89247 82270 83869 84637 82652 70934 78735 84912 92159 100683 105805
9937 105805 120310 139246 160432 180521 215201 248315 265064 275543 273808 280885 304551 335434
9925 335434 384364 429979 437273 423314 390176 356646 315033 285501 280715 280593 268843 250986
9913 250986 225926 204433 167614 135538 113946 93090 93774 82614 74578 82782 81108 63828 74427
9900 74427 73226 84683 103090 99257 86720 68433 49683 67242 71838 83228 88406 84912 76253
9887 76253 86228 87749 88926 88084 84297 68254 59963 67931 92280 98351 95073 94122 91060 79894
9873 79894 85161 92192 85819 91923 97826 98027 86966 82901 84663 88332 83459 81314 84688 102843
9859 102843 114817 126276 125359 120210 121133 117357 124553 131574 149518 169603 186045 194288 180462
9846 180462 155842 155732 155796 157014 190029 233090 307727 402853 503832 575261 600023 584494 528015
9833 528015 450730 361849 284822 234695 186209 173915 155977 140258 137641 115729 119308 132809
9821 132809 126245 108010 109760 118052 118204 106223 110428 112301 91498 77624 76959 87748 93068 96337
9807 96337 100205 125318 143556 133163 134923 150607 173743 205684 244853 284437 304264 320278
9795 320278 311778 284900 246740 205390 158588 134263 114408 99342 96867 91191 79531 91205
9783 91205 93593 105648 101820 90047 87400 83486 86159 84792 92803 98420 95565 90226 71794 72147
9769 72147 67546 60137 71810 90342 88020 94760 82188 89040 95733 89139 82478 81968 83643 90711
9755 90711 92754 80260 76708 74189 78858 84025 74122 79027 90131 75491 71191 76539 62130 68966
9741 68966 83001 98588 105522 96756 86799 82383 90275 107099 118004 113402 111461 100837 94376
9728 94376 102581 100813 78010 71421 68848 70175 77337 71582 67285 79369 108229 112102 120065 108652
9714 108652 102306 109127 109655 106458 105652 112965 105472 99473 104681 117536 122771 111590 99491 101020
9700 101020 110623 119300 104274 112285 119095 112636 111583 104204 97564 94799 97439 106703 103396 108317
9686 108317 117115 125589 138574 133802 130961 149505 169263 173914 169709 179553 200849 242493 299429
9673 299429 366222 432562 477370 510935 549189 581381 578822 564750 527326 485372 439652 386230
9661 386230 346382 287215 246591 227805 221780 196063 166195 157241 158263 154475 149939 146111 153629
9648 153629 156567 165240 164003 153979 132692 126248 140906 148516 164404 157393 147427 140613 137202
9635 137202 136035 133748 143752 142797 128767 127926 132125 129890 122876 119473 121562 135589 144132 152566
9621 152566 151064 152287 150031 141351 152776 166449 171448 177949 177575 178976 188672 203754 204068 191833
9607 191833 177174 168003 163301 155361 136529 147106 161795 163792 155615 148886 144531 148179 153198
9594 153198 145098 158901 175372 173943 162093 163714 166712 176068 183971 192530 202148 229283 235186
9581 235186 236370 245943 242299 236143 240539 258273 268608 285193 298411 329639 383447 470184 544603
9568 544603 570727 568409 526471 477370 448771 423237 379620 329102 304051 295588 285005 291067
9556 291067 313383 339681 378173 433850 497150 549548 575545 595683 622966 618993 595502 571762
9544 571762 553131 536993 518341 500809 488366 489524 487347 471526 460837 448507 450086 486287
9532 486287 544224 633176 747121 909621 1132557 1322444 1365151 1296782 1155488 967559
9522 967559 802191 684271 599059 541737 483976 459997 466883 486861 499795 503341 525390 548148
9510 548148 555620 570895 597529 612024 633896 647277 658233 658513 627090 590338 557870 492330
9498 492330 441010 399244 371166 355917 341851 356852 382125 412024 439068 459289 486768 526972
9486 526972 582036 637812 642759 594156 518597 457160 412442 382859 364510 355769 356554 360951 360890
9473 360890 353241 353155 351806 359344 360932 358139 361836 363900 354025 338917 330874 319622 308225 303971
9459 303971 293948 293833 292681 300455 286119 275618 282219 286712 299970 318839 318439 324932 327781 320243
9445 320243 315708 319373 327624 323140 339018 334010 337268 349669 356814 352638 357037 358443 352503 366891
9431 366891 374003 379334 372712 377034 374044 366790 367049 360306 358857 358170 349471 350375 359137 375512 359978
9416 359978 352582 362033 375239 363159 364129 383664 390119 378179 374504 372286 370035 373150 383661
9403 383661 393948 400877 396439 399290 417421 413309 415735 421944 434546 446107 455806 447258 441387
9390 441387 444581 451045 441928 447096 461199 447458 443205 457090 445448 433757 430493 444076 437715
9377 437715 421679 432500 440042 444452 465089 479734 484082 495887 498446 499716 495470 504355 495878
9364 495878 499513 507537 509974 506369 506476 524989 533834 537800 545557 544142 535229 535300 525919 525904 543781
9349 543781 548443 541011 540324 557924 560104 553405 549563 564672 576230 585180 577362 565454 578413
9336 578413 601163 606323 614351 643266 646772 643152 634508 642541 661531 671913 673530 685725 709303
9323 709303 711149 710471 716088 731769 743577 768475 771329 748060 743794 741311 749666 766907 777785
9310 777785 786127 795989 802864 818241 826150 820541 822678 826882 846177 873689 905002 924397 932941
9297 932941 943038 946067 949679 938920 918140 914491 920460 907500 909845 917992 929960 947800 959276
9284 959276 962785 986112 1010279 1027329 1033624 1033390 1049364 1075130 1107485 1130438 1140199 1144574 1156696
9271 1156696 1183084 1209586 1236730 1270118 1312071 1374694 1456718 1558625 1695294 1877364 2097321
9260 2097321 2334779 2565094 2715572 2750588 2652265 2472416 2259991 2087604 1967223 1890204
9250 1890204 1865778 1879207 1941750 2042591 2164482 2330023 2518099 2687638 2837385 2940231
9240 2940231 2970300 2966331 2941133 2918968 2885579 2851458 2816326 2786686 2779943 2776057 2800019 2846022
9228 2846022 2937772 3102960 3375687 3761140 4259961 4850855 5402983 5707375 5670149 5347289
9218 5347289 4861926 4315951 3876060 3577461 3385022 3281894 3253526 3257695 3275344 3298664
9208 3298664 3344329 3413318 3502469 3602825 3721785 3827164 3900911 3953393 3957607 3887907 3770039
9197 3770039 3627925 3484962 3374482 3303472 3285115 3288208 3323939 3402835 3533767 3697095 3915189
9186 3915189 4181891 4409835 4521826 4511890 4404449 4244132 4085244 3945856 3844651 3798282
9176 3798282 3782389 3783034 3803793 3834398 3858424 3901259 3943204 3984942 4045931 4097687 4176525 4249962
9164 4249962 4324552 4387295 4458534 4531357 4601110 4678944 4775320 4866736 4949358 5045013 5139040
9153 5139040 5221722 5304402 5414246 5522639 5632377 5759181 5878756 6000039 6118208 6244734
9143 6244734 6369384 6472918 6590675 6725220 6862286 6989352 7118741 7253413 7390756 7540260
9133 7540260 7700612 7855873 8021097 8203372 8373593 8536407 8718066 8908133 9090093 9281316
9123 9281316 9472382 9662539 9867932 10083119 10289552 10496831 10725766 10941563 11146109 11372194
9113 11372194 11600401 11826552 12050681 12255075 12489381 12727899 12970530 13197005 13427082
9104 13427082 13663185 13876881 14094784 14321313 14548101 14762390 14981144 15188719 15386472
9095 15386472 15577761 15757528 15933940 16102718 16254685 16390892 16522076 16654225 16783660
9086 16783660 16894230 16984005 17058920 17117635 17176254 17213775 17231629 17239429 17242435 17232478 17203547 17158873
9074 17158873 17090303 17006977 16923107 16806706 16671349 16541198 16416149 16265926 16097063 15924331
9064 15924331 15753380 15584268 15408432 15217629 15019639 14806274 14584893 14370836 14144493
9055 14144493 13916646 13704267 13477364 13239990 13007155 12793502 12581991 12353586 12123851
9046 12123851 11889226 11656282 11429549 11241121 11037436 10829837 10630911 10411112 10193553
9037 10193553 9994443 9818096 9631989 9443705 9257725 9073988 8895514 8709715 8527939
9028 8527939 8348987 8182873 8026563 7862677 7704376 7556924 7431084 7283244 7132918 6990490
9018 6990490 6861535 6728300 6599197 6469736 6355349 6234797 6106057 5990729 5874980 5757494
9008 5757494 5661149 5575411 5476896 5371648 5266601 5174552 5089095 4992735 4898606 4812707 4720632
8997 4720632 4635762 4559316 4482248 4414997 4345302 4276936 4202911 4143167 4084629 4017053 3955583
8986 3955583 3889171 3827249 3755777 3676375 3608400 3561181 3502908 3444733 3393548 3331345 3276199
8975 3276199 3232851 3186865 3123397 3068857 3025731 2996709 2960839 2928584 2885277 2842599 2809420
8964 2809420 2758284 2714152 2668787 2633160 2602734 2566234 2531437 2492918 2467365 2439594 2414883
8953 2414883 2372539 2329215 2303760 2275345 2235026 2206294 2168230 2131047 2102533 2077395 2051062
8942 2051062 2023813 2005425 1983543 1956848 1940671 1918228 1893428 1858493 1847925 1839648 1827030 1796297
8930 1796297 1763460 1755640 1738005 1715098 1706753 1675932 1656448 1642129 1622008 1587334 1541261 1529600
8918 1529600 1539213 1529109 1512799 1496973 1482059 1480888 1468359 1451723 1445646 1414372 1385739 1349533
8906 1349533 1327135 1325504 1321472 1327407 1317972 1303082 1293453 1278224 1267125 1250223 1244007 1248843 1237226
8893 1237226 1232666 1246353 1230909 1218914 1229967 1237015 1232514 1238666 1257935 1288660 1309746 1310998
8881 1310998 1312873 1316898 1341764 1379453 1397778 1455023 1546232 1675151 1887078 2234365 2770711
8870 2770711 3570623 4678594 5811503 6308776 6029663 5265498 4228430 3273154 2594419
8861 2594419 2132807 1820793 1605290 1480451 1396976 1319837 1271127 1219080 1164332 1122498 1087080
8850 1087080 1055463 1016299 989396 963738 937433 923584 915064 896601 877524 867525 846405 830629
8838 830629 819056 805282 796670 787364 764124 758091 754606 749472 745316 733250 731752 747458 745257
8825 745257 748635 742877 729840 717529 712510 703510 700409 706515 704076 693864 706355 691011 678906
8812 678906 683202 668066 659225 663322 657851 639783 627593 621301 622544 628357 619924 603724 590464
8799 590464 580661 577044 586224 592346 597625 596310 589345 576003 563476 551893 551345 559089 554593 557768
8785 557768 545904 556145 567633 554201 540049 546631 554046 546719 540124 536487 521926 522390 521244
8772 521244 508609 508012 505998 498426 492709 478825 477897 489058 496195 517024 510968 503082 480716 470720
8758 470720 472098 456162 447067 450581 457698 450425 435927 436190 438782 443421 453363 469451 477426 468699
8744 468699 447387 433447 416713 418223 422568 420094 419186 413083 410041 407121 411140 426937 423487 408686
8730 408686 408048 410417 404544 417909 413950 396314 381667 369127 375991 375771 366579 361993 359770 354222
8716 354222 350368 349351 369826 373182 376856 365657 364889 362990 352570 354304 349506 346168 355959 351636
8702 351636 360054 366072 362640 366312 360670 359318 369399 377201 372234 376217 373385 352870 349899 352007
8688 352007 351010 353839 353649 352098 340272 329447 326846 320277 316383 310046 304581 313904 325196 337284
8674 337284 319650 315584 313218 317271 323592 317455 327552 325854 323672 323286 314340 309136 316132 327405
8660 327405 332611 314587 327750 361402 369853 362173 341920 335870 324284 324882 342081 361022 364532
8647 364532 364168 363323 382436 388073 390363 392195 388813 392980 401000 399315 401760 401288 400823 396896 386840
8632 386840 379740 382630 378530 363292 348214 342047 336744 337122 326515 306595 302736 302658 301691 300616
8618 300616 298066 294201 287674 301369 295904 288805 279690 268694 265182 273270 292230 299451 295106 293720
8604 293720 285887 271968 272352 275460 264908 247615 245480 248664 256904 264928 267893 293372 327402
8591 327402 362938 389173 384842 361135 341479 324904 302804 294479 281161 273342 259650 245128
8579 245128 235242 234418 238711 230443 233184 243551 242517 230247 231865 236330 229319 224499 223808 220620
8565 220620 211804 210125 205847 196584 192032 188949 185164 184771 195452 194201 204398 215567 215605 212881
8551 212881 206204 190082 199376 219142 211994 216645 226320 239537 259351 274825 277958 244089 212329
8538 212329 206043 196769 187808 180840 178738 169881 158862 167950 167672 161414 170029 187425 187446 183194 168215
8523 168215 177191 186275 179294 170959 166031 162565 165437 178302 176665 170850 151361 147446 154875 152404
8509 152404 160669 169863 181784 181611 173603 168594 162256 168368 162414 153325 160208 164332 167198 179997
8495 179997 175243 166677 161261 156549 163797 179454 188233 180207 172941 166408 163427 154483 157284 150534
8481 150534 139511 129582 141548 148772 145112 134413 124376 124186 127179 137761 142227 153378 145562
8468 145562 141162 143202 146897 164212 179238 169531 151513 145531 162672 168948 154722 144994 126984
8455 126984 116845 135525 153585 147435 145687 140566 143343 141464 136356 136353 132536 138281 147066 152838
8441 152838 136695 142940 143877 138872 145960 144862 154804 151720 142081 140051 128482 137351 141792 151441
8427 151441 164095 155144 147738 149755 153973 141397 135736 129701 122217 112305 121042 129692 136675 134531
8413 134531 131715 124037 129928 118412 108941 100344 105540 118047 121433 144881 155603 146280 150574
8400 150574 149909 133106 127909 129896 136025 140910 127743 127916 122989 108919 107322 109739 114687 127681
8386 127681 137592 140472 141209 134214 134374 134194 142426 143403 126732 128800 127911 118500 115593 120183 110515
8371 110515 98555 102702 119531 136292 147129 145502 145792 147634 156832 145704 134168 133292 124351
8358 124351 121565 127346 127357 120906 112615 108299 102328 103981 101803 96484 89413 88709 101220 99803 116571
8343 116571 114096 116720 115931 100253 107317 115529 105190 104657 102955 102344 107864 109596 103180 89704
8329 89704 85679 92252 100557 127663 143933 162215 164560 147849 133640 109222 99716 107389 101572
8316 101572 100175 88218 89307 95273 92262 94797 102163 108339 118399 127706 102482 79629 86419
8303 86419 81701 78057 83253 77104 80216 89190 88240 93245 83101 66972 80735 89188 88133 83453
8289 83453 90206 94187 103845 107517 97961 97225 85403 84654 88413 91824 77634 64437 69287 77979
8275 77979 84695 85442 79153 71845 71136 71284 58336 59525 71629 84194 92608 94653 96825 78866
8261 78866 66474 77536 87567 78106 55709 50485 55696 63516 71655 72712 68353 70758 76652 87361
8247 87361 87444 84560 94114 100829 94743 95543 97117 106879 108547 93259 90018 88923 86381 91006 84534
8232 84534 96316 98122 97835 89356 100704 89006 83282 107118 121430 112343 101211 84377 72937
8219 72937 63775 52378 43740 42564 37203 69501 83843 83014 93703 93070 86107 88567 83658 83862
8205 83862 88237 99513 103135 89822 77488 72493 72382 70604 68265 75368 74866 78156 67804 60859
8191 60859 67379 71937 76771 76796 72220 85906 79159 76822 78559 89472 85543 76205 79703 78216 79762
8176 79762 89717 91317 80574 85288 88493 83067 71602 66917 68775 83138 86061 85532 74789 69605
8162 69605 73988 71365 77875 77414 81396 89110 77285 71256 65062 53381 58027 63829 65134 76791
8148 76791 76178 64586 57781 64349 60535 52452 57147 55553 51338 55977 62026 64964 51943 61685
8134 61685 69948 62788 56676 61558 67037 65632 68876 71590 78722 88210 87625 88655 108281 111014 114490
8119 114490 115312 113785 110862 101593 84826 90223 82614 75824 79922 85408 79188 73993 74139 66390 75257
8104 75257 86971 72184 82661 98028 87881 91067 97653 95629 83325 69010 61882 63178 63858
8091 63858 60571 61831 58004 54857 44912 48825 57828 58497 68758 80754 85322 92358 101202 97114
8077 97114 94971 89598 113513 124309 139454 151611 156017 141314 117968 101602 89415 97015 110802
8064 110802 120159 123951 126911 133228 142470 157150 162783 159530 164296 167270 158928 143113 147563 132319
8050 132319 117561 107691 108343 108847 102163 96337 106309 128545 123447 108760 100884 103023 103661 107061
8036 107061 107973 105776 101140 85861 91493 106492 117698 130414 139323 138333 146362 145696 153729 163545
8022 163545 169665 182515 185781 186113 171777 162294 162919 158385 152141 161337 178365 184421 174451 177362
8008 177362 171202 157697 155198 139006 121518 108725 109564 106558 97119 95014 105710 112672 114192
7995 114192 108894 101462 105135 100289 88020 85241 91354 98976 94803 99352 100682 110095 101844 95876
7981 95876 113183 104422 81651 80028 87822 90894 91063 91804 95157 90347 98549 93660 77316 81255
7967 81255 83929 95498 90057 89469 79288 73525 64013 66264 66954 59401 52610 58423 55103 56940 67229
7952 67229 67376 76034 67814 75844 80838 60094 44720 57743 58330 57942 48131 39662 53213 54068 52277
7937 52277 59961 57541 63086 70354 72994 67624 60766 65343 67016 50903 54347 51829 47113 50114
7923 50114 55085 61756 63236 67592 59704 52714 50891 60509 81086 88656 85238 76321 75079 54912
7909 54912 44911 47861 54450 62568 66209 59368 56870 55284 52279 53023 44727 36873 36941 40436 35946
7894 35946 31663 33046 46486 56787 53388 50857 55359 66906 47149 27110 26341 25089 31495 43956
7880 43956 43338 55309 59241 40653 43413 49152 52206 49295 48797 41702 40050 36427 33060 33161 42399
7865 42399 50871 44725 25403 23343 30698 37116 33801 36717 37583 26055 33405 31532 8196 7962
7851 7962 19139 23560 30083 53351 61849 54979 49838 46564 44337 55458 59796 54275 44743 42754
7837 42754 25563 10311 14725 21614 27130 27671 43605 56805 51062 43454 38978 37538 41447 51523
7823 51523 50247 46351 56656 50387 38582 33515 27696 24153 21336 27261 31307 18542 7561 19921
7809 19921 30928 35619 30112 28517 33478 27313 23557 20908 19307 25937 34503 38578 32247 22846
7795 22846 19385 14542 15003 14650 29169 31300 24010 30711 40550 38253 27519 17231 24902 25042 31739
7780 31739 26893 20456 25432 37084 23813 22553 26292 32732 34826 26609 23222 20805 27742 31647
7766 31647 34505 29403 17359 12466 4956 2210 3519 15032 19274 21723 24296 8884 3927 25458
7752 25458 33810 16760 14716 18860 20315 26898 38513 41101 33426 27432 17098 4248 2388 1210
7738 1210 459 11201 18321 22454 21946 27252 28742 27989 37365 38443 22126 10960 13383 25054 35273
7723 35273 30321 27348 28077 21832 13659 5344 9785 13027 18578 26864 12287 7635 12805 15231 18783
7708 18783 2483 -13697 -15020 -13648 -1091 -11438 -5693 14938 22365 27425 19597 17046 27113
7695 27113 33717 23064 24187 11714 14255 19156 17079 11363 3199 7412 1763 -756 13294 28684
7681 28684 28771 27443 12227 11619 22825 30362 23905 30315 18402 26346 32004 22330 1565 5559
7667 5559 6582 4302 8747 5264 2245 595 2273 2940 750 460 11358 24709 28379 33568 40069
7652 40069 24211 21422 20974 13593 14996 29717 38304 40437 28574 29095 27595 29927 32121 28068
7638 28068 20540 13695 13508 22415 24646 26247 23416 17704 24616 12361 -6691 -8128 12727 26774
7624 26774 26737 10008 6205 28882 33558 19269 4691 -2128 4839 19770 21477 24742 24836 24356 19995
7609 19995 11966 7241 6189 10847 5321 -4398 -5536 5032 11101 19201 16155 14456 26760 36571
7595 36571 36683 21815 12378 17098 10656 12861 18848 11321 13860 3627 -4532 7894 18459 20714
7581 20714 27465 29711 23495 33087 41146 33592 34379 38831 34132 30327 35563 38229 46961 29965 17478
7566 17478 17879 21467 18380 12405 10376 8744 19472 18109 10957 6867 12297 -3936 -4472 6097
7552 6097 19127 20574 26489 29815 18736 11279 3919 4884 8864 10090 10933 15458 19870 13753 10183
7537 10183 12152 7674 7248 12754 1613 11271 3899 -7777 6645 2885 12344 14848 4833 4559
7523 4559 16799 30010 18516 4402 -363 17121 20167 14036 16378 17788 27276 29597 34524 31694
7509 31694 28330 39232 46155 40179 44662 42597 17942 -4843 -19978 -8131 -6551 -4273 4430
7496 4430 11501 18660 8031 -533 4007 -4713 -11056 -5983 -7878 -6035 5293 11415 11594 22394
7482 22394 17999 11987 -1533 -624 8265 10407 5000 7960 17124 8889 -3451 -11007 -20125 1596
7468 1596 12778 4298 -11862 -16470 -17889 -19164 -27159 -3647 12924 17167 23746 30697 26345 22710
7454 22710 21842 19783 24083 33799 24639 1857 560 3727 -6710 -233 14542 15940 15108 22962
7440 22962 36823 33621 32520 29055 23380 18305 24116 24862 26374 26024 32116 29207 16525 12162 738
7425 738 -12148 -12445 -18182 -14478 -4627 -557 6701 14174 31068 40362 47748 48378 37246 44349 41717
7410 41717 30145 31005 32277 22174 22807 23822 20033 20510 16941 19633 34950 31644 18973 23909
7396 23909 35796 26584 26895 24679 29310 39922 41664 21686 3599 8826 33933 18957 -3951
7383 -3951 1628 2243 995 8672 28203 31137 23354 23555 38099 36003 23586 12491 13312 14298 10545
7368 10545 6193 -4634 -9609 -13360 -564 -628 -7746 -6323 -2463 10031 8079 18417 34147 43671
7354 43671 22621 21221 18444 20517 16597 5584 7374 20683 29452 23233 5669 5861 5054 -2615
7340 -2615 -1029 -4812 -11369 -14647 -10498 -12411 -11781 7979 13629 3424 556 15289 14998 14747 9823
7325 9823 16207 9393 1375 -1723 -7270 956 8539 3597 10031 2042 7156 8101 11829 14630 6938
7310 6938 -8958 -14686 -4871 8994 16926 5374 -23 4826 -1767 8047 660 -4343 2598 22425
7296 22425 35285 20535 5898 -1431 -1530 -916 11159 13027 -6053 -14064 -3945 -4712 5911 4076
7282 4076 1594 3013 17077 36671 35910 46445 57013 42440 36954 22006 14210 414 2048
7269 2048 18278 11606 11910 17025 13676 12919 10846 5480 -3893 4431 14045 7100 7316 8319 16019
7254 16019 13121 14748 5798 8216 10136 23277 21780 17641 14401 18133 13020 13052 10839 6760 3679
7239 3679 -2280 8690 21397 25623 13048 1235 1423 13011 10306 25458 18880 -605 -1488 4868
7225 4868 -939 -10820 -2000 -2187 -21734 -17279 -4759 4100 13189 14777 13273 8718 8161 1290 -8539
7210 -8539 -3246 6957 10437 4748 -2084 -15289 -11642 -7387 -11011 -12870 5116 17375 7699 -12120
7196 -12120 -15087 -668 4994 10240 16085 10336 -2428 6333 17584 15246 6369 17121 34288
7183 34288 42308 24952 8903 16104 16044 19998 17148 16164 10945 9605 3480 7529 -5745 -4962 1503
7168 1503 -1367 19612 24337 2440 -8484 -6622 10712 10024 6943 15402 24675 26442 31810 38676
7154 38676 34851 24911 17910 23978 8927 -7608 2106 19055 26941 16918 2827 9910 16322
7141 16322 -4420 -20126 -16260 -13680 -8840 -1352 16763 1123 -8483 -3161 10652 9955 2348 -6506
7127 -6506 -2854 -7494 -6403 2336 -8909 -22129 -23783 -15065 -13548 -2853 5070 -1055 6614 10450
7113 10450 8116 5572 1921 -2233 -1934 -7189 -1173 3588 -3705 -13247 -4781 2491 9673 8479 525
7098 525 3197 16164 8622 993 6210 9268 8609 -788 2440 15973 13445 19278 19258 8423 6813
7083 6813 -2929 3486 19693 23608 22920 8624 1270 7000 11665 10642 5981 12412 11860 15895 23522
7068 23522 10051 -3961 -7271 2358 13311 14284 14860 13278 20299 12547 12963 6841 9096 13066 18675
7053 18675 12376 3032 10017 4367 -11859 -13571 -25631 -23308 -14058 -2580 3036 12065 11651 4905
7039 4905 4981 4712 -14988 -24267 -30830 -21477 -8620 -3260 -1994 2082 11112 9448 12894 7319 4201
7024 4201 10619 7726 2975 -4920 -18187 -9476 2503 10977 2893 5450 -14200 -32018 -31929 -18504
7010 -18504 -12219 8997 9342 14185 2099 -5712 -3570 371 -15591 -10152 -11858 -828 24673 26900
6996 26900 20876 4683 1701 6905 19112 12311 912 -13044 -7816 -1834 9747 14762 10240
6983 10240 15284 24395 19857 10000 2118 479 8014 7390 25174 27894 12368 -3834 -5854 7301
6969 7301 5473 5895 -2987 -7102 -9515 681 5658 9005 3606 -9543 -17239 2905 18216 26970
6955 26970 36397 34583 31672 14756 14748 23427 18195 15655 11966 9006 5640 1280 -348 -3881 -9715
6940 -9715 -6927 219 -2465 3034 13463 7416 10272 3595 7913 15493 9331 7033 15410 1225
6926 1225 -2276 -1820 17049 32266 24334 3940 3986 12596 15863 17612 13648 19034 16568 7316 353
6911 353 -13251 -11449 14503 9193 1836 172 14765 17900 16638 4648 7992 10243 988 -14117
6897 -14117 -14704 -21275 -18573 -10286 -934 12412 5918 13846 589 -351 -4339 -9092 -7725 -5643 3388
6882 3388 -2783 4071 591 -3737 -3210 -10755 -12131 -353 7447 1825 -383 -2266 12294 13079 14973
6867 14973 12974 -2880 -7144 -4947 1426 8805 11765 -1815 -4526 -3661 333 3946 6593 18534
6853 18534 18511 13735 13421 21073 16104 19151 6703 -1055 3154 -314 3889 23575 38719 40136 27693
6838 27693 32228 46493 57831 67248 71461 81995 94374 68622 38929 19580 14177 10117 15
6825 15 16517 23540 37619 49675 52024 42878 26671 6110 -621 -8968 -11601 -14148 -11369 -2454
6811 -2454 8314 19407 26329 28193 20446 9748 -573 -1376 -3071 -5333 8706 12349 15677 18144
6797 18144 19552 16528 2769 -7571 -14918 -15066 3843 2074 -18708 -26608 -22181 -19073 -12595 -11502
6783 -11502 -13473 -29048 -27659 973 -9741 -18097 -21612 -21943 -11648 -2764 2843 11384 23214 26659
6769 26659 29246 23520 -261 3405 1330 -6213 -13340 -11870 -10776 -8842 -12054 7621 23839 14777
6755 14777 15614 20190 21764 24734 14994 4765 -7265 -3630 1497 5240 9533 13384 12233 5103
6741 5103 3132 10969 8913 144 -385 4646 -2506 -15347 -9267 -6932 -6856 -2389 -14349 -7539 -6240
6726 -6240 -8844 6538 27533 45523 57022 74391 95112 102760 104757 108589 108115 87508 61676
6713 61676 37458 21660 3480 -10362 -9461 2779 3454 1460 2607 10292 6127 3763 -9 -10039
6699 -10039 -9354 3636 8250 3242 -7414 -5272 -5740 -7453 -3077 861 5062 -2729 -10134 -11863 -2364
6684 -2364 5844 -762 -19044 -12907 -2314 -5584 -11149 -20560 -262 5362 9188 14429 19580 15118
6670 15118 13986 30101 29888 14286 7634 9520 -10720 -6138 -10478 2759 15499 18633 21406 10710
6656 10710 4372 17127 7342 2519 2257 -11502 -10809 -3503 -668 4087 7794 -2151 -14032 -12286
6642 -12286 -7800 6035 13529 20418 15906 28063 33063 18606 -1925 -9953 -241 -4018 -13745 -11765
6628 -11765 -25223 -38948 -29168 -29866 -31292 -23530 -17492 -21136 -11924 -4223 -1832 -1782 -6362 -13022 1821
6613 1821 10236 7461 -3328 -15528 -10626 -4685 4880 17078 17144 -1689 -7737 -2963 5731 -10616
6599 -10616 -21126 -32513 -1879 5660 2792 -4674 2622 -4762 -13083 9488 1245 2103 -1040 -282
6585 -282 8492 23049 19568 5112 -14283 -22749 -11555 -9767 -17735 -9267 -661 8649 12444 17967
6571 17967 15341 7818 -2757 -5226 -12883 -4533 16007 22988 27821 24742 13167 18279 10280 324
6557 324 2337 11999 18891 34757 36044 31683 26316 2246 7241 24960 21570 16635 7419 8123 -9540
6542 -9540 -19861 -11494 -11362 -5952 13448 2178 -11131 -15293 -18070 -25160 -19056 -12176 -14470 -11449
6528 -11449 -6433 5129 4668 26969 37597 42408 44076 30840 19877 -5152 -21242 -24188 -16027
6515 -16027 -7461 -6958 -4449 5418 5432 -6444 -4524 -15983 -14262 -11553 -16742 -11009 8564 3747 -12410
6500 -12410 -12041 -3832 11101 6930 16997 10799 11324 -5660 -20742 -14239 -9695 1445 6157 -1999
6486 -1999 -12963 -6076 -1990 -5273 -10558 -2362 1052 -2083 -3950 -1677 -9886 -10494 -6288 -10212 -4143
6471 -4143 -3851 -7099 -1370 12804 19181 13162 12815 13723 28927 33705 14897 11325 14941 6706 -12714
6456 -12714 -17767 -8657 6907 1990 -1280 -5910 -13750 -18618 -14726 -16161 -16653 -9406 -14159 -18971 -16541
6441 -16541 -15682 -5550 928 -12067 -15982 -18736 -10661 -9398 -8982 -8202 -8527 -6331 -8210 2556 -4254
6426 -4254 -7094 -6926 533 5841 12553 17064 8057 14671 26108 28105 25745 24100 20420 15901 3939
6411 3939 -2545 3823 5965 -4032 8321 9886 -12600 -3602 10309 2527 4886 15353 16281 99
6397 99 1721 13937 10072 4446 211 6051 10683 4254 3092 17837 11534 -7957 -14432 -13593 -8176
6382 -8176 2803 -7225 -12503 -11460 -8280 -1573 -465 888 -2786 -1850 4746 11812 6441 -7228
6368 -7228 -12453 -12912 -1366 -6369 -4705 -12493 -16230 -8664 2811 12333 8748 8526 5527 -12173 -11539
6353 -11539 624 2690 -11089 -13237 -7141 1136 459 5180 17015 11429 7679 10805 11463 9747
6339 9747 8905 -10810 -26409 -23074 -7303 -12429 -9950 7430 20894 29024 21209 13579 2627 -5629
6325 -5629 -4440 709 773 17282 10526 3220 7406 4480 11857 12315 7140 8150 -5831 -9732 -14411
6310 -14411 -15005 -8512 2061 537 -4614 -12243 -15182 -12270 -16819 -15728 -19063 -21005 -5538 -5714 -14411
6295 -14411 -11224 -12594 -30910 -35810 -27725 -11429 282 287 3647 2166 7501 17812 22723 16240
6281 16240 18468 15022 3016 -1125 1022 -5158 -8094 -783 -1540 7865 15368 9988 4530 3368 5334
6266 5334 8521 1278 1557 7378 11124 12821 2368 -793 526 -818 -12999 -28328 -26261 -22084
6252 -22084 -10422 -2612 4715 -1353 -4673 -11489 -28353 -33231 -31113 -15476 -4189 -5874 -7219 264
6238 264 1235 -5424 -8840 -13075 -15401 -12487 -10798 -24659 -21398 -21754 -11591 -11240 -10086 -14867 -13577
6223 -13577 -1486 2393 4846 1153 -22071 -31470 -29496 -23174 -8804 -5290 -3628 4481 8972 10499
6209 10499 20403 22361 7337 -581 10508 12977 12518 -150 -6479 -9834 -14530 -12049 -11391 -25322
6195 -25322 -27163 -17803 -24952 -22955 -6229 13499 7388 -4544 1438 19637 16831 5606 4575
6182 4575 -512 -5186 4626 5818 1164 -3017 -5470 -11534 -4224 6923 -4528 -1917 10994 15043
6168 15043 11526 3590 -9365 -20564 -14950 -1798 -1693 106 5686 13196 15644 -281 2894 8043
6154 8043 2279 -986 1166 -733 -10266 -5159 -1616 2504 16581 22203 3569 3950 2671 -2361 259
6139 259 4869 5150 2365 -17646 -5559 6341 -6107 -17017 -9191 8500 12742 3597 3394 1560
6125 1560 -5097 -12840 -10177 -5577 1568 8131 -3393 -7432 -11786 -14077 2422 4581 -7310 -8589
6111 -8589 -6808 -15901 -8948 -884 -132 -6931 1973 7874 16431 20241 21172 13995 -2305 -17124 1452
6096 1452 16586 8870 3584 -13841 -26020 -23835 -18557 3622 15254 8421 3204 6486 19708
6083 19708 8964 5507 -2004 -11866 -33668 -23641 -12835 -5067 -2730 -7435 -6307 -8186 -17127 -21263
6069 -21263 -23582 -14813 -8210 2596 7012 4783 8959 7885 -4624 -16081 -9940 -1389 1755 -5081
6055 -5081 -23435 -20704 -22689 -10928 -17869 -24042 -20624 -15983 -12180 -3315 -10852 -8652 -7419 -7447 -2481
6040 -2481 -1792 5155 3296 9292 17034 21518 12593 6536 2909 -6602 -18872 -12217 -2563 -7955 -15504
6025 -15504 -8269 2005 -11632 -12596 -7057 -2593 -2151 -10525 -19679 -24328 -28473 -35570 -32531 -15901
6011 -15901 -3345 -6481 -5032 731 7903 15397 5680 5240 -3352 1013 -2159 -5728 -3612 2186 13984
5996 13984 2877 -17186 -11642 -7624 -2889 5595 18652 19244 4638 -5200 -15540 -16476 -6915 6547
5982 6547 5643 7817 9088 4789 -5457 1735 7740 8428 303 -8784 -3310 -3448 -20658 -25221 -19742
5967 -19742 -19503 -16714 -13627 -15980 -17283 -20386 -8566 -5014 -924 1800 -3097 3323 17516 16906 5206
5952 5206 -7249 -10331 -9138 4584 3779 -1677 -17903 -23069 -19424 -3544 1152 3704 3216 2519 -4266
5937 -4266 -6054 -11707 -18493 -15420 -2397 4291 4680 8877 2669 2899 1397 1873 9403 12274 5683
5922 5683 11406 -472 -1086 2400 3344 -2980 -9958 -10613 -6305 -5287 -2951 -13049 -4773 -5644 805
5907 805 7442 802 3146 -10883 -10150 -2350 1243 -7767 4977 4620 -5390 -7986 -15002 -8041 -4926
5892 -4926 -8808 -11402 -7169 -3337 -5499 -11200 -20407 -18900 -8136 206 12912 -3530 -9228 -2628
5878 -2628 12070 1396 6356 8432 -9084 -3524 1759 -8531 -8671 -8540 -11074 -12460 -24718 -16085
5864 -16085 -21437 -19979 -21320 -18594 -12708 -19292 -6959 -8766 -13902 2067 5857 -5306 -1542 7778
5850 7778 -8237 -30491 -32200 -22586 -3594 10336 11120 -4269 -6046 -15373 -19370 -25440 -11301 -919
5836 -919 4435 3811 -10665 -10114 2591 5922 701 -1563 -2007 -2440 -3300 -16182 -17949 -27125 -31551 -31930
5820 -31930 -22988 474 15987 19669 27606 23477 5931 2283 305 14292 16696 17699 3066
5807 3066 -11586 -17260 -16267 -3073 8077 4208 -6994 -14222 -12829 -11147 -14244 -6776 -11564 -21513
5793 -21513 -25921 -17534 -8043 -1591 10280 8944 11168 3725 -8523 644 7788 4591 1360 261
5779 261 2 2433 5075 23159 26873 17729 757 -16808 -9036 -1001 -9746 -16963 -14712 -18181 -17270
5764 -17270 -16450 -5283 -7778 -18618 -30032 -21378 -13519 -21785 -18120 87 22034 15012 6513 10969
5750 10969 -8122 -22572 -17030 -25985 -24283 -18067 -7535 -19015 -14086 -7427 -12426 -8099 8313
5737 8313 13944 14108 8682 9015 15396 8131 9738 11564 12990 -2489 -16360 -19010 -17957 -11357 -4482
5722 -4482 2056 576 7359 3935 1999 -4954 -5398 -8462 4757 17391 16006 20220 9454 -2573
5708 -2573 2457 13508 6395 4234 5837 12606 10670 753 -6520 -2728 53 7974 5133 4065 -966
5693 -966 -8861 -7226 -707 -3840 -2254 -8864 -20293 -16314 -2433 -2925 -14386 -24640 -22423 -21464 -24404
5678 -24404 -11992 9179 9579 -4103 8712 6620 17512 24563 22627 4810 -6737 -2966 1850
5665 1850 9201 20863 17843 5847 -17975 -21308 -13785 -26182 -24711 -9692 10215 13422 11013
5652 11013 -5945 -12930 -9756 -11071 -2710 7535 6750 -3421 -16427 -12809 3481 2776 -1450 -5734
5638 -5734 1939 4347 924 1621 2929 -8646 -2358 -10663 -10077 -9847 -21197 -13406 -3940 -4726 -15664
5623 -15664 -15349 -12367 -10795 -7866 -6538 1022 -4924 -11080 -1865 2336 5696 4137 -6770 3137 4011
5608 4011 -8935 -17475 8129 16654 17281 11045 5602 9021 3945 -15031 -14288 -10980 -8951 -9156 -3706
5593 -3706 -100 11723 13324 4532 13730 15308 7254 -12 -9249 -12546 -11118 -9521 -17044 -13377 -13756
5578 -13756 -15695 -5038 -3407 -9148 -6119 -3336 -8472 2518 7696 2006 -5457 -2374 6954 10147
5564 10147 6692 -6658 -15819 -10583 -6379 -1276 -7616 -1613 3907 5361 -7997 -16342 -18820 -26715
5550 -26715 -27937 -17006 -7013 -14283 -21499 -27405 -14067 -8282 3738 12174 11790 3796 8587 702
5536 702 -10380 368 -6193 -3845 15736 20090 1802 3068 -7038 -17555 -21964 -15391 -15942 -26968
5522 -26968 -19414 -1552 839 -4526 214 4385 -8560 -18882 -12288 -13230 -30953 -31513 -26068 -20096
5508 -20096 -7587 977 -9830 -9508 8501 22348 23467 12279 -1449 -2208 9125 8295 1595 5888
5494 5888 8088 6225 3940 -2403 1006 845 -4636 1707 3935 -2722 724 12874 8523 10111 -7749
5479 -7749 5823 17053 6299 3240 -3658 -6124 -2496 -9448 -23411 -18726 -13406 -24300 -32959 -26693
5465 -26693 -29060 -24709 -7920 -1448 3118 8481 2546 -1338 -13845 -28465 -19326 -4553 5885
5452 5885 4359 -29 680 7582 19584 20183 -2577 -11385 -16242 -13883 -8213 -10786 -5594 -701 -2325
5437 -2325 -8872 -12386 -28634 -22262 -26163 -32623 -26987 -13961 -160 -1747 -9228 -16548 -22786 -21615
5423 -21615 -15570 -9212 -12408 -9915 -9478 -10432 -14747 -14667 -12308 -8975 -2504 -8246 -4666 -10721 -14647 -14272
5407 -14272 -7368 -15383 -22257 -18087 -6731 -24487 -29797 -22123 -11641 -3752 13926 17741 10209 1783
5393 1783 -3717 -636 5731 199 -15024 -16855 -17926 -16166 -25513 -19426 -20719 -18534 -12894 -9245 -14511
5378 -14511 -8517 -8806 -8581 -405 -5011 -4509 -6160 -13867 -11012 -9440 -21017 -28129 -23350 -14025 -7134
5363 -7134 -14901 -18976 -1987 -10595 -19621 -12749 -22380 -15940 1741 -1576 -11698 -11697 -8016 -12901 -8835
5348 -8835 -6684 -10077 -8006 -17016 -21853 -18144 -13482 -21911 -23424 -25618 -24238 -28078 -25253 -20912 -10243
5333 -10243 -9106 169 -2402 4434 -31 -15412 -9291 2716 -1126 -2354 -2460 -6369 -13760 -16682
5319 -16682 -3692 658 -3383 -11882 -6901 12328 13346 6462 9276 11546 8575 12721 5470 3457
5305 3457 -14116 -21482 -22923 -18341 -18039 -18985 -21420 -17996 -6523 13856 16102 1713 -7550 -7244 -7505
5290 -7505 12466 14594 13573 2294 -1370 5455 -1423 -18065 -20787 -9093 793 4504 1189 -5393
5276 -5393 30 3747 -11621 -13669 -13964 -16296 -326 2603 327 1155 -2659 3957 9159 11101 945
5261 945 -3488 -2109 -2441 -12478 -10509 -11620 -6818 8959 17729 6991 -770 7777 10953 670
5247 670 -5351 -11154 -11319 -9075 -20482 -18655 -5635 19190 28907 29687 27530 6984 -7127 298
5233 298 562 -7332 -12036 -5484 -1403 -21105 -17787 -10899 -20609 -6264 8427 16363 9223 -8134
5219 -8134 -21337 -11637 -950 3846 2475 6019 1153 -11607 -6502 -4639 -3825 3121 -6781 -15821
5205 -15821 -4542 -29701 -26537 -12084 -3605 -12469 -11265 -19825 -7589 15071 27277 3198 -16769
5192 -16769 -21678 -15282 -5087 -3888 -1625 8821 20445 4492 -12763 -5936 -299 -452 2100 -2636
5178 -2636 -3713 -2929 -2276 4701 941 -4879 -17289 -24668 -20586 -15111 -11359 7638 15670 15038 21261
5163 21261 9222 915 -1060 -5040 5071 9647 7152 -10691 -29181 -33753 -28456 -20012 -25255 -24879
5149 -24879 -21336 -22755 -14737 -4010 1539 5073 8372 8942 14212 -2912 -10215 -15410 -11150 -7713
5135 -7713 -13103 3045 11628 3961 387 -4805 -10770 -11133 -7252 -17484 -15450 -6708 -2035 10506
5121 10506 7028 6928 9915 4085 -10879 -20241 -16944 -5962 683 -11552 -27052 -23549 -25439 -18377
5107 -18377 844 -805 -1325 -1538 -9885 -21643 -9359 8502 6034 7033 7593 9537 16917 14231 -2684
5092 -2684 -12001 -9278 -10976 -11620 -8498 1117 2176 -4654 -11506 -2601 3327 4384 -9025 -11086 92
5077 92 4215 6818 -15230 -14603 9109 -6299 -25060 -27402 -14017 -5956 -7469 -8495 -9395 -6871 2674
5062 2674 13407 17282 17322 16081 21585 15078 3466 -9319 -12276 -1637 1145 -5343 -7138 -7002 -2659
5047 -2659 -11096 -10480 -1173 -7564 5829 18396 23451 9043 10537 27598 9257 7725 14796 10689
5033 10689 10544 16112 11954 3358 -20458 -28531 -12820 -17283 -22357 -2901 -5610 -9399 -12030 -1705
5019 -1705 -5881 -5265 -7343 -1902 -16236 -29048 -19184 1843 11447 2162 -2643 5199 3512 3205 5622
5004 5622 -1799 -25288 -22959 -9588 496 6262 2562 -792 5966 13409 6154 4501 6812 3245
4990 3245 -5886 -24984 -12220 3830 9421 4588 -4971 955 12169 18668 16116 18190 15432 11681
4976 11681 1706 -9667 -12950 -14553 -12490 -16835 -16909 -19750 -17411 -25242 -23950 -22685 -19769 -11859 -10209
4961 -10209 -15025 -20076 -27101 -18913 -13125 -4423 -5559 -14844 -13353 -15066 -21093 -21157 -26436 -24260 -18254
4946 -18254 -15057 -16525 -14535 -10327 -20034 -14042 -80 8464 14099 14630 12816 -3865 -9129 -16871
4932 -16871 -21936 -17227 -10717 -10405 -9913 -17739 -16356 -8917 -5380 -1829 -12650 -4141 1439 -11561 -8492
4917 -8492 5901 10567 15610 19327 21778 8525 -2555 -14621 -18421 -14260 -17127 -14718 -8801 -5982
4903 -5982 -3991 -4975 -9507 -4830 -2074 1565 -2804 -3528 -1198 -3273 -10327 -19870 -15093 -19777 -1570
4888 -1570 9127 11110 -1598 -2568 4697 5168 11212 12681 -1791 1388 -6866 -21287 -35044 -38098
4874 -38098 -26320 -17832 -19102 -16510 -15264 -13002 -16213 -17237 -11092 -19503 -18465 -17088 -24942 -19668
4860 -19668 -7445 -4518 5758 -5503 -16339 -7412 -17111 -23693 -8537 -2798 1924 -6908 -18116
4847 -18116 -35697 -33664 -9943 5300 7603 6792 5600 -3255 2837 4973 5893 2180 -11679 -23402
4833 -23402 -33038 -30966 -38235 -33015 -30362 -25971 -14301 -10239 -2296 -2800 3097 58 1486 -4167 -11161
4818 -11161 -2356 -3386 -16565 -22037 -23547 -24616 -22456 -19676 -22100 -18637 -4958 -477 6942 12695
4804 12695 19986 12333 11440 -2999 429 1471 -12802 -7029 15738 18530 12598 23745 22011 20785
4790 20785 11534 7528 4970 -108 1095 11379 27103 20855 5322 5881 15731 11770 -6931 -11641
4776 -11641 -5738 5306 2326 2071 -5554 -12675 -2274 3963 -3445 -9549 -16965 -20413 -11925 -2802
4762 -2802 -2921 8663 14985 16541 8867 3936 5562 5147 -1324 -1619 4503 8091 1608 -16670 -9001
4747 -9001 1905 -10725 -6400 7767 10205 3712 -2629 -1330 -6861 -15522 -10894 -10004 2531 9500
4733 9500 1077 -4257 9678 12674 2091 -6071 -15821 -12887 -6359 -1243 275 6711 4504 -7501
4719 -7501 -18664 -6353 -9976 -12667 -5644 -9752 -5751 4482 -852 -11596 -14047 -15675 -17289 -19620
4705 -19620 -19778 -13795 -20707 -19087 -14653 -15701 857 5533 12450 11685 9279 9790 14002 -443 -17216
4690 -17216 -19394 -1144 8216 7586 -3018 -9778 -6232 -6245 -11162 -23032 -24072 -13302 -255 6106
4676 6106 7753 12178 22626 15616 21334 24257 23434 11271 -6263 -1849 -1754 -7983 -7010 -10238 -6698
4661 -6698 -10224 -11268 -3542 1234 12410 7229 2025 8231 13342 1696 -7422 -15641 -19020 -13284
4647 -13284 -11360 -5707 -15174 -28696 -34532 -23741 -19173 -17035 -15853 -15091 418 22752 31344 21362
4633 21362 -4396 -13687 13872 14828 12201 5490 8595 3119 -2260 -3463 -7340 -6508 -11657 -7376 3494
4618 3494 6129 4349 45 -7449 -13982 -3149 2213 -13817 -5192 9532 12113 6101 7363 1991
4604 1991 -5320 4761 3851 7815 9541 5982 7396 8861 -3284 -11725 -11087 -7222 7060 9976 11182
4589 11182 3454 -13029 -23306 -25124 -18647 -4728 -3641 -17370 -28333 -16052 -4678 1063 -4288
4576 -4288 190 -6890 -99 2140 -9374 -15137 -15905 -12260 -26185 -27131 -34702 -26992 -21970 -18545 -4229
4561 -4229 7400 8135 8808 17856 10263 6079 17986 12017 4198 -232 -8326 -8374 -7405 -18934 -21037
4546 -21037 -22153 -28902 -28096 -27848 -30501 -24957 2804 8523 5179 4412 485 -3132 -16836 -29119 -25323
4531 -25323 -18978 -15404 -4670 -12121 -23856 -20240 -9657 -4223 -7199 -5072 331 -2535 -8699 -14780
4517 -14780 -10563 -12260 -6823 -8373 -5950 3095 -6552 -7330 -7234 -13545 -26383 -12375 -3097 2190 9429
4502 9429 14208 10769 -1176 -10538 -19821 -9104 7021 -11410 -12814 -1219 2098 4753 11874 14534
4488 14534 15129 14006 6906 -1699 -11556 -19386 -12215 3564 18332 28858 40185 37652 19492 3755
4474 3755 -9209 -18688 -10361 -5155 -11737 -9411 -20581 -16043 -8642 5066 17035 20073 9303 -1579
4460 -1579 4096 9719 21883 20551 20068 11857 18332 29859 34867 16901 1596 2457 -356 -1705
4446 -1705 -1376 -79 -2496 -7719 -2833 1687 -10511 -12353 -12408 -13094 -14368 -7609 8937 6031 487
4431 487 -6700 214 -6520 -3582 5933 -5208 -12512 -5009 -11313 -17805 -11938 -8532 8689 14948 7271
4416 7271 3765 8186 6409 6645 17537 14588 7245 -9909 -17732 -15573 -18935 -30080 -27867 -2293
4402 -2293 11474 -53 -2267 -10161 -14565 -11500 -1716 -2027 -7741 -2444 3462 1157 -9419 -6997
4388 -6997 -8960 -8890 10573 7197 6102 15051 10235 9890 -1352 -22655 -28528 -22809 -9829 -10087 -7472
4373 -7472 -5295 -13268 -5257 -3574 -2200 4530 -5578 -16012 -16404 -12749 -6875 -7692 -10504 3005 6841
4358 6841 1890 -10858 -22032 -36352 -31568 -21265 -4707 -3126 -6137 -13137 -11110 -15294 -18363 -18913
4344 -18913 -12832 4126 338 -3010 -6505 -2064 -2483 -4765 -7209 120 -1061 6111 -9296 -15204
4330 -15204 -10212 -5588 -4525 -14691 -18866 -21332 -16051 -22840 -18802 -15453 -21090 -31896 -25242 -6569
4316 -6569 -9258 -12047 -582 1159 9047 -4575 -10910 4145 16512 1785 -1601 1289 -11705
4303 -11705 -4052 13637 4141 222 -4352 -15249 -4563 -2778 -11619 -23127 -33577 -14532 -18854
4290 -18854 -32015 -25598 -20317 -24608 -16475 5812 12517 10732 8030 -757 -7402 6603 9278 1218
4276 1218 -163 6890 -1188 -14509 -11248 -8203 -6940 -7929 -1246 7254 9955 16218 6279 2299 10576
4261 10576 316 -10030 349 4404 -1425 -6128 -13195 -26171 -21630 -12605 -15249 -23256 -22034 -18768
4247 -18768 -20652 -19298 -10425 -19179 -19390 -9611 910 8032 -1400 -974 967 -2587 -15982 -11829 -8991
4232 -8991 -14151 -15879 -28539 -23326 -6474 -3805 -8851 -7193 -8397 -18016 -22298 -4682 7328 145
4218 145 1611 12527 7911 6265 -4994 996 -4281 -7435 3658 -7500 -6336 -14028 376 7286
4204 7286 12256 11003 2713 -4140 187 3154 763 9142 25002 29089 13749 6210 731 4651
4190 4651 8544 7859 2579 2166 4346 764 -3058 -2276 -21773 -28444 -18358 -13105 -1045 -6124 -14276
4175 -14276 -17477 -16769 -12799 -5742 1444 1179 -8079 -13867 6379 10650 -4715 -7149 -7578 -17825 -2090
4160 -2090 1061 -1911 -6044 -12560 -14458 -8207 -14471 -20480 -8684 -8793 -10340 -14165 -12824 -141 -1220
4145 -1220 -7873 -15439 -27391 -22908 -24934 -25008 -20503 -12410 -5669 521 -15311 -31772 -30704 -31709 -33777
4130 -33777 -9674 9852 15670 11094 20173 17814 11776 7666 11752 15384 14794 4055 -13499 -24527
4116 -24527 -22192 -19490 -12122 -12986 -36887 -34620 -26195 -13715 938 10000 25845 16029 787 1769
4102 1769 2879 -9703 -4421 9238 1315 1192 15149 31205 23483 19246 12716 -7328 -10754 -7251
4088 -7251 -5412 -15133 -21012 -21029 -32191 -39437 -27880 -34087 -33331 -34348 -32502 -31286 -45275 -36082 -27670
4073 -27670 -21238 -6479 11881 18085 5541 -4563 -8772 -6277 -7137 -13768 -5777 -7496 3651 10227
4059 10227 -1567 -11272 -2573 3380 4657 -1444 -10213 -2237 4333 4052 -8553 -11873 -12182 -10933 -6340
4044 -6340 1245 1051 -2385 -20289 -25388 -23159 -17111 -20042 -22351 -15033 -15088 -6992 8965 8443 18288
4029 18288 12483 -2840 -756 3282 2490 9222 17480 24428 18135 4554 -5363 -15133 -7294 -5579
4015 -5579 -6994 2669 10475 14763 8258 6308 4808 3768 2315 14040 16592 19716 4752 -5018
4001 -5018 -10359 -8045 -2853 -12328 -4282 -2476 -5276 -4135 -20736 -23599 -16516 -11130 -17421 -14322 -12300
3986 -12300 -15570 -19535 -27947 -24433 -24857 -36552 -36315 -25910 -24737 -28452 -23701 -32107 -26070 -15470
3972 -15470 2354 15763 5316 -12800 -18423 -16027 -8336 3384 8651 6907 -9198 -27115 -16713
3959 -16713 -13361 -19660 -22026 -15020 -4489 3095 12613 17013 11733 8139 11249 12091 8148 7183 -3754
3944 -3754 -6335 10691 14441 -3947 -22232 -16332 -5262 9876 13093 13143 21620 5386 -5938 -17259
3930 -17259 -12903 -17315 -22793 -22804 -20258 -990 3608 -2996 -11023 -18186 -14369 -9801 1211 -8255 -14510
3915 -14510 -7571 2638 908 -1381 -3717 -1235 15818 1705 -3549 10577 -4496 -17430 -33551
3902 -33551 -40219 -19088 -6822 1504 5599 -7725 -21707 -14820 -2755 1396 2514 -2559 1998
3889 1998 -2414 -2771 -5253 -2373 -7463 -7749 -8158 -11887 -16451 -3059 -6874 -9516 -19645 -27688 -26389
3874 -26389 -7687 14611 25574 6278 1913 13806 18530 14805 4561 -4092 -6759 -12820 -15231
3861 -15231 -14973 -6403 10989 6259 -9748 -15611 -25711 -16883 -12536 -5357 -3920 -7230 -4731 11026
3847 11026 -3646 -21403 -17198 -18344 -6574 -3818 2958 -1898 -6039 -16278 -18172 -440 -2713
3834 -2713 -11996 -10028 1245 175 -14375 -26910 -24597 561 19599 9443 6534 5403 8889
3821 8889 593 -4256 -9756 -18072 -25070 -24210 -1535 5564 10444 2203 -701 -5840 -19600 -13845 -4235
3806 -4235 -3005 -8643 -9024 -5369 -4268 -4369 2506 -6924 -7022 -12959 -2264 11572 18088 6212 182
3791 182 -437 4502 514 -9292 4723 8071 -4188 -879 12146 3630 -23453 -27383 -24972 -23758
3777 -23758 -19040 -17153 -23819 -33428 -45743 -30912 -20050 -21127 -17771 -12844 -13164 -19636 -11753 -9364
3763 -9364 -15467 -20431 -21153 -16351 -1964 11257 8901 2312 -5586 -8948 -7621 -1740 -2288 -4323 -3416
3748 -3416 -2204 2546 -5541 -9729 -23028 -24689 -8004 -5830 -6685 -13479 -12559 725 3845 -2011 5534
3733 5534 6598 956 -9236 -16672 -11442 -8945 -6252 -8070 -8752 -2372 1891 1084 7006 9399 6478
3718 6478 7390 -2394 156 -6761 -15494 -11439 -7993 7011 12222 17654 14705 25472 18083 11688 12645
3703 12645 22446 16550 3470 -6734 -11072 -8584 -7345 -223 -11049 -16180 -24168 -26194 -13665 -10512
3689 -10512 -10542 -2951 6766 23169 21901 14872 11603 -11157 -15960 -3459 5073 -399 -19979 -12970
3675 -12970 -6934 -5474 5110 8560 285 -7139 -2982 -2229 -4195 -3830 -8008 -15803 2443 7961 -8673
3660 -8673 -17866 -11077 -9273 -16165 -26628 -28893 -28338 -23046 -4520 -8345 -22531 -10894 -5518 -17736
3646 -17736 -17421 -4214 -4860 -471 1852 -8768 -13492 -11419 -18348 -22126 -16351 -32719 -25032 -22393
3632 -22393 -13177 -7391 -14046 -19533 -35317 -27959 -4379 12813 36790 31797 19401 2037 -4397
3619 -4397 -2705 -8170 -4203 -6903 -11977 -16654 -5701 -3325 -5414 -6104 -10642 -22602 -34370 -29062
3605 -29062 -7382 583 7804 -9671 -23415 -24238 -20008 -21932 -3021 5302 11993 3355 549 2193
3591 2193 17526 26816 12641 12337 10920 21045 19481 5119 -3941 -7937 6998 31045 26190 12733
3577 12733 13445 10263 -1662 3283 9137 5114 9807 24402 20373 7497 -13647 -20243 -19120 -8120
3563 -8120 2136 3119 3589 -5428 -11383 -20673 -17237 -18501 -15917 -29774 -32372 -37649 -30143 -24748 -18525
3548 -18525 -12429 -15050 -32430 -30471 -27391 -21447 -19406 -10662 -2707 -9802 -13862 -270 -9760 -10246
3534 -10246 -4809 2018 1852 2053 11 2558 4722 1469 13751 10469 -299 -16216 -16640 -26823
3520 -26823 -21434 -27706 -29562 -19500 -14657 -2129 4800 -2033 -4181 -1163 8739 7392 848 -2986
3506 -2986 -4530 9042 12823 6604 1548 -7237 -19727 -12215 3197 17883 9666 6694 -1230 3201
3492 3201 15081 11661 7846 -552 -6789 -8226 -7909 -2558 -1087 9970 7117 -2384 -4670 -14481 -8418
3477 -8418 -7916 -16601 -24548 -20563 -18963 -3860 10730 11402 21588 25908 9412 -6739 -4468 621
3463 621 -8040 -15562 -17322 -3503 -11568 -31687 -16042 -9548 -9901 -6354 -1774 6826 11710 7779 2426
3448 2426 -7033 -20210 -12815 909 -9235 -14816 -14793 -10551 -9761 5216 9803 7657 15833 9252 6864
3433 6864 5916 -5633 -6946 -12349 -5946 5634 -3203 -6608 -3381 17483 22824 7571 -2916 5928
3419 5928 25256 16007 3229 9968 17349 10834 11609 695 1815 -1536 8762 7340 -10383 -15566
3405 -15566 -24174 -37545 -27774 -13122 -10156 -4803 -7824 -22661 -21235 -17666 -14428 -11786 -522 14384
3391 14384 18222 10162 10252 -616 -5657 -5429 13261 13438 3177 2160 6014 10035 -1124 -12205
3377 -12205 -24219 -34282 -24751 -10908 -11447 -15070 -22783 -24696 -20704 -2977 15456 29934 29140 19421
3363 19421 297 -14132 -24257 -8185 350 -5151 -1939 5758 -4253 -1116 5957 -6063 -25838
3350 -25838 -16915 -6705 -808 2973 6373 2398 -6535 -1470 10882 16445 5502 -3520 -9615 -15519
3336 -15519 -15682 -14814 -9757 -5776 -7353 -11182 -22493 -24057 -19304 -12372 -15208 -18043 -25761 -28806 -16085
3321 -16085 -5597 -12091 -29562 -28570 -28326 -10673 -4144 -5637 -4275 -9689 -10234 -6441 -20057 -19405 -28488
3306 -28488 -31303 -13401 -10106 -15725 -11995 1469 2820 -8556 -13105 -21977 -12869 -20295 -14287 4549
3292 4549 18481 9811 -3701 6107 17015 4725 -11190 -25600 -23324 -21431 -16396 -10404 -13771
3279 -13771 -8002 -4224 -3683 -6861 -6596 -3998 -4148 -6644 -26235 -26361 -23828 -10123 3706 13960 7209
3264 7209 -5686 -9716 -12795 -8321 -2925 -342 11346 13248 7594 -1264 3286 18477 15973 988
3250 988 -20125 -20030 -6340 -6953 -1535 742 258 -10197 -9373 -30137 -46396 -36006 -11250 7753
3236 7753 21099 19702 8137 -3960 -23207 -36985 -28967 -7399 4358 10879 14053 16987 -759
3223 -759 -6498 -7576 -11836 -7477 4839 16704 49 -10321 -20471 -13847 -7776 181 22279 19395
3209 19395 14874 8310 16702 20662 17808 14625 3825 12175 11773 8033 2670 -656 994 -7729 -2386
3194 -2386 -4132 -9057 -9999 -6221 -11976 -2900 -683 -9405 -11538 -1050 7284 -2745 -1534 7656 -10907
3179 -10907 -13613 -11645 -6935 -745 5391 12699 6756 -7491 -6908 2782 -4587 -13751 -16439 -26255 -15185
3164 -15185 -13582 -12043 -3913 1438 -4341 -12644 -25010 -25104 -9949 -9955 -7898 -5370 -5349 -8348 -9457 -12091
3148 -12091 1285 5668 4489 -2230 1355 9642 12654 2204 -4384 -14564 -29303 -28257 -16452
3135 -16452 -16885 -12187 -6722 -5185 -15359 -12892 -12349 -16581 -8840 -16399 -4943 -4360 -1082 13771 6888
3120 6888 1357 2921 11557 9071 2701 -16565 -10670 -8324 -1112 6857 11311 -451 -8962 -14414
3106 -14414 -20218 -26419 -21498 -9006 -6233 -1612 917 -2900 -18422 -30110 -22482 -18626 -31640 -13976
3092 -13976 4559 -8208 -7666 -6744 -16332 -20549 -13114 -3933 -2749 4755 7161 -8609 -19542 -18582
3078 -18582 -7971 -2579 -4523 2172 -8093 -22140 -3719 16612 16611 14049 -5094 -19746 -6232
3065 -6232 -6084 8138 4012 5331 11494 4912 -9618 -6137 3644 2322 7764 -3131 -16052 -22481
3051 -22481 11812 29536 30369 23101 16679 24020 11808 -2494 -9367 -3069 -11934 -17106 -14427 -7648
3037 -7648 640 2545 5996 -89 -1143 4771 952 8005 12812 -2150 -12123 -6706 7458 10219
3023 10219 10507 5577 -15830 -35412 -18917 5200 19528 20547 17347 6776 2869 -15457 -22868
3010 -22868 -10188 4065 3693 -6267 1362 5011 -11986 -19698 -10155 4760 4817 -623 -7476 -12651
2996 -12651 -7299 -9926 -16743 -15756 -16482 -21969 -19605 -7089 -3633 -4303 4604 2628 870 5456 1807
2981 1807 -15018 -9901 2544 9436 18606 22763 18981 1630 -14509 -9311 -11956 -1457 22383
2968 22383 13408 10880 1668 -14233 -17825 -4740 2586 7160 7430 -4446 -20002 -26040 -14133 1209
2954 1209 3024 -6509 -14580 2235 25930 29438 36960 31523 799 -10476 -762 20157 27962 6172
2940 6172 -2408 4259 9366 5648 13791 4331 2042 -496 -1478 -13615 -13218 -10119 241 4792 -8862
2925 -8862 -5992 -5400 -11610 -10199 -7145 -5249 -5055 -8878 -7982 -9605 -7773 -9878 -7380 1447 -1861 -9755
2909 -9755 -14747 -19159 -14757 -16004 -5214 10515 11646 3501 3520 -15564 -22436 -23983 -26991 -10404
2895 -10404 -842 -8336 -24948 -13624 1525 8307 -1313 -9576 -11894 -8719 -7901 -10308 8142 14921
2881 14921 11134 8873 15977 17158 14778 14719 17478 12038 20015 15805 14460 7496 1290 -4812 -3303
2866 -3303 -6994 -266 -8004 -16734 -11108 -9309 -16112 -24297 -17100 -20796 -19022 -21882 -14452 -10500 -20935
2851 -20935 -13118 -23823 -35402 -31731 -23582 -21421 -6931 640 4922 4446 -7172 -15666 -12115 -8837
2837 -8837 -6608 -2323 -4022 -3105 6619 10933 6001 14180 16789 17410 22677 23833 10788 837 4177
2822 4177 2596 -1091 10985 18905 19585 20711 21973 18825 14515 1418 7167 5462 -413 -4326 2353
2807 2353 -1195 3351 2075 -2340 -8016 -6565 -6194 3239 6968 10567 13206 15418 -863 1276 15007
2792 15007 11473 6967 -6868 -6412 -7706 -1062 12354 8232 -3548 3345 -2030 -2347 -5173 -9473
2778 -9473 1562 8527 8464 9160 -8242 -14551 -10248 -4004 -138 -4947 -3262 4986 6358 2993 -2257
2763 -2257 -1623 2083 14508 9311 5821 4732 4995 5435 -12336 -20960 -6224 -4068 -3357 -6623 6055
2748 6055 11184 8493 3827 6981 4950 -8685 -1569 14381 12547 -5176 -13356 -25749 -25886 -16001
2734 -16001 -11154 5648 6181 1624 7948 12043 7766 -4024 -940 -5762 -7680 -1145 25361 25604
2720 25604 18775 15602 -4784 -14641 -15151 -18323 -9382 -11650 -12099 1234 7212 12730 8439 7822 8765
2705 8765 10724 12976 3244 9549 14868 5917 -7915 -20585 -24096 -22797 -20832 -26118 -21104 -31496
2691 -31496 -30410 -20274 -13888 -9129 -6407 4276 10378 10216 11144 12770 16507 14177 8430 -1894
2677 -1894 -8839 6266 1314 -3025 -6672 -1683 -6686 -5018 46 -143 5086 10221 10146 3881 544
2662 544 503 -10565 -15555 -19984 -23263 -14546 -12068 -7100 -13080 1852 22553 23834 30245 31040 25417
2647 25417 10831 -607 3189 7918 -70 -9288 -11246 -3039 -7094 -3665 -16921 -24597 -22543 -20248
2633 -20248 -16175 -4350 -20053 -19378 -20458 -17543 -17390 -7866 -14411 -11327 -6813 -14492 -10076 -13253 -6345
2618 -6345 536 -3296 -16124 -21706 -12418 -2280 16811 9738 3654 -1684 -538 15251 12195 6751
2604 6751 2870 -3725 4134 10804 5888 -2818 -13168 -13377 -2876 3572 7635 -3296 -6893 -203
2590 -203 14179 12558 -2104 -2428 2174 -379 -4934 -6428 8035 21510 13208 11615 1300 -5432
2576 -5432 -6118 -4920 -3316 3720 1137 -5090 7858 19198 15152 5956 4202 9979 21913 18516
2562 18516 12568 10024 10949 17454 15839 6576 6660 11766 -2947 -4389 -1743 -10912 -14715 -9387 -821
2547 -821 5149 11553 -691 -16807 -14732 -17444 -7941 3127 3869 7041 12070 13606 3548 2512
2533 2512 -33 14894 15547 1585 2882 6092 3301 4040 9813 22047 25558 17425 11286 22203
2519 22203 30476 21819 29456 24054 24297 30507 20098 17995 9729 3031 12019 22043 12606 4344
2505 4344 -10671 -2720 6913 10658 15775 9312 -4562 -1569 2058 -5375 943 -6145 -7328 -3575
2491 -3575 -4857 -1137 -7307 -25579 -27912 -6699 15862 12775 7652 11085 2080 -20342 -19670 -12307
2477 -12307 -3546 1269 -7518 -3946 865 15103 30122 29241 12418 -12716 -23863 -14150 -1189
2464 -1189 19819 17314 17592 4281 -6123 -3612 -12021 -9736 -1781 8157 10418 5588 -8651 642
2450 642 11785 18263 7930 12197 13510 13043 6375 2335 -4728 -7355 -4022 -4394 8807 15423 16674
2435 16674 2502 -16097 -14307 -10936 1801 15112 13173 9452 3586 -20983 -13700 -599 -2642
2422 -2642 -13811 -4266 18349 29460 12796 397 -1900 -8737 -12272 -2248 -7981 -7852 -1032 9048
2408 9048 9308 -10998 -20095 -19480 -8868 -90 -2769 4876 6274 -3026 4961 1620 506 -10586 -12186
2393 -12186 -7673 -7035 9573 4948 -9840 -8864 -5904 822 5230 12409 10034 6213 -1882 995 -1893
2378 -1893 -12820 -16191 -8448 -5100 75 2421 4486 7625 12810 12396 6828 11891 12655 19409 14032
2363 14032 2215 -7298 -5164 6073 -643 -5693 -12093 -11030 -7929 -12360 -4986 -3865 -12169 -15603
2349 -15603 -6614 -101 -8701 -16320 -26046 -27613 -26735 -33197 -29620 -14871 3194 6251 5122 -892
2335 -892 -15095 -9767 2213 1971 -4102 -12630 -25188 -36247 -32417 -16481 -7402 -7466 -14193 -13800 -4792
2320 -4792 6999 4805 950 -237 3282 35 7376 22453 19883 9705 9046 12494 5052 6048 8835
2305 8835 17211 25730 16213 6187 684 1881 -784 2355 17365 11912 19840 27733 11927 13363
2291 13363 18560 8293 2252 -2319 3600 4832 3294 -1280 -3029 14825 26094 2691 5330 4459
2277 4459 -4825 1131 -878 6271 24797 27260 25273 10441 4447 3354 9008 3984 -6776 -1306
2263 -1306 -10890 -17742 -13227 -9797 -8499 1895 8913 10523 8513 15741 18804 14417 4683 -2643 -5371
2248 -5371 -7041 3477 5218 5497 3179 11678 12211 14102 10847 -5336 -21897 -17217 -11793 2796
2234 2796 8445 4476 -2873 -4743 -4514 -3610 3288 10485 14456 11870 8639 15205 8184 4900 4838 7504
2218 7504 -6692 -4756 1319 -3970 -3121 10970 16364 16902 651 6899 28525 32114 14109 -3286
2204 -3286 1979 10724 5074 3579 -3124 -365 -7595 -7944 -11502 -15666 -20414 -24244 -12382 -5579 1108
2189 1108 7165 11961 5072 -14094 -16601 -13048 -6238 10509 13093 -689 4612 18942 23927 21267
2175 21267 3528 -2361 5794 7802 1886 -6230 1243 11586 6450 -8566 -5214 6420 5561 6458
2161 6458 10342 20879 10451 19504 8401 3955 2353 -2078 -9777 -17611 -20768 -20441 -22169 -10946
2147 -10946 -3322 -8620 -6289 -6276 -9505 -8959 -9193 -22461 -17510 4889 16624 14638 -1618 -15909
2133 -15909 -14627 -6979 -12501 -2707 9277 16787 5525 912 -7850 -11254 -8496 -3154 -5016 -6797
2119 -6797 177 -4203 3134 1910 5174 8217 3777 812 -1349 2927 7777 10041 2675 -7371 -8284
2104 -8284 -8723 -9318 -838 -574 -654 -2202 9552 6339 -3896 -15509 -17013 -17571 -12527 -28252 -15108
2089 -15108 -61 -19 -7917 -12562 -23381 -24573 -9701 1159 5803 11150 7819 8024 4130 251
2075 251 -2696 -3817 -12814 -8317 -2405 -13969 -11745 -1826 -408 3364 2575 2971 9203 5637 -1559
2060 -1559 -3911 -6119 -46 19558 21004 23420 22345 9941 -6810 -7201 941 6329 10613 5909
2046 5909 14490 9684 -3580 -3644 24 -6597 -8533 -6191 -3857 -5003 -15812 -12556 4086 7813 13094
2031 13094 2416 -625 -13240 -22578 -21681 -13214 -18908 -6463 6922 -1870 -2374 2913 -6005 -10610
2017 -10610 -18848 -18135 -18654 -24256 -16864 -13094 -16381 -5770 6600 7895 2857 -2683 -2131 -479 9951
2002 9951 23922 22493 14439 2652 2384 8355 5013 505 -8734 -10366 -10477 -11126 -17241 -4901 -4992
1987 -4992 -13091 -13854 -9167 -3767 6555 7710 20422 18504 7216 -5826 -8083 9469 18031 21907
1973 21907 16962 6106 6547 18453 25009 29399 19150 14718 24479 19213 9734 16186 11641 7292
1959 7292 3191 18884 22898 23795 14059 21686 14485 -4194 6330 9428 2428 4678 3628 3969 4722
1944 4722 3818 -12155 -19740 -18697 -23061 -15909 -11706 2084 3561 12643 12057 8209 10643 -9705 -9348
1929 -9348 1233 -2180 4422 3082 -6735 4605 3056 2470 -6374 -10406 -19375 -17963 -16623 -16589 -14743
$$ [...]
##END NTUPLES=NMR SPECTRUM
##END=
