##TITLE=Analysis number 327446
Compound Code cc 23816
Book Reference 486/122
Project Code adrs
Chemist Name simons
##JCAMPDX= 6.0         $$ Bruker NMR JCAMP-DX V2.0
##DATA TYPE= NMR SPECTRUM
##DATA CLASS= NTUPLES
##ORIGIN= Bruker BioSpin GmbH
##OWNER= nmr
$$ XWIN-NMR		Version 3.5
$$ Mon Mar 26 14:15:34 2007 GMT Daylight Time (UT+1h)  MAYBRIDGE\nmr@NMR_250MHZ
##.OBSERVE FREQUENCY= 250.131544655141
##.OBSERVE NUCLEUS= ^1H
##.ACQUISITION MODE= SIMULTANEOUS (DQD)
##.ACQUISITION SCHEME= undefined
##.AVERAGES= 16
##.DIGITISER RES= 18
##SPECTROMETER/DATA SYSTEM= dpx250
##.PULSE SEQUENCE= zg30
##.SOLVENT NAME= CDCl3
##.SHIFT REFERENCE= (INTERNAL, CDCl3, 0, 16.522)
##AUDIT TRAIL= $$ (NUMBER, WHEN, WHO, WHERE, WHAT)
$$ ##TITLE= Audit trail, XWIN-NMR		Version 3.5
$$ ##JCAMPDX= 5.01
$$ ##ORIGIN= Bruker BioSpin GmbH
$$ ##OWNER= nmr
$$ C:\u/data/dgb/nmr/ADRS/1900/pdata/1/auditp.txt
$$ ##AUDIT TRAIL=  $$ (NUMBER, WHEN, WHO, WHERE, WHAT)
(   1,<2007-03-26 14:15:13.16 +100>,<MAYBRIDGE\nmr>,<NMR_250MHZ>,
      <created by zg, POWCHK disabled, PULCHK disabled
       configuration hash MD5:
       49 4B E0 1D 92 C2 6B 37 9F E6 65 BC 52 41 86 1D
       data hash MD5: 64K
       53 4F EE C0 8D 63 78 83 46 DE E5 B0 D2 64 1B D9>)
(   2,<2007-03-26 14:15:24.58 +100>,<MAYBRIDGE\nmr>,<NMR_250MHZ>,
      <Start of raw data processing
       ef LB = 0.3 FT_mod = 6 PKNL = 1 SI = 32K 
       data hash MD5: 32K
       2F B2 79 7F 4B 9D 4C BE 7B 17 2A 7F 6F 93 95 5B>)
(   3,<2007-03-26 14:15:26.29 +100>,<MAYBRIDGE\nmr>,<NMR_250MHZ>,
      <apk 
       data hash MD5: 32K
       54 84 BD 02 4F FA 70 C7 40 60 69 DB 22 16 87 A4>)
(   4,<2007-03-26 14:15:26.99 +100>,<MAYBRIDGE\nmr>,<NMR_250MHZ>,
      <abs ABSG = 5 
       data hash MD5: 32K
       74 18 14 BF D7 60 B7 40 9D 2D BA 60 03 6F F6 11>)
$$ ##END=
$$ 
$$ hash MD5
$$ E4 FC C2 D5 CF 98 B1 15 DE 8B AD AA BC 39 41 35
##$RELAX= 
##$RELAX= 
##$RELAX= 
##$RELAX= 
##$RELAX= 
##$RELAX= 
##$RELAX= 
$$ Bruker specific parameters
$$ --------------------------
##$DU= <C:\u>
##$EXPNO= 1900
##$NAME= <ADRS>
##$PROCNO= 1
##$TYPE= <nmr>
##$USER= <dgb>
##$AMP= (0..31)
100 100 100 100 100 100 100 100 100 100 100 100 100 100 100 100 100 100 
100 100 100 100 100 100 100 100 100 100 100 100 100 100 
##$AQSEQ= 0
##$AQ_mod= 3
##$AUNM= <au_zg>
##$AUTOPOS= <36 >
##$BF1= 250.13
##$BF2= 250.13
##$BF3= 250.13
##$BF4= 250.13
##$BF5= 500.13
##$BF6= 500.13
##$BF7= 500.13
##$BF8= 500.13
##$BYTORDA= 1
##$CFDGTYP= 0
##$CFRGTYP= 5
##$CHEMSTR= <none>
##$CNST= (0..31)
1 1 145 1 1 1 1 1 1 1 1 1 1 1 1 1 1 1 1 1 1 1 1 1 1 1 1 1 1 1 1 1 
##$CPDPRG= <>
##$CPDPRG1= <>
##$CPDPRG2= <>
##$CPDPRG3= <>
##$CPDPRG4= <mlev>
##$CPDPRG5= <mlev>
##$CPDPRG6= <mlev>
##$CPDPRG7= <mlev>
##$CPDPRG8= <mlev>
##$CPDPRGB= <>
##$CPDPRGT= <>
##$D= (0..31)
0 1 0 0 0 0 0 0 0 0.06 0 0 0 0 0 0 0.0002 0 0 0 0 0 0 0 0 0 0 0 0 0 0 
0 
##$DATE= 1174914912
##$DBL= (0..7)
120 120 120 120 120 120 120 120 
##$DBP= (0..7)
150 150 150 150 150 150 150 150 
##$DBP07= 0
##$DBPNAM0= <>
##$DBPNAM1= <>
$$ [...]
##$SUBNAM7= <"">
##$SUBNAM8= <"">
##$SUBNAM9= <"">
##$SW= 20.6930455092707
##$SWIBOX= (0..15)
0 0 3 0 0 0 0 0 0 0 0 0 0 0 0 0 
##$SW_h= 5175.983436853
##$TD= 65536
##$TD0= 1
##$TE= 683.16
##$TE2= 300
##$TE3= 300
##$TEG= 300
##$TL= (0..7)
0 120 120 120 120 120 120 120 
##$TP= (0..7)
150 150 150 150 150 150 150 150 
##$TP07= 0
##$TPNAME0= <>
##$TPNAME1= <>
##$TPNAME2= <>
##$TPNAME3= <>
##$TPNAME4= <>
##$TPNAME5= <>
##$TPNAME6= <>
##$TPNAME7= <>
##$TPOAL= (0..7)
0.5 0.5 0.5 0.5 0.5 0.5 0.5 0.5 
##$TPOFFS= (0..7)
0 0 0 0 0 0 0 0 
##$TUNHIN= 0
##$TUNHOUT= 0
##$TUNXOUT= 0
##$USERA1= <user>
##$USERA2= <user>
##$USERA3= <user>
##$USERA4= <user>
##$USERA5= <user>
##$V9= 5
##$VALIST= <valist>
##$VCLIST= <CCCCCCCCCCCCCCC>
##$VD= 0
##$VDLIST= <DDDDDDDDDDDDDDD>
##$VPLIST= <PPPPPPPPPPPPPPP>
##$VTLIST= <TTTTTTTTTTTTTTT>
##$WBST= 1024
##$WBSW= 4
##$XGAIN= (0..3)
0 0 0 0 
##$XL= 0
##$YL= 0
##$YMAX_a= 321750
##$YMIN_a= -453543
##$ZGOPTNS= <>
##$ZL1= 120
##$ZL2= 120
##$ZL3= 120
##$ZL4= 120
##$ABSF1= 16.522
##$ABSF2= -4.171173
##$ABSG= 5
##$ABSL= 3
##$ALPHA= 0
##$AQORDER= 0
##$ASSFAC= 0
##$ASSFACI= 0
##$ASSFACX= 0
##$ASSWID= 0
##$AUNMP= <proc_1d>
##$AZFE= 0.1
##$AZFW= 0.1
##$BCFW= 0
##$BC_mod= 0
##$BYTORDP= 0
##$COROFFS= 0
##$CY= 12.5
##$DATMOD= 1
##$DC= 0
##$DFILT= <>
##$DTYPP= 0
##$F1P= 14.0000005364418
##$F2P= -0.99999901652339
##$FCOR= 0.5
##$FTSIZE= 32768
##$FT_mod= 6
##$GAMMA= 0
##$GB= 0
##$INTBC= 1
##$INTSCL= 1
##$ISEN= 128
##$LB= 0.3
##$LEV0= 0
##$LPBIN= 0
##$MAXI= 10000
##$MC2= 0
##$MEAN= 0
##$ME_mod= 0
##$MI= 0
##$NCOEF= 0
##$NC_proc= -3
##$NLEV= 6
##$NOISF1= 0
##$NOISF2= 0
##$NSP= 0
##$NTH_PI= 0
##$NZP= 0
##$OFFSET= 16.522
##$PC= 1
##$PHC0= 230.5071
##$PHC1= 6.605664
##$PH_mod= 1
##$PKNL= yes
##$PPARMOD= 0
##$PSCAL= 4
##$PSIGN= 0
##$REVERSE= no
##$SF= 250.13
##$SI= 32768
##$SIGF1= 0
##$SIGF2= 0
##$SINO= 400
##$SIOLD= 32768
##$SREGLST= <1H.CDCl3>
##$SSB= 0
##$STSI= 32768
##$STSR= 0
##$SW_p= 5175.98343685301
##$SYMM= 0
##$S_DEV= 0
##$TDeff= 65536
##$TDoff= 0
##$TI= <Analysis number 999999
Compound Code 99
Book Reference 9
Project Code 9>
##$TILT= no
##$TM1= 0
##$TM2= 0
##$TOPLEV= 0
##$USERP1= <user>
##$USERP2= <user>
##$USERP3= <user>
##$USERP4= <user>
##$USERP5= <user>
##$WDW= 1
##$XDIM= 32768
##$YMAX_p= 344508668
##$YMIN_p= -134108
$$ End of Bruker specific parameters
$$ ---------------------------------
##NTUPLES= NMR SPECTRUM
##VAR_NAME=  FREQUENCY,     SPECTRUM/REAL,   SPECTRUM/IMAG
##SYMBOL=    X,             R,               I
##VAR_TYPE=  INDEPENDENT,   DEPENDENT,       DEPENDENT
##VAR_FORM=  AFFN,          ASDF,            ASDF
##VAR_DIM=   32768,         32768,           32768
##UNITS=     HZ,            ARBITRARY UNITS, ARBITRARY UNITS
##FACTOR=    0.157963299565203, 1,           1
##FIRST=     4132.6476996994, 0,             0
##LAST=      -1043.33573715361, 0,           0
##MIN=       -1043.33573715361, -134108,     0
##MAX=       4132.6476996994, 344508668,     0
$$ Real data points
##PAGE= N=1
##DATA TABLE= (X++(R..R)), XYDATA
$$ [...]
$$ plain form
18752 21961327 18317172 15015025 12254570 10311428 9064661 8323367 7938417 7806430
18744 7806430 7817496 7905051 8049971 8312469 8700596 9118584 9609719 10167579 10822492 11686567
18734 11686567 12894328 14407380 16134318 18194860 20648436 23408641 26678442 30349005
18726 30349005 33335008 34701960 34629063 34756827 35906649 38114875 41775782 47623046
18718 47623046 54432197 59858568 63064528 65872816 68400084 66326054 58022234 46872421
18710 46872421 37642936 29778368 23198012 18587842 15954080 14640697 13919424 13111594
18702 13111594 11855691 10141833 8533501 7098891 5874135 4864024 4167421 3681598
18694 3681598 3309690 2956758 2616725 2376917 2214780 2041449 1861115 1684570 1503047
$$ packed form
18752B1961327l644155l302147k760455j943142j246767p41294l84950j31987
18744G806430J1066Q7555J44920K62498L88127M17988M91135N57860O54913Q64075
18734A1686567J207761J513052J726938K060542K453576K760205L269801L670563
18726C0349005K986003J366952p2897J27764J149822K208226L660907N847264
18718D7623046O809151N426371L205960K808288K527268k074030q303820j1149813
18710D6872421r229485p864568o580356m610170k633762j313383p21273q07830
18702A3111594j255903j713858j608332j434610j224756j010111o96603m85823
18694C681598l71908l52932l40033k39808j62137j73331j80334j76545j81523
$$ plain form
18685 1503047 1355057 1188392 1017449 936989 882206 821177 756808 678499 636803 589424 563939
18674 563939 551290 521161 456805 426793 426757 443759 394969 382627 355864 359131 376743 345654
18662 345654 307750 296534 324374 329202 322137 297268 261794 250209 221965 199930 213482 223354
18650 223354 216531 211842 227666 245090 256904 289731 242710 199868 206512 238165 225840 209153
18638 209153 203181 201748 199513 206663 202533 196907 186339 192205 215660 224472 196837 184565 174432
18625 174432 197460 192636 175011 198204 187048 220804 212744 244124 302659 309916 326531 327995
18613 327995 349029 342316 326736 337835 356982 359003 375600 391911 456595 496051 459150 445886
18601 445886 486627 458678 471458 493764 522108 549021 581733 603874 571887 523414 449842
$$ packed form
18685A503047j47990j66665j70943q0460n4783o1029o4369p8309m1696m7379k5485
18674E63939j2649l0129o4356l0012l6J7002m8790j2342k6763L267J7612l1089
18662C45654l7904j1216K7840M828p065k4869l5474j1585k8244k2035J3552R872
18650B23354o823m689J5824J7424J1814L2827m7021m2842O644L1653j2325j6687
18638B09153n972j433k235P150m130n626j0568N866K3455Q812k7635j2272j0133
18625A74432K3028m824j7625K3193j1156L3756q060L1380N8535P257J6615J464
18613C27995K1034o713j5580J1099J9147K021J6597J6311O4684L9456l6901j3264
18601D45886M0741k7949J2780K2306K8344K6913L2712K2141l1987m8473p3572
$$ plain form
18590 449842 398677 397190 364478 312910 300268 334062 342772 345261 335415 294877 280526 262171
18578 262171 238201 210819 193572 180828 182015 171968 168444 179948 183921 175728 174380 161290
18566 161290 178980 206887 232078 242576 232804 218133 196634 204916 226059 198521 207405 250568
18554 250568 269596 283420 271667 274228 311497 360369 333861 282895 260232 256955 216508 190202
18542 190202 188657 194419 208105 208187 248910 238398 210099 214993 217532 214246 204413 212108 209255 168360
18528 168360 165538 155219 159131 166293 141954 120424 122769 127928 117691 104955 90689 107350
18516 107350 128854 127084 106871 94733 105529 102551 84526 102698 87660 91976 97402 85127
18504 85127 57919 63846 60289 68920 76541 102692 120725 156323 151776 138446 106335 65360 53905
$$ packed form
18590D49842n1165j487l2712n1568j2642L3794Q710K489r846m0538j4351j8355
18578B62171k3970k7382j7247j2744J187j0047l524J1504L973q193j348j3090
18566A61290J7690K7907K5191J0498r772j4671k1499Q282K1143k7538Q884M3163
18554B50568J9028J3824j1753K561L7269M8872k6508n0966k2663l277m0447k6306
18542A90202j545N762J3686Q2M0723j0512k8299M894K539l286r833P695k853m0895
18528A68360k822j0319L912P162k4339k1530K345N159j0237j2736j4266J6661
18516A07350K1504j770k0213j2138J0796k978j8025J8172j5038M316N426j2275
18504H5127k7208N927l557Q631P621K6151J8033L5598m547j3330l2111m0975j1455
$$ plain form
18491 53905 45125 44717 51992 61028 88922 110393 116702 116190 75131 48793 84739 125918 154211
18478 154211 112573 98924 77633 66599 81121 105660 88796 73740 69845 56587 41007 77937
18466 77937 116802 130202 111445 69124 46066 62406 94889 121440 138457 173827 157988 150104
18454 150104 146637 132220 144910 136081 123972 114529 108460 120076 132270 123266 112967 130258
18442 130258 166779 163931 148488 148691 145249 136151 143283 165856 168888 159575 163843 165987 181470
18429 181470 223817 259973 250466 212806 188000 163289 121135 102408 130857 141762 157932 195513
18417 195513 227003 286772 342163 369457 373190 330613 333804 367158 396202 418804 473687 496572
18405 496572 510739 557732 581648 629946 709773 751861 785123 850162 940672 1050953 1175333
$$ packed form
18491E3905q780m08P275R036K7894K1471O309n12m1059k6338L5946M1179K8293
18478A54211m1638j3649k1291j1034J4522K4539j6864j5056l895j3258j5580L6930
18466G7937L8865J3400j8757m2321k3058J6340L2483K6551J7017L5370j5839p884
18454A50104l467j4417J2690q829j2109r443o069J1616J2194r004j0299J7291
18442A30258L6521k848j5443K03l442r098P132K2573L032r313M268K144J5483
18429A81470M2347L6156r507l7660k4806k4711m2154j8727K8449J0905J6170L7581
18417A95513L1490N9769N5391K7294L733m2577L191L3354K9044K2602N4883K2885
18405D96572J4167M6993K3916M8298P9827M2088L3262O5039R0510J10281J24380
$$ plain form
18394 1175333 1348851 1591675 1894348 2179019 2494477 2801015 3127978 3434533 3752006
18385 3752006 4179481 4713678 5317604 6002807 6702742 7435089 8237198 9098444 10041882
18376 10041882 11063103 12216962 13621302 15359987 17602416 20549388 24308814 28998844
18368 28998844 34731757 41246273 48048385 53969528 57839820 58691623 56504690 51870476
18360 51870476 45764842 39970475 35201443 32095219 30982154 31799219 34413150 38567124
18352 38567124 43717265 49004577 53104453 54950411 53476583 49260907 42549875 34887233
18344 34887233 27521943 21187500 16155896 12434984 9810602 7957750 6667099 5689175
18336 5689175 4898590 4275373 3759097 3327834 2940576 2627439 2422885 2208933 2004534
$$ packed form
18394A175333J73518K42824L02673K84671L15458L06538L26963L06555L17473
18385C752006M27475N34197O03926O85203O99935P32347Q02109Q61246R43438
18376A0041882J021221J153859J404340J738685K242429K946972L759426M690030
18368B8998844N732913O514516O802112N921143L870292Q51803k186933m634214
18360E1870476o105634n794367m769032l106224j113065Q17065K613931M153974
18352C8567124N150141N287312M099876J845958j473828m215676o711032p662642
18344C4887233p365290o334443n031604l720912k624382j852852j290651r77924
18336E689175p90585o23217n16276m31263l87258l13137k04554k13952k04399
$$ plain form
18327 2004534 1815575 1683940 1613408 1552176 1525062 1504944 1425079 1269873 1096546 990748
18317 990748 905719 841727 768388 685677 596895 528109 480351 466368 467128 438312 421498 398965
18305 398965 354136 340224 314670 306631 307754 311963 325885 291766 239386 219169 207157 209605
18293 209605 203916 212769 197613 157586 159562 202995 187208 176323 166389 166724 168905 147209 123190
18280 123190 152939 130216 138773 121777 123240 137352 154396 151283 125420 107731 93418 114553
18268 114553 121281 120557 152672 153976 155701 194316 195257 168649 176590 193798 183637 169097 192891
18255 192891 236807 243280 265209 290069 335826 340478 364260 370238 379108 421706 452432 465735
18243 465735 419280 386538 381976 410048 407887 395125 382371 313966 254834 209537 197519 196100
$$ packed form
18327B004534j88959j31635p0532o1232k7114k0118p9865j55206j73327j05798
18317I90748q5029o3992p3339q2711q8782o8786m7758j3983P60k8816j6814k2533
18305C98965m4829j3912k5554q039J123M209J3922l4119n2380k0217j2012K448
18293B09605n689Q853j5156m0027J976M3433j5787j0885r934L35K181k1696k4019
18280A23190K9749k2723Q557j6996J463J4112J7044l113k5863j7689j4313K1135
18268A14553O728p24L2115J304J725L8615R41k6608P941J7208j0161j4540K3794
18255A92891M3916O473K1929K4860M5757M652K3782N978Q870M2598L0726J3303
18243D65735m6455l2742m562K8072k161j2762j2754o8405n9132m5297j2018j419
$$ plain form
18231 196100 185637 152500 141349 145640 154348 153667 166073 144194 160606 146241 127098 137124
18219 137124 132640 117452 95846 89139 106213 101801 99170 131812 103087 116011 178457 214648
18207 214648 190726 201319 205278 202855 197434 204133 238135 277200 280698 284467 304462 279977 278234
18194 278234 293519 327495 309988 264927 242771 237706 244418 228187 211313 193346 210637 238325
18182 238325 286905 265465 204674 156911 121718 113133 122258 139633 114912 119120 95692 89575
18170 89575 82230 94672 134706 143833 159996 152414 143990 124779 101505 115229 100663 81807
18158 81807 88421 96540 115747 145337 126280 114922 130080 146634 164525 131479 137444 174236
18146 174236 182648 218151 220835 227176 264749 270659 300037 357891 417617 468617 523039 640056
$$ packed form
18231A96100j0463l3137j1151M291Q708o81J2406k1879J6412j4365j9143J0026
18219A37124m484j5188k1606o707J7074m412k631L2642k8725J2924O2446L6191
18207B14648k3922J0593L959k423n421O699L4002L9065L498L769J9995k4485j743
18194B78234J5285L3976j7507m5061k2156n065O712j6231j6874j7967J7291K7688
18182B38325M8580k1440o0791m7763l5193q585R125J7375k4721M208k3428o117
18170H9575p345J2442M0034R127J6163p582q424j9211k3274J3724j4566j8856
18158H1807O614Q119J9207K9590j9057j1358J5158J6554J7891l3046N965L6792
18146A74236Q412L5503K684O341L7573N910K9378N7854N9726N1000N4422J17017
$$ plain form
18134 640056 865572 1103555 1248312 1388849 1577840 1791920 2093971 2523744 2982773 3352351
18124 3352351 3765953 4190002 4580819 5053534 5464492 5787649 6176692 6719472 7578679
18115 7578679 8836524 10347770 12341789 15181488 18861039 23170260 28636182 35500841
18107 35500841 41063100 41458455 35302882 27798956 21676331 15998024 11034289 7681874
18099 7681874 5719506 4524369 3664554 2981398 2463076 2053299 1743166 1465761 1267918
18090 1267918 1136066 1017461 890129 764371 661684 595246 551859 474802 421408 416919
18080 416919 394086 372355 338816 306378 280039 276463 254242 201112 171381 147145 155846 170010
18068 170010 157237 133356 116393 102385 76853 75954 68768 87042 114191 110023 124033 107423
$$ packed form
18134F40056K25516K37983J44757J40537J88991K14080L02051M29773M59029L69578
18124C352351M13602M24049L90817M72715M10958L23157L89043N42780Q59207
18115G578679J257845J511246J994019K839699L679551M309221N465922O864659
18107C5500841N562259L95355o155573p503926o122625n678307m963735l352415
18099G681874j962368j195137q59815o83156n18322m09777l10133k77405j97843
18090A267918j31852j18605j27332j25758j02687o6438m3387p7057n3394m489
18080D16919k2833k1731l3539l2438k6339l576k2221n3130k9731k4236Q701J4164
18068A70010j2773k3881j6963j4008k5532q99p186J8274K7149m168J4010j6610
$$ plain form
18056 107423 111814 128275 134217 82634 59403 76180 90475 98488 90011 94502 100030 110976 86768
18043 86768 33139 2919 -34794 -16940 2876 -16169 -7155 -19528 -10526 7694 50665 61820
18031 61820 55318 32831 10043 -21976 2249 28149 38561 31120 15784 28501 42029 30443
18019 30443 23228 36695 18400 -16020 -42576 -52074 -51520 -43366 -28393 -34979 -21778 -16762 -1350
18006 -1350 14623 23152 47894 49211 14709 -6872 16859 8888 4995 -4562 -1861 -20476 -2568
17993 -2568 26771 33356 15221 -17271 -23385 5048 29397 25032 19958 32859 37083 51647 56273
17980 56273 77922 48899 11547 -11968 3725 13317 -5838 -18173 -28008 3196 35041 43500
17968 43500 19982 17667 4849 -1444 1342 -9760 -35931 -28632 -28825 10740 18237 12282 3442
$$ packed form
18056A07423M391J6461N942n1583k3231J6777J4295Q013q477M491N528J0946k4208
18043H6768n3629l0220l7713J7854J9816j9045R014j2373R002J8220M2971J1155
18031F1820o502k2487k2788l2019K4225K5900J0412p441j5336J2717J3528j1586
18019C0443p215J3467j8295l4420k6556r498N54Q154J4973o586J3201N016J5412
18006a350J5973Q529K4742J317l4502k1581K3731p971l893r557K701j8615J7908
17993b568K9339O585j8135l2492o114K8433K4349m365n074J2901M224J4564M626
17980E6273K1649k9023l7352k3515J5693R592j9155j2335r835L1204L1845Q459
17968D3500k3518k315j2818o293K786j1102k6171P299j93L9565P497n955q840
$$ plain form
17955 3442 -1075 3328 -304 -815 -32472 -52915 -41387 -48285 -56977 -27144 12301 16086 5887
17942 5887 13896 42237 47012 50265 11763 -15808 -8462 -30042 -36531 -33457 -35575 -52907 -37477
17929 -37477 -57496 -64387 -46744 -13884 -34010 -73557 -75599 -63785 -54350 -46298 -37425 -34685 -51760
17916 -51760 -59599 -22829 8958 8253 26655 27222 23259 4252 -2144 -1881 -6167 -37828 -18361 -17980
17902 -17980 -27601 -43241 -28512 -8751 -24010 -7601 6726 -7079 -17851 11162 13940 -2472
17890 -2472 22737 20851 10240 3220 -36694 -995 16902 3361 -25207 -30701 -8149 22072
17878 22072 -2777 -34860 -40238 -20793 -18841 -19520 -4175 5517 -22080 -41877 -44044 -10814 -20967
17865 -20967 -41754 -15676 906 -45575 -48480 -58987 -46855 6220 18823 3640 13520 30408
$$ packed form
17955C442m517M403l632n11l1657k0443J1528o898q692K9833L9445L785j0199
17942E887Q009K8341M775L253l8502k7571P346k1580o489L074k118j7332J5430
17929c7477k0019o891J7643L2860k0126l9547k042J1814R435Q052Q873K740j7075
17916e1760p839L6770L1787p05J8402N67l963j9007o396K63m286l1661J9467L81
17902a7980r621j5640J4729J9761j5259J6409J4327j3805j0772K9013K778j6412
17890b472K5209j886j0611p020l9914L5699J7897j3541k8568n494K2552L0221
17878B2072k4849l2083n378J9445J952o79J5345R692k7597j9797k167L3230j0153
17865b0967k0787K6078J6582m6481k905j0507J2132N3075J2603j5183R880J6888
$$ plain form
17853 30408 16049 708 -18498 -47663 -71396 -76339 -60121 -48423 -26060 -26741 -14261 -6053
17841 -6053 11739 4035 -18399 -59888 -27670 7502 5461 -14182 -44565 -76104 -101524 -73560
17829 -73560 -37427 -19368 -48450 -50234 -34693 10254 26512 34356 11365 18484 -2107 -8864
17817 -8864 -39474 -54801 -28193 -15046 2188 -12458 15406 14902 -1096 4588 28355 42025
17805 42025 21360 -22781 -29426 -42025 -22453 -7090 6084 -9654 -6548 -15936 9686 28047
17793 28047 48704 34256 47306 70342 52596 8143 -16491 -10664 13595 63820 83739 78250
17781 78250 61018 57047 87797 113406 123314 128135 129839 143879 183588 247270 281191 274014 294193
17768 294193 287558 222260 207616 176087 136801 108261 115442 161530 206395 263679 273083 245835
$$ packed form
17853C0408j4359j5341j9206k9165k3733m943J6218J1698K2363o81J2480Q208
17841f053J7792p704k2434m1489L2218L5172k041j9643l0383l1539k5420K7964
17829g3560L6133J8059k9082j784J5541M4947J6258P844k2991P119k0591o757
17817h864l0610j5327K6608J3147J7234j4646K7864n04j5998N684K3767J3670
17805D2025k0665m4141o645j2599J9572J5363J3174j5738L106r388K5622J8361
17793B8047K0657j4448J3050K3036j7746m4453k4634N827K4259N0225J9919n489
17781G8250j7232l971L0750K5609R908M821J704J4040L9709O3682L3921p177K0179
17768B94193o635o5298j4644l1529l9286k8540P181M6088M4865N7284R404k7248
$$ plain form
17756 245835 251132 264578 255683 237701 198144 146577 110298 92213 73348 48524 28980 27923
17744 27923 42461 26200 15931 13457 14045 32698 1320 -24099 15007 -8125 -19252 -14869
17732 -14869 4031 20481 21341 26439 27590 8518 -15455 -27100 -23107 -22169 -12542 -11552 -38793 -41078
17718 -41078 -20307 4843 34236 45824 23607 33504 26766 14574 -5409 2151 13062 31319
17706 31319 21677 2865 -721 -2718 -17351 -37299 -25996 -18210 -27601 -49848 -42843 -17881 -28058
17693 -28058 -34931 -19186 59745 66315 39351 19876 12173 -2373 43262 42683 38088 50906 40836
17680 40836 27225 25395 35711 40939 52262 48631 33008 -15780 -55641 -30610 -22861 -33401
17668 -33401 -21801 8861 32577 36843 18501 -27207 -28523 -35030 -36387 -18192 10720 36796
$$ packed form
17756B45835N297J3446q895j7982l9557n1567l6279j8085j8865k4824j9544j057
17744B7923J4538j6261j0269k474N88J8653l1378k5419L9106k3132j1127M383
17732a4869J8900J6450Q60N098J151j9072k3973j1645L993R38R627R90k7241k285
17718d1078K0771K5150K9393J1588k2217R897o738j2192j9983P560J0911J8257
17706C1319r642j8812l586j997j4633j9948J1303P786r391k2247P005K4962j0177
17693b8058o873J5745P8931O570k6964j9475p703j4546M5635n79m595J2818j0070
17680D0836j3611j830J0316N228J1323l631j5623m8788l9861K5031P749j0540
17668c3401J1600L0662K3716M266j8342m5708j316o507j357J8195K8912K6076
$$ plain form
17656 36796 9070 -23298 -47860 -61081 -4574 47527 22896 35365 45457 46940 49055 51411
17644 51411 34862 -6014 9960 -9076 -10995 -17786 -19084 -19260 1899 -1762 26868 19770 3182
17631 3182 20093 37551 44704 63185 28139 30358 66524 92982 81729 55180 58497 60860 69852
17618 69852 117078 144337 195969 256316 299154 347486 368176 337154 275071 207317 158171 136439
17606 136439 106009 128804 106866 89134 106602 133241 193019 260584 340447 310882 279081
17595 279081 239559 193317 144412 117898 56239 -447 -18869 -27875 -21238 -9049 -8949 -13804
17583 -13804 -19417 -32506 -26687 -27917 -39372 -13507 -2860 -13882 -25380 -29425 -20443 17860 31740
17570 31740 15748 1836 9940 2794 36170 68780 63953 53164 22294 12062 25612 35344
$$ packed form
17656C6796k7726l2368k4562j3221N6507N2101k4631J2469J0092J483K115K356
17644E1411j6549m0876J5974j9036j919o791j298j76K1159l661K8630p098j6588
17631C182J6911J7458P153J8481l5046K219L6166K6458j1253k6549L317K363Q992
17618F9852M7226K7259N1632O0347M2838M8332K0690l1022o2083o7754m9146k1732
17606A36439l0430K2795k1938j7732J7468K6639N9778O7565P9863k9565l1801
17595B79081l9522m6242m8905k6514o1659n6686j8422r006O637J2189J00m855
17583a3804n613j3089N819j230j1455K5865J0647j1022j1498m045Q982L8303J3880
17570C1740j5992j3912Q104p146L3376L2610m827j0789l0870j0232J3550R732
$$ plain form
17558 35344 -2110 -9519 8554 44845 87879 81266 35630 23298 31035 22194 17582 -14350 -11426
17545 -11426 14023 30309 50722 57638 28136 -11692 -26199 -11539 4156 7959 16336 10331
17533 10331 42759 57535 40511 30417 31726 12321 27224 17960 -12544 -18194 -20991 -32882
17521 -32882 -28075 -23270 -8793 -23175 -59460 -62515 -52971 -47763 -54101 -49640 -38743 -8630 30236
17508 30236 22104 14657 29931 46793 57621 46438 18498 -15237 -9805 19379 33377 14922
17496 14922 16609 30292 39233 26074 4312 26492 24808 -379 13702 9422 -58701 -52624 -52383
17483 -52383 -39513 -22871 -43241 -39831 -42792 -37639 -41128 -40726 -10705 14013 -3281 -6639 -19121
17470 -19121 -31553 -26747 -25169 -45449 -42546 2260 16549 -16013 -62607 -53655 -20828 4002
$$ packed form
17558C5344l7454p409J8073L6291M3034o613m5636j2332P737q841m612l1932K924
17545a1426K5449J6286K0413O916k9502l9828j4507J4660J5695L803Q377o005
17533A0331L2428J4776j7024j0094J309j9405J4903r264l0504n650k797j1891
17521c2882M807M805J4477j4382l6285l055R544N208o338M461J0897L0113L8866
17508C0236q132p447J5274J6862J0828j1183k7940l3735N432K9184J3998j8455
17496A4922J687J3683Q941j3159k1762K2180j684k5187J4081m280o8123O077K41
17483e2383J2870J6642k0370L410k961N153l489M02L0021K4718j7294l358j2482
17470a9121j2432M806J578k0280K903M4806J4289l2562m6594Q952L2827K4830
$$ plain form
17458 4002 29289 1084 7008 -139 18170 -5724 -30869 -33229 -45919 1390 40668 59213
17446 59213 32410 43855 58705 98941 122722 149729 200722 228199 158625 98428 53480 60680
17434 60680 79014 68568 46297 7593 5610 9751 43169 21032 254 -17641 -20835 -41523
17422 -41523 -28526 5901 9427 28469 28509 -7432 -42257 -77808 -69242 -59294 -85123 -77735 -39956
17409 -39956 -46915 -35947 -2082 -22978 -24497 -32651 -37062 -41121 -19526 19378 18426 16248 17993
17396 17993 40189 41243 4215 -44675 -58369 -51104 -41715 -32396 -24212 -35707 -66280 -111557 -124750
17383 -124750 -79703 -38440 4633 21754 9784 30237 28249 14551 4612 8642 37157 39337
17371 39337 7952 -1535 34568 32649 4085 10470 21080 736 13494 49638 32822 37123
$$ packed form
17458D002K5287k8205N924p147J8309k3894k5145k360j2690M7309L9278J8545
17446E9213k6803J1445J4850M0236K3781K7007N0993K7477o9574o0197m4948P200
17434F0680J8334j0446k2271l8704j983M141L3418k2137k0778j7895l194k0688
17422d1523J2997L4427L526J9042M0l5941l4825l5551Q566R948k5829P388L7779
17409c9956o959J0968L3865k0896j519q154m411m059K1595L8904r52k178J745
17396A7993K2196J054l7028m8890j3694P265R389R319Q184j1495l0573m5277j3193
17383a24750M5047M1263M3073J7121j1970K0453j988j3698r939M030K8515K180
17371C9337l1385r487L6103j919k8564O385J0610k0344J2758L6144j6816M301
$$ plain form
17359 37123 25257 -13745 -26839 -7043 27214 37083 37052 23886 -15249 -14762 -26024 -50576 -40975
17346 -40975 -33655 -23368 -25095 -19664 -14656 3408 19652 -6512 -1723 13999 27276 29693 23059
17333 23059 -1683 -2828 -3151 11618 18697 20947 61751 91467 98112 49755 28254 21317 47995
17320 47995 55309 42437 38721 61237 64281 73752 54482 34404 39748 44111 62612 79215 65624
17307 65624 60899 68248 101933 112114 93536 70474 61826 37389 26129 60727 58611 84381
17295 84381 72996 69673 34052 15534 38979 49654 54723 31052 25999 41056 21557 39329
17283 39329 46679 63053 69854 25219 33772 24622 -10223 -9579 -10299 -9320 5099 -13994 -8107 -20162
17269 -20162 -28922 -31830 -8245 -198 -14471 -10436 7558 -6232 -11224 11020 23484 506 7130
$$ packed form
17359C7123j1866l9002j3094J9796L4257R869l1j3166l9135M87j1262k4552R601
17346d0975P320J0287j727N431N008J8064J6244k6164M789J5722J3277K417o634
17333B3059k4742j145l23J4769P079K250M0804K9716O645m8357k1501o937K6678
17320D7995P314j2872l716K2516L044R471j9270k0078N344M363J8501J6603j3591
17307F5624m725P349L3685J0181j8578k3062q648k4437j1260L4598k116K5770
17295H4381j1385l323l5621j8518K3445J0675N069k3671n053J5057j9499J7772
17283C9329P350J6374O801m4635Q553r150l4845O44p20R79J4419j9093N887j2055
17269b0162q760k908K3585Q047j4273M035J7994j3790m992K2244J2464k2978O624
$$ plain form
17256 7130 -20466 -15251 6030 14164 -3339 -4447 3906 9343 22028 36390 29110 8899 -138
17243 -138 14210 3735 -15677 -21045 5137 25107 31269 37352 50594 60148 65343 61046 69406
17230 69406 70668 10107 -20559 7148 24409 17435 -8528 -3228 -33187 -34010 2932 18505 63211
17217 63211 78583 46749 45790 59998 60491 83080 74035 95474 108211 104143 90942 69357 48606
17204 48606 48633 37634 13977 2485 31779 85128 102066 95352 104725 82164 43442 20240 15875
17191 15875 -6232 10793 43079 62993 84168 91001 97551 132792 124550 100877 82260 103070
17179 103070 114752 102214 103655 125249 115976 85090 84981 77123 87394 103153 109354 105989 94287
17166 94287 99791 99108 90169 76949 119246 184202 198351 173652 137399 127282 127055 125287 95257
$$ packed form
17256G130k7596N215K1281Q134j7503j108Q353N437J2685J4362p280k0211r037
17243a38J4348j0475j9412n368K6182J9970O162O083J3242R554N195m297Q360
17230F9406J262o0561l0666K7707J7261o974k5963N300k9959q23L6942J5573M4706
17217F3211J5372l1834r59J4208M93K2589r045K1439J2737m068j3201k1585k0751
17204D8606K7j0999k3657j1492K9294N3349J6938o714R373k2561l8722k3202m365
17191A5875k2107J7025L2286J9914K1175O833O550L5241q242k3673j8617K0810
17179A03070J1682j2538J441K1594r273l0886j09p858J0271J5759O201l365j1702
17166I4287N504o83q939j3220M2297O4956J4149k4699l6253j0117k27j768l0030
$$ plain form
17153 95257 78129 93912 107756 109242 105867 123781 113409 115123 88707 66442 76576 93256
17141 93256 63417 54017 95985 105235 95846 114013 115001 107296 68620 105162 112533 128504 150529
17128 150529 157009 156519 164373 188420 236124 237936 192857 187146 197137 207427 210915 225184 241870
17115 241870 245622 235198 228408 247538 261945 276500 277364 283559 338497 372737 354316 364192 393993
17102 393993 417173 437203 459743 452268 477785 519810 618232 696709 765271 874075 961846
17091 961846 1071461 1153364 1285003 1498537 1779938 2166730 2545790 2856394 3146705 3549163
17081 3549163 4045340 4694621 5437604 6126979 6803886 7511317 8251229 9095028 10007108
17072 10007108 10900205 11864288 13058780 14608109 16614534 19147247 22449426 26917474
$$ packed form
17153I5257j7128J5783J3844J486l375J7914j0372J714k6416k2265J0134J6680
17141I3256k9839r400M1968R250r389J8167R88p705l8676L6542P371J5971K2025
17128A50529O480m90P854K4047M7704J812m5079n711R991J0290L488J4269J6686
17115B41870L752j0424o790J9130J4407J4555Q64O195N4938L4240j8421R876K9801
17102C93993K3180K0030K2540p475K5517M2025R8422P8477O8562J08804Q7771
17091I61846J09615Q1903J31639K13534K81401L86792L79060L10604K90311M02458
17081C549163M96177O49281P42983O89375O76907P07431P39912Q43799R12080
17072A0007108Q93097R64083J194492J549329K006425K532713L302179M468048
$$ plain form
17064 26917474 32576961 39208152 47013290 56095491 64476519 68063036 64556419 56036984
17056 56036984 47585785 40080705 33872074 29837861 28242403 28772842 31146635 35079617
17048 35079617 40328500 47030997 54785640 60763238 61081722 54510129 44808882 35720900
17040 35720900 27435542 20258572 15002930 11515005 9234631 7642568 6498099 5632807
17032 5632807 4930352 4367142 3870951 3445793 3080829 2733555 2463214 2235881 2001790
17023 2001790 1763350 1620877 1493037 1414603 1359897 1308079 1248708 1112093 947864 849570
17013 849570 783769 721547 683279 661337 612707 569546 510511 458175 440584 432999 443444 430924
17001 430924 365215 350583 333414 298742 298953 269077 267818 263077 262823 240040 228538 198588 203643
$$ packed form
17064B6917474N659487O631191P805138R082201Q381028L586517l506617q519435
17056E6036984q451199p505080o208631m034213j595458N30439K373793L932982
17048C5079617N248883O702497P754643N977598L18484o571593r701247r087982
17040C5720900q285358p176970n255642l487925k280374j592063j144469q65292
17032E632807p02455n63210m96191m25158l64964l47274k70341k27333k34091
17023B001790k38440j42473j27840p8434n4706n1818n9371j36615j64229r8294
17013H49570o5801o2222l8268k1942m8630m3161n9035n2336j7591p585J0445j2520
17001D30924o5709j4632j7169l4672K11k9876j259m741k54k2783j1502k9950N055
$$ plain form
16988 203643 207129 217147 193637 176113 179596 157480 159886 165854 168878 149500 148661 141547 133378
16975 133378 136421 159802 148792 134125 149244 151316 152672 139409 125747 116388 106007 82293
16963 82293 78816 69133 55119 58269 45942 48213 73206 86011 89320 77394 85329 110097 97051
16950 97051 93381 96181 97487 97401 93913 112753 86149 67204 76579 77163 60396 14754 7255 30759
16936 30759 54349 81333 64513 31039 19832 16533 47231 73821 95387 100339 71865 48895
16924 48895 32712 40699 55795 44878 63963 40518 -4038 -2924 26130 9401 -5528 -18012
16912 -18012 900 35405 52591 51976 51417 37329 27414 17644 23426 10522 7083 57162 109505
16899 109505 83131 36728 40497 32554 37052 27895 3928 348 18582 33661 62599 55716 44353
$$ packed form
16988B03643L486J0018k3510j7524L483k2116K406N968L024j9378q39p114q169
16975A33378L043K3381j1010j4667J5119K072J356j3263j3662r359j0381k3714
16963H2293l477r683j4014L150j2327K271K4993J2805L309j1926P935K4768j3046
16950I7051l670K800J306q6l488J8840k6604j8945R375N84j6767m5642p499K3504
16936C0759K3590K6984j6820l3474j1207l299L0698K6590K1566M952k8474k2970
16924D8895j6183P987J5096j0917J9085k3445m4556J114K9054j6729j4929j2484
16912a8012J8912L4505J7186o15n59j4088r915r770N782j2904l439N0079N2343
16899A09505k6374m6403L769p943M498r157k3967l580J8234J5079K8938o883j1363
$$ plain form
16886 44353 25903 10549 16871 20735 3593 -20844 4953 -606 -31156 -54452 -23600 -14640
16874 -14640 -20349 -2813 -9686 -24032 -25716 -18015 -10461 15374 4169 14734 39630 57041 30148
16861 30148 12982 37845 18461 -13117 -28527 -43451 -105 17355 45742 77697 58291 27484
16849 27484 9636 -7772 3180 55871 79024 55746 5348 14464 28265 62897 79134 28660
16837 28660 -11034 -21666 -13957 579 -3626 21318 7739 1198 -33939 -421 19451 -2669
16825 -2669 -443 9592 1778 -774 -16410 -24448 -18460 34323 63739 53360 35060 35519 -2104
16812 -2104 -20282 7651 33466 29586 28594 25434 22430 -773 -8205 -29033 2126 11546 -201
16799 -201 -28197 -25503 -11397 -3280 9240 2482 4182 -12725 -19990 -8195 -1527 8803 5549
$$ packed form
16886D4353j8450j5354O322L864j7142k4437K5797n559l0550k3296L0852Q960
16874a4640n709J7536o873j4346j684P701P554K5835j1205J0565K4896J7411k6893
16861C0148j7166K4863j9384l1578j5410j4924M3346J7460K8387L1955j9406l0807
16849B7484j7848j7408J0952N2691K3153k3278n0398R116J3801L4632J6237n0474
16837B8660l9694j0632P709J4536m205K4944j3579o541l5137L3518J9872k2120
16825b669K226J0035p814k552j5636q038N988N2783K9416j0379j8300M59l7623
16812b104j8178K7933K5815l880r92l160l004k3203p432k0828L1159R420j1747
16799b01k7996K694J4106Q117J2520o758J700j6907p265J1795O668J0330l254
$$ plain form
16786 5549 -1255 -6418 -12961 8959 27805 47303 54381 25916 -10867 -65055 -42900 -24672 -43601
16773 -43601 -30724 -15871 11711 8827 8859 -12529 -24287 -2040 28469 53914 44864 63291 33796
16760 33796 -17645 -33005 -9223 19115 25228 -13866 -47020 -60548 -61977 -48247 -12857 -19744
16748 -19744 -13802 3053 -13239 -24153 -22053 -47794 -33588 -40071 -33346 -9782 -16937 -21862 10369
16735 10369 26754 13832 10776 7424 21194 40981 32363 46184 71449 85731 73410 47799
16723 47799 54848 7792 -40167 -30622 -14145 6235 28392 18485 1333 39008 75643 46933
16711 46933 23412 21490 40232 55762 43153 59049 50904 60134 31253 -39 -22603 -4324
16699 -4324 23946 3617 -21011 -56774 -66114 -38461 -18659 -43005 -72408 -88265 -85851 -45280
$$ packed form
16786E549o804n163o543K1920J8846J9498P078k8465l6783n4188K2155J8228j8929
16773d3601J2877J4853K7582k884L2k1388j1758K2247L0509K5445r050J8427k9495
16760C3796n1441j5360K3782K8338O113l9094l3154j3528j429J3730L5390o887
16748a9744N942J6855j6292j0914K100k5741J4206o483O725K3564p155m925L2231
16735A0369J6385j2922l056l352J3770J9787q618J3821K5265J4282j2321k5611
16723D7799P049m7056m7959R545J6477K0380K2157r907j7152L7675L6635k8710
16711D6933k3521j922J8742J5530j2609J5896q145R230k8881l1292k2564J8279
16699d324K8270k0329k4628l5763r340K7653J9802k4346k9403j5857K414M0571
$$ plain form
16687 -45280 -22097 -4786 -17018 -26386 2593 11153 10282 23116 19159 -7697 -41048 -11999 -23883
16674 -23883 -3303 16811 15822 -7203 -42767 -4110 13285 2476 -15229 -8547 -1184 -18290
16662 -18290 -22751 6336 25711 26552 21475 -6564 -9040 -2045 32302 66922 42051 23230 -3593
16649 -3593 7952 -154 -20074 13798 26820 13402 -3593 -37726 -46827 -21329 -8703 -17124
16637 -17124 3608 30963 28726 -7687 30102 43049 49551 21694 9651 -92 2600 16292
16625 16292 14235 21719 43842 18509 19032 32427 5581 -3042 8374 22582 1348 -8499 -40542
16612 -40542 -58627 -73708 -65196 -37561 945 19544 -8858 -32213 -20085 -29272 -44061 -44266
16600 -44266 -38623 -3792 29210 51012 47098 36828 59385 68128 47401 29283 40991 41044 22126
$$ packed form
16687d5280K3183J7311j2232r368K8979Q560q71J2834l957k6856l3351K9049j1884
16674b3883K0580K0114r89k3025l5564L8657J7395j0809j7705O682P363j7106
16662a8290m461K9087J9375Q41n077k8039k476O995L4347L4620k4871j8821k6823
16649c593J1545q106j9920L3872J3022j3418j6995l4133r101K5498J2626q421
16637a7124K0732K7355k237l6413L7789J2947O502k7857j2043r743K692J3692
16625A6292k057P484K2123k5333N23J3395k6846q623J1416J4208k1234r847l2043
16612d0542j8085j5081Q512K7635L8506J8599k8402k3355J2128r187j4789k05
16600d4266N643L4831L3002K1802l914j0270K2557Q743k0727j8118J1708N3j8918
$$ plain form
16587 22126 -12130 -18599 -40634 -31265 -28165 -27621 -25351 -52993 -54685 -29645 -20051 162 9327
16574 9327 14115 15553 -6570 -34942 -27338 -8155 1514 12782 1596 7454 18473 18855 3391
16561 3391 -8127 -24561 -5552 4966 2411 -37304 -46979 -45956 -25221 -6761 1618 37866 41528
16548 41528 37173 22005 -5808 -1305 -7792 -20561 2026 5906 -18446 6322 23860 17123 7735
16535 7735 4300 16311 5847 -26837 755 14402 916 -3800 15210 5161 -8268 -12993
16523 -12993 -29830 -14157 34385 47469 57330 21427 23714 58381 84935 88162 82503 97230
16511 97230 88499 83612 108543 105678 116331 121973 146404 199548 203591 230359 300573 322661 301310
16498 301310 311887 262227 220736 199327 185047 166006 158490 160424 162928 201872 252523 285435
$$ packed form
16587B2126l4256o469k2035R369L100N44K270k7642j692K5040R594K0213R165
16574I327M788J438k2123k8372P604J9183R669J1268j1186N858J1019L82j5464
16561C391j1518j6434J9009J0518k555l9715r675J023K0735J8460Q379L6248L662
16548D1528m355j5168k7813M503o487j2769K2587L880k4352K4768J7538o737r388
16535G735l435J2011j0464l2684K7592J3647j3486m716J9010j0049j3429m725
16523a2993j6837J5673M8542J3084R861l5903K287L4667K6554L227n659J4727
16511I7230q731m887K4931k865J0653N642K4431N3144M043K6768P0214K2088k1351
16498C01310J0577m9660m1491k1409j4280j9041p516J934K504L8944N0651L2912
$$ plain form
16486 285435 341655 359665 307938 262170 224279 149289 109856 106429 105578 101327 73037 57030
16474 57030 42496 8672 -262 13775 19406 29613 49373 37272 28786 38375 35390 25379 31514
16461 31514 24520 46044 59966 22482 -15181 -19855 24938 59096 86382 86986 71369 26791
16449 26791 -9433 17564 24397 11569 -16507 -14652 5830 -20346 -23384 -12549 -15087 -22888 -13840
16436 -13840 7072 11357 10215 42635 40556 25586 1909 -16574 -30586 -26020 21056 35264
16424 35264 9363 -8952 -23612 -19375 -27166 4147 27014 -2985 -9332 -11869 -15722 -14254 -28022
16411 -28022 -54456 -59384 -32735 -35166 -70763 -56970 -38421 -11032 -1362 -3745 4021 21556 25122
16398 25122 25040 -27512 -52750 3509 32692 31831 17805 12515 11682 -11449 -13885 -16918 -30274 -12747
$$ packed form
16486B85435N6220J8010n1727m5768l7891p4990l9433l427q51m251k8290j6007
16474E7030j4534l3824q934J4037N631J0207J9760j2101q486R589k985j0011O135
16461C1514o994K1524J3922l7484l7663m674M4793L4158K7286O04j5617m4578
16449B6791l6224K6997O833j2828k8076J855K0482k6176l038J0835k538p801R048
16436a3840K0912M285j142L2420k079j4970k3677j8483j4012M566M7076J4208
16424C5264k5901j8315j4660M237p791L1313K2867k9999o347k537l853J468j3768
16411b8022k6434m928K6649k431l5597J3793J8549K7389R670k383P766J7535L566
16398B5122q2n2552k5238N6259K9183q61j4026n290q33k3131k436l033j3356J7527
$$ plain form
16384 -12747 2016 -22179 -21559 -13966 -51620 -59549 -31891 11675 -378 -12760 -30565 -26045 -30668
16371 -30668 -52262 -46909 -41396 -35741 -37023 -40707 -29905 -28465 -3917 10325 42197 39743 -39539
16358 -39539 -70191 -44830 -11692 16883 54336 29739 3276 -4108 26755 -4920 -26693 1711
16346 1711 26515 10855 348 20273 34560 46653 43334 55216 36271 13488 1901 -18346
16334 -18346 -18552 1341 -3363 -7614 -18669 -30775 -21321 12028 4700 -31710 -30453 11646 15015
16321 15015 23684 46095 10467 2935 10858 -5387 -24949 -11869 26744 46580 59361 67054
16309 67054 49503 19763 2751 -11142 2764 6085 19332 17327 -18960 -78178 -82767 -53638
16297 -53638 -22923 -22186 -14177 -29690 -41382 -29181 -5129 43835 34301 4992 7767 42115 53308
$$ packed form
16384a2747J4763k4195O20P593l7654p929K7658M3566j2053j2382j7805M520m623
16371c0668k1594N353N513N655j282l684J0802J440K4548J4242L1872k454p9282
16358c9539l0652K5361L3138K8575L7453k4597k6463p384L0863l1675k1773K8404
16346A711K4804j5660j0507J9925J4287J2093l319J1882j8945k2783j1587k0247
16334a8346k06J9893m704m251j1055j2106R454L3349p328l6410J257M2099L369
16321A5015Q669K2411l5628p532P923j6245j9562J3080L8613J9836J2781P693
16309F7054j7551k9740j7012j3893J3906L321J3247k005l6287n9218m589K9129
16297e3638L0715P37Q009j5513j1692J2201K4052M8964r534k9309K775L4348J1193
$$ plain form
16284 53308 54733 -12266 -31734 -7543 -14035 -18504 -20692 -9263 29625 32113 -8488 -18987 -35861
16271 -35861 -13704 -16966 -33521 -64978 -68675 -34223 15473 34002 -3478 -32557 -15803 16791
16259 16791 15394 -16489 -24875 -10633 -23481 -19561 9524 25937 11972 -5653 1829 -2152 20060
16246 20060 1930 -33640 -18970 -29213 -34368 -34336 13862 34306 2635 -21902 -35073 -54743
16234 -54743 -60603 -72983 -42034 -5842 39177 48306 34024 15135 10800 -31483 -39877 -18068
16222 -18068 -33702 -24283 5363 31186 18973 -24430 -28566 -6983 5683 32969 41826 13122
16210 13122 -12282 -12867 10578 13110 -7232 -10150 -44525 -57701 -19863 -24501 -32431 -24612 -20378
16197 -20378 4683 24404 5280 32839 42608 -17039 -45970 -57772 -28751 -30327 -22075 -1885
$$ packed form
16284E3308J425o6999j9468K4191o492m469k188J1429L8888K488m0601j0499j6874
16271c5861K2157l262j6555l1457l697L4452M9696J8529l7480k9079J6754L2594
16259A6791j397l1883q386J4242j2848L920K9085J6413j3965j7625P482l981K2212
16246B0060j8130l5570J4670j0243n155L2M8198K0444l1671k4537j3171j9670
16234e4743n860j2380L0949L6192M5019R129j4282j8889m335m2283q394K1809
16222a8068j5634R419K9646K5823j2213m3403m136K1583J2666K7286Q857k8704
16210A3122k5404n85K3445K532k0342k918l4375j3176L7838m638p930P819M234
16197b0378K5061J9721j9124K7559R769n9647k8931j1802K9021j576Q252K0190
$$ plain form
16185 -1885 29724 20353 -3792 -28759 -60316 -47443 -27495 -34146 -40435 -43320 -33255 -36591 -43282
16172 -43282 -40437 -18079 2373 12591 26283 38004 21459 -10628 -28380 -34130 -12156 -3393
16160 -3393 -15232 -41832 -59407 -60241 -46658 -23221 -3171 -33064 -30095 6788 9018 8809 -28369
16147 -28369 -36849 -24859 -44982 -42298 -37017 -23135 24174 42655 29180 19542 7079 2325 -6286
16134 -6286 -42151 -31685 -29536 -42758 -36768 -39061 -29852 -4975 21970 30735 31403 33550 16325
16121 16325 -22870 -58999 -64880 -33688 11901 -10432 -16673 -8388 27452 45191 32758 -9990
16109 -9990 -32000 -19702 -28363 -19434 -9721 19079 17413 896 12849 38843 4905 -29699 -26622
16096 -26622 -36459 -22025 14341 -13564 -20284 -12156 -12870 -22111 -32712 -29094 -5420 9309 21643
$$ packed form
16185a885L1609r371k4145k4967l1557J2873J9948o651o289k885J0065l336o691
16172d3282K845K2358K0452J0218J3692J1721j6545l2087j7752n750K1974Q763
16160c393j1839k6600j7575q34J3583K3437K0050k9893K969L6883K230k09l7178
16147b8369q480J1990k0123K684N281J3882M7309J8481j3475r638j2463m754q611
16134f286l5865J0466K149j3222N990k293R209K4877K6945Q765O68K147j7225
16121A6325l9195l6129n881L1192M5589k2333o241Q285L5840J7739j2433m2748
16109i990k2010J2298q661Q929R713K8800j666j6517J1953K5994l3938l4604L077
16096b6622r837J4434L6366k7905o720Q128p14r241j0601L618K3674J4729J2334
$$ plain form
16083 21643 18701 22616 -8744 -55275 -45862 -25827 -27498 -27388 13498 7409 2231 12652 17440
16070 17440 49695 63512 29914 19313 31941 43005 14156 -26575 -26186 -2512 29617 32242
16058 32242 36019 23378 10582 -16802 -21572 -21689 -15634 -24351 -37788 -51550 -40521 -46773 -28104
16045 -28104 -19032 -5381 16175 -2584 14167 -16010 -7646 9057 -3718 -11875 -28238 -3039
16033 -3039 42111 53573 27636 4672 33893 48242 25662 836 -8182 -5149 -14203 -26912
16021 -26912 -15938 -18645 -30305 -21579 -53977 -61666 -53841 -27105 10406 12536 16865 38110 64085
16008 64085 79290 53366 49430 69946 51720 22836 -2307 -1765 10860 33601 60382 34750
15996 34750 8720 -799 -12996 -27784 -1514 -4037 -4340 -5331 -24172 -58270 -42794 -5322 5315
$$ packed form
16083B1643k942L915l1360m6531R413K0035j671J10M0886o089n178J0421M788
16070A7440L2255J3817l3598j0601J2628J1064k8849m0731L89K3674L2129K625
16058C2242L777j2641j2796k7384m770j17O055q717j3437j3762J1029o252J8669
16045b8104R072J3651K1556j8759J6751l0177Q364J6703j2775q157j6363K5199
16033c039M5150J1462k5937k2964K9221J4349k2580k4826r018L033r054j2709
16021b6912J0974k707j1660Q726l2398p689P825K6736L7511K130M329K1245K5975
16008F4085J5205k5924l936K0516j8226k8884k5143N42J2625K2741K6781k5632
15996C4750k6030r519j2197j4788K6270k523l03r91j8841l4098J5476L7472J0637
$$ plain form
15983 5315 33759 34310 26742 24117 34792 77205 79199 -5324 -53847 -61348 -58230 -65226 -58945 -25339
15969 -25339 -59623 -69711 -36663 -3342 25460 28084 7885 27076 922 -38391 -52888 -72282
15957 -72282 -65385 -31611 -21920 -40176 -38042 6078 1308 -16023 -24670 -55271 -11621 -5944 12824
15944 12824 42399 52952 18367 -4229 -28012 -36648 -42036 -33936 -42329 -58040 -65818 -42861 -46470
15931 -46470 -40082 -37073 -36113 -37008 -31079 -25814 -9938 -21430 -7859 -1462 12555 4542 -2533 4180
15917 4180 18635 9202 -19254 -16622 31610 44263 73110 69603 7342 -26620 10932 17858 22928
15904 22928 -7964 -25026 2191 33629 -9936 -55237 -66986 -46714 -45466 -58865 -35231 -20917
15892 -20917 -35800 -52572 -53175 -16749 341 -15102 -15386 -12171 4131 -30432 -69737 -61407 -24278
$$ packed form
15983E315K8444N51p568k625J0675M2413J994q4523m8523p501L118o996O281L3606
15969b5339l4284j0088L3048L3321K8802K624k0199J9191k6154l9313j4497j9394
15957g2282O897L3774R691j8256K134M4120m770j7331q647l0601M3650N677J8768
15944A2824K9575J0553l4585k2596k3783q636n388Q100q393j5711p778K2957l609
15931d6470O388L009R60q95N929N265J5876j1492J3571O397J4017q013p075O713
15917D180J4455r433k8456K632M8232J2653K8847l507o2261l3962L7552O926N070
15904B2928l0892j7062K7217L1438m3565m5301j1749K0272J248j3399K3634J4314
15892b0917j4883j6772o03L6426J7090j5443k84L215J6302l4563l9305Q330L7129
$$ plain form
15879 -24278 16092 45935 17971 -55597 -60731 -20504 -8953 -11055 6953 -8624 -60935 -73010
15867 -73010 -34561 -13356 16571 40083 37998 2726 -9250 -12888 -10857 23534 58176 31738
15855 31738 4314 3042 -30 30834 50749 34224 46449 57675 34730 45082 32685 45957
15843 45957 74116 20728 -16095 -56386 -75111 -69732 -54599 -46453 -18884 -22871 -32152 -22276 -21398
15830 -21398 -22284 -13554 5138 34184 47940 43865 5557 -30968 -37199 -46985 -20909 -30012 -39758
15817 -39758 -23609 -6443 19115 53256 47231 53341 32287 16788 28100 8948 -20350 -5121
15805 -5121 -36526 -21452 1719 -15756 -27397 -45526 -22249 -8979 13084 699 -8041 13206
15793 13206 -1260 -23669 -15939 -26514 -48437 -52200 -65499 -42949 -5382 -21837 -18596 -18423 -32544
$$ packed form
15879b4278M0370K9843k7964p3568n134M0227J1551k102J8008j5577n2311j2075
15867g3010L8449K1205K9927K3512k085l5272j1976l638K031L4391L4642k6438
15855C1738k7424j272l072L0864J9915j6525J2225J1226k2945J0352j2397J3272
15843D5957K8159n3388l6823m0291j8725N379J5133Q146K7569l987r281R876Q78
15830b1398q86Q730J8692K9046J3756m075l8308l6525o231r786K6076r103r746
15817c9758J6149J7166K5558L4141o025O110k1054j5499J1312j9152k9298J5229
15805e121l1405J5074K3171j7475j1641j8129K3277J3270K2063j2385q740K1247
15793A3206j4466k2409P730j0575k1923l763j3299K2550L7567j6455L241J73j4121
$$ plain form
15780 -32544 -20557 -32529 -41328 -41655 -22855 -25258 -19523 -165 12834 7298 15721 -17836 -14799
15767 -14799 -8531 1855 7213 -14395 -29670 -37724 -11734 6181 13024 16414 12460 6061 -11526
15754 -11526 -12081 -14275 -52036 -57104 -24058 -24937 -10639 3281 6507 59920 87260 51784 43111
15741 43111 36215 -6043 -11406 28920 39071 31587 7908 -37982 -53993 -39870 -23290 -17872
15729 -17872 9602 -22115 -21279 -18771 11665 57090 74323 45397 12041 -9793 -21141 -16254
15717 -16254 -17163 -14736 -22109 7157 -6422 -47726 -35195 -9308 664 14775 42419 41907 4631
15704 4631 -43978 -32187 1753 21115 29917 10030 141 -23448 -25041 -20773 -20430 -8322 -10684
15691 -10684 15782 14146 23695 13067 60924 82274 39444 21041 1686 -13512 -20473 -16076
$$ packed form
15780c2544J1987j1972q799l27J8800k403N735J9358J2999n536Q423l3557L037
15767a4799O268J0386N358k1608j5275q054K5990J7915O843L390l954o399j7587
15754a1526n55k194l7761n068L3046q79J4298J3920L226N3413K7340l5476q673
15741D3111o896m2258n363M0326J0151p484k3679m5890j6011J4123J6580N418
15729a7872K7474l1717Q36K508L0436M5425J7233k8926l3356k1834j1348M887
15717a6254r09K427p373K9266j3579m1304J2531K5887R972J4111K7644n12l7276
15704D631m8609J1791L3940J9362Q802j9887r889k3589j593M268L43J2108k362
15691a0684K6466j636R549j0628M7857K1350m2830j8403j9355j5198o961M397
$$ plain form
15679 -16076 9977 -161 -27124 -81841 -63854 -46467 -39395 -39825 -46078 -64010 -51667 -54426 -43741
15666 -43741 -48382 -44760 -53903 -52647 -39958 -42228 -24261 -21247 -2206 265 -15922 -19795 -40992
15653 -40992 -27272 -42189 -28043 17296 -4163 -11860 42814 77035 92734 31163 38034 55653
15641 55653 43803 7101 12521 38838 6078 28800 50304 11590 -18340 -3107 12655 38884
15629 38884 42469 6688 -27722 -41773 -43733 -12856 -8912 -51926 -64547 -36068 50 19698
15617 19698 16628 -9307 -23047 -44723 -32565 -53596 -50431 -53716 -94301 -106400 -70188 -36279
15605 -36279 -2786 31021 25648 45192 37855 42195 45010 32046 -2174 1785 11212 -10105 -24333
15592 -24333 20264 6187 -3780 -32229 -16093 22763 27722 37671 -1053 -16789 -614 33639
$$ packed form
15679a6076K6053j0138k6963n4717J7987J7387P072m30o253j7932J2343k759J0685
15666d3741m641L622r143J256J2689k270J7967L014J9041K471j6187l873k1197
15653d0992J3720j4917J4146M5339k1459p697N4674L4221J5699o1571O871J7619
15641E5653j1850l6702N420K6317l2760K2722K1504l8714k9930J5233J5762K6229
15629C8884L585l5781l4410j4051j960L0877L944m3014j2621K8479L6118J9648
15617A9698l070k5935j3740k1676J2158k1031L165l285m0585j2099L6212L3909
15605c6279L3493L3807n373J9544p337M340K815j2964l4220L959R427k1317j4228
15592b4333M4597j4077r967k8449J6136L8856M959R949l8724j5736J6175L4253
$$ plain form
15580 33639 41286 1813 -29880 -22511 -2757 15317 50614 61732 69722 64148 66777 67668 22559
15567 22559 -9943 -42303 -42100 -40514 -31835 -5762 5129 -5299 -7880 -25601 -51396 -70896 -71042
15554 -71042 -44516 -44742 -40086 -31621 -38445 -58724 -66991 -42330 22404 100192 100102 66860 21854
15541 21854 -167 -4985 12128 30431 17368 19449 45300 38470 28353 12168 -1945 -28355
15529 -28355 -34756 -28670 -12872 -19898 -14835 25098 54626 65307 48353 -9083 -14433 11 42420
15516 42420 71242 25624 -21711 -10749 -1029 1526 19070 2578 -41080 -43833 -17136 13617
15504 13617 -3959 -21344 -22765 -1211 30257 75064 74667 76958 122494 84895 65709 76667
15492 76667 74431 21294 -6241 -3751 -14558 134 18266 21546 50448 56641 59366 60498 45201
$$ packed form
15580C3639P647l9473l1693P369J9754J8074L5297J1118P990n574K629Q91m5109
15567B2559l2502l2360K03J586Q679K6073J0891j0428k581j7721k5795j9500j46
15554g1042K6526k26M656Q465o824k0279q267K4661O4734P7788r0l3242m5006
15541B1854k2021m818J7113J8303j3063K081K5851o830j0117j6185j4113k6410
15529b8355o401O086J5798p026N063L9933K9528J0681j6954n7436n350J4444M2409
15516D2420K8822m5618m7335J0962R720K555J7544j6492m3658k753K6697L0753
15504A3617j7576j7385j421K1554L1468M4807l97K291M5536l7599j9186J0958
15492G6667k236n3137k7535K490j0807J4692J8132L280K8902O193K725J132j5297
$$ plain form
15479 45201 -4357 -9770 -35743 -41801 -39380 -35458 10363 22709 -1463 -24915 -35598 -30832 -32199
15466 -32199 -12822 -7610 -31703 -2172 19801 -25092 -45727 -13201 1562 14082 16024 2816
15454 2816 3942 -3404 27380 38251 18014 -19702 -16525 28745 10131 -32462 -40006 -33759 -48599
15441 -48599 -50406 -27279 -46326 -64048 -64705 -24727 -20142 -20463 -3715 -3995 32612 31871 -7677 -12650
15427 -12650 -26349 -30921 -25707 -2314 -8189 8677 66208 58862 16931 -4783 -19554 -40493
15415 -40493 -40748 -31259 -17826 -15068 -15452 -12086 -2946 24095 15008 -2044 16577 22382 -12592 -29273
15401 -29273 -2953 -6452 -5393 3226 -28734 -10822 18051 21324 42541 -6441 -24448 -33751 -3913
15388 -3913 5213 35936 37105 24165 32659 44060 35956 10955 -15314 -12344 12722 -3657 -30243
$$ packed form
15479D5201m9558n413k5973o058K421L922M5821J2346k4172k3452j0683M766j367
15466c2199J9377N212k4093K9531K1973m4893k0635L2526J4763J2520J942j3208
15454B816J126p346L0784J0871k0237l7716L177M5270j8614m2593p544O247j4840
15441d8599j807K3127j9047j7722o57L9978M585l21J6748k80L6607p41l9548m973
15427a2650j3699m572N214K3393n875J6866N7531p346m1931k1714j4771k0939
15415d0493k55R489J3433K758l84L366R140K7041r087j7052J8621N805l4974j6681
15401b9273K6320l499J059Q619l1960J7912K8873L273K1217m8982j8007r303K9838
15388c913R126L0723J169j2940Q494J1401q104k5001k6269K970K5066j6379k6586
$$ plain form
15375 -30243 -17447 10038 32115 11311 3869 -769 -21313 -25801 -1359 -109 4704 -19005 -8110
15362 -8110 -20997 -13342 -6429 -8110 -31878 -55907 -39784 -18784 -29780 -3461 220 -5341 -14608
15349 -14608 106 12390 -16927 -71298 -40367 -3201 -30375 -29067 -29208 -15887 -12409 -28104
15337 -28104 -11734 16953 18877 -7834 -49244 -53168 -25238 -8957 -24676 -24759 -11766 -18391 -91
15324 -91 -13912 11319 30413 3935 -22525 -11724 6907 -35179 -30868 -37066 -37447 -24073 5283
15311 5283 -982 -27495 -11083 33837 37512 25334 -12310 2133 14726 -32282 -50283 -48760
15299 -48760 -75645 -79435 -27931 17152 15247 7273 -8781 -2792 8991 3831 27205 -7768 -10136
15286 -10136 44638 48305 21556 16226 8989 -25772 -49610 -53203 -18815 12525 14971 -13457 -37203
$$ packed form
15375c0243J2796K7485K2077k0804p442m638k0544m488K4442J250M813k3709J0895
15362h110j2887P655O913j681k3768k4029J6123K1000j0996K6319L681n561r267
15349a4608J4714J2284k9317n4371L0931L7166k7174J308j41J3321L478j5695
15337b8104J6370K8687J924k6711m1410l924K7930J6281j5719q3J2993o625J8300
15324i1j3821K5231J9094k6478k6460J0801J8631m2086M311o198l81J3374K9356
15311E283o265k6513J6412M4920L675j2178l7644J4443J2593m7008j8001J523
15299d8760k6885l790N1504M5083j905p974j6054N989J1783n160K3374l4973k368
15286a0136N4774L667k6749n330p237l4761k3838l593L4388L1340K446k8428k3746
$$ plain form
15273 -37203 -50831 -39781 -20223 3749 -775 19708 6630 9867 -3247 3167 16906 42405
15261 42405 35829 25026 16521 62803 111041 93850 53469 59827 59456 46073 58109 41158 5553
15248 5553 2880 3865 -9653 -19179 -32053 -10351 -11318 -12871 -24324 -16354 23962 9453 -30972
15235 -30972 -40328 -21437 -21868 -19722 -27643 -52902 -47436 2720 43215 63117 44141 -8583 -421
15222 -421 7189 9450 -2575 15052 23020 26097 41356 26111 -1239 -1294 -15486 -15991 -36054 -39385
15208 -39385 -36490 -45255 -41923 -28876 -4733 21781 41314 24150 -14331 -20927 -23056 -23052 -12232
15195 -12232 6723 33133 53591 24807 -13296 -23368 -9686 11758 5736 13350 37424 38607
15183 38607 36234 38053 18789 5122 -6322 -12609 -4089 1156 -28999 -34437 -9802 -23437 -41921
$$ packed form
15273c7203j3628J1050J9558K3972m524K0483j3078L237j3114O414J3739K5499
15261D2405o576j0803q505M6282M8238j7191m0381O358l71j3383J2036j6951l5605
15248E553k673R85j3518r526j2874K1702r67j553j1453P970M0316j4509m0425
15235c0972r356J8891m31K146p921k5259N466N0156M0495J9902j8976n2724Q162
15222d21P610K261j2025J7627P968L077J5259j5245k7350n5j4192n05k0063l331
15208c9385K895q765L332J3047K4143K6514J9533j7164l8481o596k129MJ0820
15195a2232J8955K6410K0458k8784l8103j0072J3682K1444o022P614K4074J183
15183C8607k373J819j9264j3667j1444o287Q520N245l0155n438K4635j3635j8484
$$ plain form
15170 -41921 -80450 -69895 -34376 -1145 -23895 -45108 -28740 -52219 -31217 -11754 10230 -1163
15158 -1163 -30344 -2267 23346 40421 18757 -8265 -14089 -24256 -38960 -21100 -4249 -1592
15146 -1592 -40710 -50938 -38860 -33078 -20372 693 -27396 -49287 -57051 -33091 -16988 8836
15134 8836 28361 39774 22215 12933 33092 27040 -26770 -62963 -53264 -21744 13960 12034 24039
15121 24039 25618 -7035 -16996 -8451 18890 4889 -28043 -25574 4511 7188 11407 -21765 -20705
15108 -20705 6013 -19544 -23064 -16318 30879 56741 34157 -23558 -11080 12329 -3981 -10519
15096 -10519 -13137 -8330 9511 17703 5326 -22657 -36852 -13738 12702 -13840 -10874 4724
15084 4724 -10787 -30428 -20748 -17364 2957 -899 -19594 -6592 11832 25110 9776 -1719
$$ packed form
15170d1921l8529J0555L5519L3231k2750k1213J6368k3479K1002J9463K1984j1393
15158a163k9181K8077K5613J7075k1664k7022n824j0167j4704J7860J6851K657
15146a592l9118j0228J2078N782J2706K1065k8089k1891p764K3960J6103K5824
15134H836J9525J1413j7559r282K0159o052n3810l6193R699L1520L5704j926J2005
15121B4039J579l2653r961Q545K7341j4001l2932K469L0085K677M219l3172J060
15108b0705K6718k5557l520O746M7197K5862k2584n7715J2478K3409j6310o538
15096a0519k618M807J7841Q192j2377k7983j4195K3114K6440k6542K966J5598
15084D724j5511j9641R680L384K0321l856j8695J3002J8424J3278j5334j1495
$$ plain form
15072 -1719 -31733 -34477 -14128 -50761 -55056 -55636 -63605 -53683 -61229 -60196 -49324 -35384 -26305 -40863
15058 -40863 -47482 -1652 9639 -11314 -33115 -1572 30466 39483 39029 13918 20078 25260 37019
15045 37019 28729 -1213 -717 31518 18376 -11956 -19221 -2506 13215 -871 -7212 -31591 -27151
15032 -27151 5224 32672 23188 21734 37669 22175 9642 -111 9519 52794 76091 51793
15020 51793 35452 36727 48259 56110 52393 22901 -5669 -1738 5093 29780 10851 -258 -10300
15007 -10300 -31724 -66898 -62712 -19091 -10769 -22257 -10412 -21324 -17332 -48088 -87057 -88661
14995 -88661 -75139 -48469 -17150 -13664 -1186 9360 22141 82 -13084 2646 10554 -5703
14983 -5703 -28567 -9116 -3621 -12 -1755 980 4039 20612 26692 43086 37755 6120 1563
$$ packed form
15072a719l0014k744K0349l6633m295n80p969R922p546J033J0872J3940R079j4558
15058d0863o619M5830J1291k0953k1801L1543L2038R017m54k5111O160N182J1759
15045C7019q290k9942M96L2235j3142l0332p265J6715J5721j4086o341k4379M440
15032b7151L2375K7448r484j454J5935j5494j2533r753R630M3275K3297k4298
15020E1793j6341J275J1532P851l717k9492k8570L931O831K4687j8929j1109j0042
15007a0300k1424l5174M186M3621Q322j1488J1845j0912L992l0756l8969j604
14995h8661J3522K6670L1319L486J2478J0546J2781k2059j3166J5730P908j6257
14983e703k2864J9451N495L609j743K735L059J6573O080J6394n331l1635m557
$$ plain form
14970 1563 20763 17725 -11711 6009 45184 41071 39945 52480 58344 5280 -35978 -51299 -29562
14957 -29562 -25181 -59690 -60202 -35034 -41851 -36673 -30527 -13476 -10609 -13178 -15791 -17830 -27874 -19017
14943 -19017 10000 23100 -10519 -11609 -13029 -15430 -36141 -28383 -4043 15932 27079 14921
14931 14921 7824 -1216 28565 24353 6771 30095 20986 15816 686 -4977 -32437 -2157 37710
14918 37710 22579 1608 -17216 -50288 -29871 -22223 -28836 -7860 -5018 -16577 77 -16237
14906 -16237 -18599 6755 24356 26339 -10916 -16825 -9662 -967 -11467 -47684 -20105 15270 8672
14893 8672 15572 -3743 -20358 13587 34546 37550 43666 28840 41991 31546 28405 35692 10587
14880 10587 18442 54701 70533 31977 25065 30578 31401 18411 14184 24818 10404 -6227 -7414
$$ packed form
14970A563J9200l038k9436J7720L9175m113j126J2535N864n3064m1258j5321K1737
14957b9562M381l4509n12K5168o817N178O146J7051K867k569k613k039j0044Q857
14943a9017K9017J3100l3619j090j420k401k0711P758K4340J9975J1147j2158
14931A4921p097r040K9781m212j7582K3324r109n170j5130n663k7460L0280L9867
14918C7710j5131k0971j8824l3072K0417P648o613K0976K842j1559J6654j6314
14906a6237k362K5354J7601J983l7255n909P163Q695j0500l6217K7579L5375o598
14893H672O900j9315j6615L3945K0959L004O116j4826J3151j0445l141P287k5105
14880A0587P855L6259J5832l8556o912N513Q23j2990m227J0634j4414j6631j187
$$ plain form
14867 -7414 -7752 -15284 -24813 -2514 13447 -24306 -46268 -53642 -8995 33458 49186 34020 7581
14854 7581 1197 10955 18826 777 35 -13883 5125 -25636 -79114 -84089 -77172 -51969 -38449
14841 -38449 -40259 -44503 -31267 -9148 -36818 -28645 -7671 -32716 -54949 -38072 -30167 -54659
14829 -54659 -38305 -13928 -43170 -45573 -51437 -68344 -44326 6596 14402 -17755 -42595 -29205
14817 -29205 -30575 -24723 -26545 -9897 -27536 -28324 -33606 -38365 10566 40317 24173 -5775 6308
14804 6308 -2674 -587 -2325 14433 31154 15841 -2049 -9982 -19496 -21021 -8199 -16282 452
14791 452 18545 -5282 -9014 2384 14157 15154 -3760 8819 4101 -24403 -58263 -47511 -24265
14778 -24265 17975 23776 12703 38108 18284 -14923 -19567 -24443 -34106 -21551 13701 22078 14448
$$ packed form
14867g414l38p532r529K2299J5961l7753k1962p374M4647M2453J5728j5166k6439
14854G581o384R758P871j8049p42j3918J9008l0761n3478m975O917K5203J3520
14841c8449j810m244J3236K2119k7670Q173K0974k5045k2233J6877P905k4492
14829e4659J6354K4377k9242k403n864j6907K4018N0922P806l2157k4840J3390
14817b9205j370N852j822J6648j7639p88n282m759M8931K9751j6144k9948J2083
14804F308q982K087j738J6758J6721j5313j7890p933r514j525J2822q083J6734
14791D52J8093k3827l732J1398J1773R97j8914J2579m718k8504l3860J0752K3246
14778b4265M2240N801j1073K5405j9824l3207m644m876r663J2555L5252Q377p630
$$ plain form
14765 14448 -5100 -22584 -31889 -28471 -38062 -8987 -11778 -24862 -31891 -6557 11205 -11933 -12296
14752 -12296 -6611 -46 23627 25090 -26899 -27904 -13466 -48381 -42673 -47923 -55005 -83241 -51346
14739 -51346 -10929 8413 13402 29889 21312 34852 39694 22506 31405 42928 46080 39984 66142
14726 66142 75034 85691 71521 66061 58721 23255 -9640 -20009 24064 29895 54005 58915 22150
14713 22150 11736 34352 842 15712 -8311 -9227 1637 10709 -1986 -1026 -10650 -56596 -80898
14700 -80898 -81756 -19250 36055 48711 35252 15198 12688 19672 5536 30959 24462 -964 11418
14687 11418 -16616 -13002 -2381 -16758 32171 69773 53796 36802 41336 21444 -11195 4167
14675 4167 24766 14123 -9395 -40561 -4776 19063 -4936 -16656 -34151 -30999 -17696 1104
$$ packed form
14765A4448j9548j7484r305L418r591K9075k791j3084p029K5334J7762k3138l63
14752a2296N685O565K3673J463n1989j005J4438l4915N708n250p082k8236L1895
14739e1346M0417J9342M989J6487q577J3540M842j7188Q899J1523L152o096K6158
14726F6142Q892J0657j4170n460p340l5466l2895j0369M4073N831K4110M910l6765
14713B2150j0414K2616l3510J4870k4023r16J0864R072j2695R60r624m5946k4302
14700h0898q58O2506N5305J2656j3459k0054k510O984j4136K5423o497k5426J2382
14687A1418k8034L614J0621j4377M8929L7602j5977j6994M534j9892l2639J5362
14675D167K0599j0643k3518l1166L5785K3839k3999j1720j7495L152J3303J8800
$$ plain form
14663 1104 -16114 -41713 -10825 -17353 -34149 -37304 -80147 -72243 -33597 -8983 -7951 -32176 -22946
14650 -22946 -28651 -29792 1330 6688 -16871 -37779 -21179 21305 68587 28294 -18063 -31615
14638 -31615 -40543 -21514 2916 -15884 -39520 -25531 1272 37674 32412 64005 87847 61263
14626 61263 41494 34724 34694 58056 66259 42304 40724 50311 45269 33690 20907 26020 2199
14613 2199 12139 16407 5010 -33274 -30109 -8259 16028 16744 36452 41779 -11436 -30253 10596
14600 10596 68740 38128 10343 -10328 13806 9051 7683 8134 6707 13445 14649 438 -23049
14587 -23049 -26941 -15607 -1958 -26199 -44306 -14568 -8143 23959 16930 -4420 -42771 -40093
14575 -40093 5086 3034 22453 46684 42042 19320 401 27863 20859 -10082 -13857 -8608 33987
$$ packed form
14663A104j7218k5599L0888o528j6796l155m2843P904L8646K4614J032k4225R230
14650b2946n705j141L1122N358k3559k0908J6600M2484M7282m0293m6357j3552
14638c1615q928J9029K4430j8800k3636J3989K6803L6402n262L1593K3842k6584
14626F1263j9769o770l0K3362Q203k3955j580R587n042j1579j2783N113k3821
14613B199R940M268j1397l8284L165K1850K4287P16J9708N327n3215j8817M0849
14600A0596N8144l0612k7785k0671K4134m755j368M51j427O738J204j4211k3487
14587b3049l892J1334J3649k4241j8107K9738O425L2102p029k1350l8351K678
14575d0093M5179k052J9419K4231m642k2722j8919K7462p004l0941l775N249M2595
$$ plain form
14562 33987 55541 32110 -14511 18392 34664 29460 40620 30868 12353 14136 5480 -17225
14550 -17225 -12658 13329 17830 -40016 -51607 -22384 -8040 -10686 -10517 12247 21491 38861 37224
14537 37224 39717 -1107 -23433 -12333 -6013 -9896 -18084 -23511 -16010 -30027 -28389 -16478 -1628
14524 -1628 -16618 3257 27083 8962 -21806 -38494 -7771 -8344 -18161 -26055 -33303 -14178 7386
14511 7386 72667 89636 44250 8182 374 -8899 8639 24414 36151 -6726 -35274 -31177
14499 -31177 -40191 -26428 -48245 -71733 -35555 -6971 -4346 2938 23431 57706 40997 5644
14487 5644 -13111 -23585 -9 -21530 -42558 -21412 7228 1618 2672 4096 24578 34421 -13275
14474 -13275 -17328 42609 74341 65442 14813 12395 42191 29820 83 -22173 1918 1627 19773
$$ packed form
14562C3987K1554k3431m6621L2903J6272n204J1160r752j8515J783q656k2705
14550a7225M567K5987M501n7846j1591K9223J4344k646J69K2764R244J7370j637
14537C7224K493m0824k2326J1100O320l883q188n427P501j4017J638J1911J4850
14524a628j4990J9875K3826j8121l0768j6688L0723n73r817p894p248J9125K1564
14511G386O5281J6969m5386l6068p808r273J7538J5775J1737m2877k8548M097
14499c1177r014J3763k1817k3488L6178K8584K625P284K0493L4275j6709l5353
14487E644j8755j0474K3576k1521k1028K1146K8640n610J054J424K0482R843m7696
14474a3275m053N9937L1732q899n0629k418K9796j2371k9737k2256K4091k91J8146
$$ plain form
14461 19773 36847 54557 60995 55100 50451 38421 27654 2560 7901 -893 -17623 -11710 -18823
14448 -18823 -30164 12169 48878 32988 33921 41294 35857 40646 26759 -17242 -22557 -29385 -11923
14435 -11923 -7183 -22593 -17288 -19404 4130 28385 22414 -29972 -56520 -18326 56 13900
14423 13900 26807 25134 14390 -12970 -10678 -22757 -43367 -50234 -81963 -89421 -50862 -47536 -44183
14410 -44183 -16363 -8697 -7746 13966 25938 26115 76542 37388 14850 -22186 -24557 11751 31801
14397 31801 16666 21163 39751 32322 10997 9416 -6290 -13708 -29138 -31178 -26959 -43636 -49464
14384 -49464 -15007 -29461 -1436 38261 8407 -13562 -25172 -5767 12153 -10049 -3909 -26134
14372 -26134 -34577 -41436 -3275 31019 32562 5581 26985 48609 26004 2464 -7690 13655
$$ packed form
14461A9773J7074J7710O438n895m649j2030j0767k5094N341q794j6730N913p113
14448a8823j1341M2333L6709j5890R33P373n437M789j3887m4001n315o828J7462
14435a1923M740j5410N305k116K3534K4255n971n2386k6548L8194J8382J3844
14423A3900J2907j673j0744k7360K292j2079k0610o867l1729p458L8559L326L353
14410d4183K7820P666R51K1712J1972J77N0427l9154k2538l7036k371L6308K0050
14397C1801j5135M497J8588p429k1325j581j5706p418j5430k040M219j6677n828
14384d9464L4457j4454K8025L9697k9854k1969j1610J9405J7920k2202O140k2225
14372b6134q443o859L8161L4294J543k6981K1404K1624k2605k3540j0154K1345
$$ plain form
14360 13655 19700 -14753 -38829 -29678 -18892 -21973 28 -16188 -44799 -35045 -13487 -6574 -2823
14347 -2823 3718 3404 9355 17141 9654 -9037 19471 33707 41343 67331 63732 48221 31064
14334 31064 -34349 -71019 -37528 -28451 3717 40168 51072 50211 33091 20350 38660 11116
14322 11116 -23652 -41633 -37292 -41517 -7695 29517 34977 62358 51193 17927 9790 14139 -1372
14309 -1372 -18317 -14916 -6167 -12474 -10432 -1509 28850 36776 36010 71767 85513 53289 7073
14296 7073 -4207 -7052 -3501 17201 36470 16689 -23511 -46466 -22493 9821 2955 -20976
14284 -20976 -16005 21763 -8869 -27455 -25463 -48244 -3879 44783 45264 21882 6405 26463
14272 26463 7685 -18038 38457 68656 32910 6687 -39342 -36193 -8229 26867 5301 -814
$$ packed form
14360A3655O045l4453k4076R151J0786l081K2001j6216k8611R754K1558O913L751
14347b823O541l14N951P786p487j8691K8508J4236P636K5988l599j5511j7157
14334C1064o5413l6670L3491R077L2168L6451J0904q61j7120j2741J8310k7544
14322A1116l4768j7981M341m225L3822L7212N460K7381j1165l3266q137M349j5511
14309a372j6945L401Q749o307K042Q923L0359P926p66L5757J3746l2224m6216
14296G073j1280k845L551K0702J9269j9781m0200k2955K3973L2314o866k3931
14284b0976M971L7768l0632j8586J992k2781M4365M8662M81k3382j5477K0058
14272B6463j8778k5723N6495L0199l5746k6223m6029L149K7964L5096k1566o115
$$ plain form
14260 -814 8664 14432 14910 47002 34053 11679 47886 47031 20087 12485 1444 -5343 -17448 29574
14246 29574 17597 19963 26971 -1604 -3815 -12459 -23104 -20590 -39780 -23904 -19126 -13397 -19228
14233 -19228 -1662 23881 48092 51298 44718 48700 50415 51856 70512 64482 38399 13979 -4196
14220 -4196 -27962 -11481 563 17199 -4590 -19763 -9440 18824 43788 26187 14436 27773
14208 27773 73802 58331 15340 -4512 -8775 6784 13325 45523 48680 36943 37974 45910 70316
14195 70316 35952 62265 77270 71378 51124 31507 31086 38453 16869 -27135 -38770 2487
14183 2487 3111 4846 -16302 -13935 -6524 7601 7930 -22050 -42910 -43750 -24639 8307 18213 9727
14169 9727 228 -19214 -22138 -18663 -32532 -33355 -9966 10607 6082 11371 -29096 -57650 -55484
$$ packed form
14260h14R478N768M78L2092j2949k2374L6207q55k6944p602j1041o787j2105M7022
14246B9574j1977K366P008k8575k211q644j0645K514j9190J5876M778N729n831
14233a9228J7566K5543K4211L206o580L982J715J441J8656o030k6083k4420j8175
14220d196k3766J6481J2044J6636k1789j5173J0323K8264K4964j7601j1751J3337
14208B7773M6029j5471m2991j9852m263J5559O541L2198L157j1737J031P936K4406
14195G0316l4364K6313J5005n892k0254j9617m21P367k1584m4004j1635M1257
14183B487O24J735k1148K367P411J4125L29k9980k0860q40J9111L2946R906q486
14169I727r499j9442k924L475j3869q23K3389K0573m525N289m0467k8554K166
$$ plain form
14156 -55484 -36105 -37106 -19462 1894 14682 39298 36884 38038 35971 29803 23743 31941 23892
14143 23892 41091 31361 -1651 13442 34626 29378 34735 53921 47208 51382 28609 14304 27685
14130 27685 24587 33214 61451 40449 -9686 115 974 -12206 15902 30647 13393 15042 6028
14117 6028 41090 43941 7085 10701 11128 -3613 -16446 -39465 -57273 -55236 -24605 -17482 -8573
14104 -8573 -8722 -1079 1644 -16865 -19012 -2444 24551 41849 62811 85503 62927 62326 68280
14091 68280 77906 86530 43338 25253 -9965 -25800 2909 20118 22751 35013 -8907 -22929
14079 -22929 -1699 9943 -7244 10617 49921 25509 12059 30988 47563 23053 12402 11181
14067 11181 29389 21998 41303 33557 20841 -6102 -2768 32251 32393 45619 67272 43546 20013
$$ packed form
14156e5484J9379j001J7644K1356J2788K4616k414J154k067o168o060Q198q049
14143B3892J7199r730l3012J5093K1184n248N357J9186o713M174k2773j4305J3381
14130B7685l098Q627K8237k1002n0135R801Q59j3180K8108J4745j7254J649r014
14117F028L5062K851l6856L616M27j4741j2833k3019j7808K037L0631P123Q909
14104h573j49P643K723j8509k147J6568K6995J7298K0962K2692k2576o01N954
14091F8280R626Q624m3192j8085l5218j5835K8709J7209K633J2262m3920j4022
14079b2929K1230J1642j7187J7861L9304k4412j3450J8929J6575k4510j0651j221
14067A1181J8208p391J9305p746j2716k6943L334L5019J42J3226K1653k3726k3533
$$ plain form
14054 20013 23652 41377 47404 37975 8435 -32360 -2362 -4835 23366 46534 58954 48622
14042 48622 2903 8095 45554 21676 13706 39684 30859 2481 2032 38823 53127 31009 24120
14029 24120 44559 75567 73533 58725 44053 27372 21228 16321 19169 1998 -192 20920 4542
14016 4542 10658 36694 64450 32330 -94 13735 9127 -19026 -64970 -34979 -28525 -81026
14004 -81026 -78639 -60862 -32412 -26075 -22297 -2805 -10049 10145 -1571 -6082 12688 51094 47221
13991 47221 34989 55996 93842 97091 85908 54317 13196 -18878 -6671 -19238 -46861 -50184
13979 -50184 -38708 -12255 6825 25154 39356 47120 40863 42304 25657 -15281 -48744 -14165
13967 -14165 28949 14262 12926 24119 26569 23951 13682 788 -12826 -33916 -68014 -76879
$$ packed form
14054B0013L639J7725O027r429k9540m0795K9998k473K8201K3168J2420j0332
14042D8622m5719N192L7459k3878p970K5978q825k8378m49L6791J4304k2118o889
14029B4120K0439L1008k034j4808j4672j6681o144m907K848j7171k190K1112j6378
14016D542O116K6036K7756l2120l2424J3829m608k8153m5944K9991O454n2501
14004h1026K387J7777K8450O337L778J9492p244K0194j1716m511J8770L8406l873
13991D7221j2232K1007L7846L249j1183l1591m1121l2074J2207j2567k7623l323
13979e0184J1476K6453J9080J8329J4202P764o257J441j6647m0938l3463L4579
13967a4165M3114j4687j336J1193K450k618j0269j2894j3614k1090l4098q865
$$ plain form
13955 -76879 -63833 -48416 -48920 -36656 -14384 -6836 -20800 -54822 -48943 -12981 9316 39598
13943 39598 48510 17785 -430 13448 22192 13493 7992 24887 54779 58536 55664 72050 61458
13930 61458 32914 32403 43617 26782 1217 -18649 11179 52305 50309 32572 24165 12240
13918 12240 12905 -2603 -14942 -544 1631 8368 55425 64201 54376 45170 31588 29270 14719
13905 14719 5965 11949 -26220 -17021 -22371 -13218 3548 7908 -5909 -1352 5025 1198 19759
13892 19759 33968 48997 33211 4839 -8748 -4562 922 21263 9272 837 15266 13178
13880 13178 2690 13673 2204 -28885 -29544 -12236 -1153 5165 8582 19110 -5732 10388
13868 10388 24036 42000 -16007 -47562 -32487 -17237 11793 7874 -11140 -21336 -25410 5601
$$ packed form
13955g6879J3046J5417n04J2264K2272P548j3964l4022N879L5962K2297L0282
13943C9598Q912l0725j8215J3878Q744q699n501J6895K9892L757k872J6386j0592
13930F1458k8544n11J1214j6835k5565j9866K9828M1126j996j7737q407j1925
13918A2240O65j5508j2339J4398K175O737M7057Q776r825r206j3582k318j4551
13905A4719q754N984l8169R199n350R153J6766M360j3817M557O377l827J8561
13892A9759J4209J5029j5786k8372j3587M186N484K0341j1991q435J4429k088
13880A3178j0488J0983j1469l1089o59J7308J1083O318L417J0528k4842J6120
13868A0388J3648J7964n8007l1555J5075J5250K9030l919j9014j0196m074L1011
$$ plain form
13856 5601 13251 -9593 12817 35948 31769 22577 8784 27503 69530 46373 38079 20560 -2461
13843 -2461 -1380 26764 44551 61750 30743 22683 45218 9879 -20047 -15483 -5980 -16253 -20654
13830 -20654 -9705 -6273 -16816 -5579 -21822 -31858 -27061 -16086 -18064 -22612 -24432 4812 3675
13817 3675 -5296 24483 56293 26559 1280 -4188 -4422 -6060 -5324 -17921 -7634 25826 -6575
13804 -6575 -7830 13594 8926 -39131 -52827 -44676 -8660 -7237 -16187 3847 -6252 -5759 -2860
13791 -2860 -14871 -12781 -3450 -4656 -15725 -23367 -16292 -7914 25063 22327 39071 46656 15027
13778 15027 11119 1241 18913 17746 -1064 -1400 18990 29034 24755 16606 36958 27655 39933
13765 39933 31331 17119 3963 -14531 13315 37986 28442 9841 23517 27174 29338 8001
$$ packed form
13856E601P650k2844K2410K3131m179r192j3793J8719M2027k3157q294j7519k3021
13843b461J081K8144J7787J7199l1007q060K2535l5339k9926M564R503j0273m401
13830b0654J0949L432j0543J1237j6243j0036M797J0975j978m548j820K9244j137
13817C675q971K9779L1810k9734k5279n468k34j638P36j2597J0287L3460l2401
13804f575j255K1424m668m8057j3696Q151L6016J423q950K0034j0099M93K899
13791b860j2011K090R331j206j1069p642P075Q378L2977k736J6744P585l1629
13778A5027l908r878J7672j167j8810l36K0390J0044m279q149K0352r303J2278
13765C9933q602j4212j3156j8494K7846K4671r544j8601J3676L657K164k1337
$$ plain form
13753 8001 25242 -12716 -59032 -61864 -40222 -20265 -13539 6113 72294 100025 87805 70006
13741 70006 70032 53835 52934 27740 -13469 -5955 -2320 7080 37060 40945 27729 -111 9868 -10104
13727 -10104 7902 18971 22708 17788 32910 15812 1625 -19389 -34458 -14835 7700 12169
13715 12169 -5509 8078 12858 4228 -12132 -16858 29107 52486 39980 57298 31353 21740
13703 21740 18024 11516 49690 31418 25493 22140 52274 88562 58373 39594 10115 5825 -8983
13690 -8983 -12949 -6879 -24104 -10078 15219 -5099 -2861 -3041 -12183 7152 27096 20510 27424
13677 27424 12263 16844 23928 45527 55485 40093 37136 35086 76938 87978 78954 43163 5141
13664 5141 -990 3569 9091 32924 12228 1615 23317 42799 24639 49046 75525 38029
$$ packed form
13753H001J7241l7958m6316k832K1642J9957O726J9652O6181K7731j2220j7799
13741G0006K6j6197r01k5194m1209P514L635R400K9980L885j3216k7840R979j9972
13727a0104J8006J1069L737m920J5122j7098j4187k1014j5069J9623K2535M469
13715A2169j7678J3587M780q630j6360m726M5965K3379j2506J7318k5945r613
13703B1740l716o508L8174j8272n925l353L0134L6288l0189j8779k9479m290j4808
13690h983l966O070j7225J4026K5297k0318K238j80r142J9335J9944o586O914
13677B7424j5161M581P084K1599R958j5392k957k050M1852J1040r024l5791l8022
13664E141o131M559N522K3833k0696j0613K1702J9482j8160K4407K6479l7496
$$ plain form
13652 38029 -10949 -14048 -1961 43194 42636 51048 56796 53675 50746 51088 36859 -2492 24375
13639 24375 54223 68567 63263 29852 27896 36687 28324 27833 20406 23805 36349 44456 39816 37934
13625 37934 9256 8496 10134 -14900 -16722 -8301 11360 1990 -32476 -40416 -20699 5917 -17429
13612 -17429 -37226 -26083 -22255 -15969 32586 38279 31969 34595 -4162 26508 42361 68316 73297
13599 73297 80216 69535 8074 -15998 -21368 -9133 23250 33065 16551 -1159 -21848 -790
13587 -790 25490 32886 22235 4943 27026 47312 39077 37121 3467 983 14227 49038 59123
13574 59123 73250 84852 59859 59192 57092 53079 31207 10891 38167 42246 19271 11085 40555
13561 40555 19445 17527 33636 38661 31191 25076 25625 13696 -16669 9362 55209 17663 6720
$$ packed form
13652C8029m8978l099J2087M5155n58Q412N748l121k929L42j4229l9351K6867
13639B4375K9848J4344n304l3411j956Q791q363m91p427L399J2544Q107m640j882
13625C7934k8678p60J638k5034j822Q421J9661r370l4466p940J9717K6616k3346
13612a7429j9797J1143L828O286M8555N693o310K626l8757L0670J5853K5955M981
13599G3297O919j0681o1461k4072n370J2235L2383R815j6514j7710k0689K1058
13587g90K6280P396j0651j7292K2083K0286q235j956l3654k484J3244L4811J0085
13574E9123J4127J1602k4993o67k100m013k1872k0316K7276M079k2975q186K9470
13561D0555k1110j918J6109N025p470o115N49j1929l0365K6031M5847l7546j0943
$$ plain form
13548 6720 -25474 -74518 -59323 -36966 -33458 -39258 -26410 1132 14068 1739 10450 -6495
13536 -6495 -9530 34243 58553 33879 7196 -3238 7179 9852 18160 10738 23434 35541 -1291
13523 -1291 15757 36733 54260 39447 10722 38126 54544 77313 45622 -904 -42245 -50731
13511 -50731 -25218 5597 26967 13408 6146 27141 15370 33192 28795 15621 40685 60563
13499 60563 38111 -2912 -23665 -36781 -38664 -56371 -44928 -76049 -99346 -44206 -43194 -35138
13487 -35138 -31175 -85020 -80226 -16670 28982 51712 44156 23530 8596 -21878 -24217 -27039 -33079
13474 -33079 -604 28278 21162 21504 30267 30929 26964 -6692 14105 29782 6221 -30510 -6833
13461 -6833 21897 24671 29629 58005 72196 69259 63405 62621 47933 55049 50294 63735 74198
$$ packed form
13548F720l2194m9044J5195K2357L508n800J2848K7542J2936j2329Q711j6945
13536f495l035M3773K4310k4674k6683j0434J0417K673Q308p422J2696J2107l6832
13523a291J7048K0976J7527j4813k8725K7404J6418K2769l1691m6526m1341q486
13511e0731K5513L0815K1370j3559p262K0995j1771J7822m397j3174K5064J9878
13499F0563k2452m1023k0753j3116j883j7707J1443l1121k3297N5140J012Q056
13487c5138L963n3845M794O3556M5652K2730p556k0626j4934l0474k339k822o040
13474c3079L2475K8882p116L42Q763O62l965l3656K0797J5677k3561l6731K3677
13461f833K8730K774M958K8376J4191k937n854p84j4688P116m755J3441J0463
$$ plain form
13448 74198 40063 39043 76748 89894 93334 108918 124725 120654 91301 60285 30249 -2917
13436 -2917 -13902 19754 49623 44781 33190 27654 19065 25718 -5092 -42845 -23063 23083 -18467
13423 -18467 -32384 -17408 -7637 -27792 -16860 16796 12702 35816 19946 2673 4933 12779
13411 12779 7638 -16363 -21655 -16211 -5825 1914 10001 -7240 -21517 -51 15185 49480 59986
13398 59986 44105 57018 72380 76305 74344 96368 73931 59475 61001 48822 72075 88444
13386 88444 47339 52397 59387 35814 25187 1133 -6712 30673 46690 16064 -4318 36598
13374 36598 59237 66629 69282 57366 64350 58715 55463 58957 75558 56392 11929 -2936 28640
13361 28640 59010 53338 51071 110208 138126 136732 137981 160827 198426 201045 225387 267852 325665
$$ packed form
13448G4198l4135j020L7705J3146L440J5584J5807m071k9353l1016l0036l3166
13436b917j0985L3656K9869m842j1591n536q589O653l0810l7753J9782M6146m1550
13423a8467j3917J4976R771k0155J0932L3656m094K3114j5870j7273K260P846
13411A2779n141k4001n292N444J0386P739Q087j7241j4277K1466J5236L4295J0506
13398E9986j5881J2913J5362L925j961K2024k2437j4456J526j2179K3253J6369
13386H8444m1105N058O990k3573j0627k4054p845L7385J6017l0626k0382M0916
13374C6598K2639P392K653j1916O984n635l252L494J6601j9166m4463j4865L1576
13361B8640L0370n672k267N9137K7918j394J249K2846L7599K619K4342M2465N7813
$$ plain form
13348 325665 351789 299200 303134 338428 383401 423380 544758 699516 878347 1086011 1314541
13337 1314541 1540797 1736543 1825440 1729278 1528224 1237596 964597 717533 509473 343802
13327 343802 262387 189270 182370 180810 166925 151153 127409 94668 108220 135590 126391 91706
13315 91706 80633 102716 101358 91214 62817 54137 40270 71554 85564 67933 51441 43051
13303 43051 36449 45581 37001 35172 50054 83131 69677 32803 45795 87023 79924 55597 39030
13290 39030 75509 72230 60867 36419 18713 2543 16700 26709 36648 43075 51558 28873
13278 28873 13291 -19189 -23376 -5224 29568 45795 44946 38737 54529 54783 51406 72539 87751
13265 87751 89130 67033 47259 66451 44847 31649 60960 56997 17170 14039 40802 32114
$$ packed form
13348C25665K6124n2589L934L5294M4973L9979J21378J54758J78831K07664K28530
13337A314541K26256J95746Q8897r6162k01054k90628k72999k47064k08060j65671
13327C43802q1415p3117o900j560j3885j5772k3744l2741J3552K7370r199l4685
13315I1706j1073K2083j358j0144k8397q680j3867L1284J4010j7631j6492q390
13303D3051o602R132q580j829J4882L3077j3454l6874J2992M1228p099k4327j6567
13290C9030L6479l279j1363k4448j7706j6170J4157J0009R939O427Q483k2685
13278B8873j5582l2480m187J8152L4792J6227q49o209J5792K54l377K1133J5212
13265H7751J379k2097j9774J9192k1604j3198K9311l963l9827l131K6763q688
$$ plain form
13253 32114 33061 6018 -28410 -12833 28749 47208 72174 69370 60997 20879 10037 19387 55850
13240 55850 61726 42056 33371 49992 36465 2701 -23991 -22738 -45464 -53056 -49956 -26006 -12768
13227 -12768 -33908 -55574 -50712 -27730 -28551 -43112 -13174 -35410 -33636 20906 25751 12884 20744
13214 20744 28300 7104 -14421 -24019 -38315 -63546 -80908 -46173 -13631 34936 81167 113334
13202 113334 109844 51730 60364 91259 116710 83504 92863 112334 108556 57379 42981 72471
13190 72471 65193 84789 89966 62318 83587 108810 119296 102579 100150 115572 138145 142485
13178 142485 136641 144634 157387 132509 152717 154114 113775 90721 140678 200296 222523 217856
13166 217856 232116 216609 219270 200385 179198 164089 161274 151686 153643 160117 139369 135332 180370
$$ packed form
13253C2114R47k7043l4428J5577M1582J8459K4966k804q373m0118j0842R350L6463
13240E5850N876j9670q685J6621j3527l3764k6692J253k2726p592L100K3950J3238
13227a2768k1140k1666M862K2982q21j4561K9938k2236J774N4542M845j2867P860
13214B0744P556k1196k1525r598j4296k5231j7362L4735L2542M8567M6231L2167
13202A13334l490n8114Q634L0895K5451l3206R359J9471l778n1177j4398K9490
13190G2471p278J9596N177k7648K1269K5223J0486j6717k429J5422K2573M340
13178A42485n844P993J2753k4878K0208J397m0339k3054M9957N9618K2227m667
13166B17856J4260j5507K661j8885k1187j5109k815r588J957O474k0748m037M5038
$$ plain form
13153 180370 200068 231040 236404 208072 207566 195105 186217 164310 177036 175716 153261 156167 127124
13140 127124 99094 94873 107984 136313 178273 178817 176946 167269 138022 111968 115639 131773 144024
13127 144024 129620 97518 80290 66078 41474 46417 59466 80075 43113 20349 22504 35774
13115 35774 29935 28189 12703 25301 80276 56085 34684 7358 -35906 -55669 -20687 23494
13103 23494 43476 50344 7888 15966 33130 60668 79693 81724 59920 38788 11343 25254
13091 25254 22719 36037 48340 47738 76448 100231 88212 88478 125410 116062 121896 146963 156048
13078 156048 152454 136135 113400 129893 148202 173795 145269 151189 167173 146730 145467 165616
13066 165616 174638 183636 178246 162482 131871 119252 129278 142351 151943 162277 111404 83402
$$ packed form
13153A80370J9698L0972N364k8332n06j2461q888k1907J2726j320k2455K906k9043
13140A27124k8030m221J3111K8329M1960N44j871r677k9247k6054L671J6134J2251
13127A44024j4404l2102j7228j4212k4604M943J3049K0609l6962k2764K155J3270
13115C5774n839j746j5486J2598N4975k4191k1401k7326m3264j9763L4982M4181
13103B3494J9982O868m2456Q078J7164K7538J9025K031k1804k1132k7445J3911
13091B5254k535J3318J2303o02K8710K3783j2019K66L6932r348N834K5067R085
13078A56048l594j6319k2735J6493J8309K5593k8526N920J5984k0443j263K0149
13066A65616R022Q998n390j5764l0611j2619J0026J3073R592J0334n0873k8002
$$ plain form
13054 83402 89997 74074 77046 120325 150465 158989 165217 209090 247784 250743 234516 222798 210560
13041 210560 212351 217184 227867 268433 270872 218728 194155 185298 203093 183690 201104 212414
13029 212414 193613 159277 148325 165697 169574 179943 207058 230727 213494 215433 223030 243391
13017 243391 246542 247269 251139 264803 255029 249399 273589 268590 231004 188882 180254 241761 234603
13004 234603 208645 221064 238407 272119 300290 263956 243450 253073 269356 253900 233942 257653
12992 257653 288103 295192 321306 321104 354023 387893 372307 372577 381832 380982 370625 367528 394303
12979 394303 400750 366649 358091 354330 342707 396930 429053 421994 429646 438700 450883 451494 457253
12966 457253 494945 503591 543240 585389 608367 653984 671935 678124 658091 650019 679974 729469
$$ packed form
13054H3402O595j5923K972M3279L0140Q524O228M3873L8694K959j6227j1718j2238
13041B10560J791M833J0683M0566K439n2144k4573q857J7795j9403J7414J1310
13029B12414j8801l4336j0952J7372L877J0369K7115K3669j7233J939P597K0361
13017B43391L151P27L870J3664r774n630K4190m999l7586m2122q628O1507p158
13004B34603k5958J2419J7343L3712K8171l6334k0506R623J6283j5456j9958K3711
12992B57653L0450P089K6114k02L2919L3870j5586K70R255q50j0357l097K6775
12979C94303O447l4101q558l761j1623N4223L2123p059P652R054J2183O11N759
12966D57253L7692Q646L9649M2149K2978M5617J7951O189k0033q072K9955M9495
$$ plain form
12954 729469 730781 756640 821586 859311 899151 946475 974961 1013593 1012558 1056520 1172629 1271481
12942 1271481 1367982 1416215 1484735 1549777 1605605 1610249 1639506 1755514 1901868 2099324 2331781
12931 2331781 2590824 2848587 3166442 3515956 3971807 4614984 5498245 6679989 8179160
12922 8179160 9852181 11558709 13275005 15129411 17370545 20371975 23935375 27751296
12914 27751296 31726119 35523314 39319958 43404569 47490314 51596502 55964280 60814921
12906 60814921 67201206 75991750 87426123 102477900 122197955 147402170 179026891
12899 179026891 218185096 264580281 309928549 340847767 344508668 319531545 273599948
12892 273599948 217372316 166989631 124998103 92059855 68693294 53277068 42770001
$$ packed form
12954G29469J312K5859O4946L7725L9840M7324K8486L8632j035M3962J16109R8852
12942A271481R6501M8233O8520O5042N5828M644K9257J16008J46354J97456K32457
12931B331781K59043K57763L17855L49514M55851O43177Q83261J181744J499171
12922H179160J673021J706528J716296J854406K241134L001430L563400L815921
12914B7751296L974823L797195L796644M084611M085745M106188M367778M850641
12906F0814921O386285Q790544J1434373J5051777J9720055K5204215L1624721
12899A79026891L9158205M6395185M5348268L0919218L660901k4977123m5931597
12892B73599948n6227632n0382685m1991528l2938248k3366561j5416226j0507067
$$ plain form
12885 42770001 35086541 29124408 24382489 20574110 17523182 15018023 12993233 11310833
12877 11310833 9912518 8797130 7842269 7040497 6416854 5892216 5445055 5072716 4654437
12868 4654437 4244917 3876572 3520431 3223141 2984271 2768016 2613948 2475265 2366105
12859 2366105 2276937 2196324 2052077 1904939 1772847 1631756 1532082 1409324 1290423 1191151
12849 1191151 1136467 1098637 1075079 1093536 1082929 1044634 1016997 1019263 1025451 991246 942880 913116
12837 913116 864738 835035 790842 760722 728612 708506 683308 704531 751476 747915 717800 763923
12825 763923 766592 757635 787888 870775 885602 907799 913040 924915 888509 858740 779816 693531
12813 693531 618215 540096 444408 416603 349481 347410 337208 363504 352994 342922 371447 369072
$$ packed form
12885D2770001p683460n962133m741919l808379l050928k505159k024790j682400
12877A1310833j398315j115388r54861q01772o23643n24638m47161l72339m18279
12868D654437m09520l68345l56141k97290k38870k16255j54068j38683j09160
12859B366105q9168q0613j44247j47138j32092j41091r9674j22758j18901r9272
12849A191151n4684l7830k3558J8457j0607l8295k7637K266O188l4205m8366k9764
12837I13116m8378k9703m4193l0120l2110k0106k5198K1223M6945l561l0115M6123
12825G63923K669q957L0253Q2887J4827K2197N241J1875l6406k9769p8924q6285
12813F93531p5316p8119r5688k7805o7122k071j0202K6296j0510j0072K8525k375
$$ plain form
12801 369072 309965 288918 314757 319554 323959 325294 341419 344564 375011 391373 399515 361148
12789 361148 329024 291630 295608 308847 306891 312473 314249 295498 265933 229247 239791 236761
12777 236761 266204 280671 266313 248482 208885 186162 194256 233937 218684 233885 223465 190596
12765 190596 177332 149882 165847 205922 197986 149643 137446 119475 80371 64516 94812 103398
12753 103398 125379 153334 170097 165641 154168 162054 130792 127091 110800 119690 149004 158548
12741 158548 167102 237179 242310 208972 159965 114125 97346 95273 60180 59316 64027 64054 78524
12728 78524 108246 81922 54368 38544 5572 -12098 -18899 18496 51958 45439 52247 55715
12716 55715 63095 48160 19007 37460 75784 77969 56945 40659 42362 65425 105697 94863
$$ packed form
12801C69072n9107k1047K5839M797M405J335J6125L145L0447J6362Q142l8367
12789C61148l2124l7394L978J3239j956N582J776j8751k9565l6686J0544l030
12777B36761K9443J4467j4358j7831l9597k2723Q094L9681j5253J5201j0420l2869
12765A90596j3264k7450J5965M0075p936m8343j2197j7971l9104j5855L0296Q586
12753A03398K1981K7955J6763m456j1473P886l1262l701j6291Q890K9314R544
12741A58548Q554P0077N131l3338m9007m5840j6779k073l5093q64M711K7J4470
12728G8524K9722k6324k7554j5824l2972j7670o801L7395L3462o519O808L468
12716E5715P380j4935k9153J8453L8324K185k1024j6286J703K3063M0272j0834
$$ plain form
12704 94863 69558 72392 87681 101184 118879 134227 137469 118387 88099 80624 89964 146975
12692 146975 138387 110322 104963 88419 108423 132869 143516 125529 116529 131633 114950 103793
12680 103793 108377 115951 98591 75894 65477 60565 74069 70427 63021 69875 74034 49590 25188
12667 25188 23019 32678 -1094 15155 730 32401 49933 41961 8466 21680 60442 69233
12655 69233 59346 26777 30158 45795 34658 28367 6421 -130 -25122 -30260 -3464 -36381 -44638
12642 -44638 -48728 -20787 19231 42156 65572 40916 15416 -5151 -13118 -33498 -28795 -42136
12630 -42136 -59843 -34449 -26519 -19101 -16859 -3749 -3384 -8826 -724 -2039 -3411 1503 15030 59153
12616 59153 76103 52130 44115 52055 12472 -8137 -486 -37140 -30601 640 6082 17461 42312
$$ packed form
12704I4863k5305K834J5289J3503J7695J5348L242j9082l0288p475R340N7011
12692A46975q588k8065n359j6544K0004K4446J0647j7987r000J5104j6683j1157
12680A03793M584P574j7360k2697j0417m912J3504l642p406O854M159k4444k4402
12667B5188k169R659l3772J6249j4425L1671J7532p972l3495J3214L8762Q791
12655F9233r887l2569L381J5637j1137o291k1946o551k4992n138K6796l2917q257
12642d4638m090K7941M0018K2925K3416k4656k5500k0567p967k0380M703j3341
12630d2136j7707K5394P930P418K242J3110L65n442Q102j315j372M914J3527M4123
12616E9153J6950k3973q015P940l9583k0609P651l6654O539L1241N442J1379K4851
$$ plain form
12603 42312 24257 34362 18801 -18259 -18200 -15061 -7725 7953 34201 30778 10154 -6691 -24229
12590 -24229 -33128 -31238 -10450 58297 149974 210837 213891 215393 190409 161345 128105 129289 106588
12577 106588 75927 30707 36322 47300 27326 34890 51813 61187 55696 35899 27114 20583 45837
12564 45837 57076 42642 55544 92622 87569 64634 88342 84977 66621 79682 69533 30565
12552 30565 -4716 -16965 5604 22689 39496 7626 10241 17325 -5359 12813 12165 -17451
12540 -17451 2365 36681 37278 41181 58240 95141 75719 55704 58685 70653 90285 69048
12528 69048 55738 32182 37929 16482 21480 13587 13413 23565 33882 11821 -6391 31092 33291
12515 33291 30212 20962 27569 27681 61618 79584 42955 11296 -22841 -47985 -52109 4214 -9560
$$ packed form
12603D2312j8055J0105j5561l7060N9L139P336J5678K6248l423k0624j6845j7538
12590b4229q899J890K0788O8747R1677O0863L054J502k4984k9064l3240J184k2701
12577A06588l0661m5220N615J0978j9974P564J6923R374n491j9797q785o531K5254
12564D5837J1239j4434J2902L7078n053k2935K3708l365j8356J3061j0149l8968
12552C0565l5281j2249K2569J7085J6807l1870K615P084k2684J8172o48k9616
12540a7451J9816L4316N97L903J7059L6901j9422k0015K981J1968J9632k1237
12528F9048j3310k3556N747k1447M998p893j74J0152J0317k2061j8212L7483K199
12515C3291l079r250O607J12L3937J7966l6629l1659l4137k5144m124N6323j3774
$$ plain form
12502 -9560 -14274 -560 8382 29814 31663 15937 13649 25965 24844 41957 55522 89903 93653
12489 93653 64090 40239 21708 5723 6334 16102 1055 -13123 12061 58385 28352 16601
12477 16601 44163 124181 139995 112837 79899 80134 86426 75514 84972 132213 166302 169603 184316
12464 184316 188823 227964 272016 307212 335231 388893 445397 522278 621123 736910 908066
12453 908066 1070904 1300384 1543002 1717538 1808716 1736127 1570887 1311702 1061794 838077
12443 838077 658020 512274 385439 290636 253995 226974 174113 135622 119150 154181 168748
12432 168748 145132 110087 91084 92622 104688 104148 46792 11637 5251 16053 18603 -16199
12420 -16199 -39714 4953 26513 37664 37571 69074 47686 38686 28688 18751 43666 56461 63398
$$ packed form
12502i560m714J3714Q942K1432J849j5726k288J2316j121J7113J3565L4381L750
12489I3653k9563k3851j8531j5985O11R768j5047j4178K5184M6324l0033j1751
12477A6601K7562Q0018J5814k7158l2938K35O292j0912R458M7241L4089L301J4713
12464A84316M507L9141M4052L5196K8019N3662N6504P6881R8845J15787J71156
12453I08066J62838K29480K42618J74536R1178p2589j65240k59185k49908k23717
12443H38077j80057j45746j26835r4803l6641k7021n2861l8491j6472L5031J4567
12432A68748k3616l5045j9003J538J2066n40n7356l5155o386J0802K550l4802
12420a6199k3515M4667K1560J1151r3L1503k1388r000r998r937K4915J2795O937
$$ plain form
12407 63398 54416 42184 33441 19105 17389 28773 28921 -36201 -40385 -8581 -11345 -12309 -27158
12394 -27158 -2497 31312 48586 63861 18038 15412 40001 30483 60125 38035 28129 19024
12382 19024 219 -24498 1517 14384 38813 38347 9015 26091 19479 14308 16641 26788 33139
12369 33139 19223 6192 -1537 -13426 18446 -3080 355 482 7682 34833 49885 42412 28827
12356 28827 4677 22721 26762 24192 42931 44631 41962 57265 69181 56483 27316 -5546
12344 -5546 -2183 -16388 -16276 -15851 -13304 51148 53634 23864 -18167 -22579 -25386 -47364 -65506 -58568
12330 -58568 -32233 -12168 12525 25985 15301 16779 4778 4083 12836 -19939 -24374 -60394 -80274
12317 -80274 -70027 -67760 -58623 -18150 -10111 -15972 -14926 5378 -8416 -19636 1393 19701 24291
$$ packed form
12407F3398q982j2232q743j4336j716J1384J48o5122m184L1804k764r64j4849
12394b7158K4661L3809J7274J5275m5823k626K4589r518K9642k2090r906r105
12382A9024j8805k4717K6015J2867K4429m66k9332J7076o612n171K333J0147O351
12369C3139j3916j3031p729j1889L1872k1526L435J27P200K7151J5052p473j3585
12356B8827k4150J8044M041k570J8739J700k669J5303J1916j2698k9167l2862
12344e546L363j4205J12M25K547O4452K486k9770m2031m412k807k1978j8142O938
12330e8568K6335K0065K4693J3460j0684J478j2001o95Q753l2775m435l6020j9880
12317h0274J0247K267R137M0473Q039n861J046K0304j3794j1220K1029J8308M590
$$ plain form
12304 24291 21823 40563 26121 -4306 -2844 -1971 -8372 35662 57988 43263 22940 -7505 -16736
12291 -16736 -10952 -1283 -9535 -3838 -6559 1375 12252 25219 21727 33034 28989 19389 3904
12278 3904 10804 -4376 8776 27306 13188 6701 -38220 -39913 -35466 -38526 -30971 -19767 8721
12265 8721 19637 -384 -25298 -6952 -200 -17062 -23247 21628 45559 63395 49942 -10816
12253 -10816 6522 21858 35988 37656 28606 17315 6988 6502 24633 54735 64945 25386
12241 25386 31893 20538 17204 29251 28602 23256 15948 2121 -5011 -27613 -20048 -48753 -82204
12228 -82204 -56862 14573 26608 -15310 -63018 -83658 -77603 -31033 -20792 -24892 -33371 -43441
12216 -43441 -40090 -35226 -14816 -4530 -14973 -18758 -5499 10082 18378 32249 6148 -8261
$$ packed form
12304B4291k468J8740j4442l0427J462Q73o401M4034K2326j4725k0323l0445r231
12291a6736N784R669q252N697k721P934J0877J2967l492J1307m045r600j5485
12278C904O900j5180J3152J8530j4118o487m4921j693M447l060P555J1204K8488
12265H721J0916k0021k4914J8346O752j6862o185M4875K3931J7836j3453o0758
12253a0816J7338J5336J4130J668r050j1291j0327m86J8131L0102J0210l9559
12241B5386O507j1355l334J2047o49n346p308j3827p132k2602P565k8705l3451
12228h2204K5342P1435J2035m1918m7708k0640O055M6570J0241m100q479j0070
12216d3441L351M864K0410J0286j0443l785J3259J5581Q296J3871k6101j4409
$$ plain form
12204 -8261 -5891 -13359 -16890 -22726 -19962 -899 22065 33603 48871 36940 15177 -8960 -26458
12191 -26458 -22338 9724 48705 52123 52195 20444 20640 24931 56752 12564 -28837 -46531 -4249
12178 -4249 29228 23482 24436 20260 36111 49633 48223 76075 90855 107141 107605 109900 141157
12165 141157 167497 177637 207379 251595 298787 329267 347973 364927 386132 386112 437657 467317
12153 467317 539861 627132 719279 793541 946337 1116747 1279968 1478058 1663500 1796232
12143 1796232 1824843 1778488 1671334 1514795 1339746 1164688 1008987 887010 791607 685820
12133 685820 632012 612075 597558 582588 569442 580752 590434 628460 613964 602744 628934 672890
12121 672890 706228 745582 770862 797742 900187 1005665 1137505 1275988 1412356 1553656
$$ packed form
12204h261K370p468l531n836K764J9063K2964J1538J5268j1931k1763k4137j7498
12191b6458M120L2062L8981L418P2l1751J96M291L1821m4188m1401j7694M2282
12178d249L3477n746R54m176J5851J3522j410K7852J4780J6286M64K295L1257
12165A41157K6340J0140K9742M4216M7192L0480J8706J6954K1205k0N1545K9660
12153D67317P2544Q7271R2147P4262J52796J70410J63221J98090J85442J32732
12143A796232K8611m6355j07154j56539j75049j75058j55701j21977r5403j05787
12133F85820n3808j9937j4517j4970j3146J1310R682L8026j4496j1220K6190M3956
12121F72890L3338L9354K5280K6880J02445J05478J31840J38483J36368J41300
$$ plain form
12111 1553656 1669227 1798374 1877401 1827727 1647321 1435280 1238162 1024610 814101 647239
12101 647239 528066 434389 363720 287692 214121 165884 131795 88575 82372 93253 64828
12090 64828 39721 31646 76058 103860 87286 41361 12384 453 25238 60274 39944 15665
12078 15665 9927 24692 29509 27054 40082 68969 71141 39282 42466 16596 11876 -1275 11545
12065 11545 39710 40500 76926 76815 22665 583 5558 7735 2819 10547 -29471 -73170 -50246
12052 -50246 -32185 1119 43998 50578 46380 45190 36487 37669 10034 -18086 -25615 -38568 -21112
12039 -21112 -8164 17150 25324 14418 -35027 -55633 -48442 -29875 517 6367 83 14825
12027 14825 30313 14926 3514 1403 10342 21517 36450 30040 41252 48676 14632 -11603
$$ packed form
12111A553656J15571J29147P9027m9674j80406k12041j97118k13552k10509j66862
12101F47239j19173r3677p0669p6028p3571m8237l4089m3220o203J0881k8425
12090F4828k5107q075M4412K7802j6574m5925k8977j1931K4785L5036k0330k4279
12078A5665n738J4765M817k455J3028K8887K172l1859L184k5870m720j3151J2820
12065A1545K8165P90L6426j11n4150k2082M975K177m916P728m0018m3699K2924
12052e0246J8061L3304M2879O580m198j190q703J182k7635k8120p529j2953J7456
12039b1112J2948K5314Q174j0906m9445k0606P191J8567L0392N850o284J4742
12027A4825J5488j5387j1412k111Q939J1175J4933o410J1212P424l4044k6235
$$ plain form
12015 -11603 -21764 -7017 3046 22133 33349 17167 74 -10138 -3467 15488 43101 35126
12003 35126 68604 40322 19520 36404 49005 63569 37241 16730 -4706 29853 20805 12100
11991 12100 -37842 -51870 -43647 -25169 -26820 -30944 -16706 -10310 -6938 -34353 -37818 -28124 -15929
11978 -15929 1063 24249 12341 -8885 -14136 -34792 -4380 10657 12901 32091 48629 60002
11966 60002 53976 30039 -2748 -2685 -29215 -45068 -34733 -64567 -83007 -72401 -45046 -8014
11954 -8014 -8653 -16559 -15153 7506 6562 54062 57515 11930 -7440 11381 -14926 -24716 -26875 -46856
11940 -46856 -22944 -37201 -28204 -18600 -31907 -23720 -9268 -19361 -36745 -38946 11739 10463 -662
11927 -662 28535 8899 -20219 16486 44552 36242 -4302 -18129 -7849 3180 -9313 9239
$$ packed form
12015a1603j0161J4747J0063J9087J1216j6182j7093j0212O671J8955K7613p975
12003C5126L3478k8282k0802J6884J2601J4564k6328k0511k1436L4559r048q705
11991A2100m9942j4028Q223J8478j651m124J4238O396L372k7415l465R694J2195
11978a5929J6992K3186j1908k1226n251k0656L0412J5037K244J9190J6538J1373
11966F0002o026k3937l2787O3k6530j5853J0335k9834j8440J0606K7355L7032
11954h014o39p906J406K2659r44M7500L453m5585j9370J8821k6307r790k159j9981
11940d6856K3912j4257Q997R604j3307Q187J4452j0093j7384k201N0685j276j1125
11927f62K9197j9636k9118L6705K8066q310m0544j3827J0280J1029j2493J8552
$$ plain form
11915 9239 -33194 -26636 -8616 28920 40665 10648 -12618 -14182 -53130 -16896 -6336 -22186
11903 -22186 -13298 -30899 -27574 -22129 -8341 -9460 -554 -14864 -19030 414 -4850 -8759 34133
11890 34133 17727 19331 45085 60183 45240 15512 -16764 -20641 -25712 -8353 -4455 11227
11878 11227 4513 35078 5965 -32713 -8878 -11072 -21054 -13687 28671 25205 -6345 -32942 -21734
11865 -21734 -30496 -44468 -32138 -16470 -22799 -16021 -9102 -18647 -355 -15576 -32446 -40615 -45719
11852 -45719 -20854 -3074 -14091 -29282 -35651 -28312 -9387 11565 2864 -1557 -20729 -37122
11840 -37122 -38335 10878 44616 30569 25789 57550 69606 48747 38698 25542 13303 27267
11828 27267 33561 -8054 -20258 -3256 -206 -2843 6885 5531 37809 38427 20598 24531 24324 2847
$$ packed form
11915I239m2433O558J8020L7536J1745l0017k3266j564l8948L6234J0560j5850
11903b2186Q888j7601L325N445J3788j119Q906j4310m166J9444n264l909M2892
11890C4133j6406J604K5754J5098j4943k9728l2276l877n071J7359L898J5682
11878A1227o714L0565k9113l8678K3835k194r982P367M2358l466l1550k6597J1208
11865b1734q762j3972J2330J5668o329O778O919r545J8292j5221j6870q169n104
11852d5719K4865J7780j1017j5191o369P339J8925K0952q701m421j9172j6393
11840c7122j213M9213L3738j4047m780L1761J2056k0859j0049j3156j2239J3964
11828B7267O294m1615j2204J7002L050k637R728j354L2278O18j7829L933k07k1477
$$ plain form
11814 2847 -15055 -20779 -12508 -30173 -68299 -54569 -22485 -19610 -52671 -17574 -14343 -27852 -31933
11801 -31933 -22726 -23115 -2113 17817 2738 -23908 -59774 -56445 -28440 -21557 -40669 -19527 3386
11788 3386 -19648 -30837 -25540 -22612 -3118 -117 -2328 42244 38507 24603 3672 27739 39878
11775 39878 14173 11455 21027 19903 26434 36439 10577 -9641 -9525 -35943 -34858 -37416 -23317
11762 -23317 3529 38180 37219 32006 -1802 -20388 626 -9911 -26023 -18057 -14206 -15700 14038
11749 14038 35812 18596 -8243 -18274 -13782 -36534 1690 13589 -7762 -10671 7976 -4029
11737 -4029 8289 11490 8177 2300 3814 -18846 -9629 -5981 -9225 -11130 6643 5910 -10036 -11171
11723 -11171 10604 28930 -1197 -32432 -33645 -31960 1764 2315 -3814 -24485 -17879 -38381 -48527
$$ packed form
11814B847j7902n724Q271j7665l8126J3730L2084K875l3061L5097L231j3509m081
11801c1933R207l89K1002J9930j5079k6646l5866L329K8005O883j9112K1142K2913
11788C386k3034j1189N297K928J9494L001k211M4572l737j3904k0931K4067J2139
11775C9878k5705k718R572j124O531J0005k5862k0218J16k6418J085k558J4099
11762b3317K6846L4651r61n213l3808j8586K1014j0537j6112P966L851j494K9738
11749A4038K1774j7216k6839j0031M492k2752L8224J1899k1351k909J8647j2005
11737d029J2318L201l313n877J514k2660R217L648l244j905J7773p33j5946j135
11723a1171K1775J8326l0127l1235j213J685L3724N51o129k0671O606k0502j0146
$$ plain form
11710 -48527 -31010 -21410 -8129 27734 65861 76504 72897 77342 53119 30048 -6456 1346
11698 1346 8583 -13953 -31434 -34251 -29884 -5977 6140 10139 48434 83719 51976 4726 -35102
11685 -35102 -31851 -2171 35649 41293 35551 45699 68756 67194 54758 44490 50602 42852 30944
11672 30944 24674 18642 -24344 -42639 -15902 16265 21600 6353 -1677 -3413 29152 45941 22158
11659 22158 24296 -15881 -8778 9444 4244 -9749 8831 66901 103147 47866 12838 -19662
11647 -19662 -11340 -19085 -25033 -12218 -28034 -30073 -35871 -22519 -25902 -27983 -16526 -17002 -26784 -30792
11633 -30792 -10314 -28187 -25121 -9780 -3830 -20445 -11814 15222 -2813 -39919 -52660 -47041
11621 -47041 -44537 -28149 -32008 -32989 -44843 -16135 21230 15039 -18683 -44550 -44065 -7761 44542
$$ packed form
11710d8527J7517R600J3281L5863L8127J0643l607M445k4223k3071l6504P802
11698A346P237k2536j7481k817M367K3907J2117L999L8295L5285l1743m7250l9828
11685c5102L251K9680L7820N644n742J0148K3057j562j2436j0268O112p750j1908
11672C0944o270o032m2986j8295K6737L2167N335j5247q030j736L2565J6789k3783
11659B2158K138m0177P103J8222n200j3993J8580N8070L6246n5281l5028l2500
11647a9662Q322p745n948J2815j5816k039n798J3352l383k081J1457m76r782m008
11633c0792K0478j7873L066J5341N950j6615Q631K7036j8035l7106j2741N619
11621d7041K504J6388l859r81j1854K8708L7365o191l3722k5867M85L6304N2303
$$ plain form
11608 44542 54184 36122 -6236 -15564 -24542 -12922 -37830 -22420 -27775 -44679 -72196 -46753
11596 -46753 -17653 -31796 -61358 -75058 -35884 -22718 -23932 -900 16521 9186 15301 45846
11584 45846 52351 22849 2029 30615 56059 -423 -26374 -17043 488 8710 4411 -24497
11572 -24497 -42977 -23345 -46412 -72787 -80942 -48100 -9952 1207 -30587 -53049 -52751 -9748
11560 -9748 8323 46302 -158 -15539 -3747 2202 -15790 -36071 -36962 -29613 845 -878 -24020
11547 -24020 -51340 -57500 -38456 14248 53822 32803 20707 29632 8366 -3182 -44855 -75397
11535 -75397 -54924 -32787 -25282 -30211 -46885 -38821 -33184 -30378 -64913 -20529 -11243 -35413 -30686
11522 -30686 -3767 13096 1774 -21522 -39124 -43834 -5521 -2664 -28249 -61617 -51751 -54069
$$ packed form
11608D4542R642j8062m2358r328q978J1620k4908J5410n355j6904k7517K5443
11596d6753K9100j4143k9562j3700L9174J3166j214K3032J7421p335O115L0545
11584D5846O505k9502k0820K8586K5444n6482k5951R331J7531Q222m299k8908
11572b4497j8480J9632k3067k6375q155L2842L8148J1159l1794k2462K98M3003
11560i748J8071L7979m6460j5381J1792N949j7992k0281q91P349L0458j723k3142
11547b4020k7320o160J9044N2704L9574k1019j2096Q925k1266j1548m1673l0542
11535g5397K0473K2137P505m929j6674Q064N637K806l4535M4384R286k4170M727
11522c0686K6919J6863j1322k3296j7602m710L8313K857k5585l3368R866k318
$$ plain form
11510 -54069 -70922 -27848 -2725 8102 23636 -4597 -33720 -39457 -18212 -32842 2481 1372
11498 1372 -4017 -4975 10303 5698 -19366 -42586 -19821 -8281 -25395 -22722 -14698 -20767 -41464
11485 -41464 -72772 -53221 -25955 -2340 -15402 -5006 -34229 -7049 3541 -35134 -41517 -40094
11473 -40094 -71861 -89974 -99068 -87609 -69052 -61653 -59631 -50545 -43911 -29839 -31357 -8378 -34121
11460 -34121 -40607 -39980 -12945 -34692 -43107 -36478 -24521 -2577 3395 -7004 -11356 5239 16413
11447 16413 12973 9499 -5612 -7319 380 -18613 15559 38276 43631 17294 -13342 -33624 -41917
11434 -41917 -36842 -28140 -28718 -32347 -14167 13815 8544 -3726 -11870 -8449 4106 -22857 -34133
11421 -34133 -24379 -5096 -5291 -49340 -57510 -37157 -31543 -16063 9463 3822 33840 34866 25097
$$ packed form
11510e4069j6853M3074K5123J0827J5534k8233k9123n737K1245j4630L5323j109
11498A372n389r58J5278m605k5064k3220K2765J1540j7114K673Q024o069k0697
11485d1464l1308J9551K7266K3615j3062J0396k9223K7180J0590l8675o383J423
11473d0094l1767j8113r094J1459J8557P399K022R086O634J4072j518K2979k5743
11460c4121o486O27K7035k1747q415O629J1957K1944N972j0399m352J6595J1174
11447A6413l440l474j5111j707P699j8993L4172K2717N355k6337l0636k0282q293
11434d1917N075Q702n78l629J8180K7982n271j2270q144L421J2555k6963j1276
11421c4133R754J9283j95m4049q170K0353N614J5480K5526n641L0018J026r769
$$ plain form
11408 25097 19262 5383 24090 10462 -23343 -43033 -40663 -11969 19680 48825 55586 89433
11396 89433 85660 21847 -2983 -31175 -43411 -25429 -7637 15167 -216 2485 -12657 -9846
11384 -9846 9901 21399 20617 8437 -4486 -2250 14853 14878 -8819 -7293 -14369 -31168 -39115 -7688
11370 -7688 8751 20087 31737 9204 5712 -20174 -27364 1375 37119 31024 18140 38168
11358 38168 32801 30876 18761 13848 30728 31089 -9813 -514 10215 38554 45623 50324 20417
11345 20417 -6985 -24941 7141 18127 -4437 -13766 -40658 -77220 -64109 -46373 -32422 880
11333 880 14157 -1001 -930 23914 28285 -9269 2520 11379 1185 -51883 -44857 -20774 5506
11320 5506 20725 499 9348 -4399 -41153 -41167 -39802 -51517 -70476 -56335 -35321 -54375 -23908
$$ packed form
11408B5097n835j3879J8707j3628l3805j9690K370K8694L1649K9145O761L3847
11396H9433l773o3813k4830k8192j2236J7982J7792K2804j5383K701j5142K811
11384i846J9747J1498p82j2180j2923K236J7103K5k3697J526p076j6799p947L1427
11370g688J6439J1336J1650k2533l492k5886p190K8739L5744o095j2884K0028
11358C8168n367j925j2115m913J6880L61m0902R299J0729K8339P069M701k9907
11345B0417k7402j7956L2082J0986k2564r329k6892l6562J3111J7736J3951L3302
11333H80J3277j5158P1K4844M371l7554J1789Q859j0194n3068P026K4083K6280
11320E506J5219k0226Q849j3747l6754j4J365j1715j8959J4141K1014j9054L0467
$$ plain form
11307 -23908 -27533 -21427 -31187 -41754 -41985 -12496 15763 23143 20006 34186 18844 27969 16702
11294 16702 7555 -1850 15062 33296 10397 19946 15638 16074 28029 11990 8208 3019 -17225
11281 -17225 -8357 45616 38936 18743 25998 13903 -21918 -27530 -26169 4735 17137 -211 -23222
11268 -23222 9548 24632 5591 3348 28519 31692 -7349 -12693 -17111 5780 -29062 -7903
11256 -7903 30164 45019 60661 74586 89801 87952 45568 5698 -10935 -29791 -24453 177
11244 177 1820 13924 16763 35759 65813 66260 26425 -28355 -56311 -16798 -3196 -13795 -9329
11231 -9329 11728 3251 3883 15818 -2731 -29841 -56586 -45903 -37223 -26252 -10912 2749 -7065
11218 -7065 -24014 -40208 -26909 -11426 12754 28591 36705 42459 16915 -7533 5691 18645
$$ packed form
11307b3908l625O106r760j0567k31K9489K8259P380l137J4180j5342R125j1267
11294A6702r147r405J6912J8234k2899R549m308M36J1955j6039l782n189k0244
11281a7225Q868N3973o680k0193P255j2095l5821n612J361L0904J2402j7348k3011
11268b3222L2770J5084j9041k243K5171L173l9041n344m418K2891l4842K1159
11256g903L8067J4855J5642J3925J5215j849m2384l9870j6633j8856N338K4630
11244A77J643J2104K839J8996L0054M47l9835n4780k7956L9513J3602j0599M466
11231i329K1057q477O32J1935j8549k7110k6745J0683Q680J0971J5340J3661r814
11218g065j6949j6194J3299J5483K4180J5837Q114N754k5544k4448J3224J2954
$$ plain form
11206 18645 49582 57271 81717 74941 39332 -12690 -24606 -34183 984 9200 9322 -9338 -16957
11193 -16957 -26194 -1801 9647 14229 35778 34429 7511 1468 -4669 21640 -2849 27696 57946
11180 57946 39848 20758 10914 -40155 -47891 -34655 -37166 -27981 -7574 10333 19545 53053 66158
11167 66158 73375 47414 42172 55481 62298 62948 79560 66646 41031 26326 12132 4775 -22036
11154 -22036 -40002 -37773 -28606 -22355 -22354 -24081 -15938 -29171 -17958 -12171 -20363 -20303 9532 19846
11140 19846 27235 13685 -6413 6003 59172 65893 20983 29202 9434 -6567 -7580 -3862 -25842
11127 -25842 -17914 -5132 15900 23747 17662 -15338 -25745 -36498 -23827 -5569 -23774 -23840 -10952
11114 -10952 8486 7697 -19578 -37054 -34787 18512 48274 18193 32104 28539 28973 -18507 -32234
$$ packed form
11206A8645L0937P689K4446o776l5609n2022j1916r577L5167Q216J22j8660p619
11193a6957r237K4393J1448M582K1549j349k6918o043o137K6309k4489L0545L0250
11180E7946j8098j9090r844n1069p736J3236k511R185K0407J7907R212L3508J3105
11167F6158P217k5961n242J3309O817O50J6612j2914k5615j4705j4194p357k6811
11154b2036j7966K229R167O251Jj727Q143j3233J1213N787q192O0K9835J0314
11140A9846P389j3550k0098J2416N3169O721m4910Q219j9768j6001j013L718k1980
11127b5842P928J2782K1032P847o085l3000j0407j0753J2671J8258j8205o6J2888
11114a0952J9438p89k7275j7476K267N3299K9762l0081J3911l565M34m7480j3727
$$ plain form
11101 -32234 -17833 -55749 -60742 -60093 -52379 -23636 -41826 -46903 -15458 -7535 -35684 -11216 16774
11088 16774 20404 13928 20691 21231 19747 42788 34897 -236 16304 15214 10084 -17879 -59090
11075 -59090 -66524 -83817 -59901 -29986 -60754 -73107 -48059 -36174 -59653 -68214 -42764 -46264
11063 -46264 -42804 -45674 -18662 21236 49972 26149 22177 22759 -3109 -12632 -6408 29182 17670
11050 17670 3764 4999 8251 -8549 -1727 -10495 -54085 -44003 -6120 -9241 -26689 -66 34514
11037 34514 28571 31945 40523 38143 251 -5789 -10686 -4536 -18432 -39890 -26638 -14362 21901
11024 21901 48862 54473 74069 18134 -2902 20553 11939 13890 -13339 9654 38751 67498
11012 67498 21723 -8697 -30561 -59952 -71730 -52770 -48625 -17239 10424 15281 -3990 -9960
$$ packed form
11101c2234J4401l7916m993O49P714K8743j8190n077L1445P923k8149K4468K7990
11088A6774L630o476O763N40j484K3041p891l5133J6540j090n130k7963m1211
11075e9090p434j7293K3916K9915l0768j2353K5048J1885k3479q561K5450l500
11063d6264L460k870K7012L9898K8736k3823l972N82k5868r523O224L5590j1512
11050A7670j3906J235L252j6800O822q768m3590J0082L7883l121j7448K6623L4580
11037C4514n943L374Q578k380l7892o040m897O150j3896k1458J3252J2276L6263
11024B1901K6961N611J9596n5935k1036K3455q614J951k7229K2993K9097K8747
11012F7498m5775l0420k1864k9391j1778J8960M145L1386K7663M857j9271n970
$$ plain form
11000 -9960 3553 19612 -22049 -30693 -7527 16740 -4661 -15236 -19799 -30326 -20645 1332
10988 1332 9727 19301 45273 -9717 -29076 -21959 -12850 13792 2911 -8727 -7166 -38448 -74739
10975 -74739 -60243 -23708 4177 19599 -736 -25332 -32919 -32490 -28372 -9208 -2891 -2040 501
10962 501 -26675 -45486 -19892 436 -4750 -13351 -18091 -8892 15089 8933 17592 19001 -15513
10949 -15513 -48446 -60724 -61047 -51762 -7154 26526 15814 25786 2844 -19773 2686 904 -24443
10936 -24443 -62341 -73505 -13450 -1106 -5938 6849 34551 43497 37010 42958 23678 3057
10924 3057 -33206 -30437 -1537 18588 -8052 -18812 -47408 -43761 3671 30712 3312 -16617
10912 -16617 8741 23459 7981 4798 -5662 7300 -4310 154 15733 19229 13524 2021
$$ packed form
11000i960J3513J6059m1661q644K3166K4267k1401j0575m563j0527R681K1977
10988A332Q395R574K5972n4990j9359P117R109K6642j0881j1638J561l1282l6291
10975g4739J4496L6535K7885J5422k0335k4596p587M29M118J9164O317Q51K541
10962E01k7176j8811K5594K0328n186q601m740R199K3981o156Q659J409l4514
10949a5513l2933j2278l23R285M4608L3680j0712R972k2942k2617K2459j782k5347
10936b4443l7898j1164O0055J2344m832J2787K7702Q946o487N948j9280k0621
10924C057l6263K769K8900K0125k6640j0760k8596L647M7432K7041k7400j9929
10912a6617K5358J4718j5478l183j0460J2962j1610M464J5579L496n705j1503
$$ plain form
10900 2021 3061 -9443 -7588 21140 30581 34433 44249 25348 1006 14021 8075 352 -28446
10887 -28446 -7257 594 -49941 -30389 -7717 -9621 -18378 -41504 -45982 -7347 -12659 -12379 -7675
10874 -7675 -5542 -3859 -33471 -52202 -31400 -36238 -11628 12811 19456 17122 -22864 -20024 -8191
10861 -8191 10858 6474 39257 78221 32790 31082 13111 -40253 -76942 -64914 -44687 -77177
10849 -77177 -64438 -44293 -44700 -43853 -48730 -55214 -21732 31926 32584 -7123 -14448 -7628 -17451 30664
10835 30664 34593 29678 46224 28924 16752 8705 12852 34162 16839 -4145 25756 27269 30089
10822 30089 38025 18967 -12111 12851 36692 45594 17738 -53766 -53000 -48850 -41949 -40875 -44818
10809 -44818 -11720 4873 4843 9402 37769 51781 34587 29046 48137 24015 -15393 -35999 -45805
$$ packed form
10900B021J040j2504J855K8728R441L852R816j8901k4342J3015n946p723k8798
10887b8446K1189P851n0535J9552K2672j904q757k3126m478L8635n312K80M704
10874g675K133J683k9612j8731K0802m838K4610K4439O645k334l9986K840J1833
10861h191J9049m384L2783L8964m5431j708j7971n3364l6689J2028K0227l2490
10849g7177J2739K0145m07Q47m877o484L3482N3658O58l9707p325O820r823M8115
10835C0664L929m915J6546j7300j2172q047M147K1310j7323k0984K9901J513K820
10822C0089P936j9058l1078K4962K3841Q902k7856p1504P66M150O901J074l943
10809d4818L3098J6593l0M559K8367J4012j7194n541J9091k4122l9408k0606r806
$$ plain form
10796 -45805 -41946 -17206 513 11507 3201 -22434 -17070 17436 30718 43159 30691 22179
10784 22179 23359 11017 27107 35221 24617 518 -5448 -20189 -31721 -34048 -46337 -28659
10772 -28659 1354 8575 -14734 6169 23063 42925 44143 56743 50129 32910 26491 16587 -2661
10759 -2661 -35461 -54580 -55992 -52051 -56535 -54056 -31723 6056 -12597 -23952 -5065 24151 8153
10746 8153 -31861 -59431 -76397 -63459 -49768 -33017 -25865 -52385 -51479 -47170 -92614 -105727 -80443
10733 -80443 -40244 -33458 -38535 -41773 -42862 -65317 -58124 -33875 -3432 868 -2276 -7902 439
10720 439 4713 -40564 -63073 -34023 1491 -3710 30734 70118 49229 19653 -3309 -11360 -3322
10707 -3322 -11403 -47225 -64645 -70573 -90837 -69025 -46067 -49001 -62510 -45587 -17437 -27140 -61564
$$ packed form
10796d5805L859K4740J7719J0994q306k5635N364L4506J3282J2441j2468q512
10784B2179J180j2342J6090Q114j0604k4099n966j4741j1532k327j2289J7678
10772b8659L0013P221k3309K0903J6894J9862J218J2600o614j7219o419r904j9248
10759b661l2800j9119j412L941m484K479K2333L7779j8653j1355J8887K9216j5998
10746H153m0014k7570j6966J2938J3691J6751P152k6520R06M309m5444j3113K5284
10733h0443M0199O786n077l238j089k2455P193K4249L0443M300l144n626Q341
10720D39M274m5277k2509K9050L5514n201L4444L9384k0889k9576k2962q051Q038
10707c322q081l5822j7420n928k0264K1812K2958k934j3509J6923K8150r703l4424
$$ plain form
10694 -61564 -55571 -21985 2935 1784 -36022 -20297 22426 46388 27606 -5134 -34701 -32726
10682 -32726 -28049 -18137 -6547 -20919 -35694 -43752 -12040 1020 -20308 -50056 -70496 -58973
10670 -58973 -60186 -37619 -26890 -34802 -33878 -29634 -29242 -30324 -4281 -26884 -52362 -68125 -65131
10657 -65131 -58633 -9451 -9823 -41039 -61399 -64958 -35183 -26497 -30700 -33447 -37591 -26172 -16181
10644 -16181 4695 14447 -27839 -63261 -48888 -46311 -42687 -48690 -29834 -15422 7678 16684 8362
10631 8362 8341 5048 -16309 -33875 -9482 10849 -19780 -6628 -11892 -22526 -7474 28166 26413
10618 26413 -3694 -15948 -28414 -59682 -37303 -1553 12433 663 12586 -7782 -24428 -22875
10606 -22875 -3742 13333 33356 64587 39160 1975 -10369 -33943 -4001 17566 5372 -33126
$$ packed form
10694f1564N993L3586K4920j151l7806J5725M2723K3962j8782l2740k9567J975
10682c2726M677R912J1590j4372j4775q058L1712J3060k1328k9748k0440J1523
10670e8973j213K2567J0729p912R24M244L92j082K6043k2603k5478j5763K994
10657f5131O498M9182l72l1216k0360l559K9775Q686m203k747m144J1419R991
10644a6181K0876R752m2286l5422J4373K577L624o003J8856J4412K3100R006q322
10631H362k1l293k1357j7566K4393K0331l0629J3152n264j0634J5052L5640j753
10618B6413l0107j2254j2466l1268K2379L5750J3986j1770J1923k0368j6646J553
10606b2875J9133J7075K0023L1231k5427l7185j2344k3574K9942K1567j2194l8498
$$ plain form
10594 -33126 -7652 12072 -216 15185 14292 10882 10640 7193 25307 8671 6812 -7184 2098
10581 2098 10536 30201 16891 -4681 10058 15651 6834 -30761 -58614 -47281 -35978 -20880
10569 -20880 34215 31305 1270 18782 -13778 -5975 257 -22658 -1029 -468 23130 27558 -8959
10556 -8959 -34129 -50717 -23051 -14834 -30696 -50679 -47392 -37227 -14761 -33123 -35197 -14765
10544 -14765 10 -18559 7447 1780 -12928 -38797 -36003 -21160 -913 -22801 -30031 8563
10532 8563 -4322 -40170 -56773 -74286 -40088 -21197 -49157 -75766 -68662 -54050 977 42138
10520 42138 38932 -6186 -64297 -84023 -71277 -38355 -30887 4385 39044 44317 43847 88268 101606
10507 101606 59496 39301 31023 13015 -7902 -25462 -25134 5873 21686 6038 -10375 12697
$$ packed form
10594c3126K5474J9724j2288J5401q93l410k42l447J8114j6636j859j3996R282
10581B098Q438J9665j3310k1572J4739N593q817l7595k7853J1333J1303J5098
10569b0880N5095k910l0035J7512l2560P803O232k2915K1629N61K3598M428l6517
10556h959k5170j6588K7666Q217j5862j9983L287J0165K2466j8362k074K0432
10544a4765J4775j8569K6006n667j4708k5869K794J4843K0247k1888p230L8594
10532H563j2885l5848j6603j7513L4198J8891k7960k6609P104J4612N5027M1161
10520D2138l206m5118n8111j9726J2746L2922P468L5272L4659N273m70M4421J3338
10507A01606m2110k0195q278j8008k0917j7560L28L1007J5813j5648j6413K3072
$$ plain form
10495 12697 33787 21853 11757 21441 -1505 -14968 -4629 -6788 -15602 14954 19212 -1055
10483 -1055 7159 30904 10099 -26954 -55637 -66007 -62772 -59382 -23995 21302 15513 10833 23006
10470 23006 21571 8944 25927 31836 2943 -14301 -4487 -9633 -54683 -45040 -57089 -60167 4883
10457 4883 25315 27078 42806 15193 -2100 -33083 6439 27054 8948 -1714 14171 -14930
10445 -14930 -39659 -45160 -32179 -5006 -8854 -12442 1745 -392 -12683 -21069 2091 7770 26696
10432 26696 21105 34598 45084 26677 17741 14283 16474 18713 5312 4744 16901 447 -7869
10419 -7869 -25365 -32235 -41173 -35326 -57662 -55989 -63473 -85261 -66008 -18255 24523 38753 -950
10406 -950 -872 15689 -9833 -28599 -23962 -10380 -37002 -44575 -29694 7767 24435 -7312 -372
$$ packed form
10495A2697K1090j1934j0096R684k2946j3463J0339k159q814L0556M258k0267
10483a055Q214K3745k0805l7053k8683j0370L235L390L5387M5297n789m680J2173
10470B3006j435j2627J6983N909k8893j7244R814n146m5050R643j2049l078O5050
10457D883K0432J763J5728k7613j7293l0983L9522K0615j8106j0662J5885k9101
10445a4930k4729n501J2981K7173l848l588J4187k137j2291q386K3160N679J8926
10432B6696n591J3493J0486j8407q936l458K191K239j3401n68J2157j6454q316
10419g869j7496o870q938N847k2336J673p484k1788J9253M7753M2778J4230l9703
10406i50P8J6561k5522j8766M637J3582k6622p573J4881L7461J6668l1747O940
$$ plain form
10393 -372 12092 28073 11373 15024 30004 -4107 -36167 -26888 -4266 1401 -22632 -3425 -3040
10380 -3040 -3977 5655 -639 -31925 -29006 -59449 -46458 -12439 6068 -29654 -61499 -55836 -70821
10367 -70821 -78085 -35523 -20219 -17259 -567 6810 -18877 -49909 -48955 -20962 15868 53340 88573
10354 88573 45428 27562 9107 4979 37072 6353 22981 53889 51562 11212 7433 -36147
10342 -36147 -47273 -10863 27378 -1664 -6853 -18482 -39535 -51031 -54023 -16582 14643 3367
10330 3367 -19759 -12449 -3250 1381 10385 -3084 18526 44224 66164 82533 41942 -1942 -21566
10317 -21566 -5866 5532 14957 15578 31294 38476 2540 -23312 -11067 34656 42909 25677 35949
10304 35949 68548 51073 5646 -6860 -22922 -34506 -37097 -33546 -35940 -54738 -47970 -6540
$$ packed form
10393c72J2464J5981j6700L651J4980l4111l2060R279K2622N667k4033J9207L85
10380c040r37R632o294l1286K919l0443J2991L4019J8507l5722l1845N663j4985
10367g0821p264M2562J5304K960J6692P377k5687l1032R54K7993L6830L7472L5233
10354H8573m3145j7866j8455m128L2093l0719J6628L0908k327m0350l779m3580
10342c6147j1126L6410L8241k9042n189j1629k1053j1496k992L7441L1225j1276
10330C367k3126P310R199M631R004j3469K1610K5698K1940J6369m0591m3884j9624
10317b1566J5700J1398R425O21J5716P182l5936k5852J2245M5723Q253j7232J0272
10304C5949L2599j7475m5427j2506j6062j1584k591L551k394j8798O768M1430
$$ plain form
10292 -6540 -28683 -14038 -4851 -31092 -17513 -9396 -28386 -35060 -37354 -27504 -68490 -87207 -77351
10279 -77351 -35385 -47153 -35687 18392 57729 8933 -33834 -9727 -18493 -55109 -61885 -53282
10267 -53282 -50559 -19292 -24690 -52963 -52810 -20151 2417 -2059 18451 41498 29141 -34645 -73368
10254 -73368 -68342 -74632 -57710 -34570 -14434 -13447 1392 30541 14879 -8731 -37904 -29892 7218
10241 7218 -17153 -30529 -14127 -15103 -23071 -6318 12604 42210 18929 -25157 -36704 -17073
10229 -17073 9359 5506 3337 19789 38229 66478 49241 -15135 -48822 -52916 -5957 11842
10217 11842 -504 -8329 -6623 15709 46649 49780 33293 -4445 2844 -5443 -41390 -43597 -16948
10204 -16948 -31656 -21807 5894 23607 41464 64078 41390 23533 12611 24419 21566 5620
$$ packed form
10292f540k2143J4645R187k6241J3579Q117j8990o674k294R850m0986j8717R856
10279g7351M1966j1768J1466N4079L9337m8796m2767K4107q766l6616o776Q603
10267e3282K723L1267n398k8273J53L2659K2568m476K0510K3047j2357o3786l8723
10254g3368N026o290J6922K3140K0136R87J4839K9149j5662k3610k9173Q012L7110
10241G218k4371j3376J6402r76p968J6753J8922K9606k3281m4086j1547J9631
10229a7073K6432l853k169J6452J8440K8249j7237o4376l3687m094M6959J7799
10217A1842j2346p825J706K2332L0940L131j6487l7738P289q287l5947k207K6649
10204a6948j4708R849K7701J7713J7857K2614k2688j7857j0922J1808k853j5946
$$ plain form
10192 5620 35087 43749 25363 -21884 -13768 -25315 -4047 28298 16363 -6634 -2668 -3889 17516
10179 17516 33584 15684 -17984 -44295 -15900 -19812 -56253 -54371 -49530 -12618 -5224 24068
10167 24068 13394 25713 37736 44722 29988 7832 4667 -29040 -24866 8119 7193 11585 5536
10154 5536 21661 52436 64109 48550 49859 35589 22990 16424 9030 33410 33192 21037 -2218
10141 -2218 -34950 -15661 -9268 -147 26870 54721 41331 -10413 -16605 -29170 -34753 -16972 -3059
10128 -3059 -40662 -32052 1733 -3530 -2018 -20627 -17250 -20134 -12359 -7374 -4634 716 35609 34389
10114 34389 9918 -32886 -39898 -23818 -14351 12993 3004 15638 33548 44011 24129 -15872
10102 -15872 3273 11476 -14154 18734 47092 69821 76254 54207 3801 -10052 -25488 -33047
$$ packed form
10192E620K9467Q662j8386m7247Q116j1547K1268L2345j1935k2997L966j221K1405
10179A7516J6068j7900l3668k6311K8395l912l6441J882M841L6912P394K9292
10167B4068j0674J2319J2023O986j4734k2156l165l3707M174L2985r26M392o049
10154E536J6125L0775J1673j5559J309j4270j2599o566p394K4380k18j2155k3255
10141b218l2732J9289O393R121K7017K7851j3390n1744o192j2565n583J7781J3913
10128c059l7603Q610L3785n263J512j8609L377k884P775M985K740N350L4893j220
10114C4389k4471m2804p012J6080R467K7344r989J2634J7910J0463j9882m0001
10102a5872J9145Q203k5630L2888K8358K2729O433k2047n0406j3853j5436p559
$$ plain form
10090 -33047 -16687 26864 19633 13784 -24594 -47630 -53682 -72954 -45422 -10624 -13961 -2647
10078 -2647 -18049 -24983 -16756 -5622 9689 27021 46967 30229 16406 33979 66919 104551
10066 104551 114835 99532 93918 114619 146354 136309 88615 83016 100563 97991 96954 151149
10054 151149 185691 209566 209078 250715 334135 422814 546220 697016 842790 1041935 1246339
10043 1246339 1289839 1132602 887636 698038 527881 375000 258520 216495 177617 125272
10033 125272 89342 78177 68427 51823 59471 45235 60244 80399 48037 28386 37755 38022
10021 38022 19655 6692 30740 20789 13571 27981 27187 15665 17326 43863 15436 -906 15341
10008 15341 29180 3230 29548 44175 10205 -9004 -20834 -8446 28456 50612 49284 27738
$$ packed form
10090c3047J6360M3551p231n849l8378k3036o052j9272K7532L4798l337J1314
10078b647j5402o934Q227J1134J5311J7332J9946j6738j3823J7573L2940L7632
10066A04551J0284j5303n614K0701L1735j0045m7694n599J7547k572j037N4195
10054A51149L4542K3875m88M1637Q3420Q8679J23406J50796J45774J99145K04404
10043A246339M3500j57237k44966j89598j70157j52881j16480m2025l8878n2345
10033A25272l5930j1165r750j6604P648j4236J5009K0155l2362j9651R369K67
10021C8022j8367j2963K4048r951p218J4410p94j1522J661K6537k8427j6342J6247
10008A5341J3839k5950K6318J4627l3970j9209j1830J2388L6902K2156j328k1546
$$ plain form
9996 27738 8818 -8237 -42682 -61615 -27292 -17317 -17492 -21688 -29447 -23346 -11631 2016 -423
9983 -423 -6308 18828 -18955 -26633 -18917 -3946 12502 3401 -26627 -34612 -53969 -67772 -35524
9970 -35524 16761 42767 44549 21764 -5577 -17913 606 25026 22891 -15838 -22651 -19649 -17326
9957 -17326 -7281 -9976 34705 34636 -13497 -42929 -56455 -53190 -34979 -38252 -27962 -12314 -16853
9944 -16853 -29376 -10645 -8540 7305 22909 19444 11335 5577 3079 3490 -15044 -38895 -63812
9931 -63812 -41543 -34321 -27762 -9029 -3707 -15157 -25736 20207 58205 47368 25277 13750
9919 13750 22463 29505 34332 -10159 -22432 -22181 -24250 -28139 -12837 401 -18602 12149 28657
9906 28657 32359 22885 -24932 -54940 -34059 20228 52029 11904 -7746 25903 19077 -14394
$$ packed form
9996B7738j8920j7055l4445j8933L4323R975j75m196p759O101J1715J3647k439
9983d23n885K5136l7783p678P716J4971J6448r101l0028p985j9357j3803L2248
9970c5524N2285K6006J782k2785k7341j2336J8519K4420k135l8729o813L002K323
9957a7326J0045k695M4681o9m8133k9432j3526L265J8211l273J0290J5648m539
9944a6853j2523J8731K105J5845J5604l465q109n758k498M11j8534k3851k4917
9931f3812K2269P222O559J8733N322j1450j0579M5943L7998j0837k2091j1527
9919A3750Q713P042M827m4491j2273K51k069l889J5302J3238j9003L0751J6508
9906B8657L702r474m7817l0008K0881N4287L1801m0125j9650L3649o826l3471
$$ plain form
9894 -14394 2988 15512 20048 12156 7551 3626 26520 73996 49104 36095 59073 67242 65370
9881 65370 43977 32147 30743 28001 12525 -22940 -27264 -40357 -19373 21279 14089 4625 -12692
9868 -12692 4043 27576 29201 -373 11286 -252 6307 18374 30995 34800 22016 49123
9856 49123 38517 29206 24183 57496 42756 -3623 -6358 -9425 -4977 5675 -3050 -22315 -31916
9843 -31916 -13698 11076 8644 -16419 6600 40414 12266 -25071 -45440 -12392 19191 -20033
9831 -20033 -27362 -28293 -41672 -55993 -43290 -26690 -43501 -38898 -43658 -31853 -30705 -23229 -23139 -14428
9817 -14428 2369 128 -46077 -51039 -24963 -28839 -38048 -46504 -34611 -54063 -32445 -21183 -26308
9804 -26308 907 43561 26547 -13782 -8774 -25638 -36259 -23518 28633 64045 78669 81474
$$ packed form
9894a4394J7382J2524M536p892m605l925K2894M7476k4892j3009K2978Q169j872
9881F5370k1393j1830j404k742j5476l5465m324j3093K0984M0652p190r464j7317
9868a2692J6735K3533J625k9574J1659j1538O559J2067J2621L805j2784K7107
9856D9123j0606r311n023L3313j4740m6379k735l067M448J0652q725j9265r601
9843c1916J8218K4774k432k5063K3019L3814k8148l7337k0369L3048L1583l9224
9831b0033p329r31j3379j4321J2703J6600j6811M603m760J1805J148P476R0Q711
9817a4428J6797k241m6205m962K6076l876r209q456J1893j9452K1618J1262n125
9804b6308K7215M2654j7014m0329N008j6864j0621J2741N2151L5412J4624K805
$$ plain form
9792 81474 52164 48730 24534 9069 387 -4997 -3886 9207 23206 14295 23789 30890 17151
9779 17151 13200 -1057 -5093 35388 22690 -5348 -21584 -28789 2710 14553 34453 37395 16594
9766 16594 19198 19795 -5503 2385 -40729 -40177 -45595 -20610 -11390 -17965 8470 -14332 -58827 -57954
9752 -57954 -67873 -69039 -57384 -26619 14699 18146 -5198 -30232 2244 18466 -196 -9875 -1954
9739 -1954 29278 19764 -7419 -38560 -38178 -26925 -22589 -28697 -9585 -7975 28506 32341 16320
9726 16320 36549 57931 50623 21144 5623 11542 5005 31627 23370 -23002 -21865 -30720 -38410
9713 -38410 -28430 -3601 10362 -5007 602 -22694 -28589 -11909 -24066 -36579 -50269 -28118
9701 -28118 -5091 -10330 -38708 -70749 -47855 -5575 -9903 -24732 -5445 30613 23269 -1548
$$ packed form
9792H1474k9310l434k4196j5465q682n384J111J3093J3999q911R494P101j3739
9779A7151l951j4257m036M0481j2698k8038j6236p205L1499J1843J9900K942k0801
9766A6594K604N97k5298P888m3114N52n418K4985R220o575K6435k2802m4495Q73
9752e7954r919j166J1655L0765M1318L447k3344k5034L2476J6222j8662r679P921
9739a954L1232r514k7183l1141L82J1253M336o108J9112J610L6481L835j6021
9726A6320K0229K1382p308k9479j5521N919o537K6622q257m6372J137q855p690
9713c8410R980K4829J3963j5369N609k3296n895J6680j2157j2513j3690K2151
9701b8118K3027n239k8378l2041K2894M2280m328j4829J9287L6058p344k4817
$$ plain form
9689 -1548 26205 28310 542 -16865 -31946 -46306 -53955 -58736 -44483 -27971 -34762 -41505 -33004
9676 -33004 -4809 10610 -4061 21745 40653 18729 30937 26204 10119 -57063 -98845 -86802
9664 -86802 -78720 -84000 -81052 -57402 -28338 -18709 -18337 -23565 -35726 -203 35560 66069 79260
9651 79260 35335 16306 -12216 -3765 14175 14297 -18926 -24765 -29015 -83151 -65637 -24317 14126
9638 14126 24111 35260 56189 32689 -21066 -39055 -46965 -6563 24175 7435 31338 33447
9626 33447 -1569 -43481 -82033 -58214 -20334 -1735 -28883 -36704 -37816 -31880 -15561 -8208 2551
9613 2551 32015 33364 -9524 22904 55962 48030 3361 -22730 -15222 11011 14386 1719 9059
9600 9059 7081 -10862 17687 48938 62825 47379 28459 59827 29273 288 -12326 -22314
$$ packed form
9689a548K7753K105k7768j7407j5081j4360p649m781J4253J6512o791o743Q501
9676c3004K8195J5419j4671K5806J8908k1924J2208m733j6085o7182m1782J2043
9664h6802Q082n280K948K3650K9064R629L72n228j2161L5523L5763L0509J3191
9651G9260m3925j9029k8522Q451J7940J22l3223n839m250n4136J7514M1320L8443
9638A4126R985J1149K0929k3500n3755j7989p910M0402L0738j6740K3903K109
9626C3447l5016m1912l8552K3819L7880J8599k7148p821j112N936J6319P353J0759
9613B551K9464J349m2888L2428L3058p932m4669k6091P508K6233L375j2667P340
9600I059j978j7943K8549L1251J3887j5446j8920L1368l0554k8985j2614r988
$$ plain form
9588 -22314 -14774 -7784 -37961 -35310 -3116 12002 10364 2429 -5963 -18548 -14989 4035 5739
9575 5739 -22075 -25300 7512 34716 -17664 -68480 -50669 -44633 -36058 -40417 -56280 -39267 -12293
9562 -12293 -4043 -23410 -47867 -48761 -45787 -13259 -21033 20468 2213 -6729 18452 6655 -13047
9549 -13047 -1130 -7613 -1770 40866 33513 19446 15081 7212 7647 10617 21050 21234 -19056 -40412
9535 -40412 -70171 -49419 -5041 6880 -11100 -46056 -13611 4349 -11411 -26236 -59036 -38114
9523 -38114 -3356 18847 34598 50082 25445 9199 16159 56860 27694 -3399 -16352 -12432
9511 -12432 -4958 -22775 -41778 -43758 -19441 -41559 -39465 -22282 -14140 6441 -4036 -9185 12888
9498 12888 27980 -6241 -21986 -26190 -32571 -23284 -30968 -7621 33770 53464 56307 62854 65451
$$ packed form
9588b2314P540O990l0177K651L2194J5118j638p935q392j2585L559J9024J704
9575E739k7814l225L2812K7204n2380n0816J7811O036Q575m359j5863J7013K6974
9562a2293Q250j9367k4457q94K974L2528p774M1501j8255q942K5181j1797j9702
9549a3047J1917o483N843M2636p353j4067m365p869M35K970J0433J84m0290k1356
9535d0412k9759K0752M4378J1921j7980l4956L2445J7960j5760j4825l2800K0922
9523c8114L4758K2203J5751J5484k4637j6246O960M0701k9166l1093j2953L920
9511a2432P474j7817j9003j980K4317k2118K094J7183Q142K0581j0477n149K2073
9498A2888J5092l4221j5745m204o381R287p684K3347M1391J9694K843O547K597
$$ plain form
9485 65451 81780 68449 66016 63476 34095 30734 44623 29130 26557 15845 -3012 -14467 -19413
9472 -19413 12400 21709 -3724 -16889 -10711 940 -21879 -21355 -1372 21913 11144 15036 21157
9459 21157 -6079 -22291 -25844 -28144 -2311 19338 5645 -57143 -90295 -83916 -47340 -10726
9447 -10726 4966 6013 15509 2454 -17316 -6180 -4568 331 8914 1738 11169 29072 43333
9434 43333 54255 55327 61040 29963 -10406 -11602 36622 54437 44764 29978 26491 14208 -6537
9421 -6537 -5119 16454 26279 -32169 -28802 -28959 -54292 -55989 -26462 -13801 -24847 -43389 -51671
9408 -51671 -65477 -80378 -50101 -46045 -59773 -22612 -33591 -10495 39334 27545 40899 34024
9396 34024 17328 9598 -24171 -75187 -53868 -7439 25531 32168 -14557 -27573 -55556 -78704
$$ packed form
9485F5451J6329j3331k433k540k9381l361J3889j5493k573j0712j8857j1455m946
9472a9413L1813R309k5433j3165O178J1651k2819N24J9983K3285j0769L892O121
9459B1157k7236j6212l553k300K5833K1649j3693o2788l3152O379L6576L6614
9447a0726J5692J047R496j3055j9770J1136J612M899Q583p176R431J7903J4261
9434D3333J0922J072N713l1077m0369j196M8224J7815r673j4786l487j2283k0745
9421f537J418K1573R825n8448L367j57k5333j697K9527J2661j1046j8542q282
9408e1671j3806j4901L0277M056j3728L7161j0979K3096M9829j1789J3354o875
9396C4024j6696p730l3769n1016K1319M6429L2970O637m6725j3016k7983k3148
$$ plain form
9384 -78704 -62021 -51078 -56820 -33024 -18197 -63106 -64406 7731 24778 10882 20221 8670
9372 8670 34490 20420 -1181 -8201 5875 13768 -22006 14353 53220 35063 5774 -41066
9360 -41066 -34964 -35094 -39222 -29418 -39164 -36557 -34795 -8336 -5425 -1325 -31936 -35192 -21813 -19694
9346 -19694 -16912 -12742 12694 -11391 -3226 8858 43342 21524 7473 21566 41287 33352 24593
9333 24593 4295 13858 26391 -25432 -47099 -10042 27766 28117 26552 20321 21023 34820 1910
9320 1910 3723 -13906 -23647 -34976 -27669 -3944 -21047 -22733 -41535 -30016 -39243 -54955 -58412
9307 -58412 -20077 7862 -21975 -28915 -32541 22212 37166 20403 9341 10968 -6116 -20618
9295 -20618 -18899 -26148 -18494 -21000 11792 25552 3647 32012 65752 40817 26578 60836 72602
$$ packed form
9384g8704J6683J0943n742K3796J4827m4909j300P2137J7047j3896R339j1551
9372H670K5820j4070k1601p020J4076P893l5774L6359L8867j8157k9289m6840
9360d1066O102j30m128R804r746K607J762K6459K911M100l0611l256J3379K119
9346a9694K782M170K5436k4085Q165J2084L4484k1818j4051J4093J9721p935q759
9333B4593k0298R563J2533n1823k1667L7057L7808L51j565o231P02J3797l2910
9320A910J813j7629r741j1329P307K3725j7103j686j8802J1519r227j5712l457
9307e8412L8335K7939k9837o940l626N4753J4954j6763j1062J627j7084j4502
9295b0618J719p249P654k506L2792J3760k1905K8365L3740k4935j4239L4258J1766
$$ plain form
9282 72602 70328 100872 77210 42547 -12845 -29416 -13134 15557 23341 47438 50244 72775
9270 72775 64244 28502 38299 37823 39885 35034 39598 62388 54169 55384 36368 43486 34875 -9633
9256 -9633 -23586 -3124 -236 18170 42576 44124 78436 93438 73493 59230 52963 29546 33966
9243 33966 41218 94122 102956 92717 95315 111542 99628 94411 114489 125080 98823 120435 136837
9230 136837 129171 141253 170120 207668 222187 173831 197326 263450 318935 353431 452023 528498
9218 528498 564199 611330 701739 811147 933878 1074875 1205834 1411694 1585705 1694727
9208 1694727 1881369 2060689 2228774 2442074 2730137 3056306 3463023 4013748 4678407 5475343
9198 5475343 6442709 7584271 8766767 9901125 10557829 10426072 9536893 8224970 6830001
$$ packed form
9282G2602k274L0544k3662l4663n5392j6571J6282K8691P784K4097K806K2531
9270G2775q531l5742R797m76K062m851M564K2790q219J215j9016P118q611m4508
9256i633j3953K0462K888J8406K4406J548L4312J5002j9945j4263o267k3417M420
9243C3966P252N2904Q834j0239K598J6227j1914n217K0078J0591k6257K1612J6402
9230A36837p666J2082K8867L7548J4519m8356K3495O6124N5485L4496R8592P6475
9218E28498L5701M7131R0409J09408J22731J40997J30959K05860J74011J09022
9208A694727J86642J79320J68085K13300K88063L26169M06717N50725O64659P96936
9198E475343R67366J141562J182496J134358O56704j31757q89179j311923j394969
$$ plain form
9189 6830001 5539902 4383163 3439922 2756659 2241809 1824723 1527644 1283429 1101485
9180 1101485 930632 807645 715987 659135 624043 551356 485211 456187 385434 340693 310029
9169 310029 305281 261658 227026 203260 191389 207659 200621 181503 199282 197998 166188 155062
9157 155062 136439 124954 138105 141355 88771 81925 60600 89752 107798 58124 49038 66135
9145 66135 78810 44275 23724 33911 -2608 -19504 12278 34424 20765 13586 22979 27320
9133 27320 14968 16949 20880 12361 40324 58579 43045 24322 23606 7553 1112 28368 19630
9120 19630 23999 37386 12672 -10832 -36950 -31002 711 42657 81962 100921 69234 54347
9108 54347 76095 102442 121628 82909 46923 33744 40671 26523 -25848 -57211 -36154 -1075
$$ packed form
9189F830001j290099j156739r43241o83263n14850m17086k97079k44215j81944
9180A101485j70853j22987r1658n6852l5092p2687o6145k9024p0753m4741l0664
9169C10029m748m3623l4632k3766j1871J6270p038j9118J7779j284l1810j1126
9157A55062j8623j1485J3151L250n2584o846k1325K9152J8046m9674r086J7097
9145F6135J2675l4535k0551J0187l6519j6896L1782K2146j3659p179R393M341
9133B7320j2352J981L931q519K7963J8255j5534j8723p16j6053o441K7256q738
9120A9630M369J3387k4714k3504k6118N948L1713M1946L9305J8959l1687j4887
9108E4347K1748K6347J9186l8719l5986j3179O927j4148n2371l1363K1057L5079
$$ plain form
9096 -1075 26402 39828 37744 38944 12764 -23478 -20070 14095 36536 20067 5892 17084 21296
9083 21296 10313 19135 20941 9235 28632 63685 71249 54330 50656 61566 39751 26986 43279
9070 43279 34656 43385 31737 18390 28916 43230 45762 45972 32902 24238 1423 -20473 16517
9057 16517 -17462 -42283 -40877 -32369 -43010 -34431 -24895 -12347 6076 18294 35206 23300 -17446
9044 -17446 -2338 -13490 -28050 -14652 -4 4539 18206 -4408 -51351 -9341 44563 17305
9032 17305 18095 40550 37778 27169 -6679 -44473 -85369 -127408 -124327 -106485 -75918 -45060 -42850
9019 -42850 -36545 -32004 -40000 -18868 -21931 -29662 -6970 -8104 -12476 8641 16589 -7510 -30637
9006 -30637 -50165 -75114 -87389 -102391 -86387 -47765 -38867 -20227 15083 25181 24125 20407
$$ packed form
9096a075K7477J3426k084J200k6180l6242L408L4165K2441j6469j4175J1192M212
9083B1296j0983Q822J806j1706J9397L5053P564j6919l674J0910k1815j2765J6293
9070D3279q623Q729j1648j3347J0526J4314K532K10j3070q664k2815k1896L6990
9057A6517l3979k4821J406Q508j0641Q579R536J2548J8423J2218J6912j1906m0746
9044a7446J5108j1152j4560J3398J4648M543J3667k2614m6943M2010N3904k7258
9032A7305P90K2455k772j0609l3848l7794m0896m2039L081J7842L0567L0858K210
9019d2850O305M541p996K1132l063p731K2692j134m372K1117P948k4099k3127
9006c0637j9528k4949j2275j5002J6004L8622Q898J8640L5310J0098j056l718
$$ plain form
8994 20407 4033 -22761 -3167 10611 27152 13316 -26429 -27904 -51332 -23782 14226 3305
8982 3305 570 34916 35115 13138 -4976 -1859 12557 -24175 -25906 -21658 -46939 -40959 -44315 -47752
8968 -47752 -35868 14516 -1888 -6091 17011 26681 -390 -19145 -18031 -19014 -40363 -45542 -27883
8955 -27883 -31886 -26578 -9029 605 5032 16498 16481 2239 -9460 10048 38413 28619 2828
8942 2828 -2946 -11109 12328 35947 -1422 -44216 -14055 27775 47 -9728 -8021 -5269 9946
8929 9946 8445 -6554 -37293 -33802 -39425 -48831 -29350 -2549 16364 48955 60170 33937 6077
8916 6077 25510 34175 12804 -19530 -34572 7935 10787 9884 -19208 -4225 8905 16093 29634
8903 29634 15839 14731 27670 42327 19270 -21747 -57791 -34672 -50167 -33497 -2740 -19325
$$ packed form
8994B0407j6374k6794J9594J3778J6541j3836l9745j475k3428K7550L8008j0921
8982C305k735L4346J99k1977j8114L117J4416l6732j731M248k5281N980l356l437
8968d7752J1884N0384j6404m203K3102R670k7071j8755J114r83k1349n179J7659
8955b7883m003N308J7549R634M427J1466j7j4242j1699J9508K8365r794k5791
8942B828n774q163K3437K3619l7369m2794L0161M1830k7728r775J707K752J5215
8929I946j501j4999l0739L491n623r406J9481K6801J8913L2591J1215k6233k7860
8916F077J9433Q665k1371l2334j5042M2507K852r03k9092J4983J3130P188J3541
8903B9634j3795j108J2939J4657k3057m1017l6044K3119j5495J6670L0757j6585
$$ plain form
8891 -19325 -39283 -42490 -16522 -21110 -5467 -7954 -9259 -13433 18792 7598 -11853 -46592 -19033
8878 -19033 -4508 4701 21252 28306 43980 19659 -12199 -38993 -55151 -37499 -32022 -29814 -15169
8865 -15169 -10021 -31788 -35105 -29997 -14063 -12545 -26533 -20727 -6376 -196 24292 -11355 -22899
8852 -22899 -8111 -15503 17575 21214 13296 21644 18374 -386 11512 962 -24327 -34408 -36118
8839 -36118 -26695 -10473 16477 43441 34937 27299 1420 5308 12672 -16950 -38792 -80535 -69069
8826 -69069 -22600 -14074 -47718 -53808 -42307 -25120 -5861 -5404 11075 23340 -4586 -51164 -62523
8813 -62523 -47637 -12266 -15336 -7944 -14039 -20210 -24442 -20886 4118 4036 10327 50816 39842 -1243
8799 -1243 -4855 -34778 -49468 -48132 -33451 -5483 -4250 16619 -3397 -27667 -20285 -9170 6366
$$ packed form
8891a9325j9958l207K5968m588J5643k487j305m174L2225j1194j9451l4739K7559
8878a9033J4525R209J6551P054J5674k4321l1858k6794j6158J7652N477K208J4645
8865a5169N148k1767l317N108J5934J518j3988N806J4351O180K4488l5647j1544
8852b2899J4788p392L3078L639p918Q348l270j8760J1898j0550k5289j0081j710
8839c6118R423J6222K6950K6964q504p638k5879L888P364k9622k1842m1743J1466
8826f9069M6469Q526l3644o090J1501J7187J9259M57J6479J2265k7926m6578j1359
8813f2523J4886L5371l070P392o095o171m232L556K5004q2O291M0489j0974m1085
8799a243l612k9923j4690J336J4681K7968J233K0869k0016k4270P382J1115J5536
$$ plain form
8786 6366 13068 29328 38822 47409 26719 12036 -18812 19821 19644 -9967 -10907 -4866 28365 51759
8772 51759 35893 2296 16282 2845 -2534 -9805 6700 2798 28774 38846 40977 -19946 -5608
8759 -5608 -3679 -1876 5769 13653 58626 54747 65882 62915 51568 24931 23533 8387 7183 8513
8745 8513 3699 21454 6540 -4336 13436 -28270 -52353 -51599 -51045 -22426 2132 -6114 1414
8732 1414 7404 16911 22896 1328 13894 21603 -12721 -20041 -12750 -5890 2823 -20083 -12353 -24297
8718 -24297 -67735 -79012 -47874 14056 12797 -14069 -27969 -26013 -29250 -32590 -38366 -35338 -9890
8705 -9890 -4988 -18009 -30261 -1818 25633 50793 43736 20466 -13335 -3643 6578 31302 35461
8692 35461 34300 21545 10024 -5623 -43394 -38831 3266 28676 66586 38734 6509 2224
$$ packed form
8786F366O702J6260R494Q587k0690j4683l0848L8633j77k9611r40O041L3231K3394
8772E1759j5866l3597J3986j3437n379p271J6505l902K5976J0072K131o0923J4338
8759e608J929J803P645P884M4973l879J1135k967j1347k6637j398j5146j204J330
8745H513m814J7755j4914j0876J7772m1706k4083P54N54K8619K4558q246P528
8732A414N990R507N985k1568J2566P709l4324p320P291O860Q713k2906P730j1944
8718b4297m3438j1277L1138O1930j259k6866j3900J956l237l340n776L028K5448
8705i890M902j3021j2252K8443K7451K5160p057k3270l3801R692J0221K4724M159
8692C5461j161j2755j1521j5647l7771M563M2097K5410L7910k7852l2225m285
$$ plain form
8680 2224 2106 37692 26711 16500 26688 14690 31053 47161 58711 48167 51229 33284 25412
8667 25412 46677 21532 18779 7653 -11681 -22603 -16084 2660 -9328 -478 27233 34739 -15993
8654 -15993 -27770 2869 -1971 -5090 8733 45903 50103 34060 24176 22483 19597 -4887 -17929
8641 -17929 -8450 -9434 -8722 -24865 -10522 -29667 -43030 -27820 4497 42257 61350 61160 55690
8628 55690 51758 26037 4964 6801 16676 26975 37961 37563 33974 50949 37714 -66 4832
8615 4832 13917 -999 -3021 17929 47167 44566 35786 18132 19087 29978 22562 5227 -2191 8674
8601 8674 23598 14424 10932 -9301 10883 12756 4121 19093 33792 32403 47012 37573 15724
8588 15724 7496 2642 -595 9773 4670 21547 38773 47326 36847 37105 42878 50497 35849 35156
$$ packed form
8680B224j18L5586j0981j0211J0188j1998J6363J6108J1550j0544L062j7945p872
8667B5412K1265k5145k753j1126j9334j0922O519J8744j1988Q850K7711P506n0732
8654a5993j1777L0639m840l119J3823L7170M200j6043r884j693k886k4484j3042
8641a7929R479r84P12j6143J4343j9145j3363J5210L2317L7760J9093j90n470
8628E5690l932k5721k1073J837R875J0299J0986l98l589J6975j3235l7780M898
8615D832R085j4916k022K0950K9238k601q780j7654R55J0891p416j7335p418J0865
8601H674J4924r174l492k0233K0184J873q635J4972J4699j389J4609r439k1849
8588A5724q228m854l237J0368n103J6877J7226Q553j0479K58N773P619j4648o93
$$ plain form
8574 35156 38278 8594 -12851 -2022 5276 -10614 -3439 -10216 -14711 -842 2431 -20608 12709
8561 12709 55491 68905 31176 32022 49555 74834 67192 42240 55748 55136 19971 -29504 -23278
8548 -23278 -19755 -25169 -22095 -8921 -19675 -32064 -38698 -35925 5237 12100 14874 17259 38155
8535 38155 53410 61074 69699 59782 61961 72100 80281 75349 46050 39392 47725 39774 -12660 -41095
8521 -41095 -30373 312 -23448 -19492 -10432 -16596 -16023 -7265 2070 10048 9641 -5079 -8892 -41560
8507 -41560 -37105 1793 4098 8936 3279 42072 35329 5510 -20719 -30006 -16893 -9356 -20716
8494 -20716 -17501 -8867 -2068 -9967 -7701 61059 88457 46046 3458 -17026 -9471 -6315 -9364
8481 -9364 11596 50374 43680 65225 58914 39161 39353 41632 48389 45250 26055 17357 -6662 464
$$ packed form
8574C5156L122k9684k1445J0829P298j5890P175o777m495J3869L273k3039L3317
8561A2709M2782J3414l7729Q46J7533K5279p642k4952J3508o12l5165m9475O226
8548b3278L523n414L074J3174j0754j2389o634K773M1162O863K774K385K0896
8535C8155J5255P664Q625r917K179J0139Q181m932k9299o658Q333p951n2434k8435
8521d1095J0722L0685k3760L956R060o164N73Q758R335P978m07j4720l813l2668
8507d1560M455L8898K305M838n657L8793o743k9819k6229r287J3113P537j1360
8494b0716L215Q634O799p899K266O8760K7398m2411m2588k0484P555L156l049
8481i364K0960L8778o694K1545o311j9753J92K279O757l139j9195q698k4019P126
$$ plain form
8467 464 -3631 -982 -5712 -4867 -8077 21621 17204 -1373 -22395 -17481 -787 -10159 -26693 -21108
8453 -21108 11917 27346 -8771 -21597 -22813 -48479 -27320 -3998 11298 31881 20275 4946
8441 4946 19109 -2227 -4337 -15013 -16288 -13410 1563 2255 6181 -18126 625 2948 -4452 -8756
8427 -8756 14401 10456 -11732 3349 994 15343 11186 11988 18379 11682 16583 -10969 -23012 -21653
8413 -21653 -54538 -62121 -53074 -44356 -4017 -13560 -28147 -19877 -35859 -20311 -534 -32951 -40317
8400 -40317 -43266 -52286 -38807 -20880 -58308 -72315 -22699 -6304 883 26148 18060 16772 23589
8387 23589 34016 -954 -23027 -21203 -21366 -2580 18558 -10824 8768 41537 22480 6069
8375 6069 -8553 -37169 -49770 -33339 -38112 -16625 19354 45538 59527 39352 40610 35943 48138
$$ packed form
8467D64m095K649m730Q45l210K9698m417j8577k1022M914J6694r372j6534N585
8453b1108L3025J5429l6117j2826j216k5666K1159K3322J5296K0583j1606j5329
8441D946J4163k1336k110j0676j275K878J4973O92L926k4307J8751K323p400m304
8427h756K3157l945k2188J5081k355J4349m157Q02O391o697M901k7552j2043J359
8413b1653l2885p583R047Q718M0339r543j4587Q270j5982J5548J9777l2417p366
8400d0317k949r020J3479J7927l7428j4007M9616J6395P187K5265q088j288O817
8387B3589J0427l4970k2073J824j63J8786K1138k9382J9592L2769j9057j6411
8375F069j4622k8616j2601J6431m773K1487L5979K6184J3989k0175J258m667J2195
$$ plain form
8362 48138 12799 -23044 -7865 3383 -4511 1715 3512 27480 36892 41666 49765 51153 12634
8349 12634 11304 43731 36144 27236 53142 55008 47051 36553 38208 39831 57003 110910 104350
8336 104350 52344 80122 119616 136445 136340 152355 144213 128045 110534 92217 101784 112152
8324 112152 99220 114242 120957 114067 107759 99265 71356 39443 92296 95749 99326 129331 133451
8311 133451 112113 125588 127035 133730 164905 149237 136147 189297 239080 269064 285781 303845
8299 303845 319761 330377 330868 361585 349199 328605 296660 262380 232295 224445 240703 219570
8287 219570 183968 193606 171080 139190 138554 135056 115565 96358 93578 73632 81438 95535 76585
8274 76585 61736 104455 162815 185667 178591 164982 180722 191318 235230 282141 289439 270376
$$ packed form
8362D8138l5339l5843J5179J1248p894O226J797K3968R412M774Q099J388l8519
8349A2634j330L2427p587q908K5906J866p957j0498J655J623J7172N3907o560
8336A04350n2006K7778L9494J6829j05J6015q142j6168j7511j8317R567J0368
8324A12152j2932J5022O715o890o308q494k7909l1913N2853L453L577L0005M120
8311A33451k1338J3475J447O695L1175j5668j3090N3150M9783K9984J6717J8064
8299C03845J5916J0616M91L0717j2386k0594l1945l4280l0085p850J6258k1133
8287B19570l5602R638k2526l1890o36l498j9491j9207k780j9946P806J4097j8950
8274G6585j4849M2719N8360K2852p076j3609J5740J0596M3912M6911P298j9063
$$ plain form
8262 270376 257131 241729 234367 240108 232980 247039 230609 205071 179718 162628 147682 121889
8250 121889 88094 78923 66456 81972 69758 94997 103806 105096 96366 65096 59436 136682 160459
8237 160459 138703 109283 74201 80292 87385 73726 68971 38307 58994 94851 99200 79318
8225 79318 86696 83154 67100 85991 86141 80010 71278 44123 45782 57658 29801 -9232 -16877
8212 -16877 -17660 -5104 -8251 -3178 -18136 -26642 -13338 24672 58892 63621 48085 27380 17567
8199 17567 21012 867 -12561 -9073 -23263 -47442 -22083 8962 21650 27049 4648 -13410
8187 -13410 23718 45213 43204 22802 21947 17029 39016 66748 63535 10796 10392 4930 -22342
8174 -22342 -19598 -24154 6113 27770 25142 16818 -452 -48761 -63077 -39163 -53382 -6874 3372
$$ packed form
8262B70376j3245j5402p362N741p128J4059j6430k5538k5353j7090j4946k5793
8250A21889l3795r171j2467J5516j2214K5239Q809J290q730l1270n660P7246K3777
8237A60459k1756k9420l5082O091P093j3659m755l0664K0687L5857M349j9882
8225G9318P378l542j6054J8891J50o131q732k7155J659J1876k7857l9033p645
8212a6877p83J2556l147N073j4958q506J3304L8010L4220M729j5536k0705r813
8199A7567L445k0145j3428L488j4190k4179K5359L1045J2688N399k2401j8058
8187a3410L7128K1495k009k0402q55m918K1987K7732l213n2739m04n462k7272
8174b2342K744m556L0267K1657k628q324j7270m8309j4316K3914j4219M6508J0246
$$ plain form
8161 3372 1761 -20401 -35663 -45368 -20473 -38399 -48765 -49347 -32951 -20035 -27798 -11973 -21259
8148 -21259 -46020 -60958 -63411 -33391 -21290 -2543 25812 5976 -6312 -31914 -56112 -29126
8136 -29126 -8876 32945 59596 27560 -3092 10835 -4557 13226 34331 42033 37299 46171
8124 46171 36347 12359 1978 2134 -7164 14394 7779 -5162 -23884 9009 16279 52825 62270
8111 62270 41785 21551 11390 33119 26062 -6258 -542 8575 -27706 -56629 -58669 -60714 -59478
8098 -59478 -29438 8878 19019 54303 35762 20331 -6901 -5005 1776 -12865 -58021 -47326
8086 -47326 -22826 17908 32971 73713 74452 52414 31542 10268 25278 38313 31578 18477
8074 18477 53647 60056 55555 16046 -21891 -15861 1279 -16841 -56311 -67731 -91558 -84488 -85205
$$ packed form
8161C372j611k2162j5262r705K4895j7926j0366n82J6396J2916p763J5825r286
8148b1259k4761j4938k453L0020J2101J8747K8355j9836j2288k5602k4198K6986
8136b9126K0250M1821K6651l2036l0652J3927j5392J7783K1105P702m734Q872
8124D6171r824k3988j0381J56r298K1558o615j2941j8722L2893P270L6546R445
8111F2270k0485k0234j0161K1729p057l2320N716R117l6281k8923k040k045J236
8098e9478L0040L8316J0141L5284j8541j5431k7232J896O781j4641m5156J0695
8086d7326K4500M0734J5063M0742P39k2038k0872k1274J5010J3035o735j3101
8074A8477L5170O409m501l9509l7937O030J7140j8120l9470j1420k3827P070p17
$$ plain form
8061 -85205 -53905 -14976 3469 22071 16440 7087 30962 34087 24296 17547 13523 6964 -34189
8048 -34189 -10231 11511 -10156 -8355 2141 17580 31061 -15485 -21558 8296 39726 32149
8036 32149 8050 14698 25865 16766 -34023 -51680 -27754 -41868 -34688 413 5694 1604 -10896
8023 -10896 9084 24288 22415 13547 -16676 14177 17648 10195 -13595 -54679 -79249 -43693 -17561
8010 -17561 -23357 1245 11433 -1842 16598 20613 7120 12862 -556 15149 36878 31114 -6379
7997 -6379 -4977 29799 13382 -26822 -16507 31354 51353 59337 28591 2025 10783 31778 31250
7984 31250 38355 15827 26247 44832 57942 42540 24882 14967 3175 4084 1671 12335 9250
7971 9250 -10865 -52425 -45684 -24738 -7534 7768 -29474 -65361 -37210 -11343 -11609 9874 52537
$$ packed form
8061h5205L1300L8929J8445J8602n631r353K3875L125r791o749m024o559m1153
8048c4189K3958K1742k1667J801J0496J5439J3481m6546o073K9854L1430p577
8036C2149k4099O648J1167r099n0789j7657K3926j4114P180L5101N281m090j2500
8023a0896J9980J5204j873q868l0223L0853L471p453k3790m1084k4570L5556K6132
8010a7561n796K4602J0188j3275J8440M015j3493N742j3418J5705K1729n764l7493
7997f379J402L4776j6417m0204J0315M7861J9999P984l0746k6566Q758K0995n28
7984C1250P105k2528J0420J8585J3110j5402j7658r915j1792R09k413J0664l085
7971I250k0115m1560O741K0946J7204J5302l7242l5887K8151K5867k66K1483M2663
$$ plain form
7958 52537 53901 23559 28261 45656 23872 16505 -15829 -19335 -8287 8821 27166 58685 71980
7945 71980 38031 52601 53532 16918 27350 30319 29405 31681 73297 65957 64996 64289 49261 52267
7931 52267 79153 77849 63481 78264 88928 69084 61516 52354 26822 53562 63470 36546 17222
7918 17222 22823 13760 -11980 34580 47984 24763 18048 115 5327 13167 40162 19865 -8934
7905 -8934 9629 -14136 -6176 9462 7892 14048 32019 37301 8296 -3881 -10249 -2201 -30716
7892 -30716 -40696 -43622 -28869 -10186 5399 35692 25544 17942 -1665 -8782 -14803 -18819 33105
7879 33105 22501 -15177 -19858 -20635 -33570 -56161 -59967 -23973 -4993 -40289 -52042 -31951 2505
7866 2505 -8784 4755 34038 27164 21136 15244 -5755 -1375 3233 7737 29971 31204 4921
$$ packed form
7958E2537J364l0342M702J7395k1784p367l2334l506J1048J7108J8345L1519J3295
7945G1980l3949J4570R31l6614J0432K969r14K276M1616p340r61p07j5028L006
7931E2267K6886j304j4368J4783J0664j9844p568r162k5532K6740R908k6924j9324
7918A7222N601r063k5740M6560J3404k3221o715j7933N212P840K6995k0297k8799
7905h934J8563k3765P960J5638j570O156J7971N282k9005j2177o368Q048k8515
7892c0716r980k926J4753J8683J5585L0293j0148p602j9607p117o021m016N1924
7879C3105j0604l7678m681p77j2935k2591l806L5994J8980l5296j1753K0091L4456
7866B505j1289J3539K9283o874o028n892k0999M380M608M504K2234J233k6283
$$ plain form
7853 4921 2626 -22473 -51899 -52151 -37937 -41378 -50231 -57327 -39991 -18734 -433 -19921 -29687
7840 -29687 -3243 7600 -13184 -37073 -71298 -52223 -13838 11480 -463 -5587 25414 28987
7828 28987 12089 -3545 883 25847 75590 104829 51194 32451 36798 41006 44526 53800 -1623
7815 -1623 -25540 -29947 -5349 27557 6615 1303 10342 32921 14871 1544 3534 -7618 -7423
7802 -7423 -5057 34303 63025 71273 52657 36179 20478 15468 12598 -17759 8586 1355 -4418
7789 -4418 12108 -3270 -9859 -24242 3030 11386 37938 38511 3717 -1356 14805 19899 6092
7776 6092 -25419 -22406 -21833 -32188 -11591 -10146 -20116 -12354 2566 6775 -22635 -54436 -55091 -19972
7762 -19972 -13412 -47914 16417 51283 31839 -7488 -15279 -31458 -43143 -45707 -35023 -9912
$$ packed form
7853D921k295k5099k9426k52J4214l441q853p096J7336K1257J8301j9488r766
7840b9687K6444J0843k0784k3889l4225J9075L8385K5318j1943n124L1001L573
7828B8987j6898j5634M428K4964M9743K9239n3635j8743M347M208L520R274n5423
7815a623k3917m407K4598L2906k0942n312R039K2579j8050j3327J990j1152J95
7802g423K366L9360K8722Q248j8616j6478j5701n010k870l0357K6345p231n773
7789d418J6526j5378o589j4383K7272Q356K6552N73l4794n073J6161N094j3807
7776F092l1511L013N73j0355K0597J445r970P762J4920M209k9410l1801o55L5119
7762a9972O560l4502O4331L4866j9444l9327p791j6179j1685k564J0684K5111
$$ plain form
7750 -9912 15155 48910 42697 40760 41132 29690 31171 28138 8538 -15711 -39221 -64014 -58801
7737 -58801 -15047 -2489 38648 62472 53755 21459 1938 -18449 -26278 -49341 -60951 -48236
7725 -48236 -41501 -48722 -27164 -16692 -36752 -46535 -56172 -48255 -10569 20529 19541 10893 6160 23315
7711 23315 28643 -10146 1883 8705 -45734 -77051 -40321 12639 25486 8924 -16177 -23827
7699 -23827 -16239 -47789 -44368 -47679 -4745 14961 -18110 -32394 -28185 -61757 -39028 -4090 -9776
7686 -9776 13445 4183 -22996 -25117 -17824 538 26262 36707 20257 -8575 -31958 -8411 -23481
7673 -23481 -18831 -13910 -26335 6497 31681 59124 57404 45761 25288 5776 -27166 9739
7661 9739 46769 34954 31073 -10477 -31047 -6976 -25957 -85844 -93008 -83752 -81663 -85688 -71844
$$ packed form
7750i912K5067L3755o213j937L72j1442J481l033j9600k4249k3510k4793N213
7737e8801M3754J2558M1137K3824q717l2296j9521k0387p829k3063j1610J2715
7725d8236O735p221K1558J0472k0060r783r637P917L7686L1098r88q648m733J7155
7711B3315N328l8789J2029O822n4439l1317L6730N2960J2847j6562k5101p650
7699b3827P588l1550L421l311M2934J9706l3071j4284M209l3572K2729L4938n686
7686i776K3221r262k7179k121P293J8362K5724J0445j6450k8832k3383K3547j5070
7673b3481M650M921j2425L2832K5184K7443j720j1643k0473j9512l2942L6905
7661I739L7030j1815l881m1550k0570K4071j8981n9887p164R256K089m025J3844
$$ plain form
7648 -71844 -57444 -41965 -40399 -32180 -33604 -31086 -22928 -16194 -50304 -23153 -22638 -44425 -34076
7635 -34076 -39656 -35461 -24550 -10376 -10096 -3348 2591 -4989 -25063 -34991 -34263 -22018 4125 -4560
7621 -4560 6802 18860 23527 24632 7917 16737 28512 2396 -12944 -40790 -52362 -51291 5823
7608 5823 10860 -28327 -7635 -23273 -59370 -67337 -66754 -40945 -26337 -18536 -7477 13271 21837
7595 21837 16279 -35972 -43531 14935 36462 42065 38958 37970 38340 25362 5272 26432 69386
7582 69386 77030 34808 -6334 -20066 -8024 -19351 11528 35512 6447 -5869 7698 13324
7570 13324 -8185 -34997 -15963 -1157 -1833 -23602 -22000 -14481 -14010 -31362 -24970 -9759 2769
7557 2769 -8123 -16749 -38318 -39433 -21932 -52137 -51619 -20261 -14823 -23190 -14942 -17969 -14760 -8218
$$ packed form
7648g1844J4400J5479J566Q219j424K518Q158O734l4110K7151N15k1787J0349
7635c4076n580M195J0911J4174K80O748N939p580k0074r928P28J2245K6143q685
7621d560J1362J2058M667J105j6715Q820J1775k6116j5340k7846j1572J071N7114
7608E823N037l9187K0692j5638l6097p967N83K5809J4608P801J1059K0748Q566
7595B1837n558n2251p559N8466K1527N603l107r88L70j2978k0090K1160M2954
7582F9386P644m2222m1142j3732J2042j1327L0879K3984k9065j2316J3567N626
7570A3324k1509k6812J9034J4806o76k1769J602P519M71j7352O392J5211J2528
7557B769j0892q626k1569j115J7501l0205N18L1358N438q367Q248l027L209O542
$$ plain form
7543 -8218 -36582 -48111 -49863 -52474 -20821 -15535 -5289 -4522 29927 28156 29184 2618 7937 2095
7529 2095 48383 70761 54181 48472 19627 18420 5672 -8792 -17735 -36800 -42091 -42391 -19938
7516 -19938 -42179 -59711 -45671 -73991 -69945 -47568 -39237 -24952 -41729 -43574 -60360 -40860
7504 -40860 -6922 7230 39944 68308 63158 18507 -47542 -49355 -5210 -705 -7925 -30989 -44771
7491 -44771 -46338 1492 25146 6886 -15689 -44215 7955 43462 1040 -36630 -40703 -23849
7479 -23849 -35020 -57179 -73503 -48259 -30927 -24082 -43408 -26080 7791 8638 -6607 -36238
7467 -36238 -52063 -52491 -23410 -398 13821 27947 19051 7082 -6226 -38613 -40486 -13232 -39987
7454 -39987 -39029 17211 -224 1209 18846 4611 -21949 4089 2630 25093 51860 22772 34066
$$ packed form
7543h218k8364j1529j752k611L1653N286J0246P67L4449j771J028k6566N319n842
7529B095M6288K2378j6580n709k8845j207j2748j4464q943j9065n291l00K2453
7516a9938k2241j7532J4040k8320M046K2377Q331J4285j6777j845j6786J9500
7504d0860L3938J4152L2714K8364n150m4651o6049j813M4145M505p220k3064j3782
7491d4771j567M7830K3654j8260k2575k8526N2170L5507m2422l7670m073J6854
7479b3849j1171k2159j6324K5244J7332O845j9326J7328L3871Q47j5245k9631
7467c6238j5825m28K9081K3012J4219J4126q896j1969j3308l2387j873K7254k6755
7454c9987R58N6240j7435J433J7637j4235k6560K6038j459K2463K6767k9088J1294
$$ plain form
7441 34066 31538 -5522 -25155 -22091 -29410 -27196 -12462 -19297 -45060 -27069 17436 -12835 -1016
7428 -1016 13218 4159 39831 65279 62226 53259 44174 176 15281 21913 364 -9229 -5265
7415 -5265 5631 12685 3057 -29588 -39653 -45476 -17013 17141 33330 40357 37379 44252 36216
7402 36216 36129 40803 47949 17980 9531 -6912 -11653 14126 16158 -16878 -52217 -63658 -66668 -54912
7388 -54912 -31572 -9763 594 -20366 -28100 -20690 -29016 -3160 21369 -2935 12416 48636
7376 48636 15616 -102 18919 6229 -7809 -12635 -16248 -6490 -24774 -28715 315 -4899 -38679
7363 -38679 -68142 -50441 -5888 22978 37200 56610 31464 -2170 5104 1461 -899 -8435 -12177
7350 -12177 -22833 -43652 -56243 -54500 -37446 -25615 -26662 5133 12397 -1922 -18546 -31083
$$ packed form
7441C4066k528l7060j9633L064p319K214J4734o835k5763J7991M4505l0271J1819
7428a016J4234r059L5672K5448l053q967r085m3998J5105O632k1549r593L964
7415e265J0896P054r628l2645j0065n823K8463L4154J6189P027k978O873q036
7402C6216q7M674P146k9969q449j6443m741K5779K032l3036l5339j1441l010J1756
7388e4912K3340K1809J0357k0960p734P410q326K5856K4529k4304J5351L6220
7376D8636l3020j5718J9021j2690j4038m826l613R758j8284l941K9030n214l3780
7363c8679k9463J7701M4553K8866J4222J9410k5146l3634P274l643k360p536l742
7350a2177j0656k0819j2591J743J7054J1831j047L1795P264j4319j6624j2537
$$ plain form
7338 -31083 -21797 -35173 -33259 -51012 -39151 7265 7370 -22030 -23187 -3194 14362 25594 36124
7325 36124 36906 26846 14474 12147 -9695 -24625 -29718 -21450 -10149 5287 23117 -2075 -29173
7312 -29173 -31959 392 2074 -5884 27841 46263 6821 -10515 -26414 -28424 -20562 -38480 -32112
7299 -32112 -8693 -4656 9537 10786 21879 2294 -42658 -67348 -45862 -38985 -10099 -8975 -21052
7286 -21052 132 -12246 -18542 -21904 13461 38825 38726 6513 3537 10367 15765 -12270 2930
7273 2930 -12718 -28709 5396 27638 33153 24640 29259 30068 -4782 -56519 -65032 -61222 -56514 -21506
7259 -21506 -13521 -50321 -50838 -36942 -2808 29112 36570 52519 42891 50445 27302 27420 32925 49688
7245 49688 30752 -1721 -34787 -31551 -8166 10815 13715 -6417 -6160 -16377 -17612 -26219 -44747
$$ packed form
7338c1083R286j3376J914j7753J1861M6416J05k9400j157J9993J7556J1232J0530
7325C6124P82j0060j2372k327k1842j4930n093Q268J1301J5436J7830k5192k7098
7312b9173k786L2351J682p958L3725J8422l9442j7336j5899k010P862j7918O368
7299c2112K3419M037J4193J249J1093j9585m4952k4690K1486O877K8886J124j2077
7286b1052K1184j2378o296l362L5365K5364r9l2213k976O830N398k8035J5200
7273B930j5648j5991L4105K2242N515q513M619Q09l4850n1737q513L810M708L5008
7259b1506P985l6800n17J3896L4134L1920P458J5949r628P554k3143J18N505J6763
7245D9688j8936l2473l3066L236K3385J8981K900k0132K57j0217j235q607j8528
$$ plain form
7232 -44747 -55539 -64535 -85744 -44399 -18521 4975 -11392 -13701 -44229 -46052 -35209 -7649
7220 -7649 -12192 -17203 10330 1018 -12627 -32777 -44894 -17388 3285 3850 10185 -2138 -19464
7207 -19464 -6747 -24482 -24448 -13871 -35140 -11417 10536 -18413 -44747 -11806 13501 11151 18462
7194 18462 7349 18425 21908 10515 968 1808 -31811 -73289 -69296 -34014 6415 13088 21116
7181 21116 66186 38464 -33284 -49256 -19741 -15267 -27590 -42873 -21162 6946 854 23486
7169 23486 10455 -7599 -4284 11247 32693 45782 52954 25064 -525 5731 24036 3912
7157 3912 6972 16585 26897 14948 19995 27328 -5802 7543 35439 42401 20416 -21401 -1831
7144 -1831 22185 21859 20806 17259 -8534 -30657 -47787 -62576 -70780 -45581 -845 22189 35123
$$ packed form
7232d4747j0792q996k1209M1345K5878K3496j6367k309l0528j823J0843K7560
7220g649m543n011K7533r312j3645k0150j2117K7506K0673N65O335j2323j7326
7207a9464J2717j7735L4J0577k1269K3723K1953k8949k6334L2941K5307k350P311
7194A8462j1113J1076L483j1393r547Q40l3619m1478L993L5282M0429O673Q028
7181B1116M5070k7722p1748j5972K9515M474j2323j5283K1711K8108o092K2632
7169B3486j3031j8054L315J5531K1446J3089P172k7890k5589O256J8305k0124
7157C912L060R613J0312j1949N047P333l3130J3345K7896O962k1985m1817J9570
7144a831K4016l26j053l547k5793k2123j7130j4789q204K5199M4736K3034J2934
$$ plain form
7131 35123 31684 13080 23498 19967 -895 -14679 -19799 -31211 -13795 -3686 18264 32436
7119 32436 51486 55586 52521 47329 6119 -12875 -10262 -29714 -32250 2507 44940 38814 2466
7106 2466 6758 -21038 -53029 -24897 -15690 5052 -15543 1090 2239 -31739 -10103 -12793 -52048
7093 -52048 -78697 -98381 -75372 -50848 -45573 -43303 -31179 -14223 9204 32926 51012 19859
7081 19859 19651 14263 8849 23978 43492 71271 75359 57161 38702 21778 2833 -1734 5909
7068 5909 -12374 -56204 -59131 -61726 -90926 -38845 1424 12743 -2658 -9167 2840 -29899 -44041
7055 -44041 -48834 -56080 -78089 -46439 16866 8659 -19233 -6815 22910 47412 65068 50862
7043 50862 36378 44270 71450 59419 69847 82114 59793 30058 10816 13665 39475 54210
$$ packed form
7131C5123l439j8604J0418l531k0862j3784n120j1412J7416J0109K1950J4172
7119C2436J9050M100l065n192m1210j8994K613j9452k536L4757M2433o126l6348
7106B466M292k7796l1991K8132R207K0742k0595J6633J149l3978K1636k690l9255
7093e2048k6649j9684K3009K4524N275K270J2124J6956K3427K3722J8086l1153
7081A9859k08n388n414J5129J9514K7779M088j8198j8459j6924j8945m567P643
7068E909j8283m3830k927k595k9200N2081M0269J1319j5401o509J2007l2739j4142
7055d4041m793p246k2009L1650O3305q207k7892J2418K9725K4502J7656j4206
7043E0862j4484P892K7180j2031J0428J2267k2321k9735j9242K849K5810J4735
$$ plain form
7031 54210 43806 56752 68145 53421 75504 82546 74303 96538 95889 82016 55084 54011 27970
7018 27970 -7253 -219 -1790 23978 18402 27825 28096 43779 28366 -6223 18856 36680 41065
7005 41065 38954 42002 35332 63175 64655 41826 34705 46778 64864 41058 13712 4197 -12119
6992 -12119 -46883 -99700 -128401 -82762 -34206 -26078 -31005 -39096 -56073 -34090 -52383 -68713
6980 -68713 -47570 -35603 -34932 -47910 -53364 -68339 -46375 -19966 -3796 1233 -50040 -22039 -4370
6967 -4370 -55395 -67997 -74427 -82471 -73457 -53212 -21218 -1834 29227 33153 44280 55356 63764
6954 63764 59734 56541 67111 49441 36089 -281 -18861 -37046 -34336 16424 55896 80464
6942 80464 43992 -7605 -37902 -31365 -38543 -65587 -49762 -12452 -9295 -17842 -7717 -8451 -4777
$$ packed form
7031E4210j0404J2946J1393j4724K2083P042q243K2235o49j3873k6932j073k6041
7018B7970l5223P034j571K5768n576R423K71J5683j5413l4589K5079J7824M385
7005D1065k111L048o670K7843J480k2829p121J2073J8086k3806k7346r515j6316
6992a2119l4764n2817k8701M5639M8556Q128m927q091j6977K1983j8293j6330
6980f8713K1143J1967O71j2978n454j4975K1964K6409J6170N029n1273K8001J7669
6967d370n1025j2602o430q044R014K0245L1994J9384L1061L926J1127J1076Q408
6954F3764m030l193J0570j7670j3352l6370j8580j8185K710N0760L9472K4568
6942H0464l6472n1597l0297O537p178k7044J5825L7310L157q547J0125p34L674
$$ plain form
6929 -4777 -14444 -35632 -9629 -6331 -15931 9915 7037 1643 -15007 -2540 3978 -13306 -28727
6916 -28727 -36536 -45195 -29787 9516 24206 6919 17950 47275 21494 6308 -8877 15466
6904 15466 34300 14166 7142 21030 7661 -11862 -16425 -1673 22805 37287 79192 55296
6892 55296 36865 39402 23681 3995 2460 -13543 -41706 -34701 -20681 -32777 -29565 2271 -1759
6879 -1759 -19075 25031 35744 16211 4214 17766 21069 -2321 7921 -14011 -30295 -19301
6867 -19301 -8915 7005 17898 20430 22884 40435 42595 59282 41397 10862 -25615 -42
6855 -42 37943 61757 58247 52133 77327 46352 -582 -21006 -14067 5944 28699 32772 36300
6842 36300 14816 -573 -6840 -62647 -64348 -38332 -7567 -6991 3203 22095 17051 13610 12169
$$ packed form
6929d777r667k1188K6003L298r600K5846k878n394j6650J2467O518j7284j5421
6916b8727p809q659J5408L9303J4690j7287J1031K9325k5781j5186j5185K4343
6904A5466J8834k0134p024J3888j3369j9523m563J4752K4478J4482M1905k3896
6892E5296j8431K537j5721j9686j535j6003k8163P005J4020j2096L212L1836m030
6879a759j7316M4106J0713j9533j1997J3552L303k3390J0242k1932j6284J0994
6867a9301J0386J5920J0893K532K454J7551K160J6687j7885l0535l6477K5573
6855d2L7985K3814l510o114K5194l0975m6934k0424O939K0011K2755M073L528
6842C6300k1484j5389o267n5807j701K6016L0765N76J0194J8892n044l441j441
$$ [...]
##END NTUPLES=NMR SPECTRUM
##END=
