##TITLE=Analysis number 327345
Compound Code cc 23826
Book Reference 486/130
Project Code adrs
Chemist Name simons
##JCAMPDX= 6.0         $$ Bruker NMR JCAMP-DX V2.0
##DATA TYPE= NMR SPECTRUM
##DATA CLASS= NTUPLES
##ORIGIN= Bruker BioSpin GmbH
##OWNER= nmr
$$ XWIN-NMR		Version 3.5
$$ Thu Mar 22 11:13:20 2007 GMT Standard Time (UT+0h)  MAYBRIDGE\nmr@NMR_250MHZ
##.OBSERVE FREQUENCY= 250.131544655141
##.OBSERVE NUCLEUS= ^1H
##.ACQUISITION MODE= SIMULTANEOUS (DQD)
##.ACQUISITION SCHEME= undefined
##.AVERAGES= 16
##.DIGITISER RES= 18
##SPECTROMETER/DATA SYSTEM= dpx250
##.PULSE SEQUENCE= zg30
##.SOLVENT NAME= CDCl3
##.SHIFT REFERENCE= (INTERNAL, CDCl3, 0, 16.522)
##AUDIT TRAIL= $$ (NUMBER, WHEN, WHO, WHERE, WHAT)
$$ ##TITLE= Audit trail, XWIN-NMR		Version 3.5
$$ ##JCAMPDX= 5.01
$$ ##ORIGIN= Bruker BioSpin GmbH
$$ ##OWNER= nmr
$$ C:\u/data/dgb/nmr/ADRS/1590/pdata/1/auditp.txt
$$ ##AUDIT TRAIL=  $$ (NUMBER, WHEN, WHO, WHERE, WHAT)
(   1,<2007-03-22 11:12:53.21 +000>,<MAYBRIDGE\nmr>,<NMR_250MHZ>,
      <created by zg, POWCHK disabled, PULCHK disabled
       configuration hash MD5:
       49 4B E0 1D 92 C2 6B 37 9F E6 65 BC 52 41 86 1D
       data hash MD5: 64K
       B4 80 6A E8 B4 85 E4 74 BD CB 9B 5E 8D 7B 99 1F>)
(   2,<2007-03-22 11:13:08.49 +000>,<MAYBRIDGE\nmr>,<NMR_250MHZ>,
      <Start of raw data processing
       ef LB = 0.3 FT_mod = 6 PKNL = 1 SI = 32K 
       data hash MD5: 32K
       E1 BF 60 07 7F 41 A3 30 55 E0 36 E6 31 04 B7 B1>)
(   3,<2007-03-22 11:13:10.14 +000>,<MAYBRIDGE\nmr>,<NMR_250MHZ>,
      <apk 
       data hash MD5: 32K
       F1 01 95 76 39 8E 89 38 99 24 7E 23 7D 91 89 3D>)
(   4,<2007-03-22 11:13:10.83 +000>,<MAYBRIDGE\nmr>,<NMR_250MHZ>,
      <abs ABSG = 5 
       data hash MD5: 32K
       00 22 8E 24 22 22 BE A5 BC 24 DC 29 77 F2 88 E6>)
$$ ##END=
$$ 
$$ hash MD5
$$ B7 5D 6D 20 C0 2B A0 CD 49 2E C7 A3 46 0E 23 DB
##$RELAX= 
##$RELAX= 
##$RELAX= 
##$RELAX= 
##$RELAX= 
##$RELAX= 
##$RELAX= 
$$ Bruker specific parameters
$$ --------------------------
##$DU= <C:\u>
##$EXPNO= 1590
##$NAME= <ADRS>
##$PROCNO= 1
##$TYPE= <nmr>
##$USER= <dgb>
##$AMP= (0..31)
100 100 100 100 100 100 100 100 100 100 100 100 100 100 100 100 100 100 
100 100 100 100 100 100 100 100 100 100 100 100 100 100 
##$AQSEQ= 0
##$AQ_mod= 3
##$AUNM= <au_zg>
##$AUTOPOS= <15 >
##$BF1= 250.13
##$BF2= 250.13
##$BF3= 250.13
##$BF4= 250.13
##$BF5= 500.13
##$BF6= 500.13
##$BF7= 500.13
##$BF8= 500.13
##$BYTORDA= 1
##$CFDGTYP= 0
##$CFRGTYP= 5
##$CHEMSTR= <none>
##$CNST= (0..31)
1 1 145 1 1 1 1 1 1 1 1 1 1 1 1 1 1 1 1 1 1 1 1 1 1 1 1 1 1 1 1 1 
##$CPDPRG= <>
##$CPDPRG1= <>
##$CPDPRG2= <>
##$CPDPRG3= <>
##$CPDPRG4= <mlev>
##$CPDPRG5= <mlev>
##$CPDPRG6= <mlev>
##$CPDPRG7= <mlev>
##$CPDPRG8= <mlev>
##$CPDPRGB= <>
##$CPDPRGT= <>
##$D= (0..31)
0 1 0 0 0 0 0 0 0 0.06 0 0 0 0 0 0 0.0002 0 0 0 0 0 0 0 0 0 0 0 0 0 0 
0 
##$DATE= 1174561971
##$DBL= (0..7)
120 120 120 120 120 120 120 120 
##$DBP= (0..7)
150 150 150 150 150 150 150 150 
##$DBP07= 0
##$DBPNAM0= <>
##$DBPNAM1= <>
$$ [...]
##$SUBNAM7= <"">
##$SUBNAM8= <"">
##$SUBNAM9= <"">
##$SW= 20.6930455092707
##$SWIBOX= (0..15)
0 0 3 0 0 0 0 0 0 0 0 0 0 0 0 0 
##$SW_h= 5175.983436853
##$TD= 65536
##$TD0= 1
##$TE= 683.16
##$TE2= 300
##$TE3= 300
##$TEG= 300
##$TL= (0..7)
0 120 120 120 120 120 120 120 
##$TP= (0..7)
150 150 150 150 150 150 150 150 
##$TP07= 0
##$TPNAME0= <>
##$TPNAME1= <>
##$TPNAME2= <>
##$TPNAME3= <>
##$TPNAME4= <>
##$TPNAME5= <>
##$TPNAME6= <>
##$TPNAME7= <>
##$TPOAL= (0..7)
0.5 0.5 0.5 0.5 0.5 0.5 0.5 0.5 
##$TPOFFS= (0..7)
0 0 0 0 0 0 0 0 
##$TUNHIN= 0
##$TUNHOUT= 0
##$TUNXOUT= 0
##$USERA1= <user>
##$USERA2= <user>
##$USERA3= <user>
##$USERA4= <user>
##$USERA5= <user>
##$V9= 5
##$VALIST= <valist>
##$VCLIST= <CCCCCCCCCCCCCCC>
##$VD= 0
##$VDLIST= <DDDDDDDDDDDDDDD>
##$VPLIST= <PPPPPPPPPPPPPPP>
##$VTLIST= <TTTTTTTTTTTTTTT>
##$WBST= 1024
##$WBSW= 4
##$XGAIN= (0..3)
0 0 0 0 
##$XL= 0
##$YL= 0
##$YMAX_a= 204680
##$YMIN_a= -305563
##$ZGOPTNS= <>
##$ZL1= 120
##$ZL2= 120
##$ZL3= 120
##$ZL4= 120
##$ABSF1= 16.522
##$ABSF2= -4.171173
##$ABSG= 5
##$ABSL= 3
##$ALPHA= 0
##$AQORDER= 0
##$ASSFAC= 0
##$ASSFACI= 0
##$ASSFACX= 0
##$ASSWID= 0
##$AUNMP= <proc_1d>
##$AZFE= 0.1
##$AZFW= 0.1
##$BCFW= 0
##$BC_mod= 0
##$BYTORDP= 0
##$COROFFS= 0
##$CY= 12.5
##$DATMOD= 1
##$DC= 0
##$DFILT= <>
##$DTYPP= 0
##$F1P= 14.0000005364418
##$F2P= -0.99999901652339
##$FCOR= 0.5
##$FTSIZE= 32768
##$FT_mod= 6
##$GAMMA= 0
##$GB= 0
##$INTBC= 1
##$INTSCL= 1
##$ISEN= 128
##$LB= 0.3
##$LEV0= 0
##$LPBIN= 0
##$MAXI= 10000
##$MC2= 0
##$MEAN= 0
##$ME_mod= 0
##$MI= 0
##$NCOEF= 0
##$NC_proc= -3
##$NLEV= 6
##$NOISF1= 0
##$NOISF2= 0
##$NSP= 0
##$NTH_PI= 0
##$NZP= 0
##$OFFSET= 16.522
##$PC= 1
##$PHC0= 236.4083
##$PHC1= 7.61751
##$PH_mod= 1
##$PKNL= yes
##$PPARMOD= 0
##$PSCAL= 4
##$PSIGN= 0
##$REVERSE= no
##$SF= 250.13
##$SI= 32768
##$SIGF1= 0
##$SIGF2= 0
##$SINO= 400
##$SIOLD= 32768
##$SREGLST= <1H.CDCl3>
##$SSB= 0
##$STSI= 32768
##$STSR= 0
##$SW_p= 5175.98343685301
##$SYMM= 0
##$S_DEV= 0
##$TDeff= 65536
##$TDoff= 0
##$TI= <Analysis number 999999
Compound Code 99
Book Reference 9
Project Code 9>
##$TILT= no
##$TM1= 0
##$TM2= 0
##$TOPLEV= 0
##$USERP1= <user>
##$USERP2= <user>
##$USERP3= <user>
##$USERP4= <user>
##$USERP5= <user>
##$WDW= 1
##$XDIM= 32768
##$YMAX_p= 280580948
##$YMIN_p= -180122
$$ End of Bruker specific parameters
$$ ---------------------------------
##NTUPLES= NMR SPECTRUM
##VAR_NAME=  FREQUENCY,     SPECTRUM/REAL,   SPECTRUM/IMAG
##SYMBOL=    X,             R,               I
##VAR_TYPE=  INDEPENDENT,   DEPENDENT,       DEPENDENT
##VAR_FORM=  AFFN,          ASDF,            ASDF
##VAR_DIM=   32768,         32768,           32768
##UNITS=     HZ,            ARBITRARY UNITS, ARBITRARY UNITS
##FACTOR=    0.157963299565203, 1,           1
##FIRST=     4132.6476996994, 0,             0
##LAST=      -1043.33573715361, 0,           0
##MIN=       -1043.33573715361, -180122,     0
##MAX=       4132.6476996994, 280580948,     0
$$ Real data points
##PAGE= N=1
##DATA TABLE= (X++(R..R)), XYDATA
$$ [...]
23140 27953 958 -26381 7215 3444 2331 -326 20865 42769 67055 75543 6998 -15946
23128 -15946 -1578 47375 64158 72954 68889 53214 63767 15127 -20577 -69739 -86906 -38788
23116 -38788 -15351 16587 -6035 -7336 47425 34767 26409 21042 5694 -6789 -53576 -45868
23104 -45868 -31879 -14702 -25395 -40590 -42154 -26332 -15029 -840 -41648 -37243 -59485 -45347
23092 -45347 -6845 3403 -35383 -3046 57260 10016 -14339 -25892 -71749 -71943 -50978 -61630
23080 -61630 -27755 32920 42302 50946 58954 61054 47907 -21186 -45189 -43014 -15594 3194 -20020
23067 -20020 -41843 -25576 -20344 -20334 -26297 -39077 -12475 -45388 -77784 -23572 -59125 -88422 -49659
23054 -49659 -53358 -2019 -316 -59443 -57629 -28597 -16357 -47186 -50256 -53374 -21355 -42407 -58395
23041 -58395 -37502 -12251 -56072 -47600 -43327 -37247 -728 -15171 -36385 -20940 -2826 4132
23029 4132 -8716 -21374 -41586 -22563 -33967 -37512 -39371 -37914 -896 693 3970 -6566 -1863
23016 -1863 23132 -6336 -25920 -38606 -25391 3865 36285 18162 -15716 -44961 -92283 -75261
23004 -75261 -34797 -13665 -17694 -20171 -50579 -38371 -66201 -37369 -12829 -1279 2302 -39601
22992 -39601 -3353 46002 40099 -7958 -41377 -3485 -8315 -35090 -61953 -42088 -23622 -1939
22980 -1939 2306 -5970 3424 -8931 19240 43843 17353 -23876 -27131 -32439 -12563 -33987 -38497
22967 -38497 -51739 -48233 -56589 -15902 -40847 -31281 -53347 -37350 -12385 -27735 -59093 -35310
22955 -35310 -58202 -33782 -21169 -56163 -64671 -72050 -22473 -26663 -34099 -57639 -24795 11167
22943 11167 33748 25593 21708 29844 51362 87252 91152 26624 10898 -7146 -49431 -36255
22931 -36255 -56826 -68683 -52764 -33501 -40737 -22068 -41445 -34080 -43346 -37715 -32935 -50461 -56650
22918 -56650 -43784 -51966 -24416 -244 -15180 -1096 36255 25728 35777 38243 60921 38353
22906 38353 -9283 -8404 -19800 -11931 17479 -17409 4998 -40485 -96097 -89735 -43689 -9321
22894 -9321 -8948 6450 1019 9585 40183 67588 17342 -44069 -86818 -110884 -106375 -74986 -39492
22881 -39492 -35377 -29025 10656 -2051 -63962 -63135 -37836 -32463 -35495 -51613 -12111 36986 17828
22868 17828 6807 7390 8474 2318 24901 28529 15712 -78 23045 35784 7039 -3262 -1133
22855 -1133 6922 22886 24648 -5588 13564 8859 8622 19580 28506 55778 52528 4634 -13904
22842 -13904 -31930 -30996 -75861 -50574 -24121 5769 21387 1139 41061 70954 15486 -2715
22830 -2715 14192 -21407 -62345 -56468 -60873 -77655 -79687 -46117 -56630 -55157 -41518 -53261 -66975
22817 -66975 -22636 22062 20734 46655 58326 25072 3425 -11745 -14126 -4793 2564 -16506
22805 -16506 -5792 -22315 -60846 -59960 -90216 -60375 -37524 -54588 -78162 -84967 -94387 -83250
22793 -83250 -13136 11804 -2932 -31179 -61761 -56155 -39200 14754 -26547 -38168 3295 6841
22781 6841 -6859 -10504 25528 -5884 -44776 -36386 -12924 2740 -22036 -15529 -9073 -7626 -24134
22768 -24134 -23680 -930 30944 54766 60295 59284 41424 37195 29053 10628 24150 58304 49335
22755 49335 26427 38573 54995 51155 19749 7716 35762 18577 -40177 -13670 14276 -23356
22743 -23356 -37278 -29961 -561 -24395 -61613 -41116 -50471 -75378 -88980 -65533 -52242 8226
22731 8226 26405 22580 25434 20499 11591 -5058 -25718 -51606 -75686 -36881 -26771 -27865 -47229
22718 -47229 -44390 -35419 -49964 -68783 -74645 -32988 -15244 -22576 -49505 -74592 -77873 -73277 -91089
22705 -91089 -77347 -33347 -86432 -126405 -123980 -106079 -37765 -30047 -28958 -18656 -9686 -21147
22693 -21147 -23268 -55840 -7414 23152 46379 31760 -1235 -21580 -65044 -63285 -7087 25018
22681 25018 51430 23127 19209 8966 15995 35403 45847 -908 -12841 -13037 -36844 -35785 -32005
22668 -32005 -67545 -44144 -10729 23763 29110 -20396 -47337 -72883 -53968 -14437 11386 2851
22656 2851 54429 50591 -5919 -56217 -67272 -71064 -36153 -20943 -14649 17531 15980 -1144 8826
22643 8826 -23658 -6049 6832 18262 -15737 -4673 -25243 -21514 1973 -15783 -12387 -17667
22631 -17667 -39974 -71418 -48610 -38649 -25457 -49962 -61310 -40546 -27391 -47581 -59281 5075
22619 5075 63129 35704 39510 58870 54224 47323 55033 12342 36777 21077 -64575 -110319 -87455
22606 -87455 -33838 -10683 -22532 -29764 -56969 -74686 -43987 -541 -18813 -45230 -68288 -43681
22594 -43681 -56553 -105592 -127678 -102561 -54452 -62054 -55585 -28881 -35534 -53410 -47033 -31638
22582 -31638 -73898 -88881 -74870 -55099 -41025 -56660 -61131 -94161 -71070 -18540 19677 29018
22570 29018 10448 -34741 -33832 -26333 -4517 -7355 -26530 -23416 -39790 -48543 -45790 -55215 -45506
22557 -45506 -52500 -6622 9509 24978 9386 -5013 -28691 -76127 -53731 39163 56931 58934
22545 58934 64894 45767 44687 39651 21168 10880 -5164 13425 -3522 2465 -18567 -76171
22533 -76171 -75598 -21193 14577 14303 -19491 -17275 -16213 -7919 -28025 -34485 -10298 -18743 -34946
22520 -34946 -63704 -52392 -19278 4950 30147 19585 20865 10428 -7962 5571 -3617 19448
22508 19448 24694 -19577 15 -6132 -47491 -40418 -8613 -28709 -40235 -22178 -14380 -60738
22496 -60738 -65390 -27439 3244 7284 10594 10404 11004 -560 -6768 2875 16554 26299 27873 706
22482 706 13407 9193 -12590 -46888 -75311 -87950 -89266 -26340 4171 -11068 -42799 -66911
22470 -66911 -100906 -117555 -99642 -116070 -87737 -34072 -31903 -70656 -58052 -75052 -122362 -99074
22458 -99074 -47511 -10848 -49607 -56796 -54669 -29293 -49419 -3767 11501 -2668 -9039 -10888
22446 -10888 9556 -26763 -1035 19933 15663 -23690 -54697 -95073 -79439 -70873 -47457 -9713
22434 -9713 -22123 -18465 -1897 6764 31139 50954 7541 2581 2050 -24659 -31551 -14014 -8993
22421 -8993 -352 32761 44912 20416 -2665 -7180 21658 16729 -42495 -36149 10354 11887 2619
22408 2619 28117 22913 -970 -10921 -58954 -78833 -105075 -89658 -61514 -20648 -37547 -48261
22396 -48261 -67720 -53955 12733 36193 36915 27722 20713 10690 47218 51170 -2746 -21788 8893
22383 8893 24786 -20785 -34065 -24219 -19702 -8500 -51658 -64979 -34296 -27991 18381 17483 19717
22370 19717 -14712 -16833 -28014 -24074 -8950 -10193 -9639 -19749 -4606 -6474 -40614 -82268 -82293
22357 -82293 -67828 -41190 -15463 5177 -14272 -55561 -61684 -18651 31467 69413 31982 2111
22345 2111 9376 -2806 -6505 4464 -16893 -42520 -31563 -8775 -14357 -18204 -28476 -18928 715
22332 715 -51085 -63675 -60122 -84198 -68657 -39492 -16692 -10886 4190 18043 26009 47786 9807
22319 9807 -31659 -51850 -64088 -42090 -16842 -27902 -55245 -61610 -47541 -35615 -7059 -17478
22307 -17478 17567 7681 -25680 -34628 -13512 -9539 -47299 -23196 -15601 -40018 -26660 -18454 -2368
22294 -2368 -24710 -65279 -59055 -7802 7240 4464 29578 24027 42606 61684 47102 26241
22282 26241 52737 29490 16451 28457 34735 -11438 -56595 -61897 -35688 -45788 -38624 -9140
22270 -9140 19546 59421 2695 -27219 -16165 235 24293 26219 -725 -35216 -30278 -18451
22258 -18451 -33479 -63753 -57738 -6186 9146 6249 5909 -28362 -26260 -64172 -51285 -32998 -25969
22245 -25969 778 15536 24923 11688 11336 -46415 -59494 -52397 -17631 -16401 -9257 14036 23807
22232 23807 8334 24575 -10615 -56157 -68274 -69566 -38686 -3404 10275 17065 38798 44945
22220 44945 74603 92337 104322 69853 19663 1424 1670 2452 -21406 -24238 -53629 -65711 -46333
22207 -46333 -33715 -64211 -96520 -97824 -82793 -55065 -22171 -31688 -31630 1664 -9302 -31734 -34500
22194 -34500 23333 67230 15875 -583 -24547 -9526 26353 -23633 -9366 7236 9131 -6087
22182 -6087 -9783 -28263 -24611 -34274 -22021 -12077 -24380 -3858 29781 34410 -17977 -47236 -45061
22169 -45061 -35487 -18839 -15474 -19049 -7144 -2660 1912 25263 45551 22315 14367 74419 85056
22156 85056 54720 36855 40643 25826 -11541 -42227 -71642 -55512 -32356 28658 57057 76046
22144 76046 37658 -5418 11624 19190 40439 37559 50028 26191 7448 -35252 -32575 -17160
22132 -17160 35852 46269 44736 31346 -27315 -45441 -9173 19456 19255 -17291 -15344 25667
22120 25667 33908 49880 60279 75426 39228 20052 22335 13355 34894 14442 8437 11975 17252
22107 17252 30994 28706 -14524 -13269 17304 24939 4738 -43727 -38313 -9461 -8271 38466 57151
22094 57151 34580 -7178 -46164 -86616 -26315 31952 -3337 8447 42630 46564 32354 -8240
22082 -8240 16387 16584 -28700 -3683 -15948 -32956 -36503 -66463 -51155 -21844 5840 12229 11335
22069 11335 6185 -2503 12227 -235 -48562 -109647 -124983 -58144 -13127 -27614 -62807 -37267
22057 -37267 18219 62656 20894 10486 -7177 -33512 -17411 -42209 -39302 -31562 -9902 -31267
22045 -31267 -9549 -4455 -11998 19027 66490 23094 -24339 -5222 3577 -12704 9227 30798
22033 30798 36621 58969 83032 77042 66781 61591 34880 -30696 -94151 -102619 -92954 -56526 -46785
22020 -46785 -31885 -22718 -9686 -13107 23123 6520 676 -4824 -1750 -16157 5501 35545 -1876
22007 -1876 -3894 1624 23557 30707 38006 63365 54667 -11610 -64247 -29652 -20907 -53451 -71030
21994 -71030 -80231 -82861 -110427 -97705 -89985 -57720 -7242 12718 -8708 -10697 -41337 -72175
21982 -72175 -52628 -36704 -23965 13506 77875 70572 39617 50951 64594 31629 5563 -22623
21970 -22623 -6166 -5132 -15871 -9251 26983 62109 92457 40082 -15769 -9052 -8142 -8017 -37388
21957 -37388 -22913 -9776 -28841 -49459 -5359 -2045 -25416 448 -22624 -50071 -42119 -34196
21945 -34196 6822 8439 -12848 8497 15321 28793 13903 -20412 -31884 -34339 -3461 -8225
21933 -8225 -40568 -57720 -19520 -16623 -39896 -12667 22931 -10745 -23537 4572 36676 -5988
21921 -5988 -1916 -29403 -74933 -82826 -67114 -56055 -35496 -40654 -52420 -18929 -20105 -65390 -102064
21908 -102064 -59357 -27311 -24142 -27754 -66858 -44440 -36883 -21167 -46259 -10257 49404 54663
21896 54663 24678 35540 46177 28504 -18169 -5170 14750 13783 45218 6093 -53422 -20506
21884 -20506 -12247 -2488 -8279 8638 18712 -16422 14446 15996 30528 69735 48087 12558
21872 12558 -52204 -45938 -45718 -58387 -74116 -67757 -49516 -59725 -31336 -2086 299 -18547 26168
21859 26168 52023 56734 57745 28087 -2974 15550 26563 9061 15474 34056 17030 15197
21847 15197 -1717 -21429 3913 -33199 -78290 -83901 -113860 -118076 -71957 -65529 -78892 -58617
21835 -58617 -35070 -41829 -82223 -88971 -37039 -49285 -105637 -82176 -58169 -55606 -24769 18294
21823 18294 62345 38492 46393 57883 59838 49288 43429 -9720 -14810 -28222 -26931 9770 40849
21810 40849 7552 -2484 7838 26163 9895 -27703 -19334 -32442 -49888 -22129 -8052 -16898
21798 -16898 -50862 -55997 -47341 -56968 -59377 -62370 -39895 1395 4467 -43534 -38424 -44805 -15348
21785 -15348 -36120 -60471 -48534 -40410 -67444 -92587 -94478 -62737 -55833 -4626 -18856 -43515
21773 -43515 -20060 -5230 -61861 -92844 -53840 -7522 31940 35351 36446 39309 59964 78364
21761 78364 71186 27949 8908 -9677 -11264 -1553 16440 -9865 -54621 -79746 -32805 -20618
21749 -20618 -30056 -56343 -33312 7282 20706 34224 65406 34020 39181 30739 24916 10757
21737 10757 31906 5776 -31578 -38439 -84560 -95861 -32876 -17831 -18589 -4658 4230 21878
21725 21878 52757 57655 50020 6698 -40361 15456 47016 13783 6059 18657 13717 34145
21713 34145 8526 6762 -9985 -39363 -48533 -18194 30597 19078 -40066 -36891 -6345 22421
21701 22421 13239 25730 10413 -6036 23997 -1039 -10642 2430 9957 31181 22566 -2789
21689 -2789 -27860 -53221 -42241 -22650 24811 41988 25540 14824 -7434 14922 37495 -10165
21677 -10165 -52789 -36590 -31014 -29303 2501 62966 53885 44643 35137 8411 -7225 -311 1805
21664 1805 -32805 -58513 -51967 -3850 52009 34052 51327 37588 60561 60177 19723 -2387
21652 -2387 -9453 -18561 -35666 -16941 -50591 -70493 -56536 -45033 -45397 -37170 -26011 -19922 2933
21639 2933 24639 8089 -13492 5505 -6711 -9528 187 34959 13518 -69577 -64980 -43199
21627 -43199 -45656 -77284 -135223 -104887 -79084 -65913 -56228 -19844 -22643 -28928 -59906 -45352
21615 -45352 -45637 -18739 -7431 20858 44120 38724 44889 13526 32827 25150 34408 27431 26702
21602 26702 63478 23298 -5346 17057 16554 26354 1537 -4949 -38255 -21166 -18831 -34168 -14804
21589 -14804 -4347 3686 -44557 -45133 -57955 -83603 -105252 -78007 -51179 -40634 -2187 -19788
21577 -19788 24345 27582 -18240 -39580 -45520 -62308 -100490 -102823 -101978 -80099 -43860 -42413 -27120
21564 -27120 -519 -22162 -58064 -99303 -73775 -81945 -93432 -52395 -51912 -51835 -56333 -103877 -72272
21551 -72272 -26432 -11710 -17169 -36555 -54387 -25149 10240 51173 52199 50988 34448 53374
21539 53374 51795 16432 -19430 13038 7156 2239 15179 48953 57188 2749 -63108 -53025
21527 -53025 -38540 -31607 -21999 -15582 -18432 -3084 -11892 45969 73907 71300 83508 43265 48540
21514 48540 16682 -15165 -1381 34923 53321 78370 98066 64314 83917 50100 51082 23978
21502 23978 -4554 -27444 -75611 -55985 -52907 -40640 -11571 -28629 -69222 -40214 -12300 11678
21490 11678 25971 -25903 -53103 -27122 -36589 -28378 -10956 -16877 -1351 64202 3417 -38751
21478 -38751 -18827 -27280 -54470 -43984 -30527 -46920 -8328 18364 36241 26387 1456 -6725
21466 -6725 -27514 -23770 -50219 -24131 6430 42104 35798 26861 15703 12352 -9929 -13683 -41877
21453 -41877 -50951 -85322 -132935 -132914 -72524 -6364 9614 -31529 -45195 -41803 -44382 -48936 -35670
21440 -35670 -52039 -27148 7461 20578 7925 -38219 -16928 -28745 5171 50464 16846 42250
21428 42250 24564 -9427 19604 35687 36882 61636 37178 1366 4925 -33902 -61054 -63250
21416 -63250 -52298 -40080 -41892 -26655 -4013 -22809 -7228 -27850 -73438 -86971 -102431 -120744
21404 -120744 -118657 -58950 -22409 -7828 -18349 -41483 -68553 -67950 -22461 28267 10826 -9132
21392 -9132 -5329 -44103 -54403 -18206 -28671 -32492 -22759 31840 30730 31873 46260 30110 -28474
21379 -28474 -94555 -102573 -50246 -16520 -29448 -36475 -11404 50394 59236 15450 29006 30908
21367 30908 17327 9238 -2951 -20448 -77659 -104999 -67951 -42917 -64817 -67686 -61183 -45369
21355 -45369 -44304 -18184 -8526 30101 -6094 -16612 14716 11242 -33713 -21421 1996 28143
21343 28143 27088 38314 34886 23999 -43132 -96085 -119530 -99790 -57989 -62914 -56053 -58199 -63015
21330 -63015 -35005 -5945 -14539 -25879 -42471 -52592 -41428 -24704 -7135 24499 40259 32655
21318 32655 6296 34206 19618 -12108 -84198 -87678 -50090 -4734 -19491 -46449 -31587 15877
21306 15877 41101 39124 66846 72451 48195 -21873 3917 52514 44374 653 -20605 2390
21294 2390 41789 61876 14897 -13540 8486 36114 89205 58177 20354 41305 73500 76357
21282 76357 50339 43878 42702 25328 -314 -17048 -9878 -21558 -43342 -38299 -50987 -30749
21270 -30749 -45878 -6507 35359 21886 14677 24535 -3253 10601 18243 6330 -34177 -70108
21258 -70108 -39389 -4940 40953 57076 126381 112202 51680 70958 59889 15044 41953 29342
21246 29342 -1484 -1497 17841 41088 33884 68165 47362 32171 11236 -26201 -36254 -46404
21234 -46404 -60465 -48025 -55250 -29858 -18014 -16210 -4333 26626 49394 20639 4947 -989
21222 -989 -17304 -9195 8040 46712 50549 78966 58851 29471 -11962 -45618 -105334 -122307
21210 -122307 -95776 -64948 -73822 -56173 -43486 -43078 -18882 13853 22577 31553 38234 -17764 -14916
21197 -14916 -38371 -47886 -62612 -91970 -107966 -66515 -30353 7313 28615 44791 19750 23296
21185 23296 -1683 -31791 -33132 -30716 8790 22293 3322 -13728 -7359 -23176 -24110 -6310 11599
21172 11599 20385 62025 75936 41930 3145 -30188 2604 -14500 -26916 -14127 -7289 20880
21160 20880 20858 43947 38809 17344 32268 22187 18255 39855 50915 23950 16317 31127 11253
21147 11253 -2107 -1090 25841 6011 -28102 -19325 2155 18446 25549 15237 18216 39573
21135 39573 -5262 -55880 -37715 -26380 -38994 -28809 462 -5082 49570 58868 24825 6228
21123 6228 -13321 -44659 -34815 -41330 -13620 -20951 -53885 -23917 14185 33024 38602 35386 20017
21110 20017 -8836 -5852 -17760 -28684 -16093 20263 27155 33084 25168 24919 -11309 -53127 -18340
21097 -18340 -2686 4691 21336 30141 17573 -1132 -36922 -41435 -96590 -78495 -69887 -54430
21085 -54430 -66179 -84337 -51112 -32808 -7849 -31715 -67270 -56820 -27771 -54369 -64778 -54731
21073 -54731 -14534 -2875 27720 48861 20024 -20619 -31084 -61725 -29983 24432 -1201 -35169
21061 -35169 -29113 -55596 -63640 -32565 -11017 -3848 28554 39842 27468 2736 -7414 -10741
21049 -10741 -12611 7406 -21052 -57356 -30742 24729 69728 69180 86286 43561 -12483 -55102
21037 -55102 -48199 -39677 -36997 -16685 21357 48124 22927 22824 57293 53061 38962 31780 -19026
21024 -19026 -34050 -30241 -27004 -33490 -11281 -7158 -38333 -29081 -22067 -4351 -17470 -18583 -7068
21011 -7068 20714 35546 30724 8691 65142 60581 37400 4279 -17669 -3043 -19929 -33326
20999 -33326 -21543 -27375 -44498 -60912 -77599 -103054 -111577 -74861 -59851 -20678 -1151 -25279
20987 -25279 5023 62345 65879 72615 75021 80451 63176 32376 11189 -7358 -48101 -27999
20975 -27999 -24860 -26848 -20579 -29099 -18959 -33667 -50377 -59307 -58967 -36347 -17601 -17310 -18658 -4700
20961 -4700 6639 14555 32409 20309 -12232 -54210 -62283 -45049 -18249 -25348 1602 -16605
20949 -16605 -30131 -14898 -1775 -35355 -21675 14252 28184 44467 38307 24901 34897 22135
20937 22135 -10095 -45482 -99657 -68551 -42212 -46185 -16840 -6868 17172 22366 62525 60955
20925 60955 41067 49990 60054 68478 53723 56605 61402 28392 14296 49847 71717 95388
20913 95388 87470 52927 19849 39135 10240 -28138 -26702 -59942 -53636 -15721 -20162 12953
20901 12953 -7082 7742 3739 -32699 -58668 -33113 -49889 -61289 -29581 -35633 -36738 -28363
20889 -28363 -47463 -38383 -32566 18299 31867 -331 15551 16698 16446 21333 -11315 -46101 -37240
20876 -37240 -49473 -53139 -38983 -27269 -32259 18832 26806 9908 -11439 4509 0 -40037
20864 -40037 -22077 14024 51955 36741 -17473 -50899 -49471 -44952 -55950 -34213 -11883 7243
20852 7243 69013 103335 80759 59107 52844 22540 19204 -1179 10601 -12792 -86224 -130311
20840 -130311 -119596 -37052 -16031 -36016 -47710 -60842 -56771 -27311 -4231 -14454 -46483 -43405
20828 -43405 -33338 -12204 -5242 -25289 -70923 -103875 -52249 -31906 -75659 -87336 -75182 -56106
20816 -56106 -43014 -74292 -66031 -26391 -35158 -42622 -21167 -21773 -19768 14366 38995 50094 22401
20803 22401 -36222 -33738 -26844 -33076 4034 12334 20954 46003 52901 42908 13419 -15262 10952
20790 10952 18976 -27332 -66031 -58754 -51870 -41729 -32574 -17091 49370 30138 -14206 -2288
20778 -2288 -6132 -70800 -66786 -43352 -42713 -43871 -57730 -56891 -25596 -20840 -92 35540 32284 9533
20764 9533 -25065 -21045 6858 10327 -7978 -36703 -48037 -17375 -45229 -29316 10224 26121
20752 26121 35002 -2366 32420 45176 19053 9984 39123 25219 10031 7029 16199 -6640
20740 -6640 -67135 -76631 -49774 -32898 11550 21112 -14935 -63266 -41647 -66926 -74516 -62991
20728 -62991 -75783 -40975 -7577 -3412 4311 23282 38689 35305 10202 -5804 9484 2207
20716 2207 12828 28283 14157 -17762 17672 74145 86801 40457 15441 -26030 -5043 1718
20704 1718 17676 75521 93153 89821 15421 -59586 -45791 -60948 -26458 -39482 -30424 29317
20692 29317 45400 51928 45569 25241 19198 63607 38492 25837 27297 27019 24702 24971 13179
20679 13179 25179 11510 13509 54103 72225 47994 47275 64936 22033 17057 23019 10757 21155
20666 21155 13811 -5764 240 12761 20914 30778 23771 33824 13275 6389 39118 25208 -46795
20653 -46795 -59111 -48687 -16229 10507 41391 75795 110557 144498 93784 62355 34689 27739
20641 27739 17785 -2674 -14864 -9393 6545 3696 -4855 -12973 37809 61077 -2051 -23185 13955
20628 13955 53004 60647 31511 10349 -40122 -45326 -20697 -3115 -13095 -42085 -54873 -16305
20616 -16305 -26739 1809 47655 35902 -10623 -19750 -11691 -36202 -44580 -33588 -18745 -22248
20604 -22248 -11372 -17700 -12121 -34270 -70753 -105905 -106124 -44759 19925 51373 36513 -8736
20592 -8736 -21252 32411 81002 97775 116832 74261 19533 -10427 -441 -14319 -20412 -4456
20580 -4456 27673 50440 35486 4584 -6445 615 780 -10919 -54122 -39098 20526 -4670
20568 -4670 -49477 -33661 -73875 -84099 -47772 -17776 -12261 -8196 -18799 -8238 -9880 2924
20556 2924 29048 42818 -6592 -2669 728 -23221 -1107 24774 -7893 7506 -35680 -27829
20544 -27829 -10085 -7832 632 -5814 -16083 -6206 -5436 -5118 -47421 -44966 -38413 -22275 -5636 9895
20530 9895 -1490 -14095 -30718 -14464 -7340 -19961 -17953 -3862 -52972 -24318 -5182 -11792
20518 -11792 1938 32698 44494 57207 39040 20734 37694 39138 7059 24196 27120 20775
20506 20775 33471 20365 57264 62225 24653 27859 24584 -6289 -19698 19740 41663 13182
20494 13182 -78 -37784 -40841 -36943 -32118 41860 77384 19240 -40459 -40791 -9492 6763 21415
20481 21415 53472 73146 37364 16553 33871 28603 5233 7117 33828 25761 -12211 -57458
20469 -57458 -47096 -38121 -62232 -78998 -118017 -141034 -100724 -76897 -84842 -52997 18010 59047
20457 59047 65289 60701 33584 16758 2850 -3562 -17896 15292 20719 1484 -420 -15835 -68487
20444 -68487 -62232 -36382 -19843 5077 18983 -25097 -32176 19823 -30924 -54340 -41889 -32353
20432 -32353 -5427 10054 16256 35670 9678 -1595 -824 -38627 -49817 -12201 29170 42870
20420 42870 67829 66261 80693 66195 56691 39430 92356 61472 11854 1727 -27057 -36571
20408 -36571 -38572 -52280 -57814 -65659 -38543 13651 35529 36342 51332 89439 118852 88792 10846
20395 10846 9872 54203 44132 22703 28586 -25283 -40332 12857 20616 9351 7058 13834 48110
20382 48110 69052 30220 33215 6906 57 21284 -2862 -28812 -18291 36663 40939 1762
20370 1762 -70678 -59317 -50207 -53236 -44946 10626 59051 50728 40599 24665 14020 26532 10808
20357 10808 -923 -3196 -24232 -28162 -20529 -21317 27149 39470 -20005 -28599 7881 33077 16917
20344 16917 16638 32855 39033 49759 -15107 -68286 -42693 -16885 5000 27079 54298 100283
20332 100283 95819 32367 -1012 -5365 -1454 -45648 -50878 -17369 -6106 -2263 6157 8089 24966
20319 24966 -10404 -36379 -14080 15339 19060 -31300 -47744 -28458 -24010 -59810 -104764 -70577
20307 -70577 -28910 2735 -40108 -72509 -69357 -52322 -19454 8986 34473 55353 19374 30970
20295 30970 43579 28675 4576 13104 14965 -729 -31546 -15763 18744 54803 47938 43413
20283 43413 45130 25949 4691 -8717 -3791 -15790 -7866 5800 -2153 -5039 17097 31495 -1372
20270 -1372 -12266 11484 -146 10554 44190 61394 51198 61558 68954 59768 32836 -3849
20258 -3849 -5886 643 20379 86355 93355 46829 -13389 -21606 -31873 -37015 -23573 23774 22724
20245 22724 -1403 -5437 -8704 -2294 -5064 -32043 -19279 -10577 -35889 -36230 -12493 -14213 -20328
20232 -20328 -24139 -28139 -10935 -17817 19277 11089 9907 15911 11115 -159 17329 43843 57286
20219 57286 41940 2923 13939 30559 49057 64617 82855 73764 81395 48170 -19599 -33616
20207 -33616 -28665 -24170 -15676 7929 53138 29257 -10075 -38603 -53282 -76276 -75353 -92468 -77988
20194 -77988 -57774 -3896 777 13481 33645 67436 113032 92507 42899 -17883 24742 52093
20182 52093 65349 43887 14704 -8234 6780 -650 -10885 3050 35495 49260 95597 103913
20170 103913 127845 174933 205935 232009 193578 162427 93908 68849 98470 88661 61454 19911
20158 19911 46452 105159 116877 128039 138012 156983 158924 139356 129374 106747 99105 117492
20146 117492 94963 59755 39189 42753 50725 4082 -25804 -14049 -2264 -26578 -21820 31740
20134 31740 43634 54723 55023 38101 9611 -3365 32772 60395 36057 11679 14144 -8917
20122 -8917 -49 28340 75891 57874 74448 80090 117250 110638 132302 142039 182496 241152 264796
20109 264796 267605 266241 221673 227260 248012 239346 189085 174647 143319 171929 204978 184304
20097 184304 172934 133093 93203 84539 80638 51691 47353 19373 1282 16907 11548 38307
20085 38307 80132 91230 56956 43348 48797 50759 89194 97040 68741 53587 8900 5849
20073 5849 40655 37557 54643 44391 27379 53531 67619 32870 -893 -21468 22661 10465
20061 10465 -35224 -8083 5133 44577 57818 71911 69208 73640 52061 26019 5276 -1612
20049 -1612 18382 3250 15516 61023 75276 42050 56698 83974 45101 41881 55378 31502
20037 31502 -20875 -40216 -56735 -26669 17151 39481 57801 54175 58013 16530 -5945 32125
20025 32125 42548 -24404 -21769 -6289 30292 17468 -12779 -20523 23424 35580 34751 50424
20013 50424 45584 25639 425 7979 32335 69027 59584 6851 26989 45159 59039 73889
20001 73889 74036 85048 91162 83302 98105 104424 74299 71675 61153 59211 56627 95847 101605
19988 101605 77282 48598 62951 39598 11347 15283 18962 29150 36850 11327 -26295 -21431
19976 -21431 22412 78144 53417 -2646 -55670 -59593 -20446 29460 19377 19058 -5509 -2529
19964 -2529 49981 66035 92965 104667 110701 70041 72610 56601 75639 71697 31877 37853 39923
19951 39923 53449 68745 71969 82732 114423 115434 65516 22400 37408 16491 33475 68778
19939 68778 64095 29305 21993 26801 66176 56739 49538 30594 8493 -16875 -12832 39012 84133
19926 84133 68623 47933 51027 65343 60469 80164 155205 162407 153478 143004 70844 49807
19914 49807 76441 59005 83079 65972 11168 -38979 -34279 -21142 39349 110285 98172 127647
19902 127647 128005 85277 97812 125171 116423 68371 52339 104839 107721 88573 107201 99203
19890 99203 109816 115148 89513 91325 83415 67925 53925 29527 25869 8285 10766 12715 12193
19877 12193 9909 39216 72539 123436 134012 119479 132459 149840 99851 102390 120109 90727
19865 90727 50521 28944 1325 3395 43306 78868 53849 -1782 -9778 -49339 -25374 35410
19853 35410 74892 64170 40577 35409 68029 74638 87366 119222 132100 143628 115701 113757
19841 113757 100470 56208 50844 75496 87954 67289 63394 83130 52399 59431 89047 80021
19829 80021 83005 76827 60799 23532 37001 64663 131167 115232 91034 70464 57701 82485
19817 82485 77059 83344 92416 86376 93084 119332 99956 153760 170264 121486 93980 112264 92811
19804 92811 84160 70386 55572 32448 9575 5509 23404 62086 39129 52326 106287 113443
19792 113443 141646 146103 121536 109736 95309 89371 109280 148861 165437 176716 159445 111372
19780 111372 149845 203848 220865 238230 268402 288986 296717 293113 294128 305848 376576 397791
19768 397791 390366 366359 324820 265546 220041 243772 282918 294857 257050 199728 208208 249730
19756 249730 228126 204768 219805 193055 142625 137550 152147 146589 157485 194816 229086 207532
19744 207532 188992 231165 196227 172709 194989 230502 256470 268403 290108 307847 284421
19733 284421 267104 259437 242441 261554 309785 364459 391448 446336 458621 509492 602047 688409
19721 688409 673510 622980 568845 558995 524137 486726 470707 468931 504462 544771 545361 526064
19709 526064 462931 378255 342764 372141 385901 361674 331528 311785 312207 299941 341720 356599
19697 356599 317742 291160 312567 334344 351740 357356 359384 384481 445218 514493 521693 494979
19685 494979 513842 514623 527018 615398 645388 662752 694007 717382 769728 863054 945362 1020898
19673 1020898 1125474 1218628 1375688 1544847 1658104 1749976 1879173 2130956 2397305 2678879
19663 2678879 3047609 3597284 4335925 5274832 6451126 7806820 9321580 10494936 10704256
19654 10704256 10668147 11394007 13042005 15862080 20079274 25683969 32507341 40713727
19646 40713727 50771707 59107743 56147523 46971616 41506912 37353678 30293145 23072232
19638 23072232 18663596 16751795 16439601 17064661 18286205 19348249 18373295 14747176
19630 14747176 10801410 7993215 6250676 5160873 4450085 3946431 3602660 3443518 3406483
19621 3406483 3424451 3440368 3462230 3479610 3569659 3726265 3946395 4216153 4465493 4798803
19611 4798803 5340605 6123051 7238195 8777743 10743425 13177612 16042372 19332274
19603 19332274 22800232 24884152 23931229 22036280 21683316 23469235 27226997 32846738
19595 32846738 40342126 49961204 60616921 67711463 69590841 71759595 69824563 54131515
19587 54131515 35931798 24358691 17988223 14621657 12890268 12103753 11939872 12265502
19579 12265502 12635473 11739492 9210888 6773910 5085554 3976462 3205314 2726202 2416476
19570 2416476 2199064 2026432 1859129 1753197 1648091 1562722 1436104 1236310 1049499 913596
19560 913596 839412 783305 758563 761012 665513 602229 579564 575114 513794 470071 412305 388958
19548 388958 395008 396652 398221 404539 329691 315175 314516 300653 256729 241588 238879 230353 257808
19535 257808 311868 279075 212531 192597 222946 213380 191753 184065 193349 204549 174663 175874
19523 175874 199282 204667 166591 169296 186403 143982 142739 158673 142007 130816 128956 188458
19511 188458 185901 154674 142811 111339 120718 121937 107500 99990 84140 68508 94754 109035
19499 109035 80096 117163 137276 128186 125117 127370 133681 156193 116255 116178 153360 166663 163190
19486 163190 119367 67344 75612 131008 166787 199081 151695 124412 127046 100920 73127 72110
19474 72110 54577 24658 14184 30765 104439 100237 73703 55497 77398 111551 118807 120243
19462 120243 96654 64568 43450 52674 88269 126088 160669 188118 180296 166304 183224 203391
19450 203391 199756 133710 60903 80653 98917 96876 113763 137734 110467 121405 106790 69434
19438 69434 46075 53322 71581 73296 70923 63744 59512 55873 51576 52579 64828 59821 31073
19425 31073 5717 -5601 10009 47755 71685 78194 109861 101472 99290 68123 81268 120770
19413 120770 121168 110580 94257 112757 130435 120658 168772 235620 239202 180829 131715 90382
19401 90382 67600 47693 27958 43917 85503 94304 55613 25056 34126 36265 62820 111546
19389 111546 81142 69594 106457 118745 139853 201375 200776 153879 106261 130653 144485 110002
19377 110002 88105 99496 142832 158694 124691 89942 108837 92836 124599 177227 185477 146134
19365 146134 154363 169670 202804 175685 154800 146652 137741 147873 149748 146950 149060 190496 193168
19352 193168 210715 216508 229886 243513 172740 73539 58628 63376 124026 153658 133614 159671
19340 159671 145795 158618 135099 115319 110255 126803 124447 135244 165830 229534 254938 223578
19328 223578 202212 190239 162692 192082 219144 244904 244087 265191 269269 274373 239217 253147
19316 253147 249502 225171 223831 179822 157448 156929 159988 219669 249246 259806 343020 351736 321050
19303 321050 353542 384261 378858 376162 421705 485756 472390 469231 518415 561860 591665 625268
19291 625268 664366 728436 766801 827332 896274 957499 1047916 1159017 1317404 1486998 1649690
19280 1649690 1836056 1978740 2060723 2148701 2337954 2635454 2998932 3453161 4012021 4789634
19270 4789634 5829132 7120696 8670997 10522752 12724219 14964364 15905845 15753584
19262 15753584 16432708 18632596 22539653 28232887 35752840 44863427 55860182 69002275
19254 69002275 78588818 73563571 61722133 53545231 44930761 33812200 25246948 20639047
19246 20639047 18636887 18187091 18787776 20090824 21551229 21601867 18513788 13913242 10193447
19237 10193447 7714513 6140295 5108391 4411333 3941171 3683274 3581937 3522050 3503149
19228 3503149 3504849 3482792 3495627 3545102 3593926 3677633 3818098 4082104 4467109 5036025 5855702
19217 5855702 7019804 8634568 10597587 12941962 15693060 18844373 21498665 21749733
19209 21749733 20180519 19472318 20658685 23550559 27904729 33917915 41677612 48397574
19201 48397574 50188152 50501858 53255399 52165876 39830207 26105846 17575108 12880231
19193 12880231 10313849 8936975 8311745 8147671 8234940 8487589 8397583 7138654 5380551
19184 5380551 4034353 3187282 2624560 2241395 1962206 1783416 1648483 1553722 1430553
19175 1430553 1335505 1238801 1162441 1072556 887849 756492 653495 590002 566847 560092 573814
19164 573814 549279 476245 472134 456985 419194 362715 301024 257048 261133 258373 238314 207531
19152 207531 226924 236195 219053 202834 182726 185891 200354 149170 130835 150553 177203 175001
19140 175001 182252 163706 151780 165473 133466 158760 210722 251325 204401 212670 236890 244302
19128 244302 232322 215899 216813 255662 300872 307322 317827 343006 377062 396218 385438 345503
19116 345503 362030 413260 407808 402068 394495 420302 384333 323527 287215 251573 223796 205527
19104 205527 195120 224694 223721 218064 244163 227947 159062 166523 173625 116481 72338 84754
19092 84754 128726 147199 232243 264997 210883 137314 123086 73832 87992 97879 79607 69474
19080 69474 66969 94337 106812 84406 70453 65113 92366 89949 113884 123228 175340 202416
19068 202416 178721 196103 240805 246861 296266 297080 275034 231821 199228 170569 194476 200184
19056 200184 210565 251962 223615 227514 253002 236521 153746 150627 205683 224563 203860 190169
19044 190169 191917 207131 173502 171523 203070 202170 165126 100802 120697 141332 153085 143123
19032 143123 101793 48705 53712 61874 57576 51932 58527 61723 99508 116166 119377 117621 99674
19019 99674 87716 91132 110758 128743 95374 56672 31475 -5816 1900 605 13247 31641
19007 31641 88367 116343 105698 121308 136953 135626 142097 165112 192280 220603 218883 190046
18995 190046 199767 237697 226285 183936 151885 176600 219320 221088 231926 289834 303340 271032
18983 271032 283804 257310 171741 119077 97691 69352 79092 119008 140726 151740 176969 231477
18971 231477 250640 246491 222309 197496 193420 199102 182275 124762 67639 75116 70152 60026
18959 60026 73732 104964 131610 160579 163635 123038 93552 74263 86041 96011 67296 46422
18947 46422 42305 25547 -1845 -15856 12834 59839 66113 99355 71767 32080 15694 50900
18935 50900 50802 39904 21030 26687 29028 18228 34367 57899 51502 13588 -26392 -31063 23498
18922 23498 35244 25370 21979 22148 11859 13735 19206 13467 21926 69919 74864 56343 55612 69016
18908 69016 71959 83780 47333 -8332 9390 13877 1041 27349 19384 8041 83 9725 14699
18895 14699 15544 20467 -26968 -31395 6430 41053 46296 60824 56262 14695 -29708 -58437 -28828
18882 -28828 -16731 -36283 -34755 11430 37220 25833 -8419 798 32111 36394 26834 44257
18870 44257 14694 -11289 -8410 -17453 -60982 -46768 -7700 73353 72472 14574 831 -30973
18858 -30973 -33023 -34937 17774 13444 22604 72288 99760 49805 61235 37629 -19898 -45049
18846 -45049 -42679 5498 52166 31824 25693 8697 -510 1930 19747 31609 -2832 -33791
18834 -33791 -27298 14133 20321 -31485 -45924 -18779 -179 4527 30440 32589 70072 63336 40702
18821 40702 -8370 10729 40732 35712 14347 63111 103890 86580 71593 60452 83154 76701
18809 76701 47492 62297 79500 61431 62167 68979 88413 68724 38872 41120 37178 64382 77680
18796 77680 101212 91213 60538 18613 -6907 33682 43740 78752 69568 43080 -7907 -32463
18784 -32463 -49681 -45165 -22372 5756 -5852 28574 42027 32062 12115 2288 -793 62383
18772 62383 67514 39226 21842 53748 146393 219149 334131 474606 447349 268859 147065
18761 147065 105190 63987 33198 48697 65938 58080 43155 35871 16451 -7231 -6616 59111
18749 59111 120377 134039 159532 175674 159956 189699 174031 177638 218754 219324 260371 299670
18737 299670 285544 274306 222325 193866 190105 211757 175732 144553 95927 90751 62530 36277
18725 36277 42185 17672 60570 75052 29406 13885 24297 39975 56839 73184 87450 86636
18713 86636 67279 77121 131415 132034 81543 86145 124284 149535 110883 115151 92970 65277 122410
18700 122410 174261 201668 183081 170151 185827 237041 242151 243953 250319 237402 210179 209046
18688 209046 184021 108897 104567 79428 104069 142257 182654 171754 193503 222036 237862 221044
18676 221044 202129 150954 118407 77449 93150 131213 127584 139687 151410 137802 136346 107178
18664 107178 67970 90068 130931 110243 43259 91731 144453 158123 160890 136597 106794 87840
18652 87840 64099 64919 45129 37017 51328 55222 52202 42971 66718 64310 60776 81170 43954
18639 43954 17248 4538 -23005 -9809 10774 -4419 38459 46287 90737 106183 99942 21695
18627 21695 26102 41818 39646 26025 8130 -21800 -44081 -47159 -18962 39801 51999 9718
18615 9718 -28846 -9263 -25097 -47337 -50498 -30238 17517 45700 48000 25318 1881 -24030
18603 -24030 5223 59993 84064 131740 143324 92995 42764 50657 37163 107451 146065 136638
18591 136638 143946 162398 188181 166015 159494 171451 121072 64615 63572 42909 26863 44171
18579 44171 36387 48697 56289 48978 44711 39815 35093 48254 51584 22155 39290 48703 53225
18566 53225 69660 71406 61965 39023 56158 45551 39840 24172 16610 -23751 -2017 22377
18554 22377 -11915 -11951 -27339 -72431 -66314 1953 44823 20289 39820 60429 79305 67500
18542 67500 98170 48351 -4082 -45460 -20771 15163 32081 57401 48892 56268 143053 158777
18530 158777 155611 158878 171187 135785 118022 149482 129650 40238 58776 90322 132444 127918
18518 127918 138450 140022 147927 138551 107313 82157 57730 68721 141267 178493 197292 201340
18506 201340 180921 142201 137124 119330 102386 78124 75672 88897 124558 123863 125539 138194
18494 138194 165997 185438 183056 136294 113159 149791 149528 170832 160349 109027 104368 127045
18482 127045 109374 69397 39709 35550 34218 73491 103079 139294 138815 144568 151802 165179 110933
18469 110933 81508 91139 84804 115207 154427 166311 187168 186828 166999 150731 144941 147034 154204
18456 154204 165959 149913 188437 241773 247894 243282 269299 319163 339686 320724 314742 314394
18444 314394 308511 322707 368993 400830 416014 425493 440381 433261 440002 467010 475750 501889
18432 501889 572965 634646 698755 805788 897771 969282 1038130 1059973 1078908 1081795 1127999
18421 1127999 1143263 1195775 1324436 1448016 1525284 1696284 2043557 2403127 2876388 3455651
18411 3455651 4171375 4992894 6081708 7598505 9638895 12278180 15836863 20441547
18403 20441547 26089432 32440888 38722750 43479667 43743505 40990744 35199531 27515998
18395 27515998 21429788 17551055 15903799 16086200 17773401 20817804 25203724 30637245
18387 30637245 36588089 42094770 44869986 42750504 38117713 30156816 21651537 14950710
18379 14950710 10333694 7430006 5623399 4479720 3720483 3178690 2802075 2484606 2230933
18370 2230933 1983679 1737033 1538251 1346447 1181748 1071342 966574 950541 966962 1017078
18360 1017078 1033056 1003410 928151 854285 781242 734229 691911 619129 548719 463132 426549
18349 426549 426665 404230 392756 324713 292966 317060 320045 305714 237053 195382 180622 183713
18337 183713 202793 250524 244458 269229 281966 282300 298699 327853 292668 236673 216547 207113
18325 207113 171917 192707 216191 200202 188387 192627 180021 172838 189063 224977 241717 221896
18313 221896 155949 151227 119356 100655 67955 26497 29760 24145 -5791 -2654 562 -47224
18301 -47224 -52973 -14571 33912 63396 70642 77587 38615 34038 58615 80580 80380 36415 74316
18288 74316 99148 82262 68946 10988 2655 -3790 38108 47757 1695 -2949 11936 40563
18276 40563 39816 23643 27090 45262 85893 53929 48736 118856 130575 136733 141353 135750 122874
18263 122874 156078 187571 161721 108889 78688 71749 75120 46930 44964 58952 54515 86620
18251 86620 97220 74309 79999 118872 121747 86193 63606 58144 67149 106374 112763 80902 105877
18238 105877 178096 154170 107236 112123 126762 134579 102264 53856 72251 34146 15442 43300
18226 43300 60599 47390 11087 21201 -11800 -24888 4781 25260 41675 46556 17885 4442
18214 4442 21403 28958 49351 65480 68278 43269 49760 46993 70584 75088 62495 40904 36894
18201 36894 34067 -10994 10048 69382 93088 84942 92379 97824 45489 -4193 -2890 -3977 34985
18188 34985 46453 42706 39524 37530 53733 69202 73136 72303 77238 119732 101307 88493 70835
18175 70835 78124 89311 59826 32575 24364 25681 52441 59718 60291 59825 64912 21075 6961
18162 6961 28177 40381 53748 57131 83716 113802 146891 184967 194587 209180 222236 248582
18150 248582 214652 223371 263150 274230 282404 238108 203176 225145 242856 260849 313335 333371
18138 333371 335359 396297 462863 486644 523006 580990 618196 666823 672282 744850 831668 949159
18126 949159 1047087 1089183 1222490 1421103 1665445 2051829 2598504 3288047 4223887 5438046
18116 5438046 7062973 9163675 11946817 16005083 21901470 29763914 39052649 49488433
18108 49488433 63663001 82037501 74174862 42430026 23124367 14103066 9493904
18101 9493904 6919036 5299879 4124906 3295296 2693242 2216956 1912190 1620004 1433441
18092 1433441 1272140 1098660 932935 772610 673498 592333 560974 509099 466313 374310
18082 374310 327729 356253 344375 307451 290977 244040 284304 273504 245290 231020 263315
18071 263315 217164 149283 147507 132645 89912 106897 136376 142132 99685 79273 54185 58185
18059 58185 80016 65728 76388 12695 5430 37251 20773 25056 31842 55641 71480 85438
18047 85438 77099 64230 54208 79340 65381 28462 33091 58112 34849 18789 14756 39791
18035 39791 53054 31545 24842 12361 -20027 -33003 -1695 -4999 -8696 -16588 -13812 -23392 -21937
18022 -21937 12937 52363 58044 53669 28566 23725 5412 23675 82238 93617 31837 -44683
18010 -44683 -102998 -90075 -58459 -29788 3452 11377 9447 -4239 9180 35186 -8699 -72195
17998 -72195 -71226 -48530 -49195 -11739 10838 -1176 -69649 -76426 -54909 -1975 6946 -20343 -32175
17985 -32175 -30690 -33985 -31542 -16345 -47480 -99922 -115483 -65014 -38147 -18196 -60093 -57845
17973 -57845 1417 49263 116949 106056 86238 89381 33824 57630 43807 -5536 -4631 1659
17961 1659 -33906 -27795 7053 38129 46768 29257 59945 91927 92409 38792 24647 25113 42836
17948 42836 36757 29987 -5813 -14491 -51562 -52457 -64801 -70806 -62549 -33194 -16295 18481 15102
17935 15102 -29057 -31034 -59479 -28711 12894 17705 53509 36396 30373 10645 4782 13235 3933
17922 3933 22354 -2308 -42101 -35252 -5171 19779 36306 21080 9528 28449 31527 8320
17910 8320 12467 5822 -17079 -29357 -18201 -33887 -12030 62578 43508 13237 -707 13470
17898 13470 -22392 -34090 -38619 -55545 -53799 -17571 -14362 -47954 -71128 -103891 -83694 -69057
17886 -69057 -34380 -21186 10406 18384 -4702 16938 4271 -31866 -61200 -80803 -89156 -72080
17874 -72080 -70080 -66773 -19740 -5751 -21678 -20199 -19362 -1066 -1155 12867 26719 3160 12563
17861 12563 -1860 -56551 -52669 -73074 -51656 -44977 -43564 -73546 -97997 -57042 -14782 51382
17849 51382 52063 14184 -19939 -19803 -26158 -4262 -22431 -26387 -53913 -28813 22814 12730 -19436
17836 -19436 -23108 -18925 -43481 -26229 -24390 -52096 -56631 -2936 11475 34787 67742 11636
17824 11636 22489 15239 16556 28814 5096 -22335 8216 7653 -5690 648 32668 66653 77520
17811 77520 92937 66604 99245 152626 149951 146325 165279 153430 138967 88138 87357 72308
17799 72308 67152 69939 58092 63567 79633 76705 91201 132093 173523 122055 95441 121166
17787 121166 151309 129002 73973 47498 50929 60663 47850 6578 22740 35077 42572 41496
17775 41496 28208 -2482 -36697 -22178 35719 92397 82196 57225 33069 13957 10813 47727
17763 47727 33214 35616 93141 107790 72400 6952 8491 34012 58805 63532 33247 34052 4109
17750 4109 18119 -10991 19130 -22 -24836 -29140 18447 45583 36818 39954 -5968 -36899
17738 -36899 -51556 -28926 -21193 -67582 -45692 7481 37114 25101 36708 73197 64221 76007
17726 76007 99212 119058 159102 247179 268831 242462 191396 207459 182044 139471 128190 122736
17714 122736 63294 38625 73905 121911 125573 120510 145979 216416 253477 257424 200861 125443
17702 125443 112644 93325 82950 67870 106666 95839 56812 70379 48952 22078 32904
17691 32904 58983 75896 34988 -19398 -47484 -89275 -101359 -76709 -47599 -4135 -927 13830
17679 13830 7729 -34771 -61373 -49364 -16020 17045 37757 20688 2333 -6811 23410 26817
17667 26817 12821 30031 11788 -22367 -10089 3957 36859 15396 -2053 -17665 -44290 -33648
17655 -33648 -3850 31841 54016 5141 38401 36067 7449 2302 -17794 -14515 -2052 -29521
17643 -29521 -28606 -45805 -68577 -53705 -49144 -42775 -34264 -12977 -7999 -14336 -10148 -17576 -23889 3519
17629 3519 -1007 -6068 -3431 25662 7584 -27432 -46059 -59805 -39384 -13431 -26937 -21075 -15612
17616 -15612 -39110 -21768 30067 50072 70669 70644 99362 54618 -4599 -46497 -48424 -26886
17604 -26886 -18679 -30256 -38582 -27090 1291 36957 35759 44231 -1418 -49625 -88243 -75302
17592 -75302 -60480 16656 24054 10081 -148 -17421 -50341 -17507 17667 35906 40537 1639
17580 1639 -51946 -84919 -83846 -43793 -14853 -39053 -62655 -70984 -49278 6110 -3136 -5614 -15485
17567 -15485 1031 -26476 -41740 -40208 -46852 -28778 -44307 -47742 -47541 -34040 -20265 -19648 -75306
17554 -75306 -108452 -108689 -92194 -85819 -59809 -62574 -62542 -38272 582 73061 111440 87046 85744
17541 85744 69879 56776 45573 41880 35133 52352 -13820 -61365 -40528 -19488 -8070 -41430
17529 -41430 -42023 -49200 -36925 -19745 18841 9374 -18485 19755 21375 -26762 -46694 -44123 -41150
17516 -41150 27904 66617 41804 14728 -32293 -64215 -72545 -85963 -76899 -44303 -15785 11909
17504 11909 -13538 -82153 -123619 -115505 -125214 -112696 -51590 -54708 -96409 -96794 -76466 -62516 -22784
17491 -22784 17050 6723 -23812 -55532 -51068 -78092 -64600 -72098 -31944 13502 18448 -27460
17479 -27460 -30422 -32728 -10215 -8941 -23526 -7721 16572 32461 10090 -7521 21 7610 32287
17466 32287 40067 58690 67925 20898 -7242 820 25422 40751 37070 28358 62343 49711 -4826
17453 -4826 34516 61177 37812 70855 86481 62752 68581 85213 124726 197575 246749 318306
17441 318306 420540 461095 319270 146936 64779 79562 77285 50642 40975 40434 24064 31800
17429 31800 39322 53483 63734 88625 143524 146987 82468 23069 6257 23573 34224 50032
17417 50032 60195 58367 40111 28 -31052 -74117 -74603 -49918 -54703 -54391 -66991 -54935 -12475
17404 -12475 -13546 -4212 -44390 -49743 -33837 -21370 -29845 -24320 -8677 18401 19878 -32651 -29568
17391 -29568 -3437 23004 16040 16644 -20656 -41301 -52197 -39058 -23930 4851 11872 7635 41661
17378 41661 32850 32866 53654 47767 5861 -11679 1187 5598 -1746 -57419 -57432 -5497 31211 -9402
17364 -9402 -55216 -66706 -70033 -72725 -62366 -59013 -28549 22561 73111 18742 -22008 20721
17352 20721 30285 29891 43614 30870 -18419 -24836 -43757 -51887 -56183 -43508 -16422 7523 -15918
17339 -15918 -4130 -34636 -42320 4399 28765 17135 26832 36972 56387 69858 92852 77911
17327 77911 25628 -33287 -33615 -21275 -19916 21841 16678 24988 15952 -9771 -57508 -70035 -31207
17314 -31207 37481 59711 55245 76914 55676 18724 -28835 -41478 -45428 -45322 -47775 -25398 -51261
17301 -51261 -10677 40501 53107 40014 39615 2613 -58701 -45634 -35009 -66309 -72349 5466
17289 5466 41969 50834 46974 49632 94735 95879 73729 113047 100341 97633 123696 124816 99513
17276 99513 70792 83084 94355 52479 21560 19880 -2993 -11235 -14594 2045 34420 82253
17264 82253 95745 38853 2992 21529 22880 57884 50139 7899 -8524 1910 -8131 -36073
17252 -36073 -30688 -19540 -31538 -43018 -2702 39700 70930 59306 6645 50446 64107 58102
17240 58102 97820 106241 93141 95940 97548 96712 133464 166570 171376 175880 206164 189547 171169
17227 171169 177725 138220 96583 86456 96464 127067 135930 140539 143401 143464 164454 173065 154997
17214 154997 170194 218092 251953 266157 231922 193137 231262 266790 298710 274021 281576 343200
17202 343200 379217 383964 407002 447412 471719 521620 584576 650517 714894 803391 930853
17191 930853 996749 1065849 1114406 1208780 1341220 1468684 1576286 1753685 2029748 2351118
17181 2351118 2776063 3290047 3904543 4708279 5743401 7057581 8797624 11183289 14496931
17172 14496931 19028774 24837103 31729997 39701241 49189499 56794506 51283029 35851186
17164 35851186 23956800 17551928 14563581 13581974 13941146 15428320 18224148 22444192
17156 22444192 27953350 34458909 42171247 51115963 54934338 44042588 28390439 17877440
17148 17877440 11937109 8526244 6471545 5118277 4206909 3505886 3007187 2669004 2396508
17139 2396508 2206444 2027185 1873559 1715873 1474614 1257512 1118615 994552 879885
17130 879885 788379 769688 716965 664720 703587 692884 618000 561126 491013 488284 453858 374344
17118 374344 328289 285817 255760 231630 241837 246188 252217 281084 272162 236527 211485 216978
17106 216978 164758 89094 66791 71069 75156 102244 139771 170315 164599 159696 158757 178368 163462
17093 163462 116264 124150 142852 119530 81336 83487 119462 172322 193002 188721 128647 95588
17081 95588 89338 95722 102142 77658 65377 59660 85817 123309 109726 97600 142584 124435
17069 124435 86589 55427 34110 -31146 -48386 -20452 21576 24914 39158 54290 91164 127338
17057 127338 129709 128557 95376 46724 23793 29299 11163 34668 52978 27363 26431 61112
17045 61112 59353 77406 104898 86108 28747 -8333 -6265 7591 32339 49532 64731 49535
17033 49535 15422 -3994 22949 76953 124077 116721 80156 84675 76131 77501 74176 51687 51402
17020 51402 68128 83186 126045 152850 184056 173711 175790 148940 106139 108744 63456 66886
17008 66886 72554 43357 20215 63854 89965 73698 40762 65996 74351 68820 63751 58190 59999
16995 59999 61228 81872 43557 20551 8920 13789 -32389 -19608 -188 -34474 -42903 -10729
16983 -10729 -19801 -2869 21945 -8529 -40969 -62912 -57585 -40305 -21144 543 -6172 -13301
16971 -13301 -30565 -86561 -113543 -92727 -15572 -16423 -40586 5886 18567 13933 30235 2229
16959 2229 -10138 -12901 -37374 -49185 -50203 -49607 -61294 -77546 -86558 -63717 -65441 -76102 -68316
16946 -68316 -50624 -50216 -44099 -25047 -1103 -13391 -56289 -54949 -40137 -1603 -16679 -37622
16934 -37622 -37924 -7876 23273 5822 5511 20920 36744 36392 -9616 -50770 -72543 -86826 -54464
16921 -54464 -43492 -68067 -24055 14576 -2831 14743 27423 26844 5135 -47787 -43990 -29386
16909 -29386 7395 44469 51168 38986 13242 25376 -2592 -19836 -41607 2230 204 -12130
16897 -12130 -10483 4068 -2007 15398 41904 43772 6694 -153 40743 19383 3468 8621 -303
16884 -303 -21353 -4111 28668 33195 17602 32177 21277 49493 22991 -27043 -22418 -63835
16872 -63835 -69425 -78650 -56916 -60136 -34783 -45973 -55647 -87616 -34983 20487 48509 3872
16860 3872 1120 -7609 -33819 -88440 -76968 -61975 -39129 -18819 31989 14643 -14519 -7665
16848 -7665 1762 -16729 11535 33312 18838 12769 -4743 -50831 -41202 17566 33374 8476
16836 8476 -12892 3782 9687 -27500 -51638 -42650 23109 18145 16564 -4209 39971 26760 -16289
16823 -16289 -18992 25410 31780 146 -45092 -65778 -70856 -24585 -14740 -18695 -35655 4132 32083
16810 32083 -22052 -44850 -25689 -22459 -31515 14128 33538 55318 79280 89150 73739 13823
16798 13823 -36000 -39891 -33948 -35063 -18654 41604 47988 18611 42416 91555 96724 62445 21040
16785 21040 -24667 -61040 -46439 -56935 -45975 -4018 -14347 -63470 -73331 -57211 -6900 19449
16773 19449 -3441 -16855 -33817 -28276 -64425 -125957 -138194 -73752 -70944 -26250 -14919 -15108
16761 -15108 -25275 -42408 -24287 -29150 -32553 -54559 -87552 -81903 -49371 -33723 -30282 -50207
16749 -50207 -47148 -49409 -67168 -62504 -39279 -39149 -57575 -55480 -18924 -14662 18044 12108 -2106
16736 -2106 9494 -35321 -39271 -2730 -11631 -43927 -32718 -12663 -4881 -56110 -81658 -37433
16724 -37433 -29288 -27109 -48108 -27313 3482 53943 69038 35122 7106 37419 52931 27356
16712 27356 29485 7559 -6515 -12785 -6268 38189 26812 -27563 -8346 -24714 -57330 -31084
16700 -31084 -22541 -22285 -26839 -26004 -22754 -71673 -98631 -82841 -76360 -46818 -65377 -61872 -20487
16687 -20487 15519 18416 1585 -64906 -55369 -77598 -58387 -17947 -8084 31500 21777 -34876
16675 -34876 -21812 -1550 -3926 304 -31448 -102601 -138739 -125630 -86522 -77076 -70391 -63263 -54297
16662 -54297 -30600 -7624 33192 64736 56246 4835 -20529 -17708 1896 -18816 -49432 -46530
16650 -46530 -27670 -41440 15548 22164 631 -15605 -35176 -68110 -50030 21752 18778 -22855
16638 -22855 -38478 -37782 -7500 13574 1522 -14800 -12471 17127 33981 18266 1619 -21311
16626 -21311 -47272 -31289 11356 10446 19698 50784 67847 63450 54909 48134 49184 24255 29441
16613 29441 56558 90818 110595 156084 197826 230528 262966 288255 226739 135820 119910 112583
16601 112583 101934 112091 75176 95911 131622 133355 201794 266342 291976 271346 181692 134490
16589 134490 61859 -7460 -28788 -76346 -108721 -111119 -65692 -31402 -56946 -75510 -56267 -38257
16577 -38257 -33117 -84084 -91671 -54716 -51169 -69572 -31970 15819 40136 2764 -30083 -31761
16565 -31761 -35204 -29924 -25340 -16494 -10442 3166 -30001 -16624 -8647 -5362 -41645 -86377 -68953
16552 -68953 -85883 -58577 -65301 -47215 11208 5961 -2339 19735 46900 38426 12236 32674
16540 32674 45923 39925 7059 -35245 -32487 -27147 8722 31127 44542 32598 16482 -15962
16528 -15962 -14493 -22161 -39744 -96 -891 -23100 -28460 -33621 -60541 -51259 -6961 12474 20185
16515 20185 17874 6474 -26384 -41727 -47620 -83165 -72368 -43450 -62313 -53850 -42910 -34960
16503 -34960 10348 29090 -10019 -18211 -13715 -35526 -9688 21721 -15645 -5418 29160 -180
16491 -180 -35932 -52334 -25835 -60373 -60915 -31848 3599 39354 44755 27913 -16738 9334 -1258
16478 -1258 -9357 -14552 -20423 -51490 -72984 -70257 -47865 -82981 -132714 -90929 -80806 -68001 -56402
16465 -56402 -9117 -13295 21597 36182 -6165 -24306 -34546 -60281 -55748 -41335 -47326 -64811
16453 -64811 -38512 -20740 -47086 -92869 -64408 -41980 -248 38271 62327 51842 69012 61998
16441 61998 54349 47436 12700 21734 24901 -6207 -4110 -17266 -17790 3294 -9479 -46587 -42817
16428 -42817 -67985 -83806 -45267 -33292 -38493 -30323 -83696 -120336 -77321 -34231 -31306 -54771
16416 -54771 -28669 5529 -43465 -80964 -45220 -4411 1496 54844 55587 5522 -2113 -61350
16404 -61350 -62506 -49496 -36570 -32276 -44475 -21769 -5874 19161 28850 -33294 -29692 -32528 -15920
16391 -15920 9425 33843 23964 28586 44436 34943 33585 60070 23030 8713 4768 -28298 -19411
16378 -19411 -25657 -42845 -17914 -20794 -28658 -53455 -36135 -22218 -63935 -112341 -78715 -15542
16366 -15542 -32201 -90371 -126744 -100836 -43616 -26118 -9387 -2274 8076 -2495 -70081 -76379
16354 -76379 -52409 7228 -27566 -38724 -34481 -28230 34584 47935 36992 38233 28982 23757 18651
16341 18651 -6523 -45733 -63834 -64604 -58476 -36310 23856 -5082 -1975 32675 56531 -4762
16329 -4762 -35464 -48118 -9328 -6444 -43305 -64015 -72687 -66969 -15678 -11628 -75224 -121823 -91659
16316 -91659 -97751 -92957 -33462 -10716 -20033 -15138 -60922 -70790 -70116 -49691 -38005 -56200 -90630
16303 -90630 -69918 -71249 -71563 -71109 -59792 -6562 -54202 -72045 -43886 -33650 -39968 -68884 -75671
16290 -75671 -71039 -70062 -43014 -25525 -19591 170 60671 73988 42063 13403 -13754 -19108 -25707
16277 -25707 -60402 -49918 -43204 -20376 33877 31624 913 -10073 -58749 -98602 -103651 -72391
16265 -72391 -39607 -45087 -1938 35423 7019 -25249 -32716 15025 8094 37482 56653 5962
16253 5962 -22097 320 14227 -11771 -18192 -3895 60629 82120 45947 5202 42521 40657
16241 40657 -439 -25693 12392 24400 -37810 -84601 -71710 -108787 -106625 -62936 -62380 -61475 -19275
16228 -19275 -24635 -33553 -20622 -8672 -8616 12179 42260 31322 254 -16685 -260 15990 -7421
16215 -7421 5738 62686 61763 24579 19462 -1386 -12824 5933 -2242 3303 14924 48584 34531
16202 34531 38141 40948 29177 14440 -5010 6058 -33873 -41330 17419 54263 1392 5031
16190 5031 53555 26018 -9193 -42296 -64569 -26356 -11247 -5342 16192 20506 3315 -41132
16178 -41132 -40990 -35895 -61107 -72598 -74060 -72121 -11792 58830 68146 38368 -13703 -20303 -23968
16165 -23968 -31823 24021 9974 -25783 -37068 11926 -33308 -22593 4519 2674 -4974 -24519
16153 -24519 4996 17110 51598 20700 -60696 -72746 -97935 -118696 -116214 -72511 -31076 1338
16141 1338 37641 14665 -21810 -35299 -9530 -15531 -39924 -2059 1799 2388 31726 58775 73911
16128 73911 95761 76775 52101 35369 26680 19115 16414 -25384 -33186 21252 -9536 -36462
16116 -36462 -30562 -19102 -10406 -22387 -63841 -105480 -77956 -36252 -17129 -24366 6372 -508
16104 -508 -47470 -87802 -106104 -90905 -71789 -49839 -72353 -72623 -54697 -37215 -43167 -64192 -93757
16091 -93757 -121550 -90238 -66973 -62815 -44805 -44474 -54640 -60892 -23414 -3265 -10974 -43246 -43303
16078 -43303 -28114 7195 38794 56193 12990 -44682 -59938 -63102 -66485 -73091 -67005 -72961 -125140
16065 -125140 -131111 -80185 -84770 -70834 -36764 -46930 -58530 -43258 -22550 -1565 -19782 -6254
16053 -6254 39000 16757 -38218 -57666 -33270 -38673 3699 15571 10930 -8802 25015 39727
16041 39727 24650 10284 17329 41737 -4578 -32240 -41267 -53867 -37081 -45719 -55470 -72475
16029 -72475 -58351 -31827 -20487 6391 43647 50819 -12705 -67300 -73750 -18926 -25260 -41361
16017 -41361 -41736 5096 10604 -35225 -30645 -43165 -70760 -35951 -19204 -36765 -46955 -73563
16005 -73563 -14412 5627 -22234 -6397 30495 40627 37099 31422 14036 -24404 -41679 -44122
15993 -44122 -58313 -45954 -34253 -63950 -80530 -53666 -73478 -38087 -1101 643 -3915 -12697
15981 -12697 -41405 -69949 -65975 -19296 -41197 -57269 -6944 17390 35922 37897 -4520 -25671
15969 -25671 -60432 -87684 -49424 -26898 -26317 -26468 -61196 -63121 -57260 -59786 -45120 -61817 -96963
15956 -96963 -65897 -19624 12221 45567 59781 66385 40213 9204 -13993 7716 24759 31172
15944 31172 -19048 -98910 -80089 -65794 -58041 -55124 -56436 -86864 -75964 -27102 -16611 -26986
15932 -26986 9132 3253 20781 60846 67838 15755 -36814 -16045 -8800 -18844 -56334 -10454
15920 -10454 17951 17548 21027 -41375 -39601 -6728 -17934 -55390 -59038 -54772 -75214 -56168 -36537
15907 -36537 -60663 -50598 -72154 -84946 -94169 -104540 -101914 -78697 -10510 -9870 30452 72182
15895 72182 38195 12420 14746 51185 921 -30524 1207 68033 90592 77399 -21103 -29041
15883 -29041 5359 -214 -31014 -32602 -36823 -1105 -2813 -4800 -24253 -67723 -81498 -57920 -58350
15870 -58350 -73064 -40624 -56935 -45826 -23825 -29069 -22158 4209 37939 77597 44000 38023
15858 38023 61081 92696 72861 61084 79341 83714 12473 817 7466 4024 36449 44441
15846 44441 55425 32043 32109 23695 -7676 -21401 -13820 -3256 -42410 -14391 53580 78596 36249
15833 36249 14357 40483 23543 -26268 -54325 -72328 -86513 -74749 -63842 -24501 2753 -8035
15821 -8035 -3303 14876 16700 5570 -28600 -48882 -30769 -40024 -6591 47425 50102 19420 -9128
15808 -9128 -13584 -20647 1782 9650 29663 29745 51165 65698 64551 69117 92713 104780 64141
15795 64141 26207 -17180 -8350 -24924 -52332 -35559 37117 51305 39888 24514 33088 62225
15783 62225 40070 -2916 -6852 -24943 -61884 -29305 -8093 -17022 -27570 -39718 -71046 -99240
15771 -99240 -55454 -21949 -6318 11089 -8119 -28851 -2158 12274 16719 -20412 -27034 -31600
15759 -31600 -37586 -25486 -18569 -33517 -9332 22180 57075 51963 65807 59228 31897 2017
15747 2017 -17532 -7542 -14013 -26366 -12075 -54813 -92811 -74597 -42690 -15532 -12742 17313
15735 17313 37177 1575 8507 5294 10419 -3656 -11999 5827 -24564 -18752 -29693 -35289 -11700
15722 -11700 -33695 -44271 -50160 -80630 -92232 -96791 -54090 -40286 -15886 631 4703 -9627
15710 -9627 8581 945 -79510 -78945 -22349 -12760 909 -2532 -24299 -35728 -24714 -31132 -8369
15697 -8369 28450 -16449 -66064 -76257 -99336 -137577 -105419 -102808 -89764 -75514 -41813 -49590
15685 -49590 -63863 -29234 5519 32855 7660 -16934 -33226 -109151 -117799 -63525 -53378 -27569
15673 -27569 -12975 -25233 -28431 -42643 2624 -1776 -29834 -55460 -12687 27193 25387 2388
15661 2388 -25101 -38779 -36742 -47783 -65638 -64075 -40438 -28258 29560 74013 100993 92331
15649 92331 36494 48748 34842 6131 14641 50935 73268 62854 39745 12389 34717 44166
15637 44166 63335 45203 16046 4634 -9378 19677 31102 -32474 -79511 -107885 -36799 -25385
15625 -25385 -40715 -84728 -65465 -64403 -67789 -84012 -49372 -4870 39426 29972 -14904 -4605
15613 -4605 8230 23558 -1539 -23517 1391 9498 -60884 -15655 11364 23920 3110 437
15601 437 49621 53863 18432 24994 -11206 -19961 -54204 -49239 -13471 -28862 -10863 -7199 -13342
15588 -13342 40374 41159 46356 71242 42531 4541 6252 13582 -38438 -63240 -71467 -62915 -60335
15575 -60335 -41543 -35366 -39290 -28123 -33913 -25910 -19698 -40349 -30258 -19900 -68144 -50782 -53606
15562 -53606 -51028 -43789 -9306 -8015 -36388 -12407 8357 32645 -2330 -30737 -31484 -79469 -64850
15549 -64850 -14115 14417 22833 8217 -17166 -52742 -68548 -44922 -54556 -106874 -146024 -102180
15537 -102180 -61734 -47924 -20989 -16039 21548 18984 3691 -1388 -10664 -69115 -96308 -81183
15525 -81183 -64447 -43276 -24384 -36248 -39082 -48312 -58144 -85682 -74724 -47928 6585 34279
15513 34279 15298 1041 -37139 -54532 -7366 22482 29565 16067 -40707 -58153 703 61280
15501 61280 90834 68810 28617 28362 28459 11631 34476 52096 46086 -18727 -53961 -47696 -43817
15488 -43817 29932 59456 47156 46400 43398 70903 102717 69285 52087 40694 29033 -21991
15476 -21991 -40409 -16673 -821 -50821 -48853 -71519 -26481 2723 14744 -11188 -45412 -19664
15464 -19664 -31013 -57691 -18198 -16382 -14924 20152 58310 77106 40892 -4633 -8281 -21713
15452 -21713 -7386 -47852 -53237 -34342 -45808 -56997 -7186 -6039 -10128 4021 -20813 -37647
15440 -37647 -5725 14243 17086 -21314 -33760 -39161 -28369 -19010 -32090 13773 66535 93562
15428 93562 75780 41109 32642 65702 110266 120802 122384 87227 69383 52476 55050 28893
15416 28893 -5696 -24913 15070 61061 60459 58880 53291 19222 5247 17312 54753 40245
15404 40245 -8810 -65727 -83966 -5994 51517 93864 122352 110242 78214 80013 24135 -30634
15392 -30634 -15730 -10333 22467 -1023 -17578 -38435 -14532 -13947 -3217 6119 7078 32348 23302
15379 23302 9499 -21794 -59234 -52764 -44571 -59617 -63782 -21259 -27525 -30207 -44711 -42153 -62990
15366 -62990 -69480 -64774 -50280 -30805 -43067 -27619 -13417 -30197 -45262 -71591 -61664 -3580
15354 -3580 12562 34318 1375 -27842 -34229 4186 42165 35854 -1337 -19988 16860 51066
15342 51066 21075 -372 24736 20276 43877 53361 62156 47738 -10593 -16732 514 -17010
15330 -17010 -24980 -1058 -14528 -23381 -1042 27667 30496 21612 235 21236 27590 13806 -6044
15317 -6044 -8113 -3958 -29818 -23335 12855 36747 -9357 -36871 -22672 -1755 8293 21260
15305 21260 30611 -16654 -34576 -629 6768 8442 -26165 -58691 -38968 -36852 -16095 26788
15293 26788 55499 47622 53864 10608 -1089 -6759 -19596 -31743 -4946 17935 19918 2171
15281 2171 -2517 10445 64011 67553 44417 39138 39362 45666 12885 19476 61065 42261 10252
15268 10252 14238 2321 19165 14602 2325 51975 28306 -42019 -65661 -57951 -36992 -2667
15256 -2667 -14730 -71378 -83629 -91523 -59399 -12316 -23273 -60154 -85187 -110778 -82893 -17203
15244 -17203 7225 -30818 -50834 -32590 7430 -4429 -19563 -21483 22628 50297 48178 2017
15232 2017 -34633 -44564 176 15285 10913 9362 335 3014 17252 20276 4825 -44890 -77791
15219 -77791 -38011 29388 30694 4745 -19931 18258 54488 46752 7292 -38966 -25155 1730
15207 1730 -14423 -18380 -65768 -97493 -147262 -124347 -78601 -42180 -11004 3496 13992 1099
15195 1099 10379 2343 14598 -11339 -28793 -40288 -41840 -61509 -57531 -35448 -42287 -25646 -35795
15182 -35795 -53979 -75723 -69227 -41562 -18078 -22094 -36308 -94190 -87825 -77966 -49990 -56451 -67536
15169 -67536 -57688 -81946 -42197 -6632 -7502 -27781 -5674 16105 5861 22545 -6699 -27451
15157 -27451 -18334 -37935 -13209 2849 11056 271 1725 -11034 31776 74371 74747 33475 2458
15144 2458 -14423 -9491 -12002 -51600 -38943 1447 -11660 -22163 -26925 -23594 -6915 -16503 5362
15131 5362 28317 14818 28213 1528 -62916 -54277 -15398 -24140 -45085 -18318 27373 32160
15119 32160 9005 -2263 -3389 7495 23173 -7338 -35072 -13226 -52410 -39213 -22870 -51373
15107 -51373 -25572 -22235 18630 28240 59868 -27951 -40949 -39754 -10250 -50585 -113531 -89185
15095 -89185 -28211 -18127 -4919 78556 62675 16881 -5006 -62220 -109698 -102224 -48106 -69776
15083 -69776 -77625 -48755 -48776 -73946 -47454 -2940 14515 18365 64602 44145 48871 83695 52282
15070 52282 46223 22619 -12880 -45893 -60530 -11240 -21635 -83436 -107190 -99177 -67952 -70355
15058 -70355 -44223 -36106 -34997 -17997 -6204 -26761 -29712 -14419 33182 92019 70172 36579
15046 36579 4009 5617 48515 49856 13084 -14384 -27564 -5017 -52065 -103893 -72906 -5665
15034 -5665 29401 4595 -26331 -17690 -21360 -1143 15376 14311 53275 57578 -340 22301 -4682
15021 -4682 -39678 -16088 -1069 8666 16962 -1914 4442 -11980 -40054 -11377 36040 23088
15009 23088 -15612 -14232 26407 925 3332 44626 71905 68957 26538 -60629 -56875 -35754
14997 -35754 -49499 -23659 -62540 -83863 -52074 235 26697 25752 5509 15674 86 -41578
14985 -41578 -55397 -65892 -37564 -24529 -23129 -42878 -13031 2381 -5003 -10739 -33925 -20409
14973 -20409 -9149 -62973 -75112 -45022 -13740 -30962 -18159 17984 37705 15897 -38701 -47598
14961 -47598 -27855 -8823 -22637 -42290 -74313 -83518 -57885 -47908 20332 41467 75703 111043
14949 111043 94936 67660 97604 95925 74385 80929 26589 6233 4573 -2220 23131 52944
14937 52944 58451 4495 10167 42540 29512 39189 43827 701 9049 33763 24659 -14450 -41317
14924 -41317 -24237 -62108 -27016 19134 24943 -2803 -15273 -10963 -43 -33089 -73145 -86274
14912 -86274 -70746 -54132 -15473 9838 62660 33364 15153 -1692 9514 58327 66320 56186
14900 56186 28063 -20224 -42282 -25620 23368 51466 26371 31717 52491 76516 57435 46936
14888 46936 -1409 -22199 20321 42380 -4236 29843 70748 85014 19605 25890 27611 5771
14876 5771 -14015 3095 -3897 2846 12831 16510 14181 -28908 -28989 -7328 -25306 -19719 -27763 -26998
14862 -26998 -5711 18541 16384 -3078 -24764 -34298 -34594 -13717 18285 4607 -6238 14468
14850 14468 21956 50661 21480 -3908 -16116 6403 32644 27830 23810 20243 16022 -19796 -29531
14837 -29531 -26618 -19861 -39733 -78646 -63829 -17550 -10852 -5745 10614 2701 -37558 -27464 -13876
14824 -13876 -15640 -32244 -4975 8541 -22341 7249 555 -13065 -23000 -10298 -8503 -5071 -14387
14811 -14387 -11734 37092 58038 23987 47686 57613 21820 -43060 -18509 -15690 -40423 -66711
14799 -66711 -50404 -34928 -31642 -67159 -76349 -27529 -10201 6212 42608 43948 37528 3784
14787 3784 -31932 -12284 17586 24891 25574 6520 -33316 -45259 -35580 -72296 -84757 -64310 -56567
14774 -56567 -86916 -63241 -45725 -39501 -20899 2415 -11654 -24829 -28054 -22542 -34065 -31317
14762 -31317 -15167 -69117 -84047 -82517 -44754 -32516 -59684 -108876 -117087 -76795 -29580 -37073
14750 -37073 -25199 12703 27222 4970 3795 -14363 -27814 -60871 -30344 -28356 -47569 -69311
14738 -69311 -41361 26570 27581 14429 16662 47511 71030 46302 35487 3099 3891 19149
14726 19149 25621 28843 28001 -7601 -32158 -5546 1356 -18060 -62461 -43105 2786 12902 36330
14713 36330 27371 17745 19029 24893 30722 46349 34838 -10124 -19604 -1177 -7307 -14500 -26978
14700 -26978 -725 20930 18002 3429 2421 5953 56349 30277 23637 -2087 12988 10544 15372
14687 15372 24461 55454 54648 41160 38183 49693 28333 -20193 1559 -527 29411 73874 96219
14674 96219 80872 34881 13464 51163 67229 44216 4476 16167 13601 -27612 -53089 -40128
14662 -40128 -16413 -3417 14077 15747 58714 80325 57180 66430 36993 38129 43597 35644 2196
14649 2196 -63772 -19728 11207 19953 37432 19059 6960 -40505 -33042 -2893 15474 27922
14637 27922 54177 23569 35251 14612 40375 40582 33452 4761 38896 19495 7992 34872
14625 34872 49701 52887 71665 71517 45812 2945 14385 9837 17811 -21050 -12613 15746 5413
14612 5413 11196 6683 33631 43871 27411 9146 15221 -23181 -20205 15061 37898 23321 -12367
14599 -12367 -44297 -43742 -56342 -62517 3011 14365 9755 24769 50700 48012 46771 -1010 -22066
14586 -22066 9037 19187 -25996 -23095 -16941 37332 44583 74943 98533 78247 15477 27469
14574 27469 45727 13799 4949 -18816 -29485 -13478 -5429 -33325 -76583 -88969 -47966 -48504
14562 -48504 8736 44128 -1874 -57505 -42770 -29852 -8740 9981 13244 2130 -23090 -28359
14550 -28359 -38627 -39676 -27308 -63642 -34500 2117 16092 -40938 -109388 -116357 -89966 -65020
14538 -65020 -1894 53011 76012 49506 43641 55843 80561 65960 31740 40544 32392 -29916
14526 -29916 -36174 44503 94309 80150 25568 -8401 -47540 -42885 -23163 -20425 -5671 -1747
14514 -1747 -19208 1942 3391 3233 19318 15426 17767 -15352 -9508 -523 22166 44641 10089
14501 10089 5335 -33360 -43177 -34080 26475 28313 -7723 -61912 -17962 29848 -28178 -35212 -21702
14488 -21702 -16334 -8317 -11121 -44742 -28269 -6606 -18938 12182 17901 6633 153 -28560 -26071
14475 -26071 -18643 29534 78817 50373 42359 37314 -1599 25156 4420 -40251 -23051 -878
14463 -878 30864 44819 48053 33929 6648 -5329 8425 -25370 -53147 -69123 -62194 -15051
14451 -15051 3568 -4241 -1480 6258 30933 56772 64591 49282 -10607 -21888 -34981 -46919
14439 -46919 -46078 -50468 -9829 -8270 -518 -12538 -1374 -17137 -38175 -51053 -32827 -30201 -39954
14426 -39954 -10231 -12682 -31766 -14523 47139 34053 -7855 -16639 -25756 -40440 -29973 -18933
14414 -18933 4490 30669 24161 -986 4663 22586 45996 67520 97323 126668 87398 57613
14402 57613 31036 21148 46761 46982 46371 14746 -6652 -6529 -9040 -14599 141 -28645 -67156
14389 -67156 -84332 -49962 -15606 -13563 17196 39556 66792 99937 79702 43949 25859 58157
14377 58157 65689 54650 83337 39275 -6328 -26335 -12879 -12117 -19116 -21224 19528 7406 -25651
14364 -25651 -55095 -66757 -26825 -44330 -76549 -62150 -33162 -22418 -5203 -35385 -45992 -20681
14352 -20681 -23213 -33491 -838 7190 -38302 -38516 10590 58053 64390 66858 41969 30845 23777
14339 23777 45292 44911 -14914 -25715 -11778 34279 34442 27836 16264 7685 -5045 -34965 -22068
14326 -22068 -50798 -40111 -22483 -57345 -92570 -76134 -38589 -29002 -47928 -54289 -12356 18214
14314 18214 -10405 -68888 -65609 -69227 -76176 -32902 5160 -28112 -52481 -36136 9975 2063
14302 2063 6351 26620 19606 8204 3230 -10910 -29250 7270 -14148 -33301 -47711 -42128 -3611
14289 -3611 36247 21525 51188 57264 60705 -8573 2127 27541 18814 16021 16129 -8401 23594
14276 23594 54602 64807 70342 55408 1774 25175 32866 -19911 -45200 -42736 95 -15201
14264 -15201 -45941 -36247 -4845 875 58254 97367 55454 58940 58668 -9618 -36993 -35427 -68929
14251 -68929 -53872 2491 45444 -16305 -40475 -6998 -17756 -20229 -39589 -10224 -1876 16861
14239 16861 -5261 -13983 -8359 -28087 -24790 -31684 634 -14539 -39230 -19932 -22166 -12243 -187
14226 -187 -773 17425 9657 -58512 -83081 -75800 -69751 -69900 -44929 -31351 10094 58001 64235 -7593
14212 -7593 -72764 -86202 -43592 -32883 -39510 -72245 -103372 -85642 -69236 -56309 -74956 -58996
14200 -58996 -52521 -68441 -50356 -34776 -47010 -90378 -125421 -142917 -126310 -91882 -19466 -9556
14188 -9556 -32040 -38903 -15822 -9525 -7486 -1575 9514 -4937 -5626 -21023 -52612 -47738 -27913
14175 -27913 -22770 -54385 -34731 -27013 -31696 -38386 -47322 -32327 -41939 -25720 -23418 -13464 19157
14162 19157 -2428 -6505 24142 47149 60412 45744 42615 17634 -43430 -42396 -58407 -56232
14150 -56232 -59068 -64401 -21787 48486 70597 72108 96409 148643 130521 94432 111352 110819 54580
14137 54580 -6402 18643 72202 82764 35825 5877 -29966 -28308 8632 -41649 -7845 28580
14125 28580 34166 31384 56907 67626 62996 89156 81800 65718 52246 29589 -21435 -39093
14113 -39093 -47953 545 4233 -1150 -14587 -21060 7594 32998 11783 5088 -43874 -61385 -53984
14100 -53984 -45798 -42650 -49413 -16162 6405 -22856 -47346 -70431 -59065 -3820 30359 50396
14088 50396 17662 27782 48231 18856 -15576 -35467 -21777 -53061 -42846 959 -9202 -31618
14076 -31618 -29948 -32214 -45916 -55598 -84022 -81947 -60653 -4761 8318 3512 -14739 -56499 -35826
14063 -35826 14752 -6857 -12636 -32752 -37717 -15470 -1134 20985 40565 10807 35647 31063
14051 31063 -8877 8747 18193 -24719 -13268 38827 117273 93810 69612 49625 55414 55033
14039 55033 34905 12243 -33807 -35356 -45602 -72976 -88080 -50325 -28715 -30697 -14074 3694
14027 3694 400 14946 65459 81967 60390 57347 52019 14538 -15690 -47519 -65675 -20492
14015 -20492 20622 -15027 25267 52983 16236 -6064 18232 -1478 -4047 23543 -3597 6701
14003 6701 -2773 -23850 -60215 -44417 4231 12611 -2011 -686 -3487 -22894 -25372 -9266 13014
13990 13014 7507 1987 18940 -15975 -61036 -35696 -38793 -39515 -23813 -9714 -24999 -13914 6125
13977 6125 -4459 -29447 -30120 2197 15828 23878 40241 27734 -1422 -19678 -45280 -47710 -27260
13964 -27260 -24357 -6166 -29959 -44258 -39080 -7238 19965 9920 40131 65209 54216 29155
13952 29155 50803 67136 37107 11562 -13827 -38146 -22000 -45473 -54176 -38755 -32235 12929
13940 12929 26527 32795 3779 8142 56493 34194 -7842 -17930 -6393 8883 18098 63723
13928 63723 71435 51937 69053 29345 14805 31012 56768 92445 68809 33084 31460 44332
13916 44332 39146 15858 18293 29455 15475 46975 77971 99071 106663 51815 -10270 -21169
13904 -21169 -7519 -30639 -44592 -53275 -31615 -22852 -39521 7685 68908 54924 977 -11587
13892 -11587 -22733 -1928 4290 33550 47914 14556 -8091 -4176 -47025 -65410 -66329 -64473 -40077
13879 -40077 -37949 -28659 -20833 -52978 -60833 -41368 -33891 -14137 9419 -25406 -81614 -33431 -18980
13866 -18980 -11256 -28781 -43227 -63710 -59343 4544 60037 80447 26315 -22097 -28094 -14040
13854 -14040 14722 13530 12767 9767 54255 37345 15805 15238 3529 16663 -11021 -41005 -64538
13841 -64538 -22018 9442 16887 -10366 -8816 -9020 -37110 -52399 -26042 -32196 -22416 9661 59007
13828 59007 96142 65625 35240 19218 17318 29864 63396 54947 34048 39229 28496 18168
13816 18168 44463 36200 75473 68035 -17486 -15660 16913 3285 8682 25937 61620 31348
13804 31348 48032 42205 37793 39069 24853 16222 41308 77085 64410 22710 -12878 7667
13792 7667 -24097 -42915 -71655 -79515 -60472 -42829 -54212 -38570 -25800 -20530 -43303 -45686
13780 -45686 -56849 21094 16058 -25301 -54516 -19556 9219 -6115 -61865 -67156 -47363 -1727
13768 -1727 37733 -6768 -64698 -26306 -13998 -34552 -38452 -12653 -560 4296 -8578 -22404
13756 -22404 -28184 -60757 -39628 30078 25641 14977 19277 4702 -2240 48756 64367 30735
13744 30735 42708 -28901 -50424 -20981 -61423 -46447 -51 11000 2653 23938 6980 36137
13732 36137 61840 59425 39414 9624 -46157 -50857 -16577 17821 27661 26427 21766 -2389 -9055
13719 -9055 25066 34628 32281 53247 54174 38219 17014 32102 84254 88666 65410 30847 39895
13706 39895 34823 -11129 -29635 -29476 -58828 -64950 -16536 31916 35857 29003 12528 -20843 -37989
13693 -37989 -42730 -18938 -23856 -37216 -68058 -48586 -62958 -90329 -82428 -68983 -11043 -18292
13681 -18292 -19558 -30756 -22501 -31358 -6048 38471 68545 29117 -19863 -14365 1944 39498
13669 39498 32793 14412 16677 11623 18737 24758 27322 23707 25862 -25326 -41197 -55697 -43673
13656 -43673 -2506 51134 52141 12123 -13969 7523 -2083 -24723 -25729 -14269 -26198 -51237
13644 -51237 -27899 -20637 -16942 -3955 -49108 -51916 -49385 -55491 -55209 -45498 -13211 39135 50151
13631 50151 16861 -6535 9914 21144 -18364 -35672 -35183 -54797 -51797 -58555 -18312 -34923
13619 -34923 -48404 -7256 -8709 3468 -1779 -7313 8890 28338 69818 45213 63732 51876
13607 51876 13613 -27923 -28504 1272 11894 -42390 -66818 -63104 -19168 -43048 -33883 -16482
13595 -16482 -13203 -17628 -26074 -9290 14069 17120 32444 69575 50979 21336 24443 9040 6985
13582 6985 37149 31969 28608 128 -41932 -50246 -47745 -51582 -40624 -38244 -33319 -76 43418
13569 43418 64731 39396 5216 -7069 -20661 -62618 -28624 -32473 -69488 -82705 -6528 39464
13557 39464 28405 -8666 -16542 -1821 -10429 -29304 -53965 -69804 -15582 53670 38791 36695
13545 36695 56579 70523 37894 -2596 -26748 4237 -29346 -53891 -40705 -24485 -957 -39068
13533 -39068 -83797 -69282 -22312 12721 17808 26581 -26007 -42190 -56995 -42406 -18191 -33951
13521 -33951 -39106 -32346 -46624 -28579 -89570 -124279 -90416 -99007 -91437 -59823 -53239 -66674 -33626
13508 -33626 -16583 1158 11737 2940 -2837 -25809 -10403 -19696 -12938 -22029 -44424 -28332 -36070
13495 -36070 -44180 -16212 -14061 -25021 -39742 -83362 -88682 -89291 -7806 2189 -37332 -11098 24925
13482 24925 41991 29742 10512 -15985 -46039 -30566 -9531 17116 34990 38551 18987 -30887
13470 -30887 -48153 -20266 -20762 6615 23587 50038 66148 48376 16813 25339 47834 86918
13458 86918 67888 57618 64425 60396 54507 40031 42809 13483 14610 -17494 -47883 -18206 -19026
13445 -19026 -25466 -12889 -30666 -27607 -24298 -11186 -15127 -1477 16704 1471 3428 -821 -20571
13432 -20571 -29887 -28928 -18231 20735 44390 20926 20491 14473 -36161 -66458 -71918 -23323 2521
13419 2521 -1041 6614 22720 -17028 -54468 -41775 -46435 -41309 -23734 -18736 -36989 -28450 -39649
13406 -39649 -38671 -16398 -10199 -33185 -36575 -65075 -54735 7631 36547 -3715 -30027 15763
13394 15763 68014 99000 125210 169041 230719 269136 296990 353263 407237 486171 631427
13383 631427 790911 942121 1108958 1286045 1358502 1293700 1102220 825339 565052 367549
13373 367549 267151 195804 120284 75489 100365 107086 160336 159185 81611 37827 2056 6620
13361 6620 12224 11801 20265 24520 8806 8921 -11326 -13687 32378 16013 17091 -782 -4376 -7494
13347 -7494 17136 27668 50580 54232 -112 -33302 -86988 -62319 7895 40721 25174 2513
13335 2513 -3748 16655 5397 22239 28975 26004 43656 47941 30746 8531 18863 49578 39299
13322 39299 44603 31521 41387 50477 67372 109135 83769 34787 18800 5894 14901 35415
13310 35415 -15159 -58083 -23139 25187 30481 52004 64857 42466 42301 55397 4232 -30213
13298 -30213 -1648 55115 13915 -38006 -18868 -35892 -18807 16374 56533 76420 56220 998
13286 998 -34635 -39544 -28216 -45367 -75493 -63131 -42096 -53851 -38881 2833 -8060 53886
13274 53886 100780 88950 73324 73258 104403 124997 90793 72892 38649 22775 11555 22754
13262 22754 50099 59453 62133 65067 50846 38528 79900 78031 40124 36952 68115 111105 76352
13249 76352 72244 107586 149049 127476 117945 84943 61379 59661 3075 -48438 -22176 7472
13237 7472 11355 -5663 -43756 -71289 -32001 14937 -20701 -35520 -33037 -51399 -64034 -47559
13225 -47559 -30188 -24893 -4921 -9129 -2613 21026 25324 15362 42077 81986 87311 58920 45324
13212 45324 93886 81808 62539 56872 70429 57923 68439 74835 96108 86595 108615 135873
13200 135873 106517 92587 105456 67911 52811 57084 97506 117428 124547 75150 53798 67871
13188 67871 42929 21982 38797 47755 60330 50180 47038 69896 82143 37425 38604 31338
13176 31338 51910 75621 49513 9020 52554 71281 75030 84812 86000 59263 41052 62281
13164 62281 78398 38937 32351 85436 89626 76393 68457 84112 78995 44324 34931 46912 59545
13151 59545 44902 26098 53768 14498 -8850 -22738 -50292 -24734 17126 35553 52243 23803
13139 23803 768 19744 34341 24796 2922 -6896 -22082 1167 13310 -4545 6215 46486
13127 46486 46336 48839 42156 54439 108342 82209 74882 72961 63316 45480 59463 87426 110540
13114 110540 63341 40560 58354 72566 43705 51038 24308 47777 45253 14514 26020 44800
13102 44800 46451 51871 59367 73262 85022 66167 43647 25215 2156 13826 4467 11461 46441
13089 46441 50748 37823 53630 70429 104834 126807 102686 77912 39471 -7499 -53551 -59342
13077 -59342 -79951 -117034 -108354 -73438 13353 153512 300704 394886 379864 308333 265914
13066 265914 257553 261180 196695 158652 192983 204782 197430 194816 178070 165675 152819 149830
13054 149830 172915 192458 178821 156182 110234 96042 123340 121092 95834 93007 127837 173323
13042 173323 195848 183720 183750 142481 107562 114266 199718 224533 229380 256287 281718 314819
13030 314819 315110 308468 270317 290872 288024 291806 303971 330265 296636 265474 280328 300240
13018 300240 332565 341581 305705 288645 257020 292211 329108 337813 358565 366078 376207 383878
13006 383878 373546 390782 405153 430787 458586 436538 423948 451965 453510 433381 453858 466060
12994 466060 489219 541966 596340 630683 689034 711003 686839 733117 809311 836636 876831
12983 876831 935366 971677 1034302 1097013 1178305 1229543 1276492 1355498 1423951 1516083 1610295
12972 1610295 1713946 1827942 1945379 2128324 2332425 2575730 2812695 3049271 3252575
12963 3252575 3553542 3946503 4352817 4792294 5338294 6039286 6850454 7866932 9144012
12954 9144012 10828907 13129213 16190837 20215250 25444526 32183411 40895568 52225024
12946 52225024 67402846 87793479 114364953 147162966 186361341 232164700 273288866
12939 273288866 280580948 254512837 200437265 134889757 88047599 60624489 44473320
12932 44473320 34302785 27301540 22074777 18043389 14929472 12550719 10769543 9346124
12924 9346124 8134522 7104964 6246971 5534320 4905795 4439251 4074269 3753459 3447067
12915 3447067 3191468 2968357 2751438 2583366 2418549 2288518 2226648 2160680 2131753 2070621
12905 2070621 1963612 1931611 1954777 1949817 1842376 1668558 1508130 1441742 1447621 1474397 1525592
12894 1525592 1607178 1737515 1899974 2051960 2037177 1847206 1641904 1473628 1342469 1200715
12884 1200715 1074741 976403 872770 785508 752228 732867 703268 669285 658870 682714 687492
12873 687492 672440 600434 529882 491910 475214 472536 460602 440365 451350 450747 449083 429299
12861 429299 394224 384770 363695 362357 342709 328817 309593 327302 333483 319914 290574 236718
12849 236718 247441 242786 257049 269323 289696 286952 293581 280387 297918 258092 215088 213465
12837 213465 215022 228059 264535 311803 320026 324897 408693 470322 525438 550006 571693 661237
12825 661237 680192 666501 561244 410180 333834 284691 218355 163704 181873 163019 165876
12814 165876 130252 106972 137353 184979 219465 266940 318431 347531 418742 507513 623364
12803 623364 635581 583061 551632 475076 399215 348441 336025 309985 293231 279066 264401
12792 264401 273004 298770 309774 289000 258248 256914 213031 232460 209217 186859 179721 190253
12780 190253 155239 170849 167709 150208 141727 139442 167166 204931 188865 170284 152044 134516
12768 134516 117189 125970 129392 148284 173226 190928 163453 163705 127402 125438 138142 127528
12756 127528 117510 132894 162791 145428 87443 91246 115517 137893 109216 82722 91536 98605
12744 98605 93465 119076 141532 137580 109012 113960 128386 111317 68436 54169 55645 87597
12732 87597 85596 100256 121862 123354 68679 43378 35644 -15594 -59068 -20552 -9917 -29584
12720 -29584 644 32698 23959 14440 30913 50265 51960 45659 81285 95127 43752 35691 45233
12707 45233 62740 71696 73657 54956 -94 6113 -11582 28255 5613 -57551 -21695 -3391
12695 -3391 754 -33353 -43766 3259 40755 21141 32129 38461 35429 -4029 -35019 -11104
12683 -11104 -51805 -64821 -22131 32776 42907 18400 -9164 8593 56034 54189 90062 89281
12671 89281 106713 135978 138232 126990 126248 93356 66521 105159 108103 85700 91832 107033 84831
12658 84831 60990 42939 3672 578 24615 92364 78700 55369 78780 77151 59409 83256
12646 83256 63011 63458 63755 52455 31089 37825 11433 8775 35041 -6067 -32212 14172 26229
12633 26229 33583 31657 74173 139582 98364 64217 27215 4709 23109 32734 50013 26722
12621 26722 -5626 -735 30668 59802 56581 55377 68147 35555 46010 15989 14793 33021
12609 33021 -8013 -45499 -72535 -52368 -69683 -87246 -12661 21116 50774 42763 -6948 27815
12597 27815 45173 22887 54810 72745 73352 68014 94112 107051 120233 103994 35709 19220
12585 19220 43590 38992 40925 60233 91778 111144 107764 102367 71925 62294 78782 85638 60610
12572 60610 14193 41373 78332 74115 55692 17240 28138 3040 -3798 9763 4928 -11639
12560 -11639 -12349 4774 -6798 -8090 10032 10783 8262 1761 18386 22492 26226 20856 13827 550
12546 550 -30316 -21190 19880 39566 43411 32132 -17626 -56247 -5292 47516 39174 12899 15239
12533 15239 46701 11332 -29200 -68247 -43513 2398 13040 47306 49827 2700 -17820 -26424
12521 -26424 -25340 -15145 -805 -31139 -32090 42243 16045 7236 -10289 -24406 -24631 -22461 -14367
12508 -14367 13596 48567 76302 122522 127493 126799 159541 230176 304827 445009 594245 775466
12496 775466 938258 1142404 1341142 1456466 1402160 1191944 920371 645210 437299 315154
12486 315154 224876 141196 144071 136470 79061 44386 38059 52500 83218 74040 47944 60773
12474 60773 47540 46651 45846 44583 5114 -17526 14667 48899 21070 27258 38392 40664 46246
12461 46246 38570 669 6332 60018 23838 -18927 -31634 -27726 -7490 4369 -20745 -33623
12449 -33623 -27475 -15456 -17015 726 -8996 29128 41586 15628 12080 8082 -25975 -1619 16694
12436 16694 21285 5380 -28023 -50496 -81286 -73172 -72093 -20146 -16119 5560 -18255 -344
12424 -344 9445 6476 26173 26576 -13553 4095 16743 -16120 -1092 31499 20169 14222 2393
12411 2393 -11740 -10512 14785 2130 3925 45155 20713 -15416 -7439 -9120 -5351 3826 -1278
12398 -1278 -14700 -47530 -43798 -41989 -43288 -4588 -26347 -16014 -32726 -10445 1482 21118
12386 21118 7134 -1548 47675 36611 11596 -4513 47552 55729 17028 20825 -4096 -25092
12374 -25092 -5942 45731 55616 76009 64777 30439 -18448 -53665 -13024 27337 39397 24142
12362 24142 27411 36570 16573 -8361 -16319 -15784 -23797 -5415 -15061 1027 17514 -2553 27930
12349 27930 8051 3789 -23216 -44410 -8157 20874 16945 -30700 -36013 -58466 -65844 -45029
12337 -45029 -26634 -18202 -29408 -33159 -27885 -67733 -51535 5876 34442 30447 14649 37017
12325 37017 54993 50956 15546 -23399 -38817 -19485 24115 27318 -5380 -21230 -1397 16721
12313 16721 21298 20206 16985 15548 48262 41372 -12828 -57879 -50584 -34348 -12710 -9247 39101
12300 39101 -8549 -33076 -40284 -47199 -36541 -39145 -16178 -9651 -17810 -5993 10889 5021 13856
12287 13856 50197 52428 2350 -34039 -49700 -33333 -14975 -7702 -5668 46380 63717 71883
12275 71883 45029 18718 -6741 -58606 -37531 -33122 -67559 -66691 -29972 9891 -14387 -24867
12263 -24867 -42310 -34683 -24210 -49656 -97 38493 -12594 2093 46911 84251 61504 66038
12251 66038 39596 18575 15619 6267 33445 37557 -19751 -85370 -65422 -18391 -26241 -24728 -32334
12238 -32334 -74742 -60127 -34619 -11273 -33091 -27114 -47959 -55009 -20713 -15348 -37916 -35909
12226 -35909 -42541 -7442 34538 46994 36033 21908 21390 363 -10175 17335 42043 40210
12214 40210 82102 82497 47217 6551 2071 7072 10723 19387 -6998 22604 31810 -14086 -28600
12201 -28600 -35794 -10604 -4007 -23817 -27407 -12161 -31577 -29041 9121 -980 19432 22151 18252
12188 18252 -2554 -23421 -60537 -74483 -86015 -93804 -99444 -115146 -96560 -40392 -66390 -77224
12176 -77224 -56941 -42112 -27899 -34761 -50729 -32237 2630 -5123 2776 -11676 -42624 -52701
12164 -52701 -57656 -15353 5304 -39892 -79640 -71234 -51643 -13053 -13897 -42392 -1526 22104
12152 22104 18202 31299 -2716 4820 29029 58343 51582 29474 71211 132552 170028 190582
12140 190582 245748 335917 354516 393524 392732 365342 327532 246522 195770 131762 67262 50507
12128 50507 47243 12200 8647 -7031 -11083 -4663 437 30161 54597 19131 51709 79668 81267
12115 81267 45322 33910 57970 -2576 -24332 -32051 -3639 33851 34899 15805 -48032 -68734
12103 -68734 -31862 -35617 -73693 -32600 -32855 -80449 -91042 -49552 -23199 -31457 -39452 -45576 -34478
12090 -34478 1080 -25798 -16751 15341 42558 39301 1465 -6824 -24468 -59469 -27204 934
12078 934 -20776 -39735 -24211 -47452 -42059 -8371 -7070 -60822 -83927 -39679 16619 7450 7926
12065 7926 -23786 -18087 6221 47641 78914 58745 8103 -16635 -33491 -23572 7899 -5166
12053 -5166 -25209 8894 44777 -29955 -57891 -84879 -63074 -9595 -17694 24596 65624 33769
12041 33769 -32139 -16011 4558 9784 10223 37880 57964 70842 58163 47582 17016 -53561
12029 -53561 -48388 -53292 -22113 32630 50460 47860 8209 -23559 -49816 -33892 3141 39727
12017 39727 60398 53785 9993 26837 31188 -10552 -42104 -20703 -28909 -18700 14656 28647
12005 28647 -6467 -3844 24556 54656 70353 44590 30556 9127 9988 38653 46571 35507
11993 35507 23117 4428 -2167 -61070 -27399 22778 33811 26526 4434 -1028 38143 33567
11981 33567 49570 75080 93479 25658 -4799 6883 50659 55541 52473 27584 -6619 10346
11969 10346 20807 -2124 -9817 12554 38374 56028 69556 81464 52354 5988 41951 79570
11957 79570 87650 91126 91398 25935 1290 28666 36225 69171 73928 37667 4758 -28845 -44931
11944 -44931 3323 -35517 -50542 -77036 -28524 -4363 14032 6900 14851 23235 24435 15505 31335
11931 31335 5839 34918 76207 78224 40322 5913 -7674 -52508 -36164 -4219 29296 22641
11919 22641 13253 19019 47936 72297 39696 81020 134065 153991 114680 77573 45166 15769
11907 15769 835 23922 58157 67902 43065 15313 21885 -13558 -48635 -29721 -12797 4933
11895 4933 18493 28969 22845 24596 25065 46469 6158 -4669 6969 1639 11606 17457 40855
11882 40855 43091 73992 88293 64021 46259 38341 49513 32983 11221 -11146 -34654 23680
11870 23680 32874 56505 66317 61158 47270 18034 27282 73044 86080 83273 87140 42739 9037
11857 9037 11018 -17654 -38294 -37048 -34124 8133 27190 13855 26631 13088 -30929 -39272 -18211
11844 -18211 19234 5177 15455 13252 8294 5525 -10991 22026 75146 70610 56828 97487
11832 97487 76058 55934 62451 84207 92649 104728 68830 37385 88635 105406 56035 39269
11820 39269 7552 29552 47606 19363 -19657 -51015 -38158 -16197 5328 14669 15022 23681
11808 23681 45568 72140 82423 9864 -4139 34703 16515 52508 69428 93549 76229 50845
11796 50845 14521 23331 21986 33003 24075 13639 32793 7486 -54788 -45083 21690 40749
11784 40749 -7436 -47549 -43107 -2014 81072 129702 136174 93883 75647 95526 95765 86096 70764
11771 70764 30473 33473 49736 80976 66262 18303 -17002 27735 29985 58219 72663 54180
11759 54180 67170 35085 46271 43284 31247 -641 -23750 8587 43584 23785 -15715 14645
11747 14645 36428 52292 54092 14386 -9480 2718 548 2115 20086 29174 -577 -2683 13023
11734 13023 61938 86443 102520 118698 79727 45436 44731 38869 5965 2492 3435 -13216 -29309
11721 -29309 29410 10607 -36080 -47172 -19218 11154 -2732 -34542 -37248 -10636 20367 -5409
11709 -5409 17396 66035 70135 29858 6968 25383 46674 -322 -18312 26251 47643 47877
11697 47877 13218 12215 39490 13236 -25067 1298 14317 13383 3139 -9317 -3583 -5387 15869
11684 15869 42759 45239 63143 27376 -7402 -41394 -70594 -49839 -9038 -15851 -33620 -26169
11672 -26169 2032 23498 19178 28427 7807 7166 -12927 -42487 -50911 -25744 -60313 -71163 -34627
11659 -34627 -9297 40531 29676 -14670 -41319 -25415 4826 -846 6839 27648 12888 11196
11647 11196 14357 -13608 -33063 -5654 -19014 -72524 -63340 -17020 28042 51876 49714 29713
11635 29713 -22746 -37305 -41035 -6642 1831 -30898 -37706 -31216 -42258 -45802 -12581 13120 -6299
11622 -6299 -8952 1213 40607 21239 21295 31581 -2833 8078 22368 -11573 1053 16974 -28050
11609 -28050 -38066 -31043 -41252 -51646 -59115 -412 19572 -33200 -55390 5948 17421 2965
11597 2965 44672 31840 26440 5968 -23564 -305 4365 44911 95892 93165 77669 89143
11585 89143 94147 66068 47252 35823 32237 48483 29619 28883 38199 3835 -16073 -36778 -20219
11572 -20219 28825 13618 14365 4456 -8936 -57372 -75943 -47888 -28880 -741 34977 50577
11560 50577 40102 -47344 -76297 -58156 -81502 -63094 -60100 -11688 23203 16825 37793 41616
11548 41616 20429 -29844 -44933 -68979 -39284 -48977 -54186 -33623 1183 31637 1281 -32931
11536 -32931 11663 10618 14373 59674 67583 78400 75027 74995 79340 41838 45056 14273 -32399
11523 -32399 -54254 2804 35481 16395 -19484 -16490 2760 43842 33607 19211 -892 5552
11511 5552 44153 -9802 -39901 2156 46882 68174 40960 36354 76716 66757 25817 -1229
11499 -1229 -49509 -25534 30125 -46488 -65319 -13217 23026 41261 75357 38933 35888 33100
11487 33100 2683 4175 26940 -20218 -23156 6641 -11988 -6741 -9056 6066 16695 -10208
11475 -10208 17392 63445 72797 88626 62374 35106 43944 47791 35486 23790 -2582 -18656
11463 -18656 -36300 -46052 -53134 -37835 -29129 -7859 -15856 -62992 -59894 -62674 -32955 34391 45431
11450 45431 45962 36526 23779 55640 65356 71349 77439 39396 -16835 -40882 -46547 -77770 -58603
11437 -58603 -58728 -37910 -34269 -23818 -12428 797 -4812 742 7185 -23992 -28669 -22807 16874
11424 16874 61727 51114 14299 53854 62155 36282 25175 75250 76910 49312 23634 -1584
11412 -1584 24502 209 11680 14069 26741 38598 36451 24267 6606 -30835 -5800 39145
11400 39145 16004 -36201 -37110 2644 411 -2179 5626 -43958 -66500 -64396 -20209 -16402 -33584
11387 -33584 -30765 -5679 -733 5885 2962 -21160 -15479 -14997 -31091 -47304 -18923 2320 1051
11374 1051 -22035 -54463 -57744 -49186 6331 70405 83118 66154 9255 -64918 -96995 -110995
11362 -110995 -92866 -52740 -55735 -60114 -52389 -56703 -56342 -23767 4205 30263 -171 -32564 -50097
11349 -50097 -44169 -14661 13046 43645 62485 51791 33687 14997 36682 16874 25215 34482
11337 34482 9812 -20319 -64079 -31497 -28882 -11184 -840 37085 63312 51738 5995 -3214
11325 -3214 4617 -20842 -46653 -57174 -21754 -1463 -7363 17028 27780 -15784 -42892 -59566
11313 -59566 -70457 -28132 18125 8778 -9515 -39560 -9027 1728 -7879 -19064 13686 14843
11301 14843 -23976 -34477 -68821 -45414 -49664 -77688 -56982 -20399 -18933 -15628 -2385 -9462
11289 -9462 -25990 -21989 -2029 -29261 -31320 -2439 12403 26401 63487 14253 -11668 70
11277 70 6854 31409 29662 22829 11138 26993 13818 -6094 10866 45089 48073 93600 73918
11264 73918 39897 9961 6017 12695 48326 -2090 -17803 16528 39020 14514 -9125 7618
11252 7618 10378 -7656 -33496 -59378 -33067 -31752 -37729 -53193 -71230 -48665 -32331 -41274 -13461
11239 -13461 -985 16171 17160 29149 -2926 1252 40567 59889 27391 5640 -53862 -96710
11227 -96710 -98997 -58209 -14413 3682 -6880 -51498 -66033 -46059 -19075 -34770 -45294 -658
11215 -658 19308 6953 -11012 -34894 -24177 18790 -3627 -50143 -88290 -74630 -25622 35667
11203 35667 29622 -16004 -35598 -22216 18014 46780 34011 -30249 -10597 -10628 1645 -22352
11191 -22352 -4657 29559 11365 -11929 -8148 -28202 -20965 -14805 8708 16323 11349 10212 3339
11178 3339 -36225 -21948 15667 33062 13483 -8210 4680 -9903 -40493 -32942 -9298 3549
11166 3549 19643 -39775 -89570 -43341 -20753 -14572 11759 25287 2969 -3547 -63 -11395
11154 -11395 -17210 -37763 -54621 -19579 -21589 5275 17409 -35183 -26175 17923 55370 42034
11142 42034 29812 18600 -35144 -20752 -23830 -11333 -11811 19667 18118 25761 -10846 10523 35813
11129 35813 39805 62696 51205 25603 53108 69757 89190 46923 27810 3513 -1391 -10140
11117 -10140 -352 -9317 41965 82638 85704 67996 28545 13885 19222 2670 6134 -10336 -29054
11104 -29054 -54413 -28242 -51648 -88120 -7971 8499 21622 34645 1071 8177 6725 11799
11092 11799 -24927 -6867 -4252 -47146 -26045 -35290 -31854 -48176 -97758 -72470 -48355 -36144
11080 -36144 -68981 -65113 -54288 -71979 -79744 -44299 3366 21792 7770 -8608 -9168 11582
11068 11582 24261 8202 34083 22684 9014 -2906 -15575 -13821 -21245 -33240 -57440 -42461
11056 -42461 -77842 -75099 -15742 -61005 -69806 -45332 -28166 -33081 -9030 -9581 -9236 -10684 -22004
11043 -22004 -27743 8670 15253 -11914 2577 -1239 -43989 -24613 -14828 -41495 -42563 -48172 -26064
11030 -26064 -49996 -20153 37439 19939 19046 5481 11834 -4332 -16591 -23010 -21267 -13463 10138
11017 10138 -15951 -25924 9147 25111 27638 1827 18335 32897 20793 -54071 -81709 -80512
11005 -80512 -100002 -64927 -38797 -16067 -7371 -46977 -26342 18464 4159 -26229 -62126 -65597
10993 -65597 -41393 -58953 -70358 -63833 -97305 -87055 -34767 -13316 18843 30965 46399 40960
10981 40960 -9249 -31556 -7711 14676 15147 21998 -6461 12745 -14772 -6326 -11960 -37398 -28887
10968 -28887 -73270 -107628 -61279 -11287 19959 6089 25069 49632 35875 25522 -1663 -35285
10956 -35285 26084 64652 37857 13883 -29416 -82146 -87592 -102750 -60467 -14174 -38924 -47795
10944 -47795 -29929 -6224 -958 22124 22270 16160 18551 -18591 -31640 -42469 -55913 -79044 -62596
10931 -62596 -9191 37512 5663 -6365 -34044 -60138 -26325 -15164 -21211 -12765 -12592 -4450 -3747
10918 -3747 19458 26721 22740 29801 30480 28185 33675 2227 -10102 -2464 -29424 -69470 -108015
10905 -108015 -80368 -40366 -26592 -40037 -29889 6074 6310 8639 -29901 -25574 1054 -9167
10893 -9167 -16100 13170 835 48385 74225 21354 -11735 -21276 -19718 6309 -12100 -17958 129
10880 129 -17923 -58490 -39895 -45831 -28240 -10302 7132 -24800 -29345 -13476 8516 -18830
10868 -18830 -42057 -19706 -4624 -35671 -32689 -31411 -20813 -38209 -55307 -18628 -558 -13927
10856 -13927 -18674 -38817 -34905 -35263 -8420 10536 -13728 -321 -8763 -44723 -22293 9304 13712
10843 13712 -21935 -55332 -77820 -66739 -82065 -35873 -21773 -24107 -25256 -68726 -101095 -23847
10831 -23847 -14202 -28437 -19865 -1629 -4432 -11285 14069 13629 2381 -19959 -32461 -20990 -20164
10818 -20164 -33537 -27161 -44189 -58809 -24879 -19510 -28795 -22937 -7160 5887 -17863 -39451
10806 -39451 -23345 -2992 -17011 -36922 -36149 -10694 -11047 18634 43983 73101 63466 10337 -25031
10793 -25031 27026 52898 45728 32768 25361 21798 21311 61933 69198 83363 87653 35813 -10068
10780 -10068 -25842 41877 77931 71657 75978 74514 81990 42369 -1065 -23458 6047 736 6702
10767 6702 -2578 -25654 -30705 -22581 25557 52865 61310 47255 16990 -7704 -17185 -13078 3193
10754 3193 -31864 -81957 -104249 -38847 -31906 -72598 -31559 11810 4457 -21425 -12388 -12233 4574
10741 4574 50072 47300 46266 48244 21058 9326 9901 20398 10016 -10695 -19488 -1263 71296
10728 71296 27964 25059 52614 12215 5395 21078 9596 -2765 -1096 -1570 -15554 -14234 -122
10715 -122 -45549 -75837 -78105 -64082 -53525 -43038 -26147 -4105 9732 24501 -22702 -64434
10703 -64434 -33577 -13682 -36393 -30916 -19051 -41616 -29422 14200 -2036 -29209 -58338 -93272
10691 -93272 -89450 -44182 -78319 -99343 -49324 -12451 -17580 -70952 -62237 -58115 -32997 13616
10679 13616 61741 48587 23072 7238 67095 72148 43332 47869 58518 42564 11771 62893
10667 62893 92812 81727 82046 63677 -1668 -45378 -527 15145 20862 20470 -2117 -23667 -20751
10654 -20751 -39214 -76115 -59131 -25319 -70271 -79792 -102260 -82700 -67606 -85434 -76004 -46553
10642 -46553 -50874 -53937 -48803 -40795 -60329 -73030 -56791 -65063 -47659 -37405 5951 7908 -22142
10629 -22142 -41203 -48399 -83912 -128001 -83485 -55772 -34505 -35646 -6885 18406 15369 5831
10617 5831 13786 36443 16567 -3711 -1310 -11452 -15783 25255 -15600 -40243 -36597 8069 49555
10604 49555 8716 20712 23231 12965 23992 3019 -9251 -28838 -47332 -31492 -7787 30592
10592 30592 69600 39559 -1340 -26647 10027 34186 9739 25525 -22295 -32478 -12621 -14831
10580 -14831 -19010 -31212 -61128 -31219 -19980 -30715 -17024 14468 5367 31125 14234 -4038
10568 -4038 21831 28118 49261 21893 16637 -59211 -25502 28938 65059 81418 105258 76792
10556 76792 45319 73952 44080 -33578 -56692 -26032 4322 -2859 35679 59815 28035 15707
10544 15707 41448 61873 55508 67918 55577 24234 1441 -5884 674 -25349 -36122 3784
10532 3784 4488 32209 6908 -16217 1303 49970 52309 33896 42801 90023 59021 89269 86779
10519 86779 74256 60130 17418 45642 64548 72841 77083 39264 12826 -19239 -44420 -30820
10507 -30820 28300 95210 91282 72880 38829 11031 42385 50876 22931 20924 20871 28319 51208
10494 51208 31590 -13226 19903 64814 43576 59572 105980 111485 115040 103242 62505 29835
10482 29835 23294 46346 30692 10773 14015 30142 33107 -6214 -1196 29121 49844 59247 -10984
10469 -10984 -42492 -67048 -43581 -17448 25074 44945 25447 15057 36128 18332 -36999 -5286
10457 -5286 31444 58955 80750 12489 -20982 4699 36 -23192 -33030 -11091 36757 54847
10445 54847 38955 12428 5327 25205 -9386 11247 16344 35174 49374 49186 3482 -57499
10433 -57499 -44616 -23686 -27683 -6571 26458 16539 37946 66590 74807 38630 39399 31693 15402
10420 15402 -24577 -39812 -2787 -33695 -6238 -17372 -21955 3041 56260 34696 32948 39952
10408 39952 23740 -34760 -45784 -54324 -75958 -68019 -36982 4411 21834 44036 30371 -9927
10396 -9927 -39388 -1444 -2625 -7450 33148 37901 12713 -2266 12430 24343 -3677 3959 7860
10383 7860 17437 10215 25081 -11550 25151 23896 -4762 -23187 6419 29121 28443 43190 66101
10370 66101 43480 32142 49963 47960 -4579 -40710 -24917 -28441 -18222 3031 16887 2640
10358 2640 5184 9204 23469 1677 -855 8684 42749 62051 7424 42026 58469 60538 34820
10345 34820 42443 56577 40707 -17579 -41523 -20793 -62888 -50170 -33186 4398 968 -13862
10333 -13862 -29068 -28403 -11445 -13563 -14158 -34323 -49514 -58248 -59471 -20116 23003 3902 12843
10320 12843 12888 16409 49313 90970 111921 92720 20678 59006 84032 62036 53250 51860 25180
10307 25180 36888 63475 20417 14263 18385 8551 8380 23807 79142 86697 67490 63576 68947
10294 68947 40734 38114 64756 68475 65036 32363 59993 115443 143747 121663 117749 142226
10282 142226 139095 167769 178088 206724 192219 161678 144932 116729 123460 133287 121007 109761
10270 109761 98914 105692 116856 100162 93036 108598 102767 101162 65836 69428 68731 6719 -5822
10257 -5822 23417 52033 82231 73223 75075 78009 58435 48838 62869 50143 27994 -8801 3223
10244 3223 41838 18877 -30424 32282 57329 64501 97855 123259 114457 103854 115282 147475
10232 147475 176003 185525 171964 240085 344816 411414 508165 523601 503900 438843 377891
10221 377891 296796 242921 250636 210702 145949 135503 173596 197192 213919 205421 156107 142325
10209 142325 208946 213851 178338 167257 121403 116128 137245 114311 105231 91312 63063 47940
10197 47940 81254 95960 99106 66403 70832 57626 90823 78735 75329 61880 87038 105309
10185 105309 110309 100545 74029 97865 112690 85324 64065 66959 43190 35863 15286 47654
10173 47654 84206 88142 115488 129256 140198 144554 106952 126419 118318 101359 104077 71493
10161 71493 58272 58146 73250 41956 -52 -8077 39263 42435 18965 34528 11366 -13508
10149 -13508 17411 2681 -18513 -40550 -55443 -39267 -30764 -66370 -66508 -36900 26134 76812
10137 76812 44471 52493 68366 102430 147868 198827 180895 105743 99887 63949 68203 53737
10125 53737 46469 29869 15350 28254 43876 53693 75054 85577 76067 91189 93557 101301 93432
10112 93432 100384 114268 118221 130784 116442 147757 154846 172895 189919 170441 143710 147933
10100 147933 116479 162902 160560 119332 67535 69160 43463 50797 84228 91800 89408 80394 41655
10087 41655 31835 75052 107114 95011 115094 127188 119107 63918 48300 72256 43626 2266
10075 2266 20027 46528 39334 27914 45620 84595 75077 56403 59606 27912 20525 43791 40989
10062 40989 60966 36317 -21164 -23760 -24984 -56984 -44737 -17768 -11521 -13812 7474 8196 -1729
10049 -1729 5567 14979 41749 109775 128078 83124 95331 107775 133451 135010 164713 211439
10037 211439 257318 345747 425463 440595 400831 350203 352146 279703 192633 117452 73481 69610
10025 69610 74277 58676 47874 37170 40840 79411 86554 33664 50080 68341 49287 45088
10013 45088 30415 33816 77555 55328 32541 -18040 -33269 -53273 -30531 2401 -16978 -52389
10001 -52389 -83299 -86633 -49898 23416 60107 91036 34548 452 15986 38580 54836 43930
9989 43930 19526 13187 23727 46883 40745 21512 10163 -17506 18154 35676 31967 6946
9977 6946 9672 33997 49096 63637 84954 40623 20311 46869 18256 -19943 -15663 -43445
9965 -43445 -51646 8641 30593 12807 -4722 -5347 4241 39313 69538 55393 41460 30668 18977
9952 18977 -2208 17341 14471 17192 70997 62761 20437 467 -19638 -24028 -6482 8169 42305
9939 42305 37146 -6605 -25593 -45492 -32232 -9230 -11723 -40833 -38162 -12758 -53617 -53420 -34113
9926 -34113 -16967 -14612 10244 21706 -12054 -37934 -3532 6745 -1620 15159 -22466 13529
9914 13529 99885 76959 57349 46400 -4641 -41933 -61427 -55653 -15091 5713 17654 38120
9902 38120 28099 9728 5862 4713 5787 1304 41098 70722 103218 112959 84975 39886 47682
9889 47682 71262 67626 36341 11586 -960 -39348 -88429 -74852 -39666 -27660 -22715 -40942
9877 -40942 -96111 -117317 -107885 -69364 -27046 52801 49389 50870 11982 44466 47141 5827 -5816
9864 -5816 -16287 12503 8158 21682 27566 51865 59636 56508 89742 134967 87097 66832 29990
9851 29990 -20567 -54816 -3841 29698 24188 -6803 -5806 57410 75516 66128 23215 25456 59330
9838 59330 87890 75045 50343 18927 -30801 -64924 -766 15364 2983 -8947 -28402 -15580
9826 -15580 -15428 26515 76228 64615 22120 3453 25534 34433 41013 -2273 11795 53682 73772
9813 73772 37325 -19759 -43716 -17181 -2584 -40701 -43651 -43544 -35963 -33021 14180 20341 -37944
9800 -37944 -39939 -17784 -12599 -4792 -24215 -37274 -82027 -94300 -16940 52818 94659 60808
9788 60808 5635 4628 41915 11040 -19746 -9752 -11824 29534 41579 32481 42463 40743 18528
9775 18528 21350 15659 10382 16941 33696 34123 66784 24468 -31975 -20624 11490 13144 1114
9762 1114 52357 112045 83966 33620 8801 -6896 2986 10061 18961 22275 20595 14234 -2969
9749 -2969 766 -2502 11266 28152 43273 40890 6656 6414 -25335 -26163 -5919 -35914 -69874
9736 -69874 -48715 -28408 -41489 -42628 -36555 -24008 40525 65963 28696 26313 19258 -15188 18750
9723 18750 13592 9752 13238 40036 81784 101625 60629 -11858 -21417 32027 51077 34597 45020
9710 45020 47816 26473 31096 26652 9748 5193 55 24506 24151 13612 30022 20458 -32349
9697 -32349 -43446 18904 32530 -6025 -29403 -22098 6206 43203 45307 60496 65137 22509
9685 22509 49140 24763 36335 47192 45039 28880 15869 -33745 -41271 14621 54700 47524
9673 47524 43738 11562 -51252 -14739 40653 64365 50950 900 2922 8739 22368 48635
9661 48635 45973 8155 34246 92474 114387 108669 72026 50773 29176 736 47392 64010
9649 64010 30192 10983 14351 15225 -6132 -7979 -3331 11057 25303 34967 54984 101513 107409
9636 107409 113442 100126 86283 32158 -25579 -29150 -35800 -40685 -8327 34624 13851 34785
9624 34785 46066 7489 -9757 5923 29806 21501 22762 -14790 -8071 5983 -14023 -59972
9612 -59972 -76433 -28431 14440 9194 43338 70079 79826 41492 -11715 -2038 9598 40939
9600 40939 57728 66278 39153 33040 9858 16048 41115 54597 86586 83254 48294 33232 25722
9587 25722 22694 12298 38438 57174 61874 67238 35163 18074 81944 87409 24311 748 2263
9574 2263 34371 61540 73526 45975 11588 -24494 -13314 -32111 -24147 11259 6028 -10091
9562 -10091 32471 73137 72799 21656 11241 12979 8842 32944 55258 63756 11995 -26202 -21686
9549 -21686 -14678 38283 44102 -2690 -41468 -16701 56367 89802 112202 120300 85347 81516 88249
9536 88249 68496 67078 92370 67257 111593 99125 61931 67888 94405 59099 43197 63281
9524 63281 89859 123273 149701 188421 199767 177804 149106 144668 143209 122996 98510 71882
9512 71882 74270 97837 119599 108197 110287 128611 118928 97003 115682 107737 106071 92632 89713
9499 89713 92294 88305 73966 80394 80974 56797 55283 90716 131266 146201 145898 137632 98838 72756
9485 72756 68285 63426 45738 6551 46097 89242 97068 101040 136007 145368 112574 120015 128062
9472 128062 139722 83078 24127 34733 69681 83608 73393 69971 96292 110304 76703 87151
9460 87151 138095 154255 115801 133512 123146 110661 114829 128362 147658 184037 193568 199973
9448 199973 140986 88156 84365 83126 131586 134881 128889 155949 151146 152632 187034 199677 173110
9435 173110 177990 198296 198757 249461 262167 210428 185342 160970 160250 186877 215133 210766 182475
9422 182475 150911 131058 164584 192140 181079 175341 190441 193500 225197 220292 194236 180947
9410 180947 159358 172463 165699 197963 250695 255066 229246 241564 255589 301700 264895 213575
9398 213575 187257 190411 200611 196951 196075 242802 274967 290445 289111 279184 309791 337725 334801
9385 334801 317424 319221 345383 341572 349061 346206 367378 355347 300057 322985 323897 319362 334556
9372 334556 292538 275654 313583 301957 283817 279056 297400 329375 337352 356806 359830 372406
9360 372406 360080 347576 376769 429357 423925 415354 421541 447462 457860 437255 441680 479690
9348 479690 477389 458065 457697 451974 458266 468645 456596 485618 527960 538846 555500 584926 580105
9335 580105 547299 544767 543414 501895 501076 512253 508355 525501 566062 625823 621382 591171 575269
9322 575269 563599 522725 569122 612032 663020 687313 636835 600832 619629 623466 705314 713806
9310 713806 712688 723649 708482 710629 702302 712910 688321 692385 735340 729559 766269 704472 679644
9297 679644 706884 712137 718195 727144 720826 721256 744569 787117 806949 798485 822635 801675 791409
9284 791409 784496 765481 753587 688797 714857 759826 768633 752630 782264 743073 716949 695044
9272 695044 677094 672664 686357 692397 691980 698327 718084 737015 747360 739933 697521 682409 647197
9259 647197 646172 711489 730507 700224 692842 707488 685597 657432 627149 603234 608986 647156
9247 647156 643198 638284 613272 583094 539605 554721 564754 564414 586515 554519 544316 566714
9235 566714 595473 594619 578645 574312 567126 543348 475673 442588 406862 398852 376943 391002 401263
9222 401263 404634 392526 411805 407510 411128 412879 400192 346981 294553 265311 263670 311381 333776
9209 333776 338719 312505 323619 342585 317140 336215 359083 361987 313677 279403 272068 285162
9197 285162 274828 270586 287900 277831 295510 294142 226736 237005 256490 269146 297881 309019
9185 309019 294126 274567 239905 269804 262453 212201 205946 220491 213616 180530 158790 171738
9173 171738 172865 159416 176383 143439 128180 146819 209785 229226 257181 251965 230123 208725
9161 208725 176174 167577 165421 171687 196344 194827 192340 199690 193182 179271 157341 149268 154985
9148 154985 177438 172292 184060 190837 215457 207017 156270 143295 128907 142104 145937 187521
9136 187521 191144 156137 144768 136689 90372 101902 131798 121527 89768 86242 90290 97103 133298
9123 133298 157463 159285 163714 193642 166703 78806 58044 64985 71218 61767 62436 72970 73141
9110 73141 95691 97369 100863 39989 53942 81548 66015 42065 83583 105485 94134 115115
9098 115115 100510 118015 129092 135517 108108 78366 70977 60303 51663 45890 76312 104301
9086 104301 85794 96846 108791 80781 108435 111943 94128 63514 35689 41528 21297 18026
9074 18026 65357 99419 109759 125595 91608 38498 17750 35532 19026 26371 78248 93243
9062 93243 72727 23262 54087 65435 71597 96891 68393 50093 57876 39106 35789 41164 25428
9049 25428 45441 51440 72341 97597 73051 53559 55708 51715 51794 100754 120754 103553 55427
9036 55427 59317 92644 82796 48612 14549 -214 3310 25339 91352 137022 74094 938
9024 938 30198 41458 24826 27048 3918 30348 27617 11618 -3934 5655 63082 92025 92209
9011 92209 80505 75468 52728 27553 30945 25622 -2416 -41850 -20656 33019 61032 53105 1639
8998 1639 -27269 -11235 -9420 39668 51143 725 -215 12995 -6543 -29583 -33732 33689 42139
8985 42139 55769 55429 41153 37963 -909 3054 11108 6387 -13072 -10136 -20046 -10650 -9544 -47198
8971 -47198 -107957 -90929 -18704 21444 17201 -17848 -31319 -23802 -23091 -22663 -22782 5989 38857
8958 38857 28053 -3069 -16562 -33493 -53245 -106769 -77427 966 -14779 -35127 -36874 -5700
8946 -5700 -1719 42446 51812 52327 15072 46543 99261 131801 141226 114955 67277 41982 28477
8933 28477 35010 25158 4580 14710 21785 -12366 -37430 -9727 -5239 -61539 -66366 -42666 12232
8920 12232 30894 17853 -38680 -49727 -50143 -56007 -72099 -57946 -33089 -17267 -14121 -13937 -6881
8907 -6881 6259 55536 123847 104647 53008 14028 8999 34629 52059 47059 9010 35026
8895 35026 53900 19698 9191 -7137 15543 64446 49968 36101 35300 37593 23396 -22073
8883 -22073 -3837 12286 -7597 -43529 -15497 21288 72033 109502 83479 84381 32811 3832
8871 3832 5361 1107 19837 64616 97014 100169 77349 60970 16717 -29718 -42387 -48598 -51842
8858 -51842 -53115 -26774 4938 32477 25758 4794 -37507 -9997 6081 -22899 -12678 -27215
8846 -27215 -52662 -30879 15333 59811 61382 19719 25049 68995 59818 28129 1239 -15870
8834 -15870 -43238 -31380 -33640 -21608 -20321 -22505 -6076 11352 -65781 -92047 -70868 -70148 -40506
8821 -40506 -54374 -93699 -118228 -79340 -77103 -62259 -74996 -61234 -55605 -51905 -44989 -52623 -20873
8808 -20873 -2642 16432 -11132 -15474 -18896 21999 51427 32076 31897 17593 -11907 21350 36511
8795 36511 4956 -26801 -26489 -23184 -28940 -8340 34799 -2554 -51784 -131554 -31688 43890 54554
8782 54554 -10290 -23686 -9118 14859 57242 33801 9128 -7171 -30834 2277 84513 76585
8770 76585 35033 -9315 -3729 27953 54145 30233 -2695 10269 3714 -4451 -34067 -8567
8758 -8567 26810 35888 37365 30387 -12780 2594 -8464 -4958 4900 -22234 14357 9192 6293
8745 6293 -18637 -20695 -4140 -8355 -7742 -10117 -5031 16493 2097 -16000 -4252 32861 22974
8732 22974 30238 25937 -4634 20714 46389 70425 49393 27342 -6159 36781 25126 61681
8720 61681 68618 44903 69203 95077 59991 -9761 -15593 1445 27429 17743 56148 57347 39665
8707 39665 18937 25797 22569 11142 30865 64139 38385 -596 49938 85963 82391 80431 43860
8694 43860 -750 -4348 55120 72241 90592 147342 123337 95780 71883 76142 102747 94712
8682 94712 78669 106900 116632 80248 89557 69848 29653 2604 8270 -5367 -5557 23186 38213
8669 38213 51414 57428 85441 95444 48161 -17408 33500 39273 -4029 -2591 1105 -26827 -37318
8656 -37318 -18676 10028 44413 17862 -24741 -68913 -77450 -53596 -55561 -32305 -1144 22601
8644 22601 -11214 -21655 40080 65043 20478 29190 28717 1265 27988 77131 52969 46101 18332
8631 18332 11169 -11837 -1229 33342 59721 51267 66269 116498 126963 90611 107281 65733
8619 65733 35458 -1821 -6785 48962 45536 59185 84749 100609 90946 78818 108660 125634
8607 125634 126158 81028 79190 79523 79572 85810 70898 85437 58612 34062 63766 86290 67082
8594 67082 27950 45561 67044 39465 39437 41354 25673 50286 23703 37656 66736 28437 -7012
8581 -7012 -13682 -14675 12451 3323 13541 17995 6071 11748 23337 9827 -18708 -18 -25313
8568 -25313 -44180 -35142 -29131 16369 33712 -25304 11482 66854 103735 111809 117617 76592 92966
8555 92966 129193 70267 92401 66230 42658 74462 67108 30484 1609 -26407 -30109 16785
8543 16785 38112 51865 57821 24409 42335 44734 4446 12328 51332 60264 46057 39552 42607
8530 42607 65 -3365 1462 23832 1088 11581 9788 43411 66486 85818 75494 76327 33749
8517 33749 10035 54458 90006 116736 120115 126697 160249 142853 153232 159985 138203 140605 163335
8504 163335 160964 94897 53180 40222 -20620 -5775 40536 15913 1021 -5299 6938 53041
8492 53041 85746 89673 84977 64900 66645 38819 25005 1390 6603 28955 55714 68437 89005
8479 89005 88114 100834 87464 30137 6086 -2132 3582 5150 -23405 -4301 32198 100273 141927
8466 141927 130096 89502 131912 148088 134932 110428 123951 140038 100794 38266 23982 52582
8454 52582 46611 35936 57859 61691 67903 90083 100658 102283 123099 116964 87594 13678 -11980
8441 -11980 34472 33022 21563 20282 44888 58434 15645 11638 20362 25994 20407 36532 45383
8428 45383 32432 76263 95937 74016 31755 24179 -4895 -27196 -24496 4781 -8359 3362
8416 3362 22723 61343 76545 76972 70748 97921 102040 121463 140776 141083 133087 99067 96299 119724
8402 119724 110456 63889 20205 14519 648 -38285 -8743 33629 44936 74649 45413 20873
8390 20873 43464 48425 48129 584 8572 75598 86419 81535 40278 49835 30103 -9701 18490
8377 18490 39965 35715 46902 39577 40448 64158 68209 14183 6476 -1086 56925 110691 98421
8364 98421 95604 29213 -32371 -3458 22885 900 -51878 -38731 -17134 -1780 42920 55185
8352 55185 73784 51046 37181 42934 28906 47794 71398 56913 26109 16000 37047 59861
8340 59861 31470 59265 61032 72990 70364 40215 9879 20830 32752 31988 -2429 -22728 -36381
8327 -36381 -7798 -10434 57073 88879 29760 -3936 13103 20109 16238 10108 19291 35968 15520
8314 15520 -1699 18564 26303 27671 16344 15235 29452 26565 29288 8695 26128 28727 -35453
8301 -35453 -41583 15082 54192 71500 38210 -2816 4253 40540 28452 -26603 -86100 -80750
8289 -80750 -17591 3227 -4028 490 -2317 -16426 -23003 -18512 -22233 11158 7786 2017 -8392
8276 -8392 -54318 -44430 -31722 -34941 -76420 -46952 -10723 27710 37819 21499 2467 -18356
8264 -18356 -41326 -83067 -57688 2160 7756 -27912 -35499 -27279 -7842 -6940 -14929 -2543 15555
8251 15555 73246 54462 52246 54979 35725 14837 8947 -7048 24507 22121 -33669 -65074 -56549
8238 -56549 -51089 -42342 -48114 -52071 -75732 -67594 -49993 -58454 -18473 -4356 -7289 -25909 -40206
8225 -40206 -3182 15612 20695 -12220 -46245 -37809 -63266 -51362 -81839 -84048 -43039 -49342 -41625
8212 -41625 832 12019 -4249 -23806 -40438 -26032 -2010 -24488 734 12133 16344 -9509
8200 -9509 -29658 -35971 -38655 -7641 -14724 -37913 2221 23842 27889 42838 -9266 -25763 -28302
8187 -28302 36763 76892 49241 5947 6363 -14151 -27320 -31646 -26969 7760 6160 16916 42476
8174 42476 -22502 -56394 -14814 -5882 -43936 -76631 -69128 -87848 -74998 -55446 -12142 -39929
8162 -39929 -69201 -64612 -45245 -49228 -34814 -42865 -64503 -56442 -14503 -18675 -43385 -35876 -16632
8149 -16632 -15491 -61771 -69390 -96689 -116635 -122456 -101301 -34938 15553 -4065 348 679 -53533
8136 -53533 -25543 -2822 20846 6766 -10337 -33686 -22509 -23787 -12605 -1584 6813 -12101
8124 -12101 -396 3789 24457 39501 34819 64504 41630 25466 18408 12454 1707 11265 -40009
8111 -40009 -50779 -43251 -53587 -65046 -26529 -36706 -9839 55729 53230 10131 -20873 1585
8099 1585 27495 -25510 -45836 -26421 160 19527 22949 29257 17140 15789 17334 12251 -13476
8086 -13476 -16801 35039 56090 36597 70667 71104 68663 27240 3225 -447 -1500 -16154 -32710
8073 -32710 -49661 -16224 10033 18226 10163 -16674 -27737 8365 10698 23214 20047 45795 22973
8060 22973 -15509 -34678 -38242 -48088 -59603 -20491 4314 2952 -28708 -49461 -40010 23038 53723
8047 53723 55549 -12652 -79535 -71850 -54479 -20177 -19315 12616 25167 41708 -30728 -32721 -4272
8034 -4272 -6373 15357 31423 52902 60102 74084 31072 -9433 -4616 1991 3778 -10061 -60927
8021 -60927 -71009 -15805 44724 56226 63119 88648 69986 50182 18569 31593 81464 131239
8009 131239 115813 69102 83200 77931 28520 36472 28084 10369 3333 19392 31433 33217 30022
7996 30022 27270 670 -28220 -7227 3072 -7758 22923 6293 36376 -2185 -528 64591
7984 64591 83376 34037 -33489 -47647 -36203 31283 55514 44554 11484 19634 73308 87138
7972 87138 68755 45405 40070 27302 9616 -4909 11201 41695 44141 48279 63435 40525
7960 40525 25707 26219 10863 2254 3728 2256 28315 305 7363 44574 80207 66078 32746
7947 32746 6520 -3334 9793 31958 7110 -19669 21760 23664 29910 27662 23338 56797 58452
7934 58452 29941 16134 6353 17118 24332 -1871 12656 15146 21503 12620 3175 -26474 -36970
7921 -36970 -4051 2696 -19778 -42922 -61014 -29909 41750 89534 113249 105838 88948 50456
7909 50456 43311 20074 -23305 1351 12270 13311 -5161 2890 11962 37130 5354 -1560 31688
7896 31688 29823 -5964 20097 -169 -11063 -26085 -16032 -44237 -27183 11751 21318 -3682
7884 -3682 13101 2233 -26111 -59305 -66993 -72955 -52474 -6448 -5610 -22256 7860 -4511 -25507
7871 -25507 -29550 -27224 -4185 8508 -27889 -62192 -43332 -26632 52479 74388 32335 -24565
7859 -24565 -29910 -31214 -34776 -46842 -47102 -31727 -53180 -14082 -21847 -45223 -25924 3713 38940
7846 38940 77791 49439 -15873 -13219 -11667 10683 25476 36333 37629 38964 37450 3786 -9493
7833 -9493 -10684 -13392 -29506 -44561 -10994 -14302 -48471 -29593 -44308 -38695 -50765 -53754 -28722
7820 -28722 6443 10899 2070 28541 41996 51516 40572 13991 -9572 -23138 -18294 -29402 -78267
7807 -78267 -89333 -90072 -84565 -57181 -71533 -85520 -25892 -25276 -14425 12215 28046 33758 1
7794 1 -8906 11354 16592 48740 40958 -27385 -70611 -8203 20183 44445 70459 45842 35589
7781 35589 20654 -5447 -9595 1462 858 -539 -13134 -21883 -38660 13879 37454 21491 39019
7768 39019 54718 12911 9553 1960 49895 54088 -2558 -26195 19209 25948 11194 -37066 -38236
7755 -38236 -36593 -5829 4013 1176 -228 13390 9556 44021 47223 18424 -47946 -85423 -61106
7742 -61106 -26787 15256 34925 26786 31056 45358 41277 -7612 -87363 -56184 -7662 18782
7730 18782 35277 3630 -19986 -21664 -27338 -60225 -28839 -8124 44069 74741 97345 80555
7718 80555 16139 -5953 -31255 -28993 -73689 -32159 -16346 -12511 1296 3267 31188 50743
7706 50743 57919 58608 61485 33640 46322 67107 73746 19108 15661 27156 16170 -18757 -56328
7693 -56328 -53956 -32786 -8643 7241 -15329 -31262 -43160 -13253 -17427 -21847 -3760 53362
7681 53362 74817 45591 50224 -3347 -57765 -6086 14140 38547 48242 -4041 -6320 -17705
7669 -17705 20894 9910 -15186 -36877 -1436 20990 41524 67390 38404 19053 23120 24635
7657 24635 6273 -9912 6601 -6962 -10886 21748 21997 6754 37668 18262 14670 6252 -8577
7644 -8577 -22619 -3490 54098 48785 18889 24764 35204 13574 -46906 -58873 -19059 12658
7632 12658 -28612 -80324 -123196 -105505 -78083 -58267 -35580 -29071 -62587 -53404 -72111 -105233
7620 -105233 -117421 -92696 -57806 -61113 -113234 -110121 -93985 -96872 -98152 -75469 -28392 31703
7608 31703 68885 80893 39527 -17572 16648 58055 43599 54713 41532 59233 22738 -24671
7596 -24671 -33800 -2908 32658 45811 29145 -39880 -75697 -62446 27689 45057 17283 37736
7584 37736 65050 52617 3996 -6823 -7589 4912 34520 39154 7123 -6845 -8098 -23620 -40376
7571 -40376 -60356 -46827 -41496 -16247 -333 -32384 -49116 -17139 -22444 8637 17255 14712 -3989
7558 -3989 8418 37722 33754 29846 7459 29581 -4222 -28381 -35159 -36965 -46561 -27690 -19033
7545 -19033 -63046 -80680 -70693 -66250 -71557 -82537 -59423 -31798 1114 -24136 -16971 19627 15445
7532 15445 10277 -19744 -32136 -41295 -74338 -52062 -17287 -58 22577 -3902 -45334 -46832
7520 -46832 -43187 -33886 -26623 6279 -143 -55270 -47580 -7120 34595 49815 46889 22096 -31877
7507 -31877 -24647 1550 21096 40183 41074 19124 10517 844 -10994 -11918 26160 40317 3698
7494 3698 -149 -21061 -22170 -28754 -85581 -79341 -40500 -39877 -46416 -49172 -23412 20126 63132 77039
7480 77039 31147 -22574 -23223 3202 32396 9426 6153 -18938 -23020 -7304 12936 18645 2760
7467 2760 -13902 -1884 -6448 -21003 13372 21531 9483 -55389 -60983 -46913 -42668 -30999 -38168
7454 -38168 -69346 -59346 7283 -1297 -12380 12368 2571 -5254 -22175 -27881 -43081 -77833 -57789
7441 -57789 12070 48370 41186 42287 26688 33873 -2417 41679 48010 3162 -103366 -180122
7429 -180122 -157276 -126977 -80627 -59818 -48245 -26652 -29521 -28371 -56077 -56573 -49610 -19512 -6443
7416 -6443 1167 -2322 -27503 -32858 -20262 -48044 -52310 -44112 -20616 -35894 -57852 -60419 -39787
7403 -39787 -46963 -49303 -40763 -35202 -51488 -103594 -38313 30178 22829 17548 -60 -12641 -29340
7390 -29340 -38878 -56390 -52000 -43905 -72040 -41092 57809 111502 71258 -4856 -20605 -10420
7378 -10420 14194 26583 21878 4386 -11287 -49567 -63721 -89924 -44337 -1750 -19562 10210
7366 10210 20981 -1083 -2129 -17900 -44806 -10000 49877 35448 20281 65925 47518 64063
7354 64063 76242 74146 93484 81699 27256 9572 -15279 -34587 -44621 -63234 -49059 -54506
7342 -54506 -32302 -30258 -36822 -26894 10829 46906 30817 13955 58706 50505 44294 16823 35735
7329 35735 48497 16161 -13666 -1242 5243 7346 -1725 -19055 -41195 -36682 -64386 -57536 -21491
7316 -21491 -36199 -70068 -75595 -49450 -4356 -4375 -12139 -63145 -56805 -46452 -38670 -23571 -638
7303 -638 28882 51056 59454 93097 78205 -4887 -46707 -36317 -28625 -15867 -18385 -24190 -40325
7290 -40325 -25637 -29399 -46369 -57625 -30620 -15690 2590 -888 -30692 -22062 737 -46240
7278 -46240 -10582 19650 7963 16141 53423 72017 80040 40003 -7235 -4018 -19676 -23113 -14491
7265 -14491 19724 12508 9000 -6377 -6105 6278 47179 40055 75880 83597 40305 -15151 9037
7252 9037 25915 13233 17131 14479 31171 18692 18251 20165 16979 -1969 108 48201 79769
7239 79769 49060 -3953 -29125 -46726 -26653 -6094 -44641 -73292 -16741 28469 -9750 -16851
7227 -16851 -15295 -4908 -5188 -20147 -26003 -23726 -1923 19137 44494 25145 -28676 -67033 -58365
7214 -58365 -24624 -58656 -96418 -67345 -57500 -46650 856 31731 23258 30349 7348 16799 32357
7201 32357 -993 -32027 -20484 -17349 -42279 -56017 -84242 -47437 -44537 -8014 -11052 29614
7189 29614 52080 20447 14937 -6442 -44112 -11842 21783 10280 -19600 1310 1498 -10628
7177 -10628 14879 46194 42694 -19087 -68770 -63940 -7614 22991 -18898 -49373 -34991 6406
7165 6406 -12274 -46224 -63168 -50725 -12490 -16648 -12819 -50703 -73606 -88412 -116644 -90438
7153 -90438 -35249 22968 11287 -20876 -12733 -21211 -46951 -24725 -16650 -21836 -6172 7444 -41247
7140 -41247 -74379 -55183 -29386 20639 -1233 -43392 -27692 -39929 -41853 -36963 -42459 -34930 -24008
7127 -24008 -33271 -74906 -80843 -29503 -18099 3199 25386 -3899 17537 28156 46041 44818
7115 44818 10365 -23000 -18758 -3491 1164 6580 -6089 46455 37494 5059 17734 23026 -4440
7102 -4440 -73388 -49485 16142 6764 -26807 -59364 -27281 -5955 37587 25567 18842 -19978
7090 -19978 -5767 -7074 -18469 -18214 183 -15636 -7871 9946 35316 50375 41906 27735 -26027
7077 -26027 -7175 27712 46395 41656 18668 28282 36865 4809 13658 10631 -26636 -76461 -49954
7064 -49954 30251 22986 17160 20865 -3987 19704 15327 13167 22472 -15805 -13668 -31064 180
7051 180 6865 -14054 2211 9174 -24019 -40531 -69930 -80354 -78603 -53470 24886 29544 10043
7038 10043 -5761 -10945 -10393 -17482 -28769 -38449 -41070 -11213 21142 38501 16821 1900 -7984
7025 -7984 -51555 -57401 -25804 23832 27735 18812 30497 745 -22726 -49080 -49522 -51504 -91331
7012 -91331 -62875 -27243 -17050 -2733 -22384 -68512 -45940 -28994 -6462 -7644 -11516 -32977
7000 -32977 -19415 -10111 31529 19967 -50884 -65926 -35688 -46765 -57364 -50119 -35728 -44622
6988 -44622 -23175 -29107 -56343 -70206 -56627 -44725 -49657 -30911 -27432 -17809 -6591 -26153 10415
6975 10415 29928 23178 -3610 -23082 -12611 -28821 -25846 -52200 -34540 -3423 5700 20567
6963 20567 -9665 1673 -954 -18637 2771 -21280 -16872 -6140 25211 20351 -23304 3254
6951 3254 16315 -2779 1591 36700 45321 48863 75271 21140 -16450 -9957 -37356 -53633 -51332
6938 -51332 -97740 -131277 -113884 -50905 11803 53018 85595 87038 35420 -27658 -45565 -565
6926 -565 28679 3164 13190 36767 45946 70184 35178 -32336 -33697 -31500 -74492 -38092 -4366
6913 -4366 -5506 20516 -24784 -65696 -44124 -15522 9090 -10914 -52036 -70848 -89573 -61987
6901 -61987 -28621 -8487 -41473 -28292 29467 43883 14848 -14925 -23217 -16291 -13851 -40516
6889 -40516 -42826 -22572 -14778 -25989 -31456 -35911 -34852 -34204 -14523 -15558 3420 54227 68743
6876 68743 59005 6007 -17824 -21557 -45984 -22167 -8598 20056 44334 64489 40248 14662
6864 14662 -10321 16362 57953 50001 27374 21612 14830 14307 21056 -9589 -4147 39103 29771
6851 29771 40980 30996 35680 -6984 -9318 -22726 -25137 -4214 -1370 -16332 -1248 13594 22198
6838 22198 37388 10717 -15745 -16471 -28518 -41012 -14799 6773 20873 18010 21762 13083 -10737
6825 -10737 -12317 25616 36224 44576 17589 -3587 5529 -4846 -34952 -14409 11666 5101 -56320
6812 -56320 -28551 -331 -43170 -45740 3556 29219 8424 5987 -3973 20881 26308 9523 26378
6799 26378 24003 11234 -1030 -21419 -31111 -33911 -45423 12856 40266 -32839 -47639 -45163 -59500
6786 -59500 -68455 -58217 -65761 -53310 -45429 -26615 -47190 -69547 -31088 -14984 35725 45453 14473
6773 14473 -30982 -50903 -56282 -38447 -23419 -43023 -62329 -35779 -5505 -68594 -86096 -33088
6761 -33088 -10677 -4699 -378 17231 46812 53983 37090 -13480 -26833 -15174 -19251 -3675 20725
6748 20725 -26924 -54797 -16768 11397 7918 -21374 -43337 13626 25619 16390 -852 -7061
6736 -7061 24872 24096 1536 -7347 -14147 -7180 -7699 -50840 -37486 6858 39728 46125 100696 121098
6722 121098 89242 45300 20566 -21983 -2054 3879 24849 32108 -9834 -5509 37751 12334
6710 12334 -22916 -48757 -68046 -87328 -103605 -111736 -63023 -54729 -36510 -40178 -56773 -50699 -23115
6697 -23115 -11262 12864 16254 -7155 -15892 2986 -6300 5676 29021 8196 -24705 405
6685 405 -10899 -16204 -1163 51062 49566 52068 22854 29658 34005 8616 -11582 -24756 -8545
6672 -8545 143 10808 20108 -17035 -24125 -40928 -77481 -102215 -118427 -108635 -45980 -7858 -9586
6659 -9586 -7276 11118 -6977 -24646 -19251 -30670 -54545 -78154 -85241 -37660 12089 2726 -3254
6646 -3254 28342 23875 26331 24210 -2802 -10084 -36890 -73466 -59690 -35995 837 43259 53090
6633 53090 40176 32693 24220 -2271 14589 62487 55448 7797 -26355 -47274 -68525 -59977 -27140
6620 -27140 -10744 -29064 -72385 -63706 -2157 30602 21822 48227 45998 -126 -26411 -11071
6608 -11071 22867 24045 15903 10949 -20254 -19183 19404 16716 12147 -42495 -86364 -61774 -11516
6595 -11516 -23205 -16295 -11356 -34438 -14626 16075 41501 3016 -38839 -33991 -22625 8498
6583 8498 13937 -11171 -46263 -19921 -15116 -46588 -77064 -77490 -121420 -94860 -18245 11593 8382
6570 8382 -22559 -57629 -82109 -70318 -22111 -7785 -7788 8589 6692 -23216 15258 23925 19135
6557 19135 31827 -22955 -68473 -99731 -78521 -65550 -88493 -84649 -73280 -35057 -8546 8751
6545 8751 -6874 -20089 -41391 -43211 -53790 -56962 -76932 -121702 -112125 -33430 12380 -772 -11541
6532 -11541 -8124 13225 29117 15654 11070 3075 1585 -28488 -62510 -76090 -96713 -110987 -77262
6519 -77262 -3013 16063 14022 8076 -30076 -31501 -17805 -973 5350 32540 -14853 -28994 -2186
6506 -2186 -26207 -22826 -3543 -27627 -38672 -4551 25577 7585 8130 11168 -34807 -40289 -47860
6493 -47860 -23540 15150 12051 11206 19597 15057 -34270 -24036 -8978 -11791 13525 26143 58788
6480 58788 74061 74659 51165 32348 36289 23428 5134 -6311 -4183 -35472 -12212 18494 -8586
6467 -8586 -25032 -24816 10878 20706 20954 11691 9579 -4725 -32431 -44302 -41045 -17830 34781 29229
6453 29229 -3372 -18665 -27303 -23555 28220 60999 70973 11888 -3355 31167 22389 -11110 -46226
6440 -46226 -95192 -127047 -103942 -75201 -15422 -415 -42662 -59701 -41486 -34499 -30008 -30624 -68176
6427 -68176 -65395 -50933 -51179 -48840 -22167 -43360 -59187 -45422 -44191 -65769 -43119 -7108 -21024
6414 -21024 -46914 -64374 -20268 -6423 27123 14929 15610 -6239 -40590 -71380 -45872 -40298
6402 -40298 -61070 -84704 -74169 -45106 -20732 -29271 -2745 -6151 -23088 -42649 -68810 -48612
6390 -48612 -47479 -25426 2047 -43967 -106953 -71689 -50630 -69984 -102590 -100668 -91746 -95283 -79328
6377 -79328 -9504 36626 -30548 -73857 -75769 -34190 37519 33072 5094 -19661 -78031 -75734
6365 -75734 -49415 -1126 19251 -20424 -19835 13710 26629 -13527 -10610 -4890 4504 1999 5826
6352 5826 -1622 -2118 -15978 -12467 4247 -955 3434 -3509 -31407 -35490 -53631 -53443 -53152 -34046
6338 -34046 -1035 5359 3164 -9186 -4922 26744 25286 31205 53935 40205 3993 20743 47344
6325 47344 72214 65034 27943 19708 43843 7248 -25196 378 5390 18354 21704 3152 17485
6312 17485 47393 48508 23963 23201 2656 23808 7690 12432 -629 -20016 -27586 -22313 9871
6299 9871 48776 62354 58672 53732 51720 -6812 -12965 -7216 -31007 -34423 -15652 7958 41362
6286 41362 60893 59660 51595 52429 44241 8754 -16133 -17895 -5529 -14864 -7524 -8924 -13869 -31054
6272 -31054 -38399 26195 57761 83504 89306 47802 -2134 -20106 -14337 27649 29951 -9383 -40110
6259 -40110 -21537 -3985 -8452 422 -16071 -42464 -32036 -45176 -49381 -32561 24133 35522
6247 35522 993 -36609 -7571 17872 14118 10276 -22208 -54383 -38004 10872 47709 34117
6235 34117 45063 12005 -44266 -63715 -76215 -34173 -33040 -70612 -40017 -42555 -65106 -54695
6223 -54695 -38692 -18850 -5035 14683 37666 76887 97461 79102 62363 67873 97700 112905
6211 112905 121565 59150 2748 1730 2990 -16074 -13843 8326 -77 16307 19730 20811 -2032
6198 -2032 3172 58624 25659 -53628 -72774 -58850 -70517 -60328 -32009 -39203 -61041 -32679
6186 -32679 -16595 528 3275 -37250 -48247 -19991 -28589 -20183 -47023 -53237 -68006 -68524 -41076
6173 -41076 1965 -6482 -27151 -12169 23715 12785 27652 59395 40632 34619 51755 10828
6161 10828 38014 39422 23728 -14369 -3930 16637 25190 56612 52748 41388 44546 43498 -3423
6148 -3423 -4208 33811 56015 63127 58375 6463 -35716 -39160 -21968 -20257 30853 32894 7504
6135 7504 -16125 -25799 -25743 -622 46339 71023 39385 25133 40276 25444 20556 -7816 5510
6122 5510 25101 22031 50279 46744 8763 39444 67793 59120 -2428 2956 14951 963 20940
6109 20940 41792 49808 56182 37408 23339 -40684 -27272 -1041 -647 -35075 -65473 -102865 -75783
6096 -75783 -59292 -17813 -4491 -2498 -39878 -74270 -63722 -24127 8949 -64560 -91220 -18884
6084 -18884 2480 -7992 -27330 -23559 -57600 -58491 -59098 -37632 -36034 5563 8445 -17219 6158
6071 6158 -5966 -16915 -24897 -267 8902 65239 35563 -13575 -44061 -19950 -46582 -39548 6228
6058 6228 49401 55185 60316 82665 41699 29714 36430 30645 33667 13073 -29496 -38757 325
6045 325 20770 -14027 -15041 -22020 1800 -29618 -59445 -48012 -10722 -14167 -900 22724 18412
6032 18412 -13979 -26861 -22753 -50156 -29887 51047 48717 -4197 -24967 -2719 40747 25698
6020 25698 25034 23287 -1200 1915 21159 -5727 18766 29593 14637 -18350 -38182 -12073 -7810
6007 -7810 7471 16598 54791 33566 -29612 -32903 11583 27982 37652 -6654 -34523 -14492 -66007
5994 -66007 -64612 -39485 -62822 -73848 -62795 5278 45000 52698 51374 52231 39947 36461 55870
5981 55870 92566 89846 13980 -30170 -38189 -45899 -44800 -12131 24315 -15218 -7589 5156 -20474
5968 -20474 -20675 -10302 11136 50587 49617 71345 44481 77696 92324 44693 -9993 -31338 -25045
5955 -25045 -42861 -80653 -78273 -13288 25561 -10593 -46426 -1918 -28022 -24029 2446 10162
5943 10162 18187 8694 -10399 -38277 -32532 -31450 -30781 -34229 -10038 22613 7182 8333 -3706
5930 -3706 27153 2639 -19664 -4937 27377 17079 996 35001 39731 53543 8487 -52575
5918 -52575 -85606 -25336 16547 2189 -39945 -56246 -23721 4223 23085 6950 -25048 15841
5906 15841 4587 -39610 -58716 -30550 -16462 -14316 5225 -15166 -5904 23799 43917 18294
5894 18294 66166 93837 55284 48142 43749 34919 -14379 -63895 -21748 58897 28852 -18274
5882 -18274 -35281 -24915 20322 26971 -17002 -43871 -23627 -21945 -2616 -13619 -37124 -10417
5870 -10417 -21078 -15419 -70857 -95850 -103677 -102712 -80195 -75398 -75642 -89686 -122667 -118529 -138761
5857 -138761 -57664 -19198 -34064 -40333 -30142 -49857 -55528 -27634 -83137 -82118 5730 53361
5845 53361 25847 2605 -12783 -24677 80 12464 13336 938 -733 -46929 -79806 -35999
5833 -35999 -904 27588 43148 11840 3353 17673 57929 29623 -9922 -12481 -6779 -23156
5821 -23156 -10532 16159 438 -53912 -74089 -45245 2644 -8215 -31236 -9146 -3930 -5700
5809 -5700 35225 31366 -18411 -1754 -32483 -80542 -64259 -84885 -66967 -71747 -77613 -93404 -88551
5796 -88551 -74482 -52676 -64220 -45246 -27413 -28606 -36952 -23265 -39594 -38633 -56977 -61467 -58392
5783 -58392 -29948 -40802 -5470 14639 -10290 -36795 -28691 -37979 -29661 -20551 -27094 3340 2290
5770 2290 43313 42295 3735 -1583 30566 47272 50534 34459 23283 9251 17579 -17472 -35387
5757 -35387 -27864 -8961 -21865 -60154 -66958 -26148 3574 -404 -55664 -125932 -146078 -138717 -91355
5744 -91355 -57445 -74154 -76119 -74374 -61499 -50768 -23533 14647 7022 -4957 -51517 -63416
5732 -63416 -1866 -3622 331 37561 38366 54709 31264 30752 4898 -4671 -39983 -29537 -24056
5719 -24056 -15488 -2594 -5296 -4957 -44059 -35352 -21081 -6823 13525 29597 14422 -2881 -29807
5706 -29807 -38511 -23060 17427 46625 66506 55751 52651 74933 83623 75302 51305 57072 53560
5693 53560 31662 -1948 -10112 2654 -22821 -26749 -1260 -2472 -41676 -58080 -99572 -135155
5681 -135155 -86665 -21447 -8294 -40539 -14630 -28491 -32173 7057 45445 -222 -15777 -27510
5669 -27510 -45701 -49349 -73310 -30040 9974 39172 43854 1638 -14655 -23633 -31293 -29326 -21782
5656 -21782 -39473 -12672 5571 43324 77056 73572 34034 7447 11033 29440 18153 10209
5644 10209 -12185 -43571 -91256 -99501 -50005 -26677 -44415 -13716 20598 5526 -17061 -20217
5632 -20217 -8198 -40884 -56425 -18493 7939 25376 21512 13591 18065 1117 -5906 -30920 -76930
5619 -76930 -80029 -45009 -22148 -74093 -85907 -49875 -63307 -107596 -104583 -91774 -98679 -84846
5607 -84846 -24419 23401 9233 -18932 -37592 -45488 -77816 -92039 -69965 -68237 -43465 -30822
5595 -30822 -2554 17172 14058 -17044 -308 21028 10768 -13526 -12030 13840 15213 48672
5583 48672 52212 48001 760 16641 -5691 -4371 30226 47828 62167 39201 -5102 3502 -16935
5570 -16935 -11356 35688 4172 -32947 -51235 -13624 20033 51078 53324 782 4093 13352 41781
5557 41781 33577 26602 22343 -1284 -19834 -8247 -39722 -71249 -37537 -32056 -50331 -17679 -13122
5544 -13122 5140 17551 3758 -8413 -17666 33039 33356 20602 -8365 -39081 -53515 -43587 -50339
5531 -50339 -78224 -46768 -41091 -32883 -16269 13682 23228 -10024 -33454 1259 8234 25070 22906
5518 22906 2094 -2292 16592 8525 9067 29741 11668 18714 18717 -14961 -32096 -68173 -88766 -87317
5504 -87317 -50460 -16356 -10751 -14548 -23089 -21561 -26077 -7856 -9338 -17815 -34875 -43399 -31520
5491 -31520 -12256 19628 -10983 -37301 -32296 -40660 -62332 -100740 -80827 -66107 -19080 -13861
5479 -13861 -18775 19448 -15477 -31980 -24768 -2443 31681 29975 10976 -2522 9306 17810 12291
5466 12291 11892 32077 33275 43687 65495 38398 20108 56514 33339 23025 9277 -7782
5454 -7782 -21018 1288 -2275 25969 32651 22632 -16076 -39359 -3013 24204 30919 33473 16253
5441 16253 -52958 -29313 -3260 -43105 -53571 -14889 -32420 -35956 -18909 945 -21432 -26704
5429 -26704 -30480 -35535 2798 -17380 -41392 -32000 4841 40625 44929 1448 -35514 -33153 3057
5416 3057 -2060 24701 -3419 -40692 -18372 -4058 -33479 -19426 4936 14641 7325 -24400 -26276
5403 -26276 -4402 -2778 23535 3231 -4013 29285 15667 4036 26901 29036 -1941 -18208
5391 -18208 25507 36425 54121 19366 -50030 -50235 -25357 -29219 -7496 -101 10737 -15756 -35914
5378 -35914 8063 51687 28786 -4632 14074 19871 -34722 -90362 -114161 -78211 -54205 -41073
5366 -41073 -16467 39459 27675 24565 31211 40310 16412 16885 77440 82229 81770 48007 4605
5353 4605 4741 44079 11894 -11059 -27003 -43139 -26568 -40023 -44167 -74923 -28532 9548 28869
5340 28869 29324 26625 -22980 -44709 -24233 2339 -35226 -42474 -30599 -6546 -9302 12632 21535
5327 21535 61993 44965 34896 43095 74636 47996 17207 35969 35165 53252 33494 3667
5315 3667 28878 39228 44827 45922 62979 21468 -4260 36042 31610 37999 15785 -664 -14766
5302 -14766 -38803 -1428 -34211 -70326 -73339 -98203 -62906 -15375 30966 27696 2274 -10553
5290 -10553 -27508 -55507 -93232 -112313 -95016 -54830 -3645 33317 55409 47640 12668 -32930
5278 -32930 -42984 -44261 -32264 -8823 -23581 -43699 -52288 -40098 -49920 -90131 -94782 -65446 -62506
5265 -62506 -33578 -41568 -30995 -20016 -6499 -6609 -4150 -32294 -53223 -86578 -74231 -61406 -42885
5252 -42885 -24665 20995 29449 -16388 -68881 -110595 -35989 -11453 -2463 46171 85021 66521
5240 66521 44391 50321 15271 -5880 -31133 -82244 -109848 -40791 -19703 43697 43655 -17144 -51689
5227 -51689 -62626 -104821 -58606 -28974 27189 33709 42734 27140 29549 56059 65734 42045 -34464
5214 -34464 -28130 -11551 12291 3986 7481 -1860 -20242 29854 62353 1648 -27879 -43350 -9299
5201 -9299 15805 31939 33989 21127 6752 19146 29863 -16996 -52717 -57228 -40412 -26358
5189 -26358 -37131 -7538 -904 -18910 3947 57144 56400 24439 -21884 -25095 22379 13123 37337
5176 37337 8721 -11076 15331 28137 17222 -26544 -90532 -91664 -44822 -16802 4701 47587
5164 47587 51388 28158 -11142 -825 16668 34320 37854 31184 11983 -61636 -48722 -23623
5152 -23623 5998 3064 -10036 -19219 -5378 3755 -11807 -44971 -53541 -13625 -22848 -40718 -44087
5139 -44087 -28984 -5850 -38702 -31742 -59027 -78915 -49754 -85470 -89075 -52706 -71165 -67320
5127 -67320 -40664 -2268 33150 6169 3679 -7938 -25265 -2967 -21409 -41384 -32657 -2360
5115 -2360 -17916 15542 38920 38245 56120 54591 34987 58758 42426 39662 27771 24644 -6339
5102 -6339 2052 8920 34896 27451 43145 38012 32942 29976 10382 2178 -9288 -11960 52485 39881
5088 39881 -12390 -46947 -79697 -50022 -42455 -29258 -54600 -56421 -43841 -28958 -41958 -50443
5076 -50443 -25150 -28432 -79101 -84553 -83912 -56309 -34202 -11751 -12929 -8391 2825 3848 32030
5063 32030 14776 -22148 -6476 20030 32420 24478 31032 38636 4246 -13435 -9834 -14057 -3474
5050 -3474 -9088 8000 10850 14469 11605 -3218 -22896 -5235 -14521 -2744 -26614 -50553 -70010
5037 -70010 -73164 -90853 -66411 -33494 -55128 -75681 -38629 -41158 -80596 -95137 -60751 -44771
5025 -44771 -31525 -55359 -63230 -28140 -78536 -113573 -81862 -29014 -21349 -13045 29806 30483 37341
5012 37341 31693 2205 -19645 -33867 -21078 -32539 -74822 -74193 -36167 -6415 -11851 -26476 -201
4999 -201 7899 14468 1099 -18238 -51348 -52404 -45676 -40031 -19037 -17691 -16224 -26308 -62765 -58497
4985 -58497 8979 11758 -30796 -26018 -18334 -46891 -64699 -93481 -48873 -28827 -46979 -64558
4973 -64558 -53828 -40361 -31822 -43621 -76675 -63041 -41610 1901 -2999 -36983 -23875 -19645
4961 -19645 -64808 -65865 -58835 -59725 -9567 -41657 -25180 11111 7578 -7470 6767 -15452 -65064
4948 -65064 -45008 -51411 -66294 -70737 -77267 -26320 -1691 356 -26412 -28829 -48144 -59041 -31949
4935 -31949 -8967 32600 13426 10537 40248 32313 -11711 -58394 -64197 -90585 -52700 -28745
4923 -28745 -2515 27852 30733 35705 31022 4024 9750 5363 -11501 -1004 6389 -24305 -47303
4910 -47303 24883 87532 24813 -15971 -7005 26570 39682 36192 14668 44236 54402 40788
4898 40788 34342 -25669 -11375 26655 2703 -24689 -49135 -36486 -51895 -30880 29366 35863
4886 35863 41148 47847 40574 28209 30877 6543 -23085 -50097 -52388 -24729 -984 16774 -13976
4873 -13976 -28610 -10054 9078 32968 33107 15504 -22305 -26676 -51453 -31358 -54737 -87778
4861 -87778 -94113 -97351 -84563 -64492 -21248 57308 46814 33063 75441 69995 78730 71912 44838
4848 44838 9870 -28791 -40992 -8222 -1153 -13454 5117 35115 13754 -10758 19628 73116
4836 73116 72632 36604 40289 41804 20640 -784 11343 48097 19165 -13068 -4014 10220 -28271
4823 -28271 -55405 -51613 -62343 -34247 -34153 -92384 -86500 -64345 10975 31555 23868 36085 37079
4810 37079 26232 7378 2293 15706 -8382 -53785 -74083 -31629 -1705 13659 24743 41488
4798 41488 61157 42411 50699 34117 -1560 20646 69575 68149 10467 4324 -2047 -16202 5776
4785 5776 9536 12153 34518 9923 -11440 2097 582 -32719 -45239 -55738 -72581 -68189 -40853
4772 -40853 -17959 -37308 -66304 -71860 -104569 -93864 -46155 -23513 -31847 -47800 -76781 -76170 -51872
4759 -51872 -46456 -23566 19877 15057 -4230 2626 7793 -10887 7570 -1764 12402 15877 247
4746 247 -1982 -25574 14976 31687 23745 54477 81860 98054 44729 4494 -23272 -18655 -51170
4733 -51170 -47918 -40027 -21274 -15823 -3314 31243 32925 -15656 -18329 11364 1438 -2996 15367
4720 15367 56744 56623 67264 66361 68722 29779 -2080 5106 2963 -5986 -18289 12991 11419 -13166
4706 -13166 31273 25672 -13193 -12704 28622 22715 -18203 -47562 -71395 -38405 19269 -7489 -24364
4693 -24364 -27482 -35468 -52599 -62975 -58924 -24497 -21851 -6347 -4869 -15463 -26482 -37021 -5606
4680 -5606 1944 -18098 -35350 -35542 -53952 -55321 -6610 27546 53563 75469 59656 89 -34134
4667 -34134 -49982 -18563 -52982 -68815 -47879 -16119 -18370 -12431 16871 26646 33296 -2315 8454
4654 8454 32879 3212 -55608 -21625 4244 22231 16935 35141 11052 26920 -8632 -4489
4642 -4489 8640 6257 8825 35429 26465 26861 36455 -17992 -35180 -13684 -39573 -43033 -22545
4629 -22545 -18295 -2189 -128 -27780 -49805 -718 20199 -22321 -394 -14690 -44745 -12560
4617 -12560 30528 34248 36431 63281 101198 83688 19059 2955 30272 52822 53026 47753 3867
4604 3867 -12963 -27512 -21076 -5156 -14678 -52871 -26491 -9073 -29506 -30775 -9582 12276 17651
4591 17651 43758 39640 -27861 -60214 -44273 -37673 -16069 -13229 -16900 900 -37864 -51304 -46518
4578 -46518 37082 81892 83732 76495 33854 13807 47307 42059 37845 19320 25581 -14611 -69402
4565 -69402 -38519 -2218 -18695 -9352 23505 34432 -4933 -67660 -94838 -98138 -69277 -47937
4553 -47937 -23883 6506 39897 40536 -11873 -37238 -22615 -9370 -14413 -43018 -43271 -69637 -58471
4540 -58471 -36286 -59633 -31947 -40296 -50979 -60402 -46600 -8274 -7305 18707 6448 -4495 -17083
4527 -17083 16544 49909 83110 54411 17608 25994 42698 81886 76551 49300 45274 31373
4515 31373 -45903 -97423 -103352 -48108 -19819 -36987 -78472 -63219 -45614 -33196 -37109 -42339
4503 -42339 -47078 -62967 -23911 -3057 -6084 -39160 -78329 -67106 -25292 6699 -9352 -9689 -15183
4490 -15183 -33351 -5465 6416 -11633 -34077 -40179 -9319 19715 23339 901 -33983 -31814
4478 -31814 -34458 -35681 -28787 -33946 -14062 -37228 -73495 -100833 -46372 3963 18099 -13794 -37593
4465 -37593 -15161 -27472 -4882 -40800 -35694 16060 14265 6290 -42993 -42603 -8811 -6413 -2678
4452 -2678 -21586 -15395 -11372 -11302 -59783 -80880 -43344 -49897 -27224 -21695 -18234 -37060 -14376 -18415
4438 -18415 -30113 -41987 -25936 13268 -4511 -18880 10790 51668 52947 30344 43696 8872
4426 8872 -5544 28668 25637 4463 -16984 -34057 9395 21516 18923 -246 -8536 6118 14502
4413 14502 26880 14347 640 -32414 -53419 -56031 -43645 -25084 -20012 32677 37019 31951 24600
4400 24600 20745 410 -7466 -13296 -17183 -10913 3030 -3485 -16138 -54907 -78276 -94693 -24388
4387 -24388 -18121 -34567 -12215 22479 7619 -10868 -16060 -59215 -66420 -53026 -32480 -48571
4375 -48571 -10286 4666 18508 4253 -5020 25650 17957 -13336 6881 12863 -23997 -50617
4363 -50617 -30562 17804 11128 20879 20294 29406 5874 5654 25395 53459 33529 21096 -6972
4350 -6972 -31192 -61634 -23086 25036 16491 -37894 -42883 -6051 -3990 -10373 40646 52160 18448
4337 18448 8598 33943 41527 9796 43017 12696 7988 -8112 4416 -11546 -44297 -43109 -34513
4324 -34513 -35592 -46951 -44312 10044 11905 1238 -45011 35 30990 21026 -3163 -9802 43499
4311 43499 42739 72694 52282 36158 23570 -997 -17701 20715 19118 10827 -27085 -84607 -56751
4298 -56751 1478 9489 -15146 -58294 -81769 -80786 -32786 -11681 -7364 28150 59992 37926 9687
4285 9687 9291 968 21920 74279 42277 -25644 -25647 -17117 16336 59378 84867 66715 13786 -18139
4271 -18139 -3137 9582 -16633 -71161 -64643 -9164 1742 -8570 -20221 -26939 -68009 -54084
4259 -54084 -18074 -5271 19359 26903 -811 -11567 -1282 4703 23517 26641 23761 19423 -7363
4246 -7363 -32522 -10024 20700 38180 48571 30639 10239 16954 -13403 -30613 -219 21751
4234 21751 20180 -55322 -61613 9592 29417 16594 60811 79211 57725 7187 -37039 -15022
4222 -15022 16471 45639 5777 -31681 -23954 2208 -16036 -1959 -14148 -39020 -29099 21753
4210 21753 22546 16378 -47621 -90849 -109566 -120999 -97650 -58933 -52990 -66049 -42214 -25471 -24009
4197 -24009 500 6374 3591 -20516 -49544 -77412 -78374 -57091 -36045 -64180 -71075 -25797 42328
4184 42328 18453 -23502 -27423 8724 27032 -362 15374 40619 18869 -26626 -40433 2603
4172 2603 44830 38523 -12917 -13034 -18491 -11611 8584 44407 5172 -12437 -7816 -31261 -38033
4159 -38033 -7295 42925 27667 6547 44374 60526 29264 20472 53170 9708 -21556 -8480
4147 -8480 9669 24467 1617 -62204 -49690 -46806 -52520 -50810 14901 53590 55186 81171 83061
4134 83061 75574 85848 26990 -10867 -25933 -26192 -190 18566 12384 6960 12795 11993 20892 -47202
4120 -47202 -66848 -4127 35132 64517 50925 13423 -21091 -55004 -44709 -25695 -32441 -55322
4108 -55322 -16480 -17213 -37776 -36628 -39642 -22296 8525 61792 79269 61282 37253 48821 118
4095 118 -45315 -26720 -31971 -47553 -36052 -41048 9523 57611 71139 75028 23223 11398 -12616
4082 -12616 -64698 -120420 -98417 -66819 -23299 18305 52830 49345 15739 22761 27366 19003 25269
4069 25269 33902 37024 42241 -1253 -14074 -9319 -27149 -32327 -66425 -71729 -63152 -55102 -13351
4056 -13351 -3416 -24862 -51392 -49571 -37818 -12732 18481 72503 59715 63130 66993 -9658 -16096
4043 -16096 38480 68195 80796 90622 87436 27375 761 -4250 -32842 -8567 -12992 -19459 -7350
4030 -7350 -28182 -38870 -12094 -9831 44435 68239 22410 31748 32655 56043 74870 41851 18472
4017 18472 31551 23400 1805 -40044 -25169 -1564 6997 17862 18696 -3505 -19915 -15797 -3415
4004 -3415 2489 -45555 -38739 -15392 -13569 -5864 -11226 -44934 -33827 -28628 -49710 -53570 -26900
3991 -26900 -33978 -21141 -6711 -9622 7813 5830 -20395 -25990 -4855 -5920 4165 -9788 23743
3978 23743 -692 4008 -12919 -47602 -24843 -8958 -33719 -12372 6315 -15302 -14518 -17557 -53868
3965 -53868 -47593 -6316 13892 -1844 -2769 28014 52027 29333 4367 -17898 -11327 -24423 -45341
3952 -45341 15595 39993 76860 57450 -8427 -2141 23336 35786 54862 70565 86234 54929
3940 54929 -3725 -9619 -15969 -1874 -6156 -35679 -32218 -19789 13157 41547 67327 38187 -1607
3927 -1607 -12442 -4692 -926 6113 25592 31339 17862 70416 71117 47568 15201 -1501 43295
3914 43295 6289 -31646 24847 69588 38656 60956 36264 -11083 2049 1734 -6156 32191
3902 32191 24292 35396 -7488 -13885 98 12693 40097 63048 47556 47068 44489 30869 -2930
3889 -2930 11604 -15134 -18952 -28827 -13261 16739 26758 41355 32622 17478 15022 50719 66033
3876 66033 75648 83434 66334 54083 21599 -31730 -32563 -13297 -18596 -17899 -78300 -59319 -15942
3863 -15942 -77188 -56118 -35951 -40711 -13028 -28482 -92212 -84644 -67965 -49319 -17961 92
3851 92 15475 19958 8419 832 6490 -10088 -35707 -31479 -22815 -6140 -12238 -51782 -44068 -44755
3837 -44755 -32320 11572 50477 66580 18983 -34770 -18406 9117 7224 28455 42105 69008
3825 69008 129406 105128 67486 63756 46591 15253 51802 73645 66453 56452 12666 -7873
3813 -7873 -11212 17182 49345 63410 62026 65265 47656 34405 9350 28112 28645 38674 22263
3800 22263 1762 -4873 -19460 53377 71995 11855 -11016 -171 -20439 -14437 11289 -28591
3788 -28591 -59572 -70749 -57311 -77470 -71981 -32039 -11971 -58968 -52759 -22565 -13599 -2563
3776 -2563 -19347 -22622 23409 36127 53421 37864 27029 37016 34012 20963 48718 34122 -11290
3763 -11290 31222 61899 32825 18771 5687 23086 18266 -17388 -56572 -53697 -63921 -46546
3751 -46546 -29503 -13508 -26682 -11496 3271 7609 35134 33599 20808 566 -36861 -34125
3739 -34125 -2614 3107 -24826 -15927 1755 19312 -9765 -46442 -55770 -26742 -5627 13766
3727 13766 32378 39406 -17882 -17058 -6981 20746 39772 16015 15601 11001 -47341 -27030 11167
3714 11167 5096 -34475 -24881 -22366 -2499 -32700 -103616 -68286 -54084 -88054 -94490 -83363 -70164
3701 -70164 -61126 -34992 -26094 -26912 -1708 471 -3002 -6617 -27074 -25870 -21349 -35293 -50484 -47077
3687 -47077 -60268 -63865 -54630 -26685 13655 3634 32498 28320 9517 -17598 -28765 -15569
3675 -15569 -15040 -25793 -15355 -20428 12159 55247 52205 37850 37241 11547 -3365 -40099 -250
3662 -250 -7931 -55821 -72819 -44557 -38685 -15575 23667 27787 -24537 -16101 18951 11899 -45163
3649 -45163 -8562 49982 71589 49992 -9202 -30748 -35135 -20308 -32797 -65202 -62296 -23902
3637 -23902 10339 22528 5764 14867 13890 -38603 -41253 -4044 -33132 2970 -10263 -21722 18537
3624 18537 59232 29688 -9478 -16083 -26297 -36653 23869 44919 13795 5380 17939 27774
3612 27774 35242 16287 -12620 -36001 -30135 -52595 -40323 9022 42802 -2636 -15578 -32651
3600 -32651 -46738 -16289 -12306 -27712 22799 54428 35506 20478 55921 68674 37101 1846
3588 1846 -22106 -21652 -14220 -2369 -21562 -22919 -30011 -47841 -62714 -43329 -40237 -49236 -26299
3575 -26299 -16366 -33540 -49598 -32621 -43026 -47233 -54926 -28460 4160 1733 17829 -16836 -25862
3562 -25862 30943 53435 35619 10799 -28820 -28207 -27284 -39844 -8229 14237 53762 48201 25264
3549 25264 1784 -3359 4263 47226 49182 960 -62971 -60655 -24818 7966 -9091 11144 59858
3536 59858 84792 64720 31902 20576 -334 -16353 -16005 -10734 -4497 -2725 -6496 -29645 -72963
3523 -72963 -61725 -15861 -21611 11557 34513 -8519 -44732 -68772 -40088 -2716 14028 2207
3511 2207 -25337 15032 23044 -12230 -44993 -86674 -75056 -70949 -14852 37340 17931 9093 28706
3498 28706 24274 29446 15540 -5994 -50274 -70730 -84722 -98988 -50565 -18163 -25091 -27061 -7457
3485 -7457 6335 15337 -19682 -57135 -18278 -25773 -18352 -9663 -8036 -1618 -16796 -1235 8970
3472 8970 65555 59850 14092 -42289 -54233 -61888 -63211 -45344 -33142 -51773 -79844 -97079 -84570
3459 -84570 -67094 -40272 -29001 -39361 -37184 -11539 -25728 -39927 -47748 -37726 -52934 -53959
3447 -53959 -36964 -2376 -28701 -42421 -40626 -1439 25545 52302 68701 59815 49914 57533 62687
3434 62687 93146 76069 51925 23328 12199 19564 5644 -2111 -4554 -46491 -63023 -56680 -39032
3421 -39032 -69805 -52474 -57437 -40477 -31692 -37017 -15219 -27993 -54794 -68188 -23785 9498
3409 9498 42207 47801 68339 65523 29161 -6275 -2144 -6367 18477 33570 37116 24825 -15054
3396 -15054 21422 30633 4457 -24432 -12282 -4665 -12820 1663 7801 19730 -29705 -30587 -25671
3383 -25671 -21194 -10780 -28125 -71145 -64375 -62291 -28527 -12058 21469 24872 8106 35743 42160
3370 42160 -10907 -28294 -6208 38176 2660 -21525 -53595 -66946 -35400 -22465 -17390 -21145
3358 -21145 13294 43681 42739 21126 -700 51103 30773 29384 59105 61888 13550 -7080 24814
3345 24814 61914 64578 58649 57312 69562 58401 46576 2776 -2279 -13561 -7291 34413 33788
3332 33788 54080 92658 61818 41693 16684 61399 131843 117350 50699 200 -16370 -22579
3320 -22579 -7825 40836 72782 64917 16219 27190 25816 -13420 -65274 -78531 -64055 -98977
3308 -98977 -73545 -46729 -57280 -39839 -7725 36745 45740 -12969 -52667 -30404 -26971 -66710
3296 -66710 -73934 -42368 44259 67186 8195 -7844 -26481 -3861 33282 23689 -13527 -3441
3284 -3441 -5503 -4547 5065 -34131 -56973 -15128 -1009 14148 16059 -3676 18154 15781 -5398
3271 -5398 -21618 -38543 -46757 -58037 -59669 -21074 14319 12703 -19866 -3611 32846 20748 20661
3258 20661 4498 -42281 -49545 -45843 -6777 26837 36581 12346 -11917 2675 34512 46108
3246 46108 73983 55895 -191 -28644 -68753 -47311 -64335 -29715 36640 33348 1022 21670
3234 21670 20036 -4531 -25266 -1753 17968 22773 3385 23408 23065 -18120 -34598 -26583 -35325
3221 -35325 -21087 -8356 8644 -13020 -28322 -47264 -74949 -71238 -71417 -39419 -17882 -6202
3209 -6202 -5367 -4794 11577 44439 30849 3375 -63864 -96174 -79369 -30651 -31071 -14960 -13632
3196 -13632 -18816 8837 -13325 -32276 -36071 -28299 -34934 -43429 -42841 -45620 -43058 -16045 -13888 -32564
3182 -32564 -36411 2737 36675 41135 12044 16645 21807 -12193 -80078 -75905 -54078 -49648 -43878
3169 -43878 -34339 -82221 -77684 -45148 31665 64429 63680 64415 82174 16524 -31763 -57222 -52919
3156 -52919 -3361 -37740 -26450 -10506 -10018 -25850 -29913 9174 -23458 -23189 4121 46203 34152
3143 34152 -6722 12570 35402 45981 43647 4907 -30042 -2655 27013 -17846 -7687 -6541
3131 -6541 19029 54350 48045 12871 -13004 6407 15713 -13447 -10391 5739 -5167 13928 16222
3118 16222 -2978 -17729 -2671 -11924 -9499 -4587 -5818 15563 11863 -13237 -1567 12979 -2230
3105 -2230 -46911 -19318 128 3470 66791 23276 -12003 8776 46764 56669 66999 85607
3093 85607 73118 34537 -2218 10431 30355 43824 -14831 1912 18520 29324 37173 22051
3081 22051 15377 41828 42628 13978 -13222 -12859 3296 40365 43970 -19930 -55623 -83942 -84170
3068 -84170 -13651 15623 -4178 9023 19950 -2690 -24027 -27002 -18859 -40305 -70861 -80813
3056 -80813 -44848 -27765 -36636 -67596 -48413 -71489 -79703 -53525 -6381 25283 41045 -1660
3044 -1660 -31066 -78151 -77847 -68137 -56533 -5557 25803 47809 11663 -22508 -18485 -34992 -6033
3031 -6033 -14686 5521 49810 56271 23328 8686 -10023 -51741 -69290 -43350 -32051 -4202
3019 -4202 8650 -8570 -45900 -9949 22271 9188 -30194 -9039 13200 22765 -5311 -31151
3007 -31151 -14876 -24737 -27719 -7268 -2275 5391 -9712 22315 25274 -11327 -3033 7516 4993
2994 4993 979 25712 20449 9948 -5770 -12231 6272 28268 27842 26379 43715 43090 35960 47057
2980 47057 66387 44063 10373 34280 17639 -58332 -54961 -47349 -24970 -29231 -37051 -38439 -23576
2967 -23576 -327 -3750 -5344 566 2643 44664 47419 12948 -15985 -13480 -15345 -12406 -1560
2954 -1560 419 15747 19878 16675 31576 68926 89860 76989 53630 26094 50808 90505 76023
2941 76023 36625 -15993 -21063 -31322 -84575 -64858 -19609 -6214 -2651 -11120 -11410 -18372 -28710
2928 -28710 -31166 -29306 -48828 -43910 -52596 -77078 -46770 12448 20880 24870 43354 8991 6271
2915 6271 -8129 -44506 -27731 -15923 -25305 -31526 -58157 -69751 -73223 -89247 -64689 -21306 -3421
2902 -3421 -22067 -55887 -54350 -49260 -57817 -39708 -9551 -24425 -65123 -57328 -59948 -8391 -11410
2889 -11410 -44308 -33650 -14044 -13853 -43111 -24514 525 29566 20303 15552 20297 24345 49288
2876 49288 31480 9233 8050 5096 11903 15454 19455 58941 65466 79886 43294 37346 54663
2863 54663 40955 75067 75460 39042 -3693 -6330 -10753 -10301 23426 48806 38013 29611 19957
2850 19957 38869 30878 2857 2306 -34795 -7262 37956 39061 71185 85119 57352 23598 -18508
2837 -18508 -12283 11676 27761 40672 35455 35967 16410 21636 39406 56491 61201 49680 47419
2824 47419 61557 48497 36791 13330 283 -1456 -1140 -19963 -37056 -7519 -20897 -28816 -24915
2811 -24915 37272 71075 58005 41997 63335 66334 55212 35789 61556 65870 42356 30337
2799 30337 6869 -3862 13415 63646 92426 32632 -23029 -10104 -32046 -8797 21533 22870
2787 22870 -8263 -63495 -78688 -28297 -13649 -29627 -18923 898 -6180 -7309 -10763 -10828 -7995
2774 -7995 -21563 -45333 -39593 -58621 -46377 5809 41695 44827 -19016 -57155 -54359 -47789 -29667
2761 -29667 26464 52614 60347 35015 -871 38288 38471 59345 49060 17933 6716 10846 30167
2748 30167 37723 48408 73940 34408 23461 67946 99534 68585 43849 9068 -26025 -23880
2736 -23880 -3415 -8584 -30378 -20252 17846 -26 12334 -1954 -53149 -49223 -48957 -32932 9440
2723 9440 7272 6082 6361 24829 56057 20160 -24802 -36072 -4327 26131 15584 7423 -11451
2710 -11451 7874 28102 13899 12575 11844 38807 46537 57302 56012 34248 38369 23306 8078
2697 8078 27568 1561 8548 29570 54685 91202 83046 54119 26336 36611 29515 -13865 -19148
2684 -19148 8037 49669 -13886 -10010 21879 34637 5998 -7497 -25363 23753 14844 2270
2672 2270 41261 -675 -19975 27616 62150 90811 69806 72973 65688 39336 51582 56671 65394
2659 65394 69482 54544 44213 8997 19872 3279 -36642 -40393 9307 -6056 -7630 9791
2647 9791 -9343 32695 22322 31881 29089 26948 31742 39265 67987 36604 33278 20929 19947 1191
2633 1191 -26989 -26447 -14670 34587 56223 69602 63130 30432 7409 -47429 -58910 -64794 -29936
2620 -29936 16950 31581 28289 29914 48422 34817 57567 69367 38176 4198 -45682 -72848
2608 -72848 -88578 -104683 -125299 -123560 -85688 -78485 -68605 -66923 -48642 -14082 769 46249 50708
2595 50708 46059 6367 -54404 -117887 -134252 -147314 -109100 -100634 -80482 -54268 -21954 -25323
2583 -25323 -15886 -49561 -83331 -87497 -80083 -56358 -21334 -22056 9067 26433 12677 14113 56123
2570 56123 32089 -13630 -35125 -70841 -46705 -33963 -31801 -27006 -24634 -66219 -66517 -26502 -33797
2557 -33797 -74358 -81415 -79022 -41193 -9712 -11654 -48893 -41257 -2628 21739 -17596 -34512 -19896
2544 -19896 -17350 -3147 -18391 -47987 -30311 -20991 -25579 -15737 -59525 -34913 -17102 -35820 -4331
2531 -4331 -43063 -92098 -72524 -2478 63279 71857 60692 18540 10185 36091 27040 34285 32119
2518 32119 15140 -3882 17727 38836 26461 12709 8830 -19069 -46625 -65865 -36983 8676
2506 8676 6350 -14530 -18853 -15857 -42357 -64703 -96198 -79639 -64521 -24769 -17693 -2551 10413
2493 10413 18347 12558 -16714 -15371 10225 -4561 -20555 -54398 -50279 -23322 11103 35923 4055
2480 4055 -27150 18245 -2343 -7531 -10288 26904 61979 64573 55930 47609 -21259 -43536 -46681
2467 -46681 -44208 -17778 -8569 -4309 -37558 -23830 -32925 -28405 -18407 -2291 -32004 -35034 -15607
2454 -15607 38132 78947 50501 79940 53446 39635 60275 23917 29861 37617 69783 73616
2442 73616 36412 35382 35525 30019 45021 25279 48134 78922 91612 102732 78929 51780 39986
2429 39986 4494 -43122 -32290 -6668 14206 -11502 -3194 23609 48274 36242 24695 -21615
2417 -21615 -14044 4394 4310 60628 51380 23145 -290 -10135 18598 54293 61234 61794 65556 44129
2403 44129 3475 -27886 3187 -6417 -49637 -49488 -21951 2588 59138 17237 16239 44047 11322
2390 11322 52748 70586 46009 45844 8517 -20647 -13843 -6887 -26771 -34910 -51503 -36863 -19604
2377 -19604 -176 45878 59530 79591 63934 61765 48339 45275 35163 33074 27210 38431 59709
$$ [...]
##END NTUPLES=NMR SPECTRUM
##END=
