##TITLE=Analysis number 328230
Compound Code cc 23901
Project Code adrs
Chemist Name fudan
##JCAMPDX= 6.0         $$ Bruker NMR JCAMP-DX V2.0
##DATA TYPE= NMR SPECTRUM
##DATA CLASS= NTUPLES
##ORIGIN= Bruker BioSpin GmbH
##OWNER= nmr
$$ XWIN-NMR		Version 3.5
$$ Wed May 16 10:53:08 2007 GMT Daylight Time (UT+1h)  MAYBRIDGE\nmr@NMR_250MHZ
##.OBSERVE FREQUENCY= 250.131544655141
##.OBSERVE NUCLEUS= ^1H
##.ACQUISITION MODE= SIMULTANEOUS (DQD)
##.ACQUISITION SCHEME= undefined
##.AVERAGES= 16
##.DIGITISER RES= 18
##SPECTROMETER/DATA SYSTEM= dpx250
##.PULSE SEQUENCE= zg30
##.SOLVENT NAME= DMSO
##.SHIFT REFERENCE= (INTERNAL, DMSO, 0, 16.5077)
##AUDIT TRAIL= $$ (NUMBER, WHEN, WHO, WHERE, WHAT)
$$ ##TITLE= Audit trail, XWIN-NMR		Version 3.5
$$ ##JCAMPDX= 5.01
$$ ##ORIGIN= Bruker BioSpin GmbH
$$ ##OWNER= nmr
$$ C:\u/data/dgb/nmr/ADRS/1090/pdata/1/auditp.txt
$$ ##AUDIT TRAIL=  $$ (NUMBER, WHEN, WHO, WHERE, WHAT)
(   1,<2007-05-16 10:52:47.85 +100>,<MAYBRIDGE\nmr>,<NMR_250MHZ>,
      <created by zg, POWCHK disabled, PULCHK disabled
       configuration hash MD5:
       76 6E 9A 78 1E 09 19 81 EC 84 63 8F B0 6A 59 2D
       data hash MD5: 64K
       8A 6C FE 90 49 50 6F 11 FE E7 04 14 DB 56 92 03>)
(   2,<2007-05-16 10:53:00.49 +100>,<MAYBRIDGE\nmr>,<NMR_250MHZ>,
      <Start of raw data processing
       ef LB = 0.3 FT_mod = 6 PKNL = 1 SI = 32K 
       data hash MD5: 32K
       47 03 EC 33 D0 DC 68 0A 66 50 0B EF D9 CE A0 B5>)
(   3,<2007-05-16 10:53:02.13 +100>,<MAYBRIDGE\nmr>,<NMR_250MHZ>,
      <apk 
       data hash MD5: 32K
       BA 47 8F 81 9B FB 48 9C FB EB B8 34 52 F0 74 4B>)
(   4,<2007-05-16 10:53:02.85 +100>,<MAYBRIDGE\nmr>,<NMR_250MHZ>,
      <abs ABSG = 5 
       data hash MD5: 32K
       33 E6 AB D0 69 0E 63 17 C9 62 7F C0 B4 41 5B A6>)
$$ ##END=
$$ 
$$ hash MD5
$$ 50 8F F8 7C 9E 48 57 3C 4C EC 59 83 8C 88 2E CB
##$RELAX= 
##$RELAX= 
##$RELAX= 
##$RELAX= 
##$RELAX= 
##$RELAX= 
##$RELAX= 
$$ Bruker specific parameters
$$ --------------------------
##$DU= <C:\u>
##$EXPNO= 1090
##$NAME= <ADRS>
##$PROCNO= 1
##$TYPE= <nmr>
##$USER= <dgb>
##$AMP= (0..31)
100 100 100 100 100 100 100 100 100 100 100 100 100 100 100 100 100 100 
100 100 100 100 100 100 100 100 100 100 100 100 100 100 
##$AQSEQ= 0
##$AQ_mod= 3
##$AUNM= <au_zg>
##$AUTOPOS= <9 >
##$BF1= 250.13
##$BF2= 250.13
##$BF3= 250.13
##$BF4= 250.13
##$BF5= 500.13
##$BF6= 500.13
##$BF7= 500.13
##$BF8= 500.13
##$BYTORDA= 1
##$CFDGTYP= 0
##$CFRGTYP= 5
##$CHEMSTR= <none>
##$CNST= (0..31)
1 1 145 1 1 1 1 1 1 1 1 1 1 1 1 1 1 1 1 1 1 1 1 1 1 1 1 1 1 1 1 1 
##$CPDPRG= <>
##$CPDPRG1= <>
##$CPDPRG2= <>
##$CPDPRG3= <>
##$CPDPRG4= <mlev>
##$CPDPRG5= <mlev>
##$CPDPRG6= <mlev>
##$CPDPRG7= <mlev>
##$CPDPRG8= <mlev>
##$CPDPRGB= <>
##$CPDPRGT= <>
##$D= (0..31)
0 1 0 0 0 0 0 0 0 0.06 0 0 0 0 0 0 0.0002 0 0 0 0 0 0 0 0 0 0 0 0 0 0 
0 
##$DATE= 1179309167
##$DBL= (0..7)
120 120 120 120 120 120 120 120 
##$DBP= (0..7)
150 150 150 150 150 150 150 150 
##$DBP07= 0
##$DBPNAM0= <>
##$DBPNAM1= <>
##$DBPNAM2= <>
##$DBPNAM3= <>
$$ [...]
##$SUBNAM7= <"">
##$SUBNAM8= <"">
##$SUBNAM9= <"">
##$SW= 20.6930455092707
##$SWIBOX= (0..15)
0 0 3 0 0 0 0 0 0 0 0 0 0 0 0 0 
##$SW_h= 5175.983436853
##$TD= 65536
##$TD0= 1
##$TE= 683.16
##$TE2= 300
##$TE3= 300
##$TEG= 300
##$TL= (0..7)
0 120 120 120 120 120 120 120 
##$TP= (0..7)
150 150 150 150 150 150 150 150 
##$TP07= 0
##$TPNAME0= <>
##$TPNAME1= <>
##$TPNAME2= <>
##$TPNAME3= <>
##$TPNAME4= <>
##$TPNAME5= <>
##$TPNAME6= <>
##$TPNAME7= <>
##$TPOAL= (0..7)
0.5 0.5 0.5 0.5 0.5 0.5 0.5 0.5 
##$TPOFFS= (0..7)
0 0 0 0 0 0 0 0 
##$TUNHIN= 0
##$TUNHOUT= 0
##$TUNXOUT= 0
##$USERA1= <user>
##$USERA2= <user>
##$USERA3= <user>
##$USERA4= <user>
##$USERA5= <user>
##$V9= 5
##$VALIST= <valist>
##$VCLIST= <CCCCCCCCCCCCCCC>
##$VD= 0
##$VDLIST= <DDDDDDDDDDDDDDD>
##$VPLIST= <PPPPPPPPPPPPPPP>
##$VTLIST= <TTTTTTTTTTTTTTT>
##$WBST= 1024
##$WBSW= 4
##$XGAIN= (0..3)
0 0 0 0 
##$XL= 0
##$YL= 0
##$YMAX_a= 273911
##$YMIN_a= -233459
##$ZGOPTNS= <>
##$ZL1= 120
##$ZL2= 120
##$ZL3= 120
##$ZL4= 120
##$ABSF1= 16.50772
##$ABSF2= -4.185452
##$ABSG= 5
##$ABSL= 3
##$ALPHA= 0
##$AQORDER= 0
##$ASSFAC= 0
##$ASSFACI= 0
##$ASSFACX= 0
##$ASSWID= 0
##$AUNMP= <proc_1d>
##$AZFE= 0.1
##$AZFW= 0.1
##$BCFW= 0
##$BC_mod= 0
##$BYTORDP= 0
##$COROFFS= 0
##$CY= 12.5
##$DATMOD= 1
##$DC= 0
##$DFILT= <>
##$DTYPP= 0
##$F1P= 14.0000005364418
##$F2P= -0.99999901652339
##$FCOR= 0.5
##$FTSIZE= 32768
##$FT_mod= 6
##$GAMMA= 0
##$GB= 0
##$INTBC= 1
##$INTSCL= 1
##$ISEN= 128
##$LB= 0.3
##$LEV0= 0
##$LPBIN= 0
##$MAXI= 10000
##$MC2= 0
##$MEAN= 0
##$ME_mod= 0
##$MI= 0
##$NCOEF= 0
##$NC_proc= -6
##$NLEV= 6
##$NOISF1= 0
##$NOISF2= 0
##$NSP= 0
##$NTH_PI= 0
##$NZP= 0
##$OFFSET= 16.50772
##$PC= 1
##$PHC0= -68.72289
##$PHC1= 10.51116
##$PH_mod= 1
##$PKNL= yes
##$PPARMOD= 0
##$PSCAL= 4
##$PSIGN= 0
##$REVERSE= no
##$SF= 250.130003570458
##$SI= 32768
##$SIGF1= 0
##$SIGF2= 0
##$SINO= 400
##$SIOLD= 32768
##$SREGLST= <1H.DMSO>
##$SSB= 0
##$STSI= 32768
##$STSR= 0
##$SW_p= 5175.98343685301
##$SYMM= 0
##$S_DEV= 0
##$TDeff= 65536
##$TDoff= 0
##$TI= <Analysis number 999999
Compound Code 99
Book Reference 9
Project Code 9>
##$TILT= no
##$TM1= 0
##$TM2= 0
##$TOPLEV= 0
##$USERP1= <user>
##$USERP2= <user>
##$USERP3= <user>
##$USERP4= <user>
##$USERP5= <user>
##$WDW= 1
##$XDIM= 32768
##$YMAX_p= 473468671
##$YMIN_p= -446158
$$ End of Bruker specific parameters
$$ ---------------------------------
##NTUPLES= NMR SPECTRUM
##VAR_NAME=  FREQUENCY,     SPECTRUM/REAL,   SPECTRUM/IMAG
##SYMBOL=    X,             R,               I
##VAR_TYPE=  INDEPENDENT,   DEPENDENT,       DEPENDENT
##VAR_FORM=  AFFN,          ASDF,            ASDF
##VAR_DIM=   32768,         32768,           32768
##UNITS=     HZ,            ARBITRARY UNITS, ARBITRARY UNITS
##FACTOR=    0.157963299565203, 1,           1
##FIRST=     4129.07629947968, 0,            0
##LAST=      -1046.90713737333, 0,           0
##MIN=       -1046.90713737333, -446158,     0
##MAX=       4129.07629947968, 473468671,    0
$$ Real data points
##PAGE= N=1
##DATA TABLE= (X++(R..R)), XYDATA
$$ [...]
22754g2854o1754M4707K2499j7846L8667P2561N0478j0603q7870m26r5025K9026
22742h8440J9569l8976K814P1101l603J9469n9578R2526L2710l5278j4024j4408
22730a6118K5731q7190O0140J71617M6576l5757j20478j79152o2863J05580J0514
22719h1400J23157P9109p3063q0585j07234k6127k0470Q952Q1791P3218M6471
22708B3819k0844k5671R073J00289P1644m0207o1668k09899j32929J34444P2160
22697g9789l4700L245J20950K1472j44024R696J00291J2338l6774j56405p0874
22686b54574Q139K16852J15195n9261q0718m1564J04884j5322k0037q9543J2333
22675a03616N6902P4387K8251j7410q6603k595O3491L2743N087k181Q3625N803
$$ y = [-72854, -134608, -89901, -67402, -85248, -46581, 25980, 76458, 65855, -22015, -22441, -117466, -88440, -68871, -107847, -105033, -33932, -37535, -18066, -77644, 14882, 47592, 12314, -1710, -16118, 9613, -77577, -17437, 154180, 200756, 164999, 44521, -134631, -197494, -91914, -81400, 41757, 120866, 47803, -32782, -140016, -166143, -186613, -177661, -95870, -22652, 23819, 2975, -22696, -13623, 86666, 158310, 118103, 56435, -153464, -286393, -151949, -79789, -114489, -111244, 9706, 31178, -112846, -103150, -2859, 9479, -27295, -183700, -254574, -246435, -29583, 85612, 26351, -54367, -95931, 8953, -6369, -26406, -115949, -103616, -46714, 27673, 55924, 38514, -48089, -50684, 12807, 45550, 50637, 48456, 132081, 137884]
22663A37884n3086j52567m4869P7748Q2132r9196J2084J3878n4847L8967P0729
22652B8857k8514p4863k8376N6274Q4289J5148m3679p1554k2042l9839m9854j1738
22640a85891j4644m8184J27553N1650J0460M1516P1518N1420L3736o8217p0287
22629F30L703J31199M8714P673j2666j1372j30498l2566n8880Q8704m8269k4608
22617c8236J7588l9429J01325J47041n6362q0597q2927L4k5342l0810Q041P7464
22605b210o1680j04551k5258P7727O0741J19010m2452n2648k1813L259l1332j362
22593h2569J26179P6904l1631k9096J758J7294J30984m0374n3130m3051j1206
22582F2062j2278K6335m66J9587O2722q4509j28778m0084j1559O5004j17335O6045
$$ y = [137884, 84798, -67769, -112638, -34890, 47242, -51954, -39870, -25992, -80839, -41872, 28857, 343, -74520, -102896, -46622, 37667, 52815, 9136, -62418, -84460, -124299, -174153, -185891, -200535, -248719, -121166, -69516, -59056, -17540, 53978, 105398, 139134, 70917, 630, 4333, 135532, 184246, 191919, 179253, 167881, 37383, 4817, -54063, 34641, -13628, -38236, -20648, -60077, 41248, 188289, 131927, 51330, -31597, -31563, -56905, -87715, -79674, -2210, -63890, -168441, -193699, -115972, -55231, 63779, 21327, -31321, -53134, -49875, -81207, -82569, 43610, 120514, 88883, 59787, 61545, 78839, 209823, 169449, 116319, 73268, 62062, 49784, 76119, 75653, 95240, 157962, 73453, -55325, -95409, -106968, -41964, -159299, -93254]
22570i3254N7779l2532o1607l3324m0238M6019J02659J9961l8363L892Q7353k1405
22558c060J00192J38116q2245j24986j6049O1171O5588k3831K29m1636q2004n7285
22546f5800O3308J9521q8046o3203q6079J23157R0900m2304m3302j5750m938k5185
22534a37721j19246R3629J58733J09628m4264p7565j25027R256J05409N3370p447
22523A8755n2600j3549j02207K1369j1691Q994N2486j8466M8660J32885J51898
22512B36534j32683k15178o8038l9628O0710n5113o0591L9149J15913m4555n8302
22501b21782m9629J14457K6502r8366q4748L7386J63782N3699l2436O2688J3183
22490a5264k8538l9552q0672k0848K4121K3562p5478k2249J26151K2566Q8728
$$ y = [-93254, -35475, -68007, -129614, -162938, -203176, -157157, -54498, -34537, -72900, -69008, 18345, -3060, 97132, 235248, 153003, 28017, 11968, 73139, 138727, 114896, 115125, 73489, -8515, -65800, -2492, 17029, -71017, -134220, -220299, -97142, -6242, -48546, -91848, -107598, -112536, -137721, -256967, -163338, -4605, 105023, 60759, -16806, -141833, -132577, -27168, 26202, 18755, -33845, -47394, -149601, -128232, -139923, -130929, -78443, -96909, -48249, 84636, 236534, 103851, -111327, -179365, -218993, -158283, -213396, -273987, -234838, -118925, -163480, -221782, -271411, -156954, -130452, -228818, -313566, -276180, -112398, -58699, -91135, -28447, -15264, -43802, -83354, -164026, -184874, -160753, -137191, -212669, -234918, -108767, -86201, 2527]
22479B527l7931j02454M779Q8935k3643J8236P0788j7195p3467p3671O2689P8452
22467a955L3917r6808m3573J06459J09147k7624j7591q4171m1702j06028o8515
22456b38444O4779k450O3704M0547L6451J8213k5700Q8074k356r1800m1946K6154
22444f4774l5404m2900r793L2818k2083M4113l297p4438J6410J17517M5945o6625
22432f2511J2575P2143n5757q6145O1854L1313q910j14214o4960O0027J19822
22421c4763M2235q4425q0824J16889N7216J4431Q9104q629p1161l5467l8927Q8133
22409E3812j9988j03790j6976P5571l2986n9869J0249P6805K2050J2639n6348
22398c8831K1162j0360J12320j1429p7725o0362M1265L8514o895L940L1583K6711
$$ y = [2527, -35404, -137858, -133079, -44144, -67787, -49551, 21237, 4042, -69425, -143096, -80407, -1955, 31962, -64846, -108419, -1960, 107187, 79563, 61972, -22199, -63901, -169929, -238444, -173665, -176115, -112411, -71864, -35413, -17200, -42900, 45174, 42818, -48982, -90928, -64774, -100178, -143078, -152871, -120053, -142136, -98023, -101320, -175758, -159348, -41831, 4114, -62511, -49936, 22207, -33550, -119695, -57841, -26528, -35438, -149652, -214612, -154585, -34763, 7472, -76953, -157777, -40888, 16328, 30759, 119863, 111234, 40073, 4606, -34321, 53812, 33824, -69966, -86942, -11371, -44357, -104226, -93977, -17172, 4878, 17517, -38831, -17669, -28029, 84291, 72862, -4863, -65225, -23960, 14554, 7659, 11599, 43182, 69893]
22386F9893M6457r0026q6788k9759J5599K31039j3270n8172J429q588j14500L9780
22374C094Q5426j7265k7661J03956l1135j21322k5243O42m6518j9170j8687R2227
22362b1656k4951k8056j8666O1353R6828J34338J3738j11268j17678L6300n694
22351A4588j06050k5253L2340j1648L5410Q4787R2319L4840k8343j52296l4771
22340f4077J032M8277O1445M1583j6374j65947l5436Q4073Q6600l5595k0423K783
22328a2059r0540m8560N8422Q7753M691r0161r9374j5475j7926K8585M377N4987
22316a35280J25398J8836j9472k2063r1005Q858R5660k5572L6103L4424k1603
22305D284l8888L1017M5163l603p3156q7342p0383P7837O6424M023K2616Q1178
$$ y = [69893, 116350, 26324, -60464, -90223, -74624, 156415, 143145, 84973, 86402, 77814, -36686, 3094, 88520, 71255, 43594, 147550, 116415, -4907, -30150, -29508, -76026, -95196, -113883, -21656, -46607, -74663, -93329, -31976, 64852, 199190, 212928, 101660, -16018, 20282, 14588, -91462, -116715, -84375, -96023, -60613, 24174, 116493, 151333, 122990, -29306, -64077, -63045, -14768, 46677, 88260, 71886, -94061, -129497, -45424, 41176, 5581, -14842, -12059, -102599, -151159, -92737, -4984, -293, -90454, -189828, -205303, -223229, -194644, -190267, -135280, -9882, 8954, -10518, -32581, -123586, -114728, -19068, -44640, -8537, 25887, 4284, -34604, -3587, 41576, 37973, -35183, -122525, -192908, -115071, -48647, -44624, -22008, 59170]
22293E9170L6447j30800q1685P1956n0405J407P1594J03001L885m8810Q8846P133
22281A31739r7632n1239J5525j2584l6015n082j14712K6241O1927J0458M0638
22270c0736K6652k0255n5175Q2712K4165j19635J2299L1904P0389q402N218k9475
22258a0339p1050j15815l176P9065M7965N3139m264j14486n31L1778l7694j5315
22246a60723m4927R2171Q9410M2629M1470P5084m5766J3891n7825o8934j26501
22235a50021j10920L6281J39460K4362l0335j13584J5266P9747l9125o3401j0403
22224b22673l4405R4742J25039N0124n2133o5839J25682P7110k6926j13000o6973
22213a09252J3612N1315L0943j27979q0766L2636R2066l0265q4020K4829N8239
$$ y = [59170, 95617, -35183, -116868, -44912, -95317, -93910, -22316, 80685, 84570, 35760, 124606, 131739, 34107, -17132, -1607, -14191, -50206, -55288, -170000, -143759, -81832, -71374, -30736, -4084, -24339, -79514, 3198, 27363, -92272, -79973, -48069, 22320, 13918, 19136, -10339, -81389, -197204, -200380, -121315, -73350, -20211, -24475, -138961, -139492, -107714, -145408, -160723, -205650, -113479, -24069, 18560, 60030, 135114, 89348, 103239, 45414, -23520, -150021, -260941, -224660, -85200, -60838, -91173, -204757, -189491, -109744, -148869, -212270, -222673, -257078, -162336, -37297, 12827, -39306, -105145, 20537, 97647, 70721, -42279, -109252, -95640, -44325, -13382, -141361, -222127, -189491, -97425, -127690, -211710, -186881, -128642]
22202a28642L7385J38129J7732j4565N7359J8729r1023n575J7567l8330N440J6504
22190C0710J9313r2883O2964j04862n6530J1375m9267N5028O8933o921N5033J3048
22178E941l9507N5573L9166j8676j55678o9284O6769J3661n8354k2189L421R4319
22166h4838J048L0742J28636Q6125r5446l699j10116o2555j3149o3871N7497J05713
22154b3913P5348J4816o8617n5315O5723o0044p235m3141k8796m4617M7096J4182
22142a14513K5372K1174N589n0215j506J0928j8092N8268O8994J4418N2543R3102
22130A66062m8337k9219j16676N2962l3248j46351P1966J04096l0211P8873L4990
22119A04907l5573p8688k106j4791m6230P8103Q8033q9063m6164N4622p9839J19130
$$ y = [-128642, -91257, 46872, 64604, 50039, 107398, 126127, 35104, 29529, 47096, 8766, 14206, 30710, 50023, -42860, 20104, -84758, -141288, -129913, -179180, -124152, -55219, -62140, -7107, 5941, -33566, 22007, 61173, 42497, -113181, -182465, -115696, -102035, -160389, -182578, -179157, -84838, -83790, -53048, 75588, 161713, 66267, 62568, -47548, -110103, -123252, -187123, -129626, -23913, 51435, 66251, -2366, -57681, 8042, -52002, -59237, -102378, -131174, -175791, -128695, -114513, -89141, -67967, -62378, -112593, -114099, -103171, -121263, -62995, 5999, 20417, 72960, 166062, 117725, 88506, -28170, 24792, -8456, -154807, -82841, 21255, -8956, 69917, 104907, 69334, -9354, -11460, -26251, -72481, 5622, 93655, 4592, -41572, 13050, -66789, 52341]
22107E2341J17964k1175l6442j6396n3592J4176o4674q2821k994L6431m6582N0375
22095e3389J1134K8404P2882j6035r3411l0144Q5173j5466J4719J2298o0978k8551
22083g3364J14240K9400p1986M2981p8190N8679o800j0582o5237q7260J15703
22072c2416R0222k6301r1390l730j01304K7255k7544K7990L6985M9410R9228m7212
22060A193j01522O800n1279m7499n5775j0269L4004O7793J31015O952M2815Q4259
22048A08487j9148k7184p859l9218l9401l1482K4108N6572J8561m7289o2324o3686
22036a29863N831Q0557J82861j08432r3874J1366l0940O878j1946N8698q4369
22025a13233O0282J21380L3488j25004j23828m6968k591O399R1569l5365P7528
$$ y = [52341, 170305, 149130, 112688, 96292, 42700, 56876, -7798, -90619, -93613, -57182, -103764, -53389, -42255, -13851, 59031, 42996, -50415, -80559, 4614, -10852, 3867, 16165, -44813, -73364, 40876, 70276, -1710, 41271, -36919, 21760, 14960, 4378, -60859, -148119, -32416, 57806, 31505, -59885, -63615, -164919, -137664, -165208, -137218, -100233, -50823, 48405, 1193, -100329, -93529, -144808, -192307, -248082, -258351, -224347, -156554, -25539, -18587, 24228, 108487, 89339, 62155, 54296, 15078, -24323, -55805, -31697, 24875, 43436, -3853, -66177, -129863, -124032, -43475, 139386, 30954, -62920, -51554, -82494, -75616, -87562, -28864, -113233, -52951, 68429, 101917, -23087, -146915, -193883, -196474, -190075, -98506, -133871, -56343]
22014e6343o8542r8109L8429Q7173Q7251L9247m4146m7242j03037J5287O5913
22003h4119N4411N9127M418k3846p7646J17817j10229o5642K6040J6370M487q4544
21991a63356L9176J50429J04113k2143r4315l5345j46222P3642Q7373l2177P5793
21980C6968j3412m0827j06756q9902M3054R7985M6483l5632k3809N6116m953j9828
21968e4513K9585M3743L9328Q021k3294q905J37509p873m5811l8047J0112N7565
21956A47420O9480p0199q1125p2438K885p5863L4130O8030m4733M4152j01790
21945h0051L8559N2883M5985M4503J9912J39052M7015M010q2417j00462j28273
21934G16r2234k9485j03526r7000p0295O9724J26692J51625Q2065M9353j4920
$$ y = [-56343, -124885, -222994, -184565, -97392, -10141, 29106, -15040, -62282, -165319, -150032, -84119, -29708, 29419, 33837, 9991, -67655, 50162, -60067, -125709, -99669, -83299, -78812, -163356, -124180, 26249, 130362, 108219, 13904, -21441, -167663, -94021, -6648, -38825, 36968, 23556, -17271, -124027, -213929, -170875, -72890, -26407, -62039, -85848, -29732, -34685, -54513, -24928, 18815, 58143, 66164, 42870, 33965, 171474, 163601, 117790, 79743, 89855, 147420, 216900, 146701, 65576, -6862, -3977, -79840, -45710, 22320, -22413, 21739, -80051, -41492, 11391, 57376, 101879, 121791, 260843, 307858, 311868, 229451, 128989, 716, -91518, -121003, -224529, -321529, -391824, -322100, -195408, -43783, 38282, 87635, 72715]
21923G2715j8581j0892j6540M7727j04883o4137j27932R052K82335K15215j18620
21912A65459j42538r80O0296M0392L7477o0653J6433o6805j05189P1698J00904
21901A16494k3524j63607q0934L2337j5049q6152R0724N8884K6342J0881P5167
21890D1563J6096k1827o3107p3621O7947k4189l2083j33196p9997M5702Q4917
21879a71795N1060J9658R3012M2971j4664r0374n9641J13509Q4781P993n2677
21868B3833J7288q9765m8487J6189L4655j7611O4694N8237j18026j20348J4358
21857a64983N653p8832n3567K2849M7843J2042J8931K5633N6085K7145K9852L140
21845d8209q134N5787l0747j10503o9944P7058P9224P9896n952k0647j04388K6387
$$ y = [72715, 54134, 43242, 26702, 74429, -30454, -94591, -222523, -213471, 68864, 284079, 165459, 22921, 21941, 82237, 122629, 160106, 99453, 115886, 49081, -56108, 15590, 116494, 92970, -70637, -151571, -119234, -134283, -220435, -129711, -70827, -44485, -33604, 41563, 57659, 35832, -27275, -100896, -32949, -57138, -89221, -222417, -302414, -256712, -171795, -120735, -101077, -8065, 34906, 20242, -70132, -129773, -16264, 68517, 76510, 23833, 41121, -48644, -97131, -80942, -46287, -63898, 796, 59033, -58993, -179341, -164983, -159330, -238162, -291729, -268880, -221037, -208995, -190064, -164431, -108346, -81201, -51349, -48209, -56343, -556, -31303, -141806, -211750, -134692, -55468, 24428, 18476, -2171, -106559, -80172]
21833h0172J30207j1566j11410m937L4662J63586N0871l9712p8292J04691J19260
21822B77188k3865k22813m3938M3709j16849n7929l5578p6062p2435m6331M3166
21811c31737J35864J64845l9923r5530J12262r183p3341q059j2947L8424j4838
21800a34163k6826J25978P4295o638l942j5541N300j5299N7510m0418m052l8330
21788b2126M1519P6333j4911r4015j0034o0919o5217N7258R0177N0774L5657k533
21776H1963m7393O5473l986n9147p3207J3107j0416K6088J2740K6959P4276r2696
21764A3761q3568J6602N2912j05678k8060J02630J8716p404J16055m395r1558
21753A3p8940J50012J17744l3718O5408N6467k9738m0301m3924j18590j4199q536
$$ y = [-80172, 50035, 38469, -72941, -77878, -43216, 120370, 171241, 131529, 53237, 157928, 277188, 253323, 30510, -13428, 30281, -86568, -144497, -180075, -256137, -328572, -374903, -331737, -195873, -31028, -70951, -166481, -54219, -63402, -136743, -144802, -157749, -119325, -134163, -160989, -35011, 39284, 32646, 28704, 13163, 18463, 3164, 60674, 20256, 16204, -22126, 19393, 95726, 80815, -13200, -23234, -84153, -149370, -92112, -1935, 48839, 84496, 81963, 34570, 100043, 96057, 36910, -36297, -23190, -33606, -7518, 5222, 32181, 106457, 13761, -69807, -53205, -293, -105971, -134031, -31401, -12685, -20089, 95966, 91571, 13, -78927, 71085, 188829, 155111, 220519, 276986, 247248, 206947, 163023, 44433, 30234, 21698]
21741B1698P4151J19722p575k4142m5427K2814j15452L6815M3635o2713p4196
21730a0670k3286j40946n8274L8681P6182J00689N3153L0259M0750m1469j16268
21719e1199p9934K5208k7987J8076L6248k3122o6130q5027m512J39194J3228L3209
21707g2748J0105m9139r5891J928K5808Q7637K2257j7802J1313m1406o8349l9285
21695b25572m2516R1949P6603K0898Q2463r561K9889j5888o8047R877Q5127K8357
21683F3579n9286M985L4807J859O0391j719K2419L3956L2374m9005j42018k8360
21671b6018J9302P5823K013q0367J6371j3275n3606p8979j3138k2669K1888K0086
21659a32569k5170Q1895l4229j29004J6644J2098M0965k504n036M2958r9395l9133
$$ y = [21698, 95849, 215571, 207996, 183854, 138427, 161241, 45789, 82604, 126239, 63526, -10670, -33956, -174902, -233176, -194495, -118313, -17624, 35529, 65788, 106538, 65069, -51199, -131133, -105925, -133912, -115836, -79588, -102710, -168840, -253867, -258379, -119185, -105957, -72748, -62643, -111782, -207673, -205745, -179937, -92300, -70043, -87845, -76532, -117938, -186287, -225572, -268088, -176139, -99536, -78638, 3825, -5736, 24153, 8265, -59782, -49905, 35222, 63579, 4293, 9278, 44085, 45944, 106335, 104616, 127035, 160991, 193365, 144360, 2342, -26018, -6716, 69107, 71120, -9247, 7124, -6151, -59757, -138736, -151874, -174543, -152655, -132569, -157739, -75844, -110073, -239077, -222433, -210335, -169370, -171874, -176910, -133952, -233347, -272480]
21647b72480l911J3739L9097Q8948K6534l4426Q0729N5669K4725l8628j06030
21636a26034K772p2813Q9461q894o4166J9613m1522n686M7185R0410L7083k208
21624c4799r1350k8670O275L6196n291J108R4593o6768m3999J583R1608J26838
21612H7324l0061r8742j8376J05573P1911j1280o9802p5122R1462j1560l7005
21601D322l3677l198p6223o2975O523N0429L4362Q5196m4748o2377n8336L7154
21589a23548M1632P2206j25358P8984J2842q7411J1432K4866m92O5030L13m7349
21577g6853M3158l6351o1375j8757K2663J07532k2990o2741K7580P5121M3803
21566D0790P2785m7395k3479l3267O7111L7448q9994L046o5012O42L3845M8459
$$ y = [-272480, -276391, -262652, -223555, -134607, -108073, -142499, -61770, -6101, 18624, -20004, -126034, -123262, -196075, -106614, -115508, -179674, -160061, -201583, -207269, -160084, -69674, -32591, -34799, -126149, -154819, -148544, -112348, -117639, -116531, -21938, -88706, -132705, -131122, -39514, 87324, 57263, -41479, -59855, 45718, 117629, 106349, 36547, -38575, 52887, 41327, 4322, -29355, -32553, -108776, -171751, -165228, -114799, -80437, 4759, -39989, -102366, -160702, -123548, -81916, -9710, -135068, -56084, -43242, -130653, -119221, -94355, -94847, -29817, -29504, -76853, -33695, -70046, -131421, -150178, -127515, -19983, -42973, -105714, -78134, -3013, 40790, 113575, 66180, 42701, 9434, 76545, 113993, 23999, 27045, -37967, -37325, -3480, 44979]
21554D4979J3299K7939K6114l6034q0216P8671M7524n291K7036n5678q5491q2791
21542g9939k4430J01950N1951m5656k1220p0520m3710p346k8064l2722J0963L1286
21530a57457l1745m2635p2932K1230R4015O9121J14944N7119O6575R378j21368
21519F245j06663p97K5712P2531l1319k1319j0050j5918L7005N4023J01223J11040
21507B21713p0373o5311j27427j7191N0872M6956p026j32352j09941N5170J64153
21496I243J81327q103j01362R8015L3253k8204j7649k30992m9753J21947m921
21485B801p0705R8578R7313o0047o8632k8896l7689k7131L0598O9037m1153l2814
21473f8740J9335J01190J6052J24543m8243j57260l5277n7068m2907K3220K1386
$$ y = [44979, 58278, 86217, 112331, 76297, -3919, 74752, 122276, 116985, 144021, 88343, 2852, -79939, -104369, -2419, 49532, 3876, -17344, -87864, -131574, -138920, -166984, -199706, -188743, -157457, -189202, -231837, -304769, -283539, -189524, -120403, -5459, 51660, 118235, 127613, 6245, -100418, -101215, -75503, -2972, -34291, -55610, -65660, -81578, -44573, 9450, 110673, 221713, 151340, 86029, -41398, -58589, -7717, 39239, 32213, -100139, -210080, -154910, 9243, 190570, 182467, 81105, 179120, 212373, 184169, 166520, -64472, -114225, 7722, 2801, -67904, 30674, 127987, 67940, -692, -29588, -67277, -94408, -63810, 5227, -35926, -68740, -49405, 51785, 67837, 192380, 144137, -13123, -48400, -105468, -148375, -125155, -103769]
21462a03769l4903J09703J2325r5628l7788N859k7429J6821N8018K7228J26580
21451E7017L9001n6894Q9270R079q6855N50K6940J2620r014j36864j28921j38475
21439c22546P369J07983P2312R5094P6831L7047m447R1632n7108q1934N5334K1501
21427I9068k9692n2789K3620k6505N296j9628p814O7576j4907q0285k6270K3595
21415c8735M9383j2179O2301M782j2624j7975R5434J00813r231j38784p8289o4793
21403e9897l5061O8286j07403l3893J14636K1880m6776R985l2143J1428k3019
21392a11977q8328N9049K00903J39236q6076p2399o1214q3232L7021N61j0614
21381g7070q0232j2444Q6536P9125N0845p3873K7290L6949R24P8068p0793m5869
$$ y = [-103769, -138672, -28969, -16644, -112272, -150060, -144201, -171630, -154809, -96791, -69563, 57017, 96018, 39124, 128394, 137473, 50618, 51168, 78108, 90728, 81714, -55150, -184071, -322546, -315177, -207194, -134882, -39788, 37043, 74090, 69643, 161275, 104167, 22233, 77567, 99068, 69376, 16587, 40207, 13702, 18998, -630, -8444, 59132, 44225, -36060, -62330, -38735, 10648, -1531, 60770, 65552, 52928, 34953, 130387, 231200, 221969, 83185, 4896, -59897, -94958, -26672, -134075, -167968, -53332, -31452, -78228, -68243, -100386, -88958, -111977, -200305, -141256, 59647, 198883, 112807, 40408, -20806, -104038, -67017, -66456, -77070, -157302, -169746, -83210, -4085, 46760, -27113, 177, 37126, 38050, 116118, 45325, -544]
21369e44n239M8037J01141Q5527p1860j35863n3139q64o6112N3922O2244r057
21357H193O7077j4680M4952j602k6443q4760J9181j011J13899M0047j24092m1822
21345a061j3855Q3660O3147k8767J5394j38731j66754l4449J9809J5355R7541
21334h8711J28997q5015m0772O7493k5383K796L7541J866P8164j2910n6728m1661
21322c4323N9181P397m1433k5090q1461j4281N3870J6411p822J0651J5788M6404
21310E292O3882O8092J3381k07975p3609R5208L5878N2384k1161m9184r8265L4588
21298h1489P3030J0386j0574l9426m6058j07567k4143Q2317k8267r000M5127p410
21286a43074R7040O629o0036m3693k0016R0497K6902L9664J28275N9263m3293
$$ y = [-544, -5783, 42254, 143395, 228922, 157062, 21199, -31940, -32804, -98916, -44994, 17250, 8193, 75270, 60590, 105542, 103940, 77497, -7263, 11918, 10907, 124806, 164853, 40761, -1061, -14916, 68744, 131891, 103124, 118518, -20213, -186967, -221416, -201607, -186252, -88711, 40286, -44729, -85501, -18008, -43391, -40595, -3054, -1188, 76976, 64066, 7338, -34323, 24858, 32255, -9178, -34268, -115729, -130010, -76140, -59729, -67551, -56900, -41112, 5292, 69174, 137266, 150647, -57328, -130937, -35729, 149, 52533, 31372, -17812, -116077, -81489, -8459, 1927, -8647, -48073, -94131, -201698, -225841, -143524, -171791, -180791, -135664, -143074, -46034, -39405, -99441, -143134, -163150, -72653, -45751, -6087, 122188, 181451, 138158]
21275A38158j46596k7765J4535M9780p4872j2059n588j56508l6440J9670J12514
21264a25171N6777L6247k5420j31094o4556P5853J37584o6621j8930q735j5747
21253a49813n4972j6093R0584O6481k4336M8680j11241q5363j0685J01583L3227
21242a11948K1429J6010L1567M1474R3668o8691l8446j0015M0350j0810n8742
21231e4154N1357R3729R494J339r9706J932m2363o839o1307n2881p0778P2604
21219a57573K9918q2576M6244J01773J52578J165j36516n7631k6007R727o9048
21208a87946K0322m788N9687N1401r267O738k0600k7623o2124n6034L4356J22581
21196g3297r882J9437M602K6119J0926q2896k3053n6672N4595J49830J21583R299
$$ y = [138158, -8438, -36203, -21668, 28112, -46760, -58819, -64407, -220915, -257355, -237685, -125171, -68394, -32147, -57567, -188661, -253217, -177364, -39780, -106401, -125331, -134066, -149813, -204785, -220878, -130294, -63813, -88149, -39469, -150710, -236073, -246758, -145175, -111948, -90519, -74509, -42942, -1468, 92200, 23509, -14937, -24952, 15398, 4588, -54154, -2797, 90932, 100426, 101765, 2059, 3991, -38372, -45211, -106518, -159399, -230177, -157573, -127655, -210231, -163987, -62214, 90364, 91529, -44987, -102618, -128625, -118898, -187946, -167624, -172412, -112725, -61324, -70591, -63853, -84453, -112076, -174200, -230234, -195878, -73297, -83179, -63742, -59140, -33021, -22095, -104991, -128044, -184716, -130121, 19709, 141292, 150591]
21184A50591n1606n0666k1806j4901l8478L9636l8361j6526M623M6560M6938j4710
21172D1294N9457M3325K3622J3538N4291q0519p8931j32035o0629j080J07870
21161i797L0221K5404j5026r554N9553o3853M5732j2695M0440J7727j43146n2383
21149h7377k4724M2898r0542m4359P3955O5789o7840r7509J13241J74366m6408
21138A1490l9110N5125K8377k3802j01784R863M7781J00596J49845L799q4588
21127A57592j325l6585j23761o8171P4974L0319o2179j05021r2936P5011l0295
21116a82377m912J19944O5312L7396j05892q079P1545L7745N2071l1148k5366
21105B6239j4354o6833K2976m1844k6150L0832K7978r750O9764R4323j9031r8152
$$ y = [150591, 98985, 48319, 26513, 11612, -26866, 12770, -25591, -42117, -37494, 9066, 56004, 41294, 100751, 144076, 167698, 181236, 235527, 155008, 76077, -55958, -116587, -117667, -9797, 20424, 45828, 30802, 21248, 80801, 16948, 62680, 49985, 90425, 108152, -34994, -87377, -112101, -69203, -159745, -204104, -130149, -64360, -132200, -229709, -116468, 57898, 11490, -27620, 27505, 55882, 32080, -69704, -59841, -12060, 88536, 238381, 242180, 157592, 156267, 119682, -4079, -72250, 2724, 33043, -29136, -134157, -227093, -152082, -182377, -187289, -67345, -2033, 35363, -70529, -78608, -7063, 30682, 82753, 51605, 26239, 11885, -54948, -31972, -73816, -99966, -69134, -41156, -50906, 18858, 113181, 94150, -4002]
21093d002j6739L8063k1980n4748n1002J0008Q0668n9300J6532m3384J40727Q5066
21081A19909o4655n6849J21783J4168r1147p4159p9N551m7112p2528L8020J24204
21069A7106l0577R407L62J5788Q3060o8098j209J5027m7135m4667R0766J9207
21057E9037K6731l3902j37214L9164r939N7471r165N9321L4250k063K0327K3169
21045A27187N2329r367j02969p6421m6488p902p297k1164N3614K1359N6292O8621
21033A07794J9016J4125k0121m3217o9418J10013M6703l5333m7762M1984j3239
21022A10545j95655j67412P092J12067J00564j0866o2103q3050J1946R9675j1958
21011h9155J333P8704J7655J7896j09908Q9120l9126j7899r931L524m5441P5539
$$ y = [-4002, -20741, 17322, -4658, -59406, -110408, -100400, -19732, -79032, -62500, -105884, 34843, 119909, 55254, -1595, 120188, 134356, 43209, -30950, -31029, -25478, -72590, -145118, -107098, 17106, -13471, -4064, -3702, 12086, 95146, 27048, 25839, 40866, -6269, -50936, 39830, 59037, 85768, 51866, -85348, -46184, -56123, 1348, -7817, 51504, 85754, 83691, 104018, 127187, 179516, 170149, 67180, -9241, -55729, -63631, -70928, -92092, -38478, -17119, 39173, 107794, 126810, 140935, 120814, 77597, 8179, 118192, 164895, 129562, 81800, 123784, 110545, -85110, -252522, -245430, -133363, -32799, -43665, -105768, -188818, -176872, -77197, -89155, -87822, -9118, 8537, 26433, -83475, 5645, -33481, -51380, -61311, -57787, -103228, -27689]
20999b7689N2108p8873k3104j249l796J00515N152j32566r6677K9551J45434n7943
20987h9137m1591O5039K4011m9844k0019M3341J9463k3308o8570l7231J9906j0242
20975a68182J1402l2489L7662M9955j4259M4224Q5359o5277k4349L6005Q1245
20964D1296j5683l3809J08875J32932J12605j58771j14938o5694K5320P9336r2343
20953A9126k9900M4053l8088j40578l0317K0965P6815N370K6140l8303m086P8638
20941a0165j02675J3146R0680l4098l1968L2673j7676j07892K4666J05357M904
20930c3048L311K4521J06680N2321j0380N479R665L6521p8358k13367N2086J311
20918d3258m6869J2371j8827M6966J36106M7070l7840k5450K9309n6525q3346
$$ y = [-27689, 24419, -54454, -77558, -78807, -82603, 17912, 23064, -109502, -206179, -176628, -31194, -89137, -130728, -65689, -41678, -91522, -111541, -68200, -48737, -72045, -140615, -177846, -157940, -168182, -156780, -189269, -151607, -101652, -115911, -71687, 13672, -51605, -75954, -39949, 41296, 25613, -8196, 100679, 233611, 346216, 187445, 72507, 6813, 32133, 111469, 19126, -10774, 33279, -4809, -145387, -175704, -154739, -77924, -72554, -46414, -84717, -88803, -10165, -112840, -99694, -9014, -43112, -75080, -42407, -60083, -167975, -143309, -37952, -33048, -29737, -5216, 101464, 153785, 143405, 148884, 158549, 195070, 116712, -96655, -44569, -43258, -90127, -77756, -96583, -49617, 86489, 133559, 95719, 70269, 99578, 43053, -40293]
20907d0293j4439M4906O723j24750n9314M5792P9428L9047l9018q9650N0735M9372
20895e1461J3500k946p238K5903K4312J5994l5351l8623l1049N8477o3645j8982
20883a11109R9639o905P5746K1205j12524q1201l6260K3291J7465M3801J76682
20872A09830L4526K0929l5391j39384n8312O5309P779L1290q356K6968L4573q8844
20860I17j3007J09975m8856r4101q0935Q399N5215J03386l2454R0500j8788o1455
20848A8796Q0440M8046o1212n8153k9676O1867j8649l531j7410j11180R5610L4837
20836C9785j02870N397M9736J88294K7226p9629K9378j41909p4244m7820L6471
20825g0185O0675m4542K3898P8392N0227j205p2878l1669n8703L2159J08238N5546
$$ y = [-40293, -54732, -9826, -3103, -127853, -187167, -141375, -61947, -22900, -61918, -151568, -100833, -51461, -37961, -40907, -48145, -22242, 2070, 18064, -17287, -55910, -86959, -28482, -92127, -111109, -11470, -18375, 57371, 78576, -33948, -115149, -151409, -128118, -110653, -66852, 109830, 144356, 165285, 129894, -9490, -67802, -2493, 5286, 36576, 28220, 55188, 89761, 917, -12090, 97885, 49029, -45072, -126007, -117608, -62393, 40993, 8539, 99039, 80251, 18796, 99236, 147282, 86070, 27917, -1759, 60108, 41459, 37928, 20518, -90662, 4948, 39785, -63085, -57688, -7952, 180342, 207568, 127939, 157317, 15408, -58836, -106656, -70185, -9510, -54052, -30154, 48238, 98465, 97260, 24382, -7287, -65990, -33831, 74407, 129953]
20813A29953p9332l5422L8274n9029l0546k1895J4778O0374K1205l2842m6348
20802d0830j139K5389L9522n1931p5423m2174L1628L6790N9573L2005L164n2339
20790c5765L4238M150K7154N5100m6183n1499r6141j9737J09929P9927k1327o2151
20778b2305j3750n1759l9343K7058R4397p7378j1798K6979J4162J17333J09525
20767A73121l1600m4520j44598P0830M1391K5915k1012m4215j4389j3532N371
20756B762k9295m6853O8894N8448m9792k3229n5314K4409P595Q117l2450k5534
20744i2242m8463R9990J29438m6399J6510J7519k3577n7481k3772J2904O2406
20733D6833K4027L4307k4705j5075R2696J8820K4485n2390j23029N0399m561p8559
$$ y = [129953, 50621, 15199, 53473, -5556, -36102, -57997, -43219, 17155, 38360, 5518, -40830, -41969, -16580, 22942, -28989, -104412, -146586, -114958, -78168, -18595, 13410, 16574, -35765, -1527, 2623, 29777, 84877, 38694, -12805, -108946, -128683, -18754, 61173, 39846, -22305, -36055, -87814, -127157, -100099, -5702, -83080, -94878, -67899, -53737, 63596, 173121, 141521, 97001, -47597, 23233, 64624, 90539, 69527, 25312, 10923, -2609, 2762, -26533, -73386, -4492, 53956, 4164, -19065, -74379, -49970, -42375, -34258, -66708, -92242, -140705, -40715, 88723, 42324, 58834, 76353, 52776, -4705, -28477, -15573, 46833, 70860, 105167, 80462, 65387, 158083, 176903, 201388, 148998, 25969, 76368, 71807, -6752]
20721f752q8107L1077m3184j3691J6367r1308k2667q2273N5124J44925J84856
20710H4367P7350q1387o2359n3688j37542M1009N8779j05440J25651L1859j01246
20699a22647m8139M3016k3954N7110K1366O3840l4508K2080M2885j30722o785
20688a16458J26721J8282k1967j05784p5782j2130O1297J4528n9272R3581Q1472
20677D488j6385Q0614j808M3084p7340O1477M7689L9309Q5733k1089j24302o6285
20665E5185R5984J3948o9146o6685L2972r002r1361P036J8454L4627M8884j05300
20653c4404q9498j4317J16526K7709r04J13611M1639q1503j25331M0092o2365
20642f8745p3713m074J6726J88061O554j39752k7817O1474K886J43679J662p0565
$$ y = [-6752, -94859, -63782, -106966, -120657, -104290, -195598, -218265, -300538, -245414, -100489, 84367, 161717, 80330, 17971, -35717, -173259, -132250, -73471, -178911, -53260, -21401, -122647, -170786, -127770, -151724, -94614, -73248, -9408, -43916, -21836, 21049, -109673, -116458, 10263, 28545, 6578, -99206, -174988, -187118, -125821, -111293, -170565, -76984, 4488, -11897, 68717, 66909, 109993, 32653, 94130, 141819, 181128, 266861, 245772, 121470, 55185, 151169, 165117, 95971, 29286, 62258, 53256, -38105, -31069, -12615, 22012, 70896, -34404, -123902, -138219, -21693, 6016, 5112, 118723, 160362, 78859, -46472, -6380, -68745, -142458, -146532, -129806, 58255, 64809, -74943, -102760, -41286, -38400, 105279, 106941, 36376]
20630C6376K5254q4187q1039J76357J7479q9450J4022R0150L7667l4732r4613
20619A3284l5211r1719p8936k2370J18253J18183J0111J1330j3784q2509n6422
20608a09790l1600J06890m4836j49124l1218J01361N6558k9680J15047J49853
20598A33461M9531N553q8216n9714O6772J00532L2767j31056K2949Q674q7102
20587E4151j59787n2360J03122P4352o0263j44909k716O4805P1278Q0056N8776
20576H6505n5364l2343q6210N1602o22O0832M1613N2315p4666q4926k2349Q0619
20564A7006K5117J23908P1076o8875j77306J944R4833q7593L285j5006m6785n8356
20552a16752L3104J0586q8840k1180J7602n0519M5054Q4165O3249n9720o2650
$$ y = [36376, 61630, -22557, -103596, 72761, 90240, 790, 14812, 104962, 142629, 107897, 13284, -21927, -113646, -192582, -214952, -96699, 21484, 31595, 42925, 29141, -53368, -109790, -141390, -34500, -79336, -228460, -259678, -158317, -101759, -131439, -16392, 133461, 182992, 188545, 100329, 40615, 107387, 207919, 240686, 109630, 132579, 141253, 54151, -105636, -157996, -54874, 19478, -40785, -185694, -188410, -123605, -52327, 27729, 86505, 31141, -1202, -87412, -35810, -36432, 24400, 66013, 118328, 43662, -41264, -63613, 17006, 42123, 166031, 237107, 168232, -9074, -7130, 87703, 110, 3395, -11611, -58396, -116752, -83648, -73062, -161902, -183082, -165480, -215999, -170945, -86780, -23531, -83251, -145901]
20541a45901J00455J64789r3096L3705J8308j38458r7286J04893l966r263Q0185
20530A4365m4305j06111P6337N9478J78157l7890P483k2368k5897k6475N161r1781
20518a3846j26713l9075L4129L0027J05098M549j03386P9785J8642m1087r0842
20507a42719k306J32634N2665n300k6078q8015j30240J7796L051M9092J02550
20496c6870M7589J5627J670o620l2093m2207r4207R7664M6304m4961N2848J5424
20484B0168J1732J7523k6519l4004o4755p497q802J3469J5408J21673m6454o2392
20472e0450N8433K2077L3920n2542l2957L925Q591K4690j5106q9333j48985o2797
20460c00534J13585O8564j0328N829N6345l0902l6812j13762k9886K1481J30994
$$ y = [-145901, -45446, 119343, 26247, 59952, 78260, -60198, -157484, -52591, -56557, -65820, 14365, -29940, -136051, -59714, -236, 177921, 140031, 147514, 125146, 99249, 72774, 77935, -13846, -140559, -179634, -145505, -115478, -10380, -5831, -109217, -29432, -10790, -51877, -142719, -145025, -12391, 40274, 34974, 8896, -79119, -209359, -191563, -188512, -139420, -36870, 10719, 26346, 28016, 21396, -10697, -52904, -147111, -49447, -3143, -48104, 4744, 20168, 31900, 49423, 22904, -11100, -75855, -83352, -92154, -78685, -63277, 58396, 11942, -50450, 7983, 30060, 63980, 11438, -21519, -17594, -9003, 15687, 581, -88752, -237737, -300534, -186949, -118385, -128713, -122884, -66539, -97441, -134253, -248015, -277901, -256420, -125426]
20449a25426J27151M9158m8206L3847k7598l5315m316m7888J44564R0516j23387
20438C3100j8208J15148Q2160l8108j31254m6698k6274M5304P5304l4462L5410
20427I1422j01598k6686j3972j19808m9009O2969N7986l6350j8743J81358R2512
20416A20081p8957j6173n2111K9433P4377K3362n6598K0657j888r4889j84534
20405b17240l9322P5616L9018Q0242k206K9836K5201k4050n5840Q0089Q7744J3261
20393I2349j1666l9805r2571r0627P0995R9418l6472j20146p512J36123O4628
20382F4714o5128j33305P169M86J12751K8381L1821j14883M2546O5538l502r2680
20370e6092m2586k886j9586j1353m2023K3905J43169J8196l6026L053j24779O449
$$ y = [-125426, 1725, 50883, 2677, 36524, 8926, -26389, -30705, -78593, 65971, 156487, 33100, 14892, 130040, 212200, 174092, 42838, -3860, -30134, 15170, 90474, 56012, 91422, -10176, -36862, -50834, -170642, -219651, -156682, -98696, -135046, -153789, 27569, 120081, 41124, 24951, -27160, 2273, 76650, 100012, 43414, 64071, 62183, -32706, -217240, -256562, -180946, -141928, -61686, -63892, -34056, -8855, -32905, -88745, -8656, 79088, 92349, 80683, 40878, -51693, -142320, -71325, 28093, -8379, -128525, -136037, 86, 64714, -414, -133719, -126550, -126064, -13313, 15068, 46889, -67994, -25448, 40090, 36588, -56092, -98678, -101564, -121150, -132503, -174526, -150621, -7452, 10744, -25282, -22229, -147008, -140559]
20358a40559K355n8798O2474P0299L9316M0919n0539m9926m096L6584m0071p0133
20346a62175J01103J51932K632o311m4083j1898o671M7569j42608l3368P5624
20335b8254k7569O94P4026J35083J9765j2318p9199j16358P0562P2758N1702j18125
20323D2767J7226m1986L2639M9927J9389r7902p9229K9714N9283j5838J2570o4831
20311c6271J488m659M4570O9935M0199p2428j00683l4714k9117M6056L1515j8472
20299f2581J8869p7108j40861P2026J88818P343p3485l0777r0505J06185o3728
20288a45804k356O3240O3979j2589p0393R4081M8338o2965l1534m79J03984Q6290
20276A33792O3790J0475k9349m9310Q421o3920p3531n6985l0307J19297n5409
$$ y = [-140559, -138204, -197002, -134528, -64229, -24913, 16006, -34533, -84459, -88555, -51971, -92042, -162175, -61072, 90860, 93492, 87181, 43098, 31200, 24529, 72098, -70510, -103878, -28254, -55823, -55129, 18897, 153980, 173745, 161427, 82228, -34130, 36432, 109190, 160892, 42767, 59993, 18007, 50646, 100573, 119962, 22060, -57169, -27455, 31828, 15990, 28560, -36271, -34783, -39442, 5128, 75063, 115262, 42834, -57849, -92563, -121680, -75624, -44109, -62581, -43712, -120820, -261681, -189655, -837, 6506, -66979, -97756, -188261, -82076, -145804, -148160, -84920, -20941, -33530, -103923, -9842, 38496, -24469, -56003, -56482, 47502, 133792, 197582, 208057, 178708, 129398, 137819, 73899, 368, -56617, -86924, 32373, -23036]
20265b3036m9743j1266Q3680J38645p3394k5215o9519K2534P116j31528K4311
20254a07415J18690N071j9918j4504k333J0109L7944p7905M0141o3341q6273o8964
20242b28698J27802O6566r7758j5200J76004k8940q1075m6553j8604n120J63461
20231A1885J61387j1194j52023q1511R0223O8568L8524l8481R9903m771q0041
20220A02469l9901j646L5816L3786R221j0403l5601o4353N319m7544k0888j907
20208c5632r6246j9170M0912M4956J14170Q8180k916n7381k2938M0554o8583p4205
20196d8299N4634J4022o8962Q139k1049P4102P065o8833L9891P0890r3567j7721
20184d9688m9199q3178J04952J98166K5337j48286j3525J35547j0425k7961J126
$$ y = [-23036, -72779, -84045, -365, 138280, 64886, 39671, -29848, -7314, -198, -131726, -107415, 11275, 16346, -3572, -18076, -20409, -10300, 27644, -50261, -10120, -73461, -159734, -228698, -100896, -34330, -132088, -147288, 28716, -224, -81299, -127852, -146456, -151576, 11885, 173272, 162078, 10055, -71456, 18767, 87335, 125859, 87378, 187281, 182510, 102469, 62568, 60922, 96738, 130524, 139745, 129342, 93741, 29388, 34707, -12837, -33725, -35632, -131878, -151048, -110136, -65180, 48990, 137170, 134254, 76873, 53935, 94489, 25906, -48299, 6335, 20357, -48605, -40466, -61515, 12587, 19652, -49181, -9290, 61600, -31967, -49688, -98887, -182065, -77113, 121053, 146390, -1896, -15421, 120126, 109701, 81740, 82866]
20173H2866j33068o4395P7636l4876O3665M305m4737J298n8972l1811P6433n0393
20161a12049o6691J6157J76124J5908L4379L484j00262j96440l966M1641O7805
20150a23910P1475N2504L8080j7802m5677l2192j12544Q8208J52717q7867o7553
20139h4561K1229O6936n197m478O4324j24047p5413l3490j6944J15803L3836O8305
20127B6303M2938K1674l2329o1498R4407P8274j28614j61151L1968R3453o160
20116g35M7392J06728p8039j13641L9382R1811Q6187k7562p6632L4971j8714m8322
20104D2826M0557Q3245q5396p4016o951m8792q7583R4497J08776r1018J2698P1417
20092F0260P6135l8843l5961o397p3701j18288m5380O8478K07819J7016n6790
$$ y = [82866, -50202, -114597, -36961, -71837, -8172, -3867, -48604, -47306, -106278, -138089, -61656, -112049, -178740, -162583, 13541, 29449, 63828, 67312, -32950, -229390, -233356, -191715, -123910, -52435, 69, 38149, 20347, -25330, -57522, -170066, -81858, 70859, -17008, -84561, -63332, 3604, -1593, -6071, 58253, -65794, -141207, -174697, -191641, -75838, -42002, 26303, 69241, 90915, 58586, -2912, 91495, 169769, 41155, -119996, -88028, 5425, -735, 46657, 153385, 75346, -38295, 1087, 92898, 179085, 151523, 74891, 109862, 91148, 42826, 83383, 166628, 81232, 7216, 265, -48527, -136110, -41613, 67163, -23855, -11157, 60260, 136395, 97552, 61591, 55194, -18507, -136795, -182175, -113697, 94122, 111138, 54348]
20081E4348j37464m9902j4368R8805Q5424r2440j60504O8433O716N3757J23848
20070C6653J9714q1701n6164k5035q5897J22539J68918O0930j05775N8801L7072
20059A50055q368j5070L3822r361o3672n4562j8407M3104N1039n2021q8967k4796
20047e7204N2734J3969j2694Q3398j0776L0696L5988Q767o975m4061J8015r5825
20035A6032k9285K5709L6512N4971k9079j15709J9295k8573l7245P3497k8553
20024d2428N5768n0511p9078K5143m282k0745K1706J49312p050O442n0107j09045
20012a04875n301O6146J47908j0225j1608J8673O6265M010j05605p7360q305P4781
20000E4504o723K4852j31445k9201J62921J22031P986o1935o9165M8784P9313
$$ y = [54348, -83116, -133018, -147386, -48581, 36843, -55597, -216101, -147668, -140952, -87195, 36653, 56367, -25334, -81498, -106533, -192430, -69891, 99027, 159957, 54182, 112983, 150055, 141687, 126617, 160439, 151078, 87406, 32844, 14437, 57541, 108580, 56559, -32408, -57204, -4470, 9499, -3195, 80203, 69427, 100123, 136111, 144878, 137903, 93842, 111857, 16032, -13253, 12456, 48968, 103939, 74860, -40849, -21554, -50127, -87372, -13875, -42428, 13340, -37171, -116249, -91106, -95388, -116133, -94427, 54885, 47835, 54277, 4170, -104875, -110176, -44030, 103878, 93653, 82045, 100718, 166983, 170993, 65388, -11972, -20277, 54504, 47781, 72633, -58812, -88013, 74908, 196939, 204925, 142990, 73825, 122609, 201922]
19989B01922o4459n3159j05518J4997K6041m7673M5190k6910n1703j21438r3909
19978b76619O8946J67996P1359k6731k1621n5396R682R0764O2343N8423j27703
19967B1443j59619M916j5084P8913P8576n5605l523K4402M6448n0461j29207M5325
19955a13476J45576P6425k4665j2443m5956o0166J27917j458n3724j02275o700
19944g0945K4281k5742j10510Q7281J05189L8560N2012j25673q668j6034l9574
19933h9823P1119j672m4616l0386k0655j0807L3731k9296M4634Q330L8896M0972
19921A0427p9530J2938j8655O9372P6413p8079J31760P0570j00145l9031L1777
19910H7817L3476j36583j79841K3488M6086L5668K3468M408N0090j3021r837r928
$$ y = [201922, 137463, 84304, -21214, -6217, 19824, -27849, 17341, -9569, -61272, -182710, -276619, -207673, -39677, 31682, 4951, -16670, -72066, -62384, 28380, 90723, 149146, 21443, -138176, -133260, -148344, -69431, 9145, -46460, -49983, -25581, 20867, -29594, -158801, -113476, 32100, 108525, 83860, 71417, 25461, -34705, 93212, 91754, 38030, -64245, -70945, -46664, -72406, -182916, -95635, 9554, 48114, 100126, -25547, -34215, -50249, -89823, -18704, -20376, -64992, -95378, -116033, -126840, -93109, -122405, -77771, -69441, -30545, 10427, -69103, -56165, -74820, -5448, 70965, -7114, 124646, 195216, 95071, 56040, 87817, 121293, -15290, -195131, -171643, -125557, -89889, -66421, -62013, -11923, -24944, -34781, -44709]
19898d4709o0100P4132M1130m3438j25063P1412j2901R361o6616M5683k2775N9221
19886g4663n959j57927j24646l7000J02562J24042N3778J00765Q1143k8588j6292
19875A7215l5791j92607N5254J15329O4410K7346M5569K2897n0821K7678j07981
19864a1502k0613P0054N5153n6442m6142M8559o2483M9336n8301p81J18249o0792
19852B4295o513r1348j13418J7984J49617J16080j4076j3710n5667N6227R2944
19841A62415J6277j9778r1303p8526q0083m895J17095J24096Q883n0016R751n4957
19829E8959k4634j13241n0437n4091R4454P6904p2320n9387R0284J22093J14926
19818A83510n6333j3058R8648J1798m1083q8509o5017k1142O984N34j13315O9831
$$ y = [-44709, -104809, -30677, 10453, -32985, -158048, -86636, -99537, -90176, -156792, -111109, -133884, -74663, -80622, -238549, -363195, -400195, -297633, -173591, -119813, -19048, 62095, 33507, 17215, -18576, -211183, -155929, -40600, 23810, 51156, 96725, 119622, 68801, 96479, -11502, -32115, 37939, 93092, 36650, -9492, 39067, -23416, 25920, -32381, -33162, 85087, 24295, 17782, -73566, -186984, -169000, -19383, 96697, 82621, 68911, 13244, 69471, 162415, 178692, 158914, 67611, -10915, -90998, -95893, 21202, 145298, 154181, 104165, 113916, 58959, 34325, -78916, -129353, -183444, -88990, -12086, -84406, -143793, -53509, 68584, 183510, 127177, 114119, 212767, 224565, 183482, 94973, 29956, 8814, 15798, 16332, -96983, -27152]
19806b7152P5826K9501l2202r8759n2638n832R0858N8305j5213j01957n7703Q5385
19794e1581k515Q4223J62059j8630R305q1370L8754K0986p2319m5109m4228l1994
19782c2419j1995J17929m9425j10800M6233L0401K2270K3468J47954l0456k2934
19771A30226o2930q3653J2640L7776p7338k0305Q1724L0457q4796m2008N6871
19760b1336P3037j617j7858K3841O1297n7361K925Q813l8493k0401K853P1973
19748H7673q5968J13787O3414r7666j8617l2982l8782q7034K9968R899r381j7673
19736h3362j0239O300J66384O1008j16696P8287O1510j0901m2446m1766J6445
19725H4524N2783j02762j82186M302J31219O4033j2346j7383r8708J3848K05761
$$ y = [-27152, 48674, 78175, 45973, -52786, -105424, -111256, -20398, 37907, 22694, -79263, -136966, -51581, -54096, 30127, 192186, 173556, 182861, 101491, 140245, 161231, 88912, 43803, -425, -32419, -44414, 73515, 24090, -86710, -40477, -10076, 12194, 35662, 183616, 153160, 130226, 67296, -16357, -3717, 34059, -43279, -63584, 18140, 48597, -36199, -78207, -21336, 51701, 50084, 32226, 56067, 117364, 60003, 62928, 71741, 33248, 12847, 15700, 87673, 1705, 115492, 178906, 81240, 62623, 29641, -9141, -96175, -66207, -56308, -65689, -83362, -93601, -87301, 79083, 140091, 23395, 101682, 163192, 152291, 109845, 68079, 84524, 137307, 34545, -147641, -143339, -12120, 51913, 39567, 22184, -76524, -62676, 143085]
19714A43085R3140p1417p5622r772L1631l471l0927M4160P078j95293p4437J08835
19702c3010J41051J1796J05358n581j20005j02433J2318L8360J37676m5730k7409
19691A12391j6346m6835r5721q7519o8427K0679R2010R0584o8858j08234R0049
19680h6227R8844K0513O230P71L3818Q1845n796m4131p8430q1479K951m652j9035
19667g4778r465j14783J5290P0016J59551J04405q2868k7638N755K0709l2390
19656C3804R138J9590j38402q5070j438J76503R3188j43538j32589L0049Q0565
19645e8200P5172O9284J8430J5576j4797R9558o8397k9449m4091o7957r0966j1175
19633a07012j1646K8062R0801O4982J2669K7618M1584l2391m7128Q2917k5684
$$ y = [143085, 236225, 164808, 89186, 79414, 111045, 107574, 76647, 120807, 127885, -67408, -141845, -33010, 108041, 119837, 225195, 219614, 99609, -2824, 9494, 47854, 185530, 139800, 112391, 96045, 49210, -46511, -134030, -202457, -181778, -89768, 816, -68042, -176276, -86227, 12617, 33130, 39360, 40131, 73949, 155794, 149998, 105867, 27437, -54042, -51091, -55743, -74778, -84243, -199026, -183736, -113720, 45831, 150236, 67368, 39730, 45485, 66194, 33804, 42942, 62532, -75870, -160940, -162378, 14125, 107313, -36225, -168814, -138765, -58200, 16972, 86256, 104686, 120262, 105465, 205023, 136626, 107177, 63086, -4871, -95837, -107012, -118658, -90596, 205, 65187, 77856, 105474, 147058, 114667, 67539, 150456, 124772]
19622A24772p8367M395M2727R617L2014p4173n0069o914q4656M2220L924R5181
19610F0671K8629n8778m578n2437o9439j324J20826Q9966L7412N5545O3814q050
19598B62257o4721n613J0557n0277q6026n8930q475l366L6827O1424Q5068o9869
19586A08856j49334k9365K0520L1859J2738l170q3025n3547K8996N3159M8342
19575a3971K928l3878m0576J2008j4618j1039o5855m2716Q327J32273R5366p4228
19563d5979q6442M6623O4641P8555m3538L0213M04j36861p4857j6114L6100K8718
19551a18537q432o1963N3941J62273n9405p824J04896L2175l6460n5377P6134
19540H1421q8756L833l5360r4660p1256Q1433M2026O4863J81828L8354o6074o4281
$$ y = [124772, 46405, 50800, 93527, 103144, 135158, 60985, 10916, 4002, -80654, -38434, -34510, 60671, 89300, 30522, 25944, -26493, -95932, -97256, 23570, 113536, 150948, 206493, 270307, 262257, 197536, 191923, 202480, 152203, 66177, 7247, -1228, -4594, 32233, 93657, 178725, 108856, -40478, -69843, -49323, -17464, -4726, -7896, -90921, -144468, -115472, -62313, -13971, -11043, -44921, -85497, -73489, -88107, -99146, -165001, -207717, -199390, -67117, 28249, -45979, -132421, -85798, -21157, 57398, 13860, 44073, 44477, -92384, -167241, -183355, -147255, -118537, -126969, -188932, -134991, 27282, -32123, -39947, 64949, 97124, 60664, 5287, 81421, -7335, -3502, -38862, -133522, -204778, -123345, -81319, -16456, 165372, 203726, 137652, 73371]
19528G3371j01314k9483N3005l2554K6129L1941N3822m2737p0766J7049Q6783
19517F5246Q4088O6172j8994r5935J5608n0226m7367M1865Q1150k3442l3670n5991
19505B8504j8246j6976j9670P3933O2809q238p4440M8151m1057p8038J7615k0827
19493d6480j343q6634P710O1663K8802J11218r351j0766j6547j50151J24390Q2779
19481I5290K6677j5280J12065k6393j79575K8606L7780Q2959k5570j75811q3343
19470a22595k8243L1998N0877Q3763J17650N2759j31917l6509m659k7627k849
19459a7352L3401J7348L0951P6713k975j4210N005L7631K0228l5614l5384q4331
19447C1411Q095Q4221R6626p3790n7850m8691r0243J1307N5000j8113J377R780
$$ y = [73371, -27943, -57426, -4421, -36975, -10846, 21095, 74917, 32180, -38586, -21537, 65246, 149334, 215506, 196512, 100577, 116185, 65959, 18592, 60457, 141607, 118165, 84495, 28504, 10258, -6718, -26388, 47545, 110354, 102116, 27676, 75827, 34770, -43268, -25653, -46480, -47823, -134457, -126747, -65084, -36282, 74936, 65585, 54819, 38272, -111879, 12511, 95290, 121967, 106687, 218752, 192359, 12784, 41390, 79170, 162129, 136559, -39252, -122595, -150838, -118840, -67963, 15800, 133450, 186209, 54292, 17783, 13124, -14503, -17352, 16049, 33397, 64348, 141061, 138086, 123876, 128881, 166512, 186740, 151126, 115742, 31411, 39506, 123727, 220353, 146563, 88713, 40022, -50221, -38914, 16086, -2027, -650, 9130]
19435I130P9789j3673q6734j1840n8381p9183R3911Q5427M5965J3629j17291k0827
19423f0078O3993R7931k245J22481O1803o7832O2567l8789j10341r004q5018k4898
19411A0570k0979L9566P0966l5411o3783p1483J60358J15044j28303k1730R222
19400F4037Q4648Q9692L8028n2187M2286j6158j13587O644N6711k822j0763O8078
19388B54607m7790o4806q183k9290K0808l2196j240m7058k3934N5457N7348k3539
19376A10184m991j31595q8759P7100k4967n6992K2206J6738k1780j9500J16148
19365f208J6421l0279j10661m501p6349K5830J46566J20450O05K9816O1301M6468
19353B19459R127j28505l9959p2182j04403O1089J37595j6987o2865j8328M4415
$$ y = [9130, 88919, 75246, -11488, -23328, -81709, -160892, -66981, 18446, 64411, 78040, -39251, -60078, 3915, 101846, 99601, 222082, 283885, 216053, 278620, 239831, 129490, 120486, 35468, 10570, -10409, 29157, 100123, 64712, 929, -70554, 89804, 204848, 76545, 54815, 64037, 148685, 238377, 276405, 224218, 266504, 250346, 136759, 143403, 200114, 197292, 186529, 254607, 206817, 142011, 133828, 104538, 125346, 93150, 91910, 44852, 20918, 76375, 133723, 110184, 105193, -26402, -115161, -38061, -63028, -120020, -97814, -81076, -102856, -122356, -6208, 10213, -20066, -130727, -135228, -211577, -185747, -39181, 81269, 81874, 111690, 172991, 219459, 228586, 100081, 60122, -12060, -116463, -55374, 82221, 65234, 2369, -15959, 28456]
19342B8456m2020l2278L978l2800K6477P4534O4530k2128O1335n4253r3757L4828
19330A6902J4002j49721J1782N9167j9642K8104p590N8524R9923K5873j2845J5355
19318A39834k8599K5951J5366l9132m4030L7282k5074R588L5255K3800j7282j35641
19306b682o6495j419J4492m84O1258Q4158J7851J41845k1717j19351K0784m025
19294A24215Q59J3801O6351R761n1837m5016L5108J01186n4309j49811j00488
19283e0180l5210R0699Q1288o1555q91l8124J8973J00323m558L2980J06342l2349
19271B07738q8034j3295n642L7824o9011j13037O621J02373Q4282j53872m0476
19260d4529J03957J13880k875q4308j67813p0932n085M935J36346Q8348O9614
$$ y = [28456, -13564, -45842, -41864, -74664, -48187, 26347, 90877, 68749, 130084, 75831, -17926, 16902, 30904, -118817, -107035, -47868, -67510, -39406, -46996, 11528, 111451, 137324, 124479, 139834, 111235, 137186, 152552, 113420, 69390, 106672, 81598, 91186, 126441, 150241, 132959, -2682, -69177, -70596, -56104, -56588, 4670, 88828, 106679, 248524, 226807, 107456, 128240, 124215, 125074, 138875, 205226, 214987, 163150, 118134, 153242, 254428, 200119, 50308, -50180, -85390, 5309, 86597, 25042, 24151, -13973, 5000, 105323, 100765, 133745, 240087, 207738, 119704, 106409, 100767, 138591, 69580, -43457, -36836, 65537, 149819, -4053, -44529, 59428, 173308, 170433, 86125, -81688, -152620, -157705, -152770, -16424, 71924, 141538]
19249A41538J992o9113l4602R7222k8473J9099R7766N5835j34433L6969o0706
19238A23094N250L3669j80419j28317K0540M1496M7499r3700p3079n1651R6312
19227a59306J77857L8409J29066p217j43600j3037K5699k4659m9302P7170R886
19216F0966r9229Q673M1936K5668k3839p3723J44315R5318j0671r4695r4640j10452
19204a30373k9069j9535J1717Q7475k1313O7362k6870R0048J7284l3253k8764
19193a5291n7353K1166M5639N1458N2389j3869j19300j10756L7321M7270j9218
19182h0544M9101N0887J49590N766p9260L6366j12638l1834Q136L6553L8004j7651
19170E2476n0005J71875R6055P543o1346k1942j61738n3951O8426O6955l480k4720
$$ y = [141538, 143530, 74417, 39815, 137037, 108564, 127663, 225429, 281264, 146831, 183800, 123094, 128344, 162013, -18406, -146723, -126183, -84687, -37188, -130888, -203967, -255618, -159306, 18551, 56960, 186026, 178809, 35209, 22172, 47871, 23212, -26090, 51080, 60966, -38263, -29590, 12346, 38014, 14175, -59548, 84767, 180085, 169414, 74719, -19921, -130373, -159442, -178977, -167260, -79785, -101098, -33736, -60606, 29442, 46726, 13473, -15291, -72644, -51478, -5839, 45619, 98008, 84139, -35161, -145917, -108596, -61326, -80544, -31443, 19444, 169034, 174800, 95540, 131906, 19268, -12566, -4430, 32123, 70127, 52476, 2471, 174346, 270401, 277944, 216598, 194656, 32918, -21033, 47393, 114348, 110868, 86148]
19158H6148P5238K6776k2772j18897Q746Q4975q645m2026o003N9802q6275n3903
19146C164l8570O5519J932M3238K2243L4671N6258L7751k2670p1401K3908j22203
19134C3840j8941O8807M3791q122r7978k4061k3755r5989K2708M1129L9283n3857
19122g3145L8469P0712M8274o4243j26401k9594k2113r291J32309J06547O8479
19111A40003J1801k8719O8228l7494j66154J1817Q8885q9072K645P1231L961P2253
19099A49385n6724J1718N5779k898l7833j11973l0366J1940O3895j5337L9731
19088G7317n577k4736K0047l7319L495o6376M1513L6513q3135q6594J8401L1213
19076g5238J01459J2930p1310l2545O6366Q1671p6703Q8798J45751J9607k104
$$ y = [86148, 161386, 188162, 165390, 46493, 55239, 140214, 131569, 89543, 83540, 143342, 57067, 3164, -35406, 30113, 32045, 75283, 97526, 132197, 188455, 226206, 203536, 132135, 156043, 33840, 14899, 83706, 127497, 119375, 21397, -2664, -26419, -122408, -99700, -58571, -19288, -73145, -34676, 36036, 84310, 20067, -106334, -135928, -158041, -167332, -35023, 71524, 140003, 151804, 123085, 191313, 153819, -12335, -518, 88367, -705, 1940, 73171, 77132, 149385, 92661, 104379, 160158, 157260, 119427, 7454, -22912, -10972, 52923, 37586, 77317, 71740, 47004, 67051, 29732, 33227, -33149, 8364, 44877, -38258, -124852, -106451, -75238, 26221, 39151, -32159, -64704, 1662, 83333, 6630, 95428, 241179, 260786, 258682]
19065B58682k4494j33511l440Q8986J0572j0734m1428J8015N6061j25805m2227
19054E0677m1642j03160N3606J61272J6653p2621L9274Q8517k370p199R3354m7666
19042B28695j25341O381O4453r9931q0295J0656N7661L8470L4617q8506p311K1177
19030F0726J36823Q7504j3678o5489j21690j14215o0092M1640M4643R4522N0292
19019A40986N0512Q317j11443m6330Q1323N5759n1272O2382K6240K4912N1541
19008B92927k2295j22286P0241J34493k2994m2809l7844M8311J08241j5275r7752
18997B92958m7795J7414N4492J01401O7646N207n3870N0372j469n8826q031j6286
18985D03213k8812n3588j09251q7663j6825P3800j002L7934J3815q5543j8051
$$ y = [258682, 234188, 100677, 97237, 186223, 196795, 186061, 144633, 162648, 218709, 92904, 50677, 9035, -94125, -40519, 120753, 137406, 64785, 104059, 192576, 190206, 183007, 276361, 228695, 103354, 109735, 174188, 74257, -6038, 4618, 62279, 100749, 135366, 46860, 39549, 60726, 197549, 285053, 271375, 205886, 84196, -30019, -90111, -48471, -3828, 90694, 140986, 191498, 199815, 88372, 42042, 123365, 179124, 127852, 190234, 216474, 241386, 292927, 270632, 148346, 218587, 353080, 330086, 287277, 249433, 297744, 405985, 390710, 292958, 245163, 262577, 317069, 418470, 486116, 491323, 437453, 487825, 486356, 427530, 419499, 403213, 374401, 320813, 211562, 123899, 107074, 180874, 179872, 217806, 231621, 146078, 128027]
18974A28027Q4140K579r4049p2295J40256N4241m0300J7597J14011j0396O883
18963C30694p5401m4898r6691K44J5678j10157M5729N8980l035o6415L6420J32309
18951B23457m9576N6888P8754R8887K9254L0992O8774R5185L9852k2865q4995
18940E64607m8647n7319k6982k7575p476o8392R222l1838l8147L7660L5937m9821
18928B91229q7345q2689m8940O1075N085R326j5519r9414K4554Q8838O1764k4023
18916A83941Q819k0185j13237m1094R516J28000P3182R958j31619j2990J626N5923
18904A51840K0196o2633N2607k6550j51457j1752J12118K1638m3717J01203J1168
18893A74661k6542n6883j3992L6496j07105l4354k2895J2891M6879o9143k4581
$$ y = [128027, 212167, 214746, 120697, 48402, 188658, 242899, 202599, 220196, 334207, 323811, 330694, 255293, 210395, 113704, 113948, 129626, 19469, 65198, 124178, 121143, 54728, 91148, 223457, 173881, 230769, 309523, 408410, 437664, 468656, 537430, 632615, 672467, 649602, 564607, 515960, 458641, 431659, 404084, 396608, 328216, 337438, 305600, 267453, 305113, 341050, 291229, 203884, 121195, 72255, 133330, 138415, 147741, 132222, 32808, 57362, 146200, 207964, 183941, 192760, 172575, 59338, 18244, 27760, 155760, 228942, 238900, 107281, 94291, 95917, 151840, 172036, 109403, 162010, 135460, -15997, -27749, 84369, 106007, 62290, 163493, 174661, 148119, 91236, 77244, 113740, 6635, -27719, -50614, -37723, 9156, -59987, -84568]
18882h4568k9180j4535R814P5185Q4079O9866R8781P2364l0908J5223j2395n7012
18870A96714n4015o7784k5595O5585l9620j30539O8244M3992J32357J56984J9646
18859C65969O0586n7871N5166J19880j23130j26587J7531J78459J36219N6482
18849F82704j45072j30620o9366J7154k1955J028K9959n5523m2291J29504p0380
18838C25142l4746k7010o6896j13071L6863J16954J02207O4222j27749j19725
18828A56191p1250O5970O375l8958M8375O3148j9342J4388Q2726N255j46779O5855
18816B31954J32452k8405p0199l8694j2971j00886J4655N5255R1151R8178O8496
18805D40986J75518P8091j06922n7885n0402k2222J19271J16121Q905j7224l3260
$$ y = [-84568, -113748, -128283, -118469, -43284, 40795, 110661, 209442, 281806, 250898, 266121, 253726, 196714, 142699, 74915, 49320, 114905, 75285, -55254, 12990, 56982, 189339, 346323, 365969, 426555, 368684, 423850, 543730, 420600, 294013, 311544, 490003, 626222, 682704, 537632, 407012, 337646, 354800, 332845, 333873, 363832, 308309, 266018, 395522, 325142, 290396, 263386, 196490, 83419, 120282, 237236, 339443, 403665, 275916, 156191, 84941, 150911, 157286, 118328, 166703, 229851, 210509, 224897, 307623, 312878, 166099, 231954, 364406, 336001, 265802, 227108, 214137, 113251, 127906, 183161, 274312, 372490, 440986, 616504, 694595, 587673, 529788, 479386, 457164, 576435, 692556, 701461, 684237, 650977]
18794F50977j129j21331o6848l7378j13279j78608l5067M311k3217R1926J17730
18783B88087j3112J08920l1950O6922L10214L60748K40051j527j92682j51910
18773I83761j18554O7644J41303K0543k13711j58148j84475r2059m2697j13386
18763B90221J789L5460J2832j00099j693j6036j1322j4810q7977j36423J06673
18752G8615J06355K5018j02010L4899r6679k8797n311p4396J10685P2158k8180
18741I2357l4903L464M2451L6450n1131j1646L7737R4661L0991K1102o8174K0164
18729B13523M1930q3180l3875j649q9138m2936N3776J79654Q0313r4052q4854
18718A39512q3243N3128j1351J6211j03910J4555O8493M8404j15840l2880L8948
$$ y = [650977, 649848, 528517, 461669, 424291, 311012, 132404, 97337, 101648, 78431, 170357, 288087, 274975, 383895, 351945, 418867, 729081, 1089829, 1329880, 1328353, 1135671, 983761, 865207, 932851, 1074154, 1094697, 880986, 722838, 538363, 446304, 403607, 290221, 292010, 327470, 340302, 240203, 238510, 222474, 211152, 196342, 108365, -28058, 78615, 184970, 209988, 107978, 142877, 46198, 17401, 12090, -62306, 48379, 120537, 92357, 57454, 60918, 103369, 139819, 88688, 77042, 114779, 209440, 240431, 261533, 193359, 213523, 255453, 172273, 138398, 136749, 47611, 4675, 58451, 238105, 318418, 224366, 139512, 56269, 109397, 98046, 114257, 10347, 24902, 93395, 141799, 25959, -6921, 32027]
18707C2027n9464O4274R9074j9130M5201N4739j5578o9047j39630o9531r6882
18696a73947L9920j2081Q4945R2540q1131p035Q0353O6551J27246J47932K7880
18685C93173l3999n6056q3993Q06K5813j0834r2799l1006L4078P0447n5226j3102
18673A47302R8459J4975m6929k0309q0992j1063J86015n6686q8784K7032J08811
18662B77831r923K9727r155N7763J53845o3370j33082q7375M1507N286o7366o1741
18650A33947P8057J19134r8746L5336J44472k804q2054q008J8032R9008m7105
18639C89269L1073j00591k5960J867n3641O1206J7062j06390q9201Q1339J34381
18628C40414L4983L9328j42632j29436P8645N5774j8884J1611Q0906L4174J0996
$$ y = [32027, -27437, 36837, 135911, 116781, 161982, 216721, 201143, 132096, -7534, -77065, -173947, -134027, -146108, -61163, 31377, -49754, -56789, 23564, 90115, 217361, 365293, 393173, 359174, 303118, 219125, 219931, 245744, 234910, 142111, 111105, 145183, 215630, 160404, 147302, 245761, 260736, 213807, 193498, 112506, 101443, 287458, 230772, 141988, 169020, 277831, 267908, 297635, 288480, 346243, 500088, 436718, 303636, 216261, 257768, 263054, 195688, 133947, 212004, 331138, 232392, 267728, 412200, 409396, 327342, 319334, 337366, 436374, 389269, 420342, 319751, 293791, 295658, 242017, 303223, 320285, 213895, 124694, 206033, 340414, 375397, 414725, 272093, 142657, 221302, 277076, 258192, 269803, 350709, 384883, 395879]
18617C95879J07378Q8651j02172j31160o6822Q5627J9110p9145j8773j09335M1480
18606B30718r19J0102O9378l550r5120K7566j5157l998O2339K19545R2241k1431
18594E71714M2441L9818O0882J06365O0154J2647q8875J6400K1418J03643K45571
18583A192178R6621N7564R4836J02242J5710j06228l961O6183L3028j24459j10280
18572A313434M930n8482l8956r4091k0471j42140j85095l2997R6880K8925L6105
18561I08042o5470j76289p89m2006p7427J9013m8045J4896J00447J41262j40482
18550F33152r0654m837M2554N1742Q8537J29714M0852q072J3105J47345J45044
18539A188482J03662N6325J13546L9792J0141M1774N0420O895L7468L7012n7335
$$ y = [395879, 503257, 591908, 489736, 358576, 291754, 377381, 396491, 317346, 298573, 189238, 230718, 229799, 239901, 309279, 305729, 210609, 238175, 223018, 219020, 281359, 500904, 593145, 571714, 614155, 653973, 714855, 821220, 881374, 894021, 805146, 821546, 842964, 946607, 1192178, 1288799, 1346363, 1441199, 1543441, 1559151, 1452923, 1448962, 1515145, 1548173, 1423714, 1313434, 1318364, 1259882, 1220926, 1126835, 1106364, 964224, 779129, 746132, 843012, 871937, 908042, 842572, 666283, 665494, 623488, 546061, 565074, 517029, 531925, 632372, 773634, 633152, 542498, 537661, 580215, 631957, 720494, 850208, 891060, 882988, 896093, 1043438, 1188482, 1292144, 1348469, 1462015, 1501807, 1511948, 1553722, 1604142, 1611037, 1648505, 1685517, 1628182]
18528A628182k5882l6369o1492l3156o2626k29312k22758m0732k4616O7105R8473
18517A056817o3531m6492p517p0301l8355m0274j71414R2320J97024K2784J630
18506I32691p1289j09330J0233K6694K8955r2739m0131p6202Q349m3842j57735
18495D15654j24627L7878N3863R627o2065J2271P4874J14133o3269q3295j5098
18484C69946j11006j4682J24737L4980K7861j68093O545O9900q737J03671Q0417
18473E15539L9594p993m9654n9050o4972O2706J3024O980k3417M4842K35625J94654
18461I07878M2219m4330q554j0584q96P1410N9251K46621K8787n1510r7044k9726
18449A113522N6614r185j35988q095j6766p4571l5341p6349q5807R489r5770n9995
$$ y = [1628182, 1602300, 1565931, 1504439, 1471283, 1408657, 1179345, 956587, 915855, 891239, 958344, 1056817, 993286, 946794, 939277, 868976, 830621, 790347, 618933, 711253, 908277, 931061, 932691, 861402, 752072, 762305, 788999, 817954, 725215, 685084, 608882, 617231, 573389, 415654, 291027, 328905, 382768, 392395, 330330, 342601, 417475, 531608, 468339, 385044, 369946, 258940, 244258, 368995, 403975, 431836, 263743, 270288, 340188, 331451, 435122, 515539, 555133, 547140, 497486, 438436, 373464, 436170, 449194, 456174, 432757, 477599, 713224, 907878, 950097, 905767, 897213, 886629, 885733, 957143, 1016394, 1263015, 1291802, 1240292, 1143248, 1113522, 1170136, 1160951, 1024963, 1016868, 1000102, 925531, 890190, 813841, 728034, 737523, 641753, 581758]
18437E81758o3730j41632n8469J04479Q5404l4467q6799j884J13405l2174r5554
18426C70337K2041j8781j1648M951J40249P6537j3900m6625P3045M5235K7829
18415F69270M6193J02652P5228r924O6601J11991J28357O8490J53839J03060J34168
18404A649925J03645l458m3791n1461j2638K1287k3036R7992l6277j83448q4185
18393A434555j62845j11066o1798j75913q0078j5307j5216m7112j23374p8763
18383E63083L5070K5742j22280L7084m0020j32856n5417J0676P4563J2558q705
18372C99498Q9783l1460o1292L5590O3359J41696k48j10112P2645N7554L1311
18361F88324Q8160K21339J95115J8660J38470K6687j4740j10425l24o6290j20256
$$ y = [581758, 518028, 376396, 317927, 422406, 507810, 473343, 386544, 384660, 498065, 465891, 370337, 392378, 373597, 361949, 366900, 507149, 583686, 569786, 523161, 596206, 641441, 669270, 715463, 818115, 893343, 883419, 950020, 1062011, 1190368, 1258858, 1412697, 1515757, 1649925, 1753570, 1750112, 1706321, 1654860, 1642222, 1663509, 1640473, 1738465, 1702188, 1518740, 1434555, 1271710, 1160644, 1098846, 922933, 842855, 827548, 812332, 765220, 641846, 563083, 598153, 623895, 501615, 538699, 498679, 365823, 310406, 321082, 395645, 408203, 399498, 489281, 457821, 396529, 432119, 495478, 637174, 636926, 526814, 599459, 657013, 688324, 776484, 997823, 1192938, 1211598, 1350068, 1376755, 1362015, 1251590, 1251266, 1184976, 1064720]
18350A064720J2093R7541N3089k3792j24618K3431p59j63256j02753k1714P934
18339H21916j07793j46951J458J6807p481O4790K0822l7640j3533k8697j35355
18328D48343Q3992M9937K0243M9448j30932K027J60736J21575j4443n3112k4349
18317G13465J8738J9494k3310J495N7089r5714o1251o3229o8437m1491j1740j4095
18305D31014P4053q5151k3905J48707O1917m1574J7251M9061K282M999n450P3458
18293G06662M6616j5773K0186N837L3569N5470j60144j55971J5885K7263l6893
18282E42707J88159K0781j13704n1357O2655J18608J16069k5705j4181k3658l0347
18271G90027o3755O5255k5918O1127R6238n1490j19771j8188l3239l4177o5711
$$ y = [1064720, 1076813, 1174354, 1227443, 1203651, 1079033, 1102464, 1101705, 938449, 835696, 813982, 821916, 714123, 567172, 568630, 585437, 577956, 642746, 663568, 625928, 612395, 583698, 448343, 532335, 582272, 602515, 651963, 521031, 523058, 683794, 805369, 790926, 737814, 713465, 732203, 751697, 728387, 729882, 786971, 691257, 630006, 566777, 498340, 456849, 445109, 431014, 505067, 419916, 396011, 544718, 606635, 565061, 582312, 631373, 633655, 638654, 633204, 706662, 753278, 737505, 757691, 763528, 797097, 852567, 692423, 536452, 552337, 579600, 542707, 730866, 751647, 637943, 586586, 649241, 767849, 883918, 858213, 844032, 820374, 790027, 726272, 791527, 765609, 826736, 922974, 871484, 751713, 733525, 700286, 666109, 600398]
18260F00398j05755o447r049l9595k1846P8785K5698q0308j2317O9484N2167r3821
18248D57394n398J9822Q331j00596m7278L2072m0972Q7546O6336k8019J2658M4543
18236E06439L8970O3962O48N5232O0565j4541N2373L9158J53773J09470J24491
18225A190540q0057j93476q629J44333M6539R3073k0186j68289m7234q1122K3065
18214H98557j4050j28203L2892o166N9166P6249j9809j41614o2766O5800L5965
18203G96021n2996M3060O3628n726o336J1161J07491O3688m5568M6442O204L5828
18191A062897m5313j27210r0162Q6443K12022J38087J7698R674J4426M4631O9327
18180A392520n857M3361J68489M3086J01773k7386j3990J28564J31860K1861q1617
$$ y = [600398, 494643, 488196, 479147, 439552, 417706, 496491, 522189, 441881, 429564, 499048, 551215, 457394, 451996, 471818, 480149, 379553, 332275, 364347, 323375, 410921, 477257, 449238, 461896, 506439, 545409, 609371, 610019, 665251, 725816, 711275, 763648, 802806, 956579, 1066049, 1190540, 1110483, 917007, 908378, 1052711, 1099250, 1192323, 1172137, 1003848, 956614, 875492, 898557, 884507, 756304, 789196, 783030, 842196, 918445, 898636, 757022, 694256, 760056, 796021, 743025, 786085, 849713, 843987, 837651, 848812, 956303, 1019991, 974423, 1020865, 1027069, 1062897, 1017584, 890374, 800212, 886655, 1098677, 1236764, 1254462, 1264136, 1278562, 1323193, 1392520, 1386663, 1430024, 1598513, 1641599, 1743372, 1715986, 1701996, 1830560, 1962420, 1984281, 1902664]
18169A902664n0170q6083j21338K231Q0025N284O9695J07631r9366j7205J22883
18158A916251K4290K2630J30207R4871n1669j6406O856R0292N8631m3188r9653
18147B133112R624R6070Q8382J2593p9671p2517n2041Q3192J06812m9739L1524
18136B307341N1858L5962J0542L4487J99877K23391J7524k3035M521O3483j2338
18125B913613N2377R0585J06427Q7261J19626J70678K10786O2691J42291K39698
18115D196033K91320K69579K75821J91448K89442M29023N80236N03901M59856
18106G486659M99931N76091N96720N77349N71972N49317N05124Q92862J301473
18097A3557498J571112J660617J982946K349692L091848M495568O533773R028163
$$ y = [1902664, 1852494, 1766411, 1645073, 1647304, 1727329, 1732613, 1802308, 1909939, 1810573, 1793368, 1916251, 1940541, 1963171, 2093378, 2188249, 2136580, 2120174, 2127030, 2217322, 2275953, 2232765, 2133112, 2142736, 2238806, 2327188, 2339781, 2260110, 2187593, 2135552, 2218744, 2325556, 2275817, 2307341, 2359199, 2395161, 2405703, 2440190, 2640067, 2863458, 2880982, 2857947, 2862468, 2925951, 2913613, 2965990, 3056575, 3163002, 3250263, 3369889, 3540567, 3751353, 3814044, 3956335, 4196033, 4487353, 4756932, 5032753, 5224201, 5513643, 5942666, 6522902, 7026803, 7486659, 7986590, 8562681, 9159401, 9736750, 10308722, 10858039, 11363163, 12256025, 13557498, 15128610, 16789227, 18772173, 21121865, 24213713, 28709281, 35243054, 44271217]
18089D4271217J0865614J0807042Q982280Q570335J1255171J5451405J8595526
18082A28798590K0591703J9423505J3933409R535218R716621J1052127P428218
18075B20479391J010810j289841J466565K932369k433369p963411q733938j1097321
18067A94371255j9043397k3669000k0650062j5820798j3030205j0921212r788451
18060H1448130j1066462j2336474j1136065q162445n299673l488185k257483j352796
18052B6348547n52927K49892Q97353J497351K445860L818407N458651P906282
18044D8069416J0646981J2100092J1200690R467159J0121901J4300597J8944657
18037A34851493K1509366K1950595J8346131J2763734J2262023J5395447J3872101
$$ y = [44271217, 55136831, 65943873, 74926153, 83496488, 94751659, 110203064, 128798590, 149390293, 168813798, 182747207, 192282425, 201999046, 213051173, 220479391, 221490201, 220200360, 221666925, 224599294, 222165925, 214202514, 205468576, 194371255, 175327858, 151658858, 131008796, 115187998, 102157793, 91236581, 81448130, 70381668, 58045194, 46909129, 38746684, 33447011, 29958826, 27701343, 26348547, 25795620, 26045512, 26942865, 28440216, 30886076, 34704483, 40163134, 48069416, 58716397, 70816489, 82017179, 91484338, 101606239, 115906836, 134851493, 156360859, 178311454, 196657585, 209421319, 221683342, 237078789, 250950890]
18030B50950890M749387k844223l456273J328586N643171K315152o393374j1730544
18022B40562772j3841573j9937995k5710140k4063685j8983116j5703011j3656843
18015A08666409j2313186j3418422j5287567j4711375j1640042q227798n808413
18008B7259606m153257l032133k202821j785151j524940j284709j028035q30940
18000A1417620o60308m27902l55016m27357l88478l09077l22632j29607L5318
17991H432561l7637m1601j83786k58066k51922Q949K49381K26668K50343R8255
17981H493145j32944k65310l49883j78902j68003n9623J45833K18725K85629L03111
17971H291778L64923N11807N41833Q51717J097877J398111J903341K820297M116231
$$ y = [250950890, 255700277, 252856054, 249399781, 250728367, 256371538, 258686690, 252293316, 240562772, 226721199, 206783204, 181073064, 157009379, 138026263, 122323252, 108666409, 96353223, 82934801, 67647234, 52935859, 41295817, 33068019, 27259606, 23106349, 20074216, 17871395, 16086244, 14561304, 13276595, 12248560, 11417620, 10757312, 10329410, 9974394, 9547037, 9158559, 8849482, 8526850, 8397243, 8432561, 8394924, 8353323, 8169537, 7911471, 7659549, 7668498, 7917879, 8144547, 8394890, 8493145, 8360201, 8094891, 7745008, 7566106, 7398103, 7338480, 7484313, 7703038, 7988667, 8291778, 8656701, 9168508, 9710341, 10562058, 11659935, 13058046, 14961387, 17781684, 21897915]
17962B1897915O151993Q237478R776761R189545P116156O988337J0335292J4439851
17954I4133328J3016490M193258l375823l164667Q25186J702211l61409q87623
17946A06080951J671599K311137m218468j2627749j4367560r966476n862940n971362
17938E7049132q090342q962236p551280n043403l239823k364154j762623j419542
17930A8615729j127785q57564n87447m56613l09242R3309L31878O09514P84507
17921A7096286J059307J597930K121621K964239M354477O105808Q619057J2216371
17913E6135096J6243900J9065366J9565227J9543084K1454043K4655614K6493811
17906B03156141K2410377J3860198Q535609M953650O47613l404023n637759n094014
$$ y = [21897915, 28049908, 36287386, 46064147, 55253692, 62369848, 69358185, 79693477, 94133328, 107149818, 111343076, 107967253, 104802586, 105627772, 107329983, 106968574, 106080951, 107752550, 110063687, 105845219, 93217470, 78849910, 68883434, 63020494, 57049132, 48958790, 39996554, 32445274, 27401871, 24162048, 21797894, 20035271, 18615729, 17487944, 16630380, 16042933, 15586320, 15277078, 15370387, 15702265, 16311779, 17096286, 18155593, 19753523, 21875144, 24839383, 29193860, 35299668, 43918725, 56135096, 72378996, 91444362, 111009589, 130552673, 152006716, 176662330, 203156141, 225566518, 239426716, 247962325, 252915975, 253563588, 250159565, 244521806, 239427792]
17898B39427792r15404L308005L25570j1589316k5601145l0291421k4671898j7538786
17890A32453397j6362955j9219155k0508649j7655788j3057275q929392n948307
17883C0771876m151292k774296j888217j401810j068144n70875j84415o3939l81338
17874A8287550n52774l33555r0620J60391N35654J107128J812453K912202M498490
17865B8336919O751454R976045J3434700J5631814J4172027J0812412J0986594
17858A10101965J6854549K3042143J9178406L892920p893189o756786l03055O14800
17850A58731753l056751l475753J066948K147792p797034j9448596k1322357j4849432
17842I1996570r616178j0142163j3221586j4051978j1555524q107460n415005
$$ y = [239427792, 238512388, 241820393, 242145963, 230556647, 204955502, 174664081, 149992183, 132453397, 116090442, 96871287, 76362638, 58706850, 45649575, 36720183, 30771876, 26620584, 23846288, 21958071, 20556261, 19488117, 18917242, 18732827, 18668888, 18287550, 17734776, 17401221, 17310601, 17470992, 18006646, 19113774, 20926227, 23838429, 28336919, 35088373, 45064418, 58499118, 74130932, 88302959, 99115371, 110101965, 126956514, 149998657, 169177063, 173069983, 165176794, 158420008, 158116953, 158731753, 155675002, 152199249, 153266197, 155413989, 147616955, 128168359, 106846002, 91996570, 82380392, 72238229, 59016643, 44964665, 33409141, 25301681, 19886676]
17835A9886676l721796k784411k082042j521743j096004q58737q24002p49171
17827F248770m66152l99871l09173k45637j78535j95660j68185j48726j41988
17818C994843k12815k52276j62922j82955j12614j51747l49376l13224k17174
17809B039740p9748j46011k13781p8309j99856k37515j44501r4224L566J05822
17799I55183K2070o6784L7602p9334j00514j3651P624Q5351J41161P3082J06666
17788A168456n6233j12172j25043q0304n8374l5299N785q3134k8730K0556J29479
17777G44987Q147J3666l2578j20728p4186n8456J05L6131j2056p514l9667J21015
17765E78866P1788k3667o7024j90705j04035M0568l7618P5623Q4432J5105l576
$$ y = [19886676, 16164880, 13380469, 11298427, 9776684, 8680680, 7821943, 6997941, 6248770, 5782618, 5382747, 5073574, 4827937, 4649402, 4453742, 4285557, 4136831, 3994843, 3782028, 3529752, 3366830, 3183875, 3071261, 2919514, 2570138, 2256914, 2039740, 1959992, 1813981, 1600200, 1521891, 1322035, 1084520, 940019, 845795, 849361, 955183, 977253, 910469, 948071, 868737, 768223, 754572, 762196, 847547, 988708, 1061790, 1168456, 1112223, 1000051, 875008, 794704, 736330, 701031, 706816, 623682, 594952, 615508, 744987, 753134, 766800, 734222, 613494, 539308, 480852, 480957, 517088, 505032, 497518, 457851, 578866, 650654, 626987, 559963, 369258, 265223, 305791, 268173, 343796, 428228, 443333, 439757]
17754D39757l6796N6311K04071K5463L6442J06745J60678K95805J74896K14165
17744A677537L27321K85493J56450n2747j13890k39874k44402k31993j12358j31974
17734A319563j31610J6059r0577j03030j6760K4983L3389l0954j05802j14371
17724H00890j527n5784j38082O1531J23148p2332n6516k6108K9288r8333j49888
17713D16287p0181J9366L635J6505m1577j116K6833k302j032l1562l6098N7683
17701C56441J7832n0108P7069M3988M9430N8595p9192o3701R5393J03936R7565
17690G07248M9983j7794l1277N409J38812j6310n8012R2421P5728J0236O3630
17679A020074Q6048K7576O6777J34244K0824j80511N21K0787o8805n6290m7409
$$ y = [439757, 402961, 459272, 663343, 688806, 725248, 831993, 992671, 1288476, 1463372, 1677537, 2004858, 2290351, 2446801, 2394054, 2280164, 2040290, 1795888, 1563895, 1451537, 1319563, 1187953, 1204012, 1113435, 1010405, 993645, 1018628, 1052017, 1021063, 915261, 800890, 799363, 743579, 605497, 667028, 790176, 717844, 661328, 635220, 664508, 566175, 416287, 346106, 365472, 369107, 385612, 344035, 342919, 369752, 367450, 366418, 334856, 298758, 356441, 374273, 324165, 401234, 445222, 494652, 553247, 474055, 410354, 505747, 609683, 707248, 757231, 739437, 708160, 713569, 852381, 836071, 778059, 870480, 946208, 956444, 1020074, 1106122, 1133698, 1200475, 1334719, 1355543, 1175032, 1175553, 1196340, 1127535, 1071245, 1023836]
17668A023836j14364j56879m5110Q3541r29p1162L5916n0144O4645J01151j0814
17657H59687n0520J3327K6691n171J37825N776m7838q8008Q608L3224q7499k9509
17645G76593o3765M7723k4677O424O8387j36444j08423j1997M1096J48563J4024
17634G57504P7400M8614J41608J59723P6999P4053K0271l3261k8536j01753p7227
17623A115395Q0061J33901Q7662J78468R0908M8309j0976r6438r7153N2429J40337
17612A722903L8759r1408L6689N3044P7638K2882K1140Q3287j2630j4902r9521
17601A837881K3344J33015m743m1046R5513J22740J10616J26396J20961J13216
17591B637893J28020J00293N4381j6653o4176m146J2136L1503j7585Q7814N3569
$$ y = [1023836, 909472, 752593, 707483, 791024, 790095, 718933, 754849, 704705, 769350, 870501, 859687, 809167, 822494, 849185, 844014, 981839, 987615, 939777, 851769, 860377, 893601, 806102, 776593, 712828, 760551, 735874, 742298, 810685, 674241, 565818, 553821, 594917, 743480, 757504, 834904, 883518, 1025126, 1184849, 1261848, 1335901, 1356172, 1322911, 1294375, 1192622, 1115395, 1195456, 1329357, 1417019, 1595487, 1686395, 1734704, 1723728, 1627290, 1530137, 1582566, 1722903, 1761662, 1670254, 1706943, 1759987, 1837625, 1860507, 1881647, 1964934, 1952304, 1937402, 1837881, 1861225, 1994240, 1989497, 1948451, 2043964, 2166704, 2277320, 2403716, 2524677, 2637893, 2765913, 2866206, 2920587, 2903934, 2839758, 2835612, 2847748, 2879251, 2861666, 2949480, 3003049]
17580C003049O6183q0572j49122o3935J53213K55326J35859J16587J65404k8433
17570C573559J32267K09057K42694K35149K39789J91324P9107P2827K31088L42016
17560E548877M83937N31005L05369L00017J52698J81631L1568J62037K94371L39043
17550H330553L31273L60116L68459N40483O52888Q36231J062701J174710J491191
17541A5148605J745921K345557L288783M686587O582680R366811J3918988K0877085
17533G7961017L0167950L8336552L8286618K3134321o61885j3109071m998229
17526A89117273J5293109K9867724K4295295o283859m0429576n4623085m6987656
17519A10249225l2077302j9957789j2110478p731823n271645l748762k797728
$$ y = [3003049, 3069232, 2988660, 2839538, 2775603, 2928816, 3184142, 3320001, 3436588, 3601992, 3573559, 3705826, 3914883, 4157577, 4392726, 4632515, 4823839, 4902946, 4975773, 5206861, 5548877, 6032814, 6563819, 6869188, 7169205, 7321903, 7503534, 7535102, 7697139, 7991510, 8330553, 8661826, 9021942, 9390401, 9930884, 10583772, 11420003, 12482704, 13657414, 15148605, 16894526, 19240083, 22528866, 27215453, 33798133, 43164944, 57083932, 77961017, 108128967, 146465519, 184752137, 207886458, 207224573, 194115502, 189117273, 204410382, 234278106, 258573401, 252289542, 211859966, 157236881, 110249225, 78171923, 58214134, 46103656, 38371833, 33100188, 29351426, 26553698]
17512B6553698k054626j405141q68860m64839l31899l09185k23512R1294L91516
17503B1378446L02727P5188Q3624L37611Q82984J419274J640849J802820K250018
17494C0173541L061637M195970N829064Q080335J1156402J5989058K3583853L3882509
17486A35952369M5058439N2425241M9938948L7802623K1102075J4263257K5211775
17479C81754727M1823016L9594504J0296424k5258297m7875705m6521232k7157288
17472C26656149j312470J9633806K7455481K4563784K1005840J8817920R110625
17465D45931135j0208441k7274690m0014490m5815104m4544129l8978193l6159338
17458B02936750l5549115l2114627k6695824k1467378j6644158j1940613q130778
$$ y = [26553698, 24499072, 23093931, 22225071, 21760232, 21428333, 21119148, 20895636, 20986930, 21378446, 21681173, 21756361, 21839985, 22177596, 23060580, 24479854, 26120703, 27923523, 30173541, 33235178, 37431148, 43260212, 51340547, 62496949, 78486007, 102069860, 135952369, 181010808, 233436049, 283374997, 321177620, 342279695, 356542952, 381754727, 423577743, 463172247, 473468671, 448210374, 400334669, 353813437, 326656149, 325343679, 344977485, 372432966, 396996750, 418002590, 436820510, 445931135, 435722694, 408448004, 368433514, 322618410, 278074281, 239096088, 202936750, 167387635, 135273008, 108577184, 87109806, 70465648, 58525035, 50394257]
17451E0394257n535096l735618k798661k214708j689638o50667N33802J805308
17443C6108979L379756N724042R349605J4672552K1838806K7877532K6982026
17436A45933298J4309380k530422r157945j149586J3533505K2884132J6586359
17429B00408721n427804k5516115k9691187j9278112m194975R937720K1258315
17422A47496563K9874238L6422485L6959432K9074240K1286374J6704199Q002846
17415C25820377m184668j1113073j6560792k2996099k6663057k7934833l1803192
17408A84564663l4676422l2474711k7027604k1495238j6420463j1492567p840255
17401C3137403n605585m338935l371379k658956k017190j670283j394960j124613
$$ y = [50394257, 44859161, 41123543, 38324882, 36110174, 34420536, 33769869, 34303671, 36108979, 39488735, 45212777, 54562382, 69234934, 91073740, 118951272, 145933298, 160242678, 157712256, 148554311, 147404725, 160938230, 183822362, 200408721, 194980917, 169464802, 139773615, 120495503, 116300528, 126238248, 147496563, 177370801, 213793286, 250752718, 279826958, 301113332, 317817531, 325820377, 321635709, 310522636, 293961844, 270965745, 244302688, 216367855, 184564663, 149888241, 117413530, 90385926, 68890688, 52470225, 40977658, 33137403, 27531818, 23192883, 19821504, 17162548, 15145358, 13475075, 12080115, 10955502]
17393A0955502j019381p69492p48837o41933n27302n07928m94761n67237n82118
17384E096513m70277l23581k53421l71136m18781k37664k46100l13095k27458
17375B235000j72435k0924r2684m0992o1173p8121l5704O331o9511K6745q3945
17364A612587j96490k25111j34005j79242r2880L7259K933r9659m0244k0130l6303
17353F28715Q2322M4358P239Q0104J49035j02141N0173k1359k1360l2331p6787
17342G87968P061j05571l2138k6943r9044j0539L9305L7059r2184k9042N2962
17331E28894m6413j83107r2990k7718k4766J6215Q1102P7107j9592Q5130K4698
17320D18560M3574j47504j41170R184p6967j43376L5329J33377M2982R2391R7495
$$ y = [10955502, 9936121, 9166629, 8417792, 7775859, 7248557, 6740629, 6245868, 5678631, 5096513, 4626236, 4302655, 4049234, 3678098, 3259317, 3021653, 2775553, 2462458, 2235000, 2062565, 2041641, 1948957, 1907965, 1846792, 1768671, 1732967, 1739298, 1669787, 1696532, 1612587, 1416097, 1190986, 1056981, 877739, 784859, 822118, 825051, 725392, 685148, 665018, 628715, 711037, 755395, 762634, 842738, 991773, 889632, 939805, 918446, 897086, 864755, 787968, 795029, 689458, 657320, 630377, 531333, 520794, 560099, 597158, 504974, 475932, 528894, 482481, 299374, 206384, 178666, 153900, 170115, 251217, 328324, 308732, 393862, 418560, 462134, 314630, 173460, 182644, 105677, -37699, -2370, 131007, 173989, 266380, 363875]
17309C63875J64721P4034n0903q4359R7861P09K0967M71k8192L7175j6149J48688
17297G28898j517J5654M4935N8243p5473m1950l1020O343l4187m9697k8036M857
17285E97050j7805M1748J13912k3447q2106M4806j49218L0292j1878j0154K3103
17274E56303q233J1963l1649k07222m2385q4863j57423K074R0270n5561j94760
17263a21486M1786R0439J86608R6406p2392M4531M1328J44211P1859M2257J1313
17252E76860N2845r2370q3912O6847Q9065j1688R186l4732n6098q5982J0491O6135
17240E06647K0745q1587l028j0466o5600P6696n5907m7223J18899O9005J67836
17229F96017L2148o1493r5040j28545j37439O304J16940J14626N7606r4899r4220
$$ y = [363875, 528596, 602630, 551727, 467368, 565229, 565938, 586905, 587376, 559184, 596359, 580210, 728898, 727381, 743035, 787970, 846213, 770740, 728790, 697770, 704113, 669926, 620229, 592193, 597050, 579245, 620993, 734905, 711458, 629352, 674158, 524940, 555232, 543354, 533200, 556303, 548070, 560033, 528384, 321162, 278777, 193914, 36491, 38565, 128835, 73274, -121486, -79700, 10739, 197347, 293753, 221361, 265892, 307220, 451431, 523290, 565547, 576860, 629705, 537335, 453423, 520270, 609335, 597647, 606833, 572101, 516003, 430021, 440512, 506647, 527392, 445805, 442777, 432311, 366711, 443407, 387500, 340277, 459176, 528181, 696017, 728165, 666672, 571632, 443087, 305648, 311952, 428892, 543518, 601124, 506225, 412005]
17218D12005j0426J1055l1222r4788j08302Q0644l2871m30m9024o3795k54198
17207a41352p8185J67070R3785l6878n0461L0564Q9127J9186j0242l3266J1523
17196F0871J21281J9551J3716n9707l0485m91L6571o8448m4694N1407O6183N6644
17184B22399k2001p3269l4458J18798Q3232Q1360p6102l2600q973n5459P368k7886
17172A82409N5495L608K2393M0089q0611o053J29191p999p4580r7106n9851n8360
17160D8625n4639p4220o0558L4813P8238j8060L4721o45j45242j20635j2567J37111
17148a53058r4282K194k4675N5646N3688m1557M1189K6087O4319K6077R937q2271
17136a16706K4108J00003R6740N5109O8045j42913r8491p9044o4510N5176r008
$$ y = [412005, 401579, 412634, 381412, 286624, 178322, 258966, 226095, 225665, 176641, 112846, -141352, -219537, -52467, 41318, 4440, -46021, -15457, 73670, 92856, 82614, 49348, 60871, 182152, 201703, 215419, 155712, 125227, 124736, 161307, 92859, 48165, 99572, 165755, 222399, 200398, 127129, 92671, 211469, 294701, 376061, 299959, 267359, 258386, 202927, 210295, 182409, 237904, 241512, 263905, 303994, 223383, 217330, 346521, 338522, 263942, 166836, 106985, 48625, -6014, -80234, -140792, -105979, -27741, -45801, -11080, -11725, -156967, -277602, -290169, -153058, -247340, -245146, -269821, -214175, -160487, -202044, -160855, -134768, -70449, -44372, -34435, -116706, -92598, 7405, 104145, 159254, 227299, 84386, -14105, -93149, -157659, -102483, -111491]
17125a11491j7850P08k7456N4806L1806n821J1465O7869J04406l8840J70987l9858
17113B00731j67873l7279J21661m6792n6519k1497K0496p1391q906m4996R2326
17102b0039O9093k0623j44500k9983m2263n6476o1994K1368Q1961O4132J16519
17091b2805J12217l1747j72069m6787J00920M8496k6448N5128j26868j01389R4503
17080a16849R50p392j4270o9613j4269N2331J16597L179q0362K1189M1524M4738
17068b2247p9885o1431P9071O0776l2192n9875m2932j485O693l6816K639N6189
17056a31495K999R835j9624L1039J6951k1801O3876k2829p4959R2117O5757Q4506
17044I6372p7192l1880M3037m6746k3292N5895J827p076q8004q0994P1167J40992
$$ y = [-111491, -129341, -128633, -156089, -101283, -69477, -75298, -63833, 4036, 108442, 69602, 240589, 200731, 32858, -4421, 117240, 70448, 13929, -7568, 12928, -58463, -67369, -112365, -20039, 49054, 28431, -116069, -146052, -188315, -244791, -306785, -285417, -203456, -139324, -22805, 89412, 57665, -114404, -161191, -60271, -11775, -38223, 16905, -109963, -211352, -116849, -115899, -123291, -137561, -207174, -221443, -169112, -52515, -49336, -129698, -108509, -66985, -22247, -102132, -163563, -84492, -23716, -55908, -115783, -158715, -160200, -153507, -190323, -187684, -131495, -128496, -118661, -138285, -107246, -90295, -112096, -48220, -71049, -146008, -53891, 11866, 96372, 19180, -12700, 30337, -16409, -39701, 16194, 18021, 10945, -77059, -158053, -86886, 54106]
17032E4106k8457m0722n5842J9436L9112M6228K9516Q5730J77142Q8622J58120
17021E72991J66401O1629M8718R5376l9308J881N86l3753l8070r7892k34232j78845
17009C25482j88192q8587K18130J17052k0735q5663o7199r9013M4356P6057M8723
16998B80411k02356K3955N5501O7266n173j25641j26300m8431R2813P786j7226
16987B605P4778P3554L1412J35462J4372n7737m4351L4208L2020J97658K33082
16976G27063K04449K16545L82046K14434M3723r3260j70197J6595J38740R1040
16966A771178j05485j64152j93217k55417k39440j10652o2208K2805L8173J48801
16956H50386K56187K78148J11034J47634J28753k9006l9183M441K6776N9357j01886
$$ y = [54106, 25649, -15073, -70915, -51479, -12367, 33861, 63377, 149107, 326249, 414871, 572991, 739392, 801021, 849739, 945115, 905807, 907688, 908274, 874521, 836451, 738559, 504327, 325482, 137290, 48703, 266833, 383885, 363150, 277487, 210288, 111275, 155631, 231688, 280411, 78055, 102010, 157511, 224777, 219604, 93963, -32337, -80768, 12045, 19831, 2605, 77383, 150937, 182349, 317811, 332183, 274446, 230095, 264303, 296323, 493981, 727063, 931512, 1148057, 1530103, 1744537, 1788260, 1695000, 1524803, 1541398, 1680138, 1771178, 1665693, 1501541, 1308324, 1052907, 813467, 702815, 640607, 663412, 701585, 850386, 1106573, 1384721, 1495755, 1643389, 1772142, 1743136, 1703953, 1708394, 1735170, 1794527, 1692641]
16945A692641l20093k73794j28558r7166j83052k12222j19483p2707p1981p2151
16935A41434q4029O9422J00701p8804m1322N2737J80482K23098K34763K77109
16925A075591M2439j17637k1284j7609R1163q5499j17554j81276j72461q0269
16915D15604r5604j00970p107N7052r0665q0641J43442J54821J96493K09849J24475
16904I26749J63238J79312M7179L2768R5709J07630J4527q3021L8073r1018j99411
16893A231735k92780k23816k15217k41798o1476k2115p8083N2259l3841p2223
16883D2645n2763j11106p2418J9373N5145j03122J0600Q2504j3956M0350l005
16872a05753r7128j5766N0986P8289l741p974L7447N9590R9244k9927m3922J0807
$$ y = [1692641, 1372548, 1098754, 970196, 873030, 689978, 477756, 358273, 285566, 213585, 141434, 57405, 126827, 227528, 148724, 107402, 160139, 340621, 563719, 798482, 1075591, 1118030, 1000393, 979109, 961500, 1052663, 967164, 849610, 668334, 495873, 415604, 320000, 219030, 211923, 268975, 178310, 97669, 241111, 395932, 592425, 802274, 926749, 1089987, 1269299, 1316478, 1349246, 1444955, 1552585, 1567112, 1484091, 1522164, 1431146, 1231735, 938955, 715139, 499922, 258124, 196648, 174533, 96450, 148709, 114868, 42645, -10118, -121224, -193642, -174269, -119124, -222246, -211646, -129142, -143098, -102748, -105753, -202881, -218647, -167661, -89372, -93113, -101087, -63640, -4050, 95194, 65267, 21345, 32152]
16860C2152N1773m0544M9764j02431j16843k2286L3880O5379O6124m2180l9156
16849f4368P091m3637j65115n4311N3910M9973M9235L2727K0296p100j1350K4307
16837a08342r3608j27675k4995J13670L5553K0777J6666M0761J0340p5557K327
16826a90083J19610Q27j19111O2523K8839k0907j074K9885K037o2516j27839j33828
16814d11637N4496L8085J00689J47164L5199N8945l2724k4107l1811p8715P4446
16803f9970K0743j4967L6428k7013n8412m8423K1397j8316p6618N9637P0603m9794
16791a54705j460L9607j08202n3252k403L2560J6910N9667J03083M3073M6649
16780B1527J33772L1346j47824j28537k25350n9545m0969R017J93381K2324k7631
$$ y = [32152, 83925, 43381, 93145, -9286, -126129, -148415, -114535, -49156, 16968, -25212, -64368, -57277, -100914, -266029, -320340, -266430, -216457, -167222, -134495, -114199, -121299, -132649, -108342, -201950, -329625, -354620, -240950, -205397, -184620, -167954, -127193, -116853, -192410, -190083, -70473, -69646, -188757, -126234, -97395, -118302, -119376, -89491, -87454, -149970, -277809, -411637, -357141, -319056, -218367, -71203, -36004, 22941, -9783, -33890, -65701, -144416, -69970, -49227, -64194, -27766, -54779, -113191, -161614, -140217, -158533, -235151, -175514, -104911, -154705, -156165, -116558, -224760, -278012, -280415, -247855, -230945, -171278, -68195, -25122, 21527, 155299, 186645, 38821, -89716, -315066, -374611, -415580, -406563, -213182, -190858, -218489]
16769b18489p3549r4050J1477J00998L5020R1126R4546q0844r0987k0407j05219
16758c50378J36822J23378R9586j7932j42053L933k6973j03962n9569K02O6930
16747b70016l4278l9106Q2571L9479j4773O6977l3128P0044J62493j2790p70q9084
16735g2381l5368R0722j35949p8471r4847k8427m5538l302J56074N8964j4338
16724b02861O5017J37930Q5548o3925r9562p4760o4663J01206j9708j40228k9513
16713c05519R5605K4345l461M357K5544K930P5539Q3208J7499j02591k5346o5897
16701a73787J9265l2445l1265K9812N0068p4822l1566K3384K9446R6341K818L3825
16689e8926J03842n613j06178p7661j8345N7257J1836q2943k0015K5623J05555
$$ y = [-218489, -292038, -386088, -374611, -273613, -238593, -147467, -52921, -133765, -224752, -245159, -350378, -213556, -90178, 9408, -8524, -150577, -146644, -173617, -277579, -337148, -336946, -270016, -304294, -343400, -260829, -221350, -236123, -169146, -202274, -132230, 30263, 17473, 16703, -72381, -107749, -17027, -152976, -231447, -326294, -354721, -400259, -403561, -247487, -188523, -202861, -137844, 86, 85634, 21709, -77853, -152613, -217276, -116070, -135778, -276006, -305519, -209914, -185569, -189030, -184673, -159129, -156199, -80660, 2548, 20047, -82544, -107890, -173787, -154522, -186967, -218232, -188420, -138352, -213174, -244740, -221356, -191910, -95569, -92751, -58926, 44916, 39303, -66875, -144536, -162881, -105624, -93788, -176731, -196746, -171123, -65568]
16678f5568N1887r4355j20244O1514J10200k0089p3954M9269M1132m6172P6129
16667c0251n0515j46985n7938M2405K7417l1400N6114k1750p3236r3603O0616
16656c19126J10568r818N88J16819L3531l1060j7516p2270P5175P7070P321n5694
16644h4412l4456K6865L085l2998j48193o0340Q7342P2184M4465k4185o1394O5659
16632a46378K2112N2522N0134m5468q4201j00415J3657J73773Q1403P9854j5511
16621H1482m8250j04191j12576J3681R4866l3530K2065L8365l0940m1479r0132
16610b10639p2441J62402j2391j8324L266M4150o0179j0578L752J9357m2984k4874
16598b19483M0455m017j8680M9217J0149q7275Q1926Q0367l5432n2711k2520P4021
$$ y = [-65568, -13681, -108036, -228280, -166766, -56566, -76655, -150609, -101340, -60208, -106380, -30251, -80766, -227751, -285689, -243284, -215867, -247267, -191153, -212903, -286139, -379742, -319126, -208558, -218376, -217788, -100969, -67438, -98498, -116014, -188284, -113109, -36039, -28718, -84412, -118868, -92003, -88918, -121916, -270109, -330449, -243107, -170923, -126458, -150643, -212037, -146378, -124266, -71744, -21610, -67078, -151279, -251694, -238037, -64264, 17139, 96993, 81482, 33232, -70959, -183535, -169854, -74988, -108518, -86453, -48088, -79028, -120507, -210639, -283080, -120678, -133069, -151393, -148127, -103977, -164156, -174734, -170982, -151625, -194609, -219483, -179028, -183045, -201725, -152508, -142359, -229634, -147708, -67341, -102773, -155484, -178004, -103983]
16586a03983P0402p2208o4651P9174O5694p1386r9950O2189K8681J1754L1705
16575f2579M7990n0239l6882m9842j52827K2093o833L245O9477M9975N581r872
16563a70713P522P992Q483j4529N761O6928J9715M227n1470N7954J0072J42j3292
16550f1208q5268L8604l0809m1864N0355l9650K6740O5862q1494q2050q26L3657
16538b07951R2567l2846p884J53083J27616j7069q5678m7725P2476O713j79021
16527a25719K5879P2598k3646J3001o4784O3875Q9838j6335l6587M8256k6174
16516B0202n5099n1288l7091j626J034K171N7655j2699j8413j18579Q0811M7876
16504h5046R5352J2964J8141K5201p4868o0078o2111L3300j9464m5044M0925L6734
$$ y = [-103983, -33581, -105789, -170440, -91266, -25572, -96958, -196908, -134719, -106038, -94284, -62579, -14589, -64828, -101710, -151552, -304379, -282286, -289119, -285874, -216397, -166422, -160841, -170713, -163191, -155199, -146716, -161245, -155484, -88556, -68841, -64614, -116084, -58130, -48058, -47916, -61208, -146476, -107872, -138681, -180545, -130190, -169840, -143100, -77238, -158732, -240782, -241608, -207951, -115384, -148230, -156114, -3031, 124585, 107516, 21838, -25887, 46589, 53302, -125719, -99840, -27242, -50888, -37887, -102671, -38796, 51042, 34707, -1880, 46376, 20202, -34897, -86185, -123276, -124902, -123868, -121697, -64042, -76741, -95154, -213733, -132922, -85046, 10306, 23270, 41411, 66612, -8256, -68334, -130445, -97145, -116609, -161653, -120728, -83994]
16492h3994N8994k018l8785o1867M6988N3111O6018J2759K2172j22005L1027p504
16480b5104m6945j6396m0947l4731m4110k3280P8099J57563k7718j97905N0382
16469a71092K0747j2775q0573J8996k2371O5037Q3987k8903r2045Q326N8789N439
16457a46438J01556m3115p6093l5781L7948L5732m8369J7386M5751r0643j7041
16446b19107L0365l8940L1919J22750o0047L3119l439m2649J6346P4293O344r2010
16434a41056p6570J005m728l4628R0862J79152k926j58859R9426J31936j50938
16423f7324j9879P5802K9337j7344J9965q054o2947J8340J6890R7830p7076m2569
16411c7029J5825m172j3278k7087K6493J0273J0994M923l2703p6362R1010K9286
$$ y = [-83994, -25000, -27018, -65803, -127670, -80682, -27571, 38447, 51206, 73378, -48627, -17600, -25104, -72049, -88445, -129392, -164123, -208233, -231513, -153414, 4149, -23569, -221474, -171092, -150345, -163120, -243693, -224697, -247068, -182031, -98044, -126947, -218992, -210666, -151877, -146438, -44882, -87997, -164090, -199871, -161923, -126191, -174560, -157174, -111423, -202066, -219107, -188742, -227682, -195763, -73013, -133060, -99941, -103380, -146029, -129683, -55390, -49046, -141056, -217626, -216621, -221349, -255977, -165115, 14037, 11111, -147748, -48322, 83614, -67324, -87203, -11401, 17936, 592, 20557, 12503, -50444, -32104, -15214, 82616, 5540, -37029, -21204, -25376, -38654, -65741, -39248, -28975, -17981, -13058, -45761, -122123, -31113, -1827]
16399a827o0002k2103o2532k1372L3777k7892N5818M9278o8197p7316m3058R4773
16387a50653J0874k8736Q0129R1638q7611j07184q7074r9903J59654J02254M443
16376a12169L8766k3706p4939q9830L1525J38504J4994j02075R1614J54809k539
16365F4954r7903P8881J06206q6115l9656J1891J24873j8658l9221m0910j30505
16354f6163K2281L3752R9432q376j4174K6398r4322j76008r0627M5700O0329Q5901
16342g5877k0251l0096l9748k7734R5486J08238k4091j8516j03989n7013J1378
16331a82213Q2094O9112j15485j9269P6496p3615J00143J3818j78683q3891k0636
16320c32129N9377J2808K103R4459P1340m17r3515R4585R0140r5493L1453N7074
$$ y = [-1827, -61829, -83932, -146464, -167836, -134059, -161951, -106133, -56855, -125052, -202368, -245426, -150653, -139779, -168515, -88386, 3252, -84359, -191543, -278617, -378520, -218866, -116612, -112169, -73403, -97109, -172048, -261878, -230353, -91849, -76855, -178930, -87316, 67493, 64954, -32949, 45932, 152138, 66023, 26367, 38258, 163131, 144473, 105252, 64342, -66163, -43882, -10130, 89302, 80926, 66752, 93150, -1172, -177180, -267807, -222107, -161778, -75877, -96128, -126224, -165972, -193706, -98220, 10018, -14073, -32589, -136578, -193591, -182213, -100119, -31007, -146492, -165761, -89265, -162880, -62737, -48919, -227602, -311493, -332129, -272752, -259944, -257841, -163382, -92042, -92459, -185974, -91389, -1249, -96742, -65289, -8215]
16308h215M5827l9412K9651K9999M2480k1763j13340n0491R957L0414K145Q846
16296c3902N2818k6786o2051l7877K5727R0706p170n8108l775J10307j618j34621
16284h6350n5951J59944J47956m9120j4547l6159n9910K9515j84849j1616j50296
16273c11383m9074o452P3746Q1911P8897p6439J4874R8066O5261n0415m8060J04920
16261b4148O3331L1453l0742r9315j8222J24475p1631L4285N085o6002O996j9737
16249f4172j0522j4780k809Q021P3952m2354k3656n405R6502k0877m1648J00542
16237E2794m087k4122l8236J3989N4784q4742j86051m5145J68535Q6170j49071
16226a55182j02065J08901J11193j10704j73082L0067R9836J61283R8136K8610
$$ y = [-8215, 37612, -1800, 27851, 57850, 100330, 78567, -34773, -85264, -75307, -44893, -42748, -33902, 18916, -7870, -69921, -107798, -82071, 8635, 1465, -56643, -60418, 49889, 48271, -86350, -142301, 17643, 165599, 116479, 101932, 65773, 5863, 35378, -149471, -161087, -311383, -360457, -366909, -293163, -211252, -132355, -208794, -193920, -95854, -30593, -81008, -129068, -24148, 39183, 70636, 39894, -59421, -77643, 46832, -24799, 9486, 14571, -51431, -44435, -64172, -74694, -89474, -92283, -84262, -10310, -52664, -76320, -81725, 14777, -6100, -47748, 52794, 48707, 24585, -13651, 338, 55122, -29620, -215671, -260816, -92281, -6111, -155182, -257247, -148346, -37153, -147857, -320939, -290872, -191036, -29753, 68383, 96993]
16216I6993L0375j5050m0701l057q796q1557K2962j6857l9629M1185J04987J7013
16204A07868q3167o3474K8875J16790l9232j29695m9306n8890l4797m826j21147
16193c31001R1467J32726l17Q1714r2253L3222J47986L457N6794j4725O7l0183
16181G8954j00494J10808p7480j6142j5222o1585Q4742M9437L9780K358o5287
16170B9869k7059J43985K8712l676q3337j18019o5717j7422k476M8524l2437L4390
16158f4663J73453k0726l4454n5654o275k9180k8788k0809J3844O0513Q6198J2398
16146H5857p7833j61790L8965P9248J5597j37442j41466k229R2461j2881J9074
16135b02439O355K8956J45653m3809l9572N5666k6154J8949m3774m7720m2299
$$ y = [96993, 127368, 112318, 71617, 68560, 59764, -21793, 1169, -15688, -55317, -14132, 90855, 107868, 24701, -38773, -9898, 106892, 67660, -62035, -111341, -170231, -205028, -209854, -331001, -239534, -106808, -107125, -25411, -117664, -84442, 63544, 67001, 123795, 109070, 109137, 78954, -21540, 89268, 11788, -4354, -19576, -81161, 3581, 53018, 92798, 95156, 29869, 2810, 146795, 175507, 171831, 88494, -29525, -95242, -112664, -115140, -66616, -99053, -64663, 108790, 88064, 53610, -2044, -8319, -37499, -66287, -87096, -73252, -12739, 73459, 85857, 8024, -153766, -114801, -35553, -19956, -157398, -298864, -301093, -208632, -221513, -202439, -196084, -167128, -21475, -65284, -104856, -49190, -75344, -56395, -100169, -147889, -190188]
16124a90188L341M5915L0447R9873l9953n5303N6435j4015j29351j5750K4509
16113a84040J59333O3126q6459j60516N874j217m6349k8207M4928N7539J25274
16102e0714L1332l3327n9903p0126n8732o232O8165k698N5751p399j4877K3803
16090a24957N1216j2781J403J33762o658n8100l8238m2052k6130l693j6572N356
16078a37444Q0490M5771m8359m5405J3051N8599o0732L3191O724p1238n8330J65059
16066a8623N2707M6654k4267o5035j303Q2299N9964Q373Q5405Q147n4622j33124
16054D6575q6323K6058n4026r9817J16442J23452o1418J815J4048j9811l3777
16043b6782P8564J5258o2932j02612K5694J5644J4152M1629K4198N7862p1940
$$ y = [-190188, -186847, -140932, -110485, -10612, -50565, -105868, -49433, -63448, -192799, -208549, -184040, -24707, 38419, -48040, -208556, -202682, -203899, -250248, -278455, -233527, -175988, -50714, -19382, -52709, -112612, -182738, -241470, -247702, -179537, -182235, -126484, -133883, -148760, -124957, -73741, -86522, -85119, 48643, 41985, -16115, -54353, -96405, -122535, -126228, -142800, -137444, -56954, -11183, -59542, -104947, -91896, -33297, -94029, -60838, -54114, -125352, -183682, -18623, 34084, 80738, 56471, -8564, -9867, 72432, 132396, 140769, 226174, 234321, 179699, 46575, -39748, -13690, -67716, -167533, -51091, 72361, 10943, 12758, 26806, 6995, -26782, 51782, 67040, 4108, -98504, -72810, -57166, -43014, -1385, 22813, 80675, 8735]
16032H735K9895j36239J04488P3966r5878j32711J7125J2878k4845N6404q6470
16021a72652k8807K6771J04540Q135j8369Q8528N62L1785O5787k967L1085j8660
16009A15738n0859k6072M3926n1910r8607K1574o955m5832L1891n4035m6493J07230
15997f0404K092j5031l4915l9511k973l3933M0512P4325O6131j6107L0747n8055
15985d7122j7119O688o5837K2207L396K5116J21564J3597p3308j07743m8057o3690
15973b30308N9208L911P9689k4674o4853m9549L6543Q9651P1281J8720n1152q289
15961f9822j2898m0043p2902R6987K04111R6269j07667j12684N5277L2760L3718
15950A03106J1758o5297l9504K3748O2637j45259q5441J7348K555N9987r6725
$$ y = [8735, 38630, -97609, 6879, 80845, -15033, -147744, -130619, -117741, -142586, -86182, -172652, -201459, -174688, -70148, -62013, -80382, 8146, 8708, 40493, 106280, 103313, 134398, 115738, 64879, 38807, 82733, 30823, -67784, -46210, -53165, -98997, -67106, -121141, -167634, -60404, -58312, -73343, -108258, -147769, -150742, -184675, -144163, -69838, -3707, -19814, 10933, -47122, -64241, -57553, -123390, -101183, -97787, -72671, 48893, 62490, -10818, -118561, -166618, -230308, -171100, -167189, -87500, -112174, -177027, -226576, -190033, -100382, -29101, -10381, -61533, -69822, -82720, -122763, -195665, -98678, 105433, 201702, 94035, -18649, 36628, 69388, 103106, 114864, 49567, 10063, 33811, 96448, -48811, -134252, -116904, -114349, -54362, -151087]
15939a51087k1547Q1033J32290J2901j29909l8740R7910l828J0523l4064N0996
15928F478k1872k2209p5023N2685o0972M4739n917j37610j34086M4814p27J33402
15916a76298J12372M5211m330K0792l7405k8498m7698N2410R0913k2623K755j5986
15904h385n2260J7456J1195r1152o0763O0423K049L5526P4428L7439K7888l9173
15892A4671p5879K6095L76M6052K7165k4372j15174l6539J30400m1999l6549Q2217
15880c536Q4065N276l9262j0263K316j3067N0544m7468N2450k3126n3546j05863
15868a01480j16008L0273O664l0296J31806N4624j09503j1985K2409L3665j21887
15857b11718q6991L3896P0050L2277P5079R6328m5813r3017o7585O3522N1869
$$ y = [-151087, -172634, -91601, 40689, 53590, -76319, -115059, -17149, -20977, -10454, -44518, 6478, -15394, -37603, -112626, -59941, -120913, -76174, -82091, -219701, -353787, -308973, -309700, -176298, -63926, -18715, -23045, -2253, -39658, -68156, -115854, -63444, 27469, 4846, 7601, -8385, -60645, -43189, -31994, -123146, -183909, -123486, -121437, -85911, -11483, 25956, 53844, 14671, -61208, -35113, -34737, 11315, 38480, 14108, -101066, -137605, -7205, -49204, -85753, -3536, 80529, 85805, 46543, 36280, 38596, 25529, 76073, 28605, 81055, 57929, 4383, -101480, -217488, -187215, -180551, -210847, -79041, -24417, -133920, -145905, -123496, -89831, -211718, -298709, -264813, -194763, -162486, -87407, 8921, -36892, -129909, -197494, -133972, -82103]
15846h2103N240R9914R9046m2886k03531P587N7048R3935M7394j23305O8653m5440
15834a8448l5507M7824J24678j1195O3158l2454o7997q9283O973j1073n303J4040
15822a4587O3284K3129q6233n3904P8312P3787r6187j18700l0326L5918n6574
15811a82081j9154m969Q6635N4496O4722q2816j27867P1777K2188m8084L4277
15800a30876M5459j4895k49j35120n583N6447N6051L9952R7586J1730r1995J7223
15788e4270P0374J04919J01570n096j08432j18104k6061K8982O2319j0785j3784
15777C1632j23852R7621J455J2340j32227Q8228O2654m7311o0225N8427j14118
15766a25376k4884N2138q0859L0708M1825Q4986K06524m3648k00993j06344M027
$$ y = [-82103, -76863, 23051, 122097, 79211, -124320, -116733, -59685, 34250, 81644, -41661, 26992, -18448, -53955, -6131, 118547, 107352, 170510, 138056, 70059, -19224, -12251, -23324, -28627, -14587, 48697, 71826, -14407, -68311, 10001, 83788, -12399, -131099, -161425, -125507, -182081, -201235, -206204, -119569, -65073, -351, -83167, -211034, -139257, -117069, -165153, -130876, -85417, -100312, -100561, -235681, -241264, -184817, -128766, -88814, 8772, 20502, -71493, -54270, 16104, 121023, 222593, 217497, 109065, -9039, -35100, -6118, 56201, 45416, 31632, -92220, 5401, 6856, 19196, -113031, -24803, 37851, -9460, -69685, -11258, -125376, -150260, -98122, -178981, -148273, -106448, -21462, 185062, 141414, -59579, -165923, -161896]
15755a61896O2297O2061j7817l4625k7719K9616K9052N7199j578K8035O0945q0721
15743D849j13165R651J12635R5870O2271k3744j17099j2625L2887L3040Q5496
15732A70066j03099N7158l1078n4411K6455M8707j55341j78099j49233l8193J61810
15721b45258O9340M4487P6777m698K0165l7677Q4678N6404r3558k4803P5469O9555
15709I0881j7546k6980L7929p6667j20856p0118r0011K8282J36647O175m2693
15698a44957j19594j15381M5737J54700N3479M6508j5731m3077N2277J13998L0028
15687E7987k1770m0616P4163L8740K5665k3419J9406n8730o1304L775J32084L4049
15675A80030q1183j22252N1439m376k7972r6429K9412N6845l2118O4246K7720
$$ y = [-161896, -99599, -37538, -55355, -89980, -117699, -88083, -59031, -1832, -3410, 24625, 85570, 4849, -108316, -98665, 13970, 109840, 172111, 148367, 31268, 18643, 51530, 84570, 170066, 66967, 124125, 93047, 38636, 65091, 113798, -41543, -219642, -368875, -407068, -245258, -175918, -131431, -54654, -59352, -39187, -76864, 7814, 64218, -29340, -54143, 21326, 90881, 73335, 46355, 84284, 7617, -113239, -183357, -273368, -245086, -108439, -102264, -144957, -264551, -379932, -334195, -179495, -126016, -79508, -95239, -138316, -86039, 27959, 57987, 36217, -4399, 69764, 108504, 134169, 110750, 130156, 71426, 10122, 13897, 145981, 180030, 98847, -23405, 28034, 23658, -4314, -100743, -71331, -14486, -46604, 17642, 45362]
15664D5362J02198R2441q6183j64249j545J04863k0430j01857r9904n435Q6882
15653d7857J01225m7586K3401q7841r719J72738P0348J021j7233n2520k24026
15642a18049j29327N1473n6288k3107Q0866J27843J28149N7772Q3821p3778p7776
15631E1599m7646n0165J1782N5550J07730j60773o9883M2460M7639R5921J4651
15620I8865q1756p5943L5133j3778o9821N3621P1762l8793q0140k4392m319O8355
15608f1206J01620m2867O6089m8638M0842R1858O6346k3696J10474M829J6125
15597C21776p0153q0813k2571n7329m5529m6539n2054N2612L5819l7708o2975
15586f5464J46615K4661m9879o7034r9996L1232R860o5249L4731m5117j98819
$$ y = [45362, 147560, 240001, 153818, -10431, -11976, 92887, 72457, -29400, -129304, -134739, -47857, 53368, 5782, 29183, -58658, -68377, 104361, 174709, 175730, 158497, 105977, -118049, -247376, -195903, -252191, -275298, -194432, -66589, 61560, 119332, 203153, 129375, 51599, 3953, -46212, -34430, 21120, 128850, -31923, -101806, -59346, -11707, 84214, 98865, 17109, -58834, -23701, -37479, -107300, -53679, 18083, -20710, -100850, -125242, -129561, -61206, 40414, -2453, 63636, 14998, 55840, 147698, 214044, 190348, 300822, 305651, 321776, 251623, 170810, 148239, 90910, 45381, -1158, -53212, -600, 35219, -2489, -65464, 81151, 105812, 55933, -11101, -111097, -79865, -70005, -135254, -100523, -145640, -344459]
15575c44459l627K8138N9667J01245Q8581K4551k7958l3020l2461M3419j4938
15564a10862Q032j667L1327J14681J08088J5900J0398q9770j18248m6946J147
15553g7920L4290N4497L1605n0587J3312m9842p6317Q1705J58925j6499o06l8475
15541F4088M5776m5128j07608j6159J00923J5315k7255q4915j10293k0234P7768
15530a07722p5135J5648O9672M9004R622k8605j5169l0951J56737o336p1300K1299
15518a3236p7490R125O131o7569p8588L4364Q2864Q8382M5143l5720J04864j876
15506I6394l781j6794j10670j2334M4470K9764o7569M1895J1786Q189N9659K0133
15494A01142n9826j6501N6227P1237J9312r9010L5150N4954k6342o7789O1840
$$ y = [-344459, -348086, -319948, -260281, -159036, -70455, -45904, -73862, -106882, -139343, -95924, -110862, -102830, -104497, -73170, 41511, 149599, 165499, 175897, 86127, -32121, -79067, -77920, -43630, 10867, 42472, -8115, 5197, -44645, -120962, -39257, 119668, 103169, 102563, 64088, 109864, 64736, -42872, -59031, 41892, 57207, 29952, -54963, -165256, -185490, -107722, -182857, -167209, -97537, -48533, -38911, -67516, -82685, -113636, 43101, 36765, -34535, -13236, -90726, -81601, -75470, -143039, -221627, -187263, -104399, -16017, 29126, -6594, 98270, 96394, 92613, 75819, -34851, -47185, -2715, 27049, -40520, 1375, 13161, 21350, 81009, 101142, 41316, 24815, 81042, 152279, 171591, 72581, 107731, 162685, 136343, 68554, 130394]
15483A30394j7844o3776o4662j12079n9616J03625J74M0704J60522k5395n7486
15472C4561Q5825k1208K0277o566k039P1763l5140j03983K8891R1186J5906n7562
15460A21911m0467N1229R2722J6242O16J6218n5492n8704j20987R1181J40824
15449B55293M446j15957p193p8757P22M0033J67956N7359M5391O0796J22661J51143
15437G03893J67196K22274L07154J27720o4963j33701k47885k00364j56000j05273
15427F20051j79468q7450r4991n2812p1927m6186O5373L4703l0462n763j0169
15416A40899q451k1187j7202m0262j16100N346M0512k4677m2458K7362J60522
15405A04304N0865R740Q3869J8498Q3241Q3115J89944J83871K70295L98847K26870
$$ y = [130394, 112550, 48774, -15888, -127967, -187583, -83958, -83784, -43080, 117442, 92047, 34561, 120386, 99178, 119455, 112889, 110850, 182613, 147473, 43490, 72381, 163567, 179473, 121911, 81444, 132673, 225395, 241637, 242253, 258471, 202979, 144275, 23288, 114469, 255293, 259739, 143782, 136589, 57832, 58554, 98587, 266543, 323902, 369293, 430089, 552750, 703893, 871089, 1093363, 1400517, 1528237, 1463274, 1329573, 1081688, 881324, 725324, 620051, 440583, 353133, 258142, 205330, 133403, 87217, 152590, 187293, 156831, 151068, 140899, 132448, 111261, 94059, 53797, -62303, -56957, -16445, -41122, -83580, -56218, 104304, 155169, 164909, 248778, 267276, 350517, 433632, 623576, 807447, 1077742, 1476589, 1703459]
15394A703459j7242k91219m42728k32588j47457j50760o4926n0947M6773m5684
15384C06681l7772j31553O8362J73676o2596r639j19547r7862J8647J37253Q3516
15373C29166j5413M5626J42805J10867K88927K83148K56042m2653j53298j72058
15363A073159k97641k88797j02851J17447k9327q2562l7597p7969k2336R4592
15353C46118k4373q510q9640q1695P278K1151l941k767j5953k6333q0855K0779
15341F1259K2378q7471k5416N0752K3261J50712J47505n4432J9158J52948J30087
15330E90741J80355J80593K17392J74332N6465k50492l40872k78142j30942k6356
15320C73074J9705q0958L435j1807q7147L3170r9555j2958o0532j26542M1305
$$ y = [1703459, 1686217, 1394998, 952270, 719682, 572225, 421465, 356539, 305592, 352365, 306681, 268909, 137356, 205718, 379394, 316798, 307159, 187612, 89750, 108397, 245650, 329166, 313753, 359379, 502184, 613051, 901978, 1185126, 1441168, 1398515, 1245217, 1073159, 775518, 486721, 383870, 501317, 471990, 389428, 351831, 273862, 251526, 346118, 321745, 313235, 223595, 141900, 149178, 170329, 166388, 163621, 147668, 121335, 40480, 61259, 83637, -3834, -29250, 21502, 44763, 195475, 342980, 288548, 307706, 460654, 590741, 771096, 951689, 1169081, 1343413, 1399878, 1149386, 808514, 530372, 399430, 373074, 392779, 311821, 315256, 303449, 216302, 249472, 149917, 136959, 76427, -50115, -8810]
15309h810J03823L7964j03948O5644J17056J14802J5179j27158j03752N670p4621
15298D1849n3015j7669p0562L584R0210J50158O0070r5265q5318p6820n0787j4482
15286a18047M2530Q4844R6208l8034j76654k8318m6418P9732L5153j3113K0626
15275f1491o6694J0400K8982n5121q156m6269Q7135M8562n474O8529L450O2475
15263F6328J1027J4736p5090j59327L2538Q7420P937J68149K00375J745j80893
15252A74945j25582o0939q8632l7656Q8167p4490k06371o4811N4509R9888o3391
15241c04363j1039J5747Q3298J11976J00310P4458n4597n7951J33651l0896K777
15230F3371P0818m3726k1103L4310J2094k2939M5916M831j3407k9914m2881q0138
$$ y = [-8810, 95013, 132977, 29029, 94673, 211729, 326531, 341710, 214552, 110800, 116470, 41849, -11166, -28835, -99397, -95813, -5603, 144555, 204625, 109360, 24042, -52778, -103565, -118047, -75517, 9327, 105535, 67501, -109153, -137471, -183889, -104157, -69004, -82117, -61491, -128185, -117785, -88803, -143924, -152080, -198349, -111214, -62652, -68126, 403, 3853, 66328, 77355, 92091, 17001, -142326, -109788, -22368, -14431, 153718, 354093, 355838, 174945, 49363, -11576, -100208, -137864, -49697, -124187, -330558, -395369, -340860, -240972, -304363, -315402, -299655, -216357, -104381, -4071, 70387, 15790, -42161, 91490, 60594, 63371, 134189, 90463, 69360, 103670, 115764, 92825, 138741, 143572, 130165, 100251, 57370, -22768]
15218b2768l8208k574k9454O4536Q1411R9853Q950j0382o8257q9059P9164P5903
15206A49115j3126j35407J22510Q8717J8208l1327l2495o6326p7632j9483k844
15195i0q2703m4717K3366J50312j9828m8983J04225L1698m348J6649J7757n8780
15183H4558p9919j6927m4890j910M668o9761l5930o3057l6523P1888P0957J1615
15171a05231J31661J69857K9303M9247N4911k2100j9960o3332K9784l8326j05012
15160A10802J3217J10801R9342O707j09064L4023N4509k798j11632K9449n7936
15149A77420n7372l962r2431j22850K360R586P8055k7377j22145j0462J30869
15138c8309J35172M8436k5218q3541l5401p8405O5802J40615n315j13190l5439
$$ y = [-22768, -60976, -63550, -93004, -28468, 52943, 152796, 161746, 151364, 83107, -5952, 73212, 149115, 135989, 582, 123092, 211809, 230017, 198690, 166195, 99869, 22237, 2754, -90, -82793, -127510, -104144, 46168, 26340, -22643, 81582, 113280, 108932, 125581, 143338, 84558, 4639, -12288, -57178, -59088, -54420, -124181, -160111, -223168, -259691, -187803, -116846, -105231, 26430, 196287, 225590, 274837, 329748, 307648, 287688, 224356, 254140, 215814, 110802, 124019, 234820, 334162, 340869, 231805, 265828, 320337, 317539, 205907, 235356, 177420, 120048, 116086, 23655, -99195, -96835, -87249, -9194, -36571, -158716, -169178, -38309, 96863, 145299, 120081, 36540, 1139, -77266, -11464, 129151, 123836, 10646, -24793]
15127b4793J1756L7643m8179j4047Q6074n867j3990r2048r7687o2311N1669Q2102
15115h9678n5751M4857M3453K2687n8432Q912K3789k0746M2989o1062o723k7168
15103a32873O371J29190J49915J19611J26412Q3509N4164l2753r5038r6540n7460
15092B54508j9320L5864L7092N4031k508j46673m9076O3140j2996r1907l5323
15081H6832q8224J7891N9069l5062K7984J47227R4130P8186J59433j8774j02447
15070D26245J7330p5127p4571p1749o0023l8511m6893M6708J65071J38813N7411
15059D84704J19817R1688J45660N2820o0835r0023j11135r2219p9097j13159m8070
15048C00151q9199j10106P1268R6129K5635J5834P5571j13375k25742n8175J3153
$$ y = [-24793, -13037, 24606, -23573, -37620, 48454, 42587, 28597, -63451, -161138, -223449, -171780, -89678, -145429, -100572, -57119, -34432, -92864, -83952, -60163, -80909, -37920, -98982, -105705, -132873, -126502, 2688, 152603, 272214, 398626, 482135, 536299, 503546, 408508, 311968, 254508, 235188, 271052, 308144, 362175, 359667, 212994, 163918, 227058, 214062, 122155, 86832, -1392, 16499, 75568, 40506, 68490, 215717, 309847, 388033, 547466, 528692, 426245, 443575, 368448, 293877, 222128, 162105, 123594, 76701, 123409, 288480, 427293, 484704, 604521, 696209, 841869, 894689, 833854, 743831, 632696, 540477, 461380, 348221, 300151, 210952, 100846, 172114, 268243, 293878, 309712, 385283, 271908, 46166, -12009, 1144]
15037A144J15937J86970J79386J97072J01076P7378K04032J45098m0448n7012
15027A110633o4937l3049L1116k30655k09459l3690R9770J3172j23806O8508O7984
15016F95587J22228N7076k7599K436q1406r4245N078O5731L6932p6791M4376J63033
15004I12436J75461J31412J16338j2528m4829j09044n8713L0876K475J56177J52326
14993A452387J19823J82956K49523J59332K4209L7334L222j10616l6675k0703
14983B060792n1285q0363K4531R8253K26190J91373R1299J79580K77264J82359
14973C199993K33487J38490J27182K76952L79912N03335N26490M97804O26515
14964F510160P01081Q17043R65209J165643J416980J852848K530184L476333M426264
$$ y = [1144, 117081, 304051, 483437, 680509, 781585, 858963, 1062995, 1208093, 1167645, 1110633, 1045696, 1012647, 1043763, 813108, 603649, 569959, 669729, 682901, 559095, 627603, 695587, 817815, 874891, 847292, 849728, 768322, 674077, 679155, 744886, 781818, 705027, 749403, 912436, 1087897, 1219309, 1335647, 1323119, 1278290, 1169246, 1110533, 1141409, 1143884, 1300061, 1452387, 1572210, 1755166, 2004689, 2164021, 2188230, 2225564, 2228786, 2118170, 2081495, 2060792, 2009507, 1929144, 1953675, 2051928, 2278118, 2469491, 2560790, 2740370, 3017634, 3199993, 3433480, 3571970, 3699152, 3976104, 4356016, 4859351, 5385841, 5883645, 6510160, 7211241, 8028284, 8993493, 10159136, 11576116, 13428964, 15959148, 19435481, 23861745]
14955B3861745N229577O308879Q028502J1417693J7685815K8291916M3432442
14948A44256569N8493883O1251604L4346574j6707969n6003704o3659016m8586632
14941A13391309l1178392j9308666j2370905q292038o156055n082155m437163
14934B6565935l702737l009409k271485j666653j169890p88381o93845m57773
14926A2805762k44659l8941J61880L36731P03655R66907J235357J609586K409277
14917A9945555L247252M200755N184582O054641P804416J1767847J9622923L3971036
14909A11799007N5566347P7917895Q0429600L1867371m4545048q6288346p8911430
14902A47835396m9309141k7536451j5591832r301807o044534m517714l815910
$$ y = [23861745, 29091322, 35400201, 43428703, 54846396, 72532211, 100824127, 144256569, 202750452, 264002056, 298348630, 281640661, 225636957, 161977941, 113391309, 82212917, 62904251, 50533346, 42241308, 36085253, 31003098, 26565935, 22863198, 19853789, 17582304, 15915651, 14745761, 13957380, 13263535, 12805762, 12561103, 12522162, 12684042, 13020773, 13724428, 14691335, 15926692, 17536278, 19945555, 23192807, 27393562, 32578144, 38632785, 46437201, 58205048, 77827971, 111799007, 167365354, 245283249, 325712849, 357580220, 313035172, 226746826, 147835396, 98526255, 70989804, 55397972, 46096165, 40051631, 35533917, 31718007]
14895C1718007l342596k691618j572154n66819N55159J548349K584998L651279
14887C1884605M843253N933237Q011618J2304347K0160993L3735107N3906838
14880A70779998P3729588P4359932L0163924l9054425p9493854p5866284n0246738
14873A04372141k9269330j7148840j0647581p194902n371388m621823m238850
14866B5879427l678857k935067k040004j517168j059833p06408n36124k91260
14858A3114706O4414K21741L29994O08871J114978J414467J787821K352596K831994
14849B3841582L857616M980598O221935P633924J0471125J5507780K4134100L7782165
14841A34430825N4818735O6231211N4962311R101820m4932418p1032505o3531272
$$ y = [31718007, 28375411, 25683793, 24111639, 23544820, 24099979, 25648328, 28233326, 31884605, 36727858, 42661095, 50672713, 62977060, 83138053, 116873160, 170779998, 244509586, 318869518, 349033442, 309979017, 230485163, 154618879, 104372141, 75102811, 57953971, 47306390, 40111488, 34740100, 30118277, 25879427, 22200570, 19265503, 17225499, 15708331, 14648498, 13942090, 13405966, 13114706, 13179120, 13400861, 13730855, 14339726, 15454704, 16869171, 18656992, 21009588, 23841582, 27699198, 32679796, 38901731, 46535655, 57006780, 72514560, 96648660, 134430825, 189249560, 255480771, 310443082, 319544902, 274612484, 203579979, 140048707]
14834A40048707m2961977k6432781j6376271j0636136p343319n606627m879388
14827B5812208m306460l730681l131726k376902j789153j318334j136874j058068
14819F964010q50400n44737m29280l41153l33253l07318j73481j86798k49716
14810C547874k49359l46542l77440k80111j85370r9235r1815j44972o6354q7063
14800A619613n3568j16553k24921k51503r3471n2357R9088R8283J11909J22301
14790A258821N7541j5757j01360r9934K7864M829k0455l8169j17422n8947n0532
14779H46479n0730O5642J00655K6536J30724Q2863l6337j27107j78064r5260q3539
14768F81862j42258q2048K2064o7831P610J923j66912j22178k4448j07624p1213
$$ y = [140048707, 97086730, 70653949, 54277678, 43641542, 36298223, 30691596, 25812208, 21505748, 17775067, 14643341, 12266439, 10477286, 9158952, 8022078, 6964010, 6113610, 5568873, 5139593, 4798440, 4465187, 4157869, 3984388, 3797590, 3547874, 3298515, 2951973, 2574533, 2294422, 2109052, 2009817, 1918002, 1773030, 1706676, 1619613, 1566045, 1449492, 1224571, 973068, 879597, 827240, 926328, 1024611, 1136520, 1258821, 1316362, 1300605, 1199245, 1099311, 1127175, 1132004, 1111549, 1073380, 955958, 897011, 846479, 795749, 861391, 962046, 988582, 1119306, 1202169, 1165832, 1038725, 860661, 765401, 681862, 539604, 457556, 479620, 411789, 419399, 421322, 254410, 132232, 107784, 160, -71053]
14757g1053R556m2592l9500J50621J99414J29912J43027P7972P1594J14503L9602
14746G83056r5n0088o1400o5681n9404q2835j33735P1076N9056O6554r1173j4031
14734D21300j9315o5576n0113j15409k02223j51602j04002J2020K22258J37327
14724H4665J01218J15916J34583J70319R3260k7561q7269o0819L1781p1512o8502
14713D16079O6796P8915m549N4619p1680K3901R7150K0993j9078j25415j32856
14702D04875n3117J6599P6052J95704k4392j15471n7136l2927l8592m5126p5392
14691B51077j26918j80982o2001j5220J2858l2647N0731K00524J60000J26663
14681C84085J72295J08097o5179o5918j2859n5266L4532J03078j010K9084R3643
$$ y = [-71053, -61497, -104089, -143589, 7032, 206446, 336358, 479385, 557357, 628951, 743454, 783056, 782961, 732873, 671473, 605792, 546388, 463553, 329818, 400894, 459950, 526504, 435331, 421300, 401985, 336409, 286296, 170887, -31336, -182938, -286940, -274920, -52662, 84665, 185883, 301799, 436382, 606701, 699961, 672400, 585131, 524312, 556093, 484581, 416079, 482875, 561790, 557241, 611860, 540180, 564081, 661231, 682224, 663146, 537731, 404875, 351758, 368357, 444409, 640113, 615721, 500250, 443114, 410187, 371595, 326469, 251077, 124159, -56823, -118824, -134044, -121186, -153833, -103102, 97422, 257422, 384085, 556380, 664477, 599298, 533380, 520521, 465255, 499787, 602865, 601855, 630939, 724582]
14670G24582j34539j81891k5161P2873m1897j02163l6453J35361K3467p4444j12812
14659B46923m9121k8699M7479O1011l5002O7505M0259M3359p1868K7498L7979
14648C87323M9036J1327n7652j994M4785j7211J60m4085j70027m7439j02032M3726
14636I5917J57452Q3753K4397n1264m4197n3633P3215l0381j01643N3486J6609
14625B23711k0871l9011M6145q1059q4505Q7174j1333j04062k917O6599R7980
14614A77851K7450O9020o8292m4186k809l0188Q4103O3404Q587Q8837J45442m1392
14602D77827n8666n6882k44312o1989l949p6651p75M527O3675P4882k8913J2553
14590A01327R6460m346N8272K8758k2082m3050k2124m9372o411l5709P0838M566
$$ y = [724582, 590043, 408152, 382991, 455864, 413967, 311804, 275351, 410712, 434179, 359735, 246923, 197802, 169103, 216582, 277593, 242591, 310096, 350355, 393714, 321846, 349344, 387323, 436359, 447686, 390034, 388040, 432825, 415614, 415774, 371689, 201662, 154223, 52191, 95917, 253369, 337122, 361519, 310255, 266058, 212425, 285640, 255259, 153616, 207102, 223711, 202840, 163829, 209974, 128915, 44410, 131584, 120251, 16189, 13272, 79871, 177851, 205301, 274321, 206029, 161843, 159034, 128846, 212949, 276353, 284940, 373777, 519219, 477827, 419161, 362279, 117967, 55978, 52029, -24622, -25397, -20870, 42805, 117687, 88774, 101327, 197787, 193441, 251713, 280471, 258389, 215339, 193215, 143843, 137432, 101723, 172561, 177127]
14578A77127O150P8790j9600K4205q8973o3753K9766p3101k4334K683o0822l186
14566a5048N1632J06634R0722q7159P3862M3331p6279m3526k4985P6872L5410
14555B31466L8393p6412o7897K3287M0070J8955l3379k0426L834L1973K2253L9491
14543B51608l76N9109L1389M6791M779J6335n616j07953j34181l7377K3370M5264
14531A93142r8379n3790M1679q6466n6336l458J02717P1506n3983K9361n1577
14520C4416K460J05439P8019o4222n4578q2066O0414k247k5851R9460J37072o4297
14508B24019K2958l9345j56219k5926R2057J26936l1203o3604P3015m8497j21138
14497E3053O9156J535m7699j706n1594J5387L7203p8060J18281N2294r503n8425
$$ y = [177127, 183277, 262067, 242467, 266672, 177699, 113946, 143712, 70611, 46277, 48960, -11862, -15048, 36584, 143218, 233940, 146781, 220643, 263974, 187695, 144169, 119184, 196056, 231466, 269859, 193447, 125550, 148837, 188907, 207862, 174483, 154057, 157891, 189864, 212117, 251608, 251232, 310341, 341730, 388521, 393300, 409635, 404019, 296066, 161885, 124508, 147878, 193142, 94763, 40973, 82652, -3814, -60150, -63608, 39109, 110615, 56632, 85993, 34416, 36876, 142315, 220334, 156112, 101534, 19468, 79882, 77635, 51784, 151244, 288316, 224019, 246977, 207632, 51413, 25487, 117544, 244480, 213277, 149673, 222688, 174191, 53053, 122209, 123744, 76045, 74339, 22745, 38132, 75335, -2725, 115556, 167850, 158347, 99922]
14485I9922q670J0977r5723q5419J1631O8230Q6687J8728j6339j7425m6434J6909
14473D3074R6531Q297k0208M2624J14059k0710J3442J8500j3611L4443L3049p5349
14461B74141J4967l7262l15o2707k795P9391J55436J24466J52726J52392K73688
14450A124128K81540N024k37749k10025j93545k45407j07974j5708o8884O5658
14440C97058j5104r4297p8624l6490J206M8113q6616p0796K8039j1985l636o9979
14428F889l1373J15372N7236k9343K5945o0437j64597N5115J05255J12265J06172
14417B98499J78004Q3770N1276P5093K13740K24653L45736J53802j19715k78611
14407A226247k66567j92524j11602o8439j9134K9337o1774j39144p9955j50942
$$ y = [99922, 91252, 102229, 6506, -78913, -67282, 948, 87635, 106363, 90024, 72599, 26165, 43074, 139605, 147902, 127694, 170318, 284377, 263667, 277109, 295609, 281998, 316441, 349490, 274141, 289108, 251846, 251531, 188824, 186029, 265420, 420856, 545322, 698048, 850440, 1124128, 1405668, 1410692, 1172943, 962918, 769373, 523966, 415992, 400284, 331400, 397058, 381954, 287657, 209033, 172543, 173749, 221862, 135246, 64450, 92489, 80504, 76868, 6889, -24484, 90888, 148124, 118781, 144726, 84289, -80308, -25193, 80062, 192327, 298499, 476503, 560273, 611549, 686642, 900382, 1125035, 1470771, 1624573, 1504858, 1226247, 959680, 767156, 655554, 587115, 567981, 597318, 535544, 396400, 316445, 165503]
14397A65503J9852J40451N8361j17396L0435J73552O680o4906k4940P2224N2804
14386E12620J74559K16113L17002K93851N9977j63522k41614k72024q8329j62567
14376F46066j55177j59421p4439j16390n1590K0590O166R8739n1386n1686K9748
14365A41220Q6291m9691q9929N6692Q9752k7653K5967M5462J3006n3874r4354
14354A42889m3682J15368J10837N6507n2641j0937N9335K8363J33114L02653K99734
14343A141540K22863Q3157j44480k48760k25415j46679j30500m7729O4838q8978
14333D79857q6115q9620j52602j04840k1182k545p4811L6834M4649M7143J3547
14322I0315M8870O1806M0773j4094q3850O102m7870n2495M5901M4249l2942R6236
$$ y = [165503, 185355, 325806, 384167, 266771, 297206, 470758, 477438, 412532, 387592, 459816, 512620, 687179, 903292, 1220294, 1514145, 1574122, 1410600, 1168986, 896962, 808633, 646066, 490889, 331468, 257029, 140639, 89049, 109639, 115805, 214544, 163158, 111472, 141220, 227511, 177820, 87891, 144583, 234335, 206682, 232649, 278111, 291117, 237243, 142889, 99207, 214575, 325412, 381919, 329278, 318341, 377676, 406039, 539153, 841806, 1141540, 1364403, 1447560, 1303080, 1054320, 828905, 682226, 551726, 503997, 568835, 479857, 393742, 304122, 151520, 46680, 25498, 22953, -51858, -15024, 29625, 76768, 90315, 139185, 200991, 241764, 227670, 143820, 149922, 102052, 49557, 95458, 139707, 106765, 203001]
14310B03001R9367n8756j10707j978K2725o5518Q1890K4447j21898N187l2160
14299D5600j9540j6693j970R2715P05l1777m3042M7861M8082l1527K1984K0368
14287A32766j0854K2486j17683n4537M6770R0823Q7015R119o5003K1309J1322
14276A73533P86n8169j03200j5882n0719J03788m5441J5838M2178j8501K7983
14265G2194l9794j8304J37642k2026p2452m4641j098P0105Q6065j44q1317O5443
14253A51673m284j7366m6326r9177q393j7655O594k3997J2671P3327j7760o8210
14241e8903K0443O5503M135k6302j34007l0525M3076J10230K6606J10943L5305
14230A66504k6559o8842k0465q7486k1900Q3060J9897N09J2697k0492k7150J00881
$$ y = [203001, 302368, 243612, 132905, 130927, 153652, 88134, 170024, 194471, 72573, 77760, 45600, 26060, 9367, 7397, 100112, 100817, 69040, 25998, 73859, 121941, 90414, 112398, 132766, 121912, 144398, 26715, -27822, 18948, 109771, 196786, 205905, 140902, 162211, 173533, 174319, 116150, 12950, -2932, -53651, 50137, 4696, 20534, 62712, 44211, 72194, 32400, 14096, 151738, 129712, 57260, 12619, 11521, 81626, 167691, 167547, 86230, 151673, 147389, 130023, 83697, -15480, -23873, -41528, -34934, -58931, -46260, 27067, 9307, -58903, -38460, 27043, 31178, 4876, -129131, -159656, -116580, -6350, 20256, 131199, 166504, 139945, 71103, 50638, -36848, -58748, 24312, 44209, 44718, 57415, 36923, 9773, 110654]
14218A10654J3177l2870k9531n2333N0635O0554L1433Q6597j21786q0505j10649
14207g4624m4489K9686k2445K6841k5546O7981L2319o3113L1511M9248L1846l1748
14195G467j7431q2791N1744Q5910p038O6277N5927m7592R596M6953O0467j30444
14183I9045p0204J4116j38776n1916M4601j9065P819R9018J11171M9425m475N5224
14171A95983n3488j52514M193K6805N3883O2601L725j13770p2388r9066N9517
14160h4519L4273r5509J2654J0936R4655m3172Q708K9215N068J0403O6579l7143
14148A2148l4832n9479j7378N1529N1366L6777K4670r4131n9159Q0426K9399l6976
14136a5640N7592L9585j0111q039J92061K8645l8270p8618p8835q436l246j00167
$$ y = [110654, 123831, 90961, 61430, 9097, 59732, 120286, 151719, 238316, 116530, 36025, -74624, -119113, -89427, -111872, -85031, -110577, -42596, -10277, -73390, -41879, 7369, 39215, 7467, -9964, -92755, -41011, 44899, 37861, 104138, 160065, 112473, 122069, 169022, 229489, 99045, 28841, 42957, -95819, -147735, -103134, -122199, -114380, -15362, 95809, 145234, 140759, 195983, 142495, -10019, -5826, 20979, 74862, 137463, 141188, 27418, -44970, -144036, -84519, -50246, -145755, -133101, -122165, -27510, -70682, -61974, -32759, -27691, -17288, 49291, 12148, -22684, -82163, -99541, -48012, 3354, 40131, 64801, -29330, -88489, -8063, 21336, -15640, 41952, 81537, 71426, 63387, 255448, 284093, 245823, 167205, 88370, 79934, 76688, -23479]
14124b3479p3984P4214o4446m8826O196O738R6419J14450m3031j2865j4259k095
14112A5032l1410O5363R7022l885n1532k4104n57O7160k9786K494L665Q1813n6117
14099A35158l7778J09249j9624k6861k7859K7870O2111J06113K9898K4283P7034
14088D59594j514K5797R4266n0001l1784j22386q0362K1318N6476P1698N7267
14077E00369q0603j0426Q6753J05977J17786J76709J4902k5P2134L3820N7436
14066A074832L18453L88944J89253K83971M51911M49075N49790L02722J58252
14057D167203k2350k01668l93470o12918m96207k64552r0936j18546l8466r2249
14047A835841j68874k11578r5238j82343k29126j05066j69936r6328j4048K343
$$ y = [-23479, -97463, -23249, -87695, -136521, -130325, -123587, -27168, 87282, 44251, 31386, 17127, 15032, -16378, 48985, 146007, 142122, 90590, 66486, 65929, 133089, 103303, 105797, 109462, 191275, 135158, 97380, 206629, 187005, 160144, 132285, 160155, 222266, 328379, 358277, 382560, 459594, 458080, 483877, 578143, 528142, 496358, 373972, 293610, 314928, 371404, 443102, 500369, 419766, 409340, 496093, 602070, 719856, 896565, 911467, 911442, 983576, 1017396, 1074832, 1393285, 1782229, 1971482, 2255453, 2707364, 3156439, 3706229, 4008951, 4167203, 4144853, 3943185, 3549715, 2936797, 2440590, 2176038, 2085102, 1966556, 1928090, 1835841, 1666967, 1455389, 1360151, 1177808, 948682, 843616, 673680, 577352, 563304, 565647]
14037E65647j05010j60655J913l9182l3237q1398l3342R0154k4207j29015N7234
14026A08902l9380k6156N7092P4906J00605q459n8944l0243J32244J78033Q4110
14015E72710o101P7023J55050L2490k8797r1835j04153j52556j32008j14269j22841
14004H4713k3883O4250L6617J6866p428m0582N1522p4868m6552j15842J6721Q2576
13992D4110N046L0963j2253r080p0356j09372q8456O6993Q4404M0853L7741J1385
13980C1978O0020P5024L7885j00055r7199K802m5464P0145J14716K5823j62596
13969A3079o3310K9976l2521K6718k9936m1476R4847j8676k2802O4413o0K1708
13957D1960P095k1344n3836j32307j5590m128K0391J03665m0584N9350J23543
$$ y = [565647, 460637, 299982, 301895, 262713, 229476, 148078, 114736, 204890, 180683, 51668, 108902, 69522, 43366, 100458, 175364, 275969, 267510, 208566, 178323, 310567, 488600, 572710, 566609, 643632, 798682, 831172, 802375, 710540, 606387, 453831, 321823, 207554, 84713, 60830, 125080, 161697, 178563, 171135, 130553, 182075, 107207, 60655, -55187, -38466, 44110, 49156, 80119, 67866, 58786, -11570, -120942, -209398, -142405, -58001, -17148, 20593, 31978, 91998, 167022, 204907, 104852, 7653, 10455, -35009, 35136, 149852, 175675, 13079, -50231, -20255, -52776, -26058, -55994, -97470, -2623, -21299, -44101, 20312, 20252, 41960, 49055, 27711, -26125, -158432, -174022, -178150, -157759, -54094, -94678, -35328, 88215]
13946H8215n4483J124L1446K1214m4810n7225j4067M0729l5509o4793L2663O2553
13934G057L4738o8528L4068L2369K2779K0331L5910o9246k1850M6516K1369k2892
13922G2621n3252J38377o043o0345R3105p6754q0458P4437L4674N251l0442K2287
13910A33458J1063o7906J114n2714J6880p3772j8293j0973j8449P1171K0140R6630
13898A08349Q584Q9620Q4299L828o5619j3141j02945r7304k4587j809j00309k6985
13886a38019R4976O3355k5174n9223J08841k1100N380J35878M2262n6986r2485
13875E7705j04794M0108J57727J455j8595j3875o2772o3398p5832N7736J10282
13864H5747j5440j30843J7512N975P8190m1621n2464N3356J24001J03671n4703
$$ y = [88215, 33732, 34856, 66302, 87516, 42706, -14519, -28586, 12143, -23366, -88159, -55496, 7057, 41795, -26733, 7335, 39704, 62483, 82814, 118724, 49478, 27628, 74144, 95513, 72621, 19369, 157746, 151703, 91358, 184463, 107709, 27251, 101688, 136362, 141613, 111171, 133458, 144521, 76615, 77729, 25015, 41895, -31877, -50170, -61143, -79592, -8421, 11719, 108349, 116933, 206553, 290852, 294680, 229061, 215920, 112975, 15671, -8916, -10725, -111034, -138019, -43043, 20312, -4862, -64085, 44756, 23656, 29036, 164914, 207176, 150190, 57705, -47089, -6981, 150746, 152201, 133606, 119731, 56959, -6439, -82271, -24535, 85747, 70307, -60536, -43024, -37049, 41141, -480, -52944, 412, 124413, 228084, 173381]
13853A73381m388J8318r1523r5822N2662o89K9843K8196n1810k6371k0328J07973
13841A19442L3591K4183k7914k6652j5982k0458P8250K8103n1632j8262K2788
13830A45457M9246K6634r541j02807j899O1750o9022j5653n7497l216O2944J08384
13818A94780N6023J3637n0563n7047n7036m8012R9475J08754n441M5318k1140
13807B78748M7933l4792j26637K9687K2785o1621M132Q4684J12476j3287o9558
13796B74550q1930j07312o7062O5596M0965q412K4811m7267j04846J3830K9221
13785C2144m8171l4744j6734K0561L953J13561N5403m1330r6081Q1793O3109J2252
13773A45716k2905n7805M574O1297Q9259K5964m838M1014k4779n5875j8212J11325
$$ y = [173381, 168993, 187311, 95788, -34, 52628, 51939, 81782, 109978, 58168, 31797, 11469, 119442, 153033, 177216, 149302, 122650, 106668, 86210, 164460, 192563, 140931, 122669, 145457, 194703, 221337, 211796, 108989, 107090, 168840, 99818, 84165, 26668, 23452, 86396, 194780, 250803, 264440, 213877, 156830, 99794, 51782, 151257, 260011, 254570, 299888, 278748, 326681, 291889, 165252, 194939, 217724, 156103, 160235, 244919, 357395, 344108, 274550, 192620, 85308, 18246, 83842, 124807, 116395, 141206, 93939, -10907, 2923, 32144, -16027, -50771, -67505, -46944, -42991, 70570, 125973, 84643, -11438, 70355, 133464, 145716, 122811, 65006, 69580, 130877, 220136, 246100, 241262, 282276, 257497, 201622, 183410, 294735]
13761B94735n2998K4776r64n999K2116n7117K0695J45940N4242j1285p1989n0666
13749C11486O1326J37344N8924K7011r8065n1498q7709J459p8845k4504J11074
13738C68003K0076o1325p7379k0638l8131O1392J4940j86193r9508J4126o5217
13727f9854j03925J18343J14197R7963Q6181J11801p6138j86552j96507k1552
13717a26043J47244N9931k1935J2613k3018J7295L7355K8062o747m7969j02951
13706b6163r3666J05744J58791Q4626m556m5247n519m9529r799J05444N725q9979
13694A35872j8411N467J7850o4531j06644J1155n9278R4159J33589k2193k94J05631
13682B32372r356p2555K4553O6216k1646P3004J7386n2917k182l3038r6189L9575
$$ y = [294735, 241737, 266513, 265549, 259550, 281666, 224549, 245244, 391184, 445426, 434141, 362152, 311486, 372812, 510156, 569080, 596091, 498026, 446528, 358819, 360278, 281433, 256929, 368003, 388079, 326754, 249375, 228737, 190606, 251998, 266938, 80745, -18763, -4637, -69854, -173779, -55436, 58761, 156724, 242905, 354706, 278568, 92016, -104491, -126043, 21201, 81132, 59197, 71810, 48792, 66087, 103442, 131504, 124757, 76788, -26163, -119829, -14085, 144706, 229332, 224776, 179529, 174010, 124481, 114682, 220126, 225851, 135872, 117461, 122928, 140778, 76247, -30397, -19242, -78520, 15639, 149228, 127035, 126741, 232372, 223016, 150461, 175014, 241230, 219584, 292588, 309974, 257057, 254875, 221837, 125648, 165223]
13670A65223K5364L263j12006O9107P2878j9522j09863j00488j39554J1450L0188
13659a03960J2878J42666R5104k809j39891j4405J25920j3018m4019n1836n62
13648F068Q6354M7607L7217m425q4291K8393L5058J01728N8755o2900Q803O3244
13636C21611l6675o6102n0402L6994L7782l9232L601m402m1031J2156O6081n1670
13624A88711P4998J46818J19189M364p0324p30k9556p3395m7019o6074L6685k4469
13612B59198m9439R7059O5369J7635r4430j21358m9796P3375l5059j5719J6207
13601A63042q2656j75880P6198Q7493J4895l8600N3456n1560p0190K2327K6909
13590B5434j8409j4700p817K8853N5699J29087R7209p484r5537l0935O6207J23875
$$ y = [165223, 190587, 193850, 81844, 150951, 223829, 204307, 94444, -6044, -145598, -134148, -103960, -91082, 51584, 146688, 143879, 3988, -10417, 115503, 102485, 58466, 6630, 6068, 92422, 140029, 177246, 172821, 88530, 116923, 151981, 253709, 312464, 249564, 258367, 321611, 284936, 218834, 168432, 205426, 243208, 203976, 207577, 203175, 162144, 174300, 240381, 188711, 263709, 410527, 529716, 534080, 463756, 463026, 433470, 360075, 313056, 246982, 283667, 259198, 209759, 306818, 372187, 389822, 295392, 174034, 124238, 197613, 162554, 146835, 163042, 80386, -95494, -19296, 68197, 83092, 44492, 97948, 46388, -23802, -1475, 25434, 7025, -7675, -15492, 13361, 69060, 198147, 295356, 287872, 192335, 161400, 227607, 351482]
13578C51482k6360M166K5602r2997N0402J47533J24469R5385q2824j08165r7057
13567C91636n2921j23661m9948q338j19199p0812L3168K2698n415O0227L9210
13556A16645N2775L994l8859m2339K3533j648L1334K3980o1073m3605l1984N9923
13544I2676O6667N3367r7297m7119m7586k0405j00059o2940m5328l7670O4019
13533a81675J38962J30670R0433K0598M2913J6942l7928p9360m3021j4258R613
13522I3889P2004m2292l7720N6146R4947q1789p9564l0006L4144M4039L7136K1623
13510A82557l3331J4759j11902j63765P4225J16176J46254n948m2456J30442J2158
13499C19169p4622j00428p956J14210l5412q0933j49425k7226N3623M7581K6077
$$ y = [351482, 325122, 329288, 354890, 261893, 312295, 459828, 584297, 679682, 596858, 488693, 391636, 338715, 215054, 165106, 156768, 37569, -33243, -75, 22623, 17208, 77435, 116645, 169420, 173414, 134555, 92216, 115749, 114101, 145435, 169415, 108342, 64737, 32753, 92676, 159343, 212710, 115413, 68294, 20708, 303, -99756, -162696, -208024, -245694, -181675, -42713, 87957, 178390, 198988, 241901, 258843, 220915, 141555, 98534, 84276, 93889, 165893, 123601, 85881, 142027, 236974, 155185, 75621, 45615, 79759, 123798, 160934, 182557, 149226, 163985, 52083, -111682, -37457, 78719, 224973, 219025, 176569, 307011, 319169, 244547, 144119, 136163, 250373, 214961, 134028, -15397, -42623, 11000, 58581, 84658]
13488H4658p5259M4910K2727M3355P6783p0417l1514J45851N5552N1234j23424
13477B24456j92030J11392Q3206P919p0847j03064O971M1238L2702l7325J11321
13466B15939J64193L2819n598n0817q0200Q470M3968J33785J1450J90674K21735
13455H86418K45131L65721L78614O43079O93974P89997N39332j02312m57375n65108
13445C417471p16550p69576m84904l09271j41301n7491k6490m7000o8715P9125
13435H75298k31862j06770k4777n2636Q8048O5328M7675N1780k6182K1251J017
13424G08170K002M9599Q9915J38612K67646O06264Q75762R18885Q38768N05046
13414E000669K4004n45911r13878q38168o24189n88769m64250j99153j10092n6198
$$ y = [84658, 9399, 54309, 77036, 120391, 197174, 126757, 95243, 241094, 296646, 347880, 224456, 32426, 143818, 227024, 234943, 164096, 61032, 68003, 109241, 141943, 104618, 215939, 380132, 412951, 407353, 356536, 276336, 284806, 328774, 462559, 474009, 664683, 886418, 1131549, 1497270, 1875884, 2518963, 3212937, 4002934, 4542266, 4439954, 3982579, 3417471, 2700921, 1931345, 1446441, 1137170, 995869, 938378, 911888, 864888, 796173, 875298, 643436, 536666, 511889, 459253, 547301, 612629, 660304, 712084, 685902, 707153, 708170, 710172, 759771, 849686, 988298, 1255944, 1862208, 2737970, 3656855, 4495623, 5000669, 5024673, 4478762, 3564884, 2726716, 2102527, 1513758, 1049508, 850355, 740263, 684065]
13404F84065K9755q0437o27n9324j02487K4578N1734M9513J22724J45244J11222
13393I75960K08680M00659K39939L92974O69914Q41279R51706P15903J89681l46785
13383E239910r91200j079409q53631o50102l29901j37383Q669k2304j28189j51540
13373I04920j87765j11941j6655K3019P3847J9208J0208M9558L6054O7480L6283
13362I04216J52195K14275O7174J17725L12310J17283L79628N61095P59195P23790
13352D308886N45298K74642l22487p57140q69212q52833o11315l07944l03237
13343A104658j89141r7198k7387L0308p3156j00873n0186J2215j1390N7689O8136
13332G23675M5191J1764o3265k8018m3902j01326p9179N2460o3035j88359n6331
$$ y = [684065, 713820, 633383, 632756, 573432, 470945, 495523, 547257, 596770, 719494, 864738, 975960, 1184640, 1585299, 1825238, 2218212, 2888126, 3729405, 4681111, 5397014, 5586695, 5239910, 4248710, 3169301, 2315670, 1665568, 1335667, 1198284, 1206953, 1184649, 1056460, 904920, 717155, 605214, 588559, 611578, 685425, 704633, 714841, 764399, 800453, 867933, 904216, 1056411, 1270686, 1337860, 1455585, 1767895, 1885178, 2264806, 2825901, 3585096, 4308886, 4854184, 5128826, 4806339, 4049199, 3179987, 2327154, 1715839, 1407895, 1104658, 915517, 818319, 790932, 821240, 748084, 647211, 597025, 609240, 597850, 655539, 723675, 768866, 780630, 717365, 689347, 645445, 544119, 464940, 517400, 454365, 266006, 209675]
13321B09675q8983P3918K8341K178N7853J4174k9069j31757N0374J00416J77940
13310D65060j14560L6822J71684M3185O4678L6480N9609J45604M2529o5800j05477
13299G79814j35886j66929j41856J10513J0846j31777j4375p696j12020j28947
13289F1687L2322O0039R033m5019q9784j10879J1839N4206K955J06337l1211M8222
13277A09747k9061p141M6917k6525m4220R4109O9098J5616N3058Q507j9366k9727
13265B41012j07726l1965k3268N586O3252M2123j4020K2401l2678N3018J08142
13254C25877j11607j0886K0083K877j3255Q9760j9934j27729P2575m285p3686
13243A49790L2210k703Q559n9869j13838M2880M7903J03529J9916M5495K5464
$$ y = [209675, 120692, 194610, 222951, 225129, 282982, 297156, 268087, 136330, 186704, 287120, 465060, 350500, 387322, 559006, 602191, 666869, 703349, 762958, 908562, 951091, 885291, 779814, 643928, 476999, 335143, 445656, 456502, 324725, 310350, 302654, 190634, 61687, 94009, 154048, 163081, 118062, 28278, -82601, -70762, -16556, -13601, 92736, 61525, 109747, 80686, 73545, 120462, 93937, 49717, 143826, 212924, 228540, 281598, 290105, 270739, 241012, 133286, 101321, 78053, 83639, 146891, 189014, 174994, 197395, 164717, 217735, 325877, 214270, 203384, 223467, 226344, 213089, 302849, 282915, 155186, 227761, 223476, 149790, 182000, 179297, 187856, 127987, 14149, 57029, 104932, 208461, 228377, 273872, 299336]
13232B99336p602r0112K7360J6676m618m4925j07555L8679Q3034o4120m8170j09154
13220a1171k2374J24472J58326L5433N993j6199J5542j44144o746J04184M4549
13209B87865j9734O1586Q4646Q593j60453j03809k3030M6244K7182J1837m2353
13198A78574J8094P9467k2305m5407J8752J0006j7100J1399l462N5836j2747K016
13186B73123l8969P3840j11649m2300P3035Q3627q6181o0645N8347k8715N2888
13175B46401M4982j02842Q3251R1122l7412n6222m8786M4122P4466j33205p0019
13164A35858L8519R7219P6474n3157k1737l3950l4738l1085N5468N3579l3504
13153B48946n5203k8857P7523L5282L5904m6003o763j907o800Q17K4848J1581
$$ y = [299336, 291734, 201622, 228982, 245658, 241040, 196115, 88560, 127239, 210273, 146153, 97983, -11171, -33545, 90927, 249253, 284686, 290679, 274480, 290022, 145878, 139132, 243316, 287865, 268131, 329717, 414363, 422956, 262503, 158694, 135664, 181908, 209090, 220927, 178574, 196668, 276135, 253830, 208423, 227175, 237181, 220081, 231480, 228018, 283854, 271107, 273123, 234154, 307994, 196345, 154045, 227080, 310707, 224526, 163881, 222228, 193513, 246401, 291383, 188541, 271792, 362914, 325502, 269280, 220494, 264616, 339082, 205877, 135858, 174377, 271596, 348070, 294913, 273176, 239226, 204488, 173403, 228871, 282450, 248946, 193743, 164886, 242409, 277691, 313595, 267592, 260829, 258922, 252122, 252939, 277787, 289368]
13141B89368K4785J5832J5250L522M0453Q341K912n8956n0457j17494L1049l4374
13129A70231J8907R1367K6862N9179Q683p928L1249k4511r3474M2309l9895p9045
13117B03934L0394n1939K8678P7740K2833L8319q2136j26039m7664R1997J2622
13106A98739P6945Q600m6560Q667R2861m6575q2467l2252j0590K1841J21312K12032
13094E22553n7575j76639N143J7322J5096P2039o7944p2383J20372O0361j35285
13083C03060j23875j10887p5458J69419J33292J25567K3471j499M3610L6696r4986
13072D28410q3749r9172n2385o546M882K7320L042k6573K50J6299N5949j39824
13060A27903q839k4948o1683L0921k1275p9001J38552J46882J32805J0133J4670
$$ y = [289368, 314153, 329985, 345235, 348757, 389210, 397551, 400463, 341507, 291050, 173556, 204605, 170231, 189138, 280505, 307367, 366546, 375229, 367301, 398550, 374039, 280565, 322874, 282979, 203934, 234328, 182389, 211067, 288807, 311640, 349959, 267823, 141784, 94120, 186117, 198739, 275684, 284284, 237724, 246391, 339252, 292677, 210210, 177958, 167368, 189209, 310521, 522553, 464978, 288339, 293482, 310804, 325900, 397939, 329995, 257612, 377984, 438345, 303060, 179185, 68298, -7160, 162259, 295551, 421118, 444589, 443090, 486700, 523396, 428410, 344661, 245489, 193104, 186558, 191440, 218760, 221802, 195229, 195479, 211778, 267727, 127903, 119064, 94116, 32433, 63354, 42079, -36922, 101630, 248512, 381317, 391450, 406120]
13049D06120n3537m4509m1093L7126n0211j5714J20624J11712r2385q0647O6796
13038C64282L7306l9175K3422m1594j09400O1758K16300J28006l3244J00760N5713
13027G64134r8984l7447o0264j39664n0327M2359K6216j13797r7624P7563R931
13016C22096j5681Q933l2323n2824r124L0203M709l4636K5920o0207M8743N3307
13004B89116r9848q929K0874R644L1643m9964n8460N5456J52597L6590j0611L7195
12992D05303r8879j36669J0882J06345J52262L9169J92846K28951P6691j4553
12982I62348j36532j19629j21014q8902j07537k1196P8647J5349R2140m10m2909
12971E10355Q9944M0184j26487M8557M0406N4806L1639q5262p2104R2187J112
$$ y = [406120, 352583, 308074, 266981, 304107, 253896, 238182, 358806, 470518, 378133, 297486, 364282, 401588, 362413, 385835, 344241, 234841, 296599, 512899, 640905, 607661, 708421, 764134, 665150, 627703, 567439, 427775, 377448, 419807, 446023, 332226, 234602, 312165, 322096, 306415, 315348, 283025, 230201, 221077, 251280, 255989, 221353, 247273, 187066, 235809, 289116, 189268, 180339, 201213, 210857, 242500, 192536, 134076, 189532, 342129, 378719, 368108, 405303, 306424, 169755, 180637, 286982, 439244, 478413, 671259, 900210, 976901, 962348, 825816, 706187, 585173, 496271, 388734, 367538, 446185, 461534, 553674, 553264, 510355, 600299, 640483, 513996, 562553, 602959, 657765, 689404, 604142, 532038, 624225, 625337]
12960F25337j7262M1515P726q559j11618j08460n5231j00174n7761J10978P6165
12949D02656m2132o8645J20517Q9578R3673J06877M3954M8665K5381K8493M1332
12938H90349J7960n3681j48502n4907q0685m9613L4961m5004R561L9042N8964
12927F18445q8568k1431J9874J164j4428n6510k3818P6347M3932N6122p130k5002
12915E78997R0257J03373m7872n2763K2356J03612Q3021M0578p9598J56423O9012
12904A067396l6928l7785j57856j35296l8311m6687J9595O5233K8989p2895n6418
12893E99037P1338n1806j0152l2655P6132Q461J4482P7181J35021P558P9550K696
12881I76843q872R6415J0907j5296p0655j40276k9845l190k9261n954m1709J6544
$$ y = [625337, 608075, 649590, 657316, 648757, 537139, 428679, 373448, 273274, 215513, 326491, 402656, 360524, 291879, 412396, 501974, 595647, 702524, 746478, 795143, 820524, 849017, 890349, 908309, 854628, 706126, 651219, 570534, 520921, 555882, 510878, 520439, 559481, 618445, 529877, 508446, 528320, 529484, 515056, 458546, 434728, 511075, 555007, 611129, 603999, 578997, 669254, 772627, 724755, 671992, 694348, 797960, 880981, 921559, 841961, 998384, 1067396, 1030468, 992683, 834827, 699531, 661220, 614533, 634128, 699361, 728350, 655455, 599037, 670375, 618569, 608417, 575762, 651894, 660355, 674837, 752018, 887039, 894597, 974147, 976843, 967971, 1064386, 1075293, 1059997, 989342, 849066, 819221, 816031, 786770, 780816, 739107, 755651]
12869G55651k1465j27145L927N4371r5035r53k6556j0291J3492j0809j27342m5139
12857C62706k1800m2481j5274J27438M120j15210K0287J7270J58723Q9839J37242
12846G22860L3407J4571l8290q0141m4010j03822L1589n1993p4626R5955Q8110
12835E93610l0423l4093P5354O0337n6455l1834J415k8781l5541J8672P5969N2942
12823F61172R6517N6137o2861n1279j20757k2498N2902O096n2822l1869o8058
12812D62680M4528N2049j48832l5412M8253l5963k4446J28500l2861j21695j12725
12801B24076K240Q4933K2839j45521n653O4695J05065J09081k4563j3238k7818
12790C96136j8861K6037m621K8408L9552r787K933R9374J17778K8753j27161j94213
$$ y = [755651, 734186, 607041, 610968, 665339, 570304, 569351, 542795, 532504, 545996, 535187, 407845, 362706, 340906, 298425, 283151, 410589, 414709, 299499, 319786, 337056, 495779, 585618, 722860, 756267, 770838, 732548, 652407, 608397, 504575, 536164, 484171, 409545, 505500, 593610, 563187, 529094, 604448, 664785, 608330, 576496, 577911, 549130, 513589, 532261, 608230, 661172, 757689, 813826, 750965, 699686, 578929, 556431, 609333, 615429, 562607, 530738, 462680, 507208, 559257, 410425, 375013, 423266, 387303, 362857, 491357, 458496, 336801, 224076, 226316, 311249, 334088, 188567, 182914, 247609, 352674, 461755, 437192, 423954, 396136, 377275, 403312, 398691, 427099, 466651, 456864, 459797, 559171, 676949, 705702, 578541, 384328]
12778C84328M6398J30849J37512J02496P9731M7723K8604j5762M1592O2798M2396
12767A088665Q3110k76M5759o9674k4508L8301r044M5825q4145j07801j8730q7606
12755H99876M455J0148L1103m7157Q3116R8661N6858Q6416J41561J78976J46592
12744A690605J54245L7130O3611k8014m0289j41676j12115p1252j11686o3344
12734A377215m2810K6687P7436J9342M2008J82274K6428N8239K26736K44704J00750
12723B339009J64426L40217M34381L24728K86293K83629K67182J31882P6510j9060
12713D629197k14208l55163m12895l96190k74952k00778j68381j55859p8598j01832
12703B270341K9279J47971O6101o71R9081J74454L33421L81845K85066L07006
$$ y = [384328, 430726, 561575, 699087, 801583, 881314, 929037, 957641, 941879, 983471, 1046269, 1088665, 1171775, 1171499, 1217258, 1147584, 1123076, 1161377, 1152333, 1198158, 1114013, 1006212, 987482, 899876, 904331, 914479, 945582, 898425, 981541, 1080202, 1137060, 1223476, 1365037, 1544013, 1690605, 1844850, 1881980, 1945591, 1917577, 1877288, 1735612, 1623497, 1552245, 1440559, 1377215, 1334405, 1361092, 1438528, 1457870, 1499878, 1682152, 1708580, 1766819, 1993555, 2238259, 2339009, 2503435, 2843652, 3278033, 3602761, 3889054, 4172683, 4439865, 4571747, 4648257, 4629197, 4414989, 4059826, 3646931, 3250741, 2975789, 2775011, 2606630, 2450771, 2372173, 2270341, 2299620, 2447591, 2513692, 2513021, 2612102, 2786556, 3119977, 3501822, 3786888, 4093894]
12693D093894K79180M20880M07258K18888L6785j21275k53279l35635n10142n35282
12683C701272m25267l04982l83054l89343k93493l02239o8342n4890l29l5609
12673A443724p4926L7409J045Q4979K08842J92297J75341J89649L13762J98372
12663B770494K89085J95269Q0103l490j57690k32585l68144l56221k28614k95045
12653A693162k36207q4712j07492j32268o8592n7975m3261n1113q4554n9739K4658
12642G91907j06082m498J32480L4561q0882O1910J3501q2006q8133o2746k5858
12631E84154m5308J2004J29175O2752k9853n975j311j06891K1818P9184J43083
12620H42832J9044j22428k5968j08246n438M1713J6776L2830m1651J0936k8424
$$ y = [4093894, 4373074, 4793954, 5201212, 5420100, 5456885, 5335610, 5082331, 4746696, 4236554, 3701272, 3276005, 2971023, 2587969, 2198626, 1905133, 1602894, 1534552, 1479662, 1479333, 1443724, 1368798, 1406207, 1407252, 1492231, 1701073, 1893370, 2068711, 2258360, 2572122, 2770494, 3059579, 3254848, 3334951, 3331461, 3173771, 2941186, 2573042, 2216821, 1988207, 1693162, 1456955, 1372243, 1264751, 1132483, 1063891, 1005916, 962655, 911542, 826988, 767249, 791907, 685825, 681327, 813807, 848368, 767486, 829396, 842897, 760891, 672758, 610012, 584154, 538846, 550850, 680025, 742777, 712924, 706949, 705638, 598747, 620565, 699749, 842832, 861876, 739448, 713480, 605234, 599796, 641509, 658285, 691115, 649464, 660400, 631976]
12609F31976R1396L0702K7729n583Q5712J99744P3513J0293P007P8575O5023N6536
12597A352623Q8665j5731L8627P3572Q748L0187p871n7861j69353l8212L5263
12586A338657j4707J9847j37548j32321n504j02641n8548j4221K1070k1551j2166
12575H80367K2901k7388n8752j9674k7655M7410q2166r3284O642o0036m3155O2791
12563F08001M7136M6866Q8609P8650r1837j12172p7064j04872K8679J10370L8527
12552F60893R5714M0106p9278l6262M3438N3264M0128O275L7137j12857q8674
12541F59884j37796R0078r056j2718J0450P3208J22129O1009n4364j26358m3803
12530F32663J15188k2907O6682N7909K4289l6991k253j54387J996M4933N2786
$$ y = [631976, 723372, 754074, 781803, 776220, 861932, 1061676, 1135189, 1145482, 1152489, 1231064, 1296087, 1352623, 1441288, 1425557, 1464184, 1537756, 1546504, 1576691, 1568820, 1510959, 1341606, 1303394, 1338657, 1323950, 1343797, 1206249, 1073928, 1068424, 965783, 907235, 893014, 914084, 892533, 880367, 903268, 875880, 817128, 797454, 769799, 817209, 735043, 641759, 648401, 588365, 545210, 608001, 655137, 702003, 790612, 869262, 777425, 665253, 588189, 483317, 511996, 622366, 660893, 756607, 796713, 717435, 681173, 724611, 777875, 818003, 824278, 861415, 748558, 659884, 522088, 612166, 603110, 590392, 600842, 674050, 796179, 857188, 802824, 676466, 632663, 747851, 724944, 791626, 849535, 873824, 836833, 834580, 680193, 682189, 727122, 779908]
12519G79908M3424j1754r4687p7644P8211J03786p9628J804j4204p7486L6740
12508F88470P1379o208N343Q9913J21257l2346m5905p5406l7927N5792J02272
12497I36634J3933P0809j3982q591O3178j5866r579k1795o8691Q4428M4882Q0774
12485A156134J34796K0545l3266j1093O6576K8109K5956J444p6444j44584o1180
12474A106993L47j17730o8626J24044P6307j24169j1168J19365Q2119m3296j9061
12463A125125N6740n3177o3303n596J24302l476m7642N47K7494k3010R276Q2972
12451A230252R5883o2665p8055q7009l7791J095N8377J81841O9739n1398R7290
12440A417559M52q8731j08267o0191P5428J35908K4331j47076m6388M2174M5765
$$ y = [779908, 823332, 811578, 716891, 639247, 717458, 821244, 741616, 743420, 729216, 651730, 688470, 759849, 753641, 758984, 848897, 970154, 937808, 891903, 816497, 778570, 834362, 936634, 950567, 1021376, 1007394, 998803, 1061981, 1046115, 1036536, 1014741, 946050, 1030478, 1075360, 1156134, 1290930, 1311475, 1278209, 1267116, 1333692, 1361801, 1387757, 1389201, 1312757, 1168173, 1106993, 1107340, 989610, 920984, 1045028, 1121335, 997166, 985998, 1105363, 1187482, 1144186, 1125125, 1181865, 1128688, 1065385, 1059789, 1184091, 1180615, 1132973, 1133520, 1161014, 1138004, 1147280, 1230252, 1326135, 1263470, 1185415, 1098406, 1060615, 1061710, 1120087, 1301928, 1371667, 1320269, 1417559, 1418011, 1329280, 1221013, 1160822, 1236250, 1372158, 1396489, 1249413, 1203025, 1245199, 1290964]
12429A290964j2101K08082M890j53967j08987j8945P6239J49420Q533P364N8435
12418A509927J13278N4552k6130j6764Q0184k7588q644K1618q044K8086N6527
12407A777002m3393L6960K1096N6143k1865k9284L397J0244q2060l2761j2590
12396A682889P528L2364l7333O8624J08827Q9485Q8920Q5765K8643M795J12353
12385B272860Q4894N2423N0213J11118O2192Q7993Q9894m0319o2138j9180J69109
12374B859059J46236N8601J16853J13453O0787R3038p0881L5952J39617J20143
12364C672858J15285K00615J68701K25604L49337L32021M39407L81721M19639
12355F305188M24578N67912O30896P34155J076622J108329J151135J571839K237211
$$ y = [1290964, 1278863, 1486945, 1491835, 1337868, 1228881, 1209936, 1286175, 1435595, 1444128, 1451492, 1509927, 1623205, 1677757, 1651627, 1634863, 1715047, 1687459, 1678815, 1700433, 1692389, 1720475, 1777002, 1733609, 1770569, 1791665, 1847808, 1825943, 1796659, 1800056, 1810300, 1728240, 1695479, 1682889, 1690417, 1722781, 1685448, 1754072, 1862899, 1952384, 2041304, 2127069, 2155712, 2160507, 2272860, 2357754, 2410177, 2460390, 2571508, 2633700, 2721693, 2811587, 2771268, 2709130, 2689950, 2859059, 3005295, 3063896, 3180749, 3294202, 3354989, 3448027, 3377146, 3413098, 3552715, 3672858, 3788143, 3988758, 4157459, 4383063, 4732400, 5064421, 5503828, 5885549, 6305188, 6729766, 7297678, 7928574, 8662729, 9739351, 10847680, 11998815, 13570654, 15807865]
12346A5807865K983184M112553N640237P699378R825041J1117596J0829108R858209
12338G7873171Q871924Q239353Q106411Q047133P377720N410429J806636k207217
12330A23525560n539541p382446p990900q053380q036227q613009r563513j0526107
12322E7820437j0831125r658042p656833n523844l783402k777137k141547j728887
12314A3719620j260943r75087p96849p97297o20527n63931m04187k99649l26036
12305G675114l02638l36733k81872k61277j79478q5312j62788J0323J6772J0030
12295F102141M0407J73608K72767K35112K40767K95665L85145M17702M99676N70422
12285I233412O19947O85407P63165R41101J310813J588356J914563K816161M014344
$$ y = [15807865, 18791049, 22903602, 28543839, 36243217, 46068258, 57185854, 68014962, 77873171, 86745095, 94984448, 103090859, 111137992, 118515712, 123926141, 125732777, 123525560, 117986019, 110603573, 102612673, 94559293, 86523066, 77910057, 68346544, 57820437, 46989312, 37331270, 29674437, 24150593, 20367191, 17590054, 15448507, 13719620, 12458677, 11483590, 10686741, 9889444, 9268917, 8704986, 8300799, 8001150, 7675114, 7372476, 7035743, 6753871, 6492594, 6313116, 6227804, 6065016, 6075339, 6092111, 6102141, 6142548, 6316156, 6588923, 6824035, 7064802, 7360467, 7745612, 8163314, 8662990, 9233412, 9853359, 10538766, 11301931, 12243032, 13553845, 15142201, 17056764, 19872925, 23887269]
12276B3887269N696522P872867J0056355J0896771J0321036R219744Q200069P813694
12268I3964327P860672P850041P216739M762647J182538k806763n806981p294680
12260A06928540p451605p331274p345466p828405q815229r624280r577523q232153
12252D0722605n899181l718455k232506j062338j52794O14535J507931K510720
12244C2290517L747002N589708Q329400J1584405J4511327J5741075J4918730
$$ y = [23887269, 29583791, 37456658, 47513013, 58409784, 68730820, 77950564, 86150633, 93964327, 101824999, 109675040, 116891779, 121654426, 122836964, 120030201, 114223220, 106928540, 99476935, 92145661, 84800195, 76971790, 68156561, 58532281, 48954758, 40722605, 34823424, 31104969, 28872463, 27810125, 27657331, 28271866, 29779797, 32290517, 36037519, 41627227, 49956627, 61541032, 76052359, 91793434, 106712164]
$$ [...]
##END NTUPLES=NMR SPECTRUM
##END=
