##TITLE=Analysis number 328286
Compound Code cc 24804
Project Code adrs
Chemist Name endeavour
##JCAMPDX= 6.0         $$ Bruker NMR JCAMP-DX V2.0
##DATA TYPE= NMR SPECTRUM
##DATA CLASS= NTUPLES
##ORIGIN= Bruker BioSpin GmbH
##OWNER= nmr
$$ XWIN-NMR		Version 3.5
$$ Tue May 22 11:25:03 2007 GMT Daylight Time (UT+1h)  MAYBRIDGE\nmr@NMR_250MHZ
##.OBSERVE FREQUENCY= 250.131544655141
##.OBSERVE NUCLEUS= ^1H
##.ACQUISITION MODE= SIMULTANEOUS (DQD)
##.ACQUISITION SCHEME= undefined
##.AVERAGES= 16
##.DIGITISER RES= 18
##SPECTROMETER/DATA SYSTEM= dpx250
##.PULSE SEQUENCE= zg30
##.SOLVENT NAME= CDCl3
##.SHIFT REFERENCE= (INTERNAL, CDCl3, 0, 16.4462)
##AUDIT TRAIL= $$ (NUMBER, WHEN, WHO, WHERE, WHAT)
$$ ##TITLE= Audit trail, XWIN-NMR		Version 3.5
$$ ##JCAMPDX= 5.01
$$ ##ORIGIN= Bruker BioSpin GmbH
$$ ##OWNER= nmr
$$ C:\u/data/dgb/nmr/ADRS/1340/pdata/1/auditp.txt
$$ ##AUDIT TRAIL=  $$ (NUMBER, WHEN, WHO, WHERE, WHAT)
(   1,<2007-05-22 11:24:39.77 +100>,<MAYBRIDGE\nmr>,<NMR_250MHZ>,
      <created by zg, POWCHK disabled, PULCHK disabled
       configuration hash MD5:
       76 6E 9A 78 1E 09 19 81 EC 84 63 8F B0 6A 59 2D
       data hash MD5: 64K
       1D 10 3D 88 3C 34 2A AF 3A CC 45 85 ED 22 C7 4D>)
(   2,<2007-05-22 11:24:52.22 +100>,<MAYBRIDGE\nmr>,<NMR_250MHZ>,
      <Start of raw data processing
       ef LB = 0.3 FT_mod = 6 PKNL = 1 SI = 32K 
       data hash MD5: 32K
       A7 EF 38 9E AC 5F C2 0A 81 15 F5 9F B3 87 1C EF>)
(   3,<2007-05-22 11:24:53.82 +100>,<MAYBRIDGE\nmr>,<NMR_250MHZ>,
      <apk 
       data hash MD5: 32K
       01 A6 3F EF 13 FE 38 C4 35 10 28 7A E6 5A A3 6F>)
(   4,<2007-05-22 11:24:54.52 +100>,<MAYBRIDGE\nmr>,<NMR_250MHZ>,
      <abs ABSG = 5 
       data hash MD5: 32K
       E1 F9 75 11 27 D0 87 54 6E 91 32 45 A1 35 2D 87>)
$$ ##END=
$$ 
$$ hash MD5
$$ FF 05 03 5C 0C D6 33 F7 0D 03 14 9A 04 6E 6C 9B
##$RELAX= 
##$RELAX= 
##$RELAX= 
##$RELAX= 
##$RELAX= 
##$RELAX= 
##$RELAX= 
$$ Bruker specific parameters
$$ --------------------------
##$DU= <C:\u>
##$EXPNO= 1340
##$NAME= <ADRS>
##$PROCNO= 1
##$TYPE= <nmr>
##$USER= <dgb>
##$AMP= (0..31)
100 100 100 100 100 100 100 100 100 100 100 100 100 100 100 100 100 100 
100 100 100 100 100 100 100 100 100 100 100 100 100 100 
##$AQSEQ= 0
##$AQ_mod= 3
##$AUNM= <au_zg>
##$AUTOPOS= <11 >
##$BF1= 250.13
##$BF2= 250.13
##$BF3= 250.13
##$BF4= 250.13
##$BF5= 500.13
##$BF6= 500.13
##$BF7= 500.13
##$BF8= 500.13
##$BYTORDA= 1
##$CFDGTYP= 0
##$CFRGTYP= 5
##$CHEMSTR= <none>
##$CNST= (0..31)
1 1 145 1 1 1 1 1 1 1 1 1 1 1 1 1 1 1 1 1 1 1 1 1 1 1 1 1 1 1 1 1 
##$CPDPRG= <>
##$CPDPRG1= <>
##$CPDPRG2= <>
##$CPDPRG3= <>
##$CPDPRG4= <mlev>
##$CPDPRG5= <mlev>
##$CPDPRG6= <mlev>
##$CPDPRG7= <mlev>
##$CPDPRG8= <mlev>
##$CPDPRGB= <>
##$CPDPRGT= <>
##$D= (0..31)
0 1 0 0 0 0 0 0 0 0.06 0 0 0 0 0 0 0.0002 0 0 0 0 0 0 0 0 0 0 0 0 0 0 
0 
##$DATE= 1179829477
##$DBL= (0..7)
120 120 120 120 120 120 120 120 
##$DBP= (0..7)
150 150 150 150 150 150 150 150 
##$DBP07= 0
##$DBPNAM0= <>
##$DBPNAM1= <>
##$DBPNAM2= <>
$$ [...]
##$SUBNAM8= <"">
##$SUBNAM9= <"">
##$SW= 20.6930455092707
##$SWIBOX= (0..15)
0 0 3 0 0 0 0 0 0 0 0 0 0 0 0 0 
##$SW_h= 5175.983436853
##$TD= 65536
##$TD0= 1
##$TE= 683.16
##$TE2= 300
##$TE3= 300
##$TEG= 300
##$TL= (0..7)
0 120 120 120 120 120 120 120 
##$TP= (0..7)
150 150 150 150 150 150 150 150 
##$TP07= 0
##$TPNAME0= <>
##$TPNAME1= <>
##$TPNAME2= <>
##$TPNAME3= <>
##$TPNAME4= <>
##$TPNAME5= <>
##$TPNAME6= <>
##$TPNAME7= <>
##$TPOAL= (0..7)
0.5 0.5 0.5 0.5 0.5 0.5 0.5 0.5 
##$TPOFFS= (0..7)
0 0 0 0 0 0 0 0 
##$TUNHIN= 0
##$TUNHOUT= 0
##$TUNXOUT= 0
##$USERA1= <user>
##$USERA2= <user>
##$USERA3= <user>
##$USERA4= <user>
##$USERA5= <user>
##$V9= 5
##$VALIST= <valist>
##$VCLIST= <CCCCCCCCCCCCCCC>
##$VD= 0
##$VDLIST= <DDDDDDDDDDDDDDD>
##$VPLIST= <PPPPPPPPPPPPPPP>
##$VTLIST= <TTTTTTTTTTTTTTT>
##$WBST= 1024
##$WBSW= 4
##$XGAIN= (0..3)
0 0 0 0 
##$XL= 0
##$YL= 0
##$YMAX_a= 338708
##$YMIN_a= -213639
##$ZGOPTNS= <>
##$ZL1= 120
##$ZL2= 120
##$ZL3= 120
##$ZL4= 120
##$ABSF1= 16.44621
##$ABSF2= -4.246962
##$ABSG= 5
##$ABSL= 3
##$ALPHA= 0
##$AQORDER= 0
##$ASSFAC= 0
##$ASSFACI= 0
##$ASSFACX= 0
##$ASSWID= 0
##$AUNMP= <proc_1d>
##$AZFE= 0.1
##$AZFW= 0.1
##$BCFW= 0
##$BC_mod= 0
##$BYTORDP= 0
##$COROFFS= 0
##$CY= 12.5
##$DATMOD= 1
##$DC= 0
##$DFILT= <>
##$DTYPP= 0
##$F1P= 14.0000005364418
##$F2P= -0.99999901652339
##$FCOR= 0.5
##$FTSIZE= 32768
##$FT_mod= 6
##$GAMMA= 0
##$GB= 0
##$INTBC= 1
##$INTSCL= 1
##$ISEN= 128
##$LB= 0.3
##$LEV0= 0
##$LPBIN= 0
##$MAXI= 10000
##$MC2= 0
##$MEAN= 0
##$ME_mod= 0
##$MI= 0
##$NCOEF= 0
##$NC_proc= -5
##$NLEV= 6
##$NOISF1= 0
##$NOISF2= 0
##$NSP= 0
##$NTH_PI= 0
##$NZP= 0
##$OFFSET= 16.44621
##$PC= 1
##$PHC0= -45.71429
##$PHC1= 0.6387742
##$PH_mod= 1
##$PKNL= yes
##$PPARMOD= 0
##$PSCAL= 4
##$PSIGN= 0
##$REVERSE= no
##$SF= 250.130018955984
##$SI= 32768
##$SIGF1= 0
##$SIGF2= 0
##$SINO= 400
##$SIOLD= 32768
##$SREGLST= <1H.CDCl3>
##$SSB= 0
##$STSI= 32768
##$STSR= 0
##$SW_p= 5175.98343685301
##$SYMM= 0
##$S_DEV= 0
##$TDeff= 65536
##$TDoff= 0
##$TI= <Analysis number 999999
Compound Code 99
Book Reference 9
Project Code 9>
##$TILT= no
##$TM1= 0
##$TM2= 0
##$TOPLEV= 0
##$USERP1= <user>
##$USERP2= <user>
##$USERP3= <user>
##$USERP4= <user>
##$USERP5= <user>
##$WDW= 1
##$XDIM= 32768
##$YMAX_p= 550041992
##$YMIN_p= -728394
$$ End of Bruker specific parameters
$$ ---------------------------------
##NTUPLES= NMR SPECTRUM
##VAR_NAME=  FREQUENCY,     SPECTRUM/REAL,   SPECTRUM/IMAG
##SYMBOL=    X,             R,               I
##VAR_TYPE=  INDEPENDENT,   DEPENDENT,       DEPENDENT
##VAR_FORM=  AFFN,          ASDF,            ASDF
##VAR_DIM=   32768,         32768,           32768
##UNITS=     HZ,            ARBITRARY UNITS, ARBITRARY UNITS
##FACTOR=    0.157963299565203, 1,           1
##FIRST=     4113.69103446758, 0,            0
##LAST=      -1062.29240238543, 0,           0
##MIN=       -1062.29240238543, -728394,     0
##MAX=       4113.69103446758, 550041992,    0
$$ Real data points
##PAGE= N=1
##DATA TABLE= (X++(R..R)), XYDATA
$$ [...]
27909g4916j13133q3647J84666K01763Q7394j19059k76687j62170K28177K13618
27899H6006J55013M3031l0279j4762P5729k16220l9946L1673J64984j34141k50503
27888a29415m803J05760J61731j2615L118o0321j5615K9499L6410j25024J79999
27877A68724R599r2455n0378m1517r05p4203p275q5459n3309n145K27670J14687
27865A10034j04797p0004N7113P0098O7163J72880j4846j18525J36483M7605j47297
27854B05907K138k6297J31559l798j60847Q0994J53036p5064k41416j10794j2858
27843e7440m3032N0607J67610L60j32659j18216p570m6512m0321O2185M820N9876
27831a00292O676K9526Q2671K8753k4609K6328J68881L7117j80057q4924r7760
$$ plain form
27909 -74916 -188049 -271696 -87030 114733 202127 83068 -193619 -355789 -127612 86006
27899 86006 241019 284050 253771 239009 314738 98518 58572 90245 255229 121088 -129415
27888 -129415 -134218 -28458 133273 120658 123776 63455 47840 77339 113749 -11275 168724
27877 168724 178323 85868 35490 -6027 -6932 -81135 -88410 -173869 -227178 -232323 -4653 110034
27865 110034 5237 -64767 -7654 62444 129607 302487 287641 169116 305599 353204 205907
27854 205907 208045 181748 313307 309509 148662 229656 382692 307628 66212 -44582 -57440
27843 -57440 -100472 -49865 117745 118105 -14554 -132770 -140340 -186852 -227173 -164988 -160168 -100292
27831 -100292 -93616 -64090 18581 47334 22725 49053 217934 255051 74994 -9930 -107690
27820a07690N4076K20185Q1048M0478o8289m1982j60899m3690J6223m6015q6983
27809a43538q3256O467m2821J22291K53062R8985p583k5230q9919j8106p587L3434
27797I6199j31884M525M7723K8387L0870r3713p1733k483M5303p5388M4671J76861
27785I9338J16487j13596n8511q0775j46359J1870k1573J0322L6364Q4862J47281
27774H5710K1886j14647j32934n0032r0187N879L0894M9143K81556K80764N4861
27763D22893k33133j0913J41695q1114j27306j22394N9720J34579P3455q6958
27753A70524j19534m9987n7636J59386l3851k92526j1227R9356J35939j7783o4790
27742h2129o7478j0246o061N9804l214P277K15732K10497l1705j38417n0544j43667
$$ plain form
27820 -107690 -53614 166571 247619 288097 219808 177826 16927 -26763 -10540 -56555 -143538
27809 -143538 -226794 -220327 -263148 -140857 112205 211190 203607 178377 88458 70352 62765 96199
27797 96199 -35685 -31160 16563 44950 75820 -17893 -89626 -92109 -46806 -122194 -77523 99338
27785 99338 215825 102229 43718 -37057 -183416 -171546 -193119 -182797 -146433 -61571 85710
27774 85710 107596 -7051 -139985 -190017 -280204 -274325 -243431 -194288 87268 368032 422893
27763 422893 189760 178847 320542 239428 112122 -10272 49448 184027 257482 170524
27753 170524 50990 1003 -56633 102753 68902 -223624 -234851 -135495 444 -17339 -82129
27742 -82129 -149607 -159853 -165914 -106110 -109324 -102047 113685 324182 292477 154060 103516 -40151
27730d0151N5398M9029J07342O8056K3124j46592J05088k5641j77739j3548L7523
27719D1889K3k0477k9709J53113p0493l8180n4511j04543j46360J13988O3568
27708i1692K6733o0580j2350j41233k7618N1025R8967J13935L1753j00952p663
27697a19675J09966K04861k0644j6944j8027P7844Q7341M5653k36246j94671N2695
27686b7847M8245J8788j04005M5882M7436q7744k20681j28107J98000J48861K2250
27675c8922R9034l5323K1516J189J62733O5984l5859j20857l4662O3120J06760
27664B54713j15322k11349o9096L7782L2099p1215P9748J60273j43770j45112
27654a91249M2030K9724M4457J3638J46441K8989j54367j66880J79793K05141
$$ plain form
27730 -40151 15247 64276 171618 239674 262798 116206 221294 195653 17914 4366 41889
27719 41889 41912 21435 -8274 144839 74346 36166 -18345 -122888 -269248 -155260 -91692
27708 -91692 -64959 -125539 -137889 -279122 -306740 -255715 -156748 -42813 -11060 -112012 -119675
27697 -119675 -9709 195152 174508 157564 139537 217381 304722 350375 114129 -80542 -27847
27686 -27847 20398 39186 -64819 -18937 28499 -59245 -279926 -408033 -210033 -61172 -38922
27675 -38922 60112 24789 46305 47494 210227 276211 240352 119495 84833 147953 254713
27664 254713 139391 -71958 -141054 -103272 -71173 -142388 -62640 97633 -46137 -191249
27654 -191249 -149219 -119495 -75038 -61400 85041 114030 -40337 -207217 -27424 177717
27644A77717L1555j26443p7606J01218r398J1372q6993o1817o0963j7368q9632
27633b08358j25034K1346R2895J3640R292m8887n0837M136P1734k4119m2229J57600
27621a28821Q6238K4695o2629n9527K21217M5321l066r3692r0265P1455Q9128
27610A00054K351o7373J09676k667p157j8351j7663l5982N956j5238J1982r0312
27598b4724L5431L01871j33570k31431N2591n2632o2680k5362Q2215J12395J06127
27587A60231o0076j01471j24421q7037K86478P2446J73728j54246k08197k41686
27577b84251J83196K0670O1521K49471q5159k73237p6738m1166M8815K24810j14751
27566h6819j84023j8259J38490L762P376l0130J2879J88883P2780n4809J6919
$$ plain form
27644 177717 209272 82829 5223 106441 97043 108415 21422 -40395 -101358 -118726 -208358
27633 -208358 -333392 -312046 -219151 -205511 -196219 -245106 -295943 -291807 -220073 -244192 -286421 -128821
27621 -128821 -42583 -17888 -80517 -140044 81173 126494 123428 29736 -60529 10926 100054
27610 100054 102405 35032 144708 142041 134884 116533 98870 62888 68844 53606 65588 -24724
27598 -24724 10707 312578 179008 -52423 168 -52464 -115144 -140506 -58291 54104 160231
27587 160231 100155 -1316 -125737 -212774 73704 146150 319878 165632 -42565 -284251
27577 -284251 -101055 -80385 -18864 230607 145448 -127789 -204527 -245693 -196878 27932 -86819
27566 -86819 -270842 -289101 -150611 -146849 -139473 -169603 -156724 32159 104939 50130 67049
27555F7049L3254O2990J00616K0951J47842M7755k91204j99981j52125N0265K38762
27544A26174R005k980k25034l8108K43751j6156K5847M1221l6244j44831Q9388
27533G2033J14623j1710M5130m730N0368p2788j74487O50K3k4621J07012j63112
27521f1609j53823K1963J22956j7905R5387K06943L5720m1173k88674K0190P9426
27510A9401m8558o7063M5407J51479R9517m6572m4783K1886K22941J5842o4968
27499C04529o1881p8941r3101K6092J4428J18949L2479P731J04630o6748p639
27488C00528p2662o9866j03717J40951O4980j04157k3462p4585M0723N8743o3712
27477I3764k21833k72947K26894K01584O2875J79042r5023l18119n3438J93793
$$ plain form
27555 67049 100303 163293 263909 284860 432702 480457 189253 -10728 -162853 -112588 126174
27544 126174 135179 132199 -92835 -130943 112808 96652 122499 163720 127476 -17355 72033
27533 72033 186656 174946 220076 215346 265714 192926 18439 19089 19112 -5509 101503 -61609
27521 -61609 -215432 -193469 -70513 -88418 6969 213912 249632 208459 -80215 -60025 19401
27510 19401 -29157 -96220 -50813 100666 200183 153611 108828 130714 353655 369497 304529
27499 304529 242648 163707 70606 96698 111126 230075 262554 270285 374915 308167 300528
27488 300528 227866 158000 54283 195234 260214 156057 132595 58010 98733 157476 93764
27477 93764 -128069 -401016 -174122 27462 90337 269379 174356 -143763 -197201 -3408
27467c408q570m1272m243j20494J26153j025K18918P1595o9510j42893K2297j01970
27455e4422J2685n6q4690J13050j0220J5514o7024j14820l7303K09073J65900
27444A47687j9219k20094j43942O9315L9505J14069j4757m4243m198J7157J91668
27433A32948L6882p6438n4317o7098o3452p007J4072o721J18512p957O4825l127
27421H1122K3683N7623o6884K9842k5997j28807N1983q2902j78965O2900J54659
27410b1743L4887K3586o4285n4006J60322J71546j76995j99612m5892J3337n3511
27399b12366K2895M3799J33749l034R3489J5205n1147j34427j9769P6811J09699
27388G4904O6077j7158j70963L0535P2899J3169P080p5328j17487J3981J27219
$$ plain form
27467 -3408 -11978 -53250 -57493 -177987 -51834 -52859 166059 237654 168144 25251 47548 -54422
27455 -54422 -41737 -41793 -126483 -13433 -23653 -8139 -75163 -189983 -227286 -18213 147687
27444 147687 128468 -91626 -235568 -166253 -126748 -12679 -27436 -71679 -75877 -58720 132948
27433 132948 169830 93392 39075 -28023 -91475 -98482 -84410 -91131 27381 19424 84249 81122
27421 81122 104805 162428 95544 125386 99389 -29418 22565 -60337 -239302 -176402 -21743
27410 -21743 13144 36730 -27555 -81561 78761 250307 73312 -126300 -172192 -158855 -212366
27399 -212366 -189471 -145672 -11923 -14957 78532 93737 42590 -91837 -111606 -34795 74904
27388 74904 140981 123823 -47140 -16605 56294 69463 76543 1215 -116272 -102291 24928
27377B4928O9051n645r249N3375M1199j25951m2632J6537k42275j09225m9449
27366c79336J11701J97924N4105M3206m0399j25894k5781J40959R8045p8413K5499
27355B1616M1565n3778k08748q132J85155J26219q738N3218K25477q1924o9213
27344B22717J26114j54582j02766r809j31306j55492J14602J03529J54672N5470
27334B23149Q4736k19415k13416j6983J00627J58038k225j28916p3989o641P8532
27323a6503k9900L7938j46804l8330R9342O3057O2052J67581P342j22605j86634
27312a03464p977L4364J74973J13343P0884o6961r9795j17269N7678J11686R2690
27301B60152j801r9315o9351q9693M5452J5435p2062l6853k2046J05980P2594
$$ plain form
27377 24928 93979 88334 79085 132460 173659 47708 5076 21613 -220662 -329887 -379336
27366 -379336 -267635 -69711 -15606 27600 -12799 -138693 -164474 -23515 74530 -3883 21616
27355 21616 63181 9403 -199345 -207477 -22322 103897 95159 148377 373854 291930 222717
27344 222717 348831 194249 91483 81674 -49632 -205124 -90522 13007 167679 223149
27334 223149 307885 88470 -124946 -141929 -41302 116736 114511 -14405 -88394 -95035 -16503
27323 -16503 -46403 -8465 -155269 -193599 -94257 -31200 30852 198433 205775 83170 -103464
27312 -103464 -111441 -77077 97896 211239 282123 215162 115367 -1902 55776 167462 260152
27301 260152 258351 159036 89685 -8 45444 60879 -11183 -48036 -70082 35898 108492
27290A08492n8148J8305M5190k12605k05540p2900l6788J98660J70858K1494k46582
27279b69564j34536O9334J47032J07827O4835O5849n1163K0925M0959J51703j10685
27268A02516j04851l7319p8325k255j59575r7770J08881P7819J82344l4757q5141
27257a28433j02927j23936j28961Q1490J70811J86123K43578k0287l3208j34173
27247A0077n2155Q2782j69556L8810k3123J2602N1172n5468k08652K9307K39855
27236d4349Q4526k461O5486m5275J3742q663q0288o3324m555L7950M2918J10489
27224A06196r1738k2677J27770m9614l006k8706o0240J37752J63034n7501p5633
27213A45637j49859m5750n9517J9607j2352J1004K2564j954O9668N4620j418K635
$$ plain form
27290 108492 50344 68649 113839 -98766 -304306 -377206 -413994 -215334 -44476 -22982 -269564
27279 -269564 -404100 -334766 -187734 -79907 -15072 50777 -386 20539 61498 213201 102516
27268 102516 -2335 -39654 -117979 -120234 -279809 -377579 -268698 -190879 -8535 -43292 -128433
27257 -128433 -231360 -355296 -484257 -402767 -231956 -45833 197745 177458 144250 10077
27247 10077 -42078 40704 -128852 -90042 -113165 -100563 -49391 -104859 -313511 -284204 -44349
27236 -44349 40177 37716 103202 57927 71669 63006 -17282 -80606 -85161 -47211 -4293 106196
27224 106196 14458 -8219 119551 69937 66931 38225 -22015 115737 278771 221270 145637
27213 145637 -4222 -49972 -109489 -89882 -102234 -91230 -68666 -70620 -952 53668 52250 54885
27201E4885j08719k14890J62341J85317K2811N2955n1257q7730l7777P8766K481
27190E9183J02146j6333r7631J0100J52692l7016k70684k2579r4303M0699k457
27179a76183J41363K54043m1668j68280q7042q6032J88644M2711j26363O1399
27169B592N5120j9156P7348J03242n5497k27520l155p1264k6111r0827M6504J40880
27157f7844J45433m1623k03752j27023o5822J86597K64437J31196M165K247J15978
27146C43989l4205o4208j29392J18070m4611o6937j02799q454J06072n7716k17214
27135a57405k43797j35576K26341R666O0159J43396J31341M237m3556j0566j11055
27124a26815m7159Q9934J77162l1791r6745l6201J87330K7868l8544L8120j11249
$$ plain form
27201 54885 -53834 -268724 -106383 78934 101745 154700 103443 15713 -22064 56702 59183
27190 59183 161329 144996 47365 57465 210157 173141 -97543 -120122 -214425 -173726 -176183
27179 -176183 -34820 219223 177555 9275 -77767 -163799 24845 67556 -58807 2592
27169 2592 57712 38556 115904 219146 163649 -63871 -67026 -138290 -164401 -255228 -208724 -67844
27157 -67844 77589 35966 -167786 -294809 -360631 -174034 90403 221599 225764 228011 343989
27146 343989 309784 245576 116184 234254 189643 122706 19907 11453 117525 59809 -157405
27135 -157405 -401202 -536778 -310437 -300771 -240612 -97216 34125 38362 -5194 -15760 -126815
27124 -126815 -173974 -84040 93122 61331 -35414 -71615 115715 143583 105039 143159 31910
27113C1910o5697L7946N3114k06477j05914Q9179J15686k490j53951Q5891J7262
27102a03541N7048R5016p234J413J5175J19121J00194o2684K3632j11231r0211
27091C6698r40j1479M571Q1058o0474j99845K2620N6896J87687n1955P8116J74931
27079C17884r8459j75406r8022J7984j51685N6777K1400j3328j18984Q5009Q1181
27068g5649J00430Q1661j10304r3695P6250J8823j6379K8294P8134M9780p2078
27057F5267j46231l7903R1208J54707p8714k58081Q5530J73832N621J6221L5815
27046A07272J0802P720J12059k43162p0245k0424j7413O3102J33815R8855j1664
27035A70717J43020K1985j86264j50311Q5161k0012n2029j52944o9886N6699J08962
$$ plain form
27113 31910 -33787 4159 57273 -149204 -255118 -165939 -50253 -52743 -206694 -120803 -103541
27102 -103541 -46493 48523 41289 42702 57877 176998 277192 214508 238140 126909 36698
27091 36698 35758 24279 28850 109908 49434 -150411 -127791 -70895 116792 64837 142953 317884
27079 317884 219425 44019 -54003 -36019 -187704 -130927 -109527 -122855 -241839 -156830 -75649
27068 -75649 24781 106442 -3862 -97557 -21307 -2484 -18863 9431 87565 137345 65267
27057 65267 -80964 -118867 -27659 127048 48334 -209747 -124217 49615 55236 71457 107272
27046 107272 118074 125794 237853 -5309 -75554 -95978 -113391 -50289 83526 182381 170717
27035 170717 313737 335722 149458 -853 84308 64296 12267 -140677 -210563 -153864 -44902
27024d4902J06565r4176p3846P0420Q3104k4505J44841M1091l1283m509q6804
27013H5996n5431O9878O7593Q5235K2185j44197k1283J9372O1288J3403L1815
27002B35854j737k0949K1173O3892l7539j38903q6710j1749J71796m5404l4991
26991A14733P1552j7299j09631j16304R9785m8890j22896J10298l878q5305n3755
26980a61590P4387K59850p6331k3657M7913k8358n4307J44140o3400j60779o5364
26969a07496j21663J7150Q15K2246P0192Q0468J43707M7954j58565j55784q0192
26958b41168q1036J21589J90761j06694j47498o0116k23866j80366J72504K10767
26948c45123N3624L5608O0614K33971R3757j37580n4637J90952J33990k4773p4479
$$ plain form
27024 -44902 61663 -32513 -106359 -35939 47165 22660 167501 208592 177309 172800 85996
27013 85996 30565 100443 168036 253271 275456 131259 109976 129348 190636 204039 235854
27002 235854 234117 213168 234341 298233 260694 121791 35081 23332 195128 149724 114733
26991 114733 186285 168986 59355 -56949 42836 -6054 -128950 -18652 -22530 -107835 -161590
26980 -161590 -87203 172647 96316 72659 120572 92214 37907 182047 118647 -42132 -107496
26969 -107496 -229159 -212009 -211194 -188948 -118756 -38288 105419 153373 -5192 -160976 -241168
26958 -241168 -322204 -200615 -9854 -116548 -264046 -324162 -548028 -728394 -555890 -345123
26948 -345123 -291499 -255891 -195277 38694 132451 -5129 -59766 131186 265176 240403 165924
26937A65924j06350l9861L7758R4093j32630m7541R317P17P9595o6552q3430J19122
26925C0162k7221j22878j40857O60J78843K66991J50022j79478j95440L6519R1722
26914H9045j10160n4396M9880J30579m7877M7058r5419R612J0720p5200R7348
26903E1190M3124K2817M6512k06962j15574k0164j19047L1986J56721J14862L1125
26892C6590R7142j64721k8604Q2784Q1602k4379q3617o5250q7911j7688J61568
26881a2484J21197j03908o7134J22107P6079j28498m171j8765j18370J03418P8685
26870D8156o8674m0945L8462K00354R8998l8643j42776j60719n289j7518J5986
26859g2608J9679k50025k7272K07991Q2779J03359n0315J30460Q5046r8949j65594
$$ plain form
26937 165924 59574 19713 57471 151564 18934 -28607 -19290 -18573 61022 -5530 -88960 30162
26925 30162 2941 -119937 -260794 -260134 -81291 185700 335722 156244 -39196 -2677 89045
26914 89045 -21115 -75511 -25631 104948 57071 104129 8710 18322 29042 -46158 51190
26903 51190 94314 117131 163643 -43319 -158893 -179057 -298104 -266118 -109397 5465 36590
26892 36590 133732 -30989 -59593 23191 104793 80414 -3203 -68453 -156364 -174052 -12484
26881 -12484 108713 4805 -62329 59778 135857 7359 3188 -15577 -133947 -30529 48156
26870 48156 -20518 -61463 -23001 177353 276351 237708 94932 -65787 -71076 -88594 -72608
26859 -72608 -52929 -302954 -330226 -122235 -39456 63903 13588 144048 229094 130145 -35449
26848c5449r6564L980K35967L68783L5312j68315k6091M478m7788j27950o8020
26837G8343L4347J5324L6795n3187m4911n9235J22727M4724L5657m8917J3510
26826A75177m7046m6253j62183o2510J65548J02854l080j66092q1263K3000P3519
26815b8329n3109j4028Q6204j60201q4747J97071N3801J16220J56548m4018l9618
26804A85794j74410j04502L8181N7530o1203R0959M0916k7671J20812o9042j5889
26793H1475k23322l8255M4783K26396O4493j9359J8340j81179q6996j85546r7636
26782c96806J02195Q5818N2554K7464J73280N0922k24388o2848J9866O408O7465
26771i8070O8453r9093J44619J63315O3535j04931j8068n6950p4591K7972R4037
$$ plain form
26848 -35449 -132013 -128033 107934 476717 512029 343714 317623 322101 274313 146363 78343
26837 78343 112690 128014 164809 111622 66711 7476 130203 174927 210584 161667 175177
26826 175177 128131 81878 -80305 -142815 22733 125587 122507 -43585 -124848 -101848 -28329
26815 -28329 -81438 -95466 -9262 -169463 -254210 -57139 -3338 112882 269430 225412 185794
26804 185794 11384 -93118 -54937 2593 -58610 32349 73265 45594 166406 97364 81475
26793 81475 -141847 -180102 -135319 91077 155570 136211 154551 -26628 -113624 -299170 -396806
26782 -396806 -294611 -208793 -156239 -128775 44505 95427 -128961 -191809 -171943 -165535 -98070
26771 -98070 -29617 -128710 15909 179224 242759 137828 119760 62810 -11781 16191 110228
26760A10228j06081o5029M99L973Q6071L1094j67436r9968K9467J7761J79597
26749B0176J8797J1513K91718p9925j40094m9531o6979Q6359J7871p6704j26929
26738i3728q0690p8627K7211l5908M9816Q5824P3530Q8090K17313N687m2907k1727
26726A93884k34935j35004P0239P9459P8038J7228j07208k1803J22991j40768
26716g7879r6983O991J55664M707J62622j48151k44263J32944J67744P6082J20709
26705B60187r3947j20213j03690O1287N1397k20775k8599O8566J72883J20015
26695A67111j56619j01595P2104O8695j56276j39011Q0020K62347J6460m1764
26685G1472j37030K0021R9710r9744L2687Q8409J45556q1997n9183J07239N8606
$$ plain form
26760 110228 4147 -60882 -60383 -56410 29661 60755 -106681 -206649 -177182 -159421 20176
26749 20176 38973 50486 342204 262279 122185 72654 5675 92034 109905 33201 -93728
26738 -93728 -174418 -253045 -225834 -261742 -211926 -126102 -52572 35518 252831 258518 215611 193884
26726 193884 -41051 -176055 -105816 -26357 51681 68909 -38299 -60102 62889 -77879
26716 -77879 -174862 -167871 -12207 -7500 155122 6971 -237292 -104348 63396 139478 260187
26705 260187 166240 46027 -57663 3624 55021 -165754 -194353 -125787 47096 167111
26695 167111 10492 -91103 -18999 49696 -106580 -245591 -165571 96776 113236 71472
26685 71472 -65558 -45537 54173 -45571 -12884 75525 221081 139084 79901 187140 245746
26674B45746l0003j81209k1621P9758j03661J850m6527r6783J07778J91232j6311
26663A30249O2329O0941J21137j59824l58652m3871J19253L7706J07660J24651
26653B01579j19466j82648m9701M0310N6375J0972m2483o7804L6225j23294M2393
26642a97542l0092K4981n06J60648j48663p8102M4019J12828P9157O9186q2374
26631d6460j139J94161j7907k10535q7156J15243J13226j27109k60934L0807K06237
26620i1566Q0237q9288n6085m6716L8022O3617J0331m015N1086j95313J50626
26609h9064J36504q7485j42010k7364J34826j72781k5689R6179J30561N0878l8701
26598c4146o9957K8032J17832O4540k31383j4320J43018L1373j7981n5225K1624
$$ plain form
26674 245746 215743 34534 12913 92671 -10990 -9140 -55667 -152450 -44672 146560 130249
26663 130249 192578 253519 374656 214832 -143820 -187691 -68438 -30732 76928 201579
26653 201579 82113 -100535 -150236 -109926 -53551 -42579 -85062 -152866 -116641 -239935 -197542
26642 -197542 -227634 -202653 -203159 -42511 -191174 -269276 -225257 -112429 -33272 35914 -46460
26631 -46460 -47599 146562 128655 -81880 -169036 -53793 59433 -67676 -328610 -297803 -91566
26620 -91566 -11329 -100617 -156702 -203418 -165396 -101779 -91448 -95463 -44377 -239690 -89064
26609 -89064 47440 -40045 -182055 -209419 -74593 -247374 -273063 -176884 -46323 4555 -34146
26598 -34146 -104103 -76071 41761 106301 -125082 -139402 3616 34989 17008 -38217 -16593
26587a6593k9060j97620O69Q9156R2762j30563j45805Q7211J55427J89452q7172
26576G864k7841J56497K3270j66339j11098J35390M7629K2588p826O8906J18890
26565B67930j32864q1322j07108p413j28381k11586j24597J10164J63490K15138
26555c6549R0136J10830Q1151q6029j17718J27833Q2903m2117n9513j2641m9049
26544H9237k137k17611P0374K7915J52789J3672o8608p9894L3101r4564j85101
26533b60827R5776J21687K5533P5241j1834J40436j11030j39567K70R4517P6595
26522A06797o8524J07162k3183j95603O2001R1905Q8556J25705J8916j07580j25518
26511H0634j78320R9992O2150j58617m1691j10727Q5313J19239M0805o2616J00112
$$ plain form
26587 -16593 -45653 -243273 -242604 -153448 -60686 -191249 -337054 -249843 -94416 95036 7864
26576 7864 -19977 136520 159790 -6549 -117647 17743 65372 87960 80134 149040 267930
26565 267930 135066 53744 -53364 -60777 -189158 -400744 -525341 -415177 -251687 -36549
26555 -36549 53587 164417 245568 159539 41821 169654 252557 210440 150927 138286 89237
26544 89237 87100 -130511 -60137 -32222 120567 134239 65631 -14263 18838 -75726 -260827
26533 -260827 -165051 -43364 -17831 57410 45576 186012 74982 -64585 -64315 30202 106797
26522 106797 38273 145435 122252 -73351 -11350 80555 169111 294816 313732 206152 80634
26511 80634 -97686 2306 64456 -94161 -135852 -246579 -161266 -42027 -1222 -63838 36274
26500C6274J41450l215m8069j08205n9911L6825P4756q0475Q0340J26399J2854
26489B09023K0978j20301k5746j16584J1707P6412k9500k8203L8305j73082j35062
26478b72053k7618J17363K07398r6484L3398N3248N0924R4020o0076k11688n3742
26467a65310j305k3513J45576L1271r7892L5665J47060K8972n7968j15681o5039
26456a38164L9967J78063K14490k19625j99986k5688L3179P1291j9615m0239J41112
26445C4785J26970J8261n6259j46733l0835J16715J01966o3089O3585q5053p4513
26434E800j3174P0462N5952j04401L1322J1555K17425P6929j06971j98349r9306
26423e2756M9002L7119o6503j2709j4829J39901P7932n0200q3412j4970J18598
$$ plain form
26500 36274 177724 174509 126440 18235 -41676 -4851 69905 -10570 69770 196169 209023
26489 209023 230001 109700 83954 -32630 -20923 55489 25989 -2214 36091 -136991 -272053
26478 -272053 -299671 -182308 25090 -71394 -37996 15252 66176 160196 100120 -111568 -165310
26467 -165310 -166615 -190128 -44552 -13281 -111173 -75508 71552 100524 42556 -73125 -138164
26456 -138164 -98197 79866 294356 74731 -125255 -150943 -117764 -46473 -66088 -106327 34785
26445 34785 161755 180016 123757 -22976 -53811 62904 164870 101781 165366 80313 5800
26434 5800 -7374 63088 119040 14639 45961 57516 274941 351870 244899 46550 -52756
26423 -52756 -3754 33365 -33138 -45847 -60676 79225 157157 106957 23545 8575 127173
26412A27173K27632K5226j88527j74712j08763J4174J0520q7068k3683K01045
26402B3017Q2703p9934L2103Q2542J58842M7768j17863j69748j32803p0396O5741
26391g8028L350j2540K5863Q6100n7958R1889M926J32435p965j0606m8069k6951
26379A02446k60031L4401J70747n4299J57533r7804q4047J09074j389Q44O7478
26368A44953J41615R376q0909o3907j6682J5332m6797j84105j54075P5542J55498
26357d159J57043m568j07018p8884n4988J34682J5086j41268j20607J1546j47303
26346c40438R9786J16585O2449J44045j47434Q5454K64447j81157j94438P9021
26336a1680l7375j54478r0532j71228k4640N3059O4999L7149K50744J78241m893
$$ plain form
26412 127173 354805 380031 191504 16792 -91971 -77797 -67277 -154345 -178028 23017
26402 23017 105720 25786 57889 140431 299273 347041 229178 59430 -73373 -143769 -78028
26391 -78028 -74678 -87218 -61355 24745 -33213 58676 63602 196037 188072 177466 129397 102446
26379 102446 -157585 -123184 47563 -6736 150797 52993 -31054 78020 76631 77475 144953
26368 144953 286568 295944 215035 151128 134446 149778 102981 -81124 -235199 -159657 -4159
26357 -4159 152884 148316 41298 -37586 -92574 42108 57194 -84074 -204681 -193135 -340438
26346 -340438 -240652 -124067 -61618 82427 -65007 20447 284894 103737 -90701 -11680
26336 -11680 -49055 -203533 -294065 -465293 -489933 -436874 -371875 -334726 -83982 94259 89366
26325H9366j19910Q3984J22292N2143j41395R1541J410l0213j87968r8678r443
26314a46871L6170M7204R7187M0908N7714j20892n2830j13093j57210L0985J97790
26303h2938J58041o4134j02267m7914j8993M9669J19615m5316r3649j12822m075
26292b44783J94315j8738L4564L4460l2869p3966J49163P9655j22914r440k9516
26281d0069R9544j03565l1541o2634j0775n6219j47445J3868K65417J82936l218
26270A06299n2551J18162L2628L001j11596j03150M7835J85720k1838j9963M6479
26259B31026r6773l1610P4340R778O3845j8279J9812r2426l5174q1556N5310j24697
26247b6404p1486J4870l6972J5059J30472K9589J02563R8868M1657l4084m0027
$$ plain form
26325 89366 -30544 53440 175732 227875 86480 178021 179431 149218 -38750 -137428 -146871
26314 -146871 -110701 -63497 33690 74598 132312 11420 -41410 -154503 -311713 -280728 -82938
26303 -82938 75103 10969 -91298 -139212 -158205 -108536 11079 -34237 -127886 -240708 -244783
26292 -244783 -50468 -69206 -34642 -182 -33051 -107017 42146 121801 -1113 -10553 -40069
26281 -40069 59475 -44090 -75631 -138265 -149040 -205259 -352704 -338836 -73419 109517 106299
26270 106299 53748 171910 204538 207539 95943 -7207 40628 226348 204510 184547 231026
26259 231026 134253 102643 176983 186761 250606 232327 252139 159713 124539 42983 98293 -26404
26247 -26404 -97890 -83020 -119992 -104933 25539 55128 157691 256559 298216 264132 224105
26236B24105p8144K6078j97779k5000M8969q8722k9828J14199m5517p0597j36422
26225b58658K13539K19275R6351L617K0115k04918k47269Q0187L1409o3080L9256
26214g0176J35136j00072m7994J1956O688J77747R2040p6496J14075j3647k72302
26203d3045O82q72J28568L9668l3144j65351J63044K6267J5575j37983J5456k56245
26191b47380m5987K67600O7539J5697k14694j09884O9509O8957K08153J47032
26181B26542J5287N688p0205j52103r9342J14861J69175N3326j47527j03122k06197
26170a93617n7217J27872l3146J60555J07631N0543K433l04745k24520L2332L3176
26159b98703J93983K36174K2688J514j09152k0269N3594P9548J10479q457j66160
$$ plain form
26236 224105 145961 172039 -25740 -50740 -1771 -90493 -120321 -6122 -51639 -122236 -258658
26225 -258658 -45119 174156 270507 274124 294239 89321 -157948 -77761 -46352 -109432 -70176
26214 -70176 64960 -35112 -83106 -71150 -64462 113285 205325 128829 242904 229257 -43045
26203 -43045 -42363 -43235 85333 125001 91857 -73494 89550 115817 131392 -6591 8865 -247380
26191 -247380 -293367 -25767 41772 57469 -157225 -267109 -197600 -128643 79510 226542
26181 226542 241829 247517 177312 25209 -74133 40728 209903 263229 115702 12580 -193617
26170 -193617 -250834 -122962 -156108 4447 112078 162621 165054 -139691 -364211 -331879 -298703
26159 -298703 -104720 131454 154142 155656 46504 26235 79829 159377 269856 261399 95239
26148I5239q1137k2909O2354j16636j93555o7498J95582J20879J7533L68o319
26137C901Q1184M1964j41592j31063J9710J50873J41485L2265O5062l8710k357
26126B22722j6405n3893k4695p4680K1553o4667p8902o7929Q5573J61404J57265
26115B67346o4233l685o6488j34720q2614j83m6062J96162J26649K3605k6052
26104A89725k31483j95723L8107K41964J53093P3164j43655k31256J0739p6759
26094a72084N1437L46962Q9956k44508l51339q6249J49342l1409Q6074N5084O2437
26083d4297N2163K8589M9463j44661j7819J62720Q3095R7830P14k19198j8000
26072C0599m3580O793j5316m9675N3343J29664l0861o9642k28738L5123J51037
$$ plain form
26148 95239 14102 -8807 53547 -63089 -256644 -324142 -128560 -7681 9852 10220 3901
26137 3901 85085 127049 -14543 -145606 -125896 24977 166462 198727 263789 225079 222722
26126 222722 206317 152424 127729 53049 74602 9935 -68967 -136896 -51323 110081 267346
26115 267346 203113 199428 132940 -1780 -84394 -84577 -130639 65523 192172 215777 189725
26104 189725 -41758 -237481 -199374 42590 195683 268847 125192 -106064 -95325 -172084
26094 -172084 -120647 226315 316271 71763 -279576 -365825 -216483 -247892 -161818 -106734 -44297
26083 -44297 7866 36455 85918 -58743 -76562 86158 169253 267083 267797 48599 30599
26072 30599 -12981 -6188 -21504 -71179 -17836 111828 80967 11325 -217413 -182290 -31253
26061c1253P559o2443O3233J56420L9530l8885o8541j08554M0475N5609o6364
26050a3214j5272J92201r0028j01003j84683p6732J90269J55446j04508P0204
26040B2680J30560j06043j48979q3811j04318N8956M3746K0344K1915K8501K3063
26029i3386p0102j44698R2702K05910J65544M5981n8275j34999j12061n5016L07351
26018A48951R3779J2795R5614J05253j18111k95580J8726M3979r4732o4444j9070
26007g2840l2922J27690J04591P8628p6598o6737j9603j16525m2820Q2296N7432
25996B2592N5549M8976j37492j12560J50638M3373j09553j0741J17674K14n5139
25985A3531o5907l4450L7546K0706J23674J43407k59829k04603k0252J52182k6717
$$ plain form
26061 -31253 -23694 -86137 -22904 133516 173046 134161 65620 -42934 -2459 53150 -13214
26050 -13214 -28486 163715 73687 -27316 -211999 -288731 -98462 56984 -47524 22680
26040 22680 153240 47197 -101782 -185593 -289911 -230955 -187209 -166865 -144950 -116449 -93386
26029 -93386 -163488 -308186 -215484 -9574 155970 201951 143676 8677 -103384 -158400 148951
26018 148951 242730 255525 351139 456392 338281 42701 61427 105406 10674 -53770 -72840
26007 -72840 -105762 21928 126519 205147 128549 61812 42209 -74316 -117136 -34840 22592
25996 22592 78141 127117 -10375 -122935 27703 71076 -38477 -49218 68456 68670 13531
25985 13531 -52376 -86826 -49280 -28574 95100 238507 -21322 -225925 -246177 -93995 -120712
25974a20712K74943Q2399j29106j22801q6062j76359M3440J67859J08132J86593
25964B28326k7960P000J34327J48115j35704j22903k14204j29570r7826l1195
25954b41594Q4778K31408J40059j03726l7502k357Q6099j17197j04665J14780
25944E0083n6410L2423L1729J02583j52479k19732j45329J70911J73142M2234
25934B9155Q5760j3955o9827m0786K6945O0523K5179N5512k38446j2348L4909
25923e7379r8077K23562k5064j21511O4154r2209l0112Q1975q5307j37247m4187
25912c21402R0314O0307m4207q2148J47340J02061j7034n9893R489j3576J03625
25901b5124O2523l8465J10415p091q5379N5250R2498J6278Q6587L0230J3768o5664
$$ plain form
25974 -120712 154231 236630 107524 -15277 -101339 -277698 -234258 -66399 41733 228326
25964 228326 200366 207366 341693 489808 354104 231201 16997 -112573 -210399 -241594
25954 -241594 -156816 74592 214651 110925 73423 71066 157165 39968 -64697 50083
25944 50083 -6327 26096 57825 160408 7929 -211803 -357132 -186221 -13079 29155
25934 29155 114915 100960 31133 -9653 17292 77815 102994 158506 -79940 -92288 -57379
25923 -57379 -155456 68106 43042 -78469 -14315 -106524 -136636 -54661 -139968 -277215 -321402
25912 -321402 -231088 -170781 -214988 -297136 -149796 -47735 -64769 -124662 -115173 -128749 -25124
25901 -25124 37399 -1066 109349 102258 16879 72129 164627 180905 267492 297722 311490 245826
25889B45826n7861J60484K1193j16345m5422J1496p9785m9905J2814j37768o6851
25878a02124J55188P2291l9414n4978M1643J45308k18320j80213m2007Q4967J79131
25867D1472O7890o4324r5904L803o4837J76722J8986m4716J75113N654j77707
25856D2152p1008l774j73040P1016Q0426j44557p4860J68166J07620Q2568l5669
25845D9040j85766M3513J6040m4363j11138j3558Q164k0898J8704K85671q2880
25834c7471J2883J30368n6583K9700J48920L8481r9914j42482K30113L4444j05414
25823A83045r5587j35932k852k6570j05015J54045K25057p5434j13196j32764
25813a25203R951J22192P2307r6772m2970J71516L1598o986L7167j45807n6257
$$ plain form
25889 245826 187965 348449 369642 253297 207875 219371 139586 89681 102495 -35273 -102124
25878 -102124 53064 125355 85941 30963 72606 217914 -406 -180619 -222626 -137659 41472
25867 41472 109362 45038 -50866 -47063 -111900 64822 83808 39092 214205 219859 42152
25856 42152 -28856 -32630 -205670 -134654 -54228 -198785 -273645 -105479 2141 84709 49040
25845 49040 -136726 -93213 -77173 -121536 -232674 -246232 -238068 -258966 -240262 45409 -37471
25834 -37471 -24588 105780 49197 78897 227817 266298 166384 23902 254015 288459 183045
25823 183045 87458 -48474 -51326 -77896 -182911 -28866 196191 120757 7561 -125203
25813 -125203 -115252 6940 79247 -17525 -60495 111021 142619 135633 172800 26993 -29264
25802b9264J03557o231n7728J40529j0195k10115r3360J39284J7308q6999j4521
25791a07735o6614Q7161K03165Q1942k7701l3059j84692N2118R7219k08208k30291
25780c36695J05127K22190Q275j7758P4269J04971J12632N5588J1295j40537R3176
25769B92533o9501p1845j45536l5918P6334P4282r7494k85580O2069K23838K002
25758B5184r0373R780J24502N3881r943k7257l8365J84713P5485q6347j79121
25747D2139j4060j05393J82552J98592q1105r5772n860j70425o5605J3526N1543
25736d9868R1753j2788N9386R5984k00548p6982J36903J81227Q49m6134l115l56728
25724a80061k00051N274M0496M5861K1813J38894K25357J62504j1487j56398Q3471
$$ plain form
25802 -29264 74293 68062 10334 150863 140668 -69447 -162807 -23523 -6215 -93214 -107735
25791 -107735 -174349 -87188 115977 197919 170218 137159 -47533 4585 101804 -106404 -336695
25780 -336695 -231568 -9378 -1103 -18861 55408 160379 273011 328599 339894 199357 292533
25769 292533 223032 151187 5651 -30267 46067 120349 22855 -262725 -200656 23182 25184
25758 25184 -65189 -55409 69093 122974 113031 85774 47409 232122 307607 221260 42139
25747 42139 28079 -77314 105238 303830 222725 126953 121093 -49332 -114937 -101411 -49868
25736 -49868 41885 29097 88483 184467 -16081 -93063 43840 225067 225916 179782 176667 -180061
25724 -180061 -380112 -374838 -334342 -288481 -266668 -127774 97583 260087 248600 92202 175673
25713A75673p522k3893n1867k71504J5638L4375j09423L0397J24790N8588j88250
25702b12998m9937J8266J9188J24590J26599j85011l0854J3159P3321P9369L3794
25691I486o189j01320j06107j39990l3803J13260L6778Q3418N180q1765J25518
25680i5534J23652J61531o268q852j77167m2756J48880J01751l1674j36738m4663
25669g838J76787j17217j13522n9170J63422O4648R3489M7880l0523k59314j71909
25658b13267N2410j08102N674M8504J35688l4460j02330q36J03305O2339j25078
25647a76153j10300O0202N6640J28336j60381N4674O761j10139J38451J59073
25637D7164r123j81830p6997K4256l8311k6208k4435R9440J83453R556n1187P5168
$$ plain form
25713 175673 168151 144258 92391 -179113 -163475 -129100 -238523 -208126 -83336 -24748 -212998
25702 -212998 -262935 -244669 -225481 -100891 25708 -159303 -190157 -176998 -103677 -24308 9486
25691 9486 3297 -98023 -204130 -344120 -377923 -264663 -227885 -144467 -139287 -221052 -95534
25680 -95534 28118 189649 183381 174529 -2638 -45394 103486 205237 173563 36825 -7838
25669 -7838 168949 51732 -61790 -120960 42462 107110 200599 248479 217956 -41358 -213267
25658 -213267 -160857 -268959 -263285 -214781 -79093 -113553 -215883 -216719 -113414 -51075 -176153
25647 -176153 -286453 -226251 -169611 -41275 -201656 -146982 -140221 -250360 -111909 47164
25637 47164 38041 -143789 -220786 -196530 -234841 -261049 -285484 -186044 -2591 6965 -44222 30946
25625C0946n1398N1164Q7850o8341P3634L5107j18619M6235j00432J257j6048
25614b8645L0875J74621n1467k0344J47025O8538j83403o8154K5035R160L04Q8956
25602A92501j11550j17175Q2403j40079R133P4254j67768k6327O5012q9197r7340
25591c26133J12991J94927J10746q113O1264j56773q3368N6646m9026N3921J53655
25580A20737J50395j49563J163j02451o7112m5852j49652p0176R6288R7214k3742
25569a42751j512m5952J23352l7709n0584L1493O4545p5718J28355J18066r322
25558A02263o5972Q3129O6533l4969k24884j10381L4512n0504O3874P0094m9047
25547a15352J85076P5386R3393M0845j19661r4258l9214P4184l7100L9053J45729
$$ plain form
25625 30946 -20452 30712 118562 50221 123855 158962 40343 86578 -13854 -12597 -28645
25614 -28645 2230 176851 125384 105040 252065 320603 137200 69046 94081 103241 103545 192501
25602 192501 80951 -36224 46179 -93900 -84767 -10513 -178281 -204608 -139596 -228793 -326133
25591 -326133 -213142 -18215 92531 84418 145682 -11091 -94459 -37813 -86839 -32918 120737
25580 120737 271132 121569 122732 20281 -46831 -92683 -242335 -312511 -216223 -119009 -142751
25569 -142751 -144263 -190215 -66863 -104572 -155156 -123663 -59118 -134836 -6481 111585 102263
25558 102263 36291 119420 185953 150984 -73900 -184281 -149769 -200273 -136399 -66305 -115352
25547 -115352 69724 145110 238503 279348 159687 65429 26215 100399 63299 102352 248081
25536B48081Q2453k3807j40239L5847J83418j71364j01468n665j01271L778n8558
25525d8795r5344l7272n0724Q895L0152M5280J3641L9513J51058L8300R5079J8073
25513B07856m8024K4102j41065j05482l9997j19205N9699N5363J25090K0098j0796
25502B7639J6490J41763Q5467q7521r3378J8472q1044r6640M8694k529l3363J88512
25490A32562j45027k5108j9944q8853o1747M1159q0806M5856N6631M2057N012
25479i8208r9943l7940J06239J52506J81288R0236O1975l0575j30632j02694o9792
25468B2460Q3659j2006r2088p5707p3625J29294R6509k4626j6398N6094q0655
25457A2911J0287r4943m3920k6247l1951R4719K9594j26184j7411J09581P9609
$$ plain form
25536 248081 330534 306727 166488 202335 385753 214389 112921 107256 5985 9763 -48795
25525 -48795 -144139 -181411 -232135 -223240 -193088 -147808 -134167 -94654 56404 94704 189783 207856
25513 207856 159832 183934 42869 -62613 -102610 -221815 -162116 -106753 18337 38435 27639
25502 27639 44129 185892 271359 183838 90460 108932 27888 -68752 -20058 -22587 -55950 132562
25490 132562 -12465 -37573 -57517 -146370 -208117 -166958 -247764 -201908 -145277 -103220 -98208
25479 -98208 -198151 -236091 -129852 22654 203942 294178 356153 325578 194946 92252 22460
25468 22460 106119 94113 2025 -73682 -147307 -18013 78496 53870 37472 93566 12911
25457 12911 23198 -71745 -115665 -141912 -173863 -79144 -49550 -175734 -193145 -83564 -3955
25446c955K3163o2894l7025L1681j22954j52076o6926K5655K11894n6210o694
25435b16341M1312m5033j11616R8099P3968m6594N5843j17765R3947p463Q889
25424a72754J15490J13161j45417j22255n1694Q162J82411J26062J95639J20055
25414C68860j05646j77937j26458o3817R543O5596l6534K7688J4408J95244m9278
25403A21669k49127l22608J32712K54417P2554O15l419l2436j2201n1580K7450
25392f1954Q6025J56297p7417k04801J12227J83648K0377k19043m838R4077o0335
25381B4263K8131J31586N118O4977m6085j43244r4468k1488P3762J6898o1853
25370b2403M0801r2734j33714l724J0335o14P997J51317J76362o5j60795r615
$$ plain form
25446 -3955 19208 -43686 -80711 -49030 -171984 -324060 -390986 -365331 -153437 -209647 -216341
25435 -216341 -175029 -220062 -331678 -233579 -159611 -206205 -150362 -268127 -174180 -181643 -172754
25424 -172754 -57264 55897 -89520 -211775 -263469 -255307 -72896 53166 248805 368860
25414 368860 263214 85277 -41181 -104998 -95455 -29859 -66393 -38705 -24297 170947 121669
25403 121669 -127458 -450066 -317354 -62937 9617 10232 6813 -25623 -37824 -89404 -61954
25392 -61954 24071 180368 102951 -101850 10377 194025 214402 -4641 -9479 84598 24263
25381 24263 52394 183980 189098 254075 207990 64746 -29722 -51210 22552 39450 -22403
25370 -22403 18398 -74336 -208050 -211774 -201439 -202053 -194056 -42739 133623 133558 -27237 -36852
25358c6852n1710j34300J66472P4936J6159p8102J53219L6365J53787r5179n4197
25347A50598j38267j15005J44638J01417n2172k09672Q8758L9173o653k1109J6043
25336b251n7337m4945n3846R473J19073J10110l9690j28946o4859O7617k0804
25325a06405O3893n032K2816p5121p6132j61837K01450J87604K7221k6328j12471
25314f0342Q8249P0377J21115k21650j06794k9620j21740j23480J76668J09550
25304i7667O091k17346j34847J27267K32790J04716N3813j1476J39052m5011r8242
25293E9140j16120J8180K4100n9074j67338J30249P6041N6969R017R339M6968
25282H7471m2250K05261p475j55190j59294P1491J2412J00327q0315m0513k2854
$$ plain form
25358 -36852 -88562 -222862 -56390 18546 34705 -43397 109822 146187 299974 204795 150598
25347 150598 12331 -102674 41964 143381 91209 -118463 -29705 9468 2815 -18294 -2251
25336 -2251 -59588 -104533 -158379 -148906 -29833 80277 40587 -88359 -153218 -85601 -106405
25325 -106405 -42512 -47544 -24728 -99849 -175981 -337818 -136368 51236 78457 52129 -60342
25314 -60342 27907 98284 219399 -2251 -109045 -138665 -260405 -383885 -207217 -97667
25304 -97667 -91576 -308922 -443769 -316502 -83712 21004 74817 63341 202393 157382 59140
25293 59140 -56980 -38800 -14700 -73774 -241112 -110863 -34822 22147 31164 40503 87471
25282 87471 45221 250482 243007 87817 -71477 14 12426 112753 32438 -8075 -30929
25271c0929J28449o6888l07722P9920J69126R4902k4527k45175P1502L3874k9262
25260a26730R1690J7038k35056L244j3452O1737J19352J09919J23012l1246M5552
25249A65060l4419k1688J56851K6547j83782j00693J00129p0722o612N4319r7051
25238a2061o4755n7960K10858J78027k71883k01810Q904j4045P4206m3378J0566
25227a83331p1847J65989m2085J25842N883J31844o3312k44649L3285J30797r459
25216b1043j34671l2588p0692L5042J36405J37916j37433K164J00239k2661j12266
25205a19588r9622J02726N4444l8689J49405j10461J44567Q8432K4062m5737j28335
25194B1204j33325R1142J51985J81058J02535o7249j31458n2084R523k4372p8768
$$ plain form
25271 -30929 97520 30632 -277090 -197170 -28044 66858 42331 -202844 -131342 -97468 -126730
25260 -126730 -35040 -18002 -253058 -249814 -263266 -201529 -82177 27742 150754 119508 165060
25249 165060 130641 108953 265804 292351 108569 7876 108005 37283 30671 84990 -12061
25238 -12061 -76816 -134776 76082 254109 -17774 -219584 -210680 -224725 -150519 -193897 -183331
25227 -183331 -255178 -89189 -131274 -5432 451 132295 68983 -175666 -142381 -11584 -21043
25216 -21043 -155714 -188302 -258994 -223952 -87547 50369 -87064 -84900 15339 -7322 -119588
25205 -119588 -219210 -116484 -62040 -100729 48676 -61785 82782 171214 195276 149539 21204
25194 21204 -112121 -20979 131006 312064 414599 347350 215892 163808 173331 148959 70191
25183G0191k9838o9397l3001J55225J74331j05396j81271l1229q0992P548K11139
25172H7310M7265n1725R1968J1554k6680j27377k26883Q8469L2313j47520J0793
25161b10513J13892J58716O1350R2616j6137n8341j0347O5799m7354j76540k7415
25150e4274J27707R8733j10817j67285o5865Q8115M0031J1634o1039K2107J68020
25139I7067O1911j46765j04938J63310J5710k03348J5476K3989K50743L10693
25129D83848Q834j01963o9476J2765L8627n4962q2673J4893j37179J0931O4124
25118A87769j67013j9901J12708J19173p0629r5657k4307j8379l2941J170R2085
25107H4078P8871J07844j32235j44892L6352q0289j02885p103L0075O6540M6198
$$ plain form
25183 70191 40353 -29044 -62045 93180 267511 162115 -19156 -50385 -131377 -123829 87310
25172 87310 134575 82850 174818 186372 159692 32315 -194568 -106099 -73786 -221306 -210513
25161 -210513 -96621 62095 123445 216061 199924 141583 131236 197035 149681 -26859 -54274
25150 -54274 73433 172166 61349 -105936 -171801 -83686 -43655 -32021 -93060 -70953 97067
25139 97067 158978 12213 -92725 70585 86295 -117053 -101577 -77588 173155 483848
25129 483848 492682 390719 321243 334008 372635 317673 235000 249893 112714 123645 187769
25118 187769 20756 855 113563 232736 162107 66450 42143 23764 -9177 -8007 84078
25107 84078 162949 270793 138558 -6334 30018 -50271 -153156 -160259 -130184 -63644 -17446
25096a7446J03009Q1990J27789J5806j13649j39442j50574J920J705j15914j05600
25085c10406L3201n8695J00793J42669P4865M5341j5975J3873P2592L6983p4269
25074F0972n4168L1633j62893L7865m3054M8290J22924K0761j19257P6026Q6108
25063A05207k923m8794j0233j1532r3085J03906Q6780l3440p6329j63175n7533
25052b01151J60891J87282l2060p8741j02906k3488Q0043j6732J88119j1332q7074
25041F2851k19343J00208j3402P0157J71335m6881J4797q7947l2354R3099k9835
25030H2685j24279p8227R337O2907l4755N6554j99065P966L6408j06380Q3513
25019b03336o8892L6375J01171J75760p47l2243K3028P1162J014j29506J904P1775
$$ plain form
25096 -17446 85563 167553 295342 311148 197499 58057 -92517 -90597 -88892 -204806 -310406
25085 -310406 -277205 -335900 -235107 -92438 -17573 27768 11793 25666 98258 135241 60972
25074 60972 6804 38437 -124456 -86591 -129645 -81355 41569 62330 -56927 19099 105207
25063 105207 102284 53490 43257 31725 -61360 42546 129326 95886 19557 -143618 -201151
25052 -201151 -40260 147022 114962 36221 -66685 -90173 -10130 -26862 161257 149925 62851
25041 62851 -156492 -56284 -69686 471 171806 124925 139722 51775 19421 112520 82685
25030 82685 -41594 -119821 -110484 -47577 -82332 -25778 -224843 -216877 -180469 -286849 -203336
25019 -203336 -272228 -235853 -134682 41078 40331 8088 31116 102278 103292 -26214 -24310 47465
25007D7465r1586k37230J91484p0272n2147J4758K431o507J16909P3650n8747
24996f9792r4487j79030J01988K57064j7518l8750j07012j15836p4214l4623J59235
24985b12975l8131P0575j4974k7099J91493J5978j0539J39452k2676j87532m7039
24974a43467K61150N8646Q7060l2844j00910j07729O4196k9757j64828R200p636
24963a06919l4511J4082J47768n4836L8064K29388j5811m1130N260p3051j94544
24952h6240j28166m9729L0088Q9811n8443j34646N6080K11789Q1432K024j04801
24941i0801q0391J3332J65758Q2269q9680M9024j06399r5866j0897p4518O1980
24930a76189M1427P0471J27912R7288j58660j44087j55685n4537K18786Q3792
$$ plain form
25007 47465 -44121 -281351 -89867 -160139 -212286 -197528 -195097 -201604 -84695 -11045 -69792
24996 -69792 -164279 -343309 -241321 15743 -1775 -40525 -147537 -263373 -337587 -372210 -212975
24985 -212975 -251106 -180531 -195505 -222604 -31111 -15133 -25672 113780 91104 -96428 -143467
24974 -143467 117683 176329 263389 230545 129635 21906 86102 56345 -108483 -99283 -106919
24963 -106919 -141430 -127348 20420 -34416 3648 233036 217225 176095 181355 108304 -86240
24952 -86240 -214406 -264135 -234047 -144236 -202679 -337325 -281245 -69456 11976 14000 -90801
24941 -90801 -171192 -157860 7898 90167 487 49511 -56888 -152754 -163651 -238169 -176189
24930 -176189 -134762 -64291 63621 160909 2249 -141838 -297523 -352060 -133274 -49482
24920d9482J5410N1656J00604r6623J0886J54585K1321q6781k13987j21941J36652
24909g7700J26457O8382j31059k2113L8004j3391m2065n6641l0249n2863n9970
24898b53208J47217J07538p4884k69585j57275J08454K51647K28954l972l0560
24888E4326M82r3475j7644J01420J33768L1715J8732j41493k10360l0301M1860
24877a10970O3648O8156m0181l7740J38923P4020r6570j77405N1752K59841L5490
24866B28964j34586j41813M7892j0319o1198K4392j766l2927o9554L2914R0747
24855b7254J33427L6875j22007l3706j8331n2477q0540N0916N1980K06097n8856
24844H6124p1338k90798j5544K20122l7562N1231M4146m4506p5334P8827P8920
$$ plain form
24920 -49482 -34072 17584 118188 21565 32451 187036 208357 121576 -92411 -214352 -77700
24909 -77700 48757 117139 -13920 -36033 1971 -11420 -53485 -110126 -140375 -193238 -253208
24898 -253208 -105991 1547 -73337 -342922 -500197 -391743 -140096 88858 84886 54326
24888 54326 54808 -38667 -56311 45109 178877 210592 229324 87831 -122529 -152830 -110970
24877 -110970 -47322 20834 -19347 -57087 81836 155856 59286 -118119 -66367 193474 228964
24866 228964 94378 -47435 457 -9862 -71060 -46668 -48434 -81361 -150915 -118001 -27254
24855 -27254 106173 143048 21041 -12665 -30996 -83473 -164013 -113097 -61117 144980 86124
24844 86124 14786 -276012 -291556 -71434 -108996 -57765 -13619 -58125 -133459 -54632 24288
24833B4288J02283k473l6107N8566J58784J07010q0121j5152q0966j37466l9990
24822E8656J3603O776k04754l4478J34350J76206r4388k3101q426K9838O2724
24811A17006o6661j85662q4576J78730J50045Q1210j37655j27842J55818J44238
24801B24651J28012p949j26120q7783r0791k0350k7210j13371l5326J8512j70458
24790c08183j036Q0519J53241J38491j27019J0082J57694K974j70807m1937j24393
24779b30374j28225J60614K05304J99586q1771j25622q0333m259N366j72294o3893
24768c15901J5541J1068J63141K68557k4685k24870k29476J50172L92001L0461
24758B36009K2745l3988k42632p7110M9040R5651J27561l8496k7154m3276m5856
$$ plain form
24833 24288 126571 124098 87991 146557 305341 412351 332230 317078 236112 98646 58656
24822 58656 72259 79035 -125719 -160197 -25847 150359 55971 32870 24444 54282 117006
24811 117006 50345 -135317 -219893 -41163 108882 190092 52437 -75405 80413 224651
24801 224651 352663 344714 218594 130811 40020 19670 -7540 -120911 -156237 -137725 -308183
24790 -308183 -309219 -228700 -75459 63032 -63987 -53905 103789 106763 -64044 -105981 -230374
24779 -230374 -358599 -197985 7319 206905 125134 -488 -80821 -85080 -79714 -252008 -315901
24768 -315901 -300360 -289292 -126151 142406 117721 -107149 -336625 -186453 205548 236009
24758 236009 258754 224766 -17866 -94976 -45936 49715 177276 138780 111626 68350 22494
24747B2494L7084M9303l3033J23037O9814R9266m6477j64950j19522M7841l7086
24736D7771J61810L998L4081o1062k1270o047q7815j82360R0354P9305j02956
24725d4191j34691j8149j01795o1955O0154J72439J15541N3405Q7473J4n7296
24714G0949q5019K7948R9376J61764j98857j46126n4566L8491J58899J3779k7248
24703E9390k36988l5857K22005O0492J01596Q0495r4805j25401l6240K0727p2454
24692e7040J06307p7617n8635J02427J63285K1457j50440j24143J5303r6116Q8018
24681f7194J1457J63127J02584r894j91875k0793K5231o7755p8709O9844p0317
24670a34294j3078J62895Q5094M6215N8679k0675L9071q2940p7227M914j00560
$$ plain form
24747 22494 59578 108881 75848 198885 268699 367965 321488 156538 37016 84857 47771
24736 47771 209581 213579 247660 186598 165328 159281 71466 -110894 -20540 58765 -44191
24725 -44191 -178882 -197031 -298826 -360781 -300627 -128188 -12647 40758 128231 128245 70949
24714 70949 -14070 13878 113254 275018 76161 -69965 -124531 -86040 72859 86638 59390
24703 59390 -177598 -213455 8550 69042 170638 251133 156328 30927 -5313 15414 -57040
24692 -57040 49267 -28350 -86985 15442 178727 200184 49744 -74399 -59096 -155212 -67194
24681 -67194 -55737 107390 209974 200080 8205 -12588 12643 -55112 -133821 -63977 -134294
24670 -134294 -147372 15523 100617 146832 205511 184836 223907 140967 63740 68654 -31906
24659c1906m0945N2775q9495J06724P1691p0274j06958j04783L7420K5600J02366
24648d7785O0561k1749R3287o1106k66680Q2745N1603L9194J7981N063J57827
24637A10941J10332k7900k02150l9459k7407m9755K33494k107k68406o0977R2874
24626a30520O3095L8350j07241k2611J76753J24481J2644j19780p5971j204J08747
24615F6743n8332R5197R6604j8412j94643m5854O8561R6247n0856j95410P912
24604a32243R9088J32764l3536j34039j02199p0274K5252L1935N6384R9666r1580
24593a18782o7853l4925J099l596j26905J842R7964J26888P5495L7584N8570L2514
24581G9895Q478K518q485m2590J97921l5365o1032o496p4956k5668J8491J0073
$$ plain form
24659 -31906 -72851 -20076 -109571 -2847 68844 -1430 -108388 -213171 -175751 -150151 -47785
24648 -47785 12776 -8973 84314 23208 -243472 -160727 -109124 -69930 -51949 -46886 110941
24637 110941 221273 193373 -8777 -48236 -75643 -125398 108096 105989 -162417 -223394 -130520
24626 -130520 -67425 -29075 -136316 -158927 17826 142307 154951 35171 -40800 -42004 66743
24615 66743 8411 103608 200212 181800 -12843 -58697 9864 106111 55255 -140155 -132243
24604 -132243 -33155 99609 66073 -67966 -170165 -240439 -215187 -183252 -126868 -27202 -118782
24593 -118782 -186635 -221560 -220461 -224057 -350962 -349120 -251156 -124268 -48773 -11189 47381 79895
24581 79895 88373 90891 82406 39816 237737 202372 141340 134844 59888 34220 52711 62784
24569F2784r9547j39302o769M5805J75572K15533k1245o0634k29844p533J98465
24558A33285l7992k11027K3224K59705K51919L9238k02531j36115k24106p337
24548a11737J12739j6509J8658J4018M9410j51733k61685J56101K13356J39704
24538A62322m0196o5784R2690K080q7660n2011m9379j07942L2382l9286k4168
24527a76952o9857K8244O3872J08276J17443L3974r4154n7670J40040R7692o1610
24516A29298j7103L4262o05j55510k7442L8741l1351L8311k0982m6359N3852p4368
24504g9256j32156l8110J18644p8320j20318j35377j0569M1095J26651K16847
24494i0869P9511L1378Q5926J8803j13371l4977n4428k19782K3320J37709K10159
$$ plain form
24569 62784 -36763 -176065 -182834 -137029 38543 254076 232831 172197 -57647 -65180 133285
24558 133285 95293 -115734 -92510 167195 419114 458352 255821 119706 -104400 -111737
24548 -111737 1002 -15507 3151 17169 66579 -85154 -346839 -190738 22618 162322
24538 162322 122126 56342 149032 151112 63452 11441 -37938 -145880 -113498 -152784 -176952
24527 -176952 -246809 -218565 -154693 -46417 71026 105000 10846 -46824 93216 190908 129298
24516 129298 112195 146457 145852 -9658 -37100 1641 -29710 8601 -12381 -58740 -4888 -79256
24504 -79256 -211412 -249522 -130878 -209198 -329516 -464893 -475462 -434367 -307716 -90869
24494 -90869 -11358 20020 105946 124749 11378 -23599 -78027 -297809 -274489 -136780 73379
24483G3379n3150p6704R550l9114j6529Q8796j3205m8786J17510m1821j85826
24472a85900J02105p474J53445q4273j94659J0687J77474k8545J15468k5229O5213
24461I8312K0794j28873n8430j03347Q5684K24863K5412j02989l2240k4274l1228
24450b6316M1967R195J70789L5886j66539j5301L6235M241J32563N5669r4710
24439A83679l9707k32053j02856N6711J20884k9785p4374M4665K3798j26074M1575
24428a33537K5994J86919J22814n2984p0802M5046Q0128K0304j60105J46588J49476
24417C59841j88104j79893j5223L6540Q5588j33904j46888l9846R3677P7796m4907
24406i5323q3439j50121n1111J00975Q6255J53070J91110P402m7844J6204j24542
$$ plain form
24483 73379 20229 -56475 -46925 -86039 -102568 -13772 -26977 -75763 41747 -74 -185900
24472 -185900 -83795 -91269 62176 -22097 -216756 -206069 -28595 -57140 58328 33099 98312
24461 98312 119106 -9767 -68197 -171544 -85860 139003 164415 61426 29186 4912 -26316
24450 -26316 15651 24846 195635 231521 64982 49681 85916 90157 222720 278389 183679
24439 183679 143972 -88081 -190937 -134226 -13342 -43127 -117501 -72836 -49038 -175112 -133537
24428 -133537 -107543 79376 202190 149206 78404 123450 203578 223882 63777 210365 359841
24417 359841 171737 -8156 -23379 13161 98749 -35155 -182043 -221889 -128212 -50416 -95323
24406 -95323 -178762 -328883 -379994 -279019 -192764 -39694 151416 158818 110974 127178 2636
24395B636j52408M6418J06315N5044o4933j38159J79755O3432j15535j62314L5913
24384a43836j0496j01940Q1748J09035O647L7842N9869J314m4260N7212J393o3753
24372i225k3505J97775N1518k99363m9365Q4939j24237p1973J799J37975M126
24361i9536j08014n0703O2652J65476j1385q5776p4024L00216J18589k0549k61091
24350f4145o8055j01996R5485J4045q063R1496R5425k4830J01057p4336j9141
24339C6942p2260M8979J17008M1673j72318j523J32868L2706k7519o7333J01240
24328A70463j0536o5472m3027k1389n4588n9241J53361M3870O1419m3801k10814
24317g9755p1770J3517J03427L4067J56733n9998j19574K0492J21224Q5864o1842
$$ plain form
24395 2636 -149772 -103354 2961 58005 -6928 -145087 34668 98100 -17435 -179749 -143836
24384 -143836 -154332 -256272 -174524 -65489 -58842 -21000 38869 40183 -4077 53135 54528 -9225
24372 -9225 -32730 165045 216563 -82800 -132165 -47226 -171463 -243436 -241637 -103662 -99536
24361 -99536 -207550 -258253 -195601 -30125 -41510 -127286 -201310 98906 217495 196946 -64145
24350 -64145 -132200 -234196 -138711 -124666 -132729 -41233 54192 29362 130419 56083 36942
24339 36942 -35318 13661 130669 172342 24 -1499 131369 164075 136556 69223 170463
24328 170463 159927 94455 51428 30039 -24549 -83790 69571 113441 174860 131059 -79755
24317 -79755 -151525 -138008 -34581 -514 156219 96221 -23353 -2861 118363 204227 142385
24306A42385o1298J05432N0734M9404M6175P5572j72020j85729J2863n582m7948
24295I988o3191j90217m9031J94153O2745k3685J5630J83805n5362k43093J08474
24284d9784O5792J11818l1734m4634p5776q3759P7460J28895K7378j54696j3825
24273d2865R6630J07030J08692p8334N0680j75308k23358q1051q6439N5203J66295
24262a02825J26780J28877Q8990l755J0268N8647q4275j30243l8171j44885j09786
24251b00378m0583j00827P7857Q8095J6640K16895Q6377n3330j08841R8814n9581
24240B1138j07369r2447j35901p5042J00112J19770J83093j43535n5744K56277
24230G0352j5884k6578j19412j39265p3846l1028l2098l7466Q9963J38989j8929
$$ plain form
24306 142385 81087 186519 237253 286657 332832 408404 236384 50655 63518 57936 9988
24295 9988 -53203 -243420 -292451 -98298 -35553 -59238 -43608 140197 84835 -158258 -49784
24284 -49784 16008 127826 96092 51458 -24318 -108077 -30617 98278 125656 -29040 -42865
24273 -42865 53765 160795 269487 191153 241833 66525 -156833 -237884 -324323 -269120 -102825
24262 -102825 23955 152832 241822 238067 248335 306982 222707 92464 54293 -90592 -200378
24251 -200378 -240961 -341788 -263931 -175836 -159196 57699 144076 90746 -18095 80719 21138
24240 21138 -86231 -178678 -314579 -389621 -289509 -169739 13354 -130181 -185925 70352
24230 70352 54468 27890 -91522 -230787 -304633 -335661 -367759 -405225 -315262 -176273 -195202
24219a95202J39654J82019N0295N8819J86888p4849j67111j27551j6550O7254
24209A03666r889j34692k45351o9853o1159m9163K00099J20855l8534j304J17578
24198f7747O6520p0282R7400n2029J2786P5365p4358j35328M9529J19233m2562
24187b1473N5187R5837J5193o0671p9134O2553K17904N5907m4862n4501j06687
24176A35253J9513M9115j32110J28732J30585q6531Q69j35959O3585L843j42838
24165C4057j9320p6204P6081M5760j4632K8297R3905j00572j34478P8126K5801
24154C6821q9762L0209r6927m433M3899j38435J07130J12233P5262P7753j8j9118
24142A34614o2495r4784J26908O6926j65599K3579O1325Q8463J43959l22681k15993
$$ plain form
24219 -195202 -55548 126471 176766 235585 422473 347624 180513 52962 36412 103666
24209 103666 93777 -40915 -286266 -356119 -417278 -466441 -266342 -145487 -184021 -185325 -67747
24198 -67747 -1227 -71509 25891 -26138 -13352 62013 -12345 -147673 -98144 21089 -21473
24187 -21473 33714 129551 144744 84073 4939 67492 285396 341303 296441 241940 135253
24176 135253 154766 203881 71771 200503 331088 244557 245426 109467 173052 176895 34057
24165 34057 14737 -61467 14614 60374 45742 74039 167944 67372 -67106 11020 36821
24154 36821 -52941 -22732 -119659 -124092 -80193 -218628 -111498 735 75997 153750 153732 134614
24142 134614 72119 -22665 104243 171169 5570 29149 90474 178937 322896 215 -215778
24131b15778Q0195O5068j78187J23319J48971J02892l1510k9002j00516j7628
24121e2176J7479K1307p3396k4978o8069L467j23384m2216j3677J50499P344P6780
24109a21020K70900k9859j26387j38919j9381o0880l0955L2881j822p7981n1195
24098c54618N3819J61480J96038j37231j88235J1117K06585P9451j1268K4875
24088D2013K64367J11695Q936j25839n0498J26351j17441m7721K1963j72611O3667
24077A24882o5889N873l6085j09706J32417J01131j457Q6379O5615k19972q3995
24066h07Q3781m4782j04924n9731J9483j35145O627P6318J0189K3496J43131P5178
24054I2814j29552L7551R0583Q8291J67839K4990n4318O7207o4470k10227l1031
$$ plain form
24131 -215778 -135583 -70515 -248702 -125383 23588 126480 94970 65968 -34548 -52176
24121 -52176 -34697 -13390 -86786 -111764 -179833 -176366 -299750 -341966 -355643 -205144 -197800 -121020
24109 -121020 149880 120021 -6366 -145285 -164666 -225546 -256501 -223620 -225442 -303423 -354618
24098 -354618 -300799 -139319 56719 -80512 -268747 -257630 -51045 28406 17138 42013
24088 42013 306380 418075 427011 301172 250674 377025 259584 211863 233826 61215 124882
24077 124882 58993 64866 28781 -80925 51492 152623 151166 237545 303160 83188 -807
24066 -807 82974 38192 -66732 -126463 -106980 -242125 -235498 -159180 -148991 -125495 17636 92814
24054 92814 -36738 813 91396 179687 347526 372516 318198 385405 320935 110708 79677
24043G9677L2720j48378j5190r5823J24605K7080k3891M9023k7420m9086j45660
24032a92343o6764l9593K7371J76348J223n9963J860l9148m9111J37502L14041
24021B11423J5756k18665k22698R6386J03934j023r1766P031O2038J00160K6220
24010H8796j75982m6423O1535J77481K50184j49311k9281n8932L5669p6792n1862
23999B5082k8153M9784O0399Q6592J8654j38264j29737r1841K79083K8743r4303
23988F6039j84178j64383p3669P2500k7748J34598K96474J46651r1040M5082M4121
23977B64447j47536q9605k7874j1750l5248P8917P5167p9358L172N0186j30203
23966d9685l7311l3336J64208N255j15262J81167M4887m8963J13771p0148J1818
$$ plain form
24043 79677 112397 -35981 -51171 -146994 -22389 4691 -19200 29823 2403 -46683 -192343
24032 -192343 -259107 -298700 -271329 -94981 -93758 -153721 -151861 -191009 -240120 -102618 211423
24021 211423 227179 8514 -214184 -117798 -13864 -14887 -106653 -99622 -37584 62576 88796
24010 88796 -87186 -133609 -72074 105407 355591 206280 176999 118067 153736 76944 25082
23999 25082 -3071 46713 107112 193704 212358 74094 -55643 -147484 131599 160342 66039
23988 66039 -118139 -282522 -356191 -283691 -311439 -176841 119633 266284 175244 220326 264447
23977 264447 116911 27306 -568 -12318 -47566 31351 106518 27160 30332 80518 -49685
23966 -49685 -86996 -120332 43876 49131 -66131 115036 159923 110960 224731 154583 166401
23955A66401J9892J0915o373M2132k5232n1503j86531o3985K09675J25666r7951
23944A43106j48234O1903L1793j35349k08324J39817J91905l3595l155r0593J09782
23933E9056n3693P8743J24256m1853o6658j49810j18673L036J83606P7353n8213
23922C7150j2361l2869J3077n0800R1993q1475o2902N9480J07593N6009p5946
23911D8949p7416L7928P6059j39563j46046J1028N0939n1148j15620N5360j2409
23900b61939Q5895O5653L6102J4444n3057J43413n7724L0213J2951k3667j45721
23889a53437k9944P246p4115R98j9556l2211m2990j90891K24279L07044K1981
23878A8404K5889R2306r0298k33387L3258K20118r177Q1920P8935l6762k11125
$$ plain form
23955 166401 186293 197208 190835 232967 207735 156232 -30299 -94284 115391 241057 143106
23944 143106 -5128 56775 88568 -46781 -255105 -115288 76617 43022 39867 -50726 59056
23933 59056 5363 84106 208362 166509 99851 -49959 -168632 -165596 18010 95363 37150
23922 37150 24789 -8080 4997 -45803 46190 -35285 -98187 -38707 68886 124895 48949
23911 48949 -28467 9461 85520 -54043 -200089 -189061 -138122 -189270 -304890 -249530 -261939
23900 -261939 -176044 -110391 -74289 -59845 -112902 30511 -27213 3000 15951 -7716 -153437
23889 -153437 -183381 -176135 -250250 -249252 -268808 -301019 -344009 -534900 -310621 -3577 18404
23878 18404 44293 136599 46301 -187086 -153828 66290 57113 139033 217968 181206 -29919
23867b9919q4487l9434J74054r3665j5816J34426l5014J6361J1020p3879K9583
23856f770j14750j05668J26763P9695j20691J67739J40918j50640j10524q7583
23846a81511J0886j65239P865p8183J48063K53571P2719P4381k4427n3049m1740
23835B3336j28186q871j09963j9522q754R8511J79641J63477J44579Q799j79264
23824A63783K8419P0105n6672L5183j28316k927J52892n1309M9846N6027m3904
23813B73127N5876L6365r1224j46218q9777O2737J08642N2844j08950j2698j6676
23802A24048j64516j71198j70030L2759J25018M4486n1052K22338L42849j43171
23792A91531j49060l4359l8301p3769p5479L4139k7732l2316j5577J06616J34101
$$ plain form
23867 -29919 -114406 -153840 20214 -73451 -89267 45159 10145 26506 37526 -36353 -6770
23856 -6770 -121520 -227188 -100425 -20730 -141421 26318 167236 16596 -93928 -181511
23846 -181511 -170625 -335864 -327999 -406182 -258119 -4548 68171 142552 118125 65076 23336
23835 23336 -104850 -113721 -223684 -243206 -251960 -153449 26192 189669 334248 343047 163783
23824 163783 192202 262307 205635 240818 112502 109575 262467 211158 261004 317031 273127
23813 273127 329003 365368 274144 127926 38149 100886 209528 262372 153422 140724 124048
23802 124048 -40468 -211666 -381696 -348937 -223919 -179433 -230485 -8147 334702 191531
23792 191531 42471 8112 -30189 -103958 -179437 -145298 -173030 -205346 -220923 -114307 19794
23781A9794J397j29246j3670K3545p3345L7892J20638n4058p6405N7672M2541
23770d3245L4730L6575o156j12521m2730J35936J54373J05349m5855q6047j06125
23759B4284r3753Q4796J04175m5036j31509J46308P3885K7968k6927m5006q4431
23748C4754m9777K1448j25646q6434l3201P9095J16233M7490M8874n6556M8627
23737D4907M3669J43317o2259Q2587N9534J7162l03528j53154p2373J26549J05220
23726C1631p5081q0739J19855q2337K6752m2523o6442j22779o3478K50642J69834
23715F5335K2909P3559O1165k16658j22894m6430j35089M6033J47724R8458J26315
23704A20427Q6246R841m5489j01786n9549o5238Q1556l1050j26264j8513j32133
$$ plain form
23781 19794 21191 -108055 -121725 -98180 -171525 -133633 -12995 -67053 -143458 -85786 -43245
23770 -43245 -8515 28060 21904 -90617 -133347 2589 156962 262311 216456 130409 24284
23759 24284 -69469 15327 119502 74466 -57043 89265 163150 191118 164191 119185 34754
23748 34754 -15023 6425 -119221 -205655 -238856 -159761 -43528 3962 52836 -3720 44907
23737 44907 88576 231893 169634 252221 311755 328917 25389 -127765 -200138 -73589 31631
23726 31631 -43450 -124189 -4334 -86671 -59919 -102442 -168884 -291663 -355141 -104499 65335
23715 65335 88244 161803 222968 6310 -116584 -163014 -298103 -252070 -104346 -5888 120427
23704 120427 206673 216514 171025 69239 9690 -55548 26008 -5042 -131306 -149819 -281952
23693b81952o2954O3424m4290K6530R4219O1867K9627M5254R4864Q0639k10532
23682a03304j99327k1137k9270m942K12696K25328Q7152q4681K4214J69014q3141
23671A92602j5499K5436j94409p7407J498P7364R7579J3735k39594j59876J54160
23660a24411K14987O8140r9289l18979j35142J46551R9523Q4907J14074j0269
23650D0092Q1335j0954j36446J26898K9078j8170o301p6626J75989k175o206L0822
23638B27336r1593k02896j21761j43111N8058Q2278J75655r8985j7186P006j0401
23627a35600J0529M9709k1571r0629j11423o4116J18269K44100L4623p1850J93409
23616A55450M9607o9501M7246N5056j96863j64250m0193O9135j6996J00514J16276
$$ plain form
23693 -281952 -344906 -281482 -325772 -299242 -205023 -143156 -113529 -68275 26589 107228 -103304
23682 -103304 -302631 -323768 -353038 -357980 -145284 80044 167196 82515 106729 275743 192602
23671 192602 177103 202539 8130 -69277 -67779 9585 107164 120899 -118695 -278571 -124411
23660 -124411 90576 158716 59427 -259552 -394694 -248143 -148620 -63713 50361 40092
23650 40092 121427 110473 -25973 100925 130003 111833 105532 28906 204895 202720 196514 227336
23638 227336 135743 -67153 -188914 -332025 -273967 -191689 -16034 -115019 -132205 -125199 -135600
23627 -135600 -125071 -75362 -96933 -187562 -298985 -363101 -244832 -732 33891 -37959 155450
23616 155450 205057 135556 182802 237858 40995 -123255 -163448 -94313 -111309 -10795 105481
23605A05481K3874j11759p9808j65708J32981k8633o1298R9161L5180R5512N4629
23594I9612n8835M0690M5916L4932k1011j42892r8469n084j19905M4092J72713
23583h241J29918R1625Q0111M9806j03518q7548j8661J13785j6537j41836k01927
23572a13023n7381J02219J83358p9640j46134p6410K02931J28622j93488j05590
23562a54536Q5865p3200p2746K6323L5706o8362o147P2665O1044j892K5118K7515
23550d2647J04835j7678j21474P0180M1338R954j8898j09782M2520O1446l7568
23539a7774j3398O8711M9452j81023p1473q526j03080m7942N8443J66246K7365
23528g2999n9902N258K0576p4354p7433J93642k474j52195N2528Q5958O9979L6354
$$ plain form
23605 105481 129355 17596 -62212 -227920 -94939 -123572 -184870 -85709 -50529 44983 99612
23594 99612 40777 81467 127383 162315 141304 -1588 -100057 -105141 -225046 -180954 -8241
23583 -8241 121677 213302 293413 343219 239701 152153 133492 247277 230740 88904 -113023
23572 -113023 -170404 -68185 115173 35533 -110601 -187011 15920 144542 -48946 -154536
23562 -154536 -68671 -141871 -214617 -188294 -152588 -220950 -227097 -154432 -93388 -95280 -70162 -42647
23550 -42647 62188 44510 -76964 -6784 34554 44508 25610 -84172 -41652 19794 -17774
23539 -17774 -31172 37539 86991 -94032 -165505 -174031 -277111 -325053 -266610 -100364 -72999
23528 -72999 -132901 -127643 -107067 -181421 -258854 -65212 -67686 -219881 -167353 -81395 -11416 24938
23516B4938q8596Q8425P9985K1064P6099j17006k13064J12150J41438N7534N6491
23505B39458O3794N6698l571j3520J4529O4074j15311k37841j40198O6506K7138
23494B1756R5318O8102j41267j305R2786j3300j00009j38678K6518O086m5236
23483a29229k4741J8842k6368J8705o238q4266L7675J48027J96744o549K1496
23472A64098J09688J63743j64675j53550j17043o1091N5072M8755R249k2772L5878
23461F7352p5365l7001j12908n2038J39490p5186r9588q2055j02170P4512J47327
23450b07630R0926q8133J68184J09875J61958M7410j31767j60202n3307J27047
23440F4361l0753j42931j13706Q3566J76408n6884J118k2485l3819m2118J45017
$$ plain form
23516 24938 -63658 24767 104752 125816 201915 84909 -128155 -16005 125433 182967 239458
23505 239458 303252 359950 356379 342859 357388 421462 306151 68310 -71888 -5382 21756
23494 21756 117074 185176 43909 42604 135390 122090 22081 -116597 -90079 -83993 -129229
23483 -129229 -153970 -135128 -161496 -142791 -149029 -233295 -195620 -47593 149151 142602 164098
23472 164098 273786 437529 272854 119304 2261 -58830 -3758 44997 54246 31474 67352
23461 67352 -8013 -45014 -157922 -209960 -70470 -145656 -245244 -327299 -429469 -354957 -207630
23450 -207630 -116704 -204837 -36653 73222 235180 282590 150823 -9379 -62686 64361
23440 64361 33608 -109323 -223029 -139463 36945 -19939 -18821 -41306 -75125 -117243 27774
23429B7774J16233j39950M818n4435J00609J40914n0828n7694j41253l5967K7774
23418f2005p1652q821O2714o4964J83196O1214n6879r8096J82865n4918j17274
23407d4620K0413M9619o0389L3669M0078j08663k63275l371J33500J18691p3487
23396a57835J1380P3711J1222j65873M1345Q0694m4868Q838J40656J53746R6248
23385B49264r9016q8255J18023k112m2487l6944l0220q1668J58773j3012r9068
23374C3278j15766M7453Q7944J0836O40q3710p9833K8323j49852J47226R9860
23363B6399N2649J46649L7021j0192N123k0638k00681j63622K8399J34496J95544
23352B31147K0519j01711j06760k3324l0837j22041l2534j58385L1825M6106J3335
$$ plain form
23429 27774 144007 4057 8875 -45560 55049 195963 145135 87441 -53812 -89779 -62005
23418 -62005 -133657 -142478 -79764 -144728 38468 99682 42803 -55293 127572 72654 -44620
23407 -44620 -24207 25412 -34977 -1308 38770 -69893 -333168 -336539 -203039 -84348 -157835
23396 -157835 -146455 -72744 -61522 -227395 -186050 -105356 -150224 -141386 -730 153016 249264
23385 249264 150248 61993 180016 177904 135417 98473 68253 -13415 145358 132346 33278
23374 33278 -82488 -35035 52909 63745 64385 -19325 -99158 -70835 -220687 -73461 26399
23363 26399 79048 225697 262718 252526 257649 237011 36330 -127292 -98893 35603 231147
23352 231147 251666 149955 43195 19871 -10966 -133007 -165541 -323926 -292101 -245995 -232660
23341b32660j16955k3983q4610Q3171J23139J65564J50267J47443J7452j06548
23331A22280k09894n2007o3322p311O231K50510Q9822j20843M2597l971O4663
23320A18755j09003j13590M9430L816N4533p9319q8574K9649L6890L499M2217
23309e1697q302m8043q3637J8294r5227p4622l7229J32170J847P905J08953J4526
23297a15062R7845L8678o4281R715K245J1594R1854m8780q2616j18146J39110
23286c7844J99329L9178m4416k03258j85118j9446k9343J15594N3645J39125o6120
23275c8674j43465k5737J81582J05162p7684k2529J09087J46760J54186j22613
23265B66075k42780r7871m0069J8156O5537J71037K7878n6106m6064j29285k6523
$$ plain form
23341 -232660 -349615 -373598 -458208 -375037 -251898 -86334 63933 211376 228828 122280
23331 122280 -87614 -139621 -202943 -210254 -204023 46487 136309 15466 58063 54092 118755
23320 118755 9752 -103838 -54408 -50592 3941 -75378 -163952 -134303 -97413 -93914 -51697
23309 -51697 -59999 -108042 -191679 -173385 -268612 -343234 -380463 -248293 -246446 -238541 -129588 -115062
23297 -115062 -17217 21461 -42820 -33105 -30860 -19266 72588 23808 -58808 -176954 -37844
23286 -37844 161485 200663 156247 -47011 -232129 -251575 -280918 -165324 -111679 27446 -38674
23275 -38674 -182139 -207876 -26294 78868 1184 -21345 87742 234502 388688 266075
23265 266075 23295 -74576 -114645 -96489 -30952 140085 167963 111857 65793 -63492 -90015
23254i0015J75048J12103j10684j66622o5256j63078o0235L6618J7923j15326
23244d29524J80136K85907O9990j34538j30397j5822j00296P6605K02705m8966
23234d4200o1206N9619K23590J20550p9129j38401j94017j7746p008k8830j597
23223a68375O3986j38318O4127J85950j90733k16226l0837o7853o0367J62980
23213c95666Q5458L3751J32490P6236o0998o1107l8266J19897n1079r986J01230
23202f8040N6710O3805l6866l5332j07670l11898p3666R1672J73551l5088q9418
23191c72240l0290K5908o2984P4382K31757K45969J42890O0538j7761j942k29367
23180F6860K6157L8631J59066L00003J42349J21568M88412P01799L12080L96545
$$ plain form
23254 -90015 85033 197136 86452 -80170 -145426 -308504 -368739 -332121 -314198 -429524
23244 -429524 -249388 36519 106509 -28029 -158426 -174248 -274544 -197939 4766 -44200
23234 -44200 -105406 -45787 177803 298353 219224 80823 -113194 -130940 -137948 -166778 -168375
23223 -168375 -104389 -242707 -178580 7370 -183363 -399589 -430426 -498279 -558646 -395666
23213 -395666 -310208 -276457 -143967 -67731 -128729 -189836 -228102 -108205 -159284 -169270 -68040
23202 -68040 -11330 52475 15609 -19723 -127393 -439291 -512957 -421285 -247734 -282822 -372240
23191 -372240 -402530 -376622 -439606 -365224 -133467 112502 255392 315930 298169 296227 66860
23180 66860 93017 131648 290714 590717 733066 854634 1343046 2044845 2356925 2753470
23170B753470J09639l27608m51882m00721n61984n03616j88019L0114k8085O4594
23160D95902J93062J648k16497j65038O5120n765j43930k74515q4512O4326Q7351
23149A7152o7735p2587O8294L23462J00364K9461p9080r8345l9583J02114O585
23138B90102k16518k52664k50012P3776J7849K22081k4104j25252j5351J6884
23128b63209J46929r6693R4362J85988J38019o7183j10816l880n5948j19914M4067
23117a08278q7381J44676J97529l3738q4115l5604M6966m0012j00975N2876J6674
23106c1382L3846r1759o2105J78608L2411l29449m6710R6360J37174J1546j45045
23095b16505O7117J20302j22196j29324R8848K38359J38524q166K8751J28950
$$ plain form
23170 2753470 2863109 2535501 2083619 1682898 1120914 617298 429279 459393 431308 495902
23160 495902 688964 690612 474115 309077 374197 368432 224502 -50013 -134525 -70199 17152
23149 17152 -50583 -123170 -54876 268586 368950 398411 319331 220986 181403 283517 290102
23138 290102 73584 -179080 -429092 -355316 -337467 -115386 -139490 -264742 -280093 -263209
23128 -263209 -116280 -212973 -118611 67377 205396 138213 27397 23517 -32431 -152345 -108278
23117 -108278 -195659 -50983 146546 112808 28693 -6911 40055 43 -100932 -48056 -31382
23106 -31382 2464 -89295 -151400 27208 59619 -269830 -316540 -220180 -83006 -71460 -216505
23095 -216505 -149388 -29086 -151282 -280606 -181758 56601 195125 186959 215710 344660
23085C44660P3287j02061j63152j31716j2591j2464m7761l1134J28415j1519n5299
23074b1335j1634J12097k1341p599Q7930J39077K5585K4542j46195K5253J07r8391
23062A08096L2384j19608j89368L699P5243Q8486p2955j4967j0335k9114J41654
23051A3215R6293k89310k52275P2176K03277L4458q215o0473J8315j04537N9864
23040b17212o4544J4199J39143J51020j00549j77208m1411J28215J18390J92886
23030A42929R2068k15792j07J08826k8222n843k258n3092n1749l318L095K9096
23018A5633k9162j67889j02450Q4818J9939N6669p398J05329j29238M2607R7670
23007a3472P24n3885q4352J60821O2418o8927j21007J15897q0847k0901J36970
$$ plain form
23085 344660 417947 315886 152734 21018 8427 -4037 -51798 -82932 45483 33964 -21335
23074 -21335 -32969 79128 57787 50188 138118 277195 302780 327322 181127 206380 206487 108096
23062 108096 140480 20872 -168496 -164797 -89554 -1068 -74023 -88990 -99325 -128439 13215
23051 13215 109508 -179802 -432077 -359901 -156624 -122166 -130381 -190854 -172539 -277076 -217212
23040 -217212 -281756 -267557 -128414 22606 -77943 -255151 -296562 -168347 -49957 142929
23030 142929 234997 19205 19098 127924 99702 93859 91601 38509 -13240 -16558 -13463 15633
23018 15633 -13529 -181418 -283868 -199050 -179111 -122442 -129840 -24511 -153749 -111142 -13472
23007 -13472 -12748 -66633 -150985 9836 72254 3327 -117680 -1783 -82630 -103531 33439
22996C3439J37144J55794K6385p3137k87448o9371n367K0049q0831j46022n6310
22985c45675R0133p1527J13606J24301l7184j83128p313K49257K6918k0068J37593
22974G6913j09285J7564p7527N7553l163o7489p807o1985k3030J3305K223O7386
22962a15342J22021R9193j99740j27310L1469J00671n5220Q7108J01416o1290
22952a7024m8794j17761J2726q7567r8306P8673R6802q545J0331R0765J56403
22941F7703l1200j66578j2509j13778Q5839O0365q4068K47914J22260K2800k00459
22930a711j32552j01778o5634J34296J79378J65887p569j6174n597K3704j47222
22919B5028K4403J04730J9580j02503j26605p5826P8121m0479o1268j02341j3287
$$ plain form
22996 33439 170583 326377 352762 279625 -7823 -77194 -82561 -62512 -143343 -289365 -345675
22985 -345675 -255542 -327069 -213463 -89162 -126346 -309474 -316787 -67530 -40612 -60680 76913
22974 76913 -32372 -14808 -92335 -34782 -37945 -105434 -113241 -175226 -198256 -184951 -182728 -115342
22962 -115342 6679 105872 -93868 -221178 -189709 -89038 -144258 -57150 44266 -17024
22952 -17024 -65818 -183579 -170853 -258420 -356726 -278053 -181251 -189796 -179465 -88700 67703
22941 67703 36503 -130075 -142584 -256362 -170523 -110158 -194226 53688 175948 198748 -1711
22930 -1711 -134263 -236041 -301675 -167379 11999 177886 170317 154143 148546 172250 25028
22919 25028 49431 154161 173741 71238 -55367 -131193 -53072 -93551 -154819 -257160 -270447
22908b70447J23389Q7416P8308R0171J7549j0626J04593j11999P0057J1510j69914
22897B0007j42741J57870J63369o7002q4671P3235k6755k302m4998L5182J72481
22886B53675l4013j6992n0576J03702l4735j33768j22638R9541j13198q8184K68716
22875A31530K49213j72132j09955k1295k9679j80516j9371J03130N1250L870J21886
22864A27931l8226J05530M2140m7149j35729j5270K5023M6964j03532r1372K36439
22853A52749J63103j24102j28118m8127J1141M0353M7163m3672r1789K0094J14785
22842A13580l1131k14316M1231N6036m0300R296j02282j27588J04840N4749K4367
22831a11518m154J1890K16511J30312q669O364q3995L3299k0252j65635k7335
$$ plain form
22908 -270447 -147058 -59642 18666 108837 126386 115760 220353 108354 178411 189921 20007
22897 20007 -122734 35136 198505 131503 46832 120067 93312 91010 46012 81194 253675
22886 253675 219662 202670 152094 255796 221061 87293 -35345 64196 -49002 -137186 131530
22875 131530 380743 208611 98656 77361 47682 -132834 -152205 -49075 2175 6045 127931
22864 127931 89705 195235 237375 190226 54497 39227 64250 111214 7682 -83690 152749
22853 152749 315852 191750 63632 15505 26646 66999 114162 70490 -21299 -1205 113580
22842 113580 82449 -131867 -90636 -34600 -74900 -65604 -167886 -295474 -190634 -135885 -111518
22831 -111518 -115672 -103782 112729 243041 234372 240736 156741 190040 169788 4153 -23182
22820b3182l8292R9777J54569k9748r6321p0195r76k1455j10465n5348M8391N3529
22808h9716M599K6592r9333l414K36071P5413j14283J26879O8135r4637J8021
22797A54327q944R7763R2145k4874j99383j55745j25059j3990k1743L7520j78771
22786c46754k3625K14056j774j69146r333L9497P6245r4194n7354R0987L6466
22775b44929J7105Q9071M1J45050J33807K7718r4622j88341j09195P4988J02220
22764d7087l3396J27861Q5357M1055M1265j14250J11134J36745n6756j60159K512
22753A34281p870q7770M5331K6999k6823n2160N2201L8861j97598p2056J50256
22742C652P6101p3782l4380K4608M6185M2086J3716P6289k8432J4996K6959l6032
$$ plain form
22820 -23182 -61474 38303 192872 163124 66803 -3392 -4368 -25823 -136288 -191636 -143245 -89716
22808 -89716 -85117 -58525 -157858 -161272 74799 150212 35929 162808 230943 136306 154327
22797 154327 145383 243146 335291 310417 111034 -44711 -169770 -183760 -205503 -167983 -346754
22786 -346754 -370379 -156323 -158097 -327243 -336576 -297079 -220834 -315028 -372382 -281395 -244929
22775 -244929 -227824 -138753 -138712 6338 140145 167863 73241 -115100 -224295 -149307 -47087
22764 -47087 -80483 47378 132735 173790 215055 100805 211939 348684 291928 131769 134281
22753 134281 126411 38641 83972 110971 84148 31988 84189 123050 -74548 -146604 3652
22742 3652 79753 5971 -28409 -3801 42384 84470 98186 174475 146043 161039 187998 151966
22730A51966q7820j79389l1978L501P6367k8196k5872M3609P0405l7297q0599
22719a25303r4253J3104M520K7594J1705O3002J35818l2939j00304m8431J58694
22708A3207J79947K16665m024K47922M79604O54290P97466N53886J37408q0340
22698C196031k57862n74326n66689m65518k31093k25664j77775j5166j75391J5707
22688E22254k51632K2908m3320J27682L7955J25731Q0564k27169n6547J10544
22678D48970p1837j02594K04845K18169j34092k8028J31480J78187Q3444Q2005
22668A010549P5571j49889j14827k0544J66286L605L3404K41458J03872J6635
22658A366120J12614Q4656n5034J64485L13368L38619K57089L09854J70244L30213
$$ plain form
22730 151966 64146 -115243 -147221 -143720 -67353 -95549 -121421 -77812 -7407 -44704 -125303
22719 -125303 -219556 -206452 -201932 -174338 -162633 -99631 36187 3248 -97056 -145487 13207
22708 13207 193154 409819 405795 653717 1133321 1787611 2585077 3138963 3276371 3196031
22698 3196031 2938169 2363843 1797154 1331636 1100543 874879 697104 681938 506547 522254
22688 522254 270622 293530 250210 377892 415847 541578 622142 394973 338426 448970
22678 448970 377133 274539 479384 697553 563461 535433 666913 845100 928544 1010549
22668 1010549 1086120 936231 821404 800860 967146 970751 1004155 1245613 1349485 1366120
22658 1366120 1478734 1563390 1508356 1672841 1986209 2324828 2581917 2891771 3062015 3392228
22648C392228L16224M02343M79311N79934O82995Q18086J003609J389412J637868
22639A0702010J917659K674415L723242M825157N996943P867150J0892928J6826368
22631F5425872K8876347N2865082R2006972J21456391R9293315N5460036L4657977
22624E50041992k469907o3390134r9509297j03480236r0300400o2271820l6571292
22617I2048906k1919840j4357120j0227213p719290o094785m511435l329033k759974
22609B1130216k334650j809803j530929j454135j362740r76887r36677r41446
22601I782949p57847n57129o11748n77231l70993l74928l81315k88900k77398
22592E585460j26907j32889k10728l88850l26095l92116k99520j91126k50783
$$ plain form
22648 3392228 3708452 4110795 4590106 5170040 5853035 6671121 7674730 9064142 10702010
22639 10702010 12619669 15294084 19017326 23842483 29839426 37706576 48599504 65425872
22631 65425872 94302219 147167301 239174273 360630664 459923979 515384015 550041992
22624 550041992 547572085 484181951 384672654 281192418 190892018 128620198 92048906
22617 92048906 70129066 55771946 45544733 37825443 31730658 27219223 23890190 21130216
22609 21130216 18795566 16985763 15454834 14000699 12637959 11661072 10724395 9782949
22601 9782949 9025102 8467973 7856225 7278994 6908001 6533073 6151758 5862858 5585460
22592 5585460 5458553 5325664 5114936 4726086 4399991 4007875 3708355 3517229 3266446
22583C266446k43118k984p2192j65314j5600k05221k56578R9956L5177j2103j78686
22572B249783l7815q2624j27061P1647J6136q2925n0419J1760J70633k5104k85572
22561A828439k86285j37112j79419J23374K9043P5833J85434R7173L65659O56513
22551B758652O50039L77461J29671q7397k08867l31979m59727o08099l99077k11881
22541A608796l10880k45974j98887J101L4816l5950j17642n5862R5525J03254
22531H78297P2752J60545K6089j38825k71863k16138q1837J26232L3676m0938
22521E47990J80451k7434j99414M0493j9609J70655m0448l3145q6341P5801N2803
22510F61802k3699j6625q9880k5125q8133N108m5107o2256Q2866k9986L2727J06757
$$ plain form
22583 3266446 3023328 3020344 2948152 2782838 2767238 2562017 2305439 2405395 2440572 2428469 2249783
22572 2249783 2211968 2129344 2002283 2073930 2090066 2007141 1956722 1968482 2139115 2114011 1828439
22561 1828439 1542154 1405042 1225623 1348997 1378040 1453873 1639307 1736480 2102139 2758652
22551 2758652 3408691 3786152 3915823 3828426 3619559 3287580 2827853 2219754 1820677 1608796
22541 1608796 1297916 1051942 853055 854156 888972 853022 735380 679518 775043 878297
22531 878297 951049 1111594 1137683 998858 726995 510857 429020 555252 588928 547990
22521 547990 728441 701007 501593 542086 522477 693132 652684 619539 533198 608999 661802
22510 661802 638103 621478 531598 506473 418340 423448 378341 316085 398951 368965 401692 508449
22498E08449o0695o9941n3225r089j0032p3568M5664O7216m6898m9851O9669J5373
22486C33072l2416N7508Q8258q2925L2704L6506n6301M5430J06408j56146j19245
22475B52853l8282K16949J14919j31343j67603J37648J25498j2270j06873k16103
22465A75393j27826N4078K20268J62501J15767R1713l3367k70863l3003P4257
22455D28918N5514n5390J00479J101j36731k89093l01080O9914J62477L2317N3367
22444A21793J11694o1460q932J53468K24899j86545k27517O8097K8862o5030k1029
22433A38300J12737q2935J03459L4680j07146R8192n9809J45610Q1393j60358
22423C04123j64790n6226L9261j9093N3433P5144j03935J77799Q5557N2079j99583
$$ plain form
22498 508449 447754 377813 324588 315499 305467 231899 277563 344779 297881 248030 317699 333072
22486 333072 300656 358164 446422 363497 396201 432707 376406 421836 528244 372098 252853
22475 252853 214571 431520 546439 415096 247493 385141 510639 498369 391496 175393
22465 175393 47567 101645 321913 484414 600181 691894 658527 387664 354661 428918
22455 428918 484432 429042 529521 530622 393891 104798 -196282 -126368 36109 68426 121793
22444 121793 233487 172027 163095 316563 541462 354917 127400 195497 224359 159329 138300
22433 138300 251037 168102 271561 306241 199095 297287 237478 383088 464481 304123
22423 304123 139333 83107 122368 103275 156708 231852 127917 305716 391273 443352 243769
22412B43769r0525R1556P6454o9860j31306r1339N2602O4069P9240P6747k0949
22401B80458j36774o7846J70329M6366R4807j26008j35641m7502J34083L8069
22391B50341j63499j1039J19702J54761l6696R260k2979j32172m3696Q7344Q4186
22380B95513K6411l3609l197K1713J10387J30072J28787j25009j59236o7624n6127
22369B68081j41266j81878j89758J78030N6657N5526K57451J36321j09209j25135
22359B04820j12649R8146P9831p0659Q3307R0951j36099j45255j92289q5303K8241
22348a56958J88729j08039j57113k05883J02209J78206J78752j9866p3482q1163
22338a54608o9696O1955l3404J47355J80406J0203J14403J27884m6197j0958K3466
$$ plain form
22412 243769 153244 244800 321254 251394 120088 28749 81351 145420 224660 301407 280458
22401 280458 143684 75838 246167 292533 387340 261332 125691 78189 212272 250341
22391 250341 86842 75803 195505 350266 313570 322830 299851 167679 123983 211327 295513
22380 295513 321924 288315 285118 306831 417218 547290 676077 551068 391832 324208 268081
22369 268081 126815 -55063 -244821 -66791 -10134 45392 302843 439164 329955 204820
22359 204820 92171 190317 270148 199489 282796 373747 237648 92393 -99896 -185199 -156958
22348 -156958 31771 -76268 -233381 -439264 -337055 -158849 19903 37 -73445 -154608
22338 -154608 -224304 -162349 -195753 -48398 132008 142211 256614 384498 338301 327343 350809
22327C50809K0616j4376Q9351k80765j44148o8759j9655o4839p74J58380L19617
22316C45457O8268j00049K9564j09651k08808j15337J8462J86004l1926j39182
22306e7198L4226K27477J29839N6078j01969l0213n6121N2642J85175Q5861Q5785
22295F11582n556j28398J38235L80737O01646O87554P47504O72835J75678r1532
22285C790285k46834n00408q42408n52447m68310k96883k25828l9275n2125j90620
22275C75147L706N0020j64506m9791J74447J48305k0985j83083j37678p5506q6800
22264C3276J8360k02259k4605J93318L4253P8738J0078o8985K333j25574j79001
22253b30068o4539l1503J06882N6633K569O8845Q9182J85205k9955j8303r1427
$$ plain form
22327 350809 371425 357049 446400 165635 21487 -47272 -66927 -131766 -132540 25840 345457
22316 345457 413725 313676 343240 233589 24781 -90556 -72094 113910 81984 -57198
22306 -57198 -22972 204505 334344 390422 288453 258240 202119 254761 439936 525797 611582
22295 611582 606026 477628 615863 996600 1598246 2285800 3033304 3706139 3881817 3790285
22285 3790285 3543451 3043043 2200635 1648188 1179878 882995 657167 617892 565767 375147
22275 375147 378853 428873 264367 214576 389023 537328 516343 333260 195582 120076 33276
22264 33276 51636 -150623 -175228 18090 52343 131081 141159 72174 74507 -51067 -230068
22253 -230068 -294607 -326110 -219228 -162595 -160026 -91181 -1999 183206 153251 134948 43521
22242D3521O018o5715R876J0704j0170K8157J1467k6341J03188q8845J19727K7982
22230A69569l2935j5398n3801j02333j2572K01906l7203j18710l8571o199M8757
22219B510N7067L2652O457J8481l6533L639n7840O3212N0519J25151M6463m0612
22207B71166n6345o4527p4904k80614j77931L5609J24902K00171K86481J36259
22197D00267k19505p3822J53655j6379l4184o3031Q3754o9385j31644j1670Q6691
22186A04747R7079l1147q5818j20367q6371j40345q2551J68577j090J30721K49440
22175B02875j02883j17744O1245o8772J29923j51186k38731j5132J48028R0209
22165f2168l5125R7061R4774P48j18801K4643P2658J29m9407r4028l4356Q5855
$$ plain form
22242 43521 49539 -16176 -6300 4404 -5766 22391 33858 7517 110705 21860 141587 169569
22230 169569 136634 121236 67435 -34898 -47470 154436 117233 -1477 -40048 -46247 2510
22219 2510 59577 92229 98686 117167 80634 84273 26433 89645 140164 265315 311778 271166
22207 271166 214821 150294 75390 -205224 -383155 -347546 -222644 -22473 264008 400267
22197 400267 180762 106940 260595 244216 210032 147001 230755 161370 29726 18056 104747
22186 104747 201826 170679 84861 -35506 -121877 -262222 -344773 -176196 -177286 -46565 202875
22175 202875 99992 -17752 43493 -25279 104644 -46542 -285273 -300405 -152377 -62168
22165 -62168 -97293 -232 94542 95290 -23511 1132 73790 73919 24512 -69516 -103872 -18017
22153a8017J21079j92416n9169J69470j9903j9218M0245k5541O2383J9773J97519
22142B76205O4866j21786r5868m396Q7396M6643j23754q414L5687J38464q3623
22131B11420m4765o0794k17721J72Q2215m3935K0705k6289l1559J9504J88943
22120I7896j28858k81112j79954J88193K00563Q9470K04719n8437m7824R4881
22110A79537k1945m8567m1137j82975l5371Q8549P5657r345p5109m320K8919R3250
22098D7143M6116M355p0624J1733J3919K64407m0909j32683n4334j10361o1705
22087h2943J43993M0190m8106n3382n4322P6251J08934P0358m3192Q0483J90699
22076D28963J53935K63767O43546N42836N00465L31032J73118j01865n13457m91840
$$ plain form
22153 -18017 103062 -89354 -148523 20947 1044 -18174 22071 -3470 58913 78686 276205
22142 276205 341071 219285 123417 119021 206417 253060 129306 120892 156579 295043 211420
22131 211420 166655 105861 -111860 -111688 -29473 -73408 -52703 -78992 -110551 -91047 97896
22120 97896 -30962 -312074 -492028 -303835 -103272 -13802 190917 132480 84656 179537
22110 179537 157592 109025 67888 -115087 -150458 -61909 13748 4403 -70706 -75026 -46107 47143
22098 47143 93259 97614 26990 38723 52642 317049 276140 143457 89123 -21238 -82943
22087 -82943 61050 101240 53134 -248 -54570 21681 130615 200973 157781 238264 428963
22076 428963 582898 846665 1490211 2033047 2533512 2864544 3037662 2935797 2422340 1930500
22066A930500l41800l90985k23676l39462k1261N1872l05590k12394l9813j28428
22056b1037j04635K2890L7519M2943k02932n019K24072o74j15505k81075Q2370
22045c21083K84326J11997R6708p4315L2117Q4086J5828o5863O9391q8959j24655
22034A9578j9382m6543q4410j15307j42849j20783J00528K26231Q5552k22j44019
22023b41626Q8474J10006m2233q0461J4354J43322Q6152k11915j13446j6512M7257
22012b16628L5204K6177j39381N5039N006J4893J49448k1008J7983K96432N4660
22001B77825j62335j86728Q8537O2503o3385O1959k9930j9947j33105k8122r958
21990a42686l8510J69362P8441o9183r0726j74732j10937J1170m3069L7113J49908
$$ plain form
22066 1930500 1588700 1197715 974039 634577 613316 665188 359598 147204 107391 -21037
22056 -21037 -125672 -102782 -65263 -22320 -225252 -230271 -6199 -6873 -122378 -403453 -321083
22045 -321083 -36757 75240 171948 97633 129750 213836 229664 163801 233192 144233 19578
22034 19578 196 -46347 -130757 -246064 -388913 -509696 -409168 -182937 -97385 -97607 -241626
22023 -241626 -153152 -43146 -85379 -165840 -151486 -8164 77988 -133927 -247373 -263885 -216628
22012 -216628 -181424 -155247 -294628 -239589 -234583 -219690 -70242 -91250 -73267 223165 277825
22001 277825 115490 -71238 17299 79802 16417 78376 48446 28499 -104606 -132728 -142686
21990 -142686 -181196 -11834 66607 -2576 -93302 -268034 -378971 -367801 -410870 -373757 -223849
21979b23849J37018K92436k9007j34373K6500n2414o2985l9184j17493j34586
21969c37937m4910L27098J19348P9589j12914O9105K54647n2321k14300r5684
21959h279J29299Q0948p5747N5115j9904j56687L3443R9255j23689j02878K9065
21948f0059j496R8695J9096n2723m7284j70829r6166J54804M6336q7031k6174
21937b22831m3702j6760K5550J55827o627P3499O7564Q35N281m9919J25478k1566
21925I2629r4536j30892k00860p745K980j37029J25837L6379M7951J04901Q5678
21914g4707M1763O3227p3615m9912j45277r2541l9332l838n7160Q4516J69949
21903a76927l6K7411R0706K45j4586J56972M0034P9961p0228k36649M1411J85922
$$ plain form
21979 -223849 -86831 205605 176598 42225 68725 16311 -46674 -85858 -203351 -337937
21969 -337937 -382847 -55749 63599 143188 30274 99379 354026 301705 87405 -8279
21959 -8279 121020 201968 126221 181336 161432 4745 38188 137443 13754 -89124 -60059
21948 -60059 -61555 37140 56236 3513 -43771 -214600 -310766 -155962 -109626 -196657 -222831
21937 -222831 -266533 -283293 -257743 -101916 -108543 -35044 32520 33355 38636 -11283 114195 92629
21925 92629 -1907 -132799 -333659 -341404 -338424 -475453 -349616 -313237 -265286 -160385 -74707
21914 -74707 -32944 30283 -43332 -93244 -238521 -331062 -370394 -374232 -431392 -346876 -176927
21903 -176927 -176963 -149552 -58846 -58601 -73187 83785 123819 203780 133552 -103097 -61686 124236
21891A24236L746J16291P8792j83289q6525j662J38911n165J25708r4182o3761
21880A53100j50522r3458k6834M8970O0586M7634J24683m4959k20655j8382J20326
21869D89j50405K8494J87450j20268j2782K6739P897J71361J24409r2969M6820
21858B17235p3386M6843j89435j00931L746J10424o7410n9387K14314J0651R0046
21847B02710p4595j9928J6006J8701p3992L3416O2072j80874l7410l815n8006
21836a15715J61814L8463q2284k4191R2852N3415k22086j06175N236j0866N3107
21825a56430l2681L5432p1530k439J29203Q9805N5946q4613m6509J63663K6851
21814A06698k4209j03574M5257l4321K893j97476K5091J56180J14495m887k45707
$$ plain form
21891 124236 127982 244273 323065 139776 53251 51589 190500 185335 311043 216861 153100
21880 153100 2578 -90880 -117714 -68744 -8158 39476 164159 119200 -101455 -119837 489
21869 489 -149916 -121422 66028 -54240 -67022 -40283 -32386 138975 263384 170415 217235
21858 217235 143849 190692 1257 -99674 -95928 14496 -52914 -112301 102013 112664 202710
21847 202710 128115 108187 124193 142894 68902 102318 164390 -16484 -53894 -57709 -115715
21836 -115715 46099 84562 2278 -21913 70939 124354 -97732 -203907 -198671 -209537 -156430
21825 -156430 -189111 -153679 -225209 -227648 -98445 -8640 47306 -37307 -83816 79847 106698
21814 106698 82489 -21085 24172 -10149 -7256 -204732 -179641 -23461 91034 86147 -159560
21803a59560R555J96399L0392o0807p0933l9185J70561J7330m1026J7712N4018
21792A24456j8711j88857j80596K5265J80188J6597p7485J69550j35160j0800
21782i5553M7425J44708k04494k4642L3492k53868j0039q186O1401J84715J80795
21771E5754o3793N0002n9677K8171m1091J6274j26049R0419L6320m0541M2159
21760a2052k8576k3121j05983l08194J36845L53812J89051K6783m6862r5469n5113
21749C1121j25047p2435Q803J9942J8582J26138K2056M0885j24176n8940P5310
21738c7761M740L313K9167Q2102j21481k416J74835q9910k47606r0828k6891J55243
21726a67493J55950n3123R218k0560j30838K6685J68093o8901j04583q6858L894
$$ plain form
21803 -159560 -150005 46394 76786 15979 -54954 -94139 76422 93752 52726 70438 124456
21792 124456 105745 -83112 -263708 -238443 -58255 -41658 -119143 50407 -84753 -95553
21782 -95553 -48128 96580 -107914 -132556 -99064 -352932 -362971 -371157 -309756 -125041 55754
21771 55754 -8039 41963 -17714 10457 -30634 -14360 -140409 -49990 -13670 -54211 -12052
21760 -12052 -40628 -63749 -169732 -477926 -341081 12731 201782 228565 181703 86234 31121
21749 31121 -93926 -166361 -157558 -137616 -119034 7104 29160 70045 -54131 -113071 -37761
21738 -37761 -33021 -29708 -541 81561 -39920 -42336 132499 42589 -205017 -295845 -322736 -167493
21726 -167493 -11543 -64666 -55448 -76008 -206846 -180161 -12068 -80969 -185552 -272410 -268516
21715b68516L3964o091J10805J48086Q4047q7861k6081M3999l3072k6208j01666
21704a28594l4285j44711J09822k7423k2457j8243J90037Q4962j52885n7010l3149
21693b33936m6079J83000j1994r4162P1675Q6855j8731R7263N3069j38091o6397
21682a17528j93313J28030K35998n6681j27718J36088J26236K3485k0653K32981
21672C66925k03773j40830j2579L8088k2082j6670N4932k738o4502q1823P1855
21661a3197J8142j9133k4164M0667n0484R3146n8221l3050r5674n0375k0445O6515
21649a46273J4549L4768k23964j30380N7008J78375j34714j72571J34781J25641
21639b62780J40313j08861p3156J30867N4689L8821L4872j52003J0322J63762
$$ plain form
21715 -268516 -234552 -240643 -129838 18248 102295 14434 -11647 32352 -720 -26928 -128594
21704 -128594 -162879 -307590 -197768 -225191 -247648 -265891 -75854 9108 -143777 -200787 -233936
21693 -233936 -280015 -97015 -109009 -203171 -131496 -44641 -63372 33891 86960 -51131 -117528
21682 -117528 -310841 -182811 53187 -3494 -131212 4876 131112 154597 133944 366925
21672 366925 163152 22322 9743 47831 25749 9079 64011 61273 -3229 -85052 -13197
21661 -13197 4945 -14188 -38352 2315 -48169 44977 -13244 -46294 -141968 -192343 -212788 -146273
21649 -146273 -131724 -96956 -320920 -451300 -394292 -215917 -350631 -523202 -388421 -262780
21639 -262780 -122467 -231328 -304484 -173617 -118928 -80107 -45235 -197238 -186916 -23154
21629b3154J4074j55145q3141K6940J69227J25619j9200J7596J0863O6841J68281
21618C18801r2648j95879j50525r535k4094q0683k6286O8325J02694m5425m0821
21607a76076L7282l9279o9847J43640J05349m5541l1826m7045J07107J62275j32841
21596A3198J38507J02788o0547k6244k3287Q4577q8862j05561m9380j05739p9140
21585a99690L1738K26150K6490q0352o785N1069j75068N5450J8473J87167j6175
21574A18467j2526n1288j6421k9966j66187j32530j1926P7849J44118N5412j75363
21563b00361l83Q4811j6198p0280m4017o217J33655L8803n7106k8315N1354L7676
21551g6578m5525n4267K23026O7585k2793r8032m8949Q8581m1900o7120J42926
$$ plain form
21629 -23154 -9080 -164225 -247366 -220426 -51199 74420 55220 72816 83679 150520 318801
21618 318801 226153 30274 -120251 -129786 -153880 -234563 -260849 -192524 -89830 -135255 -176076
21607 -176076 -138794 -178073 -247920 -104280 1069 -44472 -76298 -123343 -16236 146039 13198
21596 13198 151705 254493 193946 167702 144415 228992 140130 34569 -14811 -120550 -199690
21585 -199690 -167952 58198 84688 4336 -2449 48620 -126448 -70998 -52525 134642 118467
21574 118467 105941 54653 38232 8266 -157921 -290451 -302377 -224528 -80410 -24998 -200361
21563 -200361 -200744 -115933 -132131 -202411 -246428 -252645 -118990 -80187 -137293 -165608 -114254 -76578
21551 -76578 -122103 -176370 46656 114241 91448 -6584 -55533 33048 -8852 -75972 66954
21540F6954q5467N9041K9315j4645R525l2291j58116j29708K35303O8671q0439
21529c1857N4065j07797k6012J43155j4199J1171L0263q93l0821j35408k9847
21518a38180J03273R8490J13904p1813j28761L4286o8429j96386o480P2715j06493
21507b93874n9231Q3040l235J42250L25489R279j38993m1882R3800j67170q6816
21496a37343O1767K1612Q0659M21N6649j18477k14998J21028J66191o4540k8116
21485e5147J4647j45210n6774k2538m2985R4648K5711j20882N1074K29616J07419
21474G9579o416J24123j90026o9839r0849K6632Q1731l3570q1098N6580R3859
21463i294k6554j31373k425k0723l96o8623n130m9260J40711J75691M138m5884
$$ plain form
21540 66954 -18513 40528 69843 55198 64723 32432 -125684 -255392 -20089 48582 -31857
21529 -31857 22208 -85589 -111601 31554 17355 28526 58789 57896 27075 -108333 -138180
21518 -138180 -34907 63583 177487 105674 -23087 11199 -57230 -253616 -260096 -187381 -293874
21507 -293874 -353105 -270065 -273300 -131050 194439 203718 64725 22843 116643 -50527 -137343
21496 -137343 -75576 -53964 26695 27116 83765 -34712 -249710 -128682 37509 -27031 -55147
21485 -55147 -40500 -185710 -242484 -265022 -308007 -213359 -187648 -308530 -257456 -27840 79579
21474 79579 73163 197286 7260 -62579 -153428 -126796 -45065 -78635 -159733 -103153 -9294
21463 -9294 -35848 -167221 -169646 -190369 -190765 -259388 -264518 -313778 -173067 2624 6762 -39122
21451c9122n0320J04430J11858j45929q505K02407q7513j33629m0028P2810J36536
21440A22995m6890j59386j9755K2560J84082M7444N5226k2980j12229o8146m4278
21429d1357J05885P5820J40108l1738q5863q1413K2735j17342k9922j60634m9386
21418b53107M6439o6851j9671O0717K27968L6167j17543q8898J41912R0100K9647
21407H6880r4001K1760q737J3421p5689Q758O9050M8122o5899r5782j52499l3273
21395b77889J44379K57731Q390k13397r7137J37786J56001L8312j72190n6342
21385g4356Q5320j8291p0358P4100o5536j65369j11328J3234P2356J4753J33640
21374a11835L0379J56243m5246j37263j1208K0427J06730l125P9386M7970j02794
$$ plain form
21451 -39122 -89442 14988 126846 -19083 -27588 174819 87306 -46323 -86351 -13541 122995
21440 122995 76105 -83281 -103036 -80476 103606 151050 206276 183296 71067 2921 -41357
21429 -41357 64528 140348 280456 248718 162855 81442 104177 -13165 -43087 -203721 -253107
21418 -253107 -206668 -273519 -293190 -232473 -4505 31662 -85881 -174779 -32867 57233 86880
21407 86880 -7121 14639 5902 19323 -56366 -47608 21442 69564 3665 -92117 -244616 -277889
21395 -277889 -133510 124221 132611 -80786 -177923 -40137 115864 154176 -18014 -74356
21385 -74356 10964 -7327 -77685 -3585 -69121 -234490 -345818 -332584 -260228 -245475 -111835
21374 -111835 -81456 74787 29541 -107722 -118930 -98503 8227 5102 84488 132458 29664
21363B9664j31007k12061P2403O044j3569Q7149Q5165m4163j84241o0766J14745
21352b50637O3750l6237k0451J80406J68341r8085k7371l7789K19070O7524k32736
21341d215j27730K9256K02593M4398j01824k03401O6693J44122j7447j2820k4022
21330d397n4875K6662p0183l6083o3625k1911M0912K4567O6593Q9934J51544R4784
21318B43922q6677j10047R2485m1363N8674P915J72005o7125P3203n8043k09634
21307G5315Q1264r7981j51792n4280J01875j59110l8251Q0243k6055M3635J77257
21296C2120P1070j21269p8245L691P1545J4207J65711J08812K3010L656j57922
21285A36386j49280N2993K7916o759j21070l4242l2500k5694P892J97641J13114
$$ plain form
21363 29664 -101343 -313404 -241001 -234957 -248526 -161377 -76212 -120375 -304616 -365382 -250637
21352 -250637 -186887 -223124 -243575 -63169 105172 7087 -20284 -58073 160997 228521 -4215
21341 -4215 -131945 -102689 99904 144302 42478 -160923 -94230 49892 32445 19625 -4397
21330 -4397 -59272 -32610 -102793 -138876 -202501 -224412 -183500 -158933 -92340 -2406 149138 243922
21318 243922 157245 47198 139683 98320 156994 164909 336914 269789 342992 284949 75315
21307 75315 156579 58598 -93194 -147474 -45599 -204709 -242960 -162717 -188772 -145137 32120
21296 32120 103190 -18079 -96324 -92633 -21088 -6881 158830 267642 290652 294308 136386
21285 136386 -12894 40099 68015 61256 -59814 -94056 -126556 -152250 -144358 53283 166397
21274A66397O6444j02672j83099L2578r430l9126q1909R6139K8185k4962J37486
21263H6031P7281o0670N0225o7101p0742j24330j41773o6685k081J04333k5637
21252b41149R0081J28006J3539L7165O3270O1595m0823N1439L8067j58363j44760
21241a01933J08524L0388k6276O4663Q0672p0474j3986N7629m9688k35616l0743
21230a86840p403k3964K0844O8597n090r5522o4009N9131J43190O7944R3616k5347
21218D5147J1996P5554R2396Q8556j94164p7902N5603l3511J11273l1205k34898
21207i1155p3811j2044J39273L1789j32961j43596r0888J91544K6631o0790J722
21196b14286P7487J39878O4189J9617p4729R0013P5724n2715n2267j9540j47667
$$ plain form
21274 166397 232841 130169 -52930 -20352 -29782 -68908 -150817 -54678 -26493 -51455 86031
21263 86031 163312 102642 152867 85766 15024 -109306 -251079 -317764 -319845 -215512 -241149
21252 -241149 -151068 -23062 -9523 27642 90912 152507 111684 163123 201190 42827 -101933
21241 -101933 6591 36979 10703 75366 156038 85564 71578 129207 79519 -156097 -186840
21230 -186840 -194243 -218207 -197363 -128766 -133856 -229378 -293387 -234256 -91066 -23122 70494 45147
21218 45147 57143 132697 225093 313649 119485 41583 97186 63675 174948 143743 -91155
21207 -91155 -164966 -177010 -37737 -5948 -138909 -282505 -373393 -181849 -155218 -216008 -214286
21196 -214286 -136799 3079 67268 86885 12156 102169 177893 125178 72911 53371 -94296
21185i4296r1250l6872q1949j6810N9630P2233K3713J88169J22124j59880l5028
21174e0216R843n8900k25j4290l1010l2915k0762J32201J62590l3669o7024P8548
21162G4171Q9872p1492j29770j35505O233J03558J08652J07732N5202r8726j66335
21151e6408k6328n4905J777Q7700m2613j5672J52138P8830k3772J22382J56467
21140C79596Q3942k01511k75189r8103R065J1730J89617K7466q2475k7917J230
21129A7451J46031J1451k70070q4857p865N8264n8J05346J08863q4360k74617
21118b74421N2839L4834j08641j45604N985J87893K21599j01721p2250P4806j02719
21107b27400J49185J01379K8584r0715j06368J7519P2677O7002J11773j15288
$$ plain form
21185 -94296 -185546 -222418 -304367 -321177 -261547 -189314 -165601 22568 144692 -15188 -50216
21174 -50216 -40373 -99273 -99498 -113788 -144798 -177713 -198475 -66274 96316 62647 -4377 74171
21162 74171 164043 92551 -37219 -172724 -166491 -62933 45719 153451 208653 109927 -56408
21151 -56408 -82736 -137641 -135864 -48164 -90777 -106449 45689 124519 100747 223129 379596
21140 379596 463538 262027 -13162 -111265 -102200 -90470 99147 126613 44138 16221 17451
21129 17451 163482 174933 -95137 -179994 -187859 -129595 -129653 -24307 84556 196 -274421
21118 -274421 -221582 -186748 -295389 -440993 -435008 -247115 -25516 -127237 -199487 -124681 -227400
21107 -227400 -78215 23164 51748 -38967 -145335 -127816 -55139 11863 123636 8348
21097H348j65649k27189J16656o0560L365J56123J482N1948J19614m6247P2128
21086C0019O9702L9602j46440m2320J01561k4522k43297j5461O2994J6796j11433
21075b62799q0364P767K3235L7215N3878M2222J66064j28943r8013R234Q0879
21064a49625J79869K18979L9167k69761p3633J5179j90081k22020L1948J72444
21054b47534K7015J58791J8335k483L7099j17737j73022L7564Q4213Q8767J38275
21043D9283K4763r1493j9228L8606O3283j34168j97594j40706l727K37513J7750
21032a55718j56012j5084O6174r810O0224R5040k655Q2577J52812m1484p3655
21021B409j42213p7675J49546J02383o9580P297J56235K2247j40135n6268j06009
$$ plain form
21097 8348 -157301 -384490 -267834 -328394 -325029 -168906 -167424 -115476 4138 -42109 30019
21086 30019 99721 139323 -7117 -49437 52124 27602 -215695 -231156 -168162 -151366 -262799
21075 -262799 -343163 -335396 -312161 -274946 -221068 -178846 -12782 -141725 -239738 -230504 -149625
21064 -149625 30244 249223 288390 18629 -55004 -39825 -229906 -451926 -419978 -247534
21054 -247534 -220519 -61728 -43393 -45876 -8777 -126514 -299536 -261972 -177759 -88992 49283
21043 49283 74046 -17447 -36675 1931 65214 -68954 -266548 -407254 -410981 -173468 -155718
21032 -155718 -311730 -326814 -260640 -270450 -210226 -115186 -117841 -35264 117548 76064 2409
21021 2409 -139804 -217479 -67933 34450 -35130 -27833 128402 150649 10514 -45754 -151763
21010a51763J32984o4837p3665m1648O5478j58504j46795J09815K12447J29502
21000A3014j73466j57316J05051K66905J73591J09399J5918o5340k23587j04979
20990d0810j49041N2991J29245j47184J7255K91161L5315K9247k00740r7214p7256
20979a57031m7310J81484P9177j2355j62310j5285q6494o3380K42358j5954j50943
20968b08043j32590j52336J38782J15725o351k2234J5164n9412N9969K00183J5025
20957c6118L8312R2378n8743j28298k7697J9697N2705J00544J17285J00783P3399
20946C44247k12306p6981o4751o9977N340J29227J38797M5329j0744k30553j87417
20935a89789j4488L20579K23823O156r7307o8224q8238r6888p0920K3686M908
$$ plain form
21010 -151763 -18779 -83616 -157281 -198929 -133451 -291955 -438750 -328935 -116488 13014
21000 13014 -160452 -317768 -212717 54188 227779 337178 353096 287756 64169 -40810
20990 -40810 -189851 -136860 -7615 -154799 -137544 153617 188932 218179 17439 -79775 -157031
20979 -157031 -204341 -22857 56320 43965 -118345 -133630 -220124 -283504 -41146 -57100 -208043
20968 -208043 -340633 -492969 -354187 -238462 -244813 -267047 -251883 -311295 -251326 -51143 -36118
20957 -36118 2194 94572 35829 -92469 -120166 -100469 -47764 52780 170065 270848 344247
20946 344247 131941 54960 -9791 -79768 -74428 54799 193596 238925 228181 -2372 -189789
20935 -189789 -204277 116302 340125 346281 248974 180750 92512 -4376 -75296 -51610 -46702
20924d6702j09121J43080J13255J2843O9261j16113o1814J14531q8566j76003
20914a45349k0257q1171K47495J12094q1859P9882k4906J1963q5527L2803r424
20903C5744m6770n9790J33254J15647j9836j42112j39207M8197k193N6343r0268
20892a10991p3935k8436n7101J17333J76007p7833j28736K00471J80279k33587
20882c6529j39925k2375r2584L9755J92021j15789j20436P1346K15789K78781
20872B70054N8072K5552r7487l30509o1423N1935L0989L6946N1907n1226n0272
20861f5462P4492J44921p190j53395k7228p9018j7055J18013k7034p7092N5891
20850f0157j58875P712l9365k8609Q6663J0237n0486R1867L72223M0345j90382
$$ plain form
20924 -46702 -155823 -12743 100512 113355 182616 66503 4689 119220 30654 -145349
20914 -145349 -165606 -246777 718 112812 30953 110835 85929 97892 12365 45168 35744
20903 35744 -11026 -70816 62438 178085 158249 16137 -123070 -74873 -77066 -20723 -110991
20892 -110991 -184926 -213362 -270463 -153130 22877 -54956 -183692 16779 197058 -36529
20882 -36529 -176454 -198829 -291413 -251658 -59637 -175426 -295862 -224516 -8727 270054
20872 270054 328126 353678 256191 -74318 -135741 -83806 -52817 -15871 36036 -15190 -65462
20861 -65462 9030 153951 146761 -6634 -33862 -112880 -129935 -11922 -38956 -116048 -60157
20850 -60157 -219032 -211320 -250685 -279294 -192631 -182394 -232880 -141013 231210 271555 81173
20839H1173K8109J49988q3743j86992j89560O6558O2424P9226o0525j58191j07546
20828c19079Q2576J40143K4132j58992j60240Q5516L0897k1750J73224R2857P5099
20817D4383M2812l8466k04216L6108J15898j40571J42533J81893k06871L1533
20807E036J53794J47479j7580j85264M045j53738L7387J43437R6154j4360q8063
20796A28327k33188k56588J47833J637m8984L7865R6480J09605r1816L1980K4997
20785e1852r3601P3192J33180J4089j8129n0591J29348j1786o668N6384R989j6509
20773A67046j14620j02437K2184L8475M6228J16175j7166j14309n1213j2438k1630
20762d3705j13666l437Q3061L0146R562k9538j06715j2221j63414j9721M8226
$$ plain form
20839 81173 109282 259270 175527 -11465 -201025 -134467 -72043 7183 -53342 -211533 -319079
20828 -319079 -236503 -96360 -72228 -231220 -391460 -305944 -275047 -296797 -123573 -30716 44383
20817 44383 87195 48729 -155487 -119379 -3481 -144052 -1519 180374 -26497 5036
20807 5036 158830 306309 288729 103465 107510 -46228 -8841 134596 230750 216390 128327
20796 128327 -104861 -361449 -213616 -211979 -260963 -223098 -126618 -17013 -108829 -76849 -51852
20785 -51852 -145453 -72261 60919 75008 56879 6288 135636 123850 117182 173566 183555 167046
20773 167046 52426 -50011 -27827 10648 56876 173051 155885 41576 -9637 -22075 -43705
20762 -43705 -157371 -160808 -77747 -47601 -38039 -67577 -174292 -186513 -349927 -369648 -321422
20751c21422R8111J1997N3052J13344J05979m2779o4800K7070l8422J3521M8575
20740D226J4326J4748j01208r5823K4099J9536O7956m2881O3743J40912l3884
20729G5750o2716q6084q7506o7946j48495j32444M1146N1330J95140J49857o4522
20718a36490P1580J4932j07071j37224p9691J4923K7508N7041J07327J53289o2546
20707g6422q6950M2260N3561J60561n7946j16157L5519J44300J2532o0631Q3313
20696A33940j1335m6320j11383k7991O1687l1960j34431J3130j16642j51358l7331
20685d59994J2657o5204J00120K3146J16672J36792N1012J3079J1336l550N7797
20674f137O4333J03601j15159j66233O1291p7292j30592k4221J36695Q1876K6791
$$ plain form
20751 -321422 -223311 -211314 -158262 -44918 61061 18282 -46518 -19448 -57870 -44349 4226
20740 4226 18552 33300 -67908 -163731 -139632 -120096 -52140 -95021 -31278 109634 75750
20729 75750 13034 -73050 -160556 -228502 -376997 -509441 -468295 -416965 -221825 -71968 -136490
20718 -136490 -64910 -49978 -157049 -294273 -373964 -359041 -331533 -274492 -167165 -13876 -76422
20707 -76422 -163372 -121112 -67551 93010 35064 -81093 -45574 98726 111258 50627 133940
20696 133940 122605 76285 -35098 -63089 -1402 -33362 -167793 -154663 -271305 -422663 -459994
20685 -459994 -447337 -512541 -412421 -389275 -272603 -135811 -84799 -71720 -60384 -63934 -6137
20674 -6137 58196 161797 46638 -119595 -58304 -135596 -266188 -290409 -153714 -71838 -45047
20663d5047k2837J34995R8171p3354J5081j29273j48883M9889j08836L6049J33480
20652f0565R7879j79006M7904J27334M7947j59498j3027r133l7329j67052M1668
20641b62878J63581m4748k6454m3991Q2216J00320k05114j45018j919J10034J19510
20630a54461J21304Q5164j5058R2120J07965m8759j79897j29712j0725J7002J723
20619a13334K8746J05963j56842L5796K4309j53584P52N3185l722m2139M1010
20608a79860J69956M4593P5343l3920K0587j59592p2899n6443N3440K4132l8444
20597a53107L0716O6222o2547q4121J96080N5347K2067j4653J32326r6785j09513
20586a7968p8926K42983P1883m5440K3906o6237r6212l5349o6654k33508k416
$$ plain form
20663 -45047 -67884 67111 165282 91928 107009 -22264 -171147 -121258 -230094 -194045 -60565
20652 -60565 37314 -141692 -93788 33546 81493 -78005 -91032 -100165 -137494 -304546 -262878
20641 -262878 -99297 -144045 -170499 -214490 -132274 -31954 -237068 -382086 -384005 -273971 -154461
20630 -154461 -33157 52007 36949 129069 237034 188275 8378 -121334 -132059 -115057 -113334
20619 -113334 -84588 21375 -135467 -99671 -75362 -228946 -228194 -175009 -178731 -220870 -179860
20608 -179860 -9904 34689 110032 76112 96699 -62893 -135792 -192235 -138795 -114663 -153107
20597 -153107 -122391 -56169 -118716 -202837 -6757 48590 70657 56004 188330 91545 -17968
20586 -17968 -96894 146089 217972 172532 196438 130201 33989 -1360 -68014 -301522 -303938
20575c03938J31692J35705j04867j7968O7671r0394j10209p4542K3346J35832
20565b07672K77228r1334j04021l8960J8786P9304J21240J84577L2826j2262o7722
20554A91990j17754j7268J5630K02724M6157m7725j15250P5308J29290j37443
20544B25659j115j06450j75126l9305K3656k05332L527K39319L1073r7508J205
20533a00397K11808j22511j82608l5362R6395l0973J71098M0981j22706P5135
20523H60J81505j07538K909J24033L2996k3746q5023j03256L1302q5503j12392
20512a43853J70277J45171j034R1042J22706J35564N2829q3223j89010j97751
20502A02718j7464J02809R7890Q0231l1384j14349r5415k09792J0877O007k5557
$$ plain form
20575 -303938 -172246 -36541 -141408 -159376 -91705 -182099 -292308 -366850 -343504 -207672
20565 -207672 69556 -21778 -125799 -164759 -145973 -66669 54571 239148 271974 259712 191990
20554 191990 74236 56968 72598 275322 321479 273754 158504 233812 363102 225659
20544 225659 224544 118094 -57032 -96337 -72681 -278013 -274486 -35167 -4094 -101602 -100397
20533 -100397 111411 -11100 -193708 -229070 -132675 -163648 7450 48431 -74275 860
20523 860 182365 74827 77736 201769 234765 211019 125996 22740 54042 -31461 -143853
20512 -143853 26424 171595 170561 261603 384309 519873 572702 489479 300469 102718
20502 102718 85254 188063 285953 366184 334800 220451 125036 -84756 -73879 -67872 -93429
20491i3429P0210J852m1474K553J10370N2275n1005p5004J01698P756J11685J10142
20479C07629O6768K6890R4835P8071N3369P2305j54854o6770J63087n2438J08690
20468F97582j15927j94633q1935j13279R3737J04855n0152j98271j54597M270
20458h350P6103M1381j3746L3454k349K084J1201j33941j84492N0486j2062j1856
20446a52087P7965l1084j99487M1371J67701j10223n0366P0247k2260J19322J24697
20435C5796O120J24145K4975M8303k4130k2502r6639l1862Q516j87697o5629j2112
20423a92716k4373J29255m611J50099k3311o127k6438K057p4743J23116L7892
20412I0100l1738K9288K0301L4358N7250j1889J09069Q5904M509J2045j06038
$$ plain form
20491 -93429 -23219 -21367 -62841 -60288 50082 102357 51352 -23652 78046 85802 197487 307629
20479 307629 374397 401287 496122 574193 627562 699867 545013 478243 641330 588892 697582
20468 697582 581655 387022 305087 191808 285545 390400 340248 141977 -12620 -8350
20458 -8350 67753 109134 95388 128842 126493 128577 139778 5837 -178655 -128169 -140231 -152087
20446 -152087 -74122 -105206 -304693 -263322 -95621 -205844 -256210 -185963 -208223 -88901 35796
20435 35796 41916 166061 191036 239339 215209 192707 96068 64206 72722 -114975 -180604 -192716
20423 -192716 -217089 -87834 -92445 57654 34343 28216 1778 3835 -70908 52208 90100
20412 90100 58362 87650 107951 142309 199559 187670 296739 382643 387152 399197 293159
20401B93159J26620k5701o8434l9979M9965K8940J24012l7040n6841m1833N1056
20390D03924l1149J00547j25329p8274J9147R1959q468j19139O2004J08192n6445
20379C66969j05266R9488J66758M0623j90137j74870j34931o4669J465R6779J9271
20368A21480n1354j8704P4010R0443q0786m0799j08821r8088R9513p5000k22995
20357c11101l7041j03460J26981K50930J81719J9661N4857j84244p5715J13119
20347C5706M0214j15377o9142J42525J10157L243r3836q6510l2858J89044j35445
20336a2279k64056M4447J30441l0239K7830R2288K0445l9104J1892p2020J097
20325h9258J25849l8111P8444L9736M0972Q2426J4403L992j67421j14802j1652
$$ plain form
20401 293159 419779 394078 325644 285665 335630 364570 488582 451542 394701 352868 403924
20390 403924 372775 473322 347993 269719 288866 380825 372357 253218 315222 423414 366969
20379 366969 261703 361191 527949 568572 378435 203565 68634 3965 5430 102209 121480
20368 121480 70126 51422 125432 215875 135089 94290 -14531 -112619 -13106 -88106 -311101
20357 -311101 -348142 -451602 -324621 -73691 108028 127689 182546 -1698 -77413 35706
20347 35706 75920 -39457 -108599 33926 144083 147326 53490 -33020 -65878 123166 -12279
20336 -12279 -276335 -231888 -101447 -131686 -103856 -11568 8877 -30227 -18335 -90355 -89258
20325 -89258 36591 -1520 76924 116660 157632 240058 254461 258453 91032 -23770 -35422
20314c5422J69526J32982N2506m3905J51085R1818j33427j58020O9987J23615
20304D20745k63618r2454L6932m5585j792J13770K51881L13251L41412J62365
20294A236907J61748J6524j75252J24602P320R1488j0214j30028l7248J45348
20284A431195J32033j06253j63189j39556j93524j12295k41831k14524j22575
20275B69481l13984j54908K23137r759J00732j1631k55468j38778K54388R4246
20265E7456k1761J6361o9028q5159l5412k0933k7826L6426K5233O750K66204J48965
20253B97276J9224k2512J3632j02551M3642Q3062n8218m0884l7297n9290m2750
20242I3334j21037j5552N8884J80261p810p9686N6768p581J13428K4415j03391
$$ plain form
20314 -35422 134104 267086 319592 275687 426772 518590 385163 227143 297130 420745
20304 420745 157127 64673 101605 56020 54228 167998 419879 733130 1074542 1236907
20294 1236907 1398655 1415179 1239927 1364529 1371849 1463337 1453123 1323095 1285847 1431195
20284 1431195 1563228 1456975 1293786 1154230 960706 848411 606580 392056 269481
20275 269481 -44503 -199411 23726 13967 114699 103068 -152400 -291178 -36790 57456
20265 57456 35695 52056 -16972 -102131 -137543 -158476 -186302 -149876 -124643 -117893 148311 297276
20253 297276 316500 293988 307620 205069 248711 331773 273555 232671 195374 136084 93334
20242 93334 -27703 -43255 15629 195890 188080 108394 165162 157581 271009 295424 192033
20231A92033J0477J2489O5294O3509j28011j05650J5069J80630J8013j13213k13450
20220b810j7860l8271N2329J5445N7721k6871l0765J07790J6575j30669J12020
20209A14634J92892J04164j52219j17755r2849J9710R7902R9912j9783o3663k19219
20198c6274j22291J21225k9142J99937J83595l3629l0942m9168J67757J87576
20188E58644K493l992k4098n1733P3355p1351j11934k8184J93838r2121k53582
20177A91335o2827J29475J78976L4798m2504l9599q7670k9141q1436K8843N1208
20166B71458r1104r1645J11858k5299o1922L756m8304j40369M9297N637P4136
20155E7499l6474R2188K79459J37590p0126K58642L46900J6555N7462J56187K8589
$$ plain form
20231 192033 202510 214999 280293 343802 215791 110141 125210 305840 323853 210640 -2810
20220 -2810 -20670 -58941 -6612 8833 66554 39683 8918 116708 133283 2614 114634
20209 114634 307526 411690 259471 141716 48867 68577 166479 266391 246608 182945 -36274
20198 -36274 -158565 -37340 -66482 133455 317050 283421 252479 203311 371068 558644
20188 558644 561137 557145 533047 481314 554669 483318 371384 343200 537038 444917 191335
20177 191335 128508 257983 436959 471757 429253 389654 301984 272843 191407 220250 271458
20166 271458 180354 88709 200567 175268 113346 117102 68798 -71571 -22274 -16637 57499
20155 57499 21025 113213 392672 530262 460136 718778 1065678 1082233 1139695 1295882 1324471
20144A324471P4123J04578L34846N93982L72369n1447j05476j57349l44694m52108
20134A693295l00385j59732J99539K21975o9903j06655n3452j76677j96662l15616
20124G35727n1546j19039k54284j11684P3475J5918o4031J5450M7352N835q6574
20113B06599p664L0997n5873j14983j27267r9539J47926J82664q7460p7497J5983
20102A3886N4976r0647K1335J0408O3991r9296m0035N9300J29662J22376K8996
20091B74952J0145q2621N8504J32522N0074j83929k0327n6092k69315j26645K2951
20080a89781Q7075O5988K20627J72423M6985k09109r7024k22121j22043J72833
20070g4147o425r486P1643K00443J23615r643q8518j27454l0225k6709N783J05560
$$ plain form
20144 1324471 1398594 1503172 1838018 2432000 2804369 2752922 2647446 2490097 2145403 1693295
20134 1693295 1392910 1233178 1432717 1654692 1584789 1478134 1424682 1248005 1051343 735727
20124 735727 684181 565142 310858 199174 272649 288567 224536 239986 287338 293173 206599
20113 206599 198935 229932 174059 59076 -68191 -167730 -19804 162860 75400 -2097 13886
20102 13886 68862 -21785 -450 9958 73949 -25347 -65382 -6082 123580 245956 274952
20091 274952 285097 202476 260980 393502 443576 259647 239320 183228 -86087 -212732 -189781
20080 -189781 -102706 -36718 183909 356332 403317 194208 97184 -124937 -246980 -74147
20070 -74147 -80572 -90058 -18415 182028 305643 296000 207482 80028 49803 23094 28877 134437
20058A34437K4762K13134J41476L5613j51168k08807P5966L2838m1494r7395R9071
20047B58433Q714J04445K2341q5144j24342j00907J54605K72666j07813j20156
20037B82842L040P340n814L1316O6199o4976k04912j19668R939O7148N8963l4685
20025I6732p0327J78736Q635J816q9943J8523j729o6747N500m4749K6120Q6563
20013A49130J08908q255k8949P4805O850Q9723p198j10353o9635O9188Q2440K389
20001C59043M5671o2265j35850o9167n7001K3890j08676j99580J75582J00783
19991G2430p8343m3219q2401r6916o431J76620J53213k8060K1330j22762P208
19980b7331M1272P2828j915m2492o5272R4549J42814J61417q7164j89571r9157
$$ plain form
20058 134437 159199 372333 513809 549422 398254 189447 265413 298251 256757 159362 258433
20047 258433 267147 371592 393933 308789 184447 83540 238145 510811 402998 282842
20037 282842 285882 293222 287408 318724 384923 319947 115035 -4633 5306 72454 131417 96732
20025 96732 26405 205141 213776 215592 125649 144172 142443 75696 81196 36447 62567 149130
20013 149130 258038 249783 220834 295639 302489 392212 385014 274661 205026 274214 356654 359043
20001 359043 404714 342449 206599 137432 80431 104321 -4355 -203935 -28353 72430
19991 72430 -5913 -49132 -131533 -228449 -234880 -58260 94953 66893 88223 -34539 -27331
19980 -27331 13941 86769 84854 42362 -22910 71639 214453 375870 288706 99135 -22
19969b2P1388j1205J84723N734M4453j03958J4107m0715P9027M743q3610j12284
19957E2381j32399r7861R1640R8171N523p1388l6393N2001N7281M7929j98378
19946a31493j37797J32967J99240L8872J9919k0963N4124m995j7043k1103k6697
19935H5031o5247p0290q8108q5565J1559j54880q1776J27551K97413L06230J29491
19924D11409K5247j42129j89377M8005K46743l4863R9512O4957N449L4904n4500
19913E15357r0827l367Q6431j97643j13901N9061J77057J7797j13507p4336J46954
19902D09076J13519j00745k43750n1848Q8581J92164K28867K7645j95249j30242
19892C38018N0951p4033j7556l9194o9462m329k1682j04401j3140l9117J11009
$$ plain form
19969 -22 71366 60161 244884 250618 295071 191113 205220 164505 243532 248275 164665 52381
19957 52381 -80018 -177879 -86239 11932 17455 -53933 -90326 -38325 18956 66885 -131493
19946 -131493 -269290 -136323 62917 101789 121708 100745 154869 149874 132831 111728 85031
19935 85031 19784 -50506 -138614 -224179 -212620 -367500 -449276 -321725 -24312 281918 411409
19924 411409 436656 294527 105150 153155 399898 365035 464547 529504 534953 569857 515357
19913 515357 424530 421163 507594 309951 196050 255111 432168 449965 336458 262122 409076
19902 409076 522595 421850 178100 126252 214833 406997 635864 663509 468260 338018
19892 338018 388969 314936 297380 258186 188724 184395 162713 58312 45172 6055 117064
19881A17064R154m28n9216j44361j272R5420j47515K7092J5949r089K61047J74357
19869C38202j03807j69698j8584K3099o1636N6781J71862J14164M7344o5901r3456
19858B38370K71281Q8692M0024o9333j9665p5595k4663J81556n9483J01568P9363
19847G52115J93057J09114r8648k21000Q1259K15502K02931n6488Q3930L5315
19837A297087O8025K6790J18214J05050j3408R5451p8054j31150j40086L1361
19827A379280J887P5693J0158o3418L0242N8764l1609J53670K17294J83053Q5150
19816B100164J68729J26619L15576M25392M25763M43975O11294P08359N98881
19807E924752N81343O34632O18221P20743P67130R06951R98767J278751J503398
$$ plain form
19881 117064 126218 125790 66574 -77787 -79059 16361 -131154 -104062 -88113 -97202 163845 338202
19869 338202 234395 64697 46113 69212 7576 64357 236219 350383 397727 331826 238370
19858 238370 509651 598343 638367 569034 549369 473774 449111 630667 571184 672752 752115
19847 752115 945172 1054286 955638 734638 815897 1031399 1234330 1177842 1261772 1297087
19837 1297087 1365112 1391902 1510116 1615166 1601758 1697209 1619155 1488005 1347919 1379280
19827 1379280 1381167 1456860 1467018 1403600 1433842 1492606 1460997 1614667 1831961 2015014 2100164
19816 2100164 2268893 2395512 2711088 3136480 3562243 4006218 4617512 5325871 5924752
19807 5924752 6506095 7140727 7758948 8479691 9246821 10153772 11152539 12431290 13934688
19798A3934688J858696K198159K736900L823551N212259Q436533J4199015K3748421
19790G6148222L5602934M1360046L6286660K4000428J4595330J0869628P624943
19783B46488191j181177j0397298j1726606j369401R216022J1285355O460427
19776B48775513J445338p86754n246413j6981433l1146508m0671056l9829076
19769A15559611l2096477k2341865j3919054q655713o061706m317986l217703
19762B4949107k398926k198975j824595j605050j292571j072307r98542q04714
19754A2753427o19016p96896q63508j059966r01923q45897n27466o47365o51888
19745E839502m78863l34844j29529j91918m80709k60151j56392j07814l07148
$$ plain form
19798 13934688 15793384 17991543 20728443 24551994 29764253 38200786 52399801 76148222
19790 76148222 111751156 153111202 189397862 213398290 227993620 238863248 246488191
19783 246488191 245307014 234909716 223183110 221813709 231029731 242315086 248775513
19776 248775513 250220851 249434097 244187684 227206251 196059743 155388687 115559611
19769 115559611 83463134 61121269 47202215 38546502 32484796 28166810 24949107
19762 24949107 22550181 20351206 18526611 16921561 15628990 14556683 13558141 12753427
19754 12753427 12134411 11337515 10474007 9414041 8512118 7666221 7138755 6491390 5839502
19745 5839502 5360639 5025795 4896266 4704348 4223639 3963488 3807096 3699282 3392134
19736C392134j02043k11602j45239j19638k81023q7036L1393j08921p6601l2807
19726B258617Q0529J41213j89682j70739k07011o0291j71301j29829j73926r8354
19716A279226r5186K2005j0713p822O9251J0420k8159J04176j45077k25537j24463
19705H48121K689n1270n2550m2709P2947j2280j0848K0774M7761M7552J02518
19694I72705R1215k1160J57021O1947K399M3061N1496j26284K9858j18984o2211
19683A081063O1393p484P8463j22068q1315K3659j53485j58397k9042J24633J36040
19672I53460l8381m779j01027k10370k1735K03210K5431L4556k2217J0328J01803
19661I30279l357j04915r8325p5050q0337J17697l7548j11483K5273J76918J41779
$$ plain form
19736 3392134 3290091 3078489 2933250 2813612 2532589 2445553 2476946 2368025 2291424 2258617
19726 2258617 2339146 2480359 2290677 2119938 1912927 1852636 1681335 1551506 1377580 1279226
19716 1279226 1184040 1206045 1195332 1187510 1256761 1267181 1239022 1343198 1198121 972584 848121
19705 848121 850810 799540 746990 704281 777228 764948 754100 774874 822635 870187 972705
19694 972705 1063920 1042760 1199781 1261728 1264127 1307188 1358684 1232400 1262258 1143274 1081063
19683 1081063 1142456 1134972 1213435 1091367 1010052 1033711 880226 721829 692787 817420 953460
19672 953460 915079 910300 809273 598903 577168 780378 805809 840365 818148 828476 930279
19661 930279 926922 822007 723682 648632 568295 685992 648444 536961 562234 739152 880931
19650H80931Q5478R067N7683o3715n5688q1040l3315L9417l5133N7472M2593j16396
19638G87354K1955N5185m8718j35506k99893M9690J43347m6699j32869J28668
19628E22514K8975L12360J65779J06107Q9008j31337p7892r6717j90146j6756
19618G11895J83163p9219Q390n949J45572k8597k22929j50864K0194j3848J2620
19607E80428J24133p0635j9353J39502J12228r5291k46205k1666k9064q9313J89756
19596E74520J00254n3367R4287J46444m4333j85044k3280L0747j47542j35854
19586C56832j94166o8937j06063k02J82463O9158j7445J83039J00037r1817Q7906
19575E00805J12889K78141J93065K29477N6865R5768L5444m9436J04607J89898
$$ plain form
19650 880931 966409 975476 1033159 969444 913756 832716 799401 838818 803685 861157 903750 787354
19638 787354 809309 864494 815776 680270 380377 430067 573414 526715 393846 522514
19628 522514 551489 863849 1029628 1135735 1224743 1093406 1015514 918797 728651 711895
19618 711895 895058 815839 824229 818280 963852 935255 712326 561462 581656 567808 580428
19607 580428 704561 633926 614573 754075 866303 771012 524807 503141 474077 384764 574520
19596 574520 674774 621407 715694 862138 817805 632761 609481 640228 492686 356832
19586 356832 162666 93729 -12334 -12536 169927 239085 221640 404679 504716 412899 500805
19575 500805 613694 891835 1084900 1314377 1371242 1467010 1502454 1453018 1557625 1747523
19565A747523K27693L06180L70701K85584K08517J68283J00279k43275j53576
19556C017909L2515o029j17307k22494k32495m8999J6998j12348j34971j78046
19546B014733l03719k39057l39527k12455o9296L264K32141l4170m8986q7335
19536I15593j03682J03729K78453P4568P4099n9077K02686L26773M21106P16273
19526B950521J247329J964250J897618J430145R69489O85556M53387M18869L191
19517A2020355m64178m51513O9286M18458K54644k287n0239j03024j77728p71181
19507A0742593j438471k032025j947313j435159j132625r35081m74633K3508L599
19498A374393n3964m5140q0856j28632K8527L6437m2232j84104j57515K9483o7337
$$ plain form
19565 1747523 1975216 2281396 2652097 2937681 3146198 3314481 3414760 3171485 3017909
19556 3017909 3050424 3044395 2927088 2704594 2472099 2423100 2440098 2327750 2192779 2014733
19546 2014733 1711014 1471957 1132430 919975 850679 853943 1086084 1051914 1002928 915593
19536 915593 811911 915640 1194093 1268661 1342760 1283683 1486369 1813142 2234248 2950521
19526 2950521 4197850 6162100 8059718 9489863 10459352 11144908 11598295 12017164 12020355
19517 12020355 11556177 11104664 11173950 11592408 11847052 11844765 11794526 11691502 11513774 10742593
19507 10742593 9304122 7272097 5324784 3889625 2757000 1821919 1347286 1370794 1374393
19498 1374393 1320429 1275289 1194433 1065801 1094328 1130765 1088533 904429 746914 776397 709060
19487G09060k05860K6996K21453J8676k72687k11048L5431J06789M6105o5495
19477D09420n7924R21r4000m567J96442J57151j16755j72770K0517o7982q3840
19466A86613J18962r2189M2013P8757p6262n9799O0336J08344J06293K12447Q2303
19455G67818Q092j99579j30448q6708l6667k06088o5388J95407M0265r791Q6235
19444C63148J43841q3794j98370j38384J41605J94449O2179p2009j37729K3325
19434B98261J89227o6353j70435j38861l2553L9334K383k3964J04842r789j66051
19423B6041Q3224k840j7867o7936P9993K20888L9497j85497M0844L7553m2358
19412B11542M8940K3818j338j01169J5927K5866J32316m6796m6714K01788N1769
$$ plain form
19487 709060 503200 530196 751649 770325 497638 286590 322021 428810 474915 409420
19477 409420 351496 352417 258417 253850 450292 607443 490688 317918 338435 270453 186613
19466 186613 305575 213386 255399 334156 257894 198095 258431 366775 473068 685515 767818
19455 767818 775910 576331 445883 359175 322508 116420 51032 246439 286704 276913 363148
19444 363148 506989 423195 224825 86441 228046 422495 484674 412665 274936 298261
19434 298261 487488 421135 250700 111839 79286 118620 121003 97039 201881 192092 26041
19423 26041 109265 106425 88558 20622 100615 321503 361000 175503 216347 253900 211542
19412 211542 260482 284300 282962 181793 197720 223586 355902 309106 262392 464180 515949
19401E15949J05847j4065o6628m4041p9992l5927M2723J68663M5348j32168k9501
19390D76208n6308j02445l4872J4384q622N6051M7605Q280J05778J0657R5187
19379F11903j15391j1083Q1352p4530M9052J58076l8407N8689J40586K01994K17003
19368A279244J52894K61290K48943K16216J53318J96509K29843p1914j41533j69426
19358B355384J4675o8001O021J02723J63315J2816P8902R1474P7173O9032j81742
19347B721772k40078M5272J83869J55409K69738L01226M09738L56763K28623K75797
19337D708129L25018M93481M36080P62931R56149J006061J400039K239571L598081
19328A5925540O225580J0441259J4437655J3257811J1430894J6459005K0451797
$$ plain form
19401 515949 621796 607731 541103 497062 417070 381143 423866 592529 637877 505709 476208
19390 476208 419900 317455 282583 296967 288345 344396 392001 400281 506059 516716 611903
19379 611903 496512 485429 566781 492251 541303 699379 660972 719661 860247 1062241 1279244
19368 1279244 1432138 1693428 1942371 2158587 2311905 2508414 2738257 2666343 2524810 2355384
19358 2355384 2370059 2302058 2308079 2410802 2574117 2586933 2665835 2757309 2834482 2903514 2721772
19347 2721772 2481694 2526966 2710835 2866244 3135982 3437208 3846946 4203709 4432332 4708129
19337 4708129 5033147 5526628 5962708 6725639 7681788 8687849 10087888 12327459 15925540
19328 15925540 22151120 32592379 47030034 60287845 71718739 88177744 108629541
19321A08629541J7513033Q217408K212770M149415J277675p013258j4759440j6919209
19313A03307935j3865415j4294389j5117433j3446210j2166961q840698n490419
19306B0086410l687395k322881j743516j423897j011087n58662l60555k97325
19298H681092l09644l91129l55164l04825j9020o7854M0651M51686M36815P2221
19288H234829O7874L17371L28044K08259K14639P41491P17213P81108J227133
19279A2837961J862551K635300L626134N717498R655772J6396006K3394864K1933029
19271I8059115J8716993K6176037L2993829K9275130J5076158M166257P479659
19264B31943178M638449r020601k2882032k7805034k3235966k2143191k3606554
$$ plain form
19321 108629541 126142574 134359982 136572752 140722167 141999842 134986584 120227144 103307935
19313 103307935 89442520 75148131 60030698 46584488 34417527 25576829 20086410
19306 20086410 16399015 14076134 12332618 10908721 9897634 9338972 8978417 8681092
19298 8681092 8371448 7980319 7625155 7320330 7301310 7233456 7274107 7725793 8162608 8234829
19288 8234829 8302703 8620074 8948118 9156377 9371016 10112507 10829720 11610828 12837961
19279 12837961 14700512 17335812 20961946 26679444 36335216 52731222 76126086 98059115
19271 98059115 116776108 142952145 175945974 205221104 220297262 224463519 231943178
19264 231943178 236581627 227561026 204678994 176873960 153637994 131494803 107888249
19257A07888249k2346829k0716984j6129606j0336654o505617m807817l756213
19250B3288529l230463k812595j927070j274042r20430j093261j021889p19619
19242A0289160m90031n51254r51122o99699n67761m82587m31271k53284l43161
19233E518990k85449l5704l4405J89099K06568J09471l7698Q4573P1395J801k13609
19222E575032l24369l99168j68175J30345L49796O27702O79290O49391M39420
19213G559264O40844Q69594J336605J418860O08632K86001Q07087J459196J354700
19204A6340783m29560j623735j698589j171069o35196j094944j377490j411993
19196F898207j302387r81556p69761o38293l99561k38347l7480K8570k5229j77988
$$ plain form
19257 107888249 85541420 64824436 48694830 38358176 31852559 27044742 23288529
19250 23288529 20058066 17245471 15318401 14044359 13123929 12030668 11008779 10289160
19242 10289160 9799129 9247875 8296753 7597054 7029293 6546706 6115435 5862151 5518990
19233 5518990 5233541 5197837 5163432 5352531 5559099 5668570 5630872 5715445 5786840 5788641 5575032
19222 5575032 5250663 4851495 4683320 4813665 5163461 5791163 6470453 7119844 7559264
19213 7559264 8200108 9069702 10406307 11825167 12433799 12719800 13526887 14986083 16340783
19204 16340783 15911223 14287488 12588899 11417830 10782634 9687690 8310200 6898207
19196 6898207 5595820 4614264 3844503 3206210 2806649 2568302 2530822 2559392 2534163 2356175
19186B356175j39351j7042N6211P5613p234k1108r9309j819K00487J92404N5203
19175B650230K54382P50299N72640K34728J13719J43187Q5940l17872k82659r4295
19165D110299j5963N293M9871Q8085r9248j6070J56516N9031k73606l04166m2905
19154C717137Q1929j77197k51123j37421j55977j86148q37k2334N233R9547r8375
19143B874434L9198J42799j55032Q8325L49064L04511J53196L8150L5603m7045
19133C823203r6190J00279J63186K56506M32344P49408O83350O32560P13145M64943
19123G922734M58934M64247O46089P86642R75559R34076Q92931R16292J580712
19114A5578216K103205K707209M144744P056749J2456287K1787274L3360094L6879078
$$ plain form
19186 2356175 2216824 2199782 2255993 2331606 2324372 2303264 2203955 2202136 2402623 2595027 2650230
19175 2650230 2904612 3654911 4227551 4462279 4575998 4719185 4805125 4487253 4204594 4110299
19165 4110299 4094336 4099629 4149500 4237585 4138337 4122267 4278783 4337814 4064208 3760042 3717137
19154 3717137 3799066 3621869 3370746 3233325 3077348 2891200 2890363 2868029 2873262 2972809 2874434
19143 2874434 2913632 3056431 2901399 2989724 3338788 3643299 3796495 3834645 3870248 3823203
19133 3823203 3727013 3827292 3990478 4246984 4679328 5428736 6112086 6744646 7457791 7922734
19123 7922734 8381668 8845915 9492004 10278646 11254205 12188281 13081212 13997504 15578216
19114 15578216 17681421 20388630 24533374 31590123 44046410 65833684 99193778 136072856
19106A36072856K7448309J7667226P142646j1488192k4131589k4437804j6328394
19099A11945058L30208J8973430K5885404J8530971J0468346l90148j8984626
19092A66758643l1212425l2645485k8818053k0592708j2573434p515461m551047
19085B8850030l291665k626194k393659k031965j741134j646377j576548j180308
19077A2362180p70376n28075j73053n2914m2287k12779m01462o63360o75075l28906
19067H513893k1599M71979P53259O43518N25610Q14100R94022J674669K467226
19058A6836677L928160P108237J2412121J9505956K2816210J7670538J1560292
19051A11838191N596637n794881j4551966j5416794j0974526j336830J0613478
$$ plain form
19106 136072856 163521165 181188391 188331037 176842845 152711256 128273452 111945058
19099 111945058 112275266 131248696 157134100 175665071 186133417 185743269 166758643
19092 166758643 135546218 102900733 74082680 53489972 40916538 33401077 28850030
19085 28850030 25558365 22932171 20538512 18506547 16765413 15119036 13542488 12362180
19077 12362180 11591804 11063729 10890676 10837762 10795475 10582696 10181234 9517874 8842799 8513893
19067 8513893 8492294 8964273 9717532 10361050 10886660 11700760 12694782 14369451 16836677
19058 16836677 20764837 27873074 40285195 59791151 82607361 100277899 111838191
19051 111838191 117434828 111639947 97087981 81671187 70696661 69359831 79973309
19044G9973309J6044678J2039090O722239R20472j0434808j9025841k0183473
19037F6055666j8267617j3679390q407023m974827k895555j817500j676949j509831
19029A2826974j250957j169338j075955q97135o30355k34863j11621l61012l33211
19020F762527k62042q2062j88453k93580k06932l29588l12747j77211r7382k66393
19010D546137j74901q1864j45219k21408k4064j09078k07441j12478o8394k3674
19000C377616p5261k19584j82130J36089R0925m0663J55627N9675K85999L22687
18990C910980L10936K49866J65122J62832J13310p7054k0357L3528o8857j45156
18980D635150k06766k53427k17424j65255m0716p6804l21973l65370l23727P5736
$$ plain form
19044 79973309 96017987 108057077 114779316 115699788 105264980 86239139 66055666
19037 66055666 47788049 34108659 25701636 20726809 17831254 16013754 14336805 12826974
19029 12826974 11576017 10406679 9330724 8433589 7803234 7568371 7456750 7095738 6762527
19020 6762527 6500485 6418423 6229970 5936390 5729458 5399870 5087123 4909912 4812530 4546137
19010 4546137 4371236 4289372 4144153 3922745 3898681 3789603 3582162 3469684 3401290 3377616
19000 3377616 3302355 3082771 2900641 3036730 3127655 3086992 3242619 3302294 3588293 3910980
18990 3910980 4221916 4471782 4636904 4799736 4913046 4835992 4815635 4849163 4780306 4635150
18980 4635150 4428384 4174957 3957533 3792278 3751562 3674758 3352785 2987415 2663688 2739424
18970B739424M2102K4930J64022q962p8294p2180j49295k78360k61027r8297k61154
18959A762909k55855l9124J21270J90562O2438m3801R9408K30623N6000p1887
18949B112543j87139k7132k23582k83105j7796m1289q5620j17617r2971M8807
18939A085099j05831O656K45221J33061O5888N2891m1655j33571J07594R0828
18929A506181j73459j63082o4987p2795o4765o3432k4k5373n5978R5017l5539
18918H81764R6524J18038P3198J1139p3376j16273R4332J89226M9346l3717K8990
18907A319191j03758n396J0772j75417n1642J1923k4445L0952J40629j3097m8172
18896A091540O3757P6056L2252L4516R4696K35645K36797J59790L0821J06283
$$ plain form
18970 2739424 2781526 2806456 2970478 2961516 2883222 2811042 2661747 2383387 2122360 2024063 1762909
18959 1762909 1507054 1467930 1589200 1779762 1842200 1798399 1897807 2128430 2184430 2112543
18949 2112543 1925404 1898272 1674690 1391585 1373789 1332500 1246880 1129263 1036292 1085099
18939 1085099 979268 985924 1231145 1364206 1430094 1482985 1441330 1307759 1415353 1506181
18929 1506181 1332722 1169640 1104653 1031858 967093 903661 903637 878264 822286 917303 881764
18918 881764 978288 1096326 1169524 1180663 1107287 991014 1085346 1274572 1323918 1290201 1319191
18907 1319191 1215433 1210037 1220809 1045392 993750 1005673 981228 1012180 1152809 1139712 1091540
18896 1091540 1155297 1231353 1263605 1298121 1392817 1628462 1865259 2025049 2055870 2162153
18886B162153m2845J2773L8275j39238j04081k09890k81230j63057j07361j35428
18876A030071j22657j85056O034J14382K80305M7474q4273k7889o7100l8730j15877
18865H36684K5878n6237l1696l5392k4252M5005J23600j05238j54689n333Q883
18854F27213Q6476J53300R3174j10119J1539l9358K4238J25786Q2432l9330q721
18843A006630M5240K1242K2896K09903L06956N24289Q89550R39434M66116J16753
18833D549009R669k31007l68229m29848n12863k36766j21405k99464l43100k03300
18823A812696k8598j51844j71079j35551l6574j02289l09106j16666J24179N2944
18813I38112J2656K3631j14059n5981k9258q2558M7371j0813q0533P803n5693
$$ plain form
18886 2162153 2119308 2132081 2170356 2031118 1927037 1717147 1435917 1272860 1165499 1030071
18876 1030071 907414 722358 728392 842774 1123079 1170553 1086280 1058391 991291 952561 836684
18865 836684 862562 806325 774629 739237 714985 759990 883590 778352 623663 618330 627213
18854 627213 713689 866989 960163 850044 861583 822225 846463 972249 1054681 1015351 1006630
18843 1006630 1051870 1073112 1096008 1305911 1612867 2137156 3026706 3966140 4432256 4549009
18833 4549009 4558678 4327671 3959442 3529594 3016731 2779965 2658560 2359096 2015996 1812696
18823 1812696 1784098 1632254 1461175 1325624 1289050 1186761 877655 760989 885168 938112
18813 938112 950768 974399 860340 804359 775101 692543 739914 729101 648568 656371 600678
18802F00678O3649J03654p865J99261J39245m2629J20815K24684L54575J55304
18792A911371K85229J32741M6582L8662j2880q7541M24992O42488N41292L95686
18782D318622K27738J32407l01087p11675p12163p90725o48188j71002r7820Q6545
18772A332652o5246K0354Q0387K81595N29518N41300O5489l33042o45791n77028
18762A230188j69846Q4792m8967k11395j15552p9642p6813R5413P4292m9276r7292
18751F35902J62174m2918j35482r7934N6365J01769J77479R0916j01606O9456
18741I16121J60031Q3248J29279R4975L5431M4961Q094j71484n8877O5475K5551
18730A332805k0259j91585k0736M1832j30099j33770j95979N1518J10027o5904
$$ plain form
18802 600678 664327 767981 760116 959377 1098622 1055993 1176808 1401492 1756067 1911371
18792 1911371 2196600 2329341 2375923 2414585 2401705 2314164 2739156 3381644 3922936 4318622
18782 4318622 4546360 4678767 4377680 3666005 2953842 2163117 1514929 1343927 1246107 1332652
18772 1332652 1267406 1287760 1368147 1649742 2179260 2720560 2786049 2453007 1807216 1230188
18762 1230188 1060342 1145134 1096167 884772 769220 689578 612765 708178 782470 733194 635902
18751 635902 798076 755158 619676 521742 578107 679876 857355 948271 846665 916121
18741 916121 1076152 1159400 1288679 1383654 1419085 1464046 1472140 1300656 1241779 1307254 1332805
18730 1332805 1312546 1120961 1100225 1142057 1011958 878188 682209 733727 843754 777850
18720G77850r6344n2369M6443o0349K09790J03319K8344j38393j85353j17468
18710E15470L6591n3572K4770J5511m1096l0853Q2286J81140J37938O0907r4988
18699H34104j03803J8161J23072L1474r4017r9154K05715J86809J79322J55697
18689A437380K22303M8475J06526K97418P95578J379680K318998K410867J800721
18680A0817946J266821P18504n56101j797556k253044k189982j648383r62680
18672C395525o48383m11692l35353l27570m8249l0823J25p2506J23227P7936J29293
18661A851530J24725J17977J3151J62216L86862L75459M91436J94044K94884J33859
18651D146143L25168J034270J922854L004423L080151K349048J733209R33325
$$ plain form
18720 777850 681506 629137 675580 615231 825021 928340 956684 818291 632938 515470
18710 515470 552061 498489 523259 538770 497674 466821 549107 730247 868185 929092 834104
18699 834104 730301 748462 871534 903008 808991 709837 915552 1102361 1281683 1437380
18689 1437380 1659683 1708158 1814684 2112102 2907680 4287360 6606358 9017225 10817946
18680 10817946 12084767 12803271 12247170 10449614 8196570 6006588 4358205 3395525
18672 3395525 2747142 2335450 2000097 1672527 1624278 1593455 1593580 1521074 1644301 1722237 1851530
18661 1851530 1976255 2094232 2107383 2269599 2656461 3031920 3523356 3717400 4012284 4146143
18651 4146143 4471311 5505581 7428435 10432858 13513009 15862057 17595266 18528591
18643A8528591o18967k144963k576198k200025j439334n87146Q5728L94837J008689
18634A0451212J550560K301065L174895M341162O476366J0885620K0109187L4499290
18626I3789357M6141298L9231236K4157842J2838057p989050l1407807l9917080
18619A36843853l8354290l1424493k0212247j1852515p104395m411874k796672
18612B0687367k001495q64229M21090J535268K040199J409547P33516L27022o64732
18603B3623553j095628o63181J62570J625387L368918M801826N899775Q250876
18595D5974096J2601160K0684747L6718891O1371168P3559037N6616768L3790089
18588C41315956J3271364k5034995n8562344o6742710o1277385m6356501k8848522
$$ plain form
18643 18528591 17909624 15764661 13188463 10988438 9549104 8961958 9047686 9442523 10451212
18634 10451212 12001772 14302837 17477732 21818894 28295260 39180880 59290067 93789357
18626 93789357 139930655 179161891 203319733 216157790 208168740 176760933 136843853
18619 136843853 98489563 67065070 46852823 35000308 27895913 23484039 20687367
18612 20687367 18685872 17821643 18242733 19778001 21818200 23227747 23961263 24288285 23623553
18603 23623553 22527925 21864744 22027314 23652701 27021619 31823445 37723220 45974096
18595 45974096 58575256 79260003 115978894 177350062 250909099 307525867 341315956
18588 341315956 354587320 329552325 270989981 204247271 142969886 96613385 67764863
18581F7764863j7035389j0477538o909430n137338l965585l005572k068729j304778
18573A7860504j002853r04768j089657r97686j164470j235001r85564p59104p14986
18564I006415o64897n92679j97012q1157j5222L63602N90359Q00517R14182R00393
18554A1024501M61905M6247j19071n13384j021499q68740n57395J65796O71388
18545I289748J091060N62106R7842k55480r44567j282966j292536j157889o40377
18536E466941m91178m28533k19634j32586k29885j99672n3096K9953J78268K86009
18526D206587J10039o9178j68406j56575k29500j11063k49616k03816o3088k8808
18516C036576N1652L5484R0921L74509M55554L95169K61602N14688O52846N21007
$$ plain form
18581 67764863 50729474 40251936 33342506 28205168 24239583 21234011 19165282 17860504
18573 17860504 16857651 15952883 14863226 13865540 12701070 11466069 10480505 9721401 9006415
18564 9006415 8341518 7748839 7551827 7470670 7455448 7819050 8409409 9209926 10124108 11024501
18554 11024501 11486406 11532653 11413582 10900198 9878699 9009959 8452564 8618360 9289748
18545 9289748 10380808 10942914 11040756 10785276 9840709 8557743 7265207 6107318 5466941
18536 5466941 4975763 4547230 4327596 4195010 3965125 3765453 3712357 3742310 3920578 4206587
18526 4206587 4316626 4247448 4079042 3922467 3692967 3581904 3332288 3128472 3065384 3036576
18516 3036576 3088228 3123712 3214633 3589142 4044696 4439865 4701467 5216155 5869001 6390008
18506F390008O79642N24814N01292L52826L55663N14794L37922L65750M53312
18497A0476023N33960O25630P84463J179495J583678K815195L882382N418950
18489B7299776Q624604J4137470K5359155M3097053N6544758M5984776K7157016
18482B48204608J390889l021708Q855985M923992o188177l1144535m8592888m6865125
18474A27563041l8637513k5467186j4974585q987141n747208l604469k618556
18467B7526383j659359q68439r14734j131656j234575j190595o70494l47122N9571
18458A9568980M13895J092250J853088K969339N195516R256325J7281272K8739484
18450H6370149L3830156K5416275J2823029k235616J19737O209125J971273o335104
$$ plain form
18506 6390008 7069650 7594464 8095756 8448582 8804245 9319039 9656961 10022711 10476023
18497 10476023 11009983 11635613 12420076 13599571 15183249 17998444 21880826 27299776
18489 27299776 35924380 50061850 75421005 118518058 175062816 221047592 248204608
18482 248204608 249595497 246573789 255429774 260353766 254165589 223021054 174428166 127563041
18474 127563041 88925528 63458342 48483757 39496616 33749408 30144939 27526383
18467 27526383 25867024 24998585 24083851 22952195 21717620 20527025 19856531 19509409 19568980
18458 19568980 19982875 21075125 22928213 25897552 31093068 40349393 57630665 86370149
18450 86370149 120200305 145616580 158439609 156203993 156323730 162532855 164504128 158169024
18442A58169024k3983042l1172436k8872063k2716681j4310538q614200n503077
18435B2996987l354708k033640j547579j108954o98717p65508p01965n00427n24652
18426A1760837p38996n05619j83516n76190q89492r27895p41241l89490l72462
18417F435936q3441L98115M10402Q7556O0096j21922j30159k90473n06061o14499
18407E645550j43645m0508L96174M83969Q0800J64008k18009l91075n02789n48158
18397D926317o20826m26068l02146k47651m1633N2851n7690K3062J04471o871
18387C403816k58153k84076k99871k25152J6103K32387j2617j03736o157J33616
18377B596160L04906J26487J15732L55043L65394N91202J075653J079398Q89477
$$ plain form
18442 158169024 134185982 103013546 74141483 51424802 37114264 28500064 22996987
18435 22996987 19642279 17608639 16061060 14952106 14253389 13487881 12785916 12285489 11760837
18426 11760837 11021841 10516222 10332706 9756516 8867024 7939129 7197888 6808398 6435936
18417 6435936 6352495 6750610 7161012 7248568 7308664 7186742 7056583 6766110 6260049 5645550
18407 5645550 5501905 5461397 5857571 6341540 6422340 6586348 6368339 5977264 5474475 4926317
18397 4926317 4305491 3879423 3577277 3329626 3287993 3340844 3283154 3306216 3410687 3403816
18387 3403816 3145663 2861587 2561716 2336564 2352667 2585054 2572437 2468701 2462544 2596160
18377 2596160 2901066 3027553 3143285 3498328 3863722 4454924 5530577 6609975 7499452
18368G499452Q63532J056387J668358J550847Q58956J07002m35288L2861M30222
18359A3632329J41876n35395j591311j987300k121108j834202j052657q44681
18351C807551m87026j84482J63601m4125n0118Q3559J77530J15138k60839k57026
18341C063763j57633j57975k41915q8667J330K62276L97690M02289Q07114J062599
18331E350871J829299J888863J211312K64214o8819L52347L17126J79419l78906
18322A0945726j371445j409950r58287o34392l40904l44169k62286m18086n5658
18313E150549m84929q28440m51458m21608l66240j16764J74896p4709j25844J29718
18303B585171J78940k8614j54134r4558J4386Q0909J80947J69594R7147J64432
$$ plain form
18368 7499452 8362984 9419371 11087729 12638576 13497532 13604534 13169246 13202107 13632329
18359 13632329 13774205 13238810 11647499 9660199 7539091 5704889 4652232 3807551
18351 3807551 3320525 3136043 3299644 3255519 3205401 3288960 3466490 3581628 3320789 3063763
18341 3063763 2906130 2748155 2506240 2417573 2418903 2681179 3078869 3481158 4288272 5350871
18331 5350871 7180170 9069033 10280345 10544559 10475740 10828087 11145213 11324632 10945726
18322 10945726 9574281 8164331 7206044 6571652 6230748 5886579 5624293 5206207 5150549
18313 5150549 4665620 3837180 3385722 2964114 2597874 2481110 2656006 2581297 2455453 2585171
18303 2585171 2764111 2735497 2581363 2486805 2501191 2582100 2763047 2932641 3029788 3194220
18293C194220K02300J57832j00788K347J36832j16417J23760K58030K36356L14791
18283D409263L1355j22069R1841j2843j13334j22785j78619k40327k37183p7424
18273C427875j77560j13490O236l6126j59035l39957j55866k73081j77644K3156
18263B024508j01159j55281l3566l2958p5872j1750o0845M7221J72824O6032n6848
18252A782306k97j97111n7905J61708N2418L2435J44559R2206K31845N54718O53946
18241C450828M50495O58555K40722M0466R6487j71461j48160L5339k67141m67444
18231C918686m50330k46239j64317k86629k57736j02242j79523j05264N08m4883
18221B082031k43132J10970K38324J52634K78603J87054L15611L45306K719K7732
$$ plain form
18293 3194220 3396520 3554352 3453564 3455911 3592743 3476326 3600086 3858116 4094472 4409263
18283 4409263 4440618 4318549 4410390 4397547 4284213 4161428 3982809 3742482 3505299 3427875
18273 3427875 3250315 3136825 3143061 3106935 2947900 2607943 2452077 2178996 2001352 2024508
18263 2024508 1923349 1768068 1734502 1701544 1625672 1613922 1553077 1600298 1773122 1839154 1782306
18252 1782306 1782009 1584898 1526993 1688701 1741119 1773554 1918113 2010319 2242164 2796882 3450828
18241 3450828 3901323 4559878 4800600 4841066 4937553 4766092 4617932 4653271 4386130 3918686
18231 3918686 3468356 3222117 3057800 2771171 2513435 2411193 2231670 2126406 2126914 2082031
18221 2082031 1838899 1949869 2188193 2340827 2619430 2806484 3122095 3467401 3470120 3497852
18211C497852J28390J46688M8625j09824l39765m19155j17113j39154l08138l31327
18201B057079O5416K02922l2277k5572M0338q4216r5527j54703m9188n055J0672
18190A929889m1487N6390J54906l3561J40993L557P0527k9373L5577L09805M04702
18179C001925P7846R9784m0775k10180j59900j37994j49736l18712l09660l31445
18169A521153L601l4612L491K6888o6241O6281P275L1598J04453J10841R0603
18158A865331J78256K18556k3635j57122j14566J19702K67024l7601q9094M0718
18148B267569R4911J19955R4888K16879L73458L75506J82308N4123j62384l2617
18138C584596R1795L0176m3477k64954l06626k51850L1916J63988J31819Q0998
$$ plain form
18211 3497852 3626242 3772930 3821555 3711731 3371966 2952811 2835698 2696544 2388406 2057079
18201 2057079 2122495 2325417 2293140 2267568 2307906 2223690 2128163 1973460 1924272 1919217 1929889
18190 1929889 1888402 1944792 2099698 2066137 2207130 2210687 2281214 2251841 2287418 2597223 3001925
18179 3001925 3079771 3179555 3138780 2928600 2768700 2630706 2480970 2162258 1852598 1521153
18169 1521153 1524754 1490142 1493633 1520521 1454280 1520561 1527836 1559434 1663887 1774728 1865331
18158 1865331 2043587 2262143 2238508 2081386 1966820 2086522 2353546 2315945 2226851 2267569
18148 2267569 2362480 2482435 2577323 2794202 3167660 3543166 3725474 3779597 3617213 3584596
18138 3584596 3676391 3706567 3663090 3398136 3091510 2839660 2871576 3035564 3167383 3248381
18128C248381K01716J15219q586L64881N53731O91385P82507R15786J106287J591828
18118I563135J956305K389882K785215M166142O543068J0333139J8236442L5388287
18110I1361615O8457364J06817463O2237405l1883993n9024211p7703594o2717487
18103I7544562l4317831j8563865j1174812p357907n241267l729502k716627k017290
18095A2425461j300077j146581j148621p72624p63533o96452n60688n06104m36286
18086E094495l56080k00162r5260j87974l49953k92008k26986l3639O3834j82461
18076C233806l61401r3236N4795L6947L5674L2562k56092k95134j74604R8923
18066B312240R9780K21688L53044M00352O02482M88596M38582p9915l19271n48087
$$ plain form
18128 3248381 3450097 3565316 3556730 3921611 4475342 5166727 5949234 6865020 7971307 9563135
18118 9563135 11519440 13909322 16694537 20860679 27403747 37736886 55973328 91361615
18110 91361615 159818979 266636442 328873847 296989854 237965643 160262049 97544562
18103 97544562 63226731 44662866 33488054 26130147 20888880 17159378 14442751 12425461
18095 12425461 11125384 9978803 8830182 8057558 7294025 6597573 6036885 5530781 5094495
18086 5094495 4738415 4538253 4442993 4255019 3905066 3613058 3386072 3352433 3416267 3233806
18076 3233806 2872405 2779169 2833964 2870911 2906585 2939147 2683055 2387921 2213317 2312240
18066 2312240 2412020 2633708 2986752 3387104 3989586 4478182 4916764 4836849 4517578 3969491
18056C969491o55356o44966l99664j45166J5290n6670L8161J78793l7143q3454
18046B179316j17099k13932j53481j91635j95632j65319j03040J2683m3178O7326
18036A076009Q0960O3900N4278K89728K56849J40966J68188J99942K71831j32641
18026B470010n00894l00184k90058k6739m3763J1018J63673k2895k7904M3067
18016A475331J17693n7052L6034N4107J3777K78314R8307J77745N31012L92487
18006C117755O3190j16849l82466n33597n34563m47939O0640J51246R5026Q2726
17996A555169L19622J36517Q8351J09149j16267k14554m24044l32282k45971k51362
17986F24328k4977L1840m946n1489L1872o5474n5547O9910p3193r9647l2784j641
$$ plain form
18056 3969491 3314135 2669169 2269505 2124339 2139629 2082959 2121120 2299913 2262770 2179316
18046 2179316 2062217 1848285 1694804 1503169 1307537 1142218 1039178 1051861 1008683 1076009
18036 1076009 1156969 1220869 1275147 1564875 1821724 1962690 2130878 2330820 2602651 2470010
18026 2470010 1969116 1668932 1378874 1352135 1308372 1319390 1483063 1460168 1432264 1475331
18016 1475331 1593024 1535972 1572006 1626113 1639890 1918204 2016511 2194256 2725268 3117755
18006 3117755 3180945 3064096 2681630 2148033 1613470 1165531 1226171 1377417 1472443 1555169
17996 1555169 1874791 2011308 2099659 2208808 2092541 1877987 1453943 1121661 875690 624328
17986 624328 599351 631191 626245 574756 606628 541154 485607 555517 482324 382677 349893 348252
17974C48252J31228l4586p7136j0909M2906k6447j42286j15626L26710J57185
17964E99291M3688o0153j13536m7950q1813r4989L5171M4767J40695K03773m6111
17953F22833n3674l7663q8456j36164J4225l0783J33889J19041K47718L85792
17943A176758K30748J92058J09188j26056K05J83812k46246j59630n1787k71961
17933A037089k05244k52170j08993n2575r2968L1j38709j25180R3265N3151K32239
17922D39936k1156p8987m2839M2178J37163P7972Q0806N1460j79714J1925K5286
17911E44030O2422K50849J47639J40522J85727J3344O5391m3812J4190O2333j49222
17900A293413j78062k38410l79809j63512q0075n5710J00723Q0604q3921O3747
$$ plain form
17974 348252 479480 444894 367758 356849 399755 373308 231022 115396 442106 599291
17964 599291 642979 582826 469290 421340 339527 244538 279709 324476 465171 668944 622833
17953 622833 569159 531496 443040 306876 321101 290318 424207 543248 790966 1176758
17943 1176758 1407506 1599564 1708752 1582696 1582901 1766713 1520467 1360837 1309050 1037089
17933 1037089 831845 579675 470682 418107 325139 325170 186461 61281 154546 207697 439936
17922 439936 418780 339793 296954 339132 476295 554267 635073 686533 506819 518744 544030
17911 544030 606452 857301 1004940 1145462 1331189 1344533 1409924 1366112 1380302 1442635 1293413
17900 1293413 1115351 876941 497132 333620 253545 197835 298558 379162 295241 358988
17890C58988Q0396j34063M6987K54914J30550j60551j89681p4025J0818K5440
17880C49773J59514p1076m6909j13503M6443P715p7157L6857K469q9128l934k0929
17868A80135J45326J70000j39263l22016K5399J74661J1086M3777J80073J5084
17858D84262k48993j38340j07705p5099L1336K05249p3790n7001J53218J57684
17848C30821M8884j81005L4915n7314r8439k7352J0389p3778j02348K7409J6230
17837g1588N8854J80560k5729R181J79527p8075L9913J36942n3802k70449k47338
17826a42004j4737J43106o4282o0409P9493J03467J3898R3425N3856m5847O8777
17815B28743l9427L5256R30q5095q0730j22786R5368n9120q0909p9000O5844J25193
$$ plain form
17890 358988 439384 305321 352308 607222 737772 577221 387540 313515 324333 349773
17880 349773 509287 438211 391302 277799 324242 331957 254800 291657 294126 204998 201064 180135
17868 180135 325461 495461 356198 34182 59581 234242 245328 289105 469178 484262
17858 484262 235269 96929 -10776 -85875 -54539 150710 76920 19919 173137 330821
17848 330821 379705 198700 233615 176301 77862 50510 60899 -12879 -115227 -87818 -71588
17837 -71588 -12734 167826 142097 151278 330805 252730 292643 429585 375783 105334 -142004
17826 -142004 -156741 -13635 -77917 -138326 -58833 44634 58532 151957 205813 159966 228743
17815 228743 189316 224572 225502 140407 59677 -63109 32259 -26861 -107770 -186770 -120926 4267
17803D267J6812j89111n3179k0878R899R6895L09585M780J5750J57068Q2717j83159
17791B51446k65688o8955O2926j0501m7339P7634J56246j19182l2999n3071L5504
17780a3979K87215R3184Q4076q1368j67337k36314m7557Q713K9376J14741J0154
17769H0904Q8855j46497r5000J6502n9046o2431L5260Q6700r5907P55R5075M3897
17757a0933L9182J05603J16298r1201r2535j01251J92577J25436J4713K9631N0522
17746C78042q8527p2719j34259M6564j30812K4618O7963k641j7027q4487j597
17735a4882J12942O8219L481m1118j20804r911J36749r109j94583J69962J50161
17724B51107L2877q7093j9903m9324l0491M0756J00310Q7426l23188k03654J65019
$$ plain form
17803 4267 21079 -168032 -221211 -242089 -232190 -135295 174290 179070 194820 351888 434605 251446
17791 251446 -14242 -83197 -20271 -30772 -78111 -477 155769 36587 3588 -49483 -13979
17780 -13979 273236 366420 450496 369128 201791 -34523 -82080 -73367 -43991 70750 80904
17769 80904 169759 23262 -71738 -55236 -114282 -176713 -141453 -54753 -150660 -149905 -54830 -10933
17757 -10933 28249 133852 250150 158949 66414 -34837 157740 283176 297889 327520 378042
17746 378042 289515 216796 82537 129101 -1711 22907 90870 88229 71202 -13285 -14882
17735 -14882 98060 166279 169760 128642 7838 -2073 134676 125567 -69016 100946 251107
17724 251107 283984 196891 176988 127664 97173 137929 238239 325665 2477 -201177 -36158
17713c6158J51177k1613Q3458J1669J2220L4932o7593L1805J5626j13639q8325
17702A3559Q7483J11714k13723K3082J44634R6536N7417o6991j06633N0496L0925
17691B28499M4739O1596j01293j13514j3518r6293o2341l8054l91K4584O2364
17680c622J36929J84398p6031j53933k14j20009j45698J31383Q1117l9960R854
17669D214N394Q894j08777l8526n713m7555Q8799l6829L129J28611K35548n3129
17657A84060j30425J51990K8189k90976r4448P0093j4514J00743l4042l0707K32380
17646A72343R0842n6303N9875m8620j25241j46902p677J07325J81904k7391j78403
$$ plain form
17713 -36158 115019 93406 176864 188533 200753 235685 168092 199897 215523 101884 13559
17702 13559 101042 212756 -967 22115 166749 263285 320702 253711 147078 197574 228499
17691 228499 273238 334834 233541 120027 106509 10216 -52125 -90179 -90570 -65986 -3622
17680 -3622 133307 317705 241674 87741 87527 -32482 -178180 -46797 34320 -5640 4214
17669 4214 9608 18502 -90275 -128801 -134514 -182069 -93270 -130099 -126970 1641 237189 184060
17657 184060 53635 205625 233814 -57162 -151610 -81517 -96031 4712 -29330 -60037 172343
17646 172343 263185 206882 266757 218137 92896 -54006 -61683 45642 227546 200155 21752
$$ [...]
##END NTUPLES=NMR SPECTRUM
##END=
