##TITLE=Analysis number 326931
Compound Code cc 29401
Project Code adrs
Chemist Name endeavour
##JCAMPDX= 6.0         $$ Bruker NMR JCAMP-DX V2.0
##DATA TYPE= NMR SPECTRUM
##DATA CLASS= NTUPLES
##ORIGIN= Bruker BioSpin GmbH
##OWNER= nmr
$$ XWIN-NMR		Version 3.5
$$ Fri Mar  2 10:28:27 2007 GMT Standard Time (UT+0h)  MAYBRIDGE\nmr@NMR_250MHZ
##.OBSERVE FREQUENCY= 250.131544655141
##.OBSERVE NUCLEUS= ^1H
##.ACQUISITION MODE= SIMULTANEOUS (DQD)
##.ACQUISITION SCHEME= undefined
##.AVERAGES= 16
##.DIGITISER RES= 18
##SPECTROMETER/DATA SYSTEM= dpx250
##.PULSE SEQUENCE= zg30
##.SOLVENT NAME= DMSO
##.SHIFT REFERENCE= (INTERNAL, DMSO, 0, 16.522)
##AUDIT TRAIL= $$ (NUMBER, WHEN, WHO, WHERE, WHAT)
$$ ##TITLE= Audit trail, XWIN-NMR		Version 3.5
$$ ##JCAMPDX= 5.01
$$ ##ORIGIN= Bruker BioSpin GmbH
$$ ##OWNER= nmr
$$ C:\u/data/dgb/nmr/ADRS/110/pdata/1/auditp.txt
$$ ##AUDIT TRAIL=  $$ (NUMBER, WHEN, WHO, WHERE, WHAT)
(   1,<2007-03-02 10:27:56.33 +000>,<MAYBRIDGE\nmr>,<NMR_250MHZ>,
      <created by zg, POWCHK disabled, PULCHK disabled
       configuration hash MD5:
       49 4B E0 1D 92 C2 6B 37 9F E6 65 BC 52 41 86 1D
       data hash MD5: 64K
       B0 DC 82 1A E0 71 09 E4 EA 21 85 F8 F3 DF A5 1B>)
(   2,<2007-03-02 10:28:12.27 +000>,<MAYBRIDGE\nmr>,<NMR_250MHZ>,
      <Start of raw data processing
       ef LB = 0.3 FT_mod = 6 PKNL = 1 SI = 32K 
       data hash MD5: 32K
       1E 73 6E 7A 85 E4 C1 E1 B0 F5 B1 BC 02 0B 1F A3>)
(   3,<2007-03-02 10:28:14.22 +000>,<MAYBRIDGE\nmr>,<NMR_250MHZ>,
      <apk 
       data hash MD5: 32K
       7A 82 F7 6D F1 23 31 2D 6A 6C 03 AB FE 1A 45 BA>)
(   4,<2007-03-02 10:28:15.13 +000>,<MAYBRIDGE\nmr>,<NMR_250MHZ>,
      <abs ABSG = 5 
       data hash MD5: 32K
       60 B3 0C 40 72 30 38 E4 91 42 0A E2 7B 70 BF 89>)
$$ ##END=
$$ 
$$ hash MD5
$$ 37 0C 72 9A 7F 64 B4 24 74 B3 53 19 25 E2 91 7A
##$RELAX= 
##$RELAX= 
##$RELAX= 
##$RELAX= 
##$RELAX= 
##$RELAX= 
##$RELAX= 
$$ Bruker specific parameters
$$ --------------------------
##$DU= <C:\u>
##$EXPNO= 110
##$NAME= <ADRS>
##$PROCNO= 1
##$TYPE= <nmr>
##$USER= <dgb>
##$AMP= (0..31)
100 100 100 100 100 100 100 100 100 100 100 100 100 100 100 100 100 100 
100 100 100 100 100 100 100 100 100 100 100 100 100 100 
##$AQSEQ= 0
##$AQ_mod= 3
##$AUNM= <au_zg>
##$AUTOPOS= <32 >
##$BF1= 250.13
##$BF2= 250.13
##$BF3= 250.13
##$BF4= 250.13
##$BF5= 500.13
##$BF6= 500.13
##$BF7= 500.13
##$BF8= 500.13
##$BYTORDA= 1
##$CFDGTYP= 0
##$CFRGTYP= 5
##$CHEMSTR= <none>
##$CNST= (0..31)
1 1 145 1 1 1 1 1 1 1 1 1 1 1 1 1 1 1 1 1 1 1 1 1 1 1 1 1 1 1 1 1 
##$CPDPRG= <>
##$CPDPRG1= <>
##$CPDPRG2= <>
##$CPDPRG3= <>
##$CPDPRG4= <mlev>
##$CPDPRG5= <mlev>
##$CPDPRG6= <mlev>
##$CPDPRG7= <mlev>
##$CPDPRG8= <mlev>
##$CPDPRGB= <>
##$CPDPRGT= <>
##$D= (0..31)
0 1 0 0 0 0 0 0 0 0.06 0 0 0 0 0 0 0.0002 0 0 0 0 0 0 0 0 0 0 0 0 0 0 
0 
##$DATE= 1172831274
##$DBL= (0..7)
120 120 120 120 120 120 120 120 
##$DBP= (0..7)
150 150 150 150 150 150 150 150 
##$DBP07= 0
##$DBPNAM0= <>
##$DBPNAM1= <>
##$DBPNAM2= <>
$$ [...]
##$SUBNAM7= <"">
##$SUBNAM8= <"">
##$SUBNAM9= <"">
##$SW= 20.6930455092707
##$SWIBOX= (0..15)
0 0 3 0 0 0 0 0 0 0 0 0 0 0 0 0 
##$SW_h= 5175.983436853
##$TD= 65536
##$TD0= 1
##$TE= 295.16
##$TE2= 300
##$TE3= 300
##$TEG= 300
##$TL= (0..7)
0 120 120 120 120 120 120 120 
##$TP= (0..7)
150 150 150 150 150 150 150 150 
##$TP07= 0
##$TPNAME0= <>
##$TPNAME1= <>
##$TPNAME2= <>
##$TPNAME3= <>
##$TPNAME4= <>
##$TPNAME5= <>
##$TPNAME6= <>
##$TPNAME7= <>
##$TPOAL= (0..7)
0.5 0.5 0.5 0.5 0.5 0.5 0.5 0.5 
##$TPOFFS= (0..7)
0 0 0 0 0 0 0 0 
##$TUNHIN= 0
##$TUNHOUT= 0
##$TUNXOUT= 0
##$USERA1= <user>
##$USERA2= <user>
##$USERA3= <user>
##$USERA4= <user>
##$USERA5= <user>
##$V9= 5
##$VALIST= <valist>
##$VCLIST= <CCCCCCCCCCCCCCC>
##$VD= 0
##$VDLIST= <DDDDDDDDDDDDDDD>
##$VPLIST= <PPPPPPPPPPPPPPP>
##$VTLIST= <TTTTTTTTTTTTTTT>
##$WBST= 1024
##$WBSW= 4
##$XGAIN= (0..3)
0 0 0 0 
##$XL= 0
##$YL= 0
##$YMAX_a= 262136
##$YMIN_a= -268988
##$ZGOPTNS= <>
##$ZL1= 120
##$ZL2= 120
##$ZL3= 120
##$ZL4= 120
##$ABSF1= 16.522
##$ABSF2= -4.171173
##$ABSG= 5
##$ABSL= 3
##$ALPHA= 0
##$AQORDER= 0
##$ASSFAC= 0
##$ASSFACI= 0
##$ASSFACX= 0
##$ASSWID= 0
##$AUNMP= <proc_1d>
##$AZFE= 0.1
##$AZFW= 0.1
##$BCFW= 0
##$BC_mod= 0
##$BYTORDP= 0
##$COROFFS= 0
##$CY= 12.5
##$DATMOD= 1
##$DC= 0
##$DFILT= <>
##$DTYPP= 0
##$F1P= 14.0000005364418
##$F2P= -0.99999901652339
##$FCOR= 0.5
##$FTSIZE= 32768
##$FT_mod= 6
##$GAMMA= 0
##$GB= 0
##$INTBC= 1
##$INTSCL= 1
##$ISEN= 128
##$LB= 0.3
##$LEV0= 0
##$LPBIN= 0
##$MAXI= 10000
##$MC2= 0
##$MEAN= 0
##$ME_mod= 0
##$MI= 0
##$NCOEF= 0
##$NC_proc= -5
##$NLEV= 6
##$NOISF1= 0
##$NOISF2= 0
##$NSP= 0
##$NTH_PI= 0
##$NZP= 0
##$OFFSET= 16.522
##$PC= 1
##$PHC0= 223.2591
##$PHC1= -0.3502334
##$PH_mod= 1
##$PKNL= yes
##$PPARMOD= 0
##$PSCAL= 4
##$PSIGN= 0
##$REVERSE= no
##$SF= 250.13
##$SI= 32768
##$SIGF1= 0
##$SIGF2= 0
##$SINO= 400
##$SIOLD= 32768
##$SREGLST= <1H.DMSO>
##$SSB= 0
##$STSI= 32768
##$STSR= 0
##$SW_p= 5175.98343685301
##$SYMM= 0
##$S_DEV= 0
##$TDeff= 65536
##$TDoff= 0
##$TI= <Analysis number 999999
Compound Code 99
Book Reference 9
Project Code 9>
##$TILT= no
##$TM1= 0
##$TM2= 0
##$TOPLEV= 0
##$USERP1= <user>
##$USERP2= <user>
##$USERP3= <user>
##$USERP4= <user>
##$USERP5= <user>
##$WDW= 1
##$XDIM= 32768
##$YMAX_p= 474320153
##$YMIN_p= -769356
$$ End of Bruker specific parameters
$$ ---------------------------------
##NTUPLES= NMR SPECTRUM
##VAR_NAME=  FREQUENCY,     SPECTRUM/REAL,   SPECTRUM/IMAG
##SYMBOL=    X,             R,               I
##VAR_TYPE=  INDEPENDENT,   DEPENDENT,       DEPENDENT
##VAR_FORM=  AFFN,          ASDF,            ASDF
##VAR_DIM=   32768,         32768,           32768
##UNITS=     HZ,            ARBITRARY UNITS, ARBITRARY UNITS
##FACTOR=    0.157963299565203, 1,           1
##FIRST=     4132.6476996994, 0,             0
##LAST=      -1043.33573715361, 0,           0
##MIN=       -1043.33573715361, -769356,     0
##MAX=       4132.6476996994, 474320153,     0
$$ Real data points
##PAGE= N=1
##DATA TABLE= (X++(R..R)), XYDATA
$$ [...]
15692I684o7635l0036m7082J1407J0854n1339N7363L2550r3474p0325m0046J06127
15680a71952M8191J74191P7520q3736L4646J72292L1516k0554j38502j83681J9238
15669d0831J14146L5880k871j13893j13106P5022M1511l9799j63646l923J13475
15658i8035J34673J35200M3764q9591L0096q420N2021O785M3399j44475n1312
15647E4105J40582p2270k06141P7624J86530J06231L6116P457m8564K7462j27445
15636A81687n5468k4064N9630N9188j9374J3192j09019r8363J5413L0046M3538
15625I6406P998j7128k8242K6107K53223J31556j52607k90666j34970R1562j7192
15614c3953L7986Q8910r0762p8419J06726L8887J03946J10747N3492L573n9968
$$ plain form
15692 9684 -57951 -87987 -135069 -123662 -112808 -164147 -106784 -74234 -167708 -238033 -278079 -171952
15680 -171952 -123761 50430 127950 44214 78860 251152 282668 262114 123612 -60069 -40831
15669 -40831 73315 109195 106324 -7569 -120675 -45653 -4142 -43941 -207587 -211510 -98035
15658 -98035 36638 171838 215602 126011 156107 147687 199708 206493 249892 105417 54105
15647 54105 194687 122417 -83724 -6100 180430 286661 322777 330234 281670 309132 181687
15636 181687 126219 102155 161785 220973 201599 214791 105772 7409 22822 52868 96406
15625 96406 104404 87276 59034 85141 338364 469920 317313 26647 -108323 -16761 -33953
15614 -33953 4033 92943 2181 -76238 30488 69375 173321 284068 337560 341133 281165
15603B81165j30136j92494L9821M3672j4793Q7218M9605n7227r8686J28236o3831
15592G2550j06571M5683K01728K9792r3035j33566L6813P481M60J35128M7292
15581B43755o1768l7411O4536K9096m6557K8998k00620j64160L6091R6263n8191
15570f9968R2718r5186k8639r3526O6984Q9197R2100O3297K4798l0061P8714p1544
15558A18884O337L7965O7948j952j3712P1952R1528q9741O2329L7738J3030j51708
15546B50598r8660J59504L6141o6852M9474K0672j47218j44744J21125J0865r9310
15535I1595K1165N2458J01532j40236o1370j20046p4629J59032J11246j49245
15525h498j45180J06285J10651r0227P8510J03717j66061j29651J20177l3888
$$ plain form
15603 281165 151029 -41465 -1644 42028 27235 114453 164058 106831 8145 136381 72550
15592 72550 -34021 11662 213390 243182 150147 16581 53394 60875 61335 196463 243755
15581 243755 181987 144576 209112 238208 191651 220649 20029 -144131 -108040 -11777 -69968
15570 -69968 22750 -72436 -101075 -194601 -127617 -38420 53680 116977 141775 111714 190428 118884
15558 118884 125221 163186 231134 229182 215470 287422 378950 289209 351538 389276 402306 250598
15546 250598 151938 311442 347583 280731 330205 350877 203659 58915 180040 190905 91595
15535 91595 112760 165218 266750 126514 65144 -54902 -129531 29501 140747 -8498
15525 -8498 -153678 -47393 63258 -26969 51541 155258 -10803 -140454 -20277 -54165
15515e4165M395P1495N7252o6120J08834p1724j40258P7346J11786J29036R8157
15504C26034O428M4778K829j1434j11876J00303L3816p3393r2598L7829j63091
15493I9625J18308J13530j43118j16846j02680Q8562M7558J06490J4807L9744
15483B65980m9546j69412J25439K2984j32075R976M9345j11788n5690K53095l3080
15472A75228p8435J5629j5679o5877m8691j32757K377o489K68722J52390o2596
15461B03822j36666j34172j7589J07246m2934O4232J60723n869R4995k9779p4551
15450A89458K682r0051O0639L6268j8607N5335M2294P7907J5975j81360k82299
15439i1759j5233J08256l824l4225R8834M9493M9627l3253p1687p7788J71385
$$ plain form
15515 -54165 -49770 21725 78977 12857 121691 49967 -90291 -12945 98841 227877 326034
15504 326034 332462 377240 380069 368635 256759 357062 390878 317485 224887 262716 99625
15493 99625 217933 331463 188345 71499 -31181 57381 104939 211429 226236 265980
15483 265980 216434 47022 172461 195445 63370 73346 122691 10903 -44787 208308 175228
15472 175228 96793 112422 96743 30866 -17825 -150582 -148205 -154694 114028 266418 203822
15461 203822 67156 -67016 -84605 22641 -20293 43939 204662 198793 293788 264009 189458
15450 189458 192140 102089 162728 198996 180389 235724 278018 355925 371900 190540 -91759
15439 -91759 -106992 1264 -2560 -36785 62049 111542 161169 127916 56229 -21559 149826
15428A49826J95281J38996j16568o5796M3184o4292j98235o1073j11798J17974
15418B7499J37511J99367J16063j34092k8414j17178q6041J53780J02095p3438
15408B97152J28421l0907j10940p5340n6866K2397J11752N1030l651j80699j32497
15397A9852j41193m784N3966J22421R6540j28657j09953m7473L9792J97178J37866
15386B35555r5917r5532p0404K8022J07362n9389j8952n131K18011K50691o340
15375D87976j12962j40334R2589o3174j11598n8991P8631m7919j45013P7097j0805
15364D5497M1531J61481j73807r2620n7581J86961K0607q9331N2094L2598k16086
15353h8656n3495K00192l5858p9972J885K77401J40163K8250r1072j78681J843
$$ plain form
15428 149826 345107 484103 367535 301739 344923 280631 82396 21323 -90475 27499
15418 27499 165010 364377 480440 346348 317934 200756 114715 268495 370590 297152
15408 297152 425573 394666 283726 208386 151520 173917 285669 336699 333048 152349 19852
15397 19852 -121341 -126125 -72159 50262 146802 18145 -91808 -139281 -99489 97689 235555
15386 235555 139638 44106 -26298 1724 109086 49697 30745 25614 243625 494316 487976
15375 487976 375014 234680 327269 264095 152497 93506 172137 124218 -20795 56302 45497
15364 45497 87028 248509 74702 -17918 -75499 111462 132069 42738 94832 127430 -88656
15353 -88656 -142151 58041 22183 -57789 -55904 221497 361660 389910 298838 120157 122000
15342A22000j67255j20300k9827K05011K42836L3872j31729K52784Q9275k34525
15332B62142l09329n9019J18763J50537R8315j61102j56884J17370K2518K5668
15322A08979M5872p9029j51789R6057O9537m7393K1726P5825O3320M5666R6196
15311C44967j67120k04003N2503N5598o238r7731J712J28035J75285O5314r1986
15300B56336p3393J21522M6618p3557j31821k2136m54N4795J84714J47368p3964
15289D36028j5391K9736l5467n4827K0984O3377M840j12662P0178p5169j2975
15278C18652J54157J04819j03390k13362n2264o4066P5954r180o5100n1472P3662
15267A68410L3933J4789J15111j584m9336m6725p3011j9325M8276j7016N2698
$$ plain form
15342 122000 -45255 -165555 -195382 9629 252465 286337 154608 407392 496667 262142
15332 262142 -47187 -106206 12557 163094 261409 100307 -56577 60793 83311 108979
15322 108979 154851 75822 -75967 20090 89627 42234 63960 139785 203105 248771 344967
15311 344967 177847 -26156 26347 81945 75707 -22024 -20312 107723 283008 348322 256336
15300 256336 182943 304465 351083 277526 145705 123569 123115 177910 362624 509992 436028
15289 436028 420637 450373 414906 360079 381063 444440 449280 336618 406796 331627 318652
15278 318652 472809 577628 474238 260876 208612 144546 220500 211320 146220 94748 168410
15267 168410 202343 217132 332243 330659 281323 234598 161587 142262 190538 173522 226220
15256B26220K0375k6780j75919j50997J8099q7384m0231K02128K57645M5897j52866
15245A36187o4576M4553n0479J0824O2885J11937O9894j12855j77213m2271p4925
15234h6039m6638P4914K17292P7643j28548P1338N7999j18751n1549K9140R5431
15223A92232j38909o1191O364M5765J10993L31361K6064o9254q2649j72934p0762
15212A17080M9605J06145R1817j64237K5456J602O460J7497J1387m6144K09016
15201D25684J30181l3514j15015j72359P4858j39729q910Q1028K8210j8546K993
15190B54881j01768j65050j09044p923K36148l1138L3782O6045j89909J76390
15180A62414R8292J92308j9586k11873j70568k4415J08344J70024N4979j07609
$$ plain form
15256 226220 246595 219815 43896 -107101 -89002 -176386 -216617 -14489 243156 289053 136187
15245 136187 71611 116164 65685 76509 139394 251331 321225 208370 31157 -11114 -86039
15234 -86039 -132677 -57763 159529 237172 108624 179962 237961 119210 67661 96801 192232
15223 192232 53323 -7868 -1504 44261 155254 486615 512679 443425 360776 187842 117080
15212 117080 166685 272830 364647 200410 225866 227468 233928 251425 262812 216668 425684
15201 425684 555865 522351 407336 234977 309835 170106 161196 242224 270434 251888 254881
15190 254881 153113 -11937 -120981 -128904 107244 76106 109888 175933 -13976 162414
15180 162414 260706 453014 433428 221555 50987 26572 134916 304940 359919 252310
15170B52310j09808p2802l9864J50371J80917L8017j10146q5702L6235O0985n843
15159B94670q0259n3370O9068j3070J6650L0203J3824l20l9968n0419j18786m6556
15147B1667o5871K2650J27181Q3429p2451N9603Q4049m0321k25057J16058Q4075
15136A95012P3401L722j33506j46303m132J64829n232K7143q5855j49141J3792
15125d6270Q71R7114J28825J5636L2822o459R6110k20311J9373J5279O3526K1489
15113B18005J13241M1142k0977K6879j43841j37041l7242K16935N4521m0912P7544
15102C68254k938L7598o923o6473j0186K4198M8950j66157k67557J22066N1111
15091A31943N5912J66502n2913k9073j53946L7425Q6247p3800M7238k3454K2048
$$ plain form
15170 252310 142502 69700 29836 180207 361124 399141 288995 203293 239528 300513 294670
15159 294670 214411 161041 230109 217039 233689 263892 277716 277396 237428 187009 68223 21667
15147 21667 -44204 -21554 105627 189056 116605 176208 260257 219936 -5121 110937 195012
15136 195012 268413 272135 138629 -7674 -11806 153023 147791 174934 89079 -60062 -46270
15125 -46270 -45399 51715 180540 196176 228998 222539 318649 98338 117711 132990 196516 218005
15113 218005 331246 372388 351411 378290 234449 97408 60166 277101 331622 290710 368254
15102 368254 365316 402914 395991 329518 319332 343530 392480 226323 -41234 80832 131943
15091 131943 187855 354357 301444 272371 118425 155850 242097 168297 215535 192081 214129
15080B14129Q8759q2791m5675R1800N8546m6564n046q1519M1738K5786l7735k29984
15068h556M4981J97199p3244m7908j03808J03670P2806J12381n64M3682r3057
15057B47582n7793J52988M2782o7631M7825l834k30600q0385K7788M8287P5958
15046B02967q4507k0581N5139J28575j0181k9846K5171J28255p6130j00078q7440
15035A31344K9515J0906j06208j54660o5212O2033J39224J46088q932R307L8145
15024B31550P7825K1098l4258j89910m4444J39872K3954j180J53595M3450j78844
15013B42708j42656O0440J07916m6603q3872J09817k9533l7524M6653l6881J8982
15002B09447j83147j03721M1599j09460J3382J81959P1857O2980o343m4969O4544
$$ plain form
15080 214129 302888 220097 174422 266222 324768 278204 273158 191639 233377 259163 221428 -8556
15068 -8556 36425 233624 160380 112472 8664 112334 185140 297521 296957 340639 247582
15057 247582 189789 342777 385559 317928 365753 361919 131319 50934 78722 127009 202967
15046 202967 118460 97879 153018 281593 271412 241566 266737 394992 318862 218784 131344
15035 131344 160859 171765 65557 -89103 -154315 -92282 46942 193030 184098 193405 231550
15024 231550 309375 330473 296215 106305 61861 201733 225687 224507 378102 421552 242708
15013 242708 100052 160492 268408 221805 137933 247750 218217 180693 227346 190465 209447
15002 209447 26300 -77421 -35822 -145282 -131900 50059 121916 184896 178553 133584 198128
14991A98128l269j71661Q1621j00366n7941K15490J9020M3458J70937L6148r7652
14980C33913p5037j07313P0637J3840o9881K0280J4716N1056J1582K6410N0507
14969C40710j30257j06057k4883J15436O8245o1657K6182p3098j31076r5410k340
14958g4205p508Q3279M1336O0775j11969q615R3051n4001J20870m7827K4697J12596
14946B32479K08429J08442j81297l8199k9069M8612j18975k0262m1304J20271
14936B89127j24439j13785n0064L246L1012K3101j14946Q6284O0122M0235j885
14925A28008K35768M7727P3605j2020q0971j01981j06457N2301P8552O7678m5186
14914C37024O7293q0218k78956j560J97108r224k0466m450L0578j29485j45724
$$ plain form
14991 198128 194859 23198 104819 4453 -53488 162002 181022 224480 395417 431565 333913
14980 333913 258876 151563 222200 236040 166159 186439 201155 252211 263793 290203 340710
14969 340710 210453 104396 79513 194949 263194 201537 227719 154621 23545 -71865 -74205
14958 -74205 -81713 1566 42902 103677 -8292 -16907 76144 22143 143013 95186 119883 232479
14946 232479 440908 549350 368053 329854 300785 349397 230422 210160 168856 289127
14936 289127 164688 50903 839 4085 35097 58198 -56748 29536 89658 129893 128008
14925 128008 363776 411503 485108 473088 392117 290136 183679 235980 314532 382210 337024
14914 337024 404317 324099 45143 43583 240691 231467 211001 206551 237129 107644 -38080
14903c8080l3385J57017J90132p023r8374M7010N0857m3911N089j38103j41529
14892e0300K9010P7380r6023J0709j02134P4727Q4635J51677J15979n3835k3946
14881B17879r0203M6269O6852n0009j78422l4008L8441R7611m2356j53422J74766
14870I3398K2142K933K7497k2568j05118j4853J2466L4119J2005j04801l934J45901
14858I9187J38702r4569k5265Q3529J81602O7077q4747J6381K0437k03728j33689
14847F4917j43840J25222M3240k4858K04303m5748K0322Q6929J04706n3595r4312
14836B87286l70898k6083K16955J23037o2236J8136j1682m233j08132j11226n2202
14825a01278n726R0209K2917J57434J46786j44487n8809J01598k83j8324k050
$$ plain form
14903 -38080 -71465 85552 275684 268661 170287 217297 268154 224243 229332 91229 -50300
14892 -50300 -21290 56090 -39933 -29224 -131358 -56631 28004 179681 295660 241825 217879
14881 217879 127676 173945 240797 190788 12366 -21642 16799 114410 72054 -81368 93398
14870 93398 115540 118473 145970 123402 18284 3431 15897 50016 62021 -42780 -46714 99187
14858 99187 237889 143320 118055 201584 383186 450263 365516 381897 402334 198606 64917
14847 64917 -78923 46299 89539 64681 268984 223236 243558 330487 435193 381598 287286
14836 287286 -83612 -109695 107260 230297 168061 186197 174515 170282 62150 -49076 -101278
14825 -101278 -107004 -16795 6122 163556 310342 165855 107046 208644 208361 190037 187987
14814A87987p9322r560J3532P3224O9487j73586j01472J09119l3168k7749l8185
14803i693l8690J23539p4667Q7207j9936P771j29083J0840R2380o4689J14875
14792I9854j63379m5504R8056o5129J62821j3423l2745Q8624Q786J02009J2379
14781B52349j78365R7922p4781Q558R2119L6738j87276m9741J14878J31095p7808
14770A65688p7384j28827m8423K8809J92962J36286o1394J31759J58115k15431
14760B82160n9561K8285o5165q764M2521L0412j09428M3056L7158m6105O3659
14749B38228J54858K1056j3669M9140K6723j33322o2546P2026J7766j54199k60381
14738d4320J9344J93439O746M3665M4763j4195K5161K8681j7209j28829p4122
$$ plain form
14814 187987 108665 99105 112637 185861 255348 81762 -19710 89409 56241 28492 -9693
14803 -9693 -48383 75156 489 87696 67760 75531 -53552 -42712 49668 -15021 99854
14792 99854 -63525 -109029 -10973 -76102 86719 73296 40551 129175 137961 239970 252349
14781 252349 73984 171906 97125 105683 197802 234540 47264 -2477 112401 243496 165688
14770 165688 88304 -40523 -88946 -60137 132825 269111 207717 339476 497591 282160
14760 282160 222599 250884 185719 176955 219476 249888 140460 183516 220674 174569 238228
14749 238228 393086 414142 400473 449613 476336 343014 280468 352494 370260 216061 -44320
14738 -44320 -24976 168463 175209 218874 263637 249442 274603 303284 286075 157246 83124
14727H3124L8276P8883q3846M4999l8542J07703K13468q3935q8844R0764K2877
14716C84927m4510J08325J64815j85592j26557m6051L4658p290O1829O4173R706
14705D18433j60097j07009M7544K29730J33424L8201j34820o0565j30350j01074
14695A73417j9535J6226o1096N2721l9808L0971Q5617O1913p6109P0313Q2281
14684C76911j85747r4829j3412l3159j29326L4955L27711Q5393J31541O4556o0774
14673E03820m0873n318j55092m8089J54127l8243p0663p7771N6366L542j41709
14662A40097K7655P6893n3011J44553R0344P3465J04551j51395j15159N803p8690
14651B65106J2262j02253j7021k8669K0590N3600P9163j13758Q1242J71327J54863
$$ plain form
14727 83124 121400 200283 116437 161436 122894 230597 444065 360130 271286 362050 384927
14716 384927 340417 448742 613557 427965 301408 255357 290015 282725 344554 408727 418433
14705 418433 258336 151327 198871 428601 562025 600226 465406 404841 274491 173417
14695 173417 153882 170108 109012 161733 121925 152896 238513 300426 224317 294630 376911
14684 376911 191164 96335 82923 49764 -79562 -44607 283104 368497 500038 564594 503820
14673 503820 462947 457629 302537 254448 408575 370332 299669 221898 278264 281806 140097
14662 140097 167752 244645 191634 336187 426531 499996 604547 453152 337993 343796 265106
14651 265106 277368 175115 158094 129425 150015 203615 282778 169020 250262 421589 576452
14640E76452j5848j94085k47998k8357J57071p1240j45334K6681J07454K19946
14630C84742j50177j63240M6678J03815Q0279l8711j47701q3576n7524K15942
14620A90527l9866P1111J93772Q4509N27O111j1452j78561n8590N6958j0211K1346
14608C26181N2784r1748k22575j78215L4568J80092K8270J37276J14520L8103
14598D19256j19037j083N1780j51778j6518J26793J30482P249j1597O29J2583
14587D48759k7195J1532q0680j73212K0529J00036l3083l7299j6032O6440M9270
14576C29065M6411J36193p2471q7544j18612j53104n4566r731k0973J62173O0885
14565B17726k09702O0459J45163J63019K9829r067n8652j86606o3497M8545K10707
$$ plain form
14640 576452 560604 366519 118521 90164 247235 175995 30661 57342 164796 384742
14630 384742 234565 71325 118003 221818 302097 263386 115685 32109 -25415 190527
14620 190527 150661 221772 415544 500053 500580 506691 495239 316678 258088 315046 304835 326181
14608 326181 378965 287217 64642 -113573 -79005 101087 129357 266633 381153 419256
14598 419256 300219 299136 350916 199138 182620 309413 439895 447144 435547 436176 448759
14587 448759 421564 433096 352416 179204 199733 299769 266686 229387 213355 279795 329065
14576 329065 375476 511669 439198 351654 233042 79938 25372 15641 -5332 156841 217726
14565 217726 8024 68483 213646 376665 406494 397427 338775 152169 88672 137217 347924
14554C47924K0515r964m7933P080L3494K1828q0157k216K9851j04221j07358J05821
14542B14664J08801J86720J16966q3281q5672n9422J61572K8424j15294n7352
14532D16126l5428Q5372j3981j38034M6671J72389m2019j77940o9660o7894R8838
14521B74440M0883Q5271j6823k6197n3791p0605r1193J99808R2014k5262L2021
14510D40566k1486k17006j2857N8761O7739m5863k3380k0481j88757k18089J0595
14499a70258K08573J11270J07894k6751J38337n6402K6498M7706J2235o8624r0955
14488B39523j00801r2816J45498J53972J57309l8675k07945k19245N1201J27807
14478B15828N0460O5765P2553M65m1576L5918k7626n1472m9327r2989M0206J19624
$$ plain form
14554 347924 368439 358475 310542 317622 351116 372944 292787 290571 320422 216201 108843 214664
14542 214664 323465 510185 627151 543870 458198 398776 560348 588772 473478 416126
14532 416126 380698 466070 452089 314055 360726 533115 491096 313156 243496 175602 274440
14521 274440 315323 400594 383771 357574 303783 233178 141985 341793 433807 408545 440566
14510 440566 419080 202074 189217 247978 315717 269854 246474 225993 37236 -180853 -170258
14499 -170258 38315 149585 257479 230728 369065 312663 339161 386867 399102 330478 239523
14488 239523 138722 45906 191404 345376 502685 464010 256065 36820 88021 215828
14478 215828 266288 332053 404606 405071 363495 399413 371787 320315 270988 177999 218205 337829
14466C37829O4661J32313r2042P4487l191j75242j34211j07904Q8332J75706K6307
14455C87045P8951n8378J2458J18083J3477k63773j62847J04045J21242J60952
14445E11255R9599k73884k27908O9672o8489j66521J07713O3200J324P5540j62056
14434B9445Q893k9412q7046Q202J51885J84574N3659K6233J03519K47011m9366
14423F47597j05991o2770k80960J9025L08159J04024j18691K1129p7990N1373
14413E04905N5979K2964J13103j24387l3933J56165k4624p900j01135j45230j4569
14402D01338m1919m6574r2455l8842j21229j09798J3687P3555J35362J09654R8793
14391C81572J1699l386L785J44287n7459M937m7826K9274n2371j22208O7319J38786
$$ plain form
14466 337829 402490 534803 442761 517248 514057 338815 204604 96700 185032 360738 387045
14455 387045 465996 407618 420076 538159 551636 287863 125016 229061 350303 511255
14445 511255 610854 336970 109062 178734 110245 -56276 51437 114637 115961 191501 29445
14434 29445 38338 8926 -78120 -69918 81967 266541 320200 346433 449952 696963 647597
14423 647597 541606 478836 197876 216901 525060 629084 510393 531522 453532 504905
14413 504905 560884 583848 696951 572564 538631 694796 670172 662272 561137 415907 401338
14402 401338 359419 312845 220390 181548 60319 -49479 -35792 37763 173125 282779 381572
14391 381572 393271 389885 393670 537957 480498 485435 437609 466883 414512 292304 359623 498409
14379D98409J28248q0278j45367l5578J34282n7543j16413m430J4845M9415o1363
14368C24227O3038J53872n5280j26268j69292k3829J30340J33997N4741k8722
14358D56824n9308K8245k9506m3930N0730L2148J4826L297J43935j88517j13785
14347B94959J75779K2893L1750J530o6535q3813M6858p9295m0785m029j65655
14336A33657M9894Q6050M3461R3908P9089J1572n1520j14896j12034K24478M5226
14325D88885j91793K198J40867R9076L0312j08481K0844O0262n8284j40342j00706
14314B42838J99934J46553n151K5447r7369j44378p287J3732J2905L9548L8352
14303D65124j11660j57223k6974J08781K4491M2529r623l4829r7044j03247K1251
$$ plain form
14379 498409 626657 546379 401012 365434 499716 442173 325760 321330 336175 385590 324227
14368 324227 387265 541137 485857 359589 190297 166468 296808 430805 485546 456824
14358 456824 397516 425761 396255 352325 403055 435203 450029 453326 597261 408744 294959
14347 294959 470738 493631 525381 526911 460376 376563 423421 344126 303341 299312 133657
14336 133657 183551 269601 313062 406970 486059 497631 446111 331215 219181 443659 488885
14325 488885 297092 299290 440157 539233 569545 461064 481908 542170 483886 343544 242838
14314 242838 442772 589325 584174 609621 512252 367874 360587 374319 387224 426772 465124
14303 465124 353464 196241 169267 278048 302539 345068 335445 300616 203572 100325 121576
14292A21576J21673k8547k7771J51406K9775q6245P236j14283Q3307J19277l807
14281C73597l6216N542P8363M8136N912p2522j83574p0646J5240R3831P0946J94321
14269E22930j20842M4017N5697L1971N632l49o7573J30464J7829l3432p1042k02890
14257C12412J2649J41767J9588J0317R1605r1919j14290n0776l1229L3757j4222
14246C19659j32234o2109j0923K22404P6466M1215l5012R3261J30444r8223j58057
14235C86891J43485j16146k16250j43674K22747O3375J1642K57753o7741l32370
14225B09712J9909R3745N0962J02047J66354Q5902j12742j01291q3567j8291J80659
14214E93399j92166l06797o1078K55358J70168r878j12912K8757o53O458j3060
$$ plain form
14292 121576 243249 214702 186931 338337 368112 281867 289103 174820 258127 377404 373597
14281 373597 337381 342923 421286 469422 475334 402812 219238 148592 163832 257663 328609 522930
14269 522930 402088 446105 501802 533773 539405 539056 471483 601947 619776 586344 515302 312412
14257 312412 325061 466828 486416 496733 588338 496419 382129 331353 300124 333881 319659
14246 319659 187425 125316 114393 336797 413263 454478 419466 512727 643171 544948 386891
14235 386891 530376 414230 197980 54306 277053 340428 352070 609823 542082 209712
14225 209712 229621 323366 374328 476375 642729 728631 615889 514598 431031 412740 593399
14214 593399 401233 94436 33358 288716 458884 449006 336094 364851 364198 370656 357596
14203C57596q3543J51708K33172J04917Q4129k18012n8878J0745j2055o9167J0021
14192E10633M0411j31559r2122J50125j6272j17110r2331j14724j9662J88355
14182C05744o223J22843J41832r1574n4514m8417p4264M0811m6089L6914J59775
14171D86838j26074j92098R4239R3348J30249q1507J8299j695J28416L4624R3190
14160F77829l2222M2886N6988J5456j05802r1526N4965j81980j75080m635q1040
14149A75839J03659N7375J4254M6725J33178J5811R4997N6904k68092K8494r0223
14138C68921j62730J68674J78711j6209r0480j6882J75621q8615l2381J18717
14128F03347j13312L7829j5430N9473J69562K8586k79105O7129N5086p3744j04603
$$ plain form
14203 357596 274053 425761 658933 763850 847979 629967 571089 581834 569779 500612 510633
14192 510633 551044 419485 327363 477488 461216 344106 251775 137051 117389 305744
14182 305744 299521 422364 564196 472622 418108 369691 295427 336238 290149 327063 486838
14171 486838 360764 168666 262905 356253 486502 404995 423294 421599 550015 584639 677829
14160 677829 645607 688493 745481 760937 655135 563609 618574 436594 261514 256879 175839
14149 175839 279498 336873 351127 397852 531030 546841 641838 698742 430650 459144 368921
14138 368921 206191 374865 553576 537367 446887 430005 605626 517011 484630 603347
14128 603347 490035 527864 512434 571907 741469 770055 490950 558079 613165 539421 434818
14117D34818m4304o3694m2375R7211J58614P6213k72335j50845J59398K39153
14107E91854R2930N7410n7414j59193k47094k14091j01304J52981Q1057J79403
14097C76539Q6284J9007j85341P7434k8440q2681r2431J5225J53041n9158J6837
14086B96316J18874O9971k3082j56753r8066j0905R7106N2654R930Q7570M0587
14075D84202j93239j42026J31671R9054M8540K14862O2422q9j21178J2912k1760
14064E75371p8260n9865j4504j7384J2355O2896j34194J09626J44129P790o6732
14053E41228l5696Q7852j11526J60641J5821j30772J6571j12071j52751P355M3261
14042C29913o4661n6229K05406J27897j81687j0600J767J33901m2793N946J13028
$$ plain form
14117 434818 390514 326820 284445 381656 540270 616483 344148 193303 352701 591854
14107 591854 684784 742194 684780 525587 278493 64402 -36902 116079 197136 376539
14097 376539 462823 481830 296489 373923 345483 262802 170371 185596 338637 279479 296316
14086 296316 415190 485161 462079 305326 207260 196355 293461 346115 356045 443615 484202
14075 484202 290963 148937 280608 379662 428202 643064 705486 705397 584219 597131 575371
14064 575371 497111 437246 422742 405358 417713 480609 346415 456041 600170 607960 541228
14053 541228 505532 593384 481858 642499 658320 527548 544119 432048 279297 286652 329913
14042 329913 265252 209023 414429 542326 360639 350039 351806 485707 442914 448860 561888
14031E61888J05544j374L654K0735N3427O6183o0763j97425P6442l3586N1360
14020F46085M3375j08466n5830n9614o1443M2926N1224o8744L927J7772l4389
14009D16823N788m4332J0894J41996M015O0936j76731j47867J10260N0218m8846
13998C83154r4828j6548R2518j25053k2200K2403J49733O6185L029N2482j00293
13987D10582j08639j23R3012l2776J35274j8804j41424k2945M3678j60155j87226
13976A0454Q7444Q0639M7951N4535Q2505O9643K04475J65103o3058j07357r8233
13965E34101j4990j17920j28146j5375K32965L2388j73078R4634K28781P880k33844
13954D47396k6733n3444n7753O8471j5129L3899p4014Q2127J05405l7782J1089
$$ plain form
14031 561888 667432 666058 669712 690447 743874 810057 749294 551869 628311 594725 646085
14020 646085 689460 580994 525164 465550 404107 447033 498257 429513 433440 451212 416823
14009 416823 422611 378279 389173 531169 535184 596120 419389 271522 381782 432000 383154
13998 383154 288326 271778 364296 239243 217043 239446 389179 455364 458393 510875 410582
13987 410582 301943 301820 394832 362056 497330 478526 337102 314157 357835 197680 10454
13976 10454 97898 178537 226488 281023 363528 433171 637646 802749 739691 632334 534101
13965 534101 519111 401191 273045 257670 490635 523023 349945 444579 673360 681240 447396
13954 447396 420663 367219 309466 377937 362808 396707 322693 404820 510225 472443 483532
13943D83532K2474Q3923J10927N7642j15544j34458j1320Q0420M8827o3233n7737
13932E05453o5123J9510p8967o7035J049J04747J07885L4210J23338j20643q1198
13921D83226p4215j45026J06748J26863K8561m2947L1836J61522k6879q5120j50940
13910D13629J43898Q8486M392m811K195M5933L6267l4004o6011j01423K9091j47563
13898D10079j77473J12082J46992P8520j08236k7712P7581j14402q342N0411P3279
13887E12779n0882m2337K3134l3699q2478j90857J12089L12388J03809r4133j74120
13876C95693q1547j7738J18820O3182j33175j2436J21822K01593J93934j19029
13866G31119j59718r7640j74319O9051J25694K1082j35636L0067O2060n4039j3800
$$ plain form
13943 483532 506006 589929 700856 758498 642954 508496 497176 577596 626423 563190 505453
13932 505453 440330 459840 380873 313838 314887 419634 527519 561729 685067 564424 483226
13921 483226 409011 263985 370733 497596 526157 483210 515046 676568 649689 564569 413629
13910 413629 557527 646013 650405 645594 647789 693722 729989 695985 629974 528551 557642 410079
13898 410079 232606 344688 491680 570200 461964 434252 511833 397431 389089 439500 512779
13887 512779 461897 419560 442694 408995 326517 135660 247749 560137 663946 569813 395693
13876 395693 314146 296408 415228 478410 345235 332799 454621 656214 850148 731119
13866 731119 571401 473761 299442 368493 494187 515269 379633 409700 471760 417721 403921
13855D03921n1315k1482J83519O7225Q94q2187J15800J70723p2640j46594O651
13844E74515k3404J1403N1990J5740k24993q9190J21738K0632J33637j22903p3354
13833C95811m3453K04437k4805l08754J02677J7424P7434M5411P1793K85361O5551
13822H88887r7626p8868P6500L113k09821m936m9156J71843j2965J6725J7172
13811G20868K4103j51467j92326p7674J77981N460J6920J01818O211j09680N5827
13800E78041J00971l0443J1234J58913N0389m8731j48524l384J93836J93168k7758
13789A027712j81900j32003K9978J31674L9275R313k5594p6823l6040j4668o8880
13778G02044J85660J61363m6414j14775N170N8098j31198p2995O9193J3411K3512
$$ plain form
13855 403921 352606 331124 514643 581868 582762 500575 616375 787098 714458 567864 574515
13844 574515 551111 562514 614504 630244 405251 316061 437799 458431 592068 469165 395811
13833 395811 352358 556795 531990 223236 325913 343337 420771 466182 537975 823336 888887
13822 888887 791261 712393 788893 792006 582185 577249 528093 699936 686971 703696 720868
13811 720868 744971 593504 401178 323504 501485 506945 523865 625683 631894 522214 578041
13800 578041 679012 648569 659803 818716 869105 820374 671850 668466 862302 1055470 1027712
13789 1027712 845812 713809 743787 875461 914736 924049 898455 821632 785592 770924 702044
13778 702044 887704 1049067 1002653 887878 893048 951146 819948 746953 816146 829557 853069
13767H53069k8249p9880o9795j1245m7983p2499N792J14316j63802j69772M4503
13756C74455K9603O1211J34729L4405j40153o6225O660R1313P70R3757J13949
13745G34474N3135p5421j77200j18120J70595j9001l8854K02139J01082M3550
13735H76379N5843n7266M8443j89069r7483J28795O3074K8489l4435K0752j87521
13724F56001k46734n0073P7942N54P6384J26024r9004j14301L4146J71958J59818
13713G92715J8088m3862j39776k9102O4267j71723j08725j0467R8126J92028J28190
13702G89759k8037n7035q7152q1853J62851K52260j6677m3030J9512q5165N5195
13691H80628o8909j24689l5157j06997j28886k5141L5812J82148P8454l5071o440
$$ plain form
13767 853069 824820 744940 675145 663900 615917 543418 549210 663526 499724 329952 374455
13756 374455 404058 465269 599998 634403 494250 428025 434685 525998 526768 620525 734474
13745 734474 787609 712188 534988 416868 587463 568462 529608 731747 832829 876379
13735 876379 932222 874956 923399 734330 636847 765642 828716 857205 822770 843522 656001
13724 656001 409267 359194 437136 437690 514074 640098 541094 426793 460939 632897 792715
13713 792715 810803 766941 627165 598063 662330 490607 381882 371415 469541 661569 789759
13702 789759 761722 704687 617535 535682 698533 950793 934116 891086 910598 825433 880628
13691 880628 811719 687030 651873 544876 415990 390849 426661 608809 687263 652192 645752
13680F45752J8560M681l4620j26073k3870J85539K17603M7719j4425M9799k2005
13669I48660j09239k5786l2276k00801n9044N1078P5617N9235R3437r579P2721
13658H64023P0173j93444j57120n7674K78873J99500k41186k85359k04548J73508
13648D46746J99038L4463j01193J56120R1574J40207k7742j11998j9206R930n832
13637H12107q6292m8581J17182J08627q3789k96873K3751K38292n0046k30899
13627E03479j14852J03849K67560K9186k5260O2665j5286p870j21292J16920P0354
13616H69453o0644J19625J19334o3963j49818P683J79017L2862j22794o6823J8418
13605H82350k4045k69493j27173M8720K26556K18591q6151k01967r5372M1063
$$ plain form
13680 645752 664312 668993 634373 508300 484430 669969 887572 935291 920866 970665 948660
13669 948660 839421 813635 781359 580558 521514 572592 648209 707444 800881 791302 864023
13658 864023 934196 740752 583632 525958 804831 1004331 763145 477786 273238 446746
13648 446746 645784 680247 579054 735174 826748 966955 939213 827215 808009 817939 812107
13637 812107 725815 677234 794416 903043 819254 522381 546132 784424 734378 503479
13627 503479 388627 492476 760036 789222 763962 826627 811341 803471 682179 799099 869453
13616 869453 808809 928434 1047768 983805 833987 841670 1020687 1053549 930755 863932 882350
13605 882350 858305 588812 461639 510359 736915 955506 869355 667388 572016 613079
13595F13079Q2488M4405J9034j8638L6217J0276P5352n050O3968J58083L4034
13584A113248j85977l31132q8210N9315R2179j30275l7474J35462M9483J479P0372
13573G48470j26182J9798J19692J81238p1058m4786n1004j47925J03794K3826
13563G55863l9977p7877k5132k7615m0439Q2421J77332K9155J05131M1425j64400
13552H15887l0053J0418n2899j2033J20062J36045j24057k09792j77692r1047
13542C84839R4726L7692R9270R557O151K7066Q4765l6445j01484N883J03231q3674
13530F31577k1723J05530N4077R1700k6033j42648r86O9975j5839Q2546k5086
13519H03090l0358q2170L940N2924L1119J10759O1118J22629j3352l3222K4712
$$ plain form
13595 613079 695567 739972 759006 740368 776585 786861 862213 857163 921131 1079214 1113248
13584 1113248 927271 596139 507929 567244 659423 529148 491674 627136 676619 678098 748470
13573 748470 622288 642086 761778 943016 871958 827172 776168 628243 732037 755863
13563 755863 715886 638009 612877 585262 544823 627244 804576 833731 938862 980287 815887
13552 815887 785834 796252 743353 731320 851382 987427 863370 653578 475886 384839
13542 384839 479565 517257 616527 626084 632235 659301 744066 707621 606137 612020 715251 631577
13530 631577 609854 715384 769461 861161 835128 692480 691494 761469 745630 828176 803090
13519 803090 772732 690562 694502 747426 778545 889304 950422 1073051 1059699 1026477 1051189
13508A051189j83008k20981N1959k5898J41551L5790Q1926j5300O4356J9799j07178
13497H94205j50729j0135k0215O4902N4976k5153r1401j20253j03188O4945M7847
13486F05801P2435J07927Q0966R8711L5886m8078M0565m7949K8452j01439L0611
13475I03888N5353J46628J5440k68612o5498n5231o362o407J40968o408J31672
13464I85431P3465r488j87903j7267j16554k4483J15260J38016P354j62946l1380
13453G69505J85484J51638o0354o7829p9054J05534Q1395N0557j18637p9235k15954
13442G23050p5235L0019J64096L4895M6032m2587M4486l8751O3680M9507j78753
13431H20439R686M6643Q1166j8646q076L662k09141N5465R0470l6636k2145m4782
$$ plain form
13508 1051189 868181 647200 699159 673261 814812 850602 932528 917228 981584 1001383 894205
13497 894205 743476 733341 713126 778028 833004 807851 716450 596197 493009 557954 605801
13486 605801 678236 786163 867129 965840 1001726 953648 994213 946264 974716 873277 903888
13475 903888 959241 1105869 1121309 852697 787199 731968 725606 719199 860167 853759 985431
13464 985431 1058896 1049408 861505 844238 727684 703201 818461 956477 963831 800885 769505
13453 769505 954989 1106627 1046273 978444 899390 1004924 1086319 1136876 1018239 939004 723050
13442 723050 647815 677834 841930 876825 922857 880270 924756 886005 949685 999192 820439
13431 820439 830125 876768 957934 939288 931212 934874 725733 781198 871668 835032 812887 768105
13419G68105q8664M4861P4854j45949M0333P8988j12516j30913J34807R3588J74765
13408I32259J9248J245J25813L3224l1186k4693Q7339j00501o9665N4035J18622
13397A145740J40404j4707o7630N406l2895j8995j99091L0658J19751j59191R272
13386I58722M6367o2253N9564J06973l7445n3200P6828N0461o5936k11338j41517
13375G27226R3766J91722p5902k11192K2718J25328J53976J44301n5229j47020
13365I69694p332J05896N3177J1200j41770l5702N7178Q9834J054l6022j09671
13354I57536J05123j65628k01177J90399J70351k696n7137m5787L3764J14076
13344A098824p1474r12j50336L2198o423j7205m1426o9445j07715J29203K12140
$$ plain form
13419 768105 679441 724302 799156 653207 693540 772528 660012 529099 663906 757494 932259
13408 932259 951507 952752 1078565 1111789 1080603 1055910 1143249 1042748 973083 1027118 1145740
13397 1145740 1286144 1271437 1203807 1209213 1176318 1157323 958232 988890 1108641 949450 958722
13386 958722 1005089 942836 1002400 1109373 1071928 1018728 1095556 1146017 1080081 868743 727226
13375 727226 820992 1012714 936812 725620 748338 873666 1027642 1171943 1116714 969694
13365 969694 962362 1068258 1121435 1132635 990865 955163 1012341 1102175 1103229 1067207 957536
13354 957536 1062659 897031 695854 886253 1056604 1053908 996771 950984 984748 1098824
13344 1098824 1027350 1026438 876102 908300 901877 884672 843246 773801 666086 795289 1007429
13333A007429r1181j9709J30891M4729q2288O5896N6503K0624R7690q6892j81158
13322I62534r4330o2012J53598R1402j74608j13291J42303J13392M3077k4490
13312A037575q8157Q0735O9195l5844n5804k11209N42J50r7456J35295N2370J76353
13300A063745R2537o5481o4493k06359p6761O9213M1599J01408r7612R3580J31988
13289A083364j7187p2839k69987j88957J55462J18466J9030R0842J37254L9337
13279A094785R0855r0956q1942L8454J08111j49154J29356J7376l7112o4481k4913
13268A030379O5107J4573m3042O4534J57064j92661j33342p1558r3900p34Q5554
13257H81974O6834p0323q5854J55169Q2710p8127j1224L3743M4137n9215N427
$$ plain form
13333 1007429 916248 896539 1027430 1072159 989871 1055767 1112270 1132894 1230584 1143692 962534
13322 962534 868204 806192 959790 1051192 876584 763293 905596 1018988 1062065 1037575
13312 1037575 949418 1030153 1099348 1063504 1007700 796491 797033 797183 699727 835022 887392 1063745
13300 1063745 1156282 1090801 1026308 819949 743188 812401 854000 955408 857796 951376 1083364
13289 1083364 1066177 993338 723351 534394 689856 808322 827352 918194 1055448 1094785
13279 1094785 1185640 1094684 1012742 1051196 1159307 1010153 1139509 1156885 1119773 1055292 1030379
13268 1030379 1095486 1110059 1067017 1131551 1288615 1095954 962612 891054 797154 796420 881974
13257 881974 948808 878485 792631 947800 1030510 952383 941159 974902 1019039 959824 965251
13246I65251j63415j7665J63007J0449J78428J5787n4786M7633j78262K4544J94273
13235A185244Q1229o0056j43922k5737J6201K46010J75492j4644p7752k09726
13225A172339J4493j31363l3187J15021P2960j16657k7235j48828p9469R1357
13215I29431K89687Q1255o9675l2223o3978j2084j5838k08952P8737J54503L1491
13204A162354M8612q4339K4434J53702Q5573M1454j09430K4490Q1592J11346K7223
13193A567011j11608o9689n9740j04136p0065j08413J6661J17235J40305L0053
13183A347614j60137O2572L7158m9122J36189O9576L8740k4244m5276j38342J4588
13172A289316J11995j15079j51166N9008o2352j226K51190k1176l5165J19205
$$ plain form
13246 965251 801836 784171 947178 957627 1136055 1151842 1097056 1144689 966427 990971 1185244
13235 1185244 1266473 1206417 1062495 1036758 1052959 1298969 1474461 1459817 1382065 1172339
13225 1172339 1186832 1055469 1022282 1137303 1210263 1093606 1066371 917543 838074 929431
13215 929431 1219118 1300373 1230698 1198475 1134497 1122413 1106575 897623 976360 1130863 1162354
13204 1162354 1210966 1126627 1151061 1304763 1390336 1431790 1322360 1346850 1428442 1539788 1567011
13193 1567011 1455403 1385714 1325974 1221838 1151773 1043360 1060021 1177256 1317561 1347614
13183 1347614 1187477 1250049 1287207 1238085 1374274 1443850 1482590 1458346 1413070 1274728 1289316
13172 1289316 1401311 1286232 1135066 1194074 1131722 1130496 1381686 1360510 1325345 1444550
13162A444550J9286J0470P0839o2794j72982O0441J36723j41542j00313J01205
13152A365883k9069o7344j30185P3487O2681r5819j01759K03353O6718j04801
13142A243145L568J96756P9366M3131k9626j56888R7141k3506m5362j36923J21832
13131A392634o9027j70175r3251M8152K78718K49873M4843j29484j00152j29993
13121A322138j65775O4023K1690K1592J16039R7222r5689j10585L6728J51577
13111A458960k00k43535k09373l6003J73011R1435J00079m8490N6048J87580O7986
13100A597498j94693j42289K5185P1298p3707L8768L5378p133N1187j30602j26490
13089A144400Q898K14431J32047K6436Q0828P8408j85343j22402R004J68219K0138
$$ plain form
13162 1444550 1463836 1474306 1545145 1482351 1309369 1369810 1506533 1364991 1264678 1365883
13152 1365883 1336814 1269470 1139285 1212772 1275453 1179634 1077875 1281228 1347946 1243145
13142 1243145 1246713 1443469 1522835 1565966 1536340 1379452 1476593 1453087 1407725 1270802 1392634
13131 1392634 1323607 1153432 1060181 1108333 1387051 1636924 1681767 1552283 1452131 1322138
13121 1322138 1156363 1220386 1242076 1263668 1379707 1476929 1381240 1270655 1307383 1458960
13111 1458960 1458760 1215225 1005852 969849 1142860 1234295 1334374 1285884 1341932 1529512 1597498
13100 1597498 1402805 1260516 1285701 1356999 1283292 1322060 1357438 1350305 1401492 1270890 1144400
13089 1144400 1153298 1367729 1499776 1526212 1607040 1685448 1500105 1377703 1386707 1554926 1575064
13078A575064q4584l02775p4205J60569J62839K132m4420R1014o1723p6687R8950
13067A446174L635r5216k2127k6876r2262J35328J86656j23955j5632O2667k2795
13056A435597K4763r0415j09687o2772J52431J22891m1106k1941J60185j61854
13046A408092J0342j9351L7295N1428J67778K21441j24772k06368k643m9376p9682
13035A414184O549m8566o3007k0029J32220o8131n2841K57119J36797q9254j8378
13024A586663r7260o9039L8257K6476L5076J82011j6522j0165j20384n1876j4418
13013A488819k7445K0869k1790o4932K7653j44919N078R5297j6052M1259O1407
13002A465244K4399o5976k6561K837K151r6399q6592j49830M3680R3015n1051
$$ plain form
13078 1575064 1490480 1187705 1113500 1274069 1436908 1439040 1394620 1485634 1423911 1347224 1446174
13067 1446174 1449809 1354593 1332466 1305590 1213328 1348656 1535312 1411357 1395725 1458392 1435597
13056 1435597 1460360 1369945 1260258 1197486 1349917 1472808 1431702 1409761 1569946 1408092
13046 1408092 1418434 1399083 1436378 1487806 1655584 1877025 1752253 1545885 1543242 1493866 1414184
13035 1414184 1420733 1372167 1309160 1289131 1421351 1353220 1300379 1557498 1694295 1605041 1586663
13024 1586663 1489403 1420364 1458621 1485097 1520173 1702184 1685662 1675497 1555113 1503237 1488819
13013 1488819 1461374 1482243 1460453 1395521 1423174 1278255 1283333 1378630 1362578 1403837 1465244
13002 1465244 1489643 1423667 1397106 1399943 1402094 1305695 1219103 1069273 1112953 1205968 1154917
12991A154917N017J08783J23424J55952Q344n9457N0066k0082k2418N7061M5482
12980A607089J37466j08513j07399R5755k0670j69889J20863J16269m2387J2932
12970A641516m2065k0096J13765M7135J40674j15531l5781N8158J39145j9633
12960A907287j58118j29742K4943j01864M9307J45507J26399L0575K0124K4417
12950A938835j33006j8668J2510j36818k50447l3287N3673P5241j0161R7140J06232
12939A701244m029M4020J34107j30775J5951J16050j79306j85771j1202M6080
12929A546369J88456J9793M917P7867m2162p3L9736O4674Q0556k22408r7806R7823
12917A757742n6090k941N4129j15080j17570J27114K21135N747o6454m1784L429
$$ plain form
12991 1154917 1159934 1268717 1392141 1548093 1556437 1496980 1547046 1526964 1504546 1561607 1607089
12980 1607089 1744555 1636042 1528643 1624398 1603728 1433839 1554702 1670971 1628584 1641516
12970 1641516 1599451 1579355 1693120 1740255 1880929 1765398 1729617 1787775 1926920 1907287
12960 1907287 1749169 1619427 1644370 1542506 1591813 1737320 1863719 1894294 1914418 1938835
12950 1938835 1805829 1787161 1799671 1662853 1412406 1379119 1432792 1508033 1497872 1595012 1701244
12939 1701244 1697215 1741235 1875342 1744567 1760518 1876568 1697262 1511491 1500289 1546369
12929 1546369 1734825 1754618 1759535 1837402 1795240 1795167 1834903 1899577 1980133 1757725 1659919 1757742
12917 1757742 1701652 1698711 1752840 1637760 1520190 1647304 1868439 1874186 1807732 1765948 1769377
12906A769377N2283L841o8810n5588P7919N8439j93924n4017k8929L4749K4652
12895A619992j5658k1888m9755J23964K5200q054K48754J11879J32461k9706Q3237
12884B220426n2834m2020m4214j36088k9938N439k3512O5622k00203j07900N2262
12873A707040J18311j6450Q6077J63259l856j04405m7993l7073L6440L4573l5554
12862A900369M9235P6557l7697j01021m8700r2101p4113J37683p2347n9229K86240
12851A964876J53971l7946J29032p5431j36513q1965l0588J4845j10864k1451
12841A767966j26212p6743J0776J30120K14075R7460M8564Q73j03034j57496K04091
12830B010440R685N9955j07341m1664j3984R077j0273L4818j8221n6765j41260
$$ plain form
12906 1769377 1821660 1825501 1756691 1701103 1779022 1837461 1643537 1589520 1560591 1595340 1619992
12895 1619992 1604334 1582446 1532691 1656655 1681855 1673801 1922555 2034434 2166895 2137189 2220426
12884 2220426 2167592 2125572 2081358 1945270 1915332 1920771 1897259 1962881 1762678 1654778 1707040
12873 1707040 1825351 1808901 1894978 2058237 2054381 1949976 1901983 1864910 1901350 1935923 1900369
12862 1900369 1949604 2026161 1988464 1887443 1838743 1746642 1672529 1810212 1737865 1678636 1964876
12851 1964876 2118847 2080901 2209933 2134502 1997989 1916024 1885436 1900281 1789417 1767966
12841 1767966 1641754 1565011 1575787 1705907 1919982 2017442 2066006 2066879 1963845 1806349 2010440
12830 2010440 2020125 2080080 1972739 1931075 1917091 1926168 1915895 1950713 1932492 1875727 1734467
12819A734467o3456r2452Q3217K52431P0371j82870R3864K74564K01325q9013
12809B282448k20440M2878J58050Q2900m4952l7025O0309L9953j10040j44058
12799B110023m6741L6593j21394j16869M8775j8353J22731Q2341L7273J22246
12789B256625J30843J7908j11200j78721j0817j7624R050R5064P3956j19203n2090
12778B093791o7487L3255R7330j5526o8546j58830k01239k293J11624J23976J02079
12767B048134r1497k13205k5037J53606L4960m4580K2970O5471j4137J01217J50189
12756B188091K3903j38401r9695q9632l4601m70L9274J13837J03408M2032J65647
12745B313393k3180q4878M5732k082j79517l3074J01554o9368J43626K12859m5977
$$ plain form
12819 1734467 1671011 1578559 1661776 1914207 1984578 1801708 1895572 2170136 2371461 2282448
12809 2282448 2062008 2104886 2262936 2345836 2300884 2263859 2324168 2364121 2254081 2110023
12799 2110023 2063282 2099875 1978481 1861612 1910387 1892034 2014765 2097106 2134379 2256625
12789 2256625 2387468 2405376 2294176 2115455 2104638 2087014 2096064 2191128 2265084 2145881 2093791
12778 2093791 2026304 2059559 2156889 2141363 2072817 1913987 1712748 1710455 1822079 1946055 2048134
12767 2048134 1956637 1743432 1718395 1872001 1906961 1862381 1885351 1950822 1936685 2037902 2188091
12756 2188091 2211994 2073593 1973898 1884266 1849665 1849195 1888469 2002306 2105714 2147746 2313393
12745 2313393 2290213 2205335 2251067 2248985 2069468 2036394 2137948 2068580 2212206 2425065 2379088
12734B379088k4376J823j03486j43083P989O4154J7169n677k9878L4510P7799
12723B276032J67287J25067j33887l3953k5131n999r9896l589J19786J29595R5196
12712B610508P6240l36321j10550J43410J31839j52754r8778P5740J32274J9809
12702B491417n5676N7065m4075j30474j67852J40240J86860M8140K0525j50194
12692B395976j32605M0766J60595P3643p1906K5754J35033N8989j04270k2645
12682B559330L02081l3394j33653j5065o3430n548o7934Q0532N8635p9530J3535
12671B615559K8084J18889R339j72932p5390m8127J24881L6391j67068j63426
12661B306200N6832J30625J11537L2841q3801L4543P923P1864k409j29572O1973
$$ plain form
12734 2379088 2354712 2356535 2253049 2109966 2117955 2182109 2199278 2193601 2163723 2198233 2276032
12723 2276032 2443319 2568386 2434499 2400546 2375415 2369416 2269520 2265931 2385717 2515312 2610508
12712 2610508 2686748 2350427 2239877 2383287 2515126 2362372 2263594 2339334 2471608 2491417
12702 2491417 2435741 2492806 2448731 2318257 2150405 2290645 2477505 2525645 2546170 2395976
12692 2395976 2263371 2304137 2464732 2538375 2466469 2492223 2627256 2686245 2581975 2559330
12682 2559330 2861411 2828017 2694364 2679299 2615869 2610321 2542387 2622919 2681554 2602024 2615559
12671 2615559 2643643 2762532 2771871 2598939 2523549 2475422 2600303 2636694 2469626 2306200
12661 2306200 2363032 2493657 2605194 2638035 2554234 2588777 2596700 2668564 2666155 2536583 2598556
12650B598556K49628J17948j58891j27845O0224J27753J74540j74212n2106j83176
12640B632419p3204j51182J22555K82071k4603j84399n4937q6880k71N786J4922
12629B482277J06029P9234j6028J12213K7612j20513j18383n6924K1502J11272
12619B628291Q5324M5778O3605j7624j11640n1676l942n5839j22043O8094J81834
12608B710162Q8078k26507j31162P4662J35911L3499q028P0411L9895p3734n1273
12597B661914j42359j81110p2771R4835K01713K60029J48949Q528n0631l2007
12587B897090J6074R798k3475r248J06957j8537J53749L9023j40555j52997m5632
12576B832247R262l7493k15788o4628K16018K50561j29279j12005J01672J35467
$$ plain form
12650 2598556 2848184 2966132 2807241 2679396 2739620 2867373 3041913 2867701 2815595 2632419
12640 2632419 2559215 2408033 2530588 2812659 2788056 2603657 2548720 2461840 2461569 2467355 2482277
12629 2482277 2588306 2667540 2651512 2763725 2791337 2670824 2552441 2495517 2517019 2628291
12619 2628291 2713615 2759393 2822998 2805374 2693734 2642058 2638116 2582277 2460234 2528328 2710162
12608 2710162 2798240 2571733 2440571 2515233 2651144 2684643 2676615 2747026 2786921 2713187 2661914
12597 2661914 2519555 2338445 2265674 2360509 2562222 2822251 2971200 2979728 2929097 2897090
12587 2897090 2913164 2922962 2899487 2890239 2997196 2978659 3132408 3171431 3030876 2877879 2832247
12576 2832247 2841509 2804016 2588228 2523600 2739618 2990179 2860900 2748895 2850567 2986034
12566B986034p0867k9315j12871j35434J02597J37884J5281J40172J22481L3677
12556C189639k6817q1743K4212J39354O2741j30236q5230j13530j9020j4774J48600
12545C093196N1445N9763N121J0192l90M9204l1356k95170k17224J28507J82580
12534C035868K26529j7573j40056l9739L7093K9328l9303j66165P1149Q6393p1175
12523C012349l8077N940O5123K10301M2735j27389p7561P4497J10543m2375j3270
12512C222816K7285N3944n7238O9768O6147q2443j21538p7351m6655n9041n4338
12501B941356m9318J70849J17632j0998p3956M3144P0326J14697k9981j97712
12491C096039r1499J95008P3863p127M1157J44301l0768j93080j73583p1592P5726
$$ plain form
12566 2986034 2915167 2885852 2772981 2637547 2740144 2878028 2893309 3033481 3155962 3189639
12556 3189639 3162822 3081079 3105291 3244645 3307386 3177150 3091920 2978390 2959370 2944596 3093196
12545 3093196 3144641 3204404 3209525 3219717 3219327 3268531 3237175 2942005 2724781 2853288 3035868
12534 3035868 3262397 3244824 3104768 3065029 3102122 3131450 3092147 2925982 2997131 3083524 3012349
12523 3012349 2974272 2980212 3045335 3255636 3298371 3170982 3093421 3167918 3278461 3236086 3222816
12512 3222816 3250101 3304045 3246807 3316575 3382722 3300279 3178741 3101390 3054735 2995694 2941356
12501 2941356 2892038 3062887 3180519 3169521 3095565 3138709 3209035 3323732 3293751 3096039
12491 3096039 3004540 3199548 3273411 3266284 3307441 3451742 3420974 3227894 3054311 2982719 3058445
12480C058445K57208J84557k4550O0899J85942M9955j25939k27325k01449n710
12470C212033O7206l9478J71832K16666R731j77865j5295O7208j16217K4760K88381
12459C708962J07133j42152p2749k10851k79128M8889J42491K14570Q0021j23017
12449C474169J8777L7940K3215K8534k86895k1678K105M413J00325J66158J57080
12438C704143k4067l8659j398j28407j54700J1439J91068O0150j04072L6849J18123
12427C670469k09204M7322K33552j05488k19772q9046N2923J36952J48016J49277
12417C815001K6642J5701K78551J16528p1531j12726j72899j89446j4694r8521
12407C592606N2830J82910o468m4605N862P6157N1367j25802k6992l4092J29387
$$ plain form
12480 3058445 3315653 3500210 3475660 3536559 3722501 3772456 3646517 3419192 3217743 3212033
12470 3212033 3279239 3239761 3411593 3628259 3637990 3460125 3444830 3512038 3395821 3420581 3708962
12459 3708962 3816095 3673943 3601194 3390343 3111215 3160104 3302595 3517165 3597186 3474169
12449 3474169 3492946 3530886 3554101 3582635 3295740 3274062 3276167 3280580 3380905 3547063 3704143
12438 3704143 3680076 3641417 3640019 3511612 3356912 3368351 3559419 3619569 3515497 3552346 3670469
12427 3670469 3461265 3508587 3742139 3636651 3416879 3327833 3380756 3517708 3665724 3815001
12417 3815001 3841643 3857344 4135895 4252423 4180892 4068166 3895267 3705821 3691127 3592606
12407 3592606 3645436 3828346 3821878 3777273 3783135 3859292 3910659 3784857 3757865 3723773 3853160
12396C853160K2862K5743j7825J62794J33723n2847J09135j23242j7057m845j19904
12385C971697j39J10797j4786j55074j58251N7243n2110M0836O2178k8956j4672
12374C818763j24047r8298M3215K30664J9715o9505L3135O2880J25964J89177
12364D231663J41496j50056k60510N3836M9025N064N0387l075j72358N1181j40096
12353C856557M707k5906M6324M0357j7588l2180m9855J49678K08995j4834J03419
12342D269674R6389n4123j81917j7334R6431K7296k3205Q8979K4699M3790j18702
12331D251977j05680n8959J35019q9458q4404p2870Q6420R3317Q5464Q6271l0425
12320D296672L8820l9442l30682m393R5330O8702O8729J68128o132j64140j43847
$$ plain form
12396 3853160 3876022 3901765 3883940 4046734 4180457 4127610 4236745 4113503 4096446 4091601 3971697
12385 3971697 3971558 4082355 4067569 3912495 3754244 3811487 3759377 3800213 3862391 3833435 3818763
12374 3818763 3694716 3596418 3639633 3870297 3890012 3820507 3853642 3916522 4042486 4231663
12364 4231663 4373159 4223103 3962593 4016429 4065454 4070518 4120905 4117830 3945472 3996653 3856557
12353 3856557 3861264 3835358 3881682 3922039 3904451 3872271 3822416 3972094 4181089 4166255 4269674
12342 4269674 4366063 4311940 4130023 4112689 4209120 4236416 4213211 4302190 4326889 4370679 4251977
12331 4251977 4146297 4087338 4222357 4132899 4048495 3975625 4062045 4155362 4240826 4327097 4296672
12320 4296672 4335492 4296050 3965368 3960975 4056305 4125007 4193736 4361864 4355732 4191592 4047745
12309D047745P9433J15155j09276R22J0320j6818J46495J68661O0811j34228k47960
12298D121260o0772N3935J45637J77467P5025p182o3502J07994J2043j52331j09319
12287D300255l6363j73554J9090O7320R7056k9064J30409J9735J38759n555p6863
12276D451225R8172K9786o1845J5031J16611L5910o5346j56274K6423J16652j14444
12265D491901Q0547N6877p8666n9112P6647K1906n2671q7719p7538K9317K02648
12254D604137J00075l826k06429N6792K2011j7346O6172J23810j52819k61178
12244D331399m2305J9107Q3438P6378O3690J58127O5659K8588J04706l4472j33458
12233D720857N548k15429k9177O9536K04830K49512Q855j05336k06654O3009J40419
$$ plain form
12309 4047745 4127178 4242333 4133057 4133979 4144299 4127481 4273976 4442637 4503448 4369220 4121260
12298 4121260 4060488 4114423 4260060 4437527 4512552 4505370 4441868 4549862 4561905 4409574 4300255
12287 4300255 4263892 4090338 4109428 4176748 4273804 4244740 4375149 4394884 4533643 4528088 4451225
12276 4451225 4549397 4579183 4517338 4532369 4648980 4684890 4619544 4463270 4489693 4606345 4491901
12265 4491901 4572448 4629325 4550659 4491547 4568194 4590100 4537429 4449710 4372172 4401489 4604137
12254 4604137 4704212 4700386 4493957 4550749 4572760 4555414 4621586 4745396 4592577 4331399
12244 4331399 4289094 4308201 4391639 4468017 4531707 4689834 4755493 4784081 4888787 4854315 4720857
12233 4720857 4726405 4510976 4481799 4551335 4756165 5005677 5014532 4909196 4702542 4765551 4905970
12222D905970O8934j14023p1352K1965M7938m3337j24829L8202J07336j14463
12212D722341n6649J3270J24498M9976J10471P7885k03290j08855J27631J51952
12202E009230P9088m4007j09163j0965k4813n44L1256k8498R611O8970l2670l1753
12190D915742K2303l8376m3433p2239m2376Q0981R1727j49848j71293J60853Q2522
12179D836563L2277L7945J55183J01742K5360l3608j69275j87384Q674K14772
12169E022249K00434Q9405j48929o8607K1066n3280k0533J9891l547M7066R1945
12158E197160p5508j19958M24p1010J5208L7373J74626J32750m6941R3166P9142
12147E416432R3616j40525o8954M8945J6979j58369j0216j11121k10241n5628
$$ plain form
12222 4905970 4974904 4860881 4789529 4811494 4859432 4816095 4691266 4729468 4836804 4722341
12212 4722341 4665692 4678962 4803460 4853436 4963907 5041792 4838502 4729647 4857278 5009230
12202 5009230 5088318 5044311 4935148 4924183 4899370 4898826 4930082 4901584 4911195 4980165 4947495 4915742
12190 4915742 4938045 4899669 4856236 4783997 4741621 4822602 4914329 4764481 4593188 4754041 4836563
12179 4836563 4868840 4906785 5061968 5163710 5189070 5155462 4986187 4798803 4807477 5022249
12169 5022249 5222683 5312088 5163159 5094552 5115618 5062338 5041805 5061696 5058149 5105215 5197160
12158 5197160 5121652 5001694 5002118 4931108 4946316 4983689 5158315 5291065 5244124 5337290 5416432
12147 5416432 5510048 5369523 5300569 5349514 5366493 5208124 5197908 5086787 4876546 4820918
12137D820918J47967K9175n376J35542L1790o3463j23776l2583J17274J80305
12127E237773j5272k38275q4968J4374R6824J2148O859J0999m0886J35644K514
12116E137734n258L1061N5448J61534J18222L9238j37502o936l7145k63849r8633
12105D993914M7946J20591P8317K4365k0078J6434l673o1888j04844q7314J21520
12094E125290l067p7692J77536J2674q9198n1136K30955Q6661J05523K8125J2223
12083E557894o7620j33161K1096q1021j15615n3284j9227P6401j49219r6086J07220
12072E047378K11056J59842P3515k28015j97081k1990Q8237L4001Q9523J27904
12062E384370J55241N1067p6761j12210j38757q7588J09537J77591N3121r6809
$$ plain form
12137 4820918 4968885 4998060 4992684 5128226 5160016 5096553 4972777 4940194 5057468 5237773
12127 5237773 5222501 4984226 4899258 4913632 5010456 5022604 5029463 5040462 4999576 5135220 5137734
12116 5137734 5132476 5163537 5218985 5380519 5498741 5537979 5400477 5393541 5356396 5092547 4993914
12105 4993914 5041860 5162451 5240768 5265133 5245055 5261489 5257816 5195928 5091084 5003770 5125290
12094 5125290 5122223 5044531 5222067 5234741 5145543 5094407 5325362 5412023 5517546 5545671 5557894
12083 5557894 5490274 5357113 5378209 5297188 5181573 5128289 5109062 5185463 5036244 4940158 5047378
12072 5047378 5258434 5418276 5491791 5263776 5066695 5044705 5132942 5166943 5256466 5384370
12062 5384370 5539611 5590678 5513917 5401707 5262950 5175362 5284899 5462490 5515611 5418802
12052E418802q7163q3012k5906j43811M671J46452R4046N4080j93649O6601J3274
12041E264385J38066R0411K21024l9443n9124o3959Q25J32486P0544j0092J05791
12030E850914j96001k12451j31340m8705k9439K10590M0025j57754J22302J97219
12020E645360m1238O0853j35737r8610j16395J78519l3500r6857N8825j71757
12010E249463p1721J83421L06331J63537k53539l03912j70578J49474K11401m3794
12000E420083Q8382J84069M5650n3648N1272o0739p7050m1775q4621n0660n3782
11989E367181R998J76196k2129j08830k3162J44915m559j81778j55185P4772N8162
11978E335581J26458J5748j56081j5797J06848k6685r9621j89836K50588N3405
$$ plain form
12052 5418802 5331639 5248627 5222721 5078910 5083581 5230033 5324079 5378159 5184510 5251111 5264385
12041 5264385 5402451 5492862 5713886 5674443 5615319 5551360 5552185 5684671 5755215 5745123 5850914
12030 5850914 5654913 5442462 5311122 5262417 5232978 5443568 5483593 5325839 5448141 5645360
12020 5645360 5604122 5664975 5529238 5430628 5314233 5492752 5459252 5362395 5421220 5249463
12010 5249463 5177742 5361163 5667494 5831031 5577492 5273580 5103002 5252476 5463877 5420083
12000 5420083 5508465 5692534 5738184 5684536 5735808 5675069 5598019 5556244 5471623 5420963 5367181
11989 5367181 5377179 5553375 5531246 5422416 5399254 5544169 5539610 5357832 5202647 5277419 5335581
11978 5335581 5462039 5477787 5321706 5305909 5412757 5386072 5286451 5096615 5347203 5400608
11968E400608j12156J07728m6121Q2287J0107o2482m0916k24285o2876k485J44705
11957E194114J19010j42869j42531J42998P3051o2714J8990o928q4890k0211J6288
11946E104308J0304Q8255K7139q2449j33048J6527K9951L4489O0141J8040J03869
11935E277526Q2538J01156J92881k48118j14500k773r9120r8135o27P3668j85631
11924D978865o465J79281R8068J24089K0150o6190j60761j48344p6517N0650J12351
11913E105177P0410Q0875M1030J68595m0772k30999n5087Q7812k4710O8691r2130
11902E178892j87884l1744J85345L5506L8177P5248l1275j05214p4796k2752J09696
11891E169199l1222j4302P1985J33772p2269j21271J1449l056n4862J60399o1759
$$ plain form
11968 5400608 5288452 5396180 5350059 5432346 5442453 5379971 5339055 5114770 5051894 5049409 5194114
11957 5194114 5313124 5170255 5027724 5170722 5243773 5181059 5200049 5193121 5108231 5088020 5104308
11946 5104308 5114612 5202867 5230006 5147557 5014509 5031036 5060987 5095476 5155617 5173657 5277526
11935 5277526 5360064 5461220 5654101 5405983 5291483 5288710 5189590 5091455 5090828 5164496 4978865
11924 4978865 4972400 5151681 5249749 5373838 5393988 5327798 5167037 5018693 4942176 4992826 5105177
11913 5105177 5175587 5256462 5297492 5466087 5425315 5194316 5139229 5227041 5202331 5271022 5178892
11902 5178892 4991008 4959264 5144609 5180115 5218292 5293540 5262265 5157051 5082255 5059503 5169199
11891 5169199 5137977 5123675 5195660 5329432 5257163 5135892 5147341 5144285 5089423 5249822 5188063
11880E188063j35663k633J34604R3025j14821L3324J02868j15939k07077r2051
11870D883700R1826R4412m1741j2038J39568q4078j81581j02109J66219P8478
11860E032656j32683j38174N4760n5423Q878r9259J82206K17384k2325q5152J18027
11849E080895J45482J00932j2014j89353j73640j47952l600J41605l4208j9383
11839D888764j3905K0058j11377m8113M0874n9789r4666p3610O3669J03694M0491
11828D756090j56253n5855P7589M5330J003R0054P6720k4610p9571j7734p1705
11817D641058J1045J72006N0619O4331p679j94121p8485k8491J2555J33688L0414
11806D806940j59418j95681J20922R3723K3312L0623Q3220Q9454J60567O6020
$$ plain form
11880 5188063 5052400 5049767 5184371 5277396 5162575 5195899 5298767 5182828 4975751 4883700
11870 4883700 4975526 5069938 5028197 5016159 5155727 5071649 4890068 4787959 4954178 5032656
11860 5032656 4899973 4761799 4816559 4761136 4770014 4670755 4852961 5070345 5048020 4962868 5080895
11849 5080895 5226377 5327309 5315295 5125942 4952302 4804350 4800750 4942355 4908147 4888764
11839 4888764 4874859 4894917 4783540 4735427 4776301 4716512 4621846 4548236 4611905 4715599 4756090
11828 4756090 4599837 4543982 4621571 4666901 4667904 4757958 4834678 4810068 4730497 4712763 4641058
11817 4641058 4652103 4824109 4874728 4939059 4931380 4737259 4658774 4630283 4642838 4776526 4806940
11806 4806940 4647522 4451841 4572763 4666486 4689798 4720421 4803641 4893095 5053662 5119682
11796E119682o3855k44622k61069m9069R1195J57919j2557k4392N1211j40195
11786D624248N7751m2649k1051J0381j2778r4444J5345J77722O1948j69697j36357
11775D470419L2259o9953J04763l4831N4660l0136j76000o5501J61465l2037l1244
11764D383864r6824L1771J34557J33991P3731q6402j70932J53679O4119l06588
11754D314966r909K23264J03244r005P6284N6971j02918r6543j48234j09271M6167
11743D345016R4574J12346N8862K1281M5932l1154p4018j18904q2225P320J13962
11732D492992M5392r8688k39392q4755J60752N6688q4263k7750p4510R4213O4271
11721D304950J46428o8323O0518P6987r8367j16500o0503r1250K1701J53138k0214
$$ plain form
11796 5119682 5055827 4811205 4550136 4501067 4592262 4750181 4737624 4713232 4764443 4624248
11786 4624248 4681999 4639350 4618299 4628680 4615902 4521458 4536803 4714525 4776473 4606776 4470419
11775 4470419 4502678 4432725 4537488 4502657 4557317 4527181 4351181 4285680 4447145 4415108 4383864
11764 4383864 4287040 4318811 4453368 4587359 4661090 4574688 4403756 4557435 4621554 4314966
11754 4314966 4305057 4528321 4631565 4622560 4698844 4755815 4652897 4556354 4408120 4298849 4345016
11743 4345016 4439590 4551936 4610798 4632079 4678011 4646857 4572839 4453935 4371710 4379030 4492992
11732 4492992 4538384 4439696 4200304 4115549 4276301 4332989 4248726 4220976 4146466 4240679 4304950
11721 4304950 4451378 4383055 4443573 4520560 4422193 4305693 4245190 4153940 4175641 4328779 4308565
11710D308565N0311l4932r5147q443j84810r6119j94459n7468K07617J24999J38139
11699D158253R0713J0926j11246k280j51511P0169N3278O9513o8547K4057O0480
11688D203805n1943K668J3358q519o9222k1775n6305k2205n7564j41034J78654
11677C969918Q7229m1003M2021j05232k69691J94012k0389l5206K71268N8195
11667D151122r9373r1304l4996J37122j21445j27640J86187J88867N0649j43202
11657D095987k16696M0671N3868n4032n6631Q1788p0298j93905Q7995Q3530j03160
11646C749117j29178J58593R1652k8386l7544j1905n3986k6896L240n6473q6061
11635C572173J51865O5836R2981O9327o2831j64420k42027J42282L9559j62632
$$ plain form
11710 4308565 4358876 4323944 4228797 4220354 4035544 3939425 3744966 3687498 3895115 4020114 4158253
11699 4158253 4248966 4259892 4148646 4146366 3994855 4065024 4118302 4187815 4119268 4143325 4203805
11688 4203805 4151862 4154530 4167888 4159369 4090147 4068372 4012067 3989862 3932298 3791264 3969918
11677 3969918 4057147 4016144 4058165 3952933 3683242 3877254 3856865 3821659 4092927 4151122
11667 4151122 4051749 3960445 3925449 4062571 3941126 3813486 3999673 4188540 4239189 4095987
11657 4095987 3879291 3919962 3973830 3919798 3863167 3944955 3874657 3680752 3768747 3852277 3749117
11646 3749117 3619939 3778532 3870184 3841798 3804254 3792349 3738363 3711467 3714707 3658234 3572173
11635 3572173 3724038 3789874 3882855 3952182 3889351 3724931 3482904 3625186 3664745 3502113
11625C502113J28356R2100J362j8238k8351j0978k024j1267m5816M956k19264
11614C392949p065K23624n0655K419p4355l1970M4634J07919q7278j09762j2421
11603C398039j1299M2230M4265q242r268O5652J32701N008r6245o3951j35965
11592C362925N9418J92622n7137j47971m7153M4486P6995O5465j72368K7795M3552
11581C448629q0734J62489M5856j38413P9487o8778j58730p0194j04419j791P3289
11570C186691q1765K3376R2206M3973l8799r7762J89750K7342l8116L6963p1303
11559C272556j60908J1399K04377Q6269N3426L8548o2883m2865l6407k7994r8936
11548C236582j8081P1159M8026K05376L2377k36707q9698R4787J82932m3830J1431
$$ plain form
11625 3502113 3630469 3722569 3723931 3705693 3677342 3666364 3664340 3653073 3607257 3612213 3392949
11614 3392949 3385884 3609508 3558853 3561272 3486917 3454947 3499581 3607500 3520222 3410460 3398039
11603 3398039 3386740 3428970 3473235 3464993 3455725 3521377 3654078 3659086 3562841 3498890 3362925
11592 3362925 3422343 3614965 3557828 3409857 3362704 3407190 3484185 3549650 3377282 3405077 3448629
11581 3448629 3367895 3530384 3576240 3437827 3517314 3448536 3289806 3219612 3115193 3113402 3186691
11570 3186691 3104926 3128302 3220508 3264481 3225682 3127920 3317670 3345012 3306896 3343859 3272556
11559 3272556 3111648 3123047 3327424 3413693 3467119 3505667 3442784 3399919 3363512 3335518 3236582
11548 3236582 3218501 3289660 3337686 3543062 3575439 3338732 3249034 3343821 3526753 3482923 3494354
11537C494354n3755q1654n5840j22982K00955K4906L5489q2028k72548j9360K1268
11526C088805M9302J51346k8816j5948j13090Q153O9437j08206k4126m706r3466
11515B978685q2419P93j2414o6410K7141k8579k8112R4160J14064O0045N9527
11504C116481j57499j50731q6422Q5053M098k8899J53712J17938j48259j99505
11494B705967o9065j7718J99374N1036o8961j80774l3284J86716J45768p0062
11484B848997j61105m4933R593p5823N2286J6314M4394N9113o9602j8362j54861
11473B506011k9493r6826J13098J23484J32217O5396L2768P2676M6430j45074
11463B820687q313K3852K18k6407m8394p8680j7064o1305k9236m8362J48981k3572
$$ plain form
11537 3494354 3440599 3358945 3303105 3180123 3381078 3405984 3441473 3359445 3086897 3067537 3088805
11526 3088805 3138107 3289453 3260637 3244689 3131599 3139752 3209189 3100983 3076857 3072151 2978685
11515 2978685 2896266 2897059 2884645 2818235 2845376 2816797 2788685 2882845 2996909 3056954 3116481
11504 3116481 2958982 2808251 2721829 2806882 2810980 2782081 2935793 3053731 2905472 2705967
11494 2705967 2636902 2619184 2818558 2869594 2800633 2619859 2586575 2773291 2919059 2848997
11484 2848997 2687892 2642959 2652552 2576729 2629015 2645329 2689723 2748836 2679234 2660872 2506011
11473 2506011 2476518 2379692 2492790 2616274 2748491 2813887 2846655 2919331 2965761 2820687
11463 2820687 2812374 2836226 2836444 2810037 2761643 2682963 2665899 2604594 2575358 2526996 2675977 2652405
11451B652405j04030M0899p0294K0346l1557M0478Q3476j42272j73727N0832P5969
11440B442525J79210J58782L3052m069O570l9049j27152m8408k8080p4368n074
11429B493939j57174k4599K0859J46860J32162o4661P9530M6210k5781o8291l6887
11418B542167j0721p4326J21569J1972N1840n3898N0969L0327O8882N4398j09473
11407B683706Q1723k7109j35371r1981l1981j04017M4327J10989Q7335k20552
11397B397069q2642R375K28399J05773k0976K756L070j45303k59206O7733J25528
11386B431576l0089k07638m1971N2572J03080m038J6822P5389l5518k50948k9153
11375B080084Q0882J29438q3753q6376M2792Q7921O4107L7894J33716r093P1380
$$ plain form
11451 2652405 2548375 2589274 2518980 2539326 2507769 2548247 2631723 2489451 2315724 2366556 2442525
11440 2442525 2621735 2780517 2813569 2809500 2816070 2777021 2649869 2601461 2573381 2499013 2493939
11429 2493939 2336765 2312166 2333025 2479885 2612047 2547386 2626916 2673126 2647345 2579054 2542167
11418 2542167 2531446 2457120 2578689 2590661 2642501 2588603 2639572 2669899 2738781 2793179 2683706
11407 2683706 2765429 2738320 2602949 2510968 2478987 2374970 2419297 2530286 2617621 2397069
11397 2397069 2314427 2323802 2552201 2657974 2636998 2639754 2642824 2497521 2238315 2306048 2431576
11386 2431576 2401487 2193849 2151878 2204450 2307530 2303492 2320314 2395703 2360185 2109237 2080084
11375 2080084 2160966 2290404 2206651 2120275 2163067 2250988 2315095 2352989 2486705 2477612 2548992
11364B548992m9064j36964r172P9152m6429p0659j02409r4002R0834N6050L7622
11353B303951N1416n2059m0601k3256L1320j54445m2757J66860j00161L460R3372
11342B237100k7890M6459j55656J8931J3140K5228j30961J17273J62025J11772
11332B417421j54101r9612J98222L0516p1336j29444N7261n0342J19299R0387
11322B408271k1278j73886n7277J52896N6582j2847q8578P3399o8000p4038j17067
11311B078177q1981K5765J7798P36k7661m9010l2445J15324k1042o9730J24644
11300B080575L3671L1190p4236j7650J82707K1525l18491l57076J6287J93450
11290A791952R6345o2424J66595R6071J81062J75227k1178k00723j35118J7881
$$ plain form
11364 2548992 2499928 2362964 2353792 2432944 2386515 2315856 2213447 2119445 2210279 2266329 2303951
11353 2303951 2355367 2303308 2262707 2239451 2270771 2116326 2073569 2240429 2140268 2143728 2237100
11342 2237100 2209210 2255669 2100013 2118944 2132084 2157312 2026351 2143624 2305649 2417421
11332 2417421 2263320 2163708 2361930 2392446 2321110 2191666 2248927 2198585 2317884 2408271
11322 2408271 2386993 2213107 2155830 2308726 2365308 2352461 2263883 2337282 2269282 2195244 2078177
11311 2078177 1996196 2021961 2039759 2040495 2012834 1963824 1931379 2046703 2025661 1955931 2080575
11300 2080575 2114246 2145436 2071200 2053550 2236257 2257782 1939291 1582215 1598502 1791952
11290 1791952 1888297 1825873 1992468 2088539 2269601 2444828 2423650 2222927 2087809 2105690
11280B105690p5190O5748R0358n0989N43P3564o1078j10982o7488J05965N1151
11269B127292j11471r1125M0159n5728J9784O1803j03213j30775J9600J05424
11259A881750K00524n3461j72439K944K5959M1799l8344n2668M9833M2073j3943
11248A914027M6053J29382O0585J29898j24511p6188l633q2830l6893J5483J3647
11237A985020J61324K25708J4212k06010j13937j52591p0422l3291Q9448J82893
11227B082354N2891j03332l9607M4253n8458o7753P5053o1895r9474n0507O061
11216A779586M8360Q5250N6878J415N9420q4862r5127R2021o7140r7590r913M1001
11204A809299P7877J9699J23939k08904j02045j11347J121M9015O0266O9972m6615
$$ plain form
11280 2105690 2030500 2096248 2186606 2135617 2136160 2209724 2148646 2037664 1970176 2076141 2127292
11269 2127292 2015821 1924696 1964855 1909127 1928911 1990714 1887501 1756726 1776326 1881750
11259 1881750 2082274 2028813 1856374 1859318 1885277 1927076 1888732 1836064 1885897 1927970 1914027
11248 1914027 1960080 2089462 2150047 2279945 2155434 2079246 2075613 1992783 1955890 1971373 1985020
11237 1985020 2146344 2372052 2386264 2180254 2066317 1913726 1843304 1810013 1899461 2082354
11227 2082354 2135245 2031913 1992306 2036559 1978101 1910348 1985401 1923506 1824032 1773525 1779586
11216 1779586 1827946 1913196 1970074 1971489 2030909 1946047 1850920 1942941 1875801 1778211 1768298 1809299
11204 1809299 1887176 1906875 2030814 1821910 1719865 1608518 1609639 1658654 1718920 1788892 1742277
11193A742277J72978J20570k8503l418o7159p4394n4451L5846j0332j5259K4208
11182A842363k340J7405O7579l3411j46259j56873o0314M1154J28638J59094j47050
11171A709986j59014j385M5575q4294m11K98958j5736N7679l9052j05224o8054
11160A639028L1742j46964n0670J9347Q7820J49508J29430K6440J3834k81202
11150A618313M6213K22881j18613l9047k8763l8728N367m6121N762j8394P9778
11139A688648L3638N617L7114M661K149J38152J34211j0869k18428r1448j52166
11128A571279j39228J532N4030J1569n9174P3660J63797R8853Q8449j9350M2175
11117A887592j71439p6533j7456R537l348q0457j54787M100p320m6924J0738J19582
$$ plain form
11193 1742277 1915255 2035825 2007322 2003904 1936745 1862351 1807900 1843746 1833414 1818155 1842363
11182 1842363 1840023 1857428 1925007 1891596 1745337 1588464 1528150 1569304 1697942 1857036 1709986
11171 1709986 1550972 1549587 1595162 1510868 1510457 1809415 1793679 1851358 1812306 1707082 1639028
11160 1639028 1670770 1523806 1473136 1492483 1580303 1729811 1859241 1885681 1899515 1618313
11150 1618313 1664526 1887407 1768794 1729747 1700984 1662256 1667623 1621502 1627264 1608870 1688648
11139 1688648 1722286 1727903 1765017 1769678 1771827 1909979 2044190 2033321 1814893 1723445 1571279
11128 1571279 1432051 1433583 1487613 1499182 1440008 1513668 1677465 1776318 1864767 1845417 1887592
11117 1887592 1716153 1639620 1622164 1631701 1628353 1547896 1393109 1397209 1389889 1342965 1353703 1473285
11105A473285J06675k3812J40687J28048q934r7972j37337n6543O5549j6882j54995
11094A417769P387K25241R0525j97470P0912M290n0557L9065P2254L1735O0376
11083A771527l7963j04362n3513r7796N2700J13921j69333p7014K5215O1822K5541
11072A510745K24907O7882j71797j32880n3406P8529q749K7750k68q2233K07342
11061A667822P6373J4613j6675m3748O8772j89629j1687J08912J9605m7122l7190
11050A610046M4052K01321K32540Q4981N1025J08147J60596k1144j84839j85125
11040B101600l6431J11069q0068N8655J23293L42265L83652K79236J38831r7447
11030C324655k25720k60650m0701J2187J03793J3858J70291L81359L66657K51184
$$ plain form
11105 1473285 1579960 1556148 1696835 1824883 1815949 1717977 1580640 1524097 1589646 1572764 1417769
11094 1417769 1425156 1650397 1740922 1543452 1614364 1618654 1568097 1607162 1679416 1711151 1771527
11083 1771527 1733564 1629202 1575689 1477893 1530593 1644514 1475181 1398167 1423382 1485204 1510745
11072 1510745 1735652 1803534 1631737 1498857 1445451 1523980 1515231 1542981 1542713 1460480 1667822
11061 1667822 1744195 1758808 1742133 1698385 1767157 1577528 1565841 1674753 1694358 1647236 1610046
11050 1610046 1654098 1855419 2087959 2172940 2223965 2332112 2492708 2471564 2286725 2101600
11040 2101600 2065169 2176238 2096170 2154825 2278118 2620383 3004035 3283271 3422102 3324655
11030 3324655 3098935 2838285 2797584 2809771 2913564 2927422 3097713 3479072 3845729 4096913
11020D096913J05378l87232m46487l71653l70192J3136J02147J25838J31869J95200
11010C194917J94146j37373j263j41971k63236j14154j64686k22095K4106o5535
11000B302856j80995J08003K29692J04237k32933k04982N1608j07822p6054k4191
10990A969419l42079k33010p0127m3173k0198Q7755J86627R5835p0000m7069o80
10979A513300l6539l6237K3247M7410Q1513k3219j29990j22423j76425O1793n0756
10968A151674Q9327K14717L1794M0261J26206P3373k03888m9964l128J83943j39621
10957A514694k07611m6218P3659J90757q4728k6552J54284J66272O3729j13535
10947A684751j93778n8765J13754q8288r6496j7606J18314j09175J3981m1001
$$ plain form
11020 4096913 4202291 3815059 3368572 2996919 2626727 2639863 2742010 2867848 2999717 3194917
11010 3194917 3389063 3251690 3250427 3108456 2845220 2731066 2566380 2344285 2368391 2302856
11000 2302856 2121861 2229864 2459556 2563793 2330860 2125878 2177486 2069664 1993610 1969419
10990 1969419 1627340 1394330 1324203 1281030 1260832 1348587 1535214 1631049 1561049 1513980 1513300
10979 1513300 1476761 1440524 1463771 1511181 1592694 1569475 1439485 1317062 1140637 1202430 1151674
10968 1151674 1241001 1455718 1487512 1527773 1653979 1727352 1523464 1473500 1470372 1654315 1514694
10957 1514694 1307083 1260865 1334524 1525281 1440553 1414001 1568285 1734557 1798286 1684751
10947 1684751 1490973 1432208 1545962 1457674 1361178 1343572 1461886 1352711 1366692 1325691
10937A325691o6005J60905L26230Q2686p4146m7515j82741j44023j01054m1893
10927A238135Q1616j5542r401j5563O7798k3593K44228J78933j61804k08281J06789
10916A483315J04833k4251J00453j16611m3464l8699j7299J29416j81673j19663
10906A276357N7067q0467l827J26617J01150m666K9402O1038M571j07202m4598
10895A415442n2526N2597m7434j73526J14646R8382J9269J08454l8480j47969
10885A348855J4352K4459L2270O2010K39263J10586k28640l2360J22155q6153
10875A606797p2782N6662r7390q0724o9441J40261J39621L2017N8146o9070k05181
10864A438916j28407J26097O6689J78955J0351j77925m3062r0449j2890P9911
$$ plain form
10937 1325691 1259686 1420591 1746821 1829507 1755361 1707846 1525105 1381082 1280028 1238135
10927 1238135 1319751 1304209 1294808 1279245 1347043 1323450 1567678 1746611 1584807 1376526 1483315
10916 1483315 1588148 1563897 1664350 1547739 1504275 1465576 1448277 1577693 1396020 1276357
10906 1276357 1333424 1252957 1249130 1375747 1476897 1472231 1501633 1562671 1567242 1460040 1415442
10895 1415442 1362916 1415513 1368079 1194553 1309199 1407581 1426850 1535304 1496824 1348855
10885 1348855 1363207 1387666 1419936 1481946 1721209 1831795 1603155 1570795 1692950 1606797
10875 1606797 1534015 1590677 1493287 1412563 1343122 1483383 1623004 1655021 1713167 1644097 1438916
10864 1438916 1310509 1436606 1503295 1682250 1692601 1514676 1471614 1381165 1368275 1448186
10854A448186Q5944K431K4708j08160n9920l0871J47515Q8195J0624O9624p1272
10843A607004K0966Q1757j36177L4039P8325l7933l9742j4822K1345J55226j31857
10832A638131O4043K6159r7750j05860k18411l8207J29255j11718J5962J03005
10822A404609M7531J71199J40502j46261j53687N8454K7580J31827p4758j1268
10812A595728J16357K5156j67469p3635j330M54J1283r8375j01673j05237J90379
10801A391638J10546M7587j35540k21510J16755J36465J09717M8897K5714j41970
10791A488299q6339K04901o2900j81358j3358m4659j31995j12378K17404K17276
10781A494893J22451K38283Q942q1175j76514n4098J803p103m7460j74817R3343
$$ plain form
10854 1448186 1534130 1536561 1561269 1453109 1393189 1362318 1509833 1598028 1608652 1678276 1607004
10843 1607004 1627970 1709727 1573550 1607589 1685914 1647981 1608239 1593417 1614762 1769988 1638131
10832 1638131 1702174 1728333 1630583 1524723 1306312 1268105 1397360 1285642 1301604 1404609
10822 1404609 1452140 1623339 1763841 1617580 1463893 1522347 1549927 1681754 1606996 1595728
10812 1595728 1712085 1737241 1569772 1496137 1494807 1495261 1506544 1408169 1306496 1201259 1391638
10801 1391638 1502184 1549771 1414231 1192721 1309476 1445941 1555658 1604555 1630269 1488299
10791 1488299 1401960 1606861 1543961 1362603 1349245 1304586 1172591 1060213 1277617 1494893
10781 1494893 1617344 1855627 1864569 1783394 1606880 1552782 1554585 1547482 1500022 1325205 1418548
10770A418548K23763M988L9094n2181O8161r587l0459j20625k7668j31696J26204
10759A508542J5126L5253K16178M1892l9944o1890k8034l8064j40734q258o4800
10748A435267J65516P9152j15638K055Q0130R3467j6035J10962r5650n0875P3509
10737A761860p0443j82708n0263K383Q6365J59866K19521L6661k8086K8500K7871
10726A991527p4622k5464p1135r1599N532k0546j21639m5520J17769K46546Q3479
10715A994328r8702J00170L9961Q7591l1845Q4994R8296J01684R0473j93222r2127
10704B181601r2175l8580Q5621R5949M7437P1467R708L075J10008R959k0172O5526
10692B529424P424j61448J7089O7608n4648K8495P9145Q2777J56703J53620J05675
$$ plain form
10770 1418548 1642311 1647299 1686393 1634212 1702373 1692786 1662327 1541702 1514034 1382338 1508542
10759 1508542 1523668 1558921 1775099 1816991 1777047 1715157 1687123 1649059 1508325 1500067 1435267
10748 1435267 1600783 1679935 1564297 1566352 1646482 1739949 1723914 1834876 1739226 1688351 1761860
10737 1761860 1691417 1508709 1458446 1460829 1547194 1707060 1926581 1963242 1935156 1963656 1991527
10726 1991527 1916905 1891441 1820306 1728707 1734239 1713693 1592054 1546534 1664303 1910849 1994328
10715 1994328 1895626 1995796 2035757 2123348 2091503 2176497 2274793 2376477 2466950 2273728 2181601
10704 2181601 2089426 2050846 2136467 2232416 2279853 2351320 2361028 2364103 2474111 2484070 2463898 2529424
10692 2529424 2536848 2375400 2392489 2460097 2405449 2433944 2513089 2595866 2752569 2906189 3011864
10681C011864o8483j41317J82874N2200k35757j46948J55006K28027L4328N8502
10671C130296O0904l8738r7890P5529J72647J72943K27092R3757r0916K3256J11032
10660C839912M3031L7260J66636m5992j6429J36898K5876P9015K47430J97133
10650D710770J24700J08299K51374L03006K01689K69633J22224J27358K14979
10641F434032L03455L00544L85816K06457L12625N74593P28779Q14028Q52476
10632A0912805J014583J176246J060749Q94912R71725J117466J467848J993794
10624B0610128K708602L587765M820071O408893Q928965J1934342J5761133K0198885
10616I4958784K3518802K2388154J4857301L166491o217895r223632o500941k69166
$$ plain form
10681 3011864 2943381 2802064 2984938 3037138 2801381 2654433 2809439 3037466 3071794 3130296
10671 3130296 3191200 3152462 3054572 3130101 3302748 3475691 3702783 3796540 3705624 3728880 3839912
10660 3839912 3882943 3920203 4086839 4040847 4024418 4161316 4187192 4266207 4513637 4710770
10650 4710770 4835470 4943769 5195143 5498149 5699838 5969471 6091695 6219053 6434032
10641 6434032 6737487 7038031 7423847 7630304 7942929 8517522 9246301 10060329 10912805
10632 10912805 11927388 13103634 14164383 15059295 16031020 17148486 18616334 20610128
10624 20610128 23318730 26906495 31726566 38135459 47064424 58998766 74759899 94958784
10616 94958784 118477586 140865740 155723041 158889532 152671637 143448005 136947064 136677898
10608A36677898P524231J6954434K8211997L9814958M7341818M3763999K3230874
10601C43520209p529091k9810969l4208426k5385317j1217278L931973K0132299
10594B59433400L6666103N2145728O0263897M9953865J5857160k9379182n9346520
10587C85594451o2004291m7784078k9690360j2868283K500216J6703398K8312796
10580B80763849L2080584K2673354k133583l1716314m8983152m7766044l6236310
10573A68682384k3247595j2223096l621295L211006P691187Q030742K978580p234428
10565A44267485j8213546k4074589k3266656j9066668j4256694j0161262p221190
10558B8006880n180873m043297k969414k203163j680031j404544j362853j347753
$$ plain form
10608 136677898 144202129 161156563 189368560 229183518 276525336 320289335 343520209
10601 343520209 335991118 306180149 271971723 246586406 235369128 239301101 259433400
10594 259433400 296099503 348245231 408509128 458462993 474320153 444940971 385594451
10587 385594451 323590160 275806082 246115722 233247439 235747655 252451053 280763849
10580 280763849 312844433 335517787 333384204 301667890 252684738 204918694 168682384
10573 168682384 145434789 133211693 129590398 132801404 140492591 148523333 151501913 144267485
10565 144267485 126053939 101979350 78712694 59646026 45389332 35228070 28006880
10558 28006880 22826007 18782710 15813296 13610133 11930102 10525558 9162705 7814952
10550G814952r96548p45844p68130o28899l59369l09307n05491m42321l60032
10541B699011k41252k63373l57772k08394l54501K6942n6235j59003q9556k06754
10531G89113j52454q1381M9148K42154p4006j78369J42652Q7094j19694J9874
10521G24131P4787j36555j08027K5500K2020j49855j25859P4217p9888o7499m7319
10510B05653j37499J18623R6808o321K4043O105J05151j30929j67641J7638j5622
10499A16009J01626Q6797j31355k7444P6606q231n3848k9749J11156J36980r3904
10488B84643K7966K03892j6833k14784j13048M3715O5824j0654j00001l3307L17008
10477D54421J03241j41653r1044j62097J13314J84886J21151l0966k37978p2887
$$ plain form
10550 7814952 6818404 6072560 5304430 4675531 4316162 4006855 3501364 3059043 2699011
10541 2699011 2457759 2194386 1836614 1628220 1273719 1300661 1244426 1085423 995867 789113
10531 789113 636659 555278 604426 846580 772574 594205 736857 823951 704257 724131
10521 724131 798918 662363 554336 579836 601856 452001 326142 400359 320471 252972 205653
10510 205653 68154 186777 283585 277264 301307 307412 412563 281634 113993 131631 116009
10499 116009 217635 304432 173077 145633 222239 214008 160160 130411 241567 378547 284643
10488 284643 312609 516501 499668 284884 171836 215551 281375 270721 170720 137413 454421
10477 454421 557662 416009 324965 162868 276182 461068 582219 551253 313275 240388
10467B40388j12909p4540R3464K15053L5589M0594j33173L2879J20806N3364L6364
10456E47879N2338j90810m0271L32670j14299k64895j06567P6325N1265k152J05328
10445D46811m4727K645K3613o0661o567k01826m237J04930j06905M7765l8205
10434A62636L4569O31j5279n592P4707k5743r1801M4651L6676O5853j83105j46505
10422d8302M6351O1883J12548j53458Q209J52696K2626J07419L9205K44136K4054
10411F17367k11031j19955M7646o3335O4746k70298j00758P9470J5023q1549o7949
10400i0623K90953L61350j15148k43750K7519J80039j0066j44251k05291k73508
10390b22776p8187J10512J60091J83436o3528k705n420r4457J82388J78934j68504
$$ plain form
10467 240388 127479 52939 146403 361456 397045 437639 304466 337345 458151 511515 547879
10456 547879 600217 409407 369136 701806 587507 322612 216045 292370 343635 341483 446811
10445 446811 402084 404729 428342 367681 361114 159288 155051 259981 153076 200841 162636
10434 162636 197205 197836 182557 176965 251672 225929 134128 178779 215455 281308 98203 -48302
10422 -48302 -1951 59932 172480 19022 27231 179927 202553 309972 349177 593313 617367
10411 617367 406336 286381 334027 270692 335438 65140 -35618 43852 58875 -22674 -90623
10400 -90623 200330 561680 446532 202782 230301 410340 400274 256023 50732 -222776
10390 -222776 -300963 -190451 -30360 153076 89548 86843 81423 -13034 169354 348288 179784
10379A79784m9646n1689r7515K5965M5818O8858l4939l6516Q5223l6903k57700
10368a59260p0518R6878k7145N1544J07732L7277J0651K04808j45226j19591N3840
10357D0990M1556Q2831L5218m5431p3311M4116J22791J69256k7876j25437j39107
10346A25596J48777L747o5172O0632o1284M6986J68763N8890n5898j32869j956
10335B96212M7235L6095q7878P9563o9630j00050j09521N283N2961J7193L8957
10324B06420p3077o3177Q6524K5809n0530j71326P709Q8011k7971k2473j7074
10313a1155J25888k2245r5562r7335j00045J67193N2455O5616j56726m1064K39520
10302A26540K8421p5818q5365j1007J06291K1481Q4521J4944J20099q9452k08536
$$ plain form
10379 179784 130138 78449 -19066 6899 52717 121575 86636 50120 135343 98440 -159260
10368 -159260 -229778 -132900 -160045 -108501 -769 36508 47159 251967 106741 -12850 40990
10357 40990 82546 165377 200595 155164 81853 125969 248760 418016 390140 264703 125596
10346 125596 274373 278120 212948 273580 212296 259282 428045 486935 431037 298168 296212
10335 296212 343447 379542 291664 371227 301597 201547 92026 97309 150270 167463 206420
10324 206420 133343 70166 156690 182499 131969 -39357 -31648 56363 28392 5919 -11155
10313 -11155 114733 92488 -3074 -100409 -200454 -33261 19194 84810 -71916 -112980 126540
10302 126540 154961 79143 -6222 -17229 89062 110543 195064 210008 330107 240655 32119
10291C2119j25180J02746P2572J19292m7604l6027l5574R4292o6275J0170l2465
10280H8066j13731L9899N3918l4474j9782j45959m3451L251J27199j12052K2377
10269a34739J36906J5640K3772J05952J19831O2585M8410r4466k12548j02268
10259c0925L1934J5577K7244k3506r0965K8595J99588R7224n4428M4275q5594
10248A59019j35862j10354q400P7797m8860j00175k0204j38385Q4064K07763R6439
10237F2842P0977m7589j98168r3094j4422K66394N6467J9153Q2554j76059q748
10226B0307K0525m4919J17413j4995l0258m5538J07610j06663n7483J759J35695
10215A03453J9763o6236O5355J27033j2567j4166j0533j02442L5696q3191q2721
$$ plain form
10291 32119 -93061 9685 82257 201549 153945 117918 82344 176636 110361 120531 88066
10280 88066 -25665 14234 68152 33678 13896 -132063 -175514 -172263 -45064 -157116 -134739
10269 -134739 2167 17807 41579 147531 267362 329947 378357 283891 71343 -30925
10259 -30925 1009 16586 43830 20324 -70641 -42046 157542 254766 200338 244613 159019
10248 159019 23157 -87197 -95597 -17800 -66660 -166835 -187039 -325424 -241360 -33597 62842
10237 62842 133819 86230 -111938 -205032 -219454 46940 103407 122560 205114 29055 20307
10226 20307 40832 -4087 113326 98331 68073 22535 130145 23482 -34001 -32242 103453
10215 103453 123216 56980 122335 249368 236801 222635 212102 109660 145356 62165 -20556
10204b0556J07533J28184N3910K5454l2791j02101P0793l6670m8865l8787K08740
10193C14844J26610j37117p7385M917n6321P4737N9707j07023q2201J10987N2734
10182B84489L6599q5542J76543J24699O0156J06049O0052J69595O4963j12579
10172H85024n7293J54806J39434K22400L13985J36067L60713L0289k74250j36220
10162A774955k44964r4903J36007n8519O0030J30259J25397L66222K09900r5667
10152B308717j66820l58040k90166p2296j40678j31282P4861J57567K65970J72326
10142A820159J45224M2131k09642l21809l09722l41705q5136P6620Q3341l5634
10132H63827j25572p5055L5766J92161l080j74939j09435j65095j32139Q6720
$$ plain form
10204 -20556 86977 215161 269071 294525 261734 159633 230426 193756 144891 106104 314844
10193 314844 441454 304337 226952 231869 175548 250285 309992 202969 120768 231755 284489
10182 284489 321088 235546 412089 536788 596944 702993 763045 932640 997603 885024
10172 885024 827731 982537 1121971 1344371 1658356 1794423 2155136 2185425 1911175 1774955
10162 1774955 1529991 1435088 1571095 1512576 1572606 1702865 1828262 2194484 2404384 2308717
10152 2308717 2141897 1783857 1493691 1421395 1280717 1149435 1224296 1381863 1647833 1820159
10142 1820159 1965383 2007514 1797872 1476063 1166341 824636 739500 816120 899461 863827
10132 863827 738255 663200 698966 891127 888047 713108 603673 438578 306439 393159
10122C93159P4093k83597n9096k0572K7774m0705K3013p8198m9990n5587m7596
10111a17302l2938J88590K0760k27879j48629J67555J91505L4743k22556p418
10101a53569j2463J69111K13812J62188j7950j93088k5576O6958m7262k04080
10091d1919j0735N5793j3271o5263M9447l1611O8028J23610l7597q3183J960K5684
10079D0943j14054j39804J75960o0836K72657m9618r4281N6776q0571j80023l09807
10068d82658j02034K22941J22948N9066l0040L6994j27540J6340L10106Q2790
10058A08913J52923J76420j27578l169J6007k760j03250k6263j10556m0440R7662
10047A37909j83075k70178K13519K29884L7032m459j85775j03308K4429j31010
$$ plain form
10122 393159 467252 183655 124559 103987 131761 91056 114069 35871 -14119 -69706 -117302
10111 -117302 -150240 38350 59110 -168769 -317398 -149843 41662 76405 -146151 -153569
10101 -153569 -166032 3079 216891 379079 361129 168041 142465 209423 162161 -41919
10091 -41919 -52654 3139 -10132 -75395 -25948 -57559 10469 134079 96482 13299 15259 40943
10079 40943 -73111 -212915 -36955 -97791 174866 125248 30967 87743 7172 -172851 -482658
10068 -482658 -584692 -361751 -238803 -179737 -209777 -172783 -300323 -283983 26123 108913
10058 108913 261836 438256 310678 307509 323516 320756 217506 191243 80687 40247 137909
10047 137909 -45166 -315344 -101825 128059 165091 160632 -25143 -128451 -104022 -235032
10037b35032J4405J52665p174J16635J43761P4061N3874K5413l11559j99003l6890
10026b08844N663k8570R6481P4926J92314M6259K3862j29807n5775Q9917k7471
10015G8955k34558Q7791N2511p2355Q9408O0470M0511J58139M5412j27357p6376
10004A02551o7039Q4557r9639p0177j01014l6799J90146O7184j20330L3373J23512
9993A06325P1065p9549o3534J15337n8778l5647m6493j29721k35294p3343J78428
9982b51204K65425K5168r8859o8508l3120j5801J08445K5351j30657M4669J62738
9971C3647K1176q8484M1693O1065K100J97239j14854k19780L137j50450J7077
9960a96434J60815J54319J4927Q5165r7129j0761R6851j19790M7056L3962q3925
$$ plain form
10037 -235032 -220627 -67962 -75136 41499 185260 259321 313195 338608 27049 -171954 -208844
10026 -208844 -203181 -231751 -135270 -60344 131970 178229 202091 72284 16509 106426 78955
10015 78955 -155603 -67812 -15301 -87656 1752 62222 102733 260872 306284 178927 102551
10004 102551 35512 120069 20430 -49747 -150761 -187560 2586 69770 -50560 -17187 106325
9993 106325 177390 97841 34307 149644 90866 55219 8726 -120995 -356289 -429632 -251204
9982 -251204 14221 39389 -59470 -127978 -161098 -176899 -68454 -43103 -173760 -129091 33647
9971 33647 54823 -33661 8032 69097 71197 268436 153582 -66198 -63061 -213511 -196434
9960 -196434 -35619 118700 133627 218792 121663 110902 207753 87963 135019 168981 85056
9949H5056j32837j49608J06722R3262N9715k2700k19737j82346Q3243R7442k5685
9938b07473J2937L1123J23513K21385M9446K6958J6084K05524J36361J45832p681
9927G54009j38412j22777n433r9697k57038k00562L249j18831J14595J81907M4648
9916A55658Q157L2451L5468K1401P8042j75453k91211P0751N9368j09106J61253
9905D6779J14535N2889P0278m0350M2482j46772p4137j11544j80O9169K0648K5295
9893F9092K29820k0787l879J0475p1822o0582p0506J00746P762r5003m9508L3846
9881G9654l8235r2219R8637j0761m8389m1612k44463N3666K26524K5096p5287
9870f7389k7745r6137m152J69204O4076n6553M9440J18004K8799j01542P51q4428
$$ plain form
9949 85056 -47781 -197389 -90667 2595 62310 39610 -180127 -362473 -279230 -181788 -207473
9938 -207473 -194536 -163413 -39900 181485 230931 257889 273973 479497 615858 761690 754009
9927 754009 615597 492820 487387 387690 130652 -69910 -66661 -185492 -70897 111010 155658
9916 155658 163815 196266 231734 253135 331177 155724 -135487 -64736 -5368 -114474 46779
9905 46779 161314 214203 284481 244131 286613 139841 65704 -45840 -46020 23149 43797 69092
9893 69092 298912 278125 274246 284721 212899 152317 81811 182557 190319 95316 45808 79654
9881 79654 41419 -50800 47837 37076 -11313 -52925 -297388 -243722 -17198 7898 -67389
9870 -67389 -95134 -191271 -195423 -26219 37857 -18696 30744 148748 177547 76005 76756 -7672
9858g672p0729m5490P0985J16055o1845p966o1527n3269M85J43848K652l5956
9846a0429K1257K2223j5297j83879M9266J91166R4105j05106J0157j579M4304
9835A16188p6712j44355p4427p6615l6161M37K14751L9095j8607J01317L8784
9824H3695p3404j67260L698j24445M3354J24449J32536M3917j07266n2863j32975
9813b26564j4362K62887J59379J03555o0074j89165j55134k09835J15553J80632
9803c3128Q382p90o8276l5836K40863j5126j39052q2637j33449O7819o189p0825
9791b68244K62784N2242k06263J13707P9016K9706R0153M9141p7212k9116J21488
9780B17402j16274l4013P9870j95928o7734M0214p0209j18695n5078J96568j5203
$$ plain form
9858 -7672 -78401 -123891 -52906 63149 1304 -6662 -68189 -121458 -120973 22875 25527 -10429
9846 -10429 10828 33051 17754 -166125 -116859 74307 168412 63306 73463 71884 116188
9835 116188 39476 -104879 -179306 -255921 -292082 -291645 -76894 -37799 -56406 44911 83695
9824 83695 10291 -156969 -153271 -277716 -234362 -109913 22623 66540 -40726 -93589 -226564
9813 -226564 -240926 21961 181340 284895 224821 35656 -119478 -329313 -213760 -33128
9803 -33128 -24746 -25536 -93812 -129648 111215 96089 -42963 -125600 -259049 -191230 -197419 -268244
9791 -268244 -5460 46782 -159481 -45774 33242 62948 153101 202242 125030 95914 217402
9780 217402 101128 67115 146985 -48943 -116677 -76463 -146672 -265367 -320445 -123877 -139080
9769a39080j46896l3669J82200J48397O273O2146k3399n4642M2468p526j91707
9758a55435r1476P6582j33785N6996M0952N5393J49320K8422J83671P0159M3232
9747C24031R6414j67705k23135j63063k9780K14597J05874l3690j16851n1138
9737d4446o7802o2363L8868o7550m4561J46152J99508N3839p1288n3131j73758
9726a46532j89420n9915J94933J65144j12022l401o14N2215m1542q4812J2984
9715b12982n8346n3344p7611O9881R0402J59753J2429L2497Q098r1674p5055o9246
9703b65198k6038R3217J11673q6548q4689J04321p1335n0238k7851p0810J46642
9692b26854J77750k773j6667j07498J1434J32615R4640j66265K5141L7736K7893
$$ plain form
9769 -139080 -285976 -319645 -137445 10952 17225 79371 55972 1330 43798 36272 -155435
9758 -155435 -246911 -170329 -304114 -247118 -206166 -150773 -1453 26969 210640 280799 324031
9747 324031 420445 252740 29605 -133458 -163238 51359 157233 123543 6692 -44446
9737 -44446 -112248 -174611 -135743 -203293 -247854 -101702 97806 151645 80357 27226 -146532
9726 -146532 -335952 -395867 -200934 -35790 -147812 -151213 -151827 -99612 -141154 -225966 -212982
9715 -212982 -271328 -324672 -402283 -332402 -242000 -82247 -69818 -37321 -29223 -120897 -195952 -265198
9703 -265198 -291236 -198019 -86346 -172894 -257583 -153262 -224597 -274835 -302686 -373496 -226854
9692 -226854 -49104 -51877 -68544 -176042 -164608 -31993 62647 -103618 -78477 -40741 -12848
9681a2848N0785J10640l0828K160J19937p8362k6881j46990l9165O1182J1194
9670B0824j6292P7634J5050M7104N2186k1527m2870l1526M8794K37342j9711j00509
9658B66499K57830N52339N09672M99469J39421m73685o92274m37235k74271J7498
9648C65263l6344j75618l8245n4935j43189P3502K25170k2537r9026j69030K6944
9637d8045K3442R9713K37871o528j50167j88109j86151L29J39010N1079o773m5101
9625g9430q2407K1912m1581n6450J8096N0441j2658K70233M3046N6736j92171
9614d233k0355J92617J69769j03188l50052m2265K74607r9842L7711j00040R5295
9603E0024j02649o5816m7745K8274O9524J299m1262N2978r1130l5590J86763l4813
$$ plain form
9681 -12848 37937 148577 117749 119909 239846 161484 134603 -12387 -51552 9630 20824
9670 20824 4532 82166 97216 144320 196506 174979 132109 100583 149377 386719 367008 266499
9658 266499 524329 1076668 1586340 2085809 2225230 1751545 1059271 622036 347765 365263
9648 365263 328919 153301 115056 60121 -83068 -9566 215604 193067 94041 -74989 -48045
9637 -48045 -24603 75110 312981 306453 156286 -31823 -217974 -217645 -78635 -27556 -34329 -79430
9625 -79430 -161837 -139925 -181506 -237956 -219860 -169419 -182077 88156 131202 187938 -4233
9614 -4233 -24588 168029 337798 234610 -115442 -157707 116900 17058 54769 -45271 50024
9603 50024 -52625 -118441 -166186 -137912 -68388 -67089 -108351 -55373 -146503 -182093 4670 -30143
9591c0143K0620K2278n6002L9460J85164j44015n1115k3830n9962m1642K5460
9580a13727J55295O4362J7762J6882j97525j20594j800J91503O386l8895o2645
9569h2996R1124J64786j49315j43885j34106J64780M7034j66667j90978J8942
9559c81281J86842O5709L2019M6089o678r1426m7258K23161O5150k46523L4516
9548a19680J03498j11195j803J09883q9078m3920r8886n1140o1796J15409J84316
9537f4392J19371l6209R3595Q9147j49105p1023O5407j7124q3151q6000r5012
9526b34496n913R4979P6326O7931p7379R4921J25695M5735r9727q6124J3030j36289
9514a21311J00685J5420o5291m0818j04923K9987J13972R002j79874j40090J22564
$$ plain form
9591 -30143 -9523 12755 -43247 -3787 181377 37362 -13753 -37583 -97545 -139187 -113727
9580 -113727 41568 105930 123692 140574 -56951 -177545 -179345 12158 18544 -20351 -82996
9569 -82996 8128 172914 23599 -120286 -254392 -89612 -42578 -209245 -400223 -381281
9559 -381281 -194439 -128730 -96711 -50622 -57300 -148726 -195984 27177 92327 -154196 -119680
9548 -119680 -16182 -127377 -129180 -19297 -108375 -152295 -251181 -302321 -364117 -248708 -64392
9537 -64392 54979 18770 112365 201512 52407 -18616 46791 29667 -53484 -139484 -234496
9526 -234496 -240409 -145430 -69104 -1173 -78552 16369 142064 187799 88072 1948 14978 -121311
9514 -121311 -20626 -5206 -70497 -111315 -216238 -186251 -72279 -63277 -243151 -383241 -260677
9503b60677J05618om5764M4341J53177M068o6486j03855K5642j51125l2019J66874
9491a60212M7189P2281Q6951q7080q422j6948Q7887j60218q0806P2796Q5513l0141
9479i1210J75802k3994n8046P5775K71283k16059k04745p0713q3172J39349J41023
9468E5293K5553j55970o7771n778J2188J39726J18678k5315r4966L4301p1379
9457c5440J09903L6741J17426j34092k40922m6655o4290r5972P6876K31828J25047
9446H0450r3107p586J22287q7434P0172J09537R8969j66650j89259J30297L2745
9435A00421j31210M900m4297N0661Q0610J3312m5808L0638o3103j43544O567J12813
9423b8040N5946P1836J12171j20430j39877k5576l3073J28225o7209K5307M2967
$$ plain form
9503 -260677 -155059 -155065 -200829 -156488 -3311 757 -65729 -169584 -143942 -295067 -327086 -160212
9491 -160212 -113023 -40742 46209 -40871 -49293 -66241 21646 -138572 -219378 -146582 -61069 -91210
9479 -91210 84592 60598 2552 78327 349610 133551 -71194 -141907 -225079 -85730 55293
9468 55293 80846 -75124 -142895 -148673 -136485 3241 121919 96604 1638 35939 -35440
9457 -35440 74463 111204 228630 94538 -146384 -193039 -257329 -353301 -276425 -44597 80450
9446 80450 -12657 -20243 102044 14610 84782 194319 293288 126638 -62621 67676 100421
9435 100421 -30789 -25889 -70186 -19525 61085 74397 28589 59227 -3876 -147420 -140853 -28040
9423 -28040 27906 99742 211913 91483 -48394 -73970 -107043 21182 -46027 -20720 22247
9412B2247j02223P655J0210j36981J353J26006J9921k02575m4709J511j37226
9401d34811j9839K96546K13365L5985o9161J33783L4364j02553k68411K730J08129
9390f9873J40595K9729Q2220J01686j61238j21222K3620J9881p8327Q7122M3640
9379I7833j91862k5842l7776N414K0482m2692K21896J55601n1577J88762J5595
9368C55834j29163j11557p0954M0210j74066j2996N1288J8891o9641j27910j26884
9357c56948k7496R2146N416Q2053o0603N2219J56166N5683j42857Q8648K29423
9346A73850r0974j67991j09306Q6808O4991j8001N947Q4087j0845r9809N7423
9335b3820J14189j45460n5645m8900j80225M3987J36681m3963n1178J19779P6050
$$ plain form
9412 22247 -79976 -72321 -62111 -199092 -197739 -71733 -51812 -254387 -299096 -297585 -434811
9401 -434811 -454650 -158104 55261 91246 22085 155868 190232 87679 -180732 -178002 -69873
9390 -69873 70722 100451 182671 284357 123119 1897 25517 45398 -32929 54193 97833
9379 97833 -94029 -119871 -157647 -152233 -131751 -174443 47453 203054 151477 340239 355834
9368 355834 226671 115114 44160 84370 -89696 -102692 -51404 -32513 -102154 -230064 -356948
9357 -356948 -384444 -292298 -286882 -204829 -265432 -213213 -57047 -1364 -144221 -55573 173850
9346 173850 82876 -85115 -194421 -107613 -42622 -60623 -54676 29411 18566 -81243 -23820
9335 -23820 90369 -55091 -110736 -159636 -339861 -295874 -159193 -203156 -254334 -134555 -58505
9324e8505L9624R7012l7717j41553j66105o3409J3697J68583K04854J34599L3023
9313B24103p46j45026L0179j173o0185j05782L5888n5041j53465k5782p1428J66479
9301a61979N6669n6198n0833l4320N5301J6263J69136k6405j26576J1186J4553
9290a33203K3848M8448k6078j60766O378m5846J19137J74520j07403j80554j1027
9279b92546J82172Q0320p1611L6020R4886J31232j6308o7781K2334n1366j61069
9268a13717O9699o4027k0788L9582R5824P4079j61333k61154J46649J11783j22379
9257b05782M679J18116l166n1369j26669j7827q7023k7137n4615m517O0111J63393
9245b31806O6004l0325p802J9026o7008n2409N4570J23566J08319m8658j02574
$$ plain form
9324 -58505 -18881 78131 40414 -101139 -267244 -330653 -316956 -148373 56481 191080 224103
9313 224103 223357 78331 108510 107337 47152 -58630 -22742 -77783 -231248 -257030 -328458 -161979
9301 -161979 -105310 -161508 -212341 -246661 -191360 -175097 -5961 -32366 -158942 -147756 -133203
9290 -133203 -109355 -60907 -86985 -247751 -241373 -287219 -168082 6438 -100965 -281519 -292546
9279 -292546 -110374 -30054 -101665 -65645 29241 160473 144165 76384 98718 47352 -113717
9268 -113717 -44018 -108045 -128833 -89251 6573 80652 -80681 -341835 -195186 -83403 -205782
9257 -205782 -201103 -82987 -86153 -137522 -264191 -282018 -369041 -396178 -450793 -455310 -395199 -231806
9245 -231806 -165802 -196127 -203929 -184903 -251911 -304320 -249750 -126184 -17865 -66523 -169097
9234a69097J4185Q3251n6664p968N6675J02499j22334n4392K05496L2388r6278
9223a2239l8251n9581J5380m8133R9391N3547n9259N2989O1078j19161k1137n4182
9211a29558J16324J43088o2453M3272J56481R009n3545l005l6710L2237K0787
9200B35927J15345j04839K3332j37945Q938j92400l3784K4152n3674j35888O4800
9189a86036R1423n6962O4983J37924N6538l7854j50270P6285l8466p0404J71435
9178E8596J97977j52118j31361R4696J40677N6550n4919j51618o5786O5088n1288
9167F494m8642Q9351L6582n1357o0697j59956p8066O4862j936r801j11760l2161
9155c57087J80618L230p5639n2496L6726J42337J81075j1172N521M9493j25077
$$ plain form
9234 -169097 -154912 -71661 -128325 -136293 -79618 22881 -99453 -153845 51651 84039 -12239
9223 -12239 -50490 -110071 -94691 -142824 -43433 10114 -49145 3844 64922 -54239 -75376 -129558
9211 -129558 -13234 129854 67401 110673 267154 276163 222618 219613 182903 215140 235927
9200 235927 351272 246433 269765 131820 140758 -51642 -85426 -61274 -114948 -250836 -186036
9189 -186036 -94613 -151575 -86592 51332 107870 70016 -80254 -3969 -42435 -112839 58596
9178 58596 256573 104455 -26906 67790 208467 265017 210098 58480 -7306 57782 6494
9167 6494 -42148 47203 83785 32428 -28269 -188225 -266291 -201429 -203365 -213166 -324926 -357087
9155 -357087 -176469 -173239 -248878 -301374 -264648 -122311 58764 47592 53113 102606 -22471
9144b2471j20325n7571J14969q220j0916J14344L8356J4977J1137j86053m4455
9133a56228O3487P2009M4373j1535J2870n5677K4762J49437j41685o8717J21246
9122E4342p0588j9078P2568m4959j5824k4256J8631Q3727N8460k38142J164o0651
9110a84606k15639N7856M4731J06810J46838K4334L0104n2554k9911n0660n5176
9099a77873j2787k8043j69118k70669j10866K50143L32728Q7478N0715O2815O3417
9088G7940M4166K977r3464l9274K5272P7781p2212p8199K49787k3044r1691O738
9076H6777j20035j70479J50756J23153p4097R4086r8185j42976O1252J01511K15585
9065B27348R989j81435j04405R9638m3162j19188J10570J41110J51585n8385j78262
$$ plain form
9144 -22471 -142796 -200367 -85398 -93618 -104534 9810 48166 63143 74280 -111773 -156228
9133 -156228 -92741 -20732 23641 12106 24976 -30701 -5939 143498 1813 -66904 54342
9122 54342 -16246 -35324 37244 -7715 -23539 -47795 -29164 54563 113023 -125119 -123955 -184606
9110 -184606 -400245 -342389 -297658 -190848 -44010 -19676 10428 -42126 -72037 -122697 -177873
9099 -177873 -190660 -218703 -387821 -658490 -769356 -519213 -186485 -99007 -48292 14523 77940
9088 77940 122106 125083 31619 -7655 17617 95398 23186 -55013 194774 171730 80039 86777
9076 86777 -33258 -203737 -52981 70172 -3925 90161 -8024 -151000 -89748 11763 227348
9065 227348 237337 55902 -48503 51135 7973 -111215 -645 140465 292050 233665 55403
9054E5403R849J49429K7770k68102r6705Q049j52594n6578R4275M5165M3875j72396
9042c12560K8906J57096O1676M5869N9841n9711Q926K5561j5729o3360n1537j5439
9030a30461K20835L4377r1076k5621j54884O527N7178j26520J1876l4038J73946
9019e7861J35391J01022n1645K9318o0607j84401p5450J8475J68058J6570k58315
9008b19445N3417m8069Q1192J02203P0766Q1754n6635j45377K5691J96983R0334
8997B32814r4843p8609O118N421j53139n9582r959K9704L0345l662l8500K20711
8985H6819N7467j82194k13577N9404J54581K4107j9928q2874j11627l6483P4901
8974a89404o5017P4977K41109K14263L0020k25601k67760j03352N785P3829q526
$$ plain form
9054 55403 65252 214681 242451 -25651 -122356 -114307 -266901 -323479 -229204 -184039 -140164 -312560
9042 -312560 -283654 -126558 -64882 -19013 40828 -18883 -9957 15604 -125 -63485 -115022 -130461
9030 -130461 90374 124751 33675 8054 -146830 -140303 -83125 -209645 -197769 -231807 -57861
9019 -57861 77530 178552 126907 156225 95618 -88783 -164233 -145758 22300 38870 -219445
9008 -219445 -166028 -214097 -132905 -30702 40064 121818 65183 -80194 -54503 142480 232814
8997 232814 137971 59362 65480 70901 -82238 -141820 -151779 -122075 -91730 -95392 -133892 86819
8985 86819 144286 -37908 -251485 -192081 -37500 -13393 -33321 -116195 -227822 -264305 -189404
8974 -189404 -254421 -179444 61665 275928 305948 80347 -187413 -290765 -284980 -211151 -219677
8963b19677J0134O0189J10968j38518j23095M5890J59675R7073j29764J43140
8953A6015K9222J04329j85213o607K9326k3393J3737P8499j11223o2871j8270
8942a36449O0326J02459n069n6276J13368k895k4716j19284J20169K0065k37700
8931a66002j3569J3833J08541M3896j78116j6216J26052O4975N6471n99N6116
8920I5382J00615n2667J19774N3743j49347j86290k6269M1763o7937m2498m8794
8909a62525R2595q9012J01088k3053L9873O4737K64738j92848j65642O3131K13775
8898B06857M5688j1150j23351o9625j03161k0757J43369J64589p2925k23286o6590
8887a30342K3329J00862j55836j208M4193J11362J64768j38998l14318M6099J57516
$$ plain form
8963 -219677 -209543 -149354 -38386 -176904 -299999 -254109 -94434 2639 -127125 16015
8953 16015 45237 149566 -35647 -42254 -12928 -36321 -22584 55915 -55308 -118179 -136449
8942 -136449 -76123 26336 21267 -35009 78359 75464 50748 -68536 51633 71698 -166002
8931 -166002 -179571 -165738 -57197 -13301 -191417 -207633 -81581 -16606 39865 39266 95382
8920 95382 195997 143330 263104 316847 167500 -18790 -45059 -3296 -71233 -113731 -162525
8909 -162525 -69930 -158942 -57854 -80907 -41034 23703 288441 95593 -70049 -6918 206857
8898 206857 252545 241395 118044 48419 -54742 -75499 67870 232459 159534 -63752 -130342
8887 -130342 -107013 -6151 -161987 -163195 -119002 -7640 157128 18130 -296188 -250089 -92573
8876i2573J57336q5451j64045Q7629Q015o751O2254O040n2254J65834K0529m5591
8864F0972l0416J03595k249m7560M0326P9466K2323k99089j04412L2042n8228
8853b03230o7609R0273Q9676K8063K9729L1105J52495P1979j08021j9835q1880
8842A2745n8090j2234O3968M8018m4922K0605J5991J22504j19445n2778j02600
8831a06238j49222J06497J81026n0013k02874R0630Q9600N8283n5194q8300J8144
8820a07661M0521O9199O7344q298j16947Q6319j5363j0980m1101k8388p6318j36310
8808b77983n7050J82N0928J31166O4393J92442J60805j14689j15234q1701p4775
8797a21516R6138O1658m2716l6352J65525J98936R8803j28175o0925p2091O1956
$$ plain form
8876 -92573 64763 -20688 -184733 -97104 -89089 -95840 -33586 -27546 -79800 86034 106563 60972
8864 60972 30556 134151 131902 84342 124668 204134 226457 -72632 -177044 -145002 -203230
8853 -203230 -270839 -180566 -90890 -62827 -33098 -1993 150502 222481 114460 94625 12745
8842 12745 -45345 -57579 6389 54407 9485 30090 46081 168585 49140 -3638 -106238
8831 -106238 -255460 -148963 32063 -17950 -220824 -130194 -40594 17689 -37505 -125805 -107661
8820 -107661 -67140 2059 69403 61105 -55842 30477 15114 4134 -36967 -65355 -141673 -277983
8808 -277983 -335033 -334851 -283923 -152757 -88364 104078 264883 150194 34960 -46741 -121516
8797 -121516 -25378 36280 -6436 -42788 122737 321673 420476 292301 231376 159285 221241
8786B21241J0336k0273k67649j00755L1240N1417K06262J1763j37498q9246J14918
8775C1756J42966K14830j11689j69335M059r135m1982j54698k06138R1602K37739
8764B9975R5728J15170O1088j75183j01294J3883j12621n6050J8876n7099k7057
8753a94584J02633K4344K1704o3776n9546J42198P8710r0573p1211p1213l3890
8742b15204J66995Q0088J1889j07980r7123k9473N1601J47955q043R1952j14289
8731b1632r2255O0812J07888J0607j17479m2816M7054Q7850P8574l4397j02626
8720a8420k4184M3776L3461j52387j43491P8014N7050J44909J19935o4940r6699
8709b2976k18756Q5363R6746k16108M6932K7005J07963k1355q4124L6275J7003
$$ plain form
8786 221241 231577 211304 -56345 -157100 -125860 -74443 131819 143582 6084 -83162 31756
8775 31756 174722 389552 277863 108528 112587 103452 61470 -93228 -299366 -207764 29975
8764 29975 125703 240873 301961 126778 25484 39367 -73254 -129304 -110428 -167527 -194584
8753 -194584 -91951 -67607 -45903 -109679 -169225 -27027 51683 -38890 -110101 -181314 -215204
8742 -215204 -48209 31879 43768 -64212 -161335 -190808 -139207 8748 705 92657 -21632
8731 -21632 -113887 -53075 54813 65420 -52059 -94875 -47821 40029 118603 84206 -18420
8720 -18420 -42604 1172 34633 -117754 -261245 -183231 -126181 18728 138663 73723 -22976
8709 -22976 -241732 -156369 -59623 -275731 -228799 -201794 -93831 -115186 -199310 -163035 -146032
8698a46032L4025m9658J40154P7881o1329n9840K13043J45535R5830k82063k24661
8687a17115J716R6128J55162k7255k3341o570Q2315m3492m236k46061l9708L4141
8675a38316K6611P1876O1772j2191R7917m0613M1627p1480o2017J14810k0034
8664F9962K294J05487J56285r6768k19683J2277M6347r2069k41367m6225P1427
8653b32033J38439Q0476K8558m1043M4150m0648N7448J28553k26966q4597P7382
8642g0281K30220l6326n4523J10986j18664j50934J06388P6253r5608j6220J18901
8631A00192L8749m849Q3435J76972m9609r8739j78266j55426M5336J54727K8253
8620A40775j82489j93072J3492j88487m8392L74570J32855j44014m6923J48628
$$ plain form
8698 -146032 -112007 -161665 -21511 56370 -4959 -64799 148244 293779 389609 107546 -117115
8687 -117115 -115399 -19271 135891 108636 85295 78725 161040 117548 113312 -132749 -172457 -138316
8675 -138316 -111705 -39829 21943 9752 107669 67056 108683 37203 -24814 89996 69962
8664 69962 72256 177743 334028 237260 17577 29854 76201 -15868 -257235 -303460 -232033
8653 -232033 -93594 -13118 15440 -25603 18547 -22101 35347 163900 -63066 -147663 -70281
8642 -70281 159939 123613 69090 180076 61412 -89522 16866 93119 -2489 -18709 100192
8631 100192 138941 134092 217527 394499 344890 246151 67885 -87541 -42205 112522 140775
8620 140775 -41714 -234786 -221294 -409781 -458173 -83603 49252 -94762 -141685 6943
8610F943O6252J27407j53750o3780J43015P1646j29669r4426N847J752N7256m8373
8598i880j71588L4815J32702P4594O4847j75920K557Q3366R4830J23808j20594
8587A33537O1514J02392n201J79980N5623j16742J11802m032o6240o1376l7649
8576C53608J0839p1665n5940J64497J08322R773j21146j19430k7293j45596J17804
8565B23773Q0050k40380j03936J7687J59390K6737n7145p2463q6558p6158j81338
8554c10341K47718N2214k0375k3317J5329J43588M8656j31794n9620J06401K6341
8543I4800j05659l2579J18793n1481j51078j46808M3277J36121p4543m9481Q987
8532b09651J73785J19209o926Q1337K2194q8360p1504j34617J4184J00111L3380
$$ plain form
8610 6943 73195 200602 46852 -16928 126087 197733 68064 -26362 -20515 -18763 38493 -9880
8598 -9880 -181468 -146653 -13951 60643 125490 -50430 -47873 35493 130323 254131 133537
8587 133537 195051 297443 292242 472222 527845 411103 522905 518873 452633 391257 353608
8576 353608 364447 292782 236842 401339 509661 519434 398288 278858 251565 105969 223773
8565 223773 303823 63443 -40493 -22806 136584 163321 106176 33713 -52845 -129003 -310341
8554 -310341 -62623 -10409 -30784 -54101 -38772 104816 153472 21678 -37942 68459 94800
8543 94800 -10859 -43438 75355 23874 -127204 -274012 -230735 -94614 -169157 -218638 -209651
8532 -209651 -35866 83343 76417 157754 179948 91588 20084 -114533 -100349 -238 33142
8521C3142N2942n8297J2793O1928j2365j25906j09522n6782j3746J47726l4490
8510a02577J91075K3003j91696j90089M8934Q3586N299P5999Q886Q4723K67471
8499C04614j31347k51992J557o5112r96J22935J66869m0958j09915j4951M8720
8488B9424j58018N6436J45526j13002m5622j71187K8536M1001K5058q0850N9862
8477a82836J03687K6674k9878n2717L3796L6943J54265J02279L64P0695J90818
8466D54090k17954r8891l6304k3120J69701J3099j31516q3292o8034J69098J8924
8455A65801j26725j34248J1383Q4263O8055N6699M1608j71201J110l9170N994
8444c6431L7211n1216j75801P8249P7092k9134O6919N6109K224q4984j63350J592
$$ plain form
8521 33142 86084 27787 40580 102508 90143 -35763 -145285 -202067 -215813 -68087 -102577
8510 -102577 88498 111501 -80195 -270284 -221350 -137764 -132465 -56466 -47580 37143 304614
8499 304614 173267 -78725 -77168 -142280 -143276 -20341 146528 105570 -4345 -19296 29424
8488 29424 -128594 -72158 73368 -39634 -85256 -256443 -227907 -186906 -161848 -242698 -182836
8477 -182836 -79149 -52475 -82353 -135070 -101274 -64331 89934 192213 192577 263272 454090
8466 454090 236136 137245 100941 77821 247522 260621 129105 45813 -22221 146877 165801
8455 165801 39076 -95172 -83789 474 68529 125228 166836 -4365 -3255 -42425 -36431
8444 -36431 780 -50436 -226237 -147988 -70896 -100030 -33111 22998 25222 -59762 -223112 -221520
8432b21520K6804J08462R7624M6848M6584K1873J8134o4191r5189j8877r0040
8421a23488j18817n7141J8934J38832J39501p2003K275r29J1699j0861P2261J2675
8409A2938j81743L5537N2285j13703N6170L6010N5822J04421J74640R559k44480
8398b544j23744r6825l9087K18957K95617L4162j08404k2418R0113J35133q0575
8387C00385k39266k72589m5880k9530M1752M9969R0363J07491J9391j45288m644
8376a27846P9311O7122L3238l0964J5394M6000j260p5819Q43k5728J18273m5497
8364E3067j04698j20498J42734J04721P2107j39329p8169K1470N2946R4378r3739
8353D990r7309L0113q3652k1378O9843P6422j07496j39137l5796M2220J08526
$$ plain form
8432 -221520 -194716 -86254 11370 58218 104802 126675 144809 80618 -14571 -33448 -123488
8421 -123488 -242305 -299446 -280512 -141680 -2179 -74182 -71907 -72836 -61137 -71998 263 12938
8409 12938 -168805 -133268 -80983 -194686 -138516 -102506 -46684 57737 232377 241936 -2544
8398 -2544 -126288 -223113 -262200 -43243 252374 286536 178132 155714 245827 380960 300385
8387 300385 61119 -211470 -257350 -286880 -245128 -195159 -104796 2695 22086 -123202 -127846
8376 -127846 -48535 18587 51825 20861 36255 82255 80995 5176 6019 -19709 98564 53067
8364 53067 -51631 -172129 -29395 75326 147433 8104 -70065 -48595 4351 98729 4990
8353 4990 -92319 -62206 -145858 -167236 -97393 -20971 -128467 -267604 -303400 -261180 -152654
8342a52654J22695P701m4444j55214m0649J33474L5768R3947M6536k1553J05979
8331A31586J72546M1539j91334k68110M0699N2327k5891K6266O5492P6536K3549
8320A45205J30941q0688j71896M0606j06794m7810K09834J40306r8540j40974
8310B0190r9884L6604L6135J64312K1458k44280j9075K27j9342K3920m1772L626
8298a17881J46843J58769N9924l4927k64089q5174k996k5204Q007J16737J41659
8287A01668j08565l0417K881J47498k0398j01516K2908J06240O3518j44343o3969
8276b4495j24908o6355N3286J00856M7016q0039P890J63359o4027j4736R1834
8265H9681O736l16640j06059R8507P0545O9168O6718l5560N1005l995J06104L3937
$$ plain form
8342 -152654 -29959 -22258 -66702 -221916 -262565 -129091 -93323 624 47160 25607 131586
8331 131586 304132 345671 154337 -113773 -73074 -20747 -46638 -20372 45120 121656 145205
8320 145205 276146 195458 23562 64168 -42626 -90436 119398 259704 161164 20190
8310 20190 -79694 -43090 -6955 157357 178815 -65465 -84540 -84313 -103655 -79735 -121507 -117881
8298 -117881 28962 187731 247655 212728 -51361 -136535 -139531 -164735 -156728 -39991 101668
8287 101668 -6897 -37314 -34433 113065 92667 -8849 14059 120299 183817 39474 -24495
8276 -24495 -149403 -215758 -162472 -61616 -14600 -94639 -86749 76610 12583 -2153 89681
8265 89681 96417 -220223 -326282 -227775 -157230 -88062 -21344 -56904 -5899 -9894 96210 130147
8253A30147k06551l9938J18481k5007J19458p665p3810K3769N0421N7094P0589
8242B16988o1396j01175J1799k5912j0379R4222J0447P6585q1983j62743M8335
8231A4788j04223J02646M0907k0160Q194M3947P5795j49541j23449k0600J08543
8220b3153p3712j22791J5040J8904J276N7086K32924K0885k11792l3601O6954
8209e1980q6740p7584J7134n969K04221J91802k8496K09134O9442k96170r1937
8198E2857j80762j15324l5535m8337J27068K64641J01041J61687l5804j99784
8188I1748l8487j11796q0785n8982J59886k8122K6098J0266k4815K8416k477J22303
8176I3253K0135L8399O7592j45884M1595K0031j05917n131O0053m0951l18851
$$ plain form
8253 130147 -76404 -116342 2139 -22868 96590 88925 15115 38884 89305 146399 216988
8242 216988 155592 54417 66216 40304 29925 124147 134594 211179 129196 -33547 14788
8231 14788 -89435 13211 54118 33958 42152 86099 161894 12353 -111096 -131696 -23153
8220 -23153 -96865 -219656 -204616 -185712 -184436 -127350 105574 126459 -85333 -118934 -51980
8209 -51980 -138720 -216304 -199170 -205139 -918 190884 162388 371522 440964 144794 52857
8198 52857 -127905 -243229 -278764 -327101 -200033 64608 165649 327336 291532 91748
8188 91748 53261 -58535 -139320 -198302 -38416 -66538 -40440 -30174 -54989 -26573 -29050 93253
8176 93253 113388 151787 219379 73495 115090 135121 29204 24073 84126 43175 -275676
8165b75676k3313M6938j5447M156J6279n8818P3439J31348J25634n8369j13639
8154a47468M0558q6846K5899N6638k2834N2653o9621N9123p3004k1106J79445
8143f563J4775q3648l6011L7163J37215J28158J5338j25409j87159j07736L8924
8132a74953j2823O3390J87421J3114q5047L6088j9041J43684J0228n8647j03278
8121A36J90263k2556n4625j14512m3995R632J13924O8690R2826r7396r2370n9882
8109i865J16818j7013K9890p1256j19904j86473k5586M2563j53338M7177J15500
8098b31487J97934L2379R4933j37465m3653O7832K2750k437P4800m5848R0461
8087A20199k1394j92886j95846J18605O9209r2773o6578J1047K0372J215J16030
$$ plain form
8165 -275676 -298989 -252051 -267498 -263342 -247063 -305881 -232442 -101094 24540 -33829 -147468
8154 -147468 -106910 -193756 -167857 -111219 -134053 -81400 -151021 -91898 -164902 -186008 -6563
8143 -6563 8212 -75436 -111447 -74284 62931 191089 206427 81018 -106141 -213877 -174953
8132 -174953 -187776 -124386 63035 76149 -8898 27190 8149 151833 162061 103414 136
8121 136 190399 167843 113218 -1294 -45289 -35657 78267 146957 239783 142387 50017 -9865
8109 -9865 106953 89940 119830 48574 -71330 -257803 -283389 -240826 -394164 -346987 -231487
8098 -231487 -33553 -1174 93759 -43706 -87359 -19527 3223 786 75586 29738 120199
8087 120199 98805 -94081 -289927 -171322 -102113 -194886 -261464 -250417 -230045 -228830 -112800
8076a12800J5921j84252j66453r687J00041K79813P2710Q0951J34283K6572j95386
8065D1713l9413O446j91309k4119J44809K52342J31212j3024j88840j68992q1722
8054a30897J03642N6135J2646J9337k2598r3990j54253N7831J38533L2142M7855
8043F6383L1982k6894k21825o9816n0291q2296R4931Q1368o1765R6861R2331q7270
8031a36301J41369K56232M2118j84713j40631n6325K2727M8528l6820k50372l259
8020b97447J2721N1566K05857J16565J76161J3844j80612Q643L3351l0346J5729
8009A26032q4202J8267l5336r4795l6603k5591j17512l0941M4005K2958N3588
7998a60130l0585j81528J68560L9479j1720O7811j37732J0150M6822j34622j07280
$$ plain form
8076 -112800 -96879 -281131 -447584 -457271 -357230 -77417 -4707 76244 210527 237099 41713
8065 41713 2300 8746 -182563 -206682 -61873 190469 321681 308657 119817 -49175 -130897
8054 -130897 -27255 28880 41526 60863 38265 -55725 -209978 -152147 -13614 18528 66383
8043 66383 98365 71471 -150354 -220170 -270461 -352757 -257826 -176458 -238223 -141362 -49031 -136301
8031 -136301 5068 261300 303418 118705 -21926 -78251 -55524 -6996 -43816 -294188 -297447
8020 -297447 -284726 -233160 -27303 89262 265423 279267 98655 107298 140649 110303 126032
8009 126032 41830 60097 24761 -70034 -106637 -132228 -249740 -280681 -236676 -213718 -160130
7998 -160130 -190715 -372243 -203683 -164204 -175924 -108113 -245845 -235695 -188873 -323495 -430775
7987d30775J97425R3972o4184O0553J51947K10081j01031m3770l09508l2049J26215
7976a41124k7942j61102M2909J54739J7041M0634R9186J51949n4833m6707J22094
7965A96844j76532j03949K9608K0335n5165k19298O9299Q4749l8243M359K9218
7954a58775J3034J29529K3653J4876L4869j09597j06740K1478O6754Q797J0158
7943e1964p3900J29322M2925j44295O5991Q0108p3802r3051L3264O9810L2701
7932A7109J23287R8427L670Q5433j48131j17158l9039m5305m3938K6520j53826
7921a92951L9686J55996p5018J06631J92110Q7521j00268q7076j80291j88256
7911b41916R890K17993m8066r2688J26318M9054m1696R1075p711j71100J06681
$$ plain form
7987 -430775 -233350 -139378 -203562 -143009 8938 219019 117988 74218 -235290 -267339 -141124
7976 -141124 -169066 -330168 -287259 -132520 -115479 -74845 24341 176290 121457 74750 196844
7965 196844 20312 -83637 -54029 -33694 -88859 -308157 -238858 -154109 -192352 -187993 -158775
7954 -158775 -145741 -16212 7441 22317 57186 -52411 -159151 -137673 -70919 -62122 -51964
7943 -51964 -125864 3458 46383 -97912 -31921 48187 -25615 -118666 -85402 -15592 17109
7932 17109 140396 238823 242493 327926 179795 62637 23598 -21707 -65645 -39125 -192951
7921 -192951 -153265 2731 -72287 34344 226454 313975 213707 126631 -53660 -241916
7911 -241916 -232026 -14033 -62099 -154787 -28469 20585 -21111 69964 62253 -108847 -2166
7900b166L1901M4744j65470j44485J20424j7542n6804N6753l6869L084j38020
7889c04450J05218L6566J1964N7671N7386n2824m4327M3771K8649m2188P6363
7878b6201J9184Q5587p8570R7593j39137J7205J15797N9682J51102k8429j13183
7867A60630o9132J6770j33422p2897j382o0578J55138J84590k08097k1347K0252
7856b9475l9152R492M5246j17794J4343n2613O137k5436o1121j11703N3535R1303
7844b17238K11886J21981j7059M2010k6763K4222L2528l2698j28548j36229j05644
7833b31552J06384R473m8569P4962M8892j5575n691r1165j0651R326L2080P55
7821a21331p2304q7179M9380L5048J8949P1794n1910l22l3235J86782J00865l3356
$$ plain form
7900 -2166 29735 74479 -90991 -235476 -115052 -132594 -189398 -132645 -169514 -166430 -304450
7889 -304450 -199232 -162666 -150702 -93031 -35645 -88469 -132796 -89025 -60376 -102564 -26201
7878 -26201 -7017 78570 0 97593 -41544 -24339 91458 151140 302242 273813 160630
7867 160630 91498 108268 -25154 -98051 -99433 -160011 -4873 179717 -28380 -49727 -29475
7856 -29475 -68627 -59135 -13889 -131683 -117340 -169953 -163816 -189252 -250373 -362076 -308541 -217238
7844 -217238 -5352 116629 99570 141580 114817 139039 171567 138869 10321 -125908 -231552
7833 -231552 -125168 -115695 -164264 -89302 -40410 -55985 -61676 -152841 -163492 -154166 -122086 -121331
7821 -121331 -193635 -280814 -231434 -196386 -177437 -105643 -157553 -157875 -191110 -4328 96537 63181
7809F3181q3124j49137p0096P4877J07022L540j13723o1873J30047P8260N2968
7798C1942j8003n5930R1991J42186k22452J1460P3798N7847K3363j7710j10356
7787H136o383L7420j4419L8623N530j74952o1298J37285J04267j05101O8984q1133
7775d3041Q081J29194P5184l8831o8326K048N7233r9042P6186j65283k36674J8784
7763b84487K29960J08893r1301r333K2828j35278p9797l3596r2702r0978N2503
7752d03288L09804J08880Q079r1666J0589j31507M2558N9066N1046m0984Q6976
7741I553q0701j9920j5289J79456n1456j08205n5665j6297q606M4454R7327J05906
7729H0557j00335N6016K1152J34010j03977l0238q6584m4573J62127K8588o3881
$$ plain form
7809 63181 -19943 -169080 -239176 -164299 -57277 -53737 -167460 -229333 -99286 -21026 31942
7798 31942 13939 -41991 50000 192186 -30266 -18806 54992 112839 136202 118492 8136
7787 8136 1753 39173 24754 63377 68907 -106045 -167343 -30058 74209 -30892 38092 -43041
7775 -43041 -34960 94234 169418 130587 62261 64309 121542 22500 98686 -66597 -303271 -284487
7763 -284487 -54527 54366 -36935 -46268 -23440 -158718 -238515 -272111 -364813 -455791 -403288
7752 -403288 -93484 15396 23475 -68191 -57602 -189109 -146551 -87485 -36439 -77423 9553
7741 9553 -71148 -91068 -106357 73099 21643 -86562 -142227 -158524 -167130 -122676 -25349 80557
7729 80557 -19778 36238 57390 191400 87423 57185 -29399 -73972 88155 116743 52862
7718E2862p566p7489j09944n4465o3179P07M3159j3918J5982O2031J66090P2160
7706H6430m0055j69711j38028J00411N2718n9977O463N9419Q3398j50384M8111
7695a21205N6938R6528K9936o295J74209j09983j84462K4231n3279n7515j63789
7684c14686n3676q3901J4107Q0269J56794L9507J02576N8705r3689q7549L3593
7673a47950N5807j42116K4556J38646Q8289K14706J26722q7435j69416M496j83101
7662g6796q5943J79764J45500m5303j18941q5195m9951j9072j27541p2121L07421
7651d8178J26232n838Q444Q4612J5437k44841j21651J04636O1207q8868K4003
7640h4805j7658J7048N9370j43946m8799r712m2541N2387J06108N2658N318o5400
$$ plain form
7718 52862 45296 -32193 -142137 -196602 -259781 -259074 -215915 -229833 -213851 -151820 14270 86430
7706 86430 46375 -123336 -261364 -160953 -108235 -168212 -161749 -102330 -18932 -169316 -121205
7695 -121205 -64267 32261 62197 55902 230111 120128 -64334 -40103 -93382 -150897 -314686
7684 -314686 -368362 -452263 -438156 -357887 -201093 -161586 -59010 -305 -93994 -181543 -147950
7673 -147950 -92143 -234259 -209703 -71057 17232 231938 358660 271225 101809 106305 -76796
7662 -76796 -162739 17025 162525 117222 -1719 -86914 -136865 -155937 -283478 -355599 -48178
7651 -48178 78054 72216 80660 165272 180709 -64132 -185783 -81147 -19940 -108808 -84805
7640 -84805 -102463 -85415 -26045 -169991 -218790 -228502 -271043 -218656 -112548 -59890 -54572 -119972
7628a19972K7708j63347P7585J06401J14214j02916m9377l0856O0483j817l0443
7617a12337o9593J53807M534L607J5160l1928k4123p0299j17401P4609O0507j29871
7605b43328J8367K05745R6499j25923k62702R9105J11233L5829J19736M6656P5472
7594A76689m1438o8876l522o9547k1898n0804l9944l7610K1698k1471J55211J76417
7582A74905O091J00308j21298o4209o7967P5087N4336q1480K6653Q7551n1193
7571A38784j08083j37819n1643L3822k1842J7417P9899J53669p3166r8673q910
7560g6545j6815R1027j1415j0130Q7504r8420n1015K1054Q924n4208O5236J05379
7548F0576o5528m7709j6482K0009J34430K2878N4426N331q5093j93802j85864
$$ plain form
7628 -119972 -92264 -255611 -178026 -71625 42589 -60327 -109704 -140560 -80077 -81894 -112337
7617 -112337 -181930 -28123 -23589 -19982 -4822 -36750 -60873 -131172 -248573 -173964 -113457 -243328
7605 -243328 -224961 -19216 77283 -48640 -311342 -212237 -101004 -65175 54561 101217 176689
7594 176689 135251 66375 62853 -6694 -28592 -79396 -119340 -156950 -135252 -156723 -1512 174905
7582 174905 180996 281304 160006 95797 27830 102917 157253 75773 102426 189977 138784
7571 138784 30701 -107118 -158761 -124939 -146781 -129364 -49465 104204 31038 -67635 -76545
7560 -76545 -93360 -2333 -13748 -23878 63626 -34794 -85809 -64755 -55831 -110039 -44803 60576
7548 60576 -4952 -52661 -69143 -49134 85296 108174 162600 167931 82838 -110964 -296828
7537b96828k3296J24387M2206l5526j8014n205N4625J14066J40801j95772j37779
7526b36335J24491p7495r1005K3977M1401J45554K4680j06187p3396J86407P3036
7515C5128l7738j24965K9576J9804j0846q2652n2206J59207j41044o5691J54222
7504a17205J27519n908j6817j36669J94888L9523l9082j23739L2456K4716j05739
7493a26057j85639p6578Q3496R1526Q9417k9009j1681O8005J255p494r6411J30551
7481f8619N2946Q9967q348j87826p7780M1726n7186K8164J42831k8887j13671
7470a86683L575J52288M3130j94949j75978j52682K4694K14077K06768J66791
7460A01031j26450n8231k9820Q8784J28530m9554k06761j49180Q1514p8080P8044
$$ plain form
7537 -296828 -320124 -195737 -153531 -189057 -207071 -212276 -157651 -43585 97216 -98556 -236335
7526 -236335 -111844 -189339 -280344 -256367 -214966 -69412 -44732 -150919 -224315 -37908 35128
7515 35128 -2610 -127575 -97999 -78195 -89041 -171693 -223899 -64692 -205736 -271427 -117205
7504 -117205 10314 4406 -12411 -149080 45808 85331 46249 -77490 -45034 -20318 -126057
7493 -126057 -311696 -388274 -304778 -213252 -123835 -152844 -164525 -96520 -95265 -102759 -199170 -68619
7481 -68619 -15673 74294 65946 -121880 -199660 -157934 -215120 -186956 -44125 -73012 -186683
7470 -186683 -183108 -30820 12310 -182639 -358617 -511299 -486605 -272528 -65760 101031
7460 101031 -25419 -83650 -113470 -24686 103844 54290 -152471 -301651 -220137 -298217 -220173
7449b20173J42332R2398p1480O3875j54715J447m230P7579M0064O1141j3304j8227
7437c293j3869N6740r8326k06580K3680J54756K38042N482j13182p3338j58012
7426a87900n6117J3679r1126L0894J21361m2377l2035L2K5417M5896J05581p0288
7414a36983n5829k008J9201J6805j67767j49645j6721J3879j2438K22050J86863
7403h2593J0886L5077q7596p4816J48788R385p7705k1651K6470L9089j22244P6496
7391a20414l0158P0621N2176J17120j01573j90203j06195k8503J36104Q8679o604
7380a18950p2270N1652j89445J00548p0221p6385N6789J47544J17109L242R7869
7369D7482Q6011M0825l677J6383j36108j96359n6603k0770M0678K2056j914p1639
$$ plain form
7449 -220173 -77841 14557 -56923 6952 -147763 -146316 -150546 -72967 -32903 28238 14934 -3293
7437 -3293 -17162 39578 -58748 -265328 -241648 -86892 151150 156632 43450 -29888 -187900
7426 -187900 -244017 -230338 -321464 -290570 -169209 -211586 -243621 -243589 -218172 -172276 -66695 -136983
7414 -136983 -192812 -194820 -175619 -158814 -326581 -476226 -492947 -479068 -491506 -269456 -82593
7403 -82593 -71707 -36630 -124226 -199042 -50254 -40869 -118574 -140225 -113755 -74666 -196910 -120414
7391 -120414 -150572 -79951 -27775 89345 -12228 -202431 -308626 -337129 -201025 -112346 -118950
7380 -118950 -191220 -139568 -329013 -228465 -298686 -375071 -318282 -170738 -53629 -50387 47482
7369 47482 133493 174318 170641 187024 50916 -145443 -202046 -222816 -182138 -160082 -161996 -233635
7357b33635l4558J04530Q3715P2118q504M9396K7215l2124k6410m3704j80191
7346b22152p8583J11416J44237r2506q6691J67838J60638J10750P0484j69531
7336A15900j24097l4697J95800P6963j07472p5324o3876m2020J48181R9756j8842
7325A70272o3468j2121j7043M6990j04272j34060k1046M9069j13632j16178Q8205
7314b27284n4070K3678J50290j4561j21389P2724l8460j04201J24253K29055Q9440
7303A29475k52817j28188J11044O7785J68238J3469j57994J56833j34632k6608
7293e3395O9312n7048r5209n7782J3322J31126O9085J11520M4931j10337j72273
7282a06748j09693J17709K14418Q5079j15587j85361J7501R2015J9353j36679
$$ plain form
7357 -233635 -268193 -163663 -79948 -7830 -16334 33062 60277 28153 1743 -41961 -222152
7346 -222152 -300735 -189319 -45082 -137588 -224279 -56441 104197 214947 285431 115900
7336 115900 -8197 -42894 152906 229869 122397 47073 -16803 -58823 89358 189114 170272
7325 170272 106804 94683 77640 124630 20358 -113702 -134748 -85679 -199311 -315489 -227284
7314 -227284 -281354 -257676 -107386 -121947 -243336 -170612 -209072 -313273 -189020 40035 129475
7303 129475 -123342 -251530 -140486 -72701 95537 109006 -48988 107845 -26787 -53395
7293 -53395 15917 -41131 -136340 -194122 -180800 -49674 19411 130931 175862 65525 -106748
7282 -106748 -216441 -98732 115686 200765 85178 -100183 -82682 9333 28686 -107993
7272a07993j30221J05585R1293r5489j28181J0102J05522j2586R5788J48189k33626
7261a51617m7013Q7203p3392k28475M1301K01283J28714N0467r543q8047j56168
7250b45287K23166j9577l453o1868r8872J247J16414K78593m2305k27484l0024
7239a09450J8348O277Q6206K8510k82551j49636P0991J65637M5391J9566p5628
7228a76339j5837m1747J26110R3546N9902J28196l7064j16449L7057K34490q7505
7217B04360O1469J04249m4490j49344j01022k30299j33152K3113p1556P8259p294
7206b65707j4157J80858j6212m2202J79782K7343r6685n1540j17303J03974J13259
7195A410L3217Q3704r4823j69201j21441P176l7832P3158J09799J5663j4952j25775
$$ plain form
7272 -107993 -238214 -132629 -41336 -136825 -265006 -254904 -149382 -161968 -66180 82009 -151617
7261 -151617 -198630 -111427 -184819 -413294 -371993 -170710 -41996 8471 -1072 -89119 -245287
7250 -245287 -22121 -41698 -45151 -107019 -205891 -204644 -88230 190363 148058 -79426 -109450
7239 -109450 -91102 -84825 1381 29891 -252660 -402296 -331305 -165668 -120277 -100711 -176339
7228 -176339 -192176 -233923 -107813 -14267 45635 173831 136767 20318 57375 291865 204360
7217 204360 265829 370078 325588 176244 75222 -155077 -288229 -265116 -336672 -258413 -265707
7206 -265707 -279864 -99006 -115218 -157420 22362 49705 -46980 -98520 -215823 -111849 1410
7195 1410 34627 118331 23508 -145693 -267134 -259958 -297790 -224632 -114833 -99170 -114122 -239897
7183b39897J5275N6387L6731J49363J8130J12697j6894R7558K9761j76212k15424
7172a32525j47992J57569J56632L257j56771o3882J05051L3302j78238J70477
7162e3120J17494J84479M3208j05549q3208k6305q213j7012q6938p5543M2605
7151f8102R5825J9785m6390k164J1707j433J55554K01382K0927k04518q9746O5409
7139A58236P1835j63667j63100o3489P2069j9316j31952J85590O5237K5270K14645
7128B51358o9382j25846j27110R0012m3449J63537M1486n8856K7444K5663j39538
7117C5319j13676p7098j3879k3258J8731j0537J627j7259K15124L95193q0261
7106C30026j76422j44924k6302N5150N2372P8401J4204l6196n4584L3465j11295
$$ plain form
7183 -239897 -224622 -168235 -131504 17859 35989 148686 131792 229350 259111 82899 -132525
7172 -132525 -280517 -122948 33684 36941 -119830 -183712 -78661 -45359 -223597 -53120
7162 -53120 64374 248853 292061 186512 103304 76999 68786 51774 -35164 -110707 -68102
7151 -68102 27723 47508 1118 -1046 10661 9228 164782 366164 387091 182573 92827 158236
7139 158236 230071 66404 -96696 -160185 -88116 -107432 -239384 -53794 11443 36713 251358
7128 251358 181976 56130 -70980 19032 -24417 139120 180606 121750 149194 174857 35319
7117 35319 -78357 -155455 -169334 -192592 -173861 -184398 -182771 -200030 15094 410287 330026
7106 330026 153604 8680 -17622 37528 89900 168301 182505 146309 91725 125190 13895
7095A3895q0674N3186o0035k12o340o0461J34520J67998O0502j93902j30643o532
7083a08698K9740J46186J53089K8964j62972n8965n6581j3553J72908j9276n9288
7072E1554p8779j15485j48951J44683R4684j48332L1592P9092m3026j04658K4232
7061b13394l0146M2223O0345O436q813J4667Q4626n0341p9263j26178r1890J71766
7049b19962k0059K1975J05563Q3433L2826j42131M8995J05556L8652p791O3873
7038A10930L295M7648j569J8357Q4016j48186N0570K2480m9829j30621N589O5320
7026G8000J046J7532R3354j5624j19546j06766m8175L8380L14173J16778j37049
7015B32103o8210K3361j4722j96302o0277J57451j37399j05101L1960n1075J2892
$$ plain form
7095 13895 -66779 -13593 -73628 -73840 -80180 -140641 -6121 161877 222379 28477 -102166 -108698
7083 -108698 -78958 67228 220317 249281 86309 27344 -29237 -42790 130118 110842 51554
7072 51554 -27225 -142710 -291661 -146978 -52294 -200626 -169034 -89942 -132968 -237626 -213394
7061 -213394 -243540 -201317 -140972 -134536 -143349 -128682 -44056 -94397 -173660 -299838 -391728 -219962
7049 -219962 -240021 -218046 -112483 -29050 3776 -138355 -89360 16196 54848 47057 110930
7038 110930 114225 161873 160304 178661 262677 114491 165061 187541 137712 7091 12680 78000
7026 78000 79046 96578 189932 174308 54762 -52004 -100179 -61799 252374 369152 232103
7015 232103 163893 187254 172532 -23770 -84047 73404 -63995 -169096 -137136 -188211 -175319
7004a75319J38884j9285l13153P8361J61018L9454N7625j8673l1768j5829j3494
6993a12179J58510K74865j7641j21205k80580j24426K2110K3976K65114Q3890
6983A72434l6420r1514N470n5790Q7744L6348q3733j31481p5430j2606R6760K47204
6971A58986n3985j43936j21828N0049J44460Q1235j1886q9293j43389k7174J73107
6960A6346k3749j75390M7074M0937R9867J77907m7031j7046j84479k628m7238
6949a15430o9131l2205K5580N0520K1132M7762l3031p1026p9245N7140K22616
6938B4682k5539o2794J9126J9197n5034J19881N1224k1913j91319o8815Q0186
6927a11118j44647m3896K2477M6088O7437j23493J7815P6716O7323J8963J02526
$$ plain form
7004 -175319 -36435 -55720 -368873 -290512 -129494 -90040 -32415 -51088 -82856 -98685 -112179
6993 -112179 46331 321196 303555 182350 -98230 -222656 -200546 -176570 88544 172434
6983 172434 136014 44500 49970 -5820 81924 118272 34539 -96942 -172372 -184978 -88218 158986
6971 158986 105001 -38935 -160763 -110714 33746 114981 103095 13802 -129587 -156761 16346
6960 16346 -7403 -182793 -135719 -94782 5085 182992 135961 118915 -65564 -68192 -115430
6949 -115430 -184561 -216766 -191186 -140666 -119534 -71772 -104803 -175829 -255074 -197934 24682
6938 24682 -857 -63651 -44525 -25328 -80362 39519 90743 68830 -122489 -191304 -111118
6927 -111118 -255765 -299661 -277184 -231096 -163659 -287152 -269337 -192621 -125298 -106335 -3809
6916c809J33940K66257q6048k50888k33829l2226k5946j53731n5948K13864J18201
6905a10163P3836j02758q794j11124K7055m259L4377K47815n4057j18845P3246
6894e3671n1611P5184R4550K7846N5035J8625n5143n954j14934j81504M0337k2003
6882a73243Q9546J89717Q26r4430n9301J25792j8586j2046K4464m9306m6307j11834
6870a34708k6046R8822K1690j46446j38184N367J44822n6914p6852J93013l3754
6859a49190l2758J1674M5468J06617J21829P8587n9455r0839l109L2188o6202
6848e190k9139R7931q1449p0514k74087q3132R1853J75492K6145J15104O8883
6837C1897R5690J60078M2672j76886l28333J2038N8305K08960N7987j53029J50141
$$ plain form
6916 -3809 130131 396388 310340 59452 -174377 -206603 -232549 -386280 -442228 -228364 -110163
6905 -110163 -36327 -139085 -147879 -259003 -231948 -236207 -201830 45985 -8072 -126917 -53671
6894 -53671 -105282 -30098 64452 92298 147333 165958 110815 104861 -10073 -191577 -151240 -173243
6882 -173243 -83697 106020 106846 12416 -46885 78907 60321 48275 72739 23433 -22874 -134708
6870 -134708 -160754 -61932 -40242 -186688 -324872 -319505 -174683 -231597 -308449 -115436 -149190
6859 -149190 -181948 -170274 -124806 -18189 103640 182227 122772 31933 28824 61012 -5190
6848 -5190 -34329 63602 -17847 -88361 -362448 -445580 -353727 -178235 -152090 -36986 31897
6837 31897 127587 287665 330337 153451 -174882 -162844 -104539 104421 162408 9379 159520
6826A59520J07717p8999r7521m229N4462n9147j90255j66186l440J29953q4532
6815b32657j10168N9882K09646J07480J33058j3371j69834J24447O1860j13416
6805E6927j36647j7420J24772L6307K0661j1492j25398Q9698O9214o0791j98708
6794a52877j77623J4148P8067q291P2593K29811l9167L9962K4094j7050q8589
6783b4922k476L5648k6323O7501J053j4985J5660j2858j09925o1414Q5660m6957
6771i4338q112j43733j2713J42713J72657q0425p0737O0037J48890r0313O2991
6760H6917P5349q1222j81836o3065J70232o3210J13587l1578R3483l6452L0960
6749A13165o1266k0080k246N4606O8490j31656k9558L8631J216j01268q4247J26279
$$ plain form
6826 159520 267237 188238 90717 86488 140950 81803 -108452 -274638 -278078 -148125 -232657
6815 -232657 -342825 -282943 -73297 34183 167241 153870 -15964 108483 170343 56927
6805 56927 -79720 -97140 27632 63939 84600 73108 -52290 37408 106622 45831 -152877
6794 -152877 -330500 -316352 -238285 -246576 -173983 55828 16661 56623 80717 63667 -24922
6783 -24922 -27398 8250 -18073 49428 50481 35496 51156 38298 -71627 -133041 -47381 -94338
6771 -94338 -102450 -246183 -258896 -116183 56474 -23951 -94688 -34651 114239 23926 86917
6760 86917 162266 81044 -100792 -163857 6375 -56835 56752 25174 118657 82205 113165
6749 113165 51899 31819 29573 84179 152669 21013 -8545 30086 31302 -69966 -154213 -27934
6737b7934K09970Q0940j02156j91812r477M0834j07022J03825l2531K3270m2580
6726e4673j11123q961R1751K4005Q3026N3040o4446N8039L9167Q58R0828K8779
6714B30290j89290j7017q8284M9345O8296l9491j58473K527N6053Q2899j35977
6703a39122K4775Q3557J21449J07694p3288q4364j20960J91375j4522p8381o6012
6692d7799O8298J36572j1242m6411j24656l7485J48259j40168k6454q4278M679
6681a60685j06203K164J44152j1565R5182J15182K4621m9410l2573q5171k427
6670f6733p9267r9043l1853O5028k1715O95J04396N4901J09784j929J3307O2516
6658A10087K9662m2120r6544q9607j05016J08877R3626n6193j93988r5247J11664
$$ plain form
6737 -27934 182036 262976 160820 -30992 -40469 365 -106657 -2832 -35363 -12093 -54673
6726 -54673 -165796 -174757 -83006 -59001 24025 77065 12619 70658 109825 110683 201511 230290
6714 230290 41000 23983 -64301 -14956 53340 13849 -144624 -142097 -86044 -3145 -139122
6703 -139122 -114347 -30790 90659 198353 125065 40701 -80259 111116 96594 18213 -47799
6692 -47799 20499 157071 145829 99418 -25238 -62723 85536 -54632 -81086 -165364 -160685
6681 -160685 -266888 -264724 -120572 -132137 -36955 78227 102848 53438 20865 -64306 -66733
6670 -66733 -146000 -245043 -276896 -211868 -233583 -232888 -128492 -73591 36193 34264 47571 110087
6658 110087 139749 97629 1085 -88522 -193538 -84661 8965 -47228 -241216 -336463 -224799
6647b24799O5737j9286L1389o5891n9992J60268l7900J80071J90758j84376r6914
6636f0935J50477M1540j40787o4251R5221J0224m0604J64915j21724j01191Q4541
6625A7426n004k6231J37639n9148p1090j36802J65968Q1716N4914j01157K9232
6614H7463P4946o7442j11219Q3293J75242J42688j42237j49928j59068j12979
6604a79241N2015o6971m4225k346J65034L3156k08385j58491J53390K73297n5316
6593c8083j20368J63630L423J07999L8012j43049j3457J80145J13775o6790j55731
6582F9506k29642p0030J55109J45718n7006K11N021Q978m0756P9335J34133j39163
6570F1414l7496J08839J04279j1132k54775M1625K4995R1136j3309r3495l4108
$$ plain form
6647 -224799 -159062 -178348 -146959 -212850 -272842 -112574 -150474 29597 220355 35979 -60935
6636 -60935 89542 131082 -9705 -73956 21265 31489 -9115 155800 34076 -67115 17426
6625 17426 12422 -13809 123830 64682 -6408 -143210 22758 104474 159388 58231 87463
6614 87463 162409 94967 -16252 67041 242283 384971 242734 92806 -66262 -179241
6604 -179241 -127226 -194197 -238422 -240768 -75734 -42578 -250963 -409454 -256064 17233 -38083
6593 -38083 -158451 5179 8602 116601 154613 11564 -1893 178252 292027 225237 69506
6582 69506 -160136 -230166 -75057 70661 13655 13866 18887 27865 -12891 66444 200577 61414
6570 61414 23918 132757 237036 225904 -28871 12754 37749 128885 115576 22081 -12027
6559a2027k08747k2026k6959L8914J36175R9315P0816L5625j07403j4581Q8797
6548G7899N145M0351P0883j0986J2684r11j43720k06821j8696R1817m1550J65140
6536D1235J23655n3423l3294n1495K9133R7243j33376R164r9617M5206J5914K0277
6524A0622k34361j66867J74059K38356J38923J24562j97040j94480Q4438K7995
6514F207p6797M961j60928O099J35825j2420Q3429p4907J4596Q3881j33127m4844
6502a68025L002J48099p2050J22950k2589k9402L325j8427q483k45546q3305J55317
6490b15134J52560N7792q4382j80544K00658K73806K6942j05630k07163p3920
6480a55015Q0939j94874R2664L26066O5383j4764j10726k1705q7255r0356P6722
$$ plain form
6559 -12027 -220774 -242800 -269759 -230845 -94670 4645 75461 111086 3683 -10898 77899
6548 77899 83044 123395 194278 183292 195976 195065 51345 -155476 -174172 -82355 -123905 41235
6536 41235 164890 111467 78173 26678 55811 153054 19678 28842 -70775 -25569 -9655 10622
6524 10622 -223739 -390606 -216547 21809 160732 285294 88254 -106226 -21788 6207
6514 6207 -70590 -65629 -226557 -220458 -84633 -97053 -13624 -88531 -73935 9946 -123181 -168025
6502 -168025 -165023 -16924 -88974 33976 11387 -18015 -14690 -33117 -41600 -287146 -370451 -215134
6490 -215134 -62574 -4782 -89164 -269708 -69050 204756 231698 126068 -81095 -155015
6480 -155015 -74076 -268950 -176286 149780 215163 200399 89673 67968 -19287 -109643 -32921
6469c2921J49976J28267k3363J77765q031k80042k29488m645P8909J27189k5986
6458E7630j31560L717J04636j2346m3081j0541K5839r7687j03754K224J57713
6447d7210j66166o7642K59020K743n5577K5029R909K53053K7955j81821l1274
6436B8019M8163O7524p0792k07201m6568k4347O0989l397J11917O9152q5840j32374
6424a84755P7890q5777q0259N8378R4978l207m9639J8677J56864L9516l6099m9881
6412d3314P9422j2935l2972J9691k6077l2145k98275j62488Q6538K06154Q5732
6401a30669N4348R822m8116j2355N8449q0853J13292N2674k3094p7515O664j10119
6389a87472p49N8158j75984L1709Q0431K3200M5588L3060J75490Q5178j10297
$$ plain form
6469 -32921 117055 245322 221959 399724 391693 111651 -117837 -122482 -43573 83616 57630
6458 57630 -73930 -70213 34423 22077 -21004 -31545 -5706 -103393 -207147 -204923 -47210
6447 -47210 -213376 -281018 -21998 -19255 -74832 -49803 -39894 213159 241114 59293 28019
6436 28019 76182 143706 72914 -134287 -180855 -205202 -144213 -147610 -35693 33459 -52381 -184755
6424 -184755 -106865 -192642 -272901 -214523 -119545 -122752 -172391 -153714 3150 42666 6567 -43314
6412 -43314 36108 23173 -9799 9892 -16185 -48330 -346605 -509093 -422555 -216401 -130669
6401 -130669 -76321 -66499 -114615 -126970 -68521 -149374 -36082 16592 -6502 -84017 -77353 -187472
6389 -187472 -188221 -130063 -306047 -274338 -193907 -170707 -125119 -92059 83431 168609 58312
6378E8312j89753J06590J48518k4494k2959J3012m6615o693r2596J03199J64497
6367B11018j6517o5235l4819N2208M9768J5193j66930j51331j1850P4877j22940
6356a66558o7000J78270J90340o098j36108k9733n9896K2691J81224N7203L8155
6345B02490J43559l1728l6034j52076k15971r7773K8509j86318l1101K1394M8700
6334c06349J74884K83376J33019k94103k63542r0113P6227J46540p7481P714J16503
6323i3325M9466j27567r00M2404j70018J3037R1068j6659K4885M5404J65276L9923
6311F2994j57213k0649N7050l1222j17578J12081K0461J6069j9806K1282k2293
6300g8824k7770Q0563P7819j46414r8556N904n4985J17096J59930j1631j42N2673
$$ plain form
6378 58312 -131441 -24851 123667 99173 76214 89226 42611 35918 -56678 46521 211018
6367 211018 194501 129266 94447 146655 196423 211616 44686 -106645 -118495 -43618 -166558
6356 -166558 -233558 -55288 135052 128954 -7154 -36887 -96783 -74092 107132 164335 202490
6345 202490 346049 314321 278287 126211 -89760 -187533 -159024 -345342 -376443 -355049 -306349
6334 -306349 -131465 151911 284930 -9173 -272715 -362828 -286601 -140061 -217542 -209828 -93325
6323 -93325 -43859 -171426 -172326 -129922 -299940 -286903 -195835 -212494 -187609 -142205 23071 62994
6311 62994 -94219 -114868 -57818 -89040 -206618 -94537 -74076 -58007 -77813 -56531 -78824
6300 -78824 -106594 -26031 51788 -94626 -193182 -187278 -242263 -125167 34763 23132 22990 75663
6288G5663p235m8984j26118O9823Q1845M3490k38330q3148r954K07883p5611j63711
6276b74387J2672P1795P0032j8084N6861j06199j93514o4944L8215J80205J51728
6265g5620j43838l6296J7625j8056O9774R444m5405P878L4417q6488r3914P2979
6253b87500J9569J9914J28332J06028p6648j68985p8175Q356K18290K31474R1103
6242B11758q5716k2134M156J1439j9068m058j95079j42966R3454k8046O5879j47554
6230b57935K2458K09156J29169J09334Q7530j77172j36509k09445j5175J0912
6220b27677K1486n5742J22800N9940K1641j4877k2110M1090j494j82556J1631
6209b25868j2010j1081J83902q1929K8815N3645m7905j37929l0763j55853Q8048
$$ plain form
6288 75663 68428 19444 -106674 -36851 44994 88484 -149846 -232994 -242948 -35065 -110676 -274387
6276 -274387 -261715 -189920 -119888 -137972 -81111 -187310 -380824 -445768 -407553 -227348 -75620
6265 -75620 -219458 -255754 -238129 -256185 -186411 -176967 -222372 -214494 -180077 -266565 -360479 -287500
6253 -287500 -267931 -248017 -119685 -13657 -90305 -259290 -337465 -329109 -110819 120655 211758
6242 211758 126042 103908 108064 119503 100435 96377 -98702 -241668 -148214 -176260 -110381 -257935
6230 -257935 -235477 -26321 102848 212182 299712 122540 -13969 -223414 -238589 -227677
6220 -227677 -206191 -261933 -139133 -79193 -57552 -72429 -94539 -53449 -54943 -237499 -225868
6209 -225868 -237878 -248959 -65057 -146986 -118171 -64526 -112431 -250360 -281123 -436976 -348928
6198c48928J47147p1063j58865Q3180K59788J62529l5486m3513J4647l8624j12086
6187a41274j3890J48205j52292O7428K3250k960j65542o0855J17377R1961n0542
6176a39134J7150j31917l5058k2213Q6808K76749J66569j47641j2673j28721j37131
6165b07212R551n6940o8500J60077J77204L5201K1345J58595J8158l12917j82389
6154b47827J415J02396j6583L230P9546M3066M8771L5474J4894r6767J5679m6088
6142f2794P3828j7070p7939q5099K4149o773J32095L0071j4569J10965J56070
6131B62934J18770k34232n2890L9977n8019o4876l6115m455P7409L6696L2241
6120A17440M9950K4807p1313o7868k72474N0625R3802Q4645K3610P1635O7444
$$ plain form
6198 -348928 -201781 -272844 -431709 -348529 -88741 73788 38302 -5211 9436 -29188 -141274
6187 -141274 -155164 -6959 -159251 -91823 -68573 -71533 -237075 -297930 -180553 -88592 -139134
6176 -139134 -121984 -253901 -288959 -311172 -224364 52385 218954 71313 58640 -70081 -207212
6165 -207212 -197661 -254601 -323101 -163024 14180 49381 70726 229321 247479 -65438 -247827
6154 -247827 -246412 -144016 -160599 -157369 -77823 -34757 14014 49488 64382 -32385 -16706 -62794
6142 -62794 11034 -6036 -83975 -169074 -144925 -151698 -19603 10468 -4101 106864 262934
6131 262934 381704 147472 94582 134559 76540 11664 -24451 -28906 48503 85199 117440
6120 117440 167390 192197 120884 53016 -219458 -168833 -75031 9614 33224 104859 172303
6109A72303j6348l5413R0706k4815j41817l8029M1757J9177k4496L128O7111k8241
6097H5023j46912o1320K2993l3720p2826J41754R0055j28623j46968j8806q1521
6086c50871Q8356P7647J20534J6280J16033l5494j35192j6789L5504M9451q1663
6075a16204o3699J48071O6842J5700K490M2259k9644j11682n7852K9710K4476
6064d9533r6728k62513m6826R2955K95190J27853j30977N4459n3702r7923n7276
6053b25021o6427Q2319M0675J03560J37725N0100r8510j65548j29000J15291r2799
6042b47635J053J99518P0482j03423j86494Q4521M9173L5498Q2242k5460j09836
6031a50361j8696Q6513K2082m9915j89588O5169K14745O2132L7484J5741j27413
$$ plain form
6109 172303 155955 120542 211248 186433 44616 6587 48344 67521 43025 46153 113264 85023
6097 85023 -61889 -123209 -100216 -133936 -206762 -65008 25047 -103576 -250544 -269350 -350871
6086 -350871 -262515 -184868 -64334 -48054 67979 32485 -102707 -119496 -83992 -34541 -116204
6075 -116204 -179903 -31832 35010 50710 53200 95459 65815 -45867 -103719 -74009 -49533
6064 -49533 -146261 -408774 -455600 -362645 -67455 60398 -70579 -16120 -69822 -167745 -225021
6053 -225021 -291448 -209129 -168454 -64894 72831 122931 24421 -141127 -270127 -154836 -247635
6042 -247635 -246582 -47064 23418 -80005 -266499 -181978 -132805 -97307 -15065 -40525 -150361
6031 -150361 -169057 -82544 -60462 -110377 -299965 -234796 -20051 42081 79565 95306 -32107
6020c2107J14511J31145j45488m6657J1213j61817J8717J7927J27171k8787K6137
6009C1965m3628j65J04198M8064k7142R3337J7374o8672j9830k3515j31734k87643
5997c07391j81300J59261J42596l8552n6480M4480r0498l9478q1558N7471K29011
5986a62438J49354P2922J3653n3446k07017n1905J5064R1090R4319o5911O7557
5975c6758R3663l5029j13582K02024K7486j47292l9086O6694M2963k0941N9504
5964I9646J0359k17846k7155j20143j03195j1131J27347L9053q32L5633M6133
5953a22131l7255J3004j91124j10762K04663J95254J32936k9973j27419j35672
5943b08479M9928J02575J04181J3937j08579m4051P5933o1947n9278K33578K11019
$$ plain form
6020 -32107 82404 213549 68061 21404 32617 -129200 -110483 -92556 34615 5828 31965
6009 31965 -11663 -11828 92370 140434 113292 206629 224003 155331 135501 111986 -19748 -307391
5997 -307391 -488691 -329430 -186834 -225386 -281866 -237386 -327884 -367362 -448920 -391449 -162438
5986 -162438 -13084 59838 73491 20045 -186972 -238877 -223813 -132723 -38404 -104315 -36758
5975 -36758 56905 21876 -91706 110318 137804 -9488 -48574 18120 61083 40142 99646
5964 99646 110005 -107841 -134996 -255139 -358334 -369465 -242118 -203065 -203897 -168264 -122131
5953 -122131 -159386 -146382 -337506 -448268 -243605 -48351 84585 54612 -72807 -208479
5943 -208479 -158551 -55976 48205 62142 -46437 -90488 -14555 -76502 -135780 97798 308817
5932C08817M1868j06615j57351J26430O2340j1198j59687j51991R0151M9284P4211
5921A66259O9029r9592j04822p9676m9057J7236j05856l1882j440l6990K20762
5910c6029J17155j27085J23262J19139q7530m1498r8148K5065O3391n4313R5870
5899I9279O6410K7463J57193j11988k83971k04067L9677N0720n1587J26770K72975
5888A88874P1017j24000j28481Q0889K4769L3177j25950N0580N4920j70804p3806
5877a18815k8174K1668k2392j00365N0066j6295q8993J59335O0022O9345k0561
5866c5159j3716J7280k9608N959j02688q5393l844j2525J25248K03403k1308J6262
5854F3911P0076j06565j77580n5985J87159Q0023j22657M7962J66274J01151j79581
$$ plain form
5932 308817 350685 244070 86719 213149 275489 264291 104604 -47387 42764 92048 166259
5921 166259 235288 135696 30874 -48802 -97859 -80623 -186479 -218361 -219801 -256791 -36029
5910 -36029 81126 -45959 77303 196442 108912 67414 -30734 -5669 57722 3409 99279
5899 99279 165689 193152 350345 238357 -45614 -249681 -210004 -159284 -210871 -84101 188874
5888 188874 259891 135891 7410 88299 113068 146245 20295 70875 125795 -45009 -118815
5877 -118815 -146989 -125321 -147713 -248078 -198012 -214307 -303300 -143965 -83943 -14598 -35159
5866 -35159 -48875 -31595 -61203 -55244 -157932 -243325 -247169 -259694 -134446 68957 47649 63911
5854 63911 133987 27422 -150158 -206143 -18984 61039 -61618 -13656 152618 253769 74188
5843G4188j70023R367K6230K3159m8310j92402r6197J64601P6506Q3874K1568
5832b7439r1283j7079O5475P5512M8570M7774l7639Q1014J0011j33671j27533
5821a06288j51727J33051J79244N908l6491M0224n7533K3219K6086m4662q6883
5810g5852J07045M3998j04867r5575Q1597l4704o5472J34693j10036R8413j5710
5799c6470k1032j63183j94330M4476J92902K35663O0674m8431r167O9558j41137
5788a0477j28066N0851m8342n572J20530N9053P5436l0972j19950j76712j07954
5777c22175Q2108J96672J30600N4792l6280q3730m6032k19853O2365J1690O5450
5766a04393J40492P6056j37577k3029O3764l5931n7345k485Q283j8211j42240
$$ plain form
5843 74188 -95835 -86468 -60238 -37079 -85389 -277791 -373988 -209387 -132881 -49007 -27439
5832 -27439 -118722 -135801 -70326 5186 53756 101530 63891 144905 154916 21245 -106288
5821 -106288 -258015 -124964 54280 60188 23697 63921 6388 29607 55693 11031 -75852
5810 -75852 31193 75191 -29676 -125251 -43654 -78358 -143830 -9137 -119173 -20760 -36470
5799 -36470 -57502 -220685 -415015 -370539 -177637 58026 118700 70269 61102 130660 -10477
5788 -10477 -138543 -87692 -136034 -141606 -21076 37977 113413 82441 -37509 -214221 -322175
5777 -322175 -240067 -43395 87205 141997 105717 21987 -24045 -243898 -181533 -169843 -104393
5766 -104393 36099 112155 -25422 -48451 15313 -20618 -77963 -80448 -72165 -90376 -232616
5755b32616J05278K02769P3223m8214k24962j63985J50233J50420R2559P6826
5745A81531j01081m6556J75942j53686K4513K2737r2230p9521J40672o6915j0457
5734e051J16426p2177j54358m7590J64315K77641k02344k36692j92117q4692K8204
5723d08435j17545o6086K40719K95198K85368J47598j23955k02041j24646k49994
5713c23819r4865M792k6977J88562J68642k993j21074K1689Q9060N83m6776O576
5701a36600O4802J18935r5634j25525q8650M3563J09074O4131o9663n3520J84112
5690A5025n0014o55J72806l2296q0573p5223j0797J03718J24273J05021o3716
5679B07569r6534n5687P6443j52612r5082J94938Q2495M9782p5006j83587j12571
$$ plain form
5755 -232616 -127338 75431 148654 100440 -124522 -288507 -138274 12146 104705 181531
5745 181531 80450 33894 209836 56150 80663 103400 11170 -68351 72321 5406 -5051
5734 -5051 111375 39198 -115160 -162750 1565 279206 76862 -159830 -351947 -436639 -408435
5723 -408435 -525980 -592066 -351347 -56149 229219 376817 252862 50821 -73825 -323819
5713 -323819 -418684 -413892 -440869 -252307 -83665 -86658 -207732 -186043 -96983 -96400 -143176 -136600
5701 -136600 -71798 47137 -48497 -174022 -262672 -219109 -110035 -45904 -115567 -169087 15025
5690 15025 -34989 -35644 137162 104866 24293 -50930 -61727 41991 166264 271285 207569
5679 207569 111035 55348 131791 -20821 -115903 79035 161530 211312 136306 -47281 -159852
5668a59852J9306J24054m5558K3203m4295L0014P3009r3554P1029M6756J50315
5657A94427N766n7132o6933n6715j9293N5308l9942J1110K8730L3341o0073N1280
5645G9874J68902k3073j73455o2532J80101p6203j04679K4121P8922M3798R6796
5634B32572k4531j49241j82119l0890N9332n1367J06914R2942n3766q4065j8453
5623a02672L3898J34516J0556K7071q5549Q91j12444j05175N898J70815q8547
5612a10742P3606J01406j22557k988m8247M6435P7221j59725L6215K28618N51
5601A19793N1924O3048j26178j6795j11996j75627R1188J01038M1623R8561r0728
5590D5851r2654M0771L3254n3730J33360J0522L5628R8163j25185j76830q235
$$ plain form
5668 -159852 -140546 -16492 -62050 -38847 -83142 -53128 19881 -73673 -2644 44112 194427
5657 194427 200193 143061 76128 19413 120 55428 15486 26596 55326 88667 28594 79874
5645 79874 248776 225703 52248 -10284 169817 93614 -11065 13056 91978 135776 232572
5634 232572 208041 58800 -123319 -154209 -94877 -146244 -39330 53612 -154 -84219 -102672
5623 -102672 -68774 65742 76298 103369 17820 18711 -93733 -198908 -193010 -22195 -110742
5612 -110742 -37136 64270 -58287 -61275 -109522 -63087 14134 -145591 -109376 119242 119793
5601 119793 171717 234765 108587 91792 -20204 -195831 -104643 -3605 38018 136579 45851
5590 45851 -46803 -6032 27222 -26508 106852 117374 153002 251165 125980 -50850 -59085
5579e9085L1061p292Q8163P0041q0698k196j4256M1402P5671M3739L7688j3803
5567B10435k8942k7663k31379k5581M9545K885J8244m895j01305q2824N6275J0906
5555a54299M3175J07510J8122j01200M3448R8848J49192k5602m3977N7023j5814
5544A76426q6960P67J01867N6189J20673j89923k08630p3302r2516m421R2236
5533a07594J58472J31149J17847O4915r3330j01332p2331j6475P1607j87840l8870
5522g3782n5875p1543J14103o6683J1195P9111L7486J48816J12270j9633l1759
5511A83706l8481l5990j17131O4806N2106L4219J41496J00024j84125k01990j51389
5500a52749N1580J29718Q0389j06967J24189N3571j33344r3382J18057P5085k8082
$$ plain form
5579 -59085 -28024 -35316 52847 122888 42190 39994 25738 67140 142811 186550 224238 210435
5567 210435 181493 153830 -77549 -103130 -53585 -50700 -32456 -37351 -138656 -221480 -165205 -154299
5555 -154299 -111124 -3614 14508 -86692 -43244 55604 204796 179194 135217 192240 176426
5544 176426 89466 90233 192100 248289 368962 179039 -29591 -102893 -195409 -199830 -107594
5533 -107594 50878 182027 299874 364789 271459 170127 97796 81321 152928 -34912 -73782
5522 -73782 -129657 -201200 -87097 -153780 -142585 -63474 -25988 122828 235098 215465 183706
5511 183706 145225 109235 -7896 56910 109016 143235 284731 384755 200630 -1360 -152749
5500 -152749 -101169 28549 108938 1971 126160 179731 46387 -46995 71062 146147 118065
5489A18065L1617j19041q8849M4926K20045q2673r5292J51198J9303N6930p114
5478B49115k1524N3493k8033J50449j12947j39080r9496m0598l961Q8164j69777
5467g4195o6582q8468m6223j02389J7508m5854q2386R8402K24784l493k1713J94908
5455D299J91855l1524j72114j5398J0325N856l4028m0473J59020J9531k0904l3365
5443D3080l6402p4327J89971K3652j30633q7406K6690R514J26843o4945P500j1000
5431B2537M0676J0134k3360m7467K0097j01771l6493k4450Q477j11416k7039K5466
5419b44609K29584J14528k25870j45524J38956R6322J23961N1433q66q9804p1856
5408b3745N1539q3561j6510p5790J75343J48692k1183j4943j66596j16531L1635
$$ plain form
5489 118065 149682 30641 -58208 -13282 206763 124090 28798 179996 199299 256229 249115
5478 249115 227591 281084 253051 403500 290553 151473 51977 11379 7418 95582 -74195
5467 -74195 -140777 -229245 -275468 -377857 -360349 -406203 -488589 -390187 -165403 -168896 -190609 4299
5455 4299 196154 164630 -7484 -22882 -12557 -6701 -40729 -81202 77818 97349 76445 43080
5443 43080 6678 -67649 122322 145974 15341 -72065 -45375 -35861 90982 26037 33537 22537
5431 22537 63213 73347 49987 2520 22617 -79154 -115647 -140097 -131620 -243036 -270075 -244609
5419 -244609 -15025 99503 -126367 -271891 -132935 -36613 87348 138781 137915 48111 -23745
5408 -23745 27794 -55767 -72277 -148067 27276 175968 154785 139842 -26754 -143285 -111650
5397a11650P5840n9354m308J02568K8512m9394J3340J3320m7999j1651J21240
5386G0464R7256J05675p8702j11306M5451L1080p5500p1412n2048o3186j09826
5375b12054N7036P6866l3504M1706r1236n3258m447k8742k8403M0056J17831J54519
5363C6370r2909n1056r4809k3524K47735J5711j80377R8484Q7999k42941r4755
5352b94072R7530K7523j17462J7754L8793J58969K15546j6429k41254q2357k0950
5341b16409l6685K22691P214j27569M3714J03492J8324J88552K3122n8333k06416
5330c8303j02565N1572p8964l0491o3738l2813J50129K71248n676k7768J7487
5319A10118m5965j66601n0900K38103n412j92788r8470L855M3861L0880j00993
$$ plain form
5397 -111650 -35810 -95164 -99472 3096 31608 -17786 -4446 8874 -39125 -50776 70464
5386 70464 167720 273395 194693 83387 128838 159918 84418 13006 -39042 -102228 -212054
5375 -212054 -155018 -78152 -111656 -69950 -161186 -214444 -218891 -247633 -276036 -235980 -118149 36370
5363 36370 -56539 -107595 -202404 -225928 21807 37518 -142859 -44375 43624 -199317 -294072
5352 -294072 -196542 -169019 -286481 -268727 -229934 -70965 144581 128152 -113102 -195459 -216409
5341 -216409 -253094 -30403 -23189 -150758 -107044 -3552 14772 203324 226446 168113 -38303
5330 -38303 -140868 -89296 -168260 -198751 -262489 -295302 -145173 126075 120399 92631 110118
5319 110118 64153 -102448 -153348 84755 79343 -113445 -211915 -208060 -164199 -133319 -234312
$$ [...]
##END NTUPLES=NMR SPECTRUM
##END=
