##TITLE=Analysis number 326935
Compound Code cc 29402
Project Code adrs
Chemist Name endeavour
##JCAMPDX= 6.0         $$ Bruker NMR JCAMP-DX V2.0
##DATA TYPE= NMR SPECTRUM
##DATA CLASS= NTUPLES
##ORIGIN= Bruker BioSpin GmbH
##OWNER= nmr
$$ XWIN-NMR		Version 3.5
$$ Fri Mar  2 11:01:16 2007 GMT Standard Time (UT+0h)  MAYBRIDGE\nmr@NMR_250MHZ
##.OBSERVE FREQUENCY= 250.131544655141
##.OBSERVE NUCLEUS= ^1H
##.ACQUISITION MODE= SIMULTANEOUS (DQD)
##.ACQUISITION SCHEME= undefined
##.AVERAGES= 16
##.DIGITISER RES= 18
##SPECTROMETER/DATA SYSTEM= dpx250
##.PULSE SEQUENCE= zg30
##.SOLVENT NAME= CDCl3
##.SHIFT REFERENCE= (INTERNAL, CDCl3, 0, 16.522)
##AUDIT TRAIL= $$ (NUMBER, WHEN, WHO, WHERE, WHAT)
$$ ##TITLE= Audit trail, XWIN-NMR		Version 3.5
$$ ##JCAMPDX= 5.01
$$ ##ORIGIN= Bruker BioSpin GmbH
$$ ##OWNER= nmr
$$ C:\u/data/dgb/nmr/ADRS/150/pdata/1/auditp.txt
$$ ##AUDIT TRAIL=  $$ (NUMBER, WHEN, WHO, WHERE, WHAT)
(   1,<2007-03-02 11:00:41.08 +000>,<MAYBRIDGE\nmr>,<NMR_250MHZ>,
      <created by zg, POWCHK disabled, PULCHK disabled
       configuration hash MD5:
       49 4B E0 1D 92 C2 6B 37 9F E6 65 BC 52 41 86 1D
       data hash MD5: 64K
       2E F7 3D FC B4 10 74 38 74 57 71 5E 14 5C 17 E0>)
(   2,<2007-03-02 11:01:03.54 +000>,<MAYBRIDGE\nmr>,<NMR_250MHZ>,
      <Start of raw data processing
       ef LB = 0.3 FT_mod = 6 PKNL = 1 SI = 32K 
       data hash MD5: 32K
       0E B9 E6 D3 39 5B D7 1D 01 29 B2 39 7B 6C EA 71>)
(   3,<2007-03-02 11:01:05.44 +000>,<MAYBRIDGE\nmr>,<NMR_250MHZ>,
      <apk 
       data hash MD5: 32K
       B5 50 FE 9E D1 DD E6 AA FD 22 F3 78 D8 92 67 7F>)
(   4,<2007-03-02 11:01:06.13 +000>,<MAYBRIDGE\nmr>,<NMR_250MHZ>,
      <abs ABSG = 5 
       data hash MD5: 32K
       3C DE AA 19 E0 65 81 E3 6A 86 D5 1E 11 25 97 73>)
$$ ##END=
$$ 
$$ hash MD5
$$ 48 BD 70 84 F2 4C 73 6F 4A 0A 0E 53 86 57 FC B2
##$RELAX= 
##$RELAX= 
##$RELAX= 
##$RELAX= 
##$RELAX= 
##$RELAX= 
##$RELAX= 
$$ Bruker specific parameters
$$ --------------------------
##$DU= <C:\u>
##$EXPNO= 150
##$NAME= <ADRS>
##$PROCNO= 1
##$TYPE= <nmr>
##$USER= <dgb>
##$AMP= (0..31)
100 100 100 100 100 100 100 100 100 100 100 100 100 100 100 100 100 100 
100 100 100 100 100 100 100 100 100 100 100 100 100 100 
##$AQSEQ= 0
##$AQ_mod= 3
##$AUNM= <au_zg>
##$AUTOPOS= <36 >
##$BF1= 250.13
##$BF2= 250.13
##$BF3= 250.13
##$BF4= 250.13
##$BF5= 500.13
##$BF6= 500.13
##$BF7= 500.13
##$BF8= 500.13
##$BYTORDA= 1
##$CFDGTYP= 0
##$CFRGTYP= 5
##$CHEMSTR= <none>
##$CNST= (0..31)
1 1 145 1 1 1 1 1 1 1 1 1 1 1 1 1 1 1 1 1 1 1 1 1 1 1 1 1 1 1 1 1 
##$CPDPRG= <>
##$CPDPRG1= <>
##$CPDPRG2= <>
##$CPDPRG3= <>
##$CPDPRG4= <mlev>
##$CPDPRG5= <mlev>
##$CPDPRG6= <mlev>
##$CPDPRG7= <mlev>
##$CPDPRG8= <mlev>
##$CPDPRGB= <>
##$CPDPRGT= <>
##$D= (0..31)
0 1 0 0 0 0 0 0 0 0.06 0 0 0 0 0 0 0.0002 0 0 0 0 0 0 0 0 0 0 0 0 0 0 
0 
##$DATE= 1172833239
##$DBL= (0..7)
120 120 120 120 120 120 120 120 
##$DBP= (0..7)
150 150 150 150 150 150 150 150 
##$DBP07= 0
##$DBPNAM0= <>
##$DBPNAM1= <>
##$DBPNAM2= <>
$$ [...]
##$SUBNAM7= <"">
##$SUBNAM8= <"">
##$SUBNAM9= <"">
##$SW= 20.6930455092707
##$SWIBOX= (0..15)
0 0 3 0 0 0 0 0 0 0 0 0 0 0 0 0 
##$SW_h= 5175.983436853
##$TD= 65536
##$TD0= 1
##$TE= 295.16
##$TE2= 300
##$TE3= 300
##$TEG= 300
##$TL= (0..7)
0 120 120 120 120 120 120 120 
##$TP= (0..7)
150 150 150 150 150 150 150 150 
##$TP07= 0
##$TPNAME0= <>
##$TPNAME1= <>
##$TPNAME2= <>
##$TPNAME3= <>
##$TPNAME4= <>
##$TPNAME5= <>
##$TPNAME6= <>
##$TPNAME7= <>
##$TPOAL= (0..7)
0.5 0.5 0.5 0.5 0.5 0.5 0.5 0.5 
##$TPOFFS= (0..7)
0 0 0 0 0 0 0 0 
##$TUNHIN= 0
##$TUNHOUT= 0
##$TUNXOUT= 0
##$USERA1= <user>
##$USERA2= <user>
##$USERA3= <user>
##$USERA4= <user>
##$USERA5= <user>
##$V9= 5
##$VALIST= <valist>
##$VCLIST= <CCCCCCCCCCCCCCC>
##$VD= 0
##$VDLIST= <DDDDDDDDDDDDDDD>
##$VPLIST= <PPPPPPPPPPPPPPP>
##$VTLIST= <TTTTTTTTTTTTTTT>
##$WBST= 1024
##$WBSW= 4
##$XGAIN= (0..3)
0 0 0 0 
##$XL= 0
##$YL= 0
##$YMAX_a= 369303
##$YMIN_a= -434160
##$ZGOPTNS= <>
##$ZL1= 120
##$ZL2= 120
##$ZL3= 120
##$ZL4= 120
##$ABSF1= 16.522
##$ABSF2= -4.171173
##$ABSG= 5
##$ABSL= 3
##$ALPHA= 0
##$AQORDER= 0
##$ASSFAC= 0
##$ASSFACI= 0
##$ASSFACX= 0
##$ASSWID= 0
##$AUNMP= <proc_1d>
##$AZFE= 0.1
##$AZFW= 0.1
##$BCFW= 0
##$BC_mod= 0
##$BYTORDP= 0
##$COROFFS= 0
##$CY= 12.5
##$DATMOD= 1
##$DC= 0
##$DFILT= <>
##$DTYPP= 0
##$F1P= 14.0000005364418
##$F2P= -0.99999901652339
##$FCOR= 0.5
##$FTSIZE= 32768
##$FT_mod= 6
##$GAMMA= 0
##$GB= 0
##$INTBC= 1
##$INTSCL= 1
##$ISEN= 128
##$LB= 0.3
##$LEV0= 0
##$LPBIN= 0
##$MAXI= 10000
##$MC2= 0
##$MEAN= 0
##$ME_mod= 0
##$MI= 0
##$NCOEF= 0
##$NC_proc= -4
##$NLEV= 6
##$NOISF1= 0
##$NOISF2= 0
##$NSP= 0
##$NTH_PI= 0
##$NZP= 0
##$OFFSET= 16.522
##$PC= 1
##$PHC0= 236.8644
##$PHC1= -3.500103
##$PH_mod= 1
##$PKNL= yes
##$PPARMOD= 0
##$PSCAL= 4
##$PSIGN= 0
##$REVERSE= no
##$SF= 250.13
##$SI= 32768
##$SIGF1= 0
##$SIGF2= 0
##$SINO= 400
##$SIOLD= 32768
##$SREGLST= <1H.CDCl3>
##$SSB= 0
##$STSI= 32768
##$STSR= 0
##$SW_p= 5175.98343685301
##$SYMM= 0
##$S_DEV= 0
##$TDeff= 65536
##$TDoff= 0
##$TI= <Analysis number 999999
Compound Code 99
Book Reference 9
Project Code 9>
##$TILT= no
##$TM1= 0
##$TM2= 0
##$TOPLEV= 0
##$USERP1= <user>
##$USERP2= <user>
##$USERP3= <user>
##$USERP4= <user>
##$USERP5= <user>
##$WDW= 1
##$XDIM= 32768
##$YMAX_p= 309031683
##$YMIN_p= -343378
$$ End of Bruker specific parameters
$$ ---------------------------------
##NTUPLES= NMR SPECTRUM
##VAR_NAME=  FREQUENCY,     SPECTRUM/REAL,   SPECTRUM/IMAG
##SYMBOL=    X,             R,               I
##VAR_TYPE=  INDEPENDENT,   DEPENDENT,       DEPENDENT
##VAR_FORM=  AFFN,          ASDF,            ASDF
##VAR_DIM=   32768,         32768,           32768
##UNITS=     HZ,            ARBITRARY UNITS, ARBITRARY UNITS
##FACTOR=    0.157963299565203, 1,           1
##FIRST=     4132.6476996994, 0,             0
##LAST=      -1043.33573715361, 0,           0
##MIN=       -1043.33573715361, -343378,     0
##MAX=       4132.6476996994, 309031683,     0
$$ Real data points
##PAGE= N=1
##DATA TABLE= (X++(R..R)), XYDATA
$$ [...]
28173 -67643 -60001 -27763 -38530 -49763 -4401 11214 -9986 -36035 -7767 7046 1453 -14457
28161 -14457 -16834 -34423 -71336 -44062 -103641 -93227 -48018 -9547 47968 37260 1425 -14465
28149 -14465 -71567 -94630 -55600 -91010 -68177 -47324 -67344 -26450 108697 62056 21833
28138 21833 -29349 -26567 12677 -25538 -13767 58833 73876 54032 83105 60388 103822 31992
28126 31992 67532 60767 -6157 41348 24484 65184 84404 173732 175359 84751 133370 109267
28114 109267 20003 27872 66875 33713 3086 11292 -60454 -115374 -15645 -69936 -123867 -53285
28102 -53285 -79230 -95428 -9777 84642 118135 114822 106681 103704 84895 84342 168956 142000 88327
28089 88327 90902 117365 37173 22298 -5731 -45272 -79805 -115323 -14696 62978 149247 129568
28077 129568 86146 87452 -44464 -38986 47761 36498 -73256 -119228 -125755 -68536 62872
28066 62872 93689 57719 22382 44886 30437 10347 -33178 -90929 -216976 -287130 -242624
28055 -242624 -114022 -40639 131 -72489 -12505 56813 86721 31280 -18968 -75617 -50898
28044 -50898 -89977 -107883 -32525 -11132 -10703 -70027 52875 28563 -27910 22375 62743 60032
28032 60032 72789 103892 126906 150325 189615 138502 29619 -49116 -57131 14749 17984 28282
28020 28282 28063 6392 82414 132926 113707 104652 73801 41866 50718 99682 86844 66754
28008 66754 31826 62086 -11199 -37744 74099 52110 27651 80186 150441 11688 -65389
27997 -65389 -51170 13875 85932 171947 228989 122458 83252 74508 91392 136283 124273 2330
27985 2330 -69367 -25072 -28831 -14668 -36231 -3984 -10461 -26303 -41358 -328 15023 19829
27973 19829 -30861 -51520 -40502 -111363 -120956 -55641 112 32106 -15238 9643 24948 23271
27961 23271 -9096 68247 71890 45903 47654 4601 -34378 -44733 -30995 -19274 -3890 -26102
27949 -26102 -6079 -41453 -92322 -105013 -48387 6105 39384 -37521 -58223 -19402 14354 -12362
27937 -12362 -31430 13982 28130 18190 23444 67965 51462 -24709 -56358 -78778 -17567 -45036
27925 -45036 -127327 -163882 -100328 44047 95665 123642 124211 90036 55888 23621 -13424 -64118
27913 -64118 -94289 -23289 43883 16873 80248 139561 74211 59589 13254 -66316 -101427 -4922
27901 -4922 8121 2300 -28929 -44459 -25078 66569 98968 86163 21392 37995 -55985 -60483
27889 -60483 20531 54217 -31388 -32904 -43702 -65861 -11544 36908 40379 1135 25881 101004
27877 101004 92598 -11890 14863 61569 63875 14395 -18592 -95840 -184655 -151357 -63272 -38017
27865 -38017 -84397 -57606 62 -29702 -116406 -87714 -65505 -27944 -58834 -109437 -100720 -104413
27853 -104413 -145176 -161091 -51490 17593 -42142 -64800 -27296 -33243 -59480 -64004 -91953 -56745
27841 -56745 33454 173864 172052 39767 -55930 37524 90760 19315 7886 38753 -41704
27830 -41704 -74140 -36472 -72149 -42272 7661 -32326 -20708 71707 70884 20383 -64421 -79902
27818 -79902 -41214 -107118 -136090 -59980 3283 -64988 -30720 26443 58601 34277 19950 18670
27806 18670 42283 59902 35982 -64339 -44812 1055 -54924 -85896 -32564 -13226 -33308
27795 -33308 -88188 -76511 -116459 -121951 -143419 -98594 -62993 -8835 27886 28089 -34137 -18003
27783 -18003 14358 -18082 -39709 -91041 -152396 -130971 -88258 -56086 -83238 -77081 -73096 -148223
27771 -148223 -123246 -119453 -87143 15560 7863 -81401 -101911 -33291 -44451 -36763 -56395 -81549
27759 -81549 -32532 33554 79841 -19389 -23456 -25349 43992 75377 19373 -77079 -32831 -31794
27747 -31794 26447 198413 223809 210643 168782 251862 353427 349184 238879 189846 129073
27736 129073 30604 77984 92814 70965 61134 44368 45719 20602 20458 -32319 -102748 -4220
27724 -4220 -4690 -72654 -46865 -63935 -97031 -173661 -183721 -154590 -84802 -46166 7600 16074
27712 16074 29375 5301 -6871 8093 54435 36973 -21552 50503 49813 -567 4498 -87325
27700 -87325 -23200 -50406 -23553 25194 71558 3412 5114 33801 32342 120549 101902 41996
27688 41996 -20637 -26072 -40577 -51913 50510 129995 59001 57823 37678 -81405 -56458 -62723
27676 -62723 -96777 -75078 -93407 -124895 -11506 -10230 -10821 -50404 -46674 -121805 -173274 -169853
27664 -169853 -151079 -147916 -50722 49102 42533 59365 52356 -6453 -79416 -77615 -63680 -93095
27652 -93095 -100398 -109389 -56187 -91900 -157319 -83053 -71457 -113536 -3238 99476 68551 -4211
27640 -4211 -43735 -67397 -75183 -20546 -45966 -29473 18759 47287 96723 28287 -38533 -14395
27628 -14395 17820 25914 48429 -42582 -108463 -146059 -123332 -117149 -92836 2693 16582 -67120
27616 -67120 -110388 -92521 -40700 -18415 -38804 -45043 -25698 55479 65281 1800 -10224 -27616
27604 -27616 1402 -29028 -51087 29195 81429 132032 115057 91209 35951 51985 33677 907
27592 907 -16653 2568 49560 40816 80378 101896 47695 -4638 -6262 96953 121843 89966
27580 89966 25510 2341 30505 59389 49870 39741 -25904 -74320 -44142 -66954 -59387 -58962
27568 -58962 -44155 -59447 -57753 -4832 11246 40657 38468 -82118 -117410 -63055 -19993 61009
27556 61009 37096 14711 -55861 -81818 -25429 -2516 10597 57556 95880 54927 -29624 33245
27544 33245 86271 75401 94907 98728 97407 50389 45520 -3594 7173 -14490 -44259 -171966
27532 -171966 -170720 -146137 -90349 -53795 -40780 10821 -17153 -56280 -18932 -3148 -88000 -91281
27520 -91281 -66502 -33391 -62158 -106662 -109334 -158047 -68248 27973 21764 -81623 -187848 -111390
27508 -111390 -1249 117758 50111 -4062 66419 96079 47439 34983 31155 9190 6935
27497 6935 53859 84138 25041 -79613 -143640 -138946 -87957 -6829 74072 61067 83281 92694
27485 92694 78366 99005 106180 64164 -26648 -44133 -39679 -69357 -51886 -43106 -22455 10636
27473 10636 31733 1763 49630 145491 119226 14460 -20790 17763 53358 80054 45497
27462 45497 663 25544 59437 36156 58007 32403 -9865 -84960 -44749 81322 77468 84840
27450 84840 54125 -103390 -126188 -107992 -32021 65549 22342 -17677 -50273 -61874 -9033
27439 -9033 56412 -50703 -120935 -17234 82844 -25323 -69804 -16066 23411 -10260 1164
27428 1164 55049 26783 50635 34891 -20373 -16686 53241 60948 17538 28831 -32561 -48878
27416 -48878 -30097 1150 18952 35564 69178 90984 61720 9438 -8361 -37486 -9627 -53118
27404 -53118 -173147 -182239 -23635 -33704 -50867 -68454 59 62589 103526 125347 97685
27393 97685 37540 28687 -1681 1884 6321 16830 26251 -31294 -63993 -101546 -11482 80072
27381 80072 9080 -94826 -87005 23809 72807 52664 -8774 -70078 -43165 61098 55460
27370 55460 77366 65966 64156 31381 -23163 -45165 -65133 -31890 -31140 52229 88829 83239
27358 83239 97947 65963 44674 48413 1564 -10872 -67454 -108443 -62274 70552 89330 24632
27346 24632 36473 21928 -23460 -32723 -4606 -72718 -108847 -124227 -169719 -95244 -22884 6651
27334 6651 -9712 -42874 50548 117440 201361 151915 98533 93417 134435 119042 58101 -40545
27322 -40545 -87873 -79702 -83967 -80954 48372 50046 45842 180362 229075 188996 221042 240425
27310 240425 290616 222476 163564 89671 61403 27893 89406 113660 94152 57903 35863
27299 35863 92276 28372 2984 -72139 -93188 -9510 -8843 -154184 -193388 -111311 -60033 -32601
27287 -32601 -81684 -57320 -15776 -39486 -8750 10947 -123 -29454 -5827 -37996 -66470 -81740
27275 -81740 -62324 12232 52227 89366 66128 31098 97512 94990 97009 53135 -5105 -48606
27263 -48606 -26777 15007 40469 -45842 -132539 -164985 -154024 -64389 -5320 -23046 15162 51662
27251 51662 6688 14856 61468 91793 66398 64910 75570 136495 109172 44776 166833 189550
27239 189550 153560 133974 85925 2276 44768 67655 -5710 -150496 -195429 -103258 -56672
27228 -56672 -27403 73541 -4050 -147947 -198352 -128746 -88236 -108168 -110625 -89395 -59680
27217 -59680 -85244 -138388 -53394 38342 -30866 1783 -1490 -46039 -19915 -4670 -88684 -115645
27205 -115645 -71715 -19900 12270 -15916 -3554 30696 55844 -14214 -47017 -3149 -27598
27194 -27598 -31068 45324 19143 -476 -10278 -18989 -40158 34874 29646 -17219 -13950 -18715 -8962
27181 -8962 61859 59135 -35217 -30788 -68057 -80785 -21098 55633 22446 30068 48853 74961
27169 74961 69663 67062 72163 2510 -51569 -35799 -67916 -1593 33641 -8785 -46221 59098
27157 59098 153313 56091 -68337 -77062 -39573 6147 35745 -39940 -120724 -19298 111127
27146 111127 66158 1629 7506 -92112 -164754 -166634 -43097 53017 51760 29021 -21358 -135569
27134 -135569 -87096 -70423 -57044 -84125 -66536 34338 9080 -53562 -90246 -33206 -3451
27123 -3451 -52461 5285 60090 100349 69628 48029 19250 -50387 -117448 -49021 3618 -46974
27111 -46974 -164766 -173677 -88391 40114 135687 131058 73795 49551 4324 -54527 -29995 32221
27099 32221 12263 -8497 -46905 15817 88053 42032 -18584 -9910 -27871 -21630 -25920 -90908
27087 -90908 -51346 -69989 -60678 -50478 -57594 -52300 -153431 -141022 -52270 -29239 -19536 16254
27075 16254 -14102 3514 67408 49480 85557 143229 143279 92036 166072 126795 15423 -23222
27063 -23222 -112789 -70236 -36140 -43258 -17667 5754 77529 106388 45333 38526 -5990 -24890
27051 -24890 -93 61251 74163 55105 35471 86394 18522 11236 -34043 -60514 -49994 -5257
27039 -5257 21856 -33678 -60129 -21444 17483 47255 52448 56851 -21793 -9295 2880 13878
27027 13878 89651 58964 23498 52315 51621 43616 -19790 -64803 -44507 -23497 -20380 -37290
27015 -37290 69469 153894 114787 36611 22915 -20006 -75568 -102270 -66606 -51209 -83544
27004 -83544 -74733 -86267 -133479 -32763 -27791 -34044 -44456 -549 21196 -43189 -7500 3007
26992 3007 -29003 -19645 22721 -18393 -16202 25471 23066 65771 -30133 -95042 -84518 -1084
26980 -1084 66645 -7248 -53207 -82704 -62179 -30931 -7469 1330 -29622 -94450 -39257 -14494
26968 -14494 -8514 -46158 -120790 -58770 -16131 26740 12424 -12279 23561 81241 167084 196524
26956 196524 176025 209194 123701 148771 129779 122870 69372 -6547 17256 8171 -52130 78511
26944 78511 138302 53282 -42937 -42477 57977 103765 40658 -12629 42327 129628 111261 138589
26932 138589 128968 88631 86185 118323 92716 51085 91566 166956 110908 -3962 -28268 -27590
26920 -27590 27199 64001 18122 -31366 -108 -6995 45665 59198 16367 20537 40220 -8033
26908 -8033 31520 87180 123965 106773 89629 74403 78725 103781 74732 37875 76904 136157
26896 136157 148807 122936 80104 120038 106317 116419 141588 129315 61775 54851 100128 151249
26884 151249 164531 94148 52540 35685 48360 88970 46130 -23584 -93329 -76243 -9555
26873 -9555 28876 -17288 -100254 -74105 -34346 -55238 -11144 -36409 -48002 59681 89587 -23395
26861 -23395 30403 40516 66678 66286 53386 23541 -59633 -219 66445 87871 55673 -12162
26849 -12162 5745 -16678 -22369 -31358 -18023 -31059 -37084 29365 75306 99111 97704 49866
26837 49866 25763 9918 52210 155274 201105 126736 70759 -2392 -63860 -107043 -39899
26826 -39899 138380 192935 99629 112679 91869 38460 25030 25643 37892 26940 -78769 -64932
26814 -64932 -3177 -19069 -23577 -121627 -76052 -175 17376 73581 15218 -35189 -15194 -688
26802 -688 80296 86648 116893 43688 32774 93801 103090 99465 108151 86973 94249 71 -37105
26789 -37105 -81032 -89613 25656 100429 116143 84477 31441 45659 45293 80637 112309 141362
26777 141362 69870 24453 32519 21240 -38136 -41025 -54892 -105041 -63888 -117567 -145997 -119843
26765 -119843 -138898 -50961 -24157 -106799 -165237 -131513 -46520 8632 42421 49931 100642 111680
26753 111680 145056 193089 202736 82423 89869 203049 180204 144718 163552 212471 175696
26742 175696 85636 42276 110458 164748 130680 -15946 -95420 -66320 -100265 -100975 -66784 -38374
26730 -38374 -33704 36007 107132 68013 -9349 -28733 1365 -30674 -44976 -25940 -20321 1738
26718 1738 -23921 -147013 -189602 -108371 30938 198132 204298 191811 135312 31427 -38166
26707 -38166 -24231 58362 116587 114038 79611 11202 -101519 -116421 -71687 -125364 -111916 -104643
26695 -104643 -19841 11431 -898 -104915 -72226 -61031 -89541 -66770 -101333 -94614 -58109
26684 -58109 -41861 86779 181679 93749 49565 48793 31175 14775 5630 -2663 -10995 -62060
26672 -62060 -9116 30950 -30702 -48071 -54437 -8427 -29386 4559 63665 53951 62553 3433
26660 3433 -15486 1318 70414 184344 183170 116613 124672 121577 14651 -84667 -54014 -20561
26648 -20561 39343 20929 -4703 -82716 -49274 -85530 -128481 -97764 -41239 14271 46105 115362
26636 115362 123435 86796 107221 104757 192729 172865 37197 -45417 -33911 -61516 -53361 -154713
26624 -154713 -93683 35507 107256 96195 73933 -15863 -45885 -119255 -136410 -140915 -69337
26613 -69337 -29302 -10338 -10811 -81841 -155528 -81165 -44177 -30225 -52325 -34064 -61200 -25011
26601 -25011 -14959 -80208 -62738 26174 12330 -45405 -26920 -30875 -31172 -58393 -63900 -68855 -38711
26588 -38711 -5159 -21850 45151 98853 74002 -2736 -49728 -23263 -47453 -45057 -2840 -52021
26576 -52021 -25846 -28612 11243 68236 124322 91112 61970 128945 82113 68442 -53415 -57178
26564 -57178 -61894 -18927 -29045 -35017 43513 88505 75853 72095 84311 110404 136211 -26946
26552 -26946 -77986 40952 69580 138828 41092 -17982 -78832 -85692 5214 6803 31007 38940
26540 38940 11575 18834 90324 65702 77711 139705 116857 79446 37486 31075 79866 90866
26528 90866 80519 44992 5301 11949 62771 101491 48513 48478 9594 -33521 -76408 -51386
26516 -51386 5516 -21556 25459 -16377 -2424 -14656 -44085 -57484 -44539 -10555 -8503 60897
26504 60897 21112 -49205 -48129 -33071 -24946 -64270 -27417 9901 -12086 -25425 -59120 -117463
26492 -117463 -124297 -108234 -91824 -129116 -97924 -52008 -36119 -92058 -139501 -111093 -51159 -49945
26480 -49945 -23144 11577 29632 -36893 -4994 52518 42285 14864 44302 80357 46036 57362
26468 57362 89458 189566 179458 72963 69479 97009 -8398 -69037 -129222 -121665 -60688
26457 -60688 -52986 3250 18924 -18998 38041 56526 -11790 -51849 -27680 -91365 -144666 -71502
26445 -71502 -71788 -52789 -23065 -20732 14470 39 17039 62563 63983 94819 62980 52074
26433 52074 49343 26208 70215 -4155 10812 117422 176454 166608 165381 79197 64792 118443
26421 118443 140888 85180 -31437 -62408 -51580 13352 -3638 -30896 -48557 -66150 -92336
26410 -92336 -73332 27139 98727 91661 46893 -112262 -97659 11630 76653 171402 139093
26399 139093 92039 71589 65182 32327 78881 107072 112801 107600 33374 50940 52584 76654
26387 76654 86797 69551 55128 66102 73875 55001 36909 8135 -35006 -142151 -104630 40027
26375 40027 -36399 -83566 -19091 79056 166524 70751 -7841 -30539 -111019 -160305 -209169 -238179
26363 -238179 -178978 -119542 -68414 -27319 20880 63609 16683 -22552 54485 96129 120894
26352 120894 138242 183339 185945 225785 196577 109953 33285 41746 27277 32295 -9291 13101
26340 13101 63083 113117 64329 -7910 -6005 80702 81202 48357 38240 -31147 -63714 -15755
26328 -15755 4929 81607 172959 163695 94429 72102 37772 42628 82533 82813 48701 55154 36033
26315 36033 12283 13665 57350 92218 136973 116099 132250 112424 106515 54276 476 -25821
26303 -25821 27202 69471 130341 80492 83859 52706 -2580 -64738 -140156 -120158 -126890 -104599
26291 -104599 -153498 -120273 -150166 -112315 -109150 -136746 -61611 -70970 10402 3363 -83977 -146536
26279 -146536 -111774 -78753 -90860 -1575 17999 -45772 -66452 -67691 -25805 -43406 -67261 -121969
26267 -121969 -108979 -16960 60404 3957 -12594 -39219 -109291 -121789 -91135 -52216 18610
26256 18610 226 -11326 -90664 -105485 -20817 -65013 -21402 -33435 -12339 -36075 -29651 -101951
26244 -101951 -89011 -69929 -28024 -29225 -17322 -12835 -27308 -26009 -45729 -97212 -125516 -150542
26232 -150542 -69736 26477 88508 54549 -35329 -2984 39711 24586 -47027 -80781 24739
26221 24739 101946 84545 35061 -18100 22078 68995 122500 133500 76364 54953 49915 24135
26209 24135 46251 50184 22963 14504 18830 17855 29147 -34646 -61985 -17955 -17622 30943 113554
26196 113554 105003 129711 107043 48277 -9164 -30163 -16134 -82356 -79435 -39968 -26470 -91234
26184 -91234 -84472 -77205 -42244 -6888 14488 -1463 9268 39463 113158 84013 13616 -111715
26172 -111715 -95718 -138298 -54251 22530 -13825 27957 55669 30918 79019 128810 95713
26161 95713 86574 84079 72351 50233 31584 -39009 -11329 19289 -23666 52687 44434 -20032
26149 -20032 -17 4100 43989 59920 81327 -9484 -62563 -55835 35163 -58586 -43853 375
26137 375 30349 72927 3566 -50460 -74174 -118572 -97372 -4807 12529 43102 -15306 -77329
26125 -77329 -25033 -11619 -18010 51165 96525 86969 31378 -103137 -111517 -49376 -41369 -33862
26113 -33862 20797 -938 -64934 -85348 -30630 -39038 -17325 -15558 -60349 -72098 -55228 -44961
26101 -44961 -32160 90666 107279 75027 15446 70960 117553 132476 102011 74961 13540
26090 13540 -85376 -113573 -150675 -60524 -21246 -64845 -32061 3693 36270 4417 -48705 -43549
26078 -43549 11074 -10699 8714 -5103 -33285 -20547 6134 -30292 -30093 63843 115092 59201
26066 59201 26298 -28885 -22661 18371 -17888 -109606 -27853 63616 40468 -22836 -103516 -63792
26054 -63792 -84117 -81795 -52739 -34281 -75719 -108858 -20738 23682 -75174 -58900 -62355 -78847
26042 -78847 -110774 -21919 74134 52693 52148 17761 116952 214217 223051 126033 44755 1950
26030 1950 -10264 -53441 -48489 -29796 -18649 27617 41504 7497 -21518 -17953 29909 -19241
26018 -19241 -123980 -144065 -101590 -74145 -64174 -52279 -142846 -165743 -109008 -132734 -119563 11549
26006 11549 -77505 -119672 -79075 -73425 -105042 -119547 -123127 -198538 -207999 -158409 -88328 -66096
25994 -66096 -30245 -23209 -21839 -48185 -143359 -177629 -91020 -71712 -101988 -56732 -140479 -120357
25982 -120357 -48038 -119956 -6487 -25404 -27742 -42133 -30171 -43962 -61703 1170 -3066 21382
25970 21382 42559 -58006 -82257 -88776 -75071 -15788 -22016 -461 31522 62063 46895 53634
25958 53634 -1917 -39995 -39707 -912 -46754 -102868 -55511 -42390 -66883 -39972 15142 29729
25946 29729 32058 -13821 -64378 -28465 50147 17451 11342 -5381 -117811 -56211 36417 43976
25934 43976 40077 62244 80879 138579 119281 150154 189059 164289 24831 -33164 22886 45465
25922 45465 -16940 -35780 17635 26205 37324 9860 40115 39469 110532 115146 97665 7892
25910 7892 24173 -44017 -63512 -92333 -117190 -54718 -77328 -122842 -83233 -39898 -37983 25277
25898 25277 91883 103730 101052 16144 -30680 -36414 -19788 -73107 -35043 -17140 -54450 -42238
25886 -42238 -70151 -122298 -106513 -136816 -137990 -67119 -43941 -29451 -44054 -26705 106935 103731
25874 103731 108169 8594 -18659 48760 61944 166737 223626 120170 94368 107379 113763
25863 113763 48425 -113176 -145225 -138927 -51822 -94270 -140605 -52529 -9179 -24580 -29585 43439
25851 43439 37817 92822 43500 44458 -25503 55178 113650 102614 72152 25265 -10192 -46595
25839 -46595 -19397 -20312 -59009 -36839 -40177 -53371 -32808 -5976 3956 -58190 -127456 -54549
25827 -54549 -70877 -55075 -27255 -55157 47242 164846 176701 61000 -10249 -11384 -58269
25816 -58269 -109828 -158892 -152070 -15838 10977 32251 122198 181296 126887 63632 -34861 19437
25804 19437 77346 48483 41299 74453 46921 7741 -2627 -91319 -79228 2074 28320 -63753
25792 -63753 -73916 -105080 -114961 -105317 -63919 -64261 -47347 -29647 -54410 -54190 -89072 -12428 88930
25779 88930 34120 55663 147566 93745 30134 -10400 -34790 -4236 59537 77024 10164 -84769
25767 -84769 -49981 -7045 7216 -7429 -84871 -64840 64839 66129 36455 76418 135465 127814
25755 127814 89190 -17572 -90985 -21273 -12990 -19434 -1472 29215 65244 93739 124017 65266
25743 65266 21746 26903 132001 166708 162676 122682 138256 94434 398 -88578 -28549 44581
25731 44581 81265 49143 -26032 -28187 -23749 -85187 -143251 -154386 -117736 -11156 24402 -7363
25719 -7363 32831 51737 -49640 -51372 -40097 -65979 -16117 -19249 -1654 56230 75522 31228
25707 31228 -59912 -49018 6270 51478 38075 50661 56027 49002 60713 88509 8030 60789
25695 60789 152206 144733 123531 47328 -54544 -99449 -145874 -140172 -41937 47179 44505 -91501
25683 -91501 -189417 -170210 -112188 10386 48711 70331 47564 56161 32486 209 76291 92622
25671 92622 70823 83092 90541 179410 179386 103435 8665 7042 -30631 -21827 -76364 -106251 -47363
25658 -47363 -57426 -73885 -47524 -102619 -53985 -66663 -161202 -164876 -131630 -132036 -102003 -45336
25646 -45336 -9868 20892 58070 68039 100994 103715 55115 2604 -49706 -45871 -40931 -55923
25634 -55923 -93810 -88747 -140749 -119061 -149860 -15566 -1286 -48962 -84796 -7095 2769 -96530
25622 -96530 -126027 -40475 1016 44718 91003 124345 125473 142064 72412 42681 922 -49692
25610 -49692 -71889 24681 80358 108137 32808 -13201 80200 80837 9774 37239 79408 151945
25598 151945 164118 198818 99647 38721 3470 -30423 -94796 -178563 -191178 -148416 -121660
25587 -121660 -95332 -27404 10145 54560 31767 65050 159258 143354 70544 54913 12891
25576 12891 -68352 -103388 -16722 58552 52546 -8138 95160 69545 74073 44131 -51672 -43599
25564 -43599 -86544 -116270 -105365 -103072 -111802 -71478 11131 -70414 -112293 -66140 15733 85798
25552 85798 134309 86516 13765 -2606 47258 5482 -34808 -42917 -30666 -8257 -25183 -92706
25540 -92706 -146133 -88896 13875 23935 37999 11199 -49986 -49988 -11135 -12793 -72945 -35662
25528 -35662 18411 1666 -2101 -3675 -52175 -23768 45725 17036 -24020 46208 40911 -25766
25516 -25766 -49673 -68248 -17940 4755 696 -27025 -53727 -70435 -3559 -12148 49370 94385
25504 94385 63466 65344 124376 105417 46673 96525 110132 71035 55473 4513 2998 12436
25492 12436 -42598 -113388 -126940 -23266 41638 40965 -52978 -33427 -14615 -44994 -82403 -101792
25480 -101792 -1142 -67954 -69453 -109750 -127059 -111981 -54465 -29589 -67801 -22470 -2264
25469 -2264 10731 -8832 -100241 -34658 51566 46152 20318 -67342 -101293 -196730 -206461 -100303
25457 -100303 -13736 -30404 -18631 -44826 71312 118338 107257 156802 143772 76460 50446
25446 50446 25295 1254 1010 -68924 -148246 34810 69527 68681 -21688 -33871 -46345 64329
25434 64329 74513 49636 35130 59958 41869 -18802 -45632 -51332 29186 90198 106846 136482
25422 136482 118383 67799 71715 78980 59438 35217 10521 -22641 -27552 -17258 40993 69535
25410 69535 103102 32922 52597 93404 101972 15341 -62733 -111372 -95052 -74107 -35198 19196
25398 19196 1403 -18147 25181 21040 116377 74035 14446 12324 32817 15824 -33765 -8975
25386 -8975 5746 -32572 -30814 -6944 -22469 -66775 -9777 59172 40044 -35591 -26550 34661
25374 34661 13797 -1116 16596 68671 1712 -71273 -51433 -80097 -97176 -101903 -124173 -102171
25362 -102171 -59072 -25361 -3763 28306 -40099 -145543 -56584 7840 11549 58072 119078
25351 119078 92610 31362 98311 172439 109208 73317 70219 61992 -67108 -102798 -38365 35420
25339 35420 33897 -48546 -129291 -123842 -65262 -75231 -9823 -948 -26027 -26866 -6404 -16794 -13489
25326 -13489 5107 -13552 -124690 -143283 -54303 49081 16204 -11475 38717 21158 29148
25315 29148 -130460 -159218 -179150 -78117 22455 22140 15665 36631 25792 11628 74607 38827
25303 38827 48025 46457 42534 36327 66688 49625 -30523 -1982 68123 133372 131319 115543 68231
25290 68231 30270 7455 109329 103672 42489 58249 -1509 49636 75049 47021 71856 22011
25278 22011 51704 -23519 28260 6775 -100984 -69665 -23183 -13286 -45023 -37969 -58255 -76949
25266 -76949 -117089 -128267 -53938 31523 -31583 46980 137671 172516 161265 31605 -12203
25255 -12203 5383 -4581 -4250 -60147 -90530 -17200 -37171 56782 67805 8345 3596 -21059
25243 -21059 -31131 -91302 -108303 -81076 -47655 -30066 -19775 28942 60527 93149 51033 -33971
25231 -33971 -21581 -26263 -64748 -7088 -30120 -117363 -176213 -124148 -51721 -90422 -33468 -21910
25219 -21910 103823 172370 193318 140993 18563 -53294 -111885 -141753 -208296 -223542 -114150
25208 -114150 17629 -465 -128460 -195597 -130713 -72270 -70367 -13031 16277 79731 107095
25197 107095 192914 147839 36134 48405 126555 127739 112123 98610 97240 83636 30054 -33892
25185 -33892 5877 -12834 -42712 -10974 -25470 -29258 -12694 -46290 -62458 -108007 -74162 56049
25173 56049 137207 162526 120069 143634 2109 -52925 708 60671 50385 7964 -56874
25162 -56874 -10866 -4807 -20930 -2773 39577 84509 50298 -28237 -11455 21548 -46530 -94226
25150 -94226 -123061 -160320 -60594 -40218 -64210 3214 81092 110262 82500 14176 42290 56168
25138 56168 37383 21319 129098 138245 105020 87045 39131 1072 -80526 -116904 -147439 -119632
25126 -119632 -76077 -33347 24900 -8625 71680 115125 96351 131826 93790 41658 65574
25115 65574 6926 -85012 -127423 6002 33029 -28742 -41790 -65242 -83656 -136020 -200033
25104 -200033 -166116 -88131 -77505 -22567 -67644 -32239 -42991 -61352 -94877 -43254 -3887
25093 -3887 38656 71756 108423 46666 -17315 -32978 16089 122101 40575 16666 109361 119746
25081 119746 57741 29033 -8445 -7129 -21426 -55568 -88155 -99391 -23284 -2085 -12451 -24517
25069 -24517 84575 12018 54026 70475 66594 12649 -647 64777 62138 64125 126618 91148
25057 91148 33787 -20526 -70635 -32780 -79903 -66437 23497 124262 118522 39872 -26442 -49092
25045 -49092 13467 97107 149327 122377 67035 35478 63728 16479 70119 106077 129427 68815
25033 68815 21237 35013 30201 -45076 -89020 -56440 20489 56740 64798 41553 55692 48383
25021 48383 9684 -15499 -2609 -37620 4296 -51235 -89793 -56656 -47488 -30731 73221 116414
25009 116414 49160 72625 112295 17342 -43604 -72420 -103921 -118407 -71181 -59754 -67058 -108200
24997 -108200 -173530 -99475 13696 17091 2498 47572 51660 42636 -60386 -37935 -4215 -22753
24985 -22753 -4249 -28915 -102462 -133958 -156388 -168495 -95894 -99121 -92461 -52154 -70830 -90163
24973 -90163 -22565 12288 41853 -19298 -102350 -130126 -91881 -35963 77901 123988 -27806
24962 -27806 -142948 -86196 31247 40076 -36544 -62339 -79507 -146956 -95661 -71437 -114312
24951 -114312 -63682 -28716 15987 17770 4765 -28029 -22240 -55534 -28123 -28646 -50942 -47302
24939 -47302 -70776 -63829 17351 52872 6528 -4842 -5247 6092 17580 -3721 -53882 -91453
24927 -91453 -25758 16146 68785 82376 80581 38467 20090 54678 50195 77498 91020 -8013
24915 -8013 57994 86637 139248 114525 89166 28833 -22406 -19160 -17650 81454 90043 54728
24903 54728 -33258 -57850 -51190 -40012 -75940 -119307 -179770 -220195 -95518 -6772 -65934 -75160
24891 -75160 10235 84080 -15182 -8058 58084 65147 57542 56214 38508 134932 176441 127805
24879 127805 118942 133547 123236 93993 71474 59150 96752 75262 114599 84086 70265 -31183
24867 -31183 -103531 -108062 -94753 -16753 16960 -84184 -27934 10245 31439 45512 126171 68176
24855 68176 9977 99189 82518 78021 83427 60555 32676 62303 26267 4083 28038 103788
24843 103788 116819 100433 31405 52271 93183 103661 32058 -32057 -82492 -57184 -46902
24832 -46902 -42135 -40783 -10856 33176 13655 1711 79655 109064 68353 41045 5231 30101
24820 30101 -9566 -54087 -14651 -11769 -45232 8327 109761 71374 59491 88944 50873 66794
24808 66794 87133 74163 -22660 -156057 -39693 15258 74759 115548 54764 -2843 48044
24797 48044 55743 -16620 -17082 -32854 -64439 -70849 -104462 -148265 -68428 25892 -9640 -107522
24785 -107522 -66557 -17322 -93778 -14701 37500 -18453 2044 50521 43507 96491 53582 -27308
24773 -27308 -53817 -20505 -59042 -89992 -64101 -43100 -29903 37214 31535 -22761 -85056 -86632
24761 -86632 -43885 -37208 -32087 -39138 -27164 -48582 -84699 -23631 118982 141151 -14587 -62682
24749 -62682 -93958 -140307 -184489 -163006 -169128 -173205 -182664 -174805 -172032 -206545 -196186 -140198 -182736
24736 -182736 -141662 -81986 -68533 -35560 31328 2805 80929 83054 73489 -15586 -52476 13836
24724 13836 43872 -1533 50912 98043 111478 147904 71220 -25559 -61843 -77403 -39425 26400
24712 26400 77162 15033 -73562 -9711 18340 58564 67789 107134 79803 37468 45086 75850
24700 75850 64672 27764 30505 2195 2371 2843 59767 74794 49154 51373 29046 20648 93959
24687 93959 112876 69653 68201 -17368 -96862 -71017 -51414 -60070 -30826 -86767 -43363 -130089
24675 -130089 -216148 -318472 -208796 -103281 -8093 -17806 -71077 -10562 -39356 -41220 -111436
24664 -111436 -66019 -43799 -44867 -88284 -49357 -71986 -64413 -53969 -10017 7139 -47476 -83084
24652 -83084 -94692 -46888 -53408 -43565 22697 158107 148444 87288 88204 58263 28972 22318 -69362
24639 -69362 -77013 -46452 -47068 35033 57614 47431 27921 42631 101049 120145 81489 60752
24627 60752 -7614 -86568 -51006 -16531 34068 -39299 -108785 -123046 -116286 -133515 -98087 -83252
24615 -83252 -107119 6354 101973 59227 -3519 11883 59960 -30022 -101160 -61344 -2616
24604 -2616 24327 49766 77881 64531 45602 -21690 53196 164810 142767 19387 50344
24593 50344 50061 76984 37446 -73178 -36120 -49909 -153001 -136336 -133774 -88262 -84887 -194297
24581 -194297 -194114 -100246 -47122 -53055 -36172 -57927 -141512 -140495 -93387 -64832 -3760 11086
24569 11086 27374 96115 111085 6422 -22973 -17211 -25127 -16612 -36936 -90152 -92450 -98880
24557 -98880 -95706 -32534 -63798 -112881 -150024 -75350 -67423 -27643 -13413 -26847 9290 -52351
24545 -52351 -127957 -65540 50113 114506 64542 -20473 -45767 -88545 -105792 -21542 -34655
24534 -34655 -89066 -121756 -66161 -10950 9066 -43355 -123012 -124403 -112395 -97694 -100989 -72928
24522 -72928 -51339 -111002 -181067 -236882 -142520 -55931 19944 29768 119722 73360 80340 48021
24510 48021 66228 93157 44095 -4334 -40726 -111186 -90371 27990 -16147 -49539 16983
24499 16983 82819 97554 82385 34629 3816 -29717 -51377 -108850 -30531 -2131 -22680 -146370
24487 -146370 -189034 -130669 -57222 -24696 -21453 1186 -65135 -86039 -75509 -31494 -82661 -164336
24475 -164336 -141384 -42595 -50029 -74013 -130108 -197155 -210268 -169088 -82573 -14375 -50096 -134410
24463 -134410 -147475 -145384 -86783 -4116 44291 26346 7294 28288 59569 33545 -68055
24452 -68055 -110049 -89607 -49647 15898 -13195 -67885 -106837 -133391 -76444 -159125 -233469 -167229
24440 -167229 -62873 -83404 -101728 -57319 -27245 -44008 -85706 -161142 -110816 -159584 -107987
24429 -107987 -80440 -91575 -137378 -101097 -43851 26733 -10869 -134554 -218636 -158285 -104936
24418 -104936 -61538 -44234 -19809 -42436 -21469 7297 -90255 -152076 -164550 -120536 -85400
24407 -85400 -113175 -75468 -58406 -93842 -69203 -92108 -5440 110707 80184 56904 60315 133085
24395 133085 152001 128361 45014 35696 86137 83199 103880 156298 114006 106158 77992 41340
24383 41340 67491 106376 109031 54401 10360 47997 -91268 -66136 68511 70219 11106 52097
24371 52097 44862 50391 13916 124784 144329 116107 42582 -56965 8955 43261 82888 107076
24359 107076 83732 90407 115229 107907 28493 -40906 -36709 -42114 4626 -9707 14496 13085
24347 13085 -19874 9345 20375 -67572 -77601 -44988 -55928 -3239 55944 42911 16697 62940
24335 62940 99424 93731 53580 58265 -21982 -52345 -119741 -96854 -13598 22580 18589 -13630
24323 -13630 -31266 -43101 -11498 -25569 -99750 -12871 -5811 -21128 3296 9327 -27391 32004
24311 32004 45736 70746 134851 96453 108414 163846 149376 88159 -20613 -49361 -93546
24300 -93546 -97925 -79180 -108811 -136361 -69166 7445 24498 84044 36737 72741 156717 149217
24288 149217 146480 52328 -39208 -68063 -51428 -11534 65077 33750 -32760 -12650 -3491 -63872
24276 -63872 -67985 -116828 -115098 -94996 -54669 -37062 42293 96872 51920 33046 33006 24900 46305
24263 46305 39882 58929 102005 44033 -16779 -9790 53052 73666 61859 53742 66579 21855
24251 21855 3394 -54794 -66838 -55339 -13747 80280 44712 31600 24205 82613 178938 121022
24239 121022 109973 101315 97485 94553 114243 124508 87313 66375 130709 58800 -426 -70049
24227 -70049 -64184 -96100 -80379 -39391 51438 80352 43236 -13944 -3760 -69580 -52052 -1657
24215 -1657 -23443 80403 46885 -13039 -24429 -102841 -104418 -42773 -18630 -4278 18045 -18857
24203 -18857 -17958 -104863 -175443 -205681 -139292 -88500 -20625 32812 29316 11580 -32351 27070
24191 27070 71150 8880 -30285 -54489 -31779 12543 -41823 -97587 -106385 -93956 -30706 4391
24179 4391 76977 94825 123457 49072 96238 110874 74124 83925 98830 95924 92689 147079
24167 147079 181412 146632 135580 42690 4491 -2271 32539 12792 15495 27061 71877 136380
24155 136380 65295 28242 70619 23693 74074 104681 31020 -36164 -44064 -7089 66639 33858
24143 33858 12736 -2552 -74593 -58529 -20744 75592 29388 4363 40633 -42926 11751 50772
24131 50772 -6246 -2861 -32208 -60821 -68554 28163 -10156 -111182 -130170 -120336 -46290 -61434
24119 -61434 -48349 -53344 -106489 -198499 -193085 -70504 45039 114248 99015 94309 51213 18221
24107 18221 20373 43182 3986 -49418 7896 43843 33719 6681 913 442 44200 128841
24095 128841 115537 92854 67889 21688 -31393 -53928 -22921 75944 87421 23807 -2045
24084 -2045 -54458 -37653 -34315 -78969 -60749 79652 109750 70077 94720 91877 73795 36469
24072 36469 -12600 -43553 -57563 -80012 -123598 -66495 60324 54689 -73486 -81329 -30716 3103
24060 3103 96395 80925 20447 8356 16857 46657 26730 -49123 -39040 -32465 -87999 -124039
24048 -124039 -166218 -169958 -54482 13423 45859 -51438 -64186 -52988 -83293 -13573 41921
24037 41921 35102 23339 14002 33926 -29012 -77256 -70656 -121959 -112815 23134 46495 -45519
24025 -45519 -56096 23373 29949 -75119 -234116 -184780 -134918 -125637 -49876 -1288 -18821 -24217
24013 -24217 -17924 26507 116409 87320 29837 47518 21697 3868 60473 66800 57149 83757
24001 83757 112540 53946 19360 -62238 -124025 -107819 -70375 -68055 -121748 -133157 -157662 -84136
23989 -84136 37337 80633 146174 167159 93738 -2891 16584 112424 173879 197411 199025 125816
23977 125816 58923 11631 -41815 -86273 -146279 -158440 -74007 51933 4312 -26790 -98874
23966 -98874 -118092 -101407 -77191 -83104 -31307 -22110 26028 86971 68352 101829 105500 30923
23954 30923 13213 733 -29820 -40948 -2362 -14625 70017 2703 -46344 -40768 -35139 7886
23942 7886 32829 91381 129696 105398 6248 34473 192504 156819 92213 36667 -48095 -17389
23930 -17389 -40498 -20364 16971 11258 21407 -29480 -20539 29755 4750 -30737 -38446 -112608
23918 -112608 -96711 -46740 -71536 -47201 -4778 25821 27124 97122 88003 127621 147241 110629
23906 110629 47934 14116 -21324 34872 19411 -23869 -28063 -30573 -68165 -65373 3517 63025
23894 63025 74477 116606 197704 155411 84945 48353 30855 -20709 21261 72263 -37314
23883 -37314 -83561 -33711 13296 11366 13427 30513 10309 -6601 16471 70584 83897 26678
23871 26678 -55194 -47357 -10514 90853 129417 122807 29626 -14689 24245 88492 146854 84169
23859 84169 33757 43894 76345 -10716 19450 17329 -18368 -16616 -35701 9968 66135 45324
23847 45324 -2492 -46894 -87757 -101672 -88527 -40075 37268 10412 6499 27628 -69081 -102728
23835 -102728 -124226 -173585 -51676 -21990 -19288 -20704 -88687 6871 64942 54794 86213 54204
23823 54204 -55444 -84118 -34337 3704 -12038 -3979 -28099 -14610 43903 54297 53985 -6705
23811 -6705 -9051 74903 62149 44531 -6163 -60105 -63070 -54776 -121909 -130985 -199199 -130490 -10820
23798 -10820 94121 100091 39657 -4434 5786 24465 44555 2081 -112464 -122115 -78126 -72472
23786 -72472 24664 127341 67348 93083 61184 40653 28082 26356 46871 68215 112003 78147
23774 78147 58937 -27580 -68324 -41052 -20618 17985 -6906 -1673 12131 11895 -10772 -34405
23762 -34405 -52009 -101717 -118225 -83090 -12498 13563 52265 47637 25715 14294 60437 -8665
23750 -8665 27960 121632 92166 51446 61758 131653 94677 -7401 10561 5713 -25142 38660
23738 38660 116713 130051 30866 63306 11095 -83664 -114993 -111599 -6852 16815 1744 8985
23726 8985 20124 45690 57768 28792 -71717 -114499 5389 72914 99341 146559 61784
23715 61784 -34654 -41652 38164 29411 87357 109913 110304 41508 356 50632 51895 -25201 -111722
23702 -111722 -117335 -103497 -87852 -54591 -26379 42670 87525 144037 196516 148792 104105 91023
23690 91023 116423 96956 -32313 -133552 -165878 -107522 -42556 -84758 -95861 -51923 32530
23679 32530 53763 -5441 -9355 19413 66706 52271 -15929 -88432 -148516 -69301 -4941 3368
23667 3368 -73375 -102613 -58128 55980 67935 -36812 -78553 -2299 20492 63404 12610
23656 12610 -79930 -111329 -172693 -161233 -132557 -99502 -46160 -5686 -24048 -39956 -48402 -29542
23644 -29542 -40177 -32786 -54007 -3232 3964 -101173 -185163 -216006 -180457 -158965 -189702 -175894
23632 -175894 -129493 -65517 45730 15274 34518 96525 124372 82427 8113 -48951 -56417
23621 -56417 -6533 72829 66629 12870 -1671 -4735 -13009 -37272 -5467 70498 68374 5063
23609 5063 -17168 25439 13927 14531 93209 102590 33413 -90122 -136258 -25188 6798 -32426
23597 -32426 -27935 -32101 2175 -12245 16361 79989 -9308 -53155 -39404 -34045 -62759 -49165
23585 -49165 31196 50180 62343 54499 -1476 -22375 -17077 53705 146468 126236 144436 212712
23573 212712 184206 183690 201620 105282 44224 68418 83414 58049 55441 -9695 73395 53761
23561 53761 28701 105094 9980 -114736 -91823 -138307 -134639 -90221 -5590 -6189 -40639 22941
23549 22941 49870 29251 76384 101231 59246 36543 85833 80988 113185 119632 70624 31310
23537 31310 -12776 -9371 1478 -65699 -129152 -120014 -1877 23336 -35206 -3352 17139 -13723
23525 -13723 39955 48510 58872 104872 12196 -111662 -65866 28975 58059 22477 -36793 -51411
23513 -51411 -37966 -27952 1185 90929 107615 58203 -26232 -63311 -51790 -71586 -19665 25420
23501 25420 52065 74836 14192 -26107 -27970 3646 -32856 -60210 -46991 19953 -25587 24097
23489 24097 84091 107896 76253 21210 -9027 -38049 9751 -19940 -36625 -92257 21147
23478 21147 85818 88927 45574 -21800 7055 17858 28670 39709 -1939 -106513 -58615 10787
23466 10787 -42133 -117178 -90500 -22413 -10758 2528 5725 -1173 62994 76753 -53534 -120032
23454 -120032 -122730 -99259 -58916 6633 93619 80678 -10603 -33192 -33034 -43142 -43675 -53914
23442 -53914 -44291 -20938 -44331 -69545 -80421 -15077 -14674 -5761 -39449 -73031 -120655 -138146
23430 -138146 -87534 -47902 27355 35429 3899 8206 23802 -5586 -59340 -46047 -85954 -143577
23418 -143577 -77996 -21865 -47112 -98724 -89071 -45443 15091 -7513 3688 -20439 12866 -57788
23406 -57788 -98820 -72906 -13012 -10724 -43575 -72383 -140788 -101033 -40821 -14382 17291 2498
23394 2498 -6451 -62292 -28697 28796 -11588 -63989 -19155 7820 21122 19503 -4170 31562
23382 31562 111000 44509 10046 -52884 -81414 -85699 -101907 -94088 -51133 -35737 6107 -20299
23370 -20299 -63905 -6809 79355 15975 6155 67739 65451 3249 -53139 -165203 -197567 -129432
23358 -129432 -63155 -42048 -85328 -41024 13051 -5566 -4068 -39465 -97967 -57530 29975 117414
23346 117414 85280 84718 106690 155553 128146 2511 -16378 -25353 -39187 -50991 -60295 -117570
23334 -117570 -107279 -58515 -111876 -50452 -41996 -34509 -24086 -59182 34719 122341 70826 9824
23322 9824 -67416 -112394 -154390 -198677 -282443 -256851 -106440 -1655 57553 53680 61980 -15559
23310 -15559 -43889 -77961 -25130 -49416 -95466 -94434 -11799 -41891 -53440 -10539 33092 6162
23298 6162 -26305 10246 -20297 -147114 -198254 -85463 -19499 -67311 -28321 -12650 46791
23287 46791 12245 33120 76833 -5807 14852 3014 -40070 -41361 -60611 -89185 -89100 -69112
23275 -69112 38411 119106 119226 52159 2289 23632 54476 40103 -66271 -106370 -87325 42282
23263 42282 111090 15570 -18918 46027 89496 46064 -29089 -21710 -5321 42230 -55349 -59237
23251 -59237 11153 80035 76479 52565 -40632 -118693 -91826 -109979 -103072 -39356 -93932 -144120
23239 -144120 -52589 -55523 -100503 -68640 -65993 -118201 -88551 -114974 -138258 -57069 -15845 67141
23227 67141 55120 -15977 -107116 -89845 -70225 -1244 54516 94652 92309 3732 11027 24693
23215 24693 57933 47543 61155 -458 -36269 23445 86763 75765 -8776 -69605 -99080 -112656
23203 -112656 -83820 -104907 -106205 -131343 -209936 -185876 -161998 -105238 -49916 -117627 -122290 16399
23191 16399 14719 -10932 -27195 -45589 -10596 10258 3014 63251 135557 96973 -9118 33299
23179 33299 125701 31557 -90371 -135794 -89744 -153245 -187410 -145705 -26995 46216 72206
23168 72206 -6628 -102660 -110824 -64450 -62941 -39005 49163 60567 5996 18420 110774 133478
23156 133478 125329 152317 164334 100664 82402 87893 83797 91061 98505 98471 104093 67972 38509
23143 38509 4993 52575 66425 50491 14874 46161 142123 140563 22131 -31842 -64396 -46759
23131 -46759 17966 46023 -68060 -11853 24562 28306 46594 140194 174231 138476 165086 223221
23119 223221 145022 48998 73221 54478 76507 77011 116984 72549 -29478 -77159 -74149 -35792
23107 -35792 22580 87609 138614 92057 -30043 -43623 63789 108489 19499 838 -69341
23096 -69341 -132000 -244491 -217152 -126207 -54149 47800 74022 -37302 -56107 1279 62058
23085 62058 38247 70471 121709 81198 -26759 -31979 -103095 -127670 -138639 -79166 -27151 -21512
23073 -21512 27710 -60226 -76730 -14129 4278 -18771 -15174 73060 90534 150889 195592 197108
23061 197108 135112 84605 -27412 -55841 -43077 68096 94989 59185 25191 49411 26947
23050 26947 8490 -18689 -26310 -24613 -20208 30603 61143 111676 75725 30524 62495 61391
23038 61391 35248 39339 -4260 -47467 -101458 -31555 -58463 -70292 -50218 -48857 -94157 -111288
23026 -111288 -34220 -60719 -82366 -109269 -153455 -185502 -160898 -162431 -178335 -69797 54625
23015 54625 54844 49433 10834 -25396 -30661 -108456 -98397 -99606 -74436 -163327 -126963 -8957
23003 -8957 -54293 -70926 -95819 -55706 -23372 53352 122429 75240 12707 -8743 61535 26386
22991 26386 -6001 2438 -7045 78658 184991 104316 36750 46080 110105 66757 -16138 -10751
22979 -10751 54179 53273 62492 19493 30938 16156 14510 53013 3360 -59354 3390 99039
22967 99039 114089 68772 37417 -51618 -88379 6570 26946 -68728 -75193 -47500 5728 -33114
22955 -33114 -1347 18276 27592 -8943 -19346 23430 82976 149188 123354 108268 102845 42010
22943 42010 43223 39620 10964 -1669 -45327 -96297 -126165 -130075 -113754 -40426 -105435 -89089
22931 -89089 -66841 -54549 -33262 -1731 -15546 -34352 -60159 19240 45186 -14796 -67493 -63025
22919 -63025 -119706 -204943 -206981 -151231 -97019 -68805 -13806 7605 -58773 -50388 4814 53409
22907 53409 101744 110647 64117 -7267 44843 -25213 -61935 -44278 -13901 26919 32344 -25412
22895 -25412 1505 60 10379 -109928 -140340 -171813 -177283 -98016 -88601 -51736 -46090 -16476
22883 -16476 52669 52201 -12684 33785 22000 59447 85813 93769 42608 28130 32181 25391 -41629
22870 -41629 -79284 -128325 -109394 -34885 -31941 -8376 -28485 -2492 58695 25157 -48155 -33417
22858 -33417 -5504 29636 -35738 -67496 -43974 5617 44230 52052 115167 152655 134118 152316
22846 152316 158693 88527 15500 -73277 -76124 -31900 -11115 42908 47418 100774 71666 12165
22834 12165 19204 84197 76740 28072 -101933 -136758 -109468 -119281 -67885 -56991 -101899 -129768
22822 -129768 -157468 -108712 -21797 -34679 -28546 -12787 45215 129002 184223 139859 47880 -68207
22810 -68207 -126120 -36905 622 3260 53468 85389 50879 51367 -4522 33946 -22895 -16072
22798 -16072 9846 25614 22963 25435 70155 8860 -58108 -43869 -59524 -61522 -106605 -99079
22786 -99079 -56438 -142118 -170273 -194817 -160949 -59002 -37931 -55282 45183 49058 -7371
22775 -7371 -46376 -91189 55043 53491 30663 22549 -64772 -141866 -114662 -58504 -32384 54884
22763 54884 8914 -17239 -49729 -117512 -113373 -60995 23218 73010 142033 111414 -71583 -146998
22751 -146998 -128092 -66842 -41733 10055 11226 57197 30976 -42257 -42173 -28442 -65006 15292
22739 15292 21541 -26133 100 -11245 44516 57019 -51050 -6041 1100 17036 46113 49327
22727 49327 23782 -3661 -14329 49262 14225 2266 -33222 -45004 -56195 -56624 -83945 -129251
22715 -129251 -99134 -13391 -650 4723 18736 62134 77759 -43481 -71524 -55724 13021
22704 13021 64468 -76539 -77016 -18406 -4055 4113 59404 79207 40226 40197 45564 74140 17153
22691 17153 52002 28499 -15389 -20809 -7410 22657 27997 75373 127782 38037 61347 53389
22679 53389 62978 64354 39377 40595 61873 53114 24827 21180 59393 173162 242549 211987
22667 211987 128325 51479 -68407 -53222 29583 110674 59738 26615 -44296 -45351 -95101
22656 -95101 -54148 23371 79140 66791 12208 57584 116448 -9540 -111949 -110191 -74583
22645 -74583 -135541 -150577 -124765 -124592 -178984 -112947 14948 63203 72597 32662 -12549 -14977
22633 -14977 -14266 -29916 -31762 -59769 -82346 -72332 -123239 -115502 -109648 -28486 -17724 2936 -7353
22620 -7353 17630 60490 45285 -9136 39794 64893 77870 65060 122734 114629 116747 94924
22608 94924 56247 49381 22492 111333 91314 25754 4246 88018 131397 117676 115695 160337
22596 160337 117265 -11849 -114853 -66684 -37597 -71316 -54788 -99431 -105786 -86665 -91368
22585 -91368 -103863 -141997 -43417 4020 -60869 -56803 1352 49846 70718 66361 95904 160388
22573 160388 105009 89666 71268 31561 20631 -4252 6757 -37253 -93046 -93639 -130145 -121684
22561 -121684 -84395 -71779 -12095 4857 -22811 -46231 29472 29478 -2971 -64315 -104687 -73152
22549 -73152 -86919 -157662 -68053 -34920 -21768 11578 7782 -42088 -111673 -61695 -61704 -105128 -31421
22536 -31421 -34162 -8626 75372 98879 33035 39129 1818 19254 -6414 -19077 -5863 -20384
22524 -20384 -55591 -53978 -64759 26809 40381 84939 16587 -17877 -21602 -23830 15860 92127
22512 92127 14854 53382 43069 29241 8209 -27344 3926 -5446 22066 3993 -34882 -20540
22500 -20540 19308 59030 -5522 -2723 5485 5293 4253 23527 107809 125088 15564 -39103
22488 -39103 -62253 16664 816 -65692 27298 44349 -32551 -27971 -34812 -23952 -32587 -51800
22476 -51800 -50271 54541 34774 -104867 -135135 -72884 -27478 -47574 -109284 -121427 -16113
22465 -16113 72208 46594 -48493 -7285 29170 54749 54978 65925 -37033 -135988 -210162 -213374
22453 -213374 -158842 -146292 -158154 -110314 -14812 -11549 -63843 -58679 -46366 -23349 39531 37159
22441 37159 65855 177320 202220 124968 54914 36985 86285 135682 138739 102647 83124 51130
22429 51130 72479 123047 99613 19928 53617 13237 -68302 -118400 -138152 -142017 -71341 -47167
22417 -47167 -52287 -63410 -148424 -159177 -111376 -68973 -84687 -32757 29259 -2339 -42696 -30910
22405 -30910 -6580 3409 5983 -43401 13838 73486 90221 57914 -11521 22126 26636 22257
22393 22257 32828 79581 96985 -35485 -131631 -124479 -91633 1597 17802 -41648 -120304 -113649
22381 -113649 -57086 -647 65900 66692 30229 -1501 -113466 -73611 72565 217051 212349
22370 212349 170509 153360 83588 13116 52179 44200 25000 -8407 31307 19623 -30787 -48637
22358 -48637 -52517 -107668 -141184 -68544 15081 -6642 -9090 33906 64387 72321 83092 96856
22346 96856 -415 -105650 -112457 -27542 -35729 -12801 -52150 -23726 52495 109375 19603 13117
22334 13117 -11940 -56225 -67778 2687 81132 94853 9290 -69182 -33548 -30105 -91394 -29241
22322 -29241 59947 145184 167047 104253 56930 43355 58428 101602 142718 207957 182517 208269
22310 208269 159266 50061 -56207 -132801 -138642 -81762 -78931 -189915 -135890 -65187 23984
22299 23984 29854 90901 129741 139492 134470 115872 83498 79538 84494 111364 80515 123656 119722
22286 119722 12432 -151613 -182688 -133248 -169675 -144917 -55337 22535 13144 28648 87138
22275 87138 128916 100323 9774 -58370 -86369 -71690 18170 -1280 -67553 -45971 -1831 -18779
22263 -18779 -42506 -116723 -61398 115428 40355 -28541 -66551 -97131 -169588 -99371 -44111
22252 -44111 26177 8020 -30663 -19832 46412 46454 18832 16783 39454 -356 -6428 15090 -61042
22239 -61042 -120620 -71976 38460 -41691 -126708 -146691 -141805 -55068 15545 46492 114485 70049
22227 70049 63105 130856 158903 28145 -33005 8134 14936 36301 107152 48412 1637 -60941
22215 -60941 -18395 17580 11628 -37645 -29281 -50713 -118538 -96406 14511 39408 33200 91793
22203 91793 1515 -90431 -1413 144819 242877 181966 133665 82781 64507 92294 149854
22192 149854 117545 74558 53732 2279 -11620 -36811 -51700 -17427 -10112 5107 30950 10442
22180 10442 -10276 -22892 7295 34975 64879 29843 -6120 3694 52245 53996 45384 49864
22168 49864 -24331 -52248 -7918 3077 -28989 -88952 -137079 -119154 -83137 -42664 -77687 -121199
22156 -121199 -112578 -99685 -77259 -56082 -111988 -54284 3725 -9478 9031 -19193 49706 25761
22144 25761 -34900 -71155 -56006 -52449 -32899 -24187 -14527 -27058 19477 96701 174144 171049
22132 171049 203541 175057 169005 126853 61682 -16492 -47291 54032 121364 123509 106794 58227
22120 58227 36905 -13547 31776 104233 40463 39134 -34092 -8358 69227 10220 -25731 2381
22108 2381 -44599 -50364 -50607 79454 111346 122617 106266 140969 126899 109620 75368 11962
22096 11962 -70330 -140835 -136691 -48829 7344 -16067 -13362 -33973 -7538 52439 80141 42801
22084 42801 79247 72533 -1402 -63319 -132449 -159781 -96359 -79882 -41019 18614 79 -20571
22072 -20571 49147 111028 86260 -36110 -83179 -53655 -110567 -91962 -61429 -27214 30027
22061 30027 70644 57251 23679 -24461 77312 68882 29392 29221 -5293 23096 117768 145594
22049 145594 132657 110301 -1174 -79901 -74736 11090 -42186 -55489 51702 42203 -25871
22038 -25871 44513 57419 53692 76165 63084 123839 53117 -26097 19668 26787 24300 19036
22026 19036 7876 -12325 -100266 -77008 -42633 -14752 14612 146954 160725 53896 -38020
22015 -38020 25197 -66526 -144525 -124450 -150091 -193798 -155983 -148223 -159264 -59642 -50833 -36254
22003 -36254 -53331 -64300 -5798 24025 -62345 -70373 -38561 -5808 -24971 -50633 -71769 -95757
21991 -95757 -10031 8198 -6374 66763 78786 21063 42303 -12335 -64668 -82848 -34445 -32107
21979 -32107 -46287 -892 5954 39600 65265 35562 35175 28362 19130 21932 44052 106762 69983
21966 69983 10077 148167 90058 -2959 -13459 -31899 -28188 -17198 56004 108373 92827 86916
21954 86916 43559 39178 51234 90042 86804 39925 42831 53262 85365 49091 19151 76974
21942 76974 -12811 -72860 -29427 48758 -11192 38298 14332 -16645 -68328 -32743 -38640 -39401
21930 -39401 2159 53568 132707 107349 25802 -6335 -34583 27138 35501 47097 49734 35290
21918 35290 25300 43464 56712 94929 80994 -18329 -14353 -24894 21914 39621 56236 7313
21906 7313 -31122 -32092 38316 106735 205281 161456 142992 137421 198638 120817 54346 58058 95020
21893 95020 104015 78713 89045 87968 97210 120945 73327 -22631 -97076 -110764 44314 68355
21881 68355 33228 52172 51088 -10679 6961 33146 -2356 -27576 -44713 -102104 -157180 -165371
21869 -165371 -158716 -135591 -111848 -120493 -192834 -199224 -62481 62156 45419 19625 -7265 -44783
21857 -44783 -11163 -8648 -7266 16307 -2035 31200 -8552 -90874 -182259 -217609 -216782 -140585
21845 -140585 -29981 -66892 -63355 -41518 -27721 -30474 -65034 -7554 -16059 -84419 -165605 -77422
21833 -77422 11849 86392 99089 97791 116644 187673 210677 108772 39742 68522 1295 -96784
21821 -96784 -55503 -15551 12363 9125 -208 3356 12151 -4238 -62690 -48501 -38226 -42284 -37093
21808 -37093 23610 29153 -22944 -122945 -116295 -130896 -83215 -26461 39014 102265 153252 170979
21796 170979 147081 135150 121675 68069 92896 49096 26711 14784 44551 2914 -29608
21785 -29608 -894 25517 17923 16160 -17990 -34323 1697 103527 112009 79194 151249 162653
21773 162653 105632 64612 100945 141757 82851 21431 19926 18538 13942 3300 52484 23951
21761 23951 -31878 -71038 -18642 7489 -16226 92482 141059 42645 28951 -34896 -103875
21750 -103875 -74568 -86384 -110040 -127163 -94247 -6352 -45781 -178457 -197114 -104321 13273
21739 13273 53510 83022 116642 112217 106082 55680 -63821 -85802 -77898 -11876 24494 -89070
21727 -89070 -85350 -10362 -42668 -72452 -89023 -145335 -57609 28216 -24023 -49116 -12351 -27138
21715 -27138 -33390 -31799 -99696 -69318 -12569 -6934 -20988 -18718 -22574 69970 94274 87417 4266
21702 4266 -40529 -98646 -45906 3093 85709 52873 54921 2205 -113296 -61205 -10242 22954
21690 22954 -45650 -31091 -25939 -44885 -50180 -36575 -103935 -126288 -137999 -139356 -133059 -159706
21678 -159706 -76577 4980 -117883 -147790 -87781 -35651 -34808 -70508 -79966 -77052 -32261 22796
21666 22796 87205 57059 16788 -33682 -51038 -27292 50846 96994 138035 96824 6545 -11474
21654 -11474 -51558 -21878 38856 121381 111045 60873 -74914 -84436 35975 37829 -8789 10373
21642 10373 78093 62256 6224 47222 62024 130951 166555 198984 86543 -1130 73775
21631 73775 56243 5156 -50618 11541 61944 -14146 -87847 -92187 -66924 -16627 28573 30917
21619 30917 -30921 -85035 -83094 -67336 -106839 -117717 -65927 -40937 -90996 -163786 -153276 -99777
21607 -99777 -45571 -14574 -32411 4564 41473 -2727 11612 -78989 -29611 31626 87333 140729
21595 140729 172854 72743 -95638 -71808 90576 180038 81178 -13662 57740 141985 71012
21584 71012 1800 -71477 -46262 -13844 -32982 -78666 -97287 -94566 -109372 -29622 24082 -6421
21572 -6421 -15701 79382 130361 94822 -63609 -82207 405 -915 20281 121325 192492 176624
21560 176624 51527 -6620 -59603 -109143 -178983 -286392 -288081 -193856 -29150 23053 -15859
21549 -15859 -41217 19517 -49275 -142991 -118641 -15348 -6976 44911 93159 13105 -108181
21538 -108181 -201324 -196197 -143975 -79552 35932 170150 167200 110889 59651 28817 50882
21527 50882 43434 16427 1040 9352 -40885 -95018 -173489 -135370 -42052 39233 42494 -22535
21515 -22535 -23881 -49285 2489 32528 155326 177763 50341 -46851 -56060 2181 -59364 -67870
21503 -67870 -84272 -78045 -36826 -52927 1244 47754 62316 55550 -9229 -61514 -128398 -122948
21491 -122948 -79633 -70958 -133002 -101014 -108929 -190704 -173865 -83406 -5522 -41823 -10127 39548
21479 39548 71712 98591 76647 59021 36620 -32310 13289 -46684 -61624 9911 47990 50970
21467 50970 37911 -4193 20525 -15202 -58574 -30668 -46232 7870 36948 38760 -26541 -68720
21455 -68720 -59045 38244 101420 76743 40941 105210 108728 96086 -33223 -77287 -94065 -118041
21443 -118041 -137182 -141222 -97953 -88158 -42463 -31445 3693 17022 -22009 -19711 -30796 -32569
21431 -32569 8726 124402 177741 210957 256578 231489 109363 44607 12525 -7057 993
21420 993 22412 53900 -17441 2887 66690 75770 -26497 3395 19056 -52708 -53523 -70223
21408 -70223 15682 19615 39491 14166 -66272 -118796 -130427 -181332 -148130 -125034 -85160 -14550
21396 -14550 39340 -10320 -61356 -26182 -69187 -40178 11980 -28960 -8149 -59160 -82336 -39281
21384 -39281 -15929 -29080 40418 82835 146607 189316 155414 134553 147774 109455 37458 49501
21372 49501 24485 21813 34039 99571 41894 -345 34973 90896 150090 164144 197632 160343
21360 160343 77726 140569 158428 7348 -59747 -92152 -154529 -175474 -100252 -89570 -52508
21349 -52508 -3306 13558 65313 147350 178397 249606 240834 105858 27498 -18294 -21376 -124978
21337 -124978 -145930 -56265 76502 106757 65373 -5655 8462 -11421 33899 128413 83565
21326 83565 88023 -15803 483 82250 41108 -57515 -73472 -32807 56885 63352 81173 34334
21314 34334 11148 -10520 24062 -93244 -57246 -14154 -55370 -113295 -68079 -8324 -34621
21303 -34621 -52194 -133441 -137498 -87516 -49816 -123627 -69149 4360 15578 14834 -40909 -106497
21291 -106497 -29093 61744 30437 56774 76183 56690 17382 -56695 -173134 -82052 -55348
21280 -55348 7426 45885 71508 102373 104446 63715 64232 -45444 -93421 38671 105209 115814
21268 115814 113445 68684 31396 13642 -54759 -98884 26038 162999 116581 64629 100701
21257 100701 64817 57552 37513 76884 62453 -22321 -9094 74884 80967 60377 2981 -9502
21245 -9502 68299 50134 83050 76093 78971 29562 25943 46239 19796 -9157 -44295 662
21233 662 60417 -1126 -18480 -71881 -68001 -114769 -64327 1446 42477 -11489 41560 16608
21221 16608 -50876 -55240 -37561 6886 43342 78531 64752 1532 -30578 9316 44531 85463
21209 85463 53573 -43698 -88907 -39290 15263 46286 57587 74655 136841 173662 110079 33016
21197 33016 -16523 -47172 -61043 7390 17711 -52448 -106508 -91782 -22645 43563 91152 122079
21185 122079 76459 23872 47783 21049 7206 -22937 50433 53139 24267 -31540 -71389 -185523
21173 -185523 -201664 -264657 -277710 -193590 -55219 -21373 33605 33097 59210 67602 15549 -36611
21161 -36611 -61278 -125651 -167180 -57186 -4005 -30503 28136 91844 -6148 -71385 8081
21150 8081 27248 -15127 -12291 8142 -21031 -806 22778 -17935 29179 116163 71976 81754
21138 81754 140318 115624 106641 145607 100321 59024 66915 7926 -50377 -59040 -7553 15098
21126 15098 84152 158572 203217 187649 164791 66566 11842 -38883 -8238 61135 103477 104877
21114 104877 72047 79319 79553 10323 -5137 11416 38822 31230 25913 -16638 -52023 -63124
21102 -63124 -84087 -36274 54909 71375 62764 109932 112974 52933 25661 -6391 -67387 -83281
21090 -83281 -78822 -23058 -58027 -25590 4737 3251 29514 55076 140673 110724 97409 55793
21078 55793 -435 -57386 -75394 -88860 1912 20290 51114 29410 -26047 -26826 -19990 -5110
21066 -5110 -42366 -75041 -30004 -64235 -45930 19993 -15637 -24977 -9086 11590 79135 74389
21054 74389 -26852 -85699 -1378 39013 -9530 -43744 -27415 69389 98462 16684 -13949
21043 -13949 -69518 -6877 4307 32674 53800 52630 50478 -5783 3954 -28594 -30031 -41697
21031 -41697 -26062 38156 -7944 -1934 -30591 -57978 -7354 81800 74040 -9912 26794 7395
21019 7395 -41647 -51960 -79700 -91239 -59031 -28668 -75789 -21442 37068 -30213 -61800 -71622
21007 -71622 -57762 42717 50659 29825 53404 113111 99799 65040 50852 92802 151233 157755
20995 157755 128838 136698 148558 75895 63163 23305 71145 13088 -22356 -14086 -24760 -64442
20983 -64442 322 8886 5771 18012 53612 71189 139448 218063 168081 55109 -49076 -75855
20971 -75855 -85366 -54036 58635 64148 65523 109034 48867 23755 15959 -36632 -51031 75679
20959 75679 106011 77908 75344 101314 73950 94264 9482 -53011 -55601 -7700 80579 117462
20947 117462 35795 -40519 -41614 -55616 -37371 12754 40039 43015 -43072 -150195 -107049 -92482
20935 -92482 -51526 37172 -37344 -160554 -167319 -111257 -64724 -11034 41997 32512 33742 -31721
20923 -31721 -35717 -28291 -86718 -39809 33011 -9870 18066 -19466 -71927 -32451 -20559 -98405
20911 -98405 -74459 9398 138864 110892 133861 82271 76471 115629 71213 33263 69920 72438
20899 72438 18499 -58942 -52020 21436 21011 2701 -22770 89539 145882 89241 26340 -21586
20887 -21586 -59700 -93294 6801 97091 109388 53891 54703 3366 80414 62355 44930 47965
20875 47965 4111 -86477 -89259 59764 147739 214585 243185 127663 69089 122855 98849
20864 98849 60582 38657 44082 104549 199732 217247 181805 136246 119141 80625 89094 115541
20852 115541 179346 185492 142051 49838 5457 35125 76314 73625 71309 12092 -3683 1506
20840 1506 -6161 59837 76301 116895 151117 104864 -8918 -7906 -9075 -101241 -63933 -40657
20828 -40657 -72478 -79088 60642 105252 50212 21765 38968 43956 16782 31776 58041 12400
20816 12400 13413 20384 78151 88639 108288 98475 92860 142223 61785 -4119 -92948 -79725
20804 -79725 -35092 -74556 -22597 -31646 -87613 -120795 -87922 -95630 -842 44857 370 -15230
20792 -15230 -7661 -88257 -51294 49360 131741 115472 87043 69264 138747 152780 124344 104850
20780 104850 37598 -1250 -57088 -91336 -28553 -56586 -62239 20725 -27667 -122158 -105265 -56046
20768 -56046 58371 106321 58513 59161 141371 142034 112076 108082 55331 93714 55047 75944
20756 75944 47183 13133 9889 41896 39182 39139 -1408 36297 50716 124 -96012 -99191 -41173
20743 -41173 -64627 -48606 -82958 15989 78860 120523 105575 13087 -25331 26262 84881 91665
20731 91665 126228 151877 118303 -18921 -69433 -73270 -47857 8399 36518 61911 66473 49179
20719 49179 28968 56048 83149 148688 120146 102907 90457 20535 -20842 20663 -13435 -57379
20707 -57379 7304 -11470 -89820 8818 32446 -36344 4402 75002 64624 57956 6549 -48203
20695 -48203 -53126 9584 75418 47697 79363 19160 27637 81239 57790 -26146 -26364 -37271
20683 -37271 -10922 -19603 -23102 -34425 1399 5260 -23507 64934 126531 76825 91534 111872
20671 111872 77575 39415 69462 18813 69285 145165 136731 144758 168542 139568 82355 167365
20659 167365 177934 104737 48688 45169 105197 173204 119471 24682 5570 -14314 -69279 -88577
20647 -88577 -72050 -21204 19266 8765 -14453 3502 31240 51302 -5147 -63807 -108404 -70677
20635 -70677 -60627 -85468 -21179 65334 34502 -38835 -111005 -97305 -1871 38357 92067 81959
20623 81959 117299 230083 220503 85188 18593 -32302 -25141 -32351 29142 36543 -47655 -11161
20611 -11161 -53267 -104758 -21044 53283 -32013 -66374 -80706 -71987 -110060 -21158 81426 113911
20599 113911 148715 98950 71452 94428 132643 89459 23640 -8577 -46502 -58738 -32358
20588 -32358 -21659 -11191 -31675 -78413 -88250 -148128 -197607 -195304 -183638 -111835 -106249 -154739
20576 -154739 -223782 -186179 -155795 -135152 -119363 -141949 -162675 -110775 -52059 -44359 -62855 -111184
20564 -111184 -131093 -110083 -46632 43821 103566 27328 -32778 2876 8485 26758 46417 45125
20552 45125 21390 78389 155891 118590 -12791 -25272 -54452 -114657 -19902 -76519 -109745
20541 -109745 -16423 -15657 13774 39665 18111 14168 134651 125080 134630 80027 -44248 -77258
20529 -77258 9168 77157 83318 46382 53756 97404 108347 80851 101764 151019 197400 198667
20517 198667 80408 23078 54033 80856 85899 58361 67075 85658 29358 -20851 -23331 39814
20505 39814 40005 -1712 -5375 7846 117908 163866 120852 79219 106949 107601 71379 33678
20493 33678 105516 75723 26795 27301 135658 128321 74375 38936 45551 23888 70310 124083
20481 124083 125775 107760 104981 74355 1013 25349 67302 79010 50199 18315 -13907 26866
20469 26866 74314 71691 27544 -1859 66024 95595 109311 157778 269805 328140 377665 404929
20457 404929 446437 568798 693317 751622 776682 688234 654288 737652 806402 755986 667233
20446 667233 595811 585051 563603 485144 321503 245445 188138 121166 66138 100434 113494
20435 113494 86259 89033 94651 -13179 -109167 -82417 -36868 117023 181090 159893 180773
20424 180773 141277 110967 41267 17029 130480 158877 100543 70540 72192 81957 202660
20413 202660 269920 237157 188517 178459 267574 344570 530656 691537 777905 815253 849336
20402 849336 886765 884462 926085 928555 832406 822032 835715 745425 644296 545756 422265
20391 422265 289959 227372 212655 265974 310235 288790 220460 164118 130652 46053 122474
20380 122474 154658 140504 120051 66426 52546 22152 60563 75684 104481 40702 19031
20369 19031 37203 134606 242556 262877 181085 126689 60845 113635 216248 220171 151740
20358 151740 49107 12335 34358 182 -2851 -49961 -83673 37943 124165 129542 79893
20347 79893 18431 51367 31197 82358 211873 178954 161491 133189 115502 144587 149090 114529
20335 114529 109814 152828 129986 112840 101275 212496 318096 292762 207759 132760 160392
20324 160392 99092 58534 103052 99571 99499 31435 1821 22901 75218 130883 194250 240997
20312 240997 220673 159733 152142 145809 192393 160763 120333 76447 55638 74189 60707 152896
20300 152896 150656 93735 46100 -7223 -65635 -73368 -53633 13700 41051 60648 71841 81545
20288 81545 46106 107530 110354 114752 85890 23090 41890 153681 172066 136635 91575 9553
20276 9553 -28734 45685 55043 45781 60240 102939 84716 -29443 -46719 38010 63960 165495
20264 165495 217815 126043 43618 62327 66147 38172 74720 90881 91870 60171 6008 4482
20252 4482 30355 72925 113624 101030 145956 190554 252257 318667 145660 98895 129923 116153
20240 116153 56723 -56447 -21437 95031 130341 36120 41402 144345 225685 244558 221251
20229 221251 222789 229905 137055 147938 187069 108735 24254 18854 33563 61056 72406 111635
20217 111635 160188 222828 167227 84156 108510 237850 337228 284130 220972 216262 242666
20206 242666 273164 284372 254978 112767 63347 69760 53817 -15268 1499 18507 14923 17241
20194 17241 48964 150299 179570 133102 75446 170228 140330 98800 123494 114945 103406 172290
20182 172290 230975 247805 279721 292013 238550 204690 195912 146712 168158 163745 49652 63519
20170 63519 129500 148398 220542 219416 184400 218162 216118 267289 246655 252118 245253 255790
20158 255790 320089 363360 303533 241820 266749 308399 214065 110408 92953 94271 120422
20147 120422 79691 23503 24020 103736 97430 127064 150302 189576 201274 294842 331558 267796
20135 267796 214215 221235 222522 166458 109544 169781 253432 279696 263256 235723 271392 238823
20123 238823 312562 303698 216705 283960 313764 257689 273780 241568 232080 187335 166739 248220
20111 248220 234262 143773 84498 53190 81718 112790 175646 158839 240237 250513 173459
20100 173459 68915 14106 79967 215189 203831 215858 289102 302695 197953 195752 266594
20089 266594 180596 197741 260331 308694 327029 369369 461132 439571 363870 296865 276259
20078 276259 263176 248023 169533 117461 133821 266901 342299 344120 413082 461541 580966
20067 580966 680520 817793 908022 868023 800096 790222 806192 803216 854479 976297 995512
20056 995512 825414 664086 552686 424418 348346 324823 339780 380761 297545 223140 157010
20045 157010 172477 236789 340902 322943 244380 226556 240583 196638 263353 392727 416493
20034 416493 389919 362143 343373 366980 378835 364821 358279 299583 361920 387106 409026 427300
20022 427300 458795 648762 684324 640924 707980 928372 1068275 1113651 1214438 1182257 1084681
20011 1084681 1019828 978896 1076176 1154730 1126436 1043127 909112 748505 721172 723262 711646
20000 711646 639184 520736 508600 517815 535719 552793 535255 514583 453647 429973 505235
19989 505235 563958 583222 649110 724835 719465 794107 804995 837657 944217 1034269 1002272
19978 1002272 1002647 1033342 1108293 1225848 1271773 1279097 1301784 1327050 1414904 1539339 1678435
19967 1678435 1864422 2116598 2361444 2675817 3010902 3386386 3752367 4075622 4440673
19958 4440673 4695764 4896261 5083176 5332357 5504586 5744045 6122358 6503315 6837340
19949 6837340 7262084 7943973 8863322 10129715 11888595 14148863 17249382 21699908 28125581
19940 28125581 37853749 52607371 73614190 97864612 114490887 120263191 126087973
19933 126087973 133439071 133714602 131871684 134958097 134440433 126423664 119973006 112914987
19925 112914987 94126807 68737281 47918246 34254107 25793867 20465261 16963870
19918 16963870 14451141 12871176 11916080 11351309 11040297 10836876 10856292 10964604 10933413
19909 10933413 10781326 10645226 10511142 10569285 10557855 10603077 10568300 10508381 10603106 10869969
19899 10869969 11304267 12036827 13244551 15039390 17538492 21025688 26103289 33783007
19891 33783007 45509926 63097454 87260184 112366421 126492088 131286534 138473183
19884 138473183 145113991 143517106 142330272 145455735 142014962 132898594 126631248 116231513
19876 116231513 92788626 66015936 45725722 32728985 24570821 19208965 15581235
19869 15581235 13091365 11284721 9988708 8950156 8143690 7702056 7418046 7008071 6603670
19860 6603670 6228327 5947937 5604052 5300941 5100845 4817691 4470409 4180243 3830025
19851 3830025 3461906 3093152 2707224 2383737 2058317 1815580 1799518 1648367 1535410 1439146
19841 1439146 1299185 1286584 1276228 1289846 1158184 1087553 1009733 900144 930349 978120 1016142
19830 1016142 917038 761784 813139 844605 770726 814027 883019 902470 925875 915732 920867
19819 920867 893888 905352 907729 830930 821301 786683 794014 810969 792738 777141 688282 671761
19807 671761 670463 725774 757691 802711 769743 745188 729312 752830 665128 573313 528921 483577
19795 483577 452572 380644 393437 407122 415129 421576 460325 475822 520749 541340 559522 511708
19783 511708 448953 391289 410299 479835 467374 427590 425724 479306 430605 385687 372063 327312
19771 327312 367692 424631 421633 308948 294605 367867 442411 483432 549800 601294 646671
19760 646671 613291 590286 602788 663550 648191 679453 725384 678404 686043 665830 622322 617165
19748 617165 559003 434400 395211 365642 206145 155645 203945 242426 283266 307567 359089
19737 359089 390696 383678 400110 357262 212765 193193 243976 314937 338827 365425 352074
19726 352074 291954 272560 247139 266373 341819 403496 400228 292948 297527 225742 273248 328752
19714 328752 329855 350305 309535 299578 240267 179402 174418 226044 244297 186011 255794 307951
19702 307951 312133 334257 374273 409594 497246 473952 322646 251777 244386 292941 274197 259944
19690 259944 294077 366399 423516 463646 385688 324173 167822 96536 114236 207847 219406
19679 219406 239540 211045 180123 177311 166490 194780 272967 299121 324534 387803 382617 378606
19667 378606 305261 202281 218129 231867 251690 269102 301410 309308 309623 311384 343790 381994
19655 381994 384420 437096 374861 416342 427959 470559 449867 466564 407201 386330 323202 264634
19643 264634 310849 409887 461964 477285 510947 528096 471682 404803 336654 336650 330229 371640
19631 371640 355671 430461 517059 526421 436323 389295 452390 504724 564608 632978 538761 492270
19619 492270 521747 615579 676572 713637 693653 676599 696331 685046 701756 679130 692574
19608 692574 818101 938173 970542 932983 930318 928897 954827 1013375 1062079 1109923 1106921 1085408
19596 1085408 1179798 1260335 1354713 1443224 1534044 1625229 1706862 1869161 1945764 2094547 2275726
19585 2275726 2567647 2866137 3226016 3658049 3961242 4105652 4176101 4253070 4492896 4770345
19575 4770345 5168316 5588814 5930313 6213834 6709437 7368016 8204414 9343498 10824033
19566 10824033 12643919 15043678 18237703 22589172 28538780 37130575 49978817 69228579
19558 69228579 95659673 123764406 143065644 146141461 135321265 120822759 115091755
19551 115091755 122846330 136643506 143406110 134438374 111211327 82461155 58029868
19544 58029868 41523447 31184544 24542905 20010428 16794153 14483960 12720208 11444449
19536 11444449 10459161 9881610 9646293 9723604 9893211 9870803 9609020 9161964 8882821 8843901
19526 8843901 9127501 9532160 9687723 9709909 9691413 9749709 10102744 10892463 12060134 13553974
19516 13553974 15527539 18075978 21596848 26515996 33291063 43051730 57691860 79580572
19508 79580572 109305623 140466575 161392952 164008592 151080477 134246883 127649141
19501 127649141 135977989 150305377 156629376 145874009 119974235 88327875 61782841
19494 61782841 43923062 32584580 25119433 20105529 16620400 13983597 12016813 10518320
19486 10518320 9264241 8251020 7595398 7214441 6843343 6470665 6094854 5605489 5079519
19477 5079519 4773305 4560180 4402090 4185506 3864376 3509448 3037664 2642731 2385916
19468 2385916 2154584 1959439 1843263 1729115 1711624 1653339 1540558 1488040 1451096 1439659
19458 1439659 1273804 1124820 1017663 862137 802131 795435 712296 674284 707246 760501 797150
19447 797150 756337 719306 683240 753141 709423 760698 774329 655686 532330 527680 553052
19436 553052 559988 477309 522867 522502 580217 642788 717167 736626 758953 783437 828680 808060
19424 808060 783077 873897 865796 716308 602422 604633 632614 676921 639741 615342 700594
19413 700594 818532 924172 1034029 1055225 1039502 1012292 999474 993583 956204 944540 910849
19402 910849 841211 723368 662982 621687 520643 455489 496274 394805 274315 334650 405390
19391 405390 399631 427784 381779 327390 369106 412684 357069 388952 478690 546057 595538 699853
19379 699853 666552 676052 606987 517086 568981 531850 483110 532623 540258 531189 544667 569410
19367 569410 664703 764346 878842 980717 1051192 1077684 1113278 1139013 1133112 1110643 1108583
19356 1108583 1022299 901374 806164 726852 660752 581831 468589 356773 366374 318194 215947
19345 215947 130875 46047 49471 153929 194571 160378 190381 155931 187153 176365 76771
19334 76771 43738 163348 141369 77412 154517 231847 224655 172707 181374 175378 154719 215626
19322 215626 276442 212286 211369 244282 245076 202225 160922 125095 156471 229061 338050 366837
19310 366837 350583 337023 409487 476650 568571 671741 789976 978500 1126822 1298251
19300 1298251 1315418 1279292 1206810 978620 756271 514592 311337 266126 303441 307805 337712
19289 337712 292116 251347 252714 274226 287886 300875 345006 337542 298115 226031 267890 326370
19277 326370 373755 323340 299514 421457 576193 613238 552829 690483 931685 1154879
19267 1154879 1318476 1477986 1452623 1373910 1236209 989387 774312 611863 469024 381530
19257 381530 301715 320454 375158 384938 365506 302960 251876 126592 85290 44963 66793
19246 66793 190858 204723 193344 146339 86751 177921 182860 166763 118248 90483 90914 63985
19234 63985 75322 44501 -36857 -7315 64297 114124 93428 173551 166198 163561 171269 167468
19222 167468 181699 163462 144308 147966 275636 317415 240457 204526 193501 149235 91178
19211 91178 74759 145838 189179 207288 184344 198506 199667 125378 110176 80049 68510 150370
19199 150370 188323 201904 251211 172272 199159 222974 234951 272970 263993 187944 179544 131543
19187 131543 96402 103298 111272 67223 90526 96452 191207 203541 216360 128810 71106 145048
19175 145048 161804 148226 131470 81611 81212 95901 70317 60390 14292 48004 52400 20283
19163 20283 51802 116595 101693 62605 98099 133818 143952 198857 275496 271773 352465 407236
19151 407236 525241 737808 1026733 1136629 915920 641261 420979 314904 280913 175804
19141 175804 130797 187350 205256 256368 221966 241739 259179 192944 154797 179972 161279
19130 161279 149900 214847 268506 298486 246598 105523 761 1036 25306 39018 116284
19119 116284 139766 147026 165482 153245 230607 237116 233661 180487 197516 191465 132811 183071
19107 183071 296373 299623 372538 497506 651653 977216 1338954 1733427 1888493 1623924
19097 1623924 1268419 952347 649560 445453 344919 380920 342166 322752 357375 402568
19087 402568 360295 344424 437285 399932 406380 345977 236959 161508 88713 188773 170833
19076 170833 187726 182135 178438 158170 159340 262624 337079 237663 152247 154063 151426 81916
19064 81916 65124 116050 160354 119677 137436 144622 142889 106942 252803 402260 462251 515381
19052 515381 584207 697948 802730 817340 767799 778752 725477 684632 744152 806360 856716
19041 856716 910427 880253 862137 846887 844323 941845 1093459 1135855 1066210 858579 760659
19030 760659 613466 449150 401494 389381 349627 280444 270749 380294 381733 306552 314765
19019 314765 267542 227707 140469 182603 255487 317233 333305 378667 321198 310250 285452
19008 285452 272007 235963 231591 174667 153024 174580 227594 280178 302918 271314 355095 417386
18996 417386 483285 559402 750943 1039791 1208974 1259265 1183730 1107782 942838 854605 991588
18985 991588 1159757 1134612 1000693 951164 845385 649864 543551 527163 550862 543662 529866
18974 529866 445551 408476 311610 268436 305325 346532 311566 318073 341526 355653 493511
18963 493511 680374 919531 1182213 1375789 1403244 1225481 1038676 805510 546782 463579
18953 463579 497886 523246 538336 599583 528023 371973 341415 366371 415120 415645 401955 431423
18941 431423 493977 507036 496744 538280 598386 610894 568178 586314 678430 737963 705528
18930 705528 728297 727584 918181 1174762 1564139 1914259 1956431 1757965 1458059 1171833
18920 1171833 884562 711304 582250 506972 527102 523361 356886 325421 326971 307007 263532
18909 263532 326577 353747 253746 243713 294107 347178 394754 432877 465588 405354 377392
18898 377392 372120 320291 327511 282598 220118 228847 251331 306329 396129 449819 486891 439397
18886 439397 469201 527683 480529 394108 350297 323938 235494 250232 269862 238590 262063
18875 262063 378546 357436 336620 423241 437106 335031 289215 293156 275385 266842 331345
18864 331345 360786 407225 434521 400607 313189 295253 366556 383111 338754 283402 315738
18853 315738 283541 273594 284420 221232 167153 227004 236728 198461 205613 299632 347930 377975
18841 377975 468573 424894 402116 471644 582974 636948 569693 545769 552894 508327 487425
18830 487425 420757 392308 379061 515100 578123 633035 658644 707223 693170 617283 599317
18819 599317 565874 485132 454903 482347 492293 466457 432897 370478 430987 443456 501151 495723
18807 495723 549412 701987 760076 713277 711350 760790 838993 823151 841832 878968 866350
18796 866350 852702 856734 820205 841824 898984 909326 1012900 1063941 967156 953238 988910
18785 988910 977796 992869 1009690 999599 977301 985709 985527 1026744 1054249 1219333 1382939 1345062
18773 1345062 1458335 1454646 1363518 1488649 1574539 1816653 2114883 2367164 2458827 2301432
18763 2301432 2135626 2042622 2070015 2101914 2135164 2432295 2794153 3164162 3438715 3507896
18753 3507896 3510579 3489751 3569746 3629106 3639225 3653962 3882105 4209063 4584654 4990046 5371707
18742 5371707 5719464 6220214 6727455 7178494 7750339 8653194 9748520 11300817 13384976
18733 13384976 16083230 19556855 23974727 29681915 37779374 49847479 68270765 96322070
18725 96322070 134263805 171361502 191112725 193302846 190773870 179897792 149973296
18718 149973296 109186294 74904115 52532435 38883605 30081602 24358897 20675925
18711 20675925 18229257 16768794 15989366 15554747 15183368 14982527 14986430 14957573 15063883
18702 15063883 15518861 16336106 17564529 19455328 22191318 25879291 30845278 37536183
18694 37536183 47084254 61313923 82992654 116036918 161826368 209743903 238246474
18687 238246474 242849359 239382641 227709948 193473200 142429364 96632810 65821198
18680 65821198 47179482 35573442 27985336 22775364 19196917 16696760 14782284 13183726
18672 13183726 11941625 11066423 10353582 9730343 9128897 8544252 8002515 7672897 7318356
18663 7318356 6939488 6778332 6829307 7034055 6990458 6718677 6504773 6361364 6234013 6279781
18653 6279781 6325481 6267114 6198659 6224741 6526918 7040838 7724070 8628476 9882895 11537495
18643 11537495 13819646 16913850 20998976 26272644 33657323 44735895 62303163 89658220
18635 89658220 127551102 163572243 164634757 127362567 85757244 57214980 40139215
18628 40139215 29907149 23402788 18940341 15701098 13238158 11300397 9850197 8769617
18620 8769617 7951119 7385331 7009193 6798861 6714420 6741617 6869407 7329711 8077925 8869961
18610 8869961 9393113 9384372 9069448 8677404 8106441 7645735 7489432 7604524 8009102 8585320
18600 8585320 9438510 10520660 11899005 13738346 15996268 18896536 22628329 27620421
18592 27620421 34298768 43223379 55532810 73790417 102404092 146721540 208386434
18585 208386434 270376727 290873190 250715628 180092627 119880955 81276295 58041688
18578 58041688 43523588 34014315 27499128 22670762 18774702 15677913 13359170 11639499
18570 11639499 10443132 9532180 8760203 8067834 7684319 7416668 7336349 7488162 7836696
18561 7836696 8316584 8792189 9031931 8755648 8020471 7104713 6359203 5930108 5606002
18552 5606002 5542531 5736619 6000619 6306378 6900911 7739235 8869121 10388480 12567400
18543 12567400 15476244 19195247 23968004 30785597 41512628 58503857 84390255 117738088
18535 117738088 141694553 129635047 93532250 61234244 40853392 28907967 21560543
18528 21560543 16768302 13423672 11039808 9153729 7770743 6643563 5733738 5082087
18520 5082087 4576315 4152985 3716795 3351215 3092202 2941159 2836504 2653985 2671205 2900520
18510 2900520 3109466 3340097 3274449 2942054 2549838 2244219 2017411 1791470 1676116 1586361
18500 1586361 1465424 1427081 1400154 1388963 1317407 1322308 1330426 1276210 1279010 1293053 1303141 1276518
18488 1276518 1305061 1250805 1246280 1275178 1207445 1213582 1199574 1282769 1311022 1259157 1267723 1303259
18476 1303259 1331401 1461298 1542739 1572783 1589295 1602180 1691192 1616855 1613662 1724474 1757054
18465 1757054 1741997 1773107 1786650 1966218 2112065 2159889 2344714 2551677 2667303 2770041
18455 2770041 2842965 2984628 3116146 3207429 3422742 3776990 4150291 4705298 5226597 5656811
18445 5656811 5959755 6139467 6511879 7155000 8119785 8944016 9449629 9709731 9840778
18436 9840778 10138179 10969801 12230877 13961138 16376165 19518949 23685357 29255072
18428 29255072 36748639 46897111 61312251 83429652 118841580 172868321 241717758
18421 241717758 297193282 309031683 273118110 204001529 137143436 91433163 64335157
18414 64335157 48129155 37794184 30745622 25737194 22111444 19517842 17745339 16653509
18406 16653509 16145200 15934947 15826111 15797804 15836796 16045442 16157627 16375884 16874878 17989992
18396 17989992 19931203 22885346 26732301 31716777 38617809 48685831 64448341 89978797
18388 89978797 129946400 183450663 231570552 247228563 224488159 171354826 115396045
18381 115396045 75719381 51946540 37726291 28640909 22344610 17811443 14640622
18374 14640622 12339115 10596987 9310852 8326851 7650169 7317637 7255216 7292063 7383499
18365 7383499 7184762 6669192 5900072 5249839 4858736 4568704 4267836 3839999 3409414
18356 3409414 2989170 2573708 2204941 1969052 1863336 1807419 1706598 1587623 1528970 1466784
18346 1466784 1233053 1100299 1083349 1057461 936439 863804 874577 815157 765036 854203 827874
18335 827874 758931 740732 677022 619337 673690 696078 589104 532672 561458 567679 574138 585031
18323 585031 512294 479440 534932 567613 522593 493954 478022 446003 444675 458658 398465 397868
18311 397868 371215 423874 461632 426922 498723 501854 478820 421822 439687 436100 424217 409880
18299 409880 370818 425160 513477 518087 594973 677132 665327 639333 545563 415216 345993
18288 345993 305320 223194 251335 251598 250652 313349 359495 321591 297944 285782 208365 273876
18276 273876 298566 206330 199693 256114 250601 271349 286390 351540 361448 333117 354527 285533
18264 285533 169314 162671 174245 200488 269483 469197 527099 543535 515517 504295 421384
18253 421384 278945 226284 217409 194155 135654 143465 111719 112347 88405 147013 174630 170230
18241 170230 264289 268353 153392 10479 -40387 -26159 25630 -76847 -88854 32417 187079
18230 187079 190649 132482 215791 246187 291612 283911 228003 255200 290374 262375 143823 42067
18218 42067 56970 -13464 16797 81622 132449 161751 149565 4232 28599 14021 -2362
18207 -2362 14621 25416 14511 47532 184907 263644 250509 186736 134769 112815 121531 196668
18195 196668 249930 231928 181856 160967 102438 90147 176149 213237 261731 231508 166903
18184 166903 190047 277757 308639 160031 146537 172640 161103 290108 329727 243366 185852
18173 185852 216872 171891 68200 135306 236927 260408 286658 282658 345257 412428 416899
18162 416899 442396 393550 388201 514101 648718 643268 556192 511648 539196 512533 526191
18151 526191 585862 607056 627096 664182 709346 779177 793562 837320 931286 1055156 1180824
18140 1180824 1279325 1342383 1447155 1682903 2003482 2366041 2644247 2797058 2920972 2975815
18130 2975815 2916241 2782866 2722998 2756555 2929126 3142401 3429457 3831075 4479417 5256975
18120 5256975 6238738 7527952 9058824 11101427 13823704 17302699 22086955 28791272
18112 28791272 39102281 56295868 85079927 127778905 170900033 169656435 122983453
18105 122983453 76379637 47567219 31835359 22937115 17514192 13972880 11429649
18098 11429649 9516897 8068949 6877910 5776906 4936402 4269852 3737413 3427616 2987112
18089 2987112 2601041 2341196 2135624 1819738 1543535 1389987 1299722 1245864 1060213 925314
18079 925314 880267 838784 721699 739650 821593 851649 866445 890136 873333 756017 776723
18068 776723 884104 1006058 1245289 1549169 1904149 2032258 1893577 1561128 1174517 951465
18058 951465 765194 649727 579550 506577 469539 483434 447248 375997 323993 281816 243510
18047 243510 227267 185824 112488 169207 140926 154013 225042 196891 240237 247722 192007 111392
18035 111392 176847 173805 162190 165154 149502 170220 175261 160090 105136 70526 89333 70421
18023 70421 91908 72732 161243 245442 249354 399458 420757 439827 647814 901052 859939
18012 859939 706661 561092 431372 344689 256879 289540 246652 241763 309365 360590 413006
18001 413006 353127 366331 473929 456670 367710 370597 368879 374738 377043 348971 392037 391140
17989 391140 362969 381518 398231 302662 230140 201696 224502 297767 244823 223567 173481
17978 173481 148985 200990 117783 66052 58972 76636 12202 40108 47426 91074 67874 107145
17966 107145 56416 15004 21422 76751 172153 180644 206789 202012 137903 146893 143900 160191
17954 160191 164110 127062 149799 257424 210235 222202 221253 160144 153301 190426 169795 235131
17942 235131 227388 166868 179515 118042 104687 45319 23831 82130 120741 166402 137474 99658
17930 99658 73074 8999 -63226 -77677 -7334 34059 25197 31446 21167 -11612 -15163 -61768
17918 -61768 -106798 -67299 -90938 -79414 2883 61946 71867 115562 173899 135835 54498 15812
17906 15812 -63893 -52782 38732 58492 45586 49155 117888 115328 89166 49164 -31645 -9098
17894 -9098 27309 58969 46579 28506 73352 174364 160713 174522 197322 173014 176241 258131
17882 258131 404314 682150 987336 1344879 1518749 1404716 1149872 846014 590862 416408
17872 416408 322784 257612 214612 146747 96146 70805 30590 13449 28723 76227 98607
17861 98607 111681 66157 73084 60999 -10221 -38455 -1832 67532 64765 2447 -44164 126161
17849 126161 237105 276470 420137 644569 863605 1142010 1319355 1310874 1079364 821397
17839 821397 533049 366587 312948 293823 214401 174678 88364 52194 -14536 -102518 -43702
17828 -43702 18162 4379 -11662 27302 -28988 15659 8136 74017 68996 5276 -7376 -67358
17816 -67358 -106291 -4019 48769 16748 -67929 -82640 9452 114579 149555 123300 107129
17805 107129 81905 79756 138567 139602 42408 48116 88448 115492 51326 -10724 -55116 -142769
17793 -142769 -189473 -173646 -164151 -163189 -5051 43669 27110 -39476 -136655 -219951 -161892 -78137
17781 -78137 -65443 -116452 -158970 -122090 -160786 -190749 -165557 -131494 -187263 -224253 -182816 -139102
17769 -139102 -75963 4736 -67969 -165951 -129943 -82361 -41256 -126590 -198703 -145242 -81729
17758 -81729 -127006 -124029 -17610 -38026 -114880 -107635 -96872 -92954 -78072 -71899 -21482 -36235
17746 -36235 -122125 -136766 -69573 -19356 -28636 73610 75628 33397 -32194 -143343 -127568 -43481
17734 -43481 3171 -5467 38268 -3685 4257 -18516 -37829 5295 -28849 -88216 -80999 -55000
17722 -55000 -23729 25784 7326 -20748 -26907 -86806 -141196 -100005 -38370 -38771 104263 118672
17710 118672 76368 127141 139285 -14861 -91845 -119273 -130301 -85695 -128788 -112295 -126512
17699 -126512 -58545 -70406 -46412 -78037 -144259 -201813 -236813 -213624 -182197 -270317 -233030
17688 -233030 -191102 -91976 9585 24047 -16860 -29041 -87081 -181316 -157170 -97365 -126299
17677 -126299 -161116 -188067 -161568 -78763 -77725 -5167 70143 59947 70849 95002 -3449 -29624
17665 -29624 -111787 -117876 -105420 -164285 -159384 -204964 -343378 -316128 -207153 -183950 -158632 -88281
17653 -88281 -88739 -66760 -61127 -13934 10126 86410 57417 32197 41053 85807 86457 -21976 -101345
17640 -101345 -91067 -60796 -146009 -126907 -99433 3364 19277 -45289 -84280 -110239 -142317
17629 -142317 -167698 -177295 -108464 -123455 -227586 -197637 -137813 -162450 -156062 -103198 -125442 -159343
17617 -159343 -164211 -204406 -163294 -57510 -101693 -168457 -140237 -226544 -212522 -139217 -95612
17606 -95612 -149335 -206686 -188738 -61232 86223 131838 102871 -40075 -82610 -71737 -4300
17595 -4300 27059 -7770 -108421 -43686 -32740 -37447 -87964 -123790 -191755 -238836 -227325 -158824
17583 -158824 -129191 -151270 -84755 -40704 30428 20523 30397 68827 103535 69813 40874 17271
17571 17271 -15415 5778 92619 136501 132627 109682 88721 -818 -31972 -7725 -14424 45858
17559 45858 -24029 -123188 -103879 -634 -46743 -50669 41335 115038 146263 72253 26364 -90111
17547 -90111 -161897 -183422 -165654 -149035 -134761 -155266 -76157 -53293 -95000 -92265 -53597 34623
17535 34623 63374 -41713 -167640 -226363 -173278 -167936 -144246 -138443 -95332 -54522 -96696 -123426
17523 -123426 -105780 -91561 -11077 26412 -70778 -108335 -129998 -93680 -1147 -15201 24064
17512 24064 -8146 -67721 -1329 18365 -3438 -88634 -76285 12151 11655 -19451 -103878 -142743
17500 -142743 -177114 -113150 -38762 -36618 -58261 -110533 -33365 41850 22341 -13533 26178 27349
17488 27349 -8341 -105259 -114967 -121722 -93382 -21931 -13312 -44648 -10094 -42489 -107593 -43466
17476 -43466 -62568 -114371 -193238 -255839 -301391 -268938 -196221 -251192 -197896 -194868 -137276 -169140
17464 -169140 -230973 -143741 -162498 -87463 13837 45477 9933 4416 37057 65391 106782
17453 106782 85174 85562 158225 50348 -27914 85543 111831 101809 217440 376947 557995
17442 557995 773205 892613 758905 516741 375273 222119 119691 92514 36029 -1652
17432 -1652 -13232 -45277 -78194 -134339 -101281 -38870 -51836 -88575 -57607 19921 112224 115344
17420 115344 101217 94951 44417 -26510 -50798 -78265 -69726 -67620 -48517 -21273 -73707 -129905
17408 -129905 -220051 -217099 -161935 -158220 -110249 -71308 -69911 -137896 -168487 -161845 -196799 -241615
17396 -241615 -169965 -129083 -90425 13502 84386 116441 121495 199001 158377 29412 -10763
17385 -10763 -51974 -40477 -13478 -88468 -56649 74867 163363 105092 84634 30444 -3817
17374 -3817 -13945 -24524 -53130 -23710 -2352 -9238 -43471 -95119 -103744 -73754 18952 74273
17362 74273 1438 -10544 -68414 -103012 -54588 -29164 -8065 -32049 -136794 -244148 -271806
17351 -271806 -248923 -194082 -182221 -119945 -120304 -39687 64377 61449 -16484 -68621 -110679 -61522
17339 -61522 -30197 15430 -47214 -34002 -9547 35740 13313 -88976 -147554 -185976 -77835
17328 -77835 5598 -74416 -91086 -75521 29923 139230 100722 43422 7356 23609 13154
17317 13154 -7540 -74387 -103309 -81531 -28918 -13948 -1900 18353 77333 -22092 -54626 3988
17305 3988 2996 46419 93966 53319 75525 15112 -3359 4437 -40723 -30825 15932 37711 -33010
17292 -33010 -32437 -53310 -35582 32085 13740 93691 102519 -18015 -29255 35225 35816 -6214
17280 -6214 29679 2266 -63240 -75665 -92581 -112881 -127369 -158398 -89447 -89287 -66126 -3684
17268 -3684 -115062 -219225 -215195 -131976 -114471 -69472 13260 -67715 -37455 4984 77997 70530
17256 70530 27833 -23893 -92632 -52978 22994 49185 47206 4874 9345 38595 535 -30614
17244 -30614 -39949 -17439 -56166 -82135 -71298 -137739 -144162 -78582 36051 197367 230812 273945
17232 273945 237925 146969 92371 97497 163472 210223 126636 80592 69194 43343 24755 50273
17220 50273 17135 -71664 -134346 -84277 -48845 38978 -36147 -122554 -91833 -64528 -99538 -93772
17208 -93772 -81712 -64368 -46710 -161052 -247945 -201826 -125314 -106632 -5884 -20397 -47341
17197 -47341 -66481 13901 -7069 -23639 21410 120444 149507 84055 -34237 -187586 -251135
17186 -251135 -179069 -162658 -125040 -140922 -83594 -23314 -88899 -112769 -77854 -15335 -66348
17175 -66348 -79698 -27540 -79090 -4070 15075 56237 81082 18493 9429 -13540 6461 3732
17163 3732 396 7374 -2313 -84502 -97601 -81069 -36627 20089 25229 6821 -30788 -86910 -76292
17150 -76292 26610 50508 6082 -25150 -80513 -116973 -109763 -124669 -116401 -107357 -102648 -63112
17138 -63112 -117956 -115691 -111042 -153055 -121088 -105167 -22826 -5294 -41440 -38664 -16870 -69598
17126 -69598 -85610 46196 65985 96693 107543 20790 -15446 16862 54215 26595 10370
17115 10370 25137 -20823 -18149 10358 19150 38442 -91155 -78505 -106024 -136911 -12466 83384
17103 83384 19130 -21354 2326 23042 -10231 -28010 34480 67779 4788 35119 -958 -67158
17091 -67158 -46346 -740 -26174 1719 -44484 -72690 -159888 -216512 -222051 -191688 -132391 -67387
17079 -67387 1139 52147 136548 245805 185965 120137 91407 110843 99605 150193 135513
17068 135513 51311 -61949 21001 120560 60711 4076 2929 35486 71167 -12486 -120095
17057 -120095 -79316 9831 -14884 -72586 -139854 -153450 -103236 -79829 -78251 -27419 27229 77594
17045 77594 117102 83419 81343 56845 26694 20667 -17522 -81648 -67620 -113388 -118672 -70775
17033 -70775 -2295 33450 70797 47080 77394 58204 13429 -42285 -51212 -36738 4275 48864
17021 48864 -63777 -129204 -111275 -43690 -39435 -72013 -61902 -63148 22545 87424 26867 -67544
17009 -67544 -21788 20773 79286 49424 75404 125597 117840 46931 -37545 -100947 -62159 -89467
16997 -89467 -192736 -109239 -53690 -50666 -88417 -126723 -81537 -2969 -12903 22533 13642 -2341
16985 -2341 26596 32840 11446 60662 91338 62132 -145 -38913 -40101 -35029 -66946 -84151
16973 -84151 -104849 -18248 -29083 -10330 16999 -13807 -26095 -46053 -135868 -141646 -162200 -115564
16961 -115564 -98633 -11573 47242 -10553 -156 21441 -44849 -96420 26223 60941 45500
16950 45500 95990 127522 -2471 -86565 33290 50254 41663 38529 10161 4503 -4304 -50387
16938 -50387 -31156 44517 87336 110021 45920 -40605 -8126 35759 96632 117589 95333 -33736
16926 -33736 -26748 53092 73171 -29784 -88250 -76602 -65112 -148111 -192155 -155622 -36765
16915 -36765 -18693 -8939 -88330 -134907 -116476 -46423 -10438 8994 -51947 -169237 -117385 -52978
16903 -52978 -47017 -55215 8217 109916 61238 -20151 20970 41731 138037 117365 20902 15071
16891 15071 41721 31388 34427 -2528 23626 40871 13583 -29218 -5671 -22158 20807 -31317
16879 -31317 -25169 8706 75868 124468 66545 20915 -9466 -67862 -65864 -47437 -11404 47392
16867 47392 9419 -3058 22622 -57039 -30214 12967 67615 28217 -15050 -28606 -74004 -4252
16855 -4252 -10174 -72412 -56821 -56456 -31684 11800 -8199 37367 11184 218 -26474 -60504
16843 -60504 4304 19070 19661 4101 29524 12351 -4560 15552 52379 15112 3956 50033
16831 50033 111515 196314 211046 124457 168213 166498 161060 109208 102439 32508 58084 62367
16819 62367 -24036 -31344 -76251 -61031 64166 82645 62326 -21793 4544 -49158 -124159 -70007
16807 -70007 -11650 -13403 -55900 -22213 -78657 -97645 -77926 36443 86557 69536 13424 63356
16795 63356 32576 9082 73047 24107 -48491 -85788 -30676 27936 60484 74999 62524 52367
16783 52367 70693 32587 45024 19411 -74 25940 72891 42090 20127 -36940 15258 62728
16771 62728 61570 55242 52965 -15712 -4230 66799 89973 38367 66411 47459 -8476 -33926
16759 -33926 26433 65286 18027 20231 13170 49661 -176 -43812 -79704 -67685 -62062 -50879
16747 -50879 -53597 -84530 -47701 -56901 -65832 -87785 -103741 -124923 -165410 -123889 4186 19427
16735 19427 -49221 -50310 -76964 -54683 18490 -105645 -154574 -123922 -102297 -94882 -129418 -175289
16723 -175289 -132780 -79385 -75229 35991 14411 -43334 -52916 -53073 41617 113747 12357 -80303
16711 -80303 -63241 -47215 -93721 -102486 -28875 -8751 -33081 -49173 -2032 -76293 -87295 -57839
16699 -57839 5584 41232 -30834 -116032 -107521 -55671 -5099 35478 -34066 -46631 -31018 -60435
16687 -60435 -70323 28265 -5939 -17574 -36060 22221 940 -44179 -86023 -140437 -125730 -122490
16675 -122490 -68430 -35068 -6974 -63784 -112278 -4596 63998 66766 25566 4165 26525
16664 26525 -72020 -134122 -138731 -107172 5771 -1239 -3052 -123827 -140352 -51627 33811 80191
16652 80191 115843 33286 3397 83820 46725 78713 50105 18960 -5614 -4928 -4851 -53746 -9070
16639 -9070 48236 4297 -67713 -85319 -62843 -88142 -125960 -109481 -107215 -110611 -32430 -90024
16627 -90024 -68420 -17970 30262 47469 34593 -61065 -107508 -52244 -13279 -33503 -26819 33437
16615 33437 -3124 -9082 -13874 -12287 41821 87305 123829 37293 73517 31413 44044 53944
16603 53944 10998 37970 66553 108000 49063 23151 -16027 -120351 -84122 -66871 -89581
16592 -89581 -89588 -11185 42671 37415 27553 36302 79582 74104 6731 -37055 -30148 21076 64236
16579 64236 41978 62036 51932 -39486 -37796 -27288 -30193 -68024 -65359 -99834 -173850 -75864
16567 -75864 58852 88441 105438 49910 -24910 -152130 -236720 -145329 -48406 -55928 -62076 -19389
16555 -19389 34936 61452 73355 -382 -81472 -47178 -13056 -13619 -19913 -75545 -67549 8666
16543 8666 20231 14162 -85086 -97580 26816 80658 62570 -26467 -39508 -27431 -58935 -65085
16531 -65085 -136312 -112323 -143201 -194885 -115976 -78252 -121181 -133609 -161574 -171955 -100910 -96919
16519 -96919 -131729 -91676 -211513 -151452 -20172 -32133 -35694 -29874 4610 22470 -22925 -14860
16507 -14860 4782 -21195 -63435 47628 42833 28843 -26299 -48447 -48315 -29363 16702 22069
16495 22069 -10639 -9533 22244 46212 -13449 -81428 -36837 -13196 -47663 -89379 -93343 -140544
16483 -140544 -119033 -98715 -35860 -81644 -50741 -65488 -11655 44810 27519 -39591 -3643
16472 -3643 104141 105509 209978 285801 193741 114253 51615 -41050 -19272 52645 102936 54085
16460 54085 -92298 -115073 -17301 -5367 -32386 16158 36785 -45664 -92256 -19091 -9746 28265
16448 28265 -1049 5747 69349 58681 -43921 -182268 -224813 -118268 -38540 12835 -2166
16437 -2166 -41208 -43751 -51047 -4100 36962 72196 3832 -54331 19480 14609 5751 21008 81504
16424 81504 21450 29804 46458 32723 57673 145432 125186 66038 -37645 -60331 -7802 33402
16412 33402 -22345 1283 97064 15557 -91282 -156800 -114455 -29094 -20540 -50067 -27640 -103129
16400 -103129 -62225 33116 122669 112176 52726 -14597 -18498 -18775 -27822 -49030 -47356 6192
16388 6192 8963 -38200 29597 -6232 44605 11217 -24583 4049 -42546 -51262 -74459 -65019
16376 -65019 -53650 -17546 19461 -95498 -189248 -79594 -49947 -65889 -64472 -74339 -144064 -43675
16364 -43675 60680 98664 86783 9696 -97211 -64392 68184 110775 57566 885 35877
16353 35877 -18105 -20711 25251 21118 74701 37310 74149 62652 -56137 -122874 -146633 -67130
16341 -67130 -72870 -34203 -6026 7473 44019 -15712 -119979 -158524 -116875 -119020 -56334 -20547
16329 -20547 42457 9118 29047 -76956 -131660 17701 50952 50872 84315 46088 35422 29281
16317 29281 -21363 -136846 -211823 -156701 4206 94149 16141 -73344 -67993 -61315 -85819 -91385
16305 -91385 -32868 45203 72828 115117 43220 -110873 -172354 -175084 -128296 -48686 4958 -33637
16293 -33637 -77423 -82752 11789 54627 73570 -20205 -51597 49835 40733 -61084 -113807 -115193
16281 -115193 -82789 -29210 -12452 901 72185 28160 -46122 333 25376 36021 52687
16270 52687 48073 -29197 -56399 -141441 -137255 -121761 -88741 -102225 -101806 -59866 -22603 5343
16258 5343 -75567 -176810 -86085 15171 52602 25459 -69638 -155414 -192739 -216953 -184452
16247 -184452 -133442 -37993 -17936 -52121 -82481 -94082 -82675 34847 49658 95384 94808 79012
16235 79012 129442 105164 47795 112544 157514 147871 119272 74892 98450 74467 -10064 56390
16223 56390 -1603 -43121 15450 29013 -9264 -21005 -38216 -68746 -55528 -30125 -70381 -66585
16211 -66585 -60935 -27494 30920 -24008 -3531 24114 -34724 -114976 -104237 -106165 -149988 -149833
16199 -149833 -101658 -61126 -88058 -123021 -106264 -69246 -42147 -5524 -5860 -24487 10080 4340
16187 4340 -80139 -109373 -95965 -98820 -127945 -97707 -56714 -23426 -23672 -34464 -23973 1940
16175 1940 -28871 -100908 -109665 -48698 -26765 -45510 -17211 65376 60463 28787 59572 83738
16163 83738 -93379 -150091 -129781 -100640 -133024 -127205 -64350 -8089 5667 100286 143332 120603
16151 120603 -676 12331 26888 97629 130324 130976 151585 83943 39293 -35848 -44093 -89128
16139 -89128 -3198 8516 520 -3545 -8771 11377 66885 141801 231777 181285 111141 51038
16127 51038 14463 47225 65373 56393 93015 85654 30160 26359 16311 89716 120964 88649
16115 88649 -42922 -159044 -145711 -115734 -106855 -84571 -48717 -77955 -212727 -113390 -40114
16104 -40114 -36083 25291 50687 19459 -137655 -217106 -193320 -73645 -23851 -97206 -133934
16093 -133934 -81171 -130854 -118832 -132027 -121476 -82211 -139085 -137497 -122238 -49212 77337
16082 77337 41274 -85325 -41555 -47941 17247 46041 -15758 -47744 -50084 -22652 42893 128863
16070 128863 36201 -155922 -241356 -249051 -193902 -143177 -98946 -91346 16545 52994 27241
16059 27241 13372 -94040 -139444 -11656 51156 -11337 -30206 -17698 -137309 -152978 -130110
16048 -130110 -80282 -70754 -51677 -16736 -12290 -43074 59692 117833 -36313 -20582 82101
16037 82101 111766 103408 -30181 -69846 -151910 -178597 -144803 -107195 -84296 -44593 40206 109114
16025 109114 66680 -8698 -7627 -46267 -49140 -23020 17182 1451 -52182 -75669 -44180 -54988
16013 -54988 14424 131566 210415 288638 188949 -8273 -69472 -48575 -26167 2868 -62648
16002 -62648 -80306 18010 23 18304 46071 -21397 -8567 2016 37511 -19592 -1460 42549
15990 42549 85644 83000 110328 67621 40005 13301 11862 -23269 -56943 143 49186 58394
15978 58394 -22611 -15485 2574 -2812 72960 85466 66373 80327 37761 37962 89443 173688
15966 173688 125416 114823 14518 25899 21273 49749 4932 -120377 -105211 -50457 -20060
15955 -20060 -27621 -44815 -52055 -64808 -77253 -95867 -163018 -115300 -163675 -115683 -142187 -126004
15943 -126004 -126586 -109755 -45843 -46497 -44471 -11218 -15191 -90799 -133815 -157217 -254295 -221610 -86128
15930 -86128 -51741 20443 73465 18040 -62226 -50786 -66956 -74765 -68626 4027 -12401 -29042
15918 -29042 37050 63187 76929 67772 57094 73703 42778 -23539 22085 23356 -12126 -2526
15906 -2526 -20873 58882 90916 54520 76717 5493 -11493 -20875 36524 143792 161566 85565
15894 85565 93862 5591 -67503 -58412 -45325 -50064 -10154 16345 -59467 -23698 -41963 -60796
15882 -60796 -45560 24101 -5957 20926 54637 133054 85770 -56580 -76887 -71077 -23121 -34555
15870 -34555 17597 21766 -41123 1599 14581 49807 81776 129133 88890 60412 138257 105739
15858 105739 1774 -458 -53187 -56789 43704 38662 -35668 -14471 -32839 10125 -28809 -60991
15846 -60991 -24501 22982 41185 107047 113948 86237 83118 113066 151785 120177 93436 40538
15834 40538 -34619 16158 22899 -23280 -27826 -81338 -30809 -17012 -48831 -101967 -141397 -1460
15822 -1460 36570 59497 33397 45872 19664 31121 -65295 -74066 44373 30684 -39489 -94338
15810 -94338 -134959 -120702 -80973 10984 63505 67729 14976 45927 136356 108664 63318 42833
15798 42833 9497 -16501 -1557 -56190 -6844 930 -85274 -104107 -129119 -119388 -50169 -42000
15786 -42000 -6169 -21037 -65211 -60375 -43254 43357 178235 269578 277427 230229 93859 19310
15774 19310 9397 -28175 -66581 8117 34218 23343 -53415 -7480 4714 13936 -3601 6637
15762 6637 126196 248087 228034 204188 185617 124201 29565 -66950 -72684 3661 53649 67867
15750 67867 49832 14599 -17829 -117531 -98155 42560 41286 10885 -25739 -6119 -10685 57152
15738 57152 96201 119788 94198 54164 2343 -70262 -35371 63064 39412 -6262 -6748 -36687
15726 -36687 -102023 -48194 26006 -15433 -12054 58689 128051 140706 168050 135910 77855 50801
15714 50801 -21032 25973 639 -75097 -7542 -13371 -38594 51080 61301 20908 -23313 -11295
15702 -11295 13972 69384 67257 152342 104737 79335 38443 10678 56549 582 -43455 -76058
15690 -76058 -98496 -46894 -77173 -100126 -83074 -44265 -27550 -31207 -95607 -5793 82697 26394
15678 26394 -12070 -1619 3703 -838 -69186 -74134 -46664 -37649 16387 76522 68507 -51647
15666 -51647 -91343 -36481 -50979 -80813 6134 112557 18508 -17336 18055 2176 -90127
15655 -90127 -36379 -81816 -143144 -107285 -70281 -3475 -50549 -43453 -75793 -82472 -40310 -100514
15643 -100514 -95896 24715 32831 -7258 82708 86795 -26927 -105906 -125261 -54550 -10773 -51225
15631 -51225 -24561 13043 -33285 -3412 76854 51008 586 -138076 -156719 -80313 -119688
15620 -119688 -119789 -127351 -59100 -17461 -457 7017 71800 110207 111496 73993 59041 6214
15608 6214 -9859 71644 147500 132506 60660 35900 97446 112159 115872 83732 103644 145315
15596 145315 150408 117614 140980 136632 25048 53531 115450 88892 11427 71377 149193 116388
15584 116388 103048 29596 -69437 -9534 81874 57927 8112 34183 62427 20162 3658
15573 3658 -31112 -28574 -8519 -46123 -16711 22645 5345 59395 87339 -25828 -67300 -84063
15561 -84063 -51889 -53498 -145610 -110594 -41240 -11697 71696 69141 54903 43981 64127 116296
15549 116296 69364 87931 94743 108567 103939 67561 19184 80181 111560 81797 89301 82118
15537 82118 360 -16020 12065 2671 -62389 -102743 -56558 -89408 -22766 111728 120973 -10086
15525 -10086 -35107 60090 42815 46380 46223 39789 26533 27639 -85790 -117351 -37432 7830
15513 7830 -7221 50744 7256 -6623 -7164 -47527 -54409 30613 112398 159391 166644 195565 129917
15500 129917 148347 202869 176771 152714 98964 11662 -2736 38851 26260 -33321 -26105 -86266
15488 -86266 -71687 14787 118310 148096 121732 -27783 -66743 -77860 -167073 -191438 -186116
15477 -186116 -142240 -129915 -139919 -84046 -112349 -30237 -22411 -12211 12415 -19431 -31900 -70176
15465 -70176 -78167 -44878 -99832 -73570 -1677 -7102 -16204 -32106 -65154 -71718 -86749 -78580 -30462
15452 -30462 -7534 30310 56971 68744 38895 12833 -19238 -60856 -118878 -179577 -137069 -34184
15440 -34184 222 -11961 88322 128809 121744 72487 20074 3542 -22769 41473 40752 53508
15428 53508 46195 38221 41093 31215 -16993 -25949 11529 12168 -34561 -55094 -118866 -97878 -63441
15415 -63441 57237 33824 21476 55411 96359 64276 18644 -12667 -60787 -67447 -73717 -50587
15403 -50587 -3742 57595 90854 103622 44402 13464 5262 -24917 -2591 43384 51385 -11402
15391 -11402 -57391 34383 90691 146961 130598 90671 25166 -6238 -36081 -33251 -68286 -109545
15379 -109545 -107811 18093 23237 67599 87486 120648 130222 58026 -13407 -49611 -186032 -167950
15367 -167950 -65942 -12814 -4652 -37432 -39804 -93477 -140851 -101980 -19932 12544 20290 90233
15355 90233 175440 109798 121006 153109 161382 171229 244184 231722 192035 131064 111063 55804
15343 55804 -9531 -38547 -54747 -94948 -94883 -114387 -91666 -79696 -93837 -127621 -36981 -7423
15331 -7423 2605 -19232 -63144 -28245 -3565 19199 45213 31356 20388 58337 -4280 50407
15319 50407 115602 63766 64053 -30223 -21787 -15818 16224 78285 41007 -91660 -121755 -144388
15307 -144388 -153422 -174817 -159696 -75551 42399 54096 -39377 -155275 -192087 -112254 -19886
15296 -19886 -40847 -81024 -6052 -16247 -94094 -39361 -11321 -107183 -61598 10849 39989 65215
15284 65215 129973 190284 159504 80964 -70009 -71367 36710 109924 76444 89406 28240
15273 28240 4573 -19226 -80931 -34888 25169 -13240 7862 50532 56775 29563 77783 -9773
15261 -9773 -114731 -142723 -142767 -57543 40193 30212 55747 115546 108498 169968 195399 118636 49605
15248 49605 36120 -2248 20076 -148 41037 48993 88470 -13964 -82647 -97934 -9483 83122
15236 83122 28984 -55005 -95793 -130931 -71637 11312 -26729 -11567 -56916 -172833 -196670
15225 -196670 -156269 -83970 -22679 41244 47768 30950 7599 4226 1720 -18764 -33029 -66659
15213 -66659 -46077 -25124 -38131 82480 162199 145721 69636 12127 -3524 21518 -54598
15202 -54598 -101776 -200454 -138681 -109181 -129330 -180762 -156308 -55610 -22636 35843 44937 11052
15190 11052 -37890 -79585 -7745 -21281 -117923 -121250 -34613 -64236 -30337 -72028 -53778 -30584
15178 -30584 -68589 -20253 3019 -44079 8838 106140 134959 66656 -21549 -29671 -30464 -37694
15166 -37694 -47235 34769 12063 73309 104531 21560 17489 41790 28787 -60399 -72606 -40185
15154 -40185 8212 -28916 -15784 65307 107603 89342 73222 67542 13857 -79826 -60918 -11457
15142 -11457 -114739 -186165 -96278 -143402 -177040 -132443 -122439 -118040 -36067 -7147 88883 5021
15130 5021 7586 64555 201730 237060 152869 131560 169588 116199 130151 38101 32221 61068
15118 61068 50558 28106 -37377 -106252 -73884 113547 212236 164632 107492 -17546 -41080
15107 -41080 -35327 -10282 59782 130518 147948 131471 13302 -35700 -12628 50325 54882 11875
15095 11875 20848 87756 180923 168934 129662 53353 53612 54368 -5325 -28461 85714 159080
15083 159080 149524 135221 132895 48400 53512 119720 105050 61016 -50612 -43722 -18987 -4504
15071 -4504 78379 100138 153821 93241 9326 -12255 72491 116730 81263 65919 -4530 12819
15059 12819 89398 -13615 -66928 -71578 19811 -7007 -67461 20924 70008 80359 126261 73011
15047 73011 90143 34 -123347 -166618 -95962 -63629 -38167 6830 -26762 -113442 -86068
15036 -86068 -97462 -74567 -11399 41803 14249 27132 87844 71191 47554 103395 109196 77985
15024 77985 49286 13218 -54861 -31235 45473 57471 51482 90121 156962 89597 -21695 -61054
15012 -61054 -91977 -129274 -98765 -40128 15705 2097 -6993 41507 58146 60577 61583 61843 48380
14999 48380 19736 54390 88071 79258 113009 24610 -26200 -33189 26249 86243 34942 60247
14987 60247 101916 203877 256175 203790 182902 261128 292137 282672 159144 121090 53898
14976 53898 -12695 -8553 33993 6431 -41629 12260 58773 -12697 -72867 -46689 -22497 -66945
14964 -66945 -12877 67254 164452 151274 123771 118702 115613 147130 132903 65969 -29447 4467
14952 4467 40915 61989 94689 -1475 -51585 -36220 -2934 77784 81729 11422 -84626 -98069
14940 -98069 -31780 687 92631 180912 172128 240596 221042 175180 166773 197758 124497 -8425
14928 -8425 -83529 27838 37626 -36217 -37953 23796 52866 -27856 -45348 18335 -50726 -71102
14916 -71102 -30168 3712 14944 -1756 34644 55011 53588 -16147 44939 31080 -27348 -16867
14904 -16867 422 39765 37434 9578 729 38043 89958 139540 180240 190737 239562 212806
14892 212806 39607 -7325 -12729 55427 124792 128199 131585 78710 19592 71037 70540 -35219
14880 -35219 -20357 -20750 25391 63836 26188 -36831 -74495 -96341 -81226 -61343 -73630 -75676
14868 -75676 30000 -32004 -66156 35221 59980 88092 50256 -13415 -20564 8271 50213
14857 50213 65889 55747 27185 -42957 -47832 -16849 -28809 -103354 -155485 -124245 -96424 -16854
14845 -16854 -50506 -4250 40766 39144 -30650 13488 91894 23223 -59694 -25438 -4296 56570
14833 56570 82899 74738 121219 23887 -5189 40656 85085 76302 108571 114463 44215 -38061
14821 -38061 -55241 -83801 -59881 -37398 -4188 35042 62422 67716 11131 -56368 -85295 -65329
14809 -65329 -68206 7024 104554 44655 15898 -32161 -87228 -10416 92243 104180 37389 -40415
14797 -40415 -52789 48664 74685 6207 -34855 -33692 -12271 -10040 -32591 -31798 9339 -25888
14785 -25888 -37670 -51700 9493 110408 114562 27652 1153 8864 39160 86249 91863 -19356
14773 -19356 -42900 -11689 76896 113908 97109 81405 68267 75341 65523 35994 -77701 3560
14761 3560 54270 60750 123778 69233 63068 42008 4005 67589 82290 139545 119369 68590
14749 68590 7050 -5382 -40972 -33767 18446 20619 -1577 -67743 -64234 561 -750 -86532
14737 -86532 -107146 -100727 -87044 -80045 -51488 -95721 -8395 28308 -129421 -171581 -47885 -16588
14725 -16588 -32131 -89723 -76763 -52006 -29199 41567 14171 20775 17438 -62398 -63162 -56916 -74509
14712 -74509 -115157 -46517 50011 103449 78002 87149 1002 -44079 -97466 -130429 12193 72158
14700 72158 86819 64910 -11740 -3370 97636 36940 -64747 -68201 -42644 -15291 67086 46222
14688 46222 -2791 25347 52040 -9343 -13705 -6198 -45532 621 50914 43715 -5375 16222
14676 16222 25931 4789 -34563 -18454 106812 95525 133107 134589 108315 80577 47995 47156
14664 47156 5162 56003 -10258 -69217 -25478 11670 19983 6316 49314 135568 58856 -103209
14652 -103209 -168258 -160262 -153843 -83827 -134646 -59688 38493 36802 -8032 -69353 -67936 -21972
14640 -21972 -17316 -47791 -58648 -10130 -13997 -3780 82485 159699 90347 69521 73581 20562
14628 20562 -36701 -54599 -109954 -51686 18145 -51905 -108139 -61599 -12648 32677 12019 -23357
14616 -23357 -43819 27247 18437 -25007 55146 64989 10693 -4496 3119 61284 125976 143819
14604 143819 163014 96676 -25071 -125769 -99051 18285 68864 57969 -42355 -187006
14594 -187006 -201113 -104122 -59729 -44140 -24011 24011 28942 85822 115220 63687 -71173
14583 -71173 -159127 -106577 -39981 40675 59325 101740 92884 83778 90720 94636 57946 7799
14571 7799 -64010 -106517 -67833 -19557 -94925 -107594 -72228 -109209 -127337 -12110 82438 123652
14559 123652 135735 91459 106157 83522 1569 39025 54315 108565 112835 44372 36382 -22996
14547 -22996 -96033 -889 148405 242518 187137 163258 170627 143733 57145 20448 -17605 -45790
14535 -45790 -55146 -2185 -56854 -84867 -23136 -26572 31436 -306 15065 -32239 -57115 -112321
14523 -112321 -128761 -131110 -93159 -126501 -111478 -97709 -26413 -30027 -12252 -9354 -16304 76825
14511 76825 84312 718 -39240 -2925 -23832 21248 44835 72600 83830 133067 163612 145511
14499 145511 141108 71911 22354 128738 133592 117174 35735 -32769 18186 88931 165704 182701
14487 182701 158006 134520 110151 18368 -105104 -130553 -102179 -908 -48401 -86942 -140997
14476 -140997 -123780 -75484 -78960 -49889 -107587 -61059 943 131052 144622 102370 105383 132332
14464 132332 101595 85496 79526 35495 33699 58905 100214 113636 21635 8305 17285 -30014
14452 -30014 -109329 5160 37555 -79389 -48169 17487 56916 86094 61554 91884 12686
14441 12686 -117160 -96341 -66836 -78297 -165964 -146164 -53589 -36467 -106075 -164381 -119623
14430 -119623 -54760 -10929 15124 -41263 -70152 -120335 -91531 -17655 11233 -28846 13665
14419 13665 57187 48936 61314 129827 154854 123130 35287 46120 124501 29636 -91135 -199391
14407 -199391 -185494 -161887 -123114 -41626 -15515 -45549 21302 101333 177600 195660 184766
14396 184766 180252 179797 162055 97115 53168 20622 31633 60866 -6560 -40782 -68095 -91475
14384 -91475 -36558 -10700 -13043 -10651 16782 -22107 -47733 -60130 -83266 -109399 -112777 -16700
14372 -16700 -3346 -15232 -21311 52225 61938 -14413 -12116 30737 -3293 3791 15578 -23558
14360 -23558 -43073 36620 201642 159362 60589 -28465 -13873 -16971 -47148 -9458 -45646 -95659
14348 -95659 -110873 -111339 -122115 -96341 -85104 -33260 30772 119856 111696 45125 87187 164864
14336 164864 159590 57211 18331 73774 53187 791 -51649 -112219 -65241 -84378 -40828
14325 -40828 -51523 -60142 -74287 -50123 -14352 31451 72082 30055 48620 74110 79923 144788
14313 144788 220662 160073 78902 78614 74288 82746 36673 -2500 -41150 17911 78765 111184
14301 111184 141696 140681 95350 31105 9163 37604 69025 70368 106166 103694 76505 12541
14289 12541 -84848 -134308 -112063 -105944 -89010 -52162 20048 -15398 -24475 -17 51963 100058
14277 100058 58479 26703 28164 93983 -10284 -124772 -98401 40338 41376 36833 49882
14266 49882 84015 92584 93670 131834 82456 -62993 -70307 -30021 5951 9487 41651 1291
14254 1291 -63775 51605 51818 -60089 -96762 -42817 -2972 -47816 538 -21194 41899 70907
14242 70907 134266 117959 156388 88689 -13658 48437 118399 131152 -15635 -109518 -123001
14231 -123001 -164941 -108472 -56958 -99614 -52591 17222 -5696 -40139 895 26348 -3013
14220 -3013 -10161 -97359 -85830 -40586 8120 -1395 40621 80117 120825 84352 58570 30639
14208 30639 34007 88746 73799 105626 187302 196452 104213 78508 44320 41715 -23329 3584
14196 3584 95668 88473 85107 89717 108360 115915 65331 50549 137604 124840 87329 47171 13055
14183 13055 -33506 -79519 -92168 -120525 -122580 -36629 51332 25969 -44964 -114809 -76934 -41316
14171 -41316 -39010 -19360 -42980 33717 64187 103744 77479 -29445 62208 90515 53300 61624
14159 61624 119745 79283 52969 97786 133862 110463 33052 22794 27869 -1789 40042 5033
14147 5033 15485 15312 27132 29106 -52099 -71498 -34623 -16567 -3897 -23546 -103093 -75937
14135 -75937 42580 118808 163154 28171 26850 -102992 -160899 -121985 -89090 -64004 -38107
14124 -38107 83443 41722 9107 -10553 -35632 -98240 -69091 -13945 -69456 -37540 -4189
14113 -4189 -34829 51333 176556 190182 129813 64367 -27757 -72749 -46984 45678 25102 -333
14101 -333 -53697 -112657 -53670 14405 -9494 -10528 26474 20099 74442 30944 -2763 22647
14089 22647 -9696 -42558 -40546 16435 5107 -128141 -34749 61604 73110 65517 90775 26077
14077 26077 -28639 -108458 -171538 -112743 -87190 -108592 -153253 -134714 -125532 -129209 -83167 -100329
14065 -100329 -119888 -107783 -60530 -7851 71007 68877 76595 45585 84830 142302 104709 114650
14053 114650 31102 -74494 -60079 -61434 -28663 -46175 -70577 -110708 -49715 -41459 -107645 -76506
14041 -76506 -32569 -74695 -31402 -34228 9822 76805 14175 -12590 -28051 28160 79303 77080
14029 77080 62132 102572 86972 48180 21651 48788 51157 49011 74995 126151 64365 -10853
14017 -10853 -73291 17036 30304 -21754 42702 70398 40424 -15841 43217 68832 16718 18373
14005 18373 51606 53673 57412 -38054 -78959 -59738 -105055 -70895 7001 76316 103404 25997
13993 25997 -96836 -55402 15789 -40214 -71219 -61402 -34944 70434 40107 40926 24057 -10958
13981 -10958 -74639 -72190 -1754 3739 -18632 -17847 68654 144744 110467 34649 -13271 24520
13969 24520 814 6323 66655 28577 -3066 -16395 -35508 39263 52182 -32017 -56380 -29589
13957 -29589 18142 85026 124234 50226 35595 20120 46622 -20723 -35224 9795 9298 -12329
13945 -12329 -21283 -45620 8969 52795 78250 50185 76225 121504 159369 152837 141224 130195
13933 130195 129357 100469 71509 37864 34499 17721 -38160 -35648 -80039 -39080 29369 49101
13921 49101 7799 -40588 -35196 -97431 -27734 4475 24865 18403 -1824 22825 18750 -22174
13909 -22174 3874 -33267 -41280 -31074 74492 113595 55330 -10179 6177 58288 92241 55637
13897 55637 33325 71772 181581 182448 205869 208567 144219 85620 84163 61156 23875 31018
13885 31018 60284 45382 75154 108762 45210 -21096 -106058 -66361 -106027 -135609 -60895 -63791
13873 -63791 -99355 5743 88921 75869 98891 114996 102880 96930 -26248 17443 16945 31466
13861 31466 239 4122 -38229 -12992 -13405 27605 81316 95157 127351 112330 100535 -12216
13849 -12216 -24439 79 -18132 35127 -2301 -14167 10453 -34707 -26951 -22384 3309 98219
13837 98219 144447 176650 226440 87702 12055 100191 213211 211416 139873 65793 29532
13826 29532 -35257 5401 -15644 -66135 -16632 68503 70303 31869 13926 -6447 -1186 -11094
13814 -11094 -36078 -24285 -12170 -18030 -52721 -59478 -59709 -49845 68433 85344 72511 101817
13802 101817 74184 35354 90405 79538 -26342 -115697 -71136 2731 15932 20062 -14797
13791 -14797 24935 -13720 -26769 18576 73490 24323 35573 65904 42072 33909 8687 24508
13779 24508 31173 36373 -13181 -8673 -16063 -76372 -104558 -109196 -83621 -87330 -10909 -47648 -68537
13766 -68537 -34995 11508 -24834 -4596 59751 76279 95471 158950 146530 69033 69480 121769
13754 121769 55300 3005 33555 102689 61816 -8494 30494 -33330 -54419 -28860 -56135
13743 -56135 -59479 -46489 -39427 55938 98042 76308 831 -49403 -214 68096 93608 120968
13731 120968 85520 34145 18506 37227 13931 41288 15940 -35462 -67724 -95513 -69180
13720 -69180 -55204 20085 45036 41362 45353 31789 -107432 -175480 -217998 -180920 -68179 32026
13708 32026 -8652 -54992 -31339 79313 174283 194787 129552 42740 -11478 -16702 -5622 30103
13696 30103 14937 77603 135711 70931 18801 -77153 -63555 -84859 -31810 120732 66407
13685 66407 71286 80825 14275 -2352 -4912 88914 142545 113728 70836 91994 7504 -23081
13673 -23081 -30555 -27768 -100661 -77670 -16753 36450 -34480 -89702 -98922 -74348 26760 51007
13661 51007 78364 86680 37469 22053 57922 8435 62013 26943 -58077 -60161 -78050 -111641
13649 -111641 -196957 -155687 32162 83802 77015 44563 52998 27990 22177 77370 195620 224995
13637 224995 100194 16561 5330 -5119 65502 41279 223268 247450 191271 106308 46830
13626 46830 65044 82920 -12578 -122899 -86349 -51251 29678 69246 73510 18695 -29476 -106345
13614 -106345 -32725 21438 31488 53729 22643 96463 162317 177405 103502 -12598 -114155
13603 -114155 -147785 -131356 -48425 -10704 68265 65265 55048 96618 149084 164944 27462
13592 27462 -16936 3606 30930 104672 83625 11162 -16675 35571 129266 194092 185739 72784
13580 72784 78743 127671 114077 132720 111309 105205 100195 111845 116074 145477 149470 84678 37212
13567 37212 62809 102804 149416 112545 69848 72339 67906 9816 8493 78261 128181 167389
13555 167389 53692 26845 107806 127038 78507 -38800 -6258 43277 16166 50012 46982
13544 46982 103400 106556 44590 5390 15294 12500 23812 3283 4897 53250 48365 17525 -5100
13531 -5100 -44554 -77591 -194044 -277622 -313637 -245174 -173130 -116484 -92863 -48633 -24071 16303
13519 16303 72669 86561 61998 69361 83833 90771 134760 158525 180807 117429 39824 50309
13507 50309 24392 -26801 6276 -51822 -51453 -4047 41102 -43020 -79795 -33480 10811 5926
13495 5926 17054 57479 40870 54335 50817 75600 54219 6019 -77345 -42599 11109 53159
13483 53159 19128 -36494 -4332 76559 112263 94386 51950 25498 56444 -9830 -54344 -78920
13471 -78920 -30304 -9732 -89254 -106738 -10686 33797 145450 97783 48324 85267 32068
13460 32068 -69906 -63988 -36357 -42256 -3866 21071 -12265 -37717 -33063 -26014 -13951 -5138
13448 -5138 16734 -36797 88338 128769 106545 97777 39237 -83791 -84312 -3917 -4890 -23450
13436 -23450 -15374 40553 11713 13694 33138 100188 158035 103437 -2477 -65364 -122511 -205617
13424 -205617 -149441 -68216 -83809 -216516 -122904 -54481 -93679 -74217 -37746 -20731 -73206
13413 -73206 -91166 -77164 -42133 -796 23055 -1401 -7868 2648 12952 86714 123802 178121
13401 178121 195441 138387 153001 140801 88638 44298 -19841 -79852 24035 113321 187689
13390 187689 194442 142152 98242 129440 161421 137960 175320 81704 -29711 -5605 12815
13379 12815 -922 19538 135137 129741 55183 48232 116144 55845 -89971 -96379 -37123 11133
13367 11133 64095 46840 7937 6573 -23234 -10077 61090 19342 29491 -7206 25118 52444
13355 52444 85047 90304 81 7555 68220 93394 38106 33777 -42388 -142288 -207090 -79934
13343 -79934 55424 108173 25782 46934 140433 187685 97370 114289 162750 127100 66148
13332 66148 79289 11400 4442 42401 75616 59453 22022 -8351 14546 21253 26170 43323
13320 43323 53208 19222 -28404 -41999 -501 -46410 -98449 -97856 679 97122 198261 107486
13308 107486 -12411 -79609 -52132 -46600 -92482 -172466 -202461 -198878 -156686 -91747 -29437 98060
13296 98060 213883 203891 94673 31252 2623 -22836 58470 23188 -42027 -60001 5900
13285 5900 54789 35328 32571 -43180 -117505 -104192 -108410 -128195 -172532 -103961 -72496 42339
13273 42339 58242 -13214 -40835 -2747 -8288 14673 12550 2662 85 6087 25443 -7998 -26048
13260 -26048 -85971 -68730 -23961 28644 -5104 -39351 -74737 -21313 71314 155666 131162 105111
13248 105111 50631 -3810 -43606 -6217 28841 -11304 -32905 2982 -4105 17273 51337 47411
13236 47411 125830 116707 -55920 -69485 -2127 25199 -25522 -208679 -166891 22998 57025
13225 57025 77260 23286 -22275 64837 158979 85725 20506 18415 52477 41141 -24522 -68673
13213 -68673 -125014 -84893 -32808 -10210 -62235 -137796 -83119 42352 -27433 -38663 -100454
13202 -100454 -72720 -90834 -214189 -192975 -160018 -145484 -126882 29438 17772 21588 44399
13191 44399 60566 14085 53750 107578 127484 114149 87162 136831 154982 98046 84938 47870
13179 47870 107805 96598 160985 166117 188151 141504 51054 72422 70911 68739 20384 -80695
13167 -80695 -48441 9721 31875 84380 59296 29621 81261 118842 76230 31481 89621 132523
13155 132523 -62690 -142103 -82151 -78516 -61800 -19287 38395 -14151 16620 139932 198563
13144 198563 122777 46706 -11110 -40071 -83583 -105947 -23442 -50692 1028 -23618 -43250
13133 -43250 18861 77909 65706 -14993 -18034 -9365 -24293 2854 230 111744 160431 137463
13121 137463 62020 31597 52960 50278 -36623 -106230 -140763 -161024 -85030 -12566 33472 22589
13109 22589 26166 85442 148469 105303 55924 -2809 -63363 -95248 -20762 61085 7154 2928
13097 2928 -29287 -67678 -46671 -27787 -64771 -55335 15118 24655 15463 -3414 -27448 -15907
13085 -15907 15260 -38846 -105368 -125399 -105766 -63917 -91718 -77654 14628 -32553 -134279
13074 -134279 -115587 -10544 42136 -1346 -73559 22036 -1309 -83449 -121130 -99152 -63208
13063 -63208 -88525 4532 27579 53194 130497 159159 75238 70937 67137 124619 178966 167274
13051 167274 124840 132734 228980 171494 99876 59384 52841 43 -43416 -23015 28361 -16911
13039 -16911 -66480 -922 21876 -20006 28069 37872 69458 83760 53080 95325 124459 129172
13027 129172 110685 87584 30866 15698 13665 6986 -56434 -42541 5501 -3808 75914 64445
13015 64445 72711 4469 -14637 -1800 14429 17111 73146 118727 47010 17100 81863 139380
13003 139380 43585 -32334 -17150 -40986 -76459 -53393 -37200 -12484 30388 93815 131254
12992 131254 127368 131605 112078 100079 114111 79652 64830 15794 -33487 -49543 -92018 -97023
12980 -97023 -125265 -102903 -1702 -32285 -63127 -1559 142906 136852 94672 7920 22172
12969 22172 111308 119686 155935 162365 144043 75284 66426 73101 116855 108848 -11762 11566
12957 11566 35420 31564 68861 91302 66716 58861 41038 -15406 62447 46111 61413 103801
12945 103801 86326 86903 33782 -19840 -9211 41212 12615 11981 26523 -17761 21570 127611
12933 127611 113679 65734 18056 36936 79317 56237 -53366 -84900 -57685 14919 46523
12922 46523 -11384 -15264 53808 27852 120245 129304 131073 153013 116838 67865 39356 65558
12910 65558 143746 72733 42218 -42513 -72694 -48699 -75714 -50010 -69039 -97739 -69785 -104902
12898 -104902 -85929 -40634 -77197 -91647 -56115 -55975 -67177 -29361 72699 72815 131872 191147
12886 191147 135478 52761 26685 -2336 19868 -43023 -79427 -5884 1490 -2263 -30536 -65295
12874 -65295 -29776 -40307 -32875 27569 59025 100202 108718 47725 21863 105732 79277 128639
12862 128639 176602 108697 75871 96279 143592 132808 91392 2259 -66290 -68101 -79215 -26092
12850 -26092 19509 -57651 -58383 -36901 -17646 -6456 8457 -30558 -35147 -28554 -72900 -70393 -69174
12837 -69174 -160 -25113 -19931 80807 88822 112460 81209 23296 -5626 116927 148725 114457
12825 114457 10731 23753 52324 70867 47179 103481 90396 67129 100711 39189 1990
12814 1990 -51508 -24057 -54075 -46903 -41687 -46961 -36461 -34512 -22202 -66398 -32592 -20383 41046
12801 41046 30666 12965 -36112 -19314 -34535 -67932 -18256 75378 104189 95597 24853 6194
12789 6194 -61340 -107133 -33522 -54804 -51149 25698 101261 45388 -4659 55586 85190 56279
12777 56279 33907 29857 14436 22803 20463 -23801 -77597 -112095 -102105 -62326 -117799 -153716
12765 -153716 -118327 -122019 -78681 -14667 45707 38934 -6414 65474 92211 -4790 7047 96758
12753 96758 49814 12074 81393 191583 226861 166381 87348 96794 47196 -91095 -139879
12742 -139879 18754 76018 42395 10889 -5004 15028 85764 153300 142899 134984 72931
12731 72931 26481 -1751 -22323 -41775 -6514 4012 -17171 -33350 -10706 -26592 -28949 2570
12719 2570 38421 51248 79459 35288 63682 69534 68543 72354 52512 84384 134988 122170 45630
12706 45630 36235 103850 95866 99053 45977 92408 78103 57980 147389 66084 -7417 -7733 -18425
12693 -18425 -10653 874 6634 60074 -23647 -25429 -1123 25630 -3085 -3229 7443 57314 18322
12680 18322 6372 58890 133659 45746 -15713 -93111 -166461 -215396 -184325 -61338 6414
12669 6414 63111 54880 -4376 -61306 -34810 -16268 -15452 13771 56716 -9206 -23354 14908
12657 14908 8719 18075 -27098 -6416 29713 -34871 -62314 -4950 103857 173997 129132 56141
12645 56141 35686 -97780 -176847 -139879 -80661 -17287 28190 43909 74090 84940 -17370
12634 -17370 -66106 -75619 -30953 -7306 2860 -47407 -55611 49060 118892 61732 135836 201035
12622 201035 274640 274570 262971 271943 166134 120098 82112 -46396 -141955 -114485 6703 32877
12610 32877 2325 -20826 18367 42727 35810 -57300 -41287 -17851 -34108 -88078 -70156 33494
12598 33494 83590 78380 162041 262055 263984 215631 166933 166039 174400 89931 5458 -14769
12586 -14769 -73478 -131708 -121372 -94753 -28886 -14819 21826 8683 53637 66665 22799 52761
12574 52761 16050 23511 10242 18873 -82085 7974 100334 65382 81001 19269 7974 44887
12562 44887 -50255 -97841 -92836 -91245 -72003 -43310 -41968 -48720 -1214 -53526 -114734 -35752
12550 -35752 13073 3130 76772 107002 42637 9024 47338 125330 85013 35268 81917 25387
12538 25387 -117644 -102407 -14482 9388 65985 108436 84043 25541 23645 22674 -47362 -69355
12526 -69355 -38792 32638 37765 -62590 -91825 -96968 -159649 -178392 -201452 -137761 -9945 33797
12514 33797 56118 35191 16049 -25492 -152441 -161997 -81030 -73260 -82787 -73288 -71165 -113838
12502 -113838 -87171 -69475 -55274 -74817 -55533 -29562 1790 8809 6431 -34715 -68165 -23505
12490 -23505 -51173 -51239 -29204 46119 54488 39728 12515 74295 44333 2503 22381 -13087
12478 -13087 17912 5032 -23520 -40233 -88951 -133277 -83653 28102 94967 85685 110149 75799
12466 75799 117450 59493 1976 -29618 -56675 -19981 51413 106806 47697 44637 42900 38227
12454 38227 50688 83440 -14645 -105117 -143969 -157798 -113318 -33287 23286 -21062 -50967 -32664
12442 -32664 -5811 51344 27738 -8938 56874 39335 -1235 -58175 -132586 -144814 -72444 -10988
12430 -10988 36549 40190 -32503 -24455 10405 42909 54645 45255 14270 -16826 25723 -4438
12418 -4438 30258 22317 27683 93126 69596 65802 107685 118044 190091 171589 60084 -17527
12406 -17527 -67106 -90900 -67021 16827 92028 56593 72189 60991 69407 123865 205717 143383
12394 143383 82882 50592 4016 30165 45490 44456 53659 70469 30119 3160 18066 47195
12382 47195 -31818 -15334 569 -31900 -12129 -1735 13920 -12887 21294 4158 -17179 34131
12370 34131 81320 -7764 -51203 51576 124563 108522 19712 3502 12128 27066 -29784 3830
12358 3830 74703 17934 19914 24466 -8911 27680 68803 88093 50252 69523 95737 155556
12346 155556 112501 98639 57210 14168 -57280 -51320 -46842 -93236 -75842 10438 -2414 20827
12334 20827 47276 184704 101225 75145 39267 15014 -13198 -34585 -62781 -36141 60450
12323 60450 108353 64008 28137 86990 89506 53039 115314 120045 108183 19922 -21943 -16893
12311 -16893 66445 134019 133386 103708 47147 63256 84303 85873 36942 -6812 24824 -15453
12299 -15453 -34539 95918 96397 128642 181868 151887 45684 64488 98591 125544 107235 89762
12287 89762 -35266 -79306 -15803 55053 76319 56593 25341 10853 -18580 61962 98295
12276 98295 19489 -45472 12602 -39619 -143893 -174036 -133628 -78692 -49859 -23276 -15500 50508
12264 50508 123810 70545 22692 45967 20108 58556 40651 62974 58663 -19714 -61997 -22623
12252 -22623 7334 27698 9835 -5523 313 -46755 -11875 -3348 47018 58490 99331 39063
12240 39063 -2700 -10216 -37348 -38376 -13297 18748 91852 161906 175025 35014 -23733 -38218
12228 -38218 -30865 31866 78310 42269 -51609 -47011 69848 145986 95518 33934 69552 101586
12216 101586 24601 -38863 -35924 -82261 -124263 -161535 -64299 -4524 -76035 8872 150176
12205 150176 16998 -42645 72860 119619 174123 128220 31511 -601 -55107 -53513 4338
12194 4338 1185 -35567 -23529 1030 26356 93672 170386 131172 65903 54049 16946 71902
12182 71902 -6083 -79596 -64662 53818 57582 33161 -18873 -68353 -24416 40400 69507 -22307
12170 -22307 -84141 -146892 -147527 -81324 -110701 -17046 24642 -18684 -119649 -131806 -126425 -108085
12158 -108085 -107782 -80406 31462 30440 -18512 -29317 -40864 -75478 -43486 12973 26410 21096
12146 21096 -4308 -119720 -113938 -79768 -29090 -73005 -139126 -151356 -30694 39173 62297
12135 62297 84766 79991 77509 22988 56127 89716 98476 148696 107996 15689 10199 51972
12123 51972 7577 -77101 -156308 -198215 -216878 -172354 -170621 -176695 -116480 7375 39654 17748
12111 17748 -960 -23904 20316 73268 37311 -20578 -12928 2983 8076 19174 -34355 110806
12099 110806 111906 30676 46273 -36621 -87664 47972 72465 40275 29546 39248 42516 58738
12087 58738 10613 20768 65261 42008 2415 8665 67641 138564 100767 17527 -25843 -37109
12075 -37109 -79501 -43799 13720 44452 106575 156986 92879 88486 141000 122128 46982 -36793
12063 -36793 -77676 -68959 -52273 -92209 -62420 49720 187849 260059 243591 165941 100940
12052 100940 904 -1820 -27224 -71521 -142486 -42071 130839 131349 102616 10788 -56058
12041 -56058 -26854 -27855 62005 108853 117471 110899 145036 154752 102006 174412 120528 12064
12029 12064 -26637 -44108 -49771 -99204 -68124 11623 88141 114432 42996 -13074 21262 35261
12017 35261 72541 109013 131276 69271 57704 98775 81256 44480 81729 128119 131043 95400
12005 95400 38588 4017 18065 131662 136305 76705 87021 138072 178176 173033 148459 141277
11993 141277 146186 160104 234748 232871 186668 169332 137672 111977 174177 216980 131235 -66382
11981 -66382 -50845 -33411 22535 77036 85659 -10883 -68515 -69866 -15396 29630 45121 -35070
11969 -35070 -64293 -100655 -112492 -182499 -133031 -10129 -7176 18056 29994 -41615 -131562 -69956
11957 -69956 -71024 -112901 -55777 20525 6163 -58496 -84343 -98453 -131549 -147915 -40097 47119
11945 47119 -8887 -1724 61841 74856 60495 16557 57397 109108 122599 43084 -92329 -103526
11933 -103526 -107183 -94220 -71845 -37491 -45921 -2014 35280 4645 -35361 -34690 -17221 -64440
11921 -64440 -75177 -14128 -3579 -34094 -57026 -53522 -17196 17043 -12383 194 -100449 -102500
11909 -102500 -71317 -143005 -172452 -113893 -37373 34676 -2912 -72429 48328 151532 222334
11898 222334 205048 20257 -46049 -2665 53951 80057 95885 105354 84042 21783 23020 53607
11886 53607 85568 80759 79113 135264 221648 124354 47254 -5821 -69239 -55370 1295 107606
11874 107606 108710 62915 -31302 -92816 -65049 -42265 -84601 -154902 -103727 -58418 -79168 -52313
11862 -52313 1770 12121 79222 77304 10008 -29868 -32158 -16938 -7567 32596 60126 55243
11850 55243 35760 -37274 -105488 -130610 -160969 -73663 23892 24713 39750 6728 16433 3216
11838 3216 -48451 -38156 28981 53861 7696 3638 60290 82017 1619 -174828 -156858 -11744
11826 -11744 119645 86431 111600 156615 112709 59721 89292 114329 114853 53845 -15024 -38144
11814 -38144 -43786 -72018 -42757 -5113 67240 74358 52485 42223 11578 17126 95912 55900
11802 55900 132148 186163 78077 38420 -13748 31892 64619 167842 159135 26145 -62461
11791 -62461 -88630 -130361 -174974 -121357 -109634 -58296 -13702 495 -56255 -66289 -41031 -75786
11779 -75786 -86975 -43340 -77976 -81257 -91569 -59855 -21421 -74641 -109794 -116630 -46422 -5808
11767 -5808 -74994 -142946 -145444 -22708 -33163 -93432 -18587 52583 41935 29432 6777 14438
11755 14438 -50157 25968 103094 55189 3723 34173 32902 -33835 -18369 20648 76264 102242
11743 102242 50947 -66953 -90696 -33216 7696 17415 -15771 -48538 -113994 -167622 -119182
11732 -119182 -52990 -91053 -106511 -113860 -68988 -23114 -35434 -57340 38412 58104 -9934 -42106
11720 -42106 -61082 -7291 -37971 -76690 -57824 52098 41167 -17562 26454 15946 38349
11709 38349 51557 54617 39086 9863 -32775 -23463 -13933 -54705 -26712 -42242 -49850 -9612
11697 -9612 59870 154643 204106 128460 -26232 -46669 -33125 -75996 -119581 -83011 -87713 -13248
11685 -13248 68263 55426 48587 37675 29085 53219 67750 37979 9370 -18640 -19289 19110
11673 19110 49688 91468 51161 3000 -17441 26354 -16352 -87623 -106909 -46194 17448 45170
11661 45170 48614 -29190 14518 106339 121544 75573 -20933 -69200 -24669 -29624 -126128 -154727
11649 -154727 -17689 -17486 5134 44398 75109 8945 -4345 20977 -56985 -33899 -31605 -20800
11637 -20800 -28583 -115374 -62979 -15073 24674 34692 10717 -59914 -23176 30554 7134 64948
11625 64948 32373 -7189 -9362 12522 33948 -26661 59876 109610 6181 -56806 -49144 49969
11613 49969 56181 -15087 -38497 -114039 -104817 -22740 -22705 -2106 26778 51452 -18192 -41991 -53126
11600 -53126 -13606 58911 3306 -59469 -33014 41023 31202 46462 -18941 -36861 -44162 18566
11588 18566 21475 -25768 -5435 76770 32213 49464 79274 17894 30650 90668 156841 76319
11576 76319 12579 5861 4858 13141 16 24988 34185 18033 -1212 -49481 -54338 -33022 -1911
11563 -1911 -18743 -1574 28323 31680 -29914 -47150 -60698 -59940 -53039 -63651 -83559 -22598 22938
11550 22938 85553 54050 440 -41128 -104119 -85800 -64610 -2898 98847 211183 71424
11539 71424 18004 63156 10832 -589 -27347 -40484 -89678 -140763 -143724 -96116 -163512 -180416
11527 -180416 -136230 -115254 -62122 -15699 7794 -38708 23902 71333 73570 69187 123466 237419
11515 237419 134140 94848 27083 80307 76011 -23896 -123672 -194633 -139256 -64725 -55164 -73255
11503 -73255 -80260 -13410 33901 18862 8127 83422 108123 95249 57062 13527 -5193 66267
11491 66267 53164 57534 71600 -41977 -87590 -49417 -10433 -22642 -31947 -27745 -6313 -30818
11479 -30818 -12546 -41290 -112419 -108203 -70193 -60524 -53856 -48682 -11735 -49572 -99551 -105403 -57990
11466 -57990 26945 52100 53417 -77983 -99331 -91443 -24915 44150 34668 4310 -7376 -28384
11454 -28384 -17589 16801 -4820 -79751 -92077 -96677 -33555 -25607 -55562 -58205 -52368 -59506 -81684
11441 -81684 -31504 6984 -1454 -28540 -75056 -49156 -28142 36185 87963 57803 43201 -82799
11429 -82799 -96135 -13076 64023 65535 8716 -36268 -74165 -39085 -19021 42002 96149 68880
11417 68880 -977 -23013 -39552 -67979 -83717 -34229 21013 50504 14653 -77644 -66718 11141
11405 11141 40787 3364 -37873 -85562 -196249 -161086 -86475 15070 51585 -11290 -107086
11394 -107086 -152167 -15717 -3810 -17473 12945 2673 -34163 6408 88264 -13564 -91067
11383 -91067 -86056 52588 -81498 -256406 -274861 -198860 28295 50703 108035 6143 34773
11372 34773 -6338 -10854 -60469 -90832 -42932 55524 59437 -14519 -31740 7844 -74816 26585
11360 26585 132549 107111 97889 176313 91700 26018 86329 56262 12987 -94016 -32671
11349 -32671 21415 -61515 -80707 -92158 -84048 -109785 -52408 55498 74544 64373 69260 33927
11337 33927 -54156 -52018 -17724 -20838 -10979 -14502 -66578 -128494 -194536 -143612 -57270 -63039 -90504
11324 -90504 -79628 -79484 -35815 -10740 -64375 -91441 -168974 -118788 -56405 -69165 -61114 -91376
11312 -91376 -66880 -7305 31397 24860 -119 -31185 -23868 72508 65241 81280 51472 -12191
11300 -12191 -134380 1906 30756 -27100 -56044 -59292 -57424 -120325 -119869 -52491 -77828 -63545
11288 -63545 30065 34487 73165 -9411 1310 -45219 -51032 -71467 23763 66558 78075 66711
11276 66711 76403 51596 33832 51967 50542 53083 174404 169086 74192 -27004 -89776 -84870
11264 -84870 -37238 -103649 -57580 -33565 -77112 -26267 15041 63525 45068 5418 16408 26615
11252 26615 1384 7303 46938 75736 41638 8017 -18801 -67733 -107434 -58752 -98487 -129604
11240 -129604 -194387 -174090 -37672 65663 105114 82126 126331 89005 23683 -29559 -95354
11229 -95354 -71638 -38040 -2894 -5886 39012 25332 3139 62242 89942 65404 16866 11007
11217 11007 -53882 -7877 43245 44571 -5215 -67295 -71128 -44093 -79528 -83125 4723 91651
11205 91651 174161 208157 180078 154067 97527 58454 49571 16533 34585 29066 95669 74126
11193 74126 66817 29646 -5384 58434 60159 -78275 -103501 -83848 5775 24717 18093 95104
11181 95104 74568 -19070 -46635 -74915 -16970 -12629 6940 -12720 -99367 -7008 93730 52456
11169 52456 39346 6492 -49500 -98412 -113287 -84551 -67778 18 44447 91321 116073 94185
11157 94185 27940 -4010 -34019 -36719 1310 23127 35956 31486 86913 227420 218697 130619
11145 130619 100460 13580 -6769 -12633 -13907 -7363 -33341 -30535 -10988 45806 37616 40842 14997
11132 14997 -3699 -136879 -189331 -171157 -125796 -117402 -66363 -67442 -108463 -68615 33530 47584
11120 47584 -42741 -90513 -115484 -70590 44927 79541 61683 29709 76869 54603 70274
11109 70274 150340 153514 98580 16793 -11208 2814 11669 -49040 -55023 -18420 -109421 -151751
11097 -151751 -115862 -69123 -13705 16620 -44072 -89720 -47452 -33746 15060 82795 94677
11086 94677 80586 7295 -42056 -7794 48984 61312 -28039 -158774 -181998 -101459 -920
11075 -920 -30385 -29802 20596 19133 52061 15155 -78875 -158583 -110296 81463 170978 59899
11063 59899 45160 24580 20115 -87140 -76699 14434 41795 1206 1951 34274 74417 30874
11051 30874 -31359 37205 52280 66298 72997 44937 -43388 -13569 -109436 -164975 -64551 34781
11039 34781 49632 103793 60552 26040 18390 -2769 -45940 -8185 6661 35455 85464 71114
11027 71114 -1311 -3651 -58325 -63740 -54400 7593 -25597 -76945 -45794 -5730 5270 40029
11015 40029 83290 51453 -4393 -73771 -120750 -21408 38989 5644 -14683 -45892 -44305 -110092
11003 -110092 -58909 -51507 -39938 -28197 -115399 -111485 -163825 -61429 7903 5156 19044 86181
10991 86181 40448 -22796 -66456 -57162 -154204 -132309 18557 93435 85280 -32121 7287 81225
10979 81225 14217 -82981 -168602 -151377 -107083 -125751 -161095 -191760 -88201 -62395 -77361
10968 -77361 -89060 -49126 -6274 17752 18654 114472 113851 99294 160750 31880 -36323 -43873
10956 -43873 -72282 -91739 -88831 -107529 -107495 -95252 -128532 -142474 -157707 -8713 18333 8905
10944 8905 15118 28008 4628 263 12889 7893 19118 36465 71060 87859 96622 38325 -40567
10931 -40567 -58597 -13568 -27026 -4234 121512 206798 198288 159469 60765 5072 10269 33976
10919 33976 19906 19971 -21794 35329 11807 7753 -70824 -116758 -48456 -62496 -77774 -29546
10907 -29546 80100 14752 16738 21061 67561 49140 36547 12498 -91742 -109757 -14759 83896
10895 83896 30700 -48154 -71044 -3561 34268 73603 78549 98143 15407 -56665 -77063 -28251
10883 -28251 -41666 -43353 -55087 -96420 -52706 -11971 -89527 -108893 -55226 -80843 -8958 63018
10871 63018 8110 -97368 -62240 -78136 -15603 23022 -16798 -50507 3594 -81492 -153161
10860 -153161 -183530 -144919 -69914 -39895 25057 99759 114845 55917 20860 -59030 -74702
10849 -74702 -88770 -41778 -116135 -117588 -95976 -46556 -8845 118893 106579 91867 99763 105184
10837 105184 15339 -11103 44145 125508 131981 119491 77977 48005 57098 75353 66527 -74996
10825 -74996 -139187 -103586 -47824 -56632 -64397 -45754 -53532 18348 28084 48935 -2988 -107374
10813 -107374 -26294 10245 -30845 -46406 -84346 -102274 -78048 -58925 -163206 -173785 -124873
10802 -124873 -7766 -15421 -50513 -48981 52567 16177 -72041 -128438 -190116 -151047 -207936
10791 -207936 -191336 -84393 -24388 9079 -35759 -106552 -61664 -77530 -82310 -49145 -21329
10780 -21329 -40255 -118426 -139078 -99534 -133151 -179112 -218467 -181670 -176910 -201948 -151785 -67458
10768 -67458 -31727 -21081 -46150 -29653 29893 13295 -5772 -60169 -132657 -58958 -136806 -82156
10756 -82156 -492 10902 48024 34065 18966 -9718 30617 29639 4376 -72763 -106413 -64412
10744 -64412 39024 -19237 -69882 -54047 -65236 -115334 -132274 -72183 -37296 -18795 -31299
10733 -31299 -46675 -72605 -93803 -64799 36210 106866 16358 -33926 -59483 4840 31165
10722 31165 50208 35079 83891 16240 -75742 -88552 -99570 -213288 -170972 -145955 -161320
10711 -161320 -125244 -84982 1283 39323 -8577 -108630 -82490 -36088 19856 34715 73918
10700 73918 77366 38952 -51926 -7475 29303 -11965 -14722 -17875 -53504 -21930 12881 16113
10688 16113 -33657 -46977 -54917 12083 -10275 -7812 -17747 -45006 24591 93774 76872 5286
10676 5286 -9898 25058 27626 10825 116851 96939 -31507 -118948 -71638 -17769 -33918 -130280
10664 -130280 -155589 -94526 -74657 -16107 75880 119181 124827 60891 61051 44437 11139 -49919
10652 -49919 -18376 5923 20278 -26006 -131788 -58114 15896 -44979 -26060 -74629 -89398
10641 -89398 -102525 -89489 -204823 -180109 -63097 -10851 -45768 -139481 -223822 -221031 -93198
10630 -93198 4758 34380 22209 -33811 -38584 -61621 -35920 -19296 16423 35196 107900 144242
10618 144242 151987 104240 112209 80932 133228 29036 50402 42916 77947 67143 51424 -1828
10606 -1828 -68866 -51528 1143 46505 -67557 -180110 -144577 -97870 -89771 -170866 -155196 -96954
10594 -96954 -84334 -204927 -149249 -87172 -132698 -83817 -31588 17497 -2121 -8602 -6914 -41617
10582 -41617 -82965 -65513 10247 1003 -42565 -45298 -15070 9754 16205 76984 24061 -20915
10570 -20915 -101982 -112683 -47699 -7525 46083 106740 159891 150977 78209 46805 53953 46338
10558 46338 35224 50762 6443 -2395 48396 14941 -41749 -30378 21490 40926 -35978 -60646
10546 -60646 -81034 -85073 -56426 8597 41854 -15026 -86956 -76295 4678 -8692 61520 34825
10534 34825 -39631 -95966 -112080 -86146 -11853 56151 87149 131169 88528 -39934 -96274
10523 -96274 -69947 57825 148093 167542 173659 81918 -42845 -79541 -96226 -68174 -107867
10512 -107867 -95755 -114420 -69461 20520 5342 18278 17459 -40371 -53191 -111010 -17438 -143
10500 -143 -90441 -58113 -22590 94354 102838 74898 121297 175826 99667 55532 59453 95771
10488 95771 15310 6875 -18331 -91112 -159538 -115178 -109927 -76011 -85821 -105112 -61758 42183
10476 42183 7939 -77422 -141709 -37496 8426 44824 -64067 -95054 -82018 -10794 16022
10465 16022 -16345 14517 118314 181203 120671 38559 15253 25859 31808 49739 38191 79388
10453 79388 7803 40749 46342 85051 163364 166466 122951 78593 34285 -12409 4362 50936
10441 50936 99800 102586 115509 86526 37432 -48239 -19145 9333 -58368 -76234 -28563 65979
10429 65979 90260 86351 -5971 -88148 -107456 -45428 -46279 -23915 7156 347 14230 70186
10417 70186 33185 1848 103168 181903 120971 85604 30473 1447 -41358 -2993 86559
10406 86559 57646 89419 81252 94023 104020 -5910 81653 154668 80953 48577 27683 -365
10394 -365 -38414 -43280 75781 68730 -3963 19371 -73462 -181912 -124126 -32796 -44050 -48294
10382 -48294 56901 54592 69782 107619 122456 39958 -27080 -29615 -52513 -98173 -119038 -114160
10370 -114160 -80344 2603 -28184 -79532 -41918 -5259 4550 -16235 27468 59959 -750 -20546
10358 -20546 -58650 -93323 -93747 4765 96064 229611 281594 321037 367486 448953 594255 649390
10346 649390 721555 825449 857314 797873 762310 725096 580011 385297 371557 280304 236215
10335 236215 226420 159992 66084 3602 37945 38705 -32333 -11983 -26595 -4549 -24295 -47562
10323 -47562 -32765 11538 37954 18011 -31846 7004 -16015 -29397 -46899 -14662 11760 11144
10311 11144 55243 105703 60986 15015 -74385 -42383 22024 2124 -66872 -161093 -121738 -74029
10299 -74029 -47363 -147688 -200205 -151506 -66103 22250 45662 -68346 -135250 -145252 -100583
10288 -100583 -53240 -33941 -68004 -114845 -132036 -76634 -63397 -4851 27744 1297 28521
10277 28521 72615 49956 29983 21541 -14423 42536 48104 52609 65969 78489 57843 112781
10265 112781 100788 66206 55982 94616 92736 66064 55098 19333 -1823 -37808 -87708 -140567
10253 -140567 -178206 -164876 -145395 -126224 -120278 -54996 -116124 -191446 -187933 -101380 -102564 -131886
10241 -131886 -65125 25805 57079 36905 -7988 -59873 -87096 -30914 46725 85360 49554
10230 49554 41480 6813 36017 -18870 -56507 -125571 -214380 -193290 -108475 -136653 -89300 -82000
10218 -82000 1745 30550 112695 101805 85760 66519 70077 51276 101093 119447 48515 -20728
10206 -20728 -35452 11951 59133 114699 196253 193507 98184 50119 109441 71627 -28447 -37604
10194 -37604 68855 104082 59057 7123 48326 85709 5858 -104625 -77261 5108 19555
10183 19555 -6518 -77947 -127249 -114968 -85795 -13641 37591 41590 6044 2139 28239 38559
10171 38559 34497 6066 -8579 -80471 18907 113895 123054 132522 156712 171509 81428 40153
10159 40153 104218 44284 1336 -41906 -47714 -75617 -111660 -140651 -164100 -138995 -149131 -28458
10147 -28458 41098 71349 48673 55175 64901 -15669 -57344 7266 58746 72742 89271 37071
10135 37071 18114 23602 -26346 2233 33857 79151 41601 39153 30216 -12080 -34378 -65974
10123 -65974 -60519 -23719 15314 21657 -4739 106776 145263 80676 90994 83960 25274 14035
10111 14035 74930 104879 119067 131084 198672 193625 138437 57114 10574 47820 -568 -4122
10099 -4122 39869 115074 96813 41227 87670 104785 192867 190794 237036 276258 248817 181572
10087 181572 175901 202204 219816 181280 132756 281197 384522 271686 215807 315438 338349
10076 338349 285914 313868 370366 475789 560169 578692 580588 668073 846012 911232 910802 1055357
10064 1055357 1294665 1672564 2150903 2715926 3474877 4835702 7089385 10642189 15601844
10055 15601844 19085938 16310445 10593536 6261863 3909904 2702566 1945615 1444141
10047 1444141 1066240 761185 676846 495282 402502 444012 347323 288460 298149 255664 272731
10036 272731 300123 225024 273821 227885 205937 204758 119499 69618 47520 97460 122739 138676
10024 138676 146223 188468 163576 155993 121592 73794 -20348 -12472 -68404 -104641 -75061 -37522
10012 -37522 -13475 18012 33312 17508 -20599 -10070 -42184 21306 -19135 -97103 -44455 -95485
10000 -95485 -127583 -45252 4064 -8487 21962 -9676 -4691 66521 39825 -58567 -110099 -39369
9988 -39369 -6286 -16386 -49423 -122580 -155894 -170586 -138368 -90852 -68004 -39952 -4984 -6064
9976 -6064 -37199 -39519 18505 17428 65598 61844 42242 80684 51131 55004 8595 -7171 -5098
9963 -5098 70493 61755 20504 10283 27458 19713 -61200 -37004 27997 3185 -7371 -73788
9951 -73788 -116102 23668 58374 20329 91527 205782 160570 121001 39923 -23987 -119412
9940 -119412 -94969 -84891 -25814 43683 30075 32565 -22352 -107722 -71260 -101866 -126788 -106017
9928 -106017 -99141 -93126 -72786 -57119 -58057 -55173 -34201 -24156 3527 25574 63712 13064 -48184
9915 -48184 -47815 32775 77196 113820 47811 -36657 -77886 -41730 14561 8110 -23904 -56312
9903 -56312 -12310 151788 211106 235828 182964 167294 51633 -96684 -105331 -175606 -114189
9892 -114189 1647 26870 29494 4828 -11698 126368 182907 42494 -75397 -70970 -75798
9881 -75798 -189392 -203579 -119199 -86841 -53370 -97110 -68461 -25130 -18148 20716 -25388 -87041
9869 -87041 -23630 -25445 -25356 24687 48312 66693 110294 111749 120175 218236 169096 93985 30996
9856 30996 20245 32393 27816 -13303 14262 12289 -4350 35605 99897 11239 -49110 -133992
9844 -133992 -203321 -189384 -238014 -233332 -207676 -102727 -4653 -11411 -81511 -59675 -28489 31746
9832 31746 86071 75306 26253 65280 77356 52502 125757 52186 32757 114867 135530 53277
9820 53277 -32038 -106358 -122387 -149992 -145517 -93556 -14471 -55776 -92079 -35594 44404 45122
9808 45122 34609 46413 -7196 60756 31611 5571 -45564 -108421 -79305 -106729 -150966 -191468
9796 -191468 -192141 -93661 -1292 -7061 -3223 32642 30477 10659 110450 187028 179486 91819 27689
9783 27689 20076 -70100 -29917 71644 143836 108575 130761 109047 83155 169952 118559 70192
9771 70192 -58299 -142457 -99660 16343 25091 75755 76251 2682 7796 -4682 -47885 -95098
9759 -95098 -90707 -26043 -23052 -11899 -8589 -15539 3469 -9932 894 -19694 -13606 3121 22081
9746 22081 -89656 -159649 -138056 -152777 -151047 -115002 -126238 -162699 -94710 -49287 -29958 5679
9734 5679 -74899 -106763 -119423 -117032 -37234 16781 18429 -32870 -50062 -21661 -34354 -47493
9722 -47493 -22298 -13064 -73858 -121857 -126044 -50928 -41421 -63890 -68730 -28519 29065 5666 -53605
9709 -53605 3841 57093 51209 -35826 -128978 -174635 -61820 -75977 -140089 -160584 -79899 -14027
9697 -14027 13455 51483 -11593 -18106 45057 91527 165526 173512 139844 43610 34919 34078 -3477
9684 -3477 49553 82683 -3175 8932 61624 22671 54993 95512 36818 13581 23412 -10026
9672 -10026 -45069 -65253 -70451 -42871 -92545 -122830 -120382 -98947 -69388 -69117 -32031 -48894 -82636
9659 -82636 -194674 -63778 60232 60541 16443 26256 48359 82651 120838 139850 68649 22335
9647 22335 38552 37799 -30375 -38375 -20025 1998 -40012 49210 195971 165403 59569 293
9635 293 8411 -74120 -41689 40657 103704 14044 -44680 -52612 53408 -10942 16937 -31341
9623 -31341 -45867 -53027 -56905 -5476 -26012 -55316 -96952 24610 300 -71946 -73648 -36821
9611 -36821 -37153 12807 44763 95128 126201 118645 88981 47930 84866 124117 21143 18544
9599 18544 -7976 -8075 41083 17892 23321 57130 34217 98648 61281 27205 41346 39650 -9025
9586 -9025 -7979 46539 34834 -38648 -64039 -28023 -24842 39439 186888 226831 246144 166193
9574 166193 66689 21380 -30253 -45888 -131043 -67537 26482 21587 19728 -1505 104082 185051
9562 185051 218539 177676 146977 89286 75902 55398 13041 57574 62846 27990 40021 -27900
9550 -27900 -54619 -48810 -18807 34117 45469 23433 11536 73665 65923 45885 89854 78268
9538 78268 113162 92158 134812 184846 163309 130252 128283 210696 274282 266425 204203 -1188
9526 -1188 -85640 -166420 -177170 -129843 -114297 -117543 21509 12509 28729 54338 13564 -19755
9514 -19755 22150 101840 31749 -53270 -63961 -38043 7766 54550 70411 58109 -16014 -96136
9502 -96136 -97215 44174 104063 112463 94554 14384 -10810 -45452 -87992 -99208 -2885 19302
9490 19302 56900 -57495 -65730 -68836 -119162 -29282 12524 -2415 23748 79247 38515 -38849
9478 -38849 -12863 78009 114627 116521 65572 15937 -40548 -102489 -70327 5383 -8232 -153466
9466 -153466 -186700 -35651 85317 98327 137325 141554 121609 116603 146343 127652 52363 -46049
9454 -46049 -46896 23574 66359 67252 7696 70410 63317 80810 33803 -1457 -64119 -29482 -12121
9441 -12121 22817 35981 35282 44237 8378 -17668 -24618 -56397 -35292 -49449 -69447 -7509 67189
9428 67189 77853 117706 85791 42217 110876 134570 144479 111622 19578 115102 77470 84300
9416 84300 76211 138632 177055 144696 39162 -32723 -36350 -16071 11388 2024 9380 -15598
9404 -15598 30050 67562 147277 163792 105185 144153 85915 5543 -30598 -25540 112147 250177
9392 250177 238488 172024 100851 110650 116226 78532 82539 112068 37470 79652 99120 29639
9380 29639 -26582 -39639 11710 16440 9005 -8967 68771 82730 59659 32148 5068 53225
9368 53225 128342 139670 73734 84210 75471 89516 102744 84094 -47671 -84175 -114068 -121760
9356 -121760 30500 86749 771 -54278 -23793 12506 34427 27902 92127 131324 99575 129580
9344 129580 131728 111849 70461 26352 -2288 59358 145400 160849 30792 -30194 41947 87042
9332 87042 133725 147096 155218 165969 139893 104072 123550 163634 116503 35631 91544 92429
9320 92429 -34438 -54554 -50235 -12852 49787 19928 -31511 -40490 -31617 -73772 -52359 11574
9308 11574 60038 50669 36318 48660 46799 105240 159557 223356 202239 82646 -25653 5275
9296 5275 67752 -14791 -10386 64077 114582 67591 76649 44519 90992 73753 -6933 40393
9284 40393 32142 -9997 -1924 -8313 51651 74278 -5279 -55048 -22971 -25861 -45670 60222
9272 60222 76511 65847 -1411 9185 49295 86658 61886 115373 121635 103241 186980 190608
9260 190608 138444 -6707 -101060 -32622 95534 122153 57257 113515 167115 163853 127374
9249 127374 60879 9404 111302 59840 10061 67468 122226 98556 76710 54656 48984 4151
9237 4151 -126126 7466 30348 13296 77228 63075 90122 85154 73969 -4600 57416 20293
9225 20293 44638 39727 34637 64621 77454 62981 107145 112075 61508 7447 -2641 -2137 -33367
9212 -33367 -29110 -5548 -3181 -26237 -98035 -62885 11441 4103 60252 28418 -16937 88265
9200 88265 126006 129723 145456 127426 -4047 10597 94859 137200 101780 37882 91920 82249
9188 82249 32819 31339 48787 128499 189494 218095 203380 217596 178492 136166 98533 99157
9176 99157 54267 3901 34597 147531 221291 302053 295063 185097 170747 233007 256129 273032
9164 273032 211687 186386 278469 263336 232631 273551 311925 280339 234316 182154 225934 245504
9152 245504 207355 235483 333008 288256 218110 167174 222654 362783 414887 403923 379685
9141 379685 419350 390042 367657 375659 436943 417914 467576 444505 395526 448959 498358 424933
9129 424933 386137 473493 548689 583751 504803 405116 382746 463450 504352 491592 406895 456050
9117 456050 532653 654588 836854 901063 890656 846104 887457 985197 1017453 1053840 1064723
9106 1064723 1097934 1197431 1282402 1364788 1394631 1437042 1542903 1576849 1599956 1814704 1977053
9095 1977053 2052206 2225661 2365838 2630830 2792628 2978080 3254182 3604583 4020650 4427308
9085 4427308 4698952 5086008 5614502 6140513 6617795 7157673 7722984 8298308 8909286 9396405
9075 9396405 9668157 9806721 9826315 9722692 9415400 9050867 8568455 7995488 7442728 6846138
9065 6846138 6269618 5675400 5236892 4761913 4223733 3852916 3481836 3133099 2957324 2745804
9055 2745804 2478559 2288877 2082975 1923360 1692545 1504752 1417755 1379936 1235416 1068223
9045 1068223 1031452 992148 871631 774694 785263 777474 747182 725565 651292 578129 513940
9034 513940 498787 468315 445553 434453 427083 446724 426135 455200 397341 377272 459983 456246
9022 456246 396680 434775 402084 350564 289681 290347 257805 191955 168181 98929 124725 130141
9010 130141 114335 105473 166658 210971 262179 284116 141070 -24841 31855 45902 17187
8999 17187 133966 155318 132125 155487 169957 272184 384483 405897 411550 416457 278286
8988 278286 152264 48444 88026 105311 143733 122401 41319 -38201 -90352 -29273 -23113
8977 -23113 -25327 -45517 -57620 -48257 -55682 -50040 -50358 -35010 -78687 -25622 58602 123491 149727
8964 149727 104434 26978 91456 125512 118121 77798 50072 8479 -28127 -57350 -46050 -30078
8952 -30078 -47340 28857 90718 23228 -7191 42135 18422 -57809 -115206 -12851 41480 -17460
8940 -17460 -56613 -24563 24429 3102 -50716 -2428 11045 -31194 11491 -11692 78140 146020
8928 146020 86144 103874 123247 57637 58828 79994 40800 77934 61752 75716 110845 66178
8916 66178 -7886 52069 43885 -69679 -201015 -179847 -157521 -92887 -27288 25357 -2072 -39782
8904 -39782 40675 30590 -44099 -34904 22829 3870 48567 3462 -35555 -39492 118 43724
8892 43724 51298 23883 26126 111230 112128 88831 52167 36039 48365 118119 154254 51925
8880 51925 20916 -22643 -44302 -5854 22770 -93464 -129079 -11433 43048 74926 98395
8869 98395 113549 119085 113133 62090 103412 115529 89039 1243 -78237 -84969 -30234 -108512
8857 -108512 -119392 -50834 -28977 -49148 -55560 -47743 -40188 -5818 16188 8124 -32076 62451
8845 62451 102781 55029 7154 -98927 -27915 74476 29813 -90726 -110708 50111 100885
8834 100885 55074 -24071 -111934 -69746 51152 128171 95830 43508 17628 -40986 -19588
8823 -19588 -21032 -21260 8002 118678 77429 -16281 -43294 -89703 -112396 -85987 -95422 26278
8811 26278 104485 189387 129604 28181 -32542 -34030 18411 28080 -34138 19367 -43111 -5067
8799 -5067 42876 78577 82614 -7947 -81758 -107702 -141241 -116069 -82676 -60823 -26407 -84167
8787 -84167 -79672 -117301 -182892 -144700 -71873 26267 62169 38642 62141 -41923 -57997 -11329
8775 -11329 15258 42112 69239 95003 68469 76525 73920 51203 37871 -11236 -20064 27581
8763 27581 83737 -5417 -67150 -76466 -133925 -125124 26679 99258 44542 82882 58539 -10638
8751 -10638 -24477 -190 19533 -76772 -42710 1247 25274 -45862 -122636 -66719 -27759 -28127
8739 -28127 -70827 -72225 -23305 9257 21835 10039 10894 -37077 3198 41282 -41747 -19370
8727 -19370 -46735 -134965 -82584 -71804 -103433 -84877 1926 48493 72245 51080 19021 -96608
8715 -96608 -76619 -71918 -13748 149539 185507 120116 63422 29139 -32049 -58654 -90451 -41246
8703 -41246 -66708 -42451 98966 161906 127585 100271 56972 90745 120968 17074 4786
8692 4786 93367 25737 -68278 -123160 -97828 -48392 -62946 -88768 7251 67122 99365 33623
8680 33623 -22350 31177 32685 15878 -48444 -49868 -32715 7400 59264 77527 58196 61282
8668 61282 20630 -39961 -46007 -63436 -44826 -27274 -43352 49046 48665 49379 42467 23700 39325
8655 39325 69840 6611 -3512 98205 73409 84172 44529 -15348 55705 75776 82405 76390
8643 76390 12949 11085 38468 40770 98249 200659 218005 136226 14036 52969 151710 105239
8631 105239 84384 94378 70420 88212 28372 -53632 63543 90124 4291 71443 96430 -6676
8619 -6676 -14197 8869 -14627 13987 48295 127234 172343 157456 62700 -26558 -50137 8270
8607 8270 85778 176075 120455 102748 141447 187087 162562 159039 101901 70019 10775 -516
8595 -516 -104532 -96672 -112651 -134001 -174924 -121745 -78771 -194 15038 34192 -34298 16305
8583 16305 38167 -12917 -45786 -33949 23365 88802 81188 114452 123683 107022 66549 71110
8571 71110 -5553 -67328 -55246 -108656 -202428 -100426 -39135 -92252 -13710 -10174 -67651 -93140
8559 -93140 -49138 -24648 -98123 -103618 -93726 -49303 -3182 12484 75891 109283 34537 -45794
8547 -45794 -17316 39175 119241 46748 -1154 -55441 -125490 -89641 19469 34817 -71621
8536 -71621 -84568 -38003 -26826 -68477 -67031 -122175 -128694 -88927 -118780 -83351 -39761 -42367
8524 -42367 41971 71731 -29740 -94258 -141039 -138996 -108668 -60309 -16564 39571 -66098 -130636
8512 -130636 -124996 -105789 -130316 -99323 -111397 -17940 28138 75124 -7602 -17419 35138 25315
8500 25315 38222 26131 128409 134061 109644 571 -26705 -1829 19945 -6051 -110396
8489 -110396 -200458 -75055 67271 24352 -53667 -73171 -97879 -75557 -47155 -123140 -145955
8478 -145955 -98606 -18618 23829 59777 63511 37413 10537 37216 36692 105602 72637 93420
8466 93420 76903 83487 22458 -5968 50639 -11056 -4579 50663 25156 -47062 -3289 -34339
$$ [...]
##END NTUPLES=NMR SPECTRUM
##END=
