##TITLE=Analysis number 327739
Compound Code cc 29409
Project Code adrs
Chemist Name endeavour
##JCAMPDX= 6.0         $$ Bruker NMR JCAMP-DX V2.0
##DATA TYPE= NMR SPECTRUM
##DATA CLASS= NTUPLES
##ORIGIN= Bruker BioSpin GmbH
##OWNER= nmr
$$ XWIN-NMR		Version 3.5
$$ Tue Apr  3 10:19:02 2007 GMT Daylight Time (UT+1h)  MAYBRIDGE\nmr@NMR_250MHZ
##.OBSERVE FREQUENCY= 250.131544655141
##.OBSERVE NUCLEUS= ^1H
##.ACQUISITION MODE= SIMULTANEOUS (DQD)
##.ACQUISITION SCHEME= undefined
##.AVERAGES= 16
##.DIGITISER RES= 18
##SPECTROMETER/DATA SYSTEM= dpx250
##.PULSE SEQUENCE= zg30
##.SOLVENT NAME= CDCl3
##.SHIFT REFERENCE= (INTERNAL, CDCl3, 0, 16.522)
##AUDIT TRAIL= $$ (NUMBER, WHEN, WHO, WHERE, WHAT)
$$ ##TITLE= Audit trail, XWIN-NMR		Version 3.5
$$ ##JCAMPDX= 5.01
$$ ##ORIGIN= Bruker BioSpin GmbH
$$ ##OWNER= nmr
$$ C:\u/data/dgb/nmr/ADRS/300/pdata/1/auditp.txt
$$ ##AUDIT TRAIL=  $$ (NUMBER, WHEN, WHO, WHERE, WHAT)
(   1,<2007-04-03 10:18:33.30 +100>,<MAYBRIDGE\nmr>,<NMR_250MHZ>,
      <created by zg, POWCHK disabled, PULCHK disabled
       configuration hash MD5:
       49 4B E0 1D 92 C2 6B 37 9F E6 65 BC 52 41 86 1D
       data hash MD5: 64K
       C2 A6 3D FD 4A CD 51 4A F6 27 FE B0 04 64 22 B7>)
(   2,<2007-04-03 10:18:49.51 +100>,<MAYBRIDGE\nmr>,<NMR_250MHZ>,
      <Start of raw data processing
       ef LB = 0.3 FT_mod = 6 PKNL = 1 SI = 32K 
       data hash MD5: 32K
       3A 97 AB EC DB D0 D5 53 E9 BB 7A C8 57 2F 45 C8>)
(   3,<2007-04-03 10:18:51.40 +100>,<MAYBRIDGE\nmr>,<NMR_250MHZ>,
      <apk 
       data hash MD5: 32K
       26 43 BC 85 31 6A C3 DA 67 57 8A 73 B1 D3 BC 54>)
(   4,<2007-04-03 10:18:52.21 +100>,<MAYBRIDGE\nmr>,<NMR_250MHZ>,
      <abs ABSG = 5 
       data hash MD5: 32K
       B6 45 0A 53 E5 FE F6 73 70 44 8C 70 EE 8B 34 0D>)
$$ ##END=
$$ 
$$ hash MD5
$$ 63 C5 F8 A9 E2 D8 37 8D 37 78 54 A5 65 CE 36 CF
##$RELAX= 
##$RELAX= 
##$RELAX= 
##$RELAX= 
##$RELAX= 
##$RELAX= 
##$RELAX= 
$$ Bruker specific parameters
$$ --------------------------
##$DU= <C:\u>
##$EXPNO= 300
##$NAME= <ADRS>
##$PROCNO= 1
##$TYPE= <nmr>
##$USER= <dgb>
##$AMP= (0..31)
100 100 100 100 100 100 100 100 100 100 100 100 100 100 100 100 100 100 
100 100 100 100 100 100 100 100 100 100 100 100 100 100 
##$AQSEQ= 0
##$AQ_mod= 3
##$AUNM= <au_zg>
##$AUTOPOS= <53 >
##$BF1= 250.13
##$BF2= 250.13
##$BF3= 250.13
##$BF4= 250.13
##$BF5= 500.13
##$BF6= 500.13
##$BF7= 500.13
##$BF8= 500.13
##$BYTORDA= 1
##$CFDGTYP= 0
##$CFRGTYP= 5
##$CHEMSTR= <none>
##$CNST= (0..31)
1 1 145 1 1 1 1 1 1 1 1 1 1 1 1 1 1 1 1 1 1 1 1 1 1 1 1 1 1 1 1 1 
##$CPDPRG= <>
##$CPDPRG1= <>
##$CPDPRG2= <>
##$CPDPRG3= <>
##$CPDPRG4= <mlev>
##$CPDPRG5= <mlev>
##$CPDPRG6= <mlev>
##$CPDPRG7= <mlev>
##$CPDPRG8= <mlev>
##$CPDPRGB= <>
##$CPDPRGT= <>
##$D= (0..31)
0 1 0 0 0 0 0 0 0 0.06 0 0 0 0 0 0 0.0002 0 0 0 0 0 0 0 0 0 0 0 0 0 0 
0 
##$DATE= 1175591912
##$DBL= (0..7)
120 120 120 120 120 120 120 120 
##$DBP= (0..7)
150 150 150 150 150 150 150 150 
##$DBP07= 0
##$DBPNAM0= <>
##$DBPNAM1= <>
##$DBPNAM2= <>
$$ [...]
##$SUBNAM7= <"">
##$SUBNAM8= <"">
##$SUBNAM9= <"">
##$SW= 20.6930455092707
##$SWIBOX= (0..15)
0 0 3 0 0 0 0 0 0 0 0 0 0 0 0 0 
##$SW_h= 5175.983436853
##$TD= 65536
##$TD0= 1
##$TE= 683.16
##$TE2= 300
##$TE3= 300
##$TEG= 300
##$TL= (0..7)
0 120 120 120 120 120 120 120 
##$TP= (0..7)
150 150 150 150 150 150 150 150 
##$TP07= 0
##$TPNAME0= <>
##$TPNAME1= <>
##$TPNAME2= <>
##$TPNAME3= <>
##$TPNAME4= <>
##$TPNAME5= <>
##$TPNAME6= <>
##$TPNAME7= <>
##$TPOAL= (0..7)
0.5 0.5 0.5 0.5 0.5 0.5 0.5 0.5 
##$TPOFFS= (0..7)
0 0 0 0 0 0 0 0 
##$TUNHIN= 0
##$TUNHOUT= 0
##$TUNXOUT= 0
##$USERA1= <user>
##$USERA2= <user>
##$USERA3= <user>
##$USERA4= <user>
##$USERA5= <user>
##$V9= 5
##$VALIST= <valist>
##$VCLIST= <CCCCCCCCCCCCCCC>
##$VD= 0
##$VDLIST= <DDDDDDDDDDDDDDD>
##$VPLIST= <PPPPPPPPPPPPPPP>
##$VTLIST= <TTTTTTTTTTTTTTT>
##$WBST= 1024
##$WBSW= 4
##$XGAIN= (0..3)
0 0 0 0 
##$XL= 0
##$YL= 0
##$YMAX_a= 515806
##$YMIN_a= -550834
##$ZGOPTNS= <>
##$ZL1= 120
##$ZL2= 120
##$ZL3= 120
##$ZL4= 120
##$ABSF1= 16.522
##$ABSF2= -4.171173
##$ABSG= 5
##$ABSL= 3
##$ALPHA= 0
##$AQORDER= 0
##$ASSFAC= 0
##$ASSFACI= 0
##$ASSFACX= 0
##$ASSWID= 0
##$AUNMP= <proc_1d>
##$AZFE= 0.1
##$AZFW= 0.1
##$BCFW= 0
##$BC_mod= 0
##$BYTORDP= 0
##$COROFFS= 0
##$CY= 12.5
##$DATMOD= 1
##$DC= 0
##$DFILT= <>
##$DTYPP= 0
##$F1P= 14.0000005364418
##$F2P= -0.99999901652339
##$FCOR= 0.5
##$FTSIZE= 32768
##$FT_mod= 6
##$GAMMA= 0
##$GB= 0
##$INTBC= 1
##$INTSCL= 1
##$ISEN= 128
##$LB= 0.3
##$LEV0= 0
##$LPBIN= 0
##$MAXI= 10000
##$MC2= 0
##$MEAN= 0
##$ME_mod= 0
##$MI= 0
##$NCOEF= 0
##$NC_proc= -4
##$NLEV= 6
##$NOISF1= 0
##$NOISF2= 0
##$NSP= 0
##$NTH_PI= 0
##$NZP= 0
##$OFFSET= 16.522
##$PC= 1
##$PHC0= 232.8223
##$PHC1= 5.682765
##$PH_mod= 1
##$PKNL= yes
##$PPARMOD= 0
##$PSCAL= 4
##$PSIGN= 0
##$REVERSE= no
##$SF= 250.13
##$SI= 32768
##$SIGF1= 0
##$SIGF2= 0
##$SINO= 400
##$SIOLD= 32768
##$SREGLST= <1H.CDCl3>
##$SSB= 0
##$STSI= 32768
##$STSR= 0
##$SW_p= 5175.98343685301
##$SYMM= 0
##$S_DEV= 0
##$TDeff= 65536
##$TDoff= 0
##$TI= <Analysis number 999999
Compound Code 99
Book Reference 9
Project Code 9>
##$TILT= no
##$TM1= 0
##$TM2= 0
##$TOPLEV= 0
##$USERP1= <user>
##$USERP2= <user>
##$USERP3= <user>
##$USERP4= <user>
##$USERP5= <user>
##$WDW= 1
##$XDIM= 32768
##$YMAX_p= 337713958
##$YMIN_p= -184854
$$ End of Bruker specific parameters
$$ ---------------------------------
##NTUPLES= NMR SPECTRUM
##VAR_NAME=  FREQUENCY,     SPECTRUM/REAL,   SPECTRUM/IMAG
##SYMBOL=    X,             R,               I
##VAR_TYPE=  INDEPENDENT,   DEPENDENT,       DEPENDENT
##VAR_FORM=  AFFN,          ASDF,            ASDF
##VAR_DIM=   32768,         32768,           32768
##UNITS=     HZ,            ARBITRARY UNITS, ARBITRARY UNITS
##FACTOR=    0.157963299565203, 1,           1
##FIRST=     4132.6476996994, 0,             0
##LAST=      -1043.33573715361, 0,           0
##MIN=       -1043.33573715361, -184854,     0
##MAX=       4132.6476996994, 337713958,     0
$$ Real data points
##PAGE= N=1
##DATA TABLE= (X++(R..R)), XYDATA
$$ [...]
$$ plain form
20033 53972 -2864 -9924 8033 20183 -36920 -73356 -66984 -69595 -83147 -41687 -26409 -34438
20021 -34438 -66754 -79408 -89729 -53991 -10947 -4278 14559 15799 -2820 18589 3289 18316
20009 18316 41856 -2715 11986 28215 -3645 7795 -21343 -86285 -48049 -41754 -67886 -40015
19997 -40015 36526 71322 57616 31949 22034 -27958 -3422 16859 19628 -16330 -59690 -23272
19985 -23272 -62 -7143 -32362 -27654 -20475 -52670 -38899 -27576 -17287 -21930 -20635 -23472 -33029
19972 -33029 -50489 -35579 -4427 42269 96621 148989 104957 56618 72136 102974 82085 42507
19960 42507 26430 45818 47833 11628 -12756 -25035 -20727 -26510 -31939 5455 28050 28329 -12322
19947 -12322 2922 41281 60896 94262 38755 7316 7144 37952 25432 -30843 -18363 -5659
$$ packed form
20033E3972n6836p060J7957J2150n7103l6436O372k611j3552M1460J5278q029
20021c4438l2316j2654j0321L5738M3044O669J8837J240j8619K1409j5300J5027
20009A8316K3540m4571J4701J6229l1860J1440k9138o4942L8236O295k6132K7871
19997d0015P6541L4796j3706k5667r915m9992K4536K0281K769l5958m3360L6418
19985b3272K3210p081k5219M708P179l2195J3771J1323J0289m643J295k837r557
19972c3029j7460J4910L1152M6696N4352N2368m4032m8339J5518L0838k0889l9578
19960D2507j6077J9388K015l6205k4384j2279M308n783n429L7394K2595K79m0651
19947a2322J5244L8359J9615L3366n5507l1439j72L0808j2520n6275J2480J2704
$$ plain form
19935 -5659 -40112 -3886 38256 6730 -13408 -28764 -48433 8291 68330 82037 70082 85725
19923 85725 50842 -7917 2415 3813 -19490 6844 4438 13289 29199 27302 -5762 -12857 7835
19910 7835 -33643 -63541 -70482 -39964 -38428 19977 61645 2256 -54788 -34756 -23916 6709
19898 6709 2343 -29036 -73661 -135570 -104754 -79982 -77909 -101616 -55602 -97132 -108066 -89115
19886 -89115 -110098 -113035 -97498 -66023 -49131 -68986 -70283 -53568 -52282 -74582 -85014 -65165
19874 -65165 -93989 -121743 -64704 -19359 -17467 -34680 -36723 -12225 903 -67983 -116220 -92891
19862 -92891 -53252 -11554 3856 -30744 -46691 -71605 -36345 -33659 -2151 -7388 -40502 -112512
19850 -112512 -77590 -12577 3255 9610 24210 20649 -9908 -20925 -60192 -95768 -50523 -36878
$$ packed form
19935e659l4453L6226M2142l1526k0138j5356j9669N6724O0039J3707j1955J5643
19923H5725l4883n8759J0332J398k3303K6334k406Q851J5910j897l3064p095K0692
19910G835m1478k9898o941L0518J536N8405M1668n9389n7044K0032J0840L0625
19898F709m366l1379m4625o1909L0816K4772K073k3707M6014m1530j0934J8951
19886h9115k0983k937J5537L1475J6892j9855j297J6715J286k2300j0432J9849
19874f5165k8824k7754N7039M5345J892j7213k043K4498J3128o8886m8237K3329
19862i2891L9639M1698J5410l4600j5947k4914L5260K686L1508n237l3114p2010
19850a12512L4922O5013J5832O355J4600l561l0557j1017l9267l5576M5245J3645
$$ plain form
19838 -36878 -31368 23449 86564 60831 13657 -14525 -44934 -20675 13449 4541 -39473 -34863
19826 -34863 -47850 -7038 48227 87924 48091 -50 5782 9513 1732 -23729 14507 -26987
19814 -26987 -51118 -30509 -65265 -77767 -23509 13295 19736 60716 58557 16892 -38555 -49903
19802 -49903 -72312 -64218 -24103 -2276 39498 63758 43477 56319 68202 58852 18300 -38902
19790 -38902 4733 28668 51045 27086 -8745 -57051 -15025 5117 20242 14686 22642 2869
19778 2869 -40142 -60145 -56440 -53911 -5403 -24205 9928 25133 15614 36691 23023 -16607
19766 -16607 21036 49991 30207 16214 16955 17145 -11970 2735 16377 -15744 637 -5889 -4303
19753 -4303 37435 61962 31060 13908 -11492 -17864 32785 45461 -5288 -16006 -12415 -69165
$$ packed form
19838c6878N510N4817O3115k5733m7174k8182l0409K4259L4124q908m4014M610
19826c4863j2987M0812N5265L9697l9833m8141N832L731p781k5461L8236m1494
19814b6987k4131K0609l4756j2502N4258L6804O441M0980k159m1665n5447j1348
19802d9903k2409Q094M0115K1827M1774K4260k0281J2842J1883r350m0552n7202
19790c8902M3635K3935K2377k3959l5831m8306M2026K0142J5125n556P956j9773
19778B869m3011k0003L705K529M8508j8802L4133J5205r519K1077j3668l9630
19766a6607L7643K8955j9784j3993P41J90k9115J4705J3642l2121J6381o526J586
19753d303M1738K4527l0902j7152k5400o372N0649J2676n0749j0718L591n6750
$$ plain form
19741 -69165 -55431 -12129 -4055 -16185 -1543 31013 21918 14286 4440 1606 -13753 -7964 6557
19728 6557 3707 16617 42896 15143 4973 16204 -37335 -5257 15859 47568 73531 47181
19716 47181 17025 25860 42151 65535 49580 27912 -29789 10570 25003 6362 -26703 -28383
19704 -28383 -17574 15422 29522 -4060 12494 70684 63000 58238 87048 91968 56463 6825
19692 6825 -9449 -17839 4198 7353 27408 37007 22846 4486 -11417 -2133 29052 39400 14496
19679 14496 -17080 -14256 -4301 21456 22744 -1962 33057 76891 37872 44435 20329 30847
19667 30847 22934 -13438 -20104 -33280 -39781 -21131 12818 32343 19991 19762 81341 113987 53224
19654 53224 -15813 14138 5462 10959 -13373 -41793 -37917 -37515 -48375 -26901 8645 18870 17812
$$ packed form
19741f9165J3734M3302Q074j2130J4642L2556r095p632r846k834j5359N789J4521
19728F557k850J2910K6279k7753j0170J1231n3539L2078K1116L1709K5963k6350
19716D7181l0156Q835J6291K3384j5955k1668n7701M0359J4433j8641l3065j680
19704b8383J0809L2996J4100l3582J6554N8190p684m762K8810M920l5505m9638
19692F825j6274q390K2037L155K0055R599j4161j8360j5903R284L1185J0348k4904
19679A4496l1576K824R955K5757J288k4706L5019M3834l9019O563k4106J0518
19667C0847p913l6372o666j3176o501J8650L3949J9525j2352k29O1579L2646o0763
19654E3224o9037K9951q676N497k4332k8420L876M02j0860K1474L5546J0225j058
$$ plain form
19641 17812 56661 38457 92013 121468 101901 116706 88843 29810 -11340 -21465 -47134 -57876
19629 -57876 -36897 -131124 -159105 -103030 -107633 -78436 -63878 -60110 -27158 179 73107 67930
19617 67930 60423 68496 -5702 -682 8155 315 -10666 -58212 -79047 -51308 -31551 -14266 33119
19604 33119 4987 -42862 -44417 -19915 11651 3327 7251 -30607 -57726 -50031 -69097 -47114
19592 -47114 -66685 -100260 -75642 -73528 -63650 -38452 -49076 -52559 -23748 9182 8801 -9328 -20073
19579 -20073 4209 10384 -23101 -37691 -29805 28165 2265 -23194 -49175 -42104 -55372 -33042
19567 -33042 -15931 -28440 -27259 -39688 -17817 -35598 -88616 -84944 -37266 -8738 40049 25182
19555 25182 -24517 -44052 -59830 -55314 -43656 -41455 -50684 -37843 -83094 -83612 -15860 25672 34043
$$ packed form
19641A7812L8849j8204N3556K9455j9567J4805k7863n9033m1150j0125k5669j0742
19629e7876K0979r4227k7981N6075m603K9197J4558L768L2952K7337P2928n177
19617F7930p507Q073p4198N020Q837p840j0981m7546k0835K7739J9757J7285M7385
19604C3119k8132m7849j555K4502L1566q324L924l7858k7119P695j9066K1983
19592d7114j9571l3575K4618K114R878K5198j0624l483K8811L2930l81j8129j0745
19579b0073K4282O175l3485j4590P886N7970k5900k5459k5981P071j3268K2330
19567c3042J7111j2509J181j2429K1871j7781n3018L672M7678K8528M8787j4867
19555B5182m9699j9535j5778M516J1658K201r229J2841m5251n18O7752M1532Q371
$$ plain form
19542 34043 28624 8828 -9948 -49097 -101838 -60473 -1187 35914 1788 13946 13846 23834
19530 23834 61108 14916 2306 11964 12634 -31767 -35627 -13758 8911 34906 36696 45265 65201
19517 65201 115303 84652 72296 85646 46408 58564 97722 147616 131092 55217 50396 55906
19505 55906 59951 93958 98797 65563 47538 59806 76543 88417 45253 -5417 -4379 36131
19493 36131 10976 10702 20153 53452 99151 97656 111518 113148 168468 222173 244984 259640 333081
19480 333081 363222 363809 359989 343436 292222 249956 222020 135382 90390 116914 138460 182791
19468 182791 203717 185851 176303 139474 167454 203991 246871 289513 318871 288684 350098 433489
19456 433489 481375 490869 471610 418799 378489 294390 248681 296833 289466 284550 307778 323470
$$ packed form
19542C4043n419j9796j8776l9149n2741M1365N9286L7101l4126J2158j00R988
19530B3834L7274m6192j2610R658O70m4401l860K1869K2669K5995J790Q569J9936
19517F5201N0102l0651j2356J3350l9238J2156L9158M9894j6524p5875m821N510
19505E5906M045L4007M839l3234j8025J2268J6737J1874m3164n0670J038M0510
19493C6131k5155k74R451L3299M5699j495J3862J630N5320N3705K2811J4656P3441
19480C33081L0141N87l820j6553n1214m2266k7936q6638m4992K6524K1546M4331
19468A82791K0926j7866r548l6829K7980L6537M2880M2642K9358l0187O1414Q3391
19456D33489M7886R494j9259n2811m0310q4099m5709M8152p367m916K3228J5692
$$ plain form
19444 323470 293816 272479 289862 304628 287949 263497 244945 216222 185945 171194 161154
19433 161154 163914 132163 117890 126466 138803 179006 245870 282026 317826 371393 410155 391092
19421 391092 367935 370975 407974 368842 302399 277741 199355 159152 214932 187999 179726 195832
19409 195832 186025 230667 228423 158789 107571 141822 155628 105291 65043 65729 82779 84836
19397 84836 45915 30231 20967 33747 53040 18884 -35243 -96647 -92552 -95956 -41530 -42952
19385 -42952 -17649 -18615 -18489 -49726 -59125 -32098 5107 12684 -51503 -32403 25147 59076 67083
19372 67083 79007 94492 39219 37376 85926 78473 6901 -21900 -14955 7994 -34029 -54753
19360 -54753 -57791 -64255 -36522 -64306 -87991 -68422 -49907 -36261 -22578 18111 46465 5120
$$ packed form
19444C23470k9654k1337J7383J4766j6679k4452j8552k8723l0277j4751j0040
19433A61154K760l1751j4273Q576J2337M0203O6864L6156L5800N3567L8762j9063
19421C91092k3157L040L6999l9132o6443k4658p8386m0203N5780k6933q273J6106
19409A95832r807M4642k244o9634n1218L4251J3806n0337m0248O86J7050K057
19397H4836l8921j5684r264J2780J9293l4156n4127o1404M095l404N4426j422
19385d2952K5303r66J26l1237r399K7027L7205P577o4187J9100N7550L3929Q007
19372F7083J1924J5485n5273j843M8550p453p1572k8801O945K2949m2023k0724
19360e4753l038o464K7733k7784k3685J9569J8515J3646J3683M0689K8354m1345
$$ plain form
19348 5120 -27594 -51599 -22823 -1118 8500 -11943 -28742 -11167 -816 -14917 -17513 -43422
19336 -43422 -49544 -33444 -9312 -37619 -49011 -45832 -6301 -15097 -44900 -53435 -40558 24668
19324 24668 51568 47907 34072 30402 17124 33644 37931 70840 63252 105770 92004 24063
19312 24063 -37562 -23484 40570 69674 25685 880 52699 43330 -8730 -5143 -27266 -24680
19300 -24680 -38216 -29368 -37634 1129 56381 89817 34897 25053 8037 18739 20638 -17350
19288 -17350 -57319 -72849 -29517 6022 -19964 46549 52046 24424 2015 5997 6066 -7152 -14648
19275 -14648 -28054 -14654 -17407 -1575 -15593 -23130 -7035 41476 35255 -16875 -36834 -46883
19263 -46883 -21789 46203 45916 -20685 -6624 -45924 -55234 -89306 -69351 -21293 17902 49745
$$ packed form
19348E120l2714k4005K8776K1705R618k0443j6799J7575J0351j4101k596k5909
19336d3422o122J6100K4132k8307j1392L179L9531q796k9803q535J2877O5226
19324B4668K6900l661j3835l670j3278J6520M287L2909p588M2518j3766o7941
19312B4063o1625J4078O4054K9104m3989k4805N1819r369n2060L587k2123K586
19300b4680j3536Q848q266L8763N5252L3436n4920r844j7016J0702J899l7988
19288a7350l9969j5530M3332L5539k5986O6513N497k7622k2409L982O9j3218p496
19275a4648j3406J3400k753J5832j4018p537J6095M8511o221n2130j9959j0049
19263d6883K5094O7992k87o6601J4061l9300r310l4072J9955M8058L9195L1843
$$ plain form
19251 49745 12374 25468 46390 34503 -39548 -44609 -49783 -7561 10037 67592 113046 55053
19239 55053 12603 20898 22376 -12160 -42285 -52456 -52395 -77214 -40026 36847 80899 57813 48137
19226 48137 95161 50851 -20191 -36460 -18610 -2299 27054 57450 84720 97595 96947 110723
19214 110723 87072 75597 64360 94519 76772 61038 14498 27057 90103 101152 53774
19203 53774 66539 54337 59955 55028 -11065 -68942 -64530 -31820 15732 4186 -9056 22947
19191 22947 24427 26557 71288 115201 115543 70914 103786 165048 161498 153029 108181 46522 60497
19178 60497 96597 26834 -13435 69081 101773 121748 101957 110358 134183 114058 87000 59216
19166 59216 40719 38639 49939 27906 43564 58653 86700 83785 76690 58498 71975 75249
$$ packed form
19251D9745l7371J3094K0922j1887p4051n061n174M2222J7598N7555M5454n7993
19239E5053m2450Q295J478l4536l0125j0171O1k4819L7188P6873M4052k3086r676
19226D8137M7024m4310p1042j6269J7850J6311K9353L0396K7270J2875o48J3776
19214A10723k3651j1475j1237L0159j7747j5734m6540J2559O3046J1049m7378
19203E3774J2765j2202N618m927o6093n7877M412L2710M7552j1546j3242L2003
19191B2947J480K130M4731M3913L42m4629L2872O1262l550q469m4848o1659J3975
19178F0497L6100o9763m0269Q2516L2692J9975j9791Q401K3825k0125k7058k7784
19166E9216j8497k080J1300k2033J5658J5089K8047k915p095j8192J3477L274
$$ plain form
19154 75249 61203 65441 59077 9476 -40362 -32516 11480 76358 102991 100082 78401 61629
19142 61629 49626 24873 -6339 -15195 17306 -4220 7368 -6928 31953 65286 79170 43682
19130 43682 33604 4600 18271 -29023 15260 43403 57409 55162 48102 28792 41159 77567
19118 77567 30273 -15816 -28054 -3748 -5578 1394 21611 102291 143620 124117 54895 11678
19106 11678 -7092 -139 12046 -5541 25893 53234 77373 108123 110949 106937 102882 132626
19094 132626 133674 189323 218201 167585 157719 190016 200932 200533 208727 154152 148117 180188 169285
19081 169285 165584 160879 213747 224610 192102 167497 156207 179883 185890 186106 177761 199318 168981
19068 168981 126603 129514 131942 99538 165128 253466 309075 353628 334932 350344 308619 258887
$$ packed form
19154G5249j4046M238o364m9601m9838P846M3996O4878K6633k909k1681j6772
19142F1629j2003k4753l1212q856L2501k1526J1588j4296L8881L3333J3884l5488
19130D3682j0078k9004J3671m7294M4283K8143J4006k247p060j9310J2367L6408
19118G7567m7294m6089j2238K4306j830O972K0217Q0680M1329j9503o9222m3217
19106A1678j8770O953J2185j7587L1434K7341K4139L0750K826m012m055K9744
19094A32626J048N5649K8878n0616r866L2297J0916l99Q194n4575o035L2071j0903
19081A69285l701m705N2868J0863l2508k4605j1290K3676O007K16q345K1557l0337
19068A68981m2378K911K428l2404O5590Q8338N5609M4553j8696J5412m1725m9732
$$ plain form
19056 258887 251498 282136 292364 298211 319681 347345 379910 401441 487657 557573 606724 720184
19044 720184 866287 1003198 1153454 1273818 1291629 1230826 1115228 935364 775728 707402
19034 707402 668984 637281 580672 581382 589862 600559 624782 605222 631734 675210 700226 686599
19022 686599 694235 784364 814173 795931 850709 947412 1106729 1274907 1476450 1720593 2053808
19011 2053808 2561305 3257133 4262583 5610215 7172164 8329320 8692078 8342495 7395214
19002 7395214 6120686 5028501 4317525 3896894 3665949 3532068 3518388 3515184 3540305 3580131
18992 3580131 3644578 3757819 3916057 4152949 4529075 5055920 5801500 6847376 8290832
18983 8290832 10292904 13002151 16777801 22096375 29036694 37293650 46531690 55873869
$$ packed form
19056B58887p389L0638J0228N847K1470K7664L2565K1531Q6216O9916M9151J13460
19044G20184J46103J36911J50256J20364J7811o0803j15598j79864j59636o8326
19034G07402l8418l1703n6609P10Q480J0697K4223j9560K6512M3476K5016j3627
19022F86599P636R0129K9809j8242N4778R6703J59317J68178K01543K44143L33215
19011B053808N07497O95828J005450J347632J561949J157156L62758l49583r47281
19002G395214j274528j092185p10976m20631k30945j33881j3680l204K5121L9826
18992C580131O4447J13241J58238K36892L76126N26845P45580J045876J443456
18983H290832K002072K709247L775650N318574O940319Q256956R238040R342179
$$ plain form
18975 55873869 63787439 69030378 70909299 69148946 64386379 57579052 50013411 43201022
18967 43201022 37924586 34495476 33128034 34007985 37261563 43449995 53180561 65515491
18959 65515491 77295221 85004730 86249571 80553626 69523225 56453518 44579664
18952 44579664 35675101 29795889 26119331 23792070 22294256 21411214 21081398 21037013 21377440
18943 21377440 22209980 23668967 26107667 29648121 33911200 38565105 43113801 47847674
18935 47847674 52729077 57532838 61994685 64821543 65761646 64651744 61980586 58515558
18927 58515558 54733210 51084565 47991013 45983023 46054902 48907182 54670704 62726708
18919 62726708 72133898 81218326 88006239 91282181 90334812 85160717 76653983 66108668
$$ packed form
18975E5873869P913570N242939J878921j760353m762567o807327p565641o812389
18967D3201022n276436l429110j367442Q79951L253578O188432R730566J2334930
18959F5515491J1779730P709509J244841n695945j1030401j3069707j1873854
18952D4579664q904563n879212l676558k327261j497814q83042l29816m4385L40427
18943B1377440Q32540J458987K438700L540454M263079M653905M548696M733873
18935D7847674M881403M803761M461847K826858R40103j109902k671158l465028
18927E8515558l782348l648645l093552k007990P1879K852280N763522Q056004
18919F2726708R407190R084428O787913L275942r47369n174095q506734j0545315
$$ plain form
18911 66108668 55165744 45403753 37303205 31008288 26571462 23483152 21248645 19521545
18903 19521545 18068867 16745563 15529503 14412016 13377553 12450668 11666866 11063592
18895 11063592 10663508 10450970 10360534 10298818 10168573 10053042 9930089 9750192 9555076 9436666
18885 9436666 9285065 8930008 8482119 7909239 7251907 6651354 6183498 5778430 5372158
18876 5372158 5008554 4658232 4324695 4071932 3925992 3777793 3560143 3265289 2943006
18867 2943006 2634145 2325015 2043202 1824946 1678197 1585830 1500506 1393513 1314088 1284717
18857 1284717 1227717 1224866 1267406 1263754 1305185 1389321 1470108 1476392 1349940 1225574 1114450
18846 1114450 1021686 897987 834594 863984 866573 927630 1061201 1218578 1342295 1474530
$$ packed form
18911F6108668j0942924r761991q100548o294917m436826l088310k234507j727100
18903A9521545j452678j323304j216060j117487j034463r26885p83802o03274
18895A1063592m00084k12538r0436o1716j30245j15531j22953j79897j95116j18410
18885I436666j51601l55057m47889n72880o57332o00553m67856m05068m06272
18876E372158l63604l50322l33537k52763j45940j48199k17650k94854l22283
18867B943006l08861l09130k81813k18256j46749r2367q5324j06993p9425k9371
18857A284717n7000k851M2540l652M1431Q4136Q0787O284j26452j24366j11124
18846A114450r2764j23699o3393K9390K589O1057J33571J57377J23717J32235
$$ plain form
18836 1474530 1580623 1592733 1533284 1350917 1151408 948555 782396 699404 624990 588733
18826 588733 629710 618487 590457 601828 605140 603568 631414 647859 625536 581510 573675 573354
18814 573354 547588 510299 552246 640269 726517 816159 970289 1078359 1170312 1202377 1243562
18803 1243562 1199002 1101507 1051182 1050668 1035112 1049412 1019209 992995 997019 1028079 1031555 1020756
18791 1020756 961866 898878 885072 828402 758775 706089 714867 726620 721322 665316 610279 567337
18779 567337 519894 503220 472438 488982 506978 507766 492177 475305 496368 546092 614515 633616
18767 633616 680542 678534 681913 653026 607435 575487 585695 614850 674314 747921 804520 849204
18755 849204 856402 918768 970779 974820 983369 979889 956049 954893 969820 951178 916066 878876
$$ packed form
18836A474530J06093J2110n9449j82367j99509k02853j66159q2992p4414l6257
18826E88733M0977j1223k8030J1371L312j572K7846J6445k2323m4026p835l21
18814E73354k5766l7289M1947Q8023Q6248Q9642J54130J08070R1953L2065M1185
18803A243562m4560r7495n0325n14j5556J4300l0203k6214M024L1060L476j0799
18791A020756n8890o2988j3806n6670o9627n2686Q778J1753n298n6006n5037m2942
18779E67337m7443j6674l0782J6544J7996P88j5589j6872K1063M9724O8423J9101
18767F33616M6926k008L379k8887m5591l1948J0208K9155N9464P3607N6599M4684
18755H49204P198O2366N2011M041Q549l480k3840j156J4927j8642l5112l7190
$$ plain form
18743 878876 835148 839711 811092 740083 660160 638315 537687 466251 455718 443415 436976 441052
18731 441052 393736 332125 304862 279568 282835 271839 245123 243159 274992 262982 234004 237837
18719 237837 259182 234273 240270 240449 206822 195875 172831 176638 118584 103529 145074 139486
18707 139486 160781 139351 102669 101096 114739 145338 162334 131185 140977 143664 124645 125949
18695 125949 142433 170367 210056 239500 264532 249908 191655 219555 201538 215819 240481
18684 240481 317489 373464 364674 328767 304978 278723 259944 239527 222576 242276 268151 227433
18672 227433 230999 265921 215349 125389 83921 150231 151801 135306 101858 80608 69955 125751
18660 125751 175765 202403 159827 177569 134672 107829 128239 166270 186568 198656 200205 186734
$$ packed form
18743H78876m3728M563k8619p1009p9923k1845j00628p1436j0533j2303o439M076
18731D41052m7316o1611k7263k5294L267j0996k6716j964L1833j2010k8978L833
18719B37837K1345k4909N997J79l3627j0947k3044L807n8054j5055M1545n588
18707A39486K1295k1430l6682j573J3643L0599J6996l1149R792K687j9019J304
18695A25949J6484K7934L9689K9444K5032j4624n8253K7900j8017J4281K4662
18684B40481P7008N5975q790l5907k3789k6255j8779k0417j6951J9700K5875m0718
18672B27433L566L4922n0572q9960m1468O6310J570j6495l3448k1250j0653N5796
18660A25751N0014K6638m2576J7742m2897k6843K0410L8031K0298J2088J549j3471
$$ plain form
18648 186734 118861 90194 133994 151677 151859 161553 137280 102884 122273 157487 179199 195407
18636 195407 154830 136617 167709 145996 158336 205310 255970 253991 249722 219143 232225 149411
18624 149411 103320 58347 17889 14971 42460 51714 19542 34477 61567 105805 142476 128208
18612 128208 94234 98876 73988 76927 79177 85276 109732 120411 129135 125351 105901 60096 54170
18599 54170 133543 155176 172732 254118 290937 269940 320575 360247 429268 512634 516020 506395
18587 506395 485510 466735 403811 372097 340511 299518 246111 282169 289521 251221 223262 233659
18575 233659 259734 269131 326370 338238 346888 388948 403564 453151 459973 404343 435956 478259
18563 478259 468035 457253 473593 470796 504904 539154 523580 564012 600331 627433 626525 634319
$$ packed form
18648A86734o7873k8667M3800J7683J82R694k4273l4396J9389L5214K1712J6208
18636A95407m0577j8213L1092k1713J2340M6974N0660j979m269l0579J3082q2814
18624A49411m6091m4973m0458k918K7489R254l2172J4935K7090M4238L6671j4268
18612A28208l3974M642k4888K939K250O099K4456J0679Q724l784j9450m5805n926
18599E4170P9373K1633J7556Q1386L6819k0997N0635L9672O9021Q3366L386r625
18587E06395k0885j8775o2924l1714l1586m0993n3407L6058P352l8300k7959J0397
18575B33659K6075R397N7239J1868Q650M2060J4616M9587O822n5630L1613M2303
18563D78259j0224j0782J6340k797L4108L4250j5574M0432L6319K7102r08P794
$$ plain form
18551 634319 605572 553028 473719 480216 518456 540036 560654 572467 594085 633368 642034 663873
18539 663873 632652 619725 604742 550963 524443 486964 476884 493278 556407 612149 700487
18528 700487 748994 793452 782614 810877 820437 788378 785234 772269 760194 715303 717722 700248
18516 700248 647598 643346 692423 689996 649875 620417 661654 685808 682984 678862 757238 791651
18504 791651 744795 769064 834332 877359 939393 993988 1077467 1232125 1434005 1607220 1754682
18493 1754682 1825018 1837369 1859247 1808891 1761513 1782492 1852334 1957443 2124153 2343190 2589380
18482 2589380 2905043 3216477 3515322 3804623 4213090 4743638 5411258 6377708 7834622
18473 7834622 9942300 12706045 16338383 21102070 27647608 37278241 51699083 70777267
$$ packed form
18551F34319k8747n2544p9309O497L8240K1580K0618J1813K1618L9283Q666K1839
18539F63873l1221j2927j4983n3779k6520l7479j0080J6394O3129N5742Q8338
18528G00487M8507M4458j0838K8263R560l2059l144j2965j2075m4891K419j7474
18516G00248n2650m252M9077k427m0121k9458M1237K4154k824m122P8376L4413
18504G91651m6856K4269O5268M3027O2034N4595Q3479J54658K01880J73215J47462
18493A754682P0336J2351K1878n0356m7378K0979O9842J05109J66710K19037K46190
18482B589380L15663L11434K98845K89301M08467N30548O67620R66450J456914
18473G834622K107678K763745L632338M763687O545538R630633J4420842J9078184
$$ plain form
18465 70777267 91118689 110624939 125775425 129476787 121199385 105705946 85929306
18458 85929306 65755742 49896278 39456083 33017982 28923991 26167805 24349839 23146690
18450 23146690 22326962 21725072 21240842 20701549 19958640 19141176 18419545 17894742 17645043
18441 17645043 17926737 19012736 21116330 24464614 29276425 35909429 45086291 58339743
18433 58339743 78281899 107043591 141328440 175796287 207207969 224921486 220558716
18426 220558716 199143614 167687483 131305479 98586771 75269696 60562949 51275139
18419 51275139 45058280 40697015 37668910 35326208 33313040 31489093 29525402 27340496
18411 27340496 24996375 22731587 20509746 18511516 16713281 15053116 13611117 12373319
$$ packed form
18465G0777267K0341422J9506250J5150486L701362q277402j5493439j9776640
18458H5929306k0173564j5859464j0440195o438101m093991k756186j817966j203149
18450B3146690q19728o01890m84230n39293p42909q17464p21631n24803k49699
18441A7645043K81694J085999K103594L348284M811811O633004R176862J3253452
18433E8339743J9942156K8761692L4284849L4467847L1411682J7713517m362770
18426B20558716k1415102l1456131l6382004l2718708k3317075j4706747r287810
18419E1275139o216859m361265l028105k342702k013168j823947j963691k184906
18411B7340496k344121k264788k221841j998230j798235j660165j441999j237798
$$ plain form
18403 12373319 11305854 10500251 9887772 9437432 9090544 8721750 8280464 7791787 7271624
18394 7271624 6743964 6170110 5668481 5272804 4971451 4728466 4547582 4458080 4385506 4370954
18384 4370954 4355413 4305842 4297616 4294266 4218810 4091465 3967196 3900468 3912546 3964369 4018349
18373 4018349 4160274 4313436 4602900 5093802 5805515 6848296 8222869 9969706 12381230
18364 12381230 15840513 20926024 28043954 36185115 42808600 45739877 44607631 39967039
18356 39967039 33183365 26569263 21808624 19020248 17496308 16799201 16760387 17302369 18631268
18347 18631268 20859572 24222693 28998231 35350936 43633230 54739731 71069775 97297505
18339 97297505 138089074 186401410 226669109 248934472 243931908 214770857 172522456
$$ packed form
18403A2373319j067465q05603o12479m50340l46888l68794m41286m88677n20163
18394G271624n27660n73854n01629l95677l01353k42985j80884q9502p2574j4552
18384D370954j5541m9571q226l350p5456j27345j24269o6728J2078N1823N3980
18373D018349J41925J53162K89464M90902P11713J042781J374573J746837K411524
18364A2381230L459283N085511P117930Q141161O623485K931277j132246m640592
18356C9967039o783674o614102m760639k788376j523940o97107l8814N41982J328899
18347A8631268K228304L363121M775538O352705Q282294J1106501J6330044K6227730
18339I7297505M0791569M8312336M0267699K2265363n002564k9161051m2248401
$$ plain form
18332 172522456 129225357 95873969 75809341 64104497 56851118 52165156 49335911
18325 49335911 48130357 48403408 49808120 52131621 55519638 60512856 68305507 80732973
18317 80732973 100163096 127382098 157049411 178853923 185840264 177754571 157305937
18310 157305937 130806055 107771776 93974405 89422867 93269954 106745125 129792746
18303 129792746 154060246 172113695 177150224 166770048 145065737 119297184 96520181
18296 96520181 82530876 76911558 77247632 81832194 88837815 97621145 108969890 121025476
18288 121025476 130159587 136552111 141859413 143354472 139515074 133834684 128210449 121808791
18280 121808791 115659713 112859914 114689996 122181821 139403246 172441334 221898646
$$ packed form
18332A72522456m3297099l3351388k0064628j1704844p253379m685962k829245
18325D9335911j205554K73051J404712K323501L388017M993218P792651J2427466
18317H0732973J9430123K7219002K9667313K1804512O986341q085693k0448634
18310A57305937k6499882k3034279j3797371m551538L847087J3475171K3047621
18303A29792746K4267500J8053449N036529j0380176k1704311k5768553k2777003
18296I6520181j3989305n619318L36074M584562P005621Q783330J1348745J2055586
18288A21025476R134111O392524N307302J495059l839398n680390n624235o401658
18280A21808791o149078k799799J830082P491825J7221425L3038088M9457312
$$ plain form
18273 221898646 276512329 318961927 337713958 332634124 302263106 256039733 210615482
18266 210615482 172261206 140474457 116150797 97837546 84317330 75152311 69164377
18259 69164377 64942110 61247412 57179202 52702513 48130804 43717334 39785812 36412522
18251 36412522 33664193 31605395 30199105 29405559 29268049 29567505 30281078 31646076 33223550
18242 33223550 34286507 35073569 35767934 35410191 33786346 31701241 29338856 26340471
18234 26340471 23066841 20222789 17811344 15688679 13986167 12831202 12192170 11899857
18226 11899857 11813904 11894272 11917299 11654347 11140160 10442691 9459591 8403448 7423506 6573438
18216 6573438 5892130 5388249 4971956 4591717 4301096 4038682 3834595 3614684 3412252
$$ packed form
18273B21898646N4613683M2449598J8752031n079834l0371018m6223373m5424251
18266B10615482l8354276l1786749k4323660j8313251j3520216r165019n987934
18259F9164377m222267l694698m068210m476689m571709m413470l931522l373290
18251C6412522k748329k058798j406290p93546j37510K99456P13573J364998J577474
18242C3223550J062957P87062O94365l57743j623845k085105k362385k998385
18234B6340471l273630k844052k411445k122665j702512j154965o39032k92313
18226A1899857q5953Q0368K3027k62952n14187o97469r83100j056143r79942q50068
18216F573438o81308n03881m16293l80239k90621k62414k04087k19911k02432
$$ plain form
18207 3412252 3190355 2995702 2844152 2732388 2610697 2434933 2314779 2217638 2120016 2006495
18197 2006495 1897550 1846980 1750240 1719395 1705402 1666723 1633208 1610399 1549920 1526876 1492700
18186 1492700 1466496 1479082 1403607 1381915 1345014 1323024 1291470 1274107 1250934 1256371 1280283
18175 1280283 1281273 1284252 1288283 1242976 1204044 1136010 1112717 1135650 1103264 1064062 1052385 1016838
18163 1016838 1020583 1035860 1067385 1059027 1061998 1046321 1069822 1073782 1069634 1061257 1076611 1117447
18151 1117447 1071055 1077891 1063451 1043204 1037879 1088600 1101302 1097406 1121045 1134636 1216699 1217008
18139 1217008 1175647 1166095 1184425 1160597 1152336 1166435 1206027 1280363 1316511 1323066 1418805 1529693
18127 1529693 1624767 1661288 1758005 1928519 2093829 2287163 2571139 2994446 3581347 4402099
$$ packed form
18207C412252k21897j94653j51550j11764j21691j75764j20154r7141r7622j13521
18197B006495j08945n0570r6740l0845j3993l8679l3515k2809o0479k3044l4176
18186A492700k6204J2586p5475k1692l6901k1990l1554j7363k3173N437K3912
18175A280283R90K979M031m5307l8932o8034k3293K2933l2386l9202j1677l5547
18163A016838L745J5277L1525q358K971j5677K3501L960m148q377J5354M0836
18151A117447m6392O836j4440k0247n325N0721J2702l896K3639J3591Q2063L09
18139A217008m1361r552J8330k3828q261J4099L9592P4336L6148O555R5739J10888
18127A529693R5074L6521R6717J70514J65310J93334K83976M23307N86901Q20752
$$ plain form
18117 4402099 5615212 7303620 9420893 12062823 15816012 21782209 32195987 48204437
18109 48204437 62189755 66583438 65097585 57228432 42524540 28868406 20890777 16580187
18101 16580187 13987397 12209641 10828409 9862367 9258023 8808266 8484170 7980427 7251973
18092 7251973 6497396 5841119 5224020 4639005 4149252 3780718 3415090 3121832 2830574
18083 2830574 2574607 2448310 2350246 2191012 2035744 1855537 1692491 1643020 1590819 1478111
18073 1478111 1328090 1212440 1120507 1051822 1012816 998601 983643 954307 900869 872504 884678
18062 884678 834874 757260 692050 634310 584090 533054 504026 514548 545942 531316 479937
18051 479937 450631 412633 405689 428511 432521 446015 426900 397226 403233 375498 393100 415922
$$ packed form
18117D402099J213113J688408K117273K641930L753189N966197J0413778J6008450
18109D8204437J3985318M393683j485853p869153j4703892j3656134p977629m310590
18101A6580187k592790j777756j381232r66042o04344m49757l24096n03743p28454
18092G251973p54577o56277o17099n85015m89753l68534l65628k93258k91258
18083B830574k55967j26297r8064j59234j55268j80207j63046m9471n2201j12708
18073A478111j50021j15650r1933o8685l9006j4215j4958k9336n3438k8365J2174
18062H84678m9804p7614o5210n7740n0220n1036k9028J0522L1394j4626n1379
18051D79937k9306l7998o944K2822M010J3494j9115k9674O007k7735J7602K2822
$$ plain form
18039 415922 433621 424122 376136 367750 359269 333981 356665 331015 283602 262930 298192 396468
18027 396468 410423 410681 382049 335033 364892 392247 374214 340222 325057 314821 323458 379568
18015 379568 398502 347838 327181 324900 316474 306848 321271 284679 313422 318050 294853 285036
18003 285036 280369 269913 246869 223862 237906 256335 255974 238477 251212 308430 296019 306468
17991 306468 318111 322484 311043 284731 261972 241556 205394 213061 308360 308527 257308 239869
17979 239869 227196 248486 259665 228246 236689 237541 285726 296746 253826 260896 268245 279878
17967 279878 270562 216656 166034 194184 279947 277013 254996 275214 237302 219669 219804 165914
17955 165914 144166 188484 235456 217651 157828 94828 127344 139763 130808 192359 192140 222753
$$ packed form
18039D15922J7699r499m7986q386q481k5288K2684k5650m7413k0672L5262R8276
18027C96468J3955K58k8632m7016K9859K7355j8033l3992j5165j0236Q637N6110
18015C79568J8934n0664k0657k281q426r626J4423l6592K8743M628k3197r817
18003B85036m667j0456k3044k3007J4044J8429l61j7497J2735N7218j2411J0449
17991C06468J1643M373j1441k6312k2759k0416l6162P667R5299J67n1219j7439
17979B39869j2673K1290J1179l1419Q443Q52M8185J1020m2920P070P349J1633
17967B79878r316n3906n0622K8150Q5763k934k2017K0218l7912j7633J35n3890
17955A65914k1748M4318M6972j7805n9823o3000L2516J2419q955O1551k19L0613
$$ plain form
17943 222753 266717 266518 210706 176302 190119 214209 210633 173416 156764 166665 197745 190394
17931 190394 150606 173627 187093 192486 201604 192526 216411 212886 181745 171474 192806 201032
17919 201032 235456 222215 207890 222071 204823 190592 194152 201257 155813 159641 181255 138119
17907 138119 70202 70213 73791 144032 182766 212286 201464 147243 91899 83048 91378 109006 122038
17894 122038 123750 112368 107351 103435 117927 165154 193418 212848 245148 267288 232055 188355
17882 188355 207478 259595 285570 281454 310591 418707 528498 685047 880342 1073812 1150333
17871 1150333 1159840 1118923 1002055 813029 619324 521124 468688 433248 354226 272734 225149
17860 225149 228840 256176 235322 203253 188167 245636 241684 177423 205214 279976 325074 327333
$$ packed form
17943B22753M3964j99n5812l4404J3817K4090l576l7217j6652R901L1080p351
17931A90394l9788K3021J3466N393R118r078K3885l525l1141j0271K1332Q226
17919B01032L4424j3241j4325J4181j7248j4231L560P105m5444L828K1614m3136
17907A38119o7917J1L578P0241L8734K9520j0822n4221n5344q851Q330J7628J3032
17894A22038J712j1382n017l916J4492M7227K8264J9430L2300K2140l5233m3700
17882A88355J9123N2117K5975m116K9137J08116J09791J56549J95295J93470P6521
17871A150333R507m0917j16868j89026j93705r8200n2436l5440p9022q1492m7585
17860B25149L691K7336k0854l2069j5086N7469l952o4261K7791P4762M5098K259
$$ plain form
17848 327333 337705 371331 435827 486940 660456 846026 1002942 1157137 1269467 1309945
17838 1309945 1277227 1239171 1179237 1078107 938679 756915 614600 578213 516864 449612
17828 449612 448375 455640 416940 402532 387339 334436 303916 246348 262357 276301 303189 291476
17816 291476 284736 248370 239445 269714 264500 235892 239457 342121 384268 405723 462168 579127
17804 579127 714568 929778 1130510 1315170 1433086 1437794 1366278 1268437 1234775 1234501 1276356
17793 1276356 1289626 1265519 1309166 1291237 1213433 1082009 1062982 1060094 988575 996209 1020639
17782 1020639 1011695 953175 876612 824568 796377 765286 718555 698855 649632 598867 617270
17771 617270 673312 737713 826119 983975 1164577 1194243 1134811 1035331 927086 789243 659696
$$ packed form
17848C27333J0372L3626O4496N1113J73516J85570J56916J54195J12330M0478
17838A309945l2718l8056n9934j01130j39428j81764j42315l6387o1349o7252
17828D49612j237P265l8700j4408j5193n2903l0520n7568J6009J3944K6888j1713
17816B91476o740l6366q925L0269n214k8608L565J02664M2147K1455N6445J16959
17804E79127J35441K15210K00732J84660J17916M708p1516r7841l3662k74M1855
17793A276356J3270k4107M3647j7929p7804j31424j9027k888p1519P634K4430
17782A020639q944n8520p6563n2044k8191l1091m6731j9700m9223n0765J8403
17771F17270N6042O4401Q8406J57856J80602K9666n9432r9480j08245j37843j29547
$$ plain form
17760 659696 554299 474321 494500 482387 397544 314065 323640 355241 405874 465418 493018
17749 493018 517616 578653 621716 664966 728707 771194 708463 705587 723995 675195 637001 709679
17737 709679 751576 712325 657805 643323 580594 479430 418683 362346 330834 337400 368370
17726 368370 339044 318332 298608 246801 218222 226752 213815 190415 185357 180554 176034 161573
17714 161573 171091 203056 166073 142571 158460 148776 112302 71519 67499 53099 39984 84122
17702 84122 102689 119050 127511 112262 90735 53673 74421 104176 122466 95140 79943 110017
17690 110017 116617 69822 75839 104996 53460 -5997 23628 33070 -1743 34795 32149 21511
17678 21511 39129 39389 66299 79293 56667 71231 82313 67539 102132 137695 164594 105270
$$ packed form
17760F59696j05397p9978K0179j2113q4843q3479R575L1601N0633N9544K7600
17749D93018K4598O1037M3063M3250O3741M2487o2731k876J8408m8800l8194P2678
17737G09679M1897l9251n4520j4482o2729j01164o0747n6337l1512O566L0970
17726C68370k9326k0712j9724n1807k8579Q530j2937k3400n058m803m520j4461
17714A61573R518L1965l6983k3502J5889r684l6474m0783m020j4400j3115M4138
17702H4122J8567J6361Q461j5249k1527l7062K0748K9755J8290k7326j5197L0074
17690A10017O600m6795O017K9157n1536n9457K9625R442l4813L6538k646j0638
17678B1511J7618K60K6910J2994k2626J4564J1082j4774L4593L5563K6899n9324
$$ plain form
17666 105270 71294 73255 105552 117973 91863 125789 127836 133760 109686 122650 155378 95338
17654 95338 90937 105038 58916 7289 45367 58209 51053 71920 103636 73335 51463 82082
17642 82082 115820 85149 25375 15400 62521 88755 132411 145052 102915 103740 72885 113317
17630 113317 110074 88141 78576 39989 276 -9446 -30905 -16059 23247 25400 40999 71936
17618 71936 44263 53974 47470 47668 55611 79772 89510 75620 66053 79257 50874 31672 58685
17605 58685 78857 39745 2231 23718 -6541 -12021 19700 49017 49244 54945 83463 58314
17593 58314 32816 21963 -8031 -47811 -33230 9908 3937 1114 39081 29726 51697 44866
17581 44866 11817 21475 54516 50067 16505 23496 -1901 9177 -5000 -28829 -5896 51437
$$ packed form
17666A05270l3976J961L2297J2421k6110L3926K047N924k4074J2964L2728o0040
17654I5338m401J4101m6122n1627L8078J2842p156K0867L1716l0301k1872L0619
17642H2082L3738l0671n9774r975M7121K6234M3656J2641m2137Q25l0855M0432
17630A13317l243k1933r565l8587l9713r722k1459J4846L9306K153J5599L0937
17618G1936k7673R711o504J98P943K4161R738j3890r567J3204k8383j9202K7013
17605E8685K0172l9112l7514K1487l0259n480L1721K9317K27N701K8518k5149
17593E8314k5498j0853k9994l9780J4581M3138n971k823L7967r355K1971o831
17581D4866l3049R658L3041m449l3562O991k5397J1078j4177k3829K2933N7333
$$ plain form
17569 51437 75158 68657 39468 25423 -13476 -1726 7017 -42298 -40735 -37302 -14055 -8260 -10762
17556 -10762 4767 14719 15132 -19231 -27333 -7520 70007 41228 867 21939 10751 9380 36926
17543 36926 85689 89031 68210 55248 15977 3187 21388 63429 64717 60607 40449 48500
17531 48500 65111 28954 7900 4936 5885 -3647 -8737 29126 51937 35744 37481 68556 60309
17518 60309 21302 14374 3040 -2663 -18127 -14013 -41284 -55663 -60262 -57704 -23482 22063 24118
17505 24118 17720 2723 -642 23094 -10977 -23888 -27797 -49045 -114116 -93815 -45541 5573
17493 5573 12921 25807 13875 19054 30104 2649 -33237 -9151 27954 49671 53081 37491
17481 37491 14591 42884 85676 76374 97053 63800 36037 17541 27658 60734 2318 -47868
$$ packed form
17569E1437K3721o501k9189j4045l8899J1750Q743m9315J563L433K3247N795k502
17556a0762J5529R952M13l4363q102J9813P7527k8779m0361K1072j1188j371K7546
17543C6926M8763L342k0821j2962l9271j2790J8201M2041J288m110k0158Q051
17531D8500J6611l6157k1054k964R49r532n090L7863K2811j6193J737L1075q247
17518F0309l9007o928j1334n703j5464M114k7271j4379m599K558L4222M5545K055
17505B4118o398j4997l365K3736l4071j2911l909k1248o5071K0301M8274N1114
17493E573P348J2886j1932N179J1050k7455l5886K4086L7105K1717L410j5590
17481C7491k2900K8293M2792r302K0679l3253k7763j8496J0117L3076n8416n0186
$$ plain form
17469 -47868 -67212 -65736 -51370 -47702 6043 -5976 -11262 -47351 -27407 25662 50629 72609
17457 72609 94022 108630 40395 32245 71176 57318 19167 29100 97205 135484 117025 108687
17445 108687 138584 260878 381528 381059 320468 269491 219406 111773 16004 44451 88727
17434 88727 124410 146638 149416 121326 131774 148257 157512 164174 142745 137128 107895 81211
17422 81211 41694 -24086 -21392 -17525 9348 -13360 -12050 38015 54174 39216 21703 14770
17410 14770 18781 32373 81754 93932 54724 37764 65087 106342 106733 113853 150269 123758
17398 123758 103920 123156 113234 84185 -5242 -54689 -27806 19620 16123 -6521 7090 9927
17386 9927 455 -17382 -34655 -25709 -29397 -5755 11840 56898 56430 60338 45262 60212 74926
$$ packed form
17469d7868j9344J476J4366L668N3745j2019n286l6089J9944N3069K4967K1980
17457G2609K1413J4608o8235q150L8931j3858l8151R933O8105L8279j8459q338
17445A08687K9897J22294J20650m69o0591n0977n0085j07633r5769K8447M4276
17434H8727L5683K2228K778k8090J0448J6483R255O662k1429n617k9233k6684
17422H1211l9517o5780K694L867K6873k2708J310N0065J6159j4958j7513o933
17410A4770M011J3592M9381J2178l9208j6960K7323M1255L91P120L6416k6511
17398A23758j9838J9236r922k9049q9427m9447K6883M7426l497k2644J3611K837
17386I927r472j7837j7273Q946l688K3642J7595M5058m68L908j5076J4950J4714
$$ plain form
17373 74926 52604 30374 21074 -45527 -23314 -15657 -40788 -37726 -40313 -48811 -26773 8771 19388
17360 19388 16788 -43493 -59695 -53756 -52061 -20482 16300 34150 -15996 -53475 -14524 7523
17348 7523 889 -21565 -37909 -36518 -39810 -47101 -59423 -49856 -4918 -1605 54636 84151 20707
17335 20707 -1426 39220 33301 24072 36780 42907 11768 8929 -30502 -48449 -5697 -2442 -16136
17322 -16136 -20376 33566 96245 115397 53251 44797 21952 24478 -25148 -69392 -43076 -201
17310 -201 -30241 -44841 -31012 -21365 16730 -4022 -19689 -26885 -53671 -68362 -47843 6671
17298 6671 37522 42822 79523 19141 -34885 -41237 -31898 -25819 -31425 -60729 -74365 -45440 -7653
17285 -7653 -12458 -13790 -16589 -51498 -65939 -69971 -62306 -44356 -47560 -10798 -30115 -58117 -49657
$$ packed form
17373G4926k2322k2230r300o6601K2213P657k5131L062k587q498K2038L5544J0617
17360A9388k600o0281j6202N939J695L1579L6782J7850n0146l7479L8951K2047
17348G523o634k2454j6344J391l292p291j2322R567M4938L313N6241K9515o3444
17335B0707k2133M0646n919r229J2708O127l1139k839l9431j7947M2752L255j3694
17322a6136m240N3942O2679J9152o2146q454k2845K526m9626m4244K6316M2875
17310b01l0040j4600J3829R647L8095k0752j5667p196k6786j4691K0519N4514
17298F671L0851N300L6701o0382n4026o352R339O079n606k9304j3636K8925L7787
17285g653m805j332k799l4909j4441m032P665J7950l204L6762j9317k8002Q460
$$ plain form
17272 -49657 8641 21609 45052 14989 -26935 -63193 -52215 -10798 13302 15097 46576 75268
17260 75268 60673 50473 100830 61657 21428 17525 44893 19496 -29187 -44246 -25327 -45845
17248 -45845 -53572 -16837 24390 17855 -3395 18536 17381 37142 22806 37053 -26858 -29958
17236 -29958 -31718 -38166 -34316 -68911 -84885 -65109 -65249 -46113 -56847 -66309 29816 79588 84663
17223 84663 32903 10176 13618 -5605 -34916 -6476 89237 101485 49251 22918 757 17824
17211 17824 21100 50652 17026 38074 65346 112198 153953 160389 118640 40553 14695 -13825
17199 -13825 -64895 -63142 -17357 2392 6183 3734 28026 45344 24368 25997 30444 64966 80349
17186 80349 56319 -4326 -41713 -670 62603 63765 10486 9176 294 7147 21208 43798
$$ packed form
17272d9657N8298J2968K3443l0063m1924l6258J0978M1417K4100J795L1479K8692
17260G5268j4595j0200N0357l9173m0229l903K7368k5397m8683j5059J8919k0518
17248d5845p727L6735M1227o535k1250K1931j155J9761j4336J4247o3911l100
17236b9958j760o448L850l4595j5974J9776j40J9136j0734r462R6125M9772N075
17223H4663n1760k2727L442j9223k9311K8440R5713J2248n2234k6333k2161J7067
17211A7824L276K9552l3626K1048K7272M6852M1755O436m1749p8087k5858k8520
17199a3825n1070J753M5785J9749L791k449K4292J7318k0976J629M447L4522J5383
17186H0349k4030o0645l7387M1043O3273J162n3279j310q882O853J4061K2590
$$ plain form
17174 43798 37990 -9815 -14876 -13636 14752 15265 -14147 7260 7653 29325 33187 20446 21056 -1553
17160 -1553 -973 41920 -7398 -10945 -24784 -29322 -23622 -10338 -33512 -22778 10823 36697 56606
17147 56606 71188 38168 7427 -12391 -35854 -13690 7209 -3026 -39600 -46196 -48777 -14110
17135 -14110 -39502 -17356 12207 -14658 -29716 -52910 -80236 -71239 -49304 -59783 -31090 -30102
17123 -30102 -60616 -77876 -103500 -113264 -73475 19315 8554 -34121 14289 71952 51860 32127
17111 32127 57612 83974 36938 -25171 6873 -7205 -11957 -175 7661 23066 10885 29569
17099 29569 18986 29225 24792 57895 105016 95311 82161 90984 122923 61162 -11809 -71717
17087 -71717 -100723 -39450 -25535 -54257 -72498 -72634 -36343 -49289 -40377 -14630 -8268 -19238
$$ packed form
17174D3798n808m7805n061J240K8388N13k9412K1407L93K1672L862j2741O10k2609
17160a553N80M2893m9318l547j3839m538N700J3284k3174J0734L3601K5874J9909
17147E6606J4582l3020l0741j9818k3463K2164K0899j0235l6574o596k581L4667
17135a4110k5392K2146K9563k6865j5058k3194k7326Q997K1935j0479K8693R88
17123c0102l0514j7260k5624r764L9789R2790j0761m2675M8410N7663k0092j9733
17111C2127K5485K6362m7036o2109L2044j4078m752J1782P836J5405j2181J8684
17099B9569j0583J0239m433L3103M7121r705j3150Q823L1939o1761p2971n9908
17087g1717k9006O1273J3915k8722j8241j36L6291j2946Q912K5747O362j0970
$$ plain form
17075 -19238 -49981 19931 13002 35257 54580 87557 73323 58711 56562 95266 85712 100210
17063 100210 65418 47554 -23632 -29303 -7341 -17037 -11275 5797 48175 9151 494 2602
17051 2602 34281 64506 64597 48699 -1226 26706 7701 18501 35731 2362 -3326 40513 54970
17038 54970 12903 -12264 -25524 -26229 -26056 -39957 -55381 -51500 -39568 -13420 31917 43123 7649
17025 7649 -50922 -52212 -7366 -1250 -22632 46701 68911 46642 31843 35792 39569 15538 38154
17012 38154 29291 -42082 -22023 31780 30896 -44996 -31069 -23490 -35306 -50222 -26972 -16479
17000 -16479 -46869 -96132 -117681 -90039 -50717 -42321 -62992 -67121 -45453 -9042 47481 11713
16988 11713 -63295 -48215 -19546 -22466 8630 20227 -6430 -7100 6502 15252 14075 35801 25670
$$ packed form
17075a9238l0743O9912o929K2255J9323L2977j4234j4612k149L8704r554J4498
17063A00210l4792j7864p1186n671K1962r696N762J7072M2378l9024q657K108
17051B602L1679L0225R1j5898m9925K7932j9005J0800J7230l3369n688M3839J4457
17038E4970m2067k5167j3260p05J73j3901j5424L881J1932K6148M5337J1206l5474
17025G649n8571j290M4846O116k1382O9333K2210k2269j4799L949L777k4031K2616
17012C8154q863p1373K0059N3803q84p5892J3927P579j1816j4916K3250J0493
17000a6479l0390m9263k1549K7642L9322Q396k0671m129K1668L6411N6523l5768
16988A1713p5008J5080K8669k920L1096J1597k6657o70J3602Q750j177K1726j0131
$$ plain form
16975 25670 57157 38514 24233 8846 -3312 3215 59160 65154 18671 39111 40025 21646
16963 21646 16913 28624 46617 61921 64699 52990 -3611 -11065 -47959 -41929 1543 56836
16951 56836 67077 41066 -15836 -40205 -63386 -75951 -46297 5451 6082 2293 7214 8688 -4476
16938 -4476 15425 -13509 -33021 -23245 -15366 -41407 -71340 -65360 -45689 -69223 -112556 -84180
16926 -84180 -36141 -74321 -61103 -40857 -27413 5601 64714 55340 12246 49385 75533 54714
16914 54714 15155 33493 23051 23622 24701 4812 -18483 587 2467 12698 27537 39689
16902 39689 21256 1363 -741 16854 -1728 46195 75837 67167 45134 78658 102637 65044
16890 65044 4335 19856 57173 49973 14083 -45415 -27392 14524 -7990 -18382 27118 55931
$$ packed form
16975B5670L1487j8643j4281j5387j2158O527N5945N994m6483K0440R14j8379
16963B1646m733J1711J7993J5304K778j1709n6601p454l6894O030M3472N5293
16951E6836J0241k6011n6902k4369k3181j2565K9654N1748O31l789M921J474j3164
16938d476J9901k8934j9512R776P879k6041k9933N980J9671k3534m3333K8376
16926h4180M8039l8180J3218K0246J3444L3014N9113r374m3094L7139K6148k0819
16914E4714l9559J8338j0442N71J079j9889k3295J9070J880J0231J4839J2152
16902C9689j8433j9893k104J7595j8582M7923K9642q670k2033L3524K3979l7593
16890F5044o0709J5521L7317p200l5890n9498J8023M1916k2514j0392M5500K8813
$$ plain form
16878 55931 41737 4680 -1865 740 54286 61711 33646 25444 -7009 -72399 -43766 17669
16866 17669 64438 66884 90467 59411 43626 41745 51560 15317 17062 11168 -45227 -65792 -29904
16853 -29904 21645 28581 6923 -10425 -33698 -42316 -70221 -56092 -31863 -1324 -18441 12801
16841 12801 55995 14018 22690 -30898 -75571 -43207 -21213 8062 25639 8908 62073 31973
16829 31973 22038 -2714 11819 43903 54646 46536 66704 59081 59714 98996 81738 57306 53430
16816 53430 54036 24398 12190 3297 22206 35168 7297 32114 65030 70740 69669 36686 30348
16803 30348 -11864 -13571 -29663 -13425 5432 29924 31704 54141 42554 50510 52055 9494
16791 9494 -20033 25063 60194 22464 -30157 -35433 -28393 11385 52120 14322 -28640 -50662
$$ packed form
16878E5931j4194l7057o545K605N3546P425k8065q202l2453o5390K8633O1435
16866A7669M6769K446K3583l1056j5785j881R815l6243J745n894n6395k0565L5888
16853b9904N1549O936k1658j7348k3273q618k7905J4129K4229L0539j7117L1242
16841A2801M3194m1977Q672n3588m4673L2364K1994K9275J7577j6731N3165l0100
16829C1973r935k4752J4533L2084J0743q110K0168p623O33L9282j7258k4432l876
16816E3430O06k9638j2208q893J8909J2962k7871K4817L2916N710j071l2983o338
16803C0348m2212j707j6092J6238J8857K4492J780K2437j1587P956J545m2561
16791I494k9527M5096L5131l7730n2621n276P040L9778M0735l7798m2962k2022
$$ plain form
16779 -50662 -78152 -62529 -29197 -46421 -34681 -10507 32928 56251 15373 -23693 -41749 -30340
16767 -30340 -55625 -70624 -34711 19195 4137 -2921 7705 47138 39206 -5274 -14374 25200
16755 25200 44090 12697 -55103 -58569 -43365 -55856 -51066 1920 1359 -35290 -29507 -9227 -46151
16742 -46151 -7324 35794 52853 89153 28087 -24901 -45601 -29195 -57600 -88914 -4162 36871
16730 36871 -15788 -66849 -59475 -43638 -50712 -45917 19948 53476 50923 22607 -11677 27353
16718 27353 44467 38030 36507 59841 74555 45971 9801 -37655 -30036 2760 29792 25769
16706 25769 44956 17773 -49395 -62290 -23422 338 -21002 8465 4022 -60108 -72067 -23859
16694 -23859 -13969 -43160 -4634 39100 7408 -47447 -100475 -100761 -100974 -50536 -16328 21299 29147
$$ packed form
16779e0662k7490J5623L3332j7224J1740K4174M3435K3323m0878l9066j8056J1409
16767c0340k5285j4999L5913N3906j5058p058J0626L9433p932m4480r100L9574
16755B5200J8890l1393o7800l466J5204j2491M790N2986n61l6649N783K0280l6924
16742d6151L8827M3118J7059L6300o1066n2988k0700J6406k8405l1314Q4752M1033
16730C6871n2659n1061P374J5837p074M795O5865L3528k553k8316l4284L9030
16718B7353J7114o437j523K3334J4714k8584l6170m7456P619L2796K7032m023
16706B5769J9187k7183o7168j2895L8868K3760k1340K9467m443o4130j1959M8208
16694b3859R890k9191L8526M3734l1692n4855n3028k86k13N0438L4208L7627P848
$$ plain form
16681 29147 15954 12126 9252 34278 77538 52333 50362 83673 11287 -49639 -25428 15690
16669 15690 -964 22978 36847 37182 17741 -4444 -7697 -3253 -49309 -44092 1325 71736 48034
16656 48034 -8047 -36503 -30318 -40697 56110 69967 36615 65754 56424 17639 33287 55825
16644 55825 43127 -11616 -25575 -24830 13984 22836 -63076 -59247 293 -14700 -23343 -61507 -83131
16631 -83131 -15611 33103 40277 26639 50945 37415 43228 42761 49349 31645 3294 14917 22077
16618 22077 3898 -13288 -17414 -2102 12249 31148 64567 48863 44491 -333 13279 41371
16606 41371 78141 93929 17308 -11408 24878 22192 35053 85410 75795 90148 80464 53313
16594 53313 15442 32871 68462 44746 -12964 -53507 -49231 -30138 -25078 184 18135 -11382
$$ packed form
16681B9147j3193l828k874K5026M3260k5205j971L3311p2386o0926K4211M1118
16669A5690j6654K3942J3869L35j9441k2185l253M444m6056N217M5417P0411k3702
16656D8034n6081k8456O185j0379R6807J3857l3352K9139r330l8785J5648K2538
16644E5825j2698n4743j3959P45L8814Q852q5912L829N9540j4993q643l8164k1624
16631h3131O7520M8714P174j3638K4306j3530N813m67O588j7704k8351J1623P160
16618B2077j8179j7186m126J5312J4351J8899L3419j5704m372m4824J3612K8092
16606D1371L6770J5788p6621k8716L6286k686J2861N0357r615J4353r684k7151
16594E3313l7871J7429L5591k3716n7710m0543M276J9093N060K5262J7951k9517
$$ plain form
16582 -11382 -58795 -36214 6509 -2647 16857 43233 17458 3545 -12174 -37232 -64414 -15714
16570 -15714 -32409 -21078 8960 31298 20097 -58357 -42999 -8305 13881 25333 27562 10631
16558 10631 6083 47969 63436 40667 15354 40412 70176 79774 89713 61712 63612 35841
16546 35841 26073 54023 11771 -15398 44418 70546 38279 35644 19332 29654 8146 -16254
16534 -16254 -42578 -36765 -12313 -38682 -58443 -27129 12229 21663 15295 48863 51571 12775
16522 12775 -32084 -84920 -73285 -71352 -83735 -40627 27798 58672 34622 -7684 10583 62631
16510 62631 50542 940 -23013 4094 -4974 -2711 13435 -16666 -13697 -39988 -81079 -78904
16498 -78904 -63961 -64867 -36695 3917 17755 64666 76971 62674 59946 37932 21816 45246
$$ packed form
16582a1382m7413K2581M2723r156J9504K6376k5775j3913j5719k5058k7182M8700
16570a5714j6695J1331L0038K2338j1201p8454J5358L4694K2186J1452K229j6931
16558A0631m548M1886J5467k2769k5313K5058K9764R598R939k8001J900k7771
16546C5841r768K7950m2252k7169N9816K6128l2267k635j6312J0322k1508k4400
16534a6254k6324N813K4452k6369j9761L1314L9358R434o368L3568K708l8796
16522A2775m4859n2836J1635J933j2383M3108O8425L0874k4050m2306J8267N2048
16510F2631j2089m9602k3953K7107r068K263J6146l0101K969k6291m1091K175
16498g8904J4943r06K8172M0612J3838M6911J2305j4297k728k2014j6116K3430
$$ plain form
16486 45246 72883 58208 34347 15161 5202 47777 59754 28846 50685 76699 72725 76950
16474 76950 64194 34603 40440 43619 31168 9083 27583 29424 12402 53381 91026 56484
16462 56484 -39578 -61996 -24703 -24211 -40076 -3988 64622 84501 80036 87941 53731 31410
16450 31410 30331 78448 83386 99784 95555 40613 78327 60200 38078 7719 -33330 -81695
16438 -81695 -57587 -56803 -12230 8210 7942 15353 6082 45242 51625 27661 4699 -2886 -20059
16425 -20059 -39711 -20262 8087 29431 35711 47786 52029 34268 -489 5702 -25056 -58671
16413 -58671 -18568 -24172 -76961 -64375 2393 12515 11137 46900 73375 31830 10466 14868
16401 14868 16644 -642 20683 52210 75018 49333 32342 36234 47685 60471 13273 2882
$$ packed form
16486D5246K7637j4675k3861j9186r959M2575J1977l0908K1839K6014l974M225
16474G6950j2756k9591N837L179j2451k2085J8500J841j7022M0979L7645l4542
16462E6484r6062k2418L7293M92j5865L6088O8610J9879m465P905l4210k2321
16450C1410j079M8117M938J6398m229n4942L7714j8127k2122l0359m1049m8365
16438h1695K4108P84M4573K0440k68P411r271L9160O383k3964k2962p585j7173
16425b0059j9652J9449K8349K1344O280J2075M243j7761l4757O191l0758l3615
16413e8671M0103n604n2789J2586O6768J0122j378L5763K6475m1545k1364M402
16401A4868J776j7286K1325L1527K2808k5685j6991L892J1451J2786m7198j0391
$$ plain form
16389 2882 -19245 -22860 -20465 11854 6553 4539 34449 62317 31451 22639 20040 -2940 -37515
16376 -37515 -11439 -48650 -66643 -50962 -1625 38424 25642 37569 6450 -6225 -27497 -19264
16364 -19264 -1955 33108 68366 46685 71524 105402 75873 39097 58396 61065 17433 -9800
16352 -9800 -5066 18440 1834 -30677 -20508 -13717 7249 -8821 36212 66236 42102 -1343
16340 -1343 -9196 253 57866 49161 27547 -9751 -8081 -14502 -31443 -39585 -53253 -81803 -70615
16327 -70615 -47560 -46304 -28702 -7484 10995 24508 -13281 -15982 23875 15954 -13973 -29063
16315 -29063 6767 30253 28970 6763 -12248 -1354 35404 50772 31684 1523 -70353 -87937
16303 -87937 -67311 -89478 -74806 -37772 -13319 8494 8274 29462 9690 -9012 7368 -3764
$$ packed form
16389B882k2127l615K395L2319n301k014K9910K7868l0866q812k599k2980l4575
16376c7515K6076l7211j7993J5681M9337M0049j2782J1927l1119j2675k1272Q233
16364a9264J7309L5063L5258k1681K4839L3878k9529l6776J9299K669m3632k7233
16352i800M734K3506j6606l2511J0169O791K0966j6070M5033L0024k4134m3445
16340a343p853R449N7613q705k1614l7298J670o421j6941q142j3668k8550J1188
16327g0615K3055J256J7602K1218J8479J3513l7789k701L9857p921k9927j5090
16315b9063L5830K3486j283k2207j9011J0894L6758J5368j9088l0161p1876j7584
16303h7937K0626k2167J4672L7034K4453K1813k20K1188j9772j8702J6380j1132
$$ plain form
16291 -3764 -10837 -29803 -33533 -45524 -42807 20647 87433 78345 10825 -26449 -45453 4213 28609
16278 28609 46813 56608 49191 -11154 -32705 -40274 -23425 -19241 27065 45691 -11340 -32798
16266 -32798 -38855 -32259 4653 1496 -25315 -18179 20778 29382 29616 36581 9985 -31722 -55135
16253 -55135 -23183 -492 21626 10477 -19012 -31086 -22761 -61387 -130019 -103635 -59754 -20569
16241 -20569 32121 41981 42576 88379 61732 17639 -4887 592 400 -44428 -39370 9476 6170
16228 6170 21073 43854 38734 17790 -16376 -45410 -24334 -43399 -54580 -29762 -19932 -27049
16216 -27049 -34585 -51182 -51856 -55433 -58952 -54571 -46834 -53011 -57276 -49312 -28569 7697 38264 17562
16202 17562 -28623 -63723 -42353 8099 7615 11468 34618 57201 65375 6922 11838 -1373 -44936
$$ packed form
16291c764p073j8966l730j1991K717O3454O6786r088o7520l7274j9004M9666K4396
16278B8609J8204R795p417o0345k1551p569J6849M184M6306J8626n7031k1458
16266c2798o057O596L6912l157k6811P136L8957Q604K34O965k6596m1707k3413
16253e5135L1952K2691K2118j1149k9489j2074Q325l8626o8632K6384M3881L9185
16241b0569N2690R860N95M5803k6647m4093k2526N479j92m4828N058M8846l306
16228F170J4903K2781n120k0944l4166k9034K1076j9065j1181K4818R830p117
16216b7049p536j6597o74l577l519M381P737o177m265P964K0743L6266L0567k0702
16202A7562m6185l5100K1370N0452m84L853K3150K2583Q174n8453M916j3211m3563
$$ plain form
16189 -44936 -92090 -101850 -114138 -110532 -66540 -5850 8687 20172 29670 -16943 -33001 -4441
16177 -4441 -2447 10528 243 -8911 4059 33418 -42048 -72993 -32034 2843 -2609 10999
16165 10999 15558 22880 8738 1542 11748 30559 12472 -8382 2861 7671 4590 62345 107814
16152 107814 94780 93598 133767 78231 38144 -29850 -62248 -55544 -84995 -73253 -38474 -8821
16140 -8821 3265 17518 1552 -43877 -49835 14640 13670 8613 46328 -39481 -95867 -67086 -36005
16127 -36005 -48511 -22438 -12009 -4090 32705 73428 112056 104534 116954 92161 71343 43532
16115 43532 41855 18149 16574 26412 1363 8971 -9229 1723 -34778 -89747 -85054 -74844 -74151
16102 -74151 -72482 -72589 -37690 29726 38870 24448 19322 15505 52148 68972 6277 -24031 12943
$$ packed form
16189d4936m7154r760j2288L606M3992O0690J4537J1485R498m6613j6058K8560
16177d441J994J2975j0285r154J2970K9359p5466l0945M0959L4877n452J3608
16165A0999M559P322j4142p196J0206J8811j8087k0854J1243M810l081N7755M5469
16152A07814j3034j182M0169n5536m0087o7994l2398O704k9451J1742L4779K9653
16140h821J2086J4253j5966m5429n958O4475r70n057L7715q5809n6386K8781L1081
16127c6005j2506K6073J0429P919L6795M0723L8628p522J2420k4793k0818k7811
16115D3532j677k3706j575R838k5049P608j8200J0952l6501n4969M693J0210O93
16102g4151J669j07L4899O7416R144j4422n126l817L6643J6824o2695l0308L6974
$$ plain form
16089 12943 26744 18871 44518 74252 60891 42558 42468 12462 -5440 -1539 14239 24292 37404
16076 37404 84045 66099 46793 83829 69920 58970 100534 105808 56993 64729 85187 14472
16064 14472 4309 37602 25050 8401 2234 -15205 -18489 4199 -31036 -78632 -85639 -87399
16052 -87399 -95261 -75831 -57844 -76461 -125544 -80121 16597 39397 15009 1162 -31664 -28377
16040 -28377 -8638 -15808 -11392 17482 80642 110982 75623 24593 36388 39448 16490 22633
16028 22633 -6162 -29376 -31679 -32440 -19628 -1545 24482 -3026 -55325 -44134 35703 36962
16016 36962 40309 62497 5363 -39233 -29303 -835 9052 32218 61709 67284 69708 99392 104316
16003 104316 78698 28112 -23817 -9500 -2233 -7515 -9277 -18696 21948 1575 -38840 -14259
$$ packed form
16089A2943J3801p873K5647K9734j3361j8333r0l0006j7902L901J5778J0053J3112
16076C7404M6641j7946j9306L7036j3909j0950M1564N274m8815P736K0458p0715
16064A4472j0163L3293j2552j6649o167j7439l284K2688l5235m7596p007j760
16052h7399p862J9430J7987j8617m9083M5423R6718K2800k4388j3847l2826L287
16040b8377J9739p170M416K8874O3160L0340l5359n1030J1795L060k2958O143
16028B2633k8795k3214k303p61J2812J8083K6027k7508n2299J1191P9837J259
16016C6962L347K2188n7134m4596R930K8468R887K3166K9491N575K424K9684M924
16003A04316k5618n0586n1929J4317P267n282j762r419M0644k0373m0415K4581
$$ plain form
15991 -14259 -5136 29098 78354 77499 47897 13426 22135 32929 7818 26681 44898 -9665
15979 -9665 -6966 -13941 -14492 10998 -3966 -15978 -15458 8650 63617 84975 53013 22244 2118
15966 2118 -31632 -34154 -2595 15250 63063 65997 48038 49678 40711 39960 64128 75775 91966
15953 91966 112067 113561 73244 52946 -8333 -42368 -37404 14802 -14524 -52054 -30704 -15195
15941 -15195 28108 77578 91162 82229 84348 91095 70892 75533 69735 42385 20750 11684 -40686
15928 -40686 -89159 -107938 -56853 8806 -3977 -36247 -63878 -34820 -17833 -21802 -9079 -19850
15916 -19850 -4671 -4866 -417 50215 75356 52066 50255 42936 837 -15965 -619 46354 75330
15903 75330 55056 -3050 -1072 -2713 -3040 48162 65324 57093 44462 63674 71513 67997 101632
$$ packed form
15991a4259R123L4234M9256q55k9602l4471Q709J0794k5111J8863J8217n4563
15979i665K699o975n51K5490j4964j2012N20K4108N4967K1358l1962l0769k0126
15966B118l3750k522L1559J7845M7813K934j7959J640q967p51K4168J1647J6191
15953I1966K0101J494m0317k0298o1279l4035M964N2206k9326l7530K1350J5509
15941a5195M3303M9470J3584q933K119O747k0203M641n798k7350k1635r066n2370
15928d0686m8473j8779N1085O5659j2783l2270k7631K9058J6987l969J2723j0771
15916a9850J5179j95M449N0632K5141k3290j811p319m2099j6802J5346M6973K8976
15903G5330k0274n8106J978j641l27N1202J7162q231j2631J9212P839l516L3635
$$ plain form
15890 101632 102369 3446 -34239 -37768 -68475 -56077 -32355 -17321 -7600 -26408 -58409 -40312
15878 -40312 -10711 4469 2216 12213 47403 25602 17346 12275 32372 99181 63677 27766
15866 27766 14533 -12225 -11984 -28936 -51924 -25269 7595 34982 26591 -19714 -12972 -25271
15854 -25271 28908 17985 -16289 -21113 54805 46317 3875 -1260 3609 4284 -24580 -14528 -9467
15841 -9467 52223 31770 -15614 -42813 -58269 -40549 -9225 27328 8198 -26685 -26953 -34879
15829 -34879 -82521 -69447 -2928 33793 23526 -2746 -15481 -28661 27745 57262 95727 104564
15817 104564 96877 89111 44982 -17217 10691 22593 7839 41418 41007 35963 13665 -34656
15805 -34656 -49663 -39302 -73961 -74145 -29402 68851 70786 86835 87106 76461 62070 45538 33323
$$ packed form
15890A01632P37r8923l7685l529l0707J2398K3722J5034R721j8808l2001J8097
15878d0312K9601J5180k253R997L5190k1801q256n071K0097O6809l5504l5911
15866B7766j3233k6758K41j6952k2988K6655L2864K7387q391m6305O742j2299
15854b5271N4179j0923l4274m824P5918q488m2442n135M869O75k8864J0052N061
15841i467O1690k0453m7384k7199j5456J7720L1324L6553j9130l4883k68p926
15829c4879m7642J3074O6519L6721j0267k6272j2735j3180N6406K9517L8465Q837
15817A04564p687p766m4129o2199K7908J1902j4754L3579m11n044k2298m8321
15805c4656j5007J0361l4659j84M4743R8253J935J6049K71j0645j4391j6532j2215
$$ plain form
15792 33323 84136 92550 65649 95713 73793 44742 45768 14506 -43641 -38668 -35023 -54003
15780 -54003 -31856 -33583 -5060 50134 31662 36942 -4616 3550 -43411 -61941 -41400 -31957
15768 -31957 -41414 -21466 -4002 -5127 3071 5554 -38431 -51163 -38352 -18285 6738 42407
15756 42407 22678 10825 42346 78792 103616 55340 8639 -25643 -19863 -31020 -83224 -66853
15744 -66853 -50684 -27316 -10290 -64961 -45030 -25496 -26398 -31154 173 27669 5339 12632
15732 12632 -9023 -1865 32987 47199 43011 25709 -24168 -29708 -2824 -21382 -15250 -27226
15720 -27226 -44484 -23613 -10650 18500 -25017 -82129 -94120 -64980 -49471 -32458 -16599 -34693
15708 -34693 -23743 -96561 -89015 -71668 -43849 -2374 -30625 -54304 -19896 -2851 32303 6410
$$ packed form
15792C3323N0813Q414k6901L0064k1920k9051J026l1262n8147M973L645j8980
15780e4003K2147j727K8523N5194j8472N280m1558Q166m6961j8530K0541R443
15768c1957r457J9948J7464j125Q198K483m3985j2732J2811K0067K5023L5669
15756D2407j9729j1853L1521L6446K4824m8276m6701l4282N780j1157n2204J6371
15744f6853J6169K3368J7026n4671J9931J9534r02m756L1327K7496k2330P293
15732A2632k1655P158L4852J4212m188j7302m9877n540K6884j8558O132j1976
15720b7226j7258K0871J2963K9150m3517n7112j1991K9140J5509J7013J5859j8094
15708c4693J0950p2818P546J7347K7819M1475k8251k3679L4408J7045L5154k5893
$$ plain form
15696 6410 28087 26632 10096 -25159 -59066 -12438 25130 36800 -3242 -6599 9476 -10946
15684 -10946 -2152 24462 67228 66707 49092 -18820 -69656 -59757 -43022 -11784 -16245 -3559 -28466
15671 -28466 -81497 -109932 -122316 -83081 -90704 -68938 -62868 -57521 -40315 -28235 -21870 -57838
15659 -57838 -67582 -50451 -65556 -48281 10173 16644 3056 -34620 -55060 -23009 10738 41230
15647 41230 33439 -11671 -28506 -189 68 -23539 -25176 -36379 -9216 -734 -29479 -45251 -11075
15634 -11075 -8447 -28142 -74669 -55321 -16181 67536 66273 42591 44846 55377 45919 42005 36255
15621 36255 29870 -626 -2318 21371 25850 -25410 -42266 -10641 19976 28047 24456 26699 62967
15608 62967 51604 24717 26310 17571 -35030 -59574 -73972 -34814 3443 10275 -15322 -14021
$$ packed form
15696F410K1677j455j6536l5255l3907M6628L7568J1670m0042l357J6075k0422
15684a0946Q794K6614M2766n21j7615o7912n0836R899J6735L1238m461J2686k4907
15671b8466n3031k8435j2384L9235p623K1766O070N347J7206J2080O365l5968
15659e7838r744J7131j5105J7275N8454O471j3588l7676k0440L2051L3747L0492
15647D1230p791m5110j6835K8317K57k3607j637j1203K7163Q482k8745j5772L4176
15634a1075K628j9695m6527J9348L9140Q3717j263k3682K255J0531r458l914n750
15621C6255o385l0496j692K3689M479n1260j6856L1625L0617Q071l591K243L6268
15608F2967j1363k6887J593q739n2601k4544j4398L9158L8257O832k5597J301
$$ plain form
15596 -14021 -22600 2430 -10714 -27528 3021 67108 65181 30734 -3765 -21781 -31518 13525
15584 13525 -5997 -40301 -21450 -9447 -2425 -1778 5452 49646 81146 98464 81703 39741
15572 39741 35278 4932 -5564 -22254 -15418 -19191 -17992 28653 49505 37190 8610 -5313
15560 -5313 -15600 9611 17914 9081 30841 47144 10867 -33954 -51353 -32623 -21773 -4778
15548 -4778 -6549 -23087 -37117 -15209 -51358 -62898 -20518 -10768 -24040 9193 40640 96184
15536 96184 58840 40094 25327 27188 102132 106050 68032 21718 51548 53118 84099 22304
15524 22304 -8558 -17804 -13345 -34546 -14646 2745 48774 50487 40067 27564 -20692 -2365
15512 -2365 -25965 -28166 17641 21664 -14222 1366 38352 25946 25340 9750 8155 35505 63506
$$ packed form
15596a4021q579K5030j3144j6814L0549O4087j927l4447l4499j8016r737M5043
15584A3525j9522l4304J8851J2003P022O47P230M4194L1500J7318j6761m1962
15572C9741m463l0346j0496j6690O836l773J199M6645K0852j2315k8580j3923
15560e313j0287K5211Q303q833K1760J6303l6277m4821j7399J8730J0850J6995
15548d778j771j6538j4030K1908l6149j1540M2380R750j3272L3233L1447N5544
15536I6184l7344j8746j4767J861P4944L918l8018m6314K9830J570L0981o1795
15524B2304l0862r246M459k1201J9900J7391M6029J713j0420j2503m8256J8327
15512b365k3600k201M5807M023l5886J5588L6986j2406o06j5590j595K7350K8001
$$ plain form
15499 63506 60265 71991 81354 55765 2561 -235 52764 58955 66581 64001 50890 71112 44707
15486 44707 46660 25702 20974 48723 77347 90887 77489 88137 77197 75995 127923 92685
15474 92685 23983 24115 43603 37938 12634 -57712 -55767 -58117 -69413 -28431 -28211 -83789 -71513
15461 -71513 -9430 25212 69587 56160 60240 67949 50404 20715 -9316 -18551 -2447 28676
15449 28676 -6301 24226 50066 73308 110313 119786 65050 30433 4982 7643 34560 34304
15437 34304 54571 94683 110477 87544 49993 11062 13637 8693 34524 46480 32043 5206
15425 5206 -3688 -6418 -3041 -7406 -42231 -68115 3694 51168 24818 3805 7633 -19189 -38532
15412 -38532 -13458 22161 56203 5615 26956 45318 7519 -6500 -7375 29024 11369 17248
$$ packed form
15499F3506l241J1726R363k5589n3204k796N2999O191P626k580j3111K0222k6405
15486D4707J953k0958m728K7749K8624J3540j3398J0648j0940j202N1928l5238
15474I2685o8702J32J9488n665k5304p0346J945k350j1296M0982K20n5578J2276
15461g1513O2083L4642M4375j3427M080P709j7545k9689l0031r235J6104L1123
15449B8676l4977L0527K5840K3242L7005R473n4736l4617k5451K661K6917k56
15437C4304K0267M0112J5794k2933l7551l8931K575m944K5831J1956j4437k6837
15425E206q894k730L377m365l4825k5884P1809M7474k6350k1013L828k6822j9343
15412c8532K5074L5619L4042n0588K1341J8362l7799j4019q75L6399j7655N879
$$ plain form
15400 17248 86982 130307 88285 13949 -23956 -36598 -51475 -74483 -28598 -4523 -50072 -47990
15388 -47990 -18042 -16565 8048 18791 -43662 -33219 -34346 -18115 -11592 -21430 4356 44199
15376 44199 64513 17627 -6467 12813 25307 5113 26360 -903 32828 49060 37913 9522
15364 9522 -23714 -29778 -38114 43586 55957 23288 18508 35593 46486 38946 37340 26399 6227
15351 6227 893 -7129 9719 -18365 -2928 -19432 -2525 67408 73363 63127 30351 21927 62673
15338 62673 74832 97637 45340 -20460 -28481 20134 -5535 -33755 -8186 -2072 -4053 -4086 7773
15325 7773 -3972 -43312 -52829 -6203 54737 79915 92629 67164 71789 32641 14634 88846
15313 88846 110156 88103 70239 45345 45467 38864 33879 9438 1692 16220 7781 21956 11645
$$ packed form
15400A7248O9734M3325m2022p4336l7905j2642j4877k3008M5885K4075m5549K082
15388d7990K9948J477K4613J0743o2453J0443j127J6231O523r838K5786L9843
15376D4199K0314m6886k4094J9280J2494k0194K1247k7263L3731J6232j1147k8391
15364I522l3236o064q336Q1700J2371l2669m780J7085J0893p540j606j0941k0172
15351F227n334q022J6848k8084J5437j6504J6907O9933N955j0236l2776q424M0746
15338F2673J2159K2805n2297o5800q021M8615k5669k8220K5569O114j981l3J1859
15325G773j1745l9340r517M6626O0940K5178J2714k5465M625l9148j8007P4212
15313H8846K1310k2053j7864k4894J22o603m985k4441p746J4528q439J4175j0311
$$ plain form
15300 11645 -41669 -57340 -57821 -72164 -54452 -24618 -11579 -38012 -53142 -11799 23844 65450
15288 65450 57960 -20799 -16534 2293 16669 45666 69537 25860 9741 30356 18693 11364
15276 11364 -26921 -28965 -31044 -18760 73188 95896 83181 75730 71007 22085 41662 64839
15264 64839 22555 -10960 -36577 9658 5914 -25352 -12760 26478 4291 8677 5511 29511
15252 29511 68347 66804 70110 47659 6804 -13896 -6954 -1497 6920 11976 -9432 18681 17856
15239 17856 -24563 -57397 -75075 -78538 -65473 -93199 -119126 -96897 -76704 -56990 -56010 -20677
15227 -20677 39759 73890 110797 89076 46202 15840 2193 -2296 -63559 -104021 -57313 7600
15215 7600 34365 52905 59085 41615 -44515 -57118 -13837 -5765 13572 22409 14433 33396 27312
$$ packed form
15300A1645n3314j5671m81j4343J7712K9834J3039k6433j5130M1343L5643M1606
15288F5450p490p8759M265J8827J4376K8997K3871m3677j6119K0615j1663p329
15276A1364l8285k044k079J2284R1948K2708j2715p451m723m8922J9577K3177
15264F4839m2284l3515k5617M6235l744l1266J2592L9238k2187M386l166K4000
15252B9511L8836j543L306k2451m0855k0700O942N457Q417N056k1408K8113q25
15239A7856m2419l2834j7678l463J3065k7726k5927K2229K0193J9714R80L5333
15227b0677O0436L4131L6907k1721m2874l0362j3647m489o1263m0462M6708O4913
15215G600K6765J8540O180j7470q6130j2603M3281Q072J9337Q837p976J8963o084
$$ plain form
15202 27312 -32995 -53967 -26675 11525 26175 40659 -14973 -32522 6584 11573 1312 -38652
15190 -38652 -52581 -35325 -31680 -68367 -90456 -88205 -72523 -38061 -47109 -65097 -19215 -8326
15178 -8326 22336 23960 -9183 -32668 -66812 -77069 -20503 39609 52469 -18305 -15530 8307
15166 8307 -20449 -16177 533 -13095 -34883 -25286 15219 55907 26427 39070 57264 12516
15154 12516 -33396 -66080 -57816 -55572 -48324 -23790 -6424 35095 36860 42053 16082 31109 65726
15141 65726 72817 919 -32398 -82532 -78388 -36658 10257 -1321 -3925 -11354 -12365 -2921 9290
15128 9290 13240 40730 34387 34857 81562 90082 50634 23486 42848 34227 5448 21889 -11878
15115 -11878 -20955 4589 28907 23084 4758 26506 -6184 -16278 -24021 4542 29995 4751
$$ packed form
15202B7312o0307k0972K7292L8200J4650J4484n5632j7549L9106M989j0261l9964
15190c8652j3929J7256L645l6687k2089K251J5682L4462r048j7988M5882J0889
15178h326L0662J624l3143k3485l4144j0257N6566O0112J2860p0774K775K3837
15166H307k8756M272J6710j3628k1788R597M0505M0688k9480J2643J8194m4748
15154A2516m5912l2684Q264K244P248K4534J7366M1519J765N193k5971J5027L4617
15141F5726P091p1898l3317n0134M144M1730M6915j1578k604p429j011R444J2211
15128I290L950K7490o343M70M6705Q520l9448k7148J9362q621k8779J6441l3767
15115a1878r077K5544K4318n823j8326K1748l2690j0094p743K8563K5453k5244
$$ plain form
15103 4751 17243 3170 41813 68039 53915 85043 92098 56656 4846 -34682 -72853 -1637
15091 -1637 54263 18456 39294 29692 23178 61689 78347 106642 59870 14808 -1037 -5644
15079 -5644 17893 -7022 -41719 -23144 53464 51749 34433 26288 50818 69012 28082 25848
15067 25848 26929 -5611 11302 22482 32636 37427 34795 23894 64399 115680 81891 78019
15055 78019 6874 9342 -20844 -79353 -90552 -6329 38020 22497 -248 1288 59935 15893
15043 15893 -14751 -8758 28845 45705 -6035 -40805 30922 67103 63425 97474 126911 101742
15031 101742 34350 21005 62099 36404 9365 44929 19639 -26600 51987 55999 21788 -29544
15019 -29544 -7560 -22184 -1251 59010 101630 109124 88122 87659 60634 22608 -12870 -7767
$$ packed form
15103D751J2492j4073L8643K6226j4124L1128P055l5442n1810l9528l8171P1216
15091a637N5900l5807K0838r602o514L8511J6658K8295m6772m5062j5845m607
15079e644K3537k4915l4697J8575P6608j715j7316q145K4530J8194m0930k234
15067B5848J081l2540J6913J1180J0154M791k632j0901M0505N1281l3789l872
15055G8019p1145K468l0186n8509j1199Q4223M4349j5523k2745J536N8647m4042
15043A5893l0644N993L7603J6860n1740l4770P1727L6181l678L4049K9437k5169
15031A01742o7392j3345M1094k5695k7039L5564k5290m6239P8587M012l4211n1332
15019b9544K1984j4624K0933O0261M2620P494k1002m63k7025l8026l5478N103
$$ plain form
15007 -7767 72595 113207 74718 74639 75828 9465 21997 4642 -3193 29067 35886 37366 66179
14994 66179 54240 74911 85754 82184 72987 66291 104245 83666 86147 60691 56293 75833 81307
14981 81307 63974 53161 72920 58266 36846 64439 55711 45675 43850 62900 89788 107790
14969 107790 160697 165121 243306 284963 328980 421173 483947 545611 613803 752115 1002260
14958 1002260 1172799 1255382 1297480 1309236 1318556 1238319 1154664 1080071 934467 831400 741466
14947 741466 671656 588367 473091 433297 453497 431338 404844 389786 354583 353449 352267 425537
14935 425537 443286 453650 413345 362244 353200 367279 426593 475392 479398 434515 537366 679143
14923 679143 783804 910738 1078838 1228986 1352236 1407176 1402117 1395133 1266584 1061458
$$ packed form
15007g767Q0362M0612l8489p9J189o6363J2532j7355p835L2260O819J480K8813
14994F6179j1939K0671J0843l570r197o696L7954k0579K481k5456m398J9540N474
14981H1307j7333j0813J9759j4654k1420K7593q728j0036j825J9050K6888J8002
14969A07790N2907M424P8185M1657M4017R2193O2774O1664O8192J38312K50145
14958A002260J70539Q2583M2098J1756R320q0237q3655p4593j45604j03067q9934
14947G41466o9810q3289j15276l9794K0200k2159k6494j5058l5203j134j182P3270
14935D25537J7749J0364m0305n1101r044J4079N9314M8799M006m4883J02851J41777
14923F79143J04661J26934J68100J50148J23250N4940n059o984j28549k05126
$$ plain form
14913 1061458 925576 854568 719896 621177 579087 507816 430400 358006 333465 313119 308541
14902 308541 335738 315531 249554 232552 205900 174880 143429 131165 148833 150774 87812 28647
14890 28647 923 33612 34553 43911 67971 67364 68307 61208 51529 127205 131577 107702 83818 78805
14876 78805 30033 5397 51083 61355 52195 40977 -31757 -63706 -41874 -13783 -29163 -20964
14864 -20964 33410 70755 39511 24757 -25638 -64258 -91060 -7097 113894 135507 118499
14853 118499 99185 58953 52707 66748 70893 55392 5607 -31707 -3536 34066 66875 1737
14841 1737 -45435 -2087 36166 76482 33278 14038 43337 55195 44090 58823 99971 43634
14829 43634 18860 48463 78711 58710 42090 36817 67085 57392 38190 -6304 -22998 -28341
$$ packed form
14913A061458j35882p1008j34672r8719m2090p1271p7416p2394k4541k0346m578
14902C08541K7197k0207o5977j7002k6652l1020l1451j2264J7668J941o2962n9165
14890B8647k7724L2689R41R358K4060o07R43p099r679P5676M372k3875k3884n013
14876G8805m8772k4636M5686J0272r160j1218p2734l1949K1832K8091j5380Q199
14864b0964N4374L7345l1244j4754n0395l8620k6802Q3963J20991K1613j7008
14853A18499j9314m0232o246J4041M145j5501m9785l7314K8171L7602L2809o5138
14841A737m7172M3348L8253M0316m3204j9240K9299J1858j1105J4733M1148n6337
14829D3634k4774K9603L0248k0001j6620n273L0268r693j9202m4494j6694n343
$$ plain form
14817 -28341 -26522 8299 52855 63699 69840 86196 131355 92978 45769 59149 78167 107503
14805 107503 93102 41482 -18553 -21287 30855 39387 52770 83564 77515 96899 102014 70307
14793 70307 37243 -20725 -5405 29542 14712 9363 28388 78104 50646 -2557 4320 2935
14781 2935 -20177 -23376 -25213 -28628 -22734 5485 62980 133014 135641 90905 60301 90935 115972
14768 115972 114121 73662 67753 127775 154395 163013 160314 194370 185997 168918 165003 154682 152637
14755 152637 92509 135334 127789 112885 115877 118298 101359 56319 4406 29927 63109 50595
14743 50595 15742 -24255 43140 115953 148221 146325 154044 123008 106065 120138 115303 149414
14731 149414 145697 159867 191767 268488 283362 232931 214583 229512 259207 280763 290556 302129
$$ packed form
14817b8341J819L4821M4556J0844O141J6356M5159l8377m7209J3380J9018K9336
14805A07503j4401n1620o0035k734N2142Q532J3383L0794o049J9384N115l1707
14793G0307l3064n7968J5320L4947j4830n349J9025M9716k7458n3203O877j385
14781B935k3112l199j837l415N894K8219N7495P0034K627m4736l0604L0634K5037
14768A15972j851m0459n909O0022K6620Q618k699L4056q373j7079l915j0321k045
14755A52637o0128M2825p545j4904K992K421j6939m5040n1913K5521L3182j2514
14743E0595l4853l9997O7395P2813L2268j896P719l1036j6943J4073m835L4111
14731A49414l717J4170L1900P6721J4874n0431j8348J4929K9695K1556R793J1573
$$ plain form
14719 302129 314100 298995 264738 260486 236087 207851 164760 136387 96805 108730 110865 144811
14707 144811 116597 95763 81810 66886 92553 132567 138501 99056 58377 66641 64835 96291
14695 96291 97987 81937 72601 109349 79317 54619 -13600 -12483 44826 54751 51667 20915 42843
14682 42843 57290 44680 1246 -13226 9614 -19985 -6012 51389 60572 42154 79286 85039
14670 85039 46401 64873 112512 98053 80110 85730 65986 57079 52980 47457 69300 69939 -1565
14657 -1565 -30133 -48121 2248 14279 12406 2075 -10399 -33824 -10728 -12661 26318 81300
14645 81300 84487 71240 123541 118680 156625 203758 216955 222756 231294 237340 316682 356352 377693
14632 377693 394110 395445 371163 352207 348472 357723 374061 346068 331997 310489 329299 339135
$$ packed form
14719C02129J1971j5105l4257m252k4399k8236m3091k8373l9582J1925K135L3946
14707A44811k8214k0834j3953j4924K5667M0014N934l9445m0679Q264j806L1456
14695I6291J696j6050r336L6748l0032k4698o8219J117N7309R925l084l0752K1928
14682D2843J4447j2610m3434j4472K2840k9599J3973N7401R183j8418L7132N753
14670H5039l8638J8472M7639j4459j7943N620j9744q907m099n523K1843O39p1504
14657a565k8568j7988N0369J2031j873j0331j2474k3425K3096j933L8979N4982
14645H1300L187j3247N2301m861L7945M7133J3197N801Q538O046P9342L9670K1341
14632C77693J6417J335k4282j8956l735R251J6338k7993j4071k1508J8810R836
$$ plain form
14620 339135 362109 343622 304966 342808 363535 383299 406070 405633 386080 358515 355686 372093
14608 372093 375633 387172 374751 413520 456555 500931 561297 590856 608103 637769 686472 689529
14596 689529 752924 741790 742909 725378 733030 752433 740199 719028 708662 734689 795455 800211
14584 800211 768724 733045 725941 761795 780889 760881 831919 852509 897425 983556 1006980 970224
14572 970224 962704 973247 962528 948538 1027085 1103508 1074588 1111640 1159806 1159063 1184208 1223799
14560 1223799 1301986 1352521 1376347 1439313 1443546 1488136 1568626 1628643 1671840 1698386 1680005
14549 1680005 1683772 1712145 1807065 1900691 1977243 2119981 2255028 2363093 2504951 2604484 2748204
14538 2748204 2980385 3213226 3436061 3721742 4005522 4376706 4829642 5342261 5953053
$$ packed form
14620C39135K2974j8487l8656L7842K0727J9764K2771m37j9553k7565k829J6407
14608C72093L540J1539j2421L8769M3035M4376O0366K9559J7247K9666M8703L057
14596F89529O3395j1134J119j7531P652J9403j2234k1171j0366K6027O0766M756
14584H00211l1487l5679p104L5854J9094k0008P1038K0590M4916Q6131K3424l6756
14572I70224p520J0543j0719j3990P8547P6423k8920L7052M8166p43K5145L9591
14560A223799P8187N0535K3826O2966M233M4590Q0490O0017M3197K6546j8381
14549A680005L767K8373R4920R3626P6552J42738J35047J08065J41858R9533J43720
14538B748204K32181K32841K22835K85681K83780L71184M52936N12619O10792
$$ plain form
14529 5953053 6637793 7425839 8386834 9577932 10955961 12622075 14674343 17065096 19924263
14520 19924263 23401701 27681837 33023770 39758393 48430831 59785810 74590696 93992601
14512 93992601 118667705 147861606 179064734 208158962 230277427 242021587 242930576
14505 242930576 234810437 220051046 201428885 181417544 161414603 142217601 124931703
14498 124931703 110610707 99450618 90873241 84173364 78768861 74166362 70106995 66488038
14490 66488038 63305432 60591657 58357412 56612282 55444333 54918838 55192123 56346077
14482 56346077 58305752 61218313 65400980 71161135 78918190 89133995 102639090 120291680
14474 120291680 142780464 169627917 198406165 225190589 245289642 254890954 253168366
$$ packed form
14529E953053O84740P88046R60995J191098J378029J666114K052268K390753K859167
14520A9924263L477438M280136N341933O734623Q672438J1354979J4804886J9401905
14512I3992601K4675104K9193901L1203128K9094228K2118465J1744160R08989
14505B42930576q120139j4759391j8622161k0011341k0002941j9197002j7285898
14498A24931703j4320996j1160089q577377o699877n404503m602499m059367l618957
14490F6488038l182606k713775k234245j745130j167949n25495K73285J153954
14482E6346077J959675K912561M182667N760155P757055J0215805J3505095J7652590
14474A20291680K2488784K6847453K8778248K6784424K0099053R601312j722588
$$ plain form
14467 253168366 242001723 223958358 202045188 178910902 156216556 134786750 115489387
14460 115489387 99311995 86598836 76825722 69144729 62763239 57197646 52190757 47569919
14452 47569919 43247226 39200179 35424064 31926695 28746445 25856223 23347106 21160373
14444 21160373 19206074 17501984 15994817 14641265 13441702 12391914 11477735 10592445
14436 10592445 9735260 8991031 8347643 7783030 7228664 6736520 6277671 5841678 5501342
14427 5501342 5144435 4822378 4567720 4326610 4077230 3855814 3654854 3431506 3152756
14418 3152756 2937159 2712286 2528475 2394321 2253339 2066262 1892280 1773257 1684259 1626187
14408 1626187 1496465 1416957 1389047 1338287 1248397 1149142 1048103 1025501 1062184 1027738 1023066
$$ packed form
14467B53168366j1166643j8043365k1913170k3134286k2694346k1429806j9297363
14460A15489387j6177392j2713159r773114p680993o381490n565593n006889m620838
14452D7569919m322693m047047l776115l497369l180250k890222k509117k186733
14444B1160373j954299j704090j507167j353552j199563j049788r14179q85290
14436A0592445q57185p44229o43388n64613n54366m92144m58849m35993l40336
14427E501342l56907l22057k54658k41110k49380k21416k00960k23348k78750
14418C152756k15597k24873j83811j34154j40982j87077j73982j19023q8998n8072
14408A626187j29722p9508k7910n0760q9890r9255j01039k2602L6683l4446m672
$$ plain form
14397 1023066 1027363 1009945 952227 883774 857342 874730 852387 872609 868443 831912 846915 834195
14385 834195 830321 870171 943321 916169 897718 908222 859094 814457 832465 830466 776187 724108
14373 724108 706421 725014 714349 676116 667758 683867 716985 698526 637461 590163 620264 648762
14361 648762 655682 693389 722628 727724 712400 657423 658279 686549 714930 680812 647127 636505
14349 636505 661525 702616 676298 692705 731668 716054 678642 664503 665506 648085 626248 605916
14337 605916 639495 615609 599233 636210 606478 568962 616891 640769 595793 584394 598433
14326 598433 586042 597610 601491 580794 572576 582081 561129 559916 588427 620558 645954 625669
14314 625669 621552 605393 604315 608364 554700 511193 478273 472832 486455 439748 380336 399513
$$ packed form
14397A023066M297j7418n7718o8453k6432J7388k2343K0222m166l6531J5003j2720
14385H34195l874L9850P3150k7152j8451J0504m9128m4637J8008j999n4279n2079
14373G24108j7687J8593j0665l8233q358J6109L3118j8459o1065m7298L0101K8498
14361F48762O920L7707K9239N096j5324n4977Q56K8270K8381l4118l3685j0622
14349F36505K5020M1091k6318J6407L8963j5614l7412j4139J003j7421k1837k0332
14337F05916L3579k3886j6376L6977k9732l7516M7929K3878m4976j1399J4039
14326E98433j2391J1568L881k0697q218R505k0952j213K8511L2131K5396k0285
14314F25669m117j6159j078M049n3664m3507l2920n441J3623m6707n9412J9177
$$ plain form
14302 399513 458573 511263 449115 359502 375996 390690 370744 380272 383195 381098 355135 315968
14290 315968 359052 398038 372011 332956 327148 315086 323999 304693 267359 233797 252194 272046
14278 272046 291778 306943 286726 297255 294862 284674 314168 232566 206976 232529 218500 221516
14266 221516 206396 240706 236218 215459 187678 138443 135112 178493 215936 226374 184857 131138
14254 131138 122220 158655 148725 191371 217308 122657 106461 145368 146777 148041 106767 54840
14242 54840 87252 118846 132081 134400 133781 135986 124016 114541 135484 127400 118409 162602 165134
14229 165134 142678 130408 148995 167186 171274 152111 178855 179359 163513 167569 212703 253363
14217 253363 244357 231807 181895 169301 175402 165298 151884 150341 99514 154792 172231 168539
$$ packed form
14302C99513N9060N2690o2148q9613J6494J4694j9946R528K923k097k5963l9167
14290C15968M3084L8986k6027l9055n808j2062Q913j9306l7334l3562J8397J9852
14278B72046J9732J5165k0217J0529k393j0188K9494q1602k5590K5553j4029L016
14266B21516j5120L4310m488k0759k7781m9235l331M3381L7443J0438m1517n3719
14254A31138q918L6435r930M2646K5937r4651j6196L8907J409J264m1274n1927
14242E4840L2412L1594J3235K319o19K205j1970r475K0943q084q991M4193K532
14229A65134k2456j2270J8587J8191M088j9163K6744N04j5846M056M5134M0660
14217B53363r006j2550m9912j2594O101j0104j3414j543n0827N5278J7439l692
$$ plain form
14205 168539 182301 168615 176480 178465 148846 157090 157624 200242 187515 143632 146799 142694 110128
14192 110128 140783 165295 147172 122286 128553 190347 247927 222100 192990 196649 167898 179694
14180 179694 139412 91124 133874 181678 167054 142906 135646 179607 184645 173949 157107 73418
14168 73418 43423 59973 70760 50531 32166 25953 29247 64448 70796 70886 88436 81811 84423
14155 84423 95541 90061 121384 86607 56163 51076 85591 96384 34916 46014 64942 86597
14143 86597 122222 106435 79866 116736 128288 85779 -1925 13160 70905 31436 37508 53624
14131 53624 97102 140651 132102 127490 161264 170881 157601 127351 121252 129553 97903 23394 4718
14118 4718 32355 66638 94563 95341 106310 147182 162248 137428 105155 46020 82326 143610
$$ packed form
14205A68539J3762j3686P865J985k9619Q244N34M2618j2727m3883L167m105l2566
14192A10128L0655K4512j8123k4886O267O1794N7580k5827k9110L659k8751J1796
14180A79694m0282m8288M2750M7804j4624k4148p260M3961N038j0696j6842q3689
14168G3418k9995J6550J0787k0229j8365o213L294L5201O348R0J7550o625K612
14155H4423J1118n480L1323l4777l0444n087L4515J0793o1468J1098J8928K1655
14143H6597L5625j5787k6569L6870J1552m2509q7704J5085N7745l9469O072J6116
14131E3624M3478M3549q549m612L3774R617j3280l0250o099Q301l1650p4509j8676
14118D718K7637L4283K7925P78J0969M0872J5066k4820l2273n9135L6306O1284
$$ plain form
14106 143610 131553 103648 124123 100479 137312 148446 144864 122820 83862 80128 120614 156152
14094 156152 174535 178658 188889 212656 166611 86384 88157 110294 90131 116957 129869 77568
14082 77568 77639 84836 56049 57590 86649 74237 82570 84461 75918 89990 96118 102364 120484 100741
14068 100741 174114 207699 247433 263871 291105 341980 355566 382540 459685 544778 604575
14057 604575 694920 816636 934260 1056290 1261038 1343073 1356304 1369965 1344759 1262382 1207195
14046 1207195 1077854 955764 815026 710164 638216 611070 610021 605804 564527 505939 512433
14035 512433 481669 404379 322089 302945 301064 313163 351340 391134 397703 417217 438920 477653
14023 477653 502394 588951 613301 668851 761147 879324 1033092 1170354 1302535 1367044 1406393
$$ packed form
14106A43610j2057k7905K0475k3644L6833J1134l582k2044l8958l734M0486L5538
14094A56152J8383M123J0231K3767m6045q0227J773K2137k0163K6826J2912n2301
14082G7568P1P197k8787J541K9059j2412Q333J891q543J4072O128O246J8120j9743
14068A00741P3373L3585L9734J6438K7234N0875J3586K6974P7145Q5093N9797
14057F04575R0345J21716J17624J22030K04748Q2035J3231J3661k5206q2377n5187
14046A207195j29341j22090j40738j04862p1948k7146j049m217m1277n8588O494
14035E12433l0764p7290q2290j9144j881J2099L8177L9794O569J9514K1703L8733
14023D77653K4741Q6557K4350N5550R2296J18177J53768J37262J32181O4509L9349
$$ plain form
14012 1406393 1393376 1327550 1168708 1006616 902210 819223 725255 646660 578206 529823 442271
14001 442271 384734 415305 403157 343753 293305 244495 234270 251536 275581 245243 181248
13990 181248 134691 129660 97251 71847 36090 51849 95926 129404 160327 176929 177453 177924
13978 177924 130592 69009 67512 84127 91505 36703 -19269 15979 68958 94622 82608 57113
13966 57113 49311 87850 104540 85640 80181 73367 48592 24892 37891 47807 79581 102092
13954 102092 64615 37197 22461 36668 48000 35588 18871 427 -29426 -30068 -6864 303
13942 303 -4956 30899 69091 67852 24792 -15978 10762 25795 13556 76622 134396 110526
13930 110526 47564 70567 99110 103467 71711 39998 40003 60176 94737 64230 13374 21743 57160
$$ packed form
14012A406393j3017o5826j58842j62092j04406q2987r3968p8595o8454m8383q7552
14001D42271n7537L0571j2148n9404n0448m8810j0225J7266K4045l0338o3995
13990A81248m6557n031l2409k5404l5757J5759M4077L3478L0923J6602N24M71
13978A77924m7332o1583j497J6615P378n4802n5972L5248N2979K5664j2014k5495
13966E7113p802L8539J6690j8900n459o814k4775k3700J2999R916L1774K2511
13954A02092l7477k7418j4736J4207J1332j2412j6717j8444k9853o42K3204P167
13942C03n259L5855L8192j239m3060m0770K6740J5033j2239O3066N7774k3870
13930A10526o2962K3003K8543M357l1756l1713NK0173L4561l0507n0856Q369L5417
$$ plain form
13917 57160 110808 71814 -3985 -11475 -1399 23225 62798 65868 76214 42861 22303 35031
13905 35031 87284 138570 119150 135152 153888 134354 77251 45423 7113 525 -20179 -12678
13893 -12678 -9981 -5014 48360 52175 51265 50218 52754 52869 53778 49419 18148 -23433 -35654 -3662
13879 -3662 31975 47229 36799 16040 -819 59724 78297 60097 67330 30195 27477 30975
13867 30975 55407 38763 17772 -11149 12890 -13502 4317 27366 69725 99795 63295 14889
13855 14889 -15200 -7476 49893 66667 107115 132968 117792 100973 63488 9439 -25164 -47833
13843 -47833 -60991 -66231 -71423 -58255 9313 4752 4189 17342 40226 20709 65716 71061 66715
13830 66715 68558 113874 112366 46966 17206 97321 78257 51125 60197 70723 49296 -6500
$$ packed form
13917E7160N3648l8994p5799p490J0076K4624L9573L070J0346l3353k0558J2728
13905C5031N2253N1286j9420J6002J8736j9534n7103l1828l8310o588k0704P501
13893a2678K697M967N3374L815r10j047K536J15R09m359l1271m1581j2221L1992
13879c662L5637J5254j0430k0759j6859O0543J8573j8200P233l7135k718L498
13867C0975K4432j6644k0991k8921K4039k6392J7819K3049M2359L0070l6500m8406
13855A4889l0089P724N7369J6774M0448K5853j5176j6819l7485n4049l4603k2669
13843d7833j3158n240n192J3168O7568m561n63J3153K2884j9517M5007N345m346
13830F6715J843M5316j508o5400k9760Q0115j9064k7132R072J0526k1427n5796
$$ plain form
13818 -6500 -38355 -51689 -5301 -4424 -38853 -52464 -20424 49701 54831 4388 48228 85200
13806 85200 11857 15945 77310 67865 51821 22721 1918 22366 50396 49758 73038 77320 73934
13793 73934 77545 49171 25798 25280 14732 37213 49303 1427 -23357 -46785 -4009 37761
13781 37761 59614 44105 38968 26504 7105 66062 78895 75655 82409 114272 126425 130504
13769 130504 89698 53852 19320 -24521 -54019 -28101 -27687 -11139 -1724 16341 33273 -5086
13757 -5086 -48096 -55193 -23047 -24978 -28587 5825 39133 38128 21807 15228 3439 -13955 -34644
13744 -34644 -60555 -51637 -4789 -37067 -85186 -101946 -72487 -11933 4949 11412 18028 2125
13732 2125 -27954 -61541 -73186 -7502 72663 105090 67447 4810 -1745 -1308 -39739 -53440
$$ packed form
13818f500l1855j3334M6388Q77l4429j3611L2040P0125N130n0443M3840L6972
13806H5200p3343M088O1365r445j6044k9100k0803K0448K8030o38K3280M282l386
13793G3934L611k8374k3373n18j0548K2481J2090m7876k4784k3428M2776M1770
13781C7761K1853j5509n137j2464j9399N8957J2833l240O754L1863J2153M079
13769A30504m0806l5846l4532m3841k9498K5918M14J6548R415J8065J6932l8359
13757e086m3010p097L2146j931l609L4412L3308j005j6321o579j1789j7394k0689
13744c4644k5911Q918M6848l2278m8119j6760K9459O0554J6882O463O616j5903
13732B125l0079l3587j1645O5684Q0165L2427l7643o2637o555M37l8431j3701
$$ plain form
13720 -53440 -24553 -6660 -17416 -8588 -36093 -22129 -3884 -1782 -19601 -52875 -56928 -67378
13708 -67378 -48662 -28351 -29808 -13026 76970 99866 74690 36602 26072 43426 40418 82260
13696 82260 58082 23068 -1884 14242 66159 41934 33 13322 91079 68637 706 -26375
13684 -26375 4640 43286 53473 22050 -9339 -29540 -24188 -13164 4733 23480 25167 61344
13672 61344 47520 10189 -17284 -27099 -97927 -117363 -125840 -111794 -72861 -39741 -11886 -22642
13660 -22642 -38147 -27043 -6775 -17518 -58236 -82231 -73017 -109182 -66078 -32179 -28975 -15129
13648 -15129 46490 76704 44517 -6062 -37092 -6602 9980 -42280 -61328 -30422 -10268 25805
13636 25805 -1851 31058 5513 -37150 -49100 -12595 -2338 8317 -5781 -33308 -19435 -44342
$$ packed form
13720e3440K8887J7893j0756Q828k7505J3964J8245K102j7819l3274m053j0450
13708f7378J8716K0311j457J6782Q9996K2896k5176l8088j0530J7354l008M1842
13696H2260k4178l5014k4952J6126N1917k4225m1901J3289P7757k2442o7931k7081
13684b6375L1015L8646J0187l1423l1389k0201N352J1024J7897J8747J687L6177
13672F1344j3824l7331k7473r815p0828j9436q477J4046L8933L3120K7855j0756
13660b2642j5505J1104K0268j0743m0718k3995R214l6165M3104L3899L204J3846
13648a5129O1619L0214l2187n0579l1030L0490J6582n2260j9048L0906K0154L6073
13636B5805k7656L2909k5545m2663j1950L6505J0257J0655j4098k7527J3873k4907
$$ plain form
13624 -44342 -51299 2293 44596 80472 66877 83298 69623 68576 62435 54565 31358 32011 42515
13611 42515 38562 -3295 -35878 -44810 -47228 -70220 -64488 -2226 22296 74010 79157 70770 78285
13598 78285 38658 37123 44091 58107 50561 41318 -1144 12273 20623 -1348 -20141 -57501 -69832
13585 -69832 -60767 -46944 -14229 -22653 -20486 -12825 -15880 -14466 -29107 -25067 -12561 -19256 -42279
13572 -42279 -16545 7793 -2691 -52947 -55853 -40070 -41452 -47888 -41872 -28985 -10383 62924
13560 62924 85676 93058 71555 61741 6779 20652 31881 35333 22444 -3210 11070 -5433
13548 -5433 -22822 -56226 -52203 -48332 -56402 -66946 -28952 4429 22866 13500 10902 335 -22928
13535 -22928 9741 27111 52158 45317 74114 76819 70860 38442 -701 29096 33320 34313 5384
$$ packed form
13624d4342o957N3592M2303L5876j3595J6421j3675j047o141p870k3207O53J0504
13611D2515l953m1857l2583q932k418k2992N732O2262K4522N1714N147q387P515
13598G8285l9627j535O968J4016p546r243m2462J3417Q350k1971j8793l7360j2331
13585f9832R065J3823L2715q424K167P661l055J414j4641M040J2506o695k3023
13572d2279K5734K4338j0484n0256k906J5783j382o436O016J2887J8602P3307
13560F2924K2752P382k1503r814n4962J3873J1229L452j2889k5654J4280j6503
13548e433j7389l3404M023L871q070j0544L7994L3381J8437r366k598j0567k3263
13535b2928L2669J7370K5047o841K8797K705n959l2418l9143K9797M224R93k8929
$$ plain form
13522 5384 20272 26049 25365 56855 52238 6677 13433 56097 59513 48793 1571 -2960 -8646
13509 -8646 672 23709 42829 57931 56913 41601 39495 -26079 -70306 -73420 2761 44904 72807
13496 72807 62550 44006 46540 37708 4806 3335 28895 44380 38786 71456 41876 -28503
13484 -28503 -31876 5703 -6367 11309 12587 1917 -11526 21 58039 76247 80815 52351
13472 52351 1523 -9873 22047 18951 9764 -3141 -32080 -78525 -75548 -9190 11693 38577
13460 38577 38275 -2334 15609 62276 64927 54294 37228 19136 -49479 -42401 6212 -17114
13448 -17114 -9069 7742 -22760 -41373 -6301 -23035 -9285 -13113 -465 48080 34823 30381
13436 30381 50511 54070 47558 52697 41753 44625 25677 40524 43036 38092 40033 16056 49615
$$ packed form
13522E384J4888N777o84L1490m617m5561O756M2664L416j0720m7222m531n686
13509h646R318K3037J9120J5102j018j5312k106o5574m4227l114P6181M2143K7903
13496G2807j0257j8544K534q832l2902j471K5560J5485n594L2670k9580p0379
13484b8503l373L7579j2070J7676J278j0670j3443J1547N8018J8208M568k8464
13472E2351n0828j1396L1920l096r187j2905k8939m6445K977O6358K0883K6884
13460C8577l02m0609J7943M6667K651j0633j7066j8092o8615P078M8613k3326
13448a7114Q045J6811l0502j8613L5072j6734J3750l828J2648M8545j3257m442
13436C0381K0130L559o512N139j0944K872j8948J4847K512m944J941k3977L3559
$$ plain form
13423 49615 51381 33260 30246 -7861 -17380 -20145 13217 -17459 -76150 -107827 -96953 -82521
13411 -82521 -112437 -103731 -93955 -78683 -49729 -6737 37308 32210 8878 -6347 12315 11639 12223
13398 12223 28927 35813 -463 -1339 3196 16607 42692 49387 70577 30381 51520 66015 50079
13385 50079 24842 19209 35378 16257 48664 55732 35477 28502 29213 17970 -12590 -14817 25462
13372 25462 57652 12473 4526 3461 -8140 -61861 -93244 -84681 -33124 -6327 -28114 -27919 -32532
13359 -32532 -44253 -9777 -21389 5753 11446 30292 8542 -5414 60087 80265 70362 61372
13347 61372 21843 10729 75994 49024 3877 268 -13196 -33593 4706 37911 37168 46635
13335 46635 82114 67473 50851 28571 -13665 -29636 -4611 62364 107469 90734 7451 11702
$$ packed form
13423D9615J766j8121l014l8107r519k765L3362l0676n8691l1677J0874J4432
13411h2521k9916Q706R776J5272K8954M2992M4045n098k3332j5225J8662o76N84
13398A2223J6704O886l6276q76M535J3411K6085O695K1190m0196K1139J4495j5936
13385E0079k5237n633J6169j9121L2407P068k0255o975P11j1243l0560k227M0279
13372B5462L2190m5179p947j065j1601n3721l1383Q563N1557K6797k1787J95m613
13359c2532j1721L4476j1612K7142N693J8846k1750j3956O5501K0178r903q990
13347F1372l9529j1114O5265k6970m5147l609j3464k0397L8299L3205p43R467
13335D6635L5479j4641j6622k2280m2236j5971K5025O6975M5105j6735q3283M251
$$ plain form
13323 11702 14200 13759 -19854 -16610 -9714 -31361 -61080 -85092 -69260 -29793 -27445 -41273 -49462
13310 -49462 -11009 52629 83514 67393 19304 -33157 -20663 9827 15250 4248 63754 82455
13298 82455 34410 17909 10214 -391 1268 13642 -17514 -2004 -28958 -16326 -29487 -48197
13286 -48197 -59431 -23405 1138 20980 34950 -6661 -4765 -10946 -65 15353 11317 15828
13274 15828 -27592 -29968 -47204 -69670 -12005 -1925 48291 67502 43283 24883 -21800 -51512
13262 -51512 1603 -21087 -28047 -3304 -12432 -14155 -14942 -37965 -28122 7054 -22864 -13006 16540
13249 16540 23189 35324 -19302 -34596 -1616 25291 -14878 -11867 -9706 10516 15271 -1989
13237 -1989 -27984 -23555 16864 28282 29423 25630 23201 -34571 12730 12751 28997 81063 66970
$$ packed form
13323A1702K498m41l3613L244O896k1647k9719k4012J5832L9467K348j3828q189
13310d9462L8453O3638L0885j6121m8089n2461J2494L0490N423j1002N9506J8701
13298H2455m8045j6501p695j0605J659J2374l1156J5510k6954J2632j3161j8710
13286d8197j1234L6026K4543J9842J3970m1611J896o181J0881J5418m036M511
13274A5828m3420k376j7236k2466N7665J0080N0216J9211k4219j8400m6683k9712
13262e1512N3115k2690o960K4743r128j723p87k3023R843L5176k9918R858K9546
13249A6540O649J2135n4626j5294L2980K6907m0169L011K161K0222M755j7260
13237a989k5995M429M0419J1418J141l793k429n7772M7301K1J6246N2066j4093
$$ plain form
13224 66970 41918 17713 -40385 -52714 -22636 12821 11546 -38123 -70239 -44012 -13979 480
13212 480 26013 6055 26233 46002 19965 7317 6459 8838 -16381 -35285 -68191 -31789 4979
13199 4979 26568 63583 63818 86550 75966 48099 23786 21789 27518 48819 62596 36488 -10088
13186 -10088 -16112 -157 -38786 -37836 -78880 -56131 -51440 585 32270 46495 12161 -13529
13174 -13529 -20572 9060 61550 58845 23122 -14949 -14127 2745 -8263 8809 54553 24374
13162 24374 3463 -28643 -25485 -16268 28406 55546 45169 -3162 -62699 -78693 -54100 -45177
13150 -45177 -12319 22654 54829 79744 49343 29619 3103 -37511 -72679 -59752 -20746 -29325
13138 -29325 -5987 14020 31515 21627 26643 36532 11864 27148 58467 25058 -8401 -15322
$$ packed form
13224F6970k5052k4205n8098j2329L0078L5457j275m9669l2116K6227L0033J4459
13212D80K5533j9958K0178J9769k6037j2648q58K379k5219j8904l2906L6402L6768
13199D979K1589L7015K35K2732j0584k7867k4313j997N729K1301J3777k6108m6576
13186a0088o024J5955l8629R50m1044K2749M691N2025L1685J4225l4334k5690
13174a3529p043K9632N2490k705l5723l8071Q22J6872j1008J7072M5744l0179
13162B4374k0911l2106L158R217M4674K7140j0377m8331n9537j5994K4593Q923
13150d5177L2858L4973L2175K4915l0401j9724k6516m0614l5168J2927L9006q579
13138b9325K3338K0007J7495r888N016R889k4668J5284L1319l3409l3459o921
$$ plain form
13126 -15322 -15284 -2163 15174 9376 -3011 6054 35654 61243 75284 37984 46451 71727 58132
13113 58132 16690 -20294 -23118 -50627 -92549 -33833 3686 -16644 -1469 13652 40792 39974
13101 39974 16409 20927 10924 33711 72910 49795 1056 2150 13391 891 -17435 -5459
13089 -5459 -48593 -57691 -19382 21597 -12857 -11385 6630 35658 55793 41763 22984 -16292
13077 -16292 -35036 -47750 -70367 -75228 -50101 4247 27782 40425 1022 -11840 12446 15762
13065 15762 40886 39364 40036 24974 5561 23755 -11829 9888 49448 46426 87532 54512
13053 54512 24100 33484 32509 26325 29575 38404 2915 -10994 7175 14620 43136 6608 -44618
13040 -44618 -30258 14838 18502 28351 342 -14505 -59495 -21384 41352 44908 42105 43909 -17092
$$ packed form
13126a5322L8J3121J7337n798j2387R065K9600K5589J4041l7300Q467K5276j3595
13113E8132m1442l6984k824k7509m1922N8716L7519k0330J5175J5121K7140q18
13101C9974k3565M518j0003K2787L9199k3115m8739J094J1241j2500j8326J1976
13089e459m3134r098L8309M0979l4454J472J8015K9028K0135j4030j8779l9276
13077a6292j8744j2714k2617m861K5127N4348K3535J2643l9403j2862K4286L316
13065A5762K5124j522O72j5062j9413J8194l5584K1717L9560l022M1106l3020
13053E4512l0412R384r75o184L250Q829l5489j3909J8169P445K8516l6528n1226
13040d4618J4360M5096L664R849k8009j4847m4990L8111O2736L556k803J804o1001
$$ plain form
13027 -17092 -15926 38414 -1385 -75832 -83699 -113090 -106254 -31232 -25012 -47530 -5430 44 -279
13014 -279 26935 50165 80708 68709 10671 -1670 34195 8810 -41850 -46255 -37150 -30114 -72259
13001 -72259 -96724 -75373 -77615 -76717 -87370 -63068 -79825 -40393 22059 31752 -4706 -8091 -27218
12988 -27218 -28546 -1748 73816 59285 51498 94674 109691 88450 23009 35842 6067 23269
12976 23269 43939 50537 31917 -5384 -17572 -19830 -54824 -28755 -4207 31591 34373 17571
12964 17571 4350 28697 71589 92132 56014 -12842 -17789 -2120 9900 -18296 3873 24995
12952 24995 67897 69097 45191 53118 11679 -34060 -26923 -13182 -2830 1445 -18367 -9695 -46477
12939 -46477 -50044 -33264 20751 43895 30105 25602 36631 60251 54430 -6312 -9809 22469
$$ packed form
13027a7092J166N4340l9799p4447p867k9391O836P5022O220k2518M2100N474l23
13014b79K7214K3230L0543j1999n8038j2341L5865k5385n0660m405R105P036m2145
13001g2259k4465K1351k242Q98j0653K4302j6757L9432O2452R693l6458l385j9127
12988b7218j328K6798P5564j4531p787M3176J5017k1241o5441J2833k9775J7202
12976B3269K0670O598j8620l7301j2188k258l4994K6069K4548L5798K782j6802
12964A7571j3221K4347M2892K0543l6118o8856m947J5669J2020k8196K2169K1122
12952B4995M2902J200k3906P927m1439m5739P137J3741J0352M275j9812Q672l6782
12939d6477l567J6780N4015K3144j3790m503J1029K3620n821o0742l497L2278
$$ plain form
12927 22469 36447 54080 72509 80643 69739 80630 72765 21523 -27874 -27256 -21246 -11517 7416
12914 7416 -10413 18817 44379 62092 60230 29100 63513 81565 111111 85244 57668 70032
12902 70032 24810 25812 10934 -16516 -7428 -44239 -53907 -46896 -12483 6073 20434 42923
12890 42923 14964 30885 46190 49730 66264 70102 39857 40900 -4735 -45360 -58955 -107263
12878 -107263 -94445 -20787 17731 28843 25160 32292 59639 94807 112380 65106 54989 52427
12866 52427 81564 48068 -33766 -54111 -11046 -13229 -20214 11302 45166 -12601 20320 48458
12854 48458 22429 26138 39959 18518 -770 -7831 -17435 -60038 -100044 -66495 -40462 -23648
12842 -23648 -17801 -17634 -24530 -250 -23339 -41969 -32018 -13149 74804 128853 129833 117369 109812
$$ packed form
12927B2469J3978J7633J8429Q134j0904J0891p865n1242m9397O18O010R729J8933
12914G416j7829K9230K5562J7713j862l1130L4413J8052K9546k5867k7576J2364
12902G0032m5222J002j4878k7450R088l6811r668P011L4413J8556J4361K2489
12890D2923k7959J5921J5305L540J6534L838l0245J043m5635m0625j3595m8308
12878a07263J2818P3658L8518J1112l683P132K7347L5168J7573m7274j0117k562
12866E2427K9137l3496q1834k0345M3065k183o985L1516L3864n7767L2921K8138
12854D8458k6029L709J3821k1441j9288p061r604m2603m0006L3549K6033J6814
12842b3648N847J67o896K4280k3089j8630R951J8869Q7953N4049R80j2464p557
$$ plain form
12829 109812 90698 50373 -12834 -46302 -33986 -7381 17350 -6875 -34017 -16818 -6257
12818 -6257 -364 -44102 -39883 -48253 -69539 -60120 -41229 -72891 -83226 -27689 -22989 8047 18879
12805 18879 23111 -348 -51577 -65217 -41165 -10004 -46258 -60632 -23895 -42295 -12921 25658
12793 25658 19851 3027 -16545 -5434 -27075 -84463 -85334 -69978 -39485 -22802 -14267 -2752
12781 -2752 14868 -9335 -42133 -22117 -30718 -35395 -1525 -2008 -25244 -38309 -41942 -61823 -70601
12768 -70601 -74359 -21731 466 -33321 -30474 -36595 -17505 15550 -7330 9546 43879 58574
12756 58574 38611 13153 11487 -23048 -24951 3754 -7827 -24709 -57527 -77364 -72422 -63760
12744 -63760 -25201 -36063 -17442 -6808 -42061 -50353 -50316 -21172 12107 50756 77015 93879
$$ packed form
12829A09812j9114m0325o3207l3468J2316K6605K4731k4225k7142J7199J0561
12818f257N893m3738M219q370k1286R419J8891l1662j0335N5537M700L1036J0832
12805A8879M232k3459n1229j3640K4052L1161l6254j4374L6737j8400K9374L8579
12793B5658n807j6824j9572J1111k1641n7388q71J5356L0493J6683Q535J1515
12781b752J7620k4203l2798K0016q601m677L3870m83k3236j3065l633j9881q778
12768g0601l758N2628K2197l3787K847o121J9090L3055k2880J6876L4333J4695
12756E8574j9963k5458j666l4535j903K8705j1581j6882l2818j9837M942Q662
12744f3760L8559j0862J8621J0634l5253q292L7K9144L3279L8649K6259J6864
$$ plain form
12732 93879 55350 58840 95764 61384 37164 17595 -6743 -34634 -6361 -4614 1083 8297
12720 8297 50270 20134 39764 27182 7195 -30476 -10396 -31054 -10814 -5481 11014 19528
12708 19528 -6223 -35539 -41119 -29087 -59092 -59993 -35522 -58980 -88805 -82830 -44815 -26800
12696 -26800 -69992 -95675 -71397 -37079 64594 67839 87900 97824 55568 9734 33464 -16174
12684 -16174 -43097 -2833 11105 10223 4228 -3543 11843 24760 75149 65715 32455 -42821 -42750
12671 -42750 -35267 -9337 -1372 4309 15722 10781 18704 36799 50744 -8303 -63272 -5910 75792
12658 75792 24173 -43666 -36694 18361 49608 31152 39828 100546 99367 77353 71679 23065
12646 23065 8852 -4605 484 8230 -6536 -15176 -14419 -5028 6035 -16110 17778 30020 12580
$$ packed form
12732I3879l8529L490L6924l4380k4220j9569k4338k7891K8273J747N697P214
12720H297M1973l0136J9630j2582j9987l7671K0080k0658K0240N333J6495Q514
12708A9528k5751k9316n580J2032l0005r01K4471k3458k9825N975L8015J8015
12696b6800m3192k5683K4278L4318J01673L245K0061R924m2256m5834K3730m9638
12684a6174k6923M0264J3938q82n995p771J5386J2917N0389r434l3260p5276P1
12671d2750P483K5930P965N681J1413m941P923J8095J3945n9047n4969N7362Q1702
12658G5792n1619o7839O972N5055L1247j8456Q676O0718j179k2014n674m8614
12646B3065j4213j3457N089P746j4766q640P57R391J1063k2145L3888J2242j7440
$$ plain form
12633 12580 -3168 -14386 40789 67282 24858 39 69957 64691 36112 28367 63814 29212
12621 29212 -44435 -98650 -117217 -67627 23365 63616 28730 -6275 -11002 -20398 -15044 -27957
12609 -27957 -45205 -25223 21360 43165 48798 84236 86952 71810 48195 32000 3195 2537
12597 2537 8245 -6650 -48979 -74821 -41498 -982 -10981 -998 -26991 32744 92034 101172 60621
12584 60621 22570 -4206 23537 38691 19336 -10498 -35322 -8590 10747 20184 7387 -11069
12572 -11069 -22680 -7317 -25088 -51672 -6870 21231 57243 77218 66192 84531 74586 3273
12560 3273 -31606 -41667 14952 59483 74782 75706 77851 42773 72531 94359 98579 52098 -3879
12547 -3879 -6663 -14713 10780 2239 42806 52163 14281 25309 -28093 9463 71020 112545 92160
$$ packed form
12633A2580j5748j1218N5175K6493m2424k4819O9918n266k8579p745L5447l4602
12621B9212p3647n4215j8567M9590R0992M0251l4886l5005m727r396N354j2913
12609b7957j7248J9982M6583K1805N633L5438K716j5142k3615j6195k8805o58
12597B537N708j4895m2329k5842L3323M0516r999R983k5993N9735N9290R138m0551
12584F0621l8051k6776K7743J5154j9355k9834k4824K6732J9337R437j2797j8456
12572a1069j1611J5363j7771k6584M4802K8101L6012J9975j1026J8339r945p1313
12560C273l4879j0061N6619M4531J5299R24K145l5078K9758K1828M220m6481n5977
12547c879k784q050K5493q541M0567R357l7882J1028n3402L7556O1557M1525k0385
$$ plain form
12534 92160 47775 6599 13810 2025 44114 71769 63367 28335 51519 122965 99344 79121
12522 79121 63380 83199 83394 65058 2911 6720 25948 3172 -14445 -30091 -1301 3624
12510 3624 14591 31082 51228 39968 -9 19695 42775 24342 -11816 22780 27505 60349
12498 60349 46137 -31132 -65296 -40215 -55193 -50463 -31153 -32772 -31976 -34716 -3599 65827 55911
12485 55911 65960 75768 35833 5823 15548 69850 94591 92493 97431 78256 55438 39669
12473 39669 -23878 -32625 -24439 -25481 -4488 -50024 -79926 -57937 -53438 -47776 -21885 2379 -45432
12460 -45432 -32828 11325 7078 7916 -21351 -17003 713 2231 11216 3296 -16720 -45128 -29428
12447 -29428 28874 46458 34891 45488 47014 118167 150067 165834 190334 191967 179547 175929
$$ packed form
12534I2160m4385m1176P211j1785M2089K7655q402l5032K3184P1446k3621k0223
12522G9121j5741J9819J95j8336o2147L809J9228k2776j7617j5646K8790M925
12510C624J0967J6491K0146j1260l9977J9704K3080j8433l6158L4596M725L2844
12498F0349j4212p7269l4164K5081j4978M730J9310j619P96k740L1117O9426r916
12485E5911J0049R808l9935l0010R725N4302K4741k098M938j9175k2818j5769
12473C9669o3547q747Q186j042K0993m5536k9902K1989M499N662K5891K4264m7811
12460d5432J2604M4153m247Q38k9267M348J7716J518Q985p920k0016k8408J5700
12447b9428N8302J7584j1567J0597J526P1153L1900J5767K4500J633j2420l618
$$ plain form
12435 175929 133379 75719 72322 95938 66236 61177 72957 103434 81208 59682 25045 30841
12423 30841 53635 39600 27808 20665 37730 42695 -15228 -12285 -43788 -4110 54578 22951
12411 22951 -51960 -55552 15421 46900 52267 30228 2977 -9497 25682 71530 89607 95212
12399 95212 124700 164756 184488 167555 69765 21812 39896 25290 11328 18468 39019 79762
12387 79762 109695 67746 72343 45670 34961 73460 32156 -12065 -6974 -27370 -32136 -27718
12375 -27718 -2507 893 -10929 -8206 -830 22015 54369 47115 29644 -7243 -47122 -97975
12363 -97975 -43736 35526 107113 84995 28814 17398 86425 106537 124491 121022 122479 117718
12351 117718 73841 6552 -3819 10877 30872 34917 34208 37776 79446 83086 48975 -13658
$$ packed form
12435A75929m2550n7660l397K3616k9702n059J1780L0477k2226k1526l4637N796
12423C0841K2794j4035j1792p143J7065M965n7923K943l1503L9678N8688l1627
12411B2951p4911l592P0973L1479N367k2039k7251j2474L5179M5848J8077N605
12399I5212K9488M0056J9732j6933r7790m7953J8084j4606j3962P140K0551M0743
12387G9762K9933m1949M597k6673j0709L8499m1304m4221N091k0396m766M418
12375b7718K5211L400j1822K723P376K2845L2354p254j7471l6887l9879n0853
12363i7975N4239P9262P1587k2118n6181j1416O9027K0112J7954l469J457m761
12351A17718m3877o7289j0371J4696J9995M045p09L568M1670L640l4111o2633
$$ plain form
12339 -13658 -73669 -41083 20780 18377 4867 -20227 36143 -16643 4168 80913 62366 -560
12327 -560 -385 25926 3416 -26657 -9460 40826 9808 -20036 25318 26069 -16314 -40148 -45018
12314 -45018 -27349 4135 27813 45370 8523 8376 -17210 -33550 -33149 -14573 -39474 -60035
12302 -60035 -32146 -9212 -33568 -16292 -10975 -17779 -47059 -29463 -9141 -5072 -23921 -58011
12290 -58011 -83134 -31341 13265 4810 60798 84848 102761 112845 68664 34288 42836 48968
12278 48968 63377 56725 58691 53991 10292 34779 66895 19043 -7469 -29292 -57315 -92077
12266 -92077 -76630 -21299 22320 24846 -6355 -734 13890 27967 6834 -53641 -26166 -8255
12254 -8255 -34611 16728 -25151 -99259 -59971 -16231 45591 66816 14747 -6722 -8026 -2800
$$ packed form
12339a3658o0011L2586O1863k403j3510k5094N6370n2786K0811P6745j8547o2926
12327e60J75K6311k2510l0073J7197N0286l1018k9844M5354P51m2383k3834m870
12314d5018J7669L1484K3678J7557l6847j47k5586j6340M01J8576k4901k0561
12302f0035K7889K2934k4356J7276N317o804k9280J7596K0322M069j8849l4090
12290e8011k5123N1793M4606q455N5988K4050J7913J0084m4181l4376Q548O132
12278D8968J4409o652J966m700m3699K4487L2116m7852k6512k1823k8023l4762
12266i2077J5447N5331M3619K526l1201N621J4624J4077k1133o0475K7475J7911
12254h255k6356N1339m1879p4108L9288M3740O1822K1225n2069k1469j304N226
$$ plain form
12242 -2800 -28421 -16527 -11410 -29514 -6988 5471 17896 17586 -12964 -33147 -39876 -3608 1027
12229 1027 -34962 -50883 -46000 -26453 -23746 -28754 6164 39749 -648 27576 33471 14445 11343
12216 11343 -21155 -62605 -70026 -23188 -6568 14377 28106 6300 -48943 -53221 -65958 -59799
12204 -59799 -15138 -1221 13491 8172 27115 84291 39571 2872 28199 51455 26515 816
12192 816 16613 -5365 -32741 -9433 10622 11271 18518 -5284 -64579 -106686 -52981 -12352 -3781
12179 -3781 -41935 -83168 -84145 -53851 -1775 33739 37262 -3726 -31328 31388 44994 57404
12167 57404 69697 52994 55189 18686 -23432 11863 11865 -17335 -31928 8788 6523 -11781 -6012
12154 -6012 34266 47038 8170 9503 -3444 -9047 -28351 -45487 -75529 -84875 -83896 -62390 -33736
$$ packed form
12242b800k5621J1894N117j8104K2526J2459J2425l10l0550k0183o729L6268M635
12229A027l5989j5921M883J9547K707n008L4918L3585m0397K8224N895j9026l102
12216A1343l2498m1450p421M6838J6620K0945J3729k1806n5243m278j2737O159
12204e9799M4661J3917J4712n319J8943N7176m4720l6699K5327K3256k4940k5699
12192H16J5797k1978k7376K3308K0055O49P247k3802n9295m2107N3705M0629Q571
12179c781l8154m1233r77L0294N2076L5514L523m0988k7602O2716J3606J2410
12167E7404J2293j6703K195l6503m2118L5295Kk9200j4593M0716k265j8304N769
12154f012M0278J2772l8868J333j2947n603j9304j7136l0042r346R79K1506K8654
$$ plain form
12141 -33736 32435 68152 63814 111886 90978 46362 -58947 -103374 -99283 -149175 -145061 -135777
12129 -135777 -80156 6196 18599 -18004 -35072 -71422 -84292 -35113 20092 45719 58228
12118 58228 60262 59624 77380 15744 -22890 -30289 -24117 -39220 2146 30132 4927 -31903 -18823
12105 -18823 -30742 -24337 4012 -5619 19072 8416 -9566 -12527 -21786 -13602 10345 10441 34871
12092 34871 57518 59139 70657 62610 64003 68873 43336 18049 50869 4327 -18849 955
12080 955 -32298 -24273 12146 7836 -13789 23552 56778 11134 16874 39277 27998 27019 -8716
12067 -8716 -24498 -24661 -23311 -25159 -16363 -23085 -16999 -25906 -24330 -16905 -37544 -32589 -48569 -69379
12053 -69379 -73236 -45480 -17478 19501 46375 38404 37597 -4295 -20090 -22455 -28654 -34125 -6549
$$ packed form
12141c3736O6171L5717m338M8072k0908m4616j05309m4427M091m9892M114R284
12129a35777N5621Q6352J2403l6603j7068l6350j2870M9179N5205K5627J2509
12118E8228K034o38J7756o1636l8634p399O172j5103M1366K7986k5205l6830J3080
12105a8823j1919O405K8349r631K4691j0656j7982k961r259Q184K3947R6K4430
12092C4871K2647J621J1518q047J393M870k5537k5287L2820m6542k3176J9804
12080I55l3253Q025L6419m310k1625L7341L3226m5644N740K2403j1279r79l5735
12067h716j5782j63J350j848Q796o722O086q907J576P425k0639M955j5980k0810
12053f9379l857K7756K8002L6979K6874p971q07m1892j5795k365o199n471K7576
$$ plain form
12040 -6549 3740 2954 -30183 -89424 -107264 -41253 18193 80 5384 34781 27279 -16656 -79412
12027 -79412 -78009 -42385 -6242 -43577 -72175 -72228 -35885 -33267 -27463 -30302 -12255 -2039 -27581
12014 -27581 -55169 -24373 31653 34008 -14196 -27410 -2924 6084 13083 52597 55208 45341 40541
12001 40541 14532 13772 24870 35952 18355 -19358 -35930 -66070 -49134 -26443 -19850 -1921
11989 -1921 -15448 -20405 -17459 8374 50258 50776 11818 -4200 -51989 -25570 45314 31266 -142
11976 -142 -44358 -78475 -20274 24910 -5786 -8230 32615 34084 35736 22488 6897 43572 29506
11963 29506 1210 -4181 -47481 -31049 32575 45310 51794 79489 51981 7418 -14789 -51652
11951 -51652 -54601 -32065 -7435 -39382 -60267 -29503 -4924 -15352 -46420 -27141 25024 34179
$$ packed form
12040f549J0289p86l3137n9241j7840O6011N9446j8113N304K9397p502m3935o2756
12027g9412J403L5624L6143l7335k8598n3L6343K618N804k839J8047J0216k5542
12014b7581k7588L0796N6026K355m8204j3214K4486R008O999L9514K611r867m800
12001D0541k6009p60J1098J1082j7597l7713j6572l0140J6936K2691O593J7929
11989a921j3527m957K946K5833M1884N18l8958j6018m7789K6419P0884j4048l1408
11976a42m4216l4117N8201M5184l0696k444M0845J469J652j3248j5591L6675j4066
11963B9506k8296n391m3300J6432O3624J2735O484K7695k7508m4563k2207l6863
11951e1652k949K2536K4630l1947k0885L0764K4579j0428l1068J9279N2165R155
$$ plain form
11939 34179 36979 2810 -48446 -19469 -17478 -36495 5389 13201 45581 -14903 -14621 -12563 -31766
11926 -31766 -44962 -82834 -62490 -9501 6021 4703 10616 46736 50488 40500 30173 8352
11914 8352 -29077 -30936 31366 28577 19239 22613 64616 72487 47691 51671 52353 15467 -2417
11901 -2417 396 -14289 3278 26796 21929 -16835 -36923 -25374 12201 25139 2794 11033
11889 11033 49958 33676 24933 64069 44731 -8553 -51424 -13978 3020 -13578 -34707 -74586
11877 -74586 -50917 -24041 -9486 -48163 -37157 -10795 -78817 -114804 -67120 -6850 1612 7378
11865 7378 14409 4350 -44936 -49822 -41058 9364 37283 26993 -12268 -4694 -44428 -57826 -52362
11852 -52362 -63821 -53036 -31174 -6069 -11928 -37663 -38700 3155 51627 50607 -9242 -32158
$$ packed form
11939C4179K800l4169n1256K8977J991j9017M1884P812L2380o0484K82K058j9203
11926c1766j3196l7872K0344N2989J5522j318N913L6120L752r988j0327k1821
11914H352l7429j859O2302k789r338L374M2003P871k4796L980O82l6886j7884
11901b417K813j4685J7567K3518m867l8764k0088J1549L7575J2938k2345Q239
11889A1033L8925j6282q743L9136j9338n3284m2871L7446J6998j6598k1129l9879
11877g4586K3669K6876J4555l8677J1006K6362o8022l5987M7684O0270Q462N766
11865G378P031j0059m9286m886Q764N0422K7919j0290l9261P574l9734j3398N464
11852e2362j1459J0785K1862K5105n859k5735j037M1855M8472j020n9849k2916
$$ plain form
11840 -32158 -48740 -63693 -12085 -4889 -40642 -30444 -6672 17822 -31190 -49364 -75380 -115076
11828 -115076 -120644 -124295 -74400 -33001 -37019 -7201 20084 45984 34593 6696 -5710 -25981
11816 -25981 -31132 -12898 -1550 -41213 -65646 -80457 -64651 -86065 -80254 -40765 -36165 -8830
11804 -8830 29426 -8149 -34741 -39826 -37993 -29250 -32525 -33086 -22362 -62149 -61369 -24873 -19146 -11987
11790 -11987 21740 23951 8635 9175 33165 24071 22871 36298 11644 26063 -14893 -30861 -52046
11777 -52046 -84356 -36705 -47141 -69737 -27734 13491 15672 26863 33662 70916 58798 33804
11765 33804 2603 -12896 -40379 -25318 -49256 -34558 10951 -22378 -55774 -64605 -53187 -39350
11753 -39350 -34374 -19436 -34951 -44139 -25434 10390 45687 74763 63940 -11673 -63689 -57156
$$ packed form
11840c2158j6582j4953N1608P196l5753J0198K3772K4494m9012j8174k6016l9696
11828a15076n568l651M9895M1399m018K9818K7285K5900j1391k7897j2406k0271
11816b5981n151J8234J1348l9663k4433j4811J5806k1414N811L9489M600K7335
11804h830L8256l7575k6592n085J833Q743l275n61J0724l9787P80L6496N727P159
11790a1987L3727K211j5316N40K3990r094j200J3427k4654J4419m0956j5968k1185
11777e2046l2310M7651j0436k2596M2003M1225K181J1191O799L7254j2118k4994
11765C3804l1201j5499k7483J5061k3938J4698M5509l3329l3396q831J1418J3837
11753c9350M976J4938j5515r188J8705L5824L5297K9076j0823p5613n2016O533
$$ plain form
11741 -57156 -25969 21072 18092 24028 -12765 -4609 14226 31404 4010 -3700 -25514 -8178
11729 -8178 3059 -11190 15108 82158 81665 53426 32720 38672 23392 1299 -29641 -70808
11717 -70808 -40767 -36177 -11271 -10796 -12169 -48202 -36061 2773 -3622 -52576 -35005 -39790 -45096
11704 -45096 -88661 -135831 -97551 -52389 -96676 -133946 -107539 -149294 -160530 -104236 -58595 -63625
11692 -63625 -95926 -119157 -135993 -97706 -105083 -78859 -17027 -3716 7626 -10862 2340 34328
11680 34328 50313 -7991 0 -10122 -55863 -32259 -31232 -28441 -32792 -39885 -14098 -36262 -66612
11667 -66612 -47713 -54626 -41479 -43843 -56801 -55976 -35096 -34141 -70386 -65221 -39932 -5868 -24453
11654 -24453 -5992 22169 5952 18904 -10631 -63802 -68380 -1280 2133 -34629 -77109 -75692
$$ packed form
11741e7156L1187M7041k980N936l6793Q156J8835J7178k7394p710k1814J7336
11729h178J1237j4249K6298O7050m93k8239k0706N952j5280k2093l0940m1167
11717g0808L0041M590K4906M75j373l6033J2141L8834o395m8954J7571m785n306
11704d5096m3565m7170L8280M5162m4287l7270K6407m1755j1236N6294M5641n030
11692f3625l2301k3231j6836L8287p377K6224O1832J3311J1342j8488J3202L1988
11680C4328J5985n8304P991j0122m5741K3604J027K791m351p093K5787k2164l0350
11667f6612J8899o913J3147k364j2958Q25K0880R55l6245N165K5289L4064j8585
11654b4453J8461K8161j6217J2952k9535n3171m578O7100L413l6762m2480J417
$$ plain form
11642 -75692 -97290 -74861 -61358 -67318 -63332 -45040 -53644 -26862 2984 23309 27713 -41310
11630 -41310 -19462 -26846 -30730 -35107 -89750 -69941 -28114 -13431 -36958 -54124 -48684 -45743 -13818
11617 -13818 23164 -18109 -53449 -63681 -27879 -24679 -39346 -45851 -48166 -73183 -74456 -64719 -65011
11604 -65011 -46694 -22763 -7323 -2243 -76 28281 33257 30662 51811 66176 56814 26145 25818
11591 25818 -21094 -44902 -29125 2493 -5615 -45103 -61153 -64720 -33664 10534 29296 -8584
11579 -8584 -38513 -55005 -29685 -10321 -18094 -10068 22392 13194 -5416 -14280 -57827 -107433 -82640
11566 -82640 -75841 -54464 -47417 -70452 -73549 -40037 13391 -7347 -57180 -56724 -70620 -34579 19183
11553 19183 23276 14404 46468 36314 34757 43689 70830 80607 66153 45478 22717 2970 -18140
$$ packed form
11642g5692k1598K2429J3503n960L986J8292q604K6782K9846K0325M404o9023
11630d1310K1848p384l884m377n4643J9809M1827J4683k3527j7166N440K941L1925
11617a3818L6982m1273l5340j0232L5802L200j4667o505k315k5017j273R737k92
11604f5011J8317K3931J5440N080K167K8357M976k595K1149J4365r362l0669l27
11591B5818m6912k3808J5777L1618q108l9488j6050l567L1056M4198J8762l7880
11579h584k9929j6492K5320J9364p773Q026L2460r198j8610q864m3547m9606K4793
11566h2640O799K1377P047k3035l097L3512N3428k0738m9833M56j3896L6041N3762
11553A9183M093q872L2064j0154j557Q932K7141R777j4454k0675k2761j9747k1110
$$ plain form
11540 -18140 20073 16988 -38777 -59117 -38735 43473 59271 45938 48779 26288 32566 58942
11528 58942 26379 48009 82419 44990 -5351 -37901 8800 43049 1306 -46453 -66873 -18931
11516 -18931 3039 27557 -26125 -40160 -40037 -63511 -79761 -62380 -339 -22754 -25812 -55024
11504 -55024 -67566 -67361 -100899 -92049 -29603 19761 24920 1388 -17513 -5937 27121 -6765
11492 -6765 20172 11648 -2066 15652 -40684 -44093 -9951 43903 34388 37933 19808 53294 3363
11479 3363 11449 1212 -11331 -17662 9441 -14735 -35807 -65610 -56215 -35598 -48788 -13023
11467 -13023 38311 69514 65068 51916 61451 10195 25434 60192 64636 65538 53475 49510 33478
11454 33478 36491 43095 32778 31015 -28366 -70723 -28168 -13922 4311 4720 -24179 -71079 -56893
$$ packed form
11540a8140L8213l085n5765k0340K0382Q2208J5798j3333K841k2491O278K6376
11528E8942l2563K1630L4410l7429n0341l2550M6701L4249m1743m7759k0420M7942
11516a8931K1970K4518n3682j4035J23k3474j6250J7381O2041k2415l058k9212
11504e5024j2542K05l3538Q850O2446M9364N159k3532j8901J1576L3058l3886
11492f765K6937q524j3714J7718n6336l409L4142N3854r515L545j8125L3486m9931
11479C363Q086j0237j2543o331K7103k4176k1072k9803R395K0617j3190L5765
11467a3023N1334L1203m446j3152R535n1256J5239L4758M444R02j2063l965j6032
11454C3478L013O604j0317j763n9381m2357M2555J4246J8233M09k8899m6900J4186
$$ plain form
11441 -56893 -88041 -131212 -94174 -52107 -54097 -49741 -51872 -25820 21726 51578 40852 10268
11429 10268 993 11290 10183 11438 35608 11720 10174 10960 -64056 -56398 -26282 -53837 -23937
11416 -23937 -23462 -26139 16039 68049 77689 54356 53119 10543 8509 81860 82311 104801 150226
11403 150226 136812 54719 6971 -35994 -26853 18469 40679 42315 365 3533 -6987 -45303
11391 -45303 -89500 -94392 -13952 -793 -29282 26867 89737 78724 11911 -18702 -14904 15484
11379 15484 18258 32794 9756 -25681 -36245 -14760 -72598 -113671 -130830 -107373 -55041 -32643
11367 -32643 -18434 -33917 -35523 -29679 -22674 -50791 -89370 -84274 -81253 -79458 -83965 -50281 -48098
11354 -48098 -30259 -38766 -67630 -85987 -114565 -120716 -88256 -75689 -62803 -39850 -43395 -50378
$$ packed form
11441e6893l1148m3171L7038M2067j990M356k131K6052M7546K9852j0726l0584
11429A0268r275J0297j107J255K4170k3888j546P86p5016P658L0116k7555K9900
11416b3937M75k677M2178N2010R640k3333j237m2576k034P3351M51K2490M5425
11403A50226j3414q2093m7748m2965R141M5322K2210J636m1950L168j0520l8316
11391d5303m4197m892Q0440J3159k8489N6149O2870j1013o6813l0613L798L0388
11379A5484K774J4536k3038l5437j0564K1485n7838m1073j7159K3457N2332K2398
11367c2643J4209j5483j606N844P005k8117l8579N096L021J795m507L3684K183
11354d8098J7839q507k8864j8357k8578o151L2460J2567J2886K2953l545o983
$$ plain form
11342 -50378 -40147 -37906 -65298 -59664 -35262 -90251 -101806 -65731 -65254 -66217 -51827 -1686 12648
11329 12648 3996 32584 76618 90535 43973 12671 11130 -61964 -35207 19045 27223 17695
11317 17695 38516 75330 79870 76359 65367 5036 -50889 -44013 -5185 38348 39541 -37874
11305 -37874 -69476 -26571 11135 67663 7749 14582 67726 55101 45545 32635 34106 68274
11293 68274 89271 83004 100299 102806 32325 13938 46305 36478 45276 34764 28572 15946 55249
11280 55249 64238 40349 25085 25885 -17174 -47995 -94018 -108597 -72524 -43354 -68945 -46340
11268 -46340 -40885 -18564 -31676 -27009 4277 -46534 -61016 -62393 5710 28827 -17244 -39552
11256 -39552 -56313 -89374 -84150 -94376 -82743 -108685 -125017 -94612 -56143 -77856 -55039 -44913
$$ packed form
11342e0378J0231K241k7392N634K4402n4989j1555L6075M77r63J4390N0141J4334
11329A2648q652K8588M4034J3917m6562l1302j541p3094K6757N4252Q178r528
11317A7695K0821L6814M540l511j0992o0331n5925O876L8828M3533J193p7415
11305c7874l1602M2905L7706N6528n9914O833N3144j2625r556j2910J471L4168
11293F8274K0997o267J7295K507p0481j8387L2367r827Q798j0512o192j2626L9303
11280E5249Q989k3889j5264Q00m3059l0821m6023j4579L6073K9170k5591K2605
11268d6340N455K2321j3112M667L1286n0811j4482j377O8103K3117m6071k2308
11256c9552j6761l3061N224j0226J1633k5942j6332L0405L8469k1713K2817J0126
$$ plain form
11244 -44913 -33344 -66266 -57191 -43501 -46841 -36076 -9210 -15154 -5716 39240 62640 72793
11232 72793 35979 14946 32856 10874 -12271 -26972 -45135 -81178 -60900 -25418 -13309 -12466
11220 -12466 -34011 -22687 10191 44844 22818 -27372 -45960 -23501 -48454 -34124 -41006 -13559
11208 -13559 -2014 -26691 -10381 25711 -57832 -26963 25995 45835 64125 -1258 -33213 -63727
11196 -63727 -49813 -41069 1110 13008 -49222 -102957 -101197 -90481 -95601 -56078 -5388 -18366
11184 -18366 -44174 -60424 -60086 27504 55066 54427 77477 60927 41177 39284 -8325 -70986 -71184
11171 -71184 -17933 -5054 10284 29984 31423 41074 26979 9349 22833 29632 5805 -12599
11159 -12599 -82168 -87175 -28561 -14586 4208 51109 54535 29201 3695 9782 63948 39866
$$ packed form
11244d4913J1569l2922R075J3690l340J0765K6866n944R438M4956K3400J0153
11232G2793l6814k1033J7910k1982k3145j4701j8163l6043K0278L5482J2109Q43
11220a2466k1545J1324L2878L4653k2026n0190j8588K2459k4953J4330o882K7447
11208a3559J1545k4677J6310L6092q3543L0869N2958J9840J8290o5383l1955l0514
11196f3727J3914Q744M2179J1898o2230n3735J760J0716n120L9523N0690j2978
11184a8366k5808j6250L38Q7590K7562o39K3050j6550j9750j893m7609o2661j98
11171g1184N3251J2879J5338J9700J439R651j4095j7630J3484O799k3827j8404
11159a2599o9569n007N8614J3975J8794M6901L426k5334k5506O087N4166k4082
$$ plain form
11147 39866 82065 107192 64204 52474 66277 71001 52051 41474 37101 1621 -6055 23849
11135 23849 40437 40365 1492 -28691 -29159 21708 -9904 -30349 6099 -11549 9622 5420 -23702
11122 -23702 -34185 34357 54415 42570 45332 71105 18801 -17943 -25288 -15372 -193 4138
11110 4138 -34922 -33963 -35966 -19662 -17090 -19937 -35016 -35080 21962 35835 -57260 -95059 -62803
11097 -62803 -58196 -44827 -71818 -101826 -134120 -91233 -51698 18526 60096 49294 -3900 -32238
11085 -32238 -53730 -48982 -22153 -28502 -64405 -61153 -56836 -4446 27132 54429 49832 22553 73014
11072 73014 75925 70357 78647 79301 4600 -19733 33347 22151 23173 27661 14458 19300 -10467
11059 -10467 -6960 -8977 -16809 16292 28878 15838 -11147 -8542 39766 41205 38129 -12006 -15406
$$ packed form
11147C9866M2199K5127m2988j1730J3803M724j8950j0577m373l5480p676K9904
11135B3849J6588p2l8873l0183m68N0867l1612k0445L6448j7648K1171m202k9122
11122b3702j0483O8542K0058j1845K762K5773n2304l6744p345R916J5179M331
11110D138l9060R59k003J6304K572k847j5079o4N7042J3873r3095l7799L2256
11097f2803M607J3369k6991l0008l2294M2887L9535P0224M1570j0802n3194k8338
11085c2238k1492M748K6829o349l5903L252M317N2390L1578K7297m597k7279N0461
11072G3014K911n568Q290O54p4701k4333N3080j1196J022M488j3203M842k9767
11059a0467L507k017p832L3101J2586j3040k6985K605M8308J439l076n0135l400
$$ plain form
11046 -15406 -52799 -102877 -143181 -90782 -9026 -51806 -43164 -3559 4741 -17068 -42048 -53856
11034 -53856 -10165 -39225 -61902 -57990 -57572 -29828 -33617 -19617 -33325 -23793 -13269 -40415 -65433
11021 -65433 -74410 -38508 -4644 14977 16180 -4803 -47999 -34330 -68961 -46113 -36016 2764
11009 2764 -388 22690 24657 -1874 -6013 11679 16610 -22048 -36697 -32809 -24022 -29440 -58775
10996 -58775 -71739 -82097 -67441 -89844 -88676 -64053 -48181 5301 47859 22620 14964 45952
10984 45952 30525 39550 40440 31174 -39164 -27010 36144 39328 -23783 -60831 -54415 9430 19821
10971 19821 39960 28102 44683 36871 17893 10604 2081 -41902 -79303 -61566 -14995 -2665
10959 -2665 -60626 -65083 -5805 10616 -30097 -29140 2835 -22417 13492 60683 65005 61761 38350
$$ packed form
11046a5406l7393n0078m0304N2399Q1756m2780Q642L9605Q300k1809k4980j1808
11034e3856M3691k9060k2677L912M18K7744l789J4000j3708R532J0524k7146k5018
11021f5433q977L5902L3864J9621J203k0983m3196J3669l4631K2848J0097L8780
11009B764l152K3078J967k6531m139J7692M931l8658j4649L888Q787n418k9335
10996e8775j2964j0358J4656k2403J168K4623J5872N3482M2558k5239p656L0988
10984D5952j5427R025Q90r266p0338J2154O3154L184o3111l7048O416O3845J0391
10971A9821K0139j1858J6581p812j8978p289q523m3983l7401J7737M6571J2330
10959b665n7961m457N9278J6421m0713R57L1975k5252L5909M7191M322l244k3411
$$ plain form
10946 38350 49792 6871 10360 -9738 -36374 -34779 -34564 -43304 -71379 -41668 -64531 -112642 -74150
10933 -74150 -43879 -22599 796 45767 42271 54787 37401 29334 60256 -5974 -17738 -32113
10921 -32113 1263 46805 24125 16763 38232 21619 -25598 -24858 -58085 -50057 -2027 13821
10909 13821 30648 42363 76170 83483 43731 32931 -48018 -90419 -66286 -96507 -72867 -35781
10897 -35781 -26733 -27637 -31416 -38690 -22920 24224 -16888 -46911 -79661 -53354 -46847 -44096 -34125
10884 -34125 -47737 -61077 -46037 -52213 -73531 -59166 -12864 -29520 -52378 -10866 -44064 -70997
10872 -70997 -44863 -12960 20468 2492 5168 -26233 -74019 -98840 -83818 -39400 52 22804
10860 22804 49988 12676 -24829 33983 4997 -36920 -46428 -32912 -27304 -10954 -47091 -64251
$$ packed form
10946C8350J1442m2921L489k0098k6636J595K15q740k8075K9711k2863m8111L8492
10933g4150L0271K1280K3395M4971l496J2516j7386q067L0922o6230j1764j4375
10921c2113L3376M5542k2680p362K1469j6613m7217P40l3227Q028M8030J5848
10909A3821J6827J1715L3807P313l9752j0800q0949m2401K4133l0221K3640L7086
10897c5781R048r04l779p274J5770M7144m1112l0023l2750K6307O507K751R971
10884c4125j3612j3340J5040o176k1318J4365M6302j6656k2858M1512l3198k6933
10872g0997K6134L1903L3428j7976K676l1401m7786k4821J5022M4418L9452K2752
10860B2804K7184l7312l7505N8812k8986m1917r508J3516N608J6350l6137j7160
$$ plain form
10848 -64251 -65979 -81552 -95497 -104375 -36837 -46117 -98913 -82037 -75341 -66620 -25737 -45066 -26894
10835 -26894 -51481 -41115 -54768 -68098 -83291 -110784 -122202 -101743 -75408 -38190 -45423 -16446
10823 -16446 2000 8655 11814 12975 17654 -26975 -35339 15620 52055 61454 57987 64827 45981
10810 45981 -30726 -9281 -9999 -28777 -41360 -59556 -83767 -34662 18854 24968 -12607 -68521
10798 -68521 -58413 -53938 -32795 6066 -7570 -13627 -23814 -6279 -7536 -15610 -23983 -8773 -8982
10785 -8982 4332 24091 25118 897 -48149 -59865 -15934 -4989 5793 -3526 -10173 -8148 -14458
10772 -14458 20043 29978 15195 -9326 -8265 17166 -838 -30332 -3582 5113 1930 -12837
10760 -12837 3821 -11527 -21262 -6964 -50770 -28071 -19919 -21523 -39925 -53553 -63652 -49610
$$ packed form
10848f4251j728j5573j3945q878O7538r280n2796J6876O696Q721M0883j9329J8172
10835b6894k4587J0366j3653j3330j5193k7493j1418K0459K6335L7218p233K8977
10823a6446J8446O655L159J161M679m4629q364N0959L6435R399l467O840j8846
10810D5981p6707K1445p18j8778j2583j8196k4211M9105N3516O114l7575n5914
10798f8521J0108M475K1143L8861j3636o057j0187J7535j257q074q373J5210k09
10785h982J3314J9759J027k4221m9046j1716M3931J0945J0782r319o647K025o310
10772a4458L4501R935j4783k4521J061K5431j8004k9494K6750Q695l183j4767
10760a2837J6658j5348r735J4298m3806K2699Q152j604j8402j3628j0099J4042
$$ plain form
10748 -49610 -21802 2266 4567 12433 38687 43916 -7831 -42455 -34310 -38638 -8799 -22901 -32655
10735 -32655 -53777 -43276 -38195 -22847 -36892 -57429 -25515 16289 49864 40086 19644 -11311
10723 -11311 -48838 -53306 -59796 2550 41497 61097 21108 -29295 -44836 -38305 -27495 -26327
10711 -26327 -29030 -25877 -16222 -24086 -43355 -10364 -24142 -30271 -41688 -22183 22903 -30015 -69783
10698 -69783 -21243 37415 91362 73807 52445 16617 -19623 -50220 -18765 -1731 -25137 -54092
10686 -54092 -125303 -121783 -49643 -9145 7624 14080 13530 34976 54181 10388 -28529 -5167
10674 -5167 -6314 -26074 -32307 1504 33127 1685 -26059 -15103 -12982 6695 -28265 -62846
10662 -62846 -19582 17019 42636 31869 21524 51976 42495 10610 -2538 32398 9446 27461
$$ packed form
10748d9610K7808K4068K301P866K6254N229n1747l4624Q145m328K9839j4102r754
10735c2655k1122J0501N081J5348j4045k0537L1914M1804L3575r778k0442l0955
10723a1311l7527m468o490O2346L8947J9600l9989n0403j5541O531J0810J168
10711b6327k703L153R655p864j9269L2991j3778o129j1417J9505M5086n2918l9768
10698f9783M8540N8658N3947j7555k1362l5828l6240l0597L1455J7034k3406k8955
10686e4092p1211L520P2140M0498J6769O456n50K1446J9205m3793l8917K3362
10674e167j147j9760o233L3811L1623l1442k7744J0956K121J9677l4960l4581
10662f2846M3264L6601K5617j0767j0345L0452r481l1885j3148L4936k2952J8015
$$ plain form
10650 27461 18526 25754 18076 2396 -6869 -48273 -59194 -48354 -28062 -36120 -46879 -52755 -10108
10637 -10108 -18396 -18328 -37006 -72687 -93615 -72248 -15653 25548 24988 15784 8369 -8662 -57886
10624 -57886 -56535 -16509 59996 80301 30935 19443 18410 16847 9237 24318 20716 -27919 -70538
10611 -70538 -23155 -31531 -5784 22508 29017 19232 -8293 -69124 -91009 -65818 -55282 -89403
10599 -89403 -93195 -39317 16139 59932 55611 -6412 -9916 -10508 -34268 -108455 -128132 -131589 -158853
10586 -158853 -144780 -76306 -48600 -16970 -66318 -39190 -21130 -2708 8249 479 19825 42471
10574 42471 65705 39314 -17349 -35316 -37819 -84568 -105596 -65021 -37452 -28217 -28524 -16444
10562 -16444 12751 42491 65526 45254 27978 52026 57811 106575 123152 131639 108142 81098
$$ packed form
10650B7461q935P228p678j5680r265m1404j0921J0840K0292q058j0759n876M2647
10637a0108q288O8j8678l5681k0928K1367N6595M1201n60r204p415j7031m9224
10624e7886J351M0026P6505K0305m9366j1492j033j563p610J5081l602m8635m2619
10611g0538M7383q376K5747K8292O509r785k7525o0831k1885K5191J0536l4121
10599h9403l792N3878N5456M3793m321o2023l504n92k3760p4187j9677l457k7264
10586a58853J4073O8474K7706L1630m9348K7128J8060J8422J0957p770J9346K2646
10574D2471K3234k6391n6663j7967k503m6749k1028M0575K7569R235l07J2080
10562a6444K9195K9740K3035k0272j7276K4048N785M8764J6577Q487k3497k7044
$$ plain form
10550 81098 34025 51346 37626 -5383 20113 20825 4548 -23122 -13970 -56400 -68806 -118762
10538 -118762 -131292 -41718 25547 53642 37231 2258 -13004 -28178 -22659 -13988 -19184 -42904
10526 -42904 -86546 -118914 -133715 -99082 -87229 -67828 -32210 17860 39923 6069 -35722 -11334
10514 -11334 17078 24948 36528 62387 74005 42255 45155 51579 46117 48862 -10205 -50331 -52283
10501 -52283 -35187 -20427 -26590 45346 38875 22113 -18998 670 -4089 9048 -15344 -31248
10489 -31248 -11751 -11492 -33650 -43363 -18420 5103 -626 9139 3124 23533 7507 -17299 -32669
10476 -32669 15986 28253 39651 34402 -27744 -51309 -33882 -22064 29201 106280 110117 45485
10464 45485 43828 7489 -1993 3258 14293 8954 -7480 -17325 -22380 -12669 -7717 -35041 -27038
$$ packed form
10550H1098m7073J7321j3720m3009K5496P12j6277k7670R152m2430j2406m9956
10538a18762j2530Q9574O7265K8095j6411l4973j5262j5174N519Q671n196k3720
10526d2904m3642l2368j4801L4633J1853J9401L5618N0070K2063l3854m1791K4388
10514a1334K8412P870J1580K5859J1618l1750K900O424n462K745n9067m0126j952
10501e2283J7096J4760o163P1936o471j6762m1111J9668m759J3137k4392j5904
10489c1248J9497K59k2158r713K4943K3523n729R765o015K0409j6026k4806j5370
10476c2669M8655J2267J1398n249o2146k3565J7427J1818N1265P7079L837o4632
10464D5485j657l6339r482N251J1035n339j6434r845n055R711M952k7324Q003
$$ plain form
10451 -27038 8410 -12605 -9930 13916 29399 8773 -39820 -100 -4087 10772 8724 -13729
10439 -13729 -52834 -52367 -12767 -20614 -47793 -48285 -49504 -111215 -86639 -23289 -21440 -1877 17068
10426 17068 12062 -9214 12181 5794 -10476 -17985 -42064 -51223 -36748 -48851 -15610 53227
10414 53227 64866 99071 58149 21199 35819 48364 -14102 -17380 -28292 -45630 -15520 -40106
10402 -40106 -63437 -48884 -52761 -42254 -22756 -12146 -44831 -106555 -103098 -45896 -2533 4752
10390 4752 6994 -46801 -84913 -81015 -100461 -50339 -8782 -3312 4395 7805 -8766 -35472 -73600
10377 -73600 -64529 -50946 -21320 -10189 -31314 -24525 3731 -5879 -14363 1548 35323 -4674
10365 -4674 31227 13425 -14964 19771 58563 74755 38114 569 3271 14833 8414 13187
$$ packed form
10451b7038L5448k1015K675K3846J5483k0626m8593L9720l987J4859k048k2453
10439a3729l9105M67L9600p847k7179m92j219o1711K4576O3350J849J9563J8945
10426A7068n006k1276K1395o387j6270p509k4079r159J4475j2103L3241O8837
10414E3227J1639L4205m0922l6950J4620J2545o2466l278j0912j7338L0110k4586
10402d0106k3331J4553l877J0507J9498J0610l2685o1724L457N7202M3363P285
10390D752K242n3795l8112L898j9446N0122M1557N470P707L410j6571k6706l8128
10377g3600R071J3583K9626J1131k1125O789K8256r610q484J5911L3775l9997
10365d674L5901j7802k8389L4735L8792J6192l6641l7545K702J1562o419M773
$$ plain form
10353 13187 18233 6752 -7380 -41660 -13072 39704 -40856 -78931 -53767 -81183 -42963 -42194
10341 -42194 -88008 -126437 -85196 -78304 -36372 -20394 -25077 -44306 -77246 -129625 -133081 -82530
10329 -82530 -24856 25406 76633 82842 88217 35517 -60506 -48023 -58085 -38253 -15817 -19453
10317 -19453 -5297 31628 36078 24689 35786 -8764 -69389 -64599 -21213 -9990 -14472 -1100
10305 -1100 -20688 -32371 -1239 25181 -4241 11468 39111 72372 38194 22742 44525 40439
10293 40439 49402 92844 82503 55147 760 -45811 -3912 1440 -15769 -12236 26040 31750
10281 31750 -28139 -25745 6805 -11224 13094 -10984 -31029 -10955 -11200 -32211 -35908 -19216
10269 -19216 -53024 -58464 -30519 -12801 7708 15795 12688 20454 -11287 -3588 -10256 704 38525
$$ packed form
10353A3187N046j1481j4132l4280K8588N2776q0560l8075K5164k7416L8220P69
10341d2194m5814l8429M1241O892M1932J5978m683j9229l2940n2379l456N0551
10329h2530N7674N0262N1227O209N375n2700r6023J2483j0062J9832K2436l636
10317a9453J4156L6925M450j1389J1097m4550o0625M790M3386J1223m482J3372
10305a100j9588j1683L1132K6420k9422J5709K7643L3261l4178j5452K1783m086
10293D0439Q963M3442j0341k7356n4387m6571M1899N352j7209L533L8276N710
10281C1750n9889K394L2550j8029K4318k4078k0045K0074k45k1011l697J6692
10269a9216l3808n440K7945J7718K0509Q087l107P766l1741P699o668J0960L7821
$$ plain form
10256 38525 -5740 -24443 -3780 -10838 -20918 -37230 -44486 -50781 -36385 133 9418 -42836
10244 -42836 -46608 -74953 -63749 -46563 -51176 -65819 -51799 -16777 -7202 16509 36662 51128
10232 51128 -4462 -38142 -15899 37518 808 33587 73499 63681 42218 30250 1792 34702
10220 34702 54071 82783 65079 64749 42891 -4978 -23196 -47190 -84596 -52274 -23370 9129
10208 9129 -36491 -49419 26971 76124 54787 15873 35978 55338 42065 30011 26297 37488
10196 37488 26831 23821 -30997 -35538 17769 37081 9399 22739 -1082 13320 70820 53345
10184 53345 442 -44891 -75677 -55054 -52956 -68394 -34255 22621 57828 27826 16023 -4024
10172 -4024 190 3635 -313 12711 -14220 -32760 -80595 -2777 37209 24112 42017 38761 18996
$$ packed form
10256C8525m4265j8703K0663p058j0080j6312p256o295J4396L6518R285n2254
10244d2836l772k8345J1204J7186m613j4643J4020L5022R575K3711K0153J4466
10232E1128n5590l3680K2243N3417l6710L2779L9912r818k1463j1968k8458L2910
10220C4702J9369K8712j7704l30k1858m7869j8218k3994l7406L2322K8904L2499
10208I129m5620j2928P6390M9153k1337l8914K0105J9360j3273j2054l714J1191
10196C7488j0657l010n4818m541N3307J9312k7682J3340k3821J4402N7500j7475
10184E3345n2903m5333l0786K0623K098j5438L4139N6876L5207l0002j1803k0047
10172d024M214L445l948J3024k6931j8540m7835P7818L9986j3097J7905l256j9765
$$ plain form
10159 18996 35998 46506 11408 -23528 6079 -11589 8211 48887 12076 -25412 -43438 -26118
10147 -26118 -40695 -65126 -48694 -36511 -20952 16074 46498 42958 14582 30696 136 8345
10135 8345 46247 69686 79513 52026 514 -8597 -45440 -101156 -70276 -24859 25062 90901
10123 90901 117095 114254 89654 57961 25210 44274 10692 50291 68442 62296 108027 52332
10111 52332 -16791 -12384 -26967 -74075 -29858 3700 -32178 -52307 -2708 61621 69805 60684
10099 60684 13095 14270 10787 -16736 -2597 22635 53453 19272 28110 -20695 -22940 -41372
10087 -41372 -26286 -1023 15197 37352 46945 62052 49207 -1120 -17145 -13070 -25810 -30886
10075 -30886 5104 1822 14600 14017 19667 21613 15273 -15121 -24945 -32656 -22001 5821 -5567
$$ packed form
10159A8996J7002J0508l5098l4936K9607j7668J9800M0676l6811l7488j8026J7320
10147b6118j4577k4431J6432J2183J5559L7026L0424l540k8376J6114l0560Q209
10135H345L7902K3439R827k7487n1512r111l6843n5716L0880M5417M9921O5839
10123I0901K6194k841k4600l1693l2751J9064l3582L9599J8151o146M5731n5695
10111E2332o9123M407j4583m7108M4217L3558l5878k0129M9599O4329Q184r121
10099F0684m7589J175l483k7523J4139K5232L0818l4181Q838m8805k245j8432
10087d1372J5086K5263J6220K2155R593J5107j2845n0327j6025M075j2740n076
10075c0886L5990l282J2778n83N650J946o340l0394r824p711J0655K7822j1388
$$ plain form
10062 -5567 -34704 -20975 31870 16540 -33057 -23662 15362 34906 23192 38588 69187 74149
10050 74149 71346 86818 49545 10169 -11159 -13179 -25052 -24419 -14603 -15490 -11940 -17333 1438
10037 1438 20600 69815 24613 41334 100828 96878 36143 82556 108756 49280 25566 -8782
10025 -8782 21036 25243 22466 33277 18251 -17288 -79679 -67105 -15328 29209 22402 33378
10013 33378 18195 26083 36591 28008 40444 26700 -6548 -41945 12120 52526 19099 37743
10001 37743 51179 58771 65878 81446 41668 38290 60446 101178 143738 180291 153747 74504
9989 74504 51519 41788 61211 74968 39192 29762 62597 54238 51682 69139 67659 61627 52036
9976 52036 86219 91950 61912 6172 -39021 -32226 2910 38722 17759 26363 30101 9315 60342
$$ packed form
10062e567k9137J3729N2845j5330m9597R395L9024J9544j1714J5396L0599M962
10050G4149k803J5472l7273l9376k1328k020j1873O33R816q87L550n393J8771
10037A438J9162M9215m5202J6721N9494l950o0735M6413K6200n9476k3714l4348
10025h782K9818M207k777J0811j5026l5539o2391J2574N1777M4537o807J0976
10013C3378j5183P888J0508q583J2436j3744l3248l5397N4065M0406l3427J8644
10001C7743J3436P592P107J5568l9778l378K2156M0732M2560L6553k6544p9243
9989G4504k2985r731J9423J3757l5776r430L2835q359k556J7457j480o032r591
9976E2036L4183N731l0038n5740m5193O795L5136L5812k0963Q604L738k0786N1027
$$ plain form
9963 60342 81848 16909 15799 3502 -21080 -9549 904 58551 71673 67783 73579 83442 57204
9950 57204 95700 92225 104738 116667 164010 128686 85083 77847 103159 97269 106122 131612 125494
9937 125494 101224 53351 23679 11694 10335 7796 42273 51924 72247 80917 60131 56325 42971
9924 42971 42928 77590 124549 110818 69624 39413 24038 47747 76397 67878 59508 32408 13967
9911 13967 30497 20846 5099 1146 34936 38197 42451 57201 130162 172051 148963 104897 70559
9898 70559 36479 -4121 -5002 12171 17060 48100 76098 7601 -10709 41686 66678 85410
9886 85410 92451 75325 75189 77550 87527 128129 154765 144778 132647 138876 116262 122889 122375 121168
9872 121168 133270 174345 195892 193225 236061 216536 205249 255159 286423 308164 264974 216499
$$ packed form
9963F0342K1506o4939j110j2297k4582J1531J0453N7647J3122l890N796R863k6238
9950E7204L8496l475J2513J1929M7343l5324m3603p236K5312n890Q853K5490o118
9937A25494k4270m7873k9672j1985j359k539L4477R651K0323Q670k0786l806j3354
9924D2971m3L4662M6959j3731m1194l0211j5375K3709K8650q519q370k7100j8441
9911A3967J6530r651j5747l953L3790L261M254J4750P2961M1889k3088m4066l4338
9898G0559l4080m0600q81J7173M889L1040K7998o8497j8310N2395K4992J8732
9886H5410P041j7126j36K361R977M0602K6636r987j2131O229k2614O627n14j207
9872A21168J2102M1075K1547k667M2836j9525j1287M9910L1264K1741m3190m8475
$$ plain form
9860 216499 210853 207077 247898 289622 296199 314020 292646 253264 263631 274811 267783 254738
9848 254738 264077 280350 301864 272617 242022 300114 270641 211303 213549 268185 335761 363172
9836 363172 374920 398306 462737 517020 533193 508124 489440 501942 539544 486766 455966 465793
9824 465793 501984 526187 589976 600010 588446 596859 642410 646970 637057 679774 711804 762351
9812 762351 829209 872498 868493 894603 922301 986649 1073010 1191349 1222783 1258503 1366384
9801 1366384 1465952 1619974 1778510 1957332 2100734 2381887 2656557 2965629 3348214 3834582
9791 3834582 4413884 5117975 5901390 6877170 8194991 9874241 11982413 14613835 17845175
9782 17845175 21917967 27019019 33310794 40797310 48849217 56225967 61390541 63253318
$$ packed form
9860B16499n646l776M0821M1724O577J7821k1374l9382J0367J1180p028j3045
9848B54738R339J6273K1514k9247l0595N8092k9473n9338K246N4636O7576K7411
9836C63172J1748K3386O4431N4283J6173k5069j8684J2502L7602n2778l0800R827
9824D65793L6191K4203O3789J0034j1564Q413M5551M560r913M2717L2030N0547
9812G62351O6858M3289m005K6110K7698O4348Q6361J18339L1434L5720J07881
9801A366384R9568J54022J58536J78822J43402K81153K74670L09072L82585M86368
9791C834582N79302P04091P83415R75780J317821J679250K108172K631422L231340
9782A7845175M072792N101052O291775P486516Q051907P376750N164574J862777
$$ plain form
9774 63253318 61702131 57248715 51003311 44433995 38669064 34022850 30355743 27478634
9766 27478634 25235812 23410403 21966919 20775954 19786402 18905788 18123445 17450854 16886489
9757 16886489 16453452 16246120 16202726 16325117 16652251 17315939 18323319 19769877 21714175
9748 21714175 24371607 27927431 32594805 38508744 45987010 55565460 68071477 84248545
9740 84248545 103745471 123505604 138398247 144560047 141111690 128974064 111128093
9733 111128093 92437058 76552967 64436155 55513180 48891324 43885405 39992325 36879363
9725 36879363 34334481 32199558 30186122 28180416 26302197 24588785 23055177 21691888
9717 21691888 20585490 19726157 19114578 18780142 18698967 18882208 19334908 20113988 21405627
$$ packed form
9774F3253318j551187m453416o245404o569316n764931m646214l667107k877109
9766B7478634k242822j825409j443484j190965r89552q80614p82343o72591n64365
9757A6886489m33037k07332m3394J22391L27134O63688J007380J446558J944298
9748B1714175K657432L555824M667374N913939P478266R578450J2506017J6177068
9740H4248545J9496926J9760133J4892643O161800l448357j2137626j7845971
9733A11128093j8691035j5884091j2116812q922975o621856n005919l893080l112962
9725C6879363k544882k134923k013436k005706j878219j713412j533608j363289
9717B1691888j106398q59333o11579l34436q1175J83241M52700P79080J291639
$$ plain form
9708 21405627 23216807 25558773 28543235 32302748 36924996 42627006 49175073 55798106
9700 55798106 61074465 63701226 63049656 59168949 52883750 45501155 38453686 32544193
9692 32544193 27862336 24245751 21425045 19149135 17315213 15812569 14522209 13302539
9684 13302539 12127786 11081999 10085395 9113527 8223465 7432709 6755397 6108742 5560754
9675 5560754 5108469 4709974 4395974 4035168 3666091 3316292 3028290 2775968 2603415 2460813
9665 2460813 2293775 2175756 2054674 1943897 1837140 1682696 1505096 1437530 1374193 1323555
9655 1323555 1315528 1230949 1112899 1046489 1006847 940524 856688 821639 808655 756596 706278
9644 706278 710647 645396 627175 612977 587626 544004 513578 537306 542775 509405 522722 491588
$$ packed form
9708B1405627J811180K341966K984462L759513M622248N702010O548067O623033
9700E5798106N276359K626761o51570l880707o285199p382595p047469n909493
9692C2544193m681857l616585k820706k275910j833922j502644j290360j219670
9684A3302539j174753j045787r96604r71868q90062p90756o77312o46655n47988
9675E560754m52285l98495l14000l60806l69077l49799k88002k52322j72553j42602
9665B460813j67038j18019j21082j10777j06757j54444j77600o7566o3337n0638
9655A323555q027q4579j18050o6410l9642o6323q3836l5049j2984n2059n0318
9644G06278M369o5251j8221j4198k5351m3622l0426K3728N469l3370J3317l1134
$$ plain form
9632 491588 445354 459229 463950 414362 417524 414429 402105 426769 458997 460106 405572 394667
9620 394667 358193 360493 397754 370926 313831 336161 376571 400341 390599 389004 370847 338531
9608 338531 351161 363305 384123 383769 380622 358298 340256 366848 345894 314898 308572 312330 344501
9595 344501 331036 278565 259317 270333 257247 305457 368953 300305 268982 299840 348581 336959
9583 336959 273096 242951 256038 271761 279055 279611 239395 209376 258510 277842 285586 285307 301482
9570 301482 300087 333804 375822 381058 335968 318332 269603 217542 214222 205130 163812 197917
9558 197917 210502 213266 226601 278027 297853 263563 235474 255105 261490 284773 298202 293018
9546 293018 320536 288197 285104 285051 259296 231738 201646 168886 116422 70597 67995 89252 131990
$$ packed form
9632D91588m6234J3875M721m9588L162l095j2324K4664L2228J109n4534j0905
9620C94667l6474K300L7261k6828n7095K2330M0410K3770r742j595j8157l2316
9608C38531J2630J2144K0818l54l147k2324j8042K6592k0954l0996o326L758L2171
9595C44501j3465n2471j9248J1016j3086M8210O3496o8648l1323L0858M8741j1622
9583C36959o3863l0145J3087J5723P294N56m0216l0019M9134J9332P744k79J6175
9570C01482j395L3717M2018N236m5090j7636m8729n2061l320r092m1318L4105
9558A97917J2585K764J3335N1426J9826l4290k8089J9631O385K3283J3429n184
9546B93018K7518l2339l093n3k5755k7558l0092l2760n2464m5825k602K1257M2738
$$ plain form
9533 131990 76943 115172 168347 202085 235237 218977 191465 219150 229139 212856 153350 178803
9521 178803 245276 234987 179425 188861 187472 178324 155780 196763 178767 139425 156097 185853
9509 185853 158746 202223 170461 144370 115717 120767 104869 100959 116962 92089 113509 98993
9497 98993 120463 145472 121077 70939 85249 78256 24598 73229 142846 151403 133570 120657
9485 120657 100671 64419 106436 154174 151708 118795 87023 76812 67486 30752 20398 31708
9473 31708 857 5019 37075 31842 41908 32469 25752 7278 -51377 -64345 -16907 32156 28560
9460 28560 48531 76900 101111 137724 115988 110887 101341 96126 110901 65435 64005 104598 129921
9447 129921 130571 157190 192131 158136 103148 13151 -13477 -21133 -14700 5855 29682 25625 27555
$$ packed form
9533A31990n5047L8229N3175L3738L3152j6260k7512K7685R989j6283n9506K5453
9521A78803O6473j0289n5562R436j389r148k2544M0983j7996l9342J6672K9756
9509A85853k7107M3477l1762k6091k8653N050j5898l910J6003k4873K1420j4516
9497I8993K1470K5009k4395n0138J4310o993n3658M8631O9617Q557j7833j2913
9485A20657j9986l6252M2017M7738k466l2913l1772j0211r326l6734j0354J1310
9473C1708l0851M162L2056n233J0066r439o717j8474n8655j2968M7438M9063l596
9460B8560J9971K8369K4211L6613k1736n101r546n215J4775m5466j430M0593K5323
9447A29921O50K6619L4941l3995n4988q9997k6628p656O433K0555K3827m057J930
$$ plain form
9434 27555 60486 61432 43275 48636 58961 33174 7676 35768 38900 40705 23451 19429 21029
9421 21029 -16380 -8393 12511 757 -584 1821 29971 25902 26345 10091 26585 63716 57176
9408 57176 25034 60966 79770 46569 57980 19894 34353 61337 29064 38614 92947 124576
9396 124576 68617 71235 68604 28333 -12257 -20032 10196 25141 -419 -17417 957 26731
9384 26731 100249 98037 73227 51004 23219 6950 39713 23649 9110 -5685 -78687 -133845
9372 -133845 -136027 -100800 -54787 -22605 -9785 9364 57523 56788 80952 83936 85785 85101 74382
9359 74382 67120 25026 -7494 -8011 -2215 24131 60901 16751 72260 154663 146475 81132 29327
9346 29327 21348 45524 47103 -3149 -39844 -14587 -16704 18103 -7569 -35189 -47827 -3102
$$ packed form
9434B7555L2931R46j8157N361J0325k5787k5498K8092L132J805j7254m022J600
9421B1029l7409P987K0904j1754j341K405K8150m069M43j6254J6494L7131o540
9408E7176l2142L5932J8804l3201J1411l8086J4459K6984l2273R550N4333L1629
9396A24576n5959K618k631m0271m0590p775L0228J4945k5560j6998J8374K5774
9384B6731P3518k212k4810k2223k7785j6269L2763j6064j4539j4795p3002n5158
9372a33845k182L5227M6013L2182J2820J9149M8159p35K4164K984J849o84j0719
9359G4382p262m2094l2520n17N796K6346L6770m4150N5509Q2403q188o5343n1805
9346B9327p979K4176J579n0252l6695K5257k117L4807k5672k7620j2638M4725
$$ plain form
9334 -3102 237 15218 22393 59250 58237 -27801 -62366 -35099 -18029 28105 58921 24935 -8491
9321 -8491 -12875 1414 20545 97804 110873 69238 11034 40866 69062 70294 89987 113066
9309 113066 87086 110992 61844 23295 33992 56868 77211 64521 37299 18393 22694 35785
9297 35785 23645 -3239 -27629 -45790 -34646 -19799 58849 61515 56282 101980 91732 102199
9285 102199 96245 45233 26675 59391 61166 23759 -23 21929 23716 58246 58283 23411 11219
9272 11219 -35863 -1212 62393 65591 39598 32106 23354 51424 50036 29116 -24133 -32652 8246
9259 8246 54270 48405 52153 73701 72593 -13102 -19463 29022 14541 -4716 1848 36941 39411
9246 39411 113677 124013 133451 154378 154694 119925 96307 83965 79425 93654 98835 67305 61677
$$ packed form
9334c102L339J4981P175L6857j013q6038l4565K7267J7070M6134L0816l3986l3426
9321h491m384J4289J9131P7259J3069m1635n8204K9832K8196J232J9693K3079
9309A13066k5980K3906m9148l8549J0697K2876K0343j2690k7222j8906M301J3091
9297C5785j2140k6884k4390j8161J1144J4847P8648K666n233M5698j0248J0467
9285A02199n954n1012j8558L2716J775l7407k3782K1952J787L4530L7l4872j2192
9272A1219m7082L4651O3605L198k5993p492q752K8070j388k0920n3249q519M0898
9259H246M6024n865L748K1548j108q5695o361M8485j4481j9257O564L5093K470
9246C9411P4266J0336R438K0927L16l4769k3618j2342m540J4229N181l1530n628
$$ plain form
9233 61677 74733 99041 131175 142379 111265 95850 115046 137634 128921 178520 200936 212493
9221 212493 242575 255542 279633 329327 303360 321264 355386 387963 412966 387745 342843 371633
9209 371633 462659 517660 596370 694588 820067 948580 1046795 1225484 1496865 1785359 2109247
9198 2109247 2615376 3217285 3956466 4831030 5809653 6779384 7436463 7596143 7287470 6649638
9188 6649638 5807358 4883148 4078694 3459546 2999951 2634173 2384756 2161631 1922583 1727739
9178 1727739 1596173 1463912 1335369 1226810 1125705 1007548 938819 865571 765480 692451
9168 692451 647665 634552 592903 530427 484475 422832 390463 358619 321391 300879 288596 250228
9156 250228 199706 218394 235460 230371 159329 136567 96983 98971 111024 148875 150527 110734
$$ packed form
9233F1677J3056K4308L2134J1204l1114j5415J9196K2588q713M9599K2416J1557
9221B12493L0082J2967K4091M9694k5967J7904L4122L2577K5003k5221m4902K8790
9209C71633R1026N5001P8710R8218J25479J28513R8215J78689K71381K88494L23888
9198B109247N06129O01909P39181Q74564R78623R69731O57079J59680l08673o37832
9188F649638q42280r24210q04454o19148m59595l65778k49417k23125k39048j94844
9178A727739j31566j32261j28543j08559j01105j18157o8729p3248j00091p3029
9168F92451m4786j3113m1649o2476m5952o1643l2369l1844l7228k0512j2283l8368
9156B50228n0522J8688J7066n089p1042k2762l9584J988J2053L7851J652l9793
$$ plain form
9144 110734 67906 40224 63786 82156 86474 82959 87794 48549 6056 33766 96588 106714
9132 106714 44523 33050 85661 116992 101523 67066 53032 45710 63603 48569 67891 101712
9120 101712 93272 69109 82968 98462 39247 -3863 48801 60552 25194 83478 91326 25646
9108 25646 30488 59929 70826 62313 94450 95546 103783 63417 42255 68903 47762 75282 99806
9095 99806 117009 76536 51250 50264 66114 68816 37628 2612 -283 -15556 20837 42949 52522
9082 52522 49338 5608 -11434 -62208 -73525 -55396 -41262 -46503 -36607 34183 32301 14928 33460
9069 33460 31572 -23872 -52956 -41838 20584 63113 90993 75469 44464 20856 38044 59267
9057 59267 90163 84410 97147 87680 70913 53119 47059 48299 23988 6048 -25538 -13616 -18690
$$ packed form
9144A10734m2828k7682K3562J8370M318l515M835l9245m2493K7710O2822J0126
9132A06714o2191j1473N2611L1331j5469l4457j4034p322J7893j5034J9322L3821
9120A01712q440k4163J3859J5494n9215m3110N2664J1751l5358N8284P848o5680
9108B5646M842K9441J0897q513L2137J096Q237m0366k1162K6648k1141K7520K4524
9095I9806J7203m0473k5286r86J5850K702l1188l5016k895j5273L6393K2112R573
9082E2522l184m3730j7042n0774j1317J8129J4134n241R896P0790j882j7373J8532
9069C3460j888n5444k9084J1118O2422M2529K7880j5524l1005k3608J7188K1223
9057E9267L0896n753J2737r467j6767j7794o060J240k4311j7940l1586J1922n074
$$ plain form
9044 -18690 -31222 -272 -5390 -6492 39952 18836 -5429 -11838 -11414 -13159 9697 24088 32546
9031 32546 38925 65397 40981 -44272 -46297 -45067 -31822 46825 76626 62429 13319 19261 53403
9018 53403 11878 17808 35000 23741 18672 46210 38875 29313 5055 -35757 -33610 14391 20792
9005 20792 56173 62496 44829 94508 81729 59331 45056 12242 -33757 -57994 -48610 -22946
8993 -22946 454 -30879 -28579 -19256 -50405 -55783 -21667 15346 8167 39822 29773 -66374 -52159
8980 -52159 -12393 -5712 9432 4599 18055 22132 -7846 21016 23954 25111 6319 -28534 7179
8967 7179 -14405 -55991 -55681 -73939 -48243 24193 71310 14609 -14053 -5274 -26415 -21440 -60993
8954 -60993 -93598 -69160 -54673 -60830 -11415 -41568 -75224 -32610 -21702 -4380 16804 34138
$$ packed form
9044a8690j2532L0950n118j102M6444k1116k4265o409M24j745K2856J4391Q458
9031C2546O379K6472k4416q5253k025J230J3245P8647K9801j4197m9110N942L4142
9018E3403m1525N930J7192j1259n069K7538p335r562k4258m0812K147M8001O401
9005B0792L5381O323j7667M9679j2779k2398j4275l2814m5999k4237R384K5664
8993b2946K3400l1333K300R323l1149n378L4116L7013p179L1655j0049r6147J4215
8980e2159L9766O681J5144m833J3456M077k9978K8862K938J157j8792l4853L5713
8967G179k1584m1586L10j8258K5696P2436M7117n6701k8662Q779k1141M975l9553
8954f0993l2605K4438J4487o157M9415l0153l3656M2614J0908J7322K1184J7334
$$ plain form
8942 34138 -2539 -20132 -34290 -26752 -28672 -50603 -22921 -31836 -19222 -33428 -27690 -11800 -38503
8929 -38503 -49212 -49366 -39597 -9377 -34499 -101045 -90528 -47150 -24395 -8913 12880 3890 -14642
8916 -14642 21957 6131 9560 17701 32627 34823 22775 -13988 -20642 -40604 -83105 -88223 -38962
8903 -38962 -32080 -45943 -47085 -69632 -61114 -45157 -67700 -76013 -32791 5620 9008 -2946 8517
8890 8517 20963 32400 -8797 -14139 23579 39080 51232 30244 -101 -4402 -59797 -27026
8878 -27026 -22290 -27385 -29814 -49311 -26985 51631 51172 14635 -795 -18578 -40514 -27460 -58304
8865 -58304 -7856 3941 7024 21057 8477 6740 -568 -3646 -23163 -14380 35158 75195 40360
8852 40360 -13108 -36860 -33287 -65942 -79519 -46560 -38981 16894 18377 -3954 -22618 -32184 -35977
$$ packed form
8942C4138l6677j7593j4158P538j920k1931K7682q915J2614j4206N738J5890k6703
8929c8503j0709j54R769L0220k5122o6546J0517M3378K2755J5482K1793q990j8532
8916a4642L6599j5826L429Q141J4926K196j2048l6763o654j9962m2501n118M9261
8903c8962O882j3863j142k2547Q518J5957k2543q313M3222L8411L388j1954J1463
8890H517J2446J1437m1197n342L7718J5501J2152k0988l0345m301n5395L2771
8878b7026M736n095k429j9497K2326P8616m59l6537j5430j7783k1936J3054l0844
8865e8304N0448J1797L083J4033j2580j737p308l078j9517Q783M9538M0037l4835
8852D0360n3468k3752L573l2655j3577L2959P579N5875J483k2331j8664r566l793
$$ plain form
8839 -35977 -28008 6859 14677 48988 23437 -2578 2870 4860 -43353 -49399 -3916 16710 -7612
8826 -7612 -24171 -20126 -23005 -35375 -48612 -27210 -3238 11155 29838 -37492 -53226 -52688 -34166
8813 -34166 -41829 -11797 29876 45086 -27392 -79753 -68405 -18409 -32969 -54777 -56657 -39479
8801 -39479 3399 -15318 -42948 -43967 -52272 -75826 -49137 -17477 9975 27602 13545 -10617
8789 -10617 -19871 9559 52447 16905 1203 3465 -36485 -98115 -103274 -85217 -33673 6238
8777 6238 56716 79934 96150 80585 59314 31719 72054 57054 63081 103511 73108 47939
8765 47939 36753 49829 50827 10104 -7092 -11472 -1346 -1356 4803 -37097 -18160 7163 -15447
8752 -15447 -30077 -16124 -9413 7396 31962 67515 82348 84384 35915 13961 -1797 -62304
$$ packed form
8839c5977P969L4867P818L4311k5551k6015N448J990m8213o046M5483K0626k4322
8826g612j6559M045k879j2370j3237K1402K3972J4393J8683o7330j5734N38J8522
8813c4166p663L0032M1673J5210p2478n2361J1348M9996j4560k1808j880J7178
8801c9479M2878j8717k7630j019q305k3554K6689L1660K7452J7627j4057k4162
8789a0617r254K9430M2888l5542j5702K262l9950o1630n159J8057N1544L9911
8777F238N0478K3218J6216j5565k1271k7595M0335j5000O027M0430l0403k5169
8765D7939j1186J3076R98m0723j7196m380J0126j0O159m1900J8937K5323k2610
8752a5447j4630J3953O711J6809K4566L5553J4833K036m8469k1954j5758o0507
$$ plain form
8740 -62304 -71740 -66366 9422 85721 89643 77124 43960 55272 47259 16758 39448 40385 33517
8727 33517 12054 18766 10470 1718 -24427 -23163 -9473 47063 32371 -18499 4887 22226 -18742
8714 -18742 -81201 -69736 -48884 -52174 -83714 -98132 -117290 -103877 -40481 -47846 -74114 -36687
8702 -36687 21611 59247 99600 114542 69028 26675 20087 51573 62585 119473 104049 45699
8690 45699 13391 9238 1055 22649 8896 -31357 -60247 -97986 -102157 -81003 -60642 -25913
8678 -25913 -5636 59570 99238 106495 57208 6532 23574 51501 93412 40300 11818 48204
8666 48204 26382 43284 31636 52113 81944 47827 54931 70240 76851 75371 93198 61584
8654 61584 16989 -5762 -11388 12895 5779 65795 45419 50234 98242 112727 74846 50947
$$ packed form
8740f2304r436N374P5788P6299L922j2519l3164J1312q013l0501K2690R37o868
8727C3517k1463O712q296q752k6145J264J3690N6536j4692n0870K3386J7339m0968
8714a8742o2459J1465K0852l290l1540j4418j9158J3413O3396p365k6268L7427
8702c6687N8298L7636M0353J4942m5514m2353o588L1486J1012N6888j5424n8350
8690D5699l2308m153q183K1594j3753m0253k8890l7739m171K1154K0361L4729
8678b5913K0277O5206L9668P257m9287n0676J7042K7927M1911n3112k8482L6386
8666D8204k1822J6902j1648K0477K9831l4117P104J5309O611j480J7827l1614
8654F1584m4595k2751n626K4283p116O0016k0376M815M8008J4485l7881k3899
$$ plain form
8642 50947 115480 126792 110764 155049 185697 155963 143464 110028 42322 68154 142325 149544
8630 149544 163355 107028 50796 88926 106281 84459 51876 39675 107995 111202 65397 115463
$$ packed form
8642E0947O4533J1312j6028M4285L0648k9734j2499l3436o7706K5832P4171P219
8630A49544J3811n6327n6232L8130J7355k1822l2583j2201O8320L207m5805N0066
$$ [...]
##END NTUPLES=NMR SPECTRUM
##END=
