##TITLE=Analysis number 327814
Compound Code cc 29413
Project Code adrs
Chemist Name endeavour
##JCAMPDX= 6.0         $$ Bruker NMR JCAMP-DX V2.0
##DATA TYPE= NMR SPECTRUM
##DATA CLASS= NTUPLES
##ORIGIN= Bruker BioSpin GmbH
##OWNER= nmr
$$ XWIN-NMR		Version 3.5
$$ Wed Apr 11 15:05:40 2007 GMT Daylight Time (UT+1h)  MAYBRIDGE\nmr@NMR_250MHZ
##.OBSERVE FREQUENCY= 250.131544655141
##.OBSERVE NUCLEUS= ^1H
##.ACQUISITION MODE= SIMULTANEOUS (DQD)
##.ACQUISITION SCHEME= undefined
##.AVERAGES= 16
##.DIGITISER RES= 18
##SPECTROMETER/DATA SYSTEM= dpx250
##.PULSE SEQUENCE= zg30
##.SOLVENT NAME= CDCl3
##.SHIFT REFERENCE= (INTERNAL, CDCl3, 0, 16.522)
##AUDIT TRAIL= $$ (NUMBER, WHEN, WHO, WHERE, WHAT)
$$ ##TITLE= Audit trail, XWIN-NMR		Version 3.5
$$ ##JCAMPDX= 5.01
$$ ##ORIGIN= Bruker BioSpin GmbH
$$ ##OWNER= nmr
$$ C:\u/data/dgb/nmr/ADRS/950/pdata/1/auditp.txt
$$ ##AUDIT TRAIL=  $$ (NUMBER, WHEN, WHO, WHERE, WHAT)
(   1,<2007-04-11 15:05:19.28 +100>,<MAYBRIDGE\nmr>,<NMR_250MHZ>,
      <created by zg, POWCHK disabled, PULCHK disabled
       configuration hash MD5:
       49 4B E0 1D 92 C2 6B 37 9F E6 65 BC 52 41 86 1D
       data hash MD5: 64K
       22 34 A7 11 0B 63 6E 96 20 C0 4F 17 86 0F 63 C0>)
(   2,<2007-04-11 15:05:31.77 +100>,<MAYBRIDGE\nmr>,<NMR_250MHZ>,
      <Start of raw data processing
       ef LB = 0.3 FT_mod = 6 PKNL = 1 SI = 32K 
       data hash MD5: 32K
       F7 48 B3 31 3F 51 E7 37 F8 B1 8D 5F 71 96 A8 34>)
(   3,<2007-04-11 15:05:33.78 +100>,<MAYBRIDGE\nmr>,<NMR_250MHZ>,
      <apk 
       data hash MD5: 32K
       AB 91 FD A8 4E 0A 1B 2B CB AF AC 9F D2 B8 75 E1>)
(   4,<2007-04-11 15:05:34.50 +100>,<MAYBRIDGE\nmr>,<NMR_250MHZ>,
      <abs ABSG = 5 
       data hash MD5: 32K
       FF 24 12 61 99 3C E0 EC D0 AC 74 39 40 23 43 32>)
$$ ##END=
$$ 
$$ hash MD5
$$ 6E ED 29 CF DD 3E 45 1A 6B 80 1E 9F CD 2D 71 2F
##$RELAX= 
##$RELAX= 
##$RELAX= 
##$RELAX= 
##$RELAX= 
##$RELAX= 
##$RELAX= 
$$ Bruker specific parameters
$$ --------------------------
##$DU= <C:\u>
##$EXPNO= 950
##$NAME= <ADRS>
##$PROCNO= 1
##$TYPE= <nmr>
##$USER= <dgb>
##$AMP= (0..31)
100 100 100 100 100 100 100 100 100 100 100 100 100 100 100 100 100 100 
100 100 100 100 100 100 100 100 100 100 100 100 100 100 
##$AQSEQ= 0
##$AQ_mod= 3
##$AUNM= <au_zg>
##$AUTOPOS= <33 >
##$BF1= 250.13
##$BF2= 250.13
##$BF3= 250.13
##$BF4= 250.13
##$BF5= 500.13
##$BF6= 500.13
##$BF7= 500.13
##$BF8= 500.13
##$BYTORDA= 1
##$CFDGTYP= 0
##$CFRGTYP= 5
##$CHEMSTR= <none>
##$CNST= (0..31)
1 1 145 1 1 1 1 1 1 1 1 1 1 1 1 1 1 1 1 1 1 1 1 1 1 1 1 1 1 1 1 1 
##$CPDPRG= <>
##$CPDPRG1= <>
##$CPDPRG2= <>
##$CPDPRG3= <>
##$CPDPRG4= <mlev>
##$CPDPRG5= <mlev>
##$CPDPRG6= <mlev>
##$CPDPRG7= <mlev>
##$CPDPRG8= <mlev>
##$CPDPRGB= <>
##$CPDPRGT= <>
##$D= (0..31)
0 1 0 0 0 0 0 0 0 0.06 0 0 0 0 0 0 0.0002 0 0 0 0 0 0 0 0 0 0 0 0 0 0 
0 
##$DATE= 1176300318
##$DBL= (0..7)
120 120 120 120 120 120 120 120 
##$DBP= (0..7)
150 150 150 150 150 150 150 150 
##$DBP07= 0
##$DBPNAM0= <>
##$DBPNAM1= <>
##$DBPNAM2= <>
$$ [...]
##$SUBNAM7= <"">
##$SUBNAM8= <"">
##$SUBNAM9= <"">
##$SW= 20.6930455092707
##$SWIBOX= (0..15)
0 0 3 0 0 0 0 0 0 0 0 0 0 0 0 0 
##$SW_h= 5175.983436853
##$TD= 65536
##$TD0= 1
##$TE= 683.16
##$TE2= 300
##$TE3= 300
##$TEG= 300
##$TL= (0..7)
0 120 120 120 120 120 120 120 
##$TP= (0..7)
150 150 150 150 150 150 150 150 
##$TP07= 0
##$TPNAME0= <>
##$TPNAME1= <>
##$TPNAME2= <>
##$TPNAME3= <>
##$TPNAME4= <>
##$TPNAME5= <>
##$TPNAME6= <>
##$TPNAME7= <>
##$TPOAL= (0..7)
0.5 0.5 0.5 0.5 0.5 0.5 0.5 0.5 
##$TPOFFS= (0..7)
0 0 0 0 0 0 0 0 
##$TUNHIN= 0
##$TUNHOUT= 0
##$TUNXOUT= 0
##$USERA1= <user>
##$USERA2= <user>
##$USERA3= <user>
##$USERA4= <user>
##$USERA5= <user>
##$V9= 5
##$VALIST= <valist>
##$VCLIST= <CCCCCCCCCCCCCCC>
##$VD= 0
##$VDLIST= <DDDDDDDDDDDDDDD>
##$VPLIST= <PPPPPPPPPPPPPPP>
##$VTLIST= <TTTTTTTTTTTTTTT>
##$WBST= 1024
##$WBSW= 4
##$XGAIN= (0..3)
0 0 0 0 
##$XL= 0
##$YL= 0
##$YMAX_a= 636877
##$YMIN_a= -654044
##$ZGOPTNS= <>
##$ZL1= 120
##$ZL2= 120
##$ZL3= 120
##$ZL4= 120
##$ABSF1= 16.522
##$ABSF2= -4.171173
##$ABSG= 5
##$ABSL= 3
##$ALPHA= 0
##$AQORDER= 0
##$ASSFAC= 0
##$ASSFACI= 0
##$ASSFACX= 0
##$ASSWID= 0
##$AUNMP= <proc_1d>
##$AZFE= 0.1
##$AZFW= 0.1
##$BCFW= 0
##$BC_mod= 0
##$BYTORDP= 0
##$COROFFS= 0
##$CY= 12.5
##$DATMOD= 1
##$DC= 0
##$DFILT= <>
##$DTYPP= 0
##$F1P= 14.0000005364418
##$F2P= -0.99999901652339
##$FCOR= 0.5
##$FTSIZE= 32768
##$FT_mod= 6
##$GAMMA= 0
##$GB= 0
##$INTBC= 1
##$INTSCL= 1
##$ISEN= 128
##$LB= 0.3
##$LEV0= 0
##$LPBIN= 0
##$MAXI= 10000
##$MC2= 0
##$MEAN= 0
##$ME_mod= 0
##$MI= 0
##$NCOEF= 0
##$NC_proc= -3
##$NLEV= 6
##$NOISF1= 0
##$NOISF2= 0
##$NSP= 0
##$NTH_PI= 0
##$NZP= 0
##$OFFSET= 16.522
##$PC= 1
##$PHC0= 79.6377
##$PHC1= 5.847513
##$PH_mod= 1
##$PKNL= yes
##$PPARMOD= 0
##$PSCAL= 4
##$PSIGN= 0
##$REVERSE= no
##$SF= 250.13
##$SI= 32768
##$SIGF1= 0
##$SIGF2= 0
##$SINO= 400
##$SIOLD= 32768
##$SREGLST= <1H.CDCl3>
##$SSB= 0
##$STSI= 32768
##$STSR= 0
##$SW_p= 5175.98343685301
##$SYMM= 0
##$S_DEV= 0
##$TDeff= 65536
##$TDoff= 0
##$TI= <Analysis number 999999
Compound Code 99
Book Reference 9
Project Code 9>
##$TILT= no
##$TM1= 0
##$TM2= 0
##$TOPLEV= 0
##$USERP1= <user>
##$USERP2= <user>
##$USERP3= <user>
##$USERP4= <user>
##$USERP5= <user>
##$WDW= 1
##$XDIM= 32768
##$YMAX_p= 391861551
##$YMIN_p= -415246
$$ End of Bruker specific parameters
$$ ---------------------------------
##NTUPLES= NMR SPECTRUM
##VAR_NAME=  FREQUENCY,     SPECTRUM/REAL,   SPECTRUM/IMAG
##SYMBOL=    X,             R,               I
##VAR_TYPE=  INDEPENDENT,   DEPENDENT,       DEPENDENT
##VAR_FORM=  AFFN,          ASDF,            ASDF
##VAR_DIM=   32768,         32768,           32768
##UNITS=     HZ,            ARBITRARY UNITS, ARBITRARY UNITS
##FACTOR=    0.157963299565203, 1,           1
##FIRST=     4132.6476996994, 0,             0
##LAST=      -1043.33573715361, 0,           0
##MIN=       -1043.33573715361, -415246,     0
##MAX=       4132.6476996994, 391861551,     0
$$ Real data points
##PAGE= N=1
##DATA TABLE= (X++(R..R)), XYDATA
$$ [...]
19443B7598J62m512n687P890J0169j614m422J574M518o34n182n34k735P80J404
19428B8775p144q64J7960J1033O912J5493J6757K4087M0146N1086M6378L7397
19416B88016L5061J8321p389k9048m0963l2002l8208k0502J4407L1973N7329O0994
19404C37989L8609J0415k7664n2987o4958p1849n0775k1408o295j473r360n719
19392G4525k208o982l650k841j0411O981M516J1100O003n786m057j883P891O059
19378G9257R033J7653K7167L3788M1511L9271L3548K7574K5271J3904j2020k4037
19366C11920k7478k0280j3315K400J7066L1040L8094K6312J3049l588k9590m7703
19354B97927n4348m9541m6188m3104k1416q010n451k718l259n104j0297r354l058
$$ plain form
19443 27598 27760 23248 17561 25451 35620 34006 29584 31158 35676 35042 29860 29326 26591 27371 28775
19428 28775 21631 20767 38727 49760 56672 72165 88922 113009 153155 204241 250619 288016
19416 288016 323077 341398 334009 304961 263998 231996 193788 173286 187693 219666 276995 337989
19404 337989 376598 387013 359349 306362 241404 169555 118780 97372 91077 89604 80244 74525
19392 74525 72317 65335 61685 58844 48433 55414 59930 71030 77033 71247 67190 65307 73198 79257
19378 79257 88290 105943 133110 166898 208409 247680 281228 308802 334073 347977 335957 311920
19366 311920 284442 264162 250847 253247 270313 301353 339447 365759 378808 375220 345630 297927
19354 297927 243579 194038 147850 104746 83330 75320 69869 67151 63892 58788 48491 39137 36079
19341C6079O774j617j0082k074Q390L739k286n246p240l614l630j318O7Q719O464
19326C3125k455k818j168L126K080j331k067M749J1428J1663P016j49m104o092
19312E3003j445P597l55o022r07j265j5155k156P219L862j751k578o193J942K031
19297C7827n312n137o574o338l150J370K110j928O718P022k727R26J2924J516
19283C9247j1000j1378r186o765L832P629O595j584J391K219k587P772L353L299
19269C2837J2022n41k028m637l358M303O393j830n173r765m847K233J33J718L31
19254B7791M248O29R6k539l378J569J632O442M989M525l031j2850j1510m772O135
19239A9976R528J0634M216p673k924m81j70m399M035j147r58N833J2086K407N95
$$ plain form
19341 36079 42853 41236 31154 29080 37470 41209 38923 33677 26437 22823 19193 17875 17942 26661 33125
19326 33125 30670 27852 26684 29810 31890 30559 28492 33241 44669 56332 63348 63199 59095 53003
19312 53003 51558 59155 58800 52778 51871 50606 35451 33295 40514 44376 42625 40047 33854 35796 37827
19297 37827 32515 27378 20804 14466 11316 12686 14796 12868 19586 26608 23881 24807 37731 39247
19283 39247 28247 16869 7683 918 4750 12379 18974 17390 18781 21000 18413 26185 29538 32837
19269 32837 44859 44318 42290 37653 34295 38598 44991 43161 37988 28223 23376 25609 25742 27460 27791
19254 27791 32039 32668 32764 30225 26847 28416 30048 36490 41479 46004 42973 30123 18613 13841 19976
19239 19976 29504 40138 44354 36681 33757 33276 33106 28707 32742 31595 30637 36470 48556 50963 51558
19224E1558p467k16K541N659R76J592O304k428J443J268m143m624o876O909N452
19209E7948L066k816o536K221o621m082J05M309J790L496j455k282K037j699p383
19194D2098q30K581q6l217N84J607n64J336o11o126O70K918K614J2K696Q728J239
19177E5649N812N23n830n20n07p68R984J1539R386O311J723k915j534j212k594
19162H5047o04K878r47p71M644K570L51k531q490q638j1370m459J3181P783l089
19147G5555o202J616Q436L312J438j803M15J327P827j791m516j1873Q262P435
19133H9438R899N159l276o097n380J456P371J125K26p302j0783j327O365R988
19119I6862P987m244m481q082l153J319m673l80k783l400N382j395K55k483N917
$$ plain form
19224 51558 44091 43875 46416 52075 53051 54643 60947 58519 59962 61230 57087 52463 45587 52496 57948
19209 57948 61014 58198 51662 53883 47262 43180 43285 47594 49384 52880 51425 49143 51180 49481 42098
19194 42098 41268 43849 43763 40546 41130 42737 42173 43509 42898 36772 37442 40360 42974 42986 45682 54410 55649
19177 55649 61461 61984 56154 55634 55127 54359 64343 75882 85268 91579 93302 90387 88853 87641 85047
19162 85047 84443 87321 86374 85603 90247 92817 93168 90637 82147 73509 62139 57680 70861 78644 75555
19147 75555 69353 70969 79405 82717 84155 82352 82767 84094 91921 90130 85614 73741 82003 89438
19133 89438 99337 104496 101220 95123 89743 91199 98570 99695 99921 92619 81836 80509 86874 96862
19119 96862 104849 100605 96124 88042 84889 86208 81535 81155 78372 74972 80354 78959 79214 76731 82648
19104H2648J1590J096O03O692k876k692Q41L415j141k861k546k817n79M05j4175
19089G7603j0517K573Q296N22J91m734J1546J3865O987J016p553q149j1362m281
19075G6003P273J131l893r345r448j456J952N585J29l246J687n391q586K202M990
19060E9587q52J741K794r409k086j847m57N151R537J6660K1623K0641L0332K8134
19046A81549K3898J5996R887Q190N154J874O824J3311J4708R336J1106J1750Q083
19033C21666O141o206j1394l964j3242j8986q934j2566k3104k2874j5482j6659
19021A74396k2184j7052j3878p835Q482P352Q045J0119R111P755L581R559J7036
19008A94487J7400K9581L4883M5186P4273J21180J73358J36932O1405K5335R778
$$ plain form
19104 82648 94238 95334 95937 102629 99753 97061 97902 101317 100176 97315 94769 91952 91373 91778 77603
19089 77603 67086 69659 77955 78477 78668 73934 85480 99345 106332 107348 99795 91646 80284 76003
19075 76003 83276 84407 80514 71169 61721 60265 62217 67802 67931 64685 66372 60981 52395 54597 59587
19060 59587 58735 60476 63270 53861 51775 49928 49471 54622 64159 80819 102442 123083 153415 181549
19046 181549 205447 221443 231330 239520 244674 246548 253372 266683 281391 290727 301833 313583 321666
19033 321666 327807 321601 310207 306243 293001 274015 265081 252515 229411 206537 191055 174396
19021 174396 152212 135160 121282 113447 121929 129281 137326 147445 156556 164311 167892 177451 194487
19008 194487 211887 241468 276351 321537 395810 516990 690348 827280 888685 914020 923798
18997I23798p0427j33554j10502o6599l4567k9442j3368J0895J4496R138R993
18986E09861J184Q48j812q325J2869K2703M3014P1532P3734Q3200P6877M6773
18974I32458r486n1420p1338p2554m3078L7634J22087J55503Q1856Q260k237o3934
18962A023751j57756j60563j03990o4851l6857r646j2556k4090j9961o738J0790
18951D37533M261J3322J2028K3724J7982J8810K2030L1289L5698M5719N8382P0549
18939G91327J12370J35030J34924J24424R9699O3877M5745L4048N3709R1097J13620
18928A799870J35282J59800J90508K34781K94627L66514M60093N86234P62758
18919D990467J069764J606209K495347L902067N852913P704720Q448643Q326813
$$ plain form
18997 923798 853371 719817 609315 542716 508149 478707 465339 476234 490730 499868 509861
18986 509861 511045 511893 510081 501756 514625 537328 580342 651874 725608 808808 885685 932458
18974 932458 922972 871552 800214 727660 684582 722216 844303 999806 1081662 1089922 1087685 1023751
18962 1023751 865995 705432 601442 536591 499734 490088 477532 453442 433481 426743 437533
18951 437533 441794 455116 467144 490868 508850 527660 549690 580979 616677 662396 720778 791327
18939 791327 903697 1038727 1173651 1298075 1397774 1461651 1507396 1541444 1595153 1686250 1799870
18928 1799870 1935152 2094952 2285460 2520241 2814868 3181382 3641475 4227709 4990467
18919 4990467 6060231 7666440 10161787 14063854 19916767 27621487 36070130 44396943
18911D4396943P292770M243323K99529l031894m870348m259627k085102J248814
18903D3234408M651409O410811N819075J962819k895102p235847r859591r915168
18895C2172814q780689o659189m303092k610999j607161j043126p46365n88141
18887E834052m77225l62124k90990k27397j45214m6138N9785J68585K50958K99456
18877E063748K73534J88158J68361L08104N86595J006888J644639K621976M048946
18868A5910949N977077P664063Q207887P960964P791389O363632L119300p94875
18860F2200386l286358l741228k051849K52227K463710M347420N371312L868956
18852F9424576k60765m760984q479682j0173147j0094152r287718p348942m922425
$$ plain form
18911 44396943 51689713 55933036 56232565 53200671 48330323 44070696 41985594 43234408
18903 43234408 47885817 54296628 60115703 62078522 59183420 51947573 42087982 32172814
18895 32172814 23392125 16732936 12429844 9818845 8211684 7168558 6422193 5834052
18887 5834052 5356827 4994703 4703713 4476316 4331102 4284964 4344749 4513334 4764292 5063748
18877 5063748 5337282 5525440 5693801 6001905 6588500 7595388 9240027 11862003 15910949
18868 15910949 21888026 29552089 37759976 45720940 53512329 59875961 62995261 62200386
18860 62200386 58914028 55172800 53120951 53373178 55836888 60184308 65555620 69424576
18852 69424576 69163811 64402827 55923145 45749998 35655846 26368128 19019186 14096761
18844A4096761l144091k081347j435731r97439p11202n77003n39722n17539m55961
18835C636726l63508k92182k35010j83960j44105j04577p3448o4778q0835r9257
18825A995066j06212p8177j9844O2219R8077j3183j53589k87146k88385k03305
18815A005521j26700q4629o4485m7908l3777k8819k1934k7677j7832j9667j4289
18804E17804J830J6078L2259P5314J31305J55274J70982J62424J04351l2338j29598
18793A205685j35471j08000j8798M0053L0001J3405r004p1857j03338p8473o9082
18782F95121o8965m9337l6560k6497l0228m3056n3089m0493m2192m4831l0467
18771B29406r789r837n307J8799L9783K4757j4996j8067j7885j4513n356l742
$$ plain form
18844 14096761 10952670 8871323 7435592 6438153 5726951 5149948 4610226 4092687 3636726
18835 3636726 3273218 2981036 2746026 2562066 2417961 2313384 2239936 2175158 2094323 1995066
18825 1995066 1888854 1810677 1790833 1853052 1951129 1937946 1784357 1497211 1208826 1005521
18815 1005521 878821 794192 729707 681799 648022 619203 597269 569592 551760 532093 517804
18804 517804 519634 535712 567971 643285 774590 929864 1100846 1263270 1367621 1335283 1205685
18793 1205685 1070214 962214 943416 983469 1013470 1026875 1017871 946014 842676 764203 695121
18782 695121 626156 576819 540259 513762 483534 440478 387389 346896 304704 259873 229406
18771 229406 219617 209780 204473 223272 263055 287812 272816 254749 236864 222351 216995 213253
18759B13253N27R053l009l511P647k446J0840K3990J8598J9741L6179P4321R1854
18746D97037O8447J3481k0934m1074l6691k1292r098j945R69k814q672j7151j4776
18733D05487k9595l5734l2769l6781l4461l5480l1989k6072k0526j8900j9509
18722H3671j2638j1503n608J2570K555j97J1501N390J581J4063J6787J3194M877
18709A36243J1089O0k187M188O910J5931K2363L4603L6633L4715K4643M8839N2675
18696D26705M2255L1997K5818K5740J5446Q579J371on964l6063m0996l3780l8478
18683D22624n3077n4541m1386k9140j5247k6373k1273j3796j5852j5619r610K662
18671A29372J273O603O57O3J3199K0033N088J1713J1840R298R6k264m266j4656
$$ plain form
18759 213253 213780 222833 219824 216313 223960 221514 232354 256344 274942 294683 330862 405183 497037
18746 497037 565484 578965 558031 516957 480266 458974 449876 447931 448900 446086 437414 420263 405487
18733 405487 375892 340158 307389 270608 236147 200667 168678 142606 122080 103180 83671
18722 83671 71033 59530 53922 66492 69047 68850 80351 85741 87322 101385 118172 131366 136243
18709 136243 147332 147392 145205 149393 156303 172234 194597 229200 265833 300548 325191 374030 426705
18696 426705 468960 500957 526775 552515 567961 576540 577911 577905 571941 535878 494882 461102 422624
18683 422624 369547 315006 273620 244480 229233 202860 181587 167791 151939 136320 126710 129372
18671 129372 130645 137248 137905 137968 151167 171200 176288 188001 199841 209139 209235 206971 202705 188049
18657A88049n636m274j4526J571m014o351r591m377M857l51l115K071k11K964
18643A47066k86O146p73o276m519k551j448j4828q297L24M917J5279K0228J5841
18629A70823O023K825l035J1065O821r498m889m400r874j6677j2285j2791j0245
18616A13863n147L853n066J890J778R07K50j775Q547P644Q106R627k474p351j1080
18601A23572l760R834J1466J0388J529J2363J0157j557K219q860n804k064j190
18588A58293j421J667K884J116R268m223j4618P829J4710N571O364K994N256M584
18574B00274P468J6011k780m375M67m468j7361l858p050q47O990O395J2444J9177
18560B28487M0644M3202L0018K1185L3360J5841j3782j0674m040j2750j5916r667
$$ plain form
18657 188049 182413 178139 163613 165184 161170 154819 145228 140851 145708 145357 142242 144313 144102 147066
18643 147066 146780 152926 152153 145877 141358 138807 137359 122531 114234 114558 119475 134754 154982 170823
18629 170823 176846 179671 176636 187701 194522 185024 180135 175735 165861 149184 136899 124108 113863
18616 113863 108716 112569 107503 109393 111171 112078 112328 110553 119100 126744 134850 144477 142003 134652 123572
18601 123572 119812 129646 141112 151500 153029 165392 175549 173992 176211 167351 161547 159483 158293
18588 158293 156872 158539 161423 162539 171807 167584 152966 160795 175505 181076 187440 190434 195690 200274
18574 200274 207742 223753 220973 216598 217065 212597 195236 191378 184328 183481 190471 196866 209310 228487
18560 228487 269131 312333 342351 363536 396896 412737 398955 388281 384241 371491 355575 345908
18548C45908j8582j9920l2656k7640k1961j9641k2916m406P74k802J750l699Q437
18535A82646O977q9O548N570l418M531J5258J7451K8752N0421P1156P3922N9161
18522E18886N5596M4787Q930K576J5938K0764q486k1782k0962l7596n4781o2375
18510D61495n1673m3985l8143k5831n516q26m897j784m92k856j2375j5165K693
18497B60645J6398J8384J6204J8724J0230J3694J5623J1034J5604J5191K2185
18486D33916L3684L5042L0659J4822n492q355n308p457p921m373l899q838j9481
18473D76999q563P80Q463J5402J6150J5568m314L946Q300J0154J6330K7206L7039
18460F23460O7374Q0834J02384J46359J66448J94031K03545J28285L8530R937
$$ plain form
18548 345908 327326 307406 274750 247110 225149 205508 182592 178186 178960 176158 177908 174209 182646
18535 182646 189623 189534 196082 201652 198234 202765 218023 235474 264226 314647 385803 459725 518886
18522 518886 574482 619269 628199 630775 646713 667477 658991 637209 616247 578651 523870 461495
18510 461495 409822 365837 327694 301863 296347 295521 290624 288840 288348 285492 273117 257952 260645
18497 260645 277043 295427 311631 330355 340585 354279 369902 380936 396540 411731 433916
18486 433916 467600 502642 533301 548123 542631 534276 528968 521511 513590 509217 505318 496480 476999
18473 476999 468436 469216 477679 493081 509231 524799 520485 524431 532731 542885 559215 586421 623460
18460 623460 690834 771668 874052 1020411 1186859 1380890 1584435 1712720 1751250 1761187
18450A761187q831o7794n3221k0058j3376j0504M5968J24646J96779K46897K42953
18439B444646K50590K36113J83751J80979K61357M06012N95974Q77842J239787
18430F677051J751541K678837M293199O915101J1334463J7717163K1348682J3141009
18422H5857046J960020o3324o583833j9892074k1158009j3654349p643787m598939
18414A4222751l059140k029851j341465r23570n74663k18242J02743L36482L75047
18405F890092K93072K52740J70419J5066O4085L72512P70581J219326J846370
18396A1894263K802110M321296O931602J1106294J7866352K8483805L9987065
18389A23392787L6370598J3863507Q07267l557379k6885292m4297594l5810268
$$ plain form
18450 1761187 1752356 1684562 1631341 1611283 1597907 1587403 1633371 1758017 1954796 2201693 2444646
18439 2444646 2695236 2931349 3115100 3296079 3557436 3963448 4559422 5437264 6677051
18430 6677051 8428592 11107429 15400628 22315729 33650192 51367355 72716037 85857046
18422 85857046 87817066 87753742 81169909 61277835 40119826 26465477 18821690 14222751
18414 14222751 11163611 9133760 7792295 6868725 6294062 6075820 6178563 6515045 6890092
18405 6890092 7183164 7435904 7606323 7621389 7685474 8057986 8828567 10047893 11894263
18396 11894263 14696373 19017669 25949271 37055565 54921917 83405722 123392787
18389 123392787 159763385 173626892 174434159 170876780 143991488 99693894 63883626
18382F3883626k1391691j2357437p652827n006456l344902k328794j692953j199255
18374H909311q24205n45350l18887k37066k45882j72905j23355k00620k33836
18365F007205j72545j56342j90719j51129L2103K88265N31369P12997R58617J366518
18355I226339K027014L294276N593553Q823718J1441093J0214100M566180m867607
18347E0318666j0485224j1113507q277816n240527l240223j972183j103132m21853
18339H464201j12177j02194j82705j66231L3799J63882L75303P69058J289471
18330A0532407J968749K904146M223336O295217R745298J5867530K6375449M2513110
18322A20425242N8243358M3276846l27281l8822708o0230212m4648667k5040572
$$ plain form
18382 63883626 42491935 30134498 22481671 17475215 14130313 11801519 10108566 8909311
18374 8909311 8085106 7539756 7220869 6983803 6737921 6565016 6441661 6241041 6007205
18365 6007205 5834660 5678318 5487599 5336470 5368573 5656838 6188207 6901204 7859821 9226339
18355 9226339 11253353 14547629 20141182 28964900 40405993 50620093 55186273 50318666
18347 50318666 39833442 28719935 20442119 15201592 11961369 9989186 8886054 8464201
18339 8464201 8352024 8249830 8067125 7900894 7934693 8098575 8473878 9242936 10532407
18330 10532407 12501156 15405302 19628638 25923855 35669153 51536683 77912132 120425242
18322 120425242 178668600 221945446 221618165 182795457 122565245 77916578 52876006
18315E2876006j3746462p836210m362904j896969J53007K300472N027583R045862
18307D1560385J5105718K3071832K8435366K5104237J1467133r698418k4549636
18300A10496617l0095490k4727687j6082498r425780n271709k819801j180542
18293B0893110J90783J839390M325748Q489252J5416338K5027689K9382250J2264337
18285A17828897r255241k8229303k8710271j7138547r092950n146799l400097
18278A6855689k499344j909458j420049r76176p56859o84958n20405k92631q2700
18269G713109J09146M02520P41726R18587J067220J452544K360840L941810O303348
18260B5010850J0189627J6477559K4560035K8869913J9595400m676814k6205497
$$ plain form
18315 52876006 39129544 31293334 26930430 25033461 25186468 27486940 32514523 41560385
18307 41560385 56666103 79737935 108173301 133277538 144744671 135046253 110496617
18300 110496617 80401127 55673440 39590942 30165162 24893453 22073652 20893110
18293 20893110 21083893 22923283 27249031 35738283 51154621 76182310 105564560 117828897
18285 117828897 108573656 80344353 51634082 34495535 25402585 20255786 16855689
18278 16855689 14356345 12446887 11026838 10050662 9293803 8608845 8088440 7795809 7713109
18269 7713109 7822255 8224775 8966501 9885088 10952308 12404852 14765692 18707502 25010850
18260 25010850 35200477 51678036 76238071 105107984 124703384 120026570 93821073
18253I3821073k9287160k0804577j2275149p029268l943384j936576m53251R21790
18245A9013498K580936M671791O628864O675528N554804P181599R468063Q291590
18237G0066673L021319N60075M202270M053594K11814m99817K72373K527382M209695
18228H8625378K299009l357598n589046k325078n102142j0974483j1499735q475125
18220D3601180p370693q304208p163684m880387l126261k054904j445849j069697
18212H185497q05839o09153m89385m15557l12578j86169j00562m6318N5708K03053
18202E478697L46889N06876Q10166J398392K183621K789206K544163K270566L260536
18193B1589112M014209L025964M75404J1312J444647L65934j484097j673366q80885
$$ plain form
18253 93821073 64533913 43729336 31454187 24424919 20481535 18544959 18091708 19013498
18245 19013498 21594434 26266225 32895089 39570617 45125421 52307020 61775083 70066673
18237 70066673 73087992 73648067 77850337 81903931 82115745 81615928 81888301 84415683 88625378
18228 88625378 90924387 87566789 81977743 79652665 74550523 63576040 52076305 43601180
18220 43601180 36230487 27926279 20762595 15882208 12755947 10701043 9255194 8185497
18212 8185497 7379658 6770505 6281120 5865563 5552985 5366816 5266254 5219936 5275644 5478697
18202 5478697 5825586 6332462 7142628 8541020 10724641 13513847 16058010 18328576 21589112
18193 21589112 25603321 28629285 29104689 29116001 30560648 30926582 29442485 27769119 26888234
18184B6888234J07763J44624n46181j755155j505679n16844j755221l245265l081035
18175A4735241k189476k182769k463914j959165j271306q01570n50683m09978
18167B906380l07472k36666j80972j53780j31176j06137r0338r4869q1266p6934
18157A446770n4068m4124p8168r7034p4863o8262o5032n2359l3704k3751k2589
18146H32816m7527l0586q376j1073k2324l1024k7091k6348k5045j2313o147Q067
18134E93029j680j8264k3388k0275k7269l5418k6238R23Q621P320o297M185K3129
18121D78378K9737K8370M2148Q4218J12606J45727K03508K90550M51769P77298
18111B644309J365681K327489L959600N827527L277050n254688n938766l264867
$$ plain form
18184 26888234 26995997 27140621 26594440 24839285 23333606 22816762 21061541 17816276 14735241
18175 14735241 12545765 10362996 7899082 5939917 4668611 3867041 3316358 2906380
18167 2906380 2598908 2362242 2181270 2027490 1896314 1790177 1699839 1604970 1523704 1446770
18157 1446770 1392702 1348578 1270410 1173376 1098513 1030251 965219 912860 879156 855405 832816
18146 832816 785289 754703 746327 735254 712930 681906 654815 628467 603422 591109 584962 593029
18134 593029 591349 573085 549697 529422 502153 466735 440497 441420 450041 457361 451064 455249 478378
18121 478378 508115 536485 578633 662851 775457 921184 1124692 1415242 1867011 2644309
18111 2644309 4009990 6337479 10297079 16124606 19401656 14146968 8208202 4943335
18103D943335j686994r51700n81690l61044k45603j95554j50019j02146r3443
18094E75142q3492n5806l2961k5333j2565j7536j3647m093O669M571k047j262
18082C37640q965r222K012R569N523P643K977k134L021j0240m934O044Q094K0062
18068C67090J6052l154k0856l3678k1056j6814j6542j7967k2576j2488k525k43
18056B15243r588j3286j74o489q014j2816j0553q046j98j1894m840J3518J8834
18043A61697O850K649q117J055O321N347J4609Q619P728M736L749m447n979o626
18029A98191N962R671K278M521P782J4749Q434j5549k0346j8148j8462j5818o517
18016A56748n451O70N802J7959K0430K0527K0309P092o756j5107k5283k3931j5810
$$ plain form
18103 4943335 3256341 2304641 1722951 1361907 1116304 920750 770731 668585 575142
18094 575142 491650 435844 402883 377550 364985 347449 333802 329709 336378 340949 338902 337640
18082 337640 328675 319453 321465 331034 336557 344200 347177 345043 348064 337824 332890 338934 347028 367090
18068 367090 383142 379988 359132 325454 304398 287584 271042 253075 230499 218011 215486 215243
18056 215243 205655 192369 192195 185706 177692 164876 154323 146277 146079 134185 129345 142863 161697
18043 161697 168547 171196 163079 164134 170455 175802 190411 199030 206758 211494 215243 210796 204817 198191
18029 198191 204153 213824 216102 220623 228405 243154 251588 236039 215693 197545 179083 163265 156748
18016 156748 151297 151967 157769 175728 196158 216685 236994 244086 237330 222223 196940 173009 157199
18003A57199p526l46n108o153j030J485L31P099Q243m520o755M011J0683J2741
17989A70354O047l317q412j4877j2720p496j670k518N679J6190N862O666J485
17976A61273r009q184j848J2099R771K663J4699J6768m334j0003j0828j1754j2221
17963A49092j4430j9315j5520p089k519N164N331n690j2255k805J897l4J209r38
17949H2098J5821J0254M07N690n48k503k531o351k379o422q589j540L076N697
17935I2180J0666R737j434j4251j8551j3905r248m152r96Q72J2843J2300l820
17922G2241j319J0223l051m280n288n059L949N069k996j2029q637J0786J4792
17909G4401J1348O139J368N558k711j2650l856J473L728L949q015n327k928o109
$$ plain form
18003 157199 149673 149327 144219 138066 137036 138521 138852 145951 154194 149674 142919 146930 157613 170354
17989 170354 176401 173084 164672 149795 137075 129579 127909 125391 131070 147260 153122 159788 161273
17976 161273 152264 144080 142232 154331 164102 166765 181464 198232 193898 183895 173067 161313 149092
17963 149092 134662 115347 99827 92738 90219 95383 100714 95024 82769 79964 81861 81827 83036 82098
17949 82098 97919 108173 108580 114270 113722 111219 108688 102337 99958 93536 84947 83407 86483 92180
17935 92180 102846 112583 111149 96898 78347 64442 55194 51042 50046 50918 63761 76061 72241
17922 72241 70922 81145 78094 73814 68526 63467 67416 72485 69489 57460 48823 59609 74401
17909 74401 85749 91888 93256 98814 96103 83453 79597 81070 84798 88747 80732 75405 72477 66368
17895F6368o055P66n392j654P22K186j695k01J274N210L812M05q724p776N288
17880E4534J0025L284N340K463j890L265n141j1462o845M91J261K166J1117Q20
17866F9428n620j3945q610o888j0156j1609M153J5949J4453J8674J6261M905r717
17853G7278q774R79M934R219M032r891n386j815N88J2646K4335L4639N1940O3357
17839B58081Q2719J00639J08022J06876O8221O1945Q3521N6454q063l1689o0405
17828H26321j47313j93795j60435r6323m9030l1613j6170p025j2062j0339j0491
17817I1725M833P26k74j488o31J1616J1312O860l15k258m110P757P063J6704K3279
17802A72799L1861N3662R4695J34349J36795Q9467M3631M1208K3976l0666j5443
$$ plain form
17895 66368 60313 61079 55687 54033 54755 56941 55246 55045 56319 61529 65341 65746 57022 49246 54534
17880 54534 64559 67843 73183 75646 73756 77021 71880 60418 53573 54064 55325 57491 68608 69428
17866 69428 63808 49863 41253 34365 24209 12600 16753 32702 47155 65829 82090 86995 77278
17853 77278 68504 69483 74417 83636 87668 77777 72391 70576 71164 83810 108145 142784 194724 258081
17839 258081 340800 441439 549461 656337 724558 786503 870024 926478 918415 886726 826321
17828 826321 679008 485213 324778 228455 179425 147812 131642 124617 112555 102216 91725
17817 91725 96558 97284 97010 95522 94891 106507 117819 124679 124364 122106 117996 125753 132816 149520 172799
17802 172799 204660 258322 353017 487366 624161 713628 757259 798467 822443 791777 776334
17791G76334N1120J11141J66754K20496J89652K8856j68288l25564l06510k21480
17781E22511j42291q9316n2959m2164k5033k3862k0834k7120j0411l518j3560
17770G1443q170n042M832M22L776R156K484Q639O163O213l35K1012M1413M0045
17756B02051P5370J13565J68849K06784J13501l3662j51617j96957j33566o0368
17746C03950k0514J4666N2937P0260P9307Q6631P5208K3418l0593m2096l3442
17735E79732j9264l1090k3359j1880n755r098M385J2319J7840P2J1989L9269M7424
17722F12584J1767m8317m2127m293o413m8857q1197o1961l7445m9333m7156l4669
17710A62583l0785k0258j3442p00j0389j0176q022n818K877P991J3311J9081K7030
$$ plain form
17791 776334 827454 938595 1105349 1325845 1515497 1544353 1376065 1050501 743991 522511
17781 522511 380220 290904 237945 195781 170748 146886 126052 98932 88521 85003 71443
17770 71443 63273 58231 63063 63485 67261 76417 78901 87540 93703 99916 99581 120593 162006 202051
17756 202051 277421 390986 559835 766619 880120 846458 694841 497884 364318 303950
17746 303950 283436 298102 351039 421299 500606 587237 662445 685863 655270 613174 579732
17735 579732 560468 529378 506019 494139 488384 479286 483671 495990 513830 513902 525891 565160 612584
17722 612584 624351 576034 533907 529614 523201 474344 393147 331186 293741 244408 197252 162583
17710 162583 131798 111540 98098 97398 87009 76833 68811 62993 65870 73861 87172 106253 133283
17697A33283K6431K7066K9593L4526L7823K9034J2915J2792J7190K654j0459l019
17685C49829j0216k1936j9939k2888l4848m8036l6657j0278j0211j9377k7939
17674H7504k0103j3258j3571j0709o562R25O264J1252J157p366r311j051j2266
17661A2905k432R48l03n586j699M229M162L729p693n228J929P504o327J894l090
17646D942l896N287J1757M892K779n510j0032k459K988L949J441j2080J233R896
17632A5187j680j283Q43j90k886q752K281L638J546j540N094R179P059L10q283
17617B0523q506p683m898N520L141k404N18m067m70N523O382p595K323L198n149
17602F356o755m52L219j348N98J251l27N208P992j459j3882l07m18k459J573l468
$$ plain form
17697 133283 159714 186780 216373 250899 288722 317756 330671 343463 360653 363307 352848 349829
17685 349829 339613 317677 297738 274850 240002 191966 155309 145031 134820 115443 87504
17674 87504 67401 54143 40572 29863 23301 24226 30490 41742 42899 35533 26222 25171 12905
17661 12905 10473 11421 11118 5532 3833 8062 12224 15953 8260 3032 4961 12465 6138 8032 4942
17646 4942 1046 6333 18090 22982 25761 20251 10219 7760 10748 14697 16138 4058 5291 15187
17632 15187 13507 12224 13067 12877 9991 1239 3520 7158 8704 7164 12258 21437 28496 28806 20523
17617 20523 12017 4334 -564 4956 8097 5693 6211 2144 1674 7197 13579 5984 8307 11505 6356
17602 6356 -399 -851 2368 1020 1618 2869 2542 7750 15742 14283 401 94 -324 -2783 -1210 -4678
17586d678M4J6194M990q077k209K56N532J62k134n037k93N151J267k034m377k44
17570D513q452n776R890N824j160l133j0800N57L249Q627L809K066r624l868K848
17555a430O109k09m417J370K162O56o138l335L005K238k99l829K642Q559L001
17540A0085L450R78M269L366n688j762p010j3035J615n56L508P255L715j0155
17526C5k989L482k214K233q52j529O527k72r193L837J1379Q482n234l867l416
17511F409L430L212R610k801n721j44K84r938q736K706O819M941n394j995j398
17496A284P261M457j355J682o624m919j47m9M496M583m317J101N625n162J448
17481I364O721l298P411R153K245r918n607M398J31q070k0m036j104L218j2385
$$ plain form
17586 -4678 -4634 11560 16550 8473 6264 6520 12052 12214 10080 5043 4750 9901 11168 9134 4757 4513
17570 4513 -3939 -9715 175 5999 4839 1706 -9094 -8537 -5288 3339 7148 9214 -410 -4278 -1430
17555 -1430 4679 4470 53 1423 3585 4241 -1897 -5232 -2227 11 -288 -4117 -1475 7084 10085
17540 10085 13535 14513 18782 22148 16460 14698 7688 -5347 -3732 -4288 -780 6475 10190 35
17526 35 -2954 528 -1686 547 -305 -1834 4693 4421 -4772 -935 10444 18926 13692 9825 6409
17511 6409 9839 13051 22661 19860 14139 13995 14279 4341 -4395 -1689 5130 10071 4677 2682 1284
17496 1284 8545 13002 11647 13329 6705 1786 1639 1590 6086 10669 6352 7453 13078 7916 9364
17481 9364 16085 12787 20198 29351 31596 21678 16071 20469 20600 12530 12510 8474 7370 10588 -1797
17466a797o147Q651O72l208q066N225K599L167K652L460P063L287o209N721k159
17451A4911q549n686k725M17k663J033L066J0686K0822K9797K4569K3748k6421
17438H3005l5873j2841j1030n396q88q124p400L221j369N728R769N540o325K705
17424B0722L312P83n356r882M609N7K690j2222j565N242j083M484j313p908q33
17409A737K341N916p186k717J62M432P898Q63M077m134l719l594M804n743J31
17394E268K914j890M338Q020K633k360j3071j0170j606k635m784N625N944K911
17380A137j389l541O869Q757O170p342q800J858k004L829M35o234p03M89K945
17365B476N247J68m949K865L803M4k694K553o224j0430k795k550p95K595k978
$$ plain form
17466 -1797 -7944 707 1379 -1829 -9895 -4670 -2071 1096 3748 7208 14271 17558 11349 17070 14911
17451 14911 6362 676 -2049 -1632 -4295 -3262 -196 10490 31312 61109 85678 109426 83005
17438 83005 47132 34291 23261 17865 16977 8853 1453 4674 3305 9033 18802 24342 18017 20722
17424 20722 24034 24817 19461 9579 14188 14245 16935 4713 3148 8390 7307 11791 10478 2570 1737
17409 1737 4078 9994 2808 91 253 4685 12583 13446 17523 13389 9670 6076 10880 5137 5268
17394 5268 8182 6292 10630 18650 21283 18923 5852 -4318 -5924 -8559 -13343 -7718 -1774 1137
17380 1137 -252 -3793 3076 11833 18003 10661 1861 3719 1715 5544 5979 -255 -958 -469 2476
17365 2476 7723 7891 2942 5807 9610 9654 6960 9513 3289 -7141 -9936 -12486 -13281 -10686 -13664
17350a3664K311J0618O700l502o180q126N13O83K532J112K397m847N197K81L813
17335a62j143J0099O500n29o702j0345K135j846k616J977j388m118m337l53J1581
17320a247O254L670m534m173K007k908J735N383L322J007j855k181m35J259L924
17305A1228l624m49n361j4504l430R243J4658P947l067N55j396o41J0055M641
17291B5855J004o175j0952n415K526M482Q99L466K863q087j210l022J832l329
17277D737j0634N216M967J150M437r214j2098n322N982k202l678l099K589l6j229
17262a8434O663K776j786j619K002P69M847l254n917M681R195M196o005p0k34
17247b190j82L014p455J299L395L109J281j956r172l605J951J71J1255K241j9255
$$ plain form
17350 -13664 -11353 -735 5965 2463 -3717 -11843 -11330 -10647 -8115 -7003 -4606 -9453 -4256 -3975 -162
17335 -162 -1305 8794 15294 14765 8063 -2282 -147 -1993 -4609 -2632 -4020 -8138 -12475 -12828 -1247
17320 -1247 5007 8677 4143 -30 1977 -931 804 6187 9509 10516 8661 6480 6045 7304 11228
17305 11228 7604 7155 1794 -12710 -16140 -6897 7761 15708 12641 13196 11800 11159 21214 25855
17291 25855 26859 20684 9732 4317 6843 11325 12224 15690 18553 10466 9256 6234 8066 4737
17277 4737 -5897 -681 4286 5436 9873 659 -11439 -16761 -10779 -12981 -16659 -19758 -17169 -17205 -18434
17262 -18434 -11771 -8995 -10781 -12400 -10398 -9629 -4782 -8036 -13953 -9272 -77 4119 -1886 -1956 -2190
17247 -2190 -2372 642 -6813 -5514 -2119 990 2271 315 -8857 -12462 -10511 -10340 915 3156 -16099
17232a6099m07p92N438K550K896L845O979j0715r496l737l064N907R211N239q01
17217c046m653j195J299J980J0528P279l710r428q581l458J946K458M504j369
17203e446n0m170j466j699M618k670K816J567m027P668J0263l254r44M990j083
17188G113j281J250n553k622n223l203L969Q559K8k641j1073J66L368J0531M757
17173H145m825l073r88j1065o286M069P017l437P355Q491k825L264J666p941m436
17158d869O417L511R9l744j628l331L244K187j839m668l436j11J330J0998O297
17143A0457O92r134m408N787Q704M532o83l601j097p868l909K10K293o217p174
17128a1416k285O527P110j816k425m114l398k510j40J653J2286P866o943j2477
$$ plain form
17232 -16099 -16506 -17298 -11860 -9310 -6414 -2569 4410 -6305 -15801 -19538 -22602 -16695 -7484 -2245 -3046
17217 -3046 -7699 -8894 -7595 -5615 4913 12192 8482 -946 -9527 -12985 -11039 -8581 -4077 -5446
17203 -5446 -5496 -9666 -11132 -12831 -8213 -10883 -8067 -6500 -10527 -2859 7404 4150 3206 8196 7113
17188 7113 5832 7082 1529 -1093 -6316 -9519 -5550 3009 3037 396 -10677 -10511 -7143 3388 8145
17173 8145 3320 247 -741 -11806 -18092 -14023 -7006 -10443 -3088 5403 2578 5842 7508 -433 -4869
17158 -4869 1548 5059 5158 1414 -214 -3545 -301 1886 47 -4621 -8057 -8168 -6838 4160 10457
17143 10457 11149 2015 -2393 3394 12098 16630 15947 12346 11249 3381 -528 -318 1975 -4242 -11416
17128 -11416 -13701 -7174 -64 -1880 -4305 -8419 -11817 -14327 -14467 -12814 -528 7338 395 -12082
17114a2082j759n01k459mK392N151J313O168J304M087J193K902M31l838j947q056
17098e705K183P234n426k514J0697K601l914m946j330j929K076O696L077N47J123
17083A0470p283p629n102k848k045R333N966n10l058K722M998P109k699M405J250
17068A5079j309j762m620p896j364j387P187j003J509L52o856o799j513L474j8
17053f926P47L929Q697j774l312L967J728j634n927p18K289O767m699q682m14
17038e962R12J434L088l882m900o961K652J1280N145n388l845l395l963m55m17
17023a4657O618L854R98l444l329L691n813L46J585l614j596k059J614K610K197
17008a0999K518o035O171M700o746l404K95L881J939M659m80M301K621n137o245
$$ plain form
17114 -12082 -13841 -14342 -16801 -16805 -14413 -9262 -7949 -1781 -477 3610 4803 7705 8136 4298 2351 -5705
17098 -5705 -3522 3712 -1714 -4228 6469 9070 5156 210 -1120 -3049 -973 5723 8800 9347 10470
17083 10470 3187 -4442 -9544 -12392 -14437 -5104 862 352 -2706 16 5014 12123 9424 13829 15079
17068 15079 13770 12008 7388 -508 -1872 -3259 3928 2925 4434 4786 -2070 -8869 -10382 -6908 -6926
17053 -6926 -6179 -2250 6447 4673 1361 5328 7056 5422 -505 -1223 1066 7833 3134 -5548 -5962
17038 -5962 -5050 -3616 -528 -4410 -9310 -16271 -13619 -2339 2806 -2582 -6427 -9822 -13785 -14240 -14657
17023 -14657 -8039 -4185 -3187 -6631 -9960 -6269 -12082 -11736 -10151 -13765 -15361 -17420 -15806 -13196 -10999
17008 -10999 -8481 -14516 -8345 -3645 -10391 -13795 -13500 -9619 -7680 -3021 -3501 800 3421 -1716 -7961
16993g961m220k703J2917J0395j977M98l417p577q768M082P684L23p160o737K00
16978a4421k334O981N157L21k468o888j730L782M528m233n930Q805Q358M371j384
16963B915o1j156m157M38M815j986j387J1417j767j3364m445J590l327m403k881
16948a7759R326Q911j354o240k525p14M060P86K904k645l241j613m717P9L494
16933a1248Q95R471n82J076L011j771m009l511M690L084j490L11L880n99r44J464
16917C728Q82j490m226R360k394r609r55k922k822K897k248p38P673M004L505
16902D645P018L190L90L339k682r105n054N341J144n036q448m026Q890N954m33
16887E127l418k815p267R92J527j190J015j292P780R042m407m512p10Q852P970
$$ plain form
16993 -7961 -12181 -14884 -1967 8428 6451 6949 3532 -4045 -12813 -8731 -1047 -724 -7884 -14621 -14421
16978 -14421 -16755 -9774 -4617 -4296 -6764 -13652 -15382 -11600 -7072 -11305 -17235 -8430 -72 4299 2915
16963 2915 2854 1698 -2459 -2021 2794 808 -579 10838 9071 -4293 -8738 -7148 -10475 -14878 -17759
16948 -17759 -8433 478 -876 -7116 -9641 -10355 -6295 -5509 -2605 -5250 -8491 -10104 -14821 -14742 -11248
16933 -11248 -10353 -882 -1464 -388 2623 852 -3157 -6668 -1978 1106 -384 -73 3807 3208 2264 3728
16917 3728 4610 3120 -1106 8254 5860 -3749 -4704 -7626 -10448 -7551 -9799 -10537 -2864 1140 4645
16902 4645 11663 14853 15243 18582 15900 6795 1741 7082 8226 3190 -5258 -9284 -394 5560 5127
16887 5127 1709 -1106 -8373 -7381 -5854 -7044 -6029 -7321 459 9501 5094 582 -128 8724 16694
16872A6694L970J019j0489q067L730J268q321j2090q76J0008M824M117L681n946
16858C522m489j085J267K961j519J2105N000n983j493n815k319l479K313p82k612
16843b408l170n079J5195K270k508M707o171j5352q398J051j768K600L354J943
16829a3734n144M692Q366M131o04n158m386J025R62m190j894p53n108k401k100
16814b6296L249Q062J0155Q891K475j299m331k812q950O667L564p054J0576k806
16800I1n506n79R44q803j135K293N153O177Q050M29o077q9N174l792k925r072
16784i667n324K870M368m019M81L745P514M565j731l53L820k738J913J067j620
16769D891J365j188q094l309P354M642n866k492q31j252L234L21r659n83L725
$$ plain form
16872 16694 20664 21683 11194 3127 6857 8125 -196 -12286 -13162 -3154 1670 5787 9468 3522
16858 3522 -967 -2052 -785 2176 657 12762 17762 11779 10286 4471 2152 -1327 986 204 -2408
16843 -2408 -5578 -10657 4538 6808 4300 9007 2836 -12516 -20914 -19863 -21631 -19031 -15677 -13734
16829 -13734 -18878 -14186 -5820 -1689 -2293 -7451 -11837 -10812 -9850 -14040 -15934 -16687 -21795 -24196 -26296
16814 -26296 -23047 -14985 -4830 4061 6536 5237 906 -1906 -10856 -4189 -625 -7679 2897 91
16800 91 -5415 -5994 -5050 -13853 -14988 -12695 -7542 -1365 6685 7114 1037 948 6122 2330 -595 -9667
16784 -9667 -14991 -12121 -7753 -11772 -11291 -7546 -32 4533 2802 2449 6269 3531 5444 6511 4891
16769 4891 6256 5068 -3026 -6335 1019 5661 -205 -2697 -3528 -4780 -1546 -1225 -10884 -11467 -7742
16754g742J315o78M25k603O917m621m392o81O006l830q84N357K227m567K04p35
16738h282L624N600J924q627j0762k569M287L648K932M240l638j382K731j741
16724h015m219M120J075j493J954O375P573q123p555j103j28m022M368L546J097
16709d550o070J738j482o853M604L896j060N16m81o602M283N261M786J642O305
16694E933j433r587K559J386j592j702M176K15o237L165J2589O695k007j2854
16680A306r809p090P48M351K290L620n616n395L11Q593L009o95n214j169l752
16665a4512P965k107p390J346J437R27o498m52Q206K079M080R126M378q449m283
16650d147J070L817k3M020J026l444l211r109p700K210O065p48K063J0836k098
$$ plain form
16754 -7742 -6427 -7105 -6680 -9283 -2366 -6987 -11379 -12060 -6054 -9884 -10768 -5411 -3184 -7751 -7547 -8282
16738 -8282 -4658 942 2866 -5761 -16523 -19092 -14805 -11157 -8225 -3985 -7623 -9005 -6274 -8015
16724 -8015 -12234 -8114 -7039 -8532 -6578 -203 7370 -753 -8308 -9411 -9539 -13561 -9193 -5647 -4550
16709 -4550 -10620 -8882 -10364 -17217 -12613 -8717 -9777 -9261 -9742 -16344 -12061 -6800 -2014 -372 5933
16694 5933 4500 -5087 -2528 -1142 -2734 -4436 -260 -45 -6282 -3117 9472 16167 14160 1306
16680 1306 -8503 -15593 -14845 -10494 -8204 -4584 -10200 -15595 -15284 -6691 -3682 -4377 -9591 -10760 -14512
16665 -14512 -6547 -8654 -16044 -14698 -13261 -12334 -18832 -19284 -11078 -8999 -4919 4207 8585 136 -4147
16650 -4147 -3077 740 717 4737 5763 2319 -892 -10001 -17701 -15491 -9426 -10174 -8111 2725 627
16635F27l615j766L285o806J977j354N370L582M756p569o997n698o626M775o6
16620a6125L122k40R941O375j069j908L404J70KN047n348J430L38q556m879J540
16604f756n086o529j664K759M408K808p118M137Q997O406k391K657M444j0634
16590c562m472k859M414N554K54J119k528l398l815P986J73k955k024l95r45k740
16574a0193R354R276k090p898q102k702M51P376N584j891K440L38n268k319k997
16559h641J662R298m535J453k755K114q121j4601R019Q127J687M058L574Q397
16545A0736j878r075K389j283M129J709j218J929n000K187m649R36M33o774L674
16530a755K524r769J156R08L544R26j554K16L897J004L001L209l44p335j394J137
$$ plain form
16635 627 -2988 -4754 -1469 -8275 -6298 -7652 -2282 1300 6056 -1513 -8510 -14208 -20834 -16059 -16125
16620 -16125 -13003 -13243 -3302 3073 2004 96 3500 3670 3672 8719 3371 4801 5139 -3417 -8296 -6756
16604 -6756 -11842 -18371 -20035 -17276 -12868 -10060 -17178 -13041 -4044 2362 -29 2628 7072 -3562
16590 -3562 -8034 -10893 -6479 -925 -671 448 -2080 -5478 -9293 -1307 -1134 -4089 -6113 -6508 -7453 -10193
16574 -10193 -839 8437 6347 -1551 -9653 -12355 -11904 -4528 1056 -835 1605 1943 -3325 -5644 -8641
16559 -8641 -6979 2319 -2216 -763 -3518 -1404 -9525 -24126 -15107 -6980 -5293 -1235 2339 10736
16545 10736 8858 -217 2172 889 5018 6727 5509 7438 2438 4625 -24 912 1345 -5429 -1755
16530 -1755 769 -9000 -7844 -6936 -3392 -2466 -4020 -3804 93 1097 4098 7307 6963 -372 -1766 -629
16514f29p844o132N350O664m747p398N507L326J326n846r35N166P613j0180L040
16499e719N78o180n135O181m297M357J972Q68p13L738R808m537m473k780m695
16484a1027L717J2929r67l888q788l582M030Q950N31J530n1k454l319K779k836
16469b446m226o363J359j60m219P476R068M221o093r51j467j531k53l764j669
16454a1018j341n99L355m299R78P92K859J951J610P203j345j0227m148M02n745
16439a9572J993N264O613q2l429m17K746L964n835o018L593L793Q730M184n74
16424D953N054M94J106l70l578q760J663M831n357k918j262k01l13j281k669L187
16408e421p81q05j726K381j228N166L770j266m160L979K374m017m752J041L9O200
$$ plain form
16514 -629 -8473 -14605 -9255 -2591 -7338 -14736 -9229 -5903 -4577 -10423 -11358 -6192 1421 -8759 -5719
16499 -5719 -5141 -11321 -16456 -10275 -14572 -10215 -8243 -7375 -8088 -4350 5458 921 -3552 -6332 -11027
16484 -11027 -7310 5619 4652 764 -8024 -11606 -7576 1374 1905 3435 3384 930 -2389 390 -2446
16469 -2446 -6672 -13035 -11676 -11836 -16055 -8579 489 4710 -1383 -2334 -3801 -5332 -5585 -9349 -11018
16454 -11018 -12359 -12958 -9603 -13902 -12924 -12132 -9273 -7322 -5712 1491 146 -10081 -14229 -13827 -19572
16439 -19572 -17579 -12315 -5702 -5784 -9213 -9630 -6884 -2920 -8755 -14773 -11180 -7387 1343 5527 4953
16424 4953 10007 10501 11607 11237 7659 -1101 562 5393 36 -2882 -4144 -4345 -4658 -5939 -8608 -5421
16408 -5421 -6202 -7007 -8733 -6352 -7580 -2414 1356 90 -4070 -91 2283 -1734 -6486 -5445 -5406 794
16392G94l685J37K085n096M400j316K965M610o825n035l810m011K074J10Q476
16377d127J732p235m562l03J0478J244m209l596P41N437M118l641j014M387j523
16362b073q470o702M028J4062n079O910J0070K681q523n359p26K412k138n621
16348d528p120L575R558l858j0327O574o87O449K831n194Q97j656k509j654j024
16333h673P873N049l328O475l785l004l002k946M058j513o833l083L1K636R68
16318i077M868m70J156N378l07j0803L011O764K216J301K038k111o585o844j0821
16303b0286n10J897J294L151l88P054L846L546j057n882j937J0538M541q167K0
16288b340N774J0639J482j1626j3608K123j240l637j240k966P100l989Q441M987
$$ plain form
16392 794 -2891 -2754 -669 -5765 -1365 -2681 284 4894 -1931 -6966 -10776 -14787 -12713 -12603 -4127
16377 -4127 -2395 -9630 -14192 -14495 -4017 -2773 -6982 -10578 -9837 -4400 -282 -3923 -4937 -550 -2073
16362 -2073 -10543 -17245 -13217 845 -4234 2676 12746 15427 6904 1545 819 3231 1093 -4528
16348 -4528 -11648 -8073 1485 -2373 -12700 -6126 -6813 -364 2467 -2727 -1830 -3486 -5995 -7649 -8673
16333 -8673 -800 4249 921 7396 3611 607 -2395 -5341 -1283 -2796 -9629 -12712 -12681 -10045 -9077
16318 -9077 -4209 -4679 -3523 1855 1548 -9255 -6244 520 2736 4037 6075 3964 -2621 -9465 -20286
16303 -20286 -20796 -18899 -17605 -14454 -14842 -7788 -3942 -396 -1453 -7335 -9272 1266 5807 -2360 -2340
16288 -2340 3434 14073 15555 3929 -9679 -7556 -8796 -12433 -13673 -16639 -9539 -13528 -5087 -100
16274a00l080M147l526m719n321k4Q495Q057j781J405%o904n898K624O916M947
16258E238p73n325r065l428K438O75j31J0603R19p354M899o65p648M688L483j097
16242b543l319k180N243M967L771M997k910K70j0841l929n410O799J0320Q08p952
16227a909j0423K711o82K362l751K899O838m340K97n13m608K825R165J0162L205
16212A4238p617q618O202K719m011o44L186N416o98k530L10L290n503m474j942
16197f76k848J964K586m780m899R375J2555k319l638o478k684k44n534J12N562
16182a946Q880k192j491O79q081j780k096J054M549m356l627j0895Q245J1656
16168a401N298k763o738j1789p230m076Q095J3347Q659M170J400K964j654j0205
$$ plain form
16274 -100 -3180 967 -2559 -7278 -12599 -12623 -4128 3929 2148 3553 3553 -3351 -9249 -6625 291 5238
16258 5238 4465 -860 -9925 -13353 -10915 -10240 -10371 232 1151 -6203 -1304 -1969 -9617 -4929 -1446 -2543
16242 -2543 -5862 -8042 -2799 2168 5939 10936 8026 8296 -2545 -6474 -11884 -5085 5235 6043 -1909
16227 -1909 -12332 -9621 -10303 -7941 -11692 -8793 -1955 -6295 -5998 -6511 -11119 -8294 871 11033 14238
16212 14238 6621 -1997 4205 6924 2913 2269 5455 10871 10173 7643 7953 11243 5740 1266 -676
16197 -676 -3524 -1560 1026 -3754 -8653 722 13277 10958 7320 842 -1842 -2086 -7620 -7508 -1946
16182 -1946 6934 4742 3251 3930 -4151 -5931 -8027 -6973 -2424 -6780 -10407 -21302 -13057 -1401
16168 -1401 3897 1134 -5604 -17393 -24623 -28699 -20604 -7257 1402 5572 6972 9936 8282 -1923
16154a923m578K70R703L64m628O836K83l224n086n313O366J204j2330k548K418
16139a2186J456P358J967j493L070P87j260R582l399o242o860l328M791M500J011
16124b46q02O32M856k031M328R483j1238j4972n52J821N390R92m19k320j337l195
16108i610p116q7M131R65l79P147j044Q379J1512k312j0760P838J324N832m927
16093A0893j7640M558Q973o44o021l846K48k78K255l914j264o453n685Q655P930
16078b233M220q739J027M658n94r25m064q849M185L291m20l435j277J9o62L605
16062a0193L531J529k569O789P679m32J663r634o95J781p496O92J486j035j257
16047h161l314q36j422m778o6K664P429R258o155L147o320p378K099M263K68M098
$$ plain form
16154 -1923 -6501 -6231 3472 3836 -792 6044 6327 3103 -1983 -7296 -930 274 -12056 -14604 -12186
16139 -12186 -10730 -3372 -1405 -2898 172 959 -301 9281 5882 -360 -7220 -10548 -5757 -1257 -246
16124 -246 -1048 -416 4440 2409 6737 16220 4982 -9990 -10542 -8721 -3331 -2339 -2758 -5078 -6415 -9610
16108 -9610 -16726 -16813 -12682 -11717 -12096 -4949 -5993 2386 13898 11586 826 8664 9988 15820 10893
16093 10893 -6747 -2189 6784 6140 119 -3727 -3479 -3757 -1502 -5416 -6680 -13133 -18818 -10163 -2233
16078 -2233 1987 -6752 -5725 -1067 -1661 -2586 -6650 -15499 -11314 -8023 -8443 -11878 -13155 -13136 -13798 -10193
16062 -10193 -6662 -5133 -7702 -913 6766 6334 7997 -1637 -2332 -551 -8047 -7355 -5869 -6904 -8161
16047 -8161 -11475 -12311 -13733 -18511 -18577 -15913 -8484 774 -5381 -2234 -8554 -15932 -13833 -9570 -9302 -5204
16031e204j372R379P123k774n168l388P822p573n714M289K185n597l554M05K684
16016f457l342N24k99k248l772Q80m33Q315K658o441m488J0265J635J860K70l833
16000d906j646n410J566K478o130K595Q900J343m468n595K21R885L801k959j369
15985a694j366L790K983M776j241l921N735j639o065l841j993n65K100M854n478
15970c565j0237M9M870J3846j129j2477j796N602K642m551L711K25k25j240O513
15955B238l12j1154j3378O938P706M057K009r38o43j071K110K207K116l687R386
15940G584O945m759p449n099K407K967K087R75k939m611n565l52K9j701M431J069
15924c981M713k418m818M658P189n468o12K319R64M48L47k759l463q417l867o469
$$ plain form
16031 -5204 -6576 2803 9926 7152 1984 -1404 6418 -1155 -6869 -2580 -395 -5992 -9546 -9141 -6457
16016 -6457 -9799 -9275 -9574 -11822 -15594 -14714 -15147 -6832 -4174 -10615 -15103 -4838 -3203 -1343 -1073 -4906
16000 -4906 -6552 -11962 -10396 -7918 -14048 -11453 -2553 -1210 -5678 -11273 -11052 -1167 2634 -325 -1694
15985 -1694 -3060 730 3713 8489 7248 3327 9062 7423 1358 -2483 -4476 -5041 -2941 1913 -3565
15970 -3565 -13802 -13753 -8883 4963 3834 -8643 -10439 -4837 -2195 -6746 -3035 -2810 -3035 -4275 2238
15955 2238 1926 -9228 -22606 -15668 -7962 -3905 -1896 -2834 -3477 -4548 -2438 -231 1885 -1802 7584
15940 7584 14529 9770 2321 -2778 -371 2596 4683 5658 2719 -1892 -7457 -7809 -7780 -9481 -5050 -3981
15924 -3981 732 -1686 -6504 -1846 5343 -125 -737 1582 2546 2994 3341 582 -2881 -11298 -15165 -21634
15908b1634K793P162N483o90o280m684N909J2699M977o13J065k096m370j081j849
15893c209Q86M445J984M126m414l580N08j128L946k654q089L876M203p25l010
15878b835N146o11p674l398N874k406l333l9M763l512j593P476N382o111l026
15863e897L920p69j14N526o942O540n334o24l14l86j669o887L513J592K668M590
15847e87o472r209k111Q509P983l533L050N289m666j257J909l419J798J823j52
15832a045l576k106N20L727N481o52q368p772M4l63K95L191M482j264M88M506
15816b412k331p23J057r535k992j020N120l047j0975O764J2125P656r93k156K008
15801a454m519m660l465M340J774l43n719k322J3458J0523n154k309J233J814
$$ plain form
15908 -21634 -18841 -11679 -6196 -6886 -13166 -17850 -11941 758 5735 5122 6187 4091 -279 -1360 -3209
15893 -3209 -2323 2122 4106 8232 3818 238 746 -382 3564 910 -7179 -3303 900 175 -2835
15878 -2835 2311 1700 -5974 -9372 -3498 -5904 -9237 -9276 -4513 -8025 -9618 -2142 3240 -2871 -5897
15863 -5897 -1977 -2746 -2860 2666 -4276 2264 -3070 -3694 -4008 -4394 -6063 -12950 -9437 -7845 -5177 -587
15847 -587 -7059 -16268 -18379 -9870 -1887 -5420 -2370 2919 -1747 -3004 -1095 -4514 -2716 -893 -1045
15832 -1045 -4621 -6727 -6207 -2480 3001 2349 -6019 -13791 -13747 -14110 -13815 -10624 -6142 -7406 -6918 -2412
15816 -2412 -4743 -5466 -4409 -13944 -16936 -17956 -12836 -15883 -26858 -20094 -7969 -313 -1306 -3462 -1454
15801 -1454 -5973 -10633 -14098 -9758 -7984 -8327 -14046 -16368 -2910 7613 2459 150 1383 3197
15787C197m709N009n15q703K330L823j686j145P495J293q138P514r05k480j93
15772B187l483L38P975K461P01o99j210K093L248m950n650l771R93M585M225O334
15756A5377N474j0017J777L027r10q630m832J923Q808M969j70l212q534j0325
15742e275j5818K649N415K550N315k894p37R261k097m760M598Q90J831l889o01
15727c562j069j930n415P604M752o689L293L972k809n731l499O010o91r141o854
15712b1759N263O492L245L131m268m219N245o21j012J192m418k34K343O438K261
15697i21K152q96k22Q825r38o428o184l247j474K59P825R359l634O274k654l228
15681D868O34j87o36p565j1610n593n01O247J2752N066M027J595k210k040R63
$$ plain form
15787 3197 -1512 3497 2982 -5721 -3391 432 -1254 -2399 5096 6389 -1749 5765 4860 2380 2187
15772 2187 -1296 -958 7017 9478 10179 9480 8270 10363 13611 8661 3011 -760 233 4818 9043 15377
15756 15377 20851 10834 12611 15638 14728 6098 1266 3189 11997 16966 16796 13584 5050 -5275
15742 -5275 -21093 -18444 -13029 -10479 -5164 -8058 -8795 466 -1631 -6391 -1793 -903 928 -2961 -3562
15727 -3562 -4631 -6561 -11976 -4372 380 -6309 -3016 956 -1853 -7584 -11083 -5073 -5764 -14905 -21759
15712 -21759 -16496 -10004 -6759 -3628 -7896 -12115 -6870 -7491 -8503 -7311 -11729 -11963 -9620 -3182 -921
15697 -921 1231 335 113 8938 8000 1572 -4612 -7859 -9333 -9074 -1249 8110 4476 10750 8096 4868
15681 4868 5502 5315 4679 -2886 -14496 -20089 -20590 -14343 -1591 3475 7502 9097 6887 4847 5810
15666E810k931n490o737j764r32R039M577p7K311K493m047r626m539J337P521
15651c055K54J78Q22Q09O930m153k63n257m450j761k482m053L635P789J735j265
15635d587P31p908O94R156o281K620K532M966K622j838p621o063K859N852j065
15620c331j4891k619J292K451M409R168o197j999j491N271J328k396K236Q304
15606A535j887p139o554R288n30l222K222l621K94J05M784k152N037J14m287K619
15590c394J356J048L888K314J403l159l705l151j917R06n569j062j1501J17Q812
15575a3614m877K121O506L369l502o115n032K371N687P61n604N244N314n686j450
15560a4507M277Q271n830o175m23P848l93N762j0300p152k604m427J823N028K646
$$ plain form
15666 5810 2879 -2611 -9348 -11112 -12044 -3005 1572 1495 3806 6299 2252 -7374 -11913 -10576 -3055
15651 -3055 -2801 -2623 -1801 -992 5938 1785 1522 -3735 -8185 -9946 -12428 -16481 -12846 -5057 -3322 -4587
15635 -4587 -3856 -11764 -11070 -1914 -8195 -5575 -3043 1923 4545 2707 -4914 -10977 -8118 -2266 -3331
15620 -3331 -18222 -20841 -19549 -17098 -12689 -3521 -9718 -11717 -13208 -7937 -6609 -9005 -6769 1535
15606 1535 -352 -7491 -14045 -4757 -5287 -8509 -6287 -9908 -9614 -9509 -4725 -6877 -1840 -1726 -6013 -3394
15590 -3394 -2038 -990 2898 5212 6615 3456 -249 -3400 -5317 -4411 -9980 -11042 -22543 -22426 -13614
15575 -13614 -18491 -16370 -9864 -6495 -9997 -16112 -21144 -18773 -13086 -12325 -17929 -12685 -7371 -13057 -14507
15560 -14507 -10230 -1959 -7789 -13964 -14387 -6539 -6932 -1170 -11470 -18622 -21226 -25653 -23830 -18802 -16156
15545a6156j233K253Q480M115N897K146Q8m84m476r077J934O203k076q89J223
15530b052J195j075q951q142k832L95J3361l345q206K395N897M154l11j331K425
15515f423p9L794k95q13L003P954j042J027M36o854j333l292j363K173m016o383
15499a3506O41K014k369n469O176J2447q33m030k015R618k846j4968K282M198
15485h660l587p69Q26K89j255J017J751L870k716l372L458J581P44o09K39m300
15469a1493k475J577O883K440m749j548J941J959l969j582K826M81J068O249n071
15454e463k275M508O068L051l228j293P067k338r866p59L384m242j0247n213N921
15439a4925J870P729L289j714J295J867P59q640j29K073Q518k791k772J449L329
$$ plain form
15545 -16156 -17389 -15136 -6656 -2541 3356 5502 5590 5106 630 -8447 -6513 -310 -2386 -3275 -2052
15530 -2052 -857 -1932 -10883 -19025 -21857 -21462 -8101 -11446 -19652 -17257 -11360 -7206 -7517 -8848 -6423
15515 -6423 -6502 -2708 -3003 -3816 -813 7141 6099 7126 7562 708 -625 -3917 -5280 -3107 -7123 -13506
15499 -13506 -12865 -10851 -13220 -18689 -12513 -66 -899 -4929 -6944 2674 -172 -15140 -12858 -8660
15485 -8660 -12247 -13016 -12190 -11901 -13156 -12139 -10388 -6518 -9234 -12606 -9148 -7567 -6823 -7432 -7193 -11493
15469 -11493 -13968 -12391 -5508 -3068 -7817 -9365 -7424 -5465 -9434 -11016 -8190 -7709 -6641 -392 -5463
15454 -5463 -7738 -3230 2838 5889 2661 1368 8435 6097 -3769 -4528 -1144 -5386 -15633 -20846 -14925
15439 -14925 -13055 -5326 -2037 -3751 -2456 -589 170 -8470 -8599 -6526 1992 -799 -3571 -2122 1207
15424A207J739j375k136q294m020L251M300K263N512P768L53m127R88j2946m064
15409i581K263M285n069j810k053n505N806J467l044K786n166O894L258m316K078
15394g707N653P551J328k754l434o639K835L147N938o678j5054j853J0493P964
15380G90l694J644m168j642k285M304O560N266l230m700K019P233M223j810m832
15365E678o177L647L095k375l858K55j617m054K384l969m429M778P35o931k64
15350a3102K277l120o85j393M818K923m659n485M700K888K601l339m938m36M703
15335a2247j846m395Q251N628K963j428J854p01L738r28n738K878K733k201P878
15320F439J904j548n281l674l069Q280M84j131L220n322j0489m29N064k073M99
$$ plain form
15424 1207 2946 1571 -565 -8859 -12879 -9628 -5328 -3065 2447 10215 10568 6441 7429 -5517 -9581
15409 -9581 -7318 -3033 -8102 -9912 -11965 -17470 -11664 -10197 -13241 -10455 -15621 -8727 -5469 -9785 -7707
15394 -7707 -2054 5497 6825 4071 637 -6002 -3167 -20 5918 -760 -15814 -17667 -7174 790
15380 790 -2904 -1260 -5428 -7070 -9355 -5051 1509 6775 3545 -1155 864 8097 12320 10510 5678
15365 5678 -499 3148 6243 3868 10 265 -1352 -5406 -3022 -6991 -11420 -6642 -5907 -12838 -13102
15350 -13102 -10825 -13945 -14630 -16023 -11205 -8282 -12941 -18426 -13726 -10838 -8237 -11576 -16514 -16950 -12247
15335 -12247 -14093 -18488 -10237 -4609 -1646 -3074 -1220 -1921 1817 889 -4849 -1971 762 -1439 6439
15320 6439 8343 6795 1514 -2160 -5229 3051 3535 2404 5624 302 -10187 -10616 -5552 -7625 -7126
15305g126O854K558r223k119K924P012P374K179o258j1736o072K272N342L230
15291b789L917K194j973o816L06K187n446L942O703l453l055p511p36O559N67
15276e404J042r41q793j921L66P774M551q40M321j766j0238n897J1312O86K729
15261c019n689k464J790R19k892p80k163J0041L034n35m44L19m513J440K738M141
15245A923O304m943q949r1R241J983n169j196J385O28o61q625k041k221k245n693
15229b0370N962N190q958J393J2629Nj280N86j191L68o325j0082R37j591R435
15214a3292M712J715R812k005r29r581n928M381L060n767J3162L555m188m296
15200e589q586M426J0008P427j1704j4194Q121N168l864M949J0732J207j1327
$$ plain form
15305 -7126 -272 2286 -6937 -9056 -6132 880 8254 10433 4175 -7561 -13633 -11361 -6019 -2789
15291 -2789 1128 3322 1349 -5467 -5161 -2974 -8420 -4478 2225 -1228 -4283 -11794 -12530 -5971 -5404
15276 -5404 -4362 -5303 -14096 -16017 -15651 -7877 -3326 -4166 155 -1611 -11849 -17746 -6434 -5748 -3019
15261 -3019 -8708 -11172 -9382 -8463 -11355 -12135 -14298 -4257 -1223 -1758 -2202 -1883 -6396 -4956 -2218 1923
15245 1923 8227 3284 -5665 -5756 3485 5468 299 -897 488 1116 455 -8170 -10211 -12432 -14677 -20370
15229 -20370 -14408 -9218 -18176 -16783 -4154 -4149 -5429 -4843 -6034 -5666 -11991 -22073 -21136 -22727 -13292
15214 -13292 -8580 -6865 2947 942 13 -9568 -15496 -11115 -8055 -13822 -660 2895 -1293 -5589
15200 -5589 -14175 -9749 259 7686 -4018 -18212 -10091 -4923 -8787 -3838 6894 8101 -3226
15187c226n626L244l205L252K600q5J569j596l741L945p729r947N569P599N265
15172b112m438K634O751j691p071j150N687O910O59q952K56P046O403l105k784
15157E043k883m391P35n946j056Q56K025p836n979O263J909k164L452L364l691
15142a0299k294J43k697p151Q370K36M070J0160N471k415n097j0780j1999M134
15128b0148l2Q780J1390j470N164Q08j0190M387R082n865M731j23K431l161q248
15113b464q63l129J589Q023M587k02n847j663k805l22P376k971P63l693n933K100
15097e454N940M32J360Q139Q44Q33l985q439K418Q929k158p888o95R510R19j4169
15081c464j759n779m748M766J2412q504j2557N241N49O51k838j310R774N616j112
$$ plain form
15187 -3226 -8852 -5608 -8813 -5561 -2961 -3046 -1477 -3073 -6814 -2869 -10598 -20545 -14976 -7377 -2112
15172 -2112 -6550 -3916 2835 1144 -5927 -7077 -1390 5520 6179 -2773 -2517 4529 10932 7827 5043
15157 5043 2160 -2231 -1496 -7442 -8498 -7642 -5617 -13453 -19432 -13169 -11260 -13424 -9972 -6608 -10299
15142 -10299 -12593 -12450 -15147 -22298 -13928 -13692 -9622 538 6009 3594 -1503 -12283 -24282 -20148
15128 -20148 -20180 -11400 -10 -1480 3684 4492 -5698 -1311 7771 1906 6637 6514 8945 5784 -2464
15113 -2464 -3327 -6456 -4867 3156 7743 7541 1694 31 -2774 -3096 4280 1309 2072 -1621 -7554 -5454
15097 -5454 486 918 2278 10417 11261 12094 8109 -330 2088 11017 8859 971 276 9786 10705 -3464
15081 -3464 -5223 -11002 -15750 -10984 1428 -7076 -19633 -14392 -13843 -13192 -16030 -17340 -7566 -1950 -3062
15066c062n424p5N087R51j46p36j309l52k507l031P163O372K889o167j383K904
15050A174o704J61m215L617M314L02m319J652n382p981o412k304Q253R485J4236
15035E877J0228m779r275O859K341q355l309N982r13j222l644k792n092o816K490
15020a2420O669K059L413j986L716O220k394m604L660O915J530p518l942k318
15006a000O197p11j362j267r8Q545o750o933j405o84L813k630L13M308O859k732
14990D463q668n151M310J660P914K118j1604r11M373l878J819j913k835R345L365
14975D407m915l978M396N57J715j832o833k926p60m124M502O29N693O322n338
14960b485k120N575j312j0886l408m9J2092M203j4757O914J1056o87k704M454
$$ plain form
15066 -3062 -8486 -8561 -3474 -2523 -2669 -3405 -4714 -5066 -7573 -10604 -3441 2931 5820 -347 -1730 1174
15050 1174 -5530 -5369 -9584 -5967 -1653 -1351 -5670 -4018 -9400 -17381 -23793 -26097 -17844 -8359 5877
15035 5877 16105 11326 2051 8910 11251 2896 -413 5569 4656 3434 -210 -3002 -8094 -14910 -12420
15020 -12420 -5751 -3692 -279 -2265 1451 7671 5277 673 4333 11248 12778 5260 1318 -1000
15006 -1000 5197 4486 3124 1857 1759 10304 3554 -3379 -4784 -5468 -1655 -4285 -3972 336 7195 4463
14990 4463 -4205 -9356 -5046 -3386 4528 6646 -4958 -5869 -1496 -5374 -3555 -5468 -8303 1042 4407
14975 4407 -508 -4486 -90 467 2182 350 -6483 -9409 -10169 -14293 -9791 -9162 -3469 2853 -2485
14960 -2485 -4605 970 -342 -11228 -14636 -14685 -2593 1610 -13147 -6233 4823 4136 1432 5886
14946E886J252j577l89p16M849N352j425o604J960J738j29k455O96M58j810r749
14930b663j1770N90J0789O174n48m609p533l33M972n36M778N622j256K6k540J841
14914C004j90K377J979j293M179K885K143M019K252K808k006o515P810J2473J507
14899C7432O08J949m09L578N77n574N519J509m904k161n053q639p262o495N745
14884A6420q08M441p301r674J99L381m57j998r74N304N294o885p341M333L549
14869G483M983k872o352m24J328p229J130J1538M670q630k95j305l93k460k356
14854a184M353J772p399m020J400J336j574M623J5001m49k661k222p245m075k773
14839e117l192P086m36m618m280j817N4K611l735K568R435o040n47K292j0335
$$ plain form
14946 5886 7138 5561 5172 4456 9305 14657 13232 6628 8588 10326 10197 7742 8438 8896 7086 -2663
14930 -2663 -14433 -13843 -3054 3120 2572 -2037 -9570 -9903 -4931 -5467 -689 4933 3677 3703 1163 3004
14914 3004 2814 5191 7170 5877 10056 12941 15084 19103 21355 24163 22157 15642 23452 35925 37432
14899 37432 38040 39989 39580 43158 43735 38161 43680 45189 40285 38124 33071 24432 17170 10675 16420
14884 16420 15612 20053 12752 3078 3277 6658 6201 4203 3229 8533 13827 6942 -399 3934 7483
14869 7483 12466 9594 3242 2818 4146 -3083 -1953 9585 14255 5625 5330 4025 3632 1172 -1184
14854 -1184 3169 4941 -2458 -6478 -5078 -3742 -5316 -693 14308 13859 11198 8976 1731 -2344 -5117
14839 -5117 -8309 -1223 -1659 -6277 -10557 -12374 -12320 -9709 -13444 -10876 -1441 -7481 -8028 -5736 -16071
14824a6071O542R327N609m718L437j677j71L547k123K293n031l85l876J899J336
14809f2o261P221N005p95l778n862p870N769J159O912R825N130l578o171l873
14794B771L151J876M587o83m245q288n66j409o355J342M631K642K557L387o16
14779D782q652N204N511P24l44l398m152j298k003O186M751J873m406n271N187
14764D694N401P381q214o280l54l994j244K434P817O918M143l858n540k839l025
14749C440L096R420M978o434j3045p604l179O365P481R14k380j767p102M658Q813
14734G654Q144N345k925p492o102p37r9M521N380J676M054K705l299j0833o249
14719A743p379R75N615K41o151q59P997j675n693O581M661L121n111j3475N26
$$ plain form
14824 -16071 -9529 -202 5407 689 4126 2449 2278 5825 3702 5995 964 579 -3297 -1398 -62
14809 -62 -6323 898 5903 5108 1330 -4532 -12402 -6633 -5474 1438 11263 16393 12815 6644 2771
14794 2771 5922 7798 12385 11702 7457 -831 -1397 -2806 -9161 -7819 -3188 -546 2011 5398 4782
14779 4782 -3870 1334 6845 7569 7225 3827 -325 -1623 -3626 2560 7311 9184 4778 -493 4694
14764 4694 10095 17476 9262 2982 2628 -1366 -2610 -176 7641 14559 18702 14844 9304 6465 3440
14749 3440 6536 15956 20934 14500 1455 -6149 -9328 -2963 4518 5432 3052 1285 -5817 -1159 7654
14734 7654 15798 21143 18218 10726 4624 3887 3788 8309 13689 15365 19419 22124 18825 7992 1743
14719 1743 -5636 -4661 954 1195 -4956 -5815 2182 507 -5186 1395 6056 9177 4066 -9409 -8883
14704h883j729J576N612L447P298j02m548l318m967m897K915L205P965L768n19
14689F823k050o952r082M984J0336P082m5L94l150q297m644M13K084K298k326
14674b132J892Q67R039K091k422r728o790P615O891O040j0516k440J5644n218
14660A0833o642L566J800j223K358K693O55K859Q9o980p867n112p055Q264J0719
14645H957L539k662J209K124M398J734J240l532n778K775l973J30l115M38o126
14630A358r043N605O356k109L210K94j439k802j345L331L105l065M403j440n655
14615G64j905j0419l049K071M596J725r74k907L420O698m50L76J879k283q51L350
14599B041K813p186J470k555l313L486j0521q648M158J2585R252J776N652j500
$$ plain form
14704 -8883 -10612 -9036 -3424 23 7321 7219 2671 -647 -5614 -10511 -7596 -4391 3574 7342 6823
14689 6823 4773 -2179 -11261 -6277 4059 11141 11096 11490 8340 43 -4601 -4188 -2104 194 -2132
14674 -2132 -240 627 9666 11757 9335 -393 -7183 432 7323 13363 2847 407 16051 10833
14660 10833 4191 7757 9557 8334 10692 13385 14040 16899 16988 10008 2141 -2971 -10026 -1762 8957
14645 8957 12496 9834 11043 13167 17565 19299 20539 17007 11229 14004 10031 10161 7046 7484 1358
14630 1358 -7685 -2080 4276 2167 5377 5671 4232 1430 85 3416 6521 3456 7859 6419 764
14615 764 -1141 -11560 -14609 -12538 -7942 -6217 -7191 -10098 -6678 20 -430 -54 1825 -458 -1309 2041
14599 2041 4854 -2332 -862 -3417 -6730 -3244 -13765 -22413 -18255 -5670 3582 5358 11010 9510
14585I510K018m8O32J903m516k837l080O252j091l328Q40j857o907J930k808m449
14569g836P326J749p679K3J1025L154K372K573l255k721n244J24k448K242J5692
14554A7097Q040l149m019l982m154j2210J360M059j2193k588N010J0883N452k651
14540F955L799p938j0408O033R325Q56j0585l448K056J380m042j061J345R78p01
14525e456J096M679j228j145%j816K870m187j97P989N719j79Q95m241r127n658
14509i986N409k41K483m222J080k116q082K022J0164P965l124K123J952M137m83
14494I081n295J753j488j955m209l258J470J0472J1302N218m732n546m531m427
14480C855L202J156R68M071n563p698o847K809J2182k726o226k501l518j073Q351
$$ plain form
14585 9510 11528 11480 12112 14015 9499 6662 3582 9834 8743 5415 6255 4398 -2509 -579 -3387 -7836
14569 -7836 -510 1239 -6440 -6417 4608 7762 10134 12707 9452 6731 1487 1611 -837 1405 17097
14554 17097 25137 21988 17969 13987 9833 -2377 -1017 3042 -9151 -11739 -6729 4154 9606 6955
14540 6955 10754 2816 -7592 -1559 7766 8622 -1963 -5411 -3355 -1975 -6017 -7078 -5733 -4755 -5456
14525 -5456 -4360 319 -909 -2054 -2054 -3870 -1000 -5187 -5384 2605 8324 8145 9040 4799 -4328 -9986
14509 -9986 -4577 -4818 -2335 -6557 -5477 -7593 -15675 -13653 -3489 4476 1352 3475 5427 9564 9081
14494 9081 3786 5539 4051 2096 -2113 -5371 -3901 6571 17873 23091 18359 12813 8282 3855
14480 3855 7057 8213 9181 13252 7689 -9 -6856 -4047 8135 5409 -817 -3318 -6836 -7909 442
14465D42Q593k611j278m262k538j26j0773o493O972L840J120Q146O568j995q259
14450b654j1034J555L241P42L256P269N461M204N50Q729L021m60r40M00N078j4768
14434A3650j0634J1673N787o150r391k871M2q50O01l847o956k591N705M732l116
14419d216n184l163n507l635J0473O774j0224l664J3054L335j576k185O085N314
14405E681P55m029k423o764l388J318j613k390j818J322p62L923l129m377l405
14390b1099l737M176L243O717J721k60q42L491L664J1807O220N86q647l899R979
14375A3120m748m154j865k992L753j032J475m768r877M325M700N652K338k1m633
14360A273j3744j322K523P251m658K769P670j166M546Q9k486k659p366l604L553
$$ plain form
14465 442 9035 6424 5146 884 -1654 -1780 -12553 -19046 -12074 -8234 -7114 1032 7600 5605 -2654
14450 -2654 -13688 -12133 -8892 -8150 -4894 2375 7836 12040 12590 21319 24340 23880 22940 23340 28418 13650
14434 13650 3016 14689 20476 14326 4935 2064 2106 1256 1857 -1990 -8946 -11537 -5832 -1100 -4216
14419 -4216 -9400 -12563 -18070 -21705 -11232 -4458 -14682 -18346 -5292 -1957 -3533 -5718 367 5681
14405 5681 6436 2407 -16 -6780 -10168 -8850 -10463 -12853 -14671 -13349 -14111 -10188 -13317 -17694 -21099
14390 -21099 -24836 -20660 -17417 -10700 -8979 -9239 -10081 -6590 -2926 8881 15101 15687 7040 3141 13120
14375 13120 8372 4218 2353 -639 3114 2082 3557 -1211 -11088 -6763 -2063 3589 5927 5906 1273
14360 1273 -12471 -13793 -11270 -4019 -8677 -5908 1762 596 5142 5231 2745 86 -7280 -10884 -7331
14345g331J349j388Q892K905l705j674N910l94r510p275M491Q442P943J601l191
14330G065j487l968l701J759O771Q336o039p503l074K267L811K971r88m85M023
14315I758J72q432j2005j003P510J655k372j437M241J356J067k660K317j879l864
14300e576K514P790K382j341l079K214p677j668K708Q030K433L038j0082P54O777
14285I217J744k838o399k593j0309n203K166J647J703p71n971j754J523J5323
14271b515M044M646Q535N593P31m709p846N579o082M57j663k780K79k987k051
14256g69J1677J2806n735O14J081K195j16l290L433p039q055j503M025p812j308
14241B04Q810P888m835j621m85P323K297k936p972m581J6k597L057M561K15j1541
$$ plain form
14345 -7331 -5982 -7370 1522 4427 722 -952 4958 4564 -4946 -12221 -7730 712 8655 10256 7065
14330 7065 5578 1610 -2091 -332 6439 14775 8736 1233 -1841 426 4237 7208 6220 5735 9758
14315 9758 9930 1498 -10507 -11510 -4000 -2345 -4717 -6154 -1913 -557 510 -2150 167 -1712 -5576
14300 -5576 -3062 4728 7110 5769 2690 4904 -2773 -4441 -1733 6297 8730 11768 1686 2440 9217
14285 9217 10961 8123 1724 -869 -11178 -16381 -14215 -12568 -10865 -11636 -17607 -19361 -17838 -2515
14271 -2515 1529 6175 14710 20303 21034 16325 8479 14058 7976 8433 6770 3990 4269 1282 -769
14256 -769 10908 23714 17979 18593 19674 21869 21753 18463 21896 14857 6802 5299 9324 1512 204
14241 204 9014 16902 12067 10446 9961 17284 19581 16645 8673 4092 4108 1511 4568 9129 9344 -2197
14225b197l206l687k184K542k003N597j596n61J5686M886K714j0470j0234m318
14211i031j087j903J925O018K981n121r60N498P89O758J915j153l560O892K653
14196A2614k420o28p296O012M262L14n135j3795J015O433o4k838j525R026J513
14181G488L56j243L282r106j517Q413M779o43K813k072l851N558K038p966k357
14166E972M88R46j564p820j243l183l259N744L532j590L99M650J342o790p627
14151a0003M962l765m808O674J7427P226k453o011j476k267l100k893l821K872
14137a436j578k179L349N721J743M103N600K873p338l847k722K69N830J952o345
14122E995K168o207j358M371M544j997o380k532J480P160J491n139o017L955K219
$$ plain form
14225 -2197 -5403 -9090 -11274 -8732 -10735 -5138 -6734 -7295 8391 13277 15991 5521 -4713 -9031
14211 -9031 -10118 -12021 -10096 -4078 -1097 -6218 -7178 -1680 -891 5867 7782 6629 3069 9961 12614
14196 12614 10194 9566 2270 8282 12544 12858 7723 -6072 -5057 1376 1312 -1526 -3051 5975 7488
14181 7488 7844 6601 9883 777 -740 7673 12452 11809 14622 12550 8699 14257 16295 8329 5972
14166 5972 6460 7406 5842 -1978 -3221 -6404 -9663 -3919 -387 -1977 -1578 3072 4414 -2376 -10003
14151 -10003 -5041 -8806 -13614 -6940 10487 17713 15260 9249 7773 5506 2406 -487 -4308 -1436
14137 -1436 -3014 -5193 -1844 3877 5620 9723 15323 18196 10858 7011 4289 4558 10388 12340 5995
14122 5995 8163 1956 598 4969 9513 7516 1136 -1396 84 7244 8735 3596 -2421 1534 3753
14107C753n409j594M688R908M572K343l580N337O109k388R32O195J606N645J1198
14092D9315J153N985K2841J6213J9471K2634K9734L0926L3125K9223L9965M0701
14080C41286L5561N3340O3953O5919O0781M2168M7274N7779N9345L8261L7050
14069I02717M5351L8473J9125q382J612J6265J265j9730k1387j8239m7034q0814
14057H29222q2439n6493m4894o1525o9256n9626m5796l9943n6169n7889l6916
14046B18276k1917k3732k8212j8198m372j4637j2036j6099j3503j0299q967n368
14034D0936m064J69k217K128k244K121j972l04n332k893q577Q66N406r868r413
14019D742j090Q058O719L470n925M899R478m314q419j0982j75K853j982K356J482
$$ plain form
14107 3753 -1656 -3250 1438 11346 15918 18261 14681 20018 26127 23739 24671 30866 32472 38117 49315
14092 49315 50468 56453 79294 95507 114978 137612 167346 198272 231397 260620 300585 341286
14080 341286 376847 430187 494140 560059 620840 663008 710282 768061 827406 865667 902717
14069 902717 948068 986541 1005666 997284 998896 1015161 1016426 996696 975309 957070 910036 829222
14057 829222 746783 690290 645396 583871 514615 454989 409193 369250 313081 255192 218276
14046 218276 196359 172627 144415 126217 121845 107208 95172 79073 65570 55271 46304 40936
14034 40936 36872 37041 34824 36952 34708 36829 34857 34553 29221 26328 17751 18617 24023 14155 4742
14019 4742 3652 11710 18429 21899 15974 20873 30351 26037 17618 6636 6461 9314 7332 9688 11170
14004A1170P714l3o060r049L020k834K739n709L661M867P57K500k16k639J684
13989A1572n169J246N170L9n81J058J1033J773l486l432j942j104j812m313m115
13974E937m244Q10m52M463K701O985j68m738k650l486K722k63q405l302j838j778
13958g706J513P537O662K150j3116K120N112O436k026l362m383M002N13O105M400
13943A5957l079q448n57K201q841j938O879N303K039J614O62O901l051q526Q53
13928G969m870K40k169M222k065k205O599L0L649m720P072P905j739l735k437
13913A3746l885J081n977r41N826m284k036M899O965L249K618p57k338o219N090
13898A7037j353K078N800j865j965p53l714o594k964L994N92M607N676j0839j0547
$$ plain form
14004 11170 18884 18851 12791 3742 6762 3928 6667 958 4619 9486 10243 12743 12527 9888 11572
13989 11572 6403 7649 12819 12858 12277 13335 24368 26141 22655 19223 17281 16177 14365 10052 5937
13974 5937 1693 2503 2051 6514 9215 16200 16032 11294 8644 5158 7880 7617 -788 -4090 -5928 -7706
13958 -7706 -6193 1344 8006 10156 -2960 -840 4272 10708 8682 5320 937 4939 5452 11557 15957
13943 15957 12878 4430 3873 6074 -2767 -4705 2174 7477 9516 11130 11792 18693 15642 7116 7969
13928 7969 3099 3339 1170 5392 3327 1122 7721 7751 11400 6680 13752 21657 19918 16183 13746
13913 13746 9861 10942 4965 4024 9850 5566 3530 8429 15394 18643 21261 20504 18166 11947 17037
13898 17037 15684 17762 23562 21697 19732 18979 15265 8671 5707 9701 10293 14900 20576 9737 -810
13883h10l280q286p919J0469R596K241r976J199M76L853R85M192O691P687m56
13868A6662m286K527n502l338l526O717J2419j851k713M817q116j0154J2222L378
13854A9256j188K392K295k351o020r282k158m693m394L63O37Q050k895K636q41
13839A807J190r093J0880K838j364q046l798L608K713j449K844J52p54K170n83
13824C115j448l121M013K844J875L596L389K566j0158j420r71j125M402Q632P828
13809B4017j79p982k781j388O653m70m598k51r11o778r342O016J0136p29r210
13794B203m498N575N714n782m572q982j347J2485J1888M531Q681q51j017m531
13780A9497o635p048m739m956N318J3495J667J95n81j357j753l663k919J154M463
$$ plain form
13883 -810 -4090 -12376 -20295 -9826 -230 2011 -7965 -6766 -6290 -2437 -1452 2740 9431 17118 16662
13868 16662 12376 14903 9401 6063 2537 9254 21673 19822 17109 21926 13810 3656 15878 19256
13854 19256 18068 20460 22755 20404 14384 5102 2944 -1749 -6143 -5780 -5143 2907 12 2648 1807
13839 1807 2997 -6096 4784 7622 6258 -1788 -5586 -1978 735 -714 2130 2282 1528 3698 3115
13824 3115 1667 -1454 2559 5403 7278 10874 14263 16829 6671 5251 4280 3155 7557 16189 24017
13809 24017 23838 15856 13075 11687 18340 17870 13272 13021 12110 5332 -4010 2006 12142 11413 2203
13794 2203 -2295 3280 8994 3212 -1360 -10342 -11689 796 12684 17215 25896 25045 24028 19497
13780 19497 12862 5814 1075 -3881 1437 14932 16599 16794 16213 14856 13103 9440 6521 7675 12138
13765A2138M963k224K141j52k449o522o39K004l193N088j1215m435N961Q628j128
13750H966k380K386M191R034k284q729K040N723j602k537N062P822n74p550l549
13735A6019j0841k61J3933O868N10n592o58j243M66K752J317J239k443k2L082
13720B5126n253p152M135O489N636l398p528Q080J1011k36O541j2613j0262l219
13706A7357k262p78N853K466M156j869p668o428j0563J650R329L426r833j691
13692C145O330M009R036p10p37M28P75m638j032O387n037o61J2188N422r032l361
13676B2512o159q067L138O685M247l993n938j974J929Q480M902P667N08j196l972
13661B8769N865l592p68J656Q630J2291J4120K6206K4659J0773J5717O509J52
$$ plain form
13765 12138 17101 14877 17018 16866 14417 7895 7256 9260 6067 11155 -60 -4495 1466 10094 8966
13750 8966 6586 8972 13163 22197 19913 11184 13224 18947 17345 14808 19870 27692 27118 19568 16019
13735 16019 5178 4917 18850 25718 26228 20636 19978 18735 19201 21953 23270 24509 22066 22044 25126
13720 25126 19873 12721 16856 23345 28981 25583 18055 26135 37146 36910 43451 30838 20576 17357
13706 17357 15095 14317 20170 22636 26792 24923 17255 10827 264 1914 11243 14669 4836 3145
13692 3145 9475 13484 22520 21810 21073 21501 22276 17638 16606 22993 17956 17295 29483 34905 25873 22512
13676 22512 16353 8286 11424 18109 22356 18363 12425 10451 12380 20860 25762 33429 33937 32741 28769
13661 28769 34634 31042 30274 31930 40560 52851 66971 93177 117836 128609 144326 150835 150987
13648A50987K808j2825k0388K639m21r655k632m325j4354j2370n164j0252p919
13635E6129L814Q118k13K113J4262J5449J1611K1165J4953J4538J3249J1003Q777
13622A94968K3290M3154O9761J15763J69193K62899L51226L71848K82266J86194
13612B070562J31875J3906j81803k62216k27519k26885k72116k85575k20315j41192
13602C98722q5427n4224l4863k5930j5382j7233j5280j6248q273n686r221j2554
13590I8401k961j9261k3381j3244J013j475o068l559J567M77p78k75o370m488
13576A9598m966j0398l642L432M269Q566K148J486o16K847J2o29m214Q748K0902
13561D7543Q409j0930m674m435q304m555R784j641m266j343l476j040n004m470
$$ plain form
13648 150987 153795 140970 120582 123221 122800 113145 110513 106188 91834 79464 74300 64048 56129
13635 56129 59943 68061 67848 69961 84223 99672 111283 132448 147401 161939 175188 186191 194968
13622 194968 218258 261412 331173 446936 616129 879028 1230254 1602102 1884368 2070562
13612 2070562 2202437 2216343 2034540 1772324 1544805 1317920 1045804 760229 539914 398722
13602 398722 313295 259071 224208 198278 182896 165663 150383 134135 125862 120176 110955 98401
13590 98401 95440 76179 52798 39554 40567 39092 33024 29465 31032 31509 30731 30456 24086 19598
13576 19598 14632 4234 592 4024 8293 16859 19007 20493 19877 22724 22736 22107 17893 26641 47543
13561 47543 55952 45022 40348 35913 27609 23054 32838 31197 26931 25588 22112 21072 16068 11598
13547A1598q22M520Q228J272m906j0420o558O811P377o013o201K965O173r47O552
13532A9629K568k896Q83P455M813n435J666r882l861M017K941Q383j808o630J3
13517B1856m224l803J495l19Q06N409J3014Q199K758j5195M57j977n187M153L032
13502C0474J3361M908o369K340M951J4214J7121K884o471K83L498k414j744j0779
13488F6257M25k70k923p289m945j4885r064l050o363J0348M713K08j204N27M20
13473C2905R903J3161K420J3479K1790J2830L549L782J4312R550K012j675R080
13460A47098R577L231L342l58M372Q302k939k689M792k070q32k97K655J1602K174
13445A87960j718O80p216n672l558j0709j2095r141j0821j6469q743m475q030
$$ plain form
13547 11598 10776 15296 23524 24796 19890 9470 2912 9723 17100 11087 4886 7851 14024 13077 19629
13532 19629 22197 19301 20184 27639 32452 27017 28683 18801 14940 18957 21898 30281 28473 21843 21856
13517 21856 17632 13829 15324 15005 15811 21220 34234 42433 45191 29996 30453 28476 23289 27442 30474
13502 30474 43835 48743 42374 44714 49665 63879 81000 83884 77413 77696 81194 78780 77036 66257
13488 66257 66682 66412 63489 56200 51255 36370 27306 24256 17893 28241 32954 33162 31958 32485 32905
13473 32905 42808 55969 58389 71868 93658 106488 110037 113819 128131 137681 139693 138018 147098
13460 147098 156675 159906 163248 162890 167262 175564 172625 169936 174728 172658 171826 171529 174184 185786 187960
13445 187960 186242 186922 179706 174034 170476 159767 147672 138531 127710 111241 102498 98023 89993
13432H9993p488L708k62p918M704l357Q180L254j0794q895r068l518o988n975
13418D5576l00r931j1272q455m601L743K66o58K321j359M800P376j624N335P783
13403C9000M377L4J568k956j392M124Q0L971P643N370k492k265j9599o034j0965
13388B0464J796J1405P137k802j921L319O490j088j360O961J3721P783J3632P138
13374I2675Q787J8591J2775K755j115j1004L43J837j2468r377j1465k959M536
13361I3911L071O57j777L349M772J4942J0116l271l312R091J2190L175j3457j4468
13347A18989J126j4851j4231q651p765r849r07N534M006Q949J3793J2825K925
13334A11893O561J8158K4965K7514L6216N8662R5255J23993J35171J45923J54809
$$ plain form
13432 89993 82505 86213 85951 78033 82737 79380 87560 90814 80020 71125 62057 58539 51551 45576
13418 45576 45276 35345 24073 15618 11017 14760 15026 14368 16689 15330 20130 27506 25882 31217 39000
13403 39000 43377 43411 44979 42023 40631 44755 44835 48806 56449 61819 59327 57062 37463 31429 20464
13388 20464 22260 33665 40802 38000 36079 39398 45888 44800 43440 50401 64122 71905 85537 92675
13374 92675 101462 120053 132828 135583 134468 123464 123807 125644 113176 103799 92334 89375 93911
13361 93911 96982 97639 95862 99211 103983 118925 129041 125770 122458 131549 143739 146914 133457 118989
13347 118989 120115 105264 91033 82382 74617 64768 63861 69395 73401 82350 96143 108968 111893
13334 111893 118454 136612 161577 189091 225307 283969 379224 503217 638388 784311 939120
13323I39120J48030R9242P2056Q1843N8935N791l0298m5597n0673r5563j27499
13312A055387j28370j12326j07125j13680j02162q8182o9670m4918l5057k0793
13302B33104q629o683k917n006O191J6426J2403J6124K7850L0819J9565J081n199
13289C35129K458O857Q221P223l246j159L708K801p35j943j688R76m103j0856
13275C43643j3995j4912M321J1808J7257J9419J1145J3248J1515K1479K2429K8869
13263D76226L2155K0779K1976K9083L1220L1385L7389K9755L3598L9775K9404
13252H12745K2419J1970R118R747L030P882J0094K9955L5812L8876N1772P0566
13240A113986O1795N7584N6932N8031O2257N6907N3721M7058N1018M8724N9168
$$ plain form
13323 939120 1087150 1186392 1258448 1340291 1399226 1405017 1374719 1329122 1278449 1182886 1055387
13312 1055387 927017 814691 707566 593886 491724 403542 333872 288954 253897 233104
13302 233104 224475 217792 214875 209869 216060 232486 244889 261013 288863 319682 339247 340328 335129
13289 335129 337587 344444 352665 359888 356642 355483 359191 361992 361257 359314 357626 358602 354499 343643
13275 343643 329648 314736 319057 330865 348122 367541 378686 391934 403449 424928 447357 476226
13263 476226 508381 529160 551136 580219 611439 642824 680213 709968 743566 783341 812745
13252 812745 835164 847134 856252 865999 869029 876911 887005 916960 952772 991648 1043420 1113986
13240 1113986 1175781 1233365 1290297 1348328 1410585 1467492 1521213 1568271 1619289 1668013 1727181
13229A727181P0093Q7777Q9783R0860R8573J03675J20810J34890J60204J84642
13219B868488K02671K33382K61706K83740L24528L80257M43718N20683O52679
13210F171852Q21524J044656J339003J701019K041890K321492K389986K354654
13202B0186076K554814K781256L072504M342242O761494J0423597J6209918K5491508
13194I1823409L9470800N6459176O5404753N4924327L7700592K7317429J8761065
13187C91861551m485914l2185801m0294146l8687075m1482538n0281930n1630648
13180A32813499l7963828k4078681j5304616j0197514p137375n263126m097405
13173B8770954l434076l023894k679043k431689k204453j987777j785223j500290
$$ plain form
13229 1727181 1797274 1885051 1974834 2065694 2164267 2267942 2388752 2523642 2683846 2868488
13219 2868488 3071159 3304541 3566247 3849987 4174515 4554772 4998490 5519173 6171852
13210 6171852 6993376 8038032 9377035 11078054 13119944 15441436 17831422 20186076
13202 20186076 22740890 25522146 28594650 32936892 39698386 50121983 66331901 91823409
13194 91823409 131294209 187753385 253158138 308082465 345783057 373100486 391861551
13187 391861551 387375637 355189836 314895690 276208615 234726077 184444147 132813499
13180 132813499 94849671 70770990 55466374 45268860 38131485 32868359 28770954
13173 28770954 25336878 22312984 19633941 17202252 14997799 13010022 11224799 9724509
13165I724509j187015r22962p37974o18547n27169m46223l78752l36722l09131
13156D260014k66410k42886k34289k24060k04633j89586j77157j65756j49306
13147B405931j32329j30928j23030j10515j23485j11648r5540r4091p8867n7345
13137A348153m0330k9183l3307l2582l2554l2444m9511m1398l8927m8606m0614
13126I28697j8874r362k2822k3961k2269k0696o013n356j2313j9049j5598N585
13114G57969J1635N883k667m012j6721k9686j2227L034l147o867j4038k1702k7366
13101F40088k2504j6981j9716k0117k7097l1463k1472j6568j5009j2899o869P853
13089D37246N099j765K394L768J1941M373J3730J3728J1116J4391K2902J4966
$$ plain form
13165 9724509 8537494 7614532 6876558 6258011 5730842 5284619 4905867 4569145 4260014
13156 4260014 3993604 3750718 3516429 3292369 3087736 2898150 2720993 2555237 2405931
13147 2405931 2273602 2142674 2019644 1909129 1785644 1673996 1578456 1484365 1405498 1348153
13137 1348153 1307823 1278640 1245333 1212751 1180197 1147753 1098242 1056844 1017917 969311 928697
13126 928697 909823 900461 877639 853678 831409 810713 804700 799344 787031 767982 752384 757969
13114 757969 769604 775487 772820 768808 752087 722401 710174 713208 710061 703194 689156 667454 640088
13101 640088 617584 600603 580887 560770 533673 502210 480738 464170 449161 436262 429393 437246
13089 437246 442345 440580 442974 446742 458683 463056 476786 490514 501630 516021 538923 553889
13077E53889P710k632r904j1413k3930l9365m1876k7425k4184l4085n3286m8848
13065B44651n5441o6033p2847o2874o9431q6168p4459m6753m3492n1276l1123
13054d15246J9289M4596L2820L2786N8802R3758P8767N9976O9303O8926N2122
13043A95899K8477J8355J9542J8844J4910M25p921R09r867j8139j7470j1953q612
13030B23399j6263j7400j3204j2072j2116j00j0310q592L760N738p786j1517r061
13017A14476J274M967Q398J405K230q727p873j3940j0305j745m618n461j0213
13004F9868O621N070J3074P876P572J335M155J3696P190O219N641K210K031P984
12990A60542N194j4645n378k218r4m597j2947r235P96o201L71N725J1302J3144
$$ plain form
13077 553889 561599 558967 549063 537650 513720 474355 432479 405054 380870 346785 293499 244651
13065 244651 189210 123177 50330 -12544 -81975 -168143 -242602 -289355 -332847 -384123 -415246
13054 -415246 -395957 -351361 -318541 -285755 -226953 -133195 -54428 5548 74851 143777 195899
13043 195899 224376 242731 262273 281117 296027 296452 288531 289440 279573 261434 243964 232011 223399
13030 223399 207136 189736 176532 164460 152344 152244 141934 133342 137102 142840 135054 123537 114476
13017 114476 115750 120717 129115 130520 132750 124023 116150 102210 91905 90160 85542 80081 69868
13004 69868 76489 81559 94633 102509 110081 111416 115571 129267 136457 142676 148317 150527 152558 160542
12990 160542 165736 151091 145713 143495 143401 138804 125857 116622 117418 111217 111588 117313 128615 141759
12976A41759J1599K689m178J340P863j221j3907j0083K986M610Qq82n07o71m551
12961A36854r249n623m562p719j0584j5151l997k077r694r161j3633k034oJ285
12947D4649m50R556P834M956l755M062P442J1649N755J0398q89K688Q50q205r789
12932H6751j240K860M595j755n746l894m154o368k86P070J418O506O636R400N568
12917A07361N205R788J1319J7425O83m778j3819j5038j5570n679q723n640j992
12904H0542m130J185N354k881J026Q615L362j0904j8180p942L549n287o225k420
12890D5664j0864n486n093j761o231j1011o398l270N402J2617P364J1433K576
12877C4942P11L864j604J2094L768J232k667L053j311K271Q346J498k451k446
$$ plain form
12976 141759 153358 156047 151869 153209 161072 159851 145944 135861 138847 143457 143465 142583 142076 141405 136854
12961 136854 127605 121982 117420 109701 99117 83966 79969 77892 68198 59037 45404 43370 43364 44649
12947 44649 44199 53755 61589 66545 62790 66852 74294 85943 91698 102096 101207 103895 104745 96540 86751
12932 86751 85511 88371 92966 91211 85465 81571 77417 71049 70763 77833 79251 85757 92393 101793 107361
12917 107361 112566 122354 133673 151098 151781 147003 133184 118146 102576 96897 88174 82534 80542
12904 80542 76412 77597 82951 80070 81096 89711 93073 82169 63989 56047 59596 54309 48084 45664
12890 45664 34800 29314 24221 22460 16229 5218 -1180 -4450 952 13569 20933 32366 34942
12877 34942 35653 39517 37913 50007 53775 55007 52340 55393 54082 56353 64699 66197 63746 61300
12863F1300N61Q940J2671j438r796p464j176N298J0565J3755K2032K4314K7786
12850A67348M2241O0641O3667M3975K6380m162l3212m7306n2374n4305n0293k4209
12838A38391j7196j4385j1192j5877m112m130J000J169q92j2295j9439L151J1686
12825E5879K618P200J1688J4290J4927K3404L4680L8394L5433L951k101Q25j2872
12812B28316l3637l6412l0930k1265j2682l082j1271n843J754Q75k19r810q208
12799E7586K578j900j796N421n008m938l193l397j207q506m527R9k313P080P646
12784D3625r99m841M594Q64k277L67Q819J2701J8651K0630J2577K5856J9482K4924
12770A84973K4622L0024L1041N0906Q8169J43670K13286L00187L38174K92587
$$ plain form
12863 61300 61861 70801 83472 82034 72238 64774 63598 68896 79461 93216 115248 139562 167348
12850 167348 209589 270230 333897 377872 404252 400090 366878 319572 267198 212893 162600 138391
12838 138391 121195 106810 95618 79741 75629 71499 72499 73668 72776 60481 41042 44193 55879
12825 55879 58497 65697 77385 91675 106602 130006 164686 203080 238513 242464 240363 241188 228316
12812 228316 194679 158267 127337 106072 93390 90308 79037 73194 74948 75823 75604 65794 57586
12799 57586 60164 58264 56468 61889 56881 51943 48750 45353 44146 35640 31113 31212 28899 35979 43625
12784 43625 42626 37785 42379 43243 40966 41333 50152 62853 81504 102134 114711 140567 160049 184973
12770 184973 209595 239619 270660 321566 409735 553405 766691 1066878 1405052 1697639
12760A697639K20522J56125R0389l2127j61045k13197k41597k59686k85779k72158
12750F99086j96293j18640p4882n6366l8356k7452l0058k2439j6447o730o963
12739A04460j1586j4879j2884j2157p302k0908j7663k2637k8244k6539j6759l612
12727i0710J4995J3721m030P044J0359J5483J3432Q718O633J3764N592l373M933
12714A6561Q283R617N18m369N1j0453r520o829O91K996k316K497N42m516j353
12699B400R847M994p052m989m025j2352o165k976R505J7195J3468K139n852m921
12685A1216q774q064J0262N436P870J0839P275J8290K0020n200j6148j0310j0676
12672C2036m800r53k444n077m948j1003q3N220m913k690K59K880p859p180Q206
$$ plain form
12760 1697639 1918161 2074286 2164675 2132548 1971503 1758306 1516709 1257023 971244 699086
12750 699086 502793 384153 309271 252905 214549 187097 157039 134600 118153 111423 104460
12739 104460 92874 77995 65111 52954 45652 24744 7081 -15556 -43800 -70339 -87098 -90710
12727 -90710 -75715 -61994 -66024 -58980 -48621 -33138 -19706 -10988 -4355 9409 15001 11628 16561
12714 16561 24844 34461 34979 30610 30661 20208 10688 3859 4550 7546 5230 7727 8269 3753 2400
12699 2400 12247 17241 10189 5200 1175 -11177 -17342 -20318 -10813 6382 19850 21989 16137 11216
12685 11216 2442 -5622 4640 10076 17946 28785 36060 54350 74370 69170 53022 42712 32036
12672 32036 27236 26283 23839 18762 13814 2811 2728 7948 3035 345 604 3484 -4375 -11555 -3349
12657c349Q572O823J223M833r68q072l905K168R46R485O608J2411J1279J1461
12643E9515J3441L921q935p207l36m37n169l946J778J7830P871k198r466j9871
12629D6791j6668j4166m645K612J0557K083j1014j1731r04j157N500R952J4783
12616C1993k336J724p790o768l948P315N687N065J0690j177N816K577j1878j6232
12602B0738j6662J404k949L465P626r57l299n69j426j3499n462j924Q48L367k370
12587a1669Q30k263Q209J2971R85n485M910K95K053L87n489p34o357m761R128
12572C010J108p284l699N365J0784O737K478j106J955m290l844r376k435O43O544
12557F590J137K982O944M431L79J051O750J72o212l904p068k190N423l528M040
$$ plain form
12657 -3349 5223 12046 13269 18102 17134 9062 5157 7325 8271 17756 24364 36775 48054 59515
12643 59515 72956 76877 67942 60735 60399 59962 54793 50847 52625 70455 78326 76128 66662 46791
12629 46791 30123 15957 11312 13924 24481 26564 15550 3819 2915 1758 7258 17210 31993
12616 31993 29657 31381 23591 16823 12875 20190 25877 30942 41632 40455 46271 48848 36970 20738
12602 20738 4076 5480 2531 5996 13622 12665 9366 8797 7371 -6128 -11590 -13514 -12666 -9299 -11669
12587 -11669 -10839 -13102 -4893 8078 9063 3578 8488 8783 10836 11223 5734 5000 -1357 -6118 3010
12572 3010 4118 -3166 -6865 -1500 9284 16021 18499 17393 19348 15058 11214 1838 -597 46 6590
12557 6590 7727 10709 17653 22084 22463 23514 30264 30436 24224 20320 13252 11062 16485 12957 16997
12542A6997J2564K627N960k927o599L353n1O575l057l650n272o347j548P671P570
12527C3866k318K067L929O81L192K144Q23m040j037M398M07j1753O64O974l242
12512C6755O973L514M072j762J613j1887l216l070n523l15o999j2012j073o432
12498F38P762O358m179k188L758J4447m652p689J492J581n139p772O98k167o494
12483c546M017K320K301N788L551m3K57n082j065M15O510q115K45n940N333P632
12467A4578P469k138n933q391j1732o37P842K440L902M018k016m542K903P410
12453A5173p034J145J819L593Q416K80n282j0304j065P766Q615R440j211M954
12439C6305o110j2836o452O75Q981O381M627N172N070k455j0028r51K549N103
$$ plain form
12542 16997 29561 32188 38148 35221 28622 31975 31924 38499 35442 31792 26520 20173 18625 26296 33866
12527 33866 31548 33615 37544 38225 41417 43561 44384 40344 39307 43705 44112 32359 33023 39997 36755
12512 36755 43728 47242 51314 49552 51165 39278 36062 32992 27469 27154 20155 8143 7070 638
12498 638 8400 14758 10579 8391 12149 26596 21944 14255 15747 17328 12189 4417 5115 2948 -3546
12483 -3546 471 2791 5092 10880 14431 14388 14645 9563 8498 8913 15423 7308 7553 1613 6946 14578
12467 14578 22047 19909 13976 5585 -6147 -6784 1058 3498 7400 11418 9402 4860 7763 15173
12453 15173 8139 9284 11103 14696 23112 23392 18110 7806 6741 14507 23122 32562 31351 36305
12439 36305 30195 17359 10907 11582 20563 26944 31571 36743 41813 39358 29330 28379 30928 36031
12425C6031j790j151m202K113L318J1073J4572J4901L0418L0273J1091k3071k4304
12412I9272k0153j5964L047m871j5231k79J2536J0140j32O920O654O917L134o417
12398H5573J5224J6806L857N215j628O426K054m884o295j2091m326K960M23R707
12384A19021J2759K9474L2299M6133N7221M2031Q995k5186m6877n2144m3475l1224
12372A49027r012k0251j8608o291Q945P652O098J6241M619j3283j8600j7162j3401
12359G5974q833M071P984L482r88n696n778n482j1781k922O284O713o623P517
12345F3922J9620J8101K5543J7903j250j7648k9530k3929k521o66l420N167j678
12332F9614q091q262o023j1635k576p850m275n107j538M687j560j368J72P815
$$ plain form
12425 36031 34241 33090 28888 31001 34319 45392 59964 74865 105283 135556 146647 123576 99272
12412 99272 79119 63155 66202 61331 46100 45821 58357 68497 68365 75285 81939 88856 91990 85573
12398 85573 100797 117603 121460 126675 125047 131473 133527 128643 122348 110257 105931 108891 109314 119021
12384 119021 131780 161254 193553 239686 296907 338938 347933 322747 275870 223726 180251 149027
12372 149027 140015 119764 101156 94865 103810 111462 117560 133801 138420 125137 106537 89375 75974
12359 75974 67141 71212 79196 82678 81690 75994 70216 64734 52953 50031 56315 63028 56405 63922
12345 63922 83542 101643 127186 145089 143839 126191 96661 72732 70211 69545 66125 71292 69614
12332 69614 61523 53261 47238 35603 33027 25177 20902 15795 14257 18944 17384 16016 16188 24003
12318B4003O580K342L614J0883p114l041L806P78K288K343j3024j47N35n898p548
12303B0400n692N44N680O792q135n699L324J0J0842L500J250n397L100J670p275
12288B4914r524o21k55O7j470L623R283k686r999J250J4326J0136j139n995k027
12273B9883j1866j1267o958L894L586j648j506m122k112j833K334Q754j109q51
12259E179o54l955M92N818J0258K048j060q257l998q018j0164j559L528Q843M511
12244C012k087p614J23J132L651o465m660K941K805R829R687O545J342o020m353
12229I868o990p010K976n11q028m159M1M663M869P768O553J6083P585O497J1939
12214E2144o494m365M426r11j1693m175j533o585r226L397Q932k464J312J544
$$ plain form
12318 24003 30583 32925 36539 47422 40308 37267 41073 41851 44139 46482 33458 33311 33846 27948 20400
12303 20400 14708 15252 20932 27724 19589 13890 17214 17224 28066 31566 32816 27419 30519 32189 24914
12288 24914 15390 14769 14514 14581 13111 16734 26017 23331 13332 14582 28908 39044 37905 31910 29883
12273 29883 18017 6750 -208 3686 7272 5624 4118 -4 -2116 -3949 -1615 7139 6030 5179
12259 5179 4525 570 1062 6880 17138 19186 18126 9869 5871 -2147 -12311 -13870 -10342 -1499 3012
12244 3012 925 -6689 -6566 -5434 -1783 -8248 -12908 -9967 -7162 2667 12354 18899 20241 14221 9868
12229 9868 2878 -4132 -1156 -1667 -9695 -13854 -13813 -9150 -4281 3487 10040 26123 33708 40205 52144
12214 52144 45650 41285 45711 44800 33107 28932 27399 20814 11588 14985 23917 21453 22765 24309
12200B4309q07M907L053j1002o516j283K568M723l434K308n139k448M030J3845
12186B9114N549n096j863K478j0254p682k587o584k89N858m457m517Q638j534
12172F774o832m440m624m194Q004N379J522J4089N783r64j354N71j1309j0984
12158b579q243o05j208M229J483O864m350J846k701n047P322J281p823p109o531
12143b3171J2892J422m461K698R116n816q491J0274R105O082R787R3r390n70k841
12128F729P6J1242O571o53O648J3926L474q845r445r482p328q433k491j022p724
12113f757N271l610l508K101J699M665n614N38M770M74l939n782o92j2N831N350
12097G85L03M314l07n76l689L662P114m174J138K841j183L569Q445N744J0260
$$ plain form
12200 24309 23502 28409 31462 20460 13944 12661 15229 19952 16518 18826 13687 11239 15269 29114
12186 29114 34663 29567 27704 30182 19928 12246 9659 3075 2786 8644 4187 -330 8308 6774
12172 6774 -58 -4498 -9122 -13316 -5312 67 1589 15678 21461 20497 19143 19714 8405 -2579
12158 -2579 -10822 -11427 -12635 -8406 -6923 -59 -4409 -2563 -5264 -10311 -2989 -1708 -9531 -16640 -23171
12143 -23171 -10279 -8857 -13318 -10620 -1504 -7320 -15811 -5537 3568 9650 19437 19530 10140 9570 6729
12128 6729 6805 18047 24618 23965 30613 44539 48013 39168 29723 20241 12913 4480 1989 967 -6757
12113 -6757 -1486 -5096 -8604 -6503 -4804 -139 -5753 -5215 -445 29 -3910 -9692 -10384 -10396 -4565 785
12097 785 1088 5402 5095 4519 830 4492 11606 7432 8570 11411 10228 13797 22242 27986 38246
12082C8246J1706N671p410m895p399j4338l159O08k449J777J859l788j3140q826
12068e537m300q39o790J245P738N671L422n38o106k172K672N193K477j256r05
12053b5O890P99P42M986p744j33j917m971J71J032Q428N757L959R839J77o64m743
12036B2583j3403r86l441K968K23r230j6721p248q009l32L094P232Q169O656L736
12021d709o453l548l930K495J878q31K412K894K138K887L322l402l30P114k766
12006h29r817m210k468l841L360M076K645n448P681M362L03r807k23J802k241
11991a4655k418Q727p721N887j968o705L335J458n022r37p69K194L861M560j567
11976a1740r33O078M769P247m04o186m315J357R25L344n641j787J581P052J206
$$ plain form
12082 38246 49952 55623 48213 43318 35919 21581 18422 19030 16581 18358 20217 16429 3289 -5537
12068 -5537 -9837 -10676 -17466 -16221 -8483 -2812 610 72 -6034 -8206 -5534 -341 2136 880 -25
12053 -25 6865 7664 8406 13392 5648 5515 3598 -1373 -1202 -170 8258 14015 17974 27813 27990 27326 22583
12036 22583 9180 8194 4753 7721 7944 -1286 -18007 -25255 -33264 -33596 -30502 -23270 -15101 -8445 -4709
12021 -4709 -11162 -14710 -18640 -16145 -14267 -15098 -12686 -9792 -7654 -4767 -1445 -4847 -5177 1937 -829
12006 -829 -10646 -14856 -17324 -21165 -17805 -13729 -11084 -16532 -8851 -4489 -4186 -13993 -14216 -12414 -14655
11991 -14655 -17073 -8346 -16067 -10180 -12148 -18853 -15518 -14060 -19082 -20019 -20788 -18594 -14733 -10173 -11740
11976 -11740 -12673 -6595 -1826 5421 5017 -1169 -5484 -4127 -3202 142 -5499 -7286 -5705 1347 2553
11961B553J095J9j0507j1159N485Q103L612P599j1975j1232j034m501Q577O537
11947f828l60n319p79m058N95J832P554P972j609o23p952p760L504K482k075o909
11931b0333L719O339J1496L402n395j1759P192l302Q38N512Q86R763l557n516
11917g15k481n913r458O738L977l704p11M225R23L568N259Q948l520j99J573k016
11901F494j267L075N154j517o916n510O213K539k768l845O837J855j248m036j550
11886C510N70k163r79N8o65J678Q325l456l215ol940r558j128M086Q930m611j250
11869c814J275r40J538P869N829l980p160j049q570R027P650j62r04J632m632
11854C609r54K730K6k318q65l969m57J000M299j844m264l902l492M439O800o7
$$ plain form
11961 2553 3648 3667 -6840 -17999 -12514 -4411 -799 6800 -5175 -16407 -17441 -21942 -13365 -6828
11947 -6828 -7188 -12507 -13286 -17344 -16749 -14917 -7363 609 -1000 -1623 -9575 -17335 -13831 -11349 -13424 -20333
11931 -20333 -16614 -10275 1221 4623 -772 -12531 -5339 -8641 -7803 -2291 -1405 8358 4801 -715
11917 -715 -3196 -9109 -18567 -11829 -7852 -11556 -12267 -8042 -7119 -3551 1708 10656 7136 6937 8510 6494
11901 6494 5227 8302 13456 11939 5023 -487 5726 8265 5497 1652 8489 10344 9096 5060 3510
11886 3510 4080 1917 938 996 331 2009 10334 6878 3663 3657 -283 -9841 -10969 -6883 2047 -2564 -3814
11869 -3814 -2539 -3479 -1941 5928 11757 7777 617 -432 -9002 25 7675 7513 6609 8241 3609
11854 3609 2655 5385 5411 3093 2228 -1741 -2198 -1198 3101 1257 -3007 -6909 -10401 -5962 838 771
11838G71m322J246P014L518K529k032n820m108p872K523O558L128J365j0706j11
11823f319O313L543n444K503J68n38K442k352m161j597o441O261N97p201m253
11808a6479K806M350L127P457J0963k33j0395m828j640K048j1010r03m005j844
11794b0586J5747J798r244n070O528J718m774J449j489J172N194N882q528l369
11780a3572M031J875Q05j172J081Q090j492m489m419m53j3618p983l332R513J1860
11765a3275N350j768j770k12K017L530j598M266L227l199j509K61l390j2420J540
11750a8950R322K651l479O8K325m878M049K720J0842j334m827j0236J1217N518
11736E008j926j747q602j2743K200M42P134J855l248O34J0061l887o817k939Q72
$$ plain form
11838 771 -3551 -2305 4709 8227 10756 8724 2904 -1204 -9076 -6553 5 3133 4498 -6208 -6319
11823 -6319 -6 3537 -1907 596 764 226 2668 316 -3845 -5442 -11883 -5622 -5025 -12226 -16479
11808 -16479 -13673 -9323 -6196 1261 12224 11991 1596 -3232 -4872 -2824 -13834 -14737 -18742 -20586
11794 -20586 -4839 -3041 -12285 -17355 -10827 -9109 -13883 -12434 -13923 -12751 -7557 -1675 -10203 -13572
11780 -13572 -9541 -7666 -6861 -8033 -6952 1138 -354 -4843 -9262 -9715 -23333 -31316 -34648 -25135 -13275
11765 -13275 -7925 -9693 -11463 -11675 -9658 -6128 -7726 -3460 -233 -3432 -4941 -4680 -8070 -20490 -18950
11750 -18950 -9628 -6977 -10456 -10388 -8063 -12941 -8892 -6172 4670 3336 -1491 -11727 -510 5008
11736 5008 3082 1335 -7267 -20010 -17810 -17368 -10234 -8379 -11627 -10993 -932 -4819 -11636 -14575 -13703
11721a3703p92J167N486P99P16K670M280j2634l032R612l781r91o101k409m88
11706a9201P374L109l304K611N876L06K665j77J067m890J314J446J373K846j270
11691A145q452l890P004M379N137j735o555M524l656n270R99m614l327P90j23
11676a3644N333R022N358q19q858p111K04M917o697r206K396P389K159k947m731
11661a7235j494N928k135J122J0657M073l332J345q82J831o136j1016N932Q095
11647c247r45J451P453K213Q065j61m535l40j3518p115j458N295l39l534j095
11632a1810l961k789l571K156L772O49m246J723j731K957J293k692k666L543L773
11617a3600R227P830n18n059M57l284k21j511l750j1202n603N160O788N591J949
$$ plain form
11721 -13703 -14495 -13328 -7842 -7043 -6327 -3657 623 -12011 -15043 -5431 -9212 -10203 -16304 -18713 -19201
11706 -19201 -11827 -8718 -12022 -9411 -3535 -3229 -564 -741 326 -4564 -3250 -1804 -431 2415 1145
11691 1145 -7307 -11197 -4193 186 5323 3588 -2967 1557 -2099 -7369 -6370 -10984 -14311 -13521 -13644
11676 -13644 -8311 711 6069 5250 -3608 -10719 -10515 -5598 -12295 -21501 -19105 -11716 -9557 -12504 -17235
11661 -17235 -18729 -12801 -14936 -13814 -3157 916 -2416 -1071 -1953 -122 -6258 -17274 -11342 -3247
11647 -3247 -4192 -2741 4712 6925 14990 14829 10294 9954 -3564 -10679 -12137 -6842 -7181 -10715 -11810
11632 -11810 -15771 -18560 -22131 -19975 -16203 -15554 -19800 -18077 -19808 -16851 -15558 -18250 -20916 -17373 -13600
11617 -13600 -4373 3457 2939 -2120 -1663 -4947 -5168 -6679 -10429 -21631 -27234 -22074 -15286 -9695 -7746
11602g746j230q97J733M30j963N506p406J329J064l168N062j79o601J090R276
11587c700Q726J054n893k516N749j834o796q643n107N407K277l089K986m08j986
11572a3773N366J18J707n237m792m282L143M093Q971L784q87n079j3077M961O113
11557h871j008J35O417Oj817j794J7J614q580l716M543O34n991o754m714P187
11541b2692R076J0767J1291M229K635m302o784O84L003J563J009j000m278m314
11527H87m064n548J214j100l669N386O41k349j45P2J427n025j604J1679m831o011
11511a3040N380k346J861J073Q46p602j928R278Q620J956j394q571p557O449J786
11496e189K871L821J226k772k385k001m903K051O029L36L144L138M965p174j1261
$$ plain form
11602 -7746 -8976 -9873 -8140 -7710 -9673 -4167 -11573 -10244 -9180 -12348 -7286 -7465 -14066 -12976 -3700
11587 -3700 5026 6080 187 -2329 3420 1586 -5210 -13853 -18960 -13553 -11276 -14365 -11379 -11787 -13773
11572 -13773 -8407 -8289 -6582 -11819 -16611 -20893 -17750 -13657 -4686 -902 -1789 -6868 -19945 -14984 -8871
11557 -8871 -9879 -9744 -3327 -3321 -5138 -6932 -6915 -5301 -13881 -17597 -13054 -12420 -18411 -25165 -29879 -22692
11541 -22692 -13616 -2849 8442 12671 15306 11004 4220 4904 7907 9470 10479 9479 5201 887
11527 887 -3177 -8725 -7511 -8611 -12280 -6894 -6253 -8602 -8747 -8675 -7248 -12273 -13877 -2198 -7029 -13040
11511 -13040 -7660 -10006 -8145 -7072 -6226 -13828 -15756 -6478 2142 4098 2704 -5867 -13424 -6975 -5189
11496 -5189 -2318 1503 2729 -43 -2428 -4429 -9332 -7281 -1252 -916 2228 5366 10331 3157 -8104
11481h104j277M545P849k216o344o71J814j555M273M848n084L495L914K378k434
11466E431n263p050l028k241M153K161k629j340p09l456q27J634L741j416l86
11451a1225q6K181Q81N020N68M97l594n099m467m76J981N184k420O556L959o225
11435f765p687O274M943M14l786n768k175j766R79O869L11M793Q037k46j0607
11420f180J367J019n460j167N194O202P441L634j1429q363K47j955J109J857Q76
11405e608J407n048p46J1377N309q015k103R021Q415K624l298k904M303l554n984
11390E196J098R86J433q66n035o310p90K048J829n729L500L282j474n359o999
11375a3190R348J3674k178O27L722j202K487P987k31o174n295P227J320K155P690
$$ plain form
11481 -8104 -9381 -4836 3013 797 -5547 -6218 -4404 -5959 -1686 3162 -1922 1573 5487 7865 5431
11466 5431 168 -6882 -9910 -12151 -7998 -5837 -8466 -9806 -10515 -13971 -14798 -13164 -9423 -10839 -11225
11451 -11225 -11311 -9130 -8249 -3229 -2661 -2164 -5758 -10857 -15324 -15800 -13819 -8635 -11055 -4499 -540 -6765
11435 -6765 -14452 -8178 -3235 -2821 -6607 -12375 -14550 -16316 -15337 -8468 -8157 -3364 4673 4427 -6180
11420 -6180 -4813 -3794 -9254 -10421 -5227 975 8416 12050 621 -7742 -7495 -9450 -8341 -6484 -5608
11405 -5608 -4201 -9249 -9995 1382 6691 -1324 -3427 5594 14009 16633 13335 10431 14734 11180 5196
11390 5196 6294 7280 8713 7847 2812 -3498 -4288 -2240 -411 -6140 -2640 642 -832 -6191 -13190
11375 -13190 -3842 9832 7654 8281 12003 10801 13288 21275 21044 14870 9575 16802 18122 20277 27967
11360B7967J6098Q122R586m797j4372j0920j2134n951l664p808J1412Q80n895
11347H524j572n34L689O667M409L515N776L624J573J729P340k321q96J2057l914
11332D9666j3043j3346j0200j5706j1057K451L078J127R937k407k006J3158J5940
11319B7592P45l421N285J4237J8116L1282M6337L5243R743k2149m1087m6094l6722
11306C9107j8347p681L301M16L910m059K951n270j418Q025O61L993L125p229n621
11291A5864k05m387l455J830K888j430m898l082N876l019k273j347Q367R307M651
11276B4687q008j5326p53N968J2113J1177J0774K0778L1962L7440L9114K7664
11264A97590p74k9484m2450m6784k3372r420p610j2611n506j276j533L59r98o322
$$ plain form
11360 27967 44065 52187 61773 56976 42604 31684 19550 13599 9935 2127 13539 14419 8524
11347 8524 6952 6418 10107 16774 21183 24698 30474 34098 35671 37400 44740 42419 41523 53580 49666
11332 49666 36623 23277 13077 -2629 -13686 -11235 -8157 -7030 2907 500 -1506 11652 27592
11319 27592 28337 24916 30201 44438 62554 93836 140173 175416 185159 163010 121923 75829 39107
11306 39107 20760 13079 16380 16796 20706 16647 19598 14328 12910 20935 21596 25589 28714 21485 15864
11291 15864 15659 11272 7817 9647 12535 11105 6207 3125 9001 5982 3709 2362 10729 20036 24687
11276 24687 16679 1353 600 6568 18681 29858 40632 61410 93372 130812 169926 197590
11264 197590 196816 167332 124882 78098 54726 45306 37696 25085 19579 18303 16770 17129 16131 9809
11250I809p376k753k719M202L439k888L458k193J415N991R186K939j3097q234
11236A179k042k413P59R251M995n512M017J3253J508o857j0152Q671K200j458
11222A7399R398M977R902J3364L176q34k408j7369j4812j1590p970r54j106q69
11208C04J531L394K643o242Q678j621j1628K328J853o220j803L913J2735n908
11194C957n522Q219O667J591j1324k517o16n417k565j780p21l289L715M534q197
11179a3265J967Q862l691k987j18l233M006J4041K925q454k172N384K95M36p787
11164c791o631j541O95p51R237Q917o296j0359L714J207M012O868K995M596o837
11149F035j2362j128L033o229N74R640k871l332L156M731J920l771q032k234l69
$$ plain form
11250 9809 2433 -320 -3039 1163 4602 1714 5172 2979 4394 10385 19571 22510 9413 1179
11236 1179 -863 -3276 -2517 6734 11729 6217 10234 23487 24995 18138 7986 16657 18857 17399
11222 17399 26797 31774 41676 55040 58216 57382 54974 37605 22793 11203 3233 2279 1173 304
11208 304 1835 5229 7872 1630 10308 8687 -2941 -613 1240 -4980 -6783 -2870 9865 3957
11194 3957 -1565 6654 13321 14912 3588 1071 455 -4962 -7527 -9307 -10028 -13317 -9602 -5068 -13265
11179 -13265 -11298 -2436 -6127 -9114 -9232 -12465 -8459 5582 8507 53 -2119 3265 3560 3996 -3791
11164 -3791 -10422 -11963 -11268 -12019 -2782 6135 -161 -10520 -6806 -5599 -1587 5281 8276 12872 6035
11149 6035 -6327 -7455 -4422 -10651 -10077 -437 -3308 -6640 -3484 1247 3167 -604 -8636 -10870 -11239
11134a1239p777R241J4578k665m158l178k553O929J77j592n469m83l89L370K496
11119b712J170J082j87P380K370J895k027n178m713L92j1528J787P925m423l298
11104a0065M749J611j180l24L55R275J921l779q323J051L894o113L38o205m37
11089a3232k310L883P781k016k525l532J273m112j430k729n36P285r34k027O860
11074h301M808K184K892n258p986N83O289L828k986k920n259o17n351J897k860
11059a9057l925J0714L878j377n229J323R20K196Q258r16k346K725O654N669n977
11044C510j0283J581K502k914l520M70q32P973P45l828p332m48q851m215O382
11029a9060M781p45K307o022j443P063P726J61p30J532L67l987q709K915n83M916
$$ plain form
11134 -11239 -19016 -9775 4803 2138 -2020 -5198 -7751 -822 -645 -2237 -7706 -8189 -8578 -5208 -2712
11119 -2712 -1542 -460 -647 6733 9103 10998 8971 3793 -920 -528 -12056 -10269 -2344 -6767 -10065
11104 -10065 -5316 -3705 -4885 -5209 -4854 4421 6342 2563 -5760 -4709 -815 -6928 -6590 -12795 -13232
11089 -13232 -15542 -11659 -3878 -5894 -8419 -11951 -10678 -14790 -16220 -18949 -19485 -12200 -13134 -15161 -8301
11074 -8301 -3493 -1309 1583 -3675 -11661 -11078 -4789 -961 -3947 -6867 -12126 -12743 -18094 -16197 -19057
11059 -19057 -22982 -12268 -8390 -9767 -14996 -13673 -12753 -10557 -2299 -3215 -5561 -2836 3818 9487 3510
11044 3510 -6773 -5192 -2690 -5604 -9124 -8654 -9486 -1513 -768 -4596 -11928 -12376 -21227 -25442 -19060
11029 -19060 -14279 -15024 -12717 -18739 -20182 -13119 -5393 -5232 -5962 -4430 -4063 -8050 -16759 -13844 -14427 -9511
11013i511O638o650o465O807p93M896k890M849L139K007l100l135m55K116M105
10998A558j17m550k46m59l941K27o42P117l690o616k740K193O246R610Q41l616
10982A175M489p830J593O364j0944l732r02L118K462k74j870R236J0130m682l745
10967D588n283N843K777l914j448j2702j612J0631P885K848l520o315n10O513
10953E781q581p092J0605P017o88O816j519j3030M76j863m307M146m992O61m886
10938a1456Q65R887K723j857L579J289K290p81q496J0153K506n759j761K839K366
10923H387m762r422j452K878Q866O011q443p760l27j800j143K557Q525K987K885
10908G987K557j3458k262N987l407O11J755j388K402O438j609l286J56p107m611
$$ plain form
11013 -9511 -2873 -9523 -15988 -9181 -9974 -5078 -7968 -3119 20 2027 -1073 -4208 -4663 -2547 1558
10998 1558 1441 -3109 -3355 -3814 -7755 -7528 -8170 -1053 -4743 -11359 -14099 -11906 -5660 3950 4791 1175
10982 1175 5664 -2166 -573 5791 -5153 -8885 -9787 -6669 -4207 -4481 -6351 2885 13015 8333 4588
10967 4588 -695 5148 7925 4011 2563 -10139 -11751 -1120 6765 9613 6093 -222 -732 5781
10953 5781 -2800 -9892 713 7730 7042 13858 12339 -691 -215 -2078 -6385 -2239 -7231 -6570 -11456
10938 -11456 -10591 -704 2019 162 3741 5030 7320 6539 -1957 8196 10702 4943 3182 6021 8387
10923 8387 3625 -5797 -7249 -4371 4495 10506 2063 -5697 -6024 -7824 -8967 -6410 2115 5102 7987
10908 7987 10544 -2914 -5176 811 -2596 -1985 -230 -1618 784 7222 5613 2327 2483 -4624 -9235
10893i235N2O338P069K125K156N76k877k148q232L8M999o028o826M114Q185l074
10877b768q748J273R694l404O029L65M342o8L986O330r36o131m176K411n971n349
10861c121N162l254J56P761K983k965r027n987L716J105n032n538R04j320Q846
10846e611J2583j781p766j681J487J502m538o573l675N327M151j236O347J0250
10832H786n124j2194n831Q097O483J3816o617n270k079o93j0394k990L696o558
10818a6872K243L71j109j178Q090m21J814n485K420l805m69k13k056R381K434
10803d855k025O117J0572L737k080K050n967O480K271j1468m812M354j0427O68
10789e385M022Q989L407j329K459J380k613k071m9o607r059J697M981M145J0590
$$ plain form
10893 -9235 -9183 -2845 4224 6349 8505 9081 6204 4056 -4176 -4138 861 -5167 -11993 -7879 306 -2768
10877 -2768 -11516 -10243 -549 -3953 2076 2441 6783 6715 10701 17031 16095 9964 5788 8199 2228 -3121
10861 -3121 2041 -1213 -1057 6704 9687 6722 -2305 -8292 -4576 -3471 -8503 -14041 -13137 -14457 -5611
10846 -5611 6972 5191 -2575 -4256 -2769 -1267 -5805 -12378 -16053 -10726 -6575 -7811 -1464 8786
10832 8786 3662 -8532 -14363 -6266 217 14033 7416 2146 67 -626 -11020 -14010 -10314 -16872
10818 -16872 -14629 -14258 -15367 -16545 -8455 -8876 -7062 -12547 -10127 -13932 -14401 -14614 -16670 -7289 -4855
10803 -4855 -6880 -763 9809 13546 11466 13516 7549 14029 16300 4832 20 4374 -6053 -5385
10789 -5385 -1363 7626 11033 9704 12163 13543 10930 8859 8810 2203 -6856 -5159 -178 3967 14557
10774A4557j087q870l936J915n18j238L607K208J439n84J292K523m685M674J725
10759A3022n649N716K054r884R89L511K995k027M822L110n561l932l408J719K825
10744A0302O971K739r79L918l335l564m193q090P459k41L77m021m381M556K345
10729I863n825k221N508m664l178j413j663M119K691j099M030Q282K164J1326
10715B7920o088n955O82L551p704r483l692q36O065L299J865K902J880M632j845
10700A7193r113k581K342M15k258m827r721j421J878j487L889L987p209k443J2836
10685A480M363N623J132p638j353K150L970L90M309O470p66j1906J346k506p2
10670F992P579r95k760K096L906o982rP31j998l750K015l381m580l899K347k07
$$ plain form
10774 14557 13470 4600 664 2579 2061 823 4430 6638 8077 7493 8785 11308 6623 11297 13022
10759 13022 7373 13089 15143 5259 6248 9759 12754 10727 15549 18659 13098 9166 5758 7477 10302
10744 10302 17273 20012 19033 22951 19616 16052 11859 3769 11228 10987 11364 7343 2962 7518 9863
10729 9863 4038 1817 7325 2661 -517 -1930 -3593 526 3217 2118 6148 14430 16594 27920
10715 27920 21832 15877 16559 20110 12406 2923 -769 -1605 4460 7759 9624 12526 14406 19038 17193
10700 17193 8080 5499 7841 8256 5998 1171 -8550 -9971 -8093 -9580 -5691 -1704 -8913 -11356 1480
10685 1480 5843 11466 12598 4960 3607 5757 9727 10117 14426 20896 20130 8224 9570 7064 6992
10670 6992 14571 13576 10816 12912 16818 9836 9827 10558 8560 4810 6825 3444 -1136 -5035 -2688 -2895
10654b895m54Q487O350j831o842K574j269n572q417m950N051J1601q67q428O731
10639g31N836j102o112j068J297O210L498n284l297l280K489J170N275m025q886
10624h010k009N325O415o827j392m720M850Q052Q248K593P79p79k152L913l940
10609A0346n987l739q379k385k438J032L753P675L705M747j6L957N844l107q927
10594F081j1237M32M119J780j049j043j469N790R857K978J562j418l381n189j599
10579F214K623o955k269R685P040N384m675m952M016O744N959J5960K6707K5005
10565I6486M6739Q4849Q2446K173p3107q0626m9160l1972k7220q727P96j0065
10553C2612j959j261J57K917M86L70L006M286L382O819J6855L3113N2400P1984
$$ plain form
10654 -2895 -3349 5138 11488 9657 2815 5389 4120 -1452 -9869 -14819 -9768 1833 966 -7462 -731
10639 -731 5105 4003 -2109 -3177 -1880 4330 7828 2544 -753 -4033 -1544 -374 4901 876 -8010
10624 -8010 -10019 -4694 1721 -5106 -6498 -11218 -6368 1684 9932 12525 13304 12525 10373 14286 10346
10609 10346 4359 620 -7759 -10144 -12582 -11550 -7797 -122 3583 8330 8314 12271 18115 15008 6081
10594 6081 -5156 -4724 -605 1175 126 -917 -2386 3404 13261 16239 17801 16383 13002 7813 6214
10579 6214 8837 1882 -387 9298 16338 21722 17047 12095 16111 22855 28814 44774 71481 96486
10565 96486 143225 228074 310520 312693 239586 158960 109800 77828 50608 41881 42677 32612
10553 32612 30653 29392 29549 32466 32952 33322 36328 40614 43996 50815 67670 100783 153183 225167
10539B25167J19542J47757M5602j01459j57020j05210o2333l3739k2146j1072
10529D5089k638L30m664J98k291p314j986r006q247o52R48j991n6L899o435r423
10513d239J2282R137j1384l262L377O382m882L32o857K711Q174J734n688L445
10499A1262k506j0178P706J1026j872n131K370K373L685j642n172o273K942q44
10485G746Q152N316Q92l785q211l746k008L325L992J863m463m290Q316Q326n650
10470A5775j4775p024J922N763M847K971l089O65k123j02M113L762K49M357k643
10455A4668M52J0004Q15o581o420k106l572k573m259M866M864K294J592o418p058
10440E68L186J649K226j210k651J0671R154J2615N817p224m237j2431m798P098
$$ plain form
10539 225167 344709 492466 538068 436609 279589 174379 112046 78307 56161 45089
10529 45089 42451 42781 38117 38315 36024 28710 26724 17718 9471 8819 9767 7776 7720 11619 5184 -4239
10513 -4239 8043 17180 5796 2534 5911 12293 7411 7743 886 3597 11771 13505 7817 11262
10499 11262 8756 -1422 6284 17310 15438 10307 12677 15050 18735 17093 11921 5648 8590 7746
10485 7746 15898 21214 22106 18321 10110 6364 4356 7681 11673 13536 9073 4783 13099 21425 15775
10470 15775 1000 -6024 -4102 1661 6508 9479 6390 7055 4932 4830 8943 12705 12954 17311 14668
10455 14668 15120 25124 25939 19358 12938 10832 7260 4687 428 5294 10158 12452 14044 7626 568
10440 568 3754 5403 7629 6419 3768 14439 23593 36208 42025 34801 30564 18133 13335 20433
10426B0433o573O217L602M349J2912M017j5776o435J074L371K818n224q503p607
10412H675r997J418K141N53N081L420K202P35q764N24k183q295K938N521Q51N350
10396A0170k61M658J0785n119r738l074M313K63k284l51k812P917n868p722M515
10381E392N077j165J960J919o128p647N003J565J0121L585j25K96j718o912l005
10366H218L616J3518L133j0725l292k699L076m64Q784R78m824J5416J0376K472
10352D7583P735r88j1800j0483o304m911k927k48J894j1322K29Q100K247l771
10338A5034M768N790P883N374M847p660k380o58o71K617l461M573O433n949j418
10323C5122k213j217J132m937P286l6l185l347j153J993j618M448M708o408Q97
$$ plain form
10426 20433 13860 20077 23679 28028 40940 44957 29181 22746 23820 27191 30009 24785 16282 8675
10412 8675 -1322 96 2237 2790 7871 11291 13493 14228 5464 5988 3805 -4490 -1552 3969 4820 10170
10396 10170 9909 14567 25352 20233 10495 7421 11734 11997 9713 9362 6550 14467 8599 877 5392
10381 5392 10469 9304 11264 13183 7055 -592 4411 5976 16097 19682 19557 19853 18135 11223 8218
10366 8218 11834 25352 28485 17760 14468 11769 14845 14381 23165 24143 19319 34735 45111 47583
10352 47583 55318 54330 42530 32047 25743 20832 17905 17657 19551 8229 8458 16558 18805 15034
10338 15034 19802 25592 33475 38849 43696 36036 33656 32998 32327 34944 31483 36056 42489 36540 35122
10323 35122 32909 31692 32824 27887 35173 35137 31952 28605 27452 29445 27827 32275 36983 30575 31472
10308C1472K175L823M658M37j438m828j229N256j264P543O308J2393j093J358
10294F5571P707r943j3319l583l395Q054P881K101k078j207j0153O566N55m093
10280E0664N233N65j545L169P184J1400J2322Q665N394Q321O922K2625M4969P2111
10266B57999J10446J37831R7679N8003Q8378J14707L5936j02791j08188n4680
10256F35320n7632j23452j30920r5697p0671m3803k3218j3619j0207n271j036
10245E9794k97l138K214l719p013m616m343K526L718m85j701m769j510k727L932
10230C7866j0128j446N388L067M079L161r621n146L480R439k206j0011J918P797
10216C7637q36p881o597j849o761J91J521J500K738K537k826L465J2284K024j3788
$$ plain form
10308 31472 33647 37470 42128 42565 41127 36299 35070 40326 39062 46605 52913 65306 64213 65571
10294 65571 73278 63335 50016 46433 43038 51092 58973 61074 58996 57789 47636 54202 54757 50664
10280 50664 55897 56462 54917 58086 65270 76670 88992 97657 103051 111372 118294 140919 185888 257999
10266 257999 368445 506276 603955 661958 750336 865043 900979 798188 690000 635320
10256 635320 577688 454236 323316 227619 156948 113145 89927 76308 66101 60830 59794
10245 59794 59497 56359 58573 54854 47841 43225 38882 41408 45126 44641 42940 38171 36661 33934 37866
10230 37866 27738 26292 31680 34747 38826 41987 32366 27220 30700 40139 37933 27922 29840 37637
10216 37637 36801 28920 22323 20474 13713 13904 15425 16925 19663 22200 19374 22839 35123 37147 23359
10201B3359p417N565O511p557j3504K139L872J085j009N575L299N619J0626K606
10187D0769M3J355R50M456n948p647k669l15P278o604q625l206O505J0217K633
10172C9192L446L771m027n591k931m727j017j068j861l654O772M97r907J534Q363
10157B8792p78o101o226J533R058M576N538n37q154k652o222r199L448J0305J670
10142B5051J606K037j990l183O733K422l484j6247m969J226K216L562N250p627
10128A2603m789Q918M662j401L177N78M401m455K521M985l434o559K106j894q94
10113B0525j181k97N455J208n980o134p654K964J0209N476O474R70J945r117j262
10098B3601J2266L425o83J655o048o679l207J078N473n335J080N943Q221K375
$$ plain form
10201 23359 15942 21507 28018 20461 6957 9096 12968 14053 13044 18619 21918 27537 38163 40769
10187 40769 40812 42167 43117 47573 41625 33978 31309 30994 38272 31668 23043 19837 26342 36559 39192
10172 39192 42638 46409 42382 36791 33860 29133 28116 27048 25187 21533 28305 28802 18895 20429 28792
10157 28792 28014 21913 15687 17220 26278 30854 36392 35855 27701 25049 18827 9628 13076 23381 25051
10142 25051 26657 28694 26704 23521 30254 32676 29192 12945 7976 9202 11418 14980 20230 12603
10128 12603 7814 16732 21394 19993 23170 23748 28149 23694 26215 31200 27766 21207 23313 21419 20525
10113 20525 19344 19047 24502 25710 19730 13596 5942 8906 19115 24591 31065 32035 33980 24863 23601
10098 23601 35867 39292 38609 40264 34216 27537 24330 25408 30881 25546 26626 32569 40790 43165
10084D3165m615l941O893M98j148l524n658l543o250j73L195L505O523O404m223
10069C7108j0001J73M346R63L396M611l61N88Q374j092J203O691N736n33q8P181
10053F8295R956P965o110n130J485R331K1529J9008R012K0958L2419K9173M0428
10040B58319P5667J31145K28679L90651O23528P05486J71713k72595m49368m20936
10030A442289k18886j9166J71566L98245O24062O57157J4513p10563p00260m18591
10020A240366j67688J871J49432K58214J84073j65973l96689l42526k32906j38666
10010C89508q2406n0376m2244l6918j5639j0094p703j0307j7793p453q739m306
9998I5530j0004q920J903m679q546j0372M270K01r193n736j299r292k953P148
$$ plain form
10084 43165 38550 34609 41502 42000 40852 37328 31670 28127 21877 21704 24899 28404 34927 41331 37108
10069 37108 27107 27280 31626 32589 35985 40596 40235 40823 49197 48105 49308 55999 61735 61202 61114 68295
10053 68295 78251 86216 80106 74976 76461 85792 107321 126329 135341 156299 188718 217891 258319
10040 258319 333986 465131 693810 1084461 1707989 2413475 2585188 2312593 1863225 1442289
10030 1442289 1223403 1204237 1375803 1774048 2398110 3055267 3069780 2359217 1658957 1240366
10020 1240366 1072678 1074549 1223981 1482195 1666268 1500295 1103606 761080 528174 389508
10010 389508 307102 256726 214482 177564 161925 151831 144128 133821 116028 108575 99836 95530
9998 95530 85526 76606 78509 73830 65284 54912 59182 59383 50190 44454 43155 33863 30910 38058
9984C8058K595m335R53j128j6616K021J1374q636Q261P093k835m673R511L960
9970D5603J547o292o288j0656o650j999O766J5072Q119J2854O63p406r820p475
9956C4038O37K418N247N294k494o088p131K09m71m115m173J602Q0J27o336o208
9940A2636N388N404J007M843P357j78l074l300J162j31q217J795O059K689L671
9925C7111m012J834J658m945k044L551M90j775j229P840P192j504k239P00p082
9910C5546L145L637L941J330l696J728P36l947R20l67k46L054k327k062L038l189
9894D1241m041J3R76J1082O38j07l768o980L274M847N162J41l375J980O10r631
9878D2062n602j815p24j84Q65j196Q783N821k511j0126K507J1671O564J649K79
$$ plain form
9984 38058 40653 36318 37271 36143 19527 21548 32922 24286 32547 39640 36805 32132 41643 45603
9970 45603 47150 40858 34570 23914 17264 15265 22031 37103 45222 58076 58739 51333 41513 34038
9956 34038 34675 37093 42340 47634 45140 39052 31921 32130 31659 27544 23371 24973 25053 25180 18844 12636
9940 12636 18024 23428 24435 29278 36635 36457 33383 30083 31245 31114 22897 24692 30751 33440 37111
9925 37111 33099 34933 36591 31646 29602 33153 33643 31868 30639 38479 45671 44167 41928 42628 35546
9910 35546 38691 42328 46269 47599 43903 45631 46367 42420 43340 42973 42727 45781 43454 41392 44430 41241
9894 41241 37200 37213 38189 49271 49909 49802 46034 39054 42328 47175 52337 52478 49103 51083 51693 42062
9878 42062 36460 34645 33921 33737 34602 33406 42189 48010 45499 35373 37880 49551 56115 57764 58043
9863E8043k000m562l043K395k772J185R478J2997n165j1805M59M512o71J362n076
9848E5337n879k962j512K411K006M204J4466k651j3063j0092N041J1734K137R168
9834G0345J0930o262n799k44n384o058j054m040Q84K92j905J713j182O900K333
9819F1469q237K954k192o879l853M337L891M410l202M597M518L200J0353l375
9805G1991L651J5075J2654M253r165j973n849m872m475N174Q541J5063J2809K213
9791A25090Q121J3500J2351J0802J5377J9939K1859K8740N5668Q6798J44875K22192
9779G65312L31914M89976N01894J70157O7592L64884O82980L89994n52711o85182
9769B526810k77643k1790k15226n30421m66532l02656j68396j14611p8191n4271
$$ plain form
9863 58043 56043 51481 48438 50833 48061 49246 58724 71721 66556 54751 55210 59722 59051 60413 55337
9848 55337 49458 46496 44984 47395 49401 53605 68071 65420 52357 42265 47306 59040 61177 70345
9834 70345 81275 75013 69214 68970 63586 57528 56474 52434 53318 53610 51705 53418 52236 59136 61469
9819 61469 53232 56186 53994 47115 43262 47599 51490 55900 52698 57295 61813 65013 75366 71991
9805 71991 75642 90717 103371 107624 98459 96486 90637 85765 81290 86464 95005 110068 122877 125090
9791 125090 133211 146711 159062 169864 185241 205180 227039 255779 311447 398245 543120 765312
9779 765312 1097226 1587202 2089096 2259253 2326845 2691729 3374709 3764703 3211992 2526810
9769 2526810 2249167 2227377 2012151 1481730 1015198 712542 544146 429535 351344 297073
9759B97073l1690k5410k8014k5053j7382j2209j4680j6580k332o091p661j3150
9747I6821j1381n507N839O190n739K990M38j0286n929L79Q406P958l09r547o053
9732G4270o140j024j573J985n69M107p38O441j055J186k936p090J887k801m505
9717F1445k377O100j683K874P403l156j0753K558k68o8K107p282l359Q375O743
9702F8659M723L048N674N790P425l868p945j3473o487q807l87J2723N892L72l635
9687F9704K919J000m177o491L055m406O192L204R19J392l327n565K065R344o519
9672F9309J014P054O852k931n202p68O631l543o571k407J967O036M898J3946J55
9657I6440r343K644J939q209M384q29K67n743m438p401L124J379m852N752K247
$$ plain form
9759 297073 265383 239973 211959 186906 169524 157315 142635 126055 123723 117632 109971 96821
9747 96821 85440 79933 85772 91962 86223 89213 89651 79365 73436 73815 82221 90179 89870 80323 74270
9732 74270 68130 67106 65533 67518 66949 71056 70318 76759 75704 76890 73954 66864 68751 65950 61445
9717 61445 59068 65168 63485 66359 73762 70606 59853 62411 62143 62075 64182 56900 53541 61916 68659
9702 68659 73382 76430 82104 87894 95319 91451 83506 70033 63546 54739 54352 67075 72967 73339 69704
9687 69704 72623 73623 69446 62955 66010 61604 67796 71000 71919 73311 69984 64419 66484 75828 69309
9672 69309 70323 77377 84229 81298 76096 75328 81959 78416 71845 69438 71405 77441 82339 96285 96440
9657 96440 87097 89741 91680 83471 87855 87026 87293 81550 77112 69711 72835 74214 69362 75114 77361
9642G7361K942K156o792r397J273J3071Q762o622K374J596J1429j972k463K156
9628I5874M55O89k193K498R202K220K348o612k782M421L625j267J871n662j2040
9613I2647N009R031l694j264Q698O512q88l463p10n666m450R75O125o986k622
9598I9254N673M810m397m765K883j96k839J1101L128l656J825m575M098J154j2699
9583A00799M913K399j167N377N076J060K233j363j554m355L088k684N958pP872
9568A27645L470K488O163k458m859o004q018R92M413N372l204p228P322J5751
9554A41845o036k592O491N817J4510l334n197l732j142o449m574J705O31r20l108
9539A33915O321J88r385q062P668M799n653o610N703P813m203k369k615k110N087
$$ plain form
9642 77361 80303 82459 75667 66270 67543 80614 89376 82754 85128 86724 98153 96181 93718 95874
9628 95874 96329 97018 94825 97323 106525 108745 111093 104481 101699 106120 109745 108478 110349 104687 92647
9613 92647 97656 106687 102993 101729 110427 116939 116051 112588 111878 106212 101762 102737 108862 101876 99254
9598 99254 104927 109737 105340 100575 103458 103262 100423 111524 114652 110996 112821 108246 112344 113498 100799
9583 100799 105712 108111 106944 112321 117397 118457 120690 119327 117773 113418 116506 113822 119780 119773 127645
9568 127645 131115 133603 139766 137308 132449 126445 118427 119419 123832 129204 126000 118772 126094 141845
9554 141845 135809 133217 139708 145525 160035 156701 151504 147772 146630 140181 135607 137312 137943 137023 133915
9539 133915 140236 140424 131039 122977 130645 135444 129791 123181 128884 136697 132494 130125 127510 125400 130487
9524A30487K973l950p522k873P487Q650R362m882q288Q296M097o272o60P689q72
9509A43722r381l065K308R36j964q827J265P777R00l035K069M539m75O75m367
9494A33077L086O701J876l367j1824J0100R657r29j1395O605l851N000O497k283
9480A48950k494K770Q48J362J0610J716O899P751m95j76j862p706k511O388N30
9465A72580N147j626k680M696j886o640l878M47N598P848p195j0297N0q092J1687
9450A65759J7685K946o898m45N074N589N276L528p19p782O135J2685P116r3l903
9435B11953L226m845n898n728M394J782j353M550q55M408M090p0q860K347L489
9420B12630R292l619m413L309J504k265L628Q398l290Q9O175L038O972l487l788
$$ plain form
9524 130487 133460 129510 121988 119115 126602 135252 144614 139732 131444 139740 143837 137565 136905 144594 143722
9509 143722 134341 131276 133584 134520 132556 123729 124994 132771 133671 130636 132705 137244 136769 137444 133077
9494 133077 136163 142864 144740 141373 129549 139649 149306 148377 136982 143587 139736 144736 151233 148950
9480 148950 146456 149226 150074 151436 162046 163762 170661 178412 177917 177741 175879 168173 165662 172050 172580
9465 172580 177727 176101 173421 178117 176231 169591 165713 166160 171758 179606 172411 162114 162164 154072 165759
9450 165759 183444 186390 179492 179047 184121 189710 194986 198514 197795 190013 196148 208833 215949 215856 211953
9435 211953 215179 210334 204436 198708 203102 204884 203531 208081 207226 211634 215724 215654 206794 209141 212630
9420 212630 221922 218303 213890 217199 218703 216438 220066 228464 225174 225263 231438 234476 241448 237961 234173
9405B34173L609J1053J5249n13M850K864L618L838O561Q970K77l51L113n547K216
9390B93980P29k421N181J579k855N42k940J397O323q39l604L834L80J5521J2494
9375C29301O719N636K689j376N650J0360J322N572J4675J0803M465l5J8k429o925
9360C86445M826J6j665J240o94j062N175J2489M828N788n86l384j546K59N879
9345D18008J5579P143p173j2940L62J1574P3k279j473L261Q659L482n263R44M780
9330D44737J3846N748n103n247J800J0689J0119N849j260k293O294P722O716m031
9316D95586n849l786m89j352k505j212L420Q261K319p3k71L697N621P314O043
9301E16724J0226L397m555Q106P152Q322J116J447K275J2614J5630L746J816M673
$$ plain form
9405 234173 237782 248835 264084 263571 268421 271285 274903 278741 285302 294272 294549 294198 297311 291764 293980
9390 293980 294709 292288 297469 299048 296193 296735 293795 295192 301515 300676 297072 300906 301286 316807 329301
9375 329301 336020 341656 344345 342969 348619 358979 360301 365873 380548 391351 395816 395781 395799 393370 386445
9360 386445 391271 391287 389622 390862 390168 389106 394281 406770 411598 417386 416800 413416 411870 412129 418008
9345 418008 433587 440730 433557 420617 420979 432553 432626 430347 428874 432135 440794 444276 439013 439957 444737
9330 444737 458583 464331 459228 453981 455781 466470 476589 482438 481178 478885 485179 492901 499617 495586
9316 495586 489737 485951 485462 484110 481605 480393 483813 492074 494393 494320 494049 497746 503367 510681 516724
9301 516724 526950 530347 525792 533898 541050 549372 550488 551935 554210 566824 582454 586200 588016 592689
9287E92689J8809K0845J3930M024J5444L1014K6972L8231K3326J2729j1545k9882
9275G56586j7090j0749k461J2659J9867J5106N145J2601J8397K2059K3917K4009
9263H80046K1479J1986J3455R317K729O790Q558J490K413Q955J0013J6604J2550
9250A006385Q720J1716J9902L5771M4754O3953P3023P7556O7183J8788l0407l4278
9238A363066l0928j6323P522K3317K1843L1218L7109L7527L7217M0069M6219M6818
9226A644674M4192M3704M0542M2514L7861K0447M415k067J064n864k739Q929P755
9213A885427L5q932K010J5580J2913K8212K6733L1751K5186K584k657M25N516
9200B024783p53R192J3983J7682K5460K5013K4832L4246L8115L4701M2427M4822
$$ plain form
9287 592689 611498 632343 646273 650297 665741 696755 723727 761958 785284 798013 786468 756586
9275 756586 739496 728747 726286 738945 758812 773918 779063 791664 810061 832120 856037 880046
9263 880046 901525 913511 926966 936283 939012 945802 954360 955850 958263 967218 977231 993835 1006385
9250 1006385 1015105 1026821 1046723 1082494 1127248 1191201 1264224 1341780 1408963 1427751 1397344 1363066
9238 1363066 1332138 1315815 1323337 1346654 1368497 1399715 1436824 1474351 1511568 1551637 1597856 1644674
9226 1644674 1688866 1732570 1773112 1815626 1853487 1873934 1878349 1876282 1877346 1871482 1868743 1877672 1885427
9213 1885427 1885462 1876530 1878540 1894120 1907033 1935245 1961978 1993729 2018915 2021499 2018842 2019267 2024783
9200 2024783 2024030 2033222 2047205 2064887 2090347 2115360 2140192 2174438 2212553 2247254 2289681 2334503
9188B334503L5755K9408M3676M7940M4330N3288N1369N9863N0333O2482O8115
9177B881062N4823N7868N4758P0011P0573P0496P6727Q4364Q4400R1505R0606
9166C687193R3583R9511J09807J07964J01378J13153J14580J33067J41038J29850
9156D831124J43692J47622J55506J54418J63591J87606J84383J86818J97607K01292
9146F553659K17226K34922K44547K58117K59758K81533L06819L20886L39229L54010
9136I370706L69476L94106M13213M47522M72645N02943N31014N61834N93088O47761
9126A4304308P05396P63102Q08147Q67721R28738R95365J095618J187096J276280
9117B2931771J385674J495558J621344J764036J920841K097695K285713K486412
$$ plain form
9188 2334503 2370258 2399666 2443342 2491282 2535612 2588900 2640269 2700132 2750465 2812947 2881062
9177 2881062 2935885 2993753 3048511 3118522 3189095 3259591 3336318 3420682 3505082 3596587 3687193
9166 3687193 3780776 3880287 3990094 4098058 4199436 4312589 4427169 4560236 4701274 4831124
9156 4831124 4974816 5122438 5277944 5432362 5595953 5783559 5967942 6154760 6352367 6553659
9146 6553659 6770885 7005807 7250354 7508471 7768229 8049762 8356581 8677467 9016696 9370706
9136 9370706 9740182 10134288 10547501 10995023 11467668 11970611 12501625 13063459 13656547 14304308
9126 14304308 15009704 15772806 16580953 17448674 18377412 19372777 20468395 21655491 22931771
9117 22931771 24317445 25813003 27434347 29198383 31119224 33216919 35502632 37989044
9109C7989044K710649K950651L225037L510962L816334M147665M471799M794709
9101F7616850N111592N400653N631293N817514N876124N786395N526143N050484
9093A11817048M367623L477017K400035J172527j20189j394689k602798l647931
9085A15468643m498496n132005n544303n768174n822204n743653n563589n309896
9077G2086323n024525m709305m380564m054900l747410l443269l163125k905505
9069D0657720k655800k450122k243171k059457j899656j743887j603622j468378
9061B4533627j353963j253277j173450j086685r94391r31107q74938q15877p61428
9052A5288511p15123o71426o27496n85594n49476n13358m81532m53070m27212
$$ plain form
9109 37989044 40699693 43650344 46875381 50386343 54202677 58350342 62822141 67616850
9101 67616850 72728442 78129095 83760388 89577902 95454026 101240421 106766564 111817048
9093 111817048 116184671 119661688 122061723 123234250 123114061 121719372 119116574 115468643
9085 115468643 110970147 105838142 100293839 94525665 88703461 82959808 77396219 72086323
9077 72086323 67061798 62352493 57971929 53917029 50169619 46726350 43563225 40657720
9069 40657720 38001920 35551798 33308627 31249170 29349514 27605627 26002005 24533627
9061 24533627 23179664 21926387 20752937 19666252 18671861 17740754 16865816 16049939 15288511
9052 15288511 14573388 13901962 13274466 12688872 12139396 11626038 11144506 10691436 10264224
9043A0264224m09419l76957l50524l44714l21031k99994k89144k68483k67441
9034G336517k49545k28178k23364k12819j99949j91780j83813j77283j64971j53586
9024E351229j48531j45335j42342j36232j30472j24364j13583j09484j12929r7803
9014D090154r6936r4933r1412q6049q1215r6357q5751q0170q1832p3719o7380
9003C154400o6505o9029o9784o6049o4988n9751n4617o1172o0644n7731m9623
8992B474507m7924n1054m6451m0979k8230l2504n0927m1828m1232m4614m5384
8981B003380m0372l3707l8336l5721m0061l6221l1727l9429m2409l2225k5680
8970A607492l6962l8349l0813l8550m7084l6906m1258k9986l4921l5379j9824
$$ plain form
9043 10264224 9854805 9477848 9127324 8782610 8461579 8161585 7872441 7603958 7336517
9034 7336517 7086972 6858794 6635430 6422611 6222662 6030882 5847069 5669786 5504815 5351229
9024 5351229 5202698 5057363 4915021 4778789 4648317 4523953 4410370 4300886 4187957 4090154
9014 4090154 3993218 3898285 3806873 3720824 3639609 3543252 3457501 3377331 3295499 3221780 3154400
9003 3154400 3087895 3018866 2949082 2883033 2818045 2758294 2703677 2642505 2581861 2524130 2474507
8992 2474507 2426583 2375529 2329078 2288099 2259869 2227365 2176438 2134610 2093378 2048764 2003380
8981 2003380 1963008 1929301 1890965 1855244 1815183 1778962 1747235 1707806 1665397 1633172 1607492
8970 1607492 1570530 1532181 1501368 1462818 1415734 1378828 1337570 1307584 1272663 1237284 1217460
8959A217460j7972k7031j8853j5490j7267j3354l103o329l719J135k032j278L68
8946A092535L980m727N822J2000K0454J7136K2900K6803J5972L6041L6252L1644
8934A316812L7042L2634M0369P6424J38831K24009L60771N96241R45285J431232
8924E199650J883837J630853j97560j899995j913089j293664p99492n02587l19135
8915A788818k15164j44633j02775o9748n4802o4034o3041n1184n4654l7240l4008
8904H97535l3540l0953k8129j3280k0600k0455j2051o348l455j0616q738q060
8892G01310j5352j6394J096K843n072j3302k1671j9906r780J250k377q655k235
8879E91755n030j3906q283k702m913j0786N62N145l811o655q753j863p125M184
$$ plain form
8959 1217460 1199488 1172457 1153604 1138114 1120847 1107493 1104390 1098061 1094342 1095477 1093445 1092167 1092535
8946 1092535 1096515 1091788 1097610 1109610 1130064 1147200 1170100 1196903 1212875 1248916 1285168 1316812
8934 1316812 1353854 1386488 1426857 1503281 1642112 1866121 2226892 2823133 3768418 5199650
8924 5199650 7083487 8714340 8516780 6616785 4703696 3410032 2610540 2107953 1788818
8915 1788818 1573654 1429021 1326246 1256498 1201696 1137662 1074621 1023437 968783 931543 897535
8904 897535 863995 833042 804913 791633 771033 750578 738527 732179 728724 718108 709370 701310
8892 701310 685958 669564 670660 673503 668431 655129 633458 613552 603772 605022 602645 593990 591755
8879 591755 586725 572819 564536 561834 556921 546135 546697 551842 548031 541376 532623 530760 523635 527819
8865E27819M86n275j4697q065K743m473o895n765p281L576q01o759o758j3403
8851D54452l774M824L22p972p20N045j187l626j638M077K02r68r335l762m67r330
8835D26143p52J600j3518p036N43L073J69p509n731r466k079j1L755j621r441
8820C78119j1627j2246k700J0264J634K152l847k631n678m134o05m90o341j1193
8806C30677J121L511N426Q8p620J350P033L21r069j5959q834k233K546j631j1291
8791B95436j4336L16Q144M791R77m74j238J2515N42l603O055Q131Q763K8097N0574
8776D04690O2933L1359k6754n9498n3143k9460j7874j3309n718L047r904o037
8764B80332L588j119M016k748n572p904p883m937k917J21Q291M020J708L954M916
$$ plain form
8865 527819 528305 523030 508333 500268 503011 498538 491643 485878 478597 482173 481372 474613 467855 454452
8851 454452 450678 455502 455824 447852 447132 452177 450990 447364 445726 449803 450005 449037 439702 435940 435473 426143
8835 426143 425391 426991 413473 406437 406980 410053 410222 402713 396982 387516 385437 385426 389181 387560 378119
8820 378119 366492 354246 351546 361810 363444 365596 361749 359118 353440 349306 348701 348211 341870 330677
8806 330677 331798 335309 340735 340823 333203 334553 341586 341907 332838 316879 308045 305812 308358 306727 295436
8791 295436 281100 281416 289560 294351 295328 294854 293616 306131 306673 303070 309125 317256 326019 354116 404690
8776 404690 467623 498982 472228 412730 359587 330127 312253 298944 293226 296273 286369 280332
8764 280332 283920 282801 286817 284069 278497 270593 262710 257773 254856 254977 263268 267288 268996 272950 277866
8749B77866J1468p98p539j5477k941o033K812J3001k568j1308K115N671R954R811
8735B86034M161J2074L3330M6872P7404J12029J08032j2539j03052j13588p6541
8724C74216m5042j9114j0003r056j2426n190q667k042J974J935o551m046P77j890
8710B54875m630l074m277M768J1710j734Q634O545J162k431m306l125L767J879
8696B69763l176K274j54M315K256M62J0366L830J1696K3918K0410K3896L7402
8683D07258M4558L1193j8509n0332m6264k9577j4855r392q702j0499p157J686
8671B89408J1744L709Q08J974O232N889l527L158N960M199Q654P630K0626J8089
8657C84553K0188J6155K3981K4636J8481K3913K2723J3910j3806j8342k2671m6503
$$ plain form
8749 277866 289334 288536 280997 265520 262579 256546 259358 272359 269791 258483 260598 266269 276223 286034
8735 286034 290195 302269 335599 382471 459875 571904 679936 667397 564345 450757 374216
8724 374216 329174 310060 300057 291001 278575 273385 264718 262676 264650 266585 260034 255988 256765 254875
8710 254875 250245 247171 242894 247662 259372 257638 266272 272817 273979 271548 267242 264117 267884 269763
8696 269763 266587 268861 268707 273022 275278 275740 286106 289936 301632 325550 345960 369856 407258
8683 407258 451816 483009 464500 414168 367904 338327 323472 314080 305378 294879 287722 289408
8671 289408 301152 304861 305669 307643 313875 319764 316237 319395 325355 329554 338208 345838 366464 384553
8657 384553 404741 420896 444877 469513 487994 511907 534630 548540 534734 516392 493721 447218
8645D47218m4304m1838l5928k5928k0519k2635j2667j4999j5202j3315j2466j8582
8633A68835m462O63j2489o709l813o431k700L398j346m483K512j025k513m19r5
8618A28923N313k464m57j969P38n720N233j757l179o132j231Q45o179p569o751
8603I7644j85K266P280J6523K2757M544m695n774o118J1j970m975o034k375o116
8588A12783J277P084l686J562k660o143j295Q781J029m8r368m655o71Q276J77
8573A12443o069k627O340K682o823l034k519j159n393p299o715j533J214l221
8559G6287L934P334k179n933m82j702j875n25J253J321J0485J148p68J161q827
8544H0632o193j368P971K800O9l215j463J432L561k65N032L102r578l824M025
$$ plain form
8645 447218 402914 361076 325148 299220 278701 256066 243399 228400 213198 199883 187417 168835
8633 168835 164373 165036 152547 145838 142025 135594 132894 136292 134946 130463 132975 131950 129437 129018 128923
8618 128923 134236 131772 131315 129346 130084 124364 129597 127840 124661 118529 117298 118143 111964 104395 97644
8603 97644 97459 99725 107005 123528 146285 150829 146134 140360 134242 134253 132283 127308 121274 118899 112783
8588 112783 114060 121144 117458 119020 116360 110217 108922 117703 118732 118684 109316 104661 103990 112266 112443
8573 112443 106374 103747 110087 112769 105946 102912 100393 99234 93841 86542 79827 78294 79508 76287
8559 76287 80221 87555 85376 79443 78961 77259 75384 74859 76112 77433 87918 89066 88298 89459 80632
8544 80632 74439 73071 81042 83842 83911 80696 79233 80665 84226 83961 88993 92095 82517 78693 82718
8529H2718k14K107P859N675L45J639L400o238j810k196M76R20l505o593q896j238
8513G4449m263l662j033L344K309m504K508P600K577n074M789n816j020M980k478
8498G4706p360N364J0868K922k268j0721m016M308k881k338R34K135L845O83M058
8483H0239M71M823J354m084k192r518j214l400l173Q772N526P242k047J204l752
8468H0251m374o6n991n220n974j724N479l514M111o657q159R014K417l029r79
8453E5585m40r29M615J1992R175q076r433r320L976P220M839l254J357l167K294
8438F6434N6l827l01j913K330l721j507j158l126m082M464N005j87K868N051q032
8422E8354o578k368K576J446o473N889M612O544N51m446J889j645k650l199n525
$$ plain form
8529 82718 82504 84611 92470 98145 98490 100129 103529 97291 95481 93285 93761 94681 91176 84583 75687 74449
8513 74449 70186 66524 65491 68835 71144 66640 69148 76748 79325 74251 79040 73224 72204 77184 74706
8498 74706 67346 72710 83578 86500 84232 73511 69495 73803 70922 68584 69518 71653 75498 76181 80239
8483 80239 80710 85533 86887 82803 80611 71093 69879 66479 63306 72078 77604 84846 82799 84003 80251
8468 80251 75877 75811 69820 64600 58626 56902 62381 58867 62978 56321 48162 57176 59593 56564 55585
8453 55585 55145 54216 58831 70823 79998 71922 62489 53169 57145 64365 69204 65950 67307 64140 66434
8438 66434 66490 62663 62362 60449 62779 59058 57551 56393 53267 49185 53649 58654 58467 61335 66386 58354
8422 58354 51776 49408 51984 53430 46957 52846 57458 64002 64553 60107 61996 60351 57701 54502 48977
8407D8977j0774K366O18j237k933J825J2747J587K532J809m444K46L442n347L23
8392E1737O263J497k070N032k055n956l256p386l926J1472j113l955j948J459
8378D5795N387R591N524j2226m338l982j769O010J3146j646j7033J448O533J500
8364E3940q176j080r1m044p888K506k697M800J2435p571j0650k142j701k736O078
8349C0983N037O982k273J288O186J3558j964q920j0805L438K923o143r972p045
8335B3273K931N531N298L928N525J747j089L289o731q248N327m818M986M807K042
8320D7798K501q17j1838j4272J0445J1077m845n588M524N577n897j13J20J0432
8306D9104J038j3294n660K221m001j24R747L17P419M7m190n675l31m60P9L364
$$ plain form
8407 48977 38203 40569 41187 39950 37017 38842 51589 53176 55708 57517 53073 53319 56761 51414 51737
8392 51737 58000 59497 57427 62459 60404 54448 51192 43806 39880 51352 50239 46284 44336 45795
8378 45795 51182 60773 66297 54071 49733 45751 43982 49992 63138 61492 44459 45907 52440 53940
8364 53940 45764 44684 44593 40549 32661 35167 32470 37270 49705 42134 31484 29342 27641 24905 30983
8349 30983 36020 43002 40729 42017 48203 61761 59797 50877 40072 43510 46433 40290 30318 23273
8335 23273 26204 31735 37033 40961 46486 48233 47144 50433 43702 35454 40781 35963 40949 45756 47798
8320 47798 50299 49482 37644 23372 33817 44894 40049 34461 38985 44562 38665 38552 38672 49104
8306 49104 50142 36848 31188 33409 29408 29284 39031 39348 46767 46814 42624 36949 36618 36158 36237 39601
8290C9601P05l019N17j3439j660P107M930l092r710K801J0379m388M94O182O610
8275D4018r37R72l965J388K996O418K97p230q247r319K752O828k750J212o66O45
8259C4412j426p388q611Q060O234r108j1835P694l0J3324k144o506k647p10L00
8244A9619L012j871J333Q590k350O93L239l820p116o851M625M419N417J855l176
8229B7618o547k053K915M08O344j598K887k082m794L77j615L403P999R54j650
8214C2566n786k455P703Q010m215K983R911J410j731j0065k018j442M501j418
8200C7954L467J97N157j079p572j2678l421J8825N082j888n456L658k55o449k048
8185C3494n912l714J1253J68K20K508P780n624j0496q647J1847O920J976L275
$$ plain form
8290 39601 40306 37287 37804 24365 22705 29812 34742 31650 21940 24741 35120 30732 31226 37408 44018
8275 44018 43081 44053 40088 41476 44472 50890 51187 43957 35710 26391 29143 35971 33221 34433 33767 34412
8259 34412 32986 25598 16987 25047 31281 22173 10338 18032 18002 31326 29182 22676 20029 19319 19619
8244 19619 22631 20760 22093 30683 28333 29026 32265 28445 21329 14478 19103 23522 28939 30794 27618
8229 27618 21071 19018 21933 22341 28685 27087 29974 27892 23098 23475 21860 25263 33262 34216 32566
8214 32566 26780 24325 32028 40038 35823 38806 48717 50127 48396 38331 36313 34871 39372 37954
8200 37954 41421 41618 46775 45696 38124 25446 22025 40850 45932 44044 38588 42246 41991 35542 33494
8185 33494 27582 23868 35121 35289 35509 38017 45797 40173 29677 21030 32877 39797 41773 45048
8171D5048l006M184K536m896m756n620r77j426j0749j75l136L336N033j573n110
8156A8713n560P01P569J0929J125j053J4099J3058J5913M269j128M731o001k852
8142G4513j5002o880k794j3019o662l327M052K088L464K435J1353J2406J2143
8129G4770N102k686J2889r321l237J977r949j657p09r202n349K062Q311l42J4307
8114G6966Q825m86N66l604k251K094l092k241N402l146R42N670M723J3400R888
8099A13656M803q955j3639j0343P31N445m490j612j620J1730J0234j970L520J4365
8085A21855K7988K7755J9492M639o885k4280j8376j4247j2517j5514r994K822
8073A02738O420M956m758N242P354l246K106N494M502J4040J9861M757O81M953
$$ plain form
8171 45048 42042 46226 48762 43866 39110 33490 32513 31087 20338 20163 17027 20363 25396 23823 18713
8156 18713 13153 13854 21423 32352 33477 32424 46523 59581 75494 79763 78635 83366 77365 74513
8142 74513 59511 52631 49837 36818 30156 26829 30881 32969 36433 38868 50221 62627 74770
8129 74770 79872 77186 90075 80754 77517 79494 69545 67888 67179 57977 52628 54690 63001 62659 76966
8114 76966 85791 85305 85871 82267 80016 82110 79018 76777 82179 79033 79975 85645 90368 103768 113656
8099 113656 118459 109504 95865 85522 86253 91698 87208 85596 83976 95706 105940 103970 107490 121855
8085 121855 149843 177598 197090 201729 194844 170564 152188 137941 125424 109910 99916 102738
8073 102738 109158 114114 109356 114598 121952 118706 120812 126306 130808 144848 164709 169466 170147 175100
8059A75100m722q35j1720k255o423j3654q730l701j3905j2223r023m201n835j051
8045G6822k649K952L229j481m087K106Q991R782N880K422p304p318O396K363r294
8030H8810N306M169q26N15n631n47M13o449o310J8628R300N008L598P093N212
8015A28289j637j4072r345l652p207j0353r249j0452k975L050p655K464l665k682
8001E0859K292R66m966o646Q09N343O622K903J713P231M279l847L677J2384N708
7986H9327j2635Q67m696p604j0538r841J43J728k682J028J102m871p50M665J951
7971D7194J620k063k410j850k241j872K33l97j15m414k819k982k893J654L324
7956B9969O756j250N950k459n162l199r371l572q943J435K848J2142R603o642
$$ plain form
8059 175100 170378 169543 157823 155568 149145 135491 126761 123060 109155 96932 87909 83708 77873 76822
8045 76822 74173 77125 80354 78873 74786 76892 85883 95665 101545 103967 96663 89345 95741 98104 88810
8030 88810 94116 98285 97459 97974 92343 91796 92209 85760 79450 98078 107378 112386 115984 123077 128289
8015 128289 126652 112580 103235 99583 92376 82023 72774 62322 59347 62397 54742 57206 53541 50859
8001 50859 53151 54117 49151 42505 43314 48657 55279 58182 59895 67126 71405 67558 71235 83619 89327
7986 89327 76692 77559 72863 65259 54721 44880 45023 46751 44069 45097 46199 41328 40578 45243 47194
7971 47194 48814 46751 44341 42491 40250 38378 38611 38214 38099 33685 30866 27884 24991 26645 29969
7956 29969 36725 35475 41425 38966 33804 30605 21234 17662 8719 10154 13002 25144 34747 28105
7942B8105J481K69M567L423m278j946m053k998M973l228o53N593P223j0066k3831
7927D581j569k46K486M24J423M819J0515O709l048m41J820l881k750l27k212L261
7911B1564j3303l004N256p7K556L094M155O17o690n347K254N396O5K13k95L327
7895A9781M867j060q117o902J0901l046m950j234K134J859k87q099j781K38N716
7880A0020O800j051K64O079L468j58j313j0419M381N231k490o682K96k511n915
7865F000m392M832M250K834m29L390P78j742l121K189k260L494M567o656l505
7850A0229m566L929k720O151m30J594L729J23k58K361M270m139j475l972m672
7835A0154l050K502L065k235K779P00o826j454K679J0928L010m652k191k041J816
$$ plain form
7942 28105 29586 29855 34422 37845 33567 31621 27568 24570 29543 26315 25662 31255 38478 28412 4581
7927 4581 3012 2766 5252 5676 7099 11918 22433 29142 26094 25653 27473 23592 20842 20515 18303 21564
7911 21564 8261 5257 10513 10436 12992 16086 20241 20858 14168 8821 11075 16471 16536 16749 16454 19781
7895 19781 24648 23588 15471 8569 19470 16424 11474 10240 12374 14233 13946 5847 4066 4304 10020
7880 10020 16820 15769 16033 22112 25580 25422 24109 13690 18071 23302 20812 14130 14426 11915 6000
7865 6000 1608 6440 10690 13524 13095 16485 17263 15521 12400 14589 12329 15823 20390 13734 10229
7850 10229 5663 9592 6872 13023 12593 14187 17916 18039 17781 20142 24412 20273 18798 14826 10154
7835 10154 7104 9606 12671 10436 13215 13915 7089 5635 8314 19242 22252 17600 15409 13368 15184
7820A5184K079o122q210m214n224p559J2567J6223j394O964O764n062p469N7l67
7805A4217K037r16q349n019m486M741L392l959J2872n661r589O102q24r349RJ3766
7789H984M45r944J69J0466N700r024j0274J675M212K191l301n156n270L667J303
7774d157M943P496J304Q58j162m335K043k658L08k299o622L26M461J465J291K102
7758E364k14l625O806N277l560j763r51l968o787P563P120l024j651k25k378M595
7742H579P637l594R77r655j3166L790L762k337n072P309M066l546J523L334Q666
7727A2273K335l458m974p29j0118l344N729P497L199p233p647R149J3621k206
7713A4094j946m609N276j071l441j37l130l47n144J017k646L131K834l254o078
$$ plain form
7820 15184 17263 11141 2931 -1283 -6507 -14066 -1499 14724 13330 20294 27058 21996 14527 14584 14217
7805 14217 16254 15338 6989 1970 -2516 2225 5617 1658 14530 8869 -720 5382 4558 -4791 -4782 8984
7789 8984 9429 -515 -346 10120 15820 6796 -3478 -1803 2409 4600 1299 -3857 -9127 -5460 -4157
7774 -4157 786 8282 9586 10444 9282 4947 6990 4332 4640 2341 -4281 -3955 506 1971 3262 5364
7758 5364 5150 1525 8331 13608 10048 8285 7334 3366 -3421 4142 11262 8238 6587 6362 3984 8579
7742 8579 16216 12622 13599 3944 -9222 -5432 -1670 -4007 -9079 -1770 2296 -1250 273 3607 12273
7727 12273 14608 11150 6176 5447 -4671 -8015 -2286 5211 8410 1177 -6470 2679 16300 14094
7713 14094 12148 7539 12815 11744 8303 8166 5036 4689 -455 562 -2084 1047 3881 627 -5451
7698e451J926k514L687j0803n413N8P052R867K595J826j98K134n727L457M441
7683F937j858j096L834k346q861q041M590j577L531L560j732n655N645K208N06
7668c55j631J789M684m464m527k951O456L391l28k339O72K049R375o433j1087
7653e699k402J501q139K65O77M441J342Q79N433O00j0649p093j780J5717J1509
7638F602p071p377J0210N238o34l515o741o526k77K295R038L174k590j072j971
7623a217P088Q742j735k968m254j700L429K960l311K365m14K50k019j4982j7064
7608b4830N156M368K051J989l9n603O664J4958O129n611j149J256Q20K174j95
7593H138p273n515L577n004o200K403O481j403k099J143l25j173QK950L420Q777
$$ plain form
7698 -5451 -3525 -6039 -2352 -13155 -18568 -18510 -11458 -1591 1004 2830 2632 4766 -961 2496 6937
7683 6937 5079 3983 7817 5471 -3390 -11431 -6841 -8418 -4887 -1327 -3059 -8714 -3069 -861 -355
7668 -355 -1986 -197 4487 23 -4504 -7455 -999 2392 2064 -275 397 2446 11821 5388 -5699
7653 -5699 -8101 -6600 -14739 -14474 -13797 -9356 -8014 -7135 -1702 -1102 -11751 -18844 -20624 -4907 6602
7638 6602 -469 -7846 2364 7602 6968 3453 -3288 -9814 -10091 -7796 1242 4416 1826 754 -1217
7623 -1217 5871 14613 12878 9910 5656 3956 7385 10345 7034 9399 8985 9235 7216 -7766 -24830
7608 -24830 -19674 -15306 -13255 -11266 -11305 -16908 -10244 4714 10843 5232 4083 5339 6159 8333 8138
7593 8138 865 -4650 -1073 -6077 -12277 -9874 -3393 -4796 -6895 -5752 -6077 -7250 -7242 -4292 -872 7905
7577G905j0953m791L385k842Q049M55j368M130R84o54r652n124L760M815j93n629
7561g723N737J0891O647m759n298M655m465l114J1508P418J262p023o499j984
7547G253J172o538m400p655p130J2154R025k693o140k119l350l722k584J3743
7533b984J9936j580n967j1478l826Q827L416m517p51n735P62O964P068R469K987
7518B2591m996q675r800k839l611J067J381L916L32J86P844l884r058J545k570
7503f571J202N196j030N354n198j3535m779K096J255k756k337J660P829O628m111
7488i097k971N762Q261o366q575N009M14l71O62L195j584j592M150r166K879M101
7472e289N608N393N553q05O934k078j504K18J084o602n52P887l116q750p980j591
$$ plain form
7577 7905 -3048 -7839 -4454 -7296 753 1208 -160 3970 4954 4300 -5352 -10476 -6716 -1901 -2094 -7723
7561 -7723 -1986 8905 15552 10793 5495 10150 5685 2571 14079 21497 22759 15736 9237 7253
7547 7253 8425 1887 -2513 -10168 -17298 -5144 3881 1188 -4952 -7071 -10421 -14143 -16727 -2984
7533 -2984 16952 15372 9405 -2073 -5899 2928 6344 1827 1076 -4659 -3897 3067 10135 19604 22591
7518 22591 17595 8920 -880 -3719 -7330 -6263 -4882 -966 -634 -448 7396 3512 -5546 -4001 -6571
7503 -6571 -5369 -173 -1203 4151 -1047 -14582 -19361 -17265 -16010 -18766 -21103 -19443 -11614 -4986 -9097
7488 -9097 -12068 -6306 1955 -4411 -12986 -7977 -7563 -7934 -7272 -4077 -5661 -7253 -3103 -12269 -9390 -5289
7472 -5289 319 5712 11265 10460 17394 15316 13812 14030 15114 8512 7960 15847 12731 3981 -3999 -5590
7456e590n332q125N499J643N725O478n891L092j37o003j980N259R156N763j328
7441H229L016L18k513j1035n872k321L574J070K21P626Q27j317p888J641j677
7426f101L512l088q623J747P408j492J482j780j055Q993L937L099m483k454L293
7411D395j637P712L417j0275K188k50l082q138l732J1259L417r847m881O355R38
7396b161k444R391r79l685n10K769l941K886k808K296m195o468j977Q270O387
7381B831r517j656J2132M280m094m512l774p309K970J012L780P680Q615l412o098
7366B928o361o051m829L850r272q523J0764J4382m13M083P799n078q179K457L775
7351A332J144j211O40K416j0861q611J472J448K166R534R224l153n621j806l140
$$ plain form
7456 -5590 -10922 -19047 -13548 -11905 -6180 298 -5593 -2501 -2638 -8641 -10621 -5362 3794 9557 8229
7441 8229 11245 11563 9050 -1985 -7857 -10178 -6604 -5534 -5313 2313 3140 1823 -6065 -4424 -6101
7426 -6101 -2589 -5677 -14300 -12553 -5145 -6637 -5155 -6935 -7990 1003 4940 8039 3556 1102 4395
7411 4395 2758 10470 13887 3612 5800 5550 2468 -5670 -9402 1857 5274 -4573 -9454 -3099 -2161
7396 -2161 -4605 4786 3807 122 -388 2381 -1560 1326 -1482 814 -3381 -9849 -11826 -3556 2831
7381 2831 -6686 -8342 3790 8070 3976 -536 -4310 -11619 -8649 -7637 -3857 3823 12438 9026 2928
7366 2928 -3433 -9484 -14313 -10463 -19735 -28258 -17494 -3112 -3525 558 8357 3279 -4900 -2443 1332
7351 1332 2476 1265 1905 4321 -6540 -15151 -13679 -12231 -10065 -531 8693 5540 -81 -1887 -5027
7336e027J052P353j019j0698j188j073P712j169K726J462k04K873k197J746r49
7321A400j585K079L011P327k824j402m667L282j824m479N446K298K317J250o283
7306E346l518j158k406N39j035l496n910m12J09L350M291Q084m290L264k934M08
7290B32k253l210K921J216J752M60K545L833l990k848L009j737n317j824K379
7275b832M653o760l648m147P269Q847R95K703O956J136L595k770l369l644l159
7260E825l361k799p387K523k360j337N797J0517k909r97M883N229k238l548r751
7245a913m447J074k25n312M037J5643l850n870M710K670m438j0458o920J649J3819
7230A69M466O14O139m265m203j545m165j0009j247R849P397j2307q406k264O005
$$ plain form
7336 -5027 -3975 3378 2359 -8339 -9527 -10600 -2888 -4057 -1331 131 -73 2800 603 2349 1400
7321 1400 -185 1894 4905 12232 9408 8006 3339 6621 4797 318 5764 8062 10379 11629 5346
7306 5346 1828 670 -1736 -1197 -2232 -5728 -11638 -12050 -11941 -8591 -4300 3784 -506 2758 -176 232
7290 232 -2021 -5231 -2310 -1094 658 1118 3663 7496 3506 658 3667 1930 -3387 -5211 -2832
7275 -2832 1821 -4939 -8587 -12734 -5465 3382 4377 7080 14036 15172 18767 15997 12628 8984 5825
7260 5825 2464 -335 -7722 -5199 -7559 -8896 -3099 7418 4509 3512 8395 13624 11386 7838 -1913
7245 -1913 -6360 -5286 -5511 -10823 -6786 8857 5007 -863 3847 6517 2079 -8379 -15299 -13650 169
7230 169 4635 5249 11388 7123 2920 1375 -2790 -12799 -14046 -4197 3200 -9107 -17513 -19777 -13772
7215a3772Q899K85k182O847r96o978l935K008O686p343o010P288M721o062m964
7200a5508N176k427o801j136l87Q014N912O010K865j321n909j471J483j391N68
7185f323P08l491j372L836M20o693l236R304N708p462j419N436O959o25m961l98
7169c609J1163q43r060k481l683m905J130N937Q0P621k252m689L465J911m131
7154d346q22K996J000O039p216j617N149k370J881N399q62M107n754l379l493
7139c288O315L052R833l983k080q570l874M844j4083K038P245L248k784K785O261
7124F959K022l151J154J964r87j589k719k662o165q160N141k843l57P297L615
7109d81n826N890K421k747J029N990N029k310m270p56K134r090m817j075K99K085
$$ plain form
7215 -13772 -4873 -4588 -6770 77 -919 -7897 -11832 -9824 -3138 -10481 -16491 -9203 -4482 -10544 -15508
7200 -15508 -10332 -12759 -19560 -20696 -21083 -13069 -7157 -1147 1718 397 -5512 -6983 -5500 -6891 -6323
7185 -6323 -5615 -9106 -10478 -6642 -6222 -12915 -16151 -6847 -1139 -8601 -10020 -4584 2375 1750 -3211 -3609
7169 -3609 7554 6711 -2349 -4830 -8513 -13418 -12288 -6351 -6271 1350 -902 -5591 -2126 -215 -4346
7154 -4346 -5168 -2172 -1172 4867 -2349 -3966 1183 -1187 694 6093 5231 9338 3584 205 -3288
7139 -3288 3027 6079 15912 11929 9849 1279 -2595 2249 -11834 -9796 -2551 697 -2087 698 6959
7124 6959 8981 5830 6984 8948 7961 6372 3653 991 -5174 -13334 -8193 -11036 -11393 -4096 -481
7109 -481 -6307 -417 2004 -743 286 6276 11305 8995 4725 3969 6103 -2987 -7804 -8879 -8580 -6495
7093f495m642p655Q862N186K966N172J154L972l898o164K149r749N29L080m01
7078e934n1L28k155O54j040K678J37j689P962J998l592o885K05k789O82Q501L870
7061B880l916j1390n84J906L35L450k260m703K273J2783r367j2544J7386L733
7047a8j1895m021Q78N922Q034m90k31l804n032k40O740m907k969M557K809M693
7031B6N814M234l658m262J45p787m287L594M036J0259M348k894r23k625j315J248
7015E953R273j0125l576l42o019j648K105L914K434J312j8315m371m28N163P01
7000a3969N154M254m42K432j737L633p004J528K304P953n993N38L680m39o092
6985d200k711N766P889O964J988k499J844p176l29l047l269n690p01J345L492
$$ plain form
7093 -6495 -11137 -18792 -9930 -4744 -1778 3394 4548 8520 4622 -1542 607 -9142 -8613 -5533 -5934
7078 -5934 -5985 -5657 -7812 -7158 -8198 -5520 -5383 -7072 890 2888 -704 -7589 -7384 -10173 -9491 -990 2880
7061 2880 -1036 -12426 -13010 -11104 -10769 -7319 -9579 -14282 -12009 774 -8593 -21137 -3751 -18
7047 -18 -11913 -15934 -15056 -9134 -1100 -1590 -1821 -5625 -10657 -10897 -4157 -9064 -12033 -7476 -4667 26
7031 26 5840 10074 6416 2154 2299 -5488 -9775 -6181 -2145 8114 12462 9568 8645 6020 4705 5953
7015 5953 15226 5101 1525 1183 -4836 -6484 -4379 -465 1969 3281 -15034 -19405 -19833 -14670 -13969
7000 -13969 -8815 -4561 -5003 -2571 -4308 -675 -7679 -6151 -3847 4106 -1887 -1349 2331 1892 -4200
6985 -4200 -6911 -1145 6744 13708 15696 13197 15041 7865 7536 4489 1220 -4470 -5171 -3826 -334
6970c34K373L901O717k99p976l53l446L248k643r528m325J5875O301j714k135
6955E662m063M084p32l906J987l713m696O301J0631O919Q52n662m476l475n511
6940B02J424L233J4603m990r354O34P780m439l192K138l641j921N36K558o511
6925i40L111L580k367n921J715L825l412q204R379J0071j1087R81j40l466N731
6910B856l66j917k574R539J537m030m757k931k816p377J2627J5171j879o979Q163
6895A4267O374J995j3779k984M337J0466N134N650p72O448O76j1071q756j9598
6881a613l459M641Q511j252M775O159m664M57P936M033m567k087l46J754m110
6866A6168L548L649k525m595l867p286j523j813K49n39L935O523p724q734K177
$$ plain form
6970 -334 2039 5940 12657 12358 4382 4029 583 3831 1188 -8340 -12665 3210 9511 7797 5662
6955 5662 1599 5683 4951 1045 3032 -681 -5377 924 11555 18474 19326 13664 9188 5713 202
6940 202 1626 4859 19462 14472 5118 5752 13532 9093 5901 8039 4398 2477 3013 5571 -940
6925 -940 2171 5751 3384 -2537 -822 3003 -409 -8613 766 10837 -250 731 591 -2875 2856
6910 2856 2490 573 -2001 7538 9075 5045 288 -2643 -5459 -12836 -209 14962 13083 6104 14267
6895 14267 20641 22636 8857 5873 10210 20676 25810 31460 30688 37136 37812 26741 17985 -1613
6881 -1613 -5072 -431 8080 6828 11603 17762 13098 13555 21491 25524 20957 18870 18524 20278 16168
6866 16168 19716 23365 20840 16245 12378 5092 3569 1756 2005 1466 5401 11924 4200 -4534 -2357
6851b357j40n58K242k691L694J3243m963j237l702m07k931p092N608R010N444
6836A3163K527k805M297j2813r922K20Q266L616K586M768j798k372k371K733k418
6821G677P51M633o910r182n243m617O235k954L003Q986P25j585K709J931m148
6806B011l084l53K408l980n298m825K133J0533P660j553J022m859n407j526n303
6791a0421N74L098L776J729M421K195L590m09o300m328m8J750L284n956p263L998
6775f310L980K415j844Q562J0553l752k68O131L044j1818m073l786K910J744j569
6760E919O82K989j390P80j936J931K152k063m03M486J252k105M406l065n812o352
6744A471m896m13P637O276r293p11l873p350j191O797L48J779N821M144o828l238
$$ plain form
6851 -2357 -2497 -3055 -813 -3504 190 13433 8470 7233 3531 3124 193 -6899 -1291 7719 13163
6836 13163 15690 12885 17182 4369 -5553 -5333 2933 6549 9135 13903 12105 9733 7362 10095 7677
6821 7677 8428 13061 6151 -3031 -8274 -12891 -6656 -9610 -6607 2379 3104 1519 4228 6159 2011
6806 2011 -1073 -1426 982 -2998 -8296 -13121 -10988 -455 7205 5652 6674 1815 -3592 -5118 -10421
6791 -10421 -9847 -6749 -2973 -1244 3177 5372 8962 8553 2253 -2075 -2123 -373 2911 -3045 -10308 -6310
6775 -6310 -2330 85 -1759 6803 17356 13604 13336 19467 22511 10693 6620 2834 5744 7488 5919
6760 5919 6601 9590 8200 8980 7044 8975 11127 9064 8661 13147 14399 12294 16700 13635 7823 1471
6744 1471 -3425 -3838 3799 10075 782 71 -3802 -11152 -12343 -5546 -5198 -3419 2402 6546 -282 -3520
6728c520j238J207J936K202k149K508J93k840r21M475K566k703o819M943P680
6713G520N482j531j837k951j472o362n732K195N03p706M202J2522L079j879k473
6698C560R415m295j0009o105o658L433P376O420k939N497l553m606Q7N834k710
6683G47j33k64j6402q91Q036K249L434O966k498n567N124O496kj556N89L64l889
$$ plain form
6728 -3520 -4758 -3551 -1615 587 -1562 946 1139 -1701 -2622 1853 4419 1716 -5103 -160 7520
6713 7520 13002 11471 9634 6683 5211 -1151 -6883 -4688 -4185 -11891 -7689 4833 7912 6033 3560
6698 3560 12975 8680 -1329 -7434 -14092 -10659 -3283 3137 198 5695 2142 -2464 -2377 3457 747
6683 747 614 350 -16052 -16943 -8907 -6658 -3224 3742 1244 -4323 801 7297 7295 5739 6328 6692 2803
$$ [...]
##END NTUPLES=NMR SPECTRUM
##END=
