##TITLE=Analysis number 326880
Compound Code cc 29416
Project Code adrs
Chemist Name endeavour
##JCAMPDX= 6.0         $$ Bruker NMR JCAMP-DX V2.0
##DATA TYPE= NMR SPECTRUM
##DATA CLASS= NTUPLES
##ORIGIN= Bruker BioSpin GmbH
##OWNER= nmr
$$ XWIN-NMR		Version 3.5
$$ Tue Feb 27 11:27:43 2007 GMT Standard Time (UT+0h)  MAYBRIDGE\nmr@NMR_250MHZ
##.OBSERVE FREQUENCY= 250.131544655141
##.OBSERVE NUCLEUS= ^1H
##.ACQUISITION MODE= SIMULTANEOUS (DQD)
##.ACQUISITION SCHEME= undefined
##.AVERAGES= 16
##.DIGITISER RES= 18
##SPECTROMETER/DATA SYSTEM= dpx250
##.PULSE SEQUENCE= zg30
##.SOLVENT NAME= CDCl3
##.SHIFT REFERENCE= (INTERNAL, CDCl3, 0, 16.522)
##AUDIT TRAIL= $$ (NUMBER, WHEN, WHO, WHERE, WHAT)
$$ ##TITLE= Audit trail, XWIN-NMR		Version 3.5
$$ ##JCAMPDX= 5.01
$$ ##ORIGIN= Bruker BioSpin GmbH
$$ ##OWNER= nmr
$$ C:\u/data/dgb/nmr/ADRS/2420/pdata/1/auditp.txt
$$ ##AUDIT TRAIL=  $$ (NUMBER, WHEN, WHO, WHERE, WHAT)
(   1,<2007-02-27 11:27:22.01 +000>,<MAYBRIDGE\nmr>,<NMR_250MHZ>,
      <created by zg, POWCHK disabled, PULCHK disabled
       configuration hash MD5:
       49 4B E0 1D 92 C2 6B 37 9F E6 65 BC 52 41 86 1D
       data hash MD5: 64K
       91 B6 37 C4 51 14 23 02 2E 81 40 1F EB 62 AF DA>)
(   2,<2007-02-27 11:27:35.56 +000>,<MAYBRIDGE\nmr>,<NMR_250MHZ>,
      <Start of raw data processing
       ef LB = 0.3 FT_mod = 6 PKNL = 1 SI = 32K 
       data hash MD5: 32K
       5B 14 47 5A D2 DB E0 E2 1C 87 F5 42 FD FD D9 6E>)
(   3,<2007-02-27 11:27:37.31 +000>,<MAYBRIDGE\nmr>,<NMR_250MHZ>,
      <apk 
       data hash MD5: 32K
       04 C0 44 D7 42 74 54 4D 71 6C 8D 87 7C 38 36 05>)
(   4,<2007-02-27 11:27:38.14 +000>,<MAYBRIDGE\nmr>,<NMR_250MHZ>,
      <abs ABSG = 5 
       data hash MD5: 32K
       9D 85 87 1C 3B 69 14 AD 92 5C D5 34 2C 43 93 2A>)
$$ ##END=
$$ 
$$ hash MD5
$$ 13 DE 52 26 FD 03 7C 46 1B 25 CE A6 BD DF 91 CE
##$RELAX= 
##$RELAX= 
##$RELAX= 
##$RELAX= 
##$RELAX= 
##$RELAX= 
##$RELAX= 
$$ Bruker specific parameters
$$ --------------------------
##$DU= <C:\u>
##$EXPNO= 2420
##$NAME= <ADRS>
##$PROCNO= 1
##$TYPE= <nmr>
##$USER= <dgb>
##$AMP= (0..31)
100 100 100 100 100 100 100 100 100 100 100 100 100 100 100 100 100 100 
100 100 100 100 100 100 100 100 100 100 100 100 100 100 
##$AQSEQ= 0
##$AQ_mod= 3
##$AUNM= <au_zg>
##$AUTOPOS= <40 >
##$BF1= 250.13
##$BF2= 250.13
##$BF3= 250.13
##$BF4= 250.13
##$BF5= 500.13
##$BF6= 500.13
##$BF7= 500.13
##$BF8= 500.13
##$BYTORDA= 1
##$CFDGTYP= 0
##$CFRGTYP= 5
##$CHEMSTR= <none>
##$CNST= (0..31)
1 1 145 1 1 1 1 1 1 1 1 1 1 1 1 1 1 1 1 1 1 1 1 1 1 1 1 1 1 1 1 1 
##$CPDPRG= <>
##$CPDPRG1= <>
##$CPDPRG2= <>
##$CPDPRG3= <>
##$CPDPRG4= <mlev>
##$CPDPRG5= <mlev>
##$CPDPRG6= <mlev>
##$CPDPRG7= <mlev>
##$CPDPRG8= <mlev>
##$CPDPRGB= <>
##$CPDPRGT= <>
##$D= (0..31)
0 1 0 0 0 0 0 0 0 0.06 0 0 0 0 0 0 0.0002 0 0 0 0 0 0 0 0 0 0 0 0 0 0 
0 
##$DATE= 1172575641
##$DBL= (0..7)
120 120 120 120 120 120 120 120 
##$DBP= (0..7)
150 150 150 150 150 150 150 150 
##$DBP07= 0
##$DBPNAM0= <>
##$DBPNAM1= <>
##$DBPNAM2= <>
$$ [...]
##$SUBNAM7= <"">
##$SUBNAM8= <"">
##$SUBNAM9= <"">
##$SW= 20.6930455092707
##$SWIBOX= (0..15)
0 0 3 0 0 0 0 0 0 0 0 0 0 0 0 0 
##$SW_h= 5175.983436853
##$TD= 65536
##$TD0= 1
##$TE= 295.16
##$TE2= 300
##$TE3= 300
##$TEG= 300
##$TL= (0..7)
0 120 120 120 120 120 120 120 
##$TP= (0..7)
150 150 150 150 150 150 150 150 
##$TP07= 0
##$TPNAME0= <>
##$TPNAME1= <>
##$TPNAME2= <>
##$TPNAME3= <>
##$TPNAME4= <>
##$TPNAME5= <>
##$TPNAME6= <>
##$TPNAME7= <>
##$TPOAL= (0..7)
0.5 0.5 0.5 0.5 0.5 0.5 0.5 0.5 
##$TPOFFS= (0..7)
0 0 0 0 0 0 0 0 
##$TUNHIN= 0
##$TUNHOUT= 0
##$TUNXOUT= 0
##$USERA1= <user>
##$USERA2= <user>
##$USERA3= <user>
##$USERA4= <user>
##$USERA5= <user>
##$V9= 5
##$VALIST= <valist>
##$VCLIST= <CCCCCCCCCCCCCCC>
##$VD= 0
##$VDLIST= <DDDDDDDDDDDDDDD>
##$VPLIST= <PPPPPPPPPPPPPPP>
##$VTLIST= <TTTTTTTTTTTTTTT>
##$WBST= 1024
##$WBSW= 4
##$XGAIN= (0..3)
0 0 0 0 
##$XL= 0
##$YL= 0
##$YMAX_a= 371148
##$YMIN_a= -420476
##$ZGOPTNS= <>
##$ZL1= 120
##$ZL2= 120
##$ZL3= 120
##$ZL4= 120
##$ABSF1= 16.522
##$ABSF2= -4.171173
##$ABSG= 5
##$ABSL= 3
##$ALPHA= 0
##$AQORDER= 0
##$ASSFAC= 0
##$ASSFACI= 0
##$ASSFACX= 0
##$ASSWID= 0
##$AUNMP= <proc_1d>
##$AZFE= 0.1
##$AZFW= 0.1
##$BCFW= 0
##$BC_mod= 0
##$BYTORDP= 0
##$COROFFS= 0
##$CY= 12.5
##$DATMOD= 1
##$DC= 0
##$DFILT= <>
##$DTYPP= 0
##$F1P= 14.0000005364418
##$F2P= -0.99999901652339
##$FCOR= 0.5
##$FTSIZE= 32768
##$FT_mod= 6
##$GAMMA= 0
##$GB= 0
##$INTBC= 1
##$INTSCL= 1
##$ISEN= 128
##$LB= 0.3
##$LEV0= 0
##$LPBIN= 0
##$MAXI= 10000
##$MC2= 0
##$MEAN= 0
##$ME_mod= 0
##$MI= 0
##$NCOEF= 0
##$NC_proc= -4
##$NLEV= 6
##$NOISF1= 0
##$NOISF2= 0
##$NSP= 0
##$NTH_PI= 0
##$NZP= 0
##$OFFSET= 16.522
##$PC= 1
##$PHC0= 228.135
##$PHC1= 10.59295
##$PH_mod= 1
##$PKNL= yes
##$PPARMOD= 0
##$PSCAL= 4
##$PSIGN= 0
##$REVERSE= no
##$SF= 250.13
##$SI= 32768
##$SIGF1= 0
##$SIGF2= 0
##$SINO= 400
##$SIOLD= 32768
##$SREGLST= <1H.CDCl3>
##$SSB= 0
##$STSI= 32768
##$STSR= 0
##$SW_p= 5175.98343685301
##$SYMM= 0
##$S_DEV= 0
##$TDeff= 65536
##$TDoff= 0
##$TI= <Analysis number 999999
Compound Code 99
Book Reference 9
Project Code 9>
##$TILT= no
##$TM1= 0
##$TM2= 0
##$TOPLEV= 0
##$USERP1= <user>
##$USERP2= <user>
##$USERP3= <user>
##$USERP4= <user>
##$USERP5= <user>
##$WDW= 1
##$XDIM= 32768
##$YMAX_p= 336655207
##$YMIN_p= -329894
$$ End of Bruker specific parameters
$$ ---------------------------------
##NTUPLES= NMR SPECTRUM
##VAR_NAME=  FREQUENCY,     SPECTRUM/REAL,   SPECTRUM/IMAG
##SYMBOL=    X,             R,               I
##VAR_TYPE=  INDEPENDENT,   DEPENDENT,       DEPENDENT
##VAR_FORM=  AFFN,          ASDF,            ASDF
##VAR_DIM=   32768,         32768,           32768
##UNITS=     HZ,            ARBITRARY UNITS, ARBITRARY UNITS
##FACTOR=    0.157963299565203, 1,           1
##FIRST=     4132.6476996994, 0,             0
##LAST=      -1043.33573715361, 0,           0
##MIN=       -1043.33573715361, -329894,     0
##MAX=       4132.6476996994, 336655207,     0
$$ Real data points
##PAGE= N=1
##DATA TABLE= (X++(R..R)), XYDATA
$$ [...]
23876D8209p3056n5808n952r854J00336Q6236p5627n3228j5812p125N990O3681
23864G990J6429L7244p6391k6576P3812o128k7504N0345k5814j02919l8985R6120
23852b2377L5734J3169n2127k1955l0359J4238L2106q571J0147q199L1717J3948
23840G471l4767m163K6623M51m9017k9456O3080k7770n5583N724q916K5519n3324
23827a34128p1785M6453O8561O0689N1827J9428p0277m0781n562l2966R8386K3687
23815A3532r474O6467o5395q3266Q0818M1840n5985q5867j35706J2119l32m675
23803b25924M3269J17269J18458k4037m1817O6255k8605j2129n2140O1029K9427
23792E1055m1516k8910m1117M1878J05197J0669K1909q4431o4243n0986m0829
$$ plain form
23876 48209 -24847 -80655 -86607 -96461 3875 90111 14484 -38744 -54556 -61681 -55691 7990
23864 7990 24419 61663 -14728 -41304 32508 26380 -1124 49221 23407 -79512 -118497 -22377
23852 -22377 13357 26526 -25601 -47556 -77915 -63677 -31571 -40142 -29995 -38194 -6477 7471
23840 7471 -27296 -31459 -4836 -4385 -53402 -82858 -19778 -47548 -103131 -97407 -106323 -80804 -134128
23827 -134128 -205913 -159460 -90899 -30210 21617 41045 -29232 -70013 -75575 -108541 -10155 13532
23815 13532 4058 70525 5130 -78136 2682 44522 -11463 -97330 -233036 -220917 -221249 -225924
23803 -225924 -182655 -65386 53072 29035 -12782 53473 24868 12739 -39401 21628 51055
23792 51055 9539 -19371 -60488 -18610 86587 97256 119165 34734 -29509 -80495 -121324
23781a21324o682J0226N2631J09032k7182r010k1607l6368m0504k0895j7732M492
23769a24923j6094M298J14298J11039k2297m5903J3042J1235o0177l5808K4653
23758b6637m6459J0438M8140M4642J2510m449l1683n4145L5149P9673j1846n3753
23746A580L2363p587n2480m5653J2301l1777k0396N9933J09282k3469m065M655
23734C4687n602P577q783J6409K1275P1073k184j08269J666m2217k0958K4578
23722a0748N232K150J358J00323P6125o1670j42741q7824K4809m5225L1368Q2173
23710b4670N2321Q8744N69n6489n8641l6292J7851J0432O5355L4549K9934j60010
23698c6347r1456l5127P1920P9961J2580O1103O0992m760p5125J6413k600j3328
$$ plain form
23781 -121324 -128006 -117780 -65149 43883 16701 7691 -13916 -50284 -90788 -111683 -129415 -124923
23769 -124923 -141017 -136719 -22421 88618 66321 20418 33460 44695 -15482 -51290 -26637
23758 -26637 -73096 -62658 -14518 30124 42634 38185 6502 -47643 -12494 67179 55333 1580
23746 1580 33943 26356 -26124 -71777 -59476 -91253 -111649 -51716 57566 34097 30032 34687
23734 34687 29085 36662 27879 44288 65563 136636 134452 26183 27849 -14368 -35326 -10748
23722 -10748 -5516 -3366 -2008 98315 174440 112770 -29971 -117795 -92986 -138211 -106843 -24670
23710 -24670 27651 116395 116964 60475 1834 -34458 -16607 -6175 59180 93729 123663 -36347
23698 -36347 -127803 -162930 -91010 -11049 1531 62634 123626 118866 43741 60154 57554 44226
23686D4226o0293N9907n8574k1213j7787o545L9019M6514m8883n9022l695N8297
23674b8049P919O60M2219N5464m8162l3838l9189J486K48L1441Q2743K8952o9958
23661C1936m210J9870q981j7000q9961j1787J5299l1512p7087n3161O4717R9376
23649f2501O2752m0712k6243M0459j1955L6506L4674j8294M6533j1129r7643m6837
23637i4390L4540J9860R112L9532j8014J6191M9745k2736k1076O9636j1055L4268
23625A05613n3878n4599l2087j2012l0087p3787K7454O632m451j5806Q7495K7794
23613b1719k471Q5793j5290P33O9434n5881o4916r3675J19622L9431J2832L090
23601G6983l4641m4031K5306Q9205q3121j65178n9732M3838J19148M798n3374
$$ plain form
23686 44226 -16067 43840 -14734 -35947 -53734 -60279 -21260 25254 -23629 -82651 -86346 -28049
23674 -28049 -20130 -19470 22749 78213 30051 -3787 -42976 -41490 -41242 -9801 72942 101894 31936
23661 31936 27726 47596 38615 21615 -68346 -80133 -64834 -96346 -173433 -226594 -161877 -62501
23649 -62501 251 -40461 -66704 -26245 -38200 -1694 32980 14686 61219 50090 -47553 -94390
23637 -94390 -59850 -39990 -30878 8654 -9360 6831 56576 33840 12764 82400 71345 105613
23625 105613 51735 -2864 -34951 -46963 -77050 -150837 -123383 -116751 -121202 -137008 -49513 -21719
23613 -21719 -24190 61603 46313 47046 116480 60599 -4317 -97992 21630 61061 73893 76983
23601 76983 42342 -1689 23617 112822 29701 -135477 -195209 -151371 -32223 -27425 -80799
23590h0799J5258L4993J00309k4540n0274j6942M527m153k2876K1991k1312k9658
23578g3476j16151j6622J02803J8722L2665J033L1477L0871n766j19098J0422
23567a03120N8067J7364J58j8866P462M9732k6977p085j423M8480m7110m6335
23555f9653l828O3P240o7118j056L6717P7886r712m040K9417n613l4393j8944
23542f3034M8579j7902J8524J3014P0349O8992l6964m8618n6374o4228K7339O921
23530c3402n7774P8415l0499j7076Q0276m213o3260L3270Q0417m7262m7122n8859
23518h7089j214j6748P3619k6929R83R2371K7608q0587L3258j10622j4730R1309
23506a8771L1013o1170k2871J3654L3534L4371r422L0733M9502k1995m4823L7478
$$ plain form
23590 -80799 -65541 -30548 69761 45221 -5053 -21995 -17468 -21621 -44497 -22506 -43818 -73476
23578 -73476 -189627 -206249 -103446 -84724 -52059 -51026 -19549 11322 5556 -113542 -103120
23567 -103120 -45053 -27689 -27531 -46397 -38935 10797 -16180 -23265 -24688 23792 -23318 -69653
23555 -69653 -73481 -73418 -66178 -133296 -134352 -97635 -19749 -29461 -33501 -4084 -9697 -44090 -63034
23542 -63034 -14455 -32357 -13833 -819 69530 138522 101558 52940 -3434 -67662 -40323 -33402
23530 -33402 -91176 -12761 -43260 -60336 19940 15727 -47533 -14263 66154 18892 -28230 -87089
23518 -87089 -88303 -105051 -31432 -58361 -57378 34993 62601 -17986 15272 -95350 -110080 -18771
23506 -18771 12242 -48928 -71799 -58145 -24611 9760 338 31071 80573 58578 13755 51233
23494E1233N835j887O9872L5186J3630o9534j13294j6088j8018M0957l5532p2855
23482a10495K6749K1526M705M3957M2758n0486K1214J29564J3145K2085o2563
23471A02159j6114p223m2475n6059k9493p5925j2182M3091M3583R9800J2888j23310
23459f1260j27671m0455M2417R9033N3850n182N168R2684L4015p4018o8943m7171
23447i7533n148j1660k4672p550K5593J0201M7790N9286k0810J7966N5764M0680
23435H9907l5714j09408l458l6398N4002J26656M5168K4539k4453m5041j60427
23424g4627K8533P5333N8686k4653l706K4599r8889j6437l1614J6632O4031p770
23412A0118p9809j3458J1116N1733L0886k1731N0438M8386j8427q5495l3386K2471
$$ plain form
23494 51233 57068 55181 125053 160239 173869 104335 -8959 -25047 -43065 -2108 -37640 -110495
23482 -110495 -83746 -62220 -57515 -13558 29200 -21286 -72 129492 142637 164722 102159
23471 102159 86045 78822 36347 -19712 -49205 -125130 -137312 -94221 -50638 49162 62050 -61260
23459 -61260 -188931 -229386 -186969 -87936 -34086 -39268 -34100 58584 92599 18581 -50362 -97533
23447 -97533 -102681 -114341 -139013 -146563 -120970 -110769 -62979 -3693 -24503 -6537 49227 89907
23435 89907 54193 -55215 -58673 -95071 -41069 85587 130755 155294 130841 85800 -74627
23424 -74627 -46094 29239 87925 63272 59566 84165 -14724 -31161 -62775 -46143 17888 10118
23412 10118 -69691 -83149 -72033 -20300 10586 -11145 39293 87679 69252 -16243 -49629 -27158
23400b7158P6824O2681n9065l5926J7778J2042J3410l6782o398k086k214p3228
23388f0122n1101M5634R7880j26120j11563N4082O4592M4671K3465k2971R483
23377c2070n5939k6766k2678L4952O1850R112k6807L0873N9967m7786k3835m2000
23365h1127K8675N5309J14736J9856p5632n3738J891J5739j450K0453J14N3914
23353I8740j8732j39249J5826j7097j3182q3965m7906K6338O3223J12943l5386
23342c8447p8254p9609r782L7544J18881P0800N3373m3330l9157k8773M8986N0716
23330F2948k7339q90J0658j10518p5502K1202Q4601O1938R96j5505J6840R532
23318C8961j1630k094Q4110J3040j01980p9097j7337N775L5851r6296n2447R3941
$$ plain form
23400 -27158 49666 112347 53282 17356 35134 47176 60586 23804 17406 15320 13106 -60122
23388 -60122 -111223 -65589 32291 -93829 -205392 -151310 -86718 -42047 -18582 -41553 -32070
23377 -32070 -88009 -114775 -137453 -102501 -40651 -31539 -58346 -27473 32494 -15292 -39127 -81127
23365 -81127 -52452 2857 117593 137449 61817 8079 9970 25709 24259 44712 44826 98740
23353 98740 80008 -59241 -43415 -60512 -73694 -157659 -205565 -179227 -116004 -3061 -38447
23342 -38447 -116701 -196310 -206092 -168548 -49667 21133 74506 31176 -7981 -36754 12232 62948
23330 62948 35609 34719 45377 -65141 -140643 -119441 -34840 27098 28094 12589 29429 38961
23318 38961 27331 25237 109347 122387 20407 -58690 -76027 -70252 -34401 -130697 -183144 -89203
23306h9203O2899K1184J9498p9225j39222J7583R4540J4387o4045n4958k0182
23295b16744m9742J9593J39657L7060K4327P7865J8356q3569q2798K9661J06306
23284A9972K416q8380n9480K9042L5991J1722Q0231L397n5988K2586M8901K317
23272E2727O993o6489N72M3996L9482p4039L8955l7287o1936l7272P574K1815
23260f4909N4359n7698m5402J9607O6959O1097P2029q240j06120m8822n4326M2098
23248f9368L3672j3790O3865n3173m4382K6498m8683K1112N0869j5670L215O419
23236c9416j3213K0884K5762q451N0051L9482m7311q7004K2703j0050k7999L5026
23224c9536K9865r689m9995k5470K3737k842j9680P0871O2938n0068k8776L9704
$$ plain form
23306 -89203 -26304 -5120 14378 -64847 -204069 -186486 -91946 -77559 -141604 -196562 -216744
23295 -216744 -266486 -246893 -107236 -70176 -45849 32016 50372 -33197 -115995 -86334 19972
23284 19972 22388 -65992 -125472 -96430 -60439 -48717 31514 34911 -21077 1509 50410 52727
23272 52727 59720 -6769 -6197 37799 77281 3242 42197 4910 -57026 -94298 -86724 -64909
23260 -64909 -10550 -68248 -113650 -94043 -27084 34013 106042 97802 -8318 -57140 -111466 -69368
23248 -69368 -35696 -49486 14379 -38794 -83176 -56678 -105361 -84249 -33380 -49050 -45835 -39416
23236 -39416 -52629 -31745 -5983 -14434 35617 75099 27788 -59216 -36513 -46563 -74562 -39536
23224 -39536 -9671 -19360 -69355 -94825 -71088 -73930 -93610 -22739 40199 -9869 -38645 1059
23212A059j4772j9492j2248m295j9369N6777K7344j6582k5292o2022J3576M4918
23200c0398Q655N7363m0646n5862J16958K0501J8408J24n965k1976j9834J9304
23188F6632L6474j6775K7043M64j05540k6179K8071r119p7107o609J768K0453
23176f0424j0647k6890k6538R3994P5409J18167P4884j15767M557M4008m558r8558
23164F7637j30785k6599L238J2293P7632N8546o2211n5699l3636O899M1040L3239
23152h406o6586M4933m0358P057J05521j6187L6714l9510q4271q5835j8949M6713
23140a19164J743J05702N8688L8995m2885l1670Q8762j38583n4328J15288o6409
23129d3861k6429J9146K5548N498L6801P1287J3168m1590j4941L5924j0406l2109
$$ plain form
23212 1059 -13713 -33205 -45453 -49748 -69117 -12340 15004 -1578 -26870 -88892 -75316 -30398
23200 -30398 -21743 35620 -5026 -60888 56070 76571 94979 95103 89138 67162 47328 66632
23188 66632 103106 86331 113374 113838 8298 -17881 10190 1071 -76036 -82645 -80877 -60424
23176 -60424 -71071 -97961 -124499 -30505 44904 163071 237955 122188 126745 170753 166195 67637
23164 67637 -63148 -89747 -86509 -74216 3416 61962 -249 -55948 -89584 -82685 -41645 -8406
23152 -8406 -74992 -30059 -70417 -63360 42161 25974 62688 23178 -61093 -146928 -165877 -119164
23140 -119164 -117421 -11719 46969 85964 43079 11409 100171 -38412 -92740 22548 -43861
23129 -43861 -70290 -51144 -25596 -20098 16703 87990 101158 59568 44627 80551 70145 38036
23117C8036o6344r3791K0429O044M5415O280J5990K0270m7524n8635L8118M5120
23105c0592j9573N4809l7698l8025J2785N5895p1199k4768N4824N9797N1222l4479
23093C2998k0211l0535K1737N8696r3667m1310J6767r763J3907J8509l8101K4727
23081d6246J00426Q7451J2449j54745l6310J5388N2922l4262k0023j7837m4796
23070h5583K2191Q8472q3208m9591M0538L9238o301J1690l8494M5922L0984N6416
23058G2274M0283j0519m6536l1364J8030J7227l1267l4347l3526P2405M6428q2549
23046c461m0809K7710k0420K0M110j8274L7094O1312o0156L9072Q4568r583r169
23033I2014n1673m7393q4650K3722l4677O3175P7361K9107K7110n5541o0529l4419
$$ plain form
23117 38036 -28308 -122099 -101670 -95626 -50211 -43931 -27941 -7671 -55195 -113830 -75712 -30592
23105 -30592 -50165 4644 -33054 -71079 -58294 -2399 -73598 -98366 -43542 16255 67477 32998
23093 32998 12787 -17748 3989 62685 -30982 -72292 -55525 -65288 -51381 -32872 -70973 -46246
23081 -46246 54180 141631 154080 -665 -36975 -21587 31335 -2927 -22950 -40787 -85583
23070 -85583 -63392 25080 -58128 -107719 -67181 -27943 -34244 -22554 -61048 -15126 15858 72274
23058 72274 112557 102038 55502 24138 42168 59395 28128 -6219 -39745 32660 79088 -3461
23046 -3461 -44270 -16560 -36980 -36960 -32850 -51124 -14030 47282 -12874 26198 110766 101183 92014
23033 92014 40341 -7052 -91702 -67980 -102657 -39482 37879 66986 94096 38555 -21974 -56393
23021e6393Q1079J0033J653L3229j4399J3042n9286m8076j6209j1686O7199N0520
23009E0706O5106k2238p0182L8757l1517k6740l0607n1167P5262M9163l3747q6226
22997g3430l3916O8938R7821K9289p7138j704j486j9674Q0169M1948p3472o5197
22985b7852j2287L7501q5261J3900j816n8835Q711J12632O2376l2973o327J1953
22973B1722J7431o759p9548k2150m2320L146N9607o920J9001J3715J9814m3602
22961d6863l9033o67J00002R5811k967K8796p4744j14972L178p8582j2904N1877
22949i1068n5644M5314L1232J05006m9356n0791O5833L5804J1775k2002o00K3007
22937D8510n048m031m705k1273l6007K3980n00k1996j8642J9526P8132M0706J2087
$$ plain form
23021 -56393 24686 34719 36372 69601 55202 68244 8958 -39118 -55327 -67013 186 50706
23009 50706 115812 93574 23392 62149 30632 3892 -26715 -77882 -2620 46543 12796 -73430
22997 -73430 -107346 -38408 59413 88702 11564 9860 8374 -11300 68869 110817 37345 -27852
22985 -27852 -40139 -2638 -87899 -73999 -75815 -134650 -125939 -13307 49069 16096 9769 21722
22973 21722 39153 32394 -47154 -69304 -111624 -108478 -48871 -55791 -36790 -23075 -3261 -46863
22961 -46863 -85896 -86563 13439 109250 106283 135079 60335 -54637 -51459 -130041 -142945 -91068
22949 -91068 -146712 -101398 -70166 34840 -14516 -65307 526 36330 48105 26103 25503 48510
22937 48510 43462 39431 34726 13453 -22554 1426 926 -21070 -39712 -20186 57946 98652 110739
22924A10739p4512j06791l14N4218N8959j4772l2283K0372k971j6778l5357K2839
22912a6651J0873n217N6492L7309q1477M1275O7242m4227q0094n2056q2562J35750
22900a3343R4467o1343n5261P5264l4695J2792P568j627k6189k1483M185J09303
22888H9638M308n9928l0596k1680L9013R5513l6102k9913m6616L1509k1909j8599
22876e362K7429l5705M1508J782n2085q5810K4879N7723R7584o1685M5730L7344
22864I3332J300K4601Q705m5118l8097r767M2984k8486l8087m7157k7675O957
22852e6508N0639K8134j3910M7361k7445k8038J9063K9553q359J9825l2734r621
22840A7960L4217K4560q640l2198n1013KP0714O4089n5887q2502K0992P9445K2478
$$ plain form
22924 110739 36227 -70564 -70878 -16660 42299 27527 -4756 15616 12645 -4133 -39490 -16651
22912 -16651 -5778 -10995 45497 82806 1329 42604 109846 65619 -14475 -66531 -149093 -13343
22900 -13343 81124 19781 -35480 39784 5089 17881 25449 23822 -2367 -23850 -19665 89638
22888 89638 93946 34018 3422 -18258 20755 116268 80166 50253 3637 35146 13237 -5362
22876 -5362 22067 -13638 27870 29652 -22433 -108243 -83364 -25641 71943 10258 55988 93332
22864 93332 94632 119233 127938 82820 44723 34956 77940 49454 11367 -35790 -63465 -56508
22852 -56508 -5869 22265 8355 55716 28271 233 19296 48849 40490 60315 27581 17960
22840 17960 52177 76737 68097 35899 -15114 -15112 55602 119691 63804 -18698 2294 81739 104217
22827A04217L4071k9251k4j0612J4353M1069q8555m1996m3428q0732K9189R9593
22815B7894N4101L2753m3382M0062N219l7504J5976m425j984n046p6074j03861
22803i6271k582M9646K9159L4744L788k7060m093K5144r3248M403J2372m0836
22791a04834n629J07060m4459j21756M4576k5905O1084Q4649p2053J2864Q1890
22780A7487j7645K4492j733N4552r1043r0449J3352k847n2449J00599J27438O2902
22768A44656J1942k2735k3622r2872j03257M9602l1425P3598p5369J7927o7659
22757a19214l4174Q9458O6360J4975m7202q454L1086J4157k4116l9188K8780j7196
22745d4728j20505Q1496n0833k1622O646p1993O2936J5439k991m5720J5300P6270
$$ plain form
22827 104217 138288 109037 109013 98401 112754 153823 65268 23272 -20156 -100888 -71699 27894
22815 27894 81995 114748 71366 111428 116647 79143 95119 90694 88710 83664 7590 -96271
22803 -96271 -98853 -49207 -20048 14696 18484 -8576 -12669 12475 -80773 -76370 -63998 -104834
22791 -104834 -110463 -3403 -47862 -169618 -125042 -150947 -89863 -5214 -77267 -64403 17487
22780 17487 -158 24334 22601 77153 -13890 -104339 -90987 -93834 -146283 -45684 81754 144656
22768 144656 156598 133863 110241 17369 -85888 -36286 -67711 5887 -69482 -51555 -119214
22757 -119214 -153388 -63930 2430 17405 -29797 -38251 -7165 6992 -17124 -56312 -27532 -44728
22745 -44728 -165233 -83737 -134570 -156192 -149546 -221539 -158603 -143164 -146155 -191875 -176575 -100305
22733a00305K381O3628J7738K5398m4500J9353k8355o5766P5800l1638l5506K1535
22721h0237R3049M76l6179O683k6036l2670o585n777N256j8265O3682Q0088O8393
22708A11878k7827n5630j08615k1887N6789L0549k5546j1933L9843L2962k5450
22697d867J6951m0580l5267o8782K6206N3915j65j4953m1205P4481L7003j2375
22685i638n5666r9907N8858O9985J10096M6722l2444L8690k6346j11917j8753
22674c0320m4987J9073L5383L5583K077N163K9242K9598m1791k989k2071L2622
22662D6583j3445p6613q0069P0954j2138q9769Q246M0613k251o1802Q2106J07317
22650A9732L5032j45242k4072N7421m0470L5455m618Q182n6797n7952Q1090j2290
$$ plain form
22733 -100305 -97924 -34296 -16558 8840 -35660 -16307 -44662 -110428 -34628 -66266 -101772 -80237
22721 -80237 12812 13288 -22891 -16208 -42244 -74914 -81499 -87276 -82020 -100285 -36603 43485 111878
22708 111878 84051 28421 -80194 -102081 -45292 -14743 -40289 -52222 -12379 20583 -4867
22697 -4867 12084 -28496 -63763 -132545 -106339 -52424 -52589 -67542 -108747 -34266 2737 -9638
22685 -9638 -65304 -165211 -106353 -36368 73728 120450 88006 126696 100350 -11567 -30320
22674 -30320 -75307 -56234 -20851 14732 16809 21972 51214 80812 39021 36032 13961 46583
22662 46583 33138 -43475 -123544 -52590 -64728 -154497 -146251 -105638 -107889 -169691 -87585 19732
22650 19732 54764 -90478 -114550 -57129 -97599 -62144 -66762 -58580 -115377 -173329 -92239 -104529
22638a04529O5912P3154o3987r0313l2626L2185K7176m820M0310Q6234Q8455n0219
22626F6932p1718j6802M7271p0738n4556J07531P6915j4632m6560l9669m3506
22615e9532Q5693J20450K5010n5024j02200P969J06969m2019p5749m6436K5010
22604i859k4701j08063M7425R8152K191M035N2022j1880J464M2310l5815l3131
22592B4150n9834p5966J6161R5077K8095q1309K6846L0127k5311l2875l9748O7567
22580b7020L074K403N5920J6038k975q906n8136R840M8839j0941n4923k9612m134
22567f0533k7443P4860K6526p8279k5425L1591R566M520M8489K5288N3713N6276
22555A39149l0012q5334n7393l7897q85N1238j8867m5896J32083P1397j01024
$$ plain form
22638 -104529 -38617 34537 -29450 -119763 -152389 -120204 -93028 -97848 -57538 28696 117151 66932
22626 66932 -4786 -21588 25683 -45055 -99611 7920 84835 70203 23643 -16026 -59532
22615 -59532 26161 146611 171621 116597 14397 22366 129335 87316 11567 -34869 -9859
22604 -9859 -34560 -142623 -95198 2954 5145 9180 61202 49322 50786 93096 57281 24150
22592 24150 -35684 -111650 -95489 -412 27683 -53626 -26780 3347 -21964 -54839 -94587 -27020
22580 -27020 -23946 -21543 34377 50415 47440 38534 -19602 -9762 39077 28136 -26787 -56399 -60533
22567 -60533 -87976 -13116 13410 -64869 -90294 -58703 -49137 -44617 3872 29160 82873 139149
22555 139149 109137 23803 -33590 -71487 -72372 -21134 -40001 -85897 46186 117583 16559
22544A6559j0277O4034Q0269q0476j53043r1596l5272q783N1568J10150M2545
22533a4322o916m5936l0790O5015M9819m9214r4165L1589l0734J5557M4307L0381
22521c5409J724j9325K0218L7529J6423M382l0227j02506k3450L7745J50400O5082
22509A22586j9510r8852k6036K9320k6226J5142J7875J628K0205R8900l1016l6832
22497F7184m0846j4759j4887l8089j7520N4025J1069j563j8403k3638K209O0373
22485B5155o3882Q285M9011M753j7612k993l7381O472R4102N6316q0156j14070
22473g2000L023r317M560j3142k3024j8388Q5363L1956l0883L2040L6007J7499
22461D3694q2091n8391Q312L4185J18146P7373q5993q8314L6001K2539K6268l6661
$$ plain form
22544 16559 6282 70316 150585 70109 -82934 -174530 -209802 -218585 -167017 -56867 -14322
22533 -14322 -21238 -67174 -97964 -32949 16870 -32344 -126509 -94920 -125654 -110097 -65790 -35409
22521 -35409 -33685 -53010 -32792 4737 21160 25542 -4685 -107191 -130641 -92896 57504 122586
22509 122586 103076 4224 -21812 7508 -18718 -3576 14299 15927 36132 135032 104016 67184
22497 67184 26338 11579 -3308 -41397 -58917 -4892 6177 4614 -13789 -37427 -35218 25155
22485 25155 -38727 -30442 18569 23322 5710 2717 -34664 -28192 65910 122226 42070 -72000
22473 -72000 -68977 -78294 -73734 -86876 -109900 -128288 -42925 -10969 -41852 -9812 26195 43694
22461 43694 -38397 -96788 -88476 -54291 63855 141228 55235 -33079 2922 25461 51729 15068
22449A5068K8047j557K8031l3157n1408m4066K7518J8859M4925R168j22815o0880
22437a42267M9858r418M5859L5486r558j8508k680m181q5217q7868K2231M4796
22425a61467N8947K9849r0212n6943J7345L8988k7115M2506O3312n9303L9111
22414a04982M1621j8120P1013j605k3934O503N2995j7509m5271j6227J6806M3697
22402D987R2887L5852j04996r7467j3235l479J1248M2417M0797p0384p6687J43192
22390E132M0252m0292k4713l7883l4272P0459M7839j9920n2352M5142j8441k0584
22378c9633k811J32231M8820r5248m3270P7743k5237p061J0354n4068K060p1999
22366f8119K1698P7405O9572l9199J1870J4374k4212j02087l0974k6909q974m353
$$ plain form
22449 15068 43115 41558 69589 36432 -14976 -59042 -31524 -12665 32260 41428 -81387 -142267
22437 -142267 -92409 -101827 -55968 -20482 -30040 -48548 -51228 -55409 -140626 -228494 -206263 -161467
22425 -161467 -102520 -72671 -162883 -219826 -202481 -163493 -190608 -148102 -84790 -144093 -104982
22414 -104982 -63361 -81481 -10468 -12073 -36007 -29504 23491 5982 -39289 -55516 -38710 4987
22402 4987 97874 133726 28730 -68737 -81972 -85451 -74203 -31786 9011 -61373 -138060 5132
22390 5132 45384 5092 -19621 -57504 -91776 -21317 26522 6602 -45750 -608 -19049 -39633
22378 -39633 -42444 89787 138607 43359 89 77832 52595 45534 55888 1820 3880 -68119
22366 -68119 -46421 30984 100556 61357 73227 87601 63389 -38698 -69672 -96581 -105555 -109908
22354a09908K3210j9312j1852R9518j4105m180K1685j1125l612l6916M936J4698
22342d6963M5048k9473n4941N7427j1310q4772J3115J8306K9710L8817P4300o8609
22330a9345m9594k8312K8781M3126J10376K5329o3432p2252k7498j2877p719l570
22318g6987N0789J05914J1019J6282j3213k6373n3032j7726J10713M3012l470
22307A46928M110L7012k3081r9446K123J0211M3914N9773l2566q3976m1025m5677
22295b1700n4048P1403J32715l9335K2546L4899j52801o3933P273k8070Q9010
22284b041j5196L7844L2431L3088M2973q9366j28040J08400J14991o6862q6755
22273a8533p0630O3378K0263P143K8845j7399j5618k920M1750m0755l1690J7456
$$ plain form
22354 -109908 -86698 -106010 -117862 -18344 -32449 -36629 -14944 -26069 -29681 -66597 -61661 -46963
22342 -46963 -1915 -31388 -86329 -28902 -40212 -124984 -111869 -93563 -63853 -25036 49264 -19345
22330 -19345 -68939 -97251 -68470 -25344 85032 110361 46929 -25323 -52821 -65698 -73417 -76987
22318 -76987 -26198 79716 90735 107017 93804 67431 14399 -3327 107386 150398 146928
22307 146928 151038 188050 164969 65523 67646 77857 121771 181544 148978 65002 23977 -21700
22295 -21700 -75748 -4345 128370 89035 111581 146480 -6321 -70254 -62981 -91051 -2041
22284 -2041 -17237 20607 53038 86126 129099 39733 -88307 20093 135084 68222 -18533
22273 -18533 -89163 -25785 -5522 1621 30466 13067 -2551 -5471 36279 -4476 -36166 -18710
22261a8710n9479j0663K6126M4499N0579j8334n2849L0793K8919P6873j2028q7899
22249b173j5465N6603K2409J8454O013l9375j04206M0476K5547n0358p8162K9814
22237i0423N7402M2351o7928p3062K5067J6687p722k146J3128J6334J5767m1719
22225i6264K0081O2588P4638p7494n7679O4467M2373q2716O5576O0265J4285k6161
22213F3959J4996M8134l6957m6554k6855n8021o1663M5182L2913J00171k126J651
22201G4830j18608k2266K0650M1712j0847m954K5387M0367L981o5120J7047L463
22189E642n6809r5722J1598J06121j5364j8443R1536K8994p4256k9056n261M594
22177d6426l423N0040m262L8785j9450N6360J15366L901k9234o4869m055n0827
$$ plain form
22261 -18710 -78189 -88852 -62726 -18227 32352 14018 -38831 -8038 20881 97754 85726 -2173
22249 -2173 -17638 38965 61374 79828 85841 46466 -57740 -17264 8283 -42075 -120237 -90423
22237 -90423 -33021 9330 -58598 -131660 -106593 -89906 -97628 -99774 -86646 -70312 -54545 -96264
22225 -96264 -76183 -13595 61043 -16451 -74130 -9663 32710 -50006 15570 75835 90120 63959
22213 63959 78955 127089 90132 43578 16723 -41298 -102961 -57779 -24866 75305 73179 74830
22201 74830 -43778 -66044 -45394 -3682 -14529 -19483 5904 46271 50252 -14868 2179 5642
22189 5642 -51167 -146889 -135291 -29170 -44534 -62977 28559 57553 -16703 -45759 -51020 -46426
22177 -46426 -49849 191 -4071 34714 15264 71624 186990 190891 161657 96788 92733 41906
22165D1906l0908K1219l2083k8223k5074K7919k6660Q5587L242l6934j469M8458
22153D6980n495l137J4004q2707k9704L5854K9587m224J2529J6876K1846q5920
22141c3511K8922k2165O2913O7700M4095n3536m0334K5857J6183j7923j07499
22130b9298r1663J8538N652P197L9321J0138O9636J8616L8580k8790m9006j61901
22118a52980j7025j8988k4274P9621K18481L5653j8832p1744n2867j8903l4238
22107g6096J2658n1901K9293j0161P1762P0833j5274q606J6623k2916q5195K1
22095f8959M194k3158k4213J8924J2949k131N3654N8529L8551q4486m2653q3135
22083a41934K2117O1828M0906K3859L1786L5927j5653k9657m9391n0010k8546
$$ plain form
22165 41906 10998 32217 134 -28089 -53163 -25244 -51904 33683 36925 -9 -1478 46980
22153 46980 41485 38348 52352 -30355 -60059 -24205 5382 1158 13687 30563 52409 -33511
22141 -33511 -4589 -26754 36159 103859 147954 94418 54084 79941 96124 78201 -29298
22130 -29298 -120961 -102423 -96771 -89574 -50253 -40115 29521 48137 86717 57927 8921 -152980
22118 -152980 -170005 -188993 -213267 -133646 84835 120488 101656 29912 -22955 -41858 -76096
22107 -76096 -63438 -115339 -86046 -96207 -24445 46388 31114 22508 39131 16215 -68980 -68959
22095 -68959 -64765 -87923 -112136 -93212 -80263 -82394 -28740 29789 68340 -16146 -58799 -141934
22083 -141934 -119817 -57989 -17083 6776 38562 74489 58836 29179 -20212 -70222 -98768
22072i8768J20897J28821j4828j14091j19768J6524k2592j03914n070K9597Q5899
22061i7293O3664m657k9950M5593J7000K168k0555J8544K2268l9621m5241K5118
22049d2962L5696J00075Q06K6577q4178j8752o9503m2322N3322M6057j0310l6358
22037d1852q3203O580m368L1041R4842l5633L1907n6036R613j4594K1537J8073
22025b2093q6842K0076N4941R9812J2053o4531K5137n0055p0537K7471R6976N6921
22013I9329m024m8016K0312j1045r7016j7015K3193N9570j1355l0511o2630k9699
22001a08907Q4583q301L6581N7138K1339L5158j18511j35773k9238N3532j9272
21990a31671J9000N4196q203m8837L3713j6585J7948p3182m791M8460o336M9583
$$ plain form
22072 -98768 22129 150950 136122 22031 -97737 -81213 -103805 -207719 -212789 -183192 -97293
22061 -97293 -33629 -38286 -68236 -22643 -5643 -3475 -24030 -5486 16782 -22839 -68080 -42962
22049 -42962 -7266 92809 93615 120192 36014 17262 -52241 -94563 -41241 4816 -5494 -41852
22037 -41852 -125055 -118475 -122843 -91802 3040 -32593 -686 -56722 -47109 -61703 -40166 -22093
22025 -22093 -108935 -88859 -33918 65894 77947 13416 38553 -11502 -82039 -54568 42408 99329
22013 99329 95305 47289 67601 56556 -40460 -57475 -34282 25288 13933 -16578 -79208 -108907
22001 -108907 -24324 -32625 3956 61094 82433 117591 -920 -136693 -165931 -112399 -131671
21990 -131671 -112671 -58475 -66678 -115515 -81802 -98387 -80439 -153621 -158412 -109952 -116288 -66705
21978f6705L7427M1085N3463q6610p5528j3634O9054J08678N4795m6199J6834
21967I2660m3846m6017J8801M7858L4269q229j7505l9460j3675J9260K7102n014
21955F6204j4980j9451o6687l8921O167j9289O0939M1947M5887p9q9290p3773
21943a01326l2430n964M89M27r750J5463P5967k2609n6210j3235J01619k5036
21931g2595K0035J07422l8659k5885l5473L3657k8320M704M438j08379m6044O4675
21919a20424L7933O3769m023q566K3181K2942p6139l1353M3185M7802l035K9192
21907B4464P4301l090N9741m3437j9732r0141k0573K9965j7892l4652O311j2578
21895d7313o9080J3426O3659l594k824n5350K1373O0394P1522l0688m0616P762
$$ plain form
21978 -66705 -29278 11807 65270 -21340 -96868 -110502 -41448 67230 122025 75826 92660
21967 92660 48814 2797 21598 69456 103725 95496 77991 38531 24856 44116 71218 66204
21955 66204 51224 31773 -34914 -73835 -67668 -86957 -26018 15929 61816 61737 -27553 -101326
21943 -101326 -133756 -139720 -139231 -138804 -148554 -133091 -57124 -79733 -135943 -149178 -47559 -72595
21931 -72595 -52560 54862 16203 -9682 -45155 -11498 -39818 -35114 -30676 -139055 -185099 -120424
21919 -120424 -82491 -18722 -22745 -31311 -8130 14812 -61327 -92680 -49495 -1693 -4728 24464
21907 24464 98765 95675 155416 111979 92247 2106 -18467 11498 -6394 -41046 -34735 -47313
21895 -47313 -116393 -102967 -39308 -42902 -45726 -101076 -79703 -19309 52213 21525 -19091 -11329
21883a1329p6257N339k635M6396J00202m6462m1070j13816j06443p124J60875
21872i2324N6607p099R911o9977m058O1829N2806l0099r599L2914n070l8257O5
21859d2351J4526Q7892k5984n5218r3802j652M2623J2774R957N938K0703k580
21847b7174k4437l0691J6941j4816M965J7667l5808k6683O6160M9053j9199k3683
21835d7705J2445N8129k6145k7738q1045k9364k77o233M0379J27771M7134l0527
21823C6824k3290K6472o1202J9477K7327M022k5121l5654o699l1245J4659K6452
21811b7978l1686k3927l1464N8578l3987R708N2557K7117l2097j1570L8175K8336
21799B1762k8277m7111J02752N8282n2378k6883l3474O52K3876j6327J7716j9268
$$ plain form
21883 -11329 -87586 -82247 -84882 -38486 61716 15254 -25816 -139632 -246075 -253199 -92324
21872 -92324 -35717 -42816 -32905 -102882 -106940 -45111 7695 -22404 -32003 911 -4159 -42416 -42351
21859 -42351 -27825 60067 34083 -21135 -114937 -116589 -73966 -61192 -51235 -45297 -24594 -27174
21847 -27174 -51611 -82302 -65361 -80177 -75212 -57545 -93353 -120036 -53876 -4823 -24022 -47705
21835 -47705 -35260 22869 -3276 -31014 -112059 -141423 -141700 -147933 -107554 20217 67351 36824
21823 36824 13534 40006 -21196 -1719 25608 29630 4509 -31145 -37844 -69089 -54430 -27978
21811 -27978 -59664 -83591 -115055 -56477 -90464 -80756 -28199 -1082 -33179 -44749 -6574 21762
21799 21762 -6515 -53626 49126 107408 55030 28147 -5327 -4675 19201 2874 20590 1322
21787A322k6805P2013N9788n7695l1485m225L9078N5585q2649p5607m507m5436
21775a00623L7125M141P63o2302M6764M3684K5853K9897P8473o3290k4838k1887
21763f240l9435r2829j5426J24487L9563l4109M973P0436Q2400L7699n3213o7491
21751E0815l341O4097o0068k1016o9189j47023k3348M269J19649J21343l078l4468
21739a358m703J82p0138K5920L5551j4382m1196M1454J8720N1096M6172M0836
21727A28154m1092l1908n2394M7896K9938J2544L8992o5402m7193K960m9853p1595
21715i8953q959Q6626L5508j5688Q701O5288O8903K3527m7954q1844l6388o593
21703g826k9383L2584K5370J1246j8084N194J13615Q3529o5660r4837m8017n8851
$$ plain form
21787 1322 -25483 46530 106318 48623 17138 12913 51991 107576 24927 -50680 -55187 -100623
21775 -100623 -63498 -59357 -58594 -120896 -74132 -30448 -4595 25302 103775 40485 15647 -6240
21763 -6240 -45675 -138504 -153930 -29443 10120 -23989 -19016 51420 133820 171519 118306 50815
21751 50815 47474 111571 51503 30487 -38702 -185725 -209073 -204804 -85155 36188 33110 -1358
21739 -1358 -6061 -5879 -76017 -50097 -14546 -28928 -70124 -28670 -9950 41146 87318 128154
21727 128154 87062 55154 2760 50656 80594 93138 132130 66728 19535 22495 -27358 -98953
21715 -98953 -107912 -21286 14222 -1466 7235 72523 141426 164953 116999 35155 -1233 -7826
21703 -7826 -37209 -4625 20745 31991 13907 19101 132716 216245 150585 55748 7731 -51120
21691e1120M7633P8335Q2523j9935j29546J5811J6861J6035K5793l7221q4619
21680c9450j2614O8256q4510m9603l406J2907M0974m3109J06993L2745j17438
21669h8255j4864K3537P4548K5469L10j8789J7965M6564j0568l1471m8615q5992
21657a10161r9603J9355O4328P1543N3930L2798J5015N5554K0402m9777j13341
21646c9957K2793N9453L3929o7813J8854J8473j775j7131o0624p5099p0514K119
21634a77292N1479Q3146Q3519j5798K174j0493n7681r507j9058m9838J3524J2612
21622i3213L9309P367N1618O9801m169k2353N3396L3860q7641r6633K191K0355
21610b6112N9094j3320j6863K7743l004K5840J9036k1093R043K8493q2654k3325
$$ plain form
21691 -51120 -3487 74848 157371 137436 7890 23701 40562 56597 82390 45169 -39450
21680 -39450 -52064 16192 -68318 -117921 -121327 -108420 -67446 -110555 -3562 29183 -88255
21669 -88255 -103119 -79582 -5034 20435 20745 1956 19921 66485 55917 24446 -24169 -110161
21657 -110161 -209764 -190409 -126081 -54538 -608 32190 47205 102759 123161 73384 -39957
21646 -39957 -17164 42289 76218 8405 27259 45732 43957 26826 -33798 -108897 -179411 -177292
21634 -177292 -125813 -42667 40852 25054 27228 16735 -40946 -50453 -69511 -119349 -105825 -93213
21622 -93213 -53904 -46537 5081 74882 70713 48360 101756 135616 47975 -48658 -46467 -26112
21610 -26112 32982 19662 2799 30542 27538 53378 72414 51321 60364 88857 6203 -17122
21598a7122J5574N875N2080M4525l7701q2927l4119l0475L975O8088P01k048q102
21585b1676Q5641J675m7996O810M775n6102n7866Q8785P4509j4701L675P390m4295
21572C0624n6525K0350J45851J405p2348o1299l1196n5858r312j1837L1932P2820
21560D607m355k426O6594m2741n6159m1952m7604M5842P5537J05648j0471r2749
21548b29q8061J6481P1975o168L5976n2909m822L6684L9176M0764n487n1868m3589
21535a2077J0268k016R348M475l558k4678r871m1272M7389K3035K4987l344q9544
21522f6858Q718Q8128n1728n6572m5723l1900J0728M6361m5860j936J9549M8064
21510g9029P606P3257N8182n3138m6243p934M7571N4986k4367j23618J8018J23481
$$ plain form
21598 -17122 -1548 4327 56407 100932 63231 -19696 -53815 -84290 -80315 -12227 -11526 -13574 -21676
21585 -21676 63965 65640 17644 24454 29229 -26873 -84739 4046 78555 63854 67529 74919 30624
21572 30624 -25901 -5551 140300 141705 69357 8058 -23138 -78996 -88308 -100145 -68213 4607
21560 4607 252 -2174 64420 21679 -34480 -76432 -124036 -78194 -2657 102991 92520 -229
21548 -229 -88290 -71809 166 -6002 29974 -22935 -27757 8927 48103 88867 83380 31512 -12077
21535 -12077 -1809 -3825 5523 9998 6440 -18238 -28109 -69381 -21992 1043 26030 22686 -66858
21522 -66858 -58140 29988 -21740 -78312 -124035 -155935 -145207 -98846 -144706 -146642 -127093 -79029
21510 -79029 -71423 1834 60016 6878 -39365 -47299 272 55258 30891 -92727 -74709 48772
21498D8772O4003J0882m6436r3839l1579L0888J7234k3827p6820k2986O5028P0978
21486A2298J2018O0902j028n9140N0456l4573o3336J4370j1153o722K7019j8096
21474a6985J642k6040j3069L2262N766k3320k7862p1204L372P2529j2600L87J610
21461g3512l4321l124L3302J3365n3233M1399L0965P0110J01136m2771j26433
21450d3117p1873J8599O3040j9239L8838P414p9402l2128J6247n477K2816M973
21438g9309m472k2391K006L3151R46j1754j3739R3019P000j47N6188k836j25243
21425f7581J7711M7789J6247n3055M3875k728j513M9225M094K7145M7821K9366
21413A58396o460o2794k2823p0414J4504Q8276n9567P662Q934k70m3689R451L8768
$$ plain form
21498 48772 112775 123657 77221 -16618 -48197 -17309 -75 -23902 -100722 -123708 -58680 12298
21486 12298 24316 85218 84190 25050 75506 40933 -22403 -8033 -19186 -25908 1111 -16985
21474 -16985 -15343 -41383 -54452 -22190 -16424 -39744 -67606 -138810 -135438 -62909 -75509 -75122 -73512
21461 -73512 -107833 -110957 -77655 -64290 -117523 -76124 -45159 24951 126087 83316 -43117
21450 -43117 -114990 -96391 -33351 -52590 -13752 -6338 -85740 -117868 -101621 -107098 -84282 -79309
21438 -79309 -83781 -106172 -104166 -71015 -70069 -81823 -95562 -2543 4457 4310 60498 57662 -67581
21425 -67581 -49870 -2081 14166 -38889 4986 2258 745 49970 54064 81209 129030 158396
21413 158396 151936 89142 66319 -4095 10409 98685 39118 46780 55714 55444 11755 21206 59974
21400E9974j3474p6261n7164o3346P9770J45879Q9862k8896q5046n7519J15468
21389A09247J4606l1926l4331k5910r9412J3852Q9152j03710q7980L323o356L6373
21377a23072l6132L8381Q3013K6991J3501K9515o4334O2459O2636p866r3551k880
21365a1339L9592M7K974J2303m6644m1216M1530J3704K0901J1571p3602k9045
21353e9224K0486n087L475M8326m3462n2026p291r5120O3559J43290o6610k2443
21341g2127N7606k9585L1086l0946N0846j22917k4683q496j9530J6776L8230O2980
21329e0760M4385L6475n5762j04425j1303K7318L7028K4184m4634K6730J6128
21318e4636P1628J7402L8404r2822l9473q823o7083l818j8372N4473k3936J0673
$$ plain form
21400 59974 46500 -29761 -86925 -150271 -70501 75378 165240 136344 51298 -6221 109247
21389 109247 123853 91927 57596 31686 -67726 -53874 35278 -68432 -156412 -153089 -159445 -123072
21377 -123072 -159204 -120823 -37810 -10819 2682 32197 -32137 30322 92958 85092 -8459 -11339
21365 -11339 28253 28300 31274 43577 -3067 -44283 -2753 10951 31852 43423 -30179 -59224
21353 -59224 -38738 -43825 -40350 7976 -35486 -87512 -94803 -189923 -126364 16926 -49684 -72127
21341 -72127 -14521 -44106 -13020 -43966 6880 -116037 -140720 -149216 -168746 -151970 -113740 -50760
21329 -50760 -6375 30100 -25662 -130087 -141390 -114072 -77044 -52860 -97494 -70764 -54636
21318 -54636 16992 34394 72798 -20024 -59497 -68320 -135403 -139221 -157593 -103120 -127056 -116383
21306a16383M721N5032R0886L1443P3968L3368j05863j02481m3552l2269o1666
21295a72796J26133K8070R229L1587J7585n6913k6306K2281L7891J3324m0666
21284a0581L8679N3074m2140N2404J6300l8058o5185j8989Q4155O4195j47680
21273a3826n4770K6027N2952O0552n2220J0890j529K8371r978n198j947O499k9245
21260A6578k6010m8989n1936L3698J22621j5552k2859m429l7529J8452L396J561
21248a0998m8093K2584m9978L3511P0190l5562j3345L3834Q5204l5223r04m7325
21236C895m6406J8326O1908O8833o8651q3987l0552N5810K2141j3194j2317M3431
21224A9237l0618o3937l9637J313K1643Q3866m1221J4316P127j3447m2012m468
$$ plain form
21306 -116383 -111662 -56630 34256 65699 139667 173035 67172 -35309 -78861 -111130 -172796
21295 -172796 -46663 -18593 -9364 22223 39808 -17105 -43411 -21130 16761 30085 -10581
21284 -10581 28098 81172 39032 91436 107736 69678 4493 -14496 69659 133854 -13826
21273 -13826 -68596 -42569 10383 70935 18715 29605 28076 56447 46469 41271 39324 45823 16578
21260 16578 -9432 -58421 -110357 -76659 45962 30410 7551 3122 -34407 -15955 -12559 -10998
21248 -10998 -59091 -36507 -86485 -52974 17216 -18346 -31691 2143 87347 52124 51220 3895
21236 3895 -42511 -24185 37723 106556 37905 -46082 -76634 -20824 1317 -11877 -24194 19237
21224 19237 -11381 -75318 -114955 -113642 -91999 -8133 -49354 -35038 -27911 -41358 -83370 -87838
21212h7838J4267l4133L3898R9346N3353O337j4076K8093l4969m8307j7180j1651
21200a2860R519p4747j6073Q0355J7227j4153m4047n246P7292L8295r9634k7462
21188g1534J33818n4299l6316J7814J0015P927l2522p2135N5692k2941n4936q053
21176a27470j277n1919J7835P6015M5761K2490M6899K8471N3532m7257n7307L1009
21164C6782K3283L8880j1782n7665j3730K7909K7638Q404L0206O7611p982J158
21152A70712m2551o7558j2426O7843n7243m2538o0044j1450j061o3671Q5N9734
21140f0168O5023j7122k0865k126j5567J2240K3338j6071q212Q2983J09830K5318
21128A78601r8105q0545m4113J3611p860J1920J8538n6829k8629j4054P2702P1188
$$ plain form
21212 -87838 -73571 -107704 -73806 25540 78893 85230 71154 99247 64278 15971 -1209 -12860
21200 -12860 -3341 -78088 -94161 -13806 3421 -10732 -54779 -60025 17267 55562 -44072 -71534
21188 -71534 62284 7985 -28331 -10517 -502 7425 -25097 -97232 -41540 -64481 -119417 -127470
21176 -127470 -128747 -180666 -162831 -86816 -41055 -18565 28334 56805 110337 63080 5773 36782
21164 36782 60065 98945 87163 29498 15768 43677 71315 79719 109925 177536 169554 170712
21152 170712 128161 60603 48177 116020 58777 16239 -43805 -55255 -56316 -119987 -119902 -60168
21140 -60168 4855 -12267 -33132 -35258 -50825 -38585 -15247 -31318 -39530 43453 153283 178601
21128 178601 80496 -49 -44162 -30551 -38411 -26491 -7953 -64782 -93411 -107465 -34763 36425
21116C6425K5794k1562r562P0591K19n0685n6681M2536J5461J1663q7816j9401
21104d3018K5336L6881O582j04728n7187J1453K8380j4003Q2731K3969m1908P4812
21092B9300l1052j3841q6386K4709K9522k2076K1053K2732M0736J0176n1554l69
21080b7050p679O154M2036k6175K0198o8650p0848n1497K0835N9077R2223N8745
21068D7369n7685n3193N9396J4127p322M3927o7781l8260P6974K0244l1148k0805
21056a4157O8939M6124j0450o4978L6561R9885j5428p2664k7173k2297K5072r308
21044D0126l8479L1367l5732P7440N7870o0039o8358J45430p4146r5925r0386
21033a10832M5554M2316M1616j3952m1267o4017N1837P0274n2235Q138N4679R924
$$ plain form
21116 36425 62219 40657 31095 101686 101905 51220 -5461 37075 52536 64199 -23617 -43018
21104 -43018 -17682 19199 25781 -78947 -136134 -124681 -96301 -110304 -27573 -3604 -45512 29300
21092 29300 -1752 -15593 -101979 -77270 -47748 -69824 -48771 -26039 14697 24873 -26681 -27050
21080 -27050 -34729 -28575 13461 -12714 7484 -61166 -132014 -183511 -162676 -103599 -11376 47369
21068 47369 -10316 -63509 -4113 10014 2692 46619 -21162 -59422 17552 37796 6648 -14157
21056 -14157 54782 100906 90456 25478 62039 161924 146496 73832 46659 24362 49434 40126
21044 40126 1647 33014 -2718 74722 132592 72553 4195 149625 75479 -20446 -110832
21033 -110832 -65278 -22962 18654 4702 -36565 -100582 -48745 21529 -30706 -22568 32111 42035
21021D2035P3368r2193J0957J2925m6750l593o0900m5719p008L1177N1529j9622
21009e3794l377j06736j4774O7968J52381J3355l3800k8111k8231r627p9160m2561
20997a66467L2528Q9075L0700L9495m0135J8597M9831o824l7909q5227M1191j865
20985c7010k9396J9287Q6624J1357j9736M8097Q9459m2225r4612j8892l357L3478
20973D3074J255r7087l8112j2600R9738J20927O3884o5718m5466L9081q4707j01347
20961g7078K4766O1852P7142o5068n0432j096J9696O3328J4831n7222k0723K8539
20949A8535k5924q5215j9070L2220K9015J8468j2128m2227P5164K1819l8526L8530
20937A0661P987J5237O0068J7802K2097o7905r9470k8229N1774N3966m2108l5684
$$ plain form
21021 42035 115403 23210 34167 47092 342 -3251 -64151 -109870 -116878 -85701 -34172 -53794
21009 -53794 -57171 -163907 -178681 -110713 41668 55023 21223 -6888 -35119 -44746 -123906 -166467
20997 -166467 -133939 -44864 -14164 25331 -14804 3793 53624 46800 8891 -76336 -35145 -37010
20985 -37010 -66406 -47119 39505 50862 31126 79223 168682 126457 31845 12953 9596 43074
20973 43074 44329 -52758 -90870 -103470 -3732 117195 181079 115361 69895 108976 24269 -77078
20961 -77078 -52312 9540 86682 21614 -28818 -29914 -10218 53110 67941 10719 -10004 18535
20949 18535 -7389 -92604 -111674 -79454 -50439 -31971 -44099 -86326 -11162 10657 -27869 10661
20937 10661 18648 33885 93953 111755 133852 65947 -33523 -61752 -9978 43988 1880 -33804
20925c3804q243Q0952R3442j8855K2098l5693q3820j5331J2794l134k6035O791
20913h838j2449M4544P3354k5708p9532N276L1655m2468Q831M1307L930k4496
20901A5406o174K6695K5327j3166j1223j06086j1862O3517J72900K1603r4509
20890H2428l3605j2699k7417m1908N1384P5236r7016p8876M0212P8415M702r6257
20878e5401r2996l8424R1307Q8685K1890k5971l2140j1634Q2172J4736n352m178
20866C2694n7378j5154n3768k3396l7546J4462Q6505P2888l31q2591o82P2843
20854H546M0668l3042J0484N1207n77l2954p7721L0186J315o0717L1420R4302
20842F3117l1702p0412N8900Q5632J5543k2385o9425M4488j5480m6151O0636J461
$$ plain form
20925 -33804 -42047 38905 132347 113492 135590 99897 16077 746 13540 10406 -15629 -8838
20913 -8838 -21287 23257 96611 70903 -8629 -3353 28302 -14166 -5335 35972 39902 15406
20901 15406 9232 35927 61254 48088 36865 -69221 -81083 -17566 155334 176937 82428
20890 82428 48823 36124 8707 -33201 18183 93419 -3597 -82473 -42261 36154 40856 -55401
20878 -55401 -148397 -186821 -95514 -6829 15061 -10910 -43050 -54684 27488 42224 36872 32694
20866 32694 -24684 -39838 -93606 -117002 -154548 -140086 -53581 19307 18976 -63615 -64297 8546
20854 8546 49214 16172 26656 77863 77286 44332 -33389 -3203 -1888 -62605 -31185 63117
20842 63117 31415 -38997 19903 105535 121078 98693 29268 73756 58276 12125 72761 74222
20830G4222N8851N9391j4099p7298k501l8071m1131N9178J444q20o9283l3659
20818b3776Q7551J4060j05242q3216R1649M9481m74q2967J7422j1429K1271m105
20806b9775J9727O7069m1051p3425k9039J0612L9327L8723k8053l782m061N5895
20794B2167Q4944m2735j2367l5158j0351m5106j0835N6656L8004m1108M9557n930
20782D7738k1512L9354k2127P6478l9206k5362p3668l0506M7147K7606j18498
20771i2556n4519M0519K350L7981J02111Q8542o3637J5431q1865r4617j8882j0082
20759a29224M1579L8427P6945J01134l4456k9244l1578k2777l8864N7977O4992
20748I4911k5023o9985l1825m8249k8414o4627n598P7426J3703M3957M1291p40
$$ plain form
20830 74222 133073 192464 178365 101067 98566 60495 19364 78542 79986 79166 9883 -23776
20818 -23776 63775 77835 -27407 -110623 -18974 30507 30033 -52934 -35512 -46941 -25670 -29775
20806 -29775 -10048 57021 15970 -57455 -86494 -75882 -36555 2168 -25885 -29667 -33728 22167
20794 22167 107111 64376 52009 16851 6500 -38606 -49441 7215 45219 4111 53668 47738
20782 47738 26226 65580 43453 119931 80725 55363 -18305 -48811 -1664 25942 -92556
20771 -92556 -147075 -106556 -104206 -66225 35886 124428 60791 76222 -5643 -100260 -119142 -129224
20759 -129224 -87645 -49218 27727 128861 94405 65161 33583 10806 -28058 29919 94911
20748 94911 69888 -97 -31922 -80171 -108585 -173212 -178810 -101384 -87681 -43724 -2433 -3173
20736c173K2475o2650k0045J4677k0763K9920O402J2845R856K3726O3515j3197
20724F3588n4343q0882N7M8344M3255M16o8011m4171P6399O9825k2762m3497r3578
20711a05360m8783k8431J07526N6501m3631p1666J7371J03634O3340J3366R0376
20700A54243k720m9279n1055p0326l4314N0670Q4236K2143p0811o6066P062R2577
20688F6360K238j7145j0679j7539l095K2801K4660M4883j0614j23458n6400j1277
20676h9265J2384J7642L1899m4311l8298P5438L5452o700k604J862l4220l0586
20664g1307K7696m2947r999K4899M9453O1528K0879m2816l19J8011m0836m8278
20652e4036q0306q2860P8887P6419L2863M483l3136J5542L1469q2011q1232K4506
$$ plain form
20736 -3173 19302 -43348 -63393 -48716 -69479 -39559 -33157 -20312 -10456 13270 76785 63588
20724 63588 9245 -71637 -71580 -23236 20019 20435 -47576 -91747 -15348 54477 31715 -11782 -105360
20711 -105360 -154143 -182574 -75048 -18547 -62178 -133844 -116473 -12839 50501 63867 154243
20700 154243 151523 102244 51189 -19137 -53451 -2781 81455 103598 32787 -33279 -26217 66360
20688 66360 68598 51453 40774 23235 20140 42941 67601 112484 101870 -21588 -77988 -89265
20676 -89265 -76881 -59239 -27340 -71651 -109949 -34511 941 -5759 -8363 -6501 -40721 -71307
20664 -71307 -43611 -86558 -96557 -71658 -22205 39323 60202 17386 17067 35078 -5758 -54036
20652 -54036 -134342 -217202 -138315 -61896 -29033 -24550 -57686 -42144 -10675 -92686 -173918 -149412
20640a49412O2338K1016n7742j0677L1572K2940j0875j513k9117M2658R9360R550
20628C0098P1930N410k2139j0941m0290o8375p4870M7416J02409p901n2872l8866
20616e8991o8484J2916N3691o3R7359O719j3860M3338l9451o1334N6051O307j2958
20603B1240M5040M5504L8448Q517J2865J5742n7996q8931k8516L6446M8523l6466
20591F0416p3506l9300K5065j6135O5646j5218k1768K163J1733J3604m6816j1437
20579d5553K4893k597o615k4583m062O3608k4568p3893L234P1384j6329q010P8363
20566C5272N6705J9072l9186n5423L7814K3005j35k9805L5742L2003k0119J3995
20554A08940m1838p9605L6164O2949l7059j17688J2097J49823O2373j31373j30735
$$ plain form
20640 -149412 -87074 -66058 -123800 -134477 -102905 -79965 -90840 -92353 -121470 -78812 20548 30098
20628 30098 102028 107438 85299 74358 34068 -34307 -109177 -61761 40648 32747 -20125 -58991
20616 -58991 -127475 -114559 -60868 -60931 36428 43147 29287 72625 33174 -28160 27891 34198 21240
20603 21240 66280 111784 150232 158749 171614 187356 129360 40429 11913 48359 96882 60416
20591 60416 -13090 -52390 -27325 -43460 22186 6968 -14800 -12637 -904 12700 -34116 -45553
20579 -45553 -20660 -23257 -29872 -54455 -58517 5091 -19477 -93370 -90136 -18752 -35081 -43091 35272
20566 35272 91977 111049 71863 16440 54254 77259 77124 47319 83061 115064 94945 108940
20554 108940 67102 -12503 23661 86610 49551 -68137 -56040 93783 156156 24783 -105952
20543a05952l5793J14723J03672K1200l6363J3633p3120j04336n3148k6940l6921
20532b19345j6173J37923J50029R7290n087p9056p8955l2013M9068K0729m1625
20521a7215p22m8213J4928Q1607q370m8696k4510m2038N8559Q8435j141l6045
20509A6579q5093o2703N5986N9323J6365Q0913l0979K6852j3848r8747l6821o9119
20497a41292m9224Q5741Q5663K8920j2707J1328L4766n603m3721n8191j4867l9562
20485a18749M4046j2994L9514O0548o8657P966M1061M2403M0050m7844j3059K0482
20473C4767J2995Q2961L2940J2532M3648p5452k1091o7342P676q238k7396n5955
20461b7955K0258m0484N9872l6756l8420j4693k5161q827P9584R2745Q6949J7501
$$ plain form
20543 -105952 -141745 -27022 76650 97850 61487 75120 2000 -102336 -155484 -182424 -219345
20532 -219345 -235518 -97595 52434 149724 144637 65581 -13374 -45387 3681 24410 -17215
20521 -17215 -17937 -66150 -51222 30385 22015 -26681 -51191 -93229 -34670 53765 52624 16579
20509 16579 -68514 -131217 -75231 -15908 457 81370 50391 77243 63395 -35352 -72173 -141292
20497 -141292 -190516 -104775 -19112 9808 -2899 8429 43195 37592 -6129 -64320 -79187 -118749
20485 -118749 -74703 -87697 -48183 12365 -56292 -48326 -7265 35138 75188 27344 14285 34767
20473 34767 47762 130723 163663 176195 219843 144391 123300 55958 63634 55396 28000 -27955
20461 -27955 -7697 -48181 11691 -25065 -63485 -78178 -103339 -112166 -32582 60163 147112 164613
20449A64613J1959j6551p994K944r317M1089p40l7156m4529K5532l4791q9048
20437F011j0388r769L1824L1170O690k4870J5402J2104n7451l3913N238M773k4353
20424d7532J7083L6156n4490L8907N3222j0802m1521p9270P9957M9304P4410r43
20412A14481R94K8499N8220O947l7541q9360q1339L4552N014m5871m2780q2567
20400a30751J0404K5077M664R5734L4751J9348l2200r5461j1699L620J8337Q8223
20388C0047M7566m999k4793o0607J2387j6017P6451q2287q2927P7953R2593L4296
20376I9663q1386r4745M908J20712M0439O878p2109k534J263j9906Q887K3261
20364C5331O1751J6688o7009q8634m2107P2298N2880K4710l1423k4189L6222P9164
$$ plain form
20449 164613 176572 160021 152027 154971 145654 186743 186003 148847 104318 129850 95059 6011
20437 6011 -4377 -14146 17678 48848 55538 30668 46070 58174 723 -33190 -27952 -23179 -47532
20424 -47532 -30449 5707 -48783 -9876 43346 32544 -8977 -88247 -8290 41014 115424 114481
20412 114481 115475 143974 202194 209141 171600 82240 901 35453 40467 -5404 -48184 -130751
20400 -130751 -120347 -95270 -90606 5128 39879 59227 27027 -68434 -80133 -76513 -58176 30047
20388 30047 77613 72614 47821 -12786 -399 -16416 60035 -22252 -105179 -27226 65367 99663
20376 99663 18277 -76468 -71560 49152 89591 96469 24360 21826 23089 3183 12070 35331
20364 35331 97082 113770 46761 -41873 -83980 -11682 41198 65908 34485 10296 46518 125682
20352A25682m7564j29671J8108k4688m204N9876M6001m1129N3902J8553k9018
20341D5848k8933J3808o247j5193l4376j14633j1230K9480O299P0734M8852l696
20329G13m5257J5677j0769j2105Q3836J04889N30p9131m7380K9087j3618N9395
20317H5867K8236L4772l3413n6675m9941l5131o2047K3757O7298L480r822l8547
20305d2166N0442R248m274O4853p4508p5502O4663R0058l0031J4421j286k2286
20293D3632m8882k9460N4840m4831p1282K2647O525K2731O4038J8142o3717l3866
20281e9483R0073K6305p4548j50k8237n0612M7486k49N3361j1026n282k0058j7296
20268d9716m3614K4710P7262j9157L8927L0565k0061l8397j0122o9159q766P1624
$$ plain form
20352 125682 78118 -51553 -33445 -58133 -62337 -2461 43540 2411 56313 74866 45848
20341 45848 16915 30723 24476 9283 -25093 -139726 -150956 -121476 -115177 -44443 4409 713
20329 713 -44544 -28867 -39636 -51741 32095 136984 137514 58383 11003 40090 26472 85867
20317 85867 114103 148875 115462 58787 8846 -26285 -88332 -64575 2723 6203 -3619 -42166
20305 -42166 8276 17524 13250 78103 3595 -71907 -7244 82814 52783 67204 65918 43632
20293 43632 -5250 -34710 20130 -24701 -95983 -73336 -66811 -44080 19958 38100 -25617 -59483
20281 -59483 30590 56895 -17653 -17803 -46040 -96652 -49166 -49415 3946 -7080 -12362 -32420 -49716
20268 -49716 -93330 -68620 8642 -10515 28412 58977 38916 519 -9603 -78762 -87528 -15904
20256a5904k871m2339O0932L8791j8332J8908m4857J7043K8790o407j7945m1898
20244b6089J5699R628P248M1653J3430p3160O8729p3560l0886L4191J28886j4935
20232A00834n9975j7132k5006n1636k6054o2114M6214J10050P2392j1798o5515
20221A0260J08649L2155j04434j24126P1905Q8380j6508n6736p9261l3273O739
20210i6250k4719N8295L3076j7432o065l4220m0732J21732O6167j278J0251J3325
20198H2150J62904L0720q6762j0117p7722J4457O2825o3850m8800l162j5754k1841
20186B5048N2584L9623j11408k5597J6861n7581M2596q897o4281l4726l97L5678
20174i0497K5902k905R968l9977K2281K7389n4724r224O0290N3407k5218j12666
$$ plain form
20256 -15904 -18775 -61114 -182 38609 20277 39185 -5672 11371 40161 33754 15809 -26089
20244 -26089 -10390 -762 6486 48139 61569 -11591 57138 -16422 -47308 -13117 115769 100834
20232 100834 40859 23727 -1279 -52915 -78969 -141083 -94869 15181 87573 75775 10260
20221 10260 118909 151064 46630 -77496 -5591 82789 66281 9545 -69716 -102989 -96250
20210 -96250 -120969 -62674 -29598 -47030 -53095 -87315 -128047 -6315 59852 58574 68825 82150
20198 82150 245054 275774 189012 178895 101173 115630 178455 114605 65805 62643 46889 25048
20186 25048 77632 117255 5847 -19750 -2889 -60470 -17874 -26771 -91052 -125778 -126175 -90497
20174 -90497 -64595 -67500 -57532 -97509 -75228 -47839 -102563 -111787 -51497 1910 -23308 -135974
20162a35974l835M7587L7794K5275J2670P8506M5834m5353r4285m8358N2253P270
20150b0616O3882Q4188m6271o3624p8463n6396N7066K9589R1747Q857k0054r049
20138D0856l7507k023k4300N1327j4905J5776L6486N116o3015n8602M4087L0997
20126B4293J039m2836l0558j1622m8524M326M8852R1634L7643K7080M2415L8737
20114A82479k0497l5977j5347m2744n8559M3292L4239o93l2814j66665l2455L4960
20102a10781J25149P9010j2341o6410j19814j7339J0281J00804M2468R0318m8983
20091G2362J6966m2303o5139p3259N456L2140j3383L2542J0862m6553O5628K6869
20079B2188J3544m0111O2165K7586q1367P572M0883k5620m4704P2448L4092M3369
$$ plain form
20162 -135974 -139809 -92222 -54428 -29153 -16483 62023 107857 62504 -31781 -80139 -27886 -20616
20150 -20616 43266 127454 81183 17559 -60904 -117300 -60234 -30645 61102 69959 49905 40856
20138 40856 3349 1326 -22974 28353 13448 29224 65710 70826 7811 -50791 -6704 24293
20126 24293 25332 -17504 -48062 -59684 -108208 -103882 -55030 36604 74247 101327 143742 182479
20114 182479 161982 126005 110658 67914 9355 52647 86886 86193 53379 -113286 -145741 -110781
20102 -110781 14368 93378 81037 14627 -105187 -122526 -112245 -11441 31027 121345 72362
20091 72362 89328 47025 -18114 -91373 -85917 -53777 -67160 -34618 -23756 -70309 -4681 22188
20079 22188 35732 -4379 57786 85372 4005 11577 52460 26840 -17864 54584 88676 132045
20067A32045j6736o6224l5111j7676J2936o2855j4916O1043n6817n835J25961
20056E5815M3334j9369k0283j0176J8927l752q871n794j2750J4519l1776o6735
20044d6911j5984j6170m4332P8547J0130K7792l1897N6584J52862K6767o9895
20033A27493L0376L5499r0696l568l5385Q211Q6959K0012k0900J0694N155m9190
20021A24660m4852m0175p8409k6552J9232K1354N445L1607P6905j9538j4811k7924
20009B6942q0067l8945O9351J15038M7877L7426l3358j1757j7207k1041n3731
19998D0528m6572k5147O5100p4084k561r221K8695J05699r0618n1232K8285J3858
19986a7270L2992L1573k0528k2800j9640O2512L3730p0905P2566J1954q4159p1028
$$ plain form
20067 132045 115309 49085 13974 -3702 9234 -53621 -68537 -7494 -64311 -70146 55815
20056 55815 99149 79780 59497 49321 68248 64496 55625 49831 37081 51600 19824 -46911
20044 -46911 -62895 -79065 -123397 -44850 -34720 -6928 -38825 17759 170621 197388 127493
20033 127493 157869 193368 102672 99104 63719 71930 158889 178901 158001 168695 173850 124660
20021 124660 79808 39633 -38776 -65328 -46096 -24742 -19297 12310 89215 69677 54866 26942
20009 26942 -53125 -92070 -22719 92319 140196 177622 144264 132507 115300 94259 40528
19998 40528 -6044 -31191 33909 -40175 -42736 -51957 -23262 82437 -8181 -59413 -31128 -17270
19986 -17270 15722 47295 26767 3967 -15673 46839 80569 9664 82230 94184 10025 -61003
19974f1003M6199M0666j4133j1496J830K0288k9901J4316l954J6982M947n6759
19962c2018l9219P0035q628M12l3077k3091j8222K2076M0653M723J04682J02901
19950A91227j1063j06222n3253K1312n545N5406L2371k1797j24411l8049J5869
19939d4155K2789J1662l4086r5704l4665m206J20755J05998J8167K2541L2191
19928A21287k2506o6542k0328k2002L6675K1486n1946J8018L2176M3588q597o2498
19916A8811K2458K4779K3756J0738j02549J0435P293k6897J8745l4552J5615R1567
19904H0199j8130m6519n1211K1483Q4069N6431k606j7352M1257l7155l0033m9864
19892C0569n967R165O9209J12325n6657J8478J39760J35035J79216J38186K7112
$$ plain form
19974 -61003 -14804 25862 11729 233 2063 22351 -7550 6766 2812 19794 24741 -32018
19962 -32018 -71237 -1202 -9830 -9418 -42495 -65586 -83808 -61732 -21079 -16356 88326 191227
19950 191227 180164 73942 20689 42001 36456 91862 124233 102436 -21975 -60024 -44155
19939 -44155 -21366 -9704 -43790 -139494 -174159 -178365 -57610 48388 66555 89096 121287
19928 121287 98781 32239 11911 -10091 26584 48070 -3876 14142 46318 89906 81309 18811
19916 18811 41269 66048 89804 100542 -2007 8428 15721 -11176 7569 -26983 -11368 80199
19904 80199 62069 15550 -35661 -14178 69891 126322 123716 106364 147621 110466 80433 30569
19892 30569 24602 33767 102976 215301 158644 177122 316882 451917 631133 769319 796431
19881G96431k5162o6870l6272j0269J6174J76051P6189q1012j81209j42315j38352
19870C83384l6072Q841j18300j16608r3069j4075n4335J3191L4315P1763M3284
19859A22319p187p0515K2965O1121M8660j2339j5077o2525j71910k6210j1863
19848a22561J2947M5704M6327L5641L467q3723Q9338N2174N7755N8647j3342L8245
19836B20619L6303L2856J18287K16102J31091P8135m0060m4768q9280J137O6802
19825G27224J44386K3898m9240k22199j59132J453n6004j10665m0330l5453k0685
19814B03253q5991j5094N2064J09790p0778n5349l6058q8857r012L1246J4946
19803E0160N1370L1747O2649j7936K257M874j33416l4906m1254O812j9885q616
$$ plain form
19881 796431 771269 704399 668127 657858 674032 850083 926272 845260 664051 521736 383384
19870 383384 347312 356153 237853 121245 28176 14101 -40234 -27043 7272 79035 122319
19859 122319 115132 44617 67582 128703 177363 165024 149947 87422 -84488 -110698 -122561
19848 -122561 -109614 -63910 -17583 18058 21525 -62198 27140 79314 137069 195716 182374 220619
19836 220619 256922 289778 408065 624167 755258 833393 793333 748565 659285 660422 727224
19825 727224 871610 895508 846268 624069 464937 466390 410386 299721 259391 223938 203253
19814 203253 117262 102168 154232 264022 193244 137895 101837 12980 3968 35214 50160
19803 50160 101530 133277 195926 177990 180247 185121 51705 16799 -24455 -17643 -37528 -46144
19791d6144M4629j4403o611J58J4641L7423N2840R5007o4717j28302K3722N4649
19779F2892l1624k6996k3861L0270k443m6130N6537J7899j9927O1965j3445M4408
19767A09545J38105J9964O4235j27869j06030k6096R388L4059j0480j17944k3071
19756c6194l2970L7214O3494n2965P1796K4781j072M0364n6449L479N5788J18342
19744B35608K5836j18987l9526M6321J0517k4994K7621r5462n5988J8043k3297
19733E692J2024J3916N5943M9260l9794q5073j12199M4847N9464k53l4837M3819
19721A2809R0773l963N959m9753m5024N2357N6569n20j2579k0562m9985n7357
19709b1276P0246R072l6904K8124R5666j4678j494o5969J7551j6778O9003K3506
$$ plain form
19791 -46144 -1515 -15918 -22529 -22371 -7730 29693 82533 177540 112823 -15479 8243 62892
19779 62892 31268 4272 -19589 10681 8238 -37892 18645 36544 16617 78582 65137 109545
19767 109545 247650 267614 331849 203980 97950 71854 81242 115301 104821 -13123 -36194
19756 -36194 -69164 -31950 31544 -21421 50375 75156 74084 114448 57999 61478 117266 235608
19744 235608 261444 142457 102931 149252 159769 134775 162396 66934 10946 28989 5692
19733 5692 17716 31632 87575 136835 97041 11968 -100231 -55384 4080 3827 -31010 12809
19721 12809 103582 99619 105578 55825 10801 63158 119727 119207 106628 86066 36081 -21276
19709 -21276 48970 58042 21138 49262 144928 130250 128756 62787 80338 63560 132563 156069
19697A56069n5179j7514M3555n0381l642J1842L4787j9740k2361K340OJ9294J8511
19684A17587k0870L5475O4643o2580m7257L6502n3664m730M6439k5598o7399R9557
19672A18105L3290J2076k5212l2775k1010m5143j8793L6510Q2300J10117N370
19661B54835l7819j08626j59559L0846J1662L628P9123O3350J0173R7383m0564
19650B04432p1836j4509n4383j08621K0545N5020R1886N4445o4806j42094k5117
19639e5038O2454O3218M0091P911l9953k9570J9096k1751J0452M2455M2319k2932
19627A18752j5369J4866Q4056J555l2871j3522k9539l5202l3938R1048P208L2921
19615A89965P9385M41p3604k8981n3442J1090k2491o0113l6714L2690K4243J56864
$$ plain form
19697 156069 100890 83376 126931 76550 72908 84750 119537 99797 77436 79776 79782 99076 117587
19684 117587 96717 132192 196835 134255 86998 123500 69836 65106 111545 85947 18548 118105
19672 118105 151395 163471 138259 105484 84474 39331 20538 57048 139348 249465 254835
19661 254835 217016 108390 -51169 -20323 -8661 -5033 74090 137440 147613 244996 204432
19650 204432 132596 118087 63704 -44917 -24372 30648 122534 176979 112173 -29921 -55038
19639 -55038 7416 70634 110725 118636 78683 49113 68209 46458 56910 99365 141684 118752
19627 118752 103383 118249 202305 203860 170989 157467 127928 92726 58788 149836 157044 189965
19615 189965 269350 269791 196187 167206 113764 124854 102363 42250 5536 38226 62469 219333
19603B19333J9293p6964Q344N287l5690n3130M7684m6667l4485K3156N176R4049
19591A75386Q2386k8944j25274j0237L5187K930l5407j42129P2656L5095J0355
19580G2004J5044k1127O62N5946r096m6291n3784K9941J06065Q5954L3889M4779
19568C13986j2706j47565o5951J5911N4131N6249k0684r0200m2017L4841j0446
19557H5549O5519K2328j6968N0785j2031k9143l3121L0725k5341l6457n5455M0426
19545H6816L0653p044k1246k2881P0141O0096k6685j02169K2612K1667M1135l4597
19533A18498j4951L4706j7919J804J1897Q4641m3860q5747k1650J3571N1998M8263
19521A81251l9015J894p0092P6783J11827l2845p0287k415n344m0054J7569J6106
$$ plain form
19603 219333 238626 161662 170006 175293 139603 86473 134157 87490 53005 76161 81337 175386
19591 175386 257772 228828 103554 93317 128504 131434 96027 -46102 26554 61649 72004
19580 72004 87048 65921 66583 122529 113433 67142 13358 43299 149364 235318 269207 313986
19568 313986 301280 153715 87764 103675 157806 214055 193371 103171 61154 95995 85549
19557 85549 151068 173396 156428 207213 195182 166039 132918 163643 138302 101845 46390 86816
19545 86816 117469 110425 89179 66298 136439 196535 169850 67681 90293 111960 153095 118498
19533 118498 103547 138253 120334 122138 134035 218676 174816 89069 67419 80990 132988 181251
19521 181251 142236 144130 74038 150821 262648 229803 159516 157101 151757 111703 129272 145378
19509A45378J02326N9105q2153n6506k7871j1542M0522L0174k2803k4816Q5475
19498B37289K3452J4041K0151Q5022o8725n9112J6878M3495o4417r4354l0437
19487A23283K0044K2430R775J2170j3167k1259N4851R257J4487r212J06597L5234
19475C64490k0369r9781k1321O7355m691p0207k1061N9238O9860k2854P2939K6644
19463D00242L8105m0580r3482l053O0217J3397l6917L8350M7593j2612q223j5938
19451C87099L4855J5516R1406N2637J1553o9357k277M6014j1220k2310K703O4417
19439F01036m222j36665j0911N8573k0702M926N9466L0928J8145P2678p23m1652
19427F30877N9181o15o3438j32886J0517J23599P8497L9383n7428L0967R2399
$$ plain form
19509 145378 247704 306809 224656 168150 140279 128737 169259 199433 176630 151814 237289
19498 237289 260741 274782 294933 379955 311230 252118 268996 312491 248074 153720 123283
19487 123283 143327 165757 175532 187702 174535 153276 208127 217384 231871 222659 329256 364490
19475 364490 344121 244340 223019 290374 285683 215476 194415 253653 323513 300659 373598 400242
19463 400242 438347 397767 304285 301232 361449 374846 337929 376279 423872 411260 403037 387099
19451 387099 421954 437470 528876 581513 593066 523709 521432 567446 556226 533916 536619 601036
19439 601036 596814 460149 449238 507811 487109 492035 551501 582429 600574 673252 672529 630877
19427 630877 690058 689443 626005 493119 503636 627235 705732 745115 687687 718654 811053
19416H11053P8112M0318k3053r5336p835M1418P3577M1193j4377L9982J36598
19405A121650P1656K1829K8255J34235N8146K69257L76800M36775L52248L21598
19395C192449N7654p0564R4690K15466L92397L63527K32313J31200L7638L7457
19385D684227K84791M56766O65786R58247J083733J447397K013623K954044M302949
19376A8851563O722528J1035098J9111140L0138592L3836727K3068603J325057
19369A44089308j6464514k0034639o595882J3144643K3185604J5455093o185083
19362A46594530k6120498l4059698k7658607j8034177j0987057o932246m670216
19355A8132031l222411k272588j680037j251364j048006p57839k00775k1587K04255
$$ plain form
19416 811053 889165 929483 906430 811094 803259 844677 918254 959447 945070 985052 1121650
19405 1121650 1193306 1215135 1243390 1377625 1435771 1705028 2081828 2518603 2870851 3192449
19395 3192449 3250103 3179539 3274229 3489695 3882092 4245619 4477932 4609132 4646770 4684227
19385 4684227 4969018 5425784 6091570 7049817 8133550 9580947 11594570 14548614 18851563
19376 18851563 25574091 36609189 55720329 85858921 119695648 142764251 144089308
19369 144089308 127624794 107590155 100994273 114138916 137324520 152779613 146594530
19362 146594530 120474032 86414334 58755727 40721550 29734493 22802247 18132031
19355 18132031 14909620 12637032 10956995 9705631 8657625 7899786 7699011 7677424 7881679
19346G881679J51638j07085l75179m41187k98463J32850L59814L98447L09316
19337H011830Q126l26214l16950j7105K30498P28583Q06185J047638J370767K062944
19327A3606302L175885M773866P256249J1788244K0063209L2195988L7687874
19320A30547617K7514478M231780j6598953k2661653r004487J2450725K5032773
19313A51512280J8211163m618813k7446473l7792448l1710136k1071112j3087791
19306C3996670q465451n808262l844680k653397j965619j661462j382473j083280
19298G132046o95011l86834j88153k75291n67388o47633m63190k66379l3014N1845
19288C660998k9361q4518l67014n49167m20310k41639j99620r7408o9343j55132
$$ plain form
19346 7881679 8033317 7926232 7551053 7109866 6811403 6944253 7304067 7702514 8011830
19337 8011830 8019956 7693742 7376792 7359687 7590185 8318768 9124953 10172591 11543358 13606302
19327 13606302 16782187 21556053 28812302 40600546 60663755 92859743 130547617
19320 130547617 158062095 162293875 145694922 123033269 114028782 126479507 151512280
19313 151512280 169723443 165104630 137658157 99865709 68155573 47084461 33996670
19306 33996670 25531219 19722957 15878277 13224880 11259261 9597799 8215326 7132046
19298 7132046 6437035 6050201 5862048 5586757 5019369 4371736 3908546 3642167 3609153 3660998
19288 3660998 3631637 3547119 3180105 2630938 2210628 1968989 1769369 1671961 1602618 1447486
19278A447486p5196l2450q2160n2374l3068n7732p2211o8394l4176J77258J30990
19267A247973J50230K10784J99216N3065j14694j38791R1200M49190L48270P4467
19257B570910q9473j74453k15641m89733m06209k74887k19925r9961q4505l6218
19247D79905P338k2599p2164k3029P7496m2580m1680N7153L529l1031o6112J9899
19235C46125M9990J4526j9142n061n0927P3161J37162M7289j8158K04757M34843
19224A214565K75039J44300J01780k5592k23995m08747l83055k38358r4262p9481
19214B82194m185r0306n3255j9688p045K0983L4316J7814l0457O0703L7064j5207
19202B32931m2097p7797M4315N9243J17107q7493q2200o092J5258N0432Q195o5358
$$ plain form
19278 1447486 1372290 1339840 1257680 1205306 1172238 1114506 1042295 973901 939725 1116983 1247973
19267 1247973 1398203 1608987 1808203 1861268 1746574 1607783 1698983 2148173 2496443 2570910
19257 2570910 2481437 2306984 2091343 1601610 1195401 920514 700589 600628 516123 479905
19247 479905 487243 464644 392480 369451 446947 404367 362687 419840 423369 392338 326226 346125
19235 346125 396115 410641 391499 386438 335511 408672 545834 593123 574965 779722 1214565
19224 1214565 1489604 1633904 1735684 1710092 1486097 1077350 694295 455937 361675 282194
19214 282194 278009 187703 134448 114760 107715 128698 163014 180828 150371 211074 248138 232931
19202 232931 190834 113037 157352 216595 333702 246209 164009 157917 173175 223607 231802 166444
19190A66444j5388O3142J2402o2571j29206L8585J0529Q9832L5845l8599l6148
19179A34867R319j4018L1832P4448O437j4276l2999J1789j0954K271l5351r4660
19167F8705r6913N9702Q7194O0368m7073r141o0888N981O209R698P9464J3269
19155A76575j4557j9847L9562R6242L580o2362o7334J1272M2975P675m7835r3116
19143G2830j1378J24129M0050l1060L9304j4914k5446k5049q1519k3321O5708
19132A29334J1518j8032Q2208o4108p3735n378K2665N3500l4027m4761K6446r704
19120G5926K8558Q2520l3946N192o592K6598m9586n5253N5917q227n5068N5199
19108A21238K7123M7673l6394N1905K2663k4783m3329M95M9867n5404m2750J7115
$$ plain form
19190 166444 151056 214198 226600 164029 34823 73408 83937 173769 209614 171015 134867
19179 134867 144186 130168 162000 236448 242885 228609 195610 207399 196445 198716 163365 68705
19167 68705 -28208 31494 118688 179056 131983 122842 61954 67935 74144 83842 163306 176575
19155 176575 162018 142171 181733 277975 281555 219193 151859 163131 206106 213781 165946 72830
19143 72830 61452 185581 225631 194571 233875 218961 193515 168466 86947 63626 129334
19132 129334 140852 122820 205028 140920 67185 61807 84472 137972 103945 59184 85630 75926
19120 75926 104484 187004 153058 158250 151658 178256 128670 73417 129334 121107 66039 121238
19108 121238 148361 196034 159640 211545 234208 209425 166096 166591 216458 161054 118304 135419
19096A35419L3595M5412Q6939N7694M8225p5285j16110n795j0639k4122J4871
19085A90204M6564J8857L2715m1406n0455n7637l7862n8647O1922O9021N9644
19074B32920k3444m5941M8855M331L4993k7192N3101m6601M2227M5288K7327l0600
19062C15264p2856m9654O0984Q0480k7235j9111m1750n6384K3659L7557k7506
19051B23448n1171N7661k593L7535N4532M974n0868p4354L1565N8319J8902q9658
19039B18292L821o720l8472m82N7109Q9602Q7107n6751o1184j6033n1470n5216
19027A69603l8809o2674K7619M6483K2904L6156m6886J737J07159L0195p9380
19016B14107m2521k7676K2227M623k1041l6421N7996k4460m9606N7479Q2033q1681
$$ plain form
19096 135419 169014 214426 301365 359059 407284 331999 215889 210094 199455 175333 190204
19085 190204 236768 255625 288340 246934 196479 138842 100980 42333 104255 173276 232920
19074 232920 209476 163535 212390 216721 251714 224522 277623 231022 273249 318537 345864 315264
19062 315264 242408 192754 253738 334218 306983 287872 246122 189738 213397 250954 223448
19051 223448 172277 229938 227345 264880 319412 324386 273518 199164 230729 289048 307950 218292
19039 218292 222113 215393 176921 176439 233548 323150 410257 353506 292322 276289 224819 169603
19027 169603 130794 68120 95739 142222 165126 201282 154396 156133 263292 293487 214107
19016 214107 171586 143910 166137 170760 149719 113298 171294 146834 97228 154707 236740 155059
19004A55059n6679L008j04087k0325J792N3396O9739m4916j10139O4329Q4848
18993I6025M4720j5891N8128R1013L5385k3204J329N7914O3828K9523K3963R0827
18981E53560J45560K03311J35231l3792l61880j77553J3272p3866r0068j25759
18971A88016Q048L7615M439j3965j6457m5000J2338P9998J12597O358m436K3517
18959C93068N0153O4925L6862l9039n9098j2193N9303l9930m1999m8445P1256
18948D34863K8589o2842L224K9410m7608L2708M1630n1481N292J5253M0538j7661
18936D51915K26505K47128L36674M41264L09250k6872P980J00759J66946K172
18926B263721j70093l76255l85014k61791j45668j43339n2102J9040l3135j01018
$$ plain form
19004 155059 98380 101388 -2699 -23024 -21232 32164 101903 56987 -53152 11177 96025
18993 96025 140745 124854 182982 273995 309380 286176 287505 345419 409247 438770 462733 553560
18981 553560 699120 902431 1037662 1003870 641990 464437 477709 403843 313775 188016
18971 188016 196064 233679 238118 224153 207696 162696 175034 255032 367629 373987 369551 393068
18959 393068 443221 508146 545008 505969 446871 434678 493981 454051 412052 363607 434863
18948 434863 463452 400610 403834 433244 385636 418344 459974 408493 413785 429038 469576 451915
18936 451915 678420 925548 1262222 1703486 2012736 1985864 1993844 2094603 2261549 2263721
18926 2263721 2093628 1717373 1332359 1070568 924900 781561 729459 748499 715364 614346
18916F14346p4958R3664J13851q6670r4794R63O5519j7373Q376N3397j4164l471
18904F58686L7760M3487L1155o2944N1816J70147R8345M9414K09046K96836N06879
18893B090627M22275J04189j56932m00474m90208k62497m0520O3565P9782J95592
18883A605399L19961Q0162k20976l42807k22938j41235p4126k3010N3096O5721
18873A099247O139M3110K2302P9446J25212J27945J21854J87906K88534L63556
18863B465251K90977J78011J84487J43804J40795J68565M21116N66535M67354
18854E026895K85668R0821M1461n3311J06495M89676O15432P50637R76447J101521
18844I431742J389013K261735L854271O460310J1323817J9723963K7564950J9058036
$$ plain form
18916 614346 539388 633052 746903 660233 565439 566402 631921 614548 622924 676321 662157 658686
18904 658686 696446 739933 771088 708144 759960 930107 1028452 1077866 1286912 1583748 2090627
18893 2090627 2512902 2617091 2460159 2059685 1569477 1306980 1266460 1330025 1409807 1605399
18883 1605399 1925360 2005522 1784546 1441739 1218801 1077566 1003440 980430 1033526 1099247
18873 1099247 1105386 1148496 1170798 1250244 1375456 1503401 1625255 1813161 2101695 2465251
18863 2465251 2756228 2934239 3118726 3262530 3403325 3571890 3993006 4559541 5026895
18854 5026895 5312563 5403384 5444845 5391534 5498029 5987705 6603137 7353774 8330221 9431742
18844 9431742 10820755 13082490 16936761 23397071 34720888 54444851 82009801 101067837
18836A01067837N056075P450322Q393568m361993n373921N935241M636632o041534
18828A16762227k724580j072807j6992467k6220225k2319398j4436621q573505
18821B4422624n432959l604110k449823j619440r05765o25249n73202k20732k5870
18812H965474K8439K4685K02345L10364P5690j30421K3416K9865N0642J33306
18802I713805L52677M41566O02384R71463J556080K166770L127552M979752Q205735
18793C2117784J4569752K5494393L5350237K3846707O108606R587888J0129018
18786A57204385o951652q493765N317651M253721p575749l404452k462114k1880244
18778A16007781l2334247k7296544j7759655j0583705o721222m397496l130744
$$ plain form
18836 101067837 106123912 113574234 121967802 117605809 112231888 118167129 122803761 116762227
18828 116762227 114037647 112964840 95972373 69752148 47432750 32996129 24422624
18821 24422624 18989665 15385555 12935732 11316292 10410527 9785278 9212076 8991344 8965474
18812 8965474 8993913 9018598 9220943 9531307 9606997 9476576 9499992 9529857 9580499 9713805
18802 9713805 10066482 10508048 11110432 12081895 13637975 15804745 18932297 23912049 32117784
18793 32117784 46687536 72181929 107532166 131378873 137487479 147075367 157204385
18786 157204385 150252733 141758968 147076619 151330340 143754591 140350139 137888025 116007781
18778 116007781 83673534 56376990 38617335 28033630 21312408 16914912 13784168
18771A3784168k242871j492136r60202o14422j93801K0073k36296m33009m63511
18762G167993k65615l43737n22967n26841m38819k94199l12255k68636j38085
18753D056839l32740m66295m95954l07974j89988j59132r9212j61439j07275j97745
18743A539085q1564m2960j7069o9602l2670n0216J4033K4051p0495o7762J0246
18732A155077n1263n6613L3994Q9760m0114o3023M0628J8587p124p002j0626O5788
18720A168069J13350N2457M7062J51551J61048J49340K21947K27694J59101Q5575
18710B537194J0717R1761P2675J51761J33467J13325P2338n8555q1814J5412p4496
18699B983785j50869j52313l3799J13848K06911L11615N29245O34898O80103N13328
$$ plain form
18771 13784168 11541297 10049161 9088959 8474537 8280736 8300809 8064513 7631504 7167993
18762 7167993 6902378 6558641 6035674 5508833 5070014 4775815 4463560 4194924 4056839
18753 4056839 3724099 3257804 2761850 2453876 2263888 2104756 2005544 1844105 1736830 1539085
18743 1539085 1457521 1414561 1397492 1327890 1295220 1245004 1259037 1283088 1212593 1144831 1155077
18732 1155077 1103814 1047201 1081195 1170955 1130841 1067818 1108446 1127033 1119909 1112907 1102281 1168069
18720 1168069 1281419 1333876 1380938 1532489 1693537 1842877 2064824 2292518 2451619 2537194
18710 2537194 2547911 2639672 2712347 2864108 2997575 3110900 3183238 3124683 3042869 3058281 2983785
18699 2983785 2832916 2680603 2646804 2760652 2967563 3279178 3808423 4443321 5123424 5636752
18689E636752M77745L84564L10751L09566M88050O94269R89694J438453K098872
18680A2828716K868827M083375O119492J0022856J7993050L2512988M9706625
18673A36135929M4705104J7271068J683147J087153j7534338m2352655m4931045
18666I6064363l2502420j9687942j1592595p401087m955135l248911j958887j092424
18658A3624962n59533l81863k6132M02662L32935m1654k03685O222L30953N18567
18648A4003434R15041J526773K591329L983878O089653R740647J6565163K9477953
18640H4893871N0794309O4664536M2695619Q821807K700048n566330l7021404
18633B11982456n9501660n2185191l4513827k0184608j2287955q165607n550737
$$ plain form
18689 5636752 6114497 6499061 6809812 7119378 7607428 8301697 9291391 10729844 12828716
18680 12828716 15697543 19780918 25900410 35923266 53916316 86429304 136135929
18673 136135929 180841033 198112101 199795248 200882401 183348063 140995408 96064363
18666 96064363 63561943 43874001 32281406 24880319 19925184 16676273 14717386 13624962
18658 13624962 13065429 12683566 12657434 13060096 13393031 13351377 13147692 13153914 13484867 14003434
18648 14003434 14918475 16445248 19036577 23020455 29110108 38850755 55415918 84893871
18640 84893871 135688180 200352716 243048335 251870142 254570190 249003860 211982456
18633 211982456 152480796 100295605 65781778 45597170 33309215 25143608 19592871
18626A9592871l662860k574377j768030j330802j058964p81518m23731l64673
18618G627916o06094o04479m19432m20306o53987o88108m81749l57490j49649
18609C246622j10637J32480K36493J3118j04655j8944k04116l72850m17908l42344
18599B057259k49606k24812j90734j98862q8542n2692O881N6824j3665n4262r17
18588A046872L3117l7050P8938R2471m8332r9052n5618n0245k3859o788J699j340
18576I30813l1367j4729n2473k2298j7443n6575L3971M9848n8740r8412m5601
18565F16994L3169J6519M709r0900J0145L1395o5570r2904p7553M4301R8885J44592
18553F73782j03392l1927O1018n0568m0683O7157J7092J05508O9744j00357L2573
$$ plain form
18626 19592871 15930011 13355634 11587604 10256802 9197838 8416320 7992589 7627916
18618 7627916 7021822 6417343 5997911 5577605 4923618 4235510 3753761 3396271 3246622
18609 3246622 3135985 3268465 3504958 3518076 3413421 3394477 3190361 2817511 2399603 2057259
18599 2057259 1807653 1582841 1392107 1193245 1104703 1052011 1058892 1115716 1102051 1047789 1046872
18588 1046872 1079989 1042939 1121877 1214348 1166016 1066964 1011346 961101 937242 930454 932153 930813
18576 930813 899446 884717 832244 809946 792503 735928 769899 819747 761007 662595 616994
18565 616994 650163 666682 671391 580491 590636 622031 556461 463557 386004 430305 529190 673782
18553 673782 570390 538463 599481 548913 508230 575387 592479 697987 767731 667374 699947
18542F99947Q5896P7405N4451M9131J2959l0000m2630Q956J7688j4245o6963J6931
18530H69526M40j53498j07524J571r360j1225o3505p013O4142K959k7573L5892
18518E94832O7503l0917N2534J41172J33755N2509j4512q5443n6213j7620P4958
18507I12558R5407N9207Q519n096j5647L7252M227Q029L6958j185Q1281R3833
18495A315343J14715K218R052J30195K01954M73716N66563J45276p1097P1334
18485B959269N9331k46895l18912j34896Q1627K00586K54601J96856J45709J47001
18475C344277K98683L46437K53211M74750O33316Q71034J167586J666859K380617
18466A1436770L239076M337260O866467J1528942K0421393L6946802N9985393
$$ plain form
18542 699947 785843 863248 917699 966830 979789 949789 907159 916115 933803 919558 852595 869526
18530 869526 869966 716468 608944 610515 601155 589930 526425 519412 583554 586513 558940 594832
18518 594832 662335 631418 683952 825124 958879 1011388 996876 911433 855220 837600 912558
18507 912558 1007965 1067172 1075691 1070595 1054948 1092200 1096427 1104456 1141414 1140229 1221510 1315343
18495 1315343 1430058 1432276 1441328 1571523 1773477 2247193 2813756 2959032 2887935 2959269
18485 2959269 3018600 2771705 2452793 2317897 2399524 2600110 2854711 3051567 3197276 3344277
18475 3344277 3642960 3989397 4242608 4717358 5350674 6221708 7389294 9056153 11436770
18466 11436770 14675846 19013106 25879573 37408515 57829908 94776710 154762103
18459A54762103M8741361k0281179n3059118m6374955k9019459j6432775j0299331
18452B8036647o972726m696092k997366k102776j611457j025615o05853m09816
18444G614946m73974m66949k29117k09298l4625L04738L01023j23217j98950M1655
18434F526232K44460J73542k0311j46213P2302K47062J12816J61490J97813M22232
18424G991425P58748J029940J307128J771440K558265L390361M598756P130470
18416C0536533J1687923J9582747L3415671N3499224M7107683n87904j0872717
18409A84369160J6122390K5707743k5003265n4450410m8018134l0852034j7932677
18402D9942773j1257983p349390m421237k312027q80553J9862J235250K608606
$$ plain form
18459 154762103 203503464 183222285 130163167 83788212 54768753 38335978 28036647
18452 28036647 21063921 16367829 13370463 11267687 9656230 8630615 8024762 7614946
18444 7614946 7140972 6674023 6444906 6235608 6200983 6505721 6806744 6683527 6484577 6526232
18434 6526232 6770692 6944234 6923923 6777710 6850012 7097074 7209890 7371380 7569193 7991425
18424 7991425 8750173 9780113 11087241 12858681 15416946 18807307 23406063 30536533
18416 30536533 42224456 61807203 95222874 148722098 195829781 195241877 184369160
18409 184369160 200491550 226199293 201196028 146745618 98727484 67875450 49942773
18402 49942773 38684790 31335400 26914163 24602136 23721583 23741445 24976695 27585301
18394B7585301M501990P392549J2443632K2114333M0846833P1868449R1373655
18387B78126742N7773316P55149o3473439q4622004o5369023m0078351k2929396
18380F0182994j4109076r360744o322199m630096l373997k190612j307879p20306
18372A8168085k68601Q3241P07293J647252K421256L317114N045867Q022395J4055372
18363E3199274K5863058M3209943L9961611q349044l3331037k7207311r809465
18356H3537029R750647L3402816O1404920O2169882K5652261k3083936o4522947
18349A88310672o3600347m3850751k5827048j4981657r469488o183002m320002
18342B0078377l257225k809651k333607j751312j193883p25682l06362l2574M4608
$$ plain form
18394 27585301 32087291 39479840 51923472 74037805 114884638 186753087 278126742
18387 278126742 335900058 336655207 273181768 188559764 123190741 83112390 60182994
18380 60182994 46073918 36713174 30390975 25760879 22386882 20196270 18888391 18168085
18372 18168085 17899484 17982725 18690018 20337270 22758526 26075640 31121507 39143902 53199274
18363 53199274 79062332 122272275 162233886 153884842 120553805 93346494 83537029
18356 83537029 93287676 126690492 188095412 250265294 275917555 252833619 188310672
18349 188310672 124710325 80859574 55032526 40050869 30581381 24398379 20078377
18342 20078377 16821152 14011501 11677894 9926582 8732699 8007017 7700655 7668081 7712689
18333G712689R7792J76589l5989m94503q26881q85870n12093k44043k72485m69454
18323D245752o37877m86169k83389j91118k42227k32675j38317q3185m9403j14282
18313A787110r6245O6023J98669L13730L97119K60384J7173j56570k37393j27661
18303B422339j15731n6115l1623r9105j34859j76262q3799J08287l1655r8184
18293A703293r353o5544j94284k27640j88350j21962k6059r8024m7191m0895j00655
18282E83336j9719L1648j3355n9940n2982J8053k7798l3517m1698l9668j8298
18271C26062J8649m171k7441N4788L1229r37P494P208K0696O2890n411o9514L7792
18258D59334J81057J39344l870o4974K7694M8225n9899q2492N7780J14092n1749
$$ plain form
18333 7712689 7810481 7987070 7951081 7456578 6629697 5743827 5231734 4987691 4715206 4245752
18323 4245752 3607875 3121706 2838317 2647199 2404972 2172297 2033980 1950795 1901392 1787110
18313 1787110 1690865 1756888 1955557 2269287 2666406 2926790 2943963 2787393 2550000 2422339
18303 2422339 2306608 2250493 2218870 2119765 1984906 1808644 1724845 1833132 1801477 1703293
18293 1703293 1693940 1628396 1434112 1206472 1018122 896160 870101 772077 724886 683991 583336
18282 583336 563617 595265 581910 521970 468988 487041 459243 425726 384028 344360 326062
18271 326062 344711 340540 313099 367887 399116 398179 405673 412881 433577 496467 491056 421542 459334
18258 459334 640391 779735 775865 710891 738585 786810 726911 644419 702199 816291 764542
18247G64542n0874N6152P036j58508j17089j8477r5196K8379O9426j1139K2054
18236D96306j3028R3339k7055n2088n2006o2119K6033o9670l0845k5263K6626
18225C10230M2427p3137n6421k3257J2723J060j1110K7809J9556j9899L1475j6166
18213B45290o3017j9909j4100k6743k1103q568K6804Q4786j9543m5567n2507l8604
18201D7219n3691K5893Q2245Q6663L1262L8924o071o0045K1862l876M4206k0635
18189B33956R843j5451o1964j5764J8331M9033n483k6101L7970k3460j3203N1860
18177B39567L0960O678N635m6585o5906O6326j2281l5655J720R0591K6328j6354
18165B91024l6046j8253O2371k7125r8656K8917P9271o0372j435O2100M8080K752
$$ plain form
18247 764542 713668 769820 776856 618348 501259 482782 387586 415965 485391 474252 496306
18236 496306 483278 576617 549562 497474 445468 383349 409382 339712 308867 283604 310230
18225 310230 352657 279520 223099 199842 212565 213625 202515 230324 249880 229981 261456 245290
18213 245290 182273 162364 148264 121521 100418 91850 118654 203440 183897 138330 85823 47219
18201 47219 -6472 19421 101666 188329 219591 258515 252444 192399 214261 210385 254591 233956
18189 233956 243799 228348 166384 150620 168951 217984 212501 186400 224370 200910 187707 239567
18177 239567 270527 277205 282840 236255 170349 236675 224394 188739 190459 281050 307378 291024
18165 291024 254978 236725 299096 271971 173315 202232 281503 221131 219696 281796 329876 332628
18153C32628K3966K6952Q065N6458M8387m5564M6718L9510O2849J32983Q5103
18142H18055n6165q336n5642m4304N1521L0001O9308J74028J42041J24255J5329
18131A260091p20J14200R3965J40511K00426K54758K22771K26260K98775L84437
18121C195474M86839N41846O68781R08344J436405K031693K902486M178981O630279
18112B2981128J1592660K1776614M2615017P4321789N4635325l6457159o4822162
18105A26643212n0917339k8856445j5262767r121459n862552l770393k585172
18098A0267085j898971j516622j219525r61087o59287n65887m72276l29995j72551
18089B470884j63186k16331j86332j36057j00052r8453j54461j92422n6413Q6548
$$ plain form
18153 332628 356594 383546 391611 448069 496456 450892 497610 537120 599969 732952 818055
18142 818055 761890 753554 697912 653608 705129 735130 804438 978466 1120507 1244762 1260091
18131 1260091 1259371 1373571 1467536 1608047 1808473 2063231 2286002 2512262 2811037 3195474
18121 3195474 3682313 4224159 4892940 5801284 7237689 9269382 12171868 16350849 22981128
18112 22981128 34573788 56350402 98965419 173287208 227922533 191465374 126643212
18105 126643212 75725873 46869428 31606661 22485202 16622650 12852257 10267085
18098 10267085 8368114 6851492 5631967 4670880 4011593 3445706 2973430 2643435 2470884
18089 2470884 2307698 2091367 1905035 1768978 1668926 1570473 1416012 1223590 1167177 1253725
18079A253725K17767L25581K13478R2160K1124q5354j82483l10253l07980k32245
18069A005520j96534p1216n4774m7833j17971q3780m0081J14504J6033m839k1511
18058D97518j14144o731q8874o5659j4382j99l5059K1337K5214K1463M0245P4494
18046C55223N8358R5599K03667L19156J17245O1387Q7032J8847m7654k61059m07306
18035F00495k89310j43551L618J11349J350j5616j0452L5146l6869j62333l2977
18024F0850J8392j7434j5004L8087K1144J3920n6700k4216Q931l2186K5124k2701
18012A8207J14971P2127j9286j1781J3521Q634m3719L6574n069j11282q0844n122
18000a3069L8986L0824P827l9174K2619J8423o4744j5199k0856m0751k885o382
$$ plain form
18079 1253725 1471492 1797073 2010551 2102711 2123835 2038481 1855998 1545745 1237765 1005520
18069 1005520 808986 737770 682996 635163 517192 433412 393331 507835 523868 519029 497518
18058 497518 383374 376643 287769 222110 207728 207529 172470 193807 219021 240484 280729 355223
18046 355223 413581 509180 712847 1032003 1149248 1210635 1297667 1316514 1268860 1007801 600495
18035 600495 311185 167634 171252 282601 283951 268335 257883 293029 256160 93827 60850
18024 60850 79242 61808 46804 84891 106035 119955 63255 39039 47970 15784 40908 18207
18012 18207 133178 205305 186019 174238 187759 196393 152674 189248 184179 72897 -7947 -13069
18000 -13069 25917 56741 64568 25394 48013 66436 1692 -13507 -34363 -75114 -77999 -84381
17988h4381q9705n7914l2680Q3693Q4725N3296J3906O7670j0999j7451m3047P1746
17976C8859n4790l413R9983N9812J5809q1243n3867p0173L444K011L406j1007
17964e1169K8695N7558k9125r310l4703K4044O3866j8385m2977n2854M2560J7795
17952d005p8757j4998J18025J87886P8621o7291k9474K4330p098m0706J11923
17941B78456J26239K24495K91360k7288j81526k04673j21941l3936m8223p3730
17931B29233m8863l6371r6792l7405k8167q5595J3075L7635o2832N3285Q2553
17920A9756K6251l2952R76N8970Q589L2247K7732M1953P068j8874k8457r4118
17908D9141l4351l9069M2525o5013K9482J11824n1961m8170K4062J12064J05909
$$ plain form
17988 -84381 -174086 -232000 -264680 -180987 -96262 -42966 -29060 38610 27611 10160 -32887 38859
17976 38859 -15931 -19344 80639 140451 156260 75017 21150 -49023 -45579 -43568 -40162 -51169
17964 -51169 -22474 35084 5959 -3351 -38054 -14010 49856 31471 -11506 -64360 -21800 -4005
17952 -4005 -82762 -97760 20265 208151 286772 219481 190007 214337 207239 166533 278456
17941 278456 404695 629190 920550 893262 711736 507063 385122 351186 302963 229233
17931 229233 180370 143999 47207 9802 -18365 -103960 -90885 -53250 -116082 -62797 19756
17920 19756 46007 13055 14031 73001 81590 113837 141569 183522 190590 171716 143259 49141
17908 49141 14790 -24279 18246 -46767 -17285 94539 42578 -5592 18470 130534 236443
17897B36443P6040P4617J4079Q4659J48778L05521J37062m9649N3863J21460q7852
17886A115021k44956k30988k16332j09602l7870q4940N9356K4469l8179q998j070
17875B25911r9515l9453l591O2355K7834k8510K782m3825q9150M39m5361N6036
17863B5952R2533K1404o4533m8834K0260J2501m7885O7636J34832o5815q1271
17852F6780m5920M9359R9270J08718J60747K41796K35802K98194L39308K33058
17842A787112P4428n179k15199m71256m07738l57164p0726m9347j17395n5858
17832A11678K9834n0338j6416J0937P0737M6162L1466q6095P882N5871K7117k7203
17820B11632m5025k496j3491Q3986q917p3104P3040N8591N4882L34586N03883
$$ plain form
17897 236443 312483 387100 401179 485838 634616 940137 1077199 1027550 1081413 1202873 1115021
17886 1115021 870065 639077 422745 313143 275273 190333 249689 274158 235979 226981 225911
17875 225911 126396 86943 83352 145707 173541 145031 147813 103988 14838 15277 -30084 25952
17863 25952 118485 139889 75356 26522 46782 59283 11398 79034 213866 148051 66780
17852 66780 20860 70219 169489 278207 438954 680750 916552 1214746 1554054 1787112
17842 1787112 1861540 1856361 1641162 1169906 762168 405004 334278 284931 167536 111678
17832 111678 141512 91174 74758 85695 156432 202594 234060 147965 155847 211718 238835 211632
17820 211632 166607 164111 150620 234606 225689 152585 225625 284216 339098 673684 1177567
17809A177567K90279J05777j85726l19373l58386k72086j03965q6461j82803o3983
17799H40O904K5122r041m9249n3010q6936o9286Q4592O1623N139J9173l6239K5526
17786g4842O364O0142p8920P2924M0975N228n4951n9786k4247n1457m6129R3697
17774a11002O5111L6963Q6176j22186N669J536j6881M6139J814p8342J3878N9213
17762a1912J4140m0670j9982M689K6098L4875J6307r731n6640j9355L5152N5008
17750B7979P7794J4647o0351L8692k0097j83504j4998K9750n2014N5477P6342
17739a0283M4896j7690K5804m0369m5911j2133k4638n721L8552j7149K5005R7550
17727E7913R485Q612j22284q1155K5167K811m5500j5636J16289R5920O765o183
$$ plain form
17809 1177567 1467846 1573623 1387897 1068524 710138 438052 334087 247626 64823 840
17799 840 7744 32866 23825 -25424 -78434 -165370 -234656 -150064 -88441 -83302 -64129 -100368 -74842
17786 -74842 -68478 -8336 -87256 -14332 26643 31871 -23080 -82866 -107113 -158570 -204699 -111002
17774 -111002 -45891 -8928 77248 -44938 -39269 -37733 -54614 -8475 -6661 -85003 -71125 -11912
17762 -11912 2228 -38442 -58424 -53735 -27637 7238 23545 13814 -42826 -62181 -27029 27979
17750 27979 105773 120420 60069 98761 78664 -104840 -119838 -90088 -142102 -86625 -10283
17739 -10283 34613 16923 42727 2358 -43553 -55686 -80324 -86045 -47493 -64642 -39637 57913
17727 57913 67398 76010 -46274 -127429 -102262 -99451 -144951 -160587 -44298 51622 58387 52204
17715E2204M7093J3914K9990p4316J1898m8730m1288O370l0262l6274P2242M1505
17703D4346p7783Q4858K9488j2281j02817K2776N0247n6696n6349j8462R2166
17692e07Q0921q428j47661j10794J17836Q5097m076j975l0016Q798j8883J1907
17680a7781M986O1304L7877M8498N9816l2531k1333k2878n6943j8135N364j7871
17668C0373m0195m06o4844l6944J3609L1632L3969l2442o8527P6884l755M5583
17656a5063L415r0089J0286j7245k6360M8442J2844M9687k1767m9427k2117K303
17644a15091N2804j154L538j5225N4261j1995p6435k9370O3170Q3526K5784J888
17632C5701N3964m5428p4234M7071M4683m9625K1950p8278o3121j261l99O596
$$ plain form
17715 52204 99297 113211 143201 68885 80783 32053 -9235 -2865 -33127 -69401 2841 44346
17703 44346 -33437 51421 80909 68628 -34189 -11413 38834 -17862 -74211 -92673 -507
17692 -507 80414 71986 -75675 -186469 -68633 16464 12388 10413 -19603 -10805 -29688 -17781
17680 -17781 -12795 48509 86386 134884 194700 162169 140836 117958 61015 42880 48244 30373
17668 30373 -9822 -10228 -75072 -112016 -98407 -66775 -32806 -65248 -133775 -56891 -60646 -15063
17656 -15063 -11648 -101737 -91451 -108696 -135056 -86614 -73770 -24083 -45850 -95277 -117394 -115091
17644 -115091 -62287 -63441 -59903 -75128 -20867 -32862 -109297 -138667 -75497 8029 33813 35701
17632 35701 89665 44237 -29997 17074 61757 12132 34082 -44196 -107317 -108578 -108977 -102381
17620a02381J59n2522R8840l4304j4717L0146K3641j4181n9615q7407O449J02007
17608a03885J12409m5255p2300n0074L2475L9552M4461K6086n1432o593M7289
17597b7267k4890j6505m0352J7545j1730j989m6741J03006J05996L2230K9319
17586A18622K1122o0615n8071J7176m2837k8235l8703J319l6465M2861m2760J2021
17574i4565K2508p0346p387P8879O2485J4912L4877m3255N7653N1579q0043j07280
17562g9983o0867m083J03250J07758L2007r6839J9671j0233j5591j8569k3667
17551d7146j2429R395L7153j2919J4697R626K3508Q9922M8253k8661k850l0787
17539I7762m4165r271j9974P2945L6318m2641j05085l8251O9923O6929l2404n8019
$$ plain form
17620 -102381 -102222 -154744 -55904 -90208 -104925 -74779 -51138 -65319 -124934 -212341 -205892 -103885
17608 -103885 8524 -36731 -109031 -159105 -126630 -87078 -42617 -16531 -67963 -74556 -27267
17597 -27267 -52157 -68662 -109014 -91469 -103199 -105188 -151929 -48923 57073 89303 118622
17586 118622 139744 79129 21058 38234 -4603 -32838 -71541 -70222 -106687 -63826 -106586 -94565
17574 -94565 -72057 -142403 -149790 -70911 -8426 6486 41363 -1892 55761 107340 27297 -79983
17562 -79983 -140850 -144933 -41683 66075 98082 1243 20914 10681 -4910 -23479 -47146
17551 -47146 -59575 -50180 -13027 -25946 -11249 -1623 21885 111807 160060 131399 128549 97762
17539 97762 53597 44326 24352 97297 133615 90974 -14111 -52362 17561 84490 52086 -5933
17527e933K4778l6005l5819Q1836m7254p4379r4M7643K4892r3852o571Q4969J13382
17514G7593M9893k6435o5074m5241j9773l5286J1954q130L1067n8226K9571J2221
17502d5866N1696N8248n7p0159n6847k2981n7700K3753N7612J6953L1679p9403
17490i3072K4547J25471J6981r069j3597j5666K6830k6944n9269l5306J5648n5367
17478i8813K375P4797O3062M8941O4030j25791j12840k6072N0470M8454k3533
17467c4920l1923m8460N3060m2192L0107J03331k1427k4638o9091k0984J36416
17456B9279J61258o6821o0824p7935n5955J636L9278J16670J34937K1577Q2Q7486
17444C30668J24601K68420L74758K4288l10713l22897k58914m9357J7629r6690
$$ plain form
17527 -5933 18845 -17160 -52979 28857 -18397 -92776 -92870 -45227 -20335 -114187 -120758 -35789 77593
17514 77593 127486 101051 35977 -9264 -29037 -64323 -52369 -60499 -29432 -87658 -58087 -45866
17502 -45866 5830 64078 64021 -6138 -62985 -85966 -143666 -119913 -62301 -45348 -13669 -93072
17490 -93072 -68525 56946 73927 64858 51261 35595 62425 35481 -23788 -59094 -43446 -98813
17478 -98813 -96438 -21641 41421 90362 154392 28601 -84239 -110311 -59841 -11387 -34920
17467 -34920 -66843 -115303 -62243 -104435 -74328 29003 7576 -17062 -86153 -107137 29279
17456 29279 190537 123716 62892 -15043 -70998 -69362 -30084 86586 221523 243100 243182 330668
17444 330668 455269 723689 1098447 1122735 812022 489125 230211 180854 198483 101793
17434A01793k9494k7977j29021J8733J5023r1166j786K1719L2058O6990J39043
17423A15915M547p8800q1141n6269M0757p0986j2412O1792N8746K6091p5861j4784
17411h2405K2172J8863M7227J4773q584p0194l007P4191Q2415l3457n5391l0039
17399b3436K711n9945j0806o8433K3700J11534N9146L7494N9750p9058j05764
17388e3107J4286M9925K7666n7857r145J40571J4207j04351p1562O4957L0238
17377D5828M689N2422l7330j5222l179q3261L3780n9489N0114M016J4340o414
17365B94m9032n1700l4376k7115l731K6423K2215k4561O5583L9242J076m7580
17353h3262K3952K5788n0367o3317P000R3788L4593L1696l1655j16345J2854O5956
$$ plain form
17434 101793 72299 44322 -84699 -65966 -50943 -142109 -143895 -122176 -90118 -23128 115915
17423 115915 120462 41662 -39479 -95748 -54991 -125977 -138389 -76597 -17851 8240 -67621 -82405
17411 -82405 -60233 -41370 5857 20630 12046 -58148 -61155 13036 95451 61994 6603 -23436
17399 -23436 -20725 -80670 -91476 -159909 -136209 -24675 34471 71965 131715 52657 -53107
17388 -53107 -38821 11104 38770 -19087 -28232 112339 126546 22195 -49367 15590 45828
17377 45828 50517 102939 65609 50387 47208 -36053 -2273 -61762 -11648 -7632 6708 294
17365 294 -48738 -100438 -134814 -161929 -165660 -139237 -117022 -141583 -76000 -36758 -35682 -83262
17353 -83262 -59310 -33522 -83889 -147206 -140206 -46418 -11825 19871 -11784 -128129 -115275 -49319
17341d9319j2500j2617J1501q4164l5509P0569J36913q5377j41592j5595J12914
17330a04776L4158J9384M6147j345p1024n1448P4596L8839q14N5245n950r891
17318B3121m5509J289j4575o3405K4426M5360j3801l2697l0091n3208q034M0933
17306a26191M8677L0910L4454O5163M8502o7672p6162O1268M3943r9625l886m9036
17294h9655j5347r745J4606Q6076L3278P4497K6551l7681p9164r1487J4222M7853
17282b5996L0619Q885l8950m169M2903k8543m390k0565l8630P7883j1966l3857
17270d6776o9651q3446J13068Q1072o4010q7525R088M7294M6300M9824j6636J13016
17258I1618n8362j05925k2531q4468j7025J6716P7121N1310o1872r326N3926P997
$$ plain form
17341 -49319 -61819 -74436 -62935 -147099 -182608 -112039 24874 -60503 -202095 -217690 -104776
17330 -104776 -70618 -51234 -5087 -6432 -77456 -128904 -54308 -15469 -16283 38962 33012 23121
17318 23121 -22388 -21099 -35674 -99079 -74653 -29293 -43094 -75791 -105882 -159090 -167124 -126191
17306 -126191 -77514 -46604 -12150 53013 101515 33843 -42319 18949 62892 -36733 -40619 -89655
17294 -89655 -105002 -114747 -100141 -14065 19213 93710 120261 82580 3416 -88071 -73849 -25996
17282 -25996 4623 13508 -25442 -29611 13292 -15251 -19641 -40206 -78836 -953 -12919 -46776
17270 -46776 -116427 -199873 -86805 -5733 -69743 -157268 -148180 -100886 -54586 -4762 -21398 91618
17258 91618 33256 -72669 -95200 -179668 -196693 -179977 -102856 -51546 -113418 -122744 -68818 -60821
17246f0821k2758l912k3090j1204L5536r12L4071M5332L7682P4019m0540n6758
17234F645L5885K9858p1501k3530j4821n945o4874M567N8765Q90Q5664N6679k5776
17221G2506J8101N4069r1750m8222L6201k3920q2863J3312J11186N6167k9712
17210H5075n3465j3860J8315l225K0178k2590M7539j9468q0406p2085r2420M3938
17198a42474J38961L8306L8034m3903j7500q4662n688N3061R6189n0437j84631
17187a64744q2375L6969q3723P6553k0751O039P7629M2611K9544J23778j8342
17176B3188o8276p1663j7457M3806p273k0395K0612K3347L3779k1639n9748J879
17164a19840J5878N3445k9681k4658P9942M056L668K3506j32165O2817K6215j18403
$$ plain form
17246 -60821 -83579 -87491 -110581 -121785 -86249 -87161 -53090 -7758 29924 103943 63403 6645
17234 6645 42530 72388 887 -22643 -37464 -43409 -108283 -103716 -44951 -44061 41603 98282 72506
17221 72506 90607 144676 52926 4704 40905 16985 -65878 -52566 58620 114787 85075
17210 85075 31610 17750 36065 32840 53018 30428 77967 58499 -21907 -93992 -186412 -142474
17198 -142474 -3513 34793 72827 28924 11424 -73238 -78926 -25865 70324 19887 -164744
17187 -164744 -247119 -210150 -293873 -217320 -238071 -232032 -154403 -111792 -82248 41530 23188
17176 23188 -45088 -116751 -134208 -90402 -97675 -118070 -97458 -74111 -40332 -61971 -121719 -119840
17164 -119840 -103962 -50517 -80198 -104856 -24914 -20858 -17190 6316 -125849 -63032 -36817 -155220
17152a55220j0517l3650N2819J11428j0195J1577K0341n1006l7023j4147J7923
17141i7670j0798r0096M0908M4578J2086K8846M3104K9836J3403K7483N2628K3075
17129A17383r9403k2939k7975J4229J6603M5401p1364r9112K1059L0240J10513
17118C4635P7885M217n7256p3905m4335L9058L715l5071k8591Q0151K1508k0243
17106A768m0116J918l6361J635Q814P4138k0528J2937k0366j3914N3033O5670
17094H8628l1627n0453m1875J2023J2243k4867O4133J5048q6584n802k9284k2272
17082a00689J10763J4084p1632M775k7176j17089R119P7478L3484J06860l3791
17071F186P3880l2407r8191j1804J3804n7189M3920J09251J7771k4510j0289K0028
$$ plain form
17152 -155220 -165737 -199387 -146568 -35140 -45335 -33758 -13417 -64423 -101446 -115593 -97670
17141 -97670 -108468 -198564 -157656 -113078 -100992 -72146 -29042 794 14197 41680 94308 117383
17129 117383 17980 -4959 -32934 -18705 -2102 43299 -28065 -127177 -106118 -75878 34635
17118 34635 112520 116737 59481 -14424 -58759 -19701 -15986 -51057 -79648 503 22011 1768
17106 1768 -38348 -36430 -72791 -71156 -62342 11796 -8732 4205 -16161 -30075 22958 88628
17094 88628 57001 6548 -35327 -23304 -11061 -35928 28205 43253 -43331 -49133 -78417 -100689
17082 -100689 10074 24158 -47474 -42699 -69875 -186964 -177845 -100367 -66883 39977 6186
17071 6186 80066 47659 -50532 -62336 -48532 -105721 -61801 47450 65221 40711 30422 50450
17059E0450j1262j0092n7580l0668K8745J7120k1645n1700N5736J1996k9170n6547
17047a04617K9969m906p509k5465P6818R6996N3893J4639r9156j20128P1321P0440
17035E2295k7210m7768M2839M2228k6349q9868K8713P010j772n4300r422O848
17023g6756j3460Q2856N9756N038j9577l0681n7967O9774O9312l0056o0725m6355
17011d8841j1937N4879K5055O1956m4814n1670p0605J2514P7370O6018j5839r9637
16999d5551j7712J0540N3799n3353r0775L5875M4939O4324p7942r5711L0060J01327
16987d0180N2813M1412L3494m7447o1955k9431m7958j8248j4246J8722N9840K4082
16975b9102L0974O7923J4440q209k8584o2704L521M6873l3819L1180o4749P760
$$ plain form
17059 50450 39188 29096 -28484 -59152 -30407 -13287 -34932 -86632 -30896 -18900 -48070 -104617
17047 -104617 -74648 -79554 -87063 -112528 -35710 61286 115179 129818 30662 -89466 -18145 52295
17035 52295 25085 -22683 20156 62384 36035 -53833 -25120 -18110 -19882 -74182 -83604 -76756
17023 -76756 -90216 -7360 52396 57434 37857 7176 -50791 18983 88295 58239 -2486 -48841
17011 -48841 -60778 -5899 19156 81112 36298 -15372 -85977 -73463 3907 69925 54086 -45551
16999 -45551 -63263 -52723 1076 -52277 -143052 -107177 -62238 2086 -75856 -171567 -141507 -40180
16987 -40180 12633 54045 87539 40092 -21863 -51294 -99252 -117500 -131746 -113024 -53184 -29102
16975 -29102 1872 69795 84235 76026 47442 -15262 -11741 35132 1313 32493 -32256 -24496
16963b4496R5640Q5421q3343r6223J2895n1062o3379l9008O8338N8830l669M4786
16951D730O0985l0146K9388k1360J3160k0939o4105M9504K5898k6986P5196K9680
16939A25005m7419o1177m4629k8425Q2398J6310n3027J3356M8371M4647Q8789
16928A84199j20989q3799J7769n341L4232n0210m0094k6971M5720M8802K1432
16917B4750m280M9357m7988o2686m7545j8424J9118o515m576m9959L4818O9436
16905d4494P439J7224o098O798j7106l8139N6248P2397N2296J3014l3522n0233
16893C5824j7789j3142J2036o122m100k688l3992P0279L4372m1925N2316j2463
16881G2606k80l4243m6666k9939K3585j2875n2000O9683M4769O4097o0975M5624
$$ plain form
16963 -24496 71144 156565 73222 -23001 -10106 -61168 -124547 -163555 -95217 -36387 -40056 4730
16951 4730 65715 35569 64957 43597 56757 35818 -28287 21217 47115 20129 95325 125005
16939 125005 77586 16409 -28220 -56645 25753 42063 -10964 2392 50763 95410 184199
16928 184199 63210 -20589 -2820 -8161 26071 -24139 -64233 -91204 -45484 3318 24750
16917 24750 20470 69827 21839 -40847 -88392 -106816 -87698 -94213 -98789 -148748 -113930 -44494
16905 -44494 -37055 -19831 -25929 -19131 -36237 -74376 -18128 54269 106565 119579 86057 35824
16893 35824 18035 4893 16929 10807 6707 4019 -29973 40306 74678 32753 85069 72606
16881 72606 72326 38083 -8583 -38522 -14937 -27812 -79812 -10129 34640 98737 37762 83386
16869H3386Q0287N147k8936p21m1581K466m9987O0855P7121n2643k0865m0630
16857G3899p7679l1773M382j6812K7164K4308J105j2183P1288N1968p1672j35738
16845i1743k4769R821Q4242K7642L1641p219K6278m7537o2514m6104k1047N183
16833a16126N5504l2865m2258P6337O0796L0232j10367m8579K4766l77M2509M2076
16821a8352n129l0248q6716O2618J57054J9687r9903p3972j2800P2931m9998k4647
16809h9475O6019J32971n8673p4248L4896l6358l7505O6241J19040K4155j01353
16798D5710J6137n9497l2410J939L4311j1024K5107k9239q6054m7167N6278O4498
16786b1411k8165l0453N9420R1794k6873m5514n8564M758M3655N1429k3368n7854
$$ plain form
16869 83386 163673 168820 139884 139163 97582 100048 50061 110916 188037 135394 114529 73899
16857 73899 -3780 -35553 -31171 -47983 -20819 3489 4594 -7589 63699 115667 43995 -91743
16845 -91743 -116512 -106691 -22449 5193 36834 29615 55893 8356 -54158 -100262 -121309 -116126
16833 -116126 -60622 -93487 -135745 -59408 1388 31620 -78747 -127326 -102560 -102937 -60428 -18352
16821 -18352 -23481 -53729 -140445 -77827 79227 98914 -989 -74961 -87761 -14830 -64828 -89475
16809 -89475 -23456 109515 50842 -23406 11490 -24868 -62373 3868 122908 147063 45710
16798 45710 61847 2350 -30060 -28121 6190 -4834 20273 -8966 -95020 -142187 -85909 -21411
16786 -21411 -49576 -80029 -20609 71185 44312 -1202 -59766 -55008 -11353 40076 16708 -41146
16774d1146J2045j4811n558j560k1984n5421p4729p4454L9007O7033O757R9355
16762f5466O6512J3317k5240O7994N2083j6212L1578N5507k4170l7126l1162q2885
16750D730M20L372o9725l6594N8062K3463j7831p8521k9568N1815p2355R210O344
16737a47178J2319q4106L7399M1355J2530O5716P3965K6437o0911p829N0182P117
16725B6996m5791q0565K1137N7211k1056K5552N2340k637q7781q027J6861Q7401
16713D1641P66l4666j07674N3436q069Q5589L4039j9472p2485K1120J06014K7107
16701A27346j17851l0721K0400q6472l3980K5072P7100J7680N514m7746k9807
16690g3465j8519O4985J2425J2586j638O94k8110J6468L4686J4920L4930k5506
$$ plain form
16774 -41146 -29101 -43912 -49470 -51030 -73014 -128435 -203164 -277618 -238611 -171578 -164821 -65466
16762 -65466 1046 14363 -10877 57117 109200 92988 124566 180073 155903 118777 87615 4730
16750 4730 5150 8522 -61203 -97797 -39735 -16272 -34103 -112624 -142192 -90377 -162732 -153522 -147178
16737 -147178 -134859 -218965 -181566 -140211 -127681 -61965 12000 38437 -22474 -30303 19879 26996
16725 26996 -18795 -99360 -78223 -21012 -42068 -16516 35824 33187 -54594 -62621 -45760 41641
16713 41641 42407 7741 -99933 -46497 -54566 31023 65062 45590 -26895 -5775 100239 127346
16701 127346 9495 -21226 -826 -87298 -121278 -96206 -19106 -1426 4088 -43658 -73465
16690 -73465 -91984 -26999 -14574 -1988 -3626 -2932 -31042 -14574 20112 35032 69962 44456
16678D4456J5946j3018K4412M0431O392M485j10603p8038J3639k8341L9706O2420
16666B1887j08893K9389k389n6792K3774K6078M4499J4769K3496P3932n371k5570
16654E8809o8315o702l1704o2996M6938O719O0114J09483p3633j41848Q9784k7009
16642d0360k4653l4456P2264K1765m7386j2155M0940K6071n0061k6847J4495Q9013
16630B8630n5548o3254n1072M6337J04359M1763m5164k9589O0928l3143l4135
16619b9888O728L5895O3089k452n2667k4796l2518N4649L5406q939o3883o4260
16607h3636k4173K2495K4478N8219K5360L570Q397L0222L3735j3182m4336p433
16595C3716k0685k0698M1406K6895l2427l9134N6597L8438J1604m6641l8579O2520
$$ plain form
16678 44456 60402 47384 71796 112227 118619 123104 12501 -65537 -51898 -80239 -40533 21887
16666 21887 -87006 -57617 -60006 -116798 -93024 -66946 -22447 -7678 15818 89750 84379 58809
16654 58809 -9506 -16208 -47912 -110908 -63970 -57251 2863 112346 38713 -103135 -13351 -40360
16642 -40360 -65013 -99469 -27205 -5440 -52826 -64981 -24041 2030 -48031 -74878 -60383 28630
16630 28630 -26918 -90172 -141244 -94907 9452 51215 6051 -23538 37390 4247 -29888
16619 -29888 -23160 12735 75824 73372 20705 -4091 -36609 18040 53446 44507 -19376 -83636
16607 -83636 -107809 -85314 -60836 -2617 22743 26313 34710 64932 98667 85485 41149 33716
16595 33716 13031 -7667 33739 60634 28207 -10927 45670 84108 95712 49071 10492 73012
16583G3012K4066m9894r1518N230l2297M1305L3001m7103L9717O7544l2647j5088
16571A5328P3534N0949n0378m3015L794k3389o7126K0308N026k2382O5800J3968
16559D2417q356n24L2397J9649K5769L5210n086k3192L3656j03274K6291o465
16547F8492J0507l335n2356m3380q2868l2865M6498M529k1212Q156K4142N5937
16535a7755Q7187O1395n4675N4626k6243m0460k0279k567J4119p4601o133L3369
16523G983p5311J4965K3466o9156J4562j0664j26440L5048J37584R5851P6851
16512A24739n4228l0567O1326j0657m8786l7472K7446J7050k5228q902l9218M6981
16500B2484r340k9227K8885n6014o8175N5044J29980K4206o7721j24218n0143
$$ plain form
16583 73012 97078 47184 -44334 -39104 -71401 -30096 2905 -44198 -4481 63063 30416 15328
16571 15328 88862 139811 89433 46418 50212 26823 -40303 -19995 -14969 -37351 28449 42417
16559 42417 34061 33537 65934 85583 111352 146562 141476 118284 151940 48666 74957 68492
16547 68492 78999 75664 23308 -20072 -102940 -135805 -89307 -84778 -105990 -97834 -73692 -17755
16535 -17755 69432 130827 76152 130778 104535 64075 43796 41229 55348 -19253 -25386 7983
16523 7983 -67328 -52363 -28897 -98053 -83491 -94155 -220595 -185547 -47963 47888 124739
16512 124739 70511 39944 101270 90613 41827 4355 31801 48851 23623 14721 -24497 22484
16500 22484 13144 -16083 12802 -43212 -111387 -56343 73637 97843 30122 -94096 -144239
16489a44239j1334M1669M0898m2622k3712K6029L1310m5066R66K2738J61163l1638
16477B6162p8321k4445Q8419Q9273P80q7439l6989K5204K6289j8689N3161q870
16465E4535l7474J2488k4930N937k4708j7474J262K1151L3167N1792o385m5601
16453B3760l1960o2529j2401O8332J3758l4067k3828k7802N342L7908L4186N6069
16441D6768q699N5706L2566n0358o8597N040J0751j2352R1167l992q0430l7155
16429a9585J7958O6124R0475K7777j999L5242m5674j34065j16518O8670O7105
16418E5510J229K9618j8680j9019n9999j4905k9526m6897P5939K9948j7088o558
16406b0428K8499R669j0859p4819O0686N5347k5424k0639O6670m2306L3471J3033
$$ plain form
16489 -144239 -155573 -113904 -73006 -115628 -139340 -113311 -82001 -127067 -126101 -103363 57800 26162
16477 26162 -52159 -76604 11815 101088 101868 14429 -22560 2644 28933 10244 63405 54535
16465 54535 17061 29549 4619 10556 -14152 -31626 -30364 -9213 23954 75746 69361 23760
16453 23760 -8200 -70729 -83130 -14798 -1040 -35107 -58935 -86737 -81395 -43487 -9301 46768
16441 46768 38069 93775 126341 75983 7386 12426 23177 10825 101992 98000 17570 -19585
16429 -19585 -1627 64497 154972 182749 180750 215992 170318 36253 -80265 -11595 55510
16418 55510 56739 86357 67677 48658 -11341 -26246 -55772 -102669 -26730 3218 -13870 -20428
16406 -20428 8071 17740 6881 -67938 -7252 48095 22671 2032 68702 26396 59867 72900
16394G2900m2299q3381L1632J22247J06704r0017p5773l7040k1685m641n5720
16383g7073o5002K0382K2369q331l4108q593P1455N4856J663k6190J2182J465
16371c4925K9144P2311Q6051j8716m7284l4225l7089m9028L452o0285n6931Q585
16359a38940L8373O0782K8133K6249m9841l7319l3739R910J39659j7363j6220
16348I684L6989l433n0433k3761M9650P280L2866K4358N66O463n3207J7120O9127
16335A23269Q3491m5930k1266r5342m7968L0602N3487L914q3152j3736L7230K0675
16323D5274Q6699L6095K6906N4727K8758m0988q6318j332K2569k8731l6267n6109
16311E1283o1966j5963O3883L3329K559p6040j8081L0607k7247Q464K703k5009
$$ plain form
16394 72900 30601 -52780 -21148 101099 207803 117786 42013 4973 -16712 -21353 -77073
16383 -77073 -142075 -121693 -99324 -107655 -141763 -150356 -78901 -24045 -22382 -48572 -36390 -34925
16371 -34925 -5781 66530 152581 133865 86581 52356 15267 -33761 -30309 -90594 -147525 -138940
16359 -138940 -100567 -39785 -11652 14597 -35244 -72563 -106302 -96392 43267 25904 9684
16348 9684 46673 43240 -7193 -30954 18696 25976 58842 83200 83766 90229 37022 54142 123269
16335 123269 206760 160830 139564 44222 -3746 26856 80343 84257 1105 -12631 24599 45274
16323 45274 131973 168068 194974 249701 278459 237471 151153 149821 172390 143659 107392 51283
16311 51283 -10683 -26646 37237 70566 73125 -2915 -20996 9611 -17636 -9172 -6469 -31478
16299c1478J1681O1289O2286o1531m9858r656R664N1522K6271m8658K6421J01415
16287A49368m4104n5092m0216o886j1839j258l4570J34731M3806k5216J1054J6453
16275A36231o50n7376O3537P1554L0191p7865j03501l8830j4033Q482p189o0770
16263e0219J6682O3433J5740N1600P4299j7088q8382o7578j4849J9086N3653M943
16251F1320l307K3852m838j1789K9677M0252L5978j3859m287m6162l8984N415
16239G3268J382J5038J6193K2729m8710p2933n685L6025J10521N1223o1449q1026
16227E6576j00610K3048N2063P1949O3108M945n8065m9212n2977k7186L5325P8749
16215I7713J4526k0455m4688N4533K6939j41688O655R0457L189m416M6163j15647
$$ plain form
16299 -31478 -19797 41492 103778 42247 -7611 -17267 -7603 43919 70190 21532 47953 149368
16287 149368 105264 50172 9956 3070 -8769 -10027 -44597 90134 133940 108724 119778 136231
16275 136231 135581 78205 141742 213296 243487 165622 62121 23291 9258 17740 10551 -50219
16263 -50219 -33537 29896 45636 97236 171535 154447 66065 -1513 -16362 2724 56377 61320
16251 61320 58013 81865 77027 65238 94915 135167 171145 157286 152999 106837 67853 73268
16239 73268 74650 89688 105881 128610 79900 6967 1282 37307 147828 199051 137602 56576
16227 56576 -44034 -20986 31077 103026 166134 171079 113014 63802 10825 -16361 18964 97713
16215 97713 112239 91784 47096 101629 128568 -13120 -6465 83992 87181 82765 128928 13281
16203A3281o1581R7437J8417M0834m7183m7866M7169l6260n5969P1106R8870p5224
16191F3031r2946k6289o0156R5435m3736j5374P1754l607n704L8340J00037L705
16179A24490r2517l1224R7856k8103r2050q934M2261L5673K8358k9359M2741l1305
16167E7887O3007O187j16363l9047K8946P6040J0622j6501p6882j20269N1834
16156g4539L0012K228J2846O39J6288K7296N956K52L3616J3294L3338o057O2442
16143A57611o961o7740j07834J6483L0049p238l8185L0428m5424K4011L6811q633
16131A3378O5098L2710k7415j21994O2605q43j2838n6441L7419K2898o7247K187
16119e0483N2520j6182N4305J2303m2342K6898J2234L1486P194j1583l0795K2923
$$ plain form
16203 13281 -48300 49137 67554 108388 61205 13339 60508 24248 -31721 39385 138255 63031
16191 63031 -29915 -56204 -116360 -20925 -64661 -80035 -8281 -11888 -17592 20748 120785 124490
16179 124490 31973 749 98605 70502 -21548 -30482 11779 47452 75810 46451 89192 57887
16167 57887 120894 127081 10718 -28329 617 76657 87279 70778 -6104 -126373 -74539
16156 -74539 -44527 -42299 -29453 -28814 -12526 14770 20726 20978 54594 67888 101226 95169 157611
16143 157611 150650 82910 -24924 -8441 21608 14370 -23815 6613 -38811 -14800 22011 13378
16131 13378 78476 111186 83771 -38223 24382 23539 10701 -45740 -8321 14577 -52670 -50483
16119 -50483 2037 -14145 40160 52463 10121 37019 49253 80739 87933 76350 45555 68478
16107F8478J3854O735L1857j9581P6975J04197j10963p0754K2959Q1753q4897
16096A20613n0671L6825P6693M6809q2466n9713K7345o4410m0833N1400n3614
16085G978Q295r976J2596n4164n1871L4253M3289O6384m2402O068N3212j5361
16073E8301k8868N4806K018k935N7259J2617j214N5944q5830o1922J04248J1649
16061A76073o9651o1375l250m30l1980p31L3175l7174M7867L192r7976j7446k9841
16048h9547k9823J11332M7791Q8748M5258k8150J9412P079r0735q2362k7063N2358
16036B4298J5186q135p0557J9464L5592P9697k994p5993l8967N396J8465k8721
16024b7269j4432P6879R742m8435J9364l265P4185K1628k111J9523K3824k1343
$$ plain form
16107 68478 82332 89067 120924 101343 178318 282515 171552 100798 123757 205510 120613
16096 120613 69942 106767 183460 230269 147803 88090 115435 51025 10192 61592 7978
16085 7978 16273 6297 18893 -35271 -87142 -52889 -9600 56784 14382 20450 73662 58301
16073 58301 29433 84239 86257 83322 140581 153198 151984 207928 122098 60176 164424 176073
16061 176073 106422 45047 41797 41367 9387 8656 41831 4657 52524 55716 -42260 -59706 -89547
16048 -89547 -119370 -8038 39753 128501 173759 145609 165021 172100 81365 -997 -28060 24298
16036 24298 39484 31349 -39208 -19744 15848 95545 92551 16558 -22409 -17013 1452 -27269
16024 -27269 -41701 35178 44920 -3515 15849 12584 86769 108397 106286 125809 149633 128290
16012A28290j3898p0909q1932n8346l8759Q7787J08075m5582k9594M1466N972
16001C2570L9934L2970o0442p8488k5740O6844K0938O676M3575P8995J3389m4262
15989A26959q7831o2008O9372J3496n5191o6267P5077M541o9636L4897O7485K9452
15977H0346j7286n2296n223L487O1858n871j8308n2293J5886R7378L6391K0189
15965A64258K5504j0423m0555n8383k6506o5377O1160J4831l7490K6712L0403
15954H4134J2287n4016m7149M5428K107J4004L9924m5841k7841P1121R503l8041
15942F5620l6238L7577K2571N1610r3248N710L483l3420O134l1717q7036j8619
15930a07573J5246P2585P7193O1027J3740L4377n1423j951J951N908K5815L0067
$$ plain form
16012 128290 114392 43483 -38449 -96795 -135554 -47767 60308 14726 -14868 26598 32570
16001 32570 72504 105474 45032 -33456 -59196 7648 28586 35262 78837 157832 171221 126959
15989 126959 39128 -22880 46492 59988 4797 -61470 13607 18148 -51488 -16591 50894 80346
15977 80346 63060 10764 5541 9028 70886 65015 46707 -5586 10300 107678 144069 164258
15965 164258 189762 179339 138784 80401 53895 -11482 49678 64509 27019 53731 84134
15954 84134 96421 42405 -4744 40684 42791 56795 96719 50878 23037 94158 103661 65620
15942 65620 29382 66959 89530 141140 47892 53602 57085 23665 29799 -1918 -88954 -107573
15930 -107573 -92327 -19742 57451 118478 132218 166595 115172 113221 115172 121080 146895 176962
15918A76962l0446q0597j19285l3639P1524R2569P6392l576K66k2172j4330o0034
15906E3634K3866q8733r100L0833O5522k651k4965K4220M2163n613m7612q1674
15894b0110m1673m1970J2031j0998J10133N0832K704J8903M7751k5548j7465J8044
15882A02634K2252L5258n5413m019J1079n9040m3562j5779J08863O8074j24606
15871D5741J8834K1283j6759N3458K4491N256q6869L039M8133k865n3159J1645
15859G2228k2841o4755K1376L1082j7890J4786N0954q766q7706o1027k0260J17474
15847B4655J0674o5631K3861K7059M1334l492K4557M5002k7367o2446o554J4940
15835D6592J07712L1676n7916q8899J1585o470N419j6361L4652O6133P2885l2429
$$ plain form
15918 176962 146516 65919 -53366 -87005 -15481 77088 153480 149904 150170 127998 113668 53634
15906 53634 77500 -11233 -20333 10500 76022 73371 48406 72626 114789 109176 61564 -20110
15894 -20110 -61783 -103753 -91722 -102720 7413 58245 60949 79852 127603 102055 84590 102634
15882 102634 124886 160144 104731 100712 111791 52751 9189 -6590 102273 170347 45741
15871 45741 64575 85858 69099 122557 147048 152304 65435 68474 116607 113742 60583 72228
15859 72228 49387 -15368 6008 37090 19200 33986 84940 76174 -11532 -72559 -92819 24655
15847 24655 35329 -30302 -6441 20618 61952 58460 83017 128019 100652 38206 31652 46592
15835 46592 154304 185980 128064 39165 50750 44280 49699 33338 67990 134123 207008 174579
15823A74579l8252L6822k96p2780r7069k1604j3620j01849L5458J17875N1090
15812G0354p5711M7016K4670m1553L0937P2553J18841p1390j15751j8522L237
15801D4681m0494l1305Q0254j5311m214m3296l71O976p1627q574N0330k1396M1228
15788a3119M6315l6957m7369K398L6983o2835l8142N8177o0369l88O7541Q3864
15776C6099K0810r6629l0862N0m6041R6149P9853O2375N8653r4319k7774n0094
15764H270P0277M0584m5269K6987J1558n1517q6547j9065J12286N7811r326k08
15752A15841p0r6097N0839P5920n513m6789j08940p3933Q9581N1254l163O8210
15740A17140J3993j30548n6289M2113J22983K4751p1408k8753m3075n3335m048
$$ plain form
15823 174579 136327 173149 172853 100073 3004 -18600 -32220 -134069 -98611 19264 70354
15812 70354 -5357 41659 66329 24776 55713 128266 247107 175717 59966 41444 44681
15801 44681 4187 -27118 53136 37825 33611 -9685 -10056 -3080 -74707 -83281 -32951 -54347 -13119
15788 -13119 33196 -3761 -51130 -48732 -11749 -74584 -112726 -54549 -114918 -115306 -47765 36099
15776 36099 56909 -39720 -70582 -70532 -116573 -20424 59429 121804 180457 86138 58364 8270
15764 8270 78547 119131 73862 100849 112407 60890 -25657 -44722 67564 125375 116049 115841
15752 115841 115771 19674 70513 146433 140920 94131 -14809 -88742 839 52093 48930 117140
15740 117140 131133 585 -55704 -13591 109392 134143 62735 33982 -9093 -62428 -66476
15729f6476j5126k5803j03421Q1250J12285J3637j1433l5859k2847Q0888O2525
15718F9620P0856J6979K7593R3484k4169j27917R815l5792k2849o1210j8070R4816
15706I3156Q1654l8797p9744j8145J08104L5217n4048n9028K9725K0623K7468
15695A46185L9476O15L5075P2800p9714j42307N6001J020k1005P0822O0620n6221
15683A83367r9910q2069Q6359N0865K462N6728L5457l9799l365m2531r880J9897
15671A57581o2917N663j15761L9397n2543p4349J8772J17907Q7779M2387r7343
15660F6573j9878k5271r483K7323J9801m0487J5996J2989J7221J9811k4314J4881
15648G5162n9225J9001O1536p239L2036J8120O7587p425j31927k2595o2573n1592
$$ plain form
15729 -66476 -81602 -107405 -210826 -129576 -17291 -3654 -15087 -50946 -73793 7095 69620
15718 69620 140476 157455 185048 278532 254363 126446 136261 100469 77620 16410 -1660 93156
15706 93156 174810 136013 56269 38124 146228 181445 127397 68369 98094 118717 146185
15695 146185 185661 186276 221351 294151 214437 72130 128131 129151 108146 178968 239588 183367
15683 183367 83457 1388 87747 138612 141074 197802 233259 193460 190095 147564 137684 157581
15671 157581 94664 100327 -15434 23963 -28580 -102929 -84157 33750 121529 163916 66573
15660 66573 46695 21424 11941 39264 59065 18578 34574 47563 64784 84595 60281 75162
15648 75162 15937 34938 96474 89235 121271 139391 206978 199553 67626 45031 -17542 -69134
15636f9134L5115J7179K3433p385K2734j6808l4259O0670k9159k6662q1713K9316
15624g6673l8843n4404k0595P7718J11043j300L4474n9864N7808J1617O4317K3260
15612A28558o7279r8802k9925R381j1788N540L3857K9192K3199r211L159K1156
15600C7037p6622L5382j8619J8649l4898N8561J2493n7480J6853J4878k0647o150
15588b0563n563l3288l1771J9686J100O535k754N2878J06006L9092j17343j01427
15576h7412M2772J08370L0237j2905R5586l6880j04850n3769j1337K9922N4169
15565E3903n1145j6637R2771J4177j3331n5771m5839K5577L6483M3376K781K8784
15553A15129K0326M7820n3733j00921K6441l0502l103M6383K0013n9178J7304
$$ plain form
15636 -69134 -34019 -16840 6593 -792 21942 5134 -29125 31545 2386 -24276 -105989 -76673
15624 -76673 -115516 -169920 -190515 -112797 -1754 -3054 31420 -28444 29364 40981 105298 128558
15612 128558 61279 -37523 -67448 -58067 -69855 -64315 -30458 -1266 21933 12722 15881 37037
15600 37037 -39585 -4203 -22822 -4173 -39071 19490 31983 -25497 -8644 6234 -14413 -20563
15588 -20563 -26126 -59414 -91185 -71499 -70399 -63864 -66618 -13740 92266 131358 14015 -87412
15576 -87412 -44640 63730 93967 81062 176648 139768 34918 -18851 -30188 -266 53903
15565 53903 2758 -13879 78892 93069 79738 23967 -21872 3705 40188 83564 86345 115129
15553 115129 135455 183275 129542 28621 55062 24560 21457 67840 87853 28675 45979
15542D5979O6440r2934m9142L8433P5337l5542j5463M7286L9398Q0966m4201j18342
15530C8215k8240q4537P0960P9650r760j6051M7838j6734q6918o6595p6029m9191
15518a97392k9409O8466N3956K3228K6151m2007j6364M5318k6561P0270O8279
15507D3935J3986R1738j5690n7524m3509K3277M4900n7985m3645n1247n3461l3744
15495a38969j432j5571L2084L5381P9158M3165Q9214R475J1416J0425p2241j08396
15483b6291l0728R7177J24622m6004p3428j15452K6680n530k2916j8938K0258
15472g0550l3914O0266K3790J01165M2465o9950r3000J7934Q8159N6934p584l3324
15460H2391J6087n5950o0031J00256Q2154o2038j18470p8857M7060K5846O8941
$$ plain form
15542 45979 112419 19485 -29657 8776 84113 48571 33108 80394 119792 200758 156557 38215
15530 38215 9975 -74562 -3602 76048 66288 50237 98075 81341 -5577 -72172 -148201 -197392
15518 -197392 -226801 -158335 -104379 -81151 -55000 -97007 -113371 -68053 -94614 -24344 43935
15507 43935 57921 149659 133969 76445 32936 56213 101113 43128 -517 -51764 -105225 -138969
15495 -138969 -140401 -155972 -123888 -88507 -9349 33816 123030 132505 143921 154346 82105 -26291
15483 -26291 -57019 40158 164780 118776 45348 -70104 -43424 -48954 -71870 -90808 -70550
15472 -70550 -104464 -44198 -20408 80757 123222 53272 -39728 -21794 66365 123299 115715 82391
15460 82391 98478 42528 -17503 82753 164907 102869 -15601 -94458 -47398 -21552 47389
15449D7389N9055L4873m8233n8331o5620K3880j2388j6730j9998L1699J9156J2303
15437G055q0897K1185M1067J1103m9581n5738p2402O1112J9895P6527J0904m842
15425a4612M4492P5072j3809N133m6468l1159l0959l3888J5322K9469o9285m8767
15413a19459O2727L9251R2919L1814J5255l7426q9881k8712R3942L6295J3913
15402A10638O807K142p0515K8326M2692j26003L0957J1391N327l942K3657r634
15390E1843q795k380J3866o6651j6537K3479N8734P371j4364o0988R0625N9362
15378A35565n0290n853O533o2279j21842n3769O4713K1854k0360q177k320J13840
15366A7615Q5525l0160j15496K3156J19126K211o1385m6211m6368O960M3512L2761
$$ plain form
15449 47389 106444 141317 93084 34753 -30867 -6987 -19375 -36105 -56103 -24404 -5248 7055
15437 7055 -73842 -52657 -11590 -487 -50068 -105806 -178208 -117096 -97201 -20674 -9770 -14612
15425 -14612 29880 104952 91143 96276 49808 18649 -12310 -46198 -30876 -1407 -70692 -119459
15413 -119459 -56732 -17481 75438 107252 122507 85081 -4800 -33512 60430 96725 110638
15402 110638 117445 119587 49072 77398 120090 -5913 25044 36435 41762 37820 61477 51843
15390 51843 43048 40668 54534 -12117 -28654 -5175 53559 60930 46566 -14422 76203 135565
15378 135565 85275 79422 85955 23676 -98166 -151935 -87222 -65368 -85728 -93905 -96225 17615
15366 17615 103140 72980 -42516 -19360 99766 101977 40592 -5619 -51987 -45027 -1515 31246
15354C1246J1433k0852J02308j5065k7632M4203L8561q3087l1222l9373j5296
15343d776L1724L8909N678k8237j1616j4443o5136L154J09400M0546q4620p6835
15331e6252O283R512J2830M5640J8586N3169q105J10030j2601j51371p4362J3958
15319c2683l1156m775N802L722k2946P3292J0240n897p4402N699K6661k5915l7595
15306a09953P1035L2086j38306m4773J1031R2625P7544M4990J6505m9961K685
15295E508J93K2061Q743M6967M8181p1161m1267L645k7272Q085p99m8585Q364
15282c7337j4772P3468J1806M934j7071m7068N0829M1295m5387j3665j250L9304
15270D5086l9421j35147K123q19P3853p512m1980O9622Q2531J495m5804O0466
$$ plain form
15354 31246 42679 21827 124135 109070 81438 125641 164202 81115 49893 10520 -4776
15343 -4776 26948 65857 71535 43298 31682 17239 -47897 -44743 64657 105203 20583 -56252
15331 -56252 -49969 -40457 -27627 18013 36599 89768 81663 191693 179092 27721 -46641 -32683
15319 -32683 -63839 -68614 -62812 -59090 -82036 -8744 1496 -4401 -78803 -73104 -46443 -72358 -109953
15306 -109953 -38918 -6832 -145138 -189911 -178880 -86255 -8711 36279 52784 2823 5508
15295 5508 5701 27762 36505 83472 131653 60492 19225 22870 -4402 3683 2884 -45701 -37337
15282 -37337 -52109 21359 33165 38099 21028 -26040 24789 66084 20697 7032 5782 45086
15270 45086 5665 -129482 -127359 -128178 -54325 -61837 -103817 -34195 48336 49831 4027 64493
15258F4493J5667j0432O2074j8565n2853j1942J3072m4269n2591K2798l2353m9609
15246i4510L6857L0964J5498J4488O7471K5087p4183l7335l1784O229L7713k2747
15234b6252K252O2820N9382k9989j9547n8692n5697p4984K9800N1108L8618K9694
15222H513N8420N2396o0397q6486p3436j5430J16139K8863q347N635R237J2342
15210D7449J399j0672K6097k6334j9539M8414K1464K1804O9852p1748m1814P0215
15198A36587k4092j5488m3673m6221j2286J0187O8078N9614n7845q8093J7229
15187C997k4689q1909J7456K5421J5510J1642l5039j6667J08436N465l8291j8054
15175b6722j4919J8148j9797l8165q806K534N3437o7068K2404K5944L5212R653
$$ plain form
15258 64493 80160 69728 131802 113237 60384 48442 61514 17245 -35346 -12548 -44901 -94510
15246 -94510 -57653 -26689 -11191 3297 70768 95855 21672 -15663 -47447 -41218 -3505 -26252
15234 -26252 -24000 38820 98202 68213 48666 -10026 -65723 -140707 -110907 -59799 -21181 8513
15222 8513 66933 119329 58932 -27554 -100990 -116420 -281 28582 20235 25870 35107 47449
15210 47449 48848 38176 64273 37939 18400 66814 88278 110082 179934 108186 66372 136587
15198 136587 112495 97007 53334 7113 -5173 5014 73092 132706 74861 -13232 3997
15187 3997 -20692 -102601 -85145 -59724 -44214 -32572 -67611 -84278 24158 29623 -8668 -26722
15175 -26722 -41641 -23493 -43290 -81455 -90261 -87727 -34290 -101358 -78954 -53010 -17798 -8145
15163h145m162l728q941J25402J2703n7960q7518l0824k0041k597j6934J0482
15151i2263L0017P0112k6387k8672n9358q3419Q0498N3669n446m0710M5948L5414
15139b0597m513j05062O6061Q2222M3525L7244k8321p5613n090J1903L2838L125
15127C7722m9727j3552m4918m4883Q1835O5810L4548J0329k1824k0742j11785
15116g7187k8311J05276j3359J3050k1478j4798J1228L5030J3860L9937J6102
15105G9350K5120J7405j77508r9467M9400l4443M1441m0477Q275K6332k8276J7581
15093a15267N6995L8386J8612N1656M337J8074k6734K463M5552P8704L7737L0449
15081B40964Q134q4092o3089q824L0605J6368j08946l8424J1949o9368l4028O9090
$$ plain form
15163 -8145 -12307 -16035 -24976 100426 113129 55169 -32349 -63173 -83214 -85811 -102745 -92263
15151 -92263 -62246 7866 -18521 -47193 -106551 -189970 -109472 -55803 -61249 -101959 -56011 -20597
15139 -20597 -25110 -130172 -64111 18111 61636 98880 70559 -5054 -10144 1759 34597 37722
15127 37722 -12005 -25557 -70475 -115358 -33523 32287 66835 77164 55340 34598 -77187
15116 -77187 -105498 -222 -13581 -531 -22009 -36807 -25579 9451 23311 63248 79350
15105 79350 104470 121875 -55633 -155100 -105700 -140143 -98702 -139179 -130904 -104572 -132848 -115267
15093 -115267 -58272 -19886 -1274 50382 54719 72793 46059 48522 94074 172778 210515 240964
15081 240964 249098 165006 101917 93093 123698 140066 31120 -7304 4645 -64723 -98751 -29661
15069b9661q493p0579N8516J33907N1028l995k5168j4766q157l547n1872j2059
15057A5154j821j2242j8277l973l6730m252J7444N0151j2675j5662Q3632J00047
15045A60796l5185n5480O1320O385M5209K3320p2967n3577n9750O828R6950K7012
15033A50861j06747j5885l2024J5200J9476J0761M5428j1075l5432l3552n889
15022A122P389R466n4993q1121n0618Q3712M9146j2801k3341k1629N3666q669
15010d8671L0949P0087M8674q1245m1363l637J4187L7129K0871k0344q188j5331
14998C118k463M6471L2857j515l5531j0815q735k2817o0149l2664k783L3024Q797
14985e3205O1915N1028K326m2311N6889j4046p892K183m7098M3671M4203o5707
$$ plain form
15069 -29661 -38154 -108733 -50217 83690 134718 130723 105555 90789 82632 79085 27213 15154
15057 15154 13333 1091 -17186 -21159 -57889 -62141 -44697 5454 -7221 -22883 60749 160796
15045 160796 125611 70131 131451 137836 183045 206365 133398 79821 20071 26899 123849 150861
15033 150861 44114 28229 -3795 11405 30881 41642 87070 75995 40563 7011 1122
15022 1122 8511 17977 -37016 -118137 -168755 -85043 -35897 -48698 -72039 -93668 -40002 -48671
15010 -48671 -17722 52365 101039 19794 -21569 -25206 -11019 26110 46981 26637 18449 3118
14998 3118 655 47126 79983 78468 42937 32122 23387 570 -59579 -92243 -95026 -62002 -53205
14985 -53205 8710 59738 62064 19753 76642 62596 54704 56887 9789 53460 97663 31956
14973C1956o7851n4136j1813R495Q366m921L0190M4997K613l1230N2015j3310
14961c629K503k2777K211k1701j9598J307k1361m0713Q9095P2319J2989J6025
14949F6670p7351n2627L8224O4021N248N7426M7268l6402j08164n6655q400J06417
14937D5675k2623n6655n814M1927L8908m0372J0198q3177j2856j8025p9787J1196
14925a71405J02824J1731l8328o7575L7958Q5425J6854K8406P0431P539n4945
14914B8915Q401K9509k2032J0841p8288l8612k2590m312M2180Q0683l5555r8186
14902i9046M7069J03431k9508p7344J8536J7765Q1140M4233j11285K398K7161
14891B4550j3844l005N2392o8009n6302O5465J19903N6693j1279q0259n4227m5807
$$ plain form
14973 31956 -35895 -90031 -101844 -92349 -83983 -88904 -58714 -13717 -11104 -42334 9681 -3629
14961 -3629 -1126 -23903 -21692 -43393 -62991 -61684 -83045 -123758 -34663 37656 50645 66670
14949 66670 -10681 -63308 -25084 38937 44185 101611 148879 112477 4313 -52342 -60742 45675
14937 45675 23052 -33603 -39417 2510 41418 1046 11244 -71933 -84789 -102814 -182601 -171405
14925 -171405 -68581 -56850 -95178 -162753 -124795 -39370 -22516 5890 76321 83860 28915
14914 28915 37316 66825 44793 55634 -22654 -61266 -83856 -88168 -45988 34695 -860 -99046
14902 -99046 -51977 51454 21946 -55398 -36862 -19097 62043 106276 -5009 -2611 24550
14891 24550 10706 7701 60093 -7916 -64218 1247 121150 177843 166564 86305 32078 -13729
14879a3729P8216J5707J1754K4438m46q349K7464k2962n5415l3588P6291l8503
14867F0878n7607K940l63L8920L8552j5268P989m530J0594l2753l6737O3037L4069
14854A09721k9303j08361l6969L1392O3424R0719r91P6967K6704q3481j15484
14843B4338n7078P485N6343L3560j05164N027N6074K7842k6981o5094N332o2584
14831a00900l2378J10549J00398l2727p171r791o0940n7273J235L7929L2167m1289
14819f0191j11430K9916J09044J09404L873n7301J2035N8241Q741J5670k5217
14808I2785p8m2928m1801K807J5644L5380K0832N9168M7603k1362m1251k3589
14796A03210K6858j6706m3579K854J4379q4474L2015P024J1633M8852m302k3752
$$ plain form
14879 -13729 64487 80194 91948 116386 115940 107591 135055 112093 56678 23090 99381 60878
14867 60878 3271 6211 5848 44768 83320 68052 76041 71511 82105 49352 12615 75652 109721
14854 109721 80418 -27943 -64912 -33520 29904 120623 119632 196599 223303 139822 24338
14843 24338 -32740 -25255 31088 64648 -40516 -35489 20585 48427 21446 -43648 -38316 -100900
14831 -100900 -133278 -22729 77669 44942 37771 27980 -32960 -90233 -88998 -51069 -18902 -60191
14819 -60191 -171621 -141705 -32661 76743 80616 23315 35350 93591 102332 118002 92785
14808 92785 92707 49779 7978 10785 26429 61809 82641 141809 189412 168050 126799 103210
14796 103210 130068 113362 69783 72637 87016 2542 34557 41581 53214 102066 97764 74012
14784G4012n5265q241J1245L5458o4413M8654k1669p7959n1580N511R0989L0076
14772A6818l267J9826K04N3406l395N8940R864o0323j9292L5090l355o785p5339
14759B2392q2609j6566Q5314L3603m7392j1755l0994j5729L9876k2143k3473J02247
14747C2771J3216L9156J03772k0471j21147o6782M676o1672Q7721K2254l5308
14736a814m8591K1238J2515K1844l6016q4847L0090R141N8433O1912j2147j3228
14724A8530J4880R707J861l6882J9220K4883n9018p2289M1917m7720J2864N2497
14712a9550M8308J0113l8797k0761j8403k6001N8996j2783K321O5686j217r2411
14700d4499m986k5292J4571N0526O3306k6269M6143O1646n5930n7391l9054m247
$$ plain form
14784 74012 18747 10506 21751 57209 -7204 41450 19781 -58178 -109758 -104247 -13258 16818
14772 16818 13551 33377 33581 86987 83592 142532 152396 92073 72781 107871 104516 97731 22392
14759 22392 -60217 -76783 8531 42134 -5258 -17013 -48007 -63736 -23860 -46003 -69476 32771
14747 32771 45987 85143 188915 168444 47297 -19485 -14809 -76481 11240 33494 -1814
14736 -1814 -50405 -29167 -16652 5192 -30824 -115671 -85581 -76440 -18007 43905 31758 18530
14724 18530 33410 43117 44978 8096 27316 52199 -6819 -79108 -37191 -84911 -72047 -19550
14712 -19550 28758 38871 74 -20687 -39090 -65091 -6095 -18878 -16557 49129 47912 -44499
14700 -44499 -49485 -74777 -60206 -9680 53626 27357 73500 135146 79216 21825 -17229 -21476
14688b1476J511K4531N8405P2867M8880l9103J966L8560l0319o9814k9904J7324
14676G3428n0228k1158k8168L3934K7888j4624l7607k3680K3400k8416M6210M7197
14664D8176M863m4111j9314O2368L2440m7920q7665p4292m6105o1669R366J15010
14652a08853J0521K4485J7555J6536J7373l368o164K6174n3963l6570J4635q7970
14640a69609J5170M8346N663l3780K6500P4212R3825k3585p0222J8108Q5951J2751
14628H3330j058M2748n7890l4714l4270J9434Q7940l4799o9344p0466j278M6150
14616b4217N8108O341n9223j15811J3208L1464L6738l8338k4970L0296O6059Q2328
14604F1983k4541p4654l7190Q6264K9992l7340l7434N6078p6096P4132P6442N3204
$$ plain form
14688 -21476 -19965 4566 62971 135838 184718 145615 147581 186141 155822 86008 56104 73428
14676 73428 23200 2042 -26126 7808 35696 21072 -16535 -40215 -16815 -45231 979 48176
14664 48176 53039 8928 -10386 51982 84422 36502 -51163 -125455 -171560 -233229 -223863 -108853
14652 -108853 -98332 -73847 -56292 -39756 -22383 -25751 -31915 -5741 -59704 -96274 -81639 -169609
14640 -169609 -154439 -106093 -100430 -134210 -107710 -33498 60327 36742 -33480 -15372 70579 83330
14628 83330 82272 125020 67130 32416 -1854 17580 105520 70721 1377 -69089 -70367 -24217
14616 -24217 33891 40232 -18991 -134802 -121594 -90130 -53392 -91730 -116700 -86404 -20345 61983
14604 61983 37442 -37212 -74402 11862 41854 4514 -32920 23158 -52938 21194 97636 150840
14592A50840j3482j08406l0737R263r13L1391L2442o7778m8431P2179l4822n0791
14580e9245n8029K7614L9457p929M2253P874P802J06921M1363m1799p8010O7925
14568I6197k02m0005j01723j9742j22M6424Q4741m9383n3174j2332O0294n327
14556E646o936N6354P593j308P2845l5906p7630n7077l5304R2014L1386j03244
14544e1567q5730o5770R2041K5890J5037n4018l6477L4065R2292K5662J8959K290
14532A2674k6921K3954O4622L908l6552n1138j4060q011j1235O6114m2437j1848
14520c0930n0889o7754m6303O6619Q1852N1539k5128k4305o9590M7832P9699j6200
14508c558j1660l5139p0840q683j2089L2419J5517J02210k1214n0561k1797J4092
$$ plain form
14592 150840 137358 28952 -1785 7478 6565 37956 70398 2620 -45811 26368 -8454 -59245
14580 -59245 -117274 -89660 -50203 -58132 -15879 -8005 -203 106718 148081 106282 28272 96197
14568 96197 95995 55990 -45733 -65475 -65597 -19173 65568 16185 -36989 -49321 10973 5646
14556 5646 -1290 55064 62657 61349 134194 98288 20658 -36419 -71723 20291 51677 -51567
14544 -51567 -137297 -203067 -111026 -85136 -70099 -124117 -160594 -126529 -34237 -8575 10384 12674
14532 12674 -14247 9707 74329 78237 41685 -9453 -23513 -31524 -42759 23355 -19082 -30930
14520 -30930 -81819 -149573 -195876 -129257 -47405 4134 -20994 -45299 -114889 -67057 12642 -3558
14508 -3558 -15218 -50357 -121197 -129880 -141969 -109550 -94033 8177 -13037 -63598 -85395 -71303
14496g1303L5633p0596K2244Q6397L5194o537p3681n369O3092k4005m3463O9247
14484A6853N8432J1452K4824q3015o1386M752K2518o2598R003L7323J00013R6953
14472A75124M9540j02859r3531l996L0158R5050n3216O1707P2391j25073k9339
14461G5956p471n7008l2497L001J01855M8989L6448K4313m5165O0634m4254p0308
14449I4493l3569o5152K2477l981M8625q872n0237k3604N1746j9054k2127N8701
14437D9446O4760P1776R785L379M450j02820q5085L3701k0546m1692L8710j8852
14425G012M2411k8250k9315k6518L6309L1702r902P0795M4812p1471j02659K2444
14413a2630K3123K8158n0711M7891K7348j5154O444k1522l6783l0517l1647n5948
$$ plain form
14496 -71303 -35670 -106266 -84022 2375 37569 31032 -42649 -48018 15074 -8931 -52394 16853
14484 16853 75285 86737 111561 28546 -32840 -28088 -5570 -68168 -59165 -21842 78171 175124
14472 175124 224664 121805 28274 24278 54436 149486 96270 157977 230368 105295 75956
14461 75956 68485 11477 -21020 -18019 83836 132825 169273 193586 148421 209055 164801 94493
14449 94493 60924 -4228 18249 14268 62893 54021 3784 -19820 31926 12872 -9255 49446
14437 49446 114206 185982 195767 199146 203596 100776 15691 49392 28846 -12846 25864 7012
14425 7012 49423 21173 -8142 -34660 1649 33351 23449 94244 139056 67585 -35074 -12630
14413 -12630 10493 38651 -12060 35831 63179 48025 54469 32947 -3836 -34353 -66000 -121948
14401a21948L1489L8387k1433q2548k859R156K2313p0120N210K5311M6681J04460
14389a5901N9381l8418P1902L2933l2294m7528o0681K5521K2229N8317p2313n9720
14377e6572O0536L7202R3053n0575j48265l9230o0059Q6737K0775M3613P5627
14366F2842m7454k6647m1098l7230j17035M3015M7792N4143j2288j3745P235o706
14354h7176n3167l3164J09556P7150L7268J4037j8399o6441L897K8992o2465m6819
14342i6731Q251M3736K3189k682N0681M3839P149L1427k8859m526j2495k2093
14330D0886p0982n1394j4255k5870k5566R972R0168Q9371j2853o7088N493K4095
14318h023l7568N0025P0104P8121M68r787q569q1734M1074q430r1780Q681O3425
$$ plain form
14401 -121948 -90459 -52072 -73505 -156053 -158912 -149756 -127443 -197563 -192353 -167042 -120361 -15901
14389 -15901 43480 5062 76964 109897 77603 30075 -30606 -5085 17144 75461 3148 -56572
14377 -56572 3964 41166 134219 83644 -64621 -103851 -163910 -77173 -56398 -12785 62842
14366 62842 15388 -11259 -52357 -89587 -206622 -163607 -115815 -61672 -73960 -87705 -80470 -87176
14354 -87176 -140343 -173507 -63951 13199 50467 64504 46105 -20336 -16439 12553 -49912 -96731
14342 -96731 -88480 -44744 -21555 -24237 26444 70283 77432 108859 80000 75474 62979 40886
14330 40886 -30096 -81490 -95745 -121615 -147181 -137209 -47041 42330 29477 -37611 -32118 -8023
14318 -8023 -45591 4434 74538 152659 153127 143340 134771 53037 94111 85681 -6099 2582 66007
14305F6007R7740K7250m2111n8297L7500j8838j27837n3714O2391J7398m7746
14294d0257L1679K0024j5360J12383o8760j06772K4789L3755p1736j0129K3648
14283f6736Q0760N948j08343L0448N346k9196J2913j06041p0861J05639Q5528
14272e4595J6889K9319o4098L3243J29508O379q4753n9765J9537P1724Q200n7515
14260e927k9596l1783L5046M9359q46j1091K5806R5978O967k0862r788r3297L6708
14247D6674P2239q957l1038L2707l0723q5347K4299P7859J6881k903j52601r2007
14235a32917M8777m724P8705M0859K8363k991n3710j0868L8580n2574J7872K6440
14223B1812p2988m8205m3121l203M3248Q9276J4381J16536j1169o4771p0317M2108
$$ plain form
14305 66007 163747 190997 148886 90589 128089 109251 -18586 -72300 -9909 7489 -40257
14294 -40257 -8578 11446 -3914 108469 39709 -67063 -42274 -8519 -80255 -90384 -66736
14283 -66736 14024 19972 -88371 -57923 -52577 -81773 -68860 -174901 -245762 -140123 -54595
14272 -54595 -37706 -8387 -72485 -39242 90266 96645 11892 -47873 -28336 43388 51588 -5927
14260 -5927 -35523 -67306 -32260 17099 16253 5162 30968 126946 133913 113051 103263 9966 46674
14247 46674 118913 109956 78918 111625 80902 -4445 19854 97713 114594 111691 -40910 -132917
14235 -132917 -84140 -88864 -10159 30700 59063 56072 2362 -8506 30074 -22500 -4628 21812
14223 21812 -51176 -99381 -142502 -145705 -102457 -13181 1200 117736 106567 41796 -28521 13587
14211A3587L8214J6050m4818p4673K6529J42548M6354j14277N910M205k2473K2944
14199F0100J0197M2657M0281J1011P4775r4245j40178r6151o598N2153M7781O7181
14187F8964L9884J664n0553l4811k2209N9353J6809l2480o5628k5691k7453p9263
14175a51414K0654M4449j4400M0064k0751L829P9964p7506j7802l649Q3861L1912
14163A9211l1474M4991L2141R349q2287k5645k4763m790K53M9331R1501J3j3714
14150F4117j1884R966p3635n3540O8563k9618P4918M2223q5000r545o0188k0767
14138h4390J6725K5161k2520m3546n3069O8750P7124O7214J8048r3046j2750j1344
14126d7643Q5149n986k8508j9107K8837M9327M356p3621r0215j12821K68N9850
$$ plain form
14211 13587 51801 67851 23033 -51640 -25111 117437 163791 49514 55424 59629 37156 60100
14199 60100 70297 112954 153235 164246 239021 144776 4598 -91553 -98151 -45998 1783 68964
14187 68964 108848 110512 59959 25148 2939 62292 79101 46621 -19007 -44698 -72151 -151414
14175 -151414 -130760 -86311 -100711 -60647 -81398 -77569 2395 -75111 -92913 -96562 -12701 19211
14163 19211 -12263 32728 64869 74218 -8069 -33714 -58477 -63267 -63014 -13683 77818 77831 64117
14150 64117 52233 62199 -11436 -64976 3587 -26031 48887 91110 6110 -3435 -63623 -84390
14138 -84390 -67665 -42504 -65024 -108570 -161639 -92889 -15765 51449 69497 -23549 -36299 -47643
14126 -47643 37506 31520 3012 -16095 12742 62069 66425 -7196 -97411 -210232 -209964 -150114
14114a50114J23853Q4139m7161j5516j1418o5888M1005J00471r3999k0757M5707
14103i678j6780M7033r70m9836o3247P0224J4215K3833P560p2277N802N2167j0504
14090b458Q1599J4070L129N6236m5277p8398N5600P1495n4239l942p5157j262
14078B1396K0544J00813R573p9672l5105P1355k0801o3380k2172L3783P4882j6288
14066I4928n4919K4984l1019J1006P9872p6986K5956L7449L309n0379k1022K6921
14054G0100l6554m7398p127J0194l1201n7411K9577M596M3312O3518M1956L1131
14042A14693K1279L8578j9004m6849q3212l7603J0843n6609r9159J5139Q1212
14031f0692M5162O5917J06423O0477j28148m5454l4517m9244l3211Q946K6444
$$ plain form
14114 -150114 -26261 57878 10717 -4799 -16217 -82105 -41100 59371 -34628 -55385 -9678
14103 -9678 -26458 20575 19605 -30231 -93478 -23254 -9039 14794 22354 -49923 -44121 8046 -2458
14090 -2458 79141 93211 96340 152576 107299 28901 84501 155996 101757 97815 22658 21396
14078 21396 41940 142753 152326 72654 37549 108904 88103 24723 2551 36334 111216 94928
14066 94928 40009 64993 33974 44980 124852 47866 73822 111271 114580 64201 43179 70100
14054 70100 33546 -13852 -20979 -10785 -41986 -99397 -69820 -65224 -21912 41606 83562 114693
14042 114693 135972 174550 155546 108697 25485 -12118 -1275 -57884 -157043 -141904 -60692
14031 -60692 -15530 50387 156810 217287 89139 43685 9168 -40076 -73287 -64341 -37897
14020c7897n0615m2350M5461O0423O2520q5284q8468J827L4890M0126L7574L8891
14008A7098l3141q036k826O4323J03396m1034k4717l8933k1603j5068n8649L1683
13996b7507O3777J2847m192N8160k1337q4236j793j5356K1945j9542p9092q832
13984a05158n1947O2957M3040R494p636Q242J9184R5341r479M5742m0031l9884
13972B9865l6798M8182M1999N7967o184n1087M4458o779o3545p2393p035M5518
13960B4168J00947J3191p2473m4033k4564q0303L3741J1789N3958K9235J4593
13949F0249k7197K7686N1994l6054l9748K9486P0499P621j026n0923l2277o246
13937E4064K5076o2928m9841O3348j737k2907l6264m41L0180J2362l0357n4133
$$ plain form
14020 -37897 -88512 -130862 -85401 -24978 37542 -47742 -136210 -134383 -99493 -59367 -21793 17098
14008 17098 -16043 -24079 -26905 37418 140814 99780 75063 36130 14527 -541 -59190 -27507
13996 -27507 36270 49117 44925 103085 81748 -2488 -4281 -19637 2308 -17234 -96326 -105158
13984 -105158 -157105 -94148 -51108 -41614 -49250 -41008 -21824 73517 64038 109780 69749 29865
13972 29865 -6933 41249 83248 141215 135031 83944 128402 121623 58078 -14315 -21350 24168
13960 24168 125115 138306 65833 21800 -2764 -83067 -49326 -37537 16421 45656 60249
13949 60249 33052 60738 112732 76678 36930 66416 136915 144536 143510 92587 60310 54064
13937 54064 79140 16212 -33629 29719 27982 5075 -31189 -31630 -1450 10912 -19445 -73578
13925g3578n6397O7314M8462o1116L3747N6811J2799M0142J16318L8523j78320
13914D4705q0996J36M005O1992R0384P6553l6980q9770j09989m6207m2301p7014
13902b05482o080L3384r223P5542R1797M3462j1880K6122k9742p3866j3735j545
13890h1246J5741n6422j4568O3540J8255L141p1570N0312N5885P2827m6740p014
13878B141j0706M2978P2028N8644J223q6356o3508M91N9514m9325p8426j8086
13866f9388L0716L4444j1960M9370L7353K0715J3651K4974p4669p5974o6657K9121
13854e8304N3646m886j8550l4511j3615k3491L463J17514k743m116m6227R623
13842b2197R1815R478L0358K2904p7781n613p1403j3736R05K49k7367j5015L7397
$$ plain form
13925 -73578 -129975 -62661 -14199 -75315 -41568 15243 28042 68184 184502 223025 44705
13914 44705 -36291 -36155 -32150 29842 120226 196779 159799 70029 -39960 -86167 -128468 -205482
13902 -205482 -211562 -178178 -187401 -111859 -20062 23400 11520 37642 7900 -65966 -79701 -81246
13890 -81246 -65505 -121927 -136495 -72955 -54700 -51559 -123129 -72817 -16932 55895 9155 2141
13878 2141 -8565 34413 106441 165085 166308 79952 16444 16935 76449 27124 -51302 -69388
13866 -69388 -38672 -4228 -16188 33182 70535 91250 104901 129875 55206 -20768 -87425 -58304
13854 -58304 -4658 -9544 -28094 -62605 -76220 -99711 -96248 21266 18523 14407 -31820 -22197
13842 -22197 69618 79096 109454 132358 54577 48964 -22439 -36175 -35270 -35021 -62388 -77403 -40006
13829d0006P2068R0052l6916j46023k9730L6491L7920P1729j6807m9417L7148
13818B6509J5968l6159j397J3135K2637l293k2540m5713l6606k326O74Q2803N1207
13805F4899j1993l8729P130K4316M1918n1455n7785o9425N605L1603J9727k0494
13793e4683l7691j9803L0406K2380m8814J1009M1351O2110N6979K8166M6788l472
13781A34726j20088r347M628n1806k7119M4020M7455o4058L3550P888O4178M9368
13769A13395p5035j8807o0412L3488L4770l1892n5919J00914M4600j3267J0774
13758H2609Q3979j11540p9925O085m4167n9093N0892J7996J1813J9176J9624K1021
13746A8470R2295n9208k0695q0472p6656P8974N0820P0145j103K4902L9921j3670
$$ plain form
13829 -40006 32062 122114 85198 -60825 -90555 -54064 -16144 55585 38778 -10639 26509
13818 26509 42477 6318 4921 18056 40693 37400 14860 -30853 -67459 -69785 -69111 13692 64899
13805 64899 52906 14177 21307 45623 87541 36086 -21699 -91124 -85519 -53916 -34189 -54683
13793 -54683 -92374 -112177 -81771 -59391 -108205 -97196 -55845 6265 63244 91410 138198 134726
13781 134726 14638 5291 9919 -41887 -69006 -24986 22469 -41589 -8039 -151 64027 113395
13769 113395 38360 19553 -40859 -7371 27399 -4493 -60412 40502 85102 71835 82609
13758 82609 166588 55048 -24877 -18792 -62959 -122052 -71160 -53164 -41351 -22175 -2551 18470
13746 18470 110765 51557 30862 -49610 -126266 -47292 3528 73673 72570 97472 137393 123723
13734A23723j955k1689j60173k9378J4310P3139m1075J0289L2988O3147O5125
13723A28451j2250j00457m6272R6536L7172K5845l3687j34894m3502Q500q376
13712h2934O3820M1656J6293L6340P6037j8105p7892p8490K7422J14644l6251
13701H2540n0598K8751L4997m9067l4540J0417K8303k8986o5331N3178J0046j8968
13689G42o8159L3758O4289L6332K5706o5844p557P62Q663q089K4886J6090q6166
13676b4587M4125o0773j1974M4280m9487o3429K2626P788O6343R845r3969M415
13664a04797M1917O9037J00554J5299n2749m8166k1403P4487O7776J2657n935
13653A48677j19532j5800Q3069J07665M7528k7230j44858j24957K7047O2726k5792
$$ plain form
13734 123723 121768 100079 -60094 -89472 -75162 -2023 -43098 -32809 179 63326 128451
13723 128451 116201 15744 -30528 66008 103180 129025 95338 -39556 -83058 -74558 -82934
13712 -82934 -19114 22542 38835 75175 151212 133107 55215 -23275 4147 118791 82540
13701 82540 31942 60693 95690 46623 12083 22500 50803 21817 -43514 9664 19710 742
13689 742 -67417 -33659 30630 66962 92668 26824 19267 20029 28692 20603 45489 61579 -24587
13676 -24587 19538 -41235 -53209 -8929 -58416 -121845 -99219 -91431 -25088 -15243 -109212 -104797
13664 -104797 -62880 6157 106711 122010 69261 21095 -308 74179 141955 154612 148677
13653 148677 29145 13345 96414 204079 251607 224377 79519 -45438 -18391 44335 18543
13642A8543M6611m792o456K0631K9028l26J2034K225n5122j02072k9557N7409
13630a1844M2606L8093M3862q5415k6536J4423n5035J0236J9442P6386L5825P9474
13618A81517K1990r8438j02324n0741o2444j4118R6602O0964N423n4735J3061
13607c243K5063m8386k4583M0337L8834J8031J85M0593J1633j12078r2008r564
13595a15186O2265K0337J4901N1014J03012o9629n4055k0864l9590l0234N1420
13584b6609m403M849P771L8076J4333R4094N0884r7250K57M3113j1645Q121m7120
13571G4471o1105n4505M9414O3488J8142m6481l6147m7189l1383R383q4791k7531
13559a74234L1040L5973R936L6498K2847K2266m6442Q9991Q3908o5616p1690r171
$$ plain form
13642 18543 65154 60362 53906 74537 103565 103239 115273 117498 62376 -39696 -69253 -11844
13630 -11844 30762 68855 112717 27302 766 15189 -39846 -29610 -10168 66218 102043 181517
13618 181517 203507 105069 2745 -47996 -110440 -124558 -27956 33008 38431 -16304 -3243
13607 -3243 21820 -26566 -51149 -10812 28022 46053 46238 86831 98464 -13614 -105622 -115186
13595 -115186 -52921 -32584 -17683 33331 136343 66714 12659 -8205 -47795 -78029 -26609
13584 -26609 -31012 -26163 -18392 19684 34017 128111 178995 81745 82002 125115 113470 121591 74471
13571 74471 13366 -41139 8275 71763 89905 43424 7277 -39912 -71295 -61912 -146703 -174234
13559 -174234 -143194 -107221 -97285 -60787 -37940 -15674 -62116 27875 111783 46167 -25523 -34694
13547c4694O493O5014L2879l2161L6776j01791p0164M5734J1328P01L5920Q2600
13535G8635J3904J6150k691m7008m7845m0324M4380N9871j8223r0076m329J5847
13523b1709L63O9466J4028q5785k8684P8336N2523l6113j10445M0203m8709p0531
13511a47057M6502M6498J2406m4070J549o2448p39L1868J9026k4068j2090K4195
13499a08428K3223O433P039L6132O5444L890J9216M7812L2233o1481m4531K2313
13487D9295j9653m2757m0011k6963O4004P8167r4922M3624J148M436J9795j588
13475C4575m664r3345j16729K5084J04698P7818J8746m2617j13609J5865M2693
13464e1485L0657J8800n2974K9742Q377R4319k9733k6052L0073M5021J9685m2486
$$ plain form
13547 -34694 -28201 36813 69692 37531 74307 -27484 -97648 -51914 -40586 -39885 -3965 78635
13535 78635 92539 108689 105998 58990 11145 -29179 15201 75072 56849 -33227 -37556 -21709
13523 -21709 -21346 48120 62148 -23637 -52321 26015 78538 42425 -68020 -27817 -76526 -147057
13511 -147057 -100555 -54057 -41651 -85721 -84172 -146620 -147359 -115491 -96465 -120533 -132623 -108428
13499 -108428 -85205 -78772 -71733 -35601 29843 33733 52949 100761 132994 71513 26982 49295
13487 49295 29642 -13115 -53126 -80089 -16085 62082 -32840 10784 11932 16368 36163 34575
13475 34575 29911 -63434 -180163 -155079 -50381 27437 46183 3566 -110043 -94178 -51485
13464 -51485 -20828 -2028 -55002 -25260 -16883 77436 47703 21651 51724 96745 116430 73944
13452G3944P8725K1467Q734r0594K7622n3237j62511j8835J21581R9665n4224
13441E2337o3976j03308k6240L2481M1057o8334l869O1910J16043P7401N042j03489
13429A7055J806j2470R2591L8524r4180l6225k8223p7292K3874R1N373O8978M7725
13416D7627J5738n2851r687R878m7286p3868L2940N1300P1880K9986M6607n6971
13404F5293q4536n0105J2426R3891M5965o7696n5278l0367M1402J02757L741J9745
13392I7238J26165Q5171J8022j51183j24083m6762L5927Q4766l5667n6551j0322
13381B2721K408O8375k5664n0724j17433l598K1476M7794j2271n9200J14761P4401
13369H3046O8149m5721m9257m3049J9273L9301L3828r3196m8705N2519k8626k2474
$$ plain form
13452 73944 152669 174136 182870 92276 119898 66661 -95850 -114685 6896 106561 52337
13441 52337 -11639 -114947 -141187 -108706 -67649 -135983 -139852 -77942 38101 115502 120544 17055
13429 17055 18861 6391 98982 137506 43326 7101 -21122 -98414 -74540 -74449 -69076 -98 47627
13416 47627 63365 10514 827 10705 -36581 -110449 -77509 -26209 45671 75657 122264 65293
13404 65293 -19243 -69348 -56922 36969 82934 15238 -40040 -70407 -29005 73752 77493 97238
13392 97238 223403 308574 326596 175413 51330 4568 40495 125261 89594 33043 22721
13381 22721 25129 93504 67840 17116 -100317 -103915 -82439 -34645 -46916 -106116 8645 83046
13369 83046 151195 105474 56217 13168 32441 71742 105570 12374 -36331 16188 -12438 -34912
13357c4912L2968N787K2403p9016k8592N7391J8041R5979Q5295j8105P468k9366
13345A35341m5816l9371o3611l4678L8412L1275j067J9338q899J1779O2432j887
13333A03248o355j5270K3392m5898l5951l8999j5192j7103q9539k8088P9253J2888
13321g3614K0568L5270P4571o9417N2429L3511o7722o0254P5861R4429m5166q565
13309F1901j8823j7032O1431P4434k9252m3159m068n6053L7124j3596m6932n6995
13297e1020L8799Q4159k6874m8105j5464j18j4392M0933K466J6801o3815j0103
13285d6733j6196N1616N3831l3468o640M569j314q090o2410m6610J31984O8418
13273H8957r716l0266j9766N1379L7873q2728n5713P1082K8398l9114k2651N5431
$$ plain form
13357 -34912 -1944 3843 26246 -52770 -81362 -23971 -5930 90049 175344 157239 164707 135341
13345 135341 89525 50154 -13457 -48135 -9723 21552 20485 39823 30924 42703 105135 103248
13333 103248 96893 81623 105015 59117 23166 -15833 -31025 -48128 -137667 -165755 -86502 -73614
13321 -73614 -53046 -17776 56795 -12622 39807 73318 5596 -54658 21203 115632 70466 61901
13309 61901 43078 26046 87477 161911 132659 89500 85432 29379 66503 52907 5975 -51020
13297 -51020 -12221 71938 45064 -3041 -18505 -18623 -33015 7918 10384 27185 -36630 -46733
13285 -46733 -62929 -11313 42518 9050 2410 6979 5665 -2425 -64835 -111445 20539 88957
13273 88957 79241 48975 29209 80588 118461 35733 -19980 51102 79500 40386 17735 73166
13261G3166j7701m5042J5986N4147O372K668L7733o0796o2149n8805l5820J0945
13249g9296L8513L5792M3149K7735l205m3049o7275J8057J2462P2041J6867l8964
13237C2827n0444O1557L8387j3671j0931J9915J6428o814m9483j6481p3072J3961
13225c7821k5188n9774N8739L7308J01918j1905l7255M7565J9481L2177k7394
13214I7851n323n9042j2409L5028K7959n411N2302m2421r1498o253l7415n7716
13202a04348O4800M4923j6745Q7943N5803j15510m8699J8504j0923N0842M8197
13191G4787L1482o1685q7035j7128j0091M4267K6534j3573J06122K6160r6372
13180B3468m6361m0946M0190N4761K071n4941m0271m9035o4668J6499J05077M7202
$$ plain form
13261 73166 55465 10423 26409 80556 86928 89596 127329 66533 4384 -54421 -90241 -79296
13249 -79296 -40783 -4991 38158 65893 62688 19639 -47636 -29579 -17117 54924 71791 32827
13237 32827 -17617 43940 82327 68656 57725 77640 94068 87254 37771 21290 -51782 -37821
13225 -37821 -63009 -122783 -64044 -26736 75182 63277 26022 73587 93068 125245 97851
13214 97851 92528 33486 21077 56105 84064 78653 130955 88534 -2964 -9217 -46632 -104348
13202 -104348 -39548 5375 -11370 76573 132376 16866 -31833 -13329 -24252 26590 74787
13191 74787 106269 44584 -42451 -59579 -69670 -25403 1131 -12442 93680 119840 23468
13180 23468 -22893 -63839 -23649 31112 33183 -21758 -62029 -111064 -175732 -159233 -54156 -6954
13168f954j6489N6173q4379m3702L1433m6328L1458J53217N5456k5778l6963o2611
13156D533j9503Q60Q6540m5521j18422m299J5160P8415j4109J0626o1351L6469
13144c0602M8901o516j8441J8246O178o0972l2141o4946K6877J02895K0166L0021
13132C9666L9302o3591k0653K0369l781J7706r9202j6771J21312L8099L599j0642
13120F5413o5175l7213J1662J00786m163q8448p1994N6527Q1790o3243k8269J0924
13108c1403q425o168P5952J6956l0139J0415l6186p1127K5499o436k8973o921
13096i6956J02674P7678K6086k1918l3084o1251o7545J0286j7233Q429N1158J2351
13084i325K6949j4795j8020n7181K5494L8860o32M7933M7940K020j0672j50351
$$ plain form
13168 -6954 -23443 32730 -51649 -95351 -63918 -110246 -78788 74429 129885 104107 67144 4533
13156 4533 -14970 -14110 72430 26909 -91513 -95812 -80652 -2237 -16346 -5720 -67071 -30602
13144 -30602 18299 11783 -6658 11588 17766 -43206 -75347 -140293 -113416 -10521 9645 39666
13132 39666 78968 15377 -5276 15093 11312 29018 -70184 -86955 34357 72456 76055 65413
13120 65413 238 -36975 -25313 75473 71310 -17138 -89132 -32605 49185 -14058 -42327 -31403
13108 -31403 -39828 -45996 29956 46912 16773 27188 -8998 -80125 -54626 -61062 -90035 -96956
13096 -96956 5718 83396 109482 87564 54480 -6771 -74316 -64030 -81263 -72834 -21676 -9325
13084 -9325 17624 2829 -15191 -72372 -46878 -8018 -8650 39283 87223 89243 78571 -71780
13072g1780m3938L3855k9252K2360M9608K7758o825K7999J9159k8794k9865L0185
13060D70k516K1767q316n7632l476R7250R3977j02385p9865J6286M5993O0391
13048H1944M2681k5130r4001r446k8398O61p0568K3237N299L8577l2607l6653
13036a04404j7830N5007N4565q7521q3067R5512O2666L8673P2887j2992j31337
13025e7841r2320j4748M8511O5853N4938Q7461n014j2634L1003Q0283k6490J0142
13013A69144J0951m2694k1304p7866q7375J1838J50943L3091j7702j21445l4318
13002b6737R788O984j862n9323j1952J4665k8469L7217M2767M3777J7420M302
12990D8577m1716l8225M34M6400Q3609L0202r8083o2683K5505K0022j7081p356
$$ plain form
13072 -71780 -115718 -81863 -111115 -88755 -39147 -11389 -18214 9785 28944 150 -29715 470
13060 470 -2046 19721 11405 -46227 -49703 47547 141524 39139 -40726 -24440 21553 81944
13048 81944 124625 99495 5494 -3952 -32350 -31689 -102257 -79020 -73721 -35144 -67751 -104404
13036 -104404 -122234 -67227 -12662 -100183 -183250 -87738 -25072 13601 86488 73496 -57841
13025 -57841 -150161 -164909 -116398 -50545 4393 91854 86840 74206 105209 185492 159002 169144
13013 169144 180095 137401 116097 38231 -49144 -37306 113637 146728 129026 7581 -26737
13002 -26737 -16949 -9965 -11827 -71150 -83102 -68437 -96906 -59689 -16922 26855 44275 48577
12990 48577 6861 -31364 -30930 15470 99079 129281 31198 -31485 -5980 14042 -3039 -10395
12978a0395j03412j9049O3820O0128L1831o3063l0420Q4988O0219m0616n0415
12967a6384q2853J209P5923j2513m8584L8714N0647K8627N4233K1829n306j7286
12955H8256n437M5865P982r8686j5784O8291j16329j00166N6872K0517Q131k0269
12943f0757j45591j23546J4868R4512P9232R8466n168o7369o677l6000K9481R2835
12931c5714J35490K076k1590m0306l0574q1375O8991Q2722J9480m4250K3080o9345
12919H685j00861K8662M8436J1762J8576l0378L7300p9770l4218O859K1962J20930
12907E7945M1204k72K190j7539J4202N4812r316p1345o1230k839J7751L7253L4102
12894I6918K1524k033n8086n5425n7971l2586N3733P7887o3523L1539j3666R060
$$ plain form
12978 -10395 -113807 -132856 -69036 -8908 22923 -40140 -70560 14428 74647 34031 -16384
12967 -16384 -99237 -98028 -22105 -34618 -83202 -44488 6159 34786 89019 110848 105542 88256
12955 88256 82819 128684 136666 37980 22196 90487 -25842 -126008 -69136 -48619 -40488 -60757
12943 -60757 -206348 -329894 -315026 -220514 -141282 -42816 -47984 -115353 -122030 -158030 -128549 -35714
12931 -35714 99776 101852 80262 39956 9382 -71993 -3002 79720 99200 54950 78030 8685
12919 8685 -92176 -63514 -15078 -3316 15260 -15118 22182 -57588 -91806 -84947 -62985 57945
12907 57945 99149 98877 101067 83528 97730 152542 143226 71881 10651 7812 25563 62816 96918
12894 96918 118442 116409 58323 2898 -55073 -87659 -33926 43961 -19562 11977 -1689 7371
12882G371l422j7272K5376K3706n3714L2699N9537L0394L9969N449k6811o6177
12870E7105p9601j11091J18013M8967q1779J7539L7946k6292j2695n9256l6454
12859a27598r975r3983n7097Q0277J38640M9724J8197O1001j0321r12J88L4384
12847H2525J155L4025k5267j04036j05047o0769n151L8236P5437J01736k9634
12836C210m4408O8637L4916k0685m0265N0456K1408j29296j517L719n440L7161
12824b2104Q7752r061M441L174R348n3941K7660N8610P3936k512j2462K9562r9095
12811I5308l2910J02522J45296j5788J871K2196J3008p3333j6678q4471J8881
12800A75902P359p5290q3202l5242K9412N742J0474j7866k855l183K8766K1196
$$ plain form
12882 7371 3949 -13323 12053 35759 -17955 14744 74281 104675 144644 150093 123282 57105
12870 57105 -22496 -133587 -15574 33393 -48386 -30847 7099 -19193 -31888 -91144 -127598
12859 -127598 -137573 -231556 -288653 -208376 -69736 -20012 -1815 59186 48865 47953 48141 82525
12847 82525 83680 117705 92438 -11598 -116645 -177414 -182565 -144329 -68892 32844 3210
12836 3210 -41198 27439 62355 41670 1405 51861 73269 -56027 -57544 -53825 -59265 -22104
12824 -22104 65648 56587 61028 64202 73550 19609 47269 105879 179815 177303 164841 194403 95308
12811 95308 62398 164920 310216 294428 296299 318495 331503 258170 241492 157021 175902
12800 175902 183261 107971 24769 -10473 18939 24681 35155 17289 14434 11251 40017 61213
12788F1213p5700M7224k8983K6458o169J00540N3338j1445j1360M3286P788j28639
12776G7551l6325Q658j9382q571K9065P8031p5541p4626m3991p3395J2212R0951
12764c5363J27999m2363J9669K7023j29429n5969r759M3706J4893l6383j7340
$$ plain form
12788 61213 -14487 32737 3754 30212 24043 124583 177921 166476 155116 198402 206190 77551
12776 77551 41226 49884 30502 21931 50996 129027 53486 -21140 -65131 -138526 -126314 -35363
12764 -35363 92636 50273 69942 96965 -32464 -88433 -98192 -54486 -39593 -75976 -93316
$$ [...]
##END NTUPLES=NMR SPECTRUM
##END=
