##TITLE=Analysis number 328576
Compound Code cc 30701
Project Code adrs
Chemist Name aci
##JCAMPDX= 6.0         $$ Bruker NMR JCAMP-DX V2.0
##DATA TYPE= NMR SPECTRUM
##DATA CLASS= NTUPLES
##ORIGIN= Bruker BioSpin GmbH
##OWNER= nmr
$$ XWIN-NMR		Version 3.5
$$ Tue Jun 19 10:22:32 2007 GMT Daylight Time (UT+1h)  MAYBRIDGE\nmr@NMR_250MHZ
##.OBSERVE FREQUENCY= 250.131544655141
##.OBSERVE NUCLEUS= ^1H
##.ACQUISITION MODE= SIMULTANEOUS (DQD)
##.ACQUISITION SCHEME= undefined
##.AVERAGES= 16
##.DIGITISER RES= 18
##SPECTROMETER/DATA SYSTEM= dpx250
##.PULSE SEQUENCE= zg30
##.SOLVENT NAME= DMSO
##.SHIFT REFERENCE= (INTERNAL, DMSO, 0, 16.5089)
##AUDIT TRAIL= $$ (NUMBER, WHEN, WHO, WHERE, WHAT)
$$ ##TITLE= Audit trail, XWIN-NMR		Version 3.5
$$ ##JCAMPDX= 5.01
$$ ##ORIGIN= Bruker BioSpin GmbH
$$ ##OWNER= nmr
$$ C:\u/data/dgb/nmr/ADRS/1070/pdata/1/auditp.txt
$$ ##AUDIT TRAIL=  $$ (NUMBER, WHEN, WHO, WHERE, WHAT)
(   1,<2007-06-19 10:22:01.84 +100>,<MAYBRIDGE\nmr>,<NMR_250MHZ>,
      <created by zg, POWCHK disabled, PULCHK disabled
       configuration hash MD5:
       76 6E 9A 78 1E 09 19 81 EC 84 63 8F B0 6A 59 2D
       data hash MD5: 64K
       3D 9D 47 D2 2C FC C7 05 B8 0B BC D3 FF 0B 67 0F>)
(   2,<2007-06-19 10:22:15.56 +100>,<MAYBRIDGE\nmr>,<NMR_250MHZ>,
      <Start of raw data processing
       ef LB = 0.3 FT_mod = 6 PKNL = 1 SI = 32K 
       data hash MD5: 32K
       1B 01 46 C4 8D CD 15 AC FA 3D EB 4E 9A 7F 4D 2D>)
(   3,<2007-06-19 10:22:18.06 +100>,<MAYBRIDGE\nmr>,<NMR_250MHZ>,
      <apk 
       data hash MD5: 32K
       C5 39 C4 64 AC EE A6 03 4D 0E 36 8A 10 E0 CD CC>)
(   4,<2007-06-19 10:22:19.48 +100>,<MAYBRIDGE\nmr>,<NMR_250MHZ>,
      <abs ABSG = 5 
       data hash MD5: 32K
       11 24 78 C1 43 AA E3 FB B0 0D 7E CE 2C 9C 71 6E>)
$$ ##END=
$$ 
$$ hash MD5
$$ D1 B8 EF 6E 58 A3 FF F6 6D 83 A0 5B 7A 0A B6 15
##$RELAX= 
##$RELAX= 
##$RELAX= 
##$RELAX= 
##$RELAX= 
##$RELAX= 
##$RELAX= 
$$ Bruker specific parameters
$$ --------------------------
##$DU= <C:\u>
##$EXPNO= 1070
##$NAME= <ADRS>
##$PROCNO= 1
##$TYPE= <nmr>
##$USER= <dgb>
##$AMP= (0..31)
100 100 100 100 100 100 100 100 100 100 100 100 100 100 100 100 100 100 
100 100 100 100 100 100 100 100 100 100 100 100 100 100 
##$AQSEQ= 0
##$AQ_mod= 3
##$AUNM= <au_zg>
##$AUTOPOS= <57 >
##$BF1= 250.13
##$BF2= 250.13
##$BF3= 250.13
##$BF4= 250.13
##$BF5= 500.13
##$BF6= 500.13
##$BF7= 500.13
##$BF8= 500.13
##$BYTORDA= 1
##$CFDGTYP= 0
##$CFRGTYP= 5
##$CHEMSTR= <none>
##$CNST= (0..31)
1 1 145 1 1 1 1 1 1 1 1 1 1 1 1 1 1 1 1 1 1 1 1 1 1 1 1 1 1 1 1 1 
##$CPDPRG= <>
##$CPDPRG1= <>
##$CPDPRG2= <>
##$CPDPRG3= <>
##$CPDPRG4= <mlev>
##$CPDPRG5= <mlev>
##$CPDPRG6= <mlev>
##$CPDPRG7= <mlev>
##$CPDPRG8= <mlev>
##$CPDPRGB= <>
##$CPDPRGT= <>
##$D= (0..31)
0 1 0 0 0 0 0 0 0 0.06 0 0 0 0 0 0 0.0002 0 0 0 0 0 0 0 0 0 0 0 0 0 0 
0 
##$DATE= 1182244920
##$DBL= (0..7)
120 120 120 120 120 120 120 120 
##$DBP= (0..7)
150 150 150 150 150 150 150 150 
##$DBP07= 0
##$DBPNAM0= <>
##$DBPNAM1= <>
##$DBPNAM2= <>
##$DBPNAM3= <>
$$ [...]
##$SUBNAM7= <"">
##$SUBNAM8= <"">
##$SUBNAM9= <"">
##$SW= 20.6930455092707
##$SWIBOX= (0..15)
0 0 3 0 0 0 0 0 0 0 0 0 0 0 0 0 
##$SW_h= 5175.983436853
##$TD= 65536
##$TD0= 1
##$TE= 296.16
##$TE2= 300
##$TE3= 300
##$TEG= 300
##$TL= (0..7)
0 120 120 120 120 120 120 120 
##$TP= (0..7)
150 150 150 150 150 150 150 150 
##$TP07= 0
##$TPNAME0= <>
##$TPNAME1= <>
##$TPNAME2= <>
##$TPNAME3= <>
##$TPNAME4= <>
##$TPNAME5= <>
##$TPNAME6= <>
##$TPNAME7= <>
##$TPOAL= (0..7)
0.5 0.5 0.5 0.5 0.5 0.5 0.5 0.5 
##$TPOFFS= (0..7)
0 0 0 0 0 0 0 0 
##$TUNHIN= 0
##$TUNHOUT= 0
##$TUNXOUT= 0
##$USERA1= <user>
##$USERA2= <user>
##$USERA3= <user>
##$USERA4= <user>
##$USERA5= <user>
##$V9= 5
##$VALIST= <valist>
##$VCLIST= <CCCCCCCCCCCCCCC>
##$VD= 0
##$VDLIST= <DDDDDDDDDDDDDDD>
##$VPLIST= <PPPPPPPPPPPPPPP>
##$VTLIST= <TTTTTTTTTTTTTTT>
##$WBST= 1024
##$WBSW= 4
##$XGAIN= (0..3)
0 0 0 0 
##$XL= 0
##$YL= 0
##$YMAX_a= 350420
##$YMIN_a= -435511
##$ZGOPTNS= <>
##$ZL1= 120
##$ZL2= 120
##$ZL3= 120
##$ZL4= 120
##$ABSF1= 16.5089
##$ABSF2= -4.184273
##$ABSG= 5
##$ABSL= 3
##$ALPHA= 0
##$AQORDER= 0
##$ASSFAC= 0
##$ASSFACI= 0
##$ASSFACX= 0
##$ASSWID= 0
##$AUNMP= <proc_1d>
##$AZFE= 0.1
##$AZFW= 0.1
##$BCFW= 0
##$BC_mod= 0
##$BYTORDP= 0
##$COROFFS= 0
##$CY= 12.5
##$DATMOD= 1
##$DC= 0
##$DFILT= <>
##$DTYPP= 0
##$F1P= 14.0000005364418
##$F2P= -0.99999901652339
##$FCOR= 0.5
##$FTSIZE= 32768
##$FT_mod= 6
##$GAMMA= 0
##$GB= 0
##$INTBC= 1
##$INTSCL= 1
##$ISEN= 128
##$LB= 0.3
##$LEV0= 0
##$LPBIN= 0
##$MAXI= 10000
##$MC2= 0
##$MEAN= 0
##$ME_mod= 0
##$MI= 0
##$NCOEF= 0
##$NC_proc= -3
##$NLEV= 6
##$NOISF1= 0
##$NOISF2= 0
##$NSP= 0
##$NTH_PI= 0
##$NZP= 0
##$OFFSET= 16.5089
##$PC= 1
##$PHC0= -64.44942
##$PHC1= 6.445264
##$PH_mod= 1
##$PKNL= yes
##$PPARMOD= 0
##$PSCAL= 4
##$PSIGN= 0
##$REVERSE= no
##$SF= 250.130003276754
##$SI= 32768
##$SIGF1= 0
##$SIGF2= 0
##$SINO= 400
##$SIOLD= 32768
##$SREGLST= <1H.DMSO>
##$SSB= 0
##$STSI= 32768
##$STSR= 0
##$SW_p= 5175.98343685301
##$SYMM= 0
##$S_DEV= 0
##$TDeff= 65536
##$TDoff= 0
##$TI= <Analysis number 999999
Compound Code 99
Book Reference 9
Project Code 9>
##$TILT= no
##$TM1= 0
##$TM2= 0
##$TOPLEV= 0
##$USERP1= <user>
##$USERP2= <user>
##$USERP3= <user>
##$USERP4= <user>
##$USERP5= <user>
##$WDW= 1
##$XDIM= 32768
##$YMAX_p= 473021849
##$YMIN_p= -244487
$$ End of Bruker specific parameters
$$ ---------------------------------
##NTUPLES= NMR SPECTRUM
##VAR_NAME=  FREQUENCY,     SPECTRUM/REAL,   SPECTRUM/IMAG
##SYMBOL=    X,             R,               I
##VAR_TYPE=  INDEPENDENT,   DEPENDENT,       DEPENDENT
##VAR_FORM=  AFFN,          ASDF,            ASDF
##VAR_DIM=   32768,         32768,           32768
##UNITS=     HZ,            ARBITRARY UNITS, ARBITRARY UNITS
##FACTOR=    0.157963299565203, 1,           1
##FIRST=     4129.37113323531, 0,            0
##LAST=      -1046.6123036177, 0,            0
##MIN=       -1046.6123036177, -244487,      0
##MAX=       4129.37113323531, 473021849,    0
$$ Real data points
##PAGE= N=1
##DATA TABLE= (X++(R..R)), XYDATA
$$ [...]
14876H683k2572J0718M637N185J2450r368k1667m400L120N262m055P03j919j0479
14862b3702j8063k593K3693L246j8525j3033J5898J2868J0715Q258Q457K80J376
14849H875n894j9488L466K2532K815k6204O052r40L656J9440K170j545m720j0842
14835f27J7178J4729q350k3621r919N506N954j501L050j6436m139m218o049J8933
14821i510N81j02P231j2572r96J1170J0204j4003j4255O803J3763j2775n934j4851
14807c5246R039P581J5174O31j2010j6108j167P576K0197R004j6926j6534n825
14794c4614l853r959j4318J368P197J8781J6619m242k859l925O794J6122N140
14781a749K794L933o699o403j9861k2399J6827J8370M029J535m664n727N691K2352
$$ y = [8683, -13889, -3171, 1466, 6651, 19101, 9733, -11934, -16334, -13214, -7952, -12007, -11304, -13223, -23702, -41765, -44358, -20665, -17419, -35944, -48977, -33079, -20211, -9496, -1238, 7219, 7499, 8875, 2981, -16507, -13041, 9491, 12306, -13898, -7846, -8786, -5130, 14310, 16480, 14935, 10215, -627, 16551, 31280, 22930, -691, -10610, -5104, 850, -651, 2399, -14037, -18176, -22394, -28443, -9510, -8929, -9031, -1800, -14372, -15368, -4198, 6006, -7997, -22252, -15449, -1686, -14461, -20395, -35246, -26207, -18626, -3452, -2821, -14831, -30939, -32106, -24530, -4333, 4671, -12255, -28789, -34614, -38467, -48426, -62744, -61376, -54179, -35398, -18779, -23021, -25880, -29805, -23011, -6889, -1749, 1045, 4978, -1721, -8124, -27985, -50384, -33557, -15187, -11158, -9623, -14287, -20014, -14323, 8029]
14767H029N153p038K017j747q026j3466J334L0305j4743n426P261N591P234j0001
14753F477j5153m19K481j0346k2943k667L058J5664L4037L227M09L299j8091k776
14739c743k090J3335K8726j149k8385p398j3346N539P682L003K272j789j5354
14726a2697j4376J3711K384K005P750j229k005M020J193P32J692m914J6362J2383
14712B7011l1611j9605J0237J0512p966O617j4139R314l059j3773L853J0112j4641
14699b7138J3223J5790N888p83j7023K869Q852Q606l366N965q60j5677p463j0308
14685b1425k672o208j0915R663J6212l940n563Q349J5189l254n5jj6416J0242
14671a0794K0246J022j9336j4967l077J8053M742j8971O627J0023J5942J1260
$$ y = [8029, 13182, 6144, 8161, 6414, -1612, -15078, -13744, 16561, 1818, -3608, 3653, 9244, 16478, 6477, -8676, -9095, -6614, -16960, -39903, -42570, -39512, -23848, 10189, 13416, 13825, 17124, -967, -3743, -5833, 7502, 36228, 35079, 6694, -704, -14050, -8511, -829, 2174, 4446, 2657, -12697, -27073, -13362, -10978, -8973, -1223, -2452, -4457, -437, 756, 1488, 3180, -1734, 14628, 27011, -4600, -24205, -13968, -3456, -11422, -4805, -18944, -9630, -12689, -26462, -22609, -12497, -27138, -13915, 1875, 7763, 6980, -10043, -7174, 1678, 10284, 6918, 12883, 12023, -3654, -11117, -21425, -24097, -30305, -41220, -31557, -15345, -19285, -24848, -16499, -1310, -4564, -4619, -4620, -21036, -10794, 9452, 10474, -8862, -23829, -26906, -8853, -4111, -23082, -16455, -6432, 9510, 20770]
14659B0770q339m749o005K658J0677J432j3028L941N08N995l316j4164p944j0200
14645b1764o644k022j7530j2688QL922L3702O923J0273J2725k657j1588j1499
14632a8839O98L865j3812l810l016J3278j0013k79J2317n62L1027J6977r316j3896
14618D619j3020k6739J0228J2963R10m389j3828j3019j377L685J9692J3963K120
14605d192J2613n124r934n25Q69k351M117N089J4268J1193o703j3039j1140O486
14591A627N054n7M045l299J0204j4498j6678o079K3712l98J883m104j1000O846
14577b742j0601n667j044R338J4898Q755k257j4802M126r14n260J2189r688m882
14563h551R249J7648j0372j6353j511N228j8437K068P846M223n93O461l234j887
$$ y = [20770, 12431, 7682, 1677, 4335, 15012, 16444, 3416, 7357, 7865, 13860, 10544, -3620, -11564, -21764, -28408, -30430, -47960, -60648, -60640, -56718, -23016, -16093, -5820, 6905, 4248, -7340, -18839, -18141, -14276, -28088, -31898, -34914, -21636, -31649, -31928, -19611, -20173, 10854, 27831, 18515, 4619, -8401, -35140, -24912, -11949, -11039, -15428, -29256, -42275, -43652, -39967, -20275, -6312, -4192, 8421, 3297, -6637, -7162, -6293, -8644, -4527, 562, 14830, 26023, 19320, 6281, -4859, 1627, 6681, 6624, 10669, 7370, 17574, 3076, -13602, -19681, 4031, 3633, 5516, 1412, -9588, -2742, -13343, -19010, -20054, -10716, 4182, 12937, 10680, -4122, 4, -910, -6170, 6019, -3669, -8551, 698, 18346, 7974, -8379, -9890, -4662, -23099, -21031, -13185, -8962, -9555, -3094, -6328, -8215]
14549h215n351M531J5143k7059J3912J7176J0954k777l432j999L849k150n959
14536H623k2878K986j0405j9833J5388K657p403k246O594K192J1042J7787o18
14523C886q607M411L15J1998k2147q981j4357K677N37J4332J1953j0494m082J3324
14509e235L05j2641R21J7555M77o044P797N572j8562r277j449p336M130R61j209
14494b4035J53j230q39J7112J6161k682J853N005j0370k260l718j7578P740J6610
14480A922l325O851O67j4572q013n005L599N085l348N545J4398j339J3780J1082
14466B7327P623j8404L60k0297j3901Q42k786M266J232O868R96j592l356P820
14452c002J543o034P780J1502P79K598l393K673m325j4485p537M978m297j3687
$$ y = [-8215, -13566, -9035, 6108, -20951, -7039, 10137, 21091, 18314, 14882, 12883, 16732, 14582, 8623, -14255, -11269, -21674, -41507, -26119, -23462, -30865, -33111, -26517, -24325, -13283, 4504, 3886, -4721, -310, 5, 12003, -10144, -19125, -33482, -30805, -30268, -15936, -3983, -14477, -18559, -5235, -4930, -17571, -16650, 905, 1382, -4662, 3135, 8707, -9855, -19132, -20581, -27917, -23787, -22826, -24035, -23882, -25112, -25951, -8839, 7322, 4640, 6493, 11498, 1128, -1132, -4850, -22428, -14688, 1922, -1403, 5448, 6115, -8457, -16470, -21475, -17876, -12791, -16139, -10594, 3804, 2465, 16245, 27327, 34950, 16546, 16906, -3391, -17292, -16450, -19236, -14970, -13738, -6870, -5874, -7466, -10822, -3002, -1459, -7493, 287, 11789, 12568, 15166, 11773, 14446, 10121, -4364, -11901, -6923, -11220, -24907]
14438b4907j9614J5617L557Q710L981J2131K6198R091p825k7979j3248j0107R422
14425a4973J0591O935q904j1528R533j347k1609p590J1724J1602J9783k595p789
14412f167L341k2675j9448J4293K6627N768K563n851N124L529Q497j0641j5888
14399a0928q127J4222P752j4397j1287j1448J1418m700M326K6878j0893j8066
14387b5250L0586P310P301J613j1240q166j798J2418p234J00J407Q950J641J453
14373A9091q255j7472M288J4049l332J0631l001k4460j9254J7582P883j2141m747
14360a9138K1985k774l308j0088j0724Q852J4625o790p072P02K1290j3354M701
14347a093J1444p31O526J7724n973j2819l0136N942Q684j2699q453L00o900p56
$$ y = [-24907, -44521, -28904, -25347, -16637, -12656, -525, 25673, 34764, 26939, -1040, -14288, -24395, -14973, -4382, 2553, -6351, -17879, -8346, -9693, -31302, -38892, -27168, -15566, 4217, 1622, -6167, -2826, -25501, -44949, -30656, -4029, 1739, 4302, -1549, 3575, 7104, 15601, 4960, -10928, -19055, -4833, 2919, -11478, -22765, -34213, -22795, -27495, -23169, 3709, -7184, -25250, 5336, 12646, 19947, 21560, 10320, 2154, 356, 12774, 5540, 5640, 7047, 15997, 17638, 19091, 10836, -6636, -2348, 11701, 8369, 19000, 15999, -8461, -27715, -10133, -2250, -14391, -19138, 2847, 73, -3235, -13323, -24047, -15195, -570, -7360, -14432, -13730, 7560, -5794, -1093, 10351, 9620, 16146, 33870, 27897, 15078, -15058, -9116, -432, -13131, -21584, -21284, -28184, -28940]
14333b8940m559R915j171p634K3636J1717R777J2084j550j9107k3781L177Q305
14320h131J7707J0025j5243k477q045k1184q689Q657L007K9462L3008J92k1150
14307A7139j5308j408N847M759P083r308N209j6034O517j406k2509j2344p154
14294c8917k768J4880J7518K3240J912j4420j559n097M284n937J819k192J7612
14281A0375K866j127K916R963o105P13r79n866o595R142O104j1725q808m8j0438
14266i612J0011k543k729J7698L722j1910m689k7714k0514J6337P974J0781J3042
14253a46J1665Q064j4893O707k034m711N817m040p662k886j9584j4860P686j0165
14239d1042j1520j387J7357K4842J1163N1n335n233J5014O169j47O680K0133j1705
$$ y = [-28940, -33499, -23584, -24755, -32389, -8753, 2964, 12741, 24825, 23275, 4168, -19613, -16436, -8131, 9576, 19601, 4358, 1881, -6164, -27348, -36037, -27380, -24373, 5089, 38097, 38289, 17139, 1831, 423, 6270, 11029, 18112, 8804, 14013, -2021, 4496, 3090, -19419, -31763, -38917, -41685, -26805, -9287, 13953, 15865, 1445, -114, -5211, -927, -6864, -5045, -7237, 10375, 13241, 12114, 15030, 24993, 18888, 19601, 18622, 12756, 6161, 15303, 21407, 9682, 874, 826, -9612, 399, -2144, -4873, 12825, 16547, 4637, -52, -27766, -48280, -31943, -23969, -13188, -146, 11519, 19583, 4690, 11397, 9363, 4652, 10469, 6429, -1233, -4119, -23703, -38563, -30877, -41042, -52562, -53949, -36592, -11750, -587, -536, -5871, -11104, 3910, 10079, 9932, 16612, 36745, 25040]
14225B5040m703l552L949j654J4215r893k8678n34q184k171j5074L66J1963O08
14211a8302J4781p712k017J1634m206l813N789m444k3120m359J6167j4954j3009
14198d7565J7981K012N643J5777o070j5357p205J3733J9611O315l7j467j5239
14185a1868n929J1096j555N991M40k4543k496J5687J9328K251n283n619K444L69
14171C13J115r047j1213J2191J5365j581j0614O586o365j3913l992J1125K640
14158g390K0080q17k2580n733K2334J8912j2647j9453k37J3270j433J5430J1854
14145C1590k809l5414j1321k52k582r458L2775K4495o755j4072j9975J774Q825
14132c179j1458p927J3803J2149j1632j812J0766k060K012q948j7040r180o074
$$ y = [25040, 20337, 16785, 20734, 19080, 33295, 23402, -5276, -5810, -13994, -16165, -31239, -30873, -18910, -18302, -3521, -11233, -13250, -1616, -5822, -9635, -3846, -8290, -31410, -35769, -19602, -34556, -47565, -29584, -27572, -21929, -6152, -12222, -27579, -34784, -21051, -1440, 4875, 4838, 3371, -11868, -17797, -6701, -8256, -2265, -1825, -26368, -28864, -13177, 6151, 8402, 3119, -2500, -56, 313, 1428, -7619, -18832, -6641, 8724, 7143, -3471, 3115, -3250, -17163, -21155, -10030, -7390, 12690, 11873, -10707, -16440, 5894, 24806, 12159, -7294, -7531, 5739, 4306, 19736, 31590, 28781, -6633, -17954, -18206, -20788, -30246, 2529, 27024, 20269, 6197, -13778, -12004, -3179, -14637, -22564, -8761, 3388, -8244, -10056, 710, -1350, 662, -8286, -25326, -34506, -40580]
14119d0580J6866P746N91Q493N326J0120J6949J5605r842k7341j2237J1378j3612
14106a0538p088q390K3038K2239R489m648j5869j1736n15K2835P783q573j3071
14093D956o326l23O728K0393j6389k2732K160j8632j657K8122N418k240J938J5051
14079A6467J364r555j0270Q080l088j4572P104J0845R368j5289k8181N49q536
14066c5714j0447J3892J6642j118K816O607J4679J1384j0380Q02O96J1864j0303
14053A1420k2915L25q26j539q361m771P722o282J4457k228M16p549M572J304j3866
14038b8121m65M428k23K442R994K297J1028L049m031j2377O116J3983j4612m888
14024a1380N664J9179K930j0642k4490j3945J6714J8800K0427Q064q669l657p59
$$ y = [-40580, -23714, -15968, -15377, -6884, -1558, 8562, 25511, 41116, 31274, 3933, -8304, 3074, -10538, -17626, -26016, -2978, 19261, 28750, 24102, 8233, -3503, -4018, 18817, 26600, 18027, 4956, -1370, -1693, 5035, 25428, 9039, -13693, -11533, -30165, -31822, -3700, 1718, -522, 1416, 16467, 17831, 8276, -1994, 6086, 2998, -11574, -4470, 6375, 15743, 454, -27727, -27178, -35714, -46161, -32269, -15627, -16745, -13929, -7322, 7357, 18741, 8361, 9163, 9859, 21723, 11420, -11495, -11170, -11996, -13535, -21896, -26667, -18945, -25227, -10770, -12998, -12582, -20131, -15559, -14255, -28121, -28586, -24158, -24381, -21939, -11945, -9648, 1380, 4429, 398, -11979, -5863, 8120, -6492, -11380, -5716, 13463, 16393, 5751, -18739, -32684, -15970, 2830, 23257, 31321, 22652, 18995, 18236]
14011A8236m280K198M964o948j5075l2Q214j3991j9389q327R268J8397P500n649
13997d914j476M105j4817q354J8477J2431O848p277m025m805P847p136j2825J1653
13983d268l255l640N057o022K61o661o745J6379J110q522m929J222Q635K1084
13969I706j4869k2621r04p61j1897l086J8909j4233O293O800P861M263q325p107
13955b9971J1312J0108J4577K302p684j1166M681K5804L905j0451q925j210j0586
13942g304O143p86P28J6050m674M470j2926J578O990L976R777J4724o745q656
13928B3345j4877p651K5966J1770J1159k9474o32J9410k92p757o678j2253o379
13915E657O945k376p661J2865k6112p797P031K7842J0513j4814j5587j1835J1563
$$ y = [18236, 13956, 16154, 21118, 14170, -905, -937, 7277, -6714, -26103, -34430, -25162, -6765, 735, -4914, -6390, -2285, -17102, -25456, -6979, 5452, 12300, 5023, 998, -3807, 4040, -3096, -15921, -4268, -7523, -11163, -6106, -12128, -11867, -18528, -25273, -8894, -7784, -16306, -21235, -20013, -11378, 9706, -5163, -27784, -28688, -29449, -41346, -44432, -25523, -39756, -33463, -26663, -18802, -14539, -22864, -29971, -18659, -8551, 6026, 8328, 644, -10522, -5841, 19963, 23868, 13417, 4492, 3282, -7304, -1161, -1947, -1219, 14831, 10157, 14627, 1701, 3279, 10269, 14245, 24022, 38746, 32001, 23345, 8468, 817, 26783, 38553, 49712, 20238, 19606, 39016, 38724, 30967, 24289, 12036, 5657, 12602, 10226, 2565, 15430, -10682, -18479, -11448, 16394, 26907, 12093, -3494, -15329, -3766]
13902c766m157r144j8358k0581j2344P385K8351J5448M045O272J1801O452l352
13889H052j2223J1734O740j8813M708J0770k211m400r939J498n349K9j0573Q800
13875a1177k35k084J2487R700j6733j4655J073K6656J0168k4159o126Q844J5242
13862I001n439m050k448j7486J6652L371r34R760l288r464m688J0522J8436K663
13848B2608k1335J1147j983N917L833L579j543q778j5078r323l028L940j975K047
13834i972N901N853Q03j3217m569p88J1618j38k611p64j0349k4361K359R936L871
13819b6428K87J0675P460L509J248m427j2570J4043J0188l073o922J601j3993
13806a8402j7004Q102J2808m593R565r584m201J7932p399j6732J046J6099J206
$$ y = [-3766, -7923, -17067, -35425, -56006, -68350, -60965, -32614, -17166, -13121, -6849, 4952, 11404, 8052, -4171, 7563, 14303, -4510, 198, 10968, 8757, 4357, -5582, -4084, -9433, -9404, -19977, -11177, -11412, -13496, -1009, 8691, -8042, -22697, -21624, 5032, 15200, -8959, -15085, -6241, 9001, 3562, -488, -2936, -20422, -3770, -399, -1333, 8427, 5139, -4325, -9013, 1509, 19945, 22608, 1273, 12420, 10437, 16354, 20187, 23766, 22223, 13445, -1633, -10956, -13984, -10044, -12019, -9972, -4071, 1782, 2585, -10632, -15201, -15989, -4371, -4509, -7120, -7884, -18233, -42594, -40235, -30299, -26428, -26141, -15466, -8006, -4497, -3249, -7676, -20246, -6203, 3985, 912, -6010, -4409, -18402, -35406, -27304, -14496, -19089, -9524, -19108, -23309, -5377, -12776, -29508, -28462, -12363, -11157]
13793a1157k616l250K0731J2914m161q5l253q388N673J9442N155n779p105j796
13779A6325J1297l573R36m068j0538j135o731l764J17J0776j0317J1962n4l202
13765H031j32J0232q860j8623J8001J5678q189J0767j0413n032r041j3396n480
13752a6457j198K396r21m164p424m714j250l668J1243q32q682J5830L716Q638
13738g487r671k4078J7405J4231k167J7432J2811J1067j1508j6602j0680k589
13726a1836J715Q274j055j025M267J18K495K551N675P050Q011j3982q027j3889
13712i658O240P783J362j2996j3985J3281J0394j0347l401m128k259J0821j2018
13699a8911j0235j054P423K363O727J6053r53j2565J6387K3544O05k1160k5091
$$ y = [-11157, -13773, -17023, 3708, 16622, 12461, 12376, 9123, 735, 6408, 25850, 31005, 25226, 18121, 16325, 27622, 24049, 24985, 20917, 10379, 9244, 2513, -1251, -1134, 9642, -675, 11287, 11233, 8031, 7899, 18131, 9271, -9352, 8649, 24327, 16138, 26905, 16492, 11460, 2419, -10977, -16457, -17655, -15259, -16180, -20344, -27768, -32482, -33732, -37400, -26157, -26989, -35671, -19841, -16125, -7487, -17158, -41236, -23831, -9600, -11767, 5665, 18476, 29543, 18035, 1433, -9247, -11836, -10121, -1847, -2902, -3927, 340, 458, 2953, 5504, 11179, 18229, 26240, 12258, 4231, -9658, -3418, 4365, 5727, -7269, -21254, -7973, 2421, -7926, -11327, -15455, -17714, -6893, -18911, -29146, -30200, -22777, -20414, -13687, 2366, 1413, -11152, 5235, 28779, 29384, 8224, -16867]
13686a6867m244R909O836l521q654l196n357r181J1951Q823n691P160J5802K4458
13672B8228l178o236k4821%N535j5788k300o234p74J2288J0423j1420q582R118
13658a3741O758N702J327j0811P091q589j9489j967R923K6350L050q398o175M415
13644d554j466m024k5973J2807L1927L930o05l815M999l622N744J8310j0606j9988
13630C064k4597j4355J0026J3308j2484K60K2874J2239L467j6308r102K1105J5581
13617B5078j9830l931N868O934j1166o553Q966P352J7967O655k3086n749j3786
13604e281r705k0317j1473J8515J4083L5995J2062k0782k4039k282L098O766q521
13591a1881j1487J5633k468Q341r443k973j73m929j533J5269J3542n853l945q261
$$ y = [-16867, -21111, -11202, -4366, -7887, -16541, -19737, -25094, -34275, -22324, -13501, -19192, -12032, 3770, 28228, 25050, 18814, -6007, -6007, -472, -16260, -18560, -24794, -25568, -13280, -2857, -14277, -22859, -13741, -6983, -1281, 46, -10765, -3674, -12263, -31752, -33719, -23796, 2554, 5604, -2794, -8969, -4554, -6020, -10044, -36017, -23210, 8717, 12647, 12042, 8227, 13226, 9604, 15348, 33658, 23052, 3064, -21533, -35888, -25862, -12554, -25038, -24778, -1904, 10335, 13802, -2506, -11608, 9497, 25078, 5248, 1317, 7185, 14119, 2953, -3600, 5366, 12718, 30685, 37340, 14254, 8505, -5281, -14986, -35303, -46776, -28261, -14178, 21817, 33879, 13097, -10942, -13224, -10126, -3360, -11881, -23368, -7735, -10203, -1862, -11305, -14278, -14451, -19380, -20913, -5644, 7898, 2045, -1900, -10161]
13577a0161n055K752J5457M0136J6740k9180j9840j6860j1433J8052J1428l414
13565H622N229k948j4951O244K5282l182l2762J057J5025l380j1478o367K572
13552a1037K851j405k899M276j937J0525j0672K3133q374r021L586K161j272m166
13538d251Q740J3020o570o223k1456L803J5451P3R515M669L723Q00p647k8951
13524a5304J0523Q551p753J0201j2434j0640k438j537J7855K6662n237J824q751
13511A1522r44J2125o23q298l758j7116k695J7298J1899L331p803k707K086j2826
13497A491j2024J0847J2684k0053J5248J1088n236l091J23P744R095o597k4655
13484c336j3049J204K370j452K2653J8654j2371o596L295J0724q340N047O952
$$ y = [-10161, -15216, -12464, 2993, 43129, 59869, 30689, 10849, -6011, -17444, 608, 12036, 8622, 13851, 10903, -4048, 2196, 27478, 24296, -8466, -7409, 7616, 4236, -7242, -13609, -11037, -8186, -9591, -12490, -8214, -10151, 374, -10298, 12835, 4461, -4560, -974, 1187, -85, -4251, 4489, 17509, 10939, 4716, -16740, -12937, 2514, 2587, 12102, 16771, 20494, 21294, 13647, -15304, -4781, 3770, -3983, 6218, -6216, -16856, -19294, -20831, -2976, 23686, 18449, 20273, 11522, 10578, 22703, 22080, 13782, 10024, -7092, -9787, 7511, 19410, 22741, 14938, 12231, 14317, 1491, -10533, 314, 12998, -7055, 8193, 19281, 14045, 10954, 11077, 18821, 27916, 21319, -3336, -16385, -15181, -12811, -14263, 8390, 27044, 14673, 8077, 11372, 22096, 13756, 18803, 25755]
13471B5755L269L102q549j3199M247J7684m519P429P13j951j7321m580J120J8879
13457C2079j0640j4015P59P361j008j4345K925n914N801j7811N641J0137Q396
13444I366M023p428L420m319j8951j4771k670J6545k526O600J3121J1792M035
13431A8237J948j5988j0941m940o135O180j5138j0514J1502L2695L2398J216j7557
13418B2963J050L596J154k4663m246J578l194q867J365o584j0780Q868J5485K1770
13404A9495P92p156k200k4053M813n494n192K4028J3302q176l775J4856k750k0805
13390b315J547O952N490O645K764o857J3360r215p573N271N792m93j6252n353
13376b37K0599R265j7950P989J8057n214J224p363k239J2418R514M490o73m0l6395
$$ y = [25755, 29024, 32126, 23577, 10378, 14625, 32309, 27790, 35219, 35932, 33981, 16660, 12080, 13200, 32079, 21439, 7424, 8183, 15544, 14536, 191, 3116, -2798, 3003, -14808, -9167, 970, 9366, 13389, 5961, 9381, 5062, -13889, -28660, -31330, -14785, -17311, -10711, 2410, 14202, 18237, 20185, 4197, -6744, -11684, -17819, -11639, -26777, -37291, -25789, 6906, 39304, 40520, 22963, 24013, 27609, 28763, 4100, -146, 1432, -1762, -10629, -9264, -15848, -26628, -17760, -2275, 19495, 20287, 13131, 10931, -13122, -8309, -13803, -18995, 5033, 18335, 10159, 6384, 21240, 18490, -2315, -768, 6184, 11674, 18319, 21083, 14226, 27586, 18371, 10798, 16069, 21861, 21368, 5116, -237, 20362, 29627, 11677, 19666, 37723, 32509, 33733, 26370, 24131, 36549, 46063, 50553, 49880, 49840, 13445]
13361A3445j8696j1582m786J0605N22R823l820k0629P592R141J499p491n565k10
13347b0152J5030J709j5980J600J8095J2512j5271m081j1896P25p626R358L1244
13334A5267K2991K462j4453j5584j5160j1009m189J0869J5057k377p632P823j5727
13321a1662J0461O843j3399K9114J9732j3849k5722m297q814n353n154m032J4476
13308a1656J3228P463J0508J2508j3683o746j2535M825J1937R056r894M259P783
13295B7053j0949L680J517q300p422O492J707j9802P092K25n241L344N498N098
13281I992J284J0275j5008k25J6430j5898M010j842l620M148L613J1511K231j913
13267B4988k1316j8309k480J220J5013J1754k715O818r658j3271J0094J5324J013
$$ y = [13445, -5251, -16833, -21619, -11014, -10492, -669, -4489, -25118, -17526, -8385, -6886, -14377, -19942, -20152, -5122, -3413, -19393, -17793, 302, 12814, -2457, -6538, -18434, -17709, -25335, -15977, 15267, 38258, 40720, 26267, 10683, -4477, -15486, -19675, -8806, 6251, 3874, -3758, 4065, -11662, -1201, 5642, -7757, 21357, 41089, 27240, 1518, -2779, -11593, -16946, -22100, -26132, -11656, 1572, 9035, 19543, 32051, 18368, 11622, -913, 3912, 15849, 24905, 15011, 19270, 27053, 16104, 19784, 21301, 13001, 5579, 12071, 13778, -6024, 1068, 1293, -3948, -604, 4894, 9992, 11276, 21551, 6543, 6318, 22748, 6850, 10860, 9018, 5398, 9546, 13159, 24670, 26901, 24988, 3672, -14637, -17117, -15897, -884, 10870, 8155, 14973, 5315, -7956, 2138, 17462, 18475]
13254A8475M364l678L857j0617N028N599o188l540Q284R699q18j8862j0805m476
13240c678o500K6451J2195p494m563J626J0544j5113j0224j1147j2852L774J2586
13227d395J5441L926j2660j0644M175R206k217O226k485j2511N476J8577R471
13214B7586j6386q989j2230l378P370j097J1689m906j1003J29j297K0499J1547
13201A9534k0792p048J6901K273o321N807J6699l283j6412j9654J057J8619P985
13188A5365n313j0450M321q0K36j726j395m687O333p474K883R917m943J143q424
13173d294L23N337k859J187J2914O594P330J2962r72k405j1745q838O267q314
13159A3487j3429l402m574j91j968J011J2775j584N515J056j0179J0901N8J0171
$$ y = [18475, 22839, 19161, 23018, 12401, 17429, 23028, 16840, 13300, 21584, 31283, 30465, 11603, 798, -3678, -10178, 16273, 28468, 20974, 16411, 18037, 28581, 13468, 3244, -7903, -20755, -16981, -4395, 11046, 14972, 2312, -8332, -4157, 5049, 2832, 9058, 6573, -5938, -462, 18115, 27586, 11200, 2211, -10019, -13397, -6027, -7124, 4565, -341, -11344, -11215, -12512, 7987, 19534, -1258, -8306, 8595, 10868, 4547, 10354, 27053, 23770, 7358, -12296, -11239, 7380, 15365, 10052, -398, 3923, 3843, 4079, 2353, 958, -3729, 2604, -4870, -1987, 7930, 2987, 4130, -4294, -3971, 1366, -1493, -306, 12608, 19202, 26532, 39494, 38522, 36117, 24372, 15534, 21801, 13487, 58, -3344, -7918, -8109, -10077, -9066, 3709, 2125, 7640, 8696, -1483, 9418, 9476, 19647]
13145A9647q685o418J1375k971L2410O096j4758j8094j0776M89o24n336j6967
13132a4612j2070J5453O318O471l384O941J8876k909j4073j2870Q368R362O269
13119A8140J1808N55j5549m742m857q294m465m846J4884J4166m565k842Q669r830
13105H232n064L777k74k5442k1046J758K1035J2507N170J6871L679j0218j3139
13092b154r70K591N440R00n831L96q604o229j405o759R792K323m629K0199J5653
13077B0713Q796Q432K889L393j2878j2011j2758j986N385K319l814J1043J9952
13064C9475l03m351j1807j1222O334N325n380N858l594j8015p45J0626j607M001
13050A4595J4203n430k2817j8099J186J5281J2085O104O32K5677K0062r392k0851
$$ y = [19647, 10962, 4544, 15919, 12948, 45358, 51454, 36696, 18602, 7826, 8315, 7691, 2355, -14612, -26682, -11229, -4911, 1560, -1824, 5117, 23993, 21084, 7011, -5859, 2509, 11871, 18140, 29948, 30503, 14954, 10212, 5355, -2939, -7404, -12250, 2634, 16800, 12235, 9393, 18062, 8232, 3168, 6945, 6671, -18771, -39817, -38059, -17024, -4517, 653, 17524, 21203, 10985, -2154, -3124, -533, 4907, 5807, -24, 372, -8232, -14461, -15866, -22625, -12833, -10510, -15139, 5060, 20713, 29509, 37941, 40830, 44223, 31345, 19334, 6576, 4590, 9975, 12294, 8480, 19523, 39475, 39172, 34821, 23014, 11792, 18126, 23451, 18071, 23929, 20335, 2320, 1575, 12201, 10594, 14595, 28798, 23368, 551, -17548, -16362, -1081, 11004, 17108, 17740, 43417, 63479, 54087, 33236]
13037C3236j6599k141L498R347K5504j2992k9336j4523M056J117J4432Q347L736
13024B7682m618k4524j916M938n795K143J2559K919p832k258p015j072O675L468
13010E354j194n873M956O881N959j9187k6929j0885K6131J6600m914L3J3448j3603
12996c223J3884L693J4161Q666j6717q372L965J316M075P829K5J0289J0392j1719
12982C8264j9401o4J7152M789j2540m438K4710M906P501k202k1826j1812n816
12969A9223o11q496L168J9068l292N358K533J0179J326j7958j4812J6742j6694
12956A5734j1084O859J70j1454O863L443Q059n066o365J425J4209J2975k0736
12943A5032j3921K087J2895J2518k549O485o446p376K495Q597O797R814M86K7683
$$ y = [33236, 16637, 14496, 17994, 27341, 52845, 39853, 10517, -4006, 50, 1167, 15599, 23946, 27682, 23064, -1460, -3376, 1562, -4233, -2090, 10469, 13388, 5556, 3298, -3717, -4789, 1886, 5354, 4160, -1713, 3243, 10124, 16083, -3104, -30033, -40918, -14787, 1813, -3101, -3068, 10380, -3223, 10661, 14354, 28515, 37181, 20464, 12092, 16057, 17373, 21448, 29277, 29302, 39591, 49983, 38264, 18863, 18799, 35951, 40740, 28200, 23762, 48472, 53378, 60879, 58677, 36851, 25039, 19223, 18612, 10116, 13284, 32352, 29060, 34418, 36951, 47130, 48456, 30498, 15686, 32428, 15734, 4650, 11509, 11679, 225, 7088, 10531, 18590, 13524, 7159, 8584, 22793, 35768, 15032, 1111, 3198, 16093, 28611, 26062, 32547, 26101, 18725, 21220, 29817, 36614, 46428, 46914, 74597]
12929G4597O387j7745j686j81j2615J1293p748j437P394k796k441j9699q722J5884
12915D0485N818j0920n608o552P321R692R970l04n208j0307j2268r70l448k197
12901A5504Q956O096K386J1318Q906j3767l863q770J3244J8771j2088j6147M129
12888C4675J2289m449Pj1387Q751j3910J561O743q256N281O015j2759n909J2653
12874C1305J2380j4008p223o680J2829K1367O847p934j3621j5735O329m189o978
12861A4689k738K455J256J1547J2626l295J7j316P477q07p552L65Q733L327j1210
12846C5574K971K706L606L468j0416J0717n393j31j3766M52M244Q427L410n984
12832C9885j0260M555J3396l708o844j4491l592q90r97N896p098J2865J3200J7119
$$ y = [74597, 80984, 63239, 61553, 61372, 48757, 60050, 52302, 50865, 58259, 55463, 53022, 33323, 24601, 40485, 46303, 35383, 29775, 23223, 30544, 40236, 50206, 49902, 44694, 34387, 22119, 21149, 17701, 15504, 24460, 30556, 32942, 44260, 53166, 39399, 35536, 26766, 40010, 58781, 46693, 30546, 34675, 46964, 42515, 42522, 31135, 39886, 25976, 27537, 34280, 26024, 31305, 37320, 24561, 18652, 31305, 43685, 29677, 22454, 15774, 28603, 49970, 56817, 48883, 35262, 19527, 25856, 21667, 14689, 11951, 14406, 15662, 27209, 39835, 36540, 36557, 35241, 42718, 41911, 34359, 34724, 43457, 46784, 35574, 38545, 41251, 44857, 48325, 37909, 48626, 43233, 43102, 29336, 29788, 34032, 42459, 45869, 39885, 29625, 34180, 47576, 43868, 37024, 22533, 18941, 18051, 17054, 22950, 15852, 28717, 41917, 59036]
12818E9036p651J864n696l299j7773L689q99r796m957j911j067J6045L804o881
12804B4508J4291J6541k437j8352j099l234J5627O828l791p706o656j7692K978
12791A9806K0555M902Q172j4105p676R82j8848k594j790J2766J5314j892j1889
12778B3703j2472l08K2762J9640j1241j4326Q931J1954k087l819J2229O374j9115
12765D2225j6159q173o58J7815J3894J4844N996n471r276p515n362J228J2845
12752E6233K818j0005m198n477J9110J1000j393n483K906K521k1614j9971m299
12739B2148P137K99J5203J5257K563m338K48o672j7915L180K0345k634O435Q144
12725F9400P256o829n980J6187R077n811j8316K782j881p545n768n069J2497R616
$$ y = [59036, 51385, 53249, 47553, 44254, 26481, 30170, 29271, 19475, 14518, 12607, 11540, 27585, 31389, 24508, 38799, 55340, 52903, 34551, 33452, 30218, 45845, 52673, 48882, 41176, 34520, 16828, 19806, 40361, 45263, 53435, 39330, 31654, 32636, 13788, 11194, 9404, 22170, 37484, 35592, 23703, 11231, 10923, 33685, 53325, 42084, 27758, 36689, 48643, 46556, 42737, 54966, 61340, 42225, 26066, 17893, 17235, 35050, 48944, 63788, 69784, 64313, 55037, 47522, 42160, 43388, 56233, 59051, 49046, 44848, 39371, 58481, 69481, 68088, 62605, 65511, 68032, 46418, 26447, 22148, 29285, 29584, 44787, 60044, 62607, 58269, 58517, 51845, 33930, 37110, 57455, 54821, 61256, 69400, 76656, 69827, 63847, 80034, 89111, 83300, 64984, 67766, 65885, 58340, 52572, 47503, 60000, 69616]
12711F9616J1136J4127O748j6763j070J7494J6486J4095p566j9377j0319J0247
12699A04854q03J0161M825k41J2876L56K0774K1270l587j0578n79L096L674o008
12685A60090J3491J0520n18n732K727n526k004M966j180m526j7220n616L1393
12672A80865K897j493r295m898J8210o059Q057J8336n509j5832J626k129J6220
12659B00996J7895n186K0134Q362M826k0142k7725o392Q274Q957K2619J889r980
12646B24527j7724P91m57j2715j1073L192R487j0691j5585j3083m376K0137J1482
12633A83912Q70m36J524m076M350J2348K975j5514P476J3299j1302J255j4711
12620A81970q351j3671j5014j896k038l686l325j720L035m814m930Q98j4491k6417
$$ y = [69616, 80752, 94879, 101627, 84864, 83794, 101288, 117774, 131869, 124303, 104926, 94607, 104854, 104051, 114212, 119037, 118796, 131672, 132028, 152802, 174072, 170485, 159907, 159328, 162424, 166098, 160090, 173581, 184101, 183583, 177851, 180578, 175052, 173048, 178014, 176834, 172308, 155088, 149472, 180865, 183762, 182269, 172974, 168076, 186286, 180227, 188284, 206620, 201111, 185279, 186905, 184776, 200996, 218891, 213705, 233839, 242201, 247027, 226885, 199160, 192768, 201042, 209999, 232618, 234507, 224527, 206803, 207594, 207137, 194422, 183349, 186541, 196028, 185337, 169752, 156669, 152293, 172430, 183912, 184782, 184346, 185870, 181794, 186144, 198492, 201467, 185953, 193429, 206728, 195426, 196681, 181970, 173619, 159948, 144934, 143038, 141000, 137314, 133989, 132269, 135304, 130490, 125560, 126458, 111967, 85550]
12606H5550l08K1396k416k6901m89J7579K4851j6474R9o795j8110m25N120J399
12592H4076P845j3301r703k680p721K0542P535p229m914n071J0239M680P229M63
12578I1990r670j7423q708K142J6429K833l577R51N350J3059J4881J9350o561
12565A21046k2650j67O79l150M108O688l109r517k636O900O263j1725q647M238
12551H8321p53j0897l585k1196N171J9947J2744J2440P91r89l881p277j232P274
12537I6878j1452j1515p560N761P018Q041j529N093M351J8773J7301L639p451
12524A27348j3306J818k843k1980L291R104O100j0538J4122J0583p109j3037k899
12511A00654J1446K466K7522J847k6056r417j1121J9724P931P327O134K794j4617
$$ y = [85550, 85242, 106638, 104222, 77321, 76832, 94411, 119262, 102788, 102887, 96092, 77982, 77557, 82677, 84076, 91921, 78620, 68917, 66237, 58516, 79058, 86593, 79364, 74450, 69379, 79618, 84298, 91527, 91990, 82320, 64897, 56189, 58331, 74760, 77593, 74016, 74967, 80317, 93376, 108257, 127607, 121046, 98396, 98229, 98908, 95758, 99866, 106554, 103445, 93928, 91292, 98192, 104455, 92730, 84083, 88321, 87568, 76671, 73086, 51890, 57061, 77008, 89752, 102192, 102983, 101994, 98113, 90836, 89604, 96878, 85426, 73911, 66351, 72112, 79130, 87171, 85642, 90735, 95086, 113859, 131160, 134799, 127348, 114042, 115860, 113017, 91037, 94328, 103432, 109532, 98994, 113116, 123699, 116590, 103553, 100654, 112100, 114566, 142088, 143935, 117879, 108462, 97341, 117065, 124996, 132323, 138457, 141251, 126634]
12498A26634q386J0210J1947L36J1568j8968k7142K87N906m239J999J918J3151
12485A25221J7500N596L521r444J7334K596o221q509Q437M047j735o39M311Q134
12471A70149K647O128k3298k3060P948J5196j827j4608r227P43N667J2915j9048
12458A30325L64J1254P82R041K0001M795m409j3251j8266r112J0576J1304Q584
12445A61988J5371N227L670p060P426J2349o198k223o545l43j1488O132k171o246
12431A69889l183j388N858Q167N405j222p425L186j406J5360L5899J8855O406
12418B54401o270j2157o0n382j3790o943J5772M425R607N843Q394j841k833K5748
12404B74914Q928n539j0995j3600l869j2659l331N388l182R248L6631P882J1589
$$ y = [126634, 118248, 128458, 140405, 140741, 152309, 133341, 106199, 106486, 112392, 108153, 110152, 112070, 125221, 142721, 148317, 151838, 142394, 159728, 162324, 156103, 147594, 156031, 160078, 158343, 157704, 162015, 170149, 172796, 178924, 155626, 132566, 140514, 155710, 153883, 139275, 130048, 130791, 136458, 149373, 130325, 130689, 141943, 142725, 151766, 171767, 176562, 172153, 158902, 140636, 131524, 142100, 153404, 161988, 177359, 182586, 186256, 179196, 186622, 198971, 192773, 190550, 184005, 183662, 172174, 178306, 176135, 169889, 166706, 165318, 171176, 179343, 184748, 183526, 176101, 179287, 177881, 193241, 229140, 247995, 254401, 248131, 235974, 235914, 230532, 216742, 209799, 225571, 229996, 239603, 245446, 253840, 251999, 249166, 274914, 283842, 278303, 267308, 253708, 249839, 237180, 233849, 239237, 236055, 245303, 281934, 289816, 301405]
12391C01405L684M80m187Q699j7715J6386J2849j2397R463J0287K5042K6661J2042
12378C92699j0483q799J452J6925K7380P442l2513k2893j7413J3860n592n41L1679
12365C93203J1274r550r10L514O271m304J1105p237M614J7422l656k304J3132
12352D32574O646R553J3915J7028J4151J8539M342k344j421l629K607P146J3125
12339E32232J9188J6683J5210K966O875R49J0579K0739m437L335M314J9899J6238
12326F64770J0183J6339J4515J9179L057J0933O193O306K0628K9763L5049L6324
12314H73239J6455J8337J4392J5300K4015L9785K1613J3310L4116K8451K1466
12303A120479K2938L1947L3263M4395L0737J687L4208N2096N3348N5846M3268
$$ y = [301405, 305089, 305569, 301382, 310081, 292366, 308752, 321601, 309204, 318667, 328954, 353996, 380657, 392699, 382216, 373417, 374869, 391794, 419174, 426616, 394103, 371210, 353797, 367657, 362065, 361524, 393203, 404477, 394927, 394017, 397531, 403802, 399498, 410603, 403366, 407980, 425402, 421746, 419442, 432574, 439220, 448773, 462688, 479716, 493867, 512406, 516748, 514404, 512983, 509354, 511961, 519107, 532232, 551420, 568103, 583313, 586279, 593154, 594103, 604682, 625421, 620984, 624319, 628633, 648532, 664770, 674953, 691292, 705807, 724986, 728043, 738976, 745169, 751475, 772103, 801866, 836915, 873239, 889694, 908031, 922423, 937723, 961738, 1001523, 1023136, 1036446, 1070562, 1099013, 1120479, 1143417, 1175364, 1208627, 1253022, 1283759, 1285446, 1319654, 1371750, 1425098, 1480944, 1524212]
12292A524212M1507N4067N6584P0230Q4638P5626P7526Q7472Q4747P6227J19353
12281B352189J32794J25655J22811J46100J41553J66732K01703K02163K21828
12272C813528K74660K95139K97885L35895L85486M45187N03179N65102O41346
12263G557407P13160P78158Q72077J012770J128513J248574J349154J480548J540535
12254A7680896J585044J571538J447049J278962R98292O78738L36590R039k26865
12245B5359283m16593n07872n30258m90761m09614k93706j55235p3617L7803J13141
12235B2632571K22055L38632M46021N90546P71188R42366J082821J261132J401854
12226B9689186J444763J463494J412273J273306J106883Q99513O78655M15305
$$ y = [1524212, 1565719, 1619786, 1676370, 1746600, 1831238, 1906864, 1984390, 2071862, 2156609, 2232836, 2352189, 2484983, 2610638, 2733449, 2879549, 3021102, 3187834, 3389537, 3591700, 3813528, 4088188, 4383327, 4681212, 5017107, 5402593, 5847780, 6350959, 6916061, 7557407, 8270567, 9048725, 9920802, 10933572, 12062085, 13310659, 14659813, 16140361, 17680896, 19265940, 20837478, 22284527, 23563489, 24561781, 25240519, 25577109, 25586148, 25359283, 24942690, 24434818, 23904560, 23413799, 23004185, 22710479, 22555244, 22481627, 22519430, 22632571, 22854626, 23193258, 23639279, 24229825, 25001013, 25943379, 27026200, 28287332, 29689186, 31133949, 32597443, 34009716, 35283022, 36389905, 37289418, 37968073, 38383378]
12218C8383378J77038o1231l09051n05739o32519p56555q21762q89920r74037
12209C3609602j032141j071754j072598j094611j061221r64538q41688o70473
12201B5800578n29861l67039k07866q0389J7307J61219K50527L55362M77403N80376
12191B6457617O68405P46311P41124O54982M43530J70859j57260n87675r74967
12182B8162926j311600j581645j709861j777564j790422j748855j638588j487130
12174A5117261j370183j233711j095685r77091q83304p81581p00752o33680n51352
12165F889922m99751m63697l97377l55941l34343k96577k63035k47749k16534
12156C814918j90169j64827j77836j60393j50579j37102j07778j18263q8530j01929
$$ y = [38383378, 38560416, 38499185, 38190134, 37684395, 37051876, 36295321, 35473559, 34583639, 33609602, 32577461, 31505707, 30433109, 29338498, 28277277, 27312739, 26471051, 25800578, 25270717, 24903678, 24695812, 24615423, 24632730, 24793949, 25044476, 25399838, 25877241, 26457617, 27126022, 27872333, 28613457, 29268439, 29711969, 29882828, 29725568, 29137893, 28162926, 26851326, 25269681, 23559820, 21782256, 19991834, 18242979, 16604391, 15117261, 13747078, 12513367, 11417682, 10440591, 9557287, 8775706, 8074954, 7441274, 6889922, 6390171, 5926474, 5529097, 5173156, 4838813, 4542236, 4279201, 4031452, 3814918, 3624749, 3459922, 3282086, 3121693, 2971114, 2834012, 2726234, 2607971, 2519441, 2417512]
12146B417512j09642q6136q1584p0690n6207p3197p8985m4027m3165l8084k6617
12135A709178l5873l8013o1074l4855l9560n0597l0577k8778k1849p620k9374
12124A331008l8965l2092j9315j2932j1932l1349k4626l0515j6626j7332j6505
12113A078819p182k8566j0632n615o568j4227k1695J30r879k6525n13k140k9334
12100I16073l625r506R718L247l867k0381j3326j7018j4726j428o484P172k0451
12087H25398m764k888j3794j4784j1251J2665K058O083p698l503o059k169p970
12074G71324J2985J4034O965m11J1137n025p480M612P947J9090r637O318K3809
12061H55668J4960Q091j1324K3885q878m560j0139R630N047k1369j3307j4874
$$ y = [2417512, 2307870, 2221734, 2140150, 2069460, 2013253, 1940056, 1861071, 1817044, 1773879, 1735795, 1709178, 1673305, 1635292, 1574218, 1539363, 1499803, 1449206, 1418629, 1389851, 1368002, 1360382, 1331008, 1292043, 1259951, 1240636, 1227704, 1215772, 1184423, 1159797, 1129282, 1112656, 1095324, 1078819, 1071637, 1043071, 1032439, 1026824, 1020256, 1006029, 984334, 984464, 974585, 948060, 947547, 945407, 916073, 912448, 902942, 912660, 915907, 912040, 891659, 878333, 861315, 846589, 845161, 838677, 845849, 825398, 820634, 817746, 803952, 789168, 777917, 790582, 792640, 798723, 791025, 787522, 781463, 779294, 771324, 784309, 798343, 805308, 804897, 816034, 811009, 803529, 808141, 816088, 835178, 825541, 831859, 855668, 870628, 878719, 867395, 891280, 882402, 877842, 867703, 877333, 882380, 861011, 847704, 832830]
12049H32830r404N618o557q096p893k1693K287j1026P367P745O269n11o641r075
12035G81220O961N091J0920J8137K5784O944O284l528M28R397P871O364J524j870
12021H81527K0181J5052K4619J3880L767J4875J7701J7621J026r598J832m329
12009I98154R580J9993Q643O722Q307J1244Q430K5883L1213K8967K8271o385K22
11996A179244J6824O783J6013K2067K6371K8500K0756L760J2757K0078j0618J683
11984A344218K8456L7221L1148J6337K0883M6538L5440L4553L6525J9202L5155
11973A685676L0535J5928J8111Q312J5389K6072N4125L3096L9651L2902M7536
11962B007333N0918L6548J5598L7878N0577M2461L1603L2882M0427M6002M9532
$$ y = [832830, 823426, 829044, 822487, 814391, 806498, 784805, 787092, 776066, 783433, 791178, 797447, 796936, 790295, 781220, 788181, 793272, 804192, 822329, 848113, 855057, 861341, 857813, 858241, 867638, 875509, 881873, 883397, 881527, 901708, 916760, 941379, 955259, 959026, 973901, 991602, 1009223, 1010249, 1000651, 1002483, 998154, 1007734, 1027727, 1036370, 1043092, 1051399, 1062643, 1071073, 1096956, 1128169, 1157136, 1185407, 1179022, 1179244, 1196068, 1202851, 1218864, 1240931, 1267302, 1295802, 1316558, 1320318, 1333075, 1353153, 1342535, 1344218, 1372674, 1409895, 1441043, 1457380, 1478263, 1524801, 1560241, 1594794, 1631319, 1650521, 1685676, 1716211, 1732139, 1750250, 1758562, 1773951, 1800023, 1854148, 1887244, 1926895, 1959797, 2007333, 2058251, 2094799, 2110397, 2148275, 2198852, 2241313, 2272916, 2305798, 2346225, 2392227, 2441759]
11951B441759M4412M9373M4470M4282N0245P7335M3274L9365M6512M2917O9628
11940B993572P1155N8362N8132P0018O4342O8282Q5831P1753P1444P5886P0341
11929C759118P3420P9097N3643M8810L7372L5386N8748N7290M5908M5379M4058
11918D338229N2594M3921K9315K8489M2386L7957M6512N8260K7747J6251J4749
11907D736410L0645N0365L7143p808P185K598p866N947K080q923j4179k1164m2679
11894D769754k0140j7138k6324m9959m3060l0494j5654m3766n4147k8176k9410
11883D411486n6042n2196m7360l6430n0532m8120o0517o0938o0981p5474q0566
11872C782330p6578q9000n1308n2456p3225o8205o5655l8102l6098o1450m5827
$$ y = [2441759, 2486171, 2535544, 2580014, 2624296, 2674541, 2751876, 2795150, 2834515, 2881027, 2923944, 2993572, 3064727, 3123089, 3181221, 3251239, 3315581, 3383863, 3469694, 3541447, 3612891, 3688777, 3759118, 3832538, 3911635, 3965278, 4014088, 4051460, 4086846, 4145594, 4202884, 4248792, 4294171, 4338229, 4390823, 4434744, 4464059, 4492548, 4534934, 4572891, 4619403, 4677663, 4705410, 4721661, 4736410, 4767055, 4817420, 4854563, 4846755, 4853940, 4856538, 4848672, 4854619, 4856699, 4847776, 4833597, 4812433, 4769754, 4749614, 4732476, 4706152, 4656193, 4613133, 4582639, 4566985, 4523219, 4469072, 4440896, 4411486, 4355444, 4303248, 4255888, 4219458, 4168926, 4120806, 4060289, 3999351, 3938370, 3862896, 3782330, 3705752, 3616752, 3565444, 3512988, 3439763, 3371558, 3305903, 3267801, 3231703, 3170253, 3124426]
11861C124426o0987p5879o8256o2864o3139k9462k7433m0014l7818m2420k8096
11850B588058k1133m5909o8984p2448l9449k2134n0392m7299k9233j6975l3943
11839B140159m9682m7858m3047m2864l5231k9717k3204l2116n8969k9526k3145
11828A724800m6685l0405l7109m2538j2883j2326k0892k9638o560O404k8412k0884
11816A442872k2547l2581j8893l4354j4392p122J027j7704k7684j5911j8646k104
11804A231961R150j3265k1410k0768j8315l9386j4757l066k6105l7873m755J7951
11792A059362O716l5793k3849j6196q513J328k320o204q166k907m313j8687k2710
11779I17748P415K1j6238j5331o532L968O889l4442q961j2196k3826k0792J7230
$$ y = [3124426, 3063439, 2987560, 2919304, 2856440, 2793301, 2763839, 2736406, 2696392, 2658574, 2616154, 2588058, 2566925, 2521016, 2452032, 2379584, 2340135, 2318001, 2267609, 2220310, 2191077, 2174102, 2140159, 2090477, 2042619, 1999572, 1956708, 1921477, 1891760, 1868556, 1836440, 1777471, 1747945, 1724800, 1678115, 1647710, 1610601, 1568063, 1555180, 1542854, 1521962, 1492324, 1485764, 1492168, 1463756, 1442872, 1420325, 1387744, 1368851, 1334497, 1320105, 1312983, 1314010, 1296306, 1268622, 1252711, 1234065, 1231961, 1241111, 1227846, 1206436, 1185668, 1167353, 1127967, 1113210, 1110144, 1084039, 1046166, 1041411, 1059362, 1066078, 1030285, 1006436, 990240, 981727, 983055, 980735, 974531, 966365, 963458, 959145, 940458, 917748, 925163, 925184, 908946, 893615, 887083, 891051, 897940, 863498, 854537, 842341, 818515, 797723, 814953]
11766H14953n58j0769k5798J073J1j6395k4365j9764p984k429Q860p146k2398
11753F87291k1890j0289O595J4226j9885j5115N784K2711l183Q887P192j4766
11741F67558J257m617l0686k6791j1422m411q575j352n691k4636p845k571j5831
11728E24387j6091p701p649J4112J765k1605k5771k8969J2325M981j5435m276
11716D30073q026L781J1729j0370k4328r510j5407J7172J7815o374K098m784N120
11703D08989j2340p551n961k168p421O219j847N570J849j3473J1871J2129J3563
11690D09429k002n285l6930k2513j1622n817l688j2847J3137J9244L543j1858
11678C32791j0855N028M702j834m043J4190J2162N76R642j1466j0913j5019J6137
$$ y = [814953, 814395, 803626, 777828, 778901, 778912, 762517, 738152, 718388, 710404, 707975, 716835, 709689, 687291, 665401, 655112, 661707, 675933, 656048, 640933, 646717, 669428, 666245, 675132, 682324, 667558, 668815, 664198, 633512, 606721, 595299, 590888, 582313, 580961, 575270, 550634, 542789, 540218, 524387, 508296, 500595, 492946, 507058, 508823, 487218, 461447, 432478, 444803, 449784, 434349, 430073, 422047, 425828, 437557, 427187, 402859, 393349, 377942, 395114, 412929, 406555, 408653, 403869, 408989, 396649, 389098, 383137, 380969, 373548, 379767, 377920, 383490, 385339, 371866, 383737, 395866, 409429, 407427, 402142, 365212, 342699, 331077, 325260, 321572, 308725, 321862, 341106, 344649, 332791, 321936, 326964, 331666, 329832, 325789, 339979, 352141, 352717, 362359, 350893, 339980, 324961, 341098]
11665C41098m110j4508m557O274o03j1337k208O32p392r372O325j3801j7698Q352
11651B77095J5392K8892q396j0355K629M23q867q505n094r55Q906J243O639k824
11637B96223n266k658j9074Q084K5737k15j1761N337J2233J5004O441k4052o356
11624B99677n700k0353q633J717Q77O894J6847K0013r3r438k4085N961o29o461
11610B76594M562n834j377L41L278L545j769K7956K3711K034j1098j6369J093
11597C06667R645K6655J0097j5577j191p232n525J787l947P40L373J3731L703
11584C42926J2313J7074M471J0637q096j4866M303O341J3124J3960K0570r07K8713
11571D50563J4926J7101j1664j938J6062J77l389N481j88j328j1291J081J2999
$$ y = [341098, 336988, 322480, 317923, 324197, 323594, 312257, 310049, 310681, 303289, 293917, 300242, 286441, 268743, 277095, 292487, 321379, 312983, 302628, 305257, 305680, 296813, 288308, 283214, 282259, 291165, 292408, 299047, 296223, 290957, 288299, 269225, 277309, 303046, 302831, 291070, 296407, 308640, 323644, 330085, 306033, 299677, 293977, 273624, 264991, 266708, 267585, 274479, 291326, 311339, 311246, 301808, 277723, 283684, 283055, 276594, 281156, 275322, 273945, 274286, 277564, 281109, 279340, 307296, 331007, 333041, 321943, 305574, 306667, 316312, 342967, 353064, 337487, 336296, 329064, 323539, 325326, 321379, 322119, 325492, 339223, 342926, 355239, 372313, 376784, 387421, 379325, 364459, 368762, 375103, 388227, 402187, 422757, 421850, 450563, 465489, 482590, 470926, 468988, 485050, 485227, 481838, 487319, 487131, 485803, 474512, 475593, 488592]
11558D88592j9633j8541j0998j554j076j7601j9834P043J1138L8371J0549j4789
11546D51667R077p064J0514J1307J5568J6220K2643J0248o988j5160n555j0269
11534E02208j3971J6849K7081J5540J0226j8437j3213K6307K6501m828J7321M555
11522E96139N709J7384R871J964q51R735M173K7880J9612k389J2774P444P454
11509G16899K7269J6933J1020J1065J1528K0293R627J8539K2997J6006M3398K3017
11497I48591J2120K1654K8334K7615J4731K3487L8567L3884L2796L5681M6750
11486A264210O3976N1481N1440M6021M9418N3130O6505P8515P7738P5276J00692
11475A978402J12194Q1670J07747J31217J22633J28397J41921J54600J80029J97759
$$ y = [488592, 468959, 450418, 439420, 437866, 436790, 419189, 399355, 406398, 417536, 455907, 466456, 451667, 460744, 453680, 464194, 475501, 491069, 507289, 529932, 540180, 533192, 518032, 512477, 502208, 488237, 505086, 532167, 547707, 557933, 539496, 526283, 552590, 579091, 574263, 591584, 596139, 601848, 619232, 629103, 631067, 630216, 639951, 644124, 672004, 691616, 689227, 702001, 709445, 716899, 744168, 761101, 772121, 783186, 794714, 815007, 824634, 843173, 866170, 882176, 925574, 948591, 960711, 982365, 1010699, 1038314, 1053045, 1076532, 1115099, 1148983, 1181779, 1217460, 1264210, 1328186, 1379667, 1431107, 1477128, 1526546, 1579676, 1646181, 1724696, 1802434, 1877710, 1978402, 2090596, 2172266, 2280013, 2411230, 2533863, 2662260, 2804181, 2958781, 3138810, 3336569]
11465C336569K24301K55247K87017L23569L60484M15221M66860N31498O08873
11456F809639O91973Q13708R33824J083595J266537J472387J689442J930734K164609
11447A8856448K410427K555087K594189K445997K112859J562013Q92740J48224
11439C3577984n15022j028958j346849j484221j447816j300793j090502q70428
11431B4493395o74947m53774k80267j18117R669J76440L92138O31877Q93243J168906
11421B6238563J398670J582726J675004J635967J534765J402299J237284J126280
11413C7831558J058096J008780R21374P56385N41890K84326m5719m04519p16019
11404D1236152j029007j364545j656890j890851k069124k105869k023066j818432
$$ y = [3336569, 3560870, 3816117, 4103134, 4426703, 4787187, 5202408, 5669268, 6200766, 6809639, 7501612, 8315320, 9249144, 10332739, 11599276, 13071663, 14761105, 16691839, 18856448, 21266875, 23821962, 26416151, 28862148, 30975007, 32537020, 33429760, 33577984, 33062962, 32034004, 30687155, 29202934, 27755118, 26454325, 25363823, 24493395, 23818448, 23364674, 23084407, 22966290, 22975959, 23152399, 23544537, 24176414, 25069657, 26238563, 27637233, 29219959, 30894963, 32530930, 34065695, 35467994, 36705278, 37831558, 38889654, 39898434, 40819808, 41576193, 42118083, 42402409, 42356690, 41952171, 41236152, 40207145, 38842600, 37185710, 35294859, 33225735, 31119866, 29096800, 27278368]
11396B7278368j584373j303634j017434p75671o05035m41232k86537j77378l0794
11387B1056280J27942L29318N39245P45407R47576J104324J182030J159394J005942
11378B8197458O38298J27938m61485j083695j582542j939805k150197k182000
11370A9563970k080792j906863j722268j532039j357872j160302j015379q69559
11362G918896p46881o69725n85453n19190m40835l78483l35327l04197k88058
11353C650747k36684k16689j86730j62116j70829j54719j34081j15888j23099
11344B149912j24768q9047p2399p0341r2706o9690n7225n8954o0167n1179n5951
11333A347485o6676m2196l4473l6693j5983k4836l5918m1749j1372j3525m0738
$$ y = [27278368, 25693995, 24390361, 23372927, 22597256, 21992221, 21550989, 21264452, 21087074, 21056280, 21184222, 21513540, 22052785, 22798192, 23745768, 24850092, 26032122, 27191516, 28197458, 28835756, 28963694, 28502209, 27418514, 25835972, 23896167, 21745970, 19563970, 17483178, 15576315, 13854047, 12322008, 10964136, 9803834, 8788455, 7918896, 7172015, 6502290, 5916837, 5397647, 4956812, 4578329, 4243002, 3938805, 3650747, 3414063, 3197374, 3010644, 2848528, 2677699, 2522980, 2388899, 2273011, 2149912, 2025144, 1936097, 1863698, 1793357, 1700651, 1630961, 1573736, 1514782, 1454615, 1403436, 1347485, 1280809, 1238613, 1204140, 1167447, 1151464, 1126628, 1090710, 1048961, 1037589, 1024064, 983326]
11322I83326k4236k7078l9261o007o752k1403k8120k2585k3254k350k0251m1392
11310G20637l3827j5540l168j4875N961p696j5800m703p291J022O854j800j7850
11297F11924m1541j0299j6566J802J0457n752r841j9215j8960j2561L807j188
11285D92067k7090m652j1733p782J7395m74m043k8392k1250O261K516J2397L795
11272D29015q660k9415j1238Q504p751j3168p607j0457j6477j84j4938R060J0395
11259C37079j2711o307k1K5267M5999j795j7394k291q220J035Q842j1291j9453
11246C38739o081j4716j6789r680j054l638j2680k0672l779n153J976J3369M551
11233B64393j4825m616P169J9287j1512k7751j6781O70J0025q309k394j0928K5189
$$ y = [983326, 959090, 932012, 892751, 886744, 879992, 858589, 830469, 807884, 784630, 782280, 762029, 720637, 686810, 671270, 668102, 653227, 659188, 651492, 635692, 630989, 623698, 624720, 631574, 629774, 611924, 570383, 560084, 543518, 545320, 555777, 550025, 540184, 520969, 502009, 489448, 493255, 492067, 464977, 460325, 448592, 440810, 458205, 457731, 453688, 425296, 404046, 410307, 412823, 425220, 429015, 420355, 390940, 379702, 388206, 380455, 367287, 359680, 349223, 332746, 332562, 317624, 326684, 337079, 324368, 318061, 318040, 343307, 389306, 387511, 370117, 367826, 359606, 360641, 369483, 358192, 338739, 332658, 317942, 301153, 291473, 290419, 286781, 274101, 253429, 249650, 244497, 246473, 259842, 264393, 249568, 244952, 252121, 271408, 259896, 232145, 215364, 216034, 226059, 217750, 215356, 204428, 229617]
11220B29617J2561J682k4333L709l664l335j1790P123j338J0092J889k6899j2245
11207A83069M826J4553k770j4585j30Q93O496m803o986R366K4305k172j1795p995
11193A92272j000M382k0135k3744K3064J9380l400K179L894n992j8647j6935l714
11180A51604j4534J0292K7023K1523J770J4233j2038l6254j5536J024r753J382
11168A40736K5916n153j0698j654l761K0929J3277M638k6868m77K694n404j9736
11155A34439j2077q98m811m307J726R464j1179r508Q489J2416J3087Q966j6844
11142A28963j270M612J139Q061N134j5758j7313l659L871o396j5256J164J4804
11129A08096j2238J2667J8577K4399j3056l2297k1167J0538J0519Q37J1448Q063
$$ y = [229617, 242178, 243860, 219527, 223236, 219572, 216237, 204447, 211570, 210232, 220324, 222213, 195314, 183069, 187895, 202448, 199678, 185093, 184963, 185856, 192352, 187549, 180563, 189929, 214234, 212062, 200267, 192272, 191272, 195654, 175519, 151775, 174839, 194219, 190819, 192998, 196892, 190900, 172253, 155318, 151604, 137070, 147362, 174385, 195908, 197678, 211911, 199873, 163619, 148083, 149107, 139354, 140736, 166652, 161499, 150801, 149147, 145386, 166315, 179592, 184230, 157362, 156885, 159579, 154175, 134439, 122362, 121464, 116653, 112346, 114072, 123536, 112357, 102849, 111338, 123754, 136841, 145807, 128963, 127693, 132305, 133444, 141505, 146639, 130881, 113568, 109909, 113780, 107384, 92128, 93292, 108096, 95858, 108525, 127102, 151501, 138445, 106148, 84981, 95519, 106038, 106875, 118323, 126386]
11117A26386o978o900L094n842l783K042k631n399J3407J0453r331j9104j2240
11104H3174r33r791P994j9128K176k950q171J9052K6776q784J0303Q264o275j4477
11090H7230L562K801p404O909J0014M864p397Q961p503n600P551P695j085k2697
11076H7901L816j674m318o139R231R119N012j7125Q359j046N67j739j6685n288
11062F9991m671o823M382J6278l921p486L136M397k08Q502n217j4678J4420N4409
11048A32511K206r064O989Q484j0014L228M552J5435L859k1735o523J8310K2423
11035A70661J816K8426J6638k41J4534P84k5456k3699J2120J3037K944K3816J608
11022B36988J8370L2185M000K63r584j7161q130j8937k2462n730Q960L0117J6962
$$ y = [126386, 119408, 112508, 115602, 109760, 105977, 108019, 105388, 99989, 113396, 123849, 114518, 95414, 83174, 82241, 72450, 80444, 61316, 63492, 60542, 52371, 71423, 98199, 89415, 99718, 107982, 101707, 87230, 90792, 93593, 86189, 93098, 103112, 107976, 100579, 109540, 102037, 96437, 103988, 111683, 110598, 87901, 91717, 90043, 85725, 79586, 88817, 97936, 102948, 85823, 94182, 93136, 93703, 91964, 75279, 69991, 65320, 58497, 62879, 79157, 75236, 67750, 70886, 75283, 75075, 83577, 78360, 63682, 78102, 132511, 134717, 125653, 132642, 141126, 131112, 134340, 138892, 154327, 158186, 136451, 129928, 148238, 170661, 172477, 200903, 217541, 217300, 231834, 232618, 207162, 183463, 195583, 208620, 211564, 235380, 236988, 255358, 287543, 291543, 291806, 282222, 265061, 256931, 237994, 215532, 209802, 218762, 248879, 265841]
11009B65841J0140Q489l05n960j5792j6242J2277n164o97J0458J0772J6241J2504
10996C02562j9957j392J2714n090k2956J148p574k2762j1983r545q798o498L946
10983B03815J834m162j659J9016m122q560r37L786p547J6554J3616J0900n566
10970B36968P994l616l70J1906J5537P91q287j9250K47R369N149j653j5007J6679
10956B56457n487k2355k3108j0540l816l788q112k081p915j4977j8760N683q061
10943A33140N480K6732K3298j922N680j5932P830J1833j0352j227M154j1351j5184
10930A62179p64J7085P055j2519j1033q217k8809p135J3536r02j0273m142k4610
10917I1451n896P324n651l961O019m03k4091k3802R463K85j0043K188k427L006
$$ y = [265841, 275981, 284470, 284165, 278205, 262413, 246171, 258448, 253284, 252587, 263045, 273817, 290058, 302562, 282605, 281213, 293927, 288837, 265881, 267029, 259455, 236693, 224710, 215165, 206367, 199869, 203815, 205649, 201487, 199828, 218844, 214722, 206162, 205225, 209011, 201464, 218018, 231634, 242534, 236968, 244962, 241346, 240976, 252882, 268419, 269210, 260923, 241673, 241920, 251289, 256438, 254785, 239778, 256457, 250970, 228615, 205507, 194967, 191151, 187363, 179251, 177170, 169255, 154278, 135518, 141201, 133140, 138620, 165352, 188650, 186728, 192408, 176476, 184306, 196139, 185787, 184560, 188714, 177363, 162179, 161415, 178500, 185555, 173036, 162003, 153786, 124977, 117842, 131378, 130476, 120203, 116061, 91451, 85555, 92879, 87228, 83267, 89286, 88883, 64792, 40990, 50453, 50738, 40695, 42883, 40456, 43462]
10903D3462n499Q739J4700K1393j4922k622m944o88j2441j2374P897k3610K190
10890B1281O619O000K167j1115j1762r380Q938L3830K6623j839j3239J1671K1989
10877I1783j5948j3847r441J0788K9j5168n832J5376K6179L224o218j1525r886
10864E9514M069P729J0393j2431l309N01N131J0284J0568k0321r875N911m68j1595
10850E6101j9320K4418J5090j4209K3353J0921O479P306p028j696j0753o042j4834
10837F9786j9748n089M598n817o870M342J5630l870Q206J5259q121m762k544n856
10823E5144j3992m997j275j34J923P169J8378J806p703j1209l2991l414J9810
10810B8515J2001J1410n789k6528L550J3698J1534m347k6651L463L544j5139K820
$$ y = [43462, 37963, 46702, 61402, 82795, 67873, 65251, 60307, 59619, 47178, 34804, 42701, 19091, 21281, 27900, 33900, 36067, 24952, 13190, 3810, 12748, 46578, 73201, 71362, 58123, 69794, 91783, 75835, 61988, 52547, 63335, 63364, 48196, 42364, 57740, 83919, 87143, 80925, 69400, 59514, 63583, 71312, 81705, 69274, 65965, 66466, 71597, 81881, 92449, 72128, 62253, 68164, 67696, 56101, 36781, 61199, 76289, 62080, 85433, 96354, 102833, 110139, 103111, 101415, 90662, 84620, 69786, 50038, 44949, 49547, 43730, 36860, 41202, 56832, 52962, 61168, 76427, 68306, 63544, 61000, 55144, 41152, 36155, 34880, 34746, 36669, 43838, 62216, 64022, 56319, 45110, 12119, 8705, 28515, 40516, 51926, 46137, 19609, 23159, 36857, 48391, 44044, 17393, 20856, 24400, 9261, 12081]
10797A2081J7160P351m508K036k040m569k27J1714j5081l307o605Q533R313N621
10783C7472J0034o846k061j4825J0566P760M417l52J4619P167m912M163r278j0548
10769D7376L568P912J5159j3065j9180j0359M642j175K7824K5556j8522k1338
10757D8398n846K7762J1509M221r027m007L447q047j3883J4703J8826j4223j4836
10744E8997R451j574R218J7010j0905o829j690r00j5057j1949j0707Q952K6663
10731G0680N86p947O132J0415N157j1287j908P313N275k368L249L458m230J7744
10717A02269J3321P547j1559o454m379j1887m865M009J6600J4666j2126L465m094
10704A06513q540j4895j0625L797M188P261m753P259K901J3711o61k5935Q991
$$ y = [12081, 29241, 36592, 32084, 34120, 32080, 27511, 27284, 38998, 23917, 20610, 14005, 22538, 31851, 37472, 47506, 40660, 38599, 23774, 34340, 42100, 46517, 46165, 60784, 67951, 63039, 67202, 57924, 47376, 50944, 58856, 74015, 60950, 41770, 31411, 36053, 34878, 62702, 88258, 69736, 48398, 42552, 70314, 81823, 86044, 77017, 73010, 76457, 68410, 54527, 69230, 88056, 73833, 58997, 68448, 66874, 76092, 93102, 82197, 75368, 73678, 72778, 57721, 45772, 35065, 44017, 70680, 71266, 63319, 69451, 79866, 85023, 73736, 71828, 79141, 84416, 82048, 85297, 88755, 84525, 102269, 115590, 123137, 111578, 105124, 100745, 88858, 83993, 88002, 104602, 119268, 107142, 110607, 106513, 97973, 83078, 72453, 76250, 80438, 87699, 82946, 90205, 93106, 106817, 106156, 80221, 89212]
10691H9212J6130J490P816K95k3306m275K6062J4826r261j1697j8267r154K761
10678H2632p9J0059L7809J2087o258j794o166j1729k023n74J1384Q320J0140N195
10664A49003P663j286J0812j5281J353J2913M39P141r683o34L6740K3100J8367
10651B40647N399K412J4942Q233j4878N404K4893L3402L997K0321L2258K2873
10639C99903J5952J3351M4800M9702O3032N9344P2494Q0687P6556R1447O3326
10628A030594J00231J20730J39924J34329J58177K50060L46514M66384N81474
10619C328417P75476J042075J373293J691278J848463J589736Q73034K5784m68536
10610A2079020n41847k82549K02079Q27322J594696K528419L405354L754144K920952
$$ y = [89212, 105342, 106832, 114648, 114943, 91637, 87362, 113424, 128250, 118989, 107292, 89025, 79871, 82632, 82553, 92612, 130421, 142508, 136250, 134456, 128290, 116561, 114538, 113964, 125348, 133668, 143808, 149003, 156666, 155380, 166192, 150911, 152264, 165177, 165616, 172757, 163074, 162440, 199180, 222280, 240647, 246046, 248458, 263400, 271633, 256755, 262159, 287052, 320454, 324451, 344772, 377030, 399903, 415855, 429206, 474006, 523708, 586740, 646084, 718578, 799265, 875821, 967268, 1030594, 1130825, 1251555, 1391479, 1525808, 1683985, 1934045, 2280559, 2746943, 3328417, 4103893, 5145968, 6519261, 8210539, 10059002, 11648738, 12521772, 12547556, 12079020, 11537173, 11254624, 11456703, 12284025, 13878721, 16407140, 19812494, 23566638, 26487590]
10601B6487590R23955j133436k250789k248518j517613m85907P21490J978087
10593B2474859L254722M362335M597154L052738r3907k998532m409260m257037
10585B5983072l220183j949005p17422M47073J522100K312193K340680J105042
10577B7823550j059369k905817l634026l330607k538294j656131q80800k44622
10569A1573884K61385N67892M84782p5545r04360j587552j861511j721988j427512
10560E309475j058892p77683n85578m47411l50363k45678k04506j80827j56313
10551A302224j48119j20970r0178p0447n4748n2252p8158m8582l9051m3956m1299
10540E14464l7614l2527o237J9560q853l2867k1608k4757j6930O03o608j5952
$$ y = [26487590, 27411545, 26278109, 24027320, 21778802, 20261189, 19775282, 20496772, 22474859, 25729581, 30091916, 34689070, 37741808, 37647901, 34649369, 30240109, 25983072, 22762889, 20813884, 20096462, 20543535, 22065635, 24377828, 26718508, 27823550, 26764181, 23858364, 20224338, 16893731, 14355437, 12699306, 11818506, 11573884, 11835269, 12403161, 12887943, 12812398, 11908038, 10320486, 8458975, 6736987, 5309475, 4250583, 3472900, 2887322, 2439911, 2089548, 1843870, 1639364, 1458537, 1302224, 1154105, 1033135, 942957, 872510, 817762, 765510, 687352, 638770, 599719, 555763, 514464, 476850, 444323, 438086, 457646, 448793, 415926, 394318, 369561, 352631, 353234, 346626, 330674]
10528C30674j7738j5422m978k052q963k2802l716j2169j3482J1600j2033j4234
10516B14685j6068n902p792m376J1419P189j5368R40l759J456r448k7846J2718
10503A57848J5761j514L967p941K936j6002k0035m28J178M62q976L29k857k529
10489A22199N567k1095K0446J6056o442J2521j968m492J7709j755l832l598j1861
10476A39455j2970J186K545j2053o90M475l103R721M965k426j4633n87O079M713
10462A26677l233l707j0025k7001j8218K013p677n69P442N772J51P597J0495j395
10448H8322k201J249O064J635j353l343j8391j1267j5629j2022J7938O54l796
10435D7860J0186m614m716o4O128Q082J2047N724k1800p779r810L310J5380Q516
$$ y = [330674, 312936, 297514, 292536, 290484, 281521, 258719, 255003, 242834, 229352, 240952, 228919, 214685, 198617, 192715, 184923, 180547, 191966, 199155, 183787, 184727, 180968, 182424, 172976, 145130, 157848, 173609, 172095, 176062, 168121, 171057, 155055, 135020, 134592, 135770, 136232, 127256, 127585, 124728, 122199, 127766, 106671, 127117, 143173, 136731, 149252, 147284, 142792, 160501, 158746, 154914, 151316, 139455, 126485, 127671, 130216, 118163, 117473, 121948, 118845, 128566, 133531, 131105, 116472, 115885, 121964, 126677, 123444, 119737, 109712, 82711, 64493, 66506, 58829, 58260, 65702, 71474, 71625, 79222, 89717, 88322, 86121, 87370, 93434, 95069, 93716, 90373, 71982, 60715, 45086, 33064, 51002, 51656, 47860, 58046, 53432, 48716, 48652, 54780, 62862, 74909, 80633, 58833, 51054, 41244, 44554, 59934, 68450]
10421F8450k3821m943J8593j3188p744l918q970o250j323R433J3324J1270j7316
10408C3597p999r1N434M992N086m053l820m282j4113J7897N780j5371j1637m66
10394A0954P069J7001R538k468p281j0080q103K911L569l112N070J7771N177l49
10380D7667k0908N619K6237j1443R748K0691j2686j2368J4551k0802k4938O883
10368B8251p477K515j721L500Q510q064j6129j073J4105R395L525P023j2053j5793
10354A4514N785K0334j505j3847j0490J2844J9867M1168n41k8009j8719M81J0687
10341E2569m244J4915N227j8237k4236j6311j0252J7050J7774q09r857j1190j749
10328A0650P760Q52J0374J1889J817k116J805K1192p313k115j2482j3391P126
$$ y = [68450, 44629, 39686, 58279, 45091, 37347, 33429, 24459, 18209, 16886, 26319, 39643, 50913, 33597, 25598, 25507, 30941, 35933, 41019, 36966, 33146, 28864, 14751, 32648, 38428, 23057, 11420, 10954, 18023, 35024, 44562, 42094, 34813, 24733, 16630, 19541, 23110, 19998, 25068, 42839, 48016, 47667, 26759, 32378, 58615, 47172, 56920, 77611, 64925, 52557, 67108, 46306, 21368, 28251, 20774, 23289, 21568, 25068, 33578, 25514, 9385, 8312, 22417, 31812, 35337, 42360, 30307, 14514, 20299, 40633, 39128, 25281, 14791, 27635, 47502, 88670, 88129, 60120, 41401, 41882, 52569, 48325, 63240, 68467, 50230, 25994, 9683, -569, 16481, 34255, 33446, 23589, 12399, 10650, 18410, 19262, 29636, 41525, 43342, 41226, 43031, 64223, 56910, 54795, 42313, 28922, 36048]
10315C6048J5449Q969N64k1098j0190p435J0229K106J1835K050j73j2842j3551
10302B1961k0548r163K4652Q338L185K218K498n771r109r506j2043K607J8170
10289A7489P245q506j0605R7k834J4562J9039R850L691l35N658R300j728K0993
10275H3916M1615L3506K1367J4332J7461J5467J6801Q486j1512j6716j2459j7621
10263A94643r076l2507m2214k8486k1101j4204o566k5463k057K1043p391j3591
10251A3030j027j5688J8947N876O891J1172J8729R565k0740j0606m178j867j4475
10238A5629o80o80j3570N33j901J3891J3600Q678j887m684j2113k1441J5741J8821
10224B9937j2213o541Q97k989n744O393M40P411O281m981P240O967k633l0129
$$ y = [36048, 51497, 60466, 61030, 39932, 29742, 22307, 32536, 34642, 46477, 48527, 48354, 35512, 21961, 1413, -7750, 16902, 25240, 28425, 30643, 33141, 27370, 18261, 8755, -3288, -681, 17489, 24734, 16228, 5623, 5720, 2886, 17448, 36487, 46337, 50028, 49693, 55351, 64651, 62923, 83916, 125531, 159037, 180404, 194736, 212197, 227664, 244465, 252951, 241439, 224723, 212264, 194643, 185567, 153060, 110846, 82360, 61259, 47055, 40489, 15026, 12969, 34012, 26621, 13030, 12003, -3685, 15262, 21138, 28029, 39201, 57930, 67495, 46755, 36149, 31971, 30104, 15629, 14949, 14269, 699, 1232, -669, 13222, 26822, 35500, 33613, 28929, 16816, -4625, 11116, 29937, 17724, 11183, 12080, 9091, 3347, 9740, 10180, 17591, 23872, 18891, 26131, 33098, 30465, 336]
10210C36j9344q608K5953J773q518j141J7472J6002N031j3595j5800j392Q960
10197G129J3401l302P367r824P84j3280m522J6374J7662j2922j2434L942K0952
10184C1327J3439m265j2655j586J1860J7661K4005J5062r06k696K574j9456n359
10171F9005m434P622O827J6139K7911L0379J8457K050k746k2147j9519n454K768
10158A26858J9P222J0492L1668M6604O851k0864k6966j9293O79l2937k9986M082
10145A04429L787J0562M3605J7268q382j4459j6918j5379q271l046j7711k822
10133I2663J718j5152J0671K5098j9371j0541j3778m939P821k612j3683j1784
10121D6111J226K322l178n561n813j2581J0191n924j3901q357L1251j7657j2059
$$ y = [336, -19008, -27616, -1663, 110, -8408, -9549, 7923, 23925, 28956, 15361, -439, -1831, 7129, 20530, 17228, 24595, 14771, 15555, 2275, -2247, 14127, 31789, 18867, 6433, 10375, 31327, 44766, 40501, 27846, 26260, 38120, 55781, 79786, 94848, 93942, 91246, 93820, 74364, 69005, 64571, 72193, 79020, 95159, 123070, 153449, 171906, 173956, 171210, 149063, 129544, 124090, 126858, 126877, 134099, 144591, 176259, 222863, 229714, 208850, 181884, 162591, 163270, 130333, 100347, 104429, 108216, 118778, 162383, 179651, 171269, 156810, 139892, 124513, 116242, 113196, 95485, 92663, 94381, 79229, 89900, 114998, 95627, 85086, 71308, 66369, 74190, 71578, 57895, 46111, 47337, 49659, 46481, 40920, 35107, 22526, 32717, 26793, 12892, 4535, 35786, 18129, 6070]
10108F070o610J1326M047k0244n32K142J88M992N345q224j0861j636J0296J0052
10094F351O103Q186J0530J4025J1307j7052j6055O767L021k1337k5852L792J6641
10081F427o754k509R868J1594l253R522M743J6621l956K687j9273j9588l887N75
10067B817j655J2965O704q698j775N896O303j2663j7201j952P126j3466J2370
10054c229j881o294J2702K1221l573J6946J3800N574j2178k0234P168R429L806
10041D3257j7870j3542J1861k58R896p141k360o084m835R371k89p929k0909q271
10027a5103J6395J7279R670p951n741P019k8761r351L0197K5552l284j6792m196
10014A4933N132o209l901j549J965j749j2401j0302K053K495J7165l5k943o639
$$ y = [6070, -540, 10786, 14833, -5411, -5943, -3801, -3613, 1379, 6724, -1500, -12361, -13997, -3701, 6351, 12454, 20640, 31170, 45195, 56502, 39450, 23395, 30162, 33183, 11846, -14006, -10214, 6427, -327, -2836, 7032, 18626, 15373, 24895, 29638, 46259, 42303, 44990, 25717, 6129, 2242, 2817, 1162, 14127, 20831, 12133, 10358, 16254, 22557, 9894, -7307, -9259, -2133, -15599, -3229, -5110, -11404, 1298, 22519, 18946, 35892, 49692, 55266, 43088, 22854, 30022, 39451, 43257, 25387, 11845, 23706, 23448, 33344, 26203, 23843, 17759, 12924, 22295, 22006, 14077, -6832, -15103, 1292, 18571, 28241, 20290, 14549, 21568, -7193, -16544, 13653, 39205, 35921, 19129, 14933, 20065, 13856, 9955, 8406, 10371, 8622, -3779, -14081, -12028, -9533, 7632, 7597, 4654, -1985]
10000a985p562n507L445L182J3123J494M546m465j8170J5104j91k8808N791K0128
9986A25K6885O758J3919n538j2012M596L863q229l756J9713n958p363j4076j3063
9972E864K484J360j3778o387L226L280Q932K1205K506j5150r464M523n341K043
9958E303j5061j4607J5255m541j390J2108J6325J5057j254j9118q067J9573M006
9945B3589J338O780r264j380O288n993j0454j168J0641p325l4321j0339J1216
9932b0392J6352J8339l55r480j0065j1647j1435L299J6855l782P938K5523j922
9919A9228L29L230R83j4076l518j8874m087K5330J0894l829j6491l734K4191j0920
9905H656k015p78O53O749K20q381j5450J543L2253P175m600k3431m902J1290j522
$$ y = [-1985, -9547, -15054, -11609, -8427, 4696, 6190, 10736, 6271, -11899, 3205, 3014, -25794, -20003, 125, 27010, 33768, 47687, 42149, 30137, 34733, 38596, 30367, 26611, 46324, 40366, 33003, 18927, 5864, 8348, 9708, -4070, -10457, -7231, -3951, 4981, 26186, 28692, 13542, 4078, 8601, 3260, 5303, -9758, -24365, -9110, -13651, -15041, -2933, 13392, 28449, 27195, 8077, 10, 19583, 23589, 24927, 31707, 22443, 21063, 27351, 21358, 10904, 9736, 20377, 13052, -21269, -31608, -20392, -4040, 14299, 13944, 4464, -5601, -17248, -28683, -25384, -8529, -12311, -4373, 21150, 19228, 19557, 22787, 23770, 9694, 6176, -12698, -16785, 8545, 19439, 15610, -881, -4615, 19576, 8656, 6641, 5863, 6516, 13265, 13485, 5104, -10346, -8803, 23450, 30625, 26025, 2594, -2308, 8982, 7460]
9890G460O530L298P976m431m915J9842L435k306j7150q352J8162q463k4326l589
9876f829J5170R219M119M952L335j5120o925K228R300J6347j1890k9562k391J2121
9862D074K781O938m779j1228p42L331r195j4060l10M554K3517n044J7074N519
9848B2430K0100J1265n902j2994p579n527Q82N896r23J0176m630n939k1056P669
9834A3868l445J1347J1748L67k20k4550k7097q345R582J4682m99o621O379l319
9820f123l892J842n468o157K0635M357R202R399p9j540n523j416r422q285l692
9805f162o699J4872L022N740l318J2535J3587p489k562O153o019J180m48k8016
9791c624j058P552j1189O936K2133L6709J8369k6830j8780n730l173j5662j2144
$$ y = [7460, 13990, 17288, 25264, 20833, 15918, 35760, 39195, 36889, 19739, 11387, 29549, 21086, -3240, -6829, 8341, 17560, 21679, 26631, 29966, 14846, 7921, 10149, 19449, 35796, 23906, -5656, -8047, 4074, 6855, 13793, 9014, -2214, -2956, 375, -8820, -22880, -23190, -18636, 4881, -163, 16911, 22430, 42530, 53795, 47893, 34899, 27320, 21793, 22675, 28571, 27648, 37824, 33194, 27255, 6199, 13868, 10423, 21770, 33518, 33885, 33665, 9115, -17982, -26327, -16745, -2063, -2562, -9183, -2804, -6123, -10015, -8173, -13641, -19798, 837, 5194, 14396, 23795, 23716, 22176, 16653, 15237, 5815, -2470, -6162, -12861, 2011, 5033, 10773, 7455, 19990, 33577, 26088, 23526, 29679, 23660, 24840, 24392, -3624, -4682, 2870, -8319, -1383, 20750, 57459, 75828, 48998, 30218, 24488, 21315, 5653, -6491]
9778f491m952K932L9321J849k7034j1128P209m645J2453J0968n720l0638q244
9765b4120J4392K3758K2711J943k2709O114N538K4497L842l014q571n168j5485
9752B3728j0588J6055n178q129p617m279l792J2325l320J133J7985j2552K447
9739A8218O323M580l838J648P540j1196k7667p920J1231N208J9504o915j1236
9726E480p791n809j7851r242N085K038J2440j3030j1316N16K2913J6632j1327
9713a1262j4720j0433J662J1082K5224N937R136L033L992m404j3652Q258J3615
9700B7468j770l342K3747R406m2934k6056J3301O649J0657J5183J7362q267q940
9687C2464j748J0862r581j0079P456M454q25m208k883j5337k381R633n115j0073
$$ y = [-6491, -11443, -8511, 30810, 32659, 5625, -5503, 1706, -2939, 9514, 20482, 14762, -15876, -24120, -9728, 14030, 36741, 38684, 15975, 22089, 27627, 52124, 55966, 52952, 44381, 39213, 23728, 13140, 29195, 24017, 15888, 8271, 3992, 200, 12525, 9205, 10338, 28323, 15771, 18218, 24541, 29121, 25283, 26931, 34471, 23275, -4392, -12312, -1081, 4127, 23631, 16716, 5480, -2311, -8120, -25971, -35213, -30128, -28090, -15650, -28680, -39996, -39480, -16567, 65, -11262, -25982, -36415, -34753, -23671, 1553, 7490, 16626, 19659, 23651, 19247, 5595, 13853, 27468, 25698, 22356, 46103, 55509, 12575, -13481, -180, 6469, 17126, 32309, 49671, 41404, 32464, 30716, 41578, 31997, 21918, 29374, 33828, 33003, 28795, 25912, 10575, 8194, 17827, 12712, 2639]
9673B639J0250J4934M311n858j8495k3196J628J8920P765k432p365R894K0260
9660C3255J140q294l867j2188k1184k7230n789K8690L9361K3576N770k5963N537
9647C2814P850j9831n773k700M66J7434M153J922J4039j6009k5590N786K0933
9634C5494N86p417j2742n526o749o876R296P993k924N848p973N776J0748L800
9620B9334m757L646j621j731q878l230n771k7999n301R996L0468J4668m559Q795
9606C3060Q906r345O775l046j0710j2578j4832k893L505j1955L936J2127r76O929
9592H903n810m71J8229P803j8723n502l41N49K7392R350n102k6421l357j1798
9578e299J2840J7285k89k56J6926J7333j1195k6496j0724J4361k1346k3846J8877
$$ y = [2639, 12889, 27823, 32134, 26276, 7781, -15415, -13787, 5133, 12898, 10466, 3101, 12995, 33255, 34395, 26101, 22234, 10046, -11138, -38368, -44157, -15467, 23894, 47470, 53240, 27277, 32814, 40664, 20833, 15060, 12360, 12826, 30260, 34413, 36335, 50374, 34365, 8775, 14561, 35494, 36080, 28663, 15921, 10395, 3646, -3230, 6066, 14059, 11135, 16983, 9010, 14786, 25534, 29334, 24577, 28223, 26602, 24871, 15993, 12763, 6992, -21007, -26308, -16312, 14156, 28824, 24265, 33060, 41966, 32621, 39396, 36350, 25640, 13062, -1770, -4663, -1158, -13113, -9177, 2950, 1974, 8903, 3093, 2622, 20851, 28654, 9931, 4429, 4088, 4637, 32029, 41379, 36277, 9856, 6499, -5299, 7541, 24826, 24537, 24281, 41207, 58540, 47345, 20849, 10125, 24486, 3140, -20706, -1829]
9565a829K9796l323j4872q849k518j3135L288k743M379m401J4929Q254m652J815
9551F139j6284p520P210K30m210Q748K0114r926r270K1485J9047j2159m45r524
9537A3635k5177J1870k610J4193L950l683o595l2564n105K4129J5061o236L531
9524D399J375J2636N494q122K189J2230k120J251j3713j7479K865K0405q537l765
9510I108j312O359J971k5062r907J6320O488J717J4152J0917J3323K59l5389k2948
9496a4004K3222J4269k054j4999k789J2278N495J2044j4611o064J5821l031j2615
9483A2962p287r750r877n050m277m587K0698J8743j733k098k57L254M11K623P751
9468B1526J1177R885j3371k3110k498j3443O147n06K449J7985N318j232l768P40
$$ y = [-1829, 27967, 24644, 9772, 923, -1595, -14730, -11442, -14185, -9806, -14207, 722, 8976, 4324, 6139, -10145, -17665, -10455, -10225, -14435, -5687, 14427, 4501, -4769, 16716, 35763, 23604, 23159, 13635, -11542, 328, -2282, 11911, 15861, 12178, 5583, -26981, -32086, -7957, 7104, 868, 4399, 5774, 18410, 23904, 15782, 17971, 30201, 28081, 29332, 15619, -1860, 1005, 21410, 12873, 9108, 7796, 14155, 16126, -8936, -18843, -2523, 3965, 5682, 19834, 30751, 44074, 44333, 8944, -14004, 9218, 23487, 21433, 6434, 3645, 15923, 21418, 33462, 18851, 12787, 28608, 25577, 12962, 5675, -4075, -13952, -19002, -23279, -27866, -7168, 11575, 9842, 7744, 7487, 10741, 11152, 13775, 21526, 32703, 42588, 29217, 6107, 3609, -9834, -3687, -4193, -1744, 16241, 21559, 20327, 16559, 17299]
9454A7299J081K227M133Q361J7577J4555k1815k0460j4329k1847J6444J9610m080
9441A8756j4428N558k0712o751j343n249N898K0024j006J626K6387Q195q971n646
9427B2338p148n485l283J1251J1799J0890J780J0690K748J3307p144j0941k163
9414D8639O291j6115J908L315q843J2764M98j6506P819L906j0103k5325r57J2609
9400A9900L545j2885L31J8895J6202R682j6906j9426k3139J0465K3816Q387J5336
9387E4203J1447p399l0233k2622k1733J4369J6519j0110l166j6621j0659K1853
9375d152L1659l751k0305P882k449r165Q005j3583K518K0158R718J2658P270L618
9361E0081q383k079N488k2914j2950L607K293J281O389k984o171R280j2094J681
$$ y = [17299, 18380, 20607, 24740, 33101, 50678, 65233, 43418, 22958, 8629, -13218, 3226, 22836, 18756, 4328, 9886, -10826, -17577, -18920, -24169, -18271, 1753, 747, 2373, 28760, 36955, 27984, 22338, 15190, 9705, 6422, 17673, 29472, 40362, 42142, 52832, 55580, 68887, 61743, 50802, 48639, 54930, 38815, 40723, 44038, 35195, 47959, 48457, 31951, 39770, 43676, 33573, 8248, 7291, 19900, 23445, 10560, 10891, 29786, 45988, 55670, 38764, 19338, -3801, 6664, 30480, 38867, 54203, 65650, 58251, 28018, 5396, -16337, -1968, 14551, 4441, 1275, -15346, -26005, -4152, 27507, 23756, 3451, 11333, 8884, -281, 7724, -5859, -3341, 16817, 26535, 39193, 46463, 50081, 41698, 39619, 45107, 22193, 9243, 12850, 15143, 16424, 22813, 19829, 13658, 22938, 10844, 12525]
9347A2525O641J103k078j104n503k0031O571K1986K3314P612L0392R465R953j5665
9333H5181M24L66J3018j790j0346p758J8215J4208J334M56O382K457K1933K5155
9319A69235Q582J8117J7701K4324K6034L8151L1353M0190M0368L4874M6093P9134
9307E74156J00670J21497J18213J47293J62929J61624J33622Q3613N7187M886
9297A665690k7427r4166j27885j17702j25893j60115j48678j34510r9601o8962
9287E60751n0104n1005n0400m0518m2876m0983n6583k4471j8911r734j4033o043
9275A55090q433o639j0551k194Q680j297j4760j5521j9685J934J3628p06q946
9262I0600o524L713M90l21k215j9534j0283R537J868q479j6191j2201p506K9123
$$ y = [12525, 19166, 20269, 18191, 17087, 11584, -8447, -1876, 20110, 43424, 51036, 81428, 90893, 100846, 85181, 85605, 85971, 98989, 97199, 86853, 79095, 97310, 111518, 112852, 113308, 119690, 122147, 144080, 169235, 177817, 195934, 213635, 237959, 263993, 302144, 333497, 373687, 414055, 448929, 495022, 574156, 674826, 796323, 914536, 1061829, 1224758, 1386382, 1520004, 1603617, 1660804, 1665690, 1638263, 1544097, 1416212, 1298510, 1172617, 1012502, 863824, 729314, 629713, 560751, 510647, 459642, 409242, 368724, 325848, 284865, 228282, 203811, 184900, 175166, 161133, 155090, 146657, 140018, 129467, 127273, 135953, 134656, 119896, 104375, 84690, 86624, 100252, 99546, 90600, 84076, 87789, 88279, 87958, 85743, 66209, 55926, 65463, 67331, 58852, 42661, 30460, 22954, 52077]
9248E2077q540p391q136P421J4256M066k608J2739O316r658o159L331p701J4187
9234F4200n774l082P587Q454j3634k0703K677J4663P954J9120J1986P343m405
9221I6386j9681j6964j037o568J7930j204p997o31j814R6K3844J1775Q24n423
9207H9536o74l30p28J6722o68k3836q260R267J1156J5651r54q879j780L59Q966
9192A05548q799j2651K1781Q041J934r892j3860J60k3322r241k52J0789K4410
9179I4646J0114L970J1636k440p655p371J5253K1937N250K915L078k049N384K2164
9165A76832K2789J1946J2713J677K884j386K394L4195L6441K5051L7019J2432
9153C74987p47R689q352o9927l5118j4286k8174l2011k5772j5220k4927n99J7752
$$ y = [52077, 43537, 36146, 28010, 35431, 49687, 53753, 51145, 63884, 70200, 60542, 54383, 57714, 50013, 64200, 58426, 55344, 62931, 71385, 57751, 37048, 39725, 54388, 62342, 81462, 93448, 100791, 96386, 76705, 59741, 58704, 52136, 70066, 68862, 60865, 60234, 58420, 58516, 82360, 94135, 94959, 89536, 88862, 88532, 87804, 104526, 103858, 80022, 71762, 81029, 92185, 107836, 106882, 98003, 96223, 96582, 105548, 96749, 84098, 105879, 113920, 115854, 105962, 92102, 92262, 68940, 59699, 59447, 70236, 94646, 104760, 108730, 120366, 117926, 110271, 102900, 118153, 140090, 145340, 148255, 151333, 149284, 154668, 176832, 199621, 211567, 224280, 225957, 228841, 227455, 229849, 264044, 300485, 325536, 362555, 374987, 374240, 383929, 375577, 305650, 270532, 256246, 228072, 196061, 170289, 155069, 130142, 129543, 147295]
9140A47295J356K0003J7211j3520n980J4472O271N861j4501j4891j2836j9469
9128A31272L18Q48K0246N131n375q940J3516j462J2241n446k2304j8876k3593
9115I7576J2506J0227O768J6215Q023P320p855k232M430J1614K2628J3278o409
9102A94089J1569j108J759K4016J5718J6797k3270k4729j1397K5462K6570J488
9090B56964k9898j7732N001R589L6280K1496j2615J2279K5225p293n927J8639
9078C12008k2663j9669Q075N057J3886J7893P737P545L658j2103j3426k957q658
9065B96383L682j4069M919K9911K6971K526K4849M648l710p642P154N206k433
9052C78395k1649j5210K7351J4479J2514Q581p404j1926P857J8451M848l97O752
$$ y = [147295, 148651, 168654, 185865, 172345, 166365, 180837, 187108, 192969, 178468, 163577, 150741, 131272, 131590, 132438, 152684, 157815, 152440, 143500, 157016, 155554, 167795, 162349, 140045, 121169, 97576, 110082, 120309, 127077, 143292, 151315, 158635, 150780, 148548, 152978, 164592, 187220, 200498, 194089, 205658, 204550, 206309, 230325, 246043, 262840, 239570, 214841, 203444, 228906, 255476, 256964, 227066, 209334, 214335, 223924, 260204, 281700, 269085, 281364, 306589, 299296, 293369, 312008, 289345, 269676, 277751, 282808, 296694, 314587, 322324, 329869, 333527, 321424, 307998, 305041, 296383, 300065, 285996, 290915, 320826, 347797, 350323, 375172, 379820, 376110, 368468, 375622, 380828, 378395, 356746, 341536, 368887, 383366, 395880, 404461, 397057, 385131, 392988, 411439, 416287, 415890, 422642]
9039D22642m067P642J9740J0943K6867M0148N6762N2847O1327P2649M3413K5940
9027H36853R710j4142l2710m0220l4581l8084n4834k9986j785q400L148K990L0
9014E97989J8084K9419m580j1755N804J1445Q580K015J5610j675j3508O620j8499
9001F45549R684K1129K6063J8313Q119K5185K0637J6411K4049M0503L7975J1262
8989I04879J841K2909J9884L6775K8229K6801K2099K1661K5476K0320K4892J9997
8977A175763J9089Q791L3827L7359J7063M4528N4233N9795M8473O8510Q9689O8680
8965A725800M8662M3211M8016N7312N0403O2876O7297P3267P6155P0557Q0275
8954B403831Q7982R9823J20663J07150J04491J48854J59217J63686J42200J52628
$$ y = [422642, 418575, 426217, 445957, 456900, 483767, 523915, 580677, 633524, 694851, 767500, 810913, 836853, 846563, 832421, 799711, 759491, 724910, 686826, 631992, 602006, 600221, 591821, 594969, 597959, 597989, 616073, 645492, 640912, 629157, 634961, 646406, 654986, 657001, 672611, 670936, 657428, 664048, 645549, 655233, 676362, 702425, 720738, 728857, 754042, 774679, 791090, 815139, 855642, 893617, 904879, 906720, 929629, 949513, 986288, 1014517, 1041318, 1063417, 1085078, 1110554, 1130874, 1155766, 1175763, 1194852, 1203643, 1237470, 1274829, 1291892, 1336420, 1390653, 1450448, 1498921, 1567431, 1657120, 1725800, 1774462, 1817673, 1865689, 1923001, 1973404, 2036280, 2103577, 2176844, 2252999, 2323556, 2403831, 2491813, 2591636, 2712299, 2819449, 2923940, 3072794, 3232011, 3395697, 3537897, 3690525]
8944C690525J70334K04537K37132K28676K16411K63228K91020K94845L07391L23800
8934F227899L68593M22721M68359N49191O13741O37810O85718P76808Q73058R96138
8924A2620036J147397J342123J569496J824778K129362K493668K933890L455551
8916B9516301M034019M705920N394619O176364P160516Q678901J1069640J4627443
8908I1363723J9811467K7132076L7307070N0631160O5828056P6729459O9841707
8901D38644718L4377131j7114334n7363522p3090844o8593738n5333273m1720890
8894A59805248l0814745k2801805j7095510j3024881j0122617q035645o595836
8887E1314209n650812n082126m656706m177215l628502l100838k606378k179247
$$ y = [3690525, 3860859, 4065396, 4302528, 4531204, 4747615, 5010843, 5301863, 5596708, 5904099, 6227899, 6596492, 7019213, 7487572, 8036763, 8650504, 9288314, 9974032, 10750840, 11623898, 12620036, 13767433, 15109556, 16679052, 18503830, 20633192, 23126860, 26060750, 29516301, 33550320, 38256240, 43650859, 49827223, 56987739, 65666640, 76736280, 91363723, 111175190, 138307266, 175614336, 226245496, 292073552, 368803011, 438644718, 473021849, 455907515, 398543993, 325453149, 256859411, 201526138, 159805248, 128990503, 106188698, 89093188, 76068307, 65945690, 57910045, 51314209, 45663397, 40581271, 35924565, 31747350, 28118848, 25018010, 22411632, 20232385]
8879B0232385j870441j628076j417009j265498j139832r88067q73161p63238o54705
8870I632358n85633n39406n01214m74071m44992l96233l47431l09266k79981k69559
8860E484572k71442k49139k39242k21326j88209j87383j82931j50459j18703j30103
8850C545635j17386j13659j16503j13209r7776j02629j14185j09126r8523q4410
8840B478229q7762r1314r8557r1503n9266n2160m6417j2733k2184l9776l3610
8829A842947m7207j9188j6861l8401n8239p6553p4592m7454l0844m2498k9220
8818A361890m5856j9247m747k1211l5601l4702k9152k1406o782K318k2288l6569
8806A086647j4566k2498k3661o314j7208k0049l824p663k9260l0172k0041k8240
$$ y = [20232385, 18361944, 16733868, 15316859, 14051361, 12911529, 11923462, 11050301, 10287063, 9632358, 9046725, 8507319, 8006105, 7532034, 7087042, 6690809, 6343378, 6034112, 5754131, 5484572, 5213130, 4963991, 4724749, 4503423, 4315214, 4127831, 3944900, 3794441, 3675738, 3545635, 3428249, 3314590, 3198087, 3084878, 2987102, 2884473, 2770288, 2661162, 2562639, 2478229, 2390467, 2299153, 2200596, 2109093, 2049827, 1997667, 1951250, 1938517, 1916333, 1876557, 1842947, 1795740, 1776552, 1759691, 1721290, 1663051, 1586498, 1511906, 1464452, 1433608, 1391110, 1361890, 1316034, 1296787, 1292040, 1270829, 1235228, 1200526, 1171374, 1149968, 1143186, 1145504, 1123216, 1086647, 1072081, 1049583, 1025922, 1019608, 1002400, 982351, 978527, 970864, 941604, 911432, 891391, 863151]
8794H63151j6037q398j3550q767K557K897J556j993j9247k5044k751K365P537
8781G84276M629K790J8913J7489Q706J6967J6345K5643j2586m0087k7981l2154
8769G82950j6974k0891j3709k2695p277j0814k7912k5584l2714m2762l932J0693
8757E68379k4008l7175j4976O391J1257k1947k3057k5215j4113j4763j0296n271
8745C95206k2965k3213p968p851M279J2586M996j2083L626J5732j5206k1293J4941
8732C40787L03j1573n505j5774L432O353J3916K136j1421l2337j5918r527k14
8719B64658P635K827q418j995L0243K4410K568j3773n645k3520n298P374J0262
8706B91328j1708j1909R490J4123M991m817j4162j9350K175L0244n29M591P854
$$ y = [863151, 847114, 838716, 825166, 816399, 818956, 821853, 823409, 821416, 802169, 777125, 774374, 776739, 784276, 788905, 791695, 810608, 828097, 836803, 853770, 870115, 895758, 883172, 843085, 815104, 782950, 765976, 745085, 731376, 708681, 701404, 690590, 662678, 637094, 604380, 561618, 557686, 568379, 544371, 507196, 492220, 498611, 509868, 487921, 464864, 439649, 425536, 410773, 400477, 395206, 372241, 349028, 341060, 333209, 337488, 350074, 355070, 342987, 346613, 362345, 347139, 325846, 340787, 341090, 329517, 324012, 308238, 311670, 318023, 331939, 334075, 322654, 290317, 274399, 264872, 264658, 272293, 275120, 266702, 264707, 294950, 319360, 321928, 308155, 302510, 278990, 273692, 281066, 291328, 279620, 267711, 277201, 291324, 296315, 291498, 277336, 257986, 260161, 290405, 289876, 294467, 302321]
8693C02321J4750Q744M194o143j166r27j4906P429m07l710l6522j0224Q377j7109
8679B54701j8748L393l119q746J4943L753P88R062p783p497M354j3648r898L950
8665B25505l25R534p681O319J1010k98j4521q046m174q067J2997j403J5338M680
8651B40868j8543l2718k3281Q177M663R646K794J7542P844q943j7886j5627p494
8638A67042k3567j1792K613N531J0668M844j0277J670M041K0637P76l760J1059
8625A79485K2732J5664j0984j9357j798J4579R518j4836n304l3022j8645m730
8613A33302j1490N890L716L550J6707J2371K08J6640J7351k955k0793m21q945
8600A65131l667J0734J0678Q020n133J30k989M10l87j9574K248k396P619J4951
$$ y = [302321, 317071, 325815, 330009, 323866, 322700, 321773, 306867, 314296, 313889, 310179, 273657, 263433, 271810, 254701, 235953, 239346, 236227, 227481, 242424, 246177, 246965, 256027, 248244, 240747, 245101, 231453, 221555, 225505, 225180, 234714, 227033, 233352, 244362, 244064, 229543, 221497, 217323, 209256, 222253, 220850, 236188, 240868, 222325, 189607, 166326, 174503, 179166, 188812, 191606, 209148, 216992, 208049, 190163, 174536, 167042, 143475, 131683, 134296, 139827, 150495, 155339, 145062, 146732, 150773, 171410, 172186, 168426, 179485, 202217, 217881, 206897, 187540, 185742, 200321, 209839, 195003, 189699, 156677, 138032, 133302, 121812, 127702, 131418, 134968, 151675, 164046, 164254, 180894, 198245, 195290, 174497, 174076, 165131, 161464, 172198, 182876, 190896, 185763, 185893, 182904, 183314, 182927, 163353, 165601, 163205, 170824, 185775]
8586A85775J6811O599k3288k6628q800P785J1494j0140L138J8696j7634q27K011
8573A64992j3573r182q840j0035j961m230p67Q645K5151n53J4618j4169k5145
8560A24951o058P549J7892J9257K210o726j3763j1257o668q357R133q902k0662
8547I8599j726J5290J5980p979q444j2869K790K3326N723k1852j9421k394K1770
8534A08793N285O61J7379P080J64k5577m219J0869m921K1912K6050P083j1860
8521A58699J98L2854K3398J7337K492J833K2287J9571J4210K1843K4625O0431
8509C99778P0146O8246O8162R8932J30171J32625J55587J57932J31236J18180
8499A530995R8955N2171L4901l6719r7750j21776j19702j65240j60930j52431
$$ y = [185775, 202586, 209185, 185897, 159269, 150469, 158254, 169748, 159608, 162746, 181442, 163808, 162981, 164992, 151419, 142237, 133397, 123362, 121401, 117171, 116404, 125049, 150200, 149647, 164265, 150096, 124951, 118893, 126442, 144334, 163591, 165801, 159075, 145312, 134055, 127387, 119030, 128163, 119261, 98599, 96873, 112163, 128143, 120164, 111720, 98851, 101641, 124967, 130690, 108838, 89417, 87023, 108793, 114078, 114739, 132118, 139198, 139362, 113785, 109566, 120435, 115514, 137426, 163476, 170559, 158699, 158897, 191751, 215149, 232486, 234978, 236811, 259098, 278669, 292879, 314722, 339347, 399778, 469924, 538170, 606332, 705264, 835435, 968060, 1123647, 1281579, 1412815, 1530995, 1629950, 1682121, 1717022, 1680303, 1582553, 1460777, 1341075, 1175835, 1014905, 862474]
8489H62474j05956q6715q9140q9747p4582n5644k9521p075l6790k8503l2101k9647
8477A97053j2256J0483k0116k9870n332P300j5612j4106q661R96j5917j7650L473
8464G9785J4865L5021M620J6705M493r818k90l517j0019j862j0955K071J2202
8451A33301R868P052O352K999k6331j5636o644j4737N219J2589M587J078j7997
8438A01700k2797P996j73p854q287K3416J4896J424n388j4392j2736K164M316
8425H4285K681K4740M647j3963k0665j4922J790J3530r408j133K404m976j5569
8412E3441n03J5498J0793n491j0520P14J9411K546q240k3889j0097J0167j527
8399E2303l65k430j8375j2067J3840J7165K923k020r898M550l478l365r532J3906
$$ y = [862474, 756518, 669803, 580663, 490916, 416334, 360690, 331169, 324094, 287304, 258801, 226700, 197053, 184797, 195280, 175164, 145294, 139962, 147262, 131650, 117544, 108883, 109879, 93962, 76312, 79785, 94650, 129671, 134291, 150996, 155489, 145671, 145381, 141864, 131845, 129983, 119028, 121099, 133301, 143169, 150221, 156573, 159572, 133241, 117605, 110961, 96224, 101443, 114032, 118619, 119697, 101700, 78903, 86899, 86726, 78872, 70585, 94001, 108897, 110321, 104933, 90541, 77805, 79969, 84285, 86966, 111706, 116353, 102390, 81725, 66803, 68593, 82123, 72715, 71582, 73986, 69010, 53441, 52938, 68436, 79229, 73738, 63218, 63932, 83343, 85889, 77649, 53760, 43663, 53830, 52303, 51938, 49508, 31133, 19066, 32906, 50071, 52994, 50974, 41076, 45626, 42148, 38783, 29251, 43157]
8385D3157K0239o710j9595q483N944j4537J7041K846Q236P256n9K223J1141K892
8371G1591p880L912R347j5537M320P296j3775j9169p752j0053j1837l354K3441
8358C0550J3648o740K706K76k719N284J8755r99j5767o405J8484J2262R280j599
8344G7016J0285M95j6682p839r186r052j466q767o559p579K3577Q00P798k084
8330E0757k625o650J5801j8854q319J0020M59k4819K701m4K485M032q082k111
8316A4751o612j395J1533K69k2625K907R623K7000K0768j5445j5571K3508M909
8303E3620j9299L656J1360N221M778j3840k3173j7862K51p412L927K2713q338
8290A5602J0557R372j15j342j0063j5286j0176L690N853R535K935J802J3772k141
$$ y = [43157, 63396, 56686, 37091, 28608, 34552, 20015, 37056, 39902, 48138, 55394, 55335, 57558, 68699, 71591, 63711, 67623, 76970, 61433, 65753, 73049, 59274, 40105, 32353, 22300, 10463, 7109, 30550, 44198, 37458, 40164, 40440, 37721, 43005, 61760, 60761, 44994, 38589, 57073, 69335, 78615, 77016, 87301, 87796, 71114, 63275, 54089, 45037, 43571, 34804, 28245, 20666, 44243, 45043, 52841, 50757, 48132, 41482, 57283, 38429, 30110, 40130, 40589, 15770, 18471, 18427, 20912, 24944, 16862, 14751, 8139, 6744, 18277, 18546, -4079, -1172, 8451, 35451, 56219, 40774, 25203, 48711, 53620, 34321, 37977, 49337, 54558, 59336, 45496, 22323, 4461, 4712, -2700, 1227, 23940, 15602, 26159, 35531, 35416, 34074, 24011, 8725, -1451, 2239, 8092, 17627, 20562, 22364, 36136, 33995]
8276C3995j2834o69Q54J4673L366J9300J3111o819j3734j7165J04J4252j624p674
8262C9136J88Q354P536j544j597j5417K705J7102l336k0809J4711J343k295j7017
8248B9060j3492L772k599r038O559J8784J3967j3217o158K217l391P20Q457k27
8234C5414q080n404J136J3700j1051m420l063q561K2362J1180M088P210M783j1275
8220D8019l497j0886j7165Q623J1087J722N126M490L017R602k1938j4162j5918
8207H120j371J62J463j851o956K588J6801K9558m945l7561j7296J1994Q927L057
8193A2690k090M116L819q498k1826J0609J6106K0483l724P942J08K826k259L622
8179D3924Q038j695j9237j4179l094P564j241N964m173j1886j603R533J5235j0268
$$ y = [33995, 21161, 20492, 21346, 36019, 39385, 58685, 71796, 64977, 51243, 34078, 34182, 48434, 46810, 39136, 39324, 47678, 55214, 53670, 52073, 36656, 39361, 56463, 53127, 32318, 47029, 48372, 46077, 29060, 15568, 19340, 16741, 7703, 14262, 33046, 47013, 33796, 27638, 29855, 26464, 27184, 35641, 35414, 27334, 21930, 23066, 36766, 25715, 21295, 18232, 9671, 32033, 43213, 47301, 54511, 59294, 48019, 44522, 33636, 16471, 25094, 36181, 37903, 43029, 47519, 50536, 60138, 38200, 24038, 8120, 6749, 6911, 8374, 6523, -433, 2155, 18956, 48514, 43569, 6008, -11288, 706, 9633, 12690, 10600, 14716, 18535, 10037, -11789, -1180, 14926, 35409, 31685, 39627, 39735, 42561, 40302, 43924, 51962, 50267, 31030, 16851, 13757, 21321, 20080, 26044, 21871, 9985, 8382, 17915, 33150, 22882]
8165B2882K367R162j777q908k0040J7615K5447L512q635q522Q47O983k4431j4579
8151A923L215J1633K729n179P084L57M965q440j5363j8046L1712L7132j7937p461
8137B8324m321j9635m796O712j217l708j894k912j507k0650N059K9402R791l547
8123A5101p307n5p680R58K1211J8047j8934J852j2555k431J022N693m950j0408
8109d36R989Q813M659o892O121K8545k6705n091J1279j4305k469Q960R52p556
8095A5864q79K493r0K59p062l062m099j163j800N428N299l296j5786J4274P066
8080A3446j5248J1600Q275j7677O479O408J312O80P462J1273k522L100M381j4030
8066B4939j2228j2321j1212R585J2816J3019l234j0824P250J8968p212m893k360
$$ y = [22882, 25249, 34411, 32634, 23726, 3686, 21301, 46748, 50260, 41625, 33103, 33950, 40933, 16502, 1923, 5138, 16771, 19500, 14321, 21405, 21762, 26727, 18287, 2924, -15122, 16590, 53722, 35785, 28324, 24003, 4368, -428, 6284, 5067, 1359, -535, -3447, -4954, -25604, -20545, 8857, 18648, 15101, 7794, 7739, 59, 1017, 22228, 40275, 21341, 23193, 10638, 8207, 9229, 14922, 9972, -436, 9553, 18366, 23025, 16133, 22254, 50799, 24094, 19003, 30282, 15977, 13508, 22468, 23420, 15864, 14985, 17478, 17388, 17647, 10585, 7523, 3424, 2261, 461, 5889, 11188, 7892, -7894, 6380, 13446, -1802, 9798, 18073, 396, 6875, 13283, 14595, 15275, 22737, 34010, 31488, 34588, 38969, 24939, 12711, 390, -10822, -1237, 11579, 24598, 21364, 10540, 17790, 36758, 29546, 24653, 22293]
8053B2293J710j311j0797j7842l808r701O059K945L4328L3574j2909k5606J0567
8040B9502K353J7642J784j3511k735R276j8698q441l64J1807k727j4529J9171
8027C0530M836J0897p051k2575J8175o678J747l547k136m344n810o742J603J5389
8013B4294l991J1772k114K0625l220M095j9907k9495k8443J1821R484J0128J2611
8000A7660M6l182p01R920J43J6156J4988J372r736q071J3644L4629K2923P890
7986A17681j1797k0395j1134L228j7729j9477k7100O963L1823q639R9J1161M029
7973E8713J2352q48j8991j5354N741M192k8129j5960M629J3075j802L270J028
7960B1916q13j3526J0307P252o185M044R415j066J4478j36n220J1971N563J1768
$$ y = [22293, 24003, 22692, 11895, -5947, -9755, -19456, -13397, -10452, 23876, 57450, 44541, 18935, 29502, 31855, 49497, 51281, 37770, 35035, 44311, 25613, 17172, 16808, 28615, 25888, 11359, 30530, 35366, 46263, 39212, 16637, 34812, 28134, 29881, 26334, 24198, 19854, 14044, 7302, 8905, 24294, 20303, 32075, 29961, 50586, 47366, 51461, 31554, 2059, -26384, -14563, -5079, 5049, 17660, 17706, 14524, 13823, 23743, 23886, 40042, 55030, 56402, 46666, 38595, 52239, 86868, 109791, 117681, 105884, 85489, 74355, 77583, 59854, 40377, 13277, 20240, 52063, 43424, 43523, 54684, 58713, 71065, 70217, 51226, 35872, 41613, 45805, 17676, 1716, 6345, 19420, 17618, 20888, 21916, 21103, 7577, 17884, 25136, 18951, 22995, 32410, 31344, 45822, 45686, 40466, 52437, 58000, 69768]
7946F9768K4426J4798r016k5758j687q300k9885k118M570p723j1253R840o82k3935
7932C045O012J4591k42j1681K5648O403j8788J905O820j2289m250J8704J9606
7919E5484j2956k2833J2805J245j4966j3535l279L1870J7025p289j2842j9761
7907A0968o613r304j057O878P872O260J3293n957N111j0995j367J1771R688j0817
7893B5731n899k138o894J671k543q586J1375K3990k860j2038N60q441j1954j0180
7879h206j7077r320J0711K1338J8758k404L044j101j9116j4027L856n16P978q68
7865f950K6758l600k5832J3319J0232Q001k1810P554J1312J105Q216j1144p959
7852I202Q989l887k7670J2315L831J0492J144m650J5907J1858k211j0855J7620
$$ y = [69768, 94194, 108992, 99976, 74218, 72531, 64231, 34346, 32228, 36798, 29075, 17822, 27662, 26980, 3045, 9057, 23648, 23406, 11725, 37373, 43776, 24988, 26893, 33713, 21424, 17174, 35878, 55484, 42528, 19695, 32500, 33745, 18779, 5244, 1965, 33835, 50860, 43571, 30729, 10968, 4355, -4949, -6006, 872, 8744, 15004, 28297, 22340, 27451, 16456, 15089, 26860, 36548, 25731, 19832, 17694, 10800, 12471, 9928, 1342, 12717, 36707, 33847, 21809, 22369, 13928, 1974, -8206, -25283, -34603, -23892, -2554, 16204, 13800, 16844, 15743, -3373, -17400, -13544, -14060, -6082, -6950, 19808, 16208, -9624, 3695, 13927, 21928, 118, 7672, 18984, 20089, 28305, 17161, 9202, 18191, 14304, -13366, -1051, 2780, 13272, 14416, 9766, 25673, 37531, 35320, 24465, 42085]
7839D2085J6500J222j9117j0745L065j375l691l181k3523K01N922j4205M906k686
7825d622K449J0907j5036j1985J7720O161n187m417J5874l275m561L014j2760
7812e718j3140r013k442O69J6752K2559P648k647j9445r550J085L649J1196J4236
7798A5839j0301l236j7082J436P298j4032R092J6444O840j2q96O234P627k1463
7784C788j7017K171R211L754O586N066J2110j595j3678j1644k0127L255J1386
7771f734J5952j2078n85P217K509j899j4140J2105l599p408J077Q035Q929K441
7757A1822j6174J2880L949k5760j4679j1052o458J5500J5924L870m451j374J5629
7744c74J4335k516K2348J1692j4931q62q95m716j300L464m79j60n818m189j963
$$ y = [42085, 58585, 59807, 40690, 29945, 33010, 31635, 27944, 24763, 1240, 1441, 7363, -6842, -1936, -4622, -2173, 8734, -6302, -18287, -567, 5594, 407, -4010, 11864, 8589, 4028, 7042, -5718, -18858, -27871, -30313, -29644, -12892, 9667, 17315, 14668, -4777, -14327, -13242, -9593, 1603, 15839, 5538, 2302, -14780, -13344, -6046, -20078, -10986, 5458, 12298, 12286, 11390, 17624, 25251, 3788, -13229, -11058, -1847, 1907, 8493, 13559, 25669, 24074, 10396, -1248, -21375, -18120, -6734, 9218, -2860, -3445, 3772, 6281, 4382, -9758, 2347, -1252, -8660, -7583, 452, 9381, 11822, -4352, 8528, 12477, -13283, -27962, -39014, -45472, -29972, -14048, -10178, -14629, -16003, -374, 13961, 11445, 33793, 45485, 30554, 29692, 28797, 24081, 22781, 26245, 25766, 25606, 19788, 15599, 13636]
7729A3636q676k128L556K945m909o211o136m545P951R900J4293k982J714j4081
7715D327j4291N748N511k287j1440j141k438o100K1420j346j866R160J0965j398
7701A4824J6902j1316j0570R971m839k113J0229n219m533j3891m203Q685O992
7688A0919L546p324K281J791k177K3792j2018k9496J205K2190r074J2176O409
7675B4220M428J4714m830j2804j5388q629J2429o027j0067L0498N238j9911m91
7662A3380R307m307j0769j6679r380J730K674J0339R463O310J993j2996k3373
7649b2308N384J4979Q310k810K0948Q170j1981M693j0860l710M249n71j534O216
7635A9175k879n913j5977j7807j6814J5920K0920J2684Q637P237j308m402o297
$$ y = [13636, 4960, 2832, 6388, 9333, 4424, -1787, -7923, -12468, -4517, 5383, 19676, 16694, 18408, 4327, -9964, -4216, 1295, -992, -12432, -13573, -16011, -22111, -691, -2037, -3903, 5257, 16222, 14824, 31726, 20410, 9840, 19811, 14972, 12859, 23088, 17869, 13336, -555, -4758, 3927, 10919, 14465, 7141, 9422, 11213, 9036, 32828, 20810, -8686, -7481, 14709, 5635, 17811, 24220, 28648, 43362, 38532, 25728, 10340, 1711, 14140, 8113, -1954, 28544, 33782, 13871, 13380, 22687, 18380, 7611, -9068, -18448, -16718, -14044, -3705, 5758, 12068, 14061, 1065, -22308, -16924, -1945, 6365, 3555, 24503, 32673, 20692, 25385, 14525, 10815, 15064, 14493, 12959, 19175, 16296, 10383, -5594, -23401, -40215, -24295, -3375, 9309, 17946, 25183, 23875, 19473, 13176]
7622A3176k766Q791R109M573O045J2751r425k2174j0860J2957J352R198J4814
7609D7541n827j0329k4122j2025K1356K9406j746k7646M335N975p270K037J264
7596B2949M530P146R715k9584k1863j7298r348M444N825J6205n877k734R444n527
7582a1973J4443K619k654J2729p142k076J0728j12J1964P853J882k433k005N51
7568C4374K419q280p467j6115k4341j302J999j31j5289j125l259J0883M288n329
7554b8675K7444L399j4412n294J865J1876j6972j247K2509j2478j2508N196J6561
7541b736J3687P54j1474j5214l629N576J5745o286j0678m331J285J3686J1437
7528G822n334J1166j4806o400J2250M127j6171j2377N207j709J8233M996j0654
$$ y = [13176, 10410, 19201, 28310, 32883, 38928, 51679, 42254, 20080, 9220, 22177, 23529, 32727, 47541, 41714, 31385, 7263, -4762, 16594, 46000, 44254, 16608, 20943, 26918, 19648, 21685, 22949, 27479, 34625, 44340, 14756, -7107, -24405, -33753, -29309, -23484, -7279, -13156, -15890, -6446, -11973, 2470, 5089, 2435, 15164, 8022, 5946, 16674, 16562, 28526, 36379, 38261, 35828, 33823, 34374, 36793, 28513, 21046, 4931, -19410, -20712, -18713, -18844, -34133, -35258, -38517, -27634, -23346, -28675, -1231, 2168, -12244, -17538, -15673, -3797, -20769, -22016, 493, -11985, -24493, -19297, -2736, 10951, 11705, 231, -14983, -18612, -13036, 2709, -3577, -14255, -18586, -17301, -3615, 7822, 2488, 13654, -1152, -7552, 4698, 8825, -7346, -19723, -14516, -16225, 2008, 7004, -3650]
7515c650j0798L540R088O201l666L696j5824j1371l473K0119J0123q633n952K3302
7501A2702L318n965p427j5708o174L589L505M722O300k652j0837O952q271P94
7487a5152l550p761P358N64L672O844J4937j0053m184L212J2755n391L220n189
7473A282j3525q06J0454l143O02J0670N997J2992K2664k558l6406o008P650k964
7459F901j7330j5498P973R892J251m044m706P52j3403J2291K868Q98k067K983
7445a1239m453j366o892J676K3417J0473K51O931L324L19k0838R068J333j3589
7431a585m239R201j1209j4378K2064J8815q366k227k954K0138O635j1675q013
7418A2207j8346p476O310O190j564K573N494k037m930P514q503M69R669M179j1217
$$ y = [-3650, -14448, -10908, -1820, 4381, 715, 4411, -11413, -22784, -26257, -6138, 3985, -4648, -10600, 12702, 16020, 10055, 2628, -13080, -19254, -15665, -12160, -7438, -1138, -3790, -14627, -7675, -15946, -15152, -18702, -26463, -19105, -18541, -14869, -8025, 6912, -3141, -7325, -4113, 8642, 3251, 6471, 1282, -12243, -13049, -2595, -5738, -5136, 5534, 11531, 24523, 47187, 44629, 8223, 2215, 9865, 6901, -10429, -25927, -17954, -8062, -6811, -10855, -15561, -14809, -28212, -15921, -13053, -12155, -14222, -11239, -15692, -17058, -23950, -22274, 1143, 11616, 11867, 18798, 22122, 22441, 1603, 10671, 12004, -1585, -5824, 3377, -7832, -22210, -146, 18669, 10303, 8076, 5122, 25260, 31895, 20220, 12207, -6139, -13615, -7305, -1115, -2679, -106, 5388, 3351, -1579, 5935, -2568, -2099, 7570, 11749, 532]
7403E32q92k03l131Q99m176N955r411j9897k571R640L974J8714K3596j4751n705
7388B573K875L100n246K351k6525j9239P099P727O580J1313N486j287J1834l30
7374H311J224J4922j7032p524j5534j2829J6901L6614n287k5068J651J1654j537
7361F466j1025N25R730R352N003p838j2254r416J8276n758J56j8595k5525m654
7347d5557J496K8410L6484O903k0562n980r380k801J938J8586j268k288j4569
7334h588O160J5241j5919l269Q811M568j1977J0607j533j0001O741q885J856L440
7320b748j2103o700J1147M086L110k853j7280j225L165O825K90K1524j844k844
7306B550j4796q648J6248J3468J3162n077j4325m299J2954k63k0823J9549J1794
$$ y = [532, -360, -563, -3694, -2795, -6971, -1016, -10427, -30324, -32895, -23255, -19281, -567, 23029, 8278, 2573, 5448, 8548, 3302, 5653, -20872, -40111, -33012, -25285, -18705, -7392, -1906, -3193, 8641, 8311, 9535, 24457, 7425, -99, -15633, -28462, -11561, 25053, 19766, -5302, -3651, 8003, 6466, -4559, -4034, 5696, 15048, 20051, 12213, -41, -9457, 8819, 3061, 3217, -15378, -40903, -45557, -44061, -15651, 20833, 27736, 7174, 1194, -8186, -10987, -9049, 9537, 8269, 5981, -8588, -2428, 12813, -3106, -6375, 2436, 7004, -4973, 5634, 4101, -5900, 841, -8044, -6188, -2748, -14851, -21551, -10404, -6318, -3208, -6061, -23341, -24566, -21401, -14576, -14286, 7238, 5394, 2550, -12246, -20894, -4646, 8822, 21984, 16907, 2582, -1717, 11237, 10974, -9849, 9700, 21494]
7293B1494J511j9960m680j5547j2024K2845M395L654J40N493K0225K886k1474
7280H958k8216p533O878J3233P024K861M277r935j7357r889K3209K0775q47j5478
7266b040j5392J6486J4080N296j234Q055R217m074j716l0142n422L54J8415K990
7252A4873J535n856j9265j4587N373K506j8965O67J7297K1308L0781o520k3046
7239F101j5464q842l266P716K5812j2187k0600J4122J6060K871P490l070L941
7226B0684L791n508J3297N690j9905j3508j5203m823J0762k954j0723l128K0005
7213a523J2675j4973p289j1275N024M180Q829L414r912j4528J3156N314j100M557
7199c451J7824J2040J3540j7336k4185m322q371K1358J2489j1170j2787P717r092
$$ y = [21494, 23005, 3045, -1635, -17182, -29206, -6361, -1966, 1688, 1828, 7321, 27546, 30432, 8958, -19258, -26791, -19913, -6680, 344, 3205, 7482, -2453, -19810, -29699, -6490, 14285, 13438, -2040, -17432, -946, 13134, 18430, 17196, 25251, 34468, 30394, 28678, -1464, -6886, -6532, 11883, 14873, 16408, 10552, -8713, -23300, -17927, -15421, -34386, -33719, -16422, 4886, 35667, 29147, 6101, -9363, -18205, -21471, -13755, 12057, -130, -20730, -6608, 9452, 12323, 19813, 16743, 20684, 24475, 18967, 32264, 37954, 18049, 4541, -10662, -15485, -4723, -7677, -18400, -21528, -1523, 11152, -3821, -11110, -22385, -17361, -13181, -4352, -938, -10850, -25378, -12222, -6908, -8008, -3451, 14373, 26413, 39953, 22617, -1568, -5890, -14261, 7097, 19586, 8416, -4371, 3346, -5746]
7186e746M46j0011o42O896K1992j337R510p266k231m758q866j592O898M85R777
7171A3555M678k3019n210P722k192J4882O733K887j2846j2552j511K243n870q163
7157a8663j1278N619J0498K737R628K3110r970k65N01q72r89r54L375R488o610
7142A5355j2942L997M997j6370j5108P050K7322k702p904k941m183r965l019O683
7128i730j0994N812J8378P755M655l795J2103j1910N792j2226k3344P429K0905
7115A0830j0461p684O583m897J5678K298o097p224o078J555J4976K659k6696m307
7101a8865J1873M252J2795N359r795j4280l595k552K072O031L053Q617K393J5461
7087B2819m461n165O837j5185K908L852j9536j940K568P224P16r110Q703L256
$$ y = [-5746, -5300, -15311, -15953, -9057, 12935, 11598, 21108, 13842, 11611, 6853, -2013, -3605, 3293, 3778, 13555, 18233, -4786, -9996, -2274, -4466, 10416, 17149, 20036, 7190, -5362, -6873, -4630, -10500, -18663, -29941, -24322, -13824, -11087, -1459, 21651, 11681, 11416, 11917, 11045, 10056, 9102, 12477, 21965, 15355, 2413, 6410, 11407, -4963, -20071, -13021, 14301, 11599, 3695, 754, -3429, -13394, -16413, -9730, -20724, -14912, 3466, 11221, 15876, 12081, 24184, 12274, 18066, 5840, -17504, -10075, 10830, 369, -7315, -732, -5629, 10049, 12347, 6250, -974, -7052, -5497, 9479, 12138, -14558, -18865, -6992, -2740, 10055, 15414, 5619, -8661, -12256, -14808, -12736, -6705, -3652, 4965, 7358, 22819, 18358, 13193, 20030, 4845, 7753, 11605, -7931, -9871, -7303, -79, 637, -8473, 230, 3486]
7073C486J5353J0190j7028k7140q461O356J9400K1124P029j2688m320j0591n541
7060b831j362J7128K5013K774m820j6846l008j009O635n676l117p584j3716J411
7046g008O230L598L001K0581j2461k2471k6157J246J4583J0860J0415k417q947
7033h947J0243m943m48j1363K557P155j3115K2569O110j9177k663j991P356P956
7019A299P198p372q303p968R291j2292j0325K945m622M97L896K6888O273K542
7005I947J5098j2081n650N978J6776J1000J0087J8774P014j799j2301j2893J234
6992E1184p250j2384k1823j0785j6427n960R394O880O378P224J0250M789p525
6979A3945K780r398Q37J4484P096K635J0985K476j0827q069J309M393j8954n008
$$ y = [3486, 18839, 29029, 12001, -15139, -23600, -17244, 2156, 23280, 30309, 17621, 13301, 2710, -2831, -4193, 12935, 37948, 40722, 35902, 19056, 16048, 15039, 21674, 15998, 12881, 5297, -8419, -7008, -778, 2820, 5821, 26402, 13941, -8530, -34687, -33441, -18858, -7998, 2417, 0, -8947, 1296, -3647, -4095, -15458, -12901, -5746, -18861, 3708, 9818, -9359, -12022, -14013, -6657, 1299, 8497, 1125, -7178, -15146, -5855, -18147, -28472, -25527, -30149, -29652, -25756, 1132, 7405, 9947, 25045, 12964, 7314, 13292, 30068, 41068, 51155, 69929, 76943, 75144, 62843, 49950, 51184, 43934, 31550, 9727, -1058, -17485, -23445, -14051, -7171, -793, 6431, 16681, 21470, 13945, 16725, 7327, 8164, 22648, 29744, 32379, 43364, 45840, 35013, 26944, 28253, 32646, 13692, 8684]
6965H684J3576R469N193L334j0235o169Q221j8697j2651K528J380K371J5877p10
6951B2171r134j3145J2717q261n738K959j8189k559J0327J6017O094j1696R859
6938A1422Q927K029j2782l11J3533j2810O615K1958m527k1720J265m788j0406
6925a595o478j4354O799K0672j776j9705j8846N438J1146k315o660J2975P783
6912f916L504j1291j0639M014r778R776l20K1805K2204l405j2848j5959j0616
6899b0469m159J4654O633P403j981J6575k881j1521L443j2391P915Q655N721M261
6885B1858k244j8915j6836M417K07R49p213Q129K4600J851j0299J7861O928j3851
6871A7442j5586n086j8992m475K758L835j5701J1165J3149O758R888p799J0823
$$ y = [8684, 22260, 31729, 36922, 40256, 30021, 23852, 32073, 13376, 725, 3253, 4633, 7004, 22881, 22171, 13037, -108, 12609, 4348, -1390, 1569, -16620, -19179, -8852, 7165, 13259, 1563, 11422, 20349, 22378, 9596, 9285, 22818, 10008, 16623, 38581, 34054, 12334, 13599, 8811, -1595, -8073, -22427, -15628, 5044, 3268, -16437, -35283, -29845, -18699, -21014, -27674, -14699, -6916, -3412, -14703, -25342, -21328, -31106, -21330, -21650, 155, 22359, 18954, 6106, -9853, -20469, -24628, -9974, -3341, 4062, 2081, 18656, 15775, 4254, 7697, -4694, 3221, 11876, 17597, 21858, 19614, 699, -16137, -11720, -11513, -10564, -17777, -9648, 14952, 16803, 6504, 24365, 31293, 17442, 1856, -3230, -22222, -26697, -23939, -20104, -35805, -24640, -11491, -4733, 5155, -2644, 8179]
6858H179N970K828k5802J6454J0596m891n786r534j5920J950k1102R618K7689
6845B49K122j7508J167J7722j483n302j116j5289J6388K4074P286j4284k903K0411
6831C1534L623l2391K107J4038n83j0365J531k675K682M773j1764k4124p860P245
6817b2229M386K596j5323l669J2527K8115j2267j5110m904Q846K849J1501P377
6804D695p372J0290p987n627K6340J3111j4770P238J1866m001j0659j1341r174
6791B609o5Q36r100J0188M101k01j5782Q322l795J4291J6078r680K23r440j4256
6776e671P682m518j3879J3411J5074j4842p594M720J0706n38j6475J467R792J0877
6762A0212m176p7o128j0809K1022Q310j8146J953O745J7036O283j5052j4669j264
$$ y = [8179, 14149, 16977, -8825, 7629, 18225, 13334, 7548, -1986, -17906, -15956, -37058, -27440, 249, 2371, -15137, -13970, 3752, 2269, -3033, -4149, -19438, -3050, 21024, 28310, 14026, 11123, 31534, 35157, 2766, 4873, 18911, 18328, 7963, 9494, 6819, 9501, 14274, 2510, -21614, -29474, -22229, -17843, -15247, -30570, -34239, -21712, 6403, -5864, -20974, -25878, -17032, -14183, -2682, 4695, -2677, 7613, -374, -6001, 20339, 33450, 18680, 25918, 37784, 33783, 23124, 11783, 2609, 2544, 3380, -5720, 4468, 8569, 8368, -7414, 908, -2887, 11404, 27482, 17802, 18025, 8585, -5671, 2011, -2507, -16386, -2975, 12099, -2743, -10337, -5617, 5089, 4551, -11924, -10457, -665, 10212, 6036, 5959, -169, -10978, 10044, 18354, 208, 2161, 8906, 25942, 32225, 17173, 2504, 1240]
6748A240q989L413M790R811l928R358o40n297m206J0963j7665j1838K3313O079
6734A6404k0307m556j745J0309j576L03J9545k498J539J1513J0427o263j1322
6721B1773K919J3209m323M900m579j7247j9083J2661O984J3340j687k5679j5015
6708a1827p03k3973O320L1721J0268r358q624j835K0071J4084m344L471l801N202
6694B6672k821O844N711J3918l969k5954j4103k132N065p367R466Q834K630J749
6680B4543j9815r012K6057K2128o636L1641J1930k2736p225k9896O23R188K752
6667C3542J2044J80J1911J6009o184j3075J7175J4718P8P384j029J3250L2543
6654A38546L0212J3494K1800N8228Q7706J11000J77926J65415l6918j17250r3113
$$ y = [1240, -7749, -4336, 454, 10265, 6337, 15695, 15055, 9758, 5552, 16515, -1150, -12988, 10325, 16404, -3903, -8459, -10204, 105, -1471, -1168, 18377, 15879, 17418, 28931, 39358, 33095, 21773, 24692, 37901, 33578, 38478, 33899, 16652, -2431, 10230, 17214, 30554, 28867, 3188, -11827, -12530, -36503, -30183, 1538, 11806, 2448, -6176, -8011, 12060, 26144, 21800, 25271, 21470, 26672, 23851, 30695, 36406, 50324, 46355, 20401, 6298, 4166, 9231, 1864, 11330, 20164, 22794, 24543, 4728, -4284, 21773, 43901, 37265, 68906, 80836, 58100, 50875, 20979, 21602, 30790, 33542, 45586, 45766, 57677, 73686, 67502, 54427, 71602, 86320, 86398, 93782, 92753, 106003, 138546, 168758, 182252, 204052, 262280, 349986, 460986, 638912, 804327, 767409, 650159, 557046]
6643E57046n6648j6658L1220M2233N6227J09913J27434J85657K41988L22405M22293
6632B023110N95323Q73098J454426K619094M882765P561217M858664k927879o107074
6623A5832744n789226l591224j931276j094600p11073n21333m07237l24405k53769
6614A208601k26303j41832r8817p7274m0201l5417l657P1230J40817J02995q2874
6603H17268j76875j57369j02164n9212o3879m3821k8181j9686J980j0795q873
6592A48393j7382j3322j8505O428n511j772P280l196k9549q797n264N344m509
6579E9638q207j557j1659P160P704J4952j8281O448J3101n803k0004j9077j46
6566B4269o173J0949N996K1325P443j8339j6789l889N274n040j2758P394P057
$$ y = [557046, 500398, 483740, 514960, 557193, 613420, 723333, 850767, 1036424, 1278412, 1600817, 2023110, 2618433, 3491531, 4945957, 7565051, 12447816, 20009033, 24867697, 21939818, 15832744, 10043518, 6452294, 4521018, 3426418, 2715345, 2194012, 1786775, 1462370, 1208601, 982298, 840466, 741649, 664375, 624174, 588757, 585100, 656330, 797147, 900142, 817268, 640393, 483024, 380860, 321648, 257769, 213948, 185767, 166081, 168061, 157266, 148393, 131011, 117689, 99184, 105612, 100101, 98329, 105609, 102413, 72864, 64067, 58803, 64147, 59638, 51431, 49874, 38215, 45375, 53079, 68031, 49750, 56198, 69299, 63496, 43492, 24415, 24269, 18096, 29045, 35041, 56366, 63809, 45470, 28681, 24792, 30066, 25026, 12268, 19662, 26719]
6553B6719J7180M12L098j366j0829j1972m750O277j8059m11O408j0267j0654l483
6539a1697P432L3969r874j7193K8057J4333N944K305J175p545j9486k1081J2199
6526A8538J069j1333l35N519M380N487J0319j925j4647K1356P16j3045O324q658
6512B3765q426j3799r234o699Q059J6732Q330o599q603j9364p65K0781J9228J319
6498B4725j0024M296j5137k882O271J6068J4508r420j0199j3489o305o289K5434
6485A7557K8335l544j8800j5806o676J3323L485j290l094J11j2296k386j2454
6472a3535J3076M705P694q876O38P486P600k177M782j5167M296J7503N55m860
6458B3720q329Q589m116k1691L253J615O325o589k607O349K525J8664o691k0085
$$ y = [26719, 43899, 44311, 47409, 46043, 35214, 23242, 18492, 24769, 6710, 6299, 12707, 2440, -8214, -11697, -4265, 29704, 19830, 2637, 30694, 45027, 50971, 53276, 54451, 46906, 27420, 6339, 18538, 19607, 8274, 7939, 13458, 17838, 23325, 33644, 31719, 17072, 38428, 39144, 26099, 32423, 23765, 15339, 1540, -7694, -14393, -6334, 10398, 18728, 12129, 3526, -15838, -16603, 4178, 23406, 24725, 14701, 18997, 3860, 978, 7249, 23317, 37825, 28405, 18206, 4717, -1588, -7877, 17557, 45892, 42348, 23548, 7742, 1066, 14389, 17874, 16584, 13490, 13601, 1305, -1081, -13535, -459, 4246, 11940, 3064, 3702, 11188, 18788, 16611, 21393, 6226, 10522, 28025, 28580, 23720, 15391, 23980, 19864, -1827, 1426, 3041, 9366, 2777, 170, 6519, 9044, 27708, 21017, 932]
6444I32j8792m49N182Q111J9304n532l2248q880Q498J2247J0343m186N327R780
6430I637l553n181M586j2743o918J0379K625M557K8951O667j7331N31j1552j471
6416I184j0608j375O091j5637k237J0469n299l145o433J1204K4345L097k0800
6403a144k0959j4275J4099J8610J503q599j0986R297J3402N953O550k5299p060
6390a8908J2267J712R557m27N04J0327n320L460O203L175q944K213K1915p828
6376B9906j6987j855j193l195N491M622j1396m905o344l789L41Q292K383K285
6362C656R884L330j8204P343p434Q945J0891j2733j1698j5665R697L379p700O54
6348a5655n573o203K1398J761Q477J2157m421j2072L766K5666m432m271O496j6744
$$ y = [932, -17860, -18309, -13127, -5016, 14288, 8756, -23492, -32372, -23874, -11627, -1284, -5470, -143, 9637, 6084, 903, 5489, -7254, -14172, -3793, -1168, 3389, 32340, 39007, 21676, 22207, 10655, 9184, -1424, -2799, 3292, -12345, -14582, -4113, -9412, -12557, -18990, -7786, 16559, 19656, -1144, -22103, -36378, -22279, -3669, -2166, -10765, -21751, -12454, 948, 6901, 13451, -11848, -18908, -6641, -4929, 4628, 4201, 4705, 15032, 9712, 13172, 19375, 22550, 13606, 15819, 37734, 29906, 12919, 11064, 9871, 6676, 12167, 16789, 5393, 488, -5856, -9645, -9304, -1012, 1371, 3656, 13540, 16870, -1334, 6009, -1425, 7520, 18411, 5678, -6020, -21685, -11988, -8609, -16309, -15655, -21228, -27431, -6033, -4272, 4205, 16362, 11941, -131, 3635, 29301, 24869, 20598, 27094, 10350]
6334A0350q269K000k546l897O319l880L850J5648J3150P88r773p030j3931j3862
6320a1083R003J4573J0508j1838j9886j8720M330J0509J7607Q571J3858j1769
6308A5663r287P328P247k400m597j468l61k896q871J2457O523M979O572r961O106
6293B7034R180m3387j071O95K498J1814R101P970n653K259j0954q606j7418k6177
6279d2715j4538J4362K3566M14j0658K3124J0031j013R800J1549J2338o902p849
6266B1509k1954k339J6280n622m265R10o572p702Q318J3265j2995L388J7036K5403
6252D4660J2300J2526J8395O049j1914o302k0355k9242k3566J5472K373k4790
6240d394j0279j275J856K2060O722N219M61l289n420q108p111j264J4501P911
$$ y = [10350, 2081, 4081, 1535, -2362, 3957, 77, 3927, 19575, 32725, 33513, 23740, 16710, 2779, -11083, -2080, 12493, 23001, 11163, -8723, -27443, -23113, -12604, 5003, 13574, 27432, 15663, 6376, 13704, 20951, 18551, 13954, 12486, 12125, 9229, 358, 12815, 19338, 24317, 30889, 20928, 27034, 36214, -7173, -8244, -7549, -5051, 6763, 15864, 23834, 18181, 20440, 9486, 880, -16538, -42715, -57253, -42891, -19325, -18911, -29569, -6445, 3586, 2573, 12373, 23922, 36260, 29358, 21509, -445, -2784, 13496, 7874, 3609, 4519, -2053, -9755, -1437, 11828, -1167, 2221, 19257, 44660, 56960, 69486, 87881, 93930, 82016, 75714, 55359, 26117, 2551, 18023, 20396, -4394, -14673, -15948, -14092, 7968, 14690, 19909, 20370, 17081, 11661, 3553, -3558, -4822, 9679, 17590]
6226A7590m316j5898j4769K0089J3068j3624j4593n609K478k9m379K7128J6794
6213B3930r428j252k017q313K374L226q712r620K577K3881J387M626L244r248
6199A6655j7358k2709j8213K4309K6532J7251P990k2300k6345j0438j6536m666
6187d5828J0774M330p729Q33K582K6618K791j1208K43J4163K0971J4744K477n292
6173C0469j9064j7748J3813L472q663J5921l814k1585J4667P193r104j4105j6370
6160b4918J3294K1855n146j9906k4966j5342J0943L2690K5390l762K401J0027
6148B2560j851k6021L199J5773o530k429J8767r688n183j0006l0414R003M193
6135a8627j7267j0169M706K0640J2610N287N864j6427k5005r068J591M02J2563
$$ y = [17590, 13274, -2624, -17393, 2696, 15764, 2140, -12453, -18062, -15584, -15613, -19992, 7136, 23930, 14502, 13250, 11233, 2920, 5294, 8520, -192, -9812, -7235, 16646, 18033, 22659, 25903, 16655, -703, -23412, -41625, -17316, 9216, 26467, 34457, 12157, -14188, -24626, -41162, -45828, -35054, -30724, -38453, -37620, -35038, -8420, -5629, -16837, -16594, -2431, 18540, 33284, 35761, 30469, 11405, -6343, 7470, 10942, 2279, 18200, 14386, -7199, 7468, 14661, 5557, -8548, -24918, -11624, 10231, 5085, -14821, -39787, -55129, -44186, -11496, 13894, 10132, 12533, 22560, 20709, -5312, -2113, 13660, 7130, 4701, 23468, 13780, 8597, -1409, -31823, -22820, -18627, -35894, -46063, -41357, -20717, -8107, -2820, 3044, -13383, -38388, -47456, -45865, -45463, -32900]
6122c2900J7990J377k8983N881K6162N622m170J535m670k420Q989m444J7281J936
6108I186k9540M680K1078R451J458k884P762q57j1926p924j1367m7J9479m64j2063
6093c978J4749M333n318j6128j8090j6577q10K3304J5377J0473q876n734k197
6080i472j4755p019j3591J2749J9041J283R6j3274k636L98N512K4491M567k6731
6066a9341J2412J4757j6135j6060J109n612m329l720J3265J6671N528o314k406
6053a0175L786o945m825J2071J1496M853J1039J7766n316k5457j7125o24m983
6040a4439o326M543q325q766k668K4484J0203j429k165q209J3187Q220O464J149
6026A5923Q020P126L28m704r745j6634k443M374Q62P511j6307k1478j795K733
$$ y = [-32900, -14910, -13533, -42516, -36635, -10473, -4851, -9021, -7486, -12156, -14576, -5587, -10031, 7250, 9186, -20354, -15674, 5404, 14855, 16313, 13429, 21191, 20334, 8408, 484, -10883, -10930, 8549, 8085, -3978, 10771, 15104, 9786, -6342, -24432, -41009, -41819, -18515, -3138, 7335, -1541, -7275, -9472, -24227, -31246, -44837, -32088, -13047, -11764, -11668, -24942, -27578, -27180, -21668, 2823, 7390, -19341, -6929, 7828, -8307, -24367, -23258, -28870, -33199, -36919, -23654, -6983, -1455, -7769, -10175, -6389, -13334, -18159, -6088, 5408, 10261, 21300, 39066, 33750, 8293, -8832, -9456, -14439, -20765, -16222, -24547, -33313, -35981, -11497, -1294, -2723, -4888, -13097, 90, 8310, 14774, 15923, 23943, 31069, 31397, 26693, 16948, 314, -2129, 2245, 3107, 10618, -5689, -27167, -28962, -26229]
6012b6229J687n32k456j7852K0814J1868J2825L43j7356j8950p549O584J4482
5999b2321M180j3189J644J0862J963K0589n599j623q135o893Q38k2209m81J1549
5985b8825P665J6160K4511J5500j6501p550Q369J7277j890k8876n324J3071P396
5972B0983p101o598N348r554p292L839J2034o09R192J046N22k5093q438M970j8595
5957b5346o223J9015K1465o576q289l402N92Q650J768r831J4821M287m916j5102
5943i087p17J951l632J2353j0428l249k364r221J6610J0817k573o877K4366J5338
5929C3287j4287j8754L487R11l56J2977j6344j3089k18n959J5966O883P794J642
5915A3940Q417r45j7743j739K868l133j2052q566k090J918r152j5437K4952J3079
$$ y = [-26229, -24542, -25074, -27530, -45382, -24568, -12700, 125, 468, -16888, -35838, -43387, -36803, -22321, -18141, -31330, -29686, -18824, -16861, 3728, -1871, -3494, -11629, -18522, -17684, -39893, -40374, -28825, -21160, -5000, 19511, 35011, 18510, 10960, 19329, 36606, 34716, 5840, 516, 13587, 20983, 13882, 7284, 12632, 3078, -4214, -375, 11659, 11050, 20242, 21288, 21810, -3283, -11721, -6751, -25346, -31569, -12554, 8911, 2335, -5954, -9356, -8764, -114, 1654, -8177, 6644, 10931, 6015, -9087, -9804, -7853, -11485, 868, -9560, -12809, -15173, -24394, -7784, 3033, 460, -6417, 17949, 33287, 19000, 246, 3733, 4644, 4288, 17265, 921, -12168, -12386, -18345, -2379, 4504, 12298, 13940, 22357, 21412, 3669, 1930, 4798, 1665, -10387, -18953, -21043, -19125, -28277, -43714, -18762, -5683]
5901e683o83J123r849N807R187Q173k230j518R845j3432K374M626k845r313J3701
5886I283m039J5411q65O683l942J022j3812r759K686M835j3331K470j024o517
5872a0899j2183j5116R221j0511J120J7744J2993J5829p403o837l826J7495J1275
5859A8902O410o927l113n568M237J1040J972j6613k4767m051M919m662r681o365
5845c4267J9442J9593j954O285k685o244m800j769l310P859l21J7572M570r293
5831A0678r536l897j214l531J2401K298o200j2094r867J4413J1234j1194j4262
5818b0771P214o297j3568O51O647P910j64j6396P377J2666J1700p779m895M090
5804a1615K062J5728j3316k031j358L051J3518r788j7836m722J701l971j381o18
$$ y = [-5683, -6366, -5243, -15092, -9285, -98, 8075, 5845, 4327, 14172, 740, 3114, 7740, 4895, -4418, 9283, 5244, 20655, 19790, 26473, 22531, 23553, 9741, -18, 2668, 7503, -5828, -3358, -4382, -10899, -23082, -38198, -28977, -39488, -38368, -20624, -7631, 8198, 795, -6042, -9868, 7627, 18902, 25312, 18385, 15272, 9704, 13941, 24981, 26953, 10340, -14427, -18478, -13559, -18221, -27902, -34267, -14825, 4768, 2814, 9099, 6414, 170, -4630, -6399, -9709, -1850, -2171, 15401, 19971, 10678, 1142, -2755, -3969, -7500, 4901, 7199, 999, -11095, -20962, -6549, 4685, -6509, -20771, -13557, -19854, -33422, -32771, -26124, -18214, -18378, -34774, -27397, -14731, -3031, -10810, -15705, -11615, -9553, 6175, -7141, -9172, -10530, -7479, 6039, -3749, -21585, -26307, -24606, -28577, -29958, -30576]
5790c0576j322O658j1552M927L1320K0291p181N70q516k6217K3011K7018J0275
5777C8706j6931K063J1757R229J2432j8971k2430k329J209O262j0533k3464k5
5764a3025Q700J0909K125p940j3353o621Q924k969m221J5687R27p087m458L614
5750h788J1045j303j5265J2285J0164r072m881k148l250l076P218j5133J3674
5737h530M029j8182k02Q543J4795J9620J371J559k6893L055Q116P43L98j205m940
5722B277J0035q661j8587O45M761J3637J312O302j2704Q696J2686j4074n844j1755
5708a1274j1495j462O51j34r808J7808K2086j8348j0836p505J0014K3925Q107
5695A1729N358N346p27J6304j8615k1508r375Q657J1479j116k620m856M371J7118
$$ y = [-30576, -31898, -25240, -36792, -31865, -545, 19746, 12565, 13135, 4619, -21598, 1413, 28431, 38706, 21775, 23838, 35595, 44824, 57256, 38285, 15855, 13526, 14735, 20997, 10464, -13000, -13025, -4325, 6584, 8709, 769, -12584, -19205, -10281, -13250, -17471, -1784, -857, -7944, -12402, -8788, 2257, 954, -14311, -2026, 8138, -934, -5815, -7963, -11213, -14289, -7071, -22204, -8530, -4501, -22683, -22885, -14342, 453, 20073, 21444, 23003, -3890, -835, 7281, 8024, 8422, 7217, 2277, 12312, 3651, -14936, -14291, -9530, 4107, 5419, 11721, -983, 7713, 20399, 6325, 481, -11274, -22769, -24231, -23580, -23714, -33522, -15714, 6372, -11976, -22812, -30317, -20303, 3622, 11729, 17087, 22433, 21706, 38010, 19395, -2113, -11488, -2831, 8648, 7532, 4912, 56, 4427, 21545]
5681B1545J8686r363k7364j2136o014r927K844J0272J7033k6991j8086m99n427
5668d5427R599K7250L924R649n76q372l339k442J677o697Q422Q107j5071J8096
5654D800m337r240m435m406P984L527J7807j387k0147J7051J5859J8169q825j9174
5640A3246j815Q11p496j6520Q601K2510J1311J1841j2757q669J1000o515q567
5627A6981j4052j7015j3779O288Q941J6844O249o201j9078l998M943P367J6386
5614I876J0461l123j8417q489j330K373R965M549Q346n775l295k424J8794M236
5600B5747j8489j3632K657J628N299o527j1429j8870J1103J3616l849k798l030
5587a8574o498J1882J3277j4985J5168J3634O63l861j2278J1866l70o567o946
$$ y = [21545, 40231, 30868, 3504, -8632, -14646, -24573, -21729, -11457, 5576, -21415, -39501, -40000, -45427, -35828, -8578, -4654, 4995, 4419, -3953, -7292, -9734, -8057, -14754, -6332, 1775, -13296, 4800, 463, -8777, -13212, -17618, -9634, -6107, 11700, 10313, -9834, 7217, 23076, 41245, 32420, 13246, 11431, 12242, 4746, -11774, -3173, 19337, 30648, 42489, 29732, 21063, 32063, 25548, 16981, 2929, -14086, -27865, -21577, -12636, 4208, 10457, 4256, -14822, -18820, -13877, -6510, 9876, 20337, 17214, -1203, -9692, -11022, -8649, 1316, 5865, 14211, 8436, 5141, 2717, 21511, 25747, 7258, -6374, -3717, -2089, 3210, -3317, -14746, -33616, -22513, -8897, -12746, -15544, -18574, -25072, -13190, 87, -14898, 270, 13904, 14567, 10706, -1572, 10294, 9924, 3357, -3589]
5574c589o863o859q838p448Q771L847J6492J475j3769O81M204o581o091p470P370
5559b4668j6775J5207L372J1932J3653O589M589j252m602j8239j5709J036J4082
5546a0785k591r766J925k955J460J651K7516o619m258J2558P808j0449J389j598
5532E286j0345N051k028j625j7117J3073o334K575K0187m199m2178k4931o381
5519f8966P810K2321K1504J2611k215j1109K324q59j0237J068J6404M95J916J387
5505e546o780j722N724J9543O426j6991J647m403N399q07m797r154m186P901J83
5490g563L958j0190n406Q812J9649M036r75R104j0963o333M490o240r522l656
5476a0799j5945O604O734j383M233J3629j1667j4752O747K0037M215k943n923
$$ y = [-3589, -10452, -17311, -26149, -33597, -24826, -20979, -4487, -3012, -16781, -16100, -11896, -18477, -24568, -32038, -24668, -41443, -26236, -22864, -10932, 2721, 9310, 13899, 12647, 8045, -10194, -25903, -24867, -10785, -13376, -23142, -21217, -24172, -22712, -21061, 6455, -164, -4422, 8136, 15944, 5495, 6884, 5286, -5059, -8, -2036, -3661, -20778, -7705, -14039, -11464, 8723, 4524, -37654, -62585, -68966, -61156, -38835, -17331, -4720, -6935, -18044, -15720, -16579, -26816, -25748, -9344, -8849, -6933, -5546, -12326, -14048, -8324, 11219, 17645, 654, 2301, -2102, 3297, 2490, -2307, -11461, -15647, -7746, -7563, -3605, -13795, -19201, -10389, 9260, 13296, 12321, 21425, 10462, 4129, 8619, 2379, -7143, -10799, -26744, -20140, -13406, -14789, -10556, 3073, -8594, -23346, -16599, 3438, 7653, 4710, -1213]
5463a213k1576j205o711J3662K1218n009p811R202J3045m063M636J4101j157j5542
5449A1577j9283j8649J676j116O835J951Q422Q440L036j0185q061L2452J1835
5436B8930l372J776j0723m584j821j6815q023r111q625l371j3313P15J6659J204
5422c0474O282O414r91K442K6854n069L908j1771P303j4794p81j1350M49Q603
5408a2975Q879J7414j6223j783J8482J6413m862j1550P822n852o247m654k5926
5395b1062L122L425j1413Q558J9714P079k008J970J766J315Q02j4283j5041J2665
5381c391m851j990j0636l676J9582J4465P343j5846K578N379J523j7278N77P500
5367A279k835o641m57O244N878O342J297m809J2701m94K553r727n080j1001O076
$$ y = [-1213, -22789, -23994, -30705, -17043, 4175, -834, -8645, 557, 13602, 9539, 14175, 28276, 27119, 11577, -7706, -26355, -24679, -25795, -18960, -17009, -8587, -147, 2889, -7296, -15357, 17095, 28930, 25558, 27334, 16611, 12027, 10206, -6609, -14632, -23743, -32368, -35739, -49052, -48337, -31678, -30474, -24192, -17778, -18769, -16327, 10527, 5458, 9366, -2405, 4898, -9896, -10677, -22027, -21578, -12975, -4096, 13318, -2905, -4688, 13794, 30207, 25345, 13795, 21617, 15765, 9518, 4864, -21062, -17940, -14515, -25928, -17370, 2344, 9423, 7415, 9385, 11151, 12466, 13268, -1015, -16056, -3391, -8242, -10232, -20868, -24544, -4962, 9503, 16846, 1000, 3578, 8957, 10480, -6798, -6221, 1279, -1556, -8197, -8654, -2410, 3468, 9810, 11107, 6298, 18999, 18505, 21058, 11331, 6251, -4750, 1326]
5352A326j3279Q477l10q513l535j0233J944J8165J0657L661Q719r50p673j8099
5338i643k582l277m88P83J1490L907N559n614j6104n399Q035K6693O261n209Q439
5323B2851k1702k0406o863P587m914J040J757L665K1938J859k2983L818Q824n729
5309i258k423R331O727j31o454p16j2118j473J6013J0336J393Q96m002K943l926
5294G138k1992M5O410R140M250o325r242P931L1051r576n203q194J632p296o747
5279f978k201j4687j8328j34K0663L4404Q175q510P488J232j2309j1422k6512
5266b9119j6022J9019R374Q96r027j5355J113L1715K3894J1211k765l224K404
5253B4114j0488j5667R041J0566j6596q999j4854l021P216R354K7880l505p398
$$ y = [1326, -11953, -3476, -3786, -12299, -15834, -26067, -24123, -5958, 4699, 8360, 17079, 16129, 8456, -9643, -12225, -15502, -15990, -15207, -3717, 190, 5749, 135, -15969, -21368, -13333, 13360, 19621, 14412, 22851, 1149, -19257, -26120, -18533, -23447, -22407, -20650, -16985, 4953, 6812, -16171, -12353, -3529, -9258, -11681, -2350, 4377, 4246, -2208, -2924, -15042, -16515, -502, 9834, 11227, 12123, 8121, 11064, 7138, -14854, -14809, -8399, 741, 4991, -1334, -10576, -2645, 28406, 18830, 13627, 5433, 7065, -231, -6978, -9179, -23866, -42194, -42328, -21665, 12739, 20914, 12404, 19892, 21124, 8815, -2607, -29119, -45141, -26122, -16748, -15852, -24879, -40234, -39121, -7406, 16488, 27699, 24934, 21710, 24114, 13626, -2041, 7000, 17566, 970, -8029, -22883, -25904, -18688, -9334, 18546, 15041, 7643]
5240G643m402k199n268J355o513M066J4429j610P067j7285j6675j2477r653J2894
5226b8628K9853J8888n08K0440J2526k3207r881M496r075o332l556j469n871p534
5212i858J167o040p281O822r96j731q347q623J4092O788R11P487j2863m024J4032
5197h464K3517j641k890k556p212O984o482l422K112n079O895k6540M147J2639
5183g992q558P002J0293K057J2617K150j4082j3258j5233k1712J2752J0590J5485
5170g889J0379L411Q369q357j7123j0387p497J0337R323N436j4236j3158P006
5157b4386l965O121k639q54J4606j6615k0062M752L786J4601j5133p782J0973
5144c6597P94N081J2623L502J16M60Q236P762L596j466j1211k4646R022L066Q880
$$ y = [7643, 3241, 1042, -4226, -2871, -9384, -5318, 9111, 7501, 14568, -2717, -19392, -31869, -41522, -28628, 1225, 20113, 19605, 40045, 52571, 29364, 19483, 23979, 14904, 8572, 5016, 3547, -2324, -9858, -8691, -14731, -22012, -15190, -16186, -17917, -26264, -34887, -20795, -14007, -13096, -5609, -18472, -22496, -8464, 15053, 13412, 10522, 7966, 754, 7738, 1256, -2166, -54, -5133, 1762, -24778, -20631, -7992, -16550, -9548, 745, 2802, 15419, 17569, 3487, -9771, -25004, -46716, -33964, -23374, -7889, 2490, 5901, 14270, 5913, -11210, -21597, -29094, -18757, -9434, -3998, -18234, -31392, -24386, -28351, -22230, -24869, -25723, -11117, -27732, -47794, -43042, -39256, -24655, -39788, -47570, -36597, -35803, -30722, -18099, -14597, -14481, -14021, -5785, 1977, 5573, 4107, -7104, -31750, -22728, -19662, -10782]
5129a0782l696p68N020m360N312N609R825P662m047k6608j6650k789J2283p710
5115c1699j0717R757P498K2870L9j2196K3269l775M743n678J5395J99k9849N454
5101d690J92J4765o594K449J247O847k4009r205P289k555j4117o966J1703O636
5087a7008O744m913r319J1116P58J857j1903j2922J2833Q771j3795J7172J0257
5074c52j4908k171j1833K347J8164R831J2772j9693j2212M646q325N539R440L233
5060c522J3715Q226j7547o6N998J2595N987j5963o476M09j5Q434R901l227o503
5045A1946O927j0173k2725n954R933J8540M26j7836k357K995j7124Q54L750q249
5031b9047J2772J9392J0807K1292k3363j4366p15P377K684N603M347N927p174
$$ y = [-10782, -14478, -15246, -10226, -14586, -9274, -3665, 6160, 13822, 9775, -16833, -33483, -36272, -23989, -31699, -42416, -32659, -25161, -2291, -2252, -14448, 8821, 5046, 9789, 4111, 19506, 19705, -10144, -4690, -4498, 10267, 3673, 6122, 7369, 14216, -9793, -18998, -11709, -14264, -28381, -35347, -23644, -17008, -10264, -15177, -24496, -13380, -12622, -10765, -22668, -35590, -22757, -13986, -27781, -10609, -352, -15260, -17431, -29264, -26917, -8753, 1078, 13850, -5843, -18055, -13409, -21734, -16195, -6755, -3522, 10193, 18419, 872, 806, 6804, 19399, 25386, 9423, 2947, 3356, 3341, 11775, 21676, 18449, 11946, 18873, 8700, -14025, -19979, -10046, 8494, 8920, -8916, -11273, -8278, -25402, -24548, -20798, -29047, -16275, 3117, 13924, 35216, 11853, -2513, -3228, 4149, 6833, 12436, 16783, 22710, 15536]
5018A5536j0454j9256j3357O068K1852r068m159K1440M605r069n127J0665r630
5005D6l967j826Q846j8432j1918M637L047n057O13K1481K64r727j2606O01l541
4990b7539p287l43J2788J8843R200o353k0142k379p817o759Q268J6102R564O839
4976B985k1737L516J1375J986J84j0188j1472j9851j616J5541M23j589R903n702
4962b6242j080M376n7J245O772J4701N422Q589M219r262j1726J093L710q65o530
4947e635J3458m162j0178J1761N530n511L075k486q071j0026L738l865Q359L798
4933b15K573k0380k3630Q008P195J3967j258k383K640R711J3023n528n072J7342
4919A5993L434j8115K788k054j8145Q928J7773K787j0957j8240M055K414q340
$$ y = [15536, 5082, -14174, -27531, -21463, 389, -8679, -12838, 8602, 13207, 4138, -989, 9676, 46, -3921, -5747, 3099, -15333, -27251, -22614, -19567, -24624, -24011, -2530, -2266, -11993, -24599, -23998, -27539, -34826, -35169, -22381, -3538, 5662, -691, -20833, -23212, -31029, -37788, -29520, -13418, -3854, 2985, -18752, -15236, -3861, -1875, -1691, -11879, -23351, -43202, -44818, -29277, -28854, -30443, -20540, -26242, -27322, -22946, -23003, -21758, -14986, -285, 5137, 13726, 17945, 8683, -3043, -1950, 1760, 895, -5635, 7823, 3661, -6517, 5244, 10774, 5263, 8338, 5852, -2219, -12245, -8507, -12372, -4013, -215, 2358, -18022, -41652, -33644, -26449, -12482, -13740, -16123, -13483, -3772, 9251, 3723, -1349, 15993, 19427, 1312, 4100, 2046, -16099, -7171, 10602, 13389, 2432, -15808, -11753, -9339, -17679]
4906a7679j4280L366O021l012J4838N397N59N434L419m64q905j9801K189K8562
4892E644J9587p027j5557q366J4355j0186k3864r70J9747N775n966J514n944l52
4878a1610J5984M780m347M645J1825N063l460j0563j8106l102l302J0630Q210
4865F647j596j530q310m787m602m141Q016m525K059L544j3357J4948J2720O928
4851A2014J981j1990j4987O965J5814o250l749j144p345j701N648j0116l510O750
4837a1620n828o618J3694K0297j5293l1451m563j448J1657J4138L647N367o576
4824a4597k5320j326J2763q81Q709R656k122l764M867o182j2538q11j747O465
4810b6828J1336R398K57r160O380r153j0893L53O641l135O800L257l003N401n630
$$ y = [-17679, -31959, -28593, -22572, -25584, -10746, -5349, -4790, 644, 4063, 3599, -5306, -25107, -22918, 5644, 25231, 18204, 2647, -5719, 8636, -1550, -25414, -26384, -6637, -862, -6828, -5314, -11258, -11610, 4374, 9154, 4807, 9452, 21277, 26340, 22880, 12317, -5789, -8891, -12193, -1563, 6647, 5051, 3521, -4789, -9576, -14178, -18319, -10303, -14828, -12769, -9225, -22582, -7634, 5086, 12014, 13995, 2005, -12982, -6017, 9797, 3547, -202, -1346, -8691, -10392, -4744, -14860, -18370, -11620, -17448, -24066, -10372, 9925, -5368, -36819, -41382, -42830, -31173, -17035, -13388, -8021, -14597, -39917, -41243, -28480, -29361, -20652, -10996, -13118, -16882, -12015, -18197, -30735, -31546, -33293, -26828, -15492, -6094, -5837, -14997, -8617, -17770, -28663, -28310, -21669, -24804, -18004, -14747, -17750, -12349, -17979]
4795a7979K049L950M724p635k1107M148k42K0918J1755J3842q74J1816J128r684
4781A6809n202k5217j0699N633J4262j7333k1101J1971J3314J0433n894j7431
4769c0455L332J745K784N16Q455J4059r426L142R50J3020J3287n586N038Q32l1913
4754a0220q413K033M361J2237J7361K175R236n465o045j3293j8146l748j2142
4741c0069j82j736K599n722K539J1019J3836J725j3989j0005L86P583O320R868
4727e828l913l598j3316K523n987m905M321K6070K0077p129j2142O398J9040O31
4713B2242k3733j7828o336Q2N045L690M930o389j014J9607j9234j273J6934J0412
4699G135P948o885j1719j9377j645N551P486Q91j3321j6713J727P296l821J0175
$$ y = [-17979, -15930, -11980, -7256, -14891, -35998, -31850, -32092, -11174, 581, 14423, 13549, 25365, 26493, 16809, 11607, -13610, -24309, -18676, -4414, -21747, -42848, -30877, -17563, -7130, -13024, -30455, -27123, -25378, -22594, -22078, -13623, 436, -8990, -5848, -4898, 8122, 21409, 15823, 20861, 21693, -10220, -18633, -16600, -12239, -2, 17359, 19534, 28770, 23305, 17260, 3967, -14179, -17927, -30069, -30251, -31987, -29388, -35110, -32571, -21552, -7716, -5991, -19980, -29985, -29599, -22016, -15696, -5828, -9741, -13339, -26655, -24132, -30119, -35024, -30703, -4633, 15444, 8315, -3827, 2571, 21611, 22242, -1491, -19319, -25655, -25573, -20528, -16838, -11908, -18297, -19311, 296, -18938, -20211, -3277, 7135, 15083, 8198, -3521, -22898, -24543, -18992, -11506, -10615, -23936, -40649, -38922, -31626, -35447, -25272]
4685b5272M828O984J28M826o925L6917J7507J637j582j460L174k1951j8031O675
4671G455J1488p915j8028j3067J1952k248j2609R18q947j767K461L550j1703k9648
4657f8108P789J1865o385N118J0493J8485K4933j1790j1125l471j0478J0407l009
4644b5276N984n360R70J113j3002n106M57K417K495J3092o009K805J8302J1889
4630D771K477k0145j6418M360J9241o055N525J3307j0743O03P788O253p254L46
4616D056k9374J92K0734n911J0201n45k394J6582l99q885j3558q674J1030l808
4602a0753M019J3180K618P744J6530K5252k9117l0752j4820R105N811L458P727
4589A0002o766p550r260k755J8759j421l888k2885L089K6440J0154j2113j1949
$$ y = [-25272, -20444, -13460, -13332, -8506, -15431, 21486, 38993, 40630, 39048, 37588, 40762, 18811, 780, 7455, 18943, 11028, -7000, -20067, -8115, -10363, -22972, -22054, -31001, -32768, -30307, -26757, -38460, -68108, -60319, -48454, -54839, -49721, -39228, -20743, 4190, -7600, -18725, -22196, -32674, -22267, -25276, -19292, -24652, -23682, -22569, -35571, -40677, -40220, -37803, -35308, -22216, -28225, -25420, -7118, 4771, 7248, -12897, -29315, -24955, -5714, -11769, -6244, 7063, -3680, -3077, 4711, 10964, 3710, 4056, -25318, -25126, -4392, -10303, -102, -647, -3041, 13541, 13142, 4257, -9301, -17975, -6945, -10753, -6734, 6446, 9064, 16808, 33338, 58590, 29473, -1279, -16099, -6994, -1183, 2275, 10002, 3236, -4314, -13574, -16329, 2430, 1009, -2879, -25764, -22675, 3765, 13919, 1806, -10143]
4576a0143J3408o196j0477p823R343J5868q72j7662r526P094J2022k307j015p202
4562a5488K2471J2933j4815L025J4310M326j2149m624j4994j0951k0381l304J3217
4549b6424l398Q362L7273p75j3417j3802j6466p05J015M364p30O602N78J3269
4535d254K368L014j1184j802K570n377K0282J0943N181m203k127J1409j071R437
4521C5186l127j2734j484n97n569k9j4583n174J1375j3599M354m545r135K2774
4507C113J6856O825k992j5108o359K767J6931m882j1592n097j77j5107M063J5310
4493D551j9601m396n526O582j5638N574j917k192k54j453K6985J9812j4681n804
4479g958m615M091L572N369j8112j328j8013K0561J8619N937l392j8189K1783
$$ y = [-10143, 3265, -2931, -13408, -21231, -11888, 3980, 3108, -14554, -24080, -16986, -4964, -7271, -8286, -15488, 6983, 19916, 5101, 8126, 22436, 26762, 14613, 9989, -5005, -15956, -36337, -39641, -26424, -29822, -21460, 15813, 15038, 1621, -12181, -28647, -29352, -28337, -23973, -24703, -18101, -17523, -4254, -1886, 1128, -10056, -11858, -9288, -14665, 5617, 16560, 21741, 17538, 15411, 26820, 25749, 35186, 32059, 19325, 17841, 17244, 11675, 11646, -2937, -8111, 3264, -10335, -5981, -10526, -19661, 3113, 19969, 26794, 23802, 8694, 2335, 5102, 22033, 17151, 5559, 462, 285, -14822, -10759, 4551, -15050, -19446, -24972, -18390, -34028, -28454, -30371, -32563, -32817, -34270, -7285, 12527, -2154, -7958, -12573, -8482, -4910, 459, -17653, -18981, -36994, -16433, 2186, 8123, 4731, -13458, 8325]
4466H325L584q649J996k5058m148K7723m850q251N680L252k3557J532k0362M733
4452c8050L2392J0345O242o643m744J330m170J1896K243P905Q191j2693j6599
4439b355k28J3151n793n508j0058j9094q440R657J3672J2735P777J84j3993j8688
4425b6981j3802L698K4689J9607n229J6624J3319k4733j7170l068j1988J9075
4413e959n446R357P085Q826O283M426j0714k36p700J8247N582p325j0145j5296
4399c015k4060j945J6971Q229j992J1151P710j2084j7268j0372M334l538Q850
4386a7029K0968O807Q707m845n784k159K3428j0377j3605k411m738q169l213j1178
4372b3598j7309N958J641o982Q99J7506J7354o290j2687P467O418j6723j0984
$$ y = [8325, 11909, 3260, 5256, -19802, -23950, 3773, -1077, -9328, -3648, -396, -23953, -22421, -42783, -38050, -5658, 4687, 10929, 4286, -458, 872, -3298, 8598, 10841, 18746, 26937, 14244, -2355, -2583, 10568, 4775, -733, -10791, -29885, -38325, -28668, -14996, -2261, 5516, 5700, -8293, -26981, -40783, -37085, -12396, 7211, 1982, 18606, 31925, 7192, -9978, -13046, -25034, -5959, -11405, -2048, 5037, 13863, 20146, 24572, 13858, 13622, 5922, 24169, 29751, 22426, 12281, -3015, -27075, -29020, -12049, -3820, -5812, 5339, 13049, 965, -16303, -26675, -22341, -25879, -17029, 3939, 10746, 19453, 14608, 8824, 6665, 30093, 19716, 6111, 3700, -1038, -9207, -12420, -23598, -40907, -34949, -33308, -40290, -39391, -21885, -4531, -10821, -23508, -16041, -9623, -26346, -37330]
4359c7330L786q79r644n12Q830J1205Q457m270k3080R875K4457J0452q38p876
4345g367n15J2941O59r597P942m457p025P54L0002O002k1837K462J1230j7636
4331C558j575j3162M867N164j0854k70K877P207n00r766j4882j522J0799L20J7116
4316f23K1337O008j1652j8697j1726R848p101K09P196N363J8872J2315r27j5443
4302A4979j6626j9525J2625j8431l717L668l42J9487m03Q740L020o055L216j310
4288f74j1765p575N419J3538l554r513Q895k175m170j52L030j2725O901P703j0588
4273a7405j994R91N993J6815J3024p73o305j3472m093n869P417J4557r236n362
4259e712p18j0034o907J85P62J4132J3097m135r485K453J1918Q755l00o536j0510
$$ y = [-37330, -33544, -34423, -44067, -44579, -35749, -24544, -16087, -20357, -43437, -33562, -9105, 1347, 509, -7367, -7882, 5059, 5718, -3879, 4063, -394, -7419, -6665, 23337, 29339, 7502, 9964, 21194, 3558, 1983, -11179, -6312, -1148, -12002, -12272, -9395, -2188, -2688, -12454, -27336, -28858, -18059, -17739, -623, 20714, 26722, 15070, -3627, -15353, -5505, -12606, -12397, -5201, 162, 19034, 31349, 30422, 14979, -1647, -21172, -8547, -26978, -30695, -27027, -27369, -7882, -8285, 455, 3475, -2580, 636, -674, -12439, -20014, -14595, -1057, -4611, -14124, -5229, -7404, -11574, -11726, -8696, -21421, -14520, -6817, -17405, -19399, -18408, -12415, 4400, 17424, 16651, 10346, -3126, -7219, -13088, -5671, 8886, -350, -5712, -6430, -16464, -23371, -23186, -22424, -8292, 4805, 670, -8815, -6362, 5556, 14311, 14011, 7475, -3035]
4244c035l256k855k174J1345l420K996l430J2581L697k7483k0174K0036l162L576
4230a4758J3566m399P712K4260k0234k2004n823L585l1L998L079j7115N502J1869
4216a0793M889P29m121q71O869m002p258k648j5513J3641J1668j3550L858Q528
4202h574j0550P243K0705N343K2226J2442j7312j4530j0141l084o993p684J577
4189i332O772k1928j9819m629J0987J7234J4793R439J2149J6829M398p381p752
4176B1760N405r15J3046R27p717j2587j3597N467O356Q414o763j5387j1486M026
4162c051K0983O918q93M561q835o881k497K363j8274p671N861r761J4897P814
4148E534m835J2051o164k6353M153M245m761J1138J2150R754Q550j0933K577p416
$$ y = [-3035, -6291, -9146, -11320, 25, -3395, -399, -3829, 8752, 12449, -15034, -35208, -15172, -18334, -14758, -1192, -5591, 2121, 26381, 6147, -15857, -21680, -18095, -18126, -14128, -11049, -28164, -22662, -10793, -5904, -5175, -9296, -10167, -3298, -7300, -14558, -17206, -32719, -19078, -7410, -20960, -17102, -8574, -19124, -11881, 8824, 14167, 36393, 48835, 31523, 16993, 6852, 3768, -3225, -10909, -9332, -2560, -24488, -44307, -48936, -37949, -20715, -5922, 3517, 15666, 32495, 36893, 29512, 21760, 27165, 26250, 39296, 40223, 32506, 19919, 6322, 11789, 18145, 26559, 19796, 4409, -7077, -3051, 17932, 24850, 23957, 28518, 19683, 12802, 10305, 12668, -5606, -13277, -7416, -17177, -2280, 5534, 699, 12750, 6586, -19767, -15614, -11369, -16130, -4992, 7158, 16912, 25462, 14529, 17106, 9690]
4134I690j1406q185L1533r36j7158j5390j4251K6351L5058n583k4964k3286o952
4121b5479M606q98Q888K720o652j6403L444k665J9984R924j2344j2021j0359O535
4107c0720Q223j2609N947K8032j0946j6458K4268o299j095l957L714N531J2087
4094E718q415q58K321N799L491J1559k658j030Q443k3P788k0303j4077J530L578
4079B863J1736J0474j951n77Q42j8804j6772o16j702j3782k046K139M149N660
4065a8387Q970K305P515J791O839k378O427J4812j6692k8339l018M253N029j0685
4051b1558l716K747n331K398J3088L425Q732K2397Q395k2918j3695O380J1528
4038A1872P1l1866r025J0928J6172r210K937N392Q444r140m604J3921K0093K528
$$ y = [9690, -1716, -9901, 21632, 20696, 3538, -11852, -26103, 248, 35306, 29723, 4759, -18527, -25479, -20873, -21771, -12883, -10163, -16815, -33218, -29774, -32439, -12455, -2531, -14875, -26896, -37255, -30720, -22497, -35106, -29159, -1127, -12073, -28531, -4263, -10562, -11657, -15614, -11900, -6369, 5718, -2697, -3555, -1234, 4565, 8056, 19615, 16957, 15927, 24370, 24347, 32135, 11832, -2245, -715, 2863, 14599, 25073, 23122, 22545, 23387, 4583, -12189, -12805, -14507, -28289, -30335, -28196, -24047, -18387, -9417, -7112, 403, 2194, 9033, 6655, 13082, 27894, 11202, -17137, -20155, -15902, -10873, -21558, -25274, -22527, -27858, -25460, -12372, -8947, -215, 22182, 30577, 7659, -6036, 344, 11872, 11943, -19923, -28948, -18020, -1848, -11058, -8121, -2729, 5715, -3425, -8029, 5892, 25985, 28513]
4024B8513Q181l4716k8116o700J6833P632j2085P12L1977O886j1605j7914j034
4011a1436r684j3769M411j442j5158m648L2936K0818j3361k4976L017O409K2719
3998d164O120M50M882L006j8023n652J4215j3823j9186L628J3764k145j397J5551
3984b774m002o090l513R869O426K978k2934M76N616j958j253K1963k134n799j1664
3969a4793M344P429n731K6708r745j8940L234K0261N916r095l3j0906j7360P313
3955a1398p828q023p239r797o987J8485K0168p11K389m698K320M112L083q149
3941a4273O031l777n222j6348O961j2697p958O878J5519P375j353p23J2010M229
3927c348P865J842j6905j7992o679q711K1844R447R530j6142j1725n131O915P913
$$ y = [28513, 36694, 1978, -26138, -32838, -16005, -8373, -20458, -19746, 12231, 19117, 7512, -10402, -11436, -21120, -34889, -30478, -31920, -47078, -51726, -18790, 2028, -11333, -36309, -33292, -26883, -4164, 1956, 2406, 7288, 10294, -7729, -13381, 834, -12989, -32175, -28547, -14783, -16928, -18325, -2774, -6776, -12866, -16379, -6510, -84, 2894, -20040, -19564, -13948, -15906, -17159, 4804, 2670, -3129, -14793, -10449, -3020, -8751, 17957, 8212, -10728, -7494, 12767, 18683, 9588, 9555, -1351, -18711, -11398, -19226, -27249, -34488, -44285, -51272, -32787, -12619, -13330, -10941, -15639, -13319, -9207, -6124, -14273, -8242, -12019, -17241, -33589, -26628, -39325, -47283, -40405, -24886, -17511, -18864, -19587, -7577, -3348, 4517, 6359, -10546, -28538, -35217, -43928, -22084, -12637, -3107, -19249, -30974, -36105, -29190, -21277]
3913b1277J1825q959j5524q759M257j1374J3675Q605Q338K1674K127k0105L21
3900a5176J3652J4717k182k5505j4884J6470P046j0374K479J0355P301N50j2102
3887g653p478J825J103n527K4509K812j0954j7473j5083o251R763J8294J6675
3874D562K403j0919m526P339L25L315M479J1982J9560M655r175k4663q577j1735
3860a0975k1554r358J7395r937j3281K427K029K8001P788p287J7777p681N262
3847F06L353k5498j1812J8777m193P630J3349L368l207p66l275l223j7755r642
3833c2288O923K303M591l907N667L669N801J1103j0919p994J1762J554j0393J653
3819a0475k0346J1340P116r073J4724L266q813L226j0437J805M654j4452j6635
$$ y = [-21277, -9452, -18411, -33935, -42694, -38437, -49811, -36136, -27531, -19193, 2481, 4608, -15497, -15176, -1524, 13193, 11011, -14494, -29378, -12908, -5862, -16236, -13757, -3402, 3899, 4449, -7653, -15131, -13306, -12203, -17730, 6779, 9591, -1363, -18836, -33919, -40170, -30407, -12113, 4562, 6965, -3954, -8480, -1141, -816, 2499, 6978, 18960, 38520, 43175, 34000, 9337, 760, -10975, -32529, -41887, -24492, -34429, -47710, -45283, -43254, -15253, -7465, -14752, 3025, -4656, 606, 3959, -21539, -33351, -14574, -18767, -11137, 2212, 5580, 2373, 1607, -1668, -4891, -22646, -32288, -25365, -23062, -18471, -22378, -16711, -13042, -7241, 3862, -7057, -15051, -3289, -1735, -12128, -10475, -30821, -19481, -12365, -21438, -6714, -3448, -12261, -9035, -19472, -17667, -13013, -27465, -44100]
3806d4100J6817j262L652J5347Q994Q524O970J1128k1932n049j829l875l795M922
3792e488j6626j2940K3208R789k0341m360J27K0112r356j2108M037K991J4048
3779f907k2417j2573R981j4323J6778K2498J9233K257j2440k283n517R80n768
3766a0501K581J8899J058j1119p361q908P243R000j283j4030N679J3971j0839
3753e610k407J1235J036J9212K616j3350n447n84j0255k1652L293J2470J4178
3740D735j0144j7285k480j7352J2164p510k293K0607K5748J1748p715j8555j616
3727i948K214J9538Q751j143J4501o497l259j4683j5442K28M325P634k715j3956
3713a0452j8912R077K059m407Q50O922o631o493J0622N771J3961L032L482P483
$$ y = [-44100, -27283, -28545, -24893, -9546, -552, 7972, 14942, 26070, 4138, -911, -2740, -6615, -10410, -5488, -22114, -35054, -11846, -2057, -22398, -26758, -26631, -6519, -15875, -27983, -23946, -20955, -6907, -29324, -41897, -31916, -46239, -29461, -6963, 12270, 14527, 2087, -196, -5713, -4733, -10501, -7920, 10979, 12037, 918, -6443, -15351, -8108, 892, -391, -14421, -8742, 5229, -5610, -8017, 3218, 4254, 23466, 26082, 12732, 7285, 6701, -3554, -25206, -21913, -9443, 4735, -5409, -22694, -25174, -42526, -30362, -37872, -40165, -19558, 6190, 17938, 10223, -8332, -9948, -7734, 11804, 20555, 19412, 33913, 27416, 24157, 9474, -5968, -5740, -1415, 6219, 3504, -10452, -29364, -20287, -18228, -22635, -21785, -14863, -21494, -27987, -17365, -11594, 2367, 5399, 8881, 16364]
3699A6364j3055j6070n30K913J978Q075N334m172p124j829j0556O695J2972q796
3685g801j0029k706K266J7560P940J3971J0806r6j2600j6241J1726J807q95j5731
3671b3o374q72J5675R315k2328p950p517J5759q67J0109L834J7698l043j7120
3657F296m661n201J792L979j222o073R04n222p054r69M594j494N181J3020n04
3642C366J5010Q736k866k3607k2970l532J008J9277Q86O200N262j3441l796J468
3628h999L291l245P430J3602L101n847j248P754q60l537r305j4053j2762o613
3614c1291J1349O950k033L792k530k892N5j3600J8979K8025l055j3412K966M266
3600G569k5k4865n420J3531m416j1873K2794J7144r224K756j4359j8343M681K29
$$ y = [16364, 3309, -12761, -13291, -10378, -8400, -325, 5009, 837, -6287, -8116, -18672, -11977, 995, -7801, -17830, -20536, -18270, -710, 7230, 21201, 32007, 31911, 19311, 3070, 14796, 16603, 15708, -23, -6397, -7269, 8406, 17721, -4607, -12557, -20074, -4315, -5182, 4927, 8761, 26459, 23416, 6296, 1635, -3566, -1774, 2205, 983, -5090, -4186, -9408, -16462, -17431, -12837, -14331, -9150, 3870, 3366, 18376, 27112, 24246, 639, -22331, -25863, -24855, -5578, -4692, 1508, 6770, -6671, -10467, -8999, -5708, -8953, -1523, 12079, 15180, 9333, 8085, 15839, 14979, 11442, 2137, -11916, -24678, -31291, -19942, -12992, -15025, -11233, -13763, -16655, -16600, -30200, -11221, 16804, 13749, 337, 3303, 7569, 7544, -17321, -22741, -9210, -13626, -25499, -2705, 14439, 5215, 7971, -6388, -24731, -20050, -19821]
3586a9821R493j7773j0465O917J3160K5408J3393p838j2597p633P8N879J925p542
3572g416J106j1292J3928J4056J3885j395j4057k6008n248K687J3472J4143q748
3559h87j1602K458l673j32q482o220K0245K1169l973l901k1757J3369O315j704
3545A225q999N921q469n12J9787J4157M814j4777l527k6077J49J7747O077J3839
3531B1355q40j7808m616J4979n546k5254J7186R574m383K551M371n122q087l594
3517e234Q721K0801N469M737M957j8173R665r068j3577r448j4093j0538K2322
3504c459J2995j3511K206l213q065J658J013L758P182M530Q019j0462j2796q727
3490a8872l424L562K113j0711k192m397j001J016J4612M364J7205K2463j4803
$$ y = [-19821, -10328, -28101, -38566, -31649, -18489, 6919, 20312, 12474, -123, -7756, -7678, -1799, 126, -7416, -6310, -17602, -3674, 10382, 24267, 22872, 8815, -17193, -22441, -19754, -6282, 7861, -887, -12489, -10031, -13704, -13836, -22318, -28538, -8293, 12876, 8903, 5002, -16755, -3386, 2929, 1225, -7774, -1853, -10322, -10834, 8953, 23110, 27924, 13147, 9620, -16457, -16308, 1439, 7516, 21355, 20515, 2707, -1909, 13070, 7524, -17730, -544, 9030, 4647, 7198, 11569, 6447, -1640, -5234, 3487, 24288, 29757, 34494, 39451, 21278, 30943, 21875, 8298, -1150, -15243, -25781, -3459, 9536, -3975, -1769, -4982, -13047, -11389, -10376, -6618, 564, 5094, 13113, 2651, -10145, -18872, -22296, -18734, -16621, -27332, -29524, -33921, -34922, -33906, -19294, -14930, 2275, 24738, 9935]
3477I935J2634M372O482j7780K357j0222j8251o241m853P810Q337J1976M0l822
3463B774Q049J3049m203j951M98j3311O238l198k2323Q975o118J1020K735n560
3449c326K2134J4327p934o993m330J4o839K662J7556q518j3737k7586k0620L986
3435c9204K0726L125j4956j4469O596m868L175Q464J6096m079J475j9109m565
3422d1593K6816K6571J4027N566j2616l235J499l197j6611m614J2488L13k9264
3409b3850p493J0772o04l97P230j5705J754Q444P505J7129j619M838R133j496
3395A5641p854P784n47j0814k4421j952K569J7605K3854K4936j7394j1404j6899
3382A104j9969j0337K6050J2516o474R477n483k0801l565l861j8498K1457K4212
$$ y = [9935, 22569, 26941, 33423, 15643, 18000, 7778, -10473, -16714, -21567, -13757, -5420, 6556, 6596, 2774, 10823, 23872, 19669, 17718, 18216, 4905, 11143, 7945, -14378, -5403, -11521, -501, 2234, -3326, 18808, 33135, 25201, 18208, 13878, 13892, 7053, 9715, 27271, 18753, 5016, -22570, -43190, -39204, -18478, -15353, -30309, -44778, -38182, -43050, -39875, -31411, -15315, -19394, -17919, -37028, -41593, -14777, 11794, 25821, 31387, 18771, 15536, 17035, 13838, -2773, -7387, 5101, 5414, -23850, -31343, -20571, -21175, -21572, -14342, -30047, -28293, -19849, -12344, 4785, 3166, 8004, 17137, 15641, 7787, 15571, 15024, 4210, -20211, -22163, -19594, -1989, 21865, 46801, 29407, 18003, 1104, -18865, -29202, -3152, 9364, 2890, 12367, 6884, -13917, -17482, -21343, -39841, -18384, 5828]
3369E828M35q991l766M611Q323J766j5350l077J3437J0569k838j435j2294R224
3355F442O923j6073j3711P491p422Q077L418J0520Q545j6548o930j6985m406M201
3341b6458J0623J5168j0845J922J1124N71K945j6308J0140P782j7358j6618J6213
3328a1099R276P02K655J077J5176P42r563j4437m223l250j0009K9K229p007J2317
3313a5385K2579K630n020q492r966q746j5964J43j950l642J0329K7873J8271J218
3299A3878O93l656M660p845o713J1246J2649l8133N164P2j0295J2830q422j5333
3285b9205L704m44m271J9634K2148J7532j939j0048j0215Q722l815k9334M685
3272a2846J3148P405q59p821j6303L70K9792J1038r003n315j0062J821p30m249
$$ y = [5828, 6263, -2728, -6494, -1883, 6440, 8206, -7144, -10221, 3216, 13785, 10947, 9512, -2782, 6442, 13365, -2708, -16419, -8928, -16350, -8273, -4855, 5665, 14210, -2338, -9268, -26253, -30659, -26458, -15835, -667, -11512, -9590, 1534, 2105, 5050, -11258, -1118, 6664, -10694, -27312, -11099, -1823, -1121, 1534, 2611, 17787, 18529, 8966, -5471, -9694, -12944, -22953, -22924, -20695, -27702, -15385, 7194, 9824, 4804, -3688, -13654, -22400, -38364, -38221, -40171, -43813, -33484, -5611, 12660, 13878, 14571, 10915, 15575, 7730, 1017, 12263, 24912, -13221, -8057, -7985, -18280, -5450, -13872, -29205, -25501, -25945, -30216, -10582, 11566, 29098, 27159, 17111, 6896, 15618, 11803, -17531, -12846, 302, 7707, 6848, -973, -17276, -16906, 12886, 23924, 14921, 9606, -456, 1365, 635, -3614]
3258c614p751J37l647r213J906J1637R249J1424n907N018j9904q782J4056r960
3244a5351J0926O959k137k0279J3383L6133M161N893q023k318p772k695q715p26
3230I439N021q956q947j90J0458J2589J0086L232j6196j4647l669J2574J2818
3217B3612J925M213M161j6785j2458p981Q247j66p400l21K400j7214N141P110
3203e516r87N817L614m071k452j1129j0988J0414K5923K859r461Q786k6514K66
3189a3439J8472J773p556j052R893J5338j79k895N485j1076o922q813j5990k6548
3175d3509K0560R573j0917o698K2555j842j0173J5904K5977J8195j2042m032l28
3162B3223o454l646j9242j3386J0255R402k857l19o969K4184J3414k138l099n57
$$ y = [-3614, -11365, -11228, -14875, -24088, -22182, -10545, -1296, 10128, 4221, 9239, -10665, -19447, -5391, -15351, -4425, 2534, 397, -19882, -6499, 29634, 33795, 39688, 31665, 29347, 21575, 18880, 10165, 9439, 14460, 5504, -3443, -3633, 6825, 19414, 29500, 32732, 16536, 1889, -1780, 10794, 23612, 25537, 29750, 33911, 17126, 4668, -3313, 4934, 4768, -2632, -2953, -553, -17767, -12626, -5516, -6503, -686, 2928, -1143, -3595, -14724, -25712, -15298, 10625, 13484, 4023, 12809, -13705, -13439, 5033, 6806, -750, -1802, 8091, 23429, 23250, 20355, 25840, 14764, 7842, -971, -16961, -43509, -22949, -13376, -24293, -30991, -8436, -10278, -20451, -4547, 21430, 39625, 27583, 23551, 23223, 16769, 13123, -6119, -19505, -9250, 152, -2705, -3024, -9993, 14191, 27605, 25467, 22368, 21811]
3148B1811j0244p62m540P895j7356q950J8526J128j0618k243j0066L097R914K5939
3134B3531J717k6336q663P755J6675j848j7252l656J4676R993J765n048J0349
3121B3658k143k5042j7423Q218r89j6633l092J8470k588J0371M506J3481k0410
3108i616r320J045P917P69J4254Q120k454j8568l875j2343Q145J1147k192J0095
3094C124R454Q537J754l564k4416k0601n993J6431K5931J2917P800q907n933n894
3080A0640K915j5897j2364O871N455N852J6040L251L669l536k1237Q552P897k0930
3066b822M19O369O418K2135j987n764r650L065n203n114O898R933j917o520K774
3051A9034J0001J2330j2483m522m864m973j4570j9907J0681J7602J3776O476q542
$$ y = [21811, 11567, 10805, 6265, 14160, -3196, -12146, 6380, 7508, -3110, -5353, -15419, -12322, -2408, 23531, 25248, -1088, -9751, -1996, 14679, 12831, -4421, -8077, 6599, 16592, 18357, 13309, 23658, 21515, -3527, -20950, -12732, -13721, -30354, -33446, -14976, -17564, -7193, -2687, 10794, -9616, -18936, -17891, -9974, -9205, 5049, 13169, 10715, -7853, -11728, -24071, -15926, -4779, -6971, 3124, 12578, 21115, 22869, 19305, -5111, -25712, -31705, -15274, 10657, 23574, 31374, 22467, 16534, 10640, 13555, -2342, -14706, -7835, -2380, 3472, 19512, 22763, 26432, 22896, 1659, 10211, 18108, -2822, -2403, 3966, 10384, 32519, 30532, 24768, 15118, 18183, 12980, 7866, 14764, 24697, 22780, 16260, 19034, 29035, 41365, 28882, 24360, 19496, 14523, -47, -19954, -9273, 8329, 22105, 28581, 20039]
3038B0039p552N613J0324n881k9283M438O020j644q744l805R293l503n284j0273
3024b0242p727R088J1479O183R601J4270P232j694M98j2997k0455j6095J1839
3011i020L413J8633K201p649q981J668P661K825p613o266r856k904K4649N502
2997A4263M784k2325k3590M876l820L0j3000n645K3591K2817K584N148J2133J5539
2983C7385r022Q61j1227n77K310k054o596l656l375M158j7090j7041j7008o97
2969d3629J2479Q774n91J5984J1995L493Q733k4294r077O938l466O51K1552j007
2955H535m062o886M412p561p460R717o381N359J148m599j3710J3907k66J4033
2941F186j3938j9743R459J9846q596j3167j3180j0114M904M685l206K0366J1563
$$ y = [20039, 12487, 18100, 28424, 22543, -6740, -2302, 3718, 2074, -6670, -10475, -1182, -4685, -9969, -20242, -27969, -18881, -7402, -1219, 8382, 22652, 29884, 28190, 28688, 15691, -4764, -20859, -9020, -5607, 13026, 15227, 7578, -1403, 265, 7926, 10751, 3138, -3128, -12984, -15888, 8761, 14263, 19047, -3278, -26868, -21992, -25812, -25782, -38782, -44427, -20836, 1981, 4565, 9713, 21846, 37385, 28363, 29224, 17997, 17420, 19730, 17676, 11080, 7424, 4049, 8207, -8883, -25924, -42932, -43629, -31150, -22376, -22967, -6983, 5012, 8505, 17238, -7056, -16133, -9195, -12661, -12010, 9542, 8535, 4473, -2413, 1999, -5562, -13022, -3305, -9686, -4327, -3179, -7778, -21488, -7581, -7847, 6186, -7752, -27495, -18036, 1810, -6786, -19953, -33133, -43247, -38343, -33658, -36864, -16498, -4935]
2928d935r028Q503J3429j6589j25j721j2040J5079J6271j4738j6497j3022R238
2915b6175J0980N412k011L933l933J6121J8271m239l515m237K1522k3002j5830
2902f703n359m5J1980O902P014O274r331O48Q835r993k6962o828J3523P628P870
2887E453j081j5157j0515J1390q89J515J5863n478J564k976l0K659N526Q195K988
2872A9027j1354j4088r898J621J9387l985J8126Q195j6779j0789M735J4864M824
2859B3886L527j63j4790q324J991j902M268J871j3516r494Q531J1887k04m209
2845C359j151m04n752M82J2625P114J7003Q177p239o854q652j5548j6078J301
2831a1617O002P291P268Q54p900n337O408J048j9808M104l440N875q375K471P061
$$ y = [-4935, -13963, -5460, 7969, -8620, -8745, -10466, -22506, -7427, 8844, -5894, -22391, -35413, -26175, -15195, -9783, -11794, -7861, -11794, 4327, 22598, 18359, 14844, 10607, 32129, 9127, -6703, -12062, -12107, -127, 6775, 13789, 20063, 10732, 11380, 20215, 10222, -16740, -23568, -10045, -2417, 5453, 4372, -10785, -21300, -9910, -10799, -9284, 6579, 1101, 2665, -311, -341, 2318, 7844, 16039, 19027, 7673, -6415, -16313, -14692, 4695, 710, 18836, 27031, 10252, -537, 4198, 19062, 23886, 27413, 27250, 12460, 4136, 6127, 4225, 8493, 10364, -3152, -12646, -4115, 7772, 7568, 3359, 2208, 1804, -3948, -3466, 9159, 16273, 33276, 41453, 34214, 27360, 18708, 3160, -12918, -11617, -5615, 1676, 8944, 9798, 1898, -3439, 2969, 4017, -15791, -11687, -15127, -9252, -17627, -15156, -8095]
2816h095j2136M046K792J3272j2723k725J1636l702j7986K3906Q099j0774j9782
2803b4172l183J3888J2724L679K336J4427p486j939K546O472M810j4021k2126
2790a2045j2631M613K0357J9166m630n638l629O344J1344O836R99J4132l5480
2777I738r826J654j198M74K846n447J013j5782k581J4932J0466p932P756P699
2763A3812q6p575j1952j3525J579j5031J20j39K0188J5004r757k246L859J0422
2749D673J7342k785j6873j1867j3542J467K0843p135j7648J4147J1367Q796r510
2736g25j3789j6803j7231J3105J9274m883Q146L1594M488k234l227j6092r541
2723g918K1635j0409k6179O295J0729j725n356M017l906J318J2446p639j8665
$$ y = [-8095, -20231, -16185, -13393, -121, -12844, -15569, -3933, -7635, -25621, -1715, 6384, -4390, -24172, -27355, -13467, -743, 2936, 5272, 19699, 12213, 10274, 12820, 19292, 24102, 10081, -12045, -24676, -20063, 294, 19460, 14830, 9192, 5563, 11907, 23251, 30087, 31086, 45218, 9738, -88, 1566, 368, 842, 3688, -1759, -746, -16528, -19109, -4177, 6289, -1643, 6113, 13812, 13726, 6151, -5801, -19326, -17747, -32778, -32658, -32797, -12609, 2395, -7362, -9608, -5749, 4673, 22015, 19230, 2357, -9510, -23052, -21585, -742, -7877, -25525, -11378, -11, 8785, -725, -14514, -31317, -48548, -35443, -16169, -21052, -12906, 18688, 23176, 20942, 17715, 1623, -7918, 13717, 3308, -22871, -16576, -5847, -7572, -12928, -8911, -12817, -11499, 947, -6692, -25357]
2710b5357l839l149p003J0220o861L681J1952j1096L032j6378P156K8010j551
2697a1183J401O112j4790R530L922k3136L276K6548J2260m655O341k4074q91n976
2683a5315j4552K862K9610J5600J344k400O7j2035j5230j6326n463J3754P183
2670a0901N919m376o508o743j2242J300J2237o265M556L105J0306l606R050M669
2656E01P416R935l028j5002p010r206J7137J8244j3583Q814J6354j6572m312K848
2642A2536J254j2803l119k242P044l568n456R231J3228J578J0704O254j4167j2081
2628H393j0777M217Q012q181N673N438j7163j5003K401N138m837j0973P364M640
2614a5658j152L475o254K528L106K19N556J3006P867J6329J803k8667j1620j5830
$$ y = [-25357, -29196, -32345, -39348, -29128, -35989, -32308, -20356, -31452, -28420, -44798, -37642, -9632, -11183, -9782, -3670, -18460, -8930, -5008, -28144, -24868, 1680, 13940, 9285, 15626, -8448, -9339, -15315, -29867, -27005, 2605, 18205, 19549, 17149, 17216, 5181, -10049, -26375, -31838, -18084, -10901, -4982, -9358, -15866, -22609, -34851, -33551, -21314, -27579, -23023, -19918, -9612, -13218, -4168, 501, 7917, 17852, 14824, -178, -7188, -16394, 743, 18987, 5404, 14218, 30572, 14000, 9688, 12536, 13790, 987, -2132, -4374, 2670, -898, -6354, 2877, 16105, 17683, 28387, 34641, 20474, 8393, -2384, 1833, 9845, 1664, 7337, 12775, -4388, -19391, -16990, -11852, -16689, -27662, -20298, -15658, -16810, -13335, -19589, -17061, -13955, -13736, -8180, 4826, 12693, 29022, 30825, 2158, -9462, -25292]
2600b5292n71l202J4948K4427P968k981r154L114Q719j574n420J2651o687r679
2586G267m52k631n069P997l427k0646j918K5959j0854k2022j861J4669K1526R045
2572A7583Q704k2823j4503K768N151J715j4169O329J7935j1779l917N396j4486
$$ y = [-25292, -25863, -29065, -14117, 10310, 18278, 15297, 6143, 9257, 17976, 16402, 10982, 23633, 16946, 7267, 6815, 4184, -885, 7112, 3685, -16961, -18879, 7080, -3774, -25796, -27657, -12988, 8538, 17583, 26287, 3464, -11039, -8271, -3120, -1405, -15574, -9245, 8690, -3089, -7006, -1610, -16096]
$$ [...]
##END NTUPLES=NMR SPECTRUM
##END=
