##TITLE=Analysis number 328700
Compound Code cc 35913
Project Code adrs
Chemist Name ugmt
##JCAMPDX= 6.0         $$ Bruker NMR JCAMP-DX V2.0
##DATA TYPE= NMR SPECTRUM
##DATA CLASS= NTUPLES
##ORIGIN= Bruker BioSpin GmbH
##OWNER= nmr
$$ XWIN-NMR		Version 3.5
$$ Wed Jun 27 10:00:58 2007 GMT Daylight Time (UT+1h)  MAYBRIDGE\nmr@NMR_250MHZ
##.OBSERVE FREQUENCY= 250.131544655141
##.OBSERVE NUCLEUS= ^1H
##.ACQUISITION MODE= SIMULTANEOUS (DQD)
##.ACQUISITION SCHEME= undefined
##.AVERAGES= 16
##.DIGITISER RES= 18
##SPECTROMETER/DATA SYSTEM= dpx250
##.PULSE SEQUENCE= zg30
##.SOLVENT NAME= CDCl3
##.SHIFT REFERENCE= (INTERNAL, CDCl3, 0, 16.522)
##AUDIT TRAIL= $$ (NUMBER, WHEN, WHO, WHERE, WHAT)
$$ ##TITLE= Audit trail, XWIN-NMR		Version 3.5
$$ ##JCAMPDX= 5.01
$$ ##ORIGIN= Bruker BioSpin GmbH
$$ ##OWNER= nmr
$$ C:\u/data/dgb/nmr/ADRS/2070/pdata/1/auditp.txt
$$ ##AUDIT TRAIL=  $$ (NUMBER, WHEN, WHO, WHERE, WHAT)
(   1,<2007-06-27 10:00:31.67 +100>,<MAYBRIDGE\nmr>,<NMR_250MHZ>,
      <created by zg, POWCHK disabled, PULCHK disabled
       configuration hash MD5:
       76 6E 9A 78 1E 09 19 81 EC 84 63 8F B0 6A 59 2D
       data hash MD5: 64K
       3F AE A0 A5 39 A5 A9 E7 7D AC B5 61 6B 8C B0 0D>)
(   2,<2007-06-27 10:00:45.40 +100>,<MAYBRIDGE\nmr>,<NMR_250MHZ>,
      <Start of raw data processing
       ef LB = 0.3 FT_mod = 6 PKNL = 1 SI = 32K 
       data hash MD5: 32K
       20 24 CE 33 53 53 0E 03 90 2E 27 F0 5F F0 FF FA>)
(   3,<2007-06-27 10:00:47.71 +100>,<MAYBRIDGE\nmr>,<NMR_250MHZ>,
      <apk 
       data hash MD5: 32K
       E8 29 43 B4 D7 53 6E 64 AB 43 A3 22 02 95 F1 41>)
(   4,<2007-06-27 10:00:48.46 +100>,<MAYBRIDGE\nmr>,<NMR_250MHZ>,
      <abs ABSG = 5 
       data hash MD5: 32K
       5A 11 E7 15 85 DB 36 C1 3E 8D 34 44 24 26 4D F3>)
$$ ##END=
$$ 
$$ hash MD5
$$ 6F 3B B0 01 C4 8D 25 AD 1F 2B 69 31 9E 26 74 9E
##$RELAX= 
##$RELAX= 
##$RELAX= 
##$RELAX= 
##$RELAX= 
##$RELAX= 
##$RELAX= 
$$ Bruker specific parameters
$$ --------------------------
##$DU= <C:\u>
##$EXPNO= 2070
##$NAME= <ADRS>
##$PROCNO= 1
##$TYPE= <nmr>
##$USER= <dgb>
##$AMP= (0..31)
100 100 100 100 100 100 100 100 100 100 100 100 100 100 100 100 100 100 
100 100 100 100 100 100 100 100 100 100 100 100 100 100 
##$AQSEQ= 0
##$AQ_mod= 3
##$AUNM= <au_zg>
##$AUTOPOS= <6 >
##$BF1= 250.13
##$BF2= 250.13
##$BF3= 250.13
##$BF4= 250.13
##$BF5= 500.13
##$BF6= 500.13
##$BF7= 500.13
##$BF8= 500.13
##$BYTORDA= 1
##$CFDGTYP= 0
##$CFRGTYP= 5
##$CHEMSTR= <none>
##$CNST= (0..31)
1 1 145 1 1 1 1 1 1 1 1 1 1 1 1 1 1 1 1 1 1 1 1 1 1 1 1 1 1 1 1 1 
##$CPDPRG= <>
##$CPDPRG1= <>
##$CPDPRG2= <>
##$CPDPRG3= <>
##$CPDPRG4= <mlev>
##$CPDPRG5= <mlev>
##$CPDPRG6= <mlev>
##$CPDPRG7= <mlev>
##$CPDPRG8= <mlev>
##$CPDPRGB= <>
##$CPDPRGT= <>
##$D= (0..31)
0 1 0 0 0 0 0 0 0 0.06 0 0 0 0 0 0 0.0002 0 0 0 0 0 0 0 0 0 0 0 0 0 0 
0 
##$DATE= 1182934830
##$DBL= (0..7)
120 120 120 120 120 120 120 120 
##$DBP= (0..7)
150 150 150 150 150 150 150 150 
##$DBP07= 0
##$DBPNAM0= <>
##$DBPNAM1= <>
##$DBPNAM2= <>
##$DBPNAM3= <>
$$ [...]
##$SUBNAM7= <"">
##$SUBNAM8= <"">
##$SUBNAM9= <"">
##$SW= 20.6930455092707
##$SWIBOX= (0..15)
0 0 3 0 0 0 0 0 0 0 0 0 0 0 0 0 
##$SW_h= 5175.983436853
##$TD= 65536
##$TD0= 1
##$TE= 296.16
##$TE2= 300
##$TE3= 300
##$TEG= 300
##$TL= (0..7)
0 120 120 120 120 120 120 120 
##$TP= (0..7)
150 150 150 150 150 150 150 150 
##$TP07= 0
##$TPNAME0= <>
##$TPNAME1= <>
##$TPNAME2= <>
##$TPNAME3= <>
##$TPNAME4= <>
##$TPNAME5= <>
##$TPNAME6= <>
##$TPNAME7= <>
##$TPOAL= (0..7)
0.5 0.5 0.5 0.5 0.5 0.5 0.5 0.5 
##$TPOFFS= (0..7)
0 0 0 0 0 0 0 0 
##$TUNHIN= 0
##$TUNHOUT= 0
##$TUNXOUT= 0
##$USERA1= <user>
##$USERA2= <user>
##$USERA3= <user>
##$USERA4= <user>
##$USERA5= <user>
##$V9= 5
##$VALIST= <valist>
##$VCLIST= <CCCCCCCCCCCCCCC>
##$VD= 0
##$VDLIST= <DDDDDDDDDDDDDDD>
##$VPLIST= <PPPPPPPPPPPPPPP>
##$VTLIST= <TTTTTTTTTTTTTTT>
##$WBST= 1024
##$WBSW= 4
##$XGAIN= (0..3)
0 0 0 0 
##$XL= 0
##$YL= 0
##$YMAX_a= 369458
##$YMIN_a= -522081
##$ZGOPTNS= <>
##$ZL1= 120
##$ZL2= 120
##$ZL3= 120
##$ZL4= 120
##$ABSF1= 16.522
##$ABSF2= -4.171173
##$ABSG= 5
##$ABSL= 3
##$ALPHA= 0
##$AQORDER= 0
##$ASSFAC= 0
##$ASSFACI= 0
##$ASSFACX= 0
##$ASSWID= 0
##$AUNMP= <proc_1d>
##$AZFE= 0.1
##$AZFW= 0.1
##$BCFW= 0
##$BC_mod= 0
##$BYTORDP= 0
##$COROFFS= 0
##$CY= 12.5
##$DATMOD= 1
##$DC= 0
##$DFILT= <>
##$DTYPP= 0
##$F1P= 14.0000005364418
##$F2P= -0.99999901652339
##$FCOR= 0.5
##$FTSIZE= 32768
##$FT_mod= 6
##$GAMMA= 0
##$GB= 0
##$INTBC= 1
##$INTSCL= 1
##$ISEN= 128
##$LB= 0.3
##$LEV0= 0
##$LPBIN= 0
##$MAXI= 10000
##$MC2= 0
##$MEAN= 0
##$ME_mod= 0
##$MI= 0
##$NCOEF= 0
##$NC_proc= -4
##$NLEV= 6
##$NOISF1= 0
##$NOISF2= 0
##$NSP= 0
##$NTH_PI= 0
##$NZP= 0
##$OFFSET= 16.522
##$PC= 1
##$PHC0= 157.5383
##$PHC1= 5.029769
##$PH_mod= 1
##$PKNL= yes
##$PPARMOD= 0
##$PSCAL= 4
##$PSIGN= 0
##$REVERSE= no
##$SF= 250.13
##$SI= 32768
##$SIGF1= 0
##$SIGF2= 0
##$SINO= 400
##$SIOLD= 32768
##$SREGLST= <1H.CDCl3>
##$SSB= 0
##$STSI= 32768
##$STSR= 0
##$SW_p= 5175.98343685301
##$SYMM= 0
##$S_DEV= 0
##$TDeff= 65536
##$TDoff= 0
##$TI= <Analysis number 999999
Compound Code 99
Book Reference 9
Project Code 9>
##$TILT= no
##$TM1= 0
##$TM2= 0
##$TOPLEV= 0
##$USERP1= <user>
##$USERP2= <user>
##$USERP3= <user>
##$USERP4= <user>
##$USERP5= <user>
##$WDW= 1
##$XDIM= 32768
##$YMAX_p= 548151576
##$YMIN_p= -47610
$$ End of Bruker specific parameters
$$ ---------------------------------
##NTUPLES= NMR SPECTRUM
##VAR_NAME=  FREQUENCY,     SPECTRUM/REAL,   SPECTRUM/IMAG
##SYMBOL=    X,             R,               I
##VAR_TYPE=  INDEPENDENT,   DEPENDENT,       DEPENDENT
##VAR_FORM=  AFFN,          ASDF,            ASDF
##VAR_DIM=   32768,         32768,           32768
##UNITS=     HZ,            ARBITRARY UNITS, ARBITRARY UNITS
##FACTOR=    0.157963299565203, 1,           1
##FIRST=     4132.6476996994, 0,             0
##LAST=      -1043.33573715361, 0,           0
##MIN=       -1043.33573715361, -47610,      0
##MAX=       4132.6476996994, 548151576,     0
$$ Real data points
##PAGE= N=1
##DATA TABLE= (X++(R..R)), XYDATA
$$ [...]
16098d669M251L371j367l51J172M375p63L837l345K715M051P133l635o182o960
$$ -4669 -418 2953 1586 1235 2407 6782 6019 9856 6511 9226 13277 20410 16775 10593 3633
16083C633j1587p083O700n981l791O84q697J2343R971m54k344N034m252L634O592
$$ 3633 -7954 -15037 -8337 -14318 -18109 -17425 -26122 -13779 -3808 -4262 -6606 -1572 -5824 -2190 4402
16068D402K866o200j918l477m313J155M123N259o552N54m317K2M626k376K707
$$ 4402 7268 1068 -850 -4327 -8640 -7485 -3362 1897 -4655 -4101 -8418 -8396 -3770 -6146 -3439
16053c439L68j0168m56M445m15j66J371Q95k857l901K916J069N684J539j261J293
$$ -3439 -3071 -13239 -13695 -9250 -9665 -9831 -8460 -7565 -10422 -14323 -11407 -10338 -4654 -3115 -4376 -3083
16037c083K78k949k939O53m811J851M072M176O684l258K81P04n866M840L743j526
$$ -3083 -2805 -5754 -8693 -8040 -12851 -11000 -6928 -2752 3932 674 955 1659 -4207 633 4376 2850
16021B850j134J418n542O34Q54l423p130M71m46J773q57m264O796L266m088m708
$$ 2850 1716 3134 -2408 -1774 -920 -4343 -11473 -11002 -11448 -9675 -10532 -14796 -8000 -4734 -8822 -13530
16005a3530J842j222N05N723Q046N692J266j983J167m717n089n265k667o707K303
$$ -13530 -11688 -12910 -12405 -6682 1364 7056 8322 6339 7506 2789 -2300 -7565 -10232 -16939 -14636
15990a4636J0176M22J065O37O720k685j2492o31L720p333L31R91k646j989k000
$$ -14636 -4460 -4038 -2973 -2336 4384 1699 -10793 -11424 -7704 -15037 -14706 -13715 -16361 -18350 -20350
15975b0350M092J0907j107j035P550j699l952j938p96N394K746R32k874o337j478
$$ -20350 -16258 -5351 -6458 -7493 57 -1642 -5594 -7532 -8328 -2934 -188 744 -2130 -8467 -9945
15960i945r6l914L681K735K283K656L031m404q736K07J067L957o671o683j153
$$ -9945 -10041 -13955 -10274 -7539 -5256 -2600 431 -3973 -12709 -12502 -11435 -7478 -14149 -20832 -21985
15945b1985jR850n682m301q45p076N169J4196O075n981n286l654k520O89O256
$$ -21985 -21986 -12136 -17818 -22119 -22964 -30040 -24871 -10675 -4600 -10581 -15867 -19521 -22041 -21352 -15096
15930a5096N812K532p273L036o14n695j069P181P068L014L290j536j2635K413
$$ -15096 -9284 -6752 -14025 -10989 -11603 -17298 -18367 -11186 -4118 -1104 2186 650 -11985 -9572
15916i572j923j014J1364N99k39j147j734J564l637J3804n9j979j914j0547O090
$$ -9572 -11495 -12509 -1145 -546 -785 -1932 -3666 -2102 -5739 8065 8006 6027 4113 -6434 -344
15901c44Q292j779n074r934m392K541J0585J580n362q264M527N681m613q211m833
$$ -344 7948 6169 1095 -8839 -13231 -10690 -105 1475 -3887 -12151 -7624 -1943 -6556 -14767 -19600
15886a9600k812M732J2566n49n485k091L367L286R083K470q495j893P819K363
$$ -19600 -22412 -17680 -5114 -5663 -11148 -13239 -9872 -6586 2497 4967 -3528 -5421 2398 4761
15872D761l900n157n625o253J770P662L066k14l680N459O168j228l148K665L561
$$ 4761 861 -4296 -9921 -16174 -14404 -6742 -3676 -3890 -7570 -2111 4057 2829 -319 2346 5907
15857E907k196o798p529o941k552M489L697l803L351l130p82O622j717J778j375
$$ 5907 3711 -3087 -10616 -17557 -20109 -15620 -11923 -15726 -12375 -15505 -16287 -9665 -11382 -9604 -10979
15842a0979o102n735N117P868Q928l026k822j447n898l169L245J0171O436l905
$$ -10979 -17081 -22816 -17699 -9831 -903 -3929 -6751 -8198 -14096 -17265 -14020 -3849 2587 -1318
15828a318l594k14n814j564L439l825k910J525j554J132R002P819m435o917j096
$$ -1318 -4912 -5126 -10940 -12504 -9065 -12890 -15800 -14275 -15829 -14697 -5695 2124 -2311 -9228 -10324
15813a0324M39m867o409k416p03J1888J1973J60p147Mq00r08m870k977j41L607
$$ -10324 -9885 -14752 -21161 -23577 -24280 -12392 -419 -259 -7406 -7402 -8202 -9110 -13980 -16957 -17098 -13491
15797a3491N456K368J080n611k706k6p704k47k731m039P062L205k141P038n838
$$ -13491 -8035 -5667 -4587 -10198 -12904 -12930 -20634 -20881 -23612 -27651 -20589 -17384 -19525 -12487 -18325
15782a8325q255N66J0329M5R88N743J465l14K69m672r952L893N102n09K74q968
$$ -18325 -26580 -26014 -15685 -15640 -14652 -8909 -7444 -7758 -7489 -12161 -22113 -18220 -13118 -13627 -13353 -22321
15766b2321k608m237j24M30k043K722k395m449N155Q623R329N259m499o212K909
$$ -22321 -24929 -29166 -29290 -28860 -30903 -28181 -30576 -35025 -29870 -21247 -11918 -6659 -11158 -17370 -14461
15751a4461N275j414j955r966K040L24k568l226L705k367L027P96m785o105q64
$$ -14461 -9186 -10600 -12555 -22521 -20481 -20157 -22725 -25951 -22246 -24613 -21586 -20790 -25575 -31680 -32544
15736c2544L468R429K982K044N796j53J04p542j3402N221R106K99J993n16l585
$$ -32544 -29076 -19647 -16665 -14621 -8825 -8978 -8874 -16416 -29818 -24597 -15491 -15192 -13199 -13715 -17300
15721a7300k025L154l686o025j73l667M971P472L769M046o694n002R974M338k788
$$ -17300 -19325 -16171 -19857 -25882 -26055 -29722 -24751 -17279 -13510 -9464 -16158 -21160 -11186 -6848 -9636
15706i636o691j0342o794N873M988R37M926K746K345l534o485N66R75J317R2l137
$$ -9636 -16327 -26669 -33463 -27590 -22602 -21665 -16739 -13993 -11648 -15182 -21667 -21101 -20126 -18809 -18717 -21854
15690b1854L947L507O390M686P929N728M831j2572k047L833j254k80m038l818
$$ -21854 -17907 -14400 -8010 -3324 4605 10333 15164 2592 545 4378 3124 2844 -1194 -5012
15676e012n52l413J085m328r268j515R01P56j324m571P438k296J888K571O336
$$ -5012 -5564 -8977 -7892 -12220 -21488 -23003 -22102 -21346 -22670 -27241 -19803 -22099 -20211 -17640 -11304
15661a1304k493j0020k777l637J445L288k804M842O439n892L761q18M378j027
$$ -11304 -13797 -23817 -26594 -30231 -28786 -25498 -28302 -23460 -17021 -22913 -19152 -19970 -15592 -16619
15647a6619j986O664L084N885j175o254j0302k075O249m375j776J644m682K523
$$ -16619 -18605 -11941 -8857 -2972 -4147 -10401 -20703 -22778 -16529 -20904 -22680 -21036 -25718 -23195
15633b3195J1890Q614j269r81p53p940n370K442l360n081J04K483o94N995J192
$$ -23195 -11305 -2691 -3960 -4941 -5694 -13634 -19004 -16562 -19922 -25003 -24899 -22416 -23110 -17115 -15923
15618a5923j870p170n847j906P776J0256J0029n579n406M670l960o168K552K753
$$ -15923 -17793 -24963 -30810 -32716 -24940 -14684 -4655 -10234 -15640 -10970 -14930 -21098 -18546 -15793
15604a5793l690q96r752n289J407M344R393M336k843K347l466k55J216L330n803
$$ -15793 -19483 -20379 -30131 -35420 -34013 -29669 -20276 -15940 -18783 -16436 -19902 -20157 -18941 -15611 -21414
15589b1414j625K983J433k883k46L751K296p918m804M82N16K939M42r3P82j074
$$ -21414 -23039 -20056 -18623 -21506 -21752 -18001 -15705 -23623 -28427 -27945 -27429 -24490 -24048 -24141 -23359 -24433
15573b4433J254M572N6n252J386K295O136o915o286r71L356K257M025J561L659
$$ -24433 -23179 -18607 -18551 -23803 -22417 -20122 -13986 -20901 -27187 -28158 -24802 -22545 -18520 -16959 -13300
15558a3300m677r99N925K066L78j699n188o974l549O472K152m500R263J2646k345
$$ -13300 -17977 -18976 -13051 -10985 -10607 -12306 -17494 -24468 -28017 -21545 -19393 -23893 -14630 -1984 -4329
15543d329q556j4779R67J174n740n359O771M226k81q429O130J6380Q512M222r169
$$ -4329 -12885 -27664 -26697 -25523 -31263 -36622 -29851 -25625 -25906 -34335 -28205 -11825 -3313 909 -8260
15528h260l32j226K242j75L123n174p318q48J4703M408j1633n540M656M334q338
$$ -8260 -8592 -9818 -7576 -7751 -4628 -9802 -17120 -17968 -3265 1143 -10490 -16030 -11374 -7040 -15378
15513a5378o326k877R001j792k197J754n393K623k161R099M451k680n205k264
$$ -15378 -21704 -24581 -15580 -17372 -19569 -17815 -23208 -20585 -22746 -13647 -9196 -11876 -17081 -19345
15499a9345n819k326J810K815k28ok866l962j576M594J2914L559j817N308j615
$$ -19345 -25164 -27490 -25680 -22865 -23093 -23099 -25965 -29927 -31503 -26909 -13995 -10436 -12253 -6945 -8560
15484h560m385k816m728j805j314M389J1140j851O725o869o714l781O458n139
$$ -8560 -12945 -15761 -20489 -22294 -23608 -19219 -8079 -9930 -3205 -10074 -16788 -20569 -14111 -19250
15470a9250k002N596j121n42p768m586M080M198k741J722j92K095L583M586m224
$$ -19250 -21252 -15656 -16777 -17319 -25087 -29673 -25593 -21395 -24136 -22414 -22606 -20511 -16928 -12342 -16566
15455a6566K791o48j747L074O550Q40n435j1886n870N904M773J0544Q294K639
$$ -16566 -13775 -14423 -16170 -13096 -6546 -5706 -11141 -23027 -28897 -22993 -18220 -7676 618 3257
15441C257n756j0389l643R79J342J266l724l023n119k292J043p05o004M354P090
$$ 3257 -2499 -12888 -16531 -15552 -14210 -12944 -16668 -19691 -24810 -27102 -26059 -26764 -32768 -28414 -21324
15426b1324P424N395K311l587j654m725K82J309J702p372j453J18q526O940L613
$$ -21324 -13900 -8505 -6194 -9781 -11435 -16160 -15878 -14569 -12867 -20239 -21692 -21574 -30100 -23160 -19547
15411a9547o933J238M235J208J582j924j203Q829M065l825K049q294p771r46M696
$$ -19547 -26480 -25242 -21007 -19799 -18217 -20141 -21344 -12515 -8450 -12275 -10226 -18520 -26291 -27237 -22541
15396b2541K029L627O179l73j129M39l005o088K176j351j711k012j465m972J295
$$ -22541 -20512 -16885 -10706 -11079 -12208 -11769 -14774 -20862 -18686 -20037 -21748 -23760 -25225 -30197 -28902
15381b8902N830m58j085L49J099L453l309l147M685J420l118N994K486p611O06
$$ -28902 -23072 -23530 -24615 -24266 -23167 -19714 -23023 -26170 -21485 -20065 -23183 -17189 -14703 -22314 -21708
15366b1708L520m306q076q87K495K54O561O012k492j283K48L082K680k956j429
$$ -21708 -18188 -22494 -30570 -31457 -28962 -28708 -22147 -16135 -18627 -19910 -19662 -16580 -13900 -16856 -18285
15351a8285l584J309J096J133N989j140q01J18k228K628j54n837J448Q275J85
$$ -18285 -21869 -20560 -19464 -18331 -12342 -13482 -14283 -14165 -16393 -13765 -13919 -19756 -18308 -10033 -9848
15336i848R78l571J207o718l908O786j113r064r17p2l052L752o544q637N855P206
$$ -9848 -8870 -12441 -11234 -17952 -21860 -15074 -16187 -25251 -26168 -26240 -29292 -25540 -32084 -40721 -34866 -27660
15320b7660L924l2L677O46n537J642P364n076j155o024J444M146K453L506J8Q024
$$ -27660 -23736 -23768 -20091 -19445 -24982 -23340 -15976 -21052 -22207 -28231 -26787 -22641 -20188 -16682 -16664 -8640
15304h640N66p035j757P48r321k216j367l129K160j863k529K014l304J846L218
$$ -8640 -8074 -15109 -16866 -16118 -25439 -27655 -29022 -32151 -29991 -31854 -34383 -32369 -35673 -33827 -30609
15289c0609k710Q06J292N651N29j91K494K919K524l773k514r05O9P191p8K457
$$ -30609 -33319 -32513 -31221 -25570 -25041 -25232 -22738 -19819 -17295 -21068 -23582 -24487 -24418 -17227 -17305 -14848
15273a4848Q69m162J911j328L700p82m897n029l993o063J679P848R791K669K147
$$ -14848 -13979 -18141 -16230 -17558 -13858 -14640 -19537 -24566 -28559 -34622 -32943 -25095 -15304 -12635 -10488
15258a0488J911l87n734p117K347M948m528J601J618p460l674o209J965J0654
$$ -10488 -8577 -8964 -14698 -21815 -19468 -14520 -19048 -17447 -15829 -23289 -26963 -33172 -31207 -20553
15244b0553k819J902M204L346k745p815j856l233P438m2n492l274K338J698Q87
$$ -20553 -23372 -21470 -17266 -13920 -16665 -24480 -26336 -29569 -22131 -22173 -27665 -30939 -28601 -26903 -26016
15229b6016K283M372J0978R431k726p060j2040j114L460M821K431k556q111p458
$$ -26016 -23733 -19361 -8383 1048 -1678 -8738 -20778 -21892 -18432 -13611 -11180 -13736 -21847 -29305
15215b9305n034J0M095J013Q83o384p038K335M063K112M477q9l756l251j972L156
$$ -29305 -34339 -34329 -30234 -29221 -28338 -34722 -41760 -39425 -35362 -33250 -28773 -28862 -32618 -35869 -37841 -34685
15199c4685M98O569M986k390J94o587J453n723m616J60R650K764j601O776K124
$$ -34685 -34187 -27618 -22632 -25022 -24828 -31415 -29962 -35685 -40301 -40141 -30491 -27727 -29328 -22552 -20428
15184b0428m027l12q949M114m34O411N440J296J0400P094o022j4455l223m073
$$ -20428 -24455 -24767 -33716 -29602 -30036 -23625 -18185 -16889 -6489 605 -5417 -19872 -23095 -27168
15170b7168o491l641O301J3164N543p805k708M605P370R956j996p710J350r93
$$ -27168 -33659 -37300 -30999 -17835 -12292 -20097 -22805 -18200 -10830 -874 -2870 -10580 -9230 -10223
15156a0223k356j710L676j873n773L59L97O123r05M189O674K666p678p916P59
$$ -10223 -12579 -14289 -10613 -12486 -18259 -17900 -17503 -11380 -12285 -8096 -1422 1244 -6434 -14350 -13591
15141a3591N573m489j0359j1351N20L089n33L161O138N452K882L582n561q701
$$ -13591 -8018 -12507 -22866 -34217 -33697 -30608 -31141 -27980 -21842 -16390 -13508 -9926 -15487 -24188
15127b4188k046N894p944l848m885J575O291L713K655K574o018p730O186N663
$$ -24188 -26234 -20340 -28284 -32132 -37017 -35442 -29151 -25438 -22783 -20209 -26227 -33957 -27771 -22108
15113b2108K966q62M530L46q31p607o602K769O102j29l548R4K627L537m289k09
$$ -22108 -19142 -20004 -15474 -15128 -15959 -23566 -30168 -27399 -21297 -21426 -24974 -24880 -22253 -18716 -23005 -23214
15097b3214P425O797J032j4598J963J143m761k154j009j120j346p293P158R788
$$ -23214 -15789 -8992 -7960 -22558 -20595 -19452 -24213 -26367 -27376 -28496 -29842 -37135 -29977 -20189
15083b0189M607m650O56j0466L763j663m076P221Q687j490n243m1n396r64O145
$$ -20189 -15582 -20232 -19576 -30042 -26279 -27942 -32018 -24797 -16110 -17600 -22843 -22884 -28280 -29244 -23099
15068b3099j73m932O416J0459M248m899O33n323o263r56j0049l481Q114O377j212
$$ -23099 -23272 -28204 -21788 -11329 -7081 -11980 -11347 -16670 -22933 -23889 -33938 -37419 -29305 -22928 -24140
15053b4140l421R497L146l962n382j723o214k739M54L771L757O777O91k356J934
$$ -24140 -27561 -18064 -14918 -18880 -24262 -25985 -32199 -34938 -34484 -30713 -26956 -20179 -19488 -21844 -19910
15038a9910j755q331k614P384M728P489N082k766k708q305k319M817l145k089
$$ -19910 -21665 -29996 -32610 -25226 -20498 -13009 -7927 -10693 -13401 -21706 -24025 -19208 -22353 -24442
15024b4442k0O269k481J096Q319j705j2722O472J715l257m182j540J829n64p777
$$ -24442 -24462 -18193 -20674 -19578 -11259 -12964 -25686 -19214 -17499 -20756 -24938 -26478 -24649 -25213 -32990
15009c2990L476Q115L75l710p596O741Q846r345l640M977J264R7j724k288j506
$$ -32990 -29514 -21399 -21024 -24734 -32330 -25589 -16743 -26088 -29728 -24751 -23487 -23390 -25114 -27402 -28908
14994b8908n79M449o876n78O857L668j60Q471j080l115o630Q26Q986l108q884
$$ -28908 -29487 -25038 -31914 -32492 -25635 -21967 -22127 -13656 -14736 -17851 -24481 -23655 -14669 -17777 -26661
14979b6661m327L336J2568p80m010m953K387L850q388m844L956J176j710r620
$$ -26661 -30988 -27652 -15084 -15864 -19874 -24827 -22440 -18590 -26978 -31822 -27866 -26690 -28400 -38020
14965c8020M471n80l397k334q82P8K729J034m16M68l899J149J6024P088j022k802
$$ -38020 -33549 -34129 -37526 -39860 -40742 -40664 -37935 -36901 -37317 -36849 -40748 -39599 -23575 -16487 -17509 -20311
14949b0311M751K578j190k134K590k054o170L499J1171J0503k28n472o851j723
$$ -20311 -15560 -12982 -14172 -16306 -13716 -15770 -21940 -18441 -7270 3233 3005 -2467 -9318 -11041
14935a1041p268K275M620l399p820q602p071L862J22p684k338N551P1M537R010
$$ -11041 -18309 -16034 -11414 -14813 -22633 -31235 -38306 -34444 -34322 -42006 -44344 -38793 -38722 -34185 -25175
14920b5175Q216O534J4024J691o152j7396j2639J258m9k064M424l086n797j365
$$ -25175 -16959 -10425 3599 5290 -862 -18258 -30897 -29639 -29688 -31752 -27328 -30414 -36211 -37576
14906c7576J172M165j534J258J36l064Q48K452M886O290n369m982j350J915o463
$$ -37576 -36404 -32239 -33773 -32515 -32379 -35443 -34595 -32143 -27257 -20967 -26336 -31318 -32668 -30753 -37216
14891c7216m786J657M777J3560r51m68q915K810J820j306k552n915q80n587P083
$$ -37216 -42002 -40345 -35568 -22008 -22959 -23427 -32342 -29532 -27712 -29018 -31570 -37485 -38365 -43952 -36869
14876c6869J1284j480k653j466k168M755J579L56K155L015r03j725l534j0485
$$ -36869 -25585 -27065 -29718 -31184 -33352 -28597 -27018 -26662 -24507 -21492 -22395 -24120 -27654 -38139
14862c8139O105R98j264K809m76n991p266Q908M302l2J459n87L265O550Q4j304
$$ -38139 -32034 -31036 -32300 -29491 -29967 -35958 -43224 -34316 -30014 -30046 -28587 -29174 -25909 -19359 -19275 -20579
14846b0579M574m960K867j445o630l857n857n245M717K917O838j814O97P406R142
$$ -20579 -16005 -20965 -18098 -19543 -26173 -30030 -35887 -41132 -36415 -33498 -26660 -28474 -27777 -20371 -11229
14831a1229m796k928m703o990l192n144n71n079p04R139N389J844j427K555J444
$$ -11229 -16025 -18953 -23656 -30646 -33838 -38982 -39553 -44632 -45336 -36197 -30808 -28964 -30391 -27836 -26392
14816b6392N259M056q526q202k745r213N599M394L985o495P47M097O147K308K059
$$ -26392 -21133 -17077 -25603 -33805 -36550 -45763 -40164 -35770 -31785 -38280 -37533 -33436 -27289 -24981 -22922
14801b2922k465N334j387k377p815j737M757K229L07K03n387l664N462O375J513
$$ -22922 -25387 -20053 -21440 -23817 -31632 -33369 -28612 -26383 -26076 -25873 -31260 -34924 -29462 -23087 -21574
14786b1574N389r65r0j248m935p561L672L774l959q59m222j161q300l305Q188
$$ -21574 -16185 -17150 -17240 -18488 -23423 -30984 -27312 -23538 -27497 -28356 -32578 -33739 -42039 -45344 -37156
14771c7156M212p567K814R866Q193P550m626q113j34L455j971N42k866k720L34
$$ -37156 -32944 -40511 -37697 -27831 -19638 -12088 -16714 -24827 -24961 -21506 -23477 -22935 -25801 -28521 -28187
14756b8187K943Q22K498k822l519k295Q010K110n749p583K017m156M404J2632
$$ -28187 -25244 -24422 -21924 -24746 -28265 -30560 -22550 -20440 -26189 -33772 -31755 -35911 -31507 -18875
14742a8875R14q251l070P331J580j446O409j483p537j74P54l099J083M388N115
$$ -18875 -17961 -26212 -29282 -21951 -20371 -21817 -15408 -16891 -24428 -24602 -23848 -26947 -25864 -21476 -16361
14727a6361J397l022p008J143N487l818k940J879K692p738k431p040J302L893
$$ -16361 -14964 -17986 -24994 -23851 -18364 -22182 -25122 -23243 -20551 -28289 -30720 -37760 -36458 -32565
14713c2565J059O944N933J3671O91r95q715o355q013n031j0491l743J4374J7422
$$ -32565 -31506 -24562 -18629 -4958 -4267 -5262 -13977 -20332 -28345 -33376 -43867 -47610 -33236 -15814
14699a5814R003M508m945j5317l639k42L061R354M395n903p013J998J0010K42
$$ -15814 -6811 -2303 -7248 -22565 -26204 -26446 -23385 -14031 -9636 -15539 -22552 -20554 -10544 -10302
14685a0302K709O644o775j4875n344O18J080m185m292L824N112l64l315p19R32
$$ -10302 -7593 -949 -7724 -22599 -27943 -27325 -26245 -30430 -34722 -30898 -25786 -26150 -29465 -30184 -29252
14670b9252L162j222l079O18M244N638N878l571l26Q602M195k154m594R45m647
$$ -29252 -26090 -27312 -30391 -29773 -25529 -19891 -14013 -17584 -17910 -9308 -5113 -7267 -11861 -10916 -15563
14655a5563J124J937N42k391N56K735o12l43j340n265n650j964l633N884j98j605
$$ -15563 -14439 -12502 -11960 -14351 -13795 -11060 -11672 -12015 -13355 -18620 -24270 -26234 -29867 -23983 -24181 -25786
14639b5786l273L9N424l8p024l887k670k024M685R433l232m197p88N241m164n0
$$ -25786 -29059 -29020 -23596 -23634 -30658 -34545 -37215 -39239 -34554 -25121 -28353 -32550 -33338 -28097 -32261 -32311
14623c2311K42J859p886m059R600M434O308j059k293P90k915q95K027R75K795
$$ -32311 -32069 -30210 -38096 -42155 -32555 -28121 -21813 -22872 -25165 -24375 -27290 -28185 -26158 -25183 -22388
14608b2388K997o868o07l161n130L130P751o14m38J550K63k839p176l708J992
$$ -22388 -19391 -26259 -26866 -30027 -35157 -32027 -24276 -24890 -25328 -23778 -23515 -26354 -33530 -37238 -35246
14593c5246N907N925l482r574J110L825M616K192k613m461J34O983Q786j595l21
$$ -35246 -29339 -23414 -26896 -36470 -35360 -31535 -26919 -24727 -27340 -31801 -31667 -24684 -15898 -17493 -17814
14578a7814K565o637j0587l886Q807O710l576m034N72l466L648K647k797o756
$$ -17814 -15249 -21886 -32473 -36359 -27552 -20842 -24418 -28452 -27880 -31346 -27698 -25051 -27848 -34604
14564c4604J884L382J83Q823k522J239O779M358K596K168m250n201p780m011K917
$$ -34604 -32720 -29338 -29155 -20332 -22854 -21615 -14836 -10478 -7882 -5714 -9964 -15165 -22945 -26956 -24039
14549b4039l83J49J863N002k319q676R15M037K414L354K982j512L655j098l826
$$ -24039 -24422 -24273 -22410 -17408 -19727 -28403 -27488 -23451 -21037 -17683 -14701 -16213 -12558 -13656 -17482
14534a7482K54j493K400L030k200L731M04p273l124p290j916R16n04R67M141j012
$$ -17482 -17228 -18721 -16321 -13291 -15491 -11760 -11356 -18629 -21753 -29043 -30959 -30043 -30547 -29580 -25439 -26451
14518b6451N713R247k750o035l159m865M799N683L627q022M050M457K999l13j5818
$$ -26451 -20738 -11491 -14241 -20276 -23435 -28300 -23501 -17818 -14191 -22213 -18163 -13706 -10707 -11020 -26838
14503b6838n850m6O389O473J286k358J689j096j2899m445P232J0044l69l240n87
$$ -26838 -32688 -32734 -26345 -19872 -18586 -20944 -19255 -20351 -33250 -37695 -30463 -20419 -20788 -24028 -24615
14488b4615j439R16J175j535o39Q776l3p430m80K615J0728k405n206j539J0566
$$ -24615 -26054 -25138 -23963 -25498 -26137 -17361 -17394 -24824 -25304 -22689 -11961 -14366 -19572 -21111 -10545
14473a0545N397n794r983J002P542m077n260l552o043q143O002R818J652M568
$$ -10545 -5148 -10942 -20925 -19923 -12381 -16458 -21718 -25270 -31313 -39456 -33454 -23636 -21984 -17416
14459a7416J123j173k824J503R624N615j472l988q557n637n705k558L39Q282Q880
$$ -17416 -16293 -17466 -20290 -18787 -9163 -3548 -5020 -9008 -17565 -23202 -28907 -31465 -31126 -22844 -13964
14444a3964O808p16K805R176k589o703o542j459l459M308Q227k520j611j671M276
$$ -13964 -7156 -7872 -5067 4109 1520 -5183 -11725 -13184 -16643 -12335 -4108 -6628 -8239 -9910 -5634
14429e634l884l498J072J327K036l861l8m309M779m823j1829J700J2122O611p05
$$ -5634 -9518 -13016 -11944 -10617 -8581 -12442 -12480 -16789 -12010 -16833 -28662 -26962 -14840 -8229 -8934
14414h934k726J185K429l948r121j840N400M025k918L915L922q492n607J481M030
$$ -8934 -11660 -10475 -8046 -11994 -21115 -22955 -17555 -13530 -16448 -12533 -8611 -17103 -22710 -21229 -17199
14399a7199O063j77L094k815n298j303j714M699m451l700n066p863l507N392P257
$$ -17199 -11136 -11313 -8219 -11034 -16332 -17635 -19349 -14650 -19101 -22801 -27867 -35730 -39237 -33845 -26588
14384b6588N123Q005m78k265J814L037R48K097m178R9J789m638K473Q549N07o380
$$ -26588 -21465 -13460 -13938 -16203 -14389 -11352 -10404 -8307 -12485 -12386 -10597 -15235 -12762 -4213 -3706 -10086
14368a0086m472K566R206R899k084q014m258N064j2389q775l174l590N666L55
$$ -10086 -14558 -11992 -2786 7113 5029 -2985 -7243 -2179 -14568 -23343 -26517 -30107 -24441 -24086
14354b4086k938l719k7J520L991j086K639L721p04P887K046J916L555j431n94
$$ -24086 -27024 -30743 -30770 -29250 -25259 -26345 -23706 -19985 -20689 -12802 -10756 -8840 -5285 -6716 -7310
14339g310m348j558p001k01J856Q804K224M718J379r143P88j021J038P28N642
$$ -7310 -11658 -13216 -20217 -20418 -18562 -9758 -7534 -2816 -1437 -10580 -9792 -10813 -9775 -9047 -3405
14324c405r13L03J3m52l443ml266l482M94O588J0849M693n449J302m59M643m918
$$ -3405 -4318 -4015 -4002 -4454 -7897 -7901 -11167 -14649 -14155 -7567 3282 7975 2526 3828 3369 8012 3094
14307C094k768o216k447J807m569m581K878M199O946J477q687m336J583k674l480
$$ 3094 326 -5890 -8337 -6530 -11099 -15680 -12802 -8603 -1657 -180 -8867 -13203 -11620 -14294 -17774
14292a7774j883J304J987M282j250j1662m271J816O471O310n702K27J874m05L562
$$ -17774 -19657 -18353 -16366 -12084 -13334 -24996 -29267 -27451 -20980 -14670 -20372 -20145 -18271 -18676 -15114
14277a5114N182l786j0174n242M023K168K834M873J2863l475r630r536m711N954
$$ -15114 -9932 -13718 -23892 -29134 -25111 -22943 -20109 -15236 -2373 -5848 -15478 -25014 -29725 -23771
14263b3771j774j447J663K385N864Q752j353m14k701l40n370M563K286Q965p179
$$ -23771 -25545 -26992 -25329 -22944 -17080 -8328 -9681 -10095 -12796 -13136 -18506 -13943 -11657 -2692 -9871
14248i871p419N462K47j838o208K413k014M019J008j522N774k198o173o294J0404
$$ -9871 -17290 -11828 -11581 -13419 -19627 -17214 -19228 -15209 -14201 -15723 -9949 -12147 -18320 -24614 -14210
14233a4210P135m865j061J429J501K033j376J2080k991q011L366k562M31j307
$$ -14210 -7075 -11940 -13001 -11572 -10071 -8038 -9414 2666 -325 -8336 -4970 -7532 -7101 -8408
14219h408M347o260p198K704j118J647M580K791J328J282K155l887l536L528N005
$$ -8408 -4061 -10321 -17519 -14815 -15933 -14286 -9706 -6915 -5587 -4305 -2150 -6037 -9573 -6045 -1040
14204a040j936J403j162k083n696j038j6M768J1695J082o117R39L903K381N348
$$ -1040 -2976 -1573 -2735 -4818 -10514 -11552 -11568 -6800 4895 5977 -140 799 4702 7083 12431
14189A2431o472q653J777O579L008o063J293K788Q235R837m846p425K177O137
$$ 12431 5959 -2694 -917 5662 8670 2607 3900 6688 14923 24760 19914 12489 14666 20803
14175B0803J1795j337J010L750K644J2013M830l010l885K633K827J295N578J0646
$$ 20803 32598 31261 32271 36021 38665 50678 55508 52498 48613 51246 54073 55368 60946 71592
14161G1592J6238J4785M372O389P081M067J106O943O172Q601J4359J0286K460
$$ 71592 87830 102615 106987 113376 120457 124524 125630 132573 138745 147346 161705 171991 174451
14148A74451J704J369K369J5134K9776K8037K9885M5660L9798M8264M5057L4699
$$ 174451 176155 177524 179893 195027 224803 252840 282725 328385 368183 416447 461504 496203
14136D96203M1266M0141M3408L9865N3813P8394R1315J22552J46569J63013J80482
$$ 496203 537469 577610 621018 660883 714696 793090 884405 1006957 1153526 1316539 1497021
14125A497021J79354J76794J61926J36012J13093Q0694M6430K0217P87j2043j7117
$$ 1497021 1676375 1853169 2015095 2151107 2264200 2344894 2391324 2411541 2412328 2400285 2383168
14114B383168l5339p7030r5119j16893j46756j80929j98953k15705k05961j81719
$$ 2383168 2347829 2270799 2175680 2058787 1912031 1731102 1532149 1316444 1110483 928764
14104I28764j58715j39401j04072q2304o6480m9999l8370l5486k7780k7636k2325
$$ 928764 770049 630648 526576 444272 377792 327793 289423 253937 226157 198521 176196
14093A76196j9479j2711j4939j1107j0683j0571m138l166p168n244r856j0410
$$ 176196 156717 144006 129067 117960 107277 96706 92568 89402 82234 76990 67134 56724
14081E6724o541n63J238n820p847K04N039k035q155R93j311O64l697m302q580
$$ 56724 50183 49620 50858 45038 37191 37395 42434 40399 32244 33237 31926 32590 28893 24591 16011
14066A6011j642P549l07m395k184N402m03k289j0251j2492j936N375M992K460
$$ 16011 14369 21918 21611 17216 15032 20434 20031 17742 7491 -5001 -6937 -1562 3430 5890
14052E890j1975m453Q317Q870Q664m611r513k231J40j908K620O522p363N93O789
$$ 5890 -6085 -10538 -2221 6649 15313 10702 1189 -1042 -902 -2810 -190 6332 -1031 -438 6351
14037F351J421j612k39P647Q671j471j2041k440J340r88o945o770k528J036J646
$$ 6351 7772 6160 5921 13568 22239 20768 8727 6287 7627 6639 -306 -7076 -9604 -8568 -6922
14022f922j0676l187k96Q672r58k982l784j001J3325J1890N284k718j620J695
$$ -6922 -17598 -20785 -21081 -12409 -13367 -16349 -20133 -21134 -7809 4081 9365 6647 5027 6722
14008F722l410p142N737M830M234J284p080n551n44j0056J0962P036n102K507
$$ 6722 3312 -3830 1907 6737 10971 12255 5175 -376 -920 -10976 -14 7022 1920 4427
13994D427n090o945k837L765Q041M760l943o417m179J499m235m933K320m000j55
$$ 4427 -663 -7608 -10445 -6680 1361 6121 2178 -4239 -8418 -6919 -11154 -16087 -13767 -17767 -17922
13979a7922O244M533K354j72N034O010m206k830J50N92J05j15Q549M247l8N029
$$ -17922 -11678 -7145 -4791 -4963 71 6081 1875 -955 -805 -213 -108 -223 8326 12573 12535 17564
13963A7564Q557l168J468J3618L942J0856K7707L6435M2448L4802J8610K0954
$$ 17564 26121 22953 24421 38039 41981 52837 80544 116979 159427 194229 212839 233793
13951B33793L2850L4892J9691L678j9822l6118k3591j7938j9258l3613m8833m1517
$$ 233793 266643 301535 321226 324904 305082 268964 245373 227435 208177 174564 125731 84214
13939H4214j8308j2814o966r409l695j3035q310k955J70M993R120q564n064K046
$$ 84214 65906 53092 46126 36717 33022 19987 11677 8722 8892 13885 23005 14441 9377 11423
13925A1423l918j749J0060O537M190J0392J0803j553L657N135n086R52K876j4864
$$ 11423 7505 5756 15816 22353 26543 36935 47738 46185 49842 54977 49891 50843 53719 38855
13911C8855j6780k523o04P391R578N403j76m720N825K158O704J735P511K0447
$$ 38855 22075 19552 18948 26339 35917 41320 41144 36424 42249 44407 51111 52846 60357 80804
13897H0804J5348K1719L9353O2053Q4530J11329J26897J33367J42961J58312J48533
$$ 80804 96152 117871 157224 219277 303807 415136 542033 675400 818361 976673 1125206
13886A125206J04874N2649J6906k3202n9388j11249j42973j44775j30033j30047
$$ 1125206 1230080 1282729 1299635 1276433 1217045 1105796 962823 818048 688015 557968
13876E57968j27624j01951p3754n3001k2802L622k057J6928K4656K9656L6813
$$ 557968 430344 328393 254639 201638 178836 182458 180401 197329 221985 251641 288454
13865B88454L3480J8710k40n588p987k3747l3754m9120m1617m4226l0978j8970
$$ 288454 321934 340644 340404 334816 326829 303082 269328 220208 178591 134365 103387 84417
13853H4417j1508q449r898p536o991j0082m344l583m016M975J794m07l160M822
$$ 84417 72909 64460 54562 47026 40035 29953 25609 22026 18010 22985 24779 24372 21212 26034
13839B6034L702Q093R42o420k480L972n07R965Q684k819J404K30m98k431L77L876
$$ 26034 29736 37829 38771 32351 29871 33843 33336 43301 51985 49166 50570 50800 50302 47871 48248 52124
13823E2124R517O977r490j6746k160J136k021k669m708K444L442j734r543l225
$$ 52124 61641 68618 59128 42382 40222 41358 39337 36668 31960 34404 37846 36112 26569 23344
13809B3344k786k93k387r13L992K333j836r69r476L495K587K879J265J67qJ441
$$ 23344 20558 20265 17878 16965 20957 23290 21454 20485 11009 14504 17091 19970 21235 21402 21394 22835
13793B2835k14j122P015J487n335j1189k038L118j990m267K198j366N766O258
$$ 22835 22621 21499 28514 30001 24666 13477 11439 14557 12567 8300 10498 9132 14898 21156
13779B1156k893m596n886r103r164M934M935J825J1179N254q368n992M279R242
$$ 21156 18263 13667 7781 -1322 -10486 -5552 -617 1208 12387 17641 9273 3281 7560 16802
13765A6802P707O151j2503j2126m61J960k562m084M123K86R2N697M505K939j906
$$ 16802 24509 30660 18157 6031 5570 7530 4968 884 5007 5293 5385 11082 15587 18526 16620
13750A6620m045k231p46k987j624P867j774M353j315j2795k748O039K713M348
$$ 16620 12575 10344 9598 6611 4987 12854 11080 15433 14118 1323 -1425 4614 7327 11675
13736A1675n543J152P737l909n879p933j919M907J1348J505J533j0135k345R379
$$ 11675 6132 7284 15021 11112 5233 -2700 -4619 288 11636 13141 14674 4539 2194 11573
13722A1573J581J199N264O062L643l129j1783k740M9l470k098k640k584K683Q848
$$ 11573 13154 14353 19617 25679 29322 26193 14410 11670 11719 8249 6151 3511 927 3610 12458
13707A2458N310o050QK867M882l483M912n873j251N035l285J173j115M624K60
$$ 12458 17768 11718 11726 14593 19475 15992 20904 15031 13780 18815 15530 16703 15588 20212 20472
13692B0472L76m306N788R428n00k007m564k130J989L408q889j0586P200R34j44
$$ 20472 20848 16542 22330 31758 31258 29251 24687 22557 24546 27954 19065 8479 15679 16613 16469
13677A6469M208J0781N350q869l724n735r156m153p42M003J517Q130l831Q96n87
$$ 16469 20677 31458 36808 27939 24215 18480 9324 5171 4429 8432 9949 18079 14248 15144 14557
13662A4557m264l043N410L03p250J942Q669j472J007M529p31n532J095K693l730
$$ 14557 10293 7250 12660 12963 5713 7655 16324 14852 15859 20388 19657 14125 15220 17913 14183
13647A4183p930O151N156K758K075k772K026k452j95n170J925J1517O643J626
$$ 14183 6253 12404 17560 20318 22393 19621 21647 19195 19000 13830 15755 27272 33915 35541
13633C5541pM501l184M029P817k825j410Q467J0355Q563M522M264O40Q706J847
$$ 35541 35534 40035 36851 40880 48697 45872 44462 52929 63284 71847 76369 80633 81273 89979 91826
13618I1826K891o506q038L890L446q497j2824n19j39J881q35P11L027K422M85
$$ 91826 94717 88211 80173 84063 87509 79012 66188 65669 65530 67411 66576 67287 70314 72736 73221
13603G3221l739l503J744j480p380l138M976P287k208l693p911M312L085l528
$$ 73221 69482 65979 67723 66243 58863 55725 60701 67988 65780 62087 54176 58488 61573 58045
13589E8045o325L85j989k629O83N995M174n333j729N828N736J441K814k125K136
$$ 58045 51720 52105 50116 47487 48170 54165 58339 53006 51277 57105 62841 64282 67096 64971 67107
13574F7107M316J0041J5874J0436P628Q532Q817J5529R307J4736K1207J7335L303
$$ 67107 71423 81464 97338 107774 115402 123934 132751 148280 157587 172323 193530 210865 214168
13561B14168m709M203K912L616j990n434r206o298m800r91j201m06QP61k685o796
$$ 214168 209459 213662 216574 220190 218200 212766 203560 197262 192462 191471 190270 189864 189872 190633 187948 181152
13545A81152m967o747r691J776O925K464J283m836Q23j904n334l761M408L124
$$ 181152 176185 169438 159747 161523 168448 170912 172195 167359 168182 166278 160944 157183 161591 164715
13531A64715j26J1923J8283J4983N978j898L179R279J1753j935j236r099p877
$$ 164715 164589 176512 194795 209778 215756 213858 217037 226316 238069 236134 234898 225799 217922
13518B17922o919j1609p112q937n223k709p76p152N880K481l615N488J4310J8329
$$ 217922 211003 199394 192282 183345 178122 175413 174637 167485 173365 175846 172231 177719 192029 210358
13504B10358J7812J6113L1423L1151M0939L7841L4002K3696J1074m03L345m753
$$ 210358 228170 244283 275706 306857 347796 385637 419639 443335 454409 454006 457351 452598
13492D52598l0111m8106l1846k9756k9129k4836p199j1153q076p677p593k259
$$ 452598 422487 374381 342535 312779 283650 258814 251615 240462 232386 224709 217116 214857
13480B14857j2536L74r31k13K789k033J858m328l348J1131J7373J5646K2237M2052
$$ 214857 202321 202695 201764 201551 204340 202307 204165 199837 196489 207620 224993 240639 262876 304928
13466C04928M3863L2867L2014L1601L6006K9452J256j4530k2239k2660l3769l4418
$$ 304928 348791 381658 413672 445273 481279 510731 511987 497457 475218 452558 418789 384371
13454C84371l3555l6553l1575j5951r696j8204j4781j0019J473J859L035J448
$$ 384371 350816 314263 282688 266737 257041 238837 224056 214037 215510 217369 220404 221852
13442B21852Q392P540l750O212J8075P681j798K496M264M10N3l497P327J0193
$$ 221852 230244 237784 234034 240246 258321 266002 264204 266700 270964 271374 271427 267930 275257 285450
13428B85450J2097J8292O833j5958j8602j1818m746k952k644r158j1558O27J010
$$ 285450 297547 315839 322672 306714 288112 276294 271548 268596 265952 256794 245236 245863 246873
13415B46873j1333o034L848O49J1642J803j2150j299L775O74L528o5K625K305
$$ 246873 235540 229506 233354 234003 245645 247448 235298 233999 237774 238448 241976 241911 244536 246841
13401B46841l307M959N920O085n528j133p87M596N332N806K122l161K098P508
$$ 246841 243534 248493 254413 260498 254970 253837 253050 257646 262978 268784 270906 267745 269843 277351
13387B77351J0979K2864J9287O693q585j1314j9409k8346j5893o70J247r055m932
$$ 277351 288330 311194 330481 337174 328589 317275 297866 269520 253627 252957 254204 245149 240217
13374B40217R39l004q831L52L50k511J604l894p775j0831o475m12K580k90n737
$$ 240217 241156 238152 229321 229673 230023 227512 229116 225222 217447 206616 200141 199729 202309 202019 196282
13359A96282k739r902l650M211R614P713p464m945m259Q099K517j568j309j035
$$ 196282 193543 183641 179991 184202 193816 201529 194065 189120 184861 192960 195477 193909 192600 191565
13345A91565r70J0000N669J5111L887j2065j1844j0250n615q870q230n962k117
$$ 191565 190595 200595 206264 221375 225262 213197 201353 191103 185488 176618 168388 162426 160309
13332A60309J423o448m079J126n287m18j889n764k620L104N040l547r212J036
$$ 160309 161732 155284 151205 152331 147044 146626 144737 138973 136353 139457 144497 140950 131738 132774
13318A32774o804J88m030m44j232o25m399l199Q596J713l274l262o181l384m87
$$ 132774 125970 126158 122128 121684 120452 119827 115428 112229 120825 122538 119264 116002 109821 106437 105950
13303A05950j461O533K538o334j0372j373M278N806r625J085J71l553J700J080
$$ 105950 104489 111022 113560 107226 96854 95481 99759 105565 95940 97025 97196 93643 95343 96423
13289I6423n324k949O262R728M883k410j1550n052J278k8M941N96R605J892j1427
$$ 96423 91099 88150 94412 104140 109023 106613 95063 90011 91289 91261 96202 96798 106403 108295 96868
13274I6868j8603n697o73M865O162m508o291k760Q022K988M079R096m551q216
$$ 96868 78265 72568 71895 76760 82922 78414 72123 69363 77385 80373 84452 93548 88997 80781
13260H0781L43J567p212l683L184n542k499k861R14R87k295l282j177q10l686
$$ 80781 81124 82691 75479 71796 74980 69438 66939 64078 64992 65979 63684 60402 59225 58415 54729
13245E4729l604J0188M640O70N802j04J365l412m099k124j0362J471L437p167
$$ 54729 51125 61313 65953 66623 72425 72321 73686 70274 66175 64051 53689 55160 58597 51430
13231E1430m775P055L529P277K642Q91J587K511R658j874k500k305p693l782K759
$$ 51430 46655 53710 57239 64516 67158 68049 69636 72147 81805 79931 77431 75126 67433 63651 66410
13216F6410L437o361k789o44n040n5O38Q898P791r19p677P310O16k474q652K3
$$ 66410 69847 63486 60697 60053 55013 54958 55596 64494 72285 71366 63689 70999 71615 69141 60489 60512
13200F0512Q068P592K1Q088J3604Q320J4913Q373Q324K4698K5763J0706J6682
$$ 60512 68580 76172 76193 84281 97885 106205 121118 129491 137815 162513 188276 198982 215664
13187B15664J2549R044O981m402p379n05j4183j7122j8099k4421k2229j7642j7583
$$ 215664 228213 237257 244238 239836 232457 231952 217769 200647 182548 158127 135898 118256 100673
13174A00673j0283k954p404r203n014n304K954n259j823K543N001l26p172p841
$$ 100673 90390 87436 80032 70829 65815 60511 63465 58206 56383 58926 63927 63601 56429 48588
13160D8588N43P29M536o96O245l545J889K229k912K596o22k416l530l31o14k231
$$ 48588 49131 49860 54396 53700 59945 56400 58289 60518 57606 60202 59580 57164 53634 53303 52689 50458
13144E0458q774l417m813J271k951k990K442N253J691K93q09m759L009P92p989
$$ 50458 41684 38267 33454 34725 31774 28784 31226 36479 38170 38463 37654 32895 35904 36696 28707
13129B8707q325L748J0865J617l924L785k223o680K864N756J972j464l105j063
$$ 28707 20382 24130 34995 36612 32688 36473 34250 27570 30434 36190 38162 36698 33593 32530
13115C2530O108l663l971j896K275k187J122Q576J6285L651O965M988m41r34K911
$$ 32530 38638 34975 31004 29108 31383 29196 30318 38894 55179 58830 65795 70783 70342 69408 72319
13100G2319J790K514P063j201j2113j0023L729l159n394k703j673r125o779n837
$$ 72319 74109 76623 83686 82485 70372 60349 64078 60919 55525 52822 51149 42024 35245 29408
13086B9408R8O089J900p10j658J788j008l156j493p794j0449l44P525J145M28
$$ 29408 29506 35595 37495 36785 35127 36915 35907 32751 31258 23464 13015 12671 20196 21341 21769
13071B1769k218N316J2709N710j337N055R269q40J22N59L934P126l062k233k562
$$ 21769 19551 24867 37576 43286 41949 47004 56273 55433 55555 56114 60048 67174 64112 61879 59317
13056E9317K260J0352L888O948R313O382K418J0298J7999J8243J7117L6387L7547
$$ 59317 61577 71929 75817 82765 92078 98460 100878 111176 129175 147418 164535 200922 238469
13043B38469N8002Q1518J10521J30861J41615J56876J49767J21356P8936M6804
$$ 238469 296471 377989 488510 619371 760986 917862 1067629 1188985 1267921 1314725
13033A314725p508o0246j05174j38849j54978j53055j37620j18205r7401o8527
$$ 1314725 1307217 1246971 1141797 1002948 847970 694915 557295 439090 341689 273162
13023B73162n0360l5108k4249j9469j3577p908j3721j2663j2464n869q550m587
$$ 273162 222802 187694 163445 143976 130399 122491 108770 96107 83643 77774 69224 64637
13011F4637L847p686l421o687m082M948K027M116L535J2557M280q35k638J0467
$$ 64637 68484 60798 57377 50690 46608 51556 53583 57699 61234 73791 78071 77236 74598 85065
12997H5065P076n810l947k260l786n66o880j6028j3621K538K192k743K8j295J922
$$ 85065 92141 86331 82384 80124 76338 75772 68892 52864 39243 41781 43973 41230 41258 39963 41885
12982D1885L500m847k140Q518M715j668j600q56k203K312J09L744K793Q186N346
$$ 41885 45385 40538 38398 46916 51631 49963 48363 47507 45304 47616 47725 51469 54262 62448 67794
12967F7794k551j200n310N531R380P494k398n785l222m608l016j981j019k460
$$ 67794 65243 64043 58733 64264 73644 81138 78740 72955 69733 65125 62109 60128 59109 56649
12953E6649j857o41L607o71L833P087l056j2655r935R91j996L814J751J829o224
$$ 56649 54792 54151 57758 57087 60920 68007 64951 52296 42361 43352 41356 45170 46921 48750 42526
12938D2526m376R605J1884k254M349M441R742l007q758j249J2457Q976k784q866
$$ 42526 38150 47755 59639 57385 61734 66175 75917 72910 64152 62903 75360 84336 81552 72686
12924G2686l905m949K294O073m83q41j1630j0068m370J566L917M141o759R85j911
$$ 72686 68781 63832 66126 72199 71716 70875 59245 49177 44807 46373 50290 54431 47672 48657 46746
12909D6746r402kL801L765Q155J248j699o866J1P073J0834k256J218m88L915p33
$$ 46746 37344 37342 41143 44908 53063 54311 52612 45746 45757 52830 63664 61408 62626 62138 66053 65320
12893F5320j0072j3256k804P938O158J1012j431o523K03K718j986q029R159J6080
$$ 65320 55248 41992 39188 47126 53284 64296 62865 56342 56545 59263 57277 49248 58407 74487
12879G4487Q457J2609J1784L663L810N148L097P111o54J7942K4456K1629J9183
$$ 74487 82944 95553 107337 111000 114810 119958 123055 130166 129512 147454 171910 193539 212722
12866B12722J6181R765Q611j34j7158j2934r059j7732j9914k0496j3409j7738
$$ 212722 228903 238668 247279 247145 229987 217053 207994 190262 170348 149852 136443 118705
12854A18705j3659p724o334J024M344J950k131m924j541P60l877J345o74J47J760
$$ 118705 105046 97322 90988 92012 96356 98306 96175 91251 89710 90470 86593 87938 87264 87411 89171
12839H9171Q325J1491K7101K8450J3139q8j6689k8318l2496k1007j0680k818j35
$$ 89171 97496 108987 136088 164538 177677 177589 160900 132582 100086 79079 68399 65581 65446
12826F5446K276J637m958l575l345k226R86R517N132R421J1914Q059P42j306Q03
$$ 65446 67722 69359 64401 60826 57481 55255 56241 65758 70890 80311 92225 100284 101026 99720 100523
12811A00523N907Q906j972o45J0261O297M415j12N382R292J8742L157N70Q185
$$ 100523 106430 115336 113364 112719 122980 129277 133692 133580 138962 148254 166996 170153 170723 178908
12797A78908m852j1716j7424j0517k394j7474j6986q886j880m57l04q20J3558
$$ 178908 174056 162340 144916 134399 132005 114531 97545 88659 86779 86322 86018 85198 98756
12784I8756K736j54R099J3823M249l262O049j135J979L373R050K343R95L118k330
$$ 98756 101492 101338 110437 124260 128509 125247 131296 130161 132140 135513 144563 146906 147901 151019 148689
12769A48689k427l12j099j2165N001j171n435O888R658R561J211J0169J6950J103
$$ 148689 146262 145950 144851 132686 137687 136516 131081 137969 147627 157188 158399 168568 185518 186621
12755A86621P916O794q14N425j045j0604L556P961J6313K5180J3881J0951O667
$$ 186621 194537 201331 200517 205942 204897 194293 197849 205810 222123 247303 261184 272135 278802
12742B78802J800J284K759l163j9979j0052j3885j3401j8338j3332p668k748m37
$$ 278802 280602 281886 284645 281482 261503 251451 237566 224165 205827 192495 184827 182079 181642
12729A81642Q221J5440J3467J6477J6895J3864O743J1087J2259J9244K4515K4391
$$ 181642 189863 205303 218770 235247 252142 266006 272749 283836 296095 315339 339854 364245
12717C64245L5975M0622N2425N9991O6563O3290N6890N3287M1939K0798P206q267
$$ 364245 400220 440842 493267 553258 619821 683111 740001 793288 835227 856025 863231 854964
12705H54964k4519l6521m0730l5652k5424k3083q789l329k871J1179K1430L1819
$$ 854964 830445 793924 753194 717542 692118 669035 660246 656917 654046 665225 686655 718474
12693G18474L7035M0331M7093M8907P0234Q4803J14558J45011K15839L30218N27294
$$ 718474 755509 795840 842933 891840 962074 1046877 1161435 1306446 1522285 1852503 2379797
12682B379797P46212R00030R73695J049590J138349J062500P84872M08595R7157
$$ 2379797 3126009 4026039 4999734 6049324 7187673 8250173 9035045 9443640 9540797
12673I540797j75233n33265q78827j053273j032840r71001r12456p98180o12089
$$ 9540797 9365564 8832299 7953472 6900199 5867359 4896358 3983902 3185722 2573633
12664B573633m12142k58370j60958j02279o2138l7430k5346P7J1763K3661K6899
$$ 2573633 2161491 1903121 1742163 1639884 1577746 1540316 1514970 1515047 1526810 1550471 1577370
12653A577370L7032N2402O2370P0431P5996R4581J02430J17530J31647J48532
$$ 1577370 1614402 1666804 1729174 1799605 1875601 1970182 2072612 2190142 2321789 2470321
12643B470321J74585J96908K23683K49640K78573L12359L50383L86426M51250
$$ 2470321 2644906 2841814 3065497 3315137 3593710 3906069 4256452 4642878 5094128
12634E094128N25261O26687P58675R23065J102521J298018J484274J687414J918039
$$ 5094128 5619389 6246076 7004751 7927816 9030337 10328355 11812629 13500043 15418082
12625A5418082K214167K665706L379931M512032O306682R124366J3192424J8109516
$$ 15418082 17632249 20297955 23677886 28189918 34496600 43620966 56813390 74922906
12617G4922906K2833048K6385175K8224302K7999178K4997564J9070237J0824898
$$ 74922906 97755954 124141129 152365431 180364609 205362173 224432410 235257308
12610B35257308J534193p862184j6402056k2930594k6606551k7529722k6336111
$$ 235257308 236791501 228929317 212527261 189596667 162990116 135460394 109124283
12603A09124283k3393297j9145781j4438375j0343830p350938n342310m048324
$$ 109124283 85730986 66585205 52146830 41803000 34452062 29109752 25061428
12596B5061428l205114k648760k282845k010258j776217j582255j381778j183196
$$ 25061428 21856314 19207554 16924709 14914451 13138234 11555979 10174201 8991005
12588H991005r83424q04364o47335n05184l79700k78515j98330j20173l9626J2117
$$ 8991005 8007581 7203217 6555882 6050698 5670998 5392483 5194153 5073980 5034354 5046471
12578E046471K1546J7184r999n2259r7676j64160k18887k60774k94606l01808
$$ 5046471 5068017 5085201 5075202 5022943 4925267 4761107 4542220 4281446 3986840 3685032
12568C685032l06491k85132k42848k03119j70635j42949j03808p6327n7358l8464
$$ 3685032 3378541 3093409 2850561 2647442 2476807 2333858 2230050 2153723 2096365 2057901
12558B057901k894J3598L4193M6890L6609K7961M909k3214n4683q5628j05518
$$ 2057901 2055007 2068605 2102798 2149688 2186297 2214258 2219167 2195953 2141270 2055642 1950124
12547A950124r9443j00191p4292n0770j6037J2919L5509M6305N4690M9423N4184
$$ 1950124 1850681 1750490 1676198 1625428 1609391 1622310 1657819 1704124 1758814 1808237 1862421
12536A862421M3369K0303j4817o0380j06878j30564j49252j42093j27432j01912
$$ 1862421 1905790 1926093 1911276 1850896 1744018 1613454 1464202 1322109 1194677 1092765
12526A092765q3863p1813o1458m8741m5850k3714k2762j4782j1910j1616o155
$$ 1092765 1008902 937089 875631 826890 781040 757326 734564 719782 707872 696256 690101
12515F90101j0073j2109j4953j3223j0009m868j758k02N339J9776R858j818j9750
$$ 690101 680028 667919 652966 639743 629734 624866 623108 622906 628245 648021 657879 656061 636311
12502F36311k9308j2450k46m54Q492J4314N096l625j2465J862J0289K6094K9065
$$ 636311 607003 594553 594307 593853 602345 616659 621755 618130 605665 607527 617816 643910 672975
12489F72975L4369N1729O9670O6059P4051P8656O4299O7616O0685M6844L3288
$$ 672975 707344 759073 828743 894802 968853 1047509 1111808 1179424 1240109 1286953 1320241
12478A320241M1402O0730P5025J00894J06524P9269k444r9488j65020j95573j86121
$$ 1320241 1361643 1422373 1497398 1598292 1704816 1784085 1781641 1682153 1517133 1321560 1135439
12467A135439j56003j24398r8888p2442n6183m6190k9231k0465j3517j4395j9600
$$ 1135439 979436 855038 756150 683708 627525 581335 552104 531639 518122 503727 484127
12456D84127j1850m113M060K0652L2915M9572O5202P8518Q4545R7510J07384P7765
$$ 484127 472277 468164 472224 492876 525791 575363 640565 719083 803628 901138 1008522 1086287
12444A086287N6935J9094j4465n4085q3968q2190r1009q7259p6735o8615n4419
$$ 1086287 1143222 1162316 1147851 1093766 1009798 927608 836599 749340 672605 603990 549571
12433E49571m2935m9691l6156l7024l7345l4221j8166k1356k0740k1822p307n516
$$ 549571 506636 456945 420789 383765 346420 312199 294033 272677 251937 230115 222808 217292
12421B17292l323j952j0288r042q09K285J785N683L262p764j5428R04l232k113
$$ 217292 213969 212017 201729 192687 191878 194163 195948 201631 204893 197129 181701 182605 179373 177260
12407A77260K575m873L735R90k758k256P171L040J1k440O409J3163l768j0994
$$ 177260 179835 174962 178697 179687 176929 174673 181844 184884 184895 182455 188864 202027 198259 187265
12393A87265p226N996N075j925l881o314m595m46L810n797M177m92M771j055K131
$$ 187265 180039 186035 191110 189185 185304 178990 174395 173949 177759 171962 176139 175647 180418 179363 181494
12378A81494N268O020K830r71j735l214q445n205N731O868j971n293m66L297J2618
$$ 181494 186762 192782 195612 194641 192906 189692 181247 176042 181773 188641 186670 181377 180911 184208 196826
12363A96826M873J5726J8957J5250J4191J8574P659L671K051m571M314J6723K4126
$$ 196826 201699 217425 236382 251632 265823 284397 292056 295727 297778 293207 297521 314244 338370
12350C38370K5049K3821L8868L6974L3011K9401K7787K5268J983k4070k8612k9011
$$ 338370 363419 387240 426108 463082 496093 525494 553281 578549 580532 556462 527850 498839
12338D98839m0325m4465m6211l4821l3408k2289j0840j4662j1512n2J389m128
$$ 498839 458514 414049 367838 333017 299609 277320 266480 251818 240306 240254 241643 237515
12326B37515K078K094L100O965O844P445J7426K2337K5328M1851N7457M4835K0192
$$ 237515 239593 241687 244787 251752 258596 266041 283467 305804 331132 372983 430440 475275 495467
12313D95467q140l3981l5408k6236l1239j4251l791K683L180R561K1397K4050
$$ 495467 487327 453346 417938 391702 360463 346212 342421 345104 348284 357845 379242 403292
12301D03292J9020J5927k979p209j3078k042om13J3822J0246q29j1199j1975j3306
$$ 403292 422312 438239 435260 428051 414973 412931 412925 412512 426334 436580 435751 424552 412577 399271
12287C99271n017n054J7870K3912K4576K9659N1360Q5442J06111J06689N7406
$$ 399271 394254 389200 407070 430982 455558 485217 536577 622019 728130 834819 892225
12276H92225j3014p0123j07871r6070p7359n6265m2005k9931j6534m632P244J8482
$$ 892225 879211 809088 701217 605147 527788 471523 429518 399587 383053 378421 385665 404147
12264D04147J2109J208q231k1575k0590j6349j9124j7198o144l0J01q030k755
$$ 404147 416256 417464 409233 387658 367068 350719 331595 314397 308253 308223 308324 300294 297539
12251B97539N62K480M556J697O689J2845J5674J6237L1604M4427N1853M3670K755
$$ 297539 298101 300581 305137 306834 313523 326368 342042 358279 389883 434310 486163 529833 532588
12238E32588l1486l9762k5390q763l579N555J55j0467j6121j5982k2739l2154
$$ 532588 501102 461340 435950 427187 423608 429163 429318 418851 402730 386748 364009 331855
12226C31855l0446l2021k6245j4710k0279k0908j7222q579r109j153k042O291
$$ 331855 301409 269388 243143 228433 208154 187246 170024 161445 152336 151183 149141 155432
12214A55432J620n206j67K561j830k577J0941R438j679L801Q27k34K0278J3081
$$ 155432 157052 151846 151679 154240 152410 149833 160774 170212 168533 172334 173161 172927 193205 206286
12200B06286m382n458k194k12K2102J7423J1425J3200K7495M3136M7572P9715
$$ 206286 201904 196446 194252 194040 216142 233565 244990 258190 285685 328821 376393 456108
12188D56108J02985J30083J44788J50735J44427J25024R1578M7145j068n7994
$$ 456108 559093 689176 833964 984699 1129126 1254150 1345728 1392873 1391805 1333811
12178A333811j01397j32077j52152j53293j34572j20771r2098o2819n5611l8491
$$ 1333811 1232414 1100337 948185 794892 660320 539549 447451 384632 329021 290530
12168B90530k6216j7184j5984p278l938j1911q778n919Q42p906r990j307Q688
$$ 290530 264314 247130 231146 223868 219930 208019 199241 193322 194164 186258 176268 174961 183649
12155A83649J4166J89j9403r981l531l095Q956L275r02M855J092P081R818J1688
$$ 183649 197815 198004 178601 168620 165089 161994 170950 174225 173323 178178 179270 186351 196169 207857
12141B07857R124R016J8272K3232K8097K8851L2871M8457O8307N9429N0310M1659
$$ 207857 216981 225997 244269 267501 295598 324449 357320 405777 474084 533513 583823 625482
12129F25482J9834j242j9292l1670k7022l7670l7628k9690k4979j9275K033P360
$$ 625482 645316 644074 624782 593112 566090 528420 490792 461102 436123 416848 418881 426241
12117D26241J2489K0149L2812L3758K7209L2185K6177M153m327l197M628Q902
$$ 426241 438730 458879 491691 525449 552658 584843 611020 615173 610846 607649 612277 621179
12105F21179P569J5091K1322J8346K4255L3272M0013L8293L8082K9455K5883K6260
$$ 621179 628748 643839 665161 683507 707762 741034 781047 819340 857422 886877 912760 939020
12093I39020J8285M807J952p834j6062k5379l7749n3676n0327m6913n1298o0282
$$ 939020 957305 962112 964064 956230 940168 914789 877040 823364 773037 726124 674826 614544
12081F14544n7601l7618k3063j8033j2320r36J0179J2241K4254J8249L5301M7964
$$ 614544 556943 519325 496262 478229 465909 464973 475152 487393 511647 529896 565197 613161
12069F13161M5650M6057L7787K6171j364k1612l3719l6690m3839n1165o1264m7852
$$ 613161 658811 704868 742655 768826 767462 745850 712131 675441 631602 580437 519173 471321
12057D71321m3850l6575k6922l1140k9777q789p300o682p306q880p249m590q114
$$ 471321 427471 390896 363974 332834 303057 294268 286968 280286 272980 264100 256851 252261 244147
12044B44147o320m186j2805j0121K067O870m875p756L127O119Q140J7390J2931
$$ 244147 237827 233641 220836 210715 212782 219652 214777 207021 210148 216267 224407 241797 254728
12031B54728Q214J4882O765n189j4870j2798j1243p909J476j353o590r504J478
$$ 254728 262942 277824 284589 279400 264530 251732 240489 232580 234056 232703 226113 216609 218087
12018B18087m669j1448o020j1482m562L244m215L599K844J874Q85O288K190P351
$$ 218087 213418 201970 195950 184468 179906 183150 178935 182534 185378 187252 188137 194425 196615 203966
12004B03966L202m945l314k329K5o626K132J4348P470O733L076L375O243R195
$$ 203966 207168 202223 198909 196580 196605 189979 192111 206459 213929 220662 223738 227113 233356 242551
11990B42551J464J0106O046p397L203j5580j1949k992n006l202N240O788k227
$$ 242551 244015 254121 260167 252770 255973 240393 228444 225452 220446 217244 222484 229272 227045
11977B27045k978o405n126J469J327j802J354J643m040J1173Q527M423Q963N900
$$ 227045 224067 217662 212536 214005 215332 213530 214884 216527 212487 223660 232187 236610 245573 251473
11963B51473K617J0303J8493J6722R126J5387J8158J2949J1516J1025J9180J1652
$$ 251473 254090 264393 282886 299608 308734 324121 342279 355228 366744 377769 396949 408601
11951D08601j4376l3615k6360k2269k0303r656j0747o711m98P229L64k708J644
$$ 408601 394225 360610 334250 311981 291678 282022 271275 264564 264066 271295 271659 268951 270595
11938B70595P268M744N497L651k944j532J0042J4873P313n51P18M400r118K851
$$ 270595 277863 282607 288104 291755 288811 287279 297321 312194 319507 318956 319674 324074 314956 317807
11924C17807j566q213J136K652p957p691k470N848J494O70k211J422j578M6M058
$$ 317807 316241 308028 309164 311816 303859 296168 293698 299546 301040 301710 299499 300921 299343 299389 303447
11909C03447J122k949m106m64N833O012J444Q683K8517K2558J5637J3932K3191
$$ 303447 304569 301620 297514 297050 302883 308895 310339 319022 347539 370097 385734 399666 422857
11896D22857K4798J6062J7636J8320L3884L9824N3433J12897K25144L22647K48740
$$ 422857 447655 463717 481353 499673 533557 573381 626814 739711 964855 1287502 1536242
11885A536242L403k51585l26603k48292j43229q0869m9863l7710j3746m861M61
$$ 1536242 1539645 1288060 961457 713165 569936 489067 439204 401494 387748 382887 383348
11874C83348p02j977N33Q149J0148R977N228k821j2660n252j1365o823p682n245
$$ 383348 382646 380669 381202 389351 399499 409476 414704 411883 399223 393971 382606 375783 368101 362856
11860C62856k54o168r472k878r304k244l029k230j357J385Q968J1996Q247J4570
$$ 362856 362602 356434 346962 344084 334780 332536 329507 327277 325920 327305 336273 348269 356516 371086
11846C71086N210L535Q617L447Q154J0430J5901N866j793P739J6227J9563J9081
$$ 371086 376296 379831 388448 391895 400049 410479 426380 432246 430453 438192 454419 473982 493063
11833D93063O713J0505J1287P698K710K448N624K869J7090J5952J8406J7593K1868
$$ 493063 499776 510281 521568 529266 531976 534424 540048 542917 560007 575959 594365 611958 633826
11820F33826K7258K3663K963o948j2905r790j3902j7726p742j2724r521J259q708
$$ 633826 661084 684747 687710 680762 667857 658067 644165 626439 618697 605973 596452 597711 589003
11807E89003n635N92O761J7040R247p065r204m015n944j0240n886J314O894m048
$$ 589003 583368 583960 590721 607761 617008 609943 600739 596724 590780 580540 574654 575968 582862 578814
11793E78814J376J7114J4834Q913R335N788N513J1243P259J5621J1088J8395P492
$$ 578814 580190 597304 612138 621051 630386 636174 641687 652930 660189 675810 686898 705293 712785
11780G12785J2352K3531K9078K2546K1340K2155J6380J4945J9463K2950L5037
$$ 712785 725137 748668 777746 800292 821632 843787 860167 875112 894575 917525 952562
11769I52562L5661M0861L7439L4498L5758M5610M8654N0148N6299O4828O9700
$$ 952562 988223 1029084 1066523 1101021 1136779 1182389 1231043 1281191 1337490 1402318 1472018
11758A472018P2908Q1629R7872J19464J45335J75860K04355K12674J99935J81702
$$ 1472018 1544926 1626555 1724427 1843891 1989226 2165086 2369441 2582115 2782050 2963752
11748B963752J35737R0823K9355k6826l9499m6569m0368j7569J3630M7026P6409
$$ 2963752 3099489 3190312 3219667 3192841 3153342 3106773 3066405 3048836 3062466 3109492 3185901
11737C185901J06368J38451J77241J98256K29052K60537K91154L23642L42870
$$ 3185901 3292269 3430720 3607961 3806217 4035269 4295806 4586960 4910602 5253472
11728E253472L59060L86698M26923M81454N38210O16099P29666Q64084J019122
$$ 5253472 5612532 5999230 6426153 6907607 7445817 8061916 8791582 9655666 10674788
11719A0674788J190385J409288J664931J979425K401191K938467L657849M645103
$$ 10674788 11865173 13274461 14939392 16918817 19320008 22258475 25916324 30561427
11711C0561427N956223P607792R542391J1518033J3034257J3317172J1639249
$$ 30561427 36517650 44125442 53667833 65185866 78220123 91537295 103176544
11704A03176544P704701K125226l675983q220538j0686067j1102398j0099153
$$ 103176544 110881245 113006471 109330488 101109950 90423883 79321485 69222332
11697F9222332q375333o427526m512398k754191j171813K51835J540680K706882
$$ 69222332 60846999 54419473 49907075 47152884 45981071 46232906 47773586 50480468
11689E0480468L733784M552463N086656N276574N142835M728866M094113L392238
$$ 50480468 54214252 58766715 63853371 69129945 74272780 79001646 83095759 86487997
11681H6487997K813584K550226K743357L422006M465024N623129O436706O391892
$$ 86487997 89301581 91851807 94595164 98017170 102482194 108105323 114542029 120933921
11673A20933921N116950K616129o43573l861014o285604p445265p353564o335637
$$ 120933921 126050871 128667000 128023427 124162413 117876809 110431544 103077980 96742343
11665I6742343m787026l155876j791200r33876p04162j071089j808849k622730
$$ 96742343 91955317 88799441 87008241 86074365 85370203 84299114 82490265 79867535
11657G9867535l292685l760380m011315m023650l771481l217995k375831j242996
$$ 79867535 76574850 72814470 68803155 64779505 61008024 57790029 55414198 54171202
11649E4171202J46063J799199L753625N980675Q370965J0646593J2295422J2622725
$$ 54171202 54317265 56116464 59870089 65850764 74221729 84868322 97163744 109786469
11641A09786469J0946799O989649J271098m898430r996397j3062106j3988505
$$ 109786469 120733268 127722917 128994015 124095585 114099188 101037082 87048577
11634H7048577j3332559j1769263r879617q032189o410042n085201m034422l205086
$$ 87048577 73716018 61946755 52067138 44034949 37624907 32539706 28505284 25300198
11626B5300198k556318k054622j671897j376495j174898j047305r75146r21956
$$ 25300198 22743880 20689258 19017361 17640866 16465968 15418663 14443517 13521561
11618A3521561q99173q48939p78078p12945o42059n64798m91613m25954l73794
$$ 13521561 12622388 11773449 10995371 10282426 9640367 9075569 8583956 8158002 7784208
11609G784208l22870k71705k31246k04751j96240j97414j98083k08870k17774
$$ 7784208 7461338 7189633 6958387 6753636 6557396 6359982 6161899 5953029 5735255
11600E735255k23528k20246k12930k04006j91585j70312j58057j39182j19701
$$ 5735255 5511727 5291481 5078551 4874545 4682960 4512648 4354591 4215409 4095708
11591D095708j15925j01334q5322o8792p0770p3507p7182r2908r1834r1822q3814
$$ 4095708 3979783 3878449 3793127 3724335 3653565 3580058 3502876 3409968 3318134 3226312 3142498
11580C142498o6096n5690l8317k2281j5914J809J1443K1288K1489R566j2964n5570
$$ 3142498 3076402 3020712 2982395 2960114 2944200 2946009 2957452 2978740 3000229 3009795 2996831 2941261
11568B941261q5616j20304j38530j40845j48488j39611j23325j14480j05469p8293
$$ 2941261 2855645 2735341 2596811 2455966 2307478 2167867 2044542 1930062 1824593 1746300
11558A746300o6851o1689n8186m9812n1617m6527l9942m2920l7779k5898j8389
$$ 1746300 1679449 1617760 1559574 1509762 1458145 1411618 1371676 1328756 1290977 1265079 1246690
11547A246690k5932k1694k1837j3545j8184j4552j7293j6197k1179j6255r099
$$ 1246690 1220758 1199064 1177227 1163682 1145498 1130946 1113653 1097456 1076277 1060022 1050923
11536A050923o26P531Q747K587J8533K6154K9717K2255K9934L4743J9585j378
$$ 1050923 1050297 1057828 1066575 1069162 1087695 1113849 1143566 1165821 1195755 1230498 1250083 1248705
11524A248705j4581l4870n2629o0736n6663m6532m7351l5695l2376l0041k5367
$$ 1248705 1234124 1199254 1146625 1085889 1029226 982694 935343 899648 867272 837231 811864
11513H11864k8163k4168k1952k6464k3028k0489k3352k2830k2603k1776j4927
$$ 811864 783701 759533 737581 711117 688089 667600 644248 621418 598815 577039 562112
11502E62112j6789j3976j8060j8784o238j82o739r981j984k901l186l34j2529
$$ 562112 545323 531347 513287 494503 488265 488083 481344 471363 469379 466478 463292 462958 450429
11489D50429q287j5357j3844o064o445r283L029l056J990n138r791J703O07J702
$$ 450429 442142 426785 412941 406877 400432 391149 394178 391122 393112 387974 378183 379886 380493 382195
11475C82195j1428j1381q896n008R04m608L072P065N426N27j595L184L318N27
$$ 382195 370767 359386 350490 345482 346386 341778 344850 351915 357341 357868 356273 359457 362775 363302
11461C63302n089k455o07r792j3183j4349j718n142l175p175q704r264q206l158
$$ 363302 358213 355758 355151 345359 332176 317827 316109 310967 307792 300617 291913 282649 274443 271285
11447B71285l43j818P50P70K695K168K64k807l273o901r343k198K900K941K805
$$ 271285 270942 269124 269874 270644 273339 275507 275771 272964 269691 262790 253447 251249 254149 257090 259895
11432B59895K234m988P372Q020j671p8k051k750J777L230J758m975j0456p271
$$ 259895 262129 257141 264513 272533 270862 270784 268733 265983 267760 270990 272748 267773 257317 250046
11418B50046J9j668o35j372m636J883p83m532p634n828q89p494n218L99l4j210
$$ 250046 250065 248397 247762 246390 241754 243637 242854 238322 230688 224860 223971 216477 211259 211658 211624 210414
11402B10414k308J34r91m772m584M740L67J018K171J2208L562j329j0801p595
$$ 210414 208106 208240 207249 202477 197893 202633 203000 204018 206189 218397 221959 220630 209829 202234
11388B02234K913K573J061K601j837l711l404k686O62k885q3j779L438J0522N300
$$ 202234 205147 207720 208781 211382 209545 205834 202430 199744 200406 197521 197438 195659 199097 209619 214919
11373B14919R288J6274k258j3325j2666q894j1940p05j0452J778L479Q397Q943
$$ 214919 224207 240481 238223 224898 212232 203338 191398 190693 180241 182019 185498 193895 202838
11360B02838Q272k72q36L202j614j6952l276L013k17m281p188K987J0048M905
$$ 202838 211110 210838 210002 213204 211590 194638 191362 194375 194158 189877 182689 185676 195724 200629
11346B00629n546J688J828J747M681l040k189n966N202J0556J635m438o738q805
$$ 200629 195083 196771 198599 200346 205027 201987 199798 193832 199034 209590 211225 206787 200049 191244
11332A91244L372R191m080N49q863j2189n950L645J0417Q016L637R881O431O691
$$ 191244 194616 203807 199727 200276 191413 179224 173274 176919 187336 195352 198989 208870 215301 221992
11318B21992j320P436L261l928p076n504m493l913K9m180J259K100k269l258n426
$$ 221992 220672 228108 231369 227441 220365 214861 210368 206455 206484 202304 203563 205663 203394 200136 194710
11303A94710K605Q530N713k380R654R74P6J1938J8193J9958K5906K7855L2380
$$ 194710 197315 205845 211558 209178 218832 219806 219882 231820 250013 269971 295877 323732 356112
11290C56112N1560R4947J42756J49716R3630J1537n4155n7426m0789k2957p142
$$ 356112 407672 502619 645375 795091 888721 900258 846103 788677 747888 724931 717789
11279G17789m025K687K0344M1312N5997M2746J8651K09k8242l5975n0777m8471
$$ 717789 713764 716451 736795 778107 834104 876850 895501 895710 867468 831493 780716 732245
11267G32245l4511l4936l3684j4500J035J8889M3579O3864J07071J55395J98582
$$ 732245 697734 662798 629114 614614 615649 634538 678117 741981 849052 1004447 1203029
11256A203029J69510R5537O187m9394m0379k5148r340p591j0470N71J621K1297
$$ 1203029 1372539 1468076 1474263 1424869 1384490 1359342 1350002 1342411 1331941 1332512 1334133 1355430
11244A355430L0039M2761P2360J31640K31545M10758P48621J316312J900480J836255
$$ 1355430 1385469 1428230 1500590 1632230 1863775 2274533 3023154 4339466 6239946 8076201
11234H076201P23368q56086j836492j824284j257763p48318m22565k41095j46251
$$ 8076201 8799569 7943483 6106991 4282707 3024944 2276626 1854061 1612966 1466715
11225A466715q2774n9020m4761m3473n1250n7568n3759n3986j7508L211J9831
$$ 1466715 1383941 1324921 1280160 1236687 1185437 1127869 1074110 1020124 1002616 1005827 1025658
11214A025658J9906m825k7267k7621r892N721M098j5534l6372o7875q5317p9362
$$ 1025658 1045564 1040739 1013472 985851 975959 981680 985778 970244 933872 865997 780680 701318
11202G01318p0719o3725n4023n4694l9503j9881p776p316m539k1906k6086j9007
$$ 701318 630599 566874 512851 458157 418654 398773 390997 383681 379142 357236 331150 312143
11190C12143j9445j3334p490j5431j7776m953q989j0878o146K693K641k480R027
$$ 312143 292698 279364 271874 256443 238667 233714 224725 213847 207701 210394 213035 210555 219582
11177B19582K4410J8037K0517K1705j415o23m162m588M128n482o16m510j8608
$$ 219582 243992 262029 282546 304251 302836 302213 298051 293463 297591 292109 291493 286983 268375
11164B68375k3735j6844j1327j4783j2016q624j2140r666m748r43m174J852m898
$$ 268375 244640 227796 216469 201686 189670 181046 168906 159240 154492 153549 149375 151227 146329
11151A46329K187J2414l651L282J2202L220M774M864R008J1690M855M123J3796
$$ 146329 148516 160930 157279 160561 172763 175983 180757 185621 194629 206319 211174 215297 229093
11138B29093J5912J4187L444K614q329j7304j1477l536l497L644n372m882j2286
$$ 229093 245005 259192 262636 265250 256921 239617 228140 224604 221107 224751 219379 214497 202211
11125B02211j3368n202p055j4641r387j347m39k966l431P081K1216J2719N033
$$ 202211 188843 183641 176586 161945 152558 151211 150772 147806 144375 151456 172672 185391 190424
11112A90424R334K1256K2719L1011L8265K4998O100r883j4113j0430j1269m683
$$ 190424 199758 221014 243733 274744 313009 338007 344107 334224 320111 309681 298412 293729
11100B93729M101R086L67o12O611J9310L7883L8372N4166O3681O9978P5498O9676
$$ 293729 297830 306916 307283 306671 313282 332592 370475 408847 463013 526694 596672 672170 741846
11087G41846M4173R593k0871m8676n2536m1615m4742m7106k8069m964J8152L7413
$$ 741846 786019 795612 774741 726065 673529 631914 587172 540066 511997 507033 525185 562598
11075E62598L6696L9343K3378J8446J8737L748Q411n928j4330p757J9536L0689
$$ 562598 599294 638637 662015 680461 699198 702946 711357 705429 691099 683342 702878 733567
11063G33567L9564K4498p740j7838k294Q766K1532K8365L4512K6685J4926O076
$$ 733567 773131 797629 789889 772051 769757 778523 800055 828420 862932 889617 904543 910619
11051I10619L206n392n847m546K3859N4198J09609J90623L10900M38814N19353
$$ 910619 913825 908433 902586 898040 921899 976097 1085706 1276329 1587229 2026043 2545396
11040B545396M35632J21381k51409m63266m66315l72541k89090k18647j55361
$$ 2545396 2981028 3102409 2851000 2387734 1921419 1548878 1259788 1041141 885780
11031H85780q9737o3444k1572P102K6321L5868L6005L5940L3244L1135L5842N1664
$$ 885780 796043 732599 711027 718129 744450 780318 816323 852263 885507 916642 952484 1004148
11019A004148O0239M3083j2309p9998j22240j16373p3014k8520R194J2717j1424
$$ 1004148 1064387 1107470 1095161 1015163 892923 776550 703536 675016 684210 696927 685503
11008F85503l5590m1218k8808j0863j432q698l6204p2139p2164n9414l1419j1491
$$ 685503 649913 608695 579887 569024 567592 558894 522690 450551 378387 318973 287554 276063
10996B76063n433l922n272M860Q424m205m622L701P010O899J3587L1759N4102
$$ 276063 270630 266708 261436 266296 274720 270515 265893 269594 276604 283503 297090 328849 382951
10983C82951K6513l054j7651k9336j5283N755J3838K4309K5774Q104m318o556
$$ 382951 409464 406410 388759 359423 344140 349895 363733 388042 413816 421920 417602 411046
10971D11046j1549l3140m4573m4106l0730k1747n434L44o010l061j2673j112j210
$$ 411046 399497 366357 321784 277678 246948 225201 219767 220111 214101 211040 198367 197255 196045
10958A96045n147L471N654J58k287n95k855L572Q8K995J2169Q965L89k895j3083
$$ 196045 190898 194369 200023 200181 197894 197299 194444 198016 198104 201099 213268 222233 222622 219727 206644
10943B06644o605k179R040J2359J1423J820q915j1997j9870p504n490p360k589
$$ 206644 200039 197860 206900 219259 230682 232502 223587 211590 191720 184216 178726 171366 168777
10930A68777R706K4090J1951P823J11M331J7680J2186Q830J0519J5268R709j71
$$ 168777 178483 202573 214524 222347 222458 226789 244469 256655 265485 276004 291272 300981 300810
10917C00810j6537j6022k3388j3397o358o518n797m177J0233K354j17m787m385
$$ 300810 284273 268251 244863 231466 225108 218590 212793 208616 218849 221203 221086 216299 211914
10904B11914K07N417L149M45j503K828J2853J2683P591n460l078K642P121J0648
$$ 211914 212121 217538 220687 221132 219629 222457 235310 247993 255584 250124 247046 249688 256809 267457
10890B67457J2618P919K542k556P06o490j3164p856m712m212k584r863n922j96
$$ 267457 280075 287994 290536 287980 288686 282196 269032 261176 256464 252252 249668 239805 233883 233687
10876B33687L031P32l091Q94J3k882P365n1k007O984Q487Q101J1959k35o634P008
$$ 233687 236718 237450 234359 235253 235266 232384 239749 239698 237691 244675 253162 261263 273222 272987 266353 273361
10860B73361P289K2271J5031N207K274q37j2469k1995k6922j5211k052r761n775
$$ 273361 280650 302921 317952 323159 325433 324596 312127 290132 263210 247999 245947 236186 230411
10847B30411J515R601J0130j442k703l742Q56K304N632O343J2589J0051J567J732
$$ 230411 231926 241527 251657 250215 247512 243770 244626 246930 252562 258905 271494 281545 283112 284844
10833B84844J0931J7745J0111k734o039j963p612q183k710M192j232m471n043
$$ 284844 295775 313520 323631 320897 314858 312895 305283 297100 294390 298582 297350 292879 287836
10820B87836L447K968R282Q329N652R275O878K732K29K392R219J4953J0073J3371
$$ 287836 291283 294251 303533 311862 317514 326789 333667 336399 336628 339020 348239 363192 373265 386636
10806C86636J3109K0267J5017J0205O423P432M575j583K276J4799K1124J4262
$$ 386636 399745 420012 435029 445234 451657 459089 463664 462081 464357 479156 500280 514542
10794E14542R101J0819K046J6498K2139J7349K6841L0342M3329L3684L6131M1866
$$ 514542 523643 534462 536508 553006 575145 592494 619335 649677 693006 726690 762821 804687
10782H04687L1991K3261L491o599k4989l2727k9412l0201l2883k1540j6622j891
$$ 804687 836678 859939 863430 856831 831842 799115 769703 739502 706619 685079 668457 666566
10770F66566J069j148j3323L11j975n862J820k150m614n818J065m52p693M536
$$ 666566 667635 666487 653164 653475 651500 645638 647458 645308 640694 634876 635941 635489 627796 632332
10756F32332O354J2314Q882Q109J7949R711N866J1566P797O100O956J5219K1665
$$ 632332 638686 651000 659882 667991 685940 695651 701517 713083 720880 726980 733936 749155 770820
10743G70820J3373J1904J7364K1575K6728J9576J7329P543Q508P918K0402J8374
$$ 770820 784193 796097 813461 835036 861764 881340 898669 906212 914720 922638 943040 961414
10731I61414R030J2260K1690L5482N0536L9901L5092M3198L4694L7731M7478M0195
$$ 961414 970444 982704 1004394 1039876 1090412 1130313 1165405 1208603 1243297 1281028 1328506 1368701
10719A368701N3464N8868M6372M9956M7913O6956Q4283J07187J19468J30756J48860
$$ 1368701 1422165 1481033 1527405 1577361 1625274 1692230 1776513 1883700 2003168 2133924 2282784
10708B282784J90484K34006L04364M07236N29811O21742N49256K69584o7989k78596
$$ 2282784 2473268 2707274 3011638 3418874 3948685 4570427 5119683 5389267 5321278 5042682
10698E042682k90539j73617m2275O2739J46390K11548K78170L41815L95002M59145
$$ 5042682 4752143 4578526 4536251 4598990 4745380 4956928 5235098 5576913 5971915 6431060
10688F431060N23806N92292O76609Q02149R37426J093510J305693J594825J959112
$$ 6431060 6954866 7547158 8223767 9025916 9963342 11056852 12362545 13957370 15916482
10679A5916482K448963L094585L947792N038595O415463Q083994J0070328J2251894
$$ 15916482 18365445 21460030 25407822 30446417 36861880 44945874 55016202 67268096
10671F7268096J4271909J5454969J4864870J1642998N756473j455276p888148
$$ 67268096 81540005 96994974 111859844 123502842 129259315 127804039 119915891
10664A19915891j1932521j3287345j2521104j0502312p991810n525903l342628
$$ 119915891 107983370 94696025 82174921 71672609 63680799 58154896 54812268
10657E4812268j500017O2740J372545K486012L407454M088109M420446M310037
$$ 54812268 53312251 53374991 54747536 57233548 60641002 64729111 69149557 73459594
10649G3459594L702698K709078J631619Q34715N92325R56275J861976L124550
$$ 73459594 77162292 79871370 81502989 82337704 82930029 83886304 85748280 88872830
10641H8872830M574587O041866P356858Q201034Q172526O920663M443808J098999
$$ 88872830 93447417 99489283 106846141 115047175 123219701 130140364 134584172 135683171
10633A35683171k380875n252850o993507p479718o948669n822407m480594l281865
$$ 135683171 133302296 128049446 121055939 113576221 106627552 100805145 96324551 93042686
10625I3042686k499624k294017k693823l497976m334796m860941m964521m676812
$$ 93042686 90543062 88249045 85555222 82057246 77722450 72861509 67896988 63220176
10617F3220176m116285l398187k550282j564160m09296R30252K505234M338965
$$ 63220176 59103891 55705704 53155422 51591262 51181966 52112218 54617452 58956417
10609E8956417O442216Q702438J0787368J2097453J1697609Q761674L363262l229048
$$ 58956417 65398633 74101071 84888439 96985892 108683501 117445175 120808437 117579389
10601A17579389r029980j2520809j3496320j2669529j0995982r113658p343837
$$ 117579389 108549409 96028600 82532280 69862751 58866769 49753111 42409274
10594D2409274n834548m604668l626291k882586k316660j922562j637355j452510
$$ 42409274 36574726 31970058 28343767 25461181 23144521 21221959 19584604 18132094
10586A8132094j339766j279368j228479j169917j098496r99584q87613p66350
$$ 18132094 16792328 15512960 14284481 13114564 12016068 11016484 10128871 9362521
10578I362521o40579n35940m51689l88057l44199l12149k93411k90216l03932
$$ 9362521 8721942 8186002 7734313 7346256 7002057 6689908 6396497 6106281 5802349
10569E802349l27027l41129l23755l01029k79305k64301k35311j96666j72893
$$ 5802349 5475322 5134193 4810438 4509409 4230104 3965803 3730492 3533826 3360933
10560C360933j59547j55929j38529j09699j04788j02023r5327q5467p8879p1200
$$ 3360933 3201386 3045457 2906928 2797229 2692441 2590418 2495091 2409624 2330745 2259545
10550B259545n9278m9777m8294n1456m7078m5751l5092k7773j0248o608k021K5191
$$ 2259545 2200267 2150490 2102196 2050740 2003662 1957911 1922819 1895046 1884798 1878190 1876169 1901360
10538A901360M0408L6370k752p2015j09450j11334q7930o3496n7063n1227l7794
$$ 1901360 1941768 1978138 1975386 1903371 1793921 1682587 1594657 1531161 1474098 1422871 1385077
10527A385077k5865j3616o859j4574j3217j3478j4917j6502j4014j0944k1735
$$ 1385077 1359212 1345596 1338737 1324163 1310946 1297468 1282551 1266049 1252035 1241091 1219356
10516A219356k1517j0269p190j0167N498J4352N891K20o192k3008l1046k6183
$$ 1219356 1197839 1187570 1180380 1170213 1175711 1190063 1195954 1196174 1189982 1166974 1135928 1109745
10504A109745k9662j9731n747o84j035K565K807M033J2557K3418K5077K7791K4718
$$ 1109745 1080083 1060352 1054605 1053921 1052886 1055451 1058258 1062291 1074848 1098266 1123343 1151134 1175852
10491A175852L4599L7158L0050r06j3171l5578l2359l0861k2240k3350k0655j3006
$$ 1175852 1210451 1247609 1277659 1276753 1263582 1228004 1195645 1164784 1142544 1119194 1098539 1085533
10479A085533j8053j7558q225m291K779O789J4838k13j6471l2019n4030n9474
$$ 1085533 1067480 1049922 1041697 1037406 1040185 1046974 1061812 1061599 1045128 1013109 959079 899605
10467H99605n1056k5812j8628k0462k1615j9775j4566k424P177J0284R806J9414
$$ 899605 848549 822737 804109 783647 762032 742257 727691 725267 732444 742728 752534 771948
10455G71948L0430K2596K7667M3977N8534N7823L0026q213n6150o9334o2163l4825
$$ 771948 802378 824974 852641 896618 955152 1012975 1043001 1034788 978638 909304 847141 812316
10443H12316k5464k1507l520r14M137o216k692j843Q558L6503M3076N9209J07259
$$ 812316 786852 765345 761825 760911 765048 758832 756140 754297 762855 799358 842434 901643 1008902
10430A008902J62016K42912L05128K11694k7559k50561l03314k37719j49831q0351
$$ 1008902 1170918 1413830 1718958 1930652 1903093 1652532 1349218 1111499 961668 881317
10420H81317m7790l3902k3333O637K1152K5497L6878M0250K0048l973m9680r8240
$$ 881317 833527 799625 776292 782929 804081 829578 866456 906706 926754 922781 873101 774861
10408G74861j22952r0313l1563L804Q985J1652J5657P175J3404J5831J5018n670
$$ 774861 651909 561596 530033 533837 542822 554474 570131 577306 590710 606541 621559 615889
10396F15889m298P929O360J2480L764l725O16j0241l838R379J7540K4503J8894
$$ 615889 611591 619520 625880 638360 642124 638399 639015 628774 624936 634315 651855 676358 695252
10383F95252J1926qp442q379J51Q688J1274J9801K1896J3252K5416K0932J7012
$$ 695252 707178 707170 699728 691349 691500 700188 711462 731263 753159 766411 791827 812759 829771
10370H29771J6230J1829P804K0597L1675L5322K4214K2347J4236K7978M9436O3036
$$ 829771 846001 857830 865634 886231 917906 953228 977442 999789 1014025 1042003 1091439 1154475
10358A154475M7318K8894q9j3797k610q097m779J2498L1872M1186L8000M0240
$$ 1154475 1201793 1230687 1230598 1216801 1214191 1206094 1201315 1213813 1245685 1286871 1324871 1365111
10346A365111L7755M5782N6047O1742O2088P2412P1973P6714Q4674J21303J87481
$$ 1365111 1402866 1448648 1504695 1566437 1628525 1700937 1772910 1849624 1934298 2055601 2243082
10335B243082L04140M59174N18107K94436p0544l17809l01036j55747m8234P568
$$ 2243082 2547222 3006396 3524503 3818939 3748395 3430586 3129550 2973803 2925569 2933137
10325B933137M9002R1673J02039J09192J24263J44885J58293J91597K49537K83993
$$ 2933137 2982139 3073812 3175851 3285043 3409306 3554191 3712484 3904081 4153618 4437611
10315D437611L02453L11155L41384M09978N05807O08011O91225P66204Q34390
$$ 4437611 4740064 5051219 5392603 5802581 6308388 6916399 7607624 8373828 9208218
10306I208218R54356J182473J534828K008297K476376K632720K168686J415541
$$ 9208218 10162574 11345047 12879875 14888172 17364548 19997268 22165954 23581495
10298B3581495J003182J339420K277767L497271M924330O718725R188303J2806448
$$ 23581495 24584677 25924097 28201864 31699135 36623465 43342190 52530493 65336941
10290F5336941J8339495K6902120M0283329O0953741Q8942216J11732554R8386439
$$ 65336941 83676436 110578556 150861885 211815626 300757842 412490396 510876835
10283E10876835L7274741m1067663r4696570j01467693p9558780n4508398l6300115
$$ 510876835 548151576 507083913 412387343 310919650 231360870 176852472 140552357
10276A40552357k4965804j8175806j3755264j0417992p876445o428309o016567
$$ 140552357 115586553 97410747 83655483 73237491 65361046 58932737 52916170
10269E2916170n926656n468282m622727l964487l769235l731770l494458l005332
$$ 52916170 46989514 41521232 36898505 32934018 29164783 25433013 21938555 18933223
10261A8933223k446156j959057j559317j210350r52874p75123o72474o25248n72423
$$ 18933223 16487067 14528010 12968693 11758343 10805469 10030346 9357872 8732624 8160201
10252H160201m95455m17551l42487l00524k82849k69558k42630k34602k22869
$$ 8160201 7664746 7247195 6904708 6604184 6321335 6051777 5809147 5574545 5351676
10243E351676k08230k04781j99524j81763j60745j39503j19640o9014j5906J9332
$$ 5351676 5143446 4938665 4739141 4557378 4396633 4257130 4137490 4068476 4052570 4071902
10233D071902R365q3520j99989k77489k69082k14549j69758j21954p8811n8068
$$ 4071902 4081267 3997747 3797758 3520269 3251187 3036638 2866880 2744926 2666115 2608047
10223B608047m7481l6273l4397m2356k3930j1508r795k5547l7711m0027k8739
$$ 2608047 2560566 2524293 2489896 2447540 2423610 2412102 2402307 2376760 2339049 2299022 2270283
10212B270283q414M957K0874L6264P3810J17136J56029J34804L8878p9345j64455
$$ 2270283 2261869 2266826 2287700 2323964 2397774 2514910 2670939 2805743 2844621 2765276 2600821
10201B600821j90254j85430j60181j38857j17959r8977o1430l7004k5699m951
$$ 2600821 2410567 2225137 2064956 1926099 1808140 1709163 1647733 1610729 1585030 1580079
10191A580079J0683M4946Q6536J15162R4827O2902O0706R7325J18500N2066p2815
$$ 1580079 1590762 1635708 1722244 1837406 1932233 1995135 2055841 2153166 2271666 2323732 2250917
10180B250917j45855j34566j01214p4359m8824n0815o6486o7723n5708o3078n7090
$$ 2250917 2105062 1970496 1869282 1794923 1746099 1695284 1628798 1561075 1505367 1442289 1385199
10169A385199m7149m3827l5540k4180k4444l110J8860K3946L4403M2111O5355
$$ 1385199 1338050 1294223 1258683 1234503 1210059 1206949 1225809 1249755 1284158 1326269 1391624
10158A391624R1244P8418L9170l05n6991j35939j88187j73098j12674p8384n5665
$$ 1391624 1482868 1561286 1600456 1600151 1543160 1407221 1219034 1045936 933262 854878 799213
10147G99213m3674l6145l0160k6207k4058j8936j9974k2703j8708j1584r561K65
$$ 799213 755539 719394 689234 663027 638969 620033 600059 577356 558648 547064 537503 537768
10135E37768L505k908l665l816j2743j3989j4456j7887r437M204O771p18k561
$$ 537768 541273 538365 534700 530884 518141 504152 489696 471809 462372 466576 473347 472629 470068
10122D70068l686n130j1135j743j0370q550l407r855j4534R22J761P221J3334
$$ 470068 466382 461252 450117 448374 438004 429454 426047 416192 401658 402580 404341 411562 424896
10109D24896K2801J1781P622J291q874j2015r754r936j6034j7280k9096m3710
$$ 424896 447697 459478 467100 468391 459517 447502 437748 427812 411778 394498 365402 321692
10097C21692m6398l8781k6380l933K0558L0281J3331K0844J7944j748j7845q149
$$ 321692 275294 236513 210133 206200 226758 257039 270370 291214 309158 307410 289565 281416
10085B81416O458J1319K939j788j0411k883j629Q484K0854K4527J8352J0617P630
$$ 281416 287874 299193 302132 300344 289933 287050 285421 293905 314759 339286 357638 368255 375885
10072C75885o92N656R428m554r996r427j2611n164o246K294J4501J1691K309J618
$$ 375885 375193 380849 390277 385723 375727 366300 353689 348525 342279 344573 359074 370765 373074 374692
10058C74692J8563L4926L5321K7443J234k3983l1635l9511l2541j9749j4064j2864
$$ 374692 393255 428181 463502 490945 492179 468196 436561 397050 364509 344760 330696 317832
10046C17832j1322r391l637q783L242M890m773p88L486J700m422Q333P925K459
$$ 317832 306510 297119 293482 284699 287941 292831 288058 287270 290756 292456 288034 296367 304292 306751
10032C06751j948k562J122P930j117j1010j1367j6428j3195m15m990j2983m207
$$ 306751 304803 302241 303363 311293 310176 299166 287799 271371 258176 257761 252771 239788 235581
10019B35581P357O539Q694O705J600k436O460K102j5701j4302k152r230n639m312
$$ 235581 242938 249477 258171 264876 266476 264040 270500 272602 256901 242599 240447 231217 225578 221266
10005B21266l166J617l786M124J372K054N47p198q587j0628o909l032j224N390
$$ 221266 218100 219717 215931 220055 221427 223481 224028 216830 208243 197615 190706 187674 186450 191840
9991A91840l999j07O268P281J5742J8838K4178L6858L6839M827k5317m5217l1891
$$ 191840 187841 187734 194002 201283 217025 235863 260041 296899 333738 338565 313248 268031 236140
9978B36140j5855m518o411l168Q239O411m482j2989r762m526p987N49J5309J8488
$$ 236140 220285 215767 209356 206188 214427 220838 216356 203367 193605 189079 181092 181641 196950 215438
9964B15438N220K82n763j0951j4272j9932m370K326k452N472k671l958j1363j1370
$$ 215438 220658 220940 215177 204226 189954 170022 165652 167978 165526 170998 168327 164369 153006 141636
9950A41636j1433m827J4276J5680N524K491o474K791o267m619p52M764L548L154
$$ 141636 130203 125376 139652 155332 160856 163347 156873 159664 153397 148778 148026 152790 156338 159492
9936A59492J213k332Q656N210J23o114m743q712p111q95k626J962j605O623M333
$$ 159492 160705 158373 167029 172239 172362 166248 161505 152793 145682 144787 142161 144123 142518 149141 153474
9921A53474Q36k162l807J505r87L98L185K928o54q11J712N65P904M490n967k671
$$ 153474 154310 152148 148341 149846 148859 149257 152442 155370 154716 153905 155617 156182 164086 168576 162609 159938
9905A59938M134J0410J6838P368M815Q375m486j3161j1275q615j0238j5723j875
$$ 159938 164072 174482 191320 198688 203503 211878 207392 194231 182956 174341 164103 148380 146505
9892A46505Q938J0329K654Q693P49l653Q315J0855k298J2778J4067J1964J0752
$$ 146505 155443 165772 168426 177119 177868 174215 182530 193385 191087 203865 217932 229896 240648
9879B40648j509K043R377J1788J9143J2252J5915K5298K5023L8408M5889N2820
$$ 240648 239139 241182 250559 262347 281490 293742 309657 334955 359978 398386 444275 497095
9867D97095O3486Q9514J30590J81874K61558L72737M93350N32876L57735J5472
$$ 497095 560581 650095 780685 962559 1224117 1596854 2090204 2623080 2980815 2996287
9857B996287l28788m90914m53927l49875k49739j79569j35775r9738p3739n4010
$$ 2996287 2667499 2176585 1722658 1372783 1123044 943475 807700 707962 634223 580213
9847E80213m9882m4529m3095l7441k8258j8033k2488j8628j4096r773p898p176
$$ 580213 530331 485802 442707 405266 377008 358975 336487 317859 303763 293990 286092 278916
9835B78916k106j5531j7522j7149j7805j1815n177k37p620N17P786J5891J0407
$$ 278916 276810 261279 243757 226608 208803 196988 191811 191574 183954 184471 192257 208148 218555
9822B18555j1486j5064m681J747k429r936o531L421N280K8r3n795q159L255n240
$$ 218555 207069 192005 187324 189071 186642 176706 170175 173596 178876 178904 178811 173016 164857 168112 162872
9807A62872j0694k800L925N652P106k643m720J645Q37M045R352R524O729R496
$$ 162872 152178 149378 153303 158955 166061 163418 158698 160343 161180 165225 174577 184101 190830 200326
9793B00326Q508J452R53j2978q835j0501o869K942l028o671N513L238j5m669o937
$$ 200326 208834 210286 211239 198261 189426 178925 172056 174998 171970 165299 170812 174050 174035 169366 162429
9778A62429R41J0354M175K692J4904J6287J4238N159m641j2603p552n364j249
$$ 162429 163370 173724 177899 180591 195495 211782 226020 231179 226538 213935 206383 201019 199770
9765A99770J236o812p47K669k345J3833M861J563P709J0038P007J2143J6145K1188
$$ 199770 201006 194194 193447 196116 193771 207604 212465 214028 221737 231775 238782 250925 267070 288258
9751B88258J9507J6341J0180q94r778j0938O533R303M793R338J8029J8467J5649
$$ 288258 307765 324106 334286 333392 323614 312676 319209 328512 333305 342643 360672 379139 394788
9738C94788J6843K3668M4467M4525N7686P5866Q5785J03472J31776J71595K36158
$$ 394788 411631 435299 479766 524291 581977 657843 743628 847100 978876 1150471 1386629
9727A386629L25674M48578O01159P84180R14699Q65347N28896M4518l51656n05492
$$ 1386629 1712303 2160881 2762040 3546220 4460919 5326266 5855162 5899680 5548024 5042532
9717E042532n14083n24165n75737o08037n75612m70286l64946k57570j86355j31159
$$ 5042532 4528449 4004284 3428547 2820510 2244898 1774612 1409666 1152096 965741 834582
9707H34582r8169q6334o2164m7464m1702l0040k7048j7846k6592k5689k2310j5510
$$ 834582 736413 650079 587915 540451 498749 468709 441661 423815 397223 371534 349224 333714
9695C33714j4583r031p611j1922n522o452o67k128O31j1923l912r438p032k91
$$ 333714 319131 310100 302489 290567 285045 278593 277926 275798 276429 264506 260594 251156 244124 243833
9681B43833l541o362J793n323o398k865k789K058R94L095q591q080K399n278k272
$$ 243833 240292 233930 235723 230400 224002 221137 218348 220406 221400 224495 215904 207824 210223 204945 202673
9666B02673k497O544K667q153N869O077m731m31J20n765l983O217J0732k725o201
$$ 202673 200176 206720 209387 201234 207103 213180 208449 208018 208138 202373 198390 204607 215339 212614 206413
9651B06413M365j952l426K306j0480n630M141N511N064J592K604O178l770p669
$$ 206413 210778 208826 205400 207706 197226 191596 195737 201248 206312 207904 210508 216686 212916 205247
9637B05247k362k649j969k189N105O38L863O670Q030p891J259P705K989R53l284
$$ 205247 202885 200236 198267 196078 201183 201821 205684 212354 220384 212493 213752 221457 224446 225399 222115
9622B22115l76N093P775N989L586P711J4270R966O837O941J0844K0794K4404J0034
$$ 222115 221739 226832 234607 240596 244182 251893 266163 276129 282966 289907 300751 321545 345949 355983
9608C55983J2272P743J1228O431n693j1211q231j2487k3572j8939j3900r568j7737
$$ 355983 368255 375998 387226 393657 387964 376753 368522 356035 332463 313524 299624 290056 272319
9595B72319j0857J664k008p361p426k654j987k614m704k286J851n697n087On531
$$ 272319 261462 263126 261118 253757 246331 243677 241690 239076 234372 232086 233937 228240 223153 223159 217628
9580B17628q554K786Q848N785R421k028K255l901l177L970J346n625N657J1771
$$ 217628 209074 211860 220708 226493 235914 233886 236141 232240 229063 233033 234379 228754 234411 246182
9566B46182Q175L511m886j948m286O00J606j953K810R42O713j903j254N244O603
$$ 246182 254357 257868 252982 251034 246748 247348 248954 247001 249811 250753 257466 255563 254309 259553 266156
9551B66156K702l498m668k714M677L120L369r308L338J856m853m563J0051L16
$$ 266156 268858 265360 260692 257978 262655 265775 269144 259836 263174 265030 260177 255614 265665 265981
9537B65981K951N966M773o475K874J5398K5797K5841J9260J6351n862k9004k2487
$$ 265981 268932 274898 279671 273196 276070 291468 317265 343106 362366 378717 372855 343851 321364
9524C21364j1321p910J060O440l383m271M975Q61L34O73Q601R773K1518J7140
$$ 321364 310043 302133 303193 309633 306250 301979 306954 307815 308149 308822 317423 327196 348714 365854
9510C65854K1081P595K530q296j8289k3818r242p225j0468j0263n54R643L604
$$ 365854 386935 394530 397060 388764 370475 346657 337415 330190 319722 309459 308905 318548 322152
9497C22152K930J115K160j30N472M674j098n322L928k536l027L014O456N568l926
$$ 322152 325082 326197 328357 328227 333699 338373 337275 331953 335881 333345 330318 333332 339788 345356 341430
9482C41430M920R570J109J448o80j589R98K623J497M548m484k747j498J609O591
$$ 341430 346350 355920 357029 358477 357797 356208 357206 359829 361326 365874 361390 358643 357145 358754 365345
9467C65345K384n484k634K716m607l409j148O071J0790Q63j577N922Q769R362
$$ 365345 367729 362245 359611 362327 357720 354311 353163 359234 370024 370887 369310 375232 384001 393363
9453C93363K330K14M4q79K595N360L483J677K265J973K205J748k368J500J132
$$ 393363 395693 395907 395951 395072 397667 403027 406510 408187 410452 412425 414630 416378 414010 415510 416642
9438D16642k347N990N974k007k978J340J343R854J0578N60M374M078R016L604
$$ 416642 414295 420285 426259 424252 421274 422614 423957 433811 444389 444949 449323 453401 462417 466021
9424D66021k536k939L683N899O203J6089k985J571l365L824Q841Q403q790l362
$$ 466021 463485 460546 464229 470128 476331 492420 489435 491006 487641 491465 500306 508709 499919 496557
9410D96557Q680L450Q968L820P044o3Q419Q229R485j43m23l29O605k886O643J1463
$$ 496557 505237 508687 517655 521475 528519 528456 536875 545104 554589 554446 554023 553694 560299 557413 564056 575519
9394E75519N338J600J5338P281M35R609O579P348J0628N978J0246O667n594L501
$$ 575519 580857 582457 597795 605076 605511 615120 621699 629047 639675 645653 655899 662566 656972 660473
9380F60473O504m302L079J086K807K386J303J079J576M182N736K127J583j737
$$ 660473 666977 662675 665754 666840 669647 672033 673336 674415 675991 680173 685909 688036 689619 687882
9366F87882N120M390K67L04J0013J3554J0816Q384P542R418P19K597J3152J4364
$$ 687882 693002 697392 697659 697963 707976 721530 732346 740730 748272 757690 758409 761006 774158 788522
9352G88522J0571J7338J2368J0665N692j86K667L409L058R353J2310J1600J0557
$$ 788522 799093 816431 828799 839464 845156 844970 847637 851046 854104 863457 875767 887367 897924
9339H97924K19O758J2074Q163R493J1300R516k54n969J754J2525L953M023J3693
$$ 897924 898143 904901 916975 925138 934631 945931 955447 955193 949224 950978 963503 967456 971479 985172
9325I85172Q671J1259P722J4412Q308K4384J4105J7609K3073K1665K2161J4453
$$ 985172 993843 1005102 1012824 1027236 1035544 1059928 1074033 1091642 1114715 1136380 1158541 1172994
9313A172994K1452J6431J1121M969j23l406j915j06K661J0530J0446N897J6517
$$ 1172994 1194446 1210877 1221998 1226967 1226844 1223438 1221523 1221417 1224078 1234608 1245054 1250951 1267468
9300A267468J7301J7896K2795K0438R442K0404J3314J5580K4884K2676K2305J6589
$$ 1267468 1284769 1302665 1325460 1345898 1355340 1375744 1389058 1404638 1429522 1452198 1474503 1491092
9288A491092R063J6152K2527K3053K3389J9088K2639K0776J4119K7451K7970K1642
$$ 1491092 1500155 1516307 1538834 1561887 1585276 1604364 1627003 1647779 1661898 1689349 1717319 1738961
9276A738961K2911L3309K7381K2367J9368K6187J7969K3113K8653K6134K2367
$$ 1738961 1761872 1795181 1822562 1844929 1864297 1890484 1908453 1931566 1960219 1986353 2008720
9265B008720K9450L4899L4145L2766L3706K9441L2840L4143L4461L1993M1054
$$ 2008720 2038170 2073069 2107214 2139980 2173686 2203127 2235967 2270110 2304571 2336564 2377618
9254B377618M7651L9771M0387L4814M1967N8200N4881N0068M7183L3083M7936
$$ 2377618 2425269 2465040 2505427 2540241 2582208 2640408 2695289 2745357 2792540 2825623 2873559
9243B873559N8873N9851N6497N3117N3738N5893O2471O3386O6761O9957N9959
$$ 2873559 2932432 2992283 3048780 3101897 3155635 3211528 3273999 3337385 3404146 3474103 3534062
9232C534062O5355O4709P1455P5074O7427Q0361P4532Q7973R6953R1075R9302
$$ 3534062 3599417 3664126 3735581 3810655 3878082 3958443 4032975 4120948 4217901 4308976 4408278
9221D408278J00254R9732J14391J08276J12249J28646J20174J14781J25410J32470
$$ 4408278 4508532 4608264 4722655 4830931 4943180 5071826 5192000 5306781 5432191 5564661
9211E564661J30795J40515J49332J62597J61180J67276J75503J92225K04129K02107
$$ 5564661 5695456 5835971 5985303 6147900 6309080 6476356 6651859 6844084 7048213 7250320
9201G250320K13846K34903K52929K73014K92458K96393K84246K55187K40840K53905
$$ 7250320 7464166 7699069 7951998 8225012 8517470 8813863 9098109 9353296 9594136 9848041
9191I848041K66603K87699L17708L41297L68519L98465M20416M37441M64978M98810
$$ 9848041 10114644 10402343 10720051 11061348 11429867 11828332 12248748 12686189 13151167 13649977
9181A3649977N20784N44864N66332N77288N89950O11187O32531O72060P09398
$$ 13649977 14170761 14715625 15281957 15859245 16449195 17060382 17692913 18364973 19074371
9172A9074371P32638P69611Q23482Q52475R07989R55060R87230J025223J092363
$$ 19074371 19807009 20576620 21400102 22252577 23160566 24115626 25102856 26128079 27220442
9163B7220442J156344J226722J296167J368849J405494J371421J313317J260874
$$ 27220442 28376786 29603508 30899675 32268524 33674018 35045439 36358756 37619630
9155C7619630J237415J248426J281628J298661J281333J259851J225478J155797
$$ 37619630 38857045 40105471 41387099 42685760 43967093 45226944 46452422 47608219
9147D7608219J070660R71695Q62616P34233N85490M32228K65772Q8997o9436k39931
$$ 47608219 48678879 49650574 50513190 51247423 51832913 52265141 52530913 52619910 52550474 52310543
9137E2310543m10791n71038p31176q74339r94872j082800j160473j225966j280911
$$ 52310543 51899752 51328714 50597538 49723199 48728327 47645527 46485054 45259088 43978177
9128D3978177j317995j338791j333024j333659j321522j296473j282811j277229
$$ 43978177 42660182 41321391 39988367 38654708 37333186 36036713 34753902 33476673
9120C3476673j270455j257139j243995j181995j145134j093733j041243r91684
$$ 33476673 32206218 30949079 29705084 28523089 27377955 26284222 25242979 24251295
9112B4251295r46752r07267q70245q31031p90197p48957p10406o87956o50350
$$ 24251295 23304543 22397276 21527031 20696000 19905803 19156846 18446440 17758484 17108134
9103A7108134o22403n98662n52580n33998n03493m91125m70250m32236m24168
$$ 17108134 16485731 15887069 15334489 14800491 14296998 13805873 13335623 12903387 12479219
9094A2479219m06328l94295l78273l59186l35694l23723l13404l01535k95296
$$ 12479219 12072891 11678596 11300323 10941137 10605443 10281720 9968316 9666781 9371485
9085I371485k74822k50811k54025k46658k36812k31333k22551k05177j93833j93519
$$ 9371485 9096663 8845852 8591827 8345169 8108357 7877024 7654473 7449296 7255463 7061944
9075G061944j81858j74481j73168j65247j54630j43194j44947j44560j44042j33349
$$ 7061944 6880086 6705605 6532437 6367190 6212560 6069366 5924419 5779859 5635817 5502468
9065E502468j30667j30095j17800j06767j02261j10491j00188r5132r4784r5751
$$ 5502468 5371801 5241706 5123906 5017139 4914878 4804387 4704199 4609067 4514283 4418532
9055D418532j02852r0536q5582q1696p5659p3434p4432o8946p4851q1280o7203
$$ 4418532 4315680 4225144 4139562 4057866 3982207 3908773 3834341 3765395 3690544 3609264 3542061
9044C542061o0294o2399n7759n2255n1623n2195n2955n0188n5533o0640m8084
$$ 3542061 3481767 3419368 3361609 3309354 3257731 3205536 3152581 3102393 3046860 2986220 2938136
9033B938136m6180m7733n3922n2464m1048m7985m5282l2875l7816l2161m4276
$$ 2938136 2891956 2844223 2790301 2737837 2696789 2648804 2603522 2570647 2532831 2500670 2456394
9022B456394m1512m1657l2450k9723l3453k8196k2698k6348k9719l3706l4072
$$ 2456394 2414882 2373225 2340775 2311052 2277599 2249403 2226705 2200357 2170638 2136932 2102860
9011B102860k8832k5635k1684k7095k1506k7503k6322k7843k4480k8526l2630
$$ 2102860 2074028 2048393 2026709 1999614 1978108 1950605 1924283 1896440 1871960 1843434 1810804
9000A810804k7920j9089k6448l0861l0944k4879j6354j3942j8340k2698k2006
$$ 1810804 1782884 1763795 1737347 1706486 1675542 1650663 1634309 1620367 1602027 1579329 1557323
8989A557323j9275j7876j4979j9566j9503j5262j8303j5883j3955k3062j7970
$$ 1557323 1538048 1520172 1505193 1485627 1466124 1450862 1432559 1416676 1402721 1379659 1361689
8978A361689j9563j2359j7071j6580j0401j8033j6007j2950j2495j5062j0688
$$ 1361689 1342126 1329767 1312696 1296116 1285715 1267682 1251675 1238725 1226230 1211168 1200480
8967A200480r333l915j4622k1624l183l243j8358k3135j6869j1019r637l124j4285
$$ 1200480 1191147 1187232 1172610 1150986 1147803 1144560 1126202 1103067 1086198 1075179 1065542 1062418 1048133
8954A048133j0115l542p010r504p554j2768j0913p847r568j0270j1866J475p657
$$ 1048133 1038018 1034476 1027466 1017962 1010408 997640 986727 978880 969312 959042 947176 948651 940994
8941I40994j8159j3728j1962m184L814j2820j9168r997j0596j122L814N959J987
$$ 940994 922835 909107 897145 892961 896775 883955 864787 854790 844194 843072 846886 852845 854832
8928H54832N651M718j3497j5706j7289j5465j2710o709j2106l498K073r96o246
$$ 854832 860483 865201 851704 835998 818709 803244 790534 783825 771719 768221 770294 769298 763052
8915G63052j2403k187n327r765K415N506r595k0154q407Q2m226o354j0361j3300
$$ 763052 750649 748462 743135 733370 735785 741291 731696 711542 703135 703217 698991 692637 682276 668976
8901F68976j1779j65L625J307p951k125M098p202o435J61k872q127l613m997j369
$$ 668976 657197 657032 660657 661964 654013 651888 655986 648784 642349 642510 639638 631511 627898 622901 621532
8886F21532J82N350R576l311j4940k0869j0249l396K752o805j0259j758k590j333
$$ 621532 621714 627064 636640 633329 618389 597520 587271 583875 586627 579822 569563 567805 565215 563882
8872E63882M61m744k963L164M561L985P773l124j336M843j4634j4118j1513q995
$$ 563882 564343 559599 556636 559800 564361 568346 576119 572995 571659 576502 561868 547750 536237 527242
8858E27242o008k005l711L2K488L209Q309N037J1693N871L748L423N54J2776J3886
$$ 527242 521234 519229 515518 515550 518038 521247 529556 534593 546286 552157 555905 559328 559882 572658 586544
8843E86544J6312K1174M1159P4405J15406K00558L11649L85806K52540n1380l16572
$$ 586544 602856 624030 665189 739594 855000 1055558 1367207 1753013 2005553 1954173 1637601
8832A637601l62476k64261j70008j03209n9770m4894l2129j1403r418j5386j4900
$$ 1637601 1275125 1010864 840856 737647 677877 632983 600854 589451 580033 564647 549747
8821E49747p208j3061p952m640o975j7982j8244j2170j2981k940j930p000L433
$$ 549747 542539 529478 521526 516886 509911 491929 473685 461515 448534 445594 443664 436664 440097
8808D40097p98L426l263k610J892r445j4625p969P954N812o161m396r565m512
$$ 440097 439299 442725 439462 436852 438744 429299 414674 406705 414659 420471 414310 409914 400349 395837
8794C95837k361o750k762N585k206O88J1184K420j017n950L482J959j684p014
$$ 395837 393476 386726 383964 389549 387343 388031 399215 401635 400618 394668 398150 400109 398425 391411
8780C91411j9j726L934J936r001r922O196o7J913R8m150n492K444O524j206O376
$$ 391411 391392 389666 393600 395536 386535 376613 382809 382742 384655 384753 380603 375111 377555 384079 382873 389249
8764C89249N391j091j0263o797Q026J0573k792k440J180k385o13k97J255K630
$$ 389249 394640 393549 383286 376489 384515 395088 392296 389856 391036 388651 388038 387741 388996 391626
8750C91626m784O505M718p051m266Q207J1622N723q333j3249k0046n865M879L574
$$ 391626 386842 393347 398065 391014 386748 394955 406577 412300 403967 390718 370672 364807 369686 373260
8736C73260l858j432J544O60K24n547q242n499j766O221L999K298M45J406l61
$$ 373260 369402 367970 369514 370174 370398 364851 356609 351110 349344 355565 359564 361862 362307 363713 363352
8721C63352L876k536O291M035r650l543J1563q60k89N507J377P629J4304J1670
$$ 363352 367228 364692 370983 375018 365368 361825 373388 372528 372239 377746 379123 386752 401056 412726
8707D12726O263Q810K1375J2679J6079J4634O178j1430j4015r563j0799m217j5723
$$ 412726 418989 427799 449174 461853 477932 492566 498744 487314 473299 463736 452937 448720 432997
8694D32997j2632p205k293M357L025k375q305p810P955O740q095r546o156J2801
$$ 432997 420365 413160 410867 415224 418249 415874 407569 399759 407714 414454 406359 396813 390657 403458
8680D03458K379p650M192j342J725R22L971J265P153O494K932j723J737M199k685
$$ 403458 405837 398187 402379 401037 402762 403684 407655 408920 416073 422567 425499 423776 425513 429712 427027
8665D27027M278l218n432j090m752L132L744J0182J1435N763l805j635j727K228
$$ 427027 431305 428087 422655 421565 416813 419945 423689 433871 445306 451069 447264 445629 443902 446130
8651D46130N858J588j629n686J2294R585j442K325P023N863O664Nm205M4R021
$$ 446130 451988 453576 451947 446261 458555 468140 466698 469023 476046 481909 488573 488578 484373 484417 493438
8636D93438J71L340J607j385m149p74P368N270l245Q485Q532K584K201n743N802
$$ 493438 493609 496949 498556 497171 493022 492248 499616 504886 501641 510126 518658 521242 523443 517700 523502
8621E23502P242L060N603J6353R710M827O617O992J2004O721o78M495K102j072
$$ 523502 530744 533804 539407 555760 565470 570297 576914 583906 595910 602631 601953 606448 608550 607478
8607F07478R397O699K863O029J7739J7284O733J2797J0703J2466K0754J4874J0252
$$ 607478 616875 623574 626437 632466 650205 667489 674222 687019 697722 710188 730942 745816 756068
8594G56068J1602J6238K9279J8493K0003K2526L0092L0482L3733M6435N1397M9447
$$ 756068 767670 783908 813187 831680 851683 874209 904301 934783 968516 1014951 1066348 1115795
8582A115795N8875O5332O3287O4979P5425Q9310R9969J09405J34139J60448J71747
$$ 1115795 1174670 1240002 1303289 1368268 1443693 1533003 1632972 1742377 1876516 2036964 2208711
8571B208711J96402K12033K32495K64876K85477L18826L50381L59935L20786K00548
$$ 2208711 2405113 2617146 2849641 3114517 3399994 3718820 4069201 4429136 4749922 4950470
8561D950470k5960l01934m97982n59296n05326m19883l26441k57476k07207j67958
$$ 4950470 4924510 4622576 4124594 3565298 3059972 2640089 2313648 2056172 1848965 1681007
8551A681007j52373j36874j13532q7640p8549p6772o1587n5107m9551l9980l1042
$$ 1681007 1528634 1391760 1278228 1190588 1112039 1035267 973680 918573 869022 829042 798000
8540G98000k7269k9359j8728k0731k2559k3177j6962j4496k0861j9992l233q876
$$ 798000 770731 741372 722644 701913 679354 656177 639215 624719 603858 583866 580633 571757
8528E71757q798j6381j3315q336Q71M662l037O576J0079P753K335j6858j9637
$$ 571757 562959 546578 533263 524927 525798 530460 527423 533999 544078 551831 554166 537308 517671
8515E17671j8480r317j5060j6159n676L097k686k346n674l336K620k055M960J1780
$$ 517671 499191 489874 474814 458655 452979 456076 453390 451044 445370 442034 444654 442599 447559 459339
8501D59339N373l079j2557j4661j3409j3575p113nq241n877P11Q552j525L611
$$ 459339 464712 461633 449076 434415 421006 407431 400318 400313 392072 386195 386906 395458 393933 397544
8487C97544L153j5664j8266j7750q633q13J545K357P098N910J6831K3129J7735
$$ 397544 400697 385033 366767 349017 340384 339571 341116 343473 350571 356481 373312 396441 414176
8474D14176O813j9959l1703l4585k6291o324j1390o690q63J599Q944J8047J8940
$$ 414176 420989 401030 369327 334742 308451 302127 290737 284047 283184 284783 293727 311774 330714
8461C30714J309j4238p725j7124r152J550r211j5213m524K74J025j665K687k612
$$ 330714 332023 317785 310060 292936 283784 285334 276123 260910 256386 256660 257685 256020 258707 256095
8447B56095n934Q60l695l860l442M216N046K527K276j861r945k131R802J2398
$$ 256095 250161 251021 247326 243466 240024 244240 249286 251813 254089 252228 242283 240152 249954 262352
8433B62352J2368P197M742m308q658j8069k2056j6124q73J96R320M786n829q08
$$ 262352 274720 281917 286659 282351 273693 255624 233568 217444 216571 216767 226087 230873 225044 224236
8419B24236q4l451j1137q199j371l840P79K42o098M473M444k255N000L624K285
$$ 224236 224152 220701 209564 201365 199994 196154 196933 197175 191077 195550 199994 197739 202739 206363 208648
8404B08648n020m08J5174L325j712L18o18l441M246p779l316r59M627N872J951
$$ 208648 203628 203220 218394 221719 220007 220325 219707 216266 220512 212733 209417 208458 213085 218957 220908
8389B20908j186l424n789p941K842J653L404N101J0244L703P929J7462J6135Q643
$$ 220908 219722 216298 210509 202568 205410 207063 210467 215568 225812 229515 237444 254906 271041 279684
8375B79684j201m425N233J475K695P14p475j3432j4130j3981k3404j6435o209
$$ 279684 278483 274058 279291 280766 283461 284175 276700 263268 249138 235157 211753 195318 189109
8362A89109k528O653J1626p44o712r386Q43j086o288N3J1709L895K61N255m337
$$ 189109 186581 193234 204860 204116 197404 188018 188861 187775 181487 181540 193249 197144 197405 202660 198323
8347A98323j533O551L484K161N612O483l20Q70R514J8288K8970K3866J8156J6349
$$ 198323 196790 203341 206825 208986 214598 221081 220761 221631 231145 249433 278403 302269 320425 336774
8333C36774L74r293j4013p958j1821k0289j8487j5402j0490j9195k1000r10J705
$$ 336774 337148 327855 313842 305884 294063 273774 255287 239885 229395 210200 189200 188290 189995
8320A89995p005n542p90J401L281k577L416K055n835Q656J104j775J779p914j2197
$$ 189995 182990 177448 176658 178059 181340 178763 182179 184234 178399 187055 188159 186384 188163 180249 168052
8305A68052o410k458N69k5P548O499O558L247R001J0946J2823R053j137j4038
$$ 168052 161642 159184 159753 159728 167276 173775 180333 183580 192581 203527 216350 225403 224266 210228
8291B10228j8569j2012k549k328j0244n595l765K917j328K605j124O654P877j402
$$ 210228 191659 179647 177098 174770 164526 158931 155166 158083 156755 159360 158236 164890 172767 171365
8277A71365k868j252j350M123j914j325l287n485K893k65j0494o737l641K488
$$ 171365 168497 167245 165895 170018 168104 166779 163492 158007 160900 160635 150141 143404 139763 142251
8263A42251M160N627K684r277o491j752L541L747k028Q45l138m67o451j268O838
$$ 142251 146411 152038 154722 145445 138954 137202 140743 144490 142462 143307 140169 139702 133251 131983 138821
8248A38821k440l005m511o304N20J1018j563j401k051K290r74j714j59n074k373
$$ 138821 136381 133376 128865 122561 123081 134099 132536 131135 129084 131374 130400 128686 128527 123453 121080
8233A21080k522o524j033N916k365o067R224O663K231L56N73l936p821P550K181
$$ 121080 118558 112034 111001 116917 114552 108485 117709 124372 126603 126959 127532 123596 115775 123325 125506
8218A25506n404p465K989O439J212Q821o27j4567p169N464k776L454l43l366J625
$$ 125506 120102 112637 115626 122065 123277 132098 131471 116904 109735 115199 112423 115877 115534 112168 113793
8203A13793Q43n141q189o35J424r253n486K982P090p53K779j206M720L269k182
$$ 113793 114636 109495 101306 100671 102095 92842 87356 90338 97428 96675 99454 98248 102968 106237 104055
8188A04055K134N178j3804m622P423L146m187L160L377K920p618q764j661K208
$$ 104055 106189 111367 97563 92941 100364 103510 99323 102483 105860 108780 101162 92398 90737 92945
8174I2945J316m187p1N586j381O23j851o371n777N52P429L868R329L946k59k672
$$ 92945 94261 90074 90003 95589 94208 94831 92980 86609 80832 81384 88813 92681 102010 105956 105697 103025
8158A03025M996m77K185l393k793J428L669M005o582o914M056n59P99l69P295
$$ 103025 108021 107544 109729 106336 103543 104971 108640 112645 106063 99149 103205 102646 103445 103076 110371
8143A10371L430k449P832J7987R929J632O722J5873K588j0203j4311p032j2439
$$ 110371 113801 111352 119184 137171 147100 148732 155454 171327 173915 163712 149401 142369 129930
8130A29930r772m407q27m035l118n60o171m336L847J0233m340j7212O483J3726
$$ 129930 120158 115751 114924 110889 107771 107211 101040 96704 100551 110784 106444 89232 95715 109441
8116A09441N763o636o344O152K894n265j40M345p765MR13J0965M856J997L074
$$ 109441 115204 108568 102224 108376 111270 106005 105865 110210 102445 102449 103362 114327 119183 121180 124254
8101A24254j601q291l554k9Q884J7655J4818J0829K8720L3151L4286J9564j694
$$ 124254 122653 114362 110808 110779 119663 137318 152136 162965 191685 224836 259122 278686 276992
8088B76992k4123k8896k0460j9617j7904j4931o914J0631P926K482k862j652j943
$$ 276992 252869 223973 203513 183896 165992 151061 144147 154778 162704 165186 162324 160672 158729
8075A58729Q35m259l246Q625M64m622j183J255N669J5207Q794K05L401m263n515
$$ 158729 159564 155305 152059 160684 161148 156526 155343 156598 162267 177474 186268 186473 189874 185611 180096
8060A80096k785L946L910o885j0913o767n898j5115o75J1572K673r46O078P864
$$ 180096 177311 181257 185167 178282 167369 160602 154704 139589 138914 150486 153159 152213 158291 166155
8046A66155J0170J8030J951O076P030p728j0570n493R02J567K665M209J1402K2480
$$ 166155 176325 194355 196306 202382 209412 201684 191114 185621 186523 188090 190755 194964 206366 228846
8032B28846J7607J7412J0532o834j3692j0108l271J101N851M377J7193J6851K3172
$$ 228846 246453 263865 274397 267563 253871 243763 240492 241593 247444 251821 269014 285865 309037
8019C09037J7984J7802J8957J603k825J051l630L917J777J788k258p180j3726
$$ 309037 327021 344823 363780 365383 362558 363609 359979 363896 365673 367461 365203 358023 344297
8006C44297o292q632q003k578O02K239j949N071J8K367q18L439M573j048K563
$$ 344297 338005 329373 321370 318792 319394 321633 319684 324755 324773 327140 326322 329761 334334 333286 335849
7991C35849o989p475o49K798R366Q674Q017J2516J5973J0815R169P336R828M985
$$ 335849 328860 321385 320736 323534 332900 341574 349591 362107 378080 388895 398064 405400 415228 420213
7977D20213J9972K7294L1833K9238L0838K8681M0360O3113O3647N1697K4023k0040
$$ 420213 440185 467479 499312 528550 559388 588069 628429 691542 755189 806886 830909 810869
7965H10869m9336o2369n4303l0151k0211m858M932p142j7876k5668k4325k5427
$$ 810869 761533 699164 644861 614710 594499 589641 594573 587431 569555 543887 519562 494135
7953D94135j9648k2425j6872k6299j9612o928q893j801J1739L618J0627J6977
$$ 494135 474487 452062 435190 408891 389279 382351 373458 371657 383396 387014 397641 414618
7941D14618J6163J5719K2590J7222J8602J3437M267J3757J5792J1077J6729J5121
$$ 414618 430781 446500 469090 486312 504914 518351 522618 536375 552167 563244 579973 595094
7929E95094K3838K7301K3426J8316M668j5461j0407L64j5713j9608j6099k5835
$$ 595094 618932 646233 669659 687975 692643 677182 666775 667139 651426 631818 615719 589884
7917E89884k2213k6066l1394k2724k8252l7299j7091k0385j3567j0004j3261m583
$$ 589884 567671 541605 510211 487487 459235 421936 404845 384460 370893 360889 347628 343045
7905C43045J605J12j504P774M492L284J0870R987o68J581O502P931L39k392m346
$$ 343045 344650 344762 343258 351032 355524 358808 369678 379665 378997 380578 387080 395011 395350 392958 388612
7890C88612r114L979p632q004M293k660m588n329M754O056m792j4186j6284n518
$$ 388612 379498 383477 375845 367841 372134 369474 364886 359557 364311 370367 365575 351389 335105 329587
7876C29587p206j9402k3510j5759j1390j8892j9620m606o233l580o563j3797m497
$$ 329587 322381 302979 279469 263710 252320 233428 213808 209202 202969 199389 192826 179029 174532
7863A74532n614r84j690l450p325K087k372o098q566j625N560O622l917m773K124
$$ 174532 168918 167934 166244 162794 155469 157556 155184 149086 140520 138895 144455 151077 147160 142387 144511
7848A44511k983k381P669L875j1834r60M320K235r4m25J046J851n728r148r035
$$ 144511 141528 139147 146816 150691 138857 137897 142217 144452 144358 143933 144979 146830 141102 131954 122919
7833A22919j274j95K500l550j3442n536O126o346j3224l730P197M647J879o871
$$ 122919 121645 121450 123950 120400 106958 101422 107548 101202 87978 84248 91445 96092 97971 91100
7819I1100m602J380K324M51J769L912P02k335m332k906Q075j297m564L26N482
$$ 91100 86498 87878 90202 90653 92422 96334 97036 94701 90369 87463 95538 94241 89677 90003 95485
7804I5485p09q718k241o296n302N50P656P125n653m381K288j612j0109j820N934
$$ 95485 94776 86058 83817 77521 72219 72769 80425 87550 81897 77516 79804 78192 68083 66263 72197
7789G2197l557m62k882K33l288K544M435K146n938q97P560Q961K435j1053m604
$$ 72197 68640 68178 65296 65529 62241 64785 69220 71366 65428 64531 72091 81052 83487 72434 67830
7774F7830n14L444J312m762p475o666K339L753M824l123M401N862l472o651N005
$$ 67830 67316 70760 72072 67310 59835 53169 55508 59261 64085 60962 65363 71225 67753 61102 66107
7759F6107K336K49p572o675l323K437O343J1512L283l808l784p67N399Q583J0096
$$ 66107 68443 68692 61120 54445 51122 53559 59902 71414 74697 70889 67105 66338 71737 80320 90416
7744I0416J0595J7290K7542K9298M7013L9480J1005j5302l5364m9215l3554k4539
$$ 90416 101011 118301 145843 175141 222154 261634 272639 257337 221973 172758 139204 114665
7732A14665k5038q652r419j2355n028J0878l4m135p310O89l048o04o2l537p411
$$ 114665 89627 80975 71556 59201 54173 65051 65017 60882 53572 54261 51213 50609 50547 47010 39599
7717C9599r390J694N874n95k246m251q557J782J947j420M088K50l29m166k636
$$ 39599 30209 31903 37777 37182 34936 30685 22128 23910 25857 24437 28525 28775 28446 24280 21644
7702B1644M516R443N060l913o901k764L546M461M675p05k215j0464n567l353n089
$$ 21644 26160 35603 40663 36750 29849 27085 30631 35092 39767 39062 36847 26383 20816 17463 12374
7687A2374n42J0091L325k155j370j775m248j581m49M065L171m142Q34O76N836
$$ 12374 11832 21923 25248 23093 21723 19948 15700 14119 13670 17735 20906 16764 17598 18274 24110
7672B4110j682j0407q7J806M26K5M119j893L145n40r507j821P803j285J340l280
$$ 24110 22428 12021 11934 13740 14166 14191 18310 16417 19562 19022 9515 7694 15497 14212 15552 12272
7656A2272m311M559q4N075O374m923k41J731M649k95k039J841n409p656k969l146
$$ 12272 7961 12520 12436 17511 23885 18962 18721 20452 25101 24806 22767 24608 19199 11543 8574 5428
7640E428j0251N305J0109r33k740k475L713K124m559R341K710l39N491M242J777
$$ 5428 -4823 482 10591 9658 6918 4443 8156 10280 5721 15062 17772 17433 22924 27166 28943
7625B8943O751l998n907l18p79j534K82j684j024k555j238J585j28L384l43L262
$$ 28943 35694 31696 25789 25471 24692 23158 23440 21756 20732 18177 16939 18524 18396 21780 21437 24699
7609B4699m998j9n757P586P991o637J290k987r204P343O611N178l815m021q893
$$ 24699 19701 19682 13925 21511 29502 22865 24155 21168 11964 19307 25918 31096 27281 23260 14367
7594A4367k254m238n713L83R311J431P68L315O100l447Q77N418o349p07K562O304
$$ 14367 12113 7875 2162 2545 11856 13287 14055 17370 23470 20023 20900 26318 19969 19262 21824 28128
7578B8128Q652o594j2992j0890o726k897L523P632n366j1201n47Q845J1220J1161
$$ 28128 36780 30186 17194 6304 -422 -3319 204 7836 2470 -8731 -9278 -433 10787 21948
7564B1948N136j514k865n448q297K5j272j990j153k997j852K342k909l04k981
$$ 21948 27084 25570 22705 17257 8960 8985 7713 5723 4570 1573 -279 2063 -846 -1150 -4131
7549d131K691N478l285J5802K641p106j220j336j473q39J3795L899k819j562n031
$$ -4131 -1440 4038 753 16555 19196 12090 10870 9534 8061 7222 21017 24916 22097 20535 15504
7534A5504p28r954k414M422k075n098K80Q511R196L947n627p591k525L374J422
$$ 15504 14776 4822 2408 6830 4755 -343 -63 8448 17644 21591 15964 8373 5848 9222 10644
7519A0644m248j235J1K800O245M452l468q064l684m839k644m521K662J1377O213
$$ 10644 6396 5161 5172 7972 14217 18669 15201 7137 3453 -1386 -4030 -8551 -5889 5488 11701
7504A1701J330k579J092J58P7L73J458J261l011q866p166L898P774L573L060l108
$$ 11701 13031 10452 11544 11702 11779 12152 13610 14871 11860 2994 -4172 -274 7500 11073 14133 11025
7488A1025N914qm788J023L64j554N22J326M04m433N486K737m063M52l383k785
$$ 11025 16939 16931 12143 13166 13530 11976 12498 13824 14228 9795 15281 18018 13955 14407 11024 8239
7472H239p361j9J1000M252L21l851o525q60L053J758M868l504P62J081m579j023
$$ 8239 878 859 11859 16111 16432 12581 6056 5196 8249 10007 14875 11371 12133 13214 8635 7612
7456G612L693k278l811Q45j918j179n073j505J837M611O909j621p824p93l693
$$ 7612 11305 9027 5216 6061 4143 2964 -2109 -3614 -1777 2834 9743 8122 298 -495 -4188
7441d188j70J0484J748l433K074L386l18n874J589O869o294k660r093J334O346
$$ -4188 -4358 6126 7874 4441 6515 9901 9583 3709 5298 12167 5873 3213 -5880 -4546 1800
7426A800m996L579J0172k759n115M112J363m119n707p52j516k424M107M382N163
$$ 1800 -3196 383 10555 7796 2681 6793 8156 4037 -1670 -2422 -3938 -6362 -2255 2127 7290
7411G290l113j383P55P357O108r728l915l298M11J257Q94K006K623m722k235L313
$$ 7290 4177 2794 3549 10906 17014 7286 3371 73 484 1741 2635 4641 7264 2542 307 3620
7395C620n26o159n104N948M074P845o402p260o093L370j732J79M947l927k427
$$ 3620 3094 -3065 -8169 -2221 1853 9698 3296 -3964 -10057 -6687 -8419 -8240 -3293 -7220 -9647
7380i647R667R900J531r58n322J788K775o419L205m691n42K854K261L506j652
$$ -9647 20 9920 11451 10493 5171 6959 9734 3315 6520 1829 1287 4141 6402 9908 8256
7365H256L054n66k213K213J386k986q43n66M857m970k066N540j805k230N1L468
$$ 8256 11310 10744 8531 10744 12130 9144 8301 7735 12592 7622 5556 11096 9291 7061 7112 10580
7349A0580m329r62K185O534k351l932j775k919k732m086m750m783J325j499n76
$$ 10580 6251 5289 7474 14008 11657 7725 5950 3031 299 -3787 -8537 -13320 -11995 -13494 -14070
7334a4070L274o670o58K249O837O278N936M97n350j870L571m864j104P710q937
$$ -14070 -10796 -17466 -18124 -15875 -9038 -2760 3176 3673 -1677 -3547 24 -4840 -5944 1766 -7171
7319g171k821P303k828k512m714J3097N705M223n985p378m374o193Q05O267O596
$$ -7171 -9992 -2689 -5517 -8029 -12743 354 6059 10282 4297 -3081 -7455 -13648 -12843 -6576 20
7304B0O172l335k36N87o447l182k039P399N18N013o132m461K498K288J749n740
$$ 20 6192 2857 2621 3208 -3239 -6421 -8460 -1061 -543 4470 -1662 -6123 -3625 -1337 412 -5328
7288e328M390k489K394K403n037m05k6J604P21l557j824J140K651J869L801K341
$$ -5328 -938 -3427 -1033 1370 -3667 -4072 -4098 -2494 -1773 -5330 -7154 -6014 -3363 -1494 2307 4648
7272D648J330n485q482K481j842R62k452l454M065K067n123o459N197J0944P248
$$ 4648 5978 493 -7989 -5508 -7350 -6388 -8840 -12294 -8229 -6162 -11285 -17744 -12547 -1603 5645
7257E645M26L792K508j407n286m691O12M860L452q221q956j163M544J855o409
$$ 5645 6071 9863 12371 10964 5678 987 1599 6459 9911 1690 -7266 -8429 -3885 -2030 -8439
7242h439k345L961R798L68q900M564J728M856R085k706p75m217R00M978r99o661
$$ -8439 -10784 -6823 2975 3343 -5557 -993 735 5591 14676 11970 11195 6978 7878 12856 11857 5196
7226E196n965L838J0017O83o089p116n035L917N040N544r75n104q789l275k254
$$ 5196 -769 3069 13086 13769 7680 564 -4471 -554 4486 10030 9055 3951 -4838 -8113 -10367
7211a0367P740J2945O799j0466q042P21J937j526J998M727k144j0780l468j212
$$ -10367 -2627 10318 17117 6651 -1391 -670 1267 -259 1739 6466 4322 -6458 -9926 -11138
7197a1138Q424N985J912q150L56j788K892O684k671n962l420L011J666j370K223
$$ -11138 -2714 3271 5183 -2967 -2611 -4399 -1507 5177 2506 -3456 -6876 -3865 -2199 -3569 -1346
7182a346r45J39L571j798N106M405R25o845J345l852p904j873Q546L163j034m80
$$ -1346 -2291 -2152 1419 -379 4727 9132 10057 3212 4557 705 -7199 -9072 -526 2637 1603 1123
7166A123l765K582O07j496P297J233o447l795j0513j985P196Q152o15J918K120
$$ 1123 -2642 -60 547 -949 6348 7581 1134 -2661 -13174 -15159 -7963 189 -426 1492 3612
7151C612j410K641n99n826p248P69L080j987K509R719N163P95m596k153L195K651
$$ 3612 2202 4843 4244 -1582 -8830 -8061 -4981 -6968 -4459 5260 10423 11218 6622 4469 7664 10315
7135A0315J857l569N113k811n899J701m421J747O070J384q41k402m061j1839K00
$$ 10315 12172 8603 13716 10905 5006 6707 2286 4033 10103 11487 10646 8244 4183 -7656 -7456
7120g456O861r144q941K352N336N508N103n984l978L432l097J774p699m818O985
$$ -7456 -595 -9739 -18680 -16328 -10992 -5484 -381 -6365 -10343 -6911 -10008 -8234 -15933 -20751 -13766
7105a3766r96j782P854J948L354L238M837m721L8J787k555p10K868o35j004k153
$$ -13766 -14762 -16544 -8690 -6742 -3388 -150 4687 -34 4 1791 -764 -1474 1394 759 -245 -2398
7089b398m017Q26P936M73j698n837o938O3Q189K93p53O92q127l330J1284K061
$$ -2398 -6415 -5589 2347 2820 1122 -4715 -11653 -11590 -3401 -3108 -3861 -3169 -11296 -14626 -3342 -1281
7073a281r108j127k665j906P383P407n252k213M902k462j71k501k628K613k996
$$ -1281 -10389 -11516 -14181 -16087 -8704 -1297 -6549 -8762 -3860 -6322 -6493 -8994 -11622 -9009 -12005
7058a2005p246R126O61J579N993K85k303J068k268n450M14L110j031P599j282
$$ -12005 -19251 -10125 -9464 -7885 -1892 -1607 -3910 -2842 -5110 -10560 -10146 -7036 -8067 -468 -1750
7043a750J262K62j483K546M881K123q14O45J11j4939J044P738N162m295j1317
$$ -1750 -488 -226 -1709 837 5718 7841 7027 7672 7783 -7156 -6112 1626 6788 2493 -8824
7028h824k439K827k044l65M51k357J140Q2p141j829K68J3483J4320O504p24k018
$$ -8824 -11263 -8436 -10480 -10845 -10394 -12751 -11611 -11529 -18670 -20499 -20231 -6748 7572 14076 13352 11334
7012A1334k028N967j3n062l874k778l919l56o82k438k688O641O560J244L094K539
$$ 11334 9306 15273 15260 10198 6324 3546 -373 -729 -1411 -3849 -6537 104 6664 7908 11002 13541
6996A3541J671p109j8012j0469L718M322K908l709K416K882k438k704P491L81
$$ 13541 15212 8103 -9909 -20378 -16660 -12338 -9430 -13139 -10723 -7841 -10279 -12983 -5492 -5111
6982e111l18L27m787J977J708l221j517N581K608j767K369M717j701k310l337
$$ -5111 -5429 -5102 -9889 -7912 -6204 -9425 -10942 -5361 -2753 -4520 -2151 2566 865 -1445 -4782
6967d782Q560M492q436K27l617m92m13J355R635N180l129p408o662j587o326N476
$$ -4782 3778 8270 -166 61 -3556 -4048 -4461 -3106 6529 11709 8580 1172 -5490 -7077 -13403 -7927
6951g927P16m620J417M451N839o600o436J0003K215p965j825o401L288P037J007
$$ -7927 -7211 -11831 -10414 -5963 -124 -6724 -13160 -3157 -942 -8907 -10732 -17133 -13845 -6808 -5801
6936e801m287J841O76N949n528l108N643Q224J167n198p304k116j166o138r07
$$ -5801 -10088 -8247 -7571 -1622 -7150 -10258 -4615 3609 4776 -422 -7726 -9842 -11008 -17146 -18053
6921a8053L323m223j0942K183j430J1552J3634Q69K407N244J301l848J62L970
$$ -18053 -14730 -18953 -29895 -27712 -29142 -17590 -3956 -3087 -680 4564 5865 2017 2179 6149
6907F149K518L405k224l103j296n677m88L060o335n213l043J209J297K979L442
$$ 6149 8667 12072 9848 6745 5449 -228 -716 2344 -3991 -9204 -12247 -11038 -9741 -6762 -3320
6892c320M33j823p998K284P93k055l216K406k665K038Q045J446m112N059k602
$$ -3320 -2887 -4710 -12708 -10424 -9631 -11686 -14902 -12496 -15161 -13123 -5078 -3632 -7744 -2685 -5287
6877e287k571L712l30q390j341O589Q996P736n800p030L453l416P123J031p128
$$ -5287 -7858 -4146 -4476 -12866 -14207 -7618 1378 9114 3314 -3716 -263 -3679 3444 4475 -2653
6862b653k361K220Q71k404K462l665J569j539L1j218j332K801L411n067N74P48
$$ -2653 -5014 -2794 -1923 -4327 -1865 -5530 -3961 -5500 -5469 -6687 -8019 -5218 -1807 -6874 -6300 -5552
6846e552K482K219L513K291n269r858J483J0442q72p153n312P637J970n600M045
$$ -5552 -3070 -851 2662 4953 -316 -10174 -8691 1751 879 -6274 -11586 -3949 -1979 -7579 -3534
6831c534M692L477M166P864j313k483n731r89o126l467L962N090L277L365m585
$$ -3534 1158 4635 8801 16665 15352 12869 7138 6149 23 -3444 518 5608 8885 12250 7665
6816G665n061J35j234L379k891n657L394M028n117n306j808K099R27L550N124
$$ 7665 2604 2739 1505 4884 1993 -3664 -270 3758 -1359 -6665 -8473 -6374 -5447 -1897 3227
6801C227k94J353J978k271l295j439j137q48j301N244K700m839l487n931m313
$$ 3227 2933 4286 6264 3993 698 -741 -1878 -2726 -4027 1217 3917 -922 -4409 -10340 -14653
6786a4653L336p1K908L580m07r262k066j811r98J61k004k087M653L126R02L819
$$ -14653 -11317 -11388 -8480 -4900 -5307 -14569 -16635 -18446 -19444 -19283 -21287 -23374 -18721 -15595 -14693 -10874
6770a0874Q192O701L202k975l323J443O7o772K472O539k769M052M685p046n997
$$ -10874 -2682 4019 7221 4246 923 2366 2433 -4339 -1867 4672 1903 5955 10640 3594 -2403
6755b403L655j332L73k223K482j2896l14P66o94L54L910L675m013l706k92P70
$$ -2403 1252 -80 293 -1930 552 -12344 -12658 -11892 -12586 -12232 -8322 -4647 -8660 -12366 -12658 -11888
6739a1888j883L027k432Kp50l447O541M839M706L100K431K086k149j895l600p594
$$ -11888 -13771 -10744 -13176 -13174 -13924 -17371 -10830 -5991 -1285 1815 4246 6332 4183 2288 -1312 -8906
6723h906k716M31L406n77N26J084L63J991k673L336j036O636N013k316k753k419
$$ -8906 -11622 -11191 -7785 -8362 -7836 -6752 -6389 -4398 -7071 -3735 -4771 1865 6878 4562 1809 -610
6707f10O089R536K900j552K332j302K937J1132J6149K5685K6415J9950l137k0132
$$ -610 5479 15015 17915 16363 18695 17393 20330 31462 47611 73296 99711 119661 116524 96392
6693I6392l3892k1996r496j6502q763J21k702N517M598l625m020J781n997l487
$$ 96392 62500 40504 31008 14506 5743 5864 3162 8679 13277 9652 5632 7413 1416 -2071
6679b071N19j1582n691O786L988R77J1895M194m266j1059J024M234N522o400J53
$$ -2071 -1552 -13134 -18825 -12039 -8051 -7074 4821 9015 4749 -6310 -5286 -1052 4470 -1930 -1777
6664a777k933p081L428j198K030p01Q969o714K450l769o266K17j98L137M811J832
$$ -1777 -4710 -11791 -8363 -9561 -7531 -8232 737 -5977 -3527 -7296 -13562 -13345 -13543 -10406 -5595 -3763
6648c763K348N465J414j8853j0850R93J2138J722K505L921m81M258M078n588j243
$$ -3763 -1415 4050 5464 -13389 -24239 -23246 -11108 -9386 -6881 -2960 -3441 817 4895 -693 -1936
6633a936P876n752o35J611J481O841l396l166K136o469n577p73l349k603K034
$$ -1936 5940 188 -447 1164 2645 9486 6090 2924 5060 -1409 -6986 -7759 -11108 -13711 -11677
6618a1677M629J229o170K877R70l953k60l08J746J2439K930j162o897n838J29
$$ -11677 -7048 -5819 -11989 -9112 -8142 -12095 -12355 -12663 -10917 1522 4452 3290 -3607 -9445 -9316
6603i316k839L876n261o563J836k669J683M787K545J693PJ0073O002Q664j371
$$ -9316 -12155 -8279 -13540 -20103 -18267 -20936 -19253 -14466 -11921 -10228 -10221 -148 5854 14518 13147
6588A3147n66n577j3548m297l903L0L802L006L917R029L87J385o88n011N411J839
$$ 13147 12581 7004 -6544 -10841 -14744 -14714 -10912 -7906 -3989 5040 5427 6812 6124 1113 6524 8363
6572H363k097m289j791O37N91P32l870m301k058j455Q789N1p571j2287M150P683
$$ 8363 6266 1977 186 823 1414 2146 -1724 -6025 -8083 -9538 -749 -698 -8269 -20556 -16406 -8723
6556h723O593J524L94p756o331k51P273M526J690k31J900l351Q14J741n76K250
$$ -8723 -2130 -606 -212 -7968 -14299 -14550 -7277 -2751 -1061 -1292 608 -2743 -1929 -188 -764 1486
6540A486m733r625j0313K69O672l352K51q76K853r994M091M929N559k619j796
$$ 1486 -3247 -12872 -23185 -22916 -16244 -19596 -19345 -20221 -17368 -27362 -23271 -18342 -12783 -15402 -17198
6525a7198Q489J3614O4p792l001M716M382K781m225j2444n384P829k44m661J539
$$ -17198 -8709 4905 4969 -2823 -5824 -1108 3274 6055 1830 -10614 -15998 -8169 -8413 -13074 -11535
6510a1535J563o56J020J863l673O760K670J031m901J384n860k513M572L097p20
$$ -11535 -9972 -10628 -9608 -7745 -11418 -4658 -1988 -957 -5858 -4474 -10334 -12847 -8275 -5178 -5898
6495e898o680j830L33K961n624k090N871m366M261j131m181N5K457M506m565n009
$$ -5898 -12578 -14408 -14075 -11114 -16738 -18828 -12957 -17323 -13062 -14193 -18374 -18319 -15862 -11356 -15921 -20930
6479b0930R954M884P7n502k154L748j627k92N501K429m783j0785K452L27j749
$$ -20930 -10976 -6092 -6015 -11517 -13671 -9923 -11550 -11842 -6341 -3912 -8695 -19480 -17028 -16701 -18450
6464a8450k868j01K299L782r4k070K207O118L841n683P83p074m290P91O71O545
$$ -18450 -21318 -21419 -19120 -15338 -15432 -17502 -15295 -9177 -5336 -11019 -10236 -17310 -21600 -20809 -20138 -13593
6448a3593J0086L688k803N295J916K918k05R45J394j698k053m270m405j622o030
$$ -13593 -3507 181 -2622 2673 4589 7507 7302 8247 9641 7943 5890 1620 -2785 -4407 -10437
6433a0437m481K986P644O449n573m11K521Q716J0952q008j3545m199M989l934
$$ -10437 -14918 -11932 -4288 2161 -3412 -3823 -1302 7414 18366 10358 -3187 -7386 -2397 -6331
6419f331J227R351K463l504k346r613p492j4P553J0866O593O86N182j420k494
$$ -6331 -5104 4247 6710 3206 860 -8753 -16245 -16259 -8706 2160 8753 9439 14621 13201 10707
6404A0707r596j1712r328L401L406J631N51P755p561m944Q063P30m462J1792K938
$$ 10707 1111 -10601 -19929 -16528 -13122 -11491 -10940 -3185 -10746 -15690 -7627 -6897 -11359 433 3371
6389C371j862k189o032R53j107j0127n70J0555K577j1081l62Q319L92q047o078
$$ 3371 1509 -680 -6712 -5759 -6866 -16993 -17563 -7008 -4431 -15512 -15874 -7555 -7163 -15210 -21288
6374b1288P063R136k864k203Q553K253o84j4212j2032K788R772P85n75m574L904
$$ -21288 -14225 -5089 -7953 -10156 -1603 650 -34 -14246 -26278 -23490 -13718 -12933 -13508 -18082 -14178
6359a4178J093r299K285J043M639L874M121J501R400J788l070j2400l989K534
$$ -14178 -13085 -22384 -20099 -19056 -14417 -10543 -6422 -4921 4479 6267 3197 -9203 -13192 -10658
6345a0658L462n050k525O540l664j921O21N126Q623K651p545J261m891m010M055
$$ -10658 -7196 -12246 -14771 -8231 -11895 -13816 -13195 -8069 554 3205 -4340 -3079 -7970 -11980 -7925
6330g925N736O045k937L419m96O36p108J557L414j790m778M629j84m632k944m016
$$ -7925 -2189 3856 919 4338 3842 4478 -2630 -1073 2341 551 -4227 402 218 -4414 -7358 -11374
6314a1374m790L771J642M760Q664J081k768o183l277l894k747K490P563N605R341
$$ -11374 -16164 -12393 -10751 -5991 2673 3754 986 -5197 -8474 -12368 -15115 -12625 -5062 543 9884
6299I884j015n832j938k845l141K967o399n110o982m04J750Q549K836J586O62
$$ 9884 8869 3037 1099 -1746 -4887 -1920 -8319 -13429 -20411 -20815 -19065 -10516 -7680 -6094 -5432
6284e432l374N97l617k87M457L561N837M371k260r428Q44M487l984j79m560j16
$$ -5432 -8806 -8209 -11826 -12113 -7656 -4095 1742 6113 3853 -5575 -4731 -244 -4228 -4407 -8967 -9083
6268i083L938N392k092m724M452K003k611o256P13P595N638M91k237n708q824
$$ -9083 -5145 247 -1845 -6569 -2117 -114 -2725 -8981 -8268 -673 4965 5456 3219 -2489 -11313
6253a1313O184O414l156n705j06M45j178J0916L303m299l376O901L958l456m991
$$ -11313 -5129 1285 -1871 -7576 -7682 -7237 -8415 2501 5804 1505 -1871 5030 8988 5532 541
6238E41k970J226K15j106o26P21R19l171l44j831r758O84J0183j588l843M617
$$ 541 -2429 -1203 -988 -2094 -2720 -1999 -1080 -4251 -4595 -6426 -16184 -15500 -5317 -6905 -10748 -6131
6222f131P74P083K58P126J087K20L144n109m180n953r304K65l028j099N642O915
$$ -6131 -5357 1726 1984 9110 10197 10417 13561 8452 4272 -1681 -10985 -10720 -13748 -14847 -9205 -2290
6206b290K772j888n685K483L578K165J1682j226n784n234n79P600M977p419n737
$$ -2290 482 -1406 -7091 -4608 -1030 1135 12817 11591 5807 573 -6 7594 12571 5152 -585
6191e85J952j952l925m115Q377k86l200M904l371N3m983k744l477m607K190R026
$$ -585 1367 -585 -4510 -8625 -248 -534 -3734 1170 -2201 -2148 -7131 -9875 -13352 -17959 -15769 -6743
6175f743O76m865J253M959K883K788j870j359n964l221M16K155L196j484R95K112
$$ -6743 -6067 -10932 -9679 -4720 -1837 951 -919 -2278 -8242 -11463 -11047 -8892 -5696 -7180 -6185 -4073
6159d073m111R370J2774o76p154q668k165n449K342K780j87m738m525M334P107
$$ -4073 -8184 1186 13960 13284 6130 -2538 -4703 -10152 -7810 -5030 -5217 -9955 -14480 -10146 -3039
6144c039P065K230N667l203k017J072o090L8K295j324l205K175n201k451M877
$$ -3039 4026 6256 11923 8720 6703 7775 1685 1723 4018 2694 -511 1664 -3537 -5988 -1111
6129a111o790j953L196p318n25q79m755J500R270J848l815m060K728J203O672
$$ -1111 -7901 -9854 -6658 -13976 -14501 -15380 -20135 -18635 -9365 -7517 -11332 -15392 -12664 -11461 -4789
6114d789J780m759j199O393j011m390k457J1q231P899J1831J542P77m636j199
$$ -4789 -3009 -7768 -8967 -2574 -3585 -7975 -10432 -10421 -18652 -10753 1078 2620 3397 -1239 -2438
6099b438M450Q63n515M988K061k225j1728K504J724o032l434K737K18P166J828
$$ -2438 2012 2875 -2640 2348 4409 2184 -9544 -7040 -5316 -11348 -14782 -12045 -11827 -4661 -2833
6084b833m306n770j957K53K1n457P269J2334k248k407L180n051K714M088L08J952
$$ -2833 -7139 -12909 -14866 -14613 -14592 -20049 -12780 -446 -2694 -5101 -1921 -6972 -4258 -170 138 2090
6068B090J366o720j1412K721m036q700P48J2304K661r704m946L641j517O997O792
$$ 2090 3456 -3264 -14676 -11955 -15991 -24691 -23943 -11639 -8978 -18682 -23628 -19987 -21504 -14507 -7715
6053g715J508Q167K577k868m146J328k593q90O967K361m235m743N271P043L113
$$ -7715 -6207 1960 4537 1669 -2477 -1149 -3742 -4632 2335 4696 461 -4282 989 8032 11145
6038A1145j2729k032K200n25k612l747l333k784O231J052M955L352k547N368L004
$$ 11145 -1584 -3616 -1416 -1941 -4553 -8300 -11633 -14417 -8186 -7134 -2179 1173 -1374 3994 6998
6023F998p725o683k354p972k414M835L950M760K287o038p35j0046p279N591L523
$$ 6998 -727 -7410 -9764 -17736 -20150 -15315 -11365 -6605 -4318 -10356 -11091 -21137 -28416 -22825 -19302
6008a9302P226L371o59P860j209n044m56l338J835N555l663k844j997N480R864
$$ -19302 -12076 -8705 -9364 -1504 -2713 -7757 -8213 -11551 -9716 -4161 -7824 -10668 -12665 -7185 2679
5993B679O845R06k321l862m358j409j0940j983L258r13M205N715l671j449k575
$$ 2679 9524 10430 8109 4247 -111 -1520 -12460 -14443 -11185 -12098 -7893 -2178 -5849 -7298 -9873
5978i873N304k895L039m545k236l32O845L726j619l817L934R861L585n263o168
$$ -9873 -4569 -7464 -4425 -8970 -11206 -11538 -4693 -967 -2586 -6403 -2469 7392 10977 5714 -454
5963d54K220j89n007l912j799l42J356j042N089l18l168J545M87r781k435k877
$$ -454 1766 1577 -3430 -7342 -9141 -9483 -8127 -9169 -4080 -4398 -7566 -6021 -5534 -15315 -17750 -20627
5947b0627L525M614j326l845L017O1N20j17l790L228M349Q091M330m731J129q088
$$ -20627 -17102 -12488 -13814 -17659 -14642 -14581 -14061 -14178 -17968 -14740 -10391 -2300 2030 -2701 -1572 -9660
5931i660k205N685J300N373K721n789l563m312Q67j858J665K120Q692l164j0360
$$ -9660 -11865 -6180 -4880 493 3214 -2575 -6138 -10450 -9583 -11441 -9776 -7656 1036 -2128 -12488
5916a2488j826K611N149J199J005O873L239n57R5K028l42K353j115l837o772r888
$$ -12488 -14314 -11703 -6554 -5355 -4350 2523 5762 5205 5300 7328 6986 9339 8224 4387 -2385 -12273
5900a2273Q086J256N782M985m837r183J075q205j333J1217o065K835N024L300
$$ -12273 -4187 -2931 2851 7836 2999 -6184 -5109 -13314 -14647 -3430 -9495 -6660 -1636 1664
5886A664o117L309N470j3087n161L98L955j17K710l0M649J268K193J379p971j087
$$ 1664 -4453 -1144 4326 -8761 -13922 -13524 -9569 -9686 -6976 -7006 -2357 -1089 1104 2483 -5488 -6575
5870f575k569J25P803l222N120L153o052j593l366m689k221k608k763O167J1185
$$ -6575 -9144 -9019 -1216 -4438 682 3835 -2217 -3810 -7176 -11865 -14086 -16694 -19457 -13290 -2105
5855b105P543j7114l170L574j999j786j412K352J235J58R950N699l281j154j56
$$ -2105 5438 -11676 -14846 -11272 -13271 -15057 -16469 -14117 -12882 -12724 -2774 2925 -356 -1510 -1666
5840a666R63j496O995k632r368l89k470J528k063j2304l702Q744J1198m595N76
$$ -1666 -703 -2199 4796 2164 -7204 -7593 -10063 -8535 -10598 -22902 -26604 -17860 -6662 -11257 -10681
5825a0681J727K218J872k468L045K368j113l188K314r35P78L839m414m10N791
$$ -10681 -8954 -6736 -4864 -7332 -4287 -1919 -3032 -6220 -3906 -4841 -4063 -224 -4638 -5048 743
5810G43r00r470K467L057L116k274n740J953N64K942Q208N615l593j2344m19N439
$$ 743 -157 -9627 -7160 -4103 -987 -3261 -9001 -7048 -6484 -3542 4666 10281 6688 -5656 -6075 -636
5794f36n73k154M170k92n452m874N909m310j0960l380J5L582L664R683M588j048
$$ -636 -1209 -3363 807 515 -4937 -9811 -3902 -8212 -19172 -22552 -22537 -18955 -15291 -5608 -1020 -2068
5778b068N674l645j61j082m676p293m489O793M81r804J1559P238o740O969K010
$$ -2068 3606 -39 -200 -1282 -5958 -13251 -17740 -10947 -10466 -20270 -8711 -1473 -8213 -1244 766
5763G66p757M133n218m928J1265m73l566k764n417l01P327j772K046L22L742J476
$$ 766 -6991 -2858 -8076 -13004 -1739 -2212 -5778 -8542 -13959 -14260 -6933 -8705 -6659 -6337 -2595 -1119
5747a119p858l65l048K810N449J0579J419m532q712k026L920M539o69l615K647
$$ -1119 -8977 -9342 -12390 -9580 -4131 6448 7867 3335 -5377 -7403 -3483 1056 387 -3228 -581
5732e81l393R74L714J682M82j607J509m19J659j263k327o418M051N282K109m014
$$ -581 -3974 -3000 714 2396 2878 1271 2780 2361 4020 2757 430 -5988 -1937 3345 5454 1440
5716A440k042m852m040O176L835o540K635j157O069K240n379J368J049j086k641
$$ 1440 -602 -5454 -9494 -3318 517 -6023 -3388 -4545 1524 3764 -1615 -247 802 -284 -2925
5701b925R28q80n351K970M186L056J298M548J190o008j2169K353j887j682N632
$$ -2925 -1997 -2877 -8228 -5258 -1072 1984 3282 7830 9020 3012 -9157 -6804 -8691 -10373 -4741
5686d741j862K073J552j14N231N390l878k339K071Q16l93p260K684N615J02l911
$$ -4741 -6603 -4530 -2978 -3092 2139 7529 3651 1312 3383 4199 3806 -3454 -770 4845 4947 1036
5670A036K915j200k334L100J771q961j332k526r136j011N931K572R488R844p398
$$ 1036 3951 2751 417 3517 5288 -3673 -5005 -7531 -16667 -17678 -11747 -9175 313 10157 2759
5655B759n519L724P90j508O434m916p091m280p031k5J0069O729K376r483l588
$$ 2759 -2760 964 1754 246 6680 1764 -5327 -9607 -16638 -16663 -6594 135 2511 -6972 -10560
5640a0560m734k680L216j453j557l414k450K418j0384l475L259k435m322m802
$$ -10560 -15294 -17974 -14758 -16211 -17768 -21182 -23632 -21214 -31598 -35073 -31814 -34249 -38571 -43373
5626d3373P110J1101O339O991K638N746O42j088P316p768q582j622K401k88M337
$$ -43373 -36263 -25162 -18823 -11832 -9194 -3448 -2806 -3894 3422 -4346 -12928 -14550 -12149 -12437 -8100
5611h100R176K225q298q84q85K881O150J44l166Q978M863K000m649J998o521p159
$$ -8100 1076 3301 -4997 -5881 -6766 -3885 2265 2409 -757 8221 13084 15084 10435 12433 5912 -1247
5595a247K52L123L024K014o473l80P08P6m643m072j538J0023O810j504p742l867
$$ -1247 -995 2128 5152 7166 693 313 1021 1097 -3546 -7618 -9156 867 7677 6173 -1569 -5436
5579e436j0486j1152N129O849M527N50K528l680q338M086O637j303M430K173M095
$$ -5436 -15922 -27074 -21945 -15096 -10569 -10019 -7491 -11171 -19509 -15423 -8786 -10089 -5659 -3486 609
5564F09M787o57K584M135J20o131l610l719m148k384K45k581L85j19K849J253
$$ 609 5396 4739 7323 11458 11578 5447 1837 -1882 -6030 -8414 -8169 -10750 -10365 -10484 -7635 -6382
5548f382J789R712K725j4318l391R324N181k947j582m531O380J850p874l863l747
$$ -6382 -4593 5119 7844 -6474 -9865 -541 4640 1693 111 -4420 1960 3810 -4064 -7927 -11674
5533a1674J934M349J818J79K016Q9j92J767L07K315j118K660m272r292j482j744
$$ -11674 -9740 -5391 -3573 -3394 -1378 -1289 -1481 286 593 2908 1790 4450 178 -9114 -10596 -12340
5517a2340l457J474N928J477n364k559Q468j097j818L559P451O337O21L688o032
$$ -12340 -15797 -14323 -8395 -6918 -12282 -14841 -6373 -7470 -9288 -5729 1722 8059 8680 12368 6336
5502F336l986m937j986K350N41p592P437M254l862o662K846K072n590K077K196
$$ 6336 2350 -2587 -4573 -2223 -1682 -9274 -1837 2417 -1445 -8107 -5261 -3189 -8779 -6702 -4506
5487d506M943M743k303K079l115q004j920l057m685m54L256M751j830n31k564
$$ -4506 437 5180 2877 4956 1841 -6163 -8083 -11140 -15825 -16279 -13023 -8272 -10102 -10633 -13197
5472a3197K149J682l547Q671J567N86J1278J065m783K368l923o717j491J525p027
$$ -13197 -11048 -9366 -12913 -4242 -2675 -2089 9189 10254 5471 7839 3916 -2801 -4292 -2767 -9794
5457i794J166J348P57j47n174l481K395N899q57J66k297K497Q237l543R64p59
$$ -9794 -8628 -7280 -6523 -6670 -11844 -15325 -12930 -7031 -7888 -7722 -10019 -7522 715 -2828 -1864 -2623
5441b623K280m501K162k35L362O408K446k397K222o062n011k854M61K337n836
$$ -2623 -343 -4844 -2682 -2917 445 6853 9299 6902 9124 3062 -1949 -4803 -4342 -2005 -7841
5426g841n32P511N022o98n321m079L846k403R919l277q035k524l409O67N033K028
$$ -7841 -8373 -862 4160 3462 -1859 -5938 -2092 -4495 5424 2147 -5888 -8412 -11821 -11154 -6121 -4093
5410d093M329O016J114L337J404o212k635k149K20m324P52K037k334M413j545
$$ -4093 236 6252 7366 10703 12107 5895 3260 1111 1331 -2993 -2241 -204 -2538 1875 330
5395C30q317j614L261L740j571K212N036K713p146j0368m459l793N59P101N615
$$ 330 -7987 -9601 -6340 -2600 -4171 -1959 3077 5790 -1356 -11724 -16183 -19976 -19417 -12316 -6701
5380f701J033p659j019o05k83K497M311q41o98k140r55o1r93j467P940L770k101
$$ -6701 -5668 -13327 -14346 -14951 -15234 -12737 -8426 -9267 -9965 -12105 -13060 -13121 -14114 -15581 -7641 -3871 -5972
5363e972O839P788n518n242K399J976L192K106J574o94q390p187M24P81l875m126
$$ -5972 867 8655 3137 -2105 294 2270 5462 7568 9142 8448 58 -7129 -6705 -5924 -9799 -13925
5347a3925O399K476m957K352P35Q3J288K920n048J707R458R76O557P21m85o261
$$ -13925 -7526 -5050 -10007 -7655 -6920 -6837 -5549 -2629 -7677 -5970 3488 4464 11021 11742 11257 4996
5331D996r789n89L263N029K984m410o023m407P497J429k662j114m516Q72k562
$$ 4996 -4793 -5382 -2119 2910 5894 1484 -4539 -8946 -1449 -20 -2682 -3796 -8312 -7440 -10002
5316a0002r10k170n10K105l900k290O042J0706N28P25J990L709j773m210m370
$$ -10002 -10912 -13082 -13592 -11487 -15387 -17677 -11635 -929 -401 324 2314 6023 4250 40 -4330
5301d330L593m409l130M03J985K080Q04J505p453l567j822M075Q997J153K19n580
$$ -4330 -737 -5146 -8276 -7873 -5888 -3808 -3004 -1499 -8952 -12519 -14341 -10266 -1269 -116 103 -5477
5285e477l50M11k281n209K489P829O298m124L027j092q112l502n00o37l253K915
$$ -5477 -5827 -5416 -7697 -12906 -10417 -2588 3710 -414 2613 1521 -6591 -10093 -10593 -11230 -14483 -11568
5269a1568J1239O756O32j834L688m893M045k75n643l958j675M883m486j0110J166
$$ -11568 -329 6427 7059 5225 8913 4020 8065 7790 2147 -1811 -3486 1397 -3089 -13199 -12033
5254a2033Q81K08k509Q550Q43q886K283O59K735L686j088K578L39O801j554j3668
$$ -12033 -11152 -10944 -13453 -4903 -4060 -12946 -10663 -10004 -7269 -3583 -4671 -2093 -1754 5047 3493 -10175
5238a0175j454L380k729l330K565k379j531M187M969J514O32m035Q917J1823m617
$$ -10175 -11629 -8249 -10978 -14308 -11743 -14122 -15653 -11466 -6497 -4983 -4351 -8386 531 12354 7737
5223G737n98j192R92M8j232j197j081k415m251L671p565j332k07J312N782m671
$$ 7737 7139 5947 6939 6987 5755 4558 3477 1062 -3189 482 -7083 -8415 -8622 -7310 -1528 -6199
5207f199k340Q603M573m510m865j121P466k85J93j441r515m466p374L948J1542
$$ -6199 -8539 64 4637 127 -4738 -5859 1607 1322 1515 74 -9441 -13907 -21281 -17333 -5791
5192e791R500n62l235L833q263K040K437j130l445n213J011R162P9j212K598n43
$$ -5791 3709 3147 -88 3745 -4518 -2478 -41 -1171 -4616 -9829 -8818 344 423 -789 1809 1266
5176A266m254J77N75R35m59n204j080R153J245M886N404l185j3774n647J848o283
$$ 1266 -2988 -2811 -2236 -1301 -1760 -6964 -8044 1109 2354 7240 12644 9459 -4315 -9962 -8114 -14397
5160a4397k102M800J510Q59o230J0393P297p551n052Q07J3466K920m134k885k816
$$ -14397 -16499 -11699 -10189 -9330 -15560 -5167 2130 -5421 -10473 -9666 3800 6720 2586 -299 -3115
5145c115m207J1157j782M246M255m381r878J257K454M633o59n308n949r60j511
$$ -3115 -7322 3835 2053 6299 10554 6173 -3705 -2448 6 4639 3980 -1328 -7277 -8237 -9748
5130i748L924K273P442L298r521l32M584L66M134j225K938p588j690O679J413
$$ -9748 -5824 -3551 3891 7189 -2332 -2664 1920 2286 6420 5195 8133 545 -1145 5534 6947
5115F947m94K765k690n693R03K197k659j468L697N111M308K221k896q50m684o181
$$ 6947 6453 9218 6528 835 1738 3935 1276 -192 3505 8616 12924 15145 12249 11399 6715 534
5099E34m213k968Q192j001k951N389J533q520m869K839P446J0625k171o507m295
$$ 534 -3679 -6647 1545 544 -2407 2982 4515 -4005 -8874 -6035 1411 12036 9865 3358 -937
5084i37o723K203M152o344o267M303J191r02K519J615R42P981j159n182m425n759
$$ -937 -7660 -5457 -1305 -7649 -13916 -9613 -8422 -9324 -6805 -5190 -4248 3733 2574 -2608 -7033 -12792
5068a2792M923J4404m554q888j218J2375Q685K385J661q035n294K24N3O77p980
$$ -12792 -7869 6535 1981 -6907 -8125 4250 12935 15320 16981 8946 3652 3876 3929 4606 -3374
5053c374L869k480P04p128R045J1839r98l113m46M285J824K278J845p313j1107
$$ -3374 495 -1985 -1281 -8409 636 12475 11477 8364 7918 12203 14027 16305 18150 10837 -270
5038b70m861J170J686k211l291R047L201q644o533M918M312L43j592K971o862
$$ -270 -5131 -3961 -2275 -4486 -7777 1270 4471 -4173 -10706 -5788 -1476 -1133 -2725 246 -6616
5023f616j1652N036k732L893O020j948m757Q585M766l626M080M877L561M884k706
$$ -6616 -18268 -13232 -15964 -12071 -6051 -7999 -12756 -4171 595 -3031 1049 5926 9487 14371 11665
5008A1665l709l772k230p112m741K596m12Q092L265M248K445j866p210N860L158
$$ 11665 7956 4184 1954 -5158 -9899 -7303 -7715 377 3642 7890 10335 8469 1259 7119 10277
4993A0277o777m21J14l683J565M752n934l354L178O703N973n385j2444K919J1526
$$ 10277 3500 3079 3193 -490 1075 5827 -107 -3461 -283 6420 12393 7008 -5436 -2517 9009
4978I009k29O658J0252L632j0828j0081o965n536q756n251N790L814k374J1831
$$ 9009 8780 15438 25690 29322 18494 8413 1448 -4088 -12844 -18095 -12305 -8491 -10865 966
4964I66j64n687l599o064K786J0297j802J051j85k183N363Q300n135l21o112l379
$$ 966 802 -4885 -8484 -14548 -11762 -1465 -3267 -2216 -2401 -4584 779 9079 3944 3623 -2489 -5868
4948e868j420L520O134L862J1019M370j1845j0665p00J0631L368l195j988k717
$$ -5868 -7288 -3768 2366 6228 17247 21617 9772 -893 -1593 9038 12406 9211 7223 4506
4934D506j793m324K268l087k653P708p21m651l886n662n864j170j929J0868R244
$$ 4506 2713 -1611 657 -2430 -5083 2625 1904 -2747 -6633 -12295 -18159 -19329 -21258 -10390 -1146
4919a146l979Q475J0583J054j2631o059K255K573p310k077j497n107L091R338
$$ -1146 -5125 3350 13933 14987 2356 -3703 -1448 1125 -6185 -8262 -9759 -14866 -11775 -2437
4905b437R19K52m65o901m442R365j138n320M000J153j63n84K977k328m269P788
$$ -2437 -1518 -1266 -1731 -8632 -13074 -3709 -4847 -10167 -6167 -5014 -5177 -5761 -2784 -5112 -9381 -1593
4889a593J8893j43j2433J528J2222q898p038J0188K027m296q61m549o227j5426
$$ -1593 17300 17157 4724 6252 18474 9576 2538 12726 14753 10457 9596 5047 -1180 -16606
4875a6606m282J1352M822q456O751k304m149j238N817j265k496R96O47m729o290
$$ -16606 -20888 -9536 -4714 -13170 -6419 -8723 -12872 -14110 -8293 -9558 -12054 -11058 -10411 -15140 -21430
4860b1430j775n81J0165R321k743O493L581l013l584j713o117M668j523n291M907
$$ -21430 -23205 -23786 -13621 -4300 -7043 -550 3031 18 -3566 -5279 -11396 -6728 -8251 -13542 -8635
4845h635L345K416M78Q519j682j896K934J962k637J872J510j371j814n211r03
$$ -8635 -5290 -2874 -2396 6123 4441 2545 5479 7441 4804 6676 8186 6815 5001 -210 -1113
4830a113L90N368J520N94K056n512Q53Q773j413m938m56K253n535j2354l237L110
$$ -1113 -723 4645 6165 6759 8815 3303 4156 12929 11516 6578 6122 8375 2840 -9514 -12751 -9641
4814i641M343M079K617L602k051m28r855q077J1312l101O933O640O864j428p323
$$ -9641 -5298 -1219 1398 5000 2949 2521 -7334 -15411 -4099 -7200 -267 6373 13237 11809 4486
4799D486o995k307k672N288l621l15P573O14j0967J030N78R090N510l598N136
$$ 4486 -2509 -4816 -7488 -2200 -5821 -6136 1437 2051 -8916 -7886 -7308 1782 7292 3694 8830
4784H830J470P55k209J702q749j89N206K080j1005l178m851j705p51N091L678
$$ 8830 10300 11055 8846 10548 1799 1610 6816 8896 -2109 -5287 -10138 -11843 -12594 -7503 -3825
4769c825k8J208P911l964l407N134l2j301N503M529j09L626N91j143j380k186
$$ -3825 -3853 -2645 5266 1302 -2105 3029 2997 1696 7199 11728 11619 15245 15836 14693 13313 11127
4753A1127r632K518o539k1q65q05O409M939K945J194N03n123q502p327m632n1
$$ 11127 1495 4013 -2526 -2547 -3412 -4217 2192 7131 10076 11270 11773 6650 -1852 -9179 -13811 -13862
4737a3862R11l38K070o35J399L052m402J241m245N023J1424m506l421Q310J0932
$$ -13862 -12951 -13289 -11219 -11854 -10455 -7403 -11805 -10564 -14809 -9786 1638 -2868 -6289 2021 12953
4722A2953m609m839p300m489k080j900k630J159j211j0293Q893R749r67k762M983
$$ 12953 8344 3505 -3795 -8284 -10364 -12264 -14894 -13735 -14946 -25239 -16346 -6597 -7564 -10326 -5343
4707e343j454K211R782k757K024L704M772o382o207p479J03L677k65L550j834
$$ -5343 -6797 -4586 5196 2439 4463 8167 12939 6557 350 -7129 -7026 -3349 -3614 -64 -1898
4692a898M771K588n02j787n092J090L228J116L497k927o035j841M119K385n745
$$ -1898 2873 5461 4959 3172 -1920 -830 2398 3514 7011 4084 -1951 -3792 327 2712 -3033
4677c033l289L737j315l671j194P630K266q615m305J982P811n505N443n756m010
$$ -3033 -6322 -2585 -3900 -7571 -8765 -1135 1131 -7484 -11789 -9807 -1996 -7501 -2058 -7814 -11824
4662a1824O580M312M962R968L539n952p405k940O656l915p724k339k41N071o089
$$ -11824 -5244 -932 4030 13998 17537 11585 4180 1240 7896 3981 -3743 -6082 -6323 -1252 -7341
4647g341J722j811o900K242J881K505N963n315l313K456K187L653Q197k45k898
$$ -7341 -5619 -7430 -14330 -12088 -10207 -7702 -1739 -7054 -10367 -7911 -5724 -2071 6126 5881 2983
4632B983J281n86J934q237j0250J0229J3219n68l046j1245r086K562O102L473
$$ 2983 4264 3678 5612 -2625 -12875 -2646 10573 10005 6959 -4286 -13372 -10810 -4708 -1235
4618a235L975m464J551O69l637M82k175p849m793J0411k04N420K994l658j0655
$$ -1235 2740 -1724 -173 496 -3141 -2659 -4834 -12683 -17476 -7065 -7269 -1849 1145 -2513 -13168
4603a3168L083N667M807m00j817j55P26j348O505P169l551m128M236N522J04M09
$$ -13168 -10085 -4418 389 -11 -1828 -1983 -1257 -2605 3900 11069 7518 3390 7626 13148 13252 13661
4587A3661j349o819k43M261p667m911L692q3l113J266M51k166m237K529K897M885
$$ 13661 12312 5493 5250 9511 1844 -3067 625 542 -2571 -1305 -854 -3020 -7257 -4728 -1831 3054
4571C054j568q900K673K594k540k527J898K185J494K942K304M325K343j028O167
$$ 3054 1486 -7414 -4741 -2147 -4687 -7214 -5316 -3131 -1637 1305 3609 7934 10277 9249 15416
4556A5416j14k523m269L927m200m328O992K289n462p860k49J34j789L279n123
$$ 15416 15302 12779 8510 12437 8237 3909 10901 13190 7728 -132 -381 -247 -2036 1243 -3880
4541c880p715O741K341l396N365l915m574M007M97J0644P235o08q007j1191l60
$$ -3880 -11595 -4854 -2513 -5909 -544 -4459 -9033 -5026 -4529 6115 13350 12742 4735 -6456 -6816
4526f816M36n156O62J362M869J474k903l603J600J15O39R538J0824K93l542o208
$$ -6816 -6380 -11536 -10874 -9512 -4643 -3169 -6072 -9675 -8075 -7960 -7321 2217 13041 13334 9792 3584
4510C584l690p742j593Q734K447o818N674K910k203q869n823N06k429J070N46
$$ 3584 -106 -7848 -9441 -707 1740 -5078 596 3506 1303 -7566 -13389 -12883 -15312 -14242 -13696
4495a3696L189p942p718K805Q883O473L627l254p59M739P889P079j802m061l632
$$ -13696 -10507 -18449 -26167 -23362 -14479 -8006 -4379 -7633 -8392 -3653 4236 11315 9513 5452 1820
4480A820K428K255m106N291K655r950j2369N12J2347L422r25l224N607N405m474
$$ 1820 4248 6503 2397 7688 10343 393 -11976 -11464 883 4305 3380 156 5763 11168 6694
4465F694l746O252j745q254o083l312p833L320Q854N972L840r220o124K511L952
$$ 6694 2948 9200 7455 -799 -6882 -10194 -18027 -14707 -5853 119 3959 -5261 -11385 -8874 -4922
4450d922N76O774L786n07O162R3j1293j534O57O953r98q01l613q323o21L706K538
$$ -4922 -4346 2428 6214 5707 11869 11962 669 -865 -208 6745 5747 4946 1333 -6990 -7611 -3905 -1367
4433a367K527K743J789j346o48m569m116Q63M27q63nr56k153J0258K586j180o41
$$ -1367 1160 3903 5692 4346 3698 -871 -4987 -4124 -3697 -4560 -4565 -5521 -7674 2584 5170 3990 3349
4416C349p039o604j546M915J026J200m579N10M346j56R762j140q860j142O388
$$ 3349 -3690 -10294 -11840 -6925 -5899 -4699 -9278 -8768 -4422 -4578 5184 4044 -4816 -5958 430
4401D30K250P57R21j534k585L289j29J992N188M756J959l258l899m792n004Q13
$$ 430 2680 3437 4358 2824 239 3528 3399 5391 10579 15335 17294 14036 10137 5345 341 1154
4385A154K104n914Q202M530q866n018K78K694O588N919L563k771o177o611m804
$$ 1154 3258 -2656 5546 10076 1210 -3808 -3530 -836 5752 11671 15234 12463 6286 -325 -5129
4370e129k824k819M240M510P135J53n359p534q649l90N510L112N896J928N953
$$ -5129 -7953 -10772 -6532 -2022 5113 5266 -93 -7627 -16276 -16666 -11156 -8044 -2148 -220 5733
4355E733R664o54j254j863j461NJ569L008K952k701n716n343J637N25j2604n321
$$ 5733 15397 14743 13489 11626 10165 10170 11739 14747 17699 14998 9282 3939 5576 6101 -6503 -11824
4339a1824k975P001P286L934Q182K790n243p198j141r231J0397M870m2j113o571
$$ -11824 -14799 -7798 -512 3422 11604 14394 9151 1953 812 -8419 1978 6848 6806 5693 -878
4324h78J886k345j905j745k235k972l212j678j20K03L806n86l261K418M648M781
$$ -878 1008 -1337 -3242 -4987 -7222 -10194 -13406 -15084 -15204 -15001 -11195 -11781 -15042 -12624 -7976 -3195
4308c195L526q995o261n833N893K150L841R994J835l919n59m419n780K040j621
$$ -3195 331 -8664 -14925 -20758 -14865 -12715 -8874 1120 2955 -964 -1523 -5942 -11722 -9682 -11303
4293a1303P127J160K982J201j39L835k478p04j89k079k141k4p44k137P980J079
$$ -11303 -4176 -3016 -34 1167 1028 4863 2385 1681 1492 -587 -2728 -2752 -3496 -5633 2347 3426
4277C426j964P75N487Q180m310O40L417r159p786l664l855P680L094j0491M371
$$ 3426 1462 2237 7724 15904 11594 12234 15651 6492 -1294 -4958 -8813 -1133 1961 -8530 -4159
4262d159K565k361K665j430m21K701R423M366o611o23P19o64J613j463m242j077
$$ -4159 -1594 -3955 -1290 -2720 -3141 -440 8983 13349 6738 6115 6834 6170 7783 6320 2078 1001
4246A001J650j015k317J249m449n043L683R929j367j530k159M103O012k074o144
$$ 1001 2651 1636 -681 568 -3881 -8924 -5241 4688 3321 1791 -368 3735 9747 7673 1529
4231A529j635o68J082m667n910K724K84Q031P093j180p9j0208J387j333L785L301
$$ 1529 -106 -774 308 -4359 -10269 -7545 -7261 770 7863 6683 6604 -3604 -2217 -3550 235 3536
4215C536j609N866o134q756K828O968N361Q11k68O712j472j756j0818k423N293
$$ 3536 1927 7793 1659 -7097 -4269 2699 8060 8871 8603 15315 13843 12087 1269 -1154 4139
4200D139k063p49l602j663k716M142L1o513K93N211k978O104P788m982p264k121
$$ 4139 2076 1327 -2275 -3938 -6654 -2512 -2481 -8994 -8701 -3490 -6468 -364 7424 2442 -4822 -6943
4184f943j774J158L918P105Q24r374n710L902M991M220J83L077j275N063N297
$$ -6943 -8717 -7559 -3641 3464 4288 -5086 -10796 -6894 -1903 2317 2500 5577 4302 9365 14662
4169A4662o674K157Q141k543k105o862J222J551M903q863o921L151m556l451P433
$$ 14662 7988 10145 18286 15743 13638 6776 7998 9549 14452 5589 -1332 1819 -2737 -6188 1245
4154A245P826j844j521j702L257N676J950k736p486j0717k35L564k194l487K099
$$ 1245 9071 7227 5706 4004 7261 12937 14887 12151 4665 -6052 -6287 -2723 -4917 -8404 -6305
4139f305N187k648j138O395j075m562L353k656l505l843N999O116j920m270P16
$$ -6305 -1118 -3766 -4904 1491 416 -4146 -793 -3449 -6954 -10797 -4798 1318 -602 -4872 -4156
4124d156P68J803m38o549l989J1174J0712l467j1821L67M428j869o016N226P832
$$ -4156 -3388 -1585 -2023 -8572 -12561 -1387 9325 5858 -5963 -5596 -1168 -3037 -9053 -3827 4005
4109D005l956l296M227p317j0206M432j196R998O888k907K155p296Q51Q16k178
$$ 4005 49 -3247 980 -6337 -16543 -12111 -13307 -3309 3579 672 2827 -4469 -3618 -2802 -4980
4094d980k558J159N516M522J367l318N086lj677k974J136m852L501J494J956q028
$$ -4980 -7538 -6379 -863 3659 5026 1708 6794 6791 5114 2140 3276 -1576 1925 3419 5375 -2653
4078b653k430N954o21l516j610J0413J4367j262q441p553P12m978O245L294q206
$$ -2653 -5083 871 250 -3266 -4876 5537 19904 18642 10201 2648 3360 -1618 4627 7921 -285
4063b85k990M330N329o71p167J309r86J374k86m352K092k33Q12K473J9K27n291
$$ -285 -3275 1055 6384 5713 -1454 -145 -1131 243 -43 -4395 -2303 -2536 -1724 749 768 995 -4296
4046d296l407Q374J1818N641j2782J12k367l623m345M759M137J385k183n364l642
$$ -4296 -7703 671 12489 18130 5348 5460 3093 -530 -4875 -116 4021 5406 3223 -2141 -5783
4031e783J406Q751J093n539j774J688j487n42L816m35L94K111J839j2421J683
$$ -5783 -4377 4374 5467 -72 -1846 -158 -1645 -2187 1629 1194 1588 3699 5538 -6883 -5200
4016e200N088N367k770m451K774M846J049n261j689L642R899k670j0848l658P231
$$ -5200 -112 5255 2485 -1966 808 5654 6703 1442 -247 3395 13294 10624 -224 -3882 3349
4001C349P037J103n014o331M199J0618j54j1226j1908l320m44P77q890K383L024
$$ 3349 10386 11489 6475 144 4343 14961 14807 3581 -8327 -11647 -12091 -11314 -20204 -17821 -14797
3986a4797O916M991J253J963Q952P124l464j5103j2020P349Q899l275k793j496
$$ -14797 -7881 -2890 -1637 326 9278 16402 12938 -2165 -14185 -6836 2063 -1212 -4005 -5501
3972e501K032k462N50o741K641J62L927M486K234o313j665N00r93p729j948M049
$$ -5501 -3469 -5931 -5381 -12122 -9481 -9319 -5392 -906 1328 -4985 -6650 -6150 -7143 -14872 -16820 -12771
3956a2771J837o21K632l597K302L284K007K083K145J540n552J023n399K836M879
$$ -12771 -10934 -11555 -8923 -12520 -10218 -6934 -4927 -2844 -699 841 -4711 -3688 -9087 -6251 -1372
3941a372R50M396k181j761M594r835l602O191O555M013k94l607n608m406M702
$$ -1372 -422 3974 1793 32 4626 -5209 -8811 -2620 3935 7948 7654 4047 -1561 -5967 -1265
3926a265K119j303N601J922J078k224l073k177r97K801L817J728L412R32o886
$$ -1265 854 -449 5152 7074 8152 5928 2855 678 -319 2482 6299 8027 11439 12371 5485
3911E485o1O068K696j206L372N454k240q756j1195M300Q291J23o496m03M837m28
$$ 5485 5424 11492 14188 12982 16354 21808 19568 10812 -383 3917 12208 12331 5835 5432 10269 9841
$$ [...]
##END NTUPLES=NMR SPECTRUM
##END=
