##TITLE=Analysis number 328248
Compound Code CC 38008
Book Reference 423/154/3
Project Code adrs
Chemist Name bruced
##JCAMPDX= 6.0         $$ Bruker NMR JCAMP-DX V2.0
##DATA TYPE= NMR SPECTRUM
##DATA CLASS= NTUPLES
##ORIGIN= Bruker BioSpin GmbH
##OWNER= nmr
$$ XWIN-NMR		Version 3.5
$$ Thu May 17 13:17:49 2007 GMT Daylight Time (UT+1h)  MAYBRIDGE\nmr@NMR_250MHZ
##.OBSERVE FREQUENCY= 250.131544655141
##.OBSERVE NUCLEUS= ^1H
##.ACQUISITION MODE= SIMULTANEOUS (DQD)
##.ACQUISITION SCHEME= undefined
##.AVERAGES= 16
##.DIGITISER RES= 18
##SPECTROMETER/DATA SYSTEM= dpx250
##.PULSE SEQUENCE= zg30
##.SOLVENT NAME= CDCl3
##.SHIFT REFERENCE= (INTERNAL, CDCl3, 0, 16.4472)
##AUDIT TRAIL= $$ (NUMBER, WHEN, WHO, WHERE, WHAT)
$$ ##TITLE= Audit trail, XWIN-NMR		Version 3.5
$$ ##JCAMPDX= 5.01
$$ ##ORIGIN= Bruker BioSpin GmbH
$$ ##OWNER= nmr
$$ C:\u/data/dgb/nmr/ADRS/1190/pdata/1/auditp.txt
$$ ##AUDIT TRAIL=  $$ (NUMBER, WHEN, WHO, WHERE, WHAT)
(   1,<2007-05-17 13:17:20.59 +100>,<MAYBRIDGE\nmr>,<NMR_250MHZ>,
      <created by zg, POWCHK disabled, PULCHK disabled
       configuration hash MD5:
       76 6E 9A 78 1E 09 19 81 EC 84 63 8F B0 6A 59 2D
       data hash MD5: 64K
       0D 72 9B 58 B9 EC 80 C2 AB A0 D7 B2 BD 65 7D 79>)
(   2,<2007-05-17 13:17:37.76 +100>,<MAYBRIDGE\nmr>,<NMR_250MHZ>,
      <Start of raw data processing
       ef LB = 0.3 FT_mod = 6 PKNL = 1 SI = 32K 
       data hash MD5: 32K
       8C C4 71 F4 75 1E E5 63 80 4A D2 68 8C 4D 56 9C>)
(   3,<2007-05-17 13:17:39.57 +100>,<MAYBRIDGE\nmr>,<NMR_250MHZ>,
      <apk 
       data hash MD5: 32K
       BE 17 83 F1 3F 19 BD 9A E5 51 96 89 EE AA 8D 39>)
(   4,<2007-05-17 13:17:40.26 +100>,<MAYBRIDGE\nmr>,<NMR_250MHZ>,
      <abs ABSG = 5 
       data hash MD5: 32K
       A0 83 B1 3E 65 ED CF CC B1 01 66 EB D5 AA 06 1E>)
$$ ##END=
$$ 
$$ hash MD5
$$ 38 DA 31 E8 70 3D F9 42 19 96 88 F0 F4 A5 45 94
##$RELAX= 
##$RELAX= 
##$RELAX= 
##$RELAX= 
##$RELAX= 
##$RELAX= 
##$RELAX= 
$$ Bruker specific parameters
$$ --------------------------
##$DU= <C:\u>
##$EXPNO= 1190
##$NAME= <ADRS>
##$PROCNO= 1
##$TYPE= <nmr>
##$USER= <dgb>
##$AMP= (0..31)
100 100 100 100 100 100 100 100 100 100 100 100 100 100 100 100 100 100 
100 100 100 100 100 100 100 100 100 100 100 100 100 100 
##$AQSEQ= 0
##$AQ_mod= 3
##$AUNM= <au_zg>
##$AUTOPOS= <26 >
##$BF1= 250.13
##$BF2= 250.13
##$BF3= 250.13
##$BF4= 250.13
##$BF5= 500.13
##$BF6= 500.13
##$BF7= 500.13
##$BF8= 500.13
##$BYTORDA= 1
##$CFDGTYP= 0
##$CFRGTYP= 5
##$CHEMSTR= <none>
##$CNST= (0..31)
1 1 145 1 1 1 1 1 1 1 1 1 1 1 1 1 1 1 1 1 1 1 1 1 1 1 1 1 1 1 1 1 
##$CPDPRG= <>
##$CPDPRG1= <>
##$CPDPRG2= <>
##$CPDPRG3= <>
##$CPDPRG4= <mlev>
##$CPDPRG5= <mlev>
##$CPDPRG6= <mlev>
##$CPDPRG7= <mlev>
##$CPDPRG8= <mlev>
##$CPDPRGB= <>
##$CPDPRGT= <>
##$D= (0..31)
0 1 0 0 0 0 0 0 0 0.06 0 0 0 0 0 0 0.0002 0 0 0 0 0 0 0 0 0 0 0 0 0 0 
0 
##$DATE= 1179404238
##$DBL= (0..7)
120 120 120 120 120 120 120 120 
##$DBP= (0..7)
150 150 150 150 150 150 150 150 
##$DBP07= 0
##$DBPNAM0= <>
##$DBPNAM1= <>
$$ [...]
##$SUBNAM7= <"">
##$SUBNAM8= <"">
##$SUBNAM9= <"">
##$SW= 20.6930455092707
##$SWIBOX= (0..15)
0 0 3 0 0 0 0 0 0 0 0 0 0 0 0 0 
##$SW_h= 5175.983436853
##$TD= 65536
##$TD0= 1
##$TE= 683.16
##$TE2= 300
##$TE3= 300
##$TEG= 300
##$TL= (0..7)
0 120 120 120 120 120 120 120 
##$TP= (0..7)
150 150 150 150 150 150 150 150 
##$TP07= 0
##$TPNAME0= <>
##$TPNAME1= <>
##$TPNAME2= <>
##$TPNAME3= <>
##$TPNAME4= <>
##$TPNAME5= <>
##$TPNAME6= <>
##$TPNAME7= <>
##$TPOAL= (0..7)
0.5 0.5 0.5 0.5 0.5 0.5 0.5 0.5 
##$TPOFFS= (0..7)
0 0 0 0 0 0 0 0 
##$TUNHIN= 0
##$TUNHOUT= 0
##$TUNXOUT= 0
##$USERA1= <user>
##$USERA2= <user>
##$USERA3= <user>
##$USERA4= <user>
##$USERA5= <user>
##$V9= 5
##$VALIST= <valist>
##$VCLIST= <CCCCCCCCCCCCCCC>
##$VD= 0
##$VDLIST= <DDDDDDDDDDDDDDD>
##$VPLIST= <PPPPPPPPPPPPPPP>
##$VTLIST= <TTTTTTTTTTTTTTT>
##$WBST= 1024
##$WBSW= 4
##$XGAIN= (0..3)
0 0 0 0 
##$XL= 0
##$YL= 0
##$YMAX_a= 303187
##$YMIN_a= -349977
##$ZGOPTNS= <>
##$ZL1= 120
##$ZL2= 120
##$ZL3= 120
##$ZL4= 120
##$ABSF1= 16.44722
##$ABSF2= -4.245953
##$ABSG= 5
##$ABSL= 3
##$ALPHA= 0
##$AQORDER= 0
##$ASSFAC= 0
##$ASSFACI= 0
##$ASSFACX= 0
##$ASSWID= 0
##$AUNMP= <proc_1d>
##$AZFE= 0.1
##$AZFW= 0.1
##$BCFW= 0
##$BC_mod= 0
##$BYTORDP= 0
##$COROFFS= 0
##$CY= 12.5
##$DATMOD= 1
##$DC= 0
##$DFILT= <>
##$DTYPP= 0
##$F1P= 14.0000005364418
##$F2P= -0.99999901652339
##$FCOR= 0.5
##$FTSIZE= 32768
##$FT_mod= 6
##$GAMMA= 0
##$GB= 0
##$INTBC= 1
##$INTSCL= 1
##$ISEN= 128
##$LB= 0.3
##$LEV0= 0
##$LPBIN= 0
##$MAXI= 10000
##$MC2= 0
##$MEAN= 0
##$ME_mod= 0
##$MI= 0
##$NCOEF= 0
##$NC_proc= -4
##$NLEV= 6
##$NOISF1= 0
##$NOISF2= 0
##$NSP= 0
##$NTH_PI= 0
##$NZP= 0
##$OFFSET= 16.44722
##$PC= 1
##$PHC0= -64.41216
##$PHC1= 18.58198
##$PH_mod= 1
##$PKNL= yes
##$PPARMOD= 0
##$PSCAL= 4
##$PSIGN= 0
##$REVERSE= no
##$SF= 250.130018703003
##$SI= 32768
##$SIGF1= 0
##$SIGF2= 0
##$SINO= 400
##$SIOLD= 32768
##$SREGLST= <1H.CDCl3>
##$SSB= 0
##$STSI= 32768
##$STSR= 0
##$SW_p= 5175.98343685301
##$SYMM= 0
##$S_DEV= 0
##$TDeff= 65536
##$TDoff= 0
##$TI= <Analysis number 999999
Compound Code 99
Book Reference 9
Project Code 9>
##$TILT= no
##$TM1= 0
##$TM2= 0
##$TOPLEV= 0
##$USERP1= <user>
##$USERP2= <user>
##$USERP3= <user>
##$USERP4= <user>
##$USERP5= <user>
##$WDW= 1
##$XDIM= 32768
##$YMAX_p= 425122241
##$YMIN_p= -218435
$$ End of Bruker specific parameters
$$ ---------------------------------
##NTUPLES= NMR SPECTRUM
##VAR_NAME=  FREQUENCY,     SPECTRUM/REAL,   SPECTRUM/IMAG
##SYMBOL=    X,             R,               I
##VAR_TYPE=  INDEPENDENT,   DEPENDENT,       DEPENDENT
##VAR_FORM=  AFFN,          ASDF,            ASDF
##VAR_DIM=   32768,         32768,           32768
##UNITS=     HZ,            ARBITRARY UNITS, ARBITRARY UNITS
##FACTOR=    0.157963299565203, 1,           1
##FIRST=     4113.94340835093, 0,            0
##LAST=      -1062.04002850208, 0,           0
##MIN=       -1062.04002850208, -218435,     0
##MAX=       4113.94340835093, 425122241,    0
$$ Real data points
##PAGE= N=1
##DATA TABLE= (X++(R..R)), XYDATA
$$ [...]
19148F3396j1754N0016L3545n04j8348n2656L0134Q5942J8449r599l3740j0439
19136A44442k5970j8563m3130l2254J7278L029J3674N8547m7228q471J102k1364
19124D1092l2807p485L9261N9265j6227l6700J0727k7298K3157j2255n521j4058
19112B1151L1094L7941Q829k4805k6440P268K6358j2588l2417r3359M5343O0357
19100D8732L8020J8922j4917l4344J1450J0154p706o0061m756M0948m631m3248
19088a437p058n133n16J4095J9044N8559N4593m1637n4556K6191o493k2206m2128
19075h682o654J431j5986L2216N3416K8016k6765j3079n8994L147M0260R168K9595
19062F7089k5686m608j4117m033K8066l953l615j3548n5781l2504N3459J18857
$$ plain form
19148 63396 51642 101658 135203 134699 116351 63695 93829 179771 198220 188621 154881 144442
19136 144442 118472 99909 56779 24525 41803 44832 58506 117053 69825 61354 62456 41092
19124 41092 8285 800 40061 99326 83099 46399 57126 29828 52985 40730 35209 21151
19112 21151 52245 90186 99015 74210 47770 55038 81396 68808 36391 -56968 -11625 48732
19100 48732 86752 105674 90757 56413 67863 78017 70311 10250 5494 46442 41811 -1437
19088 -1437 -8495 -13628 -14144 -49 18995 77554 132147 90510 35954 62145 55652 33446 -8682
19075 -8682 -15336 -13905 -29891 2325 55741 83757 56992 43913 -15081 -11934 28326 37494 67089
19062 67089 41403 36795 22678 18645 46711 42758 39143 25595 -30186 -62690 -9231 109626
19050A09626L1889k5495J0565K2821l4956p0579k7853L7322N38n174k3138J1529
19038C7095p602k7962K2718N1957R451o4436m2795l7772K6994N3082L3207J9713
19026G3650l6325M030k9959j8700L8664L9461J4973j7556K7715p548m4010R15
19014D5310L2087K038m806n0979N447O5643m1491l769K8553N376j4654l7012J6872
19001D8615K152k7656k0652m0581J0746N4592M8908M5404k9649l50p1800n9958
18989d0229P1471O0235k3485k4575j4846n943J5651j3214l0521J3375M4065J8412
18977G0396k8153k0938m1650k0187o55Q664L3186p704L1358K9038q271j7289K3658
18964E1453L0432M1867p1339l3362K1594k519n193n5810k5785Q2877J5552j1153
$$ plain form
19050 109626 141515 116020 126585 149406 114450 43871 16018 53340 53878 48704 25566 37095
19038 37095 29493 1531 24249 76206 85657 21221 -21574 -59346 -32352 20730 53937 73650
19026 73650 37325 41355 11396 -7304 31360 70821 85794 68238 95953 88405 44395 45310
19014 45310 77397 79435 74629 23650 29097 94740 53249 49480 78033 83409 68755 31743 48615
19001 48615 50767 23111 2459 -38122 -27376 27216 76124 121528 91879 91529 19729 -40229
18989 -40229 31242 91477 67992 43417 28571 22628 38279 25065 -5456 7919 51984 70396
18977 70396 42243 21305 -20345 -40532 -41187 -32523 663 -7041 24317 53355 45084 27795 51453
18964 51453 81885 123752 52413 19051 40645 38126 32933 -22877 -48662 34215 49767 38614
18952C8614k9668j4441J9110M0365J8906M880l4579K910J1416k585P1m4386J7499
18939B8112K8839M0678j0418P031l2051m8078L1045P538k8919m1089L2837N2145
18927F7670M1586k4537n1493k2948J2292l3147j4930M1246O7922N2658L6073k7598
18915A44794q0279l2831J3280O1681l4766k1901R362m4574m6664K7500K3136L5259
18903E3997N830J6217M4017l2857R193o0285P456N5220J6990n3129j8659L2646
18891G6636j3885o611K2208r478j5360j8254j6948O2442K5963l1657l4116j0596
18879C0344K7522N4548O666k8016k6384J9234N7945l620N007N8398R6951R7306
18867C95901Q73m7219p6822r9955q4963m0716j7307J7772L7926J5867J4682j4149
$$ plain form
18952 38614 8946 -5495 13615 53980 72886 77766 43187 46097 57513 54928 54999 10613 28112
18939 28112 56951 97629 87211 94242 62191 14113 45158 52696 23777 -17312 15525 67670
18927 67670 109256 84719 33226 10278 22570 -10577 -25507 15739 83661 136319 172392 144794
18915 144794 64515 31684 44964 106645 71879 49978 59340 14766 -31898 -4398 18738 53997
18903 53997 59827 76044 120061 87204 96397 36112 43568 98788 115778 62649 43990 76636
18891 76636 62751 56140 78348 68870 53510 35256 18308 80750 106713 75056 40940 30344
18879 30344 57866 112414 119080 91064 64680 83914 141859 138239 143246 201644 298595 395901
18867 395901 396774 349555 272733 172778 87815 47099 29792 47564 85490 101357 116039 101890
18855A01890j3486j7862j8635J8278K0451m9250m8570Q939J9720K306P5828K434
18843A02043p0392m5252P405m211P758M6413K7085l0800l7457M0604P8422K3155
18831A44773l7859J7971k559m2497M2642P5573P0622O5162Q1638L6960j2405q1729
18819C58292m1041J0810o1077J084P7321L8842m2464o7144m7968n1715n3341m5733
18807G5866J6134m0262k0785r498J1879K6287M9026L9557m3581k4750j2235j4207
18795E3431l0707n6818L8259K7985Q990k4930o227l5260L5486K3559k1946J7610
18783B9432L4606J4117n091k4940J2255N1020L4048J0130J7957N7503N3265P7783
18771C62085R2692Q9565J17233J31793J70660M1505j79025k44868j73265j25093
$$ plain form
18855 101890 88404 70542 51907 70185 90636 41386 -7184 1755 21475 23781 99609 102043
18843 102043 31651 -13601 -6196 -10407 -2649 43764 70849 40049 2592 43196 121618 144773
18831 144773 106914 124885 122326 79829 122471 198044 268666 333828 415466 452426 440021 358292
18819 358292 317251 328061 266984 268068 345389 384231 341767 274623 226655 174940 121599 75866
18807 75866 92000 51738 30953 21455 33334 59621 108647 148204 104623 79873 67638 53431
18795 53431 22724 -34094 4165 32150 41140 16210 9983 -25277 10209 33768 11822 29432
18783 29432 64038 78155 73064 48124 60379 111399 145447 155577 173534 231037 284302 362085
18771 362085 454777 544342 661575 793368 964028 1005533 826508 581640 408375 283282
18761B83282p650J671l3121n7338m4853k3800J6461q0758j015O621l8741O599
18749B7358O781j9544K6213M6962L0580m7978P049n412l9224j4638L2465L3413
18737H4025m7312k4557K2140L5736O32k4857j9406P587O174j3486j6927j0271
18725e22M4172M2171N6457K6726N5154j4155J741J4248o7540k9568P32j4266J0173
18712A25523J6185J1076J2030p2879m6938k146J3781K0913l1270R51k2947l6544
18700a2265N649K6720k4779k8482L363l4296J9307L4756M6990N164L8102Q0943
18688A61172M8915j431l0224j9910j445K1864Q989r415m2821m590j485j8976r506
18675A01137j9N338n208M4466k2304l9655L2020N5015r41j7865r1171l1215L1276
$$ plain form
18761 283282 275632 277303 244182 186844 141991 118191 134652 53894 52879 59500 20759 27358
18749 27358 34139 14595 40808 87770 118350 70372 77421 72009 32785 18147 50612 84025
18737 84025 36713 12156 34296 70032 70664 45807 26401 33988 40162 26676 9749 -522
18725 -522 43650 85821 142278 169004 224158 210003 211744 225992 158452 128884 129616 115350 125523
18712 125523 141708 152784 164814 91935 44997 42851 56632 77545 46275 47226 24279 -12265
18700 -12265 -6616 20104 -4675 -33157 -29794 -64090 -44783 -10027 36963 42127 80229 161172
18688 161172 210087 208656 178432 158522 157077 178941 187930 178515 135694 131104 129619 110643 101137
18675 101137 101118 106456 101248 145714 123410 83755 115775 170790 169849 151984 60813 29598 60874
18662F0874L9508L0061K701O278N393K0408M064J006j0825n7942l0273J6471l703
18649H4021J0537J5538K0018K2603O857m3157l1402l1870j2358Q0438L080p4439
18637D9866K1679L8754l8014k1124j9463P90k6647j5610J10481Q2106k9322q7290
18625F6206j2328k7105o182L2688Q4568K6118n114k877Q515M0226R637k8380q307
18612A77665M6785p190k3089n4449l0468J2392m111k5535q624k0475r641K7953
18600H1213M5963L4225m5404k978N7445L1642l8506k3042J2229K1448p578K8722
18588A95379l4228n221K0041J9805P639M4851O9230M1232L9934N3495K0665o5389
18576D07433n79N3261K9025J1133j0598n2071m0461n9638j20603k2313j800L5595
$$ plain form
18662 60874 100382 130443 133144 139422 144815 165223 169287 170293 159468 101526 71253 87724 84021
18649 84021 94558 110096 130114 152717 159574 116417 85015 53145 40787 121225 124305 49866
18637 49866 71545 110299 72285 51161 31698 32488 5841 -9769 100712 182818 153496 66206
18625 66206 53878 26773 20591 53279 137847 163965 158851 155974 164489 204715 214352 185972 177665
18612 177665 224450 217260 194171 139722 109254 121646 117535 92000 83376 62901 53260 81213
18600 81213 127176 161401 115997 113019 170464 202106 163600 140558 152787 174235 166657 195379
18588 195379 161151 155930 175971 195776 203415 248266 317496 358728 398662 452157 472822 407433
18576 407433 406854 460115 489140 500273 489675 437604 397143 337505 216902 194589 192789 228384
18564B28384l4463l7460l310r211l370J4563K1478R77K3418J3581j036j3558R817
18551B09810K73n9276J462R1820J8094l9751k0655j4100j7290m0807j4900N4666
18539A69346N5543K6319M5698J1815J0485J8007o461J0804O7800R092m3573k415
18527C72460P1880O3620m783m5512l4590J3557n2244o5822j6939q1992L89L5194
18515B55218L2948J0020k7167j5227k4629j02069L0174O0662J0456k4873J8628
18504B24141J2473j3210P9524j6360J2315m997K3531K577n0049j0916j7737L424
18492B44716O0790k469l3662m9744J6113N020l2661m5745L7195M5062j3925L8732
18480B69422J4695j5458m9184o2524P441N9299K7417J2076L838j4539n498R138
$$ plain form
18564 228384 193921 156461 153151 143940 140570 155133 176611 177588 201006 214587 213551 199993 209810
18551 209810 210083 150807 152269 244089 262183 222432 201777 187677 170387 129580 114680 169346
18539 169346 224889 251208 296906 308721 319206 337213 330752 341556 409356 418448 374875 372460
18527 372460 444340 507960 503177 457665 423075 436632 384388 318566 301627 219635 220024 255218
18515 255218 288166 298186 271019 255792 231163 129094 159268 219930 230386 205513 224141
18504 224141 236614 223404 302928 286568 298883 293886 317417 319994 269945 259029 241292 244716
18492 244716 305506 303037 269375 219631 235744 240764 208103 162358 199553 244615 230690 269422
18480 269422 284117 268659 219475 156951 164392 223691 251108 263184 267022 252483 246985 256123
18468B56123J932l1091N180M0345K7718j1365j0154M0687K2296j5803J4475J0408
18456C50751k6347j6360J2039K9887R29N0145J2045l6313j5589J2064O6985N209
18444D45445n0111L4703M6351J0611L1130n7348l0926p3144N983K6677N8837O3432
18432E11640K6828q7487m0615j670J3224j9027R275k5299J7328L6648J8048j5362
18420D43531R3843P2534J0283M3236N2806O9300P3651N3683J3467m4337J6805
18409H98802K9230K3590N9490M9716R5729J01257K8835L6202J09933P0206K3036
18398A526026R7539P0856O5421P0945L8437n607m2092k6611k9219l2200r1092
18387A642403j07972p642L5565N8237P0460J22837J83907K13107K57079K64284
$$ plain form
18468 256123 258055 226964 232144 272489 300207 288842 278688 319375 341671 325868 340343 350751
18456 350751 324404 308044 320083 349970 350899 401044 413089 376776 361187 373251 440236 445445
18444 445445 395334 430037 476388 486999 518129 460781 429855 356711 362694 389371 448208 511640
18432 511640 538468 450981 410366 408696 421920 402893 412168 386869 404197 440845 458893 443531
18420 443531 537374 609908 620191 663427 716233 785533 859184 912867 926334 881997 898802
18409 898802 928032 951622 1011112 1060828 1156557 1257814 1286649 1322851 1432784 1502990 1526026
18398 1526026 1623565 1694421 1759842 1830787 1869224 1863617 1821525 1794914 1765695 1733495 1642403
18387 1642403 1534431 1526789 1562354 1620591 1691051 1813888 1997795 2210902 2467981 2732265
18377B732265L44894N30420P09767R39516J406355K160036L550710N776541R064920
18368B7215424J2224217J1814188N151304m648943j1374719j2041504q949231
18361A9390736n557775l418497k173896j440134j011464o92953m44529l47282
18353D304206k46301j39068q4630n1937j9309n8495j6956O609k8520L8638N472
18342C709709j2272o3053K3388J1082q7883q4889l8117k1110J49254K34339L25875
18331D146323M56145O28206R02180J289632J890611K824027M568137P417279J1204526
18322C5327066J4096911J2002165L448212o058656j0222564p460265q75584O156906
18314D6414191J0115474P635974j271512j0342675j3886974j1870677q078780
$$ plain form
18377 2732265 3077159 3607579 4317346 5256862 6663217 8823253 12373963 18150504 27215424
18368 27215424 39439641 51253829 56405133 51756190 40381471 28339967 19390736
18361 19390736 13832961 10414464 8240568 6800434 5788970 5096017 4651488 4304206
18353 4304206 4057905 3918837 3834207 3782270 3762961 3704466 3687510 3694119 3665599 3704237 3709709
18342 3709709 3697437 3634384 3657772 3668854 3580971 3496082 3457965 3436855 3586109 3820448 4146323
18331 4146323 4602468 5230674 6132854 7422486 9313097 12137124 16705261 24122540 35327066
18322 35327066 49423977 61426142 64874354 58815698 48593134 41132869 40257285 46414191
18314 46414191 56529665 64165639 62894127 52551452 38664478 26793801 18715021
18307A8715021n025501l213544k102360j479251j126313q16356n96712l94036
18299C960948k75110j11096q381P725n5016j85605j64013k12259j46636n8413
18289B752144q3821o7779o0134o9151n9862o7429j5611N7960J55525J76425K42961
18278B961228L50156N31973P64871R74636J463810K267008L579745N875834R376121
18269B8145382J3145134J3823577P759036l318404j2130059j4187795j1212046
18262B2024825p299764m430437k697372j829619j319441r22117p25742n14765
18254B285568m49130k53042j93417j59635j34450p0966j02875m5188o301K7757
18244H98321J18064J40811J7733p0295j37282j20955j33001o9948q521n7756o3177
$$ plain form
18307 18715021 13689520 10475976 8373616 6894365 5768052 4951696 4354984 3960948
18299 3960948 3685838 3574742 3566361 3574086 3519070 3333465 3169452 2957193 2810557 2752144
18289 2752144 2668323 2600544 2540410 2471259 2411397 2343968 2328357 2386317 2541842 2718267 2961228
18278 2961228 3311384 3843357 4608228 5582864 7046674 9313682 12893427 18769261 28145382
18269 28145382 41290516 55114093 62873129 59554725 47424666 33236871 22024825
18262 22024825 14725061 10294624 7597252 5767633 4448192 3526075 2800333 2285568
18254 2285568 1836438 1583396 1389979 1230344 1095894 1024928 922053 876865 870564 898321
18244 898321 1016385 1157196 1174929 1104634 967352 846397 713396 643448 634927 577171 513994
18233E13994n1944r732J9829m4727n7406o1119r8139q2601M812R756L8459j074
18221A80108j5286N309L9657K2590n399j2968q87Q164j0544m4695j3729P7491
18209B29811M3828m1745n4618p0811K925M3392M8918Q7830P7562R4244J00731
18198E62067L9415N9574L3891o4858q9923p8100p9395n8660m3315m6759l4999
18187A98938l3257m973L2900j2178j9119K2385j3439k7930j7870K2061K8124r459
18175A66183p997l466k1631J2881L4338O2510M584J1727J4074l4040l5577n673
18163A97913o999K2942J005J6842j131p957N966L8701M6623K5797M648l6155j8357
18150B89838O5564M9050J0158q119O1425R1806O8579M3152K0653J1935o8704q019
$$ plain form
18233 513994 462050 452318 472147 427420 370014 308895 210756 128155 132967 142723 181182 180108
18221 180108 164822 170131 209788 232378 226979 214011 213124 221288 210744 166049 152320 229811
18209 229811 273639 231894 177276 106465 109390 152782 201700 289530 367092 461336 562067
18198 562067 601482 661056 694947 630089 540166 462066 382671 324011 280696 233937 198938
18187 198938 165681 160708 193608 181430 162311 184696 171257 143327 125457 147518 175642 166183
18175 166183 158186 154720 133089 145970 180308 242818 247402 259129 273203 239163 203586 197913
18163 197913 190914 213856 214861 231703 230572 222615 228581 267282 313905 339702 344350 308195 289838
18150 289838 355402 404452 414610 406491 467916 559722 628301 671453 692106 704041 635337 627318
18138F27318K8494N3485J8991K6301N7455L3835R7008O3935N6878O8542R6858
18127A229100J51435J54192J67889J84933K16514K34581L60814M03996M64422
18118C567876O78794Q68627J177591J666509K660763M252420P096390J2984297
18110C4953267K3750008L5672641K3455783j0106623l2405671l0485180j7929952
18103B6904273r432867n276987l250068k155046j456003j072474q50667o35103
18095B775058n61729l74273k82450k43422j73077j19484j04717j34003j48490
18086F33413n5075j45702r1868l8063K6269P679j2716m258Q123k3942l9737p6706
18074A87417j399J7750o468K181k7374p979n3636m198L9971P4110Q1558K9806
$$ plain form
18138 627318 655812 709297 728288 754589 812044 845879 942887 1006822 1063700 1132242 1229100
18127 1229100 1380535 1534727 1702616 1887549 2104063 2338644 2699458 3103454 3567876
18118 3567876 4246670 5115297 6292888 7959397 10620160 14872580 21968970 34953267
18110 34953267 58703275 94375916 117831699 107725076 75319405 44834225 26904273
18103 26904273 17471406 12194419 8944351 6789305 5333302 4260828 3410161 2775058
18095 2775058 2213329 1839056 1556606 1313184 1140107 1020623 915906 781903 633413
18086 633413 578338 432636 340768 302705 328974 336653 323937 319679 327802 303860 264123 187417
18074 187417 186018 203768 197300 199481 172107 164128 110492 106294 146265 220375 301933 331739
18062C31739Q13m6465o6120K257L4245m8661L6697M2949k6628j1970j11353k6677
18050A10826j4833J9396j1660q0512p3815o9294j745L9227o304M7629J5489M1677
18038A6081m5978p4602m9777K1421J0821o177M6681J4973K1520N9286K3660k0147
18026A7762m5395k1580L2000K8299M660m6394J410l671L270L9764J9747l51j2921
18013A6600N5515K6794N4816M1406m1429j2515l8863q373k6169k8423K7582m2446
18001B4495j9490l6258L0225l0029o465K5433M6005K4638J6475L344o6150o727
17989E496J2637l081m4739n7410k279M0781k9733l0193k853L4675K8221M9120
17977F42J5305j1150q270m652k6010m5498K4107K775k3236M416l7391l4097k5001
$$ plain form
18062 331739 332552 286087 219967 222224 256469 207808 244505 287454 260826 248856 137503 110826
18050 110826 95993 115389 103729 23217 -50598 -119892 -121637 -82410 -88714 -41085 -25596 16081
18038 16081 -29897 -104499 -154276 -132855 -122034 -128211 -81530 -66557 -45037 14249 37909 17762
18026 17762 -27633 -49213 -17213 11086 15746 -30648 -29238 -32909 -29639 10125 29872 29521 16600
18013 16600 72115 98909 153725 195131 153702 141187 102324 93951 67782 39359 66941 24495
18001 24495 5005 -31253 -1028 -31057 -37522 -12089 33916 58554 75029 78373 12223 5496
17989 5496 18133 15052 -29687 -87097 -89376 -48595 -78328 -108521 -111374 -76699 -48478 642
17977 642 15947 4797 -3473 -8125 -34135 -79633 -55526 -52751 -75987 -71571 -108962 -143059 -168060
17964a68060L8935J0927r196L5455N5268K2620N920M7909L8390L3821k8894j8043
17952F5052o6945P626L4530j8788k43m2778J7321J128J0923n2413N1459K0289
17940B7161o3908n2423L5778j1596j5106j1739j8470r396L9375K3450J7756J3876
17928b5242j3501J8662L2401j9332m866M6828l0322q5908j3064O2185j2308j8893
17916f3360j8048M604Q379M4013o4567k1838K3603K6496K7233K5397M9573j4256
17904B7229j1383j757k2449j2283L5122j4334j757k80l5963O473p000O77J7180
17891b0525L5763j7867j1417J5697L308m5419l3463P494M0249K3170o554K4763
17879A5199Q863k6114l3935J5128k6439l0900n6356K9427O0892J1462J0468K4638
$$ plain form
17964 -168060 -129125 -118198 -127394 -91939 -36671 -14051 -8131 39778 78168 111989 83095 65052
17952 65052 -1893 5733 40263 21475 21232 -21546 -4225 -3097 7826 -44587 6872 27161
17940 27161 -36747 -89170 -53392 -64988 -80094 -91833 -110303 -119699 -80324 -56874 -39118 -25242
17928 -25242 -38743 -20081 12320 -7012 -11878 34950 4628 -81280 -94344 -32159 -44467 -63360
17916 -63360 -81408 -76804 -68425 -24412 -88979 -110817 -87214 -60718 -33485 -8088 41485 27229
17904 27229 15846 14089 -8360 -20643 14479 145 -1612 -1892 -37855 -31382 -38382 -37705 -20525
17891 -20525 15238 -2629 -14046 1651 4959 -40460 -73923 -66429 -26180 -3010 -9564 15199
17879 15199 24062 -2052 -35987 -20859 -47298 -78198 -134554 -105127 -44235 -32773 -22305 2333
17867B333M5974k5262m6450M100K2789M4711P9422R363Q9127J0197o1739l8721
17855A35844M463k6939m9122n190n07k1411n4575L4405K9851l7814j9450l7890
17843d8335j1144K1627M5820L5825m9561k888n6755k8666J1488L4232L8003j212
17831a1566o5761n0332L799P8877N131j0388K8095O772J1313J8943K1636k35M4762
17818H1046L654j381j3436P8517Q7132N8844M992k3495o3904j7838l5679k5356
17806A33096K9800l9251l711N4100l0932r5116l2561R775K7302M2622q312k03
17794H6609j6323l8165m8332M364O2875k0153J5888k9961J972L7562l0438j5249
17782A0649n967K5947n1033l048L1239l3676j2348j9824o632J3138N0952L6505
$$ plain form
17867 2333 48307 23045 -23405 -19305 3484 48195 127617 136980 226107 236304 174565 135844
17855 135844 140307 113368 64246 59056 58549 37138 -17437 16968 46819 9005 -10445 -48335
17843 -48335 -59479 -37852 7968 43793 -5768 -8656 -65411 -94077 -82589 -48357 -10354 -11566
17831 -11566 -77327 -127659 -123860 -44983 -39852 -50240 -22145 -15373 -4060 14883 36519 36284 81046
17818 81046 84700 83319 69883 148400 235532 294376 299368 275873 211969 194131 158452 133096
17806 133096 162896 123645 119934 174034 143102 47986 15425 25200 52502 95124 86812 86609
17794 86609 70286 32121 -16211 -11847 51028 30875 46763 16802 18774 56336 25898 10649
17782 10649 4682 30629 -20404 -23452 7787 -25889 -38237 -58061 -64693 -51555 -603 35902
17770C5902k8019l8114l6151k6187O8862L4166J5824K437L6478N0533L5290N2175
17758B03196K3753n9437k4402n1861q4100j6868J6659J8766j4602k1138q986l2461
17746e1481K9027L7765k362p0137j8839L8472O810m886K736J3296j4518j8464
17734e2581M0847m9281J3620k5055n3765O2786M8021J0917k6266l839j5912l7315
17722h7823j5468n655K7639n8927k025K4324j7894o867O2187N1773M527k1786
17710d5995n0046j3012O8661r721k0640q325p474p200j6053K5613L2405K7691
17698b4096L1675K0429L5843k8650K689j7479p3209m1361k394O6660M1848j7788
17686e833l4005k8011R86p247K1056P649L2468N0518k8197J1093K7581k5710q631
$$ plain form
17770 35902 7883 -30231 -66382 -92569 -23707 10459 26283 28720 65198 115731 151021 203196
17758 203196 226949 167512 143110 91249 7149 -9719 6940 25706 11104 -10034 -19020 -51481
17746 -51481 -22454 15311 12949 -57188 -76027 -37555 -30745 -35631 -32895 -19599 -34117 -52581
17734 -52581 -11734 -61015 -47395 -72450 -126215 -63429 -15408 -4491 -30757 -34596 -50508 -87823
17722 -87823 -103291 -108946 -81307 -140234 -142259 -117935 -135829 -142696 -80509 -28736 -24209 -45995
17710 -45995 -96041 -109053 -40392 -50113 -70753 -79078 -86552 -93752 -109805 -84192 -51787 -24096
17698 -24096 7579 28008 63851 35201 37890 20411 -52798 -94159 -96553 -29893 11955 -5833
17686 -5833 -39838 -67849 -66863 -74110 -53054 -45405 -12937 37581 9384 20477 48058 22348 13717
17673A3717P517j0087p308k5972k676K9795L3476k0141n0154l8040o381K7355
17661d8899P8526P793p829k6389J6519O5391j625N6961R5615O5520j4974N3760
17649C40369N7518M037K7354J2112J7052r0384q7650p9933k9492n929k7148o0643
17637G7263j0892K6527K1660J531k1310j446M3184k2695k8973j02009m895N5682
17625C3627J0517l154J6144j0647J8157J1944m0888J281K015q455o731l970o96
17612A9144K5568N7753J729k6510k840N4975P9342L4K4072L2002L2524M9060l983
17599C42870k5299l3049n0330n5580m1339l9706l1147l4537k1061l174M0109J3902
17587F1659j593L9922J1891k1785k8906K3404j8875q0840l7960P01Q2538m5663
$$ plain form
17673 13717 21234 11147 3839 -22133 -24809 4986 38462 18321 -31833 -69873 -76254 -48899
17661 -48899 29627 37420 29591 3202 19721 85112 83487 140448 236063 301583 286609 340369
17649 340369 397887 401924 429278 441390 458442 368058 280408 200475 170983 165054 137906 77263
17637 77263 66371 92898 114558 116089 94779 93333 136517 113822 84849 -17160 -22055 33627
17625 33627 44144 40990 57134 46487 64644 76588 35700 36981 38996 30541 23810 19840 19144
17612 19144 44712 102465 104194 77684 74844 129819 209161 209195 233267 265269 297793 346853 342870
17599 342870 317571 284522 234192 178612 137273 97567 66420 31883 10822 7648 47757 61659
17587 61659 60066 99988 111879 90094 61188 84592 65717 -15123 -53083 -52382 30156 -15507
17575a5507k88K4M063J3194m1372J4880K8006j6992M5005L4029j881l0934m8499
17562a6272j7871L1420K7826k8052j7328l0848Q720p8K5123O497j3463j4634J0046
17549b8914K3107o88K1822K6474k6497j6018J8876j2400N4624L8037k4934l4449
17537C9040L4588l3383q914r561m887l0213M377M4738K0202l4948j3591j2810
17525e362p634j4138L8030J7406K7298k9829p049J4346q351q9556M961J640K5114
17512c3124M5124J9438N9981J1174k1435j8342K805o3730m7729J4499n7420L389
17500h5370N7051P6459N0242J2817L4079k65k0920j5667p4585m1228K4411N3303
17488G0327m4541k7288k0077l25N5333J4320j760n757N674J6659n1282n7717R235
$$ plain form
17575 -15507 -15795 -15771 -11708 1486 -39886 -25006 3000 -13992 31013 65042 63161 32227 -16272
17562 -16272 -34143 -2723 25103 -2949 -20277 -51125 -42405 -42483 -17360 -10863 -24326 -38960 -28914
17549 -28914 -5807 -6495 15327 41801 15304 -714 18162 5762 60386 98423 73489 39040
17537 39040 73628 40245 31331 21770 16883 -13330 -8953 35785 55987 21039 7448 -5362
17525 -5362 -12996 -27134 10896 28302 55600 25771 18722 33068 24717 -64839 -59878 -58238 -33124
17512 -33124 12000 31438 91419 102593 81158 62816 65621 1891 -45838 -31339 -88759 -85370
17500 -85370 -28319 48140 98382 111199 145278 145013 124093 108426 33841 -7387 17024 70327
17488 70327 25786 -1502 -21579 -21904 33429 47749 45989 40232 45906 62565 11283 -46434 -37199
17475c7199j0941M0310K3791J2356j388p591n548K5675m2023o5626o1362J142
17463a28404P9021N2184K3971n612l4691K0711N7922L8999j4990o4841r5N8891
17451H3066j4473m5246J6940L8521N3264k5199L7381J28009K11422J73359l7758
17440F19286j34970j39066j37752q0965l9528l9033J2934k9044m9432L6339L3431
17429E2200M5438J3144p171n5275l5561J7152L0113M0725m989R605k3922M0131
17417A21590p58p0026k0951M6779J0088p1187J5450n6275n5469M6636K2261J4572
17405B710M8164J2735m3632N722o6215k8043M9531j40m425O9016K6053n698j9555
17392D6223P265J4J746Q005N9348M1636J1940k4416m5108P33j55L0351n7791j9033
$$ plain form
17475 -37199 -48140 -7830 15961 28317 26929 19338 13790 39465 -2558 -68184 -129546 -128404
17463 -128404 -49383 2801 26772 21160 -13531 7180 65102 104101 89111 24270 24175 83066
17451 83066 68593 23347 40287 78808 132072 106873 144254 272263 483685 657044 619286
17440 619286 484316 345250 207498 126533 87005 47972 60906 31862 -17570 18769 52200
17429 52200 97638 110782 103611 48336 12775 29927 60040 100765 95776 105381 81459 121590
17417 121590 120832 50806 29855 76634 86722 15535 30985 -25290 -80759 -34123 -11862 2710
17405 2710 50874 63609 19977 25699 -40516 -68559 -19028 -19168 -23593 45423 71476 65778 46223
17392 46223 53488 53502 55248 63253 122601 164237 176177 151761 106653 107386 107231 137582 79791 60758
17378F0758P000M235J213J895k618p5736J9684N4488L0229M0171Q25m269k6637
17365A11238j0968J8751O914q867j1273n1359k0217J120k2276k4167l4728K8766
17353a7066J4288L2017K3077o2853J939M9861j8311j6683m2602J3922O7350J2015
17341E6954L6464M9504o3817l0035p058J2948k7475k1369R747j2536L6830l0791
17329I366R755j1242L0631J3139k6750j7412R131Q1866M470k1229J0068K4316
17317A16109j0584k2694k7214L253m925k9088M6497J9524j6031j641M4065K1515
17305A38786l4617K014N139j3751o7976K7265N6006k0851k2456J837k5568m6656
17293h28K8291M2033k1996l5093M6426J4603n1878n6271O107P7686N6816L7452
$$ plain form
17378 60758 67758 71993 73206 75101 72483 -3253 16431 70919 101148 141319 142144 137875 111238
17365 111238 100270 119021 125935 117068 105795 54436 34219 35339 13063 -11104 -45832 -17066
17353 -17066 -2778 29239 52316 -10537 -8598 41263 22952 6269 -36333 -22411 44939 56954
17341 56954 93418 142922 79105 49070 42012 54960 27485 6116 15863 3327 40157 9366
17329 9366 19121 7879 38510 51649 24899 7487 16618 98484 102954 81725 91793 116109
17317 116109 105525 82831 55617 58870 53945 24857 71354 90878 74847 73206 117271 138786
17305 138786 104169 106183 111322 97571 29595 56860 112866 92015 69559 71396 45828 -828
17293 -828 27463 69496 47500 12407 58833 73436 21558 -34713 -28606 49080 105896 143348
17281A43348k1093l7634k3255j6986j1620M4697J642j578j5698L5682r717l4744
17269E3044J2060J1515l5170K6928M4798k5023L3515Q285J7078O1478N7055N6945
17257C22508o148k4656M868n0429j3622J2952J3173j5442n6440l4092J2477L190
17245A68339j5633k5963l2614O2605K2558p3349m8622J1553M6520j5708N236J0242
17233A15164L1994N813J9096P133j9560J2460l038L3969k6868k7423N7352J9054
17221B25146m3625k6556K6195K8128P4814Q2791L0943J2706j4104o2346j7938
17210C16154L7149N7419O71k6167m5845L2340J874j4034L1622J6376j2585M882
17198C99856j3009m1415L6338L6461K7170m2300j3530K0699M0604J1647J1692
$$ plain form
17281 143348 122255 84621 61366 44380 32760 77457 79099 77521 61823 97505 87788 53044
17269 53044 65104 76619 41449 68377 113175 88152 121667 129952 147030 208508 265563 322508
17257 322508 316360 291704 296572 246143 232521 245473 258646 243204 186764 152672 165149 168339
17245 168339 152706 126743 94129 156734 179292 105943 57321 68874 115394 99686 104922 115164
17233 115164 147158 152971 172067 179200 159640 172100 169062 203031 176163 148740 206092 225146
17221 225146 181521 154965 181160 209288 284102 366893 397836 410542 396438 334092 316154
17210 316154 353303 410722 411393 385226 339381 371721 373595 359561 391183 407559 394974 399856
17198 399856 386847 345432 381770 418231 445401 403101 389571 410270 450874 462521 474213
17187D74213K677j6195m5392K719L2685K8415m864l144N0116L0903j3848P9805
17175F18090P5057K5042l8209J5706M8591k115L5777J6706L1497N1178L6793l0206
17163H83907o4402n7289O3494J29398N1809J03290J00731J60132J87417J53275
17153A711762K17143J24347J75495J58125J89943K82015K61345K90473L98703
17144C809351N06956P20686J016088J412951J979834K908724M619186O965224
17136B3939000R651342J1806896J1973635R685010O047508K762898Q69814q64504
17128G5871599l909376q093130j1481670j2408838j0851365q226802n677364l722410
17120A1500644k461183j634642j210965r09943o95743n17894l75444k28417k32953
$$ plain form
17187 474213 476890 460695 415303 418022 450707 479122 474258 471114 521230 552133 538285 618090
17175 618090 693147 718189 679980 695686 744277 742162 777939 794645 826142 877320 914113 883907
17163 883907 819505 762216 825710 955108 1006917 1110207 1210938 1371070 1558487 1711762
17153 1711762 1928905 2053252 2228747 2386872 2576815 2858830 3120175 3410648 3809351
17144 3809351 4316307 5036993 6053081 7466032 9445866 12354590 16973776 23939000
17136 23939000 33590342 45397238 57370873 67055883 73103391 75866289 76736103 75871599
17128 75871599 71962223 63869093 52387423 39978585 29127220 20900418 15223054 11500644
17120 11500644 9039461 7404819 6193854 5283911 4588168 4070274 3694830 3466413 3233460
17111C233460j54374r5055k7854K9283J5408k4641Q4119R7177N8770J13014J70738
17100C500045K37598M11755N01436P28128R57182J437242K105213L126305M833492
17091A7838396P188757R790921J1462786J1033737Q195331M383503J366380k49706
17083G1010105j967056m920431q458353j1030797j1290561r458314o900204m630415
17075A2353974l052138k093177j441997j049664q00424o24662m38505l68735l37011
17066B147661k64589j91650j68569j41993j80160j35157r6330r7368o0568n2743
17056G58534j4396O4855j8745l1094k1281k9370j7031J9420k7965j0877K206r003
17044F65253l5522n9924L4203M3545j0163q5472j5261n4418q5089k5726l8731
$$ plain form
17111 3233460 3079086 2984031 2956177 2985460 3000868 2976227 3060346 3157523 3216293 3329307 3500045
17100 3500045 3737643 4149398 4650834 5378962 6336144 7773386 9878599 13004904 17838396
17091 17838396 25027153 34818074 46280860 57314597 65509928 69893431 71259811 71010105
17083 71010105 69043049 64122618 55664265 44633468 33342907 23884593 16984389 12353974
17075 12353974 9301836 7208659 5766662 4716998 3916574 3291912 2853407 2484672 2147661
17066 2147661 1883072 1691422 1522853 1380860 1200700 1065543 969213 871845 811277 758534
17056 758534 744138 808993 790248 759154 737873 708503 691472 710892 682927 672050 674256 665253
17044 665253 629731 569807 604010 647555 637392 551920 536659 482241 397152 371426 332695
17033C32695o1990l9428o3350n6433m1124K984L4706Q836K289j5206k9171j2329
17021F2479L2534J2004k2052r472J3257k9231o7320l361P261k9995J5454K3824
17009E382N2603M503Q555M0230k0452p940M9834M7952L5568O6685N1006Q354j6155
16996C26125P819j2537m6682o4458m9877J260l1482n7647K2872r794n3323K7628
16984E9904o684L1478K594p1721Q571J6030o6699k2815n2066J3647O7968M5527
16972B5734O8975L3624j7211J6005p5253p8349n0669j2144J7501M3221K2317P415
16960A166L0386m7177k8429l7871M2786K8547k4557n1826Q096J1754J9901k1963
16948f9187P115J7697Q056M6248R892Q058M8298M012q293m0388K6862K2021k5874
$$ plain form
17033 332695 270705 231277 167927 111494 70370 73354 108060 116896 119185 103979 74808 62479
17021 62479 95013 107017 84965 75493 88750 59519 -7801 -11162 -3901 -33896 -18442 5382
17009 5382 57985 62488 71043 111273 90821 82881 132715 180667 216235 282920 333926 342280 326125
16996 326125 333944 321407 274725 210267 160390 161650 130168 72521 95393 85599 32276 59904
16984 59904 53220 84698 87292 15571 24142 40172 -26527 -49342 -101408 -87761 -19793 25734
16972 25734 94709 128333 111122 127127 51874 -26475 -77144 -89288 -71787 -28566 -6249 1166
16960 1166 31552 -15625 -44054 -81925 -39139 -10592 -35149 -86975 -78879 -67125 -47224 -69187
16948 -69187 -62072 -44375 -36319 9929 19821 27879 76177 80189 71896 31508 58370 80391 54517
16935E4517J9434J7887M814L6237K9156k9737k9959j0280j1959O5463M1988m1760
16923A45801m1085k2365j2288J2194r096n77K8469O031k3270p3284l2414k5684
16911d7568k3730k5452P5957J1721N9251K6260M507m5974R201j8534l6783M894
16899f250l7038J4097K6482J9813l2592P2740K3600J5890O7884m853p0558j7377
16887G1838J5903J0869j855j9562k6443L2531J3668k1094l58n356l4509M2952
16875G8584N704l5281j2171P1431Q7525J0311p3097J808L0297k7534o5733J2353
16863H4197k3373o4152m5244k5629O3794P9776J0623l7662k4209m4969L2740K7829
16851C3721k4217j7422j3417m3542M803K1994M7034O0230L4452j0413k5114j8581
$$ plain form
16935 54517 73951 91838 96652 132889 162045 132308 102349 92069 80110 145573 187561 145801
16923 145801 104716 82351 70063 82257 73161 72584 101053 107084 83814 10530 -21884 -47568
16911 -47568 -71298 -96750 -20793 -9072 50179 76439 80946 34972 44173 25639 -11144 -6250
16899 -6250 -43288 -29191 -2709 17104 -15488 57252 80852 96742 164626 159773 89215 71838
16887 71838 87741 98610 96755 77193 50750 83281 96949 75855 75497 70141 35632 78584
16875 78584 84288 49007 36836 108267 195792 206103 133006 134814 165111 137577 71844 84197
16863 84197 60824 -3328 -48572 -74201 -10407 69369 79992 42330 18121 -26848 5892 33721
16851 33721 9504 -7918 -21335 -64877 -60074 -38080 8954 69184 103636 93223 68109 49528
16839D9528J2206N546m3554k4232j1488J7021J7896j2607j3315M4528P1995p7565
16827C5959n4788o867m5217K0553j5771L02K2382M3227J002N4705N7860m1147
16815G2200o6839l6523l075o06k8231m0317K8114L4765j9326L2558O0486N9997
16803I3203r324j6703J7702j6850J1115M9213N8395L8064J7102n811j9026n7337
16791A59743J916L7880N416K3594K6973k3479p4798j11359n360O6245m99K1638
16779A27910N3440j7232m5536L4641L5570K9320m7065m7650J3268l3863k5935
16768G6868P7223M6663R493N062M8253K1355O098J9959J2922N2108J6798j0600
16756C82202R032J47631J28673N6807J11909J40910J37818J53945J11411J22499
$$ plain form
16839 49528 61734 67280 23726 -506 -11994 5027 22923 10316 -2999 41529 113524 35959
16827 35959 -18829 -25696 -70913 -50360 -66131 -65829 -43447 -220 782 55487 113347 72200
16815 72200 5361 -31162 -34237 -34843 -63074 -103391 -75277 -40512 -59838 -27280 33206 93203
16803 93203 83879 67176 84878 68028 79143 128356 186751 224815 241917 236106 217080 159743
16791 159743 161659 199539 204955 228549 255522 232043 157245 45886 40526 106771 106272 127910
16779 127910 181350 164118 118582 153223 188793 218113 171048 123398 136666 102803 76868
16768 76868 154091 200754 210247 215309 263562 284917 291015 310974 323896 376004 392802 382202
16756 382202 391234 538865 667538 724345 836254 977164 1114982 1268927 1380338 1502837
16746A502837R8933R4385M2099P315j3396q7530q4877j01230q9302j02134n7387
16735A209713j22327j53275j06816j07928q7269q1848l9780m6486o0691p4464
16725C28829n0969n323j0643J3l168m6439j7454K7221K7562R3222O6011J8210
16713D27072j6134K7332M7211j4255P5899J38864J35766J22717J31654Q8013O7353
16702A231492J32908Q2518O4288N2106k0401j4295o941o1832q5300r0914j09885
16691A173744j53117j22090q2700o2323q3609n9990m9853j04844k8622l8521l0689
16680C57386m3682o576j8316l1769m1280j7121O4416L7879o7950L5789L464J6130
16668B88370K5280o563J8881q92l9496J265R021o836K7691M9726l8563p0255j9927
$$ plain form
16746 1502837 1601770 1696155 1738254 1745569 1732173 1644643 1559766 1458536 1369234 1267100 1209713
16735 1209713 1087386 934111 827295 719367 632098 550250 510470 463984 403293 328829
16725 328829 277860 272537 261894 261907 258739 212300 194846 222067 249629 342851 408862 427072
16713 427072 410938 438270 485481 471226 547125 685989 821755 944472 1076126 1164139 1231492
16702 1231492 1364400 1446918 1511206 1563312 1542911 1528616 1521675 1459843 1374543 1283629 1173744
16691 1173744 1020627 898537 815837 753514 669905 609915 560062 455218 426596 388075 357386
16680 357386 313704 307128 288812 257043 215763 198642 263058 300937 232987 268776 272240 288370
16668 288370 313650 307087 325968 325076 285580 286845 295866 289030 316721 366447 327884 257629 237702
16655B37702J0934K5625r072N2239k728p1279q3185p973N4524j0002M7222L0939
16643B74946K5126L0839n3853m2205q313N990r305k4308k5478L582R813N9621
16631B46455j3978o2988J2773L423j4358q843J6466J437N0612K0294M6168o771
16619B90690K6319J5503L4119k2524P2672Q4959M5479J7390M3932M7157M8923
16608G04619L8767j922j413m2197l1228r2219n7078k2831k5569Q641j5526J4008
16596D76052J2026J0835K2867j4485k2099q407R993N495L1639O4993J2161n4845
16584E46225K8934L0995K1495L4842R6237J17201P0707O3110J2722l6087M3371
16573A029752P3608R2798J29173R5864K22138J63573J78390K37301K10286J86928
$$ plain form
16655 237702 248636 274261 265189 317428 314700 243421 160236 152263 206787 196785 244007 274946
16643 274946 300072 330911 277058 234853 226540 232530 223225 198917 173439 177021 186834 246455
16631 246455 232477 169489 182262 185685 171327 162484 178950 180387 230999 251293 297461 290690
16619 290690 317009 332512 366631 344107 416779 501738 547217 564607 608539 655696 704619
16608 704619 743386 741464 740051 697854 666626 574407 517329 494498 468929 477570 462044 476052
16596 476052 488078 498913 521780 507295 485196 476789 486782 492277 523916 588909 601070 546225
16584 546225 575159 606154 627649 662491 758728 875929 946636 1009746 1022468 986381 1029752
16573 1029752 1103360 1196158 1325331 1421195 1643333 1806906 1985296 2222597 2432883 2619811
16563B619811J61138J74106J12280P2445J8737R3023J03680J28684L05194M93238
16553D282336O03032Q16951J181687J794525K648818M147535O225263Q805455
16545C0505602J1140047J1982179J0622539P329356L852501J318063n55537l023329
16537G3171421o421104r861997j1713741j1312932r248816o702151m507608k974045
16529A0429027k084356j446774j065336p42463m50848l76793l33451k41682j76970
16520C510354j46374p0411J9549K1430K4986n6151k0787L1434R0823J43245J33063
16509C681161J28433O4915M9543O3943P5776R0928J07708J94324K82641M14107
16499E153479N63878Q51695J259190J995667L096921M755270O949903R418566
$$ plain form
16563 2619811 2780949 2955055 3067335 3139780 3158517 3251540 3355220 3483904 3789098 4282336
16553 4282336 4885368 5702319 6884006 8678531 11327349 15474884 21700147 30505602
16545 30505602 41645649 53627828 64250367 71579723 75432224 76750287 76194750 73171421
16537 73171421 66750317 56888320 45174579 33861647 24612831 17910680 13403072 10429027
16529 10429027 8344671 6897897 5832561 5090098 4639250 4262457 3929006 3687324 3510354
16520 3510354 3363980 3293569 3313118 3334548 3359534 3303383 3282596 3314030 3404853 3548098 3681161
16509 3681161 3809594 3874509 3924052 3987995 4063771 4154699 4262407 4456731 4739372 5153479
16499 5153479 5717357 6569052 7828242 9823909 12920830 17676100 24626003 34044569
16491C4044569J1225722J0981189Q679041N282550K132506j4010j815381m402876
16483F6113310p598951j0322329j1120761r941126p656330n390517l575651k350694
16475H156951j591071j111543q50354o24356m13993l32932l21532k30595j95077
16466B485498j39722j32530j10408m8328k4829j46308j46633q1049p0648k6902
16456A558141J7352m1225n3718m1785k2015j09087j25207k6510j5522m3940m4523
16445A051961j63775j74289n0345k7115o2889n7564j1356k1953l0958r470r120
16434D33127q843m7845m8922n3316j9846k683q914M4473k0204m7573o969k3452
16422A89033M8946l2592l7564j3514R89N294k4072j2759K9687k5505k0339P227
$$ plain form
16491 34044569 45270291 56251480 64930521 70213071 72345577 72331567 70516186 66113310
16483 66113310 58514359 48192030 37071269 27130143 19473813 14083296 10507645 8156951
16475 8156951 6565880 5454337 4603983 3979627 3565634 3232702 2911170 2680575 2485498
16466 2485498 2345776 2213246 2102838 2054510 2029681 1883373 1736740 1655691 1585043 1558141
16456 1558141 1575493 1534268 1480550 1438765 1416750 1307663 1182456 1155946 1140424 1096484 1051961
16445 1051961 888186 713897 663552 636437 573548 515984 504628 482675 451717 442247 433127
16434 433127 424284 376439 327517 274201 254355 251672 242758 287231 267027 219454 212485 189033
16422 189033 237979 205387 167823 154309 155298 160592 136520 123761 153448 127943 107604 114831
16410A14831L0741K3202K9137J6633l8695k610R245k9199k7178m3706J2184L8764
16398A33349m277J7083j2381N747N5062l1777m7665m3307n8440j485K1368r303
16386B3974N520J2848L846K9749J9489m1050p2286M0241n333o4008l3124M3333
16374c6801P0348l367m9115O856K5567J284o5486J0801k6698J5480J7427J0881
16362b2823K2760l842K3554j9121R52m162n143j1781N9776Q365p5365r5829j325
16349a23984M4939L1397o594K354j8094k828m7785n3370P0740M3772K1714j7822
16337e5561l7291k3147L0417J501J1506J9762P883J0189l893j0137J8666j3685
16325d3790l4028K5021k6747l371J2955L6311m5687k8196J970Q2641k0932n2884
$$ plain form
16410 114831 145572 168774 197911 214544 175849 173239 182484 153285 126107 82401 94585 133349
16398 133349 129072 146155 133774 139521 194583 162806 115141 71834 13394 11909 33277 23974
16386 23974 29494 42342 46188 75937 95426 54376 -17910 22331 16998 -47010 -80134 -36801
16374 -36801 33547 30180 -18935 -12079 13488 14772 -50714 -39913 -66611 -51131 -33704 -22823
16362 -22823 -63 -3905 19649 528 1480 -2682 -7825 -19606 40170 48535 -26830 -122659 -123984
16349 -123984 -79045 -47648 -54242 -51888 -69982 -72810 -120595 -173965 -103225 -59453 -37739 -55561
16337 -55561 -92852 -115999 -85582 -84081 -72575 -52813 -44930 -34741 -38634 -48771 -30105 -43790
16325 -43790 -77818 -52797 -79544 -82915 -69960 -33649 -79336 -107532 -105562 -22921 -43853 -96737
16313i6737Q904K1470r054J893Q0504J8412n7455l5956K7077k7848l6734N886
16301i9638J7373k9805K3033L3831o034n5308K843l8124n059M7174j567K8913
16289h2368K9009M5675K3548J742N7261k3347l5126M681j9537n1928o041L6511
16277a9920k9496j9902N070P837K179n753k8180q086J4286J6002o9117J2722N5657
16264f6701n1839l4601M4780J8010k8551l8114O750N295J3940N1604M3963J1044
16252b4420n390l2023o3342K827K8273j412K1398n445r697m4259L1916K4702r893
16239h6765J3866n1370j3137N195L1868M6455K8942J0615j0000j0987m3399r783
16227h8500o781m594j842K5056N0400j4300j5139j905J9823J4463k2040J4185
$$ plain form
16313 -96737 -87833 -66363 -75417 -73524 6980 25392 -32063 -68019 -40942 -68790 -105524 -99638
16301 -99638 -82265 -112070 -89037 -55206 -61240 -116548 -113705 -151829 -156888 -109714 -111281 -82368
16289 -82368 -53359 -7684 15864 17606 74867 51520 16394 21075 1538 -50390 -56431 -19920
16277 -19920 -49416 -69318 -64248 -56411 -54232 -59985 -88165 -96251 -81965 -65963 -135080 -122358 -66701
16264 -66701 -118540 -153141 -108361 -90351 -118902 -157016 -150266 -144971 -131031 -79427 -35464 -24420
16252 -24420 -29810 -61833 -125175 -122348 -94075 -95487 -74089 -79534 -89231 -133490 -101574 -76872 -86765
16239 -86765 -72899 -124269 -137406 -132211 -100343 -53888 -24946 -14331 -24331 -35318 -78717 -88500
16227 -88500 -95281 -99875 -101717 -76661 -26261 -40561 -55700 -57605 -37782 -23319 -45359 -31174
16215c1174r31m8175j2672j2679p125R5136J5882l2185n295k0275m0659J7417
16203h2735M5213K215j7914L3511k3011J8945J7305k9233k1687l7517j5373o0284
16191a70565l5935j1935J3539K2215N9387K2384K4637o201l1480k0926J7790k1583
16179a38673L8028M7568r060j1443M6535j7490p5374k1148L1607k607j4667L2066
16167i4658J9067L1979j115k7855j4038M3346M3766m4690K2386j9436k9238n0459
16155a20945M253K2238j098k750M188k7663k7161L5712M4970l5037R917K6502
16143f6874P496P6006j9952k2184n85R502n9985k900O2205m5479k0384l7733n836
16130a26703k2773m7517O2287J9575M0467l5511j5701M5566k4640n934K5988J3070
$$ plain form
16215 -31174 -32105 -80280 -92952 -105631 -112756 -17620 -1738 -33923 -39218 -59493 -100152 -82735
16203 -82735 -37522 -35307 -53221 -19710 -42721 -23776 -6471 -35704 -57391 -94908 -110281 -170565
16191 -170565 -206500 -218435 -204896 -182681 -123294 -100910 -76273 -82474 -113954 -134880 -117090 -138673
16179 -138673 -100645 -53077 -62137 -73580 -27045 -44535 -119909 -141057 -109450 -112057 -126724 -94658
16167 -94658 -75591 -43612 -44727 -72582 -86620 -43274 492 -44198 -21812 -41248 -70486 -120945
16155 -120945 -116692 -94454 -95552 -98302 -94114 -121777 -148938 -113226 -68256 -103293 -93376 -66874
16143 -66874 -59378 16628 -3324 -25508 -26093 -16591 -76576 -79476 -17271 -62750 -83134 -120867 -126703
16130 -126703 -149476 -196993 -134706 -115131 -74664 -110175 -125876 -80310 -104950 -110884 -84896 -71826
16118g1826M8592j5152n4808p550Q169j2314k5592K6647P9637M361n3177J6361
16106e6652N0176K9351n7868k427Q293N947N400p2744j2034N5658R473j5442l4032
16093h6901L1901Q471k8921n030q631j7068L8167J3628J5674N3091R226J7011
16081D0618r891n4115m4095L5839n869k5987R830l4302K1525o79K3141m795j3958
16068f2738m7225j0790L0358K9453K506m641r004j8232j6037K1470o836J3878
16056g7838N1127L1973M4492j0241q6234J8835K8274l906j3760M1502M9865K3484
16044I7573k6605p9912k8430K2403n362k2973l678K300K0039p422L1654M2627
16032D2214L6564j6385o746M9103P8963M2880L0214L8563K1349L142m8559k3961
$$ plain form
16118 -71826 -23234 -38386 -93194 -100744 -92575 -104889 -130481 -103834 -24197 -19836 -73013 -56652
16106 -56652 -6476 22875 -34993 -37420 -29127 -23180 -17780 -90524 -102558 -46900 -37427 -52869 -86901
16093 -86901 -55000 -46529 -75450 -80480 -89111 -106179 -68012 -54384 -38710 14381 23607 40618
16081 40618 30727 -23388 -67483 -31644 -37513 -63500 -53670 -87972 -66447 -67126 -43985 -48780 -62738
16068 -62738 -109963 -120753 -90395 -60942 -58436 -63077 -72081 -90313 -106350 -84880 -91716 -77838
16056 -77838 -26711 5262 49754 39513 -46721 -27886 388 -3518 -17278 24224 74089 97573
16044 97573 70968 -8944 -37374 -14971 -20333 -43306 -46984 -44684 -24645 -32067 -413 42214
16032 42214 78778 62393 55647 104750 183713 226593 256807 295370 316719 319861 271302 247341
16020B47341J3505o5706r9769J8698k6277q6494j3013O191L7357n3461j7126k909
16008d1663J3389j038P686K3583m270o4174k7566m0223j5693O740K9205J2218
15996a01806m610M0819l5859K297N6089k961k6018K4416J928J2778J595J6472
15984a4860l275R139l6510N433J097K5341P8658R1329O8004N3762L5588L4044
15972C47750Q973l2347j714L3420l0783r7910l6180j5610K5836m3049n2843K3658
15960A29201O0957N2958O7974k4489j03546j02390k6925J5588o8264l256M141
15949A949J3116K3301K3364m7822o8721m2611p960K9821J0208n0873M6504N1347
15937a8377L7127k3577m791r543L7838j6041k0712K9646o085P631m1985N41K6813
$$ plain form
16020 247341 260846 195140 95371 114069 87792 1298 -11715 -5524 31833 -21628 -38754 -41663
16008 -41663 -28274 -29312 -21626 1957 -2313 -66487 -94053 -134276 -149969 -143229 -114024 -101806
15996 -101806 -106416 -65597 -101456 -99159 -43070 -46031 -72049 -47633 -45705 -32927 -31332 -14860
15984 -14860 -18135 -8996 -45506 -40073 -38976 -13635 65023 156352 224356 278118 313706 347750
15972 347750 356723 324376 322662 356082 325299 227389 191209 175599 201435 158386 105543 129201
15960 129201 190158 243116 311090 286601 183055 80665 53740 69328 1064 -2192 1949
15949 1949 15065 38366 61730 13908 -54813 -97424 -105384 -75563 -65355 -116228 -69724 -18377
15937 -18377 18750 -4827 -9618 -19161 18677 2636 -18076 11570 5485 13116 -28869 -28328 -1515
15924a515P2800l6786l9001M560k0913r57k9598m6115K3068M585m7082J7824J6027
15911h3103M8761K8573p4316J158J8420M8381q487j2132k0738j152o314m1338
15899a02287L9240K3451P454m0419n4099k0662L6708M4360N8614n059n9110K7708
15887d4101Q8751o0929p0862n8992M2629P3470K1730n1152k2430K0557J4629N726
15875d0974J5235k1885J1100M1301m5311m6516k3042L7757O3439K3032m9570j4426
15863d9860j5789l7868L237L1114K3524K078l2472K050j8897K8299r160K4719
15851d9025O969M0853l822J85J5375J3908m2227J32k9157m5019k3190j3551m3589
15838a72158r355j4159k1460J8024N9953K5197J1770m303K370P999K588L2564
$$ plain form
15924 -1515 71285 34499 -4502 58 -20855 -21812 -51410 -97525 -74457 -69872 -116954 -99130 -83103
15911 -83103 -34342 -5769 -80085 -78927 -60507 -12126 -20613 -32745 -53483 -54635 -60949 -102287
15899 -102287 -63047 -39596 -32142 -72561 -126660 -147322 -110614 -66254 -7640 -12699 -71809 -44101
15887 -44101 44650 -16279 -87141 -146133 -103504 -30034 -8304 -59456 -81886 -61329 -46700 -40974
15875 -40974 -25739 -47624 -36524 4777 -40534 -87050 -110092 -72335 -8896 14136 -35434 -49860
15863 -49860 -65649 -103517 -100280 -69166 -45642 -43564 -76036 -73986 -92883 -64584 -73744 -49025
15851 -49025 -42056 -1203 -5025 -4840 10535 24443 -17784 -17652 -46809 -91828 -115018 -128569 -172158
15838 -172158 -181513 -195672 -217132 -199108 -139155 -113958 -102188 -106491 -104121 -96122 -93534 -60970
15826f0970P759L121L1436p994O588q545j6174m171l0643N768L8378N4320l6742
15813a7869o6454L8491L2780l849j1014K438L7142R177m7620o3789J4543N579
15801g0445j4058L2057J3532q9581l9949J9701P9851M1132J1472J2282J0439n5241
15789d8808l7468K9046M8852M046k6793J2559j8686K2477n7615l6862M8176J6440
15777d4636n805N2818P722k6179p540n22K256L9025J5048p1414l775J304K8074
15764a3624N2759M4663M966j0097j4324m7518j6175j9906j1846j2970N3436M0791
15752E0155p502l9640K7700q67j9418j7269l8796m1795k301J9232n087n912K2729
15739e8771L9221L49r285k7852l3110k8956K8868J859J9847M9477L4279K3878
$$ plain form
15826 -60970 -53211 -50090 -18654 -26648 -20060 -28605 -44779 -48950 -79593 -73825 -35447 18873 -17869
15813 -17869 -84323 -45832 -13052 -16901 -27915 -25477 11665 20842 -26778 -90567 -76024 -70445
15801 -70445 -84503 -52446 -38914 -128495 -168444 -148743 -68892 -27760 -16288 -4006 6433 -48808
15789 -48808 -86276 -57230 -8378 -4332 -31125 -18566 -37252 -14775 -72390 -109252 -61076 -44636
15777 -44636 -50441 2377 10099 -16080 -23620 -24142 -21886 17139 32187 -39227 -43002 -41698 -13624
15764 -13624 39135 83798 88764 78667 64343 16825 650 -19256 -31102 -44072 9364 50155
15752 50155 42653 3013 30713 29846 10428 -6841 -45637 -87432 -89733 -70501 -75588 -81500 -58771
15739 -58771 -19550 -19201 -28486 -56338 -89448 -118404 -89536 -87677 -67830 -18353 15926 39804
15727C9804m8714k2191p8111o815K697J3426p973K9259O0275K1192j8509J5651
15715iL902J7314l0446k7555r336j2222j715L8136M1169J2761l2089n0671p2646
15702a23407K6775L9670J320K2411l821o107r281l4806Q509M2721L7717k4793
15690b3092k7821j2812K3753O3102j251k9360n5125k6767M0239N3041k791J0322
15678A1438j6790m5563q132m747J8999N2614k4646m2573k0938K0493k5600j2327
15666i7772K9211P351K7629L7648L6907J8516j2437n0151K0229K9493m2716Q343
15654A2251M5336l1331p0544k2069q259M1327J5869k6069q30O8845J5462n3641
15642a3653l985R299j1541J7788l5484J6216L5671j2520K8229k6232m4504m1180
$$ plain form
15727 39804 -8910 -31101 -109212 -116027 -113330 -99904 -107877 -78618 -18343 2849 -15660 -9
15715 -9 3893 21207 -9239 -36794 -46130 -58352 -60067 -21931 19238 31999 -90 -50761 -123407
15702 -123407 -96632 -56962 -55642 -33231 -37052 -43159 -52440 -87246 -78737 -36016 1701 -23092
15690 -23092 -50913 -63725 -39972 23130 21879 -7481 -62606 -89373 -49134 3907 1116 11438
15678 11438 -5352 -50915 -59047 -63794 -44795 7819 -16827 -59400 -80338 -59845 -85445 -97772
15666 -97772 -68561 -61210 -33581 4067 40974 59490 47053 -3098 17131 46624 3908 12251
15654 12251 57587 26256 -44288 -66357 -74616 -33289 -17420 -43489 -44319 24526 39988 -13653
15642 -13653 -17638 -8339 -19880 -2092 -37576 -21360 14311 1791 30020 3788 -40716 -81896
15630h1896p442L8403J6767J1949r846N794k1581K9123m8586O825O3037l5493
15618c2946m4327q7714L3400N8854N7851n3103m3173O2510L6644n4547j0784R898
15606f7437J1716k0807j3547L4388R892j7644k6463j8442K9942K2249n55k1908
15594g8616K3829j696n790M3788N7508n091Q116m4245k6899K908L5979k793m0859
15581c3861J3652l3915m0529j1218L0317L7605l636R380n887K9367M8388l6634
15569C029o6513k9626K7801m2294n9069j0187K0589j449j1285L8114L9080K2179
15557f9631J7459L0866K1442k235j1650J3128J9930o338m2141k9880K1758K1693
15545a5599J7271n3347m5249k7213J4426L39J8499r243L4987K7902l7140l0562
$$ plain form
15630 -81896 -89338 -50935 -34168 -22219 -32065 -26271 -47852 -18729 -67315 -60490 2547 -32946
15618 -32946 -77273 -164987 -131587 -72733 -14882 -67985 -111158 -48648 -12004 -66551 -77335 -67437
15606 -67437 -55721 -76528 -90075 -55687 -45795 -63439 -89902 -108344 -78402 -56153 -56708 -78616
15594 -78616 -54787 -56483 -62273 -18485 39023 33932 42048 -2197 -29096 -26188 9791 6998 -33861
15581 -33861 -20209 -54124 -94653 -105871 -75554 -37949 -41585 -32205 -38092 -8725 39663 3029
15569 3029 -63484 -93110 -65309 -107603 -166672 -176859 -156270 -157719 -169004 -130890 -91810 -69631
15557 -69631 -52172 -21306 136 -2099 -13749 -621 19309 12971 -29170 -59050 -37292 -15599
15545 -15599 1672 -51675 -96924 -124137 -109711 -109372 -90873 -100116 -65129 -37227 -74367 -104929
15533a04929P286M5053L5649j9890J19R302K6208j9461Q454L7496K7555m4305
15521H537n305m1397J0066K7247k9701j306k0222l0055j8396J6802O2435J8136
15509c159N4792J3468J0067K127m4946p2962m7574K5217J550R52m386J3554m300
15496e5600j7662n586J1808K4295L3648k4571K9774K7180K473K944m377k3801
15484E25J5599Q886L3701L0664j0701o7370m0091p117l1357K9941L2368l741P737
15471i56R820m826o3451l2052P2009L1508n1895O94j9731m1616k2069J5729J463
15458a05373Q89N4309k6295m1837O147P0526O416l5751l2664J9726m566p136K0332
15445g5277r017j6755M132M801o746l2648l0079J5954N7339N7947j6809l136K3938
$$ plain form
15533 -104929 -97643 -52590 -16941 -36831 -36712 -27410 -1202 -20663 -12209 25287 52842 8537
15521 8537 3232 -38165 -28099 -852 -30553 -31859 -52081 -82136 -100532 -83730 -21295 -3159
15509 -3159 51633 65101 75168 77295 32349 -40613 -88187 -62970 -61420 -60468 -64854 -51300 -55600
15496 -55600 -73262 -78848 -67040 -42745 -9097 -33668 -3894 23286 25759 28703 24326 525
15484 525 16124 25010 58711 89375 78674 11304 -28787 -35904 -67261 -37320 -4952 -8693 -956
15471 -956 8864 4038 -59413 -91465 -19456 12052 -39843 -39149 -58880 -100496 -122565 -106836 -105373
15458 -105373 -104484 -50175 -76470 -118307 -112160 -41634 -35218 -70969 -103633 -83907 -88473 -95609 -75277
15445 -75277 -84294 -101049 -96917 -92116 -98862 -131510 -161589 -145635 -88296 -30349 -47158 -50294 -26356
15432b6356q010M2745L1256L6284R287J4101P735m1872k6886J203q02m6013L212
15419d116J051K9042q5523k5933O0862J4509m3225P135J4796K9813K1936k6790
15407f443k2629l7433R628j3632L2382M2069r506P061l7963m9801j2952M2928
15395e6291K7393M751k1959K9917K7374M8467l748o2611l0525L7326l32n585j847
15382g670m8080j4861J8821M9200L8467m0460m7629K9803P347l4388j4813J381
15370f2882M0905J6058K9691K675l0750j503M097n2782J741m7071m4965K2058
15358a22728o824K0467J507K7684J5958J3522m8505M159j6546m9446J3466K1776
15346a25510J7734J1422j4313l637N4525J4407L4269L8381K4675j1779l3498l3174
$$ plain form
15432 -26356 -34366 8379 39635 75919 85206 99307 107042 65170 38284 39487 38685 -7328 -4116
15419 -4116 -3065 25977 -59546 -85479 -24617 -10108 -53333 -46198 -31402 -1589 20347 -6443
15407 -6443 -29072 -66505 -56877 -70509 -38127 3942 -5564 1497 -36466 -86267 -99219 -56291
15395 -56291 -28898 -24147 -46106 -16189 11185 59652 55904 -6707 -37232 94 -238 -5823 -7670
15382 -7670 -55750 -70611 -51790 -2590 35877 -4583 -52212 -22409 -15062 -49450 -64263 -62882
15370 -62882 -21977 -5919 23772 26447 -4303 -5806 -1709 -54491 -52750 -99821 -144786 -122728
15358 -122728 -129552 -109085 -107578 -79894 -63936 -50414 -98919 -94760 -111306 -160752 -147286 -125510
15346 -125510 -107776 -96354 -110667 -114304 -59779 -45372 -11103 27278 51953 40174 6676 -26498
15334b6498l3211j8468k145J538N4R399j0739N3624K9088l6035l6380L055L6177
15321c0541k209l4707q130K4350K4995j6065K211L9608J9014j3180l3742n8356
15309h6752j0133M4638j7381L973L6471L3568j6057j93k6234n300l9245k5463
15297a08108M6164O8489l349j9139l3145n8281m1493k2599M8120R1033R4645K4982
15285H7319j4317l2580K874j4755K673O055k9982K121N0875p3380r1460K364P0546
15272c1647O8100K8379n8266j5226m2897k4831l0815O465M2634J805k0640n5977
15260a32916N0386M6784p357K8994L3344J589L2823M6357j6882k2892k8762j8594
15248A2874R046J4954k9900m0983K8033K6824m3298j5284l0428k3k3564l0202
$$ plain form
15334 -26498 -59709 -78177 -80322 -78784 -78730 -69331 -80070 -26446 2642 -33393 -69773 -66718 -30541
15321 -30541 -32750 -67457 -75587 -51237 -26242 -42307 -40096 -488 18526 5346 -28396 -86752
15309 -86752 -96885 -52247 -69628 -65655 -29184 4384 -11673 -11866 -38100 -43400 -82645 -108108
15297 -108108 -61944 6545 3196 -15943 -49088 -107369 -148862 -171461 -123341 -32308 62337 87319
15285 87319 73002 40422 43296 28541 31214 37269 7287 9408 60283 -13097 -104557 -102193 -31647
15272 -31647 36453 64832 6566 -8660 -51557 -76388 -107203 -100738 -58104 -56299 -76939 -132916
15260 -132916 -82530 -35746 -43103 -14109 19235 20824 53647 100004 83122 60230 31468 12874
15248 12874 21920 36874 6974 -34009 -5976 20848 -22450 -37734 -68162 -68185 -91749 -121951
15236a21951J5609L0968J7030K6045J2886l4980K1276O448K8264N3804J3530j5759
15224E3170J988m451k703l4344k2035J6108l467o4149K8466M2180k0937m0796
15212e0970J597K9506k7280l776N2417J1682l039o5436m1008m2509L8398N1045
15200d9373M7544k6280k072l0327k3454M3954O6917L949l0426J121n1277l4432
15188h4156j1275J4694O1334o082k0251k6958L2656j3823O184m017j8165M750
15176f5109J4253L6530M7327M1869N00l2903l6787l4307J5974K3548m8145q90
15164c8140O9574j6973n571Q684j7145j2721M3852M4115p519n254j9717o2354
15152a9169j4197l5912k4873M7389L2715k8894n1791j1856M1415K5595j9897P4
$$ plain form
15236 -121951 -106342 -75374 -58344 -32299 -19413 -54393 -33117 -26669 1595 55399 68929 53170
15224 53170 55158 50707 48004 13660 -8375 7733 4266 -59883 -31417 10763 -10174 -50970
15212 -50970 -49373 -19867 -47147 -50923 1494 13176 10137 -55299 -96307 -138816 -100418 -49373
15200 -49373 -1829 -28109 -30181 -60508 -83962 -40008 26909 30858 432 1553 -49724 -84156
15188 -84156 -95431 -80737 -19403 -25485 -45736 -72694 -40038 -53861 -47677 -51694 -69859 -65109
15176 -65109 -50856 -14326 33001 74870 75370 42467 5680 -28627 -12653 10895 -37250 -38140
15164 -38140 31434 14461 8890 17574 429 -12292 31560 75675 68156 62902 43185 -19169
15152 -19169 -33366 -69278 -94151 -46762 -14047 -42941 -94732 -106588 -65173 -39578 -59475 -59401
15140e9401n4607n766J01493K5700l1211K3464J3662O074L9192M405J3331l2664
15128D3672o5425k7280n464L3499o944K0054J7263j7859q511q681M3525J1459
15116B9308M392j183K5124N783l6191l7982n3640k0772J2670J2265n383K7422
15104c8187L7312k966J9485O2488K0690l8950o2080o2312K0425L256J5125K6657
15092I43n857K2637k2328k4893L125M997l6322k9560n1640M919M5764P3354M3839
15079B8978k0518k2090Q651l3307r1803k0722M3806N6832r887o7252J3976O5255
15067d8081P4426K7099p6119j0273M6483L9778J4322l8246l9757l3046K1637L4823
15055A3046m5941l3198j3779L1659K4350L6431m4752j8848j713M8016l5485n414
$$ plain form
15140 -59401 -114008 -119774 -18281 7419 -23792 -328 13334 19408 58600 63005 76336 43672
15128 43672 -21753 -49033 -54497 -20998 -27942 -7888 9375 -8484 -16995 -25676 17849 29308
15116 29308 33700 32517 57641 63424 27233 -10749 -64389 -85161 -72491 -60226 -65609 -38187
15104 -38187 -875 -3841 15644 78132 98822 59872 -2208 -64520 -44095 -40839 -25714 943
15092 943 -4914 17723 -4605 -29498 -26373 -21376 -57698 -87258 -138898 -133979 -88215 -14861 28978
15079 28978 8460 -13630 -4979 -38286 -130089 -150811 -107005 -50173 -60060 -127312 -113336 -48081
15067 -48081 26345 53444 -22675 -32948 13535 53313 67635 29389 -10368 -43414 -21777 13046
15055 13046 -32895 -66093 -79872 -48213 -23863 12568 -32184 -51032 -52745 -4729 -40214 -45628
15043d5628K9524m290m3886J6375L3812L219p541R700N7885N1437k9332k8337
15031D2938m5459K6929k5810n7222j7862J303K6560Q323k4237O843K1257m4371
15019h0808K5084L8073J5511L838J0152l3315m2061K4304J3875o582J2993k5678
15007d4614J0319P7157M9788l4351n7393n519K539l2974P376l7676n438L7540
14995c3246L9596m0344n918Q3j6003p1557M4332Q7639p673j4175p294j9131J0162
14982c3529k870O4748M6475L301n9952k5772Q879k0961L0912p373L386J0900j9677
14969a533K345Q14N683L7510K0111K9102K3330L7574M691j01550j06119K5124
14957b2918M1397N6201k1193k7795n8983n8474M9163K8077O646K5742L9811j1886
$$ plain form
15043 -45628 -16104 -20394 -64280 -47905 -14093 -10874 -18415 -8715 49170 100607 71275 42938
15031 42938 -2521 24408 -1402 -58624 -76486 -75183 -48623 -40300 -64537 -57694 -36437 -80808
15019 -80808 -55724 -17651 -2140 1698 11850 -21465 -63526 -39222 -25347 -31929 -18936 -44614
15007 -44614 -34295 42862 92650 58299 906 -4613 -2074 -35048 -27672 -65348 -70786 -33246
14995 -33246 6350 -33994 -39912 -39829 -55832 -127389 -83057 4582 -3091 -17266 -24560 -43691 -33529
14982 -33529 -36399 28349 74824 78125 18173 -7599 1280 -19681 11231 3858 7244 18144 -1533
14969 -1533 812 1626 7309 44819 64930 94032 117362 154936 159627 58077 -48042 -22918
14957 -22918 18479 74680 53487 25692 -33291 -91765 -42602 -14525 -7879 17863 57674 45788
14945D5788p1918k8194N2176J8155j1290K5764o2593l5560m7206J4130K3464K3830
14933e3454J4994m0969P782K6043o763m477J7306N6859J5847l5181j3246M16J4847
14920Dm814n9982q958n671L058M929M1821J9149m0627o3905N7120M9655p68o0727
14906f9716l3192K3559M2901J4497L9817J5526m0060l3287j178J1638M3400K053
14894A5958l1689m3147N2551j0119l1270k4512O337J1110J3493r211R958L0790
14882i751M3258L7341n2l5404j6463k5163j1644K0761l4058r979K9871J605P647
14869b031k0033j6866L3023P504K847n800k1968k9332L3118J3703R423K8708K0587
14856E2883o323k0518K7688J947J7392K3134J5349j5085k3591L7816n2073n6707
$$ plain form
14945 45788 -26130 -54324 -2148 16007 4717 30481 -32112 -67672 -114878 -100748 -77284 -53454
14933 -53454 -38460 -79429 -71647 -45604 -52367 -56844 -39538 17321 33168 -2013 -15259 -14843 4
14920 4 -4810 -64792 -73750 -79421 -76363 -71434 -29613 -10464 -51091 -114996 -57876 -8221 -8989 -69716
14906 -69716 -102908 -79349 -36448 -21951 17866 33392 -6668 -39955 -41133 -29495 13905 15958
14894 15958 -15731 -58878 -6327 -16446 -47716 -72228 -65891 -54781 -41288 -50499 -40541 -9751
14882 -9751 33507 70848 70796 35392 18929 -6234 -17878 2883 -31175 -41154 -11283 -9678 -2031
14869 -2031 -22064 -38930 -5907 1597 4444 -1356 -23324 -52656 -19538 -5835 3588 32296 52883
14856 52883 46560 26042 53730 55677 73069 96203 111552 96467 72876 110692 58619 1912
14844A912M5450Q4561P4115O8957M7895K2987J00782J55012J19811J10642K01766
14833A033890J24758L6039p0512n3402r5235j79930j23060j25161j51565q9320
14823C06502o9607m909o776m8401p2232J8410o477k6093j3429k5227k011n802
14811D3948N447J9809J0031j0863m4450q618j0072J7811j9476m415J9096M4134
14799F2382m97L5748k1175m0942O728O45k8884k3373j7688N4519q407j8801r782
14786i527k6732O8859J10k6662J5263J3373k4528J7401J9783J0508M3856l1641
14774G0063k2842P7418m154l2124J228l2177J6544M4877j1050J1942J5089L4249
14762A69063j2951p1601r097N3694K3238n0980n4893L1716L7062L2816P2260O8337
$$ plain form
14844 1912 47362 131923 206038 274995 322890 345877 446659 601671 721482 832124 1033890
14833 1033890 1158648 1194687 1124175 1070773 975538 795608 672548 547387 395822 306502
14823 306502 236895 231986 225210 176809 104577 122987 116510 90417 76988 51761 49750 43948
14811 43948 49395 69204 79235 68372 23922 15304 5232 23043 3567 -848 18248 62382
14799 62382 61885 97633 76458 35516 42244 42889 14005 -9368 -27056 27463 19056 255 -9527
14786 -9527 -36259 32600 32710 6048 21311 34684 10156 27557 47340 57848 101704 70063
14774 70063 47221 124639 120485 88361 89589 57412 73956 118833 107783 119725 134814 169063
14762 169063 156112 84511 75414 129108 152346 101366 46473 78189 115251 148067 220327 288664
14750B88664J862L3964J9347k3192j6435o1045r083n5167o1441o3822m0972L0907
14738D3587J3752k8744K9958M6929o0160o7850k3397Q8665O8303p9920m3341P930
14726d288r865j2915K3439M3787M459L0633j3706o0177N902P524m076K8645j2958
14713B6404n5053n4005O0356R457J8030R960L0127M1003k5172k1736j571M4335
14701H2135l775j2077O349q636k3995J6794l12n644O2212J04143N3676J5093J4686
14688C00649L699K0473J7862J10p549K4909n2860j2838l9159m1521k3341k2450
14676A67984l8064n3217J0402K6217J3714o6608q6592N7829O6851k7285k2595
14665D8636J089j3197j6559l2512l5194Q785L6108O5303Q208k1965O6660J0498
$$ plain form
14750 288664 290526 324490 343837 320645 304210 243165 234082 178915 117474 53652 12680 43587
14738 43587 57339 28595 58553 105482 45322 -22528 -45925 42740 111043 31123 -12218 -4288
14726 -4288 -14153 -27068 -3629 40158 44617 75250 61544 1367 7269 14793 10717 39362 26404
14713 26404 -28649 -82654 -22298 -12841 5189 15149 45276 86279 61107 39371 37800 82135
14701 82135 78360 66283 72632 63996 40001 56795 56483 50839 113051 217194 270870 285963 300649
14688 300649 304348 324821 342683 342793 335244 360153 307293 294455 255296 213775 190434 167984
14676 167984 129920 76703 87105 113322 127036 60428 -26164 31665 98516 71231 48636
14665 48636 49725 36528 19969 -12543 -47737 -38952 -2844 62459 70667 48702 115362 125860
14653A25860l3347p1359j3125J7031j5713L9941K9859J8091j4813K2417J549J2327
14641A18718N4390J29510R1100J3655P5018Q7381O3453K216K3393K6671j07805
14630E77700j22060j15029p7934l8578k7677R297M996P548m75k5579q1921j7209
14618I3079N7678j2414k0862k3358p837k3796J4736j9243p0288r209M5462M4177
14606F8125p1665o0892K0944K6435l961j4731J3249j5934j4033J3289j6884m3205
14594i9263L5928L2090o754k5187q986K2521k3735j3418Q224N4153j817k6198
14582e2442j6780L2698K7117K7436L8313K4050k5444j9567l3940K8595J8964J0095
14570E9095j3738K7291J08710O0201L7297Q570N94L8094M1726p902l8334o0768
$$ plain form
14653 125860 92513 21154 8029 25060 9347 49288 79147 97238 82425 104842 106391 118718
14641 118718 173108 302618 393718 407373 482391 569772 633225 635441 658834 685505 577700
14630 577700 455640 340611 262677 224099 196422 205719 210715 218263 217788 192209 110288 93079
14618 93079 150757 138343 117481 94123 86286 62490 77226 57983 -12305 -21514 23948 68125
14606 68125 -3540 -64432 -43488 -17053 -21014 -35745 -22496 -38430 -52463 -39174 -56058 -99263
14594 -99263 -63335 -31245 -37999 -63186 -72172 -49651 -73386 -86804 -78580 -24427 -26244 -52442
14582 -52442 -69222 -36524 -9407 18029 56342 80392 54948 35381 1441 30036 49000 59095
14570 59095 45357 72648 181358 241559 278856 287426 288020 326114 367840 359938 321604 260836
14558B60836M7284p8602n2515N8367J06116j6582m3026n1543m4072j0459O253
14547A82057j7594l8668k6014M5905p2706p9532j0812M3502J9615l4834j283K7590
14535C7226J071L0575j9863m1794l3237j3864K4126l1616l6567P0150P050l9029
14523d5772K3537L3101J9701k9477r111N6858j6997K4550L8363m2959j02636o8047
14511a18889L6836N3268J4447J7012j2323J3409K5045j0933J7916j388o108j2094
14499A6198l576K3730k0007J5402M4724L0049p770K811l756l2214n11k297m9262
14486A3521P103O6267q95N37L2159J4615j1245k2923j9072L1701M9306j9299j9208
14473A22567N041p3169k3914M2506k1430k7208l4472K9343J8357j1409k5751M520
$$ plain form
14558 260836 308120 229518 177003 235370 341486 324904 281878 230335 186263 175804 182057
14547 182057 164463 125795 99781 145686 72980 -6552 -17364 26138 45753 10919 9636 37226
14535 37226 38297 68872 49009 7215 -26022 -39886 -15760 -47376 -83943 -13793 -6743 -45772
14523 -45772 -22235 10866 30567 1090 -8021 48837 31840 56390 94753 51794 -50842 -118889
14511 -118889 -82053 -28785 -14338 2674 -9649 3760 28805 17872 35788 34400 28292 16198
14499 16198 12622 36352 16345 31747 76471 106520 98750 101561 97805 65591 65080 62783 13521
14486 13521 20624 86891 85996 86533 118692 133307 122062 99139 80067 111768 161074 141775 122567
14473 122567 127608 54439 30525 73031 51601 24393 -10079 19264 37621 26212 461 4981
14461D981L6879J6225L7879j0823l3358j0824K3149n0045m0307M3045J5547l4002
14449a654m9500k2337O40K417L3782K7440J0335M8981k323M429j9793j8590l6768
14436b2941k8545k2811o33M2597k0336N851N933o523L2526L4738k6069J3581K3708
14423C1076Q148j9842K2114j2739L0267J671k0198n7718k2007O3481N8181k8308
14411E4126m6648J9747k2533R776l9262J2415M22k0906J2485N7163L213j3515
14399B6483K5179m5212m0233Q0141J7610l0025l9672n2040J8016K8934n048P60
14387a5107K913J2379J6510J7346O1514K756k6929j7636k081o761j976m6643l7826
14374d1541L8232j3351k671J358O4842p390l2358L9280J0975p3449l1192K9711
$$ plain form
14461 4981 41860 58085 95964 85141 51783 40959 64108 14063 -26244 16801 32348 -1654
14449 -1654 -51154 -73491 -72851 -70434 -36652 -9212 1123 50104 47781 52210 32417 13827 -22941
14436 -22941 -51486 -74297 -74930 -32333 -52669 -46818 -40885 -47408 -14882 19856 -6213 7368 31076
14423 31076 39224 19382 41496 28757 59024 60695 40497 -17221 -39228 24253 82434 54126
14411 54126 7478 27225 4692 14468 -24794 -12379 -11957 -32863 -20378 36785 39998 26483
14399 26483 51662 6450 -33783 46358 63968 33943 -5729 -57769 -39753 -10819 -15867 -15107
14387 -15107 -12194 185 16695 34041 95555 98311 71382 53746 51665 44904 42928 -3715 -41541
14374 -41541 -3309 -16660 -19331 -17973 46869 39479 7121 46401 57376 -16073 -47265 -17554
14362a7554K8076N0952k319m7696k1208J0279l6345j8694l2987K9978N9784P897
14350A0163N450n3741P1291J2685J2857J4284Q604j5561n771n6543l5747J4539
14338a7490Q632L027j1368K6768J887l2493M7471K2714j9251o7440p561j8080
14326f3184O0020N1866j9634m2682j0460j332O016J3771l6886m2538J2228R376
14314f3439l8732j6198K6127O0336K7417J5748K0957j2465J2075K8059M3297R83
14302A04165m6843q5572n772j670j8856J4919k2199L0955P225J0599j872N571
14290i350J4332M4942M671R062N849M580l1495j5325O314l240P6817L9896j2314
14277A34739N148p7967l3618j7262l3072L0284j2802R926N1401l9411p1456K1292
$$ plain form
14362 -17554 10522 61474 59155 11459 -9749 530 -35815 -54509 -87496 -57518 2266 10163
14350 10163 15613 -38128 33163 45848 58705 72989 81593 66032 60261 3718 -32029 -17490
14338 -17490 -8858 -5831 -17199 9569 11456 -21037 26434 49148 29897 -37543 -45104 -63184
14326 -63184 -3164 48702 29068 -13614 -24074 -25406 -19390 -5619 -42505 -85043 -72815 -63439
14314 -63439 -102171 -118369 -92242 -31906 -4489 11259 32216 19751 31826 59885 103182 104165
14302 104165 57322 -28250 -34022 -35692 -54548 -39629 -61828 -30873 -23648 -13049 -14921 -9350
14290 -9350 4982 49924 54595 63657 69506 74086 42591 27266 33580 30340 107157 147053 134739
14277 134739 139887 61920 28302 11040 -22032 8252 -4550 5376 56777 17366 -54090 -32798
14265c2798M2016L2830l9520k4060K2683K046k6608p115j2743M2769j4053J1042
14253c511M6223o28M073k70p1627L0047K5712k3701r895K1707K1077k8152k0694
14240i639J4701K8910K7333o300k3413m7923k2500J3674K6134K6773l7061l0542
14228c9853K5730M8559m004o6439J0980M4140L35M364j9843K5087n196k5639l140
14215d919O1121k329J5641L3552J4589l57l1784j154j6528l0326J6945o1242j9720
14202b6511R23l1688j8273N4655o322m1955P2400O3252l7059m4740l479M4231
14190B5434L3526L554j0476j6030j7846l471N2376J3338J9150J3917R054J7706
14178A40232o1778k6887O1264L5112J5118J328K0058J0577N6184N0326Q1306M4424
$$ plain form
14265 -32798 9218 42048 2528 -21532 1151 3197 -23411 -30526 -43269 -500 -14553 -3511
14253 -3511 42712 42084 46157 45887 -25740 4307 30019 6318 -3577 18130 39207 11055 -9639
14240 -9639 5062 33972 61305 55005 31592 -16331 -38831 -25157 977 27750 -9311 -39853
14228 -39853 -14123 34436 30432 -36007 -25027 19113 19448 23812 3969 29056 23860 -1779 -4919
14215 -4919 56202 53873 69514 103066 117655 117298 85514 84360 67832 37506 54451 -6791 -26511
14202 -26511 -25588 -57276 -75549 -20894 -27216 -69171 3229 66481 29422 -15318 -18797 25434
14190 25434 58960 62514 52038 36008 18162 14691 67067 80405 99555 113472 122526 140232
14178 140232 78454 51567 112831 147943 163061 164389 184447 195024 251208 301534 382840 427264
14166D27264M6896J24815O3157Q4761J03865L5613M2091M0760k411m2441m290
14155I20080m2778j45386j55820j01596l9910q6937n6958n1327p5875k3528j672
14144A38293n9447l6800j845M0382O5654O0808N117k4494n4432n4365J9445k4730
14132G3586l7324L8326O3626J6857M4265m7632R650K3064k1194M610k5236m6969
14120I5629n0891J6178L8214J7170k5689J6582P3099K2855l3423J2114k782j6963
14108A62093r20L0097J406R605k974O535K0890J8724m2674m7243N281N6651J1576
14095B29047n7492K0756m19l7516K9794l053K2602J5695j6255K1421k2088J4462
14083B16954P7422N8707j4518o4978j6495O6007L7547Q1294Q4440O4626J11951
$$ plain form
14166 427264 474160 598975 662132 746893 850758 886371 928462 969222 966811 924370 920080
14155 920080 877302 731916 576096 474500 434590 347653 290695 239368 163493 139965 138293
14144 138293 78846 42046 40201 80583 146237 207045 212162 187668 133236 78871 98316 73586
14132 73586 36262 74588 138214 155071 199336 151704 161354 184418 163224 167834 142598 95629
14120 95629 44738 60916 99130 116300 90611 107193 180292 203147 169724 181838 179056 162093
14108 162093 161173 191270 192676 202281 199307 205842 226732 245456 202782 155539 160820 217471 229047
14095 229047 171555 192311 191892 154376 184170 181117 203719 219414 203159 224580 202492 216954
14083 216954 294376 353083 338565 273587 257092 323099 360646 441940 526380 591006 702957
14072G02957K92598M17286M29635L15764J63939j40170l24633m24563l85158k67632
14062G80023j98557p1803j01699m9333j134m1159l165m0095L185O221j3952m1252
14050B27280j6542K3571j0349Q086m387j1542Q485K9345m0300k9348j4773l3176
14038A36350m0153L2255R225r515n5169k7541M1759k4638O605L9793N2802Q46
14026A62619L0499L4921M468l3433k0897n0249p0437J3658K9356O122K4150J7608
14014A48385J2980l4985R605O765m934l796m9180K9476N166P942J5617L0667K9527
14001B03235J7830Q521k1482n7664k6432L7819L1738l9184k1569L7000L8937l6081
13989A72668m3948n356n9571L4234K8460m430O143R028k8248l3158k6396k3296
$$ plain form
14072 702957 995555 1412841 1842476 2158240 2322179 2182009 1857376 1432813 1047655 780023
14062 780023 581466 509663 407964 358631 357497 316338 313173 273078 276263 282484 268532 227280
14050 227280 210738 234309 223960 232046 227659 216117 224602 253947 213647 184299 169526 136350
14038 136350 96197 128452 137677 128162 72993 45452 87211 62573 69178 108971 161773 162619
14026 162619 193118 228039 232507 199074 178177 127928 57491 71149 100505 106627 130777 148385
14014 148385 161365 126380 135985 142750 137816 134020 84840 114316 119482 127424 143041 173708 203235
14001 203235 221065 229586 208104 150440 124008 161827 193565 154381 132812 169812 208749 172668
13989 172668 128720 123364 63793 98027 126487 122057 128200 137228 108980 75822 49426 26130
13977B6130K9749J9476P2908K7057p834o9010L3K050J1853J783l212J7616n0608
13964G7991n0713L2848j2932j564L7413K417N2725O9241K4977O112M1416j3661
13952B66270M435O076p7824o9585K1652N1422L0962P218n7035J6569O9579J0601
13940B80340m8637K2947j4298n1885L744j1143N7109M0834J4938K8955N0559L2893
13928D06356O9996L7967L3640Q1722N0125L1254M7116M2889N4342J12348J26447
13917A094202O0614J10865J57221J68433K58940K66525L48188M45605M94161M31921
13907C836675M20069L43381K96345K22579J52919P278n3808j79519k80204k88425
13897D477290l47822l80429l48166l44987l31083l75081l53444k81014j71186
$$ plain form
13977 26130 55879 75355 148263 175320 167486 98476 98509 100559 112412 114195 110983 128599 77991
13964 77991 27278 60126 47194 45630 83043 85460 138185 207426 232403 238515 279931 266270
13952 266270 270705 276781 198957 129372 151024 202446 233408 240626 183591 200160 269739 280340
13940 280340 231703 254650 240352 188467 192211 181068 238177 279011 293949 322904 373463 406356
13928 406356 476352 514319 547959 629681 679806 711060 758176 801065 855407 967755 1094202
13917 1094202 1154816 1265681 1422902 1591335 1850275 2116800 2464988 2910593 3404754 3836675
13907 3836675 4256744 4600125 4896470 5119049 5271968 5279246 5225438 5045919 4765715 4477290
13897 4477290 4129468 3749039 3400873 3055886 2724803 2349722 1996278 1715264 1544078
13888A544078j25188j05252j32487r9311k5722r1668j30690j13992m1500k6916
13878F51352n2431n5229K3954R319k3812j0432k8720j5323J3110j8376K4381m9076
13866D68717m5040K8236L5841p1233K36j7879N596J7911j0417N421p083k6167
13854C84139K525l5631k8217j8214l2682o221L1440M5984M9458K3901P4674K9817
13842E20973J8132k930m430k1629n6376o9788J7446l2882l7005k580L6085K2437
13830C87453K5321j3786l6405n7862k1396k8873n0453N6707L5569m5703k6457
13819B24115k0765l3164j8469l0850j5275L712K5120J7766j7318j0210p272J3655
13807A31045K101M7740P044M3421N2444K0112o777p9675o0190J0141J7315q508
$$ plain form
13888 1544078 1418890 1313638 1181151 1081840 1056118 964450 833760 719768 678268 651352
13878 651352 598921 543692 567646 576965 553153 542721 514001 498678 511788 493412 517793 468717
13866 468717 423677 451913 487754 416521 416757 398878 404474 422385 411968 417389 410306 384139
13854 384139 386664 351033 322816 304602 271920 265699 297139 343123 392581 416482 491156 520973
13842 520973 539105 536175 531745 510116 453740 383952 401398 368516 331511 328931 365016 387453
13830 387453 412774 398988 362583 304721 283325 254452 203999 260706 296275 250572 224115
13819 224115 203350 170186 151717 120867 105592 109304 134424 152190 134872 124662 117390 131045
13807 131045 133146 180886 187930 231351 283795 303907 297130 217455 157265 167406 184721 176213
13795A76213M4041K5267J4987J2435m2744k3257n32j5992j1464K8087L4637J0553
13783B52231o3010m5437J8391M4630K6759M8746J8922k0983J6291l902j0377J6665
13771B98926l2695k2106l7437L3501N1728m8864n1543N0123K2403M146O4967P0341
13759D03490J62543J76984K22837J49004m3562q4391q5007j56481j02049j06790
13749E36578j33236n4605j4767m8313j54054r3820m7768L716M1812O1590K9077
13738A26210k4730j9233k4679J4451P3K8159N2581m7282L2835J1920j354J5044
13726A63995J9270J9996J3714L5589l133L5230R7862J05734J17067J02113Q5287
13715G92724O5443M957j58658j25475r3698j04695l9854m1844K7923k0202l255
$$ plain form
13795 176213 220254 245521 260508 272943 230199 206942 206410 190418 178954 207041 241678 252231
13783 252231 189221 143784 162175 206805 233564 282310 301232 280249 296540 292638 282261 298926
13771 298926 266231 244125 206688 240189 291917 243053 191510 241633 264036 268182 333149 403490
13759 403490 566033 743017 965854 1114858 1071296 986905 901898 745417 643368 536578
13749 536578 403342 348737 333970 285657 131603 37783 -9985 -6269 35543 97133 126210
13738 126210 101480 82247 57568 72019 72092 100251 152832 105550 138385 150305 148951 163995
13726 163995 183265 203261 216975 252564 249431 284661 382523 488257 605324 707437 792724
13715 792724 858167 863124 704466 578991 485293 380598 340744 298900 326823 306621 303366
13704C03366k175k3070j726j3454O547L767K3568J2868N1339N2939N5243O4653
13692E33865K9370K8550J6112k9790k6807n2678p5069j5063J9766q2835o4075
13681B81346L9123M6521O0181k6875n57L9789k0159m1210j3974N2971J2574r6657
13669C33073l2739N1961J7434J4878j4697O5692N8058j4293K3601L7749J5160
13658E55877k0958p7083r1368M6150L4424j2449N7324J9749N0695Q214K7956L8153
13646F36684M2015N1044l025k7750k9033L8028N4648J9673J5071N0521R9084R8172
13634A045132J18225O2827J34702R4289L5466j9251L050r88J2719O1485R3280
13623A640936R7441J55368J62105K20337K77563K60870K70349K83984L34579L88797
$$ plain form
13704 303366 301191 278121 276395 262941 269488 273255 296823 309691 361030 413969 469212 533865
13692 533865 563235 591785 607897 578107 551300 498622 423553 408490 428256 345421 281346
13681 281346 320469 366990 427171 400296 399739 439528 419369 378159 364185 417156 429730 333073
13669 333073 300334 352295 369729 384607 369910 435602 493660 479367 502968 540717 555877
13658 555877 534919 457836 366468 412618 447042 434593 491917 511666 562361 570575 598531 636684
13646 636684 678699 729743 726718 698968 669935 707963 762611 782284 797355 847876 946960 1045132
13634 1045132 1163357 1226184 1360886 1455175 1490641 1471390 1474440 1473452 1486171 1547656 1640936
13623 1640936 1738377 1893745 2055850 2276187 2553750 2814620 3084969 3368953 3703532 4092329
13613D092329L50902L69890M48690M45977N99431P83224R83233J262992J566960
13604A0903628J914876K405949K806452L124661L295059L724385M963296P461694
13596D0600000J1921761J9361113L1765655N0904964P3194583Q6642759P5511258
13589C89902093L5220148k0542089o6045502q4241915p6187771n5747648l6051645
13582H6305671k2398554j4185053r261317o307142m622398l879916l523267l270170
13574A8857854k976399k552319k053982j575834j162388r01710p71038o81662
13566F182522o36945n42921m71071l85758k95474j78942j18071j16370j96797
13557C240173j93130j49872j40289j36580j97945j05588j34881j74372j23507
$$ plain form
13613 4092329 4443231 4813121 5261811 5707788 6307219 7090443 8073676 9336668 10903628
13604 10903628 12818504 15224453 18030905 21155566 24450625 28175010 33138306 40600000
13596 40600000 52521761 71882874 103648529 154553493 227748076 314390835 389902093
13589 389902093 425122241 404580152 338534650 254292735 178104964 122357316 86305671
13582 86305671 63907117 49722064 40460747 34153605 29531207 25651291 22128024 18857854
13574 18857854 15881455 13329136 11275154 9699320 8536932 7635222 6864184 6182522
13566 6182522 5545577 5002656 4531585 4145827 3850353 3671411 3553340 3436970 3240173
13557 3240173 3047043 2897171 2756882 2620302 2422357 2316769 2181888 2007516 1884009
13548A884009r0983n2166p8237r6495k0960o230n5216Q556m1069r0817o3843k9915
13536A266634n6883n5310k9897o4634r9024n5927l3621m1786j9869K4069m8545
13525G85207J4537L5694m7108n7295j3277n8366k1838j8273k0968k2785k6450
13514E49078J8195J05365J5137l765L3419l1585r699l4863l8708j1119q0739n7291
13502D53425j4342k6216o369J0592L5812J0879j122m1424k8128j569k5861k2325
13490C43352m3652k7931R224J0458k9111q0922L4941m970k5224M3735K1079n2599
13478A98380J1018L4452L7137M0506j0405k7627j2101r945L0082J1452M765q539
13466B99175P265M612M7117o127L2726m5232o0228k6255O5180M349l7569k4399
$$ plain form
13548 1884009 1793026 1740860 1662623 1566128 1545168 1538938 1483722 1492278 1451209 1360392 1296549 1266634
13536 1266634 1209751 1154441 1124544 1059910 960886 904959 871338 829552 809683 833752 785207
13525 785207 799744 835438 788330 731035 717758 659392 637554 619281 598313 575528 549078
13514 549078 567273 672638 687775 684010 717429 685844 676145 641282 602574 591455 510716 453425
13502 453425 439083 412867 406498 417090 452902 463781 462659 421235 393107 391538 365677 343352
13490 343352 299700 271769 280993 291451 262340 181418 216359 211389 186165 229900 250979 198380
13478 198380 209398 243850 280987 321493 311088 283461 271360 261415 291497 302949 307714 299175
13466 299175 306440 311052 358169 352042 384768 339536 279308 253053 318233 322582 285013 260614
13454B60614R513k461L1264P201L8887J1746k6308o7002r1175k9224O5160O2365
13442B70580j2373K3437q7K8192O758L4678P794O503q103m5484m0466K1576j8337
13429B74668j5896k4049o216m3581l415K3617K7894l9977k0777K4749j5399l562
13417A78056M407m6548k2449l5693j303j14j5122k6091j151K8307K7176j1181
13405G8294L0392n3900l8473K0567j2421k0076L9991k3946M1849N6579l9264j6677
13393F2915k4679N981m3945R37O0890N6557M3892L2657p218p6045k8982M506l1285
13380E6181j7644K4888L6707K9278J5048k5225j0817K5048l8281l9716J0599K5062
13368I1128K3538k5744l2445M1671J9015k8341J6280M2920J0846m0743L3642L257
$$ plain form
13454 260614 270127 267666 298930 306131 345018 356764 330456 263454 172279 143055 208215 270580
13442 270580 258207 281644 281557 309749 316507 351185 358979 365482 357379 311895 271429 293005 274668
13429 274668 258772 234723 228507 184926 181511 205128 233022 193045 172268 197017 181618 178056
13417 178056 182463 135915 113466 77773 76470 76356 61234 35143 33992 62299 89475 78294
13405 78294 108686 54786 16313 36880 24459 4383 44374 20428 62277 118856 79592 62915
13393 62915 38236 44217 272 1209 62099 118656 162548 195205 187987 111942 82960 87466 56181
13380 56181 38537 63425 100132 129410 144458 119233 108416 133464 95183 55467 66066 91128
13368 91128 114666 88922 56477 98148 117163 88822 105102 148022 158868 118125 151767 155024
13356A55024o4945K5527j5385n5244J4955J9708L0995L5967N5875n264o9364k9792
13344I8057k0154M034J8214m680l871l8181J4659J8174K9508m5815j9577M532
13332E4900r909J4956k8528n2770O0611M8475k2966J0085M2009N9760J3421j03936
13320H6108m9857m7209Q216M2159M3592M4100k0214p2008l6374N2515N733o174
13308E0587J1583J8450l6914n9527j1678J1924N5404L0174l7309M806P4900M0331
13296A52731k9931k4925o1574J6595N5414J8815l6027o5171l2672q176n4941j4021
13284h3883k4537k0911j1533N2323L0304k1930J6772J00391M5927r737L796k7726
13272D9256J1181l1804P6874K6980K4343M0385k1802o0244P910j1083m6665j2170
$$ plain form
13356 155024 90079 115606 100221 44977 59932 79640 110635 146602 202477 197213 127849 98057
13344 98057 77903 81937 100151 95471 91600 53419 68078 86252 115760 69945 50368 54900
13332 54900 44991 59947 31419 -21351 39260 87735 64769 74854 116863 176623 190044 86108
13320 86108 36251 -10958 -2742 39417 83009 127109 106895 34887 -1487 51028 56761 50587
13308 50587 62170 80620 43706 -15821 -27499 -15575 39829 70003 32694 37500 112400 152731
13296 152731 122800 97875 36301 52896 108310 127125 91098 25927 -6745 -14921 -69862 -83883
13284 -83883 -108420 -129331 -140864 -88541 -58237 -80167 -63395 36996 82923 73186 76982 49256
13272 49256 60437 28633 105507 132487 156830 197215 175413 115169 123079 111996 65331 53161
13260E3161M6411k1999k7857j3861J3370l704j6330M1907O4894M7930r104n9186
13248A15632n0027M979M6M0733q440j125l2121l3473K4121K9640o4879l2896N0690
13235D2880K4703K914k6108L250K497K1793k748n007n011p616k63k7257r785o730
13221G512L001K1080J6058j2576n1817k4716N538m394j6314l4403M6781N0124
13209E874J6941L7161r710o2803J4095j9839k494J4669K2662J4731n2740o477
13197b7930m5241J0289P128L6380N8790j1396Q340M2254k9793M8178k506o6609
13185B7884l6469K3123Q503l1777l7278J7253k82P377k960J905M4707L287q140
13172A7133m512l3092J4301O6603M7349L1808L510k8224m8514j0334L4836K576
$$ plain form
13260 53161 99572 77573 49716 35855 49225 45521 29191 71098 135992 183922 174818 115632
13248 115632 65605 70584 70630 111363 102923 101798 69677 36204 60325 89965 25086 -7810 42880
13235 42880 67583 70497 44389 47639 50136 71929 69181 64174 59163 51547 51284 24027 14242 7512
13221 7512 10513 31593 47651 35075 -16742 -41458 -35920 -40314 -56628 -91031 -44250 5874
13209 5874 22815 59976 50266 -12537 1558 -18281 -20775 -6106 16556 31287 -21453 -27930
13197 -27930 -73171 -62882 -55754 -19374 39416 28020 36360 78614 48821 96999 94493 27884
13185 27884 -8585 14538 23041 -8736 -46014 -28761 -29043 -21666 -24626 -22721 21986 25273 17133
13172 17133 12621 -20471 -6170 60433 107782 139590 143100 114876 66362 56028 90864 93440
13160I3440k0408q8546k9281M8198K9797J3472l179m1740n215N003O211M7164
13148E4916j8171m0763m868L4731k2158m4323L7887q423J0904l650o056q801L1259
13135A2484n21j1935l6613K0376K061j4531L172L5392J2280J2653k549j9378l1987
13122a9096p201L0346Q6255O1754k3659o2705m1727j4418L1233J08572R3845k4427
13110B18772L6726J19327J87126K13926L14155M26346M07657J76369m8444k65400
13100A786560m20742l89992k70794k16257j44732j14791j2928k6942m118k4388
13090A60876m9473l9942J7183K1010m3349j0759n3053K6502O5346J5055n9815
13079D9581j7451J3515K7077p530O156j2465m5142k0926Q695K699K1638K0160
$$ plain form
13160 93440 73032 -15514 -44795 3403 33200 46672 43493 1753 -3462 1541 7752 54916
13148 54916 36745 -4018 -8886 25845 3687 -40636 -2749 -11172 -268 -3918 -9974 -18775 12484
13135 12484 11963 28 -36585 -16209 -14148 -28679 -25507 9885 22165 34818 32269 12891 -19096
13122 -19096 -26297 4049 90304 152058 128399 65694 23967 9549 40782 149354 243199 218772
13110 218772 255498 374825 561951 775877 1090032 1516378 1924035 2100404 2051960 1786560
13100 1786560 1365818 975826 705032 488775 344043 229252 216324 189382 185264 160876
13090 160876 111403 71461 88644 109654 66305 55546 2493 28995 94341 109396 49581
13079 49581 32130 45645 72722 65192 71348 58883 13741 -7185 1510 4209 25847 46007
13067D6007M332l5920j6388j0333J0335J8975J2377J0810k1469l5459k6544j3547
13055e6824k1402K7501N3062K8378L99n6393q915K8902j5210R124M1262K126l25
13042C1685j2291n4473O156q108L3367L84j3911p19K2241j150L2835L5786n523
13029F6279l5312R745J4391j3690L9654o630n8992n6427n0050j7599L1603K5510
13017e1518K0918N4808l2156o6359K832m616m6K8087K4708K0821j6763k1948n298
13004d6530o65J3656M5494O255K6079R878n0138N182l3550l5987O0867N8942K9900
12991H9383q167j0821l2857n0342R628j0244o2662J3686q832K4788k286J1723
12979c7003n2853m5490K5608N8364L4201j1206m7553p696L1855K7101O973j5553
$$ plain form
13067 46007 50339 14419 -1969 -12302 -1967 17008 29385 40195 18726 -16733 -43277 -56824
13055 -56824 -78226 -50725 2337 30715 31114 -25279 -34194 -5292 -20502 -11378 29884 32010 31685
13042 31685 19394 -35079 -28923 -37031 -3664 -3280 -17191 -17910 4331 3181 36016 71802 66279
13029 66279 30967 40712 55103 41413 81067 74437 15445 -40982 -91032 -108631 -77028 -51518
13017 -51518 -30600 24208 -7948 -74307 -71475 -76091 -76137 -48050 -23342 -2521 -19284 -41232 -46530
13004 -46530 -47195 -33539 11955 18210 44289 54167 4029 9211 -24339 -60326 541 59483 89383
12991 89383 81216 70395 37538 -12804 -3176 -13420 -76082 -62396 -71228 -46440 -48726 -37003
12979 -37003 -89856 -135346 -109738 -51374 -17173 -28379 -75932 -83628 -51773 -24672 -17699 -33252
12967c3252K3303k2172k6453M8937m7715q145j9223k8255K7389J4211j570J6990
12955e5955N7313Q3413j9622n0039k2979n2465k8961J4618L3690M3041l1294L4954
12943E714m519P137P849Q360p6413n2149K8206l848k5416l8954k6408N6699L4502
12930g9240J9916J5342J8785p4779J4902P1641j2186l8531L7565k0973j5175J1562
12918e1171N4209L1700o28j2553j62m6403k7290M4295Q429r997m3608m7520j7293
12905a17992L6845P5085K5254j9661m6199j6338K8279L7654N33L712m1458J641
12893c2645K0680r760R552j8539l0889J3749L347K1650M0993J6890l0792j2922
12881h686k9390j3137L9547K0822k1747N580K048r64k7790m4279k4497J7735O3445
$$ plain form
12967 -33252 -9949 -32121 -58574 -9637 -57352 -65497 -84720 -112975 -85586 -71375 -72945 -55955
12955 -55955 1358 84771 65149 15110 -7869 -60334 -89295 -74677 -40987 2054 -29240 5714
12943 5714 1195 8332 16181 24541 -51872 -104021 -75815 -79663 -105079 -144033 -170441 -113742 -79240
12930 -79240 -59324 -43982 -25197 -99976 -85074 -13433 -25619 -64150 -26585 -47558 -62733 -51171
12918 -51171 3038 34738 34110 21557 21395 -25008 -52298 -8003 426 -9571 -53179 -100699 -117992
12905 -117992 -81147 -6062 19192 -469 -46668 -63006 -34727 2927 3460 7172 -34286 -32645
12893 -32645 -11965 -21725 -12173 -30712 -61601 -47852 -44505 -22855 18138 35028 4236 -8686
12881 -8686 -38076 -51213 -11666 9156 -12591 -7011 -4963 -5927 -33717 -77996 -102493 -84758 -21313
12868b1313m64R17L102j0219J9388J5625l3351j5570P7619M1774l9775r7453k946
12855f2666R316k1132j1388L1359k4542j6304K0637L8677L7874j7923J5097J686
12843F91j3892J3525K0473k4607m8333l0267N2036L7124l6090l2753k4635K2397
12831f4331K5391r611L0231K4270M881j2207K1791L0187M4072J6166j2585p736
12819I0519j6441n0848p2753L977P6289m9452m7399K5824J3381n5534k8126K7954
12807h2609L4493M043J978M5719L6946j830k2826p9604o0246k9436L3102M1416
12795g8854P2562K5535k8918j6274m615J5294K6865L7067p278q664l3868J1138
12783I990j8447j2595L5044r754l8159l1076P601R935m3096M270L4289K8633j1328
$$ plain form
12868 -21313 -21777 -20860 -17758 -27977 -8589 7036 -26315 -41885 35734 77508 37733 -59720 -62666
12855 -62666 -53350 -74482 -85870 -54511 -79053 -95357 -74720 -36043 1831 -16092 -995 691
12843 691 -13201 324 20797 -3810 -52143 -82410 -30374 6750 -29340 -62093 -86728 -64331
12831 -64331 -38940 -48551 -18320 5950 10831 -1376 20415 50602 94674 110840 98255 90519
12819 90519 74078 23230 -49523 -45546 30743 -18709 -66108 -40284 -26903 -82437 -110563 -82609
12807 -82609 -48116 -44073 -42095 3624 40570 38740 15914 -63690 -123936 -153372 -120270 -78854
12795 -78854 -6292 19243 -9675 -25949 -30564 -15270 11595 48662 41384 32720 -1148 9990
12783 9990 -8457 -21052 13992 4238 -33921 -64997 -57396 -47461 -90557 -86287 -51998 -23365 -34693
12770c4693Q883l8541l8298J9507M6417K7124j8281l7489q320l5604j7313M9564
12758g7044J22506n177n0170m1389J0882l4786j534k7475Q193P900K5202K9453
12746c3439K4202j6604l2867k0713l0426L8803N0915J3791j8270Q79k0133k2509
12734f6371M2203K2546l3150P951n813m9714k9863k0073l5889J6119N8629M8089
12722d5336r11k0448K1039J8635m48k4997K7996k7934k5162M6659N6958M012o509
12709B3554l079l420k384L321j8735k458r729k3505j7203K2744K5009N620L807
12696C542l7430O490j105j5175j5813n545k8301l2101l6648L5148M7813K655L8025
12683c8445J61J36J0175j7173j1354l3143K7260K1402L5306j7827n0039J2520
$$ plain form
12770 -34693 -25810 -64351 -102649 -83142 -36725 -9601 -27882 -65371 -73691 -109295 -126608 -77044
12758 -77044 45462 40285 -9885 -51274 -40392 -75178 -76712 -104187 -95994 -88094 -62892 -33439
12746 -33439 -9237 -25841 -58708 -79421 -109847 -71044 -20129 -6338 -24608 -23729 -43862 -66371
12734 -66371 -24168 -1622 -34772 -26821 -32634 -82348 -112211 -132284 -168173 -152054 -93425 -45336
12722 -45336 -46247 -66695 -45656 -27021 -27469 -52466 -24470 -52404 -77566 -30907 26051 30063 23554
12709 23554 20475 17055 14671 17992 -743 -3201 -12930 -36435 -53638 -30894 -5885 -265 3542
12696 3542 -33888 -27398 -28503 -43678 -59491 -65036 -93337 -125438 -162086 -126938 -79125 -76470 -38445
12683 -38445 -38284 -38148 -27973 -45146 -56500 -89643 -62383 -40981 -5675 -23502 -73541 -61021
12671f1021K5316k7577Q575K3410J4698M923j2880j6245r386M811K7619K2643
12659D886o0362j9131J5614j204J6193L0770m496k9996n0475j7739L4695j737
12647h2982j2534J4830j2780L6588l8774O7982L7893m1348l7331j6136M3720L8699
12635b173j803L5907J4123J459O316m8065l5461k4652k7150l1625N191Q8058N5719
12622C5844l5471r346j3943p374K4833J4658J6810L4267K1662P085n091k7562
12610E6372k4086k3099j176J5728J4370N4227K4920r7188n9791J846k571M700
12598c5748O179M5804k113j152J8082j8293n8479j4239L9723M1131K314M3349
12586F6558r877p0758J4089k8847l813l696L0557j3725k3179M9230L6379k1299
$$ plain form
12671 -61021 -35705 -63282 -54707 -31297 -16599 -11676 -24556 -40801 -50187 -45376 -17757 4886
12659 4886 -55476 -74607 -58993 -60197 -44004 -13234 -17730 -47726 -98201 -115940 -81245 -82982
12647 -82982 -95516 -80686 -93466 -56878 -95652 -27670 10223 -31125 -68456 -84592 -40872 -2173
12635 -2173 -3976 31931 46054 47513 53829 5764 -29697 -54349 -81499 -113124 -107933 -19875 35844
12622 35844 373 -8973 -22916 -30290 -5457 9201 26011 60278 81940 89025 83934 56372
12610 56372 32286 9187 8011 23739 38109 92336 117256 20068 -39723 -37877 -40448 -35748
12598 -35748 -29569 16235 14122 12970 31052 12759 -45720 -59959 -20236 20895 23209 66558
12586 66558 56681 -14077 12 -28835 -32648 -36344 -5787 -19512 -42691 6539 42918 21619
12574B1619k034M765K1657M0507J2726M5798M2857K7783P2623O6460Q99L0021
12562C85681J7716n6640P862o989P962k5198l1428m9310n77M9390l0512j2114
12550B55843M428p25j2259l9545K1242K0133j0527N4799J455j7734L5891r423
12538C03578k6999J0617L115J1406o1918n8912n064N4214M3749O4382K0375j497
12526C57046L8525M1821N4002J40798J83258J28947P7742K6042m2007j32956j10805
12515G62413q8224j25710j30611m4001k5665L6577n7774O08M2493N3918o532p184
12503D10308o401M9327m922m3539o3729n6369k9451J5205K744o1003j4300N7515
12491B55385M172J57l099K1992K1699l1415O125j2261o1795Q4227Q3676R5896
$$ plain form
12574 21619 19585 24350 46007 86514 99240 145038 187895 215678 288301 354761 355660 385681
12562 385681 403397 346757 354619 347630 355592 330394 298966 249656 249079 298469 267957 255843
12550 255843 260271 259546 247287 207742 228984 249117 238590 293389 294844 277110 313001 303578
12538 303578 276579 287196 290311 301717 239799 180887 175823 230037 273786 338168 358543 357046
12526 357046 395571 437392 491394 632192 815450 944397 1022139 1048181 1006174 873218 762413
12515 762413 674189 548479 417868 373867 348202 384779 327005 327613 370106 424024 417492 410308
12503 410308 403907 453234 448312 404773 341044 284675 255224 270429 273173 212170 197870 255385
12491 255385 259557 259714 256615 278607 300306 268891 275016 262755 200960 285187 368863 464759
12479D64759K7904k0714R118l4784k2851j7901p9991p5487p9810m2024k889l902
12467A21428k358n979j969j6627Q085J3358j3925m1165n6820o2611K2804J2373
12455b3406J7760K9311L1889J6909J3236k0685m376K6848j8003q749k8037p324
12443B5373j9750k7263l650N0650K6530l1867L472l0556n0950n9438l598L6227
12431h4820O6504L7475K9592J321j6455o016k757L8156r2506p9300L3814M7022
12419b7970N2532j3642l3506j1208n386K7264K8067K0970L8483o76K752J0451
12407H8131K4330L3542j0774n8325k9509o135P33k4988M995N5013K7403J5874
12395A20290O0739j6344n5876o6484o2323m4859M8306K6134J2506J871k010L7834
$$ plain form
12479 464759 492663 471949 481067 446283 423432 405531 325540 250053 170243 128219 125330 121428
12467 121428 119070 113091 111122 94495 102580 115938 102013 60848 4028 -58583 -35779 -23406
12455 -23406 -5646 23665 55554 72463 85699 65014 60638 87486 69483 60734 32697 25373
12443 25373 5623 -21640 -25290 25360 51890 20023 23495 -7061 -58011 -117449 -121047 -84820
12431 -84820 -18316 19159 48751 50072 33617 27601 24844 63000 -29506 -108806 -74992 -27970
12419 -27970 24562 10920 -22586 -33794 -39180 -11916 16151 37121 75604 74928 77680 88131
12407 88131 112461 146003 135229 76904 47395 41260 41993 17005 22000 77013 104416 120290
12395 120290 181029 164685 108809 42325 -19998 -64857 -16551 9583 22089 23960 21950 59784
12383E9784K9908j269l447k6584P019K0839k225N1097m897l393j3976M275o778
12370A10353J3525j7664r248L440k4404n6840k7630M1045M9703K9742K5248O2104
12358A99374K5047j3728L7143n6610p6502j7291K0806J4286L4261K6755k5487
12347A68054j4438l1056J0474O5250N756N619k3512o9717l900M915M8229j6667
12335A49007m3462J7379L3113L1637m1261J4522O1093J3030j3654l1276p7962
12324A12166m3002K7512M6827j2659K869o547j1752K622k6185k9817K1427J1704
12312I5165J1207L7036M219P184K6738k1425q6706k5564Q229Q709K7933M5524
12300A38249n942m269K636K2021J2205m151l4249L5068J1077J9202k4608k1075
$$ plain form
12383 59784 89692 88423 84976 58392 65411 86250 84025 135122 130225 126832 112856 117131 110353
12370 110353 123878 106214 96966 100406 76002 19162 -8468 32577 82280 112022 137270 199374
12358 199374 224421 210693 247836 191226 114724 97433 118239 132525 166786 193541 168054
12347 168054 153616 122560 133034 198284 204040 209659 186147 116430 112530 117445 165674 149007
12335 149007 105545 122924 156037 187674 146413 160935 222028 235058 221404 190128 112166
12324 112166 69164 96676 143503 130844 133713 127166 115414 118036 91851 62034 83461 95165
12312 95165 106372 143408 147627 154811 181549 160124 73418 47854 56083 64792 92725 138249
12300 138249 132307 128038 130674 152695 164900 160749 126500 161568 172645 191847 167239 146164
12288A46164j3393K8070k2622j3929K2237L3249K5449k1769K2002J9332j7080
12277B07710q8276k8998R560J476K237l144K9189M0126K5254k0027l774N517l2253
12264A44597j1832K1049L5574k8274l2480o132M0487L7884j8899n5139L6314O7853
12252B31002o621L6402J3503N307P6719J9386l3902m1563k7009o2328K2535K4037
12240B57468R878l0610k8600P948M9780Q2347M879k2058K3494K9103J9798O301
12228D09728J6397k3864K3456J0148O2742J4723M4562K3080j3223J7189R1739
12217F76677N7106k8462M540P1072K9093N7908K1449r569L3714L6171O3666R5890
12205A109255J7706K4566N9137L1828l9216j010N9044O3634J86956J71482J38978
$$ plain form
12288 146164 132771 160841 138219 124290 146527 179776 205225 183456 205458 224790 207710
12277 207710 119434 90436 99996 101472 103709 100565 129754 169880 195134 175107 171333 176850 144597
12264 144597 132765 153814 189388 161114 128634 122502 162989 200873 181974 126835 163149 231002
12252 231002 224381 260783 274286 279593 356312 375698 341796 300233 273224 210896 233431 257468
12240 257468 267346 236736 208136 216084 265864 348211 353090 331032 354526 383629 403427 409728
12228 409728 426125 402261 425717 435865 498607 513330 557892 580972 567749 584938 676677
12217 676677 733783 705321 709861 780933 810026 867934 889383 879814 913528 949699 1013365 1109255
12205 1109255 1126961 1151527 1210664 1242492 1203276 1202266 1261310 1324944 1511900 1683382 1822360
12194A822360J00576Q4071J25919O5561O2580k4533N116M7512O393r591j5755
12183B270209K0668Q394k251R8472J31789J45562J39472K01285J45992N9747L102
12172C222441K9770Q352m7119q0362o9746P412K7453p635j2863L8426K1989P0639
12160C208757P2068P4409J67580J91323K21579K82945L30788M33352L91264L76300
12150E750365L81179L80865L42181L11663L29951M09938M80999O02190O99504
12141I688835O92131P14208O70182O20772M80001L82470K56912J93131L36814
12132A4035456N42958Q34163J077179J538529K147021L102107M424608O198423
12124C3900444Q358804J0489739J2042582J1770632Q740895K904927l782000q695027
$$ plain form
12194 1822360 1922936 2007007 2132926 2198487 2261067 2236534 2241650 2289162 2295555 2285964 2270209
12183 2270209 2290877 2299271 2297020 2395492 2527281 2672843 2812315 3013600 3159592 3219339 3222441
12172 3222441 3252211 3260563 3213444 3133082 3063336 3070748 3098201 3090566 3077703 3116129 3138118 3208757
12160 3208757 3280825 3355234 3522814 3714137 3935716 4218661 4549449 4982801 5374065 5750365
12150 5750365 6131544 6512409 6854590 7166253 7496204 7906142 8387141 8989331 9688835
12141 9688835 10380966 11095174 11765356 12386128 12866129 13248599 13505511 13698642 14035456
12132 14035456 14578414 15412577 16489756 18028285 20175306 23277413 27702021 33900444
12124 33900444 42259248 52748987 64791569 76562201 85303096 88208023 84426023 75730996
12116G5730996j0379320r278277o764047m200787k237582r26883r697P03302J278093
12107D3915798J944814K479236K580282K014762J068880N8407n98583m71768J73662
12098E3165490J056410K122476L119826L601292L346097K251093O59630p10363
12090F8611951j526593j567117q43091M07057J985775L873555O242376R603075
12082H6786988J4505812K1056127K8040213L2052095K8812187J6217139k178102
12075B25292459j8908031k8197718k9237385k4970434j8981740j3570346r326976
12068H2099829o122058l564791j508218N9280J028138J306936O69595q11218k581746
12059G0575747l801888m103898l572459k559314j379306l80970K85961L23870
$$ plain form
12116 75730996 65351676 56073399 49309352 45108565 42870983 41944100 41934403 42637705 43915798
12107 43915798 45860612 48339848 50920130 52934892 54003772 54062179 53463596 52991828 53165490
12098 53165490 54221900 56344376 59464202 63065494 66411591 68662684 69322314 68611951
12090 68611951 67085358 65518241 64675150 65082207 67067982 70941537 77183913 86786988
12082 86786988 101292800 122348927 150389140 182441235 211253422 227470561 225292459
12075 225292459 206384428 178186710 148949325 123978891 104997151 91426805 82099829
12068 82099829 75977771 72412980 70904762 70964042 71992180 73299116 73968711 73157493 70575747
12059 70575747 66773859 62669961 59097502 56538188 55158882 54777912 55063873 55387743
12051E5387743k45895j239138k170947k527331k216245j630980r48094l43843
12043D4065270K20724Q75053J990050L845440O450693R339361J1174608J0470576
12035H8431775O175287p87946p533151j1711935j2857947j1796412r714286p388510
12027C2816875n409599l838893k682844j912865j346696r06144o20150m30837
12019A5668847l49902l70859m00797n13755n63941p09851q10995p99273p32567
12010A0416907o87754o21042m61985l94377l68717l33542l29883l51440m77795
12001F390372m72192m28582l65569k94790l11811k19022k60702j95771j43878
11992C698055k03846j46491p1873o0988k5307Q381P0897O6040N9740K2479M9673
$$ plain form
12051 55387743 55141848 53902710 51731763 49204432 46988187 45357207 44409113 44065270
12043 44065270 44285994 45161047 47151097 50996537 57447230 66786591 77961199 88431775
12035 88431775 94607062 93819116 86285965 74574030 61716083 49919671 40205385 32816875
12027 32816875 27407276 23568383 20885539 18972674 17625978 16719834 16099684 15668847
12019 15668847 15318945 14948086 14547289 14033534 13469593 12759742 11948747 11149474 10416907
12010 10416907 9729153 9108111 8646126 8251749 7883032 7549490 7219607 6868167 6390372
12001 6390372 5918180 5489598 5124029 4829239 4517428 4298406 4037704 3841933 3698055
11992 3698055 3494209 3347718 3275845 3214857 3189550 3197931 3268828 3334868 3394608 3417087 3466760
11981C466760N3204k4744n1520j19375j27633r5128j81730q0377p4554j6287L0994
11970B779610N8519O696j7136O1044N3436K2217l2857o6161o2051q8950j41406
11959B572961j43617j46642j81894j79803j08370j26251j00983p3920o4024o7164
11949A380293m4271j5888J5763J2160L367k7419j5380L7307k3369q5322l8440
11938A198801m6282n6967r373o1751k1649L566n5491k778L0686p753n0694k2210
11926H98105j9829J907n24K283j913K0285l5733o3028l6209r493n4309j2145n8951
11913F30446m0345l3119R573n470m483l3601n647k9136k5626M0429k2153l9625
11901D41243k8329M548Q0180M0167j8681j7918l5162J2158J3443K6317o470k9305
$$ plain form
11981 3466760 3519964 3495220 3443700 3324325 3196692 3101564 2919834 2839457 2764903 2748616 2779610
11970 2779610 2838129 2844825 2827689 2888733 2942169 2964386 2931529 2865368 2803317 2714367 2572961
11959 2572961 2429344 2282702 2100808 1921005 1812635 1686384 1585401 1511481 1447457 1380293
11949 1380293 1336022 1320134 1335897 1348057 1351424 1324005 1308625 1345932 1322563 1237241 1198801
11938 1198801 1152519 1095552 1086179 1024428 1002779 1006345 950854 948076 978762 971009 920315 898105
11926 898105 878276 880183 879659 881942 880029 900314 864581 801553 765344 755851 701542 689397 630446
11913 630446 590101 556982 566555 561085 556602 523001 517354 488218 462592 503021 480868 441243
11901 441243 412914 417462 497642 537809 519128 501210 466048 478206 491649 517966 511496 482191
11889D82191N4491K1439o0095m2641n268J455k2461p904M6056M6787j7598k5112
11877D71340n6885q5523m4251J0031O0676J8818j5411J8896K044J3271l2846J191
11865C61351k0890J0658k8269m1857J6081Q262J5072l6623K458k2227j3645k5525
11853B24846J972M7033L5924j7021n5286l3081R369P172p630K2126k5941j1370
11841A98113k7028M6411M3551k7206k7206K0043L3008j7604j4851P937J0588M4197
11829B89953k4238J9259N7515Q0981J04278N9500O870L2906K0194k6437p8321
11818E42460l0874K7414m1732n6896J9850j4413k1130r504J2152J498K9031P917
11806D65773j9998K0025J0170j4053K7358p2826l7442P33k5363K9606L1465K5746
$$ plain form
11889 482191 536682 558121 498026 455385 450117 451572 429111 421207 467263 514050 496452 471340
11877 471340 414455 328932 284681 294712 355388 374206 358795 377691 379735 393006 360160 361351
11865 361351 340461 351119 322850 280993 297074 305336 320408 283785 286243 264016 250371 224846
11853 224846 226818 273851 309775 292754 237468 204387 213756 220928 213298 235424 209483 198113
11841 198113 171085 217496 261047 233841 206635 226678 259686 242082 227231 235168 245756 289953
11829 289953 265715 284974 342489 423470 527748 587248 594118 627024 647218 620781 542460
11818 542460 511586 539000 497268 440372 460222 445809 424679 415175 427327 428825 457856 465773
11806 465773 445775 465800 475970 461917 489275 416449 379007 379740 354377 383983 415448 441194
11794D41194l0622J9326l153l0902L7790L7627k5445N2266N0824p341M3359O5469
11782F50392Q1992J34745J25141J6959k8873m8053j36063p0154r8541j09764r0592
11771D27189k1576j1802n758M2110M0270N112k4346j7467J7678M664r457L957
11759D50574L8580l6778p5783m2228j2044L9827M1376k7199k5468J6405L0297
11748C97559K6524j861L3962m6732o2122L4851P1683L5217J8144O207n481K7623
11736E35574j5592o1143o2733M0609q243m0623j8183m955l8742q477m1579m7048
11724B28865m5445l232J6201M5394R9039k9506k9252l9327O361k1000o4572J1082
11712A74608P5321K5742r745l4425K290Q351l522m7044o880K152j7549M6871M6143
$$ plain form
11794 441194 410572 429898 426745 395843 433633 471260 445815 498081 548905 541564 584923 650392
11782 650392 732384 867129 992270 1009229 980356 932303 796240 726086 627545 517781 427189
11771 427189 405613 393811 388053 430163 470433 475545 451199 433732 451410 456074 446617 450574
11759 450574 489154 452376 376593 334365 322321 362148 403524 376325 350857 367262 397559
11748 397559 424083 422222 456184 409452 347330 382181 453864 489081 507225 513432 507951 535574
11736 535574 519982 458839 396106 436715 428472 387849 369666 364711 325969 317492 275913 228865
11724 228865 183420 180188 196389 241783 340822 311316 282064 242737 249098 228098 163526 174608
11712 174608 249929 275671 265926 231501 233791 242142 238620 191576 184696 186848 169299 216170 262313
11699B62313K5209J446l9272q699k5577m0070j8067k9329q481k5994N6987L0552
11687A81018p671L8638K9715j0646k2548r539K405K0691l549l3002L1171N8248
11675B74931o772O7913P1442K6989J0805P4194J3913m1201m2005j7467o000J0232
11663D36974m1050J7344j1946m8996l6797J4477O731l4810J8601M2163K5772j1634
11651C76829L770o2778k6506M7194J8206K7732J0872Q0690M7754Q223m6581l3534
11639D51871m4035J1007k5861m7148P934P9780J10849J56276J04617J47541J44182
11628A097013J16156N2046q817m1998q6384j50699j81883j64238p8019k2031j9360
11617E11786l4950n9736p8709m2530L4447j010k3333J2163j208J1209k654j5094
$$ plain form
11699 262313 287522 288968 249696 240997 215420 175350 157283 127954 119473 93479 150466 181018
11687 181018 173347 211985 241700 231054 208506 198967 201372 222063 218514 185512 216683 274931
11675 274931 268159 336072 407514 434503 445308 519502 533415 492214 450209 432742 426742 436974
11663 436974 395924 413268 401322 352326 315529 330006 336737 301927 320528 362691 388463 376829
11651 376829 380599 317821 291315 338509 356715 384447 395319 476009 523763 531986 485405 451871
11639 451871 407836 418843 392982 345834 353768 433548 544397 700673 805290 952831 1097013
11628 1097013 1213169 1265215 1256398 1214400 1128016 977317 795434 631196 553177 531146 511786
11617 511786 476836 417100 338391 295861 330308 329298 305965 318128 316920 328129 325475 310381
11605C10381K7525L1040j266j2290K311J8600o5059J5028K8700N4668j7461m035
11593C88142K1857O294L1989p8441k0430N3779M3914J1502J2231K3572J0729k1222
11581D83916n0706o2846m892o0148o2281k7554L9231M1095k4931j2561m0429o7103
11569A50791q8720P259J3027J7925L6500L5635J1445n3449k6950J2183l5818N315
11557H5143j3720K1666J7096k3829k344L438k0433l3631K1939M1110k0106K2052
11545I8381K4101m8775k6822o373L1615Q753m648K9707r834J5992j8362L413j1785
11532H5363j4779k3922l3643R298M8270J8418M06p311j5757n3704K8486N615K3320
11519G0060j5563l4598l9093K0621J3655K3042N3954M6414o5087k4417K0301L8040
$$ plain form
11605 310381 337906 368946 367680 355390 357701 376301 311242 326270 354970 409638 392177 388142
11593 388142 409999 416293 448282 369841 349411 403190 447104 458606 470837 494409 505138 483916
11581 483916 433210 370364 365472 305324 243043 215489 254720 295815 270884 258323 217894 150791
11569 150791 62071 69330 82357 100282 136782 172417 183862 130413 103463 115646 79828 85143
11557 85143 71423 93089 110185 86356 84012 87450 67017 33386 55325 96435 76329 98381
11545 98381 122482 73707 46885 40512 72127 80880 76232 105939 96105 112097 93735 97148 85363
11532 85363 70584 46662 13019 22317 70587 89005 89411 82100 66343 12639 41125 46740 70060
11519 70060 54497 19899 -19194 1427 15082 38124 92078 138492 73405 48988 69289 107329
11507A07329j9697j5839M295O133j029J296J4666K6794m020o0825p3799j0831
11495b5527K9662K0141j2466L2811j653j0827m9138j317K1779K4141P0812N9985
11483A58403o1550j4285l0185r072k5547J1799r276k323l9133n6291J3993K5403
11471c8064K3487O8363p736o1855k1743l1151j055K7972K4395q26O4129k3487
11459B2429M043J9510M298M6167l7184l6167L0071K8938j9838l5841J0848n709
11447C1565N178L641p60m3976l7855k1170L7235N3875K9275k3952J1111J6093
11435F0260m798j4629n3092k9651L8503L1193j0631m759J1573K7300P8907L1317
11423A61493j9345l2062j2077p0082k7146M2003n220m3944o3321k783O1058j9538
$$ plain form
11507 107329 87632 71793 76088 82221 81192 82488 97154 123948 119928 59103 -14696 -25527
11495 -25527 4135 24276 11810 44621 42968 32141 -16997 -18314 3465 27606 98418 158403
11483 158403 96853 82568 52383 43311 17764 29563 20287 17964 -21169 -77460 -63467 -38064
11471 -38064 -14577 53786 46050 -15805 -37548 -68699 -69754 -41782 -17387 -18213 45916 22429
11459 22429 26472 45982 50280 96447 59263 23096 53167 82105 62267 26426 37274 31565
11447 31565 36743 40384 39624 -4352 -42207 -63377 -26142 27733 57008 33056 44167 60260
11435 60260 55462 40833 -12259 -41910 -3407 27786 17155 12396 23969 51269 130176 161493
11423 161493 142148 110086 98009 27927 781 42784 37564 -6380 -69701 -72484 -11426 -30964
11411c0964l0608K9381K0334L1752j860J3621P477P778N1289j7785j6311Q84k531
11398F2457k8459l8586N746m8185l3289J6877L7713j0165L8392L3907p359l2210
11386c161o2271j4325M5791K1426j5058P2623j6701j6556j5846k4100j3976n2597
11374i4751M7587L0206M6129N7018K0814l3072l2140m8744j3025O8977K4677l3038
11362D0638l427N200M872K712k5920j5084m0760l6556q46L5422J9299J1955J1941
11349I446L8664p010k1517n3700Q10J3987j4038K33K6283K0832K0077k5686j1279
11336b898k7033l1205J0917J4541l3043k0978N2038Q0228k0470l9397O940j9476
11324b9836L8571N0809L9868l8497l8351r386N1597q989K349m0982K6653L9258
$$ plain form
11411 -30964 -61572 -32191 -11857 19895 18035 31656 39133 46911 98200 80415 64104 64988 62457
11398 62457 33998 -4588 1158 -47027 -80316 -63439 -25726 -35891 2501 36408 29049 -3161
11386 -3161 -65432 -79757 -33966 -12540 -27598 45025 28324 11768 -4078 -28178 -42154 -94751
11374 -94751 -47164 -16958 29171 86189 107003 73931 41791 -6953 -19978 48999 73676 40638
11362 40638 37211 42411 47283 49995 24075 8991 -31769 -68325 -69171 -33749 -14450 -2495 9446
11349 9446 48110 41100 19583 -34117 -33307 -19320 -33358 -33125 -6842 13990 34067 8381 -2898
11336 -2898 -29931 -61136 -50219 -35678 -68721 -89699 -37661 42567 22097 -17300 -10360 -29836
11324 -29836 8735 59544 99412 60915 22564 13178 64775 55786 58135 17153 43806 83064
11312H3064j5867J8746L369q5181m3552M7141k2587k0901k0385M594k5270K6649
11300e0180j6732p381l4700m91Q1142Q0961R33M588R738o453J5706p696q9510
11287b0075l071L9795l1206k1034J832j0186M5068p642l4034o270k428k3173O408
11274f6016J8889O0109P498j9384q982O2546p704o0690j4899L3395K542m5726
11262c8422L2427L7285J9235m4276O1639L4871k5682n0635k0743O0720k7054q068
11250C1297j254l0506n3309M2515K691m777J7673Q099n8748l9625P510m103Q857
11237g3680o2421q162M6656N2501J5775q683M678l5829M3001K6642O949o730l144
11224b447K2456K2551k5597r288j4026n6049J696N0302J5203N436k8219l1931
$$ plain form
11312 83064 67197 85943 89312 4131 -39421 7720 -14867 -35768 -56153 -51559 -76829 -50180
11300 -50180 -66912 -74293 -108993 -109484 -28342 52619 53552 58140 67878 61425 77131 69435 -20075
11287 -20075 -23146 16649 -14557 -35591 -33759 -43945 1123 -6519 -40553 -46823 -49251 -72424 -66016
11274 -66016 -47127 12982 20480 1096 -7886 54660 46956 -13734 -28633 4762 7304 -38422
11262 -38422 -5995 31290 50525 6249 67888 102759 77077 26442 5699 66419 39365 31297
11250 31297 30043 -463 -53772 -11257 -8566 -13343 4330 12429 -46319 -85944 -78434 -82537 -73680
11237 -73680 -136101 -144263 -97607 -45106 -29331 -38014 -33336 -69165 -26164 478 7427 697 -2447
11224 -2447 20009 42560 16963 7675 -6351 -62400 -60704 -10402 4801 10237 -17982 -49913
11212d9913O1660L6717J7488k664n5047k8622l4827p13J2046j3421j0353N1048
11200a6601L1329l070k4794P107L0680l4421k2453L2868J222J0091j7004J0352
11188E306k4543L1214N4089q104n3213j4848j3012j520n257j958l2013j8110K109
11175g9860Q73r001M5789O0550J2474K1532k829l405r844m3131j7382J0728K4269
11162A0763J664o5821Q218j5475P700R184Q1256L7702l3383j3019k6645k4157
11150b2013k3339m793L032K4769o833o2579J7722P3056K5935Q387K1702n7887
11138b841k4361J7210M5740j3455J6225k1443l9485o8054l5335N0721N2834p697
11126b9941l5242O7013N1189l4518k2446k8522o914J5453J6780J7623L423o4267
$$ plain form
11212 -49913 11747 48464 65952 63288 8241 -20381 -55208 -55921 -43875 -57296 -67649 -16601
11200 -16601 14728 11658 -13136 -6029 24651 -9770 -32223 645 1867 11958 -5046 5306
11188 5306 -19237 11977 66066 57962 4749 -10099 -23111 -24631 -29888 -31846 -63859 -81969 -79860
11175 -79860 -78987 -87988 -42199 18351 30825 52357 49528 46123 36279 -6852 -24234 -13506 10763
11162 10763 12427 -53394 -45176 -60651 -52951 -43767 37489 75191 41808 28789 2144 -22013
11150 -22013 -45352 -50145 -47113 -22344 -29177 -91756 -74034 -978 24957 33344 55046 -2841
11138 -2841 -27202 -9992 35748 22293 38518 17075 -22410 -90464 -125799 -75078 -22244 -29941
11126 -29941 -65183 1830 53019 18501 -3945 -32467 -39381 -23928 -7148 10475 13898 -50369
11114e0369m6197j2150R930L4685O2329M4296m5436l6594m63j3291M1981j8752
11102c0031N971K7483k2113p0702j8445J2505L3745N2196K98k5866R215m8901
11090g4645l4806M4069R0970Q107k3861K2010O6337o3418n1679O442k1846K3147
11078i173m036p872j8054J3542N1305O691J8732r815p1491J2570M4154J8474K284
11065D7311K5287q0506j4921k8513j0391L3622o471p796N4127p25k9212k5992
11053d4180J4545L4619n461r289Q163p676J1579j9590j490L21l4709K1403J8055
11040a3710l2367Q304l0089K2545j3406R772K6238J6841o1298l643J8915L1548
11028b0350r025n6967J5515N3728j8015j0006J6853L6929j4395j2535n519j4598
$$ plain form
11114 -50369 -96566 -108716 -98786 -64101 -1772 42524 -2912 -39506 -39969 -53260 -11279 -30031
11102 -30031 -24060 3423 -18690 -89392 -107837 -95332 -61587 -9391 -9093 -34959 -25744 -74645
11090 -74645 -109451 -65382 25588 33695 9834 31844 98181 34763 -16916 -10474 -32320 -9173
11078 -9173 -13209 -21081 -39135 -25593 25712 32403 51135 41320 -30171 -17601 26553 45027 47311
11065 47311 72598 -7908 -22829 -51342 -61733 -28111 -34582 -42378 11749 11024 -18188 -44180
11053 -44180 -29635 4984 -477 -9766 -1603 -9279 2300 -17290 -18780 -18459 -53168 -31765 -13710
11040 -13710 -46077 -37773 -67862 -45317 -58723 -48951 -22713 -5872 -67170 -70813 -51898 -20350
11028 -20350 -29375 -86342 -70827 -17099 -35114 -45120 -28267 8662 -5733 -18268 -23787 -38385
11016c8385L831N270l0765J8792M7864p421p5173R343L7160J2173m4567J9685
11004d2193L2846K9413J2364l0840l045n0310K3546o716k2771L9962R25L4182
10992A7363J7341l5299p032o368l7781J9328m0057j7878k7047n2780Q735J3497
10980a47978N4806J4688L5856p853k0096K0302O005J1248j1117m3851j3216O2087
10968c9119K0771L0694l0410n1313m878L2583q5931q0320K2428M8282K9035K6773
10956h1405K181l937J2146n2211K9640M3031m9291k8979O7754L6653j6369J9873
10944b0914k4773j9707J4358l843J2370M3832l7998n4573j7776P007Q152L2443
10932f1422K3615K0456k1280j2536q0165m367L6668M4578j545Q160K6352K8036
$$ plain form
11016 -38385 -34554 -29284 -60049 -41257 6607 -814 -75987 -66644 -29484 -17311 -61878 -42193
11004 -42193 -9347 20066 32430 1590 -1455 -51765 -28219 -34935 -57706 -17744 -16819 17363
10992 17363 34704 -595 -7627 -13995 -51776 -32448 -72505 -90383 -117430 -170210 -161475 -147978
10980 -147978 -93172 -78484 -42628 -50481 -70577 -50275 -44270 -33022 -44139 -87990 -101206 -39119
10968 -39119 -18348 12346 -18064 -69377 -74255 -41672 -127603 -207923 -185495 -137213 -108178 -81405
10956 -81405 -79224 -83161 -71015 -123226 -93586 -50555 -99846 -128825 -61071 -24418 -40787 -20914
10944 -20914 -45687 -65394 -51036 -54879 -42509 1323 -36675 -91248 -109024 -102017 -93865 -61422
10932 -61422 -37807 -17351 -38631 -51167 -131332 -135699 -99031 -54453 -55998 -47838 -21486 6550
10920F550J5796j05140m3974L6348J15597K4597K3049J03186K8106J07651J84185
10909D95951K34131M04300M30995L64797K07152o3673l35162m81633m61740k73513
10899E21605k14353j04830l6937m107n6686o7631k8192K1277L4277J5246K0391
10888A00060j3796m5823k1191m599l676J39k0917m7544j3003k3089j8191O3600
10876d8030K5019k6281K2780P5276k6942l2267l749M0263l8513j6153j4166L1080
10864a1683l514q026K9139L0974m6895j8580j595J3056m060K9842j1460m2523
10852d5325p0128K8477M7367r339j1568J4783K4640k8688m3621M841J967l6973
10840a23567m0444L9311J1202P7612O8260J4535r191K5141j4243j4639k8329k5089
$$ plain form
10920 6550 22346 -82794 -126768 -90420 25177 49774 72823 176009 204115 311766 495951
10909 495951 730082 1134382 1565377 1930174 2137326 2073653 1738491 1256858 795118 521605
10899 521605 307252 202422 165485 161378 104692 37061 8869 30146 64423 79669 100060
10888 100060 86264 40441 19250 14651 10975 11114 -9803 -57347 -70350 -93439 -111630 -48030
10876 -48030 -23011 -49292 -26512 48764 21822 -10445 -14194 26069 -12444 -28597 -42763 -11683
10864 -11683 -15197 -23223 5916 36890 -10005 -28585 -30180 -17124 -21184 8658 -2802 -45325
10852 -45325 -115453 -86976 -39609 -48948 -60516 -45733 -21093 -49781 -93402 -88561 -86594 -123567
10840 -123567 -164011 -124700 -113498 -35886 32374 46909 37718 62859 48616 33977 5648 -19441
10828a9441M949j1815l857j9571n7449L2182K8155J405j9371L1464J1446j077
10816b2980j936l5729k4828K3695N6149L6026k5262m18l3128j9085k6460J5278
10804e8678L239n3588J4998J3118l027J0721k3642k036K6485L6263J9350p636
10792b4433l6185n59O1926M0169l86m2211k6405N144k658K7170M6111K8821K916
10779G9420L0819J7164l7059m7697J084L687J0121j6729m809L230j6143o08m2441
10766a9961j1745K8261l39N705K1778k6521p634M0834M8160m2619o2265j9773
10754d6119N2579L4887P3725L7213j593n2392q8023K6729k3596l7741m1340L1161
10742c4510J4394l3666j434N056m8295Q733o318P663J4537J3003k6794o1966M8407
$$ plain form
10828 -19441 -14492 -26307 -30164 -49735 -107184 -75002 -46847 -45442 -64813 -33349 -21903 -22980
10816 -22980 -24916 -60645 -85473 -61778 -5629 30397 5135 4717 -28411 -47496 -73956 -58678
10804 -58678 -55439 -109027 -94029 -80911 -83938 -73217 -96859 -98895 -72410 -36147 -16797 -24433
10792 -24433 -60618 -61177 749 40918 40532 -1679 -28084 -22940 -25598 1572 47683 76504 79420
10779 79420 110239 127403 90344 42647 43731 47418 57539 40810 36001 39231 23088 22480 -19961
10766 -19961 -31706 -3445 -3784 1921 23699 -2822 -10456 30378 78538 35919 -26346 -46119
10754 -46119 6460 41347 115072 152285 150692 98300 10277 37006 13410 -24331 -65671 -34510
10742 -34510 -20116 -53782 -55216 -50160 -98455 -89722 -96040 -88377 -73840 -60837 -87631 -149597 -101190
10729a01190L7901L5656l927o632j6677K8301L947k2985N2422N7883q5279k5298
10717d5878q591l3076Q75J8525J989j281k7765L737n6072L081N0898O890J0334
10704g6334J4215k8732K7220L4991J6353j2462k9644j5007K805N5936M3350K2808
10692E5499l5006p2259o1943M5132m2105k5182K1376M1497K9115j7706K5848K6976
10680h758j8039L4071J7654r18l8421p927m0418m8272l5878l130K7332K7047K4615
10667g1042K4102J7152L5240M78n7292o6818J0438K5697L7704L761K1987R2657
10655G4064N8904M1624o0764j07483k8906j2972J0216j384l4956M508k0609m242
10643h2000k0770o496M3839O3611M1044j2258n5085j0521P7246J9908o4828m8741
$$ plain form
10729 -101190 -63289 -27633 -31560 -38192 -54869 -26568 -22621 -45606 6816 64699 -20580 -45878
10717 -45878 -54469 -87545 -86670 -68145 -66156 -67437 -95202 -91465 -147537 -144456 -93558 -86668 -76334
10704 -76334 -62119 -90851 -63631 -28640 -12287 -24749 -54393 -69400 -66595 -10659 32691 55499
10692 55499 20493 -51766 -113709 -68577 -110682 -135864 -114488 -72991 -43876 -61582 -35734 -8758
10680 -8758 -26797 7274 24928 24010 -14411 -22338 -62756 -111028 -146906 -150036 -122704 -95657 -71042
10667 -71042 -46940 -29788 5452 5930 -51362 -118180 -107742 -82045 -44341 -40580 -18593 74064
10655 74064 132968 174592 113828 6345 -22561 -35533 -25317 -26701 -61657 -57149 -77758 -82000
10643 -82000 -102770 -109266 -65427 -1816 39228 26970 -28115 -38636 38610 58518 -6310 -55051
10631e5051Q191R793r742m9489K7334P1574l0967j6253J3412Q230m7353L436L2447
10618c4438k8446p7990o9606n198O5680J3275P685N6928K4826O927n744m3148
10606h9249k9232J6465K4600P8191N1614p1851m6818N75O5538O8899J650l1128
10594C9254l2309j7895k5696n1187q196O9998N1343l0306j6122r413j6037l5823
10582h2389k1847J9796J5765P1608L2097K2777k2693o4551m267N480n2270j9034
10570i9528J5113L4900J3412l4915N0104P7644l6643r847J2677k8833R335Q4267
10558H7686o045l8718n2508K2378R844m4297J4830j2257j1943k2216o282K9674
10546b9854o0460k2253m816L1690K5176l1504P882j646R883M2999j0152m7063
$$ plain form
10631 -55051 -46860 -37067 -46809 -96298 -68964 2610 -28357 -44610 -31198 -22968 -70321 -66885 -34438
10618 -34438 -62884 -140874 -210480 -215678 -149998 -136723 -129038 -72110 -47284 -40357 -46101 -89249
10606 -89249 -118481 -102016 -77416 775 52389 -19462 -66280 -65705 -167 68732 70382 39254
10594 39254 6945 -10950 -36646 -87833 -96029 -26031 25312 -4994 -21116 -30529 -46566 -82389
10582 -82389 -104236 -84440 -68675 2933 35030 57807 35114 -29437 -33704 -28224 -80494 -99528
10570 -99528 -84415 -49515 -36103 -71018 -20914 56730 20087 10240 22917 -5916 3419 87686
10558 87686 81641 42923 -9585 12793 22637 -21660 -6830 -19087 -31030 -53246 -59528 -29854
10546 -29854 -90314 -112567 -117383 -85693 -60517 -92021 -84139 -85785 -75902 -32903 -43055 -90118
10534i0118Q533L0380J2235J6888l6673k2066K2887J9013K6806K0221J0615k8634
10522i913q507J8025J1022o148r571q135k2778j1495k4030J7553N9315O326J1258
10509B2922j9975j238N2284j410n7945L3519P880K7472l91o2625k1336M6519L7393
10496F3069K1491o257k3384j152j2016o8482k2522N1223L6956K6619N305K1526
10484I2376J1255j1292J8232j493J691l4443n603J3509k5447J4658J3505k1573
10472F5375M854O657J9108k8143l9432M248M4874m4325k5803N499L7841M9871
10460A00624N5273M249m7596J6884J7562j2331l7390m084l0071m1836M1219J5167
10448G7670K0879j8612n1860l0921J7767M0251k01K2646M7109N9314j6525q0851
$$ plain form
10534 -90118 -81585 -51205 -38970 -22082 -58755 -80821 -57934 -38921 -12115 8106 18721 -9913
10522 -9913 -18420 -395 10627 4479 -5092 -13227 -36005 -47500 -71530 -53977 5338 11664 22922
10509 22922 2947 1709 53993 52583 -5362 28157 36037 63509 63118 493 -20843 25676 63069
10496 63069 84560 78303 54919 53767 41751 -26731 -49253 1970 38926 65545 70850 92376
10484 92376 103631 92339 110571 109078 110769 76326 70723 84232 58785 73443 86948 65375
10472 65375 70229 76886 95994 67851 28419 32667 77541 33216 7413 12912 50753 100624
10460 100624 155897 160146 112550 129434 146996 134665 97275 93191 63120 21284 62503 77670
10448 77670 98549 79937 28077 -2844 14923 55174 54973 77619 124728 184042 167517 86666
10436H6666n4019l5874q936M0965N4345j9496j0028q825m5441K1343R303K5959
10424E5962O0184j7647j1798k81k8563J0239o9558l4249K2947j0323P3180N1869
10412A01962j2530K2005l6925m365L1356M415l2335m5924m7460Q173j5739O3830
10400C6463M5808O788n968p33k5413k3812n3480k2784k4325M0524P4259J364j3275
10387C5416o9181m715L9323K1253O448r815o002j8117j3561m8165K76O9993J2
10374C165j1330J1824R022l3630Q958L935J1275P223K0796N4633o487J1781m7302
10361D3863l2531l1174N557j6304m634o239O949j1613r353N1596O2443m6191p3662
10348f1293J531Q2269J6496J3112k8965N837j1920k0919Q8709J7462n0957j6556
$$ plain form
10436 86666 32647 -3227 -12163 28802 83147 63651 53623 44798 -643 20700 30003 55962
10424 55962 116146 98499 86701 86420 57857 68096 -1462 -35711 -12764 -23087 50093 101962
10412 101962 89432 111437 74512 70147 101503 105918 73583 27659 -19801 -11628 -27367 36463
10400 36463 82271 89059 83091 82358 56945 33133 -20347 -43131 -67456 -26932 47327 48691 35416
10387 35416 -33765 -38480 843 22096 28544 18729 12727 -5390 -18951 -67116 -66840 3153 3165
10374 3165 -8165 3659 12681 -20949 -11991 -8056 3219 10442 31238 85871 79384 91165 43863
10361 43863 11332 -19842 -14285 -30589 -35223 -41462 -34513 -46126 -55479 -3883 58560 12369 -61293
10348 -61293 -59762 22507 39003 52115 23150 28987 17067 -3852 84857 102319 51362 34806
10336C4806J2635j289n9258l7819L3808L4353n1788n9192K5437N774j0834L5640
10324c7727L6584J95o6180j1568K7124L67k5709m5238J468L7760J8503L9183m5876
10311g1114J8080l1302k4486J2187Q046K0878K5521N6644m359j0457L236J2813
10299A5687J5859l0103J0129k911j6330m1041j2424k729n3625j3147q67K1783
10287a09719K9568M5768O0062Q800j8965m6942l4756L1350J8664j5952k293L9710
10275E295m3204m7036k0452k2586J5796L7134Q132M4182k600m633o401K1645M9698
10262C4970O0105L8936K9605n2845k5420L8207l9693j01539o31J9745k35P556
10250H761p5209l4086J9596O417l8975l3129K9607M0659J7105j2553k6433j8875
$$ plain form
10336 34806 47441 46152 -13106 -50925 -17117 17236 -34552 -93744 -68307 -62533 -73367 -37727
10324 -37727 -1143 -948 -67128 -78696 -51572 -51205 -76914 -122152 -120684 -82924 -64421 -25238 -71114
10311 -71114 -53034 -84336 -108822 -96635 -88589 -67711 -42190 14454 10095 -362 2874 15687
10299 15687 31546 1443 11572 8661 -7669 -48710 -61134 -63863 -117488 -130635 -131502 -109719
10287 -109719 -80151 -34383 25679 34479 15514 -31428 -66184 -34834 -16170 -32122 -34415 5295
10275 5295 -37909 -84945 -105397 -127983 -112187 -75053 -66921 -22739 -25339 -29972 -36373 -14728 34970
10262 34970 95075 134011 163616 110771 85351 123558 83865 -17674 -18305 1440 1205 8761
10250 8761 -66448 -100534 -80938 -74521 -113496 -146625 -117018 -76359 -59254 -71807 -98240 -117115
10238a17115k1540P430M4488N8355L9337P320j9341J8985J5120q102J3770j0033
10226B8674L926J36256J18653N4687J0089O6308P6881N5206N7799j104M545j688
10214F10232m7366j37315p2327p6652j08466n0876K2147L616n6344k9746k9442
10203B7461M8842L6062j0602n9927j2583R862o0270l5240L9753K8805l3274l2403
10191e3514Q862K3458J2572l6738L7175M1739K1173J2751N7931L9961L1752N0646
10179B47768P1459J56368J67601J00292P3716M5277L4643M7758m0257j33615j68518
10168F02492j72157r2792n2688j03154p2479j6369j8776R675P899k5779o332O213
10156F5753N145J4784k5930n2130o068j745n0713l2013J5964R5534K3780k423
$$ plain form
10238 -117115 -138655 -131225 -86737 -28382 10955 18275 -1066 17919 33039 24937 38707 28674
10226 28674 32600 168856 287509 342196 352285 418593 495474 550680 608479 607375 611920 610232
10214 610232 562866 425551 353224 276572 168106 117230 139377 142993 86649 56903 27461
10203 27461 76303 112365 101763 41836 29253 39115 -21155 -56395 -16642 12163 -21111 -53514
10191 -53514 -44652 -21194 -8622 -45360 -8185 33554 54727 67478 125409 165370 197122 247768
10179 247768 319227 475595 643196 743488 817204 862481 897124 944882 904625 771010 602492
10168 602492 430335 337543 284855 181701 109222 92853 74077 83752 91651 65872 59540 65753
10156 65753 70898 85682 59752 7622 1554 -191 -50904 -82917 -66953 28581 52361 49938
10144D9938l1579n2575N6813J6653J6316K3106O82N8214Q3780J36719P3959R7589
10132E29615J56995R2169L6534m1689q6387r5655q1922j63128j37725j02111r2834
10121A3862k9494O848k3982K9261J3414q994j5620m3430k9043O4334J8932l3457
10109c7369k6511p2115l554P2399L6796l6801J461m7855L4855L8535K6340J5814
10097A995l8124r9968j920J1609N3492K8950M6008N6913J00314K9949j8602n1961
10085A18655K4222k8440o6058o7298k2410k5553j6479k1749l3702J6887M0656
10074h1269L1904l284j2760M3429R014k4792K173J1855L7257j083k7320n086M581
10061a5381j377K0366N3596N524J4325J7745O9273K3143J1605K4188n54k4193
$$ plain form
10144 49938 18359 -34216 22597 39250 55566 78672 79354 137568 221348 358067 432026 529615
10132 529615 686610 778779 815313 773624 687237 591582 509660 346532 208807 106696 13862
10121 13862 -15632 -8784 -32766 -3505 9909 915 -14705 -58135 -87178 -22844 -3912 -37369
10109 -37369 -63880 -135995 -139549 -67150 -30354 -67155 -65694 -113549 -78694 -40159 -13819 1995
10097 1995 -36129 -136097 -138017 -126408 -72916 -43966 2042 58955 159269 189218 170616 118655
10085 118655 142877 114437 48379 -18919 -41329 -66882 -83361 -105110 -138812 -121925 -81269
10074 -81269 -49365 -52649 -65409 -21980 -12966 -37758 -35585 -23730 13527 12444 -14876 -19962 -15381
10061 -15381 -16758 3608 57204 62728 77053 94798 164071 187214 198819 223007 222453 198260
10049A98260m8202p1243j7486L896j0735J6647j3634n1995J6818Q037J5616P8158
10037A24137k6772k4908J5438K2814l075o8814l0131L4575J2231K8986L6009M8184
10025A68674J625J7223L1080J0362J39260K08654K16814J03926p5803k35073j92223
10014C94519p3242m8357J5979k0932m8709J3093l9315n3379k3544Q159p10K4066
10002A47628j079l2367J235M7698M60j2862M465p385n1846K9333N3494J8392J203
9989A98369m0674n8758m6892J8853L8523m3554n7131J1775j083l3600K4018O0449
9977G0295J9462j7371N107k0412M159N082m37M2580j3913n0017N4241J7083l8843
9964G7016k4498M786J1759J7041n2238k5734n8546n1687L8848K3052J9919J8740
$$ plain form
10049 198260 150058 78815 61329 65225 54490 71137 57503 5508 22326 30363 45979 124137
10037 124137 97365 72457 87895 110709 107634 38820 8689 43264 55495 84481 120490 168674
10025 168674 170299 187522 218602 228964 368224 576878 793692 897618 821815 586742 394519
10014 394519 321277 272920 288899 267967 219258 232351 193036 139657 116113 124272 123562 147628
10002 147628 146549 114182 115417 163115 163575 150713 155178 147793 95947 125280 178774 197166 198369
9989 198369 157695 98937 52045 70898 109421 65867 8736 20511 19428 -14172 9846 70295
9977 70295 89757 72386 77493 57081 61240 66322 65885 108465 94552 44535 98776 115859 77016
9964 77016 52518 57304 69063 86104 33866 8132 -50414 -102101 -63253 -40201 -20282 -1542
9952a542M2826k2573L71L9192K1658J842m3130j6367J5562n2901m5698k2463P545
9939g5678Q820j062L3147m584k9469n798N8387J6970O6364P5483M2796j5285p0959
9926I9132k3220K1795m2717o4486o383J076L3035J3857m1215n7114m243J7391
9914e3092L805K7842k2081N188K4440K5978L0899L6932J598L1766K8333L2938
9902A74546K4217P990k2340j9475M199O948m358m0112j376O274l9282k6562M8188
9889A18857P7391J06103R1260J30558J27530L0816J5189k254L1088L0274Q0321
9878H37133R4474J24715Q9109P4655Q8195J24042P2287P9062Q6641J52394J69581
9867A992288J82447K68282J49186N7103q9737q7636k8616k0418j12764p9672j09751
$$ plain form
9952 -1542 41284 18711 19082 58274 79932 81774 38644 22277 37839 -15062 -60760 -83223 -75678
9939 -75678 -66858 -67920 -34773 -39357 -68826 -74624 -16237 733 67097 142580 185376 170091 99132
9926 99132 75912 97707 54990 -9496 -15879 -14803 18232 32089 -9126 -66240 -70483 -53092
9914 -53092 -49287 -21445 -43526 -38338 -13898 12080 42979 79911 81509 113275 141608 174546
9902 174546 198763 206753 184413 164938 169137 176085 171727 131615 130239 136513 97231 70669 118857
9889 118857 196248 302351 393611 524169 651699 682515 697704 695450 726538 756812 837133
9878 837133 931607 1056322 1145431 1220086 1308281 1432323 1504610 1583672 1670313 1822707 1992288
9867 1992288 2174735 2443017 2592203 2649306 2559569 2471933 2443317 2422899 2310135 2230463 2120712
9856B120712j66537j22576m8563k5036M3886R8993J88728L15132M45706O40126
9846C490571R09115J148375J345065J265419Q22976K86220j79075m74037n27046
9837H087583n31579n46526n90733n85443m65955l56724k18119j25763n6574N2046
9827D662213J19084M9492Q1198J35028J59812K30318L80440M49241M80464M85911
9817G233201M93418M62145L78482N12710P05440R42484J292210J913225K785842
9808A6719157M111270N888849Q248843J1220791J4777059J8171854J8215212J0926421
9800A08279456j825407j2501109j6538762j5328803j2109099q792690o001982
9793C5181604l776584j885787m11432J109133K733318M532721O487246P938200
$$ plain form
9856 2120712 1954175 1831599 1783036 1758000 1801886 1900879 2089607 2404739 2850445 3490571
9846 3490571 4399686 5548061 6893126 8158545 8981521 9267741 9088666 8614629 8087583
9837 8087583 7556004 7009478 6418745 5833302 5367347 5010623 4792504 4666741 4610167 4662213
9827 4662213 4781297 4830789 4911987 5047015 5206827 5437145 5817585 6266826 6747290 7233201
9817 7233201 7726619 8188764 8567246 9079956 9785396 10727880 12020090 13933315 16719157
9808 16719157 20830427 26719276 34968119 46188910 60965969 79137823 97353035 108279456
9800 108279456 106454049 93952940 77414178 62085375 49976276 41183586 35181604
9793 35181604 31405020 29519233 29107801 30216934 32950252 37482973 43970219 51908419
9785E1908419Q138685P374968O257929M628965K739295J617859J481800J135698
9777H5283618P9291j259913k498374m061871n468256n778029m913946l707544
9769E7674976k696951j469610O21887L889533Q487093J4753489K2815031L2453505
9761A36528953M2667755M7749727L5356058L994091k7560243m2738049m1864784
9754A54133508l4082977k5305722j7404469j1163246o480971k837557j3764J885527
9746E8730329L125739L946600M315896M359147M031257L637345K924774J323220
9738H6394307m15134j000376p22256j249701l218522n969320q475759r553378
9730E5789861q857713o911548m790662l214903j932129o95256O79888K235560
$$ plain form
9785 51908419 60047104 67422072 73680001 78308966 81048261 82666120 84147920 85283618
9777 85283618 85362909 84102996 81604622 77542751 72074495 66296466 61382520 57674976
9769 57674976 54978025 53508415 54130302 58019835 66506928 81260417 104075448 136528953
9761 136528953 179196708 226946435 262302493 266296584 238736341 195998292 154133508
9754 154133508 120050531 94744809 77340340 66177094 59696123 56858566 56844802 58730329
9746 58730329 61856068 65802668 70118564 74477711 78508968 82146313 85071087 86394307
9738 86394307 85979173 84978797 84256541 83006840 79788318 73818998 65343239 55789861
9730 55789861 46932148 40020600 35229938 32015035 30082906 29387650 30067538 32303098
9722C2303098M115271O423014R341410J2674413J5116134J3900422O316796m945528
9714I5245030j3464817j5912454j4185327j1251663q446010o120022m438743l236864
9706A8189130k336473j661465j274591j061559r13948p46019n92355m97100m52710
9697H652910m21433m37531l99214l95524l50805k74189k03491q4823l5391j631
9687F048878K5005K5417J17846K72448L74770M49695M81987M79097K98356J54334
9677H727833k0648k47119n50796q13415r40717q05473o53802n46392l70128k78133
9667C501210j72315j38336j27067m9906l3715P2157J03169O9491N1638Q6256O0537
9656C423119L4802N2743J3730K2051q6155p1913r0243j18186r9182j34619r5248
$$ plain form
9722 32303098 36418369 42841383 52182793 64857206 79973340 93873762 100190558 95245030
9714 95245030 81780213 65867759 51682432 40430769 31984759 25864737 21425994 18189130
9706 18189130 15852657 14191192 12916601 11855042 10941094 10195075 9602720 9105620 8652910
9697 8652910 8231477 7793946 7394732 6999208 6648403 6374214 6170723 6085900 6050509 6048878
9687 6048878 6073883 6099300 6217146 6489594 6864364 7314059 7796046 8275143 8573499 8727833
9677 8727833 8707185 8460066 7909270 7095855 6155138 5349665 4695863 4149471 3779343 3501210
9667 3501210 3328895 3190559 3063492 3013586 2979871 3052028 3155197 3224688 3276326 3362582 3423119
9656 3423119 3457921 3510664 3524394 3546445 3460290 3388377 3298134 3179948 3080766 2946147 2850899
9645B850899K908p3336j75043j75184j94223r7526r6889j19785j16238q8482r4080
9634A623021o7948m9072j8979j9590p6015n9652k50l1383n553l7819m1556J7829
9622A233033l989l5764q2274j16693N0862Q7242L280o6152m1286k3462R390j987
9610A012200m4909j2685L627O86L7511k9626p2290l5005j3014k3497K9521K3552
9598H76071L9165q2745m7537K9182m8330l4369o975K8460o2626J125M4171J8266
9586G53858K6522k1807m4981O3087K6844n6275l9033j0406L1390J9336p782q666
9574G32087L6614J9883k2373l2478j3438k2504K7442N656n723j2540J569j2556
9562G01639j999o273r959l7304l0172r039m2285L3027P9378l1958o474r104k1440
$$ plain form
9645 2850899 2853807 2780471 2605428 2430244 2236021 2138495 2041606 1921821 1805583 1717101 1623021
9634 1623021 1555073 1506001 1487022 1467432 1391417 1331765 1331515 1300132 1294579 1256760 1215204 1233033
9622 1233033 1229044 1193280 1111006 994313 1045175 1132417 1135697 1069545 1028259 1004797 1014187 1012200
9610 1012200 967291 954606 958233 958919 996430 966804 894514 859509 846495 822998 852519 876071
9598 876071 915236 832491 784954 814136 765806 731437 724462 752922 690296 691421 735592 753858
9586 753858 780380 758573 713592 776679 803523 747248 708215 697809 729199 748535 740753 732087
9574 732087 768701 788584 766211 733733 720295 697791 725233 730889 725166 712626 714195 701639
9562 701639 699640 693367 683408 646104 615932 606893 564608 597635 677013 645055 638581 629477 608037
9549F08037J8379j1256n4290o318L0381m3632p1654J9909L9933m0379j5J5009
9537E04104M516r945k8378j2663n034l7481N4970L9183j7846J4481m0049n960
9525D59898J0029L5800J7989N1l5169k2628j4152P5357k0660K3738P381L9642
9513E77276L4937Q757m3705q655k8900n6843j4080l42j3858j0482p716L6463L5341
9500E08193j9431n646N1355k2367o9917M6768K8463k75k0775K1974K1151K2776
9488E62269k4595p2423N672J8394j5712J4329j6209J0430k4334n9479j6408R287
9476C91221j1514Q8654R735n9036J703n216K5189o43k3470J0776j024J8394Q730
9463D53499n1894o2821L140K8650P328l4216l2307k0738m3310o924R871J9563
$$ plain form
9549 608037 626416 615160 560870 554552 584933 541301 469647 489556 529489 489110 489095 504104
9537 504104 508620 498675 470297 457634 452600 415119 470089 509272 491426 505907 465858 459898
9525 459898 469927 505727 523716 523767 488598 465970 451818 527175 506515 530253 537634 577276
9513 577276 612213 620970 577265 568610 539710 482867 468787 468445 454587 444105 436389 472852 508193
9500 508193 488762 483116 534471 512104 442187 488955 517418 517143 496368 518342 539493 562269
9488 562269 537674 465251 470923 489317 473605 487934 471725 482155 457821 398342 381934 391221
9476 391221 379707 468361 478096 419060 420763 415547 440736 440093 416623 427399 426375 444769 453499
9463 453499 401605 338784 341924 370574 377902 343686 311379 290641 247331 240407 250278 269841
9451B69841L9559N5638K3285N226n041J1696j8832k2785K3809M4235k04j4528
9439D11899j0663L7480L4074M1003J1167k6719n580K1087M8504P6149j6874l5472
9427E86055r229R4685P2096K3422q883O527K7891n8606n6349Q052l7495l5175
9415F12991N6787k6740o2493o7495m5922k3187n43N7738L3759j1203K536o154
9403E20074l6228L0618J8338q271L4898P0244n049l251N1521k496q512K6954K2117
9390G10957l8441K0488L9842P2670L5390P6308J40176J51585J18071O1841j0024
9379A378863m5609p3477r3319j39573j12791l1403j9524j6469n290j1849J481
9368H31040m9086j5030k1910L5787k0381k3424l4626p959M0090J4852j3608k5836
$$ plain form
9451 269841 309400 365038 388323 393549 388508 400204 381372 358587 382396 426631 426427 411899
9439 411899 401236 438716 472790 513793 524960 498241 492661 513748 562252 638401 621527 586055
9427 586055 576826 671511 743607 767029 758146 764673 792564 733958 677609 685661 648166 612991
9415 612991 669778 643038 580545 513050 467128 443941 443398 501136 534895 523692 526228 520074
9403 520074 483846 514464 532802 524531 559429 629673 624624 621373 672894 670398 661886 688840 710957
9390 710957 672516 693004 732846 805516 840906 917214 1057390 1208975 1327046 1388887 1378863
9379 1378863 1333254 1259777 1166458 1026885 914094 882691 863167 846698 841408 829559 831040
9368 831040 781954 766924 745014 780801 760420 736996 702370 694411 734501 749353 735745 709909
9356G09909K620j3215j4633L166O956L3534M4482O7736J8341o750o736J32722
9344I78132J03050Q4396P9490J29933J46741K01852J12749L1398m958m2588p1838
9333A748357r6595j30160j88968j67567p2586j1798k4248L0215o6312p199j0953
9322A002186J8192k7529o19j0070J6795Q537n0097l3737N4127J2638M330J9105
9310A013858L9444L500j5943K8747K1171l752l6005P3529P2407J4522R0630J09753
9298A411861J19335J44589O0692J5996l1306m632j7339M7471J6361l0682r3357
9287A638989r6836q9034n6711j6323L7235M6526L2481n660m1326N8353J2686j5970
9275A504410J8269L1318J6749J4797k2980J0243J6784k4235M6805M9193o83l524
$$ plain form
9356 709909 712529 699314 684681 687847 694803 728337 772819 840555 858896 852146 845410 978132
9344 978132 1081182 1165578 1245068 1375001 1521742 1723594 1836343 1867741 1862783 1820195 1748357
9333 1748357 1651762 1521602 1332634 1165067 1092481 1080683 1056435 1086650 1020338 1013139 1002186
9322 1002186 1020378 992849 992230 982160 998955 1007492 957395 923658 977785 990423 994753 1013858
9310 1013858 1053302 1056802 1040859 1069606 1090777 1087025 1051020 1124549 1196956 1211478 1302108 1411861
9298 1411861 1531196 1675785 1736477 1752473 1721167 1716535 1699196 1746667 1763028 1732346 1638989
9287 1638989 1542153 1453119 1396408 1380085 1417320 1463846 1496327 1490667 1449341 1507694 1520380 1504410
9275 1504410 1522679 1553997 1570746 1585543 1562563 1572806 1589590 1565355 1612160 1661353 1660670 1657146
9263A657146l9259J6471J6288j5647J5047L5884N3233Q0392K64l0273K3723J7652
9251A830921J5826L5576N6169P9225K4333p9946n2098J8925l9149j17795o0350
9240A711637K8167J6797k3845J2389N5978j3017j1720K4966R878j6967n6767n530
9228A731966l1397n0454k8395M6120O2535R669j8794q06J1423J461n6977p495
9216A668856k0851l9174k9447m4123k9963J7524Q892n0446O644o073o0008k844
9204A418987k6925j6896M32l074J9600J0177l7953m6395l8889K0306J3790M470
9192A317630J8935m4888n2308N4930j3644n8578m297O944k5260j0419n0740m1106
9180A097199o2540m6191l987M063L0496m188l324k3184k5975k8140L0986R0675
$$ plain form
9263 1657146 1617887 1634358 1650646 1634999 1650046 1685930 1739163 1819555 1819819 1789546 1813269 1830921
9251 1830921 1846747 1882323 1938492 2017717 2042050 1962104 1910006 1928931 1889782 1771987 1711637
9240 1711637 1739804 1756601 1732756 1745145 1801123 1788106 1776386 1801352 1811230 1794263 1737496 1731966
9228 1731966 1700569 1650115 1621720 1667840 1730375 1740044 1721250 1720444 1731867 1733328 1676351 1668856
9216 1668856 1648005 1608831 1579384 1535261 1505298 1522822 1531714 1481268 1487912 1481839 1421831 1418987
9204 1418987 1392062 1375166 1375598 1372524 1392124 1402301 1364348 1317953 1279064 1299370 1313160 1317630
9192 1317630 1336565 1291677 1239369 1294299 1280655 1222077 1217780 1224724 1199464 1189045 1138305 1097199
9180 1097199 1034659 988468 984481 988544 1019040 1014852 1011528 988344 962369 934229 965215 1055890
9168A055890M8992j532n0927o0592l8888l3337n3714q2042m5234J2642J2123N38
9156G63919j1183r401J916m3308J780j9076K7960N3923k1568l366j2975j8901
9144G09720j8800j2465j4366j05515m2056O9261J0541k1320J751N2188q728j5497
9132F04714K97r862j5936N9388K8829n0152N61K867j7176l6123L9734j4003l2934
9119E60204l5329m2094M825L1358J6099J4811p898j4965J1960J2119j8273j8723
9107E14094Q229k0006L6130o293n6634K0900r288M8144j0179m2822m2176L43k240
9094D38202o419l1546o260k6049M5588J525m6216n8511k5978P521O4570K2905
9082C79332k1879K1473O559k5870m8488K312K5984m0381m3673N8601L2022O0330
$$ plain form
9168 1055890 1104882 1103350 1052423 991831 952943 919606 865892 783850 738616 751258 763381 763919
9156 763919 752736 743335 745251 701943 703723 684647 712607 766530 744962 741596 728621 709720
9144 709720 690920 678455 664089 558574 516518 585779 596320 575000 576751 628939 620211 604714
9132 604714 605011 595149 579213 638601 667430 617278 617839 620706 603530 567407 607141 593138 560204
9119 560204 524875 482781 487606 518964 535063 549874 541976 527011 538971 551090 532817 514094
9107 514094 522323 502317 538447 532154 475520 496420 487132 535276 525097 482275 440099 440442 438202
9094 438202 431783 400237 393977 367928 413516 415041 368825 310314 284336 291857 356427 379332
9082 379332 357453 378926 385485 359615 311127 313439 339423 299042 255369 313970 345992 406322
9070D06322q087m2587J4597o812r5170n2876J9811M5216K2363l400j099R873j4252
9057B93899k7579L3799p627O668k1210n841j084j0644M4954L2259m2003j5422
9045B80169K8579J1850L3982J2147n8072n2791M737j6390k4960J6414L9422l5161
9033B39926l935J3644M7785J0154m7744j2051J4768k1551J3144j487M7907L4795
9021C35355J737o1811m7018k6554J5066K0100J1810L6801J9371n7611p3289l8950
9009A35007n369Q2095O4447l1604m5221K6890k3222j1849J5447L0462q570k3352
8997B05161K6302L6775l5447m2165M1858J8595Q142k6373k2198J4017k7454j0280
8985A86933N8716L9929M9095k1699L1324K7465m5833M954k7486L6270J26n4723
$$ plain form
9070 406322 398235 355648 370245 363433 268263 215387 235198 280414 302777 299377 298278 308151 293899
9057 293899 266320 300119 292492 299160 277950 272109 271025 260381 305335 337594 295591 280169
9045 280169 308748 320598 354580 366727 308655 255864 260601 244211 219251 235665 275087 239926
9033 239926 235991 249635 297420 307574 259830 247779 262547 240996 254140 252653 300560 335355
9021 335355 337092 275281 228263 201709 216775 236875 248685 285486 304857 247246 173957 135007
9009 135007 129638 211733 276180 244576 199355 226245 203023 191174 206621 237083 228513 205161
8997 205161 231463 268238 232791 190626 232484 251079 259221 232848 210650 224667 197213 186933
8985 186933 245649 285578 334673 312974 344298 371763 325930 330884 303398 339668 339794 285071
8973B85071l2754m8772l3608J3089J0246j0829N2836J4125j0138n1730J3843K9480
8961B30859o0392j6141Q3593j8735j2008J1416k3359o18m3442J0113L483m7760
8949A17009p798M3235Q4424N708l0978n6382j2089K2738n464k0216K9950k1364
8937A48773k8958J6923K5276l3033K647K3388n441N0343J8699k0006l6560n4466
8925A07585M5137K6347j0964k6130K6237K6468M335o3933m0972L3041J188k3527
8913A04812K7777P928L129j2659J2840N2615k1487l7567K603K1048N4289K9752
8901B45080j6549j6953K0760n1365k5048L9618O9047P258m7960k0391L5926j4050
8889B25373m3166L8058N06l0062J0616J1085J6151j0309l9255K1723K1587l4703
$$ plain form
8973 285071 252317 203545 169937 183026 193272 182443 235279 249404 239266 187536 201379 230859
8961 230859 170467 154326 237919 219184 207176 218592 195233 194615 151173 161286 164769 117009
8949 117009 109211 152446 236870 242578 211600 155218 143129 165867 160403 140187 170137 148773
8937 148773 119815 136738 162014 128981 131628 155016 149575 199918 218617 198611 162051 107585
8925 107585 152722 179069 168105 141975 168212 194680 199015 135082 94110 127151 128339 104812
8913 104812 132589 140517 143646 130987 143827 196442 174955 137388 139991 161039 215328 245080
8901 245080 228531 211578 232338 180973 155925 195543 264590 271848 223888 203497 239423 225373
8889 225373 182207 220265 220771 190709 201325 212410 228561 218252 178997 200720 222307 187604
8877A87604l6860J2518J9224L4356M2431O6547Q8560j3725o3582k3897j2786k9895
8865B70495l9999o3548k9344J4613r186N0095K0423l9546o5091O610K6643m9035
8853I3130l2487L0208P1933K6741m7206j2905M6081l9645k7539q5576k6015J7018
8841A3738N2376R610k6039k6408M7625M9693j5584k2417R07j7394J126L5894N5221
8828A58348M106k3050n9379j2048K6341J0278J8999L383j5914l0958N095N8896
8816A44097L7312l6590k9557L216J5827J0179k2960n2890r390J1485M5973P0212
8804A86914K9646m7669l8918K9381J1481n1065j0085L9722k74m3161J3601q289
8792A11284J2107j0492K4060R834K7477k1617m3474j6603J13884L7843o5896K2501
$$ plain form
8877 187604 150744 163262 182486 216842 259273 325820 414380 400655 337073 313176 300390 270495
8865 270495 230496 166948 137604 152217 143031 193126 213549 174003 108912 115522 142165 93130
8853 93130 60643 90851 162784 189525 142319 129414 175495 135850 108311 22735 -3280 13738
8841 13738 66114 75724 49685 23277 70902 120595 105011 82594 83501 66107 67233 103127 158348
8828 158348 162454 139404 80025 67977 94318 104596 123595 126978 111064 80106 85201 144097
8816 144097 181409 144819 115262 118478 134305 144484 121524 68634 59244 70729 116702 186914
8804 186914 216560 168891 129973 159354 170835 119770 109685 149407 149133 105972 119573 111284
8792 111284 123391 112899 136959 146793 174270 152653 109179 92576 206460 244303 178407 200908
8780B00908k8874p6646o0031M879Q0419j9079l6079o451L8017n072K5251m9789
8768F7453l0419M7653l0579n8094K9239M707K0167K7735L8369O122J9259k5211
8756A16401j0024N2812o144p3941p2837j1872N2641N4076K6672m554p7347j4057
8744C1826L6593j6592M7788L5218j6162L230M622j1794k091k8841o8600Q133L6699
8731F0029m141J3379L8179L928k501l7811j236N2809J6994k2941L767O3645k7731
8718A56369k269J0446m7505k5542K3732j7975l9522L7971M6145r514J094M9017
8706A82447Q4594N9897m8843m7963p6254l6938L143L266L9714K1661n4113L0852
8694A61463P1516P972j0343l2803l9813k4300k3861J6660m0159l2142K5999L4932
$$ plain form
8780 200908 172034 95388 35357 40236 120655 101576 65497 59046 97063 91991 117242 67453
8768 67453 37034 84687 54108 -3986 25253 29960 50127 77862 116231 122353 141612 116401
8756 116401 106377 159189 153045 79104 6267 -5605 47036 101112 127784 123230 45883 31826
8744 31826 68419 51827 99615 134833 118671 121901 126523 114729 112638 83797 15197 23330 60029
8731 60029 55888 69267 107446 111374 108873 71062 69826 122635 139629 116688 120455 184100 156369
8718 156369 154100 164546 117041 91499 115231 97256 57734 95705 141850 132336 133430 182447
8706 182447 267041 326938 278095 230132 153878 116940 120083 123349 163063 184724 130611 161463
8694 161463 232979 240951 230608 197805 157992 133692 109831 126491 86332 54190 80189 115121
8682A15121K8980n7011l9131K2959O7927O9810K2674n4102r4171M0870K0686j4909
8670A29703N4635m6963o4862P930M287P928J6119O8046j8915m5683K2489M7833
8658A82547k2314L5414N4527K0310n209N2041Q036L3323J8334l4226K7366p098
8646C63051m7903q5536J9137J817k9913k7473l529M259J0550O3444K550j0532
8634B59922P1668O2876j4294n254m6834q5112k2022P5661N6003O2640P4716L32
8622D90302N77l096J1389M1946k2835k0453j5575j1208j9465k290K292L2059L76
8609D84019j7754P2068R206n9219j9385o185o3416p119N0801R202n9510j9968
8597C72740J1153n1957l6554o2311m6492j305q2142r121K6839L3193L6010J9324
$$ plain form
8682 115121 144101 87090 47959 70918 138845 208655 231329 177227 83056 123926 144612 129703
8670 129703 184338 137375 72513 80443 84730 92658 108777 176823 157908 112225 134714 182547
8658 182547 160233 195647 250174 270484 265275 317316 325352 358675 377009 342783 370149 363051
8646 363051 315148 229612 248749 250566 220653 193180 189651 193910 204460 267904 270454 259922
8634 259922 331590 394466 380172 374918 328084 242972 220950 296611 352614 415254 489970 490302
8622 490302 490879 487783 499172 541118 518283 497830 482255 471047 451582 449292 451584 483643 484019
8609 484019 466265 538333 547539 488320 468935 462750 399334 392215 443016 452218 392708 372740
8597 372740 383893 331936 295382 233071 186579 185274 103132 94011 120850 154043 190053 209377
8585B09377L5219M351L7335j2580n3619p4292j0707L4062K4023P177q427j0695
8573A81224O7L404p361p241k3312o780L7522p154k9913j2351M0543l4588n040
8560A29020L7039K9502k543J4051m4398m6063J8103n2637K4303p2082P560N639
8548D7494M8067j4170Q657l9322p6333M1412M4722j3167L1819M8098l3482K0260
8536A14055j7696N543o823k857j7279M6217L1337k4790o7126k5152o1299k1229
8524d7099m669N6012M8405j9449j0692k0409l0824M3042J3706L9313k8124j5580
8512B3632L656j4208M958L661K7852J8336J094M2842k9097M8963N3049j5092l9279
8499A30367j7807j631K4540K912j8298n775K4003o613j7301N917l1658l7796J6573
$$ plain form
8585 209377 244596 248947 286282 273702 220083 145791 135084 169146 193169 200346 191919 181224
8573 181224 181291 184695 177334 170093 146781 140001 177523 170369 140456 128105 168648 134060 129020
8560 129020 166059 195561 193018 207069 162671 116608 134711 82074 106377 34295 41855 47494
8548 47494 95561 81391 90048 50726 -25607 15805 60527 47360 79179 127277 93795 114055
8536 114055 96359 101902 95079 92222 74943 121160 152497 127707 60581 35429 -25870 -47099
8524 -47099 -51768 4244 52649 33200 22508 2099 -28725 14317 28023 67336 39212 23632
8512 23632 27288 13080 18038 21699 49551 67887 68981 111823 82726 131689 184738 169646 130367
8499 130367 112560 110929 135469 138381 120083 114308 138311 131698 114397 120314 88656 50860 67433
8486F7433J5587M3038Q646L8112j1275J4524l0015j7538K106J2561j5084n775
8474A22320P373n1979o1291J0900M0726L0304J9675J4225j4527k883K4300m4614
8462I4529L0658M8445Q845l2330m6428l6050k7871k4325J9848J7558m6342M0202
8450D6739M950j6212m910j0900K8966K0068k9251J2912J9383l184k8476J2299
8438E2384M2094K3855n81l1150j5094j1370K6062L5263M1769k9478J8700n1986
8426A00468O635K3108l8164m4268M5485J8723k0420k2197L596K3174k0462J3989
8414H9667M0680j7694o4296M3318L2923m0698n0504l4134K7407M1714J4248q1519
8402A112Q550K6761P970j3985K4248L0951K9297K383J814J7209k4350l0467n1
$$ plain form
8486 67433 83020 126058 134704 172816 161541 176065 146050 128512 130618 143179 128095 122320
8474 122320 129693 77714 16423 27323 68049 98353 118028 132253 117726 114843 139143 94529
8462 94529 125187 173632 182477 150147 103719 67669 39798 15473 35321 52879 6537 46739
8450 46739 51689 35477 30567 19667 48633 68701 39450 52362 71745 68561 40085 52384
8438 52384 94478 118333 117752 86602 71508 60138 86200 121463 163232 133754 152454 100468
8426 100468 107103 130211 92047 47779 93264 111987 91567 69370 72966 96140 75678 89667
8414 89667 130347 112653 48357 91675 124598 83900 33396 -738 26669 68383 82631 1112
8402 1112 9662 36423 44393 30408 54656 85607 114904 117287 119101 136310 111960 81493 81442
8389H1442O5670o887o7897j8721J4760o7051j5713K2221J9179M3861J3990K639
8377H7493l9771L3873L9531k4772j9553O5123l107m1622j4919L6466o390R70J2711
8364A26033j5489k8805l1396l1067M607K202N3209j4981k7619j0982O8541m470
8352H9783l363K0836m7697K276J8426p713k0237J7037N2888K5421k1779q086l1425
8339H6367N1414q729m7515j7725n713o118J884m5966k1606K6921M7169O2901j8805
8326A04479m4476k1295M4652m49l901l0680k9533J9808J2609L3562r849k2510
8314E2417J281P085J7209L9496K8275J3961j3294K285k3460j6530J259n2507m0226
8301A7251j408K4434o479K8026m570P334n429j8945l1241K4931L4581L8370M5875
$$ plain form
8389 81442 147112 140225 72328 53607 68367 1316 -14397 7824 27003 70864 84854 87493
8377 87493 47722 81595 121126 96354 76801 141924 138817 97195 82276 118742 112352 113322 126033
8364 126033 110544 81739 50343 19276 23883 26085 79294 64313 36694 25712 94253 89783
8352 89783 86420 107256 59559 61835 80261 72548 52311 69348 122236 147657 125878 117792 86367
8339 86367 137781 129052 81537 63812 58099 51981 53865 7899 -13707 13214 60383 123284 104479
8326 104479 60003 38708 83360 82911 79010 48330 18797 38605 51214 84776 74927 52417
8314 52417 53698 60783 77992 117488 145763 159724 146430 148715 125255 108725 109984 57477 17251
8301 17251 15843 40277 33798 61824 57254 64588 59159 40214 8973 33904 68485 106855 152730
8288A52730K5430l0990O98p139k0451n2078n2880l540L1529N9586L8519n2472
8276H8942m8908L7087l8870M3011M5161K4354m9847p2031K8716j4071k5415n07
8264A7622Q2642K0290j4377J3839p0512o2274O244R4694Q0619l0741n4899l8726
8252D4421j7419M9835O1876M4932L5244P593q2795m9474J1108m4041m8116j8149
8240d985J8925p275q277o207J8581k1590K0818N767l8494l3410r456O7581P5190
8227G7168K0749p5223k9512l2807L96L3157J7695K8363N427m5242O773N0503L3960
8214I1407r3588o4122L7621K5041l955k5595L9463J2991n107M6409M3042K9615
8202A33222p268j005j0585p5476k5623J109M1760p0773j3349O7054J8523K9458
$$ plain form
8288 152730 178160 147170 147868 140729 120278 68200 15320 11780 43309 102895 141414 88942
8276 88942 40034 77121 38251 81262 126423 150777 100930 28899 57615 43544 18129 17622
8264 17622 100264 120554 106177 120016 49504 -12770 -6526 88168 168787 138046 83147 44421
8252 44421 27002 76837 138713 183645 218889 226482 143687 94213 105321 61280 13164 -4985
8240 -4985 13940 6665 -1612 -7819 10762 -10828 9990 15757 -22737 -56147 -65603 1978 77168
8227 77168 97917 22694 -6818 -39625 -39229 -6072 11623 39986 45413 171 6944 57447 91407
8214 91407 -2181 -66303 -28682 -3641 -7596 -33191 6272 19263 14156 60565 103607 133222
8202 133222 125954 124949 114364 38888 13265 14374 56134 -14639 -27988 39066 57589 87047
8190H7047j0488m019K5093m4391k7902j2488P847j1709O778M7619q13l7325p971
8177A7278L027J8466l507n7246L7782K8224k9074l1981L803N1797N1387J4629
8165A04585P1848K9676J4942n7237n0532j8868p4472k4514L1058K6756l7408q423
8153G411k5540K8791j0642l4094L6802Q028k2869M6430L6944m6645L3150N6766
8141A14532j4767n2085k3602j2291k4825K5010n693n13M1680j2100l2432k2404
8129a9490L18L5936K1010j0583M416Q0453L8382k5052j9074J0470m1992L7141
8117A11935j2711j8020n8810j5670K8204j3671k818J1625K5016K7716k4926P966
8105F5836N1750j520l1613r519j6080j0673N561K7118j4230k8691j8446L5141
$$ plain form
8190 87047 76559 72540 97633 53242 25340 12852 20699 8990 15768 63387 62574 25249 17278
8177 17278 20305 38771 35264 -21982 15800 44024 14950 -17031 -13228 38569 89956 104585
8165 104585 176433 206109 221051 163814 113282 94414 19942 -4572 26486 53242 15834 7411
8153 7411 -18129 10662 20 -34074 2728 10756 -12113 34317 71261 24616 57766 114532
8141 114532 99765 47680 24078 11787 -13038 11972 6279 5766 47446 35346 2914 -19490
8129 -19490 -19172 16764 37774 27191 31607 112060 150442 125390 106316 116786 74794 111935
8117 111935 99224 81204 22394 6724 34928 21257 18439 30064 55080 82796 57870 65836
8105 65836 117586 116066 84453 74934 58854 48181 53742 80860 66630 37939 19493 54634
8093E4634j9339j1306M2736J2774o125J4677l2939m9604k6157k5531K504k643
8081d6319M7512k043J9505K2418K359k852q367k2073k0124M5345L5875M2551L2560
8068A46347k732p391L67K2060J6129M967j394m2192j1227O269k1849L7254L6612
8055A83220J4242j4927m676N4985k5183k8434j9886L2515J8048K4743M8037k5959
8043B56725l9121n4744J9096j3200J5682J2442l0667L2282L6106k8786k1109n079
8031A79627l640J8800j3301J3527n126Q076J2274k3852j3711K1956O911K5539
8019B27080J0033o735R926M4730J08046Q8921Q3233K3274N1621J4925m1273j17476
$$ plain form
8093 54634 35295 23989 66725 79499 73374 88051 55112 5508 -20649 -46180 -43676 -46319
8081 -46319 1193 -850 18655 41073 43432 40580 32213 10140 -9984 35361 71236 113787 146347
8068 146347 143615 136224 136591 158651 174780 179747 178353 136161 124934 131203 109354 146608 183220
8055 183220 197462 182535 177859 232844 207661 179227 159341 191856 209904 234647 282684 256725
8043 256725 217604 162860 181956 168756 184438 196880 166213 198495 234601 205815 184706 179627
8031 179627 175987 194787 181486 195013 189887 197963 210237 186385 172674 194630 201541 227080
8019 227080 237113 230378 240304 285034 393080 482001 565234 588508 640129 655054 613781 496305
$$ [...]
##END NTUPLES=NMR SPECTRUM
##END=
