##TITLE=Analysis number 328581
Compound Code cc 49501
Book Reference 486/154
Project Code adrs
Chemist Name simons
##JCAMPDX= 6.0         $$ Bruker NMR JCAMP-DX V2.0
##DATA TYPE= NMR SPECTRUM
##DATA CLASS= NTUPLES
##ORIGIN= Bruker BioSpin GmbH
##OWNER= nmr
$$ XWIN-NMR		Version 3.5
$$ Tue Jun 19 11:42:23 2007 GMT Daylight Time (UT+1h)  MAYBRIDGE\nmr@NMR_250MHZ
##.OBSERVE FREQUENCY= 250.131544655141
##.OBSERVE NUCLEUS= ^1H
##.ACQUISITION MODE= SIMULTANEOUS (DQD)
##.ACQUISITION SCHEME= undefined
##.AVERAGES= 16
##.DIGITISER RES= 18
##SPECTROMETER/DATA SYSTEM= dpx250
##.PULSE SEQUENCE= zg30
##.SOLVENT NAME= DMSO
##.SHIFT REFERENCE= (INTERNAL, DMSO, 0, 16.5259)
##AUDIT TRAIL= $$ (NUMBER, WHEN, WHO, WHERE, WHAT)
$$ ##TITLE= Audit trail, XWIN-NMR		Version 3.5
$$ ##JCAMPDX= 5.01
$$ ##ORIGIN= Bruker BioSpin GmbH
$$ ##OWNER= nmr
$$ C:\u/data/dgb/nmr/ADRS/1110/pdata/1/auditp.txt
$$ ##AUDIT TRAIL=  $$ (NUMBER, WHEN, WHO, WHERE, WHAT)
(   1,<2007-06-19 11:41:40.10 +100>,<MAYBRIDGE\nmr>,<NMR_250MHZ>,
      <created by zg, POWCHK disabled, PULCHK disabled
       configuration hash MD5:
       76 6E 9A 78 1E 09 19 81 EC 84 63 8F B0 6A 59 2D
       data hash MD5: 64K
       63 F1 AD 6A A9 0D 31 B5 3F D8 20 85 BD 16 BE EB>)
(   2,<2007-06-19 11:41:58.67 +100>,<MAYBRIDGE\nmr>,<NMR_250MHZ>,
      <Start of raw data processing
       ef LB = 0.3 FT_mod = 6 PKNL = 1 SI = 32K 
       data hash MD5: 32K
       08 36 10 F7 E5 34 63 75 81 48 E4 45 E8 48 E3 51>)
(   3,<2007-06-19 11:42:03.54 +100>,<MAYBRIDGE\nmr>,<NMR_250MHZ>,
      <apk 
       data hash MD5: 32K
       B0 C8 82 7C F1 A6 4D 2F 0B 62 28 8C 61 03 EA 88>)
(   4,<2007-06-19 11:42:04.98 +100>,<MAYBRIDGE\nmr>,<NMR_250MHZ>,
      <abs ABSG = 5 
       data hash MD5: 32K
       4A 64 43 3F B4 85 6E 0C 34 C5 00 52 2C 2C 95 AD>)
$$ ##END=
$$ 
$$ hash MD5
$$ A3 38 D8 1D B4 1F AE AB 44 68 49 83 A9 50 58 FF
##$RELAX= 
##$RELAX= 
##$RELAX= 
##$RELAX= 
##$RELAX= 
##$RELAX= 
##$RELAX= 
$$ Bruker specific parameters
$$ --------------------------
##$DU= <C:\u>
##$EXPNO= 1110
##$NAME= <ADRS>
##$PROCNO= 1
##$TYPE= <nmr>
##$USER= <dgb>
##$AMP= (0..31)
100 100 100 100 100 100 100 100 100 100 100 100 100 100 100 100 100 100 
100 100 100 100 100 100 100 100 100 100 100 100 100 100 
##$AQSEQ= 0
##$AQ_mod= 3
##$AUNM= <au_zg>
##$AUTOPOS= <4 >
##$BF1= 250.13
##$BF2= 250.13
##$BF3= 250.13
##$BF4= 250.13
##$BF5= 500.13
##$BF6= 500.13
##$BF7= 500.13
##$BF8= 500.13
##$BYTORDA= 1
##$CFDGTYP= 0
##$CFRGTYP= 5
##$CHEMSTR= <none>
##$CNST= (0..31)
1 1 145 1 1 1 1 1 1 1 1 1 1 1 1 1 1 1 1 1 1 1 1 1 1 1 1 1 1 1 1 1 
##$CPDPRG= <>
##$CPDPRG1= <>
##$CPDPRG2= <>
##$CPDPRG3= <>
##$CPDPRG4= <mlev>
##$CPDPRG5= <mlev>
##$CPDPRG6= <mlev>
##$CPDPRG7= <mlev>
##$CPDPRG8= <mlev>
##$CPDPRGB= <>
##$CPDPRGT= <>
##$D= (0..31)
0 1 0 0 0 0 0 0 0 0.06 0 0 0 0 0 0 0.0002 0 0 0 0 0 0 0 0 0 0 0 0 0 0 
0 
##$DATE= 1182249698
##$DBL= (0..7)
120 120 120 120 120 120 120 120 
##$DBP= (0..7)
150 150 150 150 150 150 150 150 
##$DBP07= 0
##$DBPNAM0= <>
##$DBPNAM1= <>
$$ [...]
##$SUBNAM7= <"">
##$SUBNAM8= <"">
##$SUBNAM9= <"">
##$SW= 20.6930455092707
##$SWIBOX= (0..15)
0 0 3 0 0 0 0 0 0 0 0 0 0 0 0 0 
##$SW_h= 5175.983436853
##$TD= 65536
##$TD0= 1
##$TE= 296.16
##$TE2= 300
##$TE3= 300
##$TEG= 300
##$TL= (0..7)
0 120 120 120 120 120 120 120 
##$TP= (0..7)
150 150 150 150 150 150 150 150 
##$TP07= 0
##$TPNAME0= <>
##$TPNAME1= <>
##$TPNAME2= <>
##$TPNAME3= <>
##$TPNAME4= <>
##$TPNAME5= <>
##$TPNAME6= <>
##$TPNAME7= <>
##$TPOAL= (0..7)
0.5 0.5 0.5 0.5 0.5 0.5 0.5 0.5 
##$TPOFFS= (0..7)
0 0 0 0 0 0 0 0 
##$TUNHIN= 0
##$TUNHOUT= 0
##$TUNXOUT= 0
##$USERA1= <user>
##$USERA2= <user>
##$USERA3= <user>
##$USERA4= <user>
##$USERA5= <user>
##$V9= 5
##$VALIST= <valist>
##$VCLIST= <CCCCCCCCCCCCCCC>
##$VD= 0
##$VDLIST= <DDDDDDDDDDDDDDD>
##$VPLIST= <PPPPPPPPPPPPPPP>
##$VTLIST= <TTTTTTTTTTTTTTT>
##$WBST= 1024
##$WBSW= 4
##$XGAIN= (0..3)
0 0 0 0 
##$XL= 0
##$YL= 0
##$YMAX_a= 444330
##$YMIN_a= -308801
##$ZGOPTNS= <>
##$ZL1= 120
##$ZL2= 120
##$ZL3= 120
##$ZL4= 120
##$ABSF1= 16.52593
##$ABSF2= -4.167242
##$ABSG= 5
##$ABSL= 3
##$ALPHA= 0
##$AQORDER= 0
##$ASSFAC= 0
##$ASSFACI= 0
##$ASSFACX= 0
##$ASSWID= 0
##$AUNMP= <proc_1d>
##$AZFE= 0.1
##$AZFW= 0.1
##$BCFW= 0
##$BC_mod= 0
##$BYTORDP= 0
##$COROFFS= 0
##$CY= 12.5
##$DATMOD= 1
##$DC= 0
##$DFILT= <>
##$DTYPP= 0
##$F1P= 14.0000005364418
##$F2P= -0.99999901652339
##$FCOR= 0.5
##$FTSIZE= 32768
##$FT_mod= 6
##$GAMMA= 0
##$GB= 0
##$INTBC= 1
##$INTSCL= 1
##$ISEN= 128
##$LB= 0.3
##$LEV0= 0
##$LPBIN= 0
##$MAXI= 10000
##$MC2= 0
##$MEAN= 0
##$ME_mod= 0
##$MI= 0
##$NCOEF= 0
##$NC_proc= -3
##$NLEV= 6
##$NOISF1= 0
##$NOISF2= 0
##$NSP= 0
##$NTH_PI= 0
##$NZP= 0
##$OFFSET= 16.52593
##$PC= 1
##$PHC0= -68.48296
##$PHC1= 17.42824
##$PH_mod= 1
##$PKNL= yes
##$PPARMOD= 0
##$PSCAL= 4
##$PSIGN= 0
##$REVERSE= no
##$SF= 250.129999015577
##$SI= 32768
##$SIGF1= 0
##$SIGF2= 0
##$SINO= 400
##$SIOLD= 32768
##$SREGLST= <1H.DMSO>
##$SSB= 0
##$STSI= 32768
##$STSR= 0
##$SW_p= 5175.98343685301
##$SYMM= 0
##$S_DEV= 0
##$TDeff= 65536
##$TDoff= 0
##$TI= <Analysis number 999999
Compound Code 99
Book Reference 9
Project Code 9>
##$TILT= no
##$TM1= 0
##$TM2= 0
##$TOPLEV= 0
##$USERP1= <user>
##$USERP2= <user>
##$USERP3= <user>
##$USERP4= <user>
##$USERP5= <user>
##$WDW= 1
##$XDIM= 32768
##$YMAX_p= 490776167
##$YMIN_p= -686008
$$ End of Bruker specific parameters
$$ ---------------------------------
##NTUPLES= NMR SPECTRUM
##VAR_NAME=  FREQUENCY,     SPECTRUM/REAL,   SPECTRUM/IMAG
##SYMBOL=    X,             R,               I
##VAR_TYPE=  INDEPENDENT,   DEPENDENT,       DEPENDENT
##VAR_FORM=  AFFN,          ASDF,            ASDF
##VAR_DIM=   32768,         32768,           32768
##UNITS=     HZ,            ARBITRARY UNITS, ARBITRARY UNITS
##FACTOR=    0.157963299565203, 1,           1
##FIRST=     4133.63095584987, 0,            0
##LAST=      -1042.35248100314, 0,           0
##MIN=       -1042.35248100314, -686008,     0
##MAX=       4133.63095584987, 490776167,    0
$$ Real data points
##PAGE= N=1
##DATA TABLE= (X++(R..R)), XYDATA
$$ [...]
16354b964k0694j5603J714K3325k1983k9127R233J3564l088K0400J1953k9370
16342d2640q695j5187Q336K0617M5262J9992j7552k4835k0655r125M498n395j235
16329d6614J280J1286k3166L689J4368r240l16J0171l783j7180J2393K6684L0603
16316A0175o523r025q011m923P336k7828M127o800J1264K07j4806q588J5727J1162
16302b6506j0443P88n43k0023k0039l613L2252p113r15J5318R76j4772J3022r256
16288e0867l110J6124J6897j3761n054r324o427m562n199M398K7349k6726j9309
16275g9571K3740L062J3811K2443j656M488j2923l1541J2649J8499p90k105k6660
16262e6554k9374j88J4325R42o110M020M3532J0233N820Q491l8236l505N494N873
$$ plain form
16354 -2964 -23658 -39261 -37547 -14222 -36205 -65332 -56099 -42535 -45623 -25223 -13270 -42640
16342 -42640 -51335 -66522 -58186 -37569 7693 27685 10133 -14702 -35357 -44482 -39984 -45379 -46614
16329 -46614 -45334 -34048 -57214 -53525 -39157 -48397 -48713 -38542 -42325 -59505 -47112 -20428 10175
16316 10175 3652 -5373 -13384 -18307 -10971 -38799 -34672 -41472 -30208 -30001 -44807 -53395 -37668 -26506
16302 -26506 -36949 -36161 -36704 -56727 -76766 -80379 -48127 -55240 -56155 -40837 -39861 -54633 -41611 -50867
16288 -50867 -53977 -37853 -20956 -34717 -39771 -49095 -55522 -60084 -65283 -60885 -33536 -60262 -79571
16275 -79571 -55831 -52769 -38958 -16515 -18171 -13683 -26606 -58147 -45498 -26999 -27789 -29894 -56554
16262 -56554 -85928 -86116 -71791 -70849 -76959 -72939 -29407 -19174 -13354 -4863 -43099 -46604 -41110 -35237
16248c5237J1608j234J6897j9107l1586o285J3347L0161O61J707l6207k6597j0446
16235i2318J8737L3295J7173J3033j1367o380K0983K4359J946l874k9022j2222
16223b5657Q125j19J7295o903j8611J1874J1545j5424k8569j4925k3109j341J8051
16210f7768J5337L46J8561J7226r431J5032j8406p927l617J8557J2242J3296j6973
16197a3525j2815j3468m714J9740O730Q756J3084k1708R618J0310k6085j2217
16185c6294j3347k6117n209R603K9586L929n665M618K527P780K0177K2954j8285
16172c743j3641J491O640r443k9307k9900K8425K9653K3123p510j2536l4235j5380
16159f6363J3619L413K1331o596k3638qK4879J6342j0245j5284J4116L879N174
$$ plain form
16248 -35237 -23629 -24863 -7966 -27073 -58659 -64944 -51597 -21436 -20775 -19068 -55275 -81872 -92318
16235 -92318 -73581 -40286 -23113 -10080 -21447 -27827 -6844 17515 19461 15587 -13435 -25657
16223 -25657 -17532 -17651 -356 -7259 -25870 -13996 -2451 -17875 -46444 -61369 -84478 -85819 -67768
16210 -67768 -52431 -52085 -33524 -16298 -25729 -10697 -29103 -37030 -40647 -22090 -9848 3448 -13525
16197 -13525 -26340 -39808 -44522 -24782 -18052 -9296 3788 -17920 -8302 2008 -24077 -36294
16185 -36294 -49641 -75758 -80967 -71364 -41778 -37849 -43514 -38896 -36369 -28589 -8412 14542 -3743
16172 -3743 -17384 -15893 -9253 -18696 -48003 -77903 -49478 -19825 3298 -4212 -16748 -50983 -66363
16159 -66363 -52744 -49331 -28000 -34596 -58234 -58242 -33363 -17021 -27266 -42550 -28434 -24555 -19381
16146a9381j3027k3118J1396K5893M004j4981Q254R506k1031k7254N989L4215
16134a9535J4401k2850q701j678J2485j078n781N282L787J0783n807j2672L356
16121b8008k356J4882Q871O273k1022l2788K937j2675j2528Q534j0309Q652L5270
16108c4267P629k7306L4572K3013l267j2122R73l881j7362j3898o16j2299L6892
16095b1939N606l0677k9012J979K4457K7955n998q083p85R758J0842m121k5855
16082d5873k5117J0384K3509k0448K4383M2068j1832j4286M865k5625J7726q95
16070b1141Q226K3834j6257P786M013j1994Q05N105j4188l3870k0119Q276K1209
16057c8315J8138j2189k9067L1235J7184N323j1390N341J7007j6693m3677j0084
$$ plain form
16146 -19381 -32408 -55526 -44130 -18237 -14233 -29214 -20960 -11454 -32485 -59739 -53750 -19535
16134 -19535 -5134 -27984 -36685 -38363 -25878 -26956 -32737 -27455 -23668 -12885 -18692 -31364 -28008
16121 -28008 -30364 -15482 -6611 -338 -21360 -54148 -51211 -63886 -76414 -67880 -78189 -69537 -34267
16108 -34267 -26638 -53944 -19372 3641 374 -11748 -10775 -14656 -32018 -45916 -46532 -58831 -21939
16095 -21939 -16333 -47010 -76022 -74043 -49586 -21631 -27629 -35712 -36497 -26739 -15897 -20018 -45873
16082 -45873 -70990 -60606 -37097 -57545 -33162 8906 -2926 -17212 -12347 -37972 -20246 -21141
16070 -21141 -12915 10919 -5338 2448 6461 -5533 -4728 377 -13811 -47681 -67800 -59524 -38315
16057 -38315 -20177 -32366 -61433 -30198 -13014 -7691 -19081 -13740 3267 -13426 -57103 -67187
16045f7187K1350J9721o178P724n833n704O833J702j1877J0253q740K265m983
16032d0654J5326K0280j0609r880N560j225M130j931j2030N71j3242l0464J7886
16019e6282M3175k778R85J9370j5132l77j6477j2609j6534K7427J631R062m98
16006a9037p884L390N911j4638k8528j3870m935q688K2016K5959K8484M620K0825
15993A3625P894l3737o422L8433l540j9545J54K1627J851j7508M948P660j8199
15980b759j864N684m475j6664K635p477R405k7974j4904L0571m98r574L254L1327
15966c313Q921P92n238J8946J2071k3447k2647k1303J7187O606o413P262J3648
15953C072O570j7048m3518k3118J1412K2463K1774J5547k5105j2872k4584Q991
$$ plain form
16045 -67187 -45837 -26116 -32294 -24570 -30403 -36107 -29274 -27572 -39449 -29196 -37936 -35671 -40654
16032 -40654 -25328 -5048 -15657 -25537 -19977 -21202 -17072 -19003 -31033 -30462 -43704 -74168 -56282
16019 -56282 -13107 -15885 -14900 4470 -10662 -11039 -27516 -40125 -56659 -29232 -27601 -18539 -19037
16006 -19037 -26921 -23531 -17620 -32258 -60786 -74656 -79591 -88279 -66263 -40304 -11820 -7200 13625
15993 13625 21519 -12218 -18640 19793 16253 -3292 -3138 18489 20340 2832 7780 15440 -2759
15980 -2759 -4623 1061 -3414 -20078 -17443 -24920 -15515 -43489 -58393 -27822 -28320 -37894 -34640 -3313
15966 -3313 5608 6400 1162 20108 32179 8732 -13915 -35218 -18031 -11425 -17838 -10576 3072
15953 3072 9642 -7406 -50924 -74042 -62630 -40167 -18393 -2846 -27951 -40823 -65407 -56416
15941e6416M4811O894j2098k9813M66L7589J5222k5899q14M469P135j6890j0600
15928c5944J3658n1710L910K5110m536j8343L339L360k213K7382J5330O965O637
15915g055k7579N494r666j2728J9345O777m100n220M109j4383j0134J5777K0007
15902a9356O863j303k7885J1276J2471j1632m488j436N39M2974K7812j5067l0038
15889i270l9519m395J0212l043J9318K9763k699q765J5011l570j460k2891k7503
15876d8811J248K7058J5583k1254j1631R229k266r657j9665m289J7984J4706J4661
15863a7104j1522K826J5441O284J2351j9354k6038R334L8893N731j8163J236o799
15850f884l4085Q689k294K8104J8016j5424r350o612k1118m760J0901j2349q764
$$ plain form
15941 -56416 -11605 -4711 -16809 -46622 -46156 -8567 6655 -19244 -20058 -15589 -8454 -25344 -35944
15928 -35944 -22286 -73996 -70086 -44976 -49512 -67855 -64516 -61156 -63369 -35987 -20657 -13692 -7055
15915 -7055 -34634 -29140 -38806 -51534 -32189 -25412 -29512 -34732 -30623 -45006 -55140 -39363 -19356
15902 -19356 -12493 -13796 -41681 -30405 -17934 -29566 -34054 -35490 -34951 8023 35835 20768 -9270
15889 -9270 -48789 -53184 -42972 -46015 -26697 3066 367 -8398 6613 3043 1583 -21308 -48811
15876 -48811 -47563 -20505 -4922 -26176 -37807 -28578 -30844 -40501 -60166 -64455 -46471 -31765 -17104
15863 -17104 -28626 -25800 -10359 -4075 8276 -11078 -37116 -27782 11111 16842 -1321 -85 -6884
15850 -6884 -40969 -32280 -34574 -6470 11546 -3878 -13228 -19840 -40958 -45718 -34817 -47166 -55930
15837e5930M2222L2465l0198p040n789M880p692J8990N719k5510k320O364K13
15824b3626J1442J3140k902j0013K2105M596j8772k0223J2700K0583j5709k4139
15812c0818j3894j986J7417J2111M132M529j9502q269P225j5754Q809J1420K244
15799b2336K6164K3269k1977j1124k0449o531j1395o250J0041p430Q613J0114
15787b9291J3306l960k284K6721j2108j3330J2286m725r86J6512J7524m671p284
15774G710o180j3723q788n608N175j0984j2060R05L553N249J1250R354N253k3057
15760c1951j9767p674q322K6976O090r21J9850p694j2938k2252q86j6612Q640
15747f7461j6055J307J9206L134K5967J3447p68m636K541L5253K3970n142l0325
$$ plain form
15837 -55930 -13708 18757 -11441 -18481 -24270 -19390 -27082 -8092 -2373 -27883 -30203 -23839 -23626
15824 -23626 -12184 956 -1946 -11959 10146 14742 -4030 -24253 -11553 9030 -6679 -30818
15812 -30818 -44712 -46698 -29281 -17170 -13038 -8509 -28011 -36280 -29055 -44809 -36000 -24580 -22336
15799 -22336 3828 27097 5120 -6004 -26453 -32984 -44379 -50629 -40588 -48018 -39405 -29291
15787 -29291 -15985 -19945 -22229 4492 -7616 -20946 -8660 -13385 -14371 2141 19665 14994 7710
15774 7710 1530 -12193 -20981 -26589 -21414 -32398 -44458 -43553 -40000 -34751 -23501 -14147 -8894 -31951
15760 -31951 -51718 -59392 -67714 -40738 -34648 -35569 -15719 -23413 -36351 -58603 -59489 -76101 -67461
15747 -67461 -83516 -82209 -63003 -59869 -33902 -20455 -21223 -25859 -23318 11935 35905 30763 438
15734D38j2094j360j1407P014O2L751m783J4810K7456k2127l5532j8771K0439
15721c2104q83R39j17K9273k1052k4062q778J1228K8779P530j485K514o981n676
15707b0875N79Q865q718j0372J0064R764l854K582j4496J983m397K278J8856j1015
15693a8756j0296J7704P864J329j8774J2050J6497P921l738j0182k7633n979M581
15680b7412K852j978K2291L3058n71j5674j8680o019k2979J1023P541N484J0280
15667g84m5277m213L9335p108n442j3565m095Q792r467Q457J1065L6K2456j4671
15653a4481j1048N894J3630Q817j1916p938j7765M2242K0661j1963l2833J0185
15641f515J2335J2037j138j1091K0119r425M895j0877k4007L914k477r862J7823
$$ plain form
15734 438 -11656 -13016 -24423 -17409 -17347 -13596 -18379 -3569 23887 1760 -33772 -52543 -32104
15721 -32104 -32987 -32048 -32165 -2892 -23944 -48006 -56784 -45556 -16777 -9247 -10732 -8218 -15199 -20875
15707 -20875 -20296 -11431 -20149 -30521 -20457 -10693 -14547 -11965 -26461 -24478 -28875 -26597 -7741 -18756
15693 -18756 -29052 -11348 -3484 -2155 -20929 -8879 7618 15539 11801 1619 -26014 -31993 -27412
15680 -27412 -24560 -26538 -4247 28811 28240 12566 -6114 -12133 -35112 -24089 -16548 -11064 -784
15667 -784 -46061 -50274 -10939 -18047 -23489 -37054 -41149 -32357 -41824 -33367 -22302 -22266 190 -14481
15653 -14481 -25529 -19635 -6005 2812 -9104 -17042 -34807 7435 28096 16133 -16700 -6515
15641 -6515 5820 17857 16719 5628 25747 16322 21217 10340 -13667 -9753 -12230 -22092 -4269
15628d269J6950J0086K0410j4521l7150k0257M203M404j251k7995j0778M721L9001
15615a6446L1436L033J8834j6484R328M095k0843k9049k2227J7252r25J8633R415
15602F052r537n223P60j9481P134p883J0499Q745k3662k0603k4842J0059P607
15589f0375J2055L2466J34j9784N294j2130j8238R521N178J9752L7224P016l1910
15576a3797j5308k1691k864J6218K1302j621P195Q962J7026L491j5920r967J7268
15563A0294J5422J0157k033k5978j0920R666K1437k1519k6105J801l307K3037
15551A952J0638M534k3974P128k664J212j0860M750j0220K0823J3195j3131p886
15538d503J579o698j2995L211r666j7463j7640l798M9151M128j0167M060L129
$$ plain form
15628 -4269 12681 22767 43177 28656 -8494 -28751 -24548 -20144 -21395 -49390 -60168 -55447 -16446
15615 -16446 14990 18023 36857 20373 29701 33796 12953 -16096 -38323 -21071 -21996 -3363 6052
15602 6052 -3485 -8708 -7948 -27429 -20295 -28178 -17679 -8934 -32596 -53199 -78041 -67982 -60375
15589 -60375 -48320 -15854 -15720 -35504 -30210 -42340 -60578 -51057 -45879 -26127 11097 18113 -13797
15576 -13797 -29105 -50796 -53660 -37442 -16140 -17761 -10566 -1604 15422 18913 2993 -6974 10294
15563 10294 25716 35873 33840 7862 -3058 6608 28045 6526 -19579 -17778 -21085 1952
15551 1952 12590 17124 -6850 278 -2386 -1174 -12034 -7284 -17504 3319 16514 3383 -4503
15538 -4503 -2924 -9622 -22617 -19406 -29072 -46535 -64175 -67973 -18822 -14694 -24861 -20801 -17672
15525a7672n416m004L502j3827J3695J5529k4668n974r433L188k1959J5016K5466
15512b6557m692K5185M153P254N351N758l11p17k4591k4979m896k495j5413K8052
15498b8898K4841K741m0519k0124J6934J7378M860R970K4323j9011L163K0735
15486A6393k1068l8366k1838J5412R207J546j5756J7977K5486J2863l261k6470
15474b7875j7212j482R851J739R450n500J7231J301j2657k463K296p661m701R95
15460c6688o808J5084K3176j1162m036K8660j787l5169k7382M390Q885R726l2984
15447f6095j4067j3693K3494R375J9481r283j7312j1931j121L6679L4011Q88k033
15434a1607J2586j9087K94P889k3475N10J2573N124p769l644j2806j7669J2877
$$ plain form
15525 -17672 -23088 -27092 -23590 -37417 -23722 -8193 -32861 -38835 -48268 -45080 -67039 -52023 -26557
15512 -26557 -31249 -6064 -1911 5343 10694 16452 16141 15424 -9167 -34146 -39042 -41537 -56950 -28898
15498 -28898 -4057 -1316 -41835 -61959 -45025 -27647 -22787 -12817 11506 -7505 -4342 16393
15486 16393 -4675 -43041 -64879 -49467 -40260 -38714 -54470 -36493 -11007 1856 -1405 -27875
15474 -27875 -45087 -46569 -36718 -34979 -25529 -31029 -13798 -12497 -25154 -27617 -25321 -32982 -37683 -36688
15460 -36688 -43496 -28412 -5236 -16398 -20434 8226 6439 -28730 -56112 -51722 -42837 -33111 -66095
15447 -66095 -80162 -93855 -70361 -60986 -41505 -50788 -68100 -80031 -81152 -44473 -10462 -9574 -11607
15434 -11607 979 -18108 -17814 -9925 -33400 -32890 -20317 -15193 -22962 -26606 -39412 -57081 -44204
15421d4204J8518j466j0602J0520K3205j8544n913j7241K486L3674K1152o466
15409E119l1638p016J3816q045j3669q406K2146J4480J785K643j0332k4363q822
15396e2302K1799K3471O708q946n303J8314k465j5155K2910M298m5148l878J6907
15383a8790l434K3772J7603j145l5602q753M578k344J3531J0098O417k1304l9698
15370e5071j3298L849K1637L4103L9110N060j1093j2691J649j3880k4164k9096
15358e3885J0798L9751K6594J7586l0259k9721n634J1736K1187k816L270J7461
15346B6068M719k1146j7207L032K8631o873k3237p403k490r274k3085j1308K6874
15333c2699m443r079n560P764J1413k4851m185K3993o587j099k016J4344j456
$$ plain form
15421 -44204 -25686 -27152 -37754 -27234 -4029 -22573 -28486 -45727 -43241 -9567 11585 5119
15409 5119 -26519 -33535 -19719 -27764 -41433 -49839 -27693 -13213 -11428 -8785 -19117 -43480 -52302
15396 -52302 -30503 -7032 -324 -9270 -14573 3741 1276 -13879 9031 13329 -31819 -35697 -18790
15383 -18790 -22224 1548 19151 18006 -17596 -26349 -21771 -24115 -10584 -486 5931 -15373 -55071
15370 -55071 -68369 -64520 -42883 -8780 30330 35390 24297 11606 13255 -625 -24789 -53885
15358 -53885 -43087 -3336 23258 40844 10585 -19136 -24770 -13034 8153 5337 8607 26068
15346 26068 30787 9641 -7566 -4534 24097 17224 -6013 -13416 -15906 -25180 -48265 -59573 -32699
15333 -32699 -37142 -46221 -51781 -44017 -32604 -57455 -61640 -37647 -44234 -45333 -47349 -33005 -34461
15320c4461k760k509k9980j4388J3176K82L0804L9192R778J4963r113J0828k1496
15307D316m0819K774K4841J9538R378M052k073k0056q257j568j5802J1830l733
15294a5579N894J2551j066K291k2105k942J1786k972r575J1515R476J0608k1435
15281a1553r580J2463O227K5924J9728j6945q016J9395j4946J492j4364k3728
15269a3903L5852J0029m2086m0571j4570Q804K3823R309R768J5854N7830l2253
15257B7886k4629k5165k0966q910J8794K1914K401J6556J2270J5544J0359j1598
15245C4456J0836J0628j1080K128q502k1259j403J2184L681k2104k4796P219p520
15232a5532K2306j597k2885j0156K896O504j3361L037L5353L748k3724o787O686
$$ plain form
15320 -34461 -37221 -39730 -69710 -84098 -70922 -70640 -39836 -644 9134 24097 14984 25812 4316
15307 4316 -36503 -33729 -8888 10650 20028 24080 22007 1951 -6306 -7874 -23676 -11846 -15579
15294 -15579 -9685 2866 1800 4091 -18014 -20956 -9170 -12142 -21717 -10202 -726 9882 -11553
15281 -11553 -21133 -8670 -2443 23481 43209 26264 18248 37643 22697 24189 9825 -13903
15269 -13903 21949 31978 -10108 -50679 -65249 -56445 -32622 -23313 -13545 2309 60139 27886
15257 27886 3257 -21908 -42874 -51784 -32990 -11076 -8675 7881 20151 35695 46054 34456
15245 34456 45292 55920 44840 46968 38466 17207 15804 27988 31669 9565 -15231 -8012 -15532
15232 -15532 6774 5177 -17708 -27864 -24968 -18464 -31825 -28788 6565 10313 -13411 -20198 -13512
15219a3512k1220j2612J422j0108k37j471n286m160O896J1275M944L4141J0872
15206I44R385j1099N13J3158M646J1067j9835j8204j3813j611p51J0853J7677
15193B930L575n473k0521o399j440j6162o055K8329K8504q709l0489n660L2361
15180e209J4740K1031K0393j4304k68l913j4492k406j8082j0395J489L1066K0081
15167C9731j6406l4402K6890P761j2033j6068o646j8377j7071K26n23Q909J9846
15154a8163M259p391O290K138O821M141K5039J65o272k5783J871j5152l955J4196
15140a1796J3548o33O517r192m559q187p540n473j8507K6709j7696l585l994m484
15126d8872L824J8457M4785K0864j9157q397J1818N806m0577j4075O434J9644
$$ plain form
15219 -13512 -34732 -47344 -45922 -56030 -56267 -57738 -63024 -67184 -60288 -49013 -44069 -9928 944
15206 944 10329 -770 -257 12901 17547 28614 8779 -9425 -23238 -24849 -25600 -14747 2930
15193 2930 6505 1032 -19489 -25888 -27328 -43490 -49545 -21216 7288 -1421 -31910 -37570 -5209
15180 -5209 9531 30562 50955 36651 36383 32470 17978 15572 -2510 -12905 -11416 19650 39731
15167 39731 23325 -11077 15813 23574 11541 -4527 -11173 -29550 -46621 -46395 -46918 -38009 -18163
15154 -18163 -13904 -21295 -15005 -12867 -6046 -1905 23134 23299 17027 -8756 -6885 -22037 -25992 -11796
15140 -11796 1752 1119 7636 -1556 -6115 -14302 -21842 -27315 -45822 -19113 -36809 -40394 -44388 -48872
15126 -48872 -45048 -26591 18194 39058 19901 11504 23322 29128 -11449 -25524 -19090 554
15114E54n910L762J613M71J8410k4211k2511m57j9859j012J8654J1467K332o761
15100b3458k6660m940L6065K2589O847K901l499j2775J8172M804j0135N714M878
15087B0503k5179r071J0182L3594j0596m8276q61J8295M540n097J5090Q729J7021
15074B8874l296o444J114R853k8226k8726P752j0162j4515o452P87n436R735J5463
15060b9679K6592J0161J5461k2717k8042j3727J0170J0421N874J8819j4334j6417
15048b7418P053J063j3497j0725j0143J5787k330L879K7516k198m895k828J0493
15035h243J4781j2773l5119L626K6771J718j0877k9444j6199M0392j816P65J4352
15022a2066N06l34k0614J6264M0464q056J4027J5655k9873k9516j0749p013J165
$$ plain form
15114 554 -5356 -1594 19 490 18900 -5311 -27822 -28279 -48138 -49150 -30496 -19029 -16697 -23458
15100 -23458 -50118 -55058 -18993 3596 10443 13344 9845 -2930 15242 20046 9911 15625 20503
15087 20503 -4676 -13747 -3565 30029 19433 -28843 -29704 -11409 -6869 -11966 3124 11853 28874
15074 28874 25578 19134 20248 30101 1875 -26851 -19099 -29261 -43776 -50228 -49441 -54877 -45142 -29679
15060 -29679 -3087 7074 22535 -182 -28224 -41951 -31781 -21360 -15486 3333 -11001 -27418
15048 -27418 -20365 -19302 -32799 -43524 -53667 -37880 -40210 -36331 -8815 -11013 -15908 -18736 -8243
15035 -8243 6538 -6235 -41354 -37728 -10957 -9239 -20116 -49560 -65759 -25367 -27183 -26418 -12066
15022 -12066 -11560 -11894 -32508 -16244 24220 16164 30191 45846 15973 -13543 -24292 -31305 -30140
15009c0140j1393J3358J0295j300J7210R023m0674k2334J2873Q333J2038o560
14997b9271L8362J961l3836n572K3017n152N977K481p361j887k0720j7910K68
14984d9643L4466J6450J524K409j7137j0242l334J785j1676n966j0519K605J5693
14971c3585L8704K0359j6041J0158N554j0324l883J923q341O488K719Q964j5515
14958G180n847K1053Q384l652n716P927j6486j285j3579m266m509J2668j1955
14945a0083k6470P71P299P185j2529N625J6175j7305j0908K3407K159N048J2208
14932B582N464J3307p782m7791m35n383J0028M039l6620J3631L6765K0759K6346
14919C4910j3162n873l773m521Q399O709j1379r312J2465L664k1298j5307Q007
$$ plain form
15009 -30140 -41533 -28175 -17880 -19180 -1970 7053 -33621 -55955 -43082 -34749 -22711 -29271
14997 -29271 9091 11052 -22784 -28356 -5339 -10491 -4514 -2033 -9394 -11281 -32001 -49911 -49643
14984 -49643 -15177 1273 2797 5206 -11931 -22173 -25507 -23722 -35398 -41364 -51883 -49278 -33585
14971 -33585 5119 25478 9437 19595 25149 14825 10942 12865 4524 11012 13731 22695 7180
14958 7180 1333 22386 30770 27118 21402 29329 12843 11558 -2021 -6287 -10796 1872 -10083
14945 -10083 -36553 -35782 -28483 -21298 -33827 -28202 -12027 -29332 -40240 -16833 -14674 -9626 2582
14932 2582 8046 21353 13571 -34220 -34655 -40038 -30010 -25971 -62591 -48960 -12195 8564 34910
14919 34910 21748 15875 12102 7581 15980 22689 11310 1998 14463 18127 -3171 -18478 -10471
14906a0471o471J1596L022j1149p802j6181L5466J7184j1309m1428k3482J8517
14894d2508J1462K8425O68j2862J180m279L4199M216k7217k924m66P197J1025
14881H116k978R356k8420J3477m684j7910L729k268k368K8347K5156M953j3924
14868B0582K788J5463q510j7878M823L031j6680k0279j8164N782K677M692p104
14855b8777J1387p129P862q325N497L4867J687L948j2207o202J523Q029K371N553
14841B0084k0342m402L973P438l058j0396M707J4563J1482n512M977j4143m849
14828D522O567k5536q510P741j8063p20J0483K4798J8468j8385j4072n720Q811
14815i616m2122j8276K8057o708K4115K6657J5958J485R500j2036l345j5504j3353
$$ plain form
14906 -10471 -16942 -5346 -2324 -13473 -21275 -37456 -1990 15194 3885 -37543 -61025 -42508
14894 -42508 -31046 -2621 -1953 -14815 -13635 -17914 16285 20501 -6716 -9640 -10106 -2909 8116
14881 8116 5138 14494 -13926 -449 -5133 -23043 -19314 -21582 -23950 4397 29553 34506 20582
14868 20582 23370 38833 30323 12445 17268 20299 3619 -16660 -34824 -29042 -26365 -21673 -28777
14855 -28777 -17390 -24519 -16657 -24982 -19485 15382 17069 21017 8810 2608 4131 12160 14531 20084
14841 20084 -258 -4660 -687 6751 3693 -6703 -1996 12567 24049 18537 23514 9371 4522
14828 4522 11089 -14447 -22957 -15216 -33279 -33999 -23516 1282 19750 1365 -12707 -18427 -9616
14815 -9616 -51738 -70014 -41957 -48665 -24550 2107 18065 19550 29050 17014 13669 -1835 -15188
14802a5188q776K0723J3665m824l339J5890l272P331M975l3713Q145L8628J0443
14789E0688l1890j5791J3275J1668k5397k7623O072J3932q038L645l2068j2272
14777e3799O656R190J6461O829j0716J3693M0605J8164l2433j3838n459m918P093
14764b472J3181q671j3331J8714J0434k2014k8757K989J3186J5394L632J457k4067
14751b0325j3660j3610j1303J7979n983Q385L6072J8163m856l821n253k2972P259
14738a3925L002R934R154j3763p468l461K469L0766J040j4885j9864J0544L2567
14725B6110M896l1117k8631K3675J0769J616k3709j200J2611l198k0058L3621
14713E385J0901k3r03K863L378n225J7370K437j2527L896o546J2151j5202l5352
$$ plain form
14802 -15188 -23964 -3241 10424 5600 2261 18151 14879 22210 27185 -6528 1617 40245 50688
14789 50688 18798 3007 16282 27950 2553 -25070 -18998 -5066 -13104 -9459 -41527 -53799
14777 -53799 -47143 -37953 -21492 -14663 -25379 -11686 28919 47083 14650 812 -4647 -9565 -2472
14764 -2472 10709 2038 -11293 7421 17855 -4159 -32916 -29927 -16741 -1347 2285 3742 -20325
14751 -20325 -33985 -47595 -58898 -40919 -46902 -38517 -2445 15718 10862 7041 1788 -21184 -13925
14738 -13925 -10923 -989 8165 -5598 -13066 -16527 -14058 16708 17748 2863 -17001 -6457 26110
14725 26110 31006 -111 -28742 -5067 5702 7318 -16391 -17591 -4980 -8178 -28236 5385
14713 5385 16286 16263 15360 18223 21601 16376 33746 36183 23656 27552 21006 33157 17955 -17397
14699a7397L693J8374n594l4505m200J8946J7399R371O223l733j7960q793l4338
14686e2514k5423N722M0445J1034L842l119R105P043J9457R380J2956J5649l725
14673D9852m1081N15K5703o214l1385K3762J3356m941j6617q484K4375j1290m109
14660A3442o389J882j3558p654J8525K4018k0660k8951k8308L03L3647J8706J7817
14647B2820N707j8402j2918R156O376j6074J81J4409J741n618k7732J583o813
14634b5584J2926K3096j3853K422J4426k1800M148J0842J7688m2p53J0972K5299
14621E9787j8855j4112J211k4018q205K901K0898N46j0591k2007n825q48P970
14608a1148L962P73R611R859m460j6836j7205J7099R903k2800q257P564K355J0202
$$ plain form
14699 -17397 -13704 4670 -924 -35429 -39629 -20683 -3284 6087 12310 8577 -9383 -18176 -52514
14686 -52514 -77937 -72215 -31770 -20736 -16894 -20013 -10908 -3865 15592 24972 37928 53577 49852
14673 49852 8771 9286 34989 28775 -2610 21152 34508 29567 12950 4466 28841 17551 13442
14660 13442 7053 8935 -4623 -12277 6248 30266 9606 -19345 -47653 -47350 -13703 5003 22820
14647 22820 28527 10125 -2793 6363 12739 -3335 -3154 11255 12996 7378 -20354 -18771 -25584
14634 -25584 -12658 10438 -3415 -993 13433 -8367 -4219 6623 24311 24269 23516 34488 59787
14621 59787 40932 26820 28031 4013 -4192 -1291 19607 20153 9562 -12445 -18270 -19118 -11148
14608 -11148 -7186 -6413 3198 13057 8597 -8239 -25444 -8345 1558 -21242 -29499 -21935 -19580 -9378
14594i378J7577K8891m093k3842j7719K402m500k228l065k718J1737J4683j7668
14581i921N84J9653L3832R689J3572O588k3648j7022j0113J7167k4862j3302J9490
14568B1707J9449k5008k3578j01j6758N164K7293O275q593j1297K3682j19j5513
14555B603J8697N028j6447k799J0316j221k1566j4792o343n481j6477J1239N015
14542c2228m817p942J2462J2969L759K523J519k0757J8129K3457k4436R291K2631
14529A6560J5808l0311n178J3263l143l91R16k6254m29J9280J0403Q142P150j325
14515B4491J1450P148Q139m9361r351l398M096p695M79J1096n790J2306r345J0247
14501D512K827l1771m882p360J1817j3734j4833J3362K9260k152J0708J5585J7892
$$ plain form
14594 -9378 8199 37090 32997 9155 -8564 -6162 -10662 -12890 -15955 -18673 -6936 7747 -9921
14581 -9921 -9337 10316 44148 53837 67409 73997 50349 33327 23214 40381 15519 2217 21707
14568 21707 41156 16148 -7430 -7531 -24289 -19125 8168 14443 5850 -5447 18235 18116 2603
14555 2603 21300 26328 9881 7082 17398 16177 -5389 -20181 -26524 -32005 -48482 -37243 -32228
14542 -32228 -37045 -44987 -32525 -19556 -15797 -13274 -11755 -32512 -14383 9074 -15362 -6071 16560
14529 16560 32368 2057 -3121 10142 6999 6608 7524 -18730 -19159 121 10524 18666 25816 24491
14515 24491 35941 43089 51228 1867 -7484 -10882 -6786 -14481 -14002 -2906 -8696 3610 -5735 4512
14501 4512 7339 -24432 -29314 -36674 -24857 -38591 -53424 -40062 -10802 -12954 -2246 13339 31231
14488C1231j5244p945K0165J4169p477l2176P320J4470l2853L977n006j4227L954
14475a9642J1021J6897K5874m916N491P062m9742j7826J4227J5182m007N758O795
14462A2174k3981n995k0173K337J9857M1578K8707K0958j1291j9683k3290M954
14450B6152r408j6480J4508j0557J9998J5959j433j9292n771N133M31J4778K0543
14437E4561R537j5555p973k8601m187p858J1798j7198j4328K0537Q633L568J9589
14424C2523L414L48k4000q217k909O795P841N083k7281j9828L068J1698K300P37
14410h428K762n183K2168P027N642J1614L1789K1339j6149j8048m1588j5188K756
14397E13L166r552j6424M084J2312l036k2195q464J8728K6706J6417n288n316
$$ plain form
14488 31231 15987 8042 28207 42376 34899 2723 10043 24513 -8340 -4363 -9369 -23596 -19642
14475 -19642 -8621 8276 34150 29234 34725 41787 -7955 -25781 -11554 3628 -379 5379 12174
14462 12174 -11807 -17802 -37975 -35638 -15781 25797 54504 75462 64171 44488 21198 26152
14450 26152 16744 264 14772 4215 24213 40172 38739 19447 13676 18809 19240 34018 54561
14437 54561 64098 48543 40570 11969 7782 -76 11722 -5476 -19804 733 9366 12934 32523
14424 32523 35937 36285 12285 4068 1159 7954 15795 20878 -6403 -26231 -23163 -11465 -9165 -8428
14410 -8428 -5666 -10849 11319 18346 23988 35602 67391 88730 72581 54533 12945 -2243 513
14397 513 3679 -5873 -22297 -18213 -5901 -8937 -31132 -39596 -20868 5838 22255 16967 11651
14384A1651L397K953M917m738m634K090Q287o783J160J3739M047r633j8188n541
14370B724K3772K9154r181k1391l4682n64K3183J184J0078j0648j4514n235N213
14357i07p146k780P793J560O120J3937J7782L557l1543k0003J6839J9J4877L063
14343B3168l8171n858q03j2381K8804O253k5858J5597K335M179K419n483J5264
14330I465j3025k3496J2014M1052K116l5682j8629J5778K4153J5549n45J0269
14318C9019J2909j4894j4760n231n65m774K7977q502k3364n391j2223j2011M19
14305b1391K7962k739k4881J2280K7815J5311O237r045J9816O964j9931L992j8484
14292B3906k1174Q265M087P590j6311J5935J2653O003n286k185J9937R716k9697
$$ plain form
14384 11651 15048 18001 22918 18180 13546 15636 23923 17140 18300 32039 36086 26453 8265 2724
14370 2724 26496 55650 46469 25078 -9604 -10168 13015 14199 24277 13629 -885 -6120 -907
14357 -907 -8053 -10833 -3040 -1480 4640 18577 36359 39916 8373 -11630 5209 5228 20105 23168
14343 23168 -15003 -20861 -21664 -34045 -5241 1012 -24846 -9249 -6914 -2735 -316 -5799 9465
14330 9465 -3560 -27056 -15042 26010 28126 -7556 -26185 -10407 13746 29295 28750 39019
14318 39019 51928 37034 22274 17043 16478 11704 39681 31179 7815 2424 -9799 -21810 -21391
14305 -21391 6571 3832 -21049 -8769 19046 34357 40594 31549 51365 58329 38398 42390 23906
14292 23906 2732 10997 15084 22674 6363 22298 34951 40954 35668 33483 53420 63136 33439
14279C3439l2843j2088N897J027N709l7289J8235L2128J0522R220K8401j593m6906
14266A3859j5011K9891O649k1039j8546M823l251J381K9109k4893k7938J472K9973
14253F479L6724k0014j5047j2956j6823L027J8629l387k3293O650L1138L2278
14241D3405j4239l3747j053L1609Q362j1039L3815K91L81m998j1903j1860k7115
14228A909l215j2408N52j9097j7925J2976K5348K6321L585j2669P635L7630N184
14215E5826j7876k8616J6496R143l5637k4909L5795L811J2169K4841n228j7997
14203B7818j5713r37K216n926j0849j7691j0420J9925K4546J9853J0087p306j0078
14190B5525k9508N4P902p743J4403K0017J174K580J0276j2195R178J6832j1903
$$ plain form
14279 33439 596 -11492 -5595 -4568 1141 -36148 -17913 14215 24737 33957 62358 60765 13859
14266 13859 -1152 28739 35388 14349 -4197 626 -2625 -1244 27865 2972 -24966 -23494 6479
14253 6479 43203 23189 8142 -4814 -21637 -18610 19 -3368 -26661 -20011 11127 43405
14241 43405 29166 -4581 -5634 25975 34337 23298 57113 57404 57785 52787 40884 29024 1909
14228 1909 -1306 -13714 -13162 -32259 -50184 -37208 -11860 14461 18046 5377 13012 50642 55826
14215 55826 37950 9334 25830 34973 -664 -25573 10222 14033 26202 51043 45815 27818
14203 27818 12105 11168 13384 7458 -3391 -21082 -31502 -11577 12969 32822 42909 35603 25525
14190 25525 -3983 -3929 3973 -3770 10633 30650 31824 34404 44680 32485 41663 58495 46592
14177D6592p178k374n912M849j018M711k8920L330J0901l154K4161K8124k1487
14164E2625o4K4060j2592m0671j2472J5965J5107J0434j0442r000J7728j2234
14152C8444l565m168N694J2704P0r988Q3m924j8273j5542J3105K4393R049j7404
14138B9678q915l992j2643K4942K0014O922l411j5909l0460k287K2561J3851K5260
14125F5611M483k5493M340J8284J4950j1549l0570l953J6457J450k2786O024K4118
14112F1366k8462j4441k2795m864J6571K2979K2807l3546l4546L3334J5316M5129
14100G8848j310m7551n091o992j9822j6105O897L8473K1037o712l3179j0914k3617
14087b6038J028K1481N902M456L2630K3949j2541q456q081j789p029J2976Q097
$$ plain form
14177 46592 39414 37040 31128 35977 34959 39670 10750 14080 24981 21827 45988 74112 52625
14164 52625 52561 76621 64029 23358 10886 26851 41958 52392 41950 32950 50678 38444
14152 38444 34879 30711 36405 49109 49179 39191 39274 34350 16077 535 13640 38033 47082 29678
14138 29678 20763 16771 4128 29070 49084 56006 52595 36686 6226 3939 26500 40351 65611
14125 65611 70094 44601 48941 67225 82175 70626 40056 36103 52560 54010 31224 37248 61366
14112 61366 32904 18463 -4332 -9196 7375 30354 53161 19615 -14931 18403 33719 78848
14100 78848 77538 29987 24896 17904 -1918 -18023 -11126 27347 48384 41672 8493 -2421 -26038
14087 -26038 -25010 -3529 2373 6829 39459 63408 50867 42411 34330 32541 25512 38488 46585
14074D6585J5168J9373k22k8714k034m0r968N372p377j2390J7915N922n579j9399
14060B4612K6891J5020j6019m84K1647j015k0959M915Q942j0144k0481l4317R52
14047d40K7599N470J161M744j557m132J0960k093k7360J3070K7597k5221q898
14034B0900J5605J4j2766m402l240Q575O795j6618k012J2214j140n779L312K316
14020B3774j7803N681J8932j0559j1694K7133K718j3394J7385Q074k1628r921
14008A8698n112m115J5714K2841J9287k5131k002Q187K0960J2510Q018j4342j2864
13995F2649j500N727J673j3374q773P637K558J4587j7582p26j1572M910K2750
13982F8964M695O3K8268j3166N965O191p861j4060k8975j6779J6615P825Q395
$$ plain form
14074 46585 61753 81126 80904 52190 50156 50116 40148 45520 38143 25753 43668 49590 44011 24612
14060 24612 51503 66523 50504 50020 71667 70652 49693 54608 63550 53406 32925 -1392 -440
14047 -440 27159 32629 33790 38534 36977 32845 43805 41712 14352 27422 55019 29798 20900
14034 20900 36505 36519 23753 19351 16111 24686 31481 14863 12851 25065 23925 18146 21458 23774
14020 23774 5971 11652 30584 20025 8331 35464 38182 24788 42173 50247 28619 18698
14008 18698 13586 9471 25185 48026 67313 42182 40180 48367 69327 81837 89855 75513 62649
13995 62649 61149 66876 68549 55175 46402 54039 56597 71184 53602 52876 41304 46214 68964
13982 68964 73659 73722 101990 88824 94789 100980 93119 79059 50084 33305 49920 57745 66140
13969F6140N940Q384R755J012l7497j6735j0313j3726k008r034q026O626K6394
13956B6912K629R547J4795K6714j6773k3509o345R790J2720r007J2339K848j323
13943F1337L613m042k539J0091j407K768N656J5791j669k3153j0826j6185J3119
13930E2554N602K795j9574o929j6450p641m601K768K2838J4786K846p779k470
13917C8745K0268P992q663j8270J8019L1149q64j3107k2302k4498k0927J349J7712
13904B6603K431M20L190O714l042m2860j3066r712K5574L3965J8369N781j018
13891E3349K4330k420l278n407k339j5745l2522J5988M385L851L3466n020n549
13878F3089J301o449k0332r029r375P75j0202P284M1471R154j8253j1167L550
$$ plain form
13969 66140 72080 80464 90219 91231 53734 36999 26686 12960 10952 1918 -6108 518 26912
13956 26912 29541 39088 53883 80597 63824 40315 33970 43760 56480 47473 59812 62660 61337
13943 61337 64950 60908 58369 68460 67053 69821 75477 91268 89599 66446 55620 39435 52554
13930 52554 58156 60951 41377 34448 17998 10357 5756 8524 31362 46148 48994 41215 38745
13917 38745 59013 67005 58342 40072 58091 89240 88376 75269 52967 28469 7542 8891 26603
13904 26603 29034 29454 32644 39358 36316 -6544 -19610 -29322 -3748 30217 48586 54367 53349
13891 53349 77679 75259 71981 66574 64235 48490 15968 31956 36341 40192 73658 68638 63089
13878 63089 64390 57941 37609 28580 19205 19980 9778 17062 58533 67687 49434 38267 41817
13865D1817O970j5944J1623J2392r061P826q674k306l449l869q08J9745m425j014
13851E0823j2988j5017K1480J5486m330J4095K4963L842O623j489n5k1886O538
13838H8085o521j5945j9853j9845L148K2561j0840P870K1075r80k841j7945j5738
13825C2231j5999M637N768P883K0393q012j925k1021K3542K3442N014J160J219
13812G8332j2565k589j3182k121O445L927K6271q642k6402m101q419L665J5207
13799E5826M228J3188Q702j9391k816j357j0308J1079m194j1660Q320j1281j3364
13786B6972O734J7526J7238J8117k434p034R011k0706k1040K067k2910L879L1922
13773E9342K585k382J0540L1498L0475j0338l6513k413K5818Q842j5524k3480
$$ plain form
13865 41817 48787 32843 44466 56858 47797 55623 46949 44643 41194 37325 36517 56262 51837 50823
13851 50823 37835 22818 44298 59784 55454 69549 94512 98354 104977 103488 103433 81547 88085
13838 88085 81564 65619 45766 25921 29069 51630 40790 48660 69735 68755 65914 47969 32231
13825 32231 16232 20869 26637 34520 54913 46901 44976 23955 47497 70939 75953 77113 78332
13812 78332 65767 63178 49996 47875 54320 58247 84518 75876 49474 45373 36954 40619 55826
13799 55826 60054 73242 81944 62553 59737 58380 48072 59151 54957 43297 51617 40336 26972
13786 26972 33706 51232 68470 86587 84153 77119 86130 65424 44384 46451 23541 27420 59342
13773 59342 61927 59545 70085 101583 132058 121720 85207 82794 108612 117454 101930 78450
13761G8450q764J6625L0217J1181j7845l2040k4095m203L6509j1853k8397R332
13749E5117j2775M258J1446J20q107J6535K3242Q173K294k5636k3081k5803M562
13736C0345J9349N359j3337j6153L914j5094K510J1740n529J2235J2648n29J1113
13723E8571k785j1418m0327k4352K7950K2238J8077l205j639J3834K3325J2758
13711I3027l423j9985J4427Q663J046o661k4032j9726m615J1220J8153j8610Q750
13698E8234L8718j794m2400j5920p955j6658O937o436o188Q289P874O551O886
13685C6138L0546K5315j6991r211q645M792K0426K3429j7224j6639n963O817K6227
13672I9017J3918k250k9821p736J6069Q072j1968l6365Q222j2251q836k211K8773
$$ plain form
13761 78450 69686 86311 116528 127709 109864 77824 53729 49526 86035 74182 45785 55117
13749 55117 42342 46600 58046 58166 50059 66594 89836 98009 100303 74667 51586 25783 30345
13736 30345 49694 55053 41716 25563 29477 14383 16893 28633 23104 35339 47987 47458 58571
13723 58571 55786 44368 4041 -20311 7639 29877 47954 44749 43110 56944 80269 93027
13711 93027 89604 69619 84046 92709 93755 87094 63062 43336 38721 49941 68094 49484 58234
13698 58234 96952 95158 52758 36838 28883 12225 19162 12726 6538 14827 22701 29252 36138
13685 36138 66684 91999 75008 65797 57152 61944 82370 105799 88575 71936 65973 72790 99017
13672 99017 112935 110685 80864 73128 89197 97269 85301 48936 57158 44907 36071 33860 62633
13659F2633J9556o615k1020k444K3476O887m817k933k0017l363K128o662J5647
13646F2456l660N494J5207l0057j0098K2571K0316j4197j2237J339K3866J7188
13634I8188j0829n544l6858k1468q633K5555O045k0182K908K1838P094J5722k798
13621G1038J098r962j5045l803J8782q031L4217L0277m404k2357j980j880j4890
13608G3060J745J0029R386n998m920J3654K5987n629j0645K986K7258k8478k6139
13595H2296J4708R099j2238k0526O780j593R961L507J80O24j4404m088m523J4889
13581H4672p420p419O244n208N203p531M045R866n067R043J4230l246j764l587
13567I2061l2946K1430N529q33K181O039n82J9839N266r564o473m461l0056m570
$$ plain form
13659 62633 82189 75574 54554 52110 75586 82473 77656 74723 54706 51343 53471 46809 62456
13646 62456 58796 64290 79497 49440 39342 61913 82229 68032 55795 57134 81000 98188
13634 98188 87359 81815 44957 23489 14856 40411 46456 26274 29182 51020 58114 73836 71038
13621 71038 72136 62174 47129 43326 62108 54077 88294 118571 114167 91810 89830 87950 73060
13608 73060 74805 84834 94220 88222 83302 96956 122943 117314 106669 109655 136913 108435 82296
13595 82296 97004 106103 93865 73339 80119 78526 88487 91994 92174 92798 78394 74306 69783 84672
13581 84672 77252 69833 76077 70869 76072 68541 72586 82452 77385 86428 100658 97412 95648 92061
13567 92061 59115 80545 86074 85241 87422 93461 92879 112718 117984 108420 101947 97486 67430 62860
13553F2860J1864R244J068L8J6755J3198k1466j0731j6082o571K5076n860J5165
13540I4558k536m3607K7034K1069M001P956k0350j3367k122J3167L155j8602m897
13527F5459L3735Q318J8565l3841J580n041q696J2295k958J6064J9620j4579j6669
13514I3852j6092j9965j4011j466K3808L5527J3492j4673j8912P139r900J1473
13502I0272r390j5686j4980q553L337K6076K6388q918j1377J3273J967J0308j8711
13489H4006P399J1120J6045n006N401p576j266k61o337p764j0570o243J3757J2192
13475A04897j2775J901j0766j6484k775O67J4767j6144j1517K0149Q957M797N645
13462I1319J4705l6519k3258K5962K8818K3470J1578n927m3281j6235K7275J3119
$$ plain form
13553 62860 74724 83968 85036 85074 101829 115027 93561 82830 66748 60177 85253 79393 94558
13540 94558 92022 48415 75449 96518 100519 108475 88125 74758 72636 85803 88958 70356 65459
13527 65459 99194 107512 126077 92236 93816 88775 80079 92374 89416 105480 125100 110521 93852
13514 93852 77760 57795 43784 42318 66126 101653 115145 100472 81560 88699 78799 90272
13502 90272 80882 65196 50216 41663 45000 71076 97464 88546 77169 90442 92409 102717 84006
13489 84006 91405 102525 118570 113564 118965 111389 110123 109862 103525 95761 85191 78948 92705 104897
13475 104897 92122 94023 83257 66773 63998 64665 79432 63288 51771 71920 80877 85674 91319
13462 91319 106024 69505 46247 72209 101027 124497 136075 130148 86867 70632 97907 111026
13450A11026j5673k669p515j0328j9859J7778K3357M19j0753J6151J8817k8753
13438I1998j8084N158J4117K5888K6129o445n5667j2995L1466K0305j5690j8909
13426H7271q851Q640j1426l3599N165J1825K1911J117P865j0957J9740M5154l3187
13413A10668m5285j0202K2857J3959r751Q879L977l4289k6293J6598Q475M510
13401F4103K6697J3760q197j7659j0810k5245k1562m844K4799J8620j7501O066
13389D8227K7077J1990M594j6508q771l415J4068K6149J8153o775m681k8216r288
13376G2604K6387o404L972p820l22j8834k108M605k1200K084K4636q83Q311R56
13362H5984K4597J6070J705L071j8062k2681J6518o538j5141J2756J2690J5602
$$ plain form
13450 111026 95353 92684 85169 74841 54982 72760 96117 96536 85783 101934 120751 91998
13438 91998 73914 79072 93189 119077 145206 138761 83094 70099 101565 121870 106180 87271
13426 87271 78420 87060 75634 42035 47200 59025 80936 82053 89918 78961 98701 143855 110668
13413 110668 65383 55181 78038 91997 82246 91125 95102 60813 34520 51118 59593 64103
13401 64103 90800 104560 96363 78704 67894 42649 21087 16243 41042 59662 42161 48227
13389 48227 75304 87294 91888 75380 66609 63194 77262 103411 121564 114789 110108 81892 72604
13376 72604 98991 92587 96559 88739 88417 69583 67475 72080 50880 52964 77600 76717 85028 85984
13362 85984 110581 126651 128356 131427 113365 90684 107202 100664 85523 98279 110969 126571
13350A26571j578k0329k4260J2240K3041P599K74K1245l6758j9860l5400N880
13338E8665K8515m79J578N284M694J1222J9467j7352k6343o124J7236J3674k0759
13325H9278o755J1271q65J3558l677j6814J0644p70j0349m112J1067Q174Q517
13312A09167j935k416n372m751j3016j0951J5536P945l048j374K5384P44n960
13299A09953q561K059n308k015J8601k5206k8650p181N940M3p941q315P521K1151
13285G2091J1701q605j7664R31l676p253J1381K2770R876o77N692L3638J9259
13272A49464k5440j0091j913J4151L270O915N315l2254N912J0297K011P376P292
13259A42305j5503m3574k8540m002K628K9861J6262j176K2585Q28r579J3047L84
$$ plain form
13350 126571 124993 104664 80404 92644 115685 123284 123558 144803 108045 88185 52785 58665
13338 58665 87180 86701 88279 93563 98257 109479 128946 111594 85251 79127 96363 110037 89278
13325 89278 82523 93794 92929 106487 102810 85996 96640 95870 85521 81409 92476 100650 109167
13312 109167 107232 104816 99444 94693 81677 70726 86262 94207 91159 89785 115169 115913 109953
13299 109953 101392 103451 98143 96128 114729 89523 60873 53692 59632 59675 51734 43419 50940 72091
13285 72091 83792 75187 57523 58454 54778 47525 58906 81676 91552 90875 96567 130205 149464
13272 149464 124024 113933 112020 126171 129441 136356 141671 109417 115329 125626 127637 135013 142305
13259 142305 126802 83228 54688 50686 53314 83175 99437 98261 120846 121674 112095 125142 125526
13246A25526j3335n595J10j8827j1576k317P771J1139R202j8364j114J7458j1236
13233H8842k1783J2730J5331Q112L3325K803l9917r248J5379k7995M137J3415
13221I5131J1460j0571j5602P724p16l721J1384J7798K5365J1417l7805k2840
13209H9024L178K6032j7288j764M803K0326K1521M151l4199k2801N536J0281j0223
13196I8577J1242L7246J4268l505K219J4482J8833j2762m6877n6088j217J9440
13184I5858P997j2642N695J9733k3288j3520J6082J4628M981K0468n796k7798
13172A02398j1274o533j174k520K0873J8137j2271Q014L3998j4907k5310J600
13160A11031J4739j1477r219L6593K4401j6827k0995N124K4986j0293l1191j9063
$$ plain form
13246 125526 112191 106596 106706 87879 76303 73986 81757 92896 102098 83734 82620 100078 88842
13233 88842 67059 79789 95120 103232 136557 139360 99443 90195 105574 77579 81716 95131
13221 95131 106591 96020 80418 88142 87426 83705 95089 112887 138252 149669 111864 89024
13209 89024 92202 118234 100946 99182 103985 124311 145832 149983 115784 92983 98519 108800 98577
13196 98577 109819 147065 161333 157828 160047 174529 193362 180600 133723 77635 76418 95858
13184 95858 103855 91213 96908 116641 93353 79833 95915 110543 115524 135992 130196 102398
13172 102398 91124 84591 83417 80897 101770 119907 107636 115650 149648 134741 109431 111031
13160 111031 125770 114293 105074 141667 166068 149241 128246 133370 158356 148063 116872 97809
13148I7809P983M033J6580j2608q756J4607J3848j6916k5568K777R866n572j1370
13135H6713K1721O436Q733j6266l1276L4550J0859k1701O210J1647j2642k004
13123A02980m200o350j6894J9679K4725J5325j4017k3944K102O549K1246L91j0319
13110A17273q004K317J248O717M175l178j2406J2127J6878P11L582k3193J4896
13097A33143K6771l2102l1971K6581L331o886o526J2279J5714N972q104l741k4686
13084A09775k5789O905m603o696J1775Q928Q259L3109l34k8879j3253K259l506
13071I7950J9531m30J830n577M792R914q127j897K7976J0990L243O899M0612J3910
13057B21616K247k6239k5752J383p093l7347k4425P086J8208m361K0755O31j2030
$$ plain form
13148 97809 105792 109825 126405 113797 105041 119648 133496 116580 91012 93789 103655 98083 86713
13135 86713 108434 114870 123603 107337 76061 110611 121470 99769 105979 117626 104984 102980
13123 102980 98780 92430 75536 95215 119940 135265 121248 97304 99406 105955 127201 127592 117273
13110 117273 109269 111586 112834 119551 123726 120548 108142 120269 137147 137858 141440 118247 133143
13097 133143 159914 127812 95841 122422 125753 118867 112341 124620 140334 146306 138202 134461 109775
13084 109775 83986 90891 86288 79592 91367 100295 108554 141663 141329 112450 99197 101456 97950
13071 97950 117481 117051 118881 113304 118096 128010 119883 117986 145962 156952 160195 167094 207706 221616
13057 221616 223863 197624 171872 173255 166162 128815 104390 111476 129684 125323 146078 146709 134679
13044A34679k9948r033J627J6364P984k8398o540L659K5308L2743j2329j0653
13032A25463p685l437K6612K7520j2262l0287k3487q811L9355L0884K4191j0078
13020A77978k1681J5747J61J430M3112P6178P6962L6491L8020j0358o8385q0303
13008B85352o6405k950j5364k8672o903r943o682j3068r819J1855J9171j4260
12996A42312k2388o161J901p340J2558K4262k5042k9043l229J0120Q801K2981
12984A29732R728j7324K118M1552L989m824Q738K4392q035R887P678l2316O090
12971A81405O4006O5669P8701N7359M0948J0249m6594p0236p3719l6171k9357
12960B42260l5042k1283j2199N256N08J7626j0170j7514j165J3410o294l259l626
$$ plain form
13044 134679 104731 95698 97325 113689 121673 93275 86735 90394 115702 148445 136116 125463
13032 125463 117778 114341 140953 168473 156211 125924 102437 93626 132981 163865 188056 177978
13020 177978 156297 172044 172205 173635 216747 292925 369887 406378 444398 434040 365655 285352
13008 285352 218947 215997 200633 171961 165058 155115 148433 135365 125546 137401 156572 142312
12996 142312 119924 113763 115664 108324 120882 145144 120102 91059 87830 97950 106751 129732
12984 129732 139460 122136 124254 165806 169795 164971 173709 198101 190066 199953 207631 175315 181405
12971 181405 245411 311080 389781 447140 488088 498337 451743 381507 307788 271617 242260
12960 242260 207218 185935 173736 178992 179500 197126 186956 169442 168277 181687 175393 172134 168508
12947A68508K103j9396j1878J1816J0776k7478k883k809k955L3859K0350j9055
12935A60958k8973R970J0721J1211r469j339l030j4497J332M3107L7018J8297
12923B35306J5491J1332J050k2041L705k8499n9529k5925j058K0589P244o504
12911A51161L331R003n857k2073R842j033k8048m07N518J0441N01J1263J3247
12898A56889Q1J4412j5880l3823M137K1608L1651L152k9471k1270J6940R714j3873
12885A44267k578j8192j0470J4803J4817r371J4027j055l1640j8404m148M286
12873I6342O870P864O239l589K7533L3206J8453n954j4774O842p300r635k434
12860A59663j319p526n358k633L4097j0880q207n780J9393K5560j3630k5870j9992
$$ plain form
12947 168508 170611 151215 139337 151153 161929 134451 131568 128759 125804 159663 180013 160958
12935 160958 131985 141955 152676 163887 154418 153079 150049 135552 136884 179991 217009 235306
12923 235306 250797 262129 263179 241138 244843 216344 156815 130890 129832 150421 157665 151161
12911 151161 154492 163495 157638 135565 145407 144374 116326 115919 121437 131878 132379 143642 156889
12898 156889 156970 171382 155502 121679 125816 147424 179075 182227 152756 131486 148426 158140 144267
12885 144267 141689 123497 113027 127830 142647 133276 147303 146248 114608 96204 92056 96342
12873 96342 103212 111076 117315 113726 141259 174465 192918 186964 172190 179032 171732 162097 159663
12860 159663 158344 150818 145460 142827 176924 166044 157837 152057 171450 197010 183380 157510 137518
12847A37518L9644J6341l7273k656k109q125p487l2708J2959K7729N111o682n533
12834A36729j6414J0421J9124M870j3127j5942K45J3453j3881j0622k7572J7423
12822A04707J752j0406J0812J8378j5591j7604O549J4854j918L317J8434K2194
12810A55478p906P068O452P426m298l435k2696k0197J0201J9183k893O397O131
12797A56911K0228O013k2520k385o737k5011p031l982J4835l60J6348K0147K029
12784A68485l28j5685N074j0151M560m152J9908k97q116Q207R636j1430o147K3303
12770A82867l720j9738J7531L329o201j8773q931O236J3540j0592O746K48j8238
12757A44304j3030m365J1678J6483m748L562J2091j2759m210P795j5060J5264
$$ plain form
12847 137518 177162 193503 156230 153574 151465 143340 135853 103145 116104 143833 148944 142262 136729
12834 136729 120315 130736 149860 154730 141603 125661 125906 139359 125478 114856 87284 104707
12822 104707 106459 96053 106865 125243 109652 92048 98597 113451 111533 114850 133284 155478
12810 155478 147572 154640 161092 168518 164220 160785 138089 117892 128093 147276 144383 150780 156911
12797 156911 177139 183152 160632 158247 151510 126499 119468 115486 130321 129961 146309 166456 168485
12784 168485 168157 152472 157546 147395 151955 147803 167711 167414 159298 167505 177141 165711 159564 182867
12770 182867 179147 159409 176940 180269 174068 155295 146364 152600 166140 155548 162294 162542 144304
12757 144304 131274 126909 138587 155070 150322 153884 165975 153216 149006 156801 141741 157005
12745A57005L4175n480J1297m92p732k3878J0387J0510k3288l0067l960J8815
12733A47292L3670N404j0736J819J2535j6163k4527R932K396j935j7450j2219
12721A30018J6722l158q966M668j4178o889J1961J9780k899j4506K3360P27m650
12708A51990j3199q942p078j0756J0050R025o36o805L577L152P615L1091q817
12695A60267k4852K7128K6676N018k1204k6930r652o242J7434J8282l360M331
12683A66896P639j3421k2349J1432J441l167J4669n784N346J2395j2496j6467
12671A46134j2366q116K8201N071k9748j4021M312j897J7662J8779K1181o063
12659A69129j6837k66J5271L990K072l039j9247M768J3466k171J7049n438q038
$$ plain form
12745 157005 191180 185700 196997 196505 188773 164895 175282 185792 162504 132437 128477 147292
12733 147292 180962 186366 175630 177449 189984 173821 149294 159226 161622 159687 142237 130018
12721 130018 146740 143582 134616 139284 125106 118217 130178 149958 147059 132553 155913 156640 151990
12708 151990 138791 129849 122771 112015 122065 131090 130454 123649 127226 130378 137993 169084 160267
12695 160267 135415 162543 189219 194237 173033 146103 136451 130209 147643 165925 162565 166896
12683 166896 174535 161114 138765 150197 151638 148471 163140 157356 162702 175097 162601 146134
12671 146134 133768 125652 153853 158924 129176 115155 119467 117570 135232 154011 175192 169129
12659 169129 152292 152026 167297 171287 173359 170320 151073 155841 169307 167136 184185 178747 170709
12646A70709n061q287J9712J9206j0805j507N819J9801o367j4487j6730R93l999
12633A68997j3676J6987p293m375L715P713j3615j5835K4325j2775l0263p648
12621A16257j0918J3222O216l672K5256J9674j4152J1658k1163J5538R015J785
12609A68716j2528j2936k0925j7176L931L5616K2562p686J2225N34j682l674N353
12596A72330M877J337P213j3020j9324J3421P510J3984J469j2338k1672j358O712
12583A61141J3862K2116N818l3639k588l06L456o342p619j130j1235j8937n526
12570A19071j4204J7609K2686K0580j314J641n936r075k50O060j1539j606l35
12557A43388J0171P432J8148j8676o610N702n406J3056j0759k1655M093J3294
$$ plain form
12646 170709 165648 157361 177073 196279 185474 183967 189786 209587 203220 188733 172003 172996 168997
12633 168997 155321 172308 165015 160640 164355 172068 158453 142618 166943 154168 123905 116257
12621 116257 105339 118561 124777 121105 146361 166035 151883 163541 142378 157916 166931 168716
12609 168716 156188 143252 122327 105151 109082 144698 167260 159574 171799 172333 170651 166977 172330
12596 172330 177207 178544 185757 172737 153413 166834 174344 188328 189797 177459 155787 154429 161141
12583 161141 175003 197119 202937 169298 166710 166404 169860 163518 155899 154769 143534 124597 119071
12570 119071 104867 122476 145162 165742 164428 166069 160133 151058 150808 156868 145329 143723 143388
12557 143388 153559 160991 179139 160463 153853 159555 154149 167205 156446 134791 138884 152178
12545A52178J605J4074K9423j650o430k3152k5814j5242O343J8905P121M283L537
12532A65181k3006J0222n4k611K57J6674K0197L337P891k5644Q33J9270r445N804
12518A88906k0848J119J9276m05l9730j0966L0367K7713L031O580j7299j4461
12506A73283k0702l8686L1220J6825j2085n373R938p333K7554R355k6855j4830
12494A42311K1569l091K981K528Q48M915q72J2149j2530l458k153k3514L640m487
12480A40836Q535J9578j0386j9648k406J5311j3242M295K3854n508j0150j5825
12468A35244k3368O071K0100J6154J632K6936r470j6708J0413P518J4901J803
12456A91226j3256j4686k8246N695K2060M759J839P285J1185K5644r622k9615
$$ plain form
12545 152178 153783 167857 197280 195630 189200 166048 140234 124992 131335 150240 157361 161644 165181
12532 165181 142175 152397 152343 149732 149989 166663 186860 190197 198088 172444 173277 192547 183102 188906
12518 188906 168058 169177 188453 188048 148318 137352 167719 195432 198463 205043 187744 173283
12506 173283 152581 113895 145115 161940 149855 144482 154420 147087 174641 183996 157141 142311
12494 142311 163880 160789 163770 166298 167146 172061 171189 183338 170808 167350 165197 141683 145323 140836
12480 140836 149371 168949 158563 138915 136509 151820 138578 142873 166727 161219 151069 135244
12468 135244 111876 117947 138047 154201 155833 182769 173299 156591 167004 174522 189423 191226
12456 191226 177970 163284 135038 140733 162793 167552 169391 176676 187861 213505 203883 174268
12444A74268J8525n153l7392j3839J0460K2205N273J9487K1483j3783m753l8466
12432A58315k3498K3472J4705l7139l0923M1939J2230N619M301k2393q131j1532
12420A26965J2695J3206j6240l3010L831Q743M1499K9586j4752j2003n299l091
12408A52130l3089r53K6450J3940l016J9970r65m8J291j5734l0338o092L6300
12395A59846L8828K041q891m180j0101J5881L0727o716k4411k1603o63J3447K8957
12382B13162J7820l2747l3637j0404M199L10J7909J5869q34p042j3969q8p100
12369A63448j1498j8647R383J2656J8068K543j6803J3739J5831n87N989O828J8269
12356B19219j1084n320j0348l356p751l1546j5545K917j345k5975m2470L395M3195
$$ plain form
12444 174268 192793 187640 150248 136409 146869 169074 174347 193834 215317 201534 196781 158315
12432 158315 134817 158289 172994 135855 104932 146871 159101 164720 169021 146628 138497 126965
12420 126965 139660 152866 136626 103616 107447 116190 157689 187275 172523 160520 155221 152130
12408 152130 119041 118088 144538 158478 155462 175432 174467 174419 175710 159976 129638 123546 159846
12395 159846 198674 200715 191824 187644 177543 193424 224151 217435 193024 171421 170758 184205 213162
12382 213162 230982 198235 164598 154194 158393 158703 176612 192481 191647 184605 170636 170548 163448
12369 163448 151950 133303 142686 155342 173410 175953 159150 172889 188720 188133 194122 200950 219219
12356 219219 208135 202815 192467 189111 181360 149814 134269 137186 135841 109866 67396 70791 113986
12343A13986L960N488J1795J1257j763n415M380k0241K0176K9111K1244j8463
12331A75515j2793K925J9792K1649n37j5449m2361j123l383j395k2113j529J0365
12318A29563J6769j5832j7985J4763R639K2808p33j4098M394j6537R876J5481
12306A58108J9330K7095J0203k1569l0448l931J1936L00j7065Q107J2836J3672
12294A88574l1667J0224l289k2308j08K5499J6496R788o14k0276J399j4647q828
12281A50243j510K9655L5165l6630k9212J4421K0726j6968j256J5730L730j2167
12269A71927k0751L371J8529P325Q854o870l0598j4699j7257J3368j09J2200P011
12256A52301K792J1884R531k8153Q007j8066k3760J743J8928J0887K912K475j9647
$$ plain form
12343 113986 117946 123434 135229 146486 144723 139308 143688 123447 143623 172734 193978 175515
12331 175515 162722 165647 185439 207088 206551 191102 148741 147618 144235 142840 120727 119198 129563
12318 129563 146332 130500 112515 127278 136917 159725 158992 144894 149288 132751 142627 158108
12306 158108 177438 204533 214736 193167 162719 158788 170724 171024 153959 162066 174902 188574
12294 188574 156907 167131 163842 141534 141426 166925 183421 193209 192595 172319 173718 159071 150243
12281 150243 148733 178388 213553 176923 147711 162132 182858 165890 164634 180364 184094 171927
12269 171927 151176 154547 173076 180401 189255 182385 151787 137088 119831 133199 133090 145290 152301
12256 152301 155093 166977 176508 148355 156362 138296 114536 116279 135207 146094 149006 151481 131834
12243A31834K9487R192j7624j9822j741k44J38k204l599L308o689P210k7219K3301
12229A25328J8653M709j1139k1621K237J39j2234J7658N19J1871L5778j8237k7165
12216A26496J3469L2581Q826l11l802o627J2373p500J2072J5456q060l2970k1244
12203A40759j0470j6026n551q653j3584K3342N468j9102J5945j8691l184J8445
12191A08698l869J0940K5814K2693p320l2572k3988J5873j4943j9731J8726K7933
12179A28254J4569M112J150n1559n008K3259q055k176J9497M050L706O353K649
12166A40801J1045j1105j1554K4185j4374m2051j2609K7196J8074P370k7104m003
12154A05871J0206J1861P050l830M593l689O305k2317r639Q40j4215M05j544J6007
$$ plain form
12243 131834 161321 170513 152889 133067 131326 131082 131220 129016 125417 128725 122036 129246 102027 125328
12229 125328 143981 148690 137551 115930 118167 118306 106072 123730 124249 136120 171898 153661 126496
12216 126496 139965 172546 181372 181061 177259 170632 183005 175505 187577 203033 194973 162003 140759
12203 140759 130289 114263 108712 100059 86475 109817 115285 96183 112128 93437 90253 108698
12191 108698 104829 115769 141583 164276 156956 124384 100396 116269 101326 81595 100321 128254
12179 128254 142823 146935 148085 96526 91518 114777 106722 104546 124043 128093 131799 138152 140801
12166 140801 151846 140741 129187 153372 138998 96947 84338 111534 129608 136978 109874 105871
12154 105871 116077 127938 134988 131158 135751 132062 138367 116050 106411 107251 93036 93441 91897 107904
12140A07904K8873R57k116M7191J5322k3330j2893m346l0282q019j0172J5336
12128A24425l90J1333J2652O823j2907k7807N076r166k848J3085J4027Q987j1324
12115A31966l1616O945P711L3142K0620k443o698n78k8682k0789j0850M0239q899
12102A30068k7039K5953K5845k1769j9014J4600J3850q797M2861j572l3297J8888
12090A60577n670L18j2169J435n225k5352j300l1278J0594K6971K1327P270k8267
12077A19231k0789j9928J8304p433o535R808K4195J2271J7572r92k3478p294m610
12064A10322P567L529j6693O900Q931N95j3525l215j5433J758J0753k416k889
12051I6184K7709K12q688J6688m870k7810m283J0329L236L626M061J8153o09M101
$$ plain form
12140 107904 136777 137734 135618 182809 198131 174801 161908 157562 127280 119261 109089 124425
12128 124425 124035 135368 148020 154843 141936 114129 119205 110039 107191 120276 134303 143290 131966
12115 131966 100350 107295 115006 148148 168768 166325 159627 159049 130367 109578 98728 138967 130068
12102 130068 103029 128982 154827 133058 114044 128644 142494 133697 176558 174986 141689 160577
12090 160577 154907 155225 143056 144491 139266 113914 112614 81336 91930 118901 140228 147498 119231
12077 119231 98442 78514 96818 89385 82850 92658 116853 129124 146696 145704 122226 114932 110322
12064 110322 117889 121418 104725 111625 120556 121151 107626 104411 88978 90736 101489 99073 96184
12051 96184 123893 124105 115417 132105 127235 99425 95142 105471 108707 112333 116394 134547 133938 138039
12037A38039K2472J4339l9802l2891k0815l3225J0877J7714K5387j169q845O055
12025I8136l1241K1599j312r07q491j7815K2223J9196n478k4215J132J8737J2435
12012A03999J8039R690J5279J521j7629j4667P388N528k198m0584L80K6701L2677
11999A46124K4048l235k0736J96j3240o957q445j8112L485k213M301n657j4990
11986H4569j7161p463k033L0551L0351m0K347j0119L624m324j1866k175J9644
11973A15905J6776o928r181p549J5162m835k2992Q07j0125J5266J4678m247K80
11960A13017K757l117j722J875l1301j8944J000J9835J9478r453m817K2826p675
11947A03759J4833o81k2561j3663J7823L652K7656K014k8266k2403J7842K443
$$ plain form
12037 138039 160511 174850 135048 102157 81342 48117 58994 76708 102095 100926 92081 98136
12025 98136 66895 88494 87182 86275 77784 59969 82192 101388 95910 71695 72827 91564 103999
12012 103999 122038 131728 147007 148528 130899 116232 123620 129148 126950 86366 86746 113447 146124
11999 146124 170172 166937 146201 146397 133157 126200 117755 99643 103128 100915 105216 99559 84569
11986 84569 67408 59945 57912 88463 118814 118774 121121 111002 114626 110302 98436 96261 115905
11973 115905 132681 125753 116572 109023 124185 119350 96358 97165 87040 102306 116984 112737 113017
11960 113017 115774 112657 110935 112810 81509 62565 63565 83400 102878 93425 88608 111434 103759
11947 103759 118592 117911 95350 81687 99510 103162 130818 132832 104566 82163 100005 102448
11935A02448l56Q42K0125J5503j9330k7507q073k5456P550L0061J7512K6302K2693
11922A62314k9452r556r034Q631j4070j9936j9125l519L821r761J2897K7074p026
11909I3258j7334m875J1372k0390l7415L677L8207L4739L7012J0006r250k3418
11897A15589l54L5939o97j1484j0067l0155l1284m3264K5422K2639J8988K599
11885I3871K792r309O388L376n190J587M661N111n870J8287J2535l4813k9925
11872F3501q387k0508N788J2589j2540k0322J6029N614M2560J6936j487k7957
11860G1816M944J1529K7868j7135m2369L552O652l798j3234P454K6142j9448M448
11847F8421K1215K4194j3545p611J5395o288k4456J2996Q064J0574j3929k921
$$ plain form
11935 102448 102092 102934 123059 138562 119232 91725 83652 58196 65746 95807 113319 139621 162314
11922 162314 132862 123306 114272 122903 108833 88897 69772 66253 70074 60313 73210 100284 93258
11909 93258 75924 71049 82421 62031 24616 28293 66500 101239 138251 148257 139007 115589
11897 115589 115235 151174 150477 138993 128926 98771 67487 24223 49645 72284 91272 93871
11885 93871 96663 87354 93742 97118 91928 93515 98176 103287 97417 115704 128239 93426 63501
11872 63501 55114 34606 40394 52983 40443 20121 36150 41764 84324 101260 99773 71816
11860 71816 76760 88289 116157 99022 56653 60205 66857 63059 49825 57279 83421 63973 68421
11847 68421 89636 113830 100285 92674 108069 101781 77325 90321 98385 108959 95030 92109
11835I2109k3417j5360J8583K3460l535j4986p451L873P077j6624l2291K7183
11823E8621K2718Q34K513n80J988j9035j5000J632L0880R709k2378j4241j8881
11810C8780p09J6804J9216j2237j8409J4298p131j7526n357J4007n087j3593J5586
11797C8642R068j7282J5833j4955K3800K9918J926O354k2437j0959P970Q713j6102
11784F0489l037j7697m164J797J0927J5385j8276o150o900j0369J8394Q42j0676
11771C0565K4762O902j2997J9058K0760k7053l0373l620J0923M640j4043J3073
11759D2597P042m5084N441K2256n43K557p224J2988K1878P84N096R069j6385j9000
11745D1472j935L2694n816m5456p182L1140j8335j4177L9371K3352K542q320j5080
$$ plain form
11835 92109 68692 53332 71915 95375 91840 76854 69403 73276 80353 63729 31438 58621
11823 58621 81339 82173 84686 84106 86094 67059 52059 53691 84571 94280 71902 57661 38780
11810 38780 38071 54875 74091 61854 43445 57743 50612 33086 27729 41736 36649 23056 38642
11797 38642 47710 30428 46261 31306 55106 85024 86950 93304 70867 59908 67878 76591 60489
11784 60489 57452 39755 35591 37388 48315 63700 45424 39274 32374 22005 40399 41241 30565
11771 30565 55327 62229 49232 68290 89050 61997 31624 28004 38927 43567 29524 42597
11759 42597 49639 4555 9996 32252 31709 34266 27042 40030 61908 62692 67788 76857 60472 41472
11745 41472 39537 72231 66415 20959 13777 44917 26582 12405 51776 75128 77670 69350 54270
11732E4270j5570J5123J1703k285k5297J6247K1429R612n606n709l1010j4378
11720B8529j2026K157R351j3649K675J1671j1841o231O603Q501M174k0468j0832
11707a386n728J6747L9590K8777p170K394M40j0532O07j7821J741J1114m329j3912
11693D0532k1969R957j9546o15J6157J6249r289M721J3146j2358j4524n7690O238
11680b8991M6063O639J281R730j8558j9630l70K574J921J0862J3290J0297l049
11667C2059p165J5482O063o966P676N694j2596m592k4656M661j896o115K0111
11654B7760j7020R777M282q754j4920p863O963n003j3149L6290J6383m612k196
11641B7938j1927l956K6074l331o484k3917J666o063K0342r100j7277J7599L202
$$ plain form
11732 54270 38700 53823 65526 63241 37944 54191 75620 85232 79626 73917 42907 28529
11720 28529 16503 18660 28011 14362 17037 28708 16867 10636 17239 25740 29914 9446 -1386
11707 -1386 -7114 9633 49223 78000 70830 73224 73664 63132 63739 45918 47659 58773 54444 40532
11693 40532 18563 28520 8974 8359 24516 40765 31476 36197 49343 36985 22461 -35229 -28991
11680 -28991 17072 23711 24992 34722 16164 -3466 -3836 -1262 659 11521 24811 35108 32059
11667 32059 24894 40376 46439 39473 47149 52843 40247 35655 10999 15660 13764 7649 27760
11654 27760 10740 20517 24799 16045 1125 -6738 225 -4778 -17927 18363 34746 30134 27938
11641 27938 16011 12055 38129 34798 28314 4397 6063 0 20342 11242 -6035 11564 14766
11628A4766j8080J722L5259L851j7463j1584L714q400k9710N884J5362K565m635
11615f749n493J0668J8861l122O62M211J5086k0755j5696K2809J1932O535J3665
11602E2614K2573j2926j7808k0478m204k7831o609j0690K1344k626j79L3377L2024
11589E8581N459p149J2281k3646l9859j1142l174J2973J0884P197O292j0917r910
11576G870J1340K4693N548J5247q483j5324j0468k0385L030P182J1352l2191l3470
11563c4059Q435k641o376P338J1205J853p675R242k8149J3150K7017J9881n449
11550A3772k0837J799j5131m5638k073K4830J9195J6634k8028j3205K4111L5543
11538A0972J6777J857p179l632k5199J7533J7307k3933j871J6365M045j031j8683
$$ plain form
11628 14766 -3314 -1592 33667 37518 20055 8471 12185 3785 -25925 -20041 -4679 -2114 -6749
11615 -6749 -12242 -1574 17287 14165 14827 19038 34124 13369 -2327 20482 32414 38949 52614
11602 52614 75187 62261 44453 23975 19771 -8060 -14669 -25359 -4015 -6641 -6820 26557 58581
11589 58581 64040 56891 69172 45526 5667 -5475 -8649 4324 15208 22405 28697 17780 7870
11576 7870 19210 43903 49451 64698 56215 40891 30423 10038 13068 20250 31602 -589 -34059
11563 -34059 -25624 -28265 -34641 -27303 -16098 -14245 -21920 -12678 -40827 -27677 -660 19221 13772
11550 13772 -7065 -5266 -20397 -66035 -68108 -43278 -24083 -7449 -35477 -48682 -24571 10972
11538 10972 27749 29606 22427 18795 -6404 11129 28436 4503 2632 18997 23042 22011 3328
11525C328J774j0870j6935k285j8193J2775J195J3702J6435J0170k0834j4955
11513b4693j1877R313L606J9036J1529J2686N461k4759J0018J2322l594p01k7861
11500i514l2875j6993K4342q896L359o95R874K6051l2164m0662K821K9459J3670
11487c2223J3026j7989j6137j4862K3691J1402J7539M020j398K737o125J510Q592
11474f217j4646P920J0048l026j4757j4335N299K0126J4607o192J940j4096J4630
11461A301j1153l3353n401M937j3819k4355K8287J6376k7573o441J8142r669J3634
11448d9087o532j9684q489K3502M542K1050K0676Q388k216K828j4107K113j327
11435a8343p489k9362j2900k424R021L2242J6258J280l022k1432j2712k0108J2929
$$ plain form
11525 3328 5102 -5768 -22703 -24988 -43181 -30406 -29211 -15509 926 11096 -9738 -24693
11513 -24693 -36570 -27257 -23651 -4615 6914 19600 25061 302 10320 22642 19048 18347 -9514
11500 -9514 -42389 -59382 -35040 -43936 -40577 -41272 -31398 -5347 -37511 -78173 -75352 -45893 -32223
11487 -32223 -19197 -37186 -53323 -68185 -44494 -33092 -15553 -11533 -12931 -10194 -16319 -14809 -6217
11474 -6217 -20863 -12943 -2895 -5921 -20678 -35013 -29714 -9588 5019 -1173 767 -13329 1301
11461 1301 -9852 -43205 -48606 -43669 -57488 -81843 -53556 -37180 -64753 -71194 -53052 -62721 -49087
11448 -49087 -55619 -75303 -83792 -60290 -55748 -34698 -14022 -5634 -7850 -5022 -19129 -17016 -18343
11435 -18343 -25832 -55194 -68094 -70518 -61497 -29255 -12997 -11717 -14739 -36171 -48883 -68991 -56062
11422e6062L8318j0196j5062k9805J0714N049Q490J5340J8773R205m675l5097
11410d5008j315n503k2425m2883J2019L1942r545J0241K2575j2611m403J557O926
11397e8433K525L9521J1644L319k1898n290J995L058k0343j1863J1870J1092K56
11384c2547K4683j0081j6058J0536k0000Qj427j1890J7193r635l6509q568L8344
11371e5951K9761q495j8791j997j1730r583L514o120j9119K4282L5124N204J3582
11358b0319J0479m0686n2602M829M5663j266j0115j2341O449J6669N630K3218
11346b4392Q354j4482k583j3455j3006o844J7959J4257J8891J5901m1489o6573
11334a07462j8842M3K9764M6168R537l0223j1625L342L949l2428J5421o007R120
$$ plain form
11422 -56062 -17744 -27940 -43002 -72807 -62093 -57044 -48554 -33214 -14441 -5236 -9911 -45008
11410 -45008 -46323 -51826 -74251 -117134 -105115 -73173 -82718 -72477 -49902 -62513 -66916 -65359 -58433
11397 -58433 -55908 -16387 -4743 -1424 -23322 -28612 -26617 -23559 -43902 -55765 -43895 -32803 -32547
11384 -32547 -7864 -17945 -34003 -23467 -43467 -43459 -44886 -56776 -39583 -49218 -85727 -94295 -55951
11371 -55951 -26190 -34685 -53476 -55473 -67203 -76786 -73272 -79392 -98511 -74229 -39105 -33901 -20319
11358 -20319 -9840 -50526 -103128 -98299 -52636 -53902 -64017 -76358 -69909 -53240 -47610 -24392
11346 -24392 -16038 -30520 -33103 -46558 -59564 -66408 -48449 -34192 -15301 600 -40889 -107462
11334 -107462 -126304 -126261 -96497 -50329 -40792 -71015 -82640 -79298 -75349 -107777 -92356 -98363 -89243
11321h9243J2276J4594L3320K0543m76l6672n324J4867j0322k2979r197r980k1650
11308a10243N046K2965J8439l85n366m780j7871K3249K6009J1395k6505j9197
11296g7244J1529r620l629O83P493k1058k208M0024M428k5772k0647R17k642n863
11282a03609k081K2700j0518M479j3494n872M048L017O466l709N132J2620K2528
11269e8293p85J3777m619J623M79k92o620k4549O327r027l407n303k1206k8621
11255a40516J2429J7501L415J5356J0610j6786k4026l006j3823R214k345J887
11243a30090l133P973m37m162K0346K8020O713M166j5343k817J6692m511r486
11230h6069o299j8888K3555o302M229J3093l5075l9196k393L6217K5837l13o305
$$ plain form
11321 -89243 -76967 -62373 -29053 -8510 -8986 -45658 -50982 -36115 -46437 -69416 -78613 -88593 -110243
11308 -110243 -105197 -82232 -63793 -64178 -69544 -74324 -92195 -68946 -42937 -31542 -58047 -77244
11296 -77244 -65715 -75335 -78964 -78281 -70788 -91846 -94054 -54030 -49602 -75374 -96021 -95104 -97746 -103609
11282 -103609 -105690 -82990 -93508 -89029 -102523 -108395 -104347 -101330 -94864 -98573 -93441 -80821 -58293
11269 -58293 -59078 -45301 -49920 -48297 -47818 -48110 -54730 -79279 -72952 -81979 -85386 -90689 -111895 -140516
11255 -140516 -128087 -110586 -107171 -91815 -81205 -97991 -122017 -125023 -138846 -129632 -131977 -130090
11243 -130090 -133223 -125250 -125687 -129849 -109503 -81483 -74770 -70604 -85947 -88764 -72072 -76583 -86069
11230 -86069 -92368 -111256 -87701 -94003 -89774 -76681 -111756 -150952 -153345 -117128 -91291 -91604 -97909
11217i7909K422p65R807r123o134O197J4633k7704k617L1487J394j2124k2647
11204a13083j8791Q655J9615j248j3276k43P180o117j3872j588M123l64n615J2033
11190a22591K8262K730j08p986n49J5469J955J1262j0569k4425j1747J1551J7889
11177h8857k5752j3675k458n732n315j3867K7358J8142j7991j3345L947J2891
11165a24654K1370k090k3374J5513j0029j9393o674J2258J1004L766r3j1865j8499
11152a52760J3104Q25j2996p344j615J178p704J261l87K5428j4909k1694m122
11139a81735J1720R598J2846n255Q719j7345J189P663R867O606k87J9227J9961
11126i7226P237m170j8185j5359m375o734J2436r224o656J812J2603K225j7390
$$ plain form
11217 -97909 -95487 -96252 -86445 -95568 -101702 -95505 -80872 -108576 -111193 -79706 -78312 -90436 -113083
11204 -113083 -131874 -123219 -103604 -104852 -118128 -118371 -111191 -117308 -131180 -132768 -128645 -129009 -134624 -122591
11190 -122591 -94329 -91599 -91707 -99693 -100242 -84773 -82818 -71556 -82125 -106550 -118297 -106746 -88857
11177 -88857 -114609 -128284 -130742 -136474 -141789 -155656 -128298 -110156 -128147 -141492 -137545 -124654
11165 -124654 -103284 -105374 -128748 -113235 -123264 -142657 -149331 -137073 -126069 -122303 -122396 -134261 -152760
11152 -152760 -139656 -138831 -151827 -159171 -160786 -159608 -167312 -166051 -166438 -141010 -155919 -177613 -181735
11139 -181735 -170015 -160417 -147571 -152826 -144107 -161452 -160263 -152600 -142733 -136127 -136414 -117187 -97226
11126 -97226 -89989 -94159 -112344 -127703 -132078 -138812 -126376 -135600 -142256 -140444 -127841 -125616 -143006
11113a43006L956p93p239K6887p367m3456n929j0616J5257M461k26J015J6163
11100a50893L1168j2129j1011m925k954K405j7372j2339N738K446R855J7299R556
11087a33156j2043p414j6580N613J6456O526k9922n108K2096J1052l751J1365
11075a34866j1886j2200R604O571j7302J4146M520j1265k3939L7147L1012l0401
11063a38859k8072K3293J426m413J0579q462m3622k0541J4491L4208K1405J8489
11051a20078j5826q601J1289L0332p625P561K1518N931N234p116j3588k1987J3623
11038i9333R439P085J2859J8422P665K3901M1400K3182p456j3637m3205k5152
11026d4830J1158O116L3041L4803L1109K1641K6903R65k3365l1769m9995l2670
$$ plain form
11113 -143006 -139050 -139843 -147082 -120195 -127562 -171018 -176947 -187563 -172306 -167845 -168071 -167056 -150893
11100 -150893 -119725 -131854 -142865 -147790 -150744 -148339 -165711 -178050 -172312 -169866 -160011 -142712 -133156
11087 -133156 -145199 -152613 -169193 -163580 -147124 -140598 -170520 -175628 -153532 -142480 -146231 -134866
11075 -134866 -146752 -158952 -149348 -142777 -160079 -145933 -141413 -152678 -176617 -139470 -108458 -138859
11063 -138859 -166931 -143638 -142212 -146625 -136046 -144508 -188130 -208671 -194180 -159972 -138567 -120078
11051 -120078 -135904 -144505 -133216 -102884 -110509 -102948 -81430 -75499 -70265 -77381 -90969 -112956 -99333
11038 -99333 -89894 -82809 -69950 -51528 -43863 -19962 21438 44620 37164 23527 -19678 -44830
11026 -44830 -33672 -27556 5485 40288 71397 93038 119941 120906 97541 65772 15777 -16893
11014a6893k3378O259J6628O033M038l037J7092L2993j9971k4414n1455o5247
11002a21352j4381L5555M1587m938q923j411k2603l5678J373K7l3455k0775L542
10989a81432J8565K2652l4494m7709n347J834j6503N319L9920L6545J0341k0051
10977a70360k5408p693j2664k7334O590L800j7921Q884j8589q146L8251Q883N308
10964b16399K3052j993l992M717q130L7481j0042m4789j611j9306l514P866j2507
10951b49167n831r574J4144P762j3899r341j3073R673J5924M275K2306j0840k9099
10938b66740K3217P543r041J3766K0811k0601j6877k0582M586K3874M082k8304
10926b64266j0706O942J1946N60j1251N756L5934K5655j8800n511n158j4179j7477
$$ plain form
11014 -16893 -40271 -34012 -17384 -11351 -7313 -10350 6742 39735 19764 -4650 -56105 -121352
11002 -121352 -135733 -100178 -58591 -63529 -72452 -73863 -96466 -132144 -130771 -130744 -164199 -184974 -181432
10989 -181432 -162867 -140215 -174709 -222418 -227765 -225931 -242434 -237115 -197195 -160650 -150309 -170360
10977 -170360 -195768 -203461 -216125 -243459 -236869 -233069 -250990 -242106 -260695 -268841 -230590 -221707 -216399
10964 -216399 -193347 -195340 -199332 -194615 -202745 -165264 -175306 -220095 -221706 -241012 -244526 -236660 -249167
10951 -249167 -254998 -264572 -250428 -242666 -256565 -265906 -278979 -269306 -253382 -249107 -226801 -237641 -266740
10938 -266740 -243523 -235980 -245021 -231255 -210444 -231045 -247922 -268504 -263918 -240044 -235962 -264266
10926 -264266 -274972 -268030 -256084 -255524 -266775 -261019 -225085 -199430 -218230 -223741 -228899 -243078 -260555
10913b60555k1272J5445M4505R83k0105J2188J8907K061j8009k4275q697K2699
10901b36125J9900P100J6396L4381L1113R515L3227P1651M0039N7055J17279J24662
10889C26193J69077K27001L06817M42164M23424K43187r5055l38800m01346l55465
10879I47197k84537k26556j75607j06690n2455m2358o5443n3902l3696j3365n01
10868a07913p273n085J1798P402j9052l0468k7308p676P121j7774J3023J8431
10856a64774k8551k0919k5495k833N178J4476P118l5957k814J7568j5191l423
10844b55617r059j5924M831k678K115j6547o726Q666J2581K7509Q08j9373L535
10831b65879k818l0132J903K1989J279j0686o162J3158J0830L258L145l0644p992
$$ plain form
10913 -260555 -281827 -266382 -221877 -220894 -240999 -228811 -209904 -207843 -225852 -250127 -258824 -236125
10901 -236125 -216225 -209125 -192729 -158348 -127235 -117720 -84493 -12842 27197 84252 201531 326193
10889 326193 495270 722271 1029088 1471252 1894676 2137863 2042808 1704008 1302662 947197
10879 947197 662660 436104 260497 153807 101352 58994 -6449 -60351 -94047 -107412 -107913
10868 -107913 -115186 -120271 -108473 -101071 -120123 -150591 -177899 -185575 -178454 -196228 -183205 -164774
10856 -164774 -193325 -214244 -239739 -242572 -237394 -222918 -215800 -251757 -254571 -237003 -252194 -255617
10844 -255617 -264676 -280600 -275769 -278447 -276332 -292879 -299605 -290939 -278358 -250849 -250041 -269414 -265879
10831 -265879 -268697 -298829 -296926 -274937 -273658 -284344 -290506 -277348 -266518 -263260 -260115 -290759 -298751
10818b98751q694m21M25P472L867k2820M242J270j8526o866L4623r939j5265l1701
10804c61084j3431l788j3085q333j7392N159m002r94J2259L4674N705j4218j1530
10791c90060n537L953j1120j8886K7828R805K66J8648K2500n923k8681k2335M0381
10778c59161J6740l3305n3846L201R670L2284J990k3641k9418j0389N689K6132
10766d14054M8517K134k5881j1685O198j096j0434J1098J6608k1545m0890J956
10754d39074q55j4214J5942J4450J6641J6933j1931M489O51j8282k7004L907K1750
10741d16597J5899K5577J1112p796J2788R802n251J5782K1517L8685K0606L3413
10729b24463O1099N9243j768k100k1649m9599p0335m9731m0553j6082j8160l326
$$ plain form
10818 -298751 -307445 -307866 -307441 -299969 -296102 -318922 -314680 -313410 -331936 -338802 -304179 -314118 -329383 -361084
10804 -361084 -374515 -378303 -391388 -399721 -417113 -411954 -415956 -416950 -404691 -370017 -364312 -378530 -390060
10791 -390060 -395597 -391644 -402764 -421650 -393822 -384017 -383751 -365103 -342603 -348526 -377207 -399542 -359161
10778 -359161 -342421 -375726 -429572 -426371 -416701 -384417 -382427 -406068 -435486 -445875 -440186 -414054
10766 -414054 -365537 -363403 -389284 -400969 -394771 -395867 -406301 -395203 -378595 -400140 -441030 -439074
10754 -439074 -439929 -454143 -438201 -423751 -407110 -390177 -402108 -397619 -396968 -415250 -442254 -438347 -416597
10741 -416597 -400698 -375121 -364009 -371805 -359017 -349215 -354466 -338684 -317167 -278482 -257876 -224463
10729 -224463 -163364 -104121 -105889 -107989 -129638 -179237 -249572 -299303 -339856 -355938 -374098 -377424
10717c77424J2716q153j5027J722m329k1490l4385P15N908j8906m677j489Q430
10704d56389j6983l4075p155k6260J0514J5440j0577k0676r436Q534m073l625
10692e54761K675J1908J2236R112k4259j0767k5090J086J8434J469k1286R516
10680e69727o87j0662j2774k4537l3168j8264j042J8683K1086N3825J8667J6040
10668e42560J0169J3843k0093j6851k5722l5623k9603J5000j3359j5670L699M57
10656f56313j2970R079N98q116j7279P722R975L084K0723k0293k2218K1103M0419
10643f24486L045k176K8222J8037J3968L4035J9657L3634N3817N5642O2647P0344
10631b33614Q4636J08575R6250P6363P5863J14339J38785J88866K72702M11655
$$ plain form
10717 -377424 -364708 -372861 -387888 -386166 -390495 -411985 -446370 -445655 -439747 -458653 -463330 -464819 -456389
10704 -456389 -473372 -507447 -514602 -540862 -530348 -514908 -525485 -546161 -555597 -547063 -551136 -554761
10692 -554761 -552086 -540178 -527942 -518830 -543089 -553856 -578946 -577860 -559426 -557957 -579243 -569727
10680 -569727 -570414 -581076 -593850 -618387 -651555 -669819 -670861 -652178 -631092 -577267 -558600 -542560
10668 -542560 -532391 -518548 -538641 -555492 -581214 -616837 -646440 -631440 -644799 -660469 -656770 -656313
10656 -656313 -669283 -660204 -659606 -667722 -685001 -677279 -667304 -664220 -643497 -663790 -686008 -664905 -624486
10643 -624486 -621441 -623617 -595395 -577358 -563390 -529355 -509698 -476064 -422247 -366605 -303958 -233614
10631 -233614 -148978 -40403 55847 132210 208073 322412 461197 650063 922765 1334420
10621A334420N57419P81880J077308J525962K021118K542127K823925K437868
10613A5102027J340391Q0616p33757r10251n52909J87318J168871K347968L814972
10604B1845246N244271N903015M734132J623637j695538l468039l533495k490986
10596B8162243r09489Q35142K797522M918226O784489P251965M953030K19572
10588E5012700m298268o501008o376499m908381l087115j178938O53701K345079
10580C1661271L622485L712232J913109j355293m197559n401693n033885l851227
10572B1069440k501516j326205l37378M61080R09329Q24430o212j268818k334915
10563A5489235k701630k509075k071086j600026j196739r02274o69857m84035
$$ plain form
10621 1334420 1891839 2673719 3751027 5276989 7298107 9840234 12664159 15102027
10613 15102027 16442418 16523034 15789277 14879026 14326117 14513435 15682306 18030274 21845246
10604 21845246 27089517 32992532 37726664 39350301 37654763 34186724 30653229 28162243
10596 28162243 27252754 28087896 30885418 35803644 42588133 49840098 54793128 55012700
10588 55012700 50714432 44213424 37836925 32928544 29841429 28662491 29316192 31661271
10580 31661271 35283756 38995988 40909097 39553804 35356245 29954552 24920667 21069440
10572 21069440 18567924 17241719 16904341 17365421 18274750 19099180 19092968 17824150 15489235
10563 15489235 12787605 10278530 8207444 6607418 5410679 4508405 3838548 3354513
10555C354513m00592l50308k92892k39091j83837j83148j29761j27474j11494
10546A335916j09435j05398p5329p2049m4336j1410o121l0688j8872l2654m3401
10535G86223k1809j7238n388O998j2354j7545K2608M7131K4984J6741M8352K2777
10523I01480J4486K1592J5273N3604L8963M6535L5827L8674P0869O8436R3463
10512A399202J07315J41744J78836K05465L02800L88273M38105M46654L54002
10503C962396K85642L35753N03304O69455R24395J083571R74015O17936M08423
10494I764890M73589P29093J084409J435469J835128K306415K909128L751173
10486B4289294M855264O273816Q258581J1005500J5076373K1216489L0518894
$$ plain form
10555 3354513 2953921 2603613 2310721 2071630 1887793 1704645 1574884 1447410 1335916
10546 1335916 1226481 1121083 1045754 973705 929369 917959 911838 881150 862278 829624 786223
10535 786223 764414 747176 741788 748786 736432 718887 741495 788626 813610 830351 878703 901480
10523 901480 915966 937558 952831 1006435 1045398 1091933 1127760 1166434 1237303 1305739 1399202
10512 1399202 1506517 1648261 1827097 2032562 2335362 2723635 3161740 3608394 3962396
10503 3962396 4248038 4583791 5087095 5756550 6680945 7764516 8738531 9356467 9764890
10494 9764890 10238479 10967572 12051981 13487450 15322578 17628993 20538121 24289294
10486 24289294 29144558 35418374 43676955 54682455 69758828 90975317 121494211
10479A21494211M4552554O4043060Q5973599R8857443P5855300k701996p4440645
10472D13633526r5788730q0346085n7972685m0696199k8811851k0803628j5391381
10465G3822967j1732336r255664p413477n953618m841241l951051l272920k683537
10457B4719123k186899j807281j478326j143541p92861n56137m80048p66268j110160
10448A4397602j193889j106444r23542p44423o22848n25865m61458m06698l81853
10439H030582l35390l19435l19382l12302k94521k52045k77879k47104k27023
10430E445501k10583j84330j60433j57513j40140j39685j15118q7419p9622j11562
10420D059096j22313p7545r6003q5848q0871j11639q7353q3270r4513p9973o6053
$$ plain form
10479 121494211 166046765 230089825 316063424 414920867 490776167 488074171 413633526
10472 413633526 317844796 237498711 179526026 138829827 110017976 89214348 73822967
10465 73822967 62090631 52834967 45421490 39467872 34626631 30675580 27402660 24719123
10457 24719123 22532224 20724943 19246617 18103076 17310215 16754078 16274030 15507762 14397602
10448 14397602 13203713 12097269 11173727 10429304 9806456 9280591 8819133 8412435 8030582
10439 8030582 7695192 7375757 7056375 6744073 6449552 6197507 5919628 5672524 5445501
10430 5445501 5234918 5050588 4890155 4732642 4592502 4452817 4337699 4250280 4170658 4059096
10420 4059096 3936783 3859238 3763235 3677387 3596516 3484877 3397524 3314254 3219741 3139768 3073715
10409C073715n9733n5331m1680m5599j9531m8178n2707n7117l8999o3879l6191
10398B554770n0813m1306l1944k2304l8682n1552o5505p9339n1592K441j2248
10387B111926k9512r591p415k3006l1927j2291N730o5462m2044m9051l7384k2066
10375A787907r783R745k4234j4018J9143K986l5669m4715l2866k3765k7098l6808
10363A570825o591K2411K4799P00O007k0851j3187j6888j3941m308J9524L5448
10351A603948M3885M7211K2546r280o7614q3095o6593n0291m2162k2894j9315
10340A356346j7069l0799l8715k7205j0922J2724j5925r912j4128l1578o6427
10329A106390l328j3795l622k268j7502J785P046k0813P981j5236k1143k5304
$$ plain form
10409 3073715 3013982 2958651 2916971 2871372 2851841 2803663 2750956 2693839 2654840 2590961 2554770
10398 2554770 2503957 2462651 2430707 2408403 2369721 2318169 2252664 2173325 2121733 2124174 2111926
10387 2111926 2082414 2072823 2065408 2042402 2010475 1998184 2003914 1938452 1896408 1847357 1809973 1787907
10375 1787907 1778124 1787869 1763635 1749617 1768760 1771746 1736077 1691362 1658496 1634731 1607633 1570825
10363 1570825 1564234 1586645 1611444 1612144 1618151 1597300 1584113 1567225 1553284 1548976 1568500 1603948
10351 1603948 1647833 1695044 1717590 1708310 1640696 1557601 1491008 1440717 1398555 1375661 1356346
10340 1356346 1339277 1308478 1269763 1242558 1231636 1244360 1228435 1218523 1204395 1172817 1106390
10329 1106390 1103062 1089267 1085645 1083377 1065875 1067660 1074706 1053893 1061874 1046638 1025495 1000191
10317A000191o5l570K2880J3714P21m0132l8166r913k950l0283j8318l437m91
10304H90181K0582J2278N714m1087j1367R92r115k312L030O480m42k1838k0848
10291H32248k8993K0164n858J944q050l4213j9553k0404k1099k0636k3257N082
10279F77375L1295L5089R765O621k5190m012n179O000J2678o064j2062P678n579
10266G28415P327K247j9974j7086J200O274J1955j6516l0484J1690k1255l7754
10254F26039k5912K671J2016J2404J5220J808o895m912R008K499k6632J855M116
10241F23285k5332j5276j9162R969j7796k6168j0514q020M753J8660J4745J1216
10229E60360R515L502M157k636l9404J2386K8662O38J2794N114j5594m461J4449
$$ plain form
10317 1000191 1000126 996556 1019436 1033150 1033871 993739 955573 945660 942710 912427 894109 890672 890181
10304 890181 910763 923041 928755 887668 876301 877293 868178 865866 868896 875376 874934 853096 832248
10291 832248 803255 823419 817561 819505 811455 777242 757689 737285 716186 695550 672293 677375
10279 677375 708670 743759 753524 760145 734955 730943 725764 731764 744442 738378 726316 733994 728415
10266 728415 735742 737989 718015 700929 702129 708403 720358 703842 673358 685048 663793 626039
10254 626039 600127 602798 614814 627218 642438 644246 637351 632439 641447 643946 617314 619169 623285
10241 623285 597953 582677 563515 573484 555688 529520 519006 510986 515739 534399 549144 560360
10229 560360 569875 573377 577534 574898 535494 547880 576542 577180 589974 595088 579494 575033 589482
10216E89482M987j2390j9834m1269j5638L2465k1021j5409j451J2992Q79J0426
10204E24219J6698J3863j1661k5499M940k2977k775k1608J8072M2406J6961N990
10192E58629o977j2351M195R344k474j1104l5487p182J7317J1755K2335m063j0776
10179E33161l076J736J1875J348q502m169k786o212n299R837L3090L5320L2322
10166F28645L5863M2124J9650l0393m4169p34R109k9008m0873J8911N4177O9993
10154G33295M2867K0032k4444o5351k7045l3350l4282L3946J2569m5979l8508
10143E73750J5787M0324K7195m142l5979l7828l9828k1417j3019q7K1836K7433
10131E54025r443r805l9623j3348K2941J072l5636l1801m1619L482l678n314J5317
$$ plain form
10216 589482 594469 582079 562245 520976 505338 537803 516782 501373 499922 512914 513793 524219
10204 524219 540917 554780 543119 517620 522560 499583 496808 475200 493272 535678 552639 558629
10192 558629 551652 539301 543496 552840 550366 539262 503775 496593 513910 525665 548000 543937 533161
10179 533161 530085 531821 543696 545044 536542 532373 529587 523375 518076 527913 561003 596323 628645
10166 628645 664508 706632 726282 695889 651720 650986 660095 631087 590214 609125 663302 733295
10154 733295 776162 796194 771750 706399 679354 646004 611722 645668 658237 612258 573750
10143 573750 589537 629861 657056 652914 616935 579107 539279 517862 504843 504756 526592 554025
10131 554025 544582 534777 495154 481806 504747 505819 470183 438382 396763 400245 396567 391253 406570
10118D06570K2096k0445j6844o856J3910K1695L661K013p888j504q378R434k705
10105D14759l60N897j7877l1474o621K0093j004k1180j0890J0541J7598J3294
10093C92776j6328K4377K779R890N282k3837l950P192K462P407l846r978Q323
10080D02549q924j0159L4303L103J6750J5725J297J4053K1156j1808M0085L6722
10068E54852N4912Q2964J34641J79894K33610L07163L82185M11240L43280J5271
10058B700012l07725m24186l57623k82570k13020j60537j00376o7791o0834o5835
10048F59515n4407k6630k9199k1154k7962l7621l9421j0131l411k037k250j9001
10036C86291Q312J0072r565j8634J0793J2423j8485k6046m921J9404p919j3971
$$ plain form
10118 406570 428666 408221 391377 384521 398431 420126 423787 425800 417912 416408 408030 417464 414759
10105 414759 414399 420296 402419 370945 364324 384417 383413 362233 351343 361884 379482 392776
10093 392776 376448 400825 403604 413494 418776 394939 390989 398181 400643 408050 404204 394226 402549
10080 402549 393625 383466 417769 420872 437622 453347 454644 468697 489853 478045 518130 554852
10068 554852 609764 692728 827369 1007263 1240873 1548036 1930221 2341461 2684741 2700012
10058 2700012 2392287 1968101 1610478 1327908 1114888 954351 853975 786184 725350 659515
10048 659515 605108 578478 549279 528125 500163 462542 423121 412990 409579 407542 405292 386291
10036 386291 394603 404675 395110 376476 387269 399692 381207 355161 350240 369644 361725 347754
10024C47754j481j2730n190k5255n198M988K845j1536j1273l149P784p459J6005
10011B96105J0709J4288k7890l9459l0256K421L1707J6819l947k8637k1669K1338
9999B41529Q526N842k115k1206P157k0738j2154J6026n825L1509L7566J5308j2723
9986B88702j0739n515J1986K7424l806L296m76l6944K753J8501K2896l6354p895
9973B73829K6985N348r368k2732R495J0972Q647k380k0655q197j0812k7506q215
9960B25411m014K0966j5429j3155L192l520K4884J7236q080R069m435r038k801
9947B40286j5894k1008M84K3734J9158j1134j4270o678L4001J1071K716o811j0383
9934B45272J5728J5602M210l9449j2338J8791j7896j0012q109j3117J5309Q018
$$ plain form
10024 347754 346273 333543 328353 303098 297900 302888 305733 294197 282924 279775 287559 280100 296105
10011 296105 306814 321102 293212 253753 223497 225918 257625 274444 270497 241860 220191 241529
9999 241529 250055 255897 253782 232576 239733 218995 206841 222867 217042 248551 286117 301425 288702
9986 288702 277963 272448 284434 311858 308052 311348 310872 273928 276681 295182 318078 281724 273829
9973 273829 300814 306162 296794 274062 283557 294529 303176 300796 280141 271944 261132 233626 225411
9960 225411 221397 242363 226934 213779 216971 213451 238335 255571 247491 256560 252125 243087 240286
9947 240286 224392 203384 203868 227602 246760 235626 221356 214678 248679 259750 262466 255655 245272
9934 245272 261000 276602 280812 241363 229025 247816 229920 219908 211799 198682 213991 222009
9922B22009K1194J8897p591j9717p810O453k553R202p819l4803L024P06J9188
9909B20380R207O924N055k1565j2917n654k6655o419O044P552K0655L0721j860
9896B31468k4058j6268J1755J4572k6382n496M478q170m86m773K8658L9640K0556
9883B65494j0410m4662L248l151k1771q121p007N279K5430K187k2424j947J1284
9870A93429j4339K779J5493k717P621n92l0936j9434N444m809J5001K1272M513
9857A92725N282L2082N060k1823n142J3422j9920j7072J0458j1465J5726o167
9845A93166j7814k733J4877J4664q441j1482o107j902K429N290j5764p269K00
9832A59114m870j7477L2719K4385L619J4040q899o013j3370N265J284J4725J5261
$$ plain form
9922 222009 243203 262100 254509 234792 226982 233435 230882 240084 232265 197462 200486 201192 220380
9909 220380 229587 236511 241566 220001 207084 201430 174775 168356 174400 181952 202607 233328 231468
9896 231468 207410 191142 202897 217469 191087 185591 190069 181899 181413 176640 205298 244938 265494
9883 265494 255084 210422 213670 210519 188748 180627 173620 178899 204329 206516 184092 182145 193429
9870 193429 179090 181869 197362 194645 202266 201674 170738 151304 156748 151939 166940 188212 192725
9857 192725 198007 230089 235149 213326 208184 221606 201686 184614 195072 183607 199333 193166
9845 193166 175352 172619 187496 202160 193719 182237 176130 174228 176657 181947 166183 158914 159114
9832 159114 154244 136767 169486 193871 197490 211530 202631 196618 183248 188513 189797 204522 219783
9819B19783l366k3795k0719K2392M910l852n079j2645p420o168r864K9220m743
9806A78654j6749j3369j2191K1151J6039o967R768n853j3407j7950J8205J1026
9794A68357j1143J991J4118k4449J9444K045m348J17k2040J0305K7962L068k1905
9781A63522K8260O814l223p645M027K785J0611n489K8444K2548J4015P404L2243
9768C04316P3789J11055J77911L17940M14338K91320n5807l12807l62478k72796
9758F86781j92593q5689m1496m7078k2407k8353m492p854l5083j7187j028J0617
9746B14138k8682l4137j5828J2653P688J3759Q97J504M861J363Q272r60r863j8346
9732A57319M745J505K91p176j1531J4439J8878l880k0418J0438k008K561j1356
$$ plain form
9819 219783 216417 192622 171903 194295 199205 195353 190274 177629 170209 164041 154177 183397 178654
9806 178654 161905 148536 136345 157496 173535 166568 176336 170483 157076 139126 157331 168357
9794 168357 157214 159205 173323 148874 168318 170363 166015 166132 144092 154397 182359 185427 163522
9781 163522 191782 198596 195373 187728 191755 194540 205151 199662 228106 250654 264669 272073 304316
9768 304316 378105 489160 667071 985011 1399349 1690669 1634862 1322055 959577 686781
9758 686781 494188 408499 367003 319925 297518 269165 264673 256819 221736 204549 203521 214138
9746 214138 185456 151319 135491 148144 155832 169591 170488 171992 176853 178216 186488 185528 175665 157319
9732 157319 162064 163569 163860 156684 145153 159592 178470 174590 154172 164610 162602 165163 153807
9719A53807k062q84q484k7090l5328J9636J5551O424q739m317J0129L3446r264
9706A42825j3127J822K2027J5671j0203k9790j6650n532J4653J7337J3398j6984
9694A35447j4053K3316M509q182N808k856k8730J2407k0730j3829J6256p934J8107
9681A19536K0504q743j5078K26j9563M647J3646J6582P457r289m339j4302L944
9668A15228J9994J0503Q64Q532n088j5779j0016r092l094K729J9613Q245j367
9655A41272j0406m012N312N704K0281M400L028L9205K2206k7375k6950l3655j8208
9642A20802Q14M549J7354K0958J3255p802j0807O172k2508o508N061J1317j7501
9629A35156p015q850k293J8405j7845K182J4603M831j5392j3021j7064p551L0124
$$ plain form
9719 153807 151745 150861 142377 115287 79959 99595 115146 121570 112831 108514 118643 152089 142825
9706 142825 129698 131520 153547 169218 159015 129225 112575 107043 121696 139033 152431 135447
9694 135447 121394 144710 149219 141037 146845 143989 115259 127666 106936 93107 109363 101429 119536
9681 119536 140040 131297 116219 116445 96882 101529 115175 131757 139214 129925 125586 111284 115228
9668 115228 135222 145725 146589 155121 150033 134254 124238 115146 112052 114781 134394 142639 141272
9655 141272 130866 126854 132166 137870 158151 162551 165579 204784 226990 199615 172665 139010 120802
9642 120802 121616 126165 143519 164477 177732 169930 159123 165295 142787 136279 141340 152657 135156
9629 135156 128141 119291 116998 135403 117558 119740 134343 139174 123782 110761 93697 86146 116270
9616A16270J62j7816J2483j1921j0378j1010J0105L453J2066K5716O474O114N460
9603A47178K705r135j2650P587M070j502l94j745N478o262k112j8259L3509J7520
9589A65988k4854j7905j1425k0438j1691n248J8144M2720J2374l977k0145k4089
9577I9454k1409J0294R576J1865J5520q298M082J4493R844j935k7821q224K1078
9564A28519J4220K817j8945l4345r630N194K5286R395J2974q808P937J4868L350
9551A52832m599k2855k3257j1818R045J3348n746M129O686j2974l1080P295j5496
9538F5510k575J6841K0008j6589j9061r892j309K1380j0820j3230J3659K3517
9526H7439K5305L2952j8585p794j8164k5616N290K9695K5914K6638K4560p239
$$ plain form
9616 116270 116432 98616 111099 99178 88800 77790 87895 91348 103414 129130 135604 141718 147178
9603 147178 149883 140748 128098 135685 139755 138253 137859 136114 141592 135330 133218 114959 148468 165988
9589 165988 141134 123229 111804 91366 79675 74427 92571 135291 147665 143688 123543 99454
9577 99454 78045 88339 97915 109780 125300 117002 121084 135577 145421 143486 115665 107441 128519
9564 128519 142739 145556 126611 92266 82636 87830 113116 122511 135485 126677 134614 149482 152832
9551 152832 148233 125378 102121 90303 99348 112696 106950 111079 117765 104791 73711 81006 65510
9538 65510 62935 79776 99784 83195 64134 54242 52933 74313 63493 50263 63922 87439
9526 87439 112744 145696 127111 119317 101153 75537 80827 110522 136436 163074 187634 180395
9514A80395k7980L898O67O9p220k2815j3711q208o994J515N133Q655J1837m570
9500A20671k1726Q774Q101O837M075k3123l6794L375L884J2887o94k1349k419
9487F2499J7019J6380j804J2289J8619q335o24k9074k9962m700L1936M048n133
9474H3158J1170j0435j545K0919K5881R580j46K493l759k2891j5646L399n555
9461I6623M657j36r562M963n573J0214J6496m6336k9214M347J5064N196J2285
9448G9024l486O653j0221j9320P692K3792j5932j950K0736J9064l105j264j8463
9435H3220k2889K1553J787J222J8371J5866m165j5963k0221j9987Q944p022J656
9422F2372K2898K47p734M2091K330j2708l2000m2371j0432J707P611o41j3354
$$ plain form
9514 180395 152415 156313 156980 157049 149829 127014 113303 105095 98101 99616 104749 113404 125241 120671
9500 120671 98945 107719 115820 122657 126732 103609 66815 70190 74074 86961 86267 64918 62499
9487 62499 79518 95898 94094 106383 125002 116667 116043 86969 57007 52307 84243 88291 83158
9474 83158 94328 83893 82348 103267 129148 138728 138582 141075 137316 114425 98779 102178 96623
9461 96623 101280 101144 91582 96545 90972 101186 117682 71346 42132 46479 61543 66739 79024
9448 79024 75538 82191 71970 52650 60342 84134 68202 66252 86988 106052 102947 101683 83220
9435 83220 60331 81884 83671 84893 103264 119130 114965 99002 78781 58794 67738 60716 62372
9422 62372 85270 85517 77783 119874 122204 109496 77496 35125 24693 26400 34011 33370 20016
9409B0016L1201K8216n860L732P911J5010O974M533o057k8484J7147o069P992
9396I6262P665j3356m2225j0392N634J8418N4109K6312k9854k8116j1217J7808
9384I1048j309j5563K7808j6415o584O741r153J0140R799K1467L1613K0903J7024
9371A87519q669l7617j6909k0823j5498l1120k1570k0830N618L6259L2518R436
9359I8314l163o240J1564j1072J5343K3392K8975j3081j3184k0956q511n669M393
9346A00105J727N29o562k574K438p99m074j724K74j3054j0975J4991n154j9571
9332E5577k724L1413j1316k1215M923K1898K6362j3940j7397l2957o715K663L022
9319C9594J0823k569k960p869m67K6531K3548K452j3692k1627Q380J5819p670
$$ plain form
9409 20016 51217 79433 73573 77305 85216 100226 107200 111733 105676 77192 94339 88270 96262
9396 96262 103927 90571 48346 37954 43588 62006 116115 142427 112573 84457 73240 91048
9384 91048 89739 74176 101984 85569 78985 85726 76573 86713 96512 117979 149592 170495 187519
9371 187519 178850 141233 124324 103501 88003 56883 35313 14483 20101 56360 88878 98314
9359 98314 95151 88911 100475 89403 104746 128138 157113 144032 130848 109892 101381 95712 100105
9346 100105 101832 102361 95799 93225 95663 94864 90790 89066 89340 76286 65311 80302 75148 55577
9332 55577 52853 84266 72950 51735 56658 78556 104918 90978 73581 40624 33909 36572 39594
9319 39594 50417 47848 44888 37019 36552 63083 86631 89083 75391 53764 62144 77963 70293
9306G0293K587K5973o859j8988j4275J0662K6368N633k1031j5221P057J1142k2181
9293F1160r3O69L730R67k4493l4104j201K2373J7690J4250J3362k722Q746j0688
9279F9646l7975p413J1529j4468J8164K9698P863j1082j4024j1608P196n619J9884
9266F1791j313L0100L1344r856j9227J9123K0618r250k5585l0175r084L998Q031
9253G0515k6562K315L5578P019o456m564O687J0255k0672j5905J3906L352j0567
9240F4901j6415J437M503J3320M8j1523q320p319N194K0218K7978j5602k3448
9227E4972J2716J2455q830L949J8850q236j6327j0987R682J0818R20J2082l595
9214H8469Q880j9169j3291j382k6489q294K9347J9994N541j577P447m091l0148
$$ plain form
9306 70293 72880 98853 91994 73006 58731 69393 95761 101394 80363 65142 72199 83341 61160
9293 61160 61067 61736 65466 66433 41940 7836 6635 29008 46698 60948 74310 71588 80334 69646
9279 69646 31671 24258 35787 21319 39483 69181 77044 65962 51938 40330 47526 41907 61791
9266 61791 60478 90578 121922 112066 92839 111962 132580 123330 97745 67570 58486 62484 70515
9253 70515 43953 46268 81846 88865 82409 77845 84532 94787 74115 58210 72116 75468 64901
9240 64901 48486 49923 54426 67746 67794 56271 47951 40632 45826 66044 94022 78420 54972
9227 54972 67688 80143 71313 75262 94112 85876 69549 58562 68244 79062 79982 92064 88469
9214 88469 97349 78180 64889 63507 37018 28724 58071 78065 83606 82029 89476 85385 55237
9201E5237J1666J8254j6925n730L1354n093q258j4529j4324k2307k0560N428j410
9188A2803K4504n590P451M302K2793k174K508m496Q209k477p140r567r183K0481
9174F2424J3060J9298j7885K322J6040j5283k6652l683p135O862r373O682R565
9161E6242r913j9973J3667J4904J3466k0324m509j1493J4462J5286J5146k864
9149G4097J461o106p121j0357r677j0153k812j6296K1446j1466Q75J9563R731
9136E3185M384J6803Q347j7004k7956j9375M244Q144j7172P073k4048j3465O268
9123a0572L623J4700K7207k563M2505N32j30j0582k1575M610L2728q930j8164
9110E3389o046n539K7141p374l9403k0956k202J2071L5409K2072K986J1340K2049
$$ plain form
9201 55237 66903 85157 68232 62502 93856 88763 80505 65976 51652 29345 8785 14213 12803
9188 12803 37307 31717 39168 43470 66263 64089 66597 62101 70310 67833 60693 51126 41943 62424
9174 62424 75484 94782 76897 79219 95259 79976 53324 49641 42506 49368 39995 46677 56242
9161 56242 46329 26356 40023 54927 68393 48069 43560 32067 46529 61815 76961 74097
9149 74097 75558 69452 62331 51974 42297 32144 29332 13036 34482 23016 23891 43454 53185
9136 53185 57569 74372 82719 65715 37759 18384 22628 30772 13600 20673 -3375 -16840 -10572
9123 -10572 -6949 7751 34958 32395 74900 75432 75302 64720 43145 47755 80483 71553 53389
9110 53389 47343 41804 68945 61571 22168 1212 -990 11081 46490 68562 71548 82888 104937
9097A04937J233k8292l387p959n887J6382j2726k9898j2799R674J3063j650j5582
9084B7109q844P793J6990J6513l163j6033k510q773j6269j0495J4938J7292M798
9071C9346k019K8430l351j5279k1020L198J310J7255J0837J3875m4412n868J1776
9058C4078Q755k5476p872J3689P738j1386K137L6669L1624m987l2711k026M730
9045E4962J98Q749j3468j9157j150K8096j6933j3217j4736p966K9593N915l511
9032C7375N734J9233J2811r381k0206p968O263R319L56j8006j3392r50L4641L5088
9018I0917j0597m7758p262m932k3824p720R707M522K7900o349k555J465R442K2449
9004E5405O315J8941J049k7457r753r03K1851k40j5621k4825p955K1153J4220
$$ plain form
9097 104937 106170 77878 74491 66532 60645 77027 64301 34403 21604 31278 44341 42691 27109
9084 27109 18265 26058 43048 59561 56398 40365 37855 29082 12813 2318 17256 34548 39346
9071 39346 37327 65757 62406 47127 26107 29305 30615 47870 58707 72582 28170 22302 34078
9058 34078 42833 17357 9485 23174 30912 19526 21663 58332 89956 84969 52258 50232 54962
9045 54962 55160 63909 50441 31284 30134 58230 41297 28080 13344 5378 34971 40886 37375
9032 37375 43109 62342 75153 65772 45566 37598 43861 53180 53536 35530 22138 21188 55829 90917
9018 90917 80320 32562 25300 20368 -3456 -11176 -1469 3053 30953 24604 22049 23514 32956 55405
9004 55405 61720 80661 81710 54253 44500 43597 65448 65208 49587 24762 16807 37960 52180
8991E2180j4584n379l257j1722P318J1621l855j0109p902j1470j387J7732L2476
8978E1662O090j1487k3015R79k445j5452J1303K085L616l0075P467J1382J0056
8965B2166j7820Q983J8986J3440j1183l188p402q137j42j07R229K1625J9289k911
8951F2828r507j9458J2587J690j4020Q488J0769p801k87M76O124k6199N492J9213
8937E0395j6790k5256J1317L635J3644j0047j2572L7411K8780n262q550l5997
8925C0708j5636N836K8354J5737k663p487k9054r869J4163Q660J4590k0070j4773
8912A8496j308J6790j0430J5086o846l4382J0952J0720Q364n69O109K340N273
8899D0595m965k2005l532k751M074r462J2571J6024J9865J116j2504J944o554
$$ plain form
8991 52180 37596 32217 28960 17238 24556 36177 32322 22213 14311 2841 1454 19186 51662
8978 51662 57752 46265 23250 24229 21784 6332 17635 19720 23336 -6739 728 12110 22166
8965 22166 4346 13329 32315 45755 34572 31384 23982 15845 15703 15596 24825 46450 65739 62828
8951 62828 53321 33863 46450 48140 34120 42608 53377 45576 45289 45765 51889 25690 31182 50395
8937 50395 33605 8349 19666 23301 36945 26898 14326 51737 80517 75255 66705 30708
8925 30708 15072 20908 49262 64999 62336 54849 25795 15926 30089 38749 53339 33269 18496
8912 18496 17188 33978 23548 38634 31788 -2594 8358 19078 27442 26873 32982 35322 40595
8899 40595 35630 13625 10093 7342 11416 1954 14525 30549 50414 51530 39026 40970 34416
8886C4416k6170n824k2666k8575K9137p874J0836j3200O04K1213o831K016J0856
8873b062J4110J9521P863o57k5361P608K7977j7691j6415k635K7576O704m638
8860D1900Q792k6694k6191r365J3406j0269j2122m872J3323K0933j1565L655J5891
8847A6822q773N251q066n42K5142J581K96J5179j434j9426O386j1501k4589J286
8833b388J9880L135R301J5173K5115j1095q47l0105k1025K129K565J6368j12L555
8819C1649p461j0806j7528P818K0285K2004J1294J0068o941j1684k0988q527L368
8806B2551n822j5339L483j3026K6124J2094K291m633n328l5328n015J0186J4627
8793F865N514j4572j319J5163m72j0006q880p977J9063L7724j912j3818k1320
$$ plain form
8886 34416 8246 2422 -20244 -48819 -19682 -27556 -16720 -29920 -29316 -8103 -14934 -12918 -2062
8873 -2062 12048 31569 39432 38775 13414 21022 48999 31308 14893 12258 39834 46538 41900
8860 41900 50692 23998 -2193 -11558 1848 -8421 -20543 -25415 -12092 8841 -2724 931 16822
8847 16822 8049 13300 5234 4692 29834 31415 31711 46890 45456 26030 32416 20915 -3674 -2388
8833 -2388 17492 20627 29928 45101 70216 59121 58274 28169 7144 9273 11838 28206 28094 31649
8819 31649 24188 13382 -4146 3672 23957 45961 57255 67323 60382 48698 27710 19183 22551
8806 22551 16729 1390 4873 -8153 17971 30065 32356 27723 22395 -12933 -17948 -7762 6865
8793 6865 12379 -2193 -3512 11651 11179 1173 -7707 -15684 3379 41103 39191 25373 4053
8780D053j4575K2471j0172l160J1806K3145N145J0267P50k4762r741p469P289
8767A5047J514J457P103N90L511p893j5446N808p590J4361P889J709j6861m191
8753G008J8760N911j4596o251R755M1112j7984j9670K1154N187Q150P64j0554
8740D8746l443k71J6419R098j5312j3988m899j2439p533j3943o178J6429J2525
8727B5211n433l404N606J6727K7288N664j1424q449m925q500J1152N72k6848k9830
8713f593J151J2846J2709K7138O59O215q448n642j4519j0933K7376o084k447J1881
8699D5309j2825r753J5141n896k354o43j9686j4136p299J2478M575R39k0276M703
8685i723K6117M013p043P782j592q914k2916O55K9339L2059Q311j0518k5173n966
$$ plain form
8780 4053 -10522 11949 1777 -1383 10423 33568 38713 48980 49730 24968 15227 7758 15047
8767 15047 16561 18018 25121 25711 29222 21329 5883 11691 4101 18462 26351 28060 11199 7008
8753 7008 25768 31679 17083 10832 20587 61699 43715 24045 45199 50386 58536 59300 48746
8740 48746 45303 45032 61451 70549 55237 41249 36350 23911 16378 2435 -3743 12686 25211
8727 25211 19778 16374 21980 38707 65995 71659 60235 51786 46861 38361 49513 50085 23237 -6593
8713 -6593 -5442 7404 20113 47251 47910 54125 45677 40035 25516 14583 41959 35875 33428 45309
8699 45309 32484 22731 37872 31976 29622 28979 9293 -4843 -12142 336 4911 5850 -14426 -9723
8685 -9723 16394 20407 13364 21146 19554 10640 -12276 -11621 17718 49777 58088 47570 22397 16431
8671A6431K3025j0087N718J6222J0213j736l9010l2714m108J9839J5850q433j9447
8658h237L517K7253o086o080J1196P832p916J9041M55n3705K719L4427M959m023
8644B5352j2546O992K1088J7424m924k8976p252j0115J7155J8324j8142j6256
8632H124L964l839P797J5743K985k5936k2006Q666O495J1305j121m469J382n858
8618C232M466QP41J2130K507l1465j0768j1165o756J2816J1678L2618n962m3611
8604b9531j1385J5084L1658K189J483L1893N561k1450o186J2011o166j6011M034
8591A3184L3801k889j2387k8273K4421R144K816k7398k2570J9244L245J6225K486
8578C1049k3660q959K0901n70L107L498J3046p296m1242j2434K2755k5150k295
$$ plain form
8671 16431 39456 29369 35087 51309 61522 59786 20776 -11938 -16046 3793 19643 11210 -8237
8658 -8237 -4720 22533 16447 10367 21563 29395 21479 40520 40975 -12730 -10011 24416 29375 25352
8644 25352 12806 19798 40886 58310 53386 24410 17158 7043 24198 42522 24380 8124
8632 8124 12088 8249 16046 31789 34774 8838 -13168 -4502 1993 13298 12177 7708 9090 3232
8618 3232 7698 7706 8447 20577 23084 -8381 -19149 -30314 -37070 -24254 -12576 20042 14080 -29531
8604 -29531 -40916 -25832 5826 8015 9498 41391 46952 25502 19316 31327 25161 9150 13184
8591 13184 46985 44096 31709 3436 27857 37001 39817 12419 -10151 9093 12338 28563 31049
8578 31049 7389 -1570 19331 18761 21868 25366 38412 31116 -10126 -22560 195 -24955 -27250
8565b7250K8819M01J9627R101r16K3730L473j4911j0370J5646j7370j8614j4056
8552b690m246J1855n095J2003K0407J0309k2838l2031j5556L7126M0911k90r254
8539D0611L3717k840j1939l607k0250j2920k828j7618l236K9475K6113O139J430
8526F2247l032j0759l503l0929k59J5156N221L5378Q4446R3357J14193M7916l6105
8513C73327j03979q2745o8562n5089k8942J24K1618m816N760L278l277m098l4707
8500A7892k1259m19P072o095j360j5709j1028K8372L1644j338j9313l1176j2824
8487c5541N725J5425K2144m827L029N510p702J7234J9330k464Q138L9779K8128
8474A13908N4618J08188J72207K14468J35798r5589k10451j56502q9238o5139
$$ plain form
8565 -27250 1569 1970 21597 30698 29782 53512 56985 42074 31704 47350 29980 11366 -2690
8552 -2690 -6936 4919 -176 11827 32234 42543 19705 -12326 -27882 9244 50155 49865 40611
8539 40611 74328 71488 59549 55942 35692 22772 19944 2326 -910 28565 54678 60817 62247
8526 62247 59215 48456 44953 14024 13765 28921 34142 69520 153966 247323 361516 409432 373327
8513 373327 269348 186603 118041 62952 34010 34134 55752 50936 56696 59974 56697 52599 17892
8500 17892 -3367 -3786 3286 -2809 -4169 -19878 -30906 -2534 29110 27772 8459 -22717 -35541
8487 -35541 -29816 -14391 7753 2926 5955 11465 3763 20997 40327 37863 46001 85780 113908
8474 113908 168526 276714 448921 663389 799187 703598 493147 336645 247407 182268
8464A82268m5215m7713k5240j1573k2158j465K6117J1677k8747j7546l381j3456
8452C568L1687R450n640k4417k8551r264K5258J8339k616L4998O024J687N165
8439F5688r251j0630M888N950J9651K0091q934Q853J7518O457J167L0210J10050
8426B61708J01556N3812k1467r3327j10608o1807m8562k1457R816k29m3280m774
8414B1381K6654N427l619j0149k505J0891j6891K244j6734K764K5896K44O617
8401E2220J0220J352P367o741K698j338k7662K9093O865J061j0300k5847o626
8388C2362n04j9951O532J2459K9169N267k8062J3764j3171j4682j021j1794J0899
8375B1267J4452q020J9910j0181k867L130k2170j6383j2031o103K053K327J478
$$ plain form
8464 182268 137053 89340 64100 52527 30369 28904 55021 66698 37951 20405 17024 3568
8452 3568 35255 44705 39065 14648 -13903 -23167 2091 20430 17814 52812 58836 60523 65688
8439 65688 56437 45807 50695 56645 76296 96387 87453 96306 113824 120281 121448 151658 261708
8426 261708 363264 417076 395609 302282 191674 129867 81305 59848 69664 69435 26155 21381
8414 21381 48035 53462 49843 39694 37189 48080 31189 33433 16699 19463 45359 45603 52220
8401 52220 62440 63792 71159 64418 67116 65778 38116 67209 74074 75135 64835 38988 32362
8388 32362 31858 11907 18439 30898 60067 65334 37272 51036 37865 23183 22162 10368 21267
8375 21267 35719 27699 47609 37428 34561 37691 15521 -862 -12893 -18996 -16943 -14616 -13138
8362a3138o935l569J1461j9491o226K3493m00j7902j335n526P00J11J163P354
8348c0240K2364j8662j4845J6409K137r374J9644J0513L030J7978j4746l252J7470
8335A8426J6941j2537k2782j572p608J1890k683o160l806R453J4265J7897r852
8322B1872l1283l223l115r01J1522j8482k6719J7488R112Q099m003J3646J755
8309d232R766l168k2085l637j0418k0203P462N6305L9501j2812r369j9381j5889
8296h160J130p87j7890l39j998J2842J8116O880o678M51K9818R08l5634j7780
8282a9121o076K4195m862p295J2263J2293P082l4o6Q812r096l6253n449J3927
8268i680J5693l395l129J7878K0267j3673m226n965p557k0237K0187M366J8956
$$ plain form
8362 -13138 -20073 -23642 -12181 -31672 -37898 -14405 -14805 -32707 -34042 -39568 -38868 -38757 -37594 -30240
8348 -30240 -7876 -26538 -41383 -24974 -22837 -32211 -12567 -2054 976 18954 4208 956 18426
8335 18426 35367 22830 48 -1524 -9132 2758 75 -6085 -9891 -438 13827 31724 21872
8322 21872 -9411 -12634 -15749 -16650 -5128 -23610 -50329 -32841 -23729 -15630 -19633 -5987 -4232
8309 -4232 5534 2366 -19719 -23356 -33774 -53977 -46515 9790 49291 36479 27110 7729 -8160
8296 -8160 -7030 -7817 -25707 -26046 -28044 -15202 2914 9794 3116 3567 33385 34293 -1341 -19121
8282 -19121 -25197 -1002 -5864 -13159 -896 11397 18479 18445 18379 27191 18095 -18158 -23607 -9680
8268 -9680 6013 2618 -511 17367 37634 23961 19735 13770 6213 -14024 6163 10529 29485
8255B9485L6518K527l0284m39j1774L706R011l0290k8458J3877k517M775Q35J9301
8241A6273L769o439q458k877N423K2856R23J6911k4423j9835O361k058M138L35
8227A2899M780n179l325J2667j2771k2418M091K2637j3548M047J2531l3935O122
8214a1402J2623q306J827K1019J0552k977J3803J0515j4972k5449k3342j0470
8202b6579J5716K2220K9316j6603j8531o37N480L910j199q468n862J2780J4051
8189B5594M349n607P887j6499j7830l371Q816R401N475o770J821j7214k795J852
8175d891l4068J0000J1115K1059J8076r315n572J8930j0780n799J2107K1656K546
8162D5064q438k9513j989K864r758q235R57p335j7368K5796J568j7972O340K006
$$ plain form
8255 29485 66003 68530 38246 37807 26033 29739 38750 8460 -19998 -6121 -8638 -3863 -3028 16273
8241 16273 20042 13603 5145 2268 7691 30547 31470 48381 23958 4123 10484 8426 12564 12899
8227 12899 17679 12500 9175 21842 9071 -13347 -9256 13381 -167 3880 16411 -17524 -11402
8214 -11402 1221 -7085 -5258 15761 26313 23336 37139 47654 32682 7233 -16109 -26579
8202 -26579 -10863 11357 40673 24070 5539 4902 10382 14292 13093 4625 -1237 11543 25594
8189 25594 29943 24336 32223 15724 -2106 -5477 3339 12740 18215 11445 13266 -3948 -6743 -4891
8175 -4891 -38959 -28959 -17844 3215 21291 11976 6404 25334 14554 8755 20862 42518 45064
8162 45064 36626 7113 5124 7988 -1770 -10005 -9048 -16383 -33751 -7955 -6387 -24359 -18019 -16013
8148a6013J7353n75N080j4581O10Q48j949k281M036r60L2581J0021j7559m799
8134A1812k3180J4651Q488R779K4181j789l946k7398m2142j5065K8960m691r461
8121b9801p863O924J6989K032M448K2454L749J2128J412L874j6170k4580k6128
8108c0532L706j6680p887J0242J7406K564P38m706p739Q650L334J118K916K3328
8094F458n544k8440j5251N024J3156P133K3111k098m692K418j7609j4925k937
8081c4196K356Q465r890M471K3683J9480N68J7500j6874M509J3135m482l960J372
8067B6137l2890k2689P406J7107q06j7391k310M6820K2947k0977k9375k427L4999
8054B6551O691k7262l98J3940j0674j0469Q415O477j5623m907J0435K1318K86
$$ plain form
8148 -16013 1340 765 5845 -8736 -8126 -7278 -9227 -11508 -7472 -8432 24149 34170 16611 11812
8134 11812 -11368 3283 11771 21550 45731 43942 39996 12598 -29544 -44609 -15649 -20340 -29801
8121 -29801 -37664 -30740 -13751 -11719 -7271 15183 18932 31060 32472 36346 20176 -4404 -30532
8108 -30532 -26826 -43506 -51393 -41151 -23745 -21181 -20443 -25149 -32888 -24238 -20904 -19786 -16870 6458
8094 6458 914 -27526 -42777 -37753 -24597 -17464 5647 3549 -1143 1275 -16334 -31259 -34196
8081 -34196 -31840 -23375 -33265 -28794 -5111 14369 14937 32437 15563 20072 33207 28725 24765 26137
8067 26137 -6753 -29442 -22036 -4929 -5735 -23126 -25436 21384 44331 23354 -6021 -8448 26551
8054 26551 33242 5980 5582 19522 8848 -1621 6794 13271 -2352 -7259 3176 24494 24780
8041B4780J662k7622o678P931k672k7264k4347L2787J7185l314p470m716J6719
8028c019J8572L735o36r947j8727L600L1806o14l5247k1703m154L0870R699j0912
8014f677K2967M0076J6330k6872n0517o071l335J910J5988o356J2240N705J0074
8001B5462K0368k3462j6314K425J8042j2525k9064k9126o847j2893K7449K2416
7989a4069q50p720P20J2317j244j2701n386R404p265L552K2071J3288n315k3667
7975a6865p428j0715j9823k211R558J3209J0264k0037M491L3624j480N252j1988
7962a4149K8759J0118l1721m2317j6314K020j5775J0099M8943K8200L62j1381
7950c156K892Q983m353J8753o116k4170J2171n229J1095K0752j6580k904k8449
$$ plain form
8041 24780 26442 -1180 -7858 73 -2599 -29863 -54210 -21423 -4238 -7552 -15022 -19738 -3019
8028 -3019 15553 19288 18652 8705 -10022 -6422 25384 24770 -10477 -32180 -36334 -5464 4235 -6677
8014 -6677 16290 56366 72696 45824 -4693 -10764 -14099 -12189 3799 -2557 9683 15388 25462
8001 25462 45830 22368 6054 8479 26521 13996 -15068 -44194 -51041 -63934 -36485 -14069
7989 -14069 -14919 -22639 -21919 -9602 -10846 -23547 -28933 -19529 -26794 -23242 -1171 12117 6802 -16865
7975 -16865 -24293 -35008 -54831 -57042 -47484 -34275 -24011 -44048 -39557 -5933 -7413 -2161 -14149
7962 -14149 14610 24728 -6993 -49310 -65624 -63604 -79379 -69280 -20337 7863 8225 -3156
7950 -3156 -264 8719 4366 23119 17003 -7167 5004 -225 10870 31622 15042 12138 -16311
7937a6311N006m805K3251K643O089P835K532r461j9134j6663l345R582M408n102
7923a3475R5k3987P072N565j3832j2434J3781K5061K7786J6814o087l9320P399
7910e562J2825k0473j2092L128q798J2201J204j6646m2646K3865K2159K1819L3528
7897B4512K0838k7773m0289j1987j9464Q55K3755J0028r52P127j7818m568j2450
7884d8186J321P10J9813Q935k40k9345j5120J872N677j0783L7067L6445j2868
7871d702j0313J5577l2589j4864Q414N252K5417Q878j2550n392J1964J4323n017
7858D398O915J3461j6826k5007K4501J6157p861J7634Q55M94j9603n3974K3364
7845a5492J1512k7232k4436k893L0824L6802j788k4899m195L668J4434J2506J457
$$ plain form
7937 -16311 -11305 -16110 7141 9784 15873 23708 26240 16779 -2355 -19018 -22363 -12781 -8373 -13475
7923 -13475 -13380 -37367 -30295 -24730 -38562 -50996 -37215 -12154 15632 32446 26359 -12961 -5562
7910 -5562 7263 -13210 -25302 -22174 -30972 -18771 -17567 -34213 -76859 -52994 -30835 -9016 24512
7897 24512 45350 17577 -22712 -34699 -54163 -53308 -29553 -19525 -20477 -13350 -31168 -35736 -48186
7884 -48186 -46865 -46155 -26342 -17407 -17647 -46992 -62112 -60240 -54563 -65346 -28279 8166 -4702
7871 -4702 -15015 562 -32027 -46891 -38477 -33225 -7808 1070 -11480 -16872 -4908 9415 4398
7858 4398 11313 24774 7948 -17059 7442 23599 15738 33372 34227 34721 15118 -38856 -15492
7845 -15492 -3980 -31212 -55648 -58541 -27717 9085 7297 -17602 -21797 -18129 -3695 8811 10268
7832A0268J1345Q371j1626p528m3465l1675R378M607o46m213K0739K1804p263
7819a9904k8542n298J064K4410J5315q17m148r419J0266L0038J4590j6917N437
7806A6075J0573j5627j1881J4796j8517q069K381j1078j829n015O330K2186N50
7793H75j6650l2400L749J9844j0249l1968J1041J6875J0726K563k870R199K3642
7780D377J0175k788m658N180k221j299k7472j6942j3116M72j5310p149K3711O301
7766d0739Q202L034m46J5927J2134m579j8223R025L2514r40k6154l4727j3755
7753e8727K1277L1304K0071n174j2128j0489K1686K5198k4405p036K3784J6932
7741D2293p894m210j6031r222o108j3551J693M930K75r469J1900J8195J0834j0302
$$ plain form
7832 10268 21613 29984 18358 10830 -32635 -64310 -54932 -50325 -50971 -55184 -34445 -12641 -19904
7819 -19904 -48446 -53744 -52680 -28270 -12955 -13772 -17920 -27339 -17073 12965 27555 10638 16075
7806 16075 26648 11021 -860 13936 -4581 -12650 -10269 -21347 -23176 -28191 -21861 325 875
7793 875 -15775 -48175 -44426 -24582 -34831 -66799 -55758 -38883 -28157 -25594 -28464 -19265 4377
7780 4377 14552 11764 7106 12286 10065 8766 -18706 -35648 -48764 -48292 -63602 -70751 -47040 -40739
7766 -40739 -32537 -29503 -29949 -14022 -1888 -6467 -24690 -15665 16849 15909 -10245 -44972 -58727
7753 -58727 -37450 -6146 13925 8751 -3377 -13866 7820 33018 8613 1577 25361 42293
7741 42293 34399 30189 14158 4936 -1172 -14723 -13030 -8100 -7825 -17294 -5394 12801 23635 13333
7727A3333P183k2130j8758Q901J1969k0193j405j0648l436L463k1303p151K3698
7714c6477K0527R008J6798R897l2652k5196p68K4128J537j3692Q055J1401J1757
7701D323J8232r061J7038o608j6167O936j6774j0752r083k0176K3077J7515j9834
7688b1334l579J4644J1974j0068r16J1592j7526p241P392l767j0649q632p300
7675d5410l3193J1959K1974q68m79J9452O024o601o196N139p911J6093l765j7050
7661d0832J9508O647k838J5437L0263J994j6554j0039q525l749m212J1550K1006
7648A9656K968K396j2094j0293j930k256o600M796J1453k3773j7546k5446J3699
7635d4970J0780J9629J165j3431J1991J886J3730J4564J0457j5981j5713n549
$$ plain form
7727 13333 20516 -1614 -20372 -11471 498 -19695 -21100 -31748 -35184 -31721 -53024 -60175 -36477
7714 -36477 -15950 -6942 9856 19753 -12899 -38095 -38863 -14735 -13198 -26890 -18835 -7434 4323
7701 4323 22555 13494 30532 23924 7757 14693 -2081 -12833 -21916 -42092 -19015 -1500 -21334
7688 -21334 -24913 -10269 1705 -8363 -9279 2313 -15213 -22454 -15062 -18829 -29478 -38110 -45410
7675 -45410 -78603 -66644 -44670 -45538 -46017 -26565 -20541 -27142 -33338 -28199 -36110 -20017 -23782 -40832
7661 -40832 -21324 -14677 -17515 -2078 28185 30179 13625 3586 -4939 -8688 -12900 -1350 19656
7648 19656 22624 25020 12926 2633 703 -1553 -8153 -3357 8096 -15677 -33223 -58669 -44970
7635 -44970 -34190 -14561 -13396 -26827 -14836 -12950 780 15344 25801 9820 -5893 -11442
7623a1442J0518r401o976K8071K617J2776K3502l4527m746m624Q89j494l409N86
7609B340J3093j0522J2969l1091j3696K2659j0110k6866l737j4284p74J1287K4551
7596b4181q577J1291M1878k7438l0384l265K283K0596j7134P924J3343r488M394
7583a8758Q681J9028P167o498o350M41m724k1069K2309N499O425J5201O482J417
7569C5251J269k05R053k3593j2681j3106k560q374j5364P441K1847j3486q441
7556b2949P829L774k9426K487P345j646J7098R723p137o663q8J3924j046j308
7542h083j6153j117j8234K914J0437j5454J4117j64j7702Q920j0403J1729J2142
7529b7051k7331k3105L8004K4977N252j2697l9J0585k3202Q380J7777J3439J0156
$$ plain form
7623 -11442 -924 -10325 -17301 10770 13387 26163 49665 15138 10392 5768 6657 5163 1754 2340
7609 2340 15433 4911 17880 -13211 -26907 -4248 -14358 -41224 -44961 -59245 -60019 -48732 -24181
7596 -24181 -32758 -21467 20411 -7027 -37411 -40676 -38393 -17797 -34931 -27007 -13664 -23152 -18758
7583 -18758 -10077 8951 16118 9620 3270 3711 -1013 -22082 227 5726 12151 27352 33834 35251
7569 35251 36520 36315 45368 21775 9094 -4012 -6572 -14946 -30310 -22869 -1022 -14508 -22949
7556 -22949 -15120 -11346 -40772 -38285 -30940 -32586 -15488 -5765 -12902 -19565 -19653 -5729 -6775 -8083
7542 -8083 -24236 -25353 -43587 -40673 -30236 -45690 -31573 -31737 -49439 -40519 -50922 -39193 -27051
7529 -27051 -54382 -77487 -39483 -14506 -9254 -21951 -21990 -11405 -34607 -26227 -8450 4989 15145
7516A5145j9545L724J4250m216n981P271J2396k1552k1165k8050K862N752K3135
7503a5974K0348N121l6551p326K4748j5301j3618k0894l573K2951k2540j3987
7491g6596J0809R378K0117J2514K0326p706k0563l8407L6758M4881p477j3982
7479i948k7154j9679N745J6329M046L0799O706j2612J8569N717P36q623J091k9475
7465a7753k0329J2173J1591q69K3381k8571m346J5601K5875J5674j6743m1627
7453b5943j6662m415J0876j5214m6689q241N8909j027K0847K0311Q180k6314J130
7440b4252j246Q357O044J0565l1j5654l5033j0396N652Q5k3952K6055q96L442
7426e1260m565J4395N71p302J7490J3979m124r945k5340r291J9841Q247m358K5098
$$ plain form
7516 15145 -4400 -676 13574 9358 3377 10648 23044 1492 -19673 -47723 -44861 -39109 -15974
7503 -15974 4374 9495 -27056 -34382 -9634 -24935 -38553 -59447 -63020 -40069 -62609 -76596
7491 -76596 -65787 -56409 -36292 -23778 -3452 -11158 -31721 -70128 -33370 11511 4034 -9948
7479 -9948 -37102 -56781 -51036 -34707 -30661 138 6844 -5768 12801 18518 19254 10631 11722 -17753
7465 -17753 -38082 -25909 -14318 -15187 8194 -20377 -24723 -9122 16753 32427 15684 -25943
7453 -25943 -42605 -47020 -36144 -51358 -98047 -106288 -47379 -48406 -27559 -7248 932 -25382 -24252
7440 -24252 -25498 -17141 -11097 -532 -563 -16217 -51250 -61646 -55994 -55909 -79861 -53806 -54702 -51260
7426 -51260 -55825 -41430 -40859 -48161 -30671 -16692 -20816 -30761 -56101 -65392 -45551 -37304 -41662 -16564
7412a6564j0455o341n565J3667M064j7516j6670K9015J7331K8260o069j3633k6418
7399b6894l961K450k0302k9281o047J6229K5918K3412K8861J6868k9638k576M842
7386a19q004P704l604l1297j3028J1440J7903J5368k61r191j6934K094k2296R000
7372d1225L0189Q737m104r62J4249k584j0317q385J2815k891J6533Q638k2785
7359b092l8246P513K760Q644K6840p358Q673k08m3057p700K1958o4j4990J084
7345c6243K2974J543l3207K169l021K6060n138p262j5173k7102L128K5096K3818
7332b2358J9265R707j2770l1150k855j7331M442L9615J1927j0337p289j2880K6201
7319e813O177q300K6615J4869j2136k6786k012j149J3423j2256Q967j4096N478
$$ plain form
7412 -16564 -27019 -33360 -38925 -25258 -21194 -38710 -55380 -26365 -9034 19226 13157 -476 -26894
7399 -26894 -30855 -28405 -48707 -77988 -84035 -67806 -41888 -18476 10385 27253 -2385 -4961 -119
7386 -119 -8123 -419 -4023 -35320 -48348 -36908 -19005 -3637 -3898 -13089 -30023 -27929 -50225 -41225
7372 -41225 -11036 -2299 -6403 -7365 6884 4300 -6017 -14402 -1587 -4478 12055 20693 -2092
7359 -2092 -40338 -32825 -30065 -21421 5419 -1939 6734 6526 -36531 -44231 -22273 -22337 -37327 -36243
7345 -36243 -13269 -11726 -44933 -42764 -45785 -19725 -24863 -32125 -47298 -74400 -71272 -46176 -22358
7332 -22358 -3093 6614 -6156 -37306 -40161 -57492 -53050 -13435 -1508 -11845 -19134 -32014 -5813
7319 -5813 364 -7936 18679 33548 21412 -5374 -7386 -8535 4888 -7368 1599 -12497 -7019
7306g019J2409J5298J7874j7429k6691l1350J1965j4540J3583L3119Q687p946
7294G960J7640J9500J4683k3229l9950k256K7339j6185q557k0299j1710q597Q539
7281c5122P122L562j0140j9190r379O541J1158O57J4682n247J0009J3254n452
7268a7545J4317J8894j1409o002j6427l772Q011k2820j6068J6357K5278J1625
7256D39M792L327l0213l3183j3K8247L3031j749l720k187j5973j1459L133M403
7242b1125q35N524J5956J7353j9909j6172j3623J407O818k104k466J6117j2904
7229b5963j1602j0739m03J6584K3104K6344n992k1174l19L74j3043J5667j6084
7216b3246n650k748K6173j5479k6021p839O317J5694j537M02n23k8157j6260j3182
$$ plain form
7306 -7019 5390 20688 38562 21133 -5558 -36908 -24943 -39483 -25900 7219 15906 7960
7294 7960 25600 45100 59783 36554 -3396 -5652 21687 5502 -3055 -23354 -35064 -43661 -35122
7281 -35122 -28000 -24438 -34578 -53768 -63147 -56606 -45448 -44791 -30109 -35356 -25347 -12093 -17545
7268 -17545 -3228 15666 4257 -1745 -18172 -21944 -13933 -36753 -52821 -36464 -11186 439
7256 439 5231 8558 -21655 -54838 -54851 -26604 6427 4678 958 -1229 -17202 -28661 -25528 -21125
7242 -21125 -21960 -16436 -480 16873 -3036 -19208 -32831 -31424 -24606 -26710 -29176 -13059 -25963
7229 -25963 -37565 -48304 -48707 -32123 -9019 17325 11333 -9841 -10160 -9786 -22829 -7162 -23246
7216 -23246 -28896 -31644 -5471 -20950 -46971 -54810 -48493 -32799 -34336 -33934 -34457 -62614 -78874 -92056
7202i2056J1274J250J3735l501L936P157K8863K2833J5009k6545m8159o700j4112
7189h7016j9269K8283M7726O810k5061j7467j121N1185J2520J7382K3478n507
7177C1943j7900j9694p615j375J6526M339j8839j4390J7354L5728L623k5759r851
7164e910l809N543O222n818J9263J4147j1070j9375J2318r204k986k3422k7224
7151e1325J429J577n560K3695L1627K798p948O04j7485Q017Q370J2804l6048j2288
7137c9733Q578Q311j613L5084P030l9241j6259k1210j2779k93N922N920J0356
7124d9927L2122J2660k2048L183M0205j920l2277K1712k1447j6001M875j3153
7112d2016Q971J7773J8269k0309j3482j0597K2368J1089k9549J8816K1536L871
$$ plain form
7202 -92056 -80782 -79532 -65797 -69298 -65362 -58205 -29342 -6509 8500 -18045 -66204 -72904 -87016
7189 -87016 -106285 -78002 -30276 -23466 -48527 -65994 -67115 -15930 -3410 13972 37450 31943
7177 31943 14043 -5651 -13266 -14641 1885 6224 -12615 -27005 -9651 26077 29700 3941 -5910
7164 -5910 -9719 -4176 2046 -3772 15491 29638 18568 -807 11511 2307 -679 -24101 -51325
7151 -51325 -49896 -48319 -53879 -30184 1443 4241 -3707 -3103 -20588 -12571 -4201 8603 -27445 -39733
7137 -39733 -31155 -22844 -24457 10627 17657 -21584 -37843 -59053 -71832 -72125 -66203 -60283 -49927
7124 -49927 -17805 -5145 -27193 -24010 16195 14275 -18002 3710 -17737 -33738 -28863 -42016
7112 -42016 -33045 -15272 2997 -17312 -30794 -41391 -19023 -7934 -37483 -18667 2869 6740
7100F740J4574m444n784K818k2383j2693j444J5118j6878j5860K69o22n881m387
7086e0857J5905O429l794j3655P729K1797j749k2607j5890K0323M9163J8017j6348
7073A4463n730k3291k2720R770J2815j9225J4761K2040N187J1911J4406l5953
7061a566k4330J0500J1402l0575k6531O638o790j3587J5391K4161J775J7124J6107
7048b81J8743J3143r705r700l5485j1286j630P344K8147J1033j0496K911p650
7035d912r184L0620J8599N251N811j4984l2616m0458k883j939l825j3771J5985
7022d8306J4920M380P112J6009P750J722j2353j1157j4535k3365q343p888N147
7009f8907L4283J325j0471r068j1608M354M114k3501J7902J7188m287K592K5039
$$ plain form
7100 6740 21314 16870 11086 13904 -8479 -21172 -22616 -7498 -24376 -40236 -39967 -40589 -46470 -50857
7086 -50857 -34952 -28523 -32317 -45972 -38243 -16446 -18195 -40802 -56692 -36369 12794 30811 14463
7073 14463 8733 -14558 -37278 -27508 -14693 -33918 -19157 2883 8070 19981 34387 -1566
7061 -1566 -25896 -15396 -3994 -34569 -61100 -54462 -61252 -74839 -59448 -35287 -33512 -16388 -281
7048 -281 18462 31605 21900 12200 -23285 -34571 -36201 -28857 -710 10323 -173 2738 -4912
7035 -4912 -14096 16524 35123 40374 46185 31201 -1415 -41873 -44756 -46695 -50520 -64291 -48306
7022 -48306 -33386 -29006 -21894 -5885 1865 3587 -8766 -19923 -34458 -57823 -66166 -74054 -68907
7009 -68907 -34624 -33299 -43770 -52838 -64446 -60092 -55978 -79479 -61577 -44389 -48676 -46084 -21045
6996b1045K3243n557j4642J2157k534q75r386N385k335r918m342J733J4438K0544
6982F866M567k7925L322Q735L197p155j6992J4518J2460j3196M530J9784R078
6969B1789o187j4307j3112k917j7354Q238K2935O077j3025K621p562Q838j7641
6956b1607j8033J2857J6818J4663r015k4404n171j6299r995J3956K227k610P941
6943c8672J0937l525J8647m136k6492K331N733P373l5963j0271L7443J0839p300
6930c3056L257L133j4702k3733J1441Q623J9976j0842r338P646J9832P514j2576
6917b2825P368M2707q270j4358J7058M150m5534l0568J1720O264j2591J114K9042
6904a4723q200j898p3K1000P129k4341O747j2043J0408j529k6769O733K6832J1986
$$ plain form
6996 -21045 2198 -3359 -18001 -5844 -8378 -9253 -18639 -13254 -15589 -25507 -29849 -28116 -13678 6866
6982 6866 11433 -16492 -13170 -4435 -1238 -8393 -25385 -10867 1593 -11603 -7073 12711 21789
6969 21789 15602 1295 -11817 -14734 -32088 -23850 -915 5162 -7863 -5242 -12804 -3966 -21607
6956 -21607 -39640 -26783 -9965 4698 -4317 -28721 -33892 -50191 -60186 -46230 -44003 -46613 -38672
6943 -38672 -27735 -31260 -12613 -16749 -43241 -40910 -35177 -27804 -63767 -74038 -36595 -25756 -33056
6930 -33056 -29799 -26666 -41368 -65101 -53660 -45037 -25061 -35903 -45241 -37595 -17763 -10249 -22825
6917 -22825 -15457 27250 18980 4622 21680 25830 -19704 -50272 -38552 -32288 -44879 -43765 -14723
6904 -14723 -22923 -24821 -24894 -3894 3235 -21106 -14359 -26402 -15994 -17523 -44292 -37559 -10727 1259
6890A259O998L175p606k4327P33J095K1152r240j3966J965O775q269p482J8594
6876i144K2853j2361j9549l1350N06j243k3267L313J2125l414N003k565N273j2367
6862f6187j7466K1200K5614K0055j861j1630l452R843r58M589m486J2851j4203
6849b6091k1528Q229L998J987N57L500J7651j86k3688j5557l2598j7295o99K366
6835i9354J3367R971K7217Q033Q752j566l4788j6913l936N907P841L1164k673
6822d6978j3566K29J1698j0969J622j0542K4497K0425q8k0581j5494j7930L1322
6809d6355k467q180J1108Q279j7845j96N040m1496l1617J4875K5009J4240J9683
6796d9922J7690j0781K4067J1065m524k4826m432l123J0309p392o454J439j623
$$ plain form
6890 1259 8257 11432 3826 -20501 -19768 -18673 2479 -6761 -20727 -18762 -11987 -20256 -27738 -9144
6876 -9144 13709 1348 -18201 -49551 -49045 -50288 -73555 -70242 -58117 -61531 -56528 -59093 -53820 -66187
6862 -66187 -83653 -62453 -36839 -16784 -18645 -30275 -33727 -23884 -24842 -20253 -24739 -11888 -26091
6849 -26091 -47619 -39390 -35392 -33405 -32848 -29348 -11697 -11883 -35571 -51128 -83726 -101021 -101720 -99354
6835 -99354 -85987 -76016 -48799 -40766 -32014 -33580 -68368 -85281 -89217 -83310 -75469 -44305 -46978
6822 -46978 -60544 -60315 -48617 -59586 -57964 -68506 -44009 -23584 -23672 -44253 -59747 -77677 -46355
6809 -46355 -48822 -57002 -45894 -37615 -55460 -55656 -50616 -92112 -123729 -108854 -83845 -69605 -49922
6796 -49922 -32232 -43013 -18946 -7881 -12405 -37231 -41663 -44786 -34477 -41869 -48323 -46884 -48507
6783d8507J1881J2946q431p608M46J1603K618p320j2359p547K5645J5635l717
6770a4715q739k760J3060j0592k618j2445K4620L9094l716l3829l5315o461O193
6757d8223K3631Q971j7529j7827J5355k5058j8361J4173k941K7918J2012l765
6745c1644J1731m987j8659j6614r074p140M775K3265J6707J5089n081P109l5726
6732e0249q874J8064J6017K1496l924l4263N624J9675n035N051j062k8840l1913
6719g8233J7514J517j0737P717L4598K3599J1309j1293o439j0416j8097j4237
6707e3198k103R062J9399K1564o585K0597n277K810l585k1560r868j7264r023
6694e5031K8652K1138p838P529q688k7716P438R391J6661j145j5837r306Q777
$$ plain form
6783 -48507 -36626 -23680 -32111 -39719 -39273 -27670 -25052 -32372 -44731 -52278 -26633 -10998 -14715
6770 -14715 -23454 -26214 -13154 -23746 -26364 -38809 -14189 24905 21189 -12640 -47955 -54416 -48223
6757 -48223 -24592 -15621 -33150 -50977 -35622 -60680 -79041 -64868 -67809 -39891 -27879 -31644
6745 -31644 -19913 -24900 -43559 -60173 -69247 -76387 -71612 -48347 -31640 -16551 -21632 -14523 -50249
6732 -50249 -59123 -41059 -25042 -3546 -7470 -41733 -36109 -16434 -21469 -16418 -17480 -46320 -78233
6719 -78233 -60719 -59202 -69939 -62222 -27624 -4025 7284 -4009 -10448 -20864 -38961 -53198
6707 -53198 -55301 -46239 -26840 -5276 -11861 8736 3459 6269 2684 -18876 -28744 -46008 -55031
6694 -55031 -26379 -5241 -13079 -5550 -14238 -41954 -34516 -25125 -8464 -9609 -25446 -34752 -25975
6681b5975P889j0889r433N573Q506p444l380k2019P689Q531j6724L946L6115j2453
6667c0068j2640j6690Q652p349M236j3135J4150K888j8373P01O709P009Q720K1157
6653b4033j9415j7229J6878k933J7979K04j5540O969j5451R19o987n018l734j2508
6639g9899l3574J760r092j949L1204K2727J4415N066L4158J1933j5551j0314J8686
6626a0430J1737k0978m224J8931O6399J15388Q3212q699n6595p6692l4450j9285
6614F4314q760K1919M0094L5423M4092Q4923J15206J67159J90480L15381M89027
6603A559258Q62206J617559K864005M237123K844783j893357m024510l115944
6595D951123j690136q75533n22787l39174k86256k51135j71541j41367p9719o5162
$$ plain form
6681 -25975 -18086 -28975 -38408 -32835 -24329 -31773 -35153 -57172 -49483 -40952 -57676 -53730 -17615 -30068
6667 -30068 -42708 -59398 -50746 -58095 -53859 -66994 -52844 -49956 -68329 -67628 -60919 -53910 -45190 -24033
6653 -24033 -43448 -60677 -43799 -46732 -28753 -28549 -44089 -37120 -52571 -51652 -58639 -63657 -67391 -79899
6639 -79899 -113473 -111713 -120805 -122754 -91550 -68823 -54408 -49342 -15184 -3251 -18802 -29116 -10430
6626 -10430 1307 -19671 -23895 -4964 61435 176823 260035 251336 194741 118049 83599 64314
6614 64314 55554 77473 117567 152990 197082 282005 397211 564370 754850 1070231 1559258
6603 1559258 2421464 4039023 6903028 11140151 13984934 12091577 8067067 4951123
6595 4951123 3260987 2385454 1862667 1523493 1237237 986102 814561 673194 593475 528313
6585E28313n7812n4265l1204K7701J4624J7339P3847N8731n5163j48120j02402
6574B71589m8437k8074k3093k713J569j25q076r887k5971k9109j7237j2782R368
6561G7022J9040j4317J8932K1650o50k8499k9406k4917L4173J9775P00k2840j7926
6548E2737k951q790j6501J5495L8837j9607k5495o756j5629J0311J142j0775K1953
6535C3971K1065k4243N32J5698n43P26Q028j1821j4994Q491p83M508N088k0894
6521B4829j1425J5395J5120m7459p014K9314k6359o884p047j0156J7046K2066
6509G426K4764o75m006j0802m924j7597j3953K4513K5406J1038k8736j4624m635
6496f805n611J4692q672n137j3877O165J5541k163J1715K3594q584L602k4544
$$ plain form
6585 528313 470501 416236 385032 412733 427357 444696 518543 577274 522111 373991 271589
6574 271589 223152 195078 171985 169272 170841 170716 162640 152753 126782 97673 80436 67654 77022
6561 77022 96062 81745 100677 122327 121677 93178 63772 38855 73028 92803 93503 70663 52737
6548 52737 49786 40996 24495 39990 78827 59220 33725 26969 11340 21651 22793 12018 33971
6535 33971 55036 30793 31325 47023 46480 47206 55234 43413 28419 36910 36127 40635 45723 24829
6521 24829 13404 28799 43919 -3540 -10554 18760 -7599 -14483 -21530 -31686 -14640 7426
6509 7426 32190 31515 27509 16707 11783 -5814 -19767 4746 30152 41190 12454 -2170 -6805
6496 -6805 -12416 2276 -6396 -11533 -25410 -19245 -3704 -5867 5848 29442 20858 24460 -84
6483h4l6736J131J2741P538J4242o307k9817K7171J3506N663K521J7509J2594
6470D1672o000q151n151p974k1292J4931J0236k7861J366L1746M930j9397j0391
6457a336O66K102o730k1929M404P421L986N967N595L686n47K5778P551q247j3081
6442A5286l0616j6787l986j4394K0959K9297m089N417K8705J2183k5726k5711
6430i462J2422R047R334j7328j1158k0646k7385N270j5389j021m565J149L2499
6417c7233K1687N904K2283O305k6724j1080J8658N678k4040k2094j0109O651m369
6404d8483o280k520J0480L2769P734L798K8391J7638k3920k3935M629K5021j6241
6391I081k0945L144O906q821J0333J1306M177M24j8136n044K8811j2782j7103
$$ plain form
6483 -84 -36820 -35689 -22948 -15410 -1168 -7475 -37292 -10121 3385 9048 11569 29078 41672
6470 41672 35672 27521 22370 14396 -6896 8035 18271 -9590 -8224 23522 28452 9055 -1336
6457 -1336 -670 1432 -5298 -27227 -22823 -15402 -11416 -5449 146 3832 3285 29063 36614 28367 15286
6442 15286 -15330 -32117 -36103 -50497 -29538 -241 -4330 1087 29792 41975 16249 -9462
6430 -9462 2960 12007 21341 4013 -7145 -27791 -55176 -49906 -65295 -66316 -70881 -69732 -37233
6417 -37233 -15546 -9642 12641 18946 -7778 -18858 -200 5478 -18562 -40656 -50765 -44114 -48483
6404 -48483 -54763 -57283 -46803 -14034 -6300 -2502 25889 43527 19607 -4328 301 25322 9081
6391 9081 -11864 -8720 -1814 -10635 -302 11004 15181 15605 -2531 -7575 21236 8454 -8649
6378h649j4732O031N115j3819j3273J7085o796p43r341j6345j246Q223K2340Q975
6364a7175n209K399O713r876r773J074N829K3721J666P604n665m0042k3103P181
6350e4656O360J7706J5772N30O470L0402J873k7515j0141N929j451j8756K9315
6337A838n108j8675j4810l7378J4863L4662j3859k5766j0320J3818j5512r045
6325h5292P800J3746O450R384L0266J7557o395j0856k1999J7595K4314r930k7305
6312c4665k0271R556L3916L1455j4170k4830j515N554R419L907j4370l856n596
6299b5466O783p794K5782l124j2670q346j5440J0866K6884O667p33j9575j9051
6286c5217j2668o707J068p724j1739k188P836K2293N0659K1838l5555j7572m143
$$ plain form
6378 -8649 -23381 -17350 -12235 -26054 -39327 -22242 -29038 -29781 -39122 -55467 -56713 -48490 -26150 -17175
6364 -17175 -22384 -19985 -13272 -23148 -32921 -31847 -26018 -2297 -631 6973 1308 -38734 -61837 -54656
6350 -54656 -48296 -30590 -14818 -14288 -7818 22584 24457 -3058 -13199 -7270 -8721 -27477 1838
6337 1838 -3270 -21945 -36755 -74133 -59270 -24608 -38467 -64233 -74553 -60735 -76247 -85292
6325 -85292 -77492 -63746 -57296 -47912 -17646 -89 -6484 -17340 -39339 -21744 2570 -7360 -34665
6312 -34665 -54936 -45380 -11464 19991 5821 -19009 -20524 -14970 -5551 -1644 -16014 -19870 -25466
6299 -25466 -18683 -26477 -695 -3819 -16489 -24835 -40275 -29409 -2525 4142 3409 -16166 -35217
6286 -35217 -47885 -54592 -53524 -61248 -72987 -75175 -67339 -45046 5613 27451 -8104 -25676 -29819
6273b9819P039l094J8766R226Q765l654K388J7966o475l2738k3048j513K3949
6260a2242K6554l478L636n441j9544l216l074r017N19J3645M4658n268l7265j9253
6246b8786p061L89R819j255o869k424K6355R191p548l988N099j1999k9829l707
6232e2613L6551K0740L0468l2533l0609j604K5452J8092J2060R933j8799Q517
6220B5655q087j5037j9950j5218r238k1046K9487j2288j5550J3277j0330j798
6208f0123K6642K0537L3199l26O553p186r787j9072j9175p020K0856R707j7093
6195b2288k0651l101Q672K2059J4462K959j1819j1831K443j517J521K6080J0375
6182A7364j7499j8213J0068q875L619J6133j111m0287j3970K2373J6034k2732
$$ plain form
6273 -29819 -22780 -25874 -7108 2118 10883 7229 9617 27583 21108 -11630 -34678 -36191 -12242
6260 -12242 14312 10834 14470 9029 -10515 -13731 -16805 -25822 -25303 -11658 33000 27732 -9533 -28786
6246 -28786 -35847 -35458 -25639 -26894 -33763 -36187 -9832 -641 -8189 -12177 -7078 -19077 -48906 -52613
6232 -52613 -16062 4678 35146 2613 -27996 -29600 -4148 13944 26004 35937 17138 25655
6220 25655 17568 2531 -17419 -32637 -41875 -62921 -33434 -45722 -61272 -47995 -58325 -60123
6208 -60123 -33481 -12944 20255 19929 26482 19296 9509 -9563 -28738 -35758 -14902 -5195 -22288
6195 -22288 -42939 -46040 -37368 -15309 -847 2112 -9707 -21538 -19095 -20612 -19091 6989 17364
6182 17364 -135 -18348 -8280 -17155 -13536 2597 1486 -38801 -52771 -30398 -14364 -37096
6170c7096k0167j2378M264O523J0865o237Q342o945J403J6568J7460j9099j2963
6157d9460K030K031K3127l300l4835J3063L6143K0330N287k0069l0903k3122P035
6144e2643j0051o969R597K2034K0834K8865J1946k4764l7161k3101M1015M1370
6132B0972r619k4562j397j068K1466Q167k7680k7683j2690K0530J0892j7430n074
6119d5176J5774R195O922J4604K957j5745K1761K7990j2277L002k9445k9281J645
6106b8074k648j2984K2967K0455j1535k235J6934R410p451j5745l243j8193k0705
6093e3047J4496K7346J5587m120j2744j3459j0480N377L6799l25k0459n937J6959
6080d007n183k6811J372O875k471K0985N048j7146n056J908m706K2559M429j4205
$$ plain form
6170 -37096 -57263 -69641 -65377 -58854 -47989 -54226 -45884 -52829 -51426 -34858 -17398 -36497 -49460
6157 -49460 -47430 -45399 -22272 -25572 -60407 -47344 -11201 9129 14416 -5653 -36556 -59678 -52643
6144 -52643 -62694 -69663 -60066 -38032 -17198 11667 23613 -1151 -38312 -61413 -20398 20972
6132 20972 11353 -13209 -14606 -15674 5792 13959 -13721 -41404 -54094 -33564 -22672 -40102 -45176
6119 -45176 -29402 -20207 -13285 1319 4276 -11469 10292 38282 26005 29007 -438 -29719 -28074
6106 -28074 -30722 -43706 -20739 -284 -11819 -14054 2880 12290 4839 -10906 -14149 -32342 -53047
6093 -53047 -38551 -11205 4382 262 -12482 -25941 -36421 -31044 5755 5430 -15029 -20966 -4007
6080 -4007 -9190 -36001 -34629 -27754 -30225 -9240 -4192 -21338 -26394 -24486 -29192 -6633 -2204 -16409
6066a6409j74l494k874r171K8713j3138k3761j7903p604M0924M9516p67j0567
6053A3291R877n205j5326k717k4792q135J282M155M279r065J4090J2826K4496
6040A9056l2056l2363k6312j5118N495j2491L9927K6059k162o529J3095j067J030
6027b3436j2032R737k883J1279l702j9686J463K4129J2816j0925r675J0491p014
6014a9438j3580K1437K1749M331r153j0279J3880l41q568K903R619k0520k6646
6001c4606j6754J6604J6248K861N42L74P438k07K861k0687q59Q273L1839K2216
5987C6143P524j3396l7923l2220j0352j8373Q230J2627O954l053J2159J4606L1082
5974A4008L213k2702l387j7792q963J2174k5022n884J5744J6461J0133J463L8
$$ plain form
6066 -16409 -16583 -20077 -22951 -32122 -3409 -16547 -40308 -58211 -65815 -24891 24625 23858 13291
6053 13291 23168 17963 2637 -80 -24872 -33007 -31725 -27570 -23291 -32356 -18266 -5440 19056
6040 19056 -13000 -45363 -71675 -86793 -81298 -93789 -53862 -27803 -29965 -36494 -23399 -24466 -23436
6027 -23436 -35468 -25731 -28614 -17335 -21037 -40723 -39260 -15131 -2315 -13240 -22915 -12424 -19438
6014 -19438 -33018 -11581 10168 14499 5346 -4933 8947 8606 38 2941 12560 -7960 -34606
6001 -34606 -51360 -34756 -18508 -15647 -15105 -14731 -7293 -7500 -4639 -25326 -26185 -17912 13927 36143
5987 36143 43667 30271 -7652 -39872 -50224 -68597 -60367 -47740 -40786 -43839 -31680 -17074 14008
5974 14008 17221 -5481 -8868 -26660 -35623 -23449 -48471 -54355 -38611 -22150 -12017 -10554 -10516
5961a0516j1566j7509l3948K1543J8907k4527k3354R833J7704O97j1546k312R428
5948e7166K1135L985n407Q538N610j6528j930K3255J6660P503m613k1861k4847
5935d5666j307j174K2290L2085l313k2889R414K2492R399j8276m5462j3972L6326
5922b0053J9409m141K752n475J0002n424k2001n789M092M689K093J5528n779l3250
5908d3347K5181J2793k1553p967K30J984N890p147j2444J7744K0911k769M465
5895f029K552p692l4850p944N754j8014J0951J9641J2132R745L170k2033j6951
5882d9568l0614J3508J6051M985J6221J9174J6452j8913k2873p867P401P003O080
5869b2960J6627J694m0595j727P393q198J4675Q609J6797m383j1353K5167j1044
$$ plain form
5961 -10516 -22082 -39591 -73539 -51996 -33089 -57616 -80970 -71137 -53433 -52736 -64282 -66594 -57166
5948 -57166 -36031 -32046 -37453 -28915 -23305 -39833 -41763 -18508 -1848 5655 1042 -20819 -45666
5935 -45666 -46973 -48147 -25857 6228 2915 -19974 -10560 11932 21331 3055 -42407 -56379 -20053
5922 -20053 -644 -4785 -2033 -7508 2494 -2930 -24931 -30720 -26628 -21939 -19846 -4318 -10097 -43347
5908 -43347 -18166 -5373 -26926 -34893 -34663 -32679 -26789 -33936 -46380 -28636 -7725 -10494 -6029
5895 -6029 -3477 -11169 -46019 -53963 -48209 -66223 -55272 -35631 -23499 -13754 -10584 -32617 -49568
5882 -49568 -80182 -66674 -50623 -45638 -29417 -10243 6209 -12704 -35577 -43444 -36043 -29040 -22960
5869 -22960 -6333 -4639 -45234 -46961 -39568 -47766 -33091 -24482 -7685 -12068 -23421 1746 -9298
5856i298j9402q764k8497k3967J7967M488K4815L1245J680j9310J0503r306o169
5843c4015J6838J855L584J1600L196J9552M830n366j825K2045j3689k9232j4627
5830a5254j0414P887j7057q989j3166q070K5954J4286j2718J8118K0539J0134
5818A1250j7713q529J8854k2832l5946p397M142M832k2969K2141K1506r749Q097
5805c4313J9411j7176o219L031m884Q812K3229j8281j6977m933O635L1700L6092
5792B6127j5793k2183k4740k1843P992J5768N574O786l9104J168K4307J830Q938
5779b5173J8004Q418j7961J4305J5662j3476k1192k3894P368O97j3520R413J7991
5766b3358K1382K8478J0904l6123k5813k5488k740O780J6277k7515j4567M305
$$ plain form
5856 -9298 -28700 -37464 -65961 -89928 -71961 -67473 -42658 -11413 -9733 -29043 -18540 -27846 -34015
5843 -34015 -17177 -15322 -11738 -138 3058 22610 27440 22074 20249 42294 28605 -627 -15254
5830 -15254 -25668 -17781 -34838 -43827 -56993 -65063 -39109 -24823 -37541 -19423 1116 11250
5818 11250 -6463 -14992 3862 -18970 -54916 -62313 -58171 -53339 -76308 -54167 -32661 -42410 -34313
5805 -34313 -14902 -32078 -38297 -35266 -40150 -31338 -8109 -26390 -43367 -48300 -41665 -9965 26127
5792 26127 10334 -11849 -36589 -58432 -50440 -34672 -29098 -22312 -61416 -60248 -35941 -34111 -25173
5779 -25173 -7169 1249 -16712 -2407 13255 -221 -21413 -45307 -37939 -37242 -50762 -41349 -23358
5766 -23358 -1976 26502 37406 1283 -24530 -50018 -52758 -45978 -29701 -57216 -71783 -67478
5754f7478j8222j4284R469l427J3345K7577L648J4833Q853j022K4280m725k3342
5741c0495R834K758n967q199k528L181J265r242J5949o529j2466j972q583J6344
5727c6650J9764J8853l674R571J5868k9320r647K2556n096L65l359p674O047K2257
5713A9861j844j4343n946j2306k2847K3625J1860L563o708k0830j3156M889j237
5700c5419J4522j061k1777q356j2369O604j2088J2020M0832J0889M720n021j4806
5687b1310p755Q669M985q12J6833m0784R294J6998J502K146k1390l909J960j1661
5673d5234J102l386O942K5653K932j1971J3570J038k6620j9375j8873k6852j899
5660a02973L6240J7863K6492K0884J4118k3120J2304K2463k6491j6484J9458k41
$$ plain form
5754 -67478 -85700 -99984 -90515 -93942 -80597 -53020 -49372 -34539 -25686 -26708 -2428 -7153 -30495
5741 -30495 -20661 -17903 -23870 -32069 -34597 -31416 -30151 -39393 -23444 -29973 -42439 -44411 -52994 -36650
5727 -36650 -16886 1967 -1707 7864 23732 -5588 -15235 7321 2225 2590 -769 -8443 -2396 19861
5713 19861 18017 3674 -2272 -14578 -37425 -13800 -1940 1623 -5085 -25915 -39071 -34182 -35419
5700 -35419 -20897 -21958 -43735 -52091 -64460 -57856 -69944 -57924 -17092 -6203 -1483 -6504 -21310
5687 -21310 -29065 -20396 -15411 -16223 610 -40174 -30880 -13882 -12380 -10234 -31624 -35533 -33573 -45234
5673 -45234 -44132 -47518 -40576 -14923 -11991 -23962 -10392 -9354 -35974 -55349 -74222 -101074 -102973
5660 -102973 -66733 -48870 -22378 -1494 12624 -10496 1808 24271 -2220 -18704 754 513
5648E13j7984J2355J9332n624l1222M86n321j3597j5967J9114p42K269N063L519
5634b7806m878P832K915P133J7316k5507j9933j317k2510L0505K4361o914j2206
5621c1009j9833j3104n277L0584L1080O954J3694j655j8551O463j3220k1490p865
5608d3229L402j5142j1262J9385K4449O047o906J1754R215j4775J680J3242j412
5595c552j700O880j1779j8257J1026j5782J4795J3020n557l6309L551K3687q545
5582b8522k5087j3442j1334J6078L5643n234q289K2249n957j3004l383Q316J8149
5569a3817J1109R526M455P680M389k2665k2744L597J0966n326j9711J2567k5651
5556d5625k800J7010p33l526j5649L79j712J2281R917M154M873j0879k416R462
$$ plain form
5648 513 -17471 -5116 14216 8592 -22630 -22144 -27465 -41062 -57029 -37915 -38657 -36388 -31325 -27806
5634 -27806 -32684 -24852 -21937 -14804 2512 -22995 -42928 -44245 -66755 -36250 -11889 -18803 -31009
5621 -31009 -50842 -63946 -69223 -38639 -7559 -605 13089 11434 -7117 -654 -13874 -35364 -43229
5608 -43229 -39827 -54969 -66231 -46846 -22397 -16350 -23256 -11502 -2287 -17062 -15382 -2140 -3552
5595 -3552 -5252 1628 -10151 -28408 -17382 -33164 -18369 -5349 -10906 -47215 -43664 -19977 -28522
5582 -28522 -53609 -67051 -78385 -62307 -26664 -31898 -40187 -17938 -23895 -36899 -40282 -31966 -13817
5569 -13817 -2708 6818 11273 18953 23342 677 -22067 -18470 -7504 -12830 -32541 -19974 -45625
5556 -45625 -48425 -31415 -32148 -35674 -51323 -50944 -52656 -40375 -30458 -26304 -21431 -32310 -34726 -25264
5542b5264M595l0N072N174J446m770J473j1171j4578j2218n478J1878K1244k450
5528b5077j8403J3601K6855J6509O462j8395j2867K033o591q35J4384R555j5158
5515g927M927K8088j2683k3353N403R464j420j0884j6256M668l164N394p480n354
5501c0577K5363j81j7061n673J0293P046r186j7653J6273O860Q042J613j5642
5488b0483k969M693J4467k0152k2385j0712j0251J6712J0055j4165o748L2820
5476b9118J5821q712k5039j2070j9579O418K2403K6294J2424J1165j8721m245
5464b2959j1407n477J0815J8104l352k5450k9469J026K2833K3592J6561k3938
5452b9121l2965N740J7941l681J4805M566k0239j2858l539P627J7025M1400n049
$$ plain form
5542 -25264 -20669 -20699 -15627 -10453 -9007 -13777 -12304 -23475 -38053 -50271 -55749 -43871 -22627 -25077
5528 -25077 -43480 -29879 -3024 13485 19947 1552 -11315 -9282 -15873 -16708 -2324 7231 -7927
5515 -7927 -3000 25088 12405 -10948 -5545 3919 2499 -8385 -24641 -19973 -23137 -17743 -25223 -30577
5501 -30577 -5214 -5395 -22456 -28129 -17836 -10790 -19976 -37629 -21356 -14496 -6454 -4841 -20483
5488 -20483 -23452 -18759 -4292 -24444 -46829 -57541 -67792 -51080 -41025 -55190 -61938 -29118
5476 -29118 -13297 -22009 -47048 -59118 -78697 -72279 -49876 -23582 -11158 7 -18714 -22959
5464 -22959 -34366 -39843 -29028 -10924 -14276 -39726 -69195 -68169 -45336 -21744 -5183 -29121
5452 -29121 -62086 -56346 -38405 -42086 -27281 -22715 -42954 -55812 -59351 -51724 -34699 6701 1652
5439A652j2855M051o065k1787j8834j863J9622R781K0761j738j8593q320O442
5426b7746N359J430k6030j0356k0706l618J9611J7594N463O307P7Q322R815J3943
5412e35J2685l1905m448Q089j6012P49Q107K584P287j7127R005P917K193j0061
5398b1472k2822L024j03J26K151P7j1122k0396R797J1135J3541q661p35P528J3840
5383b4092Q853M704j4646J0403r487l202q12N161J6421J4556q950J2510K3877
5370C5296Q607N001k9099l8795r589k201l0124k0543K3826K4450o83K643N940
5357b5271j423J0252l6076J2871L178j7654j9251k1789K6507N512J9060j6725
5345f0809m497K9140K431J4212K9314q511k9477J4566N366n904k403j1613j956
$$ plain form
5439 1652 -11203 -7152 -13217 -35004 -53838 -55701 -36079 -26298 -5537 -7275 -25868 -34188 -27746
5426 -27746 -22387 -20957 -46987 -57343 -78049 -81667 -62056 -44462 -38999 -32692 -32615 -24293 -14478 -535
5412 -535 12150 -19755 -24203 -16114 -32126 -31377 -23270 -20686 -13399 -30526 -21521 -13604 -11411 -21472
5398 -21472 -44294 -41270 -41373 -41247 -39096 -39019 -50141 -70537 -60740 -49605 -36064 -44725 -45460 -37932 -24092
5383 -24092 -15239 -10535 -25181 -14778 -24265 -27467 -28279 -23118 -6697 7859 -1091 11419 35296
5370 35296 43903 48904 19805 -18990 -28579 -30780 -60904 -81447 -57621 -33171 -33854 -31211 -25271
5357 -25271 -26694 -16442 -52518 -39647 -36469 -54123 -73374 -95163 -68656 -63144 -44084 -60809
5345 -60809 -65306 -36166 -33735 -19523 9791 1280 -28197 -13631 -8265 -14169 -16572 -28185 -30141
5332c0141m857j3343O268n602J4220M577K31M823L601j3563l867J1268j2892R296
5318b9981j3323k772J5634K0955j3045M563J9697n612j0657k2882j3089j691K105
5305e0098o535j2855j4747J5734K0684J3791L84J0562J0976J1526J3978p591l570
5292B239k3622q230K325k0466m5564K1578M254j5761L0421K5873M261Q503j5816
5279c0005j9055l821J4054R253j346J6563K7531l945j2188k198j8562j0366P44
5266c3341m1675J7810L2982Q323k42o78K6889J9412j0659p079j1140j5641j7873
5253c2912m907j2266j2144l344J5636R383J7445K0856k1481j3382q809L2787N580
5240g558Q114o836m324l627l5018p494K9998O928J2945R184k8836r605J2163K1121
$$ plain form
5332 -30141 -34998 -48341 -42073 -47675 -33455 -28878 -28647 -23824 -20223 -33786 -37653 -26385 -39277 -29981
5318 -29981 -43304 -46076 -30442 -9487 -22532 -17969 1728 -3884 -14541 -37423 -50512 -52203 -50098
5305 -50098 -56633 -69488 -84235 -68501 -47817 -34026 -33642 -23080 -12104 -578 13400 5809 2239
5292 2239 -21383 -29613 -27288 -47754 -93318 -71740 -67486 -83247 -52826 -26953 -22692 -14189 -30005
5279 -30005 -49060 -52881 -38827 -29574 -30920 -14357 13174 9229 -2959 -5157 -23719 -34085 -33341
5266 -33341 -75016 -57206 -24224 -15901 -16143 -16821 10068 29480 18821 11742 602 -15039 -32912
5253 -32912 -37819 -50085 -62229 -65573 -49937 -40554 -23109 -2253 -23734 -37116 -45925 -13138 -7558
5240 -7558 556 -6280 -10604 -14231 -49249 -56743 -26745 -19817 -6872 2312 -26524 -36129 -23966 -2845
5226b845J3547k0418m9001M756M960O403K4102J0359l740k786j0716j4057m321
5213d3757J808M755Q503k8444j7442K8171k186L829J4592k0540p421J2143K5019
5200b0970J0859j4977j0765m077k2219J484L4775p218k3260R880k565P049L9494
5187b510P88j2685m653n558K3474L3700p224p144J4840j6424k8047j1748N784
5174a7407m550j7370k213L1772K561k5690j9167J1263R738O853N536k2619j1127
5161e2420J7505J8441j9528N457m845r237q494j009K1322J4258Q731J1123j7140
5148a5836M007J2142Q703j1358j4745j5556L0056j3003l8553R126L0466K2964
5136H413K6279j0004j4112m180k2498k8511k36O779J213R155J1138o021K95j9128
$$ plain form
5226 -2845 10702 -9716 -58717 -53961 -49001 -42598 -18496 -8137 -11877 -14663 -25379 -39436 -43757
5213 -43757 -41949 -37194 -28691 -57135 -74577 -46406 -48592 -44763 -30171 -50711 -58132 -45989 -20970
5200 -20970 -10111 -25088 -35853 -39930 -62149 -60665 -25890 -33108 -56368 -46488 -49053 -42004 -2510
5187 -2510 -1722 -14407 -19060 -24618 -1144 32556 25332 18188 33028 16604 -11443 -23191 -17407
5174 -17407 -21957 -39327 -41540 -9768 -7207 -32897 -52064 -40801 -31063 -24210 -18674 -41293 -52420
5161 -52420 -34915 -16474 -36002 -30545 -35390 -44627 -53121 -54130 -32808 -18550 -9819 1304 -15836
5148 -15836 -11829 313 9016 -2342 -17087 -32643 -2587 -15590 -54143 -45017 -14551 8413
5136 8413 34692 24688 10576 6396 -16102 -44613 -44849 -38070 -36857 -27702 -16564 -22585 -22290 -41418
5122d1418K9871K4292n497J4086j4240j3803r316J2024r19q0j9190j987P535K0820
5108B178j2304j2953J0338p123k535K0368K517j0899k920K8143Q985l1044k6063
5095c3312r846M231J6514O340N188q621k837J3227k0910K1287J5552o49k8865
5082b2701p972j0493k0967j3941P845J9256K7903K7234O623r787k7327l5N199
5069a9163J7830P087q91j0203m9247O483J9800K396p021j0720J0091k1403J5532
5056c9429M1342k61L642j8817j2917L191K4083L37j2270r661K894J4930K1404
5043A8468J7335J668p923j5518j6143o828p951K10K2723j1102k1662j535J3725
5030a4533r00k6087k5752k335J6356M104k9568Q283K3990O54m611P538M1323R780
$$ plain form
5122 -41418 -11547 12745 7248 21334 7094 -6709 -16025 -4001 -4920 -5000 -24190 -26177 -18642 2178
5108 2178 -10126 -23079 -12741 -19864 -22399 -2031 486 -10413 -13333 14810 23795 -7249 -33312
5095 -33312 -43158 -38927 -22413 -16073 -10885 -19506 -22343 -9116 -30026 -8739 6813 6164 -22701
5082 -22701 -30673 -41166 -62133 -76074 -68229 -48973 -21070 6164 12787 3000 -24327 -24362 -19163
5069 -19163 -1333 5754 4863 -5340 -54587 -48104 -28304 -25908 -32929 -43649 -33558 -54961 -39429
5056 -39429 1913 1652 5294 -13523 -26440 -23249 834 1171 -11099 -20760 -17866 -2936 18468
5043 18468 35803 37471 29548 14030 -2113 -8941 -16892 -16682 6041 -5061 -26723 -28258 -14533
5030 -14533 -15433 -41520 -67272 -69607 -53251 -49147 -78715 -70432 -46442 -45788 -50399 -42861 -1538 8242
5016H242n340q887j8051R383K0648K1712j1297j3494M470k75j1473k3455j2744
5003d0561k158K5101M325J079j746J5570n341j9576k8471J6545J4985m936O355
4990a8829J5920q76j5606j9382J2940O577q175J8122L7091l399k6127O146K6607
4977C1009l396k803l2898k6715j1667K7493K9948K6408k4572j4050K950R505O487
4964A7699M324O306k939j1873Q327j1335m800M1154n256m5856k0900q737K9163
4951d723R710q330M800K6238l056K0128m872n408l1912l2565J7975L661j2503
4938b0857j1897J2418R073j2310k3075O013n177J0429J5189L3006j4841l954n0732
4925e6715m320l07k3830j6804K5008L1784J0463J0984m386m249N476j4126K3886
$$ plain form
5016 8242 2902 -5985 -24036 -14653 5995 27707 16410 2916 7386 7111 -4362 -27817 -40561
5003 -40561 -42719 -17618 -13293 -12214 -13960 1610 -3731 -23307 -51778 -35233 -20248 -25184 -18829
4990 -18829 -2909 -3785 -19391 -38773 -25833 -19256 -27431 -9309 27782 24383 -1744 4402 31009
4977 31009 27613 24810 -8088 -34803 -46470 -18977 10971 37379 12807 -1243 1707 11212 17699
4964 17699 22023 28329 25390 13517 21844 10509 5709 46863 41607 -4249 -25149 -33886 -4723
4951 -4723 4987 -3343 1457 27695 24639 44767 39895 34487 2575 -29990 -12015 -8354 -20857
4938 -20857 -32754 -20336 -11263 -23573 -46648 -40635 -45812 -35383 -20194 12812 -2029 -5983 -56715
4925 -56715 -61035 -61342 -85172 -101976 -76968 -45184 -34721 -23737 -28123 -32372 -26896 -41022 -17136
4912a7136k511j0719K906R300J6269J9837j4507J4230l2019k9319L531K8174J6857
4899D893p894k3354q621L4265K3580J1505k1425p988j0339j513m10o966k3414
4886c7681r384J3364o326J9147O568k8711p867j743O812l2209n027K1574P867
4873e3616j3811m587J8147K0415j53J2894j2448l013J3344p632k1583R752J5692
4860b6599R205R357j2566o723K3795j0850N85k753k904j606p149L363J7709J4581
4846G445m202j4260j678k6861J4099L8692Q939k081K226j2041L1783k1853k8316
4833h108K5824k7148l5749K1223J2854J1438L13j5040j3393J0591J9088j3810
4821a1917O46K0321K9145L511j1365k0877j7756j5199n828L4140J3764j7625k339
$$ plain form
4912 -17136 -19647 -30366 -27460 -18160 -1891 17946 3439 17669 -14350 -43669 -40138 -11964 4893
4899 4893 -3001 -26355 -34976 -711 22869 34374 12949 4961 -5378 -6891 -7301 -14267 -37681
4886 -37681 -47065 -33701 -40027 -20880 -14312 -43023 -50890 -52633 -45821 -78030 -83057 -61483 -53616
4873 -53616 -67427 -72014 -53867 -33452 -33605 -20711 -33159 -36172 -22828 -30460 -52043 -42291 -26599
4860 -26599 -17394 -8037 -20603 -27326 -3531 -14381 -13796 -16549 -19453 -21059 -28208 -24845 -7136 7445
4846 7445 3243 -11017 -12695 -39556 -25457 13235 22174 20093 22319 10278 42061 20208 -8108
4833 -8108 17716 -9432 -45181 -23958 -11104 334 647 -14393 -27786 -17195 1893 -11917
4821 -11917 -11271 9050 38195 41706 30341 9464 -8292 -23491 -29319 4821 18585 960 -1379
4808a379R185q247j2450j5578o653J2486j9270L719L6483K1857P82j7029m846
4795i40m307k5451j2993R191K5058J3742K2324J8391j3196l677j4382L251j5706
4782A305j3470k0543K0922L6637j2717j1805J4698R240n629j4407k0644m6374
4770f2787l978L2899j5589P306K2887J3026m003j273p411J0435N516j7090j8145
4757c8207m319K6420L0817j7342k1243J1164J0616P494R116j6270l7553j3511
4745e2818J7698j1239j9053k760K6808J3199O628n395J6499N334j6489j2070J548
4732c2110J2531J543p837n478J5131p578R480o412n110L2208l045j0651l1796
4719c9124j9380J7934K0986P589j3291O866p31J9540L4183j519k9238k6495J4179
$$ plain form
4808 -1379 7806 -441 -12891 -28469 -35122 -22636 -41906 -38187 -1704 20153 20935 3906 -940
4795 -940 -5247 -30698 -43691 -34500 -9442 4300 26624 45015 31819 28142 13760 17011 1305
4782 1305 -12165 -32708 -11786 24851 12134 329 15027 24267 18638 4231 -16413 -62787
4770 -62787 -66765 -33866 -49455 -42149 -19262 -6236 -10239 -11512 -18923 -8488 -2972 -20062 -38207
4757 -38207 -42526 -16106 14711 -2631 -23874 -12710 -2094 5400 14516 -1754 -39307 -52818
4745 -52818 -35120 -46359 -65412 -68172 -41364 -28165 -21537 -26932 -10433 -5099 -21588 -33658 -32110
4732 -32110 -19579 -18036 -25873 -31351 -16220 -23798 -14318 -20730 -25840 6368 3323 -7328 -39124
4719 -39124 -58504 -40570 -19584 -11995 -25286 -18420 -19151 389 34572 33053 3815 -22680 -8501
4706h501K1904o259J4866J1752k6928j6258l4681j0982P671L8777j1901j1549
4694c2089o212K5264J2136J118J2321q172q766k0269j8972O438n960k2825n788
4681g1776j1929j383J6032K0235N008L5229J2361m250J7986J9413k2334l8918
4669b4326p303n713l457J5657m862j6819j6689N62J1418J3137K2257J8612J8790
4656B1264j6736j8579j33k1454m037J7538Q273j8628o310R032l363r128J8039
4643b4222O130J4313L1531J9810o298l542l1528M855n026K6030J2739k4341N430
4630B5881j8246n137Q130R098j6441j1977j5342k111l931J2066J2027J2050q490
4617b423k7414j3119m98M388K2609m784k9483j8212L0771J0896j2043K9149J5719
$$ plain form
4706 -8501 13403 7144 22010 33762 6834 -9424 -44105 -55087 -47416 -8639 -20540 -32089
4694 -32089 -38301 -13037 -901 217 12538 4366 -4400 -24669 -43641 -37203 -43163 -65988 -71776
4681 -71776 -83705 -85088 -69056 -48821 -43813 -8584 3777 -473 17513 36926 14592 -24326
4669 -24326 -31629 -37342 -40799 -25142 -30004 -46823 -63512 -62950 -51532 -38395 -16138 2474 21264
4656 21264 4528 -14051 -14184 -35638 -39675 -22137 -13864 -32492 -38802 -29770 -33133 -42261 -24222
4643 -24222 -18092 -3779 27752 47562 41264 37722 6194 11049 6023 32053 44792 20451 25881
4630 25881 7635 2498 10628 19726 3285 -8692 -24034 -26145 -30076 -18010 -5983 6067 -2423
4617 -2423 -29837 -42956 -43454 -39066 -16457 -21241 -50724 -68936 -38165 -27269 -39312 -10163 5556
4604E556K454k6726j7550J6033J2945J4551N854n094j0136j1908l1693j2196N534
4591e2376J1988N601o958K136J3386j5524o486j4216N937J9752k5434L57j1765
4578g3602J7364K1502M863p665J9242m406J1238J0773j0705j8580J4093j4202
4566c0085r446r183j2937K301m542M485j1013j2709O2635L9967K0117k8099m1360
4553b9869L064O648k1969L504J9583P113j2377k3620k512k963j3775K224J4237
4540e0712J7227J8679L4302m975j4735K1175k072l0073m995Q500J6254j5462l5119
4527d2006M01o266N681K7735j977k0240L568J2362R840j0189j4871n334L730J300
4513c6266J3554J7569P745k8616K0140J3688k2556k0930l934Q374k549J147m640
$$ plain form
4604 5556 8010 -18716 -36266 -20233 -7288 7263 13117 8023 -2113 -14021 -45714 -57910 -52376
4591 -52376 -40388 -34787 -41745 -39609 -26223 -41747 -48233 -62449 -56512 -36760 -62194 -61837 -73602
4578 -73602 -56238 -34736 -29873 -37538 -18296 -22702 -11464 -691 -11396 -29976 -15883 -30085
4566 -30085 -39531 -48714 -61651 -59350 -63892 -59407 -70420 -83129 -20494 19473 39590 11491 -29869
4553 -29869 -26805 -20157 -42126 -38622 -19039 -11926 -24303 -47923 -50435 -53398 -67173 -64949 -50712
4540 -50712 -33485 -14806 19496 14521 -214 20961 18889 -11184 -16179 -7679 8575 -6887 -42006
4527 -42006 -41605 -47871 -42190 -14455 -16432 -36672 -33104 -20742 -10902 -21091 -35962 -41296 -37566 -36266
4513 -36266 -22712 -5143 2602 -26014 -5874 7814 -14742 -35672 -39606 -31232 -33781 -32634 -37274
4500c7274J2297J5404k5476k3647N975K1852N306O126J6750M355K1665O286j517
4487B8102m8498k3196j374o329K0699K5710K5025l011m6047N350n061J6904J9889
4474H163m3099j1971o782K7857R204J1693j563j4791k0044J670J7496L3407n390
4461E850P481O517n879j1803k944j7196j5666Q128P056q158k768K8251J0181p231
$$ plain form
4500 -37274 -24977 -9573 -35049 -58696 -52721 -30869 -25563 -19437 -2687 1668 23333 29619 28102
4487 28102 -20396 -43592 -44966 -51295 -30596 -4886 20139 17128 -28919 -23569 -28630 -11726 8163
4474 8163 -34936 -46907 -53689 -25832 -16628 -4935 -6498 -21289 -41333 -39663 -22167 11240 5850
4461 5850 13331 19848 13969 2166 -778 -17974 -33640 -25512 -18456 -26614 -29382 -1131 9050 1819
$$ [...]
##END NTUPLES=NMR SPECTRUM
##END=
