##TITLE=Analysis number 328556
Compound Code cc 49502
Book Reference 486/156
Project Code adrs
Chemist Name simons
cloudy
##JCAMPDX= 6.0         $$ Bruker NMR JCAMP-DX V2.0
##DATA TYPE= NMR SPECTRUM
##DATA CLASS= NTUPLES
##ORIGIN= Bruker BioSpin GmbH
##OWNER= nmr
$$ XWIN-NMR		Version 3.5
$$ Fri Jun 15 10:21:07 2007 GMT Daylight Time (UT+1h)  MAYBRIDGE\nmr@NMR_250MHZ
##.OBSERVE FREQUENCY= 250.131544655141
##.OBSERVE NUCLEUS= ^1H
##.ACQUISITION MODE= SIMULTANEOUS (DQD)
##.ACQUISITION SCHEME= undefined
##.AVERAGES= 16
##.DIGITISER RES= 18
##SPECTROMETER/DATA SYSTEM= dpx250
##.PULSE SEQUENCE= zg30
##.SOLVENT NAME= CDCl3
##.SHIFT REFERENCE= (INTERNAL, CDCl3, 0, 16.4549)
##AUDIT TRAIL= $$ (NUMBER, WHEN, WHO, WHERE, WHAT)
$$ ##TITLE= Audit trail, XWIN-NMR		Version 3.5
$$ ##JCAMPDX= 5.01
$$ ##ORIGIN= Bruker BioSpin GmbH
$$ ##OWNER= nmr
$$ C:\u/data/dgb/nmr/ADRS/980/pdata/1/auditp.txt
$$ ##AUDIT TRAIL=  $$ (NUMBER, WHEN, WHO, WHERE, WHAT)
(   1,<2007-06-15 10:20:46.21 +100>,<MAYBRIDGE\nmr>,<NMR_250MHZ>,
      <created by zg, POWCHK disabled, PULCHK disabled
       configuration hash MD5:
       76 6E 9A 78 1E 09 19 81 EC 84 63 8F B0 6A 59 2D
       data hash MD5: 64K
       27 AC A7 6C 47 FF B6 08 F9 42 9D 65 B5 E5 A1 1A>)
(   2,<2007-06-15 10:20:57.66 +100>,<MAYBRIDGE\nmr>,<NMR_250MHZ>,
      <Start of raw data processing
       ef LB = 0.3 FT_mod = 6 PKNL = 1 SI = 32K 
       data hash MD5: 32K
       38 61 87 BD D4 36 85 3E CA C1 B0 8B 9D 20 63 9C>)
(   3,<2007-06-15 10:20:59.67 +100>,<MAYBRIDGE\nmr>,<NMR_250MHZ>,
      <apk 
       data hash MD5: 32K
       09 BA 5D EF 99 A6 A7 70 88 F2 69 6C 36 C8 B6 6C>)
(   4,<2007-06-15 10:21:00.78 +100>,<MAYBRIDGE\nmr>,<NMR_250MHZ>,
      <abs ABSG = 5 
       data hash MD5: 32K
       EB C3 C0 35 31 62 4A 96 A8 28 0B 2F 99 E5 F8 6E>)
$$ ##END=
$$ 
$$ hash MD5
$$ 64 82 66 91 8B 95 C9 46 A0 FA 24 C0 01 85 9F 93
##$RELAX= 
##$RELAX= 
##$RELAX= 
##$RELAX= 
##$RELAX= 
##$RELAX= 
##$RELAX= 
$$ Bruker specific parameters
$$ --------------------------
##$DU= <C:\u>
##$EXPNO= 980
##$NAME= <ADRS>
##$PROCNO= 1
##$TYPE= <nmr>
##$USER= <dgb>
##$AMP= (0..31)
100 100 100 100 100 100 100 100 100 100 100 100 100 100 100 100 100 100 
100 100 100 100 100 100 100 100 100 100 100 100 100 100 
##$AQSEQ= 0
##$AQ_mod= 3
##$AUNM= <au_zg>
##$AUTOPOS= <8 >
##$BF1= 250.13
##$BF2= 250.13
##$BF3= 250.13
##$BF4= 250.13
##$BF5= 500.13
##$BF6= 500.13
##$BF7= 500.13
##$BF8= 500.13
##$BYTORDA= 1
##$CFDGTYP= 0
##$CFRGTYP= 5
##$CHEMSTR= <none>
##$CNST= (0..31)
1 1 145 1 1 1 1 1 1 1 1 1 1 1 1 1 1 1 1 1 1 1 1 1 1 1 1 1 1 1 1 1 
##$CPDPRG= <>
##$CPDPRG1= <>
##$CPDPRG2= <>
##$CPDPRG3= <>
##$CPDPRG4= <mlev>
##$CPDPRG5= <mlev>
##$CPDPRG6= <mlev>
##$CPDPRG7= <mlev>
##$CPDPRG8= <mlev>
##$CPDPRGB= <>
##$CPDPRGT= <>
##$D= (0..31)
0 1 0 0 0 0 0 0 0 0.06 0 0 0 0 0 0 0.0002 0 0 0 0 0 0 0 0 0 0 0 0 0 0 
0 
##$DATE= 1181899245
##$DBL= (0..7)
120 120 120 120 120 120 120 120 
##$DBP= (0..7)
150 150 150 150 150 150 150 150 
##$DBP07= 0
##$DBPNAM0= <>
##$DBPNAM1= <>
$$ [...]
##$SUBNAM7= <"">
##$SUBNAM8= <"">
##$SUBNAM9= <"">
##$SW= 20.6930455092707
##$SWIBOX= (0..15)
0 0 3 0 0 0 0 0 0 0 0 0 0 0 0 0 
##$SW_h= 5175.983436853
##$TD= 65536
##$TD0= 1
##$TE= 297.16
##$TE2= 300
##$TE3= 300
##$TEG= 300
##$TL= (0..7)
0 120 120 120 120 120 120 120 
##$TP= (0..7)
150 150 150 150 150 150 150 150 
##$TP07= 0
##$TPNAME0= <>
##$TPNAME1= <>
##$TPNAME2= <>
##$TPNAME3= <>
##$TPNAME4= <>
##$TPNAME5= <>
##$TPNAME6= <>
##$TPNAME7= <>
##$TPOAL= (0..7)
0.5 0.5 0.5 0.5 0.5 0.5 0.5 0.5 
##$TPOFFS= (0..7)
0 0 0 0 0 0 0 0 
##$TUNHIN= 0
##$TUNHOUT= 0
##$TUNXOUT= 0
##$USERA1= <user>
##$USERA2= <user>
##$USERA3= <user>
##$USERA4= <user>
##$USERA5= <user>
##$V9= 5
##$VALIST= <valist>
##$VCLIST= <CCCCCCCCCCCCCCC>
##$VD= 0
##$VDLIST= <DDDDDDDDDDDDDDD>
##$VPLIST= <PPPPPPPPPPPPPPP>
##$VTLIST= <TTTTTTTTTTTTTTT>
##$WBST= 1024
##$WBSW= 4
##$XGAIN= (0..3)
0 0 0 0 
##$XL= 0
##$YL= 0
##$YMAX_a= 484470
##$YMIN_a= -396258
##$ZGOPTNS= <>
##$ZL1= 120
##$ZL2= 120
##$ZL3= 120
##$ZL4= 120
##$ABSF1= 16.45492
##$ABSF2= -4.238253
##$ABSG= 5
##$ABSL= 3
##$ALPHA= 0
##$AQORDER= 0
##$ASSFAC= 0
##$ASSFACI= 0
##$ASSFACX= 0
##$ASSWID= 0
##$AUNMP= <proc_1d>
##$AZFE= 0.1
##$AZFW= 0.1
##$BCFW= 0
##$BC_mod= 0
##$BYTORDP= 0
##$COROFFS= 0
##$CY= 12.5
##$DATMOD= 1
##$DC= 0
##$DFILT= <>
##$DTYPP= 0
##$F1P= 14.0000005364418
##$F2P= -0.99999901652339
##$FCOR= 0.5
##$FTSIZE= 32768
##$FT_mod= 6
##$GAMMA= 0
##$GB= 0
##$INTBC= 1
##$INTSCL= 1
##$ISEN= 128
##$LB= 0.3
##$LEV0= 0
##$LPBIN= 0
##$MAXI= 10000
##$MC2= 0
##$MEAN= 0
##$ME_mod= 0
##$MI= 0
##$NCOEF= 0
##$NC_proc= -2
##$NLEV= 6
##$NOISF1= 0
##$NOISF2= 0
##$NSP= 0
##$NTH_PI= 0
##$NZP= 0
##$OFFSET= 16.45492
##$PC= 1
##$PHC0= -55.59985
##$PHC1= 8.091397
##$PH_mod= 1
##$PKNL= yes
##$PPARMOD= 0
##$PSCAL= 4
##$PSIGN= 0
##$REVERSE= no
##$SF= 250.130016777884
##$SI= 32768
##$SIGF1= 0
##$SIGF2= 0
##$SINO= 400
##$SIOLD= 32768
##$SREGLST= <1H.CDCl3>
##$SSB= 0
##$STSI= 32768
##$STSR= 0
##$SW_p= 5175.98343685301
##$SYMM= 0
##$S_DEV= 0
##$TDeff= 65536
##$TDoff= 0
##$TI= <Analysis number 999999
Compound Code 99
Book Reference 9
Project Code 9>
##$TILT= no
##$TM1= 0
##$TM2= 0
##$TOPLEV= 0
##$USERP1= <user>
##$USERP2= <user>
##$USERP3= <user>
##$USERP4= <user>
##$USERP5= <user>
##$WDW= 1
##$XDIM= 32768
##$YMAX_p= 507320699
##$YMIN_p= -58827
$$ End of Bruker specific parameters
$$ ---------------------------------
##NTUPLES= NMR SPECTRUM
##VAR_NAME=  FREQUENCY,     SPECTRUM/REAL,   SPECTRUM/IMAG
##SYMBOL=    X,             R,               I
##VAR_TYPE=  INDEPENDENT,   DEPENDENT,       DEPENDENT
##VAR_FORM=  AFFN,          ASDF,            ASDF
##VAR_DIM=   32768,         32768,           32768
##UNITS=     HZ,            ARBITRARY UNITS, ARBITRARY UNITS
##FACTOR=    0.157963299565203, 1,           1
##FIRST=     4115.86936942056, 0,            0
##LAST=      -1060.11406743245, 0,           0
##MIN=       -1060.11406743245, -58827,      0
##MAX=       4115.86936942056, 507320699,    0
$$ Real data points
##PAGE= N=1
##DATA TABLE= (X++(R..R)), XYDATA
$$ [...]
17152b2953o07J901p211q112l22N42L824N245O839J1533J127m806q695r130j049
$$ -22953 -23560 -21659 -28870 -36982 -37304 -36762 -32938 -27693 -20854 -9321 -8194 -13000 -21695 -30825 -31874
17137c1874R792L326N959N563N867k869j1256K36m554L230J2167O983j2201n989
$$ -31874 -22082 -18756 -12797 -7234 -1367 -4236 -15492 -15256 -19810 -16580 -4413 2570 -9631 -15620
17123a5620m941L650m369J974n203k92J56P474j1537o218K5208K0948j017j7819
$$ -15620 -20561 -16911 -21280 -19306 -24509 -24801 -24645 -17171 -28708 -34926 -9718 11230 10213 -7606
17109g606j0939m17J1561P322J407j3409j0502o69L505n258J0945L746L438J681
$$ -7606 -18545 -18962 -7401 -79 1328 -12081 -22583 -23252 -19747 -25005 -14060 -10314 -6876 -5195
17095e195l087j959k585k0846j476J0526K024O590j903j0863M449N574J826k030
$$ -5195 -8282 -10241 -12826 -33672 -35148 -24622 -22598 -16008 -17911 -28774 -24325 -18751 -16925 -18955
17081a8955o991J4036M959j545J254Q490J663r26p462j1042N929J1144n124j0766
$$ -18955 -25946 -11910 -6951 -8496 -7242 1248 2911 1985 -5477 -16519 -10590 554 -4570 -15336
17067a5336p979N752J1872L213J3814Q597q605j7174l682l513j443N112q578j1980
$$ -15336 -23315 -17563 -5691 -2478 11336 19933 11328 -5846 -9528 -13041 -14484 -9372 -17950 -29930
17053b9930q2J0451q484r911j6432N474J6938R861q894P282J8010R997n320o422
$$ -29930 -30012 -19561 -28045 -37956 -54388 -48914 -31976 -22115 -31009 -23727 -5717 4280 -1040 -7462
17039g462O26M848k255j0436R362J6057P736n206r140l052N331m440Q22P1q099
$$ -7462 -6836 -1988 -4243 -14679 -5317 10740 18476 13270 4130 1078 6409 1969 2791 2862 -5237
17024e237j5691q77j000J4478P689p580j045J8436j928j7951j4183J09K879J2432
$$ -5237 -20928 -21805 -22805 -8327 -638 -8218 -9263 9173 7245 -10706 -24889 -24780 -21901 -9469
17010i469k84p058m488l975N896J972J0932M956P770J956m985n204j3102Q69l341
$$ -9469 -9753 -16811 -21299 -25274 -19378 -17406 -6474 -1518 6252 8208 3223 -1981 -15083 -14214 -17555
16995a7555J893j113o00N267J5776N561K21m481M72J466m03L00p742K86K51K067
$$ -17555 -15662 -16775 -17375 -12108 3668 9229 9450 4969 5441 6907 6504 6804 -938 -652 -401 1666
16979A666Q24l729j0568K932K833M96k497O949O131K490j0316l054J042N597L340
$$ 1666 2490 -1239 -11807 -8875 -6042 -5546 -8043 -1094 5037 7527 -2789 -5843 -4801 796 4136
16964D136n799k216N129q372n478j1654j1628p221J0351J5458K3434N387o972
$$ 4136 -1663 -3879 1250 -7122 -12600 -24254 -35882 -43103 -32752 -17294 6140 11527 4555
16951D555n338r499l925q68K3560N336l253j0678q317l195K893L047K235r414
$$ 4555 -783 -10282 -14207 -15075 8485 13821 10568 -110 -8427 -11622 -8729 -5682 -3447 -12861
16937a2861J2327j860O144p929r222J3966L312j0696j1706M278K1623m699j6810
$$ -12861 -534 -2394 3750 -4179 -13401 565 3877 -6819 -18525 -14247 7376 2677 -14133
16924a4133l235N3L333l97N28M100o102M95R968L530r050q099o024N183R509L997
$$ -14133 -17368 -17315 -13982 -14379 -13851 -9751 -15853 -15358 -5390 -1860 -10910 -19009 -25033 -19850 -10341 -6344
16908f344p801o921Q275j569O513R867J1229o273m223P141l169j4382j0743O979
$$ -6344 -14145 -21066 -12791 -14360 -7847 2020 13249 6976 2753 9894 6725 -7657 -18400 -11421
16894a1421L509N620j566N503j0487j0451k205n195P7L706K152N197J4008m566
$$ -11421 -7912 -2292 -3858 1645 -8842 -19293 -21498 -26693 -26616 -22910 -20758 -15561 -1553 -6119
16880f119J143M536j5253j954K625p318R705N531Q854N563m594R901M400p121
$$ -6119 -4976 -440 -15693 -17647 -15022 -22340 -12635 -7104 1750 7313 2719 12620 17020 9899
16866I899J210L346k0571j3558K387N831J2966J390J0302m695p694j703J470O663
$$ 9899 11109 14455 -6116 -19674 -17287 -11456 1510 2900 13202 8507 813 -890 580 7243
16852G243q655p864R0l667l582Q529J3865k571M368r03J551l794o412M388n437
$$ 7243 -1412 -9276 -9186 -12853 -16435 -7906 5959 3388 7756 6853 8404 4610 -1802 2586 -2851
16837b851q451R010N483R891o270j0821j287n70j3407J14K613K770K85O43j098
$$ -2851 -11302 -2292 3191 13082 6812 -4009 -5296 -5866 -19273 -19159 -16546 -13776 -13491 -12848 -13946
16822a3946j374L415j678L145L591N951n058p344k104o954j264J3238k163j0490
$$ -13946 -15320 -11905 -13583 -10438 -6847 -896 -5954 -13298 -15402 -22356 -23620 -10382 -12545 -23035
16808b3035l17P414K315m904M990P966M091K76J0328N476J552j3547m786L802
$$ -23035 -23352 -15938 -13623 -18527 -13537 -5571 -1480 -1204 9124 14600 16152 2605 -2181 1621
16794A621l106j147L960m963p423k990O163r824l250J4851q12r191j661L814J5681
$$ 1621 -1485 -2632 1328 -3635 -11058 -14048 -7885 -17709 -20959 -6108 -6920 -16111 -17772 -13958 1723
16779A723j7m597J2878p892j9776n546J6938M200m572k804j3826j591R99j457
$$ 1723 1706 -2891 9987 2095 -17681 -23227 -6289 -2089 -6661 -9465 -23291 -24882 -23883 -25340
16765b5340j632J5035R462l449J533j82K156M644p345R751m918j4554Q262M832
$$ -25340 -26972 -11937 -2475 -5924 -4391 -4573 -2417 2227 -5118 4633 -285 -14839 -6577 -1745
16751a745m812k172K030P708l203n383q6p33o390L497J0530M962O458j0373q563
$$ -1745 -6557 -8729 -6699 1009 -2194 -7577 -7663 -8396 -14786 -11289 -759 4203 10661 288 -8275
16736h275O622m743N246j4655K157L348R686O8k514j0491o150O982J6389m585
$$ -8275 -1653 -6396 -1150 -15805 -13648 -10300 -614 -546 -3060 -13551 -19701 -12719 3670 -915
16722i15k725k701J1470J020j3243J49J5546L914o870k320j3212m392Q724n26
$$ -915 -3640 -6341 5129 6149 -7094 -6945 8601 12515 5645 3325 -9887 -14279 -5555 -6081
16708f081k676K119j476P378m827r285k862n354Q785J1438J853m587m197l846
$$ -6081 -8757 -6638 -8114 -736 -5563 -14848 -17710 -23064 -14279 -2841 -988 -5575 -9772 -13618
16694a3618K348K755r534l94P227J5474J1894Q47k772j1398j6687O454K975N496
$$ -13618 -11270 -8515 -18049 -18443 -11216 4258 16152 16999 14227 2829 -13858 -7404 -4429 1067
16680A067K288L686l246j5401q509o08k988J5920k436o614j25P95R249K226m054
$$ 1067 3355 7041 3795 -11606 -20115 -20723 -23711 -7791 -10227 -16841 -16966 -16171 -6922 -4696 -8750
16665h750J981P433m653n44n638J717q155l901K835p757L309M380J3267P165Q343
$$ -8750 -6769 664 -3989 -4533 -10171 -8454 -16609 -20510 -17675 -25432 -22123 -17743 -4476 2689 11032
16650A1032K218p57j473n154p906p809R072R6O843l339P65o230k688M296p310
$$ 11032 13250 12493 11020 5866 -2040 -9849 -777 -681 6162 2823 3588 -2642 -5330 -1034 -8344
16635h344j0699J2440l497J638j791k728K986J961r110j7161j1797J4171J2131
$$ -8344 -19043 -6603 -10100 -8462 -10253 -12981 -9995 -8034 -17144 -34305 -46102 -31931 -19800
16622a9800O603L293n923r568J9505J5636m61j2092j4604j2905J4310K2622K565
$$ -19800 -13197 -9904 -15827 -25395 -5890 9746 9285 -2807 -17411 -30316 -16006 6616 9181
16609I181N156M097R05o367j3224K356k551r114q237j190J1540L921j4315m562
$$ 9181 14337 18434 19339 12972 -252 2104 -447 -9561 -17798 -18988 -7448 -3527 -17842 -22404
16595b2404l76K377J4209L774K000Q216O901o557l215k058o77O01k21j1964J820
$$ -22404 -22780 -20403 -6194 -2420 -420 7796 14697 8140 4925 2867 2190 2791 2570 -9394 -7574
16580g574P304m557n169m180J472n228L055K541K338J507k27j763l767j2196m877
$$ -7574 -270 -4827 -9996 -14176 -12704 -17932 -14877 -12336 -9998 -8491 -8718 -10481 -14248 -26444 -31321
16565c1321J6414J6566M463j6251j3305J8968O084j3088N29N203o079P70j751
$$ -31321 -14907 1659 6122 -10129 -23434 -4466 1618 -11470 -10941 -5738 -11817 -11047 -12798
16552a2798k843J4668K876j2886J0440L891j704o851l049P34j2122K995R358j582
$$ -12798 -15641 -973 1903 -10983 -543 3348 1644 -5207 -8256 -7522 -19644 -16649 -7291 -8873
16538h873p222J0764J056m225L545N738k016j3802m444O721M871Q107Q49L030
$$ -8873 -16095 -5331 -4275 -8500 -4955 783 -1233 -15035 -19479 -12758 -7887 220 1069 4099
16524D099P765P240o812q063j886p287L690r79O624J908j4423j214L789R31k743
$$ 4099 11864 19104 12292 4229 2343 -4944 -1254 -2233 4391 6299 -8124 -9338 -5549 -4618 -7361
16509g361L599P106J2610J3092J670m559j7212J927N989O686j707j4069q267l257
$$ -7361 -3762 3344 15954 29046 30716 26157 8945 10872 16861 23547 21840 7771 -496 -3753
16495c753L609J480p092j0915J297j2096P346J667n396j933O304O048P302R794
$$ -3753 -144 1336 -5756 -16671 -15374 -27470 -20124 -18457 -23853 -25786 -19482 -13434 -6132 3662
16481C662p42p534j144p136M433K077O26j188n782m210k764J0226m009Q204Q580
$$ 3662 2920 -4614 -5758 -12894 -8461 -6384 -5758 -6946 -12728 -16938 -19702 -9476 -13485 -5281 3299
16466C299N357M99q391q373r312k627L100l310K361M247P292r647q828l185J0507
$$ 3299 8656 9155 764 -7609 -16921 -19548 -16448 -19758 -17397 -13150 -5858 -15505 -24333 -27518 -17011
16451a7011M750k287Q01J0363p663o381K864J0297P199P40n380j110K248N816
$$ -17011 -12261 -14548 -13747 -3384 -11047 -17428 -14564 -4267 2932 3672 -1708 -2818 -570 5246
16437E246o66J556l58p623j0342k768M176q5j0516o1J0454P860J0337j0533r284
$$ 5246 4580 6136 5778 -1845 -12187 -14955 -10779 -10864 -21380 -21441 -10987 -3127 7210 -3323 -12607
16422a2607l233J2088J3969p946j0726J090M739j881p517o992o430Q604Q175P325
$$ -12607 -15840 -3752 10217 2271 -8455 -7365 -2626 -4507 -12024 -19016 -25446 -16842 -8667 -1342
16408a342Q752M475j2856J746J0533n485k927L399j0585m544P413n565j0259j449
$$ -1342 7410 11885 -971 775 11308 5823 2896 6295 -4290 -8834 -1421 -6986 -17245 -18694
16394a8694K696l478N364J3603J5295j871j1926k361o20j686M763n236M360J562
$$ -18694 -15998 -19476 -14112 -509 14786 12915 989 -1372 -1992 -3678 1085 -4151 209 1771
16380A771K845p117r430p230J32O418j58J0869J4983L312q392j1727m353P5P60
$$ 1771 4616 -2501 -11931 -19161 -19029 -12611 -12769 -1900 13083 16395 8003 -3724 -8077 -8002 -7242
16365g242n333M26p624K815J1435q897j3389j390O954O690J564o075m621m954
$$ -7242 -12575 -12149 -19773 -16958 -5523 -14420 -27809 -29199 -22245 -15555 -13991 -20066 -24687 -29641
16351b9641Q448J0114K954j515p40j51Q100n376m513J629J1636J706m643J0314
$$ -29641 -21193 -11079 -8125 -9640 -10380 -10531 -2431 -7807 -12320 -10691 945 2651 -1992 8322
16337H322j991K920q349j5516l235K416n378p547J3790O759J045n220P346L924
$$ 8322 6331 9251 902 -14614 -17849 -15433 -20811 -28358 -14568 -7809 -6764 -11984 -4638 -714
16323g14q178n36n027n660r68q37o582r218O388Q218P086M476J228p177o159J0044
$$ -714 -8892 -9428 -14455 -20115 -21083 -21920 -28502 -37720 -31332 -23114 -16028 -11552 -10324 -17501 -23660 -13616
16307a3616J0767m465m134l052l133m913O212O416N673N548n925n216K798l74
$$ -13616 -2849 -7314 -11448 -14500 -17633 -22546 -16334 -9918 -4245 1303 -4622 -9838 -7040 -7414
16293g414O023J2113J355o90j3702j2948J397J607K57n086K258P805m442J4576
$$ -7414 -1391 10722 12077 11387 -2315 -15263 -13866 -12259 -12002 -17088 -14830 -7025 -11467 3109
16279C109l136j085k270j6180o439R088n619M543M150O502K179J786q231m750
$$ 3109 -27 -1112 -3382 -19562 -26001 -16913 -22532 -17989 -13839 -7337 -5158 -3372 -11603 -16353
16265a6353L52J2710j460p204j989M341m15J452n11P528j5014j2913J3152J2732
$$ -16353 -16001 -3291 -4751 -11955 -13944 -9603 -10018 -8566 -9077 -1549 -16563 -29476 -16324 -3592
16251c592l389l863p922l494m425K705L656N437J4174R363p252N628O244r516
$$ -3592 -6981 -10844 -18766 -22260 -26685 -23980 -20324 -14887 -713 8650 1398 7026 13270 3754
16237C754p052n477n046l901k204m862J2302J8644m957p145L840L514M437J472
$$ 3754 -3298 -8775 -13821 -17722 -19926 -24788 -12486 6158 1201 -5944 -2104 1410 5847 7319
16223G319J0212j190j1000o535j420J1396m312o064M581m049o878m588L681N904
$$ 7319 17531 16341 5341 -1194 -2614 8782 4470 -1594 2987 -1062 -7940 -12528 -8847 -2943
16209b943j728M506Q807J0825j2239o641M302p984n546j0491J0044J3333J8277
$$ -2943 -4671 -165 8642 19467 7228 587 4889 -3095 -8641 -19132 -9088 4245 22522
16196B2522P520j6679j7325O34N533r511J923J750o251n8L049N980o632j785K033
$$ 22522 30042 13363 -3962 -3328 2205 -7306 -5383 -3633 -9884 -9942 -6893 -913 -7545 -9330 -7297
16181g297M224j494K880o003o149J814j579L201j941j084k535O84K363n34J4833
$$ -7297 -3073 -4567 -1687 -7690 -13839 -12025 -13604 -10403 -12344 -13428 -15963 -15279 -12916 -13450 1383
16166A383J6668k35l356q103j186k846m953o467j422L605J6399P535O8p180m712
$$ 1383 18051 17816 14460 6357 5171 2325 -2628 -9095 -10517 -6912 9487 17022 17090 9910 5198
16151E198J917m921j2941L592P712K199Q98K98j644n838K890r655m198J3174J578
$$ 5198 7115 2194 -10747 -7155 557 2756 3654 3952 2308 -3530 -640 -10295 -14493 -1319 259
16136B59k085r550J421R030p663n079j526J3537J0294K351m068k99l889J829j7
$$ 259 -1826 -11376 -9955 -925 -8588 -13667 -15193 -1656 8638 10989 6921 6622 2733 4562 4545
16121D545j0946K183R834N263o594r196n473J0629o977K456M293r835N095J345
$$ 4545 -6401 -4218 5616 10879 4285 -4911 -10384 245 -6732 -4276 17 -9818 -4723 -3378
16107c378j5661N252J8486R664l601r574r102N280j197P297o911k0417m894O937
$$ -3378 -19039 -13787 4699 14363 10762 1188 -7914 -2634 -3831 3466 -3445 -23862 -28756 -21819
16093b1819R646J9874M315k337j3470o684N738N328Q806j225j2443n852J997L06
$$ -21819 -12173 7701 12016 9679 -3791 -10475 -4737 591 9397 8172 -4271 -10123 -8126 -7820
16079g820m444K803J6672J3252r28l671k713P972L673q634j2083M858Q179L98
$$ -7820 -12264 -9461 7211 20463 19535 15864 13151 21123 24796 16162 4079 8937 17116 17514
16065A7514k415n061k773j748q363J100J0465L038K616j2796j4851K589r397M903
$$ 17514 15099 10038 7265 5517 -2846 -1746 8719 11757 14373 1577 -13274 -10685 -20082 -15179
16051a5179R181M695N168o067K067O38M300j50o619l279N184o10J147l742k786
$$ -15179 -5998 -1303 3865 -2202 -135 503 4803 4653 -1966 -5245 -61 -671 476 -3266 -6052
16036f052R185k797p631m650K308o058J293q30q14J7357J529j455l6M005r884
$$ -6052 3133 336 -7295 -11945 -9637 -15695 -14402 -15232 -16046 1311 2840 1385 1349 5354 -4530
16021d530k0294M90J2191k840m435Q619p326m234O879J129K223K753p88l405J931
$$ -4530 -24824 -24334 -12143 -14983 -19418 -10799 -18125 -22359 -15480 -14351 -12128 -9375 -10163 -13568 -11637
16006a1637P537O218L324n62q814M174k063n870L545J045j3334J357J084K373
$$ -11637 -4100 2118 5442 4880 -3934 240 -1823 -7693 -4148 -3103 -16437 -15080 -13996 -11623
15992a1623j141l339O068M269n426l821m146m937J1068n007J26J177M522N06l469
$$ -11623 -12764 -16103 -10035 -5766 -11192 -15013 -19159 -24096 -13028 -18035 -17909 -16732 -12210 -11704 -15173
15977a5173r047l138M940K161O711R915M393j339k180j904j54p8J579L583m066
$$ -15173 -24220 -27358 -22418 -20257 -13546 -3631 762 -577 -2757 -4661 -4815 -4893 -3314 269 -3797
15962c797n310M400J4834o73K246n992K216O052k120k566q366q395p682K182N998
$$ -3797 -9107 -4707 10127 9454 11700 5708 7924 13976 11856 9290 924 -7471 -15153 -12971 -6973
15947f973j0868l53M678j252J170o251L13P551N116o343p529R944O007J161m2
$$ -6973 -17841 -18194 -13516 -14768 -13598 -19849 -19536 -11985 -6869 -13212 -20741 -10797 -4790 -3629 -3671
15932c671l974J0945J469l774j2344k540q791j54J6722J1094k902M276P193L445
$$ -3671 -7645 3300 4769 995 -11349 -13889 -22680 -22834 -6112 4982 2080 6356 13549 16994
15918A6994q437j589l482n799p051P794j64N538k626p920J528N597K287J0933
$$ 16994 8557 6968 3486 -2313 -9364 -1570 -1734 3804 1178 -6742 -5214 383 2670 13603
15904A3603q317Q16p491j3451j821N292J240o45J260P411o11j1205O635J8796
$$ 13603 5286 6102 -1389 -14840 -16661 -11369 -10129 -10774 -9514 -2103 -2714 -13919 -7284 11512
15890A1512j8165r015l154q297J1190M624j317J378O213j63j531j0099k880J725
$$ 11512 -6653 -15668 -18822 -27119 -15929 -11305 -12622 -11244 -5031 -5194 -6725 -16824 -19704 -17979
15876a7979M354L252K853P529M848o301l720R37n221L893L27P931L062q157q102
$$ -17979 -13625 -10373 -7520 9 4857 -1444 -5164 -4227 -9448 -5555 -5228 2703 5765 -2392 -10494
15861a0494r01R29K272N412n909j289m40o406n774l014J6973k262m66m263j132
$$ -10494 -11395 -10466 -8194 -2782 -8691 -9980 -10420 -16826 -22600 -25614 -8641 -10903 -11369 -15632 -16764
15846a6764k257Q048k289j917R311P294k239p964k524l676j510L662Q879L960
$$ -16764 -19021 -10973 -13262 -15179 -5868 1426 -813 -8777 -11301 -14977 -16487 -12825 -3946 14
15832A4j4375J2658P616j1657j8759j947k176o231J4699J6463L873M772J453m916
$$ 14 -14361 -1703 5913 -5744 -24503 -26450 -28626 -34857 -20158 -3695 178 4950 6403 1487
15818A487q533N791O58n009q022J0126N865L514K865N569j2496j2615L207l100
$$ 1487 -7046 -1255 -597 -5606 -13628 -3502 2363 5877 8742 14311 1815 -10800 -7593 -10693
15804a0693j545J1514L891P057l445r614M552N090k3099m349R695J509N791N961
$$ -10693 -12238 -724 3167 10224 6779 -2835 1717 6807 -16292 -20641 -10946 -9437 -3646 2315
15790B315j308K059K059R96j750k789r576P462R781o95l360m625L475j0240J2138
$$ 2315 1007 3066 5125 6121 4371 1582 -7994 -532 9249 8554 5194 569 4044 -6196 5942
15775E942J0583p583j229K514L956J55n040m605r142K717l797m415o496N9R343
$$ 5942 16525 8942 7713 10227 14183 14338 9298 4693 -4449 -1732 -5529 -9944 -16440 -16381 -7038
15760g038L43N235m834j444R513J3014l665n490n619J072j545O837J5094m7j602
$$ -7038 -6695 -1460 -6294 -7738 1775 14789 11124 5634 15 1087 -458 6379 21473 21426 19824
15745A9824m505j5107o942O060K983O511m409q131p17R197n294o740j1213K693
$$ 19824 15319 212 -6730 -670 2313 8824 4415 -3716 -4433 4764 -530 -7270 -18483 -15790
15731a5790O673M296R502J1448n077o508j263p247l45K628R863o905l644N899
$$ -15790 -9117 -4821 4681 16129 11052 4544 3281 -3966 -4311 -1683 8180 1275 -2369 3530
15717C530k296n087L569j654N02Q029J110j1848k918r80j119r908j2006O848J4079
$$ 3530 1234 -3853 -284 -1938 -1436 6593 7703 -4145 -7063 -8043 -9162 -19070 -31076 -24228 -10149
15702a0149J1108K358j2282l092q914N961L117j069N094p75k071J0111L414n003
$$ -10149 959 3317 -8965 -12057 -20971 -15010 -11893 -12962 -7868 -8643 -10714 -603 2811 -2192
15688b192m204l692r199J555j0364k016K766J0078M388M101O567j771l607k688
$$ -2192 -6396 -10088 -19287 -17732 -28096 -30112 -27346 -17268 -12880 -8779 -2212 -3983 -7590 -10278
15674a0278Q563J2122o557q461M932J225j3789l776o102l183K0330O33N701J3063
$$ -10278 -1715 10407 3850 -4611 321 1546 -12243 -16019 -22121 -25304 -4974 -4341 1360 14423
15660A4423j4932k1581j1478M711N109k122R322L106O345N57P739N458k353o665
$$ 14423 -509 -22090 -33568 -28857 -23748 -25870 -16548 -13442 -7097 -6540 1199 6657 4304 -2361
15646b361n849j7M858n782m246p265q390O191J0222n213q080J7435N678l903M962
$$ -2361 -8210 -8227 -3369 -9151 -13397 -20662 -29052 -22861 -12639 -17852 -25932 -8497 -2819 -6722 -1760
15631a760P444j626r16O406N009r873j3033o103K43O464J4198R83o742O703M848
$$ -1760 5684 4058 3142 9548 14557 4684 -8349 -14452 -14209 -7745 6453 7436 694 7397 12245
15616A2245q191p766Q252k832j6330k149j694M904O377l60M101K049K581N029
$$ 12245 4054 -3712 4540 1708 -14622 -16771 -18465 -13561 -7184 -7544 -3443 -1394 1187 6216
15602F216l626p240n367q028j0570P637K557J74L259m019l31p43N382J0057J6464
$$ 6216 2590 -4650 -10017 -18045 -28615 -20978 -18421 -18247 -14988 -19007 -19338 -20081 -14699 -4642 11822
15587A1822L792M085m470K471o291j2971k147L442k959k320l419N843M63P419
$$ 11822 15614 19699 15229 17700 11409 -1562 -3709 -267 -3226 -5546 -8965 -3122 -2659 4760
15573D760N421R80N050r089q239M756M525r71j0242j785j4766q93L314r83R960
$$ 4760 10181 11161 16211 7122 -1117 3639 8164 7193 -3049 -4834 -19600 -20493 -17179 -18162 -8202
15558h202n228o243n042J2102M359J793n591n026J1504J0131P29K130P20o686
$$ -8202 -13430 -19673 -24715 -12613 -8254 -6461 -12052 -17078 -5574 4557 5286 7416 8136 1450
15544A450n274k738q142K794M733q048J345O311P877J5865J0305n249r108m779
$$ 1450 -3824 -6562 -14704 -11910 -7177 -15225 -13880 -7569 308 16173 26478 21229 12121 7342
15530G342M849R063j1778k1977O775J9452O939j6380p23j668p936q330N162R550
$$ 7342 12191 21254 9476 -12501 -5726 13726 20665 4285 3562 1894 -6042 -14372 -9210 340
15516C40m211J587K012j194n364P68j0242n494J741R09j582Q953K46r754k59J1999
$$ 340 -3871 -2284 -272 -1466 -6830 -6062 -16304 -21798 -20057 -19148 -20730 -11777 -11531 -21285 -21544 -9545
15500i545L896j730O473J0756R66l751l967q581j3987R76J2326P949r052l391
$$ -9545 -5649 -7379 -906 9850 10816 7065 3098 -5483 -19470 -18494 -6168 1781 -7271 -10662
15486a0662L217R874k101R8o2J171n890n085P341M626m032J491Q003m149P012
$$ -10662 -7445 2429 328 426 364 1535 -4355 -9440 -2099 2527 -1505 -14 7989 3840 10852
15471A0852m219o298n761P430j839P752R750k536j1649r608J924O916o681P155
$$ 10852 6633 335 -5426 2004 165 7917 17667 15131 3482 -6126 -4202 2714 -3967 3188
15457C188R615j2164j3491j142J1623N99k946p105Q624O323P929q189n570j3537
$$ 3188 12803 639 -12852 -13994 -2371 -1772 -4718 -11823 -3199 3124 11053 2864 -2706 -16243
15443a6243L911P789N635m371m089o13L912j1839j247J76P733m450M682m333K577
$$ -16243 -12332 -4543 1092 -3279 -7368 -7981 -4069 -15908 -17155 -16979 -9246 -13696 -9014 -13347 -10770
15428a0770J5819l419j468J771o139J519m809n565p141J0172m544l746N259J448
$$ -10770 5049 1630 162 1933 -4206 -2687 -7496 -13061 -20202 -10030 -14574 -18320 -13061 -11613
15414a1613J791M244M179r6k621K418p39N50l524M228J0337j1534k243q976m585
$$ -11613 -9822 -5578 -1399 -1495 -4116 -1698 -2437 -1887 -5411 -1183 9154 -2380 -4623 -13599 -18184
15399a8184N378K778j692k549K143J2803M642k274R6l019j6834j1188J8351K129
$$ -18184 -12806 -10028 -11720 -14269 -12126 677 5319 3045 3141 122 -16712 -27900 -9549 -7420
15385g420q171k404J2817J3484K108j369o48r25m90M21j550o803r476m082N87
$$ -7420 -15591 -17995 -5178 8306 10414 9045 8397 7472 6982 7403 5853 -950 -10426 -14508 -13921
15370a3921O865j0917M95J1443j954q934P17P25J6578J295j2657k066J5904M973
$$ -13921 -7056 -17973 -17478 -6035 -7989 -16923 -16206 -15481 1097 2392 -10265 -12331 3573 8546
15356H546n451l282N749N51j3888p69m211p614N107M746l288J247R110N237K355
$$ 8546 3095 -187 5562 6113 -7775 -8544 -12755 -20369 -15262 -10516 -13804 -12557 -3447 1790 4145
15341D145K982k733N404P977j0972r842j899Q586N366l421J723j305J0185P78
$$ 4145 7127 4394 9798 17775 6803 -3039 -4938 3648 9014 5593 7316 6011 16196 16974
15327A6974k153j455n608j0095r682n081J0043J0917j316r90j3646r230P889R674
$$ 16974 14821 13366 7758 -2337 -12019 -17100 -7057 3860 2544 1554 -12092 -21322 -13433 -3759
15313c759K652m529p23o435j614J1125R421l652J355N829q478p596k745l462K097
$$ -3759 -1107 -5636 -6359 -12794 -14408 -3283 6138 2486 3841 9670 1192 -6404 -9149 -12611 -10514
15298a0514L740J215k1539Q044m799P725O951K934P688N393k568l979n36K355
$$ -10514 -6774 -5559 -27098 -19054 -23853 -16128 -9177 -6243 1445 6838 4270 291 -245 2110
15284B110K212q047n428P092N651R359m880j0413k518L925j020L568O29L133k236
$$ 2110 4322 -3725 -9153 -2061 3590 12949 8069 -2344 -4862 -937 -1957 1611 2240 5373 3137
15269C137o566j7146n195Q626K878L178N183o595O703K152o271k1522r037L117
$$ 3137 -3429 -20575 -25770 -17144 -14266 -11088 -5905 -12500 -5797 -3645 -9916 -31438 -40475 -37358
15255c7358J9308O27R24l023N794J028n494p566N216J3994J3627r375j1317k784
$$ -37358 -18050 -17423 -16499 -19522 -13728 -12700 -18194 -25760 -20544 -6550 7077 -2298 -13615 -16399
15241a6399O801J0294M848o365j5705n088M070O727k3l173J657R472R988j263
$$ -16399 -9598 696 5544 -821 -16526 -21614 -17544 -10817 -10840 -14013 -12356 -2884 7104 5841
15227E841o571n958j988L904R443R932n02j299n870J09q818n7M08q954k294J421
$$ 5841 -730 -6688 -8676 -4772 4671 14603 14101 12802 6932 7041 -1777 -1834 -1426 -10380 -12674 -11253
15211a1253J4000J2163j033o184q901j4807p39M254K0431M916q650J492n217P905
$$ -11253 2747 14910 13877 7693 -1208 -16015 -16754 -12500 7931 12847 4197 5689 472 8377
15197H377J3152r904j2498L831m714j1043m516J3963j365n101l8Q711M419J315
$$ 8377 21529 11625 -873 2958 -1756 -12799 -17315 -3352 -4717 -9818 -9856 -1145 3274 4589
15183D589N843o117j037J03j290k770P346L982l671J896M25o80k454q67Q738n978
$$ 4589 10432 4315 3278 3381 2091 -679 6667 10649 6978 8874 9299 8619 6165 5298 14036 8058
15167H058j2886o276M943J1320l460j5494P907o521q28l042q060l617R629L638
$$ 8058 -4828 -11104 -6161 5159 1699 -13795 -5888 -12409 -13237 -16279 -24339 -27956 -18327 -14689
15153a4689M826J0862M309k193r135q004O457Q063p491m984K338J615J1339J5074
$$ -14689 -9863 999 5308 3115 -6020 -14024 -7567 496 -6995 -11979 -9641 -8026 3313 18387
15139A8387q45m091m947P6p432R110K737j6724p278M537O251k071n034Q72J0895
$$ 18387 17542 13451 8504 8580 1148 10258 12995 -3729 -11007 -6470 -219 -2290 -7324 -6452 4443
15124D443k589q278q275K872L033L140l60L272N339k311j7696n032J5952L813
$$ 4443 1854 -6424 -14699 -11827 -8794 -5654 -6014 -2742 2597 286 -17410 -22442 -6490 -2677
15110b677P612J3288L377p460m562j7284p163Q084R620J311K019k834L187m020
$$ -2677 4935 18223 21600 14140 9578 -7706 -14869 -6785 2835 4146 6165 3331 6518 2498
15096B498M984l796r448O34O231m59J0952l283j4402j7633N853Q727J0849Q787
$$ 2498 7482 3686 -5762 -5128 1103 644 11596 8313 -6089 -23722 -17869 -9142 1707 10494
15082A0494j0586m252K374J353q496j331Q819J380l621K193O854J8120M113q163
$$ 10494 -92 -4344 -1970 -617 -9113 -10444 -1625 -245 -3866 -1673 5181 23301 27414 19251
15068A9251l768J183l641r187m56P689l306p180j1849m175J041J746R391K0749
$$ 19251 15483 16666 13025 3838 3382 11071 7765 585 -11264 -15439 -14398 -12652 -3261 17488
15054A7488J3711j6934j4189N031l016l433J3825l643M63M05n199q807N484K584
$$ 17488 31199 14265 76 5107 2091 -1342 12483 8840 9303 9708 4509 -4298 1186 3770
15040C770Q886o638j394l95j566J498m010K167P251J873M62L130j8021j2286J664
$$ 3770 12656 6018 4624 4229 2663 4161 151 2318 9569 11442 11904 15034 -2987 -15273 -13609
15025a3609k824P342M903K243J568o89j545M303J0299n99o983R40L714Q248M093
$$ -13609 -16433 -9091 -4188 -1945 -377 -1066 -2611 1692 11991 11392 4409 5349 9063 17311 21404
15010B1404K221j5010r373r32P722L199P515J1183J866k536n421o934J2395N387
$$ 21404 23625 8615 -758 -1690 6032 9231 16746 27929 29795 27259 21838 14904 27299 32686
14996C2686n729j0082J884L5373P9283J20745J64832N9577r9990j42665j00822
$$ 32686 26957 16875 18759 54132 133415 254160 418992 478569 378579 235914 135092
14985A35092n3866m1389k3538o182j0293J794J1668o476m269j439p295M988j870
$$ 135092 81226 39837 16299 10117 -176 1618 13286 6810 2541 1102 -6193 -1205 -3075
14972c075J678p339O942J4555o854k397K620J493R75R345o235o520N803o297k254
$$ -3075 -1397 -8736 -1794 12761 5907 3510 6130 7623 8598 17943 11708 5188 10991 4694 2440
14957B440m325K705n222j380L352J705L689k50O161N943M476r298j0753n176k512
$$ 2440 -1885 820 -4402 -5782 -2430 -725 2964 2714 8875 14818 19294 9996 -757 -5933 -8445
14942h445M738R811m502q717k094J3559Q821k472j5389o97n120M532p203K802
$$ -8445 -3707 6104 1602 -7115 -9209 4350 13171 10699 -4690 -5387 -10507 -5975 -13178 -10376
14928a0376M537L14n816J651N565O119N552J508r138j155j893k868K624L149o159
$$ -10376 -5839 -5525 -11341 -9690 -4125 1994 7546 9054 -84 -1239 -3132 -6000 -3376 -227 -6386
14913f386j6884R055J8644j998n366j5398L57k952N132P631N791J2173J895p96
$$ -6386 -23270 -14215 4429 2431 -2935 -18333 -17976 -20928 -15796 -8165 -2374 9799 11694 10898
14899A0898j4125K084J0277P177j081q206q906o784q28N568K693K172j666j465
$$ 10898 -3227 -1143 9134 16311 15230 7024 -1882 -8666 -9494 -3926 -1233 939 -727 -2192
14885b192N7J6302q216k661L372j388p300l559J357j3077M47k158r85N216J902
$$ -2192 -2135 14167 5951 3290 6662 5274 -2026 -5585 -4228 -17305 -16858 -19016 -20001 -14785 -12883
14870a2883p09R68l55k956L228P937P499M533Q216L056N000j760j0803j8296m378
$$ -12883 -13592 -12624 -12979 -15935 -12707 -4770 2729 7262 15478 18534 23534 21774 10971 -7325 -11703
14855a1703M388l942p803n234N087K106j0523O598N085J1905K977P258R506j1932
$$ -11703 -7315 -11257 -19060 -24294 -19207 -17101 -27624 -21026 -15941 -4036 -1059 6199 15705 3773
14841C773j6034K391p62j5182K607O156M851Q517L850r816q278p148P182O144
$$ 3773 -12261 -9870 -10632 -25814 -23207 -17051 -12200 -3683 167 -9649 -17927 -25075 -17893 -11749
14827a1749j603M546R06l1J994J2449J4554p510l080J680j0488o230J18j699Q561
$$ -11749 -13352 -8806 -7900 -7931 -5937 6512 21066 13556 10476 12156 1668 -4562 -4444 -6143 2418
14812B418J9161L458j4964n305k653O399N481j0453j1368J1515L623l503m845
$$ 2418 21579 25037 10073 4768 2115 8514 13995 3542 -7826 3689 7312 3809 -1036
14799a036j0449n734J1222M764j088L425j430N853l494j0100k035J12n264r34
$$ -1036 -11485 -17219 -5997 -1233 -2321 1104 -326 5527 2033 -8067 -10102 -9990 -15254 -16188
14785a6188L609L466K757p931j4L016k104M570O89q531k410N745J2572o007m768
$$ -16188 -12579 -9113 -6356 -14287 -14301 -11285 -13389 -8819 -8130 -16661 -19071 -13326 -754 -6761 -11529
14770a1529P58J1382J7833M45k1995n510l508K045O788K816m436L428P573j439
$$ -11529 -10771 611 18444 18889 -3106 -8616 -12124 -10079 -3291 -475 -4911 -1483 6090 4651
14756D651n812l934J0249J6732o449m989k1043N149K0508l056j7488j2648M260
$$ 4651 -1161 -5095 5154 21886 15437 10448 -10595 -5446 15062 12006 -5482 -18130 -13870
14743a3870J722j0841P506K4744J1910j7311j867m471k229o92L336j455K307R727
$$ -13870 -12148 -22989 -15483 9261 21171 3860 1993 -2478 -4707 -5399 -2063 -3518 -1211 8516
14729H516o740N115M457q115o335Q432R574o131J65j643P29n051p981j7086L086
$$ 8516 1776 6891 11348 3233 -3102 5330 14904 8773 8938 7295 8024 2973 -5008 -22094 -19008
14714a9008J6738K0622Q73p975j2498M561R02o372k931Q222O733k733J778J586
$$ -19008 -2270 18352 19225 11250 -1248 3313 4215 -2157 -5088 3134 9867 7134 8912 10498
14700A0498P63o59j0867o449j0618J404j735L559J2995N588q766J3654l141r266
$$ 10498 11261 10602 -265 -6714 -17332 -15928 -17663 -14104 -1109 4479 -4287 9367 6226 -3040
14686c040j419L162J3467L899j4436K39r01j0788o532N805J9121J1064n185N35
$$ -3040 -4459 -1297 12170 16069 1633 1872 971 -9817 -16349 -10544 8577 19641 14456 14991
14672A4991j0161n328M411l227m111n127L537K610K849k33n404j57l222J811M794
$$ 14991 4830 -498 3913 686 -3425 -8552 -5015 -2405 444 211 -5193 -5350 -8572 -6761 -1967
14657a967j009j957o34L101j1729j2620R585J3836l838q391R699J4056r278j0939
$$ -1967 -2976 -4933 -5567 -2466 -14195 -26815 -17230 -3394 -7232 -15623 -5924 8132 -1146 -12085
14643a2085o441j632N225J9509O404p238j5257j2152N495J0442J1377m285n722
$$ -12085 -18526 -20158 -14933 4576 10980 3742 -11515 -23667 -18172 -7730 3647 -638 -6360
14630f360l320j1459J733J158m878l569O798O608P693K213N99r57O221j798j0816
$$ -6360 -9680 -21139 -19406 -18248 -23126 -26695 -19897 -13289 -5596 -3383 -2784 -3741 2480 682 -10134
14615a0134J2529O915j427k342j0436j464O618k544M725M286j7997N313J8148
$$ -10134 2395 9310 7883 5541 -4895 -6359 259 -2285 2440 6726 -11271 -5958 12190
14602A2190Q283P012o641k822L911K945m319k817n474o81j1322m332Q098L249
$$ 12190 20473 27485 20844 18022 21933 24878 20559 17742 12268 11587 265 -4067 4031 7280
14588G280j623n595o552J810L92M273J009l006l406J0186O342j1722O66J806q14
$$ 7280 5657 62 -6490 -4680 -4288 -15 994 -2012 -5418 4768 11110 -612 54 1860 1046
14573A046o219l141J4461P940j245M63N82k083p034j8655o854J0419k196K962
$$ 1046 -5173 -8314 6147 14087 12842 13305 13887 11804 4770 -13885 -20739 -10320 -12516 -9554
14559i554r54J19J098P861l856m799j923m47P276n365J995N58J1435N68k22L894
$$ -9554 -10508 -10389 -9291 -1430 -5286 -10085 -12008 -12455 -5179 -10544 -8549 -7991 3444 4012 3790 7684
14543G684L895r94q970j166m032K80j0567P691R588J3743r37n841p081k7464M276
$$ 7684 11579 10585 1615 449 -3583 -3303 -13870 -6179 3409 17152 16215 10374 3293 -24171 -19895
14528a9895Q576N958Q488M542j4656r066J7060J2587k766J933m561j670n725j0873
$$ -19895 -11319 -5361 3127 7669 -6987 -16053 1007 13594 10828 12761 8200 6530 805 -10068
14514a0068P772N818j1189m462q518k232J7730J2645q642l222N066P101m554k096
$$ -10068 -2296 3522 -7667 -12129 -20647 -22879 -5149 7496 -1146 -4368 698 7799 3245 1149
14500A149l689J0177m405q229J631N486J620Q630J1192M31j2125q827R59n454
$$ 1149 -2540 7637 3232 -4997 -3366 2120 3740 12370 23562 23993 11868 3041 4000 -1454
14486a454P71j266q044j3598Q441J2361N985j518K610l15k475N076J83n966j670
$$ -1454 -683 -1949 -9993 -23591 -15150 -2789 3196 1678 4288 3973 1498 6574 6757 791 -879
14471h79l351p781j372O54P095J4674Q386m702l06n187J744K579j3220j2944n243
$$ -879 -4230 -12011 -13383 -12729 -5634 9040 17426 12724 12418 7231 8975 11554 -1666 -14610 -19853
14456a9853n13J0841O730k11p876o990J9378Q760j1087k502r679j708l546k08
$$ -19853 -20366 -9525 -2795 -3006 -10882 -17872 1506 10266 -821 -3323 -13002 -14710 -18256 -18464
14442a8464N002p366K175m1J2952J4781J95Q19j0699L03P02j5112O83P927q93
$$ -18464 -13462 -20828 -18653 -18694 -5742 9039 9234 10053 -646 -343 359 -14753 -14070 -6143 -7036
14427g036Q931J1199m696o669N36l931j6081k2J6030J4512o923j0468j1922q012
$$ -7036 1895 13094 8398 1729 2265 -1666 -17747 -17769 -1739 12773 5850 -4618 -16540 -24552
14413b4552O70L358j062J1027J0193L047j1843k717J0966j41j018k498r80k225
$$ -24552 -23882 -20524 -21586 -10559 -366 2681 -9162 -11879 -913 -1054 -2072 -4570 -5550 -7775
14399g775Q403L657j562o140q063L583J3486J0569j8101j4596R951O233R21j843
$$ -7775 628 4285 2723 -3417 -11480 -7897 5589 16158 -1943 -16539 -6588 -355 566 -1277
14385a277j2157n523k544J287O360O606n718P536N97j2004j3776J522L608k905
$$ -1277 -13434 -18957 -21501 -20214 -13854 -7248 -12966 -5430 -4833 -16837 -30613 -29091 -25483 -28388
14371b8388n441N795N601j02Q851K676Q634J1068P723j3756j1524n329P91M679
$$ -28388 -33829 -28034 -22433 -22535 -13684 -11008 -2374 8694 16417 2661 -8863 -14192 -13401 -8722
14357h722l256j2860l012J194K535J0603L884M363J906j2286J7646r51l01r321
$$ -8722 -11978 -24838 -27850 -26656 -24121 -13518 -9634 -5271 -3365 -15651 1995 1044 743 -8578
14343h578K731J4283K259j0058K541j288J6071J491j2176k124M58j1415j721j8
$$ -8578 -5847 8436 10695 637 3178 1890 17961 19452 7276 5152 5610 -5805 -7526 -7544
14329g544Q99m373J7698P289j6123q557j403j470K412J0479K706l055r7N037r942
$$ -7544 -6645 -11018 6680 13969 -2154 -10711 -12114 -13584 -11172 -693 2013 -1042 -1139 3898 -6044
14314f044r539P093k491j660J5318j982j1559q096p995M243J3285Q111j0605J1080
$$ -6044 -15583 -8490 -10981 -12641 2677 695 -10864 -18960 -26955 -22712 -9427 -1316 -11921 -841
14300h41L373p081J110k90N22n31O49J344o871K650l264k495R440J3147K416j0814
$$ -841 2532 -4549 -3439 -3729 -3207 -3738 -3089 -1745 -8616 -5966 -9230 -11725 -2285 10862 13278 2464
14284B464k388L679M599j0603M254j1735j0322j1763K44J3026J380J414k782n415
$$ 2464 76 3755 8354 -2249 2005 -9730 -20052 -31815 -31571 -18545 -17165 -15751 -18533 -23948
14270b3948J2838P475J957o252r529L800P332J5360J3016j1213j6419l868L375
$$ -23948 -11110 -3635 -1678 -7930 -17459 -13659 -6327 9033 22049 10836 -5583 -9451 -6076
14257f076r68J718o810j0327q899R192N180q508l160m626J0961Q774o167J8242
$$ -6076 -7044 -5326 -12136 -22463 -31362 -22170 -16990 -25498 -28658 -33284 -22323 -13549 -19716 -1474
14243a474J3250M221N03j4239j7405R979j472j1455K911J7887l336j0735L012
$$ -1474 11776 15997 16500 2261 -15144 -5165 -6637 -18092 -15181 2706 -630 -11365 -8353
14230h353j714m239p079J2914Q470j7658r273K743R796O057N300q460n258J0202
$$ -8353 -10067 -14306 -21385 -8471 -1 -17659 -26932 -24189 -14393 -8336 -3036 -11496 -16754 -6552
14216f552O56o536Q20J675J9228J7008l355l13p951j5093J818J404O111Q136o412
$$ -6552 -5896 -12432 -11612 -9937 9291 26299 22944 22631 14680 -413 1405 2809 8920 17056 10644
14201A0644Q309M736K579N182j3015k0986j3733J1599P539J4076m672q016P32
$$ 10644 18953 23689 26268 31450 18435 -2551 -16284 -4685 2854 16930 12258 4242 4974
14188D974m682J1154J382n937K089j2353q126J2085L12j2435q77J2416m884p348
$$ 4974 292 11446 12828 6891 8980 -3373 -11499 586 898 -11537 -12414 2 -4882 -12230
14174a2230K010M237j477r856k55J1517q134q140J9192J3435P73p045k674j0031
$$ -12230 -10220 -5983 -7460 -17316 -17571 -6054 -14188 -22328 -3136 10299 11072 4027 1353 -8678
14160h678o037P030R305K372n737m593K462k539k320L191R206m49o175p911n787
$$ -8678 -14715 -7685 1620 3992 -1745 -6338 -3876 -6415 -8735 -5544 3662 3213 -2962 -10873 -16660
14145a6660O47J649O620m967j5337L227P053J0772N956r116q743P136Q052l045
$$ -16660 -16013 -14364 -7744 -12711 -28048 -24821 -17768 -6996 -1040 -10156 -18899 -11763 -3711 -6756
14131f756L435m5k70P027J0159P971m08m077p796j4751r978K798L205k637N845
$$ -6756 -3321 -3366 -3636 3391 13550 21521 21113 17036 9240 -5511 -15489 -12691 -9486 -12123 -6278
14116f278l245m178L594n502n079J290J471J6068j0087j4555m75R531R411N223
$$ -6278 -9523 -13701 -10107 -15609 -20688 -19398 -17927 -1859 -11946 -26501 -26976 -17445 -8034 -2811
14102b811N260j213Q344o750j9827M404R98K104o940j0m158K900q581L381J0657
$$ -2811 2449 1236 9580 2830 -16997 -12593 -11595 -9491 -16431 -16441 -20599 -17699 -26280 -22899 -12242
14087a2242O236m339k466o002k12J3413k894J620o12L550P135N891O28j2568l437
$$ -12242 -6006 -10345 -12811 -18813 -19025 -5612 -8506 -6886 -7498 -3948 3187 9078 9706 -2862 -6299
14072f299K579J1590Q544p782M131r34j5330m067l264k607j21m365K527J77N446
$$ -6299 -3720 7870 16414 8632 12763 11829 -3501 -7568 -10832 -13439 -13560 -17925 -15398 -15221 -9775
14057i775l935O802n24Q169n77O84o705o216K960q898K955J8514L124j3468l456
$$ -9775 -13710 -6908 -7432 737 160 844 -5861 -12077 -9117 -18015 -15060 3454 6578 -6890 -10346
14042a0346P562m037n530n361J299k272P953J8977j838j1035n998j0019k256N116
$$ -10346 -2784 -6821 -12351 -17712 -16413 -18685 -10732 8245 6407 -4628 -10626 -20645 -22901 -17785
14028a7785O610J3146J0618l617N270M893J178j3505j2682m27P079k017K085m299
$$ -17785 -11175 1971 12589 8972 14242 19135 20313 6808 -5874 -6301 778 -1239 846 -3453
14014c453N319O154k095q032j1291n330P033O113p215m295M212J167O888j704
$$ -3453 1866 8020 5925 -2107 -13398 -18728 -11695 -5582 -12797 -17092 -12880 -11713 -4825 -6529
14000f529L473N098n332J734O423K070j815m928l497Q385L169q788M29M667J0292
$$ -6529 -3056 2042 -3290 -1556 4867 6937 5122 194 -3303 5082 8251 -537 -108 4559 14851
13985A4851j405r17l665j325j1691r895N147J3418j888r905N493R27p441Q950
$$ 14851 13446 12529 8864 7539 -4152 -14047 -8900 4518 2630 -7275 -1782 -855 -8296 654
13971F54L098K526M601m873k242j102m655K538Q228N775j6054M795J3684l780
$$ 654 3752 6278 10879 6006 3764 2662 -1993 545 8773 14548 -1506 3289 16973 13193
13957A3193r525J822k966l873K731j790j840J1911L548j5528n374J4993O29j9850
$$ 13193 3668 5490 2524 -1349 1382 -408 -2248 9663 13211 -2317 -7691 7302 7931 -11919
13943a1919r060O888K712J491L867o48n304m973N420Q073m529j84K074N051N371
$$ -11919 -20979 -14091 -11379 -9888 -6021 -6669 -11973 -16946 -11526 -3453 -7982 -8166 -6092 -1041 4330
13928D330K163j637N148N551o907l272r858j3390k724J1043J5217R2p811j457
$$ 4330 6493 4856 10004 15555 8648 5376 -4482 -17872 -20596 -9553 5664 5756 -2055 -3512
13914c512l046J06P963R785R710J861l245O91k70j439j2117o371M54K98j3711
$$ -3512 -6558 -6452 1511 11296 21006 22867 19622 20313 20043 18604 6487 116 570 868 -12843
13899a2843R25j554m107K981m485O094J2150r465M31K181R060J9855j794j7560
$$ -12843 -11918 -13472 -17579 -14598 -19083 -12989 -839 -10304 -9873 -7692 1368 21223 19429 1869
13885A869r832l1n115j71n890K210k159M783N074j5925r35j135K432P722K39Q932
$$ 1869 -7963 -7994 -13109 -13280 -19170 -16960 -19119 -14336 -9262 -25187 -26122 -27257 -24825 -17103 -16864 -7932
13869g932K664N158R466j105q68K033o627q996j626Q563p151L449Q467p643N428
$$ -7932 -5268 -110 9356 8251 7383 9416 2789 -6207 -7833 730 -6421 -2972 5495 -2148 3280
13854C280N193q016p951j0464L395n206P789O232m776L099k338N732m993j2382
$$ 3280 8473 457 -7494 -17958 -14563 -19769 -11980 -5748 -10524 -7425 -9763 -4031 -9024 -21406
13840b1406J0165L104j563Q8j406K227j726J1468K913O1Q689J2404m198j9239
$$ -21406 -11241 -8137 -9700 -9612 -11018 -8791 -10517 951 3864 3925 12614 25018 20820 1581
13826A581q157M520j392M466l891l648O85m322o135m048L884j042N707J1099M986
$$ 1581 -6576 -2056 -3448 1018 -2873 -6521 -5836 -10158 -16293 -20341 -16457 -17499 -11792 -693 4293
13811D293j1321m612j11N919P785O738l92j1166n46k624k428J993j677p568K456
$$ 4293 -7028 -11640 -11751 -5832 1953 8691 8299 -2867 -3413 -6037 -8465 -6472 -8149 -15717 -13261
13796a3261L184P423o255J313Q090J750r810K327K265n075o559j141j815J571
$$ -13261 -10077 -2654 -8909 -7596 494 2244 -7566 -5239 -2974 -8049 -14608 -15749 -17564 -15993
13782a5993O804m383J1693K188j0183l845p79J9586M53j9554K858O300L314M884
$$ -15993 -9189 -13572 -1879 309 -9874 -13719 -14498 5088 5541 -14013 -11155 -4855 -1541 3343
13768C343j7171j731N029J003N217Q305J0355j0762j3617P511J3921n626M081
$$ 3343 -13828 -15559 -10530 -9527 -4310 3995 14350 3588 -10029 -2518 11403 5777 9858
13755I858k358p540N292J11r826L72l059n68k935o338k362O788k02l356j75R250
$$ 9858 7500 -40 5252 5363 -4463 -4091 -7150 -7718 -10653 -16991 -19353 -12565 -12767 -16123 -16298 -7048
13739g048J452j6165j1296K40l094J6314R963Q998R047k91L426J466L88n393p741
$$ -7048 -5596 -21761 -33057 -32817 -35911 -19597 -9634 -636 8411 8120 11546 13012 13400 8007 266
13724B66n97Q68K343j0589o960K662N627m51j145J981j1050L124J0988Q577j5724
$$ 266 -331 537 2880 -7709 -14669 -12007 -6380 -6831 -7976 -5995 -17045 -13921 -2933 5644 -10080
13709a0080j3515R464Q232J3973j846j2629q060P93K699o763M582k18l690k194
$$ -10080 -23595 -14131 -5899 8074 6228 -6401 -14461 -13668 -10969 -17732 -13150 -13368 -17058 -19252
13695a9252Q346R446k989L040j976j689p309N572k360m219K05M4N713j395P978
$$ -19252 -10906 -1460 -4449 -1409 -3385 -5074 -12383 -6811 -9171 -13390 -13185 -13141 -7428 -8823 -845
13680h45j946l910l49J1707L766j242j948O533r935j0076j0945k245P45L561K754
$$ -845 -2791 -6701 -7050 4657 8423 7181 5233 11766 1831 -8245 -19190 -21435 -20690 -17129 -14375
13665a4375P643k945m076J756r593L710J9358n536j3372M957k511l623R893K1699
$$ -14375 -6732 -9677 -13753 -11997 -21590 -17880 1478 -4058 -17430 -12473 -14984 -18607 -8714 12985
13651A2985Q61j0721k15Q286J0598m402R027j959j2084j6920N543l530j134j1964
$$ 12985 13846 3125 2910 11196 21794 17392 26419 24460 12376 -4544 999 -2531 -3665 -15629
13637a5629j5344P714J1386J3089N232l941j7481o438P704J763j504J0783L586
$$ -15629 -30973 -23259 -11873 1216 6448 2507 -14974 -21412 -13708 -11945 -13449 -2666 920
13624I20k045o189k741p50N94L609M935n766O164K362l963O935k939p326L758
$$ 920 -1125 -7314 -10055 -10805 -10211 -6602 -1667 -7433 -1269 1093 -2870 4065 1126 -6200 -2442
13609b442P346M028l051p43k943q272r032j53J0163J3513l484j2734J5159j106
$$ -2442 4904 8932 5881 5138 2195 -6077 -15109 -15262 -5099 8414 4930 -7804 7355 6249
13595F249j4475K574j271m115m8l516q149J177R338J2257o166j0213l42k830K862
$$ 6249 -8226 -5652 -6923 -11038 -11086 -14602 -22751 -21574 -12236 21 -6145 -16358 -16700 -19530 -16668
13580a6668K031P316L970J172n413N819N007N178n280p706L053J845q901j0718
$$ -16668 -14637 -7321 -3351 -2179 -7592 -1773 3234 8412 3132 -4574 -1521 324 -8577 -19295
13566a9295j240P524K941m009J0639p60L7L676r300J009O296L883m516J598J210
$$ -19295 -20535 -13011 -10070 -14079 -3440 -4200 -4163 -487 -9787 -8778 -2482 1401 -3115 -1517 -307
13551c07M896j0002j0850j49Q667K623l878O726O352P176o078n235K748j2187
$$ -307 4589 -5413 -16263 -16412 -7745 -5122 -9000 -2274 4078 11254 5176 -59 2689 -9498
13537i498r685O849l512N741N941M323n89j0810p715k761K175P663q462O272J1997
$$ -9498 -19183 -12334 -15846 -10105 -4164 159 -430 -11240 -18955 -21716 -19541 -11878 -20340 -14068 -2071
13522b071l185N233R909p924q054j265l811o753q95l651J237R884P735o180p651
$$ -2071 -5256 -23 9886 1962 -6092 -7357 -11168 -17921 -18816 -22467 -21230 -11346 -3611 -9791 -17442
13507a7442n792J1969J2452l645q644J3881N039m761r362J0358L669j968P257
$$ -17442 -23234 -11265 1187 -2458 -11102 2779 7818 3057 -6305 4053 7722 5754 13011
13494A3011l845j0752j0912K320M890N022L475J6675j2527o898l521M746l397
$$ 13011 9166 -1586 -12498 -10178 -5288 -266 3209 19884 7357 459 -3062 1684 -1713
13481a713n701l17k873l12O25Q814K99k513J65J0939j595j953J1085J040n718
$$ -1713 -7414 -7731 -10604 -10916 -10291 -1477 -1178 -3691 -3526 7413 5818 3865 14950 15990 10272
13466A0272m579q658m007P85L851R543O475j1682n583K421R38n537l979n62j0065
$$ 10272 5693 -2965 -6972 -6187 -2336 7207 13682 2000 -3583 -1162 -224 -5761 -9740 -10302 -20367
13451b0367j0198j031j253Q397J0389o512O786J1536Q100m843O385J4232j1521
$$ -20367 -30565 -31596 -32849 -24452 -14063 -20575 -13789 -2253 5847 1004 7389 21621 10100
13438A0100j0018p733N571k016r359k820j750Q406N775L529K000o279j1821R306
$$ 10100 82 -7651 -2080 -4096 -13455 -16275 -18025 -9619 -3844 -315 1685 -4594 -16415 -7109
13424g109J5027J60M624l424J346j1086j3325n204r31l613l796j1409K529J0750
$$ -7109 7918 8078 12702 9278 10624 -462 -13787 -18991 -19922 -23535 -27331 -38740 -36211 -25461
13410b5461J4721J5611q812j1967M797J4608R378r095j503q532k049l983P497
$$ -25461 -10740 4871 -3941 -15908 -11111 3497 12875 3780 2277 -6255 -8304 -12287 -4790
13397d790j615j0854M131r162m733o764J959J7634J4349Q641r371m988n557k0103
$$ -4790 -6405 -17259 -13128 -22290 -27023 -33787 -31828 -14194 155 8796 -575 -5563 -11120 -31223
13383c1223n347J3332J9297q12Q004P253o763r375j4379M99L992M464k110o391
$$ -31223 -36570 -23238 -3941 -4753 3251 10504 3741 -5634 -20013 -19514 -15522 -11058 -13168 -19559
13369a9559L252J1198J1662j341r769l57l882l978M404j0913j7633M480J4361
$$ -19559 -16307 -5109 6553 5212 -4557 -4914 -8796 -12774 -8370 -19283 -36916 -32436 -18075
13356a8075r74o816j3014r877M483J9458J4204k448q997J2032K626p299j7453
$$ -18075 -19049 -25865 -38879 -48756 -44273 -24815 -10611 -13059 -22056 -10024 -7398 -14697 -32150
13343c2150n149M112m571J1894J3529O610K264J2320n430j7420R080L871M374
$$ -32150 -37299 -33187 -37758 -25864 -12335 -5725 -3461 8859 3429 -13991 -4911 -1040 3334
13330C334K69N521L294r927j422m487M363J880j2556m16K572L478k162k36q257
$$ 3334 3603 9124 12418 2491 1069 -3418 945 2825 -9731 -10147 -7575 -4097 -6259 -6495 -14752
13315a4752j559M673j152j946m07M546l032n721N022N656K058O489Q801L381K852
$$ -14752 -16311 -11638 -12790 -14736 -15143 -10597 -13629 -19350 -14328 -8672 -6614 -125 8676 12057 14909
13300A4909L973N87o126n72K731l505M659o632j3013O239N222L940N988l311r720
$$ 14909 18882 19469 13343 12771 15502 11997 16656 10024 -2989 3250 8472 12412 18400 15089 5369
13285E369k606k720M270Q644J328m57k195l641j0828m409q122n241O68m382k822
$$ 5369 2763 43 4313 12957 14285 13828 11633 7992 -2836 -7245 -15367 -20608 -19940 -24322 -27144
13270b7144J0720K816J134K569K374O378J1466j0040j4112q8J4383J0859o547
$$ -27144 -16424 -13608 -12474 -9905 -7531 -1153 10313 273 -13839 -13927 456 11315 4768
13257D768J66j1919r308j420M936J0678J0520N88r731K576Q27n857j851J2444
$$ 4768 4934 -6985 -16293 -17713 -12777 -2099 8421 9009 -722 1854 2681 -3176 -5027 7417
13243G417n77l579K512j0295k976l165M564J0225m741P43M278l170K51M251m217
$$ 7417 6840 3261 5773 -4522 -7498 -10663 -6099 4126 -615 128 4406 1236 1487 5738 1521
13228A521j4493k463p492o743K716L030M775L042M793N700j324m002N642J0274
$$ 1521 -12972 -15435 -22927 -29670 -26954 -23924 -19149 -16107 -11314 -5614 -6938 -10940 -5298 4976
13214D976K13M9O533q409o182j8295M143J3797O492l75k0389p200N157J7194J1079
$$ 4976 5189 5238 11771 3362 -2820 -21115 -16972 -3175 3317 2942 -17447 -24647 -19490 -2296 8783
13199H783l673m425N408L628m49m133q725M26j1407o358L566k266p299M269l059
$$ 8783 5110 685 6093 9721 9272 5139 -3586 -3160 -14567 -20925 -17359 -19625 -26924 -22655 -25714
13184b5714n714J1659P261O895n117j385O428p402o263L115J640J4871r125p172
$$ -25714 -31428 -19769 -12508 -5613 -10730 -12115 -5687 -13089 -19352 -16237 -14597 274 -8851 -16023
13170a6023Q917J2001m249p813j489J226M157n679K567n110P201J554l597o98
$$ -16023 -7106 4895 646 -7167 -8656 -7430 -3273 -8952 -6385 -11495 -4294 -2740 -6337 -7035
13156g035N232M744J054M717m590n025j475J812p901n97p00j0120j965Q518J265
$$ -7035 -1803 2941 3995 8712 4122 -903 -2378 -566 -8467 -9064 -9764 -19884 -21849 -13331 -12066
13141a2066N993l598l249Q038J1205o326j0416j2244m720N381J5820r273r01J4107
$$ -12066 -6073 -9671 -12920 -4882 6323 -3 -10419 -22663 -27383 -22002 -6182 -15455 -16356 -2249
13127b249Q439l350p537J718L326J964L233l097l871j3452r81Q735M195k652l239
$$ -2249 6190 2840 -4697 -2979 347 2311 5544 2447 -1424 -14876 -15857 -7122 -2927 -5579 -8818
13112h818N689j0057l86J0553J7394l017r574n183K00r189m167N377j430o391
$$ -8818 -3129 -13186 -13572 -3019 14375 11358 1784 -3399 -3199 -12388 -16555 -11178 -12608 -18999
13098a8999j1316N845J5385l180J183j2094n34J78j798m797K923J5845J6252p633
$$ -18999 -30315 -24470 -9085 -12265 -11082 -23176 -23710 -23532 -25330 -30127 -27204 -11359 4893 -2740
13084b740n155J922j60M416n188K879P785P308N941M419j768r169o207m965q182
$$ -2740 -7895 -5973 -6133 -1717 -6905 -4026 3759 11067 17008 21427 19659 10490 4283 -682 -8864
13069h864j1792p07L95J1959J2517J1109J1254j796o888N329J0094J668l021n337
$$ -8864 -20656 -21363 -20968 -9009 3508 14617 25871 24075 17187 22516 32610 34278 31257 25920
13055B5920k682n976j2072l476j616k438j817R448P202p721j031r286J076n961
$$ 25920 23238 17262 5190 1714 98 -2340 -4157 5291 12493 4772 3741 -5545 -4469 -10430
13041a0430q953L325J2655J0422J3628q00j3641j5679J1462P194j0519l564J0947
$$ -10430 -19383 -16058 -3403 7019 20647 19847 6206 -9473 1989 9183 -1336 -4900 6047
13028F047P251M818K074q431m110j729L520q641o150m39L950n04k889K548J370
$$ 6047 13298 18116 20190 11759 7649 5920 9440 799 -5351 -5790 -1840 -2344 -5233 -2685 -1315
13013a315J22K271J284J1197p42r406n138K220M296J2891n321n930O884n925j1152
$$ -1315 -1193 1078 2362 13559 12817 3411 -1727 493 4789 17680 12359 6429 13313 7388 -3764
12998c764n771m934k508j443R661J830r994K748J4233k228j5731K591k705M440
$$ -3764 -9535 -14469 -16977 -18420 -8759 -6929 -16923 -14175 58 -2170 -17901 -15310 -18015 -13575
12984a3575J4370L016j2258j2021N358R665L954L559m822J886l033o307L154N29
$$ -13575 795 3811 -8447 -20468 -15110 -5445 -1491 2068 -2754 -868 -3901 -10208 -7054 -6525
12970f525R020k625j2952l731l90J3543k89M801K896j5364O250K074O286j7572
$$ -6525 2495 -130 -13082 -16813 -17203 -3660 -3949 852 3748 -11616 -5366 -3292 2994 -14578
12956a4578J137k359j16P740Q321P806P048o985r113o476m48m081N912K719J2852
$$ -14578 -13441 -15800 -15916 -8176 145 7951 14999 8014 -1099 -7575 -8023 -12104 -6192 -3473 9379
12941I379L071N194q29L533q725r161m021p23k948P854K213n836j942K411k324
$$ 9379 12450 17644 16815 20348 11623 2462 -1559 -2282 -5230 2624 4837 -999 -2941 -530 -2854
12926b854m881Q177J844m688J190L976J0300q17j0452l776r12o027J223q70R64
$$ -2854 -7735 442 2286 -2402 -1212 2764 13064 12247 1795 -1981 -2893 -8920 -7697 -8567 -7603
12911g603r722P914Q997l557j719r34J3150O628K321l477J193L472Q671m610R94
$$ -7603 -17325 -9411 -414 -3971 -5690 -6624 6526 13154 15475 11998 13191 16663 25334 20724 21718
12896B1718J0811n674q798j0310j0308p216J0635J0461j773M76m035P792J5862
$$ 21718 32529 26855 18057 7747 -2561 -9777 858 11319 9546 10022 5987 13779 29641
12883B9641J6392p839j7544K70M358r342m270o083p517k397k587M748K972j719
$$ 29641 46033 38194 20650 20920 25278 15936 11666 5583 -1934 -4331 -6918 -2170 802 -917
12869i17n975q04R299M473k578O617P432p378n051q609P10K218N764P905J2574
$$ -917 -6892 -7696 1603 6076 3498 10115 17547 10169 5118 -3491 -2781 -563 5201 13106 25680
12854B5680r562n424P713L509q219j192j5933m971J2572J1524j709j286p712r073
$$ 25680 16118 10694 18407 21916 13697 12505 -3428 -8399 4173 15697 13988 12702 4990 -4083
12840d083k269K406k213l224R187O924k093Q47r511m607m986M556O682J890q634
$$ -4083 -6352 -3946 -6159 -9383 -196 6728 4635 5482 -4029 -8636 -13622 -9066 -2384 -494 -9128
12825i128q17m748N564N477n96o60l417j336n133k670J6950m131q219m186R363
$$ -9128 -9945 -14693 -9129 -3652 -4248 -4908 -8325 -9661 -14794 -17464 -514 -4645 -12864 -17050 -7687
12810g687J9365n111J092j6J312l539n770L189j80J519j79q367o419o086m23J6415
$$ -7687 11678 6567 7659 7643 8955 5416 -354 2835 2655 4174 3995 -4372 -10791 -16877 -17300 -885
12794h85J657L864L819r5k902m559m239K31Q46P13l910J106K258n794o113L490
$$ -885 772 4636 8455 8360 5458 899 -3340 -3109 -2263 -1550 -5460 -4354 -2096 -7890 -14003 -10513
12778a0513J3160N852M742m905M614l4O482M31j0599j7047p725J4883j596m32
$$ -10513 2647 8499 13241 8336 12950 12916 19398 19829 9230 -7817 -15542 -659 -2255 -2687
12764b687J1910m345J610j371o202O766J637Q39m674O976K593o175k026j3389
$$ -2687 9223 4878 6488 5117 -1085 5681 7318 8157 3483 10459 13052 6877 4851 -8538
12750h538l495K5916J0890k080K364j2806k987L618q483j8025M879P158J0796
$$ -8538 -12033 13883 24773 22693 25057 12251 9264 12882 4399 -13626 -8747 -1589 9207
12737I207P234n484J855n003O957p18o833K472k029K165L193j5650l417M744J5872
$$ 9207 16441 10957 12812 7809 14766 14048 7215 9687 7658 9823 13016 -2634 -6051 -1307 14565
12722A4565P469j2217l102l917j158l744M662l272L990M83K07j344J0146J032
$$ 14565 22034 9817 6715 2798 1640 -2104 2558 -714 3276 3759 3966 2622 12768 13800
12708A3800m586L306Q13M33p030j131J015N256J493j373p91q499j4236l120L083
$$ 13800 9214 12520 13333 13766 6736 5605 6620 11876 13369 11996 11205 2706 -11530 -14650 -11567
12693a1567J0205Q247Q33k820k155k612O228o07j1988j848k281q100J0917J0062
$$ -11567 -1362 6885 7718 4898 2743 131 6359 5752 -6236 -8084 -10365 -18465 -7548 2514
12679B514J5043o90J3766m230m320k698o118p494O725R619O723K316j1880j5927
$$ 2514 17557 16867 30633 26403 22083 19385 13267 5773 12498 22117 28840 31156 19276 3349
12665C349j773N928L357j1417n668l296J3066R315P959k650K291L232n858p511
$$ 3349 1576 7504 10861 -556 -6224 -9520 3546 12861 20820 18170 20461 23693 17835 10324
12651A0324J062J960J400m1l866J056o72j2972j919L069N327L574J1656J8q25
$$ 10324 11386 13346 14746 14705 10839 11895 11223 -1749 -3668 -599 4728 8302 19958 19976 19151
12636A9151N95j2775j257k03k226J2136O923r327p463r035M215j426M324J2521
$$ 19151 19746 6971 5714 5511 3285 15421 22344 13017 5554 -3481 734 -692 3632 16153
12622A6153j1820q745P267N186m542k900Q162m791j8627L938J102M359J4830o02
$$ 16153 4333 -4412 2855 8041 3499 599 8761 3970 -14657 -10719 -9617 -5258 9572 8970
12608H970l6l473j0983L333p202o531n07J7903J3686J489m42p498j879k447o121
$$ 8970 8934 5461 -5522 -2189 -9391 -15922 -16429 1474 15160 16649 16207 8709 6830 4383 -1738
12593a738L138l541j0210j831O001N745O265J861O4O454j1319j0263K542N256
$$ -1738 1400 -2141 -12351 -14182 -8181 -2436 3829 5690 5754 12208 889 -9374 -6832 -1576
12579a576j900j759J3479j742J1830J4620q762j1360j5921j198k029p605J73o025
$$ -1576 -3476 -5235 8244 6502 18332 32952 24190 12830 -3091 -4289 -6318 -13923 -13750 -19775
12565a9775P889N482L756K515p488o708k188n034J0198J4522r338j3508j2384
$$ -19775 -11886 -6404 -2648 -133 -7621 -14329 -16517 -21551 -11353 3169 -6169 -19677 -32061
12552c2061J4341O961q046j754N99R970k919j156O761J0554k468J734L216j4488
$$ -32061 -17720 -10759 -18805 -20559 -19960 -9990 -12909 -14065 -7304 3250 782 2516 5732 -8756
12538h756K584Q005M275j086n92O5K467N850P963j507J703q369j0532Q908K635
$$ -8756 -6172 1833 6108 5022 4430 4495 6962 12812 20775 19268 20971 12602 2070 10978 13613
12523A3613p719M460O813n581l483m246k784J085J300L324J903m873L461N786
$$ 13613 5894 10354 17167 11586 8103 3857 1073 2158 3458 6782 8685 3812 7273 13059
12509A3059R2K797o145o09K542k683j3314O122J3568m459j0280M41L333L930o742
$$ 13059 13151 15948 9803 9194 11736 9053 -4261 1861 15429 10970 690 1131 4464 8394 1652
12494A652O281J1315r222l092O416j1301j0614k546J6539j178L141l499j1665
$$ 1652 7933 19248 10026 6934 13350 2049 -8565 -11111 5428 4250 7391 3892 -7773
12481g773k491Q132P120L858R132Q59J675L710j1374k4603m217P050N789J07j509
$$ -7773 -10264 -2132 4988 8846 17978 18837 20512 24222 12848 -11755 -15972 -8922 -3133 -3026 -4535
12466d535N888J9555j000j9483j765N801R42n369j4277p51M172J8479J3747j2108
$$ -4535 1353 20908 19908 425 -1340 4461 5403 34 -14243 -14994 -10822 7657 21404 9296
12452I296L556K585r639j1133M96O755R786k472j8969O69J3001M574j0834r906
$$ 9296 12852 15437 5798 -5335 -4839 1916 11702 9230 -9739 -9070 3931 8505 -2329 -12235
12438a2235o193n664K829k73K045J6980M421J4202l998j4504m652J0313J0037
$$ -12235 -18428 -24092 -21263 -21536 -19491 -2511 1910 16112 12114 -2390 -7042 3271 13308
12425A3308j752j9017J5757J9925q387j3066l580L174Q307L698N851o489m713
$$ 13308 11556 -7461 8296 28221 19834 6768 3188 6362 14669 18367 24218 17729 13016
12412A3016j0584m27L403l194p248j872M004O625j579K303J770P110l66j564j2630
$$ 13016 2432 2005 5408 2214 -5034 -6906 -2902 3723 2144 4447 6217 13327 12961 11397 -1233
12397a233OJ452k846m377K485J0351R290P839O851q724J259J2509m713j352j511
$$ -1233 -1227 225 -2621 -6998 -4513 5838 15128 22967 29818 21094 22353 34862 30149 28797 27286
12382B7286p751j2811L234M333m180r701j697M241O403J532n618J131l94P131
$$ 27286 19535 6724 9958 14291 10111 410 -1287 2954 9357 10889 5271 6402 6008 13139
12368A3139q827J239J4346l216p493J115m455p30R139L343L894r667l548J562
$$ 13139 4312 5551 19897 16681 9188 10303 5848 5118 14257 17600 21494 11827 8279 9841
12354I841n214N750M788j9151O629R741j410R91Q99p219R544J987O35Q611R60
$$ 9841 4627 10377 15165 -3986 2643 12384 10974 11965 12864 5645 15189 17176 17811 26422 27382
12339B7382M429k214n592r405j6581j926J1116O228n71p57O699R162j683N171
$$ 27382 31811 29597 24005 14600 -1981 -3907 7209 13437 12866 12109 18808 27970 26287 31458
12325C1458q568o313O478m099l766P218M392J084l254n330p133o000l300K683
$$ 31458 22890 16577 23055 18956 15190 22408 26800 27884 24630 19300 12167 6167 2867 5550
12311E550L949J3653Q140n432q764K000K450J1304L885j1319o677j247q18m250
$$ 5550 9499 23152 31292 25860 17096 19096 21546 32850 36735 25416 18739 17492 16674 12424
12297A2424M776L906J027r385n414o85L339n942P789J497M011k290j573j483q15
$$ 12424 17200 21106 22133 12748 7334 6649 9988 4046 11835 13332 17343 15053 13480 11997 11182
12282A1182P032K136n117q567n770n609Q786P891J052n853l879l86j197K629k853
$$ 11182 18214 20350 15233 6666 896 -4713 4073 11964 13016 7163 3284 2898 1701 4330 1477
12267A477P153n35o191n210n598J523J0114m522j0317J3889Q575j131J185M981
$$ 1477 8630 8095 1904 -3306 -8904 -7381 2733 -1789 -12106 1783 10358 9227 10412 15393
12253A5393M536L09L916K301l179N893M91p707q10N836k396j2000j3755J1284
$$ 15393 19929 20238 24154 26455 23276 29169 29660 21953 21143 26979 24583 12583 -1172 10112
12239A0112l692m115N241O609q3R118J3k791j2243O375j5406j2593O90n32r628
$$ 10112 6420 2305 7546 14155 14072 23190 23203 20412 8169 14544 -862 -13455 -12765 -13297 -22925
12224b2925M543P539K675K709l843m445J4525J2002k325o13J652J847q970j420
$$ -22925 -18382 -10843 -8168 -5459 -9302 -13747 778 12780 10455 9842 11494 13341 4371 2951
12210B951J121L659j032l790P291n333r464N062J1730R414j045r695j7336P390
$$ 2951 4072 7731 6699 2909 10200 4867 -4597 465 12195 21609 20564 10869 -6467 923
12196I23N981r055m532J165R454R413j075K875l471n918Q234O162M828n562q422
$$ 923 6904 -2151 -6683 -5518 3936 13349 12274 15149 11678 5760 13994 20156 24984 19422 11000
12181A1000j814M570j0444p135j07K381k798L070Q572M918N433J1620J191o408
$$ 11000 9186 13756 3312 -3823 -3930 -1549 -4347 -1277 7295 12213 17646 29266 30457 24049
12167B4049m680p271K580J080P274k950r336j2260J311J6025Q765J393q068k499
$$ 24049 19369 12098 14678 15758 23032 20082 10746 -1514 -203 15822 24587 25980 17912 15413
12153A5413r45k245P448o426O493P677j1237k045L608l950q802R146l558k392
$$ 15413 14468 12223 19671 13245 19738 27415 16178 14133 17741 13791 4989 14135 10577 8185
12139H185k396k048K442q291J345L179j266Q06j563P535Q527M0q37K295j762q905
$$ 8185 5789 3741 6183 -2108 -763 2416 1150 1956 393 7928 16455 16495 15658 17953 16191 7286
12123G286l955J264J413N05J772k986N443m627j382M015j5754O098R209J3227
$$ 7286 3331 4595 6008 6513 8285 5299 10742 6115 4733 8748 -7006 -908 8301 21528
12109B1528l944j4844q917o600J41P804J6518N408j838q19J356M373q965j1499
$$ 21528 17584 2740 -6177 -12777 -12636 -4832 11686 17094 15256 14437 15793 20166 11201 -298
12095b98k987L071N073j612j2199K198Q292M446J0j1800l701M811J4503J3982
$$ -298 -3285 -214 4859 3247 -8952 -6754 1538 5984 5994 -5806 -9507 -4696 9807 23789
12081B3789M451L139n200j1269o616q57R09O016q38P873o755O05j786k521n060
$$ 23789 28240 31379 26179 14910 8294 7437 8346 14362 13524 21397 14642 15247 13461 10940 5880
12066E880j438j0779j1567J6999O217P923r345q202R663k523k357O138P103R523
$$ 5880 4442 -6337 -17904 -905 5312 13235 3890 -4312 5351 2828 471 6609 13712 23235
12052B3235k819q783r677L818M400j2826k300O622Q615m829p707n338P295J0072
$$ 23235 20416 11633 1956 5774 10174 -2652 -4952 1670 10285 5456 -2251 -7589 -294 9778
12038I778n032j9803l87R648k171N188O214N011o671o487P913P753J5441Q577
$$ 9778 4746 -15057 -15444 -5796 -7967 -2779 3435 8446 1775 -4712 3201 10954 26395 34972
12024C4972l220m411o976j129j042r952k672k605m954L903p64K819m473K921N710
$$ 34972 31752 27341 20365 19236 18194 8242 5570 2965 -1989 1914 1150 3969 -504 2417 8127
12009H127J6019K052J048J58K76n08l858j0400j6891P43O74K327J68O39j348k980
$$ 8127 24146 26198 27246 27404 27680 27172 23314 12914 -3977 -3234 -2560 -233 -65 574 -774 -3754
11993c754j340L764Q576R21l490K18L158P522K112k156r788M219P08P449l455
$$ -3754 -5094 -1330 7246 8167 4677 4895 8053 15575 17687 15531 5743 9962 10670 18119 14664
11978A4664r395J0917J624O580l523k767k992L638m972n699m54P339k175N27J2396
$$ 14664 5269 16186 17810 24390 20867 18100 15108 18746 13774 8075 7621 14960 12785 13312 25708
11963B5708J5755J107j3130k020K786L881m582j0707m570M099N525M773j2821
$$ 25708 41463 42570 29440 27420 30206 34087 29505 18798 14228 18327 23852 28625 15804
11950A5804l094j634m93J0277k537j5952M312O329o393j8923m630L640J4869M668
$$ 15804 12710 11076 10583 20860 18323 2371 6683 13012 6619 -12304 -16934 -13294 1575 6243
11936F243j1176m464Q732K086l132M758J743M015k042L889K945k942j813n449
$$ 6243 -4933 -9397 -665 1421 -1711 3047 4790 8805 6763 10652 13597 10655 8842 3393
11922C393o48Q22J589J754k232n736j757M912r050L955J1186J3904P026o195j5983
$$ 3393 2745 3567 5156 6910 4678 -1058 -2815 2097 -6953 -2998 8188 22092 29118 22923 6940
11907F940r395n10L144n114j0852P88P217M082L323k845o242j204O892N793L82
$$ 6940 -2455 -2965 179 -4935 -15787 -14999 -7782 -3700 -377 -3222 -9464 -10668 -3776 2017 2399
11892B399O478P161O88m140K682l775q782K6J307j81Q578J257q517m976j925q829
$$ 2399 8877 16038 16726 12586 15268 11493 2711 2737 4044 3863 12441 13698 5181 205 -1720 -10549
11876a0549J851j596M940N980K789R28J3481P014m860k301n930j176j4980M333
$$ -10549 -8698 -10294 -5354 626 3415 4343 17824 24838 19978 17677 11747 10571 -4409 -76
11862g6N796P113L595j1748o94M307m949n632L233l207o810p155O060N528l362
$$ -76 5720 12833 16428 4680 3986 8293 3344 -2288 945 -2262 -9072 -16227 -10167 -4639 -8001
11847h001J188K91L374J2300J769n836o220P601N290K068K591n95j946l90p760
$$ -8001 -6813 -6522 -3148 9152 10921 5085 -1135 6466 11756 13824 16415 15820 13874 13484 5724
11832E724N859J7647r219j5045k41N755L860k371K540M75L337o761j217r785l719
$$ 5724 11583 29230 20011 4966 4725 10480 14340 11969 14509 14984 18321 11560 10343 558 -3161
11817c161J2794K213j4565K514O164l770p332K891O324J1046j666m911m539k295
$$ -3161 9633 11846 -2719 -205 5959 2189 -5143 -2252 4072 15118 13452 8541 4002 1707
11803A707P669k758j0728L982M212p471J279R71K436P871Q042n18n923J5930l490
$$ 1707 9376 6618 -4110 -128 4084 -3387 -2108 -1137 1299 9170 17212 16694 10771 26701 23211
11788B3211p98n586l409L354k11J212j0680o352J643L659l082M854m647O758n67
$$ 23211 22413 16827 13418 16772 16561 17773 7093 741 2384 6043 2961 7815 3168 9926 9359
11773I359O402L838o762p098M305m076M337l906N248J16j6923o13r520o481J588
$$ 9359 15761 19599 12837 5739 10044 5968 10305 6399 11647 11763 -5160 -5773 -15293 -21774 -20186
11758b0186P407N979L246n820O967N584m365M988N203k189n270j4823J3362P328
$$ -20186 -12779 -6800 -3554 -9374 -2407 3177 -1188 3800 9003 6814 1544 -13279 83 7411
11744G411r084J214J2076P874M4k835j1339Q72J016K383Q457k85j116P052J24
$$ 7411 -1673 -459 11617 19491 19535 16700 5361 6233 7249 9632 18089 17804 16688 23740 23864
11729B3864q727j028R452j4563p057N85M944J5140M078n098j4007k729P664R916
$$ 23864 15137 14109 23561 8998 1941 2526 7470 22610 26688 21590 7583 4854 12518 22434
11715B2434O480p523j2882r047K855J795O192Q617M69K252K750j708p955j1753
$$ 22434 28914 21391 8509 -538 2317 4112 10304 18921 19390 21642 24392 22684 14729 2976
11701B976j2704j5425n515O139Q675R848Q428J1263J6250N845j4352j9848L058
$$ 2976 -9728 -25153 -30668 -24529 -15854 -6006 2422 13685 29935 35780 21428 1580 4638
11688D638j681K697q26M610N513m601j3958o570J661Q334K976p06p923M15L18
$$ 4638 2957 5654 4828 9438 14951 10350 -3608 -10178 -8517 -183 2793 2087 -5836 -5421 -5103
11673e103m118j698N620R054N061j991O032K809j1553L866K587l645J2260m765
$$ -5103 -9221 -10919 -5299 3755 8816 6825 12857 15666 4113 7979 10566 6921 19181 14416
11659A4416R92p158j2760q67J197l23P162P929m520o481r358J2141J1247k22m310
$$ 14416 15408 8250 -4510 -5377 -4180 -4503 2659 10588 6068 -413 -9771 2370 13617 13395 9085
11644I085L492K156l075J321l404P102J636M06J1487Q070j169j2204j4004j1879
$$ 9085 12577 14733 11658 12979 9575 16677 18313 18719 30206 38276 37107 24903 10899 -980
11630i80l88J412J908n412P10Q444P359r63l259R30J201j1034O674J5125j0150
$$ -980 -1368 44 1952 -3460 -2750 5694 13053 12090 8831 9761 10962 -72 6602 21727 11577
11615A1577O424L893m150L753J599L437k587o836j312M226k088j34n094m567L334
$$ 11577 18001 21894 17744 21497 23096 26533 23946 17110 15798 20024 17936 17802 12708 8141 11475
11600A1475J6284J5735J4953N248N230r867q922j3048k726P356k065j562j65L005
$$ 11475 27759 43494 58447 63695 68925 59058 50136 37088 34362 41718 39653 38091 37926 40931
11586D0931K478l618q001j786n975j5383k090J0778p92q834m638L617K799J9074
$$ 40931 43409 39791 31790 30004 24029 8646 6556 17334 16542 7708 3070 6687 9486 28560
11572B8560J4899n880j7268j6870M61R7J4536J1083n693J0q694j0640M063Q575
$$ 28560 43459 37579 20311 3441 3902 3999 18535 29618 23925 23935 15241 4601 8664 17239
11558A7239J2829j5099K014J590k410O184K442l188J033j300q547q536l518p797
$$ 17239 30068 14969 16983 18573 16163 22347 24789 21601 22634 21334 12787 4251 733 -7064
11544g064o315J5552P464j6467J0024M970L173j137k581r30N650K339J169Q776
$$ -7064 -13379 2173 9637 -6830 3194 8164 11337 10200 7619 6689 12339 14678 15847 24623
11530B4623N285j1409q718j0917N241m090l356o14M83O191r155n421M78K4100
$$ 24623 29908 18499 9781 -1136 4105 15 -3341 -3955 -3472 2719 -6436 -11857 -11379 12721
11516A2721J0283l433R146L936n523p286q042m641Q404l775J6m067j245M469K012
$$ 12721 23004 19571 28717 32653 27130 19844 11802 7161 15565 11790 11806 7739 6494 10963 12975
11501A2975Q128J0702M292r892l073j1685o491K674l752O177K173J634j461J126
$$ 12975 21103 31805 36097 26205 23132 11447 4956 7630 3878 10055 12228 13862 12401 13527
11487A3527P612R691L600m315q25K918n960m025q32k650k465Q073P706m370o40
$$ 13527 21139 30830 34430 30115 29290 32208 26248 22223 21391 18741 16276 24349 32055 27685 27045
11472B7045L652J0028P3j2415j1958r164p665m926Q710K4263R398O299K383r837
$$ 27045 30697 40725 40798 28383 16425 7261 -404 -5330 3380 27643 37041 43340 45723 35886
11458C5886n879R449J830l914N167N808l952l388L854N474O424m288p185m673
$$ 35886 30007 39456 41286 37372 42539 48347 44395 41007 44861 50335 56759 52471 45286 40613
11444D0613L888p345j3522p853L02K111P741j1636M813J0509M716n084O431K99
$$ 40613 44501 37156 23634 15781 16083 18194 25935 14299 19112 29621 34337 29253 35684 35983
11430C5983o810j2389k738K407N395n35l601l455P510L641P866o417q865l972
$$ 35983 29173 16784 14046 16453 21848 21313 17712 14257 21767 25408 33274 26857 17992 14020
11416A4020p677o732K335j630K716J521K147m66k451j097M602N1k018K698O245
$$ 14020 6343 -389 1946 316 3032 4553 6700 6234 3783 2686 7288 7339 5321 8019 14264
11401A4264J0660r2J2071k565j1674j275N78J2306q62q661j3117P04J2901J6835
$$ 14264 24924 24832 36903 34338 22664 21389 21967 34273 33411 24750 11633 12337 25238 42073
11387D2073Q872n192j7064n260P707J292P35L315k83K296O11k3303j7050L062
$$ 42073 50945 45753 28689 23429 31136 32428 33163 36478 36195 38491 39102 15799 -1251 1811
11373A811J2126Q388O247J4245J6263o444j8871l204q849n330l85j851j1409R132
$$ 1811 13937 22325 28572 42817 59080 52636 33765 30561 21712 16382 15997 14146 2737 11869
11359A1869J989J496P885J733j2291r273Q017M412r304n101q33J3650O017p784
$$ 11869 13858 15354 23239 24972 12681 3408 11425 15837 6533 1432 599 14249 20266 12482
11345A2482L068J958o990N51j900o538M256n195o007j1662j589J3231Q334P800
$$ 12482 15550 17508 10518 11069 9169 2631 6887 1692 -4315 -15977 -17566 -4335 3999 11799
11331A1799k699R65M213j3218O87j923P257N188J463J345r673r37q5p473j2380
$$ 11799 9100 10065 14278 1060 1747 -176 7081 12269 13732 15077 5404 4467 4382 -3091 -15471
11316a5471J2502K1270l105n257Q857M8j3671l851L451J0293N04O497p26K671
$$ -15471 -2969 18301 15196 9939 18796 18844 5173 1322 4773 15066 15570 22067 21341 24012
11302B4012r138r604N212J6602R02Q40J6391K4641L1248Q51m009k280R077k4020
$$ 24012 14874 5270 10482 27084 27986 28826 45217 69858 101106 101957 97948 95668 104745 80725
11288H0725j7545p548k2630j8275o433P246M211K107J236l343r922m333n877k573
$$ 80725 63180 55632 33002 14727 8294 15540 19751 21858 23094 19751 9829 5496 -381 -2954
11274b954k439M115R619k206J0284m029k3009l418K946R416q70Q017J603j2097
$$ -2954 -5393 -1278 8341 6135 16419 12390 -10619 -14037 -11091 -1675 -2545 5472 7075 -5022
11260e022N002J5848k685J785R97N52L310J204o337l648j1195N514P529K074k230
$$ -5022 -20 15828 13143 14928 15925 16477 19787 20991 14654 11006 -189 5325 12854 14928 12698
11245A2698o539r175j058J7982M954m018j0035m345K579J1349r05l706L536j764
$$ 12698 6159 -3016 -4074 13908 18862 14844 4809 464 3043 14392 13487 9781 13317 11553
11231A1553r481l887n343J650p955P860J344K960N560Q254m770j5542JL450O186
$$ 11553 2072 -1815 -7158 -5508 -13463 -5603 -4259 -1299 4261 12515 7745 -7797 -7796 -4346 1840
11216A840J3786O200j0269m946P826J695k750l51q055M562Q43j741p192p623L875
$$ 1840 15626 21826 11557 6611 14437 16132 13382 13031 4976 9538 10381 8640 1448 -6175 -2300
11201b300J1616L353K208q097r355O893o204q822j940J3479R632k365m241j1378
$$ -2300 9316 12669 14877 6780 -2575 4318 -1886 -10708 -12648 831 10463 8098 3857 -7521
11187g521j374O644k472J31k409O69K555l272K635Q749P762N206Q343J7445K7308
$$ -7521 -8895 -2251 -4723 -4592 -7001 -6332 -3777 -7049 -4414 4335 12097 17303 25646 43091 70399
11172G0399J3149N000q017l86j1497j9232j3748j1590J64M176O54j6254j6394
$$ 70399 83548 88548 80531 80145 68648 49416 35668 24078 24242 28418 29072 12818 -3576
11159c576m301M084J888L288l050m665n177M839J7951R38l380N64J327n449j919
$$ -3576 -7877 -3793 -1905 1383 -1667 -6332 -11509 -6670 11281 12219 8839 9403 10730 5281 3362
11144C362L99o519L182n183R53P243k187K806q317r0Q439Q957n765m524l498r65
$$ 3362 3761 -2758 424 -4759 -3806 3437 1250 4056 -4261 -4351 4088 13045 7280 2756 -742 -1707
11128a707O704L42m879j1431N585L818m308K079L420K654K358j607K363r2L264
$$ -1707 4997 5339 460 -10971 -5386 -1568 -5876 -3797 -377 2277 4635 3028 5391 5299 8563
11113H563K038Q095m629q855J722L378m139k303l171K10k646Q958J4965k200J752
$$ 8563 10601 18696 14067 5212 6934 10312 6173 3870 699 909 -1737 7221 22186 19986 21738
11098B1738N774j1585p540p137q129m03j363Q368K230M38j032P260j154O972k765
$$ 21738 27512 15927 8387 1250 -6879 -7282 -8645 -277 1953 2391 1359 8619 7465 14437 11672
11083A1672o981p715M348r470o25J3687N484J0162k768j517Q87O53J548m185k54
$$ 11672 4691 -3024 1324 -8146 -8771 4916 10400 20562 17794 16277 17164 17817 19365 15180 14926
11068A4926L079O067O375j1887j0963K601J422r424K388j0411l566n055O480Q466
$$ 14926 18005 24072 30447 18560 7597 10198 11620 2196 4584 -5827 -9393 -14448 -7968 498
11054D98Q155J311n235n45J190k330J3556R58j0600k208R319J2165J950M78n436
$$ 498 8653 9964 4729 4184 5374 3044 16600 17558 6958 4750 14069 26234 28184 28662 23226
11039B3226M070P445l268q377j4474l012j2220R235J1832l445j4m422L219L034
$$ 23226 27296 34741 31473 23096 8622 5610 -6610 2625 14457 11012 10998 6576 9795 12829
11025A2829K008M983j094J033l669Q603J503r137n151N550o247j4442n971j280
$$ 12829 14837 19820 18726 19759 16090 24693 26196 17059 11908 17458 11211 -3231 -9202 -10482
11011a0482J2900K706m807K839o16K694L801J0991PL724J096J088P085o757P196
$$ -10482 2418 5124 317 3156 2540 5234 9035 20026 20033 23757 24853 25941 33026 26269 33465
10996C3465m891q323J1672J4604P038n349m089J1511J0819J1564R578L898J3659
$$ 33465 28574 20251 31923 46527 53565 48216 44127 55638 66457 78021 87599 91497 105156
10983A05156J9232R814K1661M0516O9830R4310J47783K55565M57563O93499P12307
$$ 105156 124388 134202 155863 196379 266209 360519 508302 763867 1221430 1914929 2627236
10972B627236J88644n11208p50593n60787l30563j89447j24813q1897n9922l4937
$$ 2627236 2815880 2304672 1554079 993292 662729 473282 348469 266572 206650 171713
10962A71713j8894k4175k8749k0847o729n649o946j2954j1743k158M891m147o596
$$ 171713 152819 128644 99895 79048 72319 66670 59724 46770 35027 32869 37760 33613 27017
10949B7017J3493k739q391j0916r72Q023R495N915J1777J746j1714n656j097k274
$$ 27017 40510 37771 29380 18464 17492 25515 35010 40925 52702 54448 42734 37078 35981 33707
10935C3707l326J2597Q680j560k17K749J0706k622p666m214O39j1073m957k052
$$ 33707 30381 42978 51658 50098 49881 52630 63336 60714 53048 48834 49473 38400 33443 31391
10921C1391K359N901j1875L182M558n205O517N435j2919L352O773j3993r623N52
$$ 31391 33750 39651 27776 30958 35516 30311 36828 42263 29344 32696 39469 25476 15853 16405
10907A6405L651M223j390P094J0501N931K715n321r501O925J108r961j8133j3031
$$ 16405 20056 24279 22889 29983 40484 46415 49130 43809 34308 41233 42341 32380 14247 1216
10893A216j3595O177J6412P830L807K154n34m798o22J0544O183K331L351Q986
$$ 1216 -12379 -6202 10210 18040 21847 24001 23467 18669 18047 28591 34774 37105 40456 49442
10879D9442j1259j2431K310r449k062p00J501l054j4479n442j3221L315J0716
$$ 49442 38183 25752 28062 18613 16551 15851 17352 14298 -181 -5623 -18844 -15529 -4813
10866d813P305O278J4711L464K235Q66k156N23j6045J0689J5416J1421J9962q603
$$ -4813 2492 8770 23481 26945 29180 30046 27890 28413 12368 23057 38473 49894 69856 61253
10852F1253j4765j2417J513o569m927l692K807P388Q500M708j054J18m345q552
$$ 61253 46488 34071 35584 29015 24088 20396 23203 30591 39091 43799 42745 42863 38518 29966
10838B9966m370k669N222N827Q096n070j603m122J0445J1105n30j7311m60n526
$$ 29966 25596 22927 28149 33976 42072 37002 35399 31277 41722 52827 52297 34986 34526 29000
10824B9000k901j7916o964K4585K5989L3891M2127O1817Q8340N6481L2264l4659
$$ 29000 26099 8183 1219 25804 51793 85684 127811 189628 277968 334449 366713 332054
10812C32054j15590j10881n0323p170j0356j2935o030M260m147M433J0601K147
$$ 332054 216464 105583 55260 48090 37734 24799 18769 23029 18882 23315 33916 36063
10800C6063N881P7N448Q251J1246O045q629j7003j1896j6578p795j0632j1125
$$ 36063 41944 42021 47469 55720 66966 73011 64382 47379 35483 18905 11110 478 -10647
10787a0647L151K328L647n367j5451K065O147J1689l294p206p512q512q703R229
$$ -10647 -7496 -5168 -1521 -6888 -22339 -20274 -14127 -2438 -5732 -12938 -20450 -28962 -37665 -28436
10773b8436K0553J4564o28k614j241o760K040J2197L09j4718l3767k0326M888
$$ -28436 -7883 6681 6053 3439 2198 -4562 -2522 9675 9984 -4734 -38501 -58827 -53939
10760e3939J8352K4794K0583L921J2309P492N158P639p123O119L6554L2502P286
$$ -53939 -35587 -10793 9790 13711 26020 33512 38670 46309 39186 45305 81859 114361 121647
10747A21647J2750p273j8020j5274p104n808L073k344o321j3836K268L882q944
$$ 121647 134397 127124 109104 93830 86726 80918 83991 81647 75326 61490 63758 67640 58696
10734E8696j6788p252Q716K4182K4767R902N159j5302k6764J221N445k933l657
$$ 58696 41908 34656 43372 67554 92321 102223 107382 92080 65316 66537 71982 69049 65392
10721F5392K933J4817j999q971n222k86j0321q087K0786K2539N193n737m550j3396
$$ 65392 68325 83142 81143 72172 66950 66664 56343 48256 69042 91581 96774 91037 86487 73091
10707G3091l563p991j6686k2762j3954o641O495J6484L5020K7920J161J4046k538
$$ 73091 69528 61537 44851 22089 8135 1494 7989 24473 59493 87413 88574 102620 100082
10694A00082N771K2330K5557L6926M4468L0037Q7933M7189n2337o8473n2836l0412
$$ 100082 105853 128183 153740 190666 235134 265171 353104 400293 347956 279483 226647 196235
10682A96235j1577j3118j3708l571p455j745j0247j3983j6451J6879K9281J1783
$$ 196235 184658 171540 157832 154261 146806 145061 134814 120831 104380 121259 150540 162323
10670A62323P784K1949m161o667j6201j5061N910J2317K421J272O485J5556O697
$$ 162323 170107 192056 187895 181228 165027 149966 155876 168193 170614 171886 178371 193927 200624
10657B00624O480j6716k1811m302p477K229Q770K3525J8833K7553J2897N104J400
$$ 200624 207104 190388 168577 164275 156798 159027 167797 191322 210155 237708 250605 255709 257109
10644B57109r227q41n369m965J3165K8986L8061K1886K5696J7300o279j4596l170
$$ 257109 247882 247041 241672 236707 249872 278858 316919 338805 364501 381801 375522 360926 357756
10631C57756J3357K6221K5537M724k097k854o895j159o195L999K7200L6152L2206
$$ 357756 371113 397334 422871 427595 425498 422644 415749 414590 408395 412394 439594 475746 507952
10618E07952K7777L7668K5487J9819M4949O5704Q3668O1242J5802j3291j8040
$$ 507952 535729 573397 598884 618703 663652 729356 813024 874266 890068 876777 858737
10607H58737Q647L8413O5949P7376J11257J21953J24520Q6457N7573K9313M983
$$ 858737 867384 905797 971746 1049122 1160379 1282332 1406852 1493309 1550882 1580195 1585178
10596A585178Q313L1258O9954J52391K36061K78647L40323M79021O82634R87115
$$ 1585178 1593491 1624749 1694703 1847094 2083155 2361802 2702125 3181146 3863780 4850895
10586D850895J152940P69844n2588m52230j97704J99648M94552P72319J007004
$$ 4850895 6003835 6773679 6721091 6268861 6071157 6270805 6765357 7537676 8544680
10577H544680J189384J439528J872745K541028L440013M511025N937344Q165145
$$ 8544680 9734064 11173592 13046337 15587365 19027378 23538403 29475747 37640892
10569C7640892J1964810J8833656L1951103N6583050R6850357J37511359J15985472
$$ 37640892 49605702 68439358 100390461 156973511 253823868 391335227 507320699
10562E07320699l615447j17736490j34846716r1072865n3420660l1855308j9683003
$$ 507320699 503705252 385968762 251122046 160049181 106628521 74773213 55090210
10555E5090210j2737083q682258o310341m901971l797441k934933k337768j850780
$$ 55090210 42353127 33670869 27360528 22458557 18661116 15726183 13388415 11537635
10547A1537635j381030j046979q69932p05116n18600l63113j70688J46801L59234
$$ 11537635 10156605 9109626 8239694 7534578 7015978 6652865 6482177 6628978 6988212
10538F988212n1161p69219r83091p40377m86321l23720k58329k73580k97043k62175
$$ 6988212 6937051 6167832 5184741 4444364 3958043 3634323 3375994 3102414 2805371 2543196
10528B543196k38894k04574j65192j33040p6974j4752J1489L636J3175j7555r4215
$$ 2543196 2304302 2099728 1934536 1801496 1724522 1709770 1721259 1724895 1738070 1720515 1626300
10517A626300j55679j47267j14663p4107m0070j3858j5447l7904l9790m0201l2017
$$ 1626300 1470621 1323354 1208691 1134584 1094514 1080656 1065209 1027305 987515 947314 915297
10506I15297j4152n878m730o763k5810l9218m6809n1808m2090k3325k1461k368
$$ 915297 901145 895267 890537 883774 857964 818746 771937 720129 678039 654714 633253 630885
10494F30885J3643m321k3760l7877m4686k1132j465R349J4061O801j3275k0544
$$ 630885 644528 640207 616447 578570 533884 512752 511287 520636 534697 541498 528223 507679
10482E07679k1528j5276q420k813N034N695P548J1679j0854j1472r992p503k2516
$$ 507679 486151 470875 462455 459642 464676 470371 477919 489598 478744 467272 457280 449777 427261
10469D27261k8966j4461n630r557K247j9458n302k867l037Q668m275j7292j9492
$$ 427261 398295 383834 378204 368647 370894 351436 346134 343267 340230 348898 344623 327331 307839
10456C07839j4533N910J2408P638J9505J0600j6328k2062j1194L866O886O722
$$ 307839 293306 299216 311624 319262 338767 349367 333039 310977 299783 303649 310535 317257
10444C17257R675q133K37M3664O3929J19185J46401R1299J1267o6793j18294j16857
$$ 317257 326932 318799 319036 362700 426629 545814 692215 783514 794781 727988 609694 492837
10432D92837p1828l8760j1884k0293k3639o605o458n770j0774p107r032p767j6619
$$ 492837 421009 382249 370365 350072 326433 319828 313370 307600 296826 289719 280687 272920 256301
10419B56301j5490k3009j6820J0032J1182M124Q801J9397L136m526l519j7986
$$ 256301 240811 217802 200982 211014 222196 226320 235121 254518 257654 253128 249609 231623
10407B31623k5893k7241j5836k754K322J3187K3012l753k594J354p213q736P552
$$ 231623 205730 178489 162653 159899 162221 175408 198420 194667 192073 193427 186214 177478 185030
10394A85030J5758K5619J2526k587j7775j5410j1646l757L717k0297j0042r754
$$ 185030 200788 226407 238933 236346 218571 203161 191515 187758 191475 171178 161136 151382
10382A51382j3258j2601k2099j5348J1472J5815l061L783J6943J2649K271O277
$$ 151382 138124 125523 103424 88076 99548 115363 112302 116085 133028 145677 147948 154225
10370A54225J6357J9350P810P765J9819K5895Q093o406k7780k5588r270M758L133
$$ 154225 170582 189932 197742 205507 225326 251221 259314 252908 225128 199540 190270 195028 198161
10357A98161J828J145j9956j5758n222J0967J7135K0798L412j2870j5363j0884
$$ 198161 199989 201134 181178 165420 160198 171165 188300 209098 212510 199640 184277 173393
10345A73393j985L338L944k443k561l872J2138K8958j0099k1404j9694j0006j1960
$$ 173393 171408 174746 178690 176247 173686 169814 181952 210910 200811 179407 159713 149707 137747
10332A37747M41m561q310r07K528J64k229J4012J3981O048N123J161M331J5281
$$ 137747 138188 133627 125317 124410 126938 127102 124873 138885 152866 158914 164037 165198 169529 184810
10318A84810L1505K8362K9093K4034J5840J3597l331p515m909j1365j3145j9199
$$ 184810 216315 244677 273770 297804 313644 327241 323910 316395 311486 300121 286976 267777
10306B67777k7444j3788j7218r974q462j6399j6461j451j0238j7306k574l112
$$ 267777 240333 226545 209327 199353 190891 174492 158031 156580 146342 129036 126462 123350
10294A23350l523o205m596J2461J1600J0153J406p687q679j5735K615N317L630
$$ 123350 119827 113622 109026 121487 133087 143240 144646 136959 128280 112545 115160 120477 124107
10281A24107L629P992p176l405m844j4544n884J537K460o749o00p82J8678J2723
$$ 124107 127736 135728 128552 125147 120303 105759 99875 101412 103872 97123 96523 95741 114419 127142
10267A27142J391j8245j5199j484n850M345J409O997K2453K0909J0675N698o575
$$ 127142 128533 110288 95089 93605 87755 92100 93509 100506 122959 143868 154543 160241 153666
10254A53666k7291j3145N984J3221K469L19j474n658j3807M445J7480O492J123
$$ 153666 126375 113230 119214 132435 134904 135223 133749 128091 114284 118729 136209 142701 143824
10241A43824J925Q1j0484n134l813n861P712J4721Q00r642j0858j81O279n566
$$ 143824 145749 145830 135346 130212 126399 120538 128250 142971 143771 134129 123271 123090 129369 123803
10227A23803q506j2800L25k91J5951K31o751P396L747N23M399n260o793J766J3195
$$ 123803 115297 102497 102822 102531 118482 118713 111962 119358 123105 123628 128027 122767 115974 117740 130935
10212A30935K598j0254p740j212k762Q981l279q99o441K115L263Q530N555r96
$$ 130935 133533 123279 115539 114327 111565 120546 117267 116368 109927 112042 115305 123835 129390 128394
10198A28394q762K830j5432j0027R898J5863n481N448n565j2307n769J7473J2518
$$ 128394 119632 122462 107030 97003 106901 122764 117283 122731 117166 104859 99090 116563 129081
10185A29081M619N626N747j1817j1206K514Q841J410M341P670J2308K023j657
$$ 129081 133700 139326 145073 133256 122050 124564 133405 134815 139156 146826 159134 161157 159500
10172A59500p377j733O190M398K623P282j311J682J8017R762q782n618N984R380
$$ 159500 152123 150390 156580 160978 163601 170883 169572 171254 189271 199033 190251 184633 190617 199997
10158A99997J0700L4896K7267L3274M5355P7860J42333K42264M19161O50910P40922
$$ 199997 210697 245593 272860 306134 351489 429349 571682 813946 1233107 1884017 2624939
10147B624939L06693m23953p44017n94573l61278k03011j25889q4746n0115k8738
$$ 2624939 2931632 2507679 1763662 1169089 807811 604800 478911 394165 344050 315312
10137C15312l6741l5268l3181j4796j5295k855M04k516j3057j0351M278k230j2730
$$ 315312 278571 243303 210122 195326 180031 177176 177580 175064 162007 151656 155934 153704 140974
10124A40974R755J4757k917j4812R735Q356J2066q77j8600O632Q782j1329j2164
$$ 140974 150729 165486 162569 147757 157492 165848 177914 177037 158437 165069 173851 162522 150358
10111A50358j3393o129K950L699M559P898P669j0563o677L162Q166q995j1756
$$ 150358 136965 130836 133786 137485 142044 149942 157611 147048 140371 143533 151699 142704 130948
10098A30948k250r856L173O1M918L804lp558L449o422m039N43L216K39P676R140
$$ 130948 128698 118842 122015 122076 126994 130798 130795 123237 126686 120264 116225 116768 119984 120223 127899 137039
10082A37039N888k349p106n17n013k935O666R65k278q136P798k25n900l741P29
$$ 137039 142927 140578 133472 132955 127942 125007 131673 132638 130360 122224 130022 129797 123897 120156 120885
10067A20885j9343j2400R77P045J7487R190R901Q108q186p350k599J0499R306
$$ 120885 101542 89142 90119 97164 114651 123841 133742 141850 133664 126314 123715 134214 143520
10054A43520L572R571p587k687J0844p328Q541J8153J0316O979J0213K6863N0091
$$ 143520 147092 156663 149076 146389 157233 149905 158446 176599 186915 193894 204107 230970 281061
10041B81061N6896R5696J70706L56901O96872J035842O37316n15769j028217p35684
$$ 281061 337957 433653 604359 961260 1658132 2693974 3331290 2815521 1787304 1051620
10031A051620l73817j74175j10270p2746m6180m1407j1175q184j6630j8839r260
$$ 1051620 677803 503628 393358 320612 274432 233025 221850 213666 197036 178197 168937
10020A68937q979l420q800m343Q000Q576m574l179j4044j308l70n082N867K202
$$ 168937 159958 156538 147738 143395 151395 159971 155397 152218 138174 136866 136496 131414 137281 139483
10006A39483o821P99k058l883N075P159k955n789j3816k113k909l196M409J6216
$$ 139483 132662 133461 131403 127520 132595 139754 136799 131010 117194 115081 112172 108976 113385 129601
9992A29601P359K608N532n09k857p768L330n129j0047j0766O859P09j1332q507
$$ 129601 136960 139568 145100 144591 141734 133966 137296 132167 122120 111354 118213 118922 107590 99083
9978I9083P153l773j872R808k150n427N196N321M477J042j9971l504J4636L401
$$ 99083 106236 102463 100591 110399 108249 102822 108018 113339 117816 118858 98887 95383 110019 113420
9964A13420L81k847J0027P955j1114n911q704l759q295l064J3580J94K237O636
$$ 113420 113801 110954 120981 128936 117822 111911 103207 99448 91153 88089 101669 101863 104100 110736
9950A10736j323j4612M158R405O595J1097O733k476k666r03j427j0738j3217q513
$$ 110736 109413 94801 98959 108364 114959 126056 132789 130313 127647 126744 125317 114579 101362 92849
9936I2849O951o00p306R455O011L741k302r570j275Q851L165L99m275L596o872
$$ 92849 99800 99200 91894 101349 107360 111101 108799 99229 97954 106805 109970 110369 106094 109690 102818
9921A02818P802K195m894K377R882R76N477P73q456n588k232o329N394K658m014
$$ 102818 110620 112815 107921 110298 120180 121156 126633 127406 118950 113362 111130 104801 110195 112853 108839
9906A08839r156j1250j181J0345J0998M885k313j6209j4449K094N770O606J1508
$$ 108839 99683 88433 87252 97597 108595 113480 111167 94958 80509 82603 88373 94979 106487
9893A06487L076m767K014r025n888Q483J926n711L278j818k91K044j714J3903
$$ 106487 109563 104796 106810 97785 91897 100380 102306 96595 99873 98055 97764 99808 98094 111997
9879A11997J2248m457K514J884L354M503m285l865J395q951j1452j0869n745M503
$$ 111997 124245 119788 122302 124186 127540 132043 127758 123893 125288 116337 104885 94016 88271 92774
9865I2774j298k740j3610j155J4495J4906M741M761R009M500l87j991j5263j8228
$$ 92774 91476 88736 75126 73971 88466 103372 108113 112874 121883 126383 125996 124005 108742 90514
9851I0514o283K944n947n581Q028J6488k861o133J5621K335q511J0026J5028L079
$$ 90514 84231 87175 81228 75647 83675 100163 97302 91169 106790 109125 100614 110640 125668 128747
9837A28747J282P51j0651j872n853j0327o930O00J2446L914j5000j5830l704P091
$$ 128747 130029 130780 120129 118257 112404 102077 95147 95747 108193 112107 97107 81277 77573 84664
9823H4664O167n886K943m267N509N810J2515p361p613j5968p199l845K094J2582
$$ 84664 90831 84945 87888 83621 89130 94940 107455 100094 92481 76513 69314 65469 67563 80145
9809H0145p12j1346j036J3680J0921Q541N040o132j457N734k257R553N112m759
$$ 80145 79433 68087 67051 80731 91652 100193 105233 99101 97644 103378 101121 110674 115786 111027
9795A11027k220j0553j2772J524L941l778r746j0601M859P004N258k54k822J703
$$ 111027 108807 98254 85482 87006 90947 87169 77423 66822 71681 78685 83943 83689 80867 82570
9781H2570P42j2341m473R113Q770k893o820j938n605L054M065N705L99l479l624
$$ 82570 83312 70971 66498 75611 84381 81488 74668 72730 67125 70179 74244 79949 80348 76869 73245
9766G3245K115J5837n172l801j1822O052O188J059l497k696L305o453q014N996
$$ 73245 75360 91197 86025 82224 70402 76454 82642 83701 80204 77508 80813 74360 66346 72342
9752G2342n923o267J158l98J0638KP991n32j2762j3012N543J0276K713J1554J2185
$$ 72342 66419 60152 61310 60912 71550 71552 79543 79011 66249 53237 58780 69056 71769 83323 95508
9737I5508r048j0983p424k334l911p70m043k707k100R131K1875l927j1654k903
$$ 95508 86460 75477 68053 65719 61808 61038 56995 54288 52188 61319 83194 79267 67613 64710
9723F4710R962m4j6171j5180K677J6831O975o183o892p401M937L526j706l185
$$ 64710 74672 74628 58457 43277 45954 62785 69760 63577 56685 49284 54221 57747 56041 52856
9709E2856N292R245L615m13m916j4564L31P299R844j372j038L713R829J518j3241
$$ 52856 58148 67393 71008 70595 65679 51115 51446 58745 68589 67217 66179 69892 79721 81239 67998
9694F7998j0559Q001O18m291j0065R06K578M463o7q57o113j5039Q64P704o136
$$ 67998 57439 65440 66058 61767 51702 52608 55186 59649 59582 58725 52612 37573 38437 46141 40005
9679D0005q654j566J8766J2042l866n708n477J032R051Q069M119l62k349Q507
$$ 40005 31351 29785 48551 60593 56727 51019 45542 46574 55625 63694 67813 67451 65102 73609
9665G3609K212j1776p188J60O993j0251K06J3775J3869p377r111l24L156l249
$$ 73609 75821 64045 56857 57017 64010 53759 53965 67740 81609 74232 65121 64797 67953 64704
9651F4704l381l71M840P989j4724j2061J411J1534q061j9032N911J0096J2326
$$ 64704 61323 60952 65792 73781 59057 46996 48407 59941 51880 32848 38759 48855 61181
9638F1181J1628j1834N921j951Q075j853o501q310K215n871q187K211q532L283
$$ 61181 72809 60975 66896 64945 73020 71167 64666 56356 58571 52700 44513 46724 38192 41475
9624D1475J6567r307R08Q238j3291K391J7978Q796p030J026J1037j5243j2075
$$ 41475 58042 48735 49643 57881 44590 46981 64959 73755 66725 67751 78788 63545 51470
9611E1470p739J6279N5j0517K198J9791K529p835J574j940P73p928q869l34r505
$$ 51470 43731 60010 60065 49548 51746 71537 74066 66231 67805 65865 66638 58710 49841 49507 40002
9596D0002m506R671J1434L354O940m01M123o336p224j800K956j46J1244J075j2294
$$ 40002 35496 45167 56601 59955 66895 66494 70617 64281 57057 55257 58213 58067 69311 70386 58092
9581E8092l389P052l016j2876j2299j3788J3321J4090K661O346p533j2207J2694
$$ 58092 54703 61755 58739 45863 33564 19776 33097 47187 49848 56194 48661 36454 49148
9568D9148O333R409p427o556o879p352k444R221k338j392J505m847O478K838J00
$$ 49148 55481 64890 57463 50907 44028 36676 34232 43453 41115 39723 41228 36381 42859 45697 45797
9553D5797m217K014L077p497L507P012P817J3853P254j2085l826k166M833j0128
$$ 45797 41580 43594 46671 39174 42681 49693 57510 71363 78617 66532 62706 60540 65373 55245
9539E5245r904L607P291K641q223j691J132L528o912j455J072R404O084m977m683
$$ 55245 45341 48948 56239 58880 50657 48966 50098 53626 46714 45259 46331 55735 61819 56842 52159
9524E2159N376k957Q108q87n550r436r871k548o33n416K206R500K288m033k485
$$ 52159 57535 54578 62686 61799 56249 46813 36942 34394 33761 28345 30551 40051 42339 38306 35821
9509C5821q478J943J002L709p755M91R464M077j1003n874P211L036O052P519P282
$$ 35821 27343 29286 30288 33997 26242 26733 36197 40274 29271 23397 30608 33644 39696 47215 54497
9494E4497j709L475j0876j0262Q777j0165K000J636P67P836m568j668j1309N367
$$ 54497 52788 56263 45387 35125 43902 33737 35737 37373 38140 45976 41408 39740 28431 33798
9480C3798L094K832Q202o14l291k608P336n499o368M033j296j990j521j2359k298
$$ 33798 36892 39724 47926 47312 44021 41413 48749 43250 36882 40915 39619 37629 36108 23749 21451
9465B1451M929J625K685R327j4917j1428J7942J4417j247p995N20J0194m187J706
$$ 21451 26380 28005 30690 40017 25100 13672 31614 46031 44784 36789 37309 47503 43316 45022
9451D5022n439m840k5k120Q453j308j2857l58O241m49Q748k029J625n425k832
$$ 45022 39583 34743 34718 32598 41051 39743 26886 26528 32769 32320 41068 39039 40664 35239 32407
9436C2407j12J815l459K402j148p070j267J507O80M919K369l324J154m426o150
$$ 32407 32295 34110 30651 33053 31905 24835 23568 25075 25755 30674 33043 29719 30873 26447 20297
9421B0297M661J766k601N33n158Q492r27k24J3814q213K244l835P28J0228j3203
$$ 20297 24958 26724 24123 24656 19498 27990 27063 26839 40653 32440 34684 30849 31577 41805 28602
9406B8602k992J243J1559J8359k308j5489l952L548K868l091o687N126J778j4633
$$ 28602 25610 26853 38412 56771 54463 38974 35022 38570 41438 38347 31660 36786 38564 23931
9392B3931j1679j08L0Q03K02J363J1700L664M268J478J2558L17p398J888j081
$$ 23931 12252 12144 12174 12977 13179 14542 26242 29906 34174 35652 48210 48527 41129 43017 41936
9377D1936j4677n86J6989l950q545j5257o673J1981J1407j457n154p7J684k914
$$ 41936 27259 26673 43662 39712 31167 15910 9237 21218 32625 31168 26014 25937 27621 24707
9363B4707o202K617k912q39J2006N679j3548n191J0771k023m678m857m94O268
$$ 24707 18505 21122 18210 17371 29377 35056 21508 16317 27088 25065 20387 15530 15036 21304
9349B1304K0080o0j1578j4426p556l909J2826Q024R892j824K09m891j0497J3826
$$ 21304 41384 41324 29746 15320 7764 3855 16681 24705 34597 32773 32982 28091 17594 31420
9335C1420l789k042M688k646Q249R315L58N479r761j8404l005m3j8984m920K491
$$ 31420 27631 25589 30277 27631 35880 45195 45553 51032 41271 22867 19862 19819 835 -4085 -1594
9320a594K0017J0498p613M20p02M186K035J0115Q813j0600r899K138Kj0774p63
$$ -1594 18423 28921 21308 21728 21026 25212 27247 37362 46175 35575 25676 27814 27816 17042 16279
9305A6279J16l732k259O052J0070m987j0504j0662K161M224n7J968J3464N980
$$ 16279 16395 12663 10404 16456 26526 21539 11035 373 2534 6758 6701 8669 22133 28113
9291B8113M197r137q047o94n220m111J552O939L468J623p378m025R97j727J3554
$$ 28113 32310 23173 15126 14432 9212 5101 6653 13592 17060 18683 11305 7280 8277 6550 20104
9276B0104N240m210q945n968k029m411M325R176K134k221O323j128K952l187p676
$$ 20104 25344 21134 12189 6221 4192 -219 4106 13282 15416 13195 19518 18390 21342 18155 10479
9261A0479m650L623O201J5583q952j1619N377o594J3535O120k784K258q06k083
$$ 10479 5829 9452 15653 31236 22284 10665 16042 9448 22983 29103 26319 28577 27771 25688
9247B5688N310J338m784m685j4094K044J7361L563l144j2286N089p933J114N364
$$ 25688 30998 32336 27552 22867 8773 10817 28178 31741 28597 16311 21400 13467 14581 19945
9233A9945K722n139p616k610M762J3307n764p437L126l821J345J1932P441o994
$$ 19945 22667 17528 9912 7302 12064 25371 19607 12170 15296 11475 12820 24752 32193 25199
9219B5199m920j0878n55J3359L348P09k883q195n49k304j1010m808l30O323J699
$$ 25199 20279 9401 8846 22205 25553 26262 23379 15184 14635 12331 1321 -3487 -3817 2506 4205
9204D205K717O856M235R987j034j0009j1589k793J3147J026j071j291O85O565
$$ 4205 6922 13778 18013 28000 26966 16957 5368 2575 15722 16748 15677 14386 15071 21636
9190B1636N586r010j0494P150M555q587p098J2017K12j0159p171K138J2823Q326
$$ 21636 27222 18212 7718 14868 19423 10836 3738 15755 15967 5808 -1363 775 13598 21924
9176B1924O830P957K137L041l141j78n845r808L539O491O092J313j5809l688O924
$$ 21924 28754 36711 38848 41889 38748 38570 32725 22917 26456 32947 39039 40352 24543 20855 27779
9161B7779m259O255K607j500j0951K351K468Q371L234R40J604k969m948k872n955
$$ 27779 23520 29775 32382 30882 19931 22282 24750 33121 36355 37295 38899 35930 30982 28110 22155
9146B2155n950P727N045o432p282m65p726j1052J991J3110J4876q32m631k660
$$ 22155 16205 23932 28977 22545 15263 14798 7072 -3980 -1989 11121 25997 25165 20534 17874
9132A7874N398K667m41J846M617j1897k697p070L382R74R403m017L23j181O169
$$ 17874 23272 25939 25498 27344 31961 20064 17367 10297 13679 14653 24056 20039 20362 19181 25350
9117B5350L420K778l434Q62J1179O34p025R547J5673k244j3976o693L191r329
$$ 25350 28770 31548 28114 28976 40155 40789 33764 43311 58984 56740 42764 36071 39262 29933
9103B9933r813L03J082l716j941m063J1579M884n816l902k77N718n562l987o853
$$ 29933 20120 20423 21505 17789 15848 11785 23364 28248 22432 18530 18253 23971 18409 14422 7569
9088G569L681l698p739K287Q233j014o605M941L738n569j2367o171O009J0579
$$ 7569 11250 7552 -187 2100 10333 9319 2714 7655 11393 5824 -6543 -12714 -6705 3874
9074C874J2616j3179j534M23K071J734J3603P826O280l466o728P442o846j1625
$$ 3874 16490 3311 1777 2200 4271 6005 19608 27434 33714 30248 23520 30962 24116 12491
9060A2491p187k91N611J282o15m792j67K135O633N009L118M586r813N08j643l265
$$ 12491 5304 5013 10624 11906 11291 6499 6332 8467 15100 20109 23227 27813 18000 18508 16865 13600
9044A3600N710j590j0503p56R297N305R410L950j533Q292N05n797j4258r811m723
$$ 13600 19310 17720 7217 6461 15758 21063 30473 34423 32890 41182 41687 35890 21632 11821 7098
9029G098k046Q3N649K660m010j938Q220J634m928J2107N687o878j4268j1882Q101
$$ 7098 5052 5135 10784 13444 9434 7496 15716 17350 12422 24529 30216 23338 9070 -2812 5289
9014E289P323j497r034R499l819M368L701l56O933K653l124o326P162O716o878
$$ 5289 12612 11115 2081 11580 7761 12129 15830 15474 22407 25060 21936 15610 22772 29488 22610
8999B2610k688n232N313J5486k711Q8p875m034j0745m134o385m319M224m869o142
$$ 22610 19922 14690 20003 35489 32778 32866 24991 20957 10212 6078 -307 -4626 -402 -5271 -11413
8984a1413M948o2P1J5990L383q74L107P088J668k902Q67J510K81K855K989j1616
$$ -11413 -6465 -6527 -6456 9534 12917 12043 15150 22238 23906 21004 21871 23381 23662 26517 29506 17890
8968A7890l26K561m641j0952j5142K690k194k644O376J883k966O053J1027P522
$$ 17890 17564 20125 15484 4532 -10610 -7920 -10114 -12758 -6382 -4499 -7465 -1412 9615 17137
8954A7137P589J564l941p949R792J3057j013n176J860J470R77p805n563j78J219
$$ 17137 24726 26290 22349 14400 24192 37249 36236 31060 32920 34390 35367 27562 21999 21821 23040
8939B3040l070R877O522k0122J101M601r725j9206k724R246N974l301k860K1046
$$ 23040 19970 29847 36369 16247 17348 21949 12224 -6982 -9706 -460 5514 2213 -647 20399
8925B0399J1608k2510m705R938n902q11p838l548M197N959Q116l421J0537N390
$$ 20399 32007 9497 4792 14730 8828 8017 179 -3369 828 6787 14903 11482 22019 27409
8911B7409k980j9231p219l784Q999N838j126L818n671J268n82L508K139l625n065
$$ 27409 24429 5198 -2021 -5805 3194 9032 7906 11724 6053 7321 6739 10247 12386 8761 3696
8896C696l171O867J906J314K762j915Q872L493o37K016q437k475M737l798j0021
$$ 3696 525 7392 9298 10612 13374 11459 20331 23824 23187 25203 16766 14291 19028 15230 5209
8881E209K258K583q510N90j417L383k58O713L076J826k591r900J0489J3153K423
$$ 5209 7467 10050 1540 2130 713 4096 3838 10551 13627 15453 12862 2962 13451 26604 29027
8866B9027l189j0618j1983L506R992l76P50J1456J5012P49o600j2483n27r430
$$ 29027 25838 15220 3237 6743 16735 16359 17109 28565 43577 44326 37726 25243 24716 15286
8852A5286l386q459l840M640L25M620l355P632J0588M850O232j106n594j903r208
$$ 15286 11900 3441 -399 4241 4566 9186 5831 13463 24051 28901 35133 34027 28433 26530 17322
8837A7322J232L934l92j1022J913N735l282N007K582o228o800J625m869P414l628
$$ 17322 18554 22488 22096 11074 12987 18722 15440 20447 23029 16801 10001 11626 6757 14171 10543
8822A0543M138J1862k237j405o57j542k035k419o09o632j031l345P597J1963o106
$$ 10543 14681 26543 24306 22901 22244 20702 18667 16248 15639 9007 7976 4631 12228 24191 18085
8807A8085K836p092k502O880p47k420J282J463J615O087l521r764R293J331j7427
$$ 18085 20921 13829 11327 18207 17460 15040 16322 17785 19400 25487 21966 12202 21495 22826 5399
8792E399p013q401Q82M332N146J3791P251j333j560p0J495l173l53K65m30K055
$$ 5399 -1614 -10015 -9133 -4801 345 14136 21387 20054 18494 18424 19919 16746 16393 16658 16228 18283
8776A8283p866n313P228J810P307L933r013r711m09J726K176P584K24j516o532
$$ 18283 10417 5104 12332 14142 21449 25382 16369 6658 6249 7975 10151 17735 17959 16443 9911
8761I911j0229r63Q122L083P31P766J569J85j12l027K830j347p151M770j068k053
$$ 9911 -318 -1281 6841 9924 10655 18421 19990 20175 20063 17036 19866 18519 11368 16138 15070 13017
8745A3017j2184m877K0522N241j4825j0718J401J6538M418j2450O988P625l31
$$ 13017 833 -4044 16478 21719 6894 -3824 -2423 14115 18533 6083 13071 20696 20365
8732B0365q091p14K02q342j1342M886J968O944J3780n85l017k878Q48N602j6330
$$ 20365 12274 11560 11762 3420 -7922 -3036 -1068 5876 19656 19071 16054 13176 14024 19626 3296
8717C296o254k707j97O728J1330P816O392n281o012Q750L893J993O553j769M455
$$ 3296 -2958 -5665 -5862 866 12196 20012 26404 21123 15111 23861 27754 29747 36300 34531 38986
8702C8986Q58n930r148j343n289q546p951l117m964J4599O458N938j597r047p094
$$ 38986 39844 33914 24766 23423 18134 9588 1637 -1480 -6444 8155 14613 20551 18954 9907 2813
8687B813p0L029N496K375j1641k572J8636M883j136l220L237P855Q562L075k184
$$ 2813 2743 5772 11268 13643 2002 -570 18066 22949 21813 18593 21830 29685 38247 41322 39138
8672C9138M146p860n755j0132p728m487k033P403K627o103K585Q201J0931r041
$$ 39138 43284 35424 29669 19537 11809 7322 5289 12692 15319 9216 11801 20002 30933 21892
8658B1892r728R18J690M755M612J2268r379o219j261q004Q749K733n759m709j3798
$$ 21892 12164 13082 14772 19527 24139 36407 27028 20809 19548 11544 20293 23026 17267 12558 -1240
8643a240K728O759O930l128m630M608P428R551m557m401j6890j1850R562P369
$$ -1240 1488 8247 15177 12049 7419 12027 19455 29006 24449 20048 3158 -8692 870 8239
8629H239R674j0682q058L267J9083J653l164p376l93J1443K516L132J482q581
$$ 8239 17913 7231 -827 2440 21523 23176 20012 12636 12243 23686 26202 29334 30816 22235
8615B2235j2L158L615j691K453N690N142L960o685j1127l831L75N094O534m089
$$ 22235 22223 25381 28996 27305 29758 35448 40590 44550 37865 26738 22907 23282 28376 34910 30821
8600C0821Q987L180k130J0406R380p246o958K29J0020L833q61m238O086Q308l600
$$ 30821 39808 42988 40858 51264 60644 53398 46440 46669 56689 60522 59661 55423 61509 69817 66217
8585F6217L00M590m015K615Q13L141O199K1839J5644P655N862L87M913L1696J5623
$$ 66217 66517 71107 67092 69707 70520 73661 79860 101699 117343 124998 130860 131247 136160 167856 183479
8570A83479j1000j8819l219k8910j9686O598n462j5558j4012q685j662p64j0463
$$ 183479 172479 153660 150441 121531 101845 108443 102981 87423 73411 64726 63064 62300 51837
8557E1837k4447l386P025K617l627M184O206k241o458K196m403j1418L714L503
$$ 51837 27390 24004 31029 33646 30019 34203 40409 38168 31710 33906 29503 18085 21799 25302
8543B5302J161K032L218k257r39o974k0982R453J510k179J065l238r930p428R600
$$ 25302 26463 28495 31713 29456 28517 21543 561 10014 11524 9345 10410 7172 -2758 -10186 -586
8528e86Q408k753j0569N747L526l475L186O038l596M86N194j126p780J0691P321
$$ -586 7822 5069 -5500 247 3773 298 3484 9522 5926 6412 11606 10480 2700 13391 20712
8513B0712n99J409p760n850l413R464l542k877M164j3183n438L849J4154j679
$$ 20712 20113 21522 13762 7912 4499 13963 10421 7544 11708 -1475 -6913 -3064 11090 9411
8499I411L719R318K490p012k1656p408R336Q82k825P813m483r525P419J1961M750
$$ 9411 13130 22448 24938 17926 -3730 -11138 -1802 -920 -3745 4068 -415 -9940 -2521 9440 14190
8484A4190m358K409L187m880j0724j582j484Q151j066q660p70J761k872M58l714
$$ 14190 9832 12241 15428 10548 -176 -1758 -3242 4909 3843 -4817 -5587 -3826 -6698 -6240 -9954
8469i954M586j355j985l261Q7K882K596j281o3R568J7522K177q267q634q014m756
$$ -9954 -5368 -6723 -8708 -11969 -11882 -9000 -6404 -7685 -7748 1820 19342 21519 13252 4618 -3396 -8152
8453h152K193M911Q856J0600P21q164m380k280p518L444O833O64j1051j904N233
$$ -8152 -5959 -1048 7808 18408 19129 10965 6585 4305 -3213 231 7064 7728 -3323 -5227 6
8438Fj520l015R534J912r617K840l699j0406Q27J1619J0227r031m391O646o696
$$ 6 -1514 -4529 5005 6917 -2700 140 -3559 -13965 -13138 -1519 8708 -323 -4714 1932 -4764
8423d764J4395J1762l128P78m115l87K74q671j0083M463L600J1377N128p773p793
$$ -4764 9631 21393 18265 19043 14928 14541 14815 6144 -3939 524 4124 15501 20629 12856 5063
8408E063m712O09J2538K511m422q025K657N709R584O52r02j6439q845M083J150
$$ 5063 351 960 13498 16009 11587 3562 6219 11928 21512 22164 21262 4823 -4022 61 1211
8393A211o28K761O312J447r17k897K296K139N273j2975j8013L867J0884J2909
$$ 1211 583 3344 9656 11103 10186 7289 9585 11724 16997 4022 -13991 -10124 760 13669
8379A3669L221n280q201n557o73J0572N742R64L53k644m342J1771J2008q578j0669
$$ 13669 16890 11610 3409 -2148 -2821 7751 13493 14457 14810 12166 7824 19595 31603 23025 12356
8364A2356M68M839M75Q71m752j733l777j473o782L323J2114N585M550q453J125
$$ 12356 12824 17663 18138 19009 14257 12524 8747 7274 492 3815 15929 21514 26064 17611 18736
8349A8736r304m96J6169M081l455m603q883j0332j2943J4569J1714k610o306l832
$$ 18736 9432 8936 25105 29186 25731 21128 12245 1913 -11030 3539 15253 12643 6337 2505
8335B505j726p522j673l780O559J6751l696q217K897N582L478o225k677o116n48
$$ 2505 779 -6743 -8416 -12196 -5637 11114 7418 -799 2098 7680 11158 4933 2256 -3860 -4408
8320d408J1096J613j3973j1421r972J0411O731P653J3425j4995p742K997K629
$$ -4408 6688 8301 -5672 -17093 -27065 -16654 -9923 -2270 11155 -3840 -11582 -8585 -5956
8307e956J3674Q247L884j5969m397J1281n020l290k586J306N079O587n846j8226
$$ -5956 7718 15965 19849 3880 -517 10764 5744 2454 -132 1174 6253 12840 6994 -11232
8293a1232K558R301L894N2o925J0584L054m441m757n166l408o271l70J5411Q98
$$ -11232 -8674 627 4521 4573 -2352 8232 11286 6845 2088 -3078 -6486 -12757 -13127 2284 3182
8278C182K76j495J0558P966n879q552l065l476j582J1590M235m980J0169L55j78
$$ 3182 3458 1963 12521 20487 14608 6056 2991 -485 -2067 9523 13758 8778 18947 19302 19124
8263A9124R838q523j3011K384n358k876L571R602m229o739M139J6809N159j157
$$ 19124 28962 20439 7428 9812 4454 1578 5149 14751 10522 3783 7922 24731 29890 28733
8249B8733j40k138j099m583L78l426j3668L906M644j822P21K307J835N842j3884
$$ 28733 28593 26455 25356 20773 21151 17725 4057 7963 12607 10785 11506 13813 15648 21490 7606
8234G606k0587L778k385n483j52R559N083O405j111l338M967k841q28r146R187
$$ 7606 -12981 -9203 -11588 -17071 -17223 -7664 -2581 3824 2713 -625 4342 1501 673 -8473 714
8219G14K0689R399M585n112j166p926o770N332P125j150j3335k037M697k707j1035
$$ 714 21403 30802 35387 30275 29109 21183 14413 19745 26870 25720 12385 10348 15045 12338 1303
8204A303o134L431j6396M424Q755M668M620p096r28j5651l89J3408L209q203J5448
$$ 1303 -4831 -1400 -17796 -13372 -4617 51 4671 -2425 -3353 -19004 -19393 -5985 -2776 -10979 4469
8189D469K3696M957q986l431j435o192J701J592O192N511L50j9102p207r471p994
$$ 4469 28165 33122 24136 20705 19270 13078 14779 16371 22563 28074 28424 9322 2115 -7356 -15350
8174a5350l080J0235L392J4451N214m183L262l403j1870r445N263J2295m494K170
$$ -15350 -18430 -8195 -4803 9648 14862 10679 13941 10538 -1332 -10777 -5514 6781 2287 4457
8160D457N047j0857L512l90j3371N344J6032O007j86q207J082J556q065j1065
$$ 4457 9504 -1353 2159 1769 -11602 -6258 9774 15781 15595 7388 8470 10026 1961 -9104
8146i104n665l279P889N223O966l420m994L334n072M028R415k31R636K151r873
$$ -9104 -14769 -18048 -10159 -4936 2030 -1390 -6384 -3050 -8122 -4094 5321 5090 14726 16877 7004
8131G004L022N08M055R224k275k548q822n498p734n972K73l799j611P408J5283
$$ 7004 10026 10534 14589 23813 21538 18990 10168 4670 -3064 -9036 -8763 -12562 -14173 -6765 8518
8116H518J1431q63J014n51o533j2595j73o82P797O877m932l083j576J27P172j326
$$ 8518 19949 19086 20100 19549 13016 421 248 -434 7363 14240 9308 6225 4649 4776 11948 10622
8100A0622k563P99J0130j2860j0177J503Q085M37N903J5588m941j8613p578n3
$$ 10622 8059 8858 18988 6128 -4049 -2546 5539 5976 11879 27467 22526 3913 -3665 -3718
8086c718M564n707O718L897j3582N834P094j830n446j001O987L82O118K532N75
$$ -3718 846 -4861 1857 5754 -7828 -1994 5100 3270 -2176 -3177 3810 4192 10310 12842 13417
8071A3417P803N59k658n623L063J63K147r778l811l262r511m759N692Q104K859
$$ 13417 21220 21779 19121 13498 16561 16724 18871 9093 5282 2020 -7491 -12250 -6558 1546 4405
8056D405l690K342j0223K934n793P04M711J3831L071j853J059p813K744Q3M382
$$ 4405 715 3057 -7166 -4232 -10025 -9321 -4610 9221 12292 10439 11498 3685 6429 6512 10894
8041A0894j568K04K30R067P916n960n212m68M947K294r834k695J2423j069k324
$$ 10894 9326 9530 9760 18827 26743 20783 15571 15103 20050 22344 12510 9815 22238 21169 18845
8026A8845P918J3545J312n904K658o154o221m557j1409m523M468m687k289J145
$$ 18845 26763 40308 41620 35716 38374 32220 25999 21442 10033 5510 9978 5291 3002 4147
8012D147K799j914J724J4078K845R672J830l573o399l967N25J3017q418j9241
$$ 4147 6946 5032 6756 20834 23679 33351 35181 31608 25209 21242 21767 34784 26366 7125
7998G125L1J766L239r78r479L784k237K699N524j243O012m770O108P33N307J0621
$$ 7125 7156 8922 12161 11183 1704 5488 3251 5950 11474 10231 16243 11473 17581 18314 23621 34242
7982C4242J5825N342j0721r409m659n912m606J421L866O67M043R341P118J1626
$$ 34242 50067 55409 44688 35279 30620 24708 20102 21523 25389 26056 30099 39440 46558 58184
7968E8184J902m362o445k0700j2068j2533l302J0907j386p729k550l770J4688
$$ 58184 60086 55724 49279 28579 16511 3978 676 11583 10197 2468 -82 -3852 10836
7955A0836J0709n058j547l949J694P034P709j2607o349L737O746J4567J35k348
$$ 10836 21545 16487 14940 10991 12685 19719 27428 14821 8472 12209 18955 33522 33657 31309
7941C1309N471J3751J0589l444N384L16o706j5212M870q034o450p327Q411O095
$$ 31309 36780 50531 61120 57676 63060 63376 56670 41458 46328 38294 31844 24517 32928 39023
7927C9023m863q957J985R504p73j6931j5772l405N090M532p11M884k960j4000
$$ 39023 34160 25203 27188 36692 35919 18988 3216 -189 4901 9433 8722 13606 10646 -3354
7913c354q717L153P206m764k746J1905N371p17N017K741m169k237r626k505Q497
$$ -3354 -12071 -8918 -1712 -6476 -9222 2683 8054 7337 12354 15095 10926 8689 -937 -3442 5055
7898E055N804P213K407l102l675j254L16P493J1274N362j108j4058p876J2569
$$ 5055 10859 18072 20479 17377 13702 12448 12764 20257 31531 36893 35785 21727 13851 26420
7884B6420r804o496k582N695j550R6J55j3234l288Q361Q830l294q971n465j4074
$$ 26420 16616 10120 7538 13233 11683 11779 11934 -1300 -4588 3773 12603 9309 338 -5127 -19201
7869a9201L724J3902j770K542M27m556J4966q265j1145o674O739J0015P648R458
$$ -19201 -15477 -1575 -3345 -803 -376 -4932 10034 1769 -9376 -16050 -9311 704 8352 17810
7855A7810p887r789m796k963k577K154l362R056J2604k909r061K180j964Q783
$$ 17810 9923 134 -4662 -7625 -10202 -8048 -11410 -2354 10250 7341 -1720 460 -1504 7279
7841G279j1794o958o38P765N974o921l462P996j734M162n00j588j5119p282R450
$$ 7279 -4515 -11473 -12111 -4346 1628 -5293 -8755 -759 -2493 1669 1169 -419 -15538 -22820 -13370
7826a3370K656M732J0061R51o89K016l357o370n085O370J989m39k897p997K359
$$ -13370 -10714 -5982 4079 5030 4341 6357 3000 -3370 -8455 -2085 -96 -535 -3432 -11429 -9070
7811i070J8269P364K531o247j5171n657N55P548O933k943n734L272J924N95J4117
$$ -9070 9199 16563 19094 12847 -2324 -7981 -7426 122 7055 4112 -1622 1650 3574 4169 18286
7796A8286L354p80m107o824q784J707K987p44N50l610n397M279L60M79j0894k180
$$ 18286 21640 20860 16753 9929 1145 2852 5839 5095 5645 2035 -3362 917 1277 1756 -9138 -11318
7780a1318P807J5208R312n014m561j6941k328R671o798l739P353M809j562q773
$$ -11318 -3511 11697 21009 15995 11434 -5507 -7835 1836 -4962 -8701 -1348 3461 1899 -6874
7766f874R860m325K779L486J1654K527o76j2731o969L21J3808l595o109o354k861
$$ -6874 2986 -1339 1440 4926 16580 19107 18431 5700 -1269 -948 12860 9265 3156 -3198 -6059
7751f059J428Q429Q335j3078l022j605r168J830M656M355l262l468k746r101o977
$$ -6059 -4631 3798 12133 -945 -3967 -5572 -14740 -12910 -8254 -3899 -7161 -10629 -13375 -22476 -29453
7736b9453P945O522P773j010j045L703M308K465o19j7327O883R461m379K255M680
$$ -29453 -21508 -14986 -7213 -8223 -9268 -5565 -1257 1208 589 -16738 -9855 -394 -4773 -2518 2162
7721B162M095N598q143j1966n123J292r67k66J0099M972m648P284r526j3436R925
$$ 2162 6257 11855 3712 -8254 -13377 -12085 -13052 -13318 -3219 1753 -2895 4389 -5137 -18573 -8648
7706h648Q792O364L427j0510j0805m428J0067j920j675N993k3l51m039K685O700
$$ -8648 144 6508 9935 -575 -11380 -15808 -5741 -7661 -9336 -3343 -3366 -3717 -7756 -5071 1629
7691A629j462m719N308M125k503j287m377n110l628J0630J5299L680J644j7626
$$ 1629 167 -4552 756 4881 2378 1091 -3286 -8396 -12024 -1394 13905 17585 19229 1603
7677A603J929R721M369j627n079j1740l527J847n02j1457J654J9354O285L15m502
$$ 1603 3532 13253 17622 15995 10916 -824 -4351 -2504 -3006 -14463 -12809 6545 12830 13145 8643
7662H643J562J1361n490m804l442J2580Q168P083j8439J4985K2190p2k1501q100
$$ 8643 10205 21566 16076 11272 7830 20410 28578 35661 17222 32207 54397 54325 32824 24724
7648B4724j4110k876j221q318J010m140k291j412M335J7460j255k619n204m823
$$ 24724 10614 7738 6517 -1801 -791 -4931 -7222 -8634 -4299 13161 11906 9287 4083 -740
7634g40n15P267j4099j848N446p857K208j495j751O301P392k469n344j658l110
$$ -740 -1255 6012 -8087 -9935 -4489 -12346 -10138 -11633 -13384 -7083 309 -2160 -7504 -9162 -12272
7619a2272m462k97J1491Q56j3770L097l360j0380P798P54L329M485J8789O940
$$ -12272 -16734 -17031 -5540 -4684 -18454 -15357 -18717 -29097 -21299 -20545 -17216 -12731 6058 12998
7605A2998r699r15k254k359k280k741l854j6926L833J3351J0036J0518J0510J137
$$ 12998 3299 2384 130 -2229 -4509 -7250 -11104 -28030 -24197 -10846 -810 9708 20218 21355
7591B1355j0673j268j2456j0313O8K979j897j820n72o490n347J0985N443Q978
$$ 21355 10682 9414 -3042 -13355 -13287 -10308 -12205 -14025 -14597 -21087 -26434 -15449 -10006 -1028
7577a028L135n327Q68j203M122K110m417J2815R78o627r488n245n616p733K142
$$ -1028 2107 -3220 -2352 -3555 567 2677 -1740 11075 12053 5426 -4062 -9307 -14923 -22656 -20514
7562b0514M996M441L390k456j565Q406P16k879n914j0076l946n790M504Q873P848
$$ -20514 -15518 -11077 -7687 -10143 -11708 -3302 -2586 -5465 -11379 -21455 -25401 -31191 -26687 -17814 -9966
7547i966Q799M696N076r04P668k355l934j0717j6106J3106J2878M798p685p847
$$ -9966 -1167 3529 8605 7701 15369 13014 9080 -1637 -17743 -4637 8241 13039 5354 -2493
7533b493q034o916J1676N529N230j70Q989O97n745j181O370j0838j991K082R925
$$ -2493 -10527 -17443 -5767 -238 4992 4822 13811 14508 8763 7582 13952 3114 1123 3205 13130
7518A3130R492p654q977m131m204m695O939R796q325j336n756q20N047K196q579
$$ 13130 22622 14968 5991 1860 -2344 -7039 -100 9696 1371 35 -5721 -6541 -1494 702 -7877
7503g877o848J187j601P660L883L795n023M648J1658q808r597q184R490O595N243
$$ -7877 -14725 -13538 -15139 -7479 -3596 199 -4824 -176 11482 2674 -6923 -15107 -5617 978 6221
7488F221L656k449J857L280j2048L862L04L048N200k517O018k462P332j0762l744
$$ 6221 9877 7428 9285 12565 517 4379 4683 7731 12931 10414 16432 13970 21302 10540 6796
7473F796j77J217l058n518j101q804N866Q761L485N33j7741r486l060N445J9266
$$ 6796 6619 7836 4778 -740 -1841 -10645 -4779 3982 7467 8000 -9741 -19227 -22287 -16842 2424
7458B424J1531O486q806j3550l539N317J1651n566o163J793P397r955k0390K366
$$ 2424 13955 20441 11635 -1915 -5454 -137 11514 5948 -215 1578 8975 -980 -21370 -19004
7444a9004R831k949n722M575n701M257O110N856p050J414Q75O682k619j2733P925
$$ -19004 -9173 -12122 -17844 -13269 -18970 -14713 -8603 -2747 -9797 -8383 -7508 -826 -3445 -16178 -8253
7429h253K632k716m580j493J0590L999M584n24M348n547j4942n020O077J7397
$$ -8253 -5621 -8337 -12917 -14410 -3820 179 4763 4239 8587 3040 -11902 -16922 -10845 6552
7415F552O190j0531j0170l203n157k15o12O246J812l445N656J1231k109q653k10
$$ 6552 12742 2211 -7959 -11162 -16319 -16534 -17146 -10900 -9088 -12533 -6877 4354 2245 -6408 -6618
7400f618o089n970N334l296o97R691O078O226m709j1808m28J816j515Q497K472
$$ -6618 -12707 -18677 -13343 -16639 -17336 -7645 -1567 4659 -50 -11858 -12286 -10470 -11985 -3488 -1016
7385a016j596p65l263m070j52M312K295J278L009q84L695o695j0698k322l325
$$ -1016 -2612 -3377 -6640 -10710 -10862 -6550 -4255 -2977 32 -852 2843 -3852 -14550 -16872 -20197
7370b0197J5774R594l407J098M170k202N247m72k679m841j727N111o229p651J586
$$ -20197 -4423 5171 1764 2862 7032 4830 10077 9605 6926 2085 358 5469 -760 -8411 -6825
7355f825J1758P100K034j342r659q847J7302K1006j1136q414n428l255K458j1424
$$ -6825 4933 12033 14067 12725 3066 -5781 11521 32527 21391 12977 7549 4294 6752 -4672
7341d672K07N432M68m189q81o67K368j251q094J0155O228j3035m660n318m040
$$ -4672 -4465 967 1435 -2754 -3635 -4302 -1934 -3185 -11279 -1124 5104 -7931 -12591 -17909 -21949
7326b1949j51P70O786R888R470L32p874n568O74K031l744L50N953j163J837o010
$$ -21949 -22100 -21330 -14544 -4656 4814 5146 -2728 -8296 -7622 -5591 -9335 -8985 -3032 -4195 -2358 -8368
7310h368q04k375j238j685P48P615M149j0402r570L490J1298R422k892k931o924
$$ -8368 -9172 -11547 -12785 -14470 -13722 -6107 -1958 -12360 -21930 -18440 -7142 2280 -612 -3543 -10467
7295a0467j520k478j0129l507M483Q99J1940O413M524k051l215O227Q291n41K676
$$ -10467 -11987 -14465 -24594 -28101 -23618 -22719 -10779 -4366 158 -1893 -5108 1119 9410 8869 11545
7280A1545n306r855k72J954j982K383P714j467l61M859l042m366l425m77l542
$$ 11545 6239 -3616 -3888 -1934 -3916 -1533 6181 4714 4353 9212 6170 1804 -1621 -2098 -5640
7265e640p166K81p6M853o270m919J0105J0727j905K095o033j5320l590n046J0394
$$ -5640 -12806 -12525 -12601 -7748 -14018 -18937 -8832 1895 -10 2085 -3948 -19268 -22858 -27904 -17510
7250a7510M613n275O3M184N683p50K94K845j348K207n494o699L302J8266L015
$$ -17510 -12897 -18172 -18109 -13925 -8242 -8992 -8698 -5853 -7201 -4994 -10488 -17187 -13885 4381 7396
7235G396j5846l980K02Q306K320k112K719K560P798P195P810k819n591O781r474
$$ 7396 -8450 -12430 -12228 -3922 -1602 -3714 -995 1565 9363 16558 24368 21549 15958 22739 13265
7220A3265M519j1874q725k456n023N11K835N663M211N573N441k203j6586m170
$$ 13265 17784 5910 -2815 -5271 -10294 -9783 -6948 -1285 2926 8499 13940 11737 -4849 -9019
7206i019L32L192Q815q106o785O008l092l648J1718P679j310j0484p892l085R177
$$ -9019 -8687 -5495 3320 -4786 -11571 -5563 -8655 -12303 -585 7094 5784 -4700 -12592 -15677 -6500
7191f500Q215R746l552r372j0126J6652J4125J455m900r561J260m960o262L955
$$ -6500 1715 11461 7909 -1463 -11589 5063 19188 20643 15743 6182 7442 2482 -3780 175
7177A75k895m914Q08j014J080n764r515r27J4076j5J488j989q809n809L670P548
$$ 175 -2720 -7634 -6826 -7840 -6760 -12524 -22039 -22966 -8890 -8905 -7417 -9406 -18215 -24024 -20354 -12806
7161a2806m689O102J7145m813j1343o715M032l642n443k040J812L528J5043J0956
$$ -12806 -17495 -11393 5752 939 -10404 -17119 -13087 -16729 -22172 -24212 -22400 -18872 -3829 7127
7147G127N731l529p344j05P150Q988n665m390M804N432q5j2490j029M712P51k3831
$$ 7127 12858 9329 1985 1880 9030 18018 12353 7963 12767 18199 18114 5624 4595 9307 10058 -13773
7131a3773j89J1391J0286L542M139r797q447n529l748j48N939n023J4539J1979
$$ -13773 -13962 -2571 7715 11257 15396 5599 -2848 -8377 -12125 -12273 -6334 -11357 3182 15161
7117A5161j1291j0765K323J4846j728j6144M382M670r423p234l927P379o825N647
$$ 15161 3870 -6895 -4572 10274 8546 -7598 -3216 1454 -7969 -15203 -19130 -11751 -18576 -12929
7103a2929J1239Q76L438o046j883p666N422J1621l33j9754J2360M661l42R634
$$ -12929 -1690 -814 2624 -3422 -5305 -12971 -7549 4072 3739 -16015 -3655 1006 664 10298
7089A0298L844j0389p479n823L539L999j4561o746J3203n279j1595M47J5296P821
$$ 10298 14142 3753 -3726 -9549 -6010 -2011 -16572 -23318 -10115 -15394 -26989 -26542 -11246 -3425
7075c425K244o282O678k826o619k830M65m916J2686J2791q549j2994q471J9J0172
$$ -3425 -1181 -7463 -785 -3611 -10230 -13060 -12595 -17511 -4825 7966 -583 -13577 -22048 -22029 -11857
7060a1857k346n954Q497M130p721j1892p351J6818R650R54j425l625k209J2056
$$ -11857 -14203 -20157 -11660 -7530 -15251 -27143 -34494 -17676 -8026 -7072 -8497 -12122 -14331 -2275
7046b275J3045J972j2598j3768J111L576O111N380L854J833n402O277o724J6532
$$ -2275 10770 12742 144 -13624 -12513 -8937 -2826 2554 6408 8241 2839 9116 2392 18924
7032A8924Q214k5462j0419o4P130P026j564l801o68k642M422J503n953M727L173
$$ 18924 27138 1676 -8743 -8807 -1677 5349 3785 -16 -684 -3326 1096 2599 -3354 1373 4546
7017D546J934k299q542n762l816K032Q910M802k003j120j3683M657J4422l140
$$ 4546 6480 4181 -4361 -10123 -13939 -11907 -2997 1805 -198 -1318 -15001 -10344 4078 938
7003I38l833K637J0107j272j8283n415P054m825j4759L149k179P162P338N528
$$ 938 -2895 -258 9849 8577 -9706 -15121 -8067 -12892 -27651 -24502 -26681 -19519 -12181 -6653
6989f653Q711K898r65j1996j2652O172M34J7373N892j4061K397n042k099M215
$$ -6653 2058 4956 3991 -8005 -20657 -14485 -14051 3322 9214 -4847 -2450 -7492 -9591 -5376
6975e376N690k112J0206O449n898j3541P693l480o171K322M366j918j477m674
$$ -5376 314 -1798 8408 14857 8959 -4582 3111 -369 -6540 -4218 148 -1770 -3247 -7921
6961g921q076R222L369P453m386L521O144L308j823q635n794l709j0963M867K1757
$$ -7921 -15997 -6775 -3406 4047 -339 3182 9326 12634 10811 2176 -3618 -7327 -18290 -13423 8334
6946H334l085j0715n244n624J3044l270k23l950r142Q34Q422R565j1867l540K196
$$ 8334 5249 -5466 -10710 -16334 -3290 -6560 -6783 -10733 -19875 -19041 -10619 -1054 -12921 -16461 -14265
6931a4265j5002n77j979K340R726N339L207J0177j1664l867m636l467O733J0674
$$ -14265 -29267 -29844 -31823 -29483 -19757 -14418 -11211 -1034 -12698 -16565 -21201 -24668 -17935 -7261
6917g261J2337L326l074k2511j540M715k837J453J8431j47r117p370m05p220J802
$$ -7261 5076 8402 5328 -17183 -18723 -14008 -16845 -15392 3039 2892 -6225 -13595 -14000 -21220 -19418
6902a9418J2634P800q222l526J2028L196l657r208m322q25Q249K785m225l926
$$ -19418 -6784 1016 -7206 -10732 1296 4492 835 -8373 -12695 -13520 -5271 -2486 -6711 -10637
6888a0637j1348r385J0956J1015m580P449O045o587r506m190L484J658m000N164
$$ -10637 -21985 -31370 -20414 -9399 -13979 -6530 -485 -7072 -16578 -20768 -17284 -15626 -19626 -14462
6874a4462L824O625J4652K402r869M55k993r924q73L74K370L536l629M564J011
$$ -14462 -10638 -4013 10639 13041 3172 3627 634 -9290 -10163 -9789 -7419 -3883 -7512 -2948 -1937
6859a937p554k96P454p240j2855M957M813o492K109J2076k534o115R198Q75p29
$$ -1937 -9491 -9787 -2333 -9573 -22428 -17471 -12658 -19150 -17041 -4965 -7499 -13614 -4416 -3541 -4270
6844d270j0927j780J2002O278j3656n225J2334J0452k268n296j353J3241q076
$$ -4270 -15197 -16977 -4975 1303 -12353 -17578 -5244 5208 2940 -2356 -3709 9532 1456
6831A456n899L528N41r638L411N431N079O911l295j815P255L950Q640p685p335
$$ 1456 -4443 -915 -374 -10012 -6601 -1170 3909 10820 7525 5710 12965 16915 25555 17870 10535
6816A0535O011m763q217N266K768M64o20o690p268m655l870R263m647o20P206
$$ 10535 16546 11783 3566 8832 11600 12064 11444 4754 -2514 -7169 -11039 -1776 -6423 -7043 163
6801A63k952k945q71P894m82o840k101J65j0446O850M637K22J8901J0157n480
$$ 163 -2789 -5734 -6605 1289 807 -6033 -8134 -7969 -18415 -11565 -6928 -6706 12195 22352 16872
6786A6872m459j2251j1240q646L390M15p225J694J3231k110p032j5607m903J2388
$$ 16872 12413 162 -11078 -19724 -16334 -15919 -23144 -21450 -8219 -10329 -17361 -32968 -37871 -25483
6772b5483J1208k853J3912N369k778m281Q303J3297m991m291r194k652J0792L16
$$ -25483 -14275 -17128 -3216 2153 -625 -4906 3397 16694 11703 7412 -1782 -4434 6358 6674
6758F674L736K569j654J532r602m998j438P36Q174J4065q810j382J5006M733j2967
$$ 6674 10410 12979 11325 12857 3255 -1743 -3181 -2445 5729 19794 10984 9602 24608 29341 16374
6743A6374l34l212k083j338n943J036J435K3672L704l435k768J699M660l333j3481
$$ 16374 16040 12828 10745 9407 3464 4500 5935 29607 33311 29876 27108 28807 33467 30134 16653
6728A6653j262n790o017Q495j424K363J1806J6724K0634J7200K2067L1925M6354
$$ 16653 15391 9601 3584 12079 10655 13018 24824 41548 62182 79382 101449 133374 179728
6715A79728Q4768J32061J89882J75527K5975j47658k01735j51841r7327n5339
$$ 179728 264496 396557 586439 761966 787941 640283 438548 286707 189380 134041
6705A34041l1202k6382j4516j6113j3324J192J3355q766j7285p028J1526J0064
$$ 134041 102839 76457 61941 45828 32504 33696 47051 38285 21000 13972 25498 35562
6693C5562l143k0612l639L012J1682K1027K378j7484q333l712L039m629j5085
$$ 35562 32419 11807 8168 11180 22862 43889 46267 28783 20450 16738 19777 15148 63
6680F3j5785o363L843J0032J0960K254n440n03L963J654j444J1462N090k211j755
$$ 63 -15722 -22085 -18242 -8210 2750 5004 -436 -939 3024 4678 3234 14696 19786 17575 15820
6665A5820p338j3291M201R490p47j5324Q058J1843o30j1903L096J2990q554j2110
$$ 15820 8482 -4809 -608 8882 8135 -7189 869 12712 12082 179 3275 16265 7711 -4399
6651d399j3138N501N157n384L162n069n435p92J399k2250n676K339N434J7214
$$ -4399 -17537 -12036 -6879 -12263 -9101 -14170 -19605 -20397 -18998 -41248 -46924 -44585 -39151 -21937
6637b1937M306M808k223p092L270O50m116m098L986M039K2Q947Q092k0028m530
$$ -21937 -17631 -12823 -15046 -22138 -18868 -18218 -22334 -26432 -22446 -18407 -18385 -9438 -1346 -21374 -25904
6622b5904n18n863N521K283J4372L241j1097n651L546N514J0634J1946m98m783
$$ -25904 -26422 -32285 -26764 -24481 -10109 -6868 -17965 -23616 -20070 -14556 -3922 8024 7526 2743
6608B743j5790j997N448J927L677m546L144m766j448K25R136N444m180Q549L290
$$ 2743 -13047 -15044 -9596 -7669 -3992 -8538 -5394 -10160 -11608 -11383 -2247 3197 -983 7566 10856
6593A0856j1171O450r368J447Q384k877q750o070K389l062n003q732Q60J950n547
$$ 10856 -315 6135 -3233 -1786 6598 3721 -5029 -11099 -8710 -11772 -16775 -25507 -24647 -22697 -28244
6578b8244R631M627l673P208Q45P914o368Q665Q432p819j6383R913P947j027j948
$$ -28244 -18613 -13986 -17659 -10451 -9606 -1692 -8060 605 9037 1218 -15165 -5252 2695 1668 -280
6563b80r115n796J1712J1158K066q753O44p596L166p852o057J410J0744o152N530
$$ -280 -9395 -15191 -3479 7679 9745 992 1636 -5960 -2794 -10646 -16703 -15293 -4549 -10701 -5171
6548e171J1216o783O47k162K252j4527J022k819J3153J0905o719n500j936O050
$$ -5171 6045 -738 -91 -2253 -1 -14528 -13506 -16325 -3172 7733 1014 -4486 -6422 -372
6534c72L257l915P9R52R604j1800j819k218N845n023L106j2488R00J7277O614
$$ -372 2885 -1030 -951 1 9605 -2195 -4014 -6232 -387 -5410 -2304 -14792 -13892 3385 9999
6519I999M433q986l471j50j6458j5728q523J0549J6265J799Q905R980J841o001
$$ 9999 14432 5446 1975 1825 -14633 -30361 -38884 -28335 -12070 -10271 -1366 8614 10455 4454
6505D454j6626J189j639O588K002p760j918o22k897J345Q732M449k773m50M314
$$ 4454 -12172 -10983 -12622 -6034 -4032 -11792 -13710 -14332 -17229 -15884 -7152 -2703 -5476 -5926 -1612
6490a612j366J6620K176j2385j0364q288J4537J1505P693j321p356q088j224N021
$$ -1612 -2978 13642 15818 3433 -6931 -15219 -682 10823 18516 17195 9839 1751 527 5548
6476E548M491M198n793K454k537L898r735n554k28j095P122M10m798P435J681
$$ 5548 10039 14237 8444 10898 8361 12259 2524 -3030 -3258 -4353 2769 3179 -1619 5816 7497
6461G497j1611J240J034M629L16j906K914r40P100O337j1175k267j3813J815Q358
$$ 7497 -4114 -2874 -1840 2789 3105 1199 4113 3173 10273 16610 5435 3168 -10645 -8830 -472
6446d72m696Q73J0258P664j3796r287M516r613j041j812P196P969J1082l97r64
$$ -472 -5168 -4295 5963 13627 -169 -9456 -4940 -14553 -15594 -17406 -10210 -2241 8841 8444 7480
6431G480j3929o992P19k873O571O944K270p830k218N669j577M869J572Q642K946
$$ 7480 -6449 -13441 -12722 -15595 -9024 -2080 190 -7640 -9858 -4189 -5766 -897 675 9317 12263
6416A2263p819j0214k039q332k606n052l475J5013K316J744J1138N384j3693l175
$$ 12263 4444 -5770 -7809 -16141 -18747 -23799 -27274 -12261 -9945 -8201 2937 8321 -5372 -8547
6402h547j396n786M079k503N04M685L371J3799O841q571n053k995J2022Q076j3230
$$ -8547 -9943 -15729 -11650 -14153 -13649 -8964 -5593 8206 15047 6476 1423 -1572 10450 18526 5296
6387E296j856R008J667N42o268n488J535o617J96L303j280j1374J141J3316l853
$$ 5296 3440 12448 14115 14657 8389 2901 4436 -2181 -1985 1318 38 -11336 -10195 3121 -732
6372g32J675j492O324o56k941l965l420p659l736P533J0650k430r34j296M59J517
$$ -732 943 -549 5775 5119 2178 -1787 -5207 -12866 -16602 -9069 1581 -849 -1783 -3079 -2620 -1103
6356a103J031P589P276K023k553j0373n795K244m586j5194N841L652q76J02M249
$$ -1103 -72 7517 14793 16816 14263 3890 -1905 339 -4247 -19441 -13600 -9948 -10824 -10722 -6473
6341f473P472M167J3446K264p790r174j5112m48J4300N751J0303q525k018L455
$$ -6473 999 5166 18612 20876 13086 3912 -11200 -11648 2652 8403 18706 10181 8163 11618
6327A1618k34N519p469j7403o17M325q96n561k405L03Q816r867l707J0042O4j038
$$ 11618 11384 16903 9434 -7969 -8586 -4261 -5157 -10718 -13123 -12820 -4004 -13871 -17578 -7536 -7472 -8510
6311h510K496l346r01q75n987o28J6570k149n079J3501R733j213j3299j4205O02
$$ -8510 -6014 -9360 -10261 -11136 -17123 -17751 -1181 -3330 -8409 5092 14825 13612 313 -13892 -13290
6296a3290P435j3629j009J0926R296j0367J000K838L056m806M982M641k749o21
$$ -13290 -5855 -19484 -20493 -9567 -271 -10638 -9638 -6800 -3744 -8550 -3568 1073 -1676 -2297
6282b297L876L714j660n888j148m462r96P32K227N093p965n066J6505L412lk286
$$ -2297 1579 5293 3633 -2255 -3403 -7865 -8861 -8129 -5902 -809 -8774 -13840 2665 6077 6074 3788
6266C788r683n155L345l327l330J202Q266P198J6110K599p026k433p763k984M000
$$ 3788 -5895 -11050 -7705 -11032 -14362 -13160 -4894 2304 18414 21013 13987 11554 3791 807 4807
6251D807m580j1899q93m963L939Q916K968k4816o981Q379N026K596N078J428j3350
$$ 4807 227 -11672 -12565 -17528 -13589 -4673 -1705 -26521 -33502 -25123 -20097 -17501 -12423 -10995 -24345
6236b4345J129L677l98l20O128r80j198j100J694O03p261J07j831L064J2152J067
$$ -24345 -23216 -19539 -19937 -20257 -14129 -15109 -16307 -17407 -15713 -15110 -22371 -22264 -24095 -21031 -8879 -7812
6220g812J4813J486n460O12O378k326j3618o478N689r030K787n011l774R505K321
$$ -7812 7001 8487 3027 3639 10017 7691 -5927 -12405 -6716 -15746 -12959 -17970 -21744 -12239 -9918
6205i918m79l473l345K249p678O988J9102n738r461k309o895k63M922J0386K97
$$ -9918 -10397 -13870 -17215 -14966 -22644 -15656 3446 -2292 -11753 -14062 -20957 -21220 -16298 -5912 -5615
6190e615n803q05j991J838M215l484m8K035o33l761q22m112O675K191K761k250
$$ -5615 -11418 -12223 -14214 -12376 -8161 -11645 -11693 -9658 -10291 -14052 -14874 -18986 -12311 -10120 -7359 -9609
6174i609N014J7501R87j0130l619O67j050N61J658m945O474j3219j267P061Q177
$$ -9609 -4595 12906 13893 3763 144 811 -239 322 1980 -2965 3509 -9710 -10977 -3916 4261
6159D261O474Q647p404j0507n845l608n161j456r0P887k780J047J1545r595o452
$$ 4261 10735 19382 11978 1471 -4374 -7982 -13143 -14599 -14689 -6802 -9582 -8535 3010 -6585 -13037
6144a3037k813K723J5618Q435O908q96j3052r638P040j2338L779O146O943L975
$$ -13037 -15850 -13127 2491 10926 17834 16938 3886 -5752 1288 -11050 -7271 -1125 5818 9793
6130I793M324n127p461o98M548o515O369K694k253R242l621J626Q414j1865o817
$$ 9793 14117 8990 1529 831 5379 -1136 5233 7927 5674 14916 11295 12921 21335 9470 2653
6115B653p620N653k015l495Q86J6351m489r722j484r46J93j291J516K149J0871
$$ 2653 -4967 686 -1329 -4824 -3938 12413 7924 -1798 -3282 -4228 -4035 -5326 -3810 -1661 9210
6100I210m76K183j0317m217N879l814Q92R495j260j6647j2538K130l17m449r543
$$ 9210 8734 10917 600 -3617 2262 -1552 -660 8835 7575 -9072 -21610 -19480 -19797 -24246 -33789
6085c3789j675J0208R556R145J2847n36m378K265P33p025q943J6058Q294n220
$$ -33789 -35464 -25256 -15700 -6555 6292 5756 1378 3643 4376 -2649 -11592 4466 12760 7540
6071G540n565p029M334l23l227j548J771j4263r242M744J0093M099m652o636L520
$$ 7540 1975 -5054 -720 -1043 -4270 -5818 -4047 -18310 -27552 -22808 -12715 -8616 -13268 -19904 -16384
6056a6384J1341J278J7373J0113j4201j3046P433N072l126M639j1341o320Q464
$$ -16384 -5043 -3765 13608 23721 9520 -3526 3907 8979 5853 10492 -849 -7169 1295
6043A295Q070r455J564K279j474J2250l492j3224l057P903J0143r438m139J891
$$ 1295 9365 -90 1474 3753 2279 14529 11037 -2187 -5244 2659 12802 3364 -775 1116
6029A116r563m133R650N457j5183j3062J852J0725J4362l751P07l918r327J0121
$$ 1116 -8447 -12580 -2930 2527 -12656 -25718 -23866 -13141 1221 -2530 -1823 -5741 -15068 -4947
6015d947o916m91Q381L578n30R515o958o891p227r737R71M326k2J0132O226J0056
$$ -4947 -11863 -12354 -3973 -395 -925 8590 1632 -5259 -12486 -22223 -21252 -16926 -16948 -6816 -590 9466
5999I466J031j2017m264J666l945m105l943l539O061l770J921R990O167o841Q16
$$ 9466 10497 -1520 -5784 -4118 -8063 -12168 -16111 -19650 -13589 -17359 -15438 -5448 719 -6122 -5306
5984e306O82k817L87O172m540j0071o570K973J580j3491r096J3216N112Q0l639
$$ -5306 -4624 -7441 -7054 -882 -5422 -15493 -22063 -19090 -17510 -31001 -40097 -26881 -21769 -21689 -25328
5969b5328R901J5648j152M629q440K27P634J77o26j449L09n14j1132M1k006l858
$$ -25328 -15427 221 -931 3698 -4742 -4515 3119 3296 2670 1221 1530 1016 -10116 -10075 -12081 -15939
5953a5939o358J123M932O652l620p636p735l218J3055J1840j507q97m558J1568
$$ -15939 -22297 -21174 -16242 -9590 -13210 -20846 -28581 -31799 -18744 -6904 -8411 -9308 -13866 -2298
5939b298O528j7416q357L890P173l63m942N604r2Q49o334j1097r2m136J0759J6152
$$ -2298 4230 -13186 -21543 -17653 -10480 -10843 -15785 -10181 -10273 -9424 -15758 -26855 -26947 -31083 -20324 -4172
5923d172P701r491J335k310O584m664l000J2487J11j2771m123m330O178K45k324
$$ -4172 3529 -5962 -4627 -6937 -353 -5017 -8017 4470 4581 -8190 -12313 -16643 -10465 -10220 -12544
5908a2544Q008N834l280m342N424M634n215K963L901J453J2624j0209j3507k316
$$ -12544 -4536 1298 -1982 -6324 -900 3734 -1481 1482 5383 6836 19460 9251 -4256 -6572
5894f572M134L464j3966N170j352n462J1234R922J084m419M657l533N37K227q020
$$ -6572 -2438 1026 -12940 -7770 -9122 -14584 -3350 6572 7656 3237 7894 4361 4898 7125 -895
5879h95o066M910J1380J331q407q511o862K42J5416K317m708l388k172Q772n700
$$ -895 -6961 -2051 9329 10660 2253 -6258 -13120 -12878 2538 4855 147 -3241 -5413 3359 -2341
5864b341l401o435j539P583R356p37N188J876p342n482m252L705J500K941k898
$$ -2341 -5742 -12177 -13716 -6133 3223 2486 7674 9550 2208 -3274 -7526 -3821 -2321 620 -2278
5849b278o9P124k914j0725k154Q958P702p491n695m576K705N856M370J4390r594
$$ -2278 -2347 4777 1863 -8862 -11016 -2058 5644 -1847 -7542 -12118 -9413 -3557 813 15203 5609
5834E609j7980l280L891m012Q86n424j5608N50R054K2378J0093j6417j3187P274
$$ 5609 -12371 -15651 -11760 -15772 -14886 -20310 -35918 -35368 -26314 -3936 6157 -10260 -23447 -16173
5820a6173L05k980j1735O029Q636K778k179m665P173J7101J366J563p60n346K0606
$$ -16173 -15868 -18848 -30583 -24554 -15918 -13140 -15319 -19984 -12811 4290 5656 7219 6459 1113 21719
5805B1719o168j5997n074N808j449m085J05k826n874M471N856k541k847N472j351
$$ 21719 15551 -446 -5520 288 -1161 -5246 -5141 -7967 -13841 -9370 -3514 -6055 -8902 -3430 -4781
5790d781j5186o75L386L32J0214J324l595j0439K417J2640l190j2748J2531R570
$$ -4781 -19967 -20642 -17256 -16924 -6710 -5386 -8981 -19420 -17003 -4363 -7553 -20301 -7770 1800
5776A800L590L065K551j100J391j1409j0064O298l124j4738q387j046J4803J6544
$$ 1800 5390 8455 11006 9906 11297 -112 -10176 -3878 -7002 -21740 -30127 -31173 -16370 174
5762A74J682K934L738o132j2529J2904R142j1605l393l137n002L011k867N570
$$ 174 1856 4790 8528 2396 -10133 2771 11913 308 -3085 -6222 -11224 -8213 -11080 -5510
5748e510k647j431l497Q735O190k383J00K04r482K019m466m910N563R336Q324
$$ -5510 -8157 -9588 -13085 -4350 1840 -543 -443 -239 -9721 -7702 -12168 -17078 -11515 -2179 6145
5733F145p183k944P682K665k451k793m313J556N774J0182k147j131j2871p256
$$ 6145 -1038 -3982 3700 6365 3914 1121 -3192 -1636 4138 14320 12173 11042 -1829 -9085
5719i085Q715K477J2556M06r447k676m498L043M166q897M343P455j0968j0853
$$ -9085 -370 2107 14663 15069 5622 2946 -1552 1491 5657 -3240 1103 8558 -2410 -13263
5705a3263j1604L973P180J0651M774L091K990O074m739j4198k450M866q699j1272
$$ -13263 -24867 -20894 -13714 -3063 1711 4802 7792 13866 9127 -5071 -7521 -2655 -11354 -22626
5691b2626N548J6780N281j0423M756J0548J4513K64o009q782p25p439j3695k783
$$ -22626 -17078 -298 4983 -5440 -684 9864 24377 24641 18632 9850 9125 1686 -12009 -14792
5677a4792J82m132m634j897J1328J6174P379n99r585n835r0M65Q84Q226n381n546
$$ -14792 -14610 -18742 -23376 -25273 -13945 2229 9608 9009 -576 -6411 -6501 -6036 -5152 3074 -2307 -7853
5661g853r871m984Q127J1740Q744j867j3378p459M95P360P259J1704J4367M045
$$ -7853 -17724 -22708 -14581 -2841 5903 4036 -9342 -16801 -16306 -8946 -1687 10017 24384 28429
5647B8429j3315j6466k812q545P206K155K885L855K84j487k869n406r759J513
$$ 28429 15114 -1352 -4164 -12709 -5503 -3348 -463 3392 3676 2189 -680 -6086 -15845 -14332
5633a4332N405J2569K390p375p047Q770l092n077o648q61l57J521k786N966J3769
$$ -14332 -8927 3642 6032 -1343 -8390 380 -2712 -7789 -14437 -15298 -15655 -14134 -16920 -10954 2815
5618B815K769p174r167n30K080J0942M241O402p262j7024N483Q748q282l72J0874
$$ 2815 5584 -1590 -10757 -11287 -9207 1735 5976 12378 5116 -11908 -6425 2323 -5959 -6331 4543
5603D543m099O130j919J762l379p326p856j967J7771J0623r851K212p9m976l685
$$ 4543 444 6574 4655 6417 3038 -4288 -12144 -14111 3660 14283 4432 6644 6565 1589 -2096
5588b096j953M825L661l616l935L946R356O482J738p188j0735q466J5120j2311
$$ -2096 -4049 776 4437 821 -3114 832 10188 16670 18408 11220 485 -7981 7139 -5172
5574e172P00J1103J2j0381o91m398j507k756q489L058J1030Q414P096j2839q817
$$ -5172 -4472 6631 6643 -3738 -4429 -8827 -10334 -13090 -21579 -18521 -7491 923 8019 -4820 -13637
5559a3637j562L781R477n003m051m634O4n445L446K669J7165J2658N259j7233
$$ -13637 -15199 -11418 -1941 -6944 -10995 -15629 -15565 -21010 -17564 -14895 2270 14928 20187 2954
5545B954j0554m280L820N036r496j1381k604J1211J1347k652l859k870J3936J0844
$$ 2954 -7600 -11880 -8060 -3024 -12520 -23901 -26505 -15294 -3947 -6599 -10458 -13328 608 11452
5531A1452M474K81j3525o28P864k046j2534M394J4107l955l280m948p09N432p170
$$ 11452 15926 16207 2682 2054 9918 7872 -4662 -268 13839 9884 6604 1656 947 6379 -791
5516g91J118L868j1444K804K2112m452l039M542R064k850r231p432j3038N493
$$ -791 327 4195 -7249 -4445 17667 13215 10176 14718 23782 20932 11701 4269 -8769 -3276
5502c276R106m014L276l80o540l09m548l868l971O089k252K077M404j106J4378
$$ -3276 5830 1816 5092 4712 -1828 -2137 -6685 -10553 -14524 -8435 -10687 -8610 -4206 -5312 9066
5487I066O854n752l698o546L206r405m493l837p396R106P224N813M7O123Q903
$$ 9066 15920 10168 6470 -76 3130 -6275 -10768 -14605 -22001 -12895 -5671 142 189 6312 15215
5472A5215J1065j029j0314m799k741m292M608j3487l201M376P385J2995J81j0699
$$ 15215 26280 25251 14937 10138 7397 3105 7713 -5774 -8975 -4599 2786 15781 15962 5263
5458E263m10p005m068K324J2517J2884m094j2131k639J681J361p781N106k904
$$ 5263 4853 -2152 -6220 -3896 8621 21505 17411 5280 2641 4322 5683 -2098 3008 104
5444A04m985J114j870O748O62l495M300Q670L240p652q136L466q543M350j304
$$ 104 -4881 -3767 -5637 1111 1773 -1722 2578 11248 14488 6836 -1300 2166 -6377 -2027 -3331
5429c331l401n905R20J4476Q840l886P06j670Q18l775q235n489L870R559N466
$$ -3331 -6732 -12637 -11717 2759 11599 7713 8419 6749 7567 3792 -4443 -9932 -6062 3497 8963
5414H963R549N438l743k277p122j438M962M900Q20J098m066j4830j1235M994O798
$$ 8963 18512 23950 20207 17930 10808 9370 14332 19232 20052 21150 17084 2254 -8981 -3987 2811
5399B811n842l999J160L59k405K160l278P600j0522O833R245K639P011r14q477
$$ 2811 -3031 -7030 -5870 -5511 -7916 -5756 -9034 -1434 -11956 -5123 4122 6761 13772 12858 4381
5384D381l769J068j1178n675l823m986P049M137K732r865M546R726K204n71M336
$$ 4381 612 1680 -9498 -15173 -18996 -23982 -16933 -12796 -10064 -19929 -15383 -5657 -3453 -4024 312
5369C12j081r508M192L000K319J149n265j3105R073K0557j989j2567n032k918
$$ 312 -769 -10277 -6085 -3085 -766 383 -4882 -17987 -8914 11643 9654 -2913 -7945 -10863
5355a0863j217l968M55J2418p406j769J462M671J2619j411q661O366J196O425
$$ -10863 -12080 -16048 -15593 -3175 -10581 -12350 -10888 -6217 6402 4991 -3670 2696 3892 10317
5341A0317O805K911l590n267J69j2858L663j113Q587P839j4574l818J4215l56
$$ 10317 17122 20033 16443 11176 11345 -1513 2150 1037 9624 17463 2889 -929 13286 12930
5327A2930j6035j1017j5072J520J8055J4182o409k484j0217M567n12j726n504
$$ 12930 -3105 -14122 -29194 -27674 -9619 4563 -1846 -4330 -14547 -9980 -10492 -12218 -17722
5314a7722n730M115N335J4410L572N451m112N58P205j0273o733j681J765J5580
$$ -17722 -23452 -19337 -14002 408 3980 9431 5319 5877 13082 2809 -3924 -5605 -3840 11740
5300A1740j0087j6706M528m514P092J2661J638k875j132j0814n525J2466Q568
$$ 11740 1653 -15053 -10525 -15039 -7947 4714 6352 3477 2345 -8469 -13994 -1528 7040
5287G040k137n124k641q206N491J3107l491j1591j3919M848K359j17N858l768
$$ 7040 4903 -221 -2862 -11068 -5577 7530 4039 -7552 -21471 -16623 -14264 -14381 -8523 -12291
5273a2291J0802J1837m606n513n015K182J0714k105j9450j2931m24J323P396P480
$$ -12291 -1489 10348 5742 229 -4786 -2604 8110 6005 -13445 -26376 -26800 -25477 -18081 -10601
5259a0601P811L74l50J753Q401L553K267q730l609O119J1413O210k1969j0137
$$ -10601 -2790 -2416 -2766 -1013 7388 10941 13208 4478 869 6988 18401 24611 2642 -7495
5245g495P164N053j312j420R642l81k744m070q244J920q373n083j714j0595j124
$$ -7495 -331 4722 3410 1990 11632 11251 8507 4437 -3807 -1887 -10260 -15343 -17057 -27652 -28776
5230b8776J9055M79P238Q392n905j6638p017P681Q860K953l573j5403j862R621
$$ -28776 -9721 -9242 -2004 6388 483 -16155 -23172 -15491 -6631 -3678 -7251 -22654 -24516 -14895
5216a4895r031k542J0857l455Q6Q890N686r328m266M365K1k862J3313r12k258
$$ -14895 -23926 -26468 -15611 -19066 -18980 -10090 -4404 -13732 -17998 -13633 -13612 -16474 -3161 -4073 -6331
5201f331j0676M934P062O305j049n455M570p789j0075m395P407P039K063r99L905
$$ -6331 -17007 -12073 -5011 1294 245 -5210 -640 -8429 -18504 -22899 -15492 -8453 -6390 -7389 -3484
5186c484R113K194r259J2983o540j7995k671J516K806J0147R88l841l458L012
$$ -3484 5629 7823 -1436 11547 5007 -12988 -15659 -14143 -11337 -1190 -202 -4043 -7501 -4489
5172d489J1830j465p453L981p784m244j646J610n244K450J0454j131o672k858
$$ -4489 7341 5876 -1577 2404 -5380 -9624 -11270 -9660 -14904 -12454 -2000 -3131 -9803 -12661
5158a2661q834N116J4337O255q811q311j8883Q266J3832P735q552j694J512l695
$$ -12661 -21495 -16379 -2042 4213 -4598 -12909 -31792 -23526 -9694 -1959 -10511 -12205 -10693 -14388
5144a4388K904M777J587j267k287k485O250J0576l722r282R620r44K792J938m590
$$ -14388 -11484 -6707 -5120 -6387 -8674 -11159 -4909 5667 1945 -7337 2283 1339 4131 6069 1479
5129A479k256R248j228l948o956K279p109K292p84m231k2K010J062M320m153j2060
$$ 1479 -777 8471 7243 3295 -3661 -1382 -8491 -6199 -6983 -11214 -11236 -9226 -8164 -3844 -7997 -20057
5113b0057K479m052l614J3544K64j2098N477J2765K772j499J219p932R43O356
$$ -20057 -17578 -21630 -25244 -11700 -11436 -23534 -18057 -5292 -2520 -4019 -2800 -10732 -9789 -3433
5099c433O211m470O173K242p253k415P33q683Q905j001O239R828k876m554P85
$$ -3433 2778 -1692 4481 6723 -530 -2945 -2212 -10895 -1990 -2991 3248 13076 10200 5646 6431
5084F431k624P01j576q017j230N101M509M309Q54q878k361j800p83O331J256O096
$$ 6431 3807 4508 2932 -5085 -6315 -1214 3295 7604 8458 -420 -2781 -4581 -5364 967 2223 8319
5068H319q685n784N521o07M413K841q428L400j3411o707P577L159P36m972p885
$$ 8319 -366 -6150 -629 -1236 3177 6018 -2410 990 -12421 -19128 -11551 -8392 -7656 -12628 -20513
5053b0513R77k693m079N122k705J0092J5143L323M965k002j0039O750N022r599
$$ -20513 -19536 -22229 -26308 -21186 -23891 -13799 1344 4667 9632 7630 -2409 4341 9363 -236
5039b36r939r26P005l047r274M160L685l259j1103K733k555R195J2617L022J45
$$ -236 -10175 -11101 -4096 -7143 -16417 -12257 -8572 -11831 -22934 -20201 -22756 -13561 -944 2078 2223
5024B223q157k368J823K108j966o993L733J7820N675n380r095j4320N696Q833
$$ 2223 -5934 -8302 -6479 -4371 -6337 -13330 -9597 8223 13898 8518 -577 -14897 -9201 -368
5010c68P711p712j068M506o349o316N006M2J150p612q247M902O105k959K984O560
$$ -368 7343 -369 -1437 3069 -3280 -9596 -4590 -4548 -3398 -11010 -19257 -14355 -8250 -11209 -8225 -1665
4994a665K150n597q44J0746p51M088m425j1429p944O638K1836k376j9928r737
$$ -1665 485 -5112 -5956 4790 4039 8127 3702 -7727 -15671 -9033 12803 10427 -9501 -19238
4980a9238J521O779N550R391l461J4378J6211k186j3304j3702K50p534L008O477
$$ -19238 -17717 -10938 -5388 4003 542 14920 31131 28945 15641 1939 2189 -5345 -2337 4140
4966D140n111k939n628Q356P680k210K220k698j569j116P750M20r955J724R079
$$ 4140 -971 -3910 -9538 -1182 6498 4288 6508 3810 2241 1125 8875 9295 -660 1064 10143
4951A0143j279j0838m958j565P908L251j1549j2245O9P637P883r72R720m41J632
$$ 10143 8864 -1974 -6932 -8497 -589 2662 -8887 -21132 -21063 -13426 -5543 -6515 3205 2764 4396
4936D396o324r19J596n177q21O628R282P595q973j6836m589N620J5933K538j8776
$$ 4396 -1928 -2847 -1251 -6428 -7249 -621 8661 16256 7283 -9553 -14142 -8522 7411 9949 -8827
4921h827q161M836M492L919P40r87M17l779j549l366K031J0296l506r864N880
$$ -8827 -16988 -12152 -7660 -3741 -3001 -3988 -3571 -7350 -8899 -12265 -10234 62 -3444 -13308 -7428
4906g428J994Q34K64J967j404P637j637k056j308m173p310j0718O741J0167P513
$$ -7428 -5434 -4600 -4336 -2369 -3773 3864 2227 171 -1137 -5310 -12620 -23338 -16597 -6430 1083
4891A083J9897M136j1546j7706O406P744p183k442p929K54J4115n450Q28M144
$$ 1083 20980 25116 13570 -4136 2270 10014 2831 389 -7540 -7286 6829 1379 2207 6351
4877F351J526n1N255M299o990r046r821m717r073M902l111K670K1611J1442J0662
$$ 6351 7877 7826 13081 17380 10390 1344 -8477 -13194 -22267 -17365 -20476 -17806 3805 15247 25909
4862B5909J438r144n805O02m509m917M913K998P290K543n131k494q39j3923j3097
$$ 25909 27347 18203 12398 13000 8491 3574 8487 11485 18775 21318 16187 13693 12854 -1069 -14166
4847a4166k691j385J3858N994o576m844j242L295R209j050o583J2687l116m424
$$ -14166 -16857 -18242 -4384 1610 -4966 -9810 -11052 -7757 1452 402 -6181 6506 3390 -1034
4833a034N691j034j185J467k937n814O76j0780J660M827m255N564L415o606P458
$$ -1034 4657 3623 2438 3905 968 -4846 -4170 -14950 -13290 -8463 -12718 -7154 -3739 -10345 -2887
4818b887J2803m915q308j2733j0688L091J647J0995J0668Q185j0764J5952J002
$$ -2887 9916 5001 -3307 -16040 -26728 -23637 -21990 -10995 -327 7858 -2906 13046 14048
4805A4048o574m326j0335r404j1777j019J0164N978J8865J4099N165j0013k356
$$ 14048 7474 3148 -7187 -16591 -28368 -29387 -19223 -13245 5620 19719 24884 14871 12515
4792A2515l185J657q135j1129m692L467q22o319J510N467p09l147O624Q39m539
$$ 12515 9330 10987 2852 -8277 -12969 -9502 -10324 -16643 -15133 -9666 -10375 -13522 -6898 -6059 -10598
4777a0598j251k441M260O969M126N133l407l508o507K407Q499L663J63k500j1574
$$ -10598 -11849 -14290 -10030 -3061 1065 6198 2791 -717 -7224 -4817 3682 7345 7508 5008 -6566
4762f566j356q866p126n801J0402L269L818L309L314P704J0415p838m711j47j676
$$ -6566 -7922 -16788 -23914 -29715 -19313 -16044 -12226 -8917 -5603 2101 12516 4678 -33 -180 -1856
4747a856q027Q28q344n985L261N587R801Q536m168l524Q922l883q675K392M362
$$ -1856 -9883 -9055 -17399 -23384 -20123 -14536 -4735 3801 -367 -3891 5031 1148 -7527 -5135 -773
4732g73o120o788p742K069j094M00j621j545R34M782J0315R257P898m719j9473
$$ -773 -6893 -13681 -21423 -19354 -20448 -20048 -21669 -23214 -22280 -17498 -7183 2074 9972 5253 -14220
4717a4220o61O971l353M965J0327K304l264L333n249Q01M548j1312j4084N418
$$ -14220 -14881 -7910 -11263 -6298 4029 6333 3069 6402 1153 1954 6502 -4810 -18894 -13476
4703a3476N169m436N06J0549J1470p027r813N823Q979k817K056p298L357O631
$$ -13476 -8307 -12743 -12237 -1688 9782 2755 -7058 -1235 7744 4927 6983 -315 3042 9673
4689I673k596K723O244K080j0242n909r78r291m966j2158O549J7945m507p750
$$ 9673 7077 9800 16044 18124 7882 1973 995 -8296 -13262 -25420 -18871 -926 -5433 -13183
4675a3183O549R928M048K388p788r0m644o162l545k379M008L384R375R203K409
$$ -13183 -6634 3294 7342 9730 1942 1852 -2792 -8954 -12499 -14878 -10870 -7486 1889 11092 13501
4660A3501k570J89p341j2714K341K267M008k982j4281J5569J062l731n222j0122
$$ 13501 10931 11120 3779 -8935 -6594 -4327 -319 -3301 -17582 -2013 -951 -4682 -9904 -20026
4646b0026k151L514j00J834P0j16J956J0618R263J3625m447r251l891J054l061
$$ -20026 -22177 -18663 -18763 -16929 -16859 -16975 -15019 -4401 4862 18487 14040 4789 898 1952 -1109
4631a109j794R611J909n487k527n234r99M947N337K576n905k299J0944j633m565
$$ -1109 -2903 6708 8617 3130 603 -4631 -5630 -683 4654 7230 1325 -974 9970 8337 3772
4616C772L493Q005J482L62n347N624r620r647j887o701j0558R375K0376O335k376
$$ 3772 7265 15270 16752 17114 11767 17391 7771 -1876 -3763 -10464 -21022 -11647 8729 15064 12688
4601A2688q350j1799J532N048k949j9900R080K865R922J5057p931j0392l274N653
$$ 12688 4338 -7461 -5929 -881 -3830 -23730 -14650 -11785 -1863 13194 5263 -5129 -8403 -2750
4587b750P78k123m675j264M917M036q21K058r700j1154m10J1686J0007K327m255
$$ -2750 -1972 -4095 -8770 -10034 -5117 -1081 -1902 156 -9544 -20698 -21108 -9422 585 2912 -1343
4572a343j879l966j5491o770Q957J4913K216n486l962J1177J0242j12M190m502
$$ -1343 -3222 -7188 -22679 -29449 -20492 -5579 -3363 -8849 -12811 -1634 8608 8496 12686 8184
4558H184j1182j4762L381R226j5483j4068n77K2578Q536N420J601m905r917n480
$$ 8184 -2998 -17760 -14379 -5153 -20636 -34704 -35281 -12703 -4167 1253 2854 -2051 -11968 -17448
4544a7448L602j467R320N174J2719l730o395o286K614l996Q750O091o785q294
$$ -17448 -13846 -15313 -5993 -819 11900 8170 1775 -4511 -1897 -5893 2857 8948 2163 -6131
4530f131p770k099R113j000J3912L48J520L292j5842q882k505L273J8506P222
$$ -6131 -13901 -16000 -6887 -7887 6025 6373 7893 11185 -4657 -13539 -16044 -12771 5735 12957
4516A2957q841m393j2289L682J860p731J057o307O45N003M316k171j127N297j651
$$ 12957 4116 -277 -12566 -8884 -7024 -14755 -13698 -20005 -19360 -14357 -10041 -12212 -13339 -8042 -9693
4501i693m317M362J0778k200n730j58J0733L260m947K593j549J78m415m431J3620
$$ -9693 -14010 -9648 1130 -1070 -6800 -6958 3775 7035 2088 4681 3132 3310 -1105 -5536 8084
4486H084J7126p254o665j876l070L926o443j3089J143l369j222M845J1969n840
$$ 8084 25210 17956 11291 9415 6345 10271 3828 -9261 -8118 -11487 -12709 -7864 4105 -1735
4472a735q291N101J7084PK50n479o785j64l044m398L208J490o801J903m320j89
$$ -1735 -10026 -4925 12159 12166 12416 6937 152 -12 -3056 -7454 -4246 -2756 -9557 -7654 -11974 -12163
4456a2163J1449P230k098M702O939m418j1260p614p122m918n626l070J4844Q426
$$ -12163 -714 6516 4418 9120 16059 11641 381 -7233 -14355 -19273 -24899 -27969 -13125 -4699
4442d699N807P069j1315r047L815J053J185O218Q193n900r776k448o10L355k632
$$ -4699 1108 8177 -3138 -12185 -8370 -7317 -6132 86 8279 2379 -7397 -9845 -10455 -7100 -9732
4427i732o963P036J1573R527O093j266j0376j466L25m063J6181m513q454k8j017
$$ -9732 -16695 -9659 1914 11441 17534 16268 5892 4426 4751 688 16869 12356 3902 3874 2857
4412B857p92n712j1798n39J6509J367k019k024m768R071l243O353Q458k187o267
$$ 2857 2065 -3647 -15445 -15984 525 1892 -127 -2151 -6919 2152 -1091 5262 13720 11533 5266
4397E266r177q80P290P55k254m933l718P680O866l655r698J7580L745m626N15
$$ 5266 -3911 -4791 2499 3254 1000 -3933 -7651 29 6895 3240 -6458 11122 14867 10241 10756
4382A0756o920p657O82k591J0002n574j259Q658j721j01K925l073j1181L680r049
$$ 10756 3836 -3821 -3139 -5730 4272 -1302 -2561 6097 4376 4275 7200 4127 -7054 -3374 -12423
4367a2423L246J2913J3581N475o877j6858o088n894q950N039K067m186n076l522
$$ -12423 -9177 3736 17317 22792 15915 -943 -7031 -12925 -21875 -16836 -14769 -18955 -24031 -27553
4353b7553J3539R266P58K207p430N486j817O943K986q672Q348K740l575m250o823
$$ -27553 -14014 -4748 -3990 -1783 -9213 -3727 -5544 1399 4385 -4287 4061 6801 3226 -1024 -7847
4338g847R163P102l971m925q653m097m067N035P413n182k170m79m868J322N454
$$ -7847 1316 8418 4447 -478 -9131 -13228 -17295 -12260 -4847 -10029 -12199 -12678 -17546 -16224 -10770
4323a0770m825Q739R868n22m256j0971J259K342L571n423O207M35m573j2276l83
$$ -10770 -15595 -6856 3012 2490 -1766 -12737 -11478 -9136 -5565 -10988 -4781 -4346 -8919 -21195 -21578
4308b1578K757O927m989o24O200j613n532M054J5309m439k86M995q622r89q572
$$ -21578 -18821 -11894 -16883 -17507 -11307 -12920 -18452 -14398 911 -3528 -3814 1181 -7441 -8430 -17002
4293a7002j494J8059O835n944l178Q974J0658o393p804p570R086J3737J0549L334
$$ -17002 -18496 -437 6398 454 -2724 6250 16908 10515 2711 -4859 4227 17964 28513 31847
4279C1847l629j9968n948Q588L899j0884j1320k607N550R122J3769j297r744n975
$$ 31847 28218 8250 2302 10890 14789 3905 -7415 -10022 -4472 4650 18419 17122 7378 1403
4265A403o230o94P623J0390J656j2361q637K658R446N24j354Q558l933j6752k077
$$ 1403 -4827 -5521 2102 12492 14148 1787 -6850 -4192 5254 5778 4424 12982 9049 -7703 -9780
4250i780J841l533q677O204K191M251J4269J1879J553j3950j2606R615Q215n017
$$ -9780 -7939 -11472 -20149 -13945 -11754 -7503 6766 18645 20198 6248 -6358 3257 11472 6455
4236F455q944n898o661K325J379j582O160m93L185k123J411N648J512l516L961
$$ 6455 -2489 -8387 -15048 -12723 -11344 -12926 -6766 -7259 -4074 -6197 -4786 862 2374 -1142 2819
4221B819N05M375m124j1556J332K552l725m285M033O558p051j043N267O572j0532
$$ 2819 3324 7699 3575 -7981 -6649 -4097 -7822 -12107 -8074 -1516 -8567 -9610 -4343 2229 -8303
4206h303M556J3327Q625R428n403j1084n760p242O411L617k691l580j1905Q97
$$ -8303 -3747 9580 18205 27633 22230 11146 5386 -1856 4555 8172 5481 1901 -10004 -9107
4192i107Q366l718N077n409j2016M183l980j656M420k488Q232R80M076j385j980
$$ -9107 -741 -4459 618 -4791 -16807 -12624 -16604 -18260 -13840 -16328 -8096 -7116 -3040 -4425 -6405
4177f405P532k37p768N001J3900n169j731l460k313K002p7q774n507L836L641
$$ -6405 1127 890 -6878 -1877 12023 6854 5123 1663 -650 1352 1275 -7499 -13006 -9170 -5529
4162e529l341k875O303O950r39J164j863j1260m868J876M140j1188m5K5427n19
$$ -5529 -8870 -11745 -5442 1508 569 1733 -130 -11390 -16258 -14382 -10242 -21430 -21475 3952 3433
4147C433j819K754k052k404n04n219k669l113k979O753J721o32N258r683l217
$$ 3433 1614 4368 2316 -88 -592 -5811 -8480 -11593 -14572 -7819 -6098 -6730 -1472 -11155 -14372
4132a4372K139Q716M028l141j6479m141Q594R720k83j0786R031M212O110N665
$$ -14372 -12233 -3517 511 -2630 -19109 -23250 -14656 -4936 -5219 -16005 -6974 -2762 3348 9013
4118I013n116k459p479j6030K793m618M905J8475K455L34J1895Q471p753L70k114
$$ 9013 3897 1438 -6041 -22071 -19278 -23896 -18991 -516 1939 2273 14168 22639 14886 15256 13142
4103A3142p286j0623O891J3296j694k1300q010L926k517j522J5433J0632j2727
$$ 13142 5856 -4767 2124 15420 13726 -7574 -15584 -11658 -14175 -15697 -264 10368 -2359
4090b359o767K699M330r68l679M428M179M227M132J78M638P551m626j6983j0741
$$ -2359 -9126 -6427 -2097 -3065 -6744 -2316 1863 6090 10222 10400 15038 22589 17963 980 -9761
4075i761k483J840n981K0458J4423l575j2328k645L235M151j772K806J4065n714
$$ -9761 -12244 -10404 -16385 4073 18496 14921 2593 -52 3183 7334 5562 8368 22433 16719
4061A6719r99l311j0006j537J0237l64Lp581j6444L882O996Q016P956L859r588
$$ 16719 15720 12409 2403 866 11103 10739 10742 3161 -13283 -9401 -2405 5611 13567 17426 7838
4046G838j183j7747J860l72J001K078L098J0103l153r846m426J875p749p606K966
$$ 7838 6655 -11092 -9232 -9604 -8603 -6525 -3427 6676 3523 -6323 -10749 -8874 -16623 -24229 -21263
4031b1263J1921J409M715R068j2579j228k901m180K195N763J1810m2m043L30J999
$$ -21263 -9342 -7933 -3218 5850 -6729 -7957 -10858 -15038 -12843 -7080 4730 4688 645 975 2974
4016B974P92n838j539j0581p855J4948P409j40j849j3381Q195J4240M548j132
$$ 2974 3766 -2072 -3611 -14192 -22047 -7099 310 170 -1679 -15060 -6865 7375 11923 10791
4002A0791J1019J4308K337j1428j2858m175j4383m484K883O464M164j872r398
$$ 10791 21810 36118 38455 27027 14169 9994 -4389 -8873 -5990 474 4638 2766 -6632
3989f632J069N650q449r163q060J5767P815r45m95n878L410%M176P498j327k743
$$ -6632 -5563 87 -8362 -17525 -25585 -9818 -2003 -2948 -3443 -9321 -5911 -5911 -1735 5763 4436 1693
3973A693m803J2103O744j669q884k5893P81J6576k011k988r666J6600J144p132
$$ 1693 -3110 8993 15737 14068 5184 -20709 -19928 -3352 -5363 -8351 -18017 -1417 -273 -7405
3959g405R919L396k108m770j562J0366J912o01q277K165p148J734m926j1241k270
$$ -7405 2514 5910 3802 -968 -2530 7836 9748 9147 870 3035 -4113 -2379 -7305 -18546 -20816
3944b0816M15M197N137M324M900P94L113j784l178j091J1993J0900o742n613L69
$$ -20816 -20401 -16204 -11067 -6743 -1843 -1049 2064 280 -2898 -3989 8004 18904 12162 6549 6918
3929F918N378J902p272j5442k741P311N968n007K522o804n796O939J3276l54j2471
$$ 6918 12296 14198 6926 -8516 -11257 -3946 2022 -2985 -463 -7267 -13063 -6124 7152 6798 -5673
3914e673o085J4848k188j7158p396O727K2985L401q541n976j1827J564Q973k881
$$ -5673 -11758 3090 902 -16256 -23652 -16925 6060 9461 920 -5056 -16883 -15319 -6346 -9227
3900i227o3k776p872j112M509N764O69q16L819N635m956k208L094P796l884m436
$$ -9227 -9290 -12066 -19938 -21050 -16541 -10777 -10108 -10924 -7105 -1470 -6426 -8634 -5540 2256 -1628 -6064
$$ [...]
##END NTUPLES=NMR SPECTRUM
##END=
