##TITLE=Analysis number 328393
Compound Code cc 49522
Book Reference 486/150
Project Code adrs
Chemist Name simons
##JCAMPDX= 6.0         $$ Bruker NMR JCAMP-DX V2.0
##DATA TYPE= NMR SPECTRUM
##DATA CLASS= NTUPLES
##ORIGIN= Bruker BioSpin GmbH
##OWNER= nmr
$$ XWIN-NMR		Version 3.5
$$ Fri Jun  1 12:09:26 2007 GMT Daylight Time (UT+1h)  MAYBRIDGE\nmr@NMR_250MHZ
##.OBSERVE FREQUENCY= 250.131544655141
##.OBSERVE NUCLEUS= ^1H
##.ACQUISITION MODE= SIMULTANEOUS (DQD)
##.ACQUISITION SCHEME= undefined
##.AVERAGES= 16
##.DIGITISER RES= 18
##SPECTROMETER/DATA SYSTEM= dpx250
##.PULSE SEQUENCE= zg30
##.SOLVENT NAME= CDCl3
##.SHIFT REFERENCE= (INTERNAL, CDCl3, 0, 16.522)
##AUDIT TRAIL= $$ (NUMBER, WHEN, WHO, WHERE, WHAT)
$$ ##TITLE= Audit trail, XWIN-NMR		Version 3.5
$$ ##JCAMPDX= 5.01
$$ ##ORIGIN= Bruker BioSpin GmbH
$$ ##OWNER= nmr
$$ C:\u/data/dgb/nmr/ADRS/90/pdata/1/auditp.txt
$$ ##AUDIT TRAIL=  $$ (NUMBER, WHEN, WHO, WHERE, WHAT)
(   1,<2007-06-01 12:09:02.50 +100>,<MAYBRIDGE\nmr>,<NMR_250MHZ>,
      <created by zg, POWCHK disabled, PULCHK disabled
       configuration hash MD5:
       76 6E 9A 78 1E 09 19 81 EC 84 63 8F B0 6A 59 2D
       data hash MD5: 64K
       9B 86 28 73 E8 1C AE 9F 7A 4A 7D 6C 53 0B A8 83>)
(   2,<2007-06-01 12:09:15.31 +100>,<MAYBRIDGE\nmr>,<NMR_250MHZ>,
      <Start of raw data processing
       ef LB = 0.3 FT_mod = 6 PKNL = 1 SI = 32K 
       data hash MD5: 32K
       99 0D A9 3E 1D 13 25 75 53 62 5D AC 31 61 98 21>)
(   3,<2007-06-01 12:09:17.19 +100>,<MAYBRIDGE\nmr>,<NMR_250MHZ>,
      <apk 
       data hash MD5: 32K
       BD 04 BA 74 8F B8 F2 E2 F6 50 B9 90 45 98 E7 C5>)
(   4,<2007-06-01 12:09:17.91 +100>,<MAYBRIDGE\nmr>,<NMR_250MHZ>,
      <abs ABSG = 5 
       data hash MD5: 32K
       07 83 46 E4 4C F8 79 62 98 62 72 69 17 B3 30 3B>)
$$ ##END=
$$ 
$$ hash MD5
$$ FD CC 47 B0 3C D2 2F CF B9 F4 8F 2D D9 FA 75 7D
##$RELAX= 
##$RELAX= 
##$RELAX= 
##$RELAX= 
##$RELAX= 
##$RELAX= 
##$RELAX= 
$$ Bruker specific parameters
$$ --------------------------
##$DU= <C:\u>
##$EXPNO= 90
##$NAME= <ADRS>
##$PROCNO= 1
##$TYPE= <nmr>
##$USER= <dgb>
##$AMP= (0..31)
100 100 100 100 100 100 100 100 100 100 100 100 100 100 100 100 100 100 
100 100 100 100 100 100 100 100 100 100 100 100 100 100 
##$AQSEQ= 0
##$AQ_mod= 3
##$AUNM= <au_zg>
##$AUTOPOS= <19 >
##$BF1= 250.13
##$BF2= 250.13
##$BF3= 250.13
##$BF4= 250.13
##$BF5= 500.13
##$BF6= 500.13
##$BF7= 500.13
##$BF8= 500.13
##$BYTORDA= 1
##$CFDGTYP= 0
##$CFRGTYP= 5
##$CHEMSTR= <none>
##$CNST= (0..31)
1 1 145 1 1 1 1 1 1 1 1 1 1 1 1 1 1 1 1 1 1 1 1 1 1 1 1 1 1 1 1 1 
##$CPDPRG= <>
##$CPDPRG1= <>
##$CPDPRG2= <>
##$CPDPRG3= <>
##$CPDPRG4= <mlev>
##$CPDPRG5= <mlev>
##$CPDPRG6= <mlev>
##$CPDPRG7= <mlev>
##$CPDPRG8= <mlev>
##$CPDPRGB= <>
##$CPDPRGT= <>
##$D= (0..31)
0 1 0 0 0 0 0 0 0 0.06 0 0 0 0 0 0 0.0002 0 0 0 0 0 0 0 0 0 0 0 0 0 0 
0 
##$DATE= 1180696141
##$DBL= (0..7)
120 120 120 120 120 120 120 120 
##$DBP= (0..7)
150 150 150 150 150 150 150 150 
##$DBP07= 0
##$DBPNAM0= <>
##$DBPNAM1= <>
$$ [...]
##$SUBNAM7= <"">
##$SUBNAM8= <"">
##$SUBNAM9= <"">
##$SW= 20.6930455092707
##$SWIBOX= (0..15)
0 0 3 0 0 0 0 0 0 0 0 0 0 0 0 0 
##$SW_h= 5175.983436853
##$TD= 65536
##$TD0= 1
##$TE= 683.16
##$TE2= 300
##$TE3= 300
##$TEG= 300
##$TL= (0..7)
0 120 120 120 120 120 120 120 
##$TP= (0..7)
150 150 150 150 150 150 150 150 
##$TP07= 0
##$TPNAME0= <>
##$TPNAME1= <>
##$TPNAME2= <>
##$TPNAME3= <>
##$TPNAME4= <>
##$TPNAME5= <>
##$TPNAME6= <>
##$TPNAME7= <>
##$TPOAL= (0..7)
0.5 0.5 0.5 0.5 0.5 0.5 0.5 0.5 
##$TPOFFS= (0..7)
0 0 0 0 0 0 0 0 
##$TUNHIN= 0
##$TUNHOUT= 0
##$TUNXOUT= 0
##$USERA1= <user>
##$USERA2= <user>
##$USERA3= <user>
##$USERA4= <user>
##$USERA5= <user>
##$V9= 5
##$VALIST= <valist>
##$VCLIST= <CCCCCCCCCCCCCCC>
##$VD= 0
##$VDLIST= <DDDDDDDDDDDDDDD>
##$VPLIST= <PPPPPPPPPPPPPPP>
##$VTLIST= <TTTTTTTTTTTTTTT>
##$WBST= 1024
##$WBSW= 4
##$XGAIN= (0..3)
0 0 0 0 
##$XL= 0
##$YL= 0
##$YMAX_a= 377904
##$YMIN_a= -351785
##$ZGOPTNS= <>
##$ZL1= 120
##$ZL2= 120
##$ZL3= 120
##$ZL4= 120
##$ABSF1= 16.522
##$ABSF2= -4.171173
##$ABSG= 5
##$ABSL= 3
##$ALPHA= 0
##$AQORDER= 0
##$ASSFAC= 0
##$ASSFACI= 0
##$ASSFACX= 0
##$ASSWID= 0
##$AUNMP= <proc_1d>
##$AZFE= 0.1
##$AZFW= 0.1
##$BCFW= 0
##$BC_mod= 0
##$BYTORDP= 0
##$COROFFS= 0
##$CY= 12.5
##$DATMOD= 1
##$DC= 0
##$DFILT= <>
##$DTYPP= 0
##$F1P= 14.0000005364418
##$F2P= -0.99999901652339
##$FCOR= 0.5
##$FTSIZE= 32768
##$FT_mod= 6
##$GAMMA= 0
##$GB= 0
##$INTBC= 1
##$INTSCL= 1
##$ISEN= 128
##$LB= 0.3
##$LEV0= 0
##$LPBIN= 0
##$MAXI= 10000
##$MC2= 0
##$MEAN= 0
##$ME_mod= 0
##$MI= 0
##$NCOEF= 0
##$NC_proc= -3
##$NLEV= 6
##$NOISF1= 0
##$NOISF2= 0
##$NSP= 0
##$NTH_PI= 0
##$NZP= 0
##$OFFSET= 16.522
##$PC= 1
##$PHC0= -56.08043
##$PHC1= 7.430428
##$PH_mod= 1
##$PKNL= yes
##$PPARMOD= 0
##$PSCAL= 4
##$PSIGN= 0
##$REVERSE= no
##$SF= 250.13
##$SI= 32768
##$SIGF1= 0
##$SIGF2= 0
##$SINO= 400
##$SIOLD= 32768
##$SREGLST= <1H.CDCl3>
##$SSB= 0
##$STSI= 32768
##$STSR= 0
##$SW_p= 5175.98343685301
##$SYMM= 0
##$S_DEV= 0
##$TDeff= 65536
##$TDoff= 0
##$TI= <Analysis number 999999
Compound Code 99
Book Reference 9
Project Code 9>
##$TILT= no
##$TM1= 0
##$TM2= 0
##$TOPLEV= 0
##$USERP1= <user>
##$USERP2= <user>
##$USERP3= <user>
##$USERP4= <user>
##$USERP5= <user>
##$WDW= 1
##$XDIM= 32768
##$YMAX_p= 311339782
##$YMIN_p= -261665
$$ End of Bruker specific parameters
$$ ---------------------------------
##NTUPLES= NMR SPECTRUM
##VAR_NAME=  FREQUENCY,     SPECTRUM/REAL,   SPECTRUM/IMAG
##SYMBOL=    X,             R,               I
##VAR_TYPE=  INDEPENDENT,   DEPENDENT,       DEPENDENT
##VAR_FORM=  AFFN,          ASDF,            ASDF
##VAR_DIM=   32768,         32768,           32768
##UNITS=     HZ,            ARBITRARY UNITS, ARBITRARY UNITS
##FACTOR=    0.157963299565203, 1,           1
##FIRST=     4132.6476996994, 0,             0
##LAST=      -1043.33573715361, 0,           0
##MIN=       -1043.33573715361, -261665,     0
##MAX=       4132.6476996994, 311339782,     0
$$ Real data points
##PAGE= N=1
##DATA TABLE= (X++(R..R)), XYDATA
$$ [...]
$$ plain form
18840 131636 157183 175324 161948 143523 145063 192112 180949 178969 179990 184139 195107 187016
18828 187016 185590 172620 201975 229535 241039 220697 226483 226428 254581 290805 349980 402162
18816 402162 450096 486286 545411 624233 695815 754782 780141 793618 799852 775868 736221 707328
18804 707328 653901 585890 540191 525591 523263 525083 517092 502753 509039 533465 517202 471761
18792 471761 440951 462024 502935 519584 545621 570970 603114 621614 661652 722828 756649
18781 756649 772165 797963 815783 845019 880732 953912 1024860 1094641 1141111 1182203 1228318
18770 1228318 1267395 1305454 1391842 1472562 1557650 1640343 1724787 1796611 1840759 1917449 2011081
18759 2011081 2048916 2077428 2143488 2189712 2210129 2249074 2291665 2363532 2428523 2530178 2665744
$$ packed form
18840A31636K5547J8141j3376j8425J540M7049j1163j980J021M149J0968q091
18828A87016j426j2970K9355K7560J1504k0342N786n5K8153L6224N9175N2182
18816D02162M7934L6190N9125P8822P1582N8967K5359J3477O234k3984l9647k8893
18804G07328n3427o8011m5699j4600k328J820p991j4339O286K4426j6263m5441
18792D71761l0810K1073M0911J6649K6037K5349L2144J8500M0038O1176L3821
18781G56649J5516K5798J7820K9236L5713P3180P0948O9781M6470M1092M6115
18770A228318L9077L8059Q6388Q0720Q5088Q2693Q4444P1824M4148P6690R3632
18759B011081L7835K8512O6060M6224K0417L8945M2591P1867O4991J01655J35566
$$ plain form
18748 2665744 2808938 2987647 3141867 3249373 3387131 3533569 3654438 3766592 3879023
18739 3879023 4005957 4142773 4287697 4473095 4683445 4965648 5305532 5787083 6527416
18730 6527416 7580222 9103025 11112613 13587773 16339385 19176952 22435277 24877681
18722 24877681 23780793 21865228 21188853 19712918 15537656 11862863 9643514 8257118
18714 8257118 7309462 6718571 6334784 6027490 5797720 5641984 5574096 5560636 5543789 5555555
18704 5555555 5621125 5766962 5962007 6131712 6340256 6541607 6741946 6898175 7012290 7051128
18694 7051128 7082186 7114871 7173414 7240663 7332640 7462688 7601009 7790539 8030971 8360509
18684 8360509 8809386 9485804 10479309 11933732 14105692 17128034 20968763 25532298 30440576
$$ packed form
18748B665744J43194J78709J54220J07506J37758J46438J20869J12154J12431
18739C879023J26934J36816J44924J85398K10350K82203L39884M81551P40333
18730F527416J052806J522803K009588K475160K751612K837567L258325K442404
18722B4877681j096888j915565o76375j475935m175262l674793k219349j386396
18714H257118r47656n90891l83787l07294k29770j55736o7888j3460j6847J1766
18704E555555O5570J45837J95045J69705K08544K01351K00339J56229J14115L8838
18694G051128L1058L2685N8543O7249R1977J30048J38321J89530K40432L29538
18684H360509M48877O76418R93505J454423K171960L022342L840729M563535M908278
$$ plain form
18675 30440576 35684891 41326148 42925876 39421009 36705992 35408278 30214542 22430861
18667 22430861 16852856 13502556 11355194 9860057 8836618 8045787 7395268 6904004
18659 6904004 6550905 6283588 6067338 5887127 5783927 5782358 5822359 5865512 5954687 6063889
18649 6063889 6132488 6129737 6069301 5921695 5751518 5606187 5433106 5252106 5086295 4978188
18639 4978188 4926881 4894318 4891685 4947175 5031637 5215087 5503651 5959340 6655747 7733367
18629 7733367 9209515 11027611 13148562 15325245 17831599 20043996 19371171 17516218
18621 17516218 16716732 15713715 12279502 8941472 6845822 5545783 4697784 4102038
18613 4102038 3657148 3300854 3038889 2834415 2645098 2506811 2384923 2291602 2227695 2159834
$$ packed form
18675C0440576N244315N641257J599728l504867k715017j297714n193736p783681
18667B2430861n578005l350300k147362j495137j023439p90831o50519m91264
18659F904004l53099k67317k16250j80211j03200j569M0001M3153Q9175J09202
18649F063889O8599k751o0436j47606j70177j45331j73081j81000j65811j08107
18639D978188n1307l2563k633N5490Q4462J83450K88564M55689O96407J077620
18629G733367J476148J818096K120951K176683K506354K212397o72825j854953
18621A7516218p99486j003017l434213l338030k095650j300039q47999n95746
18613D102038m44890l56294k61965k04474j89317j38287j21888r3321o3907o7861
$$ plain form
18603 2159834 2136266 2154937 2143525 2128306 2113990 2095951 2022880 1905017 1756514 1622693 1481353
18592 1481353 1324904 1207246 1143816 1097049 1073052 1056275 1035398 1007131 971489 925370 849824
18581 849824 792514 769495 732453 649548 569974 537254 531371 515587 505977 456051 400234 384421
18569 384421 388845 377890 346107 323195 333692 328663 312507 275613 255573 242794 223675 220867
18557 220867 241087 232244 208085 203795 220787 201981 214958 219189 231568 224113 203843 183101
18545 183101 199222 167992 153796 154786 144642 137815 132597 168400 190206 179854 204663 218346
18533 218346 208160 166543 160385 154715 143716 121270 98022 91856 100575 96775 86244 103367
18521 103367 111371 89257 89771 101201 97673 84269 71166 50159 57837 82801 60385 37009
$$ packed form
18603B159834k3568J8671j1412j5219j4316j8039p3071j17863j48503j33821j41340
18592A481353j56449j17658o3430m6767k3997j6777k0877k8267l5642m6119p5546
18581H49824n7310k3019l7042q2905p9574l2720n883j5784r610m9926n5817j5813
18569C84421M424j0955l1783k2912J0497n029j6156l6894k0040j2779j9119k808
18557B20867K0220q843k4159m290J6992j8806J2977M231J2379p455k0270k0742
18545A83101J6121l1230j4196R90j0144o827n218L5803K1806j0352K4809J3683
18533B18346j0186m1617o158n670j0999k2446k3248o166Q719l800j0531J7123
18521A03367Q004k2114N14J1430l528j3404j3103k1007P678K4964k2416k3376
$$ plain form
18509 37009 23407 37590 55376 79093 48564 51837 82994 92197 73380 50420 43089 40010
18497 40010 57213 70643 61483 64515 83054 77670 41272 3215 8197 17960 6461 3361 11379
18484 11379 17185 11264 4895 9578 28692 33277 27716 25788 19875 1185 13027 36449 29484
18471 29484 25653 43705 50226 33952 22759 6788 -5277 18051 24077 25830 9347 -9097
18459 -9097 -17580 -25868 -7051 20137 21623 -7551 6617 15814 17905 15027 2455 19260 26369
18446 26369 23640 27379 28944 6215 -23569 -17614 4649 -9462 -6332 -13764 -27607 9491 26315
18433 26315 9571 2828 2528 -2505 -13036 -26015 -6895 -9831 -7648 -2229 -18987 -33577 -16266
18420 -16266 -35487 -50524 -46660 -33679 -19153 -19091 -21624 -9956 -23030 -1761 44961 36457 5009
$$ packed form
18509C7009j3602J4183J7786K3717l0529L273L1157R203j8817k2960p331l079
18497D0010J7203J3430r160L032J8539n384l6398l8057M982R763j1499l100Q018
18484A1379N806n921o369M683J9114M585n561j928n913j8690J1842K3422o965
18471B9484l831J8052O521j6274j1193j5971j2065K3328O026J753j6483j8444
18459i097q483q288J8817K7188J486k9174J4168R197K091k878j2572J6805P109
18446B6369k729L739J565k2729k9784N955K2263j4111L130p432j3843L7098J6824
18433B6315j6744o743l00n033j0531j2979J9120k936K183N419j6758j4590J7311
18420a6266j9221j5037L864J2981J4526O2k533J1668j3074K1269M6722q504l1448
$$ plain form
18407 5009 11515 -21777 -32494 -8641 6957 1604 60 8319 -33010 -58232 -52201 -48584 -26957
18394 -26957 -31324 -24223 8797 29691 24127 -12790 -16310 -2042 -27930 -33995 -39763 -35772 -37058
18381 -37058 -40923 -47058 -38911 -35337 -38913 -24211 -47036 -44572 -33744 -31994 -29614 -20057 -3256
18368 -3256 -12816 -31336 -53812 -47160 -24539 -3536 16930 14275 -7227 -11467 -5474 10251 4537
18355 4537 -4378 14222 17510 7300 14566 31741 15909 -8517 -6444 11933 21793 7721 -7811
18342 -7811 6281 4441 -7414 2884 7770 28524 12781 19434 21101 16591 5411 22431 21788
18329 21788 21159 -15509 -21305 1618 21043 17680 -10485 -16337 -18628 -17095 3595 30223 21529
18316 21529 -9759 -6648 -454 -19429 -12695 -1962 2994 -6306 -27873 -34807 -23135 -1462 2897
$$ packed form
18407E009O506l3292j0717K3853J5598n353j544Q259m1329k5222O031L617K1627
18394b6957m367P101L3020K0894n564l6917l520J4268k5888o065n768L991j286
18381c7058l865o135Q147L574l576J4702k2825K464J0828J750K380R557J6801
18368c256r560j8520k2476O652K2621K1003K0466k655k1502m240N993J5725n714
18355D537q915J8600L288j0210P266J7175j5832k4426K073J8377R860j4072j5532
18342g811J4092j840j1855J0298M886K0754j5743O653J667m510j1180J7020o43
18329B1788o29l6668n796K2923J9425l363k8165n852k291J533K0690K6628q694
18316B1529l1288L111O194j8975O734J0733M956r300k1567o934J1672K1673M359
$$ plain form
18303 2897 14531 6863 -14928 -42947 -53331 -42914 -34197 -16063 -2081 -5129 11419 13729 12604
18290 12604 16791 18732 13432 17331 5312 -12922 15084 24834 -7510 -6434 -16125 -8111 2999
18277 2999 10766 16604 5327 -14775 -18151 -21863 -26456 -29817 -12905 8099 23791 17710 7005
18264 7005 18742 12875 5008 7966 5695 13899 -8118 -17633 5435 24397 17379 2320 -22017
18251 -22017 -20659 -19031 17520 35825 58928 58342 46901 49690 67610 56280 61175 88449 91405
18238 91405 86950 42006 42152 44627 23331 7849 8750 44841 52259 45171 49875 41633 45969 56328
18224 56328 75599 97286 99178 89829 81803 99236 96163 90770 70361 56295 32041 41766 28858
18211 28858 31722 50826 92129 94350 89593 95878 118521 143784 184678 194667 194455 208019 197480
$$ packed form
18303B897J1634p668k1791k8019j0384J0417Q717J8134J3982l048J6548K310j125
18290A2604M187J941n300L899j2019j8234K8006R750l2344J076r691Q014J1110
18277B999P767N838j1277k0102l376l712m593l361J6912K1004J5692o081j0705
18264G005J1737n867p867K958k271Q204k2017r515K3068J8962p018j5059k4337
18251b2017J358J628L6551J8305K3103n86j1441K789J7920j1330M895K7274K956
18238I1405m455m4944J46K475k1296j5482R01L6091P418p088M704q242M336J0359
18224E6328J9271K1687J892r349q026J7433l073n393k0409j4066k4254R725j2908
18211B8858K864J9104M1303K221m757O285K2643K5263M0894R989k12J3564j0539
$$ plain form
18198 197480 195685 204112 212847 211340 196582 190041 202569 200061 200451 212893 226569 247777 260867
18185 260867 252125 247327 251869 277900 251303 253877 265307 249594 277300 344197 375653 355478
18173 355478 356856 373367 371740 417131 440565 442484 455707 495678 535633 567123 579218 564464
18161 564464 571911 627941 647674 639470 687634 714310 778166 876346 981304 1046166 1108624 1148948
18149 1148948 1174376 1193186 1187762 1199040 1219864 1249025 1262918 1311861 1368815 1400263 1415366
18138 1415366 1440314 1484463 1542840 1577643 1660092 1756207 1860969 1987419 2095571 2232242
18128 2232242 2374820 2499341 2612367 2718524 2808400 2920944 2977672 3026532 3116044 3235100
18118 3235100 3371904 3625627 3961572 4442010 5170447 6341508 8254287 10983300 14364269
$$ packed form
18198A97480j795Q427Q735j507j4758o541J2528k508L90J2442J3676K1208J3090
18185B60867q742m798M542K6031k6597K574J1430j5713K7706O6897L1456k0175
18173C55478J378J6511j627M5391K3434J919J3223L9971L9955L1490J2095j4754
18161E64464P447N6030J9733q204M8164K6676O3856R8180J04958O4862O2458M0324
18149A148948K5428J8810n424J1278K0824K9161J3893M8943N6954L1448J5103
18138A415366K4948M4149N8377L4803Q2449R6115J04762J26450J08152J36671
18128B232242J42578J24521J13026J06157Q9876J12544N6728M8860Q9512J19056
18118C235100J36804K53723L35945M80438P28437J171061J912779K729013L380969
$$ plain form
18109 14364269 18156599 21489249 24443563 28311825 25445865 16477242 10672321 7681775
18101 7681775 5984468 4908054 4201678 3660201 3238409 2926537 2689711 2477649 2301409
18092 2301409 2169992 2049986 1963579 1927797 1896719 1876893 1880287 1900771 1937643 1934667 1849499
18081 1849499 1707125 1587157 1467327 1345012 1234777 1135905 1044860 970680 900720 844948
18071 844948 800070 751054 659179 597737 535750 511041 494903 489372 465430 434200 386402 351791
18059 351791 330036 288723 255524 265017 267924 265169 272290 247944 215844 178274 158702 161106
18047 161106 139519 149852 137848 124549 123537 127949 150372 127216 101745 89692 72687 52560
18035 52560 52821 74585 71420 42613 41978 66254 73199 79105 63487 73374 72765 85985 75223 69059
$$ packed form
18109A4364269L792330L332650K954314L868262k865960q968623n804921k990546
18101G681775j697307j076414p06376n41477m21792l11872k36826k12062j76240
18092B301409j31417j20006q6407l5782l1078j9826L394K0484L6872k976q5168
18081A849499j42374j19968j19830j22315j10235r8872r1045p4180o9960n5772
18071H44948m4878m9016r1875o1442o1987k4709j6138n531k3942l1230m7798l4611
18059C51791k1755m1313l3199R493K907k755P121k4346l2100l7570j9572K404
18047A61106k1587J0333j2004j3299j012M412K2423k3156k5471j2053j7005k0127
18035E2560K61K1764l165k8807o35K4276O945N906j5618R887o09J3220j0762o164
$$ plain form
18021 69059 46129 15664 19240 16706 1552 1894 -38337 -48082 -40676 -16098 5703 -12051 -34386
18008 -34386 -33764 1379 -27028 -13307 -5459 29453 21019 156 -18255 -43738 -38540 308 25228
17995 25228 51409 39940 22736 23387 18059 1523 -8803 -21724 -36873 -37123 -24461 -9292 6670
17982 6670 11067 11730 -286 7523 18401 31037 10936 -13619 -9708 -8831 3900 5303 -1925 1372
17968 1372 -15923 -17634 -7319 -1044 -11380 -8973 -20431 -32512 -40512 -53346 -38630 -19191 -30349
17955 -30349 -43119 -27623 -9233 5923 -6256 2636 25931 33775 34236 36363 50654 25338 20424
17942 20424 30247 17434 5198 -6734 6347 22542 42677 51233 55652 53893 27036 9494
17930 9494 32104 34351 15654 -11756 7134 36083 28093 40790 67913 70868 44908 33344
$$ packed form
18021F9059k2930l0465L576k534j5154L42m0231r745P406K4578K1801j7754k2335
18008c4386O22L5143k8407J3721P848L4912q434k0863j8411k5483N198L8848K4920
17995B5228K6181j1469j7204O51n328j6536j0326j2921j5149k50J2662J5169J5962
17982F670M397O63j2016P809J0878J2636k0101k4555L911Q77J2731J403p228L297
17968A372j7295j711J0315O275j0336K407j1458j2081q000j2834J4716J9439j1158
17955c0349j2770J5496J8390J5156j2179Q892K3295P844M61K127J4291k5316m914
17942B0424R823j2813j2236j1932J3081J6195K0135Q556M419j759k6857j7542
17930I494K2610K247j8697k7410J8890K8949p990J2697K7123K955k5960j1564
$$ plain form
17918 33344 20864 13408 1802 15333 21153 31148 20537 20732 18771 13315 9248 11 -11543
17905 -11543 -14049 5157 14636 -8193 -10598 4572 1121 -8070 -94 6589 -7161 -14664 -2625
17892 -2625 -14436 -11303 5055 1411 3087 5972 -10368 -7151 2479 16060 -145 -12569 -22093
17879 -22093 -16655 -48768 -68842 -38760 -23278 -18861 -22061 -27973 -35024 -26922 4992 -2938 -20091
17866 -20091 -21814 -20000 -17781 -2477 6594 8657 10114 -3068 -13220 -23412 -24823 -34172 -29198
17853 -29198 -36986 -27463 -24484 -33124 -56375 -35865 6229 -8207 -25779 -42624 -25831 -24501 -42290
17840 -42290 -58811 -27984 23922 33736 27835 2591 -23261 -55364 -52069 -16342 -1656 -25117
17828 -25117 -44522 -29140 -14907 -18844 -52012 -82076 -73928 -37211 -28471 -58413 -41331 -19011
$$ packed form
17918C3344j2480p456j1606J3531N820R995j0611J95j961n456m067r237j1554
17905a1543k506J9206R479k2829k405J5170l451r191P976O683j3750p503J2039
17892b625j1811L133J6358l644J676K885j6340L217R630J3581j6205j2424r524
17879b2093N438l2113k0074L0082J5482M417l200n912p051Q102L1914p930j7153
17866b0091j723J814K219J5304R071K063J457j3182j0152j0192j411r349M974
17853b9198p788R523K979q640k3251K0510M2094j4436j7572j6845J6793J330j7789
17840d2290j6521L0827N1906R814n901k5244k5852l2103L295L5727J4686k3461
17828b5117j9405J5382J4233l937l3168l0064Q148L6717Q740k9942J7082K2320
$$ plain form
17816 -19011 -13979 -38715 -46940 -33370 -14971 -22924 -29526 -45968 -63749 -50570 -45283 -26788 -34512
17803 -34512 -43286 -52555 -45116 -5950 14062 2654 -2248 -12104 -23417 -29485 -11091 -10141 -20287
17790 -20287 -19819 -19810 18353 17845 -7162 -37219 -36168 -48004 -61271 -59448 -77291 -63048 -49382 -29534
17776 -29534 -19449 -22578 -49326 -65892 -46908 -19784 14392 16367 -3044 -49406 -65544 -65474 -49336
17763 -49336 -41986 -43206 -38926 -23952 -15392 -4573 16562 331 5296 10754 -1803 -3052 -5498
17750 -5498 1815 4568 23679 2277 -14602 -16605 -30535 -26996 -18295 -27413 -53407 -61732 -49980
17737 -49980 -56005 -55503 -67633 -56554 -50697 -23879 -29352 -50108 -74504 -48285 -32241 -47960 -39504
17724 -39504 -34442 -40022 -33623 -30366 -24531 -2980 -8933 9723 17363 6392 10976 -21604 -9021
$$ packed form
17816a9011N032k4736q225J3570J8399p953o602j6442j7781J3179N287J8495p724
17803c4512q774r269P439L9166K0012j1408m902r856j1313o068J8394R50j0146
17790b0287M68RL8163n08k5007l0057J051j1836j3267J823j7843J4243J3666J9848
17776b9534J0085l129k6748j6566J8984K7124L4176J975j9411m6362j6138P0J6138
17763d9336P350j220M280J4974Q560J0819K1135j6231M965N458j2557j249k446
17750e498P313K753J9111k1402j6879k003j3930L539Q701r118k5994q325J1752
17737d9980o025N02j2130J1079N857K6818n473k0756k4396K6219J6044j5719Q456
17724c9504N062n580O399L257N835K1551n953J8656P640j0971M584l2580J2583
$$ plain form
17711 -9021 12980 1188 -32390 -38102 -6927 -133 -29698 -40866 1496 30025 17323 1460
17699 1460 -22022 -27144 -3390 -27568 -43948 -35664 -30901 -40498 -23982 -12538 -25207 -10306 -12394
17686 -12394 -51672 -64347 -62211 -53810 -51423 -66473 -72203 -71501 -53824 -20904 -30707 -41437 -20192
17673 -20192 -18939 -15255 -1962 -21094 -9269 -9548 -28901 -57898 -45928 -30215 -30880 -41002 -62730
17660 -62730 -56175 -28313 5631 32300 1444 -16766 -7546 4867 1985 -25679 -44197 -73498
17648 -73498 -78530 -71887 -51629 -40005 -50367 -30033 -15935 -21374 -27261 -26450 -9452 1455 -8488
17635 -8488 -23158 -4920 21019 32006 -1020 -40955 -27314 4358 8609 1463 2361 -16567 -5649
17622 -5649 -2419 -9379 -4113 5879 11963 -13227 -14975 -6966 11032 13726 23866 44032 40252 22484
$$ packed form
17711i021K2001j1792l3578n712L1175O794k9565j1168M2362K8529j2702j5863
17699A460k3482n122K3754k4178j6380Q284M763r597J6516J1444j2669J4901k088
17686a2394l9278j2675K136Q401K387j5050n730P02J7677L2920r803j0730K1245
17673b0192J253L684J3293j9132J1825k79j9353k8997J1970J5713o65j0122k1728
17660f2730O555K7862L3944K6669l0856j8210R220J2413k882k7664j8518k9301
17648g3498n032O643K0258J1624j0362K0334J4098n439n887Q11J6998J0907r943
17635h488j4670J8238K5939J0987l3026l9935J3641L1672M251p146Q98j8928J0918
17622e649L230o960N266R992O084k5190j748Q009J7998K694J0140K0166l780j7768
$$ plain form
17608 22484 -4376 -24473 -47062 -46502 -15497 21662 10912 2859 27663 31464 12950 -6292
17596 -6292 9516 19458 1632 -19451 -27658 -4244 2571 26590 14620 -24172 -16597 -15531 -34070
17583 -34070 -35348 -18186 -762 -3018 -8295 -9045 -633 -12852 -27832 -34943 -24937 -26761 -23128
17570 -23128 -4835 -16535 -35113 -42807 -19055 -17114 -21469 -45816 -72919 -55243 -32638 -16212
17558 -16212 -42534 -50311 -30876 316 -5133 -6756 -16109 -11652 -10180 -30625 -20226 10562 26282
17545 26282 42235 28361 16533 -19672 -20058 -14991 -17478 -16591 -8271 -25875 -39791 -38323 -28115
17532 -28115 -27917 -28405 -36288 -62928 -53454 -32916 -4849 -692 5721 17050 13157 -10554 -16263 2484
17518 2484 41397 54557 15934 -40670 -71110 -76771 -69699 -47296 -20428 -10487 -24699 -36365
$$ packed form
17608B2484k6860k0097k2589N60L1005L7159j0750q053K4804L801j8514j9242
17596f292J5808R942j7826k1083q207K3414O815K4019j1970l8792P575J066j8539
17583c4070j278J7162J7424k256n277p50Q412j2219j4980p111J0006j824L633
17570b3128J8293j1700j8578p694K3752J941m355k4347k7103J7676K2605J6426
17558a6212k6322p777J9435L1192n449j623r353M457J472k0445J0399L0788J5720
17545B6282J5953j3874j1828l6205l86N067k487Q87Q320j7604j3916J468J0208
17532b8115J98m88p883k6640R474K0538K8067M157O413J1329l893k3711n709J8747
17518B484L8913J3160l8623n6604l0440n661P072K2403K6868R941j4212j1666
$$ plain form
17506 -36365 -6410 25305 37222 33903 22122 16736 -10635 -44097 -32665 -51120 -65880 -52966
17494 -52966 -9561 11315 81 -8206 -20302 -30483 -43787 -60968 -43778 -27633 -40179 -63490
17482 -63490 -75585 -54198 -55302 -62088 -70494 -66061 -56214 -64724 -60148 -51314 -42063 -53398 -74217
17469 -74217 -71986 -52529 -27313 -33258 -56839 -46187 -12955 -24300 -18439 5707 -1241 -4135 -46730
17456 -46730 -25811 5841 4382 19441 39156 37598 9723 -21423 -40738 -32894 -5709 33680
17444 33680 90497 94936 94585 113123 123986 127634 95979 88199 68098 36657 21954 6818 -20340
17431 -20340 -13879 -44776 -48564 -46641 -35366 -35658 -13251 1835 -4384 -12964 -14329 10937 30904
17418 30904 44864 23644 19853 52072 64840 22850 20479 4874 -35449 -48816 -45061 -27580
$$ packed form
17506c6365K9955L1715J1917l319j1781n386k7371l3462J1432j8455j4760J2914
17494e2966M3405K0876j1234q287j2096j0181j3304j7181J7190J6145j2546k3311
17482f3490j2095K1387j104o786q406M433R847q510M576Q834R251j1335k0819
17469g4217K231J9457K5216n945k3581J0652L3232j1345N861K4146o948k894m2595
17456d6730K0919L1652j459J5059J9715j558k7875l1146j9315P844K7185L9389
17444C3680N6817M439l51J8538J0863L648l1655p780k0101l1441j4703j5136k7158
17431b0340O461l0897l788J923J1275k92K2407J5086o219q580j365K5266J9967
17418C0904J3960k1220l791L2219J2768m1990k371j5605m0323j3367L755J7481
$$ plain form
17406 -27580 -13352 -3222 -20542 -51034 -52725 -14781 7402 23312 12373 -12284 -21203 -26268
17394 -26268 -8056 -20145 -33926 -21508 -9143 856 23272 35858 46625 36661 12892 -5024
17382 -5024 -18879 -12506 -16120 -4655 801 -12529 -22315 -3007 5678 11426 5627 -14261 -25670
17369 -25670 -24228 -29442 -49204 -22832 -2237 -8957 -17376 -8782 -6070 -14754 3905 10313 -19073
17356 -19073 -44367 -37425 -30713 -12764 -22048 -4509 -1438 -5411 12677 -1421 -15243 -15642 -33411
17343 -33411 -21023 -715 -7312 -7324 -6704 -22663 -42542 -33591 -42588 -30749 -5664 -6936 -17300
17330 -17300 -39015 -44162 -36287 -3263 23038 28111 14031 3329 -20720 -34773 -25988 -27643 -30456
17317 -30456 -28321 -18544 -22595 -41480 -38857 -18563 -20661 -25288 6091 17050 554 -7161 -10578
$$ packed form
17406b7580J4228J0130j7320l0492j691L7944K2183J5910j0939k4657q919n065
17394b6268J8212j2089j3781J2418J2365R999K2416J2586J0767r964k3769j7916
17382e024j3855O373l614J1465N456j3330r786J9308Q685N748n799j9888j1409
17369b5670J442n214j9762K6372K0595o720q419Q594K712q684J8659O408k9386
17356a9073k5294O942O712J7949r284J7539L071l973J8088j4098j3822l99j7769
17343c3411J2388K0308o597j2O20j5959j9879Q951q997J1839K5085j272j0364
17330a7300k1715n147P875L3024K6301N073j4080j0702k4049j4053Q785j655k813
17317c0456K135R777m051j8885K623K0294k098m627L1379J0959j6496p715l417
$$ plain form
17304 -10578 -13028 -31091 -27897 -18423 -10324 -15194 -4880 5466 9440 -7340 -15610 -14455 -2450
17291 -2450 -8588 12853 6165 -7820 -25447 -44313 -25896 -13418 -31297 -48609 -51896 -42736 -15129
17278 -15129 -7878 -26849 -21568 -27663 -52390 -50012 -31952 -36862 -30103 -19512 -24922 6421 -9579
17265 -9579 -21069 -17891 1235 9587 22402 1309 -5511 4036 31248 29302 995 -19278 -16963
17252 -16963 -21606 4032 17482 27215 24780 10821 -1191 -20074 -43889 -45668 -19068 -946
17240 -946 4318 2767 12406 -12899 -24683 -20864 -4951 19422 11878 -5946 2643 6208 -14475
17227 -14475 -40246 -71238 -50980 -54803 -75179 -67185 -66024 -48907 -31708 -43255 -42886 -43487 -26437
17214 -26437 -51429 -61471 -55079 -72376 -75367 -31059 -35421 -41770 -27503 -23275 -27997 -11390 -2771
$$ packed form
17304a0578k450j8063L194R474Q099m870J0314J0346L974j6780q270J155J2005
17291b450o138K1441o688j3985j7627j8866J8417J2478j7879j7312l287R160K7607
17278a5129P251j8971N281o095k4727K378J8060m910O759J0591n410L1343j6000
17265i579j1490L178J9126Q352J2815k1093o820R547K7212j946k8307k0273K315
17252a6963m643K5638J3450R733k435j3959j2012j8883k3815j779K6600J8122
17240i46N264j551R639k5305j1784L819J5913K4373p544j7824Q589L565k0683
17227a4475k5771l0992K0258l823k0376P994J161J7117J7199j1547L69o01J7050
17214b6437k4992j0042O392j7297k991M4308m362o349J4267M228m722J6607Q619
$$ plain form
17201 -2771 -22754 -24022 -9948 -11654 -52858 -72238 -40640 -38573 -43834 -35496 -32450 -92 23145
17188 23145 7274 -6890 -49593 -81713 -51496 -30897 -7503 -8563 -52095 -87719 -74376 -49039
17176 -49039 -26990 -3196 -16029 -26943 -13753 -12534 -20684 -29744 -28202 -13690 -33139 -34212 -10842
17163 -10842 -21136 -40091 -38883 -23998 -10205 -13406 -17962 -28219 -38620 -19117 -22052 -40773
17151 -40773 -41986 -22459 -277 -14096 -23661 -19771 -23372 -11931 -22986 -22811 -50390 -55450 -34006
17138 -34006 -23426 3820 33960 16349 -9486 -39850 -29520 -33419 -43899 -22005 -5840 18163
17126 18163 23279 20617 5920 7205 2244 -22987 -37109 -56522 -17748 21357 22427 14353 1076
17113 1076 -453 -6591 -17721 6473 21609 14746 10017 17560 -6787 -3950 -18567 -3908 2292
$$ packed form
17201b771j9983j268J4074j706m1204j9380L1598K067n261Q338L046L2358K3237
17188B3145j5871j4164m2703l2120L0217K0599K3394j060m3532l5624J3343K5337
17176d9039K2049K3794j2833j0914J3190J219q150r060J542J4512j9449j073K3370
17163a0842j0294j8955J208J4885J3793l201m556j0257j0401J9503k935j8721
17151d0773j213J9527K2182j3819r565L890l601J1441j1055J75k7579n060K1444
17138c4006J0580K7246L0140j7611k5835l0364J0330l899j0480K1894J6165K4003
17126A8163N116k662j4697J285m961k5231j4122j9413L8774L9105J070q074j3277
17113A076j529o138j1130K4194J5136o863m729P543k4347K837j4617J4659O200
$$ plain form
17100 2292 6313 2215 5647 -10472 -40782 -45527 -40321 -23963 -18113 -22163 -28060 -50969 -68871
17087 -68871 -58876 -34552 -29423 -11563 -10510 -35924 -14166 7960 30689 51442 41670 20752
17075 20752 8205 14091 18201 -3567 -21673 -29497 -36933 -26739 -8919 13115 -11309 -30392
17063 -30392 -45888 -40347 -15176 856 -4888 -31572 -25141 -14593 2289 -5885 -22682 -37914
17051 -37914 -57539 -40559 2208 13708 31823 28322 20093 25400 29520 1598 -19262 -38198
17039 -38198 -15611 -21672 -17005 -2912 5370 12168 8833 -7861 -28759 -33793 -20924 -24037 -32946
17026 -32946 -33509 -47191 -50302 -34112 -45921 -43328 -39004 -61526 -61435 -52829 -41268 -33320 -24251 5829
17012 5829 6429 -19986 -14495 -14249 694 -2475 2780 -6995 -12335 -24937 -52330 -35863 -18732 -16179
$$ packed form
17100B292M021m098L432j6119l0310m745N206J6358N850m050n897k2909j7902
17087f8871R995K4324N129J7860J053k5414K1758K2126K2729K0753r772k0918
17075B0752j2547N886M110k1768j8106p824p436J0194J7820K2034k4424j9083
17063c0392j5496N541K5171J6032n744k6684O431J0548J6882q174j6797j5232
17051c7914j9625J6980M2767J1500J8115l501q229N307M120k7922k0860j8936
17039c8198K2587o061M667J4093Q282O798l335j6694k0898n034J2869l113q909
17026c2946n63j3682l111J6190j1809K593M324k2522R1Q606J1561P948R069L0080
17012E829O00k6415N491K46J4943l169N255r775n340j2602k7393J6467J7131K553
$$ plain form
16998 -16179 10458 12692 -12627 -42133 -29292 -19420 -13827 -15989 -57274 -47063 -51354 -66531 -67796
16985 -67796 -40771 -14662 -18814 -22075 -30132 -18934 11169 18237 37858 21022 -9258 -20386
16973 -20386 9118 3377 3600 -5292 -15793 -20966 -35222 1014 2193 -26886 -22316 -25475 -41097
16960 -41097 -40234 -14074 -3395 -6585 -18828 -29704 -13180 -19572 -35092 -28304 -26581 -37680 -19329
16947 -19329 3147 -5937 -4891 4763 -27066 -49673 -26097 1203 8551 -4129 -28626 -13600
16935 -13600 -11905 -19529 -3059 -17148 -14261 -42767 -50791 -38019 -21735 -13934 -9250 -3446 -23810
16922 -23810 -13862 -30819 -37997 -18981 24925 5881 -8575 -5396 15904 -1033 -9732 -7322 -7554
16909 -7554 -3879 -12262 -20627 -47094 -55296 -30205 -37714 -30061 -23162 -11804 11493 22972 8014
$$ packed form
16998a6179K6637K234k5319k9506J2841R872N593k162m1285J0211m291j5177j265
16985f7796K7025K6109m152l261q057J1198L0103P068J9621j6836l0280j1128
16973b0386K9504n741K23q892j0501n173j4256L6236J179k9079M570l159j5622
16960d1097Q63K6160J0679l190j2243j0876J6524o392j5520O788J723j1099J8351
16947a9329K2476r084J046R654l1829k2607K3576K7300P348j2680k4497J5026
16935a3600J695p624J6470j4089K887k8506q024J2772J6284P801M684N804k0364
16922b3810R948j6957p178J9016M3906j9044j4456L179K1300j6937q699K410k32
16909g554L675q383q365k6467q202K5091p509P653O899J1358K3297J1479j4958
$$ plain form
16896 8014 -13046 -3700 -856 -3163 -16958 -37732 -15317 6656 -20264 -36979 -25209 -16042 -22391
16883 -22391 -22548 -44143 -11679 4418 -14921 -5617 -2445 -11020 -13265 -31266 -13357 1898 4109
16870 4109 13005 25922 17690 21792 2295 -160 -8013 -25192 -69302 -71263 -48721 -51191 -43642
16857 -43642 -36940 -42655 -50416 -51392 -63643 -37045 -529 -24525 -34886 -29265 -18423 -5192 -8543
16844 -8543 6782 12840 27652 35757 34479 16712 6851 5413 -5509 -3682 9827 36852 17015
16831 17015 -15676 -30349 -65842 -101185 -97921 -63377 -44810 -35274 -20729 -11897 -20705 -16836 -961
16818 -961 1227 -13361 -23167 -41470 -54054 -43519 -45212 -62334 -36329 -36117 -38558 -22107 -8070
16805 -8070 2909 12433 -8349 -5345 18767 31152 35732 8354 -4978 -38681 -35966 -40599 -35159
$$ packed form
16896H014k1060R346K844k307j3795k0774K2415K1973k6920j6715J1770R167o349
16883b2391j57k1595L2464J6097j9339R304L172q575k245j8001J7909J5255K211
16870D109Q896J2917q232M102j9497k455p853j7179m4110j961K2542k470P549
16857d3642O702n715p761r76j2251K6598L6516k3996j0361N621J0842J3231l351
16844h543J5325O058J4812Q105j278j7767r861j438j0922J827J3509K7025j9837
16831A7015l2691j4673l5493l5343L264L4544J8567R536J4545Q832q808L869J5875
16818i61K188j4588r806j8303j2584J0535j693j7122K6005K12k441J6451J4037
16805h070J0979R524k0782L004K4112J2385M580k7378j3332l3703K715m633N440
$$ plain form
16792 -35159 -11154 -2126 -29338 -27524 -31199 -17376 5981 -18671 -11769 10926 12408 1631 -16803
16779 -16803 -16849 -35870 -45557 -13301 9707 6290 4764 22324 55110 42525 21721 28266 -70
16766 -70 -9961 9562 14479 3606 2572 -6290 -26759 -26926 -15080 -31085 -35095 -8761 23372 19492
16752 19492 8782 -4686 5863 10167 12734 -6190 -14515 -7369 -4732 -319 5684 16325 -4095
16739 -4095 -5607 -6463 -22955 -33015 -14615 -628 -14188 -17243 -41425 -37842 6072 -15486 -26077
16726 -26077 -25846 -40784 -31206 1330 -5658 -25461 -32546 -29290 -25603 -35194 -19296 5587 22602
16713 22602 24837 21854 21046 10980 -6602 4289 8529 -18405 -26953 -10518 -9215 -24101 -19237
16700 -19237 -10816 5119 -233 -27328 -17060 -24876 -27684 -48683 -59482 -36176 -36487 -31251 -17141
$$ packed form
16792c5159K4005R028k7212J814l675J3823K3357k4652O902K2695J482j0777j8434
16779a6803m6j9021r687L2256K3008l417j526J7560L2786j2585k0804O545k8336
16766g0r891J9523M917j0873j034q862k0469j67J1846j6005m010K6334L2133l880
16752A9492j0710j3468J0549M304K567j8924q325P146K637M413O003J0641k0420
16739d095j512q56j6492j0060J8400J3987j3560l055k4182L583M3914k1558j0591
16726b6077K31j4938R578L2536o988j9803p085L256L687r591J5898K4883J7015
16713B2602K235k983q08j0066j7582J0891M240k6934q548J6435J303j4886M864
16700a9237Q421J5935n352k7095J0268p816k808k0999j0799K3306l11N236J4110
$$ plain form
16687 -17141 648 4515 -641 12532 29936 63899 37775 22533 944 -16640 -22045 -20094
16675 -20094 -13432 5577 3413 -23315 -20054 5293 26449 45108 25785 19167 21843 3724 -1629
16662 -1629 409 -5904 -11192 -18015 -14045 -17339 -18921 -25838 -23496 -16615 -13283 -17950 -42501 -40844
16648 -40844 -57781 -52493 -35964 -28114 -21407 -11083 779 6337 4886 5475 9384 -13709 -37135
16635 -37135 -30040 -31353 -53937 -56923 -55568 -51053 -63060 -51839 -33539 -29376 -29645 -29766 16492 36672
16621 36672 26502 -4130 -18950 -5419 -3447 -21546 -14421 -4823 -28640 -25566 5359 18358
16609 18358 18516 7967 30335 56752 70765 50074 807 -37800 -37512 4947 18542 -5760
16597 -5760 18976 40526 47459 35154 16663 25449 7958 4654 21119 16031 9986 5309 -12779
$$ packed form
16687a7141J7789L867n156J3173J7404L3963k6124j5242k1589j7584n405J951
16675b0094O662J9009k164k6728L261K5347K1156J8659j9323o618K676j8119n353
16662a629K038o313n288o823L970l294j582o917K342O881L332m667k4551J657
16648d0844j6937N288J6529P850O707J0324J1862N558j451N89L909k3093k3426
16635c7135P095j313k2584k986J355M515j2007J1221J8300M163k69j21M6258K0180
16621C6672j0170l0632j4820J3531J972j8099P125R598k3817L074L0925J2999
16609A8358J58j0549K2368K6417J4013k0691m9267l8607K88M2459J3595k4302
16597e760K4736K1550O933j2305j8491Q786j7491l304J6465n088o045m677j8088
$$ plain form
16584 -12779 -941 -8328 -19107 -33191 -57885 -50208 -10638 11029 16892 16618 -4627 -36475 -68844
16571 -68844 -54616 -12276 7010 6747 -13086 -23667 -29329 -3845 -8730 -13477 -20153 10983 29197
16558 29197 25621 6926 6710 10946 37787 7577 -18382 -34909 -23054 8121 5648 -6008 -8973
16545 -8973 -12911 -17949 19174 18210 4560 -4077 -19322 -22344 -1991 7690 2367 -4323 14193 14756
16531 14756 -5129 -6958 15637 -1130 -11157 -7526 4918 26655 34213 25019 28814 18753 12566
16518 12566 18418 24156 6329 -27859 -58856 -34800 -8706 4373 -4712 -23459 -18365 -33145
16506 -33145 -24074 -1340 -3060 -7004 966 14242 15865 96 -16438 -22691 -34699 -53457 -30447
16493 -30447 -20015 -20215 -40058 -60279 -57262 -29283 -9808 -5658 -2261 -10035 -29439 -39783 -34934
$$ packed form
16584a2779J1838p387j0779j4084k4694P677L9570K1667N863k74k1245l1848l2369
16571f8844J4228M2340J9286k63j9833j0581n662K5484m885m747o676L1136J8214
16558B9197l576j8695k16M236K6841l0210k5959j6527J1855L1175k473j1656k965
16545h973l938n038L7123r64j3650q637j5245l022K0353R681n323o690J8516N63
16531A4756j9885j829K2595j6767j0027L631J2444K1737P558r194L795j0061o187
16518A2566N852N738j7827l4188l0997K4056K6094J3079r085j8747N094j4780
16506c3145R071K2734j720l944P970J3276J623j5769j6534o253j2008j8758K3010
16493c0447J0432k00j9843k0221L017K7979J9475M150L397p774j9404j0344M849
$$ plain form
16480 -34934 -22406 -17453 -25252 -40597 -56478 -52424 -37021 -17282 -5934 -30765 -58256 -52068
16468 -52068 -13259 1622 -1661 -6311 -17499 -26039 -21629 944 10083 4365 -22283 -42369 -46286
16455 -46286 -41383 -42482 -41042 -34533 -30752 -21474 -20002 -7673 -10012 -13756 -28380 -58041 -34185
16442 -34185 -2994 -26695 -19741 -2530 1518 16197 26054 30363 29594 35331 17385 9913 4089
16429 4089 2414 -11386 -37005 -52778 -40255 -12626 10018 23411 10203 8159 8122 7551 16772
16416 16772 16665 -4103 -32704 -2579 27133 45388 49882 23240 -7654 -33830 -54496 -46952
16404 -46952 -43949 -35093 -22960 -34211 -30949 -2363 -10502 -9015 -23859 -36305 -61337 -53898 -39271
16391 -39271 -20825 -12994 -11586 -7340 -22417 -39445 -55142 -72274 -65498 -49062 1826 23195
$$ packed form
16480c4934J2528M953p799j5345j5881M054J5403J9739J1348k4831k7491O188
16468e2068L8809J4881l283m650j1188q540M410K2573R139n718k6648k0086l917
16455d6286M903j099J440O509L781R278J472J2329k339l744j4624k9661K3856
16442c4185L1191k3701O954J7211M048J4679R857M309p69N737j7946p472n824
16429D089j675j3800k5619j5773J2523K7629K2644J3393j3208k044l7n71R221
16416A6772j07k0768k8601L0125K9712J8255M494k6642l0894k6176k0666P544
16404d6952L003Q856J2133j1251L262K8586q139J487j4844j2446k5032P439J4627
16391c9271J8446P831J408M246j5077j7028j5697j7132O776J6436N0888K1369
$$ plain form
16379 23195 -17814 -26266 -32589 -24609 -24680 -36398 -21156 -290 -1263 -3147 -2121 -14438 -19508 -28462
16365 -28462 -2579 -13911 -15935 465 -16987 -19319 -26626 -46042 -30932 -20626 -25167 -27570 7794
16352 7794 29350 32509 -2362 -2668 23500 36024 41708 21906 -1748 11442 12765 -22750 -30863
16339 -30863 -16250 4551 13423 21755 -1062 -2642 2795 689 -19411 -28537 -7000 -3944 1009
16326 1009 -8797 -15775 -9731 -20760 -17948 -15425 -7744 5765 10355 2431 -20300 -20400 -15154 -27690
16312 -27690 -26317 -20811 -23338 -35061 -29970 -40578 -20176 -32776 -27414 -14665 -1908 -19756 -23126
16299 -23126 -40183 -43045 -32687 -29346 -34972 -27601 5098 -2812 -43673 -59037 -38648 -10404 -26393
16286 -26393 -31739 -23623 -14880 -600 -8263 -10296 -18720 4684 15980 15504 -22094 -45224 -50040
$$ packed form
16379B3195m1009q452o323P980p1j1718J5242K0866r73j884J026j2317n070q954
16365b8462K5883j1332k024J6400j7452k332p307j9416J5110J0306m541k403L5364
16352G794K1556L159l4871l06K6168J2524N684j9802k3654J3190J323l5515q113
16339c0863J4613K0801Q872Q332k2817j580N437k106k0100r126K1537L056M953
16326A009r806o978O044j1029K812K523P681J3509M590p924k2731j00N246j2536
16312b7690J373N506k527j1723N091j0608K0402j2600N362J2749J2757j7848l370
16299b3126j7057k862J0358L341n626P371L2699p910m0861j5364K0389K8244j5989
16286b6393n346Q116Q743J4280p663k033q424K3404J1296m76l7598k3130m816
$$ plain form
16273 -50040 -37194 -19649 -20762 -7355 -220 1579 -4377 -11959 198 10973 14295 -25937 -33567
16260 -33567 -11459 -13299 -6808 10355 13514 -15018 -34547 -34512 -6614 -8680 -9258 -16997 -23480 -20922
16246 -20922 -17789 -5695 16871 13670 -6425 -33272 -40073 -43957 -35003 -5975 14360 15905 18458
16233 18458 13351 -7050 -1543 9384 -9956 8562 3498 -16431 -38924 -25362 -1698 1715
16221 1715 7246 7937 16050 6721 330 13542 13499 -17846 -18829 1388 1808 -5284 -8986 7641 21479
16206 21479 26138 12839 4275 -4167 -4757 -7581 -18149 -38706 -31718 -19988 -19907 -32811 -29908 -48551
16192 -48551 -51757 -34602 -28275 -12872 4963 37495 25392 2740 11329 56816 44069 17030
16180 17030 31439 25141 29035 23933 6710 -2661 -16584 -14094 -15451 -24928 -26790 -26103 3135 3777
$$ packed form
16273e0040J2846J7545j113J3407P135J799n956p582J2157J0775L322m0232p630
16260c3567K2108j840O491J7163L159k8532j9529L5K7898k066n78p739o483K558
16246b0922L133J2094K2566l201k0095k6847o801l884Q954K9028K0335J545K553
16233A8458n107k0401N507J0927j9340J8518n064j9929k2493J3562K3664L413
16221A715N531O91Q113r329o391J3212m3l1345r83K0217M20p092l702J6627J3838
16206B1479M659j3299q564q442n90k824j0568k0557O988J1730Q1j2904K903j8643
16192d8551l206J7155O327J5403J7835L2532j2103k2652Q589M5487j2747k7039
16180A7030J4409o298L894n102j7223r371j3923K490j357r477j862O87K9238O42
$$ plain form
16166 3777 11505 12371 9402 2770 -4846 -5238 -6579 -39426 -44663 -8598 1908 8785 -207 -16841
16152 -16841 -14882 -22153 -35000 -69800 -55160 -28022 15704 36629 20688 -16997 -30157 -10220
16140 -10220 -17999 -28137 -25972 -4495 26565 18770 18059 32775 30878 11483 -16595 -4775 5210
16127 5210 7852 16457 -11464 -29353 -20457 3187 15276 14447 -9726 -25786 -12749 14164 16086
16114 16086 -17846 -6399 3809 -2534 -43136 -46508 -23460 -10649 -15742 -5970 -5358 -7724 -743
16101 -743 7337 -7375 -6451 -2862 783 7294 12674 18308 8209 -2217 -17601 -4732 699 -17767
16087 -17767 -61751 -74965 -62220 -48267 -37439 -17489 -12613 -18751 -33460 -33905 -11528 1011
16075 1011 5094 -16562 -31823 -17653 3104 14873 -1865 -11346 -13304 -20616 -35184 -14419 -3990
$$ packed form
16166C777P728Q66k969o632p616l92j341l2847n237L6065J0506O877q992j6634
16152a6841J959p271j2847l4800J4640K7138M3726K0925j5941l7685j3160J9937
16140a0220p779j0138K165K1477L1060p795p11J4716j897j9395k8078J1820R985
16127E210K642Q605k7921j7889Q896K3644J2089q29k4173j6060J3037K6913J922
16114A6086l3932J1447J0208o343m0602l372K3048J2811n093R772O12k366O981
16101g43Q080j4712R24L589L645O511N380N634j0099j0426j5384J2869N431j8466
16087a7767m3984j3214J2745J3953J0828J9950M876o138j4709m45K2377J2539
16075A011M083k1656j5261J4170K0757J1769j6738r481j958p312j4568K0765J0429
$$ plain form
16062 -3990 4497 -5921 -11872 -12038 -1531 -5292 -6188 10691 10512 -16464 -17627 -7823 14019 36375
16048 36375 31490 -13481 -24516 -18572 -26954 -17849 11349 -7344 -32297 -13388 15217 10667 -28551
16035 -28551 -37728 -2764 19171 -14672 -5448 -1914 14433 9217 -4773 -11685 6331 36177 30064
16022 30064 11268 5490 -11342 956 -4511 -14370 -18719 -8399 -1926 20046 6364 20754 36402
16009 36402 12850 7493 2043 -20398 -12735 6240 -8821 -14808 10954 13310 16659 39296 40110
15996 40110 27152 53257 47834 14891 6346 -4755 5234 17938 -4701 -26666 -1450 -10875
15984 -10875 -31989 -7296 20339 30602 16122 44037 43826 7993 -5925 -32454 -36612 -40887
15972 -40887 -31241 -5901 -5810 -9908 45 14811 24537 30125 26635 30416 43601 30989 37271 33954
$$ packed form
16062c990Q487j0418n951j66J0507l761q96J6879j79k6976j163R804K1842K2356
16048C6375m885m4971j1035N944q382R105K9198j8693k4953J8909K8605m550l9218
16035b8551r177L4964K1935l3843R224L534J6347n216j3990o912J8016K9846o113
16022C0064j8796n778j6832J2298n467r859m349J0320O473K1972j3682J4390J5648
16009C6402k3552n357n450k2441P663J8975j5061n987K5762K356L349K2637Q14
15996D0110j2958K6105n423l2943q545j1101R989J2704k2639k1965K5216r425
15984a0875k1114K4693K7635J0263j4480K7915k11l5833j3918k6529m158m275
15972d0887R646K5340R1m098R953J4766R726N588l490L781J3185j2612O282l317
$$ plain form
15958 33954 13943 -1809 14036 9814 9573 19041 13137 -445 2389 7226 -15764 -28563 -1369
15945 -1369 1915 -6069 12389 -4709 -19551 -9808 -1804 -12328 -10520 3379 14586 30761 25920
15932 25920 12022 -6914 -17803 -22093 -25023 -62259 -58769 -31751 2532 32574 43476 15124
15920 15124 1033 -507 -26255 -40614 -38364 -41648 -53316 -58181 -33297 -11929 -16229 -12019 -7065
15907 -7065 -16169 -11146 14944 22555 22872 -16462 -67467 -52898 -61479 -72217 -60245 -60665 -35079
15894 -35079 -7913 -2440 10842 17153 10732 9665 7274 -4353 -24532 -18219 -24802 -4815 19596
15881 19596 29877 25283 16727 10204 -8976 -32785 -37834 -41648 -46580 -37983 -32945 -30062 -16623
15868 -16623 -9836 -3013 -2784 1112 19872 37825 35926 -14750 -21362 -16755 -7748 -24161 -23887 -12786
$$ packed form
15958C3954k0011j5752J5845m222k41R468n904j3582K834M837k2990j2799K7194
15945a369L284p984J8458j7098j4842R743Q004j0524J808J3899J1207J6175m841
15932B5920j3898j8936j0889m290k930l7236L490K7018L4283L0042J0902k8352
15920A5124j4091j540k5748j4359K250l284j1668m865K4884K1368m300M210M954
15907g065r104N023K6090P611L17l9334n1005J4569q581j0738J1972m20K5586
15894c5079K7166N473J3282O311o421j067k391j1627k0179O313o583J9987K4411
15881A9596J0281m594q556o523j9180k3809n049l814m932Q597N038K883J3439
15868a6623O787O823K29L896J8760J7953j899n0676o612M607R007j6413K74J1101
$$ plain form
15854 -12786 8921 18172 11292 -30920 -47694 -40925 -51503 -63652 -56293 -14881 -176 -15782
15842 -15782 -19522 1966 8918 9888 -444 -15378 -24527 -22373 -5792 22224 35456 27774 11703
15829 11703 -17522 -17035 -26927 -26667 5017 15419 21672 -896 8176 -6722 -10065 6827 -582
15816 -582 6049 -529 10002 8675 4765 13248 9055 708 12081 24976 29763 11187 15265 23662
15802 23662 19987 -2173 -31790 -4441 -3066 -16097 -4577 59 26439 32102 38622 40384 29109
15789 29109 34645 29960 28162 22994 2769 1193 -22816 -23319 -27522 -23833 -19381 -4717 -15111 -657
15775 -657 10517 -3968 -12306 -16177 -17141 -28041 -33515 -40485 -60617 -58535 -29948 -18275 -6156
15762 -6156 -12189 -18382 -18140 -26101 -30073 -16537 -2394 -7614 -8923 -6192 -23591 -25539 -5272 3795
$$ packed form
15854a2786K1707R251o880m2212j6774O769j0578j2149P359M1412J4705j5606
15842a5782l740K1488O952R70j0332j4934r149K154J6581K8016J3232p682j6071
15829A1703k9225M87r892K60L1684J0402O253k2568R072j4898l343J6892p409
15816e82O631o578J0531j327l910Q483m193q347J1373J2895M787j8576M078Q397
15802B3662l675k2160k9617K7349J375j3031J1520M636K6380N663O520J762j1275
15789B9109N536m685j798n168k0225j576k4009n03m203L689M452J4664j0394J4454
15775f57J1174j4485q338l871r64j0900n474o970k0132K082K8587J1673J2119
15762f156o033o193K42p961l972J3536J4143n220j309K731j7399j948K0267R067
$$ plain form
15748 3795 25915 4816 -20906 -32530 -34521 -29046 -3001 -1520 422 -16900 -13873 -10197 -16330
15735 -16330 -12744 -26758 -28434 -2729 3924 6772 26560 17301 12399 -913 -41752 -41105 -29367
15722 -29367 11896 19080 7983 5489 -1595 -12283 -10714 -33220 -31636 -52008 -67640 -37554 -20663
15709 -20663 -43721 -26696 -8219 21033 7656 -28306 -19498 6710 5533 -339 -5384 17974
15697 17974 6542 4460 -9196 -30174 -22426 -29836 -35186 -16468 -8457 -9791 -24438 -51399 -55387
15684 -55387 -41147 -31700 -24158 -2301 25496 31421 5722 -9973 -9140 763 16979 15014 22701
15671 22701 30770 -20386 -56093 -33090 16347 14330 -428 -9753 -27185 -27497 -23550 -39674 -40383
15658 -40383 -46962 -56365 -21003 -11093 -8064 -8432 -23097 -38027 -30987 1055 6286 -9216 -8314 -3312
$$ packed form
15748C795K2120k1099k5722j1624j991N475K6045J481J942j7322L027L676o133
15735a6330L586j4014j676K5705O653K848J9788r259m902j3312m0839O47J1738
15722b9367M1263P184j1097k494p084j0688J569k2506J584k0372j5632L0086J6891
15709b0663k3058J7025J8477K9252j3377l5962Q808K6208j177n872n045K3358
15697A7974j1432k082j3656k0978P748p410n350J8718Q011j334j4647k6961l988
15684e5387J4240R447P542K1857K7797N925k5699j5695Q33R903J6216j965P687
15671B2701Q069n1156l5707K3003M9437k017j4758r325j7432l12L947j6124p09
15658d0383o579r403L5362R910L029l68j4665j4930P040L2042N231j5502R02N002
$$ plain form
15644 -3312 -8880 -20726 2800 7232 -2287 23224 29731 4754 7603 3177 2723 -20763 -40233
15631 -40233 -40407 -33711 -24272 -1040 -813 9807 17509 6851 -12516 -8859 -23097 -29578 -4712
15618 -4712 3236 5119 -8376 23268 33205 21716 -13240 -52810 -11717 15521 2827 -580 -5960
15605 -5960 6141 43008 42217 46337 20645 -270 -6746 -295 -4497 -7375 -5286 -4294 -13558 -11547
15591 -11547 3962 2960 -7319 -2204 -16594 -22369 -23900 -24835 -10861 5790 -6588 -39710 -33734
15578 -33734 -3396 37930 37323 15654 -446 1884 5447 644 -26951 -22831 1080 -2087 -26849
15565 -26849 -37074 -17680 -37587 -30245 -22831 -26900 -35876 -22022 -11744 -33280 -35824 -22375 -27204
15552 -27204 -21679 -26321 -23459 -15590 13244 17032 34636 36139 16405 20871 25030 21890 17097 2340
$$ packed form
15644c312n568j1846K3526M432r519K5511O507k4977K849m426m54k3486j9470
15631d0233j74O696R439K3232K27J0620P702j0658j9367L657j4238o481K4866
15618d712P948J883j3495L1644R937j1489l4956l9570M1093K7238j2694l407n380
15605e960J2101L6867p91M120k5692k0915o476O451m202k878K089R92r264K011
15591a1547J5509j002j0279N115j4390n775j531r35J3974J6651j2378l3122N976
15578c3734L0338M1326o07k1669j6100K330L563m803k7595M120K3911l167k4762
15565b6849j0225J9394j9907P342P414m069q976J3854J0278k1536k544J3449m829
15552b7204N525m642K862P869K8834L788J7604J503j9734M466M159l140m793j4757
$$ plain form
15538 2340 23037 26879 2487 -19416 -15270 -42524 -35272 -34266 -27313 -9716 -5711 -11712 -258
15525 -258 1048 -15936 -16389 -21722 -24494 -12084 -36002 -35337 -38475 -16230 -4829 3274 -10653 -7996
15511 -7996 10626 11539 12751 -2535 -19018 -21877 -39564 -15064 3070 11520 16394 4845 -5978
15498 -5978 -12195 -370 -9374 -2120 2413 2154 4713 -812 -12116 -17799 -7290 -5232 -17698 -30135
15484 -30135 -31973 -25265 -2400 2104 11535 7653 1497 -12995 -24928 -23746 -12325 11495 19417
15471 19417 28188 17475 11518 16414 564 -12373 -11263 -3034 -5882 -10406 9037 13976 19288
15458 19288 46283 56389 42016 15478 -9630 -21501 -11766 15943 19178 8875 -8013 -27095
15446 -27095 -35240 -16313 11359 37113 47094 37214 43209 49696 29722 20998 -9536 -23006 8614
$$ packed form
15538B340K0697L842k4392k1903M146k7254P252J006O953J7597M005o001J1454
15525b58J306j6984m53n333k772J2410k3918O65l138K2245J1401Q103j3927K657
15511g996J8622R13J212j5286j6483k859j7687K4500J8134Q450M874j1549j0823
15498e978o217J1825r004P254M533k59K559n525j1304n683J0509K058j2466j2437
15484c0135j838O708K2865M504R431l882o156j4492j1933J182J1421K3820P922
15471A9417Q771j0713n957M896j5850j2937J110Q229k848m524J9443M939N312
15458A9288K6995J0106j4373k6538k5108j1871R735K7709L235j0303j6888j9082
15446b7095q145J8927K7672K5754R981r880N995O487j9974q724l0534j3470L1620
$$ plain form
15433 8614 5341 -14534 -2771 -8009 -29850 -34403 -43737 -26306 -14770 -15987 -13890 -16630 -19957
15420 -19957 -2000 23094 12951 -9202 -26650 -33249 -24474 -5054 -14488 -27441 -29135 -37127 -18651
15407 -18651 -1902 -7999 -19845 13434 -1181 -12739 -8431 -7898 -3955 1251 6540 6104 -3450 -8536
15393 -8536 -15051 -15329 -7064 -4998 21000 54435 55568 39145 42704 44275 17105 -7350 -5058 -12514
15379 -12514 6143 28932 21412 6395 9855 16310 58576 51948 19842 4459 22874 44518
15367 44518 27417 7612 -8054 -28403 -12758 8602 23829 12979 -4294 38223 62645 46694
15355 46694 19855 5587 -7359 -23365 -18522 -20715 -24382 -23176 -23037 -26217 -36042 -48056 -18720
15342 -18720 -18012 -30516 -19972 -10387 -25053 -45839 -46560 -33412 -12356 -15744 -8182 13085 34005
$$ packed form
15433H614l273j9875J1763n238k1841m553r334J7431J1536j217K097k740l327
15420a9957J7957K5094j0143k2153j7448o599Q775J9420r434j2953j694p992J8476
15407a8651J6749o097j1846L3279j4615j1558M308N33L943N206N289m36r554n086
15393h536o515k78Q265K066K5998L3435J133j6423L559J571k7170k4455K292p456
15379a2514J8657K2789p520j5017L460O455M2266o628l2106j5383J8415K1644
15367D4518j7101j9805j5666k0349J5645K1360J5227j0850j7273M2517K4422j5951
15355D6694k6839j4268j2946j6006M843k193l667J206J39l180r825j2014K9336
15342a8720P08j2504J0544R585j4666k0786p21J3148K1056l388P562K1267K0920
$$ plain form
15329 34005 47648 31545 2468 3171 -3905 -32072 -10314 -16658 -12429 -8908 -5886 -15976 8927
15316 8927 13493 -2082 925 1314 -369 2407 -11378 -19416 -25521 -27590 -32714 -32647 -27235 -5935 6048
15301 6048 -3989 -4161 -4991 -14817 -50629 -66313 -60399 -56055 -37592 -19895 -20121 -24757 -37336 -50268
15287 -50268 -28512 8024 21740 -14324 -28770 -8322 142 9269 40448 14357 -22365 -22734
15275 -22734 -11840 -4698 14168 12313 4722 18524 29341 36169 23729 12666 -12262 -17560 -9789
15262 -9789 -25121 -22217 -27231 -35869 -38312 -37196 -56714 -43825 -27323 -19161 2745 15309 12439
15249 12439 21751 20148 8824 -1459 -6826 -6341 71 25732 -5366 -45713 -24933 -2098 4079
15236 4079 -4235 28991 40907 25210 279 -2398 -6678 -27309 -48986 -28637 -4661 374 38701
$$ packed form
15329C4005J3643j6103k9077P03p076k8167K1758o344M229L521L022j0090K4903
15316H927M566j5575L007L89j683K776j3785q038o105k069n124O7N412K1300J1983
15301F048j0037j72q30r826l5812j5684N914M344J8463J7697k26m636j2579j2932
15287e0268K1756L6536J3716l6064j4446K0448Q464R127L1179k6091l6722l69
15275b2734J0894P142J8866j855p591J3802J0817O828j2440j1063k4928n298P771
15262i789j5332K904n014q638k443J116j9518J2889J6502Q162K1906J2564k870
15249A2439R312j603j1324j0283n367M85O412K5661l1098m0347K0780K2835O177
15236D079q314L3226J1916j5697k4931k677m280k0631k1677K0349K3976N035L8327
$$ plain form
15223 38701 83761 71300 27941 -2277 -32527 -36644 -35152 -38450 -39593 -53980 -25562 -7274
15211 -7274 -4766 -14046 1188 -24509 -15158 8222 16872 -14289 -19430 15659 31982 41070 43754
15198 43754 5493 6240 9598 10040 -7108 -16074 -16081 -21622 -32296 -28499 -16791 -990 15575 36047
15184 36047 38513 19369 -16384 -17216 2737 -5074 -9835 -19668 -27264 -24422 -5648 -4389 -17754
15171 -17754 -31038 -24324 -32847 -21729 -12136 11526 103 -6750 2960 -32292 -37188 -26490 -35476
15158 -35476 -71378 -70351 -65542 -45089 -30337 -43925 -62857 -24857 9657 23221 19142 3106
15146 3106 21590 14432 -6908 9851 6003 -8530 -23469 -20629 -23604 -15804 -39174 -48988 604
15133 604 13521 3217 5373 -11806 -18235 -27559 -46395 -52684 -10355 13412 13171 3374 30226
$$ packed form
15223C8701M5060j2461m3359l0218l0250m117J492l298j143j4387K8418J8288
15211g274K508r280J5234k5697R351K3380Q650l1161n141L5089J6323R088K684
15198D3754l8261P47L358M42j7148q966pn541j0674L797J1708J5801J6565K0472
15184C6047K466j9144l5753q32J9953p811m761r833p596K842J8774J259j3365
15171a7754j3284O714q523J1118R593K3662j1423o853R710l5252m896J0698q986
15158c5476l5902J027M809K0453J4752j3588j8932L8000L4514J3564m079j6036
15146C106J8484p158k1340J6759l848j4533j4939K840k975P800k3370r814M9592
15133F04J2917j0304K156j7179o429r324j8836o289M2329K3767k41r797K6852
$$ plain form
15120 30226 14887 -6297 15214 -2453 -42575 -41699 -22417 103 3421 -23462 -22283 -16135 -21657
15107 -21657 -34347 -29135 -56940 -26009 -10268 -39944 -39446 -587 6185 -1840 -3495 22075 34596
15094 34596 33325 39688 43330 42857 20054 23633 32276 19465 13060 -4655 3479 11571 19432 33325
15080 33325 -373 -25533 -39132 -37828 -37599 -44413 -28640 -11650 -4953 -5896 -21147 -21612 -25450 -1813
15066 -1813 -914 4908 1196 -8513 -12428 -12429 -33074 -44843 -22243 -10187 -24451 -17331 -6522 10101
15052 10101 3311 -17419 -19164 -4420 -3132 -7359 -22479 -22369 -28433 -22346 -9977 -11491 -34863
15039 -34863 -30979 -21970 4814 -5565 -12000 643 15956 24196 13009 -11216 -15595 -11791 195
15026 195 -24662 -53454 -28541 -11360 8568 10754 -11794 -13424 -8676 -15303 -20437 -22455 -23314 -31091
$$ packed form
15120C0226j5339k1184K1511j7667m0122Q76J9282K2520L318k6883J179O148n522
15107b1657j2690N212k7805L0931J5741k9676M98L8859O772q025j655K5570J2521
15094C4596j271O363L642m73k2803L579Q643j2811o405j7715Q134Q092P861J3893
15080C3325l3698k5160j3599J304K29o814J5773J6990O697r43j5251m65l838K3637
15066a813Q99N822l712r709l915jk0645j1769K2600J2056j4264P120J0809J6623
15052A0101o790k0730j745J4744J288m227j5120J10o064O087J2369j514k3372
15039c4863L884R009K6784j0379o435J2643J5313Q240j1187k4225m379L804J1986
15026A95k4857k8792K4913J7181J9928K186k2548j630M748o627n134k018q59p777
$$ plain form
15012 -31091 -42202 -23009 7655 15329 20602 1656 -24591 -27774 -14098 -19386 -43836 -31510
15000 -31510 -6298 12126 11016 3569 -11407 -13497 -10354 -21221 -23548 -25032 -13385 -28889 -38951
14987 -38951 -28865 -15019 -9351 -30105 -47224 -64237 -27363 -11063 9582 41444 40194 1293
14975 1293 -28094 -28930 -1306 23726 -4410 -12716 -5483 6166 -12584 -33858 -39672 -51413 -21454
14962 -21454 24465 60003 50203 18403 12764 24083 11293 -329 22791 36892 32494 11904
14950 11904 12477 24211 11847 -8045 -8137 -1055 11852 34461 22979 2223 6810 9431 4523
14937 4523 -3494 -7039 1769 11270 15148 8138 -9462 -35400 -21303 -24367 -56469 -71468 -47785
14924 -47785 -20278 -38497 -19662 -5501 -3282 3357 -474 -27823 -21567 12972 16771 4625 15750
$$ packed form
15012c1091j1111J9193L0664P674N273j8946k6247l183J3676n288k4450J2326
15000c1510K5212J8424j110p447j4976k090L143j0867k327j484J1647j5504j0062
14987c8951J0086J3846N668k0754j7119j7013L6874J6300K0645L1862j250l8901
14975A293k9387q36K7624K5032k8136q306P233J1649j8750k1274n814j1741K9959
14962b1454M5919L5538r800l1800n639J1319j2790j1622K3120J4101m398k0590
14950A1904N73J1734j2364j9892r2P082J2907K2609j1482k0756M587K621m908
14937D523q017l545Q808R501L878p010j7600k5938J4097l064l2102j4999K3683
14924d7785K7507j8219J8835J4161K219O639l831k7349O256L4539L799j2146J1125
$$ plain form
14911 15750 22977 14575 2951 10225 12658 1034 277 12521 7787 -8197 18033 3827 -16625
14898 -16625 -13734 -22186 -19470 -12788 -7658 11019 -19053 -2432 18960 26915 -4432 -3283 7646
14885 7646 -9913 -8222 -7649 -2688 940 1851 24597 13760 -4612 -20457 -6205 16692 -2655
14872 -2655 -440 21096 7811 20790 52389 27404 -9839 -3162 18496 40602 38985 9508
14860 9508 14801 18782 8876 3691 -10911 475 14575 28711 28159 -8782 -29061 -29474 218
14847 218 1517 31331 7642 -32883 -15032 -10426 -325 1447 -12035 -20543 -15094 -35 -8192
14834 -8192 -38410 -25291 -16946 -34968 -47922 -40482 -30299 -13611 -8802 -10034 5460 -5876 -36634
14821 -36634 -41020 -15516 -12641 -18434 -22060 -21407 -6993 -12003 -12335 5110 4956 15866 14518 32108
$$ packed form
14911A5750P227q402j1624P274K433j1624p57J2244m734j5984K6230j4206k0452
14898a6625K891q452K716O682N130J8677l0072J6621K1392P955l1347J149J0929
14885G646j7559J691N73M961L628R11K2746j0837j8372j5845J4252K2897j9347
14872b655K215K1536j3285J2979L1599k4985l7243O677K1658K2106j617k9477
14860I508N293L981r906n185j4602J1386J4100J4136n52l6941k0279m13K9692
14847B18J299K9814k3689m0525J7851M606J0101J772j3482q508N449J5059q157
14834h192l0218J3119Q345j8022j2954P440J0183J6688M809j232J5494j1336l0758
14821c6634m386K5504K875n793l626O53J4414n010l32J7445j54J0910j348J7590
$$ plain form
14807 32108 44540 45346 21025 23739 36719 37553 2776 -26884 -40154 -22043 -15888 -15569 15250
14794 15250 3114 -9157 -8634 -11090 2851 -9652 -20146 -3391 14466 20608 8918 -8201
14782 -8201 -37120 -39241 -34384 -7968 -611 -3641 -3795 12140 12890 9869 -3891 -1384 11198 18147
14768 18147 40231 41381 22177 21116 32109 27698 -3546 4875 -1607 16504 32436 11706 -26583
14755 -26583 -26320 -13479 16631 43087 29173 9906 8972 17277 13716 -12548 -8375 8634 21862
14742 21862 18174 6423 1852 7908 -4619 -16231 -29402 -37616 -28430 1230 4738 1695 5585
14729 5585 26553 22161 -8817 7689 6911 -2162 -10612 -29899 -13150 2392 24320 13528 10328
14716 10328 13652 14359 11709 20578 12796 5550 2029 4029 -1936 -21105 -19884 -29876 -54711 -66242
$$ packed form
14807C2108J2432Q06k4321K714J2980Q34l4777k9660j3270J8111O155L19L0819
14794A5250j2136j2271N23k456J3941j2503j0494J6755J7857O142j1690j7119
14782h201k8919k121M857K6416P357l030j54J5935P50l021j3760K507J2582O949
14768A8147K2084J150j9204j061J0993m411l1244Q421o482J8111J5932k0730l8289
14755b6583K63J2841L0110K6456j3914j9267r34Q305l561k6264M173J7009J3228
14742B1862l688j1751m571O056j2527j1612j3171q214R186K9660L508l043L890
14729E585K0968m392l0978J6506p78r073q450j9287J6749J5542K1928j0792l200
14716A0328L324P07k650Q869p782p246l521K000n965j9169J221r992k4835j1531
$$ plain form
14702 -66242 -39392 -21945 -14809 7919 24106 35360 16184 -1311 -15727 -24544 -33149 -36960
14690 -36960 -5746 -29325 -31245 -26341 -33865 -26795 -28942 -9680 27667 15942 852 -33 -1136
14677 -1136 1121 13311 54504 74942 44576 20668 22116 24673 -4871 587 -9790 4531 15047
14664 15047 -21883 -25420 -13072 -31600 -25380 -28741 -14655 -1885 10193 17019 25737 24867 14686
14651 14686 10602 16354 -2549 30556 43559 32448 42202 56526 54160 13000 -4336 -4079 37614
14638 37614 52700 40405 10236 9871 12531 6464 4453 24422 18554 -16324 -42018 -17392 10081
14625 10081 11769 9346 19619 40060 50174 59404 41490 13479 -11800 -12525 -5585 26988 37253
14612 37253 43931 33690 19653 13671 26143 12341 -15132 -23632 -19630 -9533 -27017 -39251
$$ packed form
14702f6242K6850J7447P136K2728J6187J1254j9176j7495j4416q817q605l811
14690c6960L1214k3579j920M904p524P070k147J9262L7347j1725j5090q85j103
14677a136K257J2190M1193K0438l0366k3908J448K557k9544N458j0377J4321J0516
14664A5047l6930l537J2348j8528O220l361J4086J2770J2078O826Q718q70j0181
14651A4686m084N752j8903L3105J3003j1111R754J4324k366m1160j7336K57M1693
14638C7614J5086j2295l0169l65K660o067k011J9969n868l4878k5694K4626K7473
14625A0081J688k423J0273K0441J0114R230j7914k8011k5279p25O940L2573J0265
14612C7253O678j0241j4037n982J2472j3802k7473q500M002J0097j7484j2234
$$ plain form
14600 -39251 -17596 141 -6042 -46690 -76831 -84534 -83102 -79745 -64330 -59265 -49640 -18271 15944
14587 15944 5373 3266 -3852 2214 -3779 -11160 11610 27988 21639 33838 65544 41316 16263
14574 16263 5310 21492 34967 22578 5825 8339 16213 23730 45011 47438 27900 2356
14562 2356 -8389 -1548 -16797 -7290 -6085 -13323 -18328 -32435 -21091 -11370 -6652 7933 7322 9915
14548 9915 37382 25727 -14756 -40139 -41889 -15783 -8842 -1883 16366 32606 35298 8990 -19963
14535 -19963 -41403 -36514 -19371 -13386 -2298 3187 292 -24402 -19441 -27150 -16581 2660 18077
14522 18077 30712 35860 19144 19390 -1612 -11087 -18645 -7744 19770 22618 11262 32469 64647
14509 64647 51467 22629 7610 18591 5837 5211 8599 12597 9371 4330 21762 12681 -7356
$$ packed form
14600c9251K1655J7737o183m0648l0141p703J432L357J5415N065R625L1369L4215
14587A5944j0571k107p118O066n993p381K2770J6378o349J2199L1706k4228k5053
14574A6263j0953J6182J3475j2389j6753K514P874P517K1281K427j9538k5544
14562B356j0745O841j5249R507J205p238n005j4107J1344R721M718J4585o11K593
14548I915K7467j1655m0483k5383j750K6106O941O959J8249J6240K692k6308k8953
14535a9963k1440M889J7143N985J1088N485k895k4694M961p709J0569J9241J5417
14522A8077J2635N148j6716K46k1002r475p558J0901K7514K848j1356K1207L2178
14509F4647j3180k8838j5019J0981j2754o26L388L998l226n041J7432r081k0037
$$ plain form
14496 -7356 -9775 737 6084 -5335 -19748 -29241 -35968 -14571 -11172 -33569 -41441 -19477 -4385
14483 -4385 -14150 -29221 -19230 11724 9689 30188 26201 8834 24517 13540 14596 -6526 -41394
14470 -41394 -48922 -28287 716 15719 34615 16945 5369 -23231 -14668 3400 -2710 -10875
14458 -10875 -20932 214 5176 -7876 -19042 -11744 -241 10162 -4822 21491 28796 26885
14446 26885 18956 20089 3812 -19673 -31370 -10663 -7751 5470 -3550 -3291 -33152 -80360 -56045
14433 -56045 -44301 -26142 -3165 -5019 1988 -6464 -22804 -13160 7302 20413 -2959 -42110
14421 -42110 -60610 -46436 -32579 -30585 1594 913 -26571 -4423 22450 33590 12528 265
14409 265 -21850 -14659 -1623 17271 13544 7557 8784 -16159 -15041 -14039 -16015 -17768 -19760 -14848
$$ packed form
14496g356k419J0512N347j1419j4413r493o727K1397L399k2397p872K1964J5092
14483d385r765j5071R991L0954k035K0499l987j7367J5683j0977J056k1122l4868
14470d1394p528K0635K9003J5003J8896j7670j1576k8600Q563J8068o110q165
14458a0875j0057K1146M962j3052j1166P298J1503J0403j4984K6313P305j911
14446B6885p929J133j6277k3485j1697K0707K912J3221r020K59k9861m7208K4315
14433e6045J1744J8159K2977j854P007q452j6340R644K0462J3111k3372l9151
14421d2110j8500J4174J3857J994L2179o81k7484K2148K6873J1140k1062j2263
14409B65k2115P191J3036J8894l727n987J227k4943J118J002j976j753j992M912
$$ plain form
14395 -14848 -11615 -11136 25127 35367 12602 13687 28052 21332 37586 35626 35460 21294 24133
14382 24133 22039 16707 31648 26667 7017 13128 -10300 -29154 -32953 -24555 2542 15097 48515
14369 48515 36745 15255 -18590 -23263 -29651 -23640 -29654 -14516 14523 39194 41498 35179 27808
14356 27808 -144 -8624 10307 24706 38851 34946 3253 -6874 -9050 -3985 -12997 -12487 -27340
14343 -27340 -30730 -4810 -27323 -41304 -27356 -7872 -32716 -33334 -30312 -30843 -47529 -20118 -7967
14330 -7967 -17907 -19074 -16895 -36993 -51416 -39193 -3910 9823 12216 20762 17705 12530 21309
14317 21309 26243 10920 -9997 1981 -22049 -6737 21456 8850 -19240 -24295 -22219 -17032
14305 -17032 -37918 -9633 25039 36595 44031 10944 -2075 -34725 -38391 -5675 -16655 -26693
$$ packed form
14395a4848L233M79L6263J0240k2765J085J4365o720J6254j960j66j4166K839
14382B4133k094n332J4941m981j9650O111k3428j8854l799Q398K7097J2555L3418
14369D8515j1770k1490l3845m673o388O011o014J5138K9039K4671K304o319p371
14356B7808k7952q480J8931J4399J4145l905l1693j0127k176N065r012N10j4853
14343b7340l390K5920k2513j3981J3948J9484k4844o18L022n31j6686K7411J2151
14330g967r940j167K179k0098j4423J2223L5283J3733K393Q546l057n175Q779
14317B1309M934j5323k0917J1978k4030J5312K8193j2606k8090n055K076N187
14305a7032k0886K8285L4672J1556P436l3087j3019l2650l666L2716j0980j0038
$$ plain form
14293 -26693 -27313 -28235 -20926 4820 -10413 -21160 -20962 5201 -4199 -26371 -61501 -51086 -32483
14280 -32483 -21285 -4481 13463 1240 -11555 -8439 -13955 15557 12762 -12883 -38938 -25369
14268 -25369 -14090 -5633 -23369 -3121 7380 9649 13520 10175 27003 33831 36621 43759 28923
14255 28923 37404 42806 23200 -14118 -38489 -45022 -26022 -9101 -28762 -26890 -6658 -14781 4422
14242 4422 13290 -441 -11299 -12183 -19705 -1265 5191 -12301 -17214 5771 21695 6619 8722
14229 8722 14428 22157 24073 8121 -18401 -9623 -9711 -16622 -4546 -11287 -14248 5922 7887 19861
14215 19861 4061 -25443 -13969 -3812 10293 17415 17832 22615 22143 21040 32478 25464 14365
14202 14365 12908 21576 16243 -11518 -44169 -19833 -4150 -4319 17348 39819 36708 3610 -9107
$$ packed form
14293b6693o20r22P309K5746j5233j0747J98K6163r400k2172l5130J0415J8603
14280c2483J1198J6804J7944j2223j2795L116n516K9512k795k5645k6055J3569
14268b5369J1279Q457j7736K0248J0501K269L871l345J6828O828K790P138j4836
14255B8923Q481N402j9606l7318k4371o533J9000J6921j9661J872K0232q123J9203
14242D422Q868j3731j0858q84p522J8440O456j7492m913K2985J5924j5076K103
14229H722N706P729J916j5952k6522Q778q8o911J2076o741k961K0170J965J1974
14215A9861j5800k9504J1474J0157J4105P122M17M783m72j103J1438p014j1099
14202A4365j457Q668n333k7761l2651K4336J5683j69K1667K2471l111l3098j2717
$$ plain form
14189 -9107 -7342 1532 14018 32135 22993 25977 35349 45872 55139 38739 21000 -17316 -35289
14176 -35289 -25995 -1524 8884 11167 -21296 -47714 -26341 -16040 4576 -7111 -4567 16880
14164 16880 17192 -318 -23113 -14353 2084 -10896 -8801 -35630 -36389 -13627 -12999 3865 -888
14151 -888 -16624 -6593 -4769 7870 43094 43800 28860 25959 17336 5406 10737 28634 -17769
14138 -17769 -35671 -8117 -6049 4385 12170 -14278 -11647 -16111 -17013 -7134 -10303 -1414 8096 89
14124 89 -21547 -29626 -11672 -27243 -26998 1098 -1153 13873 23393 8427 -624 -26132 -27414 15365
14110 15365 49215 63354 61718 33590 -2607 -12003 16907 15893 -1335 -656 17790 23912 -19448
14097 -19448 -32301 -18234 -29203 -24662 -5677 25308 28957 5967 -12918 -27529 -23597 3042
$$ packed form
14189i107J765Q874J2486J8117r142K984R372J0523R267j6400j7739l8316j7973
14176c5289R294K4471J0408K283l2463k6418K1373J0301K0616j1687K544K1447
14164A6880L12j7510k2795Q760J6437j2980K095k6829p59K2762O28J6864m753
14151h88j5736J0031J824J2639L5224P06j4940k901q623j1930N331J7897m6403
14138a7769j7902K7554K068J0434P785k6448K631m464r02R879l169Q889R510q007
14124H9k1636q079J7954j5571K45K8096k251J5026R520j4966r051k5508j282M2779
14110A5365L3850J4139j636k8128l6197r396K8910j014j7228O79J8446O122m3360
14097a9448j2853J4067j0969M541J8985L0985L649k2990j8885j4611L932K6639
$$ plain form
14085 3042 37094 54954 31898 15913 33863 49388 44619 55923 52907 25727 18117 24985 26804
14072 26804 19197 27887 19497 26181 29361 23221 -18045 -17258 7000 39173 35409 15750 30847
14059 30847 43621 14297 11234 29080 33001 26977 19374 20367 52564 50553 29857 6085 -12793
14046 -12793 -46744 -38665 -50842 -52025 -28319 28 21781 3985 -13580 6534 15014 -7818
14034 -7818 -7003 -27168 -9041 39099 47676 40914 38427 22447 26001 42616 30214 87 6966
14021 6966 35702 28532 14969 19633 2411 -28832 -2603 23142 22793 32748 32086 15921 -5302
14008 -5302 15827 51999 56603 45882 38192 27994 21376 37839 32385 39905 50153 18005 -12162
13995 -12162 -15891 19499 40496 42777 35650 30514 -2110 -8654 -1288 -34131 -17720 5257 24682
$$ packed form
14085C042L4052J7860k3056j5985J7950J5525m769J1304l016k7180p610O868J819
14072B6804p607Q690q390O684L180o140m1266P87K4258L2173l764j9659J5097
14059C0847J2774k9324l063J7846L921o024p603R93L2197k011k0696k3772j8878
14046a2793l3951Q079j2177j183K3706K8347K1753j7796j7565K0114Q480k2832
14034g818Q15k0165J8127M8140Q577o762k487j5980L554J6615j2402l0127O879
14021F966K8736p170j3563M664j7222l1243K6229K5745l49R955o62j6165k1223
14008e302K1129L6172M604j0721p690j0198o618J6463n454P520J0248l2148l0167
13995a2162l729L5390K0997K281p127n136l2624o544P366l2843J6411K2977J9425
$$ plain form
13982 24682 44493 27230 11904 9438 27608 41041 27755 26997 49202 29924 -8367 -7097
13970 -7097 5146 17125 19959 15621 -3258 -12366 14239 5377 17000 30733 31474 45107 43576
13957 43576 31272 14255 10512 -969 5758 14243 13934 -3119 -33275 -38337 3099 24675 30744
13944 30744 16908 9206 6586 19134 45721 34059 27543 30522 20866 41026 28213 266 -13166
13931 -13166 -10215 -11631 4805 25004 13763 -18166 -26662 -18647 -7786 -11813 22206 9125 32
13918 32 -7682 -227 20962 48489 52049 48897 13094 -2753 8107 -364 -34674 -51066 -28281
13905 -28281 -14408 -13224 -42116 -32917 17383 53823 43559 31561 39339 25723 6913 26310
13893 26310 44660 42489 21480 -14327 -44303 -29252 3911 4811 7445 -6069 -1008 7789 4003
$$ packed form
13982B4682J9811j7263j5326k466J8170J3433j3286p58K2205j9278l8291J270
13970g097J2243J1979K834m338j8879r108K6605q862J1623J3733P41J3633j531
13957D3576j2304j7017l743j1481O727Q485l09j7053l0156n062M1436K1576O069
13944C0744j3836p702k620J2548K6587j1662o516K979r656K0160j2813k7947j3432
13931a3166K951j416J6436K0199j1241l1929q496Q015J0861m027L4019j3081r093
13918C2p714P455K1189K7527L560l152l5803j5847J0860q471l4310j6392K2785
13905b8281J3873J184k8892R199N0300L6440j0264j1998P778j3616j8810J9397
13893B6310J8350k171k1009l5807k9976J5051L3163R00K634j3514N061Q797l786
$$ plain form
13880 4003 -12114 -14484 21356 22758 25888 39088 21644 22184 16205 -1732 6253 13316 15604 21846
13866 21846 -15565 -26085 -31834 -21766 -21462 -21111 8951 18179 11292 5587 7144 9587 33679 30537
13852 30537 15797 26018 24491 25921 17500 10741 11130 28309 29625 23046 25260 20134 33871 39974
13838 39974 8802 17243 24638 45814 34325 -7882 -22128 -3163 31570 36870 39082 505
13826 505 10461 12471 31283 21786 -9584 -12693 -22385 -2218 19738 42108 44589 34734 2955
13813 2955 -14341 -4186 10834 15043 20849 1316 5656 -5407 -10907 -12597 -30745 -11360 -10499
13800 -10499 -7997 -9327 -22337 -12276 -14333 -6590 5141 62 -5523 2047 18946 17016 4685
13787 4685 -14758 26942 59663 54180 51857 32472 11537 2718 -1125 7569 36695 41240 21110
$$ packed form
13880D003j6117k370L5840J402L130J3200j7444N40n979j7937P985P063K288O242
13866B1846l7411j0520n749J0068L04L51L0062R228o887n705J557K443K4092l142
13852C0537j4740J0221j527J430q421o759L89J7179J316o579K214n126J3737O103
13838C9974l1172Q441P395K1176j1489m2207j4246J8965L4733N300K212l8577
13826E05R956K010J8812r497l1370l109r692K0167K1956K2370K481r855l1779
13813B955j7296J0155J5020M209N806j9533M340j1063n500j690j8148J9385Q61
13800a0499K502j330j3010J0061k057P743J1731n079n585P570J6899j930j2331
13787D685j9443M1700L2721n483k323j9385k0935q819l843Q694K9126M545k0130
$$ plain form
13774 21110 7587 -15371 -5746 30019 42887 41631 13272 -9379 2659 10786 15093 -2063
13762 -2063 -26715 -51847 -36341 15688 9951 12846 12022 -5525 -4807 -9142 6611 7832 10634 10805
13748 10805 7777 9387 -6531 -39012 -35443 -2133 3487 9803 -2855 -2503 10470 -14612 -18694
13735 -18694 -1090 -2651 -2823 -48268 -52610 -28713 -10598 10912 5080 13415 51094 44333 33550
13722 33550 26211 -3590 -17233 -4904 4110 -12430 -14407 -14464 17095 38152 37253 28642 31062 36227
13708 36227 31457 24908 13107 2036 4985 -8934 -11061 -16881 -31753 -13138 3316 1048 11172
13695 11172 26711 40756 19552 7342 9037 7428 -17935 -34199 -18963 13403 11781 -1159
13683 -1159 -1954 22749 25447 28137 -5448 -16238 5177 14679 16196 7722 3922 23699 43762
$$ packed form
13774B1110j3523k2958R625L5765J2868j256k8359k2651J2038Q127M307j7156
13762b063k4652k5132J5506N2029n737K895q24j7547P18m335J5753J221K802J71
13748A0805l028J610j5918l2481L569L3310N620O316j2658L52J2973k5082m082
13735a8694J7604j561j72m5445m342K3897J8115K1510n832Q335L7679o761j0783
13722C3550p339k9801j3643J2329R014j6540j977n7L1559K1057q99q611K420N165
13708C6227m770o549j1801j1071K949j3919k127n820j4872J8615J6454k268J0124
13695A1172J5539J4045k1204j2210J695j609k5363j6264J5236L2366j622j2940
13683a159p95K4703K698K690l3585j0790K1415R502J517q474l800J9777K0063
$$ plain form
13670 43762 45251 24772 270 -6187 -4136 12498 9373 11522 -2650 -29818 -33020 -3301 -3092
13657 -3092 -22949 -5288 32086 43654 18875 35481 52459 44178 21794 21954 20618 27738 -6980
13644 -6980 -27932 -14788 1836 16819 31709 32834 30243 33726 37661 18603 -16186 -23903 3526
13631 3526 13288 28409 34326 40292 47982 57116 29835 1671 -3724 -8261 315 16135 10170 24728
13617 24728 35033 26742 26507 6315 13203 15089 28889 56672 45926 23794 29996 44942 58242
13604 58242 30278 4795 1114 -2564 -2886 -7961 7834 19782 316 11701 5037 7012 1975
13591 1975 4715 32184 64536 70350 54639 39447 15753 10968 28183 29044 34777 25419 29976
13578 29976 34510 75290 101269 92491 77904 74355 63043 46833 40254 22413 2018 -491 257
$$ packed form
13670D3762J489k0479k4502o457K051J6634l125K149j4172k7168l202K9719K09
13657c092j9857J7661L7374J1568k4779J6606J6978q281k2384J60j336P120l4718
13644f980k0952J3144J6624J4983J4890J125k591L483L935j9058l4789p717K7429
13631C526R762J5121N917N966P690R134k7281k8164n395m537Q576J5820n965J4558
13617B4728J0305q291k35k0192O888J886J3800K7783j0746k2132O202J4946J3300
13604E8242k7964k5483l681l678l22n075J5795J1948j9466J1385o664J975n037
13591A975K740K7469L2352N814j5711j5192k3694m785J7215Q61N733r358M557
13578B9976M534M0780K5979q778j4587l549j1312j6210o579j7841k0395k509P48
$$ plain form
13565 257 13977 19287 32355 29191 17652 8141 2174 30260 52957 26872 -3380 23540 40667
13552 40667 44168 37921 24121 19782 28658 33785 2754 -5539 3300 -33230 -46563 -14627 9741
13539 9741 6347 -26566 -25964 -16634 -21128 7141 55177 49305 51931 15596 -16187 -22485 10480
13526 10480 33326 32339 19219 28217 2997 12754 2446 14320 45137 36849 35290 39123 36404
13513 36404 49254 54679 32043 17075 38243 51825 18485 6552 23550 23850 4155 40087
13501 40087 64568 71639 67972 65066 74341 65471 72690 52110 33611 47571 80163 69557 15621
13488 15621 -884 5821 20688 -1508 8508 37001 39589 35022 36157 53401 29552 20248 18865
13475 18865 1322 -21761 -7574 27106 42722 40416 40452 15337 18631 28142 26916 39425 55342
$$ packed form
13565B57J3720N310J3068l164j1539r511n967K8086K2697k6085l0252K6920J7127
13552D0667L501o247j3800m339Q876N127l1031q293Q839l6530j3333L1936K4368
13539I741l394l2913O02R330m494K8269M8036n872K626l6335l1783o298L2965
13526A0480K2846r87j3120Q998k5220R757j0308J1874L0817q288j559L833k719
13513C6404J2850N425k2636j4968K1168J3582l3340j1933J6998L00j9695L5932
13501D0087K4481P071l667k906R275q870P219k0580j8499J3960L2592j0606n3936
13488A5621j6505O705J4867k2196J0016K8493K588m567J135J7244k3849r304j383
13475A8865j7543k3083J4187L4680J5616k306L6k5115L294R511j226J2509J5917
$$ plain form
13462 55342 29683 35182 37515 38236 17430 26009 6507 13919 30068 20531 22147 39561 45635
13449 45635 17778 6628 2611 -5561 6075 23137 31013 50947 28968 31440 33587 25354 23548
13436 23548 36364 52900 42500 11540 -3283 34286 35455 12198 4103 28207 41135 57967
13424 57967 49905 39118 32786 3185 7275 8099 19041 18358 17755 16271 11725 23289 40996 48848
13410 48848 51382 70949 66280 59058 33306 40570 78524 99523 86891 92945 91770 60304 69669
13397 69669 64800 72997 97560 88506 69279 86035 105419 91537 112222 112711 101327 127369 148424
13384 148424 141495 127665 153170 164865 134571 113854 138171 158820 157043 158251 157074 145007
13372 145007 146846 145034 144492 136558 155194 196381 212724 215961 209394 215978 237150 263765 280094
$$ packed form
13462E5342k5659N499K333P21k0806Q579j9502P412J6149r537J616J7414O074
13449D5635k7857j1150m017q172J1636J7062P876J9934k1979K472K147q233j806
13436B3548J2816J6536j0400l0960j4823L7569J169k3257q095K4104J2928J6832
13424E7967q062j0787o332k9601M090Q24J0942o83o03j484m546J1564J7707P852
13410D8848K534J9567m669p222k5752P264L7954K0999j2632O054j175l1466R365
13397F9669m869Q197K4563r054j9227J6756J9384j3882K0685M89j1384K6042K1055
13384A48424o929j3830K5505J1695l0294k0717K4317K0649j777J208j177j2067
13372A45007J839j812n42p934J8636M1187J6343L237o567O584K1172K6615J6329
$$ plain form
13359 280094 292605 287719 282858 333331 400825 516972 676674 842165 1064907 1262310 1428367
13348 1428367 1595491 1624382 1285993 921632 675180 516076 413415 377354 330550 296063
13338 296063 270073 261419 248288 225771 197896 175623 155215 134105 112765 120263 168659 165725
13326 165725 147850 153948 149075 169413 184902 145332 123033 121248 113303 98884 110522 124507
13314 124507 145807 112103 90683 98338 83285 79289 78766 63167 76760 84257 89385 87250 90220
13301 90220 107438 107670 88543 86244 93082 81738 81208 77593 76121 64160 54740 47553 44729 59446
13287 59446 43265 34901 39284 60160 58230 68824 46242 61169 66485 70498 62455 62301 83515
13274 83515 87866 83187 78548 82233 103192 94380 67381 52282 45255 51954 50269 74989 77417
$$ packed form
13359B80094J2511m886m861N0473O7494J16147J59702J65491K22742J97403J66057
13348A428367J67124K8891l38389l64361k46452j59104j02661l6061m6804l4487
13338B96063k5990q654j3131k2517k7875k2273k0408k1110k1340P498M8396k934
13326A65725j7875O098m873K0338J5489l9570k2299j785p945j4419J1638J3985
13314A24507K1300l3704k1420P655j5053l996n23j5599J3593P497N128k135K970
13301I0220J7218K32j9127k299O838j1344n30l615j472j1961r420p187k824J4717
13287E9446j6181q364M383K0876j930J0594k2582J4927N316M013q043j54K1214
13274H3515M351m679m639L685K0959q812k6999j5099p027O699j685K4720K428
$$ plain form
13261 77417 77051 67040 58811 57366 39045 48196 70223 46750 44405 72137 80754 66936 58242
13248 58242 49957 55089 55185 59670 82594 103870 110044 91025 90253 85756 73268 67587 42767 13865
13234 13865 -20769 -5212 16007 27420 28514 20225 22926 5087 -546 548 27830 61895 70727
13221 70727 50195 27023 53713 76829 87564 78635 101018 109367 57863 20353 29071 61611
13209 61611 67087 55451 85532 62442 27391 23930 32399 32409 42666 43238 23172 8721 2918
13196 2918 6076 29862 65234 131686 196875 253146 269653 327993 384447 348413 268552 196581
13184 196581 143987 137460 132809 156068 158949 141560 156461 158104 143884 137212 144847 141882 139273
13171 139273 130057 143275 158253 141470 141615 158654 150119 122364 130103 144054 157396 191401
$$ packed form
13261G7417l66j0011q229j445j8321R151K2027k3473k345K7732Q617j3818q694
13248E8242q285N132R6M485K2924K1276O174j9019p72m497j2488n681k4820k8902
13234A3865l4634J5557K1219J1413J094q289K701j7839n633J094K7282L4065Q832
13221G0727k0532k3172K6690K3116J0735q929K2383Q349n1504l7510Q718L2540
13209F1611N476j1636L0081k3090l5051l461Q469J0J0257N72k0066j4451n803
13196B918L158K3786L5372O6452O5189N6271J6507N8340N6454l6034p9861p1971
13184A96581n2594o527m651K3259K881j7389J4901J643j4220o672P635k965k609
13171A39273r216J3218J4978j6783J45J7039q535k7755P739J3951J3342L4005
$$ plain form
13159 191401 185067 178336 174401 197063 226400 205014 204850 217890 217650 218255 199735 200913 220575
13146 220575 227840 233076 231052 219058 226297 238976 206722 173968 167044 193159 190118 194325 199391
13133 199391 188152 160907 153983 138317 119684 151136 171275 158905 175714 193885 168245 133508
13121 133508 139713 143555 134563 130678 123729 148597 149345 156292 173852 165337 156921 154243 139944 119783
13107 119783 120648 141054 133494 102271 96754 103756 111421 109265 106067 130574 100898 89633 87761
13094 87761 103148 103447 113073 107036 114568 121402 110415 101680 85261 97476 124823 126674 153307
13081 153307 172089 174293 170379 167737 176764 165307 182185 178106 166744 185735 227911 224493 191789
13068 191789 183156 172516 173445 170558 178201 156847 119721 114122 109311 82610 84620 96502 94759
$$ packed form
13159A91401o334o731l935K2662K9337k1386j64J3040k40O05j8520J178J9662
13146B20575P265N236k024j1994P239J2679l2254l2754o924K6115l041M207N066
13133A99391j1239k7245o924j5666j8633L1452K0139j2370J6809J8171k5640l4737
13121A33508O205L842q992l885o949K4868P48O947J7560q515q416k678j4299k0161
13107A19783Q65K0406p560l1223n517P002P665k156l198K4507k9676j1265j872
13094H7761J5387K99R626o037P532O834j0987q735j6419J2215K7347J851K6633
13081A53307J8782K204l914k642R027j1457J6878m079j1362J8991M2176l418l2704
13068A91789q633j0640R29k887P643k1354l7126n599m811k6701K010J1882j743
$$ plain form
13055 94759 67393 69349 90884 100778 102658 135168 151708 149882 156110 165771 167884 165070 162929
13042 162929 165201 154730 158399 181055 218424 260734 278168 290643 280761 273917 300301 373986
13030 373986 370800 376959 388189 392538 411073 433984 483307 539542 592622 676268 782408 862145
13018 862145 904265 935009 937964 885563 835053 803842 709165 617607 559612 516952 491063 439819
13006 439819 461074 482750 498028 502962 490057 494708 523381 528470 539322 581137 615448 657994
12994 657994 684241 701420 737699 764270 776574 821104 862676 909556 935253 919880 963060
12983 963060 1033391 1103240 1149564 1214700 1241006 1291139 1360484 1456552 1544207 1610105 1677123
12972 1677123 1743237 1831495 1927303 1999344 2076193 2165216 2239463 2294064 2367299 2460944 2555455
$$ packed form
13055I4759k7366J956K1535R894J880L2510J6540j826O228R661K113k814k141
13042A62929K272j0471L669K2656L7369M2310J7434J2475r882o844K6384P3685
13030C73986l186O159J1230M349J8535K2911M9323N6235N3080Q3646J06140P9737
13018H62145M2120L0744K955n2401n0510l1211r4677r1558n7995m2660k5889n1244
13006D39819K1255K1676J5278M934j2905M651K8673N089J0852M1815L4311M2546
12994F57994K6247J7179L6279K6571J2304M4530M1572M6880K5697j5373M3180
12983I63060P0331O9849M6324O5136K6306N0133O9345R6068Q7655O5898O7018
12972A677123O6114Q8258R5808P2041P6849Q9023P4247N4601P3235R3645R4511
$$ plain form
12961 2555455 2643945 2725773 2835419 2958677 3069753 3242260 3404701 3529417 3673066 3826513
12951 3826513 3974417 4136682 4302278 4483882 4676679 4864348 5087840 5306788 5489818
12942 5489818 5688062 5892062 6130510 6421664 6722154 7042123 7408049 7810872 8294027
12933 8294027 8753521 9151746 9541373 10024099 10584859 11138115 11706070 12269729 12851069
12924 12851069 13457926 14084792 14665835 15238243 15751371 16201276 16651771 17136056 17684409
12915 17684409 18340836 19133258 20055442 21143096 22415332 23890174 25523685 27179331
12907 27179331 28785708 30307900 31829265 33365687 34822136 36137478 37438197 38821030
12899 38821030 40304332 42070344 44473571 47581976 51371632 56778037 65159626 78168116
$$ packed form
12961B555455Q8490Q1828J09646J23258J11076J72507J62441J24716J43649J53447
12951C826513J47904J62265J65596J81604J92797J87669K23492K18948J83030
12942E489818J98244K04000K38448K91154L00490L19969L65926M02823M83155
12933H294027M59494L98225L89627M82726N60760N53256N67955N63659N81340
12924A2851069O06857O26866N81043N72408N13128M49905M50495M84285N48353
12915A7684409O56427P92422R22184J087654J272236J474842J633511J655646
12907B7179331J606377J522192J521365J536422J456449J315342J300719J382833
12899C8821030J483302J766012K403227L108405L789656N406405Q381589J3008490
$$ plain form
12891 78168116 98313996 127104014 163462733 204326488 243095663 276224407 311339782
12884 311339782 302624428 222163691 151055423 108603193 83706062 68003838 57501598
12877 57501598 50123212 44690839 40597462 37473816 35021489 33065031 31142528 29404981
12869 29404981 28070999 27115892 26427966 25996916 25760909 25453631 25291955 25063061 24222505
12860 24222505 22836391 21319349 19824085 18410379 17125863 15939187 14856039 13838509
12852 13838509 12804615 11848845 11015215 10276558 9566318 8946701 8386501 7898717 7429227
12843 7429227 6946425 6507687 6068293 5686193 5364764 5070261 4795655 4547554 4342001
12834 4342001 4155108 3958039 3734690 3558093 3367575 3187004 3027418 2874114 2714864
$$ packed form
12891G8168116K0145880K8790018L6358719M0863755L8769175L3128744L5115375
12884C11339782q715354q0460737p1108268m2452230k4897131j5702224j0502240
12877E7501598p378386n432373m093377l123646k452327j956458j922503j737547
12869B9404981j333982r55107o87926m31050k36007l07278j61676k28894q40556
12860B4222505j386114j517042j495264j413706j284516j186676j083148j017530
12852A3838509j033894r55770q33630p38657p10240o19617n60200m87784m69490
12843G429227m82802m38738m39394l82100l21429k94503k74606k48101k05553
12834D342001j86893j97069k23349j76597j90518j80571j59586j53304j59250
$$ plain form
12825 2714864 2559556 2419320 2309307 2206566 2131117 2063678 1972386 1861947 1750798 1686773
12815 1686773 1612177 1555424 1504425 1408974 1345482 1329485 1277313 1199335 1120050 1040778 995438
12804 995438 930220 855974 796305 766046 751433 718904 654829 653718 654895 623074 582252 585504
12792 585504 594767 564622 531340 509187 489967 490198 470038 453872 416535 401780 399831 374910
12780 374910 356311 357661 363067 372600 341446 325954 326973 322268 329414 337447 350531 370683 419554
12767 419554 465835 448714 454969 467785 515012 549456 512098 495017 541221 515388 445149 358799
12755 358799 303554 283374 246618 206751 144345 123664 111143 122724 133971 145403 164563
12744 164563 153585 164584 167868 167370 180389 169525 133837 106696 127238 151991 194482 219558
$$ packed form
12825B714864j55308j40236j10013j02741p5449o7439r1292j10439j11149o4025
12815A686773p4596n6753n0999r5451o3492j5997n2172p7978p9285p9272m5340
12804I95438o5218p4246n9669l0259j4613l2529o4075j111J177l1821m0822L252
12792E85504R263l0145l3282k2153j9220K31k0160j6166l7337j4755j949k4921
12780C74910j8599J350N406R533l1154j5492J019m705P146Q033J3084K0152M8871
12767D19554M6281j7121O255J2816M7227L4444l7358j7081M6204k5833p0239q6350
12755C58799n5245k0180l6756l9867o2406k0681j2521J1581J1247J1432J9160
12744A64563j0978J0999L284m98J3019j0864l5688k7141K0542K4753M2491K5076
$$ plain form
12732 219558 241383 248890 250648 247548 244466 273291 265958 274356 281050 261723 266345 254251 262193
12719 262193 284251 296614 308686 301209 284384 240873 206918 204338 212362 238459 254352 232515
12707 232515 225748 213789 214622 199552 181497 165272 157064 136093 128756 149773 167162 183934
12695 183934 208976 200285 167018 150011 158253 172563 155651 154184 156963 158947 137739 135969 144062
12682 144062 151442 141244 134500 150212 158558 149316 151568 131226 109448 95205 87214 106694 84899
12669 84899 88194 87286 96095 71795 48142 75699 67001 40551 46124 60785 59491 66711 78564
12656 78564 77672 29275 14336 29977 41010 27128 13516 -8240 20976 39223 47227 54335
12644 54335 44269 8867 427 7579 26153 12181 8848 29299 40940 36536 49538 50044 42199
$$ packed form
12732B19558K1825P507J758l100l082K8825p333Q398O694j9327M622j2094P942
12719B62193K2058J2363J2072p477j6825m3511l3955k580Q024K6097J5893k1837
12707B32515o767j1959Q33j5070j8055j6225q208k0971p337K1017J7389J6772
12695A83934K5042q691l3267j7007Q242J4310j6912j467K779J984k1208j770Q093
12682A44062P380j0198o744J5712Q346r242K252k0342k1778j4243p991J9480k1795
12669H4899L295r08Q809k4300k3653K7557q698k6450N573J4661j294P220J1853
12656G8564q92m8397j4939J5641J1033j3882j3612k1756K9216J8247Q004P108
12644E4335j0066l5402q440P152J8574j3972l333K0451J1641m404J3002N06p845
$$ plain form
12631 42199 26411 42177 31575 22422 17886 22537 32478 61389 51466 46378 47746 39846 19883
12618 19883 -1494 -16382 -22453 -9395 -11654 4510 13258 19528 -2518 -18309 -33142 -23916 -12490
12605 -12490 -4118 2063 24643 25735 26014 35295 -1896 -9360 7942 -13345 -48505 -54843 -51029
12592 -51029 -45641 -26451 -28377 -39099 -62329 -82705 -128731 -162843 -215003 -259260 -244139 -261665
12580 -261665 -223940 -101816 -30949 27243 54328 90486 117725 93972 96496 95548 91226 115986
12568 115986 110408 110762 92805 61884 54180 41694 36810 47672 61400 74457 68765 52697 55513
12555 55513 52660 36484 32458 28800 55919 72666 57581 54493 61596 93540 80228 83462 85614
12542 85614 69819 50461 30811 5787 16956 28914 44493 48895 70852 60445 36928 36618
$$ packed form
12631D2199j5788J5766j0602r153m536M651R941K8911r923n088J368p900j9963
12618A9883k1377j4888o071J3058k259J6164Q748O270k2046j5791j4833R226J1426
12605a2490Q372O181K2580J092K79R281l7191p464J7302k1287l5160o338L814
12592e1029N388J9190j926j0722k3230k0376m6026l4112n2160m4257J5121j7526
12580b61665L7725J22124P0867N8192K7085L6158K7239k3753K524r48m322K4760
12568A15986n578L54j7957l0921p704j2486m884J0862J3728J3057n692j6068K816
12555E5513k853j6176m026l658K7119J6747j5085l088P103L1944j3312L234K152
12542H5614j5795j9358j9650k5024J1169J1958J5579M402K1957j0407k3517l10
$$ plain form
12530 36618 25414 49506 20243 -2221 18233 6821 11841 43887 43316 15849 3331 6889
12518 6889 32891 28044 16424 31209 61148 87289 72921 35301 41929 48456 64304 84335
12506 84335 80641 70285 73230 71902 43251 22343 16868 24878 21832 12244 18142 16353 15854 -15941
12492 -15941 -25598 -18065 -4234 20552 26155 25512 27792 24989 30830 22354 4303 5614 -13137 -18873
12478 -18873 -21683 5067 19096 11580 3412 16075 55316 68995 67218 33581 28335 19129 32444
12465 32444 64597 67844 72395 87015 70474 58608 76702 91866 117279 124150 88599 46914
12453 46914 44093 49884 60070 101947 123109 129047 135502 135031 141157 144541 153745 168179 175769 149078
12439 149078 150357 160436 161351 150508 186034 231605 242708 239971 236432 240700 249443 285130 293032
$$ packed form
12530C6618j1204K4092k9263k2464K0454j1412N020L2046n71k7467j2518L558
12518F889K6002m847j1620J4785K9939K6141j4368l7620O628O527J5848K0031
12506H4335l694j0356K945j328k8651k0908n475Q010l046r588N898j789m99l1795
12492a5941r657P533J3831K4786N603o43K280k803N841q476j8051J311j8751n736
12478a8873k810K6750J4029p516q168J2663L9241J3679j777l3637n246r206J3315
12465C2444L2153L247M551J4620j6541j1866J8094J5164K5413O871l5551m1685
12453D6914k821N791J0186M1877K1162N938O455m71O126L384R204J4434P590k6691
12439A49078J279J0079R15j0843L5526M5571J1103k737l539M268Q743L5687P902
$$ plain form
12426 293032 269872 270527 295538 343870 403190 488984 612999 757700 934450 1146234 1328201
12415 1328201 1479252 1626083 1492969 1090540 780285 587970 473245 373137 316506 307282
12405 307282 278177 219739 186566 178468 201550 190912 180687 173219 159199 157406 150847 143878
12393 143878 173381 170578 154467 150009 138739 123336 103013 83521 92489 87928 56861 75122
12381 75122 95865 90010 79302 74343 72766 66682 68777 63184 49496 30194 26282 35678 31390
12368 31390 21470 24542 50999 34624 3945 25567 69473 69198 48912 42202 34579 35433 34114
12355 34114 28716 25122 30055 17385 8908 298 -8755 -14552 -32376 -45836 -17199 -2326 10597
12342 10597 1256 -35554 -37170 -21089 -11673 465 7514 14027 25711 34473 28191 27580 33360 39707
$$ packed form
12426B93032k3160O55K5011M8332N9320Q5794J24015J44701J76750K11784J81967
12415A328201J51051J46831j33114m02429l10255j92315j14725j00108n6631r224
12405C07282k9105n8438l3173q098K3082j0638j0225p468j4020j793o559o969
12393A43878K9503k803j6111m458j1270j5403k0323j9492Q968m561l1067J8261
12381G5122K0743n855j0708m959j577o084K095n593j3688j9302l912R396m288
12368C1390r920L072K6457j6375l0679K1622M3906k75k0286o710p623Q54j319
12355C4114n398l594M933j2670q477q610r053n797j7824j3460K8637J4873J2923
12342A0597r341l6810j616J6081R416J2138P049O513J1684Q762o282o11N780O347
$$ plain form
12328 39707 51499 81908 49740 14440 17304 22668 29601 32300 31296 34781 20195 5128 7556
12315 7556 1503 14486 3274 -3527 -19640 -14370 8928 22193 19705 -3593 7499 938 -47471
12302 -47471 -55650 -46324 -31592 -6248 5766 15894 33954 41183 48553 32284 8808 2639 18020
12289 18020 -17417 -15760 11559 37008 23676 -14714 -17332 -7015 18117 20467 33076 58608
12277 58608 61347 55993 50451 29860 16029 18691 17982 19468 20363 23308 25249 28829 29434 48600
12263 48600 37393 20090 35283 32370 32602 25006 21592 11476 10694 7077 -3626 736 4097 13560
12249 13560 54237 46325 22821 34446 37096 57323 38808 26295 49038 55102 55453 36605 10032
12236 10032 -14464 -25178 -31979 -53520 -55443 -20007 -17090 -18026 -7344 -10394 -28352 -30283 -17405
$$ packed form
12328C9707J1792L0409l2168l5300K864N364O933K699j004L485j4586j5067K428
12315G556o053J2983j1212o801j6113N270K3298J3265k488k3298J1092o561m8409
12302d7471q179R326J4732K5344J2014J0128J8060P229P370j6269k3476o169J5381
12289A8020l5437J657K7319K5449j3332l8390k618J0317K5132K350J2609K5532
12277E8608K739n354n542k0591j3831K662p09J486Q95K945J941L580O05J9166
12263D8600j1207j7303J5193k913K32p596l414j0116p82l617j0703M362L361R463
12249A3560M0677p912k3504J1625K650K0227j8515j2513K2743O064L51j8848k6573
12236A0032k4496j0714o801k1541j923L5436K917r36J0682l050j7958j931J2878
$$ plain form
12223 -17405 4385 19652 23783 9184 -15036 -18519 -19298 -12230 3266 -1737 7183 27618 22921
12210 22921 14323 11436 21792 12446 14973 5755 5923 2236 18742 24990 4971 9013 5343 31794
12196 31794 39469 52825 56162 41752 33918 51383 57776 58153 23848 7971 41994 39547 40447
12183 40447 52525 54340 66761 52211 35730 72594 95423 95503 124906 127805 125136 128263 140230
12170 140230 120861 93197 66142 99489 133709 114063 113526 142027 160213 162301 142025 147842
12158 147842 164930 178305 168200 160346 141512 140744 189516 212487 237650 277204 281686 294801
12146 294801 288465 299759 323189 329321 321342 327310 359694 386467 433108 460787 474829 531696
12134 531696 591702 698456 872439 1144502 1469668 1845871 2219401 2545276 2884901 2768460
$$ packed form
12223a7405K1790J5267M131j4599k4220l483p79P068J5496n003Q920K0435m697
12210B2921q598k887J0356r346K527r218J68l687J6506O248k0019M042l670K6451
12196C1794P675J3356L337j4410p834J7465O393L77l4305j5877L4023k447R00
12183D0447J2078J815J2421j4550j6481L6864K2829Q0K9403K899k669L127J1967
12170A40230j9369k7664k7055L3347L4220j9646n37K8501J8186K088k0276N817
12158A47842J7088J3375j0105p854j8834p68M8772K2971K5163L9554M482J3115
12146B94801o336J1294K3430O132p979N968L2384K6773M6641K7679J4042N6867
12134E31696O0006J06754J73983K72063L25166L76203L73530L25875L39625j16441
$$ plain form
12124 2768460 1987048 1362297 1000436 767897 620534 522300 436783 385650 369560 344303
12114 344303 322142 300118 273601 266669 251682 217815 202646 204446 219467 233870 239744 217536
12102 217536 209753 204592 182168 145003 139028 118453 118439 125942 109336 79982 53884 47184 40068
12089 40068 51214 46716 62160 66145 70067 46628 46138 47047 53431 56058 71206 29457 15999
12076 15999 28975 37594 58214 48459 49593 50648 52062 70276 68703 37224 8325 -1572 2460
12063 2460 18849 45600 36826 16839 -5334 -17507 -22977 -8220 5456 -29919 -41819 -48197
12051 -48197 -48017 -30430 -53 -2913 -25734 1116 32921 31108 10202 -24353 -14602 -5105 -7345
12038 -7345 -1582 16237 -3635 3291 11937 7264 -4217 -1453 10350 30761 36219 -299 -38339
$$ packed form
12124B768460p81412o24751l61861k32539j47363r8234q5517n1133j6090k5257
12114C44303k2161k2024k6517o932j4987l3867j5169J800J5021J4403N874k2208
12102B17536p783n161k2424l7165n975k0575j4P503j6606k9354k6098o700p116
12089D0068J1146m498J5444L985L922k3439m90R09O384K627J5148m1749j3458
12076A5999J2976Q619K0620r755J134J055J414J8214j573l1479k8899r897M032
12063B460J6389K6751q774j9987k2173j2173n470J4757J3676l5375j1900o378
12051d8197J80J7587L0377k860k2821K6850L1805j813k0906l4555R751R497k240
12038g345N763J7819j9872O926Q646m673j1481K764J1803K0411N458l6518l8040
$$ plain form
12025 -38339 -31268 -17680 -14856 -13656 -19541 -24601 -22222 -21576 -40984 -30948 -23480 -6851 12495
12012 12495 -11576 -6754 11852 -7404 -26281 -11746 10158 26073 15823 -22105 -24636 -21640
12000 -21640 -7023 10741 15163 16778 44973 53883 23689 28374 7641 -2440 27540 36429 45807
11987 45807 26429 27016 20884 22733 13475 2489 2337 4205 -22723 -7317 -25689 -39262 -10561
11974 -10561 -7390 -11451 -2280 24367 18406 -3071 -2302 8185 22730 28358 5784 11526 15034
11961 15034 -17722 -18430 -18131 -15047 -28985 -45275 -43864 -33024 1037 9256 -7960 17273 26030
11948 26030 12795 -6489 -33062 -29213 -5641 18767 29122 33473 19307 -14034 -27671 3958
11936 3958 34276 30481 34920 30978 29158 24305 30272 28700 16982 10845 -3070 6781 35601 27123
$$ packed form
12025c8339P071J3588K824J200n885n060K379O46j9408J0036P468J6629J9346
12012A2495k4071M822J8606j9256j8877J4535K1904J5915j0250l7928k531K996
12000b1640J4617J7764M422J615K8195Q910l0194M685k0733j0081K9980Q889R378
11987D5807j9378N87o132J849r258j0986j52J868k6928J5406j8372j3573K8701
11974a0561L171m061R171K6647n961k1477P69J0487J4545N628k2574N742L508
11961A5034l2756p08K99L084j3938j6290J411J0840L4061Q219j7216K5233Q757
11948B6030j3235j9284k6573L849K3572K4408J0355M351j4166l3341j3637L1629
11936C958L0318l795M439l942j820m853N967j572j1718o137j3915R851K8820q478
$$ plain form
11922 27123 5084 -30528 -27393 -6136 16818 20271 13799 -6691 5144 27657 20959 6781
11910 6781 27336 34620 43211 48478 12582 -5544 14729 38106 26682 16365 24383 43460 48747
11897 48747 39479 34447 23581 29941 30861 17111 6394 -12371 -21664 -557 22263 12166 -13007
11884 -13007 -20337 -6614 -4173 186 -10085 -21121 -18108 -17913 -21296 3419 24817 40688 26506
11871 26506 29740 20815 25107 32484 30964 37762 28694 43479 36328 11957 9639 1083 -12690 6113
11857 6113 18591 11211 1027 22108 19140 21137 17552 -11026 2128 11998 15858 9546 -4605
11844 -4605 -17650 -22400 -43161 -47373 -24417 -3603 -98 13258 43512 30583 2429 -21164
11832 -21164 -33661 -37766 -41130 -39207 -21158 -26777 -40389 -49440 -43598 -16139 6216 -12377 -20307
$$ packed form
11922B7123k2039l5612L135K1257K2954L453o472k0490J1835K2513o698j4178
11910F781K0555P284Q591N267l5896j8126K0273K3377j1424j0317Q018J9077N287
11897D8747r268n032j0866O360R20j3750j0717j8765r293K1107K2820j0097k5173
11884a3007p330J3723K441M359j0271j1036L013J95l383K4715K1398J5871j4182
11871B6506L234q925M292P377j520O798r068J4785p151k4371k318q556j3773J8803
11857F113J2478p380j0184K1081k968J997l585k8578J3154R870L860o312j4151
11844d605j3045m750k0761m212K2956K0814L505J3356L0254j2929k8154k3593
11832b1164j2497m105l364J923J8049n619j3612r051N842K7459K2355j8593p930
$$ plain form
11819 -20307 -43838 -22853 11681 18879 2763 27609 29738 25750 -2088 -41558 -40301 -32063 -12787
11806 -12787 -16305 31657 51724 23827 -1788 -25822 -7278 19240 15921 10366 -3245 1579
11794 1579 18406 9084 32037 52727 24199 19019 31891 2187 -35848 -50558 -30946 -2263
11782 -2263 -22718 -42581 -51212 -69240 -51577 -32410 -22860 -18250 -7857 -18875 -47838 -23750
11770 -23750 -4158 10770 15166 15192 25786 36086 60025 72711 40010 33542 39627 42660 37129
11757 37129 17528 -14524 -24924 -19485 -22994 -17328 754 5460 -14478 5349 21381 33274
11745 33274 63003 56190 36470 5362 -5716 11634 26905 37047 28901 19083 10475 -1265
11733 -1265 -11529 3095 780 10542 8496 12614 6537 -23964 -4993 10921 27588 32970 24528
$$ packed form
11819b0307k3531K0985L4534P198j6116K4846K129l988k7838l9470J257Q238J9276
11806a2787l518M7962K0067k7897k5615k4034J8544K6518l319n555j3611M824
11794A579J6827r322K2953K0690k8528n180J2872k9704l8035j4710J9612K8683
11782b263k0455j9863q631j8028J7663J9167R550M610J0393j1018k8963K4088
11770b3750J9592J4928M396K6J0594J0300K3939J2686l2701o468O085L033n531
11757C7129j9601l2052j0400N439l509N666J8082M706j9938J9827J6032J1893
11745C3274K9729o813j9720l1108j1078J7350J5271J0142q146r818q608j1740
11733a265j0264J4624k315R762k046M118o077l0501J8971J5914J6667N382q442
$$ plain form
11720 24528 10839 3427 -19344 -15128 -24935 -16163 6348 -13370 -16661 31763 65906 57929 45535
11707 45535 2757 -29833 -57502 -53454 -30546 -28930 -13053 -3069 15506 26056 7541 3656
11695 3656 2918 -2470 -19891 -16044 12673 42772 52542 47330 -3222 -24589 -19689 -9513 -21404
11682 -21404 9453 31034 33170 41396 55029 13267 -7847 -5260 21348 48660 70020 81018
11670 81018 70443 50413 37329 34003 20309 4195 -2580 8392 -2949 16122 42747 53325
11658 53325 46010 42721 49339 50185 30346 23273 24302 36911 44374 36362 45651 33035 42307 45272
11644 45272 27213 7757 -23018 -11810 -2675 -13681 -34861 -33782 -46274 -35824 -25381 -22889
11632 -22889 -16826 -10988 -13117 20078 44177 35910 26959 26402 19112 24985 4932 -5043 8378 15862
$$ packed form
11720B4528j3689p412k2771M216r807Q772K2511j9718l291M8424L4143p977j2394
11707D5535m2778l2590k7669M048K2908J616J5877R984J8575J0550j8515l885
11695C656p38n388j7421L847K8717L0099R770n212n0552k1367M900J0176j1891
11682b1404L0857K1581K136Q226J3633m1762k1114K587K6608K7312K1360J0998
11670H1018j0575k0030j3084l326j3694j6114o775J0972j1341J9071K6625J0578
11658E3325p315l289O618Q46j9839p073J029J2609P463q012R289j2616R272K965
11644D5272j8059j9456l0775J1208R135j1006k1180J079j2492J0450J0443K492
11632b2889O063N838k129L3195K4099q267q951n57p290N873k0053r975J3421P484
$$ plain form
11618 15862 318 -1209 18716 50154 64186 28167 30420 22274 26352 39208 36778 41505 27385
11605 27385 -29693 -48157 -20601 32067 48889 45443 31430 31582 21144 16959 6324 2251 15552
11592 15552 57723 62000 54515 51465 54801 54499 56914 24357 3246 -2155 35920 53878 23696
11579 23696 -2336 8042 15204 -7215 -13465 1560 -4984 -4797 -9564 -1405 8739 3271 -14836
11566 -14836 -21797 -27558 -23837 -1299 19990 17205 2186 9189 -4952 -4513 -775 9325 19056
11553 19056 15296 21959 24476 46551 52958 36820 41065 39633 20977 23039 32332 21075 -3593
11540 -3593 -14348 309 11093 33804 30862 1700 -3799 12375 22783 21728 12655 29301 22608
11527 22608 38219 46760 44908 28910 3745 7167 1806 -1857 15971 35804 17651 -4192 -10466
$$ packed form
11618A5862j5544j527J9925L1438J4032l6019K253q146M078J2856k430M727j4120
11605B7385n7078j8464K7556N2668J6822l446j4013J52j0438m185j0635m073J3301
11592A5552M2171M277p485l050L336l02K415l2557k1111n401L8075J7958l0182
11579B3696k6032J0378P162k2419o250J5025o544J87m767Q159J0144n468j8107
11566a4836o961n761L721K2538K1289k785j5019P003j4141M39L738J0100R731
11553A9056l760O663K517K2075O407j6138M245j432j8656K062R293j1257k4668
11540c593j0755J4657J0784K2711k942k9162n499J6174J0408j055r073J6646o693
11527B2608J5611Q541j852j5998k5165L422n361l663J7828J9833j8153k1843o274
$$ plain form
11514 -10466 -5643 22243 38748 18868 23374 34316 54090 64359 58014 35901 38198 22949
11502 22949 10249 -2177 -6478 20312 23967 21437 22849 53722 50266 37800 33702 35491 20638
11489 20638 -3743 -9663 285 -28044 -34906 -36926 -34215 -49248 -36299 -557 7792 -20921 -18232
11476 -18232 672 19383 11730 682 5016 -9202 -6395 -141 25477 -6013 -27676 -9774
11464 -9774 8589 5793 20566 21222 18979 -14662 -5568 -5792 -5430 2717 -5411 -38594 -15227 22374
11450 22374 17122 35048 43441 43055 30615 14125 -7555 -13451 -28248 -3073 -5195 -16615 -29533
11437 -29533 -25008 -43230 -37215 -50051 -46948 -19689 6884 29565 25572 27672 14 -21105 -901
11424 -901 2647 -1443 18441 27313 52964 49835 50408 14729 4697 -14767 -18145 -22470 -35816 -24579
$$ packed form
11514a0466M823K7886J6505j9880M506J0942J9774J0269o345k2113K297j5249
11502B2949j2700j2426m301K6790L655k530J412L0873l456j2466m098J789j4853
11489B0638k4381n920R948k8329o862k020K711j5033J2949L5742Q349k8713K689
11476a8232J8904J8711p653j1048M334j4218K807O254K5618l1490k1663J7902
11464i774J8363k796J4773O56k243l3641R094k24L62Q147q128l3183K3367L7601
11450B2374n252J7926Q393l86j2440j6490k1680n896j4797K5175k122j1420j2918
11437b9533M525j8222O015j2836L103K7259K6573K2681l993K100k7658k1119K0204
11424i01L548m090J9884Q872K5651l129N73l5679j0032j9464l378m325j3346J1237
$$ plain form
11410 -24579 484 28005 30770 27989 55118 61152 47089 26320 17242 26764 50565 27533 17638
11397 17638 12155 -5188 -43596 -50192 -48000 -64590 -57009 -55489 -59596 -65809 -55180 -57291 -29571
11384 -29571 2519 4891 2086 1229 -10511 -38781 -41066 -4831 7520 10156 14637 31316 27622
11371 27622 24101 33385 20709 24209 29559 29685 41163 50931 27687 45703 70583 58367 25907
11358 25907 24334 31340 28747 26129 35010 27581 64468 77364 44507 4914 12370 24829 46760
11345 46760 38624 44918 25287 -6204 5374 30855 31011 35492 22039 16847 17963 23733 24577 9381
11331 9381 -26121 -13190 9641 1306 -13696 -22366 -11812 10487 15929 -13709 -16277 1069 -1806
11318 -1806 13097 5780 -17741 -20383 -9615 10825 24449 -4265 3291 -471 -2972 11330 365
$$ packed form
11410b4579K5063K7521K765k781K7129O034j4063k0769r078R522K3801k3032r895
11397A7638n483j7343l8408o596K192j6590P581J520m107o213J0629k111K7720
11384b9571L2090K372k805q57j1740k8270k285L6235J2351K636M481J6679l694
11371B7622l521R284j2676L500N350J26J1478R768k3244J8016K4880j2216l2460
11358B5907j573P006k593k618Q881p429L6887J2896l2857l9593P456J2459K1931
11345D6760q136O294j9631l1491J1578K5481J56M481j3453n192J116N770Q44j5196
11331I381l5502J2931K2831q335j5002q670J0554K2299N442k9638k568J7346k875
11318a806J4903p317k3521k642J0768K0440J3624k8714P556l762k501J4302j0965
$$ plain form
11305 365 -17259 -12828 -2400 -11517 -8312 -15726 18883 37852 17867 -18575 -7481 -168 8828
11292 8828 7781 173 -16388 -23085 -3543 43359 57909 65330 54724 15121 -798 19184 40246
11279 40246 47535 31072 32176 35099 17733 -13066 -4878 17032 7984 6486 33497 40431 29974
11266 29974 41105 47951 56952 63261 50082 -225 -7315 -522 5802 29846 52875 60884 64506
11253 64506 81338 47985 34947 30403 32099 11904 12911 30778 33537 20120 11021 -1230 -8860
11240 -8860 -5153 15105 17504 31200 41050 46261 46499 34675 31255 37609 26974 35598 47759 43860
11226 43860 34706 31870 1139 -23086 -12060 -610 -4678 10849 29476 6337 8668 30248
11214 30248 46241 58418 48587 37291 43659 39307 33731 23786 37786 45333 53520 66887 45328
$$ packed form
11305C65j7624M431J0428r117L205p414L4609J8969j9985l6442J1094P313Q996
11292H828j047p608j6561o697J9542M6902J4550P421j0606l9603j5919J9982K1062
11279D0246P289j6463J104K923j7366l0799Q188K1910r048j498K7011O934j0457
11266B9974J1131O846R001O309j3179n0307p090O793O324K4044K3029Q009L622
11253F4506J6832l3353j3038m544J696k0195J007J7867K759j3417r099j2251p630
11240h860L707K0258K399J3696R850N211K38j1824l420O354j0635Q624J2161l899
11226D3860r154k836l0731k4225J1026J1450m068J5527J8627k3139K331K1580
11214C0248J5993J2177r831j1296O368m352n576r945J4000P547Q187J3367k1559
$$ plain form
11201 45328 32295 31603 -10038 -26236 14771 31139 53408 72061 64757 53761 31780 11830
11189 11830 18122 21015 5870 -1893 3735 9009 24139 22881 29399 39819 41837 31859 46901
11176 46901 56837 46238 36967 30404 53722 86879 92627 67703 5995 26588 62868 38315
11164 38315 21127 32302 25795 23748 32396 28152 32391 23408 10349 23773 38535 37162 12282
11151 12282 3516 4510 26317 21972 15628 11111 20593 -3501 -1507 15805 21118 31456 16409
11138 16409 54983 84760 72659 35165 10693 9565 17425 27796 26555 39580 20813 29136
11126 29136 36201 16355 1926 20861 61102 62889 22531 9965 34281 32639 23004 8615
11114 8615 -13021 -6756 5125 14803 21031 15115 8497 6844 5733 12265 35134 41536 33189 11405
$$ packed form
11201D5328j3033o92m1641j6198M1007J6368K2269J8653p304j0996k1981j9950
11189A1830O292K893j5145p763N628N274J5130j258O518J0420K018r978J5042
11176D6901R936j0599r271o563K3318L3157N748k4924o1708K0593L6280k4553
11164C8315j7188J1175o507k047Q648m244M239q983j3059J3424J4762j373k4880
11151A2282q766R94K1807m345o344m517R482k4094J994J7312N313J0338j5047
11138A6409L8574K9777j2101l7494k4472j128P860J0371j241J3025j8767Q323
11126B9136P065j9846j4429J8935M0241J787m0358j2566K4316j642r635j4389
11114H615k1636O265J1881R678O228n916o618j653j111O532K2869O402q347k1784
$$ plain form
11100 11405 -12267 -27514 -3485 2744 29589 55250 62755 76923 67567 43825 22140 14009
11088 14009 -970 -24354 -5382 166 19678 35935 19516 10262 3879 30658 33741 33727 29569
11075 29569 12077 23977 26026 -6274 5809 60184 62104 55109 58076 82555 73228 39044 39750
11062 39750 48888 36349 29822 15654 11828 6305 -13722 -2914 28618 49412 68699 73264 89192
11049 89192 102117 108076 79276 66785 81555 88733 45646 23948 -1665 1306 18334 33690
11037 33690 48634 37014 53519 71367 67819 74557 60527 63032 70324 76852 59670 30010 47186
11024 47186 53301 66861 88284 89662 65338 48505 39868 38662 58229 48496 44423 45087 41230
11011 41230 58761 62236 67545 83820 72068 75949 95242 76676 58036 58073 60961 47087 63618
$$ packed form
11100A1405k3672j5247K4029O229K6845K5661P505J4168r356k3742k1685q131
11088A4009j4979k3384J8972N548J9512J6257j6419r254o383K6779L083j4m158
11075B9569j7492J1900K049l2300J2083N4375J920o995K967K4479r327l4184P06
11062C9750R138j2539o527j4168l826n523k0027J0808L1532K0794J9287M565J5928
11049H9192J2925N959k8800j2491J4770P178m3087k1698k5613K971J7028J5356
11037C3690J4944j1620J6505J7848l548O738j4030K505P292O528j7182k9660J7176
11024D7186O115J3560K1423J378k4324j6833q637j206J9567r733m073O64l857
11011D1230J7531L475N309J6275j1752L881J9293j8566j8640L7K888j3874J6531
$$ plain form
10998 63618 73261 94024 98349 93097 114883 123546 122147 128410 133482 136744 153234 177924 194932
10985 194932 185181 182322 179161 213763 236823 228294 259440 261075 257780 255551 238527 251690 268221
10972 268221 276293 308660 295511 276780 295779 338423 390463 441017 510814 568360 697249
10961 697249 891464 1114839 1313874 1477050 1619192 1607700 1276925 911740 681107 536650
10951 536650 414074 390055 371672 328740 301877 283287 278056 268229 247403 217667 198946 184041
10939 184041 190117 180363 159041 154304 154341 180439 195618 183376 170931 166752 112128 87151 72003
10926 72003 55810 67917 90875 113725 91087 69531 80163 96731 81987 101820 112448 115300
10914 115300 96319 70558 61459 72141 91157 92670 81217 50645 46765 72302 96276 102548
$$ packed form
10998F3618R643K0763M325n252K1786Q663j399O263N072L262J6490K4690J7008
10985A94932r751k859l161L4602K3060q529L1146J635l295k229j7024J3163J6531
10972B68221Q072L2367j3149j8731J8999M2644N2040N0554O9797N7546J28889
10961F97249J94215K23375J99035J63176J42142j1492l30775l65185k30633j44457
10951E36650j22576k4019j8383m2932k6863j8590n231r827k0826k9736j8721j4905
10939A84041O076r754k1322m737L7K6098J5179j2242j2445m179n4624k4977j5148
10926G2003j6193J2107K2958K2850k2638k1556J0632J6568j4744J9833J0628K852
10914A15300j8981k5761r099J0682J9016J513j1453l0572l880K5537K3974O272
$$ plain form
10902 102548 101794 107924 120380 141155 115171 82099 66966 52172 51659 65783 46027 41359 47371
10889 47371 60071 101354 109882 87171 103941 125502 118576 123293 117975 92567 69141 66310 98544
10876 98544 88820 54109 29362 43775 63606 70767 77084 62587 66287 77269 94274 81764
10864 81764 66481 66995 72004 30355 36979 63326 72802 80732 119638 176968 233483 290615 362202
10851 362202 431327 430006 349761 281256 236013 247581 249231 234935 214045 196670 172359 154565
10839 154565 146817 144230 138105 137551 145839 166623 184489 181922 168290 176379 168148 162985 166730 169271
10825 169271 171141 167658 176402 187285 195520 205894 222798 234970 246067 246237 250485 240338 216333
10812 216333 216471 212033 206024 213881 226864 236251 219983 220330 262069 261237 253614 251417 267367 289009
$$ packed form
10902A02548p54O130J2456K0775k5984l3072j5133j4794n13J4124j9756m668O012
10889D7371J2700M1283Q528k2711J6770K1561o926M717n318k5408k3426k831L2234
10876I8544r724l4711k4747J4413J9831P161O317j4497L700J0982J7005j2510
10864H1764j5283N14N009m1649O624K6347R476P930L8906N7330N6515N7132P1587
10851C62202O9125j321q0245o8505m5243J1568J650j4296k0890j7375k4311j7794
10839A54565p748k587o125n54Q288K0784J7866k567j3632Q089q231n163L745K541
10825A69271J870l483Q744J0883Q235J0374J6904J2172J1097J70M248j0147k4005
10812B16333J38m438o009P857J2983R387j6268L47M1739q32p623k197J5950K1642
$$ plain form
10798 289009 303895 295161 240772 235030 249478 232860 198004 170801 156402 189214 183487 166935
10786 166935 176257 173813 166696 157684 149783 164054 180145 155336 114258 119811 169142 170504 136592
10773 136592 133610 139638 131637 145122 153947 153726 146249 157388 141879 118286 138421 160534 173810
10760 173810 136858 88407 85454 127498 164599 156351 119402 103124 116762 141522 148392 153830
10748 153830 151336 167521 175182 176600 176483 180531 206042 185298 156272 127512 122618 138966 160399
10735 160399 205568 209817 205134 196941 202540 192840 171194 146980 147759 156614 161083 146218 137569
10722 137569 125265 122491 103187 83077 101414 106495 98401 92678 69187 114577 166339 184814
10710 184814 192057 235923 232090 214050 216504 201787 177821 181299 195388 205423 211008 233829
$$ packed form
10798B89009J4886q734n4389n742J4448j6618l4856k7203j4399L2812n727j6552
10786A66935R322k444p117r012p901J4271J6091k4809m1078N553M9331J362l3912
10773A36592k982O028q001J3485Q825k21p477J1139j5509k3593K0135K2113J3276
10760A73810l6952m8451k953M2044L7101q248l6949j6278J3638K4760O870N438
10748A53830k494J6185P661J418j17M048K5511k0744k9026k8760m894J6348K1433
10735A60399M5169M249m683q193N599r700k1646k4214P79Q855M469j4865q649
10722A37569j2304k774j9304k0110J8337N081q094n723k3491M5390N1762J8475
10710A84814P243M3866l833j8040K454j4717k3966L478J4089J0035N585K2821
$$ plain form
10698 233829 268143 295064 305071 338778 351715 378435 395730 394754 428711 466732 466735 476615 514561
10685 514561 582443 651666 738293 810378 870379 910670 919339 925889 885495 828406 743054 646491
10673 646491 606869 630889 600696 530827 493479 470386 510474 539854 524994 527044 531483 547050
10661 547050 614450 657904 658647 664830 676888 700516 731120 808550 863414 899350 925753 951995
10649 951995 996324 1023783 1054811 1082260 1126661 1209344 1257585 1290226 1338727 1404286 1464656
10638 1464656 1545595 1634370 1719332 1816961 1908833 1993854 2070047 2127501 2183298 2266877 2329803
10627 2329803 2410345 2476192 2564530 2691413 2823601 2956708 3076274 3223546 3372167 3512281
10617 3512281 3645799 3795619 3964448 4102146 4276652 4438876 4607549 4812606 5015068
$$ packed form
10698B33829L4314K6921J0007L3707J2937K6720J7295r76L3957L8021LR880L7946
10685E14561O7882O9223Q6627P2085O0001M0291Q669O550m0394n7089q5352r6563
10673F46491l9622K4020l0193o9869l7348k3093M0088K9380j4860K050M439J5567
10661E47050O7400M3454P43O183J2058K3628L0604P7430N4864L5936K6403K6242
10649I51995M4329K7459L1028K7449M4401Q2683M8241L2641M8501O5559O0370
10638A464656Q0939Q8775Q4962R7629R1872Q5021P6193N7454N5797Q3579O2926
10627B329803Q0542O5847Q8338J26883J32188J33107J19566J47272J48621J40114
10617C512281J33518J49820J68829J37698J74506J62224J68673K05057K02462
$$ plain form
10608 5015068 5215763 5478362 5718346 5961854 6189069 6425709 6712608 7004114 7328692
10599 7328692 7700106 8084907 8533269 9025200 9470723 9914908 10391327 10962680 11532538
10590 11532538 12142052 12776425 13417925 14048235 14659258 15299462 15924251 16499196 17008837
10581 17008837 17516576 18055251 18637158 19310499 20128615 21160940 22372666 23803401 25496736
10572 25496736 27381484 29410984 31502615 33549444 35367088 37334717 39522159 41671341
10564 41671341 43673431 45751919 47249408 47387053 47875194 49708207 52991193 57834570
10556 57834570 64806960 74955707 90769673 114553518 146235539 183815600 222923734
10549 222923734 256966233 289360140 307730018 258405462 181682645 128257937 96490403
$$ packed form
10608E015068K00695K62599K39984K43508K27215K36640K86899K91506L24578
10599G328692L71414L84801M48362M91931M45523M44185M76419N71353N69858
10590A1532538O09514O34373O41500O30310O11023O40204O24789N74945N09641
10581A7008837N07739N38675N81907O73341Q18116J032325J211726J430735J693335
10572B5496736J884748K029500K091631K046829J817644J967629K187442K149182
10564D1671341K002090K078488J497489J37645M88141J833013L282986M843377
10556E7834570O972390J0148747J5813966K3783845L1682021L7580061L9108134
10549B22923734L4042499L2393907J8369878m9324556p6722817n3424708l1767534
$$ plain form
10542 96490403 76962106 64140370 55138626 48399629 43246431 39170043 35871173 33220408
10534 33220408 31088814 29393812 27964696 26812785 25960942 25400038 25163704 25270357 25587433
10525 25587433 25851054 25609639 24683795 23102207 21232903 19476273 17914362 16545626
10517 16545626 15342744 14269862 13264162 12305844 11450370 10681898 9965955 9281134 8682084
10508 8682084 8154845 7692912 7256369 6812687 6390556 6007874 5680276 5354185 5053284
10499 5053284 4781654 4542650 4356790 4189500 4020242 3805167 3605286 3431719 3269196
10490 3269196 3094205 2946277 2798948 2659974 2544116 2423475 2284243 2192624 2085478 1970535
10480 1970535 1867779 1791217 1706115 1627540 1576812 1534069 1472448 1437548 1363846 1303256 1239802
$$ packed form
10542I6490403j9528297j2821736r001744o738997n153198m076388l298870k650765
10534C3220408k131594j695002j429116j151911q51843n60904k36334J06653L17076
10525B5587433K63621k41415r25844j581588j869304j756630j561911j368736
10517A6545626j202882j072882j005700r58318q55474p68472p15943o84821n99050
10508H682084n27239m61933m36543m43682m22131l82682l27598l26091l00901
10499E053284k71630k39004j85860j67290j69258k15075j99881j73567j62523
10490C269196j74991j47928j47329j38974j15858j20641j39232r1619j07146j14943
10480A970535j02756p6562q5102p8575n0728m2743o1621l4900p3702o0590o3454
$$ plain form
10469 1239802 1186994 1141257 1064753 967855 911870 876389 846568 826572 779412 763983 780618
10458 780618 752279 709866 676070 653014 657401 649888 629826 607444 560405 510992 479416 471647
10446 471647 456762 456660 465755 415776 383106 390220 381235 385007 381804 354391 355518 370736 394530
10433 394530 420526 425755 458891 527483 547840 540649 560471 607239 624363 613678 586920 605631
10421 605631 627830 587731 479521 424775 416483 402230 313392 273669 243348 207298 195760
10410 195760 208790 207503 198372 165568 146864 160253 184231 207080 241335 248617 254494 264030
10398 264030 290036 284052 285535 312166 359605 385361 356004 361984 394052 392436 347434 329563
10386 329563 332919 321604 339730 337784 362996 364845 370319 375067 386662 376228 349652 317817
$$ packed form
10469A239802n2808m5737p6504r6898n5985l5481k9821j9996m7160j5429J6635
10458G80618k8339m2413l3796k3056M387p513k0062k2382m7039m9413l1576p769
10446D71647j4885j02R095m9979l2670P114q985L772l203k7413J127J5218K3794
10433C94530K5996N229L3136O8592K0357p191J9822M6768J7124j0685k6758J8711
10421F05631K2199m0099j08210n4746q292j4253q8838l9723l0321l6050j1538
10410A95760J3030j287r131l2804j8704J3389K3978K2849L4255P282N877R536
10398B64030K6006n984J483K6631M7439K5756k9357N980L2068j616m5002j7871
10386C29563L356j1315J8126j946K5212J849N474M748J1595j0434k6576l1835
$$ plain form
10374 317817 295851 299786 329996 326027 297911 284068 273936 275443 290148 269692 240701 227417
10362 227417 232168 240232 271349 304578 299429 258190 261239 231650 206959 212403 221449 242782 252373
10349 252373 259340 237836 206039 189328 189996 218065 232793 238741 241067 240521 218450 190822 189051
10336 189051 171243 137819 142809 149981 138743 149198 156661 136760 136304 145097 143222 122661 100288
10323 100288 64285 58166 65539 92614 114122 133040 137549 104898 108262 101376 112127 107939 112463
10310 112463 118667 123385 130080 111468 126265 156473 159445 133664 107569 94382 88824 99774
10298 99774 111483 129575 119761 102381 96811 90801 70348 39730 58682 65322 60836 45622 45821
10285 45821 44695 43593 46540 63051 74510 89142 74663 67213 61410 45135 41911 35666 21650
$$ packed form
10374C17817k1966L935L0210l969k8116j3843j0132J507J4705k0456k8991j3284
10362B27417M751Q064L1117L3229n149m1239L049k9589k4691N444R046K1333R591
10349B52373O967k1504l1797j6711O68K8069J4728N948K326n46k2071k7628j771
10336A89051j7808l3424M990P172j1238J0455P463j9901m56Q793j875k0561k2373
10323A00288l6003o119P373K7075K1508J8918M509l2651L364o886J0751m188M524
10310A12463O204M718O695j8612J4797L0208K972k5781k6095j3187n558J0950
10298I9774J1709J8092r814j7380n570o010k0453l0618J8952O640m486j5214J99
10285D5821j126j102K947J6511J1459J4632j4479p450n803j6275l224o245j4016
$$ plain form
10272 21650 17764 27847 32751 48213 63750 36962 27033 35006 71203 99521 79789 37548
10260 37548 43298 65409 60706 71875 77482 95525 70849 54356 59238 35643 -3077 -9412 -25351
10247 -25351 -44030 -47289 -87379 -113138 -75452 -16963 31981 86861 120648 127899 131495 120815
10235 120815 123534 136711 168361 184118 192641 209989 194722 160850 150427 137745 155797 200118
10223 200118 244211 231233 193454 158403 154811 167731 152134 162492 165659 158790 174066 173938
10211 173938 153840 140979 127867 138020 129738 149536 160750 179588 148630 141156 158025 148522
10199 148522 179714 207845 173414 152565 146429 153274 138103 122369 96142 110759 125535 122824
10187 122824 116559 108253 106387 95206 109684 126071 127560 141498 143098 169585 191300 225218
$$ packed form
10272B1650l886J0083M904J5462J5537k6788r929P973L6197K8318j9732m2241
10260C7548N750K2111m703J1169N607J8043k4676j6493M882k3595l8720o335j5939
10247b5351j8679l259m0090k5759L7686N8489M8944N4880L3787P251L596j0680
10235A20815K719J3177L1650J5757Q523J7348j5267l3872j0423j2682J8052M4321
10223B00118M4093j2978l7779l5051l592J2920j5597J0358L167o869J5276j28
10211A73938k0098j2861j3112J0153q282J9798J1214J8838l0958p474J6869r503
10199A48522L1192K8131l4431k0849o136O845j5171j5734k6227J4617J4776k711
10187A22824o265q306j866j1181J4478J6387J489J3938J600K6487K1715L3918
$$ plain form
10175 225218 226932 192768 161276 152433 134028 118334 125205 181988 205795 224987 219591 201500
10163 201500 196347 203765 248534 260485 249431 205996 190297 227641 239236 263031 262705 272496
10151 272496 311185 347253 373383 379926 360707 356036 350357 348628 384504 431087 464085 524934
10139 524934 635675 748877 891760 1096435 1290667 1488265 1661738 1730240 1503086 1125813
10129 1125813 841961 640665 527330 444199 378189 352263 354690 327004 283707 271054 268136
10118 268136 271739 252392 235852 237200 237048 233326 246795 241088 252287 270777 280883 282933 272405
10105 272405 276733 260488 222209 195083 196604 191913 199910 178873 154906 151310 158795 178295 190920
10092 190920 178230 162340 144097 139364 145885 138714 134852 127016 127908 122928 135641 146014 155981
$$ packed form
10175B25218J714l4164l1492q843j8405j5694O871N6783K3807J9192n396j8091
10163B01500n153P418M4769J1951j1054m3435j5699L7344J1595K3795l26R791
10151B72496L8689L6068K6130O543j9219m671n679j729L5876M6583L2998O0849
10139E24934J10741J13202J42883K04675J94232J97598J73473O8502k27154l77273
10129A125813k83852k01296j13335q3131o6010k5926K427k7686m3297j2653k918
10118B68136L603j9347j6540J348j52l722J3469n707J1199J8490J0106K050j0528
10105B72405M328j6245l8279k7126J521m691P997k1037k3967l596P485J9500J2625
10092A90920j2690j5890j8243m733O521p171l862p836Q92m980J2713J0373R967
$$ plain form
10079 155981 138526 148351 172810 163726 154376 153989 162821 132394 131739 147612 153372 131714 117660
10066 117660 132191 113442 109581 114875 103761 90630 90108 108687 120083 141702 133663 107772
10054 107772 108936 91470 97684 121672 129506 132299 135636 120853 103870 122758 141665 130673
10042 130673 127502 164317 157300 144837 150293 172535 154759 161292 159091 133232 111952 114341 111637
10029 111637 114043 106746 112074 134558 172528 170107 157780 168137 180987 199704 210021 209139 189743
10016 189743 143190 142099 147157 115412 98498 119696 155171 154473 127312 116173 98680 110210
10004 110210 135777 129768 131947 126775 125684 157056 181777 163451 134332 95447 109587 118514
9992 118514 114932 133079 148165 159399 171705 153997 151082 141960 127545 147824 177036 168325
$$ packed form
10079A55981j7455R825K4459r084r350l87Q832l0427o55J5873N760k1658j4054
10066A17660J4531j8749l861N294j1114j3131n22J8579J1396K1619q039k5891
10054A07772J164j7466O214K3988P834K793L337j4783j6983J8888J8907j0992
10042A30673l171L6815p017j2463N456K2242j7776O533k201k5859k1280K389k704
10029A11637K406p297N328K2484L7970k421j2327J0357J2850J8717J0317q82j9396
10016A89743m6553j091N058l1745j6914K1198L5475o98k7161j1139j7493J1530
10004A10210K5567o009K179n172j091L1372K4721j8326k9119l8885J4140Q927
9992A18514l582J8147J5086J1234J2306j7708k915r122j4415K0279K9212q711
$$ plain form
9980 168325 143724 141461 155372 145275 145984 140052 124235 125284 131337 126343 115539 118750 116637
9967 116637 144189 164927 159630 139724 148368 161373 145200 136157 145527 137013 144191 141627 135629
9954 135629 129075 112264 124955 135022 139972 164305 175935 190460 197486 168569 166974 189414
9942 189414 187999 194962 201968 188720 163834 164921 175502 164511 165973 165998 152563 165747 148992
9929 148992 140458 163656 147807 138773 141656 186555 213333 182385 162420 176557 179539 161143
9917 161143 160425 150687 135158 155949 162007 169944 165589 175018 178103 194707 194725 192280 174546 174596 186927
9902 186927 201248 202817 202205 193877 184527 177077 162783 158660 149362 170963 147149 142393 145090 145721
9888 145721 144307 179411 186979 162075 160341 158241 171066 175745 184322 189118 199044 207161 208189 214097
$$ packed form
9980A68325k4601k263J3911j0097P09n932j5817J049O053m994j0804L211k113
9967A16637K7552K0738n297j9906Q644J3005j6173r043R370q514P178k564n998
9954A35629o554j6811J2691J0067M950K4333J1630J4525P026k8917j595K2440
9942A89414j415O963P006j3248k4886J087J0581j0991J462K5j3435J3184j6755
9929A48992q534K3198j5849r034K883M4899K6778l0948j9965J4137K982j8396
9917A61143p18r738j5529K0791O058P937m355R429L085J6604J8k445j7734N0J2331
9902A86927J4321J569o12q328r350p450j4294m123r298K1601k3814m756K697O31
9888A45721j414L5104P568k4904j734k100J2825M679Q577M796R926Q117J028N908
$$ plain form
9874 214097 206914 214170 240085 240436 242222 232382 234536 226615 210036 194731 225788 227653 228029 227912
9860 227912 232896 223030 237213 255748 253682 248122 268123 284826 266911 225447 210918 212484 196958
9847 196958 206517 209857 217988 250293 263875 261200 267990 267917 251123 243172 229213 207322 193267
9834 193267 206663 216971 229950 250650 232143 220744 240566 255131 262000 265400 237247 243025
9822 243025 270696 271768 259006 237993 235352 234324 255114 252869 220742 219374 239357 250500 242103
9809 242103 256231 249180 223113 227463 252783 270278 292687 298195 305484 282325 279906 278343 269341
9796 269341 260869 259256 269045 271698 304976 317363 285115 279650 300896 300384 306520 295322 286705
9783 286705 287539 288737 282306 275182 269936 275864 277018 310591 323847 310326 293411 298988 290676 308090
$$ packed form
9874B14097p183P256K5915L51J786r840K154p921j6579j5305L1057J865L76j17
9860B27912M984r866J4183J8535k066n560K0001J6703j7915m1464j4529J566j5526
9847A96958R559L340Q131L2305J3582k675O790p3j6794p951j3959k1891j4055
9834A93267J3396J0308J2979K0700j8507j1399J9822J4565O869L400k8153N778
9822B43025K7671J072j2762k1013k641j028K0790k245l2127j368J9983J1143q397
9809B42103J4128p051k6067M350K5320J7495K2409N508P289k3159k419j563r002
9796B69341q472j613R789K653L3278J2387l2248n465K1246n12O136j1198q617
9783B86705Q34J198o431p124n246N928J154L3573J3256j3521j6915N577q312J7414
$$ plain form
9769 308090 324813 313005 323311 323843 320102 335761 327799 291114 293787 326976 341671 339934 310092
9756 310092 315576 329062 327588 317672 326721 300418 314333 333486 346615 308852 310496 325009 339937
9743 339937 347782 320058 314783 337156 359314 338067 307810 298725 320914 332528 319334 293942
9731 293942 314994 347158 326039 333723 326163 307886 321967 311037 317273 352215 353921 327569
9719 327569 340470 363193 380144 350815 331599 337152 359707 360201 384878 397856 369927 367325
9707 367325 370966 372623 392893 432982 461071 477291 440350 405064 395639 387010 386011 374313 401679
9694 401679 417981 425618 418271 424465 441341 450613 460451 466743 465038 445834 433166 413627 428092
9681 428092 451884 460236 467402 475305 469391 462622 457422 435975 438621 424615 428593 423347 443647
$$ packed form
9769C08090J6723j1808J0306N32l741J5659p962l6685K673L3189J4695j737k9842
9756C10092N484J3486j474r916R049k6303J3915J9153J3129l7763J644J4513J4928
9743C39937P845k7724n275K2373K2158k1247l0257r085K2189J1614j3194k5392
9731B93942K1052L2164k1119P684p560j8277J4081j0930O236L4942J706k6352
9719C27569J2901K2723J6951k9329j9216N553K2555M94K4677J2978k7929k602
9707C67325L641J657K0270M0089K8089J6220l6941l5286r425q629r99j1698K7366
9694D01679J6302P637p347O194J6876R272R838O292j705j9204j2668j9539J4465
9681D28092K3792Q352P166P903n914o769n200k1447K646j4006L978n246K0300
$$ plain form
9668 443647 479711 488969 464134 447670 461181 457510 475464 489006 502111 486739 497937 518638
9656 518638 490172 482248 473568 490169 519350 508803 467265 466660 493644 523551 531777 526065 516460
9643 516460 531324 554501 535107 556512 544753 522966 537230 542055 541679 581093 569720 545142
9631 545142 555218 555065 557238 583451 584159 592262 580314 571196 575668 557612 556349 560361 579383 586931
9617 586931 601470 619394 606315 604468 635761 652310 669967 650911 635205 605978 610098 609745
9605 609745 602889 601915 622991 620553 645176 648354 665761 669295 673434 660876 668682 684054 682887
9592 682887 667622 677383 660193 638736 644103 632275 652483 688956 700170 701410 689536 679706
9580 679706 697101 719998 733236 732415 723908 714422 733069 764369 765030 774024 772077 754228 753431 762006
$$ packed form
9668D43647L6064R258k4835j6464J3511l671J7954J3542J3105j5372J1198K0701
9656E18638k8466p924q680J6601K9181j0547m1538o05K6984K9907Q226n712r605
9643E16460J4864K3177j9394K1405j1759k1787J4264M825l76L9414j1373k4578
9631E45142J0076j53K173K6213P08Q103j1948r118M472j8056j263M012J9022P548
9617E86931J4539J7924j3079j847L1293J6549J7657j9056j5706k9227M120l53
9605F09745o856r74K1076k438K4623L178J7407L534M139j2558P806J5372j167
9592F82887j5265R761j7190k1457N367j1828K0208L6473J1214J240j1874r830
9580F79706J7395K2897J3238q21q507r486J8647L1300O61Q994j947j7849p97Q575
$$ plain form
9566 762006 745611 723290 731852 746005 762627 752360 744983 772337 797806 811434 805016 837663
9554 837663 837958 799692 801988 807716 817084 835487 843962 841984 823111 840822 847887 860386 872240
9541 872240 877687 858788 847001 844830 857723 853887 866160 870386 853343 851160 848042 873122 891758
9528 891758 884721 902571 913600 899557 929355 963430 950956 935329 924697 914349 925957 944796
9516 944796 927849 905099 909030 925319 944344 934691 929892 962032 979591 947427 954714 954719 966944
9503 966944 960428 953396 944078 946669 946663 953496 965650 990896 965626 952043 935509 947405 976210
9490 976210 997375 999861 975679 947549 970039 1007869 1015265 1004958 986820 982068 983421 1004623
9478 1004623 1026772 1006171 1028575 1046643 1044155 1054788 1048429 1056439 1079007 1087562 1066273 1074796
$$ packed form
9566G62006j6395k2321Q562J4153J6622j0267p377K7354K5469J3628o418L2647
9554H37663K95l8266K296N728R368J8403Q475j978j8873J7711P065J2499J1854
9541H72240N447j8899j1787k171J2893l836J2273M226j7043k183l118K5080J8636
9528H91758p037J7850J1029j4043K9798L4075j2474j5627j0632j0348J1608J8839
9516I44796j6947k2750L931J6289J9025r653m799L2140J7559l2164P287NJ2225
9503I66944o516p032r318K591oO833J2154K5246k5270j3583j6534J1896K8805
9490I76210K1165K486k4182k8130K2490L7830P396j0307j8138m752J353K1202
9478A004623K2149k0601K2404J8068k488J0633o359Q010K2568Q555k1289Q523
$$ plain form
9466 1074796 1077485 1059445 1072895 1071187 1074500 1076234 1048868 1065299 1090301 1062797 1027405 1034749
9454 1034749 1039321 1041224 1073937 1094242 1100273 1095098 1073657 1064112 1053551 1049533 1041301 1030993 1026388
9441 1026388 1043179 1051722 1062987 1071805 1078782 1094118 1095744 1084800 1088463 1053918 1043909 1052954 1047953
9428 1047953 1083504 1098170 1061772 1058665 1055334 1063129 1078779 1044464 1040484 1036468 1032993 1050879 1091202
9415 1091202 1098577 1098082 1083667 1058174 1033550 1043366 1042747 1047532 1078327 1075391 1067087 1080352 1090291
9402 1090291 1083765 1063248 1083728 1101580 1084063 1070516 1054461 1048335 1027512 1001073 990219 1030300
9390 1030300 1042192 1014241 1017580 1007092 1002866 1004626 1000521 1014387 1017476 1017280 984450 980032 985263
9377 985263 997111 1013095 981736 982689 991612 998113 1008695 1016534 988487 960917 975806 972550 974219
$$ packed form
9466A074796K689j8040J3450j708L313J734k7366J6431K5002k7504l5392P344
9454A034749M572J903L2713K0305O031n175k1441r545j0561m018q232j0308m605
9441A026388J6791Q543J1265Q818O977J5336J626j0944L663l4545j0009R045n001
9428A047953L5551J4666l6398l107l331P795J5650l4315l980m016l475J7886M0323
9415A091202P375m95j4415k5493k4624R816o19M785L0795k936q304J3265R939
9402A090291o526k0517K0480J7852j7517j3547j6055o126k0823k6439j0854M0081
9390A030300J1892k7951L339j0488m226J760m105J3866L089j96l2830m418N231
9377I85263J1848J5984l1359R53Q923O501J0582P839k8047k7570J4889l256J669
$$ plain form
9364 974219 965809 984242 998884 986423 988272 1001230 987926 962495 940391 939000 949850 951005
9352 951005 936604 941477 923303 900353 879366 892560 918061 949249 901664 873681 899490 895849
9340 895849 886835 891747 886183 865147 869755 880910 886832 860069 842651 841957 866350 882205 863707
9327 863707 868090 868434 844053 846955 865818 840881 814526 814675 823819 820660 804768 780278 793500
9314 793500 784527 777485 762951 756033 757662 796365 819837 809185 799008 805564 794886 782817 777349
9301 777349 768193 760634 769333 764432 764707 749513 737800 713625 679707 690020 693290 690504 702312
9288 702312 686322 695226 731941 742991 731317 704175 720976 738650 740872 711205 687178 669205
9276 669205 699016 691744 661234 668137 664396 649386 636083 648066 647965 632477 626372 615025 622992
$$ packed form
9364I74219q410J8433J4642j2461J849J2958j3304k5431k2104j391J0850J155
9352I51005j4401M873j8174k2950k0987J3194K5501L1188m7585k7983K5809l641
9340H95849r014M912n564k1036M608J1155N922k6763j7418o94K4393J5855j8498
9327H63707M383L44k4381K902J8863k4937k6355J49R144l159j5892k4490J3222
9314G93500q973p042j4534o918J629L8703K3472j0652j0177O556j0678j2069n468
9301G77349r156p559Q699m901K75j5194j1713k4175l3918J0313L270k786J1808
9288G02312j5990Q904L6715J1050j1674k7142J6801J7674K222k9667k4027j7973
9276F69205K9811p272l0510O903l741j5010j3303J1983j01j5488o105j1347P967
$$ plain form
9263 622992 642940 647700 643701 633085 635107 612053 610943 612336 641060 620240 578298 573842 593120
9250 593120 609606 595482 606764 598503 571103 555909 569115 563028 558232 538504 528052 520778
9238 520778 516008 533786 537080 506880 490360 516628 529477 527378 515010 513487 536533 514850
9226 514850 509172 509523 524422 530649 519384 531261 521063 486721 456603 448836 466372 451894 465243
9213 465243 475076 487323 503808 499940 494991 476939 464137 455601 464476 467919 452578 469644 463132
9200 463132 453075 459852 467580 449390 455189 478045 472898 451021 428737 429317 421858 399316 400041
9187 400041 418695 395727 384966 382304 380741 404870 408660 422332 432075 397982 377027 390161
9175 390161 412911 428599 411399 398328 402480 407198 408856 435013 411710 394928 402668 379216
$$ packed form
9263F22992J9948M760l999j0616K022k3054j110J393K8724k0820m1942m456J9278
9250E93120J6486j4124J1282q261k7400j5194J3206o087m796j9728j0452p274
9238E20778m770J7778L294l0200j6520K6268J2849k099j2368j523K3046k1683
9226E14850n678L51J4899O227j1265J1877j0198l4342l0118p767J7536j4478J3349
9213D65243R833J2247J6485l868m949j8052j2802q536Q875L443j5341J7066o512
9200D63132j0057O777P728j8190N799K2856n147k1877k2284N80p459k2542P25
9187D00041J8654k2968j0761k662j563K4129L790J3672R743l4093k0955J3134
9175C90161K2750J5688j7200j3071M152M718J658K6157k3303j6782P740k3452
$$ plain form
9163 379216 387059 387725 381244 333440 329148 377403 385752 365698 363948 350148 332164 344059 361551
9150 361551 365820 382604 399180 396729 352818 329414 338455 352652 368344 374653 377318 354951 354082
9137 354082 331950 353557 350282 346926 342114 342756 361912 356595 343049 323204 291856 253219 259085
9124 259085 271203 261989 274605 282391 267542 287157 287178 291926 292426 272059 277612 303791 331374
9111 331374 344105 320281 276966 277518 278874 290568 274235 283999 312117 302019 285892 273321
9099 273321 264124 300381 289211 271478 283811 257939 227193 237125 222244 215289 221672 227276 233326
9086 233326 238909 228645 259618 268938 264191 262710 242525 242348 287032 297374 272855 255066 277343
9073 277343 255492 224341 217343 238418 222721 218841 227294 222429 227805 248452 215337 207812 213996
$$ packed form
9163C79216P843O66o481m7804m292M8255Q349k0054j750j3800j7984J1895J7492
9150C61551M269J6784J6576k451m3911k3404R041J4197J5692O309K665k2367q69
9137C54082k2132K1607l275l356m812O42J9156n317j3546j9845l1348l8637N866
9124B59085J2118r214J2616P786j4849J9615K1M748N00k0367N553K6179K7583
9111C31374J2731k3824m3315N52J356J1694j6333R764K8118j0098j6127j2571
9099B73321r197L6257j1170j7733J2333k5872l0746R932j4881o955O383N604O050
9086B33326N583j0264L0973R320m747j481k0185j77M4684J0342k4519j7789K2277
9073B77343k1851l1151o998K1075j5697l880Q453m865N376K0647l3115p525O184
$$ plain form
9060 213996 214445 233598 253912 245369 237644 222323 216967 224763 217413 193751 196618 215184 222160
9047 222160 215918 204581 213870 222246 205970 205087 212673 233874 230409 239210 230438 236792 216911 201220
9033 201220 207198 218862 229988 248027 250044 219377 195219 189211 196348 202411 215125 217833 245119
9020 245119 258878 256284 231741 225700 222161 229269 234168 228756 209979 204278 222106 209533 214542
9007 214542 204031 195902 171906 155415 148339 146689 151287 188532 216472 231694 208271 173528
8995 173528 182275 181682 177805 200536 203363 212925 191975 158574 169426 180740 179977 173334 150346
8982 150346 159992 169042 182377 185874 188762 201780 199294 173841 143283 153328 179304 186107 182648
8969 182648 183547 170488 183621 191934 181228 160536 168137 183268 200009 184515 187216 191531 189174
$$ packed form
9060B13996M49J9153K0314q543p725j5321n356P796p350k3662K867J8566O976
9047B22160o242j1337R289Q376j6276q83P586K1201l465Q801q772O354j9881j5691
9033B01220N978J1664J1126J8039K017l0667k4158o008P137O063J2714K708K7286
9020B45119J3759k594k4543o041l539P108M899n412j8777n701J7828j2573N009
9007B14542j0511q129k3996j6491p076j650M598L7245K7940J5222k3423l4743
8995A73528Q747n93l877K2731K827R562k0950l3401J0852J1314p63o643k2988
8982A50346R646R050J3335L497K888J3018k486k5453l0558J0045K5976O803l459
8969A82648Q99j3059J3133Q313j0706k0692P601J5131J6741j5494K701M315k357
$$ plain form
8956 189174 182773 150267 127470 136874 166908 193732 185863 151511 140547 137592 116727 122294 135793
8943 135793 144618 182408 210545 211082 196076 170238 137157 129270 113620 100357 102895 113346 98541
8930 98541 104562 138508 158919 168540 149213 150799 135662 114899 106562 125413 157213 161776 146537
8917 146537 120367 115337 120538 116198 121641 119565 118714 124264 142204 155019 150155 121787 130000 103021
8903 103021 91855 77983 102551 109731 115545 129579 138513 134045 109104 114824 123492 119485 122388
8890 122388 130670 110113 112488 132724 112917 113596 155763 170829 160269 169233 158509 110360 106507
8877 106507 109238 104677 118990 145471 165676 173735 177105 145669 131745 137138 130744 118601 111576
8864 111576 100638 83596 74779 75815 93078 82309 74348 87715 111231 139298 111679 98802
$$ packed form
8956A89174o401l2506k2797R404L0034K6824p869l4352j0964k955k0865N567J3499
8943A35793Q825L7790K8137N37j5006k5838l3081p887j5650j3263K538J0451j4805
8930I8541O021L3946K0411R621j9327J586j5137k0763q337J8851L1800M563j5239
8917A46537k6170n030N201m340N443k076q51N550J7940J2815m864k8368Q213k6979
8903A03021j1166j3872K4568P180N814J4034Q934m468k4941N720Q668m007K903
8890A22388Q282k0557K375K0236j9807O79M2167J5066j0560Q964j0724m8149l853
8877A06507K731m561J4313K6481K0205Q059L370l1436j3924N393o394j2143p025
8864A11576j0938j7042q817J036J7263j0769p961J3367K3516K8067k7619j2877
$$ plain form
8852 98802 86401 68761 63714 82486 109002 107293 110321 124254 134232 123943 127357 125559 128064
8839 128064 136718 149453 123882 111394 103477 107049 108450 104340 100052 74997 73382 95819 93768
8826 93768 83038 98993 113943 106855 106273 109454 92273 74104 89146 97375 94947 89617 58739
8813 58739 60518 88915 107265 112534 110657 139927 132164 115063 105628 82248 92465 123733 155526
8800 155526 147683 124100 133230 155601 136465 106589 70126 64277 67828 85929 85284 98666 93962
8787 93962 90996 88729 85933 84591 63281 56647 58858 75829 88164 84099 114116 128030 110722
8774 110722 95236 82719 90164 106921 112305 120132 117700 115161 113016 108079 106323 103667 94385 76096
8760 76096 88418 106704 96522 85588 98569 127389 121596 128083 121135 108686 109894 117917 114063
$$ packed form
8852I8802j2401j7640n047J8772K6516j709L028J3933R978j0289L414j798K505
8839A28064Q654J2735k5571j2488p917L572J401m110m288k5055j615K2437k051
8826I3768j0730J5955J4950p088n82L181j7181j8169J5042Q229k428n330l0878
8813E8739J779K8397J8350N269j877K9270p763j7101r435k3380J0217L1268L1793
8800A55526p843k3583R130K2371j9136k9876l6463n849L551J8101o45J3382m704
8787I3962k966k267k796j342k1310o634K211J6971J2335m065L0017J3914j7308
8774A10722j5486j2517P445J6757N384P827k432k539k145m937j756k656r282j8289
8760G6096J2322J8286j0182j0934J2981K8820n793O487o948j2449J208Q023l854
$$ plain form
8747 114063 106412 90467 85938 89344 91573 67836 67063 92790 102418 91150 75391 80186 102029
8734 102029 107970 80360 63761 52152 42520 35872 39223 48973 47127 52682 42498 37716 41838
8721 41838 54377 45337 51404 52765 64699 76158 66959 56383 81859 93472 57863 57652 71472
8708 71472 55541 35156 27602 37969 79421 72095 63165 60554 45664 43243 61894 87271 82291
8695 82291 44599 36282 40282 16021 28805 66914 88556 106263 126861 116318 123691 126793 112937
8682 112937 106473 109382 84917 62912 46132 57014 58067 40817 35044 69179 84347 83027 70766
8669 70766 63911 58737 59083 55308 66470 92306 93967 94223 78665 68870 66019 55693 56535 66340
8655 66340 71519 53397 69260 66086 45668 43557 70167 106644 129668 104289 83558 82574 88539
$$ packed form
8747A14063p651j5945m529L406K229k3737p73K5727R628j1268j5759M795K1843
8734A02029N941k7610j6599j1609r632o648L351R750j846N555j0184m782M122
8721D1838J2539r040O067J361J1934J1459r199j0576K5476J1613l5609k11J3820
8708G1472j5931k0385p554J0367M1452p326q930k611j4890k421J8651K5377m980
8695H2291l7692q317M000k4261J2784L8109K1642J7707K0598j0543P373L102j3856
8682A12937o464K909k4465k2005j6780J0882J053j7250n773L4135J5168j320j2261
8669G0766o855n174L46l775J1162K5836J661K56j5558r795k851j0326Q42R805
8655F6340N179j8122J5863l174k0418k111K6610L6477K3024k5379k0731r84N965
$$ plain form
8642 88539 90675 87030 72534 66489 78236 91165 76977 70466 98427 98755 106310 107111 111377 123330
8628 123330 145659 156259 144119 97474 83982 100473 99778 107784 112698 104752 88161 87884 85519
8615 85519 76046 68036 33502 44845 60570 67101 70731 43995 34221 65627 116820 110803 87633
8602 87633 92689 87056 75718 66939 67239 82474 92323 115913 106420 83988 65027 62688 80320
8589 80320 82815 97978 112375 128787 118205 130026 124648 114813 104875 83850 96450 106176 115604
8576 115604 117646 127461 136999 139436 132112 97553 71297 88025 64603 41225 51915 45922 56624
8563 56624 65714 80126 97104 120778 112292 104167 113581 102478 97374 105442 70469 43493 41845
8550 41845 51044 40018 37056 28785 25386 39453 71569 74655 79851 85688 83161 54084 32285
$$ packed form
8642H8539K136l645j4496o045J1747J2929j4188o511K7961L28P555Q01M266J1953
8628A23330K2329J0600j2140m6645j3492J6491o95Q006M914p946j6591k77k365
8615H5519r473q010l4534J1343J5725O531L630k6736r774L1406N1193o017k3170
8602H7633N056n633j1338q779L00J5235R849K3590r493k2432j8961k339J7632
8589H0320K495J5163J4397J6412j0582J1821n378r835r938k1025J2600R726R428
8576A15604K042R815R538K437p324l4559k6256J6728k3422k3378J0690n993J0702
8563E6624R090J4412J6978K3674q486q125R414j1103n104Q068l4973k6976j648
8550D1845R199j1026k962q271l399J4067L2116L086N196N837k527k9077k1799
$$ plain form
8537 32285 34568 54813 91825 96248 100060 85702 76876 91882 103208 85572 78162 74668 75627
8524 75627 59888 54550 55632 32006 44670 29124 30113 36263 12124 5749 5178 9142 28142 15247
8510 15247 -1060 28343 45577 45426 58060 56559 66684 86578 108151 95505 65557 53388
8498 53388 89229 76368 88343 101227 82608 70306 40784 23666 25707 40336 53173 44255
8486 44255 39278 55412 44405 65571 92832 101523 83215 68758 91873 119470 133832 88383
8474 88383 39379 65422 77431 67661 81428 67716 59806 69928 37968 31680 20113 24321 32886
8461 32886 58981 65848 56794 47147 36353 29157 29361 16845 30956 33661 66911 77586 65042
8448 65042 52594 39433 45631 54507 38477 12434 30110 76706 83558 65644 29768 10169
$$ packed form
8537C2285K283K0245L7012M423L812j4358q826J5006J1326j7636p410l494R59
8524G5627j5739n338J082k3626J2664j5546R89O150k4139o375n71L964J9000j2895
8510A5247j6307K9403J7234j51J2634j501J0125J9894K1573j2646k9948j2169
8498E3388L5841j2861J1975J2884j8619j2302k9522j7118K041J4629J2837q918
8486D4255m977J6134j1007K1166K7261Q691j8308j4457K3115K7597J4362m5449
8474H8383m9004K6043J2009r770J3767j3712p910J0122l1960o288j1567M208Q565
8461C2886K6095O867r054r647j0794p196K04j2516J4111K705L3250J0675j2544
8448F5042j2448j3161O198Q876j6030k6043J7676M6596O852j7914l5876j9599
$$ plain form
8436 10169 28734 49774 57886 60251 51658 57456 36667 -321 -7186 17985 21766 6782 7749
8423 7749 9556 -1974 15563 31825 59015 40805 50324 28678 12099 40025 27929 13436
8411 13436 -10280 -33296 -23325 11436 6253 -16529 -31586 -29250 -26722 -32744 -22771 -2173 31414
8398 31414 43385 36679 42643 47757 58638 47529 50258 41713 44338 45632 37472 40845 23534 10582
8384 10582 9343 19432 27968 21730 29458 64258 71726 53043 19602 -10821 10411 26716 24300
8371 24300 15163 25931 20783 34353 30184 34548 53116 50219 39214 25753 17231 36193 57487
8358 57487 84822 71694 53595 39910 39436 26379 19429 21251 -3327 -11878 -17342 -14727 -18869
8345 -18869 -14035 -33509 -26011 8227 20464 18339 31742 83324 80186 68053 81941 50036 13597
$$ packed form
8436A0169J8565K1040Q112K365q593N798k0789l6988o865K5171L781j4984R67
8423G749J807j1530J7537J6262K7190j8210R519k1646j6579K7926j2096j4493
8411A3436k3716k3016R971L4761n183k2782j5057K336K528o022R973K0598L3587
8398C1414J1971o706N964N114J0881j1109K729q545K625J294q160L373j7311j2952
8384A0582j239J0089Q536o238P728L4800P468j8683l3441l0423K1232J6305k416
8371B4300r137J0768n148J3570m169M364J8568k897j1005j3461q522J8962K1294
8358E7487K7335j3128j8099j3685m74j3057o950J822k4578q551n464K615m142
8345a8869M834j9474P498L4238J2237k125J3403N1582l138j2133J3888l1905l6439
$$ plain form
8332 13597 25312 49108 55753 34550 -472 10493 1845 13146 35392 2976 6608 47531
8320 47531 37074 31340 15808 5259 -1625 -6232 -9746 14959 37609 41319 18307 42650 50796
8307 50796 17580 13666 39109 30077 -6608 7362 34080 33909 21569 40457 32954 12367 73
8294 73 -15022 5348 41059 19877 -5627 -13951 -37067 -37981 -24763 -27550 7241 41887 25484
8281 25484 3977 -23700 -25300 -16460 -13727 7203 22315 33662 22522 17461 4273 -16023 -5967
8268 -5967 16677 7803 2123 -16419 -17683 -2490 -9696 -8650 609 -5458 23371 52170 28258
8255 28258 18340 16206 15427 16519 1387 4314 31003 43830 48898 28184 15459 -2769 9739
8242 9739 9585 -4191 -17915 27963 11370 -14371 -13123 971 25566 33021 30395 14887 13334
$$ packed form
8332A3597J1715K3796O645k1203l5022J0965q648J1301K2246l2416L632M0923
8320D7531j0457n734j5532j0549o884m607l514K4705K2650L710k3012K4343Q146
8307E0796l3216l914K5443r032l6685J3970K6718j71j2340J8888p503k0587j2294
8294G3j5095K0370L5711k1182k5504q324k3116r14J3218k787L4791L4646j6403
8281B5484k1507k7677j600Q840K733K0930J5112J1347j1140n061j3188k0296J0056
8268e967K2644q874n680j8542j264J5193p206J046R259o067K8829K8799k3912
8255B8258r918k134p79J092j5132K927K6689J2827N068k0714j2725j8228J2508
8242I739j54j3776j3724M5878j6593k5741J248J4094K4595P455k626j5508j553
$$ plain form
8229 13334 19612 34443 1595 -1481 16893 33358 46833 33389 49028 40411 29654 45331
8217 45331 36884 39270 38573 31780 56296 52939 86586 96016 68836 34914 -12071 6320 33841
8204 33841 33304 35574 42289 63864 50602 6669 -5391 15010 5718 28733 -7454 -33646 -639
8191 -639 3446 4897 -1883 29913 60742 60756 48159 44496 66080 59338 39462 40648 49451 46264
8177 46264 9019 31649 58510 19897 4781 -12573 1817 -396 -2059 7613 9854 27902 20905
8164 20905 21162 30200 4858 -28883 -24137 -24076 -16044 25064 28050 39418 53904 10630 -4382 14720
8150 14720 24980 21283 24266 28899 25631 48197 57531 31449 32984 63886 63393 51717 33941
8137 33941 -1783 -13545 -15726 5325 27232 29359 41119 39008 32993 36367 53847 56470 30592
$$ packed form
8229A3334O278J4831l2848l076J8374J6465J3475j3444J5639q617j0757J5677
8217D5331q447K386o97o793K4516l357L3647R430k7180l3922m6985J8391K7521
8204C3841n37K270O715K1575j3262m3933j2060K0401r292K3015l6187k6192L3007
8191f39M085J451o780L1796L0829J4j2597l663K1584o742j9876J186Q803l187
8177D6264l7245K2630K6861l8613j5116j7354J4390k213j663R672K241J8048o997
8164B0905K57R038k5342l3741M746O1Q032M1108K986J1368J4486m3274j5012J9102
8150A4720J0260l697K983M633l268K2566R334k6082J535L0902m93j1676j7776
8137C3941l5724j1762k181K1051K1907K127J1760k111o015L374J7480K623k5878
$$ plain form
8124 30592 22890 31931 41636 47151 50222 38092 19328 24186 58196 68166 40831 29739 33950
8111 33950 27489 16417 12727 16743 5094 -2361 3307 9621 28602 23409 26674 58101 68176
8098 68176 39823 29695 49352 32271 26519 8675 -9081 -12293 -2179 5702 22881 12177
8086 12177 35698 28467 10457 21089 7626 -9543 12119 33373 4266 7556 12331 4630 -14130
8073 -14130 -19276 -3663 -5633 9216 35155 40891 50040 56874 60138 49769 65777 29299 5811
8060 5811 7481 7060 23209 33073 30164 38373 22988 19233 3483 15259 -4244 -25799 -25371 -35503
8046 -35503 -34732 8664 -8678 513 38280 37730 7896 -464 28356 38732 46400 55742 44956
8033 44956 59758 68751 40718 -3096 -20006 704 -15896 -39196 -1060 35013 30652 32559
$$ packed form
8124C0592p702R041R705N515L071j2130j8764M858L4010R970k7335j1092M211
8111C3950o461j1072l690M016j1649p455N668O314J8981n193L265L1427J0075
8098F8176k8353j0128J9657j7081n752j7844j7756l212J0114P881J7179j0704
8086A2177K3521p231j8010J0632j3463j7169K1662K1254k9107L290M775p701j8760
8073a4130n146J5613j970J4849K5939N736R149O834L264j0369J6008l6478k3488
8060E811J670m21J6149R864k909Q209j5385l755j5750J1776j9503k1555M28j0132
8046c5503P71M3396j7342R191L7767n50k9834q360K8820J0376P668R342j0786
8033D4956J4802Q993k8033m3814j6910K0710j6600k3300L8136L6073m361J907
$$ plain form
8021 32559 20181 2687 8131 11099 32181 48101 85258 88318 78837 50711 28871 32925 42537
8008 42537 33358 11061 -5615 -25099 -51588 -40003 -11967 15586 33707 34620 28813 40173 31795
7995 31795 2095 19075 17057 27199 39126 25904 15506 7666 13228 1232 2082 14772 12743
7982 12743 19271 17954 7119 30053 21080 16474 38545 13926 -904 25365 45896 67092 45745
7969 45745 40816 40727 28007 15172 -4576 22801 42607 44087 49629 26141 23980 19597 12693 36933
7955 36933 31939 10002 11256 20845 16634 22558 21707 22757 18782 30121 17113 29192 35289 7971
7941 7971 -15519 -1643 3712 32269 47543 63159 71771 54584 45202 33522 8986 18347 29614
7928 29614 12484 11099 32579 20080 -12156 -2466 16721 24808 10969 27042 80723 90367 66745
$$ packed form
8021C2559j2378j7494N444K968K1082J5920L7157L060r481k8126k1840M054R612
8008D2537r179k2297j6676j9484k6489J1585K8036K7553J8121R13n807J1360q378
7995C1795k9700J6980k018J0142J1927j3222j0398p840N562j1996Q50J2690k029
7982A2743O528j317j0835K2934q973m606K2071k4619j4830K6269K0531K1196k1347
7969D5745m929q9j2720j2835j9748K7377J9806J480N542k3488k161m383o904K4240
7955C6933m994k1937J254R589m211N924q51J050l975J1339j3008J2079O097k7318
7941G971k3490J3876N355K8557J5274J5616Q612j7187r382j1680k4536R361J1267
7928B9614j7130j385K1480j2499l2236R690J9187Q087j3839J6073N3681R644k3622
$$ plain form
7915 66745 47311 12735 19653 32958 13723 13283 4960 20247 27691 42443 38948 22282 48724
7902 48724 57140 78859 88331 57942 30560 23955 31609 14572 27862 35912 25528 -4574 6260
7889 6260 8777 382 -529 28966 46950 51287 32952 48685 32813 32595 1899 -15014 -2930
7876 -2930 -117 20537 42792 46429 29762 11145 6822 27801 21108 29675 45949 28542 13922
7863 13922 15667 24573 13364 4654 16801 20312 21728 24539 18320 20159 29203 37068 36024 33193
7849 33193 10789 -8111 -12439 -3327 -186 4922 -15536 13566 30923 19713 -16855 21 19831
7836 19831 6959 3690 -13581 -21453 -11516 -8473 5729 4592 -10237 5005 -9873 -8920 33873
7823 33873 68419 60363 38258 16681 16957 14186 14489 46524 66014 41241 2755 412 -4723
$$ packed form
7915F6745j9434l4576O918J3305j9235m40q323J5287P444J4752l495j6666K6442
7902D8724Q416K1719R472l0389k7382o605P654j7037J3290Q050j0384l0102J0834
7889F260K517q395r11K9495J7984M337j8335J5733j5872k18l0696j6913J2084
7876b930K813K0654K2255L637j6667j8617m323K0979o693Q567J6274j7407j4620
7863A3922J745Q906j1209q710J2147L511J416K811o219J839R044P865j044k831
7849C3193k2404j8900m328R112L141N108k0458K9102J7357j1210l6568J6876J9810
7836A9831j2872l269j7271p872R937L043J4202j137j4829J5242j4878R53M2793
7823C3873L4546q056k2105k1577K76k771L03L2035J9490k4773l8486k343n135
$$ plain form
7810 -4723 1119 8983 8601 2462 30617 54794 64633 41811 17222 17937 26377 -3462 -20579 -32919
7796 -32919 -35361 -40364 -18766 15087 31489 13216 -2420 -1824 12283 32538 18025 -4271 14359
7783 14359 25379 29467 18056 -4755 -23028 -22534 -12535 13189 16391 39516 33227 21026 36782
7770 36782 38474 27121 33640 23517 21770 -16566 -32435 -13831 -5594 -7291 -1719 4674 1001
7757 1001 2042 10574 1209 -2679 17394 35962 31959 9094 -18404 4130 11980 25344 10217
7744 10217 -7205 -6343 7460 3341 -34159 -47329 -1031 10328 26413 26721 22253 30301 11051
7731 11051 -303 -190 -8312 -11861 -17093 -35268 2216 30742 24221 16541 17065 1933 -8412 -1806
7717 -1806 -31665 -56757 -21933 -8812 -108 -13422 -13286 -11655 16970 43764 47573 25071 3227
$$ packed form
7810d723N842P864l82o139K8155K4177R839k2822k4589P15Q440k9839j7117j2340
7796c2919k442n003K1598L3853J6402j8273j5636N96J4107K0255j4513k2296J8630
7783A4359J1020M088j1411k2811j8273M94R999K5724L202K3125o289j2201J5756
7770C6782J692j1353O519j0123j747l8336j5869J8604Q237j697N572O393l673
7757A001J041Q532r365l888K0073J8568m003k2865k7498K2534P850J3364j5127
7744A0217j7422Q62J3803m119l7500j3170M6298J1359J6085L08m468Q048j9250
7731A1051j1354J13q122l549n232j8175L7484K8526o521p680N24j5132j0345O606
7717a806k9859k5092L4824J3121Q704j3314J36J631K8625K6794L809k2502k1844
$$ plain form
7704 3227 -6375 -22270 1532 40872 62889 43452 -12560 -23475 3462 -22024 -46544 -28229
7692 -28229 -8100 -1255 17965 4886 -16135 -16942 -636 19570 -1189 -38151 -27513 6404
7680 6404 31603 39697 38526 5331 -12022 3255 20877 25141 15736 1146 -9517 -2223 -24713
7667 -24713 -9040 5390 -2409 -6783 -1599 -7726 20924 25138 37356 49655 69543 69418 35996
7654 35996 28968 30630 10376 9116 20967 -6228 -32722 -43124 -48720 -30764 -9558 17143 29952
7641 29952 4174 10031 27618 17016 10345 -2141 -33318 -56473 -69479 -47782 -20180 -8544
7629 -8544 -19143 -33012 -41771 -14774 -16849 -14911 9283 17752 5015 -15412 -9243 -3758 -226
7616 -226 10992 10019 -987 14850 15710 13388 11793 4651 -837 -31389 -21376 -9237 -15815 -25702
$$ packed form
7704C227r602j5895K3802L9340K2017j9437n6012j0915K6937k5486k4520J8315
7692b8229K0129O845J9220j3079k1021q07J6306K0206k0759l6962J0638L3917
7680F404K5199Q094j171l3195j7353J5277J7622M264r405j4590j0663P294k2490
7667b4713J5673J4430p799m374N184o127K8650M214J2218J2299J9888j25l3422
7654C5996p028J662k0254j260J1851k7195k6494j0402n596J7956K1206K6701J2809
7641B9952k5778N857J7587j0602o671j2486l1177k3155j3006K1697K7602J1636
7629h544j0599j3869q759K6997k075J938K4194Q469j2737k0427O169N485L532
7616b26J1218r73j1006J5837Q60k322j595p142n488l0552J0013J2139o578r887
$$ plain form
7602 -25702 -31697 -14819 -29488 -33919 -4884 11817 6702 -6727 1674 24518 43271 41438 28795
7589 28795 8114 7950 -6487 -8996 3742 -3414 -43944 -40428 -28799 -36449 -61784 -37692 11129
7576 11129 -1042 -19083 -110 -4632 9375 25455 22355 17636 6088 -14411 -37367 -28517 -4928
7563 -4928 51 525 -20089 -21775 10272 22792 31865 56177 59122 68742 83768 69900 69604 46555
7549 46555 26549 13949 5200 14423 19671 -4577 -16246 -39925 -24107 -23432 -32100 -35282 -24050
7536 -24050 -10901 20652 23085 20539 -13205 -65018 -63605 -53798 -39000 -16949 -6316 1917 7337
7523 7337 -897 -17418 -40094 -49800 -38781 -34169 -25772 -6666 3302 12067 14038 -2702 -12762
7510 -12762 -13736 -5723 -13954 -12051 -16277 -35789 -31955 -17435 8153 27490 29654 -3373 -18417
$$ packed form
7602b5702n995J6878j4669m431K9035J6701n115j3429Q401K2844J8753j833j2643
7589B8795k0681j64j4437k509J2738p156m0530L516J1629p650k5335K4092M8821
7576A1129j2171j8041J8973m522J4007J6080l100m719j1548k0499k2956Q850K3589
7563d928M979M74k0614j686L2047J2520R073K4312K945R620J5026j3868k96k3049
7549D6555k0006j2600q749R223N248k4248j1669k3679J5818O75q668l182J1232
7536b4050J3149L1553K433k546l3744n1813J413R807J4798K2051J0633Q233N420
7523G337q234j6521k2676r706J1019M612Q397J9106R968Q765J971j6740j0060
7510a2762r74Q013q231J903m226j9512L834J4520K5588J9337K164l3027j5044
$$ plain form
7497 -18417 -11298 -1278 1377 -5358 -8418 -15578 -9732 -15373 -28493 -39090 -33223 -14952 28138
7484 28138 43031 21960 9044 15950 31214 22271 24900 17815 20300 17395 38038 40752 2331
7471 2331 -11734 13837 41773 3357 7803 20882 17296 14132 -10285 -26499 -21070 -23608 -18646
7458 -18646 -10922 -571 -15071 -27907 -32142 -15533 1682 20921 15894 -7737 539 14970 -8732
7445 -8732 -5152 -9366 -7841 284 -19664 -41206 -30174 1207 27457 27910 24079 17705 12404 23261
7431 23261 7375 4647 5602 -19526 -34337 -34973 -39311 -3562 7334 8077 -6428 -31049 -35827 -37784
7417 -37784 -50924 -42535 -17909 -7653 12957 17793 21614 14247 20676 22532 7037 12306 -2564
7404 -2564 -15146 -27032 -39715 -25395 -20291 -19220 6812 -8388 -11101 16122 21880 -16558 -12559
$$ packed form
7497a8417P119J0020K655o735l060p160N846n641j3120j0597N867J8271M3090
7484B8138J4893k1071j2916O906J5264q943K629p085K485k905K0643K714l8421
7471B331j4065K5571K7936l8416M446J3079l586l164k4417j6214N429k538M962
7458a8646P724J0351j4500j2836m235J6609J7215J9239n027k3631Q276J4431k3702
7445h732L580m214J525Q125j9948k1542J1032L1381K6250M53l831o374n301J0857
7431B3261j5886k728R55k5128j4811o36m338L5749J0896P43j4505k4621m778j957
7417c7784j3140Q389K4626J0256K0610M836L821p367O429J856j5495N269j4870
7404b564j2582j1886j2683J4320N104J071K6032j5200k713K7223N758l8438L999
$$ plain form
7391 -12559 -10671 -21371 -23875 -22457 -38822 -17363 -26362 -26388 -18878 -9938 -17932 -16036 -16437 -18283 -11296
7376 -11296 12903 28124 28470 11410 -12222 -14797 -24194 -20895 -20709 -31864 -20749 4284 27623
7363 27623 41361 32086 11221 -2702 -9028 -8545 -5353 1578 -22 2852 28231 29187 33901 28479
7349 28479 38317 18267 -4158 -9824 -46164 -45136 -27643 -18886 -2972 22622 3987 -8765 -30199
7336 -30199 -29874 -23828 252 23098 18600 14458 4891 -10856 -9424 -36904 -36031 1245 25646 47763
7322 47763 58660 38924 34754 23385 -13506 -33151 -42618 -56842 -48533 -25307 5990 7498 -2066
7309 -2066 -7020 -1045 -13019 -24203 -4877 -21288 -37706 -17987 52317 68409 26309 7786
7297 7786 12703 32286 49572 42312 29588 17709 10695 3958 -14574 -36616 -39577 -10144 -17393
$$ packed form
7391a2559J888j0700k504J418j6365K1459q999k6P510Q940p994J896m01j846O987
7376a1296K4199J5221L46j7060k3632k575r397L299J86j1155J1115K5033K3339
7363B7623J3738r275k0865j3923o326M83L192O931j600K874K5379R56M714n422
7349B8479R838k0050k2425n666l6340J028J7493Q757J5914K5594j8635j2752k1434
7336c0199L25O046K4080K2846m498m142r567j5747J432k7480Q73L7276K4401K2117
7322D7763J0897j9736m170j1369l6891j9645r467j4224Q309K3226L1297J508r564
7309b066m954N975j1974j1184J9326j6411j6418J9719P0304J6092m2100j8523
7297G786M917J9583J7286p260j2724j1879p014o737j8532k2042k961K9433p249
$$ plain form
7284 -17393 -23351 -4613 9645 13872 918 -21948 -27472 -32380 -27748 -20409 -21615 -13179 -13969 771
7270 771 -5046 3230 7189 -3834 27008 43396 15761 24852 50641 36530 3925 5542 4334
7257 4334 23910 37829 20556 -6720 -26309 -19355 -3105 1661 -8128 -21662 -50086 -50702 -61047
7244 -61047 -53827 -39105 -34623 -31751 -21910 -22457 -16976 -17469 -33933 -46209 -37116 -25436 -20246 -17932
7230 -17932 -13796 -35729 -34545 -9975 -4269 8281 8611 -39219 -80524 -70277 -63155 -49717 -29153
7217 -29153 -10623 -384 2358 11912 27404 27007 5913 -4133 -5150 -23693 -9093 -2878 -4381
7204 -4381 -13135 -30967 -11613 29847 17449 15314 22325 22222 -1818 -7316 13149 9371 2419 7572
7190 7572 4210 987 7614 31263 43314 14418 -24241 -22921 -41073 -41525 -14556 15938 6463
$$ packed form
7284a7393n958J8738J4258M227j2954k2866n524m908M632P339j206Q436p90J4740
7270G71n817Q276L959j1023L0842J6388k7635R091K5789j4111l2605J617j208
7257D334J9576J3919j7273k7276j9589O954J6250M766r789j3534k8424o16j0345
7244f1047P220J4722M482K872R841n47N481m93j6464j2276R093J1680N190K314
7230a7932M136k1933J184K4570N706J2550L30m7830m1305J0247P122J3438K0564
7217b9153J8530J0239K742R554J5492l97k1094j0046j017j8543J4600O215j503
7204d381q754j7832J9354M1460j2398k135P011j03k4040n498K0465l778o952N153
7190G572l362l223O627K3649J2051k8896l8659J320j8152m52K6969L0494r475
$$ plain form
7177 6463 -31674 -23083 -5934 5361 -10362 -41433 -45717 -17333 -5455 20021 42097 44035 34947
7164 34947 10608 27576 18312 8749 25980 29689 53666 64430 50709 54258 26546 16786 42549
7151 42549 21664 15919 13422 -15937 -35683 -20741 -42 -25634 -40257 -30752 -20765 -25115 -3003
7138 -3003 16635 21932 12367 3121 15274 58823 48635 22302 9402 -2579 -8644 -34105 -54172
7125 -54172 -26477 -4139 4231 25347 21245 -834 -32907 -36978 -27603 -30700 -11118 -90 -1721
7112 -1721 11275 30946 36459 26930 23204 38456 39665 7837 -28262 -57264 -58107 -40435 -22564
7099 -22564 3205 1562 -344 20887 18088 9282 408 -16928 -26256 -19759 5228 2989 -13823
7086 -13823 -18929 -45149 -20609 -1387 9646 3090 -24236 -22393 -23279 -7683 -4721 -6610 -12563
$$ packed form
7177F463l8137Q591J7149J1295j5723l1071m284K8384J1878K5476K2076J938r088
7164C4947k4339J6968r264r563J7231L709K3977J0764j3721L549k7712r760K5763
7151D2549k0885n745k497k9359j9746J4942K0699k5592j4623R505R987m350K2112
7138c003J9638N297r565r246J2153M3549j0188k6333j2900j1981o065k5461k0067
7125e4172K7695K2338Q370K1116m102k2079l2073m071R375l097J9582J1028j631
7112a721J2996J9671N513r529l726J5252J209l1828l6099k9002q43J7672J7871
7099b2564K5769j643j906K1231k799q806q874j7336r328O497K4987k239j6812
7086a3823n106k6220K4540J9222J1033o556k7326J843q86J5596K962j889n953
$$ plain form
7073 -12563 4026 28450 32597 25377 14702 -5430 -25957 -19277 -5357 3509 10948 -15707 5140
7060 5140 35450 29936 17354 14561 20807 19835 31201 59167 41490 22956 12504 -5242 -3023
7047 -3023 -16449 -14279 -18111 -298 12460 -2042 4674 8075 -7808 -18639 1222 6752 -24386
7034 -24386 -16769 27748 48105 38975 20562 891 11727 21281 -243 -13707 13888 10492 -17073
7021 -17073 -35523 -51042 -60277 -47571 -3724 32680 -10059 -23780 -24203 -39821 -43993 -23471 -4739
7008 -4739 -3048 10650 37437 51758 34110 23462 20972 22075 56689 66897 50334 13237 -23404
6995 -23404 -19866 -10006 10589 20250 27140 28451 18197 13790 -6769 -28672 -22094 30782 37948
6982 37948 10571 -3091 -10749 -17752 -21071 -46469 -31547 -6384 -14568 -30528 -50701 -40021 -10012
$$ packed form
7073a2563J6589K4424M147p220j0675k0132k0527O680J3920Q866P439k6655K0847
7060E140L0310n514j2582k793O246r72J1366K7966j7677j8534j0452j7746K219
7047c023j3426K170l832J7813J2758j4502O716L401j5883j0831J9861N530l1138
7034b4386P617M4517K0357r130j8413j9671J0836R554k1524j3464K7595l396k7565
7021a7073j8450j5519r235J2706M3847L6404m2739j3721m23j5618m172K0522J8732
7008d739J691J3698K6787J4321j7648j0648k490J103L4614J0208j6563l7097l6641
6995b3404L538R860K0595R661O890J311j0254m407k0559k1903O578N2876P166
6982C7948k7377j3662p658p003l319k5398J4922K5163q184j5960k0173J0680L0009
$$ plain form
6969 -10012 16135 18836 23376 -150 -3787 2472 -31016 -36183 -16415 4766 -1502 -14468 -13751
6956 -13751 -16449 -29360 -30374 -21888 1116 7544 1516 3668 -10319 -5061 -13511 -15930 -21591 -19426
6942 -19426 -3230 -1388 13554 18987 27622 16628 8053 -17512 -34954 -29626 -19622 -23903 -17384
$$ packed form
6969a0012K6147K701M540k3526l637O259l3488n167J9768K1181o268j2966P17
6956a3751k698j2911j014Q486K3004O428o028K152j3987N258q450k419n661K165
6942a9426J6196J842J4942N433Q635j0994q575k5565j7442N328J0004m281O519
$$ [...]
##END NTUPLES=NMR SPECTRUM
##END=
