##TITLE=Analysis number 312759
Compound Code mo 00141
Project Code adrs
Chemist Name endeavour
##JCAMPDX= 6.0         $$ Bruker NMR JCAMP-DX V2.0
##DATA TYPE= NMR SPECTRUM
##DATA CLASS= NTUPLES
##ORIGIN= Bruker BioSpin GmbH
##OWNER= NMR
$$ XWIN-NMR		Version 3.5
$$ Fri Aug 12 10:00:49 2005 GMT Daylight Time (UT+1h)  MAYBRIDGE\NMR@NMR_250MHZ
##.OBSERVE FREQUENCY= 250.131544655141
##.OBSERVE NUCLEUS= ^1H
##.ACQUISITION MODE= SIMULTANEOUS (DQD)
##.ACQUISITION SCHEME= undefined
##.AVERAGES= 16
##.DIGITISER RES= 18
##SPECTROMETER/DATA SYSTEM= dpx250
##.PULSE SEQUENCE= zg30
##.SOLVENT NAME= CDCl3
##.SHIFT REFERENCE= (INTERNAL, CDCl3, 0, 16.4346)
##AUDIT TRAIL= $$ (NUMBER, WHEN, WHO, WHERE, WHAT)
$$ ##TITLE= Audit trail, XWIN-NMR		Version 3.5
$$ ##JCAMPDX= 5.01
$$ ##ORIGIN= Bruker BioSpin GmbH
$$ ##OWNER= NMR
$$ C:\u/data/dgb/nmr/ADRS/7690/pdata/1/auditp.txt
$$ ##AUDIT TRAIL=  $$ (NUMBER, WHEN, WHO, WHERE, WHAT)
(   1,<2005-08-12 10:00:17.96 +100>,<MAYBRIDGE\NMR>,<NMR_250MHZ>,
      <created by zg, POWCHK disabled, PULCHK disabled
       configuration hash MD5:
       62 19 C7 07 E1 42 D1 B7 37 6C 3D D0 77 39 F9 E6
       data hash MD5: 64K
       56 98 76 27 62 F9 29 90 B5 3A 16 3B 32 81 3E 46>)
(   2,<2005-08-12 10:00:33.06 +100>,<MAYBRIDGE\NMR>,<NMR_250MHZ>,
      <Start of raw data processing
       ef LB = 0.3 FT_mod = 6 PKNL = 1 SI = 32K 
       data hash MD5: 32K
       C3 33 AE 6D 30 50 E8 42 21 AF FE 25 FF BA 75 DF>)
(   3,<2005-08-12 10:00:36.00 +100>,<MAYBRIDGE\NMR>,<NMR_250MHZ>,
      <apk 
       data hash MD5: 32K
       29 9A 7B 5F F7 6A DF AF 8B C7 7E 18 CF 1C 2D 02>)
(   4,<2005-08-12 10:00:37.53 +100>,<MAYBRIDGE\NMR>,<NMR_250MHZ>,
      <abs ABSG = 5 
       data hash MD5: 32K
       5D 6F 32 05 E1 AA 94 28 5A 7A 98 BA 56 E1 BB 4B>)
$$ ##END=
$$ 
$$ hash MD5
$$ 23 99 E4 F6 C1 DE D1 C8 92 64 E2 CB A8 E9 D8 04
##$RELAX= 
##$RELAX= 
##$RELAX= 
##$RELAX= 
##$RELAX= 
##$RELAX= 
##$RELAX= 
$$ Bruker specific parameters
$$ --------------------------
##$DU= <C:\u>
##$EXPNO= 7690
##$NAME= <ADRS>
##$PROCNO= 1
##$TYPE= <nmr>
##$USER= <dgb>
##$AMP= (0..31)
100 100 100 100 100 100 100 100 100 100 100 100 100 100 100 100 100 100 
100 100 100 100 100 100 100 100 100 100 100 100 100 100 
##$AQSEQ= 0
##$AQ_mod= 3
##$AUNM= <au_zg>
##$AUTOPOS= <6 >
##$BF1= 250.13
##$BF2= 250.13
##$BF3= 250.13
##$BF4= 250.13
##$BF5= 500.13
##$BF6= 500.13
##$BF7= 500.13
##$BF8= 500.13
##$BYTORDA= 1
##$CFDGTYP= 0
##$CFRGTYP= 5
##$CHEMSTR= <none>
##$CNST= (0..31)
1 1 145 1 1 1 1 1 1 1 1 1 1 1 1 1 1 1 1 1 1 1 1 1 1 1 1 1 1 1 1 1 
##$CPDPRG= <>
##$CPDPRG1= <>
##$CPDPRG2= <>
##$CPDPRG3= <>
##$CPDPRG4= <mlev>
##$CPDPRG5= <mlev>
##$CPDPRG6= <mlev>
##$CPDPRG7= <mlev>
##$CPDPRG8= <mlev>
##$CPDPRGB= <>
##$CPDPRGT= <>
##$D= (0..31)
0 1 0 0 0 0 0 0 0 0.06 0 0 0 0 0 0 0.0002 0 0 0 0 0 0 0 0 0 0 0 0 0 0 
0 
##$DATE= 1123837217
##$DBL= (0..7)
120 120 120 120 120 120 120 120 
##$DBP= (0..7)
150 150 150 150 150 150 150 150 
##$DBP07= 0
##$DBPNAM0= <>
##$DBPNAM1= <>
##$DBPNAM2= <>
$$ [...]
##$SUBNAM7= <"">
##$SUBNAM8= <"">
##$SUBNAM9= <"">
##$SW= 20.6930455092707
##$SWIBOX= (0..15)
0 0 3 0 0 0 0 0 0 0 0 0 0 0 0 0 
##$SW_h= 5175.983436853
##$TD= 65536
##$TD0= 1
##$TE= 296.16
##$TE2= 300
##$TE3= 300
##$TEG= 300
##$TL= (0..7)
0 120 120 120 120 120 120 120 
##$TP= (0..7)
150 150 150 150 150 150 150 150 
##$TP07= 0
##$TPNAME0= <>
##$TPNAME1= <>
##$TPNAME2= <>
##$TPNAME3= <>
##$TPNAME4= <>
##$TPNAME5= <>
##$TPNAME6= <>
##$TPNAME7= <>
##$TPOAL= (0..7)
0.5 0.5 0.5 0.5 0.5 0.5 0.5 0.5 
##$TPOFFS= (0..7)
0 0 0 0 0 0 0 0 
##$TUNHIN= 0
##$TUNHOUT= 0
##$TUNXOUT= 0
##$USERA1= <user>
##$USERA2= <user>
##$USERA3= <user>
##$USERA4= <user>
##$USERA5= <user>
##$V9= 5
##$VALIST= <valist>
##$VCLIST= <CCCCCCCCCCCCCCC>
##$VD= 0
##$VDLIST= <DDDDDDDDDDDDDDD>
##$VPLIST= <PPPPPPPPPPPPPPP>
##$VTLIST= <TTTTTTTTTTTTTTT>
##$WBST= 1024
##$WBSW= 4
##$XGAIN= (0..3)
0 0 0 0 
##$XL= 0
##$YL= 0
##$YMAX_a= 535507
##$YMIN_a= -548954
##$ZGOPTNS= <>
##$ZL1= 120
##$ZL2= 120
##$ZL3= 120
##$ZL4= 120
##$ABSF1= 16.43464
##$ABSF2= -4.25853
##$ABSG= 5
##$ABSL= 3
##$ALPHA= 0
##$AQORDER= 0
##$ASSFAC= 0
##$ASSFACI= 0
##$ASSFACX= 0
##$ASSWID= 0
##$AUNMP= <proc_1d>
##$AZFE= 0.1
##$AZFW= 0.1
##$BCFW= 0
##$BC_mod= 0
##$BYTORDP= 0
##$COROFFS= 0
##$CY= 12.5
##$DATMOD= 1
##$DC= 0
##$DFILT= <>
##$DTYPP= 0
##$F1P= 14.0000005364418
##$F2P= -0.99999901652339
##$FCOR= 0.5
##$FTSIZE= 32768
##$FT_mod= 6
##$GAMMA= 0
##$GB= 0
##$INTBC= 1
##$INTSCL= 1
##$ISEN= 128
##$LB= 0.3
##$LEV0= 0
##$LPBIN= 0
##$MAXI= 10000
##$MC2= 0
##$MEAN= 0
##$ME_mod= 0
##$MI= 0
##$NCOEF= 0
##$NC_proc= -2
##$NLEV= 6
##$NOISF1= 0
##$NOISF2= 0
##$NSP= 0
##$NTH_PI= 0
##$NZP= 0
##$OFFSET= 16.43464
##$PC= 1
##$PHC0= -82.94387
##$PHC1= 9.278126
##$PH_mod= 1
##$PKNL= yes
##$PPARMOD= 0
##$PSCAL= 4
##$PSIGN= 0
##$REVERSE= no
##$SF= 250.130021848598
##$SI= 32768
##$SIGF1= 0
##$SIGF2= 0
##$SINO= 400
##$SIOLD= 32768
##$SREGLST= <1H.CDCl3>
##$SSB= 0
##$STSI= 32768
##$STSR= 0
##$SW_p= 5175.98343685301
##$SYMM= 0
##$S_DEV= 0
##$TDeff= 65536
##$TDoff= 0
##$TI= <Analysis number 999999
Compound Code 99
Book Reference 9
Project Code 9>
##$TILT= no
##$TM1= 0
##$TM2= 0
##$TOPLEV= 0
##$USERP1= <user>
##$USERP2= <user>
##$USERP3= <user>
##$USERP4= <user>
##$USERP5= <user>
##$WDW= 1
##$XDIM= 32768
##$YMAX_p= 296096773
##$YMIN_p= -26127
$$ End of Bruker specific parameters
$$ ---------------------------------
##NTUPLES= NMR SPECTRUM
##VAR_NAME=  FREQUENCY,     SPECTRUM/REAL,   SPECTRUM/IMAG
##SYMBOL=    X,             R,               I
##VAR_TYPE=  INDEPENDENT,   DEPENDENT,       DEPENDENT
##VAR_FORM=  AFFN,          ASDF,            ASDF
##VAR_DIM=   32768,         32768,           32768
##UNITS=     HZ,            ARBITRARY UNITS, ARBITRARY UNITS
##FACTOR=    0.157963299565203, 1,           1
##FIRST=     4110.79708348869, 0,            0
##LAST=      -1065.18635336432, 0,           0
##MIN=       -1065.18635336432, -26127,      0
##MAX=       4110.79708348869, 296096773,    0
$$ Real data points
##PAGE= N=1
##DATA TABLE= (X++(R..R)), XYDATA
$$ [...]
20335A873K139K115L468m103K8k634j720M27L23L81J289m62q54L783Q2k570J832
$$ 1873 4012 6127 9595 5492 5520 2886 1166 1593 1916 2297 3586 3124 2270 6053 6135 3565 5397
20318E397l035n540j86N721J651k730l971k368j711k750M986j27K135l236j970
$$ 5397 2362 -3178 -3364 2357 4008 1278 -2693 -5061 -6772 -9522 -4536 -4663 -2528 -5764 -7734
20303g734K037n344L14P612J854L41k034K109J17J932M092r29O62m769j727l519
$$ -7734 -5697 -11041 -10727 -3115 -1261 -920 -2954 -845 -728 1204 5296 4367 5029 260 -1467 -4986
20287d986L47L856M022j528p494m429k268O196L916j114J666k121O5l763j845
$$ -4986 -4639 -783 3239 1711 -5783 -10212 -12480 -6284 -2368 -3482 -1816 -3937 -3872 -7635 -9480
20272i480m490M694q4j150J586K991K896l613j496R2R09O247M036J2j208j182
$$ -9480 -13970 -9276 -9360 -10510 -8924 -5933 -3037 -6650 -8146 -8054 -7145 -898 3138 3150 1942 760
20256G60J455k747J79K382L426J312J078J105l997j970k983l320j783j873R61
$$ 760 2215 -532 -353 2029 5455 6767 7845 8950 4953 2983 0 -3320 -5103 -6976 -6015
20241f015P729L325n074j692l259O45N102L752Q61l651r094j452O33N188J923
$$ -6015 1714 5039 -35 -1727 -4986 -4341 761 4513 5374 1723 -7371 -8823 -8190 -3002 -1079
20226a079J673j70J366n9k40R21O84m674L293R295J340l750k954j126K49j700
$$ -1079 594 424 1790 1731 1491 2412 3096 -1578 1715 11010 12350 8600 5646 4520 4769 3069
20210C069m721n101k165R503L878J457m908k183j679J431P18k503P438l681K492
$$ 3069 -1652 -6753 -8918 585 4463 5920 1012 -1171 -2850 -1419 -701 -3204 4234 553 3045
20195C045l262p131J214Q310J013m088L879M819n799m240J139R1R2O574N143l954
$$ 3045 -217 -7348 -6134 2176 3189 -899 2980 7799 2000 -2240 -1101 -1010 -918 5656 10799 6845
20179F845n075R71l950l38K747K168k37m39j668n585K64M03J411N916n05K235
$$ 6845 1770 2741 -1209 -1547 1200 3368 3131 2692 1024 -4561 -4297 -3894 -2483 3433 2928 5163
20163E163l639j288N336J701k666N704K973j588k53m145O84Q60k477n786m969
$$ 5163 1524 236 5572 7273 4607 10311 13284 11696 11443 7298 7982 8842 6365 579 -4390
20148d390m292K059j695j538M392M83J265m173l566m041N468R84o50J284M888
$$ -4390 -8682 -6623 -8318 -9856 -5464 -4981 -3716 -7889 -11455 -15496 -10028 -9044 -9694 -8410 -3522
20133c522O378R42m131L46K389K109r84m464o18K321K523L706n388j236l21m084
$$ -3522 2856 3798 -333 13 2402 4511 3527 -937 -1555 766 3289 6995 1607 371 50 -4034
20117d034J188K28M276L21J808L687k784m240k604L204k735k674L171l760L719
$$ -4034 -2846 -2618 1658 1979 3787 7474 4690 450 -2154 1050 -1685 -4359 -1188 -4948 -1229
20102a229P069R10n440J489l712L610r8K144L830k494k005L25L224M158m462l014
$$ -1229 5840 6750 1310 2799 -913 2697 2599 4743 8573 6079 4074 4399 7623 11781 7319 4305
20086D305N77m857J810j94J23L561l571m020P11Q353J572j372J032k588l765o779
$$ 4305 4882 25 1835 1641 1764 5325 1754 -2266 -1555 6798 8370 6998 8030 5442 1677 -5102
20070e102j593j132P32N690L238m316j619n345M878N742L861K351k916j303k658
$$ -5102 -6695 -7827 -7095 -1405 1833 -2483 -4102 -9447 -4569 1173 5034 7385 4469 3166 508
20055E08N5k13K62p976l442P1M068L114L610L419m693O65N122J523r850O40J178
$$ 508 563 350 612 -7364 -10806 -10735 -6667 -3553 57 3476 -1217 -552 4570 6093 -3757 -3117 -1939
20038a939J962k629L56k162k874m184n21R35L09L480P806N335L07j877j633J108
$$ -1939 23 -2606 -2250 -4412 -7286 -11470 -11991 -11056 -10747 -7267 539 5874 6181 4304 2671 3779
20022C779j671J198k768j018k048j64M629L411k103n162l32M390N952q50j051
$$ 3779 2108 3306 538 -480 -2528 -2692 1937 5348 3245 -1917 -2249 2141 8093 7243 6192
20007F192m938N595J0893M109K284r136j3612j821P375O228j958p56j01n682j275
$$ 6192 1254 6849 17742 21851 24135 14999 1387 -434 6941 13169 11211 10455 10354 4672 3397
19992C397L547M17K701M176J287M38k958n801l019L145q21L906q15k322l490K073
$$ 3397 6944 7361 10062 14238 15525 15963 13005 7204 4185 7330 6509 10415 9600 7278 3788 5861
19976E861L959n481j0499o130r064M029O741o60J423M643K735m509J747j973j276
$$ 5861 9820 4339 -6160 -12290 -21354 -17325 -10584 -11244 -9821 -5178 -2443 -6952 -5205 -7178 -8454
19961h454R4L91J585k77j80o159O99M946K253j54L406O142J504l764m107q30p020
$$ -8454 -8360 -7969 -6384 -6661 -6841 -13000 -12301 -7355 -5102 -5256 -1850 4292 5796 2032 -2075 -2905 -9925
19944i925M434k822q81m061M933M975j230J806Q917k210k771l447k275n484K661
$$ -9925 -5491 -8313 -9194 -13255 -8322 -3347 -4577 -2771 6146 3936 1165 -2282 -4557 -10041 -7380
19929g380J261m06p44P83k750L177M162K369M538R31j543n24l105j136L210K131
$$ -7380 -6119 -6525 -7269 -6486 -9236 -6059 -1897 472 5010 5941 4398 3874 769 -367 2843 4974
19913D974o115k039j361N113K898J481K579P067k392o502p558n491n992L561K650
$$ 4974 -1141 -3180 -4541 572 3470 4951 7530 14597 12205 5703 -1855 -7346 -13338 -9777 -7127
19898g127L177N752M896M183n439K673q99j268N325L972l676n139l11m510K36
$$ -7127 -3950 1802 6698 10881 5442 8115 7216 5948 11273 15245 11569 6430 6119 1609 1845
19883A845n56M025j236l753m765k095j093L71q02J389L486K806O474J290o122
$$ 1845 1289 5314 4078 325 -4440 -6535 -7628 -7257 -8059 -6670 -3184 -378 6096 7386 1264
19868A264j1437O42K351j165P560K187k128J249N826l449l613O239K82K456R22
$$ 1264 -10173 -9531 -7180 -8345 -785 1402 -726 523 6349 2900 -713 5526 5808 8264 9186
19853I186n95j941N64m700J066O221L174j617l185m660j326l44l113j239L341
$$ 9186 8591 6650 7214 2514 3580 9801 12975 11358 8173 3513 2187 1843 -1270 -2509 832
19838H32Q83m178M023L344J937m43l426k072j223J731j384L514J328q001m865
$$ 832 1715 -2463 1560 4904 6841 6398 2972 900 -323 1408 24 3538 4866 -3135 -8000
19823h000L318L866j306j712l903J683Q374Q06K747m328p59N352k552o199J548
$$ -8000 -4682 -816 -2122 -3834 -7737 -6054 2320 3126 5873 1545 786 6138 3586 -2613 -1065
19808a065k206J614L703L211m834n768L270J929q50N317n971l469N368L170M29
$$ -1065 -3271 -1657 2046 5257 423 -5345 -2075 -146 -996 4321 -1650 -5119 249 3419 3848
19793C848n941J408M92q71k796J062K451J698j680O606p784o782P568N548O00
$$ 3848 -2093 -685 -193 -1064 -3860 -2798 -347 1351 -329 6277 -1507 -8289 -721 4827 5427
19778E427M273L328l424o622l672j886N080L016J876N142M905k459p098L007L573
$$ 5427 9700 13028 9604 2982 -690 -2576 2504 5520 7396 12538 17443 14984 7886 10893 14466
19763A4466r762j3749K359R10L516Q659m00j266j763n122K81N178l721K879K224
$$ 14466 4704 -9045 -6686 -5776 -2260 6399 5999 4733 2970 -2152 -1871 3307 -414 2465 4689
19748D689k094o616o485o013L766M099j905P663N525n530L220Q135k974k499K775
$$ 4689 2595 -4021 -10506 -16519 -12753 -8654 -10559 -2896 2629 -2901 319 8454 5480 2981 5756
19733E756J055m98q30L490k30n796J053K728j796n746N237L611J929j34L080m878
$$ 5756 6811 6313 5483 8973 8743 2947 4000 6728 4932 -814 4423 8034 9963 9829 12909 8031
19717H031l175j688K163j603q15j336N356K663p372q133l075J183P78K938J977
$$ 8031 4856 3168 5331 3728 2913 1577 6933 9596 2224 -5909 -8984 -7801 -7023 -4085 -2108
19702b108k16J621K987M103n948k22J731k024l364J694jj738k763l841M509M126
$$ -2108 -2324 -703 2284 6387 439 217 1948 -76 -3440 -1746 -1747 -3485 -6248 -10089 -5580 -1454
19686a454k258M272r01j527l290J767l467K532l555N37N497L14K922K872N75j504
$$ -1454 -3712 560 -341 -1868 -5158 -3391 -6858 -4326 -7881 -7344 -1847 -1533 1389 4261 4836 3332
19670C332m052P12N697P689M88r069m133k729o961k338M132k340k80q90q21K933
$$ 3332 -720 -8 5689 13378 13866 4797 664 -2065 -9026 -11364 -7232 -9572 -9852 -10742 -11563 -8630
19654h630R509R722o948n339J497j759M609M247k402k886M248M787J611r255m435
$$ -8630 879 10601 3653 -1686 -189 -1948 2661 6908 4506 1620 5868 10655 12266 3011 -1424
19639a424j305M655M374m347R39r70R8n164J77M8j493M109P69m560K087K366j41
$$ -1424 -2729 1926 6300 1953 2892 1922 2020 -3144 -2967 -2919 -4412 -303 466 -4094 -2007 359 218
19622B18n471L727L501L0m599l860P438Q241n352j209M640o081J059N500K256
$$ 218 -5253 -1526 1975 2005 -2594 -6454 984 9225 3873 2664 7304 1223 2282 7782 10038
19607A0038n973m902k741N7M972j098K970J672p5r88j032k46o5k081o781M06K090
$$ 10038 4065 -837 -3578 -3521 1451 353 3323 4995 4920 3932 2900 2654 2589 508 -6273 -5867 -3777
19590c777L52m753o505k35M559Q795Q861k58p262m318k10J386J160L599L090m813
$$ -3777 -3425 -8178 -14683 -14918 -10359 -1564 7297 7039 -223 -4541 -4751 -3365 -2205 1394 4484 -329
19574c29l212ON52j349L43R87o149O28K090k827j560R826l39R50o56K553k804
$$ -329 -3541 -3535 -2983 -4332 -3989 -3002 -9151 -8523 -6433 -9260 -10820 -994 -1333 -383 -1039 1514 -1290
19557a290m573M19J426j752J47p14m69K464k882l186m48L147J1528p79o035m21
$$ -1290 -5863 -5444 -4018 -5770 -5623 -6337 -6806 -4342 -7224 -10410 -10858 -7711 3817 3038 -2997 -3418
19541c418K662L091P516J220N203q81p948p300m825q73K340m745o213P200P158
$$ -3418 -756 2335 9851 11071 16274 15393 7445 145 -4680 -5553 -3213 -7958 -14171 -6971 187
19526A87M296M34p229o631k515N350M349K043M136M189j800j209l386k718j081
$$ 187 4483 4917 -2312 -8943 -11458 -6108 -1759 284 4420 8609 6809 5600 2214 -504 -1585
19511a585L253J781J318K116L632k540k523K85n338k212M69J724j689m472k384
$$ -1585 1668 3449 4767 6883 10515 7975 5452 5737 399 -1813 -1344 380 -1309 -5781 -8165
19496h165K736M677n28k981J741J158O85O067k71n763m434j306l539M471l82q60
$$ -8165 -5429 -752 -1280 -4261 -2520 -1362 -677 5390 5119 -644 -5078 -6384 -9923 -5452 -5834 -6694
19480f694P095K628j850j117n484j435L569Q330R149j670j282o77j589K23k739
$$ -6694 401 3029 1179 62 -5422 -6857 -3288 5042 14191 12521 11239 10562 8973 9196 6457
19465F457l037P70j443k680K629m270n104M193M888j956M934O750k218m466k413
$$ 6457 3420 4190 2747 67 2696 -1574 -6678 -2485 2403 447 5381 12131 9913 5447 3034
19450C034j466k714L16Q054P446J594o828l617N88p037l658k568m395P002P550
$$ 3034 1568 -1146 -830 7224 14670 16264 9436 5819 6407 -630 -4288 -6856 -11251 -4249 3301
19435C301k778q062j621N831J467l821M54O321N388l186N312L870n004o09N842
$$ 3301 523 -7539 -9160 -3329 -1862 -5683 -5229 1092 6480 3294 8606 12476 7472 6863 12705
19420A2705K694n68p911l217j982k883K535K005M190j647J52n009K583L927m904
$$ 12705 15399 14831 6920 3703 1721 -1162 1373 3378 7568 5921 6073 1064 3647 7574 2670
19405B670J170J230Q664m01n560k722j067n136j263j247K074J670o39k070M321
$$ 2670 3840 5070 13734 13333 7773 5051 3984 -1152 -2415 -3662 -1588 82 -557 -2627 1694
19390A694m02K780J471j246k051k131j740k549j146p52O309J443l87j388J280
$$ 1694 1292 4072 5543 4297 2246 115 -1625 -4174 -5320 -6072 237 1680 1293 -95 1185
19375A185j621k286K747K96K488Q49Q277P840J703j3688m382k03o6L242J320l81
$$ 1185 -436 -2722 25 321 2809 3658 11935 19775 21478 7790 3408 3205 3139 6381 7701 7320
19359G320K506l318l12L911j192N1l984r825n868L319R999p33k013k690K38L082
$$ 7320 9826 6508 6196 10107 8915 8966 4982 -4843 -10711 -7392 2607 1874 -139 -2829 -2591 491
19343D91M080K911l411k939m917k5J649Q088N463k995l743l937K410j750M09r42
$$ 491 4571 7482 4071 1132 -3785 -3810 -2161 5927 11390 8395 4652 715 3125 1375 1784 842
19327H42O70L537J06m203k024J43k052L726M904L223q417m479k71L490L423L715
$$ 842 1512 5049 5155 952 -1072 -929 -2981 745 5649 8872 455 -4024 -4295 -805 2618 6333
19311F333pl016k245N305N941m231k596k932k991n836l582N813N585K143j649
$$ 6333 6326 3310 1065 6370 12311 8080 5484 2552 -439 -6275 -9857 -4044 1541 3684 2035
19296B035j94K767L657l645m474m687l166L372O413L770K325Q74N16q505m881
$$ 2035 1841 4608 8265 4620 146 -4541 -7707 -4335 2078 5848 8173 9047 9563 1058 -3823
19281c823n230O772N155p16j06K949K304r9L518J424o110P6n904n825J105J84
$$ -3823 -9053 -2281 2874 2158 2052 5001 7305 7206 10724 12148 6038 6114 210 -5615 -4510 -4326
19265d326j230q25r99l402k200M861L509L430M823k920m6l243n258J711J1899
$$ -4326 -5556 -6381 -7380 -10782 -12982 -8121 -4612 -1182 3641 721 675 -2568 -7826 -6115 5784
19250E784M717k401l485k483L400j936o955r716J480M791L654K081L978J405N53
$$ 5784 10501 8100 4615 2132 5532 3596 -3359 -13075 -11595 -6804 -3150 -1069 2909 4314 4867
19235D867j385k910k696j035O976l675m352l0m439P367J736j91J648L337M33k235
$$ 4867 3482 572 -2124 -3159 3817 142 -4210 -4240 -8679 -1312 424 233 1881 5218 5651 3416
19219C416R48K168J055K289r99K633k461l456j567q17n013m509N164L364l865
$$ 3416 4364 6532 7587 9876 8877 11510 9049 5593 4026 3209 -1804 -6313 -1149 2215 -1650
19204a650k042K958K633r11o902M8N909K104P348K429k610j5931n971L024K57
$$ -1650 -3692 -734 1899 988 -5914 -5866 43 2147 9495 11924 9314 -6617 -12588 -9564 -9307
19189i307k034L851K618O244k805l300L239p80M324Q613Q73k873o193j087p857
$$ -9307 -11341 -7490 -4872 1372 -1433 -4733 -1494 -2274 2050 10663 11536 8663 2470 1383 -6474
19174f474R78M592j394P419R017r85k243l969n515o778p88j041Q676M853j779
$$ -6474 -5496 -904 -2298 5121 14138 13153 10910 6941 1426 -5352 -6140 -7181 1495 6348 4569
19159D569k200K327n96K566Q315l384m156k258o824M852J0481K262p719l296K328
$$ 4569 2369 4696 4100 6666 14981 11597 7441 5183 -1641 3211 13692 15954 8235 4939 7267
19144G267r31o377Q036L380k294j430j850n359K065M905l789J433K26J134l003
$$ 7267 6336 -41 7995 11375 9081 7651 5801 442 2507 7412 3623 5056 5282 6416 3413
19129C413l622n010j735J092K960Q887N957K023o778q477L596J0373j792n423
$$ 3413 -209 -5219 -6954 -5862 -2902 5985 11942 13965 7187 -1290 2306 12679 10887 5464
19115E464k636j097k98L766L992l372l519k552R64K460J721l369O4K845O12O925
$$ 5464 2828 1731 1433 5199 9191 5819 2300 -252 712 3172 4893 1524 1588 4433 5045 11970
19099A1970M249o00R47j216j0073K114O630o330k017L442N227n63m995m948k680
$$ 11970 16219 15619 16566 15350 5277 7391 14021 7691 5674 9116 14343 13780 8785 3837 1157
19084A157R25K5L691Q8n576O304N201O462l781k252j0514k397m314N347K026j405
$$ 1157 2082 2107 5798 5886 310 6614 11815 18277 14496 12244 1730 -667 -4981 366 2392 987
19068I87K683j262O86k461l392N07P205O095m204n869k274r35m810L396n31N106
$$ 987 3670 2408 3094 633 -2759 -2252 4953 11048 6844 975 -1299 -2234 -7044 -3648 -4179 927
19052I27M960k445o843K634O342o46l010l448K656j005n086j819P025L90J40K654
$$ 927 5887 3442 -3401 -767 5575 4929 1919 -1529 1127 122 -4964 -6783 242 632 772 3426
19036C426O272L536q942m807l301J522K996M614L044k82l379l081J275l107m410
$$ 3426 9698 13234 4292 -515 -3816 -2294 702 5316 8360 8078 4699 1618 2893 -214 -4624
19021d624j675O044R210j841j0392K642J766k242J874J70l218j689O60O073N626
$$ -4624 -6299 -255 8955 7114 -3278 -636 1130 -1112 762 932 -2286 -3975 -3315 2758 8384
19006H384o234q875m537O299J249j817R392o90k359J595k433O1j869nR750R899
$$ 8384 2150 -6725 -11262 -4963 -3714 -5531 3861 3171 812 2407 -26 35 -1834 -1839 7911 17810
18990A7810r284l777k742k25o66Q71L817J947j378r29j394j88k58q752k347J148
$$ 17810 8526 4749 2007 1782 1116 1987 5804 7751 6373 5444 4050 3862 3604 -5148 -7495 -6347
18974f347O22L539M853L024K561o08O16O88k772n463l399N085P25j151M306j108
$$ -6347 -5725 -2186 2667 5691 8252 7644 8260 8948 6176 713 -2686 2399 3124 1973 6279 5171
18958E171j0466K202L743k388K274k024n561n343Q508P714k888K765J776j96m798
$$ 5171 -5295 -3093 650 -1738 536 -1488 -7049 -12392 -3884 3830 942 3707 5483 5287 489
18943D89L671M888k683k004n238n071l284K65M03Q494O953L081j453j805K012
$$ 489 4160 9048 6365 4361 -877 -5948 -9232 -8967 -8564 -70 6883 9964 8511 6706 8718
18928H718k143k263k342M31K683j659Q161m445l279k877j766P35O06j288K776
$$ 8718 6575 4312 1970 2401 5084 3425 11586 7141 3862 985 -781 -46 560 -728 2048
18913B048o879n120N397j650R19O443N254M830q717o355L087K154L049k597l211
$$ 2048 -4831 -9951 -4554 -6204 -5285 1158 6412 11242 2525 -3830 -743 1411 4460 1863 -1348
18898a348j210l081L638N430N916L119k51m498n835M013N23l79J887j401o42J497
$$ -1348 -2558 -5639 -2001 3429 9345 12464 12213 7715 1880 5893 6416 6037 7924 6523 5881 7378
18882G378m454j065N22l38J310J666L01P11J091l96L787K357P55J43k38k506r57
$$ 7378 2924 1859 2381 2043 3353 5019 5320 6031 7122 6726 10513 12870 13625 13768 13530 11024 10067
18865A0067M009J347M961l045o966l19j433j285J795M534R78m335l397k862M674
$$ 10067 14076 15423 20384 17339 10373 10054 8621 7336 9131 13665 14643 10308 6911 4049 8723
18850H723j696p114J478N251O903M332o827l513j507j050L480N236o066n311O95
$$ 8723 7027 -87 1391 6642 13545 17877 11050 7537 6030 4980 8460 13696 7630 2319 3014
18835C014M586J892O344j032p79J446q732l798N338o824q959N572J3739l094q460
$$ 3014 7600 9492 15836 14804 14025 15471 6739 2941 8279 1455 -7504 -1932 11807 8713 253
18820B53n147L425R720K666p338M644K790n261o462j819J097l110L705M715N681
$$ 253 -4894 -1469 8251 10917 3579 8223 11013 5752 -710 -2529 -1432 -4542 -837 3878 9559
18805I559l24m817q11l104k097l7R711O759J920o32r135o922r31k885p364O234
$$ 9559 9235 4418 3607 503 -1594 -1631 8080 14839 16759 16127 6992 70 -861 -3746 -11110 -4876
18789d876Q873K460J35J080l150P94m478L88O347N393j388k976j405j806L300
$$ -4876 3997 6457 6592 7672 4522 5316 838 1226 7573 12966 11578 8602 7197 5391 8691
18774H691j697j9M930O980L023k38K224J6606J6730K843m555j2162j0740p509
$$ 8691 6994 6975 11905 18885 21908 21670 23894 40500 57230 60073 55518 43356 32616 25107
18760B5107k950J930N74k995k742o346j552L10L260j914j971O677q258r437J387
$$ 25107 22157 24087 24661 21666 18924 12578 11026 11336 14596 12682 10711 17388 9130 -307 1080
18745A080N083L013j044k589j547M959m25L72K78K957L736l243k166N20l228m631
$$ 1080 6163 9176 8132 5543 3996 8955 8530 8902 9180 12137 15873 12630 10464 10984 7756 3125
18729C125j955K772K408l074N905J207k564p21k450j589o21O522mk271N830k727
$$ 3125 1170 3942 6350 3276 9181 10388 7824 7103 4653 3064 2443 8965 8961 6690 12520 9793
18713I793n181p099J095L859Q316Q272j278m631J917P060%m055r976J792l53o224
$$ 9793 4612 -2487 -1392 2467 10783 19055 17777 13146 15063 22123 22123 18068 8092 9884 9531 3307
18697C307M460K709r20r41L283J38J472Q57J574K017m387K572K460j746k744M56
$$ 3307 7767 10476 9556 8615 11898 12036 13508 14365 15939 17956 13569 16141 18601 16855 14111 14567
18681A4567K434l012m671n287l804P780L415n53J36j565l550Q59N283M986q738
$$ 14567 17001 13989 9318 4031 227 8007 11422 10869 11005 9440 5890 6749 12032 17018 8280
18666H280m754k903Q470O633k648j791m763L520o88O14L945J724j66J515k591
$$ 8280 3526 623 9093 15726 13078 11287 6524 10044 9356 9970 13915 15639 15473 16988 14397
18651A4397q630l786M801Q098O778O445q182q830J626M40j396N59l523j030k204
$$ 14397 5767 1981 6782 14880 21658 28103 19921 11091 12717 13157 11761 12320 8797 7767 5563
18636E563l611l108K172O734l469K808k490n11M550J205K379L893Q153l212o787
$$ 5563 1952 -1156 1016 7750 4281 7089 4599 4088 8638 9843 12222 16115 24268 21056 14269
18621A4269n3k971j10J971J70L595M89p621p54L606o73M22m833l868L667N069
$$ 14269 14216 11245 11135 13106 13276 16871 17360 9739 8985 12591 11918 12340 7507 3639 7306 12375
18605A2375r55k773L039J235l522k597L813R591K344N93L279l088o576k374m389
$$ 12375 11420 8647 11686 12921 9399 6802 10615 20206 22550 23143 26422 23334 16758 14384 9995
18590I995M459n66L993K623o153N904L879R40o84L285j966L531N862J815j786
$$ 9995 14454 13888 17881 20504 14351 20255 24134 25074 24390 27675 25709 29240 35102 36917 35131
18575C5131j706k722N707K779j53J588M987Q84n391o988l455M578L053m33r922
$$ 35131 33425 30703 36410 39189 39036 40624 45611 46495 41104 34116 30661 35239 38292 37859 27937
18560B7937q764p762l66O021M18m449N57J200N930k334J069k817o959n311o99
$$ 27937 19173 11411 11045 17066 17484 13035 13592 14792 20722 18388 19457 16640 9681 4370 3671
18545C671j720J953J865l85J090K883J222K384P92k554K14j923k582M022m589
$$ 3671 1951 3904 5769 5384 6474 9357 10579 12963 13755 11201 11415 9492 6910 10932 6343
18530F343k676M629P495j659r85J458K421K366j244n934p478k265K160O692j058
$$ 6343 3667 8296 15791 14132 13147 14605 17026 19392 18148 12214 4736 2471 4631 11323 10265
18515A0265j019K052P617j803n575J285K573J709k203R250M068j0195p171J472
$$ 10265 9246 11298 18915 17112 11537 12822 15395 17104 14901 24151 28219 18024 10853 12325
18501A2325J567j223N742j443m579m268L422K966J237L677N123K883l682j636
$$ 12325 13892 12669 18411 16968 12389 8121 11543 14509 15746 19423 24546 27429 23747 22111
18487B2111Q26k194k588O151k600K558k490l089K405K940L218K531k709j797k748
$$ 22111 22937 20743 18155 24306 21706 24264 21774 18685 21090 24030 27248 29779 27070 25273 22525
18472B2525L762j531n403j26Q80n40j140l46K331M53j484o84n893k074n342L158
$$ 22525 26287 24756 19353 19227 20107 19567 18427 18081 20412 20865 19381 18697 12804 10730 5388 8546
18456H546O722M945J013N863j888J23j025o583l228o45K461l874n284p269M177
$$ 8546 15268 20213 21226 27089 25201 25324 24299 17716 14488 13843 16304 12430 7146 -123 4054
18441D054K400L015L523N582K751N042o258r674o107J415P616R136J449M997R217
$$ 4054 6454 9469 12992 18574 21325 26367 20109 10435 4328 5743 13359 22495 23944 28941 38158
18426C8158O337q517j3530m984N694M026k399Q341N742o366r718m600M582J838
$$ 38158 44495 35978 22448 17464 23158 27184 24785 33126 38868 32502 22784 18184 22766 24604
18412B4604m774k877K081L03k024M681n50L21k134N383m154r000j289J675L073
$$ 24604 19830 16953 19034 19337 17313 21994 21444 21765 19631 25014 20860 11860 10571 12246 15319
18397A5319P153J999n12l689n383J044j909j1128L098k814K217J1830L250J61
$$ 15319 22472 24471 23959 20270 14887 15931 14022 2894 5992 3178 5395 17225 20475 20636
18383B0636k566k83M626J465m604j830N103O216N019l673o006J793Q63j987j150
$$ 20636 18070 17787 22413 23878 19274 17444 22547 28763 33782 30109 24103 25896 26759 24772 23622
18368B3622k262k37m647J591O633L371O603m826n802Q36j646Q72l364L211m633
$$ 23622 21360 21123 16476 18067 24700 28071 34674 29848 24046 24882 23236 24108 20744 23955 19322
18353A9322J322m71j880L607R71l166n128K56k457O078R29m018L96n174L55P51
$$ 19322 20644 20173 18293 21900 22871 19705 14577 14833 12376 18454 19383 15365 15761 10587 10942 11693
18337A1693J571P895L427K064n689L305J994N20J906j283k805j795N256L799j339
$$ 11693 13264 21159 24586 26650 20961 24266 26260 26780 28686 27403 24598 22803 28059 31858 30519
18322C0519p374r5O067J416l168k683j567k465l745O47O351p004k162M421J054
$$ 30519 23145 23050 29117 30533 27365 24682 23115 20650 16905 17552 23903 16899 14737 19158 20212
18307B0212N317L274j1528Q87j224n36M34L293J0405J205l398n27k322M060m668
$$ 20212 25529 28803 17275 18162 16938 16402 16836 20129 30534 31739 28341 27814 25492 29552 24884
18292B4884r09j66m8M810k594K37Q410m301n301l391L779K24j80n746l479l768
$$ 24884 23975 23809 23761 28571 25977 26214 34624 30323 25022 21631 25410 25634 25454 19708 16229 12461
18276A2461L212R684K468K191K816o625J857J636j609l041L328N415K030k044
$$ 12461 15673 25357 27825 30016 32832 26207 28064 29700 28091 25050 28378 33793 35823 33779
18262C3779M8k343l103l6j102l290l378Q22m47K147j058n434J831O354O048M915
$$ 33779 33827 31484 28381 28345 27243 23953 20575 21397 20950 23097 22039 16605 18436 24790 30838 35753
18246C5753o522J96M450q153J845R665L993M049O9n511k041O025J246j951P9k881
$$ 35753 29231 29427 33877 25724 27569 37234 41227 45276 45345 39834 37793 43818 45064 43113 43192 40311
18230D0311J012n149j565j231n09R60J497j374l800J854N47J703P273J611q904
$$ 40311 41323 36174 34609 33378 32869 33829 35326 33952 30152 32006 32553 34256 41529 43140 34236
18215C4236j956l909L667k312n890l124J2185J1330K255m450j286Q91q211m389
$$ 34236 32280 28371 32038 29726 23836 20712 32897 44227 46482 42032 40746 41637 33426 29037
18201B9037M310J100k853p185j165J345O520r61n395L976P182M730K74l027l932
$$ 29037 33347 34447 31594 24409 23244 24589 31109 30148 24753 28729 35911 40641 40915 37888 33956
18186C3956L57l61J777K157k012k914l565K320r03K01M087k977m328N315R290
$$ 33956 34313 33952 35729 37886 35874 32960 29395 31715 30812 31013 35100 32123 27795 33110 42400
18171D2400K505J156j400K295r07k315l093K240K811k742K361K118l174n1O69
$$ 42400 44905 46061 44661 46956 46049 43734 40641 42881 45692 42950 45311 47429 44255 44204 44873
18156D4873j956K97l88J289M432L173M646P95k923n810n453P170L522n774j254
$$ 44873 42917 43214 42826 44115 48547 51720 56366 57161 54238 48428 42975 50145 53667 47893 46639
18141D6639P223N779L154K694N274J1107Q931J3832J1296j793K304N10P886R054
$$ 46639 53862 59641 62795 65489 70763 81870 90801 104633 115929 114136 116440 116950 124836 133890
18127A33890J1400J3672J8166K8163M5404M1868N7369P4273R5749J25534J70101
$$ 133890 145290 158962 177128 205291 250695 292563 349932 424205 519954 645488 815589
18116H15589K04008K45063K77971L29959M39888O64040J133784K004653K536978
$$ 815589 1019597 1264660 1542631 1872590 2312478 2976518 4110302 6114955 8651933
18107H651933J027181l82219k011497k621761j699431r21953n20617l23130k19639
$$ 8651933 9679114 9296895 7285398 4663637 2964206 2042253 1521636 1198506 978867
18098I78867j50730j08938p0348n6667n1068m4659l4088k3290q159n770j3955
$$ 978867 828137 719199 648851 592184 541116 496457 462369 439079 430920 425150 411195
18087D11195j9761j2833l386N499L411j0128k4411j6444j7136j7214j8754k2441
$$ 411195 391434 378601 375215 380714 384125 373997 349586 333142 316006 298792 280038 257597
18075B57597j6953j4241j7535j1745q043j0152j9066j3572k945j630j0049r383
$$ 257597 240644 226403 208868 197123 189080 178928 159862 146290 143345 141715 131666 122283
18063A22283j2148r217N67J107p360m135m411o906n250K44k671m809l132K703
$$ 122283 110135 100918 101485 102592 95232 91097 86686 79780 74530 74774 72103 67294 64162 66865
18049F6865K282m183m340n551j005p255r04j996k33L014J565L238j703j2390q114
$$ 66865 69147 64964 60624 55073 54068 46813 45909 43913 43680 46694 48259 51497 49794 37404 29290
18034B9290p67K551O077M31r501k217n45k981O091L006R1K940L593P28j194q341
$$ 29290 28523 31074 37151 37582 28081 25864 25319 22338 28429 31435 31526 34466 38059 38787 37593 29252
18018B9252j572r83j991K947k806j119j25K2J8n69R34J811j210k165j339j737
$$ 29252 27680 26697 24706 27653 24847 23728 23603 23625 23643 23074 24008 25819 24609 22444 21105 19368
18002A9368j004l5J568M42K060N029M668N826J933o31j255o888k410R330O029
$$ 19368 18364 18329 19897 20339 22399 27428 32096 37922 39855 39224 37969 31081 28671 38001 44030
17987D4030o388m718K9n146o131K590n97L664O478Q65o672p772J610L239J371
$$ 44030 37642 32924 32953 27807 21676 24266 23669 27333 33811 34676 28004 20232 21842 25081 26452
17972B6452J291l599j405K494N051k691k436J397O834pl840l173O346L011m868
$$ 26452 27743 24144 22739 25233 30284 27593 25157 26554 33388 33381 29541 26368 32714 35725 30857
17957C0857n760m076J001N637J092l382J242R149j205l250k863K13O62N914l824
$$ 30857 25097 21021 22022 27659 28751 25369 26611 35760 34555 31305 28442 28655 29317 35231 31407
17942C1407R38n51j042R48M234l0j295m705p906L389j553r06J550L270J71L816
$$ 31407 32345 31794 30752 31700 35934 35904 34609 29904 21998 25387 23834 22928 24478 27748 27919 31735
17926C1735M300q69J067j166o617J063J411K945K937N93K028N296J573j437j971
$$ 31735 36035 35166 36233 35067 28450 29513 30924 33869 36806 37399 39427 44723 46296 44859 42888
17911D2888k259l098J056Q53m837L027N665M829r588j963K298P668K478j950O49
$$ 42888 40629 37531 38587 39440 34603 37630 43295 48124 38536 36573 38871 46539 49017 47067 47716
17896D7716l054k072P991L724L713P585J251k65m258L125J1266N699O310J6055
$$ 47716 44662 42590 50581 54305 58018 65603 66854 66589 62331 65456 76722 82421 88731 104786
17882A04786J6932J5900J6141J6828K1006J7027J2159K2220J4312Q039N416Q228
$$ 104786 121718 137618 153759 170587 191593 208620 220779 242999 257311 265350 270766 278994
17870B78994m51J160M311J3427O514p243j3180j4546j4109l079K976O958O275
$$ 278994 278543 279703 284014 297441 303955 296712 283532 268986 254877 251798 254774 261732 268007
17857B68007l022J843R786N857J7339J4482M754k136r345r702n829k478M466l674
$$ 268007 264985 266828 276614 282471 299810 314292 319046 316910 307565 297863 292034 289556 294022 290348
17843B90348j2615j6462k2146k1104j9548q288j2550j5874j8550j5134k0629j0058
$$ 290348 277733 261271 239125 218021 198473 190185 177635 161761 143211 128077 107448 97390
17831I7390p980m085l020o337m050n324k34M658q98m844K221m227o155J963l147
$$ 97390 89410 85325 82305 75968 71918 66594 66360 71018 70120 65276 67497 63270 57115 59078 55931
17816E5931k943j583N52m50M643k278K733J869m531n37p091l401j009q875p268
$$ 55931 52988 51405 51957 51507 56150 53872 56605 58474 53943 53406 46315 42914 41905 33030 25762
17801B5762L424N642K474k57K193L312j959R83M91L683m120l508P16j97m346n035
$$ 25762 29186 34828 37302 37045 39238 42550 40591 41574 42065 45748 41628 38120 38836 38639 34293 29258
17785B9258j389j164L142M078k423j911p550O125M967J584o165p395j526k384
$$ 29258 27869 26705 29847 33925 31502 29591 22041 28166 33133 34717 28552 21157 19631 17247
17771A7247o826K608J3041M947l089N341J2586p589p170K201K555p05K138k123
$$ 17247 10421 13029 26070 31017 27928 33269 45855 38266 31096 33297 35852 35147 37285 35162
17757C5162N090k583n334j707L099J589l914J550K323M788k183l637M97k020m374
$$ 35162 40252 37669 32335 30628 33727 35316 31402 32952 35275 40063 37880 34243 34740 32720 28346
17742B8346j244Q668K263j705j998O416M637J427l097l787m135m067R79k553J184
$$ 28346 27102 35770 38033 36328 34330 40746 45383 46810 43713 39926 35791 31724 32703 30150 31334
17727C1334N543p64l717M505o67l77N280M969Q08q84j941K416J98M68o916l886
$$ 31334 36877 36113 32396 36901 36234 35857 41137 46106 46914 46030 44089 46505 46703 47171 40255 36369
17711C6369M831K086k06k199K693K10k64K447n479o518O423J0825J935m092n685
$$ 36369 41200 43286 43080 40881 43574 43784 43520 45967 40488 33970 40393 51218 53153 49061 43376
17696D3376J556P52j54J866n547n579N347N321L023Q246k790M59l708j340q94
$$ 43376 44932 45684 45530 47396 41849 36270 41617 46938 49961 58207 55417 55876 52168 50828 49934
17681D9934r79l915r58N195K379k014L475M76l87M874K220K457j184O918k449
$$ 49934 48955 45040 44082 49277 51656 49642 53117 53593 53206 58080 60300 62757 61573 68491 66042
17666F6042l339L43L664R111J3q296K860L138L17l955j197l080m119K342o946
$$ 66042 62703 63046 66710 75821 75834 67538 70398 73536 73853 69898 68701 65621 61502 63844 56898
17651E6898p167J1577R80l271j117j307K463L809K919r29J577l058m747k81M182
$$ 56898 49731 61308 62288 59017 57900 56593 59056 62865 65784 64855 66432 63374 58627 58346 62528
17636F2528k14J521j476o654j717l363j785r952K184N158O546l42n951j433n709
$$ 62528 62314 63835 62359 55705 53988 50625 48840 38888 41072 46230 52776 52434 46483 45050 39341
17621C9341M388r28L003P124J240p634k58j348m070J282J0568n39K816l06O16
$$ 39341 43729 42801 45804 52928 54168 46534 46276 44928 40858 42140 52708 52169 54985 54679 55295
17606E5295m912K452p22m1K5M137M84L044j023l706k798l563j382M492k29K783
$$ 55295 50383 52835 52113 52072 52097 56234 56718 59762 58739 55033 52235 48672 47290 51782 51553 54336
17590E4336M039J388p999j444m011k636P440P506l961k48O068R71J101K732m358
$$ 54336 58375 59763 51764 50320 46309 43673 51113 58619 54658 54410 60478 61449 62550 65282 60924
17575F0924j928n94N101O850k4Q87m074N425R831n976j2118Q685M281l620K760
$$ 60924 58996 58402 63503 70353 70329 71216 67142 72567 82398 76422 64304 72989 77270 73650 76410
17560G6410N274M716k042J773O24O849J944M540J463o528m235o206r060k148Q950
$$ 76410 81684 86400 84358 86131 86755 93604 95548 100088 101551 95023 90788 84582 75522 73374 82324
17545H2324M274L741l97M487Q057K348L760j877o284M343j65k019m415j371M423
$$ 82324 86598 90339 89942 94429 102486 104834 108594 106717 100433 104776 104611 102592 98177 96806 101229
17530A01229M764k351J105j052K926n367j0661n726n123l370N186Q029p700l831
$$ 101229 105993 103642 104747 103695 106621 101254 90593 84867 79744 76374 81560 89589 81889 78058
17516G8058k64r178j2564j428k794j094L767P928r88k911N42K023km617L920J960
$$ 78058 77794 68616 56052 54624 51830 50736 54503 62431 61443 58532 59074 61097 61095 56478 60398 62358
17500F2358P565J359j930l787j302J333Q693j361p871N131L628k878M984J3027
$$ 62358 69923 71282 69352 65565 64263 65596 74289 72928 65057 70188 73816 70938 75922 88949
17486H8949J2213J567l633p516j308M858J114N32O22P896r47Q985P540N138N144
$$ 88949 101162 102729 99096 91580 90272 95130 96244 96776 97398 105294 104347 113332 120872 126010 131154
17471A31154J900N897K461J671M047O595O255l813k978k491K541M982J624J146
$$ 131154 133054 138951 141412 143083 147130 153725 159980 156167 153189 150698 153239 158221 159845 160991
17457A60991q887J501j043q51m104j729K148M528N168R436K508k823L783J3032
$$ 160991 152104 153605 152562 151711 147607 145878 148026 152554 157722 167158 169666 166843 170626 183658
17443A83658K2766L0217J5916K072R12o226j416Q585Q097Q553N457L843k571n100
$$ 183658 206424 236641 252557 254629 255541 249315 247899 256484 264581 273134 278591 282434 279863 274763
17429B74763r876J676O316M935J00l196K863j134K406L071l44O558J3622J7512
$$ 274763 264887 266563 272879 277814 277914 274718 277581 276447 278853 281924 281580 288138 301760 319272
17415C19272K0210J5418K3693K9745K1923K6158L1289K2020J0834J3796J1751
$$ 319272 339482 354900 378593 408338 430261 456419 487708 509728 520562 534358 546109
17404E46109J0723j132p32j638k0588j6315j4615j2265q764k601M473k31O267
$$ 546109 556832 555700 554968 553330 532742 516427 501812 489547 480783 478182 482655 482424 488691
17391D88691J9561J8667K8011M6322L6739L6828L8785L1144K8583K1660R713J4167
$$ 488691 508252 526919 554930 601252 637991 674819 713604 744748 773331 794991 804704 818871
17379H18871J0891k744j0081j6606k0616j5701j8116j7723k5977k2672r939l482
$$ 818871 829762 827018 816937 800331 779715 764014 745898 728175 702198 679526 669587 666105
17367F66105L172M704J472N634K1262K3570K5805K5860K0362J8482K2949L3268
$$ 666105 669277 673981 675453 681087 702349 725919 751724 777584 797946 816428 839377 872645
17355H72645N1205M9020L2955K8792P827j573P727K6630L6718M2877K7235K0576
$$ 872645 923850 972870 1005825 1034617 1042444 1040871 1048598 1075228 1111946 1154823 1182058 1202634
17343A202634J9481K0409L8613O2720O9632O5609N9821O6028Q9993J18917J43228
$$ 1202634 1222115 1242524 1281137 1343857 1413489 1479098 1538919 1604947 1694940 1813857 1957085
17332A957085J63642J61039J56376J42050J61037K21547L00671L95631M73828
$$ 1957085 2120727 2281766 2438142 2580192 2741229 2962776 3263447 3659078 4132906
17323D132906N44674O40494P84186J021717J415630J944738K410978K722989K894798
$$ 4132906 4677580 5318074 6102260 7123977 8539607 10484345 12895323 15618312 18513110
17314A8513110K535066K177903K097682K360217L344314M048887M626703M350540
$$ 18513110 21048176 23226079 25323761 27683978 31028292 35077179 39703882 44054422
17306D4054422K407404J019861n85814j029014j5254P53970J809048J372340M1366
$$ 44054422 46461826 47481687 46895873 45866859 45851605 46605575 48414623 49786963 49828329
17297D9828329r16948k156195j846477r07956J3591N13441M13262K89064L68783
$$ 49828329 48911381 46755186 44908709 44000753 44014344 44527785 44941047 45230111 45598894
17288D5598894J222048K127368L039165K878227J116373q1757j681379j840553
$$ 45598894 46820942 48948310 51987475 54865702 55982075 55900318 54218939 52378386
17280E2378386p38428O1592J024082R3342j590962l176862n000345m955903m287059
$$ 52378386 51639958 51701550 52725632 52818974 51228012 48051150 43050805 38094902 33807843
17271C3807843l387732k435166k229576k286790k640732k838784k586072k227009
$$ 33807843 30420111 27984945 25755369 23468579 20827847 17989063 15402991 13175982
17263A3175982j740120j261175r09309o79014n37485m47857l92961l60498l26628
$$ 13175982 11435862 10174687 9265378 8586364 8048879 7601022 7208061 6847563 6520935
17254F520935l00215k76148k61189k72155k62969k64681k68645k62937k61197
$$ 6520935 6220720 5944572 5683383 5411228 5148259 4883578 4614933 4351996 4090799
17245D090799k44936k31061k22560k12578k02485j90549j82118j67996j58539
$$ 4090799 3845863 3614802 3392242 3179664 2977179 2786630 2604512 2436516 2277977
17236B277977j46173j32206j21809j14280j06626r3094q6653p6555p3357o9295
$$ 2277977 2131804 1999598 1877789 1763509 1656883 1563789 1477136 1400581 1327224 1257929
17226A257929o6598n3990n9777o3751n6398m1888m5951m8312m1541l6348l0360
$$ 1257929 1191331 1137341 1077564 1013813 957415 915527 869576 821264 779723 743375 713015
17215G13015l9663k8196l0559l8059l2375k2053j9796k7657k1128k2874j5436
$$ 713015 673352 645156 614597 576538 544163 522110 502314 474657 453529 430655 415219
17204D15219j4145q515j1335j4084j3933n124P983L44N941M865J5800K0374K3759
$$ 415219 401074 392559 381224 367140 353207 348083 356066 356410 362351 367216 383016 403390 427149
17191D27149K2427J5490J3078L690l253q740j3962k7586l0161k2150j8938k1414
$$ 427149 449576 465066 478144 481834 478581 469841 455879 428293 398132 375982 357044 335630
17179C35630j3273o590p808R233J0511j322J949j689r740l82l829m023q946j2676
$$ 335630 322357 315767 307959 317192 327703 326381 328330 326641 316901 316519 312690 308667 299721 287045
17165B87045m830q198p228j17M429N776J035O065J1236J6052J7533K5794L1763
$$ 287045 282215 274017 266789 266672 271101 276877 277912 283977 295213 311265 328798 354592 386355
17152C86355L0784K8671M2190L8689K9665K1899J4772P794M020j863k6779k7980
$$ 386355 417139 445810 488000 526689 556354 578253 593025 600819 604839 602976 576197 548217
17140E48217l1373l0427l2816m1748l8938k1766j0410j1845k396r0k783J4694
$$ 548217 516844 486417 453601 411853 372915 351149 340739 328894 326498 326408 323625 338319
17128C38319K1814L2010K6532J6070J4876K0738J6170J949j1680j8319m601j1082
$$ 338319 360133 392143 418675 434745 449621 470359 486529 488478 476798 458479 453878 442796
17116D42796k5138l4051l4851k7223k3052j3092k0318j4938j0124m268q962j2732
$$ 442796 417658 383607 348756 321533 298481 285389 265071 250133 240009 235741 226779 214047
17104B14047q100l154J491N793O310J895K764p58l836n234m462m616J897L889
$$ 214047 205947 202793 204284 210077 216387 218282 221046 220288 216452 211218 206756 202140 204037 207926
17090B07926m418j0145r371p642n989k528K825l880o1L87k892J291J134k623k346
$$ 207926 203508 193363 183992 176350 170361 167833 170658 166778 166717 167104 164212 165503 166637 164014 161668
17075A61668m234j626n415l504J150k79P070j375j7390j7046l879k029o207l657
$$ 161668 157434 155808 150393 146889 148039 147760 154830 153455 136065 119019 115140 113111 106904 103247
17061A03247p369o248l81m932M66l700r550k915J485J2202j952o626l293l279
$$ 103247 95878 89630 89249 84317 84783 81083 71533 68618 70103 82305 80353 73727 70434 67155
17047F7155Q86K946j356l251k941r940J515O375O052J006m456J87j977J866P207
$$ 67155 68041 70987 69631 66380 63439 53499 55014 61389 67441 68447 63991 64178 62201 64067 71274
17032G1274J1835l91k013O126J3259J0030J1149J6554K4656K6831L4725M5742
$$ 71274 83109 82718 80705 86831 100090 110120 121269 137823 162479 189310 224035 269777
17020B69777O5963P1782Q9302J03405J09812J15143R0399N7576J4867k5650p4962
$$ 269777 335740 407522 496824 600229 710041 825184 915583 973159 988026 962376 887414
17009H87414r8236j16112j16539j05320q4083n4603m8816l1918j5468o992o558
$$ 887414 789178 673066 556527 451207 367124 312521 263705 231787 216319 209327 202769
16998B02769j10m281o750m294M09R10K496j019o874o14L069k635l321M36O739
$$ 202769 202659 198378 191628 187334 187743 188653 191149 190130 183256 182642 185711 183076 179755 180191 186930
16983A86930J981J026K513M606N368J1443J0819N591J2573J4909P303J537Q815
$$ 186930 188911 189937 192450 197056 202424 213867 224686 230277 242850 257759 265062 266599 275414
16970B75414J0132O563k824k751k833o577n805p791n389r115j2008k986m887J999
$$ 275414 285546 292109 289285 286534 283701 277124 271319 263528 258139 249024 237016 234030 229143 231142
16956B31142N823K646O87J953K79J575O988Q552J3602R735k53K891M348l033l018
$$ 231142 236965 239611 240298 242251 242530 244105 251093 259645 273247 282982 282729 285620 289968 286935 283917
16941B83917o871k44L261m024n220k974o338p020l346k743R360Q518Q524O189
$$ 283917 277046 276802 280063 276039 270819 267845 261507 254487 251141 248398 257758 266276 274800 280989
16927B80989J849j29O410Q832J984Q822L245R70K303P119R942Q632J0395J5143
$$ 280989 282838 282709 289119 297951 299935 308757 312002 312972 315275 322394 332336 340968 351363 366506
16913C66506L114L153J4102Q430N202J2650R105Q872O537Q677Q358J4041J1837
$$ 366506 369620 372773 386875 395305 400507 413157 422262 431134 437671 446348 454706 468747 480584
16900D80584k46K270P200N025J7521J1965Q996J6688K0263J0845J3801J7864J8824
$$ 480584 480338 482608 489808 494833 512354 524319 533315 550003 570266 581111 594912 612776 631600
16887F31600J2069N158J3032K6048K6547L6047L8727M1528M4821N1434O7872P7329
$$ 631600 643669 648827 661859 687907 714454 750501 789228 830756 875577 927011 994883 1072212
16875A072212Q4357Q4818R1134J01789J06567J09210J10635J12582J28068J39400
$$ 1072212 1156569 1241387 1332521 1434310 1540877 1650087 1760722 1873304 2001372 2140772
16865B140772J41557J51468J86680K36032K92192L74870M67183N91915P53356
$$ 2140772 2282329 2433797 2620477 2856509 3148701 3523571 3990754 4582669 5336025
16856E336025R69769J250065J639626K165724K694974L078038L563848M231741
$$ 5336025 6305794 7555859 9195485 11361209 14056183 17134221 20698069 24929810
16848B4929810M852683N316903N152150M699402M864657M790152L746971K584022
$$ 24929810 29782493 35099396 40251546 44950948 49815605 54605757 58352728 60936750
16840F0936750Q10121o0118j99428j492990k925762l759125m179815l619638l096382
$$ 60936750 61746871 61686753 61487325 59994335 57068573 53309448 49129633 45509995 42413613
16831D2413613l006846k296131j329149j57119J114721K095379K877199L141386
$$ 42413613 39406767 37110636 35781487 35624368 36739089 38834468 41711667 44853053
16823D4853053L190273L653106L655844K775680J720452J17264n42836p57430
$$ 44853053 48043326 51696432 55352276 58127956 59848408 59965672 59422836 58665406
16815E8665406k130003l418054m320704m782828m450206m391580m716277m421187
$$ 58665406 56535403 53117349 48796645 44013817 39563611 35172031 30455754 26034567
16807B6034567l849146l191468k599201k249675j877269j413563j029692p69707
$$ 26034567 22185421 18993953 16394752 14145077 12267808 10854245 9824553 9054846
16799I054846o02287m94482m13588l50303l13467k96240k69599k51617k43370
$$ 9054846 8452559 7958077 7544489 7194186 6880719 6584479 6314880 6063263 5819893
16790E819893k51435k53789k52512k47752k47879k49105k57346k41998k38609
$$ 5819893 5568458 5314669 5062157 4814405 4566526 4317421 4060075 3818077 3579468
16781C579468k30367k18493k00355k00705j84940j64570j57142j38685j29444
$$ 3579468 3349101 3130608 2930253 2729548 2544608 2380038 2222896 2084211 1954767
16772A954767j27173j09177j02807r1011p8049p9510q1677p1684o7728o4510n4051
$$ 1954767 1827594 1718417 1615610 1524599 1446550 1367040 1285363 1213679 1145951 1081441 1027390
16761A027390m6531m3891m8154m9017m0620l8789l9553l7798l6301l4247k6243
$$ 1027390 980859 936968 888814 839797 799177 760388 720835 683037 646736 612489 586246
16750E86246k9037k4083j7948j9431j4530j4211j4037q310p804N08J814o05R552
$$ 586246 557209 533126 515178 495747 481217 467006 452969 444659 436855 437363 439177 438572 448124
16737D48124J694K273P889K1094J8855K0908J7906R040j112q513q375k927J728
$$ 448124 449818 452091 459980 481074 499929 520837 538743 547783 546671 538158 529783 526856 528584
16724E28584O796L69q941j5807k0934k0003j3269o422k01k04n274p841o717n21
$$ 528584 535380 535749 526808 511001 490067 470064 456795 450373 450172 449968 444694 436853 430136 429615
16710D29615J237K825n886j7827j8031p466P614L772j290j0049j5822j6677j3314
$$ 429615 430852 433677 427791 409964 391933 384467 392081 395853 394563 384514 368692 352015 338701
16697C38701j7418j3912j3603j3735j6299k0560j3026j8135k1428j5309o201n780
$$ 338701 321283 307371 293768 280033 263734 243174 230148 212013 190585 175276 169075 163295
16685A63295l599j1642j1646o981j725q27o687j2352p452J459O05K603M644n862
$$ 163295 159696 148054 136408 129427 127702 126875 120188 107836 100384 101843 102448 105051 109695 103833
16671A03833l109o362k935j012K253N421J591L833m820n969m336n105L540J0616
$$ 103833 100724 94362 91427 90415 92668 98089 99680 103513 98693 92724 88388 83283 86823 97439
16657I7439K573Q869L73j658L156J318J60M755K698m91q63n126l795k974K483
$$ 97439 100012 108881 109254 107596 110752 112070 112230 116985 119683 119192 118329 113203 109408 106434 108917
16642A08917M305j573n018j599j394j118k317k259l254p274l813N993m858m814
$$ 108917 113222 111649 106631 105032 103638 102520 100203 97944 94690 87416 83603 89596 84738 79924
16628G9924J648k577l224l991O366L120Q35J316J85k821o970K928j692r497k664
$$ 79924 81572 78995 75771 71780 78146 81266 82101 83417 83602 80781 73811 76739 75047 65550 62886
16613F2886m411j04p845jo89Q17J525l324q03M64l504n408l075k48k241p682o823
$$ 62886 58475 58371 50526 50525 49836 50653 52178 48854 48051 48515 45011 39603 36528 36280 34039 26357 19534
16596A9534m993M983j630j330p13K469j781m663P71J954M465j543o52L861n56
$$ 19534 14541 19524 17894 16564 15851 18320 16539 11876 12647 14601 19066 17523 16871 20732 20176
16581B0176p500m9m555r251p380n091P250N727L147L530M11K152k423K54J541
$$ 20176 12676 12627 8072 -1179 -8559 -13650 -6400 -673 2474 6004 6415 8567 6144 6398 7939
16566G939j1263m357Q304K554k860J918J0084P757l312q675k831J078m22L125
$$ 7939 -3324 -7681 623 3177 317 2235 12319 20076 16764 8089 5258 6336 5914 9039
16552I039R61k341j853n142J19L710o084k017L978O26L175J610L0K703p7j97l398
$$ 9039 10000 7659 5806 664 783 4493 -1591 -3608 370 996 4171 5781 5811 8514 8437 8240 4842
16535D842O406k811l055P259L216J115j381k575k89M640J888j165k881n879j0207
$$ 4842 11248 8437 5382 12641 15857 16972 15591 13016 12727 17367 19255 18090 15209 9330 -877
16520h77M406P105K663K985k44o442k008J0870K886n593J683J159k246j335j955
$$ -877 3529 10634 13297 16282 16038 9596 7588 18458 21344 15751 17434 18593 16347 15012 13057
16505A3057n382N38k50l08L226k076O392J1121J683J418n31m745L006k527m371
$$ 13057 7675 8213 7963 7655 10881 8805 15197 26318 28001 29419 28888 24143 27149 24622 20251
16490B0251J00l40k116p62K05n555l757o911J035M551K330O644q52n68l455l712
$$ 20251 20351 20011 17895 17133 17338 11783 8026 1115 2150 6701 9031 15675 14823 14255 10800 7088
16474G088M88K476m741n322j760k20r549o29J247J0257O417m061k367Q42m246
$$ 7088 7576 10052 5311 -11 -1771 -1991 -11540 -12169 -10922 -665 5752 1691 -676 166 -4080
16459d080l252K372N067O581O65n147N003Q75j105n376J32k635k946L889K16k99
$$ -4080 -7332 -4960 107 6688 7353 2206 7209 8084 6979 1603 1735 -900 -3846 43 259 -40
16443d0K186O96j295m828k687J315q4l017m991j956o39O319K697M254l370j690
$$ -40 2146 2842 1547 -3281 -5968 -4653 -4737 -7754 -12745 -14701 -15340 -9021 -6324 -2070 -5440 -7130
16427g130P135N241o756q447n051o329J405O951L684L318K745q13l498l762J466
$$ -7130 5 5246 -1510 -9957 -15008 -21337 -19932 -12981 -9297 -5979 -3234 -4047 -7545 -11307 -9841
16412i841J911p34N006O121l702n665L320o089j1572o1N80M138j358N24N205J927
$$ -9841 -7930 -8664 -3658 2463 -1239 -6904 -3584 -9673 -21245 -21306 -20726 -16588 -17946 -17422 -12217 -10290
16396a0290J921l79m56J663J257N579J047k012k749p28N973L801o83L937J594
$$ -10290 -8369 -8748 -9204 -7541 -6284 -705 342 -1670 -4419 -5147 826 4627 3944 7881 9475
16381I475m176J447o540J299o06K853M073k74K32p018n561P943K742l64j789K958
$$ 9475 5299 6746 206 1505 899 3752 7825 7551 7783 765 -4796 3147 5889 5525 3736 6694
16365F694L306J326j092l148K426j841n497J369o9J705M768j429l98k00L874J499
$$ 6694 10000 11326 10234 7086 9512 7671 2174 3543 3474 5179 9947 8518 8120 7920 11794 13293
16349A3293m1j044l885M778Q644n376p694q683l955k972N888j940l866j600J861
$$ 13293 13252 12208 8323 13101 21745 16369 8675 -8 -3963 -6935 -1047 -2987 -6853 -8453 -6592
16334f592M502l871K935j247m573L13N072N398k147n32l539M15K20L099M522m58
$$ -6592 -2090 -5961 -3026 -4273 -8846 -8533 -3461 1937 -210 -742 -4281 -3866 -3646 -547 3975 3517
16318C517j961K2L824P129M784j1792q487L171K97K01N589J51J265k731R90J090
$$ 3517 1556 1578 5402 12531 17315 5523 -2964 207 504 705 6294 6445 7710 4979 5969 7059
16302G059j239k328O333K188M008J485L67L401M267m122k771j820j972P448P498
$$ 7059 5820 3492 9825 12013 16021 17506 17873 21274 25541 21419 18648 16828 14856 22304 29802
16287B9802R306R125J0485R956J1577K3506K5902K0695K6770K8969K3772K0692
$$ 29802 39108 48233 58718 68674 80251 103757 129659 150354 177124 206093 229865 250557
16275B50557K9228J9962J4577J3201L362k35q06j2025k3877k5228j9536j6856
$$ 250557 279785 299747 314324 327525 330887 330652 329846 317821 293944 268716 249180 232324
16263B32324j4282j3785p567J027j032O928J3837J2349K7596J8286J2384J8631
$$ 232324 218042 204257 196690 197717 196685 203613 217450 229799 257395 275681 288065 306696
16251C06696J2484J90q11P6r317j5596k4479k7899k4837j7538k4404k7153j5879
$$ 306696 319180 319370 318559 318635 309318 293722 269243 241344 216507 198969 174565 147412 131533
16238A31533j8006j5822j9193j3190j0311m933l522N06j294j632J463o127p514
$$ 131533 113527 97705 78512 65322 55011 50078 46556 47062 45768 44136 45599 39472 31958
16225C1958k138k642j5j138j679l650o065j071n355k834j244K249Q90n096j368
$$ 31958 29820 27178 27163 26025 24346 20696 14631 13560 8205 5371 4127 6376 7266 2170 802
16210H02M614M02q229k704m488j623O608J282k814K188n33K288K295q54m229l314
$$ 802 5416 5818 -2411 -5115 -9603 -11226 -4618 -3336 -6150 -3962 -4495 -2207 88 -766 -4995 -8309
16194h309L349l019l488j371j559j537K867J1290O434r237j4272l359L129R39
$$ -8309 -4960 -7979 -11467 -12838 -14397 -15934 -13067 -1777 4657 -4580 -18852 -22211 -19082 -18143
16180a8143P173L84j602j51j639J961N908k367m797m347J569K648M708Q536k102
$$ -18143 -10970 -10586 -12188 -12339 -13978 -12017 -6109 -8476 -13273 -17620 -16051 -13403 -8695 -159 -2261
16165b261l254r4M60M85m547k67l26l682o897J183O055M235L134J0225M56m125
$$ -2261 -5515 -5609 -5149 -4664 -9211 -9478 -9804 -13486 -20383 -19200 -13145 -8910 -5776 4449 4905 780
16149G80l735q073n373J372O720K053K137Q118N34L129n722l072j556k114M96
$$ 780 -2955 -11028 -16401 -15029 -8309 -6256 -4119 3999 4533 7662 1940 -1132 -2688 -4802 -4306
16134d306J607N715m068r691m381k718M551L645k133N711K607k321J139L952l458
$$ -4306 -2699 3016 -1052 -10743 -15124 -17842 -13291 -9646 -11779 -6068 -3461 -5782 -4643 -691 -4149
16119d149k052K371l563J520O635k852j208L35O61p646k053L240L301J823K933
$$ -4149 -6201 -3830 -7393 -5873 762 -2090 -3298 -2963 -2302 -9948 -12001 -8761 -5460 -3637 -704
16104g04N715K60j1729n691j249K479Q00m044m315M672O671P261p148M46O442
$$ -704 5011 5271 -6458 -12149 -13398 -10919 -10119 -14163 -18478 -13806 -7135 126 -7022 -6576 -134
16089a34p91l916j803Q14l409K713L462j96l742N61K675J076J276J374j433l190
$$ -134 -925 -4841 -6644 -5830 -9239 -6526 -3064 -3260 -7002 -6441 -3766 -2690 -1414 -40 -1473 -4663
16073d663l886o974P958P994n282n916m16P50k170L889R957l64m802l682m865
$$ -4663 -8549 -15523 -7565 429 -4853 -10769 -11185 -10435 -12605 -8716 1241 877 -3925 -7607 -12472
16058a2472K82J283K58m767k911M221K716q826n822P067N050J033j937P944J257
$$ -12472 -12190 -10907 -10649 -15416 -18327 -14106 -11390 -20216 -26038 -18971 -13921 -12888 -14825 -6881 -5624
16043e624K452m940l677k410M273K862j160J852J11n372l863j0065O483M680Q974
$$ -5624 -3172 -8112 -11789 -14199 -9926 -7064 -8224 -6372 -6261 -11633 -15496 -25561 -19078 -14398 -5424
16028e424J315K546k1n507J690j712o671k785N11M774N178K490k025l702m413
$$ -5424 -4109 -1563 -1584 -7091 -5401 -7113 -13784 -16569 -16058 -11284 -6106 -3616 -5641 -9343 -13756
16013a3756Q00N065j235k560l948l365j598P731M091l251J500l050j526k602J258
$$ -13756 -12956 -7891 -9126 -11686 -15634 -18999 -20597 -12866 -8775 -12026 -10526 -13576 -15102 -17704 -16446
15998a6446N71M327j628p547j630P180P746N161l646m647l855p1J30m92l666K147
$$ -16446 -15875 -11548 -13176 -20723 -22353 -15173 -7427 -2266 -5912 -10559 -14414 -14485 -14355 -14847 -18513 -16366
15982a6366P592j39k845M49Q513L441r458r992N839L24m083N90K140J554L384
$$ -16366 -8774 -8913 -11758 -11309 -2796 645 -8813 -18805 -12966 -12642 -16725 -16135 -13995 -12441 -9057
15967i057L79j252j78q59P43M239J639l188K05k645j89K252j332K081K345l253
$$ -9057 -8678 -9930 -10108 -10967 -10224 -5985 -4346 -7534 -7329 -9974 -10163 -7911 -9243 -7162 -4817 -8070
15951h070k050M033K97j760n474k092m876P302P542M51J681q045m372l547J932
$$ -8070 -10120 -6087 -5790 -7550 -13024 -15116 -19992 -12690 -5148 -4697 -3016 -11061 -15433 -18980 -17048
15936a7048P211J924M943J728m5n722k855m347K476M639O948O81l887O142L682
$$ -17048 -9837 -7913 -2970 -1242 -1287 -7009 -9864 -14211 -11735 -7096 -148 533 -3354 2788 6470
15921F470j0023n741n083k582N712K374j053p71L200J106l018J692M722m926l639
$$ 6470 -3553 -9294 -14377 -16959 -11247 -8873 -9926 -10697 -7497 -6391 -9409 -7717 -2995 -7921 -11560
15906a1560k114O22l930j045K140K337p74k32N564J381Q286j157j0345J100Q892
$$ -11560 -13674 -13052 -16982 -18027 -15887 -13550 -14324 -14556 -8992 -7611 675 -482 -10827 -9727 -835
15891h35O999l946j81q233r233j0698N399R340l412N62P094J113j262j427K39
$$ -835 6164 2218 2037 -6196 -15429 -26127 -20728 -11388 -14800 -14238 -7144 -6031 -7293 -8720 -8481
15876h481J491j189l148q361K990J824O900K550r43K916J773l925o885K299N517
$$ -8481 -6990 -8179 -11327 -19688 -16698 -14874 -7974 -5424 -6367 -3451 -1678 -5603 -12488 -10189 -4672
15861d672L404k749J138m61M53J520R76L325j817m274p992n76J874O38p56M6Q38
$$ -4672 -1268 -4017 -2879 -3340 -2887 -1367 -391 2934 1117 -3157 -11149 -11725 -9851 -9213 -9969 -9923 -9085
15844i085J675J831N02J559k891p882k774J754N091O922L597j404k773L675j126
$$ -9085 -7410 -5579 -5077 -3518 -6409 -14291 -17065 -15311 -10220 -3298 299 -1105 -3878 -203 -1329
15829a329n497K777J467k883J614l476m190J1969K619p54o235m100m611K57m281
$$ -1329 -6826 -4049 -2582 -5465 -3851 -7327 -11517 452 3071 2317 -3918 -8018 -12629 -12372 -16653
15814a6653l831k56K414M346O828p90p21J497J677l887r627j513j447R502P989
$$ -16653 -20484 -20740 -18326 -13980 -7152 -7942 -8663 -7166 -5489 -9376 -19003 -20516 -21963 -12461 -4472
15799d472l491n413K665q86m036L825Q349K555K30L45k665j65n711l133l29M216
$$ -4472 -7963 -13376 -10711 -11597 -15633 -11808 -3459 -904 -674 -329 -2994 -3159 -8870 -12003 -12332 -8116
15783h116J620L041l699m15L009n189n168R2m171L324K341J180l083J872N432
$$ -8116 -6496 -3455 -7154 -7569 -4560 -9749 -14917 -14825 -18996 -15672 -13331 -12151 -15234 -13362 -7930
15768g930K322l049N71O476l747l961P031J243m848J088M935N668l133l217q960
$$ -7930 -5608 -8657 -8086 -1610 -5357 -9318 -2287 -1044 -5892 -4804 131 5799 2666 -551 -9511
15753i511m789l9J0220K03k455l455M938L586p731m147K595O50K728j50J748k831
$$ -9511 -14300 -14339 -4119 -3916 -6371 -9826 -4888 -1302 -9033 -13180 -10585 -9935 -7207 -7357 -5609 -8440
15737h440j826k617J052L966N358M171m441m794k328Q77K901l60J286j843J5k962
$$ -8440 -10266 -12883 -11831 -7865 -2507 1664 -2777 -7571 -9899 -9022 -6121 -6481 -5195 -7038 -7023 -9985
15721i985m637j704K679R659K326m786N3J500M345l416K62J633n341l283P13J490
$$ -9985 -14622 -16326 -13647 -3988 -1662 -6448 -6395 -4895 -550 -3966 -3704 -2071 -7412 -10695 -9982 -8492
15705h492n7k159K24L686N983k208K468K8l665n436O815l188n514J305Q53k632
$$ -8492 -8549 -10708 -10484 -6798 -815 -3023 -555 -527 -4192 -9628 -2813 -6001 -11515 -10210 -9357 -11989
15689a1989K02J165P41J681n45K992L09j108o238M30l133J58O550O233j389L578
$$ -11989 -11787 -10622 -9881 -8200 -8745 -5753 -5444 -6552 -12790 -12360 -15493 -15335 -8785 -2552 -3941 -363
15673c63N653j581o989N154j647K383K925o344j1455n22R85k524n85j902L08O255
$$ -363 5290 3709 -3280 1874 227 2610 5535 -809 -12264 -12786 -11801 -14325 -14910 -16812 -16504 -10249
15657a0249M814J174L150K022L492J673l090p191j430l172o115o284K384J526
$$ -10249 -5435 -4261 -1111 911 4403 6076 2986 -4205 -5635 -8807 -14922 -21206 -18822 -17296
15643a7296M004J0483K151l501N114k977l549n100l649l36O0J682M701L814O111
$$ -17296 -13292 -2809 -658 -4159 955 -2022 -5571 -10671 -14320 -14656 -14596 -12914 -8213 -4399 1712
15628A712N84m485n594M530M567j185n931K520j764l957M2M286L512K353j745
$$ 1712 2296 -2189 -7783 -3253 1314 129 -5802 -3282 -5046 -9003 -8961 -4675 -1163 1190 -555
15613e55P52k509J193O64p46N51m979l500K5l453M330R92j387L025q33j397m328
$$ -555 197 -2312 -1119 -455 -1201 -650 -5629 -9129 -9104 -12557 -8227 -7235 -8622 -5597 -6430 -7827 -12155
15596a2155J008Q845l44j805N666l453n256j262P541M638l099L619L664L428j801
$$ -12155 -11147 -2302 -2646 -4451 1215 -2238 -7494 -8756 -1215 3423 324 3943 7607 11035 9234
15581I234o462p857Q150o19n507L458k472j963J715K48J065Q64l127J842J339
$$ 9234 2772 -5085 3065 2446 -3061 397 -2075 -4038 -2323 -2075 -1010 -146 -3273 -1431 -92
15566i2J084O103n81m42L838n185j71N941j277p461o20l44l258n048K034K927
$$ -92 992 7095 6514 6072 9910 4725 4554 10495 9218 1757 1137 793 -2465 -7513 -5479 -2552
15550b552j46K235M24l889q906J583Q173J128r415p355R999J86j723L448n034
$$ -2552 -2698 -463 -39 -3928 -12834 -11251 -3078 -1950 -11365 -18720 -8721 -8535 -10258 -6810 -11844
15535a1844r76l845L131Q652L643m492l862j967m348k059J111Q011M565N326L2
$$ -11844 -12820 -16665 -13534 -4882 -1239 -5731 -9593 -11560 -15908 -17967 -16856 -8845 -4280 1046 1078
15520A078j618P71j16J320p120m52O149K703n644k682k934j411K012j048K722
$$ 1078 -540 231 115 1435 -5685 -6137 12 2715 -2929 -5611 -8545 -9956 -7944 -8992 -6270
15505f270O40M666j099L859o979J228k260j587j862k631P389n773m928l475K123
$$ -6270 -5630 -964 -2063 1796 -5183 -3955 -6215 -7802 -9664 -12295 -4906 -10679 -15607 -19082 -16959
15490a6959K418q09k604m41M028Q387K014O07m423n760Q94n784N584J0609L947
$$ -16959 -14541 -15350 -17954 -18395 -14367 -5980 -3966 -3359 -7782 -13542 -12648 -18432 -12848 -2239 1708
15475A708q27l737j913K628R16j875m054P325Q06m044j276L119K002n64l090l300
$$ 1708 881 -2856 -4769 -2141 -1225 -3100 -7154 171 977 -3067 -4343 -1224 778 214 -2876 -6176
15459f176L825K202M674J241o100o941J606M639K593M476pk668m409o661m583
$$ -6176 -2351 -149 4525 5766 -334 -7275 -5669 -1030 1563 6039 6032 3364 -1045 -7706 -12289
15444a2289l513p42j689O003L877J050K553J936k160K47L761j264j310L147M987
$$ -12289 -15802 -16544 -18233 -12230 -8353 -7303 -4750 -2814 -4974 -4727 -966 -2230 -3540 -393 4594
15429D594N970m000k477K99K004P30p098m574OK664n356l984M715K650N958m778
$$ 4594 10564 6564 4087 4386 6390 7120 22 -4552 -4546 -1882 -7238 -11222 -6507 -3857 2101 -2677
15413b677q588L890k109K987J320o82j139j312r95K227j54l093j918M263K642
$$ -2677 -11265 -7375 -9484 -6497 -5177 -5859 -6998 -8310 -9305 -7078 -7232 -10325 -12243 -7980 -5338
15398e338k172M425k348j279M232L715j197l997K052k445J674n354m475K149P236
$$ -5338 -7510 -3085 -5433 -6712 -2480 1235 38 -3959 -1907 -4352 -2678 -8032 -12507 -10358 -3122
15383c122m8K354M253j934j600p506k707O764P072J481l869q525K061M748J808
$$ -3122 -3170 -816 3437 1503 -97 -7603 -10310 -3546 3526 5007 1138 -7387 -5326 -578 1230
15368A230l620J585j832j12M302K799M268q33m541m247q108J924J173K296m405
$$ 1230 -2390 -805 -2637 -2749 1553 4352 8620 7787 3246 -1001 -9109 -7185 -6012 -3716 -8121
15353h121m217k332P903O679j810m725l50M197M268l758k155n114l726j831N805
$$ -8121 -12338 -14670 -6767 -88 -1898 -6623 -6973 -2776 1492 -2266 -4421 -9535 -13261 -15092 -9287
15338i287l144n327K971Q72Q28J1029K691k587k594n148M040o53k626m856j798
$$ -9287 -12431 -17758 -14787 -13915 -13087 -2058 633 -1954 -4548 -9696 -5656 -6309 -8935 -13791 -15589
15323a5589M222Q079j147L283k515p07P056K069k237R12M887o480q693k669m114
$$ -15589 -11367 -3288 -4435 -1152 -3667 -4374 2682 4751 2514 3426 8313 1833 -6860 -9529 -13643
15308a3643J396N185n81m107n228L219N553K782O353R12J772n777o727J587J111
$$ -13643 -12247 -7062 -7643 -11750 -16978 -13759 -8206 -5424 929 1841 3613 -2164 -8891 -7304 -6193
15293f193l479m893K036l6o02O689N138l333k208k646L664q24L94m59J824n264
$$ -6193 -9672 -14565 -12529 -12565 -13167 -6478 -1340 -4673 -6881 -9527 -5863 -6687 -6293 -6752 -4928 -10192
15277a0192j254N27L389K529n04J110M577L608j198n348k715j518K877k541N945
$$ -10192 -11446 -10919 -7530 -5001 -5505 -4395 182 3790 2592 -2756 -5471 -6989 -4112 -6653 -708
15262g08J0O74k518k759N58L991k16p316k900J1007O262J754l726j5183j0835
$$ -708 -698 -24 -2542 -5301 -4743 -752 -968 -8284 -11184 -177 6085 7839 4113 -11070 -21905
15247b1905N357J04L982J0942N72m793k395O69O83n28J64N408J297n37K155k45
$$ -21905 -16548 -16444 -12462 -1520 -948 -5741 -8136 -7467 -6784 -7312 -7148 -1740 -443 -980 1175 930
15231I30r2L017Q01k536j937Q86q73K98P123K169k747j029l523j359K610P504
$$ 930 838 3855 4656 2120 183 1069 196 494 7617 9786 7039 6010 2487 1128 3738 11242
15215A1242l17q65L38p235J174J288k788k673k676n277M43L304k425l99O093O07
$$ 11242 10925 10060 10398 3163 4337 5625 2837 164 -2512 -7789 -7346 -4042 -6467 -6866 -773 -166
15199a66K003K498J276j912p93M313J618p990n510J47J161N572M55M538J108o303
$$ -166 1837 4335 5611 3699 2906 7219 8837 847 -4663 -4516 -3355 2217 2672 7210 8318 2015
15183B015l379M510j251o477M29M115J172L887k34j921p44p038k885K052O187
$$ 2015 -1364 3146 1895 -4582 -4153 -38 1134 5021 4787 2866 2122 -4916 -7801 -5749 438
15168D38J422k785l494j651m132L522P445M747R675q479o530j15l180n57k213
$$ 438 1860 -925 -4419 -6070 -10202 -6680 765 5512 15187 6708 178 63 -3117 -3674 -5887
15153e887j63M583O12M62l119j246j682K776K60k042J003N919j786L800o654k198
$$ -5887 -6050 -1467 -855 -393 -3512 -4758 -6440 -3664 -3404 -5446 -4443 1476 -310 3490 -3164 -5362
15137e362N256O059J306m883m777L302L345o58k00J46L713Q059p5o767M42k230
$$ -5362 -106 5953 7259 2376 -2401 901 4246 3588 3388 3534 7247 15306 15231 8464 8906 6676
15121F676j767K80J902n257m254j421N54J122J996k768J046j438J460J290M235
$$ 6676 4909 5189 7091 1834 -2420 -3841 -3287 -2165 -169 -2937 -1891 -3329 -1869 -579 3656
15106C656j656P93K747j70p998j571o365J488M181L959P237k246n604l773K927
$$ 3656 2000 2793 5540 5370 -2628 -4199 -10564 -9076 -4895 -936 6301 4055 -1549 -5322 -2395
15091b395M49K272j76m496n327m682k738K466Q988P652m605n190o665O693M284
$$ -2395 -1946 326 150 -4346 -9673 -14355 -17093 -14627 -5639 2013 -2592 -7782 -14447 -7754 -3470
15076c470M277L415m540j673N871m485m820j428m27M221L325Q16q04P04P033l253
$$ -3470 807 4222 -318 -1991 3880 -605 -5425 -6853 -7280 -3059 266 1082 278 982 8015 4762
15060D762l182O895K033k004k366l872J538l558J252K96l422M797K523m881m20
$$ 4762 1580 8475 10508 8504 6138 2266 3804 246 1498 1794 -1628 3169 5692 811 391
15045C91m896k155P261J0952j211m750n874m148O203L217J280k416o57N10J429
$$ 391 -4505 -6660 601 11553 10342 5592 -282 -4430 1773 4990 6270 3854 3197 3707 5136
15030E136O453o04k231O00n896M397K506m528n36J848N23J278k455j973j119n546
$$ 5136 11589 10985 8754 9354 3458 7855 10361 5833 5297 7145 7668 8946 6491 4518 3399 -2147
15014b147M073P308p45N284N598m427k118m677J103j709M431K50k390K50j622
$$ -2147 1926 9234 8489 13773 19371 14944 12826 8149 9252 7543 11974 12224 9834 10084 8462
14999H462Q12J923n438J178K819m62n4J382N89J8m712j626o41K216k659k355k711
$$ 8462 9274 11197 5759 6937 9756 9294 9240 10622 11211 11229 6517 4891 4250 6466 3807 1452 -1259
14982a259o40K663J060N31M359L123r00k969n150q396N219N45m998J331O325J267
$$ -1259 -1899 764 1824 2355 6714 9837 8937 5968 818 -7578 -2359 -1814 -6812 -5481 844 2111
14966B111r041j730J0652P256N953J013n641n674P97N326R47k376q350j915M169
$$ 2111 -6930 -8660 1992 9248 15201 16214 10573 4899 5696 11022 11969 9593 1243 -672 3497
14951C497j219O243J16p47L801l925p191O745J571n616o601l338K710J453L820
$$ 3497 2278 8521 8637 7890 11691 7766 575 7320 8891 3275 -3326 -6664 -3954 -2501 1319
14936A319Q22P05J534J160n107K46r7m407k017N289j366j570n07L3R648k681n867
$$ 1319 2141 2846 4380 5540 433 679 582 -3825 -5842 -553 -1919 -3489 -3996 -3963 5685 3004 -2863
14919b863n371Q748L364J1483N50j4232o55M574n397K121k505K655r28J638M535
$$ -2863 -8234 514 3878 15361 15911 1679 1024 5598 201 2322 -183 2472 1544 3182 7717
14904G717k232j074L207J164l569j665k031n5J661Q54L185j74n190N439k076j297
$$ 7717 5485 4411 7618 8782 5213 3548 1517 1462 3123 3977 7162 6988 1798 7237 5161 3864
14888C864L408l001M304L869K022k748j0862m102N663L090K47J659P56J340J104
$$ 3864 7272 4271 8575 12444 14466 11718 856 -3246 2417 5507 5754 7413 8169 9509 10613
14873A0613J81J400p256l261k51K755L509q504q558K234L609P757l488l334J97
$$ 10613 10794 12194 4938 1677 1426 4181 7690 -814 -9372 -7138 -3529 4228 740 -2594 -2397
14858b397J271L798O397K535l695l457K679l16mk259K49O15m520M476M434m663
$$ -2397 -1126 2672 9069 11604 7909 4452 7131 6815 6811 4552 4801 5416 896 5372 9806 5143
14842E143J79k148l740K15N499J2703l786j855j038l371r504O45N607L48j299
$$ 5143 5322 3174 -566 -351 5148 17851 14065 12210 11172 7801 -1703 -1058 4549 4897 3598
14827C598P00L309p201n454N445m05M27j940J841P851N657k512J18l238n516K88
$$ 3598 4298 7607 406 -5048 397 -8 419 -1521 320 8171 13828 11316 11434 8196 2680 2968
14811B968K125q103l635M88K094j321K625N493M326j614k132K240l372q003l040
$$ 2968 5093 -3010 -6645 -6157 -4063 -5384 -2759 2734 7060 5446 3314 5554 2182 -5821 -8861
14796h861N510J959l206M14O231L355j003l668K387N579J227o12M582n88m717
$$ -8861 -3351 -1392 -4598 -4184 2047 5402 4399 731 3118 8697 9924 9312 13894 13306 8589
14781H589n977j892J149r33k31J242j480J472K324J597O1n116K75L611k288j632
$$ 8589 2612 720 1869 936 705 1947 467 1939 4263 5860 5921 805 1080 4691 2403 771
14765G71O575J1826J034k389k108J282o077n452o55l442j169K341O47L204r36
$$ 771 7346 19172 20206 17817 15709 16991 10914 5462 4807 1365 196 2537 3184 6388 5452
14750E452m293l781M502N212p235M21O868M769r689p220k315J997O726J503r09
$$ 5452 1159 -2622 1880 7092 -143 278 7146 11915 2226 -4994 -7309 -5312 1414 2917 2008
14735B008l311o737M810L899L882l808p455M466M699o276N770M524p559m12N637
$$ 2008 -1303 -8040 -3230 669 4551 743 -6712 -2246 2453 -3823 1947 6471 -1088 -1500 4137
14720D137N48J210L509J906L01m69m8k048m565j436L899J269q830R31N770K130
$$ 4137 4685 5895 9404 11310 11611 11142 11094 9046 4481 3045 6944 8213 -617 314 6084 8214
14704H214o502o662P603J214K571K468J880l608o228L118K392n373L524K01J256
$$ 8214 1712 -4950 2653 3867 6438 8906 10786 7178 950 4068 6460 1087 4611 4812 6068
14689F068l089J112M933p41k843j401M69j98k181j727L077l09K447o33K45k301
$$ 6068 2979 4091 9024 8283 5440 4039 4508 4310 2129 402 3479 3170 5617 4984 5229 2928
14673B928m773j079K195J487L231M42n35m609m48J21J63K380J0287j917j037l908
$$ 2928 -1845 -2924 -729 758 3989 4431 3896 -713 -1161 -1040 -877 1503 11790 9873 8836 4928
14657D928n945K162Q204N501M169J046n562l259j445l0p330m510l823o742k73
$$ 4928 -1017 1145 9349 14850 19019 20065 14503 11244 9799 9769 2439 -2071 -5894 -12636 -12909
14642a2909L337R960J894l805r66n41J525N399J254o794L691L742o2m650L69L23
$$ -12909 -9572 388 2282 -1523 -2489 -3030 -1505 3894 5148 -1646 2045 5787 5725 1075 1444 1767
14626A767o840l816O882P827P912P13q31n500j1962p285K272N006L783L098J708
$$ 1767 -5073 -8889 -2007 5820 13732 14445 13614 8114 -3848 -11133 -8861 -3855 -72 3026 4734
14611D734M734J431J806j674j764P932K340j882q49n839m078N842N292j939k88
$$ 4734 9468 10899 12705 11031 9267 17199 19539 17657 16808 10969 6891 12733 18025 16086 15798
14596A5798r2m884k992L409J60n563l423m576L374O334K940K61L196j45l23J730
$$ 15798 15706 10822 7830 11239 11399 5836 2413 -2163 1211 7545 10485 10746 13942 13797 13474 15204
14580A5204P335P99m850j168l507l97p07o425r447L495R894m591J191M355q14
$$ 15204 22539 23338 18488 17320 13813 13416 12709 6284 -3163 332 10226 5635 6826 11181 10367
14565A0367j621p95q03m389m880L28N560M577l693j280J364P70m649m79O899M643
$$ 10367 8746 7951 7148 2759 -2121 -1793 3767 8344 4651 3371 4735 5505 856 377 7276 11919
14549A1919L565L839L44o763l572j766m521r67R565N992o211p95k332O12K436
$$ 11919 15484 19323 19667 12904 9332 7566 3045 2078 11643 17635 11424 10629 8297 8909 11345
14534A1345k618O988N098Q970J164o290n002r346J023N137r354P411M469m264
$$ 11345 8727 15715 20813 29783 30947 24657 19655 10309 11332 16469 7115 14526 18995 14731
14520A4731j141m15K842M084j096o660K020l572J912P064q790p044l879L156L455
$$ 14731 13590 13175 16017 20101 19005 12345 14365 10793 12705 19769 10979 3935 56 3212 6667
14505F667k476l971N969R099o76n593n788Q25o23J390K54N122M812R9p996n599
$$ 6667 4191 220 6189 15288 14612 9019 3231 4056 3433 4823 5077 10199 15011 15110 7114 1515
14489A515l156k659n15O534n36L820L590N915o092n283K14J758n372n520R138
$$ 1515 -1641 -4300 -4815 1719 1183 5003 8593 14508 8416 3133 3347 5105 -267 -5787 3351
14474C351K583m390J159J360J721Q797j551k935k188o33N368j167o300M791L489
$$ 3351 5934 1544 2703 4063 5784 14581 13030 10095 7907 7274 12642 11475 5175 9966 13455
14459A3455q11p461o207N432N079N363M347k426Q50j698o673j784O831J915M456
$$ 13455 12644 5183 -1024 4408 9487 14850 19197 16771 17621 15923 9250 7466 14297 16212 20668
14444B0668j121l102m265m391K688K863k190m211N871M272n604l245N712K542
$$ 20668 19547 16445 12180 7789 10477 13340 11150 6939 12810 17082 11478 8233 13945 16487
14430A6487o813q234M426O409K9k22K348K311M368n576M550J165k51k465j500
$$ 16487 9674 1440 5866 12275 12304 12082 14430 16741 21109 15533 20083 21248 20997 18532 17032
14415A7032k444j680m26J16j631K846j313K604P278L186n128o701k617K059N04
$$ 17032 14588 12908 12482 12598 10967 13813 12500 15104 22382 25568 20440 13739 11122 13181 13685
14400A3685l734k079L902J0992k375m721K031k153p8J592l254k213N995O857o822
$$ 13685 9951 7872 11774 22766 20391 15670 17701 15548 15470 17062 13808 11595 17590 24447 17625
14385A7625j647L374M141m303j508J971k681n903O91L005o453m158K552M804k022
$$ 17625 15978 19352 23493 19190 17682 19653 16972 11069 11760 14765 8312 4154 6706 11510 9488
14370I488m53M78M297O096J95r70l346j764k169j495M38P18N78k889L161R491
$$ 9488 9035 9513 13810 19906 20101 19131 15785 14021 11852 10357 10795 11513 12091 9202 12363 21854
14354B1854N062m316N877o630m298j940k049q1m434p335J376L995O420N673K880
$$ 21854 26916 22600 28477 21847 17549 15609 13560 13479 9045 1710 3086 7081 13501 19174 22054
14339B2054M439L384o657p742j685M552M101q083k967N54P56J729N469R95K305
$$ 22054 26493 29877 23220 15478 13793 18345 22446 14363 11396 11950 12706 14435 19904 20899 23204
14324B3204O341L052j345m886m570l940J399M826K5m9M441o18J148M568l480m740
$$ 23204 29545 32597 31252 26366 21796 17856 19255 24081 24106 24057 28498 27880 29028 33596 30116 25376
14308B5376m930J165l881m807q37K355K435J356K800J964K347J608J583K308l320
$$ 25376 20446 21611 17730 12923 12086 14441 16876 18232 21032 22996 25343 26951 28534 30842 27522
14293B7522l579j004Q801P19m076k597l568l945K046m023j63K751J1371l578q983
$$ 27522 23943 22939 31740 32459 28383 25786 22218 18273 20319 16296 16133 18884 30255 26677 17694
14278A7694r027N656o27n598j375O291M337J355K823l020Q99M852k60m348l871
$$ 17694 8667 14323 13696 8098 6723 13014 17351 18706 21529 18509 19408 24260 24000 19652 15781
14263A5781J049J597J322k279J278j530l151L318K651K52m800j183O40K093m79
$$ 15781 16830 18427 19749 17470 18748 17218 14067 17385 20036 20288 15488 14305 14945 17038 16559
14248A6559Q52Q248j0j325N701K796L83l217L34L860n306J153L341P64o718n871
$$ 16559 17411 25659 25649 24324 30025 32821 33204 29987 30321 34181 28875 30028 33369 34133 27415 21544
14232B1544l991j518o61j109j540p06J073N41M483K567j850J273o76L50k829n646
$$ 21544 17553 16035 15374 14265 12725 12019 13092 13633 18116 20683 18833 20106 19430 19780 16951 11305
14216A1305j656O191L309k763L281K671l578m168k099N345R808P359J825n258
$$ 11305 9649 15840 19149 16386 19667 22338 18760 14592 12493 17838 27646 35005 36830 31572
14202C1572J985O468j944j1849o486O302O298j458N473K864P404n11j1524J03
$$ 31572 33557 40025 38081 26232 19746 26048 32346 30888 36361 39225 46629 46118 34594 34697
14188C4697Q109O350P700O279P196R900L242Q356J9068K0974J8037J8917K4899
$$ 34697 42806 49156 56856 63135 70331 80231 83473 91829 110897 131871 149908 168825 193724
14175A93724L8200M9212N2408O7705R2935J17785J52548J69356J73440J86745
$$ 193724 231924 281136 333544 401249 494184 611969 764517 933873 1107313 1294058
14165A294058J66841J15456O2177R39o8962j10560j53015j85343j90965j75878
$$ 1294058 1460899 1576355 1638532 1639471 1570509 1459949 1306934 1121591 930626 754748
14155G54748j46169j14399q8363o8685n1906l5313k2782j5679q101j1489j6821
$$ 754748 608579 494180 405817 337132 285226 249913 227131 211452 203351 191862 175041
14144A75041j7369j5718o389l263j897l433k630m415r994K9k456j2073r396l182
$$ 175041 157672 141954 135565 132302 130405 126972 124342 119927 109933 109962 107506 95433 86037 82855
14130H2855p442K476L743m303n767o6j155J234j543k19l169k353K158P38l411
$$ 82855 75413 77889 81632 77329 71562 71496 70341 71575 70032 69813 66644 64291 66449 67187 63776
14115F3776o055l195J264k367K03N364m131m960Q92J321m77p556j327j514L242
$$ 63776 57721 54526 55790 53423 53626 58990 54859 49899 50791 52112 51635 44079 42752 41238 44480
14100D4480J200L55n85P43J481N808l251j195j641k450M3l269o471K555K724P21
$$ 44480 45680 46035 45450 46193 47674 53482 50231 49036 47395 44945 44988 41719 35248 37803 40527 41248
14084D1248l056j880L834J676o192l433K092l90K493m734J112Q008J981K376m777
$$ 41248 38192 36312 40146 41822 35630 32197 34289 33899 36392 31658 32770 40778 42759 45135 40358
14069D0358p683k129m338j947L231N922M365N435M52m367O35l245n077L7M690
$$ 40358 32675 30546 26208 24261 27492 33414 37779 43214 43666 39299 39934 36689 31612 31649 36339
14054C6339K996L604k209j661k631Q46K227N693j5j2417J390P024O650p67l212
$$ 36339 39335 42939 40730 39069 36438 37284 39511 45204 45189 32772 34162 41186 47836 47069 43857
14039D3857k27K595k02J50k753K30K908n55o242j2565j439o28N28R91Q70J026
$$ 43857 43630 46225 46023 46173 43420 43650 46558 46003 39761 27196 25757 25129 25657 26648 27518 28544
14023B8544K738L120N152n18j192l495j260J389K454j287l402q18O33L532P040
$$ 28544 31282 34402 39554 39036 37844 34349 33089 34478 36932 35645 32243 31425 32058 35590 42630
14008D2630K074k735k891L212N038L20p86L816N156M842J0137M435N306N485J2747
$$ 42630 44704 41969 39078 42290 47328 47648 46862 50678 55834 60676 70813 75248 80554 86039 98786
13993I8786N497j72j1916j1232O19k622j3790K476J3489K87n745j273N569J57
$$ 98786 104283 104111 92195 80963 81582 78960 65170 67646 81135 81422 75677 74404 79973 80130
13979H0130j125p812m646p08J03J40q0n63j941K775M081l392o682q062L31K083
$$ 80130 79005 71193 66547 65839 65942 66082 66002 65439 63498 66273 70354 66962 60280 52218 52549 54632
13963E4632m682L767J344l185N686m371m041J575o835q593m112K570M900P389
$$ 54632 49950 53717 55061 51876 57562 53191 49150 50725 43890 35297 31185 33755 38655 46044
13949D6044P24l703Q247O039M424j952j797J4682J7176J0021M957N889J1761J2852
$$ 46044 46768 43065 51312 57351 61775 59823 58026 72708 89884 99905 104862 110751 122512 135364
13935A35364J3445J6017R360J3550K3738K0340J8153R323R993l042j5048j6679
$$ 135364 148809 164826 174186 187736 211474 231814 249967 259290 269283 266241 251193 234514
13923B34514k0817k6216j8417k0582r780l9q221p519q385l296r446n898l276o675
$$ 234514 213697 187481 169064 148482 138702 138663 130442 122923 114538 111242 101796 95898 92622 85947
13909H5947p172j190J293j209K286k678J435m898m605k115r13j504J37J632L753
$$ 85947 78775 77585 78878 77669 79955 77277 78712 73814 69209 67094 66181 64677 64814 66446 70199
13894G0199K649k885l616q611K879n568m287R68O876N253J375k069n74J094k966
$$ 70199 72848 69963 66347 57736 60615 55047 50760 51728 58604 63857 65232 63163 62589 63683 60717
13879F0717O89m554M672P784L12l01M588L234J5892L0342M2423M3065O3032P3685
$$ 60717 61406 56852 61524 69308 69620 69319 73907 77141 93033 123375 165798 208863 271895 345580
13865C45580Q2044R7932J02407J06358J05242R6311P4340M7493P252m1946o2641
$$ 345580 427624 525556 627963 734321 839563 935874 1010214 1057707 1064959 1023013 960372
13854I60372p8898r9110j09262j00182q8436p7068n6470m0038l3601k8322j3314
$$ 960372 881474 782364 673102 572920 484484 407416 350946 310908 277307 248985 235671
13843B35671j693j0252q016j318L445L29Q49K469L678R954J5726L333K686P203
$$ 235671 233978 223726 215710 214392 217837 218166 219015 221484 225162 235116 250842 254175 256861 264064
13829B64064o96J846O037m55n666j0052l071M694N295L030k317Q115J9013J8561
$$ 264064 263368 265214 271251 270796 265130 255078 252007 256701 261996 265026 262709 270824 289837 308398
13815C08398K2292K2754L0448L6728M4560M6848M9785M1439M2308M6741N3056
$$ 308398 330690 353444 383892 420620 465180 512028 561813 603252 645560 692301 745357
13804G45357L0062J5463R711k1276l8472n3090n9589o8425o4982n7781n0691m5552
$$ 745357 775419 790882 800593 779317 740845 687755 628166 559741 494759 436978 386287 340735
13792C40735l7448k7566k1059j2208q123n254j56L724O367J6267J9655J8059J4128
$$ 340735 303287 275721 254662 242454 234331 229077 228921 232645 239012 255279 274934 292993 307121
13779C07121J6516K0828J7379K1692K4103K5734L0744K6425K8383K7845L3674
$$ 307121 323637 344465 361844 383536 407639 433373 464117 490542 518925 546770 580444
13768E80444K2306K3226K4183J4985J7895J8357J8738J2312J5209J7254J2678
$$ 580444 602750 625976 650159 665144 683039 701396 720134 732446 747655 764909 777587
13757G77587J4901J2025Q604R217J0451K225M718R022P202N345J1492J2807K0629
$$ 777587 792488 804513 813117 822334 832785 835010 839728 848750 855952 861297 872789 885596 906225
13744I06225J0668M817P437J4767J6745J9127J5883J0602J7914J7333J6634L0253
$$ 906225 916893 921710 929147 943914 960659 979786 995669 1006271 1024185 1041518 1058152 1088405
13732A088405K9918L2911L1126L7250M4489M3093L9677M6730M0489L9334M3124
$$ 1088405 1118323 1151234 1182360 1219610 1264099 1307192 1346869 1393599 1434088 1473422 1516546
13721A516546L6607L8658L5843L9433M7181M3656M6076M9263O3445P0929Q9466
$$ 1516546 1553153 1591811 1627654 1667087 1714268 1757924 1804000 1853263 1916708 1987637 2077103
13710B077103J05666J24571J45917J74837K03894K43605K85130L19106L61014
$$ 2077103 2182769 2307340 2453257 2628094 2831988 3075593 3360723 3679829 4040843
13701D040843M02101M65620N39608O45705P82864R60932J200503J523346J942472
$$ 4040843 4442944 4908564 5448172 6093877 6876741 7837673 9038176 10561522 12503994
13692A2503994K460121L108732L903079M837458N974722P421201R296292J1921564
$$ 12503994 14964115 18072847 21975926 26813384 32788106 40209307 49505599 61427163
13684F1427163J5416150J9247271K3766355K9113837L1558222L1786362L2212660
$$ 61427163 76843313 96090584 119856939 148970776 180528998 212315360 244528020
13677B44528020K5963639J6414493R190621l199485j5578469k1872824k9531021
$$ 244528020 270491659 286906152 296096773 292897288 277318819 255445995 225914974
13670B25914974l4275418l2346403l0448838k6914406k0800613j5684950j1615275
$$ 225914974 191639556 159293153 128844315 101929909 81129296 65444346 53829071
13663E3829071q149352n668843m120560l165926k487078k012746j670022j356281
$$ 53829071 45679719 40010876 35890316 32724390 30237312 28224566 26554544 25198263
13655B5198263j123156r57984q09139p31350p16940p20181p55268q17008q69662
$$ 25198263 24075107 23117123 22307984 21576634 20859694 20139513 19384245 18567237 17697575
13646A7697575r05911r25576r36067r13410q87117q45603q00167p41801o82149
$$ 17697575 16791664 15866088 14930021 14016611 13129494 12283891 11483724 10741923 10059774
13637A0059774o45316n97209n57460n17153m81051m46843m06918l73144l49041
$$ 10059774 9414458 8817249 8259789 7742636 7261585 6814742 6407824 6034680 5685639
13628E685639l25162l03606k72026k48408k36716k19544k06239j84397j67642
$$ 5685639 5360477 5056871 4784845 4536437 4299721 4080177 3873938 3689541 3521899
13619C521899j62909j50880j46946j42625j43043j33726j26943j17422j11933
$$ 3521899 3358990 3208110 3061164 2918539 2775496 2641770 2514827 2397405 2285472
13610B285472j13034r3324r2923r1645q4881q8933q4635p1973p7375p6940p2949
$$ 2285472 2172438 2079114 1986191 1894546 1809665 1720732 1636097 1564124 1486749 1409809 1336860
13599A336860p4693o2076n9652n2547n4711n2860n5574n0972l6867l9470l9389
$$ 1336860 1262167 1200091 1140439 1087892 1033181 980321 924747 873775 836908 797438 758049
13588G58049l5114k1806k6773l0356j7463k7867k3799q935j1157q115j3561r693
$$ 758049 722935 701129 674356 644000 626537 598670 574871 565936 554779 546664 533103 523410
13576E23410p802j1623j6925j2092j0529p525o711j841P97n80Q41O365P264J0404
$$ 523410 515608 503985 487060 474968 464439 456914 450203 448362 449159 448579 449420 455785 463049 473453
13562D73453J2004J021L309J2146J3323J7425J4280J9130L4879J7092K1027K3264
$$ 473453 485457 486478 489787 501933 515256 532681 546961 566091 600970 618062 639089 662353
13550F62353O177j2973j9044k9553m4430n2942n4826n6866m3442l5928l5030k7443
$$ 662353 668530 655557 636513 606960 562530 509588 454762 397896 354454 318526 283496 256053
13538B56053k1152j2444j3624n335j2908j1125O308P390l433l239L532K903l24
$$ 256053 234901 222457 208833 203498 190590 179465 185773 193163 189730 186491 190023 192926 192602
13525A92602L677K04J502J2861R213J3674J7340P191J0439J4755J1172R064J2540
$$ 192602 196279 196483 197985 210846 220059 233733 251073 258264 268703 283458 294630 303694 316234
13512C16234J4892O965K905M064m87J087l639p344r514n348p293p507q547q294
$$ 316234 331126 338091 340996 345060 344573 345660 342021 334677 325163 319815 312522 305015 296468 288174
13498B88174j3081o571j828n659o973n473m084l921o84M693L697K738J1480J0120
$$ 288174 275093 268522 266694 261035 254062 248589 244505 240584 239900 244593 248290 251028 262508 272628
13484B72628J0210J8226J1600J4530P517M647O724j0504j3827o871j2707j0785
$$ 272628 282838 301064 312664 327194 334711 339358 346082 335578 321751 314880 302173 291388
13472B91388o914l178m651o481o52L988N777J8369Q819J39o784l289o501o721
$$ 291388 284474 281296 276645 270164 269512 273500 279277 297646 306465 306604 299820 296531 290030 283309
13458B83309l484j5608k5150k3208k1322j9597j0999j1195q898q329j3746n218
$$ 283309 279825 264217 239067 215859 194537 174940 163941 152746 143848 135519 121773 116555
13446A16555q762r652r306J81j246m790P70K020M966l508l487o616o151p189m909
$$ 116555 107793 98141 88835 89016 87770 82980 83750 85770 90736 87228 83741 77125 70974 63785 58876
13431E8876p31l597k72L817J533J157j606J396j870k294o100m652Q85n309m539
$$ 58876 58145 54548 54276 58093 59626 60783 59177 60573 58703 56409 50309 45657 46542 41233 36694
13416C6694J019l931L450l04r65K44Q460O946N818o741m494n99J985O009j247
$$ 36694 37713 33782 37232 36928 35963 36207 44667 51613 57431 50690 46196 45597 47582 53591 52344
13401E2344K681P448J138n301p301l550M347K946j498n425P383N043j847o880
$$ 52344 55025 62473 63611 58310 51009 47459 51806 54752 53254 47829 55212 60255 58408 51528
13387E1528l405J333Q303Q897L468K236k308m953n155M012J0127k838m946m571
$$ 51528 48123 49456 57759 66656 70124 72360 70052 65099 59944 63956 74083 71245 66299 61728
13373F1728j32j583r91q91O615J0633J741O048R547P695O235M899J722j070L351
$$ 61728 61596 60013 59022 58131 64746 75379 77120 83168 92715 100410 106645 111544 113266 112196 115547
13358A15547n106o462j2987m037k974q00K470N438l032L580O738k527L96Q57r570
$$ 115547 110441 103979 90992 86955 83981 83181 85651 91089 88057 91637 98375 95848 96244 97101 87531
13343H7531o087m531K36L600j898j2298o792N901N3J041o25N32n397n571j086
$$ 87531 81444 76913 77149 80749 78851 66553 59761 65662 65715 66756 66131 66663 61266 55695 54609
13328E4609N144L148n679l640k084l015J028q63k976K762n416l894l361j565Q17
$$ 54609 59753 62901 57222 53582 51498 48483 49511 48648 45672 48434 43018 39124 35763 34198 35015
13313C5015n521n631K386J706k108j627O22m327m886M251l093J743M260M940k405
$$ 35015 29494 23863 26249 27955 25847 24220 24842 20515 15629 19880 16787 18530 22790 27730 25325
13298B5325j0882n234K823O487J330K17K460M395j979j024O615k902l433L82l204
$$ 25325 14443 9209 12032 18519 19849 20066 22526 26921 24942 23918 30533 27631 24198 24580 21376
13283B1376J625L062k341l51K821N91q211m901k068Q787N31j797P153r95K073
$$ 21376 23001 26063 23722 23371 26192 26783 18572 13671 11603 20390 20921 19124 26277 25282 27355
13268B7355J343l079p414m144o8l784j806K275M447K138k260Q99n5O687k622n780
$$ 27355 28698 25619 18205 14061 13993 10209 8403 10678 15125 17263 15003 15902 15847 22534 19912 14132
13252A4132M427O633K428n029j894N065l128k951M447L997K505J358j418q586
$$ 14132 18559 25192 27620 22591 20697 25762 22634 19683 24130 28127 30632 31990 30572 21986
13238B1986K596Q707J948k925k208M805J0171M440K106J906m162k584L164l744
$$ 21986 24582 33289 35237 32312 30104 34909 45080 49520 51626 53532 49370 46786 49950 46206
13224D6206n436K794J47L146O125K23k442m24K648J1429M086q255r489L161M973
$$ 46206 40770 43564 43711 46857 52982 53205 50763 50339 52987 64416 68502 60247 50758 53919 58892
13209E8892m06r280M018J184K329j962J995L344J1015O634m37L70J1437K0017
$$ 58892 58486 49206 53224 54408 56737 54775 56770 60114 71129 77763 77326 77696 89133 109150
13195A09150K2714K4151L1032M1800N2428O0840P5664J04725J31234J58336J66690
$$ 109150 131864 156015 187047 228847 281275 342115 417779 522504 653738 812074 978764
13184I78764J65602J80228J61215J06771N7262j0044q6974j27874j64475j85422
$$ 978764 1144366 1324594 1485809 1592580 1649842 1639798 1552824 1424950 1260475 1075053
13174A075053j84087j80322j47373j07912q9741o6263m9616l8294k3463j5984
$$ 1075053 890966 710644 563271 455359 365618 299355 249739 211445 187982 171998
13164A71998o586j5905j3077k739l273p864o405N78l867R03q82m213m318p088
$$ 171998 165412 149507 136430 133691 130418 122554 116149 116727 112860 113763 112881 108668 104350 97262
13150I7262n526j0821j2809k611l395l895K822L941K880j452j722r219j528l057
$$ 97262 91736 80915 68106 65495 62100 58205 61027 64968 67848 66396 64674 55455 53927 50870
13136E0870j2845L19L738K075l776n163k329m972l073j168o236n83m86l239L388
$$ 50870 38025 38344 42082 44157 40381 35218 32889 27917 24844 23676 17440 16857 16371 13132 16520
13121A6520O474l768J140L369r609O074o059l165J59K956L875j38j465q102K164
$$ 16520 22994 19226 20366 23735 14126 20200 14141 10976 11135 14091 17966 17828 16363 8261 10425
13106A0425L986O083N350j691l441j918k659l045j818M142M808j54n691L915L874
$$ 10425 14411 20494 25844 24153 20712 18794 16135 13090 11272 15414 20222 20068 14377 18292 22166
13091B2166K449J022m260l431o271o42Q849R814k805p3l915J644J238M63j300
$$ 22166 24615 25637 21377 17946 11675 11033 19882 29696 26891 26818 22903 24547 25785 26248 24948
13076B4948p142n333m594L072K55l327P260J283j20m920K428M064J383l684K448
$$ 24948 17806 12473 7879 10951 11206 7879 15139 16422 16302 11382 13810 17874 19257 15573 18021
13061A8021J0322N093n26l770n534l432m50o264o543j609M070l373L519k322n036
$$ 18021 28343 33436 32910 29140 23606 20174 19724 13460 6917 5308 9378 6005 9524 7202 2166
13046B166J043m055m851J113m002q22M959M505M496M896l858j2298N30Q931o34
$$ 2166 3209 -846 -5697 -4584 -8586 -9408 -4449 56 4552 9448 5590 -6708 -6178 2753 2119
13031B119m74O411m5k446M358l667j141M238k359k008m597j77N377N33N10l462
$$ 2119 1645 8056 8011 5565 9923 6256 5115 9353 6994 4986 389 212 5589 6122 6632 3170
13015C170M338K889J182m589l829M171J804j533l995j684K978l924K541r61K615
$$ 3170 7508 10397 11579 6990 3161 7332 9136 7603 3608 1924 4902 978 3519 2558 5173
13000E173m56N47k345j403M912J937l611k15N900L339K626m439n972k383r81j767
$$ 5173 4717 5264 2919 1516 6428 8365 4754 4539 10439 13778 16404 11965 5993 3610 2629 862
12984H62K174p0L339L121K100l459L509j921k034K83k724J03K866k083k995k267
$$ 862 3036 2966 6305 9426 11526 8067 11576 9655 7621 7904 5180 5283 8149 6066 3071 804
12968H04J274L607P186M006m573m088O222N162K55j029L11p881n60K048m329j534
$$ 804 2078 5685 12871 16877 12304 8216 14438 19600 19855 18826 19137 11256 10696 12744 8415 6881
12952F881M226P02k969l681L096j958o638l102J817M841k41l038j076j490L610
$$ 6881 11107 11809 8840 5159 8255 6297 -341 -3443 -1626 3215 2974 -64 -1140 -2630 980
12937I80K888P42l815N476Q077m089n114n693n368j588K621M904P547m959J78
$$ 980 3868 4610 795 6271 14348 10259 5145 -548 -5916 -7504 -4883 21 7568 2609 2787
12922B787R972L782j0489o728L982r82R64K2r761p15L892L390O860j605k723j165
$$ 2787 12759 16541 6052 -676 3306 2324 3288 3310 -6451 -7166 -3274 116 6976 5371 2648 1483
12906A483n581p20q29N452j193n128L017K356M037k672l743K581J449n6l614K087
$$ 1483 -4098 -4818 -5647 -195 -1388 -6516 -3499 -1143 2894 222 -3521 -940 509 453 -3161 -1074
12890a074Q04j534l34k89J657q082N58J0697J73n087j878k171p96l434K372r60
$$ -1074 -270 -1804 -2138 -2427 -770 -8852 -8294 2403 2576 -2511 -4389 -6560 -7356 -10790 -8418 -9378
12874i378J540j57K132N644P694J751P96o860q80P630P5q519l663k071j558j952
$$ -9378 -7838 -7995 -5863 -219 7475 9226 10022 3162 2282 9912 9987 1468 -2195 -4266 -5824 -7776
12858g776l307L763L266M275O97L992L78L001l046n731J764L503j06q427n434
$$ -7776 -11083 -7320 -4054 221 918 4910 5288 8289 5243 -488 1276 4779 4673 -3754 -9188
12843i188K720R44j940O950P961M18q984L816Q19M67J317O195J004n658o676M331
$$ -9188 -6468 -5524 -7464 -514 7447 7865 -1119 2697 3516 3983 5300 11495 12499 6841 165 4496
12827D496N54K58j395J880L49o718J438J459o949J409M443l721K596R008K391
$$ 4496 5050 5308 3913 5793 6142 -576 862 2321 -4628 -3219 1224 -2497 99 9107 11498
12812A1498q114o774k171P282K419q02m97m407m045Q045M026L563m340K690R72
$$ 11498 3384 -3390 -5561 1721 4140 3338 2841 -1566 -5611 2434 6460 10023 5683 8373 9345
12797I345l220L379n748l073l05J786k460k571K41k524Q18j884M035M125k44J802
$$ 9345 6125 9504 3756 683 378 2164 -296 -2867 -2626 -5150 -4332 -6216 -2181 1944 1700 3502
12781C502j634o106M598N778k457J647j524j003N848n57m859o466J193O360J876
$$ 3502 1868 -4238 360 6138 3681 5328 3804 2801 8649 8092 3233 -3233 -2040 4320 6196
12766F196n655p862l991J89L735L595P81k427J048O396K452k221o081k424l358
$$ 6196 541 -7321 -11312 -11123 -7388 -3793 -3012 -5439 -4391 2005 4457 2236 -3845 -6269 -9627
12751i627K236L875K633j185q758O1J1660n54m173o62p496K614K037o03k147N79
$$ -9627 -7391 -3516 -883 -2068 -10826 -10765 895 341 -3832 -4494 -11990 -9376 -7339 -7942 -10089 -9510
12735i510m701mP753K131Q84O399J546l538j735l618m70l039j022R410Q213k099
$$ -9510 -14211 -14215 -6462 -4331 -3447 2952 4498 960 -775 -4393 -4863 -7902 -8924 486 8699 6600
12719F600J588k453o643J41L798p64J066J614j488l958l188M527R43k998l154
$$ 6600 8188 5735 -908 -767 3031 2267 3333 4947 3459 -499 -3687 840 1783 -1215 -4369
12704d369M692K677j214L513L430o104n592j792M457k149n063P553N360J031K330
$$ -4369 323 3000 1786 5299 8729 2625 -2967 -4759 -302 -2451 -7514 39 5399 6430 8760
12689H760n402o656J431J519l177j152l845J820K657j97K678J887M504k980k440
$$ 8760 3358 -3298 -1867 -348 -3525 -4677 -8522 -6702 -4045 -4242 -1564 323 4827 1847 -593
12674e93n216J177J991o58M761m063K077M834M940p853q703J060J546L937J0577
$$ -593 -5809 -4632 -2641 -3299 1462 -2601 -524 4310 9250 1397 -7306 -6246 -4700 -763 9814
12659I814P057n09j0590j2468J988P46j406j879k351J623k751M162q73m799m404
$$ 9814 16871 16362 5772 -6696 -4708 -3962 -5368 -7247 -9598 -7975 -10726 -6564 -7437 -12236 -16640
12644a6640J779j260O006N930m07k579J807r58p11k435j532J543M565l846m088
$$ -16640 -14861 -16121 -10115 -4185 -4592 -7171 -5364 -6322 -7033 -9468 -11000 -9457 -4892 -8738 -12826
12629a2826P576P023L415j1q282n00O842J691p86j0601m462M669N867m072n701
$$ -12826 -5250 1773 5188 5177 -3105 -3605 3237 4928 4142 -6459 -10921 -6252 -385 -4457 -10158
12614a0158J7K284J692N406M355k83N163n793m293M232J644m692k501R2O282k216
$$ -10158 -10141 -7857 -6165 -759 3596 3313 8476 2683 -1610 2622 4266 -426 -2927 -2835 3447 1231
12598A231m323p28R156O160O728L879n121k738r127m518N29n04l08n805j219O518
$$ 1231 -3092 -3820 5336 11496 18224 22103 16982 14244 5117 599 1128 624 316 -5489 -6708 -190
12582a90L747p091m785N40K689k41M104N839j800o515j875K119J533q04j090J421
$$ -190 3557 -3534 -8319 -7779 -5090 -5331 -1227 4612 2812 -3703 -5578 -3459 -1926 -2730 -3820 -2399
12566b399K36J87K084K059m333R44P438M457n602l762l514n24O195N478m767k84
$$ -2399 -2163 -1976 108 2167 -2166 -1222 6216 10673 5071 1309 -2205 -2729 3466 8944 4177 3893
12550C893J8K641M910M521m600j3277J31K857P069j639o284o62N568l320j1500
$$ 3893 3911 6552 11462 15983 11383 -1894 -1763 1094 8163 6524 240 -422 5146 1826 -9674
12535i674k654K030k81k597o40J146M528K262n095p745L531O796M540j151l375
$$ -9674 -12328 -10298 -10579 -13176 -13816 -12670 -8142 -5880 -10975 -18720 -15189 -8393 -3853 -5004 -8379
12520h379k602R286O784j010J225L143p822q75J962L91k143L903k48m291K302
$$ -8379 -10981 -1695 5089 4079 5304 8447 625 -250 1712 2103 -40 3863 3615 -676 1626
12505A626L58l084P783n307m372l054j226R450n232m927j404m46j808N29P552
$$ 1626 1984 -1100 6683 1376 -2996 -6050 -7276 2174 -3058 -7985 -9389 -9835 -11643 -11114 -3562
12490c562J933K606q80m48j611k796n124Q105M863O32j0361l343M342J277J35
$$ -3562 -1629 977 97 -351 -1962 -4758 -9882 -1777 3086 3718 -6643 -9986 -5644 -4367 -4232
12475d232m107M474P306k469k708L912j404l153k066k253K724N290j359m505r27
$$ -4232 -8339 -3865 3441 972 -1736 2176 772 -2381 -4447 -6700 -3976 1314 -45 -4550 -5477
12460e477K051M366j543n032n137m48K112K167q40j094K637O114q14l344L44N493
$$ -5477 -3426 940 -603 -5635 -10772 -11220 -9108 -6941 -7781 -8875 -6238 -124 -938 -4282 -3938 1555
12444A555K975K889m54M334P170o364n865O48l052L883J777l536k099l020K591
$$ 1555 4530 7419 6965 11299 18469 12105 6240 6888 3836 7719 9496 5960 3861 841 3432
12429C432K335M25J361m830r259j318l2n432l518M279N677j97O336O166K706M08
$$ 3432 5767 6192 7553 2723 -6536 -7854 -7886 -13318 -16836 -12557 -6880 -7077 -741 5425 8131 8539
12413H539k224l961o561k386P484l90J953r97n607Q291M907l164l928P28p18M290
$$ 8539 6315 2354 -4207 -6593 891 501 2454 1457 -4150 4141 9048 5884 1956 2684 1966 6256
12397F256K495M391M234o73n406L03m589r299l769L562L343L360k182p636o376
$$ 6256 8751 13142 17376 16703 11297 11600 7011 -2288 -6057 -2495 848 4208 2026 -5610 -11986
12382a1986N320N964j032L549K713K593j968q203m185L157K073k528j662p83M914
$$ -11986 -6666 -702 -1734 1815 4528 7121 5153 -3050 -7235 -4078 -2005 -4533 -6195 -6978 -2064
12367b064j478k226J137k157J741K082M883q276n811O92N130M307m22m35l390
$$ -2064 -3542 -5768 -4631 -6788 -5047 -2965 1918 -6358 -12169 -11477 -6347 -2040 -2462 -2897 -6287
12352f287r38L689q69m676K026L744L909L594p52l928l355L949Q58J412L685r87
$$ -6287 -7225 -3536 -4405 -9081 -7055 -3311 598 4192 3440 -488 -3843 106 964 2376 6061 5074
12336E074m417j693M751N189K669p637l306J787M74J120l607m341r01j760K292
$$ 5074 657 -1036 3715 8904 11573 3936 630 2417 2891 4011 404 -3937 -4838 -6598 -4306
12321d306M42o071m434N251J957m22N554k959N039L385L711M23l20k974R2J545
$$ -4306 -3864 -9935 -14369 -9118 -7161 -7583 -2029 -4988 51 3436 7147 7570 7250 4276 4368 5913
12305E913J362q194l887N3K109m558O13P676M908l400p393q26L931Q62n570p86
$$ 5913 7275 -919 -4806 -4753 -2644 -7202 -6589 1087 5995 2595 -4798 -5624 -1693 -831 -6401 -7187
12289g187M840M936j087j038N577k575k115Q738J610k572l982j349k795Q4K644
$$ -7187 -2347 2589 1502 464 6041 3466 1351 10089 11699 9127 5145 3796 1001 1085 3729
12274C729p154k568O772k080j757q8J779M810J609j55Q31n503j654r54J460l317
$$ 3729 -3425 -5993 779 -1301 -3058 -3146 -1367 3443 5052 4897 5728 225 -1429 -2383 -923 -4240
12258d240O289J039N55J834n761n720K723K225O72o212j221M553J896K629L514
$$ -4240 2049 3088 3643 5477 -284 -6004 -3281 -1056 -384 -6596 -7817 -3264 -1368 1261 4775
12243D775lJ513K137l686q18J734J241k744K094k743j297K204L9J296m355m689
$$ 4775 4772 6285 8422 4736 3918 5652 6893 4149 6243 3500 2203 4407 4446 5742 1387 -3302
12227c302M056K140L351K920j819P61K805p646j864K314m704J958j91O405J649
$$ -3302 754 2894 6245 9165 7346 8107 10912 3266 1402 3716 -988 970 779 7184 8833
12212H833o554o691o988k445N822L243R83N459P797J676n267k656P066O17M73
$$ 8833 2279 -4412 -11400 -13845 -8023 -4780 -3797 1662 9459 11135 5868 3212 10278 10895 11368
12197A1368k906o697J86n550J755J821j530J78j913L211j326k25M143k684j042
$$ 11368 8462 1765 1951 -3599 -1844 -23 -1553 -1375 -3288 -77 -1403 -1628 2515 -169 -1211
12182a211O461K50l757P36l88n748l955j25L763k029N905M460N023J190l689l556
$$ -1211 5250 5500 1743 2479 2091 -3657 -7612 -7737 -3974 -6003 -98 4362 9385 10575 6886 3330
12166C330m962M218M351j772m113j185K637P14o067o812J08R068P599N214j433
$$ 3330 -1632 2586 6937 5165 1052 -133 2504 3218 -2849 -9661 -9553 -485 7114 12328 10895
12151A0895l055q722l938J069M172k822k64j065k001p91M199J517Q78l858O225
$$ 10895 7840 -882 -4820 -3751 421 -2401 -2665 -3730 -5731 -6522 -2323 -806 72 -3786 2439
12136B439J0300J092l838o969K422N103N92O40m716o762L523K357J470m49r32
$$ 2439 12739 13831 9993 3024 5446 10549 11141 11781 7065 303 3826 6183 7653 7204 6272
12121F272O445l954j2646n450O185K137j27q49J316K666j590L18P645O961p42
$$ 6272 12717 8763 -3883 -9333 -3148 -1011 -1138 -1987 -671 1995 405 723 8368 15329 14587
12106A4587n829p554j634O659L000J1p151n181j348J75L561Q74k407n027M608
$$ 14587 8758 1204 -430 6229 9229 9240 2089 -3092 -4440 -4265 -704 170 -2237 -7264 -2656
12091b656J310R472M772r529n806m81P77L492N346p868K59M54l57N535k814K660
$$ -2656 -1346 8126 12898 3369 -2437 -2918 -2141 1351 6697 -1171 -912 -458 -815 4720 1906 4566
12075D566L375J339n739j362N16J163l542l551M089M355K598r57j362n072M534
$$ 4566 7941 9280 3541 2179 2695 3858 316 -3235 854 5209 7807 6850 5488 416 4950
12060D950P547k30m958J581k432m487m022m759K312p546L495K703m18N637J287
$$ 4950 12497 12267 7309 8890 6458 1971 -2051 -6810 -4498 -12044 -8549 -5846 -6264 -627 660
12045F60n652n487Q49L015j785n08L703L398J821l216l415O6M584l07p996o524
$$ 660 -4992 -10479 -9630 -6615 -8400 -8908 -5205 -1807 14 -3202 -6617 -6551 -1967 -2274 -10270 -16794
12029a6794N291P534K124k961N80o84M0M283K821j194K660N924k822n216L68k446
$$ -16794 -11503 -3969 -1845 -4806 -4226 -4910 -4870 -587 2234 1040 3700 9624 6802 1586 1954 -492
12013d92M572m430q34M396m85m377k19j887n93k63L541L993k549k771j152n96
$$ -492 4080 -350 -1184 3212 2727 -1650 -1869 -3756 -4349 -4612 -1071 2922 373 -2398 -3550 -4146
11997d146J598j251K683N116L594J061l890o188j025M01k190L172K346j026J516
$$ -4146 -2548 -3799 -1116 4000 7594 8655 4765 -1423 -2448 -2047 -4237 -1065 1281 255 1771
11982A771M588J518M696l885k83k082p000O06q91m76R68K131J071j759n030K459
$$ 1771 6359 7877 12573 8688 8405 6323 -677 -71 -962 -1438 -470 1661 2732 973 -4057 -1598
11966a598K543M794p93p996o020R42K645l93K340L492L799o005l67L119P24l618
$$ -1598 945 5739 4946 -3050 -9070 -8128 -5483 -5876 -3536 -44 3755 -2250 -2617 502 1226 -2392
11950b392m717j951n124j341Q411L174k091K816J667j19k537j375P638O33m862
$$ -2392 -7109 -9060 -14184 -15525 -7114 -3940 -6031 -3215 -1548 -1667 -4204 -5579 2059 2692 -2170
11935b170m23l044L517Q105Q69L153o427j282J50l629n128j736k99J300j889l111
$$ -2170 -2593 -5637 -2120 5985 6854 10007 3580 2298 2448 -1181 -6309 -8045 -8344 -7044 -8933 -12044
11919a2044P938N314J676K437l619k224p10m625l026N334q27n858K166M646r34
$$ -12044 -4106 1208 2884 5321 1702 -522 -1232 -5857 -8883 -3549 -4376 -10234 -8068 -3422 -4356
11904d356n335N415J243n150N722O564J204O796j876j480k970k82o834k434k468
$$ -4356 -9691 -4276 -3033 -8183 -2461 4103 5307 12103 10227 8747 5777 5495 -1339 -3773 -6241
11889f241k861k77P630j102m098J715l92m02J695L174k272m369n127N28l09L038
$$ -6241 -9102 -9379 -1749 -2851 -6949 -5234 -5626 -6028 -4333 -1159 -3431 -7800 -12927 -12399 -12708 -9670
11873i670K976O1k548l025j967P457O083K044l048l375L945K597M868J294o995
$$ -9670 -6694 -6633 -9181 -12206 -14173 -6716 -633 1411 -1637 -5012 -1067 1530 6398 7692 697
11858F97l724k399K92N935q74K110N806j018M175L038j793j1297Q9N198q05K497
$$ 697 -3027 -5426 -5134 801 -73 2037 7843 6825 11000 14038 12245 948 1037 6235 5430 7927
11842G927n541j46R708K191j296j568n290k488M76K225Q11n35k048k597O412r30
$$ 7927 2386 2240 11948 14139 12843 11275 5985 3497 3973 6198 7009 6474 4426 1829 8241 7311
11826G311n473J376J240o090j686M935L67K983l614k25J678k11m184L435j558
$$ 7311 1838 3214 4454 -1636 -3322 1613 1980 4963 1349 1124 2802 2591 -1593 1842 284
11811B84p567k619K253L25J678N188K54k301p85O06N569r66l153M948L02l708
$$ 284 -7283 -9902 -7649 -7324 -5646 -458 -204 -2505 -3290 -2684 2885 1919 -1234 3714 4016 308
11795C08P72n214o42N727M533L208p33J760k794n781q61M813L614j782j725m648
$$ 308 1080 -4134 -4776 951 5484 8692 7959 9719 6925 1144 283 5096 8710 6928 5203 555
11779E55J277r00J836l115l981j179J714j527K420K418l191m208J747O452K19
$$ 555 1832 932 2768 -347 -4328 -5507 -3793 -5320 -2900 -482 -3673 -7881 -6134 318 537
11764E37k967J980J058K321k167j404n27k442K880O2Q494k146j0304n205R801
$$ 537 -2430 -450 608 2929 762 -642 -1169 -3611 -731 -669 7825 5679 -4625 -9830 -29
11749b9J0906k171n752m480n930K484L90M281J864l453Q65N54l41J59j702M650
$$ -29 10877 8706 2954 -1526 -7456 -4972 -4582 -301 1563 -1890 -1025 -471 -812 -653 -2355 2295
11733B295j588o39L455J273L85n571J018J193K794k555j477o252J015M400K406
$$ 2295 707 68 3523 4796 5181 -390 628 1821 4615 2060 583 -5669 -4654 -254 2152
11718B152n391J158M885k089k758l114j6N436J0060L71n121p671k904K584j473
$$ 2152 -3239 -2081 2804 715 -2043 -5157 -5173 263 10323 10694 5573 -2098 -5002 -2418 -3891
11703c891O78L031j223N28m124k072m44J982L442l030l244K73Q985J2771O796
$$ -3891 -3213 -182 -1405 -877 -5001 -7073 -7517 -5535 -2093 -5123 -8367 -8094 891 13662 20458
11688B0458n182j1229n206K047J0567j094p272n086K230K744k417K521K451l025
$$ 20458 15276 4047 -1159 888 11455 10361 3089 -1997 233 2977 560 3081 5532 2507
11674B507J0057k19n717j125J610q845p574k225J1759L633p172p563l924N285
$$ 2507 12564 12345 6628 5503 7113 -1732 -9306 -11531 228 3861 -3311 -10874 -14798 -9513
11660i513J2997l953m291j647m24N413O098J700o32L198o81q03j826J870K056
$$ -9513 3484 -469 -4760 -6407 -6831 -1418 4680 6380 5748 8946 8265 7462 5636 7506 9562
11645I562o128J305J930m763J077J544K200j771k839O8J058K290L699L295O07
$$ 9562 3434 4739 6669 1906 2983 4527 6727 4956 2117 2185 3243 5533 9232 12527 13134
11630A3134r28m472o034O469L424o526o128J618J786J879o40n915J112K578k28
$$ 13134 12206 7734 1700 8169 11593 5067 -1061 557 2343 4222 3582 -2333 -1221 1357 1129
11615A129J769L718r77j0453l042J919N801K746Q9K358L253K309k576l317n997
$$ 1129 2898 6616 5639 -4814 -7856 -5937 -136 2610 2699 5057 8310 10619 8043 4726 -1271
11600a271n545q83R656M94o437l310l761P035M040M068P90P146j430m339L235
$$ -1271 -6816 -7699 1957 2451 -3986 -7296 -11057 -4022 18 4086 4876 12022 10592 6253 9488
11585I488K439m42o373j2084K341k064k636N578J75n255K640N142K022p120l247
$$ 9488 11927 11485 5112 -6972 -4631 -6695 -9331 -3753 -3578 -8833 -6193 -1051 971 -6149 -9396
11570i396l039J770J091o749l181J0682M646N46R67J466L889o467j0358J125m567
$$ -9396 -12435 -10665 -9574 -16323 -19504 -8822 -4176 -3630 -2663 -1197 2692 -3775 -14133 -13008 -17575
11555a7575m169Q215P793j879J894L268L189J200J68p119m250n76Q02N874R204
$$ -17575 -21744 -13529 -5736 -7615 -5721 -2453 736 1936 2104 -5015 -9265 -9841 -9039 -3165 6039
11540F039K370Q86M44m235J910Q31j324L01N144L144m33l031n93j119k630j1096
$$ 6039 8409 9295 9739 5504 7414 8245 6921 7222 12366 15510 15077 12046 11453 10334 7704 -3392
11524c392l53K783r53J619m332L790N724k558k366k49m976K239K028K545L145
$$ -3392 -3745 -962 -1915 -296 -4628 -838 4886 2328 -38 -287 -5263 -3024 -996 1549 4694
11509D694m768J72N945J989L453k428l782m01m441k247m013j387k42L564O98m32
$$ 4694 -74 98 6043 8032 11485 9057 5275 4874 433 -1814 -5827 -7214 -7456 -3892 -3194 -3626
11493c626K23j451L867L227l725l489r76L529O622P189o555n586k250p223m334
$$ -3626 -3403 -4854 -987 2240 -1485 -4974 -5950 -2421 4201 11390 4835 -751 -3001 -10224 -14558
11478a4558o769K665K619R883N75j082l94l120k185M905L468k420k473m180o35
$$ -14558 -21327 -18662 -16043 -6160 -5585 -6667 -7061 -10181 -12366 -7461 -3993 -6413 -8886 -13066 -13701
11463a3701O67P814L767O692j785L92n763k619j922N162J532N66m199L84J399
$$ -13701 -13034 -5220 -1453 5239 3454 3846 -1917 -4536 -6458 -1296 236 802 -3397 -3013 -1614
11448a614M142K401l101J001p0k038o484l543O07K949N625N593K499m603L010
$$ -1614 2528 4929 1828 2829 2759 721 -5763 -9306 -8699 -5750 -125 5468 7967 3364 6374
11433F374m55J092J880j619m494J636o82K275n509N23p289K9J723m805j704J706
$$ 6374 5919 7011 8891 7272 2778 4414 3732 6007 498 1021 -6268 -6239 -4516 -9321 -11025 -9319
11417i319k690M223N227M719k758n378k106k32M790M602j156j822k457j144L66
$$ -9319 -12009 -7786 -2559 2160 -598 -5976 -8082 -8314 -3524 1078 -78 -1900 -4357 -5501 -5135
11402e135M678K005j573m263j554K388J172j986P530R187J482k499j570M66l357
$$ -5135 -457 1548 -25 -4288 -5842 -3454 -2282 -4268 3262 12449 13931 11432 9862 10328 6971
11387F971n381n057o358l830R15L66L198K797P285K864q641l131j800m79P772
$$ 6971 1590 -3467 -9825 -13655 -12740 -12374 -9176 -6379 906 3770 -4871 -8002 -9802 -10281 -2509
11372b509m918O11J596K973m57O351j204l167K865l66L699k176k713K663m08M284
$$ -2509 -7427 -6816 -5220 -2247 -2704 3647 2443 -724 2141 1775 5474 3298 585 3248 2840 7124
11356G124l036j397j438q74k240l21j715j928J357k900N15M276l478K666L248
$$ 7124 4088 2691 1253 379 -1861 -2182 -3897 -5825 -4468 -7368 -6853 -2577 -6055 -3389 -141
11341a41k707L058M630J91J910j471l616L152j529K891M045q259j814l996o387
$$ -141 -2848 210 4840 5031 6941 5470 1854 5006 3477 6368 10413 2154 340 -3656 -10043
11326a0043l461k542K735P245M75M742J049K513J253n321J930N4l102m420m77
$$ -10043 -13504 -16046 -13311 -6066 -5591 -849 200 2713 3966 -1355 575 629 -2473 -6893 -7370
11311g370N108m913l322M930O827K934j927p98j295r88M844k273n222R35J0389
$$ -7370 -2262 -7175 -10497 -5567 1260 4194 2267 1469 174 -814 4030 1757 -3465 -2530 7859
11296G859K27n942o52k837k663J928R47l580M949j978o234r68J710q3O706N789
$$ 7859 8086 2144 1492 -1345 -4008 -2080 -1133 -4713 236 -1742 -7976 -8944 -7234 -7317 -611 5178
11280E178r58R08l176l577j206k235j522J996r45N27K463K020O009K767m092K451
$$ 5178 4220 5128 1952 -1625 -2831 -5066 -6588 -4592 -5537 -5010 -2547 -527 5482 8249 4157 6608
11264F608J782K973O26o430P89O169j956l902Q33o291l239L055L111j529m757
$$ 6608 8390 11363 11989 5559 6348 12517 10561 6659 7492 1201 -2038 1017 4128 2599 -2158
11249b158n745K05R64m508m377M114L239M659P903L532N25k212j334P79m241p91
$$ -2158 -7903 -7698 -6734 -11242 -15619 -11505 -8266 -3607 4296 7828 8353 6141 4807 5586 1345 554
11233E54N92L46k872j056n000m361L051M907L414M062k949k987m151M141O075
$$ 554 1146 1492 -1380 -2436 -7436 -11797 -8746 -3839 -425 3637 688 -2299 -6450 -2309 3766
11218C766l958o099L089R51n11L72N511o964j850K337j229k74k77K628k501J954
$$ 3766 -192 -6291 -3202 -2251 -2762 -2390 3121 -3843 -5693 -3356 -4585 -4859 -5136 -2508 -5009 -3055
11202c055L810J968l490j462n058m957k5n524M411P410M637l534o101j613N870
$$ -3055 755 2723 -767 -2229 -7287 -12244 -12269 -17793 -13382 -5972 -1335 -4869 -10970 -12583 -6713
11187f713L502l042J673M125k592k858O841L415m26l888m613j233O72M020K883
$$ -6713 -3211 -6253 -4580 -455 -3047 -5905 936 4351 3925 37 -4576 -5809 -5137 -1117 1766
11172A766r29l92k233L493K394l439L895K931R24O231o086m406K705k361j238
$$ 1766 837 445 -1788 1705 4099 660 4555 7486 8410 14641 8555 4149 6854 4493 3255
11157C255q8n944J467l443M89P16N177j484j402P549P113L418j2231n377O060
$$ 3255 3167 -2777 -1310 -4753 -4264 -3548 1629 145 -1257 6292 13405 16823 4592 -785 5275
11142E275N65n303m609n88j040J528m465j565p2L280L948o45j243L888m74O49
$$ 5275 5840 537 -4072 -4660 -5700 -4172 -8637 -10202 -10274 -6994 -3046 -3691 -4934 -1046 -1520 -871
11126h71J884o978j347P905K978O82M81P25J596J502j071m762K438o911q87J738
$$ -871 1013 -5965 -7312 593 3571 4253 4734 5459 7055 8557 7486 2724 5162 -1749 -2636 -898
11110h98J510J006P80j124j227M362K3j915k584m055n35n931K337O607Q59l398
$$ -898 612 1618 2398 1274 47 4409 4432 2517 -67 -4122 -4657 -10588 -8251 -1644 -785 -4183
11094d183m44p159m199J805M068m60O257k96Q635Q272j817r107j809L939r08N9
$$ -4183 -4627 -11786 -15985 -14180 -10112 -10572 -4315 -4611 4024 12296 10479 1372 -437 3502 2594 2653
11078B653o014j506o331k227N169R578N594p147m457k462L536m071n729n361L613
$$ 2653 -3361 -4867 -11198 -13425 -8256 1322 6916 -231 -4688 -7150 -3614 -7685 -13414 -18775 -15162
11063a5162N337j694R92J906O40K563o898k065q99N813O848l623j540k571K699
$$ -15162 -9825 -11519 -10527 -8621 -7981 -5418 -12316 -14381 -15280 -9467 -2619 -6242 -7782 -10353 -7654
11048g654N503l305l260n654l656L451Q881j24r42k273m956K999j74k336Q129
$$ -7654 -2151 -5456 -8716 -14370 -18026 -14575 -5694 -5818 -6760 -9033 -13989 -10990 -11164 -13500 -5371
11033e371J086N06O824N588l624l466m378k845K330J939k311K040m611k003P29
$$ -5371 -4285 -3779 3045 8633 5009 1543 -2835 -5680 -3350 -1411 -3722 -1682 -6293 -8296 -7567
11018g567K371l134J883L115J354J645m90o018J362k320Q809J0073L326k47n825
$$ -7567 -5196 -8330 -6447 -3332 -1978 -333 -823 -6841 -5479 -7799 1010 11083 14409 14162 8337
11003H337j0412j39J397j547K771m3L264K185r40K869l536n251K165N7J668L95
$$ 8337 -2075 -2214 -817 -2364 407 364 3628 5813 4873 7742 4206 -1045 1120 1177 2845 3240
10987C240K174L329R34l492m487l397N86l249l332O110N598o330k357M221K519
$$ 3240 5414 8743 9677 6185 1698 -1699 -1113 -4362 -7694 -1584 4014 -2316 -4673 -452 2067
10972B067J503k446m280p1J707l087N196K984k045O86o062J39N009k326m1K055
$$ 2067 3570 1124 -3156 -3227 -1520 -4607 589 3573 1528 2214 -3848 -3709 1300 -1026 -1067 988
10956I88K758K788J92K978L686l068j739J012l159q056j325Q17N183M843o62k214
$$ 988 3746 6534 6726 9704 13390 10322 8583 9595 6436 -1620 -2945 -2128 3055 7898 7236 5022
10940E022n659K087L450L47R23l332l8M592j187m180p592j551P07K44J853O18
$$ 5022 -637 1450 4900 5247 6170 2838 2800 7392 6205 2025 -5567 -7118 -6411 -6167 -4314 -3696
10924c696k541o412k104M883N861j30M076M76M053k634J5j056J252M042j340k914
$$ -3696 -6237 -12649 -14753 -9870 -4009 -4139 -63 413 4466 1832 1847 791 2043 6085 4745 1831
10908A831K093L24m082l500j213n235K215M443n360q603Q471J0886N80l022k585
$$ 1831 3924 4248 166 -3334 -4547 -9782 -7567 -3124 -8484 -17087 -8616 2270 2850 -172 -2757
10893b757J788o44J456j787J37p22K165Q13m897k136k836o951l53L764N436j754
$$ -2757 -969 -1613 -157 -1944 -1807 -2529 -364 449 -4448 -6584 -9420 -16371 -16724 -12960 -7524 -9278
10877i278o983O515J3269J076p786j66J003L66K757R15J304J500o950k936K88
$$ -9278 -16261 -9746 3523 4599 -3187 -3353 -2350 -1984 773 1688 2992 4492 -2458 -5394 -5106
10862e106Q78J696L436Q87K065o544m733k870n373J228N229P267N714m589m395
$$ -5106 -4228 -2532 904 1791 3856 -2688 -7421 -10291 -15664 -14436 -9207 -1940 3774 -815 -5210
10847e210l023j499J026j074j66M18Mm7M137k349o01N773k564M125J207j98M748
$$ -5210 -8233 -9732 -8706 -9780 -9946 -9528 -9524 -9571 -5434 -7783 -8384 -2611 -5175 -1050 157 -41 4707
10830D707Q162j122q09o779o094M315J81n866o400J658J901o20L099m835l546
$$ 4707 12869 11747 10938 4159 -1935 2380 2561 -3305 -9705 -8047 -6146 -6766 -3667 -8502 -12048
10815a2048K774P635L9Q789J680j51K156o956j892n058l952K052k363K051L149
$$ -12048 -9274 -1639 -1600 7189 8869 8718 10874 3918 2026 -3032 -6984 -4932 -7295 -5244 -2095
10800b095l62Q73O269m426q930n894l052O171K974M289M655N901l61k550l936
$$ -2095 -2457 -1584 4685 259 -8671 -14565 -17617 -11446 -8472 -4183 472 6373 6012 3462 -474
10785d74k208J386L508N307N815k703q517j880R373K186j176j497L727o96q580
$$ -474 -2682 -1296 2212 7519 13334 10631 2114 234 9607 11793 10617 9120 12847 12151 3571
10770C571r16j558L831M700K914k899o483n748m392j81m459K514r32K626j042
$$ 3571 2655 1097 4928 9628 12542 9643 3160 -2588 -6980 -7161 -11620 -9106 -10038 -7412 -8454
10755h454j5M722N240M643n551q544k763j063N221O961o58j0314p88L096M891
$$ -8454 -8469 -3747 1493 6136 585 -7959 -10722 -11785 -6564 397 -261 -10575 -11363 -8267 -3376
10740c376M73N124k209q796L133k260o519M182J0509k371k820k939J473P375r40
$$ -3376 -2903 2221 12 -8784 -5651 -7911 -14430 -10248 261 -2110 -4930 -7869 -6396 979 39
10725C9L734p1q917R98L827j946N25l473k527J451Q87L259j7o969M81J982n790
$$ 39 3773 3702 -5215 -4217 -390 -2336 -1811 -5284 -7811 -6360 -5473 -2214 -2231 -9200 -8719 -6737 -12527
10708a2527Q423j961l858O767L157o761k801J112K616K376k590l217k765O541
$$ -12527 -4104 -6065 -9923 -3156 1 -6760 -9561 -8449 -5833 -3457 -6047 -9264 -12029 -5488
10694e488P382J104l845k494J774O749R85m928j354R3R88k378L447O568n57j0800
$$ -5488 1894 2998 -847 -3341 -1567 5182 6167 1239 -115 -22 966 -1412 2035 8603 8046 -2754
10678b754k737j69K014k419n87r1k81J276J304M685O353l713n521N2m030k407
$$ -2754 -5491 -5660 -3646 -6065 -6652 -6743 -7024 -5748 -4444 241 6594 2881 -2640 -2588 -6618 -9025
10662i025k120K674P439n808l938N541N055M584K622M76L308r360o245O309L563
$$ -9025 -11145 -8471 -1032 -6840 -10778 -5237 -182 4402 7024 7500 10808 1448 -4797 1512 5075
10647E075L004K018o981K77K33l052o666M486R004M189m260j0212p548L565O234
$$ 5075 8079 10097 3116 3393 3626 574 -6092 -1606 7398 11587 7327 -2885 -10433 -6868 -634
10632f34q461j242O277J409k341l932J88J55M08n117L366k75M93M495J869k554
$$ -634 -9095 -10337 -4060 -2651 -4992 -8924 -8736 -8581 -8173 -13290 -9924 -10199 -9706 -5211 -3342 -5896
10616e896k052k04N917J132n978j097N79l38J188K679J023M436L502K82m143k797
$$ -5896 -7948 -8152 -2235 -1103 -7081 -8178 -7599 -7937 -6749 -4070 -3047 1389 4891 5173 1030 -1767
10600a767j508J602L384k88J994k333j595j001k155P21K27k500k843R566P910
$$ -1767 -3275 -1673 1711 1423 3417 1084 -511 -1512 -3667 -2946 -2719 -5219 -8062 1504 9414
10585I414o982n359j182K48k634o222r95M315J860j189J956J0651j42l832p465
$$ 9414 2432 -2927 -4109 -3861 -6495 -12717 -13712 -9397 -7537 -8726 -6770 3881 3739 -93 -7558
10570g558r90K113j381J522l881l273J765M883J4341J943m606p343q908m006K61
$$ -7558 -8548 -6435 -7816 -6294 -10175 -13448 -11683 -6800 7541 9484 4878 -2465 -11373 -15379 -15118
10555a5118K86O50l796k719K703M616K16J079J078K173J078J642J498K232k419
$$ -15118 -14832 -14182 -17978 -20697 -17994 -13378 -13162 -12083 -11005 -8832 -7754 -6112 -4614 -2382 -4801
10540d801o34K485M326P654L542M18p53k989J096k623J671L859p424M746l121
$$ -4801 -5435 -2950 1376 9030 12572 12990 12237 9248 10344 7721 9392 13251 5827 10573 7452
10525G452m148K305o11L89n243k726O860J799J258P030L507n589l09K711O526
$$ 7452 3304 5609 4998 5387 144 -2582 4278 6077 7335 14365 17872 12283 11974 14685 21211
10510B1211K239m5p07J458L763M517j22J2006J9543N942q445j4428j8965j1520
$$ 21211 23450 23405 22698 24156 27919 32436 32314 44320 63863 69805 61360 46932 27967 16447
10496A6447m237N69K416l619k737K378K283j014K660N398L855m541j828M380L852
$$ 16447 12210 12779 15195 11576 8839 11217 13500 12486 15146 20544 24399 19858 18030 22410 26262
10481B6262Q367O681j0110j1935q606J25L853K041O113L112J2941R482K552n270
$$ 26262 34629 41310 31200 19265 10659 10784 14637 16678 22791 25903 38844 48326 50878 45608
10467D5608m586m525j268j2887p416l993j569P215l333m040K33m3n986k575j629
$$ 45608 41022 36497 35229 22342 14926 10933 9364 16579 13246 9206 9439 9396 3410 835 -794
10452g94K822o9N434o66m9n366k453N301R683k637m115n340m902m744o285L815
$$ -794 2028 1959 7393 6727 6678 1312 -1141 4160 13843 11206 7091 1751 -3151 -7895 -14180 -10365
10436a0365Q099j108M152Q7l822n454L889N12n868p380r30O213O892K97j461M789
$$ -10365 -2266 -3374 778 865 -2957 -8411 -4522 -4010 -9878 -17258 -18188 -11975 -5083 -4786 -6247 -1458
10420a458Q248M595n320q490m644N331N700K746n589j011m000m236L953j848J792
$$ -1458 6790 11385 6065 -2425 -7069 -1738 3962 6708 1119 108 -3892 -8128 -4175 -6023 -4231
10405d231O881k04m560k370l121L972J341n73M018J876j240J288O769L832o221
$$ -4231 2650 2446 -2114 -4484 -7605 -3633 -2292 -2865 1153 3029 1789 3077 9846 13678 7457
10390G457j410n961L681O767j590q98p63o526m602n32M633N767N698L200j213
$$ 7457 6047 86 3767 10534 8944 8046 7283 757 -3845 -4377 256 6023 11721 14921 13708
10375A3708k573l502K489n502K768J903k363O56k870j546m22J439m095L109k296
$$ 13708 11135 7633 10122 4620 7388 9291 6928 7584 4714 3168 2746 4185 90 3199 903
10360I03O496L812j63L142j1394j3647O91L407M032l10k213O986K294n424m716
$$ 903 7399 11211 11048 14190 2796 -10851 -10160 -6753 -2721 -3031 -5244 1742 4036 -1388 -6104
10345f104M001K892k960J524M660K595N35Q644O82m656m359p480Q97N09N621P106
$$ -6104 -2103 789 -2171 -647 4013 6608 7143 15787 16469 11813 7454 -26 871 1380 7001 14107
10329A4107K88j514M385J481L212N565K950j438n566L206K624J759M288o539l828
$$ 14107 14395 12881 17266 18747 21959 27524 30474 29036 23470 26676 29300 31059 35347 28808 24980
10314B4980l715j803r50l600O7L668k709o689l507J689m071O794K950l978m190
$$ 24980 21265 19462 18512 14912 14979 18647 15938 9249 5742 7431 3360 10154 13104 9126 4936
10299D936q291l919P866Q369M139m874q845Q41P927M155n85k016j737l926k687
$$ 4936 -3355 -7274 592 8961 13100 8226 -619 222 8149 12304 11719 9703 7966 4040 1353
10284A353j219M658n310m111J391L596j542j531M715J092P9j597m313K179k633
$$ 1353 134 4792 -518 -4629 -3238 358 -1184 -2715 2000 3092 3171 1574 -2739 -560 -3193
10269c193K876r69m982J071O009k650L09O230N175J118j776l315q116m20L078
$$ -3193 -317 -1286 -6268 -5197 812 -1838 -1529 4701 9876 10994 9218 5903 -2213 -2633 445
10254D45j470l139K923L496K205N69j425J366M773k337m385P561K255o48l780
$$ 445 -1025 -4164 -1241 2255 4460 5029 3604 4970 9743 7406 3021 10582 12837 12189 8409
10239H409M870N406m102l517m325L090M538j346O263J2367M615N803P364J9416
$$ 8409 13279 18685 14583 11066 6741 9831 14369 13023 19286 31653 36268 42071 49435 68851
10225F8851K5670K7061K7659J6856l647j2682k1875k5209l1267j8083j4939n511
$$ 68851 94521 121582 149241 166097 162450 149768 127893 102684 71417 53334 38395 32884
10213C2884k800m071l896M532j510l380l479p295m894J45M979N217m047o578l060
$$ 32884 30084 26013 22117 26649 25139 21759 18280 10985 6091 6236 11215 16432 12385 5807 2747
10198B747K583P82K785j051K88K30k008J264M68M429o978r029K031L12O365J965
$$ 2747 5330 6112 8897 7846 8134 8364 6356 7620 8088 12517 5539 -3490 -1459 -1147 5218 7183
10182G183M96M02m240o195l623N156L583l903R238J441j577o905l180j168n071
$$ 7183 7679 8081 3841 -2354 -5977 -821 2762 -1141 8097 9538 7961 1056 -2124 -3292 -8363
10167h363p769l871J1310J0827l990m947J528J697m508J735l863l28R375L894
$$ -8363 -16132 -20003 -8693 2134 -1856 -6803 -5275 -3578 -8086 -6351 -10214 -10542 -1167 2727
10153B727n303K253Q18M027l263k034j934l215J356N751l235L10m586j626K627
$$ 2727 -2576 -323 495 4522 1259 -775 -2709 -5924 -4568 1183 -2052 -1742 -6328 -7954 -5327
10138e327L383N998K415m208n778N009r34q98k044n220R58O252L455M516L151
$$ -5327 -1944 4054 6469 2261 -3517 1492 558 -340 -2384 -7604 -6646 -394 3061 7577 10728
10123A0728O185p917n699L89Q173O023l349k829P1j457o494J133L799P745O920
$$ 10728 16913 8996 3297 3686 11859 17882 14533 11704 11775 10318 3824 4957 8756 16501 23421
10108B3421K806n83L580j594K810l909r259l246J197j943r56L609j161Q10M330
$$ 23421 26227 25644 29224 27630 30440 26531 17272 14026 15223 13280 12324 15933 14772 15582 19912
10093A9912l37o429l211J082M214j622K727m928o734m674M853K604J665M01l98
$$ 19912 19575 13146 9935 11017 15231 13609 16336 11408 4674 0 4853 7457 9122 9523 9125
10078I125k779k91k509j310L3K084R51J391K65K419o64r226L743M279J690q83
$$ 9125 6346 6055 3546 2236 2269 4353 5304 6695 6960 9379 8715 -511 3232 7511 9201 8318
10062H318j314M587l399J873j213m502k19l290n243l350P045P78k213J611J823
$$ 8318 7004 11591 8192 10065 8852 4350 4131 841 -4402 -7752 -707 71 -2142 -531 1292
10047A292N759Q94J266K54p939n223J616k93P551N617j3402n065k936L45M803
$$ 1292 7051 7945 9211 9465 1526 -3697 -2081 -2374 5177 10794 -2608 -7673 -10609 -10264 -5461
10032e461K733J692M65n923n576K23L790J743N237M4k549J244L820K635m212j747
$$ -5461 -2728 -1036 -571 -6494 -12070 -11847 -8057 -6314 -1077 -1033 -3582 -2338 1482 4117 -95 -1842
10016a842K096j84l407m243M530Q444K503j820n597k843n377k36j496k303K598
$$ -1842 254 70 -3337 -7580 -3050 5394 7897 6077 480 -2363 -7740 -7976 -9472 -11775 -9177
10001i177P903M401K298n479m54K878k715N23R02j1248k758M429M966J283J919
$$ -9177 -1274 3127 5425 -54 -508 2370 -345 178 1080 -10168 -12926 -8497 -3531 -2248 -329
9986c29m571j18L191J019J293j000j029J068n723n29m08Q52M200K008n763m278
$$ -329 -4900 -5018 -1827 -808 485 -515 -1544 -476 -6199 -6728 -7136 -6284 -2084 -76 -5839 -10117
9970a0117j94N458j901j255j288R52K044l52P265K594m830m465M123Q25Q02L044
$$ -10117 -10311 -4853 -6754 -8009 -9297 -8345 -6301 -6653 612 3206 -1624 -6089 -1966 -1141 -339 2705
9954B705J370J316N571K396p301r775o02n83l030l32L548M821O75j667J076K280
$$ 2705 4075 5391 10962 13358 6057 -3718 -4320 -4903 -7933 -8265 -4717 104 779 -888 188 2468
9938B468L034K084j944q66J702K063r09m846M746k985k167K686P93K714m45m728
$$ 2468 5502 7586 5642 4776 6478 8541 7632 2786 7532 4547 2380 5066 5859 8573 8128 3400
9922C400m705M425J914k928K501L655n00q833P27K704K510p89m723l795l027L456
$$ 3400 -1305 3120 5034 2106 4607 8262 7762 -1071 -344 2360 4870 4081 -642 -4437 -7464 -4008
9906d008K53J394M865k418m195K944L332j680Q198K658K754M002M885N597L936
$$ -4008 -3755 -2361 2504 86 -4109 -1165 2167 487 8685 11343 14097 18099 22984 28581 32517
9891C2517K059p158o470n162O75o974m256q227l874n982L403n86j76K598o67M328
$$ 32517 34576 27418 20948 15786 16461 9487 5231 -2996 -6870 -12852 -9449 -10035 -10211 -7613 -8280 -3952
9875c952M596n89j204j239K207J939J322L876L043K325J385j288q773l622n30
$$ -3952 644 55 -1149 -2388 -181 1758 3080 6956 9999 12324 13709 12421 3648 26 -504
9860e04l781p75k467l784j150M065Q949k832j216K512P174M305k809J209K106
$$ -504 -4285 -5060 -7527 -11311 -12461 -8396 553 -2279 -3495 -983 6191 10496 7687 8896 11002
9845A1002k447l146l612p213Q95J669k767Q9N65M542Q541j634n637p538k785O228
$$ 11002 8555 5409 1797 -5416 -4521 -2852 -5619 -5530 -4965 -423 8118 6484 847 -6691 -9476 -3248
9829c248O448M487j049L989M267J3408J6640J9179J9105O478J661q466j2774m468
$$ -3248 3200 7687 6638 10627 14894 28302 44942 64121 83226 89704 91365 82899 70125 65657
9815F5657J601k341j1241j7759j0034n354m7L357m790k298K132n146M84p624o45
$$ 65657 67258 64917 53676 35917 25883 20529 20482 23839 19049 16751 18883 13737 14221 6597 5952
9800E952Q018L041J70K851m815L680J69j680k470j1685o393p81R09Q519P136j030
$$ 5952 13970 17011 17181 20032 15217 18897 19066 17386 14916 3231 -3162 -3943 -3034 5485 12621 11591
9784A1591j714j850n681k308J892O859J743K195j807o123M474J360j743R17O76
$$ 11591 9877 8027 2346 38 1930 8789 10532 12727 10920 4797 9271 10631 8888 9805 10481
9769A0481l194j101k788m052j771J4672N830j0807m908j897K380J881k320o25
$$ 10481 7287 6186 3398 -654 -2425 12247 18077 7270 2362 465 2845 4726 2406 1781
9755A781j173m063L498P02j0008p314Q498P660J858L251n57M83m922L13O306n483
$$ 1781 608 -3455 43 745 -9263 -16577 -8079 -419 1439 4690 4133 4616 -306 7 6313 830
9739H30j1047L681N523q47n520N910M399O05K202n10r998p396j657P722j30O2
$$ 830 -10217 -6536 -1013 -1860 -7380 -1470 2929 3534 5736 5226 -4772 -12168 -13825 -6103 -6233 -6171
9723f171J306m50p166K62J2656J858q676p51N648L113K581J575m749L26m49m415
$$ -6171 -4865 -5315 -12481 -12219 437 2295 -6381 -7132 -1484 1629 4210 5785 1036 1362 913 -3502
9707c502n813j051N805K839K634j163m486j670k011J619O278J231l773l118k716
$$ -3502 -9315 -10366 -4561 -1722 912 -251 -4737 -6407 -8418 -6799 -521 710 -3063 -6181 -8897
9692h897L089J0928K04n432n922n613q95K222r96J023n29R044J1406J40p161o68
$$ -8897 -5808 5120 5324 -108 -6030 -11643 -12538 -10316 -11312 -10289 -10818 -1774 9632 9772 2611 1943
9676A943m762l211L920O875Pj994j978J855j799P64j228n010o686N612K339j120
$$ 1943 -2819 -6030 -2110 4765 4772 2778 800 2655 856 1620 392 -4618 -11304 -5692 -3353 -4473
9660d473L557m860k769J529p62K452J1713N818m623o538J178K918J020J998j509
$$ -4473 -916 -5776 -8545 -7016 -7778 -5326 6387 12205 7582 1044 2222 5140 6160 8158 6649
9645F649J765K454m248r013l795L787j671M704N884j654n214J667k000L742n889
$$ 6649 8414 10868 6620 -2393 -6188 -2401 -4072 632 6516 4862 -352 1315 -685 3057 -2832
9630b832o74K842k643m973M549J143K67m73o5M492N706N324j387o783l803k483
$$ -2832 -3506 -664 -3307 -8280 -3731 -2588 -2321 -2794 -2859 1633 7339 12663 11276 4493 690 -1793
9614a793j19K706l782L804O650m227n6l875O41j041j2657Q25J0981J0487m204
$$ -1793 -1912 794 -2988 816 7466 3239 3183 -692 -51 -1092 -13749 -12924 -1943 8544 4340
9599D340o756Q6M574N704O395r4k992J845K852j534k72n162p244m992j248j045
$$ 4340 -2416 -2330 2244 7948 14343 14249 11257 13102 15954 14420 14148 8986 1742 -3250 -4498 -5543
9583e543n132k078L961P483M378N12m393l351L196L369L336n238m71j986L281
$$ -5543 -10675 -12753 -8792 -1309 3069 3581 -812 -4163 -967 2402 5738 500 29 -1957 1324
9568A324M112J819N973m205l540l801J876l057j131p06L039J605l04M453M204
$$ 1324 5436 7255 13228 9023 5483 1682 3558 501 -630 -1336 1703 3308 3004 7457 11661
9553A1661l721n544N400K350q31m219j870Q83l199j466K646j068L707M235k3j783
$$ 11661 7940 2396 7796 10146 9315 5096 3226 4109 910 -556 2090 1022 4729 8964 8941 7158
9537G158q796q539n789J142J408l86j461L115Q53k96L14p068L029L336J1257Q830
$$ 7158 -1638 -10177 -15966 -14824 -13416 -13802 -15263 -12148 -11295 -11591 -11277 -18345 -15316 -11980 -723 8107
9521H107k064l944l678L406K639n520l843k170L506O139K649k698j193J402j506
$$ 8107 6043 2099 -1579 1827 4466 -1054 -4897 -7067 -3561 2578 5227 2529 1336 2738 1232
9506A232K195M340K214J289n385n65N374k439p198N186l087n726k402k562j200
$$ 1232 3427 7767 9981 11270 5885 5320 10694 8255 1057 6243 3156 -2570 -4972 -7534 -8734
9491h734n22Q963O501J479r053n936o680n416O23N162M931k020m683j650M098
$$ -8734 -9256 -293 6208 7687 -1366 -7302 -13982 -19398 -18775 -13613 -8682 -10702 -15385 -17035 -12937
9476a2937K806P24R539P195k183r726n101N038M541L807N09j91K484N292l010
$$ -12937 -10131 -9407 132 7327 5144 -4582 -9683 -4645 -104 3703 4212 4021 6505 11797 8787
9461H787r786j314J86k076L458K089q99m142J102O990M338l904l440J870l781
$$ 8787 -999 -2313 -2127 -4203 -745 1344 445 -3697 -2595 4395 8733 4829 1389 3259 -522
9446e22J723K225q551n335J961P875M57L116j806n234L135L117o22m014J053n776
$$ -522 1201 3426 -5125 -10460 -8499 -624 -167 2949 1143 -4091 -956 2161 1539 -2475 -1422 -7198
9430g198M7L300j336L920j921J788j672j707L299J1721P526j619k470j0414p926
$$ -7198 -7151 -3851 -5187 -1267 -3188 -1400 -3072 -4779 -1480 10241 17767 16148 13678 3264 -4662
9415d662K734L490M251j943Q48M416o125o331l152L711k061j410k278R159j51
$$ -4662 -1928 1562 5813 3870 4718 9134 3009 -3322 -6474 -2763 -4824 -6234 -8512 647 496
9400D96n183N459L839j547L86O413j654m378m290M579O429%j253n281l101j337
$$ 496 -4687 772 4611 3064 3450 9863 8209 3831 -459 4120 10549 10549 9296 4015 914 -423
9384d23p231k944M98J300J992k580j915J65N945N549j166J282j383K742l882m835
$$ -423 -7654 -10598 -10100 -8800 -6808 -9388 -11303 -11138 -5193 356 -810 472 -911 1831 -2051 -6886
9368f886j708L07J882L96J868L940J0350K827M29m548r661l737n054M535N275
$$ -6886 -8594 -8287 -6405 -6009 -4141 -201 10149 12976 13405 8857 -804 -4541 -9595 -5060 215
9353B15j283P96K491M121P384l050l006q46o431O9k255O47o58O566j452l509K269
$$ 215 -1068 -272 2219 6340 13724 10674 7668 6822 391 460 -1795 -1148 -1806 4760 3308 -201 2068
9336B068J765R70j95K972M29J943o57k439M468o889k082R29J280k608k296m51
$$ 2068 3833 4803 4608 7580 8009 9952 9295 6856 11324 4435 2353 3282 4562 1954 -342 -793
9320g93J503j375o202q94O22N330L576k407J510J336M499J066o30m085M107M437
$$ -793 710 -665 -6867 -7761 -7139 -1809 1767 -640 870 2206 6705 7771 7141 3056 7163 11600
9304A1600n835n964k61J454p908N563K460K612n78m756j484M502j541p1n337j43
$$ 11600 5765 -199 -460 994 -6914 -1351 1109 3721 3143 -1613 -3097 1405 -136 -207 -5544 -5687
9288e687n85o131O794L489j271O150P785K75l304m578k372L87N684N387l725j646
$$ -5687 -6272 -12403 -5609 -2120 -3391 2759 10544 10819 7515 2937 565 952 6636 12023 8298 6652
9272F652l304n78L249j483j396l216l52m980O131L280J732j378J764J686j616
$$ 6652 3348 2770 6019 4536 3140 -76 -428 -5408 723 4003 5735 4357 6121 7807 6191
9257F191l950R08m1j116N224P958Pk722j857n195m918K223O336j324o187K894
$$ 6191 2241 3149 3108 1992 7216 15174 15181 12459 10602 5407 489 2712 9048 7724 1537 4431
9241D431J755k865J390l91J733L356n853J961L871J404K593n610l561M654L270
$$ 4431 6186 3321 4711 4320 6053 9409 3556 5517 9388 10792 13385 7775 4214 8868 12138
9226A2138l084k927L960J998m084M936O380J823J982o22j746n608o835L359N459
$$ 12138 9054 6127 10087 12085 8001 12937 19317 21140 23122 22500 20754 15146 8311 11670 17129
9211A7129N327j708r375J228L943n860m414M230K527L045k723k338j586Q403O669
$$ 17129 22456 20748 11373 12601 16544 10684 6270 10500 13027 16072 13349 11011 9425 17828 24497
9196B4497r782j90N519K685j859o55o434m505r56K804J214O16L49j486k751m343
$$ 24497 14715 14525 20044 22729 20870 20215 13781 9276 8320 11124 12338 12954 13303 11817 9066 4723
9180D723K279J573M660l72n39R719j292n334m52m007K729k855k005J336M355N873
$$ 4723 7002 8575 13235 12863 12324 22043 20751 15417 14965 10958 13687 10832 8827 10163 14518 20391
9164B0391j138l486L046K047K487N186l67K630J814j0636m125P626Q134k546j0012
$$ 20391 19253 15767 18813 20860 23347 28533 28166 30796 32610 21974 17849 25475 33609 31063 21051
9149B1051L641l23o251L99P95n713J44M717L360M886L189Q70N52j584l427Q0l44
$$ 21051 24692 24369 18118 18517 19312 13599 13743 18460 21820 26706 29895 30765 31317 29733 26306 26386 26042
9132B6042j131l643O840Q758P45K773q08M126P018j298o067J424m066M955L580
$$ 26042 24911 21268 28108 36866 37611 40384 39576 43702 50720 49422 43355 44779 40713 45668 49248
9117D9248n57J446M13j45M026K972n381M918M109N232J625O250K977q405l981
$$ 49248 48691 50137 50550 50405 54431 57403 52022 56940 61049 66281 67906 74156 77133 68728 64747
9102F4747O906P148J0727R216O172m443j526J945J0071J4460Q294Q451j929Q611
$$ 64747 71653 78801 89528 98744 104916 100473 98947 100892 110963 125423 133717 142168 140239 148850
9088A48850Q195R169J2381J3638J3406J4382J9616J4774K2529J9678K3260K1374
$$ 148850 157045 166214 178595 192233 205639 220021 239637 254411 276940 296618 319878 341252
9076C41252L1225L0838L7709M9246M6298N4313M9779N6248N8790O4726O9385P1564
$$ 341252 372477 403315 441024 490270 536568 590881 640660 696908 755698 820424 889809 961373
9064I61373P4239O6135N6210M8667K9894J5225k783j9721l8527n6328o4624o4225
$$ 961373 1035612 1101747 1157957 1206624 1236518 1251743 1248960 1229239 1190712 1134384 1069760 1005535
9052A005535o4355p3018p4969o3095n2209m6367l6802l9091m0669l4284l3716
$$ 1005535 941180 868162 793193 730098 677889 631522 594720 555629 514960 480676 446960
9041D46960k4763k4949k5015k3305j4039j1169j4854j6137j8922j1457j1586j1766
$$ 446960 422197 397248 372233 348928 334889 323720 308866 292729 273807 262350 250764 238998
9029B38998q035j1537r272q414j5504j3383q879o737n118o153p022j1278p95o382
$$ 238998 230963 219426 210154 201740 186236 172853 163974 157237 152119 145966 138944 127666 126871 120489
9015A20489m432j4883j4521M259J0270L766m828r107j942q650p271o533j258M357
$$ 120489 116057 101174 86653 90912 101182 104948 100120 91013 89071 80421 73150 66617 65359 69716
9001F9716l960l119m02n446M288j7m869J717j02j533k934m558p929o12k870l647
$$ 69716 65756 62637 62235 56789 61077 61060 56191 57908 57806 56273 53339 48781 40852 40240 37370 33723
8985C3723o643M046J5J662N581L284J08m975q969j529m006m106N64J511K172k749
$$ 33723 27080 31126 31141 32803 38384 41668 41776 36801 27832 26303 22297 18191 18755 20266 22438 19689
8969A9689o55k901o079K341J853O274m690q652j450j007Q861J312L621n85m479
$$ 19689 19034 16133 10054 12395 14248 20522 15832 7180 5730 4723 13584 14896 18517 17932 13453
8954A3453l444J0L065N25l678l305N975O501j960l081M327n950o038J755n426
$$ 13453 10009 10019 13084 13609 9931 6626 12601 19102 17142 14061 18388 12438 6400 8155 2729
8939B729P883M960N310K504l908q437j440K872Q01l101M049m09n593j508j253
$$ 2729 10612 15572 20882 23386 19478 11041 9601 12473 13274 10173 14222 13813 8220 6712 5459
8924E459m008o23L864j534K488M967p873k311M419M674P024p510j668K363M715
$$ 5459 1451 828 4692 3158 5646 10613 2740 429 4848 9522 16546 9036 7368 9731 14446
8909A4446P58l184l966L74k653m189J994j544J49K513j561O63J606O899P098m143
$$ 14446 15204 12020 8054 8428 5775 1586 3580 2036 2185 4698 3137 3800 5406 12305 19403 15260
8893A5260o466k837j972J069m49j43J425J624l046j802j758m8K586N300M702J767
$$ 15260 8794 5957 3985 5054 4605 4462 5887 7511 4465 2663 905 857 3443 8743 13445 15212
8877A5212K365K77q485K836J395p698o12K510j62j257q80k766o551L682P793m23
$$ 15212 17577 17854 9369 12205 13600 5902 5290 7800 7638 6381 5501 2735 -3816 -134 7659 7236
8861G236J193J832j588k904P91l50j216l651K7M066O547l832r648j674m918K419
$$ 7236 8429 10261 8673 5769 6560 6210 4994 1343 1370 5436 11983 8151 -1497 -3171 -8089 -5670
8845e670N067j389N158L296n161k232l30K605M843L55N723O559q842j3025K6N587
$$ -5670 -603 -1992 3166 6462 1301 -931 -1261 1344 6187 6542 12265 18824 9982 -3043 -3017 2570
8829B570l279j757k048k009L47M556L475L132n984l43J468K422p24J667K127J437
$$ 2570 -709 -2466 -4514 -6523 -6176 -1620 1855 4987 -997 -1340 128 2550 1826 3493 5620 7057
8813G057r106l071N512k961N2j186k980Q764L952k723R82J174q08Po56k11l807
$$ 7057 -2049 -5120 392 -2569 -2517 -3703 -6683 2081 6033 3310 4292 5466 4658 4665 4009 3798 -9
8796iL350J631l251n475j599J426J686o72K441J565j972J030L703l838L178J170
$$ -9 3341 4972 1721 -3754 -5353 -3927 -2241 -2913 -472 1093 -879 151 3854 16 3194 4364
8780D364k444j759J294L852r14r5J061R80l269k72p57R69o71l800k747K087M64
$$ 4364 1920 161 1455 5307 4393 4298 5359 6339 3070 2798 2041 3010 2339 -1461 -4208 -2121 -1657
8763a657K940k618k034K982M238K012l719q90p686J414Q969K531q657j167M786
$$ -1657 1283 -1335 -3369 -387 3851 5863 2144 1254 -6432 -5018 3951 6482 -2175 -3342 1444
8748A444J020K394k6j02L538n125j417q50j512J180R377k707j138n183m59j79
$$ 1444 2464 4858 4832 4730 8268 3143 1726 876 -636 544 9921 7214 6076 893 434 255
8732B55q56L439k899k701p287O690K302J321N444M790O678m693p972k150M740
$$ 255 -601 2838 -61 -2762 -10049 -3359 -1057 264 5708 10498 17176 12483 4511 2361 7101
8717G101p494l02L860k669k042M808M334L274j136k200m425l858J687o2L75K974
$$ 7101 -393 -695 3165 496 -1546 3262 7596 10870 9734 7534 3109 -749 938 876 1251 4225
8701D225m401o340n19M529L516j758k339L624K427K031k450j296k441o0R91m213
$$ 4225 -176 -6516 -7035 -2506 1010 -748 -3087 537 2964 4995 2545 1249 -1192 -1252 -261 -4474
8685d474K270N34K6n06l039J638J091K64K674K128N36K268j769J449l614m738
$$ -4474 -2204 -1670 -1644 -2150 -5189 -3551 -2460 -2196 478 2606 3142 5410 3641 5090 1476 -3262
8669c262o24K603o04N782J552l776l895r72k28O860K746m349l484q83l529R94
$$ -3262 -3886 -1283 -1887 3895 5447 1671 -2224 -3196 -3424 3436 6182 1833 -1651 -2534 -6063 -5069
8653e069O654Q327K843m422l898K361Q60l896l003k336P0q76L24J327l617n447
$$ -5069 1585 9912 12755 8333 4435 6796 7656 3760 757 -1579 -1509 -2385 -2061 -734 -4351 -9798
8637i798J595k686J771M069O216O210J516m707m681J120O10m568j004k546K966
$$ -9798 -8203 -10889 -9118 -5049 1167 7377 8893 4186 -495 625 1235 -3333 -4337 -6883 -3917
8622c917M559O393o686p48O970J951l125J239R427k350m020l078l446L813k227
$$ -3917 642 7035 349 -399 6571 8522 5397 6636 16063 13713 9693 6615 3169 6982 4755
8607D755o728j797l47J536j445K685j987J648P112o517m638N518O984K670K572
$$ 4755 -1973 -3770 -4117 -2581 -4026 -1341 -3328 -1680 5432 -1085 -5723 -205 6779 9449 12021
8592A2021J784n681m168o419J165J1066K909q7k26l701j064k605n297j252m467
$$ 12021 13805 8124 3956 -2463 -1298 9768 12677 12590 12364 8663 7599 4994 -303 -1555 -6022
8577f022r045J895N619N333J45j036k606l805o93P738k747j803L082q76o64p3
$$ -6022 -15067 -13172 -7553 -2220 -2075 -3111 -5717 -9522 -10215 -2477 -5224 -7027 -3945 -4821 -5485 -5558
8561e558Q61j589O853M856M922j422m92l521o083R89L806l754n302K137J596n149
$$ -5558 -4697 -6286 567 5423 10345 8923 8431 4910 -1173 -184 3622 -132 -5434 -3297 -1701 -6850
8545f850k048m60o00k312M560P523L536m795m844J950k952L758M872L819L068
$$ -6850 -8898 -9358 -9958 -12270 -7710 -187 3349 -1446 -6290 -4340 -7292 -3534 1338 5157 8225
8530H225j3m368m824j379q1Q34L373J393N919l774l050M312q61p186k648k62L523
$$ 8225 8212 3844 -980 -2359 -2440 -1606 1767 3160 9079 5305 2255 6567 5706 -1480 -4128 -4390 -867
8513h67k380m034N096m533J093Q081M614l262P90K034l227j778N643k13J94m961
$$ -867 -3247 -7281 -2185 -6718 -5625 2456 7070 3808 4598 6632 3405 1627 7270 7057 7251 2290
8497B290O27K282K346m223j931L143p00K255P78Q09j793m049k964l730M480J611
$$ 2290 2917 5199 7545 3322 1391 4534 3834 6089 6867 7676 5883 1834 -1130 -4860 -380 1231
8481A231M651p390j839P973N802m79k159o021L387K918p075j0060K508K339R70
$$ 1231 5882 -1508 -3347 4626 10428 9949 7790 1769 5156 8074 999 -9061 -6553 -4214 -3244
8466c244L347l682r353j017O026L757R82n284l120J076M137K737J51K620M813
$$ -3244 103 -3579 -12932 -13949 -7923 -4166 -3184 -8468 -11588 -10512 -6375 -3638 -3487 -867 3946
8451C946M90k119n073n586o045J319P601j703L36N511O37K059O977m86q97J084
$$ 3946 4436 2317 -2756 -8342 -14387 -13068 -5467 -7170 -6834 -1323 -686 1373 8350 7864 6967 8051
8435H051m287j004k340N816M036m438p096n854J394J999O616K834j63k726r111
$$ 8051 3764 2760 420 6236 10272 5834 -1262 -7116 -5722 -3723 2893 5727 5564 2838 -6273
8420f273j36N715K13K320L740J632J145k716M18L421r036n302O740m200R53j08
$$ -6273 -6409 -694 -481 1839 5579 7211 8356 5640 6058 9479 443 -4859 1881 -2319 -1366 -1474
8404a474J087p87M265R63N8R15p015k870n102k288Q833N843L023m32m214j672
$$ -1474 -387 -1174 3091 4054 4112 5027 -1988 -4858 -9960 -12248 -3415 2428 5451 5019 805 -867
8388h67J662m517M45K795K735l92j660n206l288J224N894K748m818N435k849r19
$$ -867 795 -3722 -3277 -482 2253 1861 201 -5005 -8293 -7069 -1175 1573 -3245 2190 -659 -1578
8372a578p14J746Q646n80n437n775m508K680M764M679p13n119N508P611n14n186
$$ -1578 -2292 -546 8100 7520 2083 -3692 -8200 -5520 -756 3923 3210 -1909 3599 11210 10696 5510
8356E510p603j0849K428Q623l383m57k53K950P32N516O947m109n984o105P29O023
$$ 5510 -2093 -12942 -10514 -1891 -5274 -5731 -5984 -3034 -2302 3214 10161 6052 68 -6037 -5308 715
8340G15m386o39N45K97n987j33K398J440J359J120k769Q97J948n485N206j333
$$ 715 -3671 -4310 -3765 -3468 -9455 -9588 -7190 -5750 -4391 -3271 -6040 -5143 -3195 -8680 -3474 -4807
8324d807m622J986J98p001j799R48o23J1043R866p74n014o180k641j170M808J319
$$ -4807 -9429 -7443 -7245 -14246 -16045 -15097 -15720 -4677 5189 4415 -599 -6779 -9420 -10590 -5782 -4463
8308d463J881L569l966O17k235n76L420k152J09k466L655j895J683j780L545L116
$$ -4463 -2582 987 -2979 -2362 -4597 -5173 -1753 -3905 -3796 -6262 -2607 -4502 -2819 -4599 -1054 2062
8292B062k283m139n000l216J716N399O630k370k141l503l878m09j411k07K944
$$ 2062 -221 -4360 -9360 -12576 -10860 -5461 1169 -1201 -3342 -6845 -10723 -11132 -12543 -12750 -9806
8277i806Q563L206l061L165l606j879k6n924l181K196j248M959Q31j701N043K167
$$ -9806 -1243 1963 -1098 2067 -1539 -3418 -3444 -9368 -12549 -10353 -11601 -6642 -5811 -7512 -2469 -302
8261c02j086L015K127j447o108p71N792J974m078P10j178L490n285Q07J116m197
$$ -302 -1388 1627 3754 2307 -3801 -4572 1220 3194 -884 -174 -1352 2138 -3147 -2340 -1224 -5421
8245e421M035j947l890m272N219O380M475M437j187M15p187l027N338P316n300
$$ -5421 -1386 -3333 -7223 -11495 -6276 104 4579 9016 7829 8244 1057 -1970 3368 10684 5384
8230E384n62j410j147N024n71j1406o426L025P705M372j528l970J362O849r69
$$ 5384 4822 3412 2265 7289 6718 -4688 -11114 -8089 -384 3988 2460 -1510 -148 6701 5732
8215E732l35k862p76m868K730m292m241K904K027K61k32M084j905K831n08r304
$$ 5732 5397 2535 1759 -3109 -379 -4671 -8912 -6008 -3981 -3720 -3952 132 -1773 1058 550 -8754
8199h754j207N415N962N517J074l364j767j48n180r16L995m104o796M561Q90m337
$$ -8754 -9961 -4546 1416 6933 8007 4643 2876 2728 -2452 -3368 627 -3477 -10273 -5712 -4822 -9159
8183i159P81J955j47R20N834j616o057j381k751K517o84j06L720L369o12L77j358
$$ -9159 -8378 -6423 -6570 -5650 184 -1432 -7489 -8870 -11621 -9104 -9788 -9894 -6174 -2805 -3417 -3040 -4398
8166d398K555K738l057K239K019K110J355m828j58K63l596N26N196o155q02Q494
$$ -4398 -1843 895 -2162 77 2096 4206 5561 733 575 838 -2758 -2232 2964 -3191 -3993 4501
8150D501M605j651k16l616L25lo449L187P526k390l241K253M511M756l114r650
$$ 4501 9106 7455 7239 3623 3948 3945 -2504 683 8209 5819 2578 4831 9342 14098 10984 1334
8134A334r529j353J885P961N816l349K375L633j897o726P8L1K081J958oq281q64
$$ 1334 -8195 -9548 -7663 298 6114 2765 5140 8773 6876 150 228 259 2340 4298 4292 -3989 -4853
8117d853K868o916J298R09L033K538m582J7k29p94K174R70N730J371k503M245
$$ -4853 -1985 -8901 -7603 -6694 -3661 -1123 -5705 -5688 -5917 -6711 -4537 -3567 2163 3534 1031 5276
8101E276j285j419J850k546j617j27K932J767r97K902L880k0n03J211j152l9k222
$$ 5276 3991 2572 4422 1876 259 132 3064 4831 3834 6736 10616 10596 10093 11304 10152 10113 7891
8084G891j19K894k989l461L045L570r030O34R98n387L218q02O83J881M72o95k836
$$ 7891 7772 10666 7677 4216 7261 10831 1801 2435 3433 -1954 1264 462 1145 3026 3498 2803 -33
8067c3r79k415J347o80p36J076K662P353K211q399j1119j748q79P291N70Q294
$$ -33 -1012 -3427 -2080 -2760 -3496 -2420 242 7595 9806 1407 -9712 -11460 -12339 -5048 -4478 3816
8051C816J724l107r05J188K958m051L347k095M90K802Q46k727P531L157j1235
$$ 3816 5540 2433 1528 2716 5674 1623 4970 2875 3365 6167 7013 4286 11817 14974 3739
8036C739l706J019J704l82l217L79j478p167j512J1367r44j634K419J802m97J504
$$ 3739 33 1052 2756 2374 -843 -464 -1942 -9109 -10621 746 -198 -1832 587 2389 1892 3396
8020C396l47q059J52L396J070o899k020L76O077P950N8m214k896R68j357L008
$$ 3396 3049 -5010 -4858 -1462 -392 -7291 -9311 -8935 -2858 5092 5150 936 -1960 -992 -2349 659
8004F59j374n052K931J622q721l469M218Q71n240M304L648J984n449q264L074
$$ 659 -715 -5767 -2836 -1214 -9935 -13404 -9186 -8315 -13555 -9251 -5603 -3619 -9068 -17332 -14258
7989a4258R639N058O497m118L92K465R61M461j239J000k956n290l498N778J496
$$ -14258 -4619 439 6936 2818 3210 5675 6636 11097 9858 10858 7902 2612 -886 4892 6388
7974F388J339l122r309j833K837Q691J569m37N076M695o079j535k502p175m628
$$ 6388 7727 4605 -4704 -6537 -3700 4991 6560 6123 11199 15894 9815 8280 5778 -1397 -6025
7959f025O769O791n142m879o56O78K214L375J295o17M70R25n67J883m493n821
$$ -6025 744 7535 2393 -2486 -3142 -2464 -250 3125 4420 3803 4273 5198 4631 6514 2021 -3800
7943c800R07K833j145m135n523P681L278m271J416J949K869M147p52m596J306
$$ -3800 -2893 -60 -1205 -5340 -10863 -3182 96 -4175 -2759 -810 2059 6206 5454 858 2164
7928B164J46K095J324K286M201k050r227n165J775R63J614K578k041m358N963
$$ 2164 2310 4405 5729 8015 12216 10166 939 -4226 -2451 -1488 126 2704 663 -3695 2268
7913B268r00j794M300K776O036J531l767l240k569Q13j121m387n755L711K399
$$ 2268 1368 -426 3874 6650 12686 14217 10450 7210 4641 5454 4333 -54 -5809 -2098 301
7898C01k767r66m49N063P3J098o046L880M598J578K0L433j420n200n097j65o37
$$ 301 -2466 -3432 -3881 1182 1255 2353 -3693 187 4785 6363 6383 9816 8396 3196 -1901 -2066 -2703
7881b703j552J882l40j997K202L434L365K49K259k266M713l68q373k883k266L618
$$ -2703 -4255 -2373 -2713 -4710 -2508 926 4291 4540 6799 4533 9246 8878 505 -2378 -4644 -1026
7865a026K966n201L93k39J31J880M077O89q811n373K47M513N65o216n290P684
$$ -1026 1940 -3261 -2868 -3107 -2976 -1096 2981 3670 -5141 -10514 -10267 -5754 -5189 -11405 -16695 -9011
7849i011L316M00R38O422q668m570P472L296l51j796j442J886J178oj553j992
$$ -9011 -5695 -5295 -4357 2065 -6603 -11173 -3701 -405 -756 -2552 -3994 -2108 -930 -936 -2489 -4481
7833d481j24N958O695O654J316m763p49r53o902m098L981M052P79j432K035K276
$$ -4481 -4605 1353 8048 14702 16018 11255 10506 9553 2651 -1447 2534 6586 7365 5933 7968 10244
7817A0244L943p514p737K016m118m768P863M803L00K551p145n18P35l699j405
$$ 10244 14187 6673 -1064 952 -3166 -7934 -71 4732 5032 7583 438 -80 655 -3044 -4449
7802d449M215N643m238n231Q32K953m411j200l07l941K739L072j756Q898L696
$$ -4449 -234 5409 1171 -4060 -3228 -275 -4686 -5886 -6193 -10134 -7395 -4323 -6079 2819 6515
7787F515l375l957r044n150j8P192K910J592p717k722L345M946Q419r83j516L580
$$ 6515 3140 -817 -9861 -15011 -15029 -7837 -4927 -3335 -11052 -13774 -10429 -5483 2936 1953 437 4017
7771D017p235o006P349O800N38j629l022j019R85l558n2K918l548k357j419N113
$$ 4017 -3218 -9224 -1875 4925 5463 3834 812 -207 778 -2780 -2832 86 -3462 -5819 -7238 -2125
7755b125Q99k776l571J376Q537K363L649O8L397Q06k114m274p482J041K752n371
$$ -2125 -1226 -4002 -7573 -6197 2340 4703 8352 8420 11817 12623 10509 6235 -1247 -206 2546 -2825
7739b825p281J275p9p54O643Q376p03J452K556k622o400J292M927M23K177k0j787
$$ -2825 -10106 -8831 -8910 -9664 -3021 5355 4652 6104 8660 6038 -362 930 5857 6280 8457 8437 6650
7722F650o162k051M552J160l965K847M442m372J607p012k495j338m734m070J881
$$ 6650 488 -1563 2989 4149 184 3031 7473 3101 4708 -2304 -4799 -6137 -10871 -14941 -13060
7707a3060J605j927M943N496K892k527R42M990J519o703o787p718L940J1757R57
$$ -13060 -11455 -13382 -8439 -2943 -51 -2578 -1636 3354 4873 -1830 -8617 -16335 -12395 -638 319
7692C19p205J375p35Q3J403k647l455l53L266K114M771O083m001p402P661M123
$$ 319 -6886 -5511 -6246 -6163 -4760 -7407 -10862 -11215 -7949 -5835 -1064 5019 1018 -6384 1277 5400
7676E400j686l533n269L817J448J18l268O44R081K880m695o009J262l58N474K270
$$ 5400 3714 181 -5088 -1271 177 295 -2973 -2329 6752 9632 4937 -1072 190 -168 5306 7576
7660G576K810m65O8k792k01P194P991l13j1658r123K629J574j040J491n470o678
$$ 7576 10386 9921 9989 7197 6996 14190 22181 21868 10210 1087 3716 5290 4250 5741 271 -6407
7644f407L08o56j034N830N914l419m044L795K171q866p260O951R970J396J600
$$ -6407 -6099 -6755 -7789 -1959 3955 536 -3508 287 2458 -6408 -13668 -6717 3253 4649 6249
7629F249N17M19j277j863j900r7j715J52j535J46L152n298P09N278O34m156k312
$$ 6249 6766 7185 5908 4045 2145 2048 333 485 -1050 -904 2248 -3050 -2341 2937 3571 -585 -2897
7612b897l344P112L613m444o449L656K330l265K587L372K579M066m294o401l398
$$ -2897 -6241 871 4484 40 -6409 -2753 -423 -3688 -1101 2271 4850 8916 4622 -1779 -5177
7597e177K845Q245k726l264K08n40o921L063m089L250L703k398p354q68N135J0727
$$ -5177 -2332 5913 3187 -77 131 -409 -7330 -4267 -8356 -5106 -1403 -3801 -11155 -12023 -6888 3839
7581C839L097m457J954j280p24k43L481J498p187p56o224J239J423K458J51m562
$$ 3839 6936 2479 4433 3153 2429 2186 5667 7165 -22 -778 -7002 -5763 -4340 -1882 -1731 -6293
7565f293J109M926L937l999n815m58k795N239L714p697J16P557M955K354n248
$$ -6293 -5184 -258 3679 -320 -6135 -6593 -9388 -4149 -435 -8132 -8016 -459 4496 6850 1602
7550A602J788K387m669m536j964O311N325q57k028j0638n714N546K463K880K608
$$ 1602 3390 5777 1108 -3428 -5392 919 6244 5387 3359 -7279 -12993 -7447 -4984 -2104 504
7535E04P94m787M255R743M755l117n942n611L93n051J994N174o198j965N244k101
$$ 504 1298 -3489 766 10509 15264 12147 6205 594 987 -4064 -2070 3104 -3094 -5059 185 -1916
7519a916R64r49L914l526r04O58O711Q465m116m054n840m203j455K160N989j029
$$ -1916 -952 -1901 2013 -1513 -2417 -1759 4952 13417 9301 5247 -593 -4796 -6251 -4091 1898 869
7503H69K569Q830r93k417m504j1861L858L726J33n713J362M772M793o566k62N545
$$ 869 3438 12268 11275 8858 4354 -7507 -3649 77 210 -5503 -4141 631 5424 -1142 -1404 4141
7487D141j018n090p404j990M472J877O20J321J656N502N0J340J039L913K640l268
$$ 4141 3123 -1967 -9371 -11361 -6889 -5012 -4392 -3071 -1415 4087 4137 5477 6516 10429 13069 9801
7471I801j94m241q051K78L6n800m633P900O078O83n01m828J615n060L260k195
$$ 9801 9607 5366 -2685 -2407 -2371 -8171 -12804 -4904 1174 1857 1356 -3472 -1857 -6917 -3657 -5852
7455e852J034O84O023M410n776m486k03L259n026m447N230P891l636J569k167
$$ -5852 -4818 -4134 1889 6299 523 -3963 -4166 -907 -5933 -10380 -5150 2741 -895 674 -1493
7440a493p95k907J129m874J823K30k148r10k599L325M818J958L035M971L494k529
$$ -1493 -2288 -5195 -4066 -8940 -7117 -6887 -9035 -9945 -12544 -9219 -4401 -2443 592 5563 9057 6528
7424F528n32r736m846j023l190P480Q283N623j669j0187q243O205O454K025m832
$$ 6528 5996 -3740 -8586 -9609 -12799 -5319 2964 8587 6918 -3269 -11512 -5307 1147 3172 -1660
7409a660k484L450K056K84Q707j256p688l037n7q50M298j306N004j96q97m142
$$ -1660 -4144 -694 1362 1646 10353 9097 1409 -1628 -1685 -2535 1763 457 5461 5265 4368 226
7393B26p63m112j923L470L513k993j881M247p242j841J434j215K654J1202J296
$$ 226 -537 -4649 -6572 -3102 411 -2582 -4463 -216 -7458 -9299 -7865 -9080 -6426 4776 6072
7378F072o746m750k868O784K5m044J077L782K546j353j462J504o625k482K953
$$ 6072 -674 -5424 -8292 -1508 -1483 -5527 -4450 -668 1878 525 -937 567 -6058 -8540 -5587
7363e587k801M840P904N71K824N21p806r703p502J0310O962J213m528L633J170
$$ -5587 -8388 -3548 4356 4927 7751 8272 466 -9237 -16739 -6429 533 1746 -2782 851 2021
7348B021n240m928M764O331k689j994p849L525O739N312l776l069m183N090L279
$$ 2021 -3219 -8147 -3383 2948 259 -1735 -9584 -6059 680 5992 2216 -853 -5036 54 3333
7333C333j0290J757M069j350L51R14L315j281m80r742O526k172L104N960n134
$$ 3333 -6957 -5200 -1131 -2481 -2130 -1216 2099 818 338 -9404 -2878 -5050 -1946 4014 -1120
7318a120m059M751j524j653P265K739j122l538o149j424N088j586N91k66%J747
$$ -1120 -5179 -428 -1952 -3605 3660 6399 5277 1739 -4410 -5834 -746 -2332 -1741 -2007 -2007 -260
7302b60M81r93n876J258O916q111J086L068K599O63m422n471L271K047Q560K921
$$ -260 221 -772 -6648 -5390 1526 -6585 -5499 -2431 168 831 -3591 -9062 -5791 -3744 4816 7737
7286G737l781k168l330p098l028L503N345K60P755M773k79j750r34l461k649J20
$$ 7737 3956 1788 -1542 -8640 -11668 -8165 -2820 -2560 5195 9968 9689 7939 7005 3544 895 1015
7270A015k380r41K235J985p933n208l811o33R341M887n924p463J20j971J0166
$$ 1015 -1365 -2306 -71 1914 -6019 -11227 -15038 -15671 -6330 -1443 -7367 -14830 -14710 -16681 -6515
7255f515L483o749l016j457J056R893N901K039m944k056j619J956l040N349m775
$$ -6515 -3032 -9781 -12797 -14254 -13198 -3305 2596 4635 -309 -2365 -3984 -2028 -5068 281 -4494
7240d494o014K041O264N328k020J737l506q651j21K816K798R10K678J793J688
$$ -4494 -10508 -8467 -2203 3125 1105 2842 -664 -9315 -9436 -6620 -3822 -2912 -234 1559 3247
7225C247J929K335m988j0586M99L57k763p9O33m880o397r54O676N364r9P165q794
$$ 3247 5176 7511 2523 -8063 -7564 -7207 -9970 -10049 -9416 -14296 -20693 -21647 -14971 -9607 -9706 -2541 -11335
7208a1335k379N204J799n035n145J383R674R40m537n089M890O089O313m36m430
$$ -11335 -13714 -8510 -6711 -11746 -16891 -15508 -5834 -4894 -9431 -14520 -9630 -3541 2772 2336 -2094
7193b094j618K836l076J069M526l345M48J670j635j475K798k645O56J524o228
$$ -2094 -3712 -876 -3952 -2883 1643 -1702 -1254 416 -1219 -2694 104 -2541 -1885 -361 -6589
7178f589m582K631m302l576K611N989M813K70j471k743l628k155O855P044R96
$$ -6589 -11171 -8540 -12842 -16418 -13807 -7818 -3005 -2735 -4206 -6949 -10577 -12732 -5877 1167 2163
7163B163K48q147j926M003N937K464o599n132L751L923O66o098K557j390K263
$$ 2163 2411 -5736 -7662 -3659 2278 4742 -1857 -6989 -3238 685 1351 -4747 -2190 -3580 -1317
7148a317L20r05M16r26J837O970P739j56r833j0513K596j253j857l747L357J56
$$ -1317 -997 -1902 -1486 -2412 -575 6395 14134 13978 4145 -6368 -3772 -5025 -6882 -10629 -7272 -7116
7132g116J625L278N09K231k270K660n09j154J828P58j3J941r02j596j502O63j118
$$ -7116 -5491 -2213 -1704 527 -1743 917 408 -746 1082 1840 1827 3768 2866 1270 -232 431 -687
7115f87L398P308r09m659l597p75N636k205l723l80J982j793m449P862K742m446
$$ -687 2711 10019 9110 4451 854 79 5715 3510 -213 -593 1389 -404 -4853 3009 5751 1305
7099A305r37M161pP98N54j017k052o739m442K482o39K874O683O329N174m123K509
$$ 1305 368 4529 4522 5320 5874 4857 2805 -3934 -8376 -5894 -6533 -3659 3024 9353 14527 10404 12913
7082A2913j518l298l144p681J734J69l555j800R721J984j430L84M048M2m774r227
$$ 12913 11395 8097 4953 -2728 -994 -825 -4380 -6180 3541 5525 4095 4479 8527 8569 3795 -5432
7066e432l808k53M046j196M263L009j728K772k706J89K554j723l850j971p958
$$ -5432 -9240 -9493 -5447 -6643 -2380 629 -1099 1673 -1033 -844 1710 -13 -3863 -5834 -13792
7051a3792m782J488K312O292Q178Q141j544n754n130j387N150j400J958L572L085
$$ -13792 -18574 -17086 -14774 -8482 -304 7837 6293 539 -4591 -5978 -828 -2228 -270 3302 6387
7036F387j608r421J142k01j863j57K310k642L931m622n329P126P294l452m478
$$ 6387 4779 -4642 -3500 -3701 -5564 -5721 -3411 -6053 -2122 -6744 -12073 -4947 2347 -1105 -5583
7021e583J958r43M806J694l311N39J624o119M799N401J669n960k372o76J438M850
$$ -5583 -3625 -4568 238 1932 -1379 -840 784 -5335 -536 4865 6534 574 -1798 -2474 -1036 3814
7005C814o48k022p0m212r166k393J362M386L982M725j635O18k797p75J280K565
$$ 3814 3166 1144 1074 -3138 -12304 -14697 -13335 -8949 -4967 -242 -1877 -1259 -4056 -4831 -3551 -986
6989i86M390j151K445M749l835k550l852m641J662R11j55N99M771J672n176j726
$$ -986 3404 2253 4698 9447 5612 3062 -790 -5431 -3769 -2858 -3013 -2414 2357 4029 -1147 -2873
6973b873J279L618J906j54l022l832M093J401l460r79P134M872p14q530j417M691
$$ -2873 -1594 2024 3930 3776 754 -3078 1015 2416 -1044 -2023 5111 9983 9269 739 -678 4013
6957D013o450J608N474j0000j777R23l05N214J331K849N657l093n741k559N903
$$ 4013 -2437 -829 4645 -5355 -7132 -6209 -6514 -1300 31 2880 8537 5444 -297 -2856 3047
6942C047O24L585m326J278N209r043m529O61l601l79Q21j481K990P35J129N030
$$ 3047 3671 7256 2930 4208 9417 374 -4155 -3494 -7095 -7474 -6653 -8134 -5144 -4409 -3280 1750
6926A750j604n520j398M964K139J404Q254N674m291l808n888Q5m62m991K228O92
$$ 1750 146 -5374 -6772 -1808 331 1735 9989 15663 11372 7564 1676 1761 1299 -3692 -1464 -772
6910g72m312l113p904j736L764j603M873Q616r40l38q401k519M707O630J0233
$$ -772 -5084 -8197 -16101 -17837 -14073 -15676 -10803 -2187 -3127 -3465 -11866 -14385 -9678 -3048 7185
6895G185J625k303L651k244m27P437K022l762M198M769l672n723n706m491p70
$$ 7185 8810 6507 10158 7914 7487 14924 16946 13184 17382 22151 18479 12756 7050 2559 1789
6880A789L360o67Q19j836N10M512p07m59r65K495N517J147m713K337O688Q245
$$ 1789 5149 4482 5301 3465 3975 8487 7780 7321 6356 8851 14368 15515 10802 13139 19827 28072
6864B8072l232m385o607J164K33n522j090k518j661m508l683j986J02P23L573
$$ 28072 24840 20455 13848 15012 15245 9723 8633 6115 4454 -54 -3737 -5723 -5621 -4898 -1325
6849a325k63k402J092n06J451J504N889M119R89p931m289n81J016k155J413k524
$$ -1325 -1588 -3990 -2898 -3404 -1953 -449 5440 9559 10548 2617 -1672 -2253 -1237 -3392 -1979 -4503
6833d503j471J087K551o459j343K078k53l5l088J858k71k887J109Q269P032K525
$$ -4503 -5974 -4887 -2336 -8795 -10138 -8060 -8313 -8348 -11436 -9578 -9849 -12736 -11627 -3358 3674 6199
6817F199n072r8L78M986r68%k324j202l755l854K221O203N590J035o691j290L358
$$ 6199 1127 1029 1407 6393 5425 5425 3101 1899 -1856 -5710 -3489 2714 8304 9339 2648 1358 4716
6800D716J577M870n604m348J404K049M3K17O83n993o595o356K656Q600O106o273
$$ 4716 6293 11163 5559 1211 2615 4664 4707 4924 5607 -386 -6981 -13337 -10681 -2081 4025 -2248
6784b248n355K145J834J062L611R573P814j288m885K06J76K53P402J1457J1620
$$ -2248 -7603 -5458 -3624 -2562 1049 10622 18436 17148 12263 12469 12645 12898 20300 31757 43377
6769D3377J2186K503K10n569j7473j2012l3k536m952J281L881N284N546M327K758
$$ 43377 55563 58066 58276 52707 35234 23222 23189 20653 15701 16982 20863 26147 31693 36020 38778
6754C8778PN942R190J1787P815J8610K1185J5967K4400K6290R357J78l438j0727
$$ 38778 38785 44727 53917 65704 73519 92129 113314 129281 153681 179971 189328 189506 186068 175341
6740A75341j7755j8116j1124k2363j7743j6937j6902j7945o402o95m801j850j341
$$ 175341 157586 139470 128346 105983 88240 71303 54401 36456 30054 29359 24558 22708 21367
6727B1367l586k601l890l26M616K003L376l691l30N717K913o091o069J315j40
$$ 21367 17781 15180 11290 10964 15580 17583 20959 17268 16938 22655 25568 19477 13408 14723 14583
6712A4583J151L18j942j034k35m071l218P702M852l756l047m647j26N001L14n500
$$ 14583 15734 16052 14110 13076 12841 8770 5552 13254 18106 14350 11303 6656 6530 11531 11845 6345
6696F345l049N138J0130m413j2390P71q55J877L503o717n343O796K668m380o800
$$ 6345 3296 8434 18564 14151 1761 2532 1677 3554 7057 340 -5003 1793 4461 81 -6719
6681f719k309O897Q438P50l344j695o472j430K690j529L711K568Q82M912j933
$$ -6719 -9028 -2131 6307 7057 3713 2018 -4454 -5884 -3194 -4723 -1012 1556 2438 7350 5417
6666E417q183l133J534j771L289J122N04K894M25l670R35k561n141L513N569N5
$$ 5417 -2766 -5899 -4365 -6136 -2847 -1725 -1221 1673 2098 -1572 -637 -3198 -8339 -4826 743 798
6650G98o271m119j236L392J207L370M237O78r62l638K655Q36J605L204n563l226
$$ 798 -5473 -9592 -10828 -7436 -6229 -2859 1378 2056 1094 -2544 111 947 2552 5756 193 -3033
$$ [...]
##END NTUPLES=NMR SPECTRUM
##END=
