##TITLE=Analysis number 311225
Compound Code mo 00216
Book Reference 380/175/35
Project Code adrs
Chemist Name ronp
##JCAMPDX= 6.0         $$ Bruker NMR JCAMP-DX V2.0
##DATA TYPE= NMR SPECTRUM
##DATA CLASS= NTUPLES
##ORIGIN= Bruker BioSpin GmbH
##OWNER= NMR
$$ XWIN-NMR		Version 3.5
$$ Mon Jul  4 12:24:42 2005 GMT Daylight Time (UT+1h)  MAYBRIDGE\NMR@NMR_250MHZ
##.OBSERVE FREQUENCY= 250.131544655141
##.OBSERVE NUCLEUS= ^1H
##.ACQUISITION MODE= SIMULTANEOUS (DQD)
##.ACQUISITION SCHEME= undefined
##.AVERAGES= 16
##.DIGITISER RES= 18
##SPECTROMETER/DATA SYSTEM= dpx250
##.PULSE SEQUENCE= zg30
##.SOLVENT NAME= DMSO
##.SHIFT REFERENCE= (INTERNAL, DMSO, 0, 16.522)
##AUDIT TRAIL= $$ (NUMBER, WHEN, WHO, WHERE, WHAT)
$$ ##TITLE= Audit trail, XWIN-NMR		Version 3.5
$$ ##JCAMPDX= 5.01
$$ ##ORIGIN= Bruker BioSpin GmbH
$$ ##OWNER= NMR
$$ C:\u/data/dgb/nmr/ADRS/5270/pdata/1/auditp.txt
$$ ##AUDIT TRAIL=  $$ (NUMBER, WHEN, WHO, WHERE, WHAT)
(   1,<2005-07-04 12:24:19.79 +100>,<MAYBRIDGE\NMR>,<NMR_250MHZ>,
      <created by zg, POWCHK disabled, PULCHK disabled
       configuration hash MD5:
       62 19 C7 07 E1 42 D1 B7 37 6C 3D D0 77 39 F9 E6
       data hash MD5: 64K
       EE E9 45 04 8B 89 1F 60 4B C0 23 76 1E DB 9B 79>)
(   2,<2005-07-04 12:24:33.86 +100>,<MAYBRIDGE\NMR>,<NMR_250MHZ>,
      <Start of raw data processing
       ef LB = 0.3 FT_mod = 6 PKNL = 1 SI = 32K 
       data hash MD5: 32K
       93 4B 1A 39 17 CD E8 B5 8F 70 7F CC 09 2F 3A 9C>)
(   3,<2005-07-04 12:24:35.77 +100>,<MAYBRIDGE\NMR>,<NMR_250MHZ>,
      <apk 
       data hash MD5: 32K
       DF C2 49 12 F3 21 76 54 25 E6 7C E7 C4 A5 43 D9>)
(   4,<2005-07-04 12:24:36.52 +100>,<MAYBRIDGE\NMR>,<NMR_250MHZ>,
      <abs ABSG = 5 
       data hash MD5: 32K
       BC 63 E4 D0 FD 95 3D E1 86 D8 F7 4D D1 C3 E5 50>)
$$ ##END=
$$ 
$$ hash MD5
$$ 8C B6 AD 77 69 E3 B1 22 09 E9 5E 74 4D 80 CF 07
##$RELAX= 
##$RELAX= 
##$RELAX= 
##$RELAX= 
##$RELAX= 
##$RELAX= 
##$RELAX= 
$$ Bruker specific parameters
$$ --------------------------
##$DU= <C:\u>
##$EXPNO= 5270
##$NAME= <ADRS>
##$PROCNO= 1
##$TYPE= <nmr>
##$USER= <dgb>
##$AMP= (0..31)
100 100 100 100 100 100 100 100 100 100 100 100 100 100 100 100 100 100 
100 100 100 100 100 100 100 100 100 100 100 100 100 100 
##$AQSEQ= 0
##$AQ_mod= 3
##$AUNM= <au_zg>
##$AUTOPOS= <30 >
##$BF1= 250.13
##$BF2= 250.13
##$BF3= 250.13
##$BF4= 250.13
##$BF5= 500.13
##$BF6= 500.13
##$BF7= 500.13
##$BF8= 500.13
##$BYTORDA= 1
##$CFDGTYP= 0
##$CFRGTYP= 5
##$CHEMSTR= <none>
##$CNST= (0..31)
1 1 145 1 1 1 1 1 1 1 1 1 1 1 1 1 1 1 1 1 1 1 1 1 1 1 1 1 1 1 1 1 
##$CPDPRG= <>
##$CPDPRG1= <>
##$CPDPRG2= <>
##$CPDPRG3= <>
##$CPDPRG4= <mlev>
##$CPDPRG5= <mlev>
##$CPDPRG6= <mlev>
##$CPDPRG7= <mlev>
##$CPDPRG8= <mlev>
##$CPDPRGB= <>
##$CPDPRGT= <>
##$D= (0..31)
0 1 0 0 0 0 0 0 0 0.06 0 0 0 0 0 0 0.0002 0 0 0 0 0 0 0 0 0 0 0 0 0 0 
0 
##$DATE= 1120476258
##$DBL= (0..7)
120 120 120 120 120 120 120 120 
##$DBP= (0..7)
150 150 150 150 150 150 150 150 
##$DBP07= 0
##$DBPNAM0= <>
##$DBPNAM1= <>
$$ [...]
##$SUBNAM7= <"">
##$SUBNAM8= <"">
##$SUBNAM9= <"">
##$SW= 20.6930455092707
##$SWIBOX= (0..15)
0 0 3 0 0 0 0 0 0 0 0 0 0 0 0 0 
##$SW_h= 5175.983436853
##$TD= 65536
##$TD0= 1
##$TE= 295.16
##$TE2= 300
##$TE3= 300
##$TEG= 300
##$TL= (0..7)
0 120 120 120 120 120 120 120 
##$TP= (0..7)
150 150 150 150 150 150 150 150 
##$TP07= 0
##$TPNAME0= <>
##$TPNAME1= <>
##$TPNAME2= <>
##$TPNAME3= <>
##$TPNAME4= <>
##$TPNAME5= <>
##$TPNAME6= <>
##$TPNAME7= <>
##$TPOAL= (0..7)
0.5 0.5 0.5 0.5 0.5 0.5 0.5 0.5 
##$TPOFFS= (0..7)
0 0 0 0 0 0 0 0 
##$TUNHIN= 0
##$TUNHOUT= 0
##$TUNXOUT= 0
##$USERA1= <user>
##$USERA2= <user>
##$USERA3= <user>
##$USERA4= <user>
##$USERA5= <user>
##$V9= 5
##$VALIST= <valist>
##$VCLIST= <CCCCCCCCCCCCCCC>
##$VD= 0
##$VDLIST= <DDDDDDDDDDDDDDD>
##$VPLIST= <PPPPPPPPPPPPPPP>
##$VTLIST= <TTTTTTTTTTTTTTT>
##$WBST= 1024
##$WBSW= 4
##$XGAIN= (0..3)
0 0 0 0 
##$XL= 0
##$YL= 0
##$YMAX_a= 225036
##$YMIN_a= -316930
##$ZGOPTNS= <>
##$ZL1= 120
##$ZL2= 120
##$ZL3= 120
##$ZL4= 120
##$ABSF1= 16.522
##$ABSF2= -4.171173
##$ABSG= 5
##$ABSL= 3
##$ALPHA= 0
##$AQORDER= 0
##$ASSFAC= 0
##$ASSFACI= 0
##$ASSFACX= 0
##$ASSWID= 0
##$AUNMP= <proc_1d>
##$AZFE= 0.1
##$AZFW= 0.1
##$BCFW= 0
##$BC_mod= 0
##$BYTORDP= 0
##$COROFFS= 0
##$CY= 12.5
##$DATMOD= 1
##$DC= 0
##$DFILT= <>
##$DTYPP= 0
##$F1P= 14.0000005364418
##$F2P= -0.99999901652339
##$FCOR= 0.5
##$FTSIZE= 32768
##$FT_mod= 6
##$GAMMA= 0
##$GB= 0
##$INTBC= 1
##$INTSCL= 1
##$ISEN= 128
##$LB= 0.3
##$LEV0= 0
##$LPBIN= 0
##$MAXI= 10000
##$MC2= 0
##$MEAN= 0
##$ME_mod= 0
##$MI= 0
##$NCOEF= 0
##$NC_proc= -4
##$NLEV= 6
##$NOISF1= 0
##$NOISF2= 0
##$NSP= 0
##$NTH_PI= 0
##$NZP= 0
##$OFFSET= 16.522
##$PC= 1
##$PHC0= -84.62186
##$PHC1= 10.92298
##$PH_mod= 1
##$PKNL= yes
##$PPARMOD= 0
##$PSCAL= 4
##$PSIGN= 0
##$REVERSE= no
##$SF= 250.13
##$SI= 32768
##$SIGF1= 0
##$SIGF2= 0
##$SINO= 400
##$SIOLD= 32768
##$SREGLST= <1H.DMSO>
##$SSB= 0
##$STSI= 32768
##$STSR= 0
##$SW_p= 5175.98343685301
##$SYMM= 0
##$S_DEV= 0
##$TDeff= 65536
##$TDoff= 0
##$TI= <Analysis number 999999
Compound Code 99
Book Reference 9
Project Code 9>
##$TILT= no
##$TM1= 0
##$TM2= 0
##$TOPLEV= 0
##$USERP1= <user>
##$USERP2= <user>
##$USERP3= <user>
##$USERP4= <user>
##$USERP5= <user>
##$WDW= 1
##$XDIM= 32768
##$YMAX_p= 281953008
##$YMIN_p= -492077
$$ End of Bruker specific parameters
$$ ---------------------------------
##NTUPLES= NMR SPECTRUM
##VAR_NAME=  FREQUENCY,     SPECTRUM/REAL,   SPECTRUM/IMAG
##SYMBOL=    X,             R,               I
##VAR_TYPE=  INDEPENDENT,   DEPENDENT,       DEPENDENT
##VAR_FORM=  AFFN,          ASDF,            ASDF
##VAR_DIM=   32768,         32768,           32768
##UNITS=     HZ,            ARBITRARY UNITS, ARBITRARY UNITS
##FACTOR=    0.157963299565203, 1,           1
##FIRST=     4132.6476996994, 0,             0
##LAST=      -1043.33573715361, 0,           0
##MIN=       -1043.33573715361, -492077,     0
##MAX=       4132.6476996994, 281953008,     0
$$ Real data points
##PAGE= N=1
##DATA TABLE= (X++(R..R)), XYDATA
$$ [...]
$$ plain form
17350 31463 -10348 32609 44868 -25480 -61059 -76890 -78345 -91770 -53487 -126772 -105192 12735
17338 12735 13926 -83703 -99761 -92611 42488 55958 -1371 -79258 -165756 -138694 -38942 -28906
17326 -28906 -92284 71246 94862 39701 -37445 -26440 83281 -58836 -235609 -286731 -165687
17315 -165687 -98432 -130899 -49498 -71358 -204386 -198077 -74956 20067 36673 104742 28127
17304 28127 21763 110176 -35547 -206249 -170393 -104360 5454 83349 62453 60955 91453
17293 91453 -22946 -112135 -41683 -17825 -124719 -222639 -128882 -92210 -61343 -63758 -51639
17282 -51639 21651 3680 -44886 -82344 -70403 -29026 -42043 -50090 -38684 21278 129680 125186
17270 125186 62679 66735 34412 9251 -23471 -45051 -122598 -88154 -90337 -76484 -106931 -78680
$$ packed form
17350C1463m1811M2957J2259p0348l5579j5831j455j3425L8283p3285K1580J17927
17338A2735J191r7629j6058P150J35099J3470n7329p7887q6498K7062R9752J0036
17326b8906o3378J63530K3616n5161p7146J1005J09721j42117j76773n1122J21044
17315a65687O7255l2467Q1401k1860j33028O309J23121R5023J6606O8069p6615
17304B8127o364Q8413j45723j70702L5856O6033J09814P7895k0896j498L0498
17293I1453j14399q9189P0452K3858j06894r7920R3757L6672L0867k415J2119
17282e1639P3290j7971m8566l7458J1941M1377j3017q047J1406N9962J08402m494
17270A25186o2507M056l2323k5161l2722k1580p7547L4444k183J3853l0447K8251
$$ plain form
17258 -78680 -57079 -40032 53512 -71142 -137948 -132277 -145848 -138721 -110128 -51075 28674 26585
17246 26585 16165 42065 11625 53216 -48974 -99317 -136565 -147076 -224772 -256473 -189726
17235 -189726 -174449 -275630 -228109 -175036 -140236 -86858 -62182 -65146 -70227 19889 -41930 6719
17223 6719 28639 -48535 -61939 19033 -77698 -142493 -141643 -178560 -204285 -18260 108718 -11649
17211 -11649 -91468 -113943 -64921 8567 -79386 -248315 -351882 -300800 -107305 -58732 -30074
17200 -30074 -27229 -176102 -136202 -182005 -181744 -220497 -128063 -70183 -80478 -122500 -86716 -154616
17188 -154616 -207581 -222768 -256457 -239015 -141003 -49623 5194 -40803 -39119 -107585 -201450 -296276
17176 -296276 -227434 -189809 -126974 -191492 -240791 -212629 -221720 -192136 -287552 -262768 -224478 -150981
$$ packed form
17258g8680K1601J7047R3544j24654o6806N671j3571P127K8593N9053P9749k089
17246B6585j0420K5900l0440M1591j02190n0343l7248j0511p7696l1701O6747
17235a89726J5277j01181M7521N3073L4800N3378K4676k964n081R0116o1819M8649
17223F719K1920p7174j3404Q0972r6731o4795Q50l6917k5725J86025J26978j20367
17211a1649p9819k2475M9022P3488q7953j68929j03567N1082J93495M8573K8658
17200c0074K845j48873L9900m5803K61l8753R2434N7880j0295m2022L5784o7900
17188a54616n2965j5187l3689J7442R8012R1380N4817m5997J684o8466r3865r4826
17176b96276O8842L7625O2835o4518m9299K8162r091K9584r5416K4784L8290P3497
$$ plain form
17164 -150981 -16879 117583 200295 143493 101958 104135 135513 241957 205263 169988 171741
17153 171741 138193 53763 83106 28721 51397 33225 -42148 -30281 -55664 -41479 91442
17142 91442 217911 186439 119430 87869 96533 191797 183836 229644 148362 97380 45300 -2638
17130 -2638 12707 24570 -3654 -14033 -2116 13814 56545 17563 -75511 -31035 64856 -18466
17118 -18466 -17059 -72725 -103763 -131540 -57844 -29150 7440 33767 34559 30877 75261 205211
17106 205211 84194 -23944 -49812 -104186 -180358 -241677 -228109 -61949 -2654 -70820 -61321
17095 -61321 -578 -32893 -48214 -68731 -44527 -17263 -45928 -43310 -219153 -267267 -164521
17084 -164521 -201922 -287666 -293012 -174839 -190799 -278801 -297733 -297923 -267950 -202590 -167880 -181518
$$ packed form
17164a50981J34102J34462Q2712n6802m1535K177L1378J06444l6694l5275J753
17153A71741l3548q4430K9343n4385K2676j8172p5373J1867k5383J4185J32921
17142I1442J26469l1472o7009l1561Q664R5264p961M5808q1282n0982n2080m7938
17130b638J5345J1863k8224j0379J1917J5930M2731l8982r3074M4476R5891q3322
17118a8466J407n5666l1038k7777P3696K8694L6590K6327P92l682M4384J29950
17106B05211j21017j08138k5868n4374p6172o1319J3568J66160N9295o8166R499
17095f1321O0743l2315j5321k0517K4204K7264k8665K618j75843m8114J02746
17084a64521l7401q5744n346J18173j5960q8002j8932j90K9973O5360L4710j3638
$$ plain form
17072 -181518 -129767 17874 -6371 -69012 14605 109840 104092 69186 3066 -86035 -104486
17061 -104486 -53924 -115718 -90845 -53419 -146264 -69260 -38157 -8492 -92444 -69188 -27798
17050 -27798 -2458 -63901 -93873 -64720 -35939 4564 19778 -13503 -79447 -111223 -159267 -199648
17038 -199648 -119732 -81692 -26040 53287 58071 44363 -42139 -106388 -100921 -121645 -84964 -108858
17026 -108858 -175691 -220262 -140908 -81545 -18113 51006 7116 -72687 -156873 -129377 31371
17015 31371 5179 -124735 -218526 -266635 -249777 -165574 -63915 -28743 -7174 32161 -5416
17004 -5416 -47868 -21614 51620 -22247 41736 -10750 -45935 -49059 -82622 -97120 -147976 -67587
16992 -67587 -126232 -117520 -37155 44662 149902 190638 86680 56335 -11476 -71912 -97093
$$ packed form
17072a81518N1751J47641k4245o2641Q3617R5235n748l4906o6120q9101j8451
17061a04486N0562o1794K4873L7426r2845P7004L1103K9665q3952K3256M1390
17050b7798K5340o1443k9972K9153K8781M0503J5214l3281o5944l1776m8044m0381
17038a99648P9916L8040N5652P9327M784j3708q6502o4249N467k0724L6681k3894
17026a08858o6833m4571P9354N9363O3432O9119m3890p9803q4186K7496J60748
17015C1371k6192j29914r3791m8109J6858Q4203J01659L5172K1569L9335l7577
17004e416m2452K6254P3234p3867O3983n2486l5185l124l3563j4498n0856Q0389
16992f7587n8645Q712Q0365Q1817J05240M0736j03958l0345o7811o0436k5181
$$ plain form
16981 -97093 -45403 1669 113096 113194 40982 45893 35934 -83475 -270411 -292682 -253504 -155835
16969 -155835 -146871 -303727 -320370 -150413 -186427 -206737 -118218 -52601 -47146 -5526 -154711
16958 -154711 -239247 -281719 -247898 -298724 -181705 -191205 -107930 -128380 -202098 -192595 -118122 -106475
16946 -106475 -112488 -89222 -48920 48668 -53935 -59339 24648 81969 72254 40030 -20030 -99587
16934 -99587 -59826 -39551 -54831 -20845 80491 192419 159669 94593 63005 98002 148207
16923 148207 145573 48912 17972 -56390 -95080 -116900 -40311 -3051 -24333 -101508 -147497 -129907
16911 -129907 -135718 -63002 4748 63353 3272 1473 -6911 15499 9169 -12106 15042 152349
16899 152349 125205 50235 -61610 -143945 -41057 -10740 -10478 -31479 1507 -31819 -115190
$$ packed form
16981i7093N1690M7072J11427R8p2212M911r959j19409j86936k2271L9178R7669
16969a55835Q964j56856j6643J69957l6014k0310Q8519O5617N455M1620j49185
16958a54711q4536m2472L3821n0826J17019r500Q3275k0450p3718R503P4473J1647
16946a06475o013K3266M0302R7588j02603n404Q3987N7321r715l2224o0060p9557
16934i9587L9761K0275j5280L3986J01336J11928l2750o5076l1588L4997N0205
16923A48207k634r6661l0940p4362l8690k1820P6589L7260k1282p7175m5989J7590
16911a29907n811P2716O7750N8605o0081j799q384K2410o330k1275K7148J37307
16899A52349k7144p4970j11845q2335J02888L0317K62k1001L2986l3326q3371
$$ plain form
16888 -115190 -65711 -38263 14731 4252 -13973 -78350 -52442 -11481 15136 -39109 -84501
16877 -84501 -109169 -49386 -78149 -19808 -17579 -26757 -17256 -76056 -105082 -32925 20884 -10870
16865 -10870 -17023 -19301 -67481 -23277 80157 84909 13947 59145 34339 1038 -21623 15204
16853 15204 167114 198882 129811 3595 -122743 -193771 -110296 -6653 -18734 55685 199163
16842 199163 162079 192629 150857 23488 -95803 -131896 -82336 9257 64375 84639 85145
16831 85145 -5070 -16967 -80172 -63182 -69204 -112027 -18930 -68153 -93488 46419 -43329 -84271
16819 -84271 -62049 -99217 -135411 -81827 -49676 11577 41542 25260 -52545 -202756 -250559
16808 -250559 -112886 -26697 -42887 -41033 -14817 83973 148551 92578 87106 104941 90786 -9758
$$ packed form
16888a15190M9479K7448N2994j0479j8225o4377K5908M0961K6617n4245m5392
16877h4501k4668N9783k8763N8341K229r178R501n8800k9026P2157N3809l1754
16865a0870o153k278m8180M4204J03434M752p0962M5198k4806l3301k2661L6827
16853A5204J51910L1768o9071j26216j26338p1028Q3475J03643j2081P4419J43478
16842A99163l7084L0550m1772j27369j19291l6093M9560R1593N5118K0264N06
16831H5145r0215j1897o3205J6990o022m2823R3097m9223k5335J39907q9748m0942
16819h4271K2222l7168l6194N3584L2151O1253K9965j6282p7805j50211m7803
16808b50559J37673Q6189j6190J854K6216R8790O4578n5973n472J7835j4155j00544
$$ plain form
16796 -9758 -83209 -87608 -107348 -101302 -37855 14355 29797 80081 7089 -151023 -162624 -214447
16784 -214447 -219369 -207361 -183378 -9651 3162 -70793 -94965 -98300 -59059 -95302 -125890 -206621
16772 -206621 -87363 -81900 -30509 77066 134751 94421 75424 -144480 -167423 -105190 -131700
16761 -131700 -832 -12463 -64441 -10601 5164 136703 39152 13707 125926 122609 121942
16750 121942 99158 31413 -29415 -72064 -165648 -117283 97172 94804 -14286 -38513 -50974
16739 -50974 -132887 -122791 -3874 -8639 57830 87984 -359 865 -65748 -92767 -169307 -203652
16727 -203652 -199862 -55385 -21918 -127387 -92221 -51436 -116524 -132271 -115001 -162474 -169377
16716 -169377 -171992 -154623 -109804 -29551 80578 86464 80883 12752 -149262 -131594 -9717
$$ packed form
16796i758p3451m399j9740O046O3447N2210J5442N0284p2992j58112j1601n1823
16784b14447m922J2008K3983J73727J2813p3955k4172l335L9241l6243l0588q0731
16772b06621J19258N463N1391J07575N7685m0330j8997k19904k2943O2233k6510
16761a31700J30868j1631n1978N3840J5765J31539r7551k5445J12219l317o67
16750A21942k2784o7745o0828m2649r3584M8365K14455k368j09090k4227j2461
16739e0974q1913J0096J18917m765O6469L0154q8343J224o6613k7019p6540l4345
16727b03652L790J44477L3467j05469L5166M0785o5088j5747J7270m7473o903
16716a69377k615J7369M4819Q0253J10129N886n581o8131j62014J7668J21877
$$ plain form
16705 -9717 18764 -754 -35013 4978 16430 17523 3104 -24129 -82016 -89492 -70516 -21263
16693 -21263 -76813 -142252 -207999 -225495 -274694 -196254 -195503 -157607 -32793 9724 60734 48634
16681 48634 -38406 -58913 -86433 -71345 -84540 -137680 -279563 -292050 -275734 -182433 -55737
16670 -55737 -101657 -63523 -18086 19731 -55672 -51311 -18765 -12177 -15105 30504 3265 -28062
16658 -28062 8803 -63590 -34256 -45682 7337 67911 110064 5175 -53298 -26578 9702
16647 9702 87518 120344 194130 91192 65718 45144 -38985 -12370 39954 69871 12954 3327
16635 3327 55807 125644 3653 -93675 -101910 87580 189131 73288 76897 108746 100239 169203
16623 169203 262334 162189 75609 -40998 -87315 -155115 -160667 -140237 -135932 -88512 -145578
$$ packed form
16705i717K8481j9518l4259L9991J1452J093j4419k7233n7887p476J8976M9253
16693b1263n5550o5439o5747j7496m9199P8440P51L7896J24814M2517N1010j2100
16681D8634q7040k0507k7520J5088j3195n3140j41883j2487J6316R3301J26696
16670e5737m5920L8134M5437L7817p5403M361L2546O588k928M5609k7239l1327
16658b8062L6865p2393K9334j1426N3019O0574M2153j04889n8473K6720L6280
16647I702P7816L2826P3786j02938k5474k0574q4129K6615N2324K9917n6917r627
16635C327N2480O9837j21991r7328q235J89490J01551j15843L609L1849q507O8964
16623A69203R3131j00145q6580j16607m6317o7800n552K0430M305M7420n7066
$$ plain form
16612 -145578 -285916 -366985 -283275 -103995 -60384 -17557 -13683 -57421 -91105 -135704 -165659
16601 -165659 -21327 -133747 -134386 -206738 -252810 -162033 -131264 -102249 -66697 45307 -7894
16590 -7894 -61255 -23419 -50998 -84004 -67666 -74527 28418 24708 6413 -13051 -45436 -43392
16578 -43392 -34648 -61428 -139004 -152137 -241839 -382777 -359082 -298092 -258191 -218923 -240359 -197319
16566 -197319 -164936 -178478 -213376 -159393 -65824 -85647 -49752 -16824 23897 -56556 -46171
16555 -46171 2265 -60786 -116940 -99475 -67049 -69923 -153942 -168442 -186185 -96642 -64428 -71848
16543 -71848 -64192 -107077 -80395 -111022 -58028 -140866 -160899 -57487 -101428 28891 134989
16532 134989 167265 103064 1242 -64778 -94419 -40674 -2056 71528 10242 -46084 -87522
$$ packed form
16612a45578j40338q1069Q3710J79280M3611M2827L874m3738l3684m4599k9955
16601a65659J44332j12420o39p2352m6072R0777L0769K9015L5552J12004n3201
16590g894n3361L7836k7579l3006J6338o861J02945l710j8295j9464l2385K044
16578d3392Q744k6780p7576j3133q9702j40938K3695O0990L9901L9268k1436M3040
16566a97319L2383j3542l4898N3983R3569j9823L5895L2928M0721q0453J0385
16555d6171M8436o3051n6154J7465L2426k874q4019j4500j7743Q9543L2214p420
16543g1848P656m2885K6682l0627N2994q2838k0033J03412m3941J30319J06098
16532A34989L2276o4201j01822o6020k9641N3745L8618P3584o1286n6326m1438
$$ plain form
16521 -87522 -72663 127127 210876 133769 94280 49712 -88274 -67958 -20086 -108488 -88463
16510 -88463 7678 10576 -122062 -166083 -116928 -89848 -59881 -133426 -155717 -319805 -231576
16499 -231576 -75606 -58436 -4306 34592 41636 103275 74187 -11994 -52806 -126163 -213985
16488 -213985 -212954 -92183 -59240 -65300 -77578 -82153 -25873 58649 -24504 63575 98405 40201
16476 40201 -10810 -12535 -22266 -155037 -201763 -189560 -178641 -108238 -61182 -13053 76428 23415
16464 23415 -83954 -37032 -30844 -39441 -84784 -63666 -74534 -1158 30107 81125 97487 84156
16452 84156 134905 160286 62567 53668 -5060 -57712 -34648 32443 82748 894 -77675 -98985
16440 -98985 -2998 79039 1467 -18908 39636 105174 81491 54197 -18012 -54049 34748 152583
$$ packed form
16521h7522J4859J99790Q3749p7107l9489m4568j37986K0316M7872q8402K0025
16510h8463R6141K898j32638m4021M9155K7080K9967p3545k2291j64088Q8229
16499b31576J55970J7170N4130L8898P044O1639k9088q6181m0812p3357q7822
16488b13985J031J20771L2943o060j2278m575N6280Q4522q3153Q8079L4830n8204
16476D0201n1011j725r731j32771m6726J2203J0919P0403M7056M8129Q9481n3013
16464B3415j07369M6922O188q597m5343K1118j0868P3376L1265N1018J6362j3331
16452H4156N0749K5381r7719q899n8728n2652K3064O7091N0305q1854p8569k1310
16440i8985R5987Q2037p7572k0375N8544O5538k3683k7294p2209l6037Q8797J17835
$$ plain form
16428 152583 62625 -141775 -66775 -64215 -35014 -105018 -111580 -14462 48993 -125279 -246815
16417 -246815 -133147 -44468 33382 48520 12945 -29030 -30224 17387 51609 27635 -26640
16406 -26640 73024 -46942 -90350 -184697 -127243 21133 -39151 -67675 -73294 -46317 -100200
16395 -100200 -124553 -156246 -82962 -103416 -136884 -218001 -141138 -162184 -193352 -37856 44359
16384 44359 -35217 -24744 29505 -7774 -92044 -178131 -230049 -185656 -75857 -112837 -135676
16373 -135676 -76423 -100539 -164417 -94397 -64589 22652 21068 -2653 -26853 44548 14572 -100019
16361 -100019 -244085 -223781 -77196 -87834 -67046 -33086 41437 27421 -71874 -33567 4526
16350 4526 -75563 -51757 -71972 -51694 4972 130308 170219 102415 5500 -62494 -179396
$$ packed form
16428A52583q9958k04400P5000K560K9201p0004o562R7118O3455j74272j21536
16417b46815J13668Q8679P7850J5138l5575m1975j194M7611L4222k3974n4275
16406b6640R9664j19966m3408r4347N7454J48376o0284k8524n619K6977n3883
16395a00200k4353l1693P3284k0454l3468q1117P6863k1046l1168J55496Q2215
16384D4359p9576J0473N4249l7279q4270q6087n1918M4393J09799l6980k2839
16373a35676N9253k4116o3878P0020K9808Q7241j584k3721k4200P1401k9976j14591
16361a00019j44066K0304J46585j0638K0788L3960P4523j4016r9295L8307L8093
16350D526q0089K3806k0215K0278N6666J25336L9911o7804r6915o7994j16902
$$ plain form
16339 -179396 -224127 -134428 -80560 -147396 -154640 -54701 -13886 -2589 -20161 -80632 -179636 -103453
16327 -103453 -13672 41030 -832 -18229 73363 145701 86745 -110901 -67367 41831 79417
16316 79417 148642 217146 124886 130132 67753 72984 -27081 -37356 -19898 -70125 -38752 -6547
16304 -6547 -12529 -50064 -115251 -98025 -59487 -19323 -92960 -165272 -80784 841 -58983 -177177
16292 -177177 -177064 -87229 -83769 -60885 29797 108240 155356 63218 3138 -52908 -80800 -132177
16280 -132177 -248822 -243273 -134798 1243 -15707 -168465 -208212 -107840 -149876 -194370 -140236
16269 -140236 -9968 102258 55137 11657 70464 38795 -18731 -83793 -179414 -180562 -67946
16258 -67946 33669 -100345 -132640 -116465 -108883 -98754 -174738 -293914 -203847 -222830 -150993
$$ packed form
16339a79396m4731Q9699N3868o6836p244R9939M0815J1297j7572o0471r9004P6183
16327a03453Q9781N4702m1862j7397R1592P2338n8956j97646M3534J09198L7586
16316G9417O9225O8504r2260N246o2379N231j00065j0275J7458n0227L1373L2205
16304f547n982l7535o5187J7226L8538M0164p3637p2312Q4488Q1625n9824j18194
16292a77177J13Q9835L460K2884R0682P8443M7116r2138o0080n6046k7892n1377
16280a32177j16645N549J08475J36041j6950j52758l9747J00372m2036m4494N4134
16269a40236J30268J12226m7121m3480N8807l1669n7526o5062r5621j148J12616
16258f7946J01615j34014l2295J6175P582J0129p5984j19176R0067j8983P1837
$$ plain form
16247 -150993 -73845 -65595 -170476 -49020 5579 -17 -20667 15075 48183 80682 58058
16236 58058 -10356 74018 235966 209397 171477 -39475 -196513 -292878 -167014 -162658 -106838
16225 -106838 -89872 -167291 -217245 -111333 61582 102269 166568 184861 111308 68944 99945
16214 99945 146661 5144 -147455 -126421 -201669 -156383 -190914 -286512 -282825 -250967 -142756
16203 -142756 24452 53712 121713 107547 32640 -11502 -129256 -183404 -81029 -21417 28825
16192 28825 45620 45649 -77077 -107915 -150836 -169263 -194517 -107440 -47816 -80025 -34618 -15273
16180 -15273 -15446 -24080 -53809 -22978 -2273 -7774 23177 13220 -122676 -126799 -7981 9713
16168 9713 135193 138381 104127 140263 51049 6641 11694 24838 -35039 -101121 -110370 -39270
$$ packed form
16247a50993P7148Q250j04881J21456N4599n596k0650L5742L3108L2499k2624
16236E8058o8414Q4374J61948k6569l7920k10952j57038r6365J25864M356N5820
16225a06838J6966p7419m9954J05912J72915M0687O4299J8293p3553m2364L1001
16214I9945M6716j41517j52599K1034p5248M5286l4531r5598L687L1858J08211
16203a42756J67208K9260O8001j4166p4907m4142j17754n4148J02375N9612N0242
16192B8825J6795K9j22726l0838m2921j8427k5254Q7077N9624l2209M5407J9345
16180a5273j73q634k9729L0831K0705n501L0951r957j35896m123J18818J7694
16168I713J25480L188l4254L6136q9214m4408N053J3144n9877o6082r249P1100
$$ plain form
16156 -39270 23874 -17068 -54111 -134440 -168840 -261027 -305489 -237860 -182888 -100936 -87613 -42015
16144 -42015 -6107 -120192 -106562 -119429 -102181 -163076 -199261 -127887 -106270 -119076 -107794
16133 -107794 -29403 -41332 95595 83550 -50631 -49415 -92713 -146976 -22318 -12802 -71717
16122 -71717 24084 -54856 -227102 -269429 -195252 -223842 -112909 -74319 -110495 -194320 -50480
16111 -50480 89510 31759 -12042 25588 68268 -5469 -72999 -105288 -122784 -39189 35157
16100 35157 8976 -55616 -72207 57560 70608 6809 5884 33077 7818 -28679 45802 -19126
16088 -19126 -15827 103542 82081 50954 112381 82505 17771 31456 90661 -8099 -108110
16077 -108110 -122017 -42313 -50409 -97895 -32994 44528 87715 156921 46255 13444 6220 25920
$$ packed form
16156c9270O3144m0942l7043q0329l4400r2187m4462O7629N4972Q1952J3323M5598
16144d2015L5908j14085J3630j2867J7248o0895l6185P1374K1617j2806J1282
16133a07794P8391j1929J36927j2045j34181J216m3298n4263J24658R516n8915
16122g1717R5801p8940j72246m2327P4177k8590J10933L8590l6176q3825J43840
16111e0480J39990n7751m3801L7630M2680p3737o7530l2289j7496Q3595P4346
16100C5157k6181o4592j6591J29767J3048o3799r25K7193k5259l6497P4481o4928
16088a9126L299J19369k1461l1127O1427k9876o4734J3685N9205r8760j00011
16077a08110j3907P9704q096m7486O4901P7522M3187O9206j10666l2811p224J9700
$$ plain form
16065 25920 21546 64006 56724 37211 56769 54810 33940 -100668 -109646 -125738 -52025 47080
16053 47080 52749 188181 327158 247408 196237 99392 32018 37247 -45066 -220265 -172846
16042 -172846 -37760 64405 55017 -7739 11272 -26926 -100816 -120833 -144796 -112331 3037
16031 3037 20146 -17835 -86018 -44642 4080 124899 43166 -103499 -79045 14279 22694 35098
16019 35098 -21492 -40553 -88773 -130537 -121069 -45830 -62046 -85099 -96537 -95446 -33803 -72196
16007 -72196 -64693 -144625 -85483 -9981 17514 -73913 40915 69659 66991 -151374 -199679 -91686
15995 -91686 28497 105858 124521 148803 114342 -43882 39813 117095 140586 143077 68374
15984 68374 -54228 -77582 -53546 -15003 -79438 -94514 -149333 -136267 -101002 -37879 -15148
$$ packed form
16065B5920m374M2460p282j9513J9558j959k0870j34608q978j6092P3713R9105
16053D7080N669J35432J38977p9750n1171r6845o7374N229q2313j75199M7419
16042a72846J35086J02165r388o2756J9011l8198p3890k0017k3963L2465J15368
16031C037J7109l7981o8183M1376M8722J20819q1733j46665K4454R3324Q415J2404
16019C5098n6590j9061m8220m1764R468P5239j6216k3053j1438J091O1643l8393
16007g2196P503p9932N9142P5502K7495r1427J14828K8744k668k18365m8305J07993
15995i1686J20183P7361J8663K4282l4461j58224Q3695P7282K3491K491p4703
15984F8374j22602k3354K4036L8543o4435j5076n4819J3066L5265O3123K2731
$$ plain form
15973 -15148 -56521 23961 -158222 -178892 -133948 -110005 -171327 -139259 -14853 59430 56238
15962 56238 45216 -31384 -59842 11629 27991 -56406 -156093 -200607 -168990 -139265 -215532 -208922
15950 -208922 -122720 -95127 -70894 -513 -16611 -94928 -132732 -120029 -58295 73190 171187
15939 171187 204884 157854 79447 -16223 -67362 25331 -17800 -59384 -52443 3349 127917
15928 127917 52908 -56470 -158642 -96409 -19984 -90871 -139989 -73262 -46729 49804 27255
15917 27255 13222 -53793 -122018 73188 195437 189914 118184 123314 91579 86386 -4458 -110200
15905 -110200 -128674 -176185 -168967 -93598 -14553 -96124 -116880 23904 -3698 15710 63851
15894 63851 -5923 -9020 114253 245554 213960 149619 123722 76366 -44369 8140 6196
$$ packed form
15973a5148m1373Q0482j82183k0670M4944K3943o1322L2068J24406P4283l192
15962E6238j1022p6600k8458P1471J6362q4397r9687m4514L1617K9725p6267O610
15950b08922Q6202K7593K4233P0381j6098p8317l7804J2703O1734J31485R7997
15939A71187L3697m7030p8407r5670n1139R2693m3131m1584O941N5792J24568
15928A27917p5009j09378j02172O2233P6425p0887m9118O6727K6533R6533k2549
15917B7255j4033o7015o8225J95206J22249n523p1730N130l1735n193r0844j05742
15905a10200j8474m7511P218P5369P9045q1571k0756J40784k7602J9408M8141
15894F3851o9774l097J23273J31301l1594o4341k5897m7356j20735N2509j944
$$ plain form
15883 6196 -25604 -12265 -32777 -73069 10531 121895 64467 -89878 -144819 -76444 90122
15872 90122 99631 64697 33869 -42022 -56379 83217 18274 -40127 -68097 -94461 1428 71219
15860 71219 178890 170732 94484 8496 32677 162225 103287 174381 177248 162734 195711 159828
15848 159828 25482 -71615 -50603 -4501 55992 25456 79374 105238 10633 -15607 28135
15837 28135 5596 42294 135998 141840 185261 193473 145204 92713 132362 105811 102976 99537
15825 99537 -3568 -83201 -103598 -81272 -166577 -168531 -211721 -163317 -44764 -70380 -62747 606
15813 606 31306 2501 95755 130816 55826 -87392 -86449 -77433 -126914 -138952 -142331 -130611 -7335
15800 -7335 -8133 -67248 43696 12853 -58708 -17048 -61146 -106558 -169871 -134669 -114131 -183761
$$ packed form
15883F196l1800J3339k0512m0292Q3600J11364n7428j54345n4941O8375J66566
15872I0122R509l4934l0828p5891j4357J39596o4943n8401k7970k6364R5889O9791
15860G1219J07671q158p6248q5988K4181J29548n8938P1094K867j4514L2977l5883
15848A59828j34346r7097K1012M6102O0493l0536N3918K5864r4605k6240M3742
15837B8135k2539L6698R3704N842M3421Q212m8269n2491L9649k6551k835l439
15825I9537j03105p9633k0397K2326q5305j954m3190M8404J18553k5616P633O3353
15813F06L0700k8805R3254L5061p4990j43218R43R016m9481j2038l379J1720J23276
15800g335p98n9115J10944l0843p1561M1660m4098m5412o3313L5202K0538o9630
$$ plain form
15788 -183761 -252567 -263989 -220078 -115192 -54220 -82516 -195586 -181620 -114607 -97334 -21884
15777 -21884 -11516 35636 98737 75431 47366 47026 133575 156931 174938 239345 237056 57628
15765 57628 -34901 -9547 140510 179493 99234 171794 128238 91362 -28746 -67610 -58953
15754 -58953 26215 22758 61831 59474 -105965 -231812 -255864 -61196 -20135 75223 148987
15743 148987 143780 73868 61297 -24062 -152752 -104816 -24443 35883 85440 59082 -56065
15732 -56065 -129892 -62909 -65984 -44840 -96958 -65889 -47603 -60755 -37846 -4553 85331 147662
15720 147662 43953 39924 86699 58833 -33540 18302 32602 30388 51938 94390 12083 10968
15708 10968 -12000 -69611 -497 36662 72510 9317 -55470 3425 39495 -38525 36924 -31459
$$ packed form
15788a83761o8806j1422M3911J04886O0972k8296j13070J3966O7013J7273P5450
15777b1884J0368M7152O3101k3306k8065l40Q6549K3356J8007O4407k289j79428
15765E7628r2529K5354J50057L8983q0259P2560m3556l6876j20108l8864Q657
15754e8953Q5168l457L9073k357j65439j25847k4052J94668M1061R5358P3764
15743A48987n207o9912j2571q5359j28690M7936Q0373O0326M9557k6358j15147
15732e6065p3827O6983l075K1144n2118L1069J8286j3152K2909L3293Q9884O2331
15720A47662j03709m029M6775k7866r2373N1842J4300k214K1550M2452q2307j115
15708A0968k2968n7611O9114L7159L5848o3193o4787N8895L6070p8020P5449o8383
$$ plain form
15696 -31459 -20535 43795 109396 -843 -111328 -131142 -171983 -333615 -410216 -277801 -189387
15685 -189387 -121155 -11564 42054 27927 7560 92332 146305 125237 157133 50470 40274
15674 40274 -52022 25293 35286 -111846 -119601 -70640 -99953 -59098 -13405 -20207 101125 69487
15662 69487 -19967 -35155 -92128 -133934 -46413 -72665 -149830 -211008 -254200 -169340 -156943 -91301
15650 -91301 -79848 -78365 -15277 30202 49862 54919 38015 19233 18468 40697 112074 37803
15638 37803 -23133 114047 167768 51438 -18074 -54107 22348 61903 99592 34836 -11594
15627 -11594 107593 126781 -15550 -26120 -23681 -33808 -39906 57955 207306 142763 31013
15616 31013 -128339 -236668 -234204 -208862 -228911 -227086 -128264 -17471 20907 -25445 -180339
$$ packed form
15696c1459J0924O4330O5601j10239j10485j9814m0841j61632p6601J32415Q8414
15685a89387O8232J09591N3618j4127k0367Q4772N3973k1068L1896j06663j0196
15674D0274r2296P7315R993j47132p755M8961k9313M0855M5693o802J21332l1638
15662F9487q9454j5188n6973m1806Q7521k6252p7165o1178m3192Q4860J2397O5642
15650i1301J1453J483O3088M5479J9660N057j6904j8782p65K2229P1377p4271
15638C7803o0936J37180N3721j16330o9512l6033P6455L9555L7689o4756m6430
15627a1594J19187J9188j42331j0570K439j0127o098R7861J49351o4543j11750
15616C1013j59352j08329K464K5342k0049J825R8822J10793L8378m6352j54894
$$ plain form
15605 -180339 -207496 -69491 77480 131560 83646 26543 -13161 17589 13782 9417 36050
15594 36050 47496 52975 -44865 -30371 85422 86736 41600 -25073 -115200 -104268 92211 146050
15582 146050 107198 209003 343043 289354 242873 99564 67988 62562 -82325 -65459 40769
15571 40769 134837 139519 194795 141466 32117 -29418 29691 -67786 -84460 -40789 -45603 -27514
15559 -27514 -75570 -90165 -72434 -88640 -161416 -221704 -208738 -71962 36938 -95499 -136488
15548 -136488 -87475 -23325 133212 197121 120464 198299 204432 106136 -71625 -212227 -143920
15537 -143920 -63496 -45442 -49576 -50986 -101960 -52537 -137943 -236463 -278163 -149833 -11342
15526 -11342 -54179 -162120 -121878 -98607 -61105 -91517 20408 81830 66280 -28181 -60651
$$ packed form
15605a80339k7157J38005J46971N4080m7914n7103l9704L0750l807m365K6633
15594C6050J1446N479r7840J4494J15793J314m5136o6673r0127J0932J96479N3839
15582A46050l8852J01805J34040n3689m6481j43309l1576n426j44887J6866J06228
15571D0769R4068M682N5276n3329j09349o1535N9109r7477j6674M3671m814J8089
15559b7514m8056j4595J7731j6206p2776o0288J2966J36776J08900j32437m0989
15548a36488M9013O4150J56537O3909p6657P7835O133r8296j77761j40602O8307
15537a43920Q0424J8054m134j410n0974M9423q5406r8520m1700J28330J38491
15526a1342m2837j07941M0242K3271L7502l0412J11925O1422j5550r4461l2470
$$ plain form
15515 -60651 -18031 -29406 -71720 -125882 -182934 -156857 -134362 -139402 -102529 -126690 -210609 -226556
15503 -226556 -155362 -131423 -44041 17547 28656 14269 -120422 -58249 58321 151836 137979
15492 137979 90217 69788 -26349 -48300 -24098 45917 61724 -34929 -121174 -187986 -167951
15481 -167951 -235158 -370603 -417686 -308240 -242513 -109056 35121 38876 20102 -85984 -54206
15470 -54206 16843 3556 -373 -80181 -250611 -234881 -133285 -95062 -103660 -118452 -61026 -113836
15458 -113836 -17539 28481 -28131 -181419 -190083 -199685 -69882 25831 82171 121781 31966
15447 31966 27763 70706 33768 3611 -20530 -30270 -45301 -100043 -65478 -19095 73782 167147
15435 167147 172100 143616 104158 -63479 -149612 -98312 -39001 -54361 -47632 16827 9899 188963
$$ packed form
15515f0651M2620j1375m2314n4162n7052K6077K2495n040L6873k4161q3919j5947
15503b26556P1194K3939Q7382O1588J1109j4387j34691O2173J16570R3515j3857
15492A37979m7762k0429r6137k1951K4202P0015J5807r6653q6245o6812K0035
15481a67951o7207j35445m7083J09446O5727J33457J44177L755j8774j06086L1778
15470e4206P1049j3287l929p9808j70430J5730J01596L8223q598j4792N7426n2810
15458a13836R6297M6020n6612j53288q664r602J29803R5713N6340L9610q9815
15447C1966m203M2943l6938l0157k4141r740j5031n4742L4565M6383R2877R3365
15435A67147M953k8484l9458j67637q6133N1300N9311j5360O729O4459o928J79064
$$ plain form
15423 188963 233067 127354 -12878 25836 86504 54021 -15937 -226253 -203864 -119179 -91768
15412 -91768 -138440 -229441 -150654 -11607 64642 109474 136634 131603 54685 -67718 -75986 -47607
15400 -47607 -82519 -140271 -166250 -249212 -350344 -211428 43635 52664 54785 -11304 14298
15389 14298 2074 35618 63693 -195949 -463057 -492077 -330862 -195194 -122361 -169113 -83090
15378 -83090 40368 88747 95847 899 -57713 -55769 -105054 -121471 -219686 -208290 -213260 -229751
15366 -229751 -84601 -53230 -109712 -207690 -137457 -32587 22554 -67396 -97917 -2051 -32501
15355 -32501 -8485 193330 231002 60137 -32519 -52325 -13650 -27897 -131537 -219474 -218997
15344 -218997 -104038 -87023 -59294 40970 34023 32025 -108384 -154458 -203993 -134371 -177879
$$ packed form
15423A88963M4104j05713j40232L8714O0668l2483o9958k10316K2389Q4685K7411
15412i1768m6672r1001P8787J39047P6249M4832K7160n031p6918j22403q268K8379
15400d7607l4912n7752k5979q2962j01132J38916K55063R029K121o6089K5602
15389A4298j2224L3544K8075k59642k67108k9020J61215J35668P2833m6752Q6023
15378h3090J23458M8379P100r4948n8612J944m9285j6417r8215J1396m970j6491
15366b29751J45150L1371n6482r7978P0233J04870N5141q9950l0521R5866l0450
15355c2501K4016K01815L7672j70865r2656j9806L8675j4247j03640q7937M77
15344b18997J14959J7015K7729J00264o947j998j40409m6074m9535O9622m3508
$$ plain form
15333 -177879 -126128 28962 -56994 -186814 -174070 -153012 -147735 -105869 -65274 -84084 -76916
15322 -76916 -182831 -259087 -125327 -24387 -9105 -26508 -193886 -274799 -224901 -157529 -21483
15311 -21483 -45999 -64982 -79574 -76905 -83475 -140023 -172041 -131767 -28838 3376 57646 99766
15299 99766 46915 -10220 -32996 -68171 -34548 -11888 -26862 -46713 63228 -15903 -67857
15288 -67857 -78641 -106112 -167776 -119892 -64382 -64499 -232305 -255338 -243591 -295561 -302775 -260274
15276 -260274 -122819 -105837 -73437 -95153 -99559 23265 62218 46859 62428 10799 -63541
15265 -63541 -189034 -322710 -255215 -161913 -138050 -90694 -2892 83971 41306 -92248 -168407
15254 -168407 -68432 -42572 -3087 26892 19022 -36620 -81955 -14777 27405 -26623 -10973 8976
$$ packed form
15333a77879N1751J55090q5956j29820J2744K1058N277M1866M0595j8810P168
15322g6916j05915p6256J33760J00940J5282j7403j67378q0913M9898O7372J36046
15311b1483k4516j8983j4592K669o570n6548l2018M0274J02929L2214N4270M2120
15299I9766n2851n7135k2776l5175L3623K2660j4974j9851J09941p9131n1954
15288f7857j0784k7471o1664M7884N5510j17j67806k3033J1747n1970p214M2501
15276b60274J37455J6982L2400k1716m406J22824L8953j5359J5569n1629p4340
15265f3541j25493j33676O7495R3302K3863M7356Q7802Q6863m2665j33554p6159
15254a68407R9975K5860L9485K9979p870n5642m5335O7178M2182n4028J5650J9949
$$ plain form
15242 8976 -29028 -70422 -93482 -34178 20925 32504 15766 53771 33081 -7036 -63669 -80707
15230 -80707 -90767 -109077 -90906 -139852 -81348 -165573 -193961 -126227 -36709 14265 21640 -23313
15218 -23313 31170 -94174 -131656 13105 -5702 -77597 -30069 10177 33640 33009 10345 -114218
15206 -114218 -113863 -119526 -108971 -50706 8704 23468 -16814 -89802 -157500 -237088 -141472 -159780
15194 -159780 -99405 -37208 12716 -41477 -43123 -82281 -110383 -75414 -2589 -87572 -120384 -77111
15182 -77111 -7384 7719 -73728 -109434 -90554 -70167 -24849 -9357 -7214 -73234 -237999 -193296
15170 -193296 34950 158765 72531 102317 113491 29817 8954 -11938 503 57963 131081
15159 131081 85829 45971 164509 136718 69894 23933 29673 1994 -82392 -8629 81480
$$ packed form
15242H976l8004m1394k3060N9304N5103J1579j6738L8005k0690m0117n6633j7038
15230h0707j0060j8310J8171m8946N8504q4225k8388O7734Q9518N0974P375m4953
15218b3313N4483j25344l7482J44761j8807p1895M7528M0246K3463o31k2664j24563
15206a14218L55n663J0555N8265N9410J4764m0282p2988o7698p9588R5616j8308
15194a59780O0375O2197M9924n4193j646l9158k8102L4969P2825q4983l2812M3273
15182g7111O9727J5103q1447l5706J8880K0387M5318J5492K143o6020j64765M4703
15170a93296K28246J23815q6234K9786J1174q3674k0863k0892J2441N7460P3118
15159A31081m5252l9858J18538k7791o6824m5961N740k7679q4386P3763R0109
$$ plain form
15148 81480 18704 35750 21200 -10137 -74488 -153889 -169275 -114828 -13575 -135666 -207380
15137 -207380 -175939 7738 172885 76782 17545 11250 -111435 -24017 -11187 34992 182371
15126 182371 238925 125995 67313 98189 29885 -66610 -69539 -43935 -153452 -230303 -152086
15115 -152086 -125903 -139827 -92981 -100906 -109406 -82303 58820 28360 -24057 102870 134323
15104 134323 148370 167307 104961 83373 69222 22502 62788 66027 -18637 -35791 -2506 46110
15092 46110 129942 89421 24245 44113 -35879 -45326 -68008 -131213 -84659 -4977 -58893 -174326
15080 -174326 -182225 -54866 50141 -55491 -137417 -153739 -204738 -247932 -218418 -167896 -34514
15069 -34514 -20759 -86271 12965 103044 226953 189616 98167 -3265 -102861 -181182 -187644
$$ packed form
15148H1480o2776J7046j4550l1337o4351p9401j5386N4447J01253j22091p1714
15137b07380L1441J83677J65147r6103n9237o295j22685Q7418J2830M6179J47379
15126A82371N6554j12930n8682L0876o8304r6495k929K5604j09517p6851P8217
15115a52086K6183j3924M6846p925q500K7103J41123l0460n2417J26927L1453
15104A34323J4047J8937o2346k1588j4151m6720M0286L239q4664j7154L3285M8616
15092D6110Q3832m0521o5176J9868p9992r447k2682o3205M6554P9682n3916j15433
15080a74326p899J27359J05007j05632q1926j6322n0999m3194K9514N0522J33382
15069c4514J3755o5512R9236R0079J23909l7337r1449j01432r9596p8321o462
$$ plain form
15058 -187644 -86548 -99993 -76731 -25645 -16228 -93414 -37467 23170 -6564 -117308 -193516
15047 -193516 -67475 79194 15001 -124342 -161773 -183653 -155825 -105147 -87011 2832 -69242
15036 -69242 -187863 -167698 -89618 -111257 -121399 -138138 -232568 -296038 -241233 -197202 -248033
15025 -248033 -227271 -148183 -152256 -118442 -98135 -146408 -117139 -121964 -148172 -61887 29152 -9246
15013 -9246 -68097 -52249 -59773 -105461 -136643 -115403 75381 29604 -83762 -80539 -44993 -32339
15001 -32339 -53127 -14819 6050 2027 -119516 -153801 -110252 -69874 -24948 -92815 -158081 -77940
14989 -77940 -161771 -227978 -201347 -82326 -14352 -8346 88358 124405 92857 105990 1653
14978 1653 -177876 -253766 -178694 -200812 -255329 -171087 -92092 -35147 93936 78970 -48731
$$ packed form
15058a87644J01096j3445K3262N1086R417p7186N5947O0637k9734j10744p6208
15047a93516J26041J46669o4193j39343l7431k1880K7828N0678J8136Q9843p2074
15036f9242j18621K0165P8080k1639j0142j6739r4430o3470N4805M4031n0831
15025b48033K0762P9088m073L3814K0307m8273K9269m825k6208Q6285R1039l8398
15013i246n8851J5848p524m5688l1182K1240J90784m5777j13366L223L5546J2654
15001c2339k0788L8308K0869m023j21543l4285M3549M0378M4926o7867o5266Q0141
14989g7940q3831o6207K6631J19021O7974O006R6704L6047l1548J3133j04337
14978A653j79529p5890P5072k2118n4517Q4242P8995N6945J29083j4966j27701
$$ plain form
14967 -48731 -161643 -78852 150337 185042 124130 88935 117851 54935 -32919 98816 173960
14956 173960 71226 54866 64517 42449 49019 162159 148738 120623 -32602 -69917 -58853
14945 -58853 -6219 -9375 -33822 -11080 -126443 -198551 -131046 -98508 -104794 -81860 -36180 48099
14933 48099 73768 -27589 -24831 1927 -21656 -70765 -108318 -177917 -28546 26808 -33515
14922 -33515 -118696 -151264 -124058 -157151 -84716 -10631 -51069 -42806 -132633 -169852 -126193 -54681
14910 -54681 43295 28428 -61405 -53074 -154501 -165327 -126834 -51790 62055 83251 78946 56499
14898 56499 7191 107612 125279 165095 134301 97814 157633 78054 12274 37959 50517
14887 50517 84191 10871 -73205 -160364 -52955 -95821 -47559 -24722 17140 63872 -15715
$$ packed form
14967d8731j12912Q2791K29189L4705o0912l5195K8916o2916q7854J31735P5144
14956A73960j02734j6360R651k2068O570J13140j3421k8115j53225l7315J1064
14945e8853N2634l156k4447K2742j15363p2108O7505L2538o286K2934M5680Q4279
14933D8099K5669j01357K758K6758k3583m9109l7553o9599J49371N5354o0323
14922c3515q5181l2568K7206l3093P2435P4085m0438Q263q9827l7219M3659P1512
14910e4681R7976j4867q9833Q331j01427j0826L8493P5044J13845K1196m305k2447
14898E6499m9308J00421J7667L9816l0794l6487N9819p9579o5780K5685J2558
14887E0517L3674p3320q4076q7159J07409m2866M8262K2837M1862M6732p9587
$$ plain form
14876 -15715 -47796 -1472 -124482 -174800 -131667 -85967 -89628 -71545 -42008 -134903 -217851 -149645
14864 -149645 -152372 -195276 -93553 -88708 -146113 -108758 -73154 -178900 -238763 -165931 -151758
14853 -151758 -119769 -66904 -69118 -65119 -211318 -264504 -222434 -113640 -29932 3343 -16229
14842 -16229 55128 46592 -32438 -25296 -153158 -188009 -161634 -118624 -78057 -66778 -62330 -87005
14830 -87005 -66057 -12830 45031 116560 126232 -20380 -82442 -88453 -120558 -175005 -50423 90692
14818 90692 57949 -123818 -182848 -122231 -35187 37770 84287 54988 55003 49976 41263 -53033
14806 -53033 -154069 -179266 -201822 -125931 -137400 -120787 -63896 -32344 -59407 -148583 -193701
14795 -193701 4633 4446 -21222 -1776 -37371 -7620 -36832 64406 67664 7649 100264 129596
$$ packed form
14876a5715l2081M6324j23010n0318M3133M5700l661J8083K9537r2895q2948O8206
14864a49645k727m2904J01723M845n7405L7355L5604j05746n9863P2832J4173
14853a51758L1989N2865k214L999j46199n3186M2070J08794Q3708L3275j9572
14842a6229P1357q536p9030P142j27862l4851K6375M3010M0567J1279M448k4675
14830h7005K0948N3227N7861P1529R672j46612o2062o011l2105n4447J24582J41115
14818I0692l2743j81767n9030O0617Q7044P2957M6517k9299J5n027q713r4296
14806e3033j01036k5197k2556P5891j1469J6613N6891L1552k7063q9176m5118
14795a93701J98334j87k5668J9446l5595K9751k9212J01238L258o0015R2615K9332
$$ plain form
14783 129596 14443 47929 80544 10463 -8231 -56229 24706 77048 99127 23355 -10807
14772 -10807 6187 66919 66004 -12505 -13966 -57158 36868 75226 82933 132494 81662 72174 42778
14759 42778 56890 70203 87163 153815 104955 176891 200625 56671 -473 -43714 -120824
14748 -120824 -254691 -180410 -63439 -131711 -55669 -46244 -61854 -67794 -44802 54218 111330
14737 111330 13274 -102492 -196950 -131468 -105611 -87939 -166235 -147698 35456 37531 27244
14726 27244 -45164 -101281 -82805 -153711 -287243 -124542 -67201 2863 86270 109208 87637
14715 87637 -10445 -209268 -270397 -199013 -85810 -100257 -84737 18092 -47803 -66829 -154018
14704 -154018 -107175 57850 53175 67253 80412 30309 -7895 55556 11164 19945 6954 16770
$$ packed form
14783A29596j15153L3486L2615p0081j8694m7998Q0935N2342K2079p5772l4162
14772a0807J6994O0732r15p8509j461m3192R4026L8358P707M9561n0832r488k9396
14759D2778J4112J3313J6960O6652m8860P1936K3734j43954n7144m3241p7110
14748a20824j33867P4281J16971o8272P6042R425j5610n940K2992R9020N7112
14737A11330r8056j15766r4458O5482K5857J7672p8296J8537J83154K075j0287
14726B7244p2408n6117J8476p0906j33532J62701N7341P0064Q3407K2938k1571
14715H7637r8082j98823o1129P1384J13203j4447J5520J02829o5895j9026q7189
14704a54018M6843J65025m675J4078J3159n0103l8204O3451m4392Q781j2991R816
$$ plain form
14692 16770 570 13487 23119 -65749 -54416 -6764 30076 -31454 61440 163205 134012 51820
14680 51820 86557 32719 -3690 -34958 -35764 35768 34762 28482 -23106 12458 -57799 -1557
14668 -1557 78198 73628 97991 -3500 -60129 -7852 13759 -8643 -36609 49213 116173 17556
14656 17556 -41935 1566 64877 10904 36784 48965 44514 74082 -137314 -240865 -250169 -154367
14644 -154367 -111800 -13240 -118238 -199236 -112074 -169127 -215871 -187081 -217655 -136176 -62575
14633 -62575 -15534 -55830 -119870 -79869 -50229 -52867 35971 14098 -156097 -144795 -195064 -271919
14621 -271919 -90567 -9713 -24160 15661 -52456 -24738 44058 140798 207067 202013 250100
14610 250100 193234 104556 124890 125444 22202 -64667 -68439 -67891 -53764 19557 44910 64686
$$ packed form
14692A6770j6200J2917R632q8868J1333M7652L6840o1530R2894J01765k9193q2192
14680E1820L4737n3838l6409l1268q06P1532j006o280n1588L5564p0257N6242
14668a557P9755m570K4363j01491n6629N2277K1611k2402k7966Q5822O6960r8617
14656A7556n9491M3501O3311n3973K5880J2181m451K9568k11396j03551r304R5802
14644a54367M2567R8560j04998q0998Q7162n7053m6744K8790l0574Q1479P3601
14633f2575M7041m0296o4040M0001K9640k638Q8838k1873j70195J1302n0269p6855
14621b71919J81352Q0854j4447L9821o8117K7718O8796R6740O6269n054M8087
14610B50100n6866q8678K0334N54j03242q6869l772N48J4127P3321K5353J9776
$$ plain form
14598 64686 5916 -42968 -58523 -100874 -30423 -6186 -25813 -87559 -41671 21937 119917 181995
14586 181995 137312 3656 -90007 30844 119663 -23667 -216535 -320970 -244463 -55270
14576 -55270 37383 39863 38273 26020 -82528 -71724 9116 -87606 -78262 -4742 15559 -3604
14564 -3604 38496 35388 -31115 -153042 -259630 -228054 -139664 -83374 -72678 -77949 -31589 -27729
14552 -27729 -20789 -10738 45957 80679 -9871 -86794 -71534 11790 85853 27601 39169 18638
14540 18638 15705 -75717 -73407 20673 107057 172590 163834 76395 109060 172136 142885 83018
14528 83018 -64205 -131555 -81377 -110098 -175457 -217745 -213578 -157989 -168900 -165665 -169515 -98232
14516 -98232 99667 130474 100944 76129 11836 -8476 -8948 -6965 90485 79691 133164 110160
$$ packed form
14598F4686n8770m8884j5555m2351P0451K4237j9627o1746M5888O3608R7980O2078
14586A81995m4683j33656r3663J20851Q8819j43330j92868j04435P6507J89193
14576e5270R2653K480j590j2253j08548J0804Q0840r6722R344P3520K0301j9163
14564c604M2100l108o6503j21927j06588L1576Q8390N6290J0696n271M6360L860
14552b7729O940J0051N6695L4722r0550p6923J5260Q3324P4063n8252J1568k0531
14540A8638k933r1422K310R4080Q6384O5533q756q7439L2665O3076k9251n9867
14528H3018j47223o7350N0178k8721o5359m2288M167N5589j0911L235l850P1283
14516i8232J97899L0807k9530k4815o4293k0312m72J983R7450j0794N3473k3004
$$ plain form
14504 110160 105279 88357 58958 45681 78631 149147 122774 96555 97114 81138 96981 42903
14492 42903 143440 216837 200145 76045 -29245 -109338 -125844 -122272 -54347 -85335 -175625
14481 -175625 -150388 -94057 -18614 34614 55116 90680 -33208 -110808 -138416 -41481 -91761
14470 -91761 -120463 -73803 -30909 -110183 -230953 -250231 -100803 -37480 88995 22535 -6918
14459 -6918 54719 56738 38265 -8067 -40241 30341 84679 103735 80786 76248 173037 105419
14447 105419 124063 111883 184925 99187 -47093 -106940 -84531 -174313 -188633 -112547 -99171
14436 -99171 -19143 66566 83148 -25530 -43213 37340 59170 -31056 -101525 -7586 22149
14425 22149 83202 62443 60544 82923 85452 213950 191698 94686 127675 114366 -4046 -198
$$ packed form
14504A10160m881j6922k9399j3277L2950P0516k6373k6219N59j5976J5843n4078
14492D2903J00537P3397j6692j24100j05290q0093j6506L572O7925l0988r0290
14481a75625K5237N6331P5443N3228K0502L5564j23888p7600k7608R6935n0280
14470i1761k8702M6660M2894p9274j20770j9278J49428O3323J26475o6460k9453
14459f918O1637K019j8473m6332l2174P0582N4338J9056k2949m538R6789o7618
14447A05419J8644j2180P3042q5738j46280n9847K2409q9782j4320P6086J3376
14436i9171Q0028Q5709J6582j08678j7683Q0553K1830r0226p0469R3939K9735
14425B2149O1053k0759j899K2379K529J28498k2252r7012L2989j3309j18412L848
$$ plain form
14413 -198 6954 -487 -10918 -2139 -15499 -8999 -83877 -18302 29640 6673 -22656 -25206 22719
14400 22719 -47773 -14818 31820 54145 52991 126454 50795 -45069 6326 45440 43787 -41081
14388 -41081 21166 32608 13034 72619 61082 -20332 -26046 43171 7750 -22684 77418 63368
14376 63368 16256 25817 119833 225411 144940 113115 268795 274600 159006 81315 89641 132586
14364 132586 76324 2254 -3977 55340 159632 113013 118801 119924 91398 160953 299940 334378
14352 334378 180853 -70160 -89839 3078 -47980 -44710 -112989 -151233 -82607 -21978 -85877
14341 -85877 -37726 -14104 -158222 -176595 -92602 19726 13325 72157 137729 163692 249630
14330 249630 268151 72534 -29572 65832 141644 187764 199742 201150 167261 124476 62911
$$ packed form
14413a98P152p441j0431Q779j3360O500p4878O5575M7942k2967k9329k550M7925
14400B2719p0492L2955M6638K2325j154P3463p5659r5864N1395L9114j653q4868
14388d1081O2247J1442j9574N9585j1537q1414n714O9217l5421l0434J00102j4050
14376F3368m7112R561R4016J05578q0471l1825J55680N805j15594p7691Q326M2945
14364A32586n6262p4070o231N9317J04292m6619N788J123k8526O9555J38987L4438
14352C34378j53525k51013j9679R2917n1058L270o8279l8244O8626O0629o3899
14341h5877M8151K3622j44118j8373Q3993J12328o401N8832O5572K5963Q5938
14330B49630J8521j95617j02106R5404P5812M6120J1978J408l3889m2785o1565
$$ plain form
14319 62911 6935 18935 91284 138569 83797 26627 57529 -60723 -100448 -88264 -24153
14308 -24153 119144 72032 126722 603 -25999 -50818 -125721 -34535 20121 -54158 -20322
14297 -20322 -13645 -112830 -85709 -1755 100273 131556 163939 89534 84390 50521 -38335 -146114
14285 -146114 -143873 -109752 -73575 -54245 -154124 -151771 15491 85663 122259 83679 -27894
14274 -27894 -27443 113181 97388 116409 128553 98103 67516 100038 140015 102001 97293 51981
14262 51981 201795 176040 131446 95650 160448 332249 317431 243021 260990 296590 193219
14251 193219 91345 -33796 -6971 -118193 -77381 -4612 -14770 -54644 -48166 3243 -7062
14240 -7062 -93403 -158220 -220067 -119696 33134 20828 6776 495 -35865 -81987 -97730 -41370
$$ packed form
14319F2911n5976J2000P2349M7285n4772n7170L0902j18252l9725J2184O4111
14308b4153J43297m7112N4690j26119k6602k4819p4903R1186N4656p4279L3836
14297b0322O677r9185K7121Q3954J02028L1283L2383p4405n144l3869q8856j07779
14285a46114K241L4121L6177J9330r9879K353J67262P0172L6596l8580j11573
14274b7894M51J40624j5793J9021J2144l0450l0587L2522L9977l8014m708m5312
14262E1981J49814k5755m4594l5796O4798J71801j4818p4410J7969L5600j03371
14251A93219j01874j25141K6825j11222M0812P2769j0158l9874O478N1409j0305
14240g062q6341o4817o1847J00371J52830j2306j4052o281l6360m6122j5743N6360
$$ plain form
14228 -41370 -89938 -91048 8857 -4289 -23968 -92821 -108069 -114259 -118926 273 133238 185625
14216 185625 218579 187819 174468 114817 52474 62269 -3830 -16328 29678 -65254 -130704 -46614
14204 -46614 25175 6693 -6729 -73230 -16043 -46728 -70289 1618 56152 112751 153490 125993
14192 125993 149809 146810 75558 47113 38587 98590 105281 46956 -13492 -50988 25325 51831
14180 51831 186035 289824 315372 278791 137954 76623 42060 -29552 4821 9073 68701
14169 68701 -5505 -68954 9849 52524 44925 31257 43088 220754 332327 167988 42231
14158 42231 -40782 53058 52366 -41297 20018 83738 147888 154773 94542 76466 93013 66011
14146 66011 -52117 -23272 98029 158560 146496 157583 156618 210545 161762 -4243 -11332 -35259
$$ packed form
14228d1370m8568j110R9905j3146j9679o8853j5248o190m667J19199J32965N2387
14216A85625L2954l0760j3351n9651o2343R795o6099j2498M6006r4932o5450Q4090
14204d6614P1789j8482j3422o6501N7187l0685k3561P1907N4534N6599M0739k7497
14192A25993K3816k999p1252k8445q526O0003O691n8325o0448l7496P6313K6506
14180E1831J34204J03789K5548l6581j40837o1331l4563p1612L4373M252N9628
14169F8701p4206o3449P8803M2675p599j3668J1831J77666J11573j64339j25757
14158D2231q3013R3840o92r3663O1315O3720O4150O885o0231j8076J6547k7002
14146F6011j18128K8845J21301O0531j2064J1087r65N3927m8783j66005p089k3927
$$ plain form
14134 -35259 -50043 -134246 -79654 63951 64070 -5408 -127114 -179424 -63741 56406 93077
14123 93077 90800 90032 158096 156617 135978 214224 198359 185208 152672 116877 56552 19361
14111 19361 111608 11756 -203351 -244749 -168241 -187264 -144105 -28353 61648 51809 18145
14100 18145 135434 211790 176567 43199 13223 14772 -3643 66840 78201 -40662 -58124
14089 -58124 -31503 -115196 -110862 -118292 918 12206 -117055 -84022 -112001 -34793 -83494 -116710
14077 -116710 -83139 -88430 87387 218041 249577 148616 75378 93472 -21235 -57285 31849
14066 31849 38870 27039 -79232 -89848 -54762 33939 13606 -16026 -46606 -56162 -149278 -118089
14054 -118089 -49515 30471 136591 273684 198106 32433 34758 64143 147123 207505 136055
$$ packed form
14134c5259j4784q4203N4592J43605J19o9478j21706n2310J15683J20147L6671
14123I3077k277p68O8064j479k0639P8246j5865j3151l2536l5795o0325l7191
14111A9361R2247r9852k15107m1398P6508j9023M3159J15752R0001r839l3664
14100A8145J17289P6356l5223j33368k9976J549j8415P0483J1361j18863j7462
14089e8124K6621q3693M334p430J19210J1288j29261L3033k7979P7208m8701l3216
14077a16710L3571n291J75817J30654L1536j00961p3238J8094j14707l6050Q9134
14066C1849P021j1831j06271j0616L5086Q8701k0333k9632l0580r556r3116L1189
14054a18089O8574P9986J06120J37093p5578j65673K325K9385Q2980O0382p1450
$$ plain form
14043 136055 81375 -11675 5571 75916 6776 35740 65047 -16166 -38701 -42149 -3400 75584
14031 75584 24261 84644 165081 178553 150839 15556 -13349 -49560 23614 -12219 -169501
14020 -169501 -70943 47186 5822 -35075 -73311 -113272 -139352 -62586 -1891 31056 -50175
14009 -50175 -18085 11820 17378 60634 88728 112109 89998 52747 79046 111064 120232 45503
13997 45503 69110 125383 191647 306467 365747 224549 210102 250818 41315 -136304 -96554
13986 -96554 -126230 -63160 -53446 32553 -36175 8743 -19488 -124564 -145139 -1710 103406
13975 103406 206104 144307 112295 152107 125820 75915 99327 110135 62687 90139 34769
13964 34769 7558 -19678 -26660 -22331 53641 38810 80982 89947 91342 78590 77402 108602 232460
$$ packed form
14043A36055n4680r3050J7246P0345o9140K8964K9307q1213k2535l448L8749P8984
14031G5584n1323O0383Q0437J3472k7714j35283k8905l6211P3174l5833j57282
14020a69501R8558J18129m1364m0897l8236l9961k6080P6766O0695L2947q1231
14009e0175L2090K9905N558M3256K8094K3381k2111l7251K6299L2018R168p4729
13997D5503K3607N6273O6264J14820N9280j41198j4447M0716k09503j77619L9750
13986i6554k9676O3070R714Q5999o8728M4918k8231j05076k0575J43429J05116
13975A03406J02698o1797l2012L9812k6287m9905K3412J0808m7448K7452n5370
13964C4769k7211k7236o982M329P5972j4831M2172Q965J395j2752j188L1200J23858
$$ plain form
13951 232460 408767 482036 544018 583030 476484 366723 303943 387031 489698 330087
13941 330087 127490 -69668 -59813 -32877 56488 88446 126400 207424 238194 218681 6352
13930 6352 -13859 110825 297353 273496 201681 44677 7603 94303 146 -24781 62083
13919 62083 118214 82496 109070 66303 102098 112761 69419 46790 211109 150298 118567
13908 118567 229962 193329 103234 80543 35910 -66831 -59687 -67763 113058 265857 284245
13897 284245 198720 63400 -46551 32873 79695 153653 59896 136446 122242 155358 197333
13886 197333 96734 -3208 42117 46259 -11210 -4349 9560 114300 125704 23781 116421
13875 116421 143637 86144 67955 31146 33976 40961 110855 213308 96112 -18891 -75041
$$ packed form
13951B32460J76307P3269O1982L9012j06546j09761o2780Q3088J02667j59611
13941C30087k02597j97158R855K6936Q9365L1958L7954Q1024L0770j9513k12329
13930F352k0211J24684J86528k3857p1815j57004l7074Q6700r4157k4927Q6864
13919F2083N6131l5718K6574m2767L5795J0663m3342k2629J64319o0811l1731
13908A18567J11395l6633r0095k2691m4633j02741P144q076J80821J52799J8388
13897B84245q5525j35320j09951P9424M6822P3958r3757P6550j4204L3116M1975
13886A97333j00599r9942M5325M142n7469O861J3909J04740J1404j01923R2640
13875A16421K7216n7493j8189l6809K830O985O9894J02453j17196j15003n6150
$$ plain form
13864 -75041 -41405 48286 -36883 -152094 -140339 -33093 -16992 42196 -6137 11873 22043
13853 22043 13997 56313 110509 98440 -35410 -109212 -32215 -14826 9842 67147 58588 -50875
13841 -50875 -99468 -186653 -193085 -23703 73649 10113 -43306 -44332 7941 167098 152560 107680
13829 107680 28845 12760 84588 10732 -6507 -149305 -146483 -38516 84789 22599 56987
13818 56987 14026 61691 109449 34981 63384 119246 149107 143834 135914 149839 79309 35000
13806 35000 -32727 -24424 -27846 -100584 -82411 51308 42115 -7312 66362 112784 23615 44735
13794 44735 95218 36629 61313 56871 53562 75072 177625 182267 238516 293002 148882 94268
13782 94268 36406 -78643 -54558 31492 -49511 -46308 58524 100913 137087 86629 109119
$$ packed form
13864g5041L3636Q9691q5169j15211J1755J07246J6101N9188m8333J8010J0170
13853B2043q046M2316N4196j2069j33850p3802P6997J7389K4668N7305q559j09463
13841e0875m8593q7185o432J69382R7352o3536n3419j026N2273J59157j4538m4880
13829A07680p8835j6085P1828p3856j7239j42798K822J07967J23305o2190L4388
13818E6987m2961M7665M7758p4468K8403N5862K9861n273p920J3925p0530m4309
13806C5000o7727Q303l422p2738J8173J33719r193m9427P3674M6422q9169K1120
13794D4735N0483n8589K4684m442l309K1510J02553M642N6249N4486j44120n4614
13782I4268n7862j15049K4085Q6050q1003L203J04832M2389L6174n0458K2490
$$ plain form
13771 109119 158429 196117 107792 39754 72901 57678 7097 -36366 -119906 -156628 -142607
13760 -142607 -1745 71364 -95008 -133477 37823 81696 69314 52244 122546 149049 168693
13749 168693 102391 119656 146723 62436 117998 127140 117859 97700 118432 139352 39134 33447
13737 33447 20961 75442 134076 159350 167000 202535 204884 158199 155284 48904 974 73710
13725 73710 122719 126135 70435 -17861 49752 83497 215274 312994 240447 172429 230914 120811
13713 120811 71289 75402 46970 3171 42774 38113 -30559 -50439 11307 38343 -14073 -69277
13701 -69277 -103444 -53498 2156 32357 21698 29912 113575 61636 80549 53699 72510 81283
13689 81283 -12699 -39532 48396 109056 4572 23887 125090 66565 -22180 -21807 29664 20412
$$ packed form
13771A09119M9310L7688q8325o8038L3147j5223n0581m3463q3540l6722J4021
13760a42607J40862P3109j66372l8469J71300M3873j2382j7070P0302K6503J9644
13749A68693o6302J7265K7067q4287N5562R142r281k0159K0732K0920j00218n687
13737C3447j2486N4481N8634K5274P650L5535K349m6685k915j06380m7930P2736
13725G3710M9009L416n5700q8296O7613L3745J31777R7720p2547o8018N8485j10103
13713A20811m9522M113k8432m3799L9603m661o8672j9880O1746K7036n2416n5204
13701f9277l4167M9946N5654L0201j0659Q214Q3663n1939J8913k6850J8811Q773
13689H1283r3982k6833Q7928O0660j04484J9315J01203n8525q8745L73N1471r252
$$ plain form
13677 20412 140270 113097 208865 127361 111543 179573 201735 249702 288599 220525 85976
13666 85976 139572 119291 -5036 -31439 112050 158435 205030 227186 282391 343021 234031
13655 234031 302251 398659 396977 326856 156650 106247 44752 48258 4447 53408 96060 66274
13643 66274 84504 152652 347762 340146 279000 226521 188117 130757 144161 298213 400302
13632 400302 414263 460189 389654 297433 305046 423640 470205 465893 525551 571536 575849 565465
13620 565465 585713 555877 401946 338041 457111 697626 875523 798313 680178 680642 726572
13609 726572 781711 781874 821053 873760 881982 737059 676644 776451 847162 837602 832752 734842
13597 734842 824616 1026970 1052671 1032898 1027440 1024697 1003513 1115650 1301972 1431886 1612295
$$ packed form
13677B0412J19858k7173R5768q1504j5818O8030K2162M7967L8897o8074j34549
13666H5976N3596k0281j24327k6403J43489M6385M6595K2156N5205O0630j08990
13655B34031O8220R6408j682p0121j70206n0403o1495L506m3811M8961M2652k9786
13643F6274J8230O8148J95110p616o1146n2479l8404n7360J3404J54052J02089
13632D00302J3961M5926p0535r2221P613J18594M6565m312N9658M5985M313j0384
13620E65465K0248k9836j53931o3905J19070K40515J77897p7210j18135M64M5930
13609G26572N5139J63L9179N2707Q222j44923o0415R9807P0711r560m850r7910
13597G34842Q9774K02354K5701j9773n458k743k1184J12137J86322J29914J80409
$$ plain form
13586 1612295 1834986 2144437 2403185 2739873 3309685 3911956 4567966 5478558 6769029
13577 6769029 8306723 10285184 12746443 15392692 17523126 18314083 17599106 15847747
13569 15847747 13752846 11744576 10223287 8983045 8029378 7294766 6662980 6177491 5833656
13560 5833656 5536023 5225316 5058517 4882910 4791157 4766597 4638955 4566358 4549074 4609101
13550 4609101 4753727 4978868 5046239 5154641 5293708 5418614 5599992 5937057 6345399 6831839
13540 6831839 7395394 8154046 9271704 10630738 12221176 14133469 16571037 20059203
13532 20059203 24824992 31106226 39234016 48450576 56328467 59484158 56518768 49509102
13524 49509102 41509829 34567399 29189538 25192336 22183657 20027070 18340062 16922439
$$ packed form
13586A612295K22691L09451K58748L36688N69812O02271O56010R10592J290471
13577F769029J537694J978461K461259K646249K130434P90957p14977j751359
13569A5847747k094901k008270j521289j240242r53667p34612o31786m85489l43835
13560E833656k97633l10707j66799j75607r1753k4560j27642p2597j7284O0027
13550D609101J44626K25141O7371J08402J39067J24906J81378L37065M08342M86440
13540F831839N63555P58652J117658J359034J590438J912293K437568L488166
13532B0059203M765789O281234Q127790R216560P877891L155691k965390p009666
13524D9509102p999273o942430n377861l997202l008679k156587j687008j417623
$$ plain form
13516 16922439 15686930 14810667 13972732 13222576 12503769 11966739 11543073 11152495 10895478
13507 10895478 10634577 10538793 10473052 10475856 10460280 10467656 10537414 10624696 10866198 11152463 11482612
13496 11482612 11962638 12498803 13157437 14088032 15264161 16794899 18464775 20827153 24268097
13487 24268097 28947186 35203512 43275741 52526517 60256562 63031263 59553510 52082355
13479 52082355 43839324 36776717 31199988 27114894 24093420 21732181 19849547 18258703
13471 18258703 16965048 15824621 14791473 13867199 13080893 12539083 12033376 11618699 11287300
13462 11287300 10937175 10542474 10158472 9915406 9806510 9710947 9698339 9769032 9652111 9660158
13452 9660158 9641414 9803161 9959532 10137732 10194918 10426679 10897852 11524744 12278291 13188526
$$ packed form
13516A6922439j235509q76263q37935p50156p18807n37030m23666l90578k57017
13507A0895478k60901r5784o5741K804j5576P376O9758Q7282K41502K86265L30149
13496A1482612M80026N36165O58634R30595J176129J530738J669876K362378L440944
13487B4268097M679089O256326Q072229R250776P730045K774701l477753p471155
13479E2082355q243031p062607n576729m085094l021474k361239j882634j590844
13471A8258703j293655j140427j033148r24274p86306n41810n05707m14677l31399
13462A1287300l50125l94701l84002k43066j08896r5563j2608P0693j16921Q047
13452I660158j8744J61747J56371J78200N7186K31761M71173O26892P53547R10235
$$ plain form
13442 13188526 14499677 16313473 18600073 21196666 23130539 23631587 22418628 19925976
13434 19925976 17249063 14924407 13076991 11603321 10453268 9577639 8792984 8209921
13426 8209921 7469165 6928572 6608522 6267397 5951852 5586275 5329421 5067708 4883141
13417 4883141 4743484 4567545 4399940 4319492 4251250 4051088 3912516 3903856 3797924 3593558
13407 3593558 3565659 3539650 3474193 3320777 3187261 3232256 3283848 3110089 2946388 2801546
13397 2801546 2807216 2796432 2723570 2632382 2454915 2297594 2251649 2184184 2030618 1839608 1764293
13386 1764293 1656429 1436694 1334747 1298777 1247674 1128160 951028 917228 968877 995693
13376 995693 1112882 1125101 1020284 949048 878168 845709 739277 669036 707561 784998 767795
$$ packed form
13442A3188526J311151J813796K286600K596593J933873N01048j212959k492652
13434A9925976k676913k324656j847416j473670j150053q75629p84655n83063
13426H209921p40756n40593l20050l41125l15545l65577k56854k61713j84567
13417D883141j39657j75939j67605q0448o8242k00162j38572q660j05932k04366
13407C593558k7899k6009o5457j53416j33516M4995N1592j73759j63701j44842
13397B801546N670j0784p2862r1188j77467j57321m5945o7465j53566j91010p5315
13386A764293j07864k19735j01947l5970n1103j19514j77132l3800N1649K6816
13376I95693J17189J2219j04817p1236p0880l2459j06432p0241L8525P7437j7203
$$ plain form
13365 767795 830042 901383 789410 724775 767820 722654 725630 785525 728546 661507 559417
13354 559417 548399 579794 711337 809011 754314 746265 725634 692921 698632 685916 671662 506265
13342 506265 505580 521890 454760 467086 474039 416135 405510 319278 171740 181944 255878 411640
13330 411640 536925 455187 461172 510108 323956 256868 323955 350257 265138 228548 235054
13319 235054 352328 386945 476094 531894 493405 530203 546287 525447 499925 534714 433971
13308 433971 390577 425356 465210 434331 366112 332692 427273 454664 466364 488902 517121
13297 517121 464212 523396 594861 490249 483728 607637 598917 543424 471356 422165 384009
13286 384009 321119 248473 244045 316265 316251 254477 173924 127521 212765 305593 388704 446731
$$ packed form
13365G67795O2247P1341j11973o4635M3045m5166K976N9895n6979o7039j02090
13354E59417j1018L1395J31543R7674n4697q049k0631l2713N711j2716j4254j65397
13342E06265o85J6310o7130J2326O953n7904j0625q6232j47538J0204P3934J55762
13330D11640J25285q1738N985M8936j86152o7088O7087K6302q5119l6590O506
13319B35054J17274L4617Q9149N5800l8489L6798J6084k0840k5522L4789j00743
13308D33971m3394L4779L9854l0879o8219l3420R4581K7391J1700K2538K8219
13297E17121n2909N9184P1465j04612o521J23909q720n5493p2068m9191l8156
13286C84009o2890p2646m428P2220j4o1774q0553m6403Q5244R2828Q3111N8027
$$ plain form
13274 446731 324729 270701 364492 417090 380413 249932 190589 201222 212869 269016 283276
13263 283276 270002 237694 204161 233182 249242 323165 333219 221380 193716 134662 53943
13252 53943 107706 150707 307741 313032 248688 276985 303218 377200 331305 300108 190365
13241 190365 109817 140014 210198 199283 225611 261642 325958 221609 125829 205110 240624
13230 240624 250438 279297 142117 99197 93551 57226 -31228 -12208 -21615 86758 51897 13432
13218 13432 129244 137479 84176 39909 17961 79268 94105 111320 53443 -465 36928 127647
13206 127647 237211 268878 250761 92606 49447 18219 56873 70360 137038 132457 127195
13195 127195 62779 -107480 -15908 76812 9517 6168 115886 36914 -116417 -56624 -2749
$$ packed form
13274D46731j22002n4028R3791N2598l6677j30481n9343J0633J1647N6147J4260
13263B83276j3274l2308l3533K9021J6060P3923J0054j11839k7664n9054q0719
13252E3943N3763M3001J57034N291o4344K8297K6233P3982m5895l1197j09743
13241A90365q0548L0197P0184j0915K6328L6031O4316j04349r5780P9281L5514
13230B40624R814K8859j37180m2920n646l6325q8454J9020r407J08373l4861l8465
13218A3432J15812Q235n3303m4267k1948O1307J4837J7215n7877n3908L7393R0719
13206A27647J09564L1667j8117j58155m3159l1228L8654J3487O6678m581n262
13195A27195o4416j70259R1572R2720o7295l349J09718p8972j53331N9793N3875
$$ plain form
13184 -2749 23584 174722 174312 130107 184316 162591 148818 80158 70591 30320 -34877 -20771
13172 -20771 -53280 -88516 -61890 -64534 -36678 -11782 -70719 -78185 17066 78113 28375 91101
13160 91101 24721 11562 40179 69727 92228 112408 210324 286423 279756 311069 288272 192779
13148 192779 161165 175465 217463 268008 176913 101219 147217 185907 254331 254838 59926 17298
13136 17298 84485 131544 61655 46609 70053 -22423 -73225 -73251 -28563 10480 -24860 -94554
13124 -94554 -27078 208131 262172 284270 298695 332522 244661 314098 306339 181218 138780
13113 138780 126186 97717 38039 7250 49803 76895 111703 206184 125940 35013 48238
13102 48238 69878 105380 179639 182999 182367 246421 300164 227641 147460 183603 232633 229721
$$ packed form
13184b749K6333J51138m10m4205N4209k1725j3773o8660r567m0271o5197J4106
13172b0771l2509l5236K6626k644K7856K4896n8937p466R5251O1047m9738O2726
13160I1101o6380j3159K8617K9548K2501K0180R7916P6099o667L1313k2797r5493
13148A92779l1614J4300M1998N0545r1095p5694M5998L8690O8424N07j94912m2628
13136A7298O7187M7059o9889j5046K3444r2476n0802k6M4688L9043l5340o9694
13124i4554O7476K35209N4041K2098J4425L3827q7861O9437p759j25121m2438
13113A38780j2594k8469n9678l0789M2553K7092L4808R4481q0244r0927J3225
13102D8238K1640L5502P4259L360o32O4054N3743p2523q0181L6143M9030k912
$$ plain form
13090 229721 149994 93249 93291 56839 72877 125997 117500 95004 147393 75223 111278 135488
13078 135488 76212 69723 100533 80080 126211 101300 -41230 -242099 -134297 -15740 61453
13067 61453 60818 -21407 -18662 -3640 -28418 1937 129314 198263 158263 143138 115084 143434
13055 143434 176875 174816 183824 275945 360201 340746 219148 194824 228580 305601 385158 315583
13043 315583 262908 242520 252116 196816 174716 87515 5884 -32360 4332 95225 251640
13032 251640 306516 203716 12085 -71543 -50035 -32461 -59404 -102350 -100539 40944 132027
13021 132027 183158 175063 117736 35387 92677 140402 191177 205686 119677 49698 220300
13010 220300 243803 299556 416891 350224 248995 202087 77830 -89890 -166037 -9000
$$ packed form
13090B29721p9727n6745M2l6452J6038N3120q497k2496N2389p2170L6055K4210
13078A35488n9276o489L0810k0453M6131k4911j42530k00869J07802J18557P7193
13067F1453o35q2225K745J5022k4778L0355J27377O8949m0000j5125k8054K8350
13055A43434L3441k059R008R2121Q4256j9455j21598k4324L3756P7021P9557o9575
13043C15583n2675k0388R596n5300k2100q7201q1631l8244L6692R0893J56415
13032B51640N4876j02800j91631q3628K1508J7574k6943m2946J811J41483R1083
13021A32027N1131q095n7327q2349N7290M7725N0775J4509q6009o9979J70602
13010B20300K3503N5753J17335o6667j01229m6908j24257j67720p6147J57037
$$ plain form
13000 -9000 108220 113805 81015 -21893 -90589 -97217 -70956 -6245 -43391 20753 130742 114260
12988 114260 125659 115400 -18970 -37967 84290 229919 199336 133580 -382 -38311 -25108
12977 -25108 -64861 -43676 -99438 -98502 -23377 33825 5957 -47560 -22105 53695 222489 310369
12965 310369 247170 270355 358358 303555 201044 137138 140782 77001 12110 119566 121214
12954 121214 159047 106923 53393 -23513 -54323 -47191 -71477 -138438 -90104 35361 87974
12943 87974 48760 -83823 -232475 -309709 -177200 21133 83085 18139 -58276 -133319 -107886
12932 -107886 -110695 -70319 -82106 -91041 -96066 -92435 -97724 -50111 30553 62673 126977 234328
12920 234328 287850 154580 -11848 -45008 -100476 1060 -54956 -119283 -37737 29735 146962
$$ packed form
13000i000J17220N585l2790j02908o8696o628K6261O4711l7146O4144J09989j6482
12988A14260J1399j0259j34370j8997J22257J45629l0583o5756j33962l7929J3203
12977b5108l9753K1185n5762R36P5125N7202k7868n3517K5455P5800J68794Q7880
12965C10369o3199K3185Q8003n4803j02511o3906L644o3781o4891J07456J648
12954A21214L7833n2124n3530p6906l0810P132k4286o6961M8334J25465N2613
12943H7974l9214j32583j48652p7234J32509J98333O1952o4946p6415p5043K5433
12932a07886k809M0376j1787q935n025L631n289M7613Q0664L2120O4304J07351
12920B34328N3522j33270j66428l3160n5468J01536n6016o4327Q1546O7472J17227
$$ plain form
12909 146962 97509 151866 122804 18084 33757 204787 256427 239883 210801 169066 123288
12898 123288 85021 86005 60206 100910 89361 28660 -14848 68676 151522 171869 79022 23360
12886 23360 -70251 -2040 81296 160018 39968 -17566 61941 162035 101381 24438 -131045
12875 -131045 -144168 -124290 -70683 -108578 -96075 -31048 33881 -28737 -144515 -79889 31534
12864 31534 2316 -6205 -7592 92622 192709 166398 161319 120897 108179 83745 -33268 -110273
12852 -110273 -10711 33627 -35302 -83687 -37944 -26234 -143160 -75978 30820 85630 8265
12841 8265 -105684 -134611 -98699 42486 55845 170965 115764 -12375 -89711 -128601 -70315
12830 -70315 5910 -70676 -137482 -180817 -149963 -150842 -18861 63393 61932 79506 101247 56164
$$ packed form
12909A46962m9453N4357k9062j04720J5673J71030N1640j6544k9082m1735m5778
12898A23288l8267R84k5799M0704j1549o0701m3508Q3524Q2846K0347r2847n5662
12886B3360r3611O8211Q3336P8722j20050n7534P9507J00094o0654p6943j55483
12875a31045j3123J9878N3607l7895J2503O5027O4929o2618j15778O4626J11423
12864C1534k9218q521j387J00214J00087k6311n079m0422j2718k4434j17013p7005
12852a10273R9562M4338o8929m8385M5743J1710j16926O7182J06798N4810p7365
12841H265j13949k8927L5912J41185J3359J15120n5201j28139p7336l8890N8286
12830g0315P6225p6586o6806m3335L0854q79J31981Q2254j461J7574K1741m5083
$$ plain form
12818 56164 22641 59425 -16238 -27365 42774 166187 160173 142228 146884 102760 -15541 -163305
12806 -163305 -125614 -96143 -82060 -32383 -69758 -148703 -279064 -302194 -92791 67813 63867
12795 63867 108096 226338 232940 263440 213870 115704 -9422 -72377 -83785 -68398 -67526 -85909
12783 -85909 34 42465 64865 100305 37905 7553 -101038 -192584 -151305 -154821 -215628 -222242
12771 -222242 -185309 -71065 -84878 -73065 67619 112357 51307 -16709 -152232 -145678 -77175
12760 -77175 -20804 81196 82037 94752 154385 96208 31914 9787 7564 -32905 -14702 9566
12748 9566 15139 -9401 -110579 -80894 -81705 -172536 -82929 -67295 -101785 42269 94303 57393
12736 57393 -32276 -6423 -68666 83825 98191 48939 57546 27613 -1018 -84031 -62464 -42744
$$ packed form
12818E6164l3523L6784p5663j1127P0139J23413o014j7945M656m4124j18301j47764
12806a63305L7691K9471J4083M9677l7375p8945j30361k3130K09403J60604l946
12795F3867M4229J18242O602L0500m9570r8166j25126o2955j1408J5387Q72j8383
12783h5909Q5943M2431K2400L5440o2400l0352j08591r1546M1279l516o0807o614
12771b22242L6933J14244j3813J1813J40684M4738o1050o8016j35523O554O8503
12760g7175N6371J02000Q41J2715N9633n8177o4294k2127k223m0469J8203K4268
12748I566N573k4540j01178K9685q11r0831Q9607J5634l4490J44054N2034l6910
12736E7393q9669K5853o2243J52491J4366m9252Q607k9933k8631q3013K1567J9720
$$ plain form
12724 -42744 90656 164046 185016 118449 53481 42716 51179 17240 -56863 -61729 -43885 44221
12712 44221 -7323 -31280 26197 2946 4425 -114632 -17613 -20672 -49886 -840 62558 65341
12700 65341 39616 -27103 -81291 -94634 -20194 4135 94031 53044 37805 153533 327634
12689 327634 352344 266724 138428 -9271 10902 33645 -40528 4768 26113 -69958 -55639
12678 -55639 53334 80437 35726 -25646 -96182 -1932 5087 -16932 53097 18868 22759 -78034
12666 -78034 -169952 -159277 -127195 -94162 -62371 -63477 -2481 49949 49083 -10934 -35255 -27595
12654 -27595 81245 60128 -71597 -149667 -30923 -13312 -22852 4885 54897 170589 246194
12643 246194 69553 -7216 10787 56508 146010 108582 58971 36435 41149 5719 15922
$$ packed form
12724d2744J33400P3390K0970o6567o4968j0765Q463l3939p4103m866J7844Q8106
12712D4221n1544k3957N7477k3251J479j19057R7019l059k9214M9046O3398K783
12700F5341k5725o6719n4188j3343P4440K4329Q9896m0987j5239J15728J74101
12689C27634K4710q5620j28296j47699K0173K2743p4173M5296K1345r6071J4319
12678e5639J08973K7103m4711o1372p0536R4250P019k2019P0029l4229L891j00793
12666g8034r1918J0675L2082L3033L1791j106O0996N2430q66o0017k4321P660
12654b7595J08840k1117j31725p8070J18744J7611r540K7737N0012J15692P5605
12643B46194j76641p6769J8003M5721Q9502l7428m9611k2536M714l5430J0203
$$ plain form
12632 15922 99857 34405 -30998 8275 40574 -39479 63030 52434 2261 54461 38707
12621 38707 -89042 -112259 645 -24946 44194 29730 57462 99089 -27336 -41254 -90528
12610 -90528 -85815 50793 123233 70412 27706 -96399 -110385 -63924 -55695 -33173 -15081 33923
12598 33923 -59155 -133908 -142988 -135997 -113199 -50319 -98796 -56934 -15534 -49670 40079 202461
12586 202461 252800 176884 55756 -91460 -86147 11189 43083 115700 26183 -160850 -217552
12575 -217552 -179856 -182403 -144863 -49461 -7448 37356 -2065 -5999 28409 -2721 106417 74242
12563 74242 104887 177365 172029 86697 -68124 11701 4103 40915 -8488 -2426 32691 29523
12551 29523 -15027 -141778 -131860 -130007 -54956 -61558 30865 78430 114649 76261 100507 89750
$$ packed form
12632A5922Q3935o5452o5403L9273L2299q0053J02509j0596n0173N2200j5754
12621C8707j27749k3217J12904k5591O9140j4464K7732M1627j26425j3918m9274
12610i0528M713J36608P2440n2821m2706j24105j3986M6461Q229K2522J8092M9004
12598C3923r3078p4753r080O991K2798O2880m8477M1862M1400l4136Q9749J62382
12586B02461N0339p5916j21128j47216N313R7336L1894P2617q9517j87033n6702
12575b17552L7696k547L7540R5402M2013M4804l9421l934L4408l1130J09138l2175
12563G4242L0645P2478n336q5332j54821P9825p598L6812m9403O062L5117l168
12551B9523m4550j26751R918J853P5051o602R2423M7565L6219l8388K4246j0757
$$ plain form
12539 89750 29240 -6589 -20759 -937 43466 52954 97184 132695 230995 275680 236545 158256
12527 158256 -2741 -30903 -83574 -106122 -103020 -2160 122991 112722 2070 -54361 5274
12516 5274 123913 119176 56760 62864 162321 204061 177953 199981 247254 283456 263415 200360
12504 200360 164229 73817 -47772 -35265 177290 164163 78022 71567 216367 236228 267807
12493 267807 200446 218818 180649 80143 80193 -2182 -74017 -74014 -64122 -49671 -88564 -112005 -100813
12480 -100813 -16100 164332 153666 69655 100481 93417 32120 -2933 22721 149837 202418
12469 202418 183927 90449 13574 34386 -56379 -100033 -58240 -76258 -16602 -1995 3701 -1845
12457 -1845 69616 87819 172029 188545 271071 173305 151082 102875 111383 94101 102886 58663
$$ packed form
12539H9750o0510l5829j4170J9822M4403R488M4230L5511R8300M4685l9135p8289
12527A58256j60997k8162n2671k2548L102J00860J25151j0269j10652n6431N9635
12516E274J18639m737o2416O104R9457M1740k6108K2028M7273L6202k0041o3055
12504B00360l6131r0412j21589J2507K12555j3127q6141o455J44800J9861L1579
12493B67807o7361J8372l8169j00506N0q2375p1835LR892J4451l8893k3441J1192
12480a00813Q4713J80432j0666q4011L0826p064o1297l5053K5654J27116N2581
12469B02418j8491r3478p6875K0812r0765m3654M1793j8018N9656J4607N696n546
12457a845P1461J8203Q4210J6516Q2526r7766k2223m8207Q508j7282Q785m4223
$$ plain form
12445 58663 63623 15793 117372 156767 64325 27812 -50284 -124841 -113635 -234843 -186248
12434 -186248 -104951 -18070 -15381 -16723 -7714 -20323 -170488 -96588 37479 178637 201311
12423 201311 176579 146740 127663 71727 64216 -20779 -52092 -106551 -89928 -127270 -26691
12412 -26691 -42854 37849 36727 -49914 94985 92937 126072 103631 -7468 -145617 -183053
12401 -183053 -177047 -118915 -97096 -80682 -23527 60208 43521 -68089 -118595 -46468 68328
12390 68328 173507 259351 315280 165037 147736 149489 112784 94626 106490 46851 -11217
12379 -11217 -36863 -52746 88102 136971 109656 -103460 -114913 -148162 -214412 -214969 -165833 33088
12367 33088 44063 12065 -27807 -44872 -86590 -68057 71723 -51486 -43353 -8075 27869
$$ packed form
12445E8663M960m7830J01579L9395r2442l6513p8096p4557J1206j21208M8595
12434a86248Q1297Q6881K689j342R009j2609j50165P3900J34067J41158K2674
12423B01311k4732k9839j9077n5936p511q4995l1313n4459J6623l7342J00579
12412b6691j6163Q0703j122q6641J44899k048L3135k2441j11099j38149l7436
12401a83053O006N8132K1819J6414N7155Q3735j6687j11610n0506P2127J14796
12390F8328J05179Q5844N5929j50243j7301J753l6705j8158J1864n9639n8068
12379a1217k5646j5883J40848M8869k7315k13116j1453l3249o6250n57M9136J98921
12367C3088J0975l1998l9872j7065m1718J8533J39780j23209Q133L5278L5944
$$ plain form
12356 27869 654 -173698 -282981 -208187 -183533 -155114 15485 -54477 -16007 83391 211927
12345 211927 183151 144089 136808 28432 -29396 -94391 8125 -25883 -129225 -205445 -134175
12334 -134175 -84025 -83081 -98282 -156301 -12262 191994 211723 139921 135618 114544 29913 55942
12322 55942 129232 76749 -1874 -119379 -81054 -75659 -15490 -2914 55248 -33413 -57395 95818
12310 95818 93727 11053 126530 180394 81482 101605 118137 128817 93590 87699 13973 -60998
12298 -60998 -62920 52343 141063 64069 33075 27274 -24874 -28285 -26790 47444 90710 31368
12286 31368 -74222 -84026 96719 197008 171861 189288 53557 41600 81315 81385 62039 94436
12274 94436 88397 162504 205309 257914 228770 107959 -4981 3366 91221 74517 1094 13331
$$ packed form
12356B7869k7215j74352j09283P4794K4654K8419J70599o9962L8470R9398J28536
12345B11927k8776l9062p281j08376n7828o4995J02516l4008j03342p6220P1270
12334a34175N0150R44j5201n8019J44039K04256J9729p1802m303k1074q4631K6029
12322E5942P3290n2483p8623j17505L8325N395O0169J2576N8162q8661k3982J53213
12310I5818k091q2674J15477N3864r8912K0123J6532J0680l5227n891p3726p4971
12298f0998j922J15263Q8720p6994l0994n801n2148l411J495P4234M3266n9342
12286C1368j05590r804J80745J00289k5147J7427j35731j1957L9715P0j9346L2397
12274I4436o039P4107M2805N2605k9144j20811j12940Q347Q7855j6704p3423J2237
$$ plain form
12262 13331 133038 184647 83089 -35790 22600 61818 85985 74791 67937 143865 222386
12251 222386 97697 41692 23217 23893 26955 -34014 -78353 5810 -8171 44133 84798 16976
12239 16976 -37793 -23362 -19546 -37694 25900 -3792 -67786 -71499 47737 125229 91558 59361
12227 59361 8956 -46651 68731 184556 272983 254779 294593 273508 112426 62615 33300
12216 33300 -41810 26173 59320 150842 200663 121833 -14812 10616 47208 58754 67133 85364
12204 85364 108011 69826 37869 31670 78449 -2764 119933 216290 237768 198201 216409 79774
12192 79774 134296 104479 48397 125167 216259 267882 250794 241191 281282 271595 240981 322853
12180 322853 379960 258154 120439 203415 307421 297560 336144 353711 423624 537621 519221
$$ packed form
12262A3331J19707N1609j01558j18879N8390L9218K4167j1194o854P5928P8521
12251B22386j24689n6005j8475O76L062o0969m4339Q4163j3981N2304M0665o7822
12239A6976n4769J4431L816j8148O3594k9692o3994l713J19236P7492l3671l2197
12227E9361n0405n5607J15382J15825Q8427j8204L9814k1085j61082m9811k9315
12216C3300p5110O7983L3147R1522M9821p8830j36645K5428L6592J1546Q379J8231
12204H5364K2647l8185l1957o199M6779q1213J22697R6357K1478l9567J8208j36635
12192G9774N4522k9817n6082P6770R1092N1623j7088r603M0091r687l0614Q1872
12180C22853N7107j21806j37715Q2976J04006r861L8584J7567O9913J13997j8400
$$ plain form
12169 519221 494534 486543 565126 552271 567650 498099 496951 517144 401295 370156 328984 224286
12157 224286 150691 236229 260042 201390 143014 114925 48900 69288 129380 126938 197407 198551
12145 198551 100490 51818 86179 79173 194943 268311 254640 135266 -321 49048 61478
12134 61478 40237 120371 247248 238306 214758 181799 113171 15063 73724 129860 229661 255677
12122 255677 173889 199868 266013 229424 212085 230936 243758 310269 375865 360268 243839
12111 243839 307991 315569 234737 220777 250285 143880 170364 105540 31138 92306 191981
12100 191981 216385 319000 321772 322932 397120 394613 361864 327296 296197 308238 389414 295990
12088 295990 183797 220898 301587 364877 341458 399090 533877 584906 498172 422185 402323
$$ packed form
12169E19221k4687p991P8583j2855J5379o9551j148K0193j15849l1139m1172j04698
12157B24286p3595Q5538K3813n8652n8376k8089o6025K0388O0092k442P0469J144
12145A98551r8061m8672L4361p006J15770P3368j3671j19374j35587M9369J2430
12134F1478k1241Q0134J26877q942k3548l2959o8628r8108N8661N6136R9801K6016
12122B55677q1788K5979O6145l6589j7339J8851J2822O6511O5596j5597j16429
12111B43839O4152P578q0832j3960K9508j06405K6484o4824p4402O1168R9675
12100A91981K4404J02615K772J160P4188k507l2749l4568l1099J2041Q1176r3424
12088B95990j12193L7101Q0689O3290k3419N7632J34787N1029q6734p5987j9862
$$ plain form
12077 402323 495154 546377 454583 339563 370402 422473 527237 557443 616574 599414 583374
12066 583374 553067 504213 519824 475618 502443 602822 676627 598335 404161 335949 343393
12055 343393 382251 385272 443407 388162 321228 290966 423247 557697 513045 436652 394310
12044 394310 515311 584060 573305 457522 493657 601458 694067 629901 553576 577298 545308
12033 545308 513107 436983 387655 483356 514142 466980 457342 456591 559011 602059 599185 501604
12021 501604 466999 403157 359473 483792 491010 424588 593903 709072 647212 569211 544711
12010 544711 722679 770187 723107 694004 637968 690310 763115 891622 978761 1071825 1181849
11999 1181849 1276454 1374634 1414381 1335887 1345492 1394106 1379998 1413797 1441614 1508207 1588761
$$ packed form
12077D02323R2831N1223r1794j15020L0839N2071J04764L0206N9131j7160j6040
12066E83374l0307m8854J5611m4206K6825J00379P3805p8292j94174o8212P444
12055C43393L8858L021N8135n5245o6934l0262J32281J34450m4652p6393m2342
12044C94310J21001O8749j0755j15783L6135J07801R2609o4166p6325K3722l1990
12033E45308l2201p6124m9328R5701L0786m7162r638p51J02420M3048k874r7581
12021E01604l4605o3842m3684J24319P218o6422J69315J15169o1860p8001k4500
12010E44711J77968M7508m7080k9103n6036N2342P2805J28507Q7139R3064J10024
11999A181849R4605R8180L9747p8494R605M8614j4108L3799K7817O6593Q0554
$$ plain form
11988 1588761 1679971 1581040 1425884 1534601 1637749 1558202 1560832 1689215 1679679 1557170 1572236
11977 1572236 1601450 1649107 1654162 1688152 1757399 1858580 1860259 1976494 2077847 2001157 1990542
11966 1990542 2015430 1970972 1989161 2122215 2291253 2396280 2526615 2561026 2578395 2594176
11956 2594176 2650302 2818027 3029083 3100540 3157683 3228870 3350484 3514722 3685144 3844578
11946 3844578 3950222 4046221 4276858 4486679 4722121 4962300 5307407 5725471 6016051 6315638
11936 6315638 6782086 7501419 8180537 8846437 9733301 10634369 11700200 13052548 14823076
11927 14823076 17184779 20043074 23724859 28409496 34592385 43013606 53975627 68811054
11919 68811054 89114589 117093584 154993304 202248649 250484940 281953008 281908974
$$ packed form
11988A588761R1210r8931j55156J08717J03148p9547K630J28383r536j22509J5066
11977A572236K9214M7657N055L3990O9247J01181J679J16235J01353p6690j0615
11966A990542K4888m4458J8189J33054J69038J05027J30335L4411J7369J5781
11956B594176N6126J67725K11056P1457N7143P1187J21614J64238J70422J59434
11946C844578J05644R5999K30637K09821K35442K40179L45107M18064K90580K99587
11936F315638M66448P19333O79118O65900Q86864R01068J065831J352348J770528
11927A4823076K361703K858295L681785M684637O182889Q421221J0962021J4835427
11919F8811054K0303535K7978995L7899720M7255345M8236291L1468068m4034
$$ plain form
11912 281908974 253140657 212356916 173743991 142713094 119482822 102315717 89542351
11905 89542351 79723592 72022277 66003455 61169709 56983478 53319793 50151655 47536025
11897 47536025 45300531 43419037 41645593 40010617 38722706 37595749 36711281 35935211
11889 35935211 35117071 34592465 34165273 33976527 33965490 34079813 34207789 34012662 33558026
11880 33558026 32873214 32078724 31292708 30501786 29815216 28855247 27693579 26439199 25173194
11871 25173194 23921664 22526028 21172083 19957771 18968858 17981681 16987078 16081202 15266209
11862 15266209 14489132 13713311 12868346 12209164 11585466 11063573 10450547 9935555 9512888
11853 9512888 9016211 8454956 8015340 7571606 7224620 7007456 6672220 6424474 6110516
$$ packed form
11912B81908974k8768317m0783741l8612925l1030897k3230272j7167105j2773366
11905H9542351r818759p701315o018822m833746m186231l663685l168138k615630
11897D7536025k235494j881494j773444j634976j287911j126957q84468p76070
11889C5935211q18140n24606m27192j88746j1037J14323J27976j95127m54636
11880C3558026o84812p94490p86016p90922o86570r59969j161668j254380j266005
11871B5173194j251530j395636j353945j214312r88913r87177r94603r05876q14993
11862A5266209p77077p75821q44965o59182o23698n21893o13026n14992m22667
11853I512888m96677n61255m39616m43734l46986k17164l35236k47746l13958
$$ plain form
11844 6110516 5773018 5437580 5185062 4948199 4831223 4640717 4309194 4023022 3915051
11835 3915051 3821946 3710994 3510351 3443266 3264450 3064389 2917513 2761948 2604358 2533728
11825 2533728 2455131 2381696 2296242 2175608 2043354 1961771 1952619 1747966 1611872 1579342 1606647
11814 1606647 1632264 1512170 1395119 1356412 1341270 1286423 1196893 1209486 1223294 1094208 956838
11803 956838 894878 907488 939681 931473 951006 1043244 972856 872698 975145 911943 904837
11792 904837 1072169 1154177 1147092 1103688 1197159 1067962 875203 797790 926161 800877 742377
11781 742377 606344 405424 343422 387040 495515 487112 522662 532211 550351 525813 489049
11770 489049 373775 201996 184734 151874 211548 302579 420426 507098 498088 545052 561068
$$ packed form
11844F110516l37498l35438k52518k36863j16976j90506l31523k86172j07971
11835C915051r3105j10952k00643o7085j78816k00061j46876j55565j57590p0630
11825B533728p8597p3435q5454j20634j32254q1583r152k04653j36094l2530K7305
11814A606647K5617j20094j17051l8707j5142n4847q9530J2593J3808j29086j37370
11803I56838o1960J2610L2193q208J9533R2238p0388j00158J02447o3202p106
11792I04837J67332Q2008p085m3404R3471j29197j92759p7413J28371j25284n8500
11781G42377j36033k00920o2002M3618J08475q403L5550R549J8140k4538l6764
11770D89049j15274j71779j7262l2860N9674R1031J17847Q6672r010M6964J6016
$$ plain form
11759 561068 527708 539907 616234 676747 584423 496363 497721 507775 533336 579508 617183 558483
11747 558483 536406 502671 431283 555677 668441 734083 716631 653245 619380 708367 865152
11736 865152 874350 833013 798512 657245 611030 668003 851231 807642 626646 607690 646435
11725 646435 758992 754516 656718 638837 781015 730541 650953 677935 666701 635020 651874
11714 651874 780700 771795 785812 631373 589558 590496 563983 667729 735944 676159 554869
11703 554869 538899 599487 648102 621970 598011 465696 432945 383485 404477 422801 531891
11692 531891 515132 478312 416006 443956 530093 500132 424938 309394 291459 381887 365854
11681 365854 323172 347380 366867 409474 382256 271406 179062 167474 211420 294713 335294
$$ packed form
11759E61068l3360J2199P6327O0513r2324q8060J358J0054K5561M6172L7675n8700
11747E58483k2077l3735p1388J24394J12764O5642j7452o3386l3865Q8987J56785
11736H65152R198m1337l4501j41267m6215N6973J83228m3589j80996j8956L8745
11725F46435J12557m476r7798j7881J42178n0474p9588K6982j1234l1681J6854
11714F51874J28826q905J4017j54439m1815R38k6513J03746O8215n9785j21290
11703E54869j5970O0588M8615k6132k3959j32315l2751m9460K0992J8324J09090
11692E31891j6759l6820o2306K7950Q6137k9961p5194j15544j7935R0428j6033
11681C65854m2682K4208J9487M2607k7218j10850r2344j1588M3946Q3293M0581
$$ plain form
11670 335294 305868 255589 278346 276083 311818 214969 301476 419973 390103 246006 237089
11659 237089 243596 248353 235683 261129 191382 192968 166045 162349 194227 190232 240587 236327 231647
11646 231647 309950 341087 339056 312928 259970 320754 282963 213024 83709 -19538 -38699
11635 -38699 41217 115554 86254 198559 103531 49029 48774 53542 131439 164311 244990 284591
11623 284591 110288 44147 69289 90692 85670 106362 56263 -46888 -17797 -39810 -87513
11612 -87513 -74097 103304 106220 89774 139033 166243 193984 263943 241261 159741 175824 270803
11600 270803 311039 302630 300256 329776 284666 246759 226360 178859 216030 280468 384980 400042
11588 400042 390281 388838 383874 297176 271680 317992 422538 361411 391228 304598 224101 68802
$$ packed form
11670C35294k9426n0279K2757k263L5735r6849Q6507J18497k9870j44097q917
11659B37089O507M757j2670K5446o9747J586k6923l696L1878l995N0355m260m680
11646B31647P8303L1137k031k6128n2958O0784l7791o9939j29315j03247j9161
11635c8699P9916P4337k9300J12305r5028n4502k55M768P7897L2872Q0679L9601
11623B84591j74303o6141K5142K1403n022K0692n0099j03151K9091k2013m7703
11612h7513J3416J77401K916j6446M9259K7210K7741O9959k2682q1520J6083R4979
11600B70803M0236q409k374K9520m5110l7907k0399m7501L7171O4438J04512J5062
11588D00042r761j443m964q6698k5496M6312J04546o1127K9817q6630q0497j55299
$$ plain form
11576 68802 160946 202130 322423 331774 291239 289147 226208 235513 328967 457048 490294 334041
11564 334041 269901 234984 249537 208070 203317 272550 359586 373099 243726 310010 233158
11553 233158 217632 58620 -66351 -49585 25548 40542 35462 11532 55122 32411 -65430
11542 -65430 58108 87377 170396 257722 237042 168606 86500 9263 -104807 -135295 -91432
11531 -91432 52493 37375 63807 142520 181740 137822 131372 163754 236137 268096 107945
11520 107945 62942 71881 -49082 -81411 -73219 -86355 -92368 -98073 -136778 -145393 -163128 -136755
11508 -136755 -108542 -150457 -179900 -122462 -98438 35997 128993 66148 80020 128184 191801
11497 191801 106665 39026 4992 -142702 -175632 -128077 -65525 92694 -7850 57226 75247
$$ packed form
11576F8802R2144M1184J20293R351m0535k092o2939R305R3454J28081L3246j56253
11564C34041o4140l4917J4553m1467m753O9233Q7036J3513j29373O6284p6852
11553B33158j5526j59012j24971J6766P5133J4994n080k3930M3590k2711r7841
11542f5430J23538K9269Q3019Q7326k0680o8436q2106p7237j14070l0488M3863
11531i1432J43925j5118K6432P8713L9220m3918o450L2382P2383L1959j60151
11520A07945m5003Q939j20963l2329Q192j3136o013n705l8705q615j7735K6373
11508a36755K8213m1915k9443N7438K4024J34435R2996o2845J3872M8164O3617
11497A91801q5136o7639l4034j47694l2930M7555O2552J58219j00544O5076J8021
$$ plain form
11486 75247 66443 50112 25834 -65291 -131768 -169808 -226104 -152048 -12994 151434 146593 63283
11474 63283 25329 -17168 19211 17197 -54626 -107243 -38191 -39309 21069 28606 51346 174970
11462 174970 197694 75861 80969 145729 156218 161981 49652 23185 56776 71771 100384
11451 100384 142577 188526 189431 188859 127230 78572 130850 150616 -29507 -8787 -15915 -88614
11439 -88614 -61784 -48264 -90950 -101485 -130798 -40954 53532 92629 43939 -44696 -50880 -4524
11427 -4524 28972 -50232 -1938 89487 23505 -58466 -77454 -127424 -211023 -242064 -230172 -42043
11415 -42043 139465 112105 144891 182321 149102 108668 174099 203053 173782 68765 49865
11404 49865 72929 27761 31321 113357 119167 -14944 -77180 -93429 -99536 -103898 1034 35972
$$ packed form
11486G5247q804j6331k4278r1125o6477l8040n6296P4056J39054J64428m841q3310
11474F3283l7954m2497L6379k014p1823n2617O9052j118O0378P537K2740J23624
11462A74970K2724j21833N108O4760J0489N763j12329k6467L3591J4995K8613
11451A00384M2193M5949R05n72o1629m8658N2278J9766j80123K0720p128p2699
11439h8614K6830J3520m2686j0535k9313Q9844R4486L9097m8690q8635o184M6356
11427d524L3496p9204M8294R1425o5982q1971j8988m9970q3599l1041J1892J88129
11415d2043J81508k7360L2786L7430l3219m0434O5431K8954k9271j05017j8900
11404D9865K3064m5168L560Q2036N810j34111o2236j6249o107m362J04932L4938
$$ plain form
11392 35972 125940 60179 -75932 -160051 -135923 45249 136264 148558 103939 76258 27002
11381 27002 -137039 -104224 -34992 -83777 -10713 7915 -36021 101910 127154 143351 54108
11370 54108 38674 -25159 -39301 -114142 -171053 -196108 -148656 -118557 -25514 119196 136715
11359 136715 -36806 -77323 -30288 -26337 14222 110173 192677 237903 149202 173344 99955
11348 99955 136367 40789 -90731 -32647 99761 102757 115809 77688 -39445 -51370 -30182
11337 -30182 27278 142670 106550 135750 111179 14126 1754 -25376 -42895 61156 188415
11326 188415 102929 58823 158691 136923 58265 11991 79478 32680 13047 29770 70371
11315 70371 71002 -5132 10095 -26025 -45785 27671 81067 63767 240 -57120 63492 136874
$$ packed form
11392C5972Q9968o5761j36111q4119K4128J81172R1015J2294m4619k7681m9256
11381B7002j64041L2815O9232m8785P3064J8628m3936J37931K5244J6197q9243
11370E4108j5434o3833j4142p4841n6911k5055M7452L0099R3043J44710J7519
11359A36715j73521m0517M7035L951M0559R5951Q2504M5226q8701K4142p3389
11348I9955L6412r5578j31520N8084J32408K996J3052l8121j17133j1925K1188
11337c0182N7460J15392l6120K9200k4571r7053j2372k7130j7519J04051J27259
11326A88415q5486m4106R9868k1768p8658m6274O7487m6798j9633J6723M0601
11315G0371O31p6134J5227l6120j9760P3456N3396j7300o3527n7360J20612P3382
$$ plain form
11303 136874 131482 128976 69148 -18206 -18792 26312 160792 200029 183363 60724 28671 44386
11291 44386 -46283 -178299 -152319 -267541 -329297 -271204 -123997 -75029 -12081 9489 -35722
11280 -35722 16731 74481 106511 159822 109480 58188 114376 6524 -105590 -34178 17114
11269 17114 -123131 -137342 -149380 -71548 -1648 22887 86832 143524 31239 28094 -12188
11258 -12188 -91847 -63278 -12589 -121586 -130539 -69723 266 -20690 -96741 -117788 -47445 -29662
11246 -29662 -4984 15068 40445 38533 -21989 8555 15477 -50334 17679 134623 115880 53393
11234 53393 -15660 -123142 -189410 -136202 -136848 -132553 -85756 -2385 -22540 -85607 -85468 -91099 -110585
11221 -110585 -98264 -135175 -148767 -152236 -171485 -22425 -2545 -33943 -6288 10386 56323
$$ packed form
11303A36874n392k506n9828q7354n86M5104J34480L9237j6666j22639l2053J5715
11291D4386r0669j32016K5980j15222o1756N8093J47207M8968O2948K1570m5211
11280c5722N2453N7750L2030N3311n0342n1292N6188j07852j12114P1412N1292
11269A7114j40245j4211j2038P7832O9900K4535O3945N6692j12285l145m0282
11258a2188p9659K8569N0689j08997q953O0816O9989k0956p6051k1047P0343J7783
11246b9662K4678K0052K5377j912o0522L0544O922o5811O8013J16944j8743o2487
11234E3393o9053j07482o6268N3208o46M295M6797Q3371k0155o3067J39n631j9486
11221a10585J2321l6911j3592l469j9249J49060J9880l1398K7655J6674M5937
$$ plain form
11210 56323 75193 11145 -23314 -49437 86650 225820 177135 73254 35131 -85984 -8421
11199 -8421 60773 12234 104090 120294 75140 -48501 -63603 -100558 -95709 70558 11370 -50865
11187 -50865 -21081 66738 54569 -1253 42986 83462 101692 59664 -22251 -36341 -54151 -115162
11175 -115162 -184909 -7887 84832 -134269 -83448 90619 200536 190111 120677 199533 189540
11164 189540 127300 86424 18249 68481 54546 -27819 -25104 -36957 -132648 -169912 -185157 -55064
11152 -55064 80372 135459 45634 103094 89756 31229 -2739 2925 -13741 -78858 -78501 -66072
11140 -66072 -2175 -13890 -27793 -131543 -83530 -33188 -22748 19975 -11503 -9553 26843 -34292
11128 -34292 2596 -17229 29613 152073 129451 70332 60041 -46868 55753 51267 57900
$$ packed form
11210E6323J8870o4048l4459k6123J36087J39170m8685j03881l8123j21115P7563
11199h421O9194m8539R1856J6204m5154j23641j5102l6955M849J66267n9188o2235
11187e0865K9784Q7819j2169n5822M4239M0476J8230m2028q1915j4090j7810o1011
11175a15162o9747J77022R2719k19101N0821J74067J09917j0425o9434P8856r993
11164A89540o2240m0876o8175N0232j3935q2365K715j1853r5691l7264j5245J30093
11152e5064J35436N5087q9825N7460j3338n8527l3968N664j6666o5117L57J2429
11140f6072O3897j1715j3903j03750M8013N0342J0440M2723l1478J950L6396o1135
11128c4292L6888j9825M6842J22460k2622n9119j0291j06909J02621m486O633
$$ plain form
11117 57900 144575 182565 146800 44111 26360 -23519 933 -110776 -123582 -84048 -81569
11106 -81569 -66900 -11205 67961 76345 111252 78396 104325 118099 55941 6815 -88359 -64164
11094 -64164 -10988 31162 -2419 -50202 -18359 29503 -5115 -40289 -79125 3367 -16239 -48162
11082 -48162 -76276 -202988 -80368 -15002 -25819 -11144 -38182 -60195 -58568 -166153 -97651
11071 -97651 -50783 -20048 -331 -40326 -147193 -116730 -95474 -103571 -51355 7949 69200 44719
11059 44719 71463 189264 183029 164551 56855 46269 144127 60435 -11098 -45293 -88022
11048 -88022 28376 120592 143887 105409 63837 77514 109352 82045 90457 220930 342469
11037 342469 314766 292079 320189 410260 467360 557288 504621 440884 415283 438446 506491
$$ packed form
11117E7900Q6675L7990l5765j02689j7751m9879K4452j11709j2806L9534K479
11106h1569J4669N5695P9166Q384L4907l2856K5929J3774o2158m9126r5174K4195
11094f4164N3176M2150l3581m7783L1843M7862l4618l5174l8836Q2492j9606l1923
11082d8162k8114j26712J22620O5366j0817J4675k7038k2013J627j07585O8502
11071i7651M6868L0735J9717l9995j06867L0463K1256q097N2216N9304O1251k4481
11059D4719K6744J17801o235j8478j07696j0586R7858q3692p1533l4195m2729
11048h8022J16398R2216K3295l8478m1572J3677L1838k7307Q412J30473J21539
11037C42469k7703k2687K8110R0071N7100Q9928n2667o3737k5601K3163O8045
$$ plain form
11026 506491 558713 597779 618675 677180 607747 508186 360564 457167 585447 447834 374907
11015 374907 305187 154834 348762 546438 567729 616713 607963 489223 399487 418483 495965
11004 495965 384020 298635 346965 378939 324823 321138 369944 313920 204233 170622 238742
10993 238742 325376 224713 81009 112072 183500 81688 1561 34009 17853 56366 49296
10982 49296 90122 68967 51889 138427 228495 236035 80107 48359 126560 171673 73224 29726
10970 29726 166417 252418 255039 255848 163790 237870 141475 117229 76093 58822 -8411 78118
10958 78118 97376 171959 96738 192857 171544 93173 93341 196623 141570 -9017 -154702
10947 -154702 -128104 -165061 -138738 -157411 -68098 -123640 -154240 -178566 -172811 -5062 82191
$$ packed form
11026E06491N2222L9066K0896N8505o9433r9561j47622R6603J28280j37613p2927
11015C74907o9720j50353J93928J97676K1291M8984q750j18740q9736J8996P7482
11004D95965j11945q5385M8330L1974n4116l685M8806n6024j09687l3611O8120
10993B38742Q6634j00663j43704L1063P1428j01812q0127L2448j6156L8513p070
10982D9296M0826k1155j7078Q6538R0068P540j55928l1748P8201M5113r8449m3498
10970B9726J36691Q6001K621Q09r2058P4080r6395k4246m1136j7271o7233Q6529
10958G8118J9258P4583p5221R6119k1313p8371J68J03282n5053j50587j45685
10947a54702K6598l6957K6323j8673Q9313n5542l0600k4326N755J67749Q7253
$$ plain form
10936 82191 37036 -9035 -46344 19052 126041 141725 69906 2437 -172059 -86418 123853
10925 123853 187698 174829 116585 -42140 -116933 -159841 -107725 -32816 -19703 -129277 -41918
10914 -41918 86608 -2306 25126 151683 222789 195469 235300 209788 140772 43073 87908
10903 87908 209936 170921 -12105 -2091 93663 107774 107751 31649 41213 71310 101329 73572
10891 73572 68683 33697 43492 -22174 -119032 -41789 66462 195552 216703 239981 157914 106046
10879 106046 171503 223942 192424 171969 151795 96722 86257 77334 24527 28280 108521 120252
10867 120252 109821 78998 130619 164503 163436 232826 334699 310841 295968 249268 125067
10856 125067 83043 75399 153829 373855 361686 336962 391662 390871 326720 152104 66759 68054
$$ packed form
10936H2191m5155m6071l7309O5396J06989J5684p1819o7469j74496Q5641K10271
10925A23853O3845j2869n8244j58725p4793m2908N2116P4909J3113j09574Q7359
10914d1918J28526q8914K7432J26557P1106k7320L9831k5512o9016r7699M4835
10903H7908J22028l9015j83026J0014R5754J4111k3p6102R564L0097L0019k7757
10891G3572m889l4986R795o5666r6858P7243J08251J29090K1151K3278q2067n1868
10879A06046O5457N2439l1518k0455k0174n5073j0465q923n2807L753Q0241J1731
10867A20252j0431l0823N1621L3884j067O9390J01873k3858j4873m6700j24201
10856A25067m2024p644P8430K20026j2169k4724N4700p91o4151j74616q5345J295
$$ plain form
10844 68054 179659 197880 194889 213046 238374 188276 230831 207773 276524 318851 298347 314440
10832 314440 339445 302983 300874 312509 275227 167884 176161 236789 203456 196476 170796 69717
10820 69717 -10957 82733 188001 268933 298058 185706 168332 212275 183981 185536 74556
10809 74556 33027 17435 150056 104759 27538 32970 21748 8669 -37287 -15365 -57055 -107172
10797 -107172 -74609 -85759 -136592 -106106 -75150 -83090 37711 58670 -39917 61369 102943
10786 102943 192399 148871 15988 -1622 -61190 -104230 -103342 -54596 -50023 -16616 201088 223927
10774 223927 113537 117528 108519 52816 -41543 6339 159446 212059 192848 279109 284516 221578
10762 221578 283897 177689 154870 169970 186448 195801 87200 15239 54210 21091 20123 163264
$$ packed form
10844F8054J11605J8221k991J8157K5328n0098M2555k3058O8751M2327k0504J6093
10832C14440K5005l6462k109J1635l7282j07343Q277O0628l3333o980k5680j01079
10820F9717q0674R3690J05268Q0932K9125j12352j7374M3943k8294J555j10980
10809G4556m1529j5592J32621m5297p7221N432j1222j3079m5956K1922m1690n0117
10797a07172L2563j1150n0833L0486L0956p940J20801K0959r8587J01286M1574
10786A02943Q9456m3528j32883j7610n9568m3040Q88M8746M573L3407K17704K2839
10774B23927j10390L991r009n5703r4359M7882J53107N2613j9211Q6261N407o2938
10762B21578O2319j06208k2819J5100J6478R353j08601p1961L8971l3119r68J43141
$$ plain form
10750 163264 188580 4417 -183082 -183069 -158272 -178066 -145083 -16898 108992 70430 -15539
10739 -15539 -18317 41748 86675 39644 -26147 59547 115765 -4980 -55070 -123000 -188250 -124438
10727 -124438 -119585 24917 104887 58142 73262 33575 -6789 25285 81114 118235 133224
10716 133224 157179 186878 130727 218206 289309 240945 157148 156981 240306 289713 294110 244563
10704 244563 212390 239689 209455 221926 197799 166311 221945 329754 395442 442581 528203
10693 528203 556153 503036 451455 539133 592975 565597 575020 573882 581431 511176 414271 446934
10681 446934 515039 606359 726876 773028 692915 715345 628138 655005 755964 791417 859287
10670 859287 874186 868235 769979 749894 771135 839107 932384 1048813 1076878 1173896 1223320
$$ packed form
10750A63264K5316j84163j87499J3K4797j9794L2983J28185J25890l8562q5969
10739a5539k778O0065M4927m7031o5791Q5694N6218j20745n0090o7930o5250O3812
10727a24438M853J44502P9970m6745J5120l9687m0364L2074N5829L7121J4989
10716A33224K3955K9699n6151Q7479P1103m8364q3797j67Q3325M9407M397m9547
10704B44563l2173K7299l0234J2471k4127l1488N5634J07809O5688M7139Q5622
10693E28203K7950n3117n1581Q7678N3842k7378R423j138P549p0255r6905L2663
10681D46934O8105R1320J20517M6152q0113K2430q7207K6867J00959L5453O7870
10670H59287J4899n951r8256k0085K1241O7972R3277J16429K8065R7018M9424
$$ plain form
10659 1223320 1322652 1402184 1396053 1405853 1409849 1519449 1574616 1644263 1696657 1696820 1632688 1612018
10647 1612018 1679191 1633414 1704631 1963403 1966139 1926709 1915154 1986801 2173171 2291758 2455699
10636 2455699 2680233 2852293 3057889 3280941 3568243 3783493 4028044 4354096 4700164
10627 4700164 5208767 5873128 6742672 7776173 9189164 10925319 13257226 16281791 19900566
10618 19900566 24099041 28062452 31075761 32991995 33726893 33865661 34020399 34884371 36911421
10609 36911421 40303220 45222402 51800066 59539206 66991590 72145208 73811254 72353536
10601 72353536 69549943 67235825 66356116 67310186 70823495 76869664 85010745 94449710
10593 94449710 102547758 106656306 105578120 100241350 92990963 86078305 81036797 78386905
$$ packed form
10659A223320R9332P9532o131R800L996J09600N5167O9647N2394J63o4132k0670
10647A612018O7173m5777P1217K58772K736l9430j1555P1647J86370J18587J63941
10636B455699K24534J72060K05596K23052K87302K15250K44551L26052L46068
10627D700164N08603O64361Q69544J033501J412991J736155K331907L024565L618775
10618A9900566M198475L963411L013309J916234P34898J38768J54738Q63972K027050
10609C6911421L391799M919182O577664P739140P452384N153618J666046j457718
10601G2353536k803593k314118q79709R54070L513309O046169Q141081R438965
10593I4449710Q098048M108548j078186n336770p250387o912658n041508k649892
$$ plain form
10585 78386905 78034880 79827592 83305120 87465880 90584541 90988880 87872158 82085274
10577 82085274 75471662 69494593 64796112 61561752 59764345 59073782 59171943 59536088 59263459
10568 59263459 57781626 54991911 51351673 47385468 43638603 40399269 37686956 35425113
10560 35425113 33449063 31885681 30570732 29277080 28100233 27108155 26089876 25200008
10552 25200008 24175694 23292631 22471259 21771027 21063885 20337207 19544186 18821343 18182327
10543 18182327 17607993 17013462 16265457 15644898 14973868 14254899 13715381 13202306 12602752
10534 12602752 12097295 11589889 10942007 10393026 9911458 9338413 8809344 8314114 7896842
10525 7896842 7446037 7097140 6823258 6482032 6223959 5958221 5740236 5565120 5096618
$$ packed form
10585G8386905l52025J792712L477528M160760L118661M04339l116722n786884
10577H2085274o613612n977069m698481l234360j797407o90563R8161L64145k72629
10568E9263459j481833k789715l640238l966205l746865l239334k712313k261843
10560C5425113j976050j563382j314949j293652j176847r92078j018279q89868
10552B5200008j024314q83063q21372p00232p07142p26678p93021p22843o39016
10543A8182327n74334n94531p48005o20559o71030p18969n39518n13075n99554
10534A2602752n05457n07406o47882n48981m81568n73045n29069m95230m17272
10525G896842m50805l48897k73882l41226k58073k65738k17985j75116m68502
$$ plain form
10516 5096618 4770701 4506923 4260187 3985875 3875844 3700637 3557790 3530150 3423230 3151619
10506 3151619 2992077 2843039 2743497 2565879 2363474 2181826 2134135 2178356 2161869 2094220
10496 2094220 1929176 1824708 1792893 1783401 1698498 1637913 1549392 1523730 1461935 1243870 1153194
10485 1153194 1196142 1105139 1205506 1264353 1176945 1109533 1049058 1018926 923724 994249 1014610
10474 1014610 857162 716679 650192 581555 585136 652636 684386 678908 707048 766674 732215
10463 732215 668092 624121 567283 636616 739381 778817 767666 717498 647406 668484 683083
10452 683083 703331 695506 502135 446838 532248 545800 512174 525980 636282 656126 548656
10441 548656 467044 291820 233010 309531 375461 375683 367088 453819 474427 386592 247999 413285
$$ packed form
10516E096618l25917k63778k46736k74312j10031j75207j42847k7640j06920k71611
10506C151619j59542j49038r9542j77618k02405j81648m7691M4221j6487o7649
10496B094220j65044j04468l1815r492q4903o0585q8521k5662o1795k18065r0676
10485A153194M2948r1003J00367N8847q7408o7412o0475l0132r5202P0525K0361
10474A014610j57448j40483o6487o8637L581O7500L1750n478K8140N9626l4459
10463G32215o4123m3971n6838O9333J02765L9436j1151n0168p0092K1078J4599
10452F83083K0248p825j93371n5297Q5410J3552l3626J3806J10302J9844j07470
10441E48656q1612j75224n8810P6521O5930K22q595Q6731K0608q7835j38593J65286
$$ plain form
10429 413285 675557 792742 714931 537287 648306 822264 802090 670742 629282 569723
10419 569723 557815 600674 638208 665406 659071 640400 688196 660475 615173 695721 884043
10408 884043 848545 761378 691044 676856 611969 582118 523953 554393 626244 712711 671401
10397 671401 546135 516002 615517 641160 621945 721935 646170 621132 588817 581778 631549
10386 631549 626354 636016 767029 729828 638000 653503 724220 455278 338728 471462 501713
10375 501713 446968 269938 240298 181882 221332 305287 283786 392544 396413 421534 501030
10364 501030 479814 422414 282898 279861 286904 340739 351907 277265 194696 147662 131706 222541
10352 222541 296225 400477 398352 243429 217942 301318 275232 278190 346378 452976 315204
$$ packed form
10429D13285K62272J17185p7811j77644J11019J73958k0174j31348m1460n9559
10419E69723j1908M2859L7534K7198o335j8671M7796k7721m5302Q0548J88322
10408H84043l5498q7167p0334j4188o4887k9851n8165L0440P1851Q6467m1310
10397F71401j25266l0133R9515K5643j9215R9990p5765k5038l2315p039M9771
10386F31549n195R662J31013l7201r1828J5503P0717k68942j16550J32734L0251
10375E01713n4745j77030k9640n8416L9450Q3955k1501J08758L869K5121P9496
10364E01030k1216n7400j39516l037P043N3835J1168p4642q2569m7034j5956R0835
10352B22541P3684J04252k125j54923k5487Q3376k6086K958O8188J06598j37772
$$ plain form
10341 315204 316204 322998 304410 228445 215085 248690 296598 266120 211181 172290 188417 182477
10329 182477 -24582 -37634 166902 269025 287702 259576 215357 169265 198670 209074 108108
10318 108108 36027 53071 57801 76933 -6185 70065 236032 177229 162652 135130 125191 140603
10306 140603 83217 61857 86273 101100 35264 50090 100027 333712 361604 212673 -34910
10295 -34910 -21205 -74012 -71048 -12086 96275 93621 21393 -18075 50865 117847 74431 81049
10283 81049 63143 72636 145928 190490 194069 220630 124053 81261 149927 69694 -62183 -63302
10271 -63302 -33619 -6745 79146 177161 158305 93804 96404 106401 111096 142351 222575 273191
10259 273191 328534 204152 -11341 -21679 -373 52425 93101 115884 171429 184456 169103
$$ packed form
10341C15204J000O794j8588p5965j3360L3605M7908l0478n4939l8891J6127n940
10329A82477k07059j3052K04536J02123J8677k8126m4219m6092K9405J0404j00966
10318A08108p2081J7044M730J9132q3118P6250J65967n8803j4577k7522r939J5412
10306A40603n7386k1360K4416J4827o5836J4826M9937K33685K7892j48931k47583
10295c4910J3705n2807K964N8962J08361k654p2228l9468O8940O6982m3416O618
10283H1049j7906R493P3292M4562L579K6561r6577m2792O8666q0233j31877j119
10271f3302K9683K6874Q5891R8015j8856o4501K600R997M695L1255Q0224N0616
10259B73191N5343j24382k15493j0338K1306N2798M0676K2783N5545J3027j5353
$$ plain form
10248 169103 277647 248243 142485 126977 113820 140211 172156 179441 186521 168634 134853
10237 134853 63265 -60092 -137321 -146826 -38878 64993 39764 72174 67604 115473 175522
10226 175522 178572 170945 154480 49765 44165 21623 65283 147444 171085 240342 273586 231149
10214 231149 91035 91436 3463 -93416 -79463 22414 85763 -44541 -79311 -25720 -27703
10203 -27703 16514 46648 99105 167288 171405 31169 -81917 -18491 40570 -4248 68796
10192 68796 52457 13474 58032 35580 89318 -12500 -1921 89582 107597 36601 39750 78771
10180 78771 128369 118758 184953 77543 34008 46457 82226 265106 316268 254165 233125
10169 233125 213741 307546 407635 479154 422107 350063 333109 334621 352964 417056 518002
$$ packed form
10248A69103J08544k9404j05758j5508j3157K6391L1945P285P080j7887l3781
10237A34853p1588j23357p7229r505J07948J03871k5229L2410m570M7869O0049
10226A75522L050p627j6465j04715n600k2542M3660Q2161K3641O9257L3244m2437
10214B31149j40114M01q7973r6879J3953J01877O3349j30304l4770N3591j983
10203b7703M4217L0134N2457O8183M117j40236j13086O3426N9061m4818P3044
10192F8796j6339l8983M4558k2452N3738j01818J0579R1503J8015p0996L149L9021
10180G8771M9598r611O6195j07410m3535J2449L5769J82880N1162o2103k1040
10169B33125j9384R3805J00089P1519n7047p2044j6954J512J8343O4092J00946
$$ plain form
10158 518002 704101 767508 760815 879845 767387 539420 483608 507921 424056 330178 303462
10147 303462 434381 615468 712574 714316 711451 585359 513605 466919 413218 385569 440943
10136 440943 474160 465455 468919 519296 530297 363644 264063 246498 243601 255706 324538 328990
10124 328990 294412 302635 256733 253327 315318 266602 193936 98448 136679 196520 194838 293571
10112 293571 403985 447854 378933 217890 164880 141652 120329 64299 13812 5048 -29588
10101 -29588 -71974 -10787 18464 28883 42045 92730 73473 14389 -35738 -100668 -158647 -223226
10089 -223226 -70573 -46831 36024 62957 17672 131283 254425 144083 66045 140491 135222
10078 135222 151829 205061 166003 128283 -38030 -154311 -107664 -106858 -99724 -51647 -67949 -1205
$$ packed form
10158E18002J86099O3407o693J19030j12458k27967n5812K4313q3865r3878k6716
10147C03462J30919J81087R7106J742k865j26092p1754m6686n3701k7649N5374
10136D40943L3217q705L464N0377J1001j66653r9581j7565k897J2105O8832M452
10124C28990l4578Q223m5902l406O1991m8716p2666r5488L8231N9841j682R8733
10112B93571J10414M3869o8921j61043n3010k3228k1323n6030n0487q764l4636
10101b9588m2386O1187K9251J0419J3162N0685j9257n9084n0127o4930n7979o4579
10089b23226J52653K3742Q2855K6933m5285J13611J23142j10342p8038P4446n269
10078A35222J6607N3232l9058l7720j66313j16281M6647Q06P134M8077j6302O6744
$$ plain form
10066 -1205 12246 -45156 -81585 17785 20722 50026 -5309 -69922 -6074 68795 9409 -139676
10054 -139676 -116650 -82612 -102701 36508 70426 7988 -53598 -155201 -178341 -82380 9620
10043 9620 53338 36513 -68881 -89841 -99312 -21175 -56318 -142613 -104523 -89247 -180564 -205742
10031 -205742 -182055 -164158 -181983 -197433 -214645 -217779 -127359 -103743 -27609 15035 64082 144396
10019 144396 65387 33674 73252 3656 -118679 -207592 -122127 17092 -8073 10029 42015
10008 42015 67430 63432 95720 -51404 -15698 24720 -26196 -144670 -9095 26893 25591
9997 25591 64378 93077 22216 -43203 22076 84063 251592 294757 215610 62996 111246
9986 111246 98769 117219 96809 11203 41641 150380 153369 47513 -858 75901 148135
$$ packed form
10066a205J3451n7402l6429R9370K937K9304n5335o4613O3848P4869n9386j49085
10054a39676K3026L4038k0089J39209L3918o2438o1586j01603k3140R5961R2000
10043I620M3718j6825j05394k0960r471P8137l5143q6295L8090J5276r1317k5178
10031b05742K3687J7897j7825j5450j7212l134R0420K3616P6134M2644M9047Q0314
10019A44396p9009l1713L9578o9596j22335q8913Q5465J39219k5165J8102L1986
10008D2015K5415l998L2288j47124L5706M0418n0916j18474J35575L5988j302
9997B5591L8787K8699p0861o5419O5279O1987J67529M3165p9147j52614M8250
9986A11246j2477J8450k0410q5606L0438J08739K989j05856m8371P6759P2234
$$ plain form
9975 148135 150824 113383 -2056 -26103 28594 45529 -95050 -105391 15571 70901 -47913
9964 -47913 -116315 -173456 -43073 -25074 -44841 21531 -72057 -17645 -59592 -146895 -188916 -130565
9952 -130565 -28364 -65851 -92626 -205249 -137430 -80933 36029 8661 -106034 -86285 -18642
9941 -18642 -11999 -65024 -90914 -97922 -161491 -210825 -124493 -28447 -84278 -221853 -134087 -57570
9929 -57570 -62399 -57773 -55645 -42085 -57933 -45979 -136686 -188978 -222424 -185542 -175149 -156614
9917 -156614 -97030 -105656 -44410 -38683 -71981 -32074 -21729 66904 38255 -128665 -59809 31627
9905 31627 121991 104530 89449 9573 -51233 2193 47361 -11996 -70963 -76337 -50455 -47016
9893 -47016 47929 -35641 -57537 -207908 -151560 -81885 -72470 -201754 -144944 46093 79952
$$ packed form
9975A48135K689l7441j15439k4047N4697J6935j40579j0341J20962N5330j18814
9964d7913o8402n7141J30383J7999j9767O6372r3588N4412m1947q7303m2021N8351
9952a30565J02201l7487k6775j12623O7819N6497J16962k7368j14695J9749O7643
9941a8642O643n3025k5890p008o3569m9334Q6332R6046n5831j37575Q7766P6517
9929e7570m829M626K128J3560j5848J1954r0707n2292l3446L6882J0393J8535
9917a56614N9584q626O1246N727l3298L9907J0345Q8633k8649j66920O8856R1436
9905C1627R0364j7461j5081p9876o0806N3426M5168n9357n8967n374K5882L439
9893d7016R4945q3570k1896j50371N6348O9675R415j29284N6810J91037L3859
$$ plain form
9882 79952 -53480 -83085 -90812 -83094 -90594 -231474 -242656 -71978 -36649 -171998 -271203 -120451
9870 -120451 173201 248514 161638 114215 66342 -32436 34047 73052 15403 -36477 -1138
9859 -1138 52202 106602 96321 -42896 -43826 2564 14785 -18209 -75962 84158 40346 6291
9847 6291 46760 72842 108512 131583 135578 93047 53721 -28208 -122543 -110854 13526 46455
9835 46455 113739 164854 193757 182899 89592 -5128 -58557 -50332 -48834 85520 194362 88657
9823 88657 43179 9606 -56804 -43604 -62994 -34739 -57422 43803 5739 -20284 -14772 10580
9811 10580 12488 -55161 -45204 1332 46485 106176 126270 106174 106693 163418 142940 121090 99836
9798 99836 43138 -9501 33760 73249 139505 171602 143066 61163 22805 -116021 -113026 -105717
$$ packed form
9882G9952j33432k9605p727P718p500j40880j1182J70678L5329j35349r9205J50752
9870a20451K93652P5313q6876m7423m7873r8778O6483L9005n7649n1880L5339
9859a138N3340N4400j0281j39217r30M6390J2221l2994n7753J60120m3812l4055
9847F291M0469K6082L5670K3071L995m2531l9326q1929r4335J1689J24380L2929
9835D6455O7284N1115K8903j0858r3307r4720n3429Q225J498J34354J08842j05705
9823H8657m5478l3573o6410J3200j9390K8255k2683J01225l8064k6023N512K5352
9811A0580J908o7649R957M6536M5153N9691K0094k0096N19N6725k0478k1850k1254
9798I9836n6698n2639M3261L9489O6256L2097k8536q1903l8358j38826K995P309
$$ plain form
9786 -105717 -199443 -155803 -106239 -121861 -74652 -12738 -84934 -90069 -59589 19805 2776 -14094
9774 -14094 -152554 -184818 -198120 -203995 -132289 -25625 24230 68716 -2322 -61398 -65494 -31795
9762 -31795 -64805 31099 131787 218929 87763 32778 30008 -41604 -97756 -104980 -188116 -252362
9750 -252362 -131646 -70156 -107190 -62473 33247 -45566 -125983 -75008 -18604 62408 16941
9739 16941 7773 -69420 -93495 -113451 -121829 -193156 -179771 -121131 -217943 -218316 -210748 -210379 -208116
9726 -208116 -99024 50 30006 113314 58361 84643 89257 92865 76914 80444 57566 46247
9714 46247 31160 26043 -20356 -20236 -40792 -68510 15059 13549 -30773 -13286 -5449 -44181 53830
9701 53830 -75609 -76775 -8673 -36643 -73643 -121933 10395 115988 65930 11942 59126
$$ packed form
9786a05717r3726M3640M9564j5622M7209O1914p2196n135L0480P9394j7029j6870
9774a4094j38460l2264j3302n875P1706J06664M9855M4486p1038n9076m096L3699
9762c1795l3010R5904J00688Q7142j31166n4985k770p1612n6152p224q3136o4246
9750b52362J20716O1490l7034M4717R5720p8813q0417N0975N6404Q1012m5467
9739A6941r168p7193k4075j9956q378p1327J3385N8640r6812l73P568L69K263
9726b08116J09092R9074K9956Q3308n4953K6282M614L608j5951L530k2878j1319
9714D6247j5087n117m6399J20k0556k7718Q3569j510m4322J7487P837l8732R8011
9701E3830j29439j166O8102k7970l7000m8290J32328J05593n0058n3988M7184
$$ plain form
9690 59126 123857 73720 -3348 -37051 -75210 -1072 39262 -39474 -59393 -51103 34811 100881
9678 100881 149518 133462 75587 13 -106718 -85330 -8617 20405 11834 34533 118215 146841
9666 146841 132531 11100 -62801 -74422 -20872 33343 131580 163014 175920 218202 176365
9655 176365 114349 166514 208847 165985 -8741 -156950 -68471 106694 153262 216923 42644
9644 42644 -137933 -137582 -63181 2057 7077 -46067 -77833 -38867 754 -15017 -69659 -86596
9632 -86596 -65357 -90766 -118104 -38478 8710 67844 125274 64895 48088 145879 99560 12564
9620 12564 114684 52230 -2485 123304 156238 117492 64223 -27644 -34498 23409 100098 117076
9608 117076 59926 114331 184642 152899 9874 71299 43711 10603 114370 205396 185526
$$ packed form
9690E9126O4731n0137p7068l3703l8159P4138M0334p8736j9919Q290Q5914O6070
9678A00881M8637j6056n7875p5574j06731K1388P6713K9022q571K2699Q3682K8626
9666A46841j4310j21431p3901j1621N3550N4215R8237L1434J2906M2282m1837
9655A76365o2016N2165M2333m2862j74726j48209Q8479J75165M6568O3661j74279
9644D2644j80577L51P4401O5238N020n3144l1766L8966L9621j5771n4642j6937
9632h6596K1239k5409k7338P9626M7188N9134N7430o0379j6807R7791m6319q6996
9620A2564J02120o2454n4715J25789L2934l8746n3269r1867o854N7907P6689J6978
9608A17076n7150N4405P0311l1743j43025O1425k7588l3108J03767R1026j9870
$$ plain form
9597 185526 106148 -1237 -20708 6967 -7953 65245 90971 -42025 40377 52100 114601
9586 114601 102881 111458 123906 58217 11912 39230 15399 48548 81450 162009 135243 15203
9574 15203 67648 81458 166578 236902 197319 -9378 19822 16517 -63782 -75577 -114063 -169655
9562 -169655 -150948 -189220 -243747 -280589 -260276 -195805 -174860 -187835 -122125 -17972 108278
9551 108278 118034 4434 -110506 -91852 -60909 -70811 -34527 -19687 78658 111711 56166 5969
9539 5969 -8827 47434 60262 2306 -57015 -47041 -76549 6050 -8182 19508 -32515 8323
9527 8323 -18033 -48753 -48245 -65692 21664 54531 101465 23256 75699 86790 97683 138112
9515 138112 185823 164942 188818 196276 94084 61232 114301 150676 72142 48444 93454 173348
$$ packed form
9597A85526p9378j07385j9471K7675j4920P3198K5726j32996Q2402J1723O2501
9586A14601j1720Q577J2448o5689m6305K7318k3831L3149L2902Q0559k6766j20040
9574A5203N2445J3810Q5120P0324l9583k06697K9200l305q0299j1795l8486n5592
9562a69655J8707l8272n4527l6842K0313O4471K0945j2975O5710J04153J26250
9551A08278R756j13600j14940J8654L0943r902L6284J4840R8345L3053n5545n0197
9539E969j4796N6261J2828n7956n9321R974k9508Q2599j4232K7690n2023M0838
9527H323k6356l0720N08j7447Q7356L2867M6934p8209N2443J1091J0893M0429
9515A38112M7711k0881K3876P458j02192l2852N3069L6375p8534k3698M5010P9894
$$ plain form
9503 173348 126284 32168 30041 -43043 -125900 -97622 -86648 -12980 126360 180144 82948 26331
9491 26331 -94009 11033 157996 215124 97657 76810 30603 -6570 129155 78900 -66750
9480 -66750 -50384 -2600 98044 161741 108189 128506 112637 8915 -93820 38046 115816
9469 115816 53957 -12733 -42404 -36667 -3779 24001 26117 42318 91769 134901 105863 51083
9457 51083 29804 74823 66823 78223 -50996 -140252 -176296 -208869 -130921 -62160 -107366 -176387
9445 -176387 -173885 -164937 -158556 -130097 -28669 -93443 -169202 -184868 -195682 -188455 -117948 -118620 -104557
9432 -104557 -181538 -231389 -77056 22383 -36805 -77041 -121352 -152493 -73110 2845 -67217
9421 -67217 -64197 -145545 -111611 -13645 -50655 -91089 -91902 -78812 -89248 -170789 -91345 33876
$$ packed form
9503A73348m7064r4116k127p3084q2857K8278J0974P3668J39340N3784r7196n6617
9491B6331j20340J05042J46963N7128j17467k0847m6207l7173J35725n0255j45650
9480f6750J6366M7784J00644O3697n3552K0317j5869j03722j02735J31866P7770
9469A15816o1859o6690k9671N737L2888K7780K116J6201M9451M3132k9038n4780
9457E1083k1279M5019q000J1400j29219q9256l6044l2573P7948O8761m5206o9021
9445a76387K502Q948O381K8459J01428o4774p5759j5666j0814P227P0507o72J4063
9432a04557p6981m9851J54333R9439n9188m0236m4311l1141P9383P5955p0062
9421f7217L020q1348L3934R7966l7010m0434q13J3090j0436q1541P9444J25221
$$ plain form
9409 33876 -46045 -47888 -18885 -52294 -25926 16341 126040 160780 41737 64049 91293 65153
9397 65153 163435 223439 90116 102261 164823 112151 84136 75088 21302 19223 114652 100496
9385 100496 85375 83132 84053 44581 -29110 17946 77212 16963 -67772 -11539 -16447 -65856
9373 -65856 -73821 -58905 -84984 -181968 -217681 -197130 -267898 -251771 -94417 -2594 -93529 -67555
9361 -67555 89659 54768 63159 67114 63124 89472 16430 -36084 -109094 -44765 -54655 -90692
9349 -90692 -87408 -124611 -117503 38006 74998 -31347 -134950 -160977 -178599 -74088 -66477 -26585
9337 -26585 -61039 -30355 7840 7959 18159 -14972 134852 223424 114135 104395 13180 43298
9325 43298 111217 69663 -7161 -26375 1638 -43331 10770 -16053 -24862 45 -51497 -127229
$$ packed form
9409C3876p9921j843K9003l3409K6368M2267J09699L4740j19043K2312K7244k6140
9397F5153R8282O0004j33323J2145O2562n2672k8015r048n3786k079R5429j4156
9385A00496j5121k243R21l9472p3691M7056N9266o0249q4735N6233m908m9409
9373f5856p965J4916k6079r6984l5713K0551p0768J6127J57354R1823r0935K5974
9361f7555J57214l4891Q391L955l990K6348p3042n2514p3010O4329r890l6037
9349i0692L284l7203P108J55509L6992j06345j03603k6027j7622J04511P611L9892
9337b6585l4454L0684L8195J19J0200l3131J49824Q8572j09289r740r1215L0118
9325D3298O7919m1554p6824j9214K8013m4969N4101k6823q809K4907n1542p5732
$$ plain form
9313 -127229 -81236 -171640 -147082 -27639 57730 36380 -22468 -52892 29816 126226 143051
9302 143051 169873 189864 275283 213002 203686 262253 211199 204956 54128 25884 59362 46057
9290 46057 88058 146534 119416 47277 42396 22578 84914 93436 28838 -54195 -153255 -117980
9278 -117980 -3706 104998 -1520 -5779 -28466 -129478 -89377 -58072 -9235 36890 -24758
9267 -24758 -86518 -52305 13445 -52025 -16724 -61391 -45185 35256 22501 52568 87822 25305
9255 25305 -29279 -153488 -207946 -162447 -289675 -235071 -92997 -26123 -26062 90336 214142
9244 214142 240029 128064 65817 101925 68562 59695 48628 13586 529 28921 -65237 -95254
9232 -95254 -9206 44886 -16745 -169871 -129991 33984 60248 84977 96563 77175 94656
$$ packed form
9313a27229M5993r0404K4558J19443Q5369k1350n8848l0424Q2708R6410J6825
9302A43051K6822J9991Q5419o2281r316N8567n1054o243j50828k8244L3478j3305
9290D6057M2001N8476k7118p2139m881j9818O2336Q522o4598q3033r9060L5275
9278a17980J14274J08704j06518m259k2687j01012M0101L1305M8837M6125o1648
9267b4758o1760L4213O5750o5470L5301m4667J6206Q0441j2755L0067L5254o2517
9255B5305n4584j24209n4458M5499j27228N4604J42074O6874O1J16398J23806
9244B14142K5887j11965o2247L6108l3363q867j1067l5042j3057K8392r4158l0017
9232i5254Q6048N4092o1631j53126L9880J63975K6264K4729J1586j9388J7481
$$ plain form
9221 94656 163484 163096 229157 195799 94679 -60197 -156730 -131139 -3822 48911 32651 -56687
9209 -56687 -15901 -125692 -39827 -12328 -56316 -117171 -108602 -24457 -39316 -36881 -2567 -17855
9197 -17855 -28819 -37486 -27970 -47519 -74503 -113650 -98523 -109574 -78067 -39757 14182 15797
9185 15797 68614 93211 169766 267370 262050 246426 104850 111157 184781 254169 232880 212443
9173 212443 262288 226151 101233 143469 118748 71261 -12682 38639 39714 -33838 -93980 -1184
9161 -1184 134818 48310 -62616 -9604 11651 94810 130277 117934 21056 -130053 -200878
9150 -200878 -109595 73766 93265 105205 74222 93603 130572 206235 154030 74308 -28777
9139 -28777 -142386 -137229 79694 87172 140642 201716 192653 336412 515290 625353 570730
$$ packed form
9221I4656O8828l88O6061l3358j01120j54876r6533K5591J27317N2733j6260q9338
9209e6687M0786j09791Q5865K7499m3988o0855Q569Q4145j4859K435L4314j5288
9197a7855j0964q667R516j9549k6984l9147J5127j1051L1507L8310N3939J615
9185A5797N2817K4597P6555R7604n320j5624j41576O307P3624O9388k1289k0437
9173B12443M9845l6137j24918M2236k4721m7487q3943N1321J075p3552o0142R2796
9161a184J36002q6508j10926N3012K1255Q3159L5467j2343r6878j51109p0825
9150b00878R1283J83361J9499J1940l0983J9381L6969P5663n2205p9722j03085
9139b8777j13609N157K16923P478N3470O1074r063J43759J78878J10063n4623
$$ plain form
9128 570730 519865 494490 445989 350945 391559 425527 416108 433559 341650 141778 50685 30288
9116 30288 31886 26641 173883 263851 240002 244043 304157 347302 308334 419525 463556 380345
9104 380345 279859 176265 17669 48126 166116 156511 196200 175137 33969 -23028 -1223
9093 -1223 25618 60720 123748 187441 215241 306636 454955 372209 349413 380776 481355 444239
9081 444239 351431 365461 430329 428399 441491 492000 491274 387563 178261 51013 -19677 26431
9069 26431 109335 79259 48860 79360 123431 96036 -32191 -28116 42920 -52009 -42869 54470
9057 54470 20456 8194 -12776 -10181 62034 133605 167222 89364 13102 -12800 -48491 -55637
9045 -55637 59326 27840 -19551 5225 80730 62401 41659 64985 100719 148977 199139 96348
$$ packed form
9128E70730n0865k5375m8501r5044M0614L3968r419J7451r1909j99872r1093k0397
9116C0288J598n245J47242Q9968k3849M041O0114M3145l8968J11191M4031q3211
9104C80345j00486j03594j58596L0457J17990r605L9689k1063j41168n6997K1805
9093a223K6841L5102O3028O3693K7800R1395J48319q2746k2796L1363J00579l7116
9081D44239r2808J4030O4868j930J3092N0509p26j03711k09302j27248p0690M6108
9069B6431Q2904l0076l0399L0500M4071k7395j28227M075P1036r4929R140R7339
9057E4470l4014j2262k0970K595P2215P1571L3617p7858p6262k5902l5691p146
9045e5637J14963l1486m7391K4776P5505j8329k0742K3326L5734M8258N0162j02791
$$ plain form
9033 96348 83849 106065 146925 238582 145877 79301 21024 -19439 35565 6531 129916 271505
9021 271505 181688 91305 15862 -155306 32111 161827 172170 102157 -32537 -60710 43963
9010 43963 25598 -5899 12856 51949 -4747 -55586 -43440 13415 22208 -12822 11376 17911
8998 17911 16313 -106113 -131335 -4675 75222 88385 91786 43862 31812 41431 85707 200840
8986 200840 194757 106088 109899 212764 338108 370839 386572 456117 426838 302086 222457
8975 222457 274584 213101 185955 85273 -44921 -59650 10334 40100 -9884 -102623 -75398
8964 -75398 69819 101156 120483 81452 42863 13618 63988 151509 189518 154559 43896
8953 43896 -252 88 -51662 -116777 -149164 -110127 25200 96739 122214 106813 68418 157243
$$ packed form
9033I6348j2499K2216M0860R1657r2705o6576n8277m0463N5004k9034J23385J41589
9021B71505q9817r0383p5443j71168J87417J29716J0343p0013j34694k8173J04673
9010D3963j8365l1497J8755L9093n6696n0839J2146N6855Q793l5030K4198O535
8998A7911j598j22426k5222J26660P9897J3163L401m7924j2050R619M4276J15133
8986B00840o083q8669L811J02865J25344L2731J5733O9545k9279j24752p9629
8975B22457N2127o1483k7146j00682j30194j4729O9984K9766m9984r2739K7225
8964g5398J45217L1337J9327l9031l8589k9245N0370Q7521L8009l4959j10663
8953D3896m4148L40n1750o5115l2387L9037J35327P1539K5475j5401l8395Q8825
$$ plain form
8941 157243 212232 73623 -32305 -25396 35835 -68426 -186869 -108083 -1700 9002 -83176
8930 -83176 -93237 -72014 10438 11226 21741 -28692 -85062 891 -8249 42584 78653 -34433
8918 -34433 -11531 -9958 91292 119550 117398 52876 -71511 -99929 4098 46728 67745 176463
8906 176463 268596 180107 25530 4109 -11281 18421 -34084 -68661 78363 242288 188563
8895 188563 -17175 -50543 25625 128937 109000 46888 36968 8891 87112 186118 246180
8884 246180 298570 329278 325479 251367 308050 360193 341982 200385 75792 48716 32118
8873 32118 129122 134303 149626 174032 215343 240140 261250 375483 338183 226885 227775 226123
8861 226123 222719 324650 297450 252734 341579 368244 313095 249568 227627 236492 305365 372347
$$ packed form
8941A57243N4989j38609j05928O909O1231j04261j18443P8786J06383J0702r2178
8930h3176j0061K1223Q2452P88J0515n0433n6370Q5953r140N0833L6069j13086
8918c4433K2902J573J01250K8258k152o4522j24387k8418J04027M2630K1017J08718
8906A76463R2133q8489j54577k1421j5390K9702n2505l4577J47024J63925n3725
8895A88563k05738l3368P6168J03312j9937o2112r920k8077P8221R9006O0062
8884B46180N2390L0708l799p4112N6683N2143j8211j41597j24593k7076j6598
8873C2118R7004N181J5323K4406M1311K4797K1110J14233l7300j11298Q90j652
8861B26123l404J01931k7200m4716Q8845K6665n5149o3527k1941Q865O8873O6982
$$ plain form
8849 372347 333244 198278 218248 333702 312977 278279 276079 419470 431031 279778 323135
8838 323135 301966 315095 493260 596986 548921 449778 451838 494022 612567 663635 726637
8827 726637 689355 704415 726566 701726 723364 820513 876674 935881 1014770 1033319 1075985 1083841
8815 1083841 1079557 1062511 1024131 1041413 1168362 1204609 1273353 1205320 1211106 1303861 1443464
8804 1443464 1586920 1655131 1670483 1654611 1831076 2034820 2154191 2284980 2368833 2436273
8794 2436273 2624806 3049668 3331335 3576362 4049827 4631246 5327287 6198272 7148863 8404828
8784 8404828 10186217 12589356 16006473 20522142 26798317 35216916 45413842 55330076
8776 55330076 61188184 60154124 53764380 45531317 37807354 31659251 27136737 23740404
$$ packed form
8849C72347l9103j34966J9970J15454k0725l4698k200J43391J1561j51253M3357
8838C23135k1169J3129J78165J03726m8065r9143K060M2184J18545N1068O3002
8827G26637l7282J5060K2151k4840K1638R7149N6161N9207P8889J8549M2666P856
8815A083841m284j7046l8380J7282J26949L6247O8744o8033N786R2755J39603
8804A443464J43456O8211J5352j5872J76465K03744J19371J30789Q3853O7440
8794B436273J88533M24862K81667K45027M73465N81419O96041Q70985R50591J255965
8784H404828J781389K403139L417117M515669O276175Q418599J0196926R916234
8776E5330076N858108j034060o389744q233063p723963o148103m522514l396333
$$ plain form
8768 23740404 21219683 19147274 17466258 16206606 15189388 14435863 13831315 13262012 12869399
8759 12869399 12424799 11943138 11799605 11667945 11586646 11516683 11548089 11525343 11605593 11841324
8749 11841324 12131274 12480463 12934929 13649024 14554080 15358192 16359791 17652885 19379402
8740 19379402 21889253 25135862 29623243 35901011 44599655 56949962 74468987 97161754
8732 97161754 120394121 133559958 129217187 112301249 92596483 75632563 62645369
8725 62645369 53093561 46124800 40959673 36966986 33757222 31081287 29204034 27560301
8717 27560301 26118008 24900975 23827092 22878192 21927007 21124698 20400026 19869919 19479303
8708 19479303 19097328 18731221 18497943 18420586 18462340 18564746 18661858 19060888 19649964 20074793
$$ packed form
8768B3740404k520721k072409j681016j259652j017218p53525o04548n69303l92613
8759A2869399m44600m81661j43533j31660q1299o9963L1406k2746Q0250K35731
8749A1841324K89950L49189M54466P14095R05056Q04112J001599J293094J726517
8740A9379402K509851L246609M487381O277768Q698644J2350307J7519025K2692767
8732I7161754K3232367J3165837m342771j6915938j9704766j6963920j2987194
8725F2645369r551808o968761n165127l992687l209764k675935j877253j643733
8717B7560301j442293j217033j073883r48900r51185q02309p24672n30107l90616
8708A9479303l81975l66107k33278p7357M1754J02406R7112L99030N89076M24829
$$ plain form
8698 20074793 20382281 20767643 21384420 22395720 23934103 26017031 28802613 32672377 38017847
8689 38017847 45364014 54584344 63216920 67751605 65904819 58962505 50187729 42187077
8681 42187077 35819130 31048302 27394370 24666753 22367858 20397195 18961384 17779606
8673 17779606 16711842 15830231 15048655 14227168 13607324 13122714 12467157 11798727 11386941
8664 11386941 11071721 10784603 10426927 10147080 9872617 9723938 9687711 9509901 9468188 9331341
8654 9331341 9226501 9123052 8902634 8676735 8411278 8128781 7893949 7537967 7246019 6816585
8644 6816585 6559488 6381259 6182983 5835691 5494603 5306798 5070455 4830483 4709182 4448272
8634 4448272 4037085 3744563 3538448 3463168 3450533 3323111 3247245 3175564 2962358 2747650
$$ packed form
8698B0074793L07488L85362O16777J011300J538383K082928K785582L869764N345470
8689C8017847P346167R220330Q632576M534685j846786o942314q774776q000652
8681D2187077o367947m770828l653932k727617k298895j970663j435811j181778
8673A7779606j067764q81611p81576q21487o19844m84610o55557o68430m11786
8664A1386941l15220k87118l57676k79847k74463j48679l6227j77810m1713j36847
8654I331341j04840j03449k20418k25899k65457k82497k34832l55982k91948m29434
8644F816585k57097j78229j98276l47292l41088j87805k36343k39972j21301k60910
8634D448272m11187k92522k06115p5280j2635j27422p5866p1681k13206k14708
$$ plain form
8624 2747650 2606832 2501213 2496170 2440553 2239438 2063336 1958553 1767420 1861170 1733920
8614 1733920 1636996 1612588 1667107 1718907 1737893 1657672 1627228 1728875 1726838 1626501 1626106 1533207
8602 1533207 1414517 1448355 1520519 1502420 1371070 1305115 1244785 1151854 1048954 1009524 1061292
8591 1061292 1209238 1154351 1079989 938342 947948 1094358 1039872 983426 849866 656793 588877
8580 588877 655441 770824 835640 790522 743389 739738 763721 919222 992119 951301 824036
8569 824036 705407 806456 995570 984551 895347 891208 889964 819841 820538 844367 863544 691094
8557 691094 704485 727254 663119 633899 637384 700401 640771 684186 769645 652471 563703 593332
8545 593332 599287 625856 709666 681475 705342 590477 564650 559065 565910 649738 528470 432083
$$ packed form
8624B747650j40818j05619n043n5617k01115j76102j04783j91133R3750j27250
8614A733920r6924k4408N4519N1800J8986q0221l0444J01647k037j00337l95r2899
8602A533207j18690L3838P2164j8099j31350o5955o0330r2931j02900l9430N1768
8591A061292J47946n4887p4362j41647R606J46410n4486n6446j33560j93073o7916
8580E88877O6564J15383O4816m5118m7133l651K3983J55501P2897m0818j27265
8569H24036j18629J01049J89114j1019q9204m139j244p0123O97K3829J9177j72450
8557F91094J3391K2769o4135k9220L485O3017n9630M3415Q5459j17174q8768K9629
8545E93332N955K6569Q3810k8191K3867j14865k5827n585O845Q3828j21268r6387
$$ plain form
8533 432083 577794 704515 611815 547699 602336 612512 707252 799733 842720 898099 839953
8522 839953 700624 644938 711028 769883 678407 710462 658942 591752 593007 683311 656760 529229
8510 529229 340102 250252 236215 250538 355866 381708 412198 470635 589424 644653 549105
8499 549105 441378 437082 380100 372440 314806 321569 376165 361549 296622 424155 451826 308859
8487 308859 330913 357520 316892 245286 311635 383005 415034 334436 312185 270145 278569 264890
8475 264890 262083 325225 327199 130673 150806 163700 199953 231994 134223 85407 198687 286499
8463 286499 294822 241457 248608 253894 233845 222997 226384 220868 308605 276054 175886 196793
8451 196793 195366 204833 283805 446176 487531 367520 356951 494929 557547 543423 499470
$$ packed form
8533D32083J45711J26721r2700o4116N4637J0176R4740R2481M2987N5379n8146
8522H39953j39329n5686O6090N8855r1476L2055n1520o7190J255R0304k6551j27531
8510E29229j89127q9850j4037J4323J05328K5842L0490N8437J18789N5229r5548
8499E49105j07727m296n6982p660n7634O763N4596j4616o4927J27533K7671j42967
8487C08859K2054K6607m0628p1606O6349P1370L2029q0598k2251m2040Q424j3679
8475B64890k807O3142J974j96526K0133J2894L6253L2041r7771m8816J13280Q7812
8463B86499Q323n3365P151N286k0049j0848L387n516Q7737l2551j00168K0907
8451A96793j427R467P8972J62371M1355j20011j0569J37978O2618j4124m3953
$$ plain form
8440 499470 507038 255309 66676 145027 343172 317572 362610 422559 361260 334753 279427
8429 279427 241897 308726 276800 241851 195277 235090 219770 206325 246791 350042 314732
8418 314732 141899 85685 110495 69550 132886 286626 291110 306382 261870 333494 520065
8407 520065 523937 406335 391732 280440 117262 71587 192872 198929 145923 170979 187183
8396 187183 257337 380550 370717 405180 451438 456094 393797 311079 201970 171254 209380 299670
8384 299670 305809 321384 386740 302823 273362 291029 321967 387987 405093 375320 393759 435729
8372 435729 442497 551595 602065 558749 487194 441224 473432 558062 455379 426116 375334
8361 375334 465910 422640 339584 221267 252773 309351 239427 357200 470096 497539 382891
$$ packed form
8440D99470P568k51729j88633P8351J98145k5600M5038N9949o1299k6507n5326
8429B79427l7530O6829l1926l4949m6574L9813j5320j3445M0466J03251l5310
8418C14732j72833n6214K4810m0945O3336J53740M484J5272m4512P1624J86571
8407E20065L872j17602j4603j11292j63178m5675J21285O057n3006K5056J6204
8396A87183P0154J23213r833L4463M6258M656o2297q2718j09109l0716L8126R0290
8384B99670O139J5575O5356q3917k9461J7667L0938O6020J7106k9773J8439M1970
8372D35729O768J09098N0470m3316p1555m5970L2208Q4630j02683k9263n0782
8361C75334R0576m3270q3056j18317L1506N6578o9924J17773J12896K7443j14648
$$ plain form
8350 382891 407256 508937 604854 719153 761241 823932 933769 1162144 1337019 1260619 1047557
8339 1047557 917755 831793 700177 637404 640842 648522 687286 731220 647897 699858 764715
8328 764715 913387 1055535 1035852 910101 771461 743218 738004 640066 487431 608139 564337
8317 564337 436976 441095 583870 592847 532949 408437 353546 311053 221358 144373 244784
8306 244784 385496 524995 604576 786168 936729 963209 1311077 1713298 2023667 2028399
8296 2028399 1852262 1549332 1302820 1177014 1000294 848387 681471 516326 463980 551457
8286 551457 657551 686129 699475 689698 762475 838573 837149 660393 418070 275053 270072
8275 270072 309016 365598 362962 250309 256689 325047 380093 289767 248189 217703 93035 114305
$$ packed form
8350C82891K4365J01681R5917J14299M2088O2691J09837K28375J74875p6400k13062
8339A047557j29802q5962j31616o2773L438P680L8764M3934q3323N1961O4857
8328G64715J48672J42148j9683j25751j38640k8243n214r7938j52635J20708m3802
8317E64337j27361M119J42775Q977n9898j24512n4891m2493q9695p6985J00411
8306B44784J40712J39499P9581J81592J50561K6480L47868M02221L10369M732
8296B028399j76137l02930k46512j25806j76720j51907j66916j65145n2346Q7477
8286E51457J06094K8578J3346r777P2777P6098j424j76756k42323j43017m981
8275B70072L8944N6582k636j12653O380O8358N5046r0326m1578l0486j24668K1270
$$ plain form
8263 114305 173209 289041 339078 301240 256675 258421 464996 571838 651014 791775 834305
8252 834305 743274 522026 338880 244755 203471 176525 199441 165329 299336 332508 292614
8241 292614 272618 291355 392129 316748 312095 278422 277628 344879 313522 346545 319809 276293
8229 276293 370359 333995 346264 419805 370995 317858 181725 113094 100602 154018 145293 110982
8217 110982 59355 98527 115488 103416 246303 378988 324230 252455 200834 217765 237852
8206 237852 117449 151027 245776 245454 271679 118160 20073 -50801 -96745 17808 118237
8195 118237 92889 81834 160278 212553 158986 169510 95223 93737 34341 7407 69850 67268
8183 67268 48094 11263 47122 -29879 2640 21484 70733 78454 168070 115972 -18520 70863
$$ packed form
8263A14305N8904J15832N0037l7838m4565J746K06575J06842P9176J40761M2530
8252H34305r1031k21248j83146r4125m1284k6946K2916l4112J34007L3172l9894
8241B92614j9996J8737J00774p5381m653l3673p94O7251l1357L3023k6736m3516
8229B76293R4066l6364J2269P3541m8810n3137j36133o8631j2492N3416q725l4311
8217A10982n1627L9172J6961j2072J42887J32685n4758p1775n1621J6931K0087
8206B37852j20403L3578R4749l22K6225j53519r8087p0874m5944J14553J00429
8195A18237k5348j1055P8444N2275n3567J0524p4287j486n9396k6934O2443k582
8183F7268j9174l6831L5859p7001L2519J8844M9249P721Q9616n2098j34492Q9383
$$ plain form
8171 70863 143963 57461 48856 65458 112706 85133 19895 -26012 66590 105661 56007 53609
8159 53609 146013 212863 189603 73842 16051 8758 -112956 -116711 -54401 -39706 -147102 -12418
8147 -12418 -40373 -1006 -22373 -82489 -80390 -48186 -19631 -56755 11624 18983 -101999 -171676
8135 -171676 -104282 -56791 -20801 95210 99562 -30074 -52040 -11390 -11265 41510 5034 47428
8123 47428 142655 221024 196228 100927 -9678 17105 74263 138656 18604 90032 202737
8112 202737 138567 22737 22292 13661 39746 37777 -20775 19669 46686 164258 171469 180816
8100 180816 101082 31809 -47920 -140811 -97010 -152995 -123808 -138499 -126081 -24140 32615
8089 32615 14911 -15824 -37723 9152 27498 -28608 -128770 -110918 -8612 -33161 -54696
$$ packed form
8171G0863P3100q6502q605J6602M7248k7573o5238m5907R2602L9071m9654k398
8159E3609R2404O6850k3260j15761n7791p293j21714l755O2310J4695j07396J34684
8147a2418k7955L9367k1367o0116K099L2204K8555l7124O8379P359j20982o9677
8135a71676O7394M7491L5990J16011M352j29636k1966M0650J25N2775l6476M2394
8123D7428R5227P8369k4796r5301j10605K6783N7158O4393j20052P1428J12705
8112B02737o4170j15830m45q631K6085j969n8552M0444K7017J17572P211R347
8100A80816p9734o9273p9729r2891M3801n5985K9187j4691J2418J01941N6755
8089C2615j7704l0735k1899M6875J8346n6106j00162J7852J02306k4549k1535
$$ plain form
8078 -54696 16842 24484 -27211 14339 131501 136418 90701 56915 85967 144896 165541 240680
8066 240680 186564 22620 72251 162463 270622 201135 166857 74672 -55420 -33539 102122
8055 102122 124188 161729 85224 50393 -3992 68280 107342 76858 -9689 -39714 36799 125636
8043 125636 134142 89628 -13289 -43198 -58014 -119212 -186253 -241420 -126075 -70737 -67787 -204554
8031 -204554 -150171 -67151 -12478 -12716 -1612 44617 50876 5952 -74110 -89109 -4223 64033
8019 64033 52096 -7914 36238 179402 317243 246533 126973 66008 101886 97361 140142
8008 140142 144067 132363 212277 349705 334336 237694 177186 102733 50781 -4088 -69348 -203395
7996 -203395 -182235 -89775 -30902 -54526 17266 30627 -73011 -15831 75999 90807 47933
$$ packed form
8078e4696P1538P642n1695M1550J17162M917m5717l3786K9052N8929K0645P5139
8066B40680n4116j63944M9631R0212J08159o9487l4278r2185j30092K1881J35661
8055A02122K2066L7541p6505l4831n4385P2272L9062l0484q6547l0025P6513Q8837
8043A25636Q506m4514j02917k9909j4816o1198o7041n5167J15345N5338K950j36767
8031b04554N4383Q3020N4673k38J1104M6229O259m4924q0062j4999Q4886O8256
8019F4033j1937o0010M4152J43164J37841p0710j19560o0965L5878m525M2781
8008A40142L925j1704P9914J37428j5369r6642o0508p4453n1952n4869o5260j34047
7996b03395K1160R2460N8873k3624P1792J3361j03638N7180R1830J4808m2874
$$ plain form
7985 47933 -17376 -34035 -56778 -7824 77256 202615 220818 212713 261669 283008 255728 202148
7973 202148 128681 83887 97752 106196 43649 -55018 -60978 17220 113610 93187 24399 -57796
7961 -57796 -40475 6386 -70361 -49959 56254 84031 56133 65977 15231 -55900 -107553 -180672
7949 -180672 -84757 -15148 13348 -37536 14218 23005 56546 89692 95669 72290 -28049 -25388
7937 -25388 -920 -136623 -189156 -124787 -93663 20244 126704 174478 207375 133740 85283
7926 85283 24093 69874 88386 52993 23156 -39007 3605 52555 124599 17843 -2019 -27633
7914 -27633 14205 102824 140841 203777 178828 88817 -77800 -114734 -11859 32941 -33394
7903 -33394 18831 -60817 -91069 -140408 -84721 -11632 5535 -22969 -25961 -10691 97621 43172
$$ packed form
7985D7933o5309j6659k2743M8954Q5080J25359J8203q105M8956K1339k7280n3580
7973B02148p3467m4794J3865Q444o2547r8667n960P8198R6390k0423o8788q2195
7961e7796J7321M6861p6747K0402J06213K7777k7898R844n0746p1131n1653p3119
7949a80672R5915O9609K8496n0884N1754Q787L3541L3146N977k3379j00339K661
7937b5388K4468j35703n2533O4369L1124J13907J06460M7774L2897p3635m8457
7926H5283o1190M5781J8512l5393k9837o2163M2612M8950P2044j06756j9862k5614
7914b7633M1838Q8619L8017O2936k4949r0011j66617l6934J02875M4800o6335
7903c3394N2225p9648l0252m9339N5687P3089J7167k8504k992J5270J08312n4449
$$ plain form
7891 43172 -9146 476 -57110 -140094 -125071 52832 78020 61834 136028 179867 181963 28144
7879 28144 -120751 -157100 -61755 53764 115792 170648 2364 -112953 -129265 -147789 1493
7868 1493 122591 85915 60440 -17175 -18250 -34767 -91254 -91096 -47836 81566 -6302 -20662
7856 -20662 54407 -63477 -74512 -136564 -69750 15501 43133 989 10605 92608 122662 122110
7844 122110 108632 -39149 -81130 18071 123780 155329 100526 9941 -21537 312 8625
7833 8625 65494 132283 195062 240956 154778 49179 44645 39430 -20773 -84836 26121 24944
7821 24944 -43040 -132213 -108688 -121212 -88166 7780 -30993 86102 131896 33775 21549 1548
7809 1548 19178 66133 88695 38965 -15367 -16763 -30343 63723 92259 -21494 15487 138909
$$ packed form
7891D3172n2318R622n7586q2984J5023J77903K5188j6186P4194M3839K096j53819
7879B8144j48895l6349R5345J15519O2028N4856j68284j15317j6312j8524J49282
7868A493J21098l6676k5475p7615j075j6517n6487J58M3260J29402q7868j4360
7856b0662P5069j17884j1035o2052O6814Q5251K7632m2144R616Q2003L0054n52
7844A22110j3478j47781m1981R9201J05709L1549n4803r0585l1478K1849Q313
7833H625N6869O6789O2779M5894q6178j05599m534n215o0203o4063J10957j177
7821B4944o7984q9173K3525j2524L3046R5946l8773J17095M5794r8121j2226k0001
7809A548J7630M6955K2562m9730n4332j396j3580R4066K8536j13753L6981J23422
$$ plain form
7797 138909 216064 180774 61394 -197798 -243622 -196847 -116230 50433 181594 116508 22440
7786 22440 -66065 -234939 -239958 -180605 -43194 -7528 -49054 64490 65560 29530 -18425 -1822
7774 -1822 168459 138283 168765 187280 90316 18781 4303 -93704 4517 80839 70432 118910
7762 118910 65606 90067 74059 59011 -27353 17368 98353 -12218 24449 84291 105080
7751 105080 7472 936 -86086 -128334 -41558 -769 -77370 -250320 -132150 28009 -18121
7740 -18121 14186 98123 -34082 -51306 38977 -31690 14911 79950 91722 12685 -53640 -78566
7728 -78566 -56277 -40191 66289 92267 97007 158064 48359 -83912 -40343 98771 222820
7717 222820 119047 -38582 -127710 -142344 -131597 -111120 -150652 -138231 6743 -16173 -17472
$$ packed form
7797A38909P7155l5290j19380k59192m5824M6775Q0617J66663J31161o5086r4068
7786B2440q8505j68874n019N9353J37411L5666m1526J13544J070l6030m7955J6603
7774a822J70281l0176L0482J8515r6964p1535j4478r8007R8221P6322j0407M8478
7762A18910n3304K4461j6008j5048q6364M4721Q0985j10571L6667N9842K0789
7751A05080r7608o536q7022m2248Q6776M0789p6601j72950J18170J60159m6130
7740a8121L2307Q3937j32205j7224R0283p0667M6601O5039J1772p9037o6325k4926
7728g8566K2289J6086J06480K5978M740O1057j09705j32271M3569J39114J24049
7717B22820j03773j57629q9128j4634J0747K0477l9532J2421J44974k2916j299
$$ plain form
7706 -17472 45989 106367 130176 106758 70223 68369 595 -18169 -48035 -71937 28444 67259
7694 67259 44591 65578 142372 221794 246391 147123 80273 51851 27656 -15954 -144665 -66635
7682 -66635 39990 87335 119421 120774 142185 23298 87975 151927 170120 106077 30385 -17874
7670 -17874 28442 -11290 -62092 -96395 -110108 -205324 -204977 -197947 -156356 -164686 -98240 -125 -46880
7657 -46880 -120757 -127559 7628 55811 11860 48893 70784 107524 62222 77218 59668 31587
7645 31587 10929 -114557 -171230 -21050 55055 107466 129297 103850 22154 -112452 -146636
7634 -146636 -127529 -77190 -30632 17428 4017 -1909 51431 109070 50075 54395 61781 40010
7622 40010 -68285 -52822 37709 -21816 -73488 -484 23589 -45856 -23123 36166 87339 119609
$$ packed form
7706a7472O3461O0378K3809k3418l6535j854o7774j8764k9866k3902J00381L8815
7694F7259k2668K0987P6794P9422K4597r9268o6850k8422k4195m3610j28711P8030
7682f6635J06625M7345L2086J353K1411j18887O4677O3952J8193o4043p5692m8259
7670a7874M6316l9732n0802l4303j3713r5216L47P030M1591q330O6446R8115m6755
7657d6880p3877o802J35187M8183m3951L7033K1891L6740m5302J4996j7550k8081
7645C1587k0658j25486n6673J50180P6105N2411K1831k5447q1696j34606l4184
7634a46636J9107N0339M6558M8060j3411n926N3340N7639n8995M320P386k1771
7622D0010j08295J5463R0531n9525n1672P3004K4073o9445K2733N9289N1173L2270
$$ plain form
7610 119609 81777 90904 -15736 -59558 -114520 -118202 556 9629 19162 28140 -1140 -97694
7598 -97694 -24507 46633 153975 144514 -33043 24840 39130 68349 47963 -10033 54129 101337
7586 101337 -51382 -53641 5570 -40716 -122196 -82700 -3540 -14016 -66384 -5137 37022 -20187
7574 -20187 -108172 -130846 -147537 -158023 -115693 -76728 11491 61312 -10439 -132301 -115812 -60896
7562 -60896 45299 31459 24214 109734 84436 79302 39011 4538 39374 77865 22590 -36232
7550 -36232 -36216 -49561 -187283 -148500 -146145 -164791 -60640 8796 -10890 -37516 -75591 -61881
7538 -61881 59538 80879 8684 -27160 -54171 -11652 56604 22027 -114015 -91796 -117333
7527 -117333 -72144 -54797 -50869 -7654 -12562 72058 197443 260805 100676 70644 86101 -16962
$$ packed form
7610A19609l7832R127j06640m3822n4962l682J18758R073R533Q978k9280r6554
7598i7694P3187P1140J07342r461j77557N7883J4290K9219k0386n7996O4162M7208
7586A01337j52719k259N9211m6286q1480L9496P9160j0476n2368O1247M2159n7209
7574b0187q7985k2674j6691j0486M2330L8965Q8219M9821p1751j21862J6489N4916
7562f0896J06195j3840p245Q5520k5298n134m0291l4473L4836L8491n5275n8822
7550c6232J6j3345j37722L8783K355j8646J04151O9436j9686k6626l8075J3710
7538f1881J21419K1341p2195l5844k7011M2519O8256l4577j36042K2219k5537
7527a17333M5189J7347L928M3215m908Q4620J25385O3362j60129l0032J5457j03063
$$ plain form
7515 -16962 -126696 34079 37556 -1309 -16910 -10875 -76589 -90301 5977 -2352 -6893 11890
7503 11890 5685 -28038 -18139 -15625 -19737 -28907 -34859 30867 86044 87903 82976 114826 -1575
7490 -1575 -9125 69428 70558 13135 -8865 48933 90569 168972 105916 -20635 -55308 76837
7478 76837 68604 13681 -17056 45985 8319 -55789 -9404 -17710 -40096 -92252 -23535 48081
7466 48081 16994 -48181 -71977 109732 133834 53495 82292 155308 103012 50534 -4036 27757
7454 27757 87489 26649 45966 94378 29010 13681 -28621 61694 134768 221743 86328 -194920
7442 -194920 -127326 -44105 41640 -21252 21570 18613 -14500 -32113 -53825 -90853 -52106 73623
7430 73623 166957 134756 145078 152522 210577 149207 676 -10943 -3373 169667 245136 283500
$$ packed form
7515a6962j09734J60775L477l8865j5601O035o5714j3712R6278q329m541J8783
7503A1890o205l3723R899K514m112r170n952O5726N5177J859m927L1850j16401
7490a575p550P8553J130n7423k2000N7798M1636P8403o3056j26551l4673J32145
7478G6837q233n4923l0737O3041l7666o4108M6385q306k2386n2156O8717P1616
7466D8081l1087o5175k3796J81709K4102q0339K8797P3016n2296n2478n4570L1793
7454B7757N9732o0840J9317M8412o5368j5329m2302R0315P3074Q6975j35415k81248
7442a94920O7594Q3221Q5745o2892M2822k957l3113j7613k1712l7028L8747J25729
7430G3623R3334l2201J0322P444N8055o1370j48531j1619P570J73040P5469L8364
$$ plain form
7418 283500 172711 60541 -27241 -103111 -12325 105334 192538 162234 61412 32730 46594
7407 46594 59800 42066 42497 49685 67713 122487 127178 88725 42064 -88148 -107931 -117836 -13651
7394 -13651 -70219 -230912 -141387 32506 85680 28585 -128046 -169989 -164488 -44237 -7706
7383 -7706 -118681 -120938 -82385 57862 177910 98768 -27627 -5843 -86651 -126065 -73573
7372 -73573 -43214 -53914 -52671 51277 113374 96407 32640 -80844 -244904 -202116 -47318
7361 -47318 -48025 -3612 157189 211042 39473 -57011 -89116 -55783 -36473 8074 95784 137362
7349 137362 235899 299661 232729 185483 155262 21885 -25517 123729 78274 31767 95086
7338 95086 32429 -86721 -56674 29677 11160 34444 87930 83651 16998 -28603 -46918 -44648
$$ packed form
7418B83500j10789j12170q7782p5870R0786J17659Q7204l0304j00822k8682J3864
7407D6594J3206j7734M31P188J8028N4774M691l8453m6661j30212j9783r905J04185
7394a3651n6568j60693Q9525J73893N3174n7095j56631m1943N501J20251L6531
7383g706j10975k257L8553J40247J20048p9142j26395K1784q0808l9414N2492
7372g3573L0359j0700J243J03948O2097j6967o3767j13484j64060M2788J54798
7361d7318p07M4413J60801N3853j71569r6484l2105L3333J9310M4547Q7710M1578
7349A37362R8537O3762o6932m7246l0221j33377m7402J49246m5455m6507O3319
7338I5086o2657j19150L0047Q6351j8517K3284N3486m279o6653m5601j8315K270
$$ plain form
7326 -44648 12737 -1508 -149672 -95796 17692 -18164 -205238 -282869 -214368 -101290 -49271
7315 -49271 51560 105036 99443 93690 30359 43955 19621 -15969 59471 62293 -46601 -87334
7303 -87334 -73904 -50467 -56193 -113092 -124931 -2524 90180 26890 21737 15272 -99468 -131149
7291 -131149 67714 225542 132366 59112 -70512 -66010 21969 24339 46942 -88757 -60379
7280 -60379 67334 202818 142242 8673 -30024 -111292 -151996 -156465 -92707 -78140 -71560 -20781
7268 -20781 -62394 -120316 -230715 -228493 -574 112598 122687 24936 -34122 14066 142399
7257 142399 111773 36298 20338 37176 118374 68297 -144017 -294191 -328295 -236423 -106357
7246 -106357 -42227 -23439 66295 146469 173501 140233 119136 -42088 -29065 69186 95853
$$ packed form
7326d4648N7385j4245j48164N3876J13488l5856j87074p7631O8501J13078N2019
7315d9271J00831N3476n593n753o3331J3596k4334l5590P5440K822j08894m0733
7303h7334J3430K3437n726n6899j1839J22407R2704o3290n153o465j14740l1681
7291a31149J98863J57828r3176p3254j29624M502Q7979K370K2603j35699K8378
7280f0379J27713J35484o0576j33569l8697q1268m0704m469O3758J4567O580N0779
7268b0781m1613n7922j10399K222K27919J13172J0089r7751n9058M8188J28333
7257A42399l0626p5475j5960J6838Q1198n0077k12314j50174l4104R1872J30066
7246a06357O4130J8788Q9734Q0174K7032l3268k1097j61224J3023R8251K6667
$$ plain form
7235 95853 57071 24764 77125 157708 15261 -124388 -62069 26114 41826 -5578 -36098
7224 -36098 -89680 -101942 -70458 -49525 21822 45876 82709 111930 52161 -80377 -41087 2968
7212 2968 -31893 -84898 -101696 9899 140102 108386 10777 33765 60317 55740 168350 121700
7200 121700 66027 12716 -28307 -28722 -41299 -14199 -44784 -111085 -86569 -65569 -61657 81364
7188 81364 160677 123600 26823 -53523 -2503 -39474 -66328 -29462 -110267 -93706 -125039 -157911
7176 -157911 -109642 -140051 -186422 -189241 -48732 14580 -10380 -48806 -122732 -137346 -169644 -162654
7164 -162654 -103899 -76420 -63437 22153 -9352 -15632 -41075 -39637 -3865 2783 35826 82741
7152 82741 48258 68813 45542 -138735 -101755 15261 54518 39671 28993 -86775 490
$$ packed form
7235I5853l8782l2307N2361Q0583j42447j39649O2319Q8183J5712m7404l0520
7224c6098n3582j2262L1484K0933P1347K4054L6833K9221n9769j32538L9290M4055
7212B968l4861n3005j6798J11595J30203l1716r7609K2988K6552m577J12610m6650
7200A21700n5673n3311m1023m15j2577K7100l0585o6301K4516K1000L912J43021
7188H1364P9313l7077r6777q0346N1020l6971k6854L6866q0805J6561l1333l2872
7176a57911M8269l0409m6371k819J40509O3312k4960l8426p3926j4614l2298O990
7164a62654N8755K7479J2983Q5590l1505o280k5443J438L5772O648L3043M6915
7152H2741l4483K0555k3271j84277L6980J17016L9257j4847j0678j15768Q7265
$$ plain form
7141 490 13068 38347 23434 -309 9439 -45241 -154386 6472 154582 158775 167762 244876
7129 244876 298905 75773 2436 88170 127378 152962 243777 228852 127240 273974 266034
7118 266034 145811 105143 98042 69702 -11655 25384 25316 53554 108803 111779 107531 -31360
7106 -31360 -82954 -125219 -24037 12580 -98120 -139325 -129368 -161096 -162350 -164586 -109581 -84907
7094 -84907 7709 -562 -91665 -225873 -144751 -34823 -51697 -63702 -107334 -59050 -114784 -116214
7082 -116214 26197 183958 57464 38147 56167 -32959 -54613 -32841 14800 -26022 29014
7071 29014 13160 -8353 -1816 -68723 -83451 -77103 3374 19311 59978 27639 -48460 -136520
7059 -136520 -112542 -150497 -81402 -40547 -95252 -107542 -158946 -267072 -288843 -252323 -163179
$$ packed form
7141D90J2578K5279j4913k3743R748n4680j09145J60858J48110M193Q987P7114
7129B44876N4029k23132p3337Q5734L9208K5584R0815j4925j01612J46734p940
7118B66034j20223m0668p101k8340q1357L7039o8K8238N5249K976m248j38891
7106c1360n1594m2265J01182L6617j10700m1205R957l1728j254k236N5005K4674
7094h4907R2616q271r1103j34208Q1122J09928j6874j2005m3632M8284n5734j430
7082a16214J42411J57761j26494j9317J8020q9126k1654K1772M7641m0822N5036
7071B9014j5854k1513O537o6907j4728O348Q0477J5937M0667l2339p6099q8060
7059a36520K3978l7955O9095M0855n4705j2290n1404j08126k1771L6520Q9144
$$ plain form
7048 -163179 -100961 -73967 -121747 -175378 -45030 92846 189158 201333 33938 -76506 -170573
7037 -170573 -173085 -153349 -227076 -211349 -171298 -110344 -239774 -228506 -87384 -34787 -70387
7026 -70387 -76147 -61919 42945 69400 65755 103220 85434 14777 -35772 66158 128247 115548
7014 115548 81201 -26924 -92699 -112054 -170848 -216709 -193152 -60254 -84659 -101629 -86582
7003 -86582 8103 52074 20708 8962 28623 -95807 -132915 -193835 -129086 -171173 -185966 -52491
6991 -52491 -61235 -192028 -196732 -95327 1165 97001 55230 -22248 -40048 36561 -14280 -30769
6979 -30769 139416 246336 178454 154823 91945 84177 85364 60206 97766 122871 77620 69728
6967 69728 72415 -15949 -152415 -152646 -89971 -56133 8824 14367 113243 202370 147765 41168
$$ packed form
7048a63179O2218K6994m7780n3631J30348J37876R6312J2175j67395j10444r4067
7037a70573k512J9736p3727J5727M0051O0954j29430J1268J41122N2597l5600
7026g0387n760J4228J04864K6455l645L7465j7786p0657n0549J01930O2089j2699
7014A15548l4347j08125o5775j9355n8794m5861K3557J32898k4405j6970J5047
7003h6582R4685M3971l1366j1746J9661j24430l7108o0920O4749m2087j4793J33475
6991e2491q744j30793m704J01405R6492R5836m1771p7478j7800P6609n0841j6489
6979c0769J70185J06920o7882k3631o2878p768J187k5158L7560K5105m5251p892
6967F9728K687q8364j36466k31O2675L3838O4957N543R8876Q9127n4605j06597
$$ plain form
6955 41168 -79790 -95686 -61178 -28339 -89412 -169482 -126963 -216425 -226964 -183663 -62121
6944 -62121 -125806 -123750 -3710 85767 54680 -2504 -37925 -19872 19916 -2423 54428 120879
6932 120879 116227 122016 98909 4429 -61717 -114835 -199639 -291206 -245103 -193725 -126929 -125509
6920 -125509 -134959 -130783 -107818 -162620 -222995 -158072 -76597 24316 53457 1675 -51216 5556
6908 5556 76977 -62940 -210525 -197624 -73225 81581 167822 194140 141801 92531 62687
6897 62687 123902 100690 72333 52394 53906 14036 -32711 -30506 89769 96127 -13672 -75873
6885 -75873 -86076 -34549 -76897 -105581 -2579 -66666 -115102 -111658 -62801 17091 64839 137983
6873 137983 119060 -39415 -142690 -74510 -49215 -90606 -128872 -75906 -128333 -183762 -68334
$$ packed form
6955D1168j20958j5896L4508L2839o1073q0070M2519q9462j0539M3301J21542
6944f2121o3685K056J20040Q9477l1087n7184l5421J8053L9788k2339N6851O6451
6932A20879m652N789k3107r4480o6146n3118q4804r1567M6103N1378O6796J420
6920a25509r450M176K2965n4802o0375O4923Q1475J00913K9141n1782n2891N6772
6908E556P1421j39917j47585J2901J24399J54806Q6241K6318n2339m9270k9844
6897F2687O1215k3212k8357j9939J512l9870m6747K205J20275O358j09799o2201
6885g5873j0203N1527m2348k8684J03002o4087m8436L444M8857P9892M7748P3144
6873A37983j8923j58475j03275O8180K5295m1391l8266N2966n2427n5429J15428
$$ plain form
6862 -68334 -30504 620 73551 19868 4639 89205 80924 51191 59973 -29828 -139555 -123530
6850 -123530 -256 -1512 21818 97906 112026 185550 237424 305270 202994 73834 71020
6839 71020 147058 105481 4833 -33444 -2360 19331 42872 83495 109050 118713 25614 -10403
6827 -10403 54167 102124 -35172 -27356 -34696 -45825 -119924 -56504 14907 118459 86647 139602
6815 139602 189684 265422 254121 244608 281782 226574 128550 17743 -90651 -9546 -119720
6804 -119720 -136851 -15695 69863 -10138 -7194 97639 124432 101658 5209 99946 198603
6793 198603 91603 31069 46394 131441 115784 90704 142210 132971 23992 25019 14990 93688
6781 93688 92078 106571 141276 82595 95075 117783 151416 115691 80088 16489 -43700 -13807
$$ packed form
6862f8334L7830L1124P2931n3683j5229Q4566q281k9733Q782q9801j09727J6025
6850a23530J23274j256K3330P6088J4120P3524N1874O7846j02276j29160k814
6839G1020P6038m1577j00648l8277L1084K1691K3541M0623K5555R663r3099l6017
6827a0403O4570M7957j37296P816p340j1129p4099O3420P1411J03552l1812N2955
6815A39602N0082P5738j1301r513L7174n5208r8024j10807j08394Q1105j10174
6804a19720j7131J21156Q5558q0001K944J04833K6793k2774r6449R4737R8657
6793A98603j07000o0534J5325Q5047j5657k5080N1506r239j08979J027j0029P8698
6781I3688j610J4493L4705n8681J2480K2708L3633l5725l5603o3599o0189K9893
$$ plain form
6769 -13807 67035 195261 211720 191975 158853 112233 86235 20023 12846 -68076 -184758 -180226
6757 -180226 -140738 1413 -15428 29093 72872 35662 -25748 -6859 -25936 -5172 5694
6746 5694 9713 -17819 -69167 -100763 -83253 -61022 -3404 -69767 -125302 -113581 -103229 -190510
6734 -190510 -166653 -78353 10829 -117041 -112285 -41312 -68688 -142262 -151146 -44913 5503 -14424
6722 -14424 -53359 -130890 -102839 -77689 -64766 -67461 -99241 -43214 -45872 8012 -504 97520
6710 97520 104019 -5262 -60193 -31615 -39330 -161742 -237465 -188683 -182890 -58325 -179930 -186526
6698 -186526 -162003 -113957 -107839 -41330 10665 -24737 -7396 -3515 -11039 -88954 -58120 -4885
6686 -4885 1801 -118296 -77154 74942 80101 -28606 -1419 21665 -51718 -42633 -48097 -16652
$$ packed form
6769a3807Q0842J28226J6459j9745l3122m6620k5998o6212p177q0922j16682M532
6757a80226L9488J42151j6841M4521M3779l7210o1410J8889j9077K0764J0866
6746E694M019k7532n1348l1596J7510K2231N7618o6363n5535J1721J0352q7281
6734a90510K3857Q8300Q9182j27870M756P0973k7376p3574q884J06233N0416j9927
6722a4424l8935p7531K8051K5150J2923k695l1780N6027k658N3884q516R8024
6710I7520O499j09281n4931K8578p715j22412p5723M8782N793J24565j21605o596
6698a86526K4523M8046O118O6509N1995l5402J7341L881p524p7915L0834N3235
6686d885O686j20097M1142J52096N159j08707K7187K3084p3383R085n464L1445
$$ plain form
6674 -16652 29046 61666 101894 15699 11457 87804 124167 140049 45520 29617 67882 80005
6662 80005 -18385 -91734 -56744 -48637 27520 -55844 -161026 -143007 -34348 89784 1260
6651 1260 -43168 29082 -40672 -121034 -121176 -90903 -29733 20034 111058 55073 -12017 3361
6639 3361 -63514 -25229 7176 56239 71893 69649 11694 5229 -56577 -156788 -168997 -68241
6627 -68241 30982 25611 -96202 -79624 30655 22097 -59455 -118827 33732 66093 -88996
6616 -88996 -50259 -64066 -111201 -92639 -33407 -84760 -119971 -193033 -302455 -269951 -106812
6605 -106812 -79712 -44067 15948 109800 151284 112484 47674 -24688 45320 13097 -112711
6594 -112711 -125221 -70456 52843 213122 193859 86670 -137123 -244255 -156873 -41242
$$ packed form
6674a6652M5698L2620M0228q6195m242P6347L6363J5882r4529j5903L8265J2123
6662H0005r8390p3349L4990Q107P6157q3364j05182J8019J08659J24132q8524
6651A260m4428P2250o9754q0362j42L0273O1170M9767R1024n5985o7090J5378
6639C361o6875L8285L2405M9063J5654k244n7955o465o1806j00211j2209J00756
6627f8241R9223n371j21813J6578J10279q558q1552n9372J52559L2361j55089
6616h8996L8737j3807m7135J8562N9232n1353l5211p3062j09422L2504J63139
6605a06812K7100L5645O0015R3852M1484l8800o4810p2362P0008l2223j25808
6594a12711j2510N4765J23299J60279j9263j07189k23793j07132Q7382J15631
$$ plain form
6584 -41242 -78020 -94284 -100570 -109891 -70585 -2573 103757 168154 275485 217151 160128 168305
6572 168305 71673 26417 48582 -4923 -70347 -99735 -143741 -69572 -16805 65380 91797 30161
6560 30161 20320 267 -32368 -87077 -43915 166652 140393 -37544 -90142 -119365 -168692 -162600
6548 -162600 -111287 -92529 -6338 4201 13814 -77401 -143451 -127766 -137402 -68265 -103946 -41904
6536 -41904 2557 59672 -7732 55370 11551 75141 14599 -111531 -107161 -81394 -58263 -11109
6524 -11109 58870 -13174 -74141 -176381 -113855 -102027 -139761 -121545 -95832 -40001 22137 31282
6512 31282 -13152 -130020 -192873 -58309 -48016 -156740 -181752 -105492 -60707 643 -65853
6501 -65853 -60598 -10581 106877 92153 87075 75188 -544 -42599 -63451 -110715 -70798 -65375
$$ packed form
6584d1242l6778j6264o286r321L9306O8012J06330O4397J07331n8334n7023Q177
6572A68305r6632m5256K2165n3505o5424k9388m4006P4169N2767Q2185K6417o1636
6560C0161r841k0053l2635n4709M3162K10567k6259j77937n2598k9223m9327O092
6548a62600N1313J8758Q6191J0539R613r1215o6050J5685r636O9137l5681O2042
6536d1904M4461N7115o7404O3102m3819O3590o0542j26130M370K5767K3131M7154
6524a1109O9979p2044o0967j02240O2526J1828l7734J8216K5713N5831O2138R145
6512C1282m4434j16868o2853J34564J0293j08724k5012P6260M4785O1350o6496
6501f5853N255N0017J17458j4724n078j1887p5732m2055k0852m7264L9917N423
$$ plain form
6489 -65375 -154376 -198330 -81461 94684 235763 168789 64989 11708 -76760 -50210 23387
6478 23387 49522 -101041 -212375 -178535 -94490 -67382 -25565 -99949 -91494 -96041 -136948 -161204
$$ packed form
6489f5375q9001m3954J16869J76145J41079o6974j03800n3281q8468K6550P3597
6478B3387K6135j50563j11334L3840Q4045K7108M1817p4384Q455m547m0907k4256
$$ [...]
##END NTUPLES=NMR SPECTRUM
##END=
