##TITLE=Analysis number 307104
Compound Code mo 00326
Project Code adrs
Chemist Name synnovation
##JCAMPDX= 6.0         $$ Bruker NMR JCAMP-DX V2.0
##DATA TYPE= NMR SPECTRUM
##DATA CLASS= NTUPLES
##ORIGIN= Bruker BioSpin GmbH
##OWNER= NMR
$$ XWIN-NMR		Version 3.5
$$ Wed Apr 20 16:46:20 2005 GMT Daylight Time (UT+1h)  MAYBRIDGE\NMR@NMR_250MHZ
##.OBSERVE FREQUENCY= 250.131544655141
##.OBSERVE NUCLEUS= ^1H
##.ACQUISITION MODE= SIMULTANEOUS (DQD)
##.ACQUISITION SCHEME= undefined
##.AVERAGES= 16
##.DIGITISER RES= 18
##SPECTROMETER/DATA SYSTEM= dpx250
##.PULSE SEQUENCE= zg30
##.SOLVENT NAME= CDCl3
##.SHIFT REFERENCE= (INTERNAL, CDCl3, 0, 16.522)
##AUDIT TRAIL= $$ (NUMBER, WHEN, WHO, WHERE, WHAT)
$$ ##TITLE= Audit trail, XWIN-NMR		Version 3.5
$$ ##JCAMPDX= 5.01
$$ ##ORIGIN= Bruker BioSpin GmbH
$$ ##OWNER= NMR
$$ C:\u/data/dgb/nmr/ADRS/1960/pdata/1/auditp.txt
$$ ##AUDIT TRAIL=  $$ (NUMBER, WHEN, WHO, WHERE, WHAT)
(   1,<2005-04-20 16:46:01.13 +100>,<MAYBRIDGE\NMR>,<NMR_250MHZ>,
      <created by zg, POWCHK disabled, PULCHK disabled
       configuration hash MD5:
       62 19 C7 07 E1 42 D1 B7 37 6C 3D D0 77 39 F9 E6
       data hash MD5: 64K
       4F 23 96 52 27 B7 59 56 AE 28 70 DC F0 5B 45 45>)
(   2,<2005-04-20 16:46:12.10 +100>,<MAYBRIDGE\NMR>,<NMR_250MHZ>,
      <Start of raw data processing
       ef LB = 0.3 FT_mod = 6 PKNL = 1 SI = 32K 
       data hash MD5: 32K
       1E 6A DC 13 FA 33 50 39 C4 23 8E 8B C3 04 92 EF>)
(   3,<2005-04-20 16:46:13.71 +100>,<MAYBRIDGE\NMR>,<NMR_250MHZ>,
      <apk 
       data hash MD5: 32K
       B5 90 29 3A 2C 82 9D D3 28 51 EF FF B7 8D 07 AD>)
(   4,<2005-04-20 16:46:14.43 +100>,<MAYBRIDGE\NMR>,<NMR_250MHZ>,
      <abs ABSG = 5 
       data hash MD5: 32K
       B5 2F 8B 71 47 84 18 23 12 8A 26 1C 44 B4 A9 CE>)
$$ ##END=
$$ 
$$ hash MD5
$$ 5D 2B 39 4B CE B1 F5 A7 FA 0C 94 84 2C 3D 14 CA
##$RELAX= 
##$RELAX= 
##$RELAX= 
##$RELAX= 
##$RELAX= 
##$RELAX= 
##$RELAX= 
$$ Bruker specific parameters
$$ --------------------------
##$DU= <C:\u>
##$EXPNO= 1960
##$NAME= <ADRS>
##$PROCNO= 1
##$TYPE= <nmr>
##$USER= <dgb>
##$AMP= (0..31)
100 100 100 100 100 100 100 100 100 100 100 100 100 100 100 100 100 100 
100 100 100 100 100 100 100 100 100 100 100 100 100 100 
##$AQSEQ= 0
##$AQ_mod= 3
##$AUNM= <au_zg>
##$AUTOPOS= <43 >
##$BF1= 250.13
##$BF2= 250.13
##$BF3= 250.13
##$BF4= 250.13
##$BF5= 500.13
##$BF6= 500.13
##$BF7= 500.13
##$BF8= 500.13
##$BYTORDA= 1
##$CFDGTYP= 0
##$CFRGTYP= 5
##$CHEMSTR= <none>
##$CNST= (0..31)
1 1 145 1 1 1 1 1 1 1 1 1 1 1 1 1 1 1 1 1 1 1 1 1 1 1 1 1 1 1 1 1 
##$CPDPRG= <>
##$CPDPRG1= <>
##$CPDPRG2= <>
##$CPDPRG3= <>
##$CPDPRG4= <mlev>
##$CPDPRG5= <mlev>
##$CPDPRG6= <mlev>
##$CPDPRG7= <mlev>
##$CPDPRG8= <mlev>
##$CPDPRGB= <>
##$CPDPRGT= <>
##$D= (0..31)
0 1 0 0 0 0 0 0 0 0.06 0 0 0 0 0 0 0.0002 0 0 0 0 0 0 0 0 0 0 0 0 0 0 
0 
##$DATE= 1114011960
##$DBL= (0..7)
120 120 120 120 120 120 120 120 
##$DBP= (0..7)
150 150 150 150 150 150 150 150 
##$DBP07= 0
##$DBPNAM0= <>
##$DBPNAM1= <>
##$DBPNAM2= <>
$$ [...]
##$SUBNAM7= <"">
##$SUBNAM8= <"">
##$SUBNAM9= <"">
##$SW= 20.6930455092707
##$SWIBOX= (0..15)
0 0 3 0 0 0 0 0 0 0 0 0 0 0 0 0 
##$SW_h= 5175.983436853
##$TD= 65536
##$TD0= 1
##$TE= 296.16
##$TE2= 300
##$TE3= 300
##$TEG= 300
##$TL= (0..7)
0 120 120 120 120 120 120 120 
##$TP= (0..7)
150 150 150 150 150 150 150 150 
##$TP07= 0
##$TPNAME0= <>
##$TPNAME1= <>
##$TPNAME2= <>
##$TPNAME3= <>
##$TPNAME4= <>
##$TPNAME5= <>
##$TPNAME6= <>
##$TPNAME7= <>
##$TPOAL= (0..7)
0.5 0.5 0.5 0.5 0.5 0.5 0.5 0.5 
##$TPOFFS= (0..7)
0 0 0 0 0 0 0 0 
##$TUNHIN= 0
##$TUNHOUT= 0
##$TUNXOUT= 0
##$USERA1= <user>
##$USERA2= <user>
##$USERA3= <user>
##$USERA4= <user>
##$USERA5= <user>
##$V9= 5
##$VALIST= <valist>
##$VCLIST= <CCCCCCCCCCCCCCC>
##$VD= 0
##$VDLIST= <DDDDDDDDDDDDDDD>
##$VPLIST= <PPPPPPPPPPPPPPP>
##$VTLIST= <TTTTTTTTTTTTTTT>
##$WBST= 1024
##$WBSW= 4
##$XGAIN= (0..3)
0 0 0 0 
##$XL= 0
##$YL= 0
##$YMAX_a= 443752
##$YMIN_a= -349960
##$ZGOPTNS= <>
##$ZL1= 120
##$ZL2= 120
##$ZL3= 120
##$ZL4= 120
##$ABSF1= 16.522
##$ABSF2= -4.171173
##$ABSG= 5
##$ABSL= 3
##$ALPHA= 0
##$AQORDER= 0
##$ASSFAC= 0
##$ASSFACI= 0
##$ASSFACX= 0
##$ASSWID= 0
##$AUNMP= <proc_1d>
##$AZFE= 0.1
##$AZFW= 0.1
##$BCFW= 0
##$BC_mod= 0
##$BYTORDP= 0
##$COROFFS= 0
##$CY= 12.5
##$DATMOD= 1
##$DC= 0
##$DFILT= <>
##$DTYPP= 0
##$F1P= 14.0000005364418
##$F2P= -0.99999901652339
##$FCOR= 0.5
##$FTSIZE= 32768
##$FT_mod= 6
##$GAMMA= 0
##$GB= 0
##$INTBC= 1
##$INTSCL= 1
##$ISEN= 128
##$LB= 0.3
##$LEV0= 0
##$LPBIN= 0
##$MAXI= 10000
##$MC2= 0
##$MEAN= 0
##$ME_mod= 0
##$MI= 0
##$NCOEF= 0
##$NC_proc= -4
##$NLEV= 6
##$NOISF1= 0
##$NOISF2= 0
##$NSP= 0
##$NTH_PI= 0
##$NZP= 0
##$OFFSET= 16.522
##$PC= 1
##$PHC0= -71.18077
##$PHC1= 0.2176327
##$PH_mod= 1
##$PKNL= yes
##$PPARMOD= 0
##$PSCAL= 4
##$PSIGN= 0
##$REVERSE= no
##$SF= 250.13
##$SI= 32768
##$SIGF1= 0
##$SIGF2= 0
##$SINO= 400
##$SIOLD= 32768
##$SREGLST= <1H.CDCl3>
##$SSB= 0
##$STSI= 32768
##$STSR= 0
##$SW_p= 5175.98343685301
##$SYMM= 0
##$S_DEV= 0
##$TDeff= 65536
##$TDoff= 0
##$TI= <Analysis number 999999
Compound Code 99
Book Reference 9
Project Code 9>
##$TILT= no
##$TM1= 0
##$TM2= 0
##$TOPLEV= 0
##$USERP1= <user>
##$USERP2= <user>
##$USERP3= <user>
##$USERP4= <user>
##$USERP5= <user>
##$WDW= 1
##$XDIM= 32768
##$YMAX_p= 322234029
##$YMIN_p= -392289
$$ End of Bruker specific parameters
$$ ---------------------------------
##NTUPLES= NMR SPECTRUM
##VAR_NAME=  FREQUENCY,     SPECTRUM/REAL,   SPECTRUM/IMAG
##SYMBOL=    X,             R,               I
##VAR_TYPE=  INDEPENDENT,   DEPENDENT,       DEPENDENT
##VAR_FORM=  AFFN,          ASDF,            ASDF
##VAR_DIM=   32768,         32768,           32768
##UNITS=     HZ,            ARBITRARY UNITS, ARBITRARY UNITS
##FACTOR=    0.157963299565203, 1,           1
##FIRST=     4132.6476996994, 0,             0
##LAST=      -1043.33573715361, 0,           0
##MIN=       -1043.33573715361, -392289,     0
##MAX=       4132.6476996994, 322234029,     0
$$ Real data points
##PAGE= N=1
##DATA TABLE= (X++(R..R)), XYDATA
$$ [...]
24416d797O857o0714j7515L5414N8203j073O4651j7797o3544K4752J1476k0256
24404A5657M076q746N7734J7358K3458n1143k2261p8532n654M7782O2491K3095
24392H5315l0671m0005j1552j1364O536K7317J5675l7716j8172K5785k3889j0042
24380b2783K6887m765L3786j7716j64457k9439N1217O4595N6119l9155K6264j3083
24368c2530Q5077P5190P9426p7876o5240M1395r0951p4515l3923L4348p664k297
24356f9560O4962K4238O0732L0200l1066o0749m9447N118K6075o03l5636k4447
24344f0183K4262K4911l78m0962m5164K7759L5971K2024j7090J8964N2890n0992
24332g988L8397n540o7739m978R4173K023r5814J8189P4679K0746j8726j5072
$$ y = [-4797, 2060, -58654, -76169, -40755, 17448, 16375, 81026, 63229, -315, 24437, 35913, 15657, 19733, 10987, 68721, 86079, 109537, 58394, 36133, -42399, -48053, -271, 62220, 85315, 54644, 14639, 3087, -8277, -1741, 25576, 41251, 3535, -14637, 11148, -12741, -22783, 4104, -661, 33125, 15409, -149048, -178487, -127270, -62675, -6556, -45711, -19447, -32530, 52547, 127737, 207163, 129287, 64047, 105442, 14491, -60024, -93947, -59599, -67263, -69560, -4598, 19640, 80372, 110572, 79506, 18757, -30690, -25572, 503, -100, -35736, -60183, -35921, -11010, -11388, -52350, -97514, -69755, -33784, -11760, -28850, -9886, 43004, -7988, 30409, 24869, -42870, -47848, 46325, 48348, -47466, -29277, 45402, 66148, 47422, 32350]
24320C2350j3746J4629L5265K2337m4779j8482j0269p9688m7439J2767J2216N6015
24308b8824M2548n9005J8928m6531n7431K0667Q3935j1821j12835l9798L6673
24297a53494L5344N4502K5171n223q9350L799K6495o3114J7266J19698J00814
24286G1908k9220o2690j0752m9546N4786K8896j0032o5376N3652O4330j2652P046
24274D0350O3042n4251o6680n4800J7188K2479o253M8203m0794p702K2650M678
24262a1890n2732M405L8765Q373J6867J4916P559K6111K3698M332o7019l0886
24250a7501Q0326P368j3075K0660J7437J1501L7428M0866l9614q0555p0664m4126
24238d9949K8086O154j1482K78M1528L1150l6260J0054K3697O254n8886l1239
$$ y = [32350, 18604, 33233, 68498, 90835, 46056, 27574, 17305, -62383, -109822, -97055, -84839, -28824, 13724, -45281, -26353, -72884, -130315, -109648, -25713, -37534, -150369, -190167, -153494, -118150, -63648, -38477, -43700, -133050, -129251, -102756, -165870, -148604, -28906, 71908, 42688, -20002, -30754, -80300, -25514, 3382, -6650, -72026, -18374, 45956, 33304, 40350, 103392, 49141, -17539, -72339, -55151, -32672, -38925, 9278, -31516, -39218, -16568, -11890, -64622, -60217, -21452, -13079, 3788, 18704, 26263, 52374, 76072, 80404, 13385, -17501, 62825, 70193, 57118, 77778, 95215, 106716, 144144, 185010, 145396, 64841, -5823, -49949, -21863, -15709, -27191, -26913, 14615, 45765, 9505, 19559, 43256, 49510, -9376, -40615]
24226d0615L638j9426o3245l6407N6724L9505m59K8616J0760J0254k0380m4320
24214g5355N3307R1844k6423p76j1992L6580j4379j07319O753N3770L0224l4477
24202A757n1048N7032N3003K7521k433m0858m6998k2805N935O440n072K5498j280
24189F692Q468k8993n0373m2573K566M0753O4578J7845L6214k7298l8314m8205
24177e8640k2078p8237L2053J6905L0447L7287m6128j2050K8373j8629J5104M1233
24165c4360M5722Q352p507K9188J0216n3519K179j2097q585p5101k4784M3293
24153g7003P191q461R819P5353J4418m7973j9008M1523K932M4545K7680J9084
24141I0100j6219m0572J6788n0924j523m6701L9872P7704m3692m346K6909N5367
$$ y = [-40615, -36977, -56403, -119648, -156055, -99331, -59826, -60285, -31669, -20909, -10655, -31035, -75355, -22048, 69796, 43373, 42597, 30605, 67185, 52806, -54513, -47760, 6010, 36234, 1757, -49291, 7741, 60744, 88265, 85832, 44974, -2024, -24829, -18894, -12454, -17526, 7972, 6692, 15160, -13833, -64206, -106779, -104213, -63460, 1118, 18963, 55177, 27879, -10435, -58640, -80718, -158955, -126902, -109997, -79550, -42263, -88391, -100441, -72068, -90697, -75593, -34360, 11362, 19714, 12207, 41395, 51611, -1908, 271, -11826, -20411, -95512, -120296, -77003, -69812, -78273, -68454, 6899, 21317, -26656, -45664, -4141, -1209, 43336, 71016, 90100, 73881, 33309, 50097, -827, -2350, -49051, -9179, 68525, 24833, 20487, 47396, 102763]
24129A02763p6174K1551l8834J9829j7224o2254l5219L8201J09134L3528j3856
24118H1445P45j2472j01261k561L0987M7963Q644K466K0641m7209n2972m4455
24106f8039J8866k6303l7758k6203L3158J181l404O7941R7165m1629m3401l1609
24094f0035k8668J2484L1192M6183j958k8298l7884K9549L5778Q554j7925J6226
24082E198M483l2825L631K6483l3616k7290j5843n114K2459K5333N0061K1799
24070D4759l6357j8188j1886m1010M8537m320m2929j8453J8472J9850J9186N647
24058a6692L2423l0061n392K6527L0688q1264j6344j4500k0108N367J546J477
24046h6333k1125O1868J7477K8805j546J1349q4093l5755N4223n2725L7491O5455
$$ y = [102763, 26589, 48140, 9306, 29135, 11911, -50343, -85562, -47361, 61773, 95301, 81445, 82190, 69718, -31543, -34104, -3117, 44846, 53490, 55956, 76597, 29388, -23584, -68039, -49173, -75476, -113234, -139437, -106279, -105098, -108502, -40561, 56604, 14975, -28426, -60035, -88703, -76219, -45027, 1156, -802, -29100, -66984, -37435, -1657, 6897, -11028, 5198, 9681, -23144, -19513, 6970, -26646, -53936, -69779, -74893, -52434, -27101, 22960, 44759, 8402, -9786, -21672, -62682, -14145, -18465, -61394, -79847, -61375, -41525, -22339, -16692, 15731, -14330, -19722, 6805, 37493, -43771, -60115, -74615, -94723, -89356, -87810, -86333, -107458, -45590, -28113, 692, -854, 10495, -73598, -109353, -55130, -107855, -70364, -4909]
24034d909L4523j3597J7465L1820n4713j04144K0619N0094K1733R154M1693q165
24022D1573l6370m4514m1753j3909J3597j4231j0232L8858M5815J8270J2088P835
24010A7027K9363m5450M177P239L7614p3455l3818J2997n5267m2381L1645L7059
23998g3250N4708k2003K5138O737l5868k4728J5418q177R72O3329J1800j3368
23986G08j8596n6465K5106L5775m972k7193J7631K3440p322P657P2799k3156k8274
23973A7138J5037m3363l6730j8540M6694J6916l5853N0049K470q150k2263L9191
23961B2596n0242m9622p3090j3229L3570R9815M3988K0414L3770O2080k1237j22916
23949a4103J5002N5489J4153m8051L8561J6825M327j7389K1867k7005R100K7030
$$ y = [-4909, 29614, 16017, 33482, 65302, 10589, -93555, -72936, -22842, -1109, 8045, 49738, 41573, 5203, -39311, -81064, -94973, -81376, -95607, -105839, -66981, -21166, -2896, 9192, 17027, 46390, 940, 5117, 12356, 49970, -23485, -57303, -44306, -99573, -141954, -110309, -73250, -18542, -40545, -15407, -8670, -44538, -69266, -53848, -62025, -61053, 2276, 14076, 708, -17888, -74353, -49247, -13472, -18444, -45637, -28006, -4566, -11888, -4231, 68568, 45412, 17138, 32175, -11188, -47918, -66458, -19764, -2848, -38701, 11348, 13818, 5668, -16595, 22596, -27646, -77268, -150358, -163587, -130017, -30202, 13786, 34200, 67970, 130050, 108813, -14103, 899, 56388, 70541, 22490, 61051, 77876, 82203, 64814, 86681, 59676, 68776, 95806]
23937I5806L3302l640l7778n8390n6204P106j2962j1263N889L2685k3606l7412
23925f6467q527o00K5955k63q8541N3210M2278J8623L586O750R782K8180K1768
23912D5734L2411l7727M5076K3935k3988k9053o9781p584N0779M6499o9187n0460
23900d3346L9240N0243j5516k8771l9935L8718O4069k2687q246k7078J8293K1708
23888D6692n7044k6578q393L8766L2654r767o1119n4851P9257O7598p8907j2562
23876d4254Q0855N0509J037o0442k7385M1849L8759j9972q9848J2283P912n057
23864a3754K2485l521k5708l5720m3502m622P7460k9170J1068M5935J5883o8842
23852e2008m4628j0616M6466N6016O196K5844k0777j4793Q756o2560k9858O4454
$$ y = [95806, 129108, 125468, 87690, 29300, -26904, -19798, -32760, -44023, -38134, -5449, -29055, -66467, -74994, -75594, -49639, -49902, -138443, -85233, -42955, -24332, -20746, -13996, -4214, 23966, 45734, 78145, 40418, 85494, 109429, 85441, 56388, -13393, -20977, 29802, 76301, 7114, -43346, -4106, 46137, 30621, 1850, -38085, 633, 64702, 42015, 33769, 6691, 24984, 46692, -10352, -36930, -45323, -6557, 26097, 16330, -44789, -99640, -20383, 47215, -31692, -44254, 36601, 87110, 88147, 27705, 320, 42169, 80928, 60956, -28892, -16609, -8697, -13754, 8731, 5210, -20498, -56218, -99720, -104342, -26882, -56052, -44984, 951, 16834, -52008, -96636, -107252, -60786, -4770, 1426, 27270, 6493, -8300, 456, -62104, -91962, -27508]
23840b7508N567l5625l1752J1674N4441J2836L9463N485O968k8723l7783o3359
23828h8316l6360L7594L1550K6184M0310L5011j9555j0503m5454q479k799N0289
23816I472J5283n5754P1163J7034m3186L956l3451N492L7126K6310P1012j6972
23804A07485l3712j0873o5204q2980o7074J4248j0036p78N0802J3263k7448Q4831
23792b7476N8924J7139K6002p0697q4888J0279J3613l6440j1096N2670M7505K4126
23780A9661J8796K0108p820k7891j6184M5039J3170k1456k1115L4696M1048k6142
23768G1910j1961q1132j3947J15548M2506q7029k1023l6746l4072K767N9760j2428
23756e847l6578k9837J2132J7072j3241O8226L6816m9239k5485m1800l2793M633
$$ y = [-27508, -21941, -57566, -89318, -77644, -23203, -10367, 29096, 34581, 41549, 12826, -24957, -88316, -124676, -87082, -55532, -29348, 10962, 45973, 26418, 15915, -29539, -38018, -40817, 9472, 24755, -30999, 40164, 57198, 14012, 17968, -15483, -9991, 27135, 53445, 124457, 107485, 73773, 62900, -2304, -85284, -152358, -138110, -148146, -148924, -98122, -84859, -112307, -27476, 31448, 48587, 74589, 3892, -80996, -70717, -57104, -93544, -104640, -51970, -4465, 19661, 38457, 58565, 50745, 22854, 6670, 51709, 64879, 43423, 22308, 57004, 98052, 71910, 59949, -21183, -35130, 80418, 122924, 35895, 14872, -21874, -55946, -53179, 6581, -5847, -42425, -72262, -60130, -43058, -56299, 11927, 48743, -496, -25981, -67781, -100574, -95941]
23744i5941M1252l244r6800p806O5945O2706N6313L4363P859L8496n2170j2355
23732C8618j1949k4685l1079P8264K4279j2533l2105m1406k2010r644L6389N5693
23720D7832l9367n9804P481N2864k0333J6677L2265L1916L865n6119N643K4500
23708D7420k150K552O7l6219K7228q675r6953k826J08441L8587Q29j248n102k3449
23694D8502o637k1231j7519J6289L3518O3502k7353l7899k9246k0950k2296j1889
23682c3209P0300L5511K4086l9200q699k8811k7895J9850k7196j9186N4423M7595
23670F7569n1253k9599m1218K6843L8742j967L2184j900q6265Q726N4498J9631
23658C5991n1906p2355j3510r727k009P313k6580M2834J5065M9692M3519O6031
$$ y = [-95941, -54689, -57933, -154733, -162539, -96594, -33888, 22425, 56788, 64647, 103143, 50973, 38618, 26669, 1984, -29095, 49169, 73448, 60915, 28810, -12596, -34606, -44250, -7861, 47832, 8465, -51339, -43858, 9006, -11327, 5350, 37615, 69531, 73396, 17277, 22920, 47420, 45270, 47822, 47889, 11670, 38898, 30223, -66730, -69556, 38885, 77472, 78301, 77053, 71951, 48502, 41865, 20634, 3115, 19404, 52922, 116424, 89071, 51172, 21926, 976, -21320, -33209, 37091, 72602, 96688, 57488, 48789, 19978, -7917, 11933, -15263, -34449, 19974, 67569, 16316, -13283, -54501, -27658, 11084, 9117, 41301, 39401, -46864, -38138, 16360, 35991, -15915, -88270, -101780, -111507, -113516, -106203, -132783, -89949, -74884, -25192, 18327, 84358]
23646H4358K5872n9438j690n0630k989k6226p9011j2146J5650K1345L6652Q1812
23634C3559n7894l8096Q291M669k7339L4533p753M077k800M4589O1245k4362M3357
23621G6076J2054J4626k6355q630N8187o8941j25049j8610J21595M6580Q705o8422
23609B1816k1148J4096k1700L0135j3718l9208k4880m6692J7618M5956J8723L6035
23597A7033O0134J137o454J1305j8263l810J3405k1220j8848j8283j4865o1072
23585e9801n884k1272K142J3154N6739M9628J0703p2763n0060M3177K1582J5046
23573B391m4670R859J07532r05l5971r71K7534k573r767M57n9764l9856N3849
23560G145M5873M4757l3663q5657n7459p01L4059q752r072O3065Q3199l9802q2831
$$ y = [84358, 110230, 50792, 49102, -1528, -4517, -30743, -109754, -121900, -106250, -84905, -48253, 33559, -24335, -62431, -54140, -49471, -76810, -42277, -50030, -45953, -48753, -4164, 57081, 32719, 76076, 88130, 102756, 76401, 67771, 125958, 57017, -68032, -86642, 34953, 81533, 90238, 21816, 668, 14764, -6936, 23199, 9481, -29727, -54607, -101299, -83681, -37725, -19002, 17033, 77167, 78304, 71850, 83155, 64892, 61082, 74487, 53267, 34419, 16136, 1271, -59801, -65685, -86957, -84815, -71661, -14922, 34706, 45409, -27354, -77414, -34237, -12655, 2391, -42279, -32420, 75112, 74207, 38236, 37265, 64799, 62226, 52459, 52916, -6848, -46704, 7145, 53018, 97775, 64112, -21545, -79004, -79705, -45646, -54398, -63470, -405, 82794, 42992, -39839]
23547c9839q5592K8158L2915J3065M9368J5032j5972K6656R119k333l1549p0312
23535g1284k7944L3840R8984j6429J8925O3433L0055r275P336K4791p7934m1469
23523C3029L015n8605k6162P1368O7822n0118o4513l6152k2350q0999L4965j6032
23511a44732L4793Q9422M1038O198Q120j1964j3351k7773p3462J8826Q1645M8720
23499E7480k8036j24058K6057L6576O073L648M9096J4922o7448p7735n282M1551
23487f7156M4045q504j8610K7766J1395m646J9488L9868l4076J0268n3755O4680
23475C0763M9181Q712K9114k9197p6094p101k5477n1449L3327R1883L7164M4705
23463A35531J1837m2695n7849L5715n0571p490L3618o3207m6072J9212M8524J631
$$ y = [-39839, -125431, -97273, -64358, -51293, -1925, 13107, -2865, 23791, 32910, 30577, -972, -71284, -99228, -65388, 33596, 17167, 36092, 99525, 129580, 120305, 127641, 152432, 74498, 33029, 36044, -22561, -48723, 22645, 90467, 40349, -24164, -60316, -82666, -163665, -128700, -144732, -109939, -20517, 20521, 26719, 34839, 22875, 9524, -18249, -91711, -72885, 8760, 57480, 29444, -94614, -68557, -31981, -25908, -22260, 26836, 41758, -25690, -103425, -108707, -67156, -23111, -31615, -50225, -22459, -11064, -15710, 3778, 43646, 9570, 19838, -33917, 30763, 79944, 88656, 117770, 88573, 12479, 5378, -20099, -71548, -38221, 53662, 90826, 135531, 147368, 104673, 46824, 82539, 31968, 24478, 58096, -5111, -51183, -31971, 16553, 18184]
23451A8184p750M459l8146j2770N8534L7920l2026P049K7748J0314J2741K2750
23439A09007j8575o4123M1853j876m6513k891l536M1965M1594o0529k4098N5717
23427F7995P363l565l778q6078J8927O7721m5300p1584l5307K6666N5080Q4834
23415H2974K9970k9791r2880r468M1218L3411n1595J7511K1445l7872K6891n7919
23403b6105J6349j7361l7023k4397R640L1512L2104J4602r363o6111m189K5246
23391e5096J7961p826J6257O121m8354l3081J17349k9036r071k9658J1767L6839
23379e828j7253n0230N1951N420j247n0931j0160J688J7377n167J1422O5142L3885
23366D6069O232M34k5648L3858L7970L5445j01416q9184n338J01008p095N1051
$$ y = [18184, 10434, 14893, -23253, -36023, 22511, 60431, 28405, 35454, 63202, 73516, 86257, 109007, 90432, 26309, 68162, 66286, 19773, 16882, 13346, 55311, 96905, 36376, 12278, 67995, 75358, 71793, 68015, -18063, 864, 68585, 23285, -48299, -83606, -56940, -1860, 82974, 112944, 83153, -9727, -19195, 22023, 55434, 3839, 21350, 42795, 4923, 31814, -26105, -9756, -27117, -64140, -88537, -78897, -47385, -15281, -679, -10042, -76153, -80342, -55096, -37135, -44961, -28704, -22583, -70937, -104018, 13331, -15705, -24776, -54434, -42667, -5828, -23081, -73311, -21360, -15940, -17187, -68118, -78278, -76590, -59213, -64380, -52958, 12184, 46069, 52301, 52735, 27087, 60945, 98915, 134360, 32944, -56240, -61578, 39430, 32335, 83386]
23354H3386o393l8743m3690K4705J7853N705J2302J9871j0504l4450p4430P562
23342c6826Q2658L4973q141J384o1468j7301J0521L7237k3280m4032M8492k140
23330B2077N9561j1555r1058k0182M1830P7819p1548L0478L2541P596K704j4432
23318F5831K280K4244O67k5219j16200k9641Q5189Q999M923J8882J0751N9217
23306A09923j0691l9266M553L5246M9445l1083n4576O2882L630p1556k3503n8456
23294b3452k7449J9901K8275j4010k0500l658p1667K2971O5459j5840L3979j2416
23282a8407M3702M043k17l3788q1046K7553M3870k7939k2295n3710O118M512L0721
23269g6883M3205k7683K0230P1600J4999O9255N1649N43q4554p2774J3330n8317
$$ y = [83386, 76993, 38250, -5440, 19265, 37118, 42823, 55125, 74996, 64492, 30042, -44388, -36826, 45832, 80805, 72664, 74048, 12580, -4721, 5800, 43037, 19757, -24275, 24217, 22077, 81638, 70083, -20975, -41157, 673, 78492, 6944, 37422, 69963, 77559, 80263, 65831, 68111, 92355, 93022, 67803, -48397, -78038, 7151, 16150, 21073, 39955, 50706, 109923, 99232, 59966, 64519, 99765, 149210, 118127, 63551, 126433, 130063, 58507, 35004, -23452, -50901, -31000, -2725, -16735, -37235, -40893, -112560, -89589, -24130, -39970, -5991, -18407, 25295, 29338, 29121, -4667, -85713, -58160, -14290, -42229, -64524, -118234, -112116, -107604, -76883, -33678, -61361, -41131, 30469, 45468, 114723, 166372, 166915, 82361, 9587, 22917, -35400]
23257c5400m4675K9073j5537M3187o601n8361K4152L6486P486o6968O379l1449
23245a12228O6615N266N5318O7918J1958n367j2031k2813K4167o936l4335k6899
23233A0633m5100l3785k915Q5577K7770M5654O726l9841n4373K4971M4472l4042
23221C5747k3847J8887m1764m6324j817L8670Q7007O6900r784m8203n6862k7570
23209h960j3730m5824K1913M5717M4957M2900l4767l4329k525O8158m6295q7596
23197e0381l0287L1946j6521N2275N8263j2158J2506j609n5895K0530O1180l1078
23185C8771m2986r266N8126O4300M8770m7964m4891l3783M1280O1627k7475q639
23173I7870j28202p8824l5093O7191J03912j0335R664J873k7156k3718J0413M0136
$$ y = [-35400, -80075, -51002, -66539, -23352, -29953, -88314, -64162, -27676, -20190, -87158, -80779, -112228, -45613, -40347, 14971, 82889, 94847, 89480, 77449, 54636, 78803, 71867, 37532, 10633, -34467, -68252, -71167, 14410, 42180, 87834, 94560, 54719, 346, 25317, 69789, 35747, 11900, 30787, -10977, -57301, -59118, -20448, 66559, 133459, 123675, 75472, 18610, -8960, -22690, -68514, -46601, -884, 44073, 86973, 52206, 17877, 15352, 83510, 37215, -50381, -80668, -48722, -65243, -12968, 45295, 33137, 45643, 44034, -11861, 8669, 69849, 38771, -4215, -13481, 44645, 108945, 157715, 109751, 64860, 31077, 72357, 133984, 106509, 97870, -30332, -109156, -144249, -77058, 26854, 16519, 26183, 28056, 900, -22818, -12405, 27731]
23161B7731j879j231n0861l441K5855n120m3314K4032M2971J7127j3290J9466
23149C8046M1215K29J1727m6460M6733J5492l1540n1348N148K2620J2804J0130
23137G4796n7011j6280J3908j02677m3683L1659P3794K6395m3854p628P344O391
23125c6846K2858M1301P291m7996m2773j9204L0446k8203o9407M5340P3528m3402
23113f7067k1323N871M1951O7001j9511k4964K1587k558M3937M8426n621K2518
23101A10247M0282J6471j5187p3582k2097l59N0523k1346n3684p3368j2348K6769
23089b7679M9873J4619K3875k410k2719k014j875o4525L487k08P5701M0233M975
23076I1333o4504l7760l1482l1969P2491M2832k1106l5828Q5865K9057J2137j5735
$$ y = [27731, 25852, 24621, -26240, -29681, -3826, -8946, -52260, -28228, 14743, 31870, 18580, 38046, 79261, 79490, 91217, 44757, 91490, 106982, 75442, 24094, 29242, 51862, 64666, 74796, 17785, 1505, 15413, -87264, -130947, -99288, -25494, 901, -42953, -50581, -43237, -36846, -13988, 27313, 34604, -13392, -56165, -75369, -44923, -73126, -142533, -97193, -23665, -67067, -88390, -82519, -40568, 26433, 6922, -18042, 3545, 987, 44924, 93350, 87729, 110247, 150529, 167000, 151813, 78231, 56134, 55775, 106298, 84952, 31268, -42100, -54448, -27679, 22194, 36813, 60688, 58278, 35559, 33545, 31670, -32855, -29368, -29576, 46125, 86358, 91333, 26829, -10931, -42413, -74382, -1891, 40941, 19835, -15993, 69872, 98929, 111066, 95331]
23064I5331n7980J7126r343m8785J2379M9068q4851k9569K0611J00302O509m6115
23052B4683k8662J4006N1499L1080k9227o3258j9604J948K2898N0582j8086J0427
23040D8286L1323K3562j3465o7312m0696K330j1884n1354J3777j0473o626J9805
23028f2727k4097M3909Q2471K3533j7405l6840m8065j5495J4274L9975M2223r704
23016C2052p1677q1658J8906k5317Q8003R1253k1775k4980L0526q0100j8891m5941
23004a09599n1898R0322J5460M9327O5696j9243N382J8769n139j4358L3170j2918
22992F4971l2697j4770m5905J240K7977P694l3985K818L090P5686N1814o6157
22980D1776N859m754P638o7646j3155m47J6331k3443K146L8648L3973K2535n330
$$ y = [95331, 37351, 54477, 45134, -3651, 8728, 57796, -27055, -56624, -36013, 64289, 70798, 24683, -3979, 10027, 61526, 92606, 63379, 121, -19483, -17535, 5363, 55945, 37859, 48286, 79609, 103171, 89706, 22394, -18302, -15972, -27856, -79210, -65433, -75906, -82532, -62727, -86824, -42915, 39556, 63089, 45684, 8844, -39221, -54716, -40442, -467, 41756, 32052, -39625, -121283, -102377, -127694, -39691, 51562, 29787, 4807, 35333, -44767, -63658, -109599, -161497, -71175, -55715, -6388, 59308, 40065, 45447, 64216, 59077, 44719, 77889, 64971, 32274, 17504, -28401, -27161, 816, 8510, -25475, -22657, -19567, 56119, 107933, 41776, 47635, 42881, 50519, -17127, -30282, -30729, -14398, -37841, -35695, 2953, 36926, 59461, 54131]
22967E4131K6270k7248O395L9260o5544r0245m4593J8001J04497q211m3005K8707
22955a585Q281L5211R152m3268k8420K8414N0755J5773N768l303j4142l6897k3067
22942B672M6678L9568r6342j2689O3337N0241j4051k093l7691k5674R967K0810
22930D4733j5963m3754l5931j2218j112j5626m1860J3167P5364R851q9972l8374
22918a51695M0790L4897M0386M0161k0913P074l0934m9237O1740M3841o24n3278
22906c7792k2447k1742N6392Q2865J5792o5565r2136n4818L0532j9206L1806K5658
22894g0661M4524p654N0331N2925l686k2378k7898N6308M8207q815m4957n9521
22882F725n2710L1392l072L1132j9957K1360l1737m0848O5898N4098j7901l9991
$$ y = [54131, 80401, 53153, 59548, 98808, 33264, -56981, -101574, -83573, 20924, 12713, -30292, -1585, 6696, 41907, 51059, 7791, -20629, 7785, 58540, 74313, 80081, 76778, 62636, 25739, 2672, 49350, 88918, -7424, -20113, 43224, 93465, 79414, 77321, 39630, 13956, 23923, 44733, 28770, -14984, -50915, -63133, -64245, -79871, -121731, -108564, -33200, -23349, -113321, -151695, -110905, -76008, -35622, 4539, -16374, -9300, -40234, -89471, -27731, 16110, 15486, -37792, -60239, -81981, -25589, 57276, 73068, 7503, -84633, -139451, -108919, -128125, -96319, -70661, -26137, -33791, 16540, 69465, 65779, 43401, 15503, 71811, 120018, 111203, 66246, 6725, -45985, -14593, -17665, 13467, -6490, 14870, -16867, -57715, 8183, 62281, 44380, 4389]
22870D389L0880l2226J2599Q0405j5752o2083m8196N0934N9327n0480m6744L0803
22858A3856Q382j7936K0923K7099j7011p1191O6291K6312l2431n9169j3687K2312
22846b6250O1435J4057l1695k1432L8630k863L0521P0429r446o9671J4897l6886
22834C1726l2843l4213J2957M6440K5470m1184m0220j4565k0932k2608K9748K2123
22822c8101Q8238j6300M833m2030j0143j5922L2037M5759L4918N1835m8002M4111
22810A31233k4211r9057l6528j6809L1350j5492J1677K5347m2176k6608k8304
22799h9578O3234K2531l2819N7133Q75p9107j2081j0051N1259L9954n275j22243
22787a16168j4717M5745K5019N9629M2268Q291k2916k1661n337M4794n854J9747
$$ y = [4389, 35269, 3043, 15642, 96047, 80295, 18212, -29984, 20950, 80277, 29797, -16947, 13856, 22238, 4302, 25225, 52324, 35313, -35878, 30413, 56725, 24294, -34875, -48562, -26250, 35185, 49242, 17547, -3885, 34745, 31882, 62403, 132832, 123386, 53715, 68612, 31726, -1117, -35330, -22373, 24067, 49537, 8353, -31867, -46432, -67364, -89972, -60224, -38101, 50137, 33837, 38670, -3360, -13503, -29425, 2612, 48371, 83289, 135124, 87122, 131233, 107022, 7965, -28563, -45372, -14022, -29514, -17837, 7510, -34666, -61274, -89578, -26344, -3813, -36632, 20501, 21376, -57731, -69812, -79863, -28604, 11350, 6075, -116168, -130885, -85140, -60121, -492, 41776, 50067, 27151, 5490, 153, 44947, 39093, 58840]
22775E8840n4170K5567P416r917o4452l8851k4801o9249L8321O1040J10592O8958
22763A09294K6616k4147p0076k9781K389r896M6287m4773k4521m4084M1633N4202
22751C3143n0296k0439l034L177L3317l896k9248l1999Q3497Q3526o9917j5382
22739A2449N5883m7596j45835k1903O4642O4930j1595L4763O5642j5670J4686
22728G0396M1323O4991M3614o7058j24977m5491j0395o9194P1394R2609r695m7737
22716I780k5731k6407j0317L752N6507P5796R239o1334n35k7256k9191K8028p0019
22703f7688O0646L1543o0263p25n0235q886j1056J469j0137J2249P308M6116j5106
22690f4765K3957J3253J6426l9604M2148l7668o7443j0158P5852L5174L6931K138
$$ y = [58840, 4670, 30237, 37653, 27736, -36716, -75567, -100368, -169617, -131296, -70256, 40336, 109294, 135910, 111763, 41687, 11906, 14295, 4399, 50686, 5913, -18608, -62692, -21059, 33143, -17153, -37592, -40626, -37449, -4132, -8028, -37276, -69275, 14222, 97748, 27831, 12449, 68332, 20736, -125099, -147002, -82360, -17430, -29025, 5738, 71380, 55710, 70396, 111719, 176710, 220324, 153266, 28289, -17202, -27597, -96791, -25397, 67212, 57517, 9780, -15951, -42358, -52675, -48923, 7584, 83380, 92619, 31285, 30750, 3494, -25697, 2331, -67688, -7042, 24501, -35762, -36487, -86722, -95608, -106664, -105195, -115332, -103083, -95775, -49659, -64765, -40808, -27555, -11129, -50733, -8585, -46253, -113696, -123854, -48002, -12828, 24103, 26241]
22678B6241n187l729N6663R860o1035r713P461J7588k1984Q4904R045k9561n6154
22665B4399p9556j0021J0843m3404K0855R1487N0024M7665j04889l7324j3259
22654d3180k5143j8759K4168N1534K1183J6283k0170l4233L9748K0546m3055o6858
22642g7936K4882m411j5719P4474L2457l2657l8877o2657L7968J5818J8168L7933
22630I443L1557M3578k1682J9969P834K262n2704L059j7802K4674M2251n1940
22618D0499o1617l5060J0446k991N175J9032L1914o646j6238k6551j2492Q5681
22606C1152Q7313M6667l4376l0346p3383m2861k0635M4914J0915k5238r342Q237
22594f983p344O0657m7083j7187k4946L5420J9030J9302O0054m9605j2574l6853
$$ y = [26241, 21054, 17325, 73988, 83848, 22813, 13100, 20561, 38149, 16165, 101069, 110114, 80553, 24399, -55157, -65178, -54335, -97739, -76884, 14603, 64627, 112292, 7403, -29921, -43180, -68323, -87082, -62914, -11380, 9803, 26086, 5916, -28317, 11431, 31977, -11078, -77936, -53054, -57465, -73184, 1290, 33747, 1090, -37787, -100444, -62476, -46658, -28490, 9443, 41000, 84578, 62896, 82865, 90699, 92961, 40257, 43316, 25514, 50188, 92439, 40499, -21118, -56178, -45732, -48723, -43548, -24516, 7398, 752, -15486, -42037, -54529, 31152, 118465, 165132, 130756, 100410, 27027, -15834, -36469, 8445, 19360, -5878, -15220, -6983, -14327, 46330, -753, -17940, -42886, -7466, 11564, 30866, 90920, 41315, 28741, -8112]
22582h112j7336n3282j1222K533J2027L1615m237K476M9552M0912K7317L9932
22570A12175l2798l3578K5449J75k3790N4181Q053j33764m9030K228N5179R402
22558f118k8804K4711l2131k3148N9102p8541j1344K3756O319L229K9891O4574
22546C1496N8789j8817o912J9631j9680k4200m0929n865k2138j0411m3431k2029
22534a04496R2541K0063j2560R198m0617l5778K2708J8402k8914j5282K341j3253
22522h5647M8034M7248p3656n8038l850m127m9969j665N7551L4104p110r174j74
22509a06473N0890K0925K716L986J2678P8676j3134n9867j5632k1879K4547J5331
22497g236j7015k680K516P132J1031k0640K979J8255J1954J3430o7089j5386L6255
$$ y = [-8112, -25448, -78730, -89952, -87419, -75392, -43777, -48014, -45538, 4014, 44926, 72243, 112175, 79377, 45799, 71248, 71423, 47633, 101814, 109867, -23897, -72927, -70699, -15520, -6118, -34922, -10211, -42342, -65490, -6388, -84929, -96273, -72517, -66198, -62969, -33078, 31496, 90285, 71468, 64556, 84187, 64507, 40307, -622, -6487, -28625, -39036, -82467, -104496, -11955, 8108, -4452, 4746, -35871, -71649, -48941, -30539, -59453, -74735, -72394, -85647, -37613, 9635, -64021, -122059, -125909, -130036, -180005, -181670, -124119, -90015, -97125, -106299, -106473, -55583, -34658, -31942, -27956, -15278, 63398, 50264, -9603, -25235, -47114, -22567, -7236, -24251, -26931, -24415, -17283, -6252, -26892, -23913, -5658, 6296, 19726, -47363, -62749, -26494]
22484b6494l7127p8140K2728O0702L379k346N6383L7639Q572m0447j7530k3476
22472c6157j7585O8772k2174l2740m3991l9589J1681M5383J103L7176K1843m328
22460a0606j8994o89K8381J0313L4291o510N882j4941J6018L8291p191k6667j2900
22447C4678J8167R0697p4139m8692M333J7211M056l8070J1208J5366q171M9121
22435G5765J4886j6348j6809l5643o9835k276L1826l1201j4597R60j3018l41p594
22422h4225j7845l262K6871n33N453K0604n3685k8089P900n22L253M6511M4765
22409c2804Q5486n605l9194J836L7977m1556j4455L1470k7890K9334j4626k7803
22397a7830M6918r265n0864J7009n0641j775J09543P0685M3238N3057k8070j02580
$$ y = [-26494, -63621, -141761, -119033, -58331, -54952, -57298, -915, 36724, 45296, 4849, -12681, -36157, -53742, 15030, -7144, -39884, -83875, -123464, -111783, -66400, -65297, -28121, -6278, -10606, -29600, -30289, -1908, 8405, 42696, 36186, 42068, 27127, 43145, 81436, 74245, 47578, 34678, 52845, 143542, 69403, 20711, 25044, 42255, 46311, 8241, 19449, 34815, 26644, 75765, 90651, 74303, 57494, 21851, -47984, -50260, -18434, -49635, -64232, -63272, -76290, -76631, -84225, -102070, -105332, -78461, -78994, -73541, -52937, -106622, -134711, -126811, -127333, -124080, -77569, -32804, 52682, 47077, 7883, 9719, 47696, 6140, -8315, 23155, -4735, 24599, 9973, -17830, 29088, 19823, -31041, -14032, -64673, -66448, 43095, 113780, 157018, 210075, 182005, 79425]
22385G9425q3892m2660m2063N171J2830K1088m2244M6639K136q140k0449K762
22373f9397J8195K4191j1808N1401O6594j0226J4536p6481p6278l2631K5425O4762
22361a1717L6523K0893J2443k7415l8151K1899J6424R498m601r328N3138K8744
22349A08350j5160n2238q4567p5842k2506L6634J30898M3152j5889L195k5024
22338C1003J0598j7627k0250O2603N0286Q590k6450j4056J0085J3590l3196n5808
22326A9368j19855p4061M9126P0457M5897p446L2462Q306K634L3406L488r2735
22314b8953k7226N5482j141j1215n7190m4868Q6306O9114r867k5555k3816j4785
22302c3714K108P814J5022K6794P723L1101N5264o5997j01376K4009N4603J7214
$$ y = [79425, -4467, -47127, -89190, -84019, -71189, -50101, -92345, -45706, -43570, -51710, -72159, -69397, -51202, -27011, -38819, 12582, 79176, 68950, 83486, 7005, -69273, -101904, -76479, -11717, 24806, 45699, 58142, 30727, -7424, 14475, 30899, 40397, 35796, 26468, 79606, 108350, 93190, 40952, -43615, -119457, -141963, -105329, 25569, 68721, 52832, 56027, 31003, 41601, 23974, 3724, 66327, 116613, 125203, 98753, 84697, 94782, 108372, 75176, 19368, -100487, -174548, -125422, -54965, -9068, -16514, 15948, 24254, 26888, 60294, 63782, -28953, -56179, -697, -1838, -13053, -70243, -115111, -28805, 40309, 30442, 4887, -18929, -33714, -31606, -23792, -8770, 18024, 25747, 56848, 112112, 46115, -55261, -31252, 23351, 40565]
22290D0565j8980J9438L3683l3426l9072M3716m6696l9880j3783R810l5556M1844
22278c8337J5232O16k483j1279k001k4763O579M7837L878K2674J235j0099J0696
22265A9785l2598l2678j8635j2952j2724k4848J4117Q2801N5741K5520q4232m0637
22253f1340J2096O5219j2227o3299j3426P265p565L423O6471Q856k6185J8927
22241a785J0029R268n875L882Q998j6383O079l1963o9054P656k2982k299K3955
22228h0474N8227J6417K1410j4285j1384Q180M207O1387J6965K5884o0262k4334
22216B1938m2017N1956L9605J2922m3583m2854l9704n717J4503J02046K3132q1279
22204A0948q0149P4345l246L2393J3609m6470R69M854P718j0587j6794J3242N798
$$ y = [40565, 21585, 41023, 74706, 41280, 2208, 45924, -772, -40652, -54435, -44625, -80181, -38337, -23105, -22489, -24972, -36251, -38252, -63015, -56436, -8599, -4721, 17953, 19188, 9089, 19785, -12813, -45491, -64126, -77078, -89802, -114650, -100533, -17732, 38009, 63529, -20703, -61340, -49244, 15975, 3748, -59551, -72977, -65712, -73277, -69854, -3383, 5473, -20712, -1785, 8244, 17512, 11637, 15519, 24517, 8134, 14213, -17750, -86804, -79148, -102130, -104429, -80474, -22247, -5830, 15580, 1295, -10089, -1909, 2298, 63685, 80650, 106534, 46272, 21938, -20079, 31877, 71482, 84404, 40821, -2033, -41737, -47454, -32951, 69095, 92227, 10948, -69201, 5144, 1898, 34291, 47900, 1430, 2399, 7253, 14971, 4384, -12410, 832, 6630]
22191F630J1397j0588l065N3061L944K4090N0476j04472j05686K4065m8859m6103
22179a45110n4276L2229L4584N1083J037K8189N0733O0111M8201m6726j04323
22168d4268j1753j7540q898N4371J2255l4194j6018K8960j846k1115q191K8742
22156c9495J3199P1862J4199k7952l55m6356l4713P783L1543l671P0483L1721
22144H8248k1436n9685n3068o7535J1378J9010k1496J6531L5676j757k5211J1755
22132f7590k1419L5025O3458j0770j296p2847k2512K7968J7232M6297L1164j5891
22120H819p0948m2828l0825R126L6424L5388J7536j2843L773O883j3207Q01k4001
22107g5902m9191L4502N6338P6389O8369J3488p1066k9390j3787l8854M3883N8538
$$ y = [6630, 18027, 7439, 4374, 57435, 61379, 85469, 135945, 31473, -74213, -50148, -99007, -145110, -199386, -167157, -132573, -81490, -80453, -52264, -1531, 58580, 106781, 60055, -44268, -56021, -73561, -82459, -28088, -15833, -50027, -66045, -37085, -38931, -60046, -68237, -39495, -26296, 45566, 59765, 31813, 31458, -14898, -49611, -41828, -10285, -13956, 56527, 88248, 66812, 7127, -45941, -113476, -102098, -83088, -104584, -88053, -52377, -54134, -79345, -67590, -89009, -53984, 9474, -1296, -2592, -75439, -97951, -69983, -52751, -6454, 24710, 8819, -62129, -104957, -135782, -126656, -90232, -54844, -37308, -50151, -46378, -39495, -52702, -51901, -75902, -125093, -90591, -34253, 42136, 110505, 123993, 52927, 23537, 9750, -29104, 14779, 73317]
22095G3317o0692l1493L2803L450K9638n1482l7906O994L2763k0809Q254j9392
22083c4555k1084j2559M3042n2063M0637k831k5702O4328M1080l4951k6566q480
22071b9704k0621m8508n023O6938N2296L3341n4368j365K176j4219J7777M0674
22059C9394J3264L3728p2224o7419j8363o1964N3957K5812K0575O296K661L1287
22047G004J1888k4237j3001R116J2872l0415m1364K0186M0809P2192j8250k6092
22035B0708j5816k9324m2753l1540K3881Q103J2955q303J6457j0782j5049O5190
22023f273K5855K3242R7727k9508R657k9635j8994k5175n5301p0538j2184K2468
22011f8659J0025L122k2682J3797K5151K5728m68j6430k0139J0528m4594m8494
$$ y = [73317, 12625, -18868, 13935, 17385, 47023, -4459, -42365, -35371, -2608, -23417, -15163, -34555, -55639, -68198, -25156, -77219, -36582, -39413, -65115, -787, 40293, 5342, -21224, -29704, -50325, -98833, -103856, -36918, 15378, 48719, -5649, -7014, -4838, -19057, -1280, 39394, 52658, 86386, 14162, -53257, -71620, -133584, -79627, -53815, -33240, -26944, -24283, 7004, 18892, -5345, -18346, -9230, 3642, -26773, -68137, -47951, -7142, 65050, 46800, 20708, 4892, -24432, -67185, -98725, -74844, -66741, -53786, -62089, -45632, -56414, -71463, -6273, 19582, 42824, 140551, 111043, 120700, 91065, 72071, 46896, -8405, -78943, -91127, -68659, -58634, -55512, -78194, -64397, -39246, -13518, -13986, -30416, -50555, -40027, -84621, -133115]
21999a33115K680J4591Q0379N5606r387J4031k6349n9871l3071j7849M3805k501
21987g1051M676L6236j8258k6351M5759O7566N1044j5165K92J8421l8416j2690
21975D2063J973k7347j4588k1976l0922K018n754k3126l629o956L3642k852K0254
21962c7200Q8669N3046k4930p8267m0498J287M1212q322P470j9191n4575q8837
21950a60136N4274J4474k7693N8043Q242j6650j7510J8545Q454M0861P8633L6829
21938I6366m5859j7842j5410l923J4956L2432n2423j4843k3766R227N4907O8460
21926A02282r8099q8573K6420L2861k950k7411O429O0713L4353O8426J0512j01301
21914B3662p8314k5389R314N5123O9430Q665j7878j5412R590k5929P717J0792
$$ y = [-133115, -130435, -115844, -35465, 20141, 10754, 24785, -1564, -61435, -94506, -112355, -68550, -71051, -66375, -30139, -48397, -74748, -28989, 38577, 89621, 74456, 74748, 93169, 54753, 42063, 44036, 16689, 2101, -19875, -50797, -48779, -54533, -77659, -81288, -88244, -54602, -57454, -37200, 51469, 104515, 79585, 1318, -39180, -37893, 3319, -5003, 2467, -16724, -71299, -160136, -105862, -91388, -119081, -61038, -52796, -69446, -86956, -68411, -59957, -19096, 59537, 96366, 50507, 32665, 17255, 13332, 28288, 60720, 8297, -6546, -30312, -21085, 33822, 102282, 4183, -84390, -57970, -25109, -28059, -55470, -49041, 11672, 46025, 114451, 124963, 23662, -54652, -80041, -70727, -15604, 53826, 62491, 44613, 29201, 38791, 12862, 20579, 31371]
21902C1371L5072o298j0246m6410p4934n161P9002O5698K453l7195l8760m2698
21890d8106j1159L6184M6290o1665j6419J167m6566k2758J8411N3760j5086k010
21878f7957k5300M8210J2896L5927O4383k1378o7137m0969J1732k8274N6772M1697
21866B0602O4484K8955J5266m9301l5680L5806k2857K2227j7917l9370m662m5162
21854b7609l0893n6007L9633L463M4710N0056j3642p9477j276M3415n076K2471
21842a0232J8685k469m020J02313M3653q2905q5486K0917J0194l143M9093r764
21830D6836m7272r458j9686K9916J3575j5610l5234j2972O4237K0967L0887M5247
21818A11433O0930n201o0155j16866q6829L3712L2559l3141M3969M2622m0596
$$ y = [31371, 66443, 60145, 49899, 3489, -71445, -76606, 2396, 68094, 70547, 33352, -5408, -48106, -59265, -23081, 23209, -38456, -54875, -53708, -100274, -123032, -104621, -50861, -65947, -67957, -93257, -45047, -32151, 3776, 68159, 46781, -20356, -61325, -49593, -77867, -21095, 20602, 85086, 114041, 129307, 80006, 44326, 80132, 57275, 79502, 61585, 22215, 17553, -27609, -58502, -114509, -74876, -71413, -26703, 23353, 9711, -69766, -71042, -27627, -32703, -10232, 8453, 5984, 1964, 104277, 147930, 65025, -20461, 456, 10650, 7507, 56600, 46836, -436, -9894, -29580, 336, 13911, -1699, -36933, -49905, 14332, 35299, 66186, 111433, 172363, 167162, 107007, -9859, -96688, -62976, -30417, -63558, -19589, 23033, -17563]
21807a7563q4618q4846K384M9114Q2305K9558L906L0558J8605q1572m5177R461
21795h7885L1342O99j480J1740K5553l5213j1074J3272R542N7831L7522q8986
21783c7137L9516R0613j7697q456k7991n0983M772M902J6859r735l9448O1113
21771B6328j6148m7436k8127r063L5693k261K1740O6689m1754o1875j4968n896
21759g7078K6073N0588N9904J0624n9650q8825Q225M1476q146R6891P5637j3563
21747A22156q0485K1753l4654l4903n7976o9369J14641J59848j3408q9114p7899
21736c9410N659O8307r290n4967l4142J6855L5843j832J1248j4869p9896p6685
21724a73179N4836N7879k5412K421M7831L8718Q483J5011J1401m2903m2866j4293
$$ y = [-17563, -102181, -187027, -184643, -135529, -53224, -23666, -19760, 10798, 29403, -52169, -97346, -87885, -56543, -55844, -57324, -45584, -20031, -55244, -66318, -53046, -43504, 14327, 51849, -37137, 2379, 92992, 75295, 66839, 38848, -12135, -7363, -2461, 14398, 4663, -34785, 26328, 10180, -37256, -65383, -74446, -38753, -41014, -19274, 47415, 5661, -56214, -71182, -77078, -51005, -417, 59487, 70111, 10461, -78364, -70139, -28663, -36809, 60082, 135719, 122156, 41671, 63424, 28770, -6133, -64109, -133478, -18837, 141011, 127603, 38489, -39410, -33751, 34556, 25266, -29701, -63843, -46988, -11145, -12977, -1729, -16598, -96494, -173179, -118343, -60464, -85876, -83455, -35624, 3094, 11577, 26588, 37989, -4914, -47780, -62073]
21712f2073M0019k7378M1311k6793j3602P621O2007k8392j6550O4237K0751P937
21700F9095l1659k4781l9914P804l7168k2661m1154r4634K4943J52605L4353O6654
21688F3483j7200j04853k4480J2757j4967j3662K2084J14530k872q0249k3818
21677f9247L088k3700K819M7221Q0714L8204j4164l4791r3699l8349M3286l6037
21665i4655M0659J5426k6427j4165K1131L545j1044O1633J1784L847L7589j9629
21653B9694l2456p6586n0990k628O9769L493m3443K7122L4879K2344O5846K4731
21641G1775j1092M1342o371m6464l20j4849j6401k0295l3777j6578q31L1893O291
21628a5677l7931L241m7404M92K8331J20l3376o672M2051J4782J9965k453J9564
$$ y = [-62073, -22054, -49432, -8121, -34914, -48516, -40895, 21112, -7280, -23830, 40407, 61158, 69095, 37436, 12655, -27259, -19455, -56623, -79284, -120438, -215072, -190129, -37524, -3171, 63483, 46283, -58570, -83050, -70293, -85260, -98922, -76838, 37692, 34820, -45429, -69247, -66159, -89859, -87040, -39819, 40895, 79099, 64935, 30144, -63555, -101904, -58618, -94655, -53996, -38570, -64997, -79162, -58031, -54486, -65530, -3897, 7887, 11734, 49323, 29694, -2762, -79348, -130338, -132966, -63197, -59704, -103147, -76025, -41146, -18802, 47044, 71775, 60683, 102025, 95654, 49190, 48870, 34021, 17620, -2675, -36452, -53030, -53861, -21968, -15677, -53608, -50367, -97771, -97279, -68948, -68828, -102204, -108876, -66825, -52043, -32078, -34531, -14967]
21615a4967j9661K5520O0777k1415q601l6043l2747m8389J3308N0651r704n5520
21603i6791k3777O0287K5994K7635K0961q658k8722N9035J6055k2472m031M990
21591C0506m0055k6557M9527K3257N152n5780L55j0483P0610Q3447j8286j4362
21579I7331l179m9660j5956L3173M8955O927o0556L7397M6198M2849m9932p6156
21567E7391k6268k3962O0029M3376n0858r3724l4509N8232Q1281K3958K5008n8992
21555F0962o1099m2763p698P0732P819m5441M4235j2016J9317j7866o4713j7716
21543f6247M4838M2425o6801K3237Q1322O783Q57k2927l9766K7482K1316L8821
21531I1340q1364k4983l8656j0604j0544p113R0968m6085m4194J7127J07296M5116
$$ y = [-14967, -34628, -9108, 51669, 30254, 21653, -14390, -47137, -95526, -82218, -31567, -41271, -96791, -120568, -60281, -34287, -6652, 14309, 5651, -23071, 35964, 52019, 29547, 25516, 30506, -9549, -36106, 13421, 36678, 41830, -13950, -13595, -24078, 46532, 129979, 111693, 97331, 94152, 44492, 28536, 61709, 110664, 117591, 57035, 94432, 140630, 183479, 133547, 57391, 31123, 7161, 67190, 110566, 59708, -34016, -68525, -10293, 70988, 94946, 119954, 60962, -137, -42900, -50598, 20134, 27953, -17488, 26747, 14731, 34048, 16182, -48531, -66247, -21409, 21016, -45785, -22548, 58774, 65557, 66414, 43487, 3721, 31203, 52519, 91340, 9976, -15007, -53663, -64267, -74811, -81924, 9044, -37041, -81235, -64108, 43188, 88304]
21519H8304j1978k2063m9053Q70k2766L6203J3557J9293M8862N516l6647q0990
21507a0892k7026O609R234J8728J4764J4138k9839l0692o1756K7314N3166n00
21495a6752L3824n788M466K0373m1958N570p96m3911k4533j8183P9926K4593J6150
21482C2981k3005L6923j7662k9919k7600k4262K634M9952J2566m3756M6602P2117
21470H7571M046l011k8548K7592M3352m218q6857m2108J637l9920k5087m235j3138
21457h2924Q569O5097M7692l4368J7452l4234j7968J4127J3110J9781J4331k346
21445B8319r852k5123K6903l076l1393l3872K0281J3688l1214k5801J2032O628
21433e2480J7362K2550k8982Q436N3457k8221o4502p135L8775R6917J9257o6043
$$ y = [88304, 76326, 54263, 5210, 6080, -16686, 19517, 33074, 52367, 101229, 106745, 70098, -10892, -37918, -31309, -22075, -3347, 11417, 25555, -4284, -34976, -96732, -69418, -16252, -16752, 17072, 11284, 15750, 36123, -5835, -265, -1061, -44972, -69505, -87688, -7762, 16831, 32981, 9976, 46899, 29237, -682, -28282, -52544, -49910, 42, 12608, -31148, 15454, 87571, 91617, 88606, 60058, 87650, 131002, 126784, 39927, -2181, -544, -40464, -65551, -69786, -82924, -74355, -9258, 38434, 4066, 21518, -12716, -30684, -16557, -3447, 16334, 30665, 28319, 18467, -6656, 20247, 17171, -14222, -48094, -27813, -14125, -45339, -71140, -59108, -52480, -35118, -12568, -41550, -33114, 20343, -7878, -72380, -79515, -40740, 56177, 75434, 9391]
21421I391o3917j4268m484N4631J9551m0243K6561K9905J4120K1046n5124J0374
21409G543m0902j04689L0794M1600N9208J6871N679L6039k8633R397m2651r7730
21397a07474m8256M0328N3706L5443J8896j895N0987L9814m0806k4580M969j6438
21385D694k6035K4478K4338K1757L2648N057R59Q5988k4354q6338l6349K9244
21373E6087l2237K0566l5054o1295jJ8175M9709j8399p5452L9419K6270K6060
21361A3848N232j070n6307n0384R206M72n7022N6832L8407n4517M3966J5065K0311
21348a5961n5004m8803j6800P3328M8047j0498k1971m8800J6634P7937L9255J9471
21336E6835l4867r2056k5943L060R811L2364p2175r9903O4122J01613P8794j5269
$$ y = [9391, -54526, -68794, -73278, -18647, 904, -39339, -12778, 17127, 31247, 52293, -2831, 7543, -33359, -138048, -107254, -65654, -6446, 10425, 16104, 52143, 23510, 32907, -9744, -107474, -155730, -115402, -61696, -26253, -7357, -9252, 41735, 81549, 40743, 16163, 21132, 4694, -21341, 3137, 27475, 49232, 81880, 86937, 87896, 173884, 149530, 63192, 26843, 56087, 23850, 44416, 9362, -51933, -51934, -33759, 15950, -2449, -77901, -38482, -12212, 13848, 19080, 18010, -38297, -88681, -79475, -79003, -136025, -79193, -40786, -95303, -51337, -36272, -15961, -70965, -119768, -136568, -63240, -15193, -25691, -47662, -96462, -79828, -1891, 37364, 56835, 21968, -70088, -96031, -92971, -83160, -50796, -122971, -222874, -158752, -57139, 21655, 6386]
21324F386J855m3803L426K1846L7864o2402l7679j0230M4069J0956k013K2368
21312g357K10j949J693L0054l9655o9547L567J24843L6541p3907l6892M4285k4239
21299a2353J5081K1636N4256q974m1304q6032j5880K65P7924J9315n5387j04517
21287a35970L5361N6474K4176J5489L5035r139m8475l9369k5914N5515O8833J0945
21275D2961l216n3654k4749J6039J7229N3699k1097m7746n6086l245P3339J02834
21263I6308N634k4148l0850n1193M4539o842n6711q688K8519k3359P6386k050
21251D7545J282q4605J696L5256j1479n2574K0446M4678M6998Q314J1868m8482
21239B0943r512l2437m5836J0655k2045j4648k2270K94K7153M0927K2169R345
$$ y = [6386, 8241, -35562, -32136, -10290, 27574, -34828, -72507, -82737, -38668, -27712, -29725, -7357, -7147, -9096, -7403, 22651, -17004, -86551, -82984, 41859, 78400, 4493, -32399, 11886, -12353, 2728, 24364, 78620, 69646, 28342, -57690, -73570, -73305, 4619, 23934, -31453, -135970, -100609, -44135, -19959, -4470, 30565, 21426, -27049, -66418, -92332, -36817, 32016, 42961, 39745, -13909, -38658, -22619, -5390, 48309, 27212, -20534, -76620, -79865, -6526, 96308, 101942, 77794, 46944, -4249, 40290, 33448, -23263, -31951, -3432, -26791, 49595, 47545, 48827, -35778, -34082, 1174, -10305, -62879, -42433, 2245, 49243, 57557, 69425, 20943, 11431, -21006, -66842, -56187, -78232, -92880, -115150, -114856, -87703, -46776, -24607, -15262]
21227a5262l2461K8293k6570o1530p7900j4918R5685O7490M2850O2982J00987
21216A69646n9801r5385K8875j2167m4949J4241P8039k7279j40858L4586O5425
21205A0373M8888n09k4200k6679J8919j8332M4640R8500k1912j4130J6080J1099
21193A42737l8473l6356q4741j0903P003J1351J04131N891o1666Q627p5520o84
21181b8603r389k7799L8448Q921R9246l8982m4575k1328M2957m5056k9893K1264
21169c4789J3682N9730K9280j0954l0261l9297Q226J0387J1400L6960m142J8178
21157F8400p1094n2399O146O5396L794p3069K0592J048J395O7241L9382j691l5204
21144C9937R207O570j5402O2094r165J9237o1016k1123N6564j3957n6345M6116
$$ y = [-15262, -47723, -19430, -46000, -107530, -185430, -200348, -104663, -37173, 5677, 68659, 169646, 109845, 14460, 43335, 31168, -13781, 460, 78499, 51220, -89638, -55052, 10373, 59261, 58752, 34552, 7873, 26792, 8460, 53100, 151600, 129688, 115558, 131638, 142737, 104264, 67908, -16833, -27736, -20733, -9382, 94749, 100640, 38974, 47601, -27919, -28603, -37992, -65791, -27343, -18422, 80824, 41842, -2733, -24061, 18896, -26160, -56053, -34789, -21107, 38623, 67903, 56949, 26688, -12609, -4383, 6004, 17404, 54364, 50222, 68400, -2694, -55093, -48947, 16449, 20243, -52826, -32234, -31186, -29791, 37450, 76832, 75141, 39937, 49144, 55714, 40312, 102406, 93241, 112478, 51462, 30339, 86903, 72946, 16601, 62717]
21132F2717O3017j05999j05239l0621j967N9901L7541J2867l0332l5832k7696
21121a01643m533M5442M1779K460O8346K0813k5020j6873J4972o7637m8631M2070
21109b8455J7392n911N3997J6929m7143L7226M1301l5696o5699l9371M2965M241
21097h224N3713o2469j9788J3397M3071K2848o0557j2708k1748L6366K7841K298
21085A4040K5845M1599N5450j6155k214k2895o7970k8967k2255J0018Q5210Q1727
21073A53433n2651n0601o7028m9337j0907R566R378J2767M0508L3022l2731m6551
21061e1132k9868K7412M0960J9158M9241N6981M4269k8659o1184K7499j2475K7172
21049A09374k4077m4740n8835m8088M7313L3804N9826K0325l4739p3250l9936
$$ y = [62717, 125734, 19735, -85504, -116125, -118092, -58191, -20650, -7783, -38115, -73947, -101643, -106176, -60734, -18955, -16495, 51851, 72664, 47644, 30771, 45743, -21894, -70525, -28455, -11063, -16974, 37023, 53952, 6809, 44035, 85336, 49640, -16059, -55430, -12465, -8224, 45489, -16980, -36768, -23371, 19700, 42548, -18009, -30717, -52465, -16099, 11742, 14040, 39885, 81484, 136934, 120779, 118565, 95670, 27700, -1267, -23522, -13504, 71706, 153433, 100782, 50181, -16847, -66184, -77091, -67525, -58147, -45380, -4872, 28150, -4581, -51132, -81000, -53588, -12628, 6530, 55771, 112752, 157021, 128362, 67178, 94677, 82202, 109374, 85297, 40557, -18278, -66366, -19053, 14751, 74577, 94902, 60163, -13087, -53023]
21038e3023J0689j185P488J59M3610l5487k9293J3028L7000K5409L2346L4232
21026H4973K1236l448L2104M0503k141l2969n2925j1815j884q743J0959k3367
21014E2483l5374L7047O763m9317n2989J4853M746J8182j6542j490Q963j9599
21002c2274L982l3795k5985n3089P8359M9117J2887L1314l352M611l9212l7755
20990d5192N7221K4221o0004j5386K1373J2036L2489J4014l654n3108m5349j6169
20978g7508O6993J8994o508j0410l2913K7819K511l6121n0231k8173M4137L6416
20966d4994j6378K1133j2590M557O5043O9922m4342k080q1010n4811n93J17182
20954B1039M0666m1445J5431K1751l7036n5797l0375N7488L3649n037l3802l5191
$$ y = [-53023, -42334, -43519, -36031, -35872, 7738, -27749, -57042, -44014, -7014, 18395, 50741, 84973, 106209, 102761, 134865, 175368, 173227, 140258, 87333, 75518, 73634, 64891, 75850, 52483, 17109, 54156, 60919, 11602, -41387, -26534, -21788, -3606, -20148, -21638, -12675, -32274, -28292, -62087, -88072, -141161, -62802, -13685, -798, 30516, 27164, 31775, -7437, -45192, 12029, 36250, -23754, -39140, -17767, -5731, 26758, 40772, 37118, -15990, -61339, -77508, -10515, 8479, 1971, -8439, -41352, -13533, -11022, -47143, -97374, -125547, -81410, -44994, -61372, -40239, -52829, -48272, 16771, 86693, 42351, 40271, -40739, -95550, -96143, 21039, 61705, 20260, 35691, 57442, 20406, -35391, -65766, -8278, 25371, 20334, -13468, -48659]
20942d8659k6326j8010k2061j1834R1007K1353l2957j751k8486J9329l1695L3124
20930e6966K1388K2741N3066J2588Jl2604J468n2971L3624j4249j9455k1245p2145
20917a24759L8815P6076M6172J5524l5216K3038j02062l5812P7450J16755M806
20906A00787n9477n1621M193J2423L9153k6892p3461N2420L2564n2242o1923k1504
20894a05580K9758k5737k6743O0164Q3682O394M2371L0392m0680l8916k4096l632
20882a2623o557K034j0958M803l465K8205N1652m2687j1073p51k9199O043J0378
20869a4198k3906k398p527o7863P369N7236M1519K3948k886L5735K5818q460m6065
20856A8322n2861j05183n11J3757q361K3226j9217M3453O9923k1793j2952j8178
$$ y = [-48659, -74985, -92995, -115056, -126890, -35883, -14530, -47487, -49238, -77724, -58395, -90090, -56966, -35578, -12837, 40229, 52817, 52818, 20214, 21682, -31289, 2335, -11914, -31369, -52614, -124759, -85944, -9868, 36304, 51828, 16612, 39650, -62412, -98224, -20774, 95981, 100787, 41310, -10311, -6118, 6305, 45458, 18566, -54895, -2475, 30089, -22153, -84076, -105580, -75822, -101559, -128302, -68138, 15544, 21938, 64309, 94701, 54021, 15105, -8991, -12623, -19180, -17146, -28104, -23301, -26766, 1439, 53091, 10404, -669, -1420, -30619, -24576, -14198, -38104, -40502, -48029, -115892, -108523, -51287, -9768, 14180, 11294, 47029, 72847, 64387, 18322, -34539, -139722, -140233, -126476, -134837, -111611, -130828, -87375, -17452, -39245, -52197, -70375]
20844g0375M2091k3126J8221M9209M2431n3807j7751J9472l2170n08j6144j7657
20832f0114L886J5274L125O0465r243m912n2317m6187k7976O6006n876p6542m0995
20819a75406l929K6379k2205j3698M1172O5881P119J8137q636l5121m3939K9353
20807a14893M9421J2402m5399L4830R2269P9987j2708m6598j5831J4125J8265
20796F5870k2237M2607M2290k6486l5547m6716q801L9031j3266p475l0001K6495
20784B5764Q2929j7006N323r6608j00256M7087O6488L2954J202M0271L2789j03644
20772A7293o565N2098K2052m1578o4148K8337M8341m3908j14591m7008K5100M4067
20760h0510J672R6461J7163k8400k8360M6836K8448o1147q5119r930O0607J05391
$$ y = [-70375, -28284, -51410, -33189, 16020, 58451, 4644, -13107, 6365, -25805, -26313, -42457, -60114, -56228, -40954, -37829, 22636, 13393, 8481, -43836, -90023, -117999, -51993, -57869, -134411, -175406, -179335, -152956, -175161, -188859, -147687, -81806, -74687, -56550, -65186, -100307, -144246, -114893, -65472, -53070, -98469, -63639, 28630, 108617, 95909, 49311, 33480, 47605, 65870, 43633, 86240, 128530, 102044, 66497, 19781, 10980, 50011, 36745, 29270, -731, 25764, 108693, 91687, 97010, 402, -99854, -52767, 13721, 46675, 47877, 88148, 120937, 17293, 10728, 62826, 84878, 43300, -20848, 7489, 55830, 11922, -102669, -149677, -124577, -80510, -78838, 17623, 34786, 6386, -21974, 24862, 53310, -7837, -92956, -102886, -42279, 63112]
20748F3112J0700q5438j4797k8647M7111k9476j80j8011K121J6395M0630J1314
20736A4834l500m6464m8619j2164J6936K3126P6521o3340m5716m6754m0529P5992
20724i9677P6887l0608j1322j3649m043M414O5475K4758K2049K3314j0076L0692
20712G8214q509J2063j517J0430J3214L472n9999j0503J4357n0857K4812L0882
20700E6059j6986L4220l1520p3736j8357L8838M037O935N3599J605k2289n4198
20688b1793O085O4075O8671r4574n6622n2737O9112R7764K3315j2879l1140K6164
20676H5441k3407o2647r0174l8076K687N2585K3114k5736k9362q926R4173K2617
20664B289N6189j547k2423P775j3304j1874l1174n3174l1781J392J7497K9238
$$ y = [63112, 73812, -11626, -26423, -55070, -7959, -37435, -37615, -55626, -53505, -37110, 3520, 14834, 11334, -35130, -83749, -95913, -78977, -55851, 20670, -42670, -88386, -135140, -175669, -99677, -22790, -53398, -64720, -78369, -82412, -77998, -12523, 12235, 34284, 57598, 47522, 78214, 69705, 81768, 80251, 90681, 103895, 107367, 47368, 36865, 51222, 365, 25177, 56059, 39073, 73293, 41773, -31963, -50320, -11482, -7445, -510, 53089, 54694, 32405, -21793, -15708, 48367, 117038, 22464, -34158, -86895, -17783, 79981, 103296, 90417, 59277, 85441, 62034, -613, -90787, -128863, -126176, -73591, -50477, -76213, -105575, -114501, -20328, 2289, 58478, 56931, 34508, 42283, 28979, 17105, -14069, -67243, -99024, -97632, -80135, -50897]
20652e0897j0500M4835r122k5706l2252q687O6152J8930J8415j391j1257N343
20640C863p6058p7759L5405J7108K8442Q7657K8186k1908l1092J6159l888J8876
20628B4991j1382L3917o683l0936l5788K6994K7228Q63j4857J5566l1685m8476
20616e0248Q826k2962l2326n714L8847J63941M8059n9127m0977M0788m5686M989
20604D8410j7742o845L7724l056k6367m5480l3466k7544L8094M8700j2425K0117
20592B0120j5582J2724M7469k3118k8607m1692o5794q592K7365J2927N7091O5127
20580E9438j2514n2055o8649l1802M6737N6604K4653J1326K150l4670k2875Q281
20568a3376P8433l2977k3777M4144K139N335J578j4441q4038m3443O973M5150
$$ y = [-50897, -61397, -16562, -25684, -51390, -83642, -92329, -26177, -7247, 11168, 9777, -1480, 3863, -72195, -149954, -114549, -97441, -68999, 18658, 46844, 24936, -6156, 10003, 6115, 24991, 13609, 47526, 40843, 9907, -25881, 1113, 28341, 29204, 14347, 29913, -1772, -50248, -41422, -64384, -96710, -102424, -63577, 100364, 148423, 89296, 48319, 89107, 43421, 48410, 30668, 23823, 61547, 58491, 32124, -13356, -46822, -74366, -36272, 12428, 3, 20120, 4538, 17262, 64731, 41613, 13006, -28686, -94480, -103072, -75707, -62780, -5689, 59438, 46924, -5131, -73780, -105582, -58845, -2241, 22412, 33738, 35888, 1218, -21657, -13376, 65057, 32080, 8303, 52447, 54586, 59921, 61499, 47058, -36980, -80423, -73450, -28300]
20556b8300q537m197K461K7515L6599l5264n2174L343J15923Q983n3308l9975
20544b6931j6139j1783K8016L9982M151r410q362M1877j4025J7011j9250k5591
20532d54R266J0121k5797J8227l9621m3684j5170M0518N8197O6764L0437n3907
20520E4897m5753J7481n2330J6512N8113k107m8303K2210P5176K6880k8763m0668
20508E3345n3893j8110O7661L0301L2399j1252o8429m5100R657L3980k69k3779
20496F511p8328P6899M9233j3194n7783k1328n3M9952P4230n631k3496m295p6083
20483b3366J0973n368L9830Q1600K1641m4892n7553m003P99j1467L0066Q2296
20471A20556k5487o5105J2494M987n9639J5232m4938j3781M0766L9322l8912l6541
$$ y = [-28300, -36837, -41034, -38573, -11058, 25541, -9723, -61897, -58554, 57369, 66352, 13044, -26931, -43070, -54853, -26837, 13145, 17296, 7886, -476, 41401, 27376, 44387, 25137, -454, 8812, 18933, -6864, 11363, -28258, -71942, -87112, -46594, 11603, 78367, 108804, 54897, 9144, 26625, -25705, -9193, 48920, 46813, -1490, 20720, 95896, 122776, 94013, 53345, -548, -18658, 49003, 79304, 111703, 100451, 32022, -13078, -3421, 30559, 30290, 6511, -71817, 5082, 54315, 41121, -16662, -37990, -38043, 11909, 86139, 80508, 57012, 52717, -23366, -12393, -17761, 22069, 103669, 125310, 80418, 22865, 18862, 19661, 8194, 38260, 120556, 95069, 29964, 42458, 47445, -12194, 3038, -41900, -55681, -14915, 24407, -14505, -51046]
20459e1046K3707J5732o4j7867l091N6301q078K0781Q2359o4394j22474J2751
20447e5383K5743k1025K1837J614j1612l4928r8730J3693J3235l0847O208J25362
20435d4833O3506K1543m485n658j3159n3956n6438K0789L0362j1022K5408N0787
20423B2844m762N626J7210l588M1244l3467p5602k8306J9352o8914R669M0684
20411e8010K3129J8904n4137K8466L1657J3576l9058R720K6625J5749J0590q958
20399A8253n1026Q5645P3485o3357k4807k0130l8630N1311K0223k6574r375o0253
20387d5235N6999N3841K8285j5096p0925j1172O518L1378L1837L7989o417m1287
20375E6715O6576K6600k4492r4215J1090j4560K0739K1649M2270j9231q4272j4351
$$ y = [-51046, -27339, -11607, -11671, -29538, -32629, 23672, 15594, 36375, 118734, 54340, -68134, -55383, -29640, -50665, -28828, -27214, -38826, -73754, -172484, -158791, -145556, -176403, -170195, -44833, 18673, 40216, 35731, 30073, 16914, -37042, -93480, -72691, -42329, -53351, -27943, 22844, 18082, 23708, 40918, 37330, 78574, 45107, -30495, -58801, -39449, -108363, -98694, -58010, -34881, -15977, -70114, -41648, -9991, 3585, -35473, -25753, 872, 16621, 27211, 18253, -32773, 52872, 126357, 63000, 38193, 18063, -20567, 30744, 50967, 24393, 15018, -45235, 11764, 65605, 93890, 78794, 7869, -3303, 3215, 34593, 66430, 104419, 98002, 56715, 123291, 149891, 125399, 31184, 42274, 27714, 48453, 70102, 112372, 93141, 8869, -5482]
20363e482J43978k4499q407O091l1681k99m8032q3750n1937K6230O4845K9456
20351A6513M8039j68m0216k4571L0018N5460J7113n4750q2689M1700O3197K7589
20339I7235q964n5378m1116K6036J05729k2431j2866K2882j4600M892m3983k2597
20327C4839L0490j866K2347j9332j03940j5347K5751K5620M4380M2513n1262j0741
20315B3452M2203n509o606J8468K6493L0484J2148J6720P039r518R732Q8853J07993
20302C61952J66156J72100J50195J80803J89608J60440j760j28656j87851k00066
20292H62921j08859q2835p7322j21476l8413l5624n2278j01121l3285J5761l0966
20281A96503k8753k0822n039k9902M1748L8708j6830p814k023l1490j538R1787
$$ y = [-5482, 138496, 113997, 105590, 111681, 80000, 79701, 31669, -52081, -104018, -77788, -12943, 16513, 64552, 64384, 24168, -403, 29615, 85075, 102188, 47438, -35251, 6449, 69646, 97235, 88271, 32893, -8223, 17813, 123542, 101111, 88245, 111127, 96527, 101419, 57436, 34839, 65329, 63463, 85810, 66478, -37462, -52809, -27058, -1438, 42942, 85455, 34193, 23452, 65655, 60146, 53540, 72008, 98501, 128985, 141133, 157853, 164892, 155374, 165106, 253959, 361952, 528108, 700208, 850403, 1031206, 1220814, 1381254, 1379494, 1250838, 1062987, 862921, 754062, 671227, 593905, 472429, 434016, 398392, 346114, 244993, 211708, 227469, 196503, 167750, 146928, 141889, 111987, 153735, 192443, 175613, 167799, 165776, 134286, 132748, 224535]
20269B24535O6993J2028K0197J31063J70685J75233J94605K16652J22754K765
20259A337510j34883j02594j28256j48055j15562j36420p0233l4242m8779n7821
20249C60665m436O006k4373j26686k1145M140J4178j2859l0606n3595J5436j9656
20237A07069n1955K2045K1719j158k3230L2503r861l7038L8145j7984M951J8934
20225A04140O414p0011k1923Q8641n4857q4779j4808N7490l0964J06715K1320
20214A07378m3139k2418J7640O2722P825m0926j8338l326m8096l1975L1050L0618
20202D9015Q1570L1581m6062m4176O948j9589j0709L3740J2848o3849l7560L4751
20190B8508K7876j5196j7407K1101L2833p262K0122k2112m4954k73K6303P6470
$$ y = [224535, 291528, 303556, 323753, 454816, 625501, 800734, 995339, 1211991, 1334745, 1337510, 1202627, 1100033, 971777, 823722, 708160, 571740, 501507, 467265, 418486, 360665, 356229, 362235, 337862, 211176, 190031, 194171, 208349, 195490, 164884, 111289, 126725, 107069, 55114, 77159, 98878, 97720, 74490, 106993, 97132, 60094, 98239, 80255, 85206, 104140, 110554, 40543, 18620, 107261, 52404, -32375, -47183, 10307, -20657, 86058, 107378, 64239, 41821, 59461, 122183, 130008, 89082, 70744, 67418, 19322, -12653, 18397, 49015, 130585, 162166, 116104, 71928, 78876, 59287, 48578, 82318, 95166, 31317, -6243, 28508, 56384, 41188, 23781, 44882, 77715, 70453, 90575, 68463, 23509, 23236, 49539, 126009]
20178A26009m0863p2366j3685J4591L4656p4322o9291l160J5463O0774N5734M4314
20166G7854L053L9533J1803Q491P120j4043k6909k848R508p556M3291k4590J0782
20153A35489K6107l0414n3896L5876L2145j4191k1253N3139J8311l4900p0303
20142G6110J1741L2053o6679m2197K7822j6164l0532N1549L8479K588Q917o784
20130H6903R130m509p2871l9967k0164j028J7698P7118L4859l575j0357K210J8068
20117I3515K5253L1889M2501L3045n2764m6701m7948K685N639l0599m5530L7638
20105D8623r100j417l739M362K1840J4955n221M0142K3313l3716j3334k813M6286
20092A30181l7594o1931j1611M382P3101k526k1635J1631J4151J8161j2319n8570
$$ y = [126009, 85146, 12780, -905, 13686, 48342, -25980, -95271, -98431, -82968, -22194, 33540, 77854, 80907, 120440, 132243, 140734, 147854, 133811, 106902, 104054, 113562, 106006, 149297, 124707, 135489, 161596, 131182, 77286, 113162, 145307, 131116, 109863, 163002, 181313, 146413, 76110, 87851, 119904, 53225, 11028, 38850, 22686, -7846, 43703, 82182, 84770, 93687, 86903, 96033, 91524, 18653, -21314, -41478, -42506, -24808, 52310, 87169, 83594, 73237, 75447, 93515, 118768, 150657, 193158, 226203, 173439, 126738, 78790, 81475, 87114, 56515, 10985, 48623, 39523, 38106, 34367, 38729, 60569, 75524, 70303, 110445, 133758, 100042, 86708, 83895, 130181, 92587, 30656, 19045, 23427, 96528, 94002, 72367, 83998, 98149, 116310, 103991, 45421]
20080D5421M7127P854M9288J10525l3146l9847J4368J8805K85j1192l089o7802
20068A38597q1035j9475M194n4861m9485l6808j10532j47421l5463J6370N6506
20057c19413J8288L5142N8022J3928N0324p847J6060K7561K5499L6382M1966N9626
20045E5538k1442J0155r904k866l1532j5471j9876K7323K5065j4128Q451M1749
20033E3062J0899j7444l8518j790J1441p2946j26726q7354q6969k1107M3938K2025
20021c11489O9131N8833M2707L4196J9406j1985j3661j1901K9093M1441M0830
20010a3399L32M4181Q0793J81057J56840Q6626O3806M5286J3002p0840j27371
19999D60313j29541q4383M2457n0052q155l8078J421L7845J1746l3119m8822n3862
$$ y = [45421, 92548, 100402, 149690, 260215, 227069, 187222, 201590, 220395, 220680, 209488, 206399, 138597, 57562, 38087, 42281, -12580, -62065, -98873, -209405, -356826, -392289, -375919, -319413, -301125, -265983, -207961, -194033, -143709, -151556, -135496, -107935, -82436, -46054, -4088, 55538, 34096, 44251, 34347, 31481, -51, -15522, -35398, -8075, 16990, 2862, 11313, 53062, 63961, 46517, 7999, 6209, 17650, -55296, -182022, -269376, -356345, -377452, -333514, -311489, -242358, -183525, -140818, -106622, -87216, -99201, -112862, -124763, -95670, -54229, -13399, -13067, 31114, 111907, 292964, 449804, 536430, 600236, 645522, 658524, 587684, 460313, 330772, 246389, 288846, 238794, 230639, 192561, 193982, 231827, 243573, 210454, 161632, 107770]
19987A07770r2053M988N7128K7629N8327L4646R856L1312m7178n4407q466K7498
19975A57050O4005J25053Q7083L6897J11070J38944L9508M9076k1057j25890j33072
19964E28667k1201n0671r9791n0284q205l508n7070k7527R875n0963k6397m150
19952A38775N298l7329m7808J2003N2040j4824m780j4105k1486J6719O123J2170
19940A02796o97L2342M5665K7754N1990k5494q0531l4012K2110L9879p203K8415
19928B03014R073k9508j6693j5794p076K6595J0126m1239r2888o2916J3563j2425
19916a6168K5504p547k5106k0453P0230o058K5070K020O40Q3627P5159M1560K7564
19903B76042O02R293l135j993k8832J3670K0880l4852k2706k9524j2612J5631
$$ y = [107770, 15717, 20705, 77833, 105462, 163789, 198435, 208291, 239603, 192425, 138018, 129552, 157050, 221055, 346108, 433191, 470088, 581158, 720102, 759610, 808686, 787629, 661739, 528667, 507466, 456795, 357004, 306720, 298515, 295007, 237937, 210410, 220285, 169322, 142925, 138775, 144073, 106744, 58936, 70939, 122979, 108155, 103375, 89270, 67784, 84503, 90626, 102796, 102099, 134441, 180106, 207860, 259850, 234356, 153825, 119813, 141923, 181802, 174599, 203014, 212087, 182579, 165886, 150092, 143016, 169611, 179737, 138498, 45610, -17306, -3743, -16168, 9336, 1789, -23317, -43770, 26460, 20402, 45472, 47492, 48132, 131759, 206918, 248478, 276042, 276644, 285937, 282802, 280809, 251977, 265647, 286527, 251675, 228969, 199445, 186833, 202464]
19891B02464k9027L5620M8245o8974q3755L4906M532l32P5922P7982J3087P59
19879C11429p7225m6485q798k6211M850L3572l0089N4501N6090O9556K5035J0846
19867C77071j94J621n9026O3289J0324l6477k4876J3215j4170q697K5319m0782
19855C06617r286P4630J6702K0174j5144K7029n60J3938J9317J6348L0523L5304
19843E35592r0088n1584p9160r2937m2113P287o70m5439M2139M9522R7623Q4081
19831D14253k7645o4528k3325L6899j7511M2622P9920L7605K7658q959m4010N7260
19819E10239K0847K467j9866n7904n079J13145O4264j8480Q5468K4650J4098L5382
19807G69231K3793k9856l824p7059j51923j26029m0222P5929M7220K5456L5083
$$ y = [202464, 173437, 209057, 257302, 188328, 104573, 139479, 144011, 143679, 219601, 297583, 310670, 311429, 234204, 187719, 178921, 152710, 157560, 191132, 161043, 215544, 271634, 341190, 366225, 377071, 376877, 378498, 319472, 382761, 393085, 356608, 331732, 344947, 330777, 322080, 347399, 306617, 297331, 371961, 388663, 408837, 393693, 420722, 420162, 434100, 453417, 469765, 500288, 535592, 445504, 393920, 314760, 221823, 179710, 186997, 186327, 140888, 183027, 232549, 330172, 414253, 386608, 322080, 298755, 335654, 318143, 360765, 440685, 478290, 505948, 496989, 452979, 510239, 531086, 533553, 513687, 455783, 450704, 563849, 628113, 609633, 695101, 719751, 733849, 769231, 793024, 763168, 759344, 682285, 530362, 404333, 364111, 440040, 487260, 512716, 547799]
19796E47799N5111m9479l1547P9769L3557K5104M2958N8899l2862M6971M7836
19785H24116M3788j1982J0081N3431k806J1477O1018J09896J22477M3153J0351
19774A275000J06772J20530Q1726J18315J09612J49542K81466L13460K01130J14048
19764B871601P7915N3859o5711r1910m154M8675P8969J22893K31030K61751L15606
19753C900524L06542L67788L43473K39285K13297J01756Q5573J64054K32636K75177
19743F230105L49468K89123K75086K84806L24346L61743M94462O56246Q38418
19734A0103803J086603J266483J641600K041827K414045K727121L197876L905349
19726B8384707N022590O600541Q885318J2251808J7194526K4045191L2465227
$$ y = [547799, 602910, 553431, 521884, 601653, 635210, 660314, 703272, 762171, 729309, 776280, 824116, 867904, 855922, 866003, 919434, 916628, 928105, 989123, 1099019, 1221496, 1264649, 1275000, 1381772, 1502302, 1584028, 1702343, 1811955, 1961497, 2242963, 2556423, 2757553, 2871601, 2949516, 3003375, 2937664, 2845754, 2841600, 2890275, 2969244, 3092137, 3323167, 3584918, 3900524, 4207066, 4574854, 4918327, 5157612, 5370909, 5472665, 5558238, 5722292, 5954928, 6230105, 6579573, 6868696, 7143782, 7428588, 7752934, 8114677, 8609139, 9265385, 10103803, 11190406, 12456889, 14098489, 16140316, 18554361, 21281482, 24479358, 28384707, 33407297, 40007838, 48893156, 61144964, 78339490, 102384681, 134849908]
19719A34849908L9082341L7654029K4708692M894525j4733389k7492494l0852915
19712A68110697k8689768k4420264j9251846j4150719j0115460p559550o158665
19705E7764425n495994n212842m695756m028223l322242k553582k009063j361443
19697B9085280p23103k33016K72813Q23525J637906K371154L222389M484150O042978
19688D6984076Q118907J1159852J5653265K2074039L0427518L8541010M0541241
19681B13499908L0919688J1670462r696882k6380567l2920469l1869408k7821584
19674A27401148k2654863j7144873j2398909r038891p080437o253323n826415
19667D7003437n553552n018601m349730l780581l202611k750263k271621j902041
$$ y = [134849908, 173932249, 211586278, 236294970, 241189495, 226456106, 198963612, 168110697, 139420929, 115000665, 95748819, 81598100, 71482640, 63923090, 57764425, 52268431, 47055589, 42359833, 38331610, 35009368, 32455786, 30446723, 29085280, 28362177, 28129161, 28401974, 29225499, 30863405, 33234559, 36456948, 40941098, 46984076, 55102983, 66262835, 81916100, 103990139, 134417657, 172958667, 213499908, 244419596, 256090058, 246393176, 220012609, 187092140, 155222732, 127401148, 104746285, 87601412, 75202503, 66163612, 59083175, 52829852, 47003437, 41449885, 36431284, 32081554, 28300973, 25098362, 22348099, 20076478, 18174437]
19659A8174437j592551j368855j175185r50288p35448n42261n21716m62523m28646
19650A0396964m94880m33009m73331n87323o09617n77568m72649l88113m60969
19641E899505m80577n34437k96780j88989j29406j35453r5618K0588Q2905k0341
19631D121397j67231k96295l20839k95773k93447k32476k19605r5810m7768r1527
19621B060626p9915j34699j21853o4379l4225r3582n1785n2535j8894n0715l9769
19610A318275j9495m5498J0536n4377j5246l6963p3953k7969L4881m577R486L6261
19598A131361N6025N7769J2073P2009M3116m5930r9430j15390j08131r5003J3988
19587I22457j4236j3777l840o2513P533P8324Q94o7909J2372j6230o1359J9005
$$ y = [18174437, 16581886, 15213031, 14037846, 13087558, 12352110, 11809849, 11288133, 10825610, 10396964, 9902084, 9469075, 8995744, 8408421, 7798804, 7221236, 6748587, 6360474, 5899505, 5418928, 4884491, 4587711, 4398722, 4269316, 4133863, 4038245, 4058833, 4141738, 4121397, 3954166, 3657871, 3337032, 3041259, 2747812, 2515336, 2295731, 2199921, 2152153, 2060626, 1980711, 1846012, 1724159, 1659780, 1625555, 1531973, 1480188, 1427653, 1408759, 1358044, 1318275, 1298780, 1253282, 1263818, 1209441, 1194195, 1157232, 1083279, 1055310, 1090191, 1085614, 1095100, 1131361, 1187386, 1245155, 1257228, 1329237, 1372353, 1326423, 1226993, 1111603, 1003472, 908469, 922457, 908221, 894444, 890604, 828091, 835624, 913948, 914842, 846933, 859305, 843075, 781716, 800721]
19575H00721K2837R151p0003l0354o5262n1502j8980L1007K4521j7484j9104k6842
19563E88706N8462O3036N4198M6675M0275N070q7723l7706r242j9933o0829M716
19551F45705K3346Q124m5735k2785J7793l0287n6016L4586L8865m74n533L1598
19539F39187j521k4793j9150o1990j8484m2974l5782j7766q9340p4047j7334r529
19527B26477N4051m4342j10940L9624K4071J4844K6492M6927M3039L4410k0804
19516C33849M2957J6644k4420R990K1001N3438m5j03035o4361J6009l1267k931
19504B67829J7231P8854m804j45082n0817M957O7668J0662j9957r8178j181M3028
19492A70210k057k6596P916q958p812N8419L1884R8021m775r1053k8676K385P2793
$$ y = [800721, 823558, 832709, 762706, 732352, 667090, 615588, 596608, 627615, 652136, 634652, 615548, 588706, 647168, 710204, 764402, 811077, 851352, 856422, 768699, 730993, 721751, 701818, 640989, 645705, 669051, 677175, 631440, 608655, 626448, 596161, 540145, 574731, 613596, 613122, 607589, 639187, 637666, 612873, 593723, 531733, 513249, 470275, 434493, 416727, 327387, 253340, 236006, 226477, 280528, 236186, 125246, 164870, 188941, 203785, 230277, 277204, 320243, 354653, 333849, 376806, 393450, 369030, 379020, 400021, 453459, 453414, 350379, 286018, 302027, 270760, 267829, 285060, 363914, 359110, 214028, 163211, 168168, 235836, 246498, 226541, 128363, 127182, 170210, 168153, 141557, 149473, 140515, 132703, 191122, 223006, 321027, 316252, 225199, 196523, 198908, 271701]
19479B71701J8885L8140P283L0423R721j1787L7432O6260l2805q5479k9959j1387
19467C08428M666M75m2391k0136K777k0444K8682L9590l1485p155J23847J01634
19455D88488j12781l7052K8507L5523M4293q324J9699l404L8376j2743Q363O2537
19443E51482M3760M1816O5952J97769K93080L10804K35054J01756j09606j75706
19433A556161j52401j69694j62049r3837J2314P4164J24441N1195J81653L67997
19423A789944K46872J7377j34106k36488k46455k46847k84965j50159p3310j7823
19413F64040m8336j16267m3845K8451m4279k7203k0296o5354n5760j6304j7172
19402B37675k472K6166j472j1582K9369j7811k7773l6955O1333L6419n267L1627
$$ y = [271701, 290586, 328726, 336009, 366432, 376153, 364366, 401798, 468058, 435253, 349774, 319815, 308428, 313094, 313569, 271178, 251042, 253819, 233375, 262057, 301647, 270162, 263007, 386854, 488488, 375707, 338655, 367162, 402685, 446978, 438654, 458353, 454949, 493325, 480582, 488945, 551482, 595242, 637058, 703010, 900779, 1193859, 1504663, 1739717, 1841473, 1731867, 1556161, 1403760, 1234066, 1072017, 978180, 990494, 1064658, 1189099, 1240294, 1421947, 1789944, 2036816, 2054193, 1920087, 1683599, 1437144, 1190297, 905332, 755173, 681863, 664040, 615704, 499437, 455592, 484043, 439764, 412561, 392265, 326911, 271151, 254847, 237675, 235203, 261369, 259897, 248315, 277684, 259873, 232100, 195145, 256478, 292897, 287630, 319257]
19390C19257j9035k1566N1439J4128J9290K4066K0818K1803o530k8549O087J9807
19378D21015M5252M8884O6194k5379K9767M9040m4003n4940n0101j13181q2844
19367B89704o5430q1741j6462P8049J0360m253l7807K9866n7634l755n4274J9256
19355A05879M3385L9086j503m9926J5526l1245l252K0219K4448L139M3053O341
19343B15150P7135J20333J2097l8534l4526N2530J8828O3724M4631r3650j17148
19332C20570l228m338j09709q4230n4184l8329k4742P558o881K3277p839k5199
19320g274j6254J1419j6635L81j3009n5875J2802N7867O8460j8626k7398j0204
19308a4346L2933R6843P91p8480k3333P2820k0970j25844M090K8700L5252N3224
$$ y = [319257, 300222, 278656, 330095, 344223, 363513, 387579, 408397, 430200, 423670, 395121, 401208, 421015, 466267, 515151, 581345, 555966, 585733, 634773, 590770, 535830, 485729, 372548, 289704, 224274, 142533, 126071, 204120, 214480, 210227, 172420, 202286, 144652, 140897, 86623, 105879, 149264, 188350, 186847, 136921, 152447, 121202, 117950, 138169, 162617, 165756, 208809, 215150, 292285, 412618, 424715, 386181, 351655, 404185, 423013, 486737, 531368, 437718, 320570, 317342, 313004, 203295, 119065, 64881, 26552, 1810, 9368, 2487, 25764, 17925, -7274, -23528, -12109, -28744, -28363, -41372, -97247, -84445, -26578, 41882, 23256, -4142, -14346, 18587, 115430, 116221, 37741, 14408, 87228, 66258, -59586, -55496, -26796, 8456, 61680]
19296F1680J8958j7529k7922n7057j5818L7963L5255j4229J5720N643m7843p674
19284a2853Q0987k0306k748J703m062J9706K2926P947M652m6496j6794L9526O900
19271H1088j9463k7901q497K1562j3718k0246N3781K0557J425k1033k9781N636
19259D3410K9509P6735o452R115J2472l7513o2662J9352j0934j4372L5854M1504
19247A36018K2673k972k5946p4571j1846L8331N750L7808J3413r757m8276m7545
19235C3080M2542L1738O6898q353q8943j8101k4758L5471L0056M482K7250j2281
19223A19081j8036L8893k7844J8914L0981j01556Q916M4912j4570k9647J237l3407
19211C7874l5083j6245K5965Q2705N2868K1602j8371p529R907j8538j5531J095
$$ y = [61680, 80638, 63109, 35187, -21870, -37688, 275, 35530, 21301, 37021, 42664, -5179, -12853, 68134, 47828, 45080, 46783, 42721, 62427, 85353, 93300, 97952, 51456, 34662, 74188, 81088, 61625, 33724, 25227, 46789, 33071, 12825, 66606, 87163, 88588, 67555, 37774, 43410, 72919, 149654, 143202, 152317, 164789, 127276, 64614, 83966, 73032, 58660, 94514, 136018, 158691, 155719, 129773, 55202, 43356, 81687, 87437, 125245, 138658, 128901, 80625, 33080, 75622, 107360, 174258, 165905, 76962, 58861, 34103, 69574, 99630, 104112, 131362, 119081, 101045, 139938, 112094, 131008, 161989, 60433, 69349, 114261, 99691, 70044, 71281, 37874, 2791, -13454, 12511, 95216, 148084, 169686, 151315, 143786, 153693, 135155, 119624, 120719]
19199A20719J566M009O8019J5207n7066J7118j4243K2704M6175k0532o7201m7769
19187H8706J1097l16L5884Q6812n5779k4405J7481j0773q657q622k3550M1446
19175A49324r878K534k1155Q589M7942N233j1490n8480M32M3878K4069l2161n0891
19162I7946K5037K2216L1902O1177k7324J6021P315l4005J3021n7343J3938Q918
19150A78819J0862L7540l3262p6799R092L0951P0437K9895N699J4922M4078k558
19138C19676r978J302m6043j1902P4599J51570J74776J65643J36048J02627P375
19127A065693r0537j72362j13718j59673k19014k05747j65754j07643r5698m4792
19117c09245L5178N4430M4498O7530L4758J0335n9619O257L4378P2203M3526j8926
$$ y = [120719, 122285, 126294, 194313, 209520, 152454, 169572, 155329, 178033, 224208, 203676, 136475, 88706, 99803, 99487, 135371, 222183, 166404, 141999, 159480, 148707, 140050, 131428, 107878, 149324, 139446, 141980, 120825, 129414, 177356, 182589, 171099, 112619, 113051, 156929, 180998, 148837, 97946, 122983, 145199, 177101, 238278, 210954, 226975, 234290, 200285, 213306, 155963, 169901, 178819, 189681, 227221, 193959, 117160, 126252, 157203, 227640, 257535, 263234, 278156, 322234, 319676, 309698, 311000, 264957, 253055, 327654, 479224, 654000, 819643, 955691, 1058318, 1065693, 975156, 802794, 689076, 529403, 310389, 104642, -61112, -168755, -264453, -309245, -274067, -219637, -175139, -107609, -72851, -62516, -122135, -115878, -81500, -9297, 34229, 15303]
19105A5303P1707J23937j466K6383L4094J59014J37527R0023J33861J74197K24286
19094A188866J59012M319p8262j49735j70466j25959j83475j70355n2564P2067
19084D93448j9172l4096m781k1760m5527p2059o6160M001J1728m3162j2195n5231
19072A35034m0155p029P6564O2812k7640n6487j4456J2228l5470K1136m2138O768
19060I1167J3722K382M6043J3227l9576k5429j0516J0910Q7380Q4886N988k4169
19048B56015m2298k2690J7299l5188L4206N1485l5035p6160n2011k0306J08381
19037A83698P0609k8082m1414K7977l9841J5584Q833L0630K7563m3910o1999M6015
19025A95663Q7566l1506K5221R476o0232n8576m8928K3688q7625l5175Q0256O7089
$$ y = [15303, 87010, 210947, 209481, 235864, 269958, 428972, 566499, 656522, 790383, 964580, 1188866, 1347878, 1352197, 1273935, 1124200, 953734, 827775, 644300, 473945, 421381, 493448, 474276, 440180, 435399, 413639, 368112, 296053, 229893, 233894, 245622, 202460, 190265, 135034, 94879, 87850, 164414, 227226, 199586, 143099, 128643, 140871, 105401, 126537, 84399, 91167, 104889, 107271, 153314, 166541, 126965, 101536, 91020, 101930, 189310, 274196, 280184, 256015, 213717, 191027, 208326, 173138, 207344, 258829, 223794, 147634, 95623, 75317, 183698, 254307, 226225, 184811, 212788, 172947, 188531, 197364, 227994, 255557, 211647, 149648, 195663, 283229, 251723, 276944, 286420, 226188, 167612, 118684, 142372, 54747, 19572, 99828, 166917]
19013A66917K542m2080p0298m0164L4468M0020L9537j0149L3003N8535n3746j5362
19001A43223M3522j6076n2372k8291J2373O1620L4528J9377q755p2504L0448P4427
18989B41520m9974k1073k1673j1280R760p032K4808Q7368L8739N7067J1394o6965
18977B92659n3281L6719J34581K0077o0515j5227q859l2127O1944K9449K7696
18966D33116N4577j8112l0889n772k2589o0019l076O6807M1994K9565j0955P569
18954D82216l0148q1638m3752M78O5262m4709m2067O5036L3349Q698k3533n9790
18942C29402l1647k3577K7580L647n3575K0459l39k6800J3031k213O2441m604
18930C13805Q483J2290l955K6700N824M2089J7154Q82J461r668J5869J31654O0738
$$ y = [166917, 169459, 127379, 57081, 16917, 51385, 91405, 130942, 120793, 153796, 212331, 158585, 143223, 186745, 170669, 118297, 90006, 102379, 163999, 198527, 217904, 209149, 136645, 167093, 241520, 191546, 170473, 148800, 137520, 147280, 140248, 165056, 252424, 291163, 348230, 359624, 292659, 239378, 276097, 410678, 430755, 370240, 355013, 346154, 314027, 375971, 405420, 433116, 487693, 469581, 438692, 432920, 410331, 350312, 347236, 414043, 456037, 485602, 474647, 482216, 452068, 370430, 326678, 327156, 392418, 347709, 305642, 370678, 404027, 412725, 389192, 329402, 297755, 274178, 301758, 305405, 251830, 272289, 271950, 245150, 258181, 255968, 318409, 313805, 322288, 334578, 330623, 357323, 363147, 405236, 422390, 423272, 424733, 415065, 430934, 562588, 623326]
18917F23326j4992K2914o7266j64051j32635n2140r2108J2044M7959O0201J33944
18906C77196J48002M6639L340N5693N3529n8991j02245o6922n8673p9038j41028
18895A77502j4893P3674J17507J42323N4187l0437J06694J71246J37196K33770
18885A168769K29863J43407J01487N90n3263l678L1031J04116K0579q765j17469
18874A616667j38302j11035j67166j63319m6250j9592n3894K2518K6961r32j8429
18863I47227O890K2394j1492L4620P762O900K6363P3790K3082l3087k2760P7708
18851A159397J08822K26399K74860K21108J84389P6099J7494L6103M3573Q1257
18841B429501J06429N8846k3235m5457N6528L7173L1824K49059L35612M34447
$$ y = [623326, 608334, 631248, 563982, 399931, 267296, 215156, 123048, 135092, 183051, 243252, 377196, 525198, 571837, 575177, 630870, 684399, 625408, 523163, 456241, 397568, 318530, 177502, 162609, 236283, 353790, 496113, 550300, 519863, 626557, 797803, 934999, 1168769, 1398632, 1542039, 1643526, 1644116, 1590853, 1587175, 1618206, 1722322, 1742901, 1734136, 1616667, 1478365, 1367330, 1200164, 1036845, 990595, 971003, 917109, 939627, 966588, 965656, 947227, 954117, 976511, 965019, 999639, 1007401, 1014301, 1040664, 1114454, 1137536, 1104449, 1081689, 1159397, 1268219, 1494618, 1769478, 1990586, 2174975, 2251074, 2268568, 2304671, 2348244, 2429501, 2535930, 2594776, 2571541, 2526084, 2582612, 2619785, 2651609, 2900668, 3236280, 3670727]
18831C670727L45889J86291N70p6280j04228p9719j2241l5938J39100K03389L00319
18820D537879N39911P33834Q05768Q81616R07434P33892N53608L26452J36697
18811A0157091l5979l0616J72201L91298P63199J213460J641339K042179K513108
18802A8827280L081517L647588M276699N167646O664758R145709J3144194J9779589
18794H3734980L0690792M6331648N8745091N3999860K6967957k960462l1974633
18787B65535233m2354212l7782777k9664643k1208608j1234529q34506R295258
18780A31751216K0567069L5497269N0500350N2544001L1013614L60510l0218496
18773B92015533m8176695m6854308l9286595l1783272k3533981j5741196j0517872
$$ y = [3670727, 4016616, 4202907, 4203477, 4127197, 4022969, 3943250, 3931009, 3895071, 4034171, 4237560, 4537879, 5077790, 5811624, 6617392, 7499008, 8406442, 9140334, 9693942, 10020394, 10157091, 10121112, 10090496, 10262697, 10653995, 11417194, 12630654, 14271993, 16314172, 18827280, 21908797, 25556385, 29833084, 35000730, 41665488, 50811197, 63955391, 83734980, 114425772, 160757420, 219502511, 273502371, 300470328, 297509866, 265535233, 223181021, 185398244, 155733601, 134524993, 123290464, 122455958, 131751216, 152318285, 187815554, 238315904, 290859905, 321873519, 322234029, 292015533, 243838838, 196984530, 157697935, 125914663, 102380682, 86639486, 76121614]
18766G6121614p886588o970758o628642o739964o259008n264612m314950l558409
18758B8498683k934305k333064j819818j387718j115595j033215j037296j149307
18750A5688365j199453j038623r12147r10008r58374r19343r07663r27298p67477
18741G147979o37755n69039m84081l99462k15532q2137m8012J7736J9099n7350
18731D691446k50553l37325l93779m15167l11006k43163k81840j85092j05027
18722B168494j90584j29927j11000o8274n858n4494p5016J5798m6186j27615j07635
18711A267703m0543k5273l4118j9630N265J5847J0271K0965L0213n7652M660m5890
18699A131818j658o3487p7683q6086j48330j33442l4020j1936j19219r5446p4740
$$ y = [76121614, 68235026, 61264268, 54635626, 47895662, 41636654, 36372042, 32057092, 28498683, 25564378, 23231314, 21411496, 20023778, 18908183, 17874968, 16837672, 15688365, 14488912, 13450289, 12538142, 11628134, 10669760, 9750417, 8842754, 7915456, 7147979, 6510224, 5941185, 5457104, 5057642, 4842110, 4759973, 4711961, 4729697, 4748796, 4691446, 4440893, 4103568, 3709789, 3294622, 2983616, 2740453, 2458613, 2273521, 2168494, 1977910, 1847983, 1736983, 1668709, 1662851, 1608357, 1533341, 1549139, 1502953, 1375338, 1267703, 1227160, 1201887, 1167769, 1148139, 1153404, 1169251, 1179522, 1200487, 1230700, 1173048, 1177708, 1131818, 1130160, 1066673, 988990, 902904, 754574, 621132, 587112, 575176, 455957, 360511, 285771]
18688B85771p1969O980r492N8500N0211k5139j3220P4645k1710m8653L2311M3170
18676C61405L2787L1652J7475O1383L0276J55092K29143N5514j4869K5416n0998
18665I34276j45952j34272j22497p2959J08480k1045o6331m6977R192J89781J17916
18654G49612M3275n544j26241j54420j20463l656j6418r2253p019N6137K8893
18643C51903M659j2078K5473l5133j7192n724l9969J300J4728K1591P9492K4019
18631D13069m6936R712m265l8462o865L3344k5402k6905m4275P970J6651J8405
18619C06041L5601K5534L9338J5968R881l9822Q075m7290p8415n4020q7587j5962
18607A17342k9583n3183j2006M55N4082L1141k0186K8608M8287J5546O2385J49179
$$ y = [285771, 213802, 220782, 211290, 269790, 320001, 294862, 281642, 356287, 334577, 285924, 318235, 361405, 394192, 425844, 443319, 504702, 534978, 690070, 919213, 974727, 959858, 985274, 934276, 788324, 654052, 531555, 458596, 567076, 546031, 479700, 432723, 441915, 631696, 749612, 792887, 787343, 661102, 506682, 386219, 382563, 366145, 273892, 266873, 323010, 351903, 356562, 344484, 369957, 334824, 317632, 311908, 271939, 273239, 287967, 309558, 389050, 413069, 366133, 375845, 371580, 333118, 326253, 359597, 334195, 307290, 263015, 270985, 287636, 306041, 341642, 367176, 406514, 422482, 432363, 392541, 400616, 353326, 274911, 220891, 133304, 117342, 87759, 34576, 22570, 23025, 77107, 108248, 88062, 116670, 164957, 180503, 242888, 392067]
18595C92067J47773J18295J30657N6518J1815P019j16074j46064p6247Q423J6512
18584E50694j0280N554J17624J30735J78974J29433K370p6711j18905j61242j18244
18573F30002r2813L5083J12621j5102p8330o7243O6138R128L8012J06860R0514
18562H34870J26338L2989k6569n6934l3731Q7587K0282l6216j09571j24388o6185
18551F48472k6036o4247k8488N1294q2448j9723J9252j5414j805n8267k6231n0037
18539C46322L4738Q0658N2032M7152J4969L5345K1930O7645Q1881J8430P0709
18528H71811N2661O7196p049J8230L1389n8840P22K3671l8957p2711r8026j18301
18516F71796l0505N853l9009o9332q0821N0512L3563J299m667k6691j7197l936
$$ y = [392067, 539840, 658135, 788792, 845310, 857125, 864144, 748070, 602006, 525759, 534182, 550694, 540414, 545968, 663592, 794327, 973301, 1102734, 1105104, 1028393, 909488, 748246, 630002, 537189, 572272, 684893, 669791, 591461, 524218, 590356, 599484, 637496, 744356, 834870, 961208, 994197, 967628, 910694, 876963, 964550, 984832, 948616, 839045, 714657, 648472, 622436, 558189, 529701, 580995, 498547, 478824, 498076, 482662, 480857, 422590, 396359, 346322, 381060, 461718, 513750, 560902, 575871, 611216, 633146, 700791, 782672, 801102, 871811, 924472, 991668, 984619, 1002849, 1034238, 975398, 976120, 999791, 960834, 888123, 790097, 671796, 641291, 647144, 608135, 538803, 457982, 508494, 542057, 543356, 538689, 511998, 494801, 490865]
18504D90865M8363L3528j5r7936K4882j1021l3527j1688k8747R8420M7433J453
18492E62010M717L7588o0768j7574k7552q3191N726R0122N8085o3980j3457n7734
18480D33992N8424N1142Q7022R8166n0447l0890j6052l132m5851n5099n4308j6256
18468D56711J4637O8148j2872o2774j3446k3350R803P2941J44726N2917n6378
18457F51063m8323J0205O2458k7044m2995J6606L6136J03141J37794J76441J06434
18446A181916P3185k1301p1043j33116l8365n4618k78J5744o809P668m3998K1325
18434I30310N7670P5318J3659q3190j01272j35273j43170j23314n7932J099M1487
18423D75392M0521M1091N1469N1878P0222K9121J1684p585n303J8862l2969o9590
$$ y = [490865, 539228, 572756, 572741, 474805, 499687, 488666, 455139, 443451, 414704, 513124, 560557, 562010, 566727, 604315, 543547, 525973, 498421, 415230, 420956, 511078, 569163, 505183, 491726, 433992, 492416, 543558, 630580, 728746, 678299, 647409, 631357, 628225, 582374, 527275, 472967, 456711, 471348, 539496, 526624, 463850, 450404, 427054, 436857, 509798, 654524, 707441, 651063, 602740, 612945, 675403, 648359, 605364, 621970, 658106, 761247, 899041, 1075482, 1181916, 1255101, 1233800, 1162757, 1029641, 991276, 936658, 936380, 952124, 945315, 952983, 908985, 930310, 987980, 1063298, 1076957, 993767, 892495, 757222, 614052, 490738, 432806, 433905, 475392, 515913, 557004, 608473, 660351, 730573, 759694, 771378, 763793, 758490, 777352, 744383, 674793]
18411F74793q275J00958M4957O9094O7072N9049O6728q294M6103j8971K8844K1845
18399A143903J5130K7190P6174N7905K6260j0756P6767Q8200L1876P1001K7729
18388A631379N6694J13439J12433J24598N5483Q6186Q4591R3089J47569J68997
18378B674458L10438K42408K16606J11878J86204K11620K96645L76744M99974
18369E126975M56151N30791O35979Q44237J158251J349256J358313J525810J823388
18360A4809151K356439L039637M042178N297197O711424Q740704J2471990J9207969
18352G6676689K9790215L9919548L6503030J1801664j0195892r014089K397530
18345A77878695J4461622J8419385K936225k2999061l0306120k6217816k3097155
$$ y = [674793, 666518, 767476, 812433, 881527, 948599, 1007648, 1074376, 1066082, 1112185, 1093214, 1122058, 1143903, 1159033, 1186223, 1262397, 1320302, 1346562, 1335806, 1412573, 1500773, 1532649, 1603650, 1631379, 1688073, 1801512, 1913945, 2038543, 2094026, 2180212, 2264803, 2357892, 2505461, 2674458, 2984896, 3227304, 3443910, 3555788, 3741992, 3953612, 4250257, 4627001, 5126975, 5583126, 6113917, 6749896, 7594133, 8752384, 10101640, 11459953, 12985763, 14809151, 17165590, 20205227, 24247405, 29544602, 36256026, 44996730, 57468720, 76676689, 106466904, 146386452, 182889482, 194691146, 184495254, 175481165, 177878695, 192340317, 210759702, 213695927, 190696866, 160390746, 134172930, 111075775]
18338A11075775k0671315j5795828j0859057p532416n492496m322523m215754
18331D2186386l973700l328336k689874j973814j313760q63724l53967L77528
18323B8066739J222973K350385L582020M914384O663891R653189J4895094K3663716
18315I5012391L4614218L7396783K0598299n470081j1322756k322331R647616
18308A78154139J7413903R962730j4921065k8967030k6949646k2963887k0955644
18301I0773500j7113652j2150626q464716o228086m864598m428420m394197m135011
18293B8994194l588755l171465k768593k248804j940379j653496j367696j190531
18285A1064475r40906q37136p84456p53760p05632m53527m01074m20096m09333
$$ y = [111075775, 90404460, 74608632, 63749575, 56217159, 50724663, 46402140, 42186386, 38212686, 34884350, 32194476, 30220662, 28906902, 28043178, 27689211, 28066739, 29289712, 31640097, 35222117, 40136501, 46800392, 56453581, 71348675, 95012391, 129626609, 167023392, 187621691, 182151610, 170828854, 168506523, 178154139, 195568042, 205530772, 190609707, 161642677, 134693031, 111729144, 90773500, 73659848, 61509222, 53044506, 46816420, 41951822, 37523402, 33129205, 28994194, 25405439, 22233974, 19465381, 17216577, 15276198, 13622702, 12255006, 11064475, 10123569, 9286433, 8501977, 7748217, 7042585, 6589058, 6187984, 5767888, 5358555]
18276E358555m22894l17919k94272k75915k99752k93249k40086k48184j61510
18267B804774j68807j91786j55372n3760L4328j2305r2319r6364p1518j00171
18257A896700j23783m209o8577r2995j19786q7674l8851j3255k3052J3962J6048
18246A354528J1312n5628q9392r6179r0215n7456L6519M197m3834r5681q8748
18235G89423L1065j4349P85L2904m821k7720K1315k056J22258R5597N8358L3817
18223A136576J219M3624Q5587L7573K5259K8389K2370K8919J19166L5958R2983
18212A657623Q4070P712k583K9699k847o2453j2680n3218m8251L2453o7090j17636
18200A444799j14380r4365j49169p7993J426q447r809K9865j6851p3957l1942
$$ y = [5358555, 4935661, 4617742, 4323470, 4047555, 3747803, 3454554, 3214468, 2966284, 2804774, 2635967, 2444181, 2288809, 2235049, 2269377, 2257072, 2164753, 2068389, 1996871, 1896700, 1772917, 1768708, 1700131, 1607136, 1487350, 1399676, 1360825, 1347570, 1324518, 1338480, 1354528, 1365840, 1310212, 1220820, 1124641, 1034426, 976970, 1013489, 1017686, 973852, 878171, 789423, 820488, 806139, 806924, 839828, 835007, 807287, 828602, 826546, 948804, 1044401, 1102759, 1136576, 1137795, 1181419, 1267006, 1304579, 1329838, 1358227, 1380597, 1409516, 1528682, 1564640, 1657623, 1741693, 1749405, 1746822, 1776521, 1773674, 1711221, 1698541, 1645323, 1597072, 1629525, 1562435, 1444799, 1330419, 1236054, 1086885, 1008892, 1010318, 1001871, 992062, 1021927, 1005076, 931119, 899177]
18189H99177Q515J7295n7580q8808p7228O5714O6170k5245m8547j2329l0925K1257
18177G37466k2655J0789P2817Q1039Q5573j5031p893p138m5372M5189K5450l4172
18165I26062Q4897J44945M4995K1582R7791J63865J36301N38q5352j34386j59100
18154A242138p0100o0276K3082K4900n1637m2950j7825k0414O5563P3768J06099
18143A272348O0090K1140P1715J47935J77545K32289K70028L35482K76306N0642
18133B915520r7788j39871r2314o3741O4351J60774J78593K21935M10005O48651
18123D206115P54013Q00525Q37358Q55545R02909J116440J618282K338935L339766
18114A6769888N223104Q365955J3398859K0197679K1858279R881411r766224j5567389
$$ y = [899177, 907692, 924987, 867407, 778599, 701371, 767085, 833255, 808010, 759463, 747134, 716209, 737466, 714811, 725600, 798417, 879456, 965029, 949998, 942105, 934967, 889595, 934784, 960234, 926062, 1010959, 1155904, 1200899, 1222481, 1320272, 1484137, 1620438, 1620976, 1535624, 1401238, 1242138, 1172038, 1111762, 1134844, 1159744, 1108107, 1065157, 1047332, 1026918, 1092481, 1166249, 1272348, 1332438, 1353578, 1425293, 1573228, 1750773, 1983062, 2253090, 2588572, 2864878, 2915520, 2817732, 2677861, 2585547, 2521806, 2586157, 2746931, 2925524, 3147459, 3557464, 4206115, 4960128, 5760653, 6598011, 7453556, 8356465, 9472905, 11091187, 13430122, 16769888, 21992992, 30358947, 43757806, 63955485, 85813764, 95695175, 85928951, 70361562]
18106G0361562j3548578j1986022j0476825p578614m784550k942579j807275j164037
18098A6073082j422849j706205j620872j329753j155186r49003o65319o63830
18090F560065o68753n80683m49362l86446l21882j53235p1907j69337l15624k36251
18080C206585j17858r3187o3014r1083k90618l00015k54139j68487j38043j86245
18070A503896j60844j16256q9983r1042o9674r061p1498l9770p2912n7691n9155
18059F66010n0168m9935j07103l3684m988P1497K9333J2726J366p2119o3997m64
18047C98474R485J1951p3387P9059O9375O4479m4486q4479j00036P51j6892o7975
18035B46319L6722O4252K2416m8768j877K6473j2988l2405m0494q860k541M9181
$$ y = [70361562, 56812984, 44826962, 34350137, 26771523, 21986973, 19044394, 17237119, 16073082, 14650233, 12944028, 11323156, 9993403, 8838217, 7889214, 7223895, 6560065, 5891312, 5310629, 4861267, 4474821, 4152939, 3999704, 3927797, 3758460, 3442836, 3206585, 3088727, 2995540, 2932526, 2841443, 2550825, 2250810, 1996671, 1828184, 1690141, 1503896, 1343052, 1226796, 1136813, 1045771, 976097, 967036, 895538, 855768, 782856, 725165, 666010, 615842, 565907, 458804, 425120, 420132, 491629, 520962, 533688, 535054, 462935, 398938, 398474, 407959, 419910, 346523, 425582, 494957, 559436, 514950, 430471, 330435, 331186, 314294, 246319, 283041, 347293, 369709, 320941, 319064, 345537, 332549, 300144, 259650, 250790, 248249, 297430]
18023B97430J0875n769N9452K1481j912j8546l5612j27M1116L6448K5818L014
18011D33668J0441K4394N1812L7402J14800K1003j4743o1799n7085o2749l0844
18000D66300K0777L6399n5158j21906n5262k316n9244n474l470j5712J4767P1136
17988B90837N7530J2816k0778m0446m6065N839j2152m1023k3148L3795M3558J9675
17976B80438j6509l4523j24J03406Q2342N1695L0718N6663o503p0387n1922n6365
17964C68929K7215K7599k2705p175n1761n2315r6024j07785L3405L3785n3790
17953I9378p5823K1994l3403j0965L9896O9900n474n4336j1151M5390L2541k3389
17941I4558M1508l8944m4556O7350P9586l9567k6915M1254L4759n092k0397k1970
$$ y = [297430, 308305, 302536, 361988, 383469, 381557, 363011, 327399, 327272, 368388, 404836, 430654, 433668, 444109, 468503, 520315, 557717, 672517, 693520, 678777, 616978, 559893, 497144, 466300, 487077, 523476, 468318, 346412, 291150, 288834, 229590, 224116, 220646, 204934, 219701, 290837, 348367, 361183, 340405, 299959, 253894, 259733, 247581, 206558, 183410, 217205, 260763, 280438, 263929, 229406, 229282, 332688, 415030, 466725, 497443, 554106, 547603, 477216, 425294, 368929, 396144, 423743, 401038, 393863, 342102, 289787, 193763, 85978, 119383, 153168, 99378, 23555, 45549, 12146, 1181, 41077, 110977, 105503, 51167, 40016, 85406, 117947, 94558, 136066, 97122, 52566, 119916, 199502, 159935, 133020, 174274, 209033, 203941, 183544, 161574]
17929A61574j7253p7731m5743J5374K3815k3104j5122J455N1909L2299J7360J7486
17917A42319j5501j4855k4017m803N86n96K538k6117K0486N3410j8123n591l9761
17904F9975J9968Q0369j2074K9493l074J8583J2489n3097q984L238k5987l1941
17892I8958j9369J1647Q8441R8417J04144R6295K198o952p869K8302L8742R6621
17880F29575O6276m8759j0312p4463J7652P9750l4298K7598l011r7747k5353r0822
17868D36086j47600j28725j27317l0908Q592K6998m5621j05901l7912Q7274O8353
17857C319J0358m2023j15255p5640n0991K2924Q3093O0457j196o9047p3240m1800
17845b89041k7610Q5066R9684J06598M7656j8803Q8428J02609P5985J64402J82960
$$ y = [161574, 144321, 66590, 20847, 36221, 60036, 36932, 21810, 23265, 75174, 107473, 124833, 142319, 126818, 111963, 87946, 83143, 83729, 83133, 85671, 59554, 80040, 133450, 115327, 109736, 69975, 89943, 170312, 158238, 187731, 184657, 203240, 215729, 162632, 153648, 156886, 130899, 98958, 79589, 91236, 179677, 278094, 382238, 478533, 480731, 473779, 465910, 494212, 532954, 629575, 695851, 647092, 636780, 562317, 579969, 659719, 625421, 653019, 650008, 552261, 526908, 436086, 288486, 159761, 32444, 1536, 10128, 37126, -8495, -114396, -152308, -65034, 3319, 13677, -28346, -143601, -219241, -270232, -247308, -164215, -103758, -104954, -174001, -247241, -289041, -316651, -231585, -131901, -25303, 22353, 3550, 91978, 194587, 270572, 434974, 617934]
17834F17934R2878J04351M1517m3928m3833m6289j48697p5893m9564p2106l8092
17823C38278m3438L7674j0116K8323L7128l5077q012L9221M8280Q7675J33883
17812F53819J70456K03104J48067n781r4973L2088K4545R2390J29486k0376j81021
17801A151804j27603j27912j42226n8373m0686n7318j5888Q581L2556K0272M4147
17790F87354P9009J23508J31819J65039K2729r1533j0181j160L1469J5943o354
17779A147642M5377J002R3732J68167K66234J55113N418l808n445K8953L1629
17768A934014M0751k9527j61222j71692j96656k05088k13349j23897j18380j41346
17758F13608l7053n1190o8186J10679l2730p1639j34157p1021o295k7398O0830
$$ y = [617934, 710812, 815163, 856680, 812752, 768919, 722630, 573933, 498040, 448476, 376370, 338278, 294840, 332514, 322398, 350721, 387849, 352772, 344760, 383981, 432261, 519936, 653819, 824275, 1027379, 1175446, 1169665, 1074692, 1106780, 1131325, 1223715, 1353201, 1332825, 1151804, 1024201, 896289, 754063, 695690, 655004, 597686, 581798, 590379, 622935, 643207, 687354, 766363, 889871, 1021690, 1186729, 1209458, 1117925, 1107744, 1106584, 1138053, 1153996, 1147642, 1193019, 1194021, 1287753, 1455920, 1722154, 1877267, 1882685, 1878877, 1873432, 1902385, 1934014, 1974765, 1945238, 1784016, 1612324, 1415668, 1210580, 997231, 873334, 754954, 613608, 576555, 525365, 457179, 567858, 535128, 463489, 329332, 258311, 252016, 224618, 285448]
17747B85448L3829j4170o4987p2393l578L4727M3224K5971L6519P4226n287L3809
17735D07338M8184j6005l7987j7050J38316J12900J59217J63482J21647R1482
17725A171524q2535m6588K8783J09607K00691J31380N5913q2495n0390J1819k1040
17714A426669j12441j58669j30910r1138L8582m159n3682K913p403j08776n4285
17703G46701m5576r4112n9855M0752N5043J5373N945m9161j13228K1869M3419
17692E67170J7239J6715o076L2497N1975K3247P134Q037P9488R6910m1132L2442
17680H85646P6328M5644N4958m9618m6102N2337J07405J11284L5973K862k062
17669A274655j9739M5717L0755K8974k6784j2195o9126j01479j36512q0325r2974
$$ y = [285448, 319277, 305107, 240120, 167727, 164149, 198876, 242100, 268071, 304590, 378816, 373529, 407338, 455522, 439517, 401530, 384480, 522796, 635696, 794913, 958395, 1080042, 1171524, 1088989, 1042401, 1071184, 1180791, 1381482, 1512862, 1568775, 1486280, 1435890, 1447709, 1426669, 1314228, 1155559, 1024649, 933511, 972093, 967934, 914252, 917165, 909762, 800986, 746701, 701125, 607013, 547158, 587910, 642953, 658326, 664271, 615110, 501882, 523751, 567170, 584409, 601124, 595048, 627545, 679520, 702767, 709901, 717938, 797426, 894336, 853204, 885646, 961974, 1007618, 1062576, 1012958, 966856, 1019193, 1126598, 1237882, 1273855, 1276717, 1274655, 1254916, 1300633, 1331388, 1360362, 1333578, 1321383, 1252257, 1150778, 1014266, 933941, 840967]
17658H40967j16980m9598K7579M0499K631l7355k8431K0599J6122K1339o3l4818
17646G02491n1573j06923j14999j708n7796l986j7741K8112n8621k4893N6728
17635C49091J10373M6542m7757p240p5998l0218N1635l7802l6797P1053J8349
17624D11231n5220n6563K8638L4716J7611P9664K9804k5263M1476Q3691K9282
17613F19067J1683l879J6001K7460L0326r044K8152M887p3846r4402l2501L3193
17601E57097L2976M9039k1679J2271J6965K4164J5358O363L1686P991l5903L0031
17589G26359m892O1781N9715p599O0808P6103K8955L183l6463P3648R3882J5627
17577A151107K2681M5571K4436k8109L2631Q8452P3477Q9916J46830R4858J03367
$$ y = [840967, 723987, 674389, 701968, 742467, 745098, 707743, 679312, 699911, 716033, 737372, 737309, 702491, 650918, 543995, 428996, 427288, 369492, 365506, 347765, 375877, 317256, 292363, 349091, 459464, 506006, 458249, 451009, 375011, 344793, 396428, 358626, 321829, 392882, 411231, 356011, 299448, 328086, 362802, 380413, 460077, 489881, 464618, 506094, 589785, 619067, 630750, 626871, 642872, 670332, 700658, 691614, 719766, 724653, 650807, 556405, 523904, 557097, 590073, 639112, 617433, 629704, 646669, 670833, 686191, 692554, 724240, 732231, 696328, 726359, 721467, 783248, 842963, 835364, 896172, 972275, 1001230, 1004413, 967950, 1041598, 1135480, 1151107, 1173788, 1219359, 1243795, 1215686, 1248317, 1336769, 1410246, 1500162, 1646992, 1741850, 1845217]
17566A845217K9586P1866J82123J49450R8747J32957J28816K02479K37205K36583
17556C315029L34396K94952J36563J35943J40299K75440L49804L09956K46688
17547E539070K02182K12389L58717N06017O09108P59163Q60547Q27968O24319
17538A0499480Q20666J176271J511032J822432K054452K276574K629359L354631
17530B6144897M571853O344980Q924171J2994034J9456543K9235954L9722436
17523A47394868L7956783J5028058p892333q120139K941905J5138700K0381618
17516B22829460P907005j6087035k2481648j5296371o750056L831435J8951012
17509A92903802K7246640J4833704r683330j5786462p411049M275942J2593530
$$ y = [1845217, 1874803, 1946669, 2128792, 2278242, 2376989, 2509946, 2638762, 2841241, 3078446, 3315029, 3649425, 3944377, 4080940, 4216883, 4357182, 4632622, 4982426, 5292382, 5539070, 5741252, 5953641, 6312358, 6818375, 7427483, 8186646, 9047193, 9875161, 10499480, 11320146, 12496417, 14007449, 15829881, 17884333, 20160907, 22790266, 26144897, 30716750, 37061730, 45985901, 58979935, 78436478, 107672432, 147394868, 185351651, 200379709, 192487376, 184367237, 187309142, 202447842, 222829460, 230736465, 214649430, 192167782, 176871411, 170121355, 173952790, 192903802, 220150442, 234984146, 225300816, 209514354, 202103305, 206379247, 218972777]
17502B18972777O864788j6683719l1408435k9116494k4749529k2704181j9002980
17495H2172227j3720885r595590o858460m942584m444526m786498m544961l844360
17487B9434363l079455k574780k269794k040329k052618j741389j376773j158347
17479A3140878j040176j013253r58202r56645p76422o17468m44110l74987l77174
17470F582441m53285m75569m25494k81241k76420k51267l50863l32315k44667
17461C491320k97817k71868k33986j84372k23814k42767j54245m5411j10221n4674
17451A672145j13081q5718p8173p967R611L8274N5311O1904R6554r9717j23608
17440A425535q3680r7378j51334q2817n9528j93K7186n2791k2896p7253j28323
$$ y = [218972777, 225837565, 209153846, 177745411, 148628917, 123879388, 101175207, 82172227, 68451342, 58855752, 51997292, 47054708, 42610182, 37823684, 33278723, 29434363, 26354908, 23780128, 21510334, 19470005, 17417387, 15675998, 14299225, 13140878, 12100702, 11087449, 10129247, 9172602, 8396180, 7778712, 7334602, 6959615, 6582441, 6129156, 5653587, 5228093, 4946852, 4670432, 4419165, 4068302, 3735987, 3491320, 3193503, 2921635, 2687649, 2503277, 2279463, 2036696, 1882451, 1837040, 1726819, 1672145, 1559064, 1473346, 1395173, 1387206, 1396817, 1435091, 1490402, 1552306, 1648860, 1549143, 1425535, 1341855, 1244477, 1093143, 1010326, 950798, 950605, 977791, 925000, 902104, 824851, 696528]
17429F96528o126O1129M2963j1668o0220j2090O4751l7876j03403l2802o1828
17418E39358l7785K9367n0789m4372l2399K2048j6110l032M0744n8992n003j2400
17406C70635M603M8671K5300L0260J14391R4807M436P9803N9272R3142J1557J9051
17394I55928Q0412M6998l8761M868l1667k7594K0879R212n047P8767L5296r015
17382A120276l0789P1240Q0366K0863n7623l4105l0313n6712J1232n2193j53170
17371H89072j15456r9217p0063N798R228p5620r5565n2301K4452K9109k5924k7637
17359C95876l0620n0733m9647k7224L997q167r895j8104L8838l1715O715N573
17347B24894J1371l8422L8571K6457n8419m5816j6282K838J838m3015l3946j1082
$$ y = [696528, 690402, 751531, 794494, 782826, 722606, 710516, 775267, 737391, 633988, 601186, 539358, 501573, 530940, 480151, 435779, 403380, 425428, 409318, 406286, 447030, 388038, 383035, 370635, 375238, 423909, 449209, 479469, 593860, 688667, 693103, 772906, 832178, 925320, 936877, 955928, 1036340, 1083338, 1044577, 1049445, 1017778, 990184, 1011063, 1020275, 1015228, 1093995, 1129291, 1120276, 1089487, 1160727, 1241093, 1261956, 1204333, 1170228, 1139915, 1083203, 1094435, 1042242, 889072, 773616, 674399, 604336, 610134, 619362, 543742, 448177, 395876, 420328, 449437, 423513, 395876, 365256, 314523, 264876, 237652, 241649, 233482, 223587, 205483, 244321, 212606, 219321, 224894, 236265, 197843, 236414, 262871, 204452, 158636, 142354, 145192, 147030, 104015, 70069, 58987]
17335E8987J1388j1996o3896J3087n3399m0932n4268L4385L7482J1167O7671O3985
17323G3661p0595m7138J3516o4584j8311J0126j376J593q387r988N1184L8844
17311c1455J5710L0537N4113P5438j3883J3644N2331p3298l6826J5469L7223j6157
17299A22846M3926Q111j2326l737j0594k2503k39M8698m2640l5207L2769N7093
17287A86197J9421J4451J0300M0653O9736m659m6396n9201K8283N5830M2240J60858
17275E17713J60800M8198k9787k6580J1446J5479N8324k3391m7939r1661o6616
17264E25986o3662m7800n8205J3657j4248p1182o1758k9728r378j1085k2242m3322
17252A07033J9548N0432P408q2697k2946Q3442K5558K8635n9944m0449o643J8711
$$ y = [58987, 70375, 58379, -5517, 7570, -45829, -86761, -141029, -106644, -69162, -57995, 9676, 73661, 3066, -44072, -30556, -95140, -113451, -103325, -104701, -103108, -111495, -121483, -70299, -31455, -15745, 14792, 68905, 144343, 130460, 144104, 196435, 123137, 86311, 101780, 139003, 122846, 166772, 174883, 162557, 158820, 148226, 125723, 125484, 174182, 131542, 96335, 129104, 186197, 205618, 220069, 230369, 271022, 340758, 336099, 289703, 230502, 258785, 314615, 356855, 517713, 678513, 726711, 696924, 670344, 681790, 697269, 755593, 732202, 684263, 592602, 525986, 462324, 414524, 356319, 369976, 355728, 284546, 222788, 193060, 183682, 172597, 150355, 107033, 126581, 177013, 184421, 101724, 78778, 162220, 187778, 216413, 156469, 116020, 109377, 128088]
17240A28088m3559L8190R1578l3134P135K8589j5022L5580P003M5794j346L6368
17228C25264M0514J09975Q9498J02565l9960o8052M9935P9981L6645m4548p6286
17217F05531n1051j07926j7606l8601o0801o4751m3610j2441O3992k2592o4237
17206A85907J1332Q139L4919J3096k5325m3371j1091N7077j814j7391P451m191
17194B14738j2906o3601l6588L1242L3192R134M2722O2803j1323P593K7831k560
17182C02277O4896O9184L7872P8213q901o6382p7749R930R7222L4297l9271l6105
17170D65483j6540Q994k7027n7773m803O0745P8982J06885k5679m1167l6655o090
17158E05355n8459j05985q9903r3586k6010m1757r4486K1729Q3384k4179N264
$$ y = [128088, 84529, 122719, 214297, 181163, 188298, 216887, 201865, 237445, 244448, 290242, 288896, 325264, 365778, 475753, 565251, 667816, 627856, 559804, 609739, 689720, 726365, 681817, 605531, 554480, 446554, 428948, 390347, 329546, 264795, 221185, 208744, 272736, 250144, 185907, 197239, 205378, 240297, 253393, 228068, 184697, 173606, 230683, 228869, 211478, 218929, 214738, 201832, 138231, 101643, 132885, 166077, 175211, 217933, 280736, 269413, 277006, 304837, 302277, 367173, 436357, 474229, 552442, 543541, 477159, 399410, 409340, 506562, 540859, 501588, 465483, 448943, 457937, 430910, 373137, 368334, 429079, 508061, 614946, 589267, 548100, 511445, 505355, 446896, 340911, 251008, 157422, 131412, 89655, -4831, 16898, 100282, 76103, 81367]
17147H1367l1882o8312j7430M1002k7381O338N3343n2178m9359Q472L3677r950
17135c2293j044K076m0119N9463N1540l3364r006k3434l8206j008J8848l6513
17123h3060J4688N3103n230L6658l7101K962P1679j5756n8245l1045J7209L0771
17111c367J394l8085j3120L2921K8391J2925M6355n5096j6976j3863n8978l9828
17099a17327R002j4640K2088J04332j5052m4311K7192j2493L1370Q8645O1529
17088A40335j8854o6725k7945k5930P708J428j5441n0002Q892M9535K7991O0129
17076I1121j5037l8471l5486M6759n1950l9672L0426J0632k234l0708K6463J5051
17064F894j0783l7356m881k0231L3691K5383K2202N5974L8958J345n8399o6711
$$ y = [81367, 49485, -18827, -36257, 4745, -22636, -16298, 37045, -15133, -64492, -56020, -22343, -32293, -33337, -31261, -71380, -11917, 39623, 6259, -2747, -26181, -64387, -65395, -46547, -83060, -68372, -15269, -20499, 16159, -20942, -17980, 53699, 37943, -20302, -51347, -34138, -3367, -1973, -40058, -53178, -20257, 8134, 21059, 67414, 12318, -4658, -18521, -77499, -117327, -108325, -122965, -100877, 3455, -11597, -55908, -28716, -41209, -9839, 78806, 140335, 121481, 54756, 26811, 881, 8589, 10017, -5424, -55426, -46534, 3001, 30992, 91121, 76084, 37613, 2127, 48886, -3064, -42736, -12310, -1678, -3912, -34620, -8157, 6894, -3889, -41245, -46126, -66357, -32666, -7283, 14919, 70893, 109851, 111196, 52797, -13914]
17052a3914K5527O1840Q7473M4438O065j9442j7329q2355o7091K1126K4587r202
17040F1723j6013j6087p5493m7558k8573L7940Q1687Q0271k5998k7509O1186M
17028H5580M0071M9832j12198q3430m0838k0461L9094J5376N856J5027n7636m0391
17016a04118M7332P5366l009o3030N624K4785J046k9429L2459M248j8144j556
17004b8426j6340N0034R413l8699J734k847p0019N6288O6590l0217m8316k8347
16992g9152k6111O4474M2022m5749p92n4280n3942O6417P2926P5269j9944o0337
16980a9199j5238O682P3927M8945m0223L361L7394j7152Q055m1545M5269K6636
16968A16912q3422l7498M9869K1860l3155K4158k6758j1207N326k2736l9344N4999
$$ y = [-13914, 11613, 73453, 160926, 205364, 211429, 191987, 174658, 92303, 25212, 46338, 70925, 61723, 45710, 29623, -45870, -93428, -122001, -84061, -2374, 77897, 51899, 24390, 85576, 85580, 125651, 175483, 63285, -20145, -60983, -81444, -42350, -26974, -21118, -6091, -63727, -104118, -56786, 18580, 15571, -47459, -41835, -17050, -16004, -45433, -12974, -8726, -26870, -28426, -44766, 5268, 14681, -24018, -22284, -25131, -95150, -38862, 27728, -2489, -50805, -79152, -105263, -40789, 1233, -44516, -45308, -99588, -153530, -87113, -14187, 61082, 41138, -19199, -34437, -27755, 46172, 95117, 54894, 58255, 95649, 78497, 86552, 45007, 90276, 116912, 33490, -4008, 45861, 67721, 34566, 58724, 31966, 20759, 26085, 3349, -35995, 19004]
16956A9004n91j5823M4064N6063M8078K2460j0588Q6K777J6493O4504O4612J13609
16943D24748J97619K17483J96391K3947q7862o7929L5639Q9964J58027L5164r8800
16932A124391p2081l6451n3669N8940J48553J35540M4377r9539r2403r9357M7532
16921A105833J18958L866j24254j20173j42778q5633j06677q0402k8948k2356
16911E17436n7293j59843n6198M5183L1558J9384m5983K310n8749j13219m653
16900A19933n3680k3123j4184l472j6759J4585L2679k0948k6418j7201p771J4149
16888b210M5736o681m0298P1926K9552k944J449J196Q852k3122L8824m7095m3807
16875C1378K2540N6604P4902M3635N2680l8579j0303n614M4538P1958n4760k6441
$$ y = [19004, 18413, 2590, 46654, 102717, 150795, 173255, 162667, 162753, 165530, 182023, 246527, 311139, 424748, 622367, 839850, 1036241, 1060188, 972326, 904397, 940036, 1030000, 1188027, 1223191, 1124391, 1052310, 1015859, 962190, 1021130, 1169683, 1305223, 1349600, 1250061, 1157658, 1058301, 1105833, 1224791, 1228657, 1104403, 984230, 841452, 755819, 649142, 568740, 539792, 517436, 460143, 300300, 244102, 289285, 320843, 340227, 294244, 296554, 237805, 124586, 119933, 66253, 43130, 28946, 25474, 8715, 23300, 55979, 35031, 8613, -8588, -16359, -2210, 43526, 36845, -3453, 68473, 98025, 95081, 96530, 97726, 106578, 83456, 122280, 75185, 31378, 53918, 110522, 185424, 229059, 281739, 243160, 232857, 227243, 271781, 343739, 288979, 262538]
16863B62538m7391j056J9783n0031Q923J709j3041q4362n0412l0343M0622P6338
16851A33277J6602M950k8405o0574n0165J0129J9751L725n1871j5261j5954Q5956
16839E2160n428j0409L1981P7402r364o9123n182q918k5911J2276k3612k5378
16827i506L3148N7543l6883L080p6647r8972M3102K3980M743K5815N8251K0360
16815D8014n755n2156N8046L7157o9186l8562j4762K518n680r349j9646k1343
16803i0704L6189J1665O64Q4298K902o6191Q320J8394k322J4047m7978r6159j6479
16790a43354j9090j8571L0916K7065P0649j8907N9615Q4037K8838k0731k647K5695
16778A03515K705m6727k6440J8665P496O442j782l2424P635O34n1816p0917o034
$$ y = [262538, 215147, 214091, 233874, 183843, 192766, 194475, 181434, 97072, 46660, 16317, 56939, 133277, 149879, 154829, 126424, 65850, 15685, 25814, 45565, 49290, -2581, -17842, -33796, 52160, 46732, 36323, 68304, 145706, 136342, 67219, 62037, 53119, 27208, 39484, 15872, -9506, 23642, 81185, 44302, 47382, -29265, -128237, -85135, -61155, -56412, -30597, 27654, 48014, 42259, -9897, 48149, 85306, 16120, -22442, -37204, -34686, -40366, -49715, -69361, -90704, -54515, -42850, -42186, 42112, 45014, -21177, -12857, 5537, 3215, 17262, -30716, -126875, -143354, -162444, -181015, -150099, -123034, -52385, -71292, -11677, 72360, 101198, 80467, 77820, 103515, 106220, 59493, 33053, 51718, 59214, 65656, 63874, 31450, 39085, 39719, -12097, -83014, -89048]
16765h9048Q677R307J6333M2580j0945L0845p848n5017j6845P617K7602K3875
16753a2867J4988r726j638j4854O0877J8491k1331m4096m1888k7915M8843O2193
16741C1077J3142l593j9424K4963Q6208P003k4416J8261m0609n5932j4100j951
16729B0629M0509K428K3055k0241j06794m5240L3651L5636R08N8200J4586q360
16717D8967J3805k3353j6174J6368R727k4489o1927l2342P9707N9013m8244l6762
16705a5704P6653k3074l3414r524P977k2181j2062k5108L7853J0666j0651j6061
16693c4630r254R0368M1373l0887k2441j8361K4369M022K0479j3087j2499k7426
16681A2026j041k3617j8819k0354n131K6640N9010P9509n2466j15386o3813J414
$$ y = [-89048, -80371, -71064, -54731, -12151, -23096, 7749, -99, -55116, -71961, -64344, -36742, -12867, 2121, -7605, -9243, -24097, 36780, 55271, 33940, -10156, -52044, -79959, -31116, 31077, 44219, 40626, 21202, 46165, 132373, 139376, 114960, 133221, 92612, 36680, 22580, 20629, 61138, 63566, 86621, 66380, -40414, -85654, -52003, -16367, -15459, 42741, 57327, 48967, 62772, 39419, 23245, 39613, 49340, 24851, -37076, -69418, 10289, 69302, 21058, -15704, 60949, 37875, 4461, -5063, 2914, -19267, -31329, -56437, -18584, -7918, -18569, -34630, -43884, 46484, 87857, 56970, 34529, 16168, 40537, 44559, 65038, 51951, 39452, 12026, 10985, -12632, -31451, -51805, -56936, -30296, 28714, 108223, 55757, -59629, -123442, -122028]
16669a22028O145Q2154K8540K5344P773j9540k4358J8870o453m9920J3486J9348
16657b0639k593J03790O5690k2317p0523m2802m0854l3700L9117P2912P706q5280
16645b9493j9809k4694K3515j6933p5959l6197P5604L2631N5908N6267j2375l1819
16633c354k9549m3353q879o874p8992M0586P1936k4474m5982L1580O6742J749
16621b8864L5085P6262j8153j9175Q582K2336j1716p1040m881Q6823K8506N566
16609A09331j3469m3127l3486l2046m4413K5054l2687J789O6183j1647J1975k810
16597F47j7570m42L5509L251j7921l6282L3662L6587m0981m0127p729N2410J10871
16584A11885j3213o1765j9486o101p266k201m5664O3585l6094j1826K0680J3930
$$ y = [-122028, -115883, -33729, -5189, 20155, 27928, 8388, -15970, 2900, -3553, -53473, -39987, -20639, -23232, 80558, 146248, 123931, 53408, 10606, -30248, -63948, -24831, 48081, 55787, -29493, -49302, -73996, -50481, -67414, -143373, -179570, -103966, -71335, -15427, 40840, 28465, -3354, -32903, -76256, -85135, -92009, -171001, -130415, -58479, -82953, -128935, -97355, -30613, -28864, 6221, 82483, 64330, 45155, 53737, 76073, 64357, -6683, -11564, 75259, 103765, 109331, 95862, 52735, 19249, -12797, -57210, -32156, -64843, -63054, 3129, -8518, 3457, 647, -16923, -17365, 18144, 21395, 3474, -32808, 854, 37441, -3540, -43667, -51396, 1014, 111885, 98672, 36907, 17421, 11320, 4054, 1853, -43811, 19774, -16320, -28146, -7466, 6464]
16572F464k1153q9348M2434M7599j5804l5420O8419K0141p2625l3932N2981M9780
16560A9536l2165j1429L7555l191J5947L9046j608j3177q115k085o4060j00232
16548a23978n0238J10771N5964P87K5862J1538n1145N1625R4099J6798p4427m4641
16536B3015m0111M5587K9205p2440m3436O0747J9191j6j2053J2639o0680P511
16524c0841j8j2841j8957M4002j228m593R744j7743l2670L41j6590L212j8143
16511i6325j7112L5786p742M441L1137J2350j6082K2564n13j02663M440P1080
16499e8639J8561M4735L0667J5030k9498L5692K4403l3140j8229L635J9010O2711
16487A14938N7107m7515q7563J1342j5837j4510l5883J4390L1355j4987p4226
$$ y = [6464, -14689, -104037, -61603, -14004, -29808, -65228, 3191, 23332, -49293, -83225, -30244, 19536, -12629, -24058, 13497, 10306, 26253, 65299, 63691, 50514, 42399, 40314, -23746, -123978, -174216, -63445, -7481, -6694, 19168, 30706, -20439, 31186, 125285, 142083, 67656, 23015, -17096, 28491, 57696, -14744, -58180, 2567, 21758, 21742, 9689, 22328, -38352, -30841, -30859, -43700, -62657, -18655, -19883, -24476, -14732, -32475, -65145, -64804, -81394, -78182, -96325, -113437, -77651, -85393, -80952, -49815, -37465, -53547, -30983, -31496, -134159, -129719, -58639, -40078, 4657, 35324, 50354, 20856, 56548, 80951, 47811, 29582, 33217, 52227, 114938, 172045, 124530, 36967, 48309, 32472, 17962, -17921, -3531, 27824, 12837, -61389]
16476f1389o6699l0802j878j168O3431Q5046j1711J3678n9593j2243P595L9828
16464c5905L3874j6620j1976P2616M3445J8267k6523l3489K6270k7254q785L031
16452C6951m8499m3905J1723j8574l3108L1010M8170K5824l5408O286O7248l4507
16440A3211j8158j347q8970m6011L2624J9111O3347M9281j171n7510n173p351
16428d8117L2476M052J08k6668r5080l9884P8744P0281J2640M9125K626l0460
16416I843k8440O86J1864J3551J5050k9716k5938k8576J6633P9827K6388o3546
16404b374k9001k2472J9373Q1259L4491K4287K7004m9561j8170N506k6207n0247
16392f112K3829K1309k5280K3577M538k2889p528L0611j7931J6356L2743o8027
$$ y = [-61389, -128088, -158890, -160768, -161936, -98505, -13459, -25170, -11492, -71085, -83328, -75733, -35905, -2031, -18651, -30627, 41989, 85434, 103701, 77178, 43689, 69959, 42705, 33920, 36951, -11548, -55453, -43730, -62304, -95412, -64402, -16232, 9592, -25816, -19530, 47718, 13211, -4947, -6294, -95264, -141275, -108651, -89540, -26193, 23088, 21917, -35593, -40766, -48117, -15641, -11589, -11481, -38149, -133229, -173113, -94369, -24088, -11448, 37677, 40303, 9843, -18597, -17911, -6047, 7504, 22554, -7162, -33100, -61676, -45043, 34784, 61172, -2374, -31375, -53847, -34474, 46785, 81276, 105563, 132567, 83006, 64836, 70342, 44135, -6112, 17717, 39026, 13746, 37323, 41861, 18972, 11444, 42055, 24124, 40480, 73223, 5196]
16380E196m9291j2633J1852J0248j1314p2652O1908M4437m2703K9373K147N578
16368a7854K3673Q464N4308J1659m2566L576K8998n3560j5543k818m531L953r3136
16355i5377l4307K5688Q6310J9780j2875k514K616n964K0917Q584o6941o3492
16343a17575Q2968K2182R820m3856J0570P68j669L2325J4399m358M4084J3580
16331F3238j8108q5109l0620J501M524P993K3644O5511k9534o7979R770N1557
16319c612k5526m529O5969L0729j2735o3172o4514M5172J23709P4215m5908o7609
16307E2189k2395k6847J2035K4448K728J6911o3418q3447r7255R993O5441j6173
16295a25790J4581O7357J4782j0671M394q3247m7038Q9023Q4922k9219j5132J3278
$$ y = [5196, -44095, -56728, -44876, -34628, -45942, -118594, -56686, -12249, -54952, -25579, -23432, -17854, 5819, 14283, 68591, 80250, 37684, 41260, 70258, 16698, 1155, -1663, -6194, -2241, -95377, -129684, -103996, -17686, 2094, -10781, -13295, -10679, -16643, 4274, 12858, -54083, -117575, -34607, -12425, -2605, -46461, -35891, -35123, -36792, -4467, 9932, 5574, 49658, 63238, 45130, -39979, -70599, -69098, -64574, -56581, -32937, 32574, 3040, -64939, -55169, -3612, -29138, -33667, 32302, 63031, 50296, -12876, -77390, -32218, 91491, 165706, 119798, 52189, 29794, 2947, 14982, 39430, 42158, 59069, -4349, -87796, -185051, -175058, -109617, -125790, -111209, -43852, -29070, -39741, -35347, -118594, -165632, -76609, 8313, -20906, -36038, -22760]
16283b2760O9069J2096J5332l8774k9438K4519M8631k1589p0203K962l321j137
16271a4613K0020m3247k5835L3356R0273J234m6782R644q862m7049p590k1355
16259f0806M1181k931j6188J0733j558l3114q0521l7315J75990R9925m0391L8109
16247I3114j1775n5539o2799J6970K8271L0907m9949l3361M665o879n95K3799
16235b3171j2296M6808M0203k9622n4600p249L8742M525O56j2863k531k6396m195
16222d1989J7989j5743L0046L4462K5591k8898j5025p8839j1272k2690J3435L08
16210i2625J12356J3577J2200j0893N907O851K3882J9279o455o5227o5530l8255
16198h4933O8859J06170P8125j1406k7813j0080o3066q540J4315n7650k4375n6219
$$ y = [-22760, 46309, 58405, 73737, 34963, 5525, 30044, 78675, 57086, -13117, -10155, -13476, -14613, 5407, -37840, -63675, -30319, 59954, 61188, 14406, 24050, 15188, -31861, -39451, -60806, -19625, -22556, -38744, -28011, -29569, -62683, -143204, -180519, -4529, 95396, 55005, 93114, 81339, 25800, -36999, -20029, 8242, 39149, -10800, -44161, -39496, -46375, -46970, -23171, -35467, 11341, 51544, 21922, -32678, -39927, -1185, 3340, 3996, -8867, -11398, -37794, -41989, -24000, -39743, -9697, 24765, 50356, 21458, 6433, -72406, -83678, -106368, -92933, -92625, 19731, 33308, 45508, 34615, 40522, 47373, 71255, 90534, 84079, 18852, -46678, -84933, -16074, 90096, 168221, 156815, 129002, 118922, 55856, 47316, 61631, 3981, -20394, -76613]
16186g6613Q402J9916K8120j2311L1046J7048m6296L3321J7900m6785J4907j863
16174a3208l9059M8765K1927L7356O6409o20j5187m2087o277j8865J932r2543
16162e1457l791j1196m0273N2655L1893j4072Q586M0016L157O2992J9512J3337
16150A11359o8851n2563m682N9965K6916r496K1350J7537q4964k3899J1800N5771
16138F0243M1267m8173o9707m426j5762k1159K5172L8475O2776n3383m3878K1966
16126f589M0320k3892p0783l3455M7952L4890n956j6974n1983O4193J4506J5454
16114G683J2070k9333k9051K9521L1313k5865j330o3127k8897n423M0145K2909
16102c9385N514J6302M8811N1794o686k4739P633L2829k7715n1070m4973L6150
$$ y = [-76613, -68211, -48295, -20175, -32486, -1440, 15608, -30688, 2633, 20533, -26252, -11345, -13208, -52267, -3502, 18425, 55781, 122190, 121570, 106383, 64296, 58019, 39154, 41086, -51457, -55248, -66444, -106717, -54062, -22169, -36241, -27655, 12361, 15518, 78510, 98022, 111359, 42508, -10055, -14737, 45228, 72144, 62648, 83998, 101535, 16571, -7328, 4472, 60243, 101510, 53337, -16370, -20796, -36558, -57717, -32545, 5930, 68706, 15323, -28555, -6589, 33731, 9839, -60944, -94399, -46447, -11557, -17513, -34487, -86470, -22277, -7771, 7683, 19753, -9580, -38631, -9110, 22203, -3662, -4992, -68119, -97016, -102439, -62294, -39385, -33871, -17569, 31242, 83036, 76350, 51611, 59244, 92073, 64358, 13288, -31685, 4465]
16090D465P2384L3407l6517p3037r1636r835L9966o989N2336p590J9510l0743
16078c4279J8679l9796J3850J5901k2246p6011k5558P3896J6997K3399N0489l585
16066A1736O245k4590q845K4405j1528m0469l775l1266j6945L1950P8886k1735
16054e931j2213K6818L8223J51m6283k0327j0809M5435r857o1185N4829K9412
16042B8263o1086K0524L8408j8688M5514J8490j08m5085K3912l0910K0456N2574
16030I2264K0226o1343o4037O885N5753m6947M4642k0709m3526p1416L9936M5755
16018b517p732j9344m3586o57J1037k052L1026J3680j4565N073k7101J5204k4326
16005f5860L5670l664l8648Q7029J3171o27k7475L8420m3459L216M3708n904O801
$$ y = [4465, 76849, 110256, 73739, 702, -90934, -100769, -60803, -67792, -15456, -23046, -3536, -34279, -15600, -55396, -41546, -25645, -47891, -123902, -149460, -75564, -58567, -35168, 15321, 11736, 17981, -6609, -15454, 8951, -2577, -43046, -46821, -78087, -95032, -63082, 15804, -5931, -18144, 8674, 46897, 47048, 765, -19562, -30371, 15064, 5207, -55978, -1149, 28263, -32823, -12299, 26109, 7421, 52935, 71425, 71317, 26232, 50144, 19234, 39690, 92264, 112490, 51147, -12890, -6005, 49748, 2801, 47443, 26734, -16792, -88208, -48272, -2517, -10249, -29593, -73179, -73836, -62799, -64851, -33825, -20145, -34710, -29637, -56738, -41534, -65860, -30190, -33854, -72502, 14527, 27698, 27071, -404, 38016, -5443, -2227, 41481, 35577, 42378]
15992D2378K8616M2656J2037q3922q3189J1495Q0676L7313j4917L2525K101q759
15980I9010n4853r663J3292M3611J2990M6398l8722K2215k3920o7757m7518m3940
15968d8857M8285k5093L8168J9383n892j5369l1883N1222L3614n7278N868J2306
15956B4474M5297l4573J4823L3417o8361L866K5247k390j3150J123k8856o0117
15944e9200O192L6879k2174l3163q372Q4190K4596l1696k8570L1942p937l4932
15932d2245j3681J3343J9991r147k1128J8318J594M1079K2418K1K345M9776L2656
15919A15340Q115j0358j6178o006o8014j8449J4652o3497o523L9741n9607K8468
15907d2316L3585K4243l6364k1833j4697Q1322l990Q568k4165l8486K0982j2501
$$ y = [42378, 70994, 113650, 125687, 41765, -41424, -29929, 50747, 88060, 73143, 105668, 107769, 99010, 44157, 34494, 47786, 91397, 104387, 150785, 112063, 134278, 110358, 42601, -4917, -48857, -572, -25665, 12503, 31886, 25994, 10625, -21258, 29964, 63578, 6300, 12168, 24474, 69771, 35198, 50021, 83438, 15077, 18943, 44190, 41800, 28650, 29773, 917, -59200, -53008, -16129, -38303, -71466, -79838, 4352, 28948, -2748, -31318, 624, -7313, -42245, -55926, -42583, -22592, -31739, -52867, -34549, -32955, 8124, 30542, 30563, 32908, 82684, 115340, 123455, 113097, 96919, 90913, 22899, 4450, 19102, -44395, -50918, -11177, -70784, -42316, -8731, 15512, -20852, -42685, -57382, 23940, 19950, 28518, 4353, -34133, -13151, -25652]
15895b5652m7N4511J7336J916L3672n9148m7805k7762L3617K9599l9235l3906
15883f2904M8619N3937r0975k1102K9850kk2277N4870P9881p630k736n3181l2318
15870b5968Q8581l1998p837k2829m0391N7845M9420n5104K4453P9191q700l0327
15858G6336p1402p067o643K4920k0953K1963l7706o1225K5071K7200l477k624
15846c5607N4361m2903n2165L4777K9784P087j9120M6567L8098Q693J4344k1627
15834F2289m3701J3591m0647K3690j4115k8851J2229L775N2907L7756m885M860
15822G8898m6270k1596k5827n1376J468j0788n09r4247M7914N9271O1163J843
15810e6l9254N241j1631n9319n3761L4589P5918M3520L5157J4933k5791N1461
$$ y = [-25652, -25699, 28812, 46148, 48064, 81736, 22588, -25217, -52979, -19362, 10237, -28998, -62904, -14285, 39652, -51323, -72425, -42575, -42577, -64854, -9984, 69897, 62267, 59531, 6350, -25968, 62613, 30615, 22778, -51, -40442, 17403, 66823, 11719, 36172, 115363, 106663, 76336, 4934, -2133, -8776, 16144, -4809, 17154, -20552, -81777, -56706, -29506, -32983, -35607, 18754, -24149, -76314, -41537, -11753, -4666, -23786, 22781, 60879, 69572, 83916, 62289, 18588, 32179, -8468, 15222, 1107, -27744, -15515, -11740, 41167, 78923, 74038, 78898, 32628, 11032, -14795, -66171, -64703, -75491, -76000, -170247, -122333, -63062, -1899, -56, -39310, -34069, -45700, -105019, -158780, -124191, -48273, -4753, 30404, 45337, 19546, 71007]
15798G1007K713p8741m2756j5089M6805m956m5185j5778M260L5676K2011K1132
15786A099m8130J3993K6195n3818m7259O9281j7667Q143J1336j6133n7213K3997
15774h6176L6271k1662K7952K2260p0317P347O4262J7552j897J0987O2532K9608
15762I8719L4657n4683q7702K1257L5129O370q7727j5212Q070L0562M1699j8315
15750A2824P7404M4528M2254j7171l2093l7891l067m0205J3406P020m3560o0419
15738c6970O52m242N4894q925l461L82k4634k7327J3081O3192q2o5013K0086l729
15724b2096M9574L9631K9352n1161m46M414n5804j6871J9727n107J6692J0327
15712A8232l9223q3816j0326K1713N0419R9935O029l0760n7373l2804M5831K0779
$$ y = [71007, 73720, -5021, -47777, -62866, -16061, -21017, -66202, -81980, -77720, -42044, -20033, 1099, -47031, -33038, -6843, -60661, -107920, -38639, -56306, -48163, -36827, -52960, -110173, -86176, -49905, -71567, -43615, -21355, -91672, -84325, -20063, -2511, -4408, 6579, 69111, 98719, 133376, 78693, -9009, 12248, 47377, 53747, -33980, -49192, -41122, -10560, 31139, 12824, 90228, 134756, 177010, 159839, 127746, 89855, 86788, 46583, 59989, 67009, 23449, -36970, -36318, -40560, 14334, 5409, 1948, 2330, -22304, -49631, -36550, 26642, 26560, -38453, -18367, -22096, 27478, 67109, 96461, 45300, 44854, 49268, -6536, -23407, -3680, -8787, 7905, 18232, -20991, -104807, -115133, -93420, -43001, 56934, 62963, 32203, -25170, -57974, -12143, 8636]
15700H636J5519o778n8911J0776m1367j407Q7572L4379M1870N832k1517j5019
15688E9585l7701l8467j11123j5811N0969j1569M8256Q710r128L213K0676L9050
15676F660k2360n5569k4675L1310L1145M0104k218l9273J9145j9737k024j7192
15664e4684p923r330o167o9L0406J6794K4037J9061J7411j9754k4629P3722K0817
15651G9692m9119l0547m8368N2707K2406O371j6715n227j2112k5139m1347j3587
15639h0985J4176j1623M216L7699k666j6620J9292o752k8278L3638k7750M453
15627f1200J2901k1492k5972J06594K8890o5770o7644n596K6479R3463Q4780p1679
15615C3754l5983k2084k2105r945j0792M2902K7218l786n252p643M4229J6757
$$ y = [8636, 24155, 17377, -41534, -30758, -72125, -73532, 14040, 48419, 90289, 96121, 74604, 59585, 21884, -16583, -127706, -143517, -92548, -104117, -55861, -47151, -56279, -53066, -32390, 6660, -15700, -71269, -95944, -64634, -33489, 6615, 4397, -34876, -15731, -35468, -37492, -54684, -62607, -71937, -78104, -78173, -47767, -30973, -6936, 12125, 29536, 9782, -14847, 58875, 79692, 30573, 26, -48342, 4365, 26771, 33142, 16427, 11200, -912, -26051, -67398, -80985, -66809, -78432, -74216, -36517, -39183, -55803, -36511, -43263, -71541, -37903, -65653, -61200, -48299, -69791, -95763, 10831, 39721, -26049, -93693, -99289, -72810, 20653, 105433, 33754, -2229, -24313, -46418, -56363, -67155, -24253, 2965, -821, -6073, -13716, 30513, 47270]
15603D7270O0858k1092k6028l872J5332o874k6730N0825M741o1165l7972p257
15591a1964J7611K3070l0416M148J0929O083n6388l9067K8349o533L9463P2816
15579E8101m8292o0968J9316K7342M158k890J2777l3871l2397j7914K1452K2042
15567c1144M0754J2701p6116n8635P0882P0070M6877j120j05157p1327M6528L1380
15555b4307J2656O8467j1040m0576J2014J4795J2681J8629m7557l7119m9897k9512
15543a00766L3832L1414K7572Q5279P9667k1611o341k3876p431n5123K22k3433
15531A9405m6403j5935k731l6521M1164k2477l5178l7050L8093R008n7554K1519
15519a24660L3394J7063l1731J5957k3397K1600K8356K061j5087P4021L5704p1671
$$ y = [47270, 108128, 87036, 61008, 57136, 72468, 65594, 38864, 89689, 94430, 33265, -4707, -11964, 5647, 28717, -1699, 2449, 13378, 19461, -36927, -75994, -47645, -54178, -14715, 58101, 9809, -51159, -31843, -4501, -343, -3233, 9544, -24327, -56724, -74638, -53186, -31144, 9610, 22311, -53805, -112440, -41558, 28512, 75389, 74269, -30888, -102215, -55687, -24307, -11651, 56816, 45776, 5200, 17214, 32009, 44690, 63319, 15762, -21357, -71254, -100766, -66934, -35520, -7948, 77331, 156998, 135387, 129046, 105170, 97739, 42616, 42838, 19405, -26998, -42933, -45664, -82185, -41021, -63498, -98676, -135726, -97633, -88625, -146179, -124660, -91266, -74203, -105934, -89977, -113374, -91774, -63418, -61357, -76444, -2423, 33281, -38390]
15507c8390j389j0480O685N3995O857l0609J2042j1750j9064K1207K6603J5530
15495C1237k1841K1088n2120L6986L9717m168L4695m2046j8292j6860r0121l6974
15483a18699M4895J3673j9531o858M2472K6649m3449n550J2438n484n4112K9271
15471h4285l3785n7432O8203K9724n6389r5700K1247J9846k290N1686P1833N7463
15459i879L1353N5338M1149o5304J333N4287P222k1093p3595N5263p585m1920
15447B6569O0578P5450n7953m6225p275j7925N4080p897K2110l1103q3029j113
15435a3733n0158R668J3851M4659Q4681m754n1620j4601m4007j1787M2203M6550
15423E0952j8885k2448k3157l4426j724N6498L436R310n2089J6283M5705k3243
$$ y = [-38390, -39779, -50259, -43574, 10421, 17278, -13331, -1289, -13039, -32103, -10896, 15707, 31237, 9396, 30484, -21636, 15350, 55067, 50899, 85594, 43548, 25256, 8396, -81725, -118699, -73804, -60131, -79662, -86520, -44048, -17399, -60848, -66398, -53960, -59444, -113556, -84285, -118070, -175502, -107299, -77575, -133964, -229664, -208417, -188571, -190861, -139175, -67342, -9879, 21474, 76812, 117961, 52657, 53990, 108277, 115499, 94406, 20811, 76074, 68489, 26569, 87147, 162597, 104644, 58419, 51144, 33219, 87299, 79402, 101512, 70409, -12620, -13733, -63891, -54223, -40372, 4287, 88968, 84214, 32594, 17993, -26014, -37801, 4402, 50952, 32067, 9619, -13538, -47964, -49688, 6810, 10246, 19556, -32533, -16250, 29455, 6212]
15411F212K2111P0992j9009L7283M618j7578N9882k6765J4685k0465j9686o0305
15399E1975o7831j5643J1598J557K6091J0601o308m2458K3829J5567N3529o193
15387E6314j8676N4347J7568o8798j4561o854j7207j4985K2692J7517l227J300
15375B5430O2638m1130q3010k7185l184j165Q7122O0251n9542l5163o9067r8768
15363a82773M554P953P9122Q7396k1820J9892R9530o9095q2144l9271L2144N9942
15351d570M5290P0j07688n4476J15637J4935K7678l1579P343m7586r332N371M1061
15338B154M0127L8108K0753m3282J394L3282l8769o6892J4008N3520j1119O2591
15326A05875l6616j01273l1070p434j7067l2245p8072q969O2131M2156j4460L2507
$$ y = [6212, 28323, 99315, 80306, 117589, 122207, 104629, 164511, 137746, 152431, 131966, 112280, 51975, -15856, -31499, -19901, -18344, 7747, 18348, 12040, -30418, -6589, 8978, 62507, 56314, 37638, 91985, 109553, 40755, 26194, 19340, 2133, -12852, 9840, 27357, 24130, 25430, 88068, 46938, -36072, -63257, -66441, -67606, 19516, 79767, 20225, -14938, -84005, -182773, -178219, -170266, -91144, -3748, -25568, -5676, 93854, 24759, -57385, -96656, -64512, -4570, 40720, 40790, -66898, -121374, -5737, 9198, 36876, 5297, 12640, -34946, -44278, -38907, 2154, 42281, 80389, 101142, 57860, 59254, 92536, 53767, -13125, 883, 54403, 43284, 105875, 69259, -32014, -63084, -70518, -87585, -119830, -197902, -206871, -144740, -102584, -117044, -84537]
15314h4537P9998M0734R376r0002J9012K5649r612k299M6119J3524m1794J1716
15302A7884j2214r495L6972n5331l6300r609K8836J1198K195K3331M7400M1523
15290H6390l8716j00284L586Q6226M8538P71p4511k4086J6463J2616m4443r900
15278c7350J8186m877J6056J5177P5255M155m0409l1747k7695Q3221k0034o0134
15266a0196N388K4750L6501m8566p1165o5974M131K3573p704L2055M3768N1572
15254A8133M7709K5564l6314o1180L4557j2880m2274P750n5047k2119p70J0101
15242h6770j4790L8599M2694l728J0934j4224K7273J4781j4322J4669j8458k1609
15230b4951N0566J9686m0459K774N5984O4119m7661l5950l6948M4195L5371L4907
$$ y = [-84537, -4539, 36195, 45571, -44431, -25419, 230, -9382, -11681, 34438, 47962, 6168, 17884, 5670, -3825, 33147, -22184, -58484, -68093, -39257, -28059, -25864, -2533, 44867, 86390, 47674, -52610, -49024, 37202, 85740, 86511, 12000, -12086, 4377, 16993, -27450, -37350, -19164, -24041, -7985, 7192, 82447, 86602, 46193, 14446, -13249, 69972, 49938, -10196, -4808, 19942, 56443, 7877, -63288, -129262, -125131, -101558, -109262, -77207, -33439, 18133, 65842, 91406, 55092, -6088, 28469, 15589, -26685, -18935, -73982, -96101, -96871, -86770, -101560, -62961, -20267, -23995, -13061, -27285, -12, 14769, 447, 15116, -3342, -24951, 25615, 45301, 4842, 7616, 63600, 127719, 80058, 44108, 7160, 51355, 86726, 121633]
15218A21633r3496l4753J5758O3281K115k9936k8442J0057N2874M9598j6841p2995
15206C8853K6617K9701N252J8386M745n6136m1113J720L0704K1672j7212L4732
15194I7921j4524l1800J5504l7641q7319m714O6827O2095M1824k9364p536p1310
15182c7n3760k7062L2186P3401J6177q63k5201J8267j5090j3094l0440J503n598
15169b9611p3910m3322J1339N8941J01878N7161j3036n2596J5935L1260j9791
15158D4248L3758l0961p3809O7676M0857n0760j321j3073o5841m9754J252j1587
15146a09315O9017K6555K6042j1513p4010p332J8111L7900K4049P372j1125J9776
15134A5527M1557j485k8086j04011o577K5566K3996K4221o2285l4930L4242K5102
$$ y = [121633, 28137, -6616, 9142, 72423, 74538, 44602, 16160, 26217, 79091, 128689, 111848, 38853, 65470, 95171, 100423, 118809, 123554, 67418, 26305, 28025, 58729, 80401, 63189, 97921, 83397, 51597, 67101, 29460, -57859, -62573, 4254, 66349, 108173, 78809, 71273, -37, -53797, -80859, -48673, 24728, 40905, 40042, 14841, 33108, 18018, 4924, -25516, -24013, -29611, -103521, -146843, -135504, -76563, 25315, 82476, 69440, 16844, 32779, 64039, 44248, 78006, 47045, -26764, 40912, 81769, 31009, 29688, 16615, -49226, -98980, -97728, -109315, -40298, -13743, 12299, 786, -73224, -80556, -62445, -24545, -496, 6876, -4249, 15527, 57084, 55599, 27513, -76498, -83075, -57509, -33513, -9292, -71577, -106507, -72265, -47163]
15122d7163J4847P38j8579k7873O152O7347N3045J2122p09k3121k070m0637l8420
15109d4321J2526k1250N9177J0976J0946R448o4639K5790K4489q086k1105j0432
15097a6481j0843Q9833J6403o3960l9837K4683m571o157l232R1530K3066p8551
15085B1883m211L4517m3399k3956k1729M6639K8134o9961m3990M6990j9578M8819
15073A58M4082L8073L339k890M9539N444k9276l5577q6200M2635N6985J9621l8544
15060F7389K9077r4363l5859L6749M7755L057l2387j4470K5790J7550L5931J8731
15048A04950m6636k6039l7899Q7278J00292o4840q0807o6655j9444N1037M4106
15037D5343k0362P927l7770l9640l5325j4540j1852N7112M3060L1356K6331m3455
$$ y = [-47163, -32316, -31578, -50157, -78030, -71878, -4531, 48514, 60636, 59927, 36806, 34736, -5901, -44321, -31795, -53045, 6132, 17108, 28054, 37502, -27137, -1347, 23142, 15056, -6049, -16481, -27324, 62509, 78912, 14952, -24885, -202, -4773, -10930, -14162, 77368, 100434, 21883, 17672, 52189, 8790, -15166, -36895, 9744, 37878, -32083, -76073, -29083, -48661, 158, 44240, 82313, 85652, 82762, 132301, 137745, 108469, 72892, -13308, 29327, 86312, 105933, 67389, 96466, 2103, -33756, 2993, 50748, 53805, 21418, 6948, 32738, 50288, 86219, 104950, 58314, 32275, -5624, 81654, 181946, 117106, 36299, -30356, -49800, 1237, 45343, 24981, 32908, -4862, -44502, -79827, -94367, -106219, -49107, -6047, 25309, 51640, 8185]
15025H185O0516M1350K4835j6716k4798N235K0335r250m095j522J8833K7676l5736
15012A14848p6122j06403k5109M324j5804l6622R2154J1605K2164k6315k7534
15001f8814L9848N1015j1766k7958K5423K0905l7931p8943l3567l3515j567k2896
14989a79766O7124O3201l4322j4884M8212l7270j0324j179K4061j0759P4544O3797
14977E2435m7472r0438j107N9866N5464K3612j4271j5153q806k5294j804k8066
14965d1034k0449p410L4561L5094r326o4922J6552P5375p774N0302l8157m4835
14953b2023j0469o4466m7748N6753N9953J282k3878K8381M5787K9974k063p8376
14941b6893j1591k6046K3542K9788J174j9377K317j2494M1273k9548O137K4029
$$ y = [8185, 68701, 110051, 134886, 118170, 93372, 98607, 118942, 109692, 105597, 104075, 122908, 150584, 114848, 38726, -67677, -92786, -88462, -104266, -140888, -48734, -37129, -14965, -41280, -68814, -28966, 22049, 10283, -17675, 7748, 28653, -9278, -88221, -121788, -155303, -156870, -179766, -112642, -49441, -83763, -98647, -50435, -87705, -98029, -99208, -75147, -85906, -11362, 52435, 4963, -85475, -86582, -26716, 28748, 52360, 38089, 22936, 14130, -11164, -12968, -41034, -61483, -68893, -34332, 762, -8564, -73486, -56934, 18441, 10667, 60969, 22812, -22023, -32492, -96958, -144706, -87953, -28000, -26718, -50596, -22215, 23572, 53546, 51483, -26893, -38484, -64530, -40988, -11200, -10026, -29403, -27086, -39580, 1693, -27855, -21718, 2311]
14929B311L8093N3153p52k1606q9366K1912L149m9843L896j024P2710n790N54
14916B7397n0687j4719P775q316K0920K285j1969O2578L9800M5200k8990l1002
14904F0272o5341q0991L9389P3801K7475N6413n5503n3657m1957j2436Q4289N7367
14892H9121M337m7470m1640O1443L827m1366k2719P8876k4464l222j6730r5012
14880e5019l8889L5125L0186L081L778l6628m0478M1446L652l0571P3938O6465
14868E6086o539R1832p555k8719r1607j02841n4271q284M7061Q3503J1467J50
14856i717p0257l31L7485K5406K1861O648O67k4922k3247N2402m9361J881R7527
14843F6042R182j4527n6403n7847k9191K4973j5076r3923J9703J9812K4480K8288
$$ y = [2311, 40404, 93557, 92805, 71199, -18167, 3745, 6894, -42949, -39053, -40077, 32633, 26843, 27397, -23290, -38009, -30234, -38550, -17630, -15345, -27314, 35264, 75064, 120264, 91274, 60272, -5069, -86060, -46671, 27130, 54605, 111018, 55515, 1858, -40099, -52535, 31754, 89121, 93458, 45988, 4348, 65791, 69618, 28252, 5533, 84409, 59945, 56723, 39993, -55019, -93908, -58783, -28597, -25516, -21738, -58366, -98844, -57398, -53746, -84317, -10379, 56086, 49547, 141379, 133824, 105105, 13498, -89343, -143614, -151898, -104837, -21334, -9867, -9717, -79974, -80305, -42820, -17414, 4447, 11095, 11762, -13160, -36407, 15995, -33366, -31485, 66042, 75224, 60697, 4294, -53553, -82744, -57771, -72847, -166770, -147067, -127255, -102775, -74487]
14831g4487m6574L1055M2008M7674L5299o0161J1962L6778k6182o8149k9324R7
14819a00004L3546M548O6207k2974j07835L6246O4224k17J3850P584Q359K9185
14807C2719k4904j7721m790l6316j676K7328K5529p089R709l7397M450L0688j1581
14794a1051K7719M9100k2756n7959o8995J0555J5226O1021O5941L3018k4085k1291
14782E6443j0980o7118O7333P0900j1136m9555j1272J0355j6932k1476m3085k2157
14770d8680J3043K3951M2163J265p3328m5262P6959K1373p251J5132K6934r1359
14758d5060j7541L748N7764k251j0533j7196l4396M2124R4990M0993l0761k5332
14746E6549m105m0159r461j1893L6046M7011N137k0360o7611o6435M6938J4252
$$ y = [-74487, -121061, -90006, -47998, -324, 34975, -25186, -13224, 23554, -2628, -70777, -100101, -100004, -66458, -61910, 4297, -18677, -126512, -90266, -26042, -26259, -12409, -4825, 3534, 32719, 7815, -9906, -14696, -51012, -52688, -25360, 169, -6920, 2789, -34608, -30158, 530, -11051, 16668, 65768, 43012, -14947, -83942, -73387, -58161, 2860, 68801, 101819, 77734, 56443, 45463, -21655, 45678, 116578, 105442, 55887, 44615, 54970, 38038, 16562, -26523, -48680, -35637, -11686, 30477, 31742, -41586, -86848, -9889, 11484, 4233, 19365, 46299, -45060, -62601, -58853, -1089, -3340, -13873, -31069, -65465, -23341, 71649, 112642, 81881, 56549, 52444, 12285, 2824, -9069, 26977, 73988, 79125, 58765, -8846, -75281, -28343, -14091]
14734a4091l4601J0041O2465j2888J2632o494L3568l8440j7072k042n314p4214
14722h6450l5921J3128O8115Q4559k3056o9033Q7354j8402q8017q873R517J8485
14710d8594J6131r428L3136J8305j0447m2672l9222k44N3729M9102L5592L5086
14698I0474l9821q6885M2157O6421O422j3757n2573K377m5177l51k5279o47j6881
14685g3520N8181N260n848O4638K4672r2179o1987K0296J20190N9464l387L3221
14673A49001n0216M597n2371o1989O5310J6624n8921m0751J8157N9906J433p5839
14661b5059k3052L5651P7502J3633k0206j5914o4471n95Q619j3970L979p895l1257
14648f3035q833j9035n3184M0077N8406M1149j5150k9852J5507o680p0218L6226
$$ y = [-14091, -48692, -38651, 23814, 10926, 23558, 17064, 50632, 12192, -4880, -6922, -12236, -86450, -122371, -109243, -41128, 43431, 20375, -48658, 38696, 20294, -67723, -76596, -67079, -48594, -32463, -41891, -8755, 9550, -897, -43569, -82791, -83035, -29306, 19796, 55388, 90474, 50653, -36232, 5925, 72346, 78768, 65011, 12438, 14815, -30362, -30713, -55992, -56639, -73520, -15339, -10079, -15927, 48711, 73383, -18796, -80783, -60487, 59703, 119167, 115780, 149001, 98785, 103382, 51011, -10978, 54332, 70956, 12035, -28716, -10559, 49347, 50780, -25059, -48111, -12460, 65042, 78675, 58469, 42555, -21916, -22511, -13892, -27862, -23883, -31778, -63035, -71868, -90903, -144087, -104010, -45604, -4455, -19605, -49457, -33950, -40630, -110848, -74622]
14636g4622J14625O9534k926l7091q0016o0726J34k5710K6435j7288N9652M9267
14624B1268n291J3701N6121q0189l5343N1574L9977m7294n2281k0458k5196m5075
14612a28486K1661N9427K8025K7875r890n5938M9350M4802k510M4038N6201k6133
14600A08422j9139k3775M3559o1005n2655j7245L3707J8953l6493p9090j001J0151
14588g5611K2827M3912O848l8048Q8703P6212o1580l0519l3826l0343K2512O296
14576b617l470J5096k6992l4496m7520K1122L1700k9175P6310J34526k358l1704
14564A00422k0501m7037l5678k0380m6579K4317R5010l6490K466J9936O4718l1771
14552F8433o1164r5339K4478k3357L519J01174K5971l3122m0033O3455J4285p6194
$$ y = [-74622, 40003, 109537, 106611, 69520, -10496, -71222, -71088, -96798, -70363, -87651, -27999, 21268, 15977, 29678, 85799, 5610, -29733, 21841, 61818, 14524, -37757, -58215, -83411, -128486, -106825, -47398, -19373, 8502, -1388, -57326, -7976, 36826, 34316, 78354, 134555, 108422, 89283, 65508, 109067, 48062, -4593, -21838, 11869, 30822, -5671, -84761, -85762, -75611, -52784, -8872, -2024, -40072, 48631, 124843, 63263, 32744, -1082, -31425, -8913, -2617, -6087, 9009, -17983, -52479, -99999, -78877, -47177, -76352, -42, 134484, 132126, 100422, 79921, 32884, -2794, -23174, -69753, -45436, 49574, 13084, 15550, 35486, 100204, 68433, 7269, -88070, -63592, -86949, -83430, 17744, 43715, 10593, -29440, 34015, 48300, -27894]
14540b7894J1949K0763l8967k7486L6468K3842p432J592l087J2096L3441j4486
14528B0799k7518l9158P0339O7599j3152k8498j0107j7628n340m6691K180J4963
14516a2212L703K6987n7336k7151N7828m796j6197J8647k107j3726m3983k8736
14504i9079J9556Q2073J11050n770q0540k4958l0153l0769n459l3488k9319K1206
14492a05650Q1054N0818L313O6822M6491l1568p3037K1928k8525n6040j4801m230
14480d3425Q1538L1645J7257q737p3994n2753N5257J02368o6664q3160N257N7746
14468B2335K7369L9086m5798J6850l743n8746o5150m3995L4742Q0504M5084k2610
14456B5928k407L9477R666j2427p4385n0054q0846Q704M9720M6598K4153j2310
$$ y = [-27894, -15945, 4818, -34149, -61635, -25167, -1325, -8757, -7165, -10252, 1844, 35285, 20799, -6719, -45877, 24462, 92061, 78909, 50411, 40304, 22676, 17336, -29355, -27175, -12212, -8509, 18478, -38858, -66009, -8181, -12977, -29174, -10527, -12634, -26360, -70343, -99079, -79523, 2550, 113600, 107830, 27290, 2332, -27821, -58590, -64049, -97537, -126856, -105650, -24596, 26222, 29535, 96357, 142848, 111280, 38243, 60171, 31646, -24394, -39195, -43425, 38113, 69758, 87015, 78278, 4284, -48469, 6788, 109156, 42492, -40668, -35411, 22335, 49704, 88790, 42992, 59842, 56099, -2647, -67797, -111792, -77050, 3454, 48538, 25928, 23521, 62998, 72664, 60237, -14148, -64202, -145048, -136344, -86624, -40026, -15873, -28183]
14444b8183l894L0358L3500l5641K428k6545l0660q033K0966j153k1579M7005
14432b1431O507j7716m4941J9954L4045m7941L511J9539k2046m1639J0972M1727
14420e9459m2768k4812K2276J5825Q0154L6048m1100J0063M7000k9304m0135l1748
14408e7960L0858N6752j0227k0980m6456Q541m5918j0113L8141M6736L0149K0257
14396C9780j4586k1702j3169p775r785p243l2558l1135k3798J4012K0667n7639
14384a44931l903k9400O8986J02841L9325j8845m8249p5149M1070N2283Q149N5577
14372D7754o4055n5515k7599J0126K2131l0170M0753j6637k7342L7019R093L0304
14360b4138n571M6920m7479K2697N9217J7138m950j1141k6697j202q482L965M0902
$$ y = [-28183, -32077, -1719, 31781, -3860, -1432, -27977, -58637, -66670, -45704, -46857, -68436, -21431, -14924, -32640, -77581, -57627, -23582, -71523, -68012, -48473, -70519, -112158, -101186, -59459, -102227, -127039, -104763, -88938, -8784, 27264, -13836, -3773, 43227, 13923, -26212, -57960, -27102, 29650, 19423, -1557, -48013, -39472, -85390, -95503, -57362, -10626, 19523, 39780, 25194, 3492, -9677, -17452, -27237, -34480, -67038, -98173, -121971, -107959, -87292, -144931, -148834, -178234, -109248, -6407, 32918, 14073, -34176, -109325, -68255, -15972, -7823, 47754, -16301, -71816, -99415, -89289, -67158, -97328, -56575, -73212, -100554, -63535, -54442, -24138, -29709, 17211, -30268, -7571, 51646, 68784, 63834, 52693, 25996, 24794, 16312, 20277, 61179]
14347F1179J5276o7585o3735k2657L8680M0817J3372J0580P5807l6928J6308K5097
14335A06211K1273N931l8394p3807o7893m5136K1861R4702N737l6007K5413N7415
14323G7306j98j40664n9981O2093J0696N7317M4232l5028m184M315l3134J3300
14311c930J3921k8598P0388O358j10857m4935R185j0538K8314M7602N9837K3396
14299F0143P267q797m8477R135R124l9694m0925J6238O7506M2197L7971m4157
14287F7531j0392j5105k567p455P367K9095n1531k0607l0234n4132K6663m0158
14275a01525K5699M9365L3717R839k2605l3176J4964r603J3248K0927J2332K4475
14263C7657n6419J9045K7112j2342Q430j1194k5443q1855P903K1183O116J9532
$$ y = [61179, 76455, 8870, -54865, -77522, -38842, 1975, 15347, 25927, 101734, 64806, 81114, 106211, 127484, 133415, 95021, 21214, -46679, -91815, -69954, 24748, 30485, -5522, 19891, 77306, 77108, -63556, -123537, -61444, -50748, 6569, 50801, 15773, 11589, 15904, -17230, -3930, 9991, -18607, 51781, 58139, -52718, -97653, -88468, -99006, -70692, -23090, 36747, 60143, 67410, 58613, 10136, 19271, 28395, -11299, -52224, -35986, 31520, 73717, 111688, 67531, 57139, 42034, 39467, 32012, 39379, 68474, 16943, -3664, -33898, -88030, -61367, -101525, -75826, -26461, 7256, 17095, -5510, -38686, -23722, -33325, -20077, 850, 13182, 37657, -18762, 283, 27395, 15053, 23483, 12289, -13154, -95009, -87106, -65923, -59807, -40275]
14251d0275J1564Q1170L5346m8787l9768k6299P16P631N589k5020O0778j0094
14239A2551k7181M3086J8080o1298o5389k1968q544L9204p499N4541m5059M0288
14227b9188M6292P4790M924j0356j4384l0142j7662k8550j287p0871M3311M5818
14215A2695m4561K8801q268Q920K0475m4422n2831L1791N7828N827l9588l122
14203b6455O6559j5387k6127o8743n3062L9715N4475J12398N3232l3979o0052
14192D2574r0152k7979K4917M0689J4818m4971k5327L6193k2764m2465k7216L4488
14180h7195j0658q1937K6324N3059J7673K5394J00562O7660Q974J6567l2978l5040
14168F8405p9899K0201L918l4017k517J8233j962J926Q124m6580Q36K2114M717
$$ y = [-40275, -28711, 52459, 87805, 39018, -750, -27049, -26333, -18702, -13113, -38133, 22645, 12551, -14630, 28456, 46536, -14762, -80151, -102119, -110663, -71459, -78958, -24417, -69476, -29188, 17104, 91894, 96818, 86462, 72078, 41936, 24274, -4276, -5563, -76434, -33123, 12695, -31866, -3065, -11333, -2413, 18062, -26360, -79191, -47400, 10428, 16255, -23333, -26455, 40104, 24717, -1410, -70153, -123215, -83500, -29025, 83373, 136605, 102626, 42574, -47578, -75557, -50640, -9951, 4867, -40104, -65431, -29238, -52002, -94467, -121683, -87195, -97853, -179790, -153466, -100407, -82734, -57340, 43222, 110882, 119856, 136423, 103445, 68405, -11494, 8707, 12625, -21392, -23909, -5676, -7638, -5712, 2412, -44168, -43332, -21218, -16501]
14155a6501j5224m7650N3846M9481j1394q630J3278K4675q102m7663r4195N7568
14143e0511K2067k5548j677Q695k775K3669N9341k6944k5231M0739l9823k0247
14131c8245K5341K9707K3237l6649q0210J4865L5189j9108K9845L9761L8213M9125
14119A11071j6109r3134l3097L6154J3815r229M7084k2239q020Q0059k8094N6059
14107A34320J6014k9593q7757n7149k1257j9225K5643P614K5350J0986N5425O302
14095F6673m005Q746m0198j6214P1039J4326J4962l3395m6208j6674L8195P3036
14083A30283j4541l5949r522J5114P28k4159l7263k8001K8626M081k1285k1286
14071a3174k964m3950j6180j3317l379O3988j245l5449k8578N2628J2832m729
$$ y = [-16501, -31725, -79375, -25529, 23952, 12558, 3928, 17206, 41881, 33779, -13884, -108079, -50511, -28444, -53992, -55669, -46974, -49749, -26080, 33261, 6317, -18914, 21825, -17998, -38245, -12904, 16803, 40040, 3391, -76819, -61954, -26765, -45873, -16028, 23733, 61946, 111071, 94962, 1828, -31269, 4885, 18700, 9471, 56555, 34316, 26296, 106355, 78261, 134320, 150334, 120741, 32984, -24165, -45422, -64647, -39004, -31390, -6040, 4946, 60371, 66673, 62668, 71414, 31216, 15002, 86041, 100367, 115329, 81934, 35726, 19052, 57247, 130283, 115742, 79793, 70271, 85385, 86113, 61954, 24691, -3310, 25316, 29397, 8112, -13174, -16138, -60088, -76268, -89585, -92964, -28976, -30221, -65670, -94248, -41620, -28788, -33517]
14059c3517M4513J15m6854k8780M9001o268Q642K3330N0955N508l0739r463M6541
14046G2984M2942j09047o7759J713P351L2423r875K1062n20k8464o0140O617J8246
14033g2467q267Q0562n686j1176r799J1035P1187o1045l6134L7468L5838k1801
14021I715k5495K9388M5562k0899j0846N5957M779j0590p9723J0874k4857p000
14009b3135R0046q924p900J4298P951m8809q5427R67P8960l54k0224m4887k173
13996d9611J2962K2029p540k1663K8566K5273J020L757p134k2426m8953J8595
13984d5125r408j3197l2031J7486J2238J7058o28m0766p945k077J3171M9050O5850
13971B3676M2829M1470J2361k2967l5068k4458n0608R757p488K2703L466j9480
$$ y = [-33517, 10996, 11111, -35743, -64523, -15522, -21790, -13148, 10182, 61137, 66645, 35906, 26443, 72984, 115926, 6879, -60880, -59167, -51816, -19393, -29268, -8206, -8726, -37190, -97330, -90713, -72467, -80734, -172, -5858, -17034, -26833, -15798, 55389, -5656, -41790, -4322, 31516, 9715, -15780, 13608, 59170, 38271, 27425, 83382, 88161, 77571, -2152, 8722, -16135, -23135, 66911, 57987, 50087, 64385, 72336, 23527, -61900, -60933, 18027, 17673, -2551, -47438, -49611, -36649, -14620, -22160, -43823, -15257, 10016, 11036, 14793, 7659, -14767, -63720, -45125, -54533, -67730, -99761, -82275, -70037, -52979, -53607, -94373, -102318, -104395, -91224, -42174, 23676, 66505, 107975, 120336, 97369, 62301, 37843, -12765, -3008, -10496, 12207, 15673, -3807]
13959c807m2201L2904J9042K8002k5904J9569N147K6313L89J8383k1351m3290
13947A3196m3509N1096l3089l5010M4341N3395l1911j5937N8584J6704L3558l0519
13935H0899k4624J5418j1076l4493k3194l8862m1167k2274l47l7268K5052K7425
13923h4511Q37L9562P035J3069l2978K9135N2972N8576j5679q787l1931l6084
13911h784J7440N6975J4476p340k9670m6401n5198P996q518j0675L0794J8309
13899b0596P3681J1094l4026J8845o374k3609j6838J3883j813q857N7536K2658
13887H5584J924j2003q5634m2820K9382K8688N3389O016K0412k8415l0844k4896
13875G83p3062R5038J01690O568n7683j4711k4447N917J1787q9490m9533K196
$$ y = [-3807, -46008, -13104, 5938, 33940, 8036, 27605, 32752, 59065, 59454, 77837, 56486, 13196, -30313, 20783, -12306, -47316, -2975, 50420, 18509, 2572, 61156, 77860, 111418, 80899, 56275, 71693, 60617, 26124, 2930, -35932, -77099, -99373, -99720, -136988, -111936, -84511, -83674, -44112, -37077, -24008, -56986, -27851, 25121, 83697, 68018, 59231, 27300, -8784, 8656, 65631, 80107, 72767, 43097, -3304, -58502, -50506, -59024, -69699, -38905, -20596, 53085, 64179, 30153, 48998, 42624, 19015, 2177, 16060, 14247, 5390, 62926, 85584, 87508, 75505, -10129, -52949, -23567, 5121, 58510, 64526, 84938, 56523, 25679, 783, -72279, 22759, 124449, 131017, 73334, 58623, 34176, 40093, 51880, -37610, -87143, -84947]
13863h4947J9359K5503k6988K286N4378j1357m7572K5038j8691P0543P890o24
13851A4818l6586J5182P1951N939q065P4732L7077m2525l0879q0583p2581J1470
13839d0050J16089M0975n5231o8135k6444K9460M1520J9441j7737o0909p5139
13828i6160O1096R3494j9264J3823R205j4631K0332m2450o4118J4887M4623o046
13816A4791L8370k8930o0835M2805L1544m5544j8293j8233J0061J5048J3190m895
13804a0921k5538l4509Q8046J15115J0476r7219L34L8664k4648p6866K1601L146
13792G681L499l8990M7415M8949l3485m1792o9453j9148O3532L8582L2609O28
13780D0027j4581m4017k3024O875o848p702J6207L2808j6484L7554N738K7944
$$ y = [-84947, -65588, -40085, -67073, -64787, -10409, -21766, -69338, -44300, -62991, 7552, 15442, 14818, -21768, -6586, 65365, 71304, 63239, 137971, 175048, 132523, 101644, 21061, -51520, -40050, 76039, 117014, 61783, -6352, -32796, -3336, 38184, 57625, 39888, -21021, -96160, -35064, 58430, 39166, 52989, 62194, 47563, 67895, 25445, -38673, -23786, 20837, 14791, 53161, 24231, -36604, 6201, 37745, -7799, -26092, -44325, -34264, -19216, -6026, -10921, -36459, -70968, 17078, 132193, 142669, 45450, 45784, 84448, 59800, -17066, 4535, 7681, 11180, -27810, 19605, 68554, 35069, -6723, -76176, -95324, -31792, 6790, 39399, 40027, 25446, -18571, -41595, -34720, -41568, -49270, -33063, -255, -16739, 20815, 26553, 54497]
13768E4497k8354K1346L5598j8785p4199j386J8031L1273K9575o3520m014J00435
13756A00497k1973j1530M847n8756P080L6464m0354Q636Q9243J5744p588k5211
13744I7099p3836m221J436J8915K5663K3704m2754o7678r16M8377R13j301j3957
13731A1444n3436k1809K5949L6038l1748p2625J2264J1803M9142Q4170M7438j7133
13719H1497L5876o8938j10886K4466L2181O0955k8431m3335J1624m6565p824O965
13707e2415m625K5022j8977j3489O247L7455L2597K907r026j0476k4300J5311
13695a3769l6744o224n7172m392M1920K9953j119m4318m6422J9069J41063j2328
13683I517k5840o118K79M5056p4856J4459Q693j441o3156n425L5663K8036k2469
$$ y = [54497, 26143, 47489, 83087, 64302, -9897, -11283, 6748, 38021, 67596, 4076, 62, 100497, 78524, 66994, 71841, 13085, 20165, 56629, 16275, 24911, 114154, 129898, 122310, 97099, 23263, 19042, 20478, 39393, 65056, 88760, 46006, -21672, -22588, 25789, 26702, 25401, 11444, -41992, -63801, -37852, -1814, -33562, -106187, -93923, -82120, -32978, 51192, 98630, 81497, 117373, 48435, -62451, -37985, -5804, 55151, 26720, -16615, -4991, -51556, -59380, -52415, -57040, -32018, -50995, -64484, -58237, -20782, 11815, 14722, 5696, -4780, -29080, -13769, -50513, -56737, -113909, -118301, -76381, -46428, -47547, -91865, -138287, -119218, 21845, 9517, -16323, -22441, -22162, 22894, -51962, -37503, -28810, -30251, -93407, -98832, -63169, -35133, -57602]
13670e7602r0029K8255O0832L2529k4529M6529P3973j0891L681J9698K3366m1766
13658F4046q311J3031L2404n1192k3916M6309N1381l6045L2086J6301m6715l9775
13646D9604M3838k2233m4613M9518N2920J4810l5099m2389m9983l5539K7399L4725
13634D2958p5522K5494Q7648O5075m1237n9995p2633J1916k4543J1828N0657R332
13622C0978j9165k7728L3182K175L3793L4284m5543p2123j2892J8810Q091M4717
13610B8579O1754n715p5860l7094J1706j9367J7795k091K8003o136J16081J1008
13598A28663l7117J6270j25857k1456M1242K789J2770N062K316Q851l5259l1291
13586c3017l880L1853O720N8098K8818q2774k8606N9829o725p8413l8059k2862
$$ y = [-57602, -147631, -119376, -58544, -26015, -50544, -4015, 69958, 59067, 62748, 82446, 105812, 64046, 55735, 68766, 101170, 49978, 26062, 72371, 123752, 87707, 119793, 136094, 89379, 49604, 93442, 71209, 26596, 76114, 129034, 143844, 108745, 66356, 16373, -19166, 8233, 42958, -32564, -7070, 80578, 145653, 104416, 44421, -28212, -16296, -40839, -29011, 21646, 30978, 11813, -15915, 17267, 19442, 53235, 87519, 41976, -30147, -43039, -24229, -16138, 28579, 90333, 84618, 8758, -28336, -16630, -35997, -18202, -20293, 7710, 1574, 117655, 128663, 91546, 107816, -18041, -39497, 1745, 4534, 17304, 22366, 24682, 33533, -1726, -33017, -36897, -5044, 1676, 59774, 88592, 5818, -22788, 37041, 30316, -48097, -86156, -109018]
13574a09018M5908M6852N9557n3620q1195J0139J1536L6205M8666L8316J3935
13563F7281J0257o450r0989j0739J807o9441L4937L4945M2101J9063M9655L8787
13551A21214R452j7270m7986m6461J7427k182j3433P7813O2849J0825l5763k793
13539A33692j8936q0412P258M3038k6365q1210L0934N38j529P0480K7965l972
13527A01481M109k8404l005l8209M895k2716k652M3062k0295k2066k2656m8972
13515e5428J9191J9232M988M262j0128N2045N528N5994o945m4388m1220M715p39
13502G107o0760L8670k1573M6688M1412r079m2432O4151M047k7662m103n330J2040
13489D3176n2304n0229l0255o334M3013M5645o959L7900p452n8357l3164j3607
$$ y = [-109018, -63110, -16258, 43299, -10321, -91516, -81377, -69841, -33636, 15030, 53346, 67281, 77538, 71088, -19901, -30640, -28833, -98274, -63337, -28392, 13709, 32772, 82427, 121214, 130666, 113396, 65410, 18949, 36376, 34194, 20761, 98574, 161423, 172248, 136485, 133692, 114756, 34344, 41602, 84640, 58275, -22935, 7999, 8537, 7008, 77488, 105453, 101481, 105590, 77186, 74181, 35972, 40867, 18151, 15499, 58561, 38266, 16200, -6456, -55428, -36237, -17005, -12017, -7755, -17883, 34162, 39690, 95684, 88739, 44351, 3131, 7846, 7107, -53653, -14983, -36556, 10132, 51544, 42465, 33, 64184, 68231, 40569, 36466, 31136, 43176, -9128, -59357, -89612, -95946, -52933, -7288, -14247, 23653, 16201, -42156, -75320, -88927]
13477h8927m7480O7211k2714J7976M4099j0769k0597m3755P012n33m2693r104
13465a50274L1821R146L2271j7812N3342m513r943j1793k3357O9330L9218l9627
13453b2191J8016N5352l2493K7899j8670j1815K0545j4785n5402j7303j8710P378
13441f2179l0414L4897J15204N3719j19887r5986R71m830O2656L2517M832N1392
13429D2892L7290m5196r7287k6606O1695j3514J0399K3994J10620j4331k3339
13418F6617J5710p139l2099m8526q5304M7897N2301Q7034j1738l1173o9107j05443
13406a20970K5841P964K3994P5795L412m1394J7987p164k8295j5625O344O5242
13394A3131L2158j42799K4416P9048K3467N4382k8306m8006L7117J08646P502
$$ y = [-88927, -136407, -69196, -91910, -73934, -29835, -40604, -61201, -104956, -97944, -98477, -141170, -150274, -118453, -109307, -77036, -94848, -41506, -46019, -55962, -67755, -91112, -21782, 17436, -22191, -4175, 51177, 18684, 46583, 27913, 16098, 36643, 21858, -33544, -50847, -69557, -62179, -92593, -57696, 57508, 111227, -8660, -104646, -103675, -108505, -45849, -13332, -8500, 42892, 80182, 34986, -62301, -88907, -27212, -40726, -30327, -6333, 104287, 89956, 66617, 82327, 75188, 43089, -5437, -90741, -42844, 9457, 96491, 84753, 53580, -15527, -120970, -95129, -87165, -63171, 12624, 16036, -25358, -7371, -14535, -42830, -58455, -52111, 13131, 45289, -97510, -73094, 5954, 29421, 83803, 55497, 7491, 44608, 153254, 160756]
13383A60756j1179K9255o4224m2080J3203j7096j9330K5470K5514n346l6554r714
13371D8675m0689p9718m2600j452L9337J2504L3018n363j3797k3795J6207J8055
13359c9618J1050l0457Q345L189J0918K050J5486J478k2159J0842q85L8673L2950
13346D1862n1967m4753J3874j8383M10J5489K6603J7921j0078M6374R64R26J1958
13333E1200P072M04o136l7688M748k5616l3709k9039l0292j5828Q5786M7126j0746
13320G282k0405J4964j1688L4211L0839J9397o6928o5633J4651K4487k75j0551
13308b9649j2796R008J2422J5178L0938n3551l46K9071N248j01970o2461J8927
13296a39981M2176N6866K4118J2787J52r194n4637l834K3216K6954k1455m0301
$$ y = [160756, 149577, 178832, 114608, 72528, 85731, 68635, 49305, 74775, 100289, 94943, 58389, 48675, 7986, -71732, -114332, -115784, -76447, -63943, -30925, -36288, -50085, -73880, -57673, -39618, -28568, -59025, -50680, -47491, -36573, -34523, -19037, -17559, -39718, -28876, -29761, 8912, 41862, -10105, -54858, -40984, -59367, -58957, -43468, -16865, 1056, -9022, 37352, 38316, 39242, 51200, 58272, 58676, 52540, 14852, 19600, -6016, -39725, -68764, -99056, -114884, -29098, 18028, 7282, -13123, 1841, -9847, 24364, 55203, 74600, 7672, -57961, -43310, -18823, -19098, -29649, -42445, -33437, -21015, -5837, 25101, -28450, -28796, 275, 5523, -96447, -158908, -139981, -97805, -40939, -16821, -4034, -3882, -13076, -67713, -71547, -48331, -21377, -42832, -83133]
13284h3133M3372N1321P26L3550l5298m4558n2546k9139J3873N5342K4277Nk9731
13271e1939L2894P675K1327P6966M5182o477l4367K3485m1526j31750l2301K5401
13259f5430J7036j2589O0823L4376o939O950k3615l3364Q3622O2706q0679o5298
13247b2401k0823J0480L2829j5017L5134J9034j2082m8112R743J4937K5974N7542
13235H7238m196m0141o8717M4220O0042j7144k5523j7763J4937k7573o1771k9403
13223h5794K7264j7793K7563N7395j2764J3722L7414K4265j5611J66k3450o8280
13211c5903p2115K7140J04982O8719N3547j1310n8572J8395r2445l4290R0788
$$ y = [-83133, -39761, 11560, 12286, 45836, 10538, -34020, -86566, -115705, -101832, -46490, -22213, -22208, -51939, -19045, -11370, 9957, 86923, 132105, 125628, 91261, 114746, 73220, -58530, -90831, -65430, -48394, -60983, -160, 34216, 27277, 34227, 10612, -22752, 60870, 123576, 42897, -22401, -43224, -32744, 85, -14932, 20202, 39236, 27154, -20958, -11215, 3722, 29696, 87238, 83042, 42901, -25816, 18404, 78446, 61302, 35779, 18016, 32953, 5380, -56391, -85794, -58530, -76323, -48760, 8635, -4129, 9593, 47007, 71272, 55661, 55827, 32377, -35903, -108018, -80878, 24104, 92823, 146370, 135060, 76488, 94883, 2438, -31852, 58936]
$$ [...]
##END NTUPLES=NMR SPECTRUM
##END=
