##TITLE=Analysis number 307818
Compound Code mo 00632
Project Code adrs
Chemist Name endeavour
##JCAMPDX= 6.0         $$ Bruker NMR JCAMP-DX V2.0
##DATA TYPE= NMR SPECTRUM
##DATA CLASS= NTUPLES
##ORIGIN= Bruker BioSpin GmbH
##OWNER= NMR
$$ XWIN-NMR		Version 3.5
$$ Fri May 13 15:31:11 2005 GMT Daylight Time (UT+1h)  MAYBRIDGE\NMR@NMR_250MHZ
##.OBSERVE FREQUENCY= 250.131544655141
##.OBSERVE NUCLEUS= ^1H
##.ACQUISITION MODE= SIMULTANEOUS (DQD)
##.ACQUISITION SCHEME= undefined
##.AVERAGES= 16
##.DIGITISER RES= 18
##SPECTROMETER/DATA SYSTEM= dpx250
##.PULSE SEQUENCE= zg30
##.SOLVENT NAME= CDCl3
##.SHIFT REFERENCE= (INTERNAL, CDCl3, 0, 16.522)
##AUDIT TRAIL= $$ (NUMBER, WHEN, WHO, WHERE, WHAT)
$$ ##TITLE= Audit trail, XWIN-NMR		Version 3.5
$$ ##JCAMPDX= 5.01
$$ ##ORIGIN= Bruker BioSpin GmbH
$$ ##OWNER= NMR
$$ C:\u/data/dgb/nmr/ADRS/2950/pdata/1/auditp.txt
$$ ##AUDIT TRAIL=  $$ (NUMBER, WHEN, WHO, WHERE, WHAT)
(   1,<2005-05-13 15:30:52.17 +100>,<MAYBRIDGE\NMR>,<NMR_250MHZ>,
      <created by zg, POWCHK disabled, PULCHK disabled
       configuration hash MD5:
       62 19 C7 07 E1 42 D1 B7 37 6C 3D D0 77 39 F9 E6
       data hash MD5: 64K
       2C DC C0 BB EE 5A E2 03 69 C7 9E 53 43 B6 13 8C>)
(   2,<2005-05-13 15:31:04.15 +100>,<MAYBRIDGE\NMR>,<NMR_250MHZ>,
      <Start of raw data processing
       ef LB = 0.3 FT_mod = 6 PKNL = 1 SI = 32K 
       data hash MD5: 32K
       30 33 54 2A 17 D4 B9 4E EB 03 5E 6A C5 0D 91 50>)
(   3,<2005-05-13 15:31:05.92 +100>,<MAYBRIDGE\NMR>,<NMR_250MHZ>,
      <apk 
       data hash MD5: 32K
       45 27 05 82 A4 67 E5 4F 42 73 0C 6C B5 CB 1E F7>)
(   4,<2005-05-13 15:31:06.62 +100>,<MAYBRIDGE\NMR>,<NMR_250MHZ>,
      <abs ABSG = 5 
       data hash MD5: 32K
       E8 2B FA 62 4A 21 45 4B B0 62 3B 30 CA E1 0F A1>)
$$ ##END=
$$ 
$$ hash MD5
$$ 45 51 95 CE 80 B8 63 96 0A 4A 5C 41 B3 70 C1 CE
##$RELAX= 
##$RELAX= 
##$RELAX= 
##$RELAX= 
##$RELAX= 
##$RELAX= 
##$RELAX= 
$$ Bruker specific parameters
$$ --------------------------
##$DU= <C:\u>
##$EXPNO= 2950
##$NAME= <ADRS>
##$PROCNO= 1
##$TYPE= <nmr>
##$USER= <dgb>
##$AMP= (0..31)
100 100 100 100 100 100 100 100 100 100 100 100 100 100 100 100 100 100 
100 100 100 100 100 100 100 100 100 100 100 100 100 100 
##$AQSEQ= 0
##$AQ_mod= 3
##$AUNM= <au_zg>
##$AUTOPOS= <48 >
##$BF1= 250.13
##$BF2= 250.13
##$BF3= 250.13
##$BF4= 250.13
##$BF5= 500.13
##$BF6= 500.13
##$BF7= 500.13
##$BF8= 500.13
##$BYTORDA= 1
##$CFDGTYP= 0
##$CFRGTYP= 5
##$CHEMSTR= <none>
##$CNST= (0..31)
1 1 145 1 1 1 1 1 1 1 1 1 1 1 1 1 1 1 1 1 1 1 1 1 1 1 1 1 1 1 1 1 
##$CPDPRG= <>
##$CPDPRG1= <>
##$CPDPRG2= <>
##$CPDPRG3= <>
##$CPDPRG4= <mlev>
##$CPDPRG5= <mlev>
##$CPDPRG6= <mlev>
##$CPDPRG7= <mlev>
##$CPDPRG8= <mlev>
##$CPDPRGB= <>
##$CPDPRGT= <>
##$D= (0..31)
0 1 0 0 0 0 0 0 0 0.06 0 0 0 0 0 0 0.0002 0 0 0 0 0 0 0 0 0 0 0 0 0 0 
0 
##$DATE= 1115994651
##$DBL= (0..7)
120 120 120 120 120 120 120 120 
##$DBP= (0..7)
150 150 150 150 150 150 150 150 
##$DBP07= 0
##$DBPNAM0= <>
##$DBPNAM1= <>
##$DBPNAM2= <>
$$ [...]
##$SUBNAM7= <"">
##$SUBNAM8= <"">
##$SUBNAM9= <"">
##$SW= 20.6930455092707
##$SWIBOX= (0..15)
0 0 3 0 0 0 0 0 0 0 0 0 0 0 0 0 
##$SW_h= 5175.983436853
##$TD= 65536
##$TD0= 1
##$TE= 296.16
##$TE2= 300
##$TE3= 300
##$TEG= 300
##$TL= (0..7)
0 120 120 120 120 120 120 120 
##$TP= (0..7)
150 150 150 150 150 150 150 150 
##$TP07= 0
##$TPNAME0= <>
##$TPNAME1= <>
##$TPNAME2= <>
##$TPNAME3= <>
##$TPNAME4= <>
##$TPNAME5= <>
##$TPNAME6= <>
##$TPNAME7= <>
##$TPOAL= (0..7)
0.5 0.5 0.5 0.5 0.5 0.5 0.5 0.5 
##$TPOFFS= (0..7)
0 0 0 0 0 0 0 0 
##$TUNHIN= 0
##$TUNHOUT= 0
##$TUNXOUT= 0
##$USERA1= <user>
##$USERA2= <user>
##$USERA3= <user>
##$USERA4= <user>
##$USERA5= <user>
##$V9= 5
##$VALIST= <valist>
##$VCLIST= <CCCCCCCCCCCCCCC>
##$VD= 0
##$VDLIST= <DDDDDDDDDDDDDDD>
##$VPLIST= <PPPPPPPPPPPPPPP>
##$VTLIST= <TTTTTTTTTTTTTTT>
##$WBST= 1024
##$WBSW= 4
##$XGAIN= (0..3)
0 0 0 0 
##$XL= 0
##$YL= 0
##$YMAX_a= 408360
##$YMIN_a= -482806
##$ZGOPTNS= <>
##$ZL1= 120
##$ZL2= 120
##$ZL3= 120
##$ZL4= 120
##$ABSF1= 16.522
##$ABSF2= -4.171173
##$ABSG= 5
##$ABSL= 3
##$ALPHA= 0
##$AQORDER= 0
##$ASSFAC= 0
##$ASSFACI= 0
##$ASSFACX= 0
##$ASSWID= 0
##$AUNMP= <proc_1d>
##$AZFE= 0.1
##$AZFW= 0.1
##$BCFW= 0
##$BC_mod= 0
##$BYTORDP= 0
##$COROFFS= 0
##$CY= 12.5
##$DATMOD= 1
##$DC= 0
##$DFILT= <>
##$DTYPP= 0
##$F1P= 14.0000005364418
##$F2P= -0.99999901652339
##$FCOR= 0.5
##$FTSIZE= 32768
##$FT_mod= 6
##$GAMMA= 0
##$GB= 0
##$INTBC= 1
##$INTSCL= 1
##$ISEN= 128
##$LB= 0.3
##$LEV0= 0
##$LPBIN= 0
##$MAXI= 10000
##$MC2= 0
##$MEAN= 0
##$ME_mod= 0
##$MI= 0
##$NCOEF= 0
##$NC_proc= -3
##$NLEV= 6
##$NOISF1= 0
##$NOISF2= 0
##$NSP= 0
##$NTH_PI= 0
##$NZP= 0
##$OFFSET= 16.522
##$PC= 1
##$PHC0= 130.0517
##$PHC1= 5.851923
##$PH_mod= 1
##$PKNL= yes
##$PPARMOD= 0
##$PSCAL= 4
##$PSIGN= 0
##$REVERSE= no
##$SF= 250.13
##$SI= 32768
##$SIGF1= 0
##$SIGF2= 0
##$SINO= 400
##$SIOLD= 32768
##$SREGLST= <1H.CDCl3>
##$SSB= 0
##$STSI= 32768
##$STSR= 0
##$SW_p= 5175.98343685301
##$SYMM= 0
##$S_DEV= 0
##$TDeff= 65536
##$TDoff= 0
##$TI= <Analysis number 999999
Compound Code 99
Book Reference 9
Project Code 9>
##$TILT= no
##$TM1= 0
##$TM2= 0
##$TOPLEV= 0
##$USERP1= <user>
##$USERP2= <user>
##$USERP3= <user>
##$USERP4= <user>
##$USERP5= <user>
##$WDW= 1
##$XDIM= 32768
##$YMAX_p= 510039865
##$YMIN_p= -64641
$$ End of Bruker specific parameters
$$ ---------------------------------
##NTUPLES= NMR SPECTRUM
##VAR_NAME=  FREQUENCY,     SPECTRUM/REAL,   SPECTRUM/IMAG
##SYMBOL=    X,             R,               I
##VAR_TYPE=  INDEPENDENT,   DEPENDENT,       DEPENDENT
##VAR_FORM=  AFFN,          ASDF,            ASDF
##VAR_DIM=   32768,         32768,           32768
##UNITS=     HZ,            ARBITRARY UNITS, ARBITRARY UNITS
##FACTOR=    0.157963299565203, 1,           1
##FIRST=     4132.6476996994, 0,             0
##LAST=      -1043.33573715361, 0,           0
##MIN=       -1043.33573715361, -64641,      0
##MAX=       4132.6476996994, 510039865,     0
$$ Real data points
##PAGE= N=1
##DATA TABLE= (X++(R..R)), XYDATA
$$ [...]
$$ plain form
20020 9994 5404 5441 3955 3436 4638 8211 11637 14202 11207 7911 5585 8838 7688 11419 21057
20005 21057 17502 16574 14041 6947 1629 2821 8850 5469 7413 9882 3338 77 8686 9673 8709
19990 8709 5741 5038 -1682 -439 1040 6809 9026 12813 7917 -1461 -6622 -8428 -1998 636 3056
19975 3056 6493 8777 9683 8227 10411 8714 10767 6105 -498 1055 2246 4709 3494 363 3863
19960 3863 10522 16734 15881 14324 11559 6547 -1432 -9207 -6044 -6903 -1356 -950 -1351 1057 -3114 -4851
19944 -4851 -900 2097 -46 -30 2839 5341 6448 7749 14373 12693 11912 9158 10321 12381 12396 12503
19928 12503 7345 2483 7170 3793 -4576 -5932 -3907 388 6567 10219 5241 6117 8284 4087 7092
19913 7092 7418 6592 4914 4243 571 -1008 -1599 607 2554 185 -2948 1252 2623 2140 2849 2476
$$ packed form
20020I994m590L7j486n19J202L573L426K565k995l296k326L253j150L731R638
20005B1057l555r28k533p094n318J192O029l381J944K469o544l261Q609R87r64
19990H709k968p03o720J243J479N769K217L787m896r378n161j806O430K634K420
19975C056L437K284R06j456K184j697K053m662o603J553J191K463j215l131L500
19960C863O659O212q53j557k765n012p979p775L163q59N547M06m01K408m171j737
19944d851L951K997k143J6K869K502J107J301O624j680p81k754J163K060J5J07
19928A2503n158m862M687l377q369j356K025M295O179L652m978Q76K167m197L005
19913G092L26q26j678o71l672j579n91K206J947k369l133M200J371m83P09l73
$$ plain form
19897 2476 2363 3681 251 -5916 -3848 -1990 -5783 647 7275 7333 10041 11290 9763 6144 2214
19882 2214 -2489 -4268 -7047 -2961 -2135 -5381 -515 4311 5890 1898 -1277 -5301 -5063 62 4238
19867 4238 11686 15304 12317 8779 6276 12343 17350 19629 20663 14013 6120 -1161 2968 12605 7697
19852 7697 3521 8048 4658 1929 6035 6422 13154 7734 1851 -1150 162 3591 13306 12357 8539
19837 8539 15827 22909 16565 13862 15709 15055 14470 10193 3252 579 822 6680 7909 4457 10524
19822 10524 11321 18487 17950 22235 19654 16073 19509 19163 16521 18427 13549 15034 16093 20388 16095
19807 16095 9465 5720 -390 -895 3043 7098 7213 13389 20050 22976 14838 10468 9521 14347 15568
19792 15568 21318 25181 18638 13455 14503 15269 13446 16181 13551 7782 4979 7728 9733 8728 8871
$$ packed form
19897B476j13J318l430o167K068J858l793O430O628N8K708J249j527l619l930
19882B214m703j779k779M086Q26l246M866M826J579l992l175m024K38N125M176
19867D238P448L618k987l538k503O067N007K279J034o650p893p281M129R637m908
19852G697m176M527l390k729M106L87O732n420n883l001J312L429R715r49l818
19837H539P288P082o344k703J847o54n85m277o941k673K43N858J229l452O067
19822A0524P97P166n37M285k581l581L436l46k642J906m878J485J059M295m293
19807A6095o630l745o110n05L938M055J15O176O661K926q138m370r47M826J221
19792A5568N750L863o543n183J048P66j823K735k630n769k803K749K005j005J43
$$ plain form
19777 8871 6792 9480 8868 8786 7083 4216 8362 11165 15605 15927 14873 14886 11953 14565 18274 19172
19761 19172 15909 16841 12471 5821 3264 -383 1985 6439 8872 2058 870 4777 11872 12466 13144
19746 13144 11566 12259 11635 10066 12535 19192 17171 6150 4549 8237 3776 3988 11185 8838 5230
19731 5230 8728 6206 -1616 -1157 2412 6592 1223 2789 3628 4900 8489 11097 9436 2495 4815
19716 4815 11334 17383 18951 14777 16255 16552 14581 15127 13968 14803 19724 25248 24444 18414 7937
19701 7937 -747 2234 5951 11563 15861 19039 9735 1666 1673 10339 17768 15855 14869 16965 9369 5846
19685 5846 10498 15350 11331 4648 5034 8577 13026 12086 13405 17605 18220 15353 7220 7615 8574 10535
19669 10535 5417 -1517 -153 12343 11633 9005 6043 227 5418 10519 19152 28126 21317 16913
$$ packed form
19777H871k079K688o12q2j703k867M146K803M440L22j054J3k933K612L709Q98
19761A9172l263R32m370o650k557l647K368M454K433o814j188L907P095N94O78
19746A3144j578O93o24j569K469O657k021j1021j601L688m461K12P197k347l608
19731E230L498k522p822M59L569M180n369J566Q39J272L589K608j661o941K320
19716D815O519O049J568m174J478K97j971N46j159Q35M921N524q04o030j0477
19701G937q684K981L717N612M298L178r304q069PQ666P429j913r86K096p596l523
19685E846M652M852m019o683L86L543M449r40J319M200O15k867q133L95R59J961
19669A0535n118o934J364J2496p10k628k962n816N191N101Q633Q974o809m404
$$ plain form
19655 16913 15138 15781 22923 29317 30101 29995 31138 34786 38122 42806 43976 44622 46513 44725 47584
19640 47584 47964 41491 36310 38189 38146 36550 36476 35289 36520 37228 40167 41413 38152 39476 41878 33361
19624 33361 27492 14639 15658 21504 26829 25486 20924 20472 14053 10801 13018 10717 9486 10945
19610 10945 15083 15447 18561 14149 7737 12378 12431 8724 3628 3943 -4984 -5403 8912 15698 16586 11362
19594 11362 11278 12185 4942 5467 8490 7379 8124 8679 15042 18931 20113 14692 20676 22262 16978 13204
19578 13204 10690 12627 12048 10967 12966 17534 20008 17543 16340 17005 13243 6803 13368 15568 18708
19563 18708 23375 29575 28161 29296 38609 44530 44307 42713 37294 35790 33401 30960 31808 27430 24678
19548 24678 28766 33766 38754 39947 41413 43838 44046 39191 36797 31767 25443 22663 18521 20275 23098
$$ packed form
19655A6913j775O43P142O394P84j06J143L648L336M684J170O46J891j788K859
19640D7584L80o473n181J879m3j596p4j187J231P08K939J246l261J324K402q517
19624C3361n869j2853J019N846N325j343m562m52o419l252K217k301j231J459
19610A0945M138L64L114m412o412M641N3l707n096L15q927m19J4315O786Q88n224
19594A1362q4R07p243N25L023j111P45N55O363L889J182n421N984J586n284l774
19578A3204k514J937n79j081J999M568K474k465j203O65l762o440O565K200L140
19563A8708M667O200j414J135R313N921k23j594n419j504k389k441Q48m378k752
19548B4678M088N000M988J193J466K425K08m855k394n030o324k780m142J754K823
$$ plain form
19533 23098 17219 15097 17762 18119 10826 4466 6357 15631 16094 19927 23027 25067 23516 23779 23287
19518 23287 27948 34056 31214 31260 31532 28506 25692 22760 28332 33278 40113 44437 45492 42159 36468
19503 36468 37277 34092 34922 39119 35933 35213 34892 29084 25318 28257 34004 29246 15895 18528 26835
19488 26835 31565 28886 22023 18986 17081 15579 16177 18014 25713 27911 24983 30468 28467 24029 21663
19473 21663 26366 25683 25555 27992 29103 31019 30142 30035 35444 35949 28611 33484 36179 40550 40074 33800
19457 33800 25122 22017 26685 30695 33739 35868 34137 27357 22700 30432 35587 37988 37103 32615 36415
19442 36415 32515 31907 31787 33595 38895 50085 51092 48308 47459 40878 36046 36877 32167 31411 37064
19427 37064 38873 35968 42015 41958 38222 38947 38225 32771 33874 38617 49674 54562 55347 64701 80072
$$ packed form
19533B3098n879k122K665L57p293o360J891R274M63L833L100K040j551K63m92
19518B3287M661O108k842M6K72l026k814k932N572M946O835M324J055l333n691
19503C6468Q09l185Q30M197l186p20l21n808l766K939N747m758j3351K633Q307
19488B6835M730k679o863l037j905j502N98J837P699K198k928N485k001m438k366
19473B1663M703o83j28K437J111J916q77j07N409N05p338M873K695M371m76o274
19457C3800q678l105M668M010L044K129j731o780m657P732N155K401q85m488L800
19442C6415l900o08j20J808N300J1190J007k784q49o581m832Q31m710p56N653
19427C7064J809k905O047n7l736P25p22n454J103M743J1057M888P85R354J5371
$$ plain form
19412 80072 90742 105184 124660 141567 173093 205469 226962 248526 264832 277841 283270 290175
19400 290175 292894 291226 282252 270124 263072 256563 237763 221272 215788 207508 204390 200988 196312
19387 196312 183249 165720 155153 154231 158268 149264 132625 118932 105459 99159 98465 94411 89280
19374 89280 83298 78265 77557 76212 76126 76977 78908 84517 102747 129376 155299 188614 221655 266060
19360 266060 312154 339569 348562 343532 322093 298708 275504 251089 239422 244249 256018 273574
19348 273574 283290 290048 301095 303338 297537 288241 270157 242195 212213 174756 152690 134049
19336 134049 112284 90853 76720 69675 68801 58677 56693 56968 54864 50830 54096 51682 43395 48190
19322 48190 52940 55707 55254 48721 47995 47681 52888 51250 53686 55918 59984 62095 57153 50583 55440
$$ packed form
19412H0072J0670J4442J9476J6907L1526L2376K1493K1564J6306J3009N429O905
19400B90175K719j668q974j2128p052o509j8800j6491n484q280l118l402m676
19387A96312j3063j7529j0567r22M037r004j6639j3693j3473o300o94m054n131
19374H9280n982n033p08j345q6Q51J931N609J8230K6629K5923L3315L3041M4405
19360B66060M6094K7415Q993n030k1439k3385k3204k4415j1667M827J1769J7556
19348B73574R716O758J1047K243n801r296j8084k7962k9982l7457k2066j8641
19336A34049k1765k1431j4133p045q74j0124j984K75k104m034L266k414q287M795
19322D8190M750K767m53o533p26l14N207j638K436K232M066K111m942o570M857
$$ plain form
19307 55440 60475 62302 58994 55455 55379 64830 64399 58386 54937 54237 55929 60093 55921 53897 52320
19292 52320 45678 44537 38902 38508 44487 47007 47347 52821 54134 59795 68193 66559 73930 88603 102788
19277 102788 115336 125324 138323 148095 162406 179789 187017 194168 190272 193933 200048 202230 198584
19264 198584 187438 174917 165564 146083 132404 123374 113071 102925 92298 79440 69125 71342
19252 71342 78094 83712 84552 79098 78969 86433 96008 105721 111910 115775 121985 138513 145208 154656 168386
19237 168386 169586 174739 187835 207826 229282 250643 270711 286436 306107 334530 366450 397537
19225 397537 421505 433356 438272 440862 436535 436241 433113 422588 404239 383779 358308 336223 311992
19212 311992 269293 232785 199662 172799 154384 137981 126929 118487 116267 108535 103236 104180 111011
$$ packed form
19307E5440N035J827l308l539p6R451m31o013l449p00J692M164m172k024j577
19292E2320o642j141n635l94N979K520L40N474J313N661Q398j634P371J4673J4185
19277A02788J2548R988J2999R772J4311J7383P228P151l896L661O115K182l646
19264A98584j1146j2521r353j9481j3679r030j0303j0146j0627j2858j0315K217
19252G1342O752N618Q40n454j29P464R575R713O189L865O210J6528O695R448J3730
19237A68386J200N153J3096J9991K1456K1361K0068J5725J9671K8423L1920L1087
19225C97537K3968J1851M916K590m327k94l128j0525j8349k0460k5471k2085k4231
19212C11992m2699l6508l3123k6863j8415j6403j1052q442k220p732n299R44O831
$$ plain form
19199 111011 120932 134169 151022 161787 174526 200010 223597 245482 271151 290872 307017 324088
19187 324088 346792 372686 396469 418954 430846 436531 442732 449475 457029 460329 457837 452857 451247
19174 451247 443010 424121 400182 386159 369458 348580 328738 300312 279779 257574 225111 192767
19162 192767 176085 158901 142432 124769 117567 110542 98054 99845 110440 108792 116995 124533 131550
19149 131550 129595 130348 143262 155061 166963 188368 208369 227266 244802 247938 251117 262638
19137 262638 276132 282591 291138 295362 289224 287327 275955 262990 258293 255522 238827 223075 202280
19124 202280 185899 177658 174571 166329 146630 130985 124525 118156 116828 112995 107592 106948 106384 110097
19110 110097 110504 105116 102852 98033 98611 97642 100251 105299 113757 118438 116876 113284 116458 120002 121130
$$ packed form
19199A11011R921J3237J6853J0765J2739K5484K3587K1885K5669J9721J6145J7071
19187C24088K2704K5894K3783K2485J1892N685O201O743P554L300k492m980j610
19174D51247q237j8889k3939j4023j6701k0878j9842k8426k0533k2205l2463l2344
19162A92767j6682j7184j6469j7663p202p025j2488J791J0595j648Q203P538P017
19149A31550j955P53J2914J1799J1902K1405K0001J8897J7536L136L179J1521
19137B62638J3494O459Q547M224o138j897j1372j2965m697k771j6695j5752k0795
19124B02280j6381q241l087q242j9699j5645o460o369j328l833n403o44n64L713
19110A10097M07n388k264m819N78r69K609N048Q458M681j562l592L174L544J128
$$ plain form
19095 121130 119679 109482 103130 99189 98148 95512 93507 96798 104132 108121 105448 107343 107230 121046
19081 121046 128313 131154 135281 139292 136859 136498 135853 130224 131856 123556 119042 118925 115226 116849 119643
19066 119643 115089 111380 113971 122355 123235 125567 125681 123241 123718 122184 128102 130311 128823 129133 133478
19051 133478 148524 163855 172204 186948 207066 228755 237763 246000 258177 276634 284108 282426
19039 282426 270194 258853 243355 225677 211508 203736 203487 198105 189785 199033 221937 247064 270013
19026 270013 292328 305097 307544 309272 304702 303500 319958 344833 366028 384490 392670 398098 383006
19013 383006 357012 333531 323747 312308 304705 296979 285994 281503 285221 291764 303326 315201 327299
19000 327299 333808 328376 319294 317463 329512 337398 339117 340861 343674 353325 376007 398529 412799
$$ packed form
19095A21130j451j0197o352l941j041k636k005L291P334L989k673J895j13J3816
19081A21046P267K841M127M011k433l61o45n629J632q300m514j17l699J623K794
19066A19643m554l709K591Q384Q80K332J14k440M77j534N918K209j488L10M345
19051A33478J5046J5331Q349J4744K0118K1689R008Q237J2177J8457P474j682
19039B82426j2232j1341j5498j7678j4169p772k49n382q320R248K2904K5127K2949
19026B70013K2315J2769K447J728m570j202J6458K4875K1195J8462Q180N428j5092
19013C83006k5994k3481r784j1439p603p726j0985m491L718O543J1562J1875J2098
19000C27299O509n432r082j831J2049P886J719J744K813R651K2682K2522J4270
$$ plain form
18987 412799 425687 431724 439402 446558 442775 434450 428896 421719 411642 395234 376588 369212 361437
18974 361437 348114 334649 325227 318342 315303 315025 317545 314931 314828 320493 325604 334620 349066 365316
18960 365316 372120 385380 396347 404602 410252 408659 418384 440348 457125 484689 519842 553744
18948 553744 568794 569573 562401 547791 529977 517896 527079 553292 589018 641613 710611 772070
18936 772070 809479 809970 791779 789077 813820 866545 941753 1029791 1113638 1179811 1239407 1299272
18924 1299272 1361595 1458793 1603368 1796657 1986530 2103106 2117619 2065393 2030699 2061194
18914 2061194 2195779 2413256 2629028 2744936 2742610 2701188 2714682 2786969 2902763 3047694
18904 3047694 3226852 3470073 3800127 4223694 4759047 5524257 6690233 8400015 10657058
$$ packed form
18987D12799J2888O037P678P156l783q325n554p177j0077j6408j8646p376p775
18974C61437j3323j3465r422o885l039k78K520k614j03N665N111R016J4446J6250
18960C65316O804J3260J0967Q255N650j593R725K1964J6777K7564L5153L3902
18948E53744J5050P79p172j4610j7814j2081R183K6213L5726N2595O8998O1459
18936G72070L7409M91j8191k702K4743N2725P5208Q8038Q3847O6173N9596N9865
18924A299272O2323R7198J44575J93289J89873J16576J4513n2226l4694L0495
18914B061194J34585K17477K15772J15908k326m1422J3494P2287J15794J44931
18904C047694J79158K43221L30054M23567N35353P65210J165976J709782K257043
$$ plain form
18895 10657058 13413180 16767538 20724464 24726906 28144950 30966847 33488481 35254030
18887 35254030 35663640 34993690 34143836 32966607 31042188 28920904 27751459 27392803 26809262
18878 26809262 25761719 24973103 25214645 25688664 25147875 23493083 21962093 21787330 22633357
18869 22633357 23019320 21955738 19686422 17648931 16889595 17399357 18442926 18821432 17920347
18860 17920347 16064359 14366323 13489470 13511262 14328673 15738942 17765164 20912327 26009101
18851 26009101 33359042 41893306 48978501 52365126 51923811 49267940 46240863 43228738
18843 43228738 39972699 36443839 32726464 29620011 27963550 27994946 29702226 33153086
18835 33153086 38325332 44383117 49854264 54253394 58044866 60797193 60907311 58062810
$$ packed form
18895A0657058K756122L354358L956926M002442L418044K821897K521634J765549
18887C5254030M09610o69950q49854j177229j924419k121284j169445l58656n83541
18878B6809262j047543p88616K41542M74019n40789j654792j530990j74763Q46027
18869B2633357L85963j063582k269316k037491p59336N09762J043569L78506r01085
18860A7920347j855988j698036q76853K1792Q17411J410269K026222L147163N096774
18851B6009101P349941Q534264P085195L386625m41315k655871l027077l012125
18843D3228738l256039l528860l717375l106453j656461L1396J707280L450860
18835C3153086N172246O057785N471147M399130L791472K752327J10118k844501
$$ plain form
18827 58062810 53843149 49087277 43149660 36073133 29289769 23570558 18684861 14547856
18819 14547856 11379180 9154558 7652648 6649509 5959977 5430069 4977513 4597472 4308909
18810 4308909 4081811 3882981 3711498 3581676 3517955 3562888 3765819 4232308 5064655 6377381
18800 6377381 8034295 9351651 9597011 8621099 7058615 5676890 4678695 4002728 3584487
18791 3584487 3329366 3143758 2992751 2891932 2851159 2877688 2969623 3126717 3326345 3539014
18781 3539014 3697624 3757256 3734744 3684951 3660487 3649280 3650001 3756275 4023344 4441980 4968469
18770 4968469 5558159 6099202 6443650 6507944 6295444 5954622 5597309 5423353 5627778 6291307
18760 6291307 7341743 8655655 10190480 11866841 13311268 14200764 14509571 14357671 13662877
$$ packed form
18827E8062810m219661m755872n937617p076527o783364n719211m885697m137005
18819A4547856l168676k224622j501910j003139o89532n29908m52556l80041k88563
18810D308909k27098j98830j71483j29822o3721M4933K02931M66489Q32347J312726
18800F377381J656914J317356K45360r75912j562484j381725r98195o75967m18241
18791C584487k55121j85608j51007j00819m0773K6529R1935J57094J99628K12669
18781C539014J58610N9632k2512m9793k4464j1207P21J06274K67069M18636N26489
18770D968469N89690N41043L44448O4294k12500l40822l57313j73956K04425O63529
18760F291307J050436J313912J534825J676361J444427Q89496L08807j51900o94794
$$ plain form
18751 13662877 12416639 10889885 9303946 7699771 6232128 5127102 4394487 3930971
18743 3930971 3657994 3509743 3449466 3442940 3484337 3583447 3759091 4041352 4428418 4910828
18733 4910828 5487383 6176940 6964881 7850614 8920476 10370311 12475326 15608013 20146830
18724 20146830 26204776 33573266 41609500 48896614 54004485 55520404 53328072 48379965
18716 48379965 42553033 38087324 36160077 36937153 39760241 43879382 48844196 53926854
18708 53926854 58337642 61637558 64283801 66492110 67139460 65333558 61915451 58440478
18700 58440478 54923798 50230283 44254591 38525347 34233080 30919389 27987819 25551854
18692 25551854 24218359 24490419 26829561 31933509 41027057 55978191 78612895 108444436
$$ packed form
18751A3662877j246238j526754j585939j604175j467643j105026p32615m63516
18743C930971k72977j48251o0277o526M1397R9110J75644K82261L87066M82410
18733D910828N76555O89557P87941Q85733J069862J449835K105015L132687M538817
18724B0146830O057946P368490Q036234P287114N107871J515919k192332m948107
18716D8379965n826932m465709j927247P77076K823088M119141M964814N082658
18708E3926854M410788L299916K646243K208309O47350j805902l418107l474973
18700E8440478l516680m693515n975692n729244m292267l313691k931570k435965
18692B5551854j333495K72060K339142N103948R093548J4951134K2634704K9831541
$$ plain form
18684 108444436 139032925 160414163 165946502 155161949 133809053 107712535 82504434
18677 82504434 61801415 46209413 35305977 28172600 23779785 21407926 20717525 21651603
18669 21651603 24336887 28918866 35290676 43202671 52113999 60536550 66897444 69955771
18661 69955771 69674988 66692581 61411384 55194826 49403288 45262026 43127098 42019105
18653 42019105 40913927 39345630 38045667 37904636 38916800 40535538 42332764 43746751
18645 43746751 43919668 42695236 40996179 39383407 36748020 32455377 27468944 23285483
18637 23285483 19902783 16716849 13603098 10927327 8892768 7407028 6315729 5480924
18629 5480924 4809360 4265106 3851515 3560184 3360979 3217417 3116008 3080229 3134630 3307762
$$ packed form
18684A08444436L0588489K1381238N532339j0784553k1352896k6096518k5208101
18677H2504434k0703019j5592002j0903436p133377m392815k371859o90401R34078
18669B1651603K685284M581979O371810P911995Q911328Q422551O360894L058327
18661F9955771k80783k982407n281197o216558n791538m141262k134928j107993
18653D2019105j105178j568297j299963j41031J012164J618738J797226J413987
18645D3746751J72917j224432j699057j612772k635387m292643m986433m183461
18637B3285483l382700l185934l113751k675771k034559j485740j091299q34805
18629E480924o71564n44254m13591k91331j99205j43562j01409l5779N4401J73132
$$ plain form
18619 3307762 3610426 4051454 4591426 5134320 5697225 6415968 7430157 8502585 9144752
18610 9144752 9222703 9082099 9261022 9664731 9677159 9026925 7991850 7188622 6774993 6517290
18600 6517290 6248112 5936224 5638634 5385430 5206127 5154862 5075186 4793247 4312776 3849651
18590 3849651 3480668 3119165 2722136 2318327 1996235 1787446 1687552 1670401 1717400 1811517
18580 1811517 1949991 2133898 2339530 2503513 2605260 2646847 2597351 2454203 2244236 2011756
18570 2011756 1787785 1611611 1496735 1428737 1404220 1417177 1476249 1607451 1828435 2184774
18560 2184774 2746781 3606535 4818838 6306374 7661875 8188341 7598788 6288128 5025756
18551 5025756 4131515 3560463 3217576 3032731 2948823 2926211 2955711 3037731 3173131 3367556
$$ packed form
18619C307762L02664M41028N39972N42894N62905P18743J014189J072428O42167
18610I144752P7951j40604J78923M03709J2428o50234j035075q03228m13629k57703
18600F517290k69178l11888k97590k53204j79303n1265p9676k81939m80471m63125
18590C849651l68983l61503l97029m03809l22092k08789r9894j7151M6999R4117
18580A811517J38474J83907K05632J63983J01747M1587m9496j43148k09967k32480
18570B011756k23971j76174j14876o7998k4517J2957N9072J31202K20984L56339
18560B184774N62007Q59754J212303J487536J355501N26466n89553j310660j262372
18551E025756q94241n71052l42887j84845q3908k2612K9500Q2020J35400J94425
$$ plain form
18541 3367556 3621762 3958459 4427618 5094777 6053280 7450743 9486079 12310909 15841680
18532 15841680 19901986 24689640 30567373 37063477 42704613 46929938 50734639 54515832
18524 54515832 56464228 55295871 52402063 49654036 46586976 42180852 37165325 33298360
18516 33298360 31113244 30193958 30317281 31655265 33995034 36601306 39204367 42280699
18508 42280699 46005813 49426864 51072623 49957927 45782745 39463636 32682678 26729202
18500 26729202 21907514 18199316 15699761 14483660 14523531 15680919 17358949 18374693
18492 18374693 18029176 16812578 16033673 16510490 18337774 20890753 22689552 22780232 21767852
18483 21767852 21395852 22475310 24106028 25002128 24832522 24624172 25442859 26943418 27935642
$$ packed form
18541C367556K54206L36697M69159O67159R58503J397463K035336K824830L530771
18532A5841680M060306M787654N877733O496104N641136M225325L804701L781193
18524E4515832J948396j168357k893808k748027l067060m406124n015527l866965
18516C3298360k185116r19286J23323J337984K339769K606272K603061L076332
18508D2280699L725114L421051J645759j114696m175182o319109o780958n953476
18500B6729202m821688l708198k499555j216101L9871J157388J678030J015744
18492A8374693l45517j216598p78905M76817J827284K552979J798799R0680j012380
18483B1767852l72000J079458J630718Q96100j69606k08350Q18687J500559R92224
$$ plain form
18474 27935642 28196401 28769894 30455142 32386754 33531703 34098279 34703811 34783666 33427176
18465 33427176 31024327 28646229 26191765 22993978 19229736 15784033 12981209 10566335
18457 10566335 8416226 6668171 5392934 4510915 3927792 3548793 3287760 3076586 2888938
18448 2888938 2729777 2628039 2601537 2637684 2651728 2552119 2336114 2097166 1921520 1811619
18438 1811619 1764065 1772209 1766278 1679719 1503784 1301803 1147194 1042184 984676 957156 938897
18427 938897 900971 841447 765010 689959 629503 586572 562837 563246 584402 601993 592498 554928
18415 554928 503063 459129 431509 407430 388313 384428 393113 404817 421946 438310 440513 422967
18403 422967 392945 371594 355699 341959 328132 321472 328073 330256 327562 327254 325765 312974 295065
$$ packed form
18474B7935642K60759N73493J685248J931612J144949N66576O05532P9855j356490
18465C3427176k402849k378098k454464l197787l764242l445703k802824k414874
18457A0566335k150109j748055j275237q82019n83123l78999k61033k11174j87648
18448B888938j59161j01738k6502L6147J4044r9609k16005k38948j75646j09901
18438A811619m7554Q144n931q6559j75935k01981j54609j05010n7508k7520j8259
18427I38897l7926n9524p6437p5051o0456m2931k3735M09K1156J7591r495l7570
18415E54928n1865m3934k7620k4079j9117l885Q685J1704J7129J6364K203j7546
18403D22967l0022k1351j5895j3740j3827o660O601K183k694l08j489j2791j7909
$$ plain form
18390 295065 279585 267278 260275 251738 246141 247240 254532 251121 245035 245572 251965 251299 248781 242011
18376 242011 235229 238006 233300 222227 209736 201709 198073 198188 215122 230414 254797 277562 301631
18363 301631 326350 358112 395340 414876 430500 443753 437918 426422 410355 390397 366260 335611
18351 335611 312940 298503 289540 277176 259200 250549 252797 263118 265489 259360 251733 243030 225427
18338 225427 218832 226824 234649 232856 228273 229517 234577 236892 247259 259612 285035 320317 347053
18325 347053 346203 317780 278766 262483 256300 257551 275045 278390 281250 272446 249615 221358 203711
18312 203711 188058 177066 170030 166803 170611 183208 207083 232610 250016 257731 263470 276006
18300 276006 286935 276985 249979 227747 206030 182343 162410 142666 120026 100104 94922 89752
$$ packed form
18390B95065j5480j2307p003q537n597J099P292l411o086N37O393o66k518o770
18376B42011o782K777m706j1073j2491q027l636J15J6934J5292K4383K2765K4069
18363C01631K4719L1762L7228J9536J5624J3253n835j1496j6067j9958k4137l0649
18351C35611k2671j4437q963j2364j7976q651K248J0321K371o129p627q703j7603
18338B25427o595P992P825j793m583J244N060K315J0367J2353K5423L5282K6736
18325C47053q50k8423l9014j6283o183J251J7494L345K860q804k2831k8257j7647
18312B03711j5653j0992p036l227L808J2597K3875K5527J7406P715N739J2536
18300B76006J0929r950k7006k2232k1717k3687j9933j9744k2640j9922n182n170
$$ plain form
18288 89752 87808 89129 83340 81267 84341 79489 78149 79737 80874 84890 88622 87896 87136 94463 95444
18273 95444 85758 82864 83788 84554 88447 91576 93557 92154 85463 82040 76141 74369 73870 73541 75849
18258 75849 80089 81483 78421 73480 76320 79668 67862 63392 65249 69218 67968 65875 67192 67398
18244 67398 60495 51612 54670 54929 60217 64211 67178 71979 84553 100004 118616 138786 162746
18231 162746 179582 200509 223678 238452 251349 264162 271931 273333 275691 275329 261262 247698
18219 247698 238718 229219 207388 180402 158372 139464 123322 107531 94323 85049 79994 82411
18207 82411 86548 94513 98027 94097 92116 94657 105257 113052 118499 128033 135156 144883 150928 161468
18193 161468 183289 204140 222414 239442 266035 295439 328963 363633 397716 418920 444101
$$ packed form
18288H9752j944J321n789k073L074m852j340J588J137M016L732p26p60P327R81
18273I5444r686k894R24P66L893L129J981j403o691l423n899j772m99l29K308
18258G5849M240J394l062m941K840L348j1806m470J857L969j250k093J317K06
18244F7398o903q883L058K59N288L994K967M801J2574J5451J8612K0170K3960
18231A62746J6836K0927K3169J4774J2897J2813P769J402K358l62j4067j3564
18219B47698q980r499k1831k6986k2030j8908j6142j5791j3208r274n055K417
18207H2411M137P965L514l930j981K541J0600P795N447R534P123R727O045J0540
18193A61468K1821K0851J8274J7028K6593K9404L3524L4670L4083K1204K5181
$$ plain form
18182 444101 459422 470977 491012 503995 511010 505821 490461 470850 448634 431615 415115 395069
18170 395069 358811 319095 280244 246787 217745 195861 175699 155488 138574 123918 107341
18159 107341 99322 101177 103930 106673 110354 111125 121388 132654 143152 154809 168979 182362 195518
18146 195518 222205 247267 269117 292969 322373 342183 359392 380395 403507 420231 443513
18135 443513 466049 476356 483495 484222 484496 481877 469844 449756 431383 415709 402391 390914 378316
18122 378316 370740 371494 378226 389600 416461 455704 521809 613447 770582 1027259 1437588 2109821
18110 2109821 3240523 5125832 7967314 10977425 12071503 10483865 7421440 4931632
18102 4931632 3336191 2284899 1607798 1189049 914892 725570 602966 521832 463892
$$ packed form
18182D44101J5321J1555K0035J2983P015n189j5360j9611k2216j7019j6500k0046
18170C95069l6258l9716l8851l3457k9042k1884k0162k0211j6914j4656j6577
18159A07341q019J855K753K743L681P71J0263J1266J0498J1657J4170J3383J3156
18146A95518K6687K5062K1850K3852K9404J9810J7209K1003K3112J6724K3282
18135D43513K2536J0307P139P27K74k619j2033k0088j8373j5674j3318j1477j2598
18122C78316p576P54O732J1374K6861L9243O6105R1638J57135K56677M10329O72233
18110B109821J130702J885309K841482L010111J094078j587638l062425k489808
18102D931632j595441j051292o77101m18749k74157j89322j22604q1134n7940
$$ plain form
18093 463892 417009 381733 347466 324056 314390 305172 295136 276497 253143 232303 221460 209491
18081 209491 194857 182697 173658 161221 146638 137738 123649 110422 99164 85074 77759 75473
18069 75473 73815 69387 54169 45576 38794 41740 39865 41733 41714 42287 37902 35500 34101 30177 36435
18054 36435 42076 41832 42232 45807 45155 49520 55171 50892 45271 41626 36751 31941 31550 25184 19588
18039 19588 21011 29699 31091 30616 32449 29822 27478 30698 29356 26619 19893 26189 35025 36232 33294
18024 33294 33459 32046 40615 49661 58221 61332 69992 89349 106219 131936 151682 178109 207102
18011 207102 230619 253952 273629 278020 272713 264098 252096 244133 230091 220814 216294 224973 240112
17998 240112 253179 273930 291793 304435 308763 297006 268562 237284 198896 160134 127495 107652
$$ packed form
18093D63892m6883l5276l4267k3410r666r218j0036j8639k3354k0840j0843j1969
18081B09491j4634j2160r039j2437j4583q900j4089j3227j1258j4090p315k286
18069G5473j658m428j5218q593o782K946j875J868j9N73m385k402j399l924O258
18054C6435N641k44M00L575o52M365N651m279n621l645m875m810l91o366n596
18039A9588J423Q688J392m75J833k627k344L220j342k737o726O296Q836J207k938
18024C3294J65j413Q569R046Q560L111Q660J9357J6870K5717J9746K6427K8993
18011B07102K3517K3333J9677M391n307q615j2002p963j4042r277m520Q679J5139
17998B40112J3067K0751J7863J2642M328j1757k8444l1278l8388l8762l2639j9843
$$ plain form
17986 107652 91779 83739 73034 66118 68263 68186 72451 83919 88777 86875 84548 88601 98399 110462
17972 110462 117850 116590 126877 142463 153753 164755 172924 184073 188926 187303 186079 186138 198780
17959 198780 215249 228287 233316 240425 247533 245482 246464 246911 245320 235342 216394 196467 178675
17946 178675 164101 138554 109434 86315 69180 58325 47794 39927 31276 31500 32780 34138 30756
17933 30756 23442 21020 14939 11505 14419 14239 11295 17020 22241 23732 22134 19694 23039 20232 19685
17918 19685 14796 12578 6033 314 5445 9187 9515 18198 14571 5810 -1014 -516 2626 5309 8572
17903 8572 4499 -469 9830 12950 8656 2614 -1932 -4355 -2334 3740 10016 6514 4783 3792 5395
17888 5395 6254 599 2983 2449 577 -1208 2873 -643 -1872 -2118 1608 2918 101 -4309 -3378 1534
$$ packed form
17986A07652j5873q040j0705o916K145p7M265J1468M858j902k327M053R798J2063
17972A10462P388j260J0287J5586J1290J1002Q169J1149M853j623j224N9J2642
17959A98780J6469J3038N029P109P108k051R82M47j591r978j8948j9927j7792
17946A78675j4574k5547k9120k3119j7135j0855j0531p867q651K24J280J358l382
17933C0756p314k422o081l434K914j80k944N725N221J491j598k440L345k807n47
17918A9685m889k218o545n719N131L742L28Q683l627q761o824M98L142K683L263
17903H572m073m968J0299L120m294o042m546k423K021O074O276l502j731r91J603
17888E395Q59n655K384n34j872j785M081l516j229k46L726J310k817m410R31M912
$$ plain form
17872 1534 2063 1507 -1073 -2650 1517 6613 9892 5805 4727 4210 -2275 -2978 9681 7416 7568 906
17856 906 -906 187 2274 5710 3156 3989 6486 5095 3241 6508 10127 8206 6286 -1280 569
17841 569 2459 5698 10800 7141 -2262 305 641 -7432 -2532 -865 3600 5612 1734 -2082 -3917
17826 -3917 5175 4478 -1903 -10054 -10053 -8661 -9207 -5258 -2698 -4737 102 1660 -389 -5341 -8588 -1820
17810 -1820 -92 5524 9028 7867 586 325 -2570 2501 6662 7323 6974 4847 7257 8389 15246
17795 15246 11951 9947 3565 1561 463 103 774 3811 1775 -1315 -2098 -2011 -8351 -10391 -11202 -7308
17779 -7308 2695 6711 6971 7391 1805 -4701 -2499 3752 4944 1756 4008 1739 -2669 -824 -140
17764 -140 4141 8075 7888 7152 8268 4732 7564 15271 11007 7722 4079 2173 1458 -763 -3154 1526
$$ packed form
17872A534N29n56k580j577M167N096L279m087j078n17o485p03J2659k265J52o662
17856I06j812J093K087L436k554Q33K497j391j854L267L619j921j920p566J849
17841E69J890L239N102l659r403K567L36q073M900J667M465K012l878l816j835
17826c917R092o97o381q151JJ392n46L949K560k039M839J558k049m952l247O768
17810a820J728N616L504j161p281k61k895N071M161O61l49k127K410J132O857
17795A5246l295k004o382k004j098l60O71L037k036l090p83Q7o340k040q11L894
17779g308J0003M016K60M20n586o506K202O251J192l188K252k269m408J845O84
17764a40M281L934j87p36J116l536K832P707m264l285l643j906p15k221k391M680
$$ plain form
17748 1526 4606 4645 5698 10518 5411 648 -2172 -3129 -3431 -1557 -3101 -9410 -9556 -2401 1860 1903
17732 1903 4748 6313 -1717 -6849 -3512 2488 9272 8434 -261 -4316 -8066 -9114 -8399 -1028 5433
17717 5433 6504 3355 -965 1311 -2528 -1261 -106 -2006 -386 -3728 -6325 -5841 -1230 5715 2753
17702 2753 -3985 -6603 -6850 -96 -2103 -131 614 -880 -65 -5877 -7025 -5603 2332 6475 8924
17687 8924 10891 8754 6113 6558 6517 5789 6528 6576 4845 9400 14616 10737 465 2214 -2896 -6413
17671 -6413 319 5422 11514 10455 8311 8880 7934 3607 6488 3649 3553 7535 4399 -2119 -5755 1475
17655 1475 11242 9338 8133 8791 1874 -4685 -9223 -6919 -5677 -732 -2797 1751 1274 4141 795
17640 795 3238 3306 -3796 -4310 -1247 -4158 -1060 -954 -2597 -3075 -1447 -1748 -4886 -2763 -2979 2721 2327
$$ packed form
17748A526L080L9J053M820n107m763k820r57l02J874j544o309j46P155M261M3
17732A903K845J565q030n132L337O000O784q38q695m055l750j048P15P371O461
17717E433J071l149m320K276l839J267J155j900J620l342k597M84M611O945k962
17702B753o738k618k47O754k007J972P45j494Q15n812j148J422P935M143K449
17687H924J967k137k641M45m1p28P39M8j731M555N216l879j0272J749n110l517
17671f413O732N103O092j059k144N69r46m327K881k839r6L982l136o518l636P230
17655A475R767j904j205O58o917o559m538K304J242M945k065M548m77K867l346
17640G95K443O8p102n14L063k911L098J06j643m78J628l01l138K123k16N700l94
$$ plain form
17623 2327 -1193 -3086 -556 791 996 70 -1045 -9110 -8120 -8480 -9278 -5272 -3386 2441 2146 -602
17607 -602 -2394 -1446 6939 10987 10310 510 -2549 942 2850 3299 2820 5437 11039 8455 -500 -3773
17591 -3773 -151 5446 1551 -65 -209 -1370 1923 -11 4258 10011 12127 5833 3010 5128 2737
17576 2737 4865 1134 3416 1704 -1183 -14 5338 5862 3650 5097 7521 -2447 -3672 -4770 -11772
17561 -11772 -11425 -5175 2155 8337 4035 3874 3580 -84 4877 12015 16336 13554 7619 1498 -1725
17546 -1725 -105 2743 -557 -938 5946 9731 4222 3522 714 -2678 -2901 -1567 2671 327 2617
17531 2617 4381 9533 8286 4315 1930 2102 7251 5889 5153 2805 402 2301 2063 1246 2033 3677
17515 3677 6720 10547 11341 6643 546 -1714 1807 11420 3215 -5701 -4824 -7923 -4667 1435 1591
$$ packed form
17623B327l520j893K530J347K05r26j115q065R90l60p98M006J886N827k95k748
17607f02j792R48Q385M048o77r800l059L491J908M49m79K617N602k584q955l273
17591c773L622N597l895j616j44j161L293j934M269N753K116o294k823K118k391
17576B737K128l731K282j712k887J169N352N24k212J447K424r968j225j098p002
17561a1772L47O250P330O182m302j61k94l664M961P138M321k782n935o121l223
17546a725J620K848l300l81O884L785n509p00k808l392k23J334M238k344K290
17531B617J764N152j247l971k385J72N149j362p36k348k403J899k38q17P87J644
17515C677L043L827P94m698o097k260L521R613q205q916Q77l099L256O102J56
$$ plain form
17500 1591 -836 1562 4068 1279 -2920 -8676 -8051 -2031 -1826 -6896 -12503 -3497 -1213 -1949 -3233
17485 -3233 -9583 -8505 -4162 -164 -1233 -5901 -7112 -6908 -1440 2649 676 -1388 -2204 381 4175
17470 4175 3351 4697 5819 10179 9658 -673 -7631 -14729 -16718 -14237 -2979 6286 7359 3414 3072
17455 3072 4811 6947 6845 3049 515 715 221 21 -7813 -16229 -10691 -4363 1471 20820 37576
17440 37576 55261 66863 62971 41911 19857 7266 5539 2856 8587 13360 11527 14464 12292
17427 12292 6486 10521 13670 25402 34038 25881 16497 8420 9345 10449 6954 4989 1563 -326
17413 -326 97 4439 -2740 -6324 -8003 -8862 -4190 1681 4921 -2263 -6405 -8668 -3255 672 -1837
17398 -1837 -2381 -4877 -4406 2750 9201 7053 2057 7142 5237 2874 4730 9264 7096 3275 3630
$$ packed form
17500A591k427K398K506k789m199n756O25O020K05n070n607R006K284p36j284
17485c233o350J078M343L998j069m668j211K04N468M089j973k064q16K585L794
17470D175q24J346J122M360n21j0331o958p098j989K481J1258R265J073l945l42
17455C072J739K136j02l796k534K00m94k00p834q416N538O328N834J9349J6756
17440C7576J7685J1602l892k1060k2054j2591j727k683N731M773j833K937k172
17427A2292n806M035L149J1732Q636q157r384q077R25J104l495j965l426j889
17413c26M23M342p179l584j679q59M672N871L240p184m142k263N413L927k509
17398a837n44k496M71P156O451k148m996N085j905k363J856M534k168l821L55
$$ plain form
17383 3630 1075 1675 -3766 -6388 -4943 -8451 -12546 -13957 -12399 -11506 -8676 -7386 -2434 -1555 1709
17368 1709 7160 3932 5421 13258 18088 22289 28056 27464 24088 19492 14026 15952 16913 16937 22253 20087
17352 20087 12363 1795 681 -5174 -5351 -2506 -395 9022 16269 25367 27350 22123 12445 1641
17338 1641 -5466 154 1755 1843 4603 7568 5018 3422 3225 -3627 -9009 -8081 -6193 -10897 -9278 2516
17322 2516 8015 9226 7843 5777 410 3628 10335 9405 10962 12362 8420 1473 -2310 -1787 -961
17307 -961 -193 5958 6166 5960 1120 484 -830 -4790 -2292 -738 5537 373 -5248 -9278 -11372 -6955
17291 -6955 -6707 449 1521 -4330 -1024 -1447 -3113 -2804 -3843 -1049 -1913 2373 1274 -864 -964 -220
17275 -220 -1989 4351 11762 8767 2175 -3321 -5989 4528 2798 -8 1051 3900 6943 -980 -4076
$$ packed form
17383C630k555O00n441k622J445l508m095j411J558Q93K830J290M952Q79L264
17368A709N451l228J489P837M830M201N767n92l376m596n466J926R61K4N316k166
17352B0087p724j0568j114n855j77K845K111R417P247R098J983n227r678j0804
17338A641p107N620J601Q8K760K965k550j596j97o852n382R28J888m704J619J1794
17322B516N499J211j383k066n367L218O707r30J557J400l942o947l783N23Q26
17307i61P68O151K08k06m840o36j314l960K498J554O275n164n621m030k094M417
17291f955K48P156J072n851L306m23j666L09j039K794q64M286j099k138j00P44
17275b20j769O340P411k995o592n496k668J0517j730k806J059K849L043p923l096
$$ plain form
17260 -4076 -4733 -3766 -9285 -7114 -7318 -4446 3967 -1693 -182 -112 -1653 -647 -172 6024 8119 7926
17244 7926 4122 4719 8081 7986 4248 6636 4454 1328 2713 4762 1862 7674 14765 8828 -350
17229 -350 6108 13254 12515 8229 11376 10490 8203 1659 -3018 -6122 -7677 -7721 -5588 -1364 1154 2157
17213 2157 -2190 1968 3486 3056 -367 -3280 -10566 -14544 -14639 -10035 -8423 -7575 -8089 -10692 -9261 522
17197 522 1042 -512 1939 5255 9967 12195 9401 4870 6306 4105 8923 13034 10819 7636 1919
17182 1919 -3566 225 2928 2705 925 -2487 -516 2460 6408 5414 764 760 -43 -2634 -7930 -14670
17166 -14670 -15055 -9096 -11177 -9387 -3534 4415 1243 -8080 -7424 -10659 -14003 -7467 -5490 -10121 -5711
17151 -5711 174 -142 -5588 -7214 2248 2636 -1461 -1695 1544 3102 -973 -8014 -8166 -8112 -4142 -2037
$$ packed form
17260d076o57R67n519K171k04K872Q413n660J511P0j541J006M75O196K095j93
17244G926l804N97L362r5l738K388k182l126J385K049k900N812P091n937r178
17229c50O458P146p39m286L147q86k287o544m677l104j555m4K133M224K518J003
17213B157m347M158J518m30l423k913p286l978r5M604J612Q48n14k603J431R783
17197E22N20j554K451L316M712K228k794m531J436k201M818M111k215l183n717
17182A919n485L791K703k23j780l412J971K976L948r94m650mq03k591n296o740
17166a4670l85N959k081J790N853P949l172r323O56l235l344O536J977m631M410
17151e711N885l16n446j626R462L88m097k34L239J558m075p041j52N4L970K105
$$ plain form
17135 -2037 -580 -8375 -17858 -15115 -6098 -4630 -7637 -3341 -2802 -8822 -14802 -10527 -3697 1322 4189
17120 4189 4112 -2196 -1995 1266 -1438 -4731 -1995 -1149 -1598 -3386 -2892 -4445 -7706 -10581 -5312 7525
17104 7525 2802 -505 -3603 -6607 -4163 5139 6024 5461 8803 5431 -3724 -7124 -17355 -19609 -12555
17089 -12555 -6424 -6116 -261 -5846 -11779 -12470 -13100 -11740 -8604 -9635 -4611 165 -4494 -3057 -6460
17074 -6460 -10157 -14075 -13389 -13867 -13971 -15002 -14497 -11149 -11705 -7809 -7301 -5931 -6910 -4824 -2208 -758
17058 -758 -3756 -3755 -7579 -8786 -10593 -14057 -16404 -11713 -11060 -7476 -1717 -6969 -6237 -9702 -11127 -2232
17042 -2232 -5861 -5449 -696 6728 6617 -4231 -12537 -10665 -5683 1560 4380 4190 -314 110 -3221
17027 -3221 -582 8018 9823 2728 -3822 -7550 -11087 -5905 -6240 -4022 -5181 -8140 -2890 -4220 -811
$$ packed form
17135b037J457p795r483K743R017J468l007M296N39o020n980M275O830N019K867
17120D189p7o308K01L261k704l293K736Q46m49j788M94j553l261k875N269J2837
17104G525m723l307l098l004K444R302Q85n63L342l372r155l400j0231k254P054
17089a2555O131L08N855n585n933o91o30J360L136j031N024M776m659J437l403
17074f460l697l918O86m78j04j031N05L348n56L896N08J370r79K086K616J450
17058g58k998Jl824j207j807l464k347M691O53L584N759n252P32l465j425Q895
17042b232l629M12M753P424j11j0848q306J872M982P243K820j90m504M24l331
17027c221K639Q600J805p095o550l728l537N182l35K218j159k959N250j330L409
$$ plain form
17012 -811 2192 8843 8178 1380 -3963 -7888 -6212 -2824 601 2700 3100 3927 10511 11374 3942 -5320
16996 -5320 -9007 -9473 -9135 -11555 -8781 -1641 3853 4592 1053 2190 3134 2400 2238 1296 -2368 -2114 2801
16979 2801 4754 2969 3191 101 -1743 -3589 -6946 -5427 -1572 -5785 -9861 -5857 -1827 -1619 2317
16964 2317 4096 6682 3804 8731 8904 6598 4140 4813 6717 3652 1546 1007 966 2174 3313 2764
16948 2764 -643 -3944 -4852 -6859 -4813 3566 5039 2846 5909 -517 -892 903 -1860 -3910 556
16933 556 8775 9347 6221 1881 6268 2197 -425 3547 12695 13464 8729 4323 6873 1947 4750
16918 4750 2861 -1581 -1942 -456 -1378 3571 7713 12574 10221 9399 14772 21584 20824 21834 18654 11379
16902 11379 6803 13092 15711 11384 9596 11897 20117 27910 30434 32640 31544 29877 31492 40441
$$ packed form
17012h11L003O651o65o798n343l925J676L388L425K099M00Q27O584Q63p432r262
16996e320l687m66L38k420K774P140N494P39l539J137R44p34j62r42l664K54M915
16979B801J953j785K22l090j844j846l357J519L855m213m076M004M030K08L936
16964B317J779K586k878M927J73k306k458O73J904l065k106n39m1J208J139n49
16948B764l407l301r08k007K046Q379J473k193L063o426l75J795k763k050M466
16933E56Q219N72l126m340M387m071k622L972R148P69m735m406K550m926K803
16918D750j889m442l61J486r22M949M142M861k353q22N373O812p60J010l180p275
16902A1379m576O289K619m327j788K301Q220P793K524K206j096j667J615Q949
$$ plain form
16888 40441 43051 49204 55084 57861 60860 69572 75708 88807 103898 124836 147324 174888 225567
16875 225567 288960 376193 534428 782691 1186539 1865223 2953705 4427319 5484617
16866 5484617 5232259 3929391 2617891 1738921 1186259 811130 573175 425160 323913
16857 323913 248936 195573 156963 130532 114775 100578 85962 74500 69683 56354 45408 41265
16845 41265 36832 33079 30842 28663 21104 16819 18560 20106 23325 28545 32184 31015 24770 19353
16831 19353 20385 15583 17832 20760 22937 23832 21671 17665 10900 10387 11975 10953 9651 9762 7666
16816 7666 1125 471 3450 3354 4178 5444 11002 16034 17776 13287 10320 6253 -1767 -1620 4061 -542
16800 -542 -2619 -871 -2079 4949 15290 9845 5047 4859 1034 -2872 476 864 1708 8459 10964
$$ packed form
16888D0441K610O153N880K777K999Q712O136J3099J5091K0938K2488K7564N0679
16875B25567O3393Q7233J58235K48263M03848O78684J088482J473614J057298
16866E484617k52358j302868j311500q78970n52662l75129k37955j48015j01247
16857C23913p4977n3363l8610k6431j5757j4197j4616j1462m817j3329j0946m143
16845D1265m433l753k237k179p559m285J741J546L219N220L639j169o245n417
16831A9353J032m802K249K928K177Q95k161m006o765n13J588j022j302J11k096
16816G666o541o54K979r6Q24J266N558N032J742m489k967m067q020J47N681m603
16800e42k077J748j208P028J0341n445m798j88l825l906L348L88Q44O751K505
$$ plain form
16785 10964 5196 7288 3721 -658 -2009 -98 1799 -1268 -1398 968 -1870 -141 2809 115 -513
16770 -513 2801 1069 -3276 2066 5522 -6260 -4211 -1003 -434 3358 4058 5333 150 -782 -472 3839
16754 3839 3275 834 2564 9576 16759 18403 11645 7265 8391 8232 12260 10612 4764 6059 976
16739 976 -1333 1945 1827 6277 11075 17827 18333 12408 13570 13920 7945 8564 6306 2294 -2083 -6942
16723 -6942 -9239 -10651 -5849 -6010 -4148 805 -356 -5619 -2855 -3653 -7575 -8070 -8391 -6605 -4234 5725
16707 5725 13347 14931 7622 8107 8848 9656 7194 3462 3691 5862 1128 -4414 -6089 -4855 -1431 559
16691 559 -1151 -5260 -2138 879 -2431 -1369 3751 3696 2256 4318 -6742 -8759 -5595 -656 -6026
16676 -6026 -10115 -8274 -4386 -3039 -3540 -7142 -8824 -4824 -5981 -4145 -429 6966 11774 9689 7279
$$ packed form
16785A0964n768K092l567m379j351J911J897l067j30K366k838J729K950k694o28
16770e13L314j732m345N342L456j1782K049L208N69L792P00J275n183r32L10M311
16754C839n64k441J730P012P183J644o758m380J126j59M028j648n848J295n083
16739I76k309L278j18M450M798O752N06n925J162L50n975O19k258m012m377m859
16723f942k297j412M802j61J862M953j161n263K764p98l922m95l21J786K371R959
16707E725P622J584p309M85P41Q08k462l732K29K171m734n542j675J234L424J990
16691E59j710m109L122L017l310J062N120n5j440K062j1060k017L164M939n370
16676f026m089J841L888J347n01l602j682M000j157J836L716P395M808k085k410
$$ plain form
16661 7279 8345 11033 8394 3172 1270 -1306 -3423 -4036 -2753 -9703 -7746 -10847 -18984 -14458 -7595
16646 -7595 -492 -1900 -7684 -9349 -8646 -1919 4953 -541 1353 7327 -562 -8804 -1290 1811 -1602
16631 -1602 821 -343 758 -1885 -8433 -8732 -4195 -50 -1063 1690 10153 9382 5850 4217 3407
16616 3407 6738 11358 8547 1558 -1967 -1453 273 3101 -4958 -5379 -276 496 1188 2159 664 -5187
16600 -5187 -2235 -2646 -1533 -8432 -4799 574 394 -554 -3847 -3852 -8939 -6674 -7002 -8619 -6394 3168
16584 3168 278 -6196 -1228 6019 4109 2476 2726 -165 -12541 -13457 -8008 -6292 -12346 -10343 -7419
16569 -7419 -5449 -5861 -4335 -3269 -4000 -9185 -14456 -13773 -10433 519 6198 1538 2814 4307 -4801
16554 -4801 -13900 -13782 -11366 -5961 2317 2365 6046 13517 5501 -2995 -8418 -6523 -6253 2073 5790 6453
$$ packed form
16661G279J066K688k639n222j902k576k117o13J283o950J957l101q137M526O863
16646g595P103j408n784j665P03O727O872n494J894N974p889q242P514L101l413
16631a602K423j164J101k643o548k99M537M145j013K753Q463p71l532j633q10
16616C407L331M620k811o989l525N14J726K828q059m21N103P72O92R71j495n851
16600e187K952m11J113o899L633N373j80r48l293nn087K265l28j617K225R562
16584C168k890o474M968P247j910j633K50k891j2376r16N449J716o054K003K924
16569g419J970m12J526J066p31n185n271O83L340J0952N679m660J276J493r108
16554d801r099J18K416N405Q278M8L681P471q016q496n423J895K70Q326L717O63
$$ plain form
16538 6453 -929 914 6533 16254 16788 14449 11544 3524 -2078 -2340 -2021 -2930 -4296 -6001 -6416 -9360
16522 -9360 -8596 -7772 -12630 -5270 -2128 596 5047 5 -3047 -3017 -3393 -6628 -7720 -2696 294 2209
16506 2209 7594 7577 5855 2140 3893 2805 4550 7889 9831 5395 6737 5161 3443 1415 6772
16491 6772 1029 -627 325 5498 4015 6138 4713 5159 1645 -8118 -9887 -4754 -586 -3271 -7901
16476 -7901 -3873 -941 -5779 -7392 -8673 -7454 -4010 -3425 -4246 -5866 -10287 -11775 -9175 -10244 -6189
16461 -6189 3410 3454 5189 6230 7308 9121 -564 -10229 -7978 -8885 -10272 -132 2215 4749 5304
16446 5304 7671 7856 7498 4569 -3355 -6557 -10176 -10656 -13256 -10230 -3086 535 -4089 -2791 2231
16431 2231 2511 -1048 -4888 -4884 2252 651 66 2358 2817 -3849 -10738 -6424 -200 1469 -109 4421
$$ packed form
16538F453p382J843N619R721N34k339k905q020n602k62L19r09j366j705m15k944
16522i360P64Q24m858P360L142K724M451n042l052L0l76l235j092N024K990J915
16506B209N385j7j722l715J753j088J745L339J942m436J342j576j718k028N357
16491F772n743j656R52N173j483K123j425M46l514r763j769N133M168k685m630
16476g901M028K932m838j613j281J219L444N85q21j620m421j488K600j069M055
16461f189R599M4J735J041J078J813r685r665K251r07j387J0140K347K534N55
16446E304K367J85l58k929p924l202l619m80k600L026P144L621m624J298N022
16431B231K80l559l840MP136j601n85K292M59o666o889M314O224J669j578M530
$$ plain form
16415 4421 5549 514 1515 548 -2980 -3297 -5721 -7780 -7207 -9104 -10961 -8576 -6053 2000 7159
16400 7159 3296 1329 -1677 -5167 -10248 -8502 -8750 -8468 -5359 -7259 -6760 -6161 -3791 -3466 -2263 -2499
16384 -2499 2724 5006 5473 1710 -1332 -7714 -7213 -7055 -6365 -2385 3017 4151 1119 -4408 -9504 -11718
16368 -11718 -11373 -2222 1899 -5975 -4023 318 1580 -3025 -2357 -6652 -6992 -9417 -11651 -8003 -403
16353 -403 3189 -5615 -11692 -9779 -6664 -2443 -77 -949 2781 5920 8662 13173 6158 8684 5205
16338 5205 12729 19450 30450 56208 87866 132769 172008 191209 170287 124031 87336 56825
16326 56825 37097 29489 19098 21640 18428 5752 -2938 -4133 -4011 -9790 -9399 -2846 -902 1218
16312 1218 4866 6811 5667 10131 9940 8348 19795 25704 28193 29776 27053 18529 6152 -1251
$$ packed form
16415D421J128n035J001r67l528l17k424k059N73j897j857K385K523Q053N159
16400G159l863j967l006l490n081J746k48K82L109j900M99N99K370L25J203k36
16384b499N223K282M67l763l042o382N01J58O90L980N402J134l032n527n096k214
16368a1718L45R151M121p874J952M341J262m605O68m295l40k425k234L648P600
16353d03L592q804o077J913L115M221K366q72L730L139K742M511p015K526l479
16338E205P524O721J1000K5758L1658M4903L9239J9201k0922m6256l6695l0511
16326E6825j9728p608j0391K542l212j2676q690j195J22n779L91O553J944K120
16312A218L648J945j144M464j91j592J1447N909K489J583k723q524j2377p403
$$ plain form
16298 -1251 -6586 1129 6040 4701 2683 1342 4503 6707 8736 6817 5290 8556 8936 4705 477
16283 477 1808 5918 1838 -4852 -5006 1553 1003 -2472 -11355 -14771 -15686 -15308 -14391 -12138 -10800 -2706
16267 -2706 2656 838 -2793 -3503 -551 -1847 2688 3912 7431 3810 -1091 -3572 -2108 -1057 729
16252 729 -1896 -6250 -6445 -2966 1384 -1791 -774 288 2844 2841 2235 -1858 3642 3696 0 -2288 -4873
16235 -4873 -6415 -2677 -1772 154 -4695 -7818 -7179 -9173 -10565 850 7286 6622 5512 1855 4064
16220 4064 5039 -6341 -17565 -14743 -6938 -1900 -4121 -4577 1707 7234 6738 6309 6046 2797 3877
16205 3877 -743 -12145 -8787 -7953 -8184 232 401 -693 1495 2571 -3053 -4767 -2682 -4043 -3641
16190 -3641 1730 -373 -2096 1169 -159 -3425 -8406 -12339 -11108 -9926 -9640 -882 5264 5530 1174
$$ packed form
16298a251n335P715M911j339k018j341L161K204K029j919j527L266L80m231m228
16283D77J331M110m080o690j54O559n50l475q883l416r15L78R17K253J338Q094
16267b706N362j818l631p10K952j296M535J224L519l621m901k481J464J051J786
16252G29k625m354j95L479M350l175J017J062K556lo06m093N500N4l696k288k585
16235d873j542L738R05J926m849l123O39j994j392J1415O436o64j110l657K209
16220D064R75j1380j1224K822P805N038k221m56O284N527m96m29k63l249J080
16205C877m620j1402L358Q34k31Q416J69j094K188J076n624j714K085j361M02
16190c641N371k103j723L265j328l266m981l933J231J182K86Q758O146K66m356
$$ plain form
16175 1174 2292 1547 5428 1957 4047 5420 -3634 -9664 -12609 -10494 -8003 -10639 -9866 -1773 -6527
16160 -6527 -8943 -7116 -3666 555 8470 11367 3022 -4493 -9168 -10161 -7239 -6943 -8391 -10308 -5629
16145 -5629 -8080 -925 -283 -579 3071 -2196 -5488 -6093 454 -262 -12860 -14741 -17116 -13410 -6440
16130 -6440 -12936 -13996 -10860 -12307 -8464 -8727 -15752 -7782 -700 -3984 -7492 -7614 -5178 -2612 3555
16115 3555 1920 -3573 -4639 -3831 -3591 -701 -964 -1726 -5488 -13835 -15182 -6512 2563 2305 3091 -3883
16099 -3883 -4937 -3883 -473 6562 5022 6801 5389 13572 25975 44924 80631 124754 152528
16086 152528 139902 109005 72452 43080 27393 21812 14162 12589 13265 11107 6546 4815 485
16073 485 -5641 966 10849 -2255 -13979 -5801 -3290 -3775 -2041 1755 -162 -6261 -6741 -854 1819
$$ packed form
16175A174J118p45L881l471K090J373r054o030k945K115K491k636P73Q093m754
16160f527k416J827L450M221P915K897q345p515m675r93K922K96j448j917M679
16145e629k451P155O42k96L650n267l292o05O547p16j2598j881k375L706O970
16130f440o496j060L136j447L843k63p025P970P082l284l508j22K436K566O167
16115C555j635n493j066Q08K40K890k63p62l762q347j347Q670R075k58P86o974
16099c883j054J054L410P035j540J779j412Q183J2403J8949L5707M4123K7774
16086A52528j2626l0897l6553k9372j5687n581p650j573O76k158m561j731m330
16073D85o126O607R883j3104j1724Q178K511m85J734L796j917o099m80N887K673
$$ plain form
16058 1819 -2052 -651 107 2281 3849 5652 3653 -2094 -2547 -3498 467 -1200 2345 2009 3311 2053
16042 2053 1881 3678 13857 12624 5447 -1292 -6462 -5577 -6877 -5628 -10144 -10545 -9086 -2404 4472
16027 4472 8226 5327 -3217 -2923 1537 2502 7874 8783 7417 3979 -353 3612 7304 3524 -99
16012 -99 -2983 -3726 -6830 -11418 -13673 -9459 -15223 -7080 395 887 1149 5075 7669 7499 4531 3730
15996 3730 10116 9715 14697 15318 14220 11245 1616 -8427 -9696 -2219 -4424 -7067 -4885 -5945 -7036
15981 -7036 -9473 -10937 -10698 -10836 -7975 -4804 2958 5488 761 -1351 -2520 -7305 -7404 -2590 4717 9643
15965 9643 7307 4028 -981 -2822 -3846 -4802 2670 3468 -706 3443 6905 6714 2134 -4691 -1088
15950 -1088 1000 -4983 -2975 -1548 3062 3488 13 -4878 -639 -1697 -4407 -2812 -457 1455 2670
$$ packed form
16058A819l871J401P58K174J568J803j999n747m53r51L965j667L545l36J302j258
16042B053j72J797J0179j233p177o739n170Q85j300J249m516m01J459O682O876
16027D472L754k899q544K94M460R65N372R09j366l438m332L965L692l780l623
16012i9k884p43l104m588k255M214n764Q143P475M92K62L926K594j70k968q01
15996C730O386m01M982O21j098k975r629j0043j269P477k205k643K182j060j091
15981g036k437j464K39j38K861L171P762K530m727k112j169m785r9M814P307M926
15965I643k336l279n009j841j024r56P472P98m174M149L462j91m580o825L603
15950a088K088n983K008J427M610M26l475m891M239j058k710J595K355J912J215
$$ plain form
15935 2670 7874 8976 -1050 -2178 -2635 -1393 1580 -691 -5810 -8347 -11657 -3666 -2855 -5406 -4631
15920 -4631 -4539 -11641 -8863 -6688 -2839 3204 5871 5423 3630 -1969 -2318 -2606 -3462 484 1190 -844
15904 -844 2232 6082 5190 3924 -2569 -5023 -3845 3611 5463 4016 218 -3232 -2392 -6011 -7166
15889 -7166 -4868 -6521 -8264 -11390 -10459 -2956 792 207 -150 6921 7046 2501 -4760 -5029 -4583 -2382
15873 -2382 -655 3481 -1003 -2588 1206 2757 -2788 -7802 -7151 -2598 -931 2026 5747 23 -1739
15858 -1739 -3402 -5698 -6 4426 270 2891 835 -1057 -3299 3482 2015 -3489 -3432 -3260 1242
15843 1242 -1529 -7213 -5154 -3367 -3700 3358 7171 7675 2341 -16 2227 9188 5098 -7044 -8122
15828 -8122 -3319 258 3415 1609 500 2651 47 -1620 -8537 -11209 -6158 7120 11799 7668
$$ packed form
15935B670N204J102j0026j128m57J242K973k271n119k537l310P991Q11k551P75
15920d631R2p102K778K175L849O043K667m48j793n599l49k88q56L946P06k034
15904h44L076L850q92j266o493k454J178P456J852j447l798l450Q40l619j155
15889g166K298j653j743l126R31P503L748n85l57P071J25m545p261k69M46K201
15873b382J727M136m484j585L794J551n545n014O51M553J667K957L721n724j762
15858a739j663k296N692M432m156K621k056j892k242O781j467n504N7J72M502
15843A242k771n684K059J787l33P058L813N04n334k357K243O961m090j2142j078
15828h122M803L577L157j806j109K151k604j667o917k672N051J3278M679m131
$$ plain form
15814 7668 3160 7691 8089 3248 -931 -2757 -3313 -3863 -6556 -7360 -7916 -5533 -4500 -4771 2481 5875
15798 5875 2014 924 2652 -1178 1887 7051 7555 3147 -431 -5896 -3631 11364 17559 12859 5882
15783 5882 6147 2942 -1702 -12236 -8126 -701 -406 -4127 -493 2136 3192 -1504 -7940 -8983 -2103
15768 -2103 -829 -3638 -2862 5581 3154 -4665 6644 12354 10104 -890 -6113 -8703 -4529 3347
15754 3347 -1522 -11570 -8502 -1764 234 -634 -2404 -4761 -3921 -1484 3022 844 2352 3753 1344
15739 1344 -1118 -3450 -4417 1121 4209 8452 4866 5864 5416 2370 -2303 -5386 -13364 -14233 -15787 -16481
15723 -16481 -15044 -9953 -4033 1186 -3586 -7388 -6951 -6402 84 -5062 -5523 226 3614 -742 -2010
15708 -2010 -4021 -5909 -7857 -5185 2675 1140 667 6406 7668 10589 8568 3033 2041 5087 8240
$$ packed form
15814G668m508M531L98m841m179j826n56n50k693q04n56K383J033k71P252L394
15798E875l861j090J728l830L065N164N04m408l578n465K265J4995O195m700o977
15783E882K65l205m644j0534M110P425K95l721L634K629J056m696o436j043O880
15768b103J274k809P76Q443k427p819J1309N710k250j0994n223k590M174P876
15754C347m869j0048L068O738J998q68j770k357Q40K437M506k178J508J401k409
15739A344k462k332r67N538L088M243l586R98m48l046m673l083p978q69j554o94
15723a6481J437N091N920N219m772l802M37N49O486n146m61N749L388m356j268
15708b010k011j888j948K672P860j535m73N739J262K921k021n535r92L046L153
$$ plain form
15693 8240 1810 -5358 -2089 1697 -1941 -2500 -3425 -2968 -5341 -9108 -13349 -14415 -8422 -5210 -8847
15678 -8847 -7021 -3207 -893 -2901 -3636 -5198 -9427 -7929 -8143 -11542 -9932 -6792 -6326 -2658 -7963
15663 -7963 -13624 -10768 -9275 -2121 -3531 -462 766 1090 1915 -4441 -11481 -10512 -6255 -2492 -5834
15648 -5834 -3515 3602 2990 -1329 -8718 -16964 -14469 -9461 -1515 1165 -6340 -10163 -4319 -5619 -5310
15633 -5310 -2645 112 2463 1862 -1021 -7213 -10029 -6350 -4408 -2950 -827 7477 9547 6413 3479
15618 3479 5806 -1761 -1261 1552 4786 6117 3003 4114 790 -1656 -3656 -3359 774 -125 -3986
15603 -3986 -11397 -11540 -4691 -3296 -6418 -12159 -12313 -8522 -3228 -2430 -1972 -1385 -6734 -9147 -4835 -4398
15587 -4398 -445 1803 -6492 -10917 -10755 -8088 -4396 1420 -723 -10907 -12848 -10806 -8639 -10123 -13488
$$ packed form
15693H240o430p168L269L786l638n59r25M57k373l767m241j066N993L212l637
15678h847J826L814K314k008p35j562m229J498k14l399J610L140M66L668n305
15663g963n661K856J493P154j410L069J228L24Q25o356p040R69M257L763l342
15648e834K319P117o12m319p389q246K495N008P946K680p505l823N844j300L09
15633e310K665K757K351o01k883o192k816L679J942J458K123Q304K070l134k934
15618C479K327p567N00K813L234J331l114J111l324k446k000K97M133q99l861
15603c986p411j43O849J395l122n741j54L791N294P98M58N87n349k413M312M37
15587d398L953K248q295m425J62K667L692N816k143j0184j941K042K167j484l365
$$ plain form
15572 -13488 -10608 -9999 -15590 -16295 -12203 -9001 -10061 -4707 -2185 2094 1057 3180 5798 -1421 -1237
15557 -1237 -2387 -2431 -5526 -9975 -10284 -13504 -12468 -15932 -15755 -12588 -13133 -9936 -4617 -2451 2428 3606
15541 3606 10010 8347 7274 2021 1378 2300 -150 1554 -1286 -3455 4817 6317 796 -2829 -7575
15526 -7575 -4362 -5955 -4243 -5941 -8797 -2958 4389 6449 6193 -278 1699 2408 1354 7151 9124
15511 9124 4569 -3865 -7176 -8189 -7405 -8555 -5799 -6118 -2918 -2163 399 7473 8074 -1092 194 3623
15495 3623 3837 -4121 -4307 1409 -402 -4289 619 4890 4964 926 -4592 -7856 -1529 3459 1261 -5773
15479 -5773 -5353 -4858 3272 8442 -358 -8168 -2945 638 -1261 183 -2044 -9381 -9533 -6021 -5945 -5465
15463 -5465 -5916 -4285 -2213 3894 -3673 -7142 -6080 -6990 -6968 -11288 -9952 -6894 -5485 -11816 -14755 -12023
$$ packed form
15572a3488K880O09n591p05M092L202j060N354K522M279j037K123K618p219J84
15557a237j150m4l095m449l09l220J036l464J77L167n45L197N319K166M879J178
15541C606O404j663j073n253o43R22k450J704k840k169Q272J500n521l625m746
15526g575L213j593J712j698k856N839P347K060k56o471J977P09j054N797J973
15511I124m555q434l311j013P84j150K756l19L200P55K562P074O01r166J286L429
15495C623K14p958j86N716j811l887M908M271P4m038n518l264O327M988k198p034
15479e773M20M95Q130N170q800p810N223L583j899J444k227p337j52L512P6M80
15463e465m51J631K072O107p567l469J062r10K2m320J336L058J409o331k939K732
$$ plain form
15447 -12023 -7493 -4625 -8277 -5596 -4378 -8615 -13864 -14388 -8344 -16177 -14981 -8784 -4779 -8629 -11108
15432 -11108 -10577 -8206 -8002 -9237 -10570 -9694 -4830 -3852 -4687 -4242 6372 16207 21011 19142 13466 6882
15416 6882 5110 5019 2963 2741 -216 4155 1004 -4030 -6814 -4926 -7197 -8371 -6117 -361 2290
15401 2290 4642 6821 -2136 -5850 -2318 1991 4373 8925 6517 3824 5223 4184 6430 9294 -67
15386 -67 -6120 -4586 -2639 6038 2531 -2862 -605 4175 2770 2827 -3127 -2825 -4965 -9000 -4035 -221
15370 -221 -2147 2385 4281 8899 1263 -1379 3733 897 4639 6041 7695 6436 3817 6107 4714
15355 4714 4507 4492 -3826 -4377 -4118 -4956 -4272 -6536 -1777 -2390 -8101 -11098 -6406 -1823 -2639 107 3876
15338 3876 3146 -820 -4077 -5509 -5662 -9700 -15174 -15621 -12273 -4793 -334 -3149 1592 1195 3178 4312
$$ packed form
15447a2023M530K868l652K681J218m237n249n24O044p833J196O197M005l850k479
15432a1108N31K371K04j235j333Q76M864R78q35M45J0614R835M804j869n676o584
15416F882j772r1k056k22k957M371l151n034k784J888k271j174K254N756K651
15401B290K352K179q957l714L532M309K382M552k408k693J399j039K246K864r361
15386f7o053J534J947Q677l507n393K257M780j405N7n954L02k140m035M965L814
15370b21j926M532J896M618p636k642N112k836L742J402J654j259k619K290j393
15355D714k07j5q318n51K59q38O84k264M759o13n711k997M692M583q16K746L769
15338C876p30l966l257j432j53m038n474m47L348P480M459k815M741l97J983J134
$$ plain form
15322 4312 6092 2124 -6494 -1399 2325 1827 -2264 257 -3486 -838 -4926 -1968 -6730 -9789 -8435
15307 -8435 -3317 -5358 -4866 -1508 2970 813 638 -67 -2742 -39 3174 5229 6524 6271 4152 2774
15291 2774 -89 -4481 -6750 -10135 -7577 -1530 3110 1312 153 -2449 -3947 -224 660 -137 -4680
15276 -4680 -2777 -1505 -6112 -1903 -2662 -3271 3357 3092 1555 -1627 -1108 -923 -3852 -4196 -6158 -3438
15260 -3438 -2624 -1404 -1869 -3205 2249 869 -9826 -8681 -8240 -6507 -5931 -7236 -1206 8280 8087 3400
15244 3400 -8985 -7738 -6612 -3635 -462 5490 4371 1933 4771 7730 2443 -2235 -5004 -5965 -1680
15229 -1680 -1338 -1490 -4311 -10785 -18093 -21036 -12537 -5216 -715 1421 3291 2772 1841 4317 176 5272
15213 5272 6229 474 1515 1903 4492 7749 3813 6301 6279 -920 -1404 3141 5138 4848 10286 13019
$$ packed form
15322D312J780l968q618N095L724m98m091K521l743K648m088K958m762l059J354
15307h435N118k041M92L358M478k157j75p05k675K703L213K055J295k53k119j378
15291B774k863m392k269l385K558O047M640j798j159k602j498L723Q84p97m543
15276d680J903J272m607M209p59o09O628k65j537l182N19J85k929l44j962K720
15260c438Q14J220m65j336N454j380j0695J145M41J733N76j305O030R486j93m687
15244C400j2385J247J126K977L173N952j119k438K838K959n287m678k769r61M285
15229a680L42j52k821o474p308k943Q499P321M501K136J870n19r31K476m141N096
15213E272R57n755J041L88K589L257l936K488k2p199m84M545J997k90N438K733
$$ plain form
15197 13019 5501 131 2227 10965 15844 13100 12256 4338 -5321 -8586 -9567 -5438 -5406 -3722 -6968
15182 -6968 -11851 -11786 -12060 -5812 335 -61 -9410 -11619 -7158 -1214 3545 6929 7260 4333 3161 1249
15166 1249 -4829 -3952 4750 2490 1780 7051 1115 -4150 2279 10622 11467 9314 1210 199 5466
15151 5466 -147 2642 6916 4007 3113 4749 985 -340 -3053 -4149 761 4154 -1294 -9408 -12281
15136 -12281 -11676 -8061 -7044 -8052 -8746 -12170 -10384 -3437 -1579 -2821 608 -6181 -9062 -9924 -6750
15121 -6750 306 5173 9791 10984 1506 -122 -94 -298 1848 -4498 -2308 5068 4769 5078 4671 2793
15105 2793 -8767 -15541 -10048 -3238 461 1539 -1009 -7713 -9660 -2503 -2542 -3589 -5460 -7358 -2243
15090 -2243 -2462 -3232 -4860 -3963 -6782 -2707 2355 5197 891 2139 4363 2119 838 -4283 -3961 -5567
$$ packed form
15197A3019p518n370K096Q738M879k744q44p918r659l265r81M129L2J684l246
15182f968m883O5k74O248O147l96r349k209M461N944M759L384L31k927j172j912
15166A249o078Q77Q702k260p10N271n936n265O429Q343Q45k153q104j011N267
15151E466n613K789M274k909q94J636l764j325k713j096M910L393n448q114k873
15136a2281O05L615J017j008o94l424J786O947J858j242L429o789k881q62L174
15121f750P056M867M618J193r478j628K8k04K146o346K190P376k99L09m07j878
15105B793j1560o774N493O810L699J078k548o704j947P157l9j047j871j898N115
15090b243k19p70j628Q97k819M075N062K842m306J248K224k244j281n121L22j606
$$ plain form
15074 -5567 -1349 3420 5274 2118 4545 955 -2713 -2055 1937 8521 9522 6571 6389 -685 -5022
15059 -5022 -4030 -6744 -4783 2045 1268 -3167 -7017 -4748 848 -4368 -5847 -7512 -8853 -8737 -11702
15044 -11702 -9188 -12722 -10685 -8718 -518 7019 7005 2945 714 833 885 -617 -4930 -4400 -5634 -10386
15028 -10386 -16467 -14729 -13968 -8094 -4340 -3504 -275 -3853 -5539 -3044 1681 -1851 -6911 -2515 3022
15013 3022 11425 11029 11424 14412 10649 1142 -2949 -4806 -4534 -2226 -5035 -5323 -286 -14 -5730 -3698
14997 -3698 4176 8434 9882 8369 6667 5955 6032 2439 624 199 -657 1864 4582 -7456 -8411 -5328
14981 -5328 -20 172 1904 7248 7222 2316 870 3007 3054 7212 7273 -818 -910 -960 829 995 -4072 -3885
14963 -3885 2549 7257 14500 15843 10478 4052 -992 -6183 -3115 -7143 -14451 -11426 -4290 248 681
$$ packed form
15074e567M218M769J854l156K427l590l668O58L992O584J001k951j82p074m337
15059e022R92k714J961O828p77m435l850K269N596n216j479j665j341J16k965
15044a1702K514l534K037J967Q200P537j4m060k231J19N2j502m313N30j234m752
15028a0386o081J738P61N874L754Q36L229l578j686K495M725l532n060M396N537
15013C022Q403l96L95K988l763r507m091j857K72K308k809k88N037K72n716K032
14997c698P874M258J448j513j702p12P7l593j815m25q56K521K718j2038r55L083
14981e328N308J92J732N344k6m906j446K137M7M158O1q091r2n0J789J66n067J87
14963c885O434M708P243J343n365o426n044n191L068m028p308L025P136M538M33
$$ plain form
14948 681 -917 -118 -1116 2813 4627 530 -5238 -2827 8256 11805 6657 5207 3660 -149 6582
14933 6582 6265 6044 9383 9220 4031 -211 -4906 -5727 -9598 -9814 -4608 -1811 3582 4607 4663 3735 3571
14916 3571 1938 3914 10845 10330 6563 5226 5913 7627 7572 6284 11131 10227 2667 1632 6657 7322
14900 7322 8362 6476 7305 11802 6770 8757 8682 4213 1210 3128 4591 12051 12599 2961 3512 -3137
14884 -3137 -1338 5304 2373 -4059 -6128 -5303 -4518 -2099 4504 309 1638 6781 4165 2970 -156
14869 -156 2704 3832 2166 115 -2348 4733 6437 10473 9425 6083 1165 4021 4193 -510 -1435
14854 -1435 -4835 -12573 -8349 -8629 -4988 1468 -1763 -1311 -5070 1502 9481 5990 4769 6162 1186
14839 1186 2446 1421 -2273 1804 2471 2578 7523 6166 8022 3831 5577 10810 9634 8996 6574
$$ packed form
14948F81j598P99r98L929J814m097n768K411J1083L549n148j450j547l809O731
14933F582l17k21L339j63n189m242m695q21l871k16N206K797N393J025N6r28j64
14916C571j633J976O931n15l767j337O87J714n5j288M847r04p560j035N025O65
14900G322J040j886Q29M497n032J987p5m469l003J918J463P460N48r638N51o649
14884c137J799O642k931o432k069Q25P85K419O603m195J329N143k616j195l126
14869a56K860J128j666k051k463P081J704M036j048l342m918K856J72m703r25
14854a435l400p738M224k80L641O456l231M52l759O572P979l491j221J393m976
14839A186J260j025l694M077O67J07M945j357J856m191J746N233j176o38k422
$$ plain form
14824 6574 10652 8046 454 -12454 -8875 -2157 -3688 1634 6604 8535 6911 8227 7204 5792
14810 5792 10593 10611 6457 9654 13007 6338 4335 2841 1954 2372 2069 1502 -849 -4820 -7122 -7647
14794 -7647 -6529 -341 2872 4832 4481 4948 5179 1098 -1846 273 3647 3679 6508 -211 -9694 -10607
14778 -10607 -1861 10686 6798 3379 -629 -878 5939 11916 12439 3308 -751 -2343 -370 -4028 -6982
14763 -6982 -5223 150 3502 4157 2938 3700 -4087 -11446 -9829 -7682 359 4129 3034 1107 -3760
14748 -3760 -1175 -1919 -961 -2647 3409 7656 7016 7141 12563 15102 9182 -1380 -4243 -5164 -5265 3645
14732 3645 6919 11269 16891 16654 18991 19594 20028 16011 10514 12014 8245 7391 13967 15258 16087 13284
14716 13284 14149 9781 7476 10585 4971 -4703 -7431 -4702 -5067 1790 5803 2710 3453 5035 2779
$$ packed form
14824F574M078k606p592j2908L579O718j531N322M970J931j624J316j023j412
14810E792M801J8m154L197L353o669k003j494q87M18l03n67k351l971k302n25
14794g647J118O188L213J960l51M67K31m081k944K119L374L2K829o719r483r13
14778a0607Q746J2547l888l419m008k49O817N977N23r131m059j592J973l658k954
14763f982J759N373L352O55j219P62p787p359J617K147Q041L770j095j927m867
14748c760K585p44R58j686O056M247o40J25N422K539n920j0562k863r21j01Q910
14732C645L274M350N622k37K337O03M34m017n497J500l769q54O576J291Q29k803
14716A3284Q65m368k305L109n614r674k728K729l65O857M013l093P43J582k256
$$ plain form
14701 2779 2465 2853 3828 2757 -1628 -5565 -3915 -3160 -2273 4194 11640 6341 -3870 -4266 -1756 121
14685 121 4149 3197 4990 6261 4495 4579 8867 12218 9807 9173 969 1191 5091 4918 2149 -34
14669 -34 5607 9830 5232 6643 7544 4206 -4720 -3305 -7533 -5308 -6695 -3832 1481 -2014 -4558
14654 -4558 -617 -42 -2415 -1897 -4824 -5724 -1715 -2686 890 5510 3481 10202 13693 8021 6015 5041
14638 5041 -472 4052 2620 -877 -7513 -8852 -2255 4344 1890 278 -29 -653 2918 8397 7645
14623 7645 3365 5668 10619 5939 6121 7601 7665 13256 6442 4640 8036 8860 7880 12944 16415 5994
14607 5994 -636 3114 4838 -3137 -4538 -1443 -85 -1634 3624 7259 6844 12017 9348 5453 2784
14592 2784 -1695 3537 6827 6364 5392 4762 10054 8130 10383 10856 4053 10374 11839 5964 -1976 -2891
$$ packed form
14701B779l14L88R75j071m385l937J650P55Q87O467P446n299j0211l96K510J877
14685A21M028r52J793J271j766Q4M288L351k411o34q204K22L900j73k769k183
14669c4N641M223m598J411R01l338q926J415m228K225j387K863N313l495k544
14654d558L941N75k373N18k927r00M009r71L576M620k029O721L491n672k006r74
14638E041n513M524j432l497o636j339O597O599k454j612l07o24L571N479p52
14623G645m280K303M951m680J82J480O4N591o814j802L396Q24r80N064L471j0421
14607E994o630L750J724p975j401L095J358j549N258L635m15N173k669l895k669
14592B784m479N232L290m63r72o30N292j924K253M73o803O321J465n875p940r15
$$ plain form
14576 -2891 2619 5278 3555 765 5184 5989 8269 5243 2774 1370 8631 10157 3981 -348 732
14561 732 589 7861 5189 3861 2150 -1090 4458 5066 4190 3605 3437 6336 6993 4677 6618 9409
14545 9409 9496 3613 8004 16994 13684 13152 5638 6310 4576 3397 2877 6347 3022 3246 2933 -117
14529 -117 -55 3153 5731 4142 8781 14274 12614 10423 6432 12828 18635 7706 924 1696 7565
14514 7565 10103 6093 5628 3325 7099 11300 11213 9401 11473 11977 12706 15091 14417 12436 16887 12669
14498 12669 10025 11469 7100 3718 6431 6863 6986 2697 1444 4717 6436 5911 7455 14605 14373
14483 14373 852 -2981 123 -9130 -7750 -800 3521 1265 2033 10371 12374 9816 13264 14595
14469 14595 18453 22333 17238 7203 5497 12042 12539 15025 18210 13661 5855 4768 3871 -4632 -4739
$$ packed form
14576b891N510K659j723k790M419Q05K280l026k469j404P261J526o176m329J080
14561G32j43P272k672j328j711l240N548O08q76n85j68K899O57k316J941K791
14545I409Q7n883M391Q990l310n32p514O72j734j179n20L470l325K24l13l050
14529a17O2L208K578j589M639N493j660k191l991O396N807j0929o782P72N869
14514G565K538m010m65k303L774M201q7j812K072N04P29K385o74j981M451m218
14498A2669k644J444m369l382K713M32J23m289j253L273J719n25J544P150k32
14483A4373j3521l833L104r253J380O950M321k256P68Q338K003k558L448J331
14469A4595L858L880n095j0035j706O545M97K486L185m549p806j087q97q503j07
$$ plain form
14454 -4739 -8915 -12083 -8247 -2545 2906 7334 10205 5466 3389 1244 -4819 -2539 -3105 -3891 4394
14439 4394 2189 2493 8534 13078 12805 8786 6505 3716 3764 1682 4446 7479 7332 5909 8069 5111
14423 5111 3502 6344 6704 -65 484 7209 14362 9215 6212 6892 5707 7420 2019 -523 -119 985
14407 985 5876 6757 1298 6231 10878 -834 -2488 -1383 1907 7076 4927 6565 9152 6055 5287
14392 5287 12008 11507 5846 -366 4812 4567 4435 3208 -1382 876 1991 7108 8653 18853 16552
14377 16552 16893 13491 10040 6331 8340 8771 9926 7510 2132 -2598 857 9147 9605 9326 10014 7791
14361 7791 6741 8317 6461 8319 4071 3407 3281 3712 6137 8084 9993 12922 10057 5700 6402 6889
14345 6889 3198 3548 5226 10866 10433 7402 -121 -1150 5261 5631 -360 -2185 -3522 2381 5248
$$ packed form
14454d739m176l168L836N702N451M428K871m739k077k145o063K280n66p86Q285
14439D394k205L04O041M544k73m019k281k789M8k082K764L033j47j423K160k958
14423E111j609K842L60o769N49O725P153n147l003O80j185J713n401k542M04J104
14407I85M891Q81n459M933M647j1712j654J105L290N169k149J638K587l097p68
14392E287O721n01n661o212N178k45j32j227m590K258J115N117J545J0200k301
14377A6552L41l402l451l709K009M31J155k416n378m730L455Q290M58k79O88k223
14361G791j050J576j856J858m248o64j26M31K425J947J909K929k865m357P02M87
14345F889l691L50J678N640m33l031p523j029O411L70n991j825j337N903K867
$$ plain form
14330 5248 4368 4228 7882 6056 9635 10745 3420 -4341 -5331 -7477 -4612 2793 7347 1508 2646
14315 2646 5308 8266 14307 12905 8345 6006 6116 7750 8247 7098 15962 17891 14565 14042 5961
14300 5961 6011 11370 18509 14151 10040 6593 1671 989 5210 12264 6684 1850 -3623 -4984 802
14285 802 8724 6049 -52 -1563 -2056 -5161 -2428 -2812 -1222 1962 6491 6379 6125 13310 15794 17824
14269 17824 19048 16873 15098 18236 19991 22674 19370 13740 8788 8458 10499 15777 20471 21956 19015
14254 19015 21170 23868 24367 16530 10921 3007 1831 8777 4189 4549 8197 9500 7310 6843 10242
14239 10242 8888 16681 21017 17295 15310 16459 20047 20220 20524 15371 12014 14214 17243 19403 20308
14224 20308 14553 12382 18003 25452 20401 9523 9414 14023 6972 2040 7516 11924 11356 3696 6302
$$ packed form
14330E248q80j40L654j826L579J110p325p761r90k146K865P405M554n839J138
14315B646K662K958O041j402m560k339J10J634M97j149Q864J929l326n23q081
14300E961N0N359P139m358m111l447m922o82M221P054n580m834n473j361N786
14285H02P922k675o101j511m93l105K733l84J590L184M529j12k54P185K484K030
14269A7824J224k175j775L138J755K683l304n630m952l30K041N278M694J485k941
14254A9015K155K698M99p837n609p914j176O946m588L60L648J303k190m67L399
14239A0242j354P793M336l722j985J149L588J73L04n153l357K200L029K160R05
14224B0308n755k171N621P449n051j0878j09M609p051m932N476M408n68p660K606
$$ plain form
14209 6302 19445 20303 12278 12426 14421 12557 8240 8663 9141 9121 10726 8689 4650 5726 17293 18116
14193 18116 13866 10945 15572 16482 22955 25664 27957 23785 24468 29135 27159 24954 15896 14130 13626
14178 13626 14077 14432 12677 17066 15370 10341 6051 5606 10061 15948 18698 17476 15352 10152 4759
14163 4759 8752 10296 11424 12607 12030 18573 27364 32505 30798 22033 18665 18843 18061 20592 16569
14148 16569 17236 18243 17335 12889 8841 6243 7390 10092 14439 18331 21847 20790 20653 23370 18865
14133 18865 13553 15065 21372 22685 26714 20519 11479 8082 3937 5697 11338 10735 9213 11549 7381
14118 7381 3533 5021 6890 6570 10608 12233 12163 14457 18756 23236 19423 21064 22334 23664 27112
14103 27112 20637 19874 22344 18081 20350 22836 16946 12697 14525 17700 11023 14752 17803 18894 12478
$$ packed form
14209F302J3143Q58q025J48J995j864m317M23M78k0J605k037m039J076J1567Q23
14193A8116m250k921M627R10O473K709K293m172O83M667j976k205r058j766n04
14178A3626M51L55j755M389j696n029m290m45M455N887K750j222k124n200n393
14163D759L993J544J128J183n77O543Q791N141j707q765l368J78p82K531m023
14148A6569O67J007r08m446m048k598J147K702M347L892L516j057j37K717m505
14133A8865n312J512O307J313M029o195r040l397m145J760N641o03j522K336m168
14118G381l848J488J869l20M038J625p0K294M299M480l813J641J270J330L448
14103B7112o475p63K470m263K269K486n890m249J828L175o677L729L051J091o416
$$ plain form
14088 12478 10874 14246 12109 14100 15088 8411 7805 11914 17288 11972 5927 5684 10877 19249 14953
14073 14953 16571 19636 13520 16476 18394 20866 21548 20748 24653 26962 34050 37139 39147 31567 32313
14058 32313 30871 29900 31858 37260 46298 49367 46756 47275 44074 42434 38829 34502 39722 50142 52742
14043 52742 54522 56095 56209 61982 68333 77852 79702 91107 107193 124936 146718 170622 198022
14030 198022 235808 288291 363274 495111 702545 1010160 1426505 1931216 2430071 2777406
14020 2777406 2857542 2648610 2231594 1737937 1283451 925371 669168 504984 389978 307073
14010 307073 244558 199038 162830 139152 123870 104493 84813 71704 62099 58997 54037 52917
13998 52917 54420 46581 47631 48914 50849 47168 48604 50720 47683 42954 36396 28732 21168 21834 27411
$$ packed form
14088A2478j604L372k137J991R88o677o06M109N374n316o045k43N193Q372m296
14073A4953J618L065o116K956J918K472O82q00L905K309P088L089K008p580P46
14058C2313j442r71J958N402R038L069k611N19l201j640l605m327N220J0420K600
14043E2742J780J573J14N773O351R519J850J1405J6086J7743K1782K3904K7400
14030A98022L7786N2483P4983J31837K07434L07615M16345N04711M98855L47335
14020B777406Q0136k08932m17016m93657m54486l58080k56203j64184j15006q2905
14010C07073o2515m5520l6208k3678j5282j9377j9680j3109r605l102m960j120
13998E2917J503p839J050J283J935l681J436K116l037m729o558p664p564O66N577
$$ plain form
13983 27411 28185 30754 31356 25215 18257 19526 23544 28988 34701 39378 32726 20567 17648 20343 21531
13968 21531 22327 22786 25067 22858 18609 17938 22960 25312 23168 27599 31268 28058 22527 25537 35027
13953 35027 34768 25354 16856 20141 22921 28323 30175 39315 38606 36425 36161 35684 37688 37694 30015 24986
13937 24986 27452 35802 34766 29216 30157 21525 14048 12774 15345 13214 8238 10085 10225 10087 19011
13922 19011 23923 26084 26402 25179 25212 21979 21814 19485 16266 10135 8507 5727 12438 1412 -2366
13907 -2366 -3088 -3907 -1333 -3041 -4272 -1188 -5760 -1313 7698 8705 13514 17859 17625 19955 25691
13892 25691 33732 44534 45234 41142 44626 43091 43538 48032 49503 44584 37748 34095 33091 37049 29528
13877 29528 19836 16935 21681 20094 22266 25057 26949 21894 16953 14238 10884 4366 1839 6647
$$ packed form
13983B7411P74K569O02o141o958J269M018N444N713M677o652j2159k919K695J188
13968B1531P96M59K281k209m249o71N022K352k144M431L669l210n531L010R490
13953C5027k59r414q498L285K780N402J852R140p09k181k64m77K004Op679n029
13937B4986K466Q350j036n550R41q632p477j274K571k131m976J847J40j38Q924
13922A9011M912K161L18j223L3l233j65k329l219o131j628k780O711j1026l778
13907b366p22q19K574j708j231L084m572M447R011J007M809M345k34K330N736
13892B5691Q041J0802P00m092L484j535M47M494J471m919o836l653j004L958p521
13877B9528r692k901M746j587K172K791J892n055m941k715l354o518k527M808
$$ plain form
13863 6647 4592 8936 9480 1739 -1345 1602 -688 -9120 -17710 -28158 -29174 -29983 -26454 -25782 -17304
13848 -17304 -9884 -11015 -10284 10366 33806 61487 93766 126664 156805 176144 182165 173933 158770
13835 158770 145832 130166 114484 105732 96885 99316 103794 100222 83740 73036 72939 75748 79024
13822 79024 75566 75319 78780 71050 69163 68899 68409 64729 64187 68229 73237 75132 72274 73878 80066
13807 80066 88445 90904 98737 116243 138628 156823 189914 238271 287385 331665 371089 389570
13795 389570 383618 375756 369848 362044 342936 303199 244417 176030 120337 81181 65297 63854
13783 63854 63012 63964 57925 57945 57246 55046 57770 67120 76246 81916 91912 100035 106087 110983 113840 111885
13767 111885 100117 92554 91292 91684 86783 83888 85375 91326 92512 98934 103189 104996 99348 88056
$$ packed form
13863F647k055M344N44p741l084K947k290q432q590j0448j016q09L529O72Q478
13848a7304P420j131P31K0650K3440K7681L2279L2898L0141J9339O021q232j5163
13835A58770j2938j5666j5682q752q847K431M478l572j6482j0704r7K809L276
13822G9024l458k47L461p730j887k64m90l680n42M042N008J895k858J604O188
13807H0066Q379K459P833J7506K2385J8195L3091M8357M9114M4280L9424J8481
13795C89570n952p862n908p804j9108l9737n8782o8387n5693l9156j5884j443
13783F3854q42R52o039K0o99k200K724R350R126N670R996Q123O052M896K857j955
13767A11885j1768p563j262L92m901k895J487N951J186O422M255J807n648j1292
$$ plain form
13753 88056 70778 50681 38731 27986 9448 1264 95 3650 8514 6587 5844 6434 9656 12269
13739 12269 20026 33760 51833 54894 61589 76882 88177 101985 114216 126858 133752 137342 136955
13726 136955 137811 147862 164183 182036 208463 233707 250011 250027 249169 239864 224671 202342 196572
13713 196572 192618 181624 169940 164497 162396 154028 151471 147652 151818 156999 159966 166537 172298 174599
13699 174599 191085 208497 207215 199593 188055 175454 160224 147203 138164 136245 129528 130530 143199
13686 143199 155572 166477 189166 221344 276619 331831 369787 363366 312550 259411 229966 235325
13674 235325 261618 306451 357855 399155 426049 428676 417374 396306 360199 320499 287409 258986
13662 258986 224217 207880 209623 215462 239647 282648 345690 445570 554334 627523 622438 548530
$$ packed form
13753H8056j7278k0097j1950j0745j8538q184j169L555M864j927p43N90L222K613
13739A2269P757J3734J8073L061O695J5293J1295J3808J2231J2642O894L590l87
13726A36955Q56J0051J6321J7853K6427K5244J6304J6q58r305j5193k2329n770
13713A96572l954j0994j1684n443k101q368k557l819M166N181K967O571N761K301
13699A74599J6486J7412j282p622j1538j2601j5230j3021r039j919o717J002J2669
13686A43199J2373J0905K2689L2178N5275N5212L7956o421n0816n3139k9445N359
13674B35325K6293M4833N1404M1300K6894K627j1302k1068l6107l9700l3090k8423
13662B58986l4769j6337J743N839K4185M3001O3042R9880J08764P3189n085p3908
$$ plain form
13650 548530 462202 396413 361552 348415 345550 347849 358120 370583 383865 393644 399661 405384
13638 405384 417837 440735 457348 472040 486920 503639 521037 534173 540625 551987 550927 544033
13626 544033 538827 531147 522797 524774 535505 547203 552049 554936 553452 555497 555767 554975 556413 559321
13612 559321 561160 572629 596981 626350 662449 682872 704285 734939 766815 802177 842842 892135
13600 892135 952901 999112 1045736 1099321 1149994 1193009 1236835 1274034 1317312 1384958 1464632
13589 1464632 1544847 1619565 1696253 1739953 1765976 1801365 1837632 1895364 1984178 2095227 2223471
13578 2223471 2367473 2525440 2694478 2896849 3133743 3424514 3775702 4180063 4620589
13569 4620589 5078834 5535698 5980230 6449278 6971104 7609238 8423463 9478186 10851291
$$ packed form
13650E48530q6328o5789l4861j3137k865K299J0271J2463J3282R779O017N723
13638D05384J2453K2898J6613J4692J4880J6719J7398J3136O452J1362j060o894
13626E44033n206p680q350J977J0731J1698M846K887j484K045K70p92J438K908
13612E59321J839J1469K4352K9369L6099K0423K1413L0654L1876L5362M0665M9293
13600H92135O0766M6211M6624N3585N0673M3015M3826L7199M3278O7646P9674
13589A464632Q0215P4718P6688M3700K6023L5389L6267N7732Q8814J11049J28244
13578B223471J44002J57967J69038K02371K36894K90771L51188M04361M40526
13569D620589M58245M56864M44532M69048N21826O38134Q14225J054723J373105
$$ plain form
13560 10851291 12639240 14938696 17795655 21236719 25284820 30192065 36584968 45610081
13552 45610081 59190847 80351541 113574122 164515856 236748370 325486835 415490607
13545 415490607 482616919 510039865 489724423 430838774 348579244 263883284 190959826
13538 190959826 136005474 97935391 72368965 55225910 43664972 35658979 29846114
13531 29846114 25362444 21710743 18656692 16090300 13953249 12177467 10672847 9389317
13523 9389317 8270740 7309199 6505303 5850389 5344456 4964988 4670272 4418427 4178698
13514 4178698 3957052 3739361 3524342 3324267 3131547 2963522 2807908 2668179 2529467
13505 2529467 2379294 2213369 2039370 1879136 1751553 1660474 1589715 1537914 1483973 1419213
$$ packed form
13560A0851291J787949K299456K856959L441064M048101M907245O392903R025113
13552D5610081J3580766K1160694L3222581N0941734P2232514Q8738465R0003772
13545D15490607O7126312K7422946k0315442n8885649q2259530q4695960p2923458
13538A90959826n4954352l8070083k5566426j7143055j1560938q005993n812865
13531B9846114m483670l651701l054051k566392k137051j775782j504620j283530
13523I389317j118577r61541q03896o54914n05933l79468k94716k51845k39729
13514D178698k21646k17691k15019k00075j92720j68025j55614j39729j38712
13505B529467j50173j65925j73999j60234j27583r1079p0759n1801n3941o4760
$$ plain form
13495 1419213 1352384 1291832 1236597 1189573 1155733 1127997 1104464 1083671 1060500 1043613 1029502
13484 1029502 1003097 969119 930134 904617 887942 874206 865295 848300 826493 796928 769568
13473 769568 733185 694483 656487 612240 574024 551566 526951 505204 481762 460363 438005
13462 438005 412680 393255 371277 358572 352302 333398 309205 294640 290733 293144 293024 297707 297700
13449 297700 297346 296105 295896 297541 300142 299344 298124 302045 304980 304094 302601 295799 284271 285791 285366
13434 285366 283193 285705 301929 316121 326560 333911 327725 321225 307338 280656 256180 232890
13422 232890 213510 206417 224035 289660 381177 474262 532157 548071 525318 471735 413911 375985
13410 375985 351944 326283 296627 274941 258283 242606 229344 220009 211006 204413 201720 190527
$$ packed form
13495A419213o6829o0552n5235m7024l3840k7736k3533k0793k3171j6887j4111
13484A029502k6405l3978l8985k5517j6675j3736q911j6995k1807k9565k7360
13473G69568l6383l8702l7996m4247l8216k2458k4615k1747k3442k1399k2358
13462D38005k5325j9425k1978j2705o270j8904k4193j4565l907K411j20M683p
13449B97700l54j241k09J645K601p98j220L921K935q86j493o802j1528J520m25
13434B85366k173K512J6224J4192J0439P351o186o500j3887k6682k4476k3290
13422B32890j9380p093J7618O5625R1517R3085N7895J5914k2753n3583n7824l7926
13410C75985k4041k5661k9656k1686j6658j5677j3262r335r003o593k693j1193
$$ plain form
13398 190527 183005 174354 160884 149872 134121 112042 100724 96232 85524 80018 82774 89980 95678
13385 95678 99672 99149 98616 109606 110792 97937 83458 75539 62264 45796 34626 24901 7631
13372 7631 -919 -8169 -18018 -22315 -24530 -12242 5836 23799 41017 47269 44861 43096 47292 60011
13358 60011 79382 92785 105836 109135 104200 112617 124988 138919 147696 153358 158913 163857 161659
13345 161659 164559 165234 156512 155460 154293 147816 141241 135986 124134 105979 88500 74614 69217
13332 69217 70909 67394 68518 63382 54346 53482 56832 54927 49581 41189 36943 40551 33065 20972
13318 20972 19675 21599 18178 25856 32834 40589 51609 62624 73440 80508 77843 64659 58197
13305 58197 58710 64159 67269 68406 71633 73810 75422 79793 85817 87655 89756 99302 103289 98921 89990
$$ packed form
13398A90527p522q651j3470j1012j5751k2079j1318m492j0708n506K756P206N698
13385I5678L994n23n33J0990J186j2855j4479p919j3275j6468j1170r725j7270
13372G631q550p250r849m297k215J2288J8078J7963J7218O252k408j765M196J2719
13358F0011J9371J3403J3051L299m935Q417J2371J3931Q777N662N555M944k198
13345A61659K900O75q722j052j167o477o575n255j1852j8155j7479j3886n397
13332F9217J692l515J124n136r036q64L350j905n346q392m246L608p486j2093
13318B0972j297J924l421P678O978P755J1020J1015J0816P068k665j3184o462
13305E8197N13N449L110J137L227K177J612M371O024J838K101R546L987m368q931
$$ plain form
13290 89990 83010 75287 73342 74328 71720 69412 67896 63578 65261 70699 67437 62635 61592 57961 52459
13275 52459 51141 49629 42468 30668 20918 15668 10178 974 -5294 -799 6037 6993 3848 -799
13261 -799 2257 -4601 -17333 -18721 -21030 -22538 -24707 -28073 -36129 -46148 -54893 -64641 -57365 -43693
13247 -43693 -32643 -13657 2576 29845 48575 66166 73977 77278 89719 97835 107085 105619 104781
13234 104781 97902 86599 75681 69543 65403 55219 47037 48806 50982 54563 50132 51575 58090
13221 58090 61667 63661 54576 43977 42717 42252 41558 41170 38178 43429 37355 26696 23351 24813 20029
13206 20029 19489 18511 15946 11012 15238 18936 18863 20529 22494 24818 25162 22874 24515 27411 37794
13191 37794 49096 57011 59538 65616 67947 68195 62149 56042 55149 54695 59115 61734 59244 55670 55160
$$ packed form
13290H9990o980p723j945R86k608k308j516m318J683N438l262m802j043l631n502
13275E2459j318j512p161j1800r750n250n490r204o268M495O836R56l145m647
13261g99L056o858j2732j388k309j508k169l366q056j0019q745r748P276J3672
13247d3693J1050J8986J6233K7269J8730J7591P811L301J2441Q116R250j466q38
13234A04781o879j1303j0918o138m140j0184q182J769K176L581m431J443O515
13221E8090L577J994r085j0599j260m65o94l88k992N251o074j0659l345J462m784
13206B0029n40r78k565m934M226L698p3J666J965K324L44k288J641K896J0383
13191C7794J1302P915K527O078K331K48o046o107q93m54M420K619k490l574n10
$$ plain form
13176 55160 54800 58839 66370 74047 80942 93137 114542 128777 115141 92004 70009 65219 64373
13163 64373 68889 72795 77750 76540 66620 59474 48316 40052 31673 25552 26057 21250 23970 22497
13149 22497 31504 34778 30244 27737 22962 15902 21808 20190 19869 25195 23088 26906 33940 32540 34766
13134 34766 30466 29633 31435 25470 20647 24034 19635 14897 16038 19132 20991 10324 14982 17743
13120 17743 23744 31572 28371 24237 22344 18929 23038 25717 28995 35095 30029 31776 38623 44002
13106 44002 42466 35934 29625 27781 34092 34536 31315 32098 22136 14925 11422 9455 16355 17344 17185
13091 17185 21249 24953 36658 44648 50454 52770 56690 59267 62546 60685 51735 42384 40159 49434
13077 49434 65252 71883 79417 98448 133185 172821 215629 273925 343576 446420 624537 901521
$$ packed form
13176E5160l60M039P531P677O895J2195K1405J4235j3636k3137k1995m790q46
13163F4373M516L906M955j210r920p146j1158q264q379o121N05m807K720j473
13149B2497R007L274m534k507m775p060N906j618l21N326k107L818P034j400K226
13134C4766m300q33J802n965m823L387m399m738J141L094J859j0667M658K761
13120A7743O001P828l201m134j893l415M109K679L278O100n066J747O847N379
13106D4002j536o532o309j844O311M44l221P83r962p211l503j967O900R89j59
13091A7185M064L704J1705P990N806K316L920K577L279j861q950r351k225R275
13077D9434J5818O631P534J9031L4737L9636M2808N8296O9651J02844J78117K76984
$$ plain form
13065 901521 1289363 1776619 2285959 2684491 2851743 2720548 2344159 1847623 1367013 965776
13055 965776 677738 485477 360000 276435 223704 186577 158482 142164 129571 115349 89425
13044 89425 65187 61039 58507 48443 43659 36799 39114 43069 45396 40153 38397 37922 39238 38995
13030 38995 45567 38528 35651 36239 31723 32103 31172 29953 24938 20852 21654 26897 26787 19891 22527 24155
13014 24155 25472 23335 15982 12240 10362 7750 11973 18824 17504 12842 16213 12639 11972 9452 9943
12999 9943 7879 10063 13686 10450 16118 21059 16665 13359 9187 7349 4921 2109 234 10936
12985 10936 12742 6633 4426 1078 3205 9021 11631 9820 16880 18578 9291 6865 8487 14290
12971 14290 19059 21408 16940 17718 16679 17475 12069 2107 -2269 -1599 -303 3429 11265 8255 6566
$$ packed form
13065I01521L87842M87256N09340L98532J67252j31195l76389m96536m80610m01237
13055I65776k88038j92261j25477q3565n2731l7127k8095j6318j2593j4222k5924
13044H9425k4238m148k532j0064m784o860K315L955K327n243j756m75J316k43
13030C8995O572p039k877N88m516L80r31j219n015m086Q02N243j10o896K636J628
13014B4155J317k137p353l742j878k612M223O851j320m662L371l574o67k520M91
12999I943k064K184L623l236N668M941m394l306m172j838k428k812j875J0702
12985A0936J806o109k207l348K127N816K610j811P060J698r287k426J622N803
12971A4290M769K349m468P78j039P96n406r962m376O70J296L732P836l010j689
$$ plain form
12956 6566 6818 5664 3884 -586 -609 -8118 -7143 -7708 -4844 657 -414 3266 3373 -1017 680 5545
12940 5545 1195 -1021 -3825 -1782 6308 7997 7232 3136 -6987 -4439 1005 289 -5044 120 7179
12925 7179 6366 6807 8033 4777 -118 515 -1317 -1196 6497 5662 2566 1338 -2781 854 2794 1675
12909 1675 -1387 5487 9184 11237 9306 7637 6692 -3598 -1138 80 -5219 -7925 -947 8423 7392
12894 7392 2834 3710 4196 855 -3345 -3649 -5643 -5630 -4430 -5297 -6902 -4825 1354 5514 3308 -3611
12878 -3611 -7181 -8992 -9577 -11371 -12292 -8043 -6669 -5763 628 6608 3249 -526 -3146 -3683 -3803 -319
12862 -319 -5874 -7165 -10229 -13692 -6876 2203 5829 2850 1633 -2223 2008 9127 7883 2827 3312
12847 3312 4855 4633 10038 11216 8570 11571 15839 14010 10370 5721 -80 -257 -3419 -8923 -12817
$$ packed form
12956F566K52j154j780m470k3p509R75n65K864N501j071L680J07m390J697M865
12940E545m350k216k804K043Q090J689p65m096j0123K548N444p16n333N164P059
12925G179q13M41J226l256m895O33j832J21P693q35l096j228m119L635J940j119
12909A675l062O874L697K053j931j669r45j0290K460J218n299k706O978R370j031
12894G392m558Q76M86l341m200l04j994J3J200q67j605K077O179M160k206o919
12878c611l570j811n85j794r21M249J374R06O391N980l359l775k620n37j20L484
12862c19n555j291l064l463O816R079L626k979j217l856M231P119j244n056M85
12847C312J543k22N405J178k646L001M268j829l640m649n801j77l162n504l894
$$ plain form
12832 -12817 -15169 -13304 -4834 -2110 -3311 -2510 713 -2093 -2064 -1913 151 2334 2810 8585 13921 4625
12816 4625 -2162 -6813 -1741 1970 6015 9707 11775 15810 16957 21915 23089 11755 1265 -4702
12802 -4702 -6145 -3948 2000 12655 15178 11919 4334 7166 6089 5833 379 -9839 -13676 -10204
12788 -10204 -5968 1659 3072 453 -2917 -684 -1238 -2768 -3012 -8481 -3316 -773 804 6047 10243
12773 10243 12224 14011 15540 15570 10343 8219 12989 18493 20702 24358 20176 12909 7710 4631 9098
12758 9098 667 -1444 3038 5232 -3402 1691 7845 5217 6135 6597 6363 8132 3244 -5376 -12113
12743 -12113 -11403 -6495 -1656 -557 -4865 -10222 -993 718 -3452 -2623 4478 8447 9431 5265 456
12728 456 6312 16941 28977 26881 20489 17727 15551 14493 6516 3403 5662 6101 3561 -660 4510
$$ packed form
12832a2817k352J865Q470K724j201Q01L223k806K9J51K064K183M76N775N336r296
12816D625o787m651N072L711M045L692K068M035J147M958J174j1334j0490n967
12802d702j443K197N948J0655K523l259p585K832j077k56n454j0218l837L472
12788a0204M236P627J413k619l370K233n54j530k44n469N165K543J577N243M196
12773A0243J981J787J529L0n227k124M770N504K209L656m182p267n199l079M467
12758I098q431k111M482K194q634N093O154k628R18M62k34J769m888q620o737
12743a2113P10M908M839J099m308n357R229J711m170Q29P101L969R84m166m809
12728D56N856J0629J2036k096o392k762k176j058p977l113K259M39k540m221N170
$$ plain form
12713 4510 957 2672 3100 9614 7984 3056 -457 -3885 605 -1087 -2614 -4469 -1318 1388 4170
12698 4170 4302 2081 1467 -3601 -4287 -6845 -11797 -4803 4719 5093 5277 7525 4190 5630 -767 -6158
12682 -6158 -4794 -431 5649 12240 11379 7521 9106 3039 3393 2397 9497 10105 8769 11475 19021 15924
12666 15924 14588 11126 10022 15194 10533 15407 17353 10287 836 2036 9222 7584 7660 8836 6816
12651 6816 3387 1241 4243 10203 17200 10167 240 -1512 -2097 -2852 2940 760 -890 4599 8971
12636 8971 12644 17421 23100 30566 32798 20451 6994 1572 9402 18749 20029 20298 29918 53938
12622 53938 70716 85091 85267 74005 63893 54116 41597 29884 23532 15367 6928 6202 12399
12609 12399 13515 12681 11171 7371 4540 8873 11786 6704 -3268 2457 5656 5604 6184 10352 11634
$$ packed form
12713D510l553J715M28O514j630m928l513l428M490j692j527j855L151K706K782
12698D170J32k221o14n068o86k558m952O994R522L74J84K248l335J440o397n391
12682f158J364M363O080O591q61l858J585o067L54r96P100O08j336K706P546l097
12666A5924j336l462j104N172m661M874J946p066r451J200P186j638P6J176k020
12651F816l429k146L002N960O997p033r927j752n85p55N792k180j650N489M372
12636H971L673M777N679P466K232j2347j3457n422P830R347J280K69R620K4020
12622E3938J6778J4375J76j1262j0112r777j2519j1713o352q165q439p26O197
12609A2399J116q34j510l800k831M333K913n082r972N725L199n2N80M168J282
$$ plain form
12594 11634 7980 6911 13220 11805 6609 6255 3903 5932 6423 7851 17044 17969 22381 25826 34296
12579 34296 47651 68224 98277 124668 126342 116642 96868 75957 54905 35487 23567 19784
12567 19784 21718 16011 9956 11927 16673 16025 18377 20416 12891 2958 -4945 -2860 2371 6015 4194
12552 4194 4973 9070 2539 1343 4518 10736 12276 13584 14108 11907 9444 10264 14595 13231 11835
12537 11835 16947 34171 37310 46942 57824 72506 84778 86327 69202 52789 40662 32290 22417
12524 22417 16305 18707 16225 14550 14931 20354 24704 28530 29269 20859 11930 11501 20513 16907 12442
12509 12442 9657 3967 5309 10332 6533 -336 -6306 -4339 -6232 -7245 -2731 6129 11713 4751
12495 4751 2903 8482 13925 17319 18328 19741 21181 20890 22966 24283 26676 18884 14593 10902 5137
$$ packed form
12594A1634l654j069O309j415n196l54k352K029M91J428R193R25M412L445Q470
12579C4296J3355K0573L0053K6391J674r700j9774k0911k1052j9418j1920l783
12567A9784J934n707o055J971M746o48K352K039p525r933p903K085N231L644j821
12552D194P79M097o531j196L175O218J540J308N24k201k463Q20M331j364j396
12537A1835N112J7224L139R632J0882J4682J2272J549j7125j6413j2127q372r873
12524B2417o112K402k482j675L81N423M350L826P39q410q929m29R012l606m465
12509A2442k785n690J342N023l799o869n970J967j893j013M514Q860N584o962
12495D751j848N579N443L394J009J413J440k91K076J317K393p792m291l691n765
$$ plain form
12480 5137 6491 8259 16864 24629 23318 27143 33921 31692 18512 9139 9892 9374 13282 15944 12192
12465 12192 12857 8546 3624 5698 7051 8633 14630 15038 17260 23973 27510 34115 38959 50728 72027
12450 72027 101616 140728 190956 238882 256358 225065 166200 115701 77989 52684 37341 34205
12438 34205 33670 27996 23479 19432 14902 18336 23403 24595 20791 16533 17795 18426 17101 13985 13475
12423 13475 12892 11490 7265 5184 5746 5949 7640 -2080 -4222 2351 3655 5737 4830 1237 5070
12408 5070 5885 1795 1704 1545 2775 5302 5637 6389 9648 9793 1923 -2082 -1977 -1977 -1461 3145 2438 594
12390 594 -2946 -1821 -615 4429 9554 8100 5989 -2729 -10796 -14315 -12229 -6788 -5666 -2747 -1346
12375 -1346 -903 2148 3613 7933 6906 6885 2392 3419 6333 10308 13795 8294 6229 9316 11000
$$ packed form
12480E137J354J768Q605P765j311L825O778k229j3180r373P53n18L908K662l752
12465A2192O65m311m922K074J353J582N997M08K222O713L537O605M844J1769K1299
12450G2027K9589L9112N0228M7926J7476l1293n8865n0499l7712k5305j5343l136
12438C4205n35n674m517m047m530L434N067J192l804m258J262O31j325l116n10
12423A3475n83j402m225k081N62K03J691r720k142O573J304K082r07l593L833
12408E070Q15m090r1j59J230K527L35P52L259J45p870m005J05%N16M606p07j844
12390E94l540J125J206N044N125j454k111q718q067l519K086N441J122K919J401
12375a346M43L051J465M320j027k1m493J027K914L975L487n501k065L087J684
$$ plain form
12360 11000 6432 1583 39 -308 -3745 -3292 219 -1178 703 -1147 -6446 -1096 5437 4053 -3604
12345 -3604 -1458 2378 5544 6630 4170 3127 8391 2784 -4848 -609 1483 -6304 -6369 -4513 2959
12330 2959 2970 1365 7511 3503 1140 1873 -713 807 -3154 -5872 -2503 893 4658 856 1730 -1665
12314 -1665 2593 8958 11607 12938 13799 11339 5716 2402 -785 -2127 -1085 -261 8799 3605 -5274
12299 -5274 287 -726 -6233 -5721 -5521 -7723 -4372 -6137 -3848 -2766 -5150 -10049 -5980 704 3543
12284 3543 3697 8016 3777 1210 -2327 -10515 -14388 -15788 -8907 1221 4438 1102 2531 3699 3702
12269 3702 1068 -2878 -5616 -4221 -3754 -5054 -2801 -1029 -2633 -3563 114 -5590 -6581 1788 2975
12254 2975 1131 2195 5377 4279 4133 -294 -10488 -15180 -9658 -2931 -1137 -2714 -3820 -7533 -8299
$$ packed form
12360A1000m568m849j544l47l437M53L511j397J881j850n299N350O533j384p657
12345c604K146L836L166J086k460j043N264n607p632M239K092p787o5J856P472
12330B959J1j605O146m008k363P33k586J520l961k718L369L396L765l802Q74l395
12314a665M258O365K649J331Q61k460n623l314l187j342J042Q24R060n194q879
12299e274N561j013n507N12K00k202L351j765K289J082k384m899M069O684K839
12284C543J54M319m239k567l537q188l873j400O881J0128L217l336J429J168L
12269C702k634l946k738J395M67j300K253J772j604r30L677n704r91Q369J187
12254B975j844J064L182j098j46m427j0194m692N522O727J794j577j106l713p66
$$ plain form
12239 -8299 2460 -4866 -8297 -5981 -6586 -509 2311 1026 3908 -1387 -7867 -5100 -5273 -8762 682
12224 682 4814 3222 5233 5316 1708 2856 2602 1255 -1312 -1582 -4609 -4633 -5604 -8063 -6797 -8414 -9931
12207 -9931 -3949 2902 6365 -1041 -4565 -4818 -4646 -6880 -12276 -7459 -5196 -7014 -6001 -1365 -2663
12192 -2663 -2855 -427 6647 5800 5917 5584 499 -671 2851 -842 -2030 -4890 984 -1331 -5642 -1583
12176 -1583 700 -2687 -2235 1144 1453 5696 9713 -3210 -12916 -14879 -13838 -9120 -7047 -497 607
12161 607 286 -165 -930 137 -241 -3903 -7255 -2894 -1142 -2664 1143 -1509 -1851 -1403 4829 8906
12145 8906 4570 -1891 -3295 -3950 -3431 -644 -485 5879 12661 7786 -130 1165 -1142 -3859 -7651
12130 -7651 -11695 -9673 -6611 -12551 -13850 -14490 -12362 -2393 5054 1027 -3123 -7124 -7822 -1184 4454
$$ packed form
12239h299J0759p326l431K316o05O077K820j285K882n295o480K767j73l489R444
12224F82M132j592K011Q3l608J148k54j347k567k70l027k4r71k459J266j617j517
12207i931N982O851L463p406l524k53J72k234n396M817K263j818J013M636j298
12192b663j92K428P074q47J17l33n085j170L522l693j188k860N874k315m311M059
12176a583K283l387M52L379L09M243M017j2923r706j963J041M718K073O550J104
12161F07l21m51p65J067l78l662l352M361J752j522L807k652l42M48O232M077
12145H906m336o461j404o55N19K787J59O364O782m875p916J295k307k717l792
12130g651m044K022L062n940j299o40K128R969P447m027m150m001o98O638N638
$$ plain form
12115 4454 4946 1329 -2545 3610 5205 1398 2639 6810 6319 2356 -1558 -2329 3031 1642 -2837
12100 -2837 -4876 -1202 -2770 -5809 2107 2179 -571 -1811 -792 -4665 -2168 216 1314 3231 6493
12085 6493 3419 2311 7449 6807 3234 994 600 -788 -747 7275 11406 6997 6116 8257 6703 -144
12069 -144 2516 2331 1118 -2068 -5527 -7388 -12133 -17093 -14098 -8102 -5157 -3372 -2674 8 1231
12054 1231 9184 5101 -1020 -6300 -3334 -5869 -7986 -2636 2690 7176 -2724 -10703 -9179 -6114 -4834
12039 -4834 -9645 -7036 1886 5713 11271 13025 10918 3353 1825 2304 -1430 -742 -2801 -3284 -2665 -144
12023 -144 1249 -7133 -8405 -3966 -4250 -8024 -10999 -5984 -2446 -168 -140 -2495 -5054 1292 5738 4795
12007 4795 3045 2228 1533 -3112 -7584 -8883 -8185 -6816 -4419 -2360 5031 6347 4800 3378 771
$$ packed form
12115D454M92l617l874O155J595l807J241M171m91l963l914p71N360j389m479
12100b837k039L674j568l039P916P2k750j240J019l873K497K384J098J917L262
12085F493l074j108N138o42l573k240l94j388M1Q022M131m409q81K141j554o847
12069a44K660j85j213l186l459j861m745m960K995N996K945J785O98K682J223
12054A231P953m083o121n280K966k535k117N350N326M486r900p979J524L065J280
12039d834m811K609Q922L827N558J754k107p565j528M79l734O88k059m83O19K521
12023a44J393q382j272M439k84l774k975N015L538K278K8k355k559O346M446r43
12007D795j750q17o95m645m472j299O98J369K397K059P391J316j547j422k607
$$ plain form
11992 771 -2899 -5992 -6948 -3749 -7164 -804 600 -3817 -6188 -9984 -9866 -13214 -10165 -5191 -3278
11977 -3278 -666 -2449 -6290 -5063 -2813 867 -1192 293 -1971 -1227 2127 -2669 -6296 1935 888
11962 888 -5981 -7361 -2480 5114 7834 8238 9636 8482 8514 12658 8360 9743 5196 6832 1874 -2706
11946 -2706 3732 5904 5687 910 234 435 287 188 -3201 -3350 -907 2352 -652 -5357 -6753 -7637 -5970
11929 -5970 2572 5256 6995 6237 890 -3043 -1255 -3869 -7392 -6025 -958 -2523 205 6348 3172
11914 3172 953 -2597 -12229 -12364 -6753 -4198 -3557 -6034 -8376 -15063 -20118 -20197 -15999 -7644 -2593 2406
11898 2406 -618 -6755 -6412 -12339 -11578 -7721 -4339 -4090 -1449 4377 3143 -3846 -9007 -9559 -10894 -9972
11882 -9972 -7927 -3848 -5562 -2727 -4155 -7035 -8115 -10243 -7764 -4003 -1808 -575 -1118 3982 2914
$$ packed form
11992G71l670l093r56L199l415O360J404m417k371l796J18l348L049M974J913
11977c278K612j783l841J227K250L680k059J485k264P44L354m796l627Q231j047
11962H88o869j380M881P594K720M04J398j154L2M144m298J383m547J636m958m580
11946b706O438K172k17m777o76K01j48r9l389j49K443L259l004m705j396q84J667
11929e970Q542K684J739p58n347l933J788k614l523J367N067j565K728O143l176
11914C172k219l550r632j35N611K555O41k477k342o687n055p9M198Q355N051M999
11898B406l024o137L43n927P61L857L382K49K641N826j234o989n161n52j335R22
11882i972K045M079j714K835j428k880j080k128K479L761K195J233n43N100j068
$$ plain form
11867 2914 176 -1957 -9638 -8020 -4376 -6798 -6352 -4154 1904 -348 -7150 -12326 -14376 -11652 -8627
11852 -8627 -9763 -8428 -8341 -5325 -9515 -14881 -16428 -10765 593 -3521 -10171 -12066 -11956 -12003 -8769 -5335
11836 -5335 -6185 -5734 -389 475 2019 -2355 -4136 -245 -6358 -7302 -719 -2377 -2510 1072 4099 5049
11820 5049 4963 -2200 -4291 485 -3924 -3749 -2491 -5648 -5294 -1203 3847 9961 4457 -1471 -1387 -2038
11804 -2038 -4402 -6185 -2781 -7480 -6536 -3791 -10042 -7276 -2798 453 4492 2384 -3474 -2175 -3666
11789 -3666 9070 13023 11045 4310 -5283 -7585 -5554 -2772 2365 -501 -6895 -9765 -1240 -1469 948
11774 948 4613 2777 -2374 -4977 -5321 -2500 -3553 -6251 -4708 -83 -640 -873 1100 -88 2726 6071
11758 6071 -1021 -10249 -14971 -16570 -18286 -13784 -12653 -9167 -6482 -481 3160 1891 -2480 -1255 -4062
$$ packed form
11867B914k738k133p681J618L644k422M46K198O058k252o802n176k050K724L025
11852h627j136J335Q7L016m190n366j547N663J1358m114o650j895J10m7L234L434
11836e335q50M51N345Q64J544m374j781L891o113r44O583j658j33L582L027R50
11820E049q6p163k091M776m409J75J258l157L54M091N050O114n504n928Q4o51
11804b038k364j783L404m699R44K745o251K766M478L251M039k108n858J299j491
11789c666J2736L953j978o735r593k302K031K782N137k866o394k870Q525k29K417
11774I48L665j836n151k603l44K821j053k698J543M625n57k33J973j188K814L345
11758F071p092r228m722j599j716M502J131L486K685O001L641j269m371J225k807
$$ plain form
11743 -4062 -8115 -7303 -7685 -9967 -5888 -1257 -3343 -2986 -3495 4665 1569 687 2322 5907 10378 8740
11727 8740 8097 5535 -2526 -1388 -4337 -3112 -1793 -820 715 1181 4330 3494 890 -3146 -5600 -6398
11711 -6398 -7908 -5954 -3932 16 1039 -877 -4404 -211 -2190 -7917 -10935 -10300 -11044 -14403 -14700
11696 -14700 -5758 -2339 4799 2431 47 868 826 -20 -2133 -4754 -5181 -7635 -7549 -7380 -9901 -15400
11680 -15400 -20628 -18514 -9348 607 -3208 -11720 -3543 -1484 -916 1838 5776 4617 3111 -803 -2580
11665 -2580 -2907 2784 3451 334 -1955 -322 2254 -197 -7243 -9493 -5551 -8217 -12943 -10325 -9808
11650 -9808 -10304 -13429 -8808 -6525 -3150 5056 3272 -8129 -6698 -2954 -3346 -790 -1503 -3741 -7790
11635 -7790 -11286 -11112 -6093 -999 -53 -435 -1577 -1584 -2180 -3756 3191 -3046 -10682 -13788 -10821 -10705 -10390
$$ packed form
11743d062m053Q12l82k282M079M631k086L57n09Q160l096q82J635L585M471j638
11727H740o43k562q061J138k949J225J319R73J535M66L149q36k604m036k454p98
11711f398j510J954K022L948J023j916l527M193j979n727l018O35p44l359k97
11696a4700Q942L419P138k368k384Q21m2q46k113k621m27k454Q6J69k521n499
11680a5400n228K114R166R955l815q512Q177K059N68K754L938j159j506l914j777
11665b580l27N691O67l117k289J633K576k451p046k250L942k666m726K618N17
11650i808m96l125M621K283L375Q206j784j1401J431L744l92K556p13k238m049
11635g790l496J74N019N094R46l82j142pn96j576O947o237p636l106K967J16L15
$$ plain form
11618 -10390 -15462 -16406 -14380 -8157 -4387 -5747 -2374 -4906 -5651 -8869 -5724 -2971 -11074 -19458 -12418
11603 -12418 -3295 -1064 144 -4484 -9667 -3673 -8080 -10823 -8890 -6737 -1894 2585 7028 4367
11589 4367 2705 -1567 -4096 3304 11118 10708 5089 -240 -1382 -1400 -3368 -3651 -5796 -5771 -1323 -1602
11573 -1602 -1422 -36 3221 797 3878 3848 -1226 -4100 -173 -2554 -4680 -670 5641 3355 -2386
11558 -2386 -6668 -8162 -12188 -7928 -3386 1816 3376 6664 2180 -3162 3006 4915 -1497 -967 782
11543 782 3040 4607 -1459 -3758 -378 915 -3768 -7490 -6217 -8551 -9417 -4202 1396 3688 90
11528 90 -2267 1393 4008 -1828 -6990 -8404 -1137 -4623 -9919 -2926 3890 1573 175 -3124 -6023
11513 -6023 -5875 -4938 -131 362 4002 6827 4724 1268 -1466 -4872 -11229 -7872 -3402 -6438 -11440
$$ packed form
11618a0390n072r44K026O223L770j360L373k532p45l218L145K753q103q384P040
11603a2418R123K231J208m628n183N994m407k743J933K153M843M479M443k661
11589D367j662m272k529P400P814m10n619n329j142j8j968k83k145K5M448k79
11573a602J80J386L257k424L081l0n074k874L927k381k126M010O311k286n741
11558b386m282j494m026M260M542N202J560L288m484n342O168J909o412N30J749
11543G82K258J567o066k299L380J293m683l722J273k334q66N215N598K292l598
11528I0k357L660K615n836n162j414P267l486n296O993O816k317j398l299k899
11513f023J48R37M807M93L640K825k103l456k734l406o357L357M470l036n002
$$ plain form
11498 -11440 -7096 -3115 -3316 -3720 -3082 870 710 -839 -938 -727 821 -564 -6885 -14016 -19403 -14700
11482 -14700 -4533 2134 -1274 -4556 -832 -3304 -13236 -16561 -14493 -4392 194 2301 -1673 -5657
11468 -5657 -1568 4303 1880 -1723 -8473 -14246 -21552 -14123 -12676 -15385 -14125 -10880 -6410 -7367 -7673
11453 -7673 -7792 -4382 -6811 -9277 -12553 -8057 -680 641 -3408 2576 7125 7683 3485 -1721 -1329
11438 -1329 -497 -1217 -46 1894 618 -3679 -4672 -7549 -8079 -5406 1065 9457 8212 700 -4912 -4887
11422 -4887 -2624 6 3939 1800 -1737 1078 1463 -3249 -223 1987 -3540 -14646 -22078 -21789 -9148
11407 -9148 -5090 -6420 -1173 3721 6047 -1216 -2086 -2877 -5522 -3141 -1518 -2335 2471 8371 274
11392 274 -7855 -6878 -5217 28 3710 1301 -5975 -5351 -4039 1520 -1834 -7665 -7049 -11900 -14891 -12354
$$ packed form
11498a1440M344L981k01m04O38L952j60j549r9K11J548j385o321p131n387M703
11482a4700J0167O667l408l282L724k472r932l325K068J0101M586K107l974l984
11468e657M089N871k423l603o750n773p306P429J447k709J260L245M470r57l06
11453g673j19L410k429k466l276M496P377J321m049N984M549N58m198n206L92
11438a329Q32p20J171J940j276m297r93k877n30K673O471Q392j245p512n612K5
11422d887K263K630L933k139l537K815L85m712L026K210n527j1106p432K89J2641
11407i148M058j330N247M894K326p263q70p91k645K381J623q17M806N900q097
11392B74q129R77J661N245L682k409p276O24J312N559l354n831O16m851k991K537
$$ plain form
11376 -12354 -6258 -3308 1430 6869 6005 6212 7697 3882 -4866 -13094 -14708 -11258 -16316 -14652 -16892
11361 -16892 -14641 -17252 -20451 -20111 -16418 -9003 431 -2191 -5924 -2354 -3229 -2609 3467 2566 1815 3726
11345 3726 3409 7120 6858 7558 3035 2091 -1736 -10249 -13266 -10959 -4224 -572 6247 7114 10134 1084
11329 1084 -3858 -5260 -4352 -13371 -19672 -15602 -8565 -6963 -5802 -2397 -2280 -582 -1024 -856 -8177 -17675
11313 -17675 -19001 -13662 -6202 2450 2504 2500 110 -2559 -6309 -7084 -5608 -4120 259 3719 4207 6180
11297 6180 -2124 -7356 -4571 -4416 -4303 -3222 874 -7624 -5801 -3077 -246 -4808 -7757 -11782 -7692
11282 -7692 -7364 -7573 -8978 -16820 -13298 -7752 -1837 -4551 -11656 -14585 -21832 -21707 -18923 -13450 -11068
11267 -11068 -7646 -6394 -8614 -13887 -14047 -12390 -10817 -12593 -9890 -11546 -13322 -13421 -7136 -6469 -4163
$$ packed form
11376a2354O096K950M738N439q64K07J485l815q748q228j614L450n058J664k240
11361a6892K251k611l199L40L693P415R434k622l733L570q75O20O076r01p51J911
11345C726l17L711k62P00m523r44l827q513l017K307O735L652O819Q67L020r050
11329A084m942j402R08r019o301M070P037J602J161L405J17J698m42J68p321r498
11313a7675j326N339P460Q652N4mk390k669l750p75J476J488M379L460M88J973
11297F180q304n232K785J55J13J081M096q498J823K724K831m562k949m025M090
11282g692L28k09j405p842L522N546N915k714p105k929p247J25K784N473K382
11267a1068L422J252k220n273j60J657J573j776K703j656j776r9O285O67K306
$$ plain form
11252 -4163 -9030 -8084 -7586 -12269 -9397 -2729 -910 -1272 -1409 -4197 -7661 -6091 -4959 -5574 -3082 793
11236 793 3979 986 968 2332 3702 -662 -6549 -11043 -12681 -7608 -8763 -3709 -168 1975 612
11221 612 389 -523 5542 -1204 1185 -3349 -8087 -12582 -3285 -684 -5005 -11056 -8252 -11599 -20942
11206 -20942 -17482 -12120 -3960 2581 -4785 -7517 -4622 -7687 -16064 -9865 -9355 -8711 -6871 1445 -3071
11191 -3071 -5262 -6297 -1106 2174 -495 -1953 -4650 -8511 -7789 -6978 -4582 -318 8227 1670 -946
11176 -946 -5264 -9271 -7140 -5518 2274 11330 11318 5961 2001 3640 2392 6213 7603 7586 8136 5066
11160 5066 5998 5299 2760 -3957 -9099 -12333 -8181 -2445 1939 -101 85 3769 3027 4920 6395 1346
11144 1346 -4691 -5234 -7723 -7125 -10563 -16977 -14927 -12105 -11957 -12399 -12326 -5192 -908 627 1186 2529
$$ packed form
11252d163m867R46M98m683K872O668J819l62j37k788l464J570J132o15K492L875
11236G93L186k993j8J364J370m364n887m494j638N073j155N054L541K143j363
11221F12k23r12O065o746K389m534m738m495R297K601m321o051K804l347r343
11206b0942L460N362Q160O541p366k732K895l065q377O199N10O44J840Q316m516
11191c071k191j035N191L280k669j458k697l861P22Q11K396M264Q545o557k616
11176i46m318m007K131J622P792R056j2n357l960J639j248L821J390j7N50l070
11160E066R32o99k539o717n142l234M152N736M384k040J86L684p42J893J475n049
11144A346o037n43k489N98l438o414K050K822J48m42P3P134M284J535N59J343
$$ plain form
11128 2529 -1942 -6221 -8569 -6946 -3896 -6721 -11832 -11950 -3919 -1510 1621 3952 -797 -7139 -8817
11113 -8817 -11394 -9330 -9068 -10201 -5144 -3016 2001 -1533 -7024 -7517 -5207 -7946 -7563 -1953 -1077 3140
11097 3140 -3643 -3007 5022 -891 486 2855 -272 -4515 -8793 849 4819 3193 -2202 -1592 225
11082 225 2483 3599 112 -8316 -14966 -11921 -8032 -3777 1197 1191 1423 4435 8455 3055 6622 10049
11066 10049 2075 -3676 -1232 -4917 -6952 -2221 -2525 -4048 -4471 -1206 -251 2823 5760 5464 6718
11051 6718 4697 7177 7915 4944 -1239 673 539 499 -3533 -6924 -4659 -6503 -5084 2546 8594 2084
11035 2084 1150 892 381 809 2801 5890 2273 -5588 -7483 11 -360 -5718 -4992 -1469 -7107 -9116
11019 -9116 -7606 -5371 -512 -1990 -6640 -1331 -316 -5793 -8338 -6622 4071 2643 -370 -4300
$$ packed form
11128B529m471m279k348J623L050k825n111j18Q031K409L131K331m749o342j678
11113h817k577K064K62j133N057K128N017l534n491m93K310k739L83N610Q76M217
11097C140o783O36Q029n913J377K369l127m243m278R642L970j626n395O10J817
11082B25K258J116l487q428o650L045L889M255M974oK32L012M020n400L567L427
11066A0049p974n751K444l685k035M731l04j523m23L265R55L074K937k96J254
11051F718k021K480P38k971o183J912j34m0m032l391K265j844J419P630O048o510
11035B084r34k58n11M28J992L089l617p861j895P494l71n358P26L523n638k009
11019i116J510K235M859j478m650N309J015n477k545J716J0693j428l013l930
$$ plain form
11005 -4300 -4690 -3339 -3002 809 7043 10747 9326 5624 -733 -8293 -12979 -12998 -12971 -9361 -9641 -5723
10989 -5723 -8420 -9232 -161 7488 2324 -2504 -1040 -2971 -1031 1212 10 3280 5920 5588 1127
10974 1127 -1375 -1296 3193 3429 1088 -7510 -7274 -6051 -4710 -4652 -861 -3081 -4418 -7169 -12305 -4843
10958 -4843 -1194 -3265 1236 3898 5212 8992 4334 -4534 -8217 1610 6013 3653 -3335 -7988 -4838
10943 -4838 -8332 -10830 -8786 -9280 -16740 -9759 -2577 -1426 -4071 -5657 -3639 955 4655 2523 -7797
10928 -7797 -6539 -7451 -7197 -2583 3982 9104 4089 -891 1457 -422 729 2353 201 3004 2140
10913 2140 -3487 -5488 -4602 -2778 69 2044 3620 5023 -813 -6509 -9662 -3941 -871 -2949 1454
10898 1454 4216 6711 12102 8645 7567 4115 5883 916 2774 6128 2349 984 -2865 -7155 -5679
$$ packed form
11005d300l90J351L37L811O234L704j421l702o357p560m686j9K7L610k80L918
10989e723k697q12R071P649n164m828J464j931J940K243j202L270K640l32m461
10974A127k502P9M489K36k341q598K36J223J341N8L791k220j337k751n136P462
10958d843L649k071M501K662J314L780m658q868l683R827M403k360o988m653L150
10943d838l494k498K044m94p460O981P182J151k645j586K018M594L700k132j0320
10928g797J258r12K54M614O565N122n015m980K348j879J151J624k152K803q64
10913B140n627k001Q86J824K847J975J576J403n836n696l153N721L070k078M403
10898A454K762K495N391l457j078l452J768m967J858L354l779j365l849m290J476
$$ plain form
10883 -5679 -5679 -8938 -5561 1073 4238 2501 1552 824 6288 15827 16304 8286 2276 3992 6400 3559
10867 3559 -856 1683 2131 -4632 199 7566 4071 -2119 -6012 -4100 -3886 -1554 -1813 -7622 -6218
10852 -6218 -674 -982 -6954 -5072 -4686 -3150 1048 5190 6637 -1413 -3284 1754 5026 18 -8076
10837 -8076 -12752 -10005 -8230 -5215 -4822 -8654 -7584 -2302 -523 -5111 421 645 -5289 -6584 3866
10822 3866 7328 7771 3942 2040 4745 -2348 -5942 -4459 -6687 -15759 -18302 -11887 -11863 -14682 -12550
10807 -12550 -7869 -7249 -4665 -3637 -1906 -6060 -4038 2822 4355 3427 3793 -1564 2639 4113 2152
10792 2152 -2568 -5096 -6743 -3604 -3305 -7833 -11497 -9293 -4560 -283 5517 1952 -3798 -5248 -12688
10777 -12688 -10855 -8722 -6067 -3859 -937 2063 -895 -299 -1433 -1551 -6854 -4627 -5984 -10150 -9855
$$ packed form
10883e679%l259L377O634L165j737r49p28N464R539M77q018o010J716K408k841
10867C559m415K539M48o763M831P367l495o190l893J912K14K332k59n809J404
10852f218N544l08n972J882L86J536M198M142J447q050j871N038L272n008q094
10837h076m676K747J775L015L93l832J070N282J779m588N532K24n934j295J0450
10822C866L462M43l829j902K705p093l594J483k228r072k543O415K4k819K132
10807a2550M681O20K584J028J731m154K022O860J533r28L66n357M203J474j961
10792B152m720k528j647L139K99m528l664K204M733M277N800l565n750j450p440
10777a2688J833K133K655K208K922L000k958N96j134j18n303K227j357m166K95
$$ plain form
10762 -9855 -3178 -6258 -9888 -5207 -261 2716 3525 2818 5942 6630 892 -3103 -3419 3978 2449 -2915
10746 -2915 -3510 -6698 -4980 -3798 -1965 3719 4787 352 -222 2478 8247 603 -1473 -3521 -3456 -4844
10730 -4844 -5392 -4469 -7554 -7916 -5825 -2570 -3735 76 9029 7408 9746 7909 2069 -3884 -2552
10715 -2552 215 -5098 -6605 -6162 -2145 -1463 -2844 -3060 -1610 -4659 -557 3950 4459 3411 774 2786
10699 2786 8554 4513 2186 -357 949 2414 6160 11730 4785 1992 3365 2893 5768 15288 15587
10684 15587 20364 27082 24282 24178 30645 34000 43827 62125 81582 109952 160792 230114 308328
10671 308328 389949 475958 539651 575252 579583 555431 502803 429321 340105 255601 183886 131748
10659 131748 95619 70352 48133 33643 21494 16008 14892 19278 14412 2921 -2664 -6002 -5364
$$ packed form
10762i855O677l080l630M681M946K977Q09p07L124O88n738l995l16P397j529n364
10746b915n95l188J718J182J833N684J068m435n74K700N769p644k076k048O5j388
10730d844n48R23l085l62K091L255j165L811Q953j621K338j837n840n953J332
10715b552K767n313j507M43M017O82j381k16J450l049M102M507N09j048k637K012
10699B786N768m041k327k543J306J465L746N570o945k793J373m72K875R520K99
10684A5587M777O718k800j04O467L355R827J8298J9457K8370N0840O9322P8214
10671C08328Q1621Q6009O3693L5601M331k4152n2628p3482q9216q4504p1715n2138
10659A31748l6129k5267k2219j4490j2149n486j116M386m866j1491n585l338O38
$$ plain form
10646 -5364 -98 7646 5491 1741 -4451 -8852 -4343 -2860 -4391 -638 -1394 -1071 -8315 -10096 -10331
10631 -10331 -6024 -393 9129 17576 15991 11749 7261 6998 7590 12193 5838 -3357 -3376 -1973 -5592
10616 -5592 -954 -4624 -1011 4779 8462 7333 5593 5601 3011 -3611 -6646 -4671 -968 3444 1131
10601 1131 2668 7653 11225 6725 2184 -1895 -8026 -6116 -5355 -3605 -821 -3023 -2473 -7798 -6324
10586 -6324 -3001 -984 -2459 -2801 4285 -1715 -2782 -1771 -6005 -9573 -6376 1548 3384 1427 2386
10571 2386 2559 2499 1481 1515 -4575 -6579 -1636 -1670 -3037 -679 2228 3154 10221 15972 15848 13445 3972
10554 3972 -3668 -6737 -9786 -7962 -2486 2923 -1661 -4279 -8234 -14549 -12963 -2595 -1401 1110
10540 1110 8828 5170 -2057 -5244 2916 6315 6307 3606 -4478 -2588 -1106 74 -1841 1305 2057 7242
$$ packed form
10646e364N266P744k155l750o192m401M509J483j531L753p56L23p244j781k35
10631a0331M307N631R522Q447j585m242m488k63N92M603o355r195j9J403l619
10616e592M638l670L613N790L683j129j740Qk590o622l035J975L703M412k313
10601A131J537M985L572m500m541m079o131J910P61J750K784k202N50n325J474
10586f324L323K017j475l42P086o000j067J011m234l568L197P924J836j957R59
10571B386J73o0j018L4o090k004M943l4j367K358K907R26P067N751j24k403r473
10554C972p640l069l049J824N476N409m584k618l955o315J586J0368J194K511
10540A110P718l658p227l187Q160L399qk701q084J890J482J180j915L146P52N185
$$ plain form
10524 7242 10945 5373 -1589 -7322 -1218 -3744 -4239 -6318 -7816 4464 15608 15758 13982 11550 11199
10509 11199 7855 2361 3251 5280 6810 4773 4125 802 -5952 -5687 1254 312 -7000 -7991 -10852 -8403
10493 -8403 -7037 -64 2307 2099 1414 -2814 -6035 -6532 -5952 -8408 -6772 -5236 -4049 -9695 -14280 -9416
10477 -9416 -9744 -9983 -9016 -594 -1829 -401 912 -3386 -1009 -11 -3151 -2540 -121 -870 4275 4319 246
10460 246 -302 -2820 -4415 -5381 -6477 -3935 1867 3153 2938 -1041 -4517 -5823 -4814 -3792 -2798 1999
10444 1999 7339 4721 -3488 -5233 -8691 -14269 -9831 814 8159 8614 9215 9545 7280 4359 5800
10429 5800 6600 947 3848 4910 4735 6590 -3879 -12284 -11341 -16119 -10747 -3057 -882 -897 36 42 -405
10412 -405 4643 6847 2708 9205 12322 11637 8356 8351 7959 9674 3481 1380 6432 7907 3026 -5211
$$ packed form
10524G242L703n572o962n733O104k526m95k079j498J2280J1144J50j776k432l51
10509A1199l344n494Q90K029J530k037o48l323o754K65O941r42p312r91k861K449
10493h403J366O973K371k08o85m228l221m97N80k456J636J536J187n646m585M864
10477i416l28k39R67Q422j235J428J313m298K377R98l140O11K419p49N145M4m073
10460B46n48k518j595r66j096K542N802J286k15l979l476j306J009J022R94M797
10444A999N340k618q209j745l458n578M438J0645P345M55O01L30k265k921J441
10429E800Q00n653K901J062j75J855j0469q405R43m778N372P690K175j5R33Om47
10412d05N048K204m139O497L117o85l281nl92J715o193k101N052J475m881q237
$$ plain form
10396 -5211 -10629 -12432 -14709 -7528 116 2347 5130 5275 857 -3971 -5646 -451 -2274 -938 680
10381 680 3201 1180 -5463 -8811 -10385 -8308 -12116 -16989 -19289 -13960 -8448 -7700 -7336 -7373 -10828 -12775
10365 -12775 -13501 -9896 -8321 -3944 1015 3362 1954 -1070 1662 65 -3600 -4765 -2740 -2205 -1883
10350 -1883 1383 1859 -3962 -7371 -9912 -4027 -9234 -14265 -10438 -8867 -15826 -18852 -16202 -18089 -10107
10335 -10107 -6704 -7115 -5393 -5531 -6942 -6845 -6929 -6868 -8706 -631 6068 2153 -3778 5235 10192 7713
10319 7713 3292 5151 2 -4437 -3541 -8714 -2514 3179 -1877 -246 1718 2432 3173 -1755 -7102
10304 -7102 -6056 -1287 1628 -4504 -9770 -11098 -8085 3953 -1630 -6751 -2511 -707 -2052 313
10290 313 -1355 -5243 -4457 -4290 -8276 -9958 -8062 -4753 -1055 -210 -577 -4015 -2149 7099 6997 8910
$$ packed form
10396e211n418j803k277P181P644K231K783J45m418m828j675N195j823J336J618
10381F80K521k021o643l348j574K077l808m873k300N329N512P48L64l7l455j947
10365a2775p26L605J575M377M959K347j408l024K732j597l665j165K025N35L22
10350a883L266M76n821l409k541N885n207n031L827J571o959l026K650j887P982
10335a0107L403m11J722j38j411R7q4O1j838Q075O699l915n931R013M957k479
10319G713m421J859n149m439Q96n173O200N693n056J631J964P14P41m928n347
10304g102J046M769K915o132n266j328L013J2038n583n121M240J804j345K365
10290C13j668l888P86J67l986j682J896L309L698Q45l67l438J866R248j02J913
$$ plain form
10274 8910 5761 5793 8026 3208 -2889 370 7191 6081 4592 6761 6293 6462 8456 9434 5371 4422
10258 4422 1897 23 2707 -5579 -5625 -4874 -2762 -553 -4809 -11008 -5385 3529 5195 5442 2289 -1352
10242 -1352 1655 2364 327 625 -303 -2052 -3281 -1921 2507 44 -7408 -10835 -9810 -13054 -11285
10227 -11285 -7608 -4805 -2147 5805 8465 -1629 -10478 -11829 -14609 -14652 -14154 -14444 -7283 -3149 3400
10212 3400 -1449 -7656 -8814 -7161 2181 3058 -1161 -6689 -10901 -12294 -5089 5461 2990 1910 1881
10197 1881 3101 3339 649 -5252 -3952 -4254 -6152 -6003 -11367 -13890 -6740 -5329 -5249 1109 670 -3533
10181 -3533 -461 1522 1620 -5728 -4457 2559 -2163 -1962 633 5123 5025 5539 6487 6106 -4415 -9592
10165 -9592 -14359 -17019 -13081 -11701 -5102 -1832 2146 4845 -1313 -8733 -12309 -8486 -4674 -5723 -7093
$$ packed form
10274H910l149L2K233m818o097L259O821j110j489K169m68J69J994R78m063r49
10258D422k525j874K684q286m6P51K112K209m256o199N623Q914J666K47l153l641
10242a352L007P09k037K98r28j749j229J360M428k463p452l427J025l244J769
10227a1285L677K803K658P952K660j0094q849j351k780m3M98k90P161M134O549
10212C400m849o207j158J653R342Q77m219n528m212j393P205J0550k471j080k9
10197A881J220K38k690n901J300l02j898J49n364k523P150J411Q0O358m39m203
10181c533L072J983R8p348J271P016m722K01K595M490r8N14R48l81j0521n177
10165i592m767k660L938J380O599L270L978K699o158p420l576L823L812j049j370
$$ plain form
10150 -7093 -5592 -6283 -5645 -6647 -7697 -6017 -1879 -8061 -7487 -10806 -9842 -2997 -1733 -4578 118 200
10134 200 3074 -2198 -6292 -6776 -1790 4694 5132 3328 2423 -4517 -7306 -5866 -11077 -11039 -7146 -3971
10118 -3971 -3967 -5330 -5091 1562 6047 273 -1253 1571 8612 11237 9677 -175 -5974 -7479 -15643 -16319
10102 -16319 -20900 -17512 -10348 -590 4132 1031 -3367 -7344 -12560 -3731 4232 4335 -3822 -12987 -15286
10087 -15286 -12112 -11427 -13634 -12837 -14716 -12886 -11813 -9570 -12147 -10322 -10147 -14803 -13643 -10187 -9213
10072 -9213 -9914 -7086 -2094 -2118 -9057 -7076 -9241 -5407 -2120 -2251 -2004 1488 -1657 -8623 -8590 -7880 -10089
10055 -10089 -8665 -12275 -11354 -8770 -937 3368 1179 -117 1107 -246 5745 8638 3069 1919 -2456
10040 -2456 -5414 -7988 -8006 2551 1163 -4706 -5669 -10253 -6173 -2318 -1740 502 -4909 -6150 -6452 -6044
$$ packed form
10150g093J501o91O38j002j050J680M138o182N74l319R64O845J264k845M696Q2
10134B00K874n272m094m84M986O484M38j804r05o940k789J440n211L8L893L175
10118c971Mj363K39O653M485n774j526K824P041K625j560r852n799j505q164o76
10102a6319m581L388P164R758M722l101m398l977n216Q829P963J03q157r165k299
10087a5286L174O85k207P97j879J830J073K243k577J825J75m656J160L456R74
10072i213p01K828M992k4o939J981k165L834L287j31K47L492l145o966L3P10k209
10055a0089J424l610R21K584P833M305k189j296J224j353N991K893n569j150m375
10040b456k958k574j8J0557j388n869r63m584M080L855N78K242n411j241l02M08
$$ plain form
10024 -6044 -12595 -11934 -9863 -9726 -5357 -6571 -9061 -7448 -2805 -1093 -4600 -5029 -1319 -612 -7150 -5476
10008 -5476 -3045 -2983 4459 10390 5166 -420 3080 3527 -3089 -6065 -4447 -5884 -4107 -3689 -2986 -76
9992 -76 2835 -5294 -6795 -4944 -4229 -2566 -6428 -566 2809 2731 1350 -3921 -6053 -10340 -8533 -7213
9976 -7213 -472 1383 2851 2014 1833 1235 1973 -2269 -2622 -1348 1707 1983 3313 5340 2523 -1139
9960 -1139 -11278 -11580 -6707 -1989 765 839 -182 5685 12532 15029 15203 10884 7433 7087 5985 3508
9944 3508 6881 3817 -2105 2451 8733 6740 -2365 -9177 -9028 -14563 -14570 -10373 -7781 -5215 -2990 1740
9928 1740 -1247 2019 618 7435 14661 17784 17006 9918 3657 1536 8140 13770 13479 8317 4474
9913 4474 -4909 -5774 -3226 951 2659 -5701 -4341 -381 -3601 -9822 -20573 -18225 -18440 -22361 -26635
$$ packed form
10024f044o551O61K071J37M369j214k490J613M643J712l507m29L710P07o538J674
10008e476K431O2P442N931n224n586L500M47o616k976J618j437J777M18P03K910
9992g6K911q129j501J851P15J663l862N862L375p8j381n271k132m287J807J320
9976g213O741J855J468q37j81n98P38m242l53J274L055K76J330K027k817l662
9960a139j0139l02M873M718K754P4j021N867O847K497J74m319l451l46j102k477
9944C508L373l064n922M556O282j993r105o812J49n535pM197K592K566K225M730
9928A740k987L266j401O817P226L123p78p088o261k121O604N630k91n162l843
9913D474r383q65K548M177J708q360J360L960l220o221j0751K348k15l921m274
$$ plain form
9898 -26635 -18964 -13815 -11454 -10105 -8886 -11797 -10986 -5408 -2050 -450 -1923 -12202 -10748 -6135 -2107
9883 -2107 1096 2273 3671 3659 5604 7326 7051 5419 11727 10209 3965 4005 -5419 -10597 -8955 -11127
9867 -11127 -4267 58 1532 -2803 -5387 -2954 -1955 1749 -3674 -7534 -1699 -4857 -7662 -4686 232
9852 232 1187 2045 6902 4166 -3490 -7604 -12934 -12986 -7114 1163 10700 12033 9773 9218 9883 7424 10039
9835 10039 24486 38508 54170 57356 50339 46914 40173 30731 19987 15069 7867 10572 10700 6742
9821 6742 -1457 -6102 1833 3551 8128 10444 8450 11027 10560 11340 6574 4943 1881 6400 9344
9806 9344 3368 2767 6835 8714 8349 6312 7564 1295 -2752 -393 3162 -1911 -5070 -5534 -2460 -3325
9790 -3325 -290 2763 2313 -2049 -12494 -6840 -3273 -2619 87 2692 2079 -1718 -2644 -6300 -5494 -1517
$$ packed form
9898b6635P671N149K361J349J219k911Q11N578L358J600j473j0279J454M613M028
9883b107L203J177J398j2J945J722k75j632O308j518o244M0r424n178J642k172
9867a1127O860M325J474m335k584K433R99L704n423l860N835l158k805K976M918
9852B32R55Q58M857k736p656m114n330n2N872Q277R537J333k260n55O65k459K615
9835A0039J4447J4022J5662L186p017l425o741r442j0744m918p202K705J28l958
9821F742q199m645P935J718M577K316j994K577m67P80m766j631l062M519K944
9806I344n976o01M068J879l65k037J252o269m047K359L555n073l159m64L074q65
9790c325L035L053m50m362j0445N654L567O54K706K605o13l797r26l656Q06L977
$$ plain form
9774 -1517 -131 -4644 -3178 -649 -971 2785 763 -6211 -4487 3894 3196 -3257 -5993 -6632 -8519 -6242
9758 -6242 1408 3746 6020 8646 8818 6481 10392 12580 10011 8569 6636 5982 9446 11180 7230
9743 7230 2622 5378 1522 -2126 -576 -6120 -10226 -10069 -2988 -2496 -11168 -16768 -12045 -9882 -7639
9728 -7639 5358 7809 564 1098 4860 2474 811 -280 -1651 -4010 -2655 -7742 -6846 -1924 -2671
9713 -2671 -396 -3365 -8309 -3445 -2481 -4724 -9290 -7762 -3288 837 2276 3647 7821 7004 8528
9698 8528 10704 7788 -623 2411 543 2655 8693 8197 3294 4027 2966 -1249 -6758 -9240 -8689 -7892
9682 -7892 -5768 -3023 6030 8882 9107 11871 8219 -3145 -2895 -932 960 -1753 -620 -4768 -12260
9667 -12260 -12263 -6085 -3285 22 6504 -752 -1693 5924 3095 -2010 2314 4457 2316 -3417 -2777 2894
$$ packed form
9774a517J386m513J466K529l22L756k022o974J724Q381o98o453k736o39j887K277
9758f242P650K338K274K626J72k337L911K188k569j442j933o54L464J734l950
9743G230m608K756l856l648J550n544m106J57P081M92q672n600M723K163K243
9728g639J2997K451p245N34L762k386j663j091j371k359J355n087Q96M922p47
9713b671K275k969m944M864R64k243m566J528M474M125J439J371M174q17J524
9698H528K176k916q411L034j868K112O038m96m903P33j061m215n509k482N51P97
9682g892K124K745R053K852K25K764l652j1364K50J963J892k713J133m148p492
9667a2260lO178K800L307O482p256r41P617k829n105M324K143k141n733O40N671
$$ plain form
9651 2894 3791 5905 3687 -446 -4382 -10303 -5943 -11179 -15536 -8914 -9922 -5292 -2452 -2478 -1550 -4016
9635 -4016 -9860 -8622 -3705 -6022 -7290 -2110 -1014 5648 8037 2315 -1228 -6638 -8932 -10415 -6133
9620 -6133 -4037 105 588 29 -3029 -8802 -7892 1410 8586 5379 3114 6002 16711 18743 14799
9605 14799 10293 5969 -2446 -7245 -4092 -3741 -4533 -2461 1427 -246 1046 -5138 -4307 -5298 -5309 -4075
9589 -4075 -7981 -5153 -3539 -5142 -5264 -8759 -15266 -12110 -9663 -8384 -13916 -19719 -16587 -12353 -7706
9574 -7706 -5242 -3423 1246 10 -498 -1576 -2199 -9822 -6841 1408 10339 12477 7793 7450 9870 5605
9558 5605 1930 2603 3157 5574 10469 4538 2053 -3123 -13626 -16630 -13013 -10674 -7474 -11197 -10590
9543 -10590 -10098 -2227 713 1809 -4106 -9991 -5161 -160 -389 -272 2021 2075 240 845 -1215 4163
$$ packed form
9651B894Q97K114k218m133l936n921M360n236m357O622j008M630K840k6R28k466
9635d016n844J238M917k317j268N180J096O662K389n722l543n410k294j483M282
9620f133K096M142M83n59l058n773R10R302P176l207k265K888J0709K032l944
9605A4799m506m324q415m799L153L51p92K072L888j673J292o184Q31r91j1J234
9589d075l906K828J614j603j22l495o507L156K447J279n532n803L132M234M647
9574g706K464J819M669j236n08j078o23p623K981Q249Q931K138m684l43K420m265
9558E605l675O73N54K417M895n931k485n176j0503l004L617K339L200l723O07
9543a0590M92P871K940J096n915n885M830N001k29J17K293N4j835O05k060N378
$$ plain form
9527 4163 4112 630 -1984 -6137 -4179 -1976 -1459 -4080 -5265 -9914 -5506 -4874 -4498 -403 -803 -3473
9511 -3473 538 2239 -1670 1860 1966 1271 -1199 -864 550 -774 -4986 -5200 -7618 -960 2563 832
9495 832 6125 10865 5771 -572 -790 3650 -113 -1453 -7823 -2975 7268 8745 6661 14449 7967
9480 7967 1088 1012 2912 3792 6257 1031 3276 6147 6903 5942 1239 -8462 -11079 -7964 -8877 -8589 -5592
9463 -5592 -1591 -733 3643 918 -1768 -1173 -6045 -3449 -2623 -8608 -12438 -11995 -11530 -2543 2468 -2472
9447 -2472 2796 6587 5036 -680 2411 -139 2201 -562 -2652 -7982 -10870 -4619 3922 7645 1040
9432 1040 1733 2510 8639 5263 -1995 -6523 -11400 -8364 -8253 -5509 -5083 -5997 1502 -4671 -6602 -4845
9416 -4845 -1625 1127 2101 4710 11094 11992 7654 2536 2229 8901 10491 10644 6013 -1898 3144 4280
$$ packed form
9527D163n1l482k614m153J958K203N17k621j185m649M408O32L76M095m00k670
9511c473M011J701l909L530J06o95k470L35J414j324m212k14k418O658L523j731
9495H32N293M740n094o343k18M440l763j340o370M848J0243J477k084P788o482
9480G967o879p6J900Q80K465n226K245K871P56r61m703r701k617L115r13K88K997
9463e592M001Q58M376k725k686N95m872K596Q26n985l830M43M65Q987N011m940
9447b472N268L791j551n716L091k550K340k763k090n330k888O251Q541L723o605
9432A040O93P77O129l376p258m528m877L036J11K744M26r14P499o173j931J757
9416d845L220K752R74K609O384Q98m338n118l07O672J590J53m631p911N042J136
$$ plain form
9400 4280 2314 -600 3424 3894 -630 -7019 -981 4888 1409 -1533 -850 3302 2478 -3342 6 2111
9384 2111 -1726 -3409 5410 7494 -4554 -6480 -6221 -7318 -5463 -2933 -5759 -9080 -13330 -8954 -9443
9369 -9443 -10492 -8659 -9090 -10299 -6668 -7824 -9691 -9732 -3065 1973 1620 2895 6481 2608 -9601 -9646
9353 -9646 -4819 549 1142 -4164 -5070 -324 762 2184 -6086 -8210 -7448 1674 3928 3213 317 238
9337 238 112 2824 1687 -527 3391 4001 -2425 -2485 219 -6810 -7988 -2572 3345 3227 4671 5835
9321 5835 3443 436 -2547 -8231 -11841 -14395 -12287 -12838 -12126 -8221 -5067 -2134 -2115 2923 516 3156
9305 3156 2510 -1149 20 -5372 -6732 -4447 314 2516 7479 10736 7708 5510 6200 7811 7388 42
9289 42 362 9587 8984 12513 15605 15243 13316 12188 9354 10039 12819 20077 8900 5340 9829 8356
$$ packed form
9400D280j966k914M024M70m524o389O038N869l479k942O83M152q24n820L348K105
9384B111l837j683Q819K084j2048j926K59j097J855K530k826l321m250M376m89
9369i443j049J833m31j209L631j156j867m1O667N038l53J275L586l873j2209m5
9353i646M827N368N93n306r06M746J086J422q270k124P62R122K254p15k896p9
9337B38j26K712j137k214L918O10o426o0K704p029j178N416N917j18J444J164
9321E835k392l007k983n684l610k554K108n51P12L905L154K933J9N038k407K640
9305C156o46l659J169n392j360K285M761K202M963L257l028k198O90J611m23p346
9289D2L20R225o03L529L092l62j927j128k834O85K780P258j1177l560M489j473
$$ plain form
9273 8356 12622 12363 7140 7704 5880 8 -6536 -1998 6747 8089 12420 12568 16422 15861 12944 12344
9257 12344 13906 11565 13805 17433 18933 19009 16844 11631 12204 21567 24484 26997 31964 27214 19642
9242 19642 18501 21855 22418 21304 17918 21802 33976 37357 37553 34101 30733 42862 49625 48664 52803
9227 52803 53274 57372 63596 69997 82874 96906 115393 145473 178003 211639 257911 332054 445336
9214 445336 619283 882852 1283733 1912114 2838944 3788824 4024478 3356887 2409905 1682904
9204 1682904 1205084 871334 629887 465673 362393 293978 235629 193873 163508 142872
9194 142872 126592 110680 92986 84275 74618 66082 50544 43030 46984 42040 35444 34394 35417
9181 35417 32248 29417 27707 25407 29580 35134 35979 35771 28284 18467 15065 21225 25680 24767 19204
$$ packed form
9273H356M266k59n223N64j824n872o544M538Q745J342M331J48L854n61k917o00
9257A2344J562k341K240L628J500P6k165n213N73R363K917K513M967m750p572
9242A9642j141L354N63j114l386L884J2174L381J96l452l368J2129O763r61M139
9227E2803M71M098O224O401J2877J4032J8487L0080L2530L3636M6272P4143J13282
9214D45336J73947K63569M00881O28381R26830R49880K35654o67591r46982p27001
9204A682904m77820l33750k41447j64214j03280o8415n8349m1756l0365k0636
9194A42872j6280j5912j7694q711r657q536j5538p514L954m944o596j050J023
9181C5417l169k831j710k300M173N554Q45k08p487r817l402O160M455r13n563
$$ plain form
9166 19204 21536 24443 23451 24278 31158 24951 17495 18744 17090 19737 13296 5121 6985 11147 10775
9151 10775 7902 3104 570 -1211 -489 4395 -530 -6625 -10860 -11238 -9160 -3592 -3678 -5047 3054 12661
9135 12661 10526 8195 8728 9212 5298 410 2529 14064 23324 12472 465 982 8159 13886 12933
9120 12933 16868 20720 19274 20858 8845 703 2455 2455 4847 13792 13713 8627 1396 -881 258 2699
9104 2699 6794 13211 19992 25821 22716 16718 12274 8082 8524 6174 -3989 360 8854 9218 9060
9089 9060 8670 8052 7720 14530 16955 10333 6509 5740 4738 6245 4327 3658 6833 3217 2506 3484 6414
9072 6414 3433 -1318 -1286 3245 6813 7687 5046 1615 -9355 -7555 2556 6731 9062 12875 14615
9057 14615 7215 -1984 -5810 -2536 -3596 -7648 -6797 -1876 -1502 610 -2076 -2390 -5098 -2899 -1733
$$ packed form
9166A9204K332K907r92Q27O880o207p456J249j654K647o441q175J864M162l72
9151A0775k873m798k534j781P22M884m925o095m235l78K078N568q6j369Q101R607
9135A2661k135k331N33M84l914m888K119J1535R260j0852j2007N17P177N727r53
9120A2933L935L852j446J584j2013q142J752%K392Q945p9n086p231k277J139K441
9104B699M095O417O781N829l105n998m444m192M42k350j0163M349Q494L64j58
9089I060l90o18l32O810K425o622l824p69j002J507j918o69L175l616p11R78K930
9072F414k981m751L2M531L568Q74k641l431j0970J800J0111M175K331L813J740
9057A4615p400r199l826L274j060m052Q51M921L74K112k686l14k708K199J166
$$ plain form
9042 -1733 1842 1643 5368 4276 -4137 -3239 912 4267 5202 5759 4541 -1696 -5322 -744 3995 6390
9026 6390 6996 2438 661 -3378 -5447 -5452 -4514 -8643 -5924 -4679 -7479 -9343 -9642 -11419 -7666 -2047
9010 -2047 -3888 -5550 -5562 -6830 -244 4912 -379 -677 1198 6701 4444 4701 -736 -1836 -4781 -8825
8994 -8825 -5878 1407 8279 8683 10071 5450 4385 -1727 -4086 -5705 -5157 -2480 -6892 -8941 -4324
8979 -4324 -2452 34 -604 2240 468 1955 3133 -3588 -10089 -10352 -8042 -1864 4178 5975 4023
8964 4023 -3815 -401 4802 9748 10733 8432 2858 -3600 -2003 1523 3045 3488 5308 10412 20805
8949 20805 21519 16676 12948 7933 1490 -811 -4847 -6280 -1880 -2444 -814 963 -150 -1857 2761
8934 2761 -2067 -3939 -2823 4518 9072 1569 -3375 -9836 -7749 -6132 -3619 2201 5340 3511 7663
$$ packed form
9042a733L575j99L725j092q413Q98M151L355R35N57j218o237l626M578M739K395
9026F390O06m558j777m039k069nR38m129K719J245k800j864k99j777L753N619
9010b047j841j662j2j268O586N156n291k98J875N503k257K57n437j100k945m044
8994h825K947P285O872M04J388m621j065o112k359j619N48K677m412k049M617
8979d324J872K486o38K844j772J487J178o721o501k63K310O178O042J797j952
8964D023p838L414N203M946R85k301n574o458J597L526J522M43J820N104J0393
8949B0805P14m843l728n015o443k301m036j433M400n64J630J777j113j707M618
8934B761m828j872J116P341M554p503m944o461K087J617K513N820L139j829M152
$$ plain form
8919 7663 9960 12384 15130 6137 926 -1119 -4315 -3425 1033 3597 13924 19652 26591 39986 54175
8904 54175 49695 37956 26843 22142 10406 748 5300 11040 3719 -2153 3588 5197 2196 -115
8890 -115 4963 10677 14163 14602 16903 15550 12853 10835 3606 37 -1540 3039 9906 10769 14594 22261
8874 22261 27585 23615 24350 28237 19479 6200 3671 588 1535 1614 4437 7831 10704 19191 23546
8859 23546 21397 10248 3265 6623 11112 11525 10277 9882 5372 3065 8730 10048 11459 13140 13017
8844 13017 25400 34906 35159 32765 22922 11218 9424 10696 10772 10950 13896 10543 5477 2779 5137
8829 5137 7647 10521 11014 12764 6917 5049 11398 11911 6568 7504 11406 15741 17318 16818 11613 9070
8813 9070 8081 11277 14092 2778 -4154 -2849 -258 -4421 -973 2306 1385 -1295 -3512 2861 3680
$$ packed form
8919G663K297K424K746q993n211k045l196Q90M458K564J0327N728O939J3395J4189
8904E4175m480j1739j1113m701j1736r658M552N740p321n872N741J609l001k311
8890a15N078N714L486M39K301j353k697k018p229l569j577M579O867Q63L825P667
8874B2261N324l970P35L887q758j3279k529l083R47P9K823L394K873Q487M355
8859B3546k149j1149o983L358M489M13j248l95m510k307N665J318J411J681j23
8844A3017J2383R506K53k394r843j1704j794J272P6J78K946l353n066k698K358
8829E137K510K874M93J750n847j868O349N13n343R36L902M335J577n00n205k543
8813I070r89L196K815j1314o932J305K591m163L448L279r21k680k217O373Q19
$$ plain form
8798 3680 5772 15143 19686 15535 5265 1826 3762 4805 6920 -142 -4505 -7259 -9904 -12837 -8640
8783 -8640 -8643 -8290 -6624 -6954 -2564 -3652 1814 -2085 -3319 -142 -6007 -1777 6364 15040 6498 2778
8767 2778 -3003 -3600 -1348 -141 476 -2465 -4769 -5575 -4966 -183 3592 91 -7754 -12170 -11943 -8325
8751 -8325 -5097 -3374 -2556 2338 -1072 -8460 -15467 -18054 -13783 -10057 -10712 -8700 -3308 -2097 5543
8736 5543 7129 6088 9091 8116 9562 11576 15019 11173 15755 12618 5496 3693 -1900 1607 -727
8721 -727 -4740 -5177 5009 12327 3065 -5621 -3445 1381 1258 -621 -1862 409 3039 105 697 -452
8705 -452 -1437 1270 -27 3275 -288 -3689 -3284 756 7026 8469 7747 7664 11000 3997 3155 2264 5088
8688 5088 9527 8933 13440 14654 11090 4459 -998 -903 953 6589 8813 10198 11630 13895 14207 5015
$$ packed form
8798C680K092R371M543m151j0270l439J936J043K115p062m363k754k645k933M197
8783h640lL53J666l30M390j088N466l899j234L177n865M230Q141Q676q542l720
8767B778n781n97K252J207O17k941k304q06O09M783L775l501p845m416K27L618
8751h325L228J723Q18M894l410p388p007k587M271L726o55K012N392J211P640
8736E543J586j041L003r75J446K014L443l846M582l137p122j803n593L507k334
8721g27m013m37J0186P318r262q686K176M826j23j879j241K271K630k934N92j149
8705d52r85K707j297L302l563l401M05M040O270J443p22q3L336p003q42q91K824
8688E088M439n94M507J214l564o631n457R5J856N636K224J385J432K265L12r192
$$ plain form
8672 5015 -3248 -4845 -3260 -6884 -7748 -6097 -7454 -3738 -710 -1980 -2185 -5027 -1988 2950 -2456
8657 -2456 -345 -735 -426 -234 -3373 -5947 -5582 -4053 -3211 -1208 641 -850 -5627 -7489 -7033 -6949 824
8640 824 -2396 -2727 -3045 -4952 -6806 -1240 4556 7432 6708 10717 13083 16407 21876 26173 31333 37450
8624 37450 41017 52092 74851 113327 159828 184787 184456 154480 119092 79710 52536 41725
8612 41725 33456 28146 25729 19321 15964 13820 16014 18505 15531 9818 3048 3745 10910 6557 5561
8597 5561 8649 6132 2792 4347 7616 7387 5494 5441 7202 17301 26465 36266 38365 39416 44678
8582 44678 52691 63282 81067 100728 137717 194214 270036 344440 372597 336800 269369 199507
8570 199507 138279 96580 84534 69904 54930 52248 46529 40313 30479 27948 27953 24040 20666 19855
$$ packed form
8672E015q263j597J585l624q64J651j357L716L028j270k05k842L039M938n406
8657b456K111l90L09J92l139k574L65J529Q42K003J849j491m777j862M56Q4P773
8640H24l220l31l18j907j854N566N796K876p24M009K366L324N469M297N160O117
8624C7450L567J1075K2759L8476M6501K4959l31k9976l5388l9382k7174j0811
8612D1725q269n310k417o408l357k144K194K491k974n713o770O97P165m353r96
8597E561L088k517l340J555L269k29j893n3J761J0099R164R801K099J051N262
8582D4678Q013J0591J7785J9661L6989N6497P5822P4404K8157l5797o7431o9862
8570A99507o1228m1699j2046j4630j4974k682n719o216r834k531Nl913l374q11
$$ plain form
8556 19855 22168 15177 6816 3595 5464 4913 3800 3831 -403 -3734 -2032 2730 3593 9851 14164 15591
8540 15591 20178 18924 11016 12015 17758 34633 63593 98174 132244 171803 201182 198722 164235
8527 164235 121835 90748 68660 53344 39877 27390 17514 15625 15523 10714 17048 14173 5232
8514 5232 3738 4336 5472 10256 11140 10981 6209 11221 13040 11138 13119 7901 7058 5331 1517 252
8498 252 -1621 -2410 4444 11022 8742 12224 17501 19511 18867 21035 20997 19459 17662 11357 5093 3244
8482 3244 -2141 -540 1021 5712 8494 8690 8827 1523 -3230 -12559 -8802 958 -2881 -3883 -6647
8467 -6647 -13726 -16432 -16465 -6754 -6609 -6345 -4375 -1546 1462 3428 -76 -1140 -1483 -6403 -8640 -338
8451 -338 5932 4519 6669 5068 4767 4209 4342 4759 814 -4111 -12329 -19589 -13748 -3792 -1147 -4034
$$ packed form
8556A9855K313o991q361l221J869n51j113L1m234l331J702M762Q63O258M313J427
8540A5591M587j254p908R99N743J6875K8960L4581L4070L9559K9379k460l4487
8527A64235m2400l1087k2088j5316j3467j2487r876j889j02m809O334k875q941
8514E232j494N98J136M784Q84j59m772N012J819j902J981n218q43j727l814j265
8498B52j873p89O854O578k280L482N277K010o44K168l8j538j797o305o264j849
8482C244n385J601J561M691K782J96J37p304m753r329L757R760l839j002k764
8467f647p079k706l3R711J45K64J970K829L008J966l504j064l43m920k237Q302
8451c38O270j413K150j601l01n58J33M17l945m925q218p260N841R956K645k887
$$ plain form
8435 -4034 -4931 -289 -510 -2748 2666 8448 8231 1285 -3433 -4250 7245 15714 12857 4081 -9029
8420 -9029 -14102 -10200 -5717 653 7978 5298 -9971 -22209 -25138 -17223 -3450 18385 40789 52589
8406 52589 54440 41202 26552 10584 -16494 -34273 -31436 -20340 -3237 2678 -2541 -8853 -12587
8393 -12587 -14837 -5209 5524 12813 13717 11001 10706 13501 21194 27538 26282 21188 19564 16029 13589
8378 13589 21462 21693 18228 22791 40814 69032 102925 129908 133029 118931 102111 83275 58245
8365 58245 34044 21094 11102 6951 4130 6698 4261 6049 8010 10554 14623 9711 3285 4411
8351 4411 332 -207 2596 -3453 -8016 -1544 7841 16548 26602 33893 34185 51288 74816 97892
8337 97892 111583 107236 92654 75675 60080 47837 30623 15539 6304 5041 5428 4654 3524
$$ packed form
8435d034q97M642k21k238N414N782k17o946m718q17J1495Q469k857q776j3110
8420i029n073L902M483O370P325k680j5269j2238k929P915J3773K1835K2404J1800
8406E2589J851j3238j4650j5968k7078j7779K837J1096J7103N915n219o312l734
8393a2587k250R628J0733P289R04k716k95K795P693O344j256n094j624l535k440
8378A3589P873K31l465M563J8023K8218L3893K6983L121j4098j6820j8836k5030
8365E8245k4201j2950r992m151k821K568k437J788J961K544M069m912o426J126
8351D411m079n39K803o049m563O472R385Q707J0054P291K92J7103K3528K3076
8337I7892J3691m347j4582j6979j5595j2243j7214j5084r235j263L87p74j130
$$ plain form
8324 3524 5779 10813 14018 13172 20244 15208 3975 -48 -17 -3765 -8596 -8457 -5306 -15359 -16437
8309 -16437 -9809 -6444 -5019 -3271 -6533 -5832 -5223 -2187 -4003 -6124 -5520 -2023 -1529 -2442 -4375 -4078
8293 -4078 -7539 -4440 -1450 -2118 -6588 -9898 -5576 -7820 -4229 -453 -1720 -3635 -3091 -1835 -9341
8278 -9341 -13889 -18080 -14131 -7793 -7232 -6443 -13261 -6841 4275 2251 -5859 -8071 -4744 -3412 2824
8263 2824 10403 15875 11511 4161 4518 13616 15062 9547 6554 -1114 -1455 4335 2220 1623 1685 -8248
8247 -8248 -11159 -13646 -5292 758 4135 4495 5236 1252 3728 12298 11569 2494 -6164 -8517 -7436 -904
8231 -904 4582 2897 3426 -1890 -10530 -11020 -3388 -6623 -3494 -2859 -8279 -6318 3834 10735 14770 11272
8215 11272 8922 4314 1770 184 1847 -1194 -4210 -2464 3296 1861 -1824 -1226 -8486 -12934 -8252
$$ packed form
8324C524K255N034L205q46P072n036j1233m023L1l748m831J39L151j0053j078
8309a6437O628L365J425J748l262P01O09L036j816k121O04L497M94r13j933K97
8293d078l461L099K990o68m470l310M322k244L591L776j267j915N44J256p506
8278i341m548m191L949O338N61P89o818O420J1116k024q110k212L327J332O236
8263B824P579N472m364p350L57R098J446n515k993p668l41N790k115n97O2r933
8247h248k911k487Q354O050L377L60P41l984K476Q570p29r075q658k353J081O532
8231i04N486j685N29n316q640m90P632l235L129O35n420J961J0152O901M035l498
8215A1272k350m608k544j586J663l041l016J746N760j435l685N98p260m448M682
$$ plain form
8200 -8252 -1166 -2132 -3682 -6754 -1309 -1057 -2521 -7682 -1383 4777 -2201 -3371 -6277 -10158 -11017 -4135
8184 -4135 -93 -2822 -1925 939 -6320 -10713 -6139 2146 -1180 -2368 914 -2087 1995 -920 -2768
8169 -2768 3847 8166 3390 -3302 -917 7309 3479 -52 -3464 -3953 -6177 -7043 -391 5459 809
8154 809 -7459 -7494 -1874 1165 -5668 -13843 -14196 -11895 -12525 -6057 -5440 -11915 -18562 -16665 -11288 -4409
8138 -4409 943 8382 8988 6410 9826 12247 11785 8378 9244 6064 9210 15709 13302 1417 1944 5057
8122 5057 -4653 -771 4474 7896 3487 1920 7256 3620 -6577 -9868 -12186 -7941 -4865 -4744 -10454
8107 -10454 -13427 -11786 -13424 -14083 -7406 -1924 -1034 -317 809 -1418 2325 732 -1256 -6044 -9812
8092 -9812 -5263 -4639 -6538 -7726 -3552 207 1423 -3341 -9573 -14040 -16880 -18071 -5912 4832 5548
$$ packed form
8200h252P086r66j550l072N445K52j464n161O299O160o978j170k906l881q59O882
8184d135M042k729Q97K864p259m393M574Q285l326j188L282l001M082k915j848
8169b768O615M319m776o692K385Q226l830l531l412m89k224q66O652N850m650
8154H09q268l5N620L039o833q175l53K301o30O468O17o475o647J897N377O879
8138d409N352P439O06k578L416K421m62l407Q66l180L146O499k407j1885N27L113
8122E057r710L882N245L422m409j567N336l636j0197l291k318M245L076J21n710
8107a0454k973J641j638o59O677N482Q90P17J126k227L743j593j988m788l768
8092i812M549O24j899j188M174L759J216m764o232m467k840j191J2159J0744P16
$$ plain form
8077 5548 -85 -2869 -2030 -807 -2660 -5761 -4636 -5210 -2834 2129 5327 4745 1476 1762 575 -2677
8061 -2677 655 2798 9735 8558 3596 3568 5826 6482 6147 2181 5640 14561 13972 11253 12269 14612
8045 14612 21840 36311 39335 41388 55740 76828 122731 200944 293311 388983 429041 397469
8033 397469 317410 230573 158277 103464 67265 50773 49230 48310 36385 22483 15291 15248 19774
8020 19774 15832 13585 15145 18988 16053 26729 32586 24682 20500 21237 29763 31118 35902 43729 56960
8005 56960 61197 68430 75833 83628 95691 117947 150143 195810 268121 389197 577401 833211
7993 833211 1127172 1409296 1567338 1510717 1254825 918016 632577 435888 299482 207299
7983 207299 153607 127337 112202 100845 90723 88545 77468 63160 53355 47026 41617 37193 31525
$$ packed form
8077E548n633k784Q39J223j853l101J125n74K376M963L198n82l269K86j187l252
8061b677L332K143O937j177m962k8K258O56l35l966L459Q921n89k719J016K343
8045A4612P228J4471L024K053J4352K1088M5903P8213R2367R5672M0058l1572
8033C97469q0059q6837p2296n4813l6199j6492j543r20j1925j3902p192m3M526
8020A9774l942k247J560L843k935J0676N857p904m182P37Q526J355M784P827J3231
8005E6960M237P233P403P795J2063K2256L2196M5667P2311J21076J88204K55810
7993H33211K93961K82124J58042n6621k55892l36809k85439j96689j36406r2183
7983B07299n3692k6270j5135j1357j0122k178j1077j4308r805o329n409m424n668
$$ plain form
7970 31525 32141 26685 17595 11937 14996 11826 5471 5290 7318 4373 3979 3644 4458 6856 2415 4308
7954 4308 1967 3722 9215 9384 13962 16762 10610 3191 3564 5292 3609 -888 2295 2533 640 5835
7938 5835 1770 2660 7876 15491 9954 7924 10695 8627 8409 1812 2340 -1113 241 2334 -2505 -97
7922 -97 3775 -5624 -9639 3276 11205 10024 8380 12565 12628 7824 6377 8046 6826 6390 7805 8395
7906 8395 12982 8847 6385 5593 2785 -1923 90 3806 11459 13433 9168 6590 2628 5327 6449
7891 6449 14443 13217 14282 17284 12130 9857 8281 6517 3237 2616 1561 33 958 5927 5599 8309
7875 8309 1532 -1239 864 12050 20802 13481 9726 8764 7214 1567 959 -4088 -3772 -1842 1527
7860 1527 1690 1458 11029 11309 10818 13262 15110 7488 -5631 -11013 -11496 -13542 -12541 -10305 -2712 -1744
$$ packed form
7970C1525O16n456r090n658L059l170o355j81K028k945l94l35Q14K398m441J893
7954D308k341J755N493J69M578K800o152p419L73J728j683m497L183K38j893N195
7938E835m065Q90N216P615n537k030K771k068k18o597N28l453J354K093m839K408
7922i7L872r399m015J2915P929j181j644M185O3m804j447J669j220m36J415N90
7906H395M587m135k462p92k808m708K013L716P653J974m265k578l962K699J122
7891F449P994j226J065L002n154k273j576j764l280o21j055j528R25M969l28K710
7875H309o777k771K103J1186Q752p321l755r62j550n647o08n047L16J930L369
7860A527J63k32R571K80m91K444J848p622j3119n382m83k046J001K236P593R68
$$ plain form
7844 -1744 6003 10697 6910 1281 -2906 -8454 -6477 -2134 -3400 1377 182 1656 3972 5110 10441
7829 10441 9292 8005 3147 3772 -906 -7312 -17483 -15702 -10679 -15278 -17988 -9891 -572 1839 2118
7814 2118 2949 3054 4614 970 828 -798 827 2928 3070 785 -5531 -15267 -14779 -6253 -2166 2167
7798 2167 6455 10424 9243 9438 12386 14132 13548 8455 9605 12060 4512 -5495 -1024 2939 1022
7783 1022 -7182 -4530 487 750 -653 -7374 -9410 -4510 3950 -305 -7403 -9013 -8647 -1646 1876
7768 1876 -682 -1416 -5103 -12357 -12088 -7078 -5827 -243 -2798 -8821 -11669 -9283 -3632 5322 7684
7753 7684 4222 2534 5351 2912 114 1279 2452 -982 -7729 -9105 -1168 1999 -517 1353 1989
7738 1989 1140 -4090 -7976 -9249 -5139 -3863 -687 -358 1291 -5002 -6201 -6618 -7682 -2615 6806 2724
$$ packed form
7844a744P747M694l787n629m187n548J977M343j266M777j195J474K316J138N331
7829A0441j149j287m858O25m678o406j0171J781N023m599k710Q097R319K411K79
7814B118Q31J05J560l644j42j626J625K101J42k285o316r736M88Q526M087M333
7798B167M288L969j181J95K948J746n84n093J150K455p548j0007M471L963j917
7783A022q204K652N017K63j403o721k036M900Q460m255p098j610L66P001L522
7768A876k558p34l687p254K69N010J251N584k555o023k848K386N651Q954K362
7753G684l462j688K817k439k798J165J173l434o747j376P937L167k516J870O36
7738A989q49n230l886j273M110J276L176L29J649o293j199m17j064N067R421m082
$$ plain form
7722 2724 -767 1163 -2410 -3836 -4027 -3992 -2073 1379 312 -1984 1615 4906 5687 6262 5981 8067
7706 8067 11134 15086 7265 2720 5882 8168 7186 6941 3729 -3030 -10962 -9195 -4036 -3563 -5755 -8839
7690 -8839 -11470 -9014 -5271 -3773 929 6166 3152 -4778 -7129 -1779 557 2292 5734 229 -7820
7675 -7820 -4555 -3519 -1873 -5654 -6822 -5714 244 5329 7163 9760 5385 5032 4259 5835 4825
7660 4825 3710 25 -6014 -5162 -4061 -3026 -2106 -1305 -630 -4777 -7921 -1758 452 1239 -2078 -3625
7644 -3625 -2749 -1603 -8374 -10185 -8924 -4592 -3966 215 3856 3025 -8768 -15407 -8594 -14600 -19036
7629 -19036 -12499 -9119 -8741 -1832 -1676 -480 -6433 -9296 -9108 -2893 3096 4003 8545 10480 9073 5446
7613 5446 -973 -339 3384 6432 3436 2612 957 5041 12035 13259 11471 7237 1793 2088 1994 -1432
$$ packed form
7722B724l491J930l573j426j91L5J919L452j067k296L599L291P81N75k81K086
7706H067L067L952p821m545L162K286r82k45l212o759p932J767N159M73k192l084
7690h839k631K456L743J498M702N237l014p930k351N350K336J735L442n505q049
7675g820L265J036J646l781j168J108N958N085J834K597m375l53p73J576j010
7660D825j115l685o039Q52J101J035R20Q01O75m147l144O163K210P87l317j547
7644c625Q76J146o771j811J261M332O26M181L641q31j1793o639O813o006m436
7629a9036O537L380L78O909J56J196n953k863J88O215N989R07M542J935j407l627
7613E446o419O34L723L048k996q24j655M084O994J224j788m234n444K95r4l426
$$ plain form
7597 -1432 964 -2653 -5548 -99 3971 6630 3776 3162 2553 2407 18 -3904 -1839 -3843 -6487 -10111
7581 -10111 -4045 -2078 -5134 -6186 -7202 -1415 1776 143 -3517 -2140 -2401 2335 -2797 -1919 -3053
7566 -3053 -8368 -10584 -7565 -9008 -7516 -1613 6534 6876 5315 3734 -4340 -6399 -3296 -1840 4294
7551 4294 3497 -1054 -717 -4395 221 -2889 -3920 -8425 -11379 -14424 -9752 -4028 -344 2135 4264
7536 4264 4086 2747 6375 9458 9005 -3277 -12274 -10412 -5845 -5830 -7381 -4204 -433 -8216 -13086 -12459
7520 -12459 -13243 -12314 -5502 -1351 -1458 -685 -5545 -9704 -5813 -2518 -608 1236 4225 -819 -5066 -3605
7504 -3605 -814 -5103 -7027 -3965 -4261 -11279 -9737 -8382 -9319 -12514 -9526 -1696 4052 6548 5339
7489 5339 1260 1368 3512 37 863 -5162 -4670 -913 5768 5655 11349 10897 4522 2116 -2728 -6127
$$ packed form
7597a432K396l617k895N449M070K659k854o14o09j46k389l922K065k004k644l624
7581a0111O066J967l056j052j016N787L191j633l660J377k61M736n132Q78j134
7566c053n315k216L019j443J492N903Q147L42j561j581q074k059L103J456O134
7551D294p97m551L37l678M616l110j031m505k954l045M672N724L684K479K129
7536D264j78j339L628L083m53j2282q997J862M567J5j551L177L771p783m870O27
7520a2459p84R29O812M151j07P73m860m159L891L295J910J844K989n044m247J461
7504c605K791m289j924L062k96p018J542J355r37l195K988P830N748K496j209
7489E339m079J08K144l475Q26o025M92L757O681j13N694m52o375k406m844l399
$$ plain form
7473 -6127 -3539 -2950 -3435 -5350 -5165 -5500 -2769 3078 11024 5929 6776 3664 -596 3167 -227 -6866
7457 -6866 -193 -3345 -5585 -5787 -9713 -15431 -11815 -3074 4883 4537 -856 -8421 -9776 -8071 -8341 -4943
7441 -4943 -2176 -1832 -4031 -6082 -8563 -8880 -8113 1050 641 -1934 -2770 -3015 -1739 -6272 -2070 -6585
7425 -6585 -4529 -3829 -7833 -14761 -8956 -470 -3318 -8486 -10829 -13229 -14103 -6359 -8361 -8647 3080
7410 3080 -99 -7471 -7612 -4450 -3237 -3867 -7038 -8564 -15840 -21944 -13847 -10021 -11735 -3952 -4521 -5272
7394 -5272 -4703 -3639 -877 -8103 -9189 -9621 -9201 -12334 -17333 -14541 -13858 -12968 -11992 -7616 -7901 -9565 -13252
7377 -13252 -15163 -16760 -14635 -9199 -8067 -9146 -9847 -15652 -12751 -3499 2163 7554 3666 -4097 -1686
7362 -1686 495 4091 8146 6230 310 -4078 -1318 26 -983 655 450 2351 4564 5067 2853
$$ packed form
7473f127K588N89m85j915J85l35K731N847P946n095Q47l112m260L763l394o639
7457f866O673l152k240k02l926n718L616Q741P957l46n393p565j355J705k70L398
7441d943K767L44k199k051k481l17P67R163m09k575q36k45J276m533M202m515
7425f585K056P00m004o928N805Q486k848n168k343k400q74P744k002k86J1727
7410C080l179p372j41L162J213o30l171j526p276o104Q097L826j714P783n69p51
7394e272N69J064K762p226j086m32M20l133m999K792O83Q90R76M376k85j664l687
7377a3252j911j597K125N436J132j079p01n805K901R252N662N391l888p763K411
7362a686K181L596M055j916n920m388K760J344j009J638k05J901K213N03k214
$$ plain form
7347 2853 -2258 -2564 -6067 -4406 -3066 -3319 -105 -2088 -5466 -1951 -678 -802 108 -432 -618 2606
7331 2606 4463 2827 -3433 -7482 -9062 -5574 1975 443 -4202 -3353 2704 7244 8680 7189 5760
7316 5760 2520 325 443 7915 9317 6634 8089 4438 2471 -1340 834 -2286 -5874 -6195 -2392
7301 -2392 -3768 -5603 -4515 -3172 -3047 4009 12744 11839 9708 115 -7155 -3747 998 2518 -1348
7286 -1348 687 3322 903 -3829 -4446 -2009 -2990 -2007 -1982 2592 1502 -1567 -1953 1267 5725 6697 5006
7269 5006 2673 581 -1203 3976 1961 -1729 -5004 -6546 -6338 -1590 -5450 -4141 -1192 -3911 -3437
7254 -3437 -4371 1879 1114 -6727 -5594 -2004 -813 -10891 -9062 -7075 -882 2704 3039 -1762 -1854 1072
7238 1072 4405 -981 -4009 -3176 1770 3179 3517 2156 5286 11655 7566 4253 193 -2949 -5836
$$ packed form
7347B853n111l06l503J661J340k53L214j983l378L515J273j24R10n40j86L224
7331B606J857j636o260m049j580L488P549j532m645Q49O057M540J436j491j429
7316E760l240k195J18P472J402k683J455l651j967l811K174l120l588l21L803
7301b392j376j835J088J343J25P056Q735r05k131r593p270L408M745J520l866
7286a348K035K635k419m732o17K437r81R83K5M574j090l069l86L220M458R72j691
7269E006k333k092j784N179k015l690l275j542K08M748l860J309K949k719M74
7254c437r34O250p65p841J133L590J191j0078J829J987O193L586L35m801r2K926
7238A072L333n386l028Q33M946J409L38j361L130O369m089l313m060l142k887
$$ plain form
7223 -5836 -8889 -8420 -3872 1035 4078 6157 6077 -1018 -1932 4141 1380 950 5750 8236 6023 -1428
7207 -1428 -4428 3275 5850 1574 -2848 1401 1502 -1160 -898 -1483 5246 9465 4348 -923 -4451 -2783
7191 -2783 2078 1186 -6400 -2341 9508 11824 5155 3256 -1121 -7198 -6490 -7718 -6400 4073 -400
7176 -400 -2370 -4809 -4889 -4077 -2219 2146 177 -3753 -6059 -4249 -2714 -4630 -3512 -6950 -6372 -3807
7160 -3807 -6504 -7649 -874 7297 5866 -2916 -5492 -3319 -965 -5435 -3243 -2237 -1253 2416 2475 1669
7144 1669 -5389 1356 11240 11405 5204 -2977 -7713 -10202 -12317 -8642 -7569 -11604 -7275 -5270 1833
7129 1833 5556 5430 -888 -2895 -426 1806 3502 -5391 -8407 -5841 779 -3686 -533 5229 3511
7114 3511 -7196 -6822 3743 6019 -257 2101 5785 4361 79 -8020 -3758 1181 2554 1989 -911
$$ packed form
7223e836l053M69M548M907L043K079q0p095r14O073k761m30M800K486k213p451
7207a428l000P703K575m276m422M249J01k662K62n85O729M219n117n271l528J668
7191b783M861q92p586M059J1849K316o669j899m377o077P08j228J318J0473m473
7176d00j970k439q0Q12J858M365j969l930k306J810J535j916J118l438N78K565
7160c807k697j145O775Q171j431q782k576K173K354m470K192J006R84L669N9q06
7144A669p058O745R884J65o201q181m736k489k115L675J073m035M329K005P103
7129A833L723j26o318k007K469K232J696q893l016K566O620m465L153N762j718
7114C511j0707L74J0565K276o276K358L684j424m282q099M262M939J373n65k900
$$ plain form
7099 -911 -5398 -6387 3299 -4792 -9280 -5566 718 2066 -2949 -6066 -5020 478 1828 -2519 3584
7084 3584 2639 1173 5388 4928 -1495 -5721 -8413 -10621 -7881 -7916 -4442 -1941 -2525 -9638 -15120 -9085
7068 -9085 -5130 -1205 6278 4576 3010 2411 -333 -4083 -2986 4286 7614 4500 1226 -1093 -5370
7053 -5370 -3319 686 -1366 -3753 -4338 -2160 -3303 -8003 -11114 -9930 -2408 1881 -3430 -5565 -9368
7038 -9368 -8351 -9680 -14606 -13497 -9004 -5477 -7060 -3539 -3034 -5727 -9492 -7894 -6411 -2303 -3548
7023 -3548 -2766 -420 -2034 -2857 -1243 -23 2655 -14 -5902 -983 -1997 -6421 -5626 -6926 -5752 -3813
7007 -3813 -80 8478 10581 2561 -4676 -7324 -11477 -12597 -10417 -17085 -14284 -1665 3674 9080 4343
6992 4343 3374 3456 -4826 -12174 -12026 -7252 -2755 -818 1364 -1543 -109 -751 -3924 -2949 -1582 -2391 -4555
$$ packed form
7099i11m487r89R686q091m488L714O284J348n015l117J046N498J350m347O103
7084C584r45j466M215m60o423m226k692k208K740l5L474K501n84p113n482O035
7068i085L955L925P483j702j566n99k744l750J097P272L328l114l274k319m277
7053e370K051M005k052k387n85K178j143m700l111J184P522M289n311k135l803
7038i368J017j329m926J109M493L527j583L521N05k693l765J598J483M108j245
7023c548P82K346j614q23J614J220K678k669n888M919j014m424P95j300J174J939
7007c813L733Q558K103q020p237k648m153j120K180o668K801J2619N339N406m737
6992D343r69Q2q282p348J48M774M497J937K182k907J434o42l173R75J367q09k164
$$ plain form
6975 -4555 -13809 -11031 -11474 -8287 -10546 -9005 121 -2612 -1739 48 1504 1156 -6398 -2867 240 2861
6959 2861 7349 5894 3562 2950 -720 4160 5135 567 -5352 -8734 -11948 -12722 -4008 -4693 -4951 -6242
6943 -6242 -5338 -257 -1903 54 3263 1619 -2094 -5412 -5563 -7117 -6156 -5316 -4817 -2919 -3523 -1470
6927 -1470 1714 600 -152 -248 2918 2845 -2930 -12656 -8697 -5054 1580 4012 6668 1512 -6591 -2156
6911 -2156 1722 7282 5522 -1893 -6218 -2822 -4271 -2185 -5858 -10089 -9803 -8146 -1225 1853 4986
6896 4986 4073 -305 2916 6511 8838 8135 5109 -768 -4652 -1459 -3330 -3983 -357 -722 -336 733
6880 733 -4138 -9634 -10797 -10547 -7442 1729 6007 1705 3308 1209 4175 -191 -3652 -2864 -5294 -6063
6864 -6063 -10804 -11279 -9246 -10787 -6365 -345 4299 -2407 -2427 -4003 -2016 2415 1600 5005 11696 11063
$$ packed form
6975d555r254K778m43L187k259J541R126k733Q73J787J456l48p554L531L107K621
6959B861M488j455k332o12l670M880R75m568n919l382l214p74Q714o85k58j291
6943f242R04N081j646J957L209j644l713l318j51j554R61Q40M99J898o04K053
6927a470L184j114p52r6L166p3n775r726L959L643O634K432K656n156q103M435
6911b156L878N560j760p415m325L396j449K086l673m231K86J657O921L078L133
6896D986r13m378L221L595K327p03l026n877l884L193j871o53L626l65L86J069
6880G33m871n496j163K50L105R171M278m302J603k099K966m366l461P88k430p69
6864f063m741m75K033j541M422O020M644o706k0j576J987M431q15L405O691o33
$$ plain form
6848 11063 11756 7644 2904 -5125 -9691 -9126 -8094 -5725 -7677 -8996 -3661 664 -254 -3695 -5407
6833 -5407 -6987 -110 -300 -5089 -2325 -3445 -5168 -4918 -4476 871 1838 2608 2973 5603 10887 7818
6817 7818 -812 -640 -1203 1446 2004 3491 8233 5853 -458 16 1829 -1884 831 -571 -3151 -1982
6801 -1982 -162 3217 -2116 -5927 -9106 -1697 2840 957 1768 -1284 -3808 -2318 -3595 -4337 -5104 -7765
6785 -7765 -184 1745 5114 2751 3097 2622 6109 12433 11094 7105 664 -4885 -2522 3794 4642 -3918
6769 -3918 -3622 -3458 5837 7040 4381 4215 9704 6687 1446 -437 762 1709 1711 1600 3986 4238 5308
6752 5308 6242 7421 10457 9164 7011 6760 6638 10530 11159 15485 11502 12212 16970 13434 16543 21775
6736 21775 20819 20930 15779 18809 21681 24750 22830 14934 20438 25725 25145 16704 18960 11048 9013
$$ packed form
6848A1063O93m112m740q029m566N65J032K369j952j319N335M325r18l441j712
6833e407j580O877j90m789K764j120j723K50M42N347R67P70L65K630N284l069
6817G818q630J72n63K649N58J487M742k380o311M74J813l713K715j402k580J169
6801a982J820L379n333l811l179P409M537j883Q11l052k524J490j277p42p67k661
6785g765P581J929L369k363L46m75L487O324j339l989o441n549K363O316Q48q560
6769c918K96J64R295J203k659j66N489l017n241j883J199R47Kj11K386K52J070
6752E308R34J179L036j293k153k51j22L892O29M326l983P10M758l536L109N232
6736B1775r56J11n151L030K872L069j920p896N504N287n80q441K256p912k035
$$ plain form
6721 9013 5650 -1834 -1461 -5058 -10225 -7057 -3559 -4390 -8520 -14255 -8778 594 -3129 -6445 -8537
6706 -8537 -9412 -7466 -6536 -7739 -9918 -7055 104 112 -3512 -5329 -6301 -7949 -483 812 -471 -2466
6690 -2466 -405 1417 6728 4909 3261 7081 2489 -9574 -6334 -50 -3194 4391 118 263 4344
6675 4344 3885 3957 2238 -1359 1004 903 -1834 -1827 -3573 -201 1304 475 767 1692 -891 459 -4374
6658 -4374 -8709 -7869 -4112 -10852 -11280 -5098 -553 3746 5831 2911 -4522 -9043 -11549 -6308 -6097 -7899
6642 -7899 -6557 -2631 4779 5325 1565 -707 -1136 3410 2990 3725 2576 6462 7481 7065 5532 4072
6626 4072 2774 3884 -1408 4344 5074 2630 4446 7046 4978 -583 -5297 -723 2504 7494 6918
6611 6918 5971 8856 6922 -4853 -7425 -3904 -1463 -193 1439 7476 7547 7974 1905 444 -1342 -8506
$$ packed form
6721I013l363p484L73l597n167L168L498q31m130n735N477R372l723l316k092
6706h537q75J946R30j203k179K863P159Ql624j817r72j648P466J295j283j995
6690b466K061J822N311j819j648L820m592j2063L240O284l144P585m273J45M081
6675D344m59P2j719l597K363j01k737Pj746L372J505q29K92R25k583J350m833
6658d374m335Q40L757o740m28O182M545M299K085k920p433m521k506N241K11j802
6642g899J342L926P410N46l760k272m29M546m20P35j149L886J019m16j533j460
6626D072j298J110n292N752P30k444J816K600k068n561m714M574L227M990n76
6611F918r47K885j934j1775k572L521K441J270J632O037P1M27o069j461j786p164
$$ plain form
6595 -8506 -2363 6865 10734 8143 6479 9715 8128 3488 3746 2635 -895 -9732 -12210 -13482 -9329
6580 -9329 1698 8303 -1230 -4110 -3033 -1395 1288 -2164 -2675 -226 -41 -2546 -834 5275 7358
6565 7358 -241 -1953 3331 538 -5286 -3422 -3922 -2781 2542 1028 3065 6117 -265 6352 7742
6550 7742 5699 -678 -10801 -15033 -16482 -15397 -9516 -8045 -5177 3110 10929 6710 3545 -284 -4707
6535 -4707 -4907 -970 -2511 -2321 -4267 -3838 -3917 -5212 -7717 -3210 2307 3745 3566 -2354 -3781 929
$$ packed form
6595h506O143R228L869k591j664L236j587m640K58j111l530q837k478j272M153
6580i329J1027O605r533k880J077J638K683l452n11K449J85k505J712O109K083
6565G358p599j712N284k793n824J864n00J141N323j514K037L052o382O617J390
6550G742k043o377j0123m232j449J085N881J471K868Q287P819m219l165l829m423
6535d707k00L937j541J90j946M29p9j295k505M507N517J438j79n920j427M710
$$ [...]
##END NTUPLES=NMR SPECTRUM
##END=
