##TITLE=Analysis number 309858
Compound Code mo 00751
Book Reference 1
Project Code adrs
Chemist Name stores
##JCAMPDX= 6.0         $$ Bruker NMR JCAMP-DX V2.0
##DATA TYPE= NMR SPECTRUM
##DATA CLASS= NTUPLES
##ORIGIN= Bruker BioSpin GmbH
##OWNER= NMR
$$ XWIN-NMR		Version 3.5
$$ Mon Jun  6 10:30:39 2005 GMT Daylight Time (UT+1h)  MAYBRIDGE\NMR@NMR_250MHZ
##.OBSERVE FREQUENCY= 250.131544655141
##.OBSERVE NUCLEUS= ^1H
##.ACQUISITION MODE= SIMULTANEOUS (DQD)
##.ACQUISITION SCHEME= undefined
##.AVERAGES= 16
##.DIGITISER RES= 18
##SPECTROMETER/DATA SYSTEM= dpx250
##.PULSE SEQUENCE= zg30
##.SOLVENT NAME= DMSO
##.SHIFT REFERENCE= (INTERNAL, DMSO, 0, 16.522)
##AUDIT TRAIL= $$ (NUMBER, WHEN, WHO, WHERE, WHAT)
$$ ##TITLE= Audit trail, XWIN-NMR		Version 3.5
$$ ##JCAMPDX= 5.01
$$ ##ORIGIN= Bruker BioSpin GmbH
$$ ##OWNER= NMR
$$ C:\u/data/dgb/nmr/ADRS/3860/pdata/1/auditp.txt
$$ ##AUDIT TRAIL=  $$ (NUMBER, WHEN, WHO, WHERE, WHAT)
(   1,<2005-06-06 10:30:21.07 +100>,<MAYBRIDGE\NMR>,<NMR_250MHZ>,
      <created by zg, POWCHK disabled, PULCHK disabled
       configuration hash MD5:
       62 19 C7 07 E1 42 D1 B7 37 6C 3D D0 77 39 F9 E6
       data hash MD5: 64K
       36 45 0A 4F 2C E5 64 EF E0 3B 23 46 BC 98 FB 57>)
(   2,<2005-06-06 10:30:31.89 +100>,<MAYBRIDGE\NMR>,<NMR_250MHZ>,
      <Start of raw data processing
       ef LB = 0.3 FT_mod = 6 PKNL = 1 SI = 32K 
       data hash MD5: 32K
       AA FD 22 80 90 99 72 90 AA EF 07 4C A7 2D CE DA>)
(   3,<2005-06-06 10:30:33.84 +100>,<MAYBRIDGE\NMR>,<NMR_250MHZ>,
      <apk 
       data hash MD5: 32K
       4B 16 39 BD DB CD 09 D6 CC A4 DA B7 19 F1 D7 16>)
(   4,<2005-06-06 10:30:34.57 +100>,<MAYBRIDGE\NMR>,<NMR_250MHZ>,
      <abs ABSG = 5 
       data hash MD5: 32K
       A7 20 7F F8 B8 D6 27 42 B2 E9 21 78 78 9C CF 25>)
$$ ##END=
$$ 
$$ hash MD5
$$ C9 4E 70 C3 41 43 71 D6 F9 F2 5F 56 88 67 85 50
##$RELAX= 
##$RELAX= 
##$RELAX= 
##$RELAX= 
##$RELAX= 
##$RELAX= 
##$RELAX= 
$$ Bruker specific parameters
$$ --------------------------
##$DU= <C:\u>
##$EXPNO= 3860
##$NAME= <ADRS>
##$PROCNO= 1
##$TYPE= <nmr>
##$USER= <dgb>
##$AMP= (0..31)
100 100 100 100 100 100 100 100 100 100 100 100 100 100 100 100 100 100 
100 100 100 100 100 100 100 100 100 100 100 100 100 100 
##$AQSEQ= 0
##$AQ_mod= 3
##$AUNM= <au_zg>
##$AUTOPOS= <14 >
##$BF1= 250.13
##$BF2= 250.13
##$BF3= 250.13
##$BF4= 250.13
##$BF5= 500.13
##$BF6= 500.13
##$BF7= 500.13
##$BF8= 500.13
##$BYTORDA= 1
##$CFDGTYP= 0
##$CFRGTYP= 5
##$CHEMSTR= <none>
##$CNST= (0..31)
1 1 145 1 1 1 1 1 1 1 1 1 1 1 1 1 1 1 1 1 1 1 1 1 1 1 1 1 1 1 1 1 
##$CPDPRG= <>
##$CPDPRG1= <>
##$CPDPRG2= <>
##$CPDPRG3= <>
##$CPDPRG4= <mlev>
##$CPDPRG5= <mlev>
##$CPDPRG6= <mlev>
##$CPDPRG7= <mlev>
##$CPDPRG8= <mlev>
##$CPDPRGB= <>
##$CPDPRGT= <>
##$D= (0..31)
0 1 0 0 0 0 0 0 0 0.06 0 0 0 0 0 0 0.0002 0 0 0 0 0 0 0 0 0 0 0 0 0 0 
0 
##$DATE= 1118050220
##$DBL= (0..7)
120 120 120 120 120 120 120 120 
##$DBP= (0..7)
150 150 150 150 150 150 150 150 
##$DBP07= 0
##$DBPNAM0= <>
##$DBPNAM1= <>
$$ [...]
##$SUBNAM7= <"">
##$SUBNAM8= <"">
##$SUBNAM9= <"">
##$SW= 20.6930455092707
##$SWIBOX= (0..15)
0 0 3 0 0 0 0 0 0 0 0 0 0 0 0 0 
##$SW_h= 5175.983436853
##$TD= 65536
##$TD0= 1
##$TE= 294.16
##$TE2= 300
##$TE3= 300
##$TEG= 300
##$TL= (0..7)
0 120 120 120 120 120 120 120 
##$TP= (0..7)
150 150 150 150 150 150 150 150 
##$TP07= 0
##$TPNAME0= <>
##$TPNAME1= <>
##$TPNAME2= <>
##$TPNAME3= <>
##$TPNAME4= <>
##$TPNAME5= <>
##$TPNAME6= <>
##$TPNAME7= <>
##$TPOAL= (0..7)
0.5 0.5 0.5 0.5 0.5 0.5 0.5 0.5 
##$TPOFFS= (0..7)
0 0 0 0 0 0 0 0 
##$TUNHIN= 0
##$TUNHOUT= 0
##$TUNXOUT= 0
##$USERA1= <user>
##$USERA2= <user>
##$USERA3= <user>
##$USERA4= <user>
##$USERA5= <user>
##$V9= 5
##$VALIST= <valist>
##$VCLIST= <CCCCCCCCCCCCCCC>
##$VD= 0
##$VDLIST= <DDDDDDDDDDDDDDD>
##$VPLIST= <PPPPPPPPPPPPPPP>
##$VTLIST= <TTTTTTTTTTTTTTT>
##$WBST= 1024
##$WBSW= 4
##$XGAIN= (0..3)
0 0 0 0 
##$XL= 0
##$YL= 0
##$YMAX_a= 316720
##$YMIN_a= -348395
##$ZGOPTNS= <>
##$ZL1= 120
##$ZL2= 120
##$ZL3= 120
##$ZL4= 120
##$ABSF1= 16.522
##$ABSF2= -4.171173
##$ABSG= 5
##$ABSL= 3
##$ALPHA= 0
##$AQORDER= 0
##$ASSFAC= 0
##$ASSFACI= 0
##$ASSFACX= 0
##$ASSWID= 0
##$AUNMP= <proc_1d>
##$AZFE= 0.1
##$AZFW= 0.1
##$BCFW= 0
##$BC_mod= 0
##$BYTORDP= 0
##$COROFFS= 0
##$CY= 12.5
##$DATMOD= 1
##$DC= 0
##$DFILT= <>
##$DTYPP= 0
##$F1P= 14.0000005364418
##$F2P= -0.99999901652339
##$FCOR= 0.5
##$FTSIZE= 32768
##$FT_mod= 6
##$GAMMA= 0
##$GB= 0
##$INTBC= 1
##$INTSCL= 1
##$ISEN= 128
##$LB= 0.3
##$LEV0= 0
##$LPBIN= 0
##$MAXI= 10000
##$MC2= 0
##$MEAN= 0
##$ME_mod= 0
##$MI= 0
##$NCOEF= 0
##$NC_proc= -3
##$NLEV= 6
##$NOISF1= 0
##$NOISF2= 0
##$NSP= 0
##$NTH_PI= 0
##$NZP= 0
##$OFFSET= 16.522
##$PC= 1
##$PHC0= -67.22235
##$PHC1= -18.93654
##$PH_mod= 1
##$PKNL= yes
##$PPARMOD= 0
##$PSCAL= 4
##$PSIGN= 0
##$REVERSE= no
##$SF= 250.13
##$SI= 32768
##$SIGF1= 0
##$SIGF2= 0
##$SINO= 400
##$SIOLD= 32768
##$SREGLST= <1H.DMSO>
##$SSB= 0
##$STSI= 32768
##$STSR= 0
##$SW_p= 5175.98343685301
##$SYMM= 0
##$S_DEV= 0
##$TDeff= 65536
##$TDoff= 0
##$TI= <Analysis number 999999
Compound Code 99
Book Reference 9
Project Code 9>
##$TILT= no
##$TM1= 0
##$TM2= 0
##$TOPLEV= 0
##$USERP1= <user>
##$USERP2= <user>
##$USERP3= <user>
##$USERP4= <user>
##$USERP5= <user>
##$WDW= 1
##$XDIM= 32768
##$YMAX_p= 294966473
##$YMIN_p= -235487
$$ End of Bruker specific parameters
$$ ---------------------------------
##NTUPLES= NMR SPECTRUM
##VAR_NAME=  FREQUENCY,     SPECTRUM/REAL,   SPECTRUM/IMAG
##SYMBOL=    X,             R,               I
##VAR_TYPE=  INDEPENDENT,   DEPENDENT,       DEPENDENT
##VAR_FORM=  AFFN,          ASDF,            ASDF
##VAR_DIM=   32768,         32768,           32768
##UNITS=     HZ,            ARBITRARY UNITS, ARBITRARY UNITS
##FACTOR=    0.157963299565203, 1,           1
##FIRST=     4132.6476996994, 0,             0
##LAST=      -1043.33573715361, 0,           0
##MIN=       -1043.33573715361, -235487,     0
##MAX=       4132.6476996994, 294966473,     0
$$ Real data points
##PAGE= N=1
##DATA TABLE= (X++(R..R)), XYDATA
$$ [...]
16386a6464M6820L4233J9162l5688l9849M571m4911k9458L408K0738K5362L5416
$$ -16464 30356 64589 83751 48063 8214 12785 -32126 -61584 -58176 -37438 -12076 23340
16374B3340O9130m719l9747l0286n1481R511M1995P0928J8801m0557k1952P132
$$ 23340 92470 87751 48004 17718 -33763 -24252 17743 88671 107472 66915 44963 52095
16362E2095M1360l49L298J3244l3958m8611o2272J6666M7658K1895m171j4857
$$ 52095 93455 93106 96404 109648 75690 27079 -35193 -18527 29131 51026 46855 31998
16350C1998o1633N46P9795O5246j2193M2379l4109n8186m9707l4731j0317N4382
$$ 31998 -29635 -29089 50706 115952 103759 146138 112029 53843 4136 -30595 -40912 13470
16338A3470M1987J1445k9867k6043M570K5095L5718n9947m2297K6396j4219J269
$$ 13470 55457 66902 37035 10992 15562 40657 76375 16428 -25869 527 -13692 -12423
16326a2423K8782K4138n0216q310M3653L9546N9927K3571k2092m9624n6689k8803
$$ -12423 16359 40497 -9719 -18029 25624 65170 125097 148668 126576 76952 20263 -8540
16314h540m8483L5000J06358J0192J145J8621O088k0167l3770o5344j4980j1J4162
$$ -8540 -57023 -22023 84335 94527 95672 114293 120381 100214 66444 1100 -13880 -13891 271
16301B71L0314n0955o2879J8041P8842k356m8787j6520P013j0249L0495l4763
$$ 271 30585 -20370 -83249 -65208 13634 11278 -37509 -54029 -47016 -57265 -26770 -61533
16289f1533o075L5931r326m605L6547K1076N0462K5280l2492k5656m9678j5248
$$ -61533 -67608 -31677 -41003 -45608 -9061 12015 62477 87757 55265 29609 -20069 -35317
16277c5317j2825N1421J9064L4507J90o6960k0860m573k972K7698O647k686j763
$$ -35317 -48142 3279 22343 56850 57040 -9920 -30780 -35353 -38325 -10627 -3980 -6666 -8429
16264h429L3470N5194j0445n2862j7603R0057L4167L5237q273m2433J776Q950
$$ -8429 25041 80235 69790 16928 -675 89382 123549 158786 150513 108080 109856 118806
16252A18806K3107n8212p0938l3312K1657J8233j7685k5391o485L4103K1957L3261
$$ 118806 141913 83701 12763 -20549 1108 19341 1656 -23735 -30220 3883 25840 59101
16240E9101k0651M047J6626k7728m715L3297M6517N3017m1325J243K110l33o8635
$$ 59101 38450 42497 59123 31395 26680 59977 106494 159511 118186 119429 121539 121206 52571
16227E2571o4983k4728k2783N9234R9487K4064k9556n2411m855j6342L0488j3061
$$ 52571 -12412 -37140 -59923 -689 98798 122862 93306 40895 36040 19698 50186 37125
16215C7125p1057K9768L7406K404j462L1192l943K571l1343J0396J6275l3026
$$ 37125 -33932 -4164 33242 35646 34184 65376 61433 64004 32661 43057 59332 26306
16203B6306N019m6024l8836k5421j2830M5986O6153K9390l2873n7486j4362j3766
$$ 26306 31325 -14699 -53535 -78956 -91786 -45800 20353 49743 16870 -40616 -54978 -68744
16191f8744k2420J8108L6200j0039l196K3514N5558j091n1369m1356n337L1119
$$ -68744 -91164 -73056 -36856 -46895 -50091 -26577 28981 27890 -23479 -64835 -70172 -39053
16179c9053L8969n7557l5327j2673K8747L9146L4580l3778Q9052K6332r339n7862
$$ -39053 -84 -57641 -92968 -105641 -76894 -37748 -3168 -36946 52106 78438 69099 11237
16167A1237J166O055n1310J1110R923K9732L0180N225k884n5844n4649J8353K6268
$$ 11237 12403 18458 -32852 -21742 -11819 17913 48093 53318 50434 -5410 -60059 -41706 -15438
16154a5438k2283N5196K9478l272m3425L1968K8991n672l1548J0013K4953O9969
$$ -15438 -37721 17475 46953 43681 256 32224 61215 55543 23995 34008 58961 128930
16142A28930N0074j2657l7932l6676l122l7218L4012K3156J8682k0793m1318J7322
$$ 128930 179004 166347 128415 91739 88617 51399 85411 108567 127249 106456 65138 82460
16130H2460N975j3352j11746n7310j7254K1024L0602M4442K0488j2232K9852m1339
$$ 82460 88435 75083 -36663 -93973 -111227 -90203 -59601 -15159 5329 -6903 22949 -18390
16118a8390o5666Q396O4430m085J952P576k5427L8636R075O2760p432o2314o2149
$$ -18390 -84056 -75660 -11230 -15315 -13363 -5787 -31214 7422 16497 79257 71825 9511 -52638
16105e2638j9904k7659M3381O3020N6675j5214r188k2998n0010j5261L8521M1800
$$ -52638 -72542 -100201 -56820 6200 62875 47661 38473 15475 -34535 -49796 -11275 30525
16093C0525k4820j0327o411L731J2280J0174J6202M0901R5m2607p9884j1556K1513
$$ 30525 5705 -4622 -11033 -7302 4978 15152 31354 72255 72350 29743 -50141 -61697 -40184
16080d0184j5769M7743N5552J7672l2422p082k1342k3511J8842l9739o2306O107
$$ -40184 -55953 -8210 47342 65014 32592 25510 4168 -19343 -501 -40240 -102546 -96439
16068i6439n452o4620J3115N8696M807J149L5382n294o818L7963L0566M6364L0819
$$ -96439 -101891 -166511 -153396 -94700 -89893 -88744 -53362 -58656 -65474 -27511 3055 49419 80238
16055H0238k6769l8703K7524m610N8769O7952j4876n7774J4563M4157l1971p3336
$$ 80238 53469 14766 42290 37680 96449 164401 149525 91751 106314 150471 118500 45164
16043D5164l6005K6664q16r808k7450M8270N2527j2195j7491J9230K8877m573
$$ 45164 9159 35823 35007 25199 -2251 46019 98546 86351 68860 88090 116967 112394
16031A12394j0746m339J8702j1985L8296k710n0369j6075K255M000L683J8990
$$ 112394 101648 97309 116011 104026 142322 139612 89243 73168 75423 79423 83106 102096
16019A02096l6992k4796k9500J9314N9167J2466k6745l7904l5852l8422j0835
$$ 102096 65104 40308 10808 30122 89289 101755 75010 37106 1254 -37168 -48003
16008d8003K2453l2911k8907k0819K1442j5994J2947M4835J3261j7023l7611L9689
$$ -48003 -25550 -58461 -87368 -108187 -86745 -102739 -89792 -44957 -31696 -48719 -86330 -46641
15996d6641N5513l8805Q885J6418N2664P1895O164n5269p5992O9053J2658j13062
$$ -46641 8872 -29933 -21048 -4630 48034 119929 126093 70824 -5168 63885 76543 -36519
15984c6519j3584K7226j8861k5439L8423M753N3591M0990K245m8188K3085K9827
$$ -36519 -50103 -22877 -41738 -67177 -28754 -24001 29590 70580 72825 24637 47722 77549
15972G7549j7151J8884m0180k603J2728j6515J3099L869j7117J2179r508J8568
$$ 77549 60398 79282 39102 36499 49227 32712 45811 49680 32563 44742 35234 53802
15960E3802L0687L6893L8076n8440k0995l0085k4338L5475M8129m6102k1752M86
$$ 53802 84489 121382 159458 101018 80023 49938 25600 61075 109204 63102 41350 41836
15948D1836p570J4950K5267n2160k8772l8985K7854K6915K1671p354o4243N5932
$$ 41836 34266 49216 74483 22323 -6449 -45434 -17580 9335 31006 23652 -40591 15341
15936A5341L8840k7779p8574L0202K0868j6515m636K2146k585L1488j9539n2839
$$ 15341 54181 26402 -52172 -21970 -1102 -17617 -22253 -107 -2692 28796 9257 -43582
15924d3582J2998N9819J427j5907N4509J6805o6725m0591O3483L2409K3261j2234
$$ -43582 -30584 29235 30662 14755 69264 86069 19344 -21247 42236 74645 97906 85672
15912H5672L2209n2338n9787L6242l1656N3553L9292k1083l4876K8696r424o1333
$$ 85672 117881 65543 5756 41998 10342 63895 103187 82104 47228 75924 66500 5167
15900E167K2266L4518j6852l1899J4484M8306k0558R805J1907k3450J2578m3575
$$ 5167 27433 61951 45099 13200 27684 75990 55432 65237 77144 53694 66272 22697
15888B2697m8758J1132L6143K5252l1793K1535n740M5760L4435l2498m0120M540
$$ 22697 -26061 -14929 21214 46466 14673 36208 30468 76228 110663 78165 38045 42585
15876D2585L2230n3894l8232K894J5918R9853M3748j0387j5591R904K5382k2866
$$ 42585 74815 20921 -17311 -14417 1501 101354 145102 134715 119124 129028 154410 131544
15864A31544m0955k4631q931n638l434j1966k2052J9735K1072n127J3516M673
$$ 131544 90589 65958 57027 51389 47955 35989 13937 33672 54744 49617 63133 67806
15852F7806j0246j3114N9617k335l8720l7656k5473k4578N933K2004K1093J9329
$$ 67806 57560 44446 104063 101728 63008 25352 -121 -24699 -18766 3238 24331 43660
15840D3660K0196K5441K4518L3989M3710o2363m5288j0761O7469j9605j6657j6669
$$ 43660 63856 89297 113815 147804 191514 129151 83863 73102 140571 120966 104309 87640
15828H7640k7398l3273r474L9417P029o154r7073n6927Q785O9886K9249m3829
$$ 87640 60242 26969 17495 56912 63941 57787 -39286 -96213 -87428 -17542 11707 -32122
15816c2122K4831j2745J3290K1017l523j6605j3044K8098j5981q0565k994J7938
$$ -32122 -7291 -20036 -6746 14271 10748 -5857 -18901 9197 -6784 -87349 -90343 -72405
15804g2405J3946P3297L7690n922j5959O5874k4575j8011J3507k1660L290j0944
$$ -72405 -58459 14838 52528 46606 30647 96521 71946 53935 67442 45782 49072 38128
15792C8128l0410o2119L0598j8636n7376J8373N0306Q844k2815N4357O4768j74
$$ 38128 7718 -54401 -23803 -42439 -99815 -81442 -31136 -22292 -45107 9250 74018 73844
15780G3844k1633n5446J459p396n7186L625R6891M3296n166J5770m7205p4372
$$ 73844 52211 -3235 -1776 -9172 -66358 -62733 34158 77454 72288 88058 40853 -33519
15768c3519k4148K207K5079M1636L5061k7639R16J0571o3629o69j1539L8775M746
$$ -33519 -57667 -55460 -30381 11255 46316 18677 19593 30164 -33465 -34134 -45673 -6898 -2152
15755b152l9987o2651J3795L7925N6539P759K2427L9335J7745m041P083p1141
$$ -2152 -42139 -104790 -90995 -53070 3469 11228 33655 72990 90735 86694 93777 22636
15743B2636l6492K9372N894J1825J8527p6619j807M5594j1685j0770p870K1058
$$ 22636 -13856 15516 21410 33235 51762 -24857 -26664 18930 7245 -3525 -11395 9663
15731I663R502J5137J4439k1956M3753m861j3567j0603L4611k22l1337k4794N035
$$ 9663 19165 34302 48741 26785 70538 65677 52110 41507 76118 75896 44559 19765 24800
15718B4800J4632n567n4593k3032O8124M6464l2676J3633M6248M0919m4224p4963
$$ 24800 39432 33865 -20728 -43760 24364 70828 38152 51785 98033 138952 94728 19765
15706A9765K7259L1142j2278M3538l5587l5088P265N5796k2365m2685L2607K3070
$$ 19765 47024 78166 65888 109426 73839 38751 46016 101812 79447 36762 69369 92439
15694I2439K5339k814m5039J3663m3535k8532q409L7901M4433N3621l2865l3341
$$ 92439 117778 114964 69925 83588 40053 11521 3112 41013 85446 139067 106202 72861
15682G2861j4458k947p803m4288j5675M1952L3573l864m1616J3857j7479J7633
$$ 72861 58403 55456 47653 3365 -12310 29642 63215 59351 17735 31592 14113 31746
15670C1746M4397n7863m5449R099L4681j6193P3679L2403l8452o0346K185N3176
$$ 31746 76143 18280 -27169 -18070 16611 418 74097 106500 68048 7702 9887 63063
15658F3063L9468J6630N668n2423o4382j4540Q6145N3473M0173o5852n043j8787
$$ 63063 102531 119161 124829 72406 8024 -6516 79629 133102 173275 107423 102380 83593
15646H3593r9975l7118K3621L1557M5754l2883K0564J4356J1795O3219j1029m9825
$$ 83593 -16382 -53500 -29879 1678 47432 14549 35113 49469 61264 124483 113454 63629
15634F3629o1568j856j0790l993L7912M5968J4820J7011o491k7449J3907M3938
$$ 63629 2061 205 -10585 -14578 23334 69302 84122 101133 94642 67193 81100 125038
15622A25038j0627p845O87m2864j3434M608m6408j2917m49J7362N777L1973O3102
$$ 125038 114411 106566 107253 64389 50955 55563 9155 -3762 -4211 13151 18928 50901 114003
15609A14003n1843j23048l2892L7788N2239K2130j1582p558K9450J1216M4277
$$ 114003 62160 -60888 -93780 -55992 -3753 18377 6795 -763 28687 39903 84180
15598H4180m3260o430j4731l3210m7573Q359N231m77m583M3466J8998M1981J7779
$$ 84180 40920 34490 19759 -13451 -61024 -52665 -47434 -47911 -52494 -9028 9970 51951 69730
15585F9730p52m1814M2239K2445L220m4441l5637Q410l8046K3636N3685l671J1332
$$ 69730 68978 27164 69403 91848 95068 50627 14990 23400 -14646 8990 62675 59004 70336
15572G0336J2126J1888o227n4491k4872J6248j3132K8347J8190L2818M9871O995
$$ 70336 82462 94350 88123 33632 8760 25008 11876 40223 58413 91231 141102 148097
15560A48097k1247o1888q1942j087J7020K2598m2145M2913L5099k3249j649p5498
$$ 148097 126850 64962 -16980 -18067 -1047 21551 -20594 22319 57418 34169 32520 -42978
15548d2978J9892L5746N810K5588M6080K214m2278j626L5466Q942n8560m4982
$$ -42978 -23086 12660 18470 44058 90138 92352 50074 48448 83914 92856 34296 -10686
15536a0686J0934J8112J0108O2512o7593m0420M5384J0983k6613K4655K0088o969
$$ -10686 248 18360 28468 90980 23387 -17033 28351 39334 12721 37376 57464 50495
15524E0495O984J159o1703l1565K5226m2070o7167M5136O556l6958Q6182N8700
$$ 50495 57479 58638 -3065 -34630 -9404 -51474 -118641 -73505 -66949 -103907 -17725 40975
15512D0975l7521k8272M1445J4126j1019J5271N2048K7691p949m7871m3920j7745
$$ 40975 3454 -24818 16627 30753 19734 35005 87053 114744 106795 58924 15004 -2741
15500b741q223J4631l1364P560O488O5402P1931J1328m1426j1894l1831k6281
$$ -2741 -10964 3667 -27697 -20137 -13649 51753 123684 135012 93586 81692 49861 23580
15488B3580n9018j0858O3261j5940k6666N1598J6946K3286o088j6036N4592k9578
$$ 23580 -35438 -46296 16965 1025 -25641 25957 42903 66189 60101 44065 98657 69079
15476F9079Q155k8348J470N1123k3480l6931l1772n138k4425K1162M2270K7871
$$ 69079 77234 48886 50356 101479 77999 41068 9296 4158 -20267 895 43165 71036
15464G1036m6835l9872L013M5453j3798k5617r247P622J4539m724K7520j29j1868
$$ 71036 24201 -15671 -12658 32795 18997 -6620 -15867 -8245 6294 1570 29090 28961 17093
15451A7093L2699Q570l6651l5137K4763J1866j8179n6411k5598L2730L2903N1565
$$ 17093 49792 58362 21711 -13426 11337 23203 5024 -51387 -76985 -44255 -11352 40213
15439D0213K6227o5482K4911R813J7892m3289j8143M9593q597o0658j0362k340
$$ 40213 66440 958 25869 35682 53574 10285 -7858 41735 33138 -27520 -37882 -40222
15427d0222N6958L781l8894r055J518j777k5303N575O859N6420L5388P0267O807
$$ -40222 16736 20517 -18377 -27432 -25914 -27691 -52994 -47419 -40560 15860 51248 121515 128322
15414A28322P737p7601J5587L5930m2413j1481K60L299k7054N752n884J3871j8399
$$ 128322 136059 58458 74045 109975 67562 56081 56341 59640 32586 38338 32454 46325 27926
15401B7926j3378j647q982l4516N2916N2585M7818n4023o6999J3648r091N3621
$$ 27926 14548 12901 3919 -30597 22319 74904 122722 68699 1700 15348 6257 59878
15389E9878k8420m247M010k1102K8181p894m5930L1057r465o171k4822j5422Q062
$$ 59878 31458 27211 31221 10119 38300 30406 -15524 15533 6068 -103 -24925 -40347 -32285
15376c2285j5435O0981K8138k8629l2237J5194O4027K3787p597n363J4159M565
$$ -32285 -47720 13261 41399 12770 -19467 -4273 59754 83541 75944 70581 84740 89305
15364H9305Q882l688J3645p5872p3633j5668O3667L3550O5496M2943O656j4455
$$ 89305 98187 94499 108144 32272 -41361 -57029 6638 40188 105684 148627 155283 140828
15352A40828k8694o7059j5545K8691J0621J7294k5445j3486J3428N4124n0786
$$ 140828 112134 45075 29530 58221 68842 86136 60691 47205 60633 114757 63971
15341F3971m6028J0813N0820Q148j2453J272k1156N329j6814j2005j3230N7994
$$ 63971 17943 28756 79576 87724 75271 76543 55387 60716 43902 31897 18667 76661
15329G6661m757o944M4117P10n6050n0496L277J9125M6977P620k3336K7106l2141
$$ 76661 71904 64960 109077 109787 53737 3241 6518 25643 72620 80240 56904 84010 51869
15316E1869j6877r172K7834l2459N587R176l3457n7732K7038L1919l5260J1942
$$ 51869 34992 25820 53654 21195 26782 35958 2501 -55231 -28193 3726 -31534 -19592
15304a9592N8668n022k3057P7174N2860m6179n0743p024N1503M3199k6504m4538
$$ -19592 39076 34054 10997 88171 141031 94852 44109 37085 88588 131787 105283 60745
15292F0745j9935K7311M4908j7643k8045k861k830l1892N590M3924J2914n0240
$$ 60745 40810 68121 113029 95386 67341 64480 61650 29758 35348 79272 92186 41946
15280D1946K671J10511l1821r3534l2839m3443K5209K8638K9012N2170K8334p2088
$$ 41946 44617 155128 123307 29773 -3066 -46509 -21300 7338 36350 88520 116854 44766
15268D4766k1000N9699L8557K6764k0428k4557j4465j4571M4567j3832k6455l4711
$$ 44766 23766 83465 122022 148786 128358 103801 89336 74765 119332 105500 79045 44334
15256D4334l2030l3808k1408Q669J6792O5786O76l5045n477J0397N41j3422L2856
$$ 44334 12304 -21504 -42912 -34243 -17451 48335 49011 13966 8489 18886 19427 6005 38861
15243C8861M716N3475R897k3279m9501p3002J0755J18416l2764q121P2450j9665
$$ 38861 43577 97052 106949 83670 34169 -38833 -28078 90338 57574 49453 121903 102238
15231A02238O891O2463n3882n2887n9262N5396R4849M8016Q411K6471J5807l5421
$$ 102238 109129 171592 117710 64823 5561 60957 155806 203822 212233 238704 254511 219090
15219B19090m9048n5019k9976q930K020L1956L3728n0248J8596m645q7657l4940
$$ 219090 170042 115023 85047 76117 78137 110093 143821 93573 112169 107524 19867 -15073
15207a5073L0823K6742K5853q961k2981J9853M6557J6499l2673k8188p367M6566
$$ -15073 15750 42492 68345 59384 36403 56256 102813 119312 86639 58451 51084 97650
15195I7650K0290j5287R385M770q439l5281o4962J0617L2443j802L94N0230p623
$$ 97650 117940 102653 112038 116808 108369 73088 8126 18743 51186 49384 49778 100008 92385
15182I2385m355J6403p273j830k1317k210M3140j3459q106m9703j5550j1913M429
$$ 92385 88030 104433 97160 95330 74013 71803 114943 101484 93378 43675 28125 16212 20641
15169B0641K9347J5064J6701K5159n8102l7252K5834K3823P2267L7338l6886n5140
$$ 20641 49988 65052 81753 106912 48810 11558 37392 61215 133482 170820 133934 78794
15157G8794m49K6338K0267J3923l3430j3173K5849r061k2301N635J7981p4401
$$ 78794 78345 104683 124950 138873 105443 92270 118119 109058 86757 92392 110373 35972
15145C5972l9071j4271j535j5565O5340j0929N1142L1414p087l4756j0428j976
$$ 35972 -3099 -17370 -18905 -34470 30870 19941 71083 102497 95410 60654 50226 48250
15133D8250J7933l9010o0431m7564K353P5560K9706M8543j9984n2965L5290J3402
$$ 48250 66183 27173 -33258 -80822 -78469 -2909 26797 75340 55356 2391 37681 51083
15121E1083O0796k395m6623n1164k9747J5068K8527O1829M0747o9566n4803L4816
$$ 51083 111879 109484 62861 11697 -18050 -2982 25545 87374 128121 58555 3752 38568
15109C8568k6923P75Q315L004k0694L994L1544L6254k1460m6499P3530O5636l5042
$$ 38568 11645 12420 20735 23739 3045 7039 38583 74837 53377 6878 80408 146044 111002
15096A11002L692M781k4624n3317k2942j3251K4278N327k0658N6993N4999L7487
$$ 111002 114694 119475 94851 41534 18592 5341 29619 34946 14288 71281 126280 163767
15084A63767k1135Q48M3696l6809l1739k0779l1950K4145J5225Q987J5487K0453
$$ 163767 142632 143480 187176 150367 118628 97849 65899 90044 105269 114256 129743 150196
15072A50196m0607l1767k0352n1112K6318K1844j3665L2691j9328l5094l330M9379
$$ 150196 109589 77822 57470 6358 32676 54520 40855 73546 54218 19124 15794 65173
15060F5173K2741k707j1706k0951j6581k5510M3071j6123p058M3426L7905K0905
$$ 65173 87914 85207 73501 52550 35969 10459 53530 37407 30349 73775 111680 132585
15048A32585q1983l4993k4202J558J07230R6935m1936j1670n6141j1106k8893
$$ 132585 50602 15609 -8593 -7035 100195 197130 155194 143524 87383 76277 47384
15037D7384l7772k5967J2233K9604K429j3906l891O6608K1838j01618N871K253
$$ 47384 9612 -16355 -4122 25482 27911 14005 10114 76722 98560 -3058 2813 5066
15025E066l280r77R903m3970j3779L5801N2432M7169M3514j8550O486N8092N1659
$$ 5066 1786 809 10712 -33258 -47037 -11236 41196 88365 131879 113329 119815 177907 229566
15012B29566l7605o7391N990n3088L9717k6241J214m9155J8199J0476j6790P5166
$$ 229566 191961 124570 130560 77472 117189 90948 92162 43007 61206 71682 54892 130058
15000A30058J2466k8715m6143j1260K1832k6893k2202k4518K2759M7361k6356
$$ 130058 142524 113809 67666 56406 78238 51345 29143 4625 27384 74745 48389
14989D8389j6314Q215M4333K4155L0323k0805j9896j8325k823J1131j4271J3994
$$ 48389 32075 40290 84623 108778 139101 118296 98400 80075 77252 88383 74112 88106
14977H8106K1007j52m2653J658q654l3320j003l9634n8944M4755M6204n135R658
$$ 88106 109113 108961 66308 67966 59312 25992 24989 -14645 -73589 -28834 17370 12235 21893
14964B1893J9153K6907L6307m340n9781j515K3278m654j994m7473j5000j1639
$$ 21893 41046 67953 104260 99920 40139 38624 61902 57248 55254 7781 -7219 -18858
14952a8858m432k6285J4661J8057L3294L2746k412k8742M8755M6298M257l5399
$$ -18858 -23290 -49575 -34914 -16857 16437 49183 46771 18029 66784 113082 117339 81940
14940H1940m9112J246j7217k9885M5764j2524m6358K5268J7185J0655J0707j6393
$$ 81940 32828 34074 16857 -13028 32736 20212 -26146 -878 16307 26962 37669 21276
14928B1276L483N502O822M391K1794q332J1288L5122k1383k0934K2729k3022l8911
$$ 21276 24759 30261 37083 41474 63268 54936 66224 101346 79963 59029 81758 58736 19825
14915A9825P842j5142l7033L6858Q28m0828J9190K207l6513l9933K7350P7365
$$ 19825 27667 12525 -24508 12350 13178 -27650 -8460 -6253 -42766 -82699 -55349 22016
14903B2016j0545k2708k9115j3756j4417N4268o0072n4324R1950M7679K1102J0793
$$ 22016 11471 -11237 -40352 -54108 -68525 -14257 -74329 -128653 -36703 10976 32078 42871
14891D2871K9307L036q2872m3719M9007j9426L4419J6745P091k3640k5332L7492
$$ 42871 72178 75214 -7658 -51377 -2370 -21796 12623 29368 36459 12819 -12513 24979
14879B4979K7077J0202l8012l6390K9045Q690l2296J9632M6868J2713k6206l3054
$$ 24979 52056 62258 24246 -12144 16901 25591 -6705 12927 59795 72508 46302 13248
14867A3248k8474K4219L6614J3071p173k5471l1506q572K9019M345J3177M138
$$ 13248 -15226 8993 45607 58678 51505 26034 -5472 -14044 14975 19320 32497 36635
14855C6635J8225l792J1102l1003J1101M2453M3378k2586n3121m2923J1312j54
$$ 36635 54860 51068 62170 31167 42268 84721 128099 105513 52392 9469 20781 20627
14843B0627m6050l0085M8564j0063k5028R810N8584M3452O8145m008n8398p4614
$$ 20627 -25423 -55508 -6944 -17007 -42035 -32225 26359 69811 137956 133948 75550 936
14831I36m542N2633K5638L7302l8952k2947L8304K273l3348l9770R77K4003j003
$$ 936 -3606 49027 74665 111967 73015 50068 88372 90645 57297 17527 18504 42507 41504
14818D1504N860P8781k0821k9667R294K6573O0183N7607o3588m6282k3518r021
$$ 41504 47364 126145 105324 75657 84951 111524 171707 229314 165726 119444 95926 86905
14806H6905r306k7966o098K5354K5022l3104L5831n2221l8709P5542L5833J6531
$$ 86905 77599 49633 43535 68889 93911 60807 96638 44417 5708 81250 117083 133614
14794A33614j5193l1626N383M331n9738K645R1691M511p3075n7334L6234O3766
$$ 133614 118421 86795 92178 96509 36771 39416 131107 135618 62543 5209 41443 105209
14782A05209M106p1546n3179L5122L6347qO805O802k7058m3593m098L1089L8260
$$ 105209 109315 37769 -15410 19712 56059 56051 62856 69658 42600 -993 -5091 25998 64258
14769F4258k3058k0736o3125l3035N6954K0346j7357K0417L7902j7486J0541q50
$$ 64258 41200 20464 -42661 -75696 -18742 1604 -15753 4664 42566 25080 35621 34771
14757C4771L325j2577Q137L9471K127N310O6520N714J106l7474o8244j2921J8483
$$ 34771 38096 25519 33656 73127 75254 80564 147084 152798 153904 116430 48186 35265 53748
14744E3748l69J9028q1392l5125M1631L2423J434J6445P7251o4104k0446N6349
$$ 53748 53379 72407 -8985 -44110 -2479 29944 31378 47823 125074 60970 40524 96873
14732I6873L6433k3317o7964j4856K6633L2123l9768J8731M0011O310l8833j3067
$$ 96873 133306 109989 42025 27169 53802 85925 46157 64888 104899 111209 72376 59309
14720E9309m6147J4612K9944p8078J6648P5476M1547j3639l0548j3098n061p0774
$$ 59309 13162 27774 57718 -20360 -3712 71764 113311 99672 69124 56026 50965 -19809
14708a9809k6170O810M2151Q823j5306M8747j3623l0885k9387L4628O2334J7957
$$ -19809 -45979 -39169 2982 11805 -3501 45246 31623 738 -28649 5979 68313 86270
14696H6270K4518o4283o3168j6851K8283L7617r441n691n927O2995M741o4327
$$ 86270 110788 46505 -16663 -33514 -5231 32386 22945 17254 11327 74322 79063 14736
14684A4736M9245N8286l8958j9090L7707j1454l5410J7209j0815K2007j111O348
$$ 14736 63981 122267 83309 64219 101926 90472 55062 72271 61456 83463 82352 88700
14672H8700K0651J1987p104o8068j228J7747J2577L5286L1268J1498k5855o135
$$ 88700 109351 121338 114234 46166 44938 62685 75262 110548 141816 153314 127459 121324
14660A21324k0415J0263j3398m2492m766K3068K7545J7416L175j1939N8508K9275
$$ 121324 100909 111172 97774 55282 50516 73584 101129 118545 121720 109781 168289 197564
14648A97564n9017j7885m67l9054K2757L7655K7706j6296p2104n5771m208p435
$$ 197564 138547 120662 120195 81141 103898 141553 169259 152963 80859 25088 20880 13445
14636A3445o7M4501J4500K9319J8672l1369l6956p340L8837L6551p3620o7663
$$ 13445 13378 57879 72379 101698 120370 89001 52045 44705 83542 120093 46473 -21190
14624b1190L27J8232M1602L3011j4499j9545j0695N6487O634k1439m7459L2093
$$ -21190 -20863 -2631 38971 71982 57483 37938 27243 83730 90364 68925 21466 53559
14612E3559M9036K2227q655n080k4198n747M3269K3414j0287J9025P2115M373
$$ 53559 102595 124822 116167 111087 86889 81142 124411 147825 137538 156563 228678 233051
14600B33051o6562K799j1129k1156m195l9579P03L7496m253r645l4895j3336k0281
$$ 233051 166489 169288 158159 137003 132808 93229 93932 131428 127175 117530 82635 69299 49018
14587D9018J5028K4504O3160k9324k7177J674j9864K5210L289K3346J4748J9767
$$ 49018 64046 88550 151710 122386 95209 96883 77019 102229 105518 128864 143612 163379
14575A63379o4441j2862k7740k2175j4370j3200l0464l5918M9257O7644J9739
$$ 163379 98938 86076 58336 36161 21791 8591 -21873 -57791 -8534 59110 78849
14564G8849l1632q2721k3482L6119j1228P4279L2126K7863J2486p4869R900L3116
$$ 78849 47217 -35504 -58986 -22867 -34095 40184 72310 100173 112659 37790 47690 80806
14552H0806J6768o5004l8872l5204J4558q954P5664M2664O326j634N2807M7628
$$ 80806 97574 32570 -6302 -41506 -26948 -35902 39762 82426 88752 87118 139925 187553
14540A87553k4797j9794l075k2442m5584m1813O64J0006M7258K2865k5102j4573
$$ 187553 162756 142962 139887 117445 71861 30048 30712 40718 87976 110841 85739 71166
14528G1166J156j9186J1981J6256J7460P841m7145K2636J4008j2728o3413o1306
$$ 71166 72322 53136 65117 81373 98833 106674 59529 82165 96173 83445 20032 -41274
14516d1274O431K7281L0707M0886j0o696k5165o352M7781Q386n7581k5646K7599
$$ -41274 -34843 -7562 23145 64031 64021 57325 32160 25808 73589 81975 24394 -1252 26347
14503B6347J3930O3698M2930l4741n2323l0199O841j9332p530K959L1278O002
$$ 26347 40277 103975 146905 112164 59841 29642 36483 17151 9621 12580 43858 49860
14491D9860n7610J8708L6049J1473J6854L270M7768l185n2319k2928J8676j2717
$$ 49860 -7750 10958 47007 58480 75334 78604 126372 123187 70868 47940 66616 53899
14479E3899M352J2998m938J2463K813q198J4848J1270j6304o0789k5963l613Q717
$$ 53899 58251 71249 66311 78774 81587 73389 88237 99507 83203 22414 -3549 -7162 1555
14466A555M9095l193k778Q7302O708p8047L032O5975l1305J1420P1896l5404k5549
$$ 1555 50650 47457 44679 131981 138689 60642 63674 129649 98344 109764 181660 146256 120707
14453A20707m1267k1799m609N5046M5342K6760j7097o1975n3250M4849K3884l4940
$$ 120707 79440 57641 53032 108078 153420 180180 163083 101108 47858 92707 116591 81651
14441H1651k6453j7042p300L5788L4674k7977o0693J683P4620L3685q2356j2106
$$ 81651 55198 38156 30856 66644 101318 73341 12648 14331 88951 122636 40280 28174
14429B8174k252j3193k257J4579O0147j0756l5550M380M3017L0256J8378M0671
$$ 28174 25922 12729 10472 25051 85198 74442 38892 43272 86289 116545 134923 175594
14417A75594J1222k7465o8067J0056l4751K3379K5450j3878L3136J3121m9643
$$ 175594 186816 159351 91284 101340 66589 89968 115418 101540 134676 147797 98154
14406I8154o9930k5413l8469L3865N9144M0118L7539k2070p5895j4675J2423J8648
$$ 98154 28224 2811 -35658 -1793 57351 97469 135008 112938 37043 22368 34791 53439
14394E3439M9305l5421k9055K799J6350j3376J1256N3937j5340m9812M5727J2110
$$ 53439 102744 67323 38268 41067 57417 44041 55297 109234 93894 44082 89809 101919
14382A01919M6702R387m8850o144l830N2561L3245k3893m2187Q606j7394P431
$$ 101919 148621 158008 109158 103014 99184 151745 184990 161097 118910 127516 110122 117553
14370A17553R472M008k9157l7600K4703J1750J0025M4533J6447p6166q9947j4907
$$ 117553 127025 131033 101876 64276 88979 100729 110754 155287 171734 95568 5621 -9286
14358i286J1953O3729O5182L3391l9949j266K6887K3307l8103n413j536M7305
$$ -9286 2667 66396 131578 164969 125020 123754 150641 173948 135845 130432 128896 176201
14346A76201K4822j7018m1688k402k0944o8318k3094N1464J446K6423k2534m6622
$$ 176201 201023 184005 142317 139915 118971 50653 27559 79023 80469 106892 84358 37736
14334C7736n603P4224N9797l7094r4004n3719L4524J0195K1498O4636N1649m8044
$$ 37736 32133 106357 166154 129060 35056 -18663 15861 26056 47554 112190 163839 115795
14322A15795p545j5163L6554J6360O097L4608K9749o5366n0819o7080p195M0327
$$ 115795 108250 93087 129641 146001 152098 186706 216455 151089 100270 33190 25995 66322
14310F6322L4756J8759J1299P093R425m6518r0353j0860R9947M5505j8734J1530
$$ 66322 101078 119837 131136 138229 147654 101136 10783 -77 99870 145375 126641 138171
14298A38171m6793m8308n3108j3863J3796M0973j0455j0702k6662k3834L176O4151
$$ 138171 91378 43070 -10038 -23901 -10105 30868 20413 9711 -16951 -40785 -37609 26542
14286B6542J7665J4239j2798J0521j0279N7541k2898q4382Q517J3360j1636L006
$$ 26542 44207 58446 45648 56169 45890 103431 80533 -3849 4668 18028 6392 9398
14274I398J9813N2028J7711l8144K0583L9704k0240j0884m5201J0212N5441N36
$$ 9398 29211 81239 98950 60806 81389 121093 100853 89969 44768 54980 110421 110957
14262A10957K37J0944n5059o2420m682M7614j2526q917o0103J4221L0989p159
$$ 110957 111194 122138 67079 4659 -23 47591 35065 26148 -33955 -19734 11255 4096
14250D096j2932L9803J4841K5264l912J3602L1317l4441m0367K9573K5087K8151
$$ 4096 -8836 30967 45808 71072 67160 80762 112079 77638 37271 66844 91931 120082
14238A20082k6818m5677l1243m7853K5053K5575O4557P2228q592O0m0810L218
$$ 120082 93264 47587 16344 -31509 -6456 19119 83676 155904 147312 147372 106562 109780
14226A09780N884m0545K0861J672m7780l3425J2203j7574j022k616N9194M2534
$$ 109780 115664 75119 95980 97652 49872 16447 28650 11076 10054 7438 66632 109166
14214A09166J4983j7022k7355q467l1507n925J2164j2035M373O91J1625N1873
$$ 109166 124149 107127 79772 71305 39798 33873 46037 34002 38375 39066 50691 102564
14202A02564k437l4871L8583K0111j4709m2013o4799M813L7628L2502m001k3992
$$ 102564 100127 65256 103839 123950 109241 67228 2429 7242 44870 77372 73371 49379
14190D9379k0897N079Q5422M436o482L1608n4811m2376j8831l2018L5633M6071
$$ 49379 28482 33561 118983 123419 116937 148545 93734 51358 32527 509 36142 82213
14178H2213K605j46j3175k2675L496M1553q542j6077K345L8014j1515j8387j5407
$$ 82213 84818 84672 71497 48822 52318 93871 85329 69252 71597 109611 98096 79709 64302
14165F4302J3734K64N7811L2691m3685m3804q578P670k4794k4618L829P8069L103
$$ 64302 78036 78300 136111 168802 125117 81313 72735 80405 55611 30993 34822 112891 115994
14152A15994n8714K4119J0847m5209Q4O20N0929O0672N9409o3005n0465M8842
$$ 115994 57280 81399 92246 47037 47121 47741 98670 159342 218751 155746 105281 154123
14140A54123q905r8168J0532K6080j2227J1106J4232l6886j5874L0458K3495j6199
$$ 154123 145218 47050 57582 83662 71435 82541 96773 59887 44013 74471 97966 81767
14128H1767m6406m085L3507K7283O0719L0059l22l5310m1964M412m940k0625K6741
$$ 81767 35361 31276 64783 92066 152785 182844 182522 147212 105248 109660 104720 84095 110836
14115A10836P3856L569l4414k9394M3647L6869k4174k13K1819o9724k0210m661
$$ 110836 184692 188261 153847 124453 168100 204969 180795 180582 202401 132677 112467 107806
14103A07806L616L9216P1549J6669j7757l154k2040l0370k4309n2183k872O0094
$$ 107806 111422 150638 222187 238856 221099 217945 195905 165535 141226 89043 86171 146265
14091A46265J498l3834n9838k2208O3891N8370m3447J987P6984J06514K7482m5037
$$ 146265 147763 113929 54091 31883 95774 154144 110697 112684 189668 296182 323664 278627
14079B78627m10o4086n5957M4389r784l1869j0817p165m9936j15624k7816J8784
$$ 278627 278217 214131 158174 202563 192779 160910 150093 142928 92992 -22632 -50448 -31664
14067c1664M3164N6953n705k6757n595J3121K4801M4746L6758k3222j0031n094
$$ -31664 11500 68453 62748 35991 30396 43517 68318 113064 149822 126600 116569 111475
14055A11475j1453K1747q983j2939K3183l5201k3009J2916J0909P98J1255O8792
$$ 111475 100022 121769 112786 99847 123030 87829 64820 77736 88645 89443 100698 169490
14043A69490J2996m5320l826j1427j0580K1862p778L7729j2851j6924m8690L925
$$ 169490 182486 137166 133340 121913 111333 133195 125417 163146 150295 133371 84681 88606
14031H8606J2901J4258k5220j4830O2058K4616K5043k0189k6802j1963L0284M0783
$$ 88606 101507 115765 90545 75715 137773 162389 187432 167243 140441 128478 158762 199545
14019A99545o8340k9274j7545l0556N7762L0346m2836o9894j8267Q1461L0443
$$ 199545 131205 101931 84386 53830 111592 141938 99102 29208 10941 92402 122845
14008A22845j9222p0805J7963L3260k8762j8702N224K1909P3404O5298P295j2606
$$ 122845 103623 32818 50781 84041 55279 36577 41801 63710 137114 202412 209707 197101
13996A97101l6742k5630K3670N5928M132j4611n683K2089K1362L5745M358J833
$$ 197101 160359 134729 158399 214327 218459 203848 198165 220254 241616 277361 281719 283552
13984B83552p9914R844J7640j3703o8883m1604O9319L4500k3334l1030j9043J1905
$$ 283552 203638 213482 231122 217419 148536 106932 176251 210751 187417 156387 137344 149249
13972A49249M3320L352k7723k3593k5753l6144N5079J4563l733j9269m2779K184
$$ 149249 192569 195921 168198 144605 118852 82708 137787 152350 148617 129348 86569 88753
13960H8753O9985N3656j3314l4244k465m054k7218n288l9594p6946J1870L8657
$$ 88753 158738 212394 199080 164836 162371 158317 131099 125811 86217 9271 21141 59798
13948E9798N2036M6684j5171P0292k234O353k244o0072L9156J3716J9059o781
$$ 59798 111834 158518 143347 213639 211405 217758 215514 155442 194598 208314 227373 220592
13936B20592m5650J5592K9732l8078n0346m974j651o4673o1718M1476M1693J565
$$ 220592 174942 190534 220266 182188 131842 126868 125217 60544 -1174 40302 81995 83560
13924H3560p264J4047m0286L2565N802M0850j6774o5236n3480R3343K7808k50
$$ 83560 76296 90343 50057 82622 88424 129274 112500 47264 -6216 87127 114935 114685
13912A14685k499K6671l5001n1989l2184N1258L9315J9129J8276k9153K2859j3883
$$ 114685 112186 138857 103856 51867 19683 70941 110256 129385 147661 118508 141367 127484
13900A27484J6105k189k6831k8440l7724J153L9777K3618K1590J0215L6091M3607
$$ 127484 143589 141400 114569 86129 48405 49558 89335 112953 134543 144758 180849 224456
13888B24456j0339q788k8040m1251j3991N782J4593k01Q999j1627l2891K8405
$$ 224456 214117 205329 177289 136038 122047 127829 142422 142221 151220 139593 106702 135107
13876A35107m5389m6432k4306J1773M6683L8839k469L0561l57J4062l193l983
$$ 135107 89718 43286 18980 30753 77436 116275 113806 144367 144010 158072 154879 150896
13864A50896m7746n470K582K3605K6445k3641r9132p4699L1502N5206j7739O9798
$$ 150896 103150 97680 100262 123867 150312 126671 27539 -47160 -15658 39548 21809 91607
13852I1607O8475L055j4209L2764m5769p2007l6286J8103J9434J6377j5798k9035
$$ 91607 160082 163137 148928 181692 135923 63916 27630 45733 65167 81544 65746 36711
13840C6711K0409k3076L7034K5426K4524O0252l6066l8182L7874K0354K5793k058
$$ 36711 57120 34044 71078 96504 121028 181280 145214 107032 144906 165260 191053 188995
13828A88995l1343K0891J2742J5966K8584M4202r2888j8783K2608m0929j6461
$$ 188995 157652 178543 191285 207251 235835 280037 187149 168366 190974 150045 133584
13817A33584J0373L7515K135m9115n5176L552J03127q913l8270n72L1092J1497
$$ 133584 143957 181472 183607 134492 79316 82868 185995 177082 138812 138240 169332 180829
13805A80829k6387k547L8931k9073o1159p440j7623K2313J1148k0179M8418N1045
$$ 180829 154442 151895 190826 161753 100594 93154 75531 97844 108992 88813 137231 188276
13793A88276r707o790k1175l7913O7601K1160l1538m9701n1509J902J0183K4394
$$ 188276 178569 171779 150604 112691 180292 201452 169914 120213 68704 70606 80789 105183
13781A05183K0765L0685J2539p3448N3306M9318J4405l0774m2397l5580k2647
$$ 105183 125948 156633 169172 95724 149030 198348 212753 181979 139582 104002 81355
13770H1355K2871J6630N1203q1201q3343o31L8154J2935J0145M5439q991L7064
$$ 81355 104226 120856 172059 90858 7515 6884 45038 57973 68118 113557 104566 141630
13758A41630N4420K2750n9199k1655o2766j0944N0720J1629L1149N069l4634l2016
$$ 141630 196050 218800 159601 137946 75180 64236 114956 126585 157734 162803 128169 96153
13746I6153M6764j5130k4571J0774n2448K0393K5901J0910L393M6099l942j11162
$$ 96153 142917 127787 103216 113990 61542 81935 107836 118746 122139 168238 164296 53134
13734E3134l0181K4301K7034P157O0203N9618o1723l5063N9261J4296o298k4563
$$ 53134 22953 47254 74288 81445 141648 201266 139543 104480 163741 178037 171739 147176
13722A47176R062j5867l2543L5665r058j035K6043L9442K5597L4272P1389j5083
$$ 147176 156238 140371 107828 143493 134435 133400 159443 198885 224482 258754 330143 315060
13710C15060j3979m00M4979N5039P0905J26409j7938m7801m6758l9446o2722o9263
$$ 315060 301081 300681 345660 400699 471604 598013 580075 532274 485516 446070 383348 314085
13698C14085o8651M8167K7315Q933m4415p3698m0323l0321j2693L7608L5018m383
$$ 314085 245434 293601 320916 329849 285434 211736 171413 141092 128399 166007 201025 196642
13686A96642o463P568M965q951m6313j4406K8000K8170M495l150J464J7482Q463
$$ 196642 190179 197747 202712 193761 147448 133042 161042 189212 193707 190557 192021 209503 217966
13673B17966j624L4697O4679K3170J0579M6809J9777Q0624R5951R6283J35514
$$ 217966 216342 251039 315718 338888 349467 396276 416053 496677 592628 688911 824425
13662H24425J59812J66670K10130J53548k4329q2435j98723j96612j95444k02288
$$ 824425 984237 1150907 1361037 1514585 1490256 1407821 1209098 1012486 817042 614754
13652F14754j03281k2788o1106j9668L6891o1377n1282n9289k168L6116L9491
$$ 614754 511473 488685 427579 407911 444802 383425 332143 272854 270686 306802 346293
13641C46293p134j0133l0318o6316j5011O007L0477L8243J1663k7795k1966j7061
$$ 346293 339159 329026 298708 232392 217381 223388 253865 292108 303771 275976 254010 236949
13629B36949M9369M1797K2999L3819o229l1927L0071M7163Q9141J06642J23711
$$ 236949 286318 328115 351114 384933 378704 346777 376848 424011 513152 619794 743505
13618G43505J44786J88215K07118J44331K9181q135j00607j78474j95197k00038
$$ 743505 888291 1076506 1283624 1427955 1457136 1449001 1348394 1169920 974723 774685
13608G74685j05030j34421r8082k6165n4742l428M7232o0925j8831k3547j1081
$$ 774685 669655 535234 437152 410987 356245 352817 400049 339124 320293 296746 285665
13597B85665k9395O198L683n572L020N0949k0716j0507p530L7358j3360m2690
$$ 285665 256270 262468 266151 260579 263599 314548 293832 283325 275795 313153 299793 257103
13585B57103J9138N265l0734L9671L9271J7878L7150L840L5210k1002K8242L1222
$$ 257103 276241 281506 250772 290443 329714 347592 384742 388582 423792 402790 431032 462254
13573D62254J29915O3157k9328M171k1958k3325k391l4315m2697j00080l5026
$$ 462254 592169 655326 625998 630169 608211 584886 582495 548180 505483 405403 370377
13562C70377n5106k4006l1869O3159K1779o0003m1437K5227n111k0669K0878k376
$$ 370377 315271 291265 259396 322555 344334 284331 242894 268121 263010 242341 263219 260843
13550B60843j6478j8319J3220J9543J4783n8409J3O0182K2904k0429l5775r8754
$$ 260843 244365 226046 239266 258809 273592 215183 215196 275378 298282 277853 242078 143324
13538A43324j3947N501M000k7416m1416R285O6060J900J5277J5432j9576m953
$$ 143324 129377 134878 138878 111462 70046 79331 145391 147291 162568 178000 158424 153471
13526A53471K055N7001N4926Q33K3960j5014k6695o0262l1560J8411K5531K2929
$$ 153471 155526 212527 267453 268286 292246 277232 250537 190275 158715 177126 202657 225586
13514B25586q998k1664J9744M2213k5563p4J3817Q874N042l30N704n6189l3787
$$ 225586 216588 194924 214668 256881 231318 231244 245061 253935 258977 258647 264351 208162 174375
13501A74375j1587l4842j9934Q8281M4240q793j4544o2743p179k0816M5124L045
$$ 174375 162788 127946 108012 196293 240533 231740 217196 154453 147274 126458 171582 174627
13489A74627m9493k4048J00973N819j2121J051M1765L7552j1803j18854r094r668
$$ 174627 125134 101086 202059 207878 195757 196808 238573 276125 264322 145468 136374 126706
13477A26706J5389N8352N1050N0949l420n9636j44766j1235N1967J9630j1509
$$ 126706 142095 200447 251497 302446 299026 239390 94624 83389 135356 154986 143477
13466A43477l6745K6767L0472M3258j581Q963M7957J5114M72n4169J1660j3503
$$ 143477 106732 133499 163971 207229 205648 214611 262568 277682 278154 223985 235645 222142
13454B22142j7480M1482J642m198l317k7227m1492l3406k5646j5795Q551N3842
$$ 222142 204662 246144 247786 243588 240271 213044 171552 138146 112500 96705 105256 159098
13442A59098O3048L0293M741p23k3060k7684J6153O998O986J3685N0093l229j4679
$$ 159098 222146 252439 257180 256457 233397 205713 221866 228864 235850 249535 299628 296399 281720
13429B81720l3458n9335k7636l2593P3813L5066n5803j1664L0519K8186J1176
$$ 281720 248262 188927 161291 128698 202511 237577 181774 170110 200629 228815 239991
13418B39991J1680J9048J5309q374n2415q72k5425j6481k0169O9597J980k2878
$$ 239991 251671 270719 286028 277654 225239 224367 198942 182461 162292 231889 233869 210991
13406B10991K5970n154l9024m5242k216o341N5697J5041J5995J0334L6578K9721
$$ 210991 236961 231807 192783 147541 145325 138984 194681 209722 225717 236051 272629 302350
13394C02350m3975j154K6176R681k0530L7289P323l33j5408j2642L441J0382J9473
$$ 302350 258375 257221 283397 293078 272548 309837 317160 316827 301419 288777 292218 302600 322073
13381C22073L143k4998l6814k4634M2840l5446M8907J7325j718j4524o0504l9827
$$ 322073 325216 300218 263404 238770 281610 246164 295071 312396 310678 296154 235650 195823
13369A95823L8311J7807K5977J7660j404J3457J6378L2325n1251j6487K2435j7908
$$ 195823 234134 251941 277918 295578 294174 307631 324009 356334 305083 288596 311031 293123
13357B93123k633K9361r681M571J0356j1L9159J2888r0935p4579J1221K3627j2154
$$ 293123 290490 319851 310170 314741 325097 325086 364245 377133 286198 211619 222840 246467 234313
13344B34313k0864M5048J4374j8976L238j8194J4226j7711O8982Q2311j3295m6992
$$ 234313 213449 258497 272871 253895 257133 238939 253165 235454 304436 386747 373452 326460
13332C26460m2153L787R0554O8461k2440J7456P077m0354m3671K0767N4479Q4941
$$ 326460 284307 288094 378648 447109 424669 442125 449202 408848 365177 385944 440423 525364
13320E25364L9761M3606N0296m1459K2214J9420M8187P3963L0539J9119m4288
$$ 525364 565125 608731 659027 617568 639782 659202 707389 781352 811891 831010 786722
13309G86722q0007j8053n5076m5909o8296m6353J5150J3103n858k7381m1860o838
$$ 786722 706715 688662 633586 587677 519381 473028 488178 501281 495423 468042 426182 419344
13297D19344N706M753N8042J3086n8474o1928K4225O8375P6550M8490N1095N2820
$$ 419344 425050 429803 487845 500931 442457 380529 404754 473129 549679 598169 649264 702084
13285G02084q314p2083M193o03L118J9375R125n2100J7015R3311Q5473k025M5134
$$ 702084 693770 621687 625880 625277 628395 647770 656895 604795 621810 715121 800594 798569 843703
13272H43703J45841J38251J50418K29408J90797J07774j4108j85853k41915j40251
$$ 843703 989544 1127795 1278213 1507621 1698418 1806192 1792084 1606231 1364316 1224065
13262A224065j13497j10987p0236n6120m6806o5139n2736p4118m9097K4898k1578
$$ 1224065 1110568 999581 929345 873225 826419 761280 708544 634426 585329 610227 588649
13251E88649K033M2807K4407J92J256R580p410l9652K7726k3820J2707p340J4404
$$ 588649 590682 633489 657896 658088 659344 668924 661514 621862 649588 625768 638475 631135 645539
13238F45539k9267o2275j922J8371N5092O2526K3857n1247j954O1621J06034J98192
$$ 645539 616272 553997 552075 570446 625538 688064 711921 660674 658720 720341 826375 1024567
13226A024567J46412J65251K52087J96388J10773r0218j44784j86048j85346j69255
$$ 1024567 1170979 1336230 1588317 1784705 1895478 1805260 1660476 1474428 1289082 1119827
13216A119827j74082q6545l4136q7392k3488K3821m5209m9187l7757J8747r577
$$ 1119827 945745 859200 825064 737672 714184 738005 692796 643609 605852 624599 615022
13205F15022m7452l5482k6015L0000L0727p511o5114o0402o06O1453L0168j1181
$$ 615022 567570 532088 506073 536073 566800 559289 494175 433773 433167 494620 524788 513607
13193E13607J0941m7164l0412l3087M2698Q4442O744j7865k4980M1111K7532P9282
$$ 513607 524548 477384 446972 413885 456583 541025 547769 529904 504924 546035 573567 652849
13181F52849J05434O4898P692N6101J3520l8203q312o7435r6765m7104o2935n4873
$$ 652849 758283 823181 830873 886974 900494 862291 853979 786544 689779 642675 579740 524867
13169E24867j9438p641M2086l2293o0021j5470J6839L9592k2721k7108l7777L424
$$ 524867 505429 497788 539874 507581 447560 432090 448929 488521 465800 438692 400915 404339
13157D04339j290O85j9840l4273m6143K0275P8019l2192m3491k2468J2086N5160
$$ 404339 403049 403734 383894 349621 303478 323753 401772 369580 326089 303621 315707 370867
13145C70867K2340j2532j5740L9931L0853l3142J3106Q847k4180l0195Q324l793
$$ 370867 393207 380675 364935 404866 435719 402577 415683 424530 400350 370155 378479 374686
13133C74686L3015J4252n3062J7697j0594l9631K1190r05m7696R614N208k451
$$ 374686 407701 421953 368891 386588 375994 336363 357553 356648 308952 318566 323774 321323
13121C21323j6108m8428j9576N8619M0652l9118l1216R730J392k190L3025j0875
$$ 321323 305215 256787 237211 295830 336482 297364 266148 275878 277270 275080 308105 297230
13109B97230K5018m1060N477p024M6201k1557m5154J2574K9001P0894p542j7664
$$ 297230 322248 281188 286665 279641 325842 304285 259131 271705 300706 371600 364058 346394
13097C46394k3063q333L7501M8093p5558J461O363l6092L29L1221L9442j0304
$$ 346394 323331 314998 352499 400592 325034 326495 332858 296766 297095 328316 367758 357454
13085C57454q939j0722K1247j6536M822K5113K832k2566K0433j3130j0924J6981
$$ 357454 348515 337793 359040 342504 347326 372439 375271 352705 373138 360008 349084 366065
13073C66065k7389J7239l3600j1353K126m1058m8675J5517O3055J682n5856O097
$$ 366065 338676 355915 322315 310962 313088 272030 223355 238872 301927 303609 247753 253850
13061B53850M377J3046l4047M0378O2370m328q944J5146j071L4419j2779J4146
$$ 253850 258227 271273 237226 277604 339974 335646 326702 341848 340777 375196 362417 376563
13049C76563l0563R472j2665O752o1646J8918M8752l0508K6367L1744r4767p0271
$$ 376563 346000 355472 342807 349559 287913 306831 355583 325075 351442 383186 288419 218148
13037B18148L5888M2638k5194Q059J3663K574J5806J0371L3591M8881M9955L4155
$$ 218148 254036 296674 271480 279539 293202 295776 311582 321953 355544 404425 454380 488535
13025D88535J4851J2670K5150j3757l5239o0543Q413J1899J6208L7149K0542k2899
$$ 488535 503386 516056 541206 527449 492210 431667 440080 451979 468187 505336 525878 502979
13013E02979n6299n6499k5126l2555q855L2320j4606J7422l8570n3313J9972M9852
$$ 502979 446680 390181 365055 332500 323645 355965 341359 358781 320211 266898 286870 336722
13001C36722K7813P9980P5990r900o0761j08127k2697m725N637K1111L7770L2282
$$ 336722 364535 444515 520505 510605 449844 341717 319020 314295 319932 341043 378813 411095
12989D11095n217j5817p732R173j4573k9557J6744K7424N0781l3256J818K0880
$$ 411095 405878 390061 382329 391502 376929 347372 364116 391540 442321 409065 410883 431763
12977D31763J8909n3107l6905N746l6885K1923N3123k945j9385J1565N3763l4499
$$ 431763 450672 397565 360660 366406 329521 351444 404567 401622 382237 393802 447565 413066
12965D13066p8298j4634N5354k3393k1389K4761l24k2688m5401J6057m018j6050
$$ 413066 334768 320134 375488 352095 330706 355467 355143 332455 287054 303111 299093 283043
12953B83043J9198L4065J6500M317m9165J3180K5568m2958K4159K7498O6518M942
$$ 283043 302241 336306 352806 357123 307958 321138 346706 303748 327907 355405 421923 426865
12941D26865n0151l4824j7219r846j4887M4096k0324J9120K0208N980k3008K7953
$$ 426865 376714 341890 324671 314825 299938 344034 323710 342830 363038 369018 346010 373963
12929C73963L8503j0597K3920n4691n8958k6770R60K9895J4521K6080n852n0898
$$ 373963 412466 401869 425789 371098 312140 285370 286330 316225 330746 356826 350974 300076
12917C00076J5854M6124m513N3918k1403j8920l0413k0857M8477k371n8992J3477
$$ 300076 315930 362054 357541 411459 390056 371136 340723 319866 368343 365972 306980 320457
12905C20457O2408L9966J8856m0294k5391k6226p953J2456L9103M3560M3822j9977
$$ 320457 382865 422831 441687 401393 376002 349776 341823 354279 393382 436942 480764 460787
12893D60787k5777n5971l2495J3988n325N3977M3889j9313J9405L6047m2294j4684
$$ 460787 435010 379039 346544 360532 355207 409184 453073 433760 453165 489212 446918 432234
12881D32234l958O25k7362k2504m2741L3970m001o4254m3556p442p040L9393L2653
$$ 432234 428276 428901 401539 379035 336294 370264 366263 302009 258453 251011 243971 283364 316017
12868C16017j3827J4738J3476M5077K6238k9354K948k9439p861K8358L6890J3638
$$ 316017 302190 316928 330404 375481 401719 372365 375313 345874 338013 366371 403261 416899
12856D16899l570J1028J0694l2789l6286q85P5292j0914m955p1193j1987k71p48
$$ 416899 413329 424357 435051 402262 365976 365091 440383 429469 424514 353321 341334 341063 340315
12843C40315j7937k8331P501l071N5263M0432N094M8431n217o2691k2357n432
$$ 340315 322378 294047 301548 298477 353740 394172 399266 447697 442480 379789 357432 352000
12831C52000K3366L9872K4008q082k6615j4294l060J7420K26K5507k8927q0530
$$ 352000 375366 415238 439246 431164 404549 390255 387195 404615 404841 430348 401421 320891
12819C20891J7149O0556r592q2672j6156M2300L9817k690k4581K4327J9758L4292
$$ 320891 338040 398596 389004 306332 290176 332476 372293 369603 345022 369349 389107 423399
12807D23399J8904j8692J2068j2564k6730L2880K8534j6242n9542l6010M3507
$$ 423399 442303 423611 435679 423115 396385 429265 457799 441557 382015 346005 389512
12796C89512L8249n362l5966m2489L0234L1043j9378J4181R857Q115J7280K0938
$$ 389512 427761 422399 386433 343944 374178 405221 385843 400024 409881 417996 435276 456214
12784D56214q0729j9494O5310L663m1781k833K6245K3386N6920K5158J5850m2417
$$ 456214 375485 355991 421301 424964 383183 380350 406595 429981 486901 512059 527909 485492
12772D85492j08455o2794P6154J5547j6852m864K4033q535N2864j3385l1432j0280
$$ 485492 377037 314243 390397 405944 389092 384228 408261 399726 452590 439205 407773 397493
12760C97493J6464k459L0615J3543j8534L6421O2220M3014k8729o6787o3030K1599
$$ 397493 413957 411498 442113 455656 437122 473543 535763 578777 550048 483261 420231 441830
12748D41830j1435m9678M431K2033L0171J2734L9946j995o5260m7525J7284N3247
$$ 441830 430395 380717 385148 407181 437352 450086 490032 488037 422777 375252 392536 445783
12736D45783L0140m886k859r895J0565k5599l722L030K0165O6637j9518k6016
$$ 445783 475923 471037 468178 458283 468848 443249 439527 442557 462722 529359 509841 483825
12724D83825k251L5684K9334J3514m033j5500j5870l3103p9401j0839O4933M5804
$$ 483825 481574 517258 546592 560106 556073 540573 524703 491600 412199 401360 466293 512097
12712E12097k3532m1698p306K8103J6964k1324l5848J0974L4519m720m3823l9401
$$ 512097 488565 446867 439561 467664 484628 463304 427456 438430 472949 468229 424406 385005
12700C85005K5125K1923K3879j8217k5129k6728m284J2325K7869M1790O3944m1173
$$ 385005 410130 432053 455932 437715 412586 385858 381574 393899 421768 463558 527502 486329
12688D86329n876K6796j3870J5173J1471r652n4048L4622J4457O6388N371o2482
$$ 486329 480453 507249 493379 508552 520023 510371 456323 490945 505402 571790 577161 514679
12676E14679o7060K1644K3507P1087j9960o0477L6254o312k7969K7324J3698p710
$$ 514679 447619 469263 492770 563857 543897 483420 519674 513362 485393 512717 526415 518705
12664E18705M2135K8814l6131k6224n918J0313n4013l7706l0553k3067k1697M8630
$$ 518705 560840 589654 553523 527299 521381 531694 477681 439975 409422 386355 364658 413288
12652D13288j3028P31K8251K0821p82m736k6631J1582J8921J9016M7856N4110
$$ 413288 400260 400991 429242 450063 449281 444545 417914 429496 448417 467433 515289 569399
12640E69399K9353k2469n1605J9414O6423K5936o5126k8850Q177m4817J0948Q2807
$$ 569399 598752 576283 524678 544092 610515 636451 571325 542475 550652 505835 516783 599590
12628E99590N6989k1518k0061k3023l3849K9088k0899o726M147m1407k1681K4766
$$ 599590 656579 635061 615000 591977 558128 587216 566317 559591 563738 522331 500650 525416
12616E25416Q2868J3075k8125k6602J3301Q187j795j6789r55q362l6645j0172
$$ 525416 608284 621359 593234 566632 579933 588120 586325 569536 568581 560219 523574 513402
12604E13402O6718J1368L550n435K9410N6256J677n9039j3230k9030p454k712
$$ 513402 580120 591488 595038 589603 619013 675269 676946 617907 604677 575647 568193 565481
12592E65481K3391P876m0815k8851J0498M742K4957R832o2065L2606O5767j8604
$$ 565481 588872 596748 555933 527082 537580 542322 567279 577111 515046 547652 613419 594815
12580E94815j8425O8581J5625p787j8151p2785n6147N8698L7184P4821L3153m7145
$$ 594815 576390 644971 660596 652809 634658 561873 505726 564424 601608 676429 709582 662437
12568F62437q3410o1463J4179k518j6883M400M6954N6557J0109p888O9941M7164
$$ 662437 579027 517564 531743 529225 512342 516742 563696 620253 630362 622474 692415 739579
12556G39579j1838l6570m4112q773Q46n653o928k2523l2993j0253j0894K2632
$$ 739579 727741 691171 647059 638286 639132 633479 626551 604028 571035 560782 549888 572520
12544E72520M3921L5119n443L1949q297j2357j862l3600j8820K0369P168J4694
$$ 572520 616441 651560 646117 678066 669769 657412 655550 621950 603130 623499 630667 645361
12532F45361l8220r96O400j7275m5867M3105M1244N0382K7775R697l1647K99j249
$$ 645361 607141 606145 612545 595270 549403 592508 633752 684134 711909 721606 689959 690258 689009
12519F89009J3585K701K428M7531N435j1243m1649n3679J413M9016P6892L994
$$ 689009 702594 705295 707723 755254 760689 749446 707797 654118 655531 704547 781439 785433
12507G85433j3300M0458q611k2416n5956o2054K0832k8963j025j5562k0792J3886
$$ 785433 772133 812591 803980 781564 725608 663554 684386 655423 654398 638836 618044 631930
12495F31930M0976M3056r678l7692j0430O3555n336k4245j4283k6058N3620K0436
$$ 631930 672906 715962 706284 668592 658162 721717 716381 692136 677853 651795 705415 725851
12483G25851k789j2850k2419n638M1087L1469L586M2886J2513k8365n0328p885
$$ 725851 723062 710212 687793 682155 723242 754711 758297 801183 813696 785331 735003 727118
12471G27118j7968R069L1029L3957J5927K218j8247J2610j4451R474K255p1680
$$ 727118 709150 718219 749248 783205 799132 801350 783103 795713 781262 790736 792991 721311
12459G21311l5037k1270Q8900k082p108K9598M0268L016k1177p216P916J4462
$$ 721311 686274 665004 753904 751822 744714 774312 814580 817596 796419 789203 797119 811581
12447H11581K6281J9758O7285J0123k767r824n0071o6683L3547k822P868K6772
$$ 811581 837862 857620 924905 935028 932261 922437 872366 805683 839230 836408 844276 871048
12435H71048K0659j8598N180K1744J6776P093j8412n7467N1743L0595m3826o3957
$$ 871048 891707 873109 878289 900033 916809 923902 905490 848023 899766 930361 886535 822578
12423H22578J4804Q743P4807K2886l6446j5151K6722j2738k1047p861N7948k8639
$$ 822578 837382 846125 920932 943818 907372 892221 918943 906205 885158 877297 935245 906606
12411I06606O128j0841j2015L2399n41J5809K2153j8071j4902m2026k3267N1164
$$ 906606 912734 901893 889878 922277 921736 937545 959698 941627 926725 884699 861432 912596
12399I12596P433k1132N9157L6876l1709k6366J1128m0402k231M3494R825j3268
$$ 912596 920029 898897 958054 994930 963221 936855 947983 907581 905350 948844 958669 945401
12387I45401J2372J0345m2448L0489O2352N7825J2092n6180K188J6919k7374k1464
$$ 945401 957773 968118 925670 956159 1018511 1076336 1088428 1032248 1034436 1051355 1023981 1002517
12375A002517J9175N441J7432j5903o790Q5601q323l5117J6863M706j7039K322
$$ 1002517 1021692 1027133 1044565 1028662 1021872 1107473 1099150 1064033 1080896 1085602 1068563 1070885
12363A070885k0790k7108Q54P8711N29k4580j8631l0658q28N0726M8762q204j318
$$ 1070885 1050095 1022987 1023841 1102552 1103081 1078501 1059870 1029212 1028384 1079110 1127872 1119668 1118350
12350A118350J1162l0552N3290m4075J8655L7397n270R762n3967l8070j8137K7878
$$ 1118350 1129512 1098960 1152250 1108175 1126830 1164227 1158957 1168719 1114752 1076682 1058545 1086423
12338A086423Q641L833k0454j4404J6681K6755K6181k5688L7762P6603N0807K3840
$$ 1086423 1095064 1098897 1078443 1064039 1080720 1107475 1133656 1107968 1145730 1222333 1273140 1296980
12326A296980j2065r6732q200J9693L5251o8197j1678L3916N4005J9917m5844
$$ 1296980 1284915 1188183 1179983 1199676 1234927 1166730 1155052 1188968 1242973 1262890 1217046
12315A217046M8165K2134k0231J5274l3546M382j30M0341J0338m5320N561J5846
$$ 1217046 1265211 1287345 1267114 1282388 1248842 1253224 1253094 1293435 1303773 1258453 1264014 1279860
12303A279860p038o411J589K679l275r652M7734K8394q064J953p6718M316M5829
$$ 1279860 1272822 1266411 1268000 1270679 1267404 1257752 1305486 1333880 1325816 1327769 1251051 1255367 1301196
12290A301196O0377N1828j1217m9272n9957k0856j2591O799O3133L9300k816J5695
$$ 1301196 1361573 1413401 1402184 1352912 1292955 1272099 1259508 1266307 1329440 1368740 1365924 1381619
12278A381619j1879m0740M4835N2754l1380L1850M2901J427L3129O962J0228P65
$$ 1381619 1369740 1329000 1373835 1426589 1395209 1427059 1469960 1471387 1504516 1511478 1521706 1522471
12266A522471K2258k5451m9215L4888N6176k9821l6672J1179M997M6043K9240
$$ 1522471 1544729 1519278 1470063 1504951 1561127 1531306 1494634 1505813 1510810 1556853 1586093
12255A586093k4459l5985R849j3386l6030M5988k744J3804M9886M4259J4816p6425
$$ 1586093 1561634 1525649 1535498 1522112 1486082 1532070 1529326 1543130 1593016 1637275 1652091 1575666
12243A575666k2310l246R963L0831J8475J0695J3642l4660l463M1576Q2584l7958
$$ 1575666 1553356 1550110 1560073 1590904 1609379 1620074 1633716 1599056 1595593 1637169 1719753 1681795
12231A681795j9498j353q017r561K6877K3343N5634K691O135j0850j3470m1864
$$ 1681795 1662297 1660944 1652927 1643366 1670243 1693586 1749220 1751911 1758046 1747196 1733726 1691862
12219A691862K2483o776r2971M5239J21856J2864k8618j6974N928M6783l6266
$$ 1691862 1714345 1707569 1614598 1659837 1781693 1794557 1765939 1748965 1754893 1801676 1765410
12208A765410q620K3283K1345R0199m4272k0760k0480J6686K3888J1172k5574
$$ 1765410 1756790 1780073 1801418 1891617 1847345 1826585 1806105 1822791 1846679 1857851 1832277
12197A832277K6024P2700M0056l279k8897K822K3074M8331k8625k7108L7704L9086
$$ 1832277 1858301 1931001 1971057 1967778 1938881 1941703 1964777 2013108 1984483 1957375 1995079 2034165
12185B034165j6476m0684l1956n093N6078Q7646M158M673o7839o3950K7091J13574
$$ 2034165 2017689 1977005 1945049 1939956 1996034 2083680 2087838 2092511 2024672 1960722 1987813 2101387
12173B101387L5360o7984j0713M5648N4016R049k4077j4565M3684R1262L6793
$$ 2101387 2136747 2068763 2058050 2103698 2157714 2166763 2142686 2128121 2171805 2263067 2299860
12162B299860m7814j6212k4972j641N380j4623L17R2981N3389j6642m6005l6066
$$ 2299860 2252046 2235834 2210862 2209221 2214601 2199978 2200295 2293276 2346665 2330023 2284018 2247952
12150B247952Q0991L0078m0325J0615K0053K6016Q687K7038m2160K7137Q666q103
$$ 2247952 2328943 2359021 2318696 2329311 2349364 2375380 2384067 2411105 2368945 2396082 2404748 2396645
12138B396645k4588L0691O8677K7560o203k518M2322M8380k3455j6066R998M7960
$$ 2396645 2372057 2402748 2471425 2498985 2492782 2490264 2532586 2580966 2557511 2541445 2551443 2599403
12126B599403N2941L5020o9148n6097L478P939Q127K3335K7201j2157K4097M4598
$$ 2599403 2652344 2687364 2618216 2562119 2565597 2573536 2581663 2604998 2632199 2620042 2644139 2688737
12114B688737k133j8574L937r148M8563j6977k980M206K4237P3747L5089J4469
$$ 2688737 2686604 2668030 2671967 2662819 2711382 2694405 2691425 2695631 2719868 2793615 2828704 2843173
12102B843173j8021m0319N9718Q0963N4818n460J1057P573Q8199P8618R470l9466
$$ 2843173 2825152 2784833 2844551 2925514 2980332 2974872 2985929 2993502 3081701 3160319 3169789 3130323
12090C130323k0563j1674j6696p3836n0425L2829J7872L7478L4848o272R012K2526
$$ 3130323 3109760 3098086 3081390 3007554 2957129 2989958 3007830 3045308 3080156 3073884 3082896 3105422
12078C105422J2541l0610K3831k3030J3119O599Q202M3386J5324k3318j2486J5049
$$ 3105422 3117963 3087353 3111184 3088154 3101273 3107872 3116074 3159460 3174784 3151466 3138980 3154029
12066C154029J2791J4390o986N7847L8376M7172J6676N9289M6582J0127j5769
$$ 3154029 3166820 3181210 3174224 3232071 3270447 3317619 3334295 3393584 3440166 3450293 3434524
12055C434524n4162q05l862j3220L0690Q3949L5935K278P8791M3613l6691l6875
$$ 3434524 3380362 3379557 3375695 3362475 3393165 3477114 3513049 3515327 3594118 3637731 3601040 3564165
12043C564165k3690K5774j8177k4200j7451r581k1161k5599L3198N0509L5542
$$ 3564165 3540475 3566249 3548072 3523872 3506421 3496840 3475679 3450080 3483278 3533787 3569329
12032C569329j924J6954M2683J4012m76k013J3117M3055N4161r266k3194K7236
$$ 3569329 3567405 3584359 3627042 3641054 3640578 3638565 3651682 3694737 3748898 3739632 3716438 3743674
12020C743674J9303R975k4828k2307l9012L7209O4220K5721J7092L5329M942l899
$$ 3743674 3762977 3772952 3748124 3725817 3686805 3724014 3788234 3813955 3831047 3866376 3871318 3867419
12008C867419M2532O1449m894m3272q849j6077J1744J3819J4184K0116N3113k2176
$$ 3867419 3909951 3971400 3966506 3923234 3914385 3898308 3910052 3923871 3938055 3958171 4011284 3989108
11996C989108j5737L3815J1517k3117J6655j8965j3267L1664J3754J1640O023
$$ 3989108 3973371 4007186 4018703 3995586 4012241 3993276 3980009 4011673 4025427 4037067 4043090
11985D043090P9164o8519n4304L3664K5724m0795j7327J8213L0482M3085K6306
$$ 4043090 4122254 4053735 3999431 4033095 4058819 4018024 4000697 4018910 4049392 4092477 4118783
11974D118783N7176K5714j825O020n7524J1140j8013L2392R601k353K7039j1896
$$ 4118783 4175959 4201673 4199848 4205868 4148344 4159484 4141471 4173863 4183464 4181111 4208150 4196254
11962D196254J207R994J0678N303l6860q2408J613N7945K9200L8128J4720k764
$$ 4196254 4197461 4207455 4218133 4223436 4186576 4104168 4105781 4163726 4192926 4231054 4245774 4243010
11950D243010M7917M7483m4099j533k3904j8744J7681j8701L4944M388m5634J860
$$ 4243010 4290927 4338410 4294311 4292778 4268874 4250130 4267811 4249110 4284054 4288442 4242808 4244668
11938D244668m893p551k1492J9820J7686R090p9234o7741N4548M3693P222Q232
$$ 4244668 4239775 4232224 4210732 4230552 4248238 4257328 4178094 4110353 4164901 4208594 4215816 4224048
11926D224048O5028M9516k4806J0794m0389n7078L7219l779l1062L4000N1933
$$ 4224048 4289076 4338592 4313786 4324580 4284191 4227113 4264332 4260553 4229491 4263491 4315424
11915D315424l380o2306m2321K9154R1191k0816m2298k6302j904l1823O19L3110
$$ 4315424 4312044 4249738 4207417 4236571 4327762 4306946 4264648 4238346 4236442 4204619 4205238 4238348
11903D238348m8337n0906K368o14m1386J5154j1254j3766O1031K6812J2594n132
$$ 4238348 4190011 4139105 4141473 4140859 4099473 4114627 4103373 4089607 4150638 4177450 4190044 4184912
11891D184912J109P780K1798o2826n6202K0304L1880m632j2809l1661O267j0855
$$ 4184912 4186021 4193801 4215599 4152773 4096571 4116875 4148755 4144123 4131314 4099653 4105920 4095065
11879D095065J4874M898K020M393m8935M7650l0827p0379k5834l2362O817K1206
$$ 4095065 4109939 4114837 4116857 4121250 4072315 4119965 4089138 4018759 3992925 3960563 3967380 3988586
11867C988586m4039N2922K7716n4703k2390n42k3463N159M182r708Q482L4738
$$ 3988586 3944547 3997469 4025185 3970482 3948092 3947550 3924087 3929246 3933428 3923720 3932202 3966940
11855C966940K9616k7789n1049m6434n8449m9917l851p697J9671O0063L0495K9847
$$ 3966940 3996556 3968767 3917718 3871284 3812835 3762918 3759067 3751370 3771041 3831104 3861599 3891446
11843C891446k8188n3209j9717l0900m5026o1566l8155K2153j6197l7696j7202
$$ 3891446 3863258 3810049 3790332 3759432 3714406 3652840 3614685 3636838 3620641 3582945 3565743
11832C565743o789K000J3777M6009l3685j2311K892l5906L9759N8761o6703l2718
$$ 3565743 3558954 3560954 3574731 3620740 3587055 3574744 3577636 3541730 3581489 3640250 3573547 3540829
11820C540829k9805k9466k1378M226n0224k9845J9706m1123l2135k6691j9378
$$ 3540829 3511024 3481558 3460180 3464406 3414182 3384337 3404043 3362920 3330785 3304094 3284716
11809C284716j2227j9926J5662j5690m0418k814j1328K4898M9348q4978K411L1976
$$ 3284716 3272489 3252563 3268225 3252535 3212117 3209303 3197975 3222873 3272221 3187243 3189654 3221630
11797C221630j6429o7083P634l4723O112J9236j2855l1579K0350M234L5529J0705
$$ 3221630 3205201 3138118 3145752 3111029 3117141 3136377 3123522 3091943 3112293 3116527 3152056 3162761
11785C162761q817q2192p4751k6919n346J8696P929m5312L1638j4660p7501k1821
$$ 3162761 3153944 3071752 2997001 2970082 2964736 2983432 2991361 2946049 2977687 2963027 2885526 2863705
11773B863705M1440j2682o7274k4093O56M3931L0710J1936o4101p613m4800l5603
$$ 2863705 2905145 2892463 2825189 2801096 2801752 2845683 2876393 2888329 2824228 2816615 2771815 2736212
11761B736212j132k3158k843m1589l8694p576J02599L5938m3626p170m8634m8992
$$ 2736212 2735080 2711922 2709079 2667490 2628796 2621220 2723819 2759757 2716131 2708961 2660327 2611335
11749B611335l0652k2460R87O188L1177M3730l4513m1022l0272l1238K7773j6875
$$ 2611335 2580683 2558223 2559210 2565398 2596575 2640305 2605792 2564770 2534498 2503260 2531033 2514158
11737B514158l7294q2539m4941O256L7619L4132O8428N4483j6241p1526m6422
$$ 2514158 2476864 2394325 2349384 2355640 2393259 2427391 2495819 2550302 2534061 2462535 2416113
11726B416113n7324p9190J0327M9352L1450K0322k587k5650j6456k0379j5987
$$ 2416113 2358789 2279599 2289926 2339278 2370728 2391050 2388463 2362813 2346357 2325978 2309991
11715B309991k1275k7479l3895O946l4432j8972K1064J3665k3571l9128k3679
$$ 2309991 2288716 2261237 2227342 2234288 2199856 2180884 2201948 2215613 2192042 2152914 2129235
11704B129235m2091L427J1271k1006k9448r246O208K4165K4412K3235p9687k1226
$$ 2129235 2087144 2090571 2101842 2080836 2051388 2042142 2048350 2072515 2096927 2120162 2040475 2019249
11692B019249L2503o5493J8023K2137k0343p4869L9052J724J242P83j7253m3184
$$ 2019249 2051752 1986259 2004282 2026419 2006076 1931207 1970259 1971983 1973225 1974008 1956755 1913571
11680A913571j6723J6205j7357L3668m797J4978R771k5837j0206J6305K3836k9921
$$ 1913571 1896848 1913053 1895696 1929364 1924567 1939545 1949316 1923479 1913273 1929578 1953414 1923493
11668A923493l6808l5628o9053m4229k1361J6196M742N6729J0094j7691r588o5893
$$ 1923493 1886685 1851057 1782004 1737775 1716414 1732610 1737352 1794081 1804175 1786484 1776896 1711003
11656A711003m7473k3033J9804K546J1965m3143M9902N4558k4826J6566m147k7006
$$ 1711003 1663530 1640497 1660301 1662847 1674812 1631669 1681571 1736129 1711303 1727869 1723722 1696716
11644A696716m2540l4055J7526n0198R636j9452L515P825K5272M1762L6619m3879
$$ 1696716 1654176 1620121 1637647 1587449 1597085 1577633 1581148 1588973 1614245 1656007 1692626 1648747
11632A648747m0154j4351K9279M14J6255j0123l9829l8955J3874M774q9084l0861
$$ 1648747 1608593 1594242 1623521 1623935 1640190 1630067 1590238 1551283 1565157 1569931 1480847 1449986
11620A449986k6070O1663J2977j7985q7759k8512K5682M1931M0218l529j7905
$$ 1449986 1423916 1485579 1498556 1480571 1392812 1364300 1389982 1431913 1472131 1468602 1450697
11609A450697j1027M3991L6024m560M1307K506m1386J2868o389p721J0154J175
$$ 1450697 1439670 1483661 1519685 1515125 1556432 1558938 1517552 1530420 1524031 1516310 1526464 1527639
11597A527639k4883o5999j19855n0463K5222O0279K0729k5605k9115o265k6362
$$ 1527639 1502756 1436757 1316902 1266439 1291661 1351940 1372669 1347064 1317949 1311684 1285322
11586A285322j2222j5264j8630L7188k4708M391L3346L9564k9197l7330o5715
$$ 1285322 1273100 1257836 1239206 1276394 1251686 1256077 1289423 1328987 1299790 1262460 1196745
11575A196745k2572N0107K2418N0558K5061k4526l3210m3267j8455N9532l34o2698
$$ 1196745 1174173 1224280 1246698 1297256 1322317 1297791 1264581 1221314 1202859 1262391 1262057 1199359
11563A199359J8134J1845K4494q0981J2331O3708j3503J9202j08993p5153R1439
$$ 1199359 1217493 1229338 1253832 1172851 1185182 1248890 1235387 1254589 1145596 1070443 1161882
11552A161882J2603L7569J1979j09617o8199J9471L2741L9426M2145n622o4090
$$ 1161882 1174485 1212054 1224033 1114416 1046217 1065688 1098429 1137855 1180000 1174378 1110288
11541A110288K3734j5979j3828R451J5307N3610j6765m0082K0673N3962q108l4266
$$ 1110288 1134022 1118043 1104215 1113666 1128973 1182583 1165818 1125736 1146409 1200371 1192263 1157997
11529A157997m5715q5294k3N4196N389l590p29l5260n418j9900J3251r254M3220
$$ 1157997 1112282 1026988 1026965 1081161 1086550 1082960 1082231 1046971 1041553 1021653 1034904 1025650 1068870
11516A068870K3015J1970Q68L8917K4719l4140J0502k690n6115j05545K9762L7441
$$ 1068870 1091885 1103855 1104723 1143640 1168359 1134219 1144721 1142031 1085916 980371 1010133 1047574
11504A047574j2949p1913J3098O745l174q5682o1018J13965J3642m977k5953K024
$$ 1047574 1034625 962712 975810 982555 979381 893699 832681 946646 960288 955311 929358 931382
11492I31382Q927j5339k0076k2204k1958K6500Q424M1720J3102j2739n2776o3795
$$ 931382 940309 924970 904894 882690 860732 887232 895656 937376 950478 937739 884963 821168
11480H21168N0778M3872M940j0027M7414R472M359o3020j0395O1710K1778r998
$$ 821168 871946 915818 920758 910731 958145 967617 971976 908956 898561 960271 982049 972051
11468I72051n3897n6164p7913q3606M3515N1027M2047j1532N2670K1939M215M415
$$ 972051 918154 861990 784077 700471 743986 795013 837060 825528 878198 900137 904352 908767
11456I08767j330M633j80j7553L14j6027l126O293O39L1019n1819p6251j9574
$$ 908767 907437 912070 911890 894337 894651 878624 875498 881791 882430 913449 861630 785379 765805
11443G65805L2272P2138l2593j9038N2542J5357j769n812m8805n4206o8917M7760
$$ 765805 798077 870215 837622 818584 871126 886483 884714 878902 830097 775891 706974 754734
11431G54734O7033L7065J8882J8099m3367r4841p95j5992K9194J21287L3393j22975
$$ 754734 821767 858832 877714 895813 852446 757605 756810 740818 770012 891299 924692 801717
11419H01717p9060O3127O879k3176p4219Q355r434l2943O8019K9378J546k5566
$$ 801717 722657 785784 792663 769487 695268 703623 694189 661246 729265 758643 760189 734623
11407G34623k312N0151M526k4533j3899L9853K786j4045m8723j0525J4274K4214
$$ 734623 732311 782462 786988 762455 748556 788409 791195 777150 728427 717902 732176 756390
11395G56390n4442p120p404K1652j7352M40J8774n980p818K6270J1565l8173j9130
$$ 756390 701948 694828 687424 709076 691724 692164 710938 704958 697140 723410 734975 696802 677672
11382F77672R914M0515k9904m6520k4553J9914J1226K1392N0332L9794J8354L384
$$ 677672 687586 728101 698197 651677 627124 647038 658264 679656 729988 769782 788136 791520
11370G91520l9148o6330k8506J1047J9303K6554k2770j4828K313K7542k0140n819
$$ 791520 752372 686042 657536 668583 687886 714440 691670 676842 679155 706697 686557 680738
11358F80738J792l8415N1716L1726n2173n8957p4878K3032L1391J2281n249Q7308
$$ 680738 682530 644115 695831 727557 675384 616427 541549 564581 595972 608253 603004 690312
11346F90312O8196m8271n8752l8649k2746L3154J1529l0445j6444j5519M6481
$$ 690312 758508 710237 651485 612836 590090 623244 634773 604328 587884 572365 618846
11335F18846M0158K0111N952m8456j2024p061L391J0637m5903O558N7297l348
$$ 618846 659004 679115 685067 636611 624587 617526 620917 631554 585651 592209 649506 646158
11323F46158J809J0286l5770K1368J6046K5549N3910k4338r5425L3097O704m2978
$$ 646158 647967 658253 622483 643851 659897 685446 739356 715018 619593 652690 659394 616416
11311F16416J166M6243j4049k4702l4091n570J9218j0226N348J5105J0564N9638
$$ 616416 617582 663825 649776 625074 590983 585413 604631 594405 599753 614858 625422 685060
11299F85060k925o5832M1396l3740l4546K7823L624J1213p982L2995N5440L778
$$ 685060 682135 616303 657699 623959 589413 617236 620860 632073 624091 657086 712526 716304
11287G16304m9472k5044j7918p979j8523M7734J6335k2050M544m0521j7862R24
$$ 716304 666832 641788 623870 615891 597368 645102 661437 639387 643931 603410 585548 586472
11275E86472M930L0480l0063j6696j9097n53J6564J9279m781P751j6930m3981
$$ 586472 591402 621882 591819 575123 556026 555473 572037 591316 586535 594286 577356 533375
11263E33375O1331L4169l7967L9130K1306m1847K6618j6516n2810J729m07K5136
$$ 533375 594706 628875 590908 630038 651344 609497 636115 619599 566789 568518 568111 593247
11251E93247J6497K8574O1500p006r5388j0584q777p7328k2666K4317m6k8220
$$ 593247 609744 638318 699818 692812 597424 586840 578063 500735 478069 502386 502340 474120
11239D74120N0411k7875N1443L0453m2136m9715j4547K7387J01117M7965J1935
$$ 474120 524531 496656 548099 578552 536416 486701 472154 499541 600658 648623 660558
11228F60558n6133l1603k2677K9588L207L9026n297Q202k0874j731O7961L2644
$$ 660558 604425 572822 550145 579733 582940 621966 616669 624871 603997 602266 670227 702871
11216G02871k2306q803j5789l5031J7053o595n1685k6081l5401p3758k7082M9947
$$ 702871 680565 671762 655973 620942 637995 631400 579715 553634 518233 444475 417393 467340
11204D67340O2318J7465L4779k4214k9995K0701l7131l451k4314J1929P9470p564
$$ 467340 529658 547123 581902 557688 527693 548394 511263 507812 483498 495427 574897 567333
11192E67333m8867j3760K943K1468J4847K2441L2642K411k8958q784K5830j4861
$$ 567333 518466 504706 507649 529117 543964 566405 599047 601458 572500 563716 589546 574685
11180E74685K986L658K8226l9687m0862M0469N5606k0385K6870j0060l9876J3107
$$ 574685 577671 581329 609555 569868 529006 569475 625081 604696 631566 621506 581630 594737
11168E94737M3126k3581k6090k6658l835K3062K7529O8995L8882J5064J05306
$$ 594737 637863 614282 588192 561534 557699 580761 608290 677285 716167 731231 836537
11157H36537R7468P3377Q7539J39487K07139J97587J64416K14292O1031n9957
$$ 836537 934005 1007382 1094921 1234408 1441547 1639134 1803550 2017842 2078873 2018916
11147B018916k05146k74777j99781j70137j67532q5464p0038l2153L8324j9784
$$ 2018916 1813770 1538993 1339212 1169075 1001543 916079 846041 813888 852212 832428
11137H32428m2712k436j1984j6895l0083n2805n1719K3723J5559J4896o1652l6428
$$ 832428 789716 787280 775296 758401 728318 675513 623794 647517 663076 677972 616320 579892
11125E79892L2044K7170K8018l244j2894m55k0211K1515N7397j7672p2785l6872
$$ 579892 611936 639106 667124 663880 650986 650531 630320 651835 709232 691560 618775 581903
11113E81903P394K7320j4333k584n5702m0155j9750K8073l912O2756P3124k4779
$$ 581903 589297 616617 602284 599700 543998 503843 484093 512166 508254 571010 644134 619355
11101F19355Q702j3476J4598K6353m5221l2948l8403M1316K3106L0890j5121K4472
$$ 619355 628057 614581 629179 655532 610311 577363 538960 580276 603382 634272 619151 643623
11089F43623P4714N4099p5971o0150j09693l1757K191L1654J6843N0590R64k657
$$ 643623 718337 772436 696465 636315 526622 494865 497056 528710 545553 596143 597107 594450
11077E94450j3487p1996J2582K5024n463j8016Q452R8286K8035m9385n9336m0050
$$ 594450 580963 508967 521549 546573 541110 523094 531546 629832 657867 608482 549146 509096
11065E09096n3653j9201N2667k3767k5064L9286K0532P8580j4385l6613J1222
$$ 509096 455443 436242 488909 465142 440078 479364 499896 578476 564091 527478 538700
11054E38700o680M0881L5991O621n2682l5659l7632J9083N1002K3872N9758L0216
$$ 538700 532020 572901 608892 615513 562831 527172 489540 508623 559625 583497 643255 673471
11042F73471N495J4568O5017K790j0583q915L1723M2798N7188K1533k1832J6672
$$ 673471 678966 693534 758551 761341 750758 741843 773566 816364 873552 895085 873253 889925
11030H89925K4171N576j2015l3482k4632j4208j8607J10715O7759J4440o898J3029
$$ 889925 914096 919672 907657 874175 849543 835335 816728 927443 995202 1009642 1002744 1015773
11018A015773m0873j9589k5914n0682q5934l3771P6847P4704N7360M1828l2543
$$ 1015773 974900 955311 929397 878715 792781 759010 835857 910561 967921 1009749 977206
11007I77206j8970J6083J725m3129j7543J134J3442M3015J7223J1534k1608O789
$$ 977206 958236 974319 976044 932915 915372 916506 929948 972963 990186 1001720 980112 986901
10995I86901L4041j4164k7222p834M206l2131j5912m8779o8950q8266j1495p0
$$ 986901 1020942 1006778 979556 971722 975928 943797 927885 879106 810156 721890 710395 710325
10983G10325o327l218j1463M3316L5157l8731m0500k0910M6496K0091n732K1253
$$ 710325 703998 700780 689317 732633 767790 729059 688559 667649 714145 734236 728504 749757
10971G49757L2857n9017m2806K0846L7263j9912q4047M8004K9653r117L3362k4567
$$ 749757 782614 723597 680791 701637 738900 718988 634941 682945 712598 703481 736843 712276
10959G12276j2945N797L7648P3745L8748p7791k9627l0196k466n2597l9497J611
$$ 712276 699331 705128 742776 816521 855269 777478 747851 717655 715189 662592 623095 624706
10947F24706L3862N8035k5497k7914j6450Q675Q3236J1868l6115l5821K4173N3841
$$ 624706 658568 716603 691106 663192 646742 655417 738653 750521 714406 678585 702758 756599
10935G56599O3349l761Q246L2390m2455m7210m5619n5639M7264K1836P473l5365
$$ 756599 819948 816187 824433 856823 814368 767158 721539 665900 713164 735000 742473 707108
10923G07108J6356J9498m3561m1032N3214P0520L3081l5837l0202K6796K8666
$$ 707108 723464 742962 699401 658369 711583 782103 815184 779347 749145 775941 804607
10912H04607M1408Q296J2410L8386K1168K3573N1079l8353k7481k1167J1322M4805
$$ 804607 846015 854311 866721 905107 926275 949848 1000927 962574 935093 913926 925248 970053
10900I70053j2096O037L1157P714N192q929j2567k6124K1002K1985P7615M8447
$$ 970053 957957 963994 995151 1002865 1008057 999128 986561 960437 981439 1003424 1081039 1129486
10888A129486l0282j4974M3675K1457J0882M5900O5768J08350J32594J13209J03577
$$ 1129486 1099204 1084230 1127905 1149362 1160244 1206144 1271912 1380262 1512856 1626065 1729642
10877A729642R7343J51325J84520J33172J9981j09626j11223j77755k26847j14140
$$ 1729642 1826985 1978310 2162830 2296002 2315983 2206357 2095134 1917379 1690532 1576392
10867A576392q1077n8689o4653o7215j8070J2657j6109J4692l6158L2592m19l9999
$$ 1576392 1495315 1436626 1371973 1304758 1286688 1299345 1283236 1297928 1261770 1294362 1293943 1253944
10855A253944j8179K2722r961m358m380P5983L5584O159L3488J4624l8159m5792
$$ 1253944 1235765 1258487 1248526 1244168 1239788 1315771 1351355 1357514 1391002 1405626 1367467 1321675
10843A321675R7581M0960L0997J57R434R0595P0608J3070j2185N962N375N9419
$$ 1321675 1419256 1460216 1491213 1491370 1500804 1591399 1662007 1675077 1662892 1668854 1674229 1733648
10831A733648O8602Q9481J2534m2255j9986j2377L4991j3120L4474R5545R1925
$$ 1733648 1802250 1891731 1904265 1862010 1842024 1829647 1864638 1851518 1885992 1981537 2073462
10820B073462J21209P5968J08717R1759J72397K25577K95609L06369K04613J34370
$$ 2073462 2194671 2270639 2379356 2471115 2643512 2869089 3164698 3471067 3675680 3810050
10810C810050p488n4383r3906q7798j82551k05853j37168j27752r5121o5444p7497
$$ 3810050 3802562 3748179 3654273 3566475 3383924 3178071 3040903 2913151 2818030 2752586 2675089
10799B675089m1694K2079N494P2990Q4020J15603N7604M5629N8980O3018M5181
$$ 2675089 2633395 2655474 2660968 2733958 2817978 2933581 2991185 3036814 3095794 3158812 3203993
10788C203993R5542Q8683M6814M5025M5222R9524J27762K2294J59075J25559R5291
$$ 3203993 3299535 3388218 3435032 3480057 3525279 3624803 3752565 3774859 3933934 4059493 4154784
10777D154784J52127J37976J52084J51323K16627K61707K38115K81808L22566
$$ 4154784 4306911 4444887 4596971 4748294 4964921 5226628 5464743 5746551 6069117
10768F069117M52182O01078O30722P21098O99669O30360O34768O32036P66079
$$ 6069117 6521299 7122377 7753099 8474197 9173866 9804226 10438994 11071030 11837109
10759A1837109R19718J289129J641390K192928K743990L398235M138129N201242
$$ 11837109 12756827 14045956 15687346 17880274 20624264 24022499 28160628 33361870
10751C3361870O774583R122482J2524626J7291390K3516894L0238724L7315003
$$ 33361870 40136453 49258935 61783561 79074951 102591845 132830569 170145572
10744A70145572M4654662M7775204L2391035m160533l4292725m7291774m8528638
$$ 170145572 214800234 262575438 294966473 290805940 256513215 209221441 160692803
10737A60692803m0305144k9033848j9955324j3822687r813810p076417n237189
$$ 160692803 120387659 91353811 71398487 57575800 47761990 40685573 35448384
10730C5448384l947408l207855k650332k168284j731366j312791r84040o31617
$$ 35448384 31500976 28293121 25642789 23474505 21743139 20430348 19446308 18814691
10722A8814691k85636J919K46336N16660P55540R63108J236700J411384Q31723
$$ 18814691 18529055 18530974 18777310 19293970 20049510 21012618 22249318 23660702 24492425
10713B4492425n35035j681540k070440j983396j522349r96688o04318n29060o69482
$$ 24492425 23957390 22275850 20205410 18222014 16699665 15702977 15098659 14569599 13900117
10704A3900117p20786p09504p05212o49753o33415n72307n36477m39921m32488
$$ 13900117 13179331 12469827 11764615 11114862 10481447 9909140 9372663 8932742 8500254
10695H500254m16615k81466l31715l55990l84923l43177k86799k17325j99671
$$ 8500254 8083639 7802173 7470458 7114468 6729545 6386368 6099569 5882244 5682573
10686E682573j75044j88507j24226k01414j98530k37299j54972j79104k01401
$$ 5682573 5507529 5319022 5194796 4993382 4794852 4557553 4402581 4223477 4022076
10677D022076j17702j30228j25384j16742j37157r6003o7375j26402j46673m7117
$$ 4022076 3904374 3774146 3648762 3532020 3394863 3298860 3231485 3105083 2958410 2911293
10667B911293q0103l2852N2217m5622k8651n112M425n2383o1518m4466o4149n7714
$$ 2911293 2831190 2798338 2850555 2804933 2776282 2771170 2775595 2723212 2661694 2617228 2553079 2495365
10655B495365n0141l2817p387j2372N672j6749r400J3890M2036K3555L9429M0693
$$ 2495365 2445224 2412407 2405020 2392648 2398320 2381571 2372171 2386061 2428097 2451652 2491081 2531774
10643B531774L2764j5991j366L3377K3958L0434P1538O4463J01202J09390J72585
$$ 2531774 2564538 2548547 2547181 2580558 2604516 2634950 2706488 2770951 2872153 2981543 3154128
10632C154128J86380K13670J94619K20868K65409L15818M72748N20467N59885
$$ 3154128 3340508 3554178 3748797 3969665 4235074 4550892 5023640 5544107 6103992
10623F103992P15360R01823J213147J454124J803602K212960K584018K910388
$$ 6103992 6819352 7721175 8934322 10388446 12192048 14405008 16989026 19899414
10615A9899414L094754K848497K112712J136666L96896J54928L72123J046450
$$ 19899414 22994168 25842665 27955377 29092043 29488939 29643867 30015990 31062440
10607C1062440J953757L171175M166691M988569N387061M680557K759098L23138
$$ 31062440 33016197 36187372 40354063 45342632 50729693 55410250 58169348 58492486
10599E8492486j563524k325349j838742m82308J341650L065574M691029N827085
$$ 58492486 56928962 54603613 52764871 52282563 53624213 56689787 61380816 67207901
10591F7207901O022940M608201J366060k312646n067698o192938n685870m135934
$$ 67207901 73230841 77839042 79205102 76892456 71824758 65631820 59945950 55810016
10583E5810016k184104k89506J259131K146097K262550J189739r78798l356412
$$ 55810016 53625912 53336406 54595537 56741634 59004184 60193923 59215125 55858713
10575E5858713m987854n488008m950814l736339k449656j359842m93604k384Q128
$$ 55858713 50870859 45382851 40432037 36695698 34246042 32886200 32392596 32390212 32398340
10566C2398340n04944j445092k358294k927956l130126k894466k445975j954749
$$ 32398340 31893396 30448304 28090010 25162054 22031928 19137462 16691487 14736738
10558A4736738j464774j158520q89821o39488m99515l13124k88743j40025l4381
$$ 14736738 13271964 12113444 11223623 10584135 10084620 9771496 9482753 9342728 9308347
10549I308347P3107K98635N23181O06860N83114R5119n88301j007353j128555
$$ 9308347 9381454 9680089 10203270 10810130 11393244 11488363 10900062 9892709 8764154
10540H764154j117924r47238o46318m88149l43769l19469l13453k95099k96868
$$ 8764154 7646230 6698992 6052674 5564525 5220756 4901287 4587834 4292735 3995867
10531C995867k27568j57904k17301j59583j51243j28651j93284j13036j00547
$$ 3995867 3768299 3610395 3393094 3233511 3082268 2953617 2760333 2647297 2546750
10522B546750j55177r9503p7939j34492j75935j43599j75704j05313k5932n2627
$$ 2546750 2391573 2292070 2214131 2079639 1903704 1760105 1584401 1479088 1453156 1400529
10512A400529p1079m2078j21930r5159o2693m3039q8166k1469k2247o9134m959
$$ 1400529 1329450 1287372 1165442 1070283 1007590 964551 876385 854916 832669 763535 758576
10501G58576P966n0175o1255p9271r973L18M17K1594p0960m3848j2127K7618l4469
$$ 758576 766542 716367 655112 575841 565868 566186 566603 588197 517237 473389 461262 488880 454411
10488D54411m0182k6863l3443l2173l9707k5420N547j072l5357k8248J6089k3612
$$ 454411 414229 387366 353923 321750 282043 256623 262170 261098 225741 197493 213582 189970
10476A89970p5884j0213K9880N4093P666M1394M601k0611K8685l5415L1809m3900
$$ 189970 114086 103873 133753 187846 195512 236906 241507 220896 249581 214166 245975 202075
10464B02075n7393l3463N238K2198K7230J1819K6779n0079o9940J8975N0726j1163
$$ 202075 144682 111219 116457 138655 165885 177704 204483 154404 84464 103439 154165 143002
10452A43002n6339j6220j1860P955n6715J838N0691M4684O9336J6633K5807M0725
$$ 143002 86663 70443 58583 66538 9823 11661 62352 107036 176372 193005 218812 259537
10440B59537j4506L632O1385K157J6588k7574o5519o4328p3391l8737o4968O678
$$ 259537 245031 248663 310048 312205 328793 301219 235700 171372 97981 59244 -5724 954
10428I54O1169L2154j5243J8492l7484k6354r000j1256j8238J5100M1449J6556
$$ 954 62123 94277 79034 97526 60042 33688 24688 13432 -4806 10294 51743 68299
10416F8299M4841o810k120r034m847m1135o467J1684M5059J9183n5775l9793K3355
$$ 68299 113140 106330 104210 95176 90329 49194 42727 54411 99470 118653 62878 23085 46440
10403D6440L0432L8900N2206P9874N3207p7191l8804K9397m8718m0241O48K7984
$$ 46440 76872 115772 167978 247852 301059 223868 185064 214461 165743 125502 126150 154134
10391A54134J8465J5249J1272O4214O4658N8487L3329L8676Q0731M9618L1032
$$ 154134 172599 187848 199120 263334 327992 386479 419808 458484 539215 588833 619865
10380F19865K4554N5925R2358P7184J08158K65339K72547L70167N35074O83819
$$ 619865 644419 700344 792702 869886 978044 1243383 1515930 1886097 2421171 3104990
10370C104990Q47097R78907R36184L72142l71096q52316r85809q60426p15925
$$ 3104990 3952087 4930994 5867178 6239320 5868224 5015908 4030099 3169673 2453748
10361B453748n24324l60838k72872k14446j59565j19375m8159k9144k0592J3060
$$ 2453748 1929424 1568586 1295714 1081268 921703 802328 754169 725025 704433 717493
10351G17493M5947L5444R0464R8079N9746O0341M2186j3009p2378p7080j6165
$$ 717493 763440 798884 889348 987427 1047173 1107514 1149700 1136691 1064313 987233 971068
10340I71068p2311k3235K3919J07963J06632J46858K59786K53517L03609L64434
$$ 971068 898757 875522 899441 1007404 1114036 1260894 1520680 1774197 2077806 2442240
10330B442240M09140L13705K9622k72424m42244m88226m25013l70001k26519j29690
$$ 2442240 2851380 3165085 3194707 2922283 2480039 1991813 1566800 1196799 970280 840590
10320H40590j30328j69034j49256j00848J5305K8043J5539n7968m9789k081r816
$$ 840590 710262 541228 391972 291124 306429 334472 350011 292043 242254 240173 230357
10309B30357L8292j3885k0798k8936P956N2784M052K5567j2399m3665m2143p522
$$ 230357 268649 254764 233966 205030 212986 265770 269822 295389 282990 239325 197182 189660
10297A89660m5693k9408m4590l9261J851j6868j1176q556N142R1365Q1263l1474
$$ 189660 143967 114559 69969 30708 32559 15691 4515 -4041 1101 92466 173729 142255
10285A42255o1598k8922o3720K0238k6749m4252l6411L4920J26569J5968j6372
$$ 142255 80657 51735 -11985 8253 -18496 -62748 -99159 -64239 62330 78298 61926
10274F1926j0784l6731j6722N5275j9774o5254K3890K1083m0599m3069P049k3516
$$ 61926 51142 14411 -2311 52964 33190 -32064 -8174 12909 -27690 -70759 -63710 -87226
10262h7226j5363J7884k2207J4803j240J583l6321k247J869K7702M9132j8404
$$ -87226 -102589 -84705 -106912 -92109 -93349 -91766 -128087 -130334 -128465 -100763 -51631 -70035
10250g0035j4851p5232n949Q7684K497J7879R461K1452N631o64L208l3597j9451
$$ -70035 -84886 -160118 -166067 -78383 -75886 -58007 -48546 -27094 -21463 -22127 -18919 -52516 -71967
10237g1967k6426k2807j9214Q4176Q995m0018L7178N3739J7277N094l4397r333
$$ -71967 -98393 -121200 -140414 -56238 -47243 -87261 -50083 3656 20933 26027 -8370 -17703
10225a7703M0756K7096q7305j4871J1312j0142j7643k5193J9563M9391M5932J9997
$$ -17703 23053 50149 -37156 -52027 -40715 -50857 -68500 -93693 -74130 -24739 21193 41190
10213D1190m930l6530k4264K3410o5110j3478L8837K3959k4000m8289J3053k128
$$ 41190 36260 -270 -24534 -1124 -66234 -79712 -40875 -16916 -40916 -89205 -76152 -78280
10201g8280q2907n2239L1648P2728N7306J5477L0095M6793l0121m3566j0759l6156
$$ -78280 -161187 -213426 -181778 -109050 -51744 -36267 -6172 40621 10500 -33066 -43825 -79981
10189g9981j4323m7378n5452R09R8716O5616K8475j7355n18O1793P3512J826o4752
$$ -79981 -94304 -141682 -197134 -196225 -97509 -31893 -3418 -20773 -21291 40502 114014 115840 51088
10176E1088j2562L7342K8409K1007l0097n2865r74M1406K4767R6237L1547O404
$$ 51088 38526 75868 104277 125284 95187 42322 41348 82754 107521 203758 235305 241709
10164B41709O9377J9153l1308K0751O657o561l2048m8332n116K1091N0573R2570
$$ 241709 311086 330239 298931 319682 326339 319778 287730 239398 234282 255373 305946 398516
10152C98516J1388o2068q134p0232k6937J3864J1154k4138j3134N0561L4046l946
$$ 398516 409904 347836 339702 269470 242533 256397 267551 243413 230279 280840 314886 310940
10140C10940J979n4625l2328o3304k240k6820m54M8568N979l861j0498n6347r487
$$ 310940 312919 258294 225966 162662 160422 133602 133148 181716 187695 183834 173336 116989 107502
10127A07502M2465l493J5693m9782l4399J5097J2127q2576l8943k1385K0906M4495
$$ 107502 149967 146474 162167 112385 77986 93083 105210 22634 -16309 -37694 -16788 27707
10115B7707r463l4815n6249Q499O8752O8852N2722k3831n4703J907j537q2660
$$ 27707 18244 -16571 -72820 -64321 4431 73283 126005 102174 47471 49378 47841 -34819
10103c4819L130M1884o3280N5968M8949K7974k2281j5830j988p902P1717k233
$$ -34819 -31689 10195 -53085 2883 51832 79806 57525 41695 39707 31805 103522 101289
10091A01289p424j4585n4248k6876j7600n28J5765j8578J4951L3992p369j9957
$$ 101289 93865 79280 25032 -1844 -19444 -19972 -4207 -22785 -7834 26158 18789 -1168
10079a168L9471J8583r73o2035k7875J9731k3618m2981K5240J6827j1364l6750
$$ -1168 38303 56886 55913 -6122 -33997 -14266 -37884 -80865 -55625 -38798 -50162 -86912
10067h6912k4697q809K6760l666j032K7304N1831m2010k9598P104L3493K076o8276
$$ -86912 -111609 -120418 -93658 -97324 -98356 -71052 -19221 -61231 -90829 -83725 -50232 -48156 -116432
10054a16432J5904J5904M1371O1945j5242N7j840n4270o561k5855l6558J5623
$$ -116432 -100528 -84624 -43253 18692 3450 3507 1667 -52603 -59164 -85019 -121577 -105954
10042a05954O0102l523J4615L7788J845o2030L8502K8125J642p7412l9056n9920
$$ -105954 -45852 -49375 -34760 3028 4873 -57157 -18655 9470 11112 -66300 -105356 -165276
10030a65276Q4075O2410j9066n840m670J8297j7703j4868n8856J9399M3218m6802
$$ -165276 -81201 -18791 -37857 -43697 -48367 -30070 -47773 -62641 -121497 -102098 -58880 -105682
10018a05682J9371O3847j4032J802n7291m0630J3130K891J32685O8851n7154k9562
$$ -105682 -86311 -22464 -36496 -34694 -91985 -132615 -119485 -116594 16091 84942 27788 -1774
10006a774N8915o854k1537l1669m6890J8164P6892K3236j1848P204J518l0061
$$ -1774 57141 50287 28750 -2919 -49809 -31645 45247 68483 56635 63839 65357 35296
9994C5296k6502j878N0527P1023j9838j7236O886l7742m3145m4229j1782L6012
$$ 35296 8794 6916 57443 128466 108628 91392 98278 60536 17391 -26838 -38620 -2608
9982b608N5203N309N7215p1748j9625O8714J7843j4297K4944L1621J2198m9772
$$ -2608 52595 57904 115119 43371 23746 92460 110303 96006 120950 152571 164769 114997
9970A14997k7312J0572n281P613L259j7957J5661J9250r8371m2899q593k5197
$$ 114997 87685 98257 92976 100589 103848 85891 101552 120802 22431 -20468 -29061 -54258
9958e4258O1569J1875l6912k9878L4950L4041p051n7112L217N3514O197j4306
$$ -54258 7311 19186 -17726 -47604 -12654 21387 14336 -42776 -39559 13955 20152 5846
9946E846p0100o0840o313K9261N8093J919l0646k9139Q8691K5946j2323J1789
$$ 5846 -64254 -125094 -131407 -102146 -44053 -42134 -72780 -101919 -13228 12718 395 12184
9934A2184l8936p012N0845m7534n3267m6528M4923J6648L9663N1386J7435o4032
$$ 12184 -26752 -33764 17081 -30453 -83720 -130248 -85325 -68677 -29014 22372 39807 -24225
9922b4225l1272j2620K4886K5650M782J5480k9465l3699K4966j0922n962o901
$$ -24225 -55497 -68117 -43231 -17581 -12799 2681 -26784 -60483 -35517 -46439 -52401 -59302
9910e9302J8934K216J5614L6631m1001j0649J2355K6503L674L495k3169l8304
$$ -59302 -40368 -38152 -22538 14093 -26908 -37557 -25202 1301 4975 8470 -14699 -53003
9898e3003k474K1373J3797M5739L2101M0472J6260j9113l2047j8442m130n149
$$ -53003 -55477 -34104 -20307 25432 57533 98005 114265 95152 63105 44663 40533 35384
9886C5384N996K8555P914p0924J1495k0858m2071j2630n3801M6437L0756p701
$$ 35384 41380 69935 77849 6925 18420 -2438 -44509 -57139 -110940 -64503 -33747 -41448
9874d1448j9652j6977p560L2153R25m1469K9787N353n9061L1394n151l0798j2898
$$ -41448 -61100 -78077 -85637 -53484 -52559 -94028 -64241 -58888 -117949 -86555 -91706 -122504 -135402
9861a35402J962O0592N5885M931k0370k0391j1307R511m9165k0169L1008O3704
$$ -135402 -133440 -72848 -16963 -12032 -32402 -52793 -64100 -54589 -103754 -123923 -92915 -29211
9849b9211p1506k0655N970M024m0266l4081n002M3455L7314R793j5816j1330K4156
$$ -29211 -100717 -121372 -115402 -111378 -151644 -185725 -190727 -147272 -109958 -100165 -115981 -127311 -103155
9836a03155J8898L8184N5754K618q332l5052K3468n566m1361n3987J7483P7591
$$ -103155 -84257 -46073 9681 12299 3967 -31085 -7617 -13183 -54544 -108531 -91048 -13457
9824a3457J7672M098j0515k0206J7289O442n7648m0528L8019m0497J4764J4748
$$ -13457 4215 8313 -2202 -22408 -5119 1323 -56325 -96853 -58834 -99331 -84567 -69819
9812f9819m5813k1882N4078N2644J5871L1736o3729m0108j7955j84M6830j2624
$$ -69819 -115632 -137514 -83436 -30792 -14921 16815 -46914 -87022 -104977 -105161 -58331 -70955
9800g0955o7678k4889M5596P0278k8710k8169L8751M4941p766p1318R86L1067
$$ -70955 -138633 -163522 -117926 -47648 -76358 -104527 -65776 -20835 -28601 -99919 -98933 -67866
9788f7866L2447Q361m060l666j4499j8844J0669o7251l0785L2080J13233Q721
$$ -67866 -35419 -27058 -31118 -34784 -49283 -68127 -57458 -124709 -155494 -123414 -10181 -1460
9776a460j0014J4957l683L2702J6614J7310J9857o4101r359p259n9758k2670K4681
$$ -1460 -11474 3483 -200 32502 49116 66426 86283 22182 12823 5564 -54194 -76864 -52183
9763e2183l2787M1843M914K5147l777j0164K986R953K5343Q5587J038l3019K9138
$$ -52183 -84970 -43127 -38213 -13066 -16843 -27007 -24021 -14068 11275 96862 97900 64881 94019
9750I4019n269j62p507J8503L6728k4788p4171l5154k200K0455m1135m6813k2271
$$ 94019 88750 88588 81081 99584 136312 111524 37353 2199 -1 20454 -20681 -67494 -89765
9737h9765j8820M9922L9348o431M0420l2430r1562q657L0068Q57l526M3377K0178
$$ -89765 -108585 -58663 -19315 -25746 14674 -17756 -109318 -117975 -87907 -87050 -90576 -47199 -27021
9724b7021q228m2939K6544j9L1991j0392r1986L2352N9703N150l6740Q668j7539
$$ -27021 -35249 -78188 -51644 -51663 -19672 -30064 -122050 -89698 -29995 -24845 -61585 -52917 -70456
9711g0456O5679k816k6491L6750K5991P508Q590K1645K9630o8250n7249j0342
$$ -70456 -4777 -7593 -34084 2666 28657 36165 44755 66400 96030 27780 -29469 -39811
9699c9811k2474m756M0599J5353m4671l3025m444M4100L1334O2704K9842p0684
$$ -39811 -62285 -67041 -26442 -11089 -55760 -88785 -93229 -49129 -17795 44909 74751 4067
9687D067n5986L574r729m437K3158M0640j5454k3056K4231L4874l6741l3966K4141
$$ 4067 -51919 -48345 -58074 -62511 -39353 1287 -14167 -37223 -12992 21882 -14859 -48825 -24684
9674b4684N1385J0890Q280m0904p271J3053k8704p543J5761l1331k4636M3856
$$ -24684 26701 37591 45871 4967 -2304 10749 -17955 -25498 -9737 -41068 -65704 -21848
9662b1848O6383J969m709K402n646J2178N9560O9017L6727K5196J34733J18444
$$ -21848 44535 46504 41795 44197 38551 50729 110289 179306 216033 241229 375962 494406
9650D94406J24108J22773K5696q1841j35147j43115j70202p3956m6441n7404l7185
$$ 494406 618514 741287 766983 685142 549995 406880 236678 162722 116281 58877 21692
9639B1692k5835M0881n8552m5078l951K0542O0258J2086q495L6423p3021m3631
$$ 21692 -4143 36738 -21814 -66892 -70843 -50301 9957 22043 13548 49971 -23050 -66681
9627f6681O117L7102K249J8739j2044J4468J304k6618q5320J8160M8842K7554
$$ -66681 -60564 -23462 -21213 -2474 -14518 -50 1254 -25364 -110684 -92524 -43682 -16128
9615a6128j9761q91p756j27N5646j6830l8809K665L9333K1985k7048p0540j8058
$$ -16128 -35889 -36780 -44536 -44663 10983 -5847 -44656 -41991 -2658 19327 -7721 -78261 -96319
9602i6319K8159j1929k1817k5124J9259N5328J4687j7482K3667j1847K0199k2902
$$ -96319 -68160 -80089 -101906 -127030 -107771 -52443 -37756 -55238 -31571 -43418 -23219 -46121
9590d6121J5320L5452L1048p979m4297m8277L9763r542l5220J3951K2697J5439
$$ -46121 -30801 4651 35699 27720 -16577 -64854 -25091 -34633 -69853 -55902 -33205 -17766
9578a7766J0825k6842k8249L5134M1067n9313O157l1386K4433L7750r32q975k4396
$$ -17766 -6941 -33783 -62032 -26898 14169 -45144 -38987 -70373 -45940 -8190 -9122 -18097 -42493
9565d2493l7729p1252N493L9085o240J3219K4372K0689J7178J3737K8605j0351
$$ -42493 -80222 -151474 -145981 -106896 -113136 -99917 -75545 -54856 -37678 -23941 4664 -5687
9553e687k3862m0744L9313L8512K4667J2318k6779N647L1725j3948j5462o8526
$$ -5687 -29549 -70293 -30980 7532 32199 44517 17738 23385 55110 41162 25700 -42826
9541d2826k790j4059K5257k3748L3359M6688N2611J6029q759n4735k1678O727
$$ -42826 -45616 -59675 -34418 -58166 -24807 21881 74492 90521 81762 27027 5349 12076
9529A2076O760o5169l7677L1631R6781P602l8904m2509L6589M807O138L4162k5762
$$ 12076 18836 -46333 -84010 -52379 44402 52004 13100 -29409 7180 11987 18125 52287 26525
9516B6525N7611n330j8336K5950o2894m9691l0839L9577M2844o452m5033K0735
$$ 26525 84136 78806 60470 86420 23526 -26165 -57004 -17427 25417 18965 -26068 -5333
9504e333j1814O23N3798Q972q653o1967p8581k838N0303j8029J0555K342K3069
$$ -5333 -17147 -16524 37274 46246 37593 -24374 -102955 -105793 -55490 -73519 -62964 -60622 -37553
9491c7553j891J1973m8850L0993J5111K3705j637M1975L4378l7710j3145N0792
$$ -37553 -39444 -27471 -76321 -45328 -30217 -6512 -8149 33826 68204 30494 17349 68141
9479F8141k019r8219K0640R986o3648L5779L0757n416k5938k3967j770l839l071
$$ 68141 66122 -32097 -11457 -1471 -65119 -29340 1417 -3999 -29937 -53904 -55674 -59513 -62584
9466f2584J8364K9155J2624K0412k7208q1323l8253M1201Q1847P656l0278j5481
$$ -62584 -44220 -15065 -2441 17971 -9237 -90560 -128813 -87612 -5765 1891 -28387 -43868
9454d3868K0801n4759J8593m758j5775K4512J771k1889k7539J649K1382L4046
$$ -43868 -23067 -77826 -59233 -63991 -79766 -55254 -53483 -75372 -102911 -101262 -79880 -45834
9442d5834M1903K6299j9933o392j1541k3938j23171j6856P7091L4995k9292M7066
$$ -45834 -3931 22368 2435 -3957 -15498 -39436 -162607 -179463 -102372 -67377 -96669 -49603
9430d9603L9350l2441R041O5942K6061k5581L0140K9407n3175o9422j3193l1274
$$ -49603 -10253 -42694 -33653 32289 58350 32769 62909 92316 39141 -30281 -43474 -74748
9418g4748q169L2282K4993N381k5822K7357O405J1808M3389m1252j1677q846L0474
$$ -74748 -82917 -50635 -25642 -20261 -46083 -18726 -12321 -513 42876 1624 -10053 -18899 11575
9405A1575N0101L7175M736p5995n5846J2399J6799q835o775K7576L8609N406l6952
$$ 11575 61676 98851 103587 27592 -28254 -15855 944 -7891 -14666 12910 51519 56925 19973
9392A9973k3585l8067l2200M98L0492J0544J8258j1432p642J6935l454L8374l678
$$ 19973 -3612 -41679 -73879 -73381 -42889 -32345 -14087 -25519 -33161 -16226 -19680 18694 15016
9379A5016l3871j7093k4334N6065j7946J307J117j0626o306l7193K6082N4507
$$ 15016 -18855 -35948 -60282 -4217 -22163 -20856 -19739 -30365 -36671 -73864 -47782 6725
9367F725L3832M3682l947k6488j8314m6095p741k8066l4048k753J1079J6137J086
$$ 6725 40557 84239 80292 53804 35490 -10605 -18346 -46412 -80460 -83213 -72134 -55997 -54911
9354e4911M996j7568M0339P1774m1408r3694p4306L1352M547J8631j681L962M5334
$$ -54911 -49915 -67483 -27144 44630 3222 -90472 -164778 -133426 -128879 -110248 -111929 -107967 -62633
9341f2633L9552M1605Q537o2123k8084K678k0348N101l1157M6424L0549k5059
$$ -62633 -23081 18524 27061 -35062 -63146 -60468 -80816 -75715 -106872 -60448 -29899 -54958
9329e4958K4661N496j043m2772o4433K8391M4313J228K4675O3550o636j7609j8485
$$ -54958 -30297 -24801 -25844 -68616 -133049 -104658 -60345 -59117 -34442 29108 22472 4863 -13622
9316a3622O21L7539j1678K2444r131R758J4916j4771n4813n8766M4262N7138k4772
$$ -13622 -13001 24538 12860 35304 26173 35931 50847 36076 -18737 -77503 -33241 23897 -875
9303h75l190Q78J558J6408o5146j1075M3338N383L7384k3927m0189p473O308K6460
$$ -875 -4065 -3187 -1629 14779 -50367 -61442 -18104 -12721 24663 736 -39453 -46926 -40618 -14158
9289a4158M0460N951q547K6810K8859k9696o1147l6646L3403N2795n8416p3779
$$ -14158 26302 32253 23706 50516 79375 49679 -11468 -48114 -14711 38084 -20332 -94111
9277i4111K7374K6632O2979J2357o3107j1347j1346M413K7199J7692k7858n5977
$$ -94111 -66737 -40105 22874 35231 -27876 -39223 -50569 -46156 -18957 -1265 -29123 -85100
9265h5100N4355Q003l4904n2176k6424J01748N5424j0498N9728j4535J8245O8914
$$ -85100 -30745 -22742 -57646 -109822 -136246 -34498 20926 10428 70156 55621 73866 142780
9253A42780k3562q6347n4863l1500j7822n700J7195P3814l2082k0981o114L1148
$$ 142780 119218 32871 -21992 -53492 -71314 -77014 -59819 13995 -18087 -39068 -45182 -14034
9241a4034N8459J2711j3626m5342m9006N906L2954L8070K5142L8491k0650q164
$$ -14034 44425 57136 43510 -1832 -50838 -44932 -11978 26092 51234 89725 69075 60911
9229F0911k4876l4846n1067m3606K3191P3284q559l7584l9551o048L1939L4650
$$ 60911 36035 1189 -49878 -93484 -70293 2991 -5568 -43152 -82703 -88751 -56812 -22162
9217b2162P6777L1092J0573l2617R282k7269l2859J3619N821l1820K9885j1290
$$ -22162 54615 85707 96280 63663 72945 45676 12817 26436 32257 437 30322 19032
9205A9032r554k2278j2710K8006k6482k4600K1894j8456r9368k736j4701O4994
$$ 19032 9478 -12800 -25510 2496 -23986 -48586 -26692 -45148 -144516 -147252 -161953 -96959
9193i6959O9556K8323j2230p423j1197j0814o1172j2841J01272L5633j6561j0259
$$ -96959 -27403 920 -11310 -18733 -29930 -40744 -101916 -114757 -13485 22148 5587 -4672
9181d672n1824N413M2183K7268L1895j2457n8337j9790J2590j1050J642j7460
$$ -4672 -56496 -51083 -8900 18368 50263 37806 -20531 -40321 -27731 -38781 -37139 -54599
9169e4599l562M9236M4416J056P564L2076o3993l3679n418P725m6834k2867M2168
$$ -54599 -58161 -8925 35491 36547 44111 76187 12194 -21485 -26903 -19178 -66012 -88879 -46711
9156d6711P628K3676l0052M007P3604m9706k329k4437N0346K2130j865p680o3813
$$ -46711 -39083 -15407 -45459 -41452 32152 -17554 -19883 -44320 6026 28156 26291 18611 -45202
9143d5202J2839k503m219M804N25j3269L9362M4717J2096k6099M989K1370K4761
$$ -45202 -32363 -34866 -39085 -34281 -33756 -47025 -7663 37054 49150 23051 28040 49410 74171
9130G4171J4115M98o0668j2045k1088R055K6805n1869p982j710k5819J4987J5620
$$ 74171 88286 88784 28116 16071 -5017 4038 30843 -21026 -29008 -30718 -56537 -41550 -25930
9117b5930M8630m2894m7440K9173J9016J4058k5783k7757l4260L2111O8912K0651
$$ -25930 22700 -20194 -67634 -38461 -19445 -5387 -31170 -58927 -93187 -61076 7836 28487
9105B8487l6899n7470M8424Q675k1813J1267q41j115M7826K2940J9024k7431n3033
$$ 28487 -8412 -65882 -17458 -8783 -30596 -19329 -20170 -21285 26541 49481 68505 41074 -11959
9092a1959o821L2098L7270k8686m5505M6676Q882l8014r3396j3044L7614K1817
$$ -11959 -18780 13318 50588 21902 -23603 23073 31955 -6059 -99455 -112499 -74885 -53068
9080e3068J1205P9525r588l6743m6079M8370M5799r106m4659j9426j7878L4372
$$ -53068 -41863 37662 28074 -8669 -54748 -6378 39421 30315 -14344 -33770 -51648 -17276
9068a7276o092L469P516o092R044j4164n2272Q849Ro514l5457N445J6120P8194
$$ -17276 -23368 -19899 -12383 -18475 -9431 -23595 -75867 -67018 -67009 -73523 -108980 -103535 -87415 -9221
9054i221L2452l8155l2861K5630m370O9199M4576j6679J4088m4661l9317N3836
$$ -9221 23231 -14924 -47785 -22155 -26525 42674 87250 70571 84659 39998 681 54517
9042E4517P035k4686m80k2415j0824m213J4733L2050l2370o2512p73l331o0412
$$ 54517 61552 36866 36386 13971 3147 -1066 13667 45717 13347 -49165 -49938 -53269 -113681
9029a13681L5457L2939P0827L0335j0707n9185j2914M2898O2258K67l0059m0534
$$ -113681 -78224 -45285 25542 55877 45170 -14015 -26929 15969 78227 78494 48435 7901
9017G901j1887K6216O102m2553M5685K9910j750m4146k1036M3164m6282l8290
$$ 7901 -3986 22230 28332 -14221 31464 61374 59624 15478 -5558 37606 -8676 -46966
9005d6966L6138M5455L2870K9697J6614n0545m6481k914J4961R724j780r459J2915
$$ -46966 -10828 34627 67497 97194 113808 63263 16782 13868 28829 38553 36773 27314 40229
8992D0229k2162o0133l0538j9163r661N0161J9589J0908L9782p653K4956O539
$$ 40229 18067 -42066 -72604 -91767 -101428 -51267 -31678 -20770 19012 11359 36315 42854
8980D2854N1989r916k0269j6836k8519l9107K5266N6492L4384o512m8658m5894
$$ 42854 94843 84927 64658 47822 19303 -19804 5462 61954 96338 89826 41168 -4726
8968d726j8161J645J5218J5831K725k9222j3110l305O3277J212o9901p98k5665
$$ -4726 -22887 -21242 -6024 9807 12532 -16690 -29800 -33105 30172 31384 -38517 -39315 -64980
8955f4980L5508J8218m6455J7311K3640o5807k3168j1703L3234L0728L9770Q14
$$ -64980 -29472 -11254 -57709 -40398 -16758 -82565 -105733 -117436 -84202 -53474 -13704 -12890
8943a2890n7338j29l8076k774M8285L6326Q644K9171j3250l5085M6093N2264P7511
$$ -12890 -70228 -70357 -108433 -111207 -62922 -26596 -17952 11219 -2031 -37116 8977 61241 138752
8930A38752L6502K4053J1086m3957o3661o6132j8066K6955L4599l235k5928P990
$$ 138752 175254 199307 210393 166436 102775 36643 18577 45532 80131 76896 50968 58958
8918E8958q992m5649m4909m538K3695O0968L9368m66l1085k7629J8644j7747l889
$$ 58958 49966 4317 -40592 -45130 -21435 39533 78901 78435 47350 19721 38365 20618 16729
8905A6729k832l8667l0043L5261O8860q935k9345j0480n0781m6432R1313J8511
$$ 16729 13897 -24770 -54813 -19552 49308 40373 11028 548 -50233 -96665 -5352 13159
8893A3159k6471j7093k7811L2229j1567M4894K0087J1280J8438J0731m7526l1035
$$ 13159 -13312 -30405 -58216 -25987 -37554 7340 27427 38707 57145 67876 20350 -10685
8881a0685J5657j6133M0066M2523p360k9295L479j1473O699R901L5474j2699J1034
$$ -10685 4972 -11161 28905 71428 64068 34773 38252 26779 33478 43379 78853 66154 77188
8868G7188j2755k6318j1917J3761O225n199K5614Q064k6540J5607N4784J3516
$$ 77188 64433 38115 26198 39959 46184 40985 66599 74663 48123 63730 118514 132030
8856A32030l6124o3816o7106M518J2460k0265k6554l7256P779N8362M5854Q233
$$ 132030 95906 32090 -35016 -30498 -18038 -38303 -64857 -102113 -94334 -35972 9882 18115
8844A8115J7893J9588J1094Q262L616r0395M514J0978j305j996K6254k3082m6443
$$ 18115 36008 55596 66690 74952 78568 -11827 -7313 3665 2360 364 26618 3536 -42907
8831d2907K6828N3030K3973K3395K2950r352M621P8896P7556Q095m1661k3848
$$ -42907 -16079 36951 60924 84319 107269 97917 102538 181434 258990 267085 225424 201576
8819B01576l5056Q4804N9223J3763L5149L4835J28119J99513J60631J94562K00709
$$ 201576 166520 251324 310547 324310 359459 394294 522413 721926 882557 1077119 1277828
8808A277828Q5596L3226j02209j77765j85881j87961j54688j01137q8496m4685
$$ 1277828 1363424 1396650 1294441 1116676 930795 742834 588146 487009 398513 353828
8798C53828K9830M3170m7688q6078m7036k4443K9979K997j3340k6472m1064N4777
$$ 353828 383658 426828 379140 293062 246026 221583 251562 254559 241219 214747 173683 228460
8786B28460J0574m3637p878J9607J8691l3386N5352L3450j0887L4400L3704N5979
$$ 228460 239034 195397 187519 207126 225817 192431 247783 281233 270346 304746 338450 394429
8774C94429Q1934J163O5405Q8814J22887J83000K34350K75939L81156M03522L64644
$$ 394429 476363 477526 542931 631745 754632 937632 1171982 1447921 1829077 2232599 2597243
8763B597243J71699q7405l06646l65032l66092l65922k83118k10651j42398j04602
$$ 2597243 2768942 2681537 2374891 2009859 1643767 1277845 994727 784076 641678 537076
8753E37076n2994j9165n9059m8978o238l771J8708k491k0914j6597m2559l2463
$$ 537076 484082 464917 405858 356880 350642 346871 365579 363088 342174 325577 283018 250555
8741B50555J1173L6659l3775l0497M760j1772l4429r855K6433J2106j6640P2858
$$ 250555 261728 298387 264612 234115 238875 227103 192674 182819 209252 221358 204718 277576
8729B77576J0467N5495L6838l7327J00253J75382J52841J99023J60717J45401
$$ 277576 288043 343538 380376 343049 443302 618684 771525 970548 1131265 1276666
8719A276666R8388m0195j19593j49209j55526j51539k10149p5119m2049q4148
$$ 1276666 1375054 1334859 1215266 1066057 910531 758992 548843 473724 431675 347527
8709C47527L771O264J13j5291m2255n6815j6739q900L7646l3507J8295J8485j5253
$$ 347527 351298 357562 357675 342384 300129 243314 226575 217675 255321 221814 240109 258594 243341
8696B43341J5957M1508k2829k737J3738j621m306J5818K2358k7749N2797N486
$$ 243341 259298 300806 277977 275240 288978 287357 283051 298869 321227 293478 346275 351761
8684C51761k5393J7713j5190o4583J3057J7552l4736o7894P655m007L8465j8299
$$ 351761 326368 344081 328891 264308 277365 294917 260181 192287 199942 195935 234400 216101
8672B16101k3559r534k9918j2564j6580J0172L1723j2725O2775P201O883K6388
$$ 216101 192542 183008 153090 140526 123946 134118 165841 153116 215891 223092 229975 256363
8660B56363N6499J6035N5475J0533q3085m0383k323R082L1179J3787N4818k7072
$$ 256363 312862 328897 384372 394905 311820 271437 269114 278196 309375 323162 377980 350908
8648C50908j10J05619R0726J0195k6233m3300n660Q550j7337L6417Q168J1223
$$ 350908 350798 456417 547143 557338 531105 487805 482145 490695 473358 509775 517943 529166
8636E29166J056m0829j1840o2654m8600O6934K5392Q559K8734K5089K4274N3324
$$ 529166 530222 489393 477553 414899 366299 433233 458625 467184 495918 521007 545281 598605
8624E98605R8949M7766J32762R4832R9121J52109K24550K23615J97280L1943j01486
$$ 598605 697554 745320 878082 972914 1072035 1224144 1448694 1672309 1869589 1901532 1800046
8613A800046k31908k72675k01278j63555j50388q615K919r582k0439N1731M1007
$$ 1800046 1568138 1295463 1094185 930630 780242 771627 774546 764964 744525 796256 837263
8602H37263k5964l5466K1338q639n8774l4683L5280L0995N3008l6585j2831L9260
$$ 837263 811299 775833 797171 788532 729758 695075 730355 761350 814358 777773 764942 804202
8590H04202J15179k5738p4078M5343J06167O7262P3737N2029Q3082J23618R0480
$$ 804202 919381 893643 819565 864908 971075 1038337 1112074 1164103 1247185 1370803 1461283
8579A461283J25293J59597J77329K27136L04319L58547M51256M43329L56368j9005
$$ 1461283 1586576 1746173 1923502 2150638 2454957 2813504 3264760 3708089 4064457 4045452
8569D045452l75467n28602n87300n12091l68721k33169k20888k12871q5639Q349
$$ 4045452 3669985 3141383 2554083 2041992 1673271 1440102 1219214 1006343 920704 929053
8559I29053k8406m0304k6473l0952k9827n808l3754K815k1713j12615l8814M896
$$ 929053 900647 860343 833870 802918 773091 767283 733529 736344 714631 602016 563202 568098
8547E68098K2234m6215m2377K1302N2433k2445M8230O2593k3014n2057j7303J5858
$$ 568098 590332 544117 501740 523042 575475 553030 601260 663853 640839 588782 571479 587337
8535E87337Q6024Q8587J29030Q0394P0848J33864J45276K19775K26433R3477q862
$$ 587337 673361 761948 890978 971372 1042220 1176084 1321360 1541135 1767568 1861045 1852183
8524A852183j95708k71329k24835j70143j34708r7328j43886r0193n3396m5629
$$ 1852183 1656475 1385146 1160311 990168 855460 758132 614246 524053 470657 425028
8514D25028k9571J9600L0157j6584j4652M4875n1823o848k3229p7712j6414N5533
$$ 425028 395457 415057 445214 428630 413978 458853 407030 400182 376953 299241 282827 338360
8502C38360l9431q4185L3526L5958l4929n219M8842P0348m2374q4381j1013r489
$$ 338360 298929 214744 248270 284228 249299 244080 292922 363270 320896 236515 225502 216013
8490B16013l184m9979k8719j026K0713J3313k3697J9903K640J302L8845p423M1500
$$ 216013 212829 162850 134131 133105 153818 167131 143434 163337 165977 167279 206124 198701 240201
8477B40201k3461n5833L2070J842M8334k2672o4841K8189J3897j9008O5519P4287
$$ 240201 216740 160907 192977 194819 243153 220481 155640 183829 197726 178718 244237 318524
8465C18524K8597o2155n3056r165k3935j0809P337J2865j4301k9075j8593J9378
$$ 318524 347121 284966 231910 222745 198810 188001 195338 208203 193902 164827 146234 165612
8453A65612N8651l4400j1742l1142j9669M9925N4531K1964l0057m9677n8087k4538
$$ 165612 224263 189863 178121 146979 127310 177235 231766 253730 223673 173996 115909 91371
8441I1371l5542O1849K5340l3791j2063N6100M5557n8396l8199K8692M630m726
$$ 91371 55829 117678 143018 109227 97164 153264 198821 140425 102226 130918 135548 130822
8429A30822O6815L9882J1999p457l8125j2705o9324K7806N032j7797p287k8904
$$ 130822 197637 237519 249518 242061 203936 191231 121907 149713 154745 136948 129661 100757
8417A00757k0355P4754L7364P810n4011m8569k1187M988k1489n2748j1389M8803
$$ 100757 80402 155156 192520 200330 146319 97750 76563 81551 60062 7314 -4075 44728
8405D4728K4274q505l0331k3917P561N890J6065J9452L1924j9253L8521O2079
$$ 44728 69002 60497 30166 6249 13810 19700 35765 55217 87141 67888 106409 168488
8393A68488l6808l6130K6221J6749k0001J1162O7066L727J4084m5228n138K8520
$$ 168488 131680 95550 121771 138520 118519 129681 196747 200474 214558 169330 164192 192712
8381A92712J7579p8054j14109j4228j5226O451K2526M0037l1453O968j3437m8215
$$ 192712 210291 132237 18128 3900 -11326 -4875 17651 57688 26235 33203 19766 -28449
8369b8449j8272L2799K6031N706R179K6366m604L06k0925l4284l5291K7125O5567
$$ -28449 -46721 -13922 12109 17815 26994 53360 48756 49062 28137 -6147 -41438 -14313 51254
8356E1254p3898J2711O2556K0179R395J4593k1178j4408j5262k7132j6723k1205
$$ 51254 -22644 -9933 52623 72802 82197 96790 75612 61204 45942 18810 2087 -19118
8344a9118M3276L3257P0274O8622J3736N1685K0787j8238o6945j02907m7473L6277
$$ -19118 24158 57415 127689 196311 210047 261732 282519 264281 197336 94429 46956 83233
8332H3233k6490K6912J9307p6936n987L8131l715o742r7068l3710L6913O3873
$$ 83233 56743 83655 102962 26026 20039 58170 54455 47713 -49355 -83065 -46152 17721
8320A7721K7303k1198k6338j1467J7963O4310l5255J1027m007l0382J4341o1098
$$ 17721 45024 23826 -2512 -13979 3984 68294 33039 44066 40059 9677 24018 -37080
8308c7080m1496O5281K0802k57K4653J4147N6630K8666J1472k5679L2981O0121
$$ -37080 -78576 -13295 7507 7250 31903 46050 102680 131346 142818 117139 150120 210241
8296B10241M7310N5983N4809l6578q3987n6985m6754m7072m0941k6459J4766L8110
$$ 210241 257551 313534 368343 331765 247778 190793 144039 96967 56026 29567 44333 82443
8284H2443J7806l5697O730L787m3161n8913l8468K4395L7618Q522l7630M0807
$$ 82443 100249 64552 71282 75069 31908 -27005 -65473 -41078 -3460 5062 -32568 8239
8272H239L5703j1329k3521O195J9502j6797m0459k0183K152J8373J7862L9125
$$ 8239 43942 32613 9092 15287 34789 17992 -22467 -42650 -40498 -22125 -4263 34862
8260C4862l6994J4307L4987L818m177k9479N7037J04833R277J375J9551j2853
$$ 34862 -2132 12175 47162 50980 46803 17324 74361 179194 188471 189846 209397 196544
8248A96544o7904n0356N455K0946j1102n2627n5291K6310M892Q988n009l8446
$$ 196544 128640 78284 83739 104685 93583 40956 -14335 11975 16867 25855 20846 -17600
8236a7600K4928m992M4146P827n7240K7850M1337j4677j9529j4876j5417o1083
$$ -17600 7328 2336 46482 54309 -2931 24919 66256 51579 32050 17174 1757 -59326
8224e9326j397K6462K586k0665L3729L3808N141m662m0651n638L2177J4653k1171
$$ -59326 -60723 -34261 -31675 -52340 -18611 15197 20338 15676 -24975 -30613 1564 16217 -4954
8211d954m2591J1128K9044N658L9049M9015l038n4810j3436L9283k5276r195p0277
$$ -4954 -47545 -36417 -7373 -1715 37334 86349 83311 28501 15065 54348 29072 19877 -50400
8198e0400m9646N2404P732J9290k2360j7077L2003L1514j330J8617K1481K6220
$$ -50400 -100046 -47642 -39910 -20620 -42980 -60057 -28054 3460 2130 20747 42228 68448
8186F8448k1611m8511n2200j0862k74K6752J5736k6956r665N0825J8319p308k0609
$$ 68448 46837 -1674 -53874 -64736 -65010 -38258 -22522 -49478 -59143 -8318 10001 2693 -17916
8173a7916o468J1218j0K5224p089l9973M24l2899M7378Q1424n6924j3422P4392
$$ -17916 -24384 -13166 -13176 12048 4959 -35014 -34590 -67489 -20111 61313 4389 -9033 65359
8160F5359K6930k362l3833J7411K8262R39k9444l6026k2241n692j0254M657N0412
$$ 65359 92289 89927 56094 73505 101767 102706 73262 37236 14995 9303 -951 3706 54118
8147E4118k3772o5906n6856M8591N7936n1221k0945J3013j532O8477l102m8913
$$ 54118 30346 -35560 -92416 -43825 14111 -37110 -58055 -45042 -46574 21903 18801 -30112
8135c0112k9915L1612J7665l8781L437L6916k5535j0080L2969j0313j2481p78
$$ -30112 -60027 -28415 -10750 -49531 -46094 -9178 -34713 -44793 -11824 -22137 -34618 -35396
8123c5396J3522j8087K0442N4636j0568k3138j784l501J9673k3181k383k3510
$$ -35396 -21874 -39961 -19519 35117 24549 1411 -373 -3874 15799 -7382 -9765 -33275
8111c3275p086M5952n389j5439P269q4432J6544P1684l2618K5660r39j1996n363
$$ -33275 -40361 5591 202 -15237 -7968 -92400 -75856 -4172 -36790 -11130 -12069 -24065 -29428
8098b9428K1883O0080L7810k6568o4659q869k1066L5294J7993L7396l7426n0030
$$ -29428 -7545 52535 90345 63777 -882 -9751 -30817 4477 22470 59866 22440 -27590
8086b7590k3098K90n2929o7503J2909P8051L6669p8766R616K7969K087J0549K8072
$$ -27590 -50688 -50398 -103327 -170830 -157921 -79870 -43201 -121967 -112351 -84382 -82295 -71746 -43674
8073d3674L4957J2441J2747K740M7047N5207J9096l4609k4285k2141j1227j6747
$$ -43674 -8717 3724 16471 19211 66258 121465 140561 105952 81667 59526 48299 31552
8061C1552N35N868M5023p71j6634j08286q4776N4340K8704J7229j1927k3977l1379
$$ 31552 32087 37955 82978 82207 65573 -42713 -127489 -73149 -44445 -27216 -39143 -63120 -94499
8048i4499j2695O8494O9548k7230j3203o5174M8296O9545J8075k7169K9991j3958
$$ -94499 -107194 -38700 30848 3618 -9585 -74759 -26463 43082 61157 33988 63979 50021
8036E0021m5097o7045l2792L8266P5736K4505o6489j9667k2017K6569M8837J4226
$$ 50021 4924 -62121 -94913 -56647 19089 43594 -22895 -42562 -64579 -38010 10827 25053
8024B5053l661k9401O422L0543Q7052K873m2212k6601j2463j7741k9072M3703
$$ 25053 21392 -8009 -1587 28956 116008 118881 76669 50068 37605 19864 -9208 34495
8012C4495J6619m3496L5227J1474l9454j7410K7708K8779K8291o005K9896N397
$$ 34495 51114 7618 42845 54319 14865 -2545 25163 53942 82233 76228 106124 111521
8000A11521K0745p0185k8293j447k0833l4212P77N4545J2127l9090K6990N2595
$$ 111521 132266 62081 33788 32341 11508 -22704 -21927 32618 44745 5655 32645 85240
7988H5240N5151j07676l8442J6802m655k1700l880K5696l438j0519M442L9349
$$ 85240 140391 32715 -5727 11075 6420 -15280 -19160 6536 3098 -7421 -2979 36370
7976C6370k8769K2030N7584J0082n4797L9690K3135j7927p5256K8986M0564M5785
$$ 36370 7601 29631 87215 97297 42500 82190 105325 87398 12142 41128 81692 127477
7964A27477l5153j0274P132R384m6188j4193J3722m9947m8919K2028N6804O753
$$ 127477 92324 82050 89182 98566 52378 38185 51907 1960 -46959 -24931 31873 38626
7952C8626j6937M613J5496m1408M316o234l0580l498O1729m928n7491k7185R726
$$ 38626 21689 26302 41798 390 4706 -1528 -32108 -35606 26123 21195 -36296 -63481 -53755
7939e3755r099k4539O4517Q7320J8601q772K8032J2077o4962o290n14l844o760
$$ -53755 -62854 -87393 -22876 64444 83045 74273 102305 114382 49420 43130 42616 38772 32012
7926C2012M4292o0535M356K4520k3704j5740K1524J236J4570M442m1445m0476
$$ 32012 76304 15769 20125 44645 20941 5201 26725 27961 42531 46973 5528 -34948
7914c4948J9670J7196k7489M6627J2630K694K3784K469k615m9904o8319l2270
$$ -34948 -15278 1918 -25571 21056 33686 36380 60164 62633 60018 10114 -58205 -90475
7902i0475J9051K3363J9214N9759l3724l6769k0031J2439o752k1988O0638R6m5984
$$ -90475 -71424 -48061 -28847 30912 -2812 -39581 -59612 -47173 -53925 -75913 -15275 -15179 -61163
7889f1163k2005R6478K1458J4750J7117m8187q6361j413K4582p205R66N0577j5145
$$ -61163 -83168 13310 34768 49518 66635 18448 -67913 -69326 -44744 -51949 -50983 -406 -15551
7876a5551J5155n72l2377O464k7791N3889R2807j2400j02079j8248L6812K5770
$$ -15551 -396 -968 -33345 -26881 -54672 -783 92024 79624 -22455 -40703 -3891 21879
7864B1879j1000j3550L7283l5656j6711M1355l735J5039j5394o379L6244J5029
$$ 21879 10879 -2671 34612 -1044 -17755 23600 19865 34904 19510 13131 49375 64404
7852F4404k2212j2079J7908l618L8708m8447m8480N949J08156Q765m3522j26956
$$ 64404 42192 30113 48021 44403 83111 34664 -13816 -7867 100289 109054 65532 -61424
7840f1424q7211K9355J5941j3615L0470k6818j1516K4010J4136K8938L7164R9041
$$ -61424 -148635 -119280 -103339 -116954 -86484 -113302 -124818 -100808 -86672 -57734 -20570 78471
7828G8471L1956n5081p6149K931N2026J298l8668o922N8605q19J9548l6847j2419
$$ 78471 110427 55346 -20803 -17872 34154 35452 -3216 -10138 48467 47648 67196 30349 17930
7815A7930p38k6245j1658k5144L8186K9615o6414n924J1394p2610Q261L2591M1919
$$ 17930 17192 -9053 -20711 -45855 -7669 21946 -44468 -50392 -38998 -111608 -103347 -70756 -28837
7802b8837O2508L085k2044o8084q1747K2716L9704L0259M9591k4024n8500l8212
$$ -28837 33671 36756 14712 -53372 -135119 -112403 -72699 -42440 7151 -16873 -75373 -113585
7790a13585q7J0662M685N3053J5632q934R67m896o6586l3782M0628M8508j3265
$$ -113585 -113672 -103010 -98325 -45272 -29640 -38574 -37607 -42503 -109089 -142871 -102243 -53735 -67000
7777f7000K400J9048M438M6556K0185j4506m3337L205l1165M2395k328n657M511
$$ -67000 -64600 -45552 -41114 5442 25627 11121 -32216 -29011 -60176 -17781 -20109 -25766 -21255
7764b1255m1677p4036k8086j219N0130J8112L2184m0064R700N0443j3285m7382
$$ -21255 -62932 -136968 -165054 -166273 -116143 -98031 -65847 -105911 -96211 -45768 -59053 -106435
7752a06435M2526K8129n6805m7197R596K475K3020N6440L3405N5489j8495n4738
$$ -106435 -63909 -35780 -92585 -139782 -130186 -127711 -104691 -48251 -14846 40643 22148 -32590
7740c2590n474l7986l636L5388M557N4490j9040L0244K7901Q963n4171p898j8834
$$ -32590 -38064 -76050 -79686 -44298 -39741 14749 -4291 25953 53854 62817 8646 748 -18086
7727a8086J6882m367k3166K6865L5691K2582L558k7563J0020k7493O95J6050n7616
$$ -18086 -1204 -5571 -28737 -1872 33819 56401 59959 32396 42416 14923 15618 31668 -25948
7714b5948k5636p793J3635N2619k5461p9103k086J686J12466L9349J3574J1785
$$ -25948 -51584 -59377 -45742 6877 -18584 -97687 -99773 -98087 14379 53728 67302 79087
7702G9087l2178k1460k5853k6929j9418P3305N4571l0323k4184m5362j0393K8928
$$ 79087 46909 25449 -404 -27333 -46751 26554 81125 50802 26618 -18744 -29137 -209
7690b09J9023J504p083L6731l517q4775J3132M6127m719o4790m3813M0698P4141
$$ -209 18814 20318 13235 49966 46449 -38326 -25194 20933 16214 -48576 -92389 -51691 22450
7677B2450M2498L7699N798n5597K0340p200k920J3508j3358l1359L5980m6952
$$ 22450 64948 102647 108445 52848 73188 65988 63068 76576 63218 31859 67839 20887
7665B0887l2071K8021K0862J5098k5060j774m708L1149j853m5872n736p210K8837
$$ 20887 -11184 16837 37699 52797 27737 25963 21255 52404 50551 4679 -1057 -8267 20570
7652B0570n494K4039k3864n562n2676M8521M3706m9931J9523j7619j5096K8092
$$ 20570 15076 39115 15251 9689 -42987 5534 49240 -691 18832 1213 -13883 14209
7640A4209O4678J705m7761m9427m3799K3206K1293J4027J1751K384L5158j5022
$$ 14209 78887 80592 32831 -16596 -60395 -37189 -15896 -1869 9882 12266 47424 32402
7628C2402n8157J487j0809j5190K222j791o010j1388M256M8181k1662k443K6480
$$ 32402 -25755 -24268 -35077 -50267 -48045 -49836 -55846 -67234 -62978 -14797 -36459 -38902 -12422
7615a2422j9635m6063K4108O4977k0274l2957O335J5693l2267j0401l89J1770
$$ -12422 -32057 -78120 -54012 10965 -9309 -42266 -35931 -20238 -52505 -62906 -63295 -51525
7603e1525L3830M1749M191j7204k1978m364j7637k8506M3754k3234l3833L9573
$$ -51525 -17695 24054 28245 11041 -10937 -15301 -32938 -61444 -17690 -40924 -74757 -35184
7591c5184J00882k4283l078l938o7497q8991k2283J0636M3331K332N3049M9389
$$ -35184 65698 41415 38337 34399 -33098 -122089 -144372 -133736 -90405 -88073 -35024 14365
7579A4365O6347J5363r691k7119J217o981p316K1346m2678l2205p6325m6683L5462
$$ 14365 80712 96075 86384 59265 60482 53501 46185 67531 24853 -7352 -83677 -130360 -94898
7566i4898R4340J7046m4194k3366l3007K2966O0908J9729J5174J9187p4293n6142
$$ -94898 -558 16488 -27706 -51072 -84079 -61113 -205 19524 34698 53885 -20408 -76550
7554g6550J6324K5777j7722R278L9784m028p699L3407k9182o3612j0735N6253
$$ -76550 -60226 -34449 -52171 -42893 -3109 -7137 -14836 18571 -10611 -74223 -84958 -28705
7542b8705o5042l997L4941k0233L9340M7668J0036k8824o907J0909k997L4085
$$ -28705 -93747 -97744 -62803 -83036 -43696 3972 14008 -14816 -21723 -10814 -13811 20274
7530B0274K1545K0974m6037m7893p4050J0398J3567K8565M0853J3256l2744k3016
$$ 20274 41819 62793 16756 -31137 -105187 -94789 -81222 -52657 -11804 1452 -31292 -54308
7518e4308K8853J0604l7082k2538N4928L4655q488m7260N5921L5461J1233m0208
$$ -54308 -25455 -14851 -51933 -74471 -19543 15112 6624 -40636 15285 50746 61979 21771
7506B1771n9097k308M5676K1462l7620p0791m3900l2253L2865N1402O2208k2504
$$ 21771 -37326 -39634 6042 27504 -10116 -80907 -124807 -157060 -124195 -72793 -10585 -33089
7494c3089P183j4382M6566O7403j2714q0806Q590N1933n516J0201M0598j013j9356
$$ -33089 -25906 -40288 6278 73681 60967 -19839 -11249 40684 35168 45369 85967 84954 65598
7481F5598o1473k0350J2174k8752K5741J8661N1076L6161p3941n2463M1363n1598
$$ 65598 4125 -16225 -4051 -32803 -7062 11599 62675 98836 24895 -27568 13795 -37803
7469c7803j1498j9892m8721J4422L9231K5028j2192l7216K2121J02112m3336k0249
$$ -37803 -49301 -69193 -117914 -103492 -64261 -39233 -51425 -88641 -66520 35592 -7744 -27993
7457b7993l364r345n50m4912N837L0710j5539K5144l053M0092Q3872n5389l5133
$$ -27993 -31357 -40702 -41252 -86164 -80327 -49617 -65156 -40012 -43065 -2973 80899 25510 -9623
7444i623n7285j0946K913q79l026L4597K8194M24k8922J2444J3431N8895j1925
$$ -9623 -66908 -77854 -74941 -75820 -78846 -44249 -16055 -15631 -44553 -32109 -18678 40217 28292
7431B8292J2828R578k8064J5178n421o824j9011J3158q990K4051k3678q7392n4963
$$ 28292 41120 50698 22634 37812 32391 25567 6556 19714 10724 34775 11097 -76295 -131258
7418a31258M9275Q9095j5069n3789k3208N9571M4863J3614p642p0487j7518n010
$$ -131258 -81983 7112 -7957 -61746 -84954 -25383 19480 33094 25452 -45035 -62553 -67563
7406f7563j30J5565K87M034J1030j7910l499K9924J2470N6661j8110o3661k9792
$$ -67563 -67693 -52128 -51841 -47807 -36777 -54687 -58186 -28262 -15792 40869 22759 -40902 -70694
7393g0694l510J3933L4904K3220K4156k9617j9704q8292l1865K178J09187Q0183
$$ -70694 -74204 -60271 -25367 -2147 22009 -7608 -27312 -115604 -147469 -145291 -36104 44079
7381D4079P5567j3921j4942r4166J9369j1110n8073M112J013l1921j8297R1903
$$ 44079 119646 105725 90783 -3383 15986 4876 -53197 -49085 -48072 -79993 -98290 -6387
7369f387K5084q058K612n1434j5459K1028J4435r444n238J8307L1183j075J0810
$$ -6387 18697 10639 13251 -38183 -53642 -32614 -18179 -27623 -32861 -14554 16629 15554 26364
7356B6364n991N468k579k6585N5275j2069m0777J0479J6192L7292o591m1913m6318
$$ 26364 20373 25841 23262 -3323 51952 39883 -894 9585 25777 63069 56478 14565 -31753
7343c1753k4317J6572J0737k2250O7837M8032k7318l2539K7837k9162j2104J3173
$$ -31753 -56070 -39498 -28761 -51011 16826 64858 37540 5001 32838 3676 -8428 4745
7331D745k9938l8123K07O6650k1942k6008j4966J992j1485J2587L8216R802J8697
$$ 4745 -25193 -63316 -63109 3541 -18401 -44409 -59375 -57383 -68868 -56281 -18065 -8263 10434
7318A0434J3940k4201j87K7326K4551m9217k4586J6941j6396m4872K4969P7975
$$ 10434 24374 173 -14 27312 51863 2646 -21940 -4999 -21395 -66267 -41298 36677
7306C6677J2817o3153J6072P50J9051R232k6270m2808J5030k1199j3390j4908
$$ 36677 49494 -13659 2413 3163 22214 31446 5176 -37632 -22602 -43801 -57191 -72099
7294g2099M4784M0111K2000K1592j1549m1736n3136K2522k1390k6644l0677o411
$$ -72099 -27315 12796 34796 56388 44839 3103 -50033 -27511 -48901 -75545 -106222 -112633
7282a12633J852O588o706L5596J8851M0727j7648j0115L5003L2725J7146k2803
$$ -112633 -110781 -104193 -110899 -75303 -56452 -15725 -33373 -43488 -8485 24240 41386 18583
7270A8583p3936r5091k3745j2395L840K2421R0788Q2936j8574L5098J1184k798
$$ 18583 -55353 -150444 -174189 -186584 -182744 -160323 -69535 13401 -5173 29925 41109 38311
7258C8311j3374j0972N944N05L2209l6708m7380J0859o35j8031L9917J00233J7984
$$ 38311 24937 13965 19909 20414 52623 15915 -31465 -20606 -21241 -39272 645 100878 118862
7245A18862m2466l2790m4416k3830l6250Q443m951M2416N4476J3102o6304n4477
$$ 118862 76396 43606 -810 -24640 -60890 -52447 -57398 -14982 39494 52596 -13708 -68185
7233f8185Q780j5193R145J6647K2992J0256L8864L4266j0467o679J0632o185j0052
$$ -68185 -59405 -74598 -65453 -48806 -25814 -15558 23306 57572 47105 40426 51058 44873 34821
7220C4821l1317l6642J6315O8357L6850O371n5871o5725m6423J8345L6239k2349
$$ 34821 3504 -33138 -16823 51534 88384 94755 38884 -26841 -73264 -54919 -18680 -41029
7208d1029j0479k9980k1854J3196N9662j8311j3123O489K8368R068l2495k4910
$$ -41029 -51508 -81488 -103342 -90146 -30484 -48795 -61918 -55429 -27061 -17993 -50488 -75398
7196g5398l4731L9277K7536N5L2628O7327K4431j9287J2135M4392r645q6366m375
$$ -75398 -110129 -70852 -43316 -43261 -10633 56694 81125 61838 73973 118365 108720 22354 17979
7183A7979j9959J9009k8547J2279L4626j7137q4062L0492L7454l82P0502K1379
$$ 17979 -1980 17029 -11518 761 35387 18250 -65812 -35320 2134 1752 72254 93633
7171I3633p3997l3853M3265r425L501j7819q090P177L0893M4070l0428L1168o033
$$ 93633 19636 -14217 29048 19623 23124 5305 -2785 4392 35285 79355 48927 80095 74062
7158G4062l3682l7583K9570K4316j6601n0428L5433r983K182r277r092M0506M413
$$ 74062 40380 2797 32367 56683 40082 -10346 25087 15104 17286 8009 -1083 39423 43836
7145D3836L0788k2636l0684R188J0103J8986j2970n083K2078K0959l1244K1409
$$ 43836 74624 51988 21304 30492 40595 59581 46611 41528 63606 84565 53321 74730
7133G4730K1851n5143O415m6998l0545k3410L7233K1447K4145J6419m1881k8226
$$ 74730 96581 41438 47853 855 -29690 -53100 -15867 5580 29725 46144 4263 -23963
7121b3963K5595N334K0672m0440l650k8251l3989M3109l2875k7303k5274N7347
$$ -23963 1632 6966 27638 -12802 -16452 -44703 -78692 -35583 -68458 -95761 -121035 -63688
7109f3688L4369N4702M0363J7879l1367m1292J788L9541Q132l8016l6833m8659
$$ -63688 -29319 25383 65746 83625 52258 10966 12754 52295 60427 22411 -14422 -63081
7097f3081k6337n3115o1567N1538K5398M5167O2838k1264j2300N367L6194J8093
$$ -63081 -89418 -142533 -204100 -152562 -127164 -81997 -19159 -40423 -52723 -47356 -11162 6931
7085F931M65n436m3198J2825J655j4769j6845L4825l2591l3822j1390N4881K9223
$$ 6931 7396 1960 -41238 -28413 -26758 -41527 -58372 -23547 -56138 -89960 -101350 -46469 -17246
7072a7246K1309j4682J7404k2029k1905j0425L181L208l6367j2289P0078J1596
$$ -17246 4063 -10619 6785 -15244 -37149 -47574 -44393 -41185 -77552 -89841 -19763 -8167
7060h167L1416K969j3606K4275j3312k1298L3473J1494m6521j2757J9571j809
$$ -8167 23249 26218 12612 36887 23575 2277 35750 47244 723 -12034 7537 5728
7048E728l9397q19p358o4183r485P2273O322l1746K6393M9610N475L4954p665
$$ 5728 -33669 -34488 -41846 -106029 -115514 -43241 -36919 -68665 -42272 7338 12813 47767 40102
7035D0102l450k0200p0084k75k5028J0122J1061j2495L2908n004K7770N9487l6899
$$ 40102 36652 16452 -53632 -53907 -78935 -68813 -57752 -70247 -37339 -42343 -14573 44914 8015
7022H015m0924J6912O3716L0180m2715l941O4004q0478j0060K8558o1539o1167
$$ 8015 -32909 -15997 47719 77899 35184 31243 95247 14769 4709 33267 -28272 -89439
7010h9439J3810P9316N0325J3838j1740n3993o3029k0525K4508R9503J9604l8143
$$ -89439 -75629 3687 54012 67850 56110 2117 -60912 -81437 -56929 42574 62178 24035
6998B4035l4441k413P1669o2953m9548J6600L2802p493j0048k821K7114k3453
$$ 24035 -10406 -12819 58850 -4103 -53651 -37051 -4249 -11742 -21790 -24611 2503 -20950
6986b0950q7992J6217K633K413L8508K2278q821n4728m3079j388K0919M3984P4373
$$ -20950 -108942 -92725 -90092 -87679 -49171 -26893 -35714 -90442 -133521 -134909 -113990 -70006 4367
6973D367N159n1925q459l0601N1077O0415j6068j2131n743j3343N391J6277m9914
$$ 4367 9526 -42399 -50858 -81459 -30382 30033 13965 1834 -3909 -17252 -11861 4416 -45498
6960d5498o472o871N3274L9163o8122j7778K5740K9178M9714k4928n6393m0557
$$ -45498 -51970 -58841 -5567 33596 -34526 -52304 -26564 2614 52328 27400 -28993 -69550
6948f9550J4773j5391J1477k2968N971j0001K1031K7687L9140N6379j35m7461
$$ -69550 -54777 -70168 -58691 -81659 -75688 -85689 -64658 -36971 2169 58548 58413 10952
6936A0952n3307m23j7687O4650K1496l8192m454j5908L4512L7592p410j4384Q973
$$ 10952 -42355 -42778 -60465 4185 25681 -12511 -16965 -32873 1639 39231 31821 17437 26410
6923B6410J5669j8083N473N2244j5204o4520l6752L884J7502l3908J0686N8730
$$ 26410 42079 23996 29469 81713 66509 1989 -34763 -30879 -13377 -47285 -36599 22131
6911B2131l2342J8051N5749N226k5005k5095r441k1737J939M274L7670K6194K0590
$$ 22131 -10211 7840 63589 68815 43810 18715 9274 -12463 -10524 -6250 31420 57614 78204
6898G8204m9026o9197j9122P0382K620m2048j0839J2009L8483N0771P1116o3326
$$ 78204 29178 -40019 -59141 11241 13861 -28187 -39026 -27017 11466 62237 133353 70027
6886G0027j42252o6592N928M0767K9698M9842N0147j3166j2276K1721j890n8510
$$ 70027 -72225 -138817 -132889 -92122 -62424 -12582 37565 24399 12123 33844 31954 -26556
6874b6556k539l6358j6301O8751L0756j9546j8867K0988M1408L8102k9796j5760
$$ -26556 -29095 -65453 -81754 -13003 17753 -1793 -20660 328 41736 79838 50042 34282
6862C4282l7988j7533j6988k0752L8486J77L6719k6388k9553j5423j4554j44l396
$$ 34282 -3706 -21239 -38227 -58979 -20493 -20316 16403 -9985 -39538 -54961 -69515 -69659 -73055
6849g3055R146J2782n765p597L6562K5868l44J0607N593p2932m1276M461N2364
$$ -73055 -63909 -51127 -56892 -64489 -27927 -2059 -2403 8204 13797 -59135 -100411 -95950 -43586
6836d3586J3789L9566m199k3414q089M2507j7787m2249j9629P785K6049N506j5665
$$ -43586 -29797 9769 5570 -17844 -25933 16574 -1213 -43462 -63091 -55306 -29257 -23751 -39416
6823c9416P5405R709q5781K7581N7655j3738j5653o7956l5070k579j0882K6841
$$ -39416 35989 45698 -40083 -12502 45153 31415 15762 -52194 -87264 -89843 -100725 -73884
6811g3884M3983L8004k2433o0842j056L6459n211P10L9997J9307j3647j4180Q688
$$ -73884 -29901 8103 -14330 -75172 -76228 -39769 -44980 -44270 -4273 15034 1387 -12793 -4105
6798d105n5206J8286J7006l4969J2669j0930J6181L2183J1287R322j386p36N5924
$$ -4105 -59311 -41025 -24019 -58988 -46319 -57249 -41068 -8885 2402 11724 10338 9602 65526
6785F5526J05523m2125l6142o2500l9855M6071k867j945j1684J416L2325J8719
$$ 65526 171049 128924 92782 30282 -9573 36498 33631 31686 20002 21418 53743 72462
6773G2462m9193N98M0760n588l9888n6118q1018K2044M2881n788R701N7030q3
$$ 72462 23269 23867 64627 59039 19151 -36967 -117985 -95941 -53060 -58848 -49147 7883 7800
6760G800k503J9721j0449m9893K512j4357k1598N2963P0780n553l0579m3446J7047
$$ 7800 5297 25018 14569 -35324 -32812 -47169 -68767 -15804 54976 49423 18844 -24602 -7555
6747g555J6994l0908k0530L840M1578M674J125k999j4004l8086L0696M8180N8808
$$ -7555 9439 -21469 -41999 -38159 3419 8093 9218 6219 -7785 -45871 -15175 33005 91813
6734I1813Q870K4488k155r9590l3886J520l7122J3549r174j1811P2309n773N618
$$ 91813 100683 125171 123016 23426 -10460 -8940 -46062 -32513 -41687 -53498 18811 13038 18656
6721A8656k6358m6734K4053Q822K2311K8446L8226m0087p3763n810N7j2465K1579
$$ 18656 -7702 -54436 -30383 -21561 750 29196 67422 27335 -46428 -52238 -52181 -64646 -43067
6708d3067j7580J4251L9849K8551J3064m5147m6549m1950N0650K7504L4801l4964
$$ -43067 -60647 -46396 -6547 22004 35068 -10079 -56628 -98578 -47928 -20424 14377 -20587
6696b0587K3506O661l5620o1963L1864R2876l9544J7276N9854K3701k4839n6241
$$ -20587 2919 9580 -26040 -88003 -56139 36737 -2807 14469 74323 98024 73185 16944
6684A6944P257r147J9941j2551m47j162M500o5272j8655M2160K662j204k1096
$$ 16944 24201 15054 34995 22444 21997 20835 25335 -39937 -58592 -16432 -13770 -14974 -36070
6671c6070p445o292l989o836J2994Q865K6665K5065j6678m7108M8560N9088K1608
$$ -36070 -43515 -49807 -53796 -60632 -47638 -38773 -12108 12957 -3721 -50829 -2269 56819 78427
6658G8427m1592K6344K2161k0651q774k6918k2093l2950l1424O675M0828J7669
$$ 78427 36835 63179 85340 64689 55915 28997 6904 -26046 -57470 -50795 -9967 7702
6646G702j3647m162j7837l3467O2340k2040O950N0583N396l1691k0014m3862J65
$$ 7702 -5945 -10107 -27944 -61411 929 -21111 -14161 36422 41818 10127 -9887 -53749 -53584
6633e3584K2347N4287J7174J005L5281k5687n8346n5518K5567k9612n591k4288
$$ -53584 -31237 23050 40224 41229 76510 50823 -7523 -63041 -37474 -67086 -72677 -96965
6621i6965J5509j502M3576J7699j4743m7789R7296N4753k5099j7670k6320k8409
$$ -96965 -81456 -82958 -39382 -21683 -36426 -84215 13081 67834 42735 25065 -1255 -29664
6609b9664j5915K6273Q3787O2798o0181j3875q2843o2271k5525L7022N2243J7778
$$ -29664 -45579 -19306 64481 127279 67098 53223 -29620 -91891 -117416 -80394 -28151 -10373
6597a0373L6776k7396k8235l079L5141J3037j500N452J5135J4993n1772n6925
$$ -10373 26403 -993 -29228 -32307 2834 15871 14371 19823 34958 49951 -1821 -58746
6585e8746J4809k3530l4614l4204M2679L6063l8185m541O0656N8137J5946l821
$$ -58746 -43937 -67467 -102081 -136285 -93606 -57543 -95728 -100269 -39613 18524 34470 30649
6573C0649K2592k6254l5370l7316J5251k4551j7404J0414p04J7154K4072N304
$$ 30649 53241 26987 -8383 -45699 -30448 -54999 -72403 -61989 -62693 -45539 -21467 -16163
6561a6163k0018M3842O0824J2346m5072m0043l6227L90O6820o166m4635l3694
$$ -16163 -36181 7661 68485 80831 35759 -4284 -40511 -40121 26699 20533 -24102 -57796
6549e7796k4447J8741J8204l442j0598N7189q544k4277j6045k9893Q812O5425
$$ -57796 -82243 -63502 -45298 -48740 -59338 -2149 -10693 -34970 -51015 -80908 -72096 -6671
6537f671R6051l6572m4735k8089l492j3254o77L4791K0150L7k2846m3868j8447
$$ -6671 89380 52808 8073 -20016 -23508 -36762 -37439 -2648 17502 17539 -5307 -49175 -67622
6524f7622j3463j4945P3470R3360L0897J8845j1945o6427l5506K8758l2222r4324
$$ -67622 -81085 -96030 -22560 70800 101697 120542 108597 42170 6664 35422 3200 -91124
6512i1124k780k4900K9616l954O1357K3201p0916l4639K2626L5155J5953k6113
$$ -91124 -93904 -118804 -89188 -93142 -31785 -8584 -79500 -114139 -91513 -56358 -40405 -66518
6500f6518j326k8820L2881J4184j4857J3578K1845m3544k5054J6179k9341j5542
$$ -66518 -67844 -96664 -63783 -49599 -64456 -50878 -29033 -72577 -97631 -81452 -110793 -126335
6488a26335K2147P0836R2337l3545m5844K4522j5162J3N2570p589p4784l3944
$$ -126335 -104188 -33352 58985 25440 -20404 4118 -11044 -11031 41539 33950 -40834 -74778
6476g4778J9008k1404k5232q75O3434N3130K3806l0369M7251N0097J4756j0971
$$ -74778 -55770 -77174 -102406 -103281 -39847 13283 37089 6720 53971 104068 118824 107853
6464A07853l6554j8922k5129o0401O2322K2626l1539l7383j9318R588p135M235
$$ 107853 71299 52377 27248 -33153 29169 51795 20256 -17127 -36445 -26857 -33992 -29757
6452b9757L8581j3546l0938l2207J2931P6844J2647j9208j1098J2373K9854n1922
$$ -29757 8824 -4722 -35660 -67867 -54936 21908 34555 15347 4249 16622 46476 -5446
6440e446m4917J5768l41J2311M7069m1068j5699J274j297k8883j9701L1420J7066
$$ -5446 -50363 -34595 -34936 -22625 24444 -16624 -32323 -31049 -32346 -61229 -80930 -49510 -32444
6427c2444J0979M4610J3102k9018J3477L9494P561q7531J1527J0306j0034j7285
$$ -32444 -21465 23145 36247 7229 20706 60200 67761 -19770 -8243 2063 -7971 -25256
6415b5256J1163O2434M2070q2319R189k5029P422J9513j9035M3024L4372N4895
$$ -25256 -14093 48341 90411 8092 17281 -7748 -326 19187 152 43176 77548 132443
6403A32443m1152m3191k740P333l8520k3497L1641M088p2945o360k5465J1294
$$ 132443 91291 48100 45360 52693 14173 -9324 22317 26405 -46540 -52900 -78365 -67071
6391f7071P69N1652k9430m6318j1968n996L7731K7136K1076j3842J1414M4152
$$ -67071 -66302 -14650 -44080 -90398 -102366 -108362 -70631 -43495 -22419 -36261 -24847 19305
6379A9305L8662j4249o916l9079j3733m8250k8203P3111K3571K217K8070k0998
$$ 19305 57967 43718 36802 -2277 -16010 -64260 -92463 -19352 4219 6436 34506 13508
6367A3508m8048j9477L9309k9722o6339r25P7414M7981m1297K1780J2119j2382
$$ 13508 -34540 -54017 -14708 -44430 -110769 -111694 -34280 13701 -27596 -5816 6303 -6079
6355f079K4769L93m3195l0044J2780J6243L2088J6626m6297m3913J2609L8350
$$ -6079 18690 19083 -24112 -54156 -41376 -25133 6955 23581 -22716 -66629 -54020 -15670
6343a5670M8597J6398N592p407l1666J0031K3087K4442j5858k7591l2527l3025
$$ -15670 32927 49325 54917 47510 15844 25875 48962 73404 57546 29955 -2572 -35597
6331c5597K142n6352J0358j3648K8060N1972J2433l916k918k079J7772Q599k9982
$$ -35597 -33455 -89807 -79449 -93097 -65037 -13065 -632 -4548 -7466 -9545 8227 16826 -13156
6318a3156K9158Q326L1131k6803P019p674q1298n3628L6013P5388M2188m3933
$$ -13156 16002 24328 55459 28656 35675 28001 -53297 -106925 -70912 4476 46664 2731
6306B731k3839k807K3009K574r202k8584j4760K7896N5315O005k0624p112M6550
$$ 2731 -21108 -23915 -906 1668 -7534 -36118 -50878 -22982 32333 38338 17714 10602 57152
6293E7152O1141o6822r6766n8592K8717M7100K6278P261k6327P8548J787n3880
$$ 57152 118293 51471 -45295 -103887 -75170 -28070 -1792 5469 -20858 57690 59477 5597
6281E597l7146K3063L0729J5252j8477L6653O1400K0755l2866N421R964k8619
$$ 5597 -31549 -8486 22243 37495 19018 55671 117071 137826 104960 110381 120345 91726
6269I1726l6640l7606l2720m5989K6669R49J0128j7465n2471M0798R3446K7822
$$ 91726 55086 17480 -15240 -61229 -34560 -33611 -23483 -40948 -93419 -52621 40825 68647
6257F8647L7014m216K0432m3659l1174J4181l2415j2112L9913m6750m6169k2528
$$ 68647 105661 101445 121877 78218 47044 61225 28810 16698 56611 9861 -36308 -58836
6245e8836M4759L5874l0815J5637M1037q368J721j8280m6732m0340j3123Q4836
$$ -58836 -14077 21797 -9018 6619 47656 39288 41009 22729 -24003 -64343 -77466 7370
6233G370Q3661M0550m2814K9606l1508r1252n5808k0527L0704K693k241N1447
$$ 7370 91031 131581 88767 118373 86865 -4387 -60195 -80722 -50018 -47325 -49566 1881
6221A881Q0664J05361N4848p3481m3276l1161n9579j0287k2355M2141K6158q4063
$$ 1881 82545 187906 242754 169273 125997 94836 35257 24970 2615 44756 70914 -13149
6209a3149j13997J2088N8933K3497L9026J0665o356L4663q07p565K2911L7612
$$ -13149 -127146 -115058 -56125 -32628 6398 17063 10707 45370 44563 36998 59909 97521
6197I7521M051n2676q2945m675N2270L6055p6914p0544N9725j2729l199l311k1783
$$ 97521 101572 48896 -34049 -38724 13546 49601 -27313 -97857 -38132 -50861 -54060 -57371 -79154
6184g9154N9153J7315K2978k5037j1822q1577N407O1096N8699J0612N3228J9491
$$ -79154 -20001 -2686 20292 -4745 -16567 -98144 -92737 -31641 27058 37670 90898 110389
6172A10389J3440o5049k5830j3614k9978l1922k429J7673l257m3760N4129K0891
$$ 110389 123829 58780 32950 19336 -10642 -42564 -44993 -27320 -30577 -74337 -20208 683
6160F83k1339j7740o0236O5015M7514k157M7650k163o4984j02137J3047J221J2659
$$ 683 -20656 -38396 -98632 -33617 13897 11740 59390 57227 -7757 -109894 -96847 -95626 -82967
6147h2967N9832r267j2155M2719L3315J4920n8793k7239m7249N2087M70j5828
$$ -82967 -23135 -32402 -44557 -1838 31477 46397 -12396 -39635 -86884 -34797 -34327 -50155
6135e0155n885J2554O0790l1557p4367J7593L7205L2041L2387K5849k3280n0430
$$ -50155 -56040 -43486 17304 -14253 -88620 -71027 -33822 -1781 30606 56455 33175 -17255
6123a7255j8863L6219j0026l6053N107m397J5358J6225k2261m344O209j3423J9459
$$ -17255 -36118 101 -9925 -45978 -40871 -45268 -29910 -13685 -35946 -40290 -34081 -47504 -28045
6110b8045M6528K00J0736l0166j0012P7967J488k4388o1986l4183K799o727J9578
$$ -28045 18483 18683 29419 -747 -10759 67208 68696 44308 -17678 -51861 -49062 -55789 -36211
6097c6211K7945L2331j745R722n5215o1524J2859M27j4459n274K8559o718J0507
$$ -36211 -8266 24065 22320 32042 -23173 -84697 -71838 -71411 -85870 -91144 -62585 -69303 -58796
6084e8796q243j3496K94P399L4963J7669l6178J0388J2531J6420J097j0910n7934
$$ -58796 -67039 -80535 -80241 -72842 -37879 -20210 -56388 -46000 -33469 -17049 -15952 -26862 -84796
6071h4796L8315M1798K450L6049m5173J8758N1239K9434k0283J9766J5331K1226
$$ -84796 -46481 -4683 -2233 33816 -11357 7401 58640 88074 67791 87557 102888 124114
6059A24114k7694n6284q2073K9663l7719j6985j5330K7560K5212R624J9398J1840
$$ 124114 96420 40136 -41937 -12274 -49993 -66978 -82308 -54748 -29536 -19912 -514 11326
6047A1326N768m790j9865K1070j8150j1360o4641p8038N3580J3588l7762P5802
$$ 11326 17094 12304 -7561 13509 -4641 -16001 -80642 -158680 -105100 -91512 -129274 -53472
6035e3472O6552j2892N522N6711P282k8097j9253k4710J1051P826N202l2386K6891
$$ -53472 13080 188 5710 62421 69703 41606 22353 -2357 8694 16520 21722 -10664 16227
6022A6227L5791l540Q654l5389l1701N1720n548l6809m0197K3187j274j7354N6712
$$ 16227 52018 48478 57132 21743 -9958 41762 36214 -595 -40792 -17605 -18879 -36233 20479
6009B0479K3704k2936k4978j4898j6368M2318J3041k5353L534j5348K2984J8067
$$ 20479 44183 21247 -3731 -18629 -34997 7321 20362 -4991 -1457 -16805 6179 24246
5997B4246k7099L074M512J5837j8088J4453j0888K5984K1112j5118M725q996J6088
$$ 24246 -2853 221 4733 20570 2482 16935 6047 32031 53143 38025 42750 33754 49842
5984D9842j3508n9750o1744K3901M3904M4463j4462l9728n0553R295L7165O5591
$$ 49842 36334 -23416 -85160 -61259 -17355 27108 12646 -27082 -77635 -68340 -31175 34416
5972C4416j4828j3385K3675l8606q1322L4945N9049n298n2373k7967j423N7463
$$ 34416 19588 6203 29878 -8728 -90050 -55105 3944 -1354 -53727 -81694 -83117 -25654
5960b5654K6162K0428L6856l5745l9404N227K611P1541J4916q6997m4433o243
$$ -25654 508 20936 57792 22047 -17357 -12130 -9519 62022 76938 -10059 -54492 -60735
5948f0735J9500j2818l9302K2757L6787m9952M9697N1183j0214O931l397K8027
$$ -60735 -41235 -54053 -93355 -70598 -33811 -83763 -34066 17117 6903 13834 10437 38464
5936C8464J4364j6078l9536l195J0982j7222J9418L3134K1427l8965n7462l1079
$$ 38464 52828 36750 -2786 -5981 5001 -12221 7197 40331 61758 22793 -34669 -65748
5924f5748o636J9311J9308O6255k4610o4653m10N0534j101m9925J7944K9623K3730
$$ -65748 -72384 -53073 -33765 32490 7880 -56773 -57183 -6649 -7750 -57675 -39731 -10108 13622
5911A3622K9289J1673q1970L971l5359L3806K6189m134L380Q930M2041L0139L1652
$$ 13622 42911 54584 -27386 -23415 -58774 -24968 1221 -2913 467 9397 51438 81577 113229
5898A13229L6637n4772p7103j0527K4458R658j0281J7769L1347O486k6498q0823
$$ 113229 149866 95094 17991 7464 31922 41580 31299 49068 80415 86901 60403 -20420
5886b0420K1921o119R531Q93j0990m2554j2668J2467P5875L7235k4699m5070k2694
$$ -20420 1501 -4618 4913 5806 -5184 -47738 -60406 -47939 27936 65171 40472 -4598 -27292
5873b7292O2304K2948l4238n8584k5530n0463K6341R7091L5229m7870q0893M869
$$ -27292 35012 57960 23722 -34862 -60392 -110855 -84514 12577 47806 -64 -80957 -76088
5861g6088Q4371L97n2333L2851L8634J0438p399N569J4903R91o9608m1387j2987
$$ -76088 8283 8680 -43653 -10802 27832 38270 30871 36440 51343 52334 -17274 -58661 -71648
5848g1648L2475J4686j3571K0333L4607J3036L5118j9540k5000j8370K3876p147
$$ -71648 -39173 -24487 -38058 -17725 16882 29918 65036 45496 20496 2126 26002 18855
5836A8855j5092J0551L1116j9830m2107m3901o119N6619k7427l1544L5121P9208
$$ 18855 3763 14314 45430 25600 -16507 -60408 -66527 -9908 -37335 -68879 -33758 45450
5824D5450K5144m4406q571j2621k3933n707k637j381l9807k2955J3622J8707l1982
$$ 45450 70594 26188 17617 4996 -18937 -24644 -27281 -28662 -68469 -91424 -77802 -59095 -91077
5811i1077N3979K7368L2459p901L987K5513K6628J7538j1060j5367o9249q7531
$$ -91077 -37098 -9730 22729 14828 18815 44328 70956 88494 77434 62067 -7182 -94713
5799i4713K4462J5446l1138Q892M5751L7536P5094j1069p4748J8343j1798J1156
$$ -94713 -70251 -54805 -85943 -77051 -31300 6236 81330 70261 -4487 13856 2058 13214
5787A3214K556M1844M684l00k0521n5524k2016K5202K2837l1191m6714K3811N9416
$$ 13214 15770 57614 62298 61998 41477 -14047 -36063 -10861 11976 -19215 -65929 -42118 17298
5774A7298K2229L7386M6628m1500p9366l5414N1663L3989m6282p6018O965O934
$$ 17298 39527 76913 123541 82041 2675 -32739 18924 52913 6631 -69387 -62422 -55488
5762e5488K2639O1400K7020l5676l668n5472k7773O6922K4899p4175K8683K1435
$$ -55488 -32849 28551 55571 19895 16227 -39245 -67018 -96 24803 -49372 -20689 746
5750G46R834l3948k0839k0580j0240J9422K6298K14k3482j2474l9255J8126O5588
$$ 746 10580 -23368 -44207 -64787 -75027 -55605 -29307 -29093 -52575 -65049 -104304 -86178 -20590
5737b0590j306K1077J6886O2321j6533o3370k0127J4915N21m7380L4682L1021
$$ -20590 -21896 -819 16067 78388 61855 -1515 -21642 -6727 -6206 -53586 -18904 12117
5725A2117l328k0895j8876p204M1302J3535l9267j6331Q4494j4948j4710k7582
$$ 12117 8789 -12106 -30982 -38186 3116 16651 -22616 -38947 45547 30599 15889 -11693
5713a1693n0828L5121O32q8889l646J733k0281M1295N3369J9593P330L5919J8846
$$ -11693 -62521 -27400 -26768 -115657 -119303 -117570 -137851 -96556 -43187 -23594 -16264 19655 38501
5700C8501P841j2452J3121m3137m6767o0389M6902O2671L603K1996L1054q412
$$ 38501 46342 33890 47011 3874 -42893 -103282 -56380 6291 9894 31890 62944 54532
5688E4532q425j4348j9596J0101l9779q86l9101K8798L5298m7524o4147L7553
$$ 54532 46107 31759 12163 22264 -17515 -18401 -57502 -28704 6594 -40930 -105077 -67524
5676f7524L7388n295j863J9202J3856L4990O2907l6177J0355J2200j5327O095
$$ -67524 -30136 -35431 -37294 -18092 -4236 30754 93661 57484 67839 80039 64712 70807
5664G0807J6408N161l7860r892l364j8353k5309O859n6578l4052J2229K0766K759
$$ 70807 87215 92376 54516 44624 41260 22907 -2402 4457 -52121 -86173 -73944 -53178 -50419
5651e0419M1623r53J761j003n138k1902K0991O5948n2467K6027m6284o8790j4737
$$ -50419 -8796 -9749 -7988 -8991 -14129 -36031 -15040 50908 -1559 24468 -21816 -90606 -105343
5638a05343M6016L1503j6010J8045l026j0331O0940P4881p077p3721l0020q523
$$ -105343 -59327 -27824 -43834 -25789 -28815 -39146 21794 96675 89598 15877 -14143 -22666
5626b2666k3277j1560M3507K7263P276q68k4122J3949K562j5721j233j6979l8583
$$ -22666 -45943 -57503 -13996 13267 20543 19675 -4447 9502 12064 -3657 -4890 -21869 -60452
5613f0452n0511n6182K8825Q9256O2484j0615O731M5308l4852O2610K4756j8768
$$ -60452 -110963 -167145 -138320 -49064 13420 2805 9536 54844 19992 82602 107358 88590
5601H8590m2472J1478k9917m1805m3484N0220k7668m464J0587N287j9950J5098
$$ 88590 46118 57596 27679 -14126 -57610 -7390 -35058 -39522 -28935 -23648 -43598 -28500
5589b8500J00399J8752n6144J2042K194j3669J293j931l8611l0703L0060P3238
$$ -28500 71899 90651 34507 46549 48743 35074 36367 34436 -4175 -34878 -4818 68420
5577F8420O2802k1943q963l1812M622R9142K9574k3854l5842j3635m4069n3059
$$ 68420 131222 109279 100316 68504 73126 172268 201842 177988 142146 128511 84442 31383
5565C1383L8996p340m5178q2199J6395M4375N699j6139R280J1349j0585K5921
$$ 31383 70379 63039 17861 -64338 -47943 -3568 2131 -14008 -4728 6621 -3964 21957
5553B1957k2404k9867j6069n456p579M921Q2399M7565j4686n9225j2754n4882
$$ 21957 -447 -30314 -46383 -51839 -59418 -54497 27902 75467 60781 1556 -11198 -66080
5541f6080o384j125L2246L4438K8192J6643j4337k7528l0195j5438J4413J2163
$$ -66080 -72464 -73589 -41343 -6905 21287 37930 23593 -3935 -34130 -49568 -35155 -22992
5529b2992l098j5367o423N516m7704P1803L7671J6243K7733k4528m7415j8524
$$ -22992 -26090 -41457 -47880 -42364 -90068 -18265 19406 35649 63382 38854 -8561 -27085
5517b7085K6999n7456o593M2798J5113J0749M8087L2158n158p49m9521m5959l1319
$$ -27085 -86 -57542 -64135 -21337 -6224 4525 52612 84770 79612 78863 29342 -16617 -47936
5504d7936m769j2067M2276M4755j3915j9468P745K1750N583L3137J0962o2456
$$ -47936 -52705 -64772 -22496 22259 8344 -11124 -3379 18371 23954 57091 68053 5597
5492E597p0666K7839L3244n0315l1904J3926L8891K4181j3639j5831K1691N1014
$$ 5597 -65069 -37230 -3986 -54301 -86205 -72279 -33388 -9207 -22846 -38677 -16986 34028
5480C4028J0224m0593j6164J3322L6477j2949o403m3453L461o16n837M3018L6585
$$ 34028 44252 3659 -12505 817 37294 24345 17942 -25511 -22050 -22666 -28503 14515 51100
5467E1100r98O0410P150n7630k6843k4270J2749L0606k2315p810k1704J3932L5670
$$ 51100 50102 110512 117662 60032 33189 8919 21668 52274 29959 22149 445 14377 50047
5454E0047j0968m0023o7221J0481K3606L2753o2709P166L1713p0682j8364N1158
$$ 50047 39079 -944 -68165 -57684 -34078 -1325 -64034 -56868 -25155 -95837 -114201 -63043
5442f3043r736J9508N3166K3088J0591J9775n376l9010j5663n937J7828j1531
$$ -63043 -72779 -53271 -105 22983 33574 53349 47973 8963 -6700 -12637 5191 -6340
5430f340m4071o783j7940O230L5724J2554K1401J9960j1694M257m89K55M1057
$$ -6340 -50411 -57194 -75134 -68904 -33180 -20626 775 20735 9041 13298 12809 13064 54121
5417E4121j0932l2362q275m4618m4292J6280K562M6357K6441L6557m054m1689
$$ 54121 43189 10827 2552 -42066 -86358 -70078 -67516 -21159 5282 41839 37785 -3904
5405c904L0731O829K4804L154J9564q116k8600L7728K5019k4214j8583Q192J239
$$ -3904 26827 33656 58460 61614 81178 73062 44462 82190 107209 82995 64412 72604 73843
5392G3843m1192l7449M103J4634P151l787k6717K7934N3956J9206J08816N819
$$ 73843 32651 -4798 -695 13939 21090 17303 -9414 18520 72476 91682 200498 206317
5380B06317n4320m3189k6766J4461p985m7357j5232M1890k6648k7111J5434L0866
$$ 206317 151997 108808 82042 96503 88518 41161 25929 67819 41171 14060 29494 60360
5368F0360L565L0269m2348J1630K7431k556m0084k1849o078N9124j4701J5277
$$ 60360 63925 94194 51846 63476 90907 88351 48267 26418 20340 79464 64763 80040
5356H0040N9597q0588k9279j6361L8636P9764n9661n8109j2611J031N8701N3581
$$ 80040 139637 59049 29770 13409 52045 131809 72148 14039 1428 2459 61160 114741
5344A14741n5807p3259k2491q428R664J3384L1856M2808n548l4069r1513j5060
$$ 114741 58934 -14325 -36816 -45244 -35580 -22196 9660 52468 46920 12851 -78662 -93722
5332i3722O9810k647J0114m6967p838L664n39J4554j3269k6719k0606o290K6296
$$ -93722 -23912 -26559 -16445 -63412 -71250 -67586 -68125 -53571 -66840 -93559 -114165 -120455 -94159
5319i4159L1918K0992N4963J4482j1321L8588k7973j7835Q322l7222M1370L4959
$$ -94159 -62241 -41249 13714 28196 16875 55463 27490 9655 17977 -19245 22125 57084
5307E7084j1742m8454n7568J330Q8075N7557l4559j6374n7457K5444L239l3210
$$ 57084 45342 -3112 -60680 -59350 28725 86282 51723 35349 -22108 3336 6575 -26635
5295b6635O890L5956O579N9979k9437J6542J7544l4019l0644P651M5565j4592
$$ -26635 -19745 16211 22790 82769 53332 69874 87418 53399 22755 30406 75971 61379
5283F1379m1356R809n3260k0256K5974m508l8140O3247p182J5004q620o7191N7830
$$ 61379 20023 29832 -23428 -43684 -17710 -22218 -60358 2889 -4293 10711 2091 -65100 -7270
5270g270L4437Q03k803k3092L1125m8452n5008J2979p883K36J0356r67M3006M5141
$$ -7270 27167 27970 25167 2075 33200 -15252 -70260 -57281 -65164 -64928 -54572 -55539 -12533 32608
5256C2608J8405j6005N8004L2816l119n583k6926l9076l1194n4911q65o2422r084
$$ 32608 51013 35008 93012 125828 122709 117126 90200 51124 19930 -34981 -35846 -98268 -107352
5243a07352p388J3440R987j4342p543K35R432J9246M2202k1079J3088K8103p7796
$$ -107352 -114740 -101300 -91313 -105655 -113198 -112963 -103531 -84285 -42083 -63162 -50074 -21971 -99767
5230i9767l7999K9249P4804k043j7456K1798k4515R59K643L3367j9860L195J1272
$$ -99767 -137766 -108517 -33713 -35756 -53212 -31414 -55929 -54970 -52327 -18960 -38820 -35625 -24353
5217b4353j9972r336K4207l6334K4266P079m4368k0339m45N8583L921J2852K8778
$$ -24353 -44325 -53661 -29454 -65788 -41522 -34443 -78811 -99150 -99595 -41012 -37091 -24239 4539
5204D539l1980k8040k1776J3670L8735P281j4395L4714K5729L0469j2646K9374
$$ 4539 -27441 -55481 -77257 -63587 -24852 -17571 -31966 2748 28477 58946 46300 75674
5192G5674n326q0477m5353K1027N2982N3940j0787k4257n339O349o7309l3579
$$ 75674 70348 -10129 -55482 -34455 18527 72467 61680 37423 32084 38433 -28876 -62455
5180f2455K3216N2748N565l661o0581m9851P6293J139P177k2556l1365k3032L5928
$$ -62455 -39239 13509 19074 15413 -45168 -95019 -18726 -17587 -10410 -32966 -64331 -87363 -51435
5167e1435R38K7658M0909j9631n2321m3539m4290N1137Q2075K9128k3870k1191
$$ -51435 -50497 -22839 18070 -1561 -53882 -97421 -141711 -90574 -8499 20629 -3241 -24432
5155b4432l4504k9339K3824l299p815L7866K5465q5405k7828k5040P1238N7273
$$ -24432 -58936 -88275 -64451 -67750 -75565 -37699 -12234 -97639 -125467 -150507 -79269 -21996
5143b1996J6506j1280p979R3284j187n2989n3152q963P2505J3783J7206N8711
$$ -21996 -5490 -16770 -24749 68535 67348 14359 -38793 -47756 24749 38532 55738 114449
5131A14449k9509m6310o1388O200M0031M285L5528O2044J688o6339k4469N2536
$$ 114449 84940 38630 -22758 -16558 23473 27758 63286 125330 127018 60679 36210 88746
5119H8746O7929m9891o2398o6471l4276n8724J5627L6520j5595K4659L3856M930
$$ 88746 156675 106784 44386 -22085 -56361 -115085 -99458 -62938 -78533 -53874 -20018 -15088
5107a5088n8559J1443K3241K2169l0319m4270o2254m482L6831O2467M4027J770
$$ -15088 -73647 -62204 -38963 -16794 -47113 -91383 -153637 -158119 -121288 -58821 -14794 -13024
5095a3024K8368l6968l4753j581m0887l0375K0860P5155M2213K3105j9595n8209
$$ -13024 15344 -21624 -56377 -57958 -98845 -129220 -108360 -33205 9008 32113 12518 -45691
5083d5691J1821L9244Q573k4998l701j5479O550j4818L3861K1770M6346M6713
$$ -45691 -33870 5374 13947 -11051 -14752 -30231 -23681 -38499 -4638 17132 63478 110191
5071A10191j3583j7070k8233N513j118m0470L5863k634j5993K6120Q382n9777
$$ 110191 96608 79538 51305 56818 55700 15230 51093 48459 32466 58586 66968 7191
5059G191j4358N2877p2158k2481j1313Q199L9529J5417J164n0761J5225Q895J9577
$$ 7191 -7167 45710 -26448 -48929 -60242 -52043 -12514 2903 4067 -46694 -31469 -22574 -2997
5046b997L188L6829l1789j8775J2246K8616L5575L579m0126N0236Q240k7654k2236
$$ -2997 191 37020 5231 -13544 -1298 27318 62893 66472 26346 76582 84822 57168 34932
5033C4932m7228K7404L4824M7613J6543n4342n8461m3436n423j4966k2920L5034
$$ 34932 -12296 15108 49932 97545 114088 59746 1285 -42151 -47574 -62540 -85460 -50426
$$ [...]
##END NTUPLES=NMR SPECTRUM
##END=
