##TITLE=Analysis number 307216
Compound Code mo 00777
Book Reference 378/128
Project Code adrs
Chemist Name benw
##JCAMPDX= 6.0         $$ Bruker NMR JCAMP-DX V2.0
##DATA TYPE= NMR SPECTRUM
##DATA CLASS= NTUPLES
##ORIGIN= Bruker BioSpin GmbH
##OWNER= NMR
$$ XWIN-NMR		Version 3.5
$$ Mon Apr 25 10:20:27 2005 GMT Daylight Time (UT+1h)  MAYBRIDGE\NMR@NMR_250MHZ
##.OBSERVE FREQUENCY= 250.131544655141
##.OBSERVE NUCLEUS= ^1H
##.ACQUISITION MODE= SIMULTANEOUS (DQD)
##.ACQUISITION SCHEME= undefined
##.AVERAGES= 16
##.DIGITISER RES= 18
##SPECTROMETER/DATA SYSTEM= dpx250
##.PULSE SEQUENCE= zg30
##.SOLVENT NAME= DMSO
##.SHIFT REFERENCE= (INTERNAL, DMSO, 0, 16.522)
##AUDIT TRAIL= $$ (NUMBER, WHEN, WHO, WHERE, WHAT)
$$ ##TITLE= Audit trail, XWIN-NMR		Version 3.5
$$ ##JCAMPDX= 5.01
$$ ##ORIGIN= Bruker BioSpin GmbH
$$ ##OWNER= NMR
$$ C:\u/data/dgb/nmr/ADRS/2110/pdata/1/auditp.txt
$$ ##AUDIT TRAIL=  $$ (NUMBER, WHEN, WHO, WHERE, WHAT)
(   1,<2005-04-25 10:20:07.32 +100>,<MAYBRIDGE\NMR>,<NMR_250MHZ>,
      <created by zg, POWCHK disabled, PULCHK disabled
       configuration hash MD5:
       62 19 C7 07 E1 42 D1 B7 37 6C 3D D0 77 39 F9 E6
       data hash MD5: 64K
       24 3F 1D 9D 38 C0 72 B9 C8 8F EE EF 51 96 D7 5E>)
(   2,<2005-04-25 10:20:19.58 +100>,<MAYBRIDGE\NMR>,<NMR_250MHZ>,
      <Start of raw data processing
       ef LB = 0.3 FT_mod = 6 PKNL = 1 SI = 32K 
       data hash MD5: 32K
       23 E5 9F 3A 36 89 EA A2 B8 18 D9 AA 5F 0B E6 05>)
(   3,<2005-04-25 10:20:21.19 +100>,<MAYBRIDGE\NMR>,<NMR_250MHZ>,
      <apk 
       data hash MD5: 32K
       7B 2C 9F 0E A5 ED 24 1F 27 DB CA DD 28 75 77 75>)
(   4,<2005-04-25 10:20:21.88 +100>,<MAYBRIDGE\NMR>,<NMR_250MHZ>,
      <abs ABSG = 5 
       data hash MD5: 32K
       7C 4B E9 A4 3E 34 33 03 CF BB E2 49 0C C6 C6 68>)
$$ ##END=
$$ 
$$ hash MD5
$$ 7C 9B EC 83 5F F3 86 3A E8 7D 68 82 5D 3B 56 44
##$RELAX= 
##$RELAX= 
##$RELAX= 
##$RELAX= 
##$RELAX= 
##$RELAX= 
##$RELAX= 
$$ Bruker specific parameters
$$ --------------------------
##$DU= <C:\u>
##$EXPNO= 2110
##$NAME= <ADRS>
##$PROCNO= 1
##$TYPE= <nmr>
##$USER= <dgb>
##$AMP= (0..31)
100 100 100 100 100 100 100 100 100 100 100 100 100 100 100 100 100 100 
100 100 100 100 100 100 100 100 100 100 100 100 100 100 
##$AQSEQ= 0
##$AQ_mod= 3
##$AUNM= <au_zg>
##$AUTOPOS= <12 >
##$BF1= 250.13
##$BF2= 250.13
##$BF3= 250.13
##$BF4= 250.13
##$BF5= 500.13
##$BF6= 500.13
##$BF7= 500.13
##$BF8= 500.13
##$BYTORDA= 1
##$CFDGTYP= 0
##$CFRGTYP= 5
##$CHEMSTR= <none>
##$CNST= (0..31)
1 1 145 1 1 1 1 1 1 1 1 1 1 1 1 1 1 1 1 1 1 1 1 1 1 1 1 1 1 1 1 1 
##$CPDPRG= <>
##$CPDPRG1= <>
##$CPDPRG2= <>
##$CPDPRG3= <>
##$CPDPRG4= <mlev>
##$CPDPRG5= <mlev>
##$CPDPRG6= <mlev>
##$CPDPRG7= <mlev>
##$CPDPRG8= <mlev>
##$CPDPRGB= <>
##$CPDPRGT= <>
##$D= (0..31)
0 1 0 0 0 0 0 0 0 0.06 0 0 0 0 0 0 0.0002 0 0 0 0 0 0 0 0 0 0 0 0 0 0 
0 
##$DATE= 1114420806
##$DBL= (0..7)
120 120 120 120 120 120 120 120 
##$DBP= (0..7)
150 150 150 150 150 150 150 150 
##$DBP07= 0
##$DBPNAM0= <>
##$DBPNAM1= <>
$$ [...]
##$SUBNAM7= <"">
##$SUBNAM8= <"">
##$SUBNAM9= <"">
##$SW= 20.6930455092707
##$SWIBOX= (0..15)
0 0 3 0 0 0 0 0 0 0 0 0 0 0 0 0 
##$SW_h= 5175.983436853
##$TD= 65536
##$TD0= 1
##$TE= 295.16
##$TE2= 300
##$TE3= 300
##$TEG= 300
##$TL= (0..7)
0 120 120 120 120 120 120 120 
##$TP= (0..7)
150 150 150 150 150 150 150 150 
##$TP07= 0
##$TPNAME0= <>
##$TPNAME1= <>
##$TPNAME2= <>
##$TPNAME3= <>
##$TPNAME4= <>
##$TPNAME5= <>
##$TPNAME6= <>
##$TPNAME7= <>
##$TPOAL= (0..7)
0.5 0.5 0.5 0.5 0.5 0.5 0.5 0.5 
##$TPOFFS= (0..7)
0 0 0 0 0 0 0 0 
##$TUNHIN= 0
##$TUNHOUT= 0
##$TUNXOUT= 0
##$USERA1= <user>
##$USERA2= <user>
##$USERA3= <user>
##$USERA4= <user>
##$USERA5= <user>
##$V9= 5
##$VALIST= <valist>
##$VCLIST= <CCCCCCCCCCCCCCC>
##$VD= 0
##$VDLIST= <DDDDDDDDDDDDDDD>
##$VPLIST= <PPPPPPPPPPPPPPP>
##$VTLIST= <TTTTTTTTTTTTTTT>
##$WBST= 1024
##$WBSW= 4
##$XGAIN= (0..3)
0 0 0 0 
##$XL= 0
##$YL= 0
##$YMAX_a= 395131
##$YMIN_a= -337344
##$ZGOPTNS= <>
##$ZL1= 120
##$ZL2= 120
##$ZL3= 120
##$ZL4= 120
##$ABSF1= 16.522
##$ABSF2= -4.171173
##$ABSG= 5
##$ABSL= 3
##$ALPHA= 0
##$AQORDER= 0
##$ASSFAC= 0
##$ASSFACI= 0
##$ASSFACX= 0
##$ASSWID= 0
##$AUNMP= <proc_1d>
##$AZFE= 0.1
##$AZFW= 0.1
##$BCFW= 0
##$BC_mod= 0
##$BYTORDP= 0
##$COROFFS= 0
##$CY= 12.5
##$DATMOD= 1
##$DC= 0
##$DFILT= <>
##$DTYPP= 0
##$F1P= 14.0000005364418
##$F2P= -0.99999901652339
##$FCOR= 0.5
##$FTSIZE= 32768
##$FT_mod= 6
##$GAMMA= 0
##$GB= 0
##$INTBC= 1
##$INTSCL= 1
##$ISEN= 128
##$LB= 0.3
##$LEV0= 0
##$LPBIN= 0
##$MAXI= 10000
##$MC2= 0
##$MEAN= 0
##$ME_mod= 0
##$MI= 0
##$NCOEF= 0
##$NC_proc= -2
##$NLEV= 6
##$NOISF1= 0
##$NOISF2= 0
##$NSP= 0
##$NTH_PI= 0
##$NZP= 0
##$OFFSET= 16.522
##$PC= 1
##$PHC0= -77.8649
##$PHC1= 3.487419
##$PH_mod= 1
##$PKNL= yes
##$PPARMOD= 0
##$PSCAL= 4
##$PSIGN= 0
##$REVERSE= no
##$SF= 250.13
##$SI= 32768
##$SIGF1= 0
##$SIGF2= 0
##$SINO= 400
##$SIOLD= 32768
##$SREGLST= <1H.DMSO>
##$SSB= 0
##$STSI= 32768
##$STSR= 0
##$SW_p= 5175.98343685301
##$SYMM= 0
##$S_DEV= 0
##$TDeff= 65536
##$TDoff= 0
##$TI= <Analysis number 999999
Compound Code 99
Book Reference 9
Project Code 9>
##$TILT= no
##$TM1= 0
##$TM2= 0
##$TOPLEV= 0
##$USERP1= <user>
##$USERP2= <user>
##$USERP3= <user>
##$USERP4= <user>
##$USERP5= <user>
##$WDW= 1
##$XDIM= 32768
##$YMAX_p= 295459109
##$YMIN_p= -105133
$$ End of Bruker specific parameters
$$ ---------------------------------
##NTUPLES= NMR SPECTRUM
##VAR_NAME=  FREQUENCY,     SPECTRUM/REAL,   SPECTRUM/IMAG
##SYMBOL=    X,             R,               I
##VAR_TYPE=  INDEPENDENT,   DEPENDENT,       DEPENDENT
##VAR_FORM=  AFFN,          ASDF,            ASDF
##VAR_DIM=   32768,         32768,           32768
##UNITS=     HZ,            ARBITRARY UNITS, ARBITRARY UNITS
##FACTOR=    0.157963299565203, 1,           1
##FIRST=     4132.6476996994, 0,             0
##LAST=      -1043.33573715361, 0,           0
##MIN=       -1043.33573715361, -105133,     0
##MAX=       4132.6476996994, 295459109,     0
$$ Real data points
##PAGE= N=1
##DATA TABLE= (X++(R..R)), XYDATA
$$ [...]
16960A0668j3343p292P653L12J6247j465o713j7471j5919N038K1282K6017N555
16947C0569k2678k0349j8371j8557n660J7458J4583J7024K1982J2846J8921j3986
16935C3782k1292L536J934q935N160o886k801m750J0108j4113n08J3479M670j4024
16921f40l140K7744J962n986j3852k044m976j6375l149K1551K0458J5063O306
16908D2922k6540P45o438j1282r375p764J7444R899j5626j6660R67J5165K495
16895d048P34j351p27p291n862J689m449j597j2607R954j0534q365K3022J1103
16881a0329J7525J8760r469p322K330N993M997j7913j3035k0433L226J4478N273
16868e919K3722l510j3912j2978q623K8317J4865J1359j6940l703q710Q069J0636
$$ plain form
16960 10668 -2675 -9967 -2314 -2002 14245 12780 6067 -11404 -27323 -22285 -1003 25014 30569
16947 30569 7891 -12458 -30829 -49386 -55046 -37588 -23005 -5981 16001 28847 47768 33782
16935 33782 12490 16026 17960 9025 14185 7299 4498 -252 9856 -4257 -4765 8714 13384 -640
16921 -640 -3780 23964 25926 19940 6088 4044 -932 -17307 -20456 1095 21553 36616 42922
16908 42922 16382 17127 10689 -593 -9968 -17732 -288 9611 -6015 -22675 -21708 -6543 -4048
16895 -4048 -3314 -4665 -5392 -12683 -18545 -16856 -21305 -22902 -35509 -25555 -36089 -44454 -21432 -10329
16881 -10329 7196 25956 16487 9165 11495 17488 22485 4572 -8463 -28896 -25670 -11192 -5919
16868 -5919 17803 14293 381 -12597 -21220 7097 21962 33321 16381 12678 3968 12037 22673
16855B2673o464j963j0849n525J0640J1823j1325j9160R014K4685j5230j3600
16843e281J5332J6505n9j3037L25J757j5309j1462q51m787M610O361j5999j5500
16829c7395Q131P288R023p408j996L3296J0007k7186k670N664m374K1993K4685
16816C9058N772l186K570j9102k6391j5251l906q987O634J7712Q061j5731j3071
16803b5818o155o462l339O145K7253K6136K2277j2449k7753l482J5418j656M63
16790A0578Q265K799P124j2366J5797n757j2513j7092K243J25j8308Q577p540
16777a8068J931k765p33K7934O598J7564J574j8773o786r594k166j3345K6821
16764A0192L244k1413M204K2333J9323l95k3429q066K4565J462j9626j6278K3468
$$ plain form
16855 22673 16209 14246 3397 -2128 8512 20335 9010 -10150 -1136 23549 8319 -5281
16843 -5281 10051 26556 26497 13460 13785 15542 233 -11229 -12080 -16867 -12257 -5896 -21895 -37395
16829 -37395 -29264 -21976 -12953 -20361 -22357 10939 20946 -6240 -8910 -3246 -7620 14373 39058
16816 39058 44830 41644 44214 25112 -1279 -16530 -20436 -29423 -22789 -5077 2984 -12747 -25818
16803 -25818 -31973 -38435 -41774 -35629 -8376 17760 40037 27588 -165 -3647 11771 10115 10578
16790 10578 18843 21642 28766 16400 32197 26440 13927 -3165 -922 -797 -19105 -10528 -18068
16777 -18068 -16137 -18902 -19635 8299 14897 32461 34035 15262 8476 -1118 -3284 -16629 10192
16764 10192 13436 -7977 -3773 18560 37883 37488 14059 5993 30558 32020 12394 -3884 19584
16751A9584k255j4844j5637r800l339J9219Q732M382j323j1851J1391m559l370
16738c670O847P285o252Q713j1224J095j6844p763R445N163r507m491R362J9759
16724G918R744j1367k9273j6133P572Q474k596o07L255K463k2866J6761K2007
16711d648P26j8345j6357N573M392n870J1013j0191m038J1206N205K4891N858
16698I415n286j3859P070j425m903K772j1045N16P097k863J137Q118K033k1578
16684b2801n375M021J8245R937M584m373k610M86j5227J9716J3925l787l776j3428
16670d63j2988k71L387P484j875k147J4380l670m773n235J2225j6019j7711J7943
16656i733J3163j0712P705J0447O658J1750J2541r96j6398J4238J8845j15r669
$$ plain form
16751 19584 17329 2485 -13152 -22952 -26291 -7072 1660 6042 4719 -7132 4259 -300 -3670
16738 -3670 3177 10462 4210 12923 1699 2794 -14050 -21813 -12368 -7205 -16712 -21203 -11841 7918
16724 7918 17662 6295 -22978 -39111 -31539 -23065 -25661 -26268 -23013 -20550 -43416 -26655 -4648
16711 -4648 -3922 -22267 -38624 -33051 -28659 -34529 -23516 -33707 -37745 -26539 -21334 3557 9415
16698 9415 4129 -9730 -2660 -4085 -8988 -6216 -17261 -16745 -9648 -12511 -11374 -3256 -1223 -22801
16684 -22801 -28176 -24155 -5910 4027 8611 4238 1628 2114 -13113 6603 20528 16741 12965 -463
16670 -463 -13451 -13722 -10335 -2851 -4726 -6873 7507 3837 -936 -6171 6054 -9965 -27676 -9733
16656 -9733 3430 -7282 423 10870 17528 29278 41819 40823 24425 38663 57508 57393 47724
16643D7724j6377j6310j4577M871J3829j2594k972j2707k309J4629L3729k847
16631C4089j3027J419j0390J690j249k781J7374p885l5511K007J5654Q161j2007
16618b456k1964J0026j492k5584L91j5815n316J8933K6851J2287l956J9809k604
16605I110j1149n779j8273P035J9553J498j4921L086J4933r350L014L0N54k785
16591c444k681J390R035n34q088q362M743O527p333j1964j7851L33K3832K8241
16577A3844J759k9012j8222m002Q028J9257N227j4232J3804J0622O524j8321o977
16564a1701o477r084q709K557J3076p695O821O794k686J1414o432N729J5066o970
16550A703O508K885j5610R661j460j7573n356j8976J5928Q206n669K093j5337
$$ plain form
16643 47724 31347 15037 460 5331 19160 6566 3594 -9113 -11422 3207 36936 34089
16631 34089 21062 22481 12091 13781 12532 9751 27125 19240 -16271 -14264 1390 9551 -2456
16618 -2456 -24420 -14394 -15886 -41470 -41079 -56894 -62210 -43277 -16426 -4139 -8095 11714 9110
16605 9110 -2039 -7818 -26091 -19056 497 1995 -12926 -9840 5093 -4257 -1243 -1213 -659 -3444
16591 -3444 -6125 -4735 4300 3766 -4322 -12684 -7941 -1414 -8747 -20711 -38562 -38229 -14397 13844
16577 13844 15603 -13409 -31631 -35633 -27605 -8348 -3121 -17353 -3549 7073 13597 -4724 -11701
16564 -11701 -18178 -27262 -35971 -33414 -20338 -28033 -21212 -14418 -17104 -5690 -12122 -6393 8673 1703
16550 1703 8211 11096 -4514 5147 3687 -13886 -19242 -38218 -22290 -14084 -19753 -17660 -32997
16537c2997j9194J3454J6326Q716p266K477j61O108K5423m397n337l350j6258
16524a6456M087j0781k4174J4093J255o121P216O507O705J3846Q449j0813k983
16511i170K320j1058Q534J4959J1313K91j1158r456j6459o055r639j1832j8015
16498f5425R672N436l907J678O49L079K159m868K7110K5115j700J984P546o119
16484B409k382J1169O777O819k0267k6117K8028L4921N937p642k8918j8130k9325
16471c6721J3678J6356J850N547j2571j1449J5985K556R619J2529j2572r172r993
16458a4358Q958N208p217j3967P108J4519J2493j0124J1447j6333o873K832N644
16445f63P219j0264k4579r435Q826L0646L0233l527j9376j8924q988n715k698
$$ plain form
16537 -32997 -52191 -38737 -22411 -13695 -20961 -18484 -18645 -12537 12886 8489 3152 -198 -16456
16524 -16456 -12369 -23150 -47324 -33231 -31976 -38097 -30881 -24374 -17669 -3823 4626 -6187 -9170
16511 -9170 -6850 -17908 -9374 5585 16898 17189 6031 -3425 -19884 -25939 -35578 -47410 -65425
16498 -65425 -55753 -50317 -54224 -52546 -51897 -48818 -46659 -51527 -24417 698 -1002 982 8528 2409
16484 2409 27 11196 17973 24792 4525 -21592 6436 41357 47294 39652 10734 -7396 -36721
16471 -36721 -23043 -6687 -4837 710 -11861 -23310 -7325 -4769 4850 17379 4807 -4365 -14358
16458 -14358 -5400 -192 -7409 -21376 -14268 251 12744 2620 14067 -2266 -9139 -6307 -663
16445 -663 6556 -3708 -28287 -37722 -28896 1750 31983 28456 9080 -9844 -18832 -24547 -27245
16432b7245J0276P011p463r079k892J0410j5240L143J49O313J5690J5454k252
16419D275k0055J506J7007J8985k0478k429J2052r823q029j2711J7665K726j0394
16406i703Q212n012j3250J8576J9066N982q928N48j6261l2706n34K264J884K0932
16392h930J3851l307p267M918m211k13j410o59N769j824j0904j0357K4591Q474
16378H521k707j9297j5292Q698l98J0207J1200j4405q421m413N391N707J9195
16365C986J8182q793j1539P62L636J875O403P422n466j9680k3892j3999O775Q472
16351b5856J5058R819q230m325p806k180j3832J2854J0671p898M795o753k0937
16338d4620O859J7865J9076J7845o559j3502j3100q510J9154K4154m155k7336
$$ plain form
16432 -27245 -16969 -9958 -17421 -26500 -29392 -18982 -34222 -31079 -30930 -24617 -8927 6527 4275
16419 4275 -15780 -14274 2733 21718 1240 -1189 10863 1040 -6989 -19700 -2035 691 -9703
16406 -9703 -1491 -6503 -19753 -1177 17889 23871 14943 15491 -770 -33476 -34010 -31746 -29862 -8930
16392 -8930 4921 1614 -5653 -735 -4946 -5159 -6569 -7228 -1459 -3283 -14187 -24544 47 8521
16378 8521 5814 -13483 -28775 -20077 -20475 -10268 932 -13473 -21894 -26307 -20916 -15209 3986
16365 3986 22168 13375 1836 2598 6234 8109 14512 21934 16468 -3212 -27104 -41103 -34328 -25856
16351 -25856 -10798 -979 -9209 -13534 -21340 -23520 -37352 -24498 -13827 -21725 -16930 -23683 -44620
16338 -44620 -37761 -19896 -820 17025 10466 -3036 -16136 -24646 -5492 18662 14507 -12829
16326a2829l8338K3076J7025L979J6841j0655j1726J0243j381k453M126J3766
16314A1674J0048r35J3718j0124j5997M19k302j5655k376j5511K48J6432J9411
16301I050J4640j8016l1692j4076N848R37j0926P326J5324J9797j917r091K216
16288a0580o238j197M522J0967Q10r846P574k4062j6617K3553K8443J1293l0341
16275a1719k6173Q838K0717P273K5339Q975k0653n267J7568J4029J2095j7394
16263C3628k0245j9413l6058j319P036J383J7635J3631J1701r088j7980J0891
16251h198P589k4361p312J7941O524J689J2535q028K248l051L435K987O139j3190
16237c053J5366R204L155o097j0913l609J694j2194j8298j221R649Q751J3885
$$ plain form
16326 -12829 -51167 -28091 -11066 -7087 9754 -901 -12627 -2384 -3765 -6218 -2092 11674
16314 11674 21722 20787 34505 24381 8384 8803 6501 -9154 -11530 -27041 -26793 -10361 9050
16301 9050 23690 5674 -26018 -40094 -34246 -33309 -44235 -36909 -21585 -1788 -3705 -12796 -10580
16288 -10580 -16818 -18015 -13493 -2526 -1716 -11562 -3988 -28050 -44667 -21114 7329 18622 -11719
16275 -11719 -37892 -29054 -8337 -1064 24275 33250 12597 7330 24898 38927 51022 33628
16263 33628 13383 -6030 -42088 -43407 -36371 -34988 -17353 -3722 7979 -1109 -19089 -8198
16251 -8198 -609 -24970 -32282 -14341 -7817 -6128 6407 -1621 627 -2424 1011 3998 10137 -3053
16237 -3053 12313 21517 24672 18575 7662 4053 5747 -6447 -24745 -25966 -16317 -7566 6319
16224F319K9085p914j9494j2549k150J790k3492j5033j4343J3510L202L7140J8346
16211A4417j1417j9729j139J7053J2379j0477P446j2560j8731m979p235K964J800
16198c0208r74J3459J1097O850l544p646r995j1463o197R816K7482J4935k8405
16185a4793p469J071q89m195J6363K3669K185r631Pj207j7641j7129J7514j4448
16171b6593P361J9102Q32P190K111j1614k0230j0605J347j340J8977l414Q892
16158g984J2971R505p251j2298o592M671P70p384L8772j6147l340M309k473k0443
16144a2914k0783L17J4256J1064K575n337j1578M517l261J382M154K731L116R257
16130e04L911j0758j5418J1505R625J0761K6711Q569n164o542k768j1279j1733
$$ plain form
16224 6319 35404 27490 7996 -4553 -6703 -4913 -28405 -43438 -57781 -44271 -41069 -3929 14417
16211 14417 3000 -16729 -17868 -815 11564 1087 8533 -4027 -22758 -27737 -34972 -32008 -30208
16198 -30208 -31182 -17723 -6626 224 -3320 -10966 -20961 -32424 -38621 -28805 -1323 13612 -14793
16185 -14793 -22262 -21191 -22080 -26275 -9912 13757 15942 6311 6318 5111 -12530 -29659 -12145 -26593
16171 -26593 -19232 -130 702 7892 10003 -1611 -21841 -32446 -31099 -32439 -13462 -16876 -7984
16158 -7984 4987 14492 7241 -5057 -11649 -6978 -6208 -13592 25180 9033 5693 10002 7529 -12914
16144 -12914 -33697 -33380 -19124 -8060 -5485 -10822 -22400 -17883 -21144 -19762 -15608 -12877 -9761 -504
16130 -504 3407 -7351 -22769 -11264 -1639 9122 35833 44402 39238 32696 29928 18649 6916
16117F916n174m68R229K1142K0320K088p982k0215j7906m241j7934k081J4211
16104b095K9891K2309J7200j7506k4643j0839J0444j3118K861J4344p94P34k0717
16091H071l3o208n798j688K131j4381J228l838j868p991K5888k203Q848j786n797
16076e425O889O513J0554M051N559j743R74k9654l376K504M028j682j8590J3948
16062e450J8765J752l258P241l646j1481J0213J0452m697r384p286j4301L01o773
16048a7552q508J8821o193j3872J5305J6276N080J4173n890j064j2268j7579j0579
16035b3850j0685j5385K0718J8910N829o661j0478J457R395L1243J3261q259j9234
16022F261j2138K5116O584j8676j4223J7185R435k1446j8107N184m082k4592K0838
$$ plain form
16117 6916 1742 1274 10503 31645 51965 54053 46071 25856 7950 3709 -14225 -16306 -2095
16104 -2095 27796 50105 67305 49799 25156 14317 24761 11643 14504 28848 28054 28788 8071
16091 8071 8038 1830 -3968 -5656 -3525 -17906 -16678 -20516 -22384 -30375 -4487 -6690 2158 372 -5425
16076 -5425 1464 7977 18531 22582 28141 26398 27372 -2282 -5658 -3154 874 -808 -19398 -5450
16062 -5450 13315 15067 11809 19050 15404 3923 14136 24588 19891 10507 3221 -11080 -10779 -17552
16048 -17552 -26060 -7239 -13432 -27304 -11999 4277 9357 23530 17640 16576 4308 -13271 -23850
16035 -23850 -34535 -49920 -29202 -10292 -4463 -11124 -21602 -20145 -10750 20493 33754 25495 6261
16022 6261 -5877 19239 25823 7147 -7076 10109 19544 -1902 -20009 -14825 -18907 -43499 -22661
16009b2661R512M049j505j3293O574j2748N24J8881J8205J1128r584m962k624
15996A496K260O316O652m388n323k2793Q566J9851J5701j9298j6052p878J0687
15983d203K2456R446l533k8291J5915l012l2587K462L51q019J1909J1529J2414
15970F837Q67j7338l092K3745O541j0739n809j9059J209N245K425J3896L571o34
15956G665r79P079L687j8920r535J3800o5K2543j3860j1927n297r656J8395O258
15942I188k6127n180P042O627R243J1724J7793J743L822k660m280o266j7179p070
15928a580k0R504L289j3643k7687P316K0220Q887m994q482m800m618q92K051J8209
15913B760K1245r862l4738j3403K2696L316j2564L568L108o604m262j6878l095
$$ plain form
16009 -22661 -13149 -9100 -10605 -23898 -17324 -30072 -29548 -10667 7538 18666 9082 4120 1496
15996 1496 3756 10072 16724 12336 7013 -15780 -7214 12637 28338 9040 -7012 -14890 -4203
15983 -4203 18253 27699 24166 -4125 11790 8778 -23809 -21347 -20996 -29015 -17106 -5577 6837
15970 6837 7704 -9634 -12726 11019 17560 6821 1012 -18047 -16838 -11593 -9168 4728 8299 7665
15956 7665 6686 13765 17452 -1468 -11003 2797 2732 25275 11415 -512 -5809 -15465 2930 9188
15942 9188 -16939 -22119 -15077 -8450 793 12517 30310 32053 35875 33215 28935 22669 5490 -1580
15928 -1580 -1600 7904 11193 -2450 -30137 -22821 -2601 6286 1292 -7190 -11990 -16608 -17500 -15449 2760
15913 2760 24005 14143 -20595 -33998 -11302 -7986 -20550 -16982 -13874 -20478 -24740 -41618 -44713
15900d4713J9965K2519P886L868l23J2336L676m984j5440j0111j4701J7170N61
15887b291j4607k048j61Q816K481J7223P970j832K0401L833j4800m053J7424J066
15873C9422q300N160J4479p308N722N287r473l111j0062j8987K404n564n270j2875
15859h476L895l651r721k631J6133J5659R053k4597k0136j0816K8154M1081K1467
15846E5414j6406j6367k4585r198P124O019L98j7258j9340J8065L02J7218J6819
15833A8205n89O430k174O994J2108k2804j1958N714j7168j9825K507N624Q061
15820h875R536K427k66m926j4645j759J0564J700j4664P705J3829K101J374R92
15806E093l370L969j887k0509k262q71M608Q469J5312n968K0714J7633l6093j0795
$$ plain form
15900 -44713 -24748 -2229 5657 9525 9202 21538 25214 20230 4790 -5321 -20022 -2852 -2291
15887 -2291 -16898 -18946 -19107 -10291 -7810 9413 17383 15551 35952 39785 24985 20932 38356 39422
15873 39422 31122 36282 50761 43453 49175 54462 44989 41878 31816 12829 15233 9669 4399 -8476
15859 -8476 -4581 -8232 -17953 -20584 -4451 11208 20261 -4336 -24472 -35288 -7134 33947 55414
15846 55414 39008 22641 -1944 -11142 -4018 2001 2399 -14859 -34199 -16134 -15832 1386 18205
15833 18205 17616 24046 21872 28866 40974 18170 6212 11926 -5242 -25067 -22560 -16936 -8875
15820 -8875 661 3088 2822 -2104 -16749 -18508 -7944 -6244 -20908 -13203 626 2727 4101 5093
15806 5093 1723 5692 3805 -16704 -18966 -19837 -15229 -6760 8552 2584 23298 40931 4838 -5957
15792e957J0467o766j8752j7441J093R176j229R604J1717J0179J4553m478R073
15779B1239J7155J408q220j3625J744l913p354j9032O194J7359n07J8589q17j6434
15765A3786n301q064j2280j0910J3457N985M493O540j2534m352M164O550M067
15752E601m117N867J834O992k30j6244j7739q992p787J3795J5276r907Q940P312
15738F01O582J3000j360J239p177q806j5635n512J388K1929O007M436j2427J7205
15724B1470K1249l102K735r983k9349j3629L060L302j3245o914N667J5263R141
15711E665m350J1385J329n465l699J0677p384M008j1046p083o003R602J917q884
15697i331l534J514J1343L884o285o273m793q388n841K0122J0026j2735N659J0928
$$ plain form
15792 -5957 4510 -2256 -21008 -38449 -37356 -28180 -29409 -19805 -8088 2091 16644 12166 21239
15779 21239 38394 39802 31582 17957 19701 15788 8434 -10598 -4404 12955 12448 31037 30220 13786
15765 13786 8485 421 -11859 -22769 -9312 -3327 1166 7706 -4828 -9180 -5016 1534 5601
15752 5601 1484 7351 9185 16177 15947 -297 -18036 -27028 -34815 -21020 -5744 -15651 -6711 601
15738 601 7183 20183 18823 20062 12885 4079 -11556 -17068 -15680 6249 12256 16692 4265 21470
15724 21470 42719 39617 42352 32369 3020 -10609 -7549 -4247 -17492 -24406 -18739 -3476 5665
15711 5665 1315 12700 14029 8564 4865 15542 8158 12166 1120 -5963 -11966 -2364 -447 -9331
15697 -9331 -12865 -11351 -8 3876 -2409 -8682 -13475 -21863 -27704 -7582 2444 -10291 -4632 6296
15683F296J3691J613o653l2283m371J2491J6033O282p440m49K0982J578o648O844
15669B7966J2316J182j6948k0194p611q890j0479K8778J2498m090K421O159M264
15656B7372j2980l5584j78K565n16K4173J3046j506j1574l760N328J2776n439
15643A3723j9084N139Q368J2067M848J106o620j1897k1691j861J6941k582j706
15630c249O987j0935N287k170P853L259J9203k3450k5984K3268q45j8136K818
15617a6094l784J0315J8498J9182o314J0944Q041j084o060k2111j3331J4807l720
15604I289Q453O293M322J5739P239o795j2667j1514P553R341L526M19k2664J631
15590B0165P886j4488r750j1961m014O715J7761J6585K4042n453j6215k8527j9830
$$ plain form
15683 6296 19987 21600 14947 -17336 -21707 -9216 6817 13099 5659 5210 26192 27770 21122 27966
15669 27966 40282 41464 24516 4322 -3289 -12179 -22658 6120 18618 14528 16949 23108 27372
15656 27372 14392 -21192 -21370 -18805 -19321 4852 17898 16392 4818 1058 6386 19162 13723
15643 13723 -5361 -222 8146 20213 25061 26167 19547 7650 -14041 -15902 1039 -1543 -3249
15630 -3249 3738 -7197 -1910 -4080 3773 7032 26235 2785 -23199 69 -776 -18912 -16094
15617 -16094 -19878 -9563 8935 28117 21803 32747 40788 39704 33644 11533 -1798 13009 9289
15604 9289 17742 24035 28357 44096 51335 44540 31873 20359 27912 37253 40779 41198 18534 20165
15590 20165 28051 13563 3813 -8148 -12162 -5447 12314 28899 52941 47488 31273 2746 -17084
15577a7084L890O015O290j5123j2246O72o929L867M886K6767K3108l627N330j1293
15563A4523j6675j4814j684J2321J4633j5086n995J745J4634J1860m447L884r810
15550E089k253J0570M594M181j976j9173m755O925l536m19P100J8229m735j5244
15536D597J148R356r696k177m691m06L340J2966J0739n108j1539K63K503j7688
15522f393O299m890k2951P623K065Q638K8269P322k6529Q774P762k4466l2910
15509d1387j313L0561P311q457J911J9811l202j260O324q271o739L6612j113k5096
15495E692J1709k384N62j1191P742l96J0512K6197J0101J2536o738L649k0141
15482D7850m5214k1771O702n323k911p716Q761K877J0040P159n932M999K2306
$$ plain form
15577 -17084 -13194 -7179 -889 -16012 -28258 -27586 -34515 -30648 -25762 1005 24113 20486 25816 14523
15563 14523 -2152 -16966 -18650 -6329 8304 -6782 -12777 -11032 3602 15462 11015 14899 5089
15550 5089 2836 13406 18000 22181 20205 1032 -3723 3202 -334 -753 6347 24576 19841 4597
15536 4597 5745 15101 5405 3228 -1463 -1869 1471 14437 25176 20068 8529 8792 11295 -6393
15522 -6393 -94 -4984 -27935 -20312 -18247 -9609 18660 25982 -547 8227 15989 -8477 -41387
15509 -41387 -42700 -12139 -4828 -13285 -11374 8437 5235 3975 10299 2028 -4711 31901 30788 5692
15495 5692 17401 15017 15579 4388 12130 11734 22246 48443 58544 71080 64342 67991 47850
15482 47850 2636 -19135 -12433 -17756 -20667 -28383 -19622 -16745 -6705 454 -5478 -479 21827
15469B1827J2169l161M783K32O932n967j0119k3272k3794R533J6492K3345j2307
15456A6693j7539J4665p208r087n3J9267J4526j401M769K2121N924j4766M749
15443E2660r212j7448k4815j7060L687N097R158R850j841K1404N356k27j7847
15430A8762j708K0202j3748o143j4691P444m951M152j9113k8888p822J3766R022
15417b3716L454j4097O814J1965O046l59R765J7460m953O008p729l628p062k4622
15403b4654j6858P39L2124J0967j1791L711K1037R99j6552o957J0536J8813Q284
15390C0398l379P628r308l0777M808K431m105j594Q680K131M581L086O18p450
15376G748q939J510K7417J4355J876j4198k054J267p168j2746P512L539R049j8150
$$ plain form
15469 21827 33996 30835 35618 35850 42782 36815 26696 3424 -20370 -10837 5655 29000 16693
15456 16693 -846 13819 6611 -2476 -2529 16738 31264 29863 34632 56753 62677 47911 52660
15443 52660 43448 26000 1185 -15875 -12188 -7091 2067 11917 10076 31480 36836 36609 18762
15430 18762 17054 37256 23508 17365 2674 10118 5167 9319 -9794 -38682 -46504 -32738 -23716
15417 -23716 -20262 -34359 -27545 -15580 -9534 -9893 -128 17332 12379 18387 10658 7030 -32 -24654
15403 -24654 -41512 -40773 -8649 2318 -9473 -5762 15275 16274 -278 -7235 3301 22114 30398
15390 30398 27019 34647 25339 -5438 -630 1801 -2304 -3898 4782 6913 11494 14580 15198 7748
15376 7748 -1191 319 27736 42091 43967 29769 27715 28982 21814 9068 16580 20119 29168 11018
15362A1018j7902j1983L993J3241m603r642J759L1701Q752J3525n646k2197k3350
15349a1334k144O940J7427n700j6242L740J1607j2591k377J3121L580J4294P079
15336B7400j3722k5707K572K3241J3171k3189k825o147L007j229j319L707j2093
15323a3133M883J0090r901j4367P316o46j8531j1974J0869J6526J5062J4748J0753
15310B1695L799r377j9760p590J4487q067J3343N402j2768l626j7132J7645P111
15297E162j2358J0957m926K771j6234M949R491j9852J9839J7256p992k1486J886
15284a0537j474n705P933K7937Q336O45M870m480j8928o594R402J723p997R353
15270A4484J0358J671J0340k736j3231r419J9121L175j8400m631k4950L927J5548
$$ plain form
15362 11018 -6884 -18867 -14874 -1633 -6236 -15878 -14119 17582 26334 39859 34213 12016 -11334
15349 -11334 -13478 -6538 10889 5189 -11053 -7313 4294 -8297 -10674 2447 6027 20321 27400
15336 27400 13678 -12029 -9457 13784 26955 3766 941 -5206 -2199 -3428 -4747 -1040 -13133
15323 -13133 -8250 1840 -8061 -22428 -15112 -15758 -34289 -46263 -35394 -18868 -3806 10942 21695
15310 21695 25494 16117 -3643 -11233 3254 -4813 8530 13932 1164 -2462 -19594 -1949 5162
15297 5162 -7196 3761 -1165 1606 -14628 -9679 -188 -20040 -201 17055 9063 -12423 -10537
15284 -10537 -12011 -17716 -9783 18154 26490 27135 32005 27525 8597 2003 11405 13128 5131 14484
15270 14484 24842 26513 36853 34117 20886 11467 30588 33763 15363 10732 -14218 -10291 5257
15257E257j965j024j1694j2457k0533J6685J1526j675n680P711K152J262Q607
15244a828o214J2424J5822j5909j2641J3832P567p952q598R879m448q790R586
15231B730P948j339j788n482K636K340j2813m851J1982K7816M067j1685n45J7738
15217C8754J0650k5172m991N320P825k2528m2005j862J3270K4904j1129N293J8477
15204A6806l438r435n120K0437N213m983j231k5149k871J091L05J8050J2625O511
15190B8811O002l133k4603k9544J3380J6993o960j1789J8839J2853k812o018m990
15177G029Q45O574N503K449j0660j1352j2291l649M60j6981L553R895O475N071
15163g079J5480n951q779K804l363J4445P798p453p498o615j08J8112O952J515
$$ plain form
15257 5257 3292 2268 -9426 -21883 -42416 -25731 -14205 -15880 -21560 -13849 -11697 -10435 -1828
15244 -1828 -8042 4382 20204 4295 -8346 5486 13053 5101 -3497 6382 1934 -6856 2730
15231 2730 10678 9339 7551 2069 4705 7045 -5768 -10619 1363 29179 33246 21561 21016 38754
15217 38754 49404 24232 19241 24561 32386 9858 -32147 -34009 -20739 4165 -6964 -1671 16806
15204 16806 13368 3933 -1187 19250 24463 19480 18249 -6900 -9771 -8680 -8375 9675 22300 28811
15190 28811 34813 31680 7077 -22467 -9087 7906 946 -10843 7996 20849 18037 12019 7029
15177 7029 7874 14448 19951 22400 11740 388 -11903 -15552 -15092 -32073 -28520 -18625 -12150 -7079
15163 -7079 8401 2450 -6329 -3525 -6888 7557 15355 7902 404 -6211 -6319 11793 18745 20260
15149B0260j5707j6046R276k787k149m059J2628J8633J1479j7656l08R23l472
15136A1015k5870o984Q866P419p881q44n276m57k1499L667P108K5037K2536j2186
15122D651j7180K6874L21j9807p919J9967L8206j4062k6781j8365K797j1454j0546
15109c3298K1793J6565m812k1119r282O486L504M245J3680P046j1214J076Q473
15096C143P062L85k7788k8622l956J8919J6679Q333J2573L418j165L175N340L273
15082B0769k347r106l293p035p261j0297l914J7358J360n243J2539N321r42P729
15068A5638m866J0320j500j2636p438m823J0517N584J3150j6822j9999n05Q798
15055d582J6901j0482l310M462M485J8561N35Q547J3174o818l0820k8893Q899
$$ plain form
15149 20260 4553 -11493 -2217 -5004 -7153 -11212 1416 20049 31528 13872 13564 14487 11015
15136 11015 -14855 -21839 -12973 -5554 -13435 -14279 -19555 -20012 -41511 -37844 -30736 -5699 16837 4651
15122 4651 -12529 14345 14666 -5141 -13060 6907 45113 31051 4270 -14095 -11298 -22752 -33298
15109 -33298 -11505 5060 248 -20871 -30153 -23667 -20163 -15918 -2238 4808 -6406 -5330 3143
15096 3143 10205 10590 -17198 -45820 -49776 -30857 -14178 -5845 6728 10146 8981 12156 17496 20769
15082 20769 18422 9316 6023 -1012 -8273 -18570 -22484 -5126 -3766 -9009 3530 8851 7909 15638
15068 15638 10772 21092 19592 6956 -482 -5305 5212 10796 23946 7124 -12875 -13380 -4582
15055 -4582 12319 1837 -1473 2989 7474 26035 26570 35117 48291 41473 10653 -18240 -9341
15042i341J4755J0414R411j5183N524K1907N4j7122M397j6010j3380K233J2551
15029A0210J3855R94j8363j1043J5528M679q054o926o903r754J5890J0241q737
15016A617j7917K2789k260j8301R623J8509J5269M629Q179K2354j5883j9589l1148
15003b129j9992J2290J4364J211J020K4700j2114r67K9621J4609l4744k6386L278
14990D761J894o915N676K479J1200J8410j0782k4418l027K788r430K7862j1897
14977H601k3516K8667M311o590J1891l160J1514Q271n746j6006k0330m448R741
14964C200l542R33j389J2195J8944j3782j7693m89J5971K4129o648j3966K749
14951B0612l558p227P969J786j887R026J1941m681L646P534J42j7580k0626m486
$$ plain form
15042 -9341 5414 15828 25239 10056 15580 37487 37541 20419 24816 8806 -4574 -2341 10210
15029 10210 24065 25059 6696 -4347 11181 15860 7806 880 -6023 -15777 113 10354 1617
15016 1617 -16300 6489 4229 -14072 -4449 14060 29329 33958 42137 64491 48608 29019 -2129
15003 -2129 -22121 -9831 4533 5744 6764 31464 19350 18383 48004 62613 27869 1483 4761
14990 4761 6655 -260 5416 7895 19095 37505 26723 2305 -722 2066 -7364 20498 8601
14977 8601 -14915 13752 18063 11473 23364 20204 31718 39989 34243 18237 -2093 -6541 3200
14964 3200 -342 591 -798 11397 30341 16559 -1134 -1623 14348 38477 31829 17863 20612
14951 20612 17054 9827 17796 19582 17695 26721 38662 33981 37627 45161 45303 27723 7097 2611
14937B611j8793j9160Q602P656J3255M643r117n21K0404L857n396P866p70J0355
14923B5492K0834j6k7171j3658n888j5619n348K0098P511l974Q150j2710j5948
14910a8247j1149L282K1512q115j6767Q02M332P055j2159n026J8517J1700o186
14897a0449L285J6162J5421O370j0711N837N401p055j334n712n728r442K3813
14884B5858p025l624o7k2923o816k016J1876j654N542N351R996R13k784l934j422
14869G271K009j0930K337P41Q44L062O404O054k0201j8587L0888J0293j3975o982
14855g72L52R296J3005l04J023j592j1759J1653M367p482m472k879J1203K974
14841B4613j0517k1763n333K333J5190R032n573K555j8226j1502r982L021K8764
$$ plain form
14937 2611 -16182 -35342 -26740 -19084 -5829 -1186 -10303 -10824 9580 13437 8041 15907 15137 25492
14923 25492 46326 46310 19139 5481 -407 -16026 -21374 -1276 6235 2261 10411 -2299 -18247
14910 -18247 -29396 -26114 -4602 -12717 -29484 -28682 -24350 -17295 -29454 -34480 -15963 -4263 -10449
14897 -10449 -7164 8998 24419 30789 20078 25915 31316 24261 22927 17215 11487 2045 25858
14884 25858 18833 15209 15142 -7781 -14597 -16613 -4737 -6391 -849 4502 14498 15411 12627 8693 7271
14869 7271 9280 -1650 687 1428 2272 5334 11738 17792 -2409 -20996 9892 20185 6210 -772
14855 -772 -420 8876 21881 21577 22600 21008 9249 20902 25269 17787 13315 10436 21639 24613
14841 24613 14096 -7667 -13000 -10667 4523 13555 7982 10537 -7689 -19191 -29173 -26152 2612
14828B612O807M882j1236j109p827j4141p56m059j216P519r323j466K8317J7891
14814A6895P992J6605J069J2233j5341k2765m529j1803J0197J4316Q770j3689
14802A9950j4147j5087M322J8766k84N259K903j3756R897j910j8225J9891J5825
14789C3404M965j3404r256j8276P183j301M786L74p802K733j9957Q608R234L357
14775D648l401m815m741l696J109J3962O108p726P519l81L018J2721j183k85j5044
14760G813k1729l217K2212N494k171O895n329n518Q977N73j0641J6809J0787n481
14746B5474j0632j9723j4022Q343j2053Q077J4191L575J0786r387p463J3731J8489
14733B9386J0943k7632j8658J1794R991p418J2973N74l137m287K0857R606J185
$$ plain form
14828 2612 9419 14301 3065 1956 -5871 -20012 -20768 -24827 -26043 -18524 -27847 -29313 -996 16895
14814 16895 24887 41492 42561 54794 39453 16688 12159 356 10553 24869 33639 19950
14802 19950 5803 -9284 -4962 13804 13520 18779 21682 7926 17823 15913 -2312 17579 33404
14789 33404 38369 24965 15709 -2567 4616 3315 8101 8475 673 3406 -16551 -7943 1291 4648
14775 4648 1247 -3568 -8309 -12005 -10896 3066 9174 1448 8967 8586 11604 24325 23142 22857 7813
14760 7813 -13916 -17133 5079 10573 8402 15297 9968 4450 13427 14000 3359 20168 30955 25474
14746 25474 14842 -4881 -18903 -10560 -22613 -14536 -345 3230 14016 4629 -2834 10897 29386
14733 29386 40329 12697 -5961 5833 15824 8406 21379 21953 18816 14529 35386 44992 46177
14720D6177J6754M996k5953k0995J119j6976r194m41p357Q46j742K332n909Q436
14706g907K5958K822j3174n370J2738K730J223k009O764L510o303j7545L017L0481
14692C6935K0339O39l9587m772K7679K4352j8404n965m603p172Q92j1775j738
14679A6820K937k266J4277J1921J8043j710j6920j7085Q329R284j8403j1888j1599
14666A740n194K7739l850k2301k654K1518K5662k85k6489O001P930K300l680j0567
14652A7870J0289j5648l308Q933J6032J0985q532J421m731j3786O493o845j2360
14639F813j675l183J1226J0767j0007p64J2981l416J0921R683j9658k1582N079
14626G185K2123P270J6901N715k405k2490J180J3611K165r813k787O204J4200
$$ plain form
14720 46177 62931 67927 41974 20979 22098 5122 -4072 -4513 -11870 -11024 -12766 -10434 -16343 -7907
14706 -7907 18051 20873 7699 2329 15067 17797 19020 17011 23775 27285 20982 3437 6454 36935
14692 36935 57274 57913 18326 13554 41233 65585 47181 41216 36613 29441 30333 18558 16820
14679 16820 19757 17491 31768 43689 61732 60022 43102 26017 34346 43630 25227 13339 1740
14666 1740 -3454 24285 20435 -1866 -4520 16998 42660 42375 15886 21887 29817 32117 28437 17870
14652 17870 28159 12511 9203 18136 34168 45153 36621 38042 33311 19525 26018 19173 6813
14639 6813 5138 1955 13181 23948 13941 13177 26158 22742 33663 43346 23688 2106 7185
14626 7185 29308 36578 53479 59194 56789 34299 35479 49090 51255 41442 38655 44859 59059
14613E9059K3039k3682l4403j7663O607M448J1881k988n875k0231j2370J9440
14601G262J0971j0490k0123J4677l174j446pr82k390j3450K019O724J4496m50
14587C637q004K4304L136j8860k4334L8568J6236k8008j5046J510J6328J5040
14575B4507j9766r375K0317Q015K924n636n834M369j73j8811m710J3159J4246
14562B3232R416o889n535K240j8820j294J9941l058q573n637j122j2000j2506
14549b0605Q652N063K2377J5065L758o524j473J4171J6642l497j907k2766n148
14536B3808N449m398K099K4014N87j7329k3391K425l757J54j3272N602J3922P862
14522B3775k3606M799K0810j4579J2071K1795j0107j4948L718k8716q017K0078
$$ plain form
14613 59059 82098 58416 24013 6350 12957 17405 29286 26298 20423 192 -12178 7262
14601 7262 18233 7743 -12380 2297 -877 -2323 -2330 -3312 -5702 -19152 -17133 -10409 4087 3637
14587 3637 -4367 19937 23073 4213 -20121 18447 34683 6675 -8371 -6861 9467 24507
14575 24507 4741 -4634 15683 23698 26622 20986 15152 19521 19348 537 -4173 8986 23232
14562 23232 32648 25759 20224 22464 3644 2350 22291 19233 10660 5023 3901 -8099 -20605
14549 -20605 -11953 -6890 15487 30552 34310 27786 26313 40484 57126 53629 51722 28956 23808
14536 23808 29257 24859 26958 50972 51559 34230 10839 13264 9507 9661 -3611 1991 15913 23775
14522 23775 169 4968 25778 11199 23270 45065 34958 20010 23728 -4988 -13005 7073
14510G073K0320o80j3883L004R342J1239Q08m253J267L952q507k3146k5939K666
14496a6737J104N396J454R744O656k904l676J130j2830J817L541J467J5143k789
14482H516k8868n397Q162K190P784J4438J9110N488j5044q399m080j609j0449
14469h158J4731o086J379J6571j472k753j117J281J2811j5699o424n223j513P395
14455E723Q803K0900L681P230P622j5952K282l544q139L554R521M792m092j3923
14441B8458o015j8151J3824K2225l912k1418L649O134j428K4917J4513k0541k1308
14428B0947j2846O499K581J3719J8094j7761o592j514j6829J8035J0412L879j2601
14415B6023k3575R523K5n056j5266J3556L136N551k0171P384J1377R837N992J1894
$$ plain form
14510 7073 27393 26713 12830 15834 25176 36415 37223 32970 34237 38189 29682 6536 -19403 -16737
14496 -16737 -15633 -10237 -8783 961 7617 4713 1037 2167 -10663 -8846 -5305 -3838 11305 8516
14482 8516 -20352 -25749 -17587 -15397 -7613 6825 25935 31423 16379 7980 3900 2291 -8158
14469 -8158 6573 487 1866 18437 16965 14212 13095 14376 27187 11488 5064 -159 -1672 5723
14455 5723 14526 35426 39107 46337 53959 38007 40289 36745 28606 32160 41681 46473 42381 28458
14441 28458 22443 4292 18116 40341 36429 15011 18660 24794 23366 48283 62796 42255 20947
14428 20947 8101 14600 17181 30900 48994 31233 24641 23127 6298 24333 34745 38624 26023
14415 26023 2448 11971 11996 6940 -8326 5230 8366 13917 -6254 1130 12507 22344 28336 40230
14401D0230j4241j1409R7K1140K1384Q960l0810j7292o253K699o976J451O329
14388A5309L75J6893K066O961j0106j7878r775J2539q61q076k0184n350j4783
14375c2870J679J3032P134N501P938K2516n31k7443k0535R402J7947J2070m445
14362A1395j4548k4718L799M069M539k723n281P736J7063K775j891j4716J1611
14349h90N927J7698j8177q591J5504J0362P191o870R1j273k0960K299P661p124
14335B848l338j2185J6881J8933j6269j5593j0598K0664L0062K446j9203j1431
14323C217J9728J9881k734o15R541K311k7645R624j468L847O07m798k5366j7334
14309a1204J0958N044l749j7971J5127K3940L408j5643k3347L0571K4264k859
$$ plain form
14401 40230 25989 14580 14677 35817 57201 66161 35351 18059 11806 14505 7529 8980 15309
14388 15309 15684 32577 34643 41604 31498 13620 3845 16384 15523 7447 -12737 -18087 -32870
14375 -32870 -31191 -18159 -11025 -5524 2414 24930 24399 -3044 -23579 -14177 3770 15840 11395
14362 11395 -3153 -27871 -24072 -20003 -15464 -18187 -23468 -15732 1331 4106 2215 -12501 -890
14349 -890 5037 22735 4558 -4033 11471 21833 29024 22154 22245 20972 12 2311 9972 2848
14335 2848 -490 -12675 4206 23139 6870 -8723 -19321 1343 31405 33851 14648 3217
14323 3217 22945 42826 40092 39477 49018 51329 23684 33308 31840 35687 36294 31496 6130 -11204
14309 -11204 -246 4798 1049 -16922 -1795 22145 25553 9910 -13437 17134 41398 38539
14297C8539k1002Q374J104j2119R784m337Q935n907k7646J0584K0447O063J2199
14284D5018j7767j1335k7988o992J116K1493J4844Q37r836O49N304m275j8100
14271g032J8164K0476J2236M648p62j1619j1778j8476j216j054L3415M919j2066
14258B9855r949l484j5093o233J4835m478O317n35q484J5148L3243j7186j4656
14245A9300j1072j4341m956n748K0506L259q794K3351R818j0872j9142R296J150
14232A1755m593J5214J7240k4211M648J1229J1502k0239j3884j4749l699J554
14220h233r070J6692Q758J4250j7417j1583J2461j2579j605J439l452k272J5446
14207B835N475M535M682J0427j2423L92Q798J6116j688m973j369j4207j086J3636
$$ plain form
14297 38539 17537 25911 27015 14896 24680 20343 29278 23371 -4275 6309 26756 32819 45018
14284 45018 27251 15916 -12072 -19064 -17948 3545 18389 19226 9390 10039 15343 11068 -7032
14271 -7032 11132 31608 43844 48492 47730 36111 24333 5857 4641 3587 37002 41921 29855
14258 29855 19906 16422 1329 -4904 9931 5453 11770 11235 2751 17899 51142 33956 19300
14245 19300 8228 -6113 -11069 -16817 3689 6948 -1846 21505 31323 20451 1309 10605 11755
14232 11755 7162 22376 39616 15405 20053 31282 42784 22545 8661 -6088 -9787 -8233
14220 -8233 -17303 -611 8147 22397 4980 -6603 5858 -6721 -8326 -6887 -10339 -12611 2835
14207 2835 8310 12845 17527 27954 15531 15923 24721 40837 39149 34176 32807 18600 17514 31150
14193C1150m94J6555R641l544j4560o756O905l810N057J1237o28P07j3160j0575
14179B7725m500L159K926n83M017N474P254K786n852j5817k2985J032o39j104
14165B893k0291k183L567J0120J7403J1255q93J5381j2168j9558L597N951p012
14152H062o024j563J6079K3190M777j1540J3335J365l935J0953j1369O105l947
14139D5488m862k737p253k984r427Q79L6719k8923k6935K5430O136P588O027J1372
14125E6518Q335M757j6972r245o284N501J0312L316k1018J464J429n418j3119
14112A9576k4969K6554M0203K1870j2424p955j4875k2119r540J5470n123j7555
14100I113P666K935m48J5729r571J999J7159j1781k3383J2477K0694j3888j1821
$$ plain form
14193 31150 30656 47211 56852 53308 38748 31992 38897 35087 40144 51381 50753 51460 38300 27725
14179 27725 23225 26384 29310 28727 32744 38218 45472 48258 42406 26589 3604 4636 3997 2893
14165 2893 -17398 -19581 -16014 -5894 11509 22764 21871 37252 25084 5526 9123 15074 8062
14152 8062 2038 475 16554 39744 44521 32981 46316 47681 43746 54699 43330 49435 45488
14139 45488 40626 37889 30636 27652 18225 19104 55823 26900 -35 25395 31531 39119 45146 56518
14125 56518 64853 69610 52638 43393 37109 42610 52922 56238 35220 36684 38113 32695 19576
14112 19576 -5393 21161 61364 83234 70810 62855 47980 25861 16321 31791 26668 9113
14100 9113 16779 19714 19266 34995 25424 27423 44582 32801 9418 21895 42589 28701 16880
14087A6880J177j119k084J2983J4448p898m952J0718j4953j4661M152r376J1378
14074A6693J7504J435L569k0657j9968J1399N209l532q153P176m390r336M275
14061A224K1691J6741K348K5151j5068n08O38L60K080K717j2288j7999j0675p156
14047I256N381j0048q11N507J7164J3139n921q013j1239J7000J9334J0207k7192
14034C3764j6654n001r550l302j1681j893N818J2470o924l235P177J6410m874
14021A2525N223K4724l849N396j3809j122K3705K2418l244j5587k9153q930J5016
14008C3313p715k6563q569J3772K3034J7051L2102q415l9228j2847K754N430J5240
13995C9359J0142N813R15M873j6152k3330N625n985r399L0085R438k185o88k4222
$$ plain form
14087 16880 18057 16938 14854 27837 42285 34387 29435 40153 25200 10539 14691 5315 16693
14074 16693 34197 35632 39201 18544 -1424 9975 15184 11652 3499 10675 6285 -3051 1224
14061 1224 22915 39656 42004 67155 52087 51579 52217 52577 54657 57374 45086 27087 16412 9256
14047 9256 14637 4589 3778 9285 26449 39588 33667 25654 14415 31415 50749 60956 33764
14034 33764 17110 12109 2559 -743 -12424 -14317 -8499 3971 -2953 -6188 989 17399 12525
14021 12525 17748 42472 38623 44019 30210 29088 52793 75211 71967 56380 27227 18297 33313
14008 33313 25598 -965 -9534 4238 27272 44323 76425 68010 28782 15935 18689 24119 39359
13995 39359 49501 55314 56229 61102 44950 21620 27245 21260 11861 41946 51384 49199 48511 24289
13981B4289L78Q131m742j934m173O79j5195j5230Q001L3901K1556j0990K6P917
13967E2614Q50j1080J985k143j2745l3120n267O696m336J3290J3760K4051K4074
13954F8629J974J4075n513k5034j6329k02l149j2830m322O1p594M105m195Q532
13940A8208J8391r35J0175j4096m728K228k3464P954J101j8200K825l95K874J3714
13926A5652N749M727N020L075k262j3537L09L774o855p448Q442j6475n194J8053
13912A3030Q37P689K492M12J9488m312N8L414r764l6824k0378J3130K2449R904
13898B1625J6613K302l970j2727m760Q602n27J4338K0241l770q59k4533m900M536
13884C2211J0312p803J082j912n927N26p980n626R205L285P221J0849K416J2665
$$ plain form
13981 24289 24667 32798 28056 26122 21949 22628 7433 -7797 204 34105 55661 44671 44697 52614
13967 52614 53464 42384 44369 42226 29481 -3639 -8906 -2210 -6546 6744 20504 44555 68629
13954 68629 70603 84678 79165 54131 37802 37600 34451 21621 17299 17360 9766 13871 9676 18208
13940 18208 36599 35664 45839 31743 27015 29243 5779 13733 14834 -3366 -541 -936 1938 15652
13926 15652 21401 26128 31148 34223 31961 18424 18733 22507 15652 8204 16646 171 -5023 13030
13912 13030 13867 21556 24048 24460 43948 39636 39694 43108 33344 -3480 -23858 -10728 11721 21625
13898 21625 38238 40540 36570 23843 19083 27685 27158 41496 61737 57967 57108 32575 27675 32211
13884 32211 42523 34720 35802 33890 27963 28489 20509 14883 24088 27373 34594 45443 47859 60524
13870F0524k240j0775n573q7O469q661L113j91n172j5394J6377J5092k075J978
13856E3385k955j2052J107J841r858J3017J062Km36J8079n595p30J1381q940l849
13841E5459r69j2618M105q203j2773N097J8981K3597Q671Q338k2809k6927p955
13828C1994J6231K2913M676M676j0371n40j6086l388J1402M205l6802j2836M254
13815B0328j930J3113J4462k102j2751n667o573k641J468j2301o300K208J4807
13802A6121J1729J1560J1394j1396O408P02N140K7906r25l2496k3334J7165M921
13789D4895p13k942k1926n220Q84n409J215J0210J8911R594j1293j7314q034L753
13775A6611J1615j861J8k160j5209j464N844J9423J5950J4605Lj90o781K971K426
$$ plain form
13870 60524 58284 47509 41936 41849 48318 39657 42770 42579 37407 22013 38390 53482 51407 53385
13856 53385 50430 38378 39485 41326 31468 44485 45547 45549 45113 63192 57597 56867 68248 59308 55459
13841 55459 54490 41872 45977 37774 25001 30098 49079 72676 81347 89685 66876 39949 31994
13828 31994 48225 71138 75814 80490 70119 69579 53493 50105 61507 65712 28910 16074 20328
13815 20328 18398 31511 45973 43871 31120 25453 18880 16239 17707 5406 -894 1314 16121
13802 16121 27850 39410 50804 39408 45816 46518 51658 79564 78639 46143 22809 39974 44895
13789 44895 44182 41240 19314 14094 14978 9569 10784 20994 39905 49499 38206 20892 12858 16611
13775 16611 28226 26365 26383 24223 9014 7550 13394 32817 48767 63372 63375 63185 56404 59375 61801
13760F1801k9054j6207J53o09N571o291J0880r89J0180J5452n254j3516M735n790
13746C1062J9416J0759j683k1884J1585J6402J082r975j2219k0398j2214q37J3384
13733B4480K979n752q873r84J9j647K5888J9130K95m493l0257o084Q290N8L077
13718B6126O182q901j1809M486J0136R200k592l752n593k5785J1527J5518J2210
13705C6953J9672k182r534k1730J174Q102N189P913j099J9357J7655r667p684
13692F4119p835P07K1837M822r51r190k0012j9998l796m017j831q897M44n80J7580
13677C2402J1198r385K343K4922j6477o608J6214J0298k7042j994J5904q903k946
13664C9926J6331J6467j0988k6458O11j9415J5171J4622R421m42Q46o41r792J9699
$$ plain form
13760 61801 32747 16540 16693 16084 21655 15364 26244 25255 35435 50887 45633 32117 36852 31062
13746 31062 50478 61237 59554 37670 49255 65657 66739 56764 44545 24147 11933 11096 24480
13733 24480 27459 21707 12834 11850 11869 10222 36110 55240 55535 51042 20785 14701 22991 23049 26126
13718 26126 32308 23407 11598 16084 26220 35420 32828 29076 23483 -2302 9225 24743 36953
13705 36953 56625 54443 44909 23179 24353 32455 37644 45557 44458 63815 81470 71803 64119
13692 64119 56284 56991 78828 83650 82699 73509 53497 33499 29703 25686 23855 14958 15402 14822 32402
13677 32402 43600 34215 36558 61480 45003 38395 54609 64907 37865 35871 51775 42872 39926
13664 39926 56257 72724 61736 35278 35889 16474 31645 46267 55688 55246 56092 55451 45659 65358
13650F5358N101j1298M068r096J9814J948j4808j2289k1375m29L8860L742j8930
13637E0666l60o389n927M86J4615K2183J172k3508R330Q29k1091M00L55M905Q846
13622E6512k175j3181J2825J6833L0051r070r518j4723j9931L223J4102Q21k0589
13609D5180j431R527J2352j1462j812K888J8815k820j5465J477K3626K184k3409
13596E9650o607R433p714J047J726L786k2542j3178M962l380J1057J0490j734
13583D6996q317M885l531J4163p528j2390O284J4038m66O387J5116K059j563L423
13569G9556j8303k1108J2411J9890k924k4071K70L0517L5290Q291j9094j7229
13557H3496j3546j0932N202J2485j081k4344j4579K0961K1805J1174j0348p128
$$ plain form
13650 65358 70459 59161 63229 54133 73947 75895 61087 48798 27423 26994 65854 69596 50666
13637 50666 50306 43917 37990 38476 53091 75274 76446 52938 62268 63097 42006 42406 42761 47666 56512
13622 56512 54337 41156 53981 70814 100865 91795 82277 67554 47623 50846 64948 65769 45180
13609 45180 43749 53276 65628 54166 52354 55242 74057 71237 55772 57249 80875 83059 59650
13596 59650 53043 62476 54762 55809 57535 61321 38779 25601 30563 27183 38240 48730 46996
13583 46996 38679 43564 40033 54196 46668 34278 40562 54600 54134 60521 75637 77696 76133 79556
13569 79556 61253 40145 52556 72446 69522 45451 45721 76238 111528 119819 100725 83496
13557 83496 69950 59018 64220 76705 75624 51280 36701 57662 79467 90641 80293 73165
13545G3165N394j5231j7762j2511j0131M13l149K534N272O065P118M348k1591
13532B3934p062J4306J3768J169p040j270j2135J0428o08Q915J8245N03j7954
13519D5199j2781L633k952J2529J8205J9961j0891j8084q507M694J4878l675q615
13506E3594q155p493M333J597j8751R5K1969m535R25m457J9733N226N811o833
13492F3059j111J2304O862j8060N966q506j0183J1475K371o848Q607k511l163
13479F0262R33r855j0424P115K9244L48o668p000k937Q302j0063L755J4331k5535
13465E1808j3050J1629L744J220p39j9736j5951M883L0927m56j3244R227J1144
13452F1406J858r806J917L008O452K58j1313O907J2852Q52O225J746k025k885
$$ plain form
13545 73165 78559 63328 45566 33055 22924 23337 20188 22722 27994 34059 41177 45525 23934
13532 23934 16872 31178 44946 46115 39075 37805 25670 36098 35490 44405 62650 63153 45199
13519 45199 32418 36051 33099 45628 63833 83794 72903 54819 46312 51006 65884 62209 53594
13506 53594 45439 37946 42279 43876 25125 25220 47189 42654 43579 39122 58855 64081 69892 63059
13492 63059 61948 74252 81114 63054 69020 60514 50331 61806 64177 57329 65936 63425 60262
13479 60262 61195 51340 40916 48031 77275 77623 70955 63955 61018 69320 59257 63012 77343 51808
13465 51808 38758 50387 54131 55351 54612 34876 18925 23808 54735 54279 41035 50262 61406
13452 61406 63264 53458 55375 58383 64835 65093 53780 60687 73539 74391 80616 82362 80337 77452
13438G7452p166l294K5990N806k909k5842o950k428j4695R790j7481N391j28j484
13424D2052R306J3695M074O625J4743Q92J1664l1612j7928K3811J8039J2774p179
13411A00956l407n130o034j6262O143L470k0933p010o827J8243J4991R722K1807
13398A09729O03j1073o604K522k8277r725J7756M21j6694K3807J1283k5365j0247
13385E8136o390P269L6538O63r081n837j349m527j1524j1600j290J7368j485q946
13371E7945P987r909J4599r16j231p316k2354n366R933m256J5854R874j001n924
13357E7919j8051k3520j7231J0993K2174O387J8611J557j2939R0j000O810K0349
13344G2149R377j7770j8143K395J7135J3631L794m506J0243J2117j5131p127m893
$$ plain form
13438 77452 70286 66992 92982 98788 95879 70037 63087 60659 45964 55754 38273 43664 43536 42052
13424 42052 51358 65053 69127 75752 90495 91387 103051 71439 53511 77322 95361 108135 100956
13411 100956 97549 92419 86385 70123 76266 79736 58803 51793 44966 63209 78200 87922 109729
13398 109729 110332 99259 92655 95177 66900 57175 74931 75352 58658 82465 93748 68383 58136
13385 58136 51746 59015 95553 96216 87135 81298 79949 75422 63898 52298 51008 68376 66891 57945
13371 57945 65932 56023 70622 69706 68475 61159 38805 33439 43372 39116 54970 64844 63843 57919
13357 57919 39868 16348 -883 10110 32284 38671 57282 58839 45900 45990 44990 51800 72149
13344 72149 81526 63756 45613 48008 65143 78774 82568 78062 88305 100422 85291 78164 73271
13331G3271n777R022j946j1769l266Q309J7022L524q122p298n926J4603L905j3425
13317G2127p85K1908K0253k3977j3768O349j2128n391k4235J0744J0057J7141
13305G8295P137l946j418j3872p950k033N021J1272N363J852K292O831R04o85
13291H9063O980K034j1361K318j0671j5921q11R90J0273J5721k110j324l2012
13278E3169j3915K2198J7525J5320J2875l285j660q356n491J4801L534o496k8366
13265G1853k0321J2446J7370P396o212L110M724J2784J505R92k5711o433j0165
13252F3338R455J3686o974j267L597J0214M119N61j33R166n753m355J480J3637
13238A10771Q976j8877j7604k702o365n181K07m891q650j3771J7816q820J1283
$$ plain form
13331 73271 67494 76516 74570 62801 59535 67844 84866 88390 80268 72970 67044 81647 85552 72127
13317 72127 71342 93250 113503 89526 75758 82107 69979 64588 40353 51097 61154 78295
13305 78295 85432 81486 80068 66196 58246 56213 61234 72506 77869 79721 82013 88844 89748 89063
13291 89063 96043 98077 86716 89034 78363 62442 61631 62621 72894 88615 86505 85181 53169
13278 53169 39254 61452 78977 94297 107172 103887 102227 93871 88380 103181 106715 100219 71853
13265 71853 51532 63978 81348 88744 82532 85642 90366 103150 104655 105647 79936 73503 63338
13252 63338 72793 86479 79505 78238 81835 92049 96168 96729 96596 105762 100009 95654 97134 110771
13238 110771 119747 100870 83266 80564 74199 69018 69225 64334 55684 41913 59729 50909 62192
13225F2192J9194O923O474K642J3210O494r007k804L552j8295j1249J4467L2185
13212A25978J7452j1132j3757p228j0362L763O384O757k988k6679k526p445q977
13199F9240M943P357J3745j4788m942l21M131J115j5096j0221O502N880j440J2015
13185G8120K401M420O49j0409j3255p137Q804K1665N225J9200J4264l2985j0560
13172H0402J7461P282j2483l339R058q984p683K1859j947j1153j918J2119m447
13159I6227P662o184j4468O664N072J5546N185j9390l556J3647m568j2791M101
13146I3147K2556r899j4052O656p357k757Q57P306J3907n556Q07R613r481k4969
13132H0778j4188K5977J2536R63L029O298q361n06J3202J1625Q354j8199j648
$$ plain form
13225 62192 81386 88309 94783 97425 110635 117129 108122 105318 108870 90575 79326 93793 125978
13212 125978 143430 132298 118541 111313 100951 104714 111098 117855 114867 88188 85662 78217 69240
13199 69240 74183 81540 95285 80497 75555 75234 79365 80480 65384 55163 61665 67545 66105 78120
13185 78120 80521 84941 85590 75181 61926 54789 63593 85258 90483 109683 123947 90962 80402
13172 80402 97863 105145 92662 89323 98381 89397 81714 103573 101626 90473 88555 100674 96227
13159 96227 103889 97705 83237 89901 94973 110519 115704 96314 92758 106405 101837 89046 93147
13146 93147 115703 105804 91752 98408 91051 88294 89151 96457 110364 104808 105615 115228 105747 80778
13132 80778 66590 92567 105103 106066 109095 115393 107032 106526 119728 131353 139707 121508 119860
13119A19860j4430J078J0989K6305J5401j4576L842j6071j4524k2794o444K0650
13107A09286J035j1433R347J6155J7913j3836n677J711p255N197M783N201l181
13094A29246j5022j1567K0435p42o886k391O269q573n528J2080R823j8023k92
13081A08829J2657N118j066j3811k0393O317J2848j857R480K2311k556N505J3688
13068A57070r529K379j10n937J1082p566k3992l158K045R979K7559K756l044k421
13054A57113n763L724k357L711j1058m7999o328K2711O135j0082J5880O133J32
13041A31952n501J809o139j0299J9149j88j3287k588M331K4024J63K142n567J1313
13027A51314K2974J1239j966j5407j9002K157l81j2220j118j1230L016N413K620
$$ plain form
13119 119860 105430 106508 117497 143802 159203 144627 148469 132398 117874 95080 88636 109286
13107 109286 110321 98888 108235 124390 142303 128467 122790 124501 117246 122443 127226 132427 129246
13094 129246 114224 102657 123092 122350 115464 113073 119342 110769 105241 117321 127144 109121 108829
13081 108829 121486 126604 125538 111727 91334 97651 110499 108642 118122 140433 137877 143382 157070
13068 157070 147541 149920 149810 143873 154955 147389 123397 120239 122284 132263 159822 162578 159534 157113
13054 157113 151350 155074 152717 156428 145370 97371 91043 113754 119889 109807 125687 131820 131952
13041 131952 126451 128260 122121 111822 130971 130783 117496 114908 119239 143263 143426 145568 140001 151314
13027 151314 174288 185527 183561 168154 149152 151309 150928 138708 137590 126360 129376 134789 137409
13014A37409M043p732k3985L183j9597j536M512J9592J1761R115j4118O272M289
13001A33208k679r175J0450K9845J1569j0610k931j8263j1133J675r299k6939
12989I5718k0646J629K8262J4025O571M842R546J5347K7963J5138k8622k2931
12977A46842N024j1799k388J0110J5300P231R614m587j3062k1554N722J5917l525
12964A58845j5211r404p92P843Q173l591j5585j0114J1838K497k250J7068o55
12951A48662j7810j1474M751k494L461l148p917J6284K3493Q428K5770M601j6745
12938A75862m634j122j459L3r992K293k833j47M510j0997q341m50Q179k716R302
12923A57488O984P81L857J661L373J983k607j0741j1483n475o540M6q63K2478
$$ plain form
13014 137409 141452 133720 109735 112918 93321 91785 96297 115889 127650 136765 122647 128919 133208
13001 133208 130529 121354 131804 161649 173218 162608 159677 141414 130281 131956 122657 95718
12989 95718 75072 76701 104963 118988 125559 130401 139947 155294 183257 198395 169773 146842
12977 146842 151866 140067 137679 147789 163089 170320 179934 175347 162285 140731 146453 162370 158845
12964 158845 143634 134230 133438 141281 149454 145863 130278 120164 132002 134499 132249 149317 148662
12951 148662 130852 119378 124129 121635 125096 121948 114031 130315 153808 162236 188006 192607 175862
12938 175862 171228 170106 168647 168680 158688 160981 158148 158001 162511 151514 143173 142723 150902 148186 157488
12923 157488 164472 165253 169110 170771 174144 176127 173520 162779 151296 145821 139281 139327 138464 160942
12909A60942K4881o684k0625M863J995l847j2020k084p476m870L822P231L011
12896A49139K161P181N65J7546o697m377m078K381J7852J4392j3739P991m945
12883A85372N257K99j8418j0701k346K2894r80m36R17q733q640j741p304K777
12869A58217r907j573j3353L732J3798J6313J0489l535l694j5464J2756O420J0310
12856A84509P712j7978q722M821r083l20m467J5612J3377j551k71j5556M749j6061
12842A56771m111j8104J0698K4614K2967M201r144k1537r688n592M554J7178J6822
12829A89629j1486j9334N287J6326J7283j0670l689J2763K5151p047k5765Q498
12817A96946N318j3931l710j865j1223J6485N23o187J3666Q295j5566L2k464j6365
$$ plain form
12909 160942 185823 179139 158514 163377 165372 161525 149505 147421 139945 135075 138897 146128 149139
12896 149139 151300 158481 159046 176592 169895 165518 161440 163821 181673 196065 182326 190317 185372
12883 185372 190629 190928 172510 161809 159463 182357 181377 180941 181858 173125 164485 162744 155440 158217
12869 158217 148310 146737 133384 137116 150914 167227 177716 174181 170487 155023 167779 174199 184509
12856 184509 192221 174243 165521 170342 161259 160939 156472 172084 185461 183910 183639 168083 172832 156771
12842 156771 152660 134556 145254 169868 192835 197036 187892 166355 156667 151075 155629 172807 189629
12829 189629 178143 158809 164096 180422 197705 187035 183346 196109 221260 214213 188448 196946
12817 196946 202264 188333 184623 182758 171535 188020 188543 182356 196022 204317 188751 188783 186319 169954
12803A69954J0838J579q1J4671N187O053J1691m304j1638M875M123p021j9050
12790A86877p404J5838j08j8569j3794j8552K1081Q532Q694J226j3540j926k281
12777A66074J5214K2452J0397M626p75O786l024j8840k945J1917m204j8051N550
12764A95177L7612N123k0363q854n482m184j4722j262q093k18J0340J0300n994
12751A89380J599M548p767j4986J2781J2254j0739R800j1662j2351R536q737K3570
12738A97226J2259J7798j0948r24J6600J078j0314k61N417Q705J2775q789j6517
12725B24105r886o785O577K458j723J5019J9686N24L506j3886r343J1381n556
12712B36077j4471L048K1123p030k954q732J3809j1345R920J6986n884j6963k2214
$$ plain form
12803 169954 180792 182371 182290 196961 202148 208201 219892 215588 203950 208825 212948 205927 186877
12790 186877 179473 195311 195203 176634 162840 144288 165369 173901 182595 183821 170281 168355 166074
12777 166074 181288 203740 214137 218763 217988 224774 221750 202910 199965 211882 207678 189627 195177
12764 195177 232789 237912 217549 208695 203213 199029 184307 183045 174952 174734 185074 195374 189380
12751 189380 190979 195527 187760 172774 185555 197809 187070 196870 185208 172857 182393 173656 197226
12738 197226 209485 227283 216335 215411 232011 233089 222775 222514 227931 236636 249411 240622 224105
12725 224105 214219 207434 214011 216469 214746 229765 249451 249975 253481 239595 230252 241633 236077
12712 236077 221606 224654 245777 238747 235793 227061 240870 229525 239445 256431 250547 233584 211370
12699B11370J417M080K91j981L53R064m426l369L1467l947M21P653j1550k6564
12685B14279L725J1755q582N271K2763N807N55L721k2685j9629j194R862J0902
12672B36550K5326M621M902Q276j0212J171R548L385R326j6693k0760k0729j0874
12659B23837r663N250L146k753l968K9189N296m949K751J0376M283J0993j2897
12646B60891p870N455J8246r230o313J0846p806R745m56k270k8994m578O568M466
12632B48700J2961J520J393L703o541l495O209J6971R703J038r269L435K966P386
12618B96680j7147k3412L475Q391k0075r663J4912J4635M699J4005Q682M537p531
12605B92188m642P844k549m179l2445J2792K3341M133M673O613J5143q114j1462
$$ plain form
12699 211370 212787 216867 217158 215177 215530 224594 220168 216799 248266 244319 244740 252393 240843 214279
12685 214279 218004 229759 221177 226448 249211 255018 255573 259294 236609 216980 215786 225648 236550
12672 236550 261876 266497 271399 279675 269463 270634 280182 283567 292893 276200 255440 234711 223837
12659 223837 214174 219424 222570 219817 215849 245038 250334 245385 248136 258512 262795 273788 260891
12646 260891 253021 258476 276722 267492 261179 272025 264219 273964 273508 271238 242244 237666 244234 248700
12632 248700 261661 263181 264574 268277 261736 258241 264450 281421 291124 292162 282893 286328 289294 296680
12618 296680 279533 256121 259596 267987 247912 238249 253161 267796 272495 286500 295182 299719 292188
12605 292188 287546 295390 292841 288662 256217 269009 292350 296483 301156 307769 322912 314798 303336
12592C03336j8988N686k3848J728K2149J7687p103j6468J1739n210O244J0438
12580C07390M822J3098j0900k323J740N91J0907k3888j8609J3512N925r918Q163
12567C00510K4011K0795O773J79j6092k9886K018P279Q065k0040J112J2200K758
12554C19682J248O487P280N347n507k0977j1183L916R509k643K1134J4303r68
12541C47628k030O081M548r30J2515j5418k2040k3068J6180K0821j9996N199N722
12528C35212j3572m866K0600J636O914K0805J3288j742p815n748Q613o89p137
12515C65499k106M835k4221O252J4569J5279L796r190q685n15j3717l0560n640
12502C15596J2350L340Q660L0618J1027n601K42j2184l624J5941J353k077O945
$$ plain form
12592 303336 284348 290034 266186 267914 290063 307750 300647 284179 295918 290708 296952 307390
12580 307390 312212 325310 314410 312087 313827 314418 325325 301437 282828 296340 302265 292347 300510
12567 300510 324521 345316 352089 352268 336176 306290 308308 315587 323652 303612 304724 316924 319682
12554 319682 320930 327417 334697 340044 334537 313560 302377 306293 315802 313159 334293 348596 347628
12541 347628 345598 351679 356227 355297 367812 352394 330354 307286 323466 344287 324291 329490 335212
12528 335212 321640 316774 337374 339010 345924 366729 380017 378275 370460 364712 373325 372636 365499
12515 365499 363393 368228 344007 350259 364828 380107 383903 374713 366028 365513 351796 321236 315596
12502 315596 327946 331286 339946 370564 381591 375990 376232 364048 360424 376365 377718 375641 382586
12489C82586j2327M872k348o326K6439o864o145J1635N795k721J7886J0353J23
12476D22958J0016L677m493p26j7664m016J7876k695j1163p256J7661J2678p121
12463D29732j6329j3517m911M551J6468K254k391N510j2317J4352L3507N110j8901
12450D43118j0431j1643j4691k2301O501K8285K583j696O28q094J8260J526J0674
12437D42719P643k911R395j8742J3800M939j0594j2201P252j401M552R379q225
12424D45605J0603J1309j0381m789J7018M639k4773k5110n213O277J6242J6909
12412D58336K3L133N435R964j9R233q267j0949m207L0209P967J8281j0810k7126
12398D81203l454J5607Q165j859L0422J0486p522l121l2378j6402J3834J5023
$$ plain form
12489 382586 370259 375131 372783 366457 392896 386032 379887 391522 397317 394596 412482 422835 422958
12476 422958 432974 436651 432158 431432 413768 409752 427628 424933 413770 406514 424175 436853 429732
12463 429732 413403 399886 394975 399526 415994 418248 415857 421367 409050 423402 456909 462019 443118
12450 443118 432687 421044 406353 384052 390553 418838 421421 419725 420353 412259 430519 432045 442719
12437 442719 450362 447451 456846 438104 451904 456843 446249 434048 441300 439899 444451 453830 445605
12424 445605 456208 467517 457136 452347 469365 474004 449231 424121 418908 425185 441427 458336
12412 458336 458359 461492 466927 476891 476872 486105 477838 466889 462682 492891 500858 519139 508329 481203
12398 481203 477749 493356 501521 499662 530084 540570 533048 529927 497549 481147 494981 510004
12386E10004K44j7793l923N139n256M116l528P397J1966l606j2750j907j225Q845
12372D97723P598J0186R142J392J825K469n037K868J0200J8793o168m379k336
12359E44276K781j0920j159J7160L643J938q922j6074o231P083N318J2943K0847
12346E72683p798k5425O6K8245L656j0561J84K0279l87P559J891j282q150n532
12332E75428P631k789j3056m078J7059J3663m280k0489M045K0570j9598R075J5177
12319E98358Q596L88j3138J5341l577r677J6227j569Q245l267j2678K2358P959
12306F33566j7546r605n104J9915p566j1188o001j6328n020J5199J3150J7982
12294F21454L1063J727k563j401J9479J5824P981N259L399n80j6475k5609j4422
$$ plain form
12386 510004 510248 492455 488532 493671 488415 492531 489003 496400 508366 504760 492010 490103 488878 497723
12372 497723 505321 515507 524649 526041 527866 530335 525298 528166 538366 557159 550991 546612 544276
12359 544276 547057 536137 534978 552138 555781 557719 548797 532723 526492 533575 538893 551836 572683
12346 572683 564885 539460 539526 567771 571427 560866 561050 581329 580942 588501 590392 589110 580960 575428
12332 575428 583059 580270 567214 563136 580195 593858 589578 569089 573134 593704 574106 583181 598358
12319 598358 606954 607342 594204 609545 605968 596291 612518 610949 619194 615927 603249 625607 633566
12306 633566 616020 606415 601311 621226 613660 602472 596471 580143 575123 590322 603472 621454
12294 621454 652517 654244 651681 650280 669759 685583 693564 698823 702222 701642 685167 659558 645136
12281F45136K2529J3549J7665k3644o628Q614j816J9292K535q260j899J7307N40
12268G04920n971O798J5924K3831k1573m6816j9953J4032J9057L412J0183J6606
12256G20450q207J4847J455J4913J328J4719o646o734N767J9011j0429j4788o403
12243G39283K68k286j847o624J0567q801j2187M212J0882J1684J4447l488r583
12230G46527K1330J4722k616O975M016j402j4448o728J5755J0200K189q02j1967
12217G83751l798K5879K5089j839n507j4150p903o034L572J4471l083k28J2880
12204H23100J2317R055r184O872j0098j0708o464J631J3580J0416Q164K308J093
12191H52082r940j7114K385K4771n62J0741J1168j090j1318r124Q018K1269J0641
$$ plain form
12281 645136 667665 681214 698879 675235 668607 677221 675405 694697 697232 688972 687073 704380 704920
12268 704920 698949 705747 721671 745502 723929 677113 657160 671192 690249 693661 703844 720450
12256 720450 712243 727090 728545 743458 744786 759505 752859 746125 751892 770903 760474 745686 739283
12243 739283 739551 737265 735418 728794 739361 730560 718373 722585 733467 745151 759598 756110 746527
12230 746527 767857 782579 779963 786938 790954 789552 775104 768376 784131 794331 796520 795718 783751
12217 783751 779953 805832 830921 829082 823575 809425 801522 795488 799060 813531 810448 810220 823100
12204 823100 835417 844472 835288 842160 832062 821354 814890 816521 830101 840517 848681 850989 852082
12191 852082 842142 825028 827413 852184 851622 862363 873531 872441 861123 851999 860017 881286 891927
12178H91927q037j6209r943k091K465J6152O329J0266K1801J1470m006q954n338
12165I05832J1470J3887J09j3941n73j6130n251K9432L5254P116k4547k5273k5081
12152H92304J7569J6133q410J8515P132k241L703L1108J3114k3951k2072Q820
12140I51724K9237J5042K761j8237j1668K178N094R220R906J0340J0618O967l248
12127A019934R575J090k7843k0545K400J9567N291M20p234q454j8794K151K2192
12114I99750J9252J3202J5806P55j3585M581J1161j764k0030j8979K4361L4380
12102A068890n449L176J4408J3640M014P337q136k099r796n109J580M638R366
12089A096460O928j5145Q811L105O097J1611M673M3M626j2277j1587J378J8473
$$ plain form
12178 891927 883890 867681 857738 855647 858112 874264 880593 890859 912660 924130 920124 911170 905832
12165 905832 917302 931189 931298 917357 916784 900654 895403 924835 960089 967205 942658 917385 892304
12152 892304 909873 926006 917596 936111 943243 941002 944705 975813 988927 964976 942904 951724
12140 951724 980961 996003 998764 980527 968859 971037 976131 985351 995257 1005597 1016215 1023182 1019934
12127 1019934 1029509 1030599 1002756 982211 984611 1004178 1009469 1009889 1002655 994201 975407 977558 999750
12114 999750 1019002 1032204 1048010 1048765 1035180 1039761 1050922 1049158 1029128 1010149 1034510 1068890
12102 1068890 1063441 1066617 1081025 1094665 1098679 1106016 1097880 1095781 1085985 1080876 1082456 1087094 1096460
12089 1096460 1103388 1088243 1097054 1100159 1106256 1117867 1122540 1122583 1127209 1114932 1103345 1104723 1123196
12076A123196N146R745R24l288R719k57k0350k456J0924K618O119O5J4228j204
12062A155129n784J2989R517j6827l830p626J1165o673N14J9490N163j0040R8
12049A163285J0857J0261O44K115K0661Q970k0616k3660N799M445P870n543p773
12036A177315R033k458J5751O769k891r422N773K0040l515o657j1658K161o97
12023A199544j7110N895J9565N695J1507K2099l08p527q36Q080o32j5337Q018
12010A238653P878K0470j7374L41m667k6692k3852J1290L0411o256o794j8599
11998A204809m833O150L2641j1o362K329k0615q668L1950k26k52Q696r579m282
11984A231747M147L598K067J4892Q203j068o966j5641n266J1448M049j5585j6648
$$ plain form
12076 1123196 1128342 1138087 1139011 1135723 1145442 1145185 1124835 1122379 1133303 1135921 1142040 1142105 1156333 1155129
12062 1155129 1149345 1162334 1171851 1155024 1151194 1143568 1154733 1148060 1148574 1168064 1173227 1163187 1163285
12049 1163285 1174142 1184403 1185047 1187162 1207823 1216793 1196177 1172517 1178316 1182761 1190631 1185088 1177315
12036 1177315 1186348 1183890 1199641 1206410 1203519 1194097 1199870 1219910 1216395 1209738 1198080 1200241 1199544
12023 1199544 1182434 1188329 1207894 1213589 1225096 1247195 1246887 1239360 1238524 1246604 1245972 1230635 1238653
12010 1238653 1246531 1267001 1249627 1249968 1245301 1218609 1194757 1206047 1236458 1230202 1223408 1204809
11998 1204809 1199976 1206126 1238767 1238756 1232394 1234723 1214108 1205440 1237390 1237164 1236912 1245608 1236029 1231747
11984 1231747 1235894 1239492 1241559 1256451 1264654 1263586 1256620 1240979 1235713 1247161 1251210 1235625 1218977
11971A218977j026N071R431J6813m694m199L469N254K612j2448k2294O906J12
11958A223984L40j2152J1323J531J3155O908K3094O970L668j1111l023O179j4656
11945A256210Q719r070j1010n156n12K363O471o107K662P075L1066m113p454k208
11931A268936j2829j245r659p789N644l691K618j551j846J2949J5083q195p895
11918A250530o288o809p882k086M190j256q066j7536J33K667J1424k220j1629
11905A205172K064N513o374k0133o583K4800Q076Q966J5081J519J8078m571k451
11892A249157L884k1566j1930J1018n681R488M59p501p580j571k816m391K70k968
11878A208272j729L08k0099l498J1059k80M853Q784l348r666j1900n662p040j5698
$$ plain form
11971 1218977 1217951 1223022 1232453 1249266 1244572 1240373 1243842 1249096 1251708 1239260 1216966 1223872 1223984
11958 1223984 1224324 1212172 1223495 1225026 1238181 1245089 1268183 1275153 1278821 1267710 1264687 1270866 1256210
11945 1256210 1264929 1255859 1244849 1239693 1239181 1241544 1248015 1241908 1244570 1251645 1282711 1278598 1271144 1268936
11931 1268936 1256107 1254862 1245203 1237414 1243058 1239367 1241985 1240434 1238588 1251537 1266620 1258425 1250530
11918 1250530 1244242 1237433 1229551 1227465 1231655 1230399 1222333 1204797 1204930 1207597 1219021 1216801 1205172
11905 1205172 1207236 1212749 1206375 1186242 1179659 1204459 1212535 1221501 1236582 1238101 1256179 1251608 1249157
11892 1249157 1253041 1231475 1219545 1230563 1224882 1234370 1234829 1227328 1219748 1218177 1215361 1210970 1211240 1208272
11878 1208272 1206543 1206851 1186752 1183254 1194313 1194033 1198886 1207670 1204322 1194656 1182756 1177094 1170054 1154356
11864A154356k7059r021O939J8857J1417j2783n287P700J1704J0318J759j6481
11852A152419l152m144R252O216j0957q056o814J0987J4374o813P065j1984J2092
11839A160485k363k0790k6998j5676J3609J6445k0709j5698k453p258J4377J6421
11827A109392J7655R238m721l1514q817p285j3108J5344j76q09k596j0678q591
11814A063334p127p253J59j5468N166K707J2896P504J576N729o413j7717j8836
11801A026257n350Q781Q37l80N797m34j5271n577Q388m552Q944K084j0973j0814
11787A007737K343Q82k642l799M042P211L300j9282P291L808j3262m888L441j1037
11773I85145j170Q687j7897j8980k40J1670K0565o038k0221k2076Q15o863m636
$$ plain form
11864 1154356 1127297 1118276 1125215 1144072 1155489 1142706 1137419 1145119 1156823 1167141 1168900 1152419
11852 1152419 1149267 1145123 1154375 1160591 1149634 1141578 1134764 1145751 1160125 1153312 1160377 1148393 1160485
11839 1160485 1158122 1137332 1110334 1094658 1108267 1124712 1104003 1088305 1085852 1078594 1092971 1109392
11827 1109392 1127047 1136285 1131564 1100050 1091233 1083948 1070840 1086184 1086008 1085199 1082603 1071925 1063334
11814 1063334 1056207 1048954 1049113 1033645 1038811 1041518 1054414 1061918 1063494 1069223 1062810 1045093 1026257
11801 1026257 1020907 1029688 1030525 1030145 1035942 1035508 1020237 1014660 1023048 1018496 1027440 1029524 1018551 1007737
11787 1007737 1010080 1010962 1008320 1004521 1008563 1015774 1019074 999792 1007083 1010891 997629 992741 996182 985145
11773 985145 983975 992662 974765 955785 955545 967215 987780 981742 961521 939445 940260 933397 928761
11760I28761k871J1111l599M383r121K035j6378J7899r175j1779L518P99N823
11747I21406K6592j0745j1022P206j9789k3982j3865N005K5808R716J566l760
11735I14136J613j9601m008k3029p109r710j1139N90K0890N061k448l787P329
11722H68788r871k0585J6875O693j7090k3379k019N962Q75k778J729Q033m862
11709H28371r135O931J4773N407j3115j9194q195J8392J546j3039N375J1979N376
11696H35472j4643k0351k2679j976J5940J6803J00q970j4793l517O289j0814Q042
11683G84903O659j7771k9814n945J1652j300J2527P041p805j0540q513R099q280
11670G41913k7098j9155J6247K3857J2941l310q11o571Q482J046J0137n404j9301
$$ plain form
11760 928761 925890 937001 933402 937785 928664 930699 914321 932220 923045 911266 914784 915583 921406
11747 921406 947998 937253 926231 933437 913648 889666 875801 880806 906614 916330 917896 914136
11735 914136 915749 896148 892140 869111 862002 852292 841153 841743 862633 867694 865246 861459 868788
11722 868788 858917 838332 855207 861900 844810 821431 819412 825374 826249 823471 825200 833233 828371
11709 828371 819236 826167 840940 846347 833232 814038 805843 824235 825781 812742 818117 830096 835472
11696 835472 820829 800478 777799 775823 791763 808566 808666 799696 784903 781386 787675 776861 784903
11683 784903 791562 773791 743977 738032 749684 748384 760911 767952 760147 749607 741094 750193 741913
11670 741913 714815 695660 711907 735764 748705 745395 744584 738013 746495 747541 757678 752274 732973
11657G32973j1473k1224j8071J8963L2472R539N11j6977n282j7298k5149j9471
11645F59513l050K6290R886j6222p000j5831J7740M078J595k33k8615j6381R692
11632F41462K9451J4368P541O082n284r846j0005m071j495k769j7862j4346j6456
11619F16770j2531J3194J7786P189K487J393j3033O9k21j2555l751J2070k7028
11606F01839O397K7106j645m032K833J961j9251o114l908K661j669M635j7170
11593E93643J1216L891M224r810o081k6099j6334P995K010O961J7355k3453o014
11580E59504J519q218P635K7407l920j3947k5167J570K1803q378j9248r176N623
11567E37007n100J6708K0317j3451k5663j0694n317j119J909J3904J4321j0128
$$ plain form
11657 732973 721500 700276 682205 701168 733640 743179 743690 726713 721431 704133 678984 659513
11645 659513 656463 682753 692639 676417 669417 653586 671326 675404 676999 676766 648151 631770 641462
11632 641462 670913 685281 692822 698904 693620 683774 673769 669698 668203 665434 647572 633226 616770
11619 616770 604239 617433 635219 642408 644895 646288 633255 633324 633103 620548 616797 628867 601839
11606 601839 608236 635342 633697 629665 632498 634459 615208 609094 605186 607847 606178 610813 593643
11593 593643 604859 608750 612974 603164 597083 570984 554650 562645 564655 571616 588971 565518 559504
11580 559504 561023 552805 560440 587847 583927 569980 544813 546383 568186 559808 540560 531384 537007
11567 537007 531907 548615 568932 555481 529818 519124 513807 512688 514597 528501 542822 532694
11555E32694k2745J833j5517K233K503o011J609O498K0652P667j2841m894N280
11542E18961o067k3724L100q533K0916K4833L041m77M343j1367j350p28j9794
11529E03154k7398l0899J0332K7694Q747L946j271n132J0402r141j3785j743K638
11516D77544M3P726J7105O673l7235l735J2819P974k5033K062J0306k40q311k4995
11502D42703j144Q004Q359j4186P422l196O149J3107Q403m561l7124M088J6656
11489D54680j7208k2680o0J4743J0685q82q032J4883J6915q777k1370j0838J2710
11476D34769J3768j4944j9333J8586n995j396J9991P671j8701j0955q821j4112
11464D00528k461j862j9557L375J0876m080r684L734J9468l983r017r995n966
$$ plain form
11555 532694 509949 511782 496265 498498 501001 494990 496599 503097 523749 531416 518575 513681 518961
11542 518961 512894 489170 492270 483737 504653 529486 532527 532050 536393 525026 523676 522948 503154
11529 503154 475756 444857 455189 482883 491630 495576 494305 489173 499575 490434 476649 474906 477544
11516 477544 477587 485313 502418 509091 471856 468121 480940 488914 463881 465943 476249 476009 467698 442703
11502 442703 441559 449563 457922 443736 451158 447962 454111 467218 475621 471060 433936 438024 454680
11489 454680 437472 414792 414732 429475 440160 439278 431246 446129 463044 454267 432897 422059 434769
11476 434769 448537 433593 414260 432846 426851 425455 445446 453117 434416 423461 414640 400528
11464 400528 398067 396205 376648 380023 390899 386819 377135 380869 400337 396354 387337 377342 371376
11451C71376Q627j0709l017Q809P691k840j4740l072J1070j2112J5313J6581M554
11438C97531J346m957K1j8509l012j992q609j0240k501M507O782q255m315j0715
11424C37082m109J4246l491p387L821K0065J1958k2619j3610O878J1756o21o707
11411C47262k150Q520J5265n673k3194M175J3550R151j2464j8136J469N482O333
11398C49590J2203J0780j1102K073l066j276k355J3125l897r771j4874k9175j1519
11385C00736J4130m223K538o4l062L434j940J98j297K2423R565j2301j4334N919
11371C21722K199K748M257J806j0022j8211j0804O520R619n715n342q104m247
11358B86426m882L659k361m321L34M054N575j394K1436J5118j9342K4047P73J0619
$$ plain form
11451 371376 380003 369294 366277 375086 382777 379937 365197 362125 373195 361083 376396 392977 397531
11438 397531 398877 393920 393941 375432 372420 370428 361819 351579 349078 353585 360367 352112 347797 337082
11424 337082 332973 347219 343728 336341 340162 360227 372185 349566 335956 342834 354590 353969 347262
11411 347262 345112 353632 368897 363224 340030 344205 357755 366906 354442 336306 337775 343257 349590
11398 349590 361793 372573 361471 363544 360478 359202 356847 369972 366075 356304 341430 312255 300736
11385 300736 314866 310643 313181 313117 310055 313489 311549 311747 310450 332873 342438 330137 315803 321722
11371 321722 323921 326669 330926 332732 322710 304499 293695 300215 309834 304119 298777 290673 286426
11358 286426 281544 285203 282842 278521 278855 282909 288484 287090 308526 323644 304302 328349 329122 339741
11344C39741J1586k0635j5316j6739k840N278O705J238j5022J18j5077l974J6024
11331B91087L430j4908k079K0628K3640o022j6967j4100k3914m770Q482J0698
11319B75205K630o793J1506j4j5142p302j292J4651j409l715R50P504J9634L569
11305B99982k1663j5020M719J9578K476j131J4102L273j0487l711j2773j4399
11293B64946j6432k1643p01J856R807J2900p150j8719O424J043J682k0337L356
11280B17032J6647l09k477J0671o029k4622J876N631m254r721r103j5626J7775
11267A97491Q202j832J6134P508P612J2758k4077j5970M0n36L1570J1636J1804
11254B62340J7331J2900j4012j1808J479p179j1530j3540r78J6211K664K190j1801
$$ plain form
11344 339741 351327 330692 315376 298637 295797 301075 307780 309018 293996 294114 279037 275063 291087
11331 291087 294517 279609 277530 298158 321798 315776 298809 284709 260795 256025 264507 275205
11319 275205 277835 271042 282548 282534 267392 260090 258798 273449 272040 268325 269275 276779 296413 299982
11305 299982 278319 263299 268018 287596 290072 288941 303043 306316 295829 292118 279345 264946
11293 264946 248514 226871 226170 228026 237833 250733 243583 224864 231288 232331 234013 213676 217032
11280 217032 233679 233370 230893 241564 235535 210913 212789 218420 214166 204445 195342 179716 197491
11267 197491 205693 203861 219995 227503 235115 247873 223796 207826 207866 207330 238900 250536 262340
11254 262340 279671 292571 278559 266751 268230 261051 249521 235981 235003 251214 253878 256068 244267
11241B44267r420j2220k2252J844J4459J4035k670k32K9017M0561K8705J5470
11229C41564J6160L1720N9269O8563J00610J68454K65029K72499K24551J85145
11219A733564M8526j37567k12671k36013k28261j65554j01824r6429o7765m2657
11209D93349k1895k6034k7239l851j7673k1715m891j3487P556o533k5604l4536
11197B97447k8993q105j3635r572q213J304K6788Q703k7328l3943J6372n700k1584
11184A93541R321J2663o03M781N182n434k0073j3199p958n232J6070L926k386
11171A90599q342m665j9226j037l9j5953p626J4968K017q164o085l6474m354M386
11157A00005R163j2830m1164l7482r758M6108Q0119P3566O1721J8012r560j2734
$$ plain form
11241 244267 234847 222627 200375 202219 216678 230713 228043 227811 256828 297389 326094 341564
11229 341564 357724 389444 448713 517276 617886 786340 1051369 1323868 1548419 1733564
11219 1733564 1782090 1644523 1431852 1195839 967578 802024 700200 603771 536006 493349
11209 493349 471454 445420 418181 414330 396657 374942 370051 356564 364120 357587 331983 297447
11197 297447 268454 260349 246714 237142 228929 230233 257021 265724 238396 204453 220825 215125 193541
11184 193541 202862 215525 214922 219703 224885 219451 199378 186179 178221 172989 189059 192985 190599
11171 190599 182257 177592 158366 157329 157290 141337 133711 148679 150696 142532 136447 99973 95619 100005
11157 100005 109168 96338 55174 17692 7934 54042 134161 207727 269448 287460 277900 265166
11145B65166N76l770j6868j976N71N06m544P825j3202J0408q648j8960m09R286
11131B25961J1690N601j8435j3428R051J5917j3024j0555J0779j0765k598K5986
11119B36180J6220m915N915j0595l549m212j5140m035j4052J6207J072j8778J811
11106B02129l975L963l175q656J0017J8304o651j9990p030J6118J7778k307j2272
11093B04253n103k637R461J805m198r539j9403N572o448n908J4555K4259N459
11080B12128J1765N328Q639J5148J4810J1736r923k0732j4873J5216L9390J5246
11068C03878r467q661J4957J6404j7943j5097r00J4485o261j9884j8232k270j0511
11055B40498l245K2294J933j0408j079J323k751K421o888j8411j3328j1739j0950
$$ plain form
11145 265166 265742 261972 245104 243128 243699 244205 239661 247486 234284 244692 236044 217084 216675 225961
11131 225961 237651 243252 224817 211389 220440 236357 223333 212778 223557 212792 210194 236180
11119 236180 252400 247485 253400 242805 239256 235044 219904 215869 201817 218024 219096 200318 202129
11106 202129 198154 202117 198942 190286 200303 218607 211956 191966 184936 201054 218832 216525 204253
11093 204253 199150 196513 205974 207779 203581 194042 174639 180211 173763 167855 182410 206669 212128
11080 212128 223893 229221 237860 253008 267818 279554 269631 248899 234026 249242 288632 303878
11068 303878 294411 285750 300707 317111 299168 284071 283171 297656 291395 271511 253279 251009 240498
11055 240498 237253 259547 261480 251072 249993 251316 248565 250986 244098 225687 212359 200620 189670
11042A89670j0452m667L200K2783L3837j3l168J3655J2691O606k1476J2692N823
11029B61181j4824J8507L3868J8514J1681J9469j7190j9099k3402j3424L40K538
11017B78159p174R687n422j1550j6794l170K4764j4912k8339R103j8180k6642
11005A89530k9485j4849K7596K4575j099J1415N574l605j2009k2779r409P494
10993A72949R640J8180O099l477P301J6667M269m423O961M227j5725j2678J388
10980B11378K0825r57Q53n972K105J7186r684j4044M943P167J8391L829J2818
10967B68838J3228J7390R899j9122k3560k0337p183J5620J7959R499J5361p501
10955B90091K639K4604J2320P153L4456N7838P8951N2644M5213M8480N1116M5227
$$ plain form
11042 189670 179218 174551 177751 200534 234371 234358 231190 244845 257536 264142 242666 255358 261181
11029 261181 246357 264864 298732 317246 328927 348396 331206 312107 288705 275281 275621 278159
11017 278159 270985 280672 275250 263700 246906 243736 268500 253588 225249 234352 216172 189530
11005 189530 160045 145196 172792 197367 196268 207683 213257 209652 197643 174864 165455 172949
10993 172949 182589 200769 206868 203391 210692 227359 231628 227205 234166 238393 222668 209990 211378
10980 211378 232203 231246 232099 226127 228232 245418 235734 221690 226633 233800 252191 256020 268838
10967 268838 282066 299456 309355 290233 266673 246336 239153 254773 272732 282231 297592 290091
10955 290091 292730 317334 329654 336807 371263 429101 508052 560696 605909 654389 705505 750732
10943G50732K5488J5904l3161m7718j02437j12534o4652o4228p3187l4865j6275
10932B43067N809R766L296J9776K5134k273M60L216j070j0513q72J2374L7838
10919C46008J0469K1128L343N954k445P300J8163K0074q30j1057P109R846m133
10906D30929j7497q285J752j748J3288K0841L532J2181m521j6271j51m438J727
10893D31339J1119j722P213J5833K189k654q919K47Q797J8007K0841L0231L7915
10880E70436K1349N1185M7603J6738K8969J2011J6967L9212K9180N631K81J5293
10868H54855n186k492L999J4216K5760M5729N0953M5771N2486L7410L8637K8418
10856A190556O3122P5471Q2986Q2453M7430M3018N5649Q2708J03010R8795J10288
$$ plain form
10943 750732 776220 792124 758963 711245 608808 496274 431622 367394 294207 259342 243067
10932 243067 248876 258642 261938 281714 306848 304575 305035 308251 307181 296668 295796 308170 346008
10919 346008 356477 377605 380948 386902 384457 391757 409920 429994 429164 418107 425216 435062 430929
10906 430929 413432 405147 406899 405151 418439 439280 442812 454993 450472 434201 434050 429612 431339
10893 431339 442458 440736 447949 463782 465971 463317 454398 454645 463442 481449 502290 532521 570436
10880 570436 591785 642970 690573 707311 736280 748291 765258 804470 833650 839281 839562 854855
10868 854855 849669 847177 851176 865392 891152 936881 987834 1033605 1086091 1123501 1162138 1190556
10856 1190556 1253678 1329149 1412135 1494588 1542018 1585036 1640685 1723393 1826403 1925198 2035486
10845B035486J12653J07826J33118J98538K85335L86354N09870N81938N53572
10836D904690N23826M51426L27065L40294M14415O04401Q70498J207141J597968
10827A1241724J950967K360379K935222L679658M986633P221261J0882936J7003428
10819F2262208K7055745M1550490N4934815N2421685L7362706J9871460j5014173
10812B80444936l9799081m5299565m6353854l6690657k3375723j4261724r558640
10805F5105692p392945o387623o095052n898902n440678m744471m038966l398904
10797B1708151k762526k179374j712348j316300j123667j007912r41339j015031
10789I649654j004874r31772q52908p53780o33296n57380n05105m05250l75743
$$ plain form
10845 2035486 2148139 2255965 2389083 2587621 2872956 3259310 3769180 4351118 4904690
10836 4904690 5428516 5879942 6207007 6547301 6961716 7566117 8436615 9643756 11241724
10827 11241724 13192691 15553070 18488292 22167950 27154583 34375844 45258780 62262208
10819 62262208 89317953 130868443 185803258 238224943 275587649 295459109 280444936
10812 280444936 240645855 195346290 148992436 112301779 88926056 74664332 65105692
10805 65105692 57712747 51325124 45230072 39331170 33890492 29146021 25107055 21708151
10797 21708151 18945625 16766251 15053903 13737603 12613936 11606024 10664685 9649654
10789 9649654 8644780 7713008 6860100 6106320 5473024 4915644 4410539 4005289 3629546
10780C629546l33877k82675k61247k32497j95829j61233j50410j29124j03763
10771A778891j09716q2067o4253p2645n5035m4923k7917l5269l8114n7896p2889
10760A118167o5832n2350m6732n1186m1589l7262l2732k9513k6365k4120j5567
10749F94919L0888L3414J2686j2060j2284K044j5426k5985l4269j0193j4834k5437
10737F23463j6512n597p513j072j3294l1930l3658l392O777o249M614K1282j081
10724E35838k0385r873j6237R28R876j1678r162k2151k394J3750j8212k5348m172
10711D20780J6669j4278n085l730J027O005K283j238j0039k0000m675m181j6080
10698C67458K8528O6526P1999N6033P3764O6681J9434k5912m0969l1682q0809
$$ plain form
10780 3629546 3295669 3012994 2751747 2519250 2323421 2162188 2011778 1882654 1778891
10771 1778891 1669175 1587108 1522855 1450210 1395175 1350252 1322335 1287066 1248952 1191056 1118167
10760 1118167 1052335 999985 953253 902067 860478 823216 790484 760971 734606 710486 694919
10749 694919 725807 759221 771907 759847 747563 749607 734181 708196 673927 663734 648900 623463
10737 623463 606951 601354 593841 592769 579475 547545 513887 510495 517272 511023 515637 536919 535838
10724 535838 515453 505580 489343 490271 500147 488469 479307 457156 454762 468512 450300 424952 420780
10711 420780 437449 423171 418086 414356 415383 421388 423671 422433 412394 392394 387719 383538 367458
10698 367458 395986 462512 534511 590544 664308 730989 750423 724511 683542 651860 571051
10687E71051p2661m4314o8328l8533j1193l2988n8521l7491j3729m115J7773J4190
10675B21141N770K7790R191p27J335Q91K684J3289K433n891j3808k8634o247k0736
10661B08481Q993J9239J6399L877L2674K8294q260j3467N568J3978o6J11P685
10648C23506r19L1808J67k302j3010m331K2938K6059J8901O412j1643L0158O4677
10635D92421O6112M2422K2016K4244M4988O1361R4518J25249J40640J76920K09163
10624A500054K47192L48070N09596O86584R20842J067624J117055R61498N92800
10615G951315J74759j14883k29151p7991K12014O04193J121497J665191K121142
10606A3428086K172316J630485O78345k91753r71778j163924q21234j68414N48857
$$ plain form
10687 571051 498390 454076 385748 347215 336022 303034 244513 207022 193293 189178 206951 221141
10675 221141 226911 254701 263892 263165 264500 265391 268075 281364 283797 277906 264098 235464 229217 208481
10661 208481 217474 236713 253112 256989 289663 317957 309697 296230 301798 315776 315710 315821 323506
10648 323506 322587 354395 354562 352260 339250 334919 357857 383916 402817 409229 397586 427744 492421
10635 492421 558533 600955 622971 647215 692203 753564 848082 973331 1113971 1290891 1500054
10624 1500054 1747246 2095316 2604912 3291496 4212338 5279962 6397017 7358515 7951315
10615 7951315 8126074 8011191 7782040 7704049 7916063 8520256 9641753 11306944 13428086
10606 13428086 15600402 17230887 17909232 17617479 16645701 15481777 14660543 14492129 15040986
10597A5040986J334276K103155K627250K546384J566184P8417j297760k174532
10589B1824360k409829j974836j225241m56880K81263Q95247J245529J114610
10581A9294223L67947o47707j534132k029944k034449j676218j142554o34930
10573I962236j99225P1214J54823M3843k39495o59637r85871j145644j145387
10564E856857r71680p75008n99010m66523l54057k86288k43061k30559k18193
10555A712478j90203j55174j59609j27212j06450j04077q5408q4824k9078k2575
10545F47868l9490l7289m6490n9891m3289n288r729k3171k6679k6955j3431j2552
10533C03614j2318n277M95j5385l4135j7153P354j2050j1516p326j475j4654J2799
$$ plain form
10597 15040986 16375262 18478417 21105667 23652051 25218235 25296652 23998892 21824360
10589 21824360 19414531 17439695 16214454 15757574 16038837 16934084 18179613 19294223
10581 19294223 19662170 19014463 17480331 15450387 13415938 11739720 10597166 9962236
10573 9962236 9763011 9834225 9989048 10032891 9793396 9133759 8147888 7002244 5856857
10564 5856857 4885177 4110169 3511159 3044636 2690579 2404291 2161230 1930671 1712478
10555 1712478 1522275 1367101 1207492 1080280 973830 869753 784345 699521 670443 647868
10545 647868 608378 571089 524599 464708 421419 416131 406402 383231 356552 329597 316166 303614
10533 303614 291296 286019 286514 271129 236994 219841 227195 215145 203629 196303 194828 180174 192973
10520A92973p975j2104l648N199j5220O994J3722j0225k8693j007R397L944N842
10507A59199M165L052k1323L737O738P515j8763j3398q502R979r573j2285q804
10494A01737M281R480J896n451M887k0270J255p769j4723j1818J0683J419k0302
10481E5305j4908K0058N5314O4695N4298O2743K7005k0368m8335l2925J3606R841
10469B46329j2212k3729L349k581o069j228j439k777K707L91k9966j2403J1548
10456A71920k1846r72r444N287m53k3011j8394J7563J8622K0547J1214j688k8460
10443A40885j3625M279n564j4838j1803q274k212J271J7676O101r915K7608L2046
10430A63635j5911k1200r788Q043M918K1266q611j385J3097p507k64j5057l969
$$ plain form
10520 192973 184998 172894 169246 174445 159225 166219 179941 169716 141023 140016 149413 153357 159199
10507 159199 163364 166416 145093 148830 155568 163083 144320 130922 122420 132399 122826 110541 101737
10494 101737 106018 115498 117394 111943 116830 96560 97815 90046 75323 63505 74188 75607 55305
10481 55305 40397 60455 115769 180464 234762 297505 324510 304142 255807 222882 236488 246329
10469 246329 234117 210388 213737 211156 205087 203859 202420 199643 202350 202741 172775 160372 171920
10456 171920 150074 149102 139658 144945 144492 121481 103087 120650 139272 159819 171033 169345 140885
10443 140885 127260 131539 125975 111137 99334 91060 88848 90119 107795 113896 103981 131589 163635
10430 163635 147724 126524 116736 124779 129697 150963 142352 140967 154064 146557 146293 131236 127267
10417A27267P070J9408P723K7786L1886K4289L1404O6259J04697J58999K30909
10406H37697K76761K62646J73605J13339o1185k18286k35275k39296j95328j16803
10396E97875q8754o4994m9529l9251n2023m4570k8482j8374k1279k1400k1451
10385A47768P872J0013j7168k245J1516R221j50o500M569j1213l2663j4121j3306
10372I3593l332O994Q390n099o541o932M684p484L043j1043j1934O853N670k799
10358G4063j079J1243o06j1530P149K2191N545L2961J7529q11k7699k3313n035
10345A00608K1502K1712k718k8664j9446M009m317n905J4646N709j3886j0377
10333H2873k6409o329J3063m053p455k3901k481K3328M695R7J6464J8915k509
$$ plain form
10417 127267 134337 153745 161468 189254 221140 245429 276833 343092 447789 606788 837697
10406 837697 1114458 1377104 1550709 1664048 1602863 1384577 1149302 910006 714678 597875
10396 597875 509121 444127 394598 355347 303324 258754 230272 211898 190619 169219 147768
10385 147768 155640 165653 148485 146240 157756 166977 166827 160327 164896 153683 121020 106899 93593
10372 93593 90261 97255 105645 100546 94005 87073 91757 84273 87316 76273 64339 71192 76862 74063
10358 74063 72984 84227 83621 72091 79240 101431 106976 139937 157466 156655 128956 105643 100608
10345 100608 122110 143822 141104 112440 92994 97003 92686 86781 101427 107136 93250 82873
10333 82873 56464 50135 63198 59145 51690 27789 25308 48636 53331 53428 69892 88807 86298
10320H6298l2438k6940o814J2011K3527P119o107J0500J8019r49m98j4846j1575
10307E7307O115n186k659o807J3608K1897p823j2562o66k067L676j052l199L09
10293F0891n155j1587P979J0006p867q716k0444O507M967j2294R236K2078O351
10280F1952j8092m904P707K693j3627j1471K3816r85j5236J3900J1137k541k2738
10267C1611J26R127N176P206J2940J7616r340k1015m097N68J5214m612L475J7021
10253H1016J5022J355j2392l107j1828l324n144j2620k377O175J55J550R65K306
10239E7752n462Q716o250R281J2866J8965j5750k105J3579j098R131l0971l1918
10226C6736O603J7280K1857l248j1251O687p766Q840K19K492Q814Q692J6928k0356
$$ plain form
10320 86298 53860 26920 20106 32117 55644 62763 56656 67156 85175 84226 83728 68882 57307
10307 57307 63422 58236 55577 48770 62378 84275 76452 63890 63224 61157 64833 63781 60582 60891
10293 60891 55736 44149 52128 62134 54267 45551 25107 31614 36581 24287 33523 55601 61952
10280 61952 43860 38956 46663 49356 35729 24258 48074 47089 31853 45753 56890 54349 31611
10267 31611 31737 40864 46040 53246 66186 83802 74462 53447 49350 49918 65132 60520 63995 81016
10253 81016 96038 97393 85001 81894 70066 66742 61598 48978 46601 52776 52931 54481 55446 57752
10239 57752 52290 61006 54756 64037 76903 95868 80118 78013 91592 90494 99625 68654 36736
10226 36736 43339 60619 82476 79228 67977 74664 66898 75738 75957 78449 87263 95955 112883 92527
10212I2527m2043j6528N912L2961n141l306j048n828J098K417j366L953j2894
10199E0714j482R12r009r222O49m029m554j571R112N123n541P518K5611L0621
10185I4852J8733j4723j4012m772J3974J6781R098q138r646j4526m245K595K2131
10172A08102K4919q593j4223o073Q110J0617J6438J522O604R326p910j1488k903
10159A34448K2420K2903P753k431O858R953j1806m7237k4864L707P984N414N962
10146A41064k602J3356J0767K235j4190p022j7847o531k570J612k214J5092j0471
10133A20679j4938n453j1198j3615l475J1988J0337j6092j7530k4034j827k355
10121C2487M818p655r505O070j319k1969j114N711k354j945l007Q810p772k930
$$ plain form
10212 92527 50484 33956 39868 72829 67688 64382 63334 57506 58604 61021 59655 63608 50714
10199 50714 49232 50144 41135 31913 32562 28533 23979 22408 31520 36643 31102 38620 64231 94852
10185 94852 113585 98862 84850 80078 94052 110833 119931 111793 102147 87621 83376 85971 108102
10172 108102 133021 124428 110205 104132 112242 122859 139297 140819 147423 156749 148839 137351 134448
10159 134448 156868 179771 187524 185093 191951 201904 190098 142861 117997 121704 129688 135102 141064
10146 141064 138462 151818 162585 164820 150630 143608 125761 119230 116660 118272 116058 131150 120679
10133 120679 105741 100288 89090 75475 72000 83988 94325 78233 60703 36669 34842 32487
10121 32487 37305 29650 20145 26215 24896 2927 1813 7524 5170 3225 218 9028 1256 -1674
10107a674J2413R967N956Q975l0226L201J4595O341n063Q178p353j1626M76J8720
10093C2880J5196J2383m468j9788k9342J6421K6510J0556j0487j8268J477Q497
10081D1567j2995j922j7457M097J9436p861K664l484q237J345j4987j6649J0467
10068d016J0725J8636O909J2733k904j3100M615M066j742P758L4128J0662j782
10055H6688K77k0127m979K0457j4011k3288L387o344m534j4697n027o236N4J7964
10041B9584J5643r099Q400J4808j9296J5274J2730o943k1644k0353k400K97j5852
10028A149M053J4238M573j3639l374J3461K8352J7464k7368o638j2054K538L954
10015B6709O357j963L760j4371J2636J5500J6966j1876l0152j3784K799K1575
$$ plain form
10107 -1674 10739 20706 26662 35637 5411 8612 23207 29548 24485 32663 25310 13684 14160 32880
10093 32880 48076 60459 55991 36203 6861 23282 49792 60348 49861 31593 33070 41567
10081 41567 28572 26650 9193 13290 32726 24865 27529 24045 15808 17153 2166 -14483 -4016
10068 -4016 6709 25345 32254 44987 42083 28983 33598 37664 35922 43680 77808 88470 86688
10055 86688 86965 66838 61859 82316 68305 45017 48404 42060 37526 22829 17802 11566 11620 29584
10041 29584 45227 36128 44528 59336 40040 55314 68044 61101 39457 19104 16704 17001 1149
10028 1149 5202 19440 24013 10374 7000 20461 48813 66277 38909 32271 20217 22755 26709
10015 26709 33066 31103 34863 20492 33128 48628 65594 53718 23566 9782 12581 34156
10003C4156j641J4908P049r237k0730p65L966j9760j9548J0949J2305Q202m910
9990A4944L923J8027J4707Q962R015k888N06M01O499j8005l5802j8459J0507J4741
9976B7078K9726J6546m554j2211l0427J2213J1702l6868J7658L670j48m897N315
9963C4803l033j1868Q541J1092q550N603n7j0814J8119J8920j1759n795j1427
9950C3775j211m165l714o611O649N789j870j612J489J8805k53n458r70k0108k8800
9935h265P022J2155J5011Q471N883J969r353j871K2817o709j3729j5630k3910
9922f139K067J4299L27K076J7114K5423j7550k9881N511o453l00j6110j2747P037
9908a5326J7270J4581m995j042R008j0766n573m524J0739J0686Q585L241R38M905
$$ plain form
10003 34156 32515 47423 54472 45235 24505 23740 27706 7946 -11602 -653 11652 19854 14944
9990 14944 18867 36894 51601 60563 69578 66690 67196 67597 74096 56091 20289 1830 12337 27078
9976 27078 56804 73350 68796 56585 26158 38371 50073 13205 30863 34533 34385 29488 34803
9963 34803 31770 19902 28443 39535 30985 36588 36531 25717 43836 62756 50997 45202 33775
9950 33775 32564 28399 24685 18074 24723 30512 28642 27030 28519 47324 47071 41613 40643 20535 -8265
9935 -8265 -1243 10912 25923 34394 40277 42246 32893 31022 53839 47130 33401 17771 -6139
9922 -6139 -4072 10227 10554 12630 29744 55167 37617 7736 13247 6794 6494 -9616 -22363 -15326
9908 -15326 1944 16525 11530 10488 19496 8730 3157 -1367 9372 20058 28643 31884 32822 37727
9894C7727j9853M242n572N238m295j0808K1859K9010L29j8399j5860j7273o868
9881e23J8256k55q628J4339O095M486q170J4379k3513j7709p544m279j733J1345
9867c454J8903J5376N796l309j4602O438J7401L933J0151p792j1482J797J4036
9854E3192K26j8295l952J5004r01o021m095J8171j1260j0152j9497j4886k821
9841e287O033L792J027N474J8298R454j6914L63J9110K801j1253m206o092O345
9827B8945J2715J2057j68j1973j9982j8440J0926J5784r240O484P633M24q320
9814B6845o848R869j946r039j6531K489J0320l341n783J5021J503j652r185j2632
9800i10J267K508m45J9420K7025p986r368r482N593K543j244j5477L683K0019
$$ plain form
9894 37727 17874 22116 16544 21782 17487 6679 28538 57548 57877 39478 23618 6345 -523
9881 -523 17733 17478 8850 23189 29284 33770 25600 39979 16466 -1243 -8787 -13066 -14799 -3454
9867 -3454 15449 30825 36621 33312 18710 25148 42549 46482 56633 48841 37359 39156 53192
9854 53192 53418 35123 31171 46175 45274 39253 35158 53329 42069 31917 12420 -2466 -5287
9841 -5287 746 4538 5565 11039 29337 38791 21877 22240 41350 44151 32898 28692 22600 28945
9827 28945 41660 53717 53549 41576 21594 3154 14080 29864 20624 27108 34741 35165 26845
9814 26845 19997 29866 27920 18881 2350 4839 15159 11818 6035 21056 22559 20907 11722 -910
9800 -910 357 2865 2420 21840 48865 40879 31511 22029 27622 30165 28921 13444 17127 37146
9786C7146J4213j5454O259O96J0167J4360L7660M0029N3004P5377M3210k0546
9774B96121m1715m4291n9607k9297k3749j6734j9588j4925p18j1424K834J3917
9762E0824K505o450j3813J8626K342j0837K93j1313j9025j3668R004J0805P888
9749B7181R409m214k2380J1901L645K757Q814q156j1154J893Q550J2361R701K929
9735E3237k0621j3530J4237n449j4694j071J2865L5405O826k0134j6635j0690
9723A9746j2692p333J1563L8314J2842l94k0610j1005n366k6758n069Q376J4721
9710A6335K669Q800j5913o603k958O12L800J545N304K0126L80l572j9857N968
9696A6636k351J2862L2202J5159N211r784j9999j7816K93J61o116q066r39K6246
$$ plain form
9786 37146 51359 35905 42164 42860 53027 67387 105047 145076 198080 273457 316667 296121
9774 296121 254406 210115 150508 121211 97462 80728 61140 46215 45497 34073 36907 50824
9762 50824 53329 46879 33066 51692 54034 43197 43490 32177 13152 -516 8488 19293 27181
9749 27181 36590 32376 9996 21897 25542 28299 37113 28957 17803 19696 28246 40607 50308 53237
9735 53237 32616 19086 33323 27874 13180 12109 24974 60379 67205 47071 30436 19746
9723 19746 7054 -279 11284 49598 62440 62046 41436 30431 25065 -1693 -6762 1614 16335
9710 16335 19004 27804 11891 5288 2330 2942 6742 8287 13591 33717 34097 30525 10668 16636
9696 16636 14285 27147 59349 74508 79719 69935 49936 32120 32413 32574 26458 18392 17453 43699
9682D3699O33n635K4160j1094k4710O4K627l442L430M053J1862J2077K0052k265
9668G5511Q420j9882j3893J6117K0030J5602L5036J7629J8016N2823P8271J01107
9656D04787J64054K90127M88149O89733O18457J31194k04770m66601o03633m50411
9646A061086k56056j45609r5549o1445n3452p0335l9552l3699m3084m0823k3521
9635A97961k7762k0441r107k3338k9041k244L950q4j7767q511p469q041j0768
9622C7338j2632M235J4490L4626L18l319j3478j2403J53n435j506k1495k4471
9609c579K814j2137o024J0079L303p482O109J8747o579J0554J0578K084j9818
9596H649k0447J0680n799o731K8968K0153l337j8590J993K3638K3770j9581j6810
$$ plain form
9682 43699 44332 38697 62857 51763 27053 27117 29744 26302 29732 33785 45647 57724 77776 75511
9668 75511 83931 64049 50156 66273 86303 101905 136941 154570 172586 225409 303680 404787
9656 404787 568841 858968 1347117 2036850 2655307 2786501 2581731 2115130 1511497 1061086
9646 1061086 805030 659421 563872 502427 448975 378640 339088 305389 262305 221482 197961
9635 197961 170199 149758 140651 117313 88272 86028 89978 89894 72127 63616 56147 48106 37338
9622 37338 24706 28941 43431 78057 78375 75056 61578 49175 49328 43893 42387 20892 -3579
9609 -3579 -765 -12902 -18926 -8847 -5544 -13026 -6917 11830 5251 15805 26383 28467 8649
9596 8649 -11798 -1118 -6917 -13648 15320 35473 32136 13546 15539 39177 62947 43366 26556
9583B6556M749P312j1693j0477o24k813J2667L904m194J0070j0140l117K7756
9570D9956j456k8896k9821J4115N746j0484Q339R289J836j1N540j6000p34j131
9556F288p069p233p428J2835j7030j4714K8235K2713k3682K113p038j1870N720
9543a8160K7759P83R588J6722J7212j9668Q306J872m486j6138k3630K5123K3649
9530D8932q219r925L698m164k5197r430M48j8404m508k732J9476L0267m160K039
9516A8121M608Q690J609j2681R160p240p102j0481j7794J5804K4906j3620j1157
9503B823q20L843p944n713M510m036J5806L987R104Q196P868j4760j2301K10r079
9488A694J2014J7391o06m179n548k0213J6631P622J2358q492j5597n819J1597
$$ plain form
9583 26556 31305 38617 26924 16447 15823 13010 25677 29581 25387 35457 25317 22200 49956
9570 49956 48500 19604 -10217 3898 9644 -840 7499 16788 18624 18613 24153 8153 7419 6288
9556 6288 -781 -8014 -15442 -2607 -19637 -34351 -6116 16597 -7085 -4972 -12010 -23880 -18160
9543 -18160 9599 10382 19970 36692 53904 34236 42542 44414 39928 23790 160 25283 48932
9530 48932 40713 30788 34486 30322 5125 -4305 -3857 -22261 -26769 -29501 -10025 20242 16082 18121
9516 18121 22729 31419 33028 20347 29507 22267 15165 4684 -13110 2694 27600 13980 2823
9503 2823 2003 5846 -2098 -7811 -3301 -7337 8469 12456 21560 29756 37624 22864 10563 10773 1694
9488 1694 13708 31099 30493 26314 20766 553 17184 24806 37164 28672 13075 7256 18853
9475A8853J972n343Q858q786n448J2830n396j3114q588j501J3823J4061q143J364
9461A5442M569N968J3418k1283k1220n771J8919K4299r002m111j422p050m762
9448G994R035M217j1608r502r801j221K7635K4693K553j5966j1764K4410o847
9435C3828j3117j4623K849R525N007K3713J0953j1566r378n502M138J1670J7147
9422F4644j5168k3405j7082q44r183N477L765J7032J3777L992n784j3553j4634
9409I034K0737K1192J298j1942J0032j3394j697r207j5998j5407L749P246O483
9396A2126J2957r822j210m713m408k0597r443J5908P510j4016Q830K1680J4260
9383B9062N629j578k3766j4909J472j5113O348J8452k624q349J8378j697O176
$$ plain form
9475 18853 20825 15482 24340 15554 10106 22936 17540 4426 -4162 -5663 8160 22221 14078 15442
9461 15442 20011 25979 39397 18114 -3106 -8877 10042 34341 25339 21228 19806 12756 7994
9448 7994 17029 21246 9638 136 -9665 -10886 16749 41442 43995 28029 16265 40675 33828
9435 33828 20711 6088 8937 18462 23469 47182 58135 46569 37191 31689 35827 47497 64644
9422 64644 49476 26071 8989 8145 -1038 4439 8204 25236 39013 43005 37221 23668 9034
9409 9034 29771 50963 52261 40319 50351 36957 35260 26053 10055 -5352 -1603 5643 12126
9396 12126 25083 15261 14051 9338 4930 -15667 -25110 -9202 -1692 -15708 -6878 14802 29062
9383 29062 34691 33113 9347 -5562 -4090 -19203 -12855 5597 2973 -5376 13002 11305 17481
9370A7481Q433L958k8038k4604j9626L526K8755K8008J5003J5129k7290j2084
9358H651J9590r548l474J7342k760R680K1332P964k2002k0246j0608j8192L277
9345A006K2699R784j0358r565J2617R367j6933j1963m193K47K3109M35J923j6970
9331A1205r294j295k716Q430j2190j5210K1165K8521P233q427q588l2673J77J3499
9317a63J3187K4297J2280M854o55k8149j573Q402Q776J6370k526j6478o040m307
9303B8275j3506j1162J6020N475m444o472Q555l627J483j1492J721J1400L851
9290B6077k642N834j0864j1420m213k2083J2662j139M565p092K535Q14J0160R317
9276A2511o963j6020k9717J24K6271M396Q861k613j2597j1597J8183P629n219
$$ plain form
9370 17481 25914 29872 1834 -22770 -42396 -38870 -10115 17893 32896 48025 20735 8651
9358 8651 28241 18693 15219 32561 29801 39481 60813 68777 46775 26529 15921 -2271 1006
9345 1006 23705 33489 23131 13566 26183 35550 18617 6654 2461 2708 25817 26252 28175 11205
9331 11205 1911 616 -2100 6330 -5860 -21070 95 28616 35849 27422 18834 -13839 -13662 -163
9317 -163 13024 37321 49601 54455 53800 25651 24078 32480 41256 57626 55100 38622 32582 28275
9303 28275 14769 3607 19627 25102 20658 14186 22741 19114 20597 9105 10826 22226 26077
9290 26077 23435 29269 18405 6985 2772 -19311 -6649 -7788 -3223 -10315 -7780 -6966 3194 12511
9276 12511 5548 -10472 -40189 -40065 -13794 -9398 -537 -3150 -15747 -27344 -9161 -1532 -6751
9263f751j2413K0723J2173j1265j2570J2728m36j2324j052N633p759n814J336
9250a7791J5950l210J9977q638j368J9319L283n333J0288M014J4185N970r463
9237D7183j8015J8396m482o159o566j1277k3421J4285K1807O78j4272J2534k606
9224B8085k0820m971J3571p509P771l262J3259P706K938N806l071m712j4590n425
9210A4776m280j4865m273K166J0016O332K2282K7382j4698l4766O471Q299l253
9197B1589p626p503j6077j905j753J1158J0093J817k1480o992K4921P664j8516
9184d610j6819J0516J1233K547j0676l31P767J090L662r296o210k629k81n305
9170a9342Q044p808J833J0772k212r288Q867j0791K5667K3913m715j3600j688
$$ plain form
9263 -6751 -19164 1559 13732 2467 -10103 2625 2189 -10135 -11187 -5554 -13313 -19127 -17791
9250 -17791 -1841 -5051 14926 6288 4920 24239 27522 22189 32477 36491 50676 56646 47183
9237 47183 29168 47564 43082 36923 30357 19080 -4341 9944 31751 32429 18157 30691 28085
9224 28085 7265 2294 15865 8356 16127 12865 26124 33830 36768 42574 39503 34791 20201 14776
9210 14776 10496 -4369 -8642 -6476 3540 9872 32154 59536 44838 10072 16543 24842 21589
9197 21589 13963 6460 -9617 -11522 -13275 -2117 7976 9793 -11687 -18679 6242 13906 -4610
9184 -4610 -21429 -10913 320 2867 -7809 -8140 -373 717 4379 -4917 -11127 -13756 -14037 -19342
9170 -19342 -11298 -19106 -17273 -6501 -8713 -18001 -9134 -19925 5742 29655 24940 11340 9652
9157I652j699k8324J188J0735M415J289R735Q282J4105J972r933l2852j4770j2820
9143c9025L540J5632j0265q317P388j0018L748J0520j897p306N924K5907j2366
9130a6535l173L855l659p957J7201j017j7804J1681J7441j3599J594J517P378
9117c077M995j9704J1572L2361J5444j1307l3048r075m447J7856J2427J036K6505
9104D1538K775k8031r141P322R447M341j1537M354j5873L750j0242j7033K425
9091a5905J0620L134J2158K1618Q039j3782l0705n224K6880L6841j9924q205R05
9078B6450j5616J285k0761N594Q411M046j5987k612P807K039R985J4283J1285
9065C6209j2253k0023o031q704O721k011k0391M962L0885J2295o745J817J4795
$$ plain form
9157 9652 7953 -20371 -19183 -8448 -4033 -2744 6991 15273 29378 31350 21417 -11435 -26205 -39025
9143 -39025 -35485 -19853 -30118 -38435 -31047 -41065 -37317 -26797 -28694 -36000 -30076 -4169 -16535
9130 -16535 -19708 -15853 -19512 -27469 -10268 -11285 -29089 -17408 33 -13566 -11972 -10455 -3077
9117 -3077 1918 -17786 -6214 26147 41591 30284 -2764 -11839 -16286 1570 13997 15033 41538
9104 41538 44313 16282 7141 14463 23910 28251 16714 21068 5195 8945 -1297 -18330 -15905
9091 -15905 -5285 -2151 10007 31625 39664 25882 -4823 -10047 16833 53674 33750 25545 26450
9078 26450 10834 12119 -8642 -3048 5363 9409 -6578 -9190 -1383 656 10641 24924 36209
9065 36209 23956 3933 -2098 -10802 -4081 -6092 -26483 -21521 9364 21659 14914 16731 31526
9052C1526n804k0373O127O445j6161M07j392k755J4814p36q849j6211K0778J2785
9038B0601R60l2318o196K0094R140j6927j5033j8105K336J6190J0121J1529o787
9025d395Q856j353q179l446m37K548J1267P209K756o98l539K983p297j4722j4424
9010b2871M731J0814J6333j8845j8346k676K5291J0962j2040L754M352q97K310
8997B872P519L716J4928O634J66k736P702L324m6798j9260O182J8416J7745L2454
8983E2864J1382j9261k3678j6083Q540J0466j2303R480K773j9650p299O402J0971
8970A4604J0610k2623m834o133K0152J1672j2882k148j1489k3648j4380L026J6044
8957b2029P778J0141J4472o999R36N488m516k445q78j5947k7199n446N733P642
$$ plain form
9052 31526 25722 5349 11476 17921 1760 2167 775 -1980 12834 12098 3249 -12962 7816 20601
9038 20601 21561 -10757 -16953 3141 12281 -4646 -19679 -37784 -35448 -19258 -9137 2392 -4395
9025 -4395 4461 3108 -5071 -8517 -8954 -6406 4861 12070 14826 14128 10589 13572 6275 -8447 -22871
9010 -22871 -18140 -7326 9007 -9838 -28184 -30860 -5569 5393 -6647 -2893 1459 562 2872
8997 2872 10391 14107 29035 35669 35835 33099 40801 44125 -2673 -21933 -15751 2665 20410 52864
8983 52864 64246 44985 21307 5224 13764 24230 11927 21407 24180 4530 -2769 3633 14604
8970 14604 25214 2591 -2243 -8376 11776 23448 10566 8418 -3071 -26719 -41099 -38073 -22029
8957 -22029 -14251 -4110 10362 3363 4299 9787 5271 2826 1948 -13999 -41198 -46644 -40911 -33269
8943c3269R303J0572R605j4847j2423J4271J3606k263L189J0639N687J0887o484
8930A8473j6212j6588L590O061j4297r43j3357l444J1657N430j0760l608J5008
8917a8990J1743Q934j5162o081J0831K2401j0285p931j1m259j5716j1135Q203
8904b7458K5754J3180j0867j7653L59P753P029J6429m781q684R265R024P712k914
8890B4148j0436j569j5481P788l554k2583j942L3681R872j1690k309p505n795
8877g375K0729L668j3493m319J7099l660p719J3354k985J6599L710o310j0923
8864A8375j0019M714K6j5697n001K8324K5740q625k2014m582O581j3898j7827
8851a3903j0843q684J0267J6359P351O185j172M788J0893j1332N179J788j1835
$$ plain form
8943 -33269 -23966 -13394 -3789 -18636 -31059 -16788 -3182 -5445 -2256 8383 14070 24957 18473
8930 18473 2261 -14327 -10737 -4676 -18973 -19916 -33273 -36717 -25060 -19630 -30390 -33998 -18990
8917 -18990 -7247 1687 -13475 -19556 -8725 13676 3391 -4540 -4551 -8810 -24526 -35661 -27458
8904 -27458 -1704 11476 609 -17044 -16685 -8932 -1903 14526 9745 1061 10326 19350 27062 24148
8890 24148 13712 12143 -3338 4450 896 -21687 -23629 10052 19924 8234 5925 -1580 -7375
8877 -7375 13354 17022 3529 -790 16309 12649 4930 18284 15299 31898 35608 29298 18375
8864 18375 8356 13070 13096 -2601 -7602 20722 46462 37837 15823 11241 17822 3924 -13903
8851 -13903 -24746 -33430 -23163 -6804 547 6732 5560 10348 21241 9909 15088 16876 5041
8838E041N101Q46J616j7179k3960j2913N936J8393J7419K3088P109j6773m873
8825H851J2633j9098j9678j0437l528J1914K682p74J52q52O05m924O512Q867M226
8810b849J5470J3662m302j9378K151J1107O5j3678M443k608n437j4145J190j1397
8796b5706j4791K3816m426l084J0416R450J7388O158j4486J0629m641r848J1345
8783A2220P313j7237m1199M08K5915J3744J9176J3407M131j483k0256j1507r773
8770e141j4762n460J265r870P742J270q075L7520J348r346O880L2692J923k5941
8756A2045M512o464j8697J4588O115k1603L883j2031K240R976j7545k1725j0096
8743e4802Q994J024K6058O745L356J2360r505r690M968j2773P362P014M402J3911
$$ plain form
8838 5041 10142 10988 12604 -4575 -28535 -41448 -35512 -17119 300 23388 30497 13724 8851
8825 8851 21484 2386 -17292 -27729 -31257 -19343 -16661 -17435 -17283 -18135 -17530 -22454 -15942 -7075 -2849
8810 -2849 12621 26283 21981 2603 4754 15861 15926 2248 6691 4083 -1354 -15499 -14309 -25706
8796 -25706 -40497 -16681 -21107 -24191 -13775 -4325 13063 19221 4735 15364 10723 875 12220
8783 12220 19533 2296 -38903 -38495 -12580 1164 20340 33747 37878 36395 16139 4632 -5141
8770 -5141 -19903 -25363 -24098 -33968 -26226 -24956 -33031 4489 5837 -3509 3371 36063 37986 12045
8756 12045 16557 10093 -8604 5984 12099 -9504 -5621 -17652 -15412 -5436 -22981 -44706 -54802
8743 -54802 -45808 -44784 -18726 -11981 -8625 3735 -5770 -15460 -10492 -23265 -15903 -8889 -4487 9424
8729I424r99j1959o678j0462O331J0622j3045j277K0953J3923P09p916k616p62
8715F248R290P089k1087k9580J3545K3858j675j0897p497j058J792J2748O620
8702I396r785R42R74j066j1646N158J9513k033m584n281n946j1548j6926Q944
8688b3888K505p854J2659J5737L458L490m178q919K9220K0017k388r003j8141
8675A2715o331J2802j785j1006p099j032o609k903j897J027j7068m910R271N729
8661a9096r060K0506J4000J8736j515q790N207j996j9852j7108J524J3387k966
8648g023P255L0965J3260j7310L307M995k83r81k3894j7035K1277j5997j8118
8635a9582N892J9036O846j3224K644j229j71m132J7022j2374l076R037J1816P465
$$ plain form
8729 9424 8425 -3534 -10212 -20674 -14343 -3721 -16766 -18043 2910 16833 17542 9626 7010 6248
8715 6248 15538 22627 1540 -28040 -14495 9363 7688 -3209 -10706 -11764 -9972 2776 9396
8702 9396 -389 553 1527 461 -11185 -6027 13486 11453 6869 1588 -4358 -15906 -32832 -23888
8688 -23888 -21383 -29237 -16578 -841 2617 6107 1929 -6990 22230 42247 39859 30856 12715
8675 12715 6384 19186 17401 6395 -704 -1736 -8345 -11248 -13145 -12118 -29186 -34096 -24825 -19096
8661 -19096 -28156 -7650 6350 25086 23571 14781 19988 17992 -1860 -18968 -17444 -4057 -7023
8648 -7023 232 31197 44457 27147 30454 35449 35166 34185 10291 -6744 14533 -1464 -19582
8635 -19582 -13690 5346 12192 -1032 1612 383 212 -3920 13102 728 -2348 6689 18505 25970
8621B5970j1154j1034N511K662j164p508M385k3501n953L4255J6746P600j9635
8608A7180j2976j3872j4439J3437J3560Q528N495j673j8303K328J0840l888j0913
8595d696J1536R281r350o292j7546M692J3870k5744j2757n58k924M962o467m03
8581d2396J5080Q562P426J0538O899J9903J5505J3716M770n307p242k2390l9827
8568a4763J237J9063m031R207j579j3656K2654j049N366J3837j3644q995p396
8555F251P540k460j5506q816J0624q065j4552K501P164J2826N960L224k465j2208
8541g982J3347J1478O648j6956M096j6699m099Q102K6351Q129N598Q546J7626
8528F4185l636j3375o831j8049k878j1683j6257r33K0872l95l786j4519L918o506
$$ plain form
8621 25970 14816 3782 9293 11955 10791 3283 7668 -15833 -21786 12469 29215 36815 17180
8608 17180 4204 -9668 -24107 -10670 2890 11418 16913 15240 -3063 -735 10105 6217 -4696
8595 -4696 6840 16121 6771 479 -17067 -12375 1495 -24249 -37006 -37564 -40488 -35526 -41993 -42396
8581 -42396 -27316 -18754 -11328 -790 6109 26012 41517 55233 60003 54696 47454 25064 -14763
8568 -14763 -13526 5537 1506 10713 9134 -4522 18132 17083 22449 36286 22642 13647 6251
8555 6251 13791 11331 -4175 -12991 -2367 -10432 -24984 -22483 -15319 -2493 3467 6691 4226 -7982
8541 -7982 5365 16843 23491 6535 10631 -6068 -10167 -2065 24286 32415 38013 46559 64185
8528 64185 60549 47174 40343 22294 19416 7733 -8524 -9457 11415 11020 7234 -7285 -3367 -9873
8514i873p045l203K8256j42K099m394o148Q833q581o786k728j9615j4329m275
8500d7931l90P656J2752K162K2763J7061k2926m534J5906K2459N559R40J4170
8487D5647L2464J5216L1185L9439k2445l307j7243k5044k3989l5724o751K825
8475C2273O593P922j0490j9449j4331O408J945r811M961j5192P968J1775o511
8462D061J0869m603m820M787p921j7734M910L8261o643j4219K747k805j0868j2599
8448a6577m544j1105J5188J4005J0163O455L1370K3617Q638j75J4067j086j6166
8435G3850k3454j6154k1524j9341L290Q932j2730K595L840M644j7367k482m453
8422b0354j8740j0178N149Q296J1760k988j598P047M323Q899j0407j6046j8721
$$ plain form
8514 -9873 -16918 -20121 8135 7993 10092 5698 -450 8383 -198 -6984 -9712 -29327 -43656 -47931
8500 -47931 -48321 -40665 -27913 -25751 -2988 14073 -8853 -13387 2519 24978 30537 31477 45647
8487 45647 78111 93327 124512 163951 141506 138199 120956 95912 71923 36199 29448 32273
8475 32273 38866 46788 36298 16849 2518 8926 10871 1060 6021 -9171 -1203 10572 4061
8462 4061 14930 10327 5507 10294 2373 -15361 -10451 27810 21167 6948 9695 6890 -3978 -16577
8448 -16577 -21121 -32226 -17038 -3033 7130 13585 44955 68572 77210 77035 91102 90016 73850
8435 73850 50396 34242 12718 -6623 -3333 5599 -7131 -4536 -696 3948 -13419 -15901 -20354
8422 -20354 -39094 -49272 -44123 -35827 -24067 -27055 -28653 -21606 -17283 -8384 -18791 -34837 -53558
8409e3558o619J2496L7128K4410n194k0107p107j5871O657R010K1723M886j324
8396F530n504J3316J4144j804l0093k215Q847R803k96j2203J8438M526q823J146
8382A5812j0978n563k4128l66K8576j2502n851K0928r791K100Q421L44N171o345
8368E828o001K3419J4232l002l856r29j6937p84l259p384O925l800n461j5268
8354a6277k575K1043M035m126O480m895k6813j2503J4732J6649M8378k496j5220
8341B6412j8776o128J45n615j4815O170n239N315N098N490o717o749J6131j356
8327f34j301K780J1703m634j3712M638N493m353m673J1047K0182N238j6245j1188
8313D341q586k170O115K6217q015k5067J6681O860P746j0523j6808l871P8j004
$$ plain form
8409 -53558 -60177 -47681 -10553 13857 8663 -11444 -18551 -34422 -27765 -18755 2968 7854 6530
8396 6530 1026 14342 28486 26682 -3411 -5626 3221 13024 12728 525 18963 23489 14666 15812
8382 15812 4834 -729 -24857 -25223 3353 -9149 -15000 5928 -3863 -1763 6658 7002 12173 5828
8368 5828 -173 23246 37478 34476 30620 29691 12754 11970 8711 1327 8252 4452 -1009 -16277
8354 -16277 -18852 2191 6226 2100 8580 3685 -23128 -35631 -20899 -4250 44128 41632 26412
8341 26412 7636 1508 1653 -3962 -18777 -12607 -17846 -12531 -7433 -1943 -8660 -15409 722 -634
8327 -634 -1935 845 12548 7914 -5798 -1160 4333 -20 -4693 6354 26536 31774 15529 4341
8313 4341 -4245 -6415 -300 25917 17902 -7165 9516 16376 24122 13599 -3209 -7080 -7002 -8006
8299h006K4073Q251O842J1620Q828l835n371k3136j536R047k0707J141m090K439
8285E560J8322L953n996M326Q98n676K063j0173o663P387j1330P749M603j0088
8271D935k1562q481M939P423K745p873R526K726j764J1542m941j8575J6070P168
8257C878J3185R357n143K957N832q241j4652k5599J0728P857j0292N654K2033
8244A7554J147k216n488P552m259J0058o103j4520k2154q354j2383L2553L1020
8231B4407j818k7317q086N083o782l22K0670m574j4914Q473j0957l428N180j27
8217a4512J5858J2989p3r228j8638K859p817l1020R528N011N802j58j6053j3211
8203e8663J6283J5783j2624j050J2563O257J01J951L2247K704p784k3342k1311
$$ plain form
8299 -8006 16067 24318 31160 42780 51608 47773 42402 19266 17730 26777 6070 7211 3121 5560
8285 5560 23882 27835 21839 26165 27063 21387 23450 13277 6614 14001 2671 10420 15023 4935
8271 4935 -16627 -25108 -20169 -12746 -10001 -17874 -8348 -5622 -7386 4156 -785 -19360 -3290 3878
8257 3878 17063 26420 21277 24234 30066 21825 7173 -18426 -7698 159 -10133 -4479 17554
8244 17554 18701 16485 10997 18549 14290 24348 18245 3725 -18429 -26783 -39166 -6613 24407
8231 24407 22589 -4728 -12814 -7731 -14513 -14835 5835 1261 -13653 -5180 -16137 -19565 -14385 -14512
8217 -14512 1346 14335 14262 5034 -13604 -10745 -18562 -49582 -40054 -35043 -29241 -29399 -45452 -58663
8203 -58663 -42380 -26597 -39221 -40271 -27708 -21451 -21350 -19399 12848 15552 7768 -15574 -36885
8190c6885R224P35J9668K2419J6142r861l1402J109J8529N75j3747j8811J9262
8177c043J2345J4688K5574j2341k4729j7833n304o482l054J1974J636j8003m133
8164b8705K6203M800N179p749M553J2012l2400o636J5990J6069q50Q932j4108
8151C290o832l999K414j6310l082J0322L910M195j7812l300o947M891K2615N285
8137a360n976J3752L520j1346R74o79L804k786l524k823M404m593R091P698J97
8122A0353q930r986Q746J1820K0703L867o982j6266j2700j5780l838K5837J6753
8109B3597j2358P358O782J8442K73l5041k3624l485n51J3920J7041N403J668q966
8095A0459L442L28j0286j6456J6109o114J1831P735o980o21l905k0065l6039M040
$$ plain form
8190 -36885 -27661 -26926 -7258 15161 31303 21442 -9960 -8851 9678 10253 -3494 -22305 -3043
8177 -3043 9302 23990 49564 37223 12494 -5339 -10643 -17125 -20179 -8205 -6569 -24572 -28705
8164 -28705 -2502 2298 7477 -272 4281 16293 -16107 -22743 -6753 9316 8466 17398 3290
8151 3290 -3542 -7541 -5127 -21437 -24519 -14197 -10287 -6092 -23904 -27204 -34151 -29260 -6645 -1360
8137 -1360 -7336 6416 9936 -1410 -436 -1115 2689 -97 -3621 -6444 -2040 -6633 2458 10156 10353
8122 10353 1423 -8563 183 12003 32706 36573 29591 13325 625 -15155 -18993 6844 23597
8109 23597 11239 18597 25379 43821 44094 9053 -14571 -18056 -18607 -4687 12354 17757 19425 10459
8095 10459 13901 14229 3943 -12513 3596 -2518 9313 17048 10068 9447 5542 -14523 -50562 -46522
8081d6522K1281J3900O450j9661j3593J0341L250k291K2330J7842k107o025j5837
8068a0642m487j3025m651jJ7506L139q373J5166L0832r859O170j2254k5184p359
8054b3022k3526j39Q84J0087J8999J094J2748J2894k4625K069o193J5841P136
8041D247j4398j5555K3929j3803P000J3751M274l552j8664K689L8743N987P443
8028D2091N654l7454J535J8672L698L949k1328j0426J3940m30k6322o956l591
8015a6968m822Q58m660K4937J276k760k83j385N623m463j3361N804J3507J4159
8001A7462J19j5509p239r167J803P247K4739r50j2206j1573R952j3323L60L442
7987d843K342r550j1834R185R168o288p553J0484O376p998J1853O213j7506J3839
$$ plain form
8081 -46522 -25241 -11341 -4891 -24552 -38145 -27804 -24554 -26845 -4515 13327 11220 5195 -10642
8068 -10642 -15129 -28154 -32805 -32806 -15300 -12161 -20534 -5368 25464 15605 21775 9521 -15663 -23022
8054 -23022 -46548 -46687 -45803 -35716 -16717 -15623 -2875 10019 -14606 -12537 -18730 -2889 4247
8041 4247 -10151 -25706 -1777 -15580 -8580 5171 9445 5893 -12771 -10082 28661 34648 42091
8028 42091 47745 10291 11826 30498 34196 38145 16817 6391 20331 19901 -6421 -13377 -16968
8015 -16968 -21790 -20932 -25592 -655 621 -2139 -2422 -3807 1816 -2647 -16008 -10204 3303 17462
8001 17462 17581 2072 -5167 -14334 -12531 -5284 19455 18505 6299 -5274 4678 -8645 -8285 -4843
7987 -4843 -2501 -12051 -23885 -14700 -5532 -11820 -19373 -8889 -2513 -10511 1342 7555 -9951 3888
7973C888P969k3665m591J2899j3531j1668N187N771l532l519m305J0811L663L73
7959a4250J1612Q999j0953L2063j7797Q35R591L40k234O161p487p740J2078q676
7945A2542J945k085K49m344l4999J5111n903m074n464J1687n237J4477O896K750
7931C551p214k1657j1605l61O227N966P805L1643K8303p134J2286q034j1372Q6
7917B8490j0799j4011l808M078O555J4153o432j2372k571J4861l608j9560n915
7904a0939J0326J0023J996N676q796o963j7759l037j0225O805m303p217L4060
7891c53L6250n383r982j278J0861q942k3985r710J6262p835k3168J0172J4654
7878b437r929j102m143P997p485P175p40k345p116r553n082K7723K4230J4578
$$ plain form
7973 3888 11857 -11808 -16399 -3500 -17031 -28699 -23512 -17741 -21273 -24792 -29097 -18286 -14623 -14250
7959 -14250 -2638 6361 -4592 27471 9674 10509 20100 20440 18206 24367 16880 9140 21218 12542
7945 12542 14487 12402 12651 8307 -26692 -11581 -17484 -21558 -27022 -15335 -20572 -6095 801 3551
7931 3551 -3663 -25320 -36925 -37286 -31059 -25093 -17288 14355 42658 35524 47810 39776 28404 28490
7917 28490 17691 3680 -128 3950 10505 24658 18226 5854 3283 18144 14536 -5024 -10939
7904 -10939 -613 9410 11406 17082 8286 1323 -16436 -19473 -29698 -22893 -27196 -34413 -353
7891 -353 35897 30514 20532 19254 30115 21173 -2812 -12522 3740 -4095 -27263 -17091 -2437
7878 -2437 -12366 -13468 -17611 -9614 -17099 -9924 -10664 -13009 -20125 -29678 -34760 -7037 17193 31771
7864C1771R733p945j8219m979k702N550m347q949N479J37m612O521n912Q515n809
7849D232n062L152J262P742K944k5128q533L93k0848N365L4675J5269Q878j1728
7835A2613J4000p710j0150O23k819J4034L913J5165j7848k4338N907O145o978
7822B557l250p734J109J2383j45q627j0015j7845l845J6594L1426K9773P041R212
7808E8634j7604k2128j3849P07l1690m261O977N490Q275n957j2918J8391K8320
7795A8387k501M75q789k5851p814J6632q993L412P111J8959N092M880P378L036
7781C1414r676j2754j8542j3055J6388l991q310l68K500K544K6262p520j535O962
7767A0319O579p202r248J7732N814o471o243Q311q672j1368N341J1162j8407Q949
$$ plain form
7864 31771 41504 33559 15340 10361 7659 13209 8862 -87 5392 5529 917 7438 1526 10041 4232
7849 4232 -830 2322 3584 11326 14270 -10858 -19391 -18998 -39846 -34481 194 15463 24341 12613
7835 12613 26613 18903 8753 9376 6557 20591 24504 39669 21821 -2517 3390 9535 2557
7822 2557 -693 -8427 -7318 5065 4920 -3707 -13722 -31567 -35412 -18818 12608 42381 49422 58634
7808 58634 41030 18902 5053 5760 -25930 -30191 -23214 -17724 -9449 -15406 -28324 -9933 18387
7795 18387 15886 16361 7572 -18279 -26093 -9461 -18454 -15042 -7931 11028 16120 21000 28378 31414
7781 31414 21738 8984 -9558 -22613 -6225 -10216 -18526 -18894 -16394 -13850 12412 4892 3357 10319
7767 10319 16898 9696 448 18180 23994 17523 11280 19591 10919 -449 4892 16054 -2353 6596
7753F596K1435k3796j9817j4167J2039K6839j582r423j1030j8405J2439q497M994
7740b2375J6804R940j433k8197n118P187k231j4682J8429K2219O905J513M30m206
7726E185j8011R812J2822K643m561j4325K761K5291M34r125n157J0229n31k1371
7712c904k1051K1596L8081n057k4678k2640j3542L429J70J1549J522q143P478
7699a5190k206J0766J398j9670k897q82P002Q969j3304O273O597n273Q764K939
7685f714l864K5867p751o400k1217K971R287r037M903R913L1557J1834o895p54
7671C3700j4398k8563j0959J019P73j525K1524m499r658j7583R860J2247J2369
7658D307J7935r548L050q528j1660J9100Q294j3147n134j0764kO812J7336m602
$$ plain form
7753 6596 28031 4235 -15582 -29749 -17710 9129 7547 -1876 -12906 -31311 -18872 -27369 -22375
7740 -22375 -5571 4369 2936 -25261 -30379 -23192 -25423 -40105 -21676 543 7448 8961 9391 5185
7726 5185 -12826 -3014 9808 12451 7890 -6435 -3674 21617 22051 12926 7769 17998 17467 -3904
7712 -3904 -24955 -3359 34722 29665 4987 -17653 -31195 -27766 -27596 -16047 -14525 -22668 -15190
7699 -15190 -17396 -6630 -5232 -24902 -27799 -28681 -21679 -12710 -26014 -19741 -13144 -18417 -9653 -6714
7685 -6714 -10578 15289 7538 1138 -20079 -17108 -7821 -16858 -11955 -2042 29515 41349 34454 33700
7671 33700 19302 -9261 -20220 -19201 -18428 -19953 1571 -2928 -12586 -30169 -20309 -8062 4307
7658 4307 22242 12694 15744 7216 -4444 14656 22950 9803 4669 -6095 -6097 715 18051 13449
7644A3449j1979m632l430J3925k310j3225J473J9327j5572j0381j4409l788J7879
7631a3673J114O517J6854J2531j757j3199n679j0717o29l776J7920r528k4157
7618b8179k958P569q238J8543q632l420q357J622J807j050K0579R26k1541N087
7604b6242K7830O293k2833j569J1537o78k3817o599K2920K167r575j539o038q042
7590c6185r704J810K1735M672M910l53p374p364j271J5734M897p303K668J8131
7576E003M634k0787l585K463j42J1573K4963K649o579n831o2q854j7448j3200
7562b5203K1141M474k2702K903L446k682j3205j2605j385P884K5218Q459J8009
7549A3752l07n025m829p345l691n638j628o094Q126j162m234k035R133j845L833
$$ plain form
7644 13449 1470 -3162 -6592 7333 5023 -8202 -6729 12598 -2974 -13355 -27764 -31552 -13673
7631 -13673 -12559 -6042 10812 23343 21586 8387 2708 -8009 -8638 -12414 5506 -4022 -28179
7618 -28179 -31137 -23568 -31806 -13263 -21895 -25315 -33672 -32050 -30243 -31293 -10714 -9788 -31329 -26242
7604 -26242 1588 7881 -14952 -16521 -4984 -5662 -29479 -36078 -13158 -10991 -20566 -22105 -28143 -36185
7590 -36185 -45889 -44079 -22344 -17672 -12762 -13115 -20489 -27853 -29124 -13390 -8493 -15796 -13128 5003
7576 5003 9637 -11150 -14735 -12272 -12414 -841 24122 26771 20192 14361 14299 5445 -12003 -25203
7562 -25203 -4062 412 -22290 -19387 -15941 -18623 -31828 -44433 -45818 -37934 -12716 -4257 13752
7549 13752 13445 8420 3591 -3754 -7445 -13083 -14711 -20805 -12679 -13841 -18075 -20110 -10977 -12822 -8989
7534h989J5608K4886j0039k4805K0388Q148j8673j5540l245j165K6467j143J24
7521A2022j4446p598j17N649Q94j5036R663J4256J1143j1j1968j2434J1507m425
7507i01l7317JJ9736O255J7854K3727o635J3501j6385n759J3056J104j4348j9698
7493e809r907P816J2487J618j0815j231Q194l104r43J634o083j9662m494K0206
7479a0093P644j0802j3053M374R131J7443o39k1804K3442K805n560j3847k8990
7466c9949m940n047P730J9056J7759J1118l5055j7691K008L827J7099K1465J2938
7453A0318n442M325j5751j248k4336n93J2967Q950N784O420J850q127R407J0666
7439A5190j0430l9675j0232J0732K2773N410P20K1623j8824k7014K4218J1911
$$ plain form
7534 -8989 6619 31505 21466 -3339 17049 25197 6524 -9016 -12261 -13426 13041 11898 12022
7521 12022 -2424 -10022 -10139 -4490 -3596 -18632 -8969 5287 16430 16419 4451 -7983 3524 -901
7507 -901 -38218 -38217 -18481 -12226 5628 29355 22720 36221 19836 14077 27133 28237 13889 -5809
7493 -5809 -15716 -7900 4587 6205 -4610 -5841 2353 -751 -1694 -60 -6143 -25805 -30299 -10093
7479 -10093 -2449 -13251 -26304 -21930 -12799 4644 4005 -17799 5643 8448 2888 -10959 -39949
7466 -39949 -44889 -49936 -42206 -23150 -5391 5727 -29328 -47019 -45011 -41184 -24085 -2620 10318
7453 10318 4876 9201 -6550 -7798 -32134 -32727 -19760 -10810 -5026 1394 3244 -4883 4524 15190
7439 15190 4760 -34915 -45147 -34415 -11642 -6232 -5512 16111 -2713 -29727 -5509 6402
7427F402l499Q79k044L155K0305j4083l9781J136J0735K5151J5831r596k431j213
7413A0947l148j305J8n325j883P688O699J713r451j0189p136K731k166J3673j2195
7398i329J0838J3527p742o262l342j739K0115N644r989J258r867l954N09k7336
7384b7669M822J9094K6145J7236m312k6218k0318J325p22n163k273k502J9791
7371g64J189k2560k229J3372j0114K449q178m954O908O078J7027m781j4912j54
7357b1623N592q428r414o529J9410J0157J88l200k549R772p197O994J0930k5627
7343b1524k4068M70j236O491J130J9226J6677j0434j8127J7238n192j8063j3949
7330e1361K2173L0151K6481m472k8544p459N056p099M479J0115J8739r568l3723
$$ plain form
7427 6402 2903 3782 1738 4893 25198 11115 -28666 -27530 -16795 8356 24187 14591 12160 10947
7413 10947 7799 6494 6512 1187 -696 6992 13691 15404 5953 -4236 -11372 -8641 -10807 2866 -9329
7398 -9329 1509 15036 7294 1032 -2310 -4049 16066 21710 11721 12979 3112 -842 -333 -27669
7384 -27669 -22847 -3753 22392 39628 35316 9098 -11220 -9895 -10617 -15780 -18053 -20555 -764
7371 -764 425 -22135 -24364 -10992 -21106 -18657 -26835 -31789 -24881 -18803 -1776 -6557 -21469 -21623
7357 -21623 -16031 -24459 -33873 -40402 -20992 -10835 -10647 -13847 -16396 -6624 -13821 -6827 4103 -21524
7343 -21524 -45592 -45122 -46358 -39867 -38737 -19511 -2834 -13268 -31395 -14157 -19349 -37412 -51361
7330 -51361 -29188 963 27444 22972 -5572 -13031 -7975 -15074 -10595 -480 18259 8691 -25032
7317b5032j5585Q816K59j0959J0892O914n934J559P165q91R13K3400J840J102
7303D459Q592J7371j4035j7194o588p93k516m044j3357L0366J1651q916n180j7140
7289a7324m264m841J2605O94O731L419m147J4340J5004p32m066j5110j3778R348
7275b121j781p186n187J9949K779p003L873Q386m57j07k61N473r449k328O261
7260A0841P765m505l451J734j1765R442M37k3089j0836o366J574K6074M954J0999
7246A3808Q513j6936j5739R534l112M653J0708J0456p173j6596j1633r523J2649
7233a0391J1485j5550j3948J786m234j359K324K2784J9428J5096J02j9287q621
7220c85k4986n699J3054K11k79J9533J1451k6724k586J3945J0399j2200j2068
$$ plain form
7317 -25032 -40617 -31801 -31542 -42501 -31609 -24695 -30629 -29070 -21905 -22796 -21883 1517 3357 4459
7303 4459 13051 30422 16387 -807 -7395 -8188 -10704 -14748 -28105 2261 13912 4996 -184 -17324
7289 -17324 -21588 -26429 -13824 -13130 -6399 -2980 -7127 7213 22217 21485 17419 2309 -11469 -2121
7275 -2121 -3902 -11088 -16275 3674 6453 -550 3323 11709 11252 11145 10884 16357 6908 4580 10841
7260 10841 18606 14101 10650 12384 619 10061 10498 -12591 -23427 -29793 -28219 -2145 2809 13808
7246 13808 22321 5385 -10354 -820 -3932 721 11429 21885 14712 -1884 -13517 -23040 -10391
7233 -10391 1094 -14456 -28404 -26618 -30852 -32211 -29887 -7103 12325 27421 27523 8236 -385
7220 -385 -25371 -31070 -18016 -17805 -18084 1449 12900 -13824 -16410 -2465 7934 -4266 -16334
7207a6334K3377J6102p218k2201o958J9317n290j4721P797O304J4701j265p589
7194F022j3992N678O258K0071m480j9949o184O168J8117N45j824M21K195j2655
7180F391K994j8994J583J1997j0336k3151J2048L487J3968K0879k0698l4678L105
7167c1405n738R264N210k0546J9052p735j3056P590J2661R524j9562m91O203O919
7153b2110R319J4314J2237K738J4615p590q529q832r527R061j0605j8628Q254
7140a5283O916J3536R351j1000k9875m754Q258J4137P864J456N134J718j3290
7127e832O911N399n441j186j89n260N42O892r339q410m347N217L859k136l33J4540
7111H87K439m329J021J02r227j6682q099J4745M38Q216M688N763j974O609p924
$$ plain form
7207 -16334 7043 23145 15927 -6274 -13232 6085 795 -13926 -6129 175 14876 13611 6022
7194 6022 -7970 -2292 3966 24037 19557 -392 -6576 -408 17709 18254 16430 16851 19046 6391
7180 6391 9385 -9609 -8026 3971 -6365 -29516 -17468 -13981 -13 20866 168 -34510 -31405
7167 -31405 -37143 -27879 -22669 -43215 -24163 -31898 -44954 -37364 -24703 -15179 -34741 -35232 -29029 -22110
7153 -22110 -12791 1523 13760 16498 31113 23523 14994 6162 -3365 5696 -4909 -23537 -15283
7140 -15283 -8367 5169 14520 3520 -26355 -31109 -22851 -8714 -850 606 5740 7458 -5832
7127 -5832 1079 6478 1037 -149 -338 -5598 -5056 1836 -7503 -15913 -20260 -15043 -11184 -13320 -13653 887
7111 887 3326 -1003 18 120 -9107 -25789 -33888 -19143 -18705 -10489 -5801 -38 -2012 4597 -3327
7096c327k145J5219M221j0779j7560m315m95O548m971J308m151p09P899o660N491
7081a4426N235O694j3355K617j1483q337L717R626J996p868R776m898k553J0895
7067a2364K511K100L4569P410j8781l735K638k1547N338n372J0955J1381j2306
7054B797m4738J74L9513R741o121q297p909Q38q409J1336J7281q16n494P84n338
7039d658J4722R322j2327k3975J0700J5992o979O034n219P041q824p499J7694
7026A2024J922m846n016J5596R46j1534k6874j5481L1577J5282k375J0496o256
7013A5461k622o831n71p171M344K1419j2988l4360j9167J707O320P096K6609K8333
6999B7579k358j4710j6017k2291K578J1566K1089j4714N278j2735l0515R095L243
$$ plain form
7096 -3327 -5472 9747 13968 3189 -14371 -18686 -19181 -12633 -17604 -16296 -20447 -21156 -13257 -19917 -14426
7081 -14426 -9191 -2497 -15852 -13235 -24718 -33055 -29338 -19712 -17716 -25584 -15808 -20706 -23259 -12364
7067 -12364 -9853 -7753 26816 34226 15445 11710 14348 -7199 -1861 -7233 3722 15103 2797
7054 2797 -41941 -41767 -2254 7487 1366 -6931 -14840 -14002 -22411 -11075 6206 5390 -104 680 -4658
7039 -4658 10064 19386 7059 -16916 -6216 9776 2797 8831 3612 10653 1829 -5670 12024
7026 12024 13946 9100 4084 19680 20626 9092 -17782 -33263 -1686 13596 11221 21717 15461
7013 15461 12839 6008 5437 -1734 2610 24029 11041 -23319 -42486 -40779 -34459 -27363 -754 27579
6999 27579 25221 10511 -5506 -27797 -25219 -13653 7436 -7278 -2000 -14735 -45250 -36155 -32912
6986c2912J101M64P721N486J8889k552j2315j0549p606k0806N7O109M511J4333
6972b8069J6108o248J3969J2849N697l3350k4043J3377L479k630J9450L270J5787
6959I646l71l296r597Q588n199p414j3963r21n237k854J1785J2058K5726J1182
6945C0133j6392j2706M407R760j3053j1827j6317l121J3393J0146L4n758l945
6932a5246j3964Q238N752l858R664K1760m355j2752J1328p464m789J699k159r82
6918g128j5860Q13J849Q205J0220L232j1597k3474q258m2M958j507J0263K0567
6904g759M33k1587q332K0701R793j0050k1454Q846J9100n159J1533J1666l0751
6891b3020q283k723J1417J0074k5276q319J3659o858k159J0799n16M138J2591
$$ plain form
6986 -32912 -31811 -31347 -23626 -18140 749 -1803 -14118 -24667 -32273 -53079 -53022 -46913 -42402 -28069
6972 -28069 -11961 -18209 -4240 8609 14306 -19044 -43087 -29710 -26231 -28861 -9411 -6141 9646
6959 9646 9275 5979 -3618 4970 -229 -7643 -21606 -22527 -27764 -30618 -18833 -6775 18951 30133
6945 30133 13741 1035 5442 15202 2149 -9678 -25995 -29116 -15723 -5577 -5543 -11301 -15246
6932 -15246 -29210 -20972 -15220 -19078 -9414 12346 7991 -4761 6567 -897 -5686 -3987 -6146 -7128
6918 -7128 -22988 -22175 -20326 -12121 -1901 1331 -10266 -33740 -41998 -42040 -37082 -38589 -28326 -7759
6904 -7759 -7326 -28913 -37245 -16544 -6751 -16801 -38255 -29409 -10309 -15468 -3935 7731 -23020
6891 -23020 -31303 -34026 -22609 -12535 -37811 -46130 -32471 -39329 -41488 -30689 -31205 -27067 -14476
6878a4476K047J5056m999j8747r091p06J6708K430J3089K0425j2763j8845Q696
6865a176j9128Q687J3384j8727J028j155l2064n790O600Q226R869J4184j3383
6852b9445p511J3329K2500r916N924K2110j5650j1582L165J0898m231r997J318
6839i088P052j921l536j1259J1230J2756J4920J5223j0870k3291j0869o574p907
6826b4134j2713J6390K3281n878j2151r509o687m000J6884M052K570N561P911
6813A577m348J7738n326j140m025k18O748j6137j4447Q365K2842j2420L721J4343
6799A7273j986L923J8989j0534m795L902k5496k8635l351J0578Q862K2270Q812
6786A9812J0447O922j6563p752n929k0388j6507m624K4350J2589j2549l238j5705
$$ plain form
6878 -14476 -12429 2627 -2372 -21119 -30210 -30916 -14208 -11778 1311 21736 8973 -9872 -1176
6865 -1176 -20304 -11617 1767 -16960 -15932 -17087 -49151 -54941 -48341 -40115 -30246 -16062 -29445
6852 -29445 -36956 -23627 -1127 -11043 -5119 16991 1341 -10241 -7076 3822 -409 -10406 -9088
6839 -9088 -2036 -3957 -7493 -18752 -7522 5234 20154 35377 24507 1216 -9653 -16227 -24134
6826 -24134 -36847 -20457 2824 -3054 -15205 -24714 -31401 -35401 -18517 -14465 -11895 -6334 1577
6813 1577 -2771 14967 9641 8501 4476 4258 11006 -5131 -19578 -11213 11629 -791 2930 17273
6799 17273 15287 19210 38199 27665 22870 26772 1276 -27359 -30710 -20132 -11270 11000 19812
6786 19812 30259 37181 20618 12866 6937 -13451 -29958 -34582 -10232 2357 -10192 -13430 -29135
6773b9135m028J908J1833r570l346J6860j0976j6531M839J7048J9252k3352l4700
6760e9898r466L6833p378J4667Q931l04L848k535R901p789m410L942J4529o08
6746B63o347q398J3291L356j6879k4225K6976K7414k0289j3949P098N208q788
6733a5269k988q780O084L922p761J1106P79j8042k380J0442p72J1555J2542n709
6719e271j2340j809J717o433J3736P400J1530k294j2594j9432j9807N105L4020
6706f472p50j1206J0243O169l327k955j2490K4809P835o124j8802j3428k582O573
6692b2507q783J1473J9294K1060j8549j6839j2260r642r417M824K1538K7654K0963
6679B8809j5127m888J2316j7233J0884J2040l028j2725m840k045j2889r821m171
$$ plain form
6773 -29135 -33163 -31255 -19422 -28992 -32338 -15478 -26454 -42985 -38146 -21098 -1846 -25198 -59898
6760 -59898 -69364 -32531 -39909 -25242 -16311 -16615 -12767 -15302 -5401 -13190 -17600 -13658 871 263
6746 263 -6084 -14482 -1191 2165 -14714 -38939 -11963 15451 -4838 -18787 -11689 -6481 -15269
6733 -15269 -18257 -27037 -20953 -17031 -24792 -13686 -12907 -30949 -33329 -22887 -23659 -12104 438 -5271
6719 -5271 -17611 -19420 -17703 -24136 -10400 -3000 8530 6236 -6358 -25790 -45597 -40492 -6472
6706 -6472 -7222 -18428 -8185 -2016 -5343 -8298 -20788 4021 11856 5732 -13070 -26498 -29080 -22507
6692 -22507 -31290 -19817 -523 20537 1988 -14851 -27111 -36753 -46170 -41346 -19808 7846 28809
6679 28809 13682 8794 21110 3877 14761 26801 23773 11048 6208 4163 -8726 -18547 -22718
6666b2718J9101J4636M392M363J8375J80q778j876n935j1664N080m491j8385K123
6652e597k422r975n158r295l871R053K5209K0902K054j2594l242k044l072k256
6638b308J4560p456n198N538k391J1565R849j1430r521O361J0906K001r059k2793
6624i376j0j1285k941Q924l337o065k189J7803R723O993r537M771O210J836o631
6609D889k0761n54l282P924O330k282q177j359K810j3397J6802K8885M122L325
6595B5275j0406J22j5935j8532M884k702k232J875j6462m799o272O914q373j1364
6581e8007J1778K0353M343O885O810L128K436p645Q236O941j506K749J175J8030
6567B5706J8014j6518j8211k8169j1542J8865J0829k2351Q19K3308j860l183L324
$$ plain form
6666 -22718 -3617 11019 15411 19774 38149 38329 29551 27675 21740 10076 15156 10665 -7720 -5597
6652 -5597 -8019 -17994 -23152 -32447 -36318 -27265 -2056 18846 20900 8306 5064 3020 -52 -2308
6638 -2308 12252 4796 -402 5136 2745 14310 24159 12729 3208 9569 20475 22476 13417 -9376
6624 -9376 -9386 -20671 -23612 -14688 -18025 -24090 -26279 -8476 1247 8240 -1297 3474 9684 11520 4889
6609 4889 -15872 -16426 -19708 -11784 -5454 -7736 -15913 -17272 -14462 -27859 -11057 17828 21950 25275
6595 25275 14869 14991 -944 -19476 -14592 -17294 -19526 -17651 -34113 -38912 -45184 -38270 -46643 -58007
6581 -58007 -46229 -25876 -21533 -14648 -7838 -4710 -2274 -9919 -1683 5258 3752 6501 7676 25706
6567 25706 43720 27202 8991 -19178 -30720 -11855 -1026 -23377 -22558 750 -1110 -4293 -969
6554i69m508l393J8641O639l0501q453K5832K512m209n969p95j4949r434J8397
6540a1159n427R501K626P572j1005M510J9014J9139N090J5417K048k6593j5875
6527A4858l1761k013K2125j487j1208j0079r335J5212J1392J6367p768p255J0785
6514I833J0358l796j5224m892M984N999K12p173k334j0324L984M827J771n666
6500g441j4857J4370K1967m594n074K542J354j0792l091J94N161J5452q637J5047
6486B1601N639r763j538o662L979j3720j5936p531L901K994o261j0701K0823J7319
6472D144J0480j085L643j871J2013o787l21j1521k5128k0749J8413J2953M120
6459a696J878P749R715j0217Jp441J0995J2627k76r522O339k4215j9694J0878
$$ plain form
6554 -969 -5477 -8870 9771 16410 -14091 -22544 3288 5800 1591 -4378 -5173 -20122 -29556 -11159
6540 -11159 -16586 -7085 -4459 3113 -7892 -3382 15632 34771 39861 55278 57326 30733 14858
6527 14858 -16903 -18916 3209 1722 -9486 -19565 -28900 -13688 -2296 14071 6303 -952 9833
6514 9833 20191 16395 1171 -3721 1263 7262 7474 301 -2033 -12357 -8373 -3546 -1775 -7441
6500 -7441 -22298 -7928 14039 9445 4371 6913 8267 -2525 -5616 -5422 -261 15191 6554 21601
6486 21601 27240 17477 15939 9277 13256 -464 -16400 -23931 -20030 -17036 -23297 -33998 -13175 4144
6472 4144 14624 13539 17182 15311 27324 20537 20216 8695 -16433 -37182 -18769 -5816 -1696
6459 -1696 182 7931 17646 7429 7430 -11 10984 23611 23335 13813 20152 -4063 -23757 -12879
6445a2879L325k6425j0762Q461K7074K2546O563k719j0966J3334J0461j7679k1700
6432a1366J2627J3115r233j1728l693q036n437J7125K4225J1006n954m123J502
6419B0030O306n871j4826l350R73J1753n537j5369R524O805J980J7652J0253q632
6405C1691j966l377k1532l412R266J5963M49j4494k04j186j968l0322j9433l600
6391d4125N436Q934P917K2756J553j5550m085J7471M463L852K1320J824j223m682
6377B5861k1971j2148l147k141P333R360J0119Q808j1393P253j7040m078J5330
6364A2146P01k884K0570J632P197o433r249o597j0443l1917j0856n341J0752P237
6350b3485J6159P175K2864m011q410j7711j7420q914n41J4835J680J3957m380
$$ plain form
6445 -12879 -9554 -35979 -46741 -38280 -11206 11340 17903 15184 4218 17552 28013 10334 -11366
6432 -11366 1261 14376 5143 -6585 -10278 -18314 -23751 -6626 17599 28605 22651 18528 20030
6419 20030 26336 20465 5639 2289 3262 15015 9478 -5891 3633 10438 12418 30070 40323 31691
6405 31691 29725 26348 4816 1404 10670 26633 27082 12588 12384 11198 9230 -21092 -40525 -44125
6391 -44125 -38689 -29755 -21838 918 2471 -13079 -17164 307 4770 8622 29942 31766 30543 25861
6377 25861 3890 -8258 -11405 -13546 -6213 3147 13266 22074 10681 17934 894 -3184 12146
6364 12146 12847 9963 30533 32165 39362 32929 23680 17083 6640 -25277 -36133 -41474 -30722 -23485
6350 -23485 -7326 -151 22713 18702 10292 -7419 -24839 -33753 -34294 -19459 -17779 -3822 -8202
6337h202n856J0516o665k3484k432R557J0322J2747M453k2785J9516N028J5716
6324A8431J1579p666k3666j1773j1178L985l579P773K1877M682k2280k9854M148
6311c7521L4652J9035l614j1487p229J9563J7365l8541k2099N603J3788j673k618
6298a4776J4556J0827k1532J1217N767j2463q811J9788N899r271J039J587K916
6285F743Q969q421r118J5941N796J3058j3138k4332r605K2560K0266p533j2114
6272I072q28L141K985M686j990j3568j5739j746K4205J7400r565k3680j202K379
6258d450j5834l881Q401o761q335R077J9340K6727j1821m886J3311K412N779r954
6244A9125M7p53J2246q270j6326j3330M480J4895J0321Q54k2333k365J005j7203
$$ plain form
6337 -8202 -14058 -3542 -10207 -33691 -36123 -26566 -16244 -3497 956 -21829 -2313 2715 18431
6324 18431 30010 22344 -1322 -13095 -24273 -20288 -23867 -16094 5783 10465 -11815 -41669 -37521
6311 -37521 -2869 16166 12552 1065 -6164 13399 30764 -7777 -29876 -24273 -10485 -12158 -14776
6298 -14776 -220 10607 -10925 292 6059 -6404 -15215 4573 10472 1201 2240 3827 6743
6285 6743 15712 7291 -1827 14114 19910 32968 19830 -4502 -14107 8453 28719 21186 9072
6272 9072 8244 11385 14370 19056 17066 3498 -12241 -13987 10218 27618 18053 -5627 -6829 -4450
6258 -4450 -20284 -24165 -15764 -22525 -30860 -21783 -2443 24284 12463 7577 20888 23300 29079 19125
6244 19125 19172 18419 30665 22395 6069 -7261 -2781 12114 22435 23289 956 -1409 -404 -17607
6230a7607r348J8319O55k9184n794K586L2268Q976n4K797j3624p015J8521J2535
6216A4031k7635k2294J6993L536j4476P392J1839J0302N863j1277m47L120M204
6203A151Q651k011k1092Q300J4354r78l306k1573j9564M157J2893j1773J431J1227
6189a8133J666J772Q344N087m562l144L04J1747J5182j5359j3688j0627J5371
6176f040K9457P717J7719j3556j3164j0280p760n691j1259K224J4280K4873j4513
6163A4007j7083j4513K155J261j265N442r527J7460K825j3766k4135o206n207
6150d8552r165l908K2120L481J428M609M127J9922l391k3007R369K2460J3872
6137A3365l591n097k1281r825R144J0468K3650J1105j0397l6970m682J2552J8098
$$ plain form
6230 -17607 -26955 -8636 -7981 -37165 -42959 -40373 -8105 871 817 3614 -10010 -17025 1496 14031
6216 14031 -13604 -35898 -18905 -15369 -29845 -22453 -10614 -312 5551 -5726 -6173 -3053 1151
6203 1151 9802 7791 -13301 -5001 9353 8375 5069 -16504 -36068 -31911 -19018 -30791 -29360 -18133
6189 -18133 -16467 -14695 -6351 -1264 -5826 -8970 -8666 3081 18263 2904 -10784 -21411 -6040
6176 -6040 23417 31134 48853 35297 22133 11853 4093 -1598 -12857 -10633 3647 28520 14007
6163 14007 -3076 -17589 -15434 -14173 -15438 -9996 -19523 -2063 762 -13004 -37139 -43345 -48552
6150 -48552 -57717 -61625 -39505 -36024 -34596 -29987 -25860 -5938 -9329 -32336 -22967 -507 13365
6137 13365 9774 4677 -16604 -26429 -17285 -6817 16833 27938 17541 -19429 -24111 -11559 6539
6124F539L355j4412J1237J4886j2491K068R479k84P534m011j0546r831n852M972
6110B643J7182m130N378q684j266n274J1243j329o851R407K2738j3482j1945j7696
6096b066J0396J4920j0825j4310k359J6356n979O060P322k71p114K596r855q60
6082D011j9076q884Q199L0542n325p774l204J3218j5559n953J4834O074j5426
6069d323K997K0805j4357j3617p895R830k051q351q952J4042R85k2631K3966M525
6055e027o088r543Q50m227K876Q095J5233k2809m557k214P664K405R274j2581
6041b0649n072m594n606J2576K9466Q569J318L005j4271J395P217q312j0664j920
6027g542R176j033m248l638n303J1854L3190J068m706k732r981k2161j4930L749
$$ plain form
6124 6539 9894 -4518 6719 21605 9114 11182 20661 20377 27911 23900 13354 3523 -2329 2643
6110 2643 19825 15695 21073 12389 11123 5849 17092 15763 8912 18319 41057 27575 15630 -2066
6096 -2066 8330 23250 12425 -1885 -4244 12112 6133 12193 19515 19244 12130 14726 4871 4011
6082 4011 -15065 -23949 -15750 14792 9467 1693 -1511 11707 -3852 -9805 5029 11103 -4323
6069 -4323 -1326 19479 5122 -8495 -16390 -6560 -8611 -16962 -25914 -11872 -10887 -33518 -9552 -5027
6055 -5027 -11115 -20658 -19808 -24035 -21159 -13064 2169 -20640 -25197 -27411 -19747 -17342 -8068 -20649
6041 -20649 -25721 -30315 -35921 -23345 6121 14690 16008 19013 4742 6137 13354 5042 -5622 -7542
6027 -7542 1634 601 -3647 -7285 -12588 -734 32456 33524 28818 26086 16105 -6056 -20986 -17237
6013a7237L362k1460K870K3681L6691J95n981o715n931J841j3445j8354J5350
6000e133O910J2223J3703k5113l0850Q464K571q126K2599J4039k408M975l786
5987A0068k094O732M969j6486o133j725j4443k400J3120J3398J1218l429j156
5974A1639k4791k2835p999l706J6723K9479p917j9840q61L395L245Q758P109p786
5960a5387j3834J4379K7980K71k1956k5881j1543J3151K6433J4383R26r813P046
5947F155Q097K38P223j723j934j6627l1436N033K2449J3859k4026q710K9963J93
5933H754k0855p605j1156q87m89N741k615o469K5221K0531O308r402j7622r372
5919a9917r841O565K1590j2700l36J0456J950Q089J174M509o812p635p193Q815
$$ plain form
6013 -17237 -13875 -35335 -32465 -8784 27907 28102 22121 15406 9475 11316 -2129 -20483 -5133
6000 -5133 1777 14000 27703 2590 -28260 -19796 -17225 -25351 -2752 11287 8879 13854 10068
5987 10068 7974 14706 19675 3189 -2944 -4669 -19112 -21512 -8392 5006 16224 12795 11639
5974 11639 -13152 -35987 -43986 -47692 -30969 -1490 -9407 -29247 -30108 -26713 -23468 -14710 -7601 -15387
5960 -15387 -29221 -14842 13138 13409 -8547 -34428 -45971 -32820 -6387 7996 8922 -891 6155
5947 6155 14252 14490 21713 19990 18056 1429 -30007 -24974 -2525 11334 -12692 -21402 8561 8754
5933 8754 -12101 -19706 -30862 -31749 -32238 -26497 -29112 -35581 -10360 10171 16479 7077 -10545 -19917
5919 -19917 -29758 -23193 -1603 -14303 -14639 -4183 -2233 5856 7030 11539 4727 -2908 -10101 -1286
5905a286K7917j1811m917q987j980p143j0905j0165J193j034Q881J0762M098l772
5891i149O402J4880N476l548j5163j3654j730J2370p888m723q759K3546P428j5159
5877i671O954p661N14J0583J775O992m194j0892M317K0684L357L721p288j4430
5863D761N472r756j6858r574j5207M91p90r177P640L3106J7791j5620L980Q231
5849D490N609p135n345o772M982l721j0574k61R654J55J500O469J853p904K531
5834d469j341k264K5879J1307l07k2298J404L349j7150P95J5338K934n837J408
5820H748o148o207K087o527l01P689k6613j3957J0667p985q293O350P94J4478
5806b5218N660J0101Q534K36J3795R534k1384k2198m063j0491K0541O164O235
$$ plain form
5905 -1286 26631 14820 9903 916 -1064 -8207 -19112 -29277 -28084 -29118 -20237 -9475 -5377 -9149
5891 -9149 -2747 12133 17609 14061 -1102 -14756 -16486 -4116 -12004 -16727 -25486 -1940 5488 -9671
5877 -9671 -2717 -10378 -9864 719 2494 9486 5292 -5600 -1283 19401 22758 26479 19191 4761
5863 4761 10233 477 -16381 -25955 -41162 -40671 -41461 -50638 -42998 -9892 7899 -7721 -3741 4490
5849 4490 10099 2964 -2381 -9153 -4171 -7892 -18466 -18727 -9073 -8918 -7418 -949 904 -7000 -4469
5834 -4469 -5810 -8074 17805 29112 28805 6507 7911 11260 -5890 -5095 10243 13177 7340 8748
5820 8748 2600 -3607 -1520 -8047 -8348 -659 -27272 -41229 -30562 -38547 -46840 -40490 -39696 -25218
5806 -25218 -19558 -9457 -923 -687 13108 22642 1258 -20940 -25003 -35494 -14953 -8789 -2554
5793b554r414l1895j7319K4961K8669R153K400J604J297j1352j4682L842J620
5780a3670J2998J809j1018n179K197J0254p386n762P409j197r493M0364r730k2807
5766a1211n731P232J1420J573R145j827j6291J2345n715j3187j6656J4995l81
5753a4289P037J0400O019o180o423R680J4665q971k2121P980J1342n966n486n622
5739g935o353j5899O471J1532m069q521r805J119J2332L551L306R169o288j1394
5725b2784j9927J2323K9834N914J5676m788j3757j6074J4481J707j3148r91j1191
5712b2725R86j5747K474K3982J5862j898l959q888P35n559L936J4329r583o845
5698a2900q75q261j6012j2440j2646J438J8781r367j3983J2966M0103J8999o427
$$ plain form
5793 -2554 -11968 -43863 -61182 -36221 -7552 1601 4001 5605 6902 -4450 -19132 -15290 -13670
5780 -13670 -672 1137 -9881 -15060 -12863 -2609 -9995 -15757 -8348 -9545 -19038 21326 11596 -11211
5766 -11211 -16942 -9710 1710 3283 12428 10601 -5690 6655 940 -12247 -28903 -13908 -14289
5753 -14289 -7252 3148 9167 2987 -3436 6244 20909 11938 -10183 -2203 9139 3173 -2313 -7935
5739 -7935 -14288 -30187 -23716 -12184 -16253 -24774 -34579 -33460 -21128 -17577 -14271 -5102 -11390 -22784
5725 -22784 -42711 -30388 -554 5360 21036 16248 2491 -13583 898 2605 -10543 -11534 -22725
5712 -22725 -21739 -37486 -35012 -11030 4832 2934 -1025 -9913 -9178 -14737 -10801 3528 -6055 -12900
5698 -12900 -13775 -22036 -38048 -50488 -63134 -61696 -42915 -52282 -66265 -53299 -13196 5803 -624
5685f24n5809k3704J5806O278L8307J0511K529j6028q778k669J3045l30P213J943
5671a2310K90Q171j134j3337n802p211K5620J5178L594K016l458j326J015o342
5657D964k8683m797J8433K9043J0076l683j8285j9103l478Q179m425q447J5715
5644d491J0727Q701p741p294k635r676j2047J4166l568r856J8597K4919K6151
5631D5953q458j5216Q160M519j2200j3652j7245j0607K917M681O140j2064n469
5618b2541j285J9662J8697P751N451j633j0405j1835q436N447k529J589N449L156
5604H538p260k7765J4413l635J2068J2571o39J1307r562l49J7268p40k0037q957
5590b779J3599K6622j3769j7682q636J696n89j977q441J1733K303j8720P899R17
$$ plain form
5685 -624 -56433 -80137 -64331 -58053 -19746 -9235 -6706 -22734 -31512 -34181 -21136 -21466 -14253 -12310
5671 -12310 -12020 -3849 -4983 -18320 -24122 -31333 -5713 9465 13059 15075 11617 10291 11306 4964
5657 4964 -23719 -28516 -10083 18960 29036 25353 7068 -12035 -15513 -7334 -11759 -20206 -4491
5644 -4491 6236 14937 7196 -98 -2733 -12409 -24456 -10290 -13858 -23714 -5117 19802 45953
5631 45953 37495 22279 30439 34958 22758 9106 -8139 -18746 -15829 -11148 -5008 -17072 -22541
5618 -22541 -23826 -4164 14533 22284 27735 26102 15697 3862 -4574 873 -1656 -67 5382 8538
5604 8538 1278 -26487 -12074 -15709 -3641 8930 8291 19598 10036 9687 26955 26215 6178 -2779
5590 -2779 10820 37442 23673 5991 -2645 -949 -1538 -3515 -11956 -223 2080 -16640 -8741 -7824
5576g824o263R749L009q817j4513L911K545J930J2373J3948J3603J1446n435J913
5562C1575m1185k1834j522j0007j3907J3435K1583J1602J7819j4376q382N995
5550i204o668j655r738R327J685J1261j9270N4J3156Q85J2242n93k4931j4826
5536c8275J7182J5946j7841j0713J0608J0081q579J1943J7091L009j7806n471
5524a2825m343J8124M661p335j1628r509j6654l027m230J1811n69r184Q759J8814
5510a7135k514j3845R973p16k224m481j007J2410K1066r132R573j8685J1780M086
5496h51j0115N580J0119J5434k521N225j1591l4359J0888j334j2949M971J6230
5483e273N617R870M449j056k2199k0176P424J0346N68J1882m158J869n484k808
$$ plain form
5576 -7824 -14087 -4338 -1329 -10146 -24659 -20748 -18203 -16273 -3900 10048 23651 35097 29662 31575
5562 31575 -9610 -31444 -32966 -42973 -56880 -43445 -21862 -10260 7559 -6817 -15199 -9204
5550 -9204 -15872 -17527 -27265 -17938 -16253 -4992 -24262 -24208 -11052 -10167 2075 1482 -23449 -38275
5536 -38275 -21093 -5147 -22988 -33701 -23093 -13012 -21591 -9648 7443 10452 -7354 -12825
5524 -12825 -17168 956 5617 -1718 -13346 -22855 -39509 -42536 -46766 -34955 -35524 -44708 -35949 -17135
5510 -17135 -19649 -33494 -23521 -24237 -26461 -30942 -31949 -19539 1527 -7605 1968 -16717 -4937 -851
5496 -851 -10966 -5386 4733 20167 17646 22871 11280 -23079 -12191 -13525 -26474 -21503 -5273
5483 -5273 344 10214 14663 13607 -8592 -28768 -21344 -10998 -10430 1452 -2706 -837 -6321 -9129
5469i129m061p088N832J181m765J3769K0166L551m678m899l5812k4295K655N78
5455d6995L022J0684K5396K1088n577j4544k450K2749R530k1438j5007j409K3081
5442H130J1108J897k1650p619J0474j541j0184Q783p032J1232R920j686o588o912
5428a668R226L11j3916o206R124J0481P261j7540o345m43p604J7965k642L029
5414A033J5037k3889k3564J1968J6887P633j5665q424j425L120J7771L76l92J3530
5400A3996O819r008l502R810J044q370M003m065J625J5731O33j4794p288q976
5386b342j0431l529J0683J0886l192j613j211j1727J1323K345p304J531N10R221
5372E150j2269o510j1450P859K0456J0835j1502j1465j958Q911K366k0449R703
$$ plain form
5469 -9129 -13190 -20278 -14446 -13265 -18030 -4261 15905 19456 14778 9879 -25933 -50228 -47573 -46995
5455 -46995 -43973 -33289 -7893 13195 7618 -6926 -9376 13373 22903 1465 -13542 -14951 8130
5442 8130 19238 21135 -515 -8134 2340 799 -9385 -602 -7634 3598 13518 11832 5244 -1668
5428 -1668 7558 7869 -6047 -12253 -3129 7352 14613 -2927 -9272 -9715 -17319 646 -1996 1033
5414 1033 16070 -7819 -31383 -19415 -2528 5105 -10560 -18984 -20409 -17289 482 858 466 13996
5400 13996 20815 11807 8305 18115 19159 10789 14792 10727 12352 28083 28716 13922 6634 -2342
5386 -2342 -12773 -16302 -5619 5267 2075 462 -749 -12476 -1153 1192 -6112 -4581 -4071 5150
5372 5150 -7119 -13629 -25079 -17220 3236 14071 2569 -8896 -10854 -1943 423 -20026 -10323
5359a0323l869r189j821K329J1820K344O538O17j2387J7887O180k5712j2446Q262
5345a9770j328n046Q06L022j432j4132N150J0957k999J3318R766m50L741K0790
5331B2393J0108J5570j0702n858j0342J716j096n31L518o07j2978p512M390L117
5317A1186j5677j8591q469J2180j1086L694J998J9335N537j3700j1702M394Q366
5304a2535O450k287j1236k555O079J901l712l088j2926P65J1108p622P017K758
5290a9883r594l327K0419J4651J0822N08J196K1326j5416j2080L41O058j728j4951
5276a658n840j3133r507j1509q708K7366K2131M885P36J4667J9871j4610j8279
5263F412m892j5199J1813K0995l422j8293P218J7407l713J2212J359k6935k1360
$$ plain form
5359 -10323 -14192 -23381 -25202 -22873 -11053 -8709 -2171 -1554 -13941 3946 10126 -15586 -28032 -19770
5345 -19770 -21098 -26144 -25338 -22316 -23748 -37880 -32730 -21773 -24772 -11454 -1688 -2138 1603 22393
5331 22393 32501 48071 37369 31511 21169 22885 21789 21258 24776 24169 11191 3679 8069 11186
5317 11186 -4491 -23082 -31551 -19371 -30457 -26763 -24765 -5430 107 -13593 -25295 -20901 -12535
5304 -12535 -6085 -8372 -19608 -22163 -16084 -14183 -17895 -20983 -33909 -33144 -22036 -29658 -22641 -19883
5290 -19883 -29477 -32804 -12385 2266 13088 13596 14792 36118 20702 8622 8963 15021 13293 -1658
5276 -1658 -7498 -20631 -30138 -41647 -50355 -22989 -858 4027 4763 19430 39301 24691 6412
5263 6412 1520 -13679 -1866 19129 15707 -2586 4632 22039 18326 30538 31897 4962 -16398
5250a6398j4924L870J7762r117k0467J3499J4348R293K3979j049j8502l674R29
5237d51J797J035q000q028o64J283K1871P239p883K646O163o168j4082j1587J217
5222a3612q962j4621K0665N144M142J978q093j6730N319P26o322j189q125p386
5208d7066r00N898M178p56K699N613J1717R333K1814J3301J5479q129j0046j7471
5194E664K684J446m214N688M039n807p175K373p295l235k572m488q105r90Q497
5179a3490J9789J0177K778j1638j7536j7241M582J7738L554J1167q55N763r324
5166E464k1904k882J7941M421j4685j1311N25j4974O777J385K6171L8207N624
5153D0759j3228j4070j6579N491Q671j479Q636q487Q302n121j0710o202o600L133
$$ plain form
5250 -16398 -31322 -27452 -9690 -18807 -39274 -25775 -11427 -2134 21845 20796 2294 -1380 -451
5237 -451 1346 2381 -5619 -13647 -14311 -13028 8843 16082 8199 10845 17008 10840 -3242 -14829 -13612
5222 -13612 -22574 -37195 -16530 -11386 -7244 -5266 -13359 -30089 -24770 -24044 -30366 -31555 -39680 -47066
5208 -47066 -47966 -42068 -37890 -38646 -35947 -30334 -18617 -9284 12530 25831 41310 33181 23135 5664
5194 5664 8348 9794 5580 11268 15307 9500 2325 4698 -2597 -5832 -8404 -12892 -20997 -21987 -13490
5179 -13490 6299 16476 19254 7616 -9920 -27161 -22579 -4841 -1287 9880 9025 14788 5464
5166 5464 -16440 -19322 -1381 3040 -11645 -22956 -22431 -37405 -30628 -29243 -3072 35135 40759
5153 40759 27531 13461 -3118 2373 11044 9565 18201 9714 18016 12895 2185 -4017 -10617 -7484
5139g484k119J2841J703k1209R277K9382j505j6956j7178J4620M5L234O029r006
5125A674j5572j9262M58J4817O29Q601J6753j6095p750P029R641Q368m019k88
5111D984l473K8884J3559q999l3452j4402L66j5961m574K6086n221j6374l12J0252
5097a8637o582P559J6540m321O325k4865m490J1636o161N191J0960m258J2075
5084I72j306p289m049K963m232P304k399j5889j1975j5834l755J4621J8928j370
5070b3310J0095O390O199o315N095N351L856l692p792k758o032k1404P18J9592
5056a4007L3839j32k1782r395j411J4975j32r747p581J2237j1636k0797K234Q979
5042b4356n808J6735l178j2727N189R354O945R866m11k113j3731N671P663N897
$$ plain form
5139 -7484 -9603 3238 4941 -16268 -6991 22391 20886 3930 -13248 1372 1417 4651 10680 1674
5125 1674 -13898 -33160 -32702 -17885 -17256 -8655 8098 -7997 -15747 -8718 923 9291 5272 4984
5111 4984 1511 30395 43954 34955 1503 -12899 -12533 -28494 -33068 -6982 -12203 -28577 -28889 -18637
5097 -18637 -25219 -17660 -1120 -5441 884 -23981 -28471 -16835 -22996 -17805 -6845 -11103 972
5084 972 -334 -7623 -11672 -8709 -12941 -5637 -8036 -23925 -35900 -51734 -55489 -40868 -21940 -23310
5070 -23310 -13215 -6825 -626 -6941 -1846 3505 7361 3669 -4123 -6881 -12913 -34317 -33599 -14007
5056 -14007 19832 19700 -2082 -11477 -12888 2087 1955 -7792 -15373 -3136 -14772 -35569 -33335 -24356
5042 -24356 -30164 -13429 -16607 -29334 -24145 -14791 -7846 2020 1609 -504 -14235 -8564 -901 4996
5028D996j5718j3012r90o473J6474K6777J9535m883k7729j0801J4242j2323L143
5015f762J713j219P392J3116L085j1457P601o259o548j2180j5849N490K629r987
5001b9235J0039n050Q956J3047J2964j5998r888m501P25O969M741K297j9836j1153
4987c5923R483k982R355j4383J424K6274j5476K13J4628m897J8739k791k1038
4974a7374M935K3698n817l961k309p667k855r959J0139K2185m101j0762l161j6313
4960b3322K804Q161q41Q566L061p601J6138r778j9216L105o642l903K2948R651
4946C131N429o290N409M237K968P207O632r369L66j8556j3558M918N652J3664
4932A1840l985J736j0019K6542l317j846j0145q529p715M628L080M052m641J3376
$$ plain form
5028 4996 -10722 -23734 -24724 -31197 -14723 12054 31589 26706 -1023 -11824 2418 -9905 -6762
5015 -6762 -5049 -6268 1124 14240 17325 5868 13469 7210 662 -11518 -27367 -21877 -19248 -29235
5001 -29235 -19196 -24246 -15290 -2243 10721 -5277 -15165 -19666 -18941 -11972 -7231 -4934 -24770 -35923
4987 -35923 -26440 -29422 -20067 -34450 -33026 -6752 -22228 -22015 -7387 -12284 6455 3664 -17374
4974 -17374 -12439 11259 5442 1481 -828 -8495 -11350 -21309 -11170 11015 6914 -3848 -7009 -23322
4960 -23322 -20518 -12357 -13198 -4632 -1571 -9172 6966 -2812 -22028 -18923 -25565 -29468 -6520 3131
4946 3131 8560 2270 7679 11916 14884 22091 28723 19354 19720 1164 -12394 -7476 -1824 11840
4932 11840 7855 9591 -428 26114 22797 20951 10806 2277 -5438 -810 2270 6322 1681 15057
4918A5057j166l474l9k3994l794J0425j489L093L224p562m491Q860J0775J3243
4904A8668O795J1826j0877j0733p240m30L334j6991p267N525P416j6288q707m975
4890b9944Q874J4147m963k6099J981L075J4213K904J1938K036j652K358m829j3968
4876a9929J1039K958P98k392r764q424J848J9308J4007r048r254K3210J9153k4209
4862I301r842n541k5377L35J2073J6741J0406Q926J0291n451K787L677L289N464
4848C7079l705r044n736K459j9234k8031O642n830O989O36J3991n0J221k357L750
4833a220n2R633J224j444P90K385K722k6073k4309K820R546J2860J858J2189N750
4818H679l447K121M809O95k816j2323k3554p71K0188k2624q344K1607N075j872
$$ plain form
4918 15057 13891 10417 10378 -13616 -17410 -6985 -8474 -5381 -2157 -9719 -14210 -5350 5425 18668
4904 18668 25463 37289 26412 15679 8439 8009 11343 -5648 -12915 -7390 26 -16262 -24969 -29944
4890 -29944 -21070 -6923 -11886 -37985 -36004 -32929 -18716 -15812 -3874 -1838 -3490 -1132 -5961 -19929
4876 -19929 -8890 -5932 -5134 -7526 -17290 -25714 -23866 -4558 9449 401 -8853 14357 33510 9301
4862 9301 -541 -6082 -31459 -31124 -19051 -2310 8096 17022 27313 21862 24649 28326 31615 37079
4848 37079 33374 24330 18594 21053 1819 -26212 -19570 -25400 -18411 -17775 -3784 -3834 -2613 -4970 -1220
4833 -1220 -1272 8361 9585 8141 8931 11316 14038 -12035 -36344 -33524 -23978 -11118 -9260 2929 8679
4818 8679 5232 7353 12162 12857 10041 -2282 -25836 -26607 -6419 -29043 -37387 -15780 -10705 -12577
4804a2577K0078J0346O500j0974j7330j9639J0883K1202j1634j5664K0167N851
4792G209j1107k399L198M287J1210K260j2473k6902j0627j2361l952j3726J085
4779f4298L2223J3038j2926R16K2855J2862j8138j4787j1574j2583L586J6657
4767c2169J156m342p849J9582Q235J2778R165J3025m51j8282P894n441k075o115
4753d889J667k2410q133K7044J5981j4788N130r481j6541R79O572J0066O296o000
4739h507n987J6181R636n623j1581N28J2678j8908k7389N217K5922J0685j2084
4726i232q773j6392q316J3978k356q989J9412L991j3896J2079K0007m152J666
4713i73k830Q115O099K0331J5244p228j2303j750J3262m929j4753k0042L743J872
$$ plain form
4804 -12577 7501 17847 24347 13373 -3957 -23596 -12713 8489 -3145 -18809 1358 7209
4792 7209 -3898 -6297 -3099 1188 12398 14658 2185 -24717 -35344 -47705 -51657 -65383 -64298
4779 -64298 -32075 -19037 -31963 -31047 -8192 4670 -13468 -28255 -39829 -52412 -48826 -32169
4767 -32169 -31013 -35355 -43204 -23622 -15387 -2609 6556 19581 19130 848 8742 3301 1226 -4889
4753 -4889 -3222 -25632 -33765 -6721 9260 -5528 -398 -9879 -26420 -25441 -18869 -8803 -2507 -8507
4739 -8507 -14494 1687 11323 5700 -5881 -5353 7325 -11583 -38972 -33755 -7833 2852 -9232
4726 -9232 -18005 -34397 -42713 -28735 -31091 -40080 -20668 -16677 -30573 -18494 1513 -2639 -973
4713 -973 -3803 4312 10411 30742 45986 38758 26455 24705 37967 33038 18285 -1757 1986 3858
4699C858k413m608K1099Q675j3469k8432k4948r925N065L1399J6543j4229o252
4686a7637Q273J8784K4823K347j8909j1461k63p439j4234Q571p32m38N557Q032
4672E274N031m530J468j8233k2621L320K2654J9313Q70J4604j2811p442J2412
4659A9309M474q35K488O485m361q819l860j5763L419K33L19j1055K343j6080k0690
4644d2393j3531J7315M758L2271J6778p132j1701k1043P510J8436J0784J1464
4632B3516n211l045k1684J3856O041j004j4024k175J2288j9684q037K5530J3850
4619B0217k011p614p354j2048q584j8336J6638K2562J3009M420k1637q658J1094
4606A698k552k429K114p217p418R416J6713J1209Q999j3319q680j4427p234j0582
$$ plain form
4699 3858 1445 -3163 17936 26611 13142 -15290 -40238 -50163 -45098 -13699 2844 -11385 -17637
4686 -17637 -9364 9420 34243 36590 17681 6220 5957 -1482 -15716 -7145 -7877 -8315 -2758 5274
4672 5274 10305 5775 7243 -10990 -33611 -30291 -7637 11676 12546 27150 14339 6897 19309
4659 19309 23783 22948 25436 31921 27560 18741 14881 -882 2537 2770 3089 -7966 -5623 -21703 -42393
4644 -42393 -55924 -38609 -33851 -1580 15198 8066 -3635 -24678 -17168 1268 12052 23516
4632 23516 18305 15260 -6424 7432 13473 12469 -1555 -3730 8558 -11126 -19163 6367 20217
4619 20217 18206 10592 3238 -8810 -17394 -35730 -19092 3470 16479 20899 -738 -9396 1698
4606 1698 -854 -3283 -1169 -8386 -15804 -6388 10325 21534 30533 17214 8534 -5893 -13127 -23709
4592b3709K0488K8068j4623k1939J0689p028l690k0856R553J2592K0315l392q386
4579a918N610L603j3344j0939l812N963J0451M323J1054L7531Q941q460j7665
$$ plain form
4592 -23709 -3221 24847 10224 -11715 -1026 -8054 -11744 -32600 -23047 -10455 9860 6468 -1918
4579 -1918 3692 7295 -6049 -16988 -20800 -14837 -4386 -63 10991 48522 57463 49003 31338
$$ [...]
##END NTUPLES=NMR SPECTRUM
##END=
