##TITLE=Analysis number 307445
Compound Code mo 00914
Project Code adrs
Chemist Name holme
##JCAMPDX= 6.0         $$ Bruker NMR JCAMP-DX V2.0
##DATA TYPE= NMR SPECTRUM
##DATA CLASS= NTUPLES
##ORIGIN= Bruker BioSpin GmbH
##OWNER= NMR
$$ XWIN-NMR		Version 3.5
$$ Tue May  3 14:38:06 2005 GMT Daylight Time (UT+1h)  MAYBRIDGE\NMR@NMR_250MHZ
##.OBSERVE FREQUENCY= 250.131544655141
##.OBSERVE NUCLEUS= ^1H
##.ACQUISITION MODE= SIMULTANEOUS (DQD)
##.ACQUISITION SCHEME= undefined
##.AVERAGES= 16
##.DIGITISER RES= 18
##SPECTROMETER/DATA SYSTEM= dpx250
##.PULSE SEQUENCE= zg30
##.SOLVENT NAME= CDCl3
##.SHIFT REFERENCE= (INTERNAL, CDCl3, 0, 16.522)
##AUDIT TRAIL= $$ (NUMBER, WHEN, WHO, WHERE, WHAT)
$$ ##TITLE= Audit trail, XWIN-NMR		Version 3.5
$$ ##JCAMPDX= 5.01
$$ ##ORIGIN= Bruker BioSpin GmbH
$$ ##OWNER= NMR
$$ C:\u/data/dgb/nmr/ADRS/2660/pdata/1/auditp.txt
$$ ##AUDIT TRAIL=  $$ (NUMBER, WHEN, WHO, WHERE, WHAT)
(   1,<2005-05-03 14:37:32.74 +100>,<MAYBRIDGE\NMR>,<NMR_250MHZ>,
      <created by zg, POWCHK disabled, PULCHK disabled
       configuration hash MD5:
       62 19 C7 07 E1 42 D1 B7 37 6C 3D D0 77 39 F9 E6
       data hash MD5: 64K
       14 84 1B D3 D6 BC 75 83 B4 01 0F B0 C3 EB 08 2F>)
(   2,<2005-05-03 14:37:45.84 +100>,<MAYBRIDGE\NMR>,<NMR_250MHZ>,
      <Start of raw data processing
       ef LB = 0.3 FT_mod = 6 PKNL = 1 SI = 32K 
       data hash MD5: 32K
       CE 5B 4A E3 2D 9B F6 54 C4 DD 42 51 1A 78 57 7E>)
(   3,<2005-05-03 14:37:51.34 +100>,<MAYBRIDGE\NMR>,<NMR_250MHZ>,
      <apk 
       data hash MD5: 32K
       D4 51 FA 09 B3 07 70 8C 1F 3F 95 50 33 07 5F CB>)
(   4,<2005-05-03 14:37:53.68 +100>,<MAYBRIDGE\NMR>,<NMR_250MHZ>,
      <abs ABSG = 5 
       data hash MD5: 32K
       2F 61 9C D3 38 5F 5F DF 39 2D D4 75 CB 64 E3 EA>)
$$ ##END=
$$ 
$$ hash MD5
$$ 5F BC A3 B2 72 9C 75 8E 95 7C 6D 6B ED CF C6 F8
##$RELAX= 
##$RELAX= 
##$RELAX= 
##$RELAX= 
##$RELAX= 
##$RELAX= 
##$RELAX= 
$$ Bruker specific parameters
$$ --------------------------
##$DU= <C:\u>
##$EXPNO= 2660
##$NAME= <ADRS>
##$PROCNO= 1
##$TYPE= <nmr>
##$USER= <dgb>
##$AMP= (0..31)
100 100 100 100 100 100 100 100 100 100 100 100 100 100 100 100 100 100 
100 100 100 100 100 100 100 100 100 100 100 100 100 100 
##$AQSEQ= 0
##$AQ_mod= 3
##$AUNM= <au_zg>
##$AUTOPOS= <31 >
##$BF1= 250.13
##$BF2= 250.13
##$BF3= 250.13
##$BF4= 250.13
##$BF5= 500.13
##$BF6= 500.13
##$BF7= 500.13
##$BF8= 500.13
##$BYTORDA= 1
##$CFDGTYP= 0
##$CFRGTYP= 5
##$CHEMSTR= <none>
##$CNST= (0..31)
1 1 145 1 1 1 1 1 1 1 1 1 1 1 1 1 1 1 1 1 1 1 1 1 1 1 1 1 1 1 1 1 
##$CPDPRG= <>
##$CPDPRG1= <>
##$CPDPRG2= <>
##$CPDPRG3= <>
##$CPDPRG4= <mlev>
##$CPDPRG5= <mlev>
##$CPDPRG6= <mlev>
##$CPDPRG7= <mlev>
##$CPDPRG8= <mlev>
##$CPDPRGB= <>
##$CPDPRGT= <>
##$D= (0..31)
0 1 0 0 0 0 0 0 0 0.06 0 0 0 0 0 0 0.0002 0 0 0 0 0 0 0 0 0 0 0 0 0 0 
0 
##$DATE= 1115127451
##$DBL= (0..7)
120 120 120 120 120 120 120 120 
##$DBP= (0..7)
150 150 150 150 150 150 150 150 
##$DBP07= 0
##$DBPNAM0= <>
##$DBPNAM1= <>
##$DBPNAM2= <>
$$ [...]
##$SUBNAM6= <"">
##$SUBNAM7= <"">
##$SUBNAM8= <"">
##$SUBNAM9= <"">
##$SW= 20.6930455092707
##$SWIBOX= (0..15)
0 0 3 0 0 0 0 0 0 0 0 0 0 0 0 0 
##$SW_h= 5175.983436853
##$TD= 65536
##$TD0= 1
##$TE= 295.16
##$TE2= 300
##$TE3= 300
##$TEG= 300
##$TL= (0..7)
0 120 120 120 120 120 120 120 
##$TP= (0..7)
150 150 150 150 150 150 150 150 
##$TP07= 0
##$TPNAME0= <>
##$TPNAME1= <>
##$TPNAME2= <>
##$TPNAME3= <>
##$TPNAME4= <>
##$TPNAME5= <>
##$TPNAME6= <>
##$TPNAME7= <>
##$TPOAL= (0..7)
0.5 0.5 0.5 0.5 0.5 0.5 0.5 0.5 
##$TPOFFS= (0..7)
0 0 0 0 0 0 0 0 
##$TUNHIN= 0
##$TUNHOUT= 0
##$TUNXOUT= 0
##$USERA1= <user>
##$USERA2= <user>
##$USERA3= <user>
##$USERA4= <user>
##$USERA5= <user>
##$V9= 5
##$VALIST= <valist>
##$VCLIST= <CCCCCCCCCCCCCCC>
##$VD= 0
##$VDLIST= <DDDDDDDDDDDDDDD>
##$VPLIST= <PPPPPPPPPPPPPPP>
##$VTLIST= <TTTTTTTTTTTTTTT>
##$WBST= 1024
##$WBSW= 4
##$XGAIN= (0..3)
0 0 0 0 
##$XL= 0
##$YL= 0
##$YMAX_a= 489462
##$YMIN_a= -405693
##$ZGOPTNS= <>
##$ZL1= 120
##$ZL2= 120
##$ZL3= 120
##$ZL4= 120
##$ABSF1= 16.522
##$ABSF2= -4.171173
##$ABSG= 5
##$ABSL= 3
##$ALPHA= 0
##$AQORDER= 0
##$ASSFAC= 0
##$ASSFACI= 0
##$ASSFACX= 0
##$ASSWID= 0
##$AUNMP= <proc_1d>
##$AZFE= 0.1
##$AZFW= 0.1
##$BCFW= 0
##$BC_mod= 0
##$BYTORDP= 0
##$COROFFS= 0
##$CY= 12.5
##$DATMOD= 1
##$DC= 0
##$DFILT= <>
##$DTYPP= 0
##$F1P= 14.0000005364418
##$F2P= -0.99999901652339
##$FCOR= 0.5
##$FTSIZE= 32768
##$FT_mod= 6
##$GAMMA= 0
##$GB= 0
##$INTBC= 1
##$INTSCL= 1
##$ISEN= 128
##$LB= 0.3
##$LEV0= 0
##$LPBIN= 0
##$MAXI= 10000
##$MC2= 0
##$MEAN= 0
##$ME_mod= 0
##$MI= 0
##$NCOEF= 0
##$NC_proc= -3
##$NLEV= 6
##$NOISF1= 0
##$NOISF2= 0
##$NSP= 0
##$NTH_PI= 0
##$NZP= 0
##$OFFSET= 16.522
##$PC= 1
##$PHC0= 131.4465
##$PHC1= 5.85546
##$PH_mod= 1
##$PKNL= yes
##$PPARMOD= 0
##$PSCAL= 4
##$PSIGN= 0
##$REVERSE= no
##$SF= 250.13
##$SI= 32768
##$SIGF1= 0
##$SIGF2= 0
##$SINO= 400
##$SIOLD= 32768
##$SREGLST= <1H.CDCl3>
##$SSB= 0
##$STSI= 32768
##$STSR= 0
##$SW_p= 5175.98343685301
##$SYMM= 0
##$S_DEV= 0
##$TDeff= 65536
##$TDoff= 0
##$TI= <Analysis number 999999
Compound Code 99
Book Reference 9
Project Code 9>
##$TILT= no
##$TM1= 0
##$TM2= 0
##$TOPLEV= 0
##$USERP1= <user>
##$USERP2= <user>
##$USERP3= <user>
##$USERP4= <user>
##$USERP5= <user>
##$WDW= 1
##$XDIM= 32768
##$YMAX_p= 445702113
##$YMIN_p= -68178
$$ End of Bruker specific parameters
$$ ---------------------------------
##NTUPLES= NMR SPECTRUM
##VAR_NAME=  FREQUENCY,     SPECTRUM/REAL,   SPECTRUM/IMAG
##SYMBOL=    X,             R,               I
##VAR_TYPE=  INDEPENDENT,   DEPENDENT,       DEPENDENT
##VAR_FORM=  AFFN,          ASDF,            ASDF
##VAR_DIM=   32768,         32768,           32768
##UNITS=     HZ,            ARBITRARY UNITS, ARBITRARY UNITS
##FACTOR=    0.157963299565203, 1,           1
##FIRST=     4132.6476996994, 0,             0
##LAST=      -1043.33573715361, 0,           0
##MIN=       -1043.33573715361, -68178,      0
##MAX=       4132.6476996994, 445702113,     0
$$ Real data points
##PAGE= N=1
##DATA TABLE= (X++(R..R)), XYDATA
$$ [...]
17144d36K318K450K200J098o089j45R79p72m970m112M991l61j997K516P411L711
17128H792j724j353l130k361m424L227M918o273j278P67J868J091K8j620O67p71
17112a576k210K999J755J766m662n132P03M849K367k66j618k986k764N126K934
17097A285K61N486L94m152m565j480Q69J249J993j040l572l177K076K418N061
17082C106k36o21M839J865J72k018O82Q89m827n208q80j924J735K353L319J115
17066D361j225m8L42J766n62J513R44j050l398k864J52k708L67R12k991k981K714
17049d756N543k59p87j248M515L532m360m78J366o23m418J536N116K99k073n734
17033b829o604l381J083L714K617K239R56J452M922k42k7M470L44m171J668O095
$$ y = [-436, 1882, 4332, 6532, 7630, 1541, 1396, 2375, 1603, -3367, -7479, -2488, -2849, -4846, -2330, 5081, 8792, 7068, 5715, 2585, 224, -4200, -973, 3945, -2328, -3606, -2839, -971, 120, 148, -1472, -805, -1576, -3786, -787, 968, 2734, -1928, -7060, -6357, -1508, 859, 593, -1025, -4011, -6775, -1649, 1285, 1546, 7032, 7426, 3274, -1291, -2771, -1902, -653, 1340, 300, -3272, -6449, -4373, -1955, 3106, 2870, 2249, 7088, 8953, 9125, 7107, 7789, 8678, 3851, -1357, -2237, -4161, -2426, -73, 3246, 4361, 3136, 3088, 3430, 5196, 4634, 6147, 7091, 6041, 2643, -221, -69, -2777, -2410, -1498, -4489, -7470, -4756, 787, 528, -259, -1507, 3008, 6540, 2180, 1702, 3068, 2445, -1973, -437, 4679, 4978, 2905, -2829, -9433, -12814, -11731, -8017, -5400, -3161, -2205, -753, 4169, 3927, 3900, 8370, 8714, 4543, 6211, 12306]
17017A2306m412n480k487k707L494q83n96r20M215l472m494O310L769l339k0k074
17001g90R53k622%l91j787m406J586M604J573K317l394j708O040O595o89k167
16985E714k943n052k34J632k155M29L063J107M57p710n557O097N863K606k046
16970A271o869J99J911J409k056K712k950m906p7L213m73l143K109l255j678L925
16954h658k56L11L118K68j04L010K776k587m378K09r41j98L974p17J272n54Q81
16937b574P300N261n191k431l077m236K530K542R69j255k731J941n0j084k120
16922d206j200K382L950p22P29j99j193J372L952J137o564q121m61O640J784l518
16906d238K255J405j005j939K017K675o25j949k477l83Q14k048j749j87N667k669
$$ y = [12306, 7894, 2414, -73, -2780, 714, -169, -765, -1685, 2530, -942, -5436, 874, 4643, 1304, 1284, -790, 163, -2459, -2459, -2850, -4637, -9043, -7457, -2853, -1280, 1037, -2357, -4065, 1975, 8570, 7881, 5714, 2771, -2281, -2515, -883, -3038, -2609, 454, 1561, 2018, -5692, -11249, -5152, 711, 3317, 1271, -5598, -5399, -3488, -2079, -4135, -1423, -4373, -9279, -9356, -6143, -6616, -9759, -7650, -10905, -12583, -8658, -8914, -8603, -5485, -5217, -5321, -2311, 465, -2122, -6500, -6291, -7232, -7430, -3456, -4173, -2901, -3455, -2574, 4726, 9987, 4796, 2365, -712, -4948, -2418, 124, 1093, -162, -2893, -952, -1002, -2086, -4206, -5406, -3024, 926, 204, 933, 734, -459, 913, 4865, 6002, -562, -8683, -9144, -2504, -720, -4238, -1983, -578, -1583, -3522, -1505, 1170, 545, -1404, -3881, -4264, -3450, -5498, -7247, -7434, -1767, -4436]
16890d436j693j547J660j33M661J554j130m70J30k354l5K02K322L534j750K46
16874G61k148l249%N531L687k504k141m070k641L848M080K759l67q88J324m801
16858h19m247M15K078J908J131L051j62k948P64R00m00M722N90o28o299n515q80
16841f339M610L708l02l188M574J261K92n164o202J272Q03L313L223M833K390
16826I084J540K899l536o136j907k86k873k992o70k006J040K128k397N067M93
16811e52k52N36k869Q45q78P08M31J169K089k74J899J776j120o831j382j170J713
16794d162k417k772J626M099K379k173K015J757r49O255L822o102l504l340J552
16779a914J71L38l200P52L757J696l772o62J65N155N443n73l494m959k490j521
$$ y = [-4436, -6129, -7676, -6016, -6149, -1488, 66, -1064, -1534, -1404, -3758, -3793, -3591, -1269, 2265, 515, 761, -1387, -4636, -4636, 895, 4582, 2078, -63, -4133, -6774, -2926, 1154, 3913, 3546, 2658, 3982, -819, -5066, -4651, -2573, -665, 466, 3517, 3355, 407, 1171, 2071, 1671, 6393, 6983, 6355, 56, -5459, -6339, -1729, 1979, 1677, -1511, 3063, 4324, 4616, -548, -6750, -5478, -4675, -1362, 1861, 6694, 9084, 10624, 13523, 9987, 3851, 1944, 1658, -1215, -4207, -4877, -6883, -5843, -3715, -6112, -1045, -552, -804, -268, -3137, -2292, -3170, -2462, -2031, -862, 1227, 953, 2852, 4628, 3508, -3323, -4705, -5875, -4162, -6579, -9351, -7725, -3626, -1247, -3420, -1405, 352, -597, 5658, 9480, 3378, -126, -3466, -1914, -1743, -1405, -4605, -3853, -96, 1600, -2172, -2834, -2669, 2486, 7929, 7356, 3862, -1097, -3587, -5108]
16763e108k292J364j20o17n88m44r5J722k572O60Q603K282k015k32j282k986L242
16746d78M222J389j414O85K769J575J36l731p403j972l506L114r84q78N8K835
16730c583K422K451N189o620k70r9k246j452M00j748J715L424k141K236K497K031
16714D206k215k398k818r19k519l617L409N127K592r84L295J84m934N59J075k555
16698b512n905j107M482J506j296K467J548q48M211l105n504n531j920K768K910
16683g836l97L544L42L232P30m018j905N16K246n93R81k122K027k933K473K829
16667h84k57n57k475L45J654n84J486L447O4m921l600j035k361L475J750j167
16651e620j292J980M825k993q73j36k103L69J34j265L743l58L291Q79l850k335
$$ y = [-5108, -7400, -6036, -6156, -6773, -7361, -7805, -7900, -6178, -8750, -8090, 513, 2795, 780, 548, -734, -3720, -478, 3744, 5133, 3719, 4404, 7173, 8748, 8884, 5153, -2250, -4222, -7728, -4614, -5598, -6476, -6418, -3583, -1161, 1290, 6479, -141, -411, -510, -2756, -4208, -3808, -5556, -3841, -417, -2558, -322, 2175, 4206, 1991, -407, -3225, -4144, -6663, -10280, -6871, -1744, 848, -136, 3159, 3343, -1591, -1032, 43, -2512, -8417, -9524, -5042, -3536, -4832, -2365, -817, -1665, 2546, -559, -6063, -11594, -13514, -10746, -7836, -8233, -4689, -4347, -1115, -385, -4403, -6308, -5792, -3546, -4139, -3158, -5280, -3253, -6186, -3713, -884, -1141, -1698, -4173, -3828, -2174, -2758, -1272, 2175, 2239, -2682, -6282, -7317, -9678, -6203, -4453, -5620, -6912, -4932, -107, -3100, -3973, -4109, -6212, -5843, -5709, -6974, -3231, -3589, -298, 581, -3269, -5604]
16635e604J93K795L702J048j876r61L841l438p51j499J395N62k301L765J04p78
16619A97K041k772j551q57j511j142N464J138n07K90p34m936J820N98m63r55j716
16602e596J03j687K588K444J824j368m978L443N454K819k732o160k094O87L347
16587a906n378J664o5p66L235K417m005l201l531Q64L250K664L153j452k112L875
16571a294L5l625n29M490J764K318j990r071k474J936l865j097R054O787r29k449
16555i39J9p92j421j572K875J73p495J272K573M233J038J012l532n228K361K24
16539e199j857k671M70P493K396l456m241l563L224J717J28L092N59K140n2m716
16523d536j468P174O413p186p310k568r02j379k674L913O389j253l975k572K357
$$ y = [-5604, -5411, -2616, 1086, 2134, 258, -703, 3138, -300, -1051, -2550, -1155, -593, -2894, 871, 975, 197, 2238, -534, -2085, -2942, -4453, -5595, -131, 1007, 500, 790, 56, -4880, -3060, -2462, -2925, -3880, -5596, -5493, -7180, -4592, -2148, -324, -1692, -6670, -3227, 2227, 5046, 2314, -3846, -5940, -5253, -1906, -7284, -5620, -5685, -6451, -3216, -799, -4804, -8005, -11536, -10672, -7422, -4758, -1605, -3057, -5169, -1294, -1259, -4884, -5413, -923, 841, 3159, 1169, -7902, -10376, -8440, -12305, -13402, -4348, 2439, 1510, -939, -920, -1712, -3133, -4705, -1830, -1657, -9152, -7880, -5307, -1074, -36, 976, -2556, -7784, -5423, -5199, -7056, -9727, -9257, -1764, 632, -2824, -7065, -10628, -7404, -5687, -5559, -2467, -1908, 232, 180, -4536, -6004, 1170, 7583, 397, -6913, -9481, -10383, -11762, -14436, -10523, -4134, -5387, -9362, -11934, -9577]
16508i577K731M269L496k69j973j552m52o23Q71N53j063k993n186L637Q302K116
16492B287j329J862m74m657K13Jk070j712m45L223L086J9j363K39k167j676J476
16475c487j275N69m299k470K465N637N54K974r1J746M884n244n117j760j233l06
16459f453j656j198K084L711q77J613J341o040j322M849N650j889p12J773j039
16444a65k708q10L865P49j738K30k846m355M547K658l020K090N47j350m830n115
16428a2251L498K336j442K691K726j891P40r62n85L670m79j664k159L196K160
16413d16n579n62N197M239L035k146l939J543K142J532L255l76m485m249O334
16398E525k1j202k019K250m741l36l8K454p87k743l038k697K06L598N75L167K50
$$ y = [-9577, -6846, -2577, 919, 650, -1323, -2875, -3327, -3950, -3079, -2526, -3589, -6582, -11768, -8131, 171, 2287, 958, 2820, 2346, -2311, -2098, -2097, -4167, -5879, -6324, -3101, -15, 4, -1359, -1120, -3287, -4963, -3487, -4762, -4193, -8492, -10962, -8497, -2860, -2306, 668, 577, 2323, 7207, 1963, -3154, -4914, -6147, -6453, -8109, -9307, -7223, -3512, -4389, -2776, -1435, -7475, -8797, -3948, 1702, -187, -899, 874, -165, -2873, -3683, 182, 931, -807, -577, -3423, -7778, -3231, -573, -3593, -1503, -956, -2306, -7136, -12251, -8753, -6417, -7859, -5168, -2442, -4333, -3593, -4555, -5140, -1470, -1949, -3613, -5772, -2576, -416, -5995, -6557, -1360, 2879, 5914, 3768, -171, 1372, 3514, 5046, 8301, 7925, 3440, -809, 5525, 5504, 4302, 2283, 4533, -208, -544, -582, 1872, 1085, -1658, -4696, -7393, -7187, -3589, -3014, 153, 403]
16381D03m270n042r90L972L538k56l915L220J744J475M610J687n024J502l290
16366f36j128j268j19N640L86P39m550m140K882L216K081k516l781p524L244O82
16350f792J251j063K117J752j040k592k025J807q67J707M578k159q40k011J277
16335d900L973j341n307J199K65Q08M322M38N754J56r38l805l479k845K273K280
16319a147l629o297O36K565M487r48l004N308P44O01l4m013r87Q38j256L069L851
16302G84M221q96Q47m857J491n33l159j273J834K527J349M828p95m105n71J269
16286B961O83p233p970m25J773K330N45M518O816M18l979q434k507j270k215K406
16270a1583L732N000R81l327n36N46J831o67K80n185L12k345K935M674K802M099
$$ y = [403, -3867, -8909, -9899, -5927, -2389, -2645, -6560, -3340, -1596, -121, 4489, 6176, 1152, 2654, -636, -1764, -3032, -3151, 2489, 2875, 3614, -936, -5076, -2194, 1022, 3103, 587, -3194, -10718, -7474, -6792, -5541, -6604, -4487, -2735, -3775, -6367, -8392, -6585, -7452, -5745, -1167, -3326, -4166, -6177, -4900, -927, -2268, -7575, -6376, -6111, -5303, -981, -543, 5211, 5367, 4429, 624, -2855, -5700, -3427, -1147, -4776, -11073, -10437, -7872, -3385, -4333, -7337, -2029, -1285, -684, -718, -4731, -5718, -4880, -6136, -3067, 784, 5005, 4109, 4956, 99, 1590, 1057, -2102, -3375, -1541, 986, 2335, 7163, 6368, 2263, 1692, 2961, 3644, -3589, -11559, -11984, -10211, -7881, -7336, -2818, 3998, 4416, 437, -7997, -10504, -11774, -13989, -11583, -7851, -2851, -1870, -5197, -5733, -5187, -3356, -4023, -3743, -8928, -8616, -10961, -8026, -3352, -550, 3549]
16254C549l080n126l14p26J208p22p72J137l261m407L987r9o30J100l01K618J964
16237c875J932m4k52K353N501j787l238P61j635o040r81K72l279N62K495K910
16221d345L161L038n736k773K128J961J061n819m241j334M686J064R49L062J32
16206c006k183J5K143k646l929l146l27j532N385N533O68n601j95j94j972j046
16190a2033j302L275M178K281m58m779l306K424P43L588N319K68Q12L637L69k453
16174B563k707K714K659l759l375j555N104L838O48r6L550K119m722l931J148
16159D198l665r8L51k983m377l764J839k622K817K951K611k34k444L833N69J579
16143E61J845k219p084k605N194J284L303k510r69L794L730j859m035o774K104
$$ y = [3549, 469, -4657, -4971, -5697, -4489, -5211, -5983, -4846, -8107, -12514, -8527, -8626, -9256, -8156, -8457, -5839, -3875, -1943, -1987, -2239, 114, 5615, 3828, 590, 1351, -284, -6324, -7305, -7033, -10312, -9750, -7255, -4345, -1184, 1854, -3882, -6655, -4527, -2566, -1505, -7324, -11565, -12899, -8213, -7149, -6200, -3138, -3006, -5189, -5174, -3031, -5677, -9606, -12752, -13079, -14611, -9226, -3693, -3025, -8626, -8821, -9015, -10987, -12033, -13335, -10060, -5882, -3601, -4059, -8838, -12144, -9720, -8977, -5389, -70, 198, 1010, 4647, 5016, 2563, -144, 2570, 5229, 1470, -1905, -3460, 1644, 5482, 6130, 6034, 9584, 11703, 6981, 3050, 4198, 533, 435, 786, -2197, -6574, -10338, -8499, -11121, -8304, -5353, -2742, -2976, -5420, -1587, -1018, 561, 2406, 187, -6897, -9502, -4308, -3024, 279, -2231, -3200, 594, 4324, 2465, -1570, -8344, -6240]
16128f240J68o31k626l289K676M287N11m664k70k401M029P420K76j629M09l763
16112e737K343J693m441j545N373L867m451n046L086L215l204L916K248j043j395
16097a121k225l668J440N248L44K282K107k955n665K955J761k126L664K08o800
16082d551j368j730N861M156J022m470k05j170l050K113J102R5p10l79K147l639
16066d776M65J539M755L773l968j902k227k296K867K398J309O502K857m364o007
16051I25k98l198k354L506j460p406L51N774J844l635l853K082K233j518J324
16036e683J662k11J626N482O66o714N26l202L984L549m324K772k287k441n706
16021a0301o627N212N739L409k46K62n79r39l095J863J946j87L128M877Q14j264
$$ y = [-6240, -6072, -6703, -9329, -12618, -9942, -5655, -5144, -9808, -10078, -12479, -8450, -1030, -754, -2383, -1974, -5737, -3394, -1701, -6142, -7687, -2314, 1553, -2898, -7944, -4858, -1643, -4847, -931, 1317, 274, -1121, -3346, -7014, -5574, -326, 18, 2300, 4407, 1452, -4213, -1258, 503, -1623, 2041, 2249, -4551, -5919, -7649, -1788, 2368, 3390, -1080, -1285, -2455, -5505, -3392, -2290, -2195, -2905, -3284, -1137, -4776, -4311, -2772, 1983, 5756, 1788, -114, -2341, -4637, -1770, 628, 1937, 8439, 11296, 6932, 925, 627, -2571, -4925, -1419, -2879, -10285, -9934, -4160, -2316, -5951, -9804, -7722, -5489, -7007, -5683, -4021, -4232, -2606, 2876, 3542, -3172, -2646, -5848, -1864, 1685, -2639, 133, -2154, -4595, -10301, -16928, -11716, -5977, -2568, -2814, -2552, -3131, -4070, -7165, -5302, -3356, -3543, -415, 4462, 5276, 4012]
16005D012m836r34m77J638P86m162l87j592L910K539N5l80l152K41L415M446K715
15988G837l690n216l384R0M71m98p63Q43P99j75K375k306j059k51O64j653k781
15971h697O82K487M228K089l833j213j990k517M139K812k981p57N53K748L307
15956A057l00l037j492k92M07K765L246O07l775m901q01K238L907N68k094k504
15940d401J067J78j653J446n71q780k523J328k87M885K822L041J603r44n09o50
15924c948L383J368j010l055l437n476l762R40O312K142K205l398m783k128N014
15909i633O687m27m002k537N102L850l670K105L201L371J993J427n82l230k04
15894C451j955k01j80j421j998J135r01r59R69N80j581K851L450L38q37J765J339
$$ y = [4012, -824, -1758, -2235, -597, 189, -3973, -4360, -5952, -2042, 497, 552, 172, -2980, -2739, 676, 5122, 7837, 4147, -1069, -4453, -4363, -3892, -4390, -5153, -4310, -3511, -3686, -1311, -3617, -4676, -4927, -4263, -5916, -8697, -8015, -5528, -1300, 789, -3044, -4257, -6247, -8764, -4625, -1813, -4794, -5551, -4998, -2250, 1057, 757, -2280, -3772, -4064, -3657, -892, 2354, 2961, -814, -5715, -6516, -4278, -371, 197, -1897, -4401, -3334, -3156, -4809, -3363, -3934, -12714, -15237, -13909, -14196, -9311, -6489, -3448, -1845, -2789, -3298, -3948, -565, 803, -207, -3262, -6699, -12175, -15937, -14997, -8685, -6543, -4338, -7736, -12519, -14647, -9633, -2946, -3373, -7375, -9912, -4810, -960, -4630, -2525, 676, 4047, 6040, 7467, 6885, 3655, 3451, 1496, 1295, 1115, -306, -2304, -1169, -2070, -3029, -2060, -1480, -3061, -210, 3240, 3578, 2741, 4506, 5845]
15877E845R77n056p373k064N114K658L75J314k633k89m11L769j874M68J995p25
15861B090j880k936l685L251M39k719K674j358n366k623K839L300M552M364L936
15846F878J107p957j0218J04P672j669J841R56m389K81M46Q41q18j652J29k793
15830i241M581K25p355K27L467J997K119K299M87P12L9l825k232L987l016q598
15814a4127j580K123J374M250N712J457L449n286j611K130j946l492j103J274
15800g376q40K87L704L948M876k145n328p763j113K022K37P433K612j899m721
15785f066j071L025Q59P16j568p84j354J305l82M712k023l802m170K891Q92j135
15769g955j861J303K140K377J0R88L221L78P50j33k534n009R95N997O88l980l283
$$ y = [5845, 6822, 1766, -5607, -7671, -2557, 101, 476, 1790, -843, -1132, -1543, 2226, 352, 820, 2815, 2090, 210, -2726, -6411, -3160, -2721, -5440, -2766, -4124, -9490, -12113, -9274, -5974, -1422, 2942, 6878, 7985, 28, -10190, -10086, -2414, -4083, -2242, -1286, -5675, -5394, -4948, -4107, -4925, -6577, -6448, -9241, -4660, -4435, -11790, -11563, -8096, -6099, -3980, -1681, -1194, -482, -443, -4268, -6500, -2513, -5529, -14127, -15707, -13584, -12210, -7960, -2248, -791, 2658, -2628, -4239, -2109, -4055, -7547, -8650, -7376, -8216, -7929, -4225, -277, 4599, 2454, -2874, -10637, -11750, -9728, -9491, -2058, 554, -1345, -6066, -7137, -4112, -3253, -2537, -4105, -4889, -6243, -4938, -5320, -608, -2631, -6433, -10603, -7712, -6820, -7955, -9816, -8513, -6373, -3996, -3986, -2998, 223, 601, 1351, 1218, -1316, -6325, -5330, 667, 1355, -2625, -5908]
15752e908K600J884j200m632o264J65K820L147m990n452L036O611K739J189j078
15737e333m05L120j437k970j69P07K51o05r54o007n40J086J221M783L532L121
15721e99J497O43k88Q09J556n265J82J446o24p70L296j280l908m393J915J109
15705d674N2P01j508N007L350o339m996p43l88L058N345k390k116K737L039N926
15689F061K690l45o72J453j084k600j449K7k257k234o9m644l416J644J358k184
15673g721J690o74K150M210m73o38K80k849j639J963Q62m514m560R33N637L240
15657b103P74l192J383L420n93m038n090J861K718J959n58K941K250l37k246R8
15641g53J56p49j449j65N24N87j999m310M203J407J788N343l276m463j624k511
$$ y = [-5908, -3308, -1424, -2624, -7256, -13520, -13355, -10535, -7388, -12378, -17830, -14794, -8183, -5444, -4255, -5333, -5738, -2618, -4055, -7025, -7194, -6487, -6236, -6841, -7795, -13802, -14342, -13256, -12035, -7252, -3720, -599, 898, 1541, 1253, 2062, 3618, -1647, -1465, -19, -643, -1413, 1883, 603, -3305, -7698, -5783, -4674, -4622, -3921, -5429, -422, 2928, -3411, -8407, -9150, -9538, -6480, -1135, -3525, -5641, -2904, 135, 6061, 8751, 8406, 7734, 9187, 8103, 5503, 4054, 4081, 1824, -410, -479, -5123, -8539, -6895, -5537, -7721, -6031, -6705, -4555, -345, -818, -1456, -1176, -4025, -5664, -3701, -2839, -7353, -11913, -10980, -5343, -2103, -1329, -4521, -3138, 282, -311, -4349, -9439, -7578, -4860, -2901, -3459, -518, 1732, 1395, -851, -753, -597, -1346, -2795, -2960, -2436, -1849, -3848, -8158, -3955, -2548, -760, 4583, 1307, -3156, -4780, -7291]
15625g291r64O52M57J358k905K873J650m444n215K914m912K708O204K286k305
15610f934J359q34J779M023n32k096r25n06l378M78M36J229N737M652j2j808m557
15593a889k303l901M18l04K294L348P467k897m941l080L453K277k043l034o79
15578e814J485o806q52j97K406n53j133K470K6l545O92l908l19J920M778K564
15562f786N546k132j015M176K96k290O76K543J221l156L36J393J852K044j130
15547C574o322M6J242j658j245P63N39k123R68K942n65q06L36Q53N06P87J95l29
15529b97K080R8k143J021K221l849j134k182K707J621J595J351R93p416j292j068
15513e694n309j869L946M919L150J166l836j222j002j227J313J599K207N562K53
$$ y = [-7291, -8255, -7603, -7146, -5788, -8693, -5820, -4170, -8614, -13829, -10915, -15827, -13119, -6915, -4629, -6934, -5575, -6409, -4630, -607, -1139, -3235, -4160, -4666, -8044, -7566, -7130, -5901, -164, 4488, 4476, 2668, -1889, -4192, -8093, -7675, -7979, -5685, -2337, 5130, 2233, -2708, -5788, -2335, -58, -2101, -5135, -5814, -4329, -11135, -11987, -12184, -9778, -10331, -11464, -8994, -8968, -12513, -11821, -15729, -16048, -14128, -9350, -6786, -1240, -3372, -4387, -211, 85, -2205, -1529, 1014, 2235, -921, -585, 808, 2660, 4704, 3574, -2748, -2702, -1460, -3118, -4363, -3600, -3061, -5184, -4216, -1274, -1839, -2645, -2309, -1456, -950, -163, 32, -297, 1783, 1881, -262, 759, 2980, -869, -2003, -4185, -1478, 143, 1738, 3089, 4082, -3334, -4626, -5694, -11003, -12872, -8926, -4007, -857, 309, -3527, -4749, -5751, -6978, -5665, -4066, -1859, 3703, 3956]
15498C956l177k477o1j542n168Q42L698j731n282J023O139M281o5m640J467j298
15482d035o74K119j597O03L419K998n931l341J003Q94j514K661m757r82O106l37
15466c365l449Q23K115K826P298o78l756j621j019M658K699m630j152p94m718
15451d763m772j751L851j232J757k497r1N600K890k34j024k890J335j494k726
15436h041K927Q41q33K11k891l971L976P069j989j180K124P54m267J173L967o201
15420f331k728O077J682k395o887j368j951M442N196M785P84l190q56p358K7M209
15404e862K758L49r66l617L327O229n738r264K025P758k691j562k760l199K467
15389a0746M778J960k298l41J502j731l146M25k017N148O176r7l155j161L146
$$ y = [3956, 779, -1698, -1759, -3301, -8469, -7627, -3929, -5660, -10942, -9919, -3780, 501, 436, -4204, -2737, -4035, -4709, -2590, -4187, -3584, -165, 2833, -3098, -6439, -5436, -4542, -6056, -3395, -8152, -9134, -3028, -3365, -6814, -5991, -3876, -1050, 6248, 5570, 1814, 193, -826, 3832, 6531, 1901, 749, -45, -4763, -9535, -11286, -7435, -8667, -6910, -9407, -9498, -3898, -1008, -1242, -2266, -5156, -3821, -5315, -8041, -5114, -4273, -5106, -4895, -7786, -11757, -7781, -712, -2701, -3881, -1757, -1003, -5270, -4097, -130, -6331, -9059, -2982, -1300, -3695, -10582, -11950, -13901, -9459, -4263, 522, 1306, -1884, -2740, -10098, -10071, -5862, -3104, -2755, -3721, -7338, -4011, 2218, -3520, -12784, -10759, -3001, -5692, -7254, -10014, -13213, -10746, -5968, -4008, -6306, -6647, -5145, -6876, -10022, -9597, -11614, -6466, -290, -387, -3542, -4703, -1557]
15374a557r60K663m076J79M65k180k131L031R85P36j805J938m861m930K383M737
15358e383L949M197p24j474j840j644L948j48l503l424q37j958N23j305j422L366
15342g679M066Q48L24k576j216L421M499J073k381j904l691K691R91j060K688
15327I4J153N42N172k333k774l123m086K053K541K602P61k400k589O26K967J684
15311B890k691p161m366K8L03M729K837M183Q424R66n010n176o710M96L332O055
15295C129j601m089p98k003K49M534k480l394K506O489J641l159k054j957J906
15280a081K805j030L16j138r32k939N20j713j812K550o61k615j85M916K293M709
15264D003Q91j006j426m477r3J755r96M438n415j982L621J930j740k618n98k257
$$ y = [-1557, -2517, 146, -3930, -3751, -3286, -5466, -7597, -4566, -3581, -2845, -4650, -2712, -7573, -12503, -10120, -5383, -1434, 2763, 2039, 565, -1275, -2919, 1029, 881, -2622, -6046, -6883, -8841, -8318, -9623, -11045, -7679, -3613, -2765, -2441, -5017, -6233, -2812, 1687, 2760, 379, -1525, -5216, -2525, -1534, -2594, 94, 1247, 1789, 6961, 4628, 1854, -1269, -5355, -3302, -761, 1841, 2602, 202, -2387, -1761, 1206, 2890, 199, -6962, -11328, -11300, -10997, -6268, -3431, 752, 9176, 10142, 5132, -44, -6754, -6258, -2926, 3129, 1528, -2561, -3359, -5362, -5113, -579, -3059, -6453, -3947, 2542, 4183, 1024, -1030, -2987, -1081, 1724, 694, 1010, -128, -1060, -3999, -3479, -5192, -7004, -4454, -5115, -7730, -7915, -2999, -706, 4003, 4894, 3888, 2462, -2015, -2108, -353, -1349, 3089, -2326, -4308, -687, 1243, -497, -3115, -3713, -5970]
15248e970l079J096K917o72j151J30l667p0j294J862J865J961j236k351O288N131
15232A760N98j496j332L79n171L534L197j896j717Q79l266o597o310j145L334
15217a5249J698J219O556K533k929j577j114K191j522K808l629k273J338K799
15203g151O184K426P65j94j737J006l11j927L292N84l850j187O105M96n553j894
15187b946j444J241M32Q23j256k404j99J086j82K103j667k171k107O444L510o169
15171d906j482L499N23l353n66J664K656L411K939j691k063l031K372k14j291
15156a533k584l204j236J403M765r38o320k700N27J652l86K925O615J911m597
15141c700j688K478J045J65j207l354m318L007J849k511M530m257k539L419L445
$$ y = [-5970, -9049, -7953, -5036, -5708, -6859, -6729, -10396, -10466, -11760, -9898, -8033, -6072, -7308, -9659, -3371, 1760, 2358, 862, -470, -91, -5262, -1728, 1469, -427, -2144, -1265, -4531, -11128, -17438, -18583, -15249, -13551, -12332, -5776, -3243, -6172, -7749, -8863, -6672, -8194, -5386, -9015, -11288, -9950, -7151, -967, 1459, 2224, 2030, 293, 1299, 988, -939, 2353, 2937, -913, -2100, 4005, 4501, -1052, -2946, -4390, -3149, -2717, -1894, -3150, -5554, -5753, -4667, -4849, -2746, -4413, -6584, -8691, -2247, 1263, -4906, -6388, -2889, -2366, -5719, -6285, -4621, -1965, 1446, 4385, 2694, 631, -2400, -28, -242, -1533, -4117, -7321, -8557, -7154, -2389, -3327, -9647, -12347, -11820, -10168, -10554, -7629, -1014, 897, -3700, -5388, -2910, -1865, -1700, -2907, -6261, -10579, -7572, -5723, -8234, -3704, -7961, -10500, -7081, -3636]
15126c636M080K798o517q046J203L981M47k779m472m38o91K781K631O125p73p91
15110d097M40j363q914R23N431J268n7Q88K372k643K92N245J36n192Q27K071O26
15093a747O48j460m20J860m663j154j764l384K03J019l019j022J167M985P148
15078a603m019q021k745K647M536k205j326J604N806J91j876J796N226K179j516
15063F74m050J70Q35k327m827m218j020O926K064n527J515L317K287k344L85P84
15047e356N99n73j677M80P56j543n97K993m349l046J421P894J670Q94q0P57j160
15030i17K07m63m659k208J8J31k433k665k298J125L362N350L462j36j143m773
15014h040J184K357j301M60m52k736p16K162K34P28n207j016L280K278j793l063
$$ y = [-3636, 444, 3242, -3275, -11321, -10118, -6137, -5690, -8469, -12941, -13379, -14070, -11289, -8658, -2533, -3306, -4097, -3657, -5020, -13934, -13011, -7580, -6312, -6369, -5481, -3109, -5752, -5460, -215, -79, -5271, -4444, -2373, -1747, -1099, -2559, -2979, -1119, -5782, -6936, -8700, -12084, -11881, -10862, -13881, -14903, -13736, -8751, -1603, -5622, -13643, -16388, -13741, -9205, -11410, -12736, -11132, -5326, -5135, -7011, -5215, 11, 2190, 674, -3376, -3206, -2371, -4698, -9525, -13743, -14763, -7837, -5773, -11300, -9785, -6468, -4181, -6525, -6140, -5356, -4757, -5330, -7007, -6527, -5771, -7314, -7911, -4918, -9267, -12313, -10892, -2998, -1328, -434, -514, 243, -917, -710, -1173, -5832, -8040, -8022, -7891, -10324, -12989, -15287, -14162, -10800, -5450, -1988, -2124, -3267, -8040, -6856, -4499, -5800, -5340, -5792, -8528, -9244, -7082, -6848, -6120, -11327, -12343, -9063, -6785, -8578, -11641]
14998a1641M026J086K208N045k226j565o07M793l755m331j849K520P56o32l983
14983a0155M591O253o139k874N435J252j030L47k383m212m755J372l64R471N852
14968B661m437l26j710n062j510J885J799l014K806l121k75N014k89l38r26q33
14952g676J778O17P95J204O92m533j678J264p2K363M207K887k112l109j29p25
14936d227k826j370J076l250j350j97n789M616P070N643L83o778J309J917k050
14921e823K225j581r04M624K823l933l234R24l19K373o61k474L000O620n13n630
14905b483N60k4j769l301O02j21k366K696O268k94q137l464J476p55m118K566
14889a2664J979L024N293l651l930K054L162n906L37K129J180J613O471N80m829
$$ y = [-11641, -7615, -6529, -4321, 724, -1502, -3067, -3674, 1119, -2636, -6967, -8816, -6296, -5540, -6172, -10155, -5564, 689, -5450, -8324, -2889, -1637, -2667, -2320, -4703, -8915, -13670, -12298, -12662, -3191, 2661, -1776, -2102, -3812, -8874, -10384, -8499, -6700, -9714, -6908, -10029, -10304, -5290, -5579, -5917, -6843, -7676, -5898, -5281, -4486, -3282, -2590, -7123, -8801, -7537, -7609, -5246, -1039, 1848, -264, -3373, -3502, -4227, -7053, -8423, -7347, -10597, -11947, -12144, -17933, -13317, -6247, -604, -221, -6999, -5690, -3773, -5823, -3598, -5179, -6083, -1459, 1364, -2569, -5803, -4879, -5198, -2825, -3486, -5960, -2960, 3660, 3147, -2483, -1923, -1947, -3716, -7017, -6415, -6536, -8902, -6206, 62, -232, -8369, -11833, -10357, -11112, -15230, -12664, -10685, -7661, -2368, -6019, -9949, -7895, -4733, -10639, -10302, -8173, -6993, -5380, 1091, 1671, -3158]
14874c158n925m976L719P414K717m064l822j603k330J11L584M926n34KL828K260
14858B149l409n896j141l717l832K335N668P69k680k37K962N415L613k335j389
14843a725M25j502K50k112l337p618j212J598N914K043K694L180k556l728j05
14828g791N045Kn530n436N618M108r41l392k829L541K135K345j76n75j330m190
14812i396M91K706J791R47L78j98m696j848M200J771L120r77q80j192r83K620
14796b146p74k516J41j770l567L59L061k92K278J655p115k067L480K535q51m764
14780a2353K788M332M178j106k716j21K17k421m819J653J215R67M654o10q19l79
14764e340o166K140M231K973n58L41k798l146R34K401R2k817n999M545M852l976
$$ y = [-3158, -9083, -14059, -10340, -2926, -209, -4273, -8095, -9698, -12028, -11917, -8333, -3407, -3941, -3939, -111, 2149, -1260, -7156, -8297, -12014, -15846, -13511, -7843, -7074, -9754, -9991, -7029, -1614, 1999, -336, -1725, -1300, -2802, -2552, -4664, -8001, -15619, -16831, -15233, -9319, -7276, -4582, -1402, -3958, -7686, -7791, -2746, -2744, -8274, -13710, -8092, -3984, -4925, -8317, -11146, -7605, -5470, -3125, -3301, -3876, -5206, -9396, -8905, -6199, -4408, -3461, -3083, -3281, -7977, -9825, -5625, -3854, -734, -1711, -2591, -3783, -4766, -2146, -2920, -5436, -5295, -7065, -10632, -10273, -7212, -7504, -5226, -3571, -10686, -12753, -9273, -6738, -7589, -12353, -9565, -5233, -1055, -2161, -4877, -4998, -4781, -7202, -12021, -10368, -9153, -8186, -3532, -4142, -4961, -5340, -11506, -9366, -5135, -2162, -2720, -2379, -5177, -8323, -7389, -4988, -4896, -7713, -13712, -9167, -4315, -8291]
14748h291p28M389M93j381r08J043k283k221n025M580O667J847J609m625j185
14733f019K527R95k73L055J587N03k078J498P31m282p10m096j295P125K207L82
14717A857k190J379J64K138o45q7j968k789l708P92J519O021N50j773k898m237
14701e875m845n89J738K359q46K519L78l63m01K132L547m85j971n602l741M48
14685a1597M3N451K866K83l081P82J879m624m914K561O797K870l132p4K989L259
14669B358l377l687l211O87K226N69k001j707k715l105L290P643k777q386lK860
14653a1336K070j936o07K33L987l800k17N515N670k735Q62K009J884jL550k903
14637B245n805l408M937n92n65j936n931O399K988k933n090l272M908K027m333
$$ y = [-8291, -9019, -4630, -4137, -5518, -6426, -5383, -7666, -9887, -14912, -10332, -3665, -1818, -209, -4834, -6019, -3492, -2497, -2770, 285, 1872, 2375, 297, 1795, 2526, -1756, -2466, -6562, -7857, -732, 1475, 1857, -333, 1046, 1210, 3348, 2703, 2616, 648, -2141, -5849, -5057, -3538, 2483, 3033, 1260, -1638, -5875, -10720, -11309, -9571, -7212, -8058, -5539, -5161, -5524, -5925, -3793, -246, -731, -2702, -8304, -12045, -11597, -11554, -6103, -3237, -2954, -6035, -5253, -3374, -7998, -12912, -10351, -3554, -684, -3816, -3890, -901, 2358, -1019, -4706, -7917, -7230, -5004, -4435, -6436, -8143, -10858, -13963, -10673, -3030, -5807, -14193, -14196, -11336, -9266, -11202, -11809, -11576, -7589, -11389, -11606, -6091, -421, -3156, -2294, -285, 1599, 1598, 5148, 2245, -3560, -6968, -2031, -2623, -3188, -5124, -11055, -4656, -1668, -4601, -9691, -12963, -8055, -6028, -10361]
14622a0361l48p27J087L098J261J816O37k818O54L22R33m327k333N268j281l679
14606a0798j349Q013K618j867M356L489l779o14j218n692m053j448K694j416l301
14591a4365N168J240m365l662J573K447K389l48J663K045J366L52K964j09p317
14576h959m037M065M101m260l217l410M681Q654j904j795o61m320M396o1j017
14561g744J486K81q41Q81M432L455M52l834q879N29K378J300m655k472P16L534
14545h981M486M009L155j375l615k880N38J858K064l589K396J538L341j088J876
14530C733K308k366l236k705k385o70l328K300R919M708n59m399m554J686J450
14515A902M102l465n658J090O940J460n319q86m268j015j143L666M205K537k966
$$ y = [-10361, -10709, -11436, -10349, -7251, -5990, -4174, -3537, -6355, -5701, -5379, -4446, -8773, -11106, -5838, -7119, -10798, -12147, -4134, -1516, -3383, 973, 4462, 683, 69, -1149, -6841, -10894, -12342, -9648, -11064, -14365, -9197, -7957, -12322, -15984, -14411, -11964, -9575, -9923, -8260, -6215, -4849, -4497, -1533, -1642, -8959, -12996, -8931, -4830, -9090, -12307, -15717, -11036, -2382, -4286, -6081, -6742, -11062, -6666, -6727, -7744, -6258, -5977, -6818, -5937, -1505, 1950, 2402, -1432, -10311, -9782, -7404, -6104, -10759, -13231, -12515, -8981, -4495, -486, 2669, 1294, -2321, -5201, -4663, -2805, -741, -4330, -1934, -396, 2945, 1857, 3733, 6041, 3675, 439, -2266, -4651, -5321, -8649, -6349, 3570, 8278, 7719, 3320, -1234, 452, 1902, 6004, 2539, -3119, -2029, 4911, 6371, 1052, 166, -4102, -5117, -6260, -2594, 1611, 4148, 1182]
14500A182k4j126K940j038m276m729k380K560L864j969k36n22l590r98k18J609
14484h951J261L207p12l923k549k637j60K717R3j663L076N42o8j701j596j376
14468a4440l645K475M572l368n448n50K635J121O052M43q18L421j171j812K38
14453a0295j768k726j146O507L390m685j211K820K402M002J906M948j618k915
14439c89j811L001l116p80l95l812n82l815j655m92j127N641N2J642M525k692
14423e805m192R88M237j873j27J523l435m922j245M327L351K45K78L647K004L76
14407f23l177k342l548P9J712j316K438J599o048l412O503K994p90l501K031J425
14391e976N74j126n158K464K012M82J831m059J14N538l95L385K299j212m048k684
$$ y = [1182, 1158, 32, 2972, 1934, -2342, -7071, -9451, -6891, -3027, -4996, -5232, -5754, -9344, -10342, -10560, -8951, -7690, -4483, -5195, -9118, -11667, -14304, -14464, -11747, -11654, -13317, -10241, -9699, -9767, -11468, -13064, -14440, -18085, -15610, -11038, -14406, -19854, -20404, -17769, -16648, -10596, -10153, -10971, -7550, -8721, -10533, -10295, -12063, -14789, -15935, -9428, -6038, -10723, -11934, -9114, -6712, -2710, -804, 4144, 2526, -389, -2200, 801, -2315, -3095, -3490, -7302, -7884, -11699, -13354, -13846, -14973, -9332, -9280, -7638, -3113, -5805, -9997, -9009, -4772, -6645, -6772, -5249, -8684, -13606, -14851, -10524, -7173, -6928, -6650, -3003, -999, -623, -3800, -6142, -9690, -9611, -7899, -9215, -6777, -5178, -11226, -14638, -8135, -5141, -5931, -9432, -7401, -5976, -5402, -6528, -11686, -9222, -7210, -6728, -4897, -8956, -8842, -3304, -3699, -314, 1985, 773, -3275, -5959]
14375e959k205j972j657k501K738k95J856K825J327L483l20o823l41Q90M010Q849
14359C905J032q013k71n815o55M185O954j395m911K578j482m501j828J875k334
14344a0676k374N88j49K646L792L735M999N455n647l413j772n120j730Q37L720
14329e109J358J818r52k931Q71N69m42K876J334m462k116M76l280m4L22j475J287
14312i900N80j979N633K820k723J213P092j838k727k108R11O78j837J43l161k19
14296g422M59L997M311J617K48l955o950m430M026L148J041L47o91k947l387K48
14280a0340K420L027n42J69k783N59j720O54l285k550L976L204K855J979j521
14265c898l306j775pK186K977l200m8K510J797l126m235K879N832J866j231L460
$$ y = [-5959, -8164, -10136, -11793, -14294, -11556, -11851, -9995, -7170, -5843, -2360, -2680, -9503, -9844, -8954, -4944, 3905, 4937, -3076, -3347, -9162, -9817, -5632, 1322, -73, -4984, -2406, -3888, -8389, -10217, -8342, -10676, -13050, -12462, -12611, -9965, -6173, -2438, 2561, 8016, 2369, -1044, -2816, -7936, -9666, -8829, -5109, -3751, -1933, -2885, -5816, -4945, -4376, -4818, -1942, -608, -5070, -7186, -6710, -9990, -10034, -9712, -11187, -9900, -9320, -11299, -5666, -2846, -5569, -4356, 2736, 898, -1829, -3937, -3026, -2348, -4185, -4042, -7203, -7422, -6963, -2966, 1345, 2962, 3210, -745, -7695, -12125, -8099, -4951, -3910, -3563, -4254, -7201, -10588, -10340, -7920, -4893, -5435, -5266, -8049, -7490, -9210, -8556, -11841, -14391, -10415, -7211, -4356, -2377, -3898, -7204, -8979, -8986, -6800, -3823, -7023, -7071, -4561, -2764, -5890, -10125, -7246, -1414, 452, -779, 2681]
14249B681j974l697L25Q74L46j165K624m872j652m69O027L079J017J940o106m16
14233a438K119k035l680J771J36k026j298N629L639j757j900Q1K16m356r41Q36
14217e004J620K174K931n6R62l125p103l84J055K495m421o40k17l436K777M200
14201f172k177P52K502L19K225j01n534J916J329q45l982k161l007L600n71J20
14185a1787j387L626k864J129M790L100L364p81K603l185l074J891O628M085J511
14170I649J600m335n595m588J791P12m132p36j637j883O683J647n292k972J983
14155g105L496K342P338l416p475j441k82J961M9k56l5J66K408O171J306n915
14139f88o509L797K62L565J648K72m90k893j674m440m768M383M723N83k053L329
$$ y = [2681, 707, -2990, -2665, -1791, -1445, -2610, 14, -4858, -6510, -6979, -952, 2127, 3144, 5084, -1022, -1438, 681, -1354, -5034, -3263, -3127, -5153, -6451, -822, 2817, 1060, -840, -759, -543, -4899, -5840, -5004, -3384, -1210, 1721, 1665, 2627, -498, -7601, -7985, -6930, -4435, -8856, -9496, -9713, -13149, -10372, -6172, -8349, -7597, -5095, -4776, -2551, -2652, -8186, -6270, -4941, -5786, -9768, -11929, -14936, -11336, -11907, -11787, -13174, -9548, -12412, -11283, -6493, -3393, -29, -810, 1793, -1392, -4466, -2575, 4053, 8138, 9649, 11249, 6914, 1319, -3269, -1478, -766, -4898, -5634, -7271, -9154, -2471, -824, -6116, -9088, -7105, -3609, -1267, 6071, 2655, -4820, -6261, -6543, -4582, -4533, -4789, -4824, -4658, -2250, 3921, 5227, -688, -7197, -3400, -3138, 427, 2075, 2347, 1857, -1036, -2710, -7150, -11918, -7535, -2812, -2229, -4282, -953]
14123i53q74k314K974L098J992l329l580j566k990q83j178K276N406O245j715
14108B609l605m89l961k856j572N27L004l97k25O7P26J461L145n29m176L599O682
14091D010l322p016k126n208n79L75P75L877J919P09l742J66J695K043P6j07o2
14074f517l503J303J948k188L146l949n86K358K000l518l163J455k739J492M884
14059g577k606j619K835k589m00n98J20n953O19J996L307P625J51q19K57j151
14043f402k107K413K380K711K526l534l529J620L413k95k044K374M46n963rj095
14027g095kJ290k344k755K681M711R50p33j234l215N043L193l830L50J513J290
14011a87j930j475k030n859m82Q299r13l484r56k915j229L130J310m051M87K482
$$ y = [-953, -1827, -4141, -1167, 1931, 3923, 594, -2986, -4552, -7542, -8425, -9603, -7327, -1921, 4324, 2609, -996, -1485, -5446, -8302, -9874, -9347, -6343, -6740, -6965, -6898, -6172, -4711, -1566, -2095, -6271, -2672, 4010, 688, -6328, -8454, -13662, -14241, -13866, -13091, -9214, -7295, -6586, -10328, -10162, -8467, -6424, -6348, -6455, -6517, -10020, -8717, -6769, -8957, -5811, -9760, -10346, -7988, -5988, -9506, -12669, -11214, -13953, -12461, -7577, -10183, -11802, -8967, -11556, -11956, -12554, -12434, -18387, -17768, -15772, -12465, -4840, -4689, -5508, -5251, -6402, -8509, -6096, -3716, -1005, 1521, -2013, -5542, -3922, -509, -804, -2848, -474, -28, -5991, -6000, -7095, -7097, -5807, -8151, -10906, -8225, -3514, -2564, -3297, -4531, -7746, -2703, 490, -3340, -2990, -1477, -187, -2117, -3592, -5622, -11481, -11963, -3664, -4577, -8061, -9017, -11932, -13161, -10031, -8721, -12772, -12285, -9803]
13995i803M657L789p7k838j917k046L281n9K605k174m191j757j978J977J269L329
13979e933k487m544j435J215M250P342J330k014j500K66q071k542L903P143J115
13964a962k824k821j63M73L46j932L607O214m673m796Q65o66k31K246k78r98J189
13947f404j544j223j449N208M150L608J386n168j026k835N11K570M5K454M54j37
13931F00j053l244k790N12M055N16L31K064L335j343j0194j592r67J648M920r73
13915d175Q7L625j191j988K103j924K94M261R14k617J986J93N42l206k841M08
13899c529L032p34o78J778p75k543n66Q79l238m9Q93L103J100r70Q64K601l829
13882b661j462J536l115k221j566l553L510J184j925M444j312J228Q50J199L330
$$ y = [-9803, -5146, -1357, -1434, -4272, -6189, -8235, -4954, -5013, -2408, -4582, -8773, -10530, -12508, -10531, -9262, -5933, -8420, -12964, -14399, -13184, -8934, -1592, -262, -2276, -3776, -3510, -11581, -14123, -10220, -3077, -1962, -4786, -7607, -7770, -7297, -6951, -8883, -5276, 938, -3735, -8531, -7666, -8332, -8563, -6317, -6595, -7593, -6404, -7948, -9171, -10620, -5412, -1262, 2346, 3732, -1436, -2462, -5297, -4786, -2216, -2171, 283, 737, 600, -453, -3697, -6487, -5975, -1920, -1404, -1073, 991, 4326, 2983, -7211, -8803, -9770, -8122, -3202, -4175, -4088, -463, -1654, -3642, -1539, -3463, -3169, 1092, 2006, -611, 1375, 1568, 2110, -1096, -3937, -3529, -497, -1231, -1909, -131, -906, -3449, -4015, -3136, -6374, -6423, -5530, -2427, -1327, -2297, -1433, 1168, -2661, -4123, -2587, -5702, -7923, -9489, -13042, -9532, -8348, -10273, -5829, -7141, -5913, -5063, -3864, -534]
13867e34P16M886R09j306j836k746k543k760j780k004l028O39k867Q84K371m44
13851a1443L17L818L241J231n13K96k922Q33Qm446R1M16j598L576M524j860M172
13834b59Q52l894n177M061L163k903J001K779n60k70K109m780m978n774j42J572
13818a3200M514m43O62j531n87J956K092J389J628J898O23K905l264M67o28J191
13802c28J137l096o636l183P10r67P75L171k29L189R50K108j428l054L955L605
13786F79Q72R17N91l704j077m193J083N081m60j378j13j024j259l532K436K682
13770b399K190l153j351O19L770J317J830n381l642j522K348k023J864J192l80
13755d721L269Qm464j390n343K53J0196J828l235p197j049K644K71O251L265k137
$$ y = [-534, 182, 5068, 5977, 4671, 2835, 89, -2454, -5214, -6994, -8998, -12026, -11387, -14254, -13370, -10999, -11443, -11126, -7308, -4067, -2836, -3349, -3053, -5975, -5142, -5134, -9580, -9489, -9073, -10671, -7095, -2571, -4431, -259, 593, -3301, -8478, -4417, -1254, -4157, -3156, -377, -937, -1207, 902, -3878, -8856, -14630, -14772, -13200, -8686, -9129, -8467, -9998, -10585, -8629, -6537, -5148, -3520, -1622, -999, 1906, -1358, -891, -1519, -328, 809, -2287, -8923, -12106, -11396, -12363, -11588, -8417, -8646, -5457, -4507, -2399, -3827, -6881, -2926, 679, 1551, 2468, 3059, -645, -1722, -5915, -4832, 249, -211, -1589, -1702, -2726, -3985, -7517, -5081, -2399, -209, -3362, -4713, -4094, -324, 993, 2823, -2558, -6200, -7722, -5374, -7397, -5533, -4341, -4721, -1452, -1444, -5908, -7298, -12641, -12388, -2192, -364, -3599, -10796, -11845, -9201, -8930, -2679, 586, -1551]
13739a551k971l785k271m298L248P359Q58l046K09o21J122K771K599k477k366
13724e220J54K784M134jm603k26J778l937n475M8J341L542K822Q96M59l454l295
13707h253k314N952Q020k43j338l053l408k287L585m628l399J467M173K660j42
13692c208l990L30R34K334L410J648j77m498L63n7o248k145J625M86M350r25R65
13675d803K516k39k781n395K481O76k223k381j267M787M769K996k143n261L891
13660d377O004o0J152J100n54j374j836J157j963k420m172k56N281N115J459M190
13644H446R55K325J510J525O169O013Q82N208N677r78K891O142R595L991K048
13629F2399O779R752l1m470m795n868m692k289l980j177l308l783r09n986p465
$$ y = [-1551, -4522, -8307, -10578, -14876, -11628, -4269, -3411, -6457, -6248, -6869, -5747, -2976, -377, -2854, -5220, -5066, -2282, 1852, 1851, -2752, -2978, -1200, -5137, -10612, -10564, -9223, -5681, -2859, -1963, -1504, -4958, -8253, -10567, -4615, 3405, 3162, 1824, -1229, -4637, -6924, -3339, -7967, -11366, -9899, -5726, -3066, -3208, -7198, -6868, -5934, -3600, -190, 1458, 1281, -3217, -2854, -2911, -9159, -11304, -9679, -9193, -4843, -5768, -4803, -2287, -2526, -5307, -10702, -8221, -7545, -9768, -12149, -13416, -8629, -3860, -864, -3007, -8268, -4377, 1627, 1567, 2719, 3819, 3265, 1891, 55, 1212, -751, -3171, -7343, -7599, -2318, 2797, 4256, 8446, 9401, 11726, 13236, 14761, 20930, 26943, 27825, 33033, 38710, 37732, 40623, 46765, 56360, 60351, 62399, 69178, 78930, 78899, 74429, 69634, 63766, 59074, 56785, 52805, 51628, 48320, 44537, 43628, 37642, 30177]
13614C0177m264m750n411q43o317N95P037q09j777j633r52m577m345M272j067
13599E336j669n37M35K241l11j838J280j33l744k901l445O96L853L781k873k181
13583b010m80n173J226k008j220J11k931R88L18j309K203J942O02m48K836J519
13567c834j855k701l575K976M087r89j02P68j557K7K118M455k006p84M289J912
13551C229m625m110P11L107M78R10j912K554L81j315M59m231K44q30O350L094
13535D494q75k410l573j056m289M35q36j131M463r78K524k884J211q32j029M37
13519f329J611j554K158N661q6K890j769o125j678j820l02o16J757Q47K508L710
13503H63J12l604l337J660J19j761K572j031l287j882J785K505P8j196l16j875
$$ y = [30177, 25913, 21163, 15752, 14909, 8592, 9187, 16224, 15415, 13638, 12005, 11053, 6476, 2131, 6403, 5336, 3667, 3130, 3565, 5806, 5495, 3657, 4937, 4804, 1060, -1841, -5286, -4590, -737, 3044, 171, -2010, -2490, -7663, -6437, -8445, -9665, -9554, -12485, -11497, -11179, -12488, -10285, -8343, -7741, -8189, -5353, -3834, -5689, -8390, -11965, -8989, -4902, -5891, -5993, -5225, -6782, -6755, -4637, -182, -2188, -2972, 1317, 3229, -1396, -5506, -4795, -1688, -1210, -300, -2212, 342, 723, -592, -133, -4364, -4120, -4950, 1400, 4494, 3619, 1209, -2364, -3420, -7709, -7274, -8110, -9241, -4778, -5756, -3232, -6116, -4905, -5737, -6766, -6329, -4718, -6272, -4114, 1547, 1461, 4351, 2582, -3543, -5221, -7041, -7343, -7959, -6202, -5355, -2847, 863, 975, -2629, -5966, -4306, -4187, -5948, -3376, -4407, -7694, -9576, -7791, -5286, -5208, -6404, -6720, -8595]
13487h595n54J934M461L943n1j790m422j430N12j17R07k141R10J175k073J210
13471f121M510M22J94k861p19K229L71K978K444k941j841J249l368p37l973J092
13455g072J279j448K175P41k623N88k565J631L456Q51j90l781j366k550l086J19
13439a3841K272J531M009K910L941m011k094N839K322K210J344n684k986J553
13425f85l68j860M89Q98k037l868M4R09l73K79L334k11m072n43M000K264N79k60
13407a481L137r84m302L059N879K88m547J368k770o688l562k473L412O500j289
13392d453k083O62j966k13L421N910P01o13l216Q96M697J494K019j103m188j220
13376G45m47j546J881K273j234l053Q26k525j759o92M626K633m421n960J858K664
$$ y = [-8595, -9149, -7215, -2754, 1189, 1138, -652, -5074, -6504, -5992, -6109, -5202, -7343, -6433, -5258, -7331, -6121, -1611, -1189, -995, -3856, -4575, -2346, -1975, 1003, 3447, 506, -1335, -86, -3454, -4191, -8164, -7072, -5793, -7241, -5066, -4325, -6948, -6360, -8925, -7294, -3838, -2987, -3177, -6958, -8324, -10874, -13960, -13841, -11569, -10038, -6029, -3119, 822, -3189, -5283, 556, 2878, 5088, 6432, 748, -2238, -685, -1053, -2913, -2424, -1526, -3563, -7431, -7387, -6478, -6851, -6572, -3238, -3449, -7521, -8064, -4064, -1800, -1221, -1481, 1656, 672, -3630, -571, 5308, 5596, 1049, 2417, -353, -7041, -10603, -13076, -9664, -3164, -4453, -6536, -5874, -7840, -8053, -4632, 1278, 1979, 1366, -1850, -954, 3743, 5237, 7256, 6153, 1965, 745, 298, -1248, 633, 2906, 1672, -1381, -555, -3080, -4839, -5531, -905, 1728, -2693, -8653, -6795, -4131]
13360d131N74M012j810m252n20k116K368L085J410K27j307M082k265j178k207
13345d028m844J659Q17q29M52l015M89J898K086J383j05J123k12K912Q76R26m197
13328b609k568O11K409J208j146k603K033l82k197P62K440O321n908j543m360
13313g532n051j373j500L544M672k99L141L572O786p94k952j72l058P54P39N62
13297A039N658j486k659l495l113J542M111J371j774j751o68J341J651q07n8k720
13281a818K530o45m665l853J822l017j617J372K058K816N68j117L071L140K760
13266C405N74M11q73m608j247J065l015l454m522J901L638N805j4k647k851K809
13250c623Q27L995M61j823J942k273J133m958n49qr91P913M655j123L50O99K57
$$ y = [-4131, -3557, 455, -1355, -5607, -6127, -8243, -5875, -2790, -1380, -1153, -2460, 1622, -643, -1821, -4028, -8872, -7213, -6396, -7225, -6773, -9788, -9299, -7401, -5315, -3932, -4037, -2914, -3126, -214, 662, 1588, -2609, -5177, -4566, -2157, -949, -2095, -4698, -2665, -3047, -5244, -4482, -2042, 4279, -1629, -3172, -7532, -12583, -13956, -15456, -11912, -7240, -7539, -4398, -826, 5960, 5166, 2214, 2042, -1016, -262, 477, 1039, 6697, 5211, 2552, -943, -4056, -2514, 1597, 2968, 1194, -557, -1225, 116, 1767, 960, 902, -1818, 712, 67, -4598, -8451, -6629, -9646, -11263, -9891, -7833, -5017, -4449, -5566, -2495, 645, 3405, 3979, 4390, 3517, -1091, -2338, -1273, -4288, -7742, -12264, -10363, -6725, -920, -934, -3581, -6432, -3623, -2796, 1199, 1660, -163, 1779, -494, 639, -4319, -4868, -4876, -5867, 2046, 6701, 5578, 5928, 6627, 6884]
13233F884l832o958j649J182J765j229J948K348m302k48k570l342J727n90l118
13218a1984L197P34m694J595J081k506K456J25r67o73L641J057J98N222M409O38
13202C529p6k033P72k252n72M061k040l137q79L214M024j554L00n201M414J646
13186D216p19n980J082L37J783K053m61M564J129r796n382L41O92L68k866K546
13170f093M039M561J125J022j299l663r43m863Q80J01K585o342j945P139k87j627
13154e610n67m80k009L360L905M451q77n279m699m665O279M199M92M22k971k754
13138f803M304M419Q08j653n98j74j365J829K143j078O38k039M169K385l115l882
13122a2j576k078R48J536l848l725M768L006M010J335j074l11J846j067L134r20
$$ y = [6884, 3052, -3906, -5555, -4373, -2608, -3837, -1889, 459, -3843, -4091, -6661, -10003, -8276, -8866, -11984, -8787, -8053, -12747, -11152, -10071, -12577, -10121, -9996, -10963, -11636, -7995, -6938, -6740, -1518, 2891, 3529, 3453, 1420, 2192, -60, -632, 3429, 1389, -1748, -2627, 587, 4611, 3057, 3357, -1844, 2570, 4216, 3497, -2483, -1401, -1064, 719, 2772, 2311, 6875, 8004, -1792, -7174, -6833, -6141, -5773, -8639, -6093, -2054, 2507, 3632, 4654, 3355, -308, -1251, -6114, -5234, -5133, -2548, -8890, -10835, -3696, -3983, -5610, -6177, -6657, -8666, -5306, -1401, 3050, 2173, -3106, -7805, -12470, -6191, -1992, -1500, -1078, -4049, -6803, -2499, 1920, 2728, 1075, 477, 303, -1062, 767, 2910, 1832, 2470, 431, 4600, 6985, 3870, -12, -1588, -3666, -2718, -1182, -5030, -8755, -3987, -981, 3029, 4364, 3290, 2979, 4825, 3758, 6892, 5972]
13106E972m232m378j922k544Q62P43j255j640K94L115m56J935L131M10O5j821
13090a721l586J63J862N669L597j16l994m392N830J887j7M629J944J547k345l385
13074G572q07k796j613j621l11k07m53j453l886O66J794P67P03M68r26k88k306
13057d697k411J829J751N005l739J376L909j030o34K048R32k049J790l881m150
13042c951L322k054j653M256L934l374j192M98p56m439M693O953P20l14l473J657
13026D827K914r9P1k24k61l18R4k652R7r02p0K608O67K81n772M90L220L319K958
13007A1248L353j225p847k867k05J873k678J90L87n042k81L145P803K777p034
12992C597m921J117N140m24M27l093P18J741n695K731Q22n60L670M506K394l049
$$ y = [5972, 1740, -2638, -4560, -7104, -6242, -5499, -6754, -8394, -8100, -4985, -5441, -3506, -375, 35, 100, -1721, -5307, -5144, -3282, 2387, 5984, 5868, 1874, -2518, 3312, 5199, 5182, 9811, 11755, 13302, 10957, 7572, 6765, 3969, 2356, 735, 424, 217, -236, -1689, -5575, -4909, -3115, -2348, -1645, -1177, -2103, -2391, -4697, -7108, -5279, -3528, 1477, -2262, -886, 3023, 1993, 1359, 3407, 4339, 2290, 4080, 199, -3951, -629, -2683, -4336, -80, 3854, 480, -712, -214, -970, -5409, -716, 6237, 6957, 6643, 3170, 4827, 7741, 7642, 7713, 7489, 7228, 6910, 7004, 4352, 4449, 3547, 3477, 6085, 6752, 7033, 1261, 1751, 4971, 8290, 11248, 14601, 13376, 5529, 2662, 2457, 4330, 1652, 1842, 2229, -2813, -3094, 51, 7854, 10631, 3597, -1324, -207, 4933, 4509, 4936, 1843, 2561, 4302, -1393, 1338, 2160, 1600, 5270, 9776, 12170, 9121]
12976I121j21K35J215m169l392r38k425j610L999J06M344Q22k501m474L097K598
12960E907L442k581j101N305j051M90L31K545m204l894j408N586K563l436l864
12945D630K207P949O911l955l478j946k64J015k90J690J746K789k984l620O708
12930A9108L577J103k598l532l020K722K215q59J569m164m538J74n43J404L212
12915A5830K009L40j293k284J378j516J110p4K424O06K040O51L529k907K28J535
12899B3606K469r27k916K137j6m302K250N063O55J778N761k224j808J886K592
12884C6004k118o33l841J096M868M697O89J212M82M554R065P849N831J0535J0511
12869I0801J5973K0549K2828K2322L5008N2451P0712R1555J08085J20174J26602
$$ y = [9121, 9000, 9235, 10450, 6281, 2889, 1951, -474, -2084, 1915, 2021, 6365, 7187, 4686, 212, 3309, 5907, 9349, 6768, 5667, 10972, 9921, 10411, 10742, 13287, 9083, 5189, 3781, 9367, 11930, 8494, 4630, 6837, 14786, 21697, 17742, 14264, 12318, 12054, 13069, 12779, 14469, 16215, 19004, 16020, 12400, 19108, 22685, 23788, 21190, 17658, 14638, 17360, 19575, 18716, 20285, 16121, 11583, 11757, 11214, 12618, 15830, 17839, 18179, 16886, 14602, 15980, 14464, 15574, 15500, 17924, 18530, 20570, 21221, 24750, 21843, 22071, 23606, 26075, 25148, 22232, 24369, 24353, 20051, 22301, 27364, 28019, 29797, 35558, 33334, 31526, 33412, 36004, 33886, 33253, 29412, 30508, 35376, 40073, 40762, 41974, 42456, 47010, 56075, 63924, 69755, 80290, 90801, 106774, 127323, 150151, 172473, 207481, 259932, 330644, 422199, 530284, 650458, 777060]
12858G77060J21485J03726P5611M8445Q603k7465n5848p9642j01558j07183j06129
12847F57105j02393q8724o7645n2642m0985l7642k5577k4781k4386k4949j4314
12836A53067j1451j8852j2334j2639j0977p313m749q084j1640m901n401n472l403
12823C5851p42L57j811K326K53j554j996q42J88N94L445J291m658o285L515K295
12807C2227j661o22m306o405j379j961K87K637J311l39n291L51L709P137P267
12792C2962L292K880K105J0670N451P035L403K525J279m051m825n797r461o775
12778D0693l909n005j817r903n868p72K26L628N68k181Q65l348k692k832r88Q55
12762G520r79l895J089j723j0971l594J205J667L561J481J451J070K567l11L263
$$ y = [777060, 898545, 1002271, 1077882, 1126327, 1134930, 1107465, 1051617, 971975, 870417, 763234, 657105, 554712, 465988, 398343, 345701, 304716, 267074, 241497, 216716, 192330, 167381, 153067, 141616, 122764, 110430, 97791, 86814, 79501, 74752, 66668, 55028, 50127, 44726, 39254, 35851, 35109, 35466, 33655, 35981, 36234, 34680, 32684, 31842, 32030, 32624, 36069, 37360, 32702, 26417, 29932, 32227, 30566, 29944, 25638, 19233, 17854, 15893, 16180, 18817, 20128, 19789, 14498, 14849, 18558, 25695, 32962, 36254, 39134, 41239, 51909, 57360, 64395, 67798, 70323, 71602, 67551, 62726, 56929, 47468, 40693, 36784, 31779, 29962, 20059, 14191, 13419, 13645, 17273, 17841, 15660, 16525, 13177, 10485, 7653, 6665, 7520, 6541, 2646, 3735, 2012, -8959, -12553, -11348, -9681, -6120, -4639, -3188, -2118, 449, 138, 3401]
12747C401L592M591Q37k681M652Q853L831K011J59J052r1m284m436m214m775m41
12731A2057l403q55N18K447L885O39J418j119N66J866k073R71N338j716J347J457
12715B3343J989J635K804L942Q491j334l827l770K951r21m801j231L406J092k943
12700C0826Q354J0703R515R071P202J2515J0977J5930J4497J5943J2238M880R897
12687A72548P196m60l184p577j0869r307j2026j5494j1464j2922k494k400o668
12674H4879m391q043m345l616l262k98K488K611k40j086J81r78l76l440j327M906
12658F3663M922O81l198o304l844j899L177J544q82L113l113q676o113k176O432
12643D7327O153P225M703j678L609K767M263O65J0326J1381N922M193m588p862
$$ y = [3401, 6993, 11584, 12421, 9740, 14392, 23245, 27076, 29087, 29246, 30298, 30207, 25923, 21487, 17273, 12498, 12057, 8654, 7799, 8317, 10764, 14649, 15288, 16706, 15587, 16153, 18019, 15946, 16917, 22255, 20539, 21886, 23343, 25332, 26967, 29771, 33713, 42204, 40870, 37043, 33273, 36224, 35303, 30502, 29271, 32677, 33769, 30826, 39180, 49883, 59398, 68469, 75671, 88186, 99163, 115093, 129590, 145533, 157771, 162651, 172548, 179744, 179284, 176100, 168523, 157654, 148347, 136321, 120827, 109363, 96441, 93947, 91547, 84879, 80488, 72445, 68100, 64484, 61222, 60924, 63412, 66023, 65783, 64697, 64878, 63900, 63524, 60084, 58757, 63663, 68585, 69266, 66068, 59764, 55920, 54021, 57198, 58742, 57860, 60973, 57860, 49184, 43071, 40895, 47327, 53480, 60705, 65408, 63730, 67339, 70106, 74369, 75034, 85360, 96741, 102663, 106856, 102268, 94406]
12629I4406k872k924l864q001r834m785o143q468J201R18J901J488l204k772J446
12614D8493J597K861K13j022j932K32K030k763k40M405J1362J2824J1291R055
12600I8406Q988J8959K0597K6618L4541L9762M3807L4811K6052J4377K162j5186
12588C53894k6055k8383l2669l0119l4629k9941k4210j2013j5943j0014p930n433
12576I6555l231N78p257j4814j6147j3919q457j1633j1968j3706J025J2298K4650
12563C3974L3040L4226L6913L9325M4359L9193K8702K2344J4392J3342J0405M178
12551C54393N119K996l198Q40m49M462J0587M479M472R248Q315L057N54m309J625
12536D02191j456o077m237n118k890j70J802M77r50J210J3022K3484L4645N4050
$$ y = [94406, 91534, 88610, 84746, 76745, 66911, 62126, 55983, 47515, 48716, 49634, 51535, 53023, 49819, 47047, 48493, 50090, 52951, 53164, 52142, 50210, 50442, 52472, 49709, 49469, 53874, 65236, 78060, 89351, 98406, 107394, 126353, 146950, 173568, 208109, 247871, 291678, 326489, 352541, 366918, 369080, 353894, 327839, 299456, 266787, 236668, 202039, 172098, 147888, 135875, 119932, 109918, 101988, 96555, 93324, 93902, 86645, 71831, 55684, 41765, 33308, 21675, 9707, -3999, -2974, 9324, 33974, 67014, 101240, 138153, 177478, 221837, 261030, 289732, 312076, 326468, 339810, 350215, 354393, 359512, 362508, 359310, 360150, 359701, 364163, 374750, 379229, 383701, 392949, 401264, 404321, 404875, 400566, 402191, 400735, 394658, 390421, 385303, 382413, 382243, 384045, 384522, 383572, 384782, 397804, 421288, 455933, 509983]
12522E09983O0704P0949P1141N5131M1690K0919m013k2893l9515n1630n4712l8729
12510F19025k7054k2359j0745m818r04k318j899J241K842N323M276R659J0342
12497E82611J3247J0528J0539J0297J1604J0195O644J1637J6347J8200K3516K1738
12485G47103K3892L0393L2901L1869L8651L7786M1551M6483N0570N6739O8428
12474A206366P7113Q5872R4479J05026J08440J22338J29890J40667J54369J64758
12464B389318J80133K10868K49470K80442L15033L78584M62832N65546O93865
12455E726091Q37350R90683J146360J306931J489820J701069J958884K356158
12447A7513346K988654M027736N705810Q284645J1817471J5744791J9020560K0873710
$$ y = [509983, 570687, 641636, 712777, 767908, 809598, 830517, 826504, 803611, 764096, 712466, 657754, 619025, 591971, 569612, 558867, 554049, 553145, 550827, 548928, 550169, 553011, 558334, 562610, 572269, 582611, 595858, 606386, 616925, 627222, 638826, 649021, 655665, 667302, 683649, 701849, 725365, 747103, 770995, 801388, 834289, 866158, 904809, 942595, 984146, 1030629, 1081199, 1137938, 1206366, 1283479, 1369351, 1463830, 1568856, 1677296, 1799634, 1929524, 2070191, 2224560, 2389318, 2569451, 2780319, 3029789, 3310231, 3625264, 4003848, 4466680, 5032226, 5726091, 6563441, 7554124, 8700484, 10007415, 11497235, 13198304, 15157188, 17513346, 20502000, 24529736, 30235546, 38520191, 50337662, 66082453, 85103013, 105976723]
12439A05976723K1405128K1243588K0166587J7277313J2096060N451821j128510
12432B02488710o841789j1540829j5245200j7692814j8703069j8432847j7121517
12425I6910645j4935242j2203478r496204p330562n855819m925955m365643m035528
12417C3762214l791365l532849l228462k892331k553616k225877j925749j649700
12409A1962265j417842j217211j047851r10715p95228o96599o11165n42047m82584
12400D241023m20722l69032l19694k76105k39656k05380j79866j50873j32639
12391A947056j15262r7342q2007p2586o5229o3493o1998o0849o6072o8579o6683
12380A126956o5095n7360m9480m8552m5290l7898l8580l7259l2782k8517k7389
$$ y = [105976723, 127381851, 148625439, 168792026, 186069339, 198165399, 203617220, 202488710, 195646921, 184106092, 168860892, 151168078, 132465009, 114032162, 96910645, 81975403, 69771925, 60275721, 52945159, 47089340, 42163385, 37797742, 33762214, 29970849, 26438000, 23209538, 20317207, 17763591, 15537714, 13611965, 11962265, 10544423, 9327212, 8279361, 7368646, 6573418, 5876819, 5265654, 4723607, 4241023, 3820301, 3451269, 3131575, 2855470, 2615814, 2410434, 2230568, 2079695, 1947056, 1831794, 1734452, 1652445, 1579859, 1514630, 1451137, 1389139, 1328290, 1262218, 1193639, 1126956, 1061861, 1004501, 955021, 906469, 861179, 823281, 784701, 747442, 714660, 686143, 658754]
12369F58754k4708k5266k6259j9733k1512j1747j3885j8889k2888j0228q749q370
12357D46520p281p818r937o999o626p824q912o340j686m015q533Q70m029r787
12343C57603j0678j5356j2022j0973j3322j6742j3383j6841j7072q059q683q870
12331B05602j1536q424j2358o437m272n517p126q148m597n712l618k337l213r646
12317A12661j0518j6259q797l118j792K04J0326J2467J9758K8211L6693L7874
12305B17710L0563K5362K3465K4714J5509K004J311k322n33p936n789p345l881
12292C12832m692l758q313r536o446j0403q655j1561p291q733r387k565r275r356
12278B02861n458l117j1780r546o716p806q383p023o588k291J35r80k754o308
$$ y = [658754, 634046, 608780, 582521, 562788, 541276, 529529, 515644, 496755, 473867, 463639, 454890, 446520, 439239, 431421, 421484, 414485, 407859, 400035, 391123, 384783, 383097, 379082, 370549, 371419, 367390, 357603, 346925, 331569, 319547, 308574, 295252, 278510, 265127, 248286, 231214, 223155, 214472, 205602, 194066, 185642, 173284, 166847, 162575, 157058, 149932, 141784, 137187, 131475, 127857, 125520, 122307, 112661, 102143, 85884, 77087, 73969, 72177, 72381, 82707, 95174, 114932, 143143, 179836, 217710, 248273, 273635, 297100, 321814, 337323, 339327, 340638, 338316, 337783, 329847, 324058, 316713, 312832, 308140, 304382, 296069, 286533, 280087, 269684, 261029, 249468, 242177, 233444, 224057, 221492, 212217, 202861, 197403, 194286, 182506, 172960, 166244, 158438, 150055, 143032, 136444, 134153, 134288, 133308, 130554, 124246]
12264A24246j858r14M3m177k461K894j085j516k420l35j671l788L471M886L982
12249A19297r21j849n72l497j7921j3169m828n891o037j2877n731k616k173o501
12235C4714n334m069M823Q186Q778O034L548M409M194n90L15j168N674P27J591
12220G1832O20k557J40p84n291l611m35L186J725j0032q830K007m137q89N469
12205D8413N746J336l527k657K905K575O203L464j902l442k711k440m755M577
12191E3785m03j032K067J821j775l020J115L270M160M400K417M907M468q85j382
12176G3913j445j80R19m228k434l58n28m905N490J683l94J206M359m008J9J99
12160F9308k043K277k583j446k369l348k069J534l717j498j605k156J565M859
$$ y = [124246, 122388, 121474, 121517, 117340, 114879, 117773, 116688, 115172, 112752, 112417, 110746, 106958, 110429, 115315, 119297, 118376, 116527, 115955, 112458, 94537, 81368, 76540, 70649, 64612, 51735, 46004, 43388, 41215, 34714, 29380, 25311, 30134, 38320, 47098, 53132, 56680, 61089, 65283, 64693, 65008, 63840, 69514, 70241, 71832, 72452, 69895, 70035, 69251, 63960, 60349, 59914, 63100, 64825, 54793, 45963, 47970, 43833, 42944, 48413, 54159, 55495, 51968, 49311, 52216, 54791, 60994, 64458, 62556, 59114, 56403, 53963, 49208, 53785, 53382, 52350, 54417, 56238, 54463, 51443, 52558, 55828, 59988, 64388, 66805, 71712, 76180, 75295, 73913, 72468, 72288, 73207, 68979, 66545, 66187, 65659, 60754, 66244, 67927, 67533, 68739, 73098, 69090, 69109, 69308, 67265, 69542, 66959, 65513, 63144, 59796, 57727, 59261, 55544, 54046, 52441, 50285, 51850, 56709]
12146E6709J318N109K834M194j302k170j974R67K77O274n66n115j202K925L923
12131G2201J2082J6549K4863M0534L9673K4404Q578L55j2720k4280k6818j0945
12119A64476J0176K3933L2171L4285K0320k450k3217l0479l5033l0717k4628j1992
12107A26845q357j3877j2962k121l111p060k735l884j0671q777o639p27K142K512
12093E0578m044p287n901o851r495r003l06j318n660n058j792P05p0l393L361
12078e534J708L738L745J480J460j464K12M505k97n26p31j731J627M826J691M279
12062A8988O84n349k788L095J984M66m484r30L766K065J500L228M489K460J947
12047C1121l816l514r39K688L165j612m540N25M22M8K849K144m41K917M889N138
$$ y = [56709, 58027, 63136, 65970, 70164, 68862, 66692, 64718, 65685, 65962, 72236, 71670, 66555, 65353, 68278, 72201, 84283, 100832, 125695, 166229, 205902, 230306, 238884, 239239, 226519, 202239, 175421, 164476, 174652, 198585, 230756, 265041, 285361, 282911, 259694, 229215, 194182, 163465, 138837, 126845, 118488, 104611, 91649, 89528, 86417, 79357, 76622, 72738, 62067, 53290, 46651, 45924, 48066, 50578, 46534, 39247, 33346, 26495, 17000, 7997, 7691, 6373, 713, -4345, -6137, -5432, -5502, -8895, -5534, -3826, -88, 3657, 5137, 6597, 5133, 5345, 9850, 9553, 9027, 8296, 6565, 8192, 13018, 14709, 18988, 19672, 14323, 11535, 14630, 16614, 17080, 12596, 11666, 15432, 17497, 18997, 22225, 26714, 29174, 31121, 27305, 23791, 22852, 25540, 28705, 27093, 22553, 23078, 23500, 23548, 26397, 28541, 28100, 31017, 35906, 41044]
12031D1044L359O001M158O447Q305J706R617J0120O455J463R016J6622K2541L1610
12017A78464N2300O9084Q4270J03327J13994J20289J22324J16366R3314O4032
12007A117764L7161p894m5060p1299q9692j02954j10463j02664r3388p6768o2682
11996C92061n5755l6646k9340l2824k3385j5867k1496k0800j6551j6656j3649
11985A09092j1955j0835j2722o166n026l759r598l420m418l605k701n157p261
11972B2469m211n23j831j322J239j871K397J040O243n365l536L005o86M195N90
11957B1833m134L084j324m18j24O603l67k942r38k436o37j343l214Q26L448L915
11941B1832L034j158K473j804j718j010l515J315l27K178j835K458P126N204k27
$$ y = [41044, 44403, 50404, 54562, 61009, 69314, 71020, 80637, 90757, 97212, 98675, 107691, 124313, 146854, 178464, 230764, 299848, 384118, 487445, 601439, 721728, 844052, 960418, 1053732, 1117764, 1154925, 1147031, 1101971, 1030672, 940980, 838026, 727563, 624899, 531511, 454743, 392061, 336306, 299660, 270320, 237496, 214111, 198244, 176748, 155948, 139397, 122741, 109092, 97137, 86302, 73580, 67414, 62388, 58629, 49031, 45611, 41193, 37588, 34887, 29730, 22469, 18258, 17735, 15904, 14582, 15821, 13950, 16347, 17387, 23630, 18265, 14729, 17734, 17048, 21243, 21833, 17699, 20783, 19459, 19041, 18917, 25520, 25153, 22211, 21273, 18837, 18200, 16857, 13643, 14469, 17917, 21832, 24866, 23708, 26181, 24377, 22659, 21649, 18134, 19449, 19122, 21300, 19465, 21923, 29049, 34253, 34026]
11926C4026p08j82n5j683l050N187J0259K661j065L083O215L839J855R819Q998
11911G9199O745Q410R270P656J4563J6374K5321L0266L3528L4464M0669M7761
11899C54226M8697O4066R2604J31589J83997K40928L01836L65662M18611M46293
11889B648509M47391M20604L48789K51570J26411j0310j36531k46736l26153l74792
11879C148752l93548l87280l51555k99449k49986j95757j50737j25583j09585
11870H85272r8064q9346p8550o8498n7332n9288n6736n0812m5622l4701k7764
11859B18559k4585k2000j3581j0504j4712j1935j5329j3185r594r729j613o327
11847F5465j0362n331M837j200l172l584l111j178m296n827l80N774q96m336k926
$$ y = [34026, 33318, 33136, 33081, 31398, 28348, 33535, 43794, 46455, 45390, 48473, 54688, 58527, 60382, 70201, 79199, 85944, 94354, 103624, 111280, 125843, 142217, 167538, 197804, 231332, 265796, 306465, 354226, 402923, 466989, 559593, 691182, 875179, 1116107, 1417943, 1783605, 2202216, 2648509, 3095900, 3516504, 3865293, 4116863, 4243274, 4232964, 4096433, 3849697, 3523544, 3148752, 2755204, 2367924, 2016369, 1716920, 1466934, 1271177, 1120440, 994857, 885272, 787208, 697862, 619312, 550814, 493482, 434194, 377458, 326646, 281024, 246323, 218559, 193974, 171974, 158393, 147889, 133177, 121242, 105913, 92728, 83134, 73405, 71792, 65465, 55103, 49772, 54609, 53409, 50237, 46653, 43542, 42364, 38068, 32241, 31861, 37635, 36739, 32403, 29477]
11832B9477k639m44k410m293R40M359J911j298n915n018n710M3l30K888L23k001
11816I883J303K650L080k974m703J282O791J345n907k380M58k799M20L570q00
11801A1219l568k002M011M507K679p35o784k447O78r73o50q3k493K020j577n96
11785C206M811j686L186p43j327J10r09J891k234J938N61q71J462K105k51k537
11769H712J983J081j944k317l131k1J087p28N729k649L046N104J60J622L657l119
11753A8272J615M117m238m826k021J54q75O05M391K168k435J615J04m823l0K877
11737A6670p51n358j380p59l077k690J143L741M067M14m508l282J8k411q41K25
11721A221J680L557j346l351J175J161N424k342o435j070L363R36n059m236k02
$$ y = [29477, 26838, 26394, 23984, 19691, 20631, 24990, 26901, 25603, 19688, 14670, 8960, 9003, 8673, 11561, 11884, 9883, 11186, 13836, 16916, 13942, 9239, 10521, 17312, 18657, 12750, 10370, 10828, 8029, 8449, 12019, 11219, 7651, 5649, 9660, 14167, 16846, 16111, 9327, 6880, 7558, 6585, 5935, 5852, 3359, 5379, 3802, 3206, 8017, 6331, 9517, 8774, 7447, 7557, 6648, 8539, 6305, 8243, 8804, 7933, 9395, 11500, 11249, 8712, 10695, 11776, 9832, 7515, 4384, 4363, 5450, 4722, 10451, 7802, 10848, 15952, 16112, 17734, 21391, 18272, 19887, 24004, 19766, 14940, 12919, 13073, 12198, 12803, 17194, 19362, 16927, 18542, 18646, 13823, 13793, 16670, 15919, 10561, 9181, 8422, 5345, 2655, 3798, 7539, 11606, 12020, 7512, 4230, 4248, 1837, 996, 1221, 2901, 6458, 5112, 1761, 2936, 4097, 9521, 7179, 744, -326, 3037, 3973, -1086, -5322, -5524]
11706e524N395P413k343l30o48K206K403j067l899k078j066n59k115K098N096
11691D982K124L541L928l826l407l659K875K09K979k282l47j308N22J046P007
11676A4384n918n389o857j164Q200K030o026k620k86j499j961M294j097J223O420
11661C734nj643K197J295j923j291J380M95m1J295k031L219P62J071n60m10j805
11644E739j063l297J252Pk479k932J165M592J265J306K835K815n217J041j747
11629E282l17O20J279J968r3j700K656n396o415N23J884K718J103J506r11k724
11613A983M766L696k08l643l148n79K356o30o247k609K561K222j13m90k181L143
11597H79J190m121k873M954O422L508o636m781M849L982l74j901j296j020p69
$$ y = [-5524, -129, 7284, 4941, 4611, 3963, 6169, 8572, 7505, 3606, 1528, 462, -97, -2212, -114, 4982, 7106, 10647, 14575, 10749, 7342, 3683, 6558, 6767, 9746, 7464, 7117, 5809, 6331, 7377, 14384, 8466, 3077, -3780, -4944, 3256, 5286, -740, -3360, -3646, -5145, -7106, -2812, -3909, -2686, 3734, 3729, 2086, 4283, 5578, 3655, 2364, 3744, 4239, 4198, 5493, 3462, 6681, 7443, 8514, 7954, 7544, 5739, 4676, 1379, 2631, 2638, 159, -2773, -1608, 2984, 4249, 5555, 8390, 11205, 5988, 7029, 5282, 4965, 5585, 6864, 8832, 8739, 7039, 9695, 4299, -2116, -1593, 291, 3009, 4112, 5618, 4707, 1983, 6749, 10445, 10237, 6594, 3446, 2867, 5223, 4593, -1654, -4263, -1702, 520, 407, -83, -2264, 879, 2069, -2052, -4925, 29, 6451, 9959, 3323, -1458, 3391, 7373, 6999, 5098, 3802, 2782, 2013]
11582B013l2J466k863p89K253L441L356r57m192m69Q02L919j770l578j768j957
11566a125N0M405j186L59n35J811k303J872j16K44mj062J977j955j378P89O31
11549B474m571j968O32o54k747L00O089K020q1K73P36l462jL802J134l040j517
11532e81L158L848J496j390L441L685j444n07r092m878j338j112l678j880O337
11517c935M712M278j381j33j600k271J991m423L367J782j448J090j667Q07o94
11502D75k559J307l894J674J383j612j120J496O49n92M517O8k227K746J492j367
11486B436J759P9n264m5J989J616k996Q09L287K004l786L57l121J37P913N668
11470A2842j049j949j348N257K300L528P140L254j766m961l459J731J594o256
$$ y = [2013, 1981, 3447, 584, -205, 2048, 5489, 8845, 7888, 3696, 3227, 4029, 7948, 6178, 2600, 832, -1125, -1075, 3330, 2144, 2503, 1968, 3779, 1476, 3348, 3232, 3476, 3472, 2410, 4387, 2432, 1054, 1843, 2474, -2097, -4065, -3433, -4087, -6834, -6534, -445, 1575, 1494, 1767, 2503, -959, -960, 2842, 3976, 936, -581, 2577, 6425, 7921, 6531, 9972, 13657, 12213, 11706, 2614, -2264, -3602, -4714, -8392, -10272, -3935, 777, 5055, 3674, 3541, 1941, -330, 1661, -2762, 605, 2387, 939, 2029, 362, 1169, 475, -2084, -777, -4671, -2997, -1614, -3226, -4346, -2850, -2201, -2793, 1724, 1792, -435, 2311, 3803, 2436, 4195, 4274, -990, -1035, 954, 2570, -426, 383, 3670, 5674, 1888, 2245, -876, -739, 7174, 12842, 11793, 9844, 8496, 13753, 16053, 19581, 26721, 29975, 28209, 23248, 19789, 21520, 23114, 16858]
11456A6858k775k970m456k914N7M579M155k271j69l083j295r2K155j887O529l579
11440H842j1053O14M290j013j548M95J440J676k458j782m918j317K895O48J519
11425a670R5J095l130m29N622N88o22M459K275Q61K373m284j952k530Q86P27M58
11408D822K329L501l633n799L44N663M35j74J485N46Q89j158p37o33N35l301k711
11391B403O300K556K986l003m274m981j331m80J148L007L668j605j76M199J300
11376A1717l939L300M163j906n436Q05K449j347j669L56O66L177k900l111L404
11361I729j1N616L159J879l497o415m156J720M07r64m365L255K481k737k231j6
11345C854j56L909k058k977K406M603l449l288j059K76M331k5m349K330n7k571
$$ y = [16858, 14083, 11113, 6657, 3743, 3800, 8379, 12534, 10263, 10094, 7011, 5716, 5624, 7779, 5892, 12421, 8842, -2211, -1597, 2693, 1680, 132, 627, 2067, 3743, 1285, -497, -5415, -6732, -3837, -3189, -1670, -1575, -480, -3610, -4039, 1583, 2171, 1549, 6008, 8283, 9144, 11517, 7233, 5281, 2751, 3637, 4364, 4822, 7151, 10652, 7019, 1220, 1564, 7227, 7662, 7488, 8973, 9519, 10408, 9250, 8513, 7880, 8415, 5114, 2403, 8703, 11259, 14245, 11242, 6968, 1987, 656, 176, 1324, 4331, 7999, 6394, 6218, 10417, 11717, 7778, 11078, 15241, 13335, 7899, 8704, 11153, 9806, 8137, 8493, 9159, 12336, 9436, 6325, 9729, 9718, 15334, 18493, 20372, 16875, 10460, 6304, 8024, 8431, 7467, 3102, 6357, 8838, 6101, 3870, 3854, 3698, 7607, 5549, 2572, 4978, 9581, 6132, 2844, 1785, 2061, 6392, 6367, 2018, 4348, 4291, 1720]
11329A720l848j624M253O685J722J186j713J163N25j459l184k696j081L871K42
11314E762j49n975L16J983j164k500J530p74o309m91K337K170Q0L006M62J450
11298A734J096m264o15K696M732J119m49o894l547N24j399K182K94O757M244J904
11282A0114k595J206k803k966J847m403m98k632j268L438J913L559k157k649m582
11267d476J157q36M0P780L018P06n116k617L37k460R01J291K467l127J69l45K959
11250A848L297q16M861m296n626K524J645M796K564Q26j595n429K585j638k129
11235C417N825M38j312l49k784j380L66l11m374l769M239K869K717J158l059k952
11219G39N85o55j554M614K229K54L385J317k670L319K854P55J089l840j473P57
$$ y = [1720, -2128, -3752, 501, 7186, 8908, 10094, 8381, 9544, 10069, 8610, 5426, 2730, 1649, 5520, 5762, 5613, -362, -46, 1937, 773, -1727, -197, -971, -7280, -7771, -5434, -3264, -3184, -178, 284, 1734, 2830, -1434, -2049, 647, 5379, 6498, 6049, -845, -4392, -3868, -5267, -3085, -2791, 3966, 8210, 10114, 7519, 8725, 5922, 2956, 4803, 400, -98, -2730, -3998, -560, 1353, 4912, 2755, 106, -4476, -3319, -4155, -4115, 3665, 6683, 7389, 2273, -344, -7, -2467, -1566, -275, 2192, -935, -766, -1111, 1848, 5145, 4329, 9190, 4894, -732, 1792, 3437, 8233, 10797, 11623, 10028, 4599, 7184, 5546, 3417, 9242, 9680, 8368, 8019, 5235, 3855, 4221, 3910, -464, -4233, 6, 2875, 5592, 6750, 3691, 739, 1324, 669, -885, 3729, 5958, 6212, 9597, 10914, 8244, 11563, 14417, 15172, 16261, 12421, 10948, 11705]
11203A1705j172q4J8o196n797J368J757Q324L544k007j783K120k564l000M103
11188A0336J350j919m869L723K227j024o533J116L442m643j14M144M292L809n251
11173A0086k39K359j474O84j62j26p12m312J870M884K124j028L90N025j481m314
11157A3574j167m315j979J157j491l254J913J155L321j460K57M14K971O673J668
11142A9437K121q36j034J671n90q20j454J77J539L074J223P070M184M380k602
11127C7540l571L961K438L575N657O525J0131O153J1758R272J4003J4829J7518
11114A39789J0525Q332k736m56m018j4371j6716q522j0869j0172m544r437q414
11101F8391q204l091k925l217l885o445j399j92k522n102l890j366K89j403m992
$$ y = [11705, 10533, 10449, 10467, 4271, -1526, -158, 1599, 9923, 13467, 11460, 9677, 11797, 9233, 6233, 10336, 11686, 9767, 4898, 8621, 10848, 9824, 3291, 4407, 7849, 3206, 3092, 7236, 11528, 15337, 10086, 9847, 12206, 10732, 11416, 11254, 11128, 10416, 6104, 7974, 12858, 14982, 13954, 14344, 19369, 17888, 13574, 12407, 8092, 6113, 7270, 5779, 2525, 4438, 5593, 8914, 7454, 7711, 8125, 11096, 17769, 19437, 21558, 20722, 19688, 21359, 20769, 19949, 18495, 18672, 20211, 23285, 24508, 31578, 35762, 40142, 37540, 33969, 37930, 40368, 43943, 49600, 56125, 66256, 72409, 84167, 93439, 107442, 122271, 139789, 150314, 158646, 155910, 155454, 151436, 137065, 120349, 111827, 100958, 90786, 86242, 76805, 68391, 60187, 57096, 54171, 50954, 47069, 40624, 39225, 39033, 36511, 31409, 27519, 26153, 26442, 25039, 20047]
11086B0047k724j569k305m446P92N915N59L69j041m34j422l675k695N489R79m519
11070I320j632L752L505k420k106n40m998j420L908N258K264l16l181l6n60M490
11054A5288M246p43j355n511K8o54J001j333j145k360m225K287M486k922j136
11039E952K075r54j8J297q50K435N6k507q0J006k720K301J034l237K430J669P
11022I896L510L149N53k682m85k101j596K901L62J225m153J760o73k999L284K807
11006A4758L905O88o58l090J351n09J469L614l739k820K746l723n236K907P943
10991A9606n463m675k407l830K231k892j742j286q57P79M744N044k067k789J103
10976E499Q684q10o438n97J745N320J093P88j390l41J610L280p95R82L95k809
$$ y = [20047, 17323, 15754, 13449, 9003, 9795, 15710, 16269, 16638, 15597, 15163, 13741, 10066, 7371, 12860, 13839, 9320, 7688, 11440, 14945, 12525, 10419, 9879, 4881, 3461, 7369, 12627, 14891, 14575, 11394, 11358, 10798, 15288, 19534, 18791, 17436, 11925, 11953, 11299, 12300, 10967, 9822, 7462, 3237, 5524, 10010, 7088, 5952, 8027, 7073, 7055, 8352, 7502, 9937, 9993, 7486, 7406, 8412, 5692, 7993, 9027, 5790, 8220, 9889, 9896, 13406, 16555, 17108, 14426, 13941, 11840, 10244, 13145, 13507, 14732, 10579, 12339, 11666, 8667, 11951, 14758, 18663, 19351, 18693, 15603, 16954, 16445, 17914, 21528, 17789, 14969, 17715, 13992, 8756, 11663, 19606, 14143, 9468, 7061, 3231, 5462, 2570, 828, -458, -1315, -536, 4208, 9252, 7185, 4396, 5499, 14183, 13373, 6935, 6338, 8083, 13403, 14496, 15284, 13894, 13553, 15163, 18443, 17648, 18630, 19025, 16216]
10960A6216l644J007l47k028m984J446l054l346M90O647r39k711J6k24M0K926
10944G511Q66K888J116P67m05j803N45M072l20o812l876N306N884L635L13j908
10928A7779k713k230n988J028j22m805m219J372L959M042K566k208l00L619R439
10913B1219j322l361o61J945l612L125J681l444n913K852N798L655l623l149j389
10898A3801RQ67L066o002k519L377N035L413N53O29K668k810J269N367J480k866
10882B7337j598l596K347L099J093k276L044L254o492l081K727M216M393L855
10868C8322k518o957k235N79O476j316l439p95M410M265K164j517j940n702m651
10853B5146j517M037n25k09M849N070J195n01m09q69J954J634k288J478L579J362
$$ y = [16216, 12572, 13579, 13232, 11204, 6220, 7666, 4612, 1266, 1756, 8403, 7464, 4753, 4769, 4545, 4585, 7511, 8377, 11265, 12381, 13148, 12743, 10940, 11485, 15557, 15237, 8425, 4549, 9855, 15739, 19374, 19687, 17779, 15066, 12836, 6848, 7876, 7754, 2949, -1270, 102, 4061, 8103, 10669, 8461, 8161, 11780, 21219, 19897, 16536, 15875, 17820, 14208, 17333, 19014, 15570, 9657, 12509, 18307, 21962, 18339, 15190, 13801, 13810, 14677, 17743, 11741, 9222, 12599, 17634, 21047, 21600, 22229, 24897, 22087, 23356, 28723, 30203, 27337, 25739, 22143, 24490, 27589, 28682, 26406, 29450, 32704, 26212, 23131, 25858, 30074, 34467, 38322, 35804, 28847, 26612, 27191, 33667, 32351, 28912, 28117, 32527, 36792, 38956, 37439, 35499, 29797, 25146, 23629, 27666, 27141, 26932, 31781, 36851, 38046, 37545, 37136, 36267, 38221, 39855, 37567, 39045, 42624, 43986]
10837D3986M630L811P543N826j365l908q043n092n810J312K993M098K842P224
10823F0047Q045O183j475m816l121r78O83m106m184q76k935J217K135j991l277
10808E0551M32l872l333j988L315K529P598O948L681j501q38R335K414L311P799
10793H6381N469Q097O360P384J1631J3617J8212K3434L1127M7802O1414J02000
10781D22928J58721K50823L80269N04590N04092K92624K1533j78687l41858m24742
10771A590293l88724k80159j81378j13131p4045n5990m7547m1351m1231l8984
10761C27753l6405k9803k2132k4111k4015j4071j6844j8199j1173j3685j4274
10750A03041j1586m866n585r717p261q713j717L475J774N28P04J015J188l396
$$ y = [43986, 48616, 52427, 59970, 65796, 64431, 60523, 52480, 47388, 41578, 42890, 45883, 49981, 52823, 60047, 68092, 74275, 72800, 67984, 64863, 63885, 64568, 60462, 56278, 55402, 52467, 53684, 55819, 53828, 50551, 50983, 47111, 43778, 41790, 45105, 47634, 55232, 62180, 65861, 64360, 63522, 72857, 75271, 78582, 86381, 91850, 99947, 106307, 113691, 125322, 138939, 157151, 180585, 211712, 259514, 320928, 422928, 581649, 832472, 1212741, 1717331, 2221423, 2514047, 2535580, 2356893, 2015035, 1590293, 1201569, 921410, 740032, 626901, 552856, 496866, 449319, 407968, 366737, 327753, 291348, 261545, 239413, 215302, 191287, 177216, 160372, 142173, 131000, 117315, 103041, 91455, 86589, 81004, 71287, 64026, 55313, 53596, 57071, 58845, 59373, 60077, 61092, 62280, 58884]
10736E8884j636K569j452M703P347l564j0040m897k019k467k83j541jM774j255
10721D9122l156l59k814Q34M293P598J392p19m98K677K687J8478K1593K0635K4380
10706A46143J1098p213j4374k3485k2298k1916j7288j1335n064J446L617j221
10694C8110m610Q65p372n493J24L489K800m2K785m051q618m467m889n036l554
10679D1L086q77n141J999l937m57q63q651m290O081J5720J9702J8526J1940N257
10664E8136J978l123m123n961o439o124m029K11r42n74J856N391n472q012l274
10649A9499J876j414q55K029P067P867J0255R893K289J732J939l221m67M568R86
10634F4043o247P06K68k14l787m632j919o036J129R189O713K457L61K038J961
$$ y = [58884, 57248, 59817, 58365, 63068, 70415, 66851, 56811, 51914, 49895, 47428, 47145, 45604, 45603, 50377, 49122, 45966, 45607, 42793, 43627, 47920, 55518, 56910, 56191, 55693, 58370, 61057, 79535, 101128, 121763, 146143, 157241, 150028, 135654, 112169, 89871, 67955, 50667, 39332, 34268, 35714, 39331, 38110, 33500, 34365, 26993, 21500, 21624, 25113, 27913, 27871, 30656, 26605, 17987, 13520, 8631, 3595, 41, 3127, 2250, -2891, -892, -4829, -5286, -6149, -14800, -19090, -13009, 2711, 22413, 40939, 52879, 58136, 60114, 56991, 52868, 46907, 40468, 34344, 30315, 30526, 29584, 29010, 30866, 36257, 30785, 22773, 19499, 21375, 19961, 19106, 21135, 28202, 36069, 46324, 56217, 58506, 60238, 62177, 58956, 58489, 63057, 64043, 57796, 58502, 58770, 58556, 54769, 50137, 48218, 42182, 43311, 52500, 59213, 61670, 62031, 64069, 66030]
10619F6030Q711J0729K3017L0814K7409L6517L9492L7633L8864K7225J0817o229
10607C51029l1012l7393k4067j8206l0043k9040k6877k2784j4836q670k160N853
10595A11794M086K026l67l919o906p112m85J28J07N248R733N488M35l297m009
10580A12950l852m894r151j0190j3827q372k491j739J046O420L716N472N089l655
10566G6522j0754j4375n087L157M183Q570K2714K8187K4444K0922P813j565N186
10553A69917M159K013p658j2031j1273j9624k0310j8892j6627j0550r070J350
10541E1404J2172J7221J9707J4305O542l077j4427k1549j9705j0163m077M006
10529E2359O627P704J4220J3968R737J1610P806N041J91l569N499J0904P211j940
$$ y = [66030, 74741, 85470, 108487, 139301, 166710, 203227, 242719, 280352, 319216, 346441, 357258, 351029, 320017, 282624, 258557, 240351, 210308, 181268, 154391, 131607, 116771, 108101, 105941, 111794, 115880, 117906, 117539, 113620, 106714, 99602, 99117, 99245, 99352, 104600, 114333, 119821, 120256, 116959, 112950, 109098, 104204, 95053, 84863, 71036, 62664, 60173, 58434, 59480, 65900, 69616, 75088, 80177, 76522, 65768, 51393, 46306, 49463, 53646, 62216, 84930, 113117, 137561, 158483, 166296, 164731, 169917, 174076, 176089, 168431, 156400, 145127, 125503, 105193, 86301, 69674, 59124, 50054, 51404, 63576, 80797, 100504, 114809, 121351, 118274, 103847, 82298, 62593, 52430, 48353, 52359, 58986, 66690, 80910, 94878, 104615, 116225, 124031, 129072, 129263, 125694, 131193, 142097, 149308, 147368]
10515A47368n040K757J123k824j147J112O454J0535J1653O558l080o798q236o974
10501A53461o44K210J2787K2678K6716L3676L7958O1209P8519Q3621P7794O2919
10489F52904K8313j4236l1083m005K0880L3155M1050O7465Q7503M2621m5762p8595
10477H00210o4217m2028k5586j8200j0534p947m041k554j837l066K592O970J4114
10464F43876J1712P663N045j32q55j1021j6498j5143j4458j5024j4859j0712J702
10451E71296N803M964k344l268K053l607j3588j8208j4201j3424l273N202J3076
10438E30481J5759J7765J9434J8651J6128R050Q886J2572K3087K8167K8114K8650
10426G56744K5234J4851R225J0202J6211K3403L0359M0659M3118L4945K9952K2946
$$ y = [147368, 142328, 145085, 146208, 143384, 142237, 143349, 149803, 160338, 171991, 178549, 175469, 168671, 160435, 153461, 152817, 155027, 167814, 190492, 217208, 250884, 288842, 350051, 428570, 512191, 589985, 652904, 681217, 666981, 635898, 631893, 652773, 685928, 726978, 794443, 881946, 924567, 878805, 800210, 735993, 693965, 668379, 650179, 639645, 631698, 627657, 625103, 623266, 620200, 622792, 629762, 643876, 655588, 663251, 668296, 668164, 667309, 656288, 639790, 624647, 610189, 595165, 580306, 569594, 571296, 577099, 582063, 579719, 576451, 578504, 574897, 561309, 543101, 528900, 515476, 512203, 517405, 530481, 546240, 564005, 583439, 602090, 618218, 627268, 636154, 648726, 671813, 699980, 728094, 756744, 781978, 796829, 806054, 816256, 832467, 855870, 886229, 926888, 970006, 1004951, 1034903, 1057849]
10414A057849J2882P906R021J7008L2540N3067O1257P8459R1892R9742J18703
10403A640326J51125K09849L00934L88113L99678K55105Q9286j2116r4864j27128
10393C200308p3025J9831R4175J41487J58328J65430J88075K31198K81035L23047
10383D729889L73672M41834N23533O22922P33979Q67138J049895J249285J315245
10374A1907392J248128J260178J418282J663095K057559K692964L550869M676871
10366C0475338O331099Q949908J3162400J9829070L0232864M5879127O6998710
10359B21858516Q7131976Q5521906M8332028K857687k7098760n0563619o9058645
10352B98981089o9867051n4108374l5722193k2409859j4072725r293212p542253
$$ y = [1057849, 1070731, 1078637, 1087658, 1104666, 1137206, 1190273, 1251530, 1329989, 1421881, 1521623, 1640326, 1791451, 2001300, 2302234, 2690347, 3090025, 3345130, 3434416, 3422300, 3327436, 3200308, 3127283, 3147114, 3241289, 3382776, 3541104, 3706534, 3894609, 4125807, 4406842, 4729889, 5103561, 5545395, 6068928, 6691850, 7425829, 8292967, 9342862, 10592147, 11907392, 13155520, 14415698, 15833980, 17497075, 19554634, 22247598, 25798467, 30475338, 36806437, 45756345, 58918745, 78747815, 108980679, 154859806, 221858516, 308990492, 394512398, 442844426, 445702113, 418603353, 368039734, 298981089, 229114038, 175005664, 139283471, 116873612, 102800887, 93507675, 85965422]
10345H5965422p948819q574229q300691p374151o270973n296549m649690m268743
10337C3281577l938948l602216l263710k858427k395790j966716j635042j394137
10329A2226591j223340j103164j011189r26091q40635p56410o60330n52257m62445
10320D690730l81259l20109k76092k53265k23580j96959j77449j69947j64908
10311B527162j49921j21263j04482r7592q9954p5413o4014o6041o9926p7936q7151
10300A523469q7732q0175p4162o1100n0055m1604l1844k9923l2377l6233l3261
10289I65003l7546m3410l3112k3441j4993j4819j6419j9736j6647j8385j6635
10278G09860k0935j6671q775r145q104j355k900j0649q907q704j6883k0497k6122
$$ y = [85965422, 78016603, 69442374, 61141683, 53767532, 47496559, 42200010, 37550320, 33281577, 29342629, 25740413, 22476703, 19618276, 17222486, 15255770, 13620728, 12226591, 11003251, 9900087, 8888898, 7962807, 7122172, 6365762, 5705432, 5153175, 4690730, 4309471, 3989362, 3713270, 3460005, 3236425, 3039466, 2862017, 2692070, 2527162, 2377241, 2255978, 2151496, 2053904, 1963950, 1888537, 1824523, 1758482, 1688556, 1610620, 1523469, 1435737, 1355562, 1281400, 1220300, 1170245, 1128641, 1096797, 1066874, 1034497, 998264, 965003, 927457, 884047, 850935, 827494, 812501, 797682, 781263, 761527, 744880, 726495, 709860, 688925, 672254, 663479, 654334, 646230, 644875, 641975, 631326, 622419, 613715, 596832, 576335, 550213]
10265E50213j9550j7338k1499j2437p910q935j3554j5602j7692j6223k1659k7404
10253C50410k9931k1440p990j0379o307n346k860l572p533p462j1475j9078j7086
10240A99951j1671r245p040o405q029j7989m6759r1236o9755N7331J59256J69759
10228C18168J45571R9875M5269R746j5993l0640k9477k8241k4173j2984k570J063
10216D75614N489R437N877J917p375j0362j8424j8172k0378k4779k3446j0908
10204C64490o404n024m413o880j0980j0336j6021j5697k0774j6129p081n201p384
10191B32166o483o201r710J68M018R654R826J1303J5457L948p573j7521k6926
10178B12126k8956k1414j3043q53J2415J8542K0189J4972O455m46j0041j3518
$$ y = [550213, 530663, 513325, 491826, 479389, 471479, 462544, 448990, 433388, 415696, 399473, 377814, 350410, 320479, 299039, 291049, 280670, 274363, 269017, 266157, 262585, 255052, 247590, 236115, 217037, 199951, 188280, 179035, 171995, 165590, 157561, 139572, 92813, 1577, -68178, -10847, 148409, 318168, 463739, 563614, 608883, 618629, 602636, 571996, 542519, 514278, 490105, 477121, 474551, 475614, 481103, 490540, 496417, 498334, 490959, 480597, 462173, 444001, 423623, 398844, 375398, 364490, 358086, 353062, 348649, 341769, 330789, 320453, 304432, 288735, 267961, 251832, 244751, 239550, 232166, 225683, 219482, 209772, 209940, 213958, 223612, 233438, 244741, 260198, 264146, 256573, 239052, 212126, 183170, 161756, 148713, 147860, 160275, 178817, 199006, 213978, 220433, 219987, 209946, 196428]
10166A96428k3651k5616k8614j7880j2891j7323j4267j4211p294o14J2150J7565
10154F3782K6931K6490K9397K2344J3467N874l06j862n936k091O164J3512K1649
10141B19415K7275K7797L6834O0136Q6106J43496K14748K69378J80680J9523p0618
10130A214770j39083k07449k03941j44239q3562m5967k7806k0471k1129k0975
10120C00148j5043j3810p259o564j2465j7229j6767j7643j8116j3306j1107o910
10108A43929O687J3114O007R901J2010J0354L898l236l547l703l769l615p55L390
10094A90665O729L651k899R61k062p352j1797j016m334r472o956n688k119n474
10080A42837j249M690J856j891j993k025l807p57l147M699P194Q845P108N612
$$ y = [196428, 172777, 147161, 118547, 100667, 87776, 70453, 56186, 41975, 34681, 34067, 46217, 63782, 90713, 117203, 146600, 168944, 182411, 188285, 187979, 186117, 180181, 178090, 184254, 197766, 219415, 246690, 274487, 311321, 371457, 457563, 601059, 815807, 1085185, 1265865, 1285388, 1214770, 1075687, 868238, 664297, 520058, 436496, 390529, 362723, 342252, 321123, 300148, 285105, 271295, 264036, 257472, 245007, 227778, 211011, 193368, 175252, 161946, 150839, 143929, 150616, 163730, 169737, 179638, 191648, 202002, 205900, 202664, 199117, 195414, 191645, 188030, 187275, 190665, 197394, 201045, 198146, 199107, 197045, 189693, 177896, 176880, 172546, 163074, 156118, 150430, 148311, 142837, 141588, 146278, 148134, 146243, 144250, 142225, 138418, 137661, 134514, 139213, 146407, 155252, 162360, 167972]
10066A67972J2991J1847R345k701M944Q895P715P361K187R650J4770J6479J7673
10053B89128J7802K3537K9844L7450M7168N6436P0592P6990Q1377P8769Q1556
10042H90649R1745J22763J59017K21517L17478M82798P35075J135514J751476
10033E908032K582382L359290L520378K652653R86481o83971k021328k821263
10025A3482654k926511k436032j721175j108918o98637m72421l71230l45486l50439
10016C051805l33743l01049k59514k34282k18347k09163k10848j93757j54258
10007I36844j33860j08613q0829n4911m1296l3039l0596l6552l7835l6397l6424
9996C06492k8785k2575j6223j2157j4309j7539j7375o767n034o360p066q109p259
$$ y = [167972, 180963, 192810, 202155, 199454, 204398, 213293, 221008, 228369, 230556, 240206, 254976, 271455, 289128, 306930, 330467, 360311, 397761, 444929, 501365, 571957, 648947, 730324, 809093, 890649, 982394, 1105157, 1264174, 1485691, 1803169, 2285967, 3021042, 4156556, 5908032, 8490414, 11849704, 15370082, 18022735, 19009216, 18325245, 16303917, 13482654, 10556143, 8120111, 6398936, 5290018, 4591381, 4118960, 3747730, 3402244, 3051805, 2718062, 2417013, 2157499, 1923217, 1704870, 1495707, 1284859, 1091102, 936844, 802984, 694371, 613542, 558631, 517335, 484296, 453700, 417148, 379313, 342916, 306492, 277707, 255132, 238909, 226752, 212443, 194904, 177529, 170762, 165728, 159368, 152302, 144193, 136934]
9983A36934q901o122l424j465k540n456k9J852M464R9p63j115O83m027n489k78
9967A04423l578r11L483k154k005k275O99l654l17j705L550P941J426o62K940
9952A07201L823P358N334M224J3173P389M022M530Q957J5274J9293K6280L3849
9939B60707M9402Q1113J13268J84189K77842M04824N13147M69220K23529l4233
9929B543008k19589l70747m36475l69633k58117j63119j01310o4356m4860m3215
9919D71587m5276m4705m3401l7532l6091k5198j8307j5343j1138l393r552q898
9907A72753j2782k3128k4918j5386o793m335J337Q48m304k306m407o747n692o422
9893E7718o462q244n724K13M057J0088M334M835J902J975K996q86m194p493J700
$$ y = [136934, 128033, 121911, 118487, 117022, 114482, 109026, 108997, 110849, 115313, 115412, 114649, 113534, 114217, 110190, 104701, 104423, 100845, 99934, 103417, 101263, 99258, 96983, 97682, 94028, 93711, 92006, 95556, 103497, 104923, 104261, 107201, 111024, 118382, 123716, 127940, 141113, 148502, 152524, 157054, 166011, 181285, 200578, 226858, 260707, 310109, 391222, 504490, 688679, 966521, 1371345, 1884492, 2353712, 2577241, 2543008, 2323419, 1952672, 1516197, 1146564, 888447, 725328, 624018, 559662, 514802, 471587, 426311, 381606, 338205, 300673, 264582, 239384, 221077, 205734, 194596, 191203, 181651, 172753, 159971, 136843, 111925, 96539, 89746, 85411, 86748, 87596, 83292, 80986, 76579, 69832, 64140, 57718, 51256, 43012, 37288, 37501, 41558, 51646, 55980, 60815, 62717, 64692, 67688, 66802, 62608, 55115, 56815]
9878E6815j473Q99k572o9L3j095O69k86J31k456m670m880J232k973n379j919J402
9861C3409M507p46m570J811N977l787L360N284L42k332j132m593k631M432J113
9846D0444j700m130m65o8j8J454J810Q43N33J027J45j717l733k601Q07K69l422
9829B9478n144l154L287O897L961N119l11j878N22l378l448L694L953k14j99K93
9813C9478k806J024j542M58n019o521j148o52j343j663L645l409L885N590o8k316
9797B7593M513K166L594r94k421l301q14M068r1k56K164m660l003j735o22K361
9781B8562J725k245K299j088p66q89J305j752l31j658r13K684j446R93K473J581
9765C0534J599o74J3N06O544J110n471m887P34j118j501n056o42O091n004k463
$$ y = [56815, 55342, 56241, 53669, 53600, 53633, 52538, 53207, 52921, 53052, 50596, 45926, 41046, 42278, 39305, 33926, 32007, 33409, 37916, 37170, 32600, 34411, 40388, 36601, 39961, 45245, 45587, 43255, 42123, 37530, 34899, 39331, 40444, 38744, 34614, 34149, 34081, 34063, 35517, 37327, 38170, 38703, 39730, 39875, 38158, 34425, 31824, 32631, 32900, 29478, 24334, 21180, 24467, 31364, 35325, 40444, 40133, 38255, 38777, 35399, 31951, 35645, 39598, 39384, 39185, 39478, 36672, 37696, 36154, 36612, 31593, 25072, 23924, 23272, 21929, 20266, 23911, 20502, 24387, 29977, 29909, 27593, 32106, 34272, 37866, 36872, 34451, 31150, 30336, 34404, 34313, 34057, 36221, 31561, 28558, 26823, 26201, 28562, 30287, 28042, 30341, 29253, 28487, 27598, 28903, 27151, 26820, 25162, 24249, 26933, 25487, 26480, 28953, 30534, 32133, 31459, 31472, 31978, 38522, 39632, 34161, 29274, 30008, 28890, 27389, 22333, 21691, 27782, 22778, 20315]
9749B0315K455J748k431K578K686N97o523J421P956M405k43K860P30l325P35k903
9733C3061j30M27k461r57k048Q4k984k332J003P699K22j22M527O33k861l976k279
9716B7506q36M629L171l228q46J370N18P0J927R2J354J679n120l809k695J030
9700B6812M048L558o68r72k544n702J186K676N894L000J927K638J60l026n837
9685C3150q026m215n74M066K124P77k160k854J842K701K361K102n24J157J084
9670C3011j072M964q50o744l058N67K524n191o035L194K549N219k614k707j695
9655B2062O9o498n449R73L883M716J684J27J129K375K935k45J52L52j180k750
9639B4335j968J67K59j542K541K366N475N070Q27n578l899K39l492q164j994J712
$$ y = [20315, 22770, 24518, 22087, 24665, 27351, 27948, 21425, 22846, 30802, 35207, 34964, 37824, 38554, 35229, 35964, 33061, 32931, 33358, 30897, 29940, 27892, 27976, 24992, 22660, 23663, 31362, 31584, 31462, 35989, 36622, 33761, 29785, 27506, 26670, 31299, 34470, 31242, 30396, 31766, 32284, 32354, 34281, 34373, 35727, 37406, 32286, 28477, 25782, 26812, 30860, 34418, 33750, 32778, 30234, 24532, 25718, 28394, 34288, 37288, 39215, 41853, 42013, 38987, 33150, 25124, 20909, 20335, 24401, 26525, 27302, 25142, 22288, 24130, 26831, 29192, 31294, 30770, 31927, 33011, 31939, 36903, 36053, 29309, 26251, 26818, 29342, 24151, 18116, 21310, 23859, 29078, 26464, 23757, 22062, 22131, 15633, 10184, 11157, 15040, 19756, 21440, 21567, 22696, 25071, 28006, 27761, 27913, 28265, 27085, 24335, 22367, 22534, 22793, 21251, 23792, 26158, 31633, 36703, 37530, 31952, 28053, 28292, 24800, 16636, 14642, 16354]
9623A6354j385J561N420M630K527m532k276K326L108K197L419J640J1797J7356
9609F4142P841N831O161O009L672l099n625m521o364n611p544o584n845o332J983
9594D4114k001l960j135j066l349o229k950j683N786L055j18n114m448K020K833
9579B5755j58K20K44k076m53j269j049k856j006n69l176L902K711O90M112J473
9563B6495p56j503l051L269j411l346J701k551J766k791L380L837j640m638n57
9548A8204N347N084M72l952l430Q62M50l817o74R397K372m686L89O61m633K55
9532B2301J795k983k113O98L078L790k623m919O22O42N10j270j338j964P315M831
9516B8372j946j837k300m717l056L486L960J434J224J730j205j120L019L89M172
$$ y = [16354, 14969, 16530, 21950, 26580, 29107, 24575, 22299, 24625, 27733, 29930, 33349, 34989, 46786, 64142, 71983, 77814, 83975, 89984, 93656, 90557, 84932, 80411, 74047, 68436, 60892, 54308, 48463, 42131, 44114, 42113, 38153, 37018, 35952, 32603, 26374, 23424, 21741, 27527, 30582, 30464, 25350, 20902, 22922, 25755, 25597, 25817, 26061, 23985, 23532, 22263, 21214, 18358, 17352, 16783, 13607, 17509, 20220, 20910, 25022, 26495, 25739, 24236, 21185, 24454, 23043, 19697, 21398, 18847, 20613, 17822, 21202, 25039, 23399, 18761, 18204, 23551, 28635, 29107, 25155, 21725, 22587, 23037, 19220, 18546, 27943, 30315, 25629, 26018, 26679, 22046, 22301, 24096, 21113, 19000, 19698, 22776, 26566, 23943, 19024, 19646, 20288, 20798, 19528, 18190, 16226, 23541, 28372, 26426, 24589, 22289, 17572, 14516, 18002, 21962, 23396, 24620, 26350, 25145, 24025, 27044, 27433, 31605]
9501C1605L813RM0R87J534k408m06q807l633M007L092k77k089j538j581K436M851
9484C1635m43l38L24M60n181j934j473l496l271r78L631J0514L028k573k84l97
9468B9224R33K060m534p240l680j237L297M069L096l004N03j168j418L637J835
9453B6373k257p8M187N1l667p97l408K976k521o302K109O973J274k90k67j732
9437B2624N05K943K772m671l211M467J382j679J468l42j66k419n79J270j446M495
9421B7413L34K313k998k060K87k121J882N499l39l551L703K484p61J524P37p62
9405C3584j918k920j530K862j379o652Q0L513N15J957J724j199J099k37p54j493
9389B7252K326j195j909k342k655l44L892L678L448o95j791k063n13j643N13m24
$$ y = [31605, 35418, 35427, 35467, 36454, 37988, 35580, 35174, 26367, 22734, 26741, 29833, 29556, 27467, 25929, 24348, 26784, 31635, 31192, 30854, 31178, 31638, 26457, 24523, 23050, 19554, 16283, 15305, 18936, 29450, 32478, 29905, 29621, 29224, 30157, 32217, 27683, 20443, 16763, 15526, 18823, 22892, 25988, 22984, 23487, 22319, 20901, 24538, 26373, 24116, 24038, 28225, 28276, 24609, 23812, 20404, 23380, 20859, 14557, 16666, 23639, 24913, 24623, 24356, 22624, 23129, 26072, 28844, 24173, 20962, 25429, 26811, 25132, 26600, 26258, 26092, 23673, 23094, 24364, 22918, 27413, 27747, 30060, 27062, 25002, 25289, 23168, 25050, 30549, 30210, 26659, 30362, 32846, 32085, 33609, 34346, 33584, 31666, 28746, 27216, 30078, 28699, 22047, 22127, 25640, 26155, 28112, 29836, 28637, 29736, 29499, 28745, 27252, 29578, 28383, 26474, 24132, 21477, 21133, 25025, 28703, 32151, 31456, 29665, 27602, 27089, 25446, 25959, 25535]
9373B5535K585l077o94N765l893k223k636N77N824K499L716J57r95m936O02K954
9357C1760L91M13L762O36N22k113n374k461J37l42j249K319J365N288K951R90
9341C8995l298j938k570j784K143J651M678k196m100j072L270O90n84l635J697
9326C1947Q38P646L540j485n800k239L067j512k133L79L6J816K26q87j061K727
9310C7105j214J554K826R65j645p48J691N5q18K438J352L004K375m768N01p64
9294D3909l335o368M570K179k504l776k240m00J342K546k185k496K950N787L243
9279D3222m145n7Q99J258j404J521M003k795l073J775M54Q64M456O289p73j246
9263E1248l994M77O61k894k633l413j08N172k917M47K093l339k019K160J590K533
$$ y = [25535, 28120, 25043, 24349, 30114, 26221, 23998, 21362, 21939, 27763, 30262, 33978, 34135, 33140, 28204, 28806, 31760, 32151, 32564, 36326, 36962, 37484, 35371, 29997, 27536, 27673, 27331, 26082, 28401, 29766, 35054, 38005, 38995, 35697, 33759, 31189, 29405, 31548, 33199, 37877, 35681, 31581, 30509, 33779, 34469, 33885, 30250, 31947, 32785, 40431, 43971, 42486, 36686, 34447, 37514, 36002, 33869, 34248, 34284, 36100, 36326, 35439, 34378, 37105, 35891, 37445, 40271, 41236, 39591, 38843, 40534, 40589, 39771, 42209, 43561, 46565, 48940, 44172, 44673, 43909, 40574, 34206, 38776, 40955, 38451, 34675, 32435, 32035, 33377, 35923, 33738, 31242, 34192, 39979, 43222, 39077, 39020, 39919, 41177, 39773, 41294, 45297, 42502, 39429, 41204, 41658, 42522, 46978, 53267, 52494, 51248, 47254, 47731, 48392, 45498, 42865, 39452, 39344, 44516, 41599, 42046, 44139, 40800, 38781, 40941, 42531, 45064]
9247D5064l687l712m46N357J311k267n798m119J155M549O117L977L901o62K835
9232E3575r91K39l45k687p11l222k892L578j38K81K162L230m323K332j611l297
9216D5180l814k116K321L376K086P073L130o259n089K348M388J089J608O49n949
9201E0021j231O975L010J356k421n334l267j963J930L510l290k906N80P715m3
9186E4642n99L105J189l194l695R613Q573j647r637m065m90P97J504O027j256
9171F0867j851j572k435k050J619j117n61q26j5L392M257m72n371o18N006M661
9155F2914J772n174j263k437J350J394L727J246L58l11l851k24L55M620K4P09
9139F5209k669j580k43N909P209N025K316j09m119m498M38J972J970n577k262
$$ y = [45064, 41377, 37665, 37219, 42576, 43887, 41620, 35822, 31703, 32858, 37407, 43524, 47501, 51402, 50740, 53575, 52584, 52823, 52478, 49791, 49080, 45858, 42966, 46544, 46406, 46687, 48849, 52079, 47756, 50088, 48477, 45180, 41366, 39250, 41571, 44947, 47033, 54106, 57236, 50977, 45888, 48236, 52624, 53713, 55321, 55970, 50021, 48790, 55765, 58775, 60131, 57710, 52376, 49109, 47146, 49076, 52586, 49296, 46390, 46970, 54685, 54642, 54043, 57148, 58337, 55143, 51448, 61061, 69634, 67987, 58350, 54285, 53795, 54592, 56096, 62123, 60867, 59016, 57444, 55009, 52959, 54578, 53461, 52900, 52074, 52059, 55451, 59708, 59236, 53865, 53247, 58253, 62914, 64686, 59512, 58249, 55812, 57162, 58556, 62283, 63529, 63887, 63576, 59725, 59501, 59856, 64476, 64500, 65209, 62540, 60960, 60717, 66626, 73835, 78860, 81176, 81067, 76948, 72450, 72888, 74860, 76830, 71253, 68991]
9124F8991L902o60m054n27K489N130J916N06K204K34k793m070M072J907k048n9
9108G7140j179m820L474r8j513M681K536l196j837K079p33L424N59m328k929K603
9092G5863J235K832r40n732P142O231J424j744l882n025j839K233J17L463M962
9077H6340r12m369O78j181J931O527J030J611L455O98L05M83L348m52o227k378
9061I0887J416J402J666J163j358k475J230N046K194j468l798k05J686K800L389
9046A03575M61k850p427p45Q560L789J175k112j393n043J054M818M023n915k874
9031I9096L672O372J333L065J073L557k73p65P78l140K735O61l495L696J970k910
9015A17425k411K708J757M139L469m40l602k679l445L048N573N399J275m00R6
$$ y = [68991, 72893, 72233, 68179, 67652, 70141, 75271, 77187, 77693, 79897, 80131, 77338, 73268, 77340, 79247, 77199, 77140, 75961, 71141, 74615, 74517, 73004, 77685, 80221, 77025, 75188, 77267, 76534, 79958, 80517, 76189, 73260, 75863, 77098, 79930, 78990, 73258, 80400, 86631, 88055, 86311, 82429, 77404, 75565, 77798, 77915, 81378, 86340, 85428, 81059, 81737, 80556, 82487, 89014, 90044, 91655, 95110, 95808, 96113, 96596, 99944, 99492, 93265, 90887, 92303, 93705, 95371, 96534, 95176, 92701, 93931, 98977, 101171, 99703, 95905, 95700, 97386, 100186, 103575, 104036, 101186, 93759, 93014, 101574, 105363, 106538, 104426, 103033, 97990, 99044, 103862, 107885, 101970, 99096, 102768, 109140, 110473, 113538, 114611, 118168, 117895, 117130, 117908, 114768, 117503, 118164, 114669, 118365, 120335, 117425, 115014, 117722, 119479, 123618, 127087, 126647, 123045, 120366, 116921, 119969, 125542, 130941, 132216, 131816, 131912]
9000A31912K760j35k366k523M13J865n16M35j493O69L235J283m564j138N120N816
8984A40773k22l203N97L364N370m96l70j773k616j643r45J749N080N317q46J496
8968A51632L59k022k770m79O851L978M290n22k234K250L485P62J734n74k134P35
8952A65341m10J876K389K067Q14N40N59J307P100L748J211K866L918K973R14K31
8936A97444j538K189O882M254m959j445L381M338L385l71L997N329N839j882K848
8921B29691J279K93L186m957j241Q123O913L041k758j017L940K731j498L580L898
8906B55204p08L6L467L500J79K458m29L49M719L338L076k70m080m62L057j171
8890B72263L819L945N021N321N027K867L767K033J953M4j295j03M140K368j170
$$ y = [131912, 134672, 134537, 132171, 129648, 130061, 131926, 131410, 131845, 130352, 131021, 134256, 135539, 130975, 129837, 134957, 140773, 140551, 137348, 137945, 141309, 146679, 146183, 145813, 144040, 141424, 139781, 138836, 140585, 145665, 150982, 150136, 151632, 151991, 149969, 147199, 146720, 153571, 157549, 161839, 161317, 159083, 161333, 164818, 165580, 167314, 166740, 164606, 165341, 164931, 166807, 169196, 171263, 172077, 172617, 173176, 174483, 181583, 185331, 186542, 189408, 193326, 196299, 197213, 197444, 195906, 198095, 204977, 209231, 204272, 202827, 206208, 210546, 213931, 213560, 217557, 222886, 228725, 226843, 229691, 230970, 231263, 234449, 229492, 228251, 236374, 243287, 246328, 243570, 242553, 246493, 249224, 247726, 251306, 255204, 254496, 254532, 257999, 261499, 261678, 264136, 263707, 264056, 268775, 272113, 275189, 274919, 270839, 270377, 273434, 272263, 276082, 280027, 285048, 290369, 295396, 298263, 302030, 304063, 306016, 306060, 304765, 304662, 308802, 311170, 310000]
8875C10000k573O891Q844M063k471L91Q807P605J20P29K604r9k001N954P167J307
8859C57338L778N066N277L598K374P260j52n210O76M994N669N005R107N505O239
8844D16524P356k080p9M227O574O301Q532Q015K179K851N639L863J384P582Q273
8829D87141R551R746J301J552P119R878Q933M072L185m77N620J0555J1732R880
8815E79788O106P086O527Q072Q801J0232Q641J0978P555M113J0796J3306P376
8802F89377N114J1924J0835J3642J1048R301J1657J9363J4419J1077J5239J2665
8790H35661J1474R501J5937J0545J0114J6750J7643J5374J5980J3411J8451J7710
8778A008551J6792K0468J9543J5236J8029J8092J7960K1549K0449J3024J4505
$$ y = [310000, 307427, 314318, 323162, 327225, 324754, 325145, 333952, 341557, 341677, 342406, 345010, 344911, 342910, 348864, 356031, 357338, 361116, 366182, 371459, 375057, 377431, 384691, 384539, 379329, 380005, 384999, 390668, 395673, 404780, 410285, 416524, 423880, 421800, 421721, 425948, 432522, 438823, 447355, 455370, 457549, 460400, 466039, 469902, 471286, 478868, 487141, 496692, 506438, 507739, 509291, 516410, 526288, 535221, 539293, 542478, 542001, 547621, 558176, 569908, 579788, 585894, 592980, 599507, 607579, 616380, 626612, 635253, 646231, 653786, 657899, 668695, 682001, 689377, 694491, 706415, 717250, 730892, 741940, 751241, 762898, 782261, 796680, 807757, 822996, 835661, 847135, 856636, 872573, 883118, 893232, 909982, 927625, 942999, 958979, 972390, 990841, 1008551, 1025343, 1045811, 1065354, 1080590, 1098619, 1116711, 1134671, 1156220, 1176669, 1189693, 1204198]
8767A204198K5539K4351K1882K2692K6071K8006K6551K0487J8949K9935K9429
8756A478090L0626K7710K5311K8533L1251L4928L8215L1950L2166M0032L4298
8745A833110L5048L9999M2359M3097M7065M9077M7071M5625M9833N3364N5527
8734B341175N7085N7968N8183O3375O7056O7787P0570P3297P7361P7936Q3715
8723C095508Q4997Q3157R2582J00151J04404J01578J07454J17192J20114J23211
8713D130348J29065J38251J46112J51408J53644J62685J73714J83174J98164J95175
8703E761740K06447K15715K25104K39840K48519K66915K81095K95150L03702L21986
8693H366213L40341L61923L76290L88421M14646M25731M54585M81591N06501N29074
$$ y = [1204198, 1229737, 1254088, 1275970, 1298662, 1324733, 1352739, 1379290, 1399777, 1418726, 1448661, 1478090, 1508716, 1536426, 1561737, 1590270, 1621521, 1656449, 1694664, 1726614, 1758780, 1798812, 1833110, 1868158, 1908157, 1950516, 1993613, 2040678, 2089755, 2136826, 2182451, 2232284, 2285648, 2341175, 2398260, 2456228, 2514411, 2577786, 2644842, 2712629, 2783199, 2856496, 2933857, 3011793, 3095508, 3180505, 3263662, 3356244, 3456395, 3560799, 3662377, 3769831, 3887023, 4007137, 4130348, 4259413, 4397664, 4543776, 4695184, 4848828, 5011513, 5185227, 5368401, 5566565, 5761740, 5968187, 6183902, 6409006, 6648846, 6897365, 7164280, 7445375, 7740525, 8044227, 8366213, 8706554, 9068477, 9444767, 9833188, 10247834, 10673565, 11128150, 11609741, 12116242, 12645316]
8683A2645316N62973O03904O51779O91047O87789O49060O11012N81028N56789
8674A8240697N47624N57429N65152N74326N69127N50451N19425M75618M28864
8665B3028713L72236L13104K50306J84903J13515L8496l3917j04955j66985k33215
8655B3762201k96091l48186l99245m49200m85741n16168n44876n68091n83683
8646A9570920n89863n89313n92367n89110n77326n52427n20805m86120m44414
8637A4629175m27699m65961n11676n27175n42273n48188n19258m75592m35833
8628A0175520m07009l82696l64946l46483l29099l17718l09291k90573k78624
8619G149081k62087k49620k43910k30503k19231k06214j94331j85798j78759j76053
$$ y = [12645316, 13208289, 13812193, 14463972, 15155019, 15842808, 16491868, 17102880, 17683908, 18240697, 18788321, 19345750, 19910902, 20485228, 21054355, 21604806, 22124231, 22599849, 23028713, 23400949, 23714053, 23964359, 24149262, 24262777, 24301273, 24267356, 24162401, 23995416, 23762201, 23466110, 23117924, 22718679, 22269479, 21783738, 21267570, 20722694, 20154603, 19570920, 18981057, 18391744, 17799377, 17210267, 16632941, 16080514, 15559709, 15073589, 14629175, 14201476, 13735515, 13223839, 12696664, 12154391, 11606203, 11086945, 10611353, 10175520, 9768511, 9385815, 9020869, 8674386, 8345287, 8027569, 7718278, 7427705, 7149081, 6886994, 6637374, 6393464, 6162961, 5943730, 5737516, 5543185, 5357387, 5178628, 5002575]
8609E002575j64025j53444j47526j46097j35338j30428j18349j13623j19134j13654
8599C660957j04116j00430r8134r1771r1779q9341q2614p6037p9310q3980p3470
8588B689975o9949o7721o2661n9584n3354n4643n0401n4694n7276n2736m5722
8577B061234m4559m8246m4280l9563m3601m1269l8590l7467l1766l4295l7903
8566A619695l1432k9593k8936l0401l0555k5861k2657k3807k1664k7425k5707
8555A321657k5711k6258k4389k1746k5183k2315k7165j7814j3170j5940j8495
8544A083471j9550j5295j1834j5089j4520j9406j5780j1310j4714j4307j2708
8533I18958j7703j1702j0279j3779j0456r644p139j0693j3542j0934j0599k941
$$ y = [5002575, 4838550, 4685106, 4537580, 4391483, 4256145, 4125717, 4007368, 3893745, 3774611, 3660957, 3556841, 3456411, 3358277, 3266506, 3174727, 3085386, 3002772, 2926735, 2847425, 2763445, 2689975, 2620026, 2552305, 2489644, 2430060, 2376706, 2322063, 2271662, 2216968, 2159692, 2106956, 2061234, 2016675, 1968429, 1924149, 1884586, 1840985, 1799716, 1761126, 1723659, 1691893, 1657598, 1619695, 1588263, 1558670, 1529734, 1499333, 1468778, 1442917, 1420260, 1396453, 1374789, 1347364, 1321657, 1295946, 1269688, 1245299, 1223553, 1198370, 1176055, 1148890, 1131076, 1117906, 1101966, 1083471, 1063921, 1048626, 1036792, 1021703, 1007183, 987777, 971997, 960687, 945973, 931666, 918958, 901255, 889553, 879274, 865495, 855039, 845395, 838256, 827563, 814021, 803087, 792488, 789547]
8521G89547j4667j5258o703l842n830q996j1599j0240r802q365o508j0538p213
8508F69986m377p777j2790j1085j3163n437k037n602r524j2191j1644j0419n177
8495E58763j584o497j0348q644j0735l345l199m287q882j968m713r801p674o12
8481D76474k761o351m709n523m593j0141q113l956l503j919j578L371l615j0200
8467D12883p263n483l770m805k509n496m798o972O44j443o217n698J11r55k943
8452C55286o634q234m487j098o221k602l876j258r07q497l157k003R53J582M006
8437C12853l563p834p228j499k26j005m368l540R9k24l101l901k290j306l342
8422B69525k728l8l281k438l312J695p16j638m756n91j179j469p610l967n28j683
$$ y = [789547, 774880, 759622, 752919, 749077, 743247, 734251, 722652, 712412, 702610, 694245, 687737, 677199, 669986, 665609, 657832, 645042, 633957, 620794, 615357, 613320, 607718, 598194, 586003, 574359, 563940, 558763, 557179, 550682, 540334, 531690, 520955, 517610, 514411, 510124, 501242, 499274, 494561, 484760, 477086, 476474, 473713, 467362, 462653, 457130, 452537, 442396, 434283, 430327, 426824, 424905, 423327, 426698, 423083, 412883, 405620, 400137, 396367, 391562, 389053, 383557, 378759, 371787, 372431, 370988, 364771, 359073, 359184, 358229, 355286, 348652, 340418, 335931, 334833, 328612, 326010, 322134, 320876, 319969, 311472, 308315, 306312, 307265, 308847, 312853, 309290, 301456, 294228, 292729, 292503, 291498, 287130, 283590, 283689, 283465, 280364, 276463, 274173, 272867, 269525, 266797, 266759, 263478, 261040, 257728, 259423, 258707, 257069, 252313, 251722, 250543, 249074, 241464, 237497, 236969, 235286]
8406B35286J283r45k179m97J103j976k220n309K240m071l265K720j644k168J428
8391B19786m083o385j62n805n181J435L124j551P89L71j789r98n437m273q19O
8375A89028n532k226J372j025j732J476j827p12L04K440k378n809j060k906J180
8360A70593K096l810J635o35l882l401q457j097K858M486n91l77k380n18n24k621
8344A53375J200n69K361K962N93q524k156k257K56l916l519l827L923M212l385
8329A40729m436l797Q45J053j708O59o78j982k494m789K034J965m939l162L736
8314A23036j327j528M766K391k145m995o858l843L08J674k031j402L654L689p40
8299A14649l360k490p49j175n231l639Mm268k481M375L93k112r83K701J2122J1907
$$ y = [235286, 236569, 235624, 233445, 232948, 234051, 232075, 229855, 224546, 226786, 222715, 219450, 222170, 220526, 218358, 219786, 215703, 209318, 209156, 203351, 198170, 199605, 202729, 201178, 201967, 202338, 200549, 199551, 194114, 189841, 189022, 189028, 183496, 181270, 182642, 181617, 179885, 181361, 179534, 178822, 179126, 181566, 179188, 173379, 172319, 169413, 170593, 172689, 168879, 170514, 169879, 165997, 162596, 154139, 153042, 155900, 160386, 159795, 159418, 157038, 156520, 155996, 153375, 154575, 154006, 156367, 159329, 159922, 151398, 149242, 146985, 147241, 143325, 139806, 135979, 139902, 144114, 140729, 136293, 132496, 133341, 134394, 132686, 133345, 132667, 130685, 128191, 123402, 125436, 127401, 122462, 119300, 123036, 121709, 120181, 124947, 127338, 125193, 120198, 113340, 109497, 109805, 111479, 109448, 108046, 111700, 115389, 114649, 111289, 108799, 108050, 106875, 101644, 98005, 98009, 93741, 91260, 95635, 96028, 93916, 92933, 95634, 107756, 119663]
8283A19663O208L073P094J0391N546Qk007o932q569r258j4247o838m424l662l973
8268I2073l465l462j290M399K168k449n240k400K591K465K921M580j976k653n707
8253H2555L654L616J798l8l036n006k088l92K842N719J671m806o066m08J620j057
8237H0578p78l468P25P72K87R45l28j690j155l240M317J197J018k928N34J167
8221G7953k547L954k17r77J025m463j341J149j318L514J000k227r47L069l227
8206G4400m795J864L961M2k103L331j421k176j662k295M11l803j497J172j412
8191F4017l048o870M19O814M19k415j040N96o5k805K932j76R85M08j27K958K49
8174F3251j556q66K617K427j888p31K737j666j857m402m6J917p89m52l803K357
$$ y = [119663, 125871, 128944, 136038, 146429, 151975, 151983, 149976, 143044, 134475, 125217, 110970, 104132, 99708, 96046, 92073, 88608, 85146, 83856, 88255, 90423, 87974, 82734, 80334, 82925, 85390, 88311, 92891, 90915, 88262, 82555, 86209, 89825, 91623, 91585, 88549, 83543, 81455, 81063, 83905, 89624, 91295, 86489, 80423, 80015, 81635, 80578, 79800, 76332, 77057, 77829, 78116, 79061, 78733, 77043, 75888, 72648, 76965, 78162, 79180, 76252, 76786, 77953, 75406, 79360, 79143, 78166, 79191, 74728, 73387, 74536, 73218, 76732, 77732, 75505, 74558, 77627, 74400, 69605, 71469, 75430, 75472, 73369, 76700, 75279, 73103, 71441, 69146, 69557, 65754, 64257, 65429, 64017, 60969, 54099, 54518, 61332, 61751, 59336, 58296, 58892, 58827, 56022, 58954, 58778, 59763, 60171, 60044, 63002, 63251, 61695, 60829, 63446, 65873, 63985, 63254, 65991, 64325, 62468, 58066, 58020, 59937, 59148, 58696, 54893, 57250]
8158E7250J295R03j200K028j768n138j025k289l88L302J820K61k679Q44K818K791
8142E8825m294k362J301j77j481L038m446l215N441p9l455j515O89J53L266l17
8126E1372l030P4mM64K394J24m41r01k339l289j491M965K90j001Mk653Q82j691
8108D3729K665J603R00o720l849N511M124P68O68L78l542K776M331L470L290m777
8092E5325k506j55l061l608L808L5k208m675j417j647J844O162J76k347R86O99
8076D7411o595l721L587K797l296j956l34J964j201k083K100m332o683K540M007
8061C4205K779J625k296k06R02j637m061k391K422N708L298k43q17K51L444j321
8045D1662J684J808l358j346k602m028K497l54P737k88o766l152J112L357K559
$$ y = [57250, 58545, 59448, 58248, 60276, 58508, 53370, 52345, 50056, 49668, 52970, 54790, 55051, 52372, 53216, 56034, 58825, 54531, 52169, 53470, 53293, 51812, 54850, 50404, 47189, 52630, 52551, 49096, 47581, 48270, 48423, 51689, 51372, 48342, 48416, 48412, 48876, 51270, 51394, 50953, 50052, 47713, 44424, 42933, 47898, 48188, 47187, 47191, 44538, 45420, 43729, 46394, 47997, 48897, 42177, 38328, 43839, 47963, 48731, 49399, 49777, 46235, 49011, 53342, 56812, 60102, 55325, 52819, 52664, 49603, 45995, 49803, 49838, 47630, 42955, 41538, 39891, 41735, 47897, 48073, 45726, 46712, 47411, 40816, 37095, 40682, 43479, 40183, 38227, 37893, 39857, 38656, 36573, 38673, 34341, 27658, 30198, 34205, 36984, 38609, 36313, 36107, 37009, 35372, 31311, 28920, 31342, 37050, 40348, 40105, 39288, 39539, 42983, 41662, 43346, 45154, 41796, 40450, 37848, 33820, 36317, 35963, 43700, 43412, 36646, 33494, 34606, 37963, 40522]
8030D0522M642j092p085k924m86k430R85J371l213J742M930J117j029K876Q07
8015D0733j426L047L486k269L736l818m871j576m282l73J244L293M06k939m106
8000C0285l775l544L982N25K547j343O43M628M268n080j753m123k872k61J875
7985B6002M144j587k943k897l93P75L685K016l117J129M247l149j085J252K950
7970C1029L964k186l305o47P56K533l373l618P06L251N639j4l507k403j305J391
7954B8911l593Q81M957K759n860l129k925j73M032j589R31j522j997k84L20j766
7938A9953k433L982L628j744r36N433O316K165l497l952l213k288J122K211j489
7923B5258L28k890K001M695k140j201O034J889q44o725k040m30K085M54N79l263
$$ y = [40522, 45164, 44072, 36987, 34063, 33577, 31147, 32132, 33503, 30290, 32032, 36962, 38079, 37050, 39926, 40733, 39307, 42354, 45840, 43571, 47307, 43489, 38618, 37042, 32760, 32387, 33631, 36924, 37330, 34391, 30285, 26510, 22966, 26948, 27473, 30020, 28677, 29320, 33948, 38216, 33136, 31383, 27260, 24388, 24127, 26002, 30146, 28559, 25616, 22719, 22326, 23101, 26786, 28802, 25685, 26814, 31061, 27912, 26827, 28079, 31029, 34993, 32807, 29502, 28855, 29611, 32144, 28771, 25153, 25859, 29110, 34749, 34735, 31228, 28825, 27520, 28911, 25318, 26199, 31156, 33915, 28055, 24926, 22001, 21828, 25860, 24271, 25202, 23680, 21683, 21399, 21719, 19953, 17520, 21502, 25130, 23386, 22450, 27883, 34199, 36364, 32867, 28915, 25702, 23414, 24536, 26747, 25258, 25586, 22696, 24697, 29392, 27252, 26051, 32085, 33974, 33130, 26405, 24365, 23935, 26020, 26474, 27053, 23790]
7907B3790n026J040N263L317J572K059k797n540J301J25J842n54o883K751K636
7892B4896K944k057J621L122K483J251l075k432J758L7n501k506L332J781J491
7877B9145k288l522m21l929l458M532L568L531L811n295l429J747p34O56K817
7862B6731j293l428J171M788R14n415n516m863M247N446J638L79K877J335J401
7847C0412l231p475J713N376k932p76k539l464J386K546L316j276k465j696M88
7832A9383K711L19R86J381o152k9O07p300k474K962J124M933K833l320l166k165
7816A2633P96P34J038k076j479L847K772k583k147N2L769P029k411m550q2K875
7800B0217M21k117R81K851k088l182J460J678K07J108K37j688o89M10J153N91
$$ y = [23790, 18764, 19804, 25067, 28384, 29956, 32015, 29218, 23678, 24979, 25104, 26946, 26392, 19509, 22260, 24896, 27840, 25783, 27404, 30526, 33009, 34260, 31185, 28753, 30511, 30548, 25047, 22541, 25873, 27654, 29145, 26857, 23335, 22914, 18985, 15527, 20059, 23627, 27158, 30969, 25674, 22245, 23992, 23258, 23914, 26731, 25438, 22010, 23181, 27969, 28883, 23468, 17952, 13089, 17336, 22782, 24420, 24799, 27676, 29011, 30412, 27181, 19706, 21419, 26795, 23863, 23087, 20548, 17084, 18470, 21016, 24332, 23056, 20591, 18895, 19383, 22094, 22413, 23399, 24780, 18628, 18599, 19206, 11906, 9432, 12394, 13518, 18451, 21284, 17964, 14798, 12633, 13429, 14163, 15201, 13125, 11646, 15493, 18265, 15682, 13535, 13587, 17356, 24385, 21974, 17424, 17342, 20217, 20638, 18521, 19502, 22353, 20265, 17083, 18543, 20221, 20428, 21536, 21773, 20085, 19396, 19806, 20959, 21550]
7784B1550M961j709k13k12j703L04j519J470m70k153l948l463L55m93k566p64
7768I427O078N952l541n714L573K890M25K397m848n145J462Q166J311o628K356
7753A8161O145m743j1135m388K038K153m99J073M323K733O411n39J704n149o654
7738A1634L857L47r43J829K24k966J568L23j949K211j120n328j751L71J103m003
7722E407M093J039N85j255J455J543J050M401j549m784N41o93k374o52K723P86
7706A2316J064l38K287P89N14K482M363l9m951q060k597J253k776j893K742L218
7690A0374K612J541m221j11j631Q3r08k632J722R27J987m72J667k302J000L111
7674A2747K420J64k073J056l824m314L597N783K843j981l722k03k393k576m008
$$ y = [21550, 26511, 24802, 24589, 24377, 22674, 22978, 21459, 22929, 22459, 20306, 16358, 12895, 13250, 12757, 10191, 9427, 15505, 21457, 17916, 12202, 15775, 18665, 19090, 21487, 16639, 11494, 12956, 21122, 22433, 15805, 18161, 24306, 19563, 8428, 4040, 6078, 8231, 7732, 8805, 13128, 15861, 22272, 21733, 23437, 18288, 11634, 15491, 15838, 14895, 16724, 16948, 13982, 15550, 15873, 13924, 16135, 15015, 9687, 7936, 8307, 9410, 5407, 9500, 10539, 11124, 9869, 11324, 12867, 13917, 18318, 16769, 11985, 12526, 11833, 9459, 8807, 11530, 12316, 13380, 13042, 15329, 16118, 16632, 19114, 23477, 23438, 18487, 10427, 7830, 9083, 6307, 4414, 7156, 10374, 12986, 14527, 10306, 10195, 8564, 8647, 7739, 5107, 6829, 7756, 9743, 9271, 10938, 8636, 9636, 12747, 15167, 15331, 13258, 14314, 10490, 6176, 9773, 15556, 18399, 16418, 12696, 12493, 10100, 7524, 3516]
7659C516l41j676K147L592o8K59K971J321j827p28j41J98l77J076l195P62L201
7642A0690n04J871k336Q89L806M78k646o91k917l027O842J016l87r4m0m629K174
7625A0495M475M86R94J192J583R33l326n175k292k89k370J678K98O66K306k733
7609H921o69J026j463k01O97o5n115L053Q042k172l056P62L277L920j477o73l408
7592A1399q17P69K261L124N95q43j300j131j36j675l347p27K670K591N65l106
7576A0892j612r10k690J567K789m437k33O78K857M010J964J800j708l168k482
7561I317M591m65q696n43K335j171N52l290m45J657J288k166L27L423J497k511
7545E700m077j595L356K219J505M038j568j366k422k682P58j809L472J53n09R16
$$ y = [3516, 3175, 1499, 3646, 7238, 7170, 7429, 10400, 11721, 9894, 9166, 9025, 9223, 8846, 9922, 6727, 7489, 10690, 10186, 12057, 9721, 10610, 14416, 14894, 12248, 11557, 8640, 5613, 12455, 13471, 13084, 12990, 12950, 8321, 10495, 14970, 15456, 16450, 17642, 19225, 20158, 16832, 11657, 9365, 9076, 6706, 8384, 8682, 9348, 11654, 8921, 8252, 9278, 7815, 7614, 8311, 8246, 3131, 6184, 14226, 12054, 8998, 9760, 13037, 16957, 15480, 14807, 11399, 10582, 11351, 13612, 16736, 17331, 16488, 15188, 14057, 13921, 12246, 8899, 8172, 10842, 13433, 13998, 10892, 9280, 8370, 5680, 7247, 10036, 5599, 5366, 6044, 8901, 12911, 14875, 16675, 14967, 11799, 9317, 13908, 13443, 4747, 4204, 6539, 5368, 5920, 2630, 2185, 3842, 5130, 2964, 3291, 6714, 8211, 5700, 1623, 28, 3384, 5603, 7108, 11146, 9578, 8212, 5790, 3108, 3866, 2057, 5529, 5682, 5173, 6089]
7529F089l007j65R48j97L287R45j171K58J494J224J14j974j266j091K822M849
7513A3159R19l921J311R04n396o32J657j704K596k589l204J666M167L29r0j218
7497G954O004K712k656n595n0Q17k734j051J140j305n881n419K853O158o54m398
7481b105L558O078n37m587J070N160J816l187Q86n5l962P39n74k96k249J984j774
7464A965q13p11M233K422J062K144m79k898l145L976m786O0P034L75J15q59K063
7447A1758L784n584p465n101J090Q199K261l679K917j69J638K102J24m069J131
7432H937J118m286K255j23l444k156L266L20m13M535N029j543n127l729o904J2
7416b253J344k056M941K268nK557J81j939R12O241J271j385j341l750l060L720
$$ y = [6089, 3082, 2917, 3865, 3668, 6955, 7900, 6729, 6987, 8481, 9705, 9819, 7845, 6579, 5488, 8310, 13159, 14078, 10157, 11468, 12372, 6976, 6344, 8001, 6297, 8893, 6304, 3100, 4766, 8933, 9262, 9172, 7954, 13958, 16670, 14014, 8419, 8369, 9186, 6452, 5401, 6541, 5236, -645, -6064, -3211, 2947, 2293, -2105, 1453, 7531, 6994, 2407, 3477, 8637, 10453, 7266, 8152, 8097, 4135, 4874, 4300, 4004, 1755, 3739, 1965, 1152, 441, 4674, 7096, 8158, 10302, 9823, 6925, 3780, 7756, 2970, 3030, 10064, 10439, 10554, 9695, 11758, 15542, 9958, 2493, -2608, -1518, 6681, 8942, 5263, 8180, 8011, 9649, 11751, 11875, 7806, 8937, 10055, 5769, 8024, 7901, 4457, 2301, 5567, 5887, 5474, 10009, 15038, 13495, 8368, 4639, -2265, -2253, -909, -2965, 1976, 4244, 4239, 6796, 6977, 5038, 5950, 12191, 13462, 12077, 10736, 6986, 3926, 7646]
7400G646K514J867L346k496j0136K34J328R51K129L254J130l649l18K873n41q050
7384B082j045M537M5j161M58R05j24k042M24L188K206j106k844k726j222q18k970
7367b213K50M673L585l185O52L654k06q28k919K11M513N11J824J182r53j640l930
7350E181j141j19k825n250j91j167Q76M813P654J309j325n477j495k83J763J377
7334C700m69l4m027L486K303J100L188K699K31L95L27k717O30l895J617J857k215
7317H176j866P52J294k639m693j892o82L669j502K107K808l954j914K78R65K283
7301C190K216J014p266J088K851J854L828Q20j737j48k753k954K637O359l232
7286G767m133m727M801L293m662j040L302M79j383j089K711J1l004m043K149K169
$$ y = [7646, 10160, 12027, 15373, 12877, 2741, 2975, 4303, 5254, 7383, 10637, 11767, 8118, 7800, 10673, 10132, 2082, 1037, 5574, 5619, 4458, 4916, 5821, 5697, 3655, 4079, 7267, 9473, 8367, 5523, 2797, 1575, 757, -2213, -1963, 2710, 6295, 3110, 3762, 7416, 7210, 6382, 3463, 3674, 8187, 8698, 10522, 11704, 10751, 9111, 5181, 4040, 3921, 1096, -4154, -4345, -5512, -4636, 177, 7831, 9140, 7815, 2338, 843, 560, 2323, 3700, 3231, 3197, -830, 2656, 4959, 6059, 9247, 11946, 12177, 12572, 12899, 10182, 10812, 6917, 8534, 10391, 8176, 6310, 7062, 8356, 5717, 1024, -868, -1550, 2119, 617, 2724, 5532, 1578, -336, -58, 907, 3190, 5406, 6420, -846, 242, 3093, 4947, 8775, 9595, 7858, 7710, 4957, 2003, 4640, 10999, 7767, 3634, -1093, 3708, 7001, 2339, 1299, 4601, 5080, 3697, 2608, 5319, 5330, 2326, -1717, 432, 2601]
7270B601j623j794l166q70K408n920o77Q286N703k419l656M76j891L043K707j170
7254B038l26k72L51j726M55j234K836l384J968R95P119K000l951J217L951k68
7238A1769n391k286j142l304O49J075K44J576m417l945N732L895J308K011j87
7223G587r41k267k89j482q2M759K635l500p15n88j963j780j374L467L80J87j617
7206B417k804j33L636N407K997J592l514k978j014l264L433L385K58j927l925
7191C566k462R01N186l747o172L692k071J77K862M719J825m39O1q41j880p99J703
7174F281j451K115M191M38k838m874k728k265j48j572O058O423n123j723K202
7159D986N189J748q676j408J772K299J948K514k001m422j835j998j600l40J431
$$ y = [2601, 978, -816, -3982, -4852, -2444, -8364, -9041, -755, 4948, 2529, -1127, -651, -2542, 501, 3208, 2038, 1712, 1440, 1791, 65, 520, -714, 2122, -1262, 706, 1701, 8820, 10820, 6869, 8086, 12037, 11769, 6378, 4092, 2950, -354, 295, 1370, 1614, 3190, -1227, -5172, 560, 4455, 5763, 7774, 7587, 6646, 4379, 4090, 2608, 2526, 7285, 9920, 6420, 5705, 5117, 3154, 1374, 0, 3467, 3847, 4034, 2417, -387, -520, 3116, 8523, 11520, 13112, 9598, 6620, 5606, 2342, 5775, 9160, 9418, 7491, 3566, 1104, 2005, 7191, 3444, -2728, 964, -1107, -930, 1932, 6651, 8476, 8037, 8098, 7257, 5377, 4578, 6281, 4830, 6945, 11136, 11574, 8736, 3862, 1134, -1131, -1279, -2851, 3207, 9630, 4507, 2784, 4986, 10175, 11923, 3247, 1839, 3611, 5910, 7858, 10372, 8371, 3949, 2114, 116, -1484, -1824, -393]
7144c93j290k78M142r90K21O72j587J641M907K489K075O7n713r37R19m340p41
7127H64l637q86L229L656k187p6M10m280J77n830K264M802j186m6K401m10k810
7110c545M121N55L304k462j967K720L829k327l126M960J841l666m302k613k879
7095e557J3K37k169P7J782N591M698J178J210K24l78j508J332j895K072k278l663
7078I66j793K437N1K060L239k26J16R84k228p620j500M343L991k571j86K894k729
7061B228l607N320r84o363o967R62j74K734L498M28K579m754j548L029L360j647
7045a906K797k653K051J421m733O51L676J608N489L198k932l26m60l278l658J629
7029B574K042J185J4l483j089k978j583k29L423K993N11J636l87n06j298j095
$$ y = [-393, -1683, -1961, 2181, 1191, 1412, 2084, 497, 2138, 7045, 9534, 11609, 11676, 5963, 5026, 5945, 1605, 864, -2773, -3659, -430, 3226, 1039, 963, 1373, -2907, -2730, -8560, -6296, -1494, -2680, -2726, -325, -735, -3545, 576, 1131, 4435, 1973, 6, 2726, 6555, 4228, 1102, 6062, 7903, 4237, -65, -2678, -5557, -5544, -5307, -7476, -7399, -5617, -26, 4672, 5850, 7060, 7284, 6906, 5398, 6730, 4835, 6907, 4629, 966, -827, 1610, 1661, 3721, 6960, 6734, 6850, 7834, 5606, -2014, -3514, 829, 4820, 2249, 2063, 4957, 2228, -1379, 3941, 2957, -3406, -10373, -9411, -9585, -6851, -3353, -2925, -346, -5100, -6648, -3619, -259, -1906, 891, -1762, 289, 1710, -3023, -2372, 1304, 2912, 8401, 11599, 8667, 8341, 7881, 4603, 945, 2574, 4616, 5801, 5815, 2332, 1243, -1735, -3318, -3547, -124, 2869, 3380, 5016, 4629, 4123, 2825, 1730]
7013A730N918M293l559j74R36m407L47K210l164j233m790m459M691P647L15n985
6997C16K2M259M147n77q362j944L428j322m177q20J030N707O985J299m968Q3M083
6980I189l72k935J314j209q14k113Q03j226m912l90M41N257k459k039L395M235
6964F165j755m4R9K31J786Q92j407k339M87j431j924N829L788l146k176L517j027
6947G545o261n62J392m30p80K817r72k605Q63j246k979j500N745J961j176l479
6931a667p61J828k84l288L897J957l706m587J574L753p55m020J739K629K7N48
6915a116l05j831k003J171J597j539M54M021p5k77Q02k490K52M189m955l473j02
6898e680L923K718j862l106l508k682L10N367K260l246K889j53n221n48l199j479
$$ y = [1730, 7648, 11941, 8382, 8208, 9144, 4737, 5084, 7294, 4130, 2897, -1893, -6352, -1661, 5986, 6301, 316, 338, 4597, 8744, 8167, -195, -2139, 1289, -33, -4210, -5030, -4000, 1707, 8692, 9991, 5023, 5106, 9189, 8817, 5882, 7196, 5987, 5173, 3060, 3863, 2637, -2275, -2665, -2224, 3033, 574, -1465, 1930, 6165, 4410, 4366, 4465, 4696, 6482, 7374, 5967, 3628, 4115, 2684, 760, 6589, 10377, 7231, 5055, 8572, 7545, 1284, 722, 2114, 1684, 904, 3721, 2749, 144, 1007, -239, -3218, -4718, 1027, 2988, 1812, -1667, -2428, -600, -884, -4172, -275, 1682, -2024, -6611, -5037, -1284, -2039, -6059, -4320, -1691, -1664, -1116, -1421, -3252, -5255, -4084, -2487, -4026, -3572, 449, 374, 97, 899, -1591, -1339, 2850, -2105, -5578, -5680, -1757, 961, -901, -4007, -7515, -10197, -9887, -4520, -2260, -5506, -2617, -2770, -7991, -8539, -11738, -13217]
6882a3217J612n9M195P142N262j943j407K613K942l32l673k858L993N205l860
6867E615l359l760J448J194j312n437r65N743P696K080j333k91J928l093k497
6852C657k94k14n261j140O275L170J411K536m757q36j860k923J43K695k366jM36
6835F71M469J207n326o75K922K325m26j040l482J773L703R20n57j835n675m607
6819e633Q44R37J465j378M873K28o586k546J753O039L630k512k254J370q0m839
6803d689l713L86N264K879k327l7k667K269M822K527m56m585k159j765K813L640
6787B202K767m806j988J565J139k39J035L484m14L82j832j26m076J167K723J016
6771C999o621J973L093l051l429J098K590J942J101j679M841l828o2O619N206
$$ y = [-13217, -11605, -11664, -7469, -327, 4935, 2992, 1585, 4198, 7140, 6808, 3135, 277, 4270, 9475, 5615, 2256, -1504, -56, 1138, -174, -5611, -6576, -833, 6863, 8943, 7610, 7319, 9247, 6154, 3657, 3363, 3149, -2112, -3252, 3023, 6193, 7604, 10140, 5383, 4547, 2687, -236, -93, 2602, 236, 235, 671, 5140, 6347, 1021, 346, 3268, 5593, 5167, 4127, 645, 2418, 6121, 7041, 6484, 4649, -1026, -5633, -4789, -3852, -2387, -3765, 1108, 1336, -5250, -7796, -6043, -4, 3626, 1114, -1140, 230, 150, -4689, -8402, -8016, -2752, 127, -2200, -2237, -4904, -2635, 2187, 4714, 4258, -327, -2486, -4251, -1438, 2202, 4969, 163, -1825, -260, 879, 640, 1675, 5159, 4745, 5127, 3295, 3169, -907, 260, 2983, 3999, -2622, -649, 2444, -607, -4036, -2938, -348, 1594, 2695, 1016, 5857, 2029, 1967, 8586, 13792]
6756A3792m71l895k604j074J071O06l12O1K0q31j955K13m822o138j121N20L689
6739c251O263M573n61n237j301k873l81L93L814l74P63k928j979L519J356m879
6723c083l692O17N093L730J202K505Q44n565l424J787J96M72j900j150J450q25
6707a743L42P15n332P19J067J417M552P44J114r07J644p96j327n714j011J430
6691c086J767j15k845l710L331N272n73K393j951j116K745K505l087l382j427
6676c279J606l6o628k109K372P72L196J932j730j227l67L285O295L204L846l677
6660G455n881L195p41k224l093J292o22q52J102M528q72L382n78J59K88k924n209
6643a595l825r59m613K283O349K854j084n340k307L286P082K265j659o809M020
$$ y = [13792, 13321, 9426, 6822, 5748, 6819, 7425, 7113, 7174, 7194, 6363, 4408, 4621, -201, -6339, -7460, -6940, -3251, 3012, 7585, 7024, 1787, 486, -2387, -2768, -2375, 1439, 1065, 1828, -1100, -3079, 440, 1796, -3083, -6775, -6158, -1065, 2665, 3867, 6372, 7216, 1651, -1773, 14, 210, 682, -1218, -2368, -918, -1743, -1401, -686, -6018, -5299, -4232, -2815, 1737, 2481, 3595, 2688, 4332, 3536, 2209, -3505, -4516, -3086, -1319, -1434, -4279, -7989, -4658, 614, 41, 2434, 483, -633, 2112, 4617, 1530, -1852, -3279, -1673, -1709, -8337, -10446, -8074, -7302, -4106, -2174, -3904, -5131, -5498, -2213, 4082, 7286, 11132, 7455, 1574, 4769, 4028, 1804, -1289, 3, -619, -1471, -369, 4159, 3287, 6669, 6091, 6250, 6538, 3614, -1595, -5420, -6379, -10992, -8709, -2360, 494, -590, -5930, -8237, -4951, 2131, 4396, 2737, -4072, -52]
6628e2M526J684j974j018j921m097J132l79N54J382j298k830O626J767K485K646
6612I233j562M767P792M14m639m462o765J268l488m949r59J471j790k639K487
6597c821L387P00l298K973K67q19q1Q95j09J698J358N60P07r55l861P38K538j475
6579A402j490M533L755L371l08l610l785l276K707j054p145k36L355R33J942l925
6563b831k609K672Q92L456k019m891O43M471j175k810j322M510k036J242J926
6548A19J547M849j459l423K357l669p825l95K245K154K144O06M159K78J82q8k228
6531A553K63J919J355N900J067m590m869Q8l022M07j592j720P526m84Q57K449
6515G107j206j983l545j30J647L895m599k99J920K182O343j960m370M2l573O67
$$ y = [-52, 4474, 6158, 4184, 3166, 1245, -2852, -1720, -2099, -1545, -163, -1461, -4291, 2335, 4102, 6587, 9233, 7671, 12438, 20230, 20644, 16005, 11543, 4778, 6046, 2558, -2391, -3350, -1879, -3669, -6308, -3821, -434, 266, -3032, -59, 208, -611, -692, 203, 94, 1792, 3150, 3710, 4417, 3462, -399, 339, 2877, 1402, -88, 4445, 8200, 11571, 11263, 7653, 3868, 592, 3299, 2245, -4900, -5136, -1781, -848, 1094, -2831, -5440, -2768, -1876, 1580, -439, -5330, -4687, -216, -1391, -4201, -5523, -1013, -3049, -1807, 119, 1666, 6515, 5056, 1633, 3990, 321, -7504, -7899, -5654, -3500, -1356, -750, 3409, 3687, 3869, 3781, 1553, 1816, 3735, 5090, 10990, 12057, 7467, 2598, 2686, -336, 71, -1521, -3241, 4285, 3801, 4658, 7107, 5901, 3918, 373, 243, 1890, 5785, 1186, 887, 2807, 4989, 11332, 9372, 5002, 5044, 1471, 2138]
6499B138K440k968M812l4m607r7o12k936J349J177k651n152K080k525q31K264
6483f153q64K712J486J493J197o1m355K00N57N912K813j135l865q96k681n716
6467i356K227J130j202m34L150j066m68Q71K026O84m257L82N429N625l608o117
6451d984L40j075K734j59k405L493K375J887k850m499J179N26O88R58Q49J435
6435D92j063J703j288j665M4O8L300K794J204p95k326K33k886q86J265K588L070
6418E852K498L08m410n3J64r79K82K123n185R27j727n632N46R45J405J574l074
6401d436K038M506l900m000J522L9J086L282j426l105Q17K779K64j472l182j107
6385f295J871K516j529J074R320J122n369j315j93J524J785k882k432P71J080
$$ y = [2138, 4578, 1610, 6422, 6388, 1781, 1684, 1072, -1864, -515, 662, -1989, -7141, -5061, -7586, -8417, -6153, -7017, -4305, -2819, -1326, -129, -190, -4545, -4345, -3788, 2124, 4937, 3802, -63, -959, -3640, -9356, -7129, -5999, -7201, -7635, -4485, -5551, -6019, -5148, -3122, -2438, -6695, -6313, -884, 4741, 1133, -4984, -4644, -5719, -2985, -3144, -5549, -2056, 319, 2206, -644, -5143, -3964, -3438, -2750, -1792, -943, 492, -571, 1132, -156, -1821, -1777, -1709, 1591, 4385, 5589, 4794, 2468, 2701, -185, -1071, 194, 2782, 5852, 8350, 8658, 4248, 4195, 4359, 3380, 3662, 5785, 600, 1527, -200, -5832, -5286, -4341, -2936, -1362, -4436, -2398, 2108, -1792, -5792, -4270, -4231, -3145, 137, -1289, -4394, -3577, -798, -534, -2006, -5188, -6295, -4424, -1908, -3437, -2363, 6957, 8079, 2710, 1395, 1202, 2726, 4511, 1629, -803, -32, 1048]
6370A048J140N98J607N10j740m355N10L801K9m698k921O441K590l178n312j725
6354e655K452j923L347L437j075n75M066J942l533m516j076O27L275L28n568J137
6338c310p82j604M06L225P78k88n57j194L609K522p79j217j389J035k068P40L398
6321B525K777L91J94o037l821M983M17m518R20M71K30M780m045k517Q7n40M756
6304A053k33L89l548j854P98r90J52j089M326L834M021m74o936k871k186K560
6288c048J122J438N079L30j211R4M207R98n016n164l613n204O33M715n52L218
6272a974J518N154K885m366N49j838j69Q53J459m41q52m047J585L896K140j315
6256E037l64L23n855k722K917K456l071M23k029r60j991p24j947N72M82M607j003
$$ y = [1048, 2188, 2786, 4393, 4903, 3163, -1192, -682, 3119, 3148, -1550, -4471, 1970, 4560, 1382, -3930, -5655, -3203, -5126, -1779, 1658, 583, 8, 4074, 6016, 2483, -2033, -3109, -2482, 793, 1121, -4447, -3310, -4092, -5696, -5290, -2065, -1287, -1575, -2132, -3326, 283, 2805, 2026, 809, -580, 455, -1613, -873, 2525, 5302, 5693, 5887, -150, -3971, 1012, 1429, -3089, -2169, -1698, -1468, 3312, -733, -3250, -3163, -3703, 1053, 820, 1209, -2339, -4193, -3395, -4385, -4233, -5322, -996, 2838, 6859, 6385, -551, -3422, -5608, -3048, -1926, -488, 4591, 4921, 3710, 3804, 8011, 9009, 3993, -1171, -4784, -9988, -9355, -4640, -5192, -1974, -456, 4698, 7583, 3217, 3766, 1928, 1759, 2612, 4071, 3630, 2778, -1269, 316, 4212, 6352, 5037, 4673, 4996, -859, -3581, -664, 1792, -1279, -856, -2885, -3845, -5836, -6560, -8507, -7935, -7453, -2846, -3849]
6239c849M30L58N329l35k569n03j835l143o73K439M178J426m124K959q18n271
6223f001j014o59J766K068L574j693p1K436M800K520K879r043m550m640J606L76
6207e646m408k051l522N09l271J489R59K582k717J120M705r39L033l13K805R907
6191D242L871O13j794k856K756K140J755l495n94j737P43l689J15P8J753M162
6175H063N46m381n262m67L648J892R06R7j732K464j496j809J152J087K720k055
6159E373n416k048m759k554M596N88K683K478j377k215mM114P5J054r42N050k106
6142D590l567j127l260p28J529j256L916K468J433J389k548M561k532j639j614
6127A615l49r53m543j380K113N00m55L70J539j599K609J734l496N473J227L202
$$ y = [-3849, -3419, -3061, 2268, 1933, -636, -1139, -2974, -6117, -6790, -4351, -173, 1253, -2871, 88, -730, -6001, -7015, -7674, -5908, -3840, -266, -1959, -2030, 406, 5206, 7726, 10605, 1562, -2988, -7628, -6022, -5646, -10054, -12105, -15627, -15118, -18389, -16900, -15941, -13359, -16076, -14956, -10251, -11190, -8157, -8470, -5665, 4242, 8113, 8726, 6932, 4076, 6832, 8972, 10727, 7232, 6638, 4901, 5644, 1955, 2070, 2148, 3901, 8063, 8609, 4228, -1034, -1501, 2147, 4039, 4945, 5042, 3310, 5774, 4278, 2469, 3621, 4708, 7428, 5373, -43, -2091, -6850, -9404, -4808, -4220, -1537, 941, -436, -2651, -2655, 1459, 1534, 2588, 1646, 6696, 4590, 1023, -104, -3364, -4092, -2563, -3819, 97, 2565, 3998, 5387, 2839, 7400, 4868, 3229, 1615, 1266, 313, -4230, -5610, -3497, -2997, -3452, -3082, -1543, -3142, -533, 1201, -2295, 3178, 4405, 7607]
6111G607rJ118K855j894p108l182J525L775m343m515l029N646N559k751l267J901
6095a12K826m148p81l89q09J044p96K704J683K269o043l641O983Q73p07N94J813
6078C363l197k44N382k651l460J382Q36n851o15Q32p82j416q1L564K65K118j778
6061b333l525m526n5N401M539K994l391l750k419Q12L014j094n77K749M86l610
6045e285K792Q17K04p27L322J407l484q383L335M673J999M422L56n778N46J198
6029A414q75k759J741m091J530N664M180j128J465L491j574q202k325J93j526
6014b802J033n12K734j370n959k474M94j439J529K144K088N67j598k28J784k194
5998f203j653n45N715K498m310j369k396L449J193K575j032j048L162K780J395
$$ y = [7607, 7598, 8716, 11571, 9677, 2569, -613, 912, 4687, 344, -4171, -7200, -1554, 4005, 1254, -2013, -112, 2714, -1434, -2215, -2604, -3413, -2369, -3165, -461, 1222, 3491, -2552, -6193, 790, 1663, 956, 1550, 3363, 166, -78, 5304, 2653, -807, 575, 1411, -4440, -5055, -4223, -5005, -6421, -6502, -2938, -2673, -555, -2333, -5858, -10384, -10439, -5038, -499, 2495, -896, -4646, -7065, -6253, -3239, -4333, -4910, -2161, -1675, -5285, -2493, -1676, -1472, -2199, 1123, 2530, -954, -9337, -6002, -1329, 670, 5092, 5448, -330, 216, 1414, 539, -2220, -479, -4570, -3040, 2624, 6804, 5676, 7141, 10632, 9058, 856, -1469, -1276, -2802, -1769, -2281, 453, -917, -6876, -9350, -8856, -10295, -8766, -6622, -4534, -3967, -5565, -5793, -4009, -6203, -7856, -8401, -2686, -188, -4498, -5867, -8263, -4814, -3621, -1046, -2078, -3126, 36, 2816, 4211]
5983D211k416l910J07L230M312M71K270p7o167n734K503l46m540j582L516J110
5967c042j313J829M198L537L568l810n056m72j406O26L625j61l346J709j519q73
5951a906p25Q45J673p35m728l785J630j808L212O707J732N678L592J99k338j942
5935G301j407l888k930J799K047l96K05j419m198l224K399N619L320n956p73j747
5919c248J499L058k87j960J043Ol818J614K024J093J924L269P0K760r65j692n51
5902E839p739l037P40n66K477J405j937n5N25l586R78M856m52l045m587J369M755
5885b060J360j209J753N23j375M837j246j522l153l690k603k591M211K27j58o17
5869g313M668M658m44o605n298N918L310k445P92J335j576J018L444l270l211
$$ y = [4211, 1795, -2115, -2008, 1222, 5534, 6005, 8275, 8198, 2031, -3703, -1200, -1546, -6086, -7668, -4152, -3042, -4355, -2526, 1672, 5209, 8777, 4967, -89, -561, -1967, -1341, 2284, 2123, -1223, 486, -1033, -1906, -2631, -1786, -113, -848, -5576, -9361, -7731, -9539, -6327, 380, 2112, 7790, 11382, 11581, 9243, 7301, 5894, 2006, -924, 875, 2922, 2526, 2731, 1312, -2886, -6110, -3711, 1908, 5228, -728, -1501, -3248, -1749, 1309, 1022, -938, 105, 111, -3707, -2093, -69, 1024, 2948, 6217, 6287, 9047, 8082, 6390, 5839, -1900, -4937, -4197, -4763, -2286, -881, -2818, -2873, -2348, -5934, -4956, -100, -552, -3597, -8184, -6815, -2060, -700, -1909, -156, 367, -1008, 3829, 2583, 1061, -2092, -5782, -8385, -10976, -6765, -6538, -6696, -7313, -2645, 2013, 1569, -5036, -10334, -4416, -1106, -3551, -2759, -1424, -3000, -1982, 1462, -1808, -5019]
5854e019J440l24q21k428l048L268J163O5k437k90q75K769M96M04p22K78M023
5837b058N063K632k994j016m754m863l87L328L729J996k74P11l455P29N02n246
5821f357J499M168O08j756k621m65J060J461L007m44l373N206k29N07l026l313
5805d068L709l22K012J701m989j876K053K288N34k650J989k22k039j467m262J988
5789e621P133K950j656n115l12K145k358j674l415J170R69M471J012j807k687
5774d795l21K182n81l529j909k085K426J56N76M008j784l013J052j67j631J506
5758g909P361j535J027L703J666k366O406o25o930L80j498r263J195M510L164
5743g14k848k271j533M858O416R49j322j033N18j046L896k494l033L91L595k962
$$ y = [-5019, -3579, -3903, -4724, -7152, -10200, -6932, -5769, -5704, -8141, -8431, -9306, -6537, -6041, -5637, -6359, -6081, -2058, 3005, 5637, 2643, 1627, -3127, -7990, -8377, -5049, -1320, 676, 402, 1113, -2342, -1613, -1111, -6357, -4858, -690, -82, -1838, -4459, -4924, -3864, -2403, 604, 160, -3213, 1993, 1764, 2271, -755, -4068, -359, -681, 1331, 3032, -1957, -3833, -1780, 508, 1042, -1608, 381, 159, -1880, -3347, -7609, -5621, 1512, 4462, 2806, -2309, -2621, -476, -2834, -4508, -7923, -6753, -5784, -1313, -301, -2108, -4795, -5116, -2934, -3515, -7044, -8953, -11038, -8612, -8456, -7880, -3872, -5656, -8669, -7617, -7784, -9415, -7909, -548, -2083, -1056, 2647, 4313, 1947, 8353, 7728, 798, 1178, -320, -9583, -8388, -3878, -714, -3562, -5833, -7366, -2508, 3908, 4857, 3535, 2502, 3020, 1974, 5870, 3376, 343, 734, 4329, 1367]
5727A367l434l743j170L750m0j8O394J046J955L700Q46n869k393k967j458p93
5711b827J615K293n61r12K587p80l64j314j699j875m754j045k484L899J788L396
5695c037m2j441k613m680j079L360P09N8K519J413J120j995o702r43K147L329
5679g877K823m008J334L391J017m505l683j385N829K661k880l527M082P97j049
5664f980k106P7M661J559J273j623m235K359K537J282J531m142j409Q05M455J705
5648A749o11K01j390j099K47l473j711n09N26k589J105J315M068M18K949M730
5632E926l81j861K736q04l916k150J014J655Q54j503k211k716k505n144K792j879
5616a0093K752L416K17l969K231L536L306j117j190j864j556R08k28K65m36j008
$$ y = [1367, -2067, -5810, -6980, -3230, -3270, -3288, 3106, 4152, 6107, 9807, 10653, 4784, 2391, -576, -2034, -2827, -1212, 1081, 520, -392, 2195, 1415, 1051, -263, -1962, -3837, -8591, -9636, -12120, -8221, -6433, -3037, -3079, -4520, -7133, -11813, -12892, -9532, -8823, -8765, -6246, -4833, -3713, -5708, -12410, -13353, -11206, -7877, -5054, -9062, -7728, -4337, -3320, -7825, -11508, -12893, -7064, -4403, -7283, -10810, -6728, -5931, -6980, -9086, -9009, -4348, -2789, -1516, -3139, -7374, -5015, -2478, -1196, 335, -3807, -5216, -4411, 44, 1749, 1138, 1339, -51, -1150, -903, -4376, -6087, -6596, -6070, -8659, -7554, -6239, -2171, -1753, 1196, 5926, 5545, 3684, 6420, 5616, 1700, -450, 564, 2219, 3073, 1570, -641, -3357, -5862, -11006, -8214, -10093, -7341, -3925, -3708, -7677, -5446, -1910, 1396, 279, -911, -2775, -4331, -3423, -3651, -3386, -3822, -4830]
5600d830L465R0J909l655l907K285j463n247l69M917N578L459j413n155l421j975
5584i732J576M090M72N960J237j483N02L38l507m583j479P21k43P99k315j787
5568i434N855N485n48l335J385K867j681l962l20j610n24L675j581Q9K375k52
5552a516K325Q93J40K869K359K637n912n486K494O494L838j132l189l447k22k818
5536C27l222m297J127N902J495K788q86m500j756K393M830K11n344L158L521k637
5520C110j92j961j321j892l247M874j157l651N718N114k093l358O21P04l6L03
5504A536L137J745j444O58j515m308J866j132j33n38j040J596k835l824J674L375
5488a182m37l089j588m625M51L052L531N789P11k750j605j599k290k567J516K185
$$ y = [-4830, -1365, -1275, 634, -3021, -6928, -4643, -6106, -11353, -11722, -6805, -1227, 2232, 819, -4336, -7757, -9732, -8156, -4066, -3594, 2366, 3603, 2120, 2622, 2960, -547, -5130, -6609, -5888, -6131, -5332, -7647, -9434, -3579, 1906, 1358, -1977, -592, 2275, 594, -3368, -3688, -5298, -5822, -2147, -3728, -3639, -1264, -1516, 809, 1702, 1842, 4711, 7070, 9707, 3795, -1691, 803, 7297, 11135, 10003, 6814, 3367, 3145, 327, -2895, -7192, -6065, -163, 1332, 4120, 3234, -1266, -3022, -629, 4201, 4412, -932, 2226, 5747, 3110, 2918, 957, -364, -2256, -5503, -629, -1786, -5437, 281, 5395, 3302, -56, 565, 1269, 1233, 1536, 4673, 6418, 4974, 5632, 4117, -191, 1675, 543, 410, -128, -1168, 428, -2407, -6231, -4557, -1182, -1619, -4708, -6296, -10921, -10470, -7418, -3887, 1902, 2613, -137, -1742, -3341, -5631, -8198, -6682, -4497]
5472d497K296K98l167j263N393K400m853K576l599K616J009J136M49m896k083
5457f185J167K729M30J201q95o041m272J840P335K575o479j972N014N90k317M583
5441f97j592k427K863j45k194L685j704O04N214N901l759o699p92k581m5J278
5425c090L001N99k535k358J042K116j745j162L28k794k414P203j624k4J235L402
5409A180O14l144p06j333M857rM68q12M25j770l853j517N0N690O056m791m527
5392c122j704K326j360m933J367O333J959l262k567l207K838M096j187J919J876
5377A372n374q58L230L524J35K560o38l130k940k224j369K509M943j076k53K394
5361B805k109p128q39J833N299L44J410n150n038l49L82L565j14o24J538R03K406
$$ y = [-4497, -2201, -1903, -5070, -6333, -940, 1460, -3393, -817, -4416, -1800, -791, 345, 794, -4102, -6185, -5018, -2289, -1859, -658, -1553, -7594, -11866, -10026, -2691, -116, -6595, -8567, -3553, -2963, -5280, -697, -2289, -4716, -1853, -1998, -4192, -507, -2211, -1607, 3607, 9508, 5749, -950, -1742, -4323, -4368, -3090, -89, 510, -2025, -4383, -3341, -1225, -2970, -4132, -3804, -6598, -9012, -1809, -3433, -3457, -2222, 1180, 1794, -1350, -2056, -3389, 1468, 1459, 1927, 1115, 1540, -230, -4083, -5600, -5550, 140, 6196, 1405, -3122, -4826, -2500, -3860, -8793, -7426, -1093, 866, -2396, -4963, -8170, -5332, -1236, -2423, -504, 1372, -4002, -4860, -1630, 1894, 2029, 4589, 3951, 821, -2119, -4343, -5712, -3203, 1740, 664, 411, 2805, 696, -6432, -7271, -5438, -139, 205, 1615, -3535, -8573, -8922, -8540, -4975, -5089, -5713, -4175, -3272, -866]
5344h66l605o599r76O987j704k28M995m23o52n156J859L119J079J101j868l76
5328c313r03k265L218J978J032R03L154K101j672r14r44q19l485l26O70L587K562
5311D564k753j337k840M88L827M061j800m238L133k358k636m660K742J564L065
5296H22K373n744J33J328n756J391K660L814j269l164K993M93m115q83k822l668
5280a1414J760K584L512k666R67J878q20R37j046L76K994J181k796m068O25J15
5264e881N070L458p97o18j411l18k169Q58J928p12j706K621l44J63j092o23k594
5247d167K26N756L723n993l117l165K514M091l776n229P04K806N490K3j344j699
5231c157j904O398L92n062l072j772L68J413J167K095J941Q63k614m427j35K783
$$ y = [-866, -4471, -11070, -12046, -5059, -6763, -6991, -1996, -2419, -3071, -8227, -6368, -3249, -2170, -1069, -2937, -3313, -4216, -6481, -3263, -1285, -253, 650, 3804, 5905, 4233, 3319, 2375, 1556, -1929, -2255, -1585, 2002, 4564, 1811, 474, -2366, -1878, 1949, 6010, 4210, -28, 3105, 747, -1889, -6549, -3807, -2243, 822, 3195, -2549, -2416, -1088, -6844, -5453, -2793, 1021, -248, -3412, -419, 74, -4041, -4924, -7746, -11414, -9654, -7070, -3558, -6224, -5257, -3379, -4199, -3262, -4308, -3932, -938, 243, -2553, -6621, -5996, -5881, -811, 2647, 1850, 1232, -179, -497, -2666, -1808, 120, -592, -2298, 323, -21, 142, -950, -1573, -4167, -3941, 1815, 5538, -455, -3572, -6737, -4223, -132, -3908, -9137, -8433, -5627, -137, -114, -1458, -3157, -5061, 1337, 1729, -3333, -6405, -8177, -7809, -6396, -5229, -3134, -1193, -330, -2944, -7371, -7506, -4723]
5215d723K605N35P8L941J102q513k335k496N738Q92j466J264L076L347K393j573
5199C865J493m62n713j245m563k092R49k884L8j618k040L73Q573N303J676M218
5183E871m92r90p443l823q80K21L484L514j250p787m115K914J316J262M007R25
5167c266m131M315K688j094K376J452M29K141J96K614o55k78j190K89l048k411
5151D27k519j482K630J995k061r72n15j256M710J437j392j20m408j658J807L821
5135D44M573J281K6q07k249p321j103M732L212j365J344R2j583j959J462K602
5119C381k157o254j533L561j242o69j034K670q5K764Q041m64k692l845l568j025
5103d151K69L19J996o08j986J637J862K337L205K443q14K408k534m583l597k798
$$ y = [-4723, -2118, -1583, -1505, 2436, 3538, -4975, -7310, -9806, -4068, -3176, -4642, -3378, -302, 3045, 5438, 3865, 5358, 4896, -817, -2062, -6625, -8717, -7768, -10652, -10614, -12232, -14272, -13899, -5326, -23, 1653, 5871, 5379, 4389, -3054, -6877, -7757, -7536, -4052, -538, -1788, -9575, -13690, -10776, -9460, -8198, -4191, -3266, -7397, -3082, -394, -1488, 888, 2340, 2769, 4910, 5106, 7720, 7065, 6787, 5597, 5886, 2838, 427, -2092, -3574, -944, 1051, -1010, -1982, -2497, -3753, 957, 2394, 1002, 882, -3526, -5184, -3377, 444, 5017, 6298, 6324, 5517, 3268, -4053, -5156, -424, 2788, 1423, 2767, 2859, 1276, -683, 779, 3381, 1224, -5030, -6563, -3002, -4244, -4913, -5947, -3277, -3362, -598, 7443, 6979, 4287, 442, -3126, -4151, -3882, -3563, -1567, -2175, -4161, -2524, -662, 1675, 4880, 7323, 6509, 8917, 6383, 1800, -1797, -4595]
5087d595K891p75N82K634J121nR80k758m070o011L018K450J632r16L797O076Q089
5070A4140j971p506k165j164J003J312l340Q56P21J005m317m431L413P760J397
5055F713k982J570K813m507q273p74L729L223r29j459J280j182j612j782K432
5040a740q00j496k262k616J118Q028K523k930r47j959k180Q79M598J196k21n57
5024F34j022j218l61L42j22l210o08Q07P0L385J058K578J01j242M241k013k264
5007A156o336J128N615J012K208j72p66m569j961R45l130J790J670m37j515L411
4991D9J413k720j358l928o1J468J969j280Q91J727q94k726J541k604k152j257
4975i922J070L244M752j639J549j873l451J302j779K072m72j016J319J284j185
$$ y = [-4595, -1704, -2479, -1897, 737, 1858, 1853, 2833, 75, -3995, -10006, -6988, -4538, -2906, -3822, -25, 6051, 14140, 12169, 4663, 2498, 1334, 2337, 3649, 309, 1165, 1886, 2891, -1426, -5857, -2444, 5316, 6713, 3731, 5301, 8114, 3607, -4666, -5440, -1711, 1512, 583, -876, 404, -778, -2390, -4172, -1740, -2540, -4036, -6298, -8914, -7796, 232, 2755, -175, -1122, -3081, -5261, -4382, 216, 1412, 1191, 634, -388, -1606, -1967, -1625, -1747, -4957, -5565, -4758, -4688, -1303, -245, 2333, 2434, 1192, 5433, 3420, 1156, -5180, -4052, 1563, 2575, 4783, 4611, 3845, -724, -2685, -1740, -4870, -3080, -1410, -1847, -3362, 49, 1462, -1258, -2616, -6544, -6605, -5137, -3168, -4448, -3557, -1830, -2724, -5450, -3909, -6513, -8665, -9922, -8852, -5608, -856, -2495, -946, -2819, -6270, -4968, -6747, -4675, -5147, -6163, -4844, -3560, -4745]
4960d745j357L746l533Q20J102l812J415N963m14j074P86j112j55Q77R68K000
4944A475j993J438J875O743m818q219L715L256l823k917K418J470Q42l417j134
4929c089N076j36m712O19K4N280M24k998j707k039k12K62K913j446k257L177j453
4912b274k885K970j446M20L445m515M990O529j206m728k672l178k735M496M929
4897B140L145P77n120j149J181J37m567l442j079J610l86K892O481J467o078K444
4881D53O2l199m40l293M149k25l762P33J630M250Q75k593m301K53l604k243M452
4864f803J245l973N249P9m602q37N455K64J767K584j853L856K891n80l214K95
4848A823o7j057j182l54j406M87p10J365K015j501M84K688l932j825M224r42j387
$$ y = [-4745, -6102, -2356, -5889, -5069, -3967, -7779, -6364, -401, -815, -1889, -1103, -2215, -2370, -1493, -525, 1475, -518, 920, 2795, 9538, 4720, -3499, 216, 3472, -351, -3268, -850, 620, 1462, -1955, -3089, 1987, 1851, -2861, -2242, -2218, 3062, 3486, 488, -1219, -3258, -3470, -3208, -295, -1741, -3998, -821, -2274, -5159, -2189, -3635, -3215, 230, -4285, 705, 7234, 6028, 1300, -1372, -4550, -7285, -2789, 2140, 5285, 6062, 942, -207, 974, 1111, -3456, -6898, -7977, -6367, -6753, -3861, 2620, 4087, -1991, 453, 515, -2684, -3124, -6417, -2268, -2493, -6255, -5522, -3892, 358, 1233, -1360, -5661, -5408, -9012, -11255, -6803, -5558, -9531, -4282, -4203, -8805, -9642, -4187, -3923, -2156, 428, -1425, 2431, 5322, 4742, 1528, 1823, 1756, 699, -483, -837, -2243, -1756, -2466, -1101, 914, -587, -103, 2585, -1347, -3172, 1052, 110, -1277]
4831a277j810M68K590K272l540j748N434K058l696j596m113J497j210k652M059
4816c264M876j864l107m765N539O319j857n977n882o88j699p1N594N789N62K802
4800B307J124m094l477j409O33L238J160l743l62k969l179J141M170M37p99J861
4784c961k396j811k217P79M620k89k440J774k00k176m24M695k287k79j62K279
4768d495K20L955J624l962j284j201p9K271j960l128J449j375k490j379J773k518
4752a2579J200J189O177K559P65j079J075K081j426n423j484P553J568p99j222
4737A55j605l812k807j738M164J952K433L194j185P95Q01m682m82J671j413j253
4721c812o67k318Q75J479J542J095o95J931J97o00L790j203l323K999L777l2k475
$$ y = [-1277, -3087, -2619, -29, 2243, -1297, -3045, 2389, 4447, 751, -845, -4958, -3461, -4671, -7323, -3264, 1612, -252, -3359, -8124, -2585, 3734, 1877, -4100, -9982, -10670, -12369, -12440, -6846, -1057, -495, 2307, 3431, -663, -4140, -5549, -4916, -1678, -518, -4261, -4623, -7592, -10771, -9630, -5460, -5023, -5822, -3961, -6357, -8168, -10385, -9606, -4986, -5275, -7715, -5941, -6141, -8317, -8741, -4046, -6333, -6612, -6774, -4495, -4275, -320, 1304, -2658, -3942, -5143, -5222, -2951, -4911, -8039, -6590, -7965, -10455, -11834, -10061, -12579, -11379, -10190, -4013, -1454, -689, -1768, -693, 1388, -38, -5461, -6945, 608, 2176, 1377, 155, -1450, -5262, -8069, -9807, -5643, -3691, -1258, 1936, 751, 1546, 2347, -2335, -2817, -1146, -2559, -3812, -4479, -6797, -5922, -4443, -2901, -1806, -2501, -570, -373, -973, 2817, 1614, -1709, 1290, 5067, 5035, 2560]
4704B560J983K111j435p54j678m214O8k32k201m976J693K189L886J009l35Q60
4688E34l164k855O1L532L156L62K366J750k017j782l247n122L779P015J302o253
4672e83m116K761l61P81l727l493Q78j437r44O504L193j187J764N75n064J32p34
4655e058l658K165M35K089M46K263J355j631j869N86K102k756J282j227L787k180
4639a869P91J663R50l174m955K557K439j086o605m720L077K851K21K705q13k243
4623h211K749K113k171k263m29j455L61J0236K422J431L454j119n404j796l974
4608d056P45M90J045Q8l050L365O02l695k010j582K300L965L12o01k516j835j951
4591h384L381K819l415j27l608M535Q016L018L255j230o638m840K582M73l053
$$ y = [2560, 4543, 6654, 5219, 4465, 2787, -1427, -1359, -1591, -3792, -8768, -7075, -4886, -1000, 9, -326, 534, -2630, -5485, -5424, -1892, 1264, 1626, 3992, 5742, 3725, 1943, -1304, -6426, -2647, 4368, 5670, -583, -4699, -1938, -2299, -1518, -5245, -8738, -7860, -9297, -10241, -3737, -544, -1731, 33, 608, -4456, -4324, -5058, -8716, -6551, -6116, -4027, -3581, -1318, 37, -1594, -3463, -2877, -775, -3531, -2249, -3476, 311, -1869, -1078, 585, 1535, -1639, -6594, -4037, -1598, -2684, -9289, -14009, -10932, -8081, -7860, -5155, -5968, -8211, -5462, -3349, -5520, -7783, -8212, -9667, -9306, 930, 3352, 4783, 8237, 7118, 1714, -82, -4056, -3311, -2821, -1776, -1688, -4738, -1373, -771, -4466, -6476, -8058, -5758, -1793, -1481, -2082, -4598, -6433, -8384, -5003, -2184, -5599, -5726, -9334, -4799, 3217, 6235, 9490, 8260, 1622, -3218, -636, -163, -3216]
4576c216m786J93K278M003L335j715j695n056J326J588J771k997n74o13L267j334
4560d225m31k244k293L165R219J711m229m015K69j836l48j526p68l365N682O351
4544A117j805k656k594L17K492l138j920K979O81M928q1k135P58o34K689J18o99
4527D17j174L703l013k370k421J336k574k245O345K173j559K97j08j917P18R11
4511a481J289J82L26K293q6l440j899l778K08J052o50J178k432k66J437j323K799
4494d591K562R65j191J934n330j763K463K294m977k79q48q92O435M222j451K46
4478b01k280m99K080K784J585j287k607K889O75O35j165l334j082N35J045k943
4462c170J529j867L1j436J142J198m16k079j389K006k547j356K438L517K195J109
$$ y = [-3216, -8002, -7809, -5531, -1528, 1807, 92, -1603, -6659, -5333, -3745, -1974, -4971, -5545, -6158, -2891, -4225, -4656, -6900, -9193, -6028, 3191, 4902, 673, -3342, -3073, -4909, -5257, -6783, -7551, -10916, -5234, 1117, -688, -3344, -5938, -5621, -3129, -6267, -8187, -5208, -4527, 401, 320, -1815, -1057, -1691, 998, 1116, 417, -757, 2946, -67, -2437, -4858, -3522, -6096, -8341, -1996, 177, -1382, -1085, -1193, -3110, -2392, -1481, -192, -10, 316, 2609, 2523, -917, -2816, -6594, -6386, -5334, -5984, -4806, -7238, -7504, -6067, -7390, -4591, -2029, -1064, -2255, -321, -5651, -7414, -4951, -2657, -7634, -7913, -8761, -9653, -3218, 1004, -447, -201, -2481, -2980, -900, 1884, 3469, 2182, -425, 2464, 3139, 3774, 2609, -725, -1807, -1272, -227, -3170, -1641, -3508, -3477, -4913, -3771, -2573, -2989, -5068, -6457, -4451, -6998, -8354, -5916, -2399, -204, 905]
4446I05n053K632J790L678j430p798l522J664L264J939O170l017p137j585N536
4431a964O832l445k025L844L261o75r37j743k04q09m841l664J418N55j502M36
4415e463L6J221J217M09k432L165J084L65o5qK046M277J686l597k129m58m962
4398c608k193j805L00q02K977M267p05l756j862J799K064L178J423l818O1N13
4382a967J529L443j782j101k205K752K082l399j156j045M103p76l224J201J706
4367A61j946L208K364k820J172r10O9k729k687J871K407l35n475k430L992N465
4351A377K886j928%j251j28j335m49R3k559k264J942m550l088K797J872K692L900
4334Gj930l566j152k44P39J050R38J556J803p9k289j077j034K929L230J870k311
$$ y = [905, -4148, -1516, 274, 3952, 2522, -5276, -8798, -7134, -3870, -1931, 4239, 1222, -5915, -7500, -1964, 4868, 1423, -602, 3242, 6503, 5828, 4891, 3148, 2944, 2135, -2706, -6370, -4952, -4397, -5899, -5463, -5427, -4206, -2989, -2580, -5012, -1847, -763, -398, -463, -471, 1575, 5852, 7538, 3941, 1812, 1354, -3608, -5801, -7606, -7306, -8108, -5131, -864, -1569, -5325, -7187, -5388, -3324, -146, 1277, -2541, -2480, -1967, -438, 3005, 1223, 122, -2083, 669, 2751, -648, -1804, -2849, 1254, 478, -2746, -1545, 161, -1785, 1423, 3787, 967, 2139, 1229, 1298, -1431, -4118, -2247, 160, -175, -5650, -8080, -4088, 1377, 4263, 2335, 2335, 1084, 956, -379, -828, -735, -3294, -5558, -3616, -8166, -11254, -8457, -6585, -3893, 7, -1923, -5489, -6641, -6885, -6146, -5096, -4158, -2602, -799, -878, -3167, -4244, -5278, -2349, 881, 2751, 440]
4317D40j03M786n237o131k316L943L376j027j330J172K641n780j428K636n74K0
4301d912L115J753q34O67j306L419K655n440k233l292j653k2j938J618N052L28
4285c023p14N60K187k16j113j262j416P39o72M380N632n415l126J86L396L641
4269C764J283j387p202n281r3O208J010m160L636M326O0l072o409O49N287K566
4253A185J961l215J879l071k541L070K420J46J899j646k774p31k912m209j218
4238i757k74L851j64J263n45j008J494k704J915P063J748o386k943K688L654R73
4222H68J556k146M154J779l670j416L169k870l703N63M016L05j254j97o276J923
4206c199o546k809K087J019L817M176L62l726k600K674L239q98Q20j013K65J8
$$ y = [440, 337, 5123, -114, -6245, -8561, -4618, -1242, -2269, -3599, -2427, 214, -5566, -6994, -4358, -4932, -4912, -1797, -44, -878, -211, -1517, 1902, 4557, -883, -3116, -6408, -8061, -8083, -10021, -8403, -3351, -3023, -3737, -3177, -990, -1206, -2319, -3581, -4997, -4258, -4930, -550, 5082, -333, -3459, -3273, 123, 3764, 5047, 3660, -3542, -8823, -8916, -2708, -1698, -5858, -2222, 2104, 2164, -908, -7317, -6668, -1381, 1185, 3146, -69, 1810, -1261, -3802, -732, 1688, 1834, 3733, 2087, -687, -1418, -4330, -8539, -9757, -10031, -6180, -6344, -5081, -5626, -6634, -5140, -7844, -5929, 1134, 2882, -3504, -6447, -3759, -105, 868, 2424, 278, 4432, 6211, 2541, 1125, 4294, 1424, -2279, -1716, 2300, 2605, 1351, 1154, -5122, -3199, -9745, -12554, -10467, -9448, -5631, -1455, -1093, -4819, -7419, -4745, -1506, -2404, -1584, -2597, -2332, -2314]
4190b314l79k020j832K729J310k215q87O17j205M560J16n78Q75L467K887N535
4174A0666l388m758n769n254r54L800M94j217J773L868J121L48j076K4M335j003
4158C010l097J481L36m056j610O00k135M56J802k592L413M929K404m917p64J118
4142C78L85J949l394l693p96Q05J390m382K742L643j055J245P402N311m100k246
4126E584n823L742L333J266j059k973m120J18k344l522j322k727m70k72k557L451
4110i695l513m487K650J548j253J209j566k828L237M95L095J145m01j764K498
4095i630M779K024K222J064j842j462R59k80k3L613n924o962k606L071Q602L102
4079G07n94k687K393j446L03J911J041J800K947L910j709m169n468o893j370N383
$$ y = [-2314, -2693, -4713, -6545, -3816, -2506, -4721, -5608, -4991, -6196, -1636, -1520, -2098, -1223, 2244, 5131, 10666, 7278, 2520, -3249, -8503, -9457, -5657, -5163, -6380, -4607, -739, 382, 730, -346, -322, 4013, 3010, -87, 1394, 1730, -2326, -3936, -3336, -5471, -5015, -3213, -5805, -2392, 2537, 4941, 24, -740, 378, 763, 2712, -682, -4375, -5171, -4366, -2976, -7358, -4616, -973, -2028, -783, 6619, 11930, 7830, 5584, -239, 3503, 6836, 8102, 7043, 4070, -50, 68, -2276, -5798, -7120, -9847, -10317, -10589, -13146, -9695, -13208, -17695, -15045, -13497, -14750, -13541, -15107, -17935, -14698, -14203, -11108, -9963, -10364, -12128, -9630, -4851, -2827, -605, 459, -1383, -2845, -1886, -2166, -2189, 1424, -4500, -11462, -14068, -10997, -2395, 707, 113, -2574, -181, -1627, -1324, 587, 1628, 3428, 6375, 10285, 8576, 4407, -1061, -7954, -9324, -3941]
4063c941n430k482K387L582k367j306L405Q84N381K424l547J841M392j306m461
4048e44J085N514p75j723m228l367M260N192Q81q204o082K308L636n82p18K492
4032h55j810m054K434L975K875o36o48n064K435k85R56r72K220k002p14J408J089
4015C52L373L669J50k448l690l919N92J19l026o467L388R332M093j919p674m238
3999h313J445J023J339J575J587J126j234N767k157n267j9J281j013q30L593k233
3983b330J442K148Q22q3l658L31K789j50j849J929j042K524K854j90j951n403
3967a817O42L907K731l392k837n676L260J858k051k30k519K645K682j837K975
3952C41K257j287l291l058K368L267J831l213k06k893J837J518L162M58J828N31
$$ y = [-3941, -9371, -11853, -9466, -5884, -8251, -9557, -6152, -5268, 113, 2537, -1010, 831, 5223, 3917, -544, 541, 6055, 5280, 3557, -671, -4038, 222, 5414, 6295, -1909, -7991, -5683, -2047, -2629, -3347, -855, -2665, -6719, -4285, -310, 2565, 1929, 1281, -3783, -1348, -1633, -677, -1649, 571, -1431, -2145, -737, 352, 3725, 7394, 7544, 5096, 1406, -2513, -1921, -1802, -4828, -11295, -7907, 1425, 5518, 3599, -4075, -8313, -6868, -5845, -4506, -2931, -1344, -218, -1452, 4315, 2158, -3109, -3128, -1847, -2860, -3690, -97, -2330, -888, 1260, 2082, 1999, -1659, -1328, 1461, 1311, -538, 1391, 349, 2873, 5727, 5537, 3586, -1817, -1175, 2732, 5463, 2071, -766, -6442, -3182, -1324, -3375, -3605, -6124, -3479, -797, -2634, 341, 2598, 1311, -1980, -5038, -2670, 597, 2428, -785, -991, -3884, -2047, -529, 2633, 3091, 4919, 5450]
3936E450m679m245J152M42p87J794J21O28N23j485L18l767k258j862J122Q21L57
3919f355p11Q199M430m012n319R81O9K008K096J62l698j224N55J666Q19J591j659
3902d02l030K935q8k935k001p89R53L166L442K75j197K346k688k381L557K656
3886C819k974k723L28M83o81l405k054K981N579M434l830k360P36K21J32j883
3870a197j928K448n87l494J33l857o07j803K352J214M415L480j841J118p46k184
3854c084N83J955m145J336k015k194K594L353N180J650j028K444j189k462m17
3839B561k030J88J861k93R97M459l020n499J163K858k13k740k484J84j358M388
3823A022m357k931L007O598l097n477l103k021M609P936k184k729j078j113k084
$$ y = [5450, 771, -3474, -2322, -1880, -2667, -873, -752, -124, 399, -1086, -768, -4535, -6793, -8655, -7533, -6712, -6355, -7066, 1133, 5563, 1551, -3768, -2787, -2718, -710, 1386, 1548, -2150, -3374, -2819, -1153, -334, 1257, -402, -3432, -497, -585, -3520, -5521, -6310, -5357, -2191, 1251, 1526, 329, 2675, -13, -2394, 1163, 3819, 845, -1878, -1550, -1067, -1748, -5153, -7207, -4226, 1353, 5787, 1957, -403, 333, 554, 686, -1197, -3125, -677, -1264, -4758, -4625, -8482, -9089, -10892, -8540, -7326, -2911, 569, -1272, -154, -900, -3084, -2501, -546, -4691, -3355, -5370, -7564, -4970, -1617, 3563, 5213, 4185, 6629, 5440, 2978, 2561, 531, 719, 2580, 2287, 3284, 7743, 4723, -776, 387, 3245, 3032, 292, -2192, -2008, -3366, 1022, -3335, -6266, -3259, 3339, 242, -5235, -8338, -10359, -5750, 2186, 2, -2727, -3805, -4918, -7002]
3808g002j204J522k496p99L252l17M415L581p90J670J799l185k471j643Q83m588
3792g373M60L40k021K690N719N183K062j93n82m681j405n37L103k606m935L358
3776a418Q33M066l91j841l905k213J140K642O137L536N26J108j160o492k359J520
3760A729j667k608k230M98k844j004J513l86O78n056r97K191O64K118O81J445
3744e275L205J178k487l416J337K033J086R45m29K052K802L231k659k900k204
3729a501l60j819L259O142J73k310l577l430p10K175j075k438j83K511K297O89
3713a57p50k240J134J673P55m841J689J78J740m63M61n75p65K200n530m603K290
3696g804J155k825J849N060J1Q46j471k634N843K534p73k848Q22k407K40M838
$$ y = [-7002, -8206, -6684, -9180, -9979, -6727, -7044, -2629, 952, 162, 1832, 3631, 446, -2025, -3668, -2785, -7373, -6913, -6573, -8594, -5904, -185, 4998, 7060, 6867, 6285, 1604, 199, -338, 2765, 159, -4776, -1418, -585, 3481, 3090, 1249, -2656, -4869, -3729, -1087, 5050, 8586, 9112, 10220, 9060, 2568, 209, 1729, 62, -2546, -4776, -4278, -7122, -8126, -6613, -6999, -6321, -11377, -12374, -10183, -9519, -7401, -6720, -5275, -2070, -892, -3379, -6795, -5458, -3425, -2339, -1394, -1823, 229, 3031, 6262, 3603, 703, -1501, -1861, -3680, -421, 5721, 5894, 3584, 7, -3423, -4133, -1958, -3033, -5471, -5654, -3143, -846, -157, -907, -3147, -2013, -340, 415, -4426, -2737, -2559, -819, -1282, -821, -1396, -2161, 39, -5491, -10094, -7804, -6649, -9474, -7625, -2565, -2554, -1708, -3179, -5813, 30, 2564, 1791, -1057, -235, -2642, -2402, 2436]
3680B436K611j523J40K115l694m520k77m857N34K726j52M657J258n763l314L346
3664d277J552k590k517q2L644O711l28l226K12K828k242r49P31L067p6K172l118
3647A512o73L87k309j528M57n581l311M490J085n72L81k233k154j820J200M580
3631f089P142j756m868J231K712m92m467J485K170K46j825k757M29J252M969j829
3615b447j195j96K975j983n481k605P084j605j179J203k541j749M23P15l25M138
3599d768O585p80k554L280J191o811J179p87k319J127K287p37n87Q56J636k718
3583c920L162j440j754k141m754j717N782K358j242l79K795L642R71k725k348
3568c710j880J671L346j797m909l864J492N288q32M155L693m34j640m667o09J299
$$ y = [2436, 5047, 3524, 3664, 5779, 2085, -2435, -2712, -7569, -7035, -4309, -4461, 196, 1454, -4309, -7623, -4277, -2725, -5315, -7832, -7914, -4270, 2441, 2113, -1113, -901, 1927, -315, -1264, -533, 2534, 2458, 4630, 1512, 839, 1226, -1083, -2611, -2154, -7735, -11046, -6556, -5471, -6043, -5662, -7895, -10049, -11869, -10669, -6089, 1053, -703, -5571, -4340, -1628, -2120, -6587, -5102, -2932, -2686, -4511, -7268, -6839, -5587, -618, -2447, -3642, -3838, -863, -2846, -8327, -10932, -3848, -5453, -6632, -5429, -7970, -9719, -9296, -8581, -8906, -4768, 1817, 1037, -1517, 1763, 2954, -3857, -2678, -3465, -5784, -4657, -2370, -3107, -3694, -2838, -1202, -3920, -758, -2198, -3952, -6093, -10847, -12564, -6782, -4424, -5666, -6045, -3250, 392, 1363, -1362, -3710, -5590, -3919, -573, -2370, -7279, -11143, -9651, -4363, -5195, -1040, 2653, 2219, 579, -4088, -4697, -3398]
3552c398J437j161L020L474l753m786R97J452m571O94L593K010L004J355k325
3537A042k151R60J204j944r61M734j796m254l271n436K208L698n13N17L195O558
3521C790j005o805q73L566K435J721m672j742l76k61K055j32L469J385K312K758
3505G625l174m576l666k151Q44J561K264K267Q35m443n716O86K542J732l97k481
3489f248l059Q62O16m129N265M847N221K136q48k466k496m000j419N62L899M844
3473C587k917q233k108L410K463M142k16r034j937J541Q36M755j77K937L327J729
3457D105N05m245j175K60j140K341M036K483n107l691k306J030O504K29L8o170
3441b303l987K630J075R3J625o16M722l933l324n70J39J192k170J908L068J543
$$ y = [-3398, -1961, -3122, -102, 3372, -381, -5167, -4170, -2718, -7289, -6595, -3002, -992, 2012, 3367, 1042, -1109, -149, 1055, -889, -1850, 2884, 1088, -3166, -6437, -11873, -9665, -5967, -6480, -5963, -2768, 3790, 2785, -4020, -4893, -1327, 1108, 2829, -1843, -3585, -3961, -4222, -2167, -2299, 1170, 2555, 4867, 7625, 4451, -125, -3791, -5942, -5098, -3537, -1273, 994, 1829, -2614, -8330, -7644, -5102, -3370, -3767, -6248, -9307, -8445, -7829, -11958, -6693, -1846, 3375, 5511, 4663, 2197, -299, -4299, -5718, -5156, -1257, 3587, 670, -7563, -9671, -6261, -3798, 344, 128, -8906, -10843, -9302, -8466, -3711, -3888, -951, 2376, 4105, 4610, 365, -810, -550, -1690, 651, 4687, 7170, 2063, -1628, -3934, -2904, 3600, 3829, 3867, -2303, -6290, -3660, -2585, -2492, -867, -1483, 3239, -694, -4018, -4588, -4449, -3257, -5427, -3519, -451, 1092]
$$ [...]
##END NTUPLES=NMR SPECTRUM
##END=
