##TITLE=Analysis number 312049
Compound Code mo 00943
Project Code adrs
Chemist Name ugmt
##JCAMPDX= 6.0         $$ Bruker NMR JCAMP-DX V2.0
##DATA TYPE= NMR SPECTRUM
##DATA CLASS= NTUPLES
##ORIGIN= Bruker BioSpin GmbH
##OWNER= NMR
$$ XWIN-NMR		Version 3.5
$$ Fri Jul 22 10:12:13 2005 GMT Daylight Time (UT+1h)  MAYBRIDGE\NMR@NMR_250MHZ
##.OBSERVE FREQUENCY= 250.131544655141
##.OBSERVE NUCLEUS= ^1H
##.ACQUISITION MODE= SIMULTANEOUS (DQD)
##.ACQUISITION SCHEME= undefined
##.AVERAGES= 16
##.DIGITISER RES= 18
##SPECTROMETER/DATA SYSTEM= dpx250
##.PULSE SEQUENCE= zg30
##.SOLVENT NAME= CDCl3
##.SHIFT REFERENCE= (INTERNAL, CDCl3, 0, 16.46)
##AUDIT TRAIL= $$ (NUMBER, WHEN, WHO, WHERE, WHAT)
$$ ##TITLE= Audit trail, XWIN-NMR		Version 3.5
$$ ##JCAMPDX= 5.01
$$ ##ORIGIN= Bruker BioSpin GmbH
$$ ##OWNER= NMR
$$ C:\u/data/dgb/nmr/ADRS/6370/pdata/1/auditp.txt
$$ ##AUDIT TRAIL=  $$ (NUMBER, WHEN, WHO, WHERE, WHAT)
(   1,<2005-07-22 10:11:54.14 +100>,<MAYBRIDGE\NMR>,<NMR_250MHZ>,
      <created by zg, POWCHK disabled, PULCHK disabled
       configuration hash MD5:
       62 19 C7 07 E1 42 D1 B7 37 6C 3D D0 77 39 F9 E6
       data hash MD5: 64K
       24 8F 8C 0C DD F0 33 66 7C 4B 28 36 D7 ED B3 21>)
(   2,<2005-07-22 10:12:05.14 +100>,<MAYBRIDGE\NMR>,<NMR_250MHZ>,
      <Start of raw data processing
       ef LB = 0.3 FT_mod = 6 PKNL = 1 SI = 32K 
       data hash MD5: 32K
       B4 DF B8 D5 D5 4F 74 44 6B DC 25 61 37 67 E6 C7>)
(   3,<2005-07-22 10:12:07.07 +100>,<MAYBRIDGE\NMR>,<NMR_250MHZ>,
      <apk 
       data hash MD5: 32K
       68 2B 33 96 4B F5 0D 32 B2 73 8A 7C 9E F9 52 A1>)
(   4,<2005-07-22 10:12:07.75 +100>,<MAYBRIDGE\NMR>,<NMR_250MHZ>,
      <abs ABSG = 5 
       data hash MD5: 32K
       58 0D DE FA 82 13 E2 AA 8D EE 09 E5 E7 42 9C 3D>)
$$ ##END=
$$ 
$$ hash MD5
$$ 07 FB 27 C1 E1 27 0F 32 27 E8 A8 E2 D0 96 1E C0
##$RELAX= 
##$RELAX= 
##$RELAX= 
##$RELAX= 
##$RELAX= 
##$RELAX= 
##$RELAX= 
$$ Bruker specific parameters
$$ --------------------------
##$DU= <C:\u>
##$EXPNO= 6370
##$NAME= <ADRS>
##$PROCNO= 1
##$TYPE= <nmr>
##$USER= <dgb>
##$AMP= (0..31)
100 100 100 100 100 100 100 100 100 100 100 100 100 100 100 100 100 100 
100 100 100 100 100 100 100 100 100 100 100 100 100 100 
##$AQSEQ= 0
##$AQ_mod= 3
##$AUNM= <au_zg>
##$AUTOPOS= <7 >
##$BF1= 250.13
##$BF2= 250.13
##$BF3= 250.13
##$BF4= 250.13
##$BF5= 500.13
##$BF6= 500.13
##$BF7= 500.13
##$BF8= 500.13
##$BYTORDA= 1
##$CFDGTYP= 0
##$CFRGTYP= 5
##$CHEMSTR= <none>
##$CNST= (0..31)
1 1 145 1 1 1 1 1 1 1 1 1 1 1 1 1 1 1 1 1 1 1 1 1 1 1 1 1 1 1 1 1 
##$CPDPRG= <>
##$CPDPRG1= <>
##$CPDPRG2= <>
##$CPDPRG3= <>
##$CPDPRG4= <mlev>
##$CPDPRG5= <mlev>
##$CPDPRG6= <mlev>
##$CPDPRG7= <mlev>
##$CPDPRG8= <mlev>
##$CPDPRGB= <>
##$CPDPRGT= <>
##$D= (0..31)
0 1 0 0 0 0 0 0 0 0.06 0 0 0 0 0 0 0.0002 0 0 0 0 0 0 0 0 0 0 0 0 0 0 
0 
##$DATE= 1122023513
##$DBL= (0..7)
120 120 120 120 120 120 120 120 
##$DBP= (0..7)
150 150 150 150 150 150 150 150 
##$DBP07= 0
##$DBPNAM0= <>
##$DBPNAM1= <>
##$DBPNAM2= <>
##$DBPNAM3= <>
$$ [...]
##$SUBNAM7= <"">
##$SUBNAM8= <"">
##$SUBNAM9= <"">
##$SW= 20.6930455092707
##$SWIBOX= (0..15)
0 0 3 0 0 0 0 0 0 0 0 0 0 0 0 0 
##$SW_h= 5175.983436853
##$TD= 65536
##$TD0= 1
##$TE= 295.16
##$TE2= 300
##$TE3= 300
##$TEG= 300
##$TL= (0..7)
0 120 120 120 120 120 120 120 
##$TP= (0..7)
150 150 150 150 150 150 150 150 
##$TP07= 0
##$TPNAME0= <>
##$TPNAME1= <>
##$TPNAME2= <>
##$TPNAME3= <>
##$TPNAME4= <>
##$TPNAME5= <>
##$TPNAME6= <>
##$TPNAME7= <>
##$TPOAL= (0..7)
0.5 0.5 0.5 0.5 0.5 0.5 0.5 0.5 
##$TPOFFS= (0..7)
0 0 0 0 0 0 0 0 
##$TUNHIN= 0
##$TUNHOUT= 0
##$TUNXOUT= 0
##$USERA1= <user>
##$USERA2= <user>
##$USERA3= <user>
##$USERA4= <user>
##$USERA5= <user>
##$V9= 5
##$VALIST= <valist>
##$VCLIST= <CCCCCCCCCCCCCCC>
##$VD= 0
##$VDLIST= <DDDDDDDDDDDDDDD>
##$VPLIST= <PPPPPPPPPPPPPPP>
##$VTLIST= <TTTTTTTTTTTTTTT>
##$WBST= 1024
##$WBSW= 4
##$XGAIN= (0..3)
0 0 0 0 
##$XL= 0
##$YL= 0
##$YMAX_a= 302208
##$YMIN_a= -340669
##$ZGOPTNS= <>
##$ZL1= 120
##$ZL2= 120
##$ZL3= 120
##$ZL4= 120
##$ABSF1= 16.46003
##$ABSF2= -4.233143
##$ABSG= 5
##$ABSL= 3
##$ALPHA= 0
##$AQORDER= 0
##$ASSFAC= 0
##$ASSFACI= 0
##$ASSFACX= 0
##$ASSWID= 0
##$AUNMP= <proc_1d>
##$AZFE= 0.1
##$AZFW= 0.1
##$BCFW= 0
##$BC_mod= 0
##$BYTORDP= 0
##$COROFFS= 0
##$CY= 12.5
##$DATMOD= 1
##$DC= 0
##$DFILT= <>
##$DTYPP= 0
##$F1P= 14.0000005364418
##$F2P= -0.99999901652339
##$FCOR= 0.5
##$FTSIZE= 32768
##$FT_mod= 6
##$GAMMA= 0
##$GB= 0
##$INTBC= 1
##$INTSCL= 1
##$ISEN= 128
##$LB= 0.3
##$LEV0= 0
##$LPBIN= 0
##$MAXI= 10000
##$MC2= 0
##$MEAN= 0
##$ME_mod= 0
##$MI= 0
##$NCOEF= 0
##$NC_proc= -4
##$NLEV= 6
##$NOISF1= 0
##$NOISF2= 0
##$NSP= 0
##$NTH_PI= 0
##$NZP= 0
##$OFFSET= 16.46003
##$PC= 1
##$PHC0= -80.97881
##$PHC1= 9.109541
##$PH_mod= 1
##$PKNL= yes
##$PPARMOD= 0
##$PSCAL= 4
##$PSIGN= 0
##$REVERSE= no
##$SF= 250.130015499716
##$SI= 32768
##$SIGF1= 0
##$SIGF2= 0
##$SINO= 400
##$SIOLD= 32768
##$SREGLST= <1H.CDCl3>
##$SSB= 0
##$STSI= 32768
##$STSR= 0
##$SW_p= 5175.98343685301
##$SYMM= 0
##$S_DEV= 0
##$TDeff= 65536
##$TDoff= 0
##$TI= <Analysis number 999999
Compound Code 99
Book Reference 9
Project Code 9>
##$TILT= no
##$TM1= 0
##$TM2= 0
##$TOPLEV= 0
##$USERP1= <user>
##$USERP2= <user>
##$USERP3= <user>
##$USERP4= <user>
##$USERP5= <user>
##$WDW= 1
##$XDIM= 32768
##$YMAX_p= 272094263
##$YMIN_p= -425012
$$ End of Bruker specific parameters
$$ ---------------------------------
##NTUPLES= NMR SPECTRUM
##VAR_NAME=  FREQUENCY,     SPECTRUM/REAL,   SPECTRUM/IMAG
##SYMBOL=    X,             R,               I
##VAR_TYPE=  INDEPENDENT,   DEPENDENT,       DEPENDENT
##VAR_FORM=  AFFN,          ASDF,            ASDF
##VAR_DIM=   32768,         32768,           32768
##UNITS=     HZ,            ARBITRARY UNITS, ARBITRARY UNITS
##FACTOR=    0.157963299565203, 1,           1
##FIRST=     4117.14745948675, 0,            0
##LAST=      -1058.83597736626, 0,           0
##MIN=       -1058.83597736626, -425012,     0
##MAX=       4117.14745948675, 272094263,    0
$$ Real data points
##PAGE= N=1
##DATA TABLE= (X++(R..R)), XYDATA
$$ [...]
24461g1949O5001k7656L3979L8937m7588j29493L0347O4078N9814K1031o7102
$$ -71949 -6948 -34604 -625 38312 -9276 -138769 -108422 -44344 15470 36501 -30601
24450c0601o1109j5928Q0040J09064l0213o6197m025M6534k4265l9014Q2581M6128
$$ -30601 -91710 -107638 -27598 81466 51253 -14944 -18969 27565 3300 -35714 46867 92995
24438I2995L5110k8313l2962L0696K3666m8293n7951r3856p0380O4902N5197O7034
$$ 92995 128105 99792 66830 97526 121192 72899 14948 -78908 -149288 -84386 -29189 37845
24426C7845Q285o0340n7785k5470J7109N6086K8120k3877J146r87j0672J0940
$$ 37845 46130 -14210 -71995 -97465 -80356 -24270 3850 -20027 -18881 -19868 -30540 -19600
24414a9600O1342j7453m4712P30m334n3853r60R6994k7822p4817N8393N5427j0746
$$ -19600 41742 24289 -20423 -19693 -24027 -77880 -78840 18154 -9668 -84485 -26092 29335 18589
24401A8589m8730M8809J9047m858r8873l4795N1973N5742j7579j0803J1774l2288
$$ 18589 -30141 18668 37715 32857 -66016 -100811 -48838 6904 -10675 -21478 -9704 -41992
24389d1992k5672M5924P7501l6083j7492J7920k1948M3251L6597j25137q2405
$$ -41992 -67664 -21740 55761 19678 2186 20106 -1842 41409 78006 -47131 -129536
24378a29536K0967N1975M6043m7500j6279J0578k068o473K2356K9441j6095o9438
$$ -129536 -108569 -56594 -10551 -58051 -74330 -63752 -65820 -72293 -49937 -20496 -36591 -106029
24366a06029j7365O4037J5670k0977m5455J3223N1760O9234k9825k0686L573M7480
$$ -106029 -123394 -59357 -43687 -64664 -110119 -96896 -45136 24098 -5727 -26413 -22840 24640
24354B4640P9749K4455r3576K001J4614k3410J0540K1288j3533L2952k7777K6517
$$ 24640 104389 128844 35268 37269 51883 28473 39013 60301 46768 79720 51943 78460
24342G8460K080p4691j34119Q253N1064q278o676N0210M884k7381K4584K8593
$$ 78460 80540 5849 -128270 -120017 -68953 -77231 -83907 -33697 -28813 -56194 -31610 -3017
24330c017q509k4436J5721L2638j9254k047N7043l5907r200K8337l2617n1901
$$ -3017 -11526 -35962 -20241 12397 -6857 -8904 48139 12232 3032 31369 -1248 -53149
24318e3149N4770l4512j448K1537k1744n5917k581R166k2325J4025J17747K8325
$$ -53149 1621 -32891 -34339 -12802 -34546 -90463 -93044 -83878 -106203 -92178 25569 53894
24306E3894q6124r5051m0234K0211O4822J1518n800k2829k1969M3579k627J4769
$$ 53894 -32230 -127281 -167515 -147304 -82482 -70964 -76764 -99593 -121562 -77983 -80610 -65841
24294f5841M8885M8378N120m7086J851l6797L1205K9062J2826M7117L5901m9793
$$ -65841 -16956 31422 36542 -10544 -8693 -45490 -14285 14777 27603 74720 110621 60828
24282F0828j22324j04142M5275J33500K2110p33l7937l0487L5233P198L8057n3898
$$ 60828 -61496 -165638 -120363 13137 35247 34514 -3423 -33910 1323 8521 46578 -7320
24270g320j2600P2191K734k5629L3997j4355O433j9517n903j5322K5529Q165l688
$$ -7320 -19920 52271 55005 29376 63373 49018 55451 35934 30031 14709 40238 48403 44715
24257D4715p0515O8921M0218l9274k5382j4624o4936j3314N8021L0512l6426m2399
$$ 44715 -25800 43121 83339 44065 18683 4059 -60877 -74191 -16170 14342 -22084 -64483
24245f4483L0163K7868L4025r442j5189k3348L7275k7443o308l939j5406M8345
$$ -64483 -34320 -6452 27573 18131 2942 -20406 16869 -10574 -16882 -20821 -36227 12118
24233A2118l102j2066j5639l5902K9042R688k4857M3290n250M4721K5314k2908
$$ 12118 9016 -3050 -18689 -54591 -25549 -15861 -40718 2572 -2678 42043 67357 44449
24221D4449l2101n702k1538k6299l2629j0766L8283O7138k2057m6596p110n8317
$$ 44449 12348 6646 -14892 -41191 -73820 -84586 -46303 20835 -1222 -47818 -54928 -113245
24209a13245L6481N5495l4169l0282M4591l9044o300J0092K5583M4608O8228k6553
$$ -113245 -76764 -21269 -55438 -85720 -41129 -80173 -86473 -76381 -50798 -6190 62038 35485
24197C5485l5479l1859M123N2026j572q6722n2578l1319q885L3945O1928L0864
$$ 35485 6 -31853 -27730 24296 22724 -63998 -116576 -147895 -156780 -122835 -60907 -30043
24185c0043L775J735k6986o8404J0099J5608K9921L0691k9134o145J9093o5674
$$ -30043 -26268 -24533 -51519 -119923 -109824 -94216 -64295 -33604 -62738 -68883 -49790 -115464
24173a15464L2507K3939k5672J9894j4576K6782N0993l3923Q567O1245K196k8297
$$ -115464 -82957 -59018 -84690 -64796 -79372 -52590 -1597 -35520 -26953 34292 36488 8191
24161H191j6096K7003J6481j6645J1184r384Q802n9509n7010j2090J0062Q7184
$$ 8191 -7905 19098 35579 18934 30118 20734 29536 -29973 -86983 -99073 -89011 -1827
24149a827O958l0797j3414l0008J8916O3907l2078l2012k6911O3022K1794p881
$$ -1827 5131 -25666 -39080 -69088 -50172 13735 -18343 -50355 -77266 -14244 7550 -331
24137c31j3412r295O935l432L3277L8207l6261p8480M1475L8628j3762K3764k4439
$$ -331 -13743 -23038 -16103 -19535 13742 51949 15688 -62792 -21317 17311 3549 27313 2874
24124B874k3335K8437L4497o3498m1002l4730J8052M7368n787J0254L0843M2256
$$ 2874 -20461 7976 42473 -21025 -62027 -96757 -78705 -31337 -37124 -26870 3973 46229
24112D6229J5467l4455j8034r980r577n5247j6363R854K5670L955k5642p416j7769
$$ 46229 61696 27241 9207 -773 -10350 -65597 -81960 -72106 -46436 -42481 -68123 -75539 -93308
24099i3308N552R711M7932N0813O1598K4407j998p2971o6390n849L6505J3663
$$ -93308 -87756 -78045 -30113 20700 82298 106705 104707 31736 -34654 -40503 -3998 9665
24087I665o757o0522l6910n151O2236J19936p705J5091J9127k9167l3138J6969
$$ 9665 2908 -57614 -94524 -99675 -37439 82497 74792 89883 109010 79843 46705 63674
24075F3674p2173j03109P1L4098j515N0033j9966m6319P1403J26011j742r1130
$$ 63674 -8499 -111608 -111537 -77439 -78954 -28921 -48887 -95206 -23803 102208 100466 9336
24063I336r8572j5393L8617J36K1505P3789N1068l644Q513K0209j06460r0696
$$ 9336 -89236 -104629 -66012 -65876 -44371 29418 80486 76842 85355 105564 -896 -91592
24051i1592J7237L450R00O1277j0070j3361k5587R483K4628j0784N62L0883N6856
$$ -91592 -74355 -70905 -70005 -8728 -18798 -32159 -57746 -48263 -23635 -34419 -33857 -2974 53882
24038E3882m8293J095P5944J3018K329n0976J1054O047n0987j3952K8739M8905
$$ 53882 5589 6684 82628 95646 97975 46999 58053 64100 13113 -839 27900 76805
24026G6805K0146l9638N192o7048m822J0995k899l8939L1821k789K0913j6640
$$ 76805 96951 57313 62505 -4543 -9365 1630 -1269 -40208 -8387 -11176 9737 -6903
24014f903l3625m2565j2434M7909Q6760K5683o1880k4599L712k8242L51J716K6689
$$ -6903 -40528 -83093 -95527 -47618 39142 64825 2945 -21654 -17942 -46184 -45833 -44117 -17428
24001a7428k6173k3389J8190j7028j1237M9762L0425p814q663j8375J2337L8545
$$ -17428 -43601 -66990 -48800 -65828 -77065 -27303 3122 -4692 -13355 -31730 -19393 19152
23989A9152J1753j8319l0882K0178J3069M3484p626j2416j5031l8455m723J6966
$$ 19152 30905 12586 -18296 1882 14951 58435 50809 38393 23362 -15093 -19816 -2850
23977b850n0813j3383j8544O5573q286k6769K7482k060M214P6886j864k4363N0064
$$ -2850 -53663 -67046 -85590 -20017 -28303 -55072 -27590 -29650 -25436 51450 49586 25223 75287
23964G5287l6351m7811J7245N8257R677l4145o1962j1606m2030Q141l2827n5742
$$ 75287 38936 -8875 8370 66627 76304 42159 -19803 -31409 -73439 -65298 -98125 -153867
23952a53867P767J13578n5069o1860n429j6570K7154J3704M7645K0368J8339j7593
$$ -153867 -146100 -32522 -87591 -149451 -154880 -171450 -144296 -130592 -82947 -62579 -44240 -61833
23940f1833j0170l0853M5333R0294j2810L0627J0878k2679m1371J0637K0969K4999
$$ -61833 -72003 -102856 -57523 32771 19961 50588 61466 38787 -2584 8053 29022 54021
23928E4021n9109j6164P217K6704J1544l63M7024n8187m2040M182j6190q292M338
$$ 54021 -5088 -21252 -14035 12669 24213 23850 70874 12687 -29353 -25171 -41361 -49653 -45315
23915d5315Q2118R3994K4671J076p4663l820j2646l6107o5256J861j0792o4292
$$ -45315 36803 130797 155468 156544 81881 78061 65415 29308 -35948 -34087 -44879 -109171
23903a09171K4798L5420N743j4007J270P7297M4664k7129M9562j2391j6932n4224
$$ -109171 -84373 -48953 -43210 -57217 -55947 21350 66014 38885 88447 76056 59124 4900
23891D900p5593N5456J4760j9289m3809N335L1277k445J0785J9388k731K8560
$$ 4900 -70693 -15237 -477 -19766 -63575 -58240 -26963 -29408 -18623 765 -1966 26594
23879B6594k7770l112P7252J742o4070j6205J5908P9053l2681j01396n893L9979
$$ 26594 -1176 -4288 72964 74706 10636 -5569 10339 89392 56711 -44685 -50578 -10599
23867a0599N0587j2544k8599j1376p2676L1373M2879O367j1892l0068l1027Q2460
$$ -10599 39988 27444 -1155 -12531 -85207 -53834 -10955 -4588 -16480 -46548 -77575 4885
23855D885J3602k0199m5546o5555N6098M6081n2481M121j5056K3633P9723N6005
$$ 4885 18487 -1712 -47258 -112813 -56715 -10634 -63115 -58994 -74050 -50417 29306 85311
23843H5311N5297j4979j09729n989j6328n1325L1087K272L8762N219k2912L3224
$$ 85311 140608 125629 15900 9911 -6417 -57742 -26655 -24383 14379 19598 -3314 29910
23831B9910K3763p4669j0542J1191J3165K7141n0349m3283q955J9005M8413R5254
$$ 29910 53673 -20996 -31538 -20347 -7182 19959 -30390 -73673 -82628 -63623 -15210 80044
23819H0044N5059q380p6149m9542J4280P4003K7893l3316m9611M9241l8802m0674
$$ 80044 135103 126723 50574 1032 15312 89315 117208 83892 34281 83522 44720 4046
23807D046l1778L1426r3624j6828K6534O0554k494n5180j9251L1267J3860N0251
$$ 4046 -27732 3694 -89930 -106758 -80224 -19670 -22164 -77344 -96595 -65328 -51468 -1217
23795a217O4604j1271M9947n3800o0075K2062j1591n5696R439N59K358K6957m767
$$ -1217 63387 52116 102063 48263 -11812 10250 -1341 -57037 -47598 -47039 -44681 -17724 -22491
23782b2491q142N0940Q9418J2331n7548J9956n6435l6259j3556k6009o0950r465
$$ -22491 -30633 20307 109725 122056 64508 84464 28029 -8230 -21786 -47795 -108745 -118210
23770a18210k4171j5526N1118Q0853l6878l6561M9103N4067k0379p7774p562o544
$$ -118210 -142381 -157907 -106789 -25936 -62814 -99375 -50272 3795 -16584 -94358 -101920 -108464
23758a08464m61M7699O8659p926m6046m9667M2650L6853L3682K2382k8794n6863
$$ -108464 -108925 -61226 7433 -493 -46539 -96206 -53556 -16703 16979 39361 10567 -46296
23746d6296o9744m4348K8067O5482l9567K3089L3815K1405P0966O6781j6154k8177
$$ -46296 -116040 -160388 -132321 -66839 -106406 -83317 -49502 -28097 42869 109650 93496 65319
23734F5319j5389l5552j7159M0283J6540k2018p682o9116j9336J7385j0356k6578
$$ 65319 49930 14378 -2781 37502 54042 32024 24342 -44774 -64110 -46725 -57081 -83659
23722h3659N0586Q125L1031n4445j20997L9527P2613K9008m809Q0118N70Q431
$$ -83659 -33073 -24948 6083 -48362 -169359 -129832 -57219 -28211 -33020 47098 47668 56099
23710E6099k844o9739j04713L7571J0939J73L933J5947M268J91N3554k3820j248
$$ 56099 53255 -16484 -121197 -83626 -72687 -72514 -68581 -52634 -48366 -48175 5379 -18441 -19689
23697a9689N479j0227K3555M5429M0021l856j4379L380k688k4115O967n2396m2206
$$ -19689 -14210 -24437 -882 44547 84568 80712 66333 69713 67025 42910 49877 -2519 -44725
23684d4725J639j2051n3753M1279N4138N5537L1191k3108k2804m4555j6444k144
$$ -44725 -43086 -55137 -108890 -67611 -13473 42064 73255 50147 27343 -17212 -33656 -35800
23672c5800j1530J5177R1259p439k1615q754J1483q245j6707j0397J0450J0090
$$ -35800 -47330 -32153 59106 51667 30052 21298 32781 24536 7829 -2568 7882 17972
23660A7972q071K3866R4656L0224n1060n6389q2839j9409K3136q62k1942m4502
$$ 17972 9901 33767 128423 158647 107587 51198 -31641 -51050 -27914 -28776 -50718 -95220
23648i5220R633M765J8176M018K2992m7381K8123P755j8584l0660L9272O0527
$$ -95220 -85587 -80822 -62646 -58628 -35636 -83017 -54894 -47139 -65723 -96383 -57111 3416
23636C416r327l1194n5096k4005N9595M7691k3936K8324K8917J069j9855k1809
$$ 3416 -5911 -37105 -92201 -116206 -56611 -8920 -32856 -4532 24385 25454 5599 -16210
23624a6210L390O724K5359R642P212n7287l0350k1670J8955N1518j9669j31537
$$ -16210 -12820 -6096 19263 28905 36117 -21170 -51520 -73190 -54235 -2717 -22386 -153923
23612a53923l5548P2068Q5340Q0764n5174O11l908j9473j5223j286N7982k7714
$$ -153923 -189471 -117403 -32063 48701 -6473 -5862 -9770 -29243 -44466 -45752 12230 -15484
23600a5484K6913M8251m7152k6994l2784J1899K2108k4792l4562J381M6076M5556
$$ -15484 11429 59680 12528 -14466 -47250 -35351 -13243 -38035 -72597 -71216 -25140 20416
23588B0416L8517M9743j1209m1581J0179J3065k9904p6639J2655j3110L7206N8366
$$ 20416 58933 108676 97467 55886 66065 79130 49226 -27413 -14758 -27868 9338 67704
23576F7704J2771p5299j741l0538m7906K6034k95j6270M3817k2144j1710K301
$$ 67704 80475 5176 3435 -27103 -75009 -48975 -49270 -65540 -21723 -43867 -55577 -53276
23564e3276J0428J3749L2302m969N4760K7958l5585j07067j0764k841J5536M1494
$$ -53276 -42848 -29099 3203 -1766 52994 80952 45367 -61700 -72464 -75305 -59769 -18275
23552a8275l855j2133O9136K390J089l0609N3206N8784o2774n8267j492J3172
$$ -18275 -22130 -34263 34873 37263 38352 7743 60949 119733 56959 -1308 -2800 10372
23540A0372r577j3311K6643N6061O9064J3915k7932l7612m4428o0554l6431L8930
$$ 10372 795 -12516 14127 70188 139252 153167 125235 87623 43195 -17359 -53790 -14860
23528a4860M9887L2445K8546m8279m3285R3J6973k2881J5422l7995m7907k1854
$$ -14860 35027 67472 96018 47739 4454 4547 21520 -1361 14061 -23934 -71841 -93695
23516i3695K21P8086P673p0455J4840l218M9946j384l8184p861j1351n285J1782
$$ -93695 -93474 -15388 -7715 -78170 -63330 -66548 -16602 -17986 -56170 -64031 -75382 -80667 -68885
23503f8885l3241L8651p903M5499K3908L5126m4574r4119q2469r476R3474J5253
$$ -68885 -102126 -63475 -71378 -25879 -1971 33155 -11419 -105538 -188007 -197483 -104009 -88756
23491h8756L96M1579l672l1519k6423J848P1277L172J0077K45n5020K1826J22383
$$ -88756 -88360 -46781 -50453 -81972 -108395 -106547 -35270 -32098 -22021 -21776 -76796 -54970 67413
23478F7413l3265o6550Q333L336Q459j277l6149m7328o2920K4355p7o101n119
$$ 67413 34148 -32402 -24069 -20733 -12274 -13551 -49700 -97028 -159948 -135593 -135670 -141771 -146890
23465a46890j2390L8676L7249j637N454k9014Q670P7592K5968k4832j4239q593
$$ -146890 -159280 -120604 -83355 -84992 -79538 -108552 -99882 -22290 3678 -21154 -35393 -43986
23453d3986N442o766r366p206K0335N8056k0901o0117o3970J432M8083Q0433J5650
$$ -43986 -38544 -45310 -54676 -61882 -41547 16509 -4392 -64509 -128479 -127047 -78964 1469 17119
23440A7119o1302k6725k6681K1361K1372J2074j6310j2888k3729J2565l289k4945
$$ 17119 -44183 -70908 -97589 -76228 -54856 -42782 -59092 -71980 -95709 -83144 -86433 -111378
23428a11378q341J5881p938P5854l3975O63K7061k8074p446Q833P6840M0447m3978
$$ -111378 -119719 -103838 -111776 -35922 -69897 -69234 -42173 -70247 -77693 -68860 7980 48427 4449
23415D449K6109L0754k1185m59k7100p2693m6150J0510M3023L148L005n9128Q5782
$$ 4449 30558 61312 40127 39668 12568 -60125 -106275 -95765 -52742 -49594 -46589 -105717 -19935
23402a9935L7152n1446J6992l0395q424j8843N2K0654o5328j4632J5270q936K7856
$$ -19935 17217 -34229 -17237 -47632 -56056 -74899 -74847 -54193 -119521 -134153 -118883 -127819 -99963
23389i9963N3883O440n3227q4983R392M9285M0303k5472j6409J7144M5564M9081
$$ -99963 -46080 -39640 -92867 -177850 -168458 -119173 -78870 -104342 -120751 -103607 -58043 -8962
23377h962j4090k3081p0337k2775L1867O4076m1042J142o501q327L0296O3164
$$ -8962 -23052 -46133 -116470 -139245 -107378 -43302 -84344 -83202 -89703 -98030 -67734 -4570
23365d570j3285M3568Q5270l2688j13147k150O3417M006l6015J2112j5089L2101
$$ -4570 -17855 25713 110983 78295 -34852 -37002 26415 30421 -5594 6518 -8571 23530
23353B3530j7488L478M0839p563l5534m4309J7674J1726L486n6504k6713j0896
$$ 23530 6042 9520 50359 42796 7262 -37047 -19373 -7647 -4161 -60665 -87378 -98274
23341i8274j1003M7906P4029N345J8883j1554j2187k6515j1491l7478m1517j8291
$$ -98274 -109277 -61371 12658 18003 36886 25332 13145 -13370 -24861 -62339 -103856 -122147
23329a22147J0820k2194M3604N0469k5953N4029Q3308K5034Op599m4516K746p0048
$$ -122147 -111327 -133521 -89917 -39448 -65401 -11372 71936 96970 96976 89377 44861 47607 -22441
23316b2441j14809K2934P4723M3879j5091K4614J9762l8662J9179K0880K4975
$$ -22441 -137250 -114316 -39593 4286 -10805 13809 33571 -5091 14088 34968 59943
23305E9943k0174n5656l3224J7255K0314j0426k0555l5621J0777j0319k1664K9016
$$ 59943 39769 -15887 -49111 -31856 -11542 -21968 -42523 -78144 -67367 -77686 -99350 -70334
23293g0334l3416O5732J5287m2229J9165L3036j6742o3644J0764N8654L3607n6416
$$ -70334 -103750 -38018 -22731 -64960 -45795 -12759 -29501 -93145 -82381 -23727 9880 -46536
23281d6536j212N4439k4806j3631J7338j9436J1763J6009j1312j00522Q51Q2046
$$ -46536 -47748 6691 -18115 -31746 -14408 -33844 -22081 -6072 -17384 -117906 -117055 -35009
23269c5009M0588j0268k9746M040m3705n0551J2090M4483o939l0278P7584P2361
$$ -35009 5579 -4689 -34435 -30395 -74100 -124651 -112561 -68078 -75017 -105295 -27711 44650
23257D4650j6270n1739k6554l2997m1862K3954P7708P9231l3251l9856P1506j4001
$$ 44650 28380 -23359 -49913 -82910 -124772 -100818 -23110 56121 22870 -16986 54520 40519
23245D0519q1327K6907n1212k7772o821j2699Q2389P8303n471m5954O854l476
$$ 40519 -40808 -13901 -65113 -92885 -99706 -112405 -30016 48287 42816 -3138 3716 240
23233B40O3731L050l3085k6365k1257P460j6919p8206k4115K229O4905M697k0653
$$ 240 63971 67021 33936 7571 -13686 -6226 -23145 -101351 -125466 -123237 -58332 -53635 -74288
23220g4288J3137K2568L470j0230j1788o898k0006P0982J1714N1334J6927j9555
$$ -74288 -61151 -38583 -35113 -45343 -57131 -64029 -84035 -13053 -1339 49995 66922 47367
23208D7367K5395J2592l0844l7629o1613q0592Q327M5049P443O900N1633R6160
$$ 47367 72762 85354 54510 16881 -44732 -125324 -116997 -71948 -64505 -57605 -5972 90188
23196I0188L4299j31173j01564L1573L6476K2130j4900J04N988Q637k2505o3940
$$ 90188 124487 -6686 -108250 -76677 -40201 -18071 -32971 -32867 -26879 -18242 -40747 -104687
23184a04687l3400K9414O8624O0730j1876K7839Q779n1799j1081O3509J5632m656
$$ -104687 -138087 -108673 -40049 20681 8805 36644 45423 -6376 -17457 46052 61684 57028
23172E7028p0857o402Q5424k0599m4855n0592j4365M0085M4198L0793n5226l7678
$$ 57028 -13829 -20231 65193 44594 -261 -50853 -65218 -25133 19065 49858 -5368 -43046
23160d3046N0782m395K3409M3268m4065m3991L5169K4720k0410k6834p9781r423
$$ -43046 7736 3341 26750 70018 25953 -18038 17131 41851 21441 -5393 -85174 -94597
23148i4597k0490O0964N5044J9350j3534k4524M5209Q4569l0586n5521o586K8835
$$ -94597 -115087 -54123 921 20271 6737 -17787 27422 111991 81405 25884 19298 48133
23136D8133j5044l6579k6508M141k3581L8654K3090n884M4146N924K8378j8943
$$ 48133 33089 -3490 -29998 -25857 -49438 -10784 12306 6422 50568 56492 84870 65927
23124F5927j0595l6747m4398j0782K7064N95l5827l1456Q415J5358K4056Q145
$$ 65927 55332 18585 -25813 -36595 -9531 -8936 -44763 -76219 -67804 -52446 -28390 -20245
23112b0245o0803L5386J7781K9158n672k2931j372p182J3452K200o283m4421m2222
$$ -20245 -81048 -45662 -27881 1277 -4395 -27326 -28698 -35880 -22428 -20228 -26511 -70932 -113154
23099a13154J1498L0923J1239j6592M6237J2803p789M0983N839P516m6656l0615
$$ -113154 -101656 -70733 -59494 -76086 -29849 -17046 -24835 16148 21987 29503 -17153 -47768
23087d7768N2775P381j2355j7812m92j2422m8270l0139j1171O4934O3496p7782
$$ -47768 5007 12388 33 -17779 -18271 -30693 -78963 -109102 -120273 -55339 8157 -69625
23075f9625j8343M8922O9533n85j5918n1501l9291j8833L1625L9735l7981k0593
$$ -69625 -87968 -39046 30487 29902 13984 -37517 -76808 -95641 -64016 -24281 -62262 -82855
23063h2855K6083L332K0682L6107L7595n0047J4314M6058L1095L4772o2849q7098
$$ -82855 -56772 -53440 -32758 3349 40944 -9103 5211 51269 82364 117136 54287 -32811
23051c2811l2865L5008R0274J8160J905J5715p1777k6580n645m718q2188J2118
$$ -32811 -65676 -30668 59606 77766 79671 95386 23609 -2971 -8616 -13334 -95522 -83404
23039h3404K9557l0345n255J6236P6304l9506r1469K6937M4694O7010P135l527
$$ -83404 -53847 -84192 -89447 -73211 3093 -36413 -127882 -100945 -56251 10759 17894 14367
23027A4367j2769K4463m551l7926N2269K8821K731n4880n397J82J4635k5814j6997
$$ 14367 1598 26061 21510 -16416 35853 64674 67405 12525 7128 7310 21945 -3869 -20866
23014b0866k9985k3305P4817L1606j6548k2997m9469L7916K2279k9177K3250o017
$$ -20866 -50851 -74156 661 32267 15719 -7278 -56747 -18831 3448 -25729 -2479 -8496
23002h496M8842R229l2710N281J0089j5759P799N112k7909K9481j3024k0020p3978
$$ -8496 40346 49575 16865 22146 32235 16476 24275 29387 1478 30959 17935 -2085 -76063
22989g6063l9221K7458K8495k6449M0462j033j02275k6191L9482J4421m4624J0347
$$ -76063 -115284 -87826 -59331 -85780 -45318 -46351 -148626 -174817 -135335 -120914 -165538 -155191
22977a55191M9395M821Q6971K2622L211j3947K832j5183K0327K5059m1145r0687
$$ -155191 -105796 -100975 -14004 8618 11829 -2118 714 -14469 5858 30917 -10228 -100915
22965a00915N3745N4746J8873L464n1509n5730K8219K4097m8506m6793M1456N5617
$$ -100915 -47170 7576 26449 29913 -21596 -77326 -49107 -25010 -73516 -120309 -78853 -23236
22953b3236q433k2930k957j1244K4436r812k065m4566m9587K8775M2120M9317
$$ -23236 -31669 -54599 -57556 -68800 -44364 -54176 -56241 -100807 -150394 -121619 -79499 -30182
22941c0182J5590K3428j2893m5833k2047M2647Q8003L0800o3268N840N6879M7078
$$ -30182 -14592 8836 -4057 -49890 -71937 -29290 58713 89513 26245 32085 88964 136042
22929A36042m8270q1332r4139j4308L0999M7187K1784J0484J650k2936J0668N423
$$ 136042 87772 6440 -87699 -102007 -71008 -23821 -2037 8447 10097 -12839 -2171 3252
22917C252m8237j1827M718l5016j887P0225M2337m4594k0968O6913J0414l3028
$$ 3252 -44985 -56812 -52094 -87110 -88997 -18772 23565 -21029 -41997 24916 35330 2302
22905B302K5290j686K1800L9829J2796o1924o921p4317M2938N6477k1008k5118
$$ 2302 27592 25906 47706 87535 100331 38407 31486 -42831 107 56584 35576 10458
22893A0458l0202m0866m7705K2450N4633L4222J5431m9845m216J1024j442j7497
$$ 10458 -19744 -60610 -108315 -85865 -31232 2990 18421 -31424 -35640 -24616 -26058 -43555
22881d3555r957l4086p646q488J3026P6949K1426L8312l2342r1639J4841J1364
$$ -43555 -53512 -87598 -95244 -103732 -90706 -13757 7669 45981 13639 -78000 -63159 -51795
22869e1795n6161j2636N4361M8403J1298q503M5452n746k3590j6865M0264J0501
$$ -51795 -107956 -120592 -66231 -17828 -6530 -15033 30419 24673 1083 -15782 24482 34983
22857C4983k1533N8405l5429k2807j0321J07k8948l5970L4082M7563l3003L19
$$ 34983 13450 71855 36426 13619 3298 3405 -25543 -61513 -27431 20132 -12871 -12552
22845a2552M9830N8031L2409l3366n9295q3115n3743R2300P0504m688J1138L2117
$$ -12552 37278 95309 127718 94352 35057 -48058 -101801 -9501 61003 56315 67453 99570
22833I9570J9181n7509q3396J5526k4478k5334R1320l4168o7384n767O8135N8157
$$ 99570 118751 61242 -22154 -6628 -31106 -56440 34880 712 -66672 -72439 -4304 53853
22821E3853l8907l4268R718N859n2053L2111J9319J28k3251L0454K7904m5443
$$ 53853 14946 -19322 -9604 -3745 -55798 -23687 -4368 -4240 -27491 2963 30867 -14576
22809a4576L6139p0635r329K7647K1874j389L6542Q420n2360k5276k266p462L3335
$$ -14576 21563 -49072 -58401 -30754 -8880 -10269 26273 34693 -17667 -42943 -45209 -52671 -19336
22796a9336J3148o8842n4400K7556K8194N9491L6795j9786r4804J0118K8672J7947
$$ -19336 -6188 -75030 -129430 -101874 -73680 -14189 22606 2820 -91984 -81866 -53194 -35247
22784c5247K3452k1115J6394n94J9327J3060j8280J5934j5626p827j9K8426l1201
$$ -35247 -11795 -32910 -16516 -17110 2217 15277 -3003 12931 -2695 -10522 -10541 17885 -13316
22771a3316k9151k1085M886Q853N202M7345L2350q136n829o0603k1371J3991n9
$$ -13316 -42467 -63552 -58666 -49813 -44611 2734 35084 26948 21119 -39484 -60855 -46864 -46923
22758d6923k5084k1312j7295O3864L9841J4043q030Q060N1414Q045k2762q4321
$$ -46923 -72007 -93319 -110614 -46750 -6909 7134 -896 7164 58578 66623 43861 -40460
22746d0460j9050J836L331m5430k7338K0881K37M2826K2773j1195j07m4272m8010
$$ -40460 -59510 -57674 -54343 -99773 -127111 -106230 -105993 -63167 -40394 -51589 -51696 -95968 -143978
22733a43978N820R6283J5416m5855L1881L6515j7390m6968K1633l6813j2683J9831
$$ -143978 -138158 -41875 -26459 -72314 -40433 -3918 -21308 -68276 -46643 -83456 -96139 -76308
22721g6308k2639q322K5079L4377K0869o5019m7023q899j04N8324J2339k1818
$$ -76308 -98947 -107269 -82190 -47813 -26944 -91963 -138986 -147885 -147989 -89665 -77326 -99144
22709i9144K914n202o0K2396J2990rj5633l6131L512P6272M3865L1745m9026l7412
$$ -99144 -96230 -101432 -101492 -79096 -66106 -66115 -81748 -117879 -114367 -38095 5770 37515 -11511 -48923
22695d8923o9191K7594N1585r83l1720k6122N6776P9893J5300N1607l0373q6226
$$ -48923 -118114 -90520 -38935 -39918 -71638 -97760 -40984 38909 54209 105816 75443 -10783
22683a0783K618j9318m7327o1233Q851R3870l552M2569p621q13n754L0769K0273
$$ -10783 -8165 -27483 -74810 -136043 -127192 -33322 -36874 5695 -1926 -2739 -8493 22276 42549
22670D2549L3946r542q0806n2518k5957k1264N596M3155M1062m992l3600J2685
$$ 42549 76495 66953 -13853 -66371 -92328 -113592 -107996 -64841 -23779 -28771 -62371 -49686
22658d9686J2947j5325p5617m124Q4970M6052m0498K9204M8911k0739j30178o3407
$$ -49686 -36739 -52064 -127681 -131805 -46835 -783 -41281 -12077 36834 16095 -114083 -177490
22646a77490O7574K7568J9203Q887p92J709p175l1656K8287Q284k0530j9726o4491
$$ -177490 -109916 -82348 -63145 -54258 -55050 -53341 -60516 -92172 -63885 -55601 -76131 -95857 -160348
22633a60348l2458N2155L61M9205N1374Q4348l5892q0906L5052j7879p838O1542
$$ -160348 -192806 -140651 -140290 -91085 -39711 44637 8745 -72161 -37109 -54988 -62826 -1284
22621a284l2473k7447J3376K6660R67J2504N322n0310q5845J05963N8768r215
$$ -1284 -33757 -61204 -47828 -21168 -20201 -7697 -2375 -52685 -138530 -32567 26201 16986
22609A6986j6506N8644J0381m618k5972l7738q0632k7007K2351O4135N0841L9292
$$ 16986 480 59124 69505 64887 38915 1177 -79455 -106462 -84111 -19976 30865 70157
22597G0157k9631n8003o200j6549L7485L3102n1146l5066O6240M6228m8190o9928
$$ 70157 40526 -17477 -23677 -40226 -2741 30361 -20785 -55851 10389 56617 8427 -61501
22585f1501p1072J6848J12254K4167q673m6345m18k626M4857L0097j8205l6961
$$ -61501 -132573 -115725 -3471 20696 12023 -34322 -34740 -37366 7491 37588 19383 -17578
22573a7578j6651l8991L8971j3679R181k7974J0642j9585K1844K2328m0127j5784
$$ -17578 -34229 -73220 -34249 -47928 -38747 -66721 -56079 -75664 -53820 -31492 -71619 -87403
22561h7403L726J7716J25237J3757l1520j128q5884R70P2057P650o0392o4718
$$ -87403 -83677 -65961 59276 73033 41513 40385 -45499 -44529 27528 35178 -25214 -89932
22549h9932J0920O5161o9307J5957O3737O1243k0032k5333L9450O0018k0302p5390
$$ -89932 -79012 -13851 -83158 -67201 -3464 57779 37747 12414 51864 111882 91580 16190
22537A6190J6842l3438p7102m8267P9994L0672j8801p2881l1494J8245L8455J725
$$ 16190 33032 -406 -77508 -125775 -45781 -15109 -33910 -106791 -138285 -120040 -81585 -79860
22525g9860O8676J4257k5137k7270k7194r946L1096J7820K1996M1550j1385o8615
$$ -79860 -11184 3073 -22064 -49334 -76528 -86474 -55378 -37558 -15562 25988 14603 -54012
22513e4012k3806Q4884P913q994K3672L5000K5711m5820j0399P0551J8001n0298
$$ -54012 -77818 7066 14979 5985 29657 64657 90368 44548 34149 104700 122701 72403
22501G2403K2639R356N87j00607o7769n5370o4733P246K3070O9648P3338l605
$$ 72403 95042 104398 104985 4378 -63391 -118761 -183494 -176248 -153178 -83530 -10192 -13797
22489a3797m5698n3825L3116L3458o928J6607J7287K3962L1805O4009n4309n0648
$$ -13797 -59495 -113320 -80204 -46746 -53674 -37067 -19780 4182 35987 99996 45687 -4961
22477d961m2534k4446J0916K9457P25p1270k7732N4145Q8292K9936j21505r252
$$ -4961 -47495 -71941 -61025 -31568 -30843 -102113 -129845 -75700 12592 42528 -78977 -88229
22465h8229M5418K5723K1315J0013o9565n4524q546O676L6826L5718l214k665
$$ -88229 -42811 -17088 4227 14240 -55325 -109849 -118395 -111719 -74893 -39175 -42389 -45054
22453d5054J2348L8318r022J0519k771o2581j6011P1491N897n3146j1948L0543
$$ -45054 -32706 5612 -3410 7109 4338 -58243 -74254 -2763 3134 -50012 -61960 -31417
22441c1417m5641K7136N3400L413L782n8789n3278N2091j1992J7925Q301j9551
$$ -31417 -77058 -49922 3478 6891 10673 -48116 -101394 -49303 -61295 -43370 -35069 -54620
22429e4620j8754J01773L1939K0246j0426p5998l3471N647m2847K5398O9942o6362
$$ -54620 -73374 28399 60338 80584 70158 -5840 -39311 -33664 -76511 -51113 18829 -47533
22417d7533o1437O2619L3025q7935k1359K9482L3921M2695k0425R27J6622r4563
$$ -47533 -108970 -46351 -13326 -101261 -122620 -93138 -59217 -16522 -36947 -36020 -19398 -113961
22405a13961K782J14758j5592n7988j9585J7876K9826O876l9951n2827k0909p646
$$ -113961 -111179 3579 -12013 -70001 -89586 -71710 -41884 -35008 -74959 -127786 -148695 -156341
22393a56341N3734P7168P3279k8158K1300l6342n9075k705O950K1593j1144L0326
$$ -156341 -102607 -25439 47840 19682 40982 4640 -54435 -57140 -50190 -28597 -39741 -9415
22381i415k5197p997m1332K4617L0251l8985N0893k2638m7050K3956L1193P293
$$ -9415 -34612 -42609 -83941 -59324 -29073 -68058 -17165 -39803 -86853 -62897 -31704 -24411
22369b4411J0316k2820j6533J07087m053k5750r500l9020m5254k4552n4624P520
$$ -24411 -14095 -36915 -53448 53639 49586 23836 14336 -24684 -69938 -94490 -149114 -141594
22357a41594M2091P4907j0763j1502K8952K582k7722j256l7801j8318k3825l1518
$$ -141594 -99503 -24596 -35359 -46861 -17909 -15327 -43049 -44305 -82106 -100424 -124249 -155767
22345a55767J9020l0906M5927J36808P7190k1843n6784q2875m4044O0621N7778
$$ -155767 -136747 -167653 -121726 15082 92272 70429 13645 -69230 -113274 -52653 5125
22334E125Q652l909J028k5769M832N1913k1960k0403M8316N8701j8824l5404l0518
$$ 5125 13777 9868 10896 -14873 -10041 41872 19912 -491 47825 106526 87702 52298 21780
22321B1780J0006m8865p1580O8663L9536j3442j0112K3504l7423j6680p162J6324
$$ 21780 31786 -17079 -88659 -19996 19540 6098 -4014 19490 -17933 -34613 -41775 -25451
22309b5451L0816m1074j6219K4920K574O4854q586l6843l8710L6489K9308L6817
$$ -25451 5365 -35709 -51928 -27008 -24434 40420 31834 -5009 -43719 -7230 22078 58895
22297E8895j3237k5446K9956m4627k6959K3212q48M396J7710m2093l9150J5321
$$ 58895 45658 20212 50168 5541 -21418 1794 946 5342 23052 -19041 -58191 -42870
22285d2870l680K4j07K9883J8942K7722j9825l8609k6283K882K931R406M7907
$$ -42870 -46550 -46526 -46633 -16750 2192 29914 10089 -28520 -54803 -51921 -48990 -39584 8323
22272H323O5658j9005j8502j1301L7848K8353l5343k5446K8431L5203R515j03995
$$ 8323 73981 54976 36474 25173 63021 91374 56031 30585 59016 94219 103734 -261
22260b61Q235N1545j9144q423j0480K6975M2415k0205k2226K8373l739j32193
$$ -261 7974 59519 40375 31952 21472 48447 90862 70657 48431 76804 73065 -59128
22248e9128j6436L9725M4242L2231k9546k9446l4769k9999O1728O9738M4902q2994
$$ -59128 -75564 -35839 8403 40634 11088 -18358 -53127 -83126 -21398 48340 93242 10248
22236A0248n0043M2517M9038j0381p2641m6582M7228N9297O0229M4166l3191j5433
$$ 10248 -39795 2722 51760 41379 -31262 -77844 -30616 28681 88910 133076 99885 84452
22224H4452n3901K6780o269J8414o0802k4970J3164j7045J8273L2809P716p8605
$$ 84452 30551 57331 51062 69476 8674 -16296 -3132 -20177 -1904 30905 38621 -39984
22212c9984n1402N979R4687M4836K2437p863k3672j3567k4504j0707k1734r703
$$ -39984 -91386 -85407 9280 54116 76553 68690 45018 31451 6947 -3760 -25494 -35197
22200c5197r296j1455O0484L6084n069j1408l3080m5317J534M1807o791j315K1318
$$ -35197 -44493 -55948 4536 40620 35551 24143 -8937 -54254 -52720 -10913 -17704 -19019 2299
22187B299j1727l7917k490N8186J3289J9610m7566R64K2474l8743o3051M6076
$$ 2299 -9428 -47345 -49835 8351 21640 41250 -6316 -5352 17122 -21621 -84672 -38596
22175c8596N9650j6954O924l6459n9345l117m513o5521P9459P2442n810K8955
$$ -38596 21054 4100 11024 -25435 -84780 -87897 -92410 -157931 -78472 -6030 -11840 17115
22163A7115J06848l1994l9458n1881m6582k8543M7677N5819K5764n4185m8144
$$ 17115 123963 91969 52511 630 -45952 -74495 -26818 29001 54765 580 -47564
22152d7564J8822l96N94L7353N7825l8908K3977n170k2090o498k1484N4093L5626
$$ -47564 -28742 -29138 -28544 8809 66634 27726 51703 46533 24443 17945 -3539 50554 86180
22139H6180l0580j1999K4676j9955J1023K994l003m7604o9020K6548L960K155
$$ 86180 55600 43601 68277 48322 59345 62339 59336 11732 -57288 -30740 -26780 -24625
22127b4625K8379o0101J8754K9054j10K048k3819J9393P07n1395j5492K6120L1461
$$ -24625 3754 -56347 -37593 -8539 -8649 -6601 -30420 -11027 -10320 -61715 -77207 -51087 -19626
22114a9626K5040l613k7076j0596n3903K1789k0870p3427l58M8862O6017N8581
$$ -19626 5414 1801 -25275 -35871 -89774 -67985 -88855 -162282 -162640 -113778 -47761 10820
22102A0820j0172M5991K2596j9741J9304n7175Q372k766J9195L8973k9311m2768
$$ 10820 648 46639 69235 49494 68798 11623 19995 17229 36424 75397 46086 3318
22090C318O5315j5392o7860O9012M1312o3924j2277M0343K4967o2853r6157j4329
$$ 3318 68633 53241 -14619 54393 95705 31781 19504 59847 84814 21961 -74196 -88525
22078h8525N8838j8780l2932M6542J4375P015O2233Q7635m5443m3622j6037P818
$$ -88525 -29687 -48467 -81399 -34857 -20482 -13467 48766 136401 90958 47336 31299 39117
22066C9117N6159Q166k8392q121k2688n0429K1742R7085J3205m0276k1576k4284
$$ 39117 95276 103442 75050 66929 44241 -6188 15554 112639 125844 85568 63992 39708
22054C9708K4482k4581j01622K2559M9587o221r0048P520N7518K7383j2456M1936
$$ 39708 64190 39609 -62013 -39454 10133 3912 -86136 -78616 -21098 6285 -6171 35765
22042C5765m4782J7880J5166k7074j9389L0145k4932K0593L9422k0830l276L6745
$$ 35765 -9017 8863 24029 -3045 -22434 7711 -17221 3372 42794 21964 18688 55433
22030E5433M3532N6714k6181k3521J7157m7103p1091M0187L5597J2680m9953l5126
$$ 55433 98965 155679 129498 105977 123134 76031 4940 45127 80724 93404 43451 8325
22018H325k064R156l6958o6568m2939L8778L1797K2872m1414k4768k7381N0462
$$ 8325 6261 15417 -21541 -88109 -131048 -92270 -60473 -37601 -79015 -103783 -131164 -80702
22006h0702M5313p7515K4522Q4055L2513K9212Q2359J3119r6974r4538l7764L6067
$$ -80702 -35389 -112904 -88382 -4327 28186 57398 139757 152876 55902 -38636 -76400 -40333
21994d0333N8661L3279q740p6128l1359n7899K3239P5422P1492L6897j4844L356
$$ -40333 18328 51607 42867 -33261 -64620 -122519 -99280 -23858 47634 84531 69687 73043
21982G3043N5510K295o8965k7814j1396J1110k0082k5941j9324L5622o898P573
$$ 73043 128553 130848 61883 34069 22673 33783 13701 -12240 -31564 4058 -2840 4733
21970D733J5263n032L83l6304L692O4367j271Q874k8485l3842j8961l3566o1356
$$ 4733 19996 14964 15347 -20957 -17265 47102 45831 54705 26220 -7622 -26583 -60149 -121505
21957a21505J2011N7309J1179K7120k3957r339r95J3555l5749j07976K208p115
$$ -121505 -109494 -52185 -41006 -13886 -37843 -47182 -48177 -34622 -70371 -178347 -176139 -183254
21945a83254O2782N1231j1708O5023O2451q36M1612R455N7550j6542n6833p0851
$$ -183254 -120472 -69241 -80949 -15926 46525 45689 87301 96756 154306 137764 80931 10080
21933A0080k8704n5410J9627K7985J2674O3096m2595K6252M5181L5943j3032p8705
$$ 10080 -18624 -74034 -54407 -26422 -13748 49348 6753 33005 78186 114129 101097 22392
21921B2392m9789M369K0521k031J8552o017r8904k0916O9639P2577k8583o4912
$$ 22392 -27397 -23028 -2507 -4538 14014 7997 -90907 -111823 -42184 30393 1810 -63102
21909f3102q638K9340Q2441O4105J136l1956n2380l7909J0162k939K2576J3881
$$ -63102 -71740 -42400 40041 104146 105282 73326 20946 -16963 -6801 -9740 12836 26717
21897B6717M5064l6310q4757K7114K4572O2833j73p006L3692l433q6081J3358
$$ 26717 71781 35471 -49286 -22172 2400 65233 65060 58054 91746 88313 2232 15590
21885A5590N4751l6477l8064J701r441K3876O071k006k259K1233o3498j9250M4007
$$ 15590 70341 33864 -4200 -2499 -11940 11936 18007 16001 13742 34975 -28523 -47773 -3766
21872c766Q8950Q869k6457l7637m8123L6120O1409R254r3710n8299J1095J03224
$$ -3766 85184 94053 67596 29959 -18164 17956 79365 88619 -5091 -63390 -52295 50929
21860E0929M8646K177l9353n6480O138n4582K7913L0093r291l4928L5442O21j9362
$$ 50929 99575 101752 62399 5919 12057 -42525 -14612 15481 6190 -28738 6704 7325 -12037
21847a2037L4554O474l5978q9579Q628R6418L3325J0996j9674m3440n2254j8061
$$ -12037 22517 28991 -6987 -96566 -87938 8480 41805 52801 33127 -10313 -62567 -80628
21835h0628P947J2437P8162J6472L772j2206P241j9874k1610L9365P5613Q166
$$ -80628 -72681 -60244 17918 34390 38162 25956 33197 13323 -8287 31078 106691 114857
21823A14857n0597J3021K1173R273R648n0191m7069K3182l8912q1895O0618Q1464
$$ 114857 64260 77281 98454 107727 117375 67184 20115 43297 4385 -77510 -16892 64572
21811F4572k059K1425M256q1903m9659O7034q445k6704k3569K7987j1685m7192
$$ 64572 62513 83938 88194 6291 -43368 23666 15221 -11483 -35052 -7065 -18750 -65942
21799f5942M5609J00604l6588r0929o28O6367O1205l3352n2255L222j3065J1732
$$ -65942 -20333 80271 43683 -47246 -47874 18493 79698 46346 -5909 -2687 -15752 -4020
21787d020o0405K0832K8281L5421q465m2147J0422L3530L5428j1294j15J6401
$$ -4020 -64425 -43593 -15312 20109 11644 -30503 -20081 13449 48877 37583 37468 53869
21775E3869K5865m3327l566L7977M8395l7538K2270l8125O700j0642j9598J2702
$$ 53869 79734 36407 32841 70818 119213 81675 103945 65820 72520 61878 42280 54982
21763E4982M9361J8645J6471O826j0613p7038j1471J05237L0158m9838l6585J291
$$ 54982 104343 122988 139459 146285 135672 58634 47163 152400 182558 132720 96135 97426
21751I7426L6107q101J7549k5962m660j6043m8366O73J0179N3194P6288M1841
$$ 97426 133533 125432 142981 117019 112359 96316 47950 48623 58802 111996 188284 230125
21739B30125m7782k7784M6925n0581p3314K7719p236k2135l3792K7243J9211Q6803
$$ 230125 182343 154559 201484 150903 77589 105308 98072 75937 42145 69388 88599 175402
21727A75402L759l5240j0628o9430n2257N5110N714J2295L436l6729j883l1824
$$ 175402 179161 143921 133293 63863 11606 66716 72430 84725 88161 51432 49549 17725
21715A7725N8663M9274k8537l9045k6310j0669k0496k3940K2664N4454J9849j1858
$$ 17725 76388 125662 97125 58080 31770 21101 605 -23335 -671 53783 73632 61774
21703F1774n0635P366r243M4819m8728k5517O8651N9588L6370j4730K4996m8676
$$ 61774 11139 18505 9262 54081 5353 -20164 48487 108075 144445 129715 154711 106035
21691A06035q1052K0906K4533K3488L0187l7297k5960n212J08508L1364j16583
$$ 106035 24983 45889 70422 93910 124097 86800 60840 55628 164136 195500 78917
21680G8917k3414q073J014M7999J8818r7577n5155J237o2601J4129j6104J4406
$$ 78917 55503 47430 48444 96443 115261 17684 -37471 -36234 -98835 -84706 -100810 -86404
21668h6404J05084k0452k6980L6168K796l9763L8650M2974L9545j9385l1166P358
$$ -86404 18680 -1772 -28752 7416 10212 -29551 9099 52073 91618 72233 41067 48425
21656D8425o33r737O7944O9751q3600n3558P5578j2589p665L1803M2822J2353
$$ 48425 47792 38055 105999 175750 92150 38592 114170 101581 93916 125719 168541 180894
21644A80894l5881l7758P64J0833k6775r900J6232K7598R65l042q615l8296r086
$$ 180894 145013 107255 108019 118852 92077 82177 98409 126007 126972 123930 115315 77019 67933
21631F7933k5840n8531J1690J03899J4685L5944Q738k5203l6266K9193m3150r65
$$ 67933 42093 -16438 -4748 99151 113836 149780 158518 133315 97049 126242 83092 82127
21619H2127R3576J0855J1927o7084l9209k474N3482l715L680l7668n3279O0263
$$ 82127 175703 186558 198485 131401 92192 89718 143200 139485 143165 105497 52218 112481
21607A12481M8272Q916j6723l5284r781K740n4858r127K0666K5646N4600L2904
$$ 112481 160753 169669 152946 117662 107881 110621 55763 46636 67302 92948 147548 180452
21595A80452j04769j9723K5686k5526l6517L7661N1404K9648m8698j4083m578
$$ 180452 75683 55960 81646 56120 19603 57264 108668 138316 89618 75535 70957
21584G0957L6020M493j6420N076L5117n0013J3805J0880L2279k1569m4991k0206
$$ 70957 106977 111470 95050 100126 135243 85230 99035 109915 142194 120625 75634 55428
21572E5428p756o2178K3002J4750p328j5702j3743O775N3265Q4069Q4755K4884
$$ 55428 47672 -14506 8496 23246 15918 216 -13527 -6752 46513 130582 215337 240221
21560B40221o6316j7019k5080k3771M0823k3538l2839k4690k0063N9657M6687
$$ 240221 173905 156886 131806 108035 148858 125320 92481 67791 47728 107385 154072
21549A54072J335K7334J7514k8378n3228N702N8044J379l4807M9018K2985k9077
$$ 154072 155407 182741 200255 171877 118649 124351 182395 183774 148967 197985 220970 191893
21537A91893L850K4388O001k3114J287P66m6404m1837p461P9253N1036m6657m8552
$$ 191893 195743 220131 226132 203018 204305 205071 158667 116830 109369 188622 239658 193001 144449
21524A44449p2021N8540k5748l0755l6202N1796O3110N7162J6576k1321k9579
$$ 144449 72428 130968 105220 74465 38263 90059 153169 210331 226907 205586 176007
21513A76007L5774O4732k830j5822n0391J1894l64N2802K510n1439K4841j045
$$ 176007 211781 276513 273683 257861 207470 219364 219000 271802 274312 222873 247714 246669
21501B46669o9462L7582L9198p95m0357m4898r7207K0105O574p015K8594O7446
$$ 246669 177207 214789 253987 253192 212835 167937 70730 90835 97409 90394 118988 186434
21489A86434N0093j4718o7839L1168n022p231j8578n3766j5115L1589P5478L4080
$$ 186434 236527 221809 153970 185138 180116 172885 154307 100541 85426 117015 192493 226573
21477B26573M125j9685L5453l4278k9538L9335J8882m4698L4816L9503p1750p7828
$$ 226573 230698 211013 246466 212188 182650 221985 240867 196169 230985 270488 198738 120910
21465A20910N7826N5324k7423O030J13244o108p108m8807n5201l3380k054R5868
$$ 120910 178736 234060 206637 212667 325911 319803 312695 263888 208687 175307 173253 269121
21453B69121M1514R371m1711K8246j08513R865Q0915m9204p3400M6264N7392n3004
$$ 269121 310635 320006 278295 306541 198028 207893 288808 239604 166204 212468 269860 216856
21441B16856l9387L699L7141L9782K549n1129l8734O8077O1956O794m2842q9773
$$ 216856 177469 181168 218309 258091 260640 209511 170777 238854 300810 307604 264762 174989
21429A74989L0591J01151L3957J3290r851q4370o5573Q2094l7343n4090L2634
$$ 174989 205580 306731 340688 353978 344127 259757 194184 276278 238935 184845 217479
21418B17479J6679K3498J1581l2260J5778J1324o4621K9770k4345l9391M7822
$$ 217479 234158 257656 269237 236977 252755 264079 199458 229228 204883 165492 213314
21407B13314k691K5464R3529J2518r307J5649l2622K758L4878K5202o6767O704
$$ 213314 210623 236087 329616 342134 332827 348476 315854 318612 353490 378692 311925 318629
21395C18629K1182K1123K7481K9301J32935J02051o072o2313K3502J7328l8291
$$ 318629 339811 360934 388415 417716 550651 652702 646630 584317 607819 625147 586856
21384E86856J2094J8855R0337K5324J624K5089N506Q1441L2883l7613o522o3023
$$ 586856 598950 617805 708142 733466 735090 760179 765685 847126 880009 842396 835874 772851
21372G72851m7009m2127l1544k6812j9232K1260m7172l1896q42l6544k3947q403
$$ 772851 725842 683715 652171 625359 606127 627387 580215 548319 547477 510933 486986 478583
21360D78583m4916m844m4163n5705p9183K7719O2353j2469j9605n624j8023k4209
$$ 478583 433667 428823 384660 328955 249772 277491 339844 327375 307770 302146 284123 259914
21348B59914n2128J6483O6307P3453j3451k677l6185k524j5031j9594L4112n9451
$$ 259914 207786 224269 290576 364029 350578 347901 311716 309192 294161 274567 308679 249228
21336B49228n1892L6581J02948K6269l1560n1533k8324J0723J0784K7609M9723
$$ 249228 197336 233917 336865 363134 331574 280041 251717 262440 273224 300833 350556
21325C50556M2157J8234j2809k8982O0062m3923l8692L3874M4626p180q0646k3480
$$ 350556 392713 410947 398138 369156 429218 385295 346603 380477 425103 417923 337277 313797
21313C13797R8239P9217m1494m5575j9169j5486j5634K2351L5728m4117j2519
$$ 313797 412036 491253 449759 404184 385015 369529 353895 376246 411974 367857 355338
21302C55338n3657j8220J15801l259K5429l534j00209j2376R4540l1307K1448
$$ 355338 301681 283461 399262 396003 421432 417898 317689 305313 399853 368546 389994
21291C89994M5197K8101L8998J1329M134n910m9303q5468K1509Q6033L9461L1529
$$ 389994 435191 463292 502290 513619 517753 511843 462540 377072 398581 484614 524075 555604
21279E55604k8313q838K7197q156j833m4936n5628n2072k2918l8014Q258k5463
$$ 555604 527291 518453 545650 537494 535661 490725 435097 383025 360107 322093 330351 304888
21267C04888j1773k321L590r164L0032j0373p3167K8982L9116P8880K2320n1401
$$ 304888 293115 290794 294384 285220 315252 304879 231712 260694 299810 378690 401010 349609
21255C49609l4756p7759l8662O0778J3702M5283N9995O201j03237k4922K5594
$$ 349609 314853 237094 198432 259210 272912 318195 378190 384391 281154 256232 281826
21244B81826n105k8414O0518O3734n7602M9564K6307k7698L838J4014k8452J6260
$$ 281826 276721 248307 308825 372559 314957 364521 390828 363130 366968 380982 352530 368790
21232C68790M8855m0179j09193k8609l7853m513M8083j786l110N001K9429R4209
$$ 368790 417645 377466 268273 239664 201811 197298 245381 243595 240485 245486 274915 369124
21220C69124m1346l2889j4819P97o0133R570P0224n642J8242P9829O511k9753
$$ 369124 327778 294889 280070 280867 220734 230304 300528 294886 313128 392957 399468 369715
21208C69715n3376l81n124l0889Q527k2298l2471M2831L9213n5205p5212p6339
$$ 369715 316339 315958 310834 279945 288472 266174 233703 276534 315747 260542 185330 108991
21196A08991L4370N4190J7625j3904K1861J4246K2197j8449k8293O6234J6570
$$ 108991 143361 197551 215176 201272 223133 237379 259576 241127 212834 279068 295638
21185B95638o536p7770p7601N3731j4394N139j6096o3465O5242Q3770J3621k9805
$$ 295638 289102 211332 133731 187462 173068 178207 162111 98646 163888 247658 261279 231474
21173B31474J9089P85R829m039n355n6951J9683J0823p0013j9079M7956k178J4697
$$ 231474 250563 251348 261177 257138 251783 194832 214515 225338 155325 136246 184202 182024 196721
21160A96721O9344o2314l8596r560q715m2097m0811M0618M6582j9182L6541j2407
$$ 196721 266065 203751 165155 155595 146880 104783 63972 104590 151172 131990 168531 156124
21148A56124k7308p1561n7673K8967L1570M9811N5029L1151n5675p8596K4328
$$ 156124 128816 57255 -418 28549 60119 109930 164959 196110 140435 61839 86167
21137H6167K5943K4919j0866R48K72M3755n846n2214L1493K3670q928O9127n8627
$$ 86167 112110 137029 126163 127111 127383 171138 165292 113078 144571 168241 159313 228440 169813
21124A69813m6296l4077n7210K7035Q5431M1394j9663m1795K5630K580l9254l0282
$$ 169813 123517 89440 32230 59265 144696 186090 166427 124632 150262 152842 113588 83306
21112H3306q1248k8256N0296N4200l1052m7019L8612P6217M1906L414j2273L2944
$$ 83306 2058 -26198 24098 78298 47246 227 38839 115056 156962 160376 148103 181047
21100A81047N211j7932k5794M4532M130k7491P5261q070m7180K180O6209k5086
$$ 181047 186258 168326 142532 187064 191194 163703 238964 230894 183714 185894 252103 227017
21088B27017m3770k2286o657k8059P5881L3447J4683o7378q4m7237Q085l161N0336
$$ 227017 183247 160961 154304 126245 202126 235573 250256 182878 182794 135557 143642 140481 190817
21075A90817j9089p6752k7919m6188k6455J9661O6305Q6387J3028q6015J0791
$$ 190817 171728 94976 67057 20869 -5586 14075 80380 166767 179795 93780 104571
21064A04571K6136k4382L6096k9758O0263r68m5761m2460K5386J882O135L7388
$$ 104571 130707 106325 142421 112663 172926 171958 126197 83737 109123 111005 117140 154528
21052A54528M5228L9486l2420j13917o605l4460j7879J015K0399M433j5424l071
$$ 154528 199756 239242 206822 92905 86300 51840 33961 34976 55375 59808 44384 41313
21040D1313J4453K4859J0248k4374J7147K7304J627N2973l9634j3003N6J0620
$$ 41313 55766 80625 90873 66499 83646 110950 112577 165550 125916 112913 112969 123589
21028A23589k4575k1131k4336q6726l8869P4907K0401L3777k7581m3051R27J15020
$$ 123589 99014 77883 53547 -33179 -72048 2859 23260 57037 29456 -13595 -12668 102352
21016A02352M0638m6734l7092J9848O4215k2026n8950K5136q010J7937Ml4076
$$ 102352 142990 96256 59164 79012 143227 121201 62251 87387 79377 97314 97318 63242
21004F3242l3311p231l0678l6449j4879J8145J29787O63R761M4499k9423n9151
$$ 63242 29931 22700 -7978 -44427 -59306 -41161 88626 89289 99050 143549 114126 54975
20992E4975q033M2760j0806K7729k0522j7576J6573L1244M4541J17911M4061o2259
$$ 54975 46942 89702 78896 106625 86103 68527 85100 116344 160885 278796 322857 260598
20980B60598r7739l4345K2015O2006L2854l3167q7402m864L1373K9973p993P7532
$$ 260598 162859 128514 150529 212535 245389 212222 124820 119956 151329 181302 173309 250841
20968B50841K8933Q44P829L4014M8439k408q8988o6086J0487Q087N6123l1101
$$ 250841 279774 280618 288447 322461 370900 368492 279504 213418 223905 231992 288115 257014
20956B57014n2788p7103r5781J8664K0404O9605R7624k6455p4540o3575k5393
$$ 257014 204226 127123 31342 50006 70410 140015 237639 211184 136644 73069 47676
20945D7676l475k4885k1523k6276l7694L0868O0315L2727J2959L9437O50m8077
$$ 47676 44201 19316 -2207 -28483 -66177 -35309 25006 57733 70692 110129 110779 62702
20933F2702n7553K0267n4476l7092P0025O4168L5181P6738r3229p5745L971L1478
$$ 62702 5149 25416 -29060 -66152 3873 68041 103222 179960 86731 10986 14957 46435
20921D6435L9028q321k1307J0883n590P690L4882O1403R763j3946o2709j6630
$$ 46435 85463 77142 55835 66718 61128 68818 103700 165103 174866 160920 98211 81581
20909H1581l7890j9533N2378q37p522r5464j8230M7429L9002O2606p3210j4434
$$ 81581 43691 24158 76536 75699 68177 -27287 -45517 1912 40914 103520 30310 15876
20897A5876o2133L1618Q692O9770O9896j3177m2788j6066q79L7429K8912J6092
$$ 15876 -46257 -14639 -5947 63823 133719 120542 77754 61688 60809 98238 127150 143242
20885A43242m0783P786j5196K7571r412N438k3523k093O093k0633j0126j8926
$$ 143242 102459 110245 95049 122620 113208 118646 95123 93030 99123 78490 68364 49438
20873D9438m940m7254q59N5136k7061M4866m3504J5615l3083r8682M602N9825
$$ 49438 44498 -2756 -3615 51521 24460 69326 25822 41437 8354 -90328 -85726 -25901
20861b5901J1072K0290k700P5597K7431k1620L1846l7773k7670j9175N2538J8459
$$ -25901 -14829 5461 2761 78358 105789 84169 116015 78242 50572 31397 83935 102394
20849A02394k052m1659m4242N6077O9523o1059m0302k7545j6801M4802K1506k0997
$$ 102394 100342 58683 14441 70518 140041 78982 38680 11135 -5666 39136 60642 39645
20837C9645l6694M937j3199O742J9107k8531l0882N5429M0673P0535k1551R036
$$ 39645 2951 7888 -5311 1431 20538 -7993 -38875 16554 57227 127762 106211 115247
20825A15247k3291k5579q237O970O3380J6125p7520r5144J6492L0714K4621k2800
$$ 115247 91956 66377 58140 65110 128490 144615 67095 -28049 -11557 19157 43778 20978
20813B0978j4742j9243j2765m8867L7008P0668L7532k5689m4055n6558j21773
$$ 20978 6236 -13007 -25772 -74639 -37631 33037 70569 44880 825 -55733 -177506
20802a77506M1580J13326P446J02238K9087k2069o8286q5274R786K1567O5989
$$ -177506 -135926 -22600 -15154 87084 116171 94102 25816 -59458 -49672 -28105 37884
20791C7884N5040N7132L0243m3617l2502r0914n5100j8476L2788k7496R246N351
$$ 37884 92924 150056 180299 136682 104180 13266 -41834 -60310 -27522 -55018 -45772 -40421
20779d0421l7175n1660M935J2728K9811K8823l758J0526J9775k352l794j375N1286
$$ -40421 -77596 -129256 -124321 -111593 -81782 -52959 -56717 -46191 -26416 -28768 -32562 -33937 17349
20766A7349K3555r2947r532N6584j2526m2639J3784J7335j4620J7220L7513K6865
$$ 17349 40904 -52043 -61575 -4991 -17517 -60156 -46372 -29037 -43657 -26437 11076 37941
20754C7941O930k0645O839J4785K0504J7598j7723n3111j4380j0192O3505p650
$$ 37941 44871 24226 31065 45850 66354 83952 66229 13118 -1262 -11454 52051 44401
20742D4401J9832N601p6380l2779L4828K7159L2323m3555J8879J0817m131k3712
$$ 44401 64233 69834 -6546 -39325 -4497 22662 54985 11430 30309 41126 36995 13283
20730A3283j2754n4478k4884j1711K2797Q877M363j5704j655N3590K8752j8072
$$ 13283 529 -53949 -78833 -90544 -67747 -58870 -54507 -70211 -71866 -18276 10476 -7596
20718g596R302M269J5400L3597L758m4972o7048M3244J254Q255M9288r028l0408
$$ -7596 1706 5975 21375 54972 58730 13758 -53290 -10046 -8792 -537 48751 39723 9315
20705I315j1958o080k6846K2184j6784k2953l1911o297O928P2118N8185m4523
$$ 9315 -2643 -8723 -35569 -13385 -30169 -53122 -85033 -91330 -84402 -12284 45901 1378
20693A378J0933N2006J5659o1418l9329K6121q691l2961j08427K5922N0973M7233
$$ 1378 12311 64317 79976 18558 -20771 5350 -3341 -36302 -144729 -118807 -67834 -20601
20681b0601Q204l5397N4722M229P255r001m655J5975Q050l5610r5878K6580M8494
$$ -20601 -12397 -47794 6928 11157 18412 9411 4756 20731 28781 -6829 -102707 -76127 -27633
20668b7633O3616M0239l450k8650j830N0439K4709m8996n2414j0728O709n9171
$$ -27633 35983 76222 72772 44122 42292 92731 117440 68444 16030 5302 12011 -47160
20656d7160o9167J540R0162J266n743O7787J0363j2256L401K9463q5834n5441
$$ -47160 -116327 -114787 -24625 -23359 -29102 38685 49048 36792 40193 69656 -16178 -71619
20644g1619P453M9355K8607O6057K4726L2363m1450m4210n2201m7998n2988j8389
$$ -71619 -64166 -14811 13796 79853 104579 136942 95492 51282 -919 -48917 -101905 -120294
20632a20294Q0527O7843L5505N046l8393r6363m0018N9611O3455L485o196j3617
$$ -120294 -39767 28076 63581 68627 30234 -66129 -106147 -46536 16919 20404 14208 591
20620E91k6388l6596j3767J5130R9544n504j8294o381n8146o634N1795j7976j04346
$$ 591 -25797 -62393 -76160 -61030 38514 33010 14716 8335 -49811 -56445 -4650 -22626 -126972
20607a26972k3863L5460N1446N0502l2450k7101Q512O4918m650k4246p499J3013
$$ -126972 -150835 -115375 -63929 -13427 -45877 -72978 -64466 452 -4198 -28444 -35943 -22930
20595b2930n2870j8425m28M2232J8878m83p6364j5773L0586P4640Q1286L056J3950
$$ -22930 -75800 -94225 -94653 -52421 -33543 -34026 -110390 -126163 -95577 -20937 60349 63405 77355
20582G7355n8910K26K3223l8271m5852l3620j7438K5506N6509L5677k0189N7854
$$ 77355 18445 18671 41894 3623 -42229 -75849 -93287 -67781 -11272 24405 4216 62070
20570F2070n033l4218j0377n3798o364J6562l4292K6755P6967q871n3722N0264
$$ 62070 57037 22819 12442 -41356 -47720 -31158 -65450 -38695 38272 29401 -24321 25943
20558B5943J468k2258n547J4210J3052l4679j1444N837n6164N7006P3197N5314
$$ 25943 27411 5153 -394 13816 26868 -7811 -19255 -13418 -69582 -12576 60621 115935
20546A15935j481J2914O566L4121j16411r9326J0596R644o9207k9414k102O652
$$ 115935 114454 127368 133934 168055 51644 -47682 -37086 -27442 -96649 -126063 -128165 -121513
20534a21513J2585J1395N8411m1654j1655O3354P672J6939l3146R111J7186m8561
$$ -121513 -108928 -97533 -39122 -80776 -92431 -29077 -21405 -4466 -37612 -28501 -11315 -59876
20522e9876k4618n6909L2046M6113L3039M2231n6457l844L3060k9563Q895o2513
$$ -59876 -84494 -141403 -109357 -63244 -30205 12026 -44431 -48275 -15215 -44778 -35883 -98396
20510i8396k3468k9156m594N5125N7281J2192k4581p741p445L7050O6319K885
$$ -98396 -121864 -151020 -155614 -100489 -43208 -31016 -55597 -63338 -70783 -33733 32586 35471
20498C5471L1630l4384m7845l3224l648K8180M3163J8356M970l442N3751N727
$$ 35471 67101 32717 -15128 -48352 -52000 -23820 19343 37699 42669 39227 92978 98705
20486I8705k5093j89n4897q4922K1939K925N899K2137P3673K1913J3502q8524
$$ 98705 73612 73423 18526 -66396 -44457 -41532 -35633 -13496 60177 82090 95592 7068
20474G068n0848l1760O88k2280k121K0090M1737P1277N1561m132k2183l3954M9758
$$ 7068 -43780 -75540 -74852 -97132 -99253 -79163 -37426 33851 85412 81280 59097 25143 74901
20461G4901k301k8575j1716j1293P013k9347K3423N120k4530j4977Q137k9459
$$ 74901 72600 44025 32309 21016 28029 -1318 22105 27225 2695 -12282 -4145 -33604
20449c3604N43k6708p6478O2332R9027N1315l5912k3770N296N4582j705j6797
$$ -33604 -33061 -59769 -136247 -73915 25112 76427 40515 16745 22041 76623 74918 58121
20437E8121o0256R145J7170J6802p060L128O572j0498l8045n9271K8960N7394
$$ 58121 -2135 7010 24180 40982 33922 37050 43622 33124 -4921 -64192 -35232 22162
20425B2162q4276l3710J5860N2661K9573l409j3986M6090Q9765j6702j07641L2368
$$ 22162 -62114 -95824 -79964 -27303 2270 -1139 -15125 30965 120730 104028 -3613 28755
20413B8755L3477J7711m2850J1975Q524J7199N4409j3963O4736L2814L4449J08560
$$ 28755 62232 79943 37093 49068 57592 74791 129200 115237 179973 212787 247236 355796
20401C55796L3623m9599j16962n6103R734L7673j2422K2926K3676k7132k1900
$$ 355796 389419 339820 222858 166755 176489 214162 201740 224666 248342 221210 199310
20390A99310j4692m7645l8526l6069q8979n2628R009O2373k984O880q529L584
$$ 199310 184618 136973 98447 62378 -26601 -79229 -70220 -7847 -10831 -3951 -12480 -8896
20378h896N3284L3952J4066m2956j21429q9652Q907L0749M6580J3617M9243j1696
$$ -8896 44388 78340 92406 49450 -71979 -161631 -152724 -121975 -75395 -61778 -12535 -24231
20366b4231M198j2449o8341q388K8282L8991q004M4601L9605J4200l9661m3864
$$ -24231 -20033 -32482 -100823 -109211 -80929 -41938 -49942 -5341 34264 48464 8803 -35061
20354c5061K8306O62R280J4901k9371k0163k7541O106Q4083k1057l5171K2349
$$ -35061 -6755 -6093 3187 18088 -11283 -31446 -58987 -52881 31202 10145 -25026 -2677
20342b677O0377l4284m5411j0306k4036L2547M4832j6901N6185L3526n0371q2210
$$ -2677 57700 23416 -21995 -32301 -56337 -23790 21042 4141 60326 93852 43481 -38729
20330c8729j06073K4405M7177N5789l427p1888o541K4002j9277K084J6612M8421
$$ -38729 -144802 -120397 -73220 -17431 -20858 -92746 -99287 -75285 -94562 -92478 -75866 -27445
20318b7445P3390o1092j208M9324O920n3425j2201J9926J8311P0192L8014j13676
$$ -27445 45945 -15147 -16355 32969 39889 -13536 -25737 -5811 12500 82692 120706 7030
20306G030n1646K3675K8278J4904L2434q7991l6185R069k84N704j3808j6097J6202
$$ 7030 -44616 -20941 7337 22241 54675 -33316 -69501 -60432 -60716 -55012 -68820 -84917 -68715
20293f8715r550l055N3102q0016n2880P6854M7814M159m450l6675N4206Q9025
$$ -68715 -78265 -81320 -28218 -108234 -161114 -84260 -36446 -32287 -36737 -73412 -19206 69819
20281F9819l9348r3679n2465L0816K7508J2318L7088k0339k6106L7531J0574j5514
$$ 69819 30471 -63208 -115673 -84857 -57349 -45031 -7943 -28282 -54388 -16857 -6283 -21797
20269b1797N7643O5354k7007m2361M524R347O623m2282K0962J8987m4938K4532
$$ -21797 35846 101200 74193 31832 36356 45703 52326 10044 31006 49993 5055 29587
20257B9587k6579k7028j929K3202J6696k7484j1976m0808J0003m532L3663N7533
$$ 29587 3008 -24020 -25949 -2747 13949 -13535 -25511 -66319 -56316 -60848 -27185 30348
20245C0348j1499J5886m9900K9818L3765J1284J2717K6862p573j6910k0334o046
$$ 30348 18849 34735 -15165 14653 48418 59702 72419 99281 91708 74798 54464 48418
20233D8418m0552o4346o6274M8480O2389M8252O1866J498q7580n4372N5224o718
$$ 48418 7866 -56480 -122754 -74274 -11885 36367 98233 99731 12151 -42221 13003 6285
20221F285p425j6349K9016J4675J9272J063L8370J8753l9422r8922o4613m282
$$ 6285 -1140 -17489 11527 26202 45474 46537 84907 103660 64238 -34684 -99297 -103579
20209a03579m505P2161J7744o581j841j8548O4828K8788j3864m5213L1183J0057
$$ -103579 -108084 -35923 -18179 -24760 -26601 -45149 19679 48467 34603 -10610 20573 30630
20197C0630l3925M5707M6674l3900p7547M989j4096p992m6400j6644m809m4375
$$ 30630 -3295 42412 89086 55186 -22361 -17372 -31468 -39460 -85860 -102504 -107313 -151688
20185a51688J7840K5637K4083n6833j63K554L7651K8579M4193R345O7770r130
$$ -151688 -133848 -108211 -84128 -140961 -141124 -138570 -100919 -72340 -28147 -18802 48968 39838
20173C9838l8107K1940j19637o7820Q6097k1158n364M8578M8920P734k1459K3869
$$ 39838 1731 23671 -95966 -163786 -77689 -98847 -104211 -55633 -6713 1021 -20438 3431
20161C431l2050J7768j8806m8051M6036M4974j7644M0627m9704M625O9890N3337
$$ 3431 -28619 -10851 -29657 -77708 -31672 13302 -4342 36285 -13419 -8794 61096 114433
20149A14433J5897o8151q0499L1235l3741j9125L3242l656k1820Q546P7993j8381
$$ 114433 130330 62179 -18320 12915 -20826 -39951 -6709 -10365 -32185 -23639 54354 35973
20137C5973m118K9773J1134k3035m8790j757j4745m3740N0375O1311k1769K9633
$$ 35973 31855 61628 72762 49727 937 -820 -15565 -59305 -8930 52381 30612 60245
20125F0245J11022L6599m3560j1090n678k3852J6052l3650N0966R3272L4570m3562
$$ 60245 171267 207866 164306 153216 147538 123686 139738 106088 157054 250326 284896 241334
20113B41334l6188M1651J0684J6341K6991n97n0172p0786J2661L251q3658K0055
$$ 241334 205146 246797 257481 273822 300813 300216 250044 179258 191919 195170 111512 131567
20101A31567K481k0783L0106L4469n2826n4117n4779j8487L4699K7108O946m789
$$ 131567 134048 113265 143371 177840 125014 70897 16118 -2369 32330 59438 66384 61595
20089F1595n0240m6009p6278J8308O8715K0207K4140J1304M541n2480N146j00
$$ 61595 11355 -34654 -110932 -92624 -23909 -3702 20438 31742 36283 -16197 -11051 -11151
20077a1151l9656M6968L505J7663J6068R0384K3185o6453n8387o530M4195m5455
$$ -11151 -50807 -3839 -334 17329 33397 123781 146966 80513 22126 15596 59791 14336
20065A4336m0036M3159J4524k6111R205N693j3892K4j0138k1535l3035N5565N0584
$$ 14336 -25700 17459 31983 5872 15077 20770 6878 6902 -3236 -24771 -57806 -2241 48343
20052D8343L3108K0437k4680j0636J6872J9403J4441L0750j3673J1354l2486q7320
$$ 48343 81451 101888 77208 66572 83444 102847 117288 148038 134365 145719 113233 25913
20040B5913n1318j21374p850N3951R1945P9555m8216O255M6771Q7443j0122K5123
$$ 25913 -25405 -146779 -154629 -100678 -8733 70822 22606 28861 75632 163075 152953 178076
20028A78076n9987o5030N749K7491n3119l8490j359O1635L6472N8121J5512N8994
$$ 178076 118089 53059 58808 86299 33180 -5310 -6669 54966 91438 149559 165071 224065
20016B24065Q4301O349q4008j01641J9236M7309K2084N0377N9244Q4491K03325
$$ 224065 308366 314715 230707 129066 148302 195611 217695 268072 327316 411807 615132
20005F15132J50782K05467K06586J64006Q4405J0942o8443r7386J848Q1521J11301
$$ 615132 765914 971381 1177967 1341973 1426378 1437320 1368877 1271491 1273339 1354860 1466161
19994A466161L9377k1738j0514l7162j11559j16428k14217j64778j58456j29999
$$ 1466161 1505538 1483800 1473286 1436124 1324565 1208137 993920 829142 670686 540687
19984E40687j06474l8864m3167k5654m1556M946l3661L971j0745N931o2422J5710
$$ 540687 434213 395349 352182 326528 284972 289918 256257 260228 249483 255414 192992 208702
19972B08702k7888j3117M9678K7936j1025O39O303J9355m2837l7085k0114k8266
$$ 208702 180814 167697 217375 245311 234286 234925 241228 260583 217746 180661 160547 132281
19960A32281L531M961Q661L6045p097J3701Q763Q935m2614p1376o0177J6474O2054
$$ 132281 135812 140773 149434 185479 178382 192083 200846 209781 167167 95791 35614 52088 114142
19947A14142N8832j9634k9599J6541N6713N443o0420k1195J3991O4929j7136m803
$$ 114142 172974 153340 123741 140282 196995 202438 142018 120823 134814 199743 182607 177804
19935A77804J0381K4901J9612K4927J4904J9842M206L7064m502L1741K507k8219
$$ 177804 188185 213086 232698 257625 272529 292371 296577 333641 329139 360880 363387 335168
19923C35168Q27l1138q3367k7932J4408J5619m5883m5293L1907K7209k991N0903
$$ 335168 335995 304857 221490 193558 207966 223585 177702 132409 164316 191525 188534 239437
19911B39437J6682l4690m3091J2746K1774M9895j3954l5436l176n7303J7191K9299
$$ 239437 256119 221429 178338 191084 212858 262753 248799 213363 210187 152884 170075 199374
19899A99374K6049L2587j0317r3672p1860P3552O6655k9205k1988o811j1177o0943
$$ 199374 225423 258010 247693 154021 82161 155713 222368 193163 171175 164364 153187 92244
19887I2244p2769J0542P0149K4107j0298r284k096L4431l9799l4116l315Q498
$$ 92244 19475 30017 100166 124273 113975 104691 102595 137026 97227 63111 59796 68294
19875F8294m0481P59K1270M386j0118L539o1306k7898L8726o4594j8144Q4011
$$ 68294 27813 28572 49842 54228 44110 47649 -13657 -41555 -2829 -67423 -85567 -1556
19863a556N3827M5163J1409j126R0415J46430O0231K4509K0174N5249O798r499
$$ -1556 52271 97434 108843 107717 198132 344562 404793 429302 449476 504725 511523 502024
19851E02024o0381M1079K2093j267P6984N2550p9231n5515j2928n3166j03566
$$ 502024 441643 482722 504815 503548 580532 633082 553851 498336 485408 432242 328676
19840C28676m9546m9072m1475l7281m5870o855q612k6042p1061j9595O8557M6345
$$ 328676 279130 230058 188583 151302 105432 98577 89965 63923 -7138 -26733 41824 88169
19828H8169L3217J112M2073J6111r5709q5008K073J19657L1991M3174L4187L1065
$$ 88169 121386 122498 164571 180682 84973 -35 2038 121695 153686 196860 231047 262112
19816B62112O514M0481K099J2542n2183j4311P387L5732O1599l515j00922p6891
$$ 262112 268626 309107 311206 323748 271565 257254 264641 300373 361972 358457 257535 180644
19804A80644n8778J3954O0139L9781k5080l8496O809k5475k4804O4424l9123k5436
$$ 180644 121866 135820 195959 235740 210660 172164 178973 153498 128694 193118 153995 128559
19792A28559m636j2782J0564J2431P244n0125m6841N7446K2323n8373q368l2171
$$ 128559 123923 111141 121705 134136 141380 91255 44414 101860 124183 65810 57442 25271
19780B5271M6160P8897M573M3655l1850O870p6377k5387p7011j4638J0906k1682
$$ 25271 71431 150328 154901 198556 166706 173576 97199 71812 -5199 -19837 -8931 -30613
19768c0613J7443k773O1500j73j7980m349Q1154K7451l9705k1932j2552m7218
$$ -30613 -13170 -15943 45557 45384 27404 23055 104209 131660 91955 70023 57471 10253
19756A0253O7490R9754l410p10O4957P0657j4866O0086O585r6940P15N618j9413
$$ 10253 77743 177497 174087 173377 238334 308991 294125 354211 360796 263856 264571 270189 250776
19743B50776o5114r597Q43O0459J0157l9511l2461M6790J11994J7537j0288o87
$$ 250776 185662 176065 176908 237367 247524 208013 175552 222342 334336 351873 341585 340898
19731C40898k2491J0631o0982l3461m0753q4060k2170n103Q1508m161K4339M453
$$ 340898 318407 329038 268056 234595 193842 109782 87612 82509 164017 159856 184195 188648
19719A88648k4444j8989J259K2261J7461l5785M3520N1920K3975l9893m1276r1512
$$ 188648 164204 145215 146474 168735 186196 150411 193931 245851 269826 229933 188657 97145
19707I7145m5385Q5443N0017p0722n1959j4109L0531m7383N0641L5074L0271J5994
$$ 97145 51760 137203 187220 116498 64539 50430 80961 33578 84219 119293 149564 165558
19695A65558K506P9852R0428j0643r2151j8458j547m0526k8184m8392n4179J6020
$$ 165558 168064 247916 338344 327701 235550 217092 215545 175019 146835 98443 44264 60284
19683F0284R123K486n9455n3826n865R1903P9940L035m7467q2398J9893O0191
$$ 60284 69407 71893 12438 -41388 -47253 44650 124590 127625 80158 -2240 17653 77844
19671G7844J4147L8476L154j692n304m953m4390m3684Q9345J08704M3153Q91j9008
$$ 77844 91991 130467 133621 131929 126625 121672 77282 33598 122943 231647 274800 275691 256683
19658B56683N017K2058n3260m4502m3775K3302O248J9878K2179q372k8047l0211
$$ 256683 261700 283758 230498 185996 142221 165523 171771 191649 213828 205456 177409 147198
19646A47198j6499l620R784n1423j24570p5102R4347N2548k6251J7836J8874j1027
$$ 147198 130699 127079 136863 85440 -39130 -114232 -19885 32663 6412 24248 43122 32095
19634C2095k0589R0967L1157m7391l5306M091j8122K7407L9985O407k2907m7769
$$ 32095 11506 102473 133630 86239 50933 55024 36902 64309 104294 110701 87794 40025
19622D0025O43L642L8424l0572j7105Q09P0323m8650l440l2123N6644P2040J1715
$$ 40025 40668 44310 82734 52162 35057 35866 106189 57539 54099 21976 78620 150660 162375
19609A62375m4531r5037k7752J1567j1014n465m1702R388O0518j8477j6641M381
$$ 162375 117844 22807 -4945 6622 -4392 -9857 -51559 -42171 18347 -130 -16771 -12390
19597a2390J1844O6726J8491j2989q936j1369k1068k1384M4184N1143J9710k5114
$$ -12390 -546 66180 84671 71682 62746 51377 30309 8925 53109 104252 123962 98848
19585I8848l3457K1762j7175J643L387L8203l7059j0624K5379p2398m1037k1590
$$ 98848 65391 87153 69978 71621 75008 113211 76152 65528 90907 18509 -22528 -44118
19573d4118L4489K0667n5138j2624k0632j5532M444M0619j2495q6841r8947k4793
$$ -44118 -9629 11038 -44100 -56724 -77356 -92888 -88444 -47825 -60320 -147161 -246108 -270901
19561b70901j08207m5904P3889P7106L1373J09340L9915q0472r4445k1909n153
$$ -270901 -379108 -425012 -351123 -274017 -242644 -133304 -93389 -173861 -268306 -290215 -295368
19550b95368P2755P6771l7279J0770J36246J85105M0386O302Q0777J0551m4622
$$ -295368 -222613 -145842 -183121 -172351 -36105 149000 189386 195688 276465 287016 242394
19539B42394L30m5202m5166o73p84N7450J33134J19834J17070J49816Q7040k0059
$$ 242394 242724 197522 152356 151683 150899 208349 341483 461317 578387 728203 815243 795184
19527G95184j12132o1051k4368j8234J02608R3626J41250O9816m6082p2786p5273
$$ 795184 683052 622001 597633 579399 682007 775633 916883 986699 940617 867831 792558
19516G92558o1923q5647j06649n3887J7823J175K2239n8031n3954Q9272J3365
$$ 792558 730635 644988 538339 484452 502275 503450 525689 467658 413704 502976 516341
19505E16341P2775L3423q9222p8574M2737J12395J03714K3004L3259R4512J67233
$$ 516341 589116 622539 533317 454743 497480 609875 713589 736593 769852 864364 1031597
19494A031597K23496K55417K60265J33325L0542l6339q2678m8224L2178J4745
$$ 1031597 1255093 1510510 1770775 1904100 1934642 1898303 1815625 1767401 1799579 1814324
19484A814324Q5757J46506N7429M0099j02977k67491k29346j56038j50541j07256
$$ 1814324 1900081 2046587 2104016 2144115 2041138 1773647 1544301 1388263 1237722 1130466
19474A130466k4919L6138o0414l8512m9386K2067n073M1637R9901J21027L0326
$$ 1130466 1105547 1141685 1081271 1042759 993373 1015440 1010367 1052004 1151905 1272932 1303258
19463A303258k0522q768N6079M2609L8343R729J2696K2263M3682Q2830N9296P0777
$$ 1303258 1282736 1273968 1330047 1372656 1410999 1420728 1433424 1455687 1499369 1582199 1641495 1712272
19451A712272R0951R8559J18991J12858P7679J18076J53505J46647J73566K15946
$$ 1712272 1803223 1901782 2020773 2133631 2211310 2329386 2482891 2629538 2803104 3019050
19441C019050L65166M18202M00894L83223L38625L13194L02014L12148K87988
$$ 3019050 3384216 3802418 4203312 4586535 4925160 5238354 5540368 5852516 6140504
19432F140504L95525M83975N45375N99582O32577N62819N90761N90850N81305
$$ 6140504 6536029 7020004 7565379 8164961 8797538 9360357 9951118 10541968 11123273
19423A1123273N93052P01202J032127J309947J625161J976590K423251K980518
$$ 11123273 11716325 12417527 13449654 14759601 16384762 18361352 20784603 23765121
19415B3765121L825768M966362O619451R000863J2439490J7521512K3821363K9790033
$$ 23765121 27590889 32557251 39176702 48177565 60617055 78138567 101959930 131749963
19407A31749963L3192547L1568280K4346710J4350561N550695j419932n951484
$$ 131749963 164942510 196510790 220857500 235208061 240758756 239338824 233387340
19400B33387340m945306J128070P519712R753101O043363j847797j0405749j8592723
$$ 233387340 228442034 229570104 237089816 246842917 252886280 251038483 240632734 222040011
19392B22040011k6598024l1410562l0978831k7373697k2831660j8149491j3705432
$$ 222040011 195441987 164031425 133052594 105678897 82847237 64697746 50992314
19385E0992314j0034761p302043n470201m105983l145715k568681k041742j647045
$$ 50992314 40957553 33655510 28185309 24079326 20933611 18364930 16323188 14676143
19377A4676143j313222j007630p49015m72850l93359l57166m20493m75428n03825
$$ 14676143 13362921 12355291 11606276 11133426 10740067 10382901 9962408 9486980 8983155
19368H983155o08257m90948l49326l73668l77397l46834k34858k83835k86423
$$ 8983155 8374898 7883950 7534624 7160956 6783559 6436725 6201867 5918032 5631609
19359E631609k58188k52087l05777k47118l27087l39613k20203k26232k13989
$$ 5631609 5373421 5121334 4815557 4568439 4241352 3901739 3681536 3455304 3241315
19350C241315j21361o3182r8330q9469r6697p2284o9835p3059k1167j2940P2144
$$ 3241315 3119954 3056772 2958442 2868973 2772276 2699992 2630157 2557098 2535931 2522991 2595135
19339B595135P7207N9503J24539K32088L16292L65858N67902Q03692J137355J486442
$$ 2595135 2672342 2731845 2856384 3088472 3404764 3770622 4338524 5142216 6279571 7766013
19329G766013K275258L225908M084637M789511M674542L851073K187349J26722
$$ 7766013 10041271 13267179 17351816 22141327 26815869 30666942 32854291 32981013
19321C2981013j798057l378485m376271m503000m100725l353595k594298j996231
$$ 32981013 31182956 27804471 23428200 18925200 14824475 11470880 8876582 6880351
19313F880351j420771j039189p65200o16281m58153l70205j19656r5700j69836
$$ 6880351 5459580 4420391 3655191 3038910 2580757 2210552 2090896 1995196 1825360
19304A825360j49379j47026j32053r7063l8086o6636K865O789l2606j5921L2663
$$ 1825360 1675981 1528955 1396902 1299839 1261753 1195117 1197982 1204771 1172165 1156244 1188907
19293A188907P21p510N458K7662J5502R961o0835j12224p6536n839K1262j4454
$$ 1188907 1189628 1182118 1187576 1215238 1230740 1240701 1179866 1067642 991106 985267 1006529 992075
19281I92075q7984n2283k2954Q3791N6985K5215K9227J9603l5012n3187n6073
$$ 992075 904091 851808 828854 912645 969630 994845 1024072 1043675 1008663 955476 899403
19270H99403p0508L4391N146l2825n2363O075j2683j6938p008j2823m5378m2895
$$ 899403 828895 863286 868432 835607 783244 789319 776636 759698 752690 739867 694489 651594
19258F51594k6450P520L9611J13069P1878K1588l8202O4978M4625J6829r733q111
$$ 651594 625144 632664 672275 785344 857222 878810 840608 905586 950211 967040 957307 949196
19246I49196N815J0892m4615q0870o2619P5250O0043k4334l4863n8073m6090K9939
$$ 949196 955011 965903 921288 840418 777799 853049 913092 888758 853895 795822 749732 779671
19234G79671K7630n6889r8357l4852j1788j2469j5972j5033k9875O1910N3704
$$ 779671 807301 750412 652055 617203 605415 592946 576974 561941 532066 593976 647680
19223F47680j3621P2395l6265l8789j7884J0916Q4017O3087p833O975K7606J5157
$$ 647680 634059 706454 670189 631400 613516 624432 708449 771536 763703 770678 798284 813441
19211H13441j5479n9302o3037l6200k2569m692M9536J1349m0935O3671R7709P0722
$$ 813441 797962 738660 675623 639423 616854 612162 661698 673047 632112 695783 793492 864214
19199H64214O1744P8820J25218M9262M0574J16500J53098J12480J99320K20736
$$ 864214 925958 1004778 1129996 1179258 1219832 1336332 1489430 1601910 1801230 2021966
19189B021966L23230L91439N02113Q13704J126955J538197K154778K365908K427018
$$ 2021966 2345196 2736635 3238748 4052452 5179407 6717604 8872382 11238290 13665308
19180A3665308K059261J220963K85899o34591j421704j893592k024520j699649
$$ 13665308 15724569 16945532 17231431 16596840 15175136 13281544 11257024 9557375
19172I557375j293752q47566l76044K70410Q03192J467734K044229K395641K325240
$$ 9557375 8263623 7416057 7040013 7310423 8113615 9581349 11625578 14021219 16346459
19163A6346459J706715P80768l01173j309074k008808k467886k493030k130002
$$ 16346459 18053174 18833942 18532769 17223695 15214887 12747001 10253971 8123969
19155H123969j733670j311261j079285q26842n73421m57344k59999j89825j94420
$$ 8123969 6390299 5079038 3999753 3172911 2599490 2142146 1882147 1692322 1497902
19146A497902j20336q2280p6953r2693l9353o8998j08759r7938k6715J4099p7491
$$ 1497902 1377566 1295286 1218333 1125640 1086287 1017289 908530 810592 783877 797976 720485
19135G20485n0146p9345k7523N7820J4138j3693J840j8035o725L3312J2174k666
$$ 720485 670339 590994 563471 621291 635429 621736 623576 605541 598816 632128 644302 641636
19123F41636O470n1216l2435k655R250n0502q6412n1873J0763q1k8160n9810l838
$$ 641636 648106 596890 564455 561800 571050 520548 434136 382263 393026 392945 364785 304975 301137
19110C01137q549n8053m3598O2556R946J04129o1226q4982L369l0270M119n2197
$$ 301137 292588 234535 190937 253493 263439 367568 306342 221360 224729 194459 198578 146381
19098A46381j804m1555M8901M1755p172m7065J3356N0681n6758J9049Q0335M253
$$ 146381 144577 103022 151923 193678 186506 139441 152797 203478 146720 165769 246104 250357
19086B50357K4453O2093p519J36k007l8321J0394l291k0234o407k9868r1657o2771
$$ 250357 274810 336903 329384 329520 327513 289192 299586 296295 276061 269654 239786 148129 85358
19073H5358q776q389p786k8948p6790q7891j04856k9748j5773k5479j0125N3107
$$ 85358 76582 68193 60407 31459 -45331 -133222 -238078 -267826 -283599 -309078 -319203 -266096
19061b66096N6149L9812M9383r262O0908m1641K9023L0321O3878N9572O2663Q0258
$$ -266096 -209947 -170135 -120752 -130014 -69106 -110747 -81724 -51403 12475 72047 134710 214968
19049B14968L5588K4323L945J7968L8169m1360r8470k2604l3047L2452J12669
$$ 214968 250556 274879 278824 296792 334961 293601 195131 172527 139480 171932 284601
19038B84601K58388J91659J26629R1078L1804r1692j19913p5579q3352J2585J33577
$$ 284601 542989 734648 861277 952355 984159 892467 772554 696975 613623 626208 759785
19027G59785J13444Q4187M015q3287p1554k8544j06350k8611R640l7685j36980
$$ 759785 873229 957416 961431 878144 806590 778046 671696 643085 652725 615040 478060
19016D78060j13539p7170M5824M5824K0386L1461M8615K2621l9226m2646m5112
$$ 478060 364521 287351 333175 378999 399385 430846 479461 502082 462856 420210 375098
19005C75098N2636O2600L7998J8520j3698l7339j8571k0487P0902k3724j4860
$$ 375098 427734 490334 528332 546852 533154 495815 477244 456757 527659 503935 489075
18994D89075j743R680O6314J4707j4934m8747j5424M8730k3422K4349M3438J0699
$$ 489075 487332 497012 563326 578033 563099 514352 498928 547658 524236 548585 592023 602722
18982F02722J7169L3894M2184M779r892M0797o713J8007M8413J01729O3874L5036
$$ 602722 619891 653785 695969 700748 690856 731653 724940 742947 791360 893089 956963 991999
18970I91999J17796J01160J3584j3071r5190j7855P9091N8556m410K9506L5158
$$ 991999 1109795 1210955 1224539 1211468 1116278 1098423 1177514 1236070 1231660 1261166 1296324
18959A296324N4449J46706J29806L5873J06509K6066J22356J05574J47517J82727
$$ 1296324 1350773 1497479 1627285 1663158 1769667 1795733 1918089 2023663 2171180 2353907
18949B353907K24529L07762L84719L88763N45921N60239L29784K21842K38314
$$ 2353907 2578436 2886198 3270917 3659680 4205601 4765840 5095624 5317466 5555780
18940E555780L00879L59680M71645M62086N05628N56366M15758L65453L46828
$$ 5555780 5856659 6216339 6687984 7150070 7655698 8212064 8627822 8993275 9340103
18931I340103L53475L77393O07196Q18511J022655J219208J345307J589481K007076
$$ 9340103 9693578 10070971 10678167 11496678 12519333 13738541 15083848 16673329 18680405
18922A8680405K456174L176635M105768N324334P175516R717910J3619949J9560992
$$ 18680405 21136579 24313214 28418982 33743316 40918832 50636742 64256691 83817683
18914H3817683K7573768L6025641M1799513M0749869K9448847J2678942j952158
$$ 83817683 111391451 147417092 189216605 229966474 259415321 272094263 270142105
18907B70142105j4397475k0759091j4829109q60462J2320650J8549364J3464989
$$ 270142105 255744630 234985539 220156430 219295968 231616618 250165982 263630971
18900B63630971l32478j4428500k7909354l8904480m0575853l4510440k6530694
$$ 263630971 263298493 248869993 220960639 182056159 141480306 106969866 80439172
18893H0439172j9385776j3637454r556386o866194n124250l936135l058506k333476
$$ 80439172 61053396 47415942 37859556 30993362 25869112 21932977 18874471 16540995
18885A6540995j807374j351936j035438q70596o16861n58557n08665l84093k84991
$$ 16540995 14733621 13381685 12346247 11475651 10858790 10300233 9791568 9407475 9122484
18876I122484j66329j34074k12349k49541m59907n54912n15643l50938k62375
$$ 9122484 8956155 8822081 8609732 8360191 7900284 7345372 6829729 6478791 6216416
18867F216416k07280j91811k85324m01867m74887m17814m11429l74118k70481
$$ 6216416 6009136 5817325 5532001 5130134 4655247 4237433 3826004 3451886 3181405
18858C181405k59157j91835j11257j83546k01141j68790n6757o6880j37168j02790
$$ 3181405 2922248 2730413 2619156 2435610 2234469 2065679 2008922 1942042 1804874 1702084
18848A702084M368l0661r0443n2182j09948j40824j69475k4392K7013K7448K4659
$$ 1702084 1706452 1675791 1585348 1533166 1423218 1282394 1112919 1088527 1115540 1142988 1167647
18837A167647r806m0586p4779k0701j7390k4666l7627O631M7642N9638L1394r8314
$$ 1167647 1157841 1117255 1042476 1021775 1004385 979719 942092 948723 996365 1056003 1087397 989083
18825I89083k2787j2323J4586l7881j1726L9114J9520K2775M8772j3146K4974
$$ 989083 966296 953973 968559 930678 918952 958066 977586 1000361 1049133 1035987 1060961
18814A060961J07560J45892J14984o4386r3018p9200n581O1709J53349J94962
$$ 1060961 1168521 1314413 1429397 1365011 1271993 1192793 1187212 1248921 1402270 1597232
18804A597232J47778J36031J89077J79936J50275J12892R8683O2753Q162R781
$$ 1597232 1745010 1881041 2070118 2250054 2400329 2513221 2611904 2674657 2682819 2692600
18794B692600M6982J25410J09892J16972O6916R1713K10511K80615M16254O22806
$$ 2692600 2739582 2864992 2974884 3091856 3158772 3250485 3460996 3741611 4157865 4780671
18784D780671J028846J711254K319311K852225L064161K597766J502519J92445
$$ 4780671 5809517 7520771 9840082 12692307 15756468 18354234 19856753 20049198
18776B0049198p87261j726370k475452k535964k101395j640116j139215n25439
$$ 20049198 19261937 17535567 15060115 12524151 10422756 8782640 7643425 7117986
18768G117986J33967P05604J345933K005697K400112K365712J774518P46570l22836
$$ 7117986 7251953 7957557 9303490 11309187 13709299 16075011 17849529 18596099 18273263
18759A8273263j250802k073248k503348k519395k105141j649579j309059r57439
$$ 18273263 17022461 14949213 12445865 9926470 7821329 6171750 4862691 3905252
18751C905252o93867m71378l95984k57419j62636l3963n521j15855n5122l2182
$$ 3905252 3211385 2740007 2344023 2086604 1923968 1890005 1884484 1768629 1713507 1681325
18741A681325k04011r5358p1967j26470j43174j23487l8806r0978l3134j8265
$$ 1681325 1477314 1381956 1309989 1183519 1040345 916858 878052 787074 753940 735675
18731G35675O6197l5660m9863k6941L0594N1868K9707j0133M0518O308p3254j11255
$$ 735675 801872 766212 716349 689408 720002 771870 801577 791444 831962 838270 765016 653761
18719F53761l7223L5556M9517L4068M7084n2492m7593j2925l7468p5853L9410
$$ 653761 616538 652094 701611 735679 782763 730271 682678 669753 632285 556432 595842
18708E95842m167j8614j03278o6224n9079k6148n0990N281K7464L2210L6319L0163
$$ 595842 591675 573061 469783 403559 344480 318332 267342 272623 300087 332297 368616 398779
18696C98779k7164l6309j7193p176o9190K5419K7035M6129j0162q2506k6209o9534
$$ 398779 371615 335306 318113 310937 241747 267166 294201 340330 330168 247662 221453 151919
18684A51919j9236J5682n59N0065R3615j1878m0911l1587J4649J3580L7820k5240
$$ 151919 132683 148365 147806 197871 291486 279608 238697 207110 221759 235339 273159 247919
18672B47919q593P837k5029K6401k2025o3188q267k744n9173l6835K9775r813
$$ 247919 239326 247163 222134 248535 226510 163322 155055 152311 93138 56303 86078 76265
18660G6265k4897j852Q641l0793K2974P3168j5515j3754M3074K2539j93P096m8331
$$ 76265 51368 49516 58157 27364 50338 123506 107991 94237 137311 159850 159657 166753 118422
18647A18422M95m7172J4878O459L5006j6856j1455L2432m1644l6716J7070J9103
$$ 118422 118917 71745 86623 93082 128088 111232 99777 132209 90565 53849 70919 90022
18635I0022M1598j4071r2778p36N8510N4258o3369j630O1659O5913J5368M4145
$$ 90022 131620 117549 24771 24035 82545 136803 73434 71804 133463 199376 214744 258889
18623B58889p653n6500k5650o01o3841o7067K1895K3607n3658K6512N4277j7027
$$ 258889 251236 194736 169086 168485 104644 37577 59472 83079 29421 55933 110210 93183
18611I3183K9502J6227j8336K0036K1459L3214R754J4622K2519m0137J1136M8626
$$ 93183 122685 138912 120576 140612 162071 195285 205039 219661 242180 202043 213179 261805
18599B61805K971p9894q5550K338J0480L2125K4804J884j2517l9814j8753k841
$$ 261805 264776 184882 99332 101670 112150 144275 169079 170963 158446 118632 99879 97038
18587I7038K4710M2399n8424j6787m8540L3154O0734Q1789k1120p4828n7140N423
$$ 97038 121748 164147 105723 88936 40396 73550 134284 216073 194953 120125 62985 68408
18575F8408n0745K9442Q9416N514m5690q6096j5934J8902J7070Q479j1383K3279
$$ 68408 17663 47105 136521 142035 96345 10249 -5685 13217 30287 38766 27383 50662
18563E0662L2773K823n8685j7077l6683K4783N0617j4066m0257J8214k1599K450
$$ 50662 83435 86258 27573 10496 -26187 -1404 49213 35147 -5110 13104 -8495 -6045
18551f045j4173K4687n846o4052L8472M4323j1879l3407L6241K2930M4026o2625
$$ -6045 -20218 4469 -1377 -65429 -26957 17366 5487 -27920 8321 31251 75277 12652
18539A2652j07462J2363M370K3956N7801R4697L2078O302n7382o5767l1684k2269
$$ 12652 -94810 -82447 -78077 -54121 3680 98377 130455 136757 79375 13608 -18076 -40345
18527d0345n4091J6350M7704L8024k3946k0694J1861j7861N9989M1498m3227n0169
$$ -40345 -94436 -78086 -30382 7642 -16304 -36998 -25137 -42998 16991 58489 15262 -34907
18515c4907m296K6264O178K8762j9178N4805r5J2313J535n4067r809M56j3615
$$ -34907 -39203 -12939 -6761 22001 2823 57628 57533 69846 71381 17314 7505 7961 -5654
18502e654m3571Q614K0737l4628P184O8367r116L8375K8738j5827J0670l0519
$$ -5654 -49225 -40611 -19874 -54502 -47318 21049 11933 50308 79046 63219 73889 43370
18490D3370o0260k9389m1151M5146K0330J8448J8484k0201k1543l328M8297J8887
$$ 43370 -16890 -46279 -87430 -42284 -21954 -3506 14978 -5223 -26766 -30094 18203 37090
18478C7090J1276m4843l5163O6446J3553o2684L0271M7365j7449M156l0523l2870
$$ 37090 48366 3523 -31640 34806 48359 -14325 15946 63311 45862 50018 19495 -13375
18466a3375k6251l8176M8965N8038L8575l4594l6761M718o18M4612r050m52K9517
$$ -13375 -39626 -77802 -28837 29201 67776 33182 -3579 1139 521 45133 36083 35631 65148
18453F5148j9608J5704j3373k779J2691p4292k0171M6657L6632N2368L4817m1594
$$ 65148 45540 61244 47871 45092 57783 -16509 -36680 9977 46609 98977 133794 92200
18441I2200j3908J5455K4470K745K5597K9541j7273o4347k5440J7897L0879n0255
$$ 92200 78292 93747 118217 120962 146559 176100 158827 94480 69040 86937 117816 67561
18429F7561k7106j518J8931k5948J771J5570J7034N4200m3217o3914K9011Q6697
$$ 67561 40455 38937 57868 31920 33691 49261 66295 120495 77278 13364 42375 129072
18417A29072K4965m0704k9047J2122n5730k253k8190j8522N0057j9871l611l8536
$$ 129072 154037 113333 84286 96408 40678 38425 10235 -8287 41770 21899 18288 -20248
18405b0248L445L5096N2576L8904j4397J6760l1835n4982k0669n248O5453j6698
$$ -20248 -16803 18293 70869 109773 95376 112136 80301 25319 4650 -598 64855 48157
18393D8157p7952K8262K5527J295J0620o6943m0322k5052O972M4672K8063k3225
$$ 48157 -29795 -1533 23994 25289 35909 -31034 -71356 -96408 -89436 -44764 -16701 -39926
18381c9926n7528j273J5342L504l461R094K170m9516N5791N5679M8558q354J2183
$$ -39926 -97454 -98727 -83385 -79881 -83342 -74248 -72078 -121594 -65803 -10124 38434 30080 42263
18368D2263k2419O0905J39754L5291q582p0556n6749K4740N720k6814k0723j364
$$ 42263 19844 80749 220503 255794 247212 176656 119907 144647 150367 123553 102830 101466
18356A01466n9305q9744l6306O5221O3641q3168l9760L1605O926O8376Q37M442
$$ 101466 42161 -47583 -83889 -18668 44973 -38195 -77955 -46350 -39424 28952 29789 34231
18344C4231Q141k6213R71m3022j7371R1016k8103m0632P4891R1966J01823K8236
$$ 34231 42372 16159 17130 -25892 -43263 47753 19650 -20982 53909 145875 247698 275934
18332B75934o5145o085N3357p686M9332Q4776J51326K18617K30621K28423J89857
$$ 275934 210789 204704 258061 250375 299707 384483 535809 754426 985047 1213470 1403327
18321A403327P8334M0860l3698j54023j36367J2072R3756R3784M1594o065r2815
$$ 1403327 1481661 1522521 1488823 1334800 1198433 1210505 1304261 1398045 1439639 1433574 1340759
18310A340759j05535k17864j91684j76403j55964r0752j02484r4734o4489n528
$$ 1340759 1235224 1017360 825676 649273 493309 402557 300073 205339 140850 135322
18300A35322j136M3238n2930q7324L8194K6429k9601n3555j0202J0319K2386o023
$$ 135322 134186 177424 124494 37170 75364 101793 72192 18637 8435 18754 41140 35117
18288C5117L9421N2932K6803k2083n5123n6485l1646j1788o1811l4922P7026P1030
$$ 35117 74538 127470 154273 132190 77067 20582 -11064 -22852 -84663 -119585 -42559 28471
18276B8471j6669P897P5645n5313p1242r582R601m723k9204l0744l6734p1387
$$ 28471 11802 19699 95344 40031 -31211 -40793 -31192 -35915 -65119 -95863 -132597 -203984
18264b03984m6542L6744O5060J06151P86j9549K5393N9879l7048k6352K7655P7597
$$ -203984 -250526 -213782 -148722 -42571 -41785 -61334 -35941 23938 -13110 -39462 -11807 65790
18252F5790K2237m243j3291L0398j5875q9153l1771o4849O1048Q1122L2166J3487
$$ 65790 88027 83784 70493 100891 85016 -4137 -35908 -100757 -39709 41413 73579 87066
18240H7066M4313l630q9090n3118L0377R0452J49954L8753m608p0408p4887r5754
$$ 87066 131379 127749 38659 -14459 15918 106370 256324 295077 290469 220061 145174 49420
18228D9420L5439K320M6966l1156p6816l337L9403N197l0425l1400j34163M9947
$$ 49420 84859 87179 134145 102989 26173 22836 62239 67436 37011 5611 -128552 -78605
18216g8605J9801j5811K6661J9518N0436K344O743O8864r953j02926l4061L9990
$$ -78605 -58804 -74615 -47954 -28436 22000 24344 31087 99951 89998 -12928 -46989 -6999
18204f999L6871O779m0992o3311j997L9614j2022j4378o009N2635j1247J3583
$$ -6999 29872 36651 -4341 -67652 -69649 -30035 -42057 -56435 -62444 -9809 -21056 -7473
18192g473M6642Q9597J6886m02l4835p0003k5600M971Q0270L5760k2473L2618
$$ -7473 39169 128766 145652 145250 110415 40412 14812 19783 100053 135813 113340 145958
18180A45958L4410L3132J6504k8469n1221j8750M4598J9935k9517q2533o3901
$$ 145958 180368 213500 230004 201535 150314 131564 176162 196097 166580 84047 20146
18169B0146J8454N6140j4656J03232J7458k4856k9964K0158j090j626J1857J9174
$$ 20146 38600 94740 80084 183316 200774 175918 145954 166112 165022 163396 175253 194427
18157A94427n1145J3635J344L3969M4334R409p652L7q382N0010L4179j9786M5680
$$ 194427 143282 156917 158261 192230 236564 245973 238321 238358 229976 279986 314165 294379 340059
18144C40059J05388K8948O830R038J6824O7572O8830P2063O3052P3062R7128J14195
$$ 340059 445447 474395 481225 490263 507087 574659 643489 715552 778604 851666 948794 1062989
18132A062989Q8285N1683O0507J48406K02439J90314K51804L00656L86746M36098
$$ 1062989 1151274 1202957 1263464 1411870 1614309 1804623 2056427 2357083 2743829 3179927
18122C179927N03490O96983P12088P81869R73577J175872J593865K140889L212238
$$ 3179927 3683417 4380400 5092488 5874357 6847934 8023806 9617671 11758560 14970798
18113A4970798M899834P686816J2315698J7972202K3125245K3065966J0613117
$$ 14970798 19870632 27557448 39873146 57845348 80970593 104036559 114649676
18106A14649676n755683k1004483k5783068j9712019j3200271q523672n487722
$$ 114649676 108893993 87889510 62106442 42394423 29194152 20670480 15182758
18099A5182758l679184k565765j872398j430593j028872q17708o46128n35642
$$ 15182758 11503574 8937809 7065411 5634818 4605946 3788238 3142110 2606468
18091B606468l41859k83655k40631j71358o9522j28880j35179j39224q8675p8343
$$ 2606468 2264609 1980954 1740323 1568965 1499443 1370563 1235384 1096160 1007485 929142
18081I29142n2504j6566j9680p4237q7487N9686j8894l9383m6068o9092p4792
$$ 929142 876638 860072 840392 766155 678668 738354 719460 680077 634009 564917 490125
18070D90125k7636k3606j04940j45083k9449K7952L0337K7753J6636M5425O3749
$$ 490125 462489 438883 333943 188860 159411 187363 217700 245453 262089 307514 371263
18059C71263k8087o8397m0353L1710N7059l7779p9483q7993j4639N1241N4953
$$ 371263 343176 274779 234426 266136 323195 285416 205933 117940 103301 154542 209495
18048B09495k8471m3830l9006L86L1700o0860k0964p349K9242m6831J0295K9662
$$ 209495 181024 137194 98188 98574 130274 69414 48450 41101 70343 23512 33807 63469
18036F3469K1615l1967q201N1647L022q927O0512m6398o5533J8284O2369k1177
$$ 63469 85084 53117 44916 96563 99585 90658 151170 104772 39239 57523 119892 98715
18024I8715m9946J6330M2815m4855m0414q35O661j7339O3765K1669K8483p54o2019
$$ 98715 48769 65099 107914 63059 22645 21810 28471 11132 74897 96566 125049 124295 62276
18011F2276k1350l7424Q604L2256l3489p3909l1936Q1232J02562l7456k3197M464
$$ 62276 40926 3502 12106 44362 10873 -63036 -94972 -13740 88822 51366 28169 32633
17999C2633k4038j91J7021q3561k3083o241J1880N6019K3806k8668l9479J3408
$$ 32633 8595 8404 25425 -58136 -81219 -87460 -75580 -19561 4245 -24423 -63902 -50494
17987e0494K1473j9510O984L9537K3816K7022O2959J2215p0583k1743J1986m3515
$$ -50494 -29021 -48531 -41547 -2010 21806 48828 111787 124002 53419 31676 43662 147
17975A47L4972M2885L9987q9162j7019Q8184j6192j74895k8975L6694M9149M5807
$$ 147 35119 78004 117991 28829 11810 99994 83802 -91093 -120068 -83374 -34225 11582
17963A1582j7090j10N5121L3307k1147k5886K6551l1929n744L6500O0538P4794
$$ 11582 -5508 -5618 49503 82810 61663 35777 62328 30399 24655 61155 121693 196487
17951A96487Q0348L2641p0697j37931o5561J5370J7772R932m5033j9036n4007
$$ 196487 276835 309476 238779 100848 35287 50657 68429 78361 33328 14292 -39715
17940c9715m2497K3990P0262L1084J0922M7931J4854o6219p5016r636K0724o4437
$$ -39715 -82212 -58222 12040 43124 54046 101977 116831 50612 -24404 -34040 -13316 -77753
17928g7753l4140M80J4494N3971M5919L4238K1832j4911k8929K6284K2019j7053
$$ -77753 -111893 -111413 -96919 -42948 2971 37209 59041 44130 15201 41485 63504 46451
17916D6451m9972j2533P1244j1998n3860l5431p1618O743J0435M2844J532p555
$$ 46451 -3521 -16054 55190 43192 -10668 -46099 -117717 -110974 -100539 -57695 -56163 -63718
17904f3718O8156M1825L464K4446o7070p7469j8332M9369K812k2791l2078P2381
$$ -63718 4438 46263 49727 74173 7103 -70366 -88698 -39329 -36517 -59308 -91386 -19005
17892a9005L52n8925j2919K0095L4254n9480l4815K3218L5488N4065J08530q476
$$ -19005 -18653 -77578 -90497 -70402 -36148 -95628 -130443 -107225 -71737 -17672 90858 82382
17880H2382l9925l7726J6779l4567J5606k9542k7838J92m8029j0547L0219M0937
$$ 82382 42457 4731 21510 -13057 2549 -26993 -54831 -54639 -102668 -113215 -82996 -42059
17868d2059L8601k1957Q971j8227j0347q0720l5122J5484O2894O3301L0457l3351
$$ -42059 -3458 -25415 -16444 -34671 -45018 -125738 -160860 -145376 -82482 -19181 11276 -22075
17856b2075K37l4443K2628L7596m6756N7359L2045m9564p744j9082Q212J4124
$$ -22075 -21838 -56281 -33653 3943 -42813 14546 46591 -2973 -10717 -29799 -21587 -7463
17844g463K8993q1269l2998P3222M1981p392j269k5095m1810o7133l3751o640
$$ -7463 21530 -59739 -92737 -19515 22466 15074 13805 -11290 -53100 -120233 -153984 -160624
17832a60624N8600J9357K2579K8032k1323J5928L6385l2611M3440j7451L4534
$$ -160624 -102024 -82667 -60088 -32056 -53379 -37451 -1066 -33677 9763 -7688 26846
17821B6846J5767J3510K381O282n0601n9245o8180L1731N1750L0430j2618M1203
$$ 26846 42613 56123 58504 64786 14185 -45060 -113240 -81509 -29759 671 -11947 29256
17809B9256L5703p3393m5510m957o761k7750L6920N2206L5120N2099L7257Q441
$$ 29256 64959 -8434 -53944 -58901 -65662 -93412 -56492 -4286 30834 82933 120190 128631
17797A28631k3567m1945k339O1196l2702r3089n6203K4471P6472M1509P474m0137
$$ 128631 105064 63119 60780 121976 89274 -3815 -60018 -35547 40925 82434 89908 49771
17785D9771p1551p2766O232K9016m7537J7629L4138J6216J0376l4821j830J0386
$$ 49771 -21780 -94546 -88314 -59298 -106835 -89206 -55068 -38852 -28476 -63297 -65127 -54741
17773e4741k2942J5086m938l1195M3999j6718m6079Q24J0016J6486k3681j1049
$$ -54741 -77683 -62597 -67535 -98730 -54731 -71449 -117528 -116704 -106688 -90202 -113883 -124932
17761a24932L0185n7989k6501K635O229O2816M0929R0250l835q4646K91k1126
$$ -124932 -94747 -152736 -179237 -176602 -170373 -107557 -66628 23622 19787 -64859 -64568 -85694
17749h5694p231N6309O874M3278M0672l921K1732l7854o2198L164l84k3593k1614
$$ -85694 -92925 -36616 -29742 13536 54208 50287 72019 34165 -28033 -24869 -25253 -48846 -70460
17736g0460M7508p907N9223O848n5673p264J21697K1879j42849n3096k1120j4940
$$ -70460 -22952 -30859 28364 35212 -20461 -27725 93972 115851 -26998 -80094 -101214 -116154
17724a16154J1427Q059J2508M1163M0234k5292L620m0510L331K7426L3270K5682
$$ -116154 -104727 -96668 -84160 -42997 -2763 -28055 -24435 -64945 -61614 -34188 -918 24764
17712B4764l625K4637n0049j28061k4621N0844Q0418L4753j6959J4441k0319j2402
$$ 24764 21139 45776 -4273 -132334 -156955 -106111 -25693 9060 -7899 6542 -13777 -26179
17700b6179j6831l4943k0260K8121K514M653q776j5617k3573R807k4394K7987
$$ -26179 -43010 -77953 -98213 -70092 -67578 -62925 -71701 -87318 -110891 -101084 -125478 -97491
17688i7491P300l2053l9447j6992P131O8362L0910K0153k3611k3378l659Q9129
$$ -97491 -90191 -122244 -161691 -178683 -171552 -103190 -72280 -52127 -75738 -99116 -102775 -13646
17676a3646K6500L984m1320p9021l6148M0037R563J184o4534j4632O6876O4897
$$ -13646 12854 16838 -24482 -103503 -139651 -99614 -90051 -88867 -153401 -168033 -101157 -36260
17664c6260N9775n8414p1221L4607j0629N5085N7385J0366m6003K4213J8764k4289
$$ -36260 23515 -34899 -106120 -71513 -82142 -27057 30328 40694 -5309 18904 37668 13379
17652A3379M2130j1729p150M72j5354m919q1663p753J5878O3054K4277P265l2729
$$ 13379 55509 43780 36630 37102 21748 16829 -64834 -72587 -56709 6345 30622 37887 5158
17639E158K1649q333r1408n1515J5580L8771J7977J7893P4515J525m1408L4992
$$ 5158 26807 18474 -72934 -124449 -108869 -70098 -52121 -34228 40287 41812 404 35396
17627C5396J3970K2065j6754k3509q073L7046k1360p1339n7390l0097P287M8679
$$ 35396 49366 71431 54677 31168 23095 60141 38781 -32558 -89948 -120045 -112758 -64079
17615f4079q001p789m495j1143J1714l5420L9259K5610l5877j3412k5544J1351
$$ -64079 -72080 -79869 -84364 -95507 -83793 -119213 -79954 -54344 -90221 -103633 -129177 -117826
17603a17826N614k8240K5482J3750n360M4861K6508l7290M7996K3287j5402n7831
$$ -117826 -112212 -140452 -114970 -101220 -106580 -61719 -35211 -72501 -24505 -1218 -16620 -74451
17591g4451o9671j7355N4663r854L5822K1106k2369P157n0878k6172J845L2013
$$ -74451 -144122 -161477 -106814 -116668 -80846 -59740 -82109 -74952 -125830 -152002 -150157 -118144
17579a18144N3260j9757j1809P589J0751j2355n5150q857l7893N0264O7103J832
$$ -118144 -64884 -84641 -96450 -88861 -78110 -90465 -145615 -154472 -192365 -142101 -74998 -73166
17567g3166j4689L7138O6596l5276k9006j4691N744M8789J4026l8527p003l071
$$ -73166 -87855 -50717 15879 -19397 -48403 -63094 -57350 -8561 5465 -33062 -40065 -43136
17555d3136n2909o9888M0393J0449l8287L9206J11663L5159K0228m8266l4756
$$ -43136 -96045 -165933 -125540 -115091 -153378 -114172 -2509 32650 52878 4612 -30144
17544c0144L9505l3744l2048N2125N5716l126p1252l8055J104o7O5409K4810l5021
$$ -30144 9361 -24383 -56431 -4306 51410 48284 -22968 -61023 -59919 -59986 5423 30233 -4788
17531d788O3168K9046o2035m7789m388O4248k775o1231r551M1600m9440J9256
$$ -4788 58380 87426 25391 -22398 -26786 37462 34687 -26544 -36095 5505 -43935 -24679
17519b4679j1927m1446k1328R674O4978N2566j9952m2637k536J3237m9405L7329
$$ -24679 -36606 -78052 -99380 -89706 -24728 27838 7886 -34751 -37287 -24050 -73455 -36126
17507c6126O0641l3936k7651M5483J6508k6498l5902m1850l1148O076N9392L5449
$$ -36126 24515 -9421 -37072 8411 24919 -1579 -37481 -79331 -110479 -104403 -45011 -9562
17495i562j4573n774N6554L432n2320K2977l0382l4233L3049K6829M4549O1530
$$ -9562 -24135 -29909 26645 30077 -22243 734 -29648 -63881 -30832 -4003 40546 102076
17483A02076j07283p0223K0452l1543K4091o814j6831L4294O4543M7328m9903
$$ 102076 -5207 -75430 -54978 -86521 -62430 -69244 -86075 -51781 12762 60090 10187
17472A0187m6278m2824j12457L0138N4490k720j5722P2669L2965K9011J4198k9239
$$ 10187 -36091 -78915 -191372 -161234 -106744 -109464 -125186 -52517 -19552 9459 23657 -5582
17460e582l3499O3384N0276n4207j03615j8065Q4599P2666m1896k4555j4010L6613
$$ -5582 -39081 24303 74579 20372 -83243 -101308 -16709 55957 14061 -10494 -24504 12109
17448A2109m9507n2530R0027J18046J12836J04347J27282M5253L2233j05526k10707
$$ 12109 -37398 -89928 99 118145 230981 335328 462610 507863 540096 434570 223863
17437B23863r1649j1512K5190m3186j05437o4903n7126L2920L9016J2424m3374
$$ 223863 132214 120702 145892 102706 -2731 -67634 -124760 -91840 -52824 -40400 -83774
17426h3774Q984J4747J7315O522M2365L2961l4489p1802j4112L3311J322P414
$$ -83774 -74790 -60043 -42728 -36206 6159 39120 4631 -67171 -81283 -47972 -46650 -39236
17414c9236M5072M5625j2570q4867r7019J04226L0108k5234M2371k2398q258l6963
$$ -39236 5836 51461 38891 -45976 -142995 -38769 -8661 -33895 8476 -13922 -22180 -59143
17402e9143Q616n6685k5475m5440M3164N3841J2970O998P9296J2585o7642k5372
$$ -59143 -50527 -107212 -132687 -178127 -134963 -81122 -68152 -61154 18142 30727 -36915 -62287
17390f2287o2326K0965K5274m336k7619J4479J2345q8959m5689J04669N8906r48
$$ -62287 -124613 -103648 -78374 -82710 -110329 -95850 -83505 -172464 -218153 -113484 -54578 -55526
17378e5526J7550Q101L3640J8976o919P348M8097r231l4581o6047k7823R425L0937
$$ -55526 -37976 -29875 3765 22741 15822 23170 71267 62036 27455 -38592 -66415 -56990 -26053
17365b6053J9962J4763l0423m5336j6399J1438M9058J3431m746k0335l084p4864
$$ -26053 -6091 8672 -21751 -67087 -83486 -72048 -22990 -9559 -14305 -34640 -37724 -112588
17353a12588o0763j7167K5138R5866j3526o607M1261L4272K6655n8651m3580P1274
$$ -112588 -173351 -190518 -165380 -69514 -83040 -89647 -48386 -14114 12541 -46110 -89690 -18416
17341a8416j5932p4388r308P901K5931k048K741K8758l7337N947J5919K4668j4830
$$ -18416 -34348 -108736 -118044 -110143 -84212 -86260 -83519 -54761 -92098 -86151 -70232 -45564 -60394
17328f0394j8695j334K5926P1269k9887l5372R718l5080j290J4386L4926J1390
$$ -60394 -79089 -80423 -54497 16772 -13115 -48487 -38769 -73849 -75139 -60753 -25827 -14437
17316a4437J1832K399L0447J2354j04202O787L6567m528k7115l1112q291k2095
$$ -14437 -2605 -206 30241 42595 -61607 -54820 -18253 -22781 -49896 -81008 -89299 -111394
17304a11394k4828R3822O3613M4974J8795p6668o054K9910j2007k9928L2077k455
$$ -111394 -136222 -42400 21213 66187 84982 8314 2260 32170 20163 -9765 22312 19857
17292A9857J5653r180j9547J8507J3973L9931k4595r0239K3884J1304k0476m3354
$$ 19857 35510 26330 6783 25290 39263 79194 54599 -35640 -11756 -452 -20928 -64282
17280f4282M4500j5474k1890l6952J5305o0140J3749M0757m20J1789j4726q225
$$ -64282 -19782 -35256 -57146 -94098 -78793 -138933 -125184 -84427 -84847 -73058 -87784 -96009
17268i6009N9586j0820j5976l0337j9219k5940M9160N4329M1955n5724n4464k3318
$$ -96009 -36423 -47243 -63219 -93556 -112775 -138715 -89555 -35226 6729 -48995 -103459 -126777
17256a26777m4457q407K2484O9439R3572K9209o088l8546m331K5820N136k1501
$$ -126777 -171234 -179641 -157157 -87718 5854 35063 28975 -9571 -13902 11918 17054 -4447
17244d447r5552L9394Q9073M6948l3071k8426L177q4259o082L3925P844o534q5468
$$ -4447 -99999 -60605 28468 75416 42345 13919 17096 -67163 -73245 -39320 -31476 -38010 -123478
17231a23478k8349R627K0333L9376O2800Q266l651m6835l7410l9455l2043K5654
$$ -123478 -151827 -142200 -121867 -82491 -19691 -11425 -15076 -61911 -99321 -138776 -170819 -145165
17219a45165k305n6883N8067P2376M4775k7516m7202J1146P1956l5585j27989
$$ -145165 -147470 -204353 -146286 -73910 -29135 -56651 -103853 -92707 -20751 -56336 -184325
17208a84325K155J1791M7789O5070L4682m0199j5017K4106l8712J6201N0703m193
$$ -184325 -182170 -170379 -122590 -57520 -22838 -63037 -78054 -53948 -92660 -76459 -25756 -29949
17196b9949K6088l1771k2776J4633n9261k8411o758M2538Q623p1355O0182M0373
$$ -29949 -3861 -35632 -58408 -43775 -103036 -131447 -138205 -95667 -87044 -158399 -98217 -57844
17184e7844J5103P336m3862k3246K9085N9801L7778k2454n1148m2944l6826O363
$$ -57844 -42741 -35405 -79267 -102513 -73428 -13627 24151 1697 -49451 -92395 -129221 -122858
17172a22858L7774m9752p5239M3528N5927O850K2780k037K3672N1813l7382L401
$$ -122858 -85084 -134836 -210075 -166547 -110620 -103770 -80990 -83027 -59355 -7542 -44924 -41523
17160d1523N0132J4746n7409j09083o468K5267o311N3680L2470n9249k1993l3600
$$ -41523 8609 23355 -34054 -143137 -149605 -124338 -130649 -76969 -44499 -103748 -125741 -159341
17148a59341Q187j10K5458r232N6421o775j7496j3145J7508N6299J9232k8168
$$ -159341 -151154 -151264 -125806 -135038 -78617 -85392 -102888 -116033 -98525 -42226 -22994 -51162
17136e1162o4465J21K9361N1584K1688j3182j6731l8060j190k2004K4629O3611
$$ -51162 -115627 -115506 -86145 -34561 -12873 -26055 -42786 -80846 -82036 -104040 -79411 -15800
17124a5800J0408j9362p7980m5534M2967j1931l218l73L4614K7661m6527k2430
$$ -15800 -5392 -24754 -102734 -148268 -105301 -117232 -120450 -120823 -86209 -58548 -105075 -127505
17112a27505j3245o857K9796J3271O7664N4869P482N5342k9617l7240p4768j0891
$$ -127505 -140750 -147607 -117811 -104540 -36876 17993 25475 80817 51200 13960 -60808 -71699
17100g1699K5155L7163k1708p6630j5782l1526K0317N912K1895R873n535K8739
$$ -71699 -46544 -9381 -31089 -107719 -123501 -155027 -134710 -128798 -106903 -97030 -102565 -73826
17088g3826K3719k6096k281J7109J8480m3301l6858P7209L0818o5468k45K8718
$$ -73826 -50107 -76203 -78484 -61375 -42895 -86196 -123054 -45845 -15027 -80495 -80740 -52022
17076e2022M0936J0534m3432k5485R248K7596n5649m4465J5622J3909O5300M7110
$$ -52022 -11086 -552 -43984 -69469 -60221 -32625 -88274 -132739 -117117 -103208 -37908 9202
17064I202l7446j8831m7332k1276l3897r101J8326N7120L4479k0151J4201M3702
$$ 9202 -28244 -47075 -94407 -115683 -149580 -158681 -140355 -83235 -48756 -68907 -54706 -11004
17052a1004N022l616k6840m9395l5522j1661K059M2878J2586j4449K2865N7534
$$ -11004 -5982 -9598 -36438 -85833 -121355 -133016 -130957 -88079 -75493 -89942 -67077 -9543
17040i543K7594n359n0697J0103K5940p2917Q909m902N1135j857p3287l0477J0975
$$ -9543 18051 12692 -38005 -27902 -1962 -74879 -65970 -70872 -19737 -21594 -94881 -125358 -114383
17027a14383O5169K467n6798j4256m7284L067Q4082N2686n1102j0399m4122j1246
$$ -114383 -49214 -46747 -103545 -117801 -165085 -162018 -77936 -25250 -76352 -86751 -130873 -142119
17015a42119l116j1286M4802K9967k2274J9363K0088M353n4083Q937N700J291
$$ -142119 -145235 -156521 -111719 -81752 -104026 -84663 -64575 -60222 -114305 -105368 -99668 -98377
17003i8377L0147J1722J104O115j6018j0037l6998m0742M1631O8663R3573m0179
$$ -98377 -68230 -56508 -55404 -49289 -65307 -75344 -112342 -153084 -111453 -42790 50783 10604
16991A0604J5997O3170l9493l9780N3097M222k2939J6743L6632j5856J059m0030
$$ 10604 26601 89771 50278 10498 63595 67817 44878 61621 98253 82397 83456 43426
16979D3426l1736l3822o9900p913K3709p4157l225N5920M1678m5430J5967L2461
$$ 43426 11690 -22132 -92032 -99945 -76236 -150393 -153618 -97698 -56020 -101450 -85483 -53022
16967e3022K3680o855l6919m1073L1371j3508R897M9317n4106m5795j314J5189
$$ -53022 -29342 -36197 -73116 -114189 -82818 -96326 -86429 -37112 -91218 -137013 -138327 -123138
16955a23138M1849K5450K1618n044l7258n4057r178J7043J26L56Q944L7670K1596
$$ -123138 -81289 -55839 -34221 -39265 -76523 -130580 -139758 -122715 -122589 -122233 -113289 -75619 -54023
16942e4023m4908K9683Q5132M4720m3380k2841Q8701M4939j25817r8353r008M7455
$$ -54023 -98931 -69248 15884 60604 17224 -5617 83084 128023 2206 -96147 -105155 -57700
16930e7700m7220j7941p952J134N329m4963K0274j0984J5098O7777K7794k1123
$$ -57700 -104920 -122861 -130813 -129679 -124350 -169313 -149039 -160023 -144925 -77148 -49354 -70477
16918g0477P430Q329L9616K1740L3522k8444k2468m1304k0972j5017M2882m139
$$ -70477 -63047 -54718 -15102 6638 40160 11716 -10752 -52056 -73028 -88045 -45163 -49302
16906d9302l6076q828k1665J2655L2782J6628o6605j7656J6239p511K1892O0008
$$ -49302 -85378 -94206 -115871 -103216 -70434 -53806 -120411 -138067 -121828 -129339 -107447 -47439
16894d7439M6942J3645j4816j17075j3080M4816J0006k6216J6865L3782j0841
$$ -47439 -497 13148 -1668 -118743 -131823 -87007 -77001 -103217 -86352 -52570 -63411
16883f3411P4509M4916l5360n3476n4314n1796k6327L9735k0119K1703l5082k9746
$$ -63411 11098 56014 20654 -32822 -87136 -138932 -165259 -125524 -145643 -123940 -159022 -188768
16871a88768J2288M4102q111K0495l974q103j9203K0095M9295K6698m403o5743
$$ -188768 -176480 -132378 -140489 -119994 -123968 -132071 -151274 -131179 -81884 -55186 -59589 -125332
16859a25332j0620J7224l0343o5148n1664N3843Q5504Q112R69q9142R023N3506
$$ -125332 -135952 -118728 -149071 -214219 -265883 -212040 -126536 -118424 -117455 -206597 -197574 -144068
16847a44068P214q456Q639J6421M8389K3642M375j03332o7337Q3957L6815N6274
$$ -144068 -136854 -145310 -136671 -120250 -71861 -48219 -43844 -147176 -214513 -130556 -93741 -37467
16835c7467N9684j6123P670K0778r998j9454P5261m4889K790L0489n6424p0517
$$ -37467 22217 6094 13764 34542 24544 5090 80351 35462 38252 68741 12317 -58200
16823e8200r2096n7578R7513M5467N5607L3074o7021k6579l7365o8827N9727N7520
$$ -58200 -150296 -207874 -110361 -64894 -9287 23787 -43234 -69813 -107178 -176005 -116278 -58758
16811e8758L6823L6991p399r0192q59O914O0803l3060k3564K6669K1500P0234
$$ -58758 -21935 15056 7657 -82535 -83394 -76480 -15677 -48737 -72301 -45632 -24132 46102
16799D6102J9749m6561L3404J9098q574j1772l856n4743q8108j1183k9750l5915
$$ 46102 65851 19290 52694 71792 63218 51446 47590 -7153 -95261 -106444 -136194 -172109
16787a72109M0472j09L2468K0014L0060J8561n0952O424Q4324j6893j8253M1969
$$ -172109 -131637 -131746 -99278 -79264 -49204 -30643 -81595 -75171 9153 -7740 -25993 15976
16775A5976m3992m9570l3704k7185k8470K5100N5714k8291l8790J02163P3923
$$ 15976 -28016 -77586 -111290 -138475 -166945 -141845 -86131 -114422 -153212 -51049 22874
16764B2874M1316k7396q8515n3231N2288L6307j7445l6660J1442j8375l6205j937
$$ 22874 64190 36794 -51721 -104952 -52664 -16357 -33802 -70462 -59020 -77395 -113600 -115537
16752a15537o397l1300M5456J8739L6610j1742M5846M3762j6249o6465N508j8807
$$ -115537 -121934 -153234 -107778 -89039 -52429 -64171 -18325 25437 9188 -57277 -51769 -70576
16740g0576m6666l2653L9888M7337M7584q537n524K9112M7583q402j6345J2759
$$ -70576 -117242 -149895 -110007 -62670 -15086 -23623 -29147 -35 47548 39146 22801 35560
16728C5560q3292j05083n979K8930O2951P5060l7279k0130L939m0037p3833j1048
$$ 35560 -47732 -152815 -158794 -129864 -66913 8147 -29132 -49262 -45323 -85360 -159193 -170241
16716a70241O3441P5551L0673p1785M9846P684m5750n5293K3591J4953m1652O6861
$$ -170241 -106800 -31249 -576 -72361 -22515 -14831 -60581 -115874 -92283 -77330 -118982 -52121
16704e2121J03958M0965j6116m7949p6759m4182n7090j1877K9556O579M408L0423
$$ -52121 51837 92802 76686 28737 -48022 -92204 -149294 -161171 -131615 -125036 -120628 -90205
16692i0205L8492K0904Q3368n6838o7409j0106J2148Q016m706n626m4464N5390
$$ -90205 -51713 -30809 52559 -4279 -71688 -81794 -69646 -61630 -66336 -71962 -116426 -61036
16680f1036j1972k8973k5313K2470L4044k5533j5452j2670n8125N9617O6886J5562
$$ -61036 -73008 -101981 -127294 -104824 -70780 -96313 -111765 -124435 -182560 -122943 -56057 -40495
16668d0495l1691j09819m7521M6673M0909N6545L0183K79p730J5736j9201m4448
$$ -40495 -72186 -182005 -229526 -182853 -141944 -85399 -55216 -54937 -62667 -46931 -66132 -110580
16656a10580K6634K1810j0055M8404L4409L3315O049j4737n2792o9701j8264j7241
$$ -110580 -83946 -62136 -72191 -23787 10622 43937 49986 35249 -17543 -87244 -105508 -122749
16644a22749M5626k6546j2455k0040P2586L1487J4045k9968m8772J4862J144k3936
$$ -122749 -77123 -103669 -116124 -136164 -63578 -32091 -18046 -48014 -96786 -81924 -80780 -104716
16632a04716j2542j2604P0135Q0554l4682k557l735r211Q802J9481M0097K2807
$$ -104716 -117258 -129862 -59727 20827 -13855 -16412 -20147 -29358 -20556 -1075 39022 61829
16620F1829R739Q477n1604r4011p90O2163m5682j1143J8128k3188j9771k8671
$$ 61829 71568 80045 28441 -65570 -66360 -4197 -49879 -61022 -42894 -66082 -85853 -114524
16608a14524L6063m6500J0286N2659L8778J9040m2738K6918N5752N1325n3283
$$ -114524 -78461 -124961 -114675 -62016 -23238 -4198 -46936 -20018 35734 87059 33776
16597C3776j11215l7110m974N0162Q0865Q5314j5941o8508p485J4180q5923o0370
$$ 33776 -77439 -114549 -119523 -69361 11504 96818 80877 12369 4884 19064 -66859 -127229
16585a27229k8714j2410j2883m9633O5169O0931O1557Q801k858M5001j272o720
$$ -127229 -155943 -168353 -181236 -230869 -165700 -104769 -43212 -34411 -37269 7732 6460 -260
16573b60k0576m1070j5032K5711j856j6306j331k0300L5743l1481l3444O0316
$$ -260 -20836 -61906 -76938 -51227 -53083 -69389 -70720 -91020 -55277 -86758 -120202 -59886
16561e9886O3484K4234J6273K8p437l6849r8833o0890P702p147K8360R332O6500
$$ -59886 3598 27832 44105 44133 36696 -153 -98986 -159876 -152174 -159321 -130961 -121629 -55129
16548e5129J1407k0931l3475j2402N6774J5017L4900m0274m2654l0377o8604J1035
$$ -55129 -43722 -64653 -98128 -110530 -53756 -38739 -3839 -44113 -86767 -117144 -185748 -174713
16536a74713P6272q922N4624K2335j0959J7241L9812L9498m3732m0770L923j7366
$$ -174713 -98441 -107363 -52739 -30404 -41363 -24122 15690 55188 11456 -29314 -25391 -42757
16524d2757O6931N2790J7467p7129j00403o4961k5371K357L9464N9779N475P4794
$$ -42757 24174 76964 94431 17302 -83101 -148062 -173433 -171076 -131612 -71833 -66358 8436
16512H436R392M885l2474K910J5284j2355m1771L0951l7452j8355l2402r594q644
$$ 8436 17828 22713 -9761 -6851 8433 -3922 -45693 -14742 -52194 -70549 -102951 -112545 -121189
16499a21189N6682M2792j9773o2475K0354N7079M4859j0831l1249p3306o3844
$$ -121189 -64507 -21715 -41488 -103963 -83609 -26530 18329 7498 -23751 -97057 -160901
16488a60901L1920o5591m2175l952J7348O1108N7166Q407j3013N238K0416l6930
$$ -160901 -128981 -194572 -236747 -240699 -223351 -162243 -105077 -96670 -109683 -104445 -84029 -120959
16476a20959m5320o381N9915m363K362M5325J31802M5669m2784l1560l8371m98
$$ -120959 -166279 -172660 -112745 -117108 -114746 -69421 62381 108050 65266 33706 -4665 -5163
16464e163k4202q5916l8011L5995N7828m22J4302o3858l4413J25067O4964j00427
$$ -5163 -29365 -115281 -153292 -117297 -59469 -59891 -45589 -109447 -143860 -18793 46171 -54256
16452e4256j3808N4374p947m8065j6914j7666J3393J7205l2079k5506K9135L1830
$$ -54256 -68064 -13690 -21637 -69702 -86616 -104282 -90889 -73684 -105763 -131269 -102134 -70304
16440g0304O9013k7685q000J7789p2006K2541l4880L1755N4234K2592L6379P762
$$ -70304 -1291 -28976 -36976 -19187 -91193 -68652 -103532 -71777 -17543 5049 41428 49190
16428D9190m5857q1290k8661j023k2585K0767K6331M572j065L0249l117k4527
$$ 49190 3333 -77957 -106618 -107641 -130226 -109459 -83128 -78556 -79621 -49372 -52489 -77016
16416g7016k8637m7298k2206k882O9744P1639O0555k2462l4455r5309J4632r791
$$ -77016 -105653 -152951 -175157 -178039 -108295 -36656 23899 1437 -33018 -128327 -113695 -123486
16404a23486j2704L5760L6107j1260P047Q709K4682K4999M702k4569l2864K6495
$$ -123486 -136190 -100430 -64323 -75583 -68536 -59827 -35145 -10146 -5444 -30013 -62877 -36382
16392c6382j162l8213L1921O2575J4821k4253J1927o1771p0584R9774M4339l6783
$$ -36382 -37544 -75757 -43836 18739 33560 9307 21234 -40537 -111121 -11347 32992 -3791
16380c791k8202j0221j3985l1550Q468R289N3294K9905O0859l2902K6832j7916
$$ -3791 -31993 -42214 -56199 -87749 -79281 -69992 -16698 13207 74066 41164 67996 50080
16368E0080n2217j6521J9654Q0071l6124n8495M236K6342l1449m5989q233N9610
$$ 50080 -2137 -18658 996 81067 44943 -13552 -9316 17026 -14423 -60412 -68645 -9035
16356i035O1190p1056k8315m7998N176l2711K3841M6773n044m3897l2832k6474
$$ -9035 52155 -18901 -47216 -95214 -90038 -122749 -98908 -52135 -57179 -101076 -133908 -160382
16344a60382M4978M9719N6464n6360l4454n5035M8620K5332K0283O4896l9359
$$ -160382 -115404 -65685 -9221 -65581 -100035 -155070 -106450 -81118 -60835 4061 -35298
16333c5298P546j0668M8069J676k7808p0138j4004j1057J1750m4560L3900R9487
$$ -35298 -27752 -38420 9649 11325 -16483 -86621 -100625 -111682 -99932 -144492 -110592 -11105
16321a1105P0418n2525p5340L2721o513l741K5870P040J9330l6579m6966K6813
$$ -11105 59313 6788 -68552 -35831 -42344 -46085 -20215 -13175 6155 -30424 -77390 -50577
16309e0577K5516O2466j6746j9952J4254k7266J4732j3224k1635j0497n698K3620
$$ -50577 -25061 37405 20659 707 14961 -12305 2427 -10797 -32432 -42929 -48627 -25007
16297b5007J72o70k56M0888k4413j0054K5445L7383K4439N426m8003n0311m4993
$$ -25007 -24835 -25505 -25761 15127 -9286 -19340 6105 43488 67927 73353 25350 -24961 -69954
16284f9954j2378j7558K5110l1728l1867j2884m393K654R130q706P037M5526N8104
$$ -69954 -82332 -99890 -74780 -106508 -138375 -151259 -155652 -152998 -143868 -152574 -145537 -100011 -41907
16271d1907K1133P93m9352L2693K9886M5233R3604n4369j11029J5550r584L2645
$$ -41907 -20774 -19981 -69333 -36640 -6754 38479 132083 77714 -33315 -17765 -27349 5296
16259E296o978N735L9122Q084j4878m2348l0627L2050m4967J53k7012k3806l3494
$$ 5296 -1682 4053 43175 51259 36381 -5967 -36594 -4544 -49511 -49358 -76370 -100176 -133670
16246a33670o1172K4314J275L5125J08705P455M2556P5016m904r5694p8124j1434
$$ -133670 -194842 -170528 -169253 -134128 -25423 -17968 24588 99604 94700 -994 -79118 -90552
16234i0552l7259K8923K6499P4888J4198m0561J5931l6153p7802j09k3556M4977
$$ -90552 -127811 -98888 -72389 2499 16697 -23864 -7933 -44086 -121888 -121997 -145553 -100576
16222a00576j0070M0037J8498J998O5672J0902k4952L5704l5025q0689J8101L7672
$$ -100576 -110646 -70609 -52111 -50113 15559 26461 1509 37213 2188 -78501 -60400 -22728
16210b2728J4763K700l7791k8298K1400P94n778J481o4229l3448N1095Q2595M0301
$$ -22728 -7965 -5265 -43056 -71354 -49954 -49160 -54938 -53457 -117686 -151134 -100039 -17444 22857
16197B2857J5531p2191m5909l0767j6682M2798O0239O0873K5943j17049j7950
$$ 22857 38388 -33803 -79712 -110479 -127161 -84363 -24124 36749 62692 -54357 -72307
16186g2307N4969k5001k7430K1631k0161P651N36j2233J421N915L3230M5276n1787
$$ -72307 -17338 -42339 -69769 -48138 -68299 -60648 -60112 -72345 -70924 -65009 -31779 13497 -38290
16173c8290o5970l2963K8109N0619O9014J6807K3381l982o3307m1392J7728j2623
$$ -38290 -104260 -137223 -109114 -58495 10519 27326 50707 46725 -16582 -57974 -40246 -52869
16161e2869o735K0389m2144j6700K4501J07153m8184p5383L0189m5007p817L24
$$ -52869 -59604 -39215 -81359 -98059 -73558 33595 -14589 -89972 -59783 -104790 -112607 -112283
16149a12283L420l1755k1973j0927L7933R029J4308j0919N7042R331J5919m0242
$$ -112283 -108863 -140618 -162591 -173518 -135585 -126556 -112248 -123167 -66125 -56794 -40875 -81117
16137h1117K6492K568m684J815K705j9889L2930n560m2516P1812j0297k4811K305
$$ -81117 -54625 -52057 -56741 -54926 -52221 -72110 -39180 -44740 -87256 -15444 -25741 -50552 -48247
16124d8247L8514k9762l7732k1950L461r005O2708j8027J6093L4761l9734K3913
$$ -48247 -9733 -39495 -77227 -99177 -95716 -104721 -42013 -60040 -43947 -9186 -48920 -25007
16112b5007n733K144k329j7908j5880l798P1332N538p7876p362k5456l9967j1606
$$ -25007 -30740 -28596 -30925 -48833 -64713 -68511 2821 8359 -69517 -76879 -102335 -142302 -153908
16099a53908K7144J4381N1757O2947k6408L5058O4149J3675q5108n9241J0286
$$ -153908 -126764 -112383 -60626 2321 -24087 10971 75120 88795 3687 -55554 -45268
16088d5268M153m293k5830o324k8605L4804L9051p017J2459L6839N2324n1020
$$ -45268 -41115 -45408 -71238 -77562 -106167 -71363 -32312 -39329 -26870 9969 62293 11273
16076A1273k7609l600m9857L0196K8638m5915m0714K8735K0464n188K2j4668m3023
$$ 11273 -16336 -19936 -69793 -39597 -10959 -56874 -97588 -68853 -48389 -53577 -53555 -68223 -111246
16063a11246Q1650L1938k2639j8309M7031R25l8431k2815j2842j0824r432L7404
$$ -111246 -29596 2342 -20297 -38606 8425 9350 -29081 -51896 -64738 -75562 -84994 -47590
16051d7590q04q326M6086j7123q1241R53J3235M0819L9513j2452j3443n3562m4903
$$ -47590 -48394 -56720 -10634 -27757 -108998 -108045 -94810 -53991 -14478 -26930 -40373 -93935 -138838
16038a38838k3681o888K5311J853J8472L7172j3752l8076J3281l5696l8489Q5524
$$ -138838 -162519 -169407 -144096 -142243 -123771 -86599 -100351 -138427 -125146 -160842 -199331 -113807
16026a13807K7401o383k2535J04304M838k5062k5135j1674k3894J0868J5550K1756
$$ -113807 -86406 -92789 -115324 -11020 -6182 -31244 -56379 -68053 -91947 -81079 -65529 -43773
16014d3773j348K0082j0418O1959m839o6147J9436j1674n6246l0685J6584J6537
$$ -43773 -45121 -25039 -35457 26502 21663 -44484 -25048 -36722 -92968 -123653 -107069 -90532
16002i0532N7651K4101M882J629K3348j735j9868k2756J9746l485j6846k1782
$$ -90532 -32881 -8780 -3898 -2269 21079 19344 -524 -23280 -3534 -7019 -23865 -45647
15990d5647L0168p27p3567k5430Q3028K005K8184k0564r953o1970j7565J5741
$$ -45647 -15479 -16206 -89773 -115203 -32175 -30170 -1986 -22550 -32503 -94473 -112038 -96297
15978i6297J6167R570j7260M3999L0160j3433M804K224j8151J7460J3649R40N1543
$$ -96297 -80130 -70560 -87820 -43821 -13661 -27094 -22290 -20066 -38217 -20757 -7108 -6168 45375
15965D5375p523m848R051N1735K0195q6709o8812R063N0788j040J8122J3501p092
$$ 45375 37852 33004 42055 93790 113985 27276 -41536 -32473 18315 17275 35397 48898 41806
15952D1806j2810K6042j11923m4096k19M1033N0n5211L5511K8670l5303R5255
$$ 41806 28996 55038 -56885 -100981 -101200 -60167 -60117 -115328 -79817 -51147 -86450 8805
15940H805L0549n7116p1135O1242M8507r231k474k3494J9430l1649m4791j0393
$$ 8805 39354 -17762 -88897 -27655 20852 11621 9147 -14347 5083 -26566 -71357 -81750
15928h1750N1708O3642l4923J1472Q6287J0879K9517K9060o9360k6011j5956k7238
$$ -81750 -30042 33600 -1323 10149 96436 107315 136832 165892 96532 70521 54565 27327
15916B7327L8049L1969o7728M055p616p975O0529M6246l8891m0513m6417N4232
$$ 27327 65376 97345 29617 33672 26056 18081 78610 124856 85965 45452 -965 53267
15904E3267N0287k3404k2164L1061j8942p7602k8848L1647J165Q9893M8185j831
$$ 53267 103554 80150 57986 89047 70105 -7497 -36345 -4698 -3533 86360 134545 132714
15892A32714n3317j3684k4510j4465m4102l5876J0913O7637M8391m1652n229R612
$$ 132714 79397 65713 41203 26738 -17364 -53240 -42327 25310 73701 32049 26820 36432
15880C6432J0486k153J8167l9593n3955p1216J0896J5397R2500l468J7296j3582
$$ 36432 46918 44765 62932 23339 -30616 -101832 -90936 -75539 16961 13493 30789 17207
15868A7207q776l8591p8111j1258P2535M8593p084L1131J8835l2115j7458l772
$$ 17207 8431 -30160 -108271 -119529 -46994 1599 -5485 25646 44481 12366 -5092 -8864
15856h864K1587O914n539L4004N6388M6658m547k0309n2089j1259j3233l7183
$$ -8864 12723 19637 14098 48102 104490 151148 146601 126292 74203 62944 49711 12528
15844A2528M4812N2136k4899j9968J9267J4067L3486l267p3413n3159N6948K6253
$$ 12528 57340 109476 84577 64609 83876 97943 131429 128162 54749 1590 58538 84791
15832H4791j498N873k9728K7482L8655j6420l1007J434l648n0081k975j4198m0255
$$ 84791 83293 89166 59438 86920 125575 109155 78148 79582 75934 25853 22878 8680 -31575
15819c1575L3561P9768n8231m3003L2577N7894K3996J8624K0882o2492M2887O160
$$ -31575 1986 81754 23523 -19480 13097 70991 94987 113611 134493 72001 114888 121048
15807A21048l3536p5443n5222l2320o156O6362R6914j2480n6727o480O4799M7747
$$ 121048 87512 12069 -43153 -75473 -81629 -15267 81647 69167 12440 5960 70759 118506
15795A18506P654j1248l0839m3503L8988K2031J2191j3982M384P716r718k3410
$$ 118506 126160 114912 84073 40570 79558 101589 113780 99798 104182 111898 102180 78770
15783G8770j6666J9624n018j4499L5001J5756p902N7628n1281n3906J8615R4376
$$ 78770 62104 81728 76710 62211 97212 112968 105066 162694 111413 57507 76122 170498
15771A70498j6969j4639O5425M5834j3973m9265o4743n4064j841O1449J0425O00
$$ 170498 153529 138890 204315 250149 236176 186911 122168 68104 66263 127712 138137 138737
15759A38737k0245K7571j6230K610M7852M6349J839m735p1559p1237m8094N172
$$ 138737 118492 146063 129833 132443 180295 226644 228483 223748 152189 80952 32858 38030
15747C8030R3593O1253k5237n1656J4648j8664n0293P973J6265k537K8790r316
$$ 38030 131623 192876 167639 115983 130631 111967 61674 69647 85912 83375 112165 102849
15735A02849n7778q084N2093M296p1954p3613Q4696J8770J3423l472k2838K301
$$ 102849 45071 36987 89080 93376 21422 -52191 32505 51275 64698 61226 38388 40689
15723D0689R851n6618j6502K8047j6063o84K8374q760m0667J5175N5848l9667
$$ 40689 50540 -6078 -22580 5467 -10596 -11280 17094 8334 -32333 -17158 38690 -977
15711i77m5382Q253K6427k2869M1374l06J9279J0188k3608N6758n7468j5960P2658
$$ -977 -46359 -38106 -11679 -34548 6826 6520 25799 35987 12379 69137 11669 -4291 68367
15698F8367L1697j7011m0704R926j9643k7478n904j6191J7571j5223k0770P1501
$$ 68367 100064 83053 42349 52275 32632 5154 -750 -16941 630 -14593 -35363 36138
15686C6138L9702l3493Q063l880j1118q708r2704L3365K5722l0003N066m1228
$$ 36138 75840 42347 50410 46530 35412 26704 -66000 -32635 -6913 -36916 -31850 -73078
15674g3078J6993M0524L9170o679k0982J7967K1125r1887K1650K8838n858l8841
$$ -73078 -56085 -15561 23609 16930 -4052 13915 35040 -56847 -35197 -6359 -12217 -51058
15662e1058L1858P4682p3341l1839l1666J0216K144O6400p882k2323M9996J8628
$$ -51058 -19200 55482 -17859 -49698 -81364 -71148 -69004 -2604 -10486 -32809 17187 35815
15650C5815M731m6059m6776k671K4935K0963R63m1464l0104R7067L9274k7817
$$ 35815 40546 -5513 -52289 -54960 -30025 -9062 -8099 -49563 -79667 17400 56674 28857
15638B8857L0790M6750n4672p0637m373L6651K6812O066j4848j9584K4901p0181
$$ 28857 59647 106397 51725 -18912 -23285 13366 40178 46244 31396 11812 36713 -33468
15626c3468n1930N4188M3049o234K6077Q0208K7178j18113n9982l0552N4429N982
$$ -33468 -85398 -31210 11839 5605 31682 111890 139068 20955 -39027 -69579 -15150 -9168
15614i168J9951O2830J093m2674o810n118o846p736p8359q1758Q4393Q9381M4464
$$ -9168 10783 73613 74706 32032 25222 20104 13258 5522 -72837 -154595 -70202 19179 63643
15601F3643O59j2235j25251P539Q4382L1251m9240q0508N6050K3253K7169O3489
$$ 63643 64302 52067 -73184 -65645 18737 49988 748 -79760 -23710 -457 26712 90201
15589I0201j4000m6544k2803j3947r703l9443k6308O827K8741L4686l2169m2124
$$ 90201 76201 29657 6854 -7093 -16796 -56239 -82547 -75720 -46979 -12293 -44462 -86586
15577h6586k1368M126r091M7352Q8636q037K0548P38j8010J8058K4683n802J2630
$$ -86586 -107954 -103828 -112919 -65567 23069 15032 35580 36318 18308 36366 61049 55247 67877
15564F7877J0011p2192l2870P3869K1700l0974J2421q887m063k7188L0009K0273
$$ 67877 77888 5696 -27174 46695 68395 37421 49842 40955 36892 9704 39713 59986
15552E9986K2942J6165J8876k0235j18423K5398N9731N675n1326m8325p863O9501
$$ 59986 82928 99093 117969 97734 -20689 4709 64440 70115 18789 -29536 -37399 32102
15540C2102r513K8899k086q377K997l3519j7262j5113J452J4768k8913K4712J267
$$ 32102 22589 51488 49402 41025 44022 10503 -6759 -21872 -20420 -5652 -34565 -9853 -8586
15527h586M2679J9659l6755k5558r632j7692p880L4369K2826J0949J5959o838
$$ -8586 34093 53752 16997 -8561 -18193 -35885 -43765 -9396 13430 24379 40338 33500
15515C3500J6101n3151n7353J6902O0261l1932p4192J9446P6795R5306J2583l0678
$$ 33500 49601 -3550 -60903 -44001 16260 -15672 -89864 -70418 6377 101683 114266 83588
15503H3588l4440o5147L0969q973m2267L7882Q202p122L187j6389k6441r849P464
$$ 83588 49148 -15999 14970 5997 -36270 1612 9814 2692 5879 -10510 -36951 -46800 -39336
15490c9336P3392M1846r53k6152j8479Q181J8943m7530J0483j100L8214j6158
$$ -39336 34056 75902 74949 48797 30318 38499 57442 9912 20395 19295 57509 41351
15478D1351Q262M1552l5253Q688J8947M0097M0249m197K8968j1685k9634r9412
$$ 41351 49613 91165 55912 64600 83547 123644 163893 159696 188664 176979 147345 47933
15466D7933m1333J1477J8348K5959K0949L5567K7372j1849n8160n1939j5781Q7718
$$ 47933 6600 18077 36425 62384 83333 118900 146272 134423 76263 24324 8543 96261
15454I6261Q340o9315O0210J268J5443j3326J4415L6673o909j2897j7294n9498
$$ 96261 104601 35286 95496 96764 112207 98881 113296 149969 143060 130163 112869 53371
15442E3371O6067P4171j0463q3727q0683n1098N4419R4261K3965r734K2735k5409
$$ 53371 119438 193609 183146 99419 18736 -32362 22057 116318 140283 130549 153284 127875
15430A27875n3408o1984k2830O0844N3245k4287J3961K5984j5255j9644M2764
$$ 127875 74467 12483 -10347 50497 103742 79455 93416 119400 104145 84501 127265
15419A27265l4821o7240k1404J552J1952j5077L5210J6185J8031L3405n4565l7095
$$ 127265 92444 25204 3800 5352 17304 2227 37437 53622 71653 105058 50493 13398
15407A3398j5106J485J1679J4962k7089M133K080P0856l8465m4193N3310M0966
$$ 13398 -1708 -223 11456 26418 -671 3462 5542 76398 37933 -6260 47050 88016
15395H8016k1205o1619o4932K2896M7531M6015N7966K41o2769o0426L3598m1692
$$ 88016 66811 5192 -59740 -36844 10687 56702 114668 114909 52140 -8286 25312 -16380
15383a6380K8059M5613K5079L4985j227n941k3283P955K4224n5513j0386M6570
$$ -16380 11679 57292 82371 117356 116129 110188 86905 94860 119084 63571 53185 99755
15371I9755J10112p7547o5296M1505L0731L6764j7280L1407m71m9511l3278O69
$$ 99755 209867 132320 67024 108529 139260 176024 158744 190151 189680 140169 106891 107560
15359A07560J905L91o8408m8605P142K8753m7192P3059J01335J5291o5492p566
$$ 107560 109465 109856 41448 -7157 -15 28738 -18454 54605 155940 171231 105739 98173
15347I8173N7912M4227m1033j12594l1066j9618K0058J11788K2794k3492j17059
$$ 98173 156085 200312 159279 46685 15619 -3999 16059 127847 150641 127149 10090
15336A0090k232M463P9424K7633j5804r160M914O4022M8643l5860q3550p823M5068
$$ 10090 7858 12321 91745 119378 103574 94414 99328 163350 211993 176133 92583 84760 129828
15323A29828J07983r801L7081j8359J971k4986l7948o2951j1498k3473M877M3733
$$ 129828 237811 228010 265091 246732 248703 223717 185769 122818 111320 87847 92724 136457
15311A36457R7527K4105k0795m2843n3671L8921J0106o9761m3090L0924L1573
$$ 136457 233984 258089 237294 194451 140780 179701 189807 120046 76956 107880 139453
15300A39453j2423n890P0343M8212N2552p4500p0209J1147J5247L3531j1357l3736
$$ 139453 127030 121140 191483 239695 292247 217747 147538 158685 173932 207463 196106 162370
15288A62370j9420L4380J0029l3478m6342l2442M1313p469Q5572K6763P597J2449
$$ 162370 142950 177330 187359 153881 107539 75097 116410 108941 194513 221276 228873 241322
15276B41322n1164m1157o342j1783r9308q120J20681P9271l6035o3227k2692k7009
$$ 241322 190158 149001 142659 130876 31568 23448 144129 223400 187365 124138 101446 74437
15264G4437q676R0715J3479J195J5331J335k266j9491O6153J3946n8883j15618
$$ 74437 65761 156476 169955 171150 186481 187816 185550 166059 232212 246158 187275 71657
15252G1657j0365O3446R3912J2972m0024k418J0335P7976k2607j7135n4650J6792
$$ 71657 61292 124738 218650 231622 191598 189180 199515 277491 254884 237749 183099 199891
15240A99891l9451n7525K0428M9664M80j3619P260J2599r952l8904L4205j9459
$$ 199891 160440 102915 123343 173007 173487 159868 167128 179727 169775 130871 165076 145617
15228A45617m4635L1936J8340J0836J28100m786m1832l0497l72j9942J9632o0150
$$ 145617 100982 132918 151258 162094 290194 285408 243576 213079 212707 192765 212397 152247
15216A52247M089M3468k6300K494J1513l0542M1841m274Q019K123L2631J15J3144
$$ 152247 156336 199804 173504 175998 187511 156969 198810 194536 202555 204678 237309 237424 250568
15203B50568j9549P7109k1848j0384K7415M1562l7231L595l7645n4988O513J4079
$$ 250568 231019 308128 286280 275896 303311 344873 307642 311237 273592 218604 225117 239196
15191B39196J1755M33K5143M6447K4869l6609m1825o5353j0814L6764l1206j3584
$$ 239196 250951 251384 276527 322974 347843 311234 269409 204056 193242 230006 198800 185216
15179A85216o935J1971P003j5091o6529J9977N3111r393o420j5946k9791Q5961
$$ 185216 178281 190252 197255 182164 115635 135612 188723 179330 172910 156964 127173 213134
15167B13134Q1477M9140n3945K0775K553J7587j9871k3884o2624J8935K1621j8908
$$ 213134 294611 343751 289806 310581 313134 330721 310850 286966 224342 243277 264898 245990
15155B45990N3419N6959r594m9262L4341M5223n089l5425o4586j27516n5561K6681
$$ 245990 299409 356368 346774 297512 331853 377076 371987 336562 271976 144460 88899 115580
15143A15580P7707K9101M5392J8237j0152r701p255J8865k5126q2571O4419K7400
$$ 115580 193287 222388 267780 286017 275865 266164 258909 277774 252648 170077 234496 261896
15131B61896j8476J3504Q7458m7202j1672j1771N397L6286o3692M4137q5K259
$$ 261896 243420 256924 344382 297180 285508 273737 279134 315420 251728 295865 295780 298039
15119B98039R9949N1687n6985p3995o7918j7642J7624k2410j2500P3164R9924
$$ 298039 397988 449675 392690 318695 250777 233135 250759 228349 215849 289013 388937
15108C88937k1478l2924k8764M1250K1381j8351n95L2986k9791p6857m9490J0223
$$ 388937 367459 334535 305771 347021 368402 350051 349456 382442 352651 275794 226304 236527
15096B36527K8225L3907M3574K7824l3173l1666k6048q919J8018K1243l5638J7396
$$ 236527 264752 298659 342233 370057 336884 305218 279170 270251 288269 309512 273874 291270
15084B91270L7138l4892O1216m3583j0066Q0972J29159J8694l6369l3242m2382
$$ 291270 328408 293516 354732 311149 301083 382055 511214 529908 493539 460297 417915
15073D17915N6891K6540j494k5312P229l2215r121O185l4273K0435L1070P352
$$ 417915 474806 501346 499852 474540 481769 449554 440433 446618 412345 432780 463850 471202
15061D71202k7908k3476L8179j7849j7039K2751N2550j6160m9291n7172P2440
$$ 471202 443294 419818 457997 440148 423109 445860 498410 482250 432959 375787 448227
15050D48227M2287m5314l0221L4035o08L870l168n755J8375J9031M202L9751Q358
$$ 448227 490514 445200 414979 449014 448406 452276 449108 443353 461728 480759 484961 524712 533070
15037E33070k0583L7520q3149l696K1613K9607j2983j1835j6882N2563J4711P6107
$$ 533070 512487 550007 466858 463162 484775 514382 501399 489564 472682 525245 539956 616063
15025F16063Q1898K6555l4571k1498p196O7653J9131N419J6337L3861K1553k9362
$$ 616063 697961 724516 689945 668447 661251 728904 748035 753454 769791 803652 825205 795843
15013G95843j9482O811M2537L7505n881L4574P1410P5914k4735J8920J58929J61012
$$ 795843 776361 783172 825709 863214 857333 891907 963317 1039231 1014496 1033416 1192345 1353357
15001A353357J25560J66156K57185L50269O59364J033951J380396J674517J464398
$$ 1353357 1478917 1645073 1902258 2252527 2911891 3945842 5326238 7000755 8465153
14992H465153N73121j96689r15411j670776j602286j293763q49808n08297l81723
$$ 8465153 9038274 8841585 7926174 6255398 4653112 3359349 2509541 2001244 1619521
14983A619521k27968j31255r0900o6687m7318k5591l8382n3040l0563k1319k5310
$$ 1619521 1391553 1260298 1169398 1102711 1055393 1029802 991420 938380 907817 886498 861188
14972H61188J4310l5770j7077M9421Q661l4378p569N226k4005o9979o2581L5876
$$ 861188 875498 839728 822651 872072 880733 846355 838786 844012 820007 750028 687447 723323
14960G23323K1710N5485L1753J222K5328j9752n1419K6700O3103N9742M6988L6042
$$ 723323 745033 800518 832271 833493 858821 839069 787650 814350 877453 937195 984183 1020225
14948A020225L0510k0817l1589n8965L9166k461J3592J9772M2430q126M4685j6033
$$ 1020225 1050735 1029918 998329 939364 978530 976069 989661 1009433 1051863 1043737 1088422 1072389
14936A072389m1708L1903O1707N3487j5052j03003j1713o626l3091Q0610J06276
$$ 1072389 1030681 1062584 1124291 1177778 1162726 1059723 1048010 1041384 1008293 1088903 1195179
14925A195179j132R699J6331j0357n1767K4997R5549k2773J6244n9017N7598M4085
$$ 1195179 1194047 1203746 1220077 1209720 1157953 1182950 1278499 1255726 1271970 1212953 1270551 1314636
14913A314636J1620j6423K0478L0697J2273K3703j8355k1550L3398J1358k054
$$ 1314636 1326256 1309833 1330311 1361008 1373281 1396984 1378629 1357079 1390477 1401835 1399781
14902A399781J7082m4539q0127N5974O8431n1309L6225O1263J14586P2482p335
$$ 1399781 1416863 1372324 1292197 1348171 1416602 1365293 1401518 1462781 1577367 1649849 1642514
14891A642514j8607l5673L6005J6013r976j0635P4084P5464J0301j3756M6170
$$ 1642514 1623907 1588234 1624239 1640252 1630276 1619641 1693725 1769189 1779490 1765734 1811904
14880A811904M8814k1437j2983r761J5619J6956J7662P1450M7072Q616M4151l3704
$$ 1811904 1860718 1839281 1826298 1816537 1832156 1849112 1866774 1938224 1985296 1993912 2038063 2004359
14868B004359Q3311M5294m9023Q757O7208M4546N4880N9761N0793J4632K4717
$$ 2004359 2087670 2132964 2083941 2092698 2159906 2204452 2259332 2319093 2369886 2384518 2409235
14857B409235K743j7829L5837M6630n8499O2287Q9585m0826p154K1797P3296J27519
$$ 2409235 2411978 2394149 2429986 2476616 2418117 2480404 2569989 2529163 2522009 2543806 2617102 2744621
14845B744621O0853Q615k4455L2468J0563L9033O4179J20628J63849P3098j4376
$$ 2744621 2805474 2814089 2789634 2822102 2832665 2871698 2935877 3056505 3220354 3293452 3279076
14834C279076N7270R2198J2634q119m5536j1087P6848J2162K8808M817R0485Q2415
$$ 3279076 3336346 3428544 3441178 3433059 3387523 3376436 3453284 3465446 3494254 3499071 3589556 3671971
14822C671971O0943J00847N8862O1205L0650L9633P0766M5195J22396Q180K1445
$$ 3671971 3732914 3833761 3892623 3953828 3984478 4024111 4094877 4140072 4262468 4270648 4292093
14811D292093N4430R8374J18081Q5101L4422O8773Q5272J16476J28759K0880j3866
$$ 4292093 4346523 4444897 4562978 4648079 4682501 4751274 4836546 4953022 5081781 5102661 5088795
14800E088795L0240R0898J34166P9749P7785J07247Q3808J27745R6920M4412P1360
$$ 5088795 5119035 5209933 5344099 5423848 5501633 5608880 5692688 5820433 5917353 5961765 6033125
14789F033125J17887P0258J02799P4047R0355J26987O4979L7329M5320Q9930P7496
$$ 6033125 6151012 6221270 6324069 6398116 6488471 6615458 6680437 6717766 6763086 6853016 6930512
14778F930512Q8979N5598R8530R3909J13823J59566P6804N5654J22348J09305
$$ 6930512 7019491 7075089 7173619 7267528 7381351 7540917 7617721 7673375 7795723 7905028
14768G905028J03428L3765P3920Q8698R1706L5800M1655O9354J3668L8017N3724
$$ 7905028 8008456 8042221 8116141 8204839 8296545 8332345 8374000 8443354 8457022 8495039 8548763
14757H548763J52414J58076M8177j6849K1680M9501J11783P4781K9201O6613k1706
$$ 8548763 8701177 8859253 8907430 8890581 8912261 8961762 9073545 9148326 9177527 9244140 9222434
14746I222434Q51l6541l513L6202M9930L4476J9863r307L7448N813m2711n4456
$$ 9222434 9223285 9186744 9183231 9219433 9269363 9303839 9323702 9314395 9351843 9357656 9314945 9260489
14734I260489m8740j7118J4462n2983q9276l1471p5940m7961p9446M0076N446
$$ 9260489 9211749 9194631 9209093 9156110 9066834 9035363 8959423 8911462 8832016 8872092 8877538
14723H877538k3080q9746L1295Q17o3399j23948p6642m4517o6224p5485j64143
$$ 8877538 8854458 8764712 8796007 8796824 8733425 8609477 8532835 8488318 8422094 8346609 8182466
14712H182466j19313j22211p5925j25921o8373l5591n7851j13506r5618j06667
$$ 8182466 8063153 7940942 7865017 7739096 7670723 7635132 7577281 7463775 7368157 7261490
14702G261490l6812n9250m5994k6417r2005o8591j05277j72482j22968k8676m6349
$$ 7261490 7224678 7165428 7119434 7093017 7001012 6932421 6827144 6654662 6531694 6503018 6456669
14691F456669n184r7543j11731n2630l3252p2746p9158p3186q1189j18271j07130
$$ 6456669 6451485 6353942 6242211 6189581 6156329 6083583 6004425 5931239 5850050 5731779 5624649
14680E624649J896q9713j22641q9371M904j5681j22316j21513j03900j30650j6000
$$ 5624649 5626545 5536832 5414191 5324820 5329724 5314043 5191727 5070214 4966314 4835664 4819664
14669D819664R252j0105o6155q1612o2795q3365r6893p1751p8518p1863k9628
$$ 4819664 4828916 4818811 4752656 4671044 4608249 4524884 4427991 4356240 4277722 4205859 4176231
14658D176231J0539L863L0321o2536r9874o7301q2312o1879q7548J1505k841m4852
$$ 4176231 4186770 4190633 4220954 4158418 4058544 3991243 3908931 3847052 3759504 3771009 3768168 3723316
14646C723316n5544q1473l6925q583R639o2822o5818j9602l6209J8243p399j6005
$$ 3723316 3667772 3586299 3549374 3540791 3550430 3487608 3421790 3402188 3365979 3384222 3376823 3360818
14634C360818l2065o5666p1879n7948k6310o9430n3445M274K7646j8159o9851
$$ 3360818 3328753 3263087 3191208 3133260 3106950 3037520 2984075 2988349 3015995 2997836 2927985
14623B927985m2082M96j1497q090n5516k7921l3196m6765l7841J6907k5130l7147
$$ 2927985 2885903 2886399 2874902 2866812 2811296 2783375 2750179 2703414 2665573 2682480 2657350 2620203
14611B620203m0689k9308r2920N4789k9372n8570L9355j770j7435k5245n5616
$$ 2620203 2579514 2550206 2457286 2512075 2482703 2424133 2463488 2461718 2444283 2419038 2363422
14600B363422m716k7568j0579l912k5340j5122l7400j1994l5520o2862r743P3305
$$ 2363422 2358706 2331138 2320559 2316647 2291307 2276185 2238785 2226791 2191271 2128409 2118666 2191971
14588B191971N8801n668l6273p1562q1008L534K5530J2354j0245k5703k5153k2375
$$ 2191971 2250772 2245104 2208831 2137269 2056261 2059795 2085325 2097679 2087434 2061731 2036578 2014203
14576B014203l8165l5274L4380O4949N5409k1456n8363o6518m5266K1592l0372
$$ 2014203 1976038 1940764 1975144 2040093 2095502 2074046 2015683 1949165 1903899 1925491 1895119
14565A895119O1783K8299n0775N9078j1701j22627n297j7676q5382J7696k761
$$ 1895119 1956902 1985201 1934426 1993504 1981803 1859176 1853879 1836203 1750821 1768517 1765756
14554A765756m9707j5965J3486K1079k2331k8407J3749J2247N706P0532J258n2182
$$ 1765756 1716049 1700084 1713570 1734649 1712318 1683911 1697660 1709907 1715613 1786145 1787403 1735221
14542A735221r800m5111l5020k2307r884k0690j7796M1235k1079P875Q2838L8801
$$ 1735221 1725421 1680310 1645290 1622983 1613099 1592409 1574613 1615848 1594769 1602644 1685482 1724283
14530A724283q8743j4612R0685L7236l7923l3331M2547r020n6142m567k0479M749
$$ 1724283 1635540 1620928 1711613 1748849 1710926 1677595 1720142 1711122 1654980 1650413 1629934 1634683
14518A634683L4941K5462J090k3826j9752k8901k0272J55O9025o7540q1249m4713
$$ 1634683 1669624 1695086 1696176 1672350 1652598 1623697 1603425 1603580 1672605 1605065 1523816 1479103
14506A479103j2841L8851P4438N5941k2834p775J8540K918k3874n6104J9729O9396
$$ 1479103 1466262 1505113 1579551 1635492 1612658 1604883 1623423 1626341 1602467 1546363 1566092 1635488
14494A635488Q7285N0844o5838J0797J0571m9270o2881j8259L2120J8199m04l8689
$$ 1635488 1722773 1773617 1707779 1718576 1729147 1679877 1616996 1598737 1630857 1649056 1648652 1609963
14482A609963o082K3440L2210k4424J879q5315j6089K6866j2130j1090R0952R4523
$$ 1609963 1603881 1627321 1659531 1635107 1636986 1551671 1535582 1562448 1550318 1539228 1630180 1724703
14470A724703L879k9300L0700J8339p2864j2132M111L1087J7919j606M1263M7196
$$ 1724703 1728582 1699282 1729982 1748321 1675457 1663325 1667436 1698523 1716442 1714836 1756099 1803295
14458A803295j1080J7098J5586k4365j20746L8482P1645k8456k5389m6216M0226
$$ 1803295 1792215 1809313 1824899 1800534 1679788 1718270 1789915 1761459 1736070 1689854 1730080
14447A730080K1749J339M322M3358j2542j5738K1088p775L8193P750n8712j6889
$$ 1730080 1751829 1753168 1757490 1800848 1788306 1772568 1793656 1785881 1824074 1831824 1773112 1756223
14435A756223k6274K457j8291j3533q802K7644P3593N6568j9544m3748l6324J5368
$$ 1756223 1729949 1732406 1714115 1700582 1691780 1719424 1793017 1849585 1830041 1786293 1749969 1765337
14423A765337k1630J5217M7189L7768j07415k0626M8832K0320m2060K4038J4533
$$ 1765337 1743707 1758924 1806113 1843881 1736466 1715840 1764672 1784992 1742932 1766970 1781503
14412A781503k0657Q992o39N5357J0740K1143k1498L3276L7056j462j5173L7340
$$ 1781503 1760846 1769838 1769199 1824556 1835296 1856439 1834941 1868217 1905273 1903811 1888638 1925978
14400A925978m7477o272K3058L5454k266o0644L9167Q9317J4689r740M9949j2307
$$ 1925978 1878501 1872229 1895287 1930741 1928475 1867831 1906998 1996315 2011004 2001264 2051213 2038906
14388B038906l7476K5917K6477J7044N762P690N090j7333J3593J711J262L005
$$ 2038906 2001430 2027347 2053824 2070868 2076630 2084320 2089410 2072077 2085670 2087381 2088643 2091648
14376B091648N4939k9693j1421j283N4311P1198j9446M1231P194j0104L1065L7968
$$ 2091648 2146587 2116894 2105473 2104190 2158501 2229699 2210253 2251484 2258678 2248574 2279639 2317607
14364B317607P832k4557J4989R512k6821m115K5669j0719Q935k3535N1208J6868
$$ 2317607 2325439 2300882 2315871 2325383 2298562 2294447 2320116 2309397 2318332 2294797 2346005 2362873
14352B362873L5061L8406m9154m3723L3888L5428L2659L9517N2419k6690K0980
$$ 2362873 2397934 2436340 2387186 2343463 2377351 2412779 2445438 2484955 2537374 2510684 2531664
14341B531664P0720L748k1191k818N354L5723k2307N9372N0874l3084N9955P8227
$$ 2531664 2602384 2606132 2584941 2582123 2587477 2623200 2600893 2660265 2711139 2678055 2738010 2816237
14329B816237R280k1523o2037m2009O2073O8764k3934q501L8552o093L942M182
$$ 2816237 2825517 2803994 2741957 2699948 2762021 2830785 2806851 2798350 2836902 2830809 2834751 2838933
14317B838933O1883Q5182O0552P503J6883j2565p018R5148O5799K2217k5276k3448
$$ 2838933 2900816 2985998 3046550 3054053 3070936 3058371 3051353 3146501 3212300 3234517 3209241 3185793
14305C185793N2167O8693j8686M7918L0147n0985k7367L6802Q9681J04996N2613
$$ 3185793 3237960 3306653 3287967 3335885 3366032 3315047 3287680 3324482 3414163 3519159 3571772
14294C571772J0487K0282J02671L3358M3325J9694k720M3589j2652K7496K9423
$$ 3571772 3582259 3602541 3705212 3738570 3781895 3801589 3798869 3842458 3829806 3857302 3886725
14283C886725K5405Q1591J23215K2529l4928L1957P8634J276J0765Q083n8586
$$ 3886725 3912130 3993721 4116936 4139465 4104537 4136494 4215128 4216404 4227169 4235252 4176666
14272D176666j58L4568O9358J8224P848K21J4868P4882n6865M678K6168K4471
$$ 4176666 4176508 4211076 4280434 4298658 4306506 4306727 4321595 4396477 4339612 4344290 4370458 4394929
14260D394929M7719l9081j07065K0811K531k457L3527J23753P1967K7784L081
$$ 4394929 4442648 4403567 4296502 4317313 4319844 4317387 4350914 4474667 4546634 4574418 4577499
14249D577499K8707O7669O1855j5628N512M4304l1921M2187J06728M1570l3412
$$ 4577499 4606206 4673875 4735730 4720102 4725614 4769918 4737997 4780184 4886912 4928482 4895070
14238D895070P3484L1518M6466J9575L7596O8179J17540L1342O6874J3180L4033
$$ 4895070 4968554 5000072 5046538 5066113 5103709 5171888 5289428 5320770 5387644 5400824 5434857
14227E434857N2845K7734P9117L8779L7583L4328M5077R4579Q4495L6812M9510
$$ 5434857 5487702 5515436 5594553 5633332 5670915 5705243 5750320 5844899 5929394 5966206 6015716
14216F015716L9828O185O2257L6889Q2711M3784M9002O1586K7946N7082J02761
$$ 6015716 6055544 6061729 6123986 6160875 6243586 6287370 6336372 6397958 6425904 6482986 6585747
14205F585747K9009J6919N8315J09706N2923R6073J19327M3992J5240L0572P4875
$$ 6585747 6614756 6631675 6689990 6799696 6852619 6948692 7068019 7112011 7127251 7157823 7232698
14194G232698Q6325K647R1846R6134J39243J32207J45120O1359K0517K3930K5016
$$ 7232698 7319023 7321670 7413516 7509650 7648893 7781100 7926220 7987579 8008096 8032026 8057042
14183H057042L5368J67774J27209N6460J09496J30912J16056N6525J20993N8209
$$ 8057042 8092410 8260184 8387393 8443853 8553349 8684261 8800317 8856842 8977835 9036044
14173I036044O8762P5734J50779J56569P4821J24413J08234M2673L5004O3047
$$ 9036044 9104806 9180540 9331319 9487888 9562709 9687122 9795356 9838029 9873033 9936080
14163I936080J31075J31432K04454J86664J08948J27830J48278Q6333R8306J39163
$$ 9936080 10067155 10198587 10403041 10589705 10698653 10826483 10974761 11061094 11159400 11298563
14153A1298563Q5786J22559J97801J84704J08629J59649M2663J60935K30232J62140
$$ 11298563 11384349 11506908 11704709 11889413 11998042 12157691 12200354 12361289 12591521 12753661
14143A2753661O7022J49920J79339J92402J82000J56864J62101J68886J58124
$$ 12753661 12820683 12970603 13149942 13342344 13524344 13681208 13843309 14012195 14170319
14134A4170319R9769J05448K46178K75938J60704J36658K19389K53420K10792
$$ 14170319 14270088 14375536 14621714 14897652 15058356 15195014 15414403 15667823 15878615
14125A5878615K01227J90383K15252K45385K40596K28646K18667K39253K17026
$$ 15878615 16079842 16270225 16485477 16730862 16971458 17200104 17418771 17658024 17875050
14116A7875050K08567K91013K94141K37247K25116J50106K34949L16335K63807
$$ 17875050 18083617 18374630 18668771 18906018 19131134 19281240 19516189 19832524 20096331
14107B0096331K89136L07362K35472K17628K60441K98429L19317K97713K13967
$$ 20096331 20385467 20692829 20928301 21145929 21406370 21704799 22024116 22321829 22535796
14098B2535796K65140L43260L37189L06806L68459L57153L89742L49764L23841
$$ 22535796 22800936 23144196 23481385 23788191 24156650 24513803 24903545 25253309 25577150
14089B5577150K85193L03075K87798L68710L68075L99875L40873L58110L10175
$$ 25577150 25862343 26165418 26453216 26821926 27190001 27589876 27930749 28288859 28599034
14080B8599034L90880L42957L83278L99094M48903M11827L09597L77925M29500
$$ 28599034 28989914 29332871 29716149 30115243 30564146 30975973 31285570 31663495 32092995
14071C2092995L82084M09113M20443M38385M72209L97092M46094L93007M25491
$$ 32092995 32475079 32884192 33304635 33743020 34215229 34612321 35058415 35451422 35876913
14062C5876913L67182M05789M23144M22273M74055M29847M56921M71397M09838
$$ 35876913 36244095 36649884 37073028 37495301 37969356 38399203 38856124 39327521 39737359
14053C9737359M26330M36817M36911L87696L65254M37622M15602M27923M45496
$$ 39737359 40163689 40600506 41037417 41425113 41790367 42227989 42643591 43071514 43517010
14044D3517010L84616L97850M18810M10784L47293L21542L95329M09265L87035
$$ 43517010 43901626 44299476 44718286 45129070 45476363 45797905 46193234 46602499 46989534
14035D6989534L69515K67693L00609L79439L35627K61266K85390K44195K44569
$$ 46989534 47359049 47626742 47927351 48306790 48642417 48903683 49189073 49433268 49677837
14026D9677837K24825K65914K13901K19118K03302K57615K04740J41926J27597
$$ 49677837 49902662 50168576 50382477 50601595 50804897 51062512 51267252 51409178 51536775
14017E1536775N8241R2559J02692J08819J03740P7817l3035k4861K8239m9477
$$ 51536775 51595016 51687575 51790267 51899086 52002826 52080643 52047608 52022747 52050986 52001509
14007E2001509l2370p7743j07227j41692j14169p6077j16593j86127k13074j96626
$$ 52001509 51969139 51891396 51784169 51642477 51528308 51452231 51335638 51149511 50936437 50739811
13997E0739811k97470l33879k26823k71302k52274l31337k84984k92947k52877
$$ 50739811 50442341 50108462 49881639 49610337 49358063 49026726 48741742 48448795 48195918
13988D8195918l28401l69642m21119l81949l67674l83296l39351l46781l69464
$$ 48195918 47867517 47497875 47076756 46694807 46327133 45943837 45604486 45257705 44888241
13979D4888241m00385m94491m39955l86339m14403l57505m39056n18076m95128
$$ 44888241 44487856 43993365 43553410 43167071 42752668 42395163 41956107 41438031 40942903
13970D0942903m47825m70184m44978m37353m82488n32874l90797m02480m90845
$$ 40942903 40495078 40024894 39579916 39142563 38660075 38127201 37736404 37333924 36843079
13961C6843079m98105m46532m45504m28323m60421m29607l84761m14194m71805
$$ 36843079 36344974 35898442 35452938 35024615 34564194 34134587 33749826 33335632 32863827
13952C2863827m84223m70470m39487l98398m32276m58131l83195l59336l43453
$$ 32863827 32379604 31909134 31469647 31071249 30638973 30180842 29797647 29438311 29094858
13943B9094858l29055l83366l99522m16780l30705m07524l72181k95396l74042
$$ 29094858 28765803 28382437 27982915 27566135 27235430 26827906 26455725 26160329 25786287
13934B5786287m00478m05566l82417k79659k41443l55566l50224k93307l03989
$$ 25786287 25385809 24980243 24597826 24318167 24076724 23721158 23370934 23077627 22773638
13925B2773638k37359k74413l20825k64884l24551k25261k50453l08340k15052
$$ 22773638 22536279 22261866 21941041 21676157 21351606 21126345 20875892 20567552 20352500
13916B0352500l09654k90066l49664k38813k01437j72278j63844k73470k66540
$$ 20352500 20042846 19752780 19403116 19164303 18962866 18790588 18626744 18353274 18086734
13907A8086734k13806k45789k10622j70439k80404k01012j90835k25234k33041
$$ 18086734 17872928 17627139 17416517 17246078 16965674 16764662 16573827 16348593 16115552
13898A6115552j60317k11403k03852j92235j09970j58511k35717k19815j64758
$$ 16115552 15955235 15743832 15539980 15347745 15237775 15079264 14843547 14623732 14458974
13889A4458974j29699j84013j85178j52390k08677j12397j29114j31270j97789
$$ 14458974 14329275 14145262 13960084 13807694 13599017 13486620 13357506 13226236 13028447
13880A3028447j33572r0259j75317j98494j96346j31149j16076j47700j06475
$$ 13028447 12894875 12804616 12629299 12430805 12234459 12103310 11987234 11839534 11733059
13871A1733059j64193j44519p8600j03550p2179j13895j21034j19651j47128j45687
$$ 11733059 11568866 11424347 11345747 11242197 11170018 11056123 10935089 10815438 10668310 10522623
13861A0522623j59443p3068n4861j43253j58686j24033n5160j3869o7372o6605
$$ 10522623 10363180 10290112 10235251 10091998 9933312 9809279 9754119 9740250 9672878 9606273
13851I606273j09521j73494j13005o8371k8625r2539j02787j63990j03488q706
$$ 9606273 9496752 9323258 9210253 9141882 9113257 9020718 8917931 8753941 8650453 8641747
13841H641747j09292j73284o493p8600j08815j2934k4162q2832j19195j17785
$$ 8641747 8532455 8359171 8352678 8274078 8165263 8152329 8128167 8045335 7926140 7808355
13831G808355j04981j12497l9444n1291p8453j34124n0780n7166j08572q498J1932
$$ 7808355 7703374 7590877 7551433 7500142 7421689 7287565 7236785 7179619 7071047 7062549 7074481
13820G074481p6194r6688K486o3219j22485n9798n3421l0590j7252l4785j10212
$$ 7074481 6998287 6901599 6904085 6840866 6718381 6658583 6605162 6574572 6557320 6522535 6412323
13809F412323o5278n7703m5510o890r9050j5994n2031n6437k0452l9762k3225
$$ 6412323 6347045 6289342 6243832 6236942 6137892 6121898 6069867 6013430 5992978 5953216 5929991
13798E929991n6284j29339r3914o6497l9258n7087l6839P0566m3004o5808o1440
$$ 5929991 5873707 5744368 5650454 5583957 5544699 5487612 5450773 5521339 5478335 5412527 5351087
13787E351087k9431p308k5445R285m1754o1855o1161k3618m6127j18377j9849
$$ 5351087 5321656 5314348 5288903 5298188 5256434 5194579 5133418 5109800 5063673 4945296 4925447
13776D925447k0869q7429o1958N2o772k0508j7693n4430j7055m9980m4347M721
$$ 4925447 4904578 4817149 4755191 4755243 4748471 4727963 4710270 4655840 4638785 4588805 4544458 4549179
13764D549179J9695k9463q1383k4074o0854j0423Q810n3086o008p1992R986n200
$$ 4549179 4568874 4539411 4458028 4433954 4373100 4362677 4371487 4318401 4312393 4240401 4250387 4245187
13752D245187l0389m4890p8712J0969L5030K3862L5828n9313Q296l4357j16538
$$ 4245187 4214798 4169908 4091196 4102165 4137195 4161057 4196885 4137572 4145868 4111511 3994973
13741C994973o170J7881J9097K3601L4480p0925k7921O80j4925k0533l8787p521
$$ 3994973 3988803 4006684 4025781 4049382 4083862 4012937 3985016 3985696 3970771 3950238 3911451 3903930
13729C903930P7j7322q1977m8809n2221m1352l7990n3359n692j7148m8782k2658
$$ 3903930 3904007 3886685 3804708 3755899 3703678 3662326 3624336 3570977 3565285 3548137 3499355 3476697
13717C476697n9215j33305j2887l9279j24084m3129K9587Q883O421O455J2366
$$ 3476697 3417482 3284177 3271290 3232011 3107927 3064798 3094385 3103268 3109689 3116144 3128510
13706C128510m7088p3912m7871J3436n6560m8962r014N0034K9680K1790J2992
$$ 3128510 3081422 3007510 2959639 2973075 2916515 2867553 2858539 2908573 2938253 2960043 2973035
13695B973035m1427m0200l8628p827n4534k8806J8994j11105o2529m6539O196
$$ 2973035 2931608 2891408 2852780 2844953 2790419 2761613 2780607 2669502 2606973 2560434 2566630
13684B566630L6646K9726J1941q240j5678o5270m2010l9603o3466l747K4362r0585
$$ 2566630 2603276 2633002 2644943 2636703 2621025 2555755 2513745 2474142 2410676 2406929 2431291 2340706
13672B340706o0256n2545K2514Q1103L7602j3076l2826j5826n501p3374J8126
$$ 2340706 2280450 2227905 2250419 2331522 2369124 2356048 2323222 2307396 2301895 2228521 2246647
13661B246647K1016J4274k8479p1479k8331K3297q0268p2639P3910J09959R734
$$ 2246647 2267663 2281937 2253458 2181979 2153648 2176945 2096677 2024038 2097948 2207907 2217641
13650B217641o4426p7033m0344J6841N1180J428p124K964j3192m9676k1203n1572
$$ 2217641 2153215 2076182 2035838 2052679 2103859 2105287 2098163 2101127 2087935 2038259 2017056 1965484
13638A965484l4889q278K7294K7572r124k8740L5905J2756j4069K1223k1087k0531
$$ 1965484 1930595 1922317 1949611 1977183 1968059 1939319 1975224 1987980 1973911 1995134 1974047 1953516
13626A953516K0206n8473n4953j8931o1857J9003M3804k2208n1925m723k3183
$$ 1953516 1973722 1915249 1860296 1841365 1779508 1798511 1842315 1820107 1768182 1763459 1740276
13615A740276O1265R777l2036q6602o3562J3812L7679M939q039j3361M1379Q295
$$ 1740276 1801541 1811318 1779282 1692680 1629118 1642930 1680609 1685548 1677509 1664148 1705527 1713822
13603A713822P092l8646n4500l76k0206o7972j8600j5362j7053J5205J9477L4912
$$ 1713822 1720914 1682268 1627768 1627392 1607186 1539214 1520614 1505252 1488199 1503404 1522881 1557793
13591A557793N6269J6792m6578m8050J871p004k6022m6755l0217q013P0402j4458
$$ 1557793 1614062 1630854 1584276 1536226 1538097 1531093 1505071 1458316 1428099 1420086 1490488 1476030
13579A476030r9597m5273R2Q033L1282N2011k1909O937M136l909K6435O6538j77
$$ 1476030 1376433 1331160 1331252 1339285 1370567 1422578 1400669 1407606 1411742 1407833 1434268 1500806 1500629
13566A500629m008O6325K0193p4696j16878o0720L1073N3681j7992l1007N8611
$$ 1500629 1496621 1562946 1583139 1508443 1391565 1330845 1361918 1415599 1397607 1366600 1425211
13555A425211L8790J9878k5288q0948l5835K5459k292n5846j4671o4466N476M3796
$$ 1425211 1464001 1483879 1458591 1377643 1341808 1367267 1364975 1309129 1294458 1229992 1235468 1279264
13543A279264P4649J9005j1209n3771m9371k1441L9406M2627j6374l8108l7410
$$ 1279264 1353913 1372918 1361709 1307938 1258567 1237126 1276532 1319159 1302785 1264677 1227267
13532A227267m4920k3032l4082m1921K3051l6549R8669L3731J4557R074r859k0827
$$ 1227267 1182347 1159315 1125233 1083312 1106363 1069814 1168483 1202214 1216771 1225845 1215986 1195159
13520A195159N7444r94j0762J379K9800k6399k2349m3330p2300J9992M4907l6456
$$ 1195159 1252603 1251609 1240847 1242226 1272026 1245627 1223278 1179948 1107648 1127640 1172547 1136091
13508A136091J0198O9887o437k2243j192m1978k195j9653m7491K1906n540k907
$$ 1136091 1146289 1216176 1209739 1187496 1186304 1144326 1142131 1122478 1074987 1096893 1091353 1088446
13496A088446N161o147K1712P8592n8407o8607L7160R882n4763J3780m7315m7763
$$ 1088446 1093607 1087460 1109172 1187764 1129357 1060750 1097910 1107792 1053029 1066809 1019494 971731
13484I71731p5326O4157m352J4112m2000o9109L8804P694L5609J6542o2250N2003
$$ 971731 896405 960562 956210 970322 928322 859213 898017 905711 941320 957862 895612 947615
$$ [...]
##END NTUPLES=NMR SPECTRUM
##END=
