##TITLE=Analysis number 310504
Compound Code mo 01026
Chemist Name infarmatik
##JCAMPDX= 6.0         $$ Bruker NMR JCAMP-DX V2.0
##DATA TYPE= NMR SPECTRUM
##DATA CLASS= NTUPLES
##ORIGIN= Bruker BioSpin GmbH
##OWNER= NMR
$$ XWIN-NMR		Version 3.5
$$ Mon Jun 20 14:32:00 2005 GMT Daylight Time (UT+1h)  MAYBRIDGE\NMR@NMR_250MHZ
##.OBSERVE FREQUENCY= 250.131544655141
##.OBSERVE NUCLEUS= ^1H
##.ACQUISITION MODE= SIMULTANEOUS (DQD)
##.ACQUISITION SCHEME= undefined
##.AVERAGES= 16
##.DIGITISER RES= 18
##SPECTROMETER/DATA SYSTEM= dpx250
##.PULSE SEQUENCE= zg30
##.SOLVENT NAME= DMSO
##.SHIFT REFERENCE= (INTERNAL, DMSO, 0, 16.522)
##AUDIT TRAIL= $$ (NUMBER, WHEN, WHO, WHERE, WHAT)
$$ ##TITLE= Audit trail, XWIN-NMR		Version 3.5
$$ ##JCAMPDX= 5.01
$$ ##ORIGIN= Bruker BioSpin GmbH
$$ ##OWNER= NMR
$$ C:\u/data/dgb/nmr/ADRS/4250/pdata/1/auditp.txt
$$ ##AUDIT TRAIL=  $$ (NUMBER, WHEN, WHO, WHERE, WHAT)
(   1,<2005-06-20 14:31:40.49 +100>,<MAYBRIDGE\NMR>,<NMR_250MHZ>,
      <created by zg, POWCHK disabled, PULCHK disabled
       configuration hash MD5:
       62 19 C7 07 E1 42 D1 B7 37 6C 3D D0 77 39 F9 E6
       data hash MD5: 64K
       0C A8 F2 1F 9E DF 4A F9 AD 4F 22 3C 1C CD 08 6D>)
(   2,<2005-06-20 14:31:51.54 +100>,<MAYBRIDGE\NMR>,<NMR_250MHZ>,
      <Start of raw data processing
       ef LB = 0.3 FT_mod = 6 PKNL = 1 SI = 32K 
       data hash MD5: 32K
       79 1E 03 2F 0E 78 98 3D BE 83 A5 9F 1B BB 9B 8D>)
(   3,<2005-06-20 14:31:53.27 +100>,<MAYBRIDGE\NMR>,<NMR_250MHZ>,
      <apk 
       data hash MD5: 32K
       D5 E3 67 02 67 32 FA 9C BE 44 9D EA 50 D7 30 44>)
(   4,<2005-06-20 14:31:54.00 +100>,<MAYBRIDGE\NMR>,<NMR_250MHZ>,
      <abs ABSG = 5 
       data hash MD5: 32K
       43 3C D8 C9 CB C8 77 32 38 62 7E AB 97 A8 76 78>)
$$ ##END=
$$ 
$$ hash MD5
$$ 79 7C F6 B2 DB DC E1 8D 4E FA E0 59 FA 65 E7 3F
##$RELAX= 
##$RELAX= 
##$RELAX= 
##$RELAX= 
##$RELAX= 
##$RELAX= 
##$RELAX= 
$$ Bruker specific parameters
$$ --------------------------
##$DU= <C:\u>
##$EXPNO= 4250
##$NAME= <ADRS>
##$PROCNO= 1
##$TYPE= <nmr>
##$USER= <dgb>
##$AMP= (0..31)
100 100 100 100 100 100 100 100 100 100 100 100 100 100 100 100 100 100 
100 100 100 100 100 100 100 100 100 100 100 100 100 100 
##$AQSEQ= 0
##$AQ_mod= 3
##$AUNM= <au_zg>
##$AUTOPOS= <17 >
##$BF1= 250.13
##$BF2= 250.13
##$BF3= 250.13
##$BF4= 250.13
##$BF5= 500.13
##$BF6= 500.13
##$BF7= 500.13
##$BF8= 500.13
##$BYTORDA= 1
##$CFDGTYP= 0
##$CFRGTYP= 5
##$CHEMSTR= <none>
##$CNST= (0..31)
1 1 145 1 1 1 1 1 1 1 1 1 1 1 1 1 1 1 1 1 1 1 1 1 1 1 1 1 1 1 1 1 
##$CPDPRG= <>
##$CPDPRG1= <>
##$CPDPRG2= <>
##$CPDPRG3= <>
##$CPDPRG4= <mlev>
##$CPDPRG5= <mlev>
##$CPDPRG6= <mlev>
##$CPDPRG7= <mlev>
##$CPDPRG8= <mlev>
##$CPDPRGB= <>
##$CPDPRGT= <>
##$D= (0..31)
0 1 0 0 0 0 0 0 0 0.06 0 0 0 0 0 0 0.0002 0 0 0 0 0 0 0 0 0 0 0 0 0 0 
0 
##$DATE= 1119274299
##$DBL= (0..7)
120 120 120 120 120 120 120 120 
##$DBP= (0..7)
150 150 150 150 150 150 150 150 
##$DBP07= 0
##$DBPNAM0= <>
##$DBPNAM1= <>
##$DBPNAM2= <>
##$DBPNAM3= <>
$$ [...]
##$SUBNAM7= <"">
##$SUBNAM8= <"">
##$SUBNAM9= <"">
##$SW= 20.6930455092707
##$SWIBOX= (0..15)
0 0 3 0 0 0 0 0 0 0 0 0 0 0 0 0 
##$SW_h= 5175.983436853
##$TD= 65536
##$TD0= 1
##$TE= 295.16
##$TE2= 300
##$TE3= 300
##$TEG= 300
##$TL= (0..7)
0 120 120 120 120 120 120 120 
##$TP= (0..7)
150 150 150 150 150 150 150 150 
##$TP07= 0
##$TPNAME0= <>
##$TPNAME1= <>
##$TPNAME2= <>
##$TPNAME3= <>
##$TPNAME4= <>
##$TPNAME5= <>
##$TPNAME6= <>
##$TPNAME7= <>
##$TPOAL= (0..7)
0.5 0.5 0.5 0.5 0.5 0.5 0.5 0.5 
##$TPOFFS= (0..7)
0 0 0 0 0 0 0 0 
##$TUNHIN= 0
##$TUNHOUT= 0
##$TUNXOUT= 0
##$USERA1= <user>
##$USERA2= <user>
##$USERA3= <user>
##$USERA4= <user>
##$USERA5= <user>
##$V9= 5
##$VALIST= <valist>
##$VCLIST= <CCCCCCCCCCCCCCC>
##$VD= 0
##$VDLIST= <DDDDDDDDDDDDDDD>
##$VPLIST= <PPPPPPPPPPPPPPP>
##$VTLIST= <TTTTTTTTTTTTTTT>
##$WBST= 1024
##$WBSW= 4
##$XGAIN= (0..3)
0 0 0 0 
##$XL= 0
##$YL= 0
##$YMAX_a= 222855
##$YMIN_a= -218572
##$ZGOPTNS= <>
##$ZL1= 120
##$ZL2= 120
##$ZL3= 120
##$ZL4= 120
##$ABSF1= 16.522
##$ABSF2= -4.171173
##$ABSG= 5
##$ABSL= 3
##$ALPHA= 0
##$AQORDER= 0
##$ASSFAC= 0
##$ASSFACI= 0
##$ASSFACX= 0
##$ASSWID= 0
##$AUNMP= <proc_1d>
##$AZFE= 0.1
##$AZFW= 0.1
##$BCFW= 0
##$BC_mod= 0
##$BYTORDP= 0
##$COROFFS= 0
##$CY= 12.5
##$DATMOD= 1
##$DC= 0
##$DFILT= <>
##$DTYPP= 0
##$F1P= 14.0000005364418
##$F2P= -0.99999901652339
##$FCOR= 0.5
##$FTSIZE= 32768
##$FT_mod= 6
##$GAMMA= 0
##$GB= 0
##$INTBC= 1
##$INTSCL= 1
##$ISEN= 128
##$LB= 0.3
##$LEV0= 0
##$LPBIN= 0
##$MAXI= 10000
##$MC2= 0
##$MEAN= 0
##$ME_mod= 0
##$MI= 0
##$NCOEF= 0
##$NC_proc= -6
##$NLEV= 6
##$NOISF1= 0
##$NOISF2= 0
##$NSP= 0
##$NTH_PI= 0
##$NZP= 0
##$OFFSET= 16.522
##$PC= 1
##$PHC0= -88.73418
##$PHC1= 14.16525
##$PH_mod= 1
##$PKNL= yes
##$PPARMOD= 0
##$PSCAL= 4
##$PSIGN= 0
##$REVERSE= no
##$SF= 250.13
##$SI= 32768
##$SIGF1= 0
##$SIGF2= 0
##$SINO= 400
##$SIOLD= 32768
##$SREGLST= <1H.DMSO>
##$SSB= 0
##$STSI= 32768
##$STSR= 0
##$SW_p= 5175.98343685301
##$SYMM= 0
##$S_DEV= 0
##$TDeff= 65536
##$TDoff= 0
##$TI= <Analysis number 999999
Compound Code 99
Book Reference 9
Project Code 9>
##$TILT= no
##$TM1= 0
##$TM2= 0
##$TOPLEV= 0
##$USERP1= <user>
##$USERP2= <user>
##$USERP3= <user>
##$USERP4= <user>
##$USERP5= <user>
##$WDW= 1
##$XDIM= 32768
##$YMAX_p= 535196170
##$YMIN_p= -1479718
$$ End of Bruker specific parameters
$$ ---------------------------------
##NTUPLES= NMR SPECTRUM
##VAR_NAME=  FREQUENCY,     SPECTRUM/REAL,   SPECTRUM/IMAG
##SYMBOL=    X,             R,               I
##VAR_TYPE=  INDEPENDENT,   DEPENDENT,       DEPENDENT
##VAR_FORM=  AFFN,          ASDF,            ASDF
##VAR_DIM=   32768,         32768,           32768
##UNITS=     HZ,            ARBITRARY UNITS, ARBITRARY UNITS
##FACTOR=    0.157963299565203, 1,           1
##FIRST=     4132.6476996994, 0,             0
##LAST=      -1043.33573715361, 0,           0
##MIN=       -1043.33573715361, -1479718,    0
##MAX=       4132.6476996994, 535196170,     0
$$ Real data points
##PAGE= N=1
##DATA TABLE= (X++(R..R)), XYDATA
$$ [...]
22947A38389o1238j67488j56799j36028k55121Q9952J91975L11237o4909P9304
22937c0726j8999l69703j94519N8067J94081J45327j0907R7937L0872j43843J5841
22926b26572j3193k19288K19611J71769L30390K43031m333j28662J19289k08856
22916B83186l93474o0025j277P7694Q5021J23356j98901j32201r9098k18571l5113
22905e69403J91598J37442k17075N5994J50479j52345J18316k06350J51179J8065
22895c22100p1565j12013n4578K15838l7668O3261J19931P0261P4205K53037O6682
22884B65291j83929j28600L3429r5559r5715J3928Q2270L7758j80185k10673Q120
22873d53865K01058N24549J73696k44460k59422l5166J00365J38038j74948l70458
$$ plain form
22947 138389 77151 -90337 -247136 -383164 -638285 -548333 -356358 -45121 -110030 -30726
22937 -30726 -49725 -419428 -613947 -555880 -361799 -216472 -227379 -129442 -98570 -242413 -226572
22926 -226572 -239765 -459053 -239442 -67673 262717 505748 501415 372753 492042 283186
22916 283186 -110288 -170313 -171590 -93896 -8875 114481 -84420 -216621 -315719 -534290 -569403
22905 -569403 -377805 -240363 -457438 -401444 -250965 -403310 -284994 -491344 -340165 -322100
22895 -322100 -393665 -505678 -560256 -344418 -382086 -318825 -198894 -128633 -54428 198609 265291
22884 265291 81362 -47238 -13809 -109368 -205083 -191155 -108885 -71127 -251312 -461985 -453865
22873 -453865 -252807 271742 445438 200978 -58444 -93610 6755 144793 -30155 -400613
22863d00613j83828l9842j86209J58061L62616M23539J26536k90677l36066k29234
22853e95717K09577k04860j5751M25178P1144q9212O5616K55302l23358j79259
22843c81340J58666K42245R0112j20500J15652k4479K77704j48996l56877L688
22833a44125n2254l44286L5558K16593K51315N2534l79316l17095L50004k4738
22823c55810j03339J30110O910J63614m66521k65973K63723N51328K57133l50712
22813a69537l08028l8435J52161J60911K4043J85800L4038k0248k1837J10507
22803A09375j20180l31135R0924K265j97838J18235j0546p8561l1656M19116K61903
22792B31902R908K79379J79919l16381j81617L3146k25755j33295l7009j5515
$$ plain form
22863 -400613 -584441 -624283 -810492 -652431 -289815 133724 260260 -30417 -366483 -595717
22853 -595717 -386140 -591000 -606751 -181573 -110429 -199641 -134025 121277 -202081 -381340
22843 -381340 -222674 19571 109683 -10817 104835 80356 358060 209064 -147813 -144125
22833 -144125 -196379 -540665 -505107 -288514 -37199 15335 -363981 -681076 -331072 -355810
22823 -355810 -459149 -329039 -322129 -158515 -625036 -891009 -627286 -75958 181175 -169537
22813 -169537 -477565 -516000 -363839 -202928 -178885 6915 40953 20705 -1132 109375
22803 109375 -10805 -341940 -251016 -248751 -446589 -328354 -338900 -417461 -449117 -30001 231902
22792 231902 241810 521189 701108 384727 203110 236256 10501 -122794 -159803 -175318
22782a75318P2566L74923j25975l14800Q3562j00822r7928l5776M19238k32825
22772a33155l44697j08335N1083Q5920J96395O8704q4944m65787K7948Q4529Q5374
22761e36965l5206j76422j73184O7379P8993K38611J67538N29983K127l34454
22751a71600l76693r1284M07285K88390j22161l43725k2857K47866J13078L539
22741f8162J29233m03922l85886J45168N47873K78145J11123l80188j54034J76825
22731c825J08041J57847m19389n28375J8599O3742l9857K02777K82484l47160
22721e05116o4803n5545k0789j72905K56648K65154K52734P1190O4508M6082O9684
22710B06842m80758j39382L05285J53469k47120k19217o6422L60526M39413L50299
$$ plain form
22782 -175318 -102752 272171 146196 -168604 -85042 -185864 -283792 -319568 99670 -133155
22772 -133155 -477852 -586187 -535104 -449184 -252789 -184085 -269029 -734816 -706868 -622339 -536965
22761 -536965 -572171 -748593 -921777 -854398 -775405 -536794 -369256 160727 162854 -171600
22751 -171600 -548293 -639577 -232292 56098 -66063 -409788 -432645 -184779 -71701 -68162
22741 -68162 61071 -342851 -728737 -583569 -35696 242449 353572 -26616 -180650 -3825
22731 -3825 104216 262063 -157326 -685701 -667102 -603360 -643217 -440440 -157956 -505116
22721 -505116 -569919 -625464 -646253 -819158 -562510 -297356 -44622 26568 91076 137158 206842
22710 206842 -273916 -413298 -108013 45456 -201664 -420881 -487303 -126777 312636 662935
22700F62935q2194j96204j11147R9043j14412L3764m80956j54442J32474j50279
22690c61418M0388O8945N2091K06389J8874m9547J76055n1527j40226l8580L37666
22679B59110J29714k29050k62298j57965k19781j22762N0589M52313J4210q8944
22669a74864P3334l3448N9522j22899j52026j04069j45019k94727O8481O59230
22659a66485J41015Q2288l844j3001n5553J37557K45885j22693l84211k31643
22649c70685l11587J7714N06660J84628l27004R3930J01355R341J49563K07614
22639B61529J49504K5864k22640Q0168j8842J09164j19684l26555K098K2285k5797
22628f2906K77362J06265o7655j11819o8709o7269M4236N5337L18418J39247J0735
$$ plain form
22700 662935 580741 384537 273390 372433 258021 291785 -189171 -343613 -211139 -361418
22690 -361418 -321030 -252085 -199994 6395 25269 -24278 151777 100250 -39976 -78556 259110
22679 259110 388824 159774 -102524 -260489 -480270 -603032 -552443 -100130 -85920 -174864
22669 -174864 -101530 -134978 -75456 -198355 -350381 -454450 -599469 -894196 -825715 -166485
22659 -166485 -25470 56818 52974 39973 -15580 121977 367862 245169 -139042 -370685
22649 -370685 -682272 -664558 -157898 26730 -300274 -206344 -104989 -95648 53915 261529
22639 261529 411033 436897 214257 294425 275583 384747 265063 -61492 -59394 -37109 -62906
22628 -62906 214456 320721 253066 141247 72538 5269 49505 104842 423260 562507 573242
22617E73242m31562K8089K67229J84340l59492j01722j66993N8484J24548L70997
22607E47160r9895k70056j41029M1087k52146j5758M10213j23150l60712K88284
22597B3998K21495O2467k4472M7445j60390P7316r6481O4112Q2888J38004O5990
22586E02372k10508M3251o2807m1329N1633K04857N7180q251m5056O5028l14203
22575B42167k44603j09072k33522K03457Q8538r3750J49167J38599N8989l9714
22565A60256l04819K88937K51092K6419l07173J2593r794J78228K31285q8486
22555D38538j53747Q2356L0141l7747j5015K38689L4476m8255k09046J76250L31271
22544H67911q2713m70445m55820J22907L81715K83548j27754j88070j94319m3987
$$ plain form
22617 573242 141680 169769 436998 621338 261846 160124 -6869 51615 176163 547160
22607 547160 447265 177209 36180 77267 -174879 -190637 219576 96426 -264286 23998
22597 23998 245493 307960 283488 330933 170543 247859 151378 215490 298378 436382 502372
22586 502372 291864 335115 272308 230979 282612 487469 544649 536398 491342 556370 242167
22575 242167 -2436 -111508 -345030 -141573 -53035 -146785 2382 140981 199970 160256
22565 160256 -144563 144374 395466 421885 114712 127305 117511 295739 527024 438538
22555 438538 284791 367147 397288 359541 344526 583215 617691 569436 360390 536640 867911
22544 867911 785198 314753 -141067 -18160 363555 647103 519349 331279 136960 92973
22534I2973N3169K30507K35509j00545j58433K06765K98065J902K28134J42522
22524A230568m05815j59281J75735k22331R102o5618J96L36647k1230L57867J79044
22513A414884k06043n07940n84444j21208K59772L99354l8180m37888j27511M4357
22503I5153o6593J68652Q1439l8863J71939J62303j19817m4799J8745M74507J91696
22492A094362k99645l09110p2291O0744K73878J1018j94514m05889J84829J92938
22482E36320j13635q7148q3956K46812j19164l73358L00410J1723k55213j76846
22472a14055K02503M48075O6863k11429q5911L64450J64995l52146k37622J9864
22462B65587K19886j07881j76577K74793M53474j27806k23435j40555r6272r8619
$$ plain form
22534 92973 146142 376649 612158 511613 353180 559945 858010 859912 1088046 1230568
22524 1230568 824753 665472 841207 618876 627978 562360 562556 899203 877973 1235840 1414884
22513 1414884 1208841 700901 116457 -4751 255021 654375 616195 178307 50796 95153
22503 95153 28560 197212 278651 239788 411727 574030 454213 409414 428159 902666 1094362
22492 1094362 794717 485607 413316 474060 747938 758956 564442 158553 343382 536320
22482 536320 422685 335537 251581 498393 379229 5871 306281 318004 62791 -114055
22472 -114055 88448 536523 603386 391957 306046 670496 835491 483345 245723 265587
22462 265587 485473 377592 201015 475808 929282 801476 578041 437486 341214 242595
22452B42595j20906L34592k1103q000Q5206j50859p2480J49508O7931N8846n3046
22441E12284k29302K7513K46966O1241J17405J44384P2546k00518j68292n0225
22431E34002j49669J31417K09875J54976j84158k22428l2906m9870J07282O3739
22421E62260k32692Q0580K58870R5109J91736J33785l79234k12764k59085m5351
22411A93214Q2184j07747M8097J70022K92468J86842K00401K90577k21214k51637
22401H83207l56652p9347l7725Q6928j86136K12773J36396L0854K27365j02566
22391H15097j66120J28512J61040r9906l86966q1041k04623J62520M7460J03650
22381D79623J78043K48995Q2403O9725Q1548m88749j73468N75635J48592j49361
$$ plain form
22452 242595 121689 456281 435178 427178 512384 361525 289045 438553 506484 565330 512284
22441 512284 282982 310495 557461 618702 736107 880491 953037 752519 584227 534002
22431 534002 384333 515750 725625 880601 696443 474015 441109 391239 498521 562260
22421 562260 329568 410148 669018 764127 955863 1089648 710414 497650 238565 193214
22411 193214 275398 167651 215748 385770 678238 865080 1065481 1356058 1134844 883207
22401 883207 526555 447208 409483 496411 310275 523048 659444 690298 917663 815097
22391 815097 648977 777489 938529 838623 451657 370616 165993 328513 375973 479623
22381 479623 657666 906661 989064 1058789 1140337 651588 478120 1053755 1202347 1052986
22371A052986j55426L1387Q2404l13753M2651k9765m3367K77499m29j29164q1454
22360G33569K30251o3923P7407J9381Q9251J09545k81599k9637P2014l2603K6802
22349I50458r5399P6387J18308L38330K39700j94737n25001k29199J98163L5072
22339I12082m59139K0166L57426K01789o4693J09025K67053K09474n1231l14485
22329A187467n20245j82058N21755J4504j19923k16385l14006j55588J62598N68917
22319I47036J77189k25807q4728j06607L18783P5860j02005r463J66806n7868
22309A099196P1319L68024j51547N5347K29777j2858l32738o15486p1660J37809
22299G77183J61914K42714j14481m01528k3834K6269O982J18581M94470K89865
$$ plain form
22371 1052986 897560 928947 1011351 697598 740249 710484 667117 944616 944187 815023 733569
22360 733569 963820 899897 977304 996685 1085936 1195481 913882 884245 956259 923656 950458
22349 950458 855059 931446 1049754 1388084 1627784 1433047 908046 678847 877010 912082
22339 912082 452943 473109 830535 1032324 967631 1076656 1343709 1553183 1501952 1187467
22329 1187467 667222 485164 1006919 1021423 901500 685115 371109 215521 378119 947036
22319 947036 1124225 898418 813690 707083 1025866 1101726 999721 990258 1157064 1099196
22309 1099196 1170515 1538539 1386992 1442339 1672116 1659258 1326520 711034 639374 777183
22299 777183 939097 1181811 1067330 665802 641968 668237 675219 793800 1288270 1578135
22289A578135j33527J64809K2041Q3887K7214k57146j83140k93243j20662l6435
22279H51933N4451K48498j06166Q1525j37068J44190J39340J26034k6008r2874
22269A283855J32206K21388q7335k86090J36766L85446J18729l24752m02243l70098
22259H07872Q3055N42259J50772k0335R3992j56443j83945O6898j90289j1313
22249A182523o0761J79991J30382r5213L06000L4342j88944j14180k3037j44704
22239A206399M6225N75585K80788k03949k75302J56017k29132m69149K97747K13973
22229A599202K82265R2919N6769J33046j14333J11226k38040m17692j1949K59184
22219A752597L0658K98768L4539m1307K15249Q3125J50654n132n4017l03378j61225
$$ plain form
22289 1578135 1444608 1609417 1631458 1715345 1742559 1485413 1302273 1009030 888368 851933
22279 851933 906384 1154882 1048716 1130241 993173 1137363 1276703 1402737 1376729 1283855
22269 1283855 1416061 1637449 1550114 1264024 1400790 1786236 1904965 1580213 1177970 807872
22259 807872 890927 1433186 1583958 1563623 1657615 1501172 1317227 1384125 1193836 1182523
22249 1182523 1121762 1301753 1432135 1336922 1642922 1677264 1488320 1374140 1351103 1206399
22239 1206399 1252624 1828209 2108997 1905048 1629746 1785763 1556631 1087482 1385229 1599202
22229 1599202 1881467 1974386 2031155 2164201 2049868 2161094 1923054 1505362 1493413 1752597
22219 1752597 1783255 2082023 2116562 2075255 2290504 2373629 2524283 2519151 2465134 2161756 2000531
22208B000531k86884l16148j9184L5041K06625L8845R9077K90516J78963O8598
22198B295980k22659l43591j73766J92922L38236Q1439J38850l84655J05258P0235
22188B098249k60382K9412J17889L09784k32046j3662l2988k6490K67691L66496
22178B623953k55456l51604J26436j60613k0892L20924L6280Q3415K06419r7122
22168B511740j94149k59285J81264P2460K59796O1664J12932n76536m49968J72467
22158A892385J81261K94743P8158n3252J17856O6575j662j4956j11967R8008k09791
22147B337358J78658O8153P585j4093p2815n8407M26989L55187K1832j5462k28704
22136C006281K7439m2729k13577P3420J90269m35089q585L03031L5773j60164
$$ plain form
22208 2000531 1713647 1397499 1378315 1413356 1619981 1658826 1757903 2048419 2227382 2295980
22198 2295980 2073321 1729730 1555964 1748886 2087122 2168561 2307411 1922756 2028014 2098249
22188 2098249 1837867 1867279 1985168 2294952 2062906 2049244 2016256 1989766 2257457 2623953
22178 2623953 2368497 2016893 2143329 1982716 1961824 2282748 2319028 2402443 2608862 2511740
22168 2511740 2317591 2058306 2239570 2312030 2571826 2633490 2746422 2169886 1719918 1892385
22158 1892385 2073646 2368389 2446547 2393295 2511151 2577726 2576064 2561108 2449141 2547149 2337358
22147 2337358 2516016 2584169 2591754 2577661 2504846 2446439 2873428 3228615 3250447 3234985 3006281
22136 3006281 3033720 2990991 2777414 2850834 3041103 2606014 2597429 2900460 2936233 2776069
22126B776069L8961k6255n9304K67232o5239J5675M72286Q6325j4188O0079J39285
22115C690926P8784M8134j72072m96941j55991L15695K40045J24385m4569j97478
22105C430918R6225j28638k52099J14280J80549l00426l8283j68102o1736M45672
22095C318360J76349K30677L2288K7937k94598P7943P8984n7015k9488P3391j51810
22084C483018p9615J44690L40942O8823j39723k62460j8224J45317N2954K77871
22074D013593Q0920j93628k16895k6729K14362K01487L62959j94547j83178L96398
22064D454742J64533j87738j42318k59126K37221L2663k6349L40948K12184q6365
22054D740395O5257j7540l19618r4094K57729L18327J19778K22943K71630j1217
$$ plain form
22126 2776069 2815030 2788775 2729471 2996703 2931464 2947139 3419425 3505750 3491562 3551641 3690926
22115 3690926 3769710 3817844 3645772 3148831 2992840 3308535 3548580 3672965 3628396 3430918
22105 3430918 3527143 3398505 3146406 3260686 3441235 3140809 3102526 2934424 2872688 3318360
22095 3318360 3494709 3725386 3757674 3785611 3491013 3568956 3647940 3590925 3561437 3634828 3483018
22084 3483018 3403403 3548093 3889035 3957858 3818135 3555675 3537451 3682768 3735722 4013593
22074 4013593 4094513 3900885 3683990 3657261 3871623 4073110 4436069 4241522 4058344 4454742
22064 4454742 4619275 4431537 4289219 4030093 4267314 4299977 4273628 4614576 4826760 4740395
22054 4740395 4805652 4788112 4468494 4374400 4632129 4950456 5070234 5293177 5564807 5553590
22044E553590r678m6260j65623j27438j31044P353P2256J00531L09901N20862
22034F084450j54256m26390k9278k20054J06244L08471K31595q4727p81152j67204
22024D867699K29122J12431O1187K23948L23266K8378j74674O7025J63396k22062
22014E679716l78739q8580K88953k0279N2197p7543Q3251K89194j18195J0644
22004E720619K82471J14968L3557k65861k55165K69244N01171K8902j12900M2438
21994F359444K29045L54157K59332j01510m24327l50754K68859J00777K18127
21985F913150J05938l00408o6051j39913K99879O4169P044j96060k12997j10153
21975F364598K93825N09588L82122M0665k58805j74966R6121l9054M1433K47963
$$ plain form
22044 5553590 5543912 5497652 5332029 5204591 5073547 5080900 5153156 5253687 5563588 6084450
22034 6084450 5930194 5503804 5474526 5254472 5360716 5669187 5900782 5816055 5034903 4867699
22024 4867699 5096821 5209252 5270439 5494387 5817653 5846031 5671357 5738382 5901778 5679716
22014 5679716 5300977 5212397 5501350 5481071 5533268 5455725 5538976 5828170 5709975 5720619
22004 5720619 6003090 6118058 6151615 5885754 5630589 5899833 6401004 6429906 6317006 6359444
21994 6359444 6588489 6942646 7201978 7100468 6676141 6325387 6594246 6695023 6913150
21985 6913150 7019088 6718680 6652629 6512716 6812595 6876764 6883808 6687748 6474751 6364598
21975 6364598 6658423 7168011 7550133 7590798 7331993 7157027 7253148 7214094 7255527 7503490
21965G503490N5804k21842Q3732R9099J89732J72617J31261q1586K9678J0547
21955G972532N8294Q6019K34873j79991K20515n7059j65238L57232K5587k04608
21945H348156J6817K00906K45058m2426J08194K6641m6969q9884j73960K03072
21935H795605j48440M9159J00157J22420j3224J51802R4366p7338k12221k1625
21925H840661J10136m2947k66964j59081L02402L72648n1629K71544K87825J00708
21915I765303J16441R4465o8719j68572J25612l2067j64044Q9662J52745K77709
21905A0188535Q1469p1221K2643K65839q2849k25839R4588J95518r4690J94951
21895A0568944M35886j36536K01437O695J70931o7346N3904K66543J62086P1542
$$ plain form
21965 7503490 7559294 7337452 7421184 7520283 7710015 7882632 8013893 7932307 7961985 7972532
21955 7972532 8030826 8116845 8351718 8171727 8392242 8335183 8169945 8527177 8552764 8348156
21945 8348156 8364973 8565879 8810937 8768511 8876705 8903346 8856377 8766493 8592533 8795605
21935 8795605 8647165 8696324 8796481 8918901 8905677 9057479 9151845 9074507 8862286 8840661
21925 8840661 8950797 8907850 8640886 8481805 8784207 9156855 9105226 9376770 9664595 9765303
21915 9765303 9881744 9976209 9907490 9738918 9864530 9832463 9668419 9758081 9910826 10188535
21905 10188535 10270004 10198783 10221426 10487265 10404416 10178577 10273165 10468683 10373993 10568944
21895 10568944 11004830 10868294 11069731 11076426 11247357 11180011 11233915 11500458 11662544 11734086
21885A1734086j68510k81723p9934L00133Q5238j50356L17101J86536N6470M5418
21875A2044459L79723n4829l09922Q3846L78408K32310l42131m15965K37314M39305
21865A2672518L90811K67137j62122k99951k09965n0016j31496K41715J85918
21856A2904549k4978K38296l1805j08027l22106R9496K37226P366J89404K04864
21846A3394285r6139k26779K47674K29587k53242J86246J55706O4508n5895j66144
21836A3479807J00770K38321l1526j69604j06944l7564K59078J0832K07485j58703
21826A3791952k04216K2766J09591L67068j6268j22076n3412J38336K8995p13
21816A4062023J27383K63420J08824j89428l40677o426j80451J66117J93673j02627
$$ plain form
21885 11734086 11565576 11283853 11203919 11504052 11589290 11438934 11756035 11942571 11999041 12044459
21875 12044459 12424182 12369353 12059431 12143277 12521685 12753995 12411864 11995899 12233213 12672518
21865 12672518 13063329 13330466 13168344 12868393 12658428 12608412 12476916 12718631 12904549
21856 12904549 12879571 13117867 13086062 12978035 12655929 12755425 12992651 13000017 13189421 13394285
21846 13394285 13298146 13071367 13319041 13548628 13295386 13481632 13637338 13701846 13645951 13479807
21836 13479807 13580577 13818898 13787372 13617768 13510824 13473260 13732338 13743170 13950655 13791952
21826 13791952 13587736 13610502 13720093 14087161 14070893 13948817 13895405 14033741 14062736 14062023
21816 14062023 14189406 14452826 14561650 14372222 14031545 14025119 13844668 14010785 14204458 14101831
21806A4101831m9679k20816J21900L24938J29139R2436l06516l8670K24542K9
21796A4379134k17384k3339K65297J77421r1842K2915n0491k72791j36976k90713
21786A3761231q6129J9209L19485J94082j3027k06653n8075j41895j51007K6477
21776A3663698k1732l9981q7242o8799m3177j29060j06319o7785k8303q559K96562
21765A3359303M14613j43938m02067j38015Q1085j45860j41085J36120J39423
21756A3159579K74965q3433j32260p1154j74552J6396j15826j89165m5873n043
21746A2633634l01105J70111L63125k21989k04881J81689K31716J53200j07814
21737A2897686n33328l81583n0130L45938O5616N5613O6015r5413r1711K25287
$$ plain form
21806 14101831 14052152 13831336 13953236 14278174 14407313 14499749 14193233 14154563 14379105 14379134
21796 14379134 14161750 14138411 14403708 14581129 14489287 14512202 14461711 14188920 14051944 13761231
21786 13761231 13675102 13694311 14013796 14207878 14194851 13988198 13930123 13788228 13637221 13663698
21776 13663698 13641966 13601985 13514743 13445944 13402767 13273707 13167388 13099603 13071300 13062741 13359303
21765 13359303 13773916 13629978 13227911 13089896 13170981 13025121 12884036 13020156 13159579
21756 13159579 13434544 13351111 13218851 13147697 12973145 12989541 12873715 12684550 12638677 12633634
21746 12633634 12332529 12502640 12865765 12643776 12438895 12620584 12852300 13005500 12897686
21737 12897686 12364358 11982775 11932645 12278583 12344199 12399812 12465827 12370414 12278703 12503990
21727A2503990k365J7464k65960j19071j6218j72998j32569m0709k06095p1932
21717A1493537O181J81169j88102l62811M00440L08027N5956J9068j87986p2903
21707A1652576k19548J05332J27723j49769l61858m21911k74802K0227J1789J44146
21697A0633905L7928k14712j03726q8884J14511l2876K8439j78183j48803k0506
21687A0027093J12604j91790J83524M7901m7775j13973K4698k27218R2261l05289
21677I602036k19611k28731l8139J95811K69598J15276J58105m1422o48703J57676
21667I321896J90431j11650k10582k61563m68659L12552L12562M0626l87458l55200
21657H382955q0609J30047l742L32716J97580l73855j23311o3825j75255j53628
$$ plain form
21727 12503990 12501625 12519089 12253129 12134058 12117840 11944842 11812273 11771564 11565469 11493537
21717 11493537 11499718 11680887 11492785 11129974 11530414 11838441 11894397 11913465 11725479 11652576
21707 11652576 11433028 11538360 11666083 11516314 11154456 10732545 10457743 10477970 10489759 10633905
21697 10633905 10671833 10457121 10353395 10264511 10379022 10346146 10374585 10196402 10047599 10027093
21687 10027093 10139697 9947907 10131431 10179332 10131557 10017584 10042282 9815064 9907325 9602036
21677 9602036 9382425 9153694 9115555 9311366 9580964 9696240 9854345 9812923 9164220 9321896
21667 9321896 9512327 9400677 9190095 8928532 8459873 8772425 9084987 9125613 8738155 8382955
21657 8382955 8302346 8432393 8428651 8761367 8958947 8585092 8461781 8397956 8222701 8069073
21647H069073k56012m8974N1511O5527P172o0884J21539J68517N6601l7262Q745
21636H145553l66626j6563m6530j69701j77574j85586l34780m8033M19581K52906
21626G472647k01160J6958J55921k85624l54300r4222J10765P0475j42663j99616
21616F549181K54622L68415N3493l1668m09554j7394q1018K0592l6749l14125
21606F355795n4981K46867M3891l56257j0019K17158o9105Q003m9680p0142n491
21595F256039k29874j14716k00624J86545R5163k81852N2684L14571j12003j33623
21585E832310k39112q613J20871j12581o7618J18542k8254p3264k84189l23820
21575D934272j41811J1935Q7254J58049J13643j74797r6061r4056j48620p325
$$ plain form
21647 8069073 7813061 7764087 7815598 7881125 7888297 7827413 7948952 8117469 8174070 8136808 8145553
21636 8145553 7778927 7762364 7715834 7546133 7368559 7182973 6848193 6800160 7219741 7472647
21626 7472647 7271487 7288445 7444366 7158742 6804442 6710220 6820985 6891460 6748797 6549181
21616 6549181 6803803 7172218 7225711 7194043 6784489 6767095 6686077 6706669 6669920 6355795
21606 6355795 6300814 6547681 6591572 6235315 6225296 6442454 6373349 6381352 6331672 6261530 6256039
21595 6256039 6026165 5911449 5710825 5897370 5992533 5710681 5763365 6077936 5965933 5832310
21585 5832310 5593198 5584585 5705456 5592875 5525257 5643799 5615545 5542281 5258092 4934272
21575 4934272 4792461 4804396 4891650 5049699 5163342 4988545 4892484 4798428 4649808 4642483
21565D642483j31935J59349K02446k53944p3566J21718N054n7791r5520L2801
21555D551095j11449k44058p3218m0385J14961P5132j75349j7155j97383o0615
21545C821576P996m9264k69191K56876O2539J27165M831J61478l8022r5864P4061
21534D064181J24754j05393K27859j71988n0498k76417l00031L33108J62686n8674
21524C949587J0114n0085j99199k35493k6705M97661J57626j8764p8989R4160
21514D099913n59k9694j31983n3216m5698l23208k09717K65568L4970l09831J71810
21503C468355L08839L47627m91964m00829K3914K84872K76189J86163k38506k27243
21493C537417k57213k77854J36621J89343M2681M3663L6094j28150m2264j43223
$$ plain form
21565 4642483 4510548 4669897 4872343 4618399 4544833 4666551 4671605 4613814 4518294 4551095
21555 4551095 4439646 4195588 4122370 4081985 4196946 4272078 4096729 4079574 3882191 3821576
21545 3821576 3829572 3780308 3511117 3767993 3830532 3957697 3962528 4124006 4085984 3990120 4064181
21534 4064181 4188935 4083542 4311401 4139413 4088915 3812498 3512467 3845575 4008261 3949587
21524 3949587 3959701 3909616 3710417 3474924 3448219 3945880 4103506 4084742 4005753 4099913
21514 4099913 4099354 4069660 3937677 3884461 3838763 3515555 3305838 3571406 3606376 3296545 3468355
21503 3468355 3777194 4124821 3632857 3232028 3255942 3540814 3817003 4003166 3764660 3537417
21493 3537417 3280204 3002350 3138971 3328314 3370995 3414658 3450752 3322602 3280338 3137115
21483C137115k125k99819l26720n7446J66045K48329L20675M09140P3244k13541
21473C454897m50438r4285N3846k00332P1787l8944o023P4825P8605k74475j49803
21462B519660P2053M6874j03861J46554p0040K2988J16722K00995k68846k28068
21452B455031j13115l5921J50668J89347m0579P3828j62909j73807K0079k76044
21442B086578J35931O9226r7874j96119l0396l63373j12213L58562K88015l86395
21432A751942k06699K67569N6800j84206q3222J71247r9584L790J86153O07132
21422B470922R1834l56429k15365k62054j97187j11990L42315J39266j13839j3155
21412A774318J3325l9113j25937M9911q1454M5005R8388j41585J72825l07477
$$ plain form
21483 3137115 3134990 2835171 2508451 2451005 2617050 2865379 3186054 3595194 3668438 3454897
21473 3454897 3004459 2910174 2964020 2763688 2835475 2796531 2790508 2865333 2943938 2669463 2519660
21462 2519660 2591713 2638587 2534726 2681280 2611240 2634228 2750950 2951945 2683099 2455031
21452 2455031 2341916 2305995 2456663 2646010 2605431 2679259 2516350 2342543 2362622 2086578
21442 2086578 2222509 2291735 2193861 1997742 1967346 1603973 1491760 1850322 2138337 1751942
21432 1751942 1545243 1812812 1869612 1685406 1602184 1773431 1673847 1677637 1863790 2470922
21422 2470922 2562756 2206327 1990962 1728908 1531721 1419731 1762046 1901312 1787473 1774318
21412 1774318 1787643 1748530 1622593 1672504 1591050 1636055 1734443 1592858 1765683 1458206
21402A458206q9089K18404J61323J4574l8234l61796j64055K05164J8525L44949
21392A767971L21484j54236l28664R8637L5042J88067K32982k3366o6425q6345
21382A985147J50132N8069k04343l37738k89483j2715l35528j32289K22014N0633
21372A153899J56183K40791p4803j64329M3861K32304J48973J42918n4776j51420
21362A673601J25228k33458n32976K13070M29099K05553j90267j4212J91540n2602
21352A814576j17232K43861k11287r5097k34426Q9818j4370l09003l4096L26261
21342A459005J36522K5252r8573O1536m8403l3769J74377j18978k63141L9379
21332A333207L7133k8296k1982j74634P2476O6196k82635m281n5336k4287J04048
$$ plain form
21402 1458206 1369117 1587521 1748844 1763418 1725184 1363388 1199333 1404497 1423022 1767971
21392 1767971 2089455 1935219 1606555 1705192 1740234 1928301 2161283 2137917 2071492 1985147
21382 1985147 2135279 2193348 1989005 1651267 1361784 1349069 1013541 881252 1103266 1153899
21372 1153899 1310082 1550873 1476070 1311741 1355602 1587906 1736879 1879797 1825021 1673601
21362 1673601 1798829 1565371 1032395 1245465 1674564 1880117 1689850 1675638 1867178 1814576
21352 1814576 1697344 1941205 1729918 1634821 1400395 1490213 1475843 1166840 1132744 1459005
21342 1459005 1595527 1620779 1522206 1583742 1535339 1501570 1675947 1556969 1293828 1333207
21332 1333207 1370340 1342044 1320062 1145428 1217904 1284100 1001465 997184 941848 917561 1021609
21321A021609K34090p288P4872J89497N002j01435j52633j5036O5914K4579M7774
21310A386945k56461K49088J05443j80392j19314O8501p8443q5740j01612j39940
21300H48075J24610J35971J26369k18742l17233K1191K75220J89423O3138K90268
21290A538290K17887l51220m05702n2237j57530k1933K81647P780j59000m732
21280H93250J29346m54511j31959L9346j1045K5479J30471J22029j1078K16055
21270I47383J81997k95562j53998L84564K97988k73789k06120k79300O0813J79249
21260H43225J40695m7674j43677J17875n0347j47637M4609J21912K87110j02957
21250A063134j94250R6162L15188k42814m42391o2855j2552Q1972L30903K12545
$$ plain form
21321 1021609 1255699 1248411 1323283 1512780 1517782 1416347 1263714 1248678 1314592 1339171 1386945
21310 1386945 1130484 1379572 1485015 1304623 1185309 1253810 1175367 1089627 988015 848075
21300 848075 972685 1108656 1235025 1016283 699050 720241 995461 1184884 1248022 1538290
21290 1538290 1756177 1404957 999255 947018 789488 767555 1049202 1056982 897982 893250
21280 893250 1022596 568085 436126 475472 464427 489906 620377 742406 731328 947383
21270 947383 1129380 833818 679820 1064384 1362372 1088583 882463 603163 663976 843225
21260 843225 983920 936246 792569 910444 860097 712460 757069 878981 1166091 1063134
21250 1063134 868884 965046 1280234 1037420 595029 532174 519622 601594 932497 1145042
21240A145042m54751q5168k39483J41892J17775j74619l29523j33594P6878Q2656
21230A47105l7816M5480L86179J89772J05970M07110k06016q0809K43403j7939
21220A182439Q738n597l34891L6826r9701k6234l33789l90440K47252L68259J42932
21209G95794k32164l09797J08826L00363k4868k68197n006k30469m6539K36704
21199C24647L7339n9142J14629L12857K72342j8234r1897J94827l36659k74273
21189D76436K91547N2863l65763l48058K22424O42321j69768k66545r8034r1324
21179C46099P4693K60906K07784n31188k94475L52489K29634r4198J70862Q2528
21169H05134m04193l35172r8842M34629L59457L2683P281k59988j01244L6376
$$ plain form
21240 1145042 690291 605123 365640 507532 625307 450688 121165 -12429 64449 147105
21230 147105 109289 154769 540948 730720 836690 1243800 1037784 956975 1200378 1182439
21220 1182439 1191177 1185580 850689 887515 787814 761580 427791 37351 284603 652862 795794
21209 795794 563630 253833 362659 663022 638154 369957 364951 134482 87943 324647
21199 324647 361986 302844 417473 730330 1002672 984438 892541 1087368 750709 476436
21189 476436 767983 820846 455083 107025 329449 971770 802002 535457 437423 346099
21179 346099 420792 681698 889482 358294 63819 416308 645942 551744 722606 805134
21169 805134 400941 65769 -33073 401556 761013 793696 800977 540989 439745 476121
21159D76121p8497l2194q6173k2177O6998J5300O531M12444J90009m71133m7903
21148D29326N752J61955J5997n8114m39012l03986l4596K98241p6859k74404L03298
21137B7598M40193N9952q4672k88929k5363j10197J40564k13851k17087K16621
21127e5171L41042j83005j54413J71253m6147K7420K89711J43884r3585k94143
21117A46846M1473J028J43528J56126j87853P9157k48456j07619J42537P8901
21107B45668L05331j21488l6165j20587l66238j47113J79422j5932j23133J41295
21097e8940j75581j93420K95199K62930J5871P338N7417j68151k0524J33942n275
21086A50806K66610K46170k57037k13732L15472J61654k99518j067N6570j46405
$$ plain form
21159 476121 397624 365430 279257 257080 324078 339378 345909 758353 948362 477229 429326
21148 429326 435078 597033 613030 554916 115904 -188082 -222678 75563 -1296 -275700 27598
21137 27598 467791 527743 443071 154142 128779 18582 159146 -54705 -271792 -55171
21127 -55171 285871 102866 -51547 119706 73559 100979 390690 534574 440989 146846
21117 146846 188319 189347 332875 489001 301148 380305 131849 24230 166767 245668
21107 245668 550999 429511 393346 272759 -93479 -240592 -61170 -77102 -200235 -58940
21097 -58940 -234521 -427941 -132742 130188 146059 153397 210814 42663 22139 156081 150806
21086 150806 417416 663586 406549 192817 508289 669943 370425 369358 425928 279523
21076B79523J48523K31445j95467j40129M0893k56735o7990N3758o12n1716J49364
21065A90857K32653K09088k32431j80918l6791n6741k27428l72416j48168L79308
21055b42987R5834q2986j08066j87491L00434J38683J40689o0858j8587K8136
21045B801J53356P1526m48051l36722L57460L04210M3342K106O8698q2192J88890
21034C25424n469j75379k45568j70088K46038M6611J38196J51153n2180k12316
21024D6422j48805K31224r6085o0998r5811k39080K0215J32966J36971Q3523K82922
21013B93464J54193J48335k64802m92165M9060o0709K56788Q0765j32930K02127
21003B34126L99675J22957l62521l29709L25871j41978j59045l09674p2696J73359
$$ plain form
21076 279523 428046 659491 464024 323895 364788 108053 40063 93821 93209 41493 190857
21065 190857 423510 632598 400167 219249 182458 125717 -101711 -474127 -622295 -242987
21055 -242987 -147153 -230139 -338205 -525696 -225262 -86579 54110 -6748 -25335 2801
21045 2801 156157 227683 -220368 -557090 -199630 104580 147922 150028 218726 136534 325424
21034 325424 319955 144576 -100992 -271080 -25042 21569 159765 310918 258738 46422
21024 46422 -102383 128841 32756 -28242 -124053 -363133 -342918 -209952 -72981 10542 293464
21013 293464 447657 595992 331190 -160975 -111915 -172624 84164 164929 31999 234126
21003 234126 633801 756758 394237 64528 390399 248421 89376 -220298 -292994 -119635
20993a19635p9858M6169P8756k3241l31446K34717J22851r5784L0650M87428J7129
20982C67736j29364j96059k06159N1028O6005j75160l3476K12061m1391k0882
20972a05661L00277O4808M7114j12070M2826K06771K55327j7933k41575J71692
20962F11576l68383m26949l39158k0367J09469J08916Q7907j99167J42154K12370
20952h1632N55230K06348k07267m95961m62129O9484K42973l57281l28966L71976
20942d87225Q6493l10809k15395L72227J85941N5310K8409P6024M09024N1532
20932B51531q3520k44045N3752L03946m3055J15480j9869j8366O1047R4862K84955
20921G56718k05434n63370m05708k2081K28492L7759r2097J29898l9645k5751
$$ plain form
20993 -119635 -199493 -153324 -74568 -97809 -429255 -194538 -71687 -167471 -136821 350607 367736
20982 367736 238372 42313 -163846 -112818 -46813 -221973 -255449 -43388 -84779 -105661
20972 -105661 194616 259424 306538 194468 237294 444065 699392 681459 439884 611576
20962 611576 243193 -183756 -522914 -543281 -433812 -324896 -236989 -436156 -294002 -81632
20952 -81632 473598 679946 472679 -23282 -485411 -415927 -172954 -530235 -859201 -487225
20942 -487225 -400732 -711541 -926936 -554709 -368768 -313458 -285049 -209025 199999 251531
20932 251531 168011 -76034 -22282 281664 238609 354089 334220 315854 376901 471763 756718
20921 756718 551284 -12086 -417794 -439875 -211383 -173624 -265721 -135823 -175468 -201219
20911b01219j26043m3211M0903M30582J18276J03595Q2652J6879j80140k54229
20901a1955m35765m9362K03657J63594K71111R5911n63856j77437O2857O4902
20891c76343L50244M46584L65396l49349m83434N8128m3384j44695j25386L1305
20881b70934M27887L0641l43691n6890p188J03148J84131q4546m4773J19585o411
20870E0959k05123l13805O4426K02306L31441K13661Q1574K25740k64437k88228
20860I8514l09922m43627K57054p733L5925N189k09072L33045r6907j48447J75659
20849c10322J85473m1820l04675P1196m9706k8293J68582Q5493k23882k57677
20839g05631j11331L95874K14269j58420N5219J05232l5406J76390L8972l38353
$$ plain form
20911 -201219 -327262 -370473 -329570 101012 219288 322883 405535 422414 242274 -11955
20901 -11955 -447720 -497082 -293425 -129831 141280 237191 -326665 -504102 -441245 -376343
20891 -376343 -26099 420485 785881 436532 -46902 11226 -32158 -176853 -302239 -270934
20881 -270934 156953 187594 -156097 -212987 -220175 -117027 67104 -17442 -62215 57370 50959
20870 50959 -154164 -467969 -403543 -201237 130204 343865 425439 651179 386742 98514
20860 98514 -211408 -655035 -397981 -405714 -369789 -364600 -573672 -240627 -337534 -485981 -310322
20849 -310322 -124849 -166669 -471344 -400148 -449854 -478147 -309565 -224072 -447954 -705631
20839 -705631 -816962 -421088 -206819 -365239 -310020 -204788 -240194 -63804 -24832 -363185
20829c63185j20905J88773J5609l58583K87172J94089J01877J40904o5916J06562
20819A26397J98872j99798m0404r8639R0132j01520M887j69383R1297P5703j09495
20808a31951k86641l8032L9977K17389K22629N1839k38995J57828J1713j25760
20798a20004k41295R0993J46603j6654r885j26395O6553l0776k78330j42886J10166
20787e51910N3884q2177k20183K53299K31895J19565K45793J26612n9377K922
20777A20323j45871l75689K5325L1929J61264M37655j56083j23219k76641j09767
20767d10774K67764o9436J20841k70556J16915m4265O1348K58665r6932K4499
20757d1931M5402Q4226l38158k16767L27250k047j41464L9768K62081Q9576l55309
$$ plain form
20829 -363185 -484090 -295317 -279708 -638291 -351119 -157030 -55153 85751 19835 126397
20819 126397 325269 125471 85067 -13572 76560 -24960 -20073 -189456 -98159 -22456 -131951
20808 -131951 -418592 -456624 -416647 -199258 23371 75210 -163785 -5957 5756 -120004
20798 -120004 -361299 -270306 -123703 -140357 -150242 -276637 -210084 -240860 -519190 -662076 -551910
20787 -551910 -498026 -580203 -800386 -547087 -315192 -195627 50166 176778 117401 120323
20777 120323 -25548 -401237 -375912 -343983 -182719 254936 98853 -24366 -301007 -410774
20767 -410774 -143010 -212446 -91605 -362161 -245246 -289511 -228163 30502 -66430 -41931
20757 -41931 3471 87697 -250461 -467228 -139978 -142025 -283489 -243721 18360 107936 -247373
20746b47373j63229J34037k64659l8159L35114j31816R5713L10591J84393j45700
20736F8912p2038l28704k77333p4605J0521l5089K73274P2312q1305O5616l2811
20725d11250j43786k34102J79515L46477L50013l2351l40004m0847k3205m3737
20715c93277M1250p5888p2069Q7074j83688L06308J87191l17054k34145L2012
20705f22286M07968L35472p3557k90136l7298R2934K13281J76051j41885k6534
20695C4010j39694K8643j76804k44990k543R8481L19716k06664J00299J45764
20685d3782l96150j91744M02994L23107O0154r4813M9827l62636J39637k536J8721
20674i7221k58093m5016L98692k742L9518l7622l38895k59572k86760K36308L41271
$$ plain form
20746 -247373 -410602 -276565 -541224 -579383 -244269 -376085 -280372 30219 214612 68912
20736 68912 -3126 -331830 -609163 -683768 -673247 -708336 -435062 -362750 -444055 -378439 -411250
20725 -411250 -555036 -789138 -609623 -263146 86867 54516 -285488 -326335 -349540 -393277
20715 -393277 -352027 -427915 -499984 -412910 -596598 -290290 -103099 -420153 -654298 -622286
20705 -622286 -214318 121154 47597 -242539 -279837 -186903 26378 202429 60544 34010
20695 34010 -105684 -77041 -253845 -498835 -501378 -402897 -83181 -289845 -189546 -43782
20685 -43782 -439932 -631676 -228682 94425 154579 59766 109593 -253043 -113406 -115942 -97221
20674 -97221 -355314 -400330 -1638 -4380 35138 -2484 -341379 -600951 -887711 -651403 -310132
20663c10132K09285k10006j15030q2389J63188K66369j89896R595k7330J0287
20653b76059N3260j50051o0703J31127J18706k22760J35094O364o623j64353L41165
20642i4833Q7055J24438j0611j67273Q5223o8434j27606j43422j57088N5958k07743
20631f24336r8337n1731R3431J33300J05613J14692r6995J1280O4867K415L15049
20620c0752j40014l04839n4922k49785J790L43404J64395K48354r3752m01761
20610e17882K6339K51341K91015k1063k8212k43689j29934j03939J98651K51640
20600b5733k11339j51952K02721J22268q4410j08201j62502L30134J50882l11605
20590b49737j54450L3762j28304J81928J14559j01708k02365J22136K31901J18355
$$ plain form
20663 -310132 -100847 -310853 -425883 -508272 -345084 -78715 -268611 -259016 -286346 -276059
20653 -276059 -222799 -372850 -433553 -302426 -183720 -406480 -271386 -265022 -271645 -435998 -94833
20642 -94833 -7778 116660 106049 -61224 23999 -44435 -172041 -315463 -472551 -416593 -624336
20631 -624336 -722673 -774404 -680973 -547673 -442060 -327368 -424363 -413083 -348216 -345801 -30752
20620 -30752 -170766 -475605 -530527 -780312 -778522 -435118 -270723 -22369 -116121 -517882
20610 -517882 -491543 -240202 50813 29750 1538 -242151 -372085 -476024 -277373 -25733
20600 -25733 -237072 -389024 -186303 -64035 -148445 -256646 -419148 -89014 61868 -249737
20590 -249737 -404187 -370425 -498729 -316801 -202242 -303950 -506315 -384179 -152278 -33923
20580c3923l4854k79593j60079k05683o6639J3807n9374J33155j67896M7339K52972
20569e60768L8552j43548l31890o3956L04831M6149p6925L65614L77605k45067
20559b89403m98662k21650J41472J07668M15290K8688k49103j06420K19279J70768
20549b82073L7357j37193j5437l42530o7642k7321r2243M51316J85098J08132
20539a82536k78575k09062K09675P289J66555m7076o3198l5975K5912J84781k5398
20528b47608l83141j21911K22948K14982Q9067k33036N3719K32991j6918j0359
20518a99266m7995l4026J04401j37180k3874K4691L08694J74355r5764L2528j61458
20507e4894n9208k92032l1714r9416K10250j14874j39579j41794M08571N12276
$$ plain form
20580 -33923 -68777 -348370 -508449 -714132 -780771 -766964 -826338 -693183 -861079 -813740 -560768
20569 -560768 -522216 -665764 -997654 -1061610 -756779 -710630 -787555 -421941 -44336 -289403
20559 -289403 -788065 -1009715 -868243 -760575 -345285 -316597 -565700 -672120 -452841 -282073
20549 -282073 -244716 -381909 -397346 -739876 -807518 -834839 -927082 -475766 -290668 -182536
20539 -182536 -461111 -670173 -460498 -453209 -286654 -333730 -396928 -432903 -406991 -222210 -247608
20528 -247608 -630749 -752660 -529712 -314730 -225663 -458699 -404980 -171989 -188907 -199266
20518 -199266 -247261 -281287 -176886 -314066 -337940 -313249 -4555 169800 74036 106564 -54894
20507 -54894 -114102 -406134 -437848 -537264 -327014 -441888 -581467 -723261 -314690 197586
20497A97586l9272O906l7290l93861k31705R3739M505J78900m6939l01572J76252
20486c92751O6370J28994j01730N356J74123j45233k13296K99296L27612l30798
20476a82057r5193L6688n79283k09723P5694L61923j8794l8367L15677L66113
20466C2678k73499m15944p1979N4378j24343l5680q5621M40615M41327j48013
20456a86081k58125k42981O4702K38790R0864m1974j43017O0520O4339j58596
20446e11559j32781J50858k7150J23465L36465L00378k45741j99696k76001j353
20436d83115P7442Q2812N323j85826o2258P3215k63088k4785M95294j37371J06314
20425c16043r0658k43724k26110K93231L20487N5010j53814r8522k21028J74515
$$ plain form
20497 197586 158314 165220 127930 -265931 -497636 -403897 -399392 -220492 -267431 -569003 -392751
20486 -392751 -326381 -197387 -299117 -293761 -119638 -264871 -478167 -178871 148741 -182057
20476 -182057 -277250 -240562 -819845 -1029568 -953874 -591951 -610745 -649112 -333435 32678
20466 32678 -240821 -656765 -728744 -674366 -798709 -834389 -920010 -479395 -38068 -186081
20456 -186081 -444206 -687187 -622485 -383695 -292831 -334805 -477822 -417302 -352963 -511559
20446 -511559 -644340 -493482 -520632 -397167 -60702 239676 -6065 -205761 -481762 -483115
20436 -483115 -405673 -322861 -317538 -503364 -565622 -492407 -755495 -780280 -284986 -422357 -316043
20425 -316043 -406701 -650425 -876535 -583304 -262817 -207807 -361621 -460143 -681171 -506656
20415e06656M5354j93901j55277q3213l37594R4470M17062M12713j18147l15976
20405g41165j0554L18992p9150k80571j06522l4034J42266K93920K13837j85973
20395d68954Q245J64494P0212J18376r5485l43007l22095k92321L09351K79530
20385e71654J66140L3244K74552j47368k21853n4182o1774k10955J95728K60336
20375c37786Q7348l9050k3613K17895L9806j35718j05454J46292o4950M9721j03861
20364b69370m14835j98776j49866j1395K40674P3972Q276K10519K01506r1384
20354d00679k52917k89267J19085p6179N002R9131J66159K25428J28610j28069
20344d03696K44483J45473P6448L74828k43084K701j44585m7375R8509m5035l46173
$$ plain form
20415 -506656 -461302 -655203 -810480 -893693 -1231287 -1136817 -719755 -307042 -425189 -741165
20405 -741165 -751719 -432727 -511877 -792448 -898970 -933004 -790738 -496818 -282981 -468954
20395 -468954 -460709 -296215 -226003 -107627 -203112 -546119 -868214 -1160535 -851184 -571654
20385 -571654 -405514 -372270 -97718 -245086 -466939 -521121 -582895 -793850 -598122 -337786
20375 -337786 -250438 -289488 -313101 -95206 -55400 -191118 -296572 -150280 -215230 -165509 -269370
20364 -269370 -684205 -882981 -1032847 -1044242 -803568 -729596 -721320 -510801 -309295 -400679
20354 -400679 -653596 -942863 -823778 -899957 -894955 -795824 -629665 -404237 -275627 -403696
20344 -403696 -159213 -13740 62708 437536 194452 197153 52568 5193 103702 58667 -287506
20333b87506l4019p8073O9791J76011m8741l85830J15323L06088O8753r1209r0915
20322b80327J60575j21823q9870K65664Q5020J57570j6644k08119k3871j90627
20312b62452l7714K3758m2990Q6270J9825K16169k96340k35299k98710P900K92788
20301e26795l6790K00412n9648Q4821j78185n1724j69985l5394m5441K85534L14845
20290b18350J0818J05386Q5232k77721k64526J67951M64786L1351j72718l91166
20280d58957j3512K3042J50798j57023M1371j75835k56617n4995L27869K3776
20270e50083l07545k01214K83580K42416k21774J57267M3121k16457K94163J88065
20260b88461N1845l143J98663r7181J48687j08498j24890j57529m17476J1565
$$ plain form
20333 -287506 -321525 -399598 -329807 -153796 -202537 -588367 -473044 -166956 -98203 -189412 -280327
20322 -280327 -119752 -241575 -331445 -65781 19239 176809 160165 -47954 -71825 -262452
20312 -262452 -300166 -276408 -319398 -233128 -213303 2866 -293474 -528773 -827483 -819583 -526795
20301 -526795 -563585 -363173 -422821 -338000 -516185 -567909 -737894 -773288 -818729 -533195 -218350
20290 -218350 -207532 -102146 -16914 -294635 -559161 -391210 73576 104927 -67791 -458957
20280 -458957 -472469 -449427 -298629 -455652 -414281 -590116 -846733 -901728 -573859 -550083
20270 -550083 -857628 -1058842 -775262 -532846 -754620 -597353 -554232 -770689 -476526 -288461
20260 -288461 -236616 -239759 -41096 -138277 10410 -98088 -222978 -380507 -797983 -786418
20250g86418N25975J28114L3276p5485j43718Q8614J28052p7596k35888N5518
20240c59556j80580j4920K2567K65538Q9604l5365K73223O1955l80370j24710
20230c82614q5558J12195P3653r0604k51990k68702J20849J84415O0190j12561
20220f40727m6838K37098j41971j93996k38064O1915K72634J8009k27671k9485
20210i29096j24825J87094L81151p7442J95577o4530p7466P4808J62536r0217
20200c62410k02958J20383P2270l150L3734j5330L5538J28925J7290l84210o0839
20189f20757Q9258J78774k7178j29878l43360J94343J05770J07866L33050L44455
20179B32343J98128n8912l85448m81380p7178M2748K31338K72890J25046J65931
$$ plain form
20250 -786418 -260443 -132329 -99053 -174538 -318256 -229642 -101590 -179186 -415074 -359556
20240 -359556 -540136 -555056 -532489 -266951 -177347 -212712 60511 122466 -257904 -382614
20230 -382614 -468172 -355977 -282324 -372928 -624918 -893620 -772771 -588356 -528166 -640727
20220 -640727 -687565 -450467 -592438 -786434 -1024498 -962583 -689949 -671940 -899611 -929096
20210 -929096 -1053921 -866827 -485676 -563118 -367541 -432071 -509537 -434729 -272193 -362410
20200 -362410 -565368 -444985 -372715 -375865 -342131 -357461 -321923 -192998 -175708 -559918 -620757
20189 -620757 -531499 -352725 -379903 -509781 -853141 -658798 -553028 -445162 -112112 232343
20179 232343 430471 371559 -13889 -495269 -572447 -529699 -298361 -25471 99575 265506
20169B65506k81390k62587J2535p6368r3442j47597r9276k38659K14644N86815
20159a19819K58363q3244o80763Q8298L18547L7572k14663K41039M47404Q7477
20149C80211j09344k32322m04603n23468J88781J41301N1119R686m5217R9031
20139d44825J02539j02417J43667j9232j55418j06131q072J35314j43095k08545
20129h06215q3011j10800J26699L02309K76177q3839l48423Q8734L69459N9426
20119b09484o5364j11457j36865K8923J18570k68875p5485K11709N2903J21495
20109c33930L37689M1923j27185J2507j58094K4229K0973q6729j17763L0731J02756
20098b52893M9513l92013r1325j06061M8770n7397j0300j18503J20661L97834
$$ plain form
20169 265506 -15884 -278471 -265936 -342304 -435746 -583343 -682619 -921278 -706634 -119819
20159 -119819 138544 55300 -625463 -537165 -218618 -181046 -395709 -154670 292734 380211
20149 380211 270867 38545 -366058 -889526 -700745 -559444 -508325 -498639 -543856 -444825
20139 -444825 -342286 -444703 -301036 -320268 -475686 -581817 -589889 -454575 -597670 -806215
20129 -806215 -889226 -1000026 -873327 -571018 -294841 -378680 -727103 -638369 -268910 -209484
20119 -209484 -274848 -386305 -523170 -494247 -375677 -644552 -720037 -508328 -455425 -333930
20109 -333930 3759 45682 -81503 -68996 -227090 -202861 -181888 -268617 -386380 -355649 -252893
20098 -252893 -203380 -595393 -686718 -792779 -744009 -801406 -811706 -930209 -809548 -411714
20088d11714M29125j4091k83527P5360K00804J22547M0642Q8728K49892q8505
20078D09261k29862k16348k14227J12422M1525k12444n880K7815j17626j11855
20068e17219l5961R7565K27790o8037k27647j95399J5780L28372m9267l18725
20058g42748N6201M44532L74051R4512j49876q6093o20381P9394N00432J38166
20048H8190m3190j37469K00328j2842o4069j26709k83873k73062M69440L30695
20038A47439k9577k21231k73579p7845j57951k13269Q839O7264L68231l9131m56709
20027h77519n5613L49975K48408N1411k754J30731Q7588J03085k08882l73535
20017e47105r016n8474R9534J58233K57200R6122P5549P9628n6140l03833j91141
$$ plain form
20088 -411714 17411 3320 -280207 -204847 -4043 118504 159146 247874 497766 409261
20078 409261 179399 -36949 -251176 -138754 -97229 -309673 -315553 -287738 -405364 -517219
20068 -517219 -553180 -455615 -227825 -295862 -523509 -718908 -703128 -374756 -424023 -742748
20058 -742748 -686547 -242015 132036 226548 76672 -9421 -629802 -550408 -49976 88190
20048 88190 45000 -92469 107859 95017 30948 -95761 -379634 -652696 -183256 147439
20038 147439 117862 -103369 -376948 -454793 -612744 -826013 -817174 -749910 -381679 -420810 -877519
20027 -877519 -933132 -583157 -334749 -283338 -286092 -155361 -67773 35312 -173570 -547105
20017 -547105 -556121 -614595 -515061 -356828 -99628 -3506 72043 151671 95531 -208302 -399443
20006c99443l33006O3337k34294J30891J7009L6581q5493K08623J37380R3468
19996c64947J6645j5018k81151L3660L45462K183k21842J59284k8274J91952J10486
19985e1560q4893k34635k14734l690K65209j14016R7149l80087p0634j30681P2782
19974h49790K75123L2338M1526K3954k50665r5853k19232J83663L52714K7819
19964d78403p0414j10570l9455R2477r971j38466k5106l0086P9387J99869k55688
19953g86426l25555k2488J52068J42299L24315j2738p7751M60796p1917l68488
19943e85885k70804L661m8470J57026O6843K87198J11658J9368n9443m68652l7062
19932h24562J74785J09412K87321J69006k00978k39519K09041K25733k17110l88900
$$ plain form
20006 -399443 -732449 -669112 -903406 -772515 -755506 -718925 -804418 -595795 -458415 -364947
19996 -364947 -348302 -363320 -644471 -610811 -265349 -263166 -485008 -325724 -353998 -162046 -51560
19985 -51560 -136453 -371088 -585822 -589512 -324303 -438319 -341170 -721257 -791891 -922572 -849790
19974 -849790 -574667 -542329 -500803 -476849 -727514 -823367 -1042599 -858936 -506222 -478403
19964 -478403 -548817 -659387 -698842 -606365 -616336 -754802 -779908 -809994 -730607 -530738 -786426
19953 -786426 -1111981 -1134469 -982401 -840102 -515787 -528525 -606276 -145480 -217397 -585885
19943 -585885 -856689 -853028 -901498 -744472 -677629 -390431 -278773 -259405 -318848 -787500 -824562
19932 -824562 -649777 -540365 -253044 -84038 -285016 -524535 -315494 -89761 -306871 -695771
19922f95771J26534J39198m1955l2932J60639M12000p9926l83383P5493L59016
19912C8913N4431l03682k80444j34315l82721J53877J36191l67519J02319J6240
19902i66710L44063K19637m2688m20979K5028L8370k8913L72027k4634l20862
19892h05661j47551J39824K27441k15356j52791M70805N69885k96592m51268k52213
19882i13477J5305J61674K47725N2189m7979j70798p4421o8431r7072l21434m9414
19871a266133R2860M50379J90795J98329k01314J7340J33654o659j61684j29254
19861f81687L2290j94069q7123L40857J25014k74112o952K22330J68566K22444
19851a32442j00263l49407J92465J46116K36017k05741k88584M2832q918l7238
$$ plain form
19922 -695771 -569237 -430039 -471994 -504926 -344287 67713 -12213 -395596 -320103 38913
19912 38913 93344 -210338 -490782 -625097 -1007818 -853941 -717750 -1085269 -982950 -966710
19902 -966710 -622647 -403010 -445698 -866677 -841649 -803279 -832192 -460165 -484799 -805661
19892 -805661 -953212 -813388 -585947 -801303 -954094 -483289 86596 -209996 -661264 -913477
19882 -913477 -898172 -736498 -488773 -436584 -484563 -655361 -729782 -798213 -895285 -1216719 -1266133
19871 -1266133 -1173273 -722894 -532099 -333770 -535084 -517744 -384090 -390749 -552433 -681687
19861 -681687 -649397 -843466 -930589 -589732 -464718 -738830 -745782 -523452 -354886 -132442
19851 -132442 -232705 -582112 -389647 -243531 -7514 -213255 -501839 -459007 -467925 -505163
19841e05163j36736j70332K29177L87675J81094k33346m66380m7556R4963j3951
19831f80555n9069J7632P4876j16538M2968L53419J58617l37350j96830J62463
19821e80367O2687j03355L36006J45941j9338o4937j51270J22399J89129k29367
19811b92472k19299q7021P25J84494J1066j57774m0558p1157p5403k9822J65141
19800f12080j27604l4471j86234J01739L31121k04867O0736J60206j22552J92572
19790d41434J29240O9633k02521l8006k42486K64640L01787k65911j98812J23445
19780e00425r5654q8391J10961j47970J68188j42591O8281j70904J7062K30532
19770e50911L71720J71986k39021k79157j85794L4144j20634o4133J57252L15943
$$ plain form
19841 -505163 -641899 -812231 -583054 -195379 -14285 -247631 -714011 -761567 -666604 -680555
19831 -680555 -739624 -721992 -647116 -763654 -720686 -367267 -208650 -546000 -742830 -580367
19821 -580367 -517680 -621035 -285029 -139088 -158426 -223363 -374633 -252234 -63105 -292472
19811 -292472 -511771 -598792 -598067 -413573 -402507 -560281 -600839 -671996 -747399 -777221 -612080
19800 -612080 -739684 -774155 -960389 -858650 -527529 -732396 -671660 -511454 -634006 -441434
19790 -441434 -312194 -242561 -445082 -483088 -725574 -460934 -159147 -425058 -623870 -500425
19780 -500425 -596079 -684470 -573509 -721479 -553291 -695882 -627601 -798505 -781443 -550911
19770 -550911 -179191 -7205 -246226 -525383 -711177 -677033 -797667 -861800 -704548 -388605
19760c88605L63037o6034j49519k98072l92324j94076K10229J83368O6167J36446
19750e29383O9252j61331J6951M46367J65026K8285m2785m3874q4997l49696j14769
19739f00954n8650n064K75430L75350r8355l54339J86464n8873R0959j54763N779
19728c97016n8045k39969j13234L5746J68070J45688J25711m1609j59328K39481
19718b94505J71436k39675l22747L5471L01160O4577j29348l1910Q7936r1531
19708d49136l97017j90169r6790N8775K5101J16733M84984J22930n9573l2185
19698d16347K13704k74961k03891J10246J48901J98543L8095j96680N5999Q4725
19688b41666J85182k0510J8517K01230j32858k05536J10494j6546n0838k35264
$$ plain form
19760 -388605 -25568 -91602 -241121 -539193 -931517 -1125593 -915364 -731996 -665829 -529383
19750 -529383 -460131 -621462 -604511 -158144 6882 35167 -7618 -51492 -136489 -486185 -600954
19739 -600954 -659604 -664668 -389238 -13888 -112243 -466582 -280118 -338991 -248032 -402795 -397016
19728 -397016 -455061 -695030 -808264 -772518 -604448 -458760 -333049 -374658 -533986 -294505
19718 -294505 -123069 -362744 -685491 -650020 -348860 -284283 -413631 -445541 -357605 -449136
19708 -449136 -846153 -1036322 -1133112 -1074337 -1049236 -932503 -447519 -324589 -384162 -416347
19698 -416347 -202643 -477604 -681495 -571249 -422348 -223805 -185710 -382390 -326391 -241666
19688 -241666 -56484 -76994 -58477 142753 9895 -195641 -85147 -101693 -152531 -387795
19678c87795j54116n5650M97K74397L08706L2579R1763k23257o5365j63947l20175
19667f62363N0959K03438P3179L0192j88981n6055L35084m2560n01310J38365
19657f20052J88789l73812Q4507J45714L4197J54273K0242K50049M8647P7667
19647A0221l49107l44513l26384k05184k5267j04211M91911N76618J28915J09939
19637c7062j69312k78043k6023J83794Q7054j30710k17744r6152M7260K57735
19627c79203J29835m56862p1940K32223K17891J12173k81877M600R4776j36778
19617e35162m6799O5368l3935L36201K46316k04738l53361q0372k05314L53911
19607d57885J62325l09869k46966l32052J51566K38087K58718J69723j10483j17058
$$ plain form
19678 -387795 -541911 -597561 -597064 -322667 -13961 18618 110381 -112876 -178241 -342188 -662363
19667 -662363 -611404 -407966 -334787 -304595 -493576 -549631 -214547 -257107 -758417 -620052
19657 -620052 -431263 -805075 -720568 -574854 -540657 -386384 -366142 -116093 -67446 10221
19647 10221 -338886 -683399 -1009783 -1214967 -1240234 -1344445 -852534 -275916 -147001 -37062
19637 -37062 -206374 -484417 -510440 -326646 -239592 -370302 -588046 -684198 -636938 -379203
19627 -379203 -249368 -706230 -778170 -545947 -328056 -215883 -497760 -493160 -398384 -535162
19617 -535162 -581961 -516593 -550528 -214327 31989 -172749 -526110 -606482 -811796 -457885
19607 -457885 -295560 -605429 -852395 -1184447 -1032881 -794794 -536076 -366353 -476836 -593894
19597e93894r826p111J78543L056K54378J39035j30097k15549K00097L54651L26
19586A73609k17050m86691r1279j16884J95082J27761k0685q6206P8638j2847
19576d56552o9302J2696j81833K33425J49419L08305K35546N5745j26877p806
19566A52766k28464l25953K25646k9227N2209j81261k51066N0995N2383n6442
19556e38414M18J46524K20903r2693p0539J86728M7558J1072l13492k08900O5156
19545e45679r6478M0897K52262K33523O9398K57136K37759k71244m92702j97161
19535e12289L6837J11421L982k75339L2322P2845l56422J7354L63476J58248r9642
19524d47207j30480L50511K48849j9724m05211J62013K33213r6384K10274l61078
$$ plain form
19597 -593894 -603720 -610831 -432288 -429232 -174854 -35819 -165916 -381465 -181368 173283 173609
19586 173609 -43441 -530132 -621411 -738295 -543213 -415452 -436137 -522343 -443705 -456552
19576 -456552 -525854 -513158 -694991 -461566 -312147 -3842 231704 287449 160572 152766
19566 152766 -75698 -401651 -176005 -205232 -153023 -334284 -585350 -534355 -481972 -538414
19556 -538414 -537996 -391472 -170569 -263262 -333801 -147073 -99515 -88443 -401935 -610835 -545679
19545 -545679 -642157 -601260 -348998 -115475 -46077 211059 448818 177574 -315128 -512289
19535 -512289 -475452 -364031 -360049 -635388 -603066 -530221 -886643 -869289 -505813 -347565 -447207
19524 -447207 -577687 -227176 21673 1949 -403262 -241249 -8036 -104420 105854 -255224
19514b55224k78537k30463K0382q4675M1605p7882K18780R0917O8460R3051j20106
19503e13692j7867o0963P0731j0581j09252J45717J38742K97499J48159k54897
19493a66404k7722k30463j53311L51423K32883j79422l82691l28970K8217J38032
19483g18428P8054l61977Q9118J85651K1040L89792K95983j35175k1996l17437
19473d95375J06117O231p4214l21746Q1800K5391j87558k70J55497Q6371m09334
19462a027090k07210M10320M8975L91337J49146J000K287r0308N8193j37026k64836
19451f65212k68611K24942J67325N89997k7038m29836K58790K97323k7594K08319
19441C28405l66729n44030K72826l6966j13547o5320n0056N4902J77541p051k2399
$$ plain form
19514 -255224 -533761 -764224 -743842 -828517 -786912 -864794 -646014 -555097 -486637 -393586 -513692
19503 -513692 -531559 -592522 -521791 -532372 -641624 -495907 -357165 -59666 88493 -166404
19493 -166404 -194126 -424589 -577900 -226477 6406 -173016 -555707 -884677 -856460 -718428
19483 -718428 -640374 -1002351 -913233 -727582 -706542 -316750 -20767 -155942 -177938 -495375
19473 -495375 -389258 -383027 -457241 -778987 -697187 -671796 -859354 -859624 -704127 -617756 -1027090
19462 -1027090 -1234300 -823980 -775005 -383668 -234522 -233522 -231235 -321543 -263350 -400376 -665212
19451 -665212 -933823 -708881 -541556 48441 21403 -408433 -149643 147680 120086 328405
19441 328405 -38324 -582354 -309528 -346494 -460041 -525361 -575417 -520515 -342974 -350025 -372424
19430c72424r6639l0323j97931l2374K86624L3790j34803j47928M36327J23265
19420a32416k20880N2340K14025l08916l21451N2938J56164k3506j09515m1311
19410f82528J91941k73608k63041L8932K61438J84916l74389q1734P5338R043
19400i13692M68301J3774J13854m5908k08494n19790k2342J81766n0400K24298
19390g58633M08692K43191j06817o8210L14420m37q3792l4890J02471K33157j55489
19379I3663P0943k51739k72481o7160l39747K8897K96849J11367j307O4296k85393
19368e51812k81644j13782K98961J21030q3869J08492J37369L15100p6969j60829
19358b87953j26848J89402j36131l95910O846L11810m5482N1452n9468L70544
$$ plain form
19430 -372424 -469063 -499386 -697317 -729691 -443067 -409277 -544080 -692008 -255681 -132416
19420 -132416 -353296 -300956 -86931 -395847 -717298 -664360 -508196 -531702 -641217 -682528
19410 -682528 -490587 -764195 -1027236 -988304 -726866 -541950 -916339 -998073 -922735 -913692
19400 -913692 -445391 -431617 -317763 -363671 -572165 -1091955 -1114297 -932531 -982931 -758633
19390 -758633 -349941 -106750 -213567 -281777 32643 32206 -51586 -86476 15995 249152 93663
19379 93663 164606 -87133 -359614 -426774 -766521 -737624 -440775 -329408 -330715 -266419 -551812
19368 -551812 -833456 -947238 -648277 -527247 -611116 -502624 -365255 -50155 -127124 -287953
19358 -287953 -414801 -225399 -361530 -757440 -750594 -438784 -484266 -432814 -492282 -121738
19348a21738K86265j28572m8409j49199k23062M9867j48355j09664p3850k2986
19338f89703K92596M61883J80098J63826j86103l27851j95851o2424k82615N5424
19328e90720K47599j74163K60417n1994k93778o6085k27979J18187J65378J40901
19318d72237k8422J29630J17867j45924j52004P8898J52954j65903j82437K62886
19308d04692L6833j45731l3803J28968K52274k87784l98370O409K31237K41511
19298c73148J40985K92340J10557m14390l22930j46504k540M1102K81870M61980
19288F9322M5308j48350l22229j13739k63951r350J06630j98301O2154R2776L39007
19277c40723J66280m2584l14016j25826J71128M605Q3133K63583J70117j27865
$$ plain form
19348 -121738 164527 35955 -12454 -161653 -384715 -334848 -483203 -592867 -666717 -689703
19338 -689703 -397107 64776 244874 408700 222597 -105254 -301105 -363529 -646144 -590720
19328 -590720 -343121 -517284 -256867 -308861 -602639 -668724 -896703 -778516 -613138 -472237
19318 -472237 -500659 -371029 -253162 -399086 -551090 -472192 -319238 -485141 -667578 -404692
19308 -404692 -367859 -513590 -547393 -418425 -166151 -453935 -852305 -845896 -614659 -373148
19298 -373148 -232163 60177 170734 -243656 -566586 -713090 -715630 -674528 -392658 69322
19288 69322 114630 -33720 -355949 -469688 -733639 -742989 -636359 -834660 -772506 -679730 -340723
19277 -340723 -174443 -217027 -531043 -656869 -485741 -481136 -398003 -134420 35697 -92168
19267i2168o6558J16873j99534j73315J92255J62559l01991O676O4360j58009
19257d48852k08995j3365J4426j29219j15868P9686K59982K26881K2993j42939
19247d55270K18878J0916j84369j90805K3825Q7954J55484L37749K1573k72361
19237b46426j35362J90517K58526j45323r2275L3113J98285j10769l05268j07619
19227d62601r7151j56121K27701M29638L2449o6075l54679J7482K53187k5656
19217b01826k12737j8596J80163J72438o2671j89420r0941J05997j8299L3872
19207c02020L27653K04854k4633o5530p4918P4522n2938r3916k21880j25995j14086
19196d68887Q600K49807O764k17936m85526j35948K52598K98198j723L7026J39562
$$ plain form
19267 -92168 -158726 -41853 -241387 -414702 -222447 -59888 -361879 -355203 -290843 -448852
19257 -448852 -657847 -671212 -656786 -786005 -901873 -822187 -562205 -335324 -312331 -455270
19247 -455270 -236392 -225476 -409845 -600650 -576825 -488871 -333387 4362 25935 -246426
19237 -246426 -381788 -191271 67255 -78068 -170343 -137230 61055 -49714 -354982 -462601
19227 -462601 -559752 -715873 -488172 -58534 -26085 -92160 -446839 -429357 -176170 -201826
19217 -201826 -414563 -433159 -252996 -80558 -143229 -332649 -423590 -317593 -335892 -302020
19207 -302020 25633 230487 205854 140324 65406 139928 86990 -6926 -228806 -354801 -468887
19196 -468887 -460287 -210480 -203716 -421652 -907178 -1043126 -790528 -492330 -494053 -457027 -317465
19185c17465K45940J02787k1893l31219j57528j59573q1124K4690J84300K82280
19175b28805K03299r2609j66269k07301j44783Q5472P2771P0354j62265n423J78037
19164c97522J69826J35124R716l07446J28373K28935J00514J4417M8731K1589
19154A52257j45240j97844j6049K55136n6485K13096J4557j83121k87266k80508
19144e31467J02657L44269k3243j85846k32690n4404O4314R9625L4418p829k20162
19133f10358J1964j7685k74801M7402K4177R2001n6133k21730q4503L12693M18331
19122c58642K22288j46381j64226L70916J41887l80196J4900M2536l1815k21193
19112e09926k31390J54589Q6206j26967K6577j07546K94285J72514k56071K0948
$$ plain form
19185 -317465 -71525 31262 9369 -321850 -479378 -638951 -720075 -695385 -511085 -228805
19175 -228805 -25506 -118115 -284384 -491685 -636468 -550996 -478225 -407871 -570136 -575559 -397522
19164 -397522 -227696 -92572 -82856 -390302 -261929 -32994 67520 81937 130668 152257
19154 152257 7017 -190827 -206876 48260 -8225 204871 219428 36307 -250959 -531467
19144 -531467 -428810 -84541 -107784 -293630 -526320 -580724 -516410 -416785 -382367 -390196 -610358
19133 -610358 -598394 -616079 -890880 -843478 -819301 -727300 -783433 -1005163 -1089666 -776973 -358642
19122 -358642 -136354 -282735 -446961 -76045 65842 -314354 -299454 -256918 -288733 -509926
19112 -509926 -741316 -586727 -500521 -627488 -600911 -708457 -414172 -241658 -497729 -476781
19102d76781r7087J41575l0750l3558k67481j64860j94105J30254j68584j4355
19092a175732M37708J35168L1586r7420k08302K9897J51165L15226J80608j45498
19082c45594l2050p7986q893r2023L77852K15549m6848k9735j84947p9127O1879
19071b41923m1946j80520p169L03589m9023l52179k14424m4750J06264L62957
19061c59124L90114k55820j6685K3447P9558j0087j50075l1576J42848N9872j58169
19050b85697k79964j84657N1122N389N15840N13216J13362p5604k46301k46545
19040a19839k95775J67409K85476K54524L5222l93566R088K41581k17062m25933
19030d58875L0528N3524j30105J0668n2017L84656J36815R413j15744j50006k29391
$$ plain form
19102 -476781 -573868 -432293 -463043 -496601 -764082 -928942 -1123047 -992793 -1161377 -1175732
19092 -1175732 -738024 -602856 -571270 -668690 -876992 -847095 -695930 -380704 -200096 -345594
19082 -345594 -377644 -455630 -464523 -556546 -178694 36855 -9993 -39728 -224675 -303802 -241923
19071 -241923 -283869 -464389 -471558 -167969 -216992 -569171 -783595 -828345 -722081 -359124
19061 -359124 30990 -224830 -241515 -218068 -138510 -148597 -298672 -330248 -187400 -127528 -285697
19050 -285697 -565661 -750318 -699196 -693807 -177967 335249 448611 373007 126706 -119839
19040 -119839 -415614 -248205 37271 291795 327017 -66549 -57461 184120 -32942 -458875
19030 -458875 -428347 -374823 -504928 -494260 -546277 -161621 -24806 -15393 -131137 -281143 -510534
19019e10534p7952k0208K93796K05876K49182k68248k72755J18708J28387j39287
19009b93035M7977P2053k2163k3377P0713m2859q3739k13271k47246J7571K05980
18998e11396M38372k3539J02168m7922k48444J0522J16639j82099j74886J5728
18988e04857O9693J32560O0968j02870q165N6504L99996R668R74Q0575k82149
18977h7103k38954J69916k21858j93578K57111k0157j23570J13862L04259K62372
18967B22300J3519l66164j6181j66468K35511L26647m74888l86551J45017O595
18957d60663M51238K38100Q168k87514j36740j60187k09230J8903j5133K25680
18947c27378L65553j46248j90284j25363K90529L68955j80703l81703n1205K7758
$$ plain form
19019 -510534 -588486 -608694 -314898 -109022 140160 -128088 -400843 -282135 -153748 -293035
19009 -293035 -245058 -173005 -195168 -218545 -147832 -190691 -274430 -487701 -734947 -717376 -511396
18998 -511396 -73024 -96563 5605 -42317 -290761 -280239 -163600 -345699 -520585 -504857
18988 -504857 -435164 -302604 -241636 -344506 -352671 -296167 103829 113497 114471 195046 -87103
18977 -87103 -326057 -156141 -377999 -571577 -314466 -334623 -458193 -344331 -40072 222300
18967 222300 235819 -130345 -146526 -312994 -77483 249164 -225724 -612275 -467258 -460663
18957 -460663 -9425 228675 236843 -50671 -187411 -347598 -556828 -537925 -553058 -327378
18947 -327378 38175 -108073 -298357 -423720 -133191 235764 55061 -326642 -377847 -350089
18937c50089r3927J77293J07894P7287q8616M2707J17750o2142p1821N368O9151
18926f9145o8536n4570J3911k80705k07586L1313M41066j22032K44539j56362
18916b28107o8862J07026K1328j82827K03739j26449j50693l9164J89740K86787
18906A2518k42523m20397J3627M36708l7598m13073m3362J91648j83675N1409
18896f34718L05263j2489l66348K18320N3443j25714N7970J300J00242J93589
18886b09142L61292J70619J31202j85392m31168k81914K1095k36470J91975K7653
18876d40250k0058K63299K9290o2665N4269J15936q5831j14268j17093l667O3952
18865c17086K1771j86033k3519K44864Q0550j34813M8154K31333o1031K3757J41093
$$ plain form
18937 -350089 -444016 -266723 -158829 -81542 -170158 -127451 -9701 -71843 -143664 -138296 -69145
18926 -69145 -137681 -192251 -178340 -459045 -666631 -635318 -194252 -316284 -71745 -228107
18916 -228107 -296969 -189943 -168615 -351442 -147703 -274152 -424845 -464009 -274269 12518
18906 12518 -230005 -650402 -636775 -200067 -237665 -650738 -694100 -502452 -686127 -634718
18896 -634718 -329455 -341944 -708292 -489972 -436529 -562243 -504273 -502973 -402731 -209142
18886 -209142 152150 322769 453971 268579 -162589 -444503 -423408 -659878 -467903 -440250
18876 -440250 -460308 -197009 -167719 -230384 -176115 -60179 -146010 -260278 -377371 -381038 -317086
18865 -317086 -295315 -481348 -504867 -260003 -179453 -314266 -266112 -34779 -95810 -72053 69040
18854F9040R4610n54248m67672J19681M44906O5283r1055K39253J15973l89075
18844c53304k32489j34883q6016n5555K69098R1367L26271K5721l57499o11q586
18833e16486N3353L39603M61031m7579l24912o5013j34317k1183L60479j3818
18823I1158q8619l2282k35679J74581K16442j41881k12466k45358J67319L10247
18813C462M39391K887k03868j05319k26758j12812q2807oJ47613M86917l3317
18802C15383r0401k56346j07863K51451K66646k16621K5046m3764m87696k33911
18792e78076K72221O2409p0381l6878j4131M63715K08229k05685J67460J81383
18782D50266k76807M7984M4101r3437j0193p173q0496k5884J30154N8201k58506
$$ plain form
18854 69040 163650 -390598 -858270 -738589 -293683 -228400 -319455 -80202 35771 -353304
18844 -353304 -585793 -720676 -806692 -862247 -593149 -501782 -175511 -149790 -507289 -507900 -516486
18833 -516486 -463133 -123530 337501 289922 -34990 -100003 -234320 -255503 104976 91158
18823 91158 2539 -29743 -265422 -90841 125601 -16280 -228746 -474104 -306785 3462
18813 3462 442853 445740 241872 136553 -90205 -203017 -285824 -285830 -138217 348700 315383
18802 315383 224982 -31364 -139227 112224 378870 162249 187295 143531 -344165 -578076
18792 -578076 -305855 -243446 -313827 -350705 -364836 98879 307108 101423 268883 450266
18782 450266 173459 221443 265544 172107 161914 154741 74245 48361 178515 236716 -21790
18771b1790k93880K13324J09674R4822J15999j43216J0155j45361o4492J80323
18761E5558n1019O5153l8602k1403p9631j64682N158r3927j22372J08840L82365
18750D5438K20868M0509P2162j87178j39799p4895M7791J04703J73110m68343
18740a65634k24224r711J62760r8464k13473K60750J09473r0912M20654R0882
18730B42101J44937Q4926m58578o6227l64827j89961K98004P3043J77456k2764
18720h1890J87675k80909N5086J31207j19298O313K63769m9640Q9160m0142k91362
18709a30031J03567J33932j8207J41716j4537k09396j00001R3752l4352k75699
18699c09256j32286J75020K63294K89758j43042J11892L7068k22045r5862J60097
$$ plain form
18771 -21790 -315670 -102346 7328 102150 218149 74933 85088 -60273 -124765 55558
18761 55558 4539 69692 31090 9687 -69944 -234626 -229468 -323395 -445767 -336927 45438
18750 45438 266306 306815 378977 191799 52000 -22895 24896 129599 302709 -165634
18740 -165634 -389858 -399569 -236809 -335273 -548746 -287996 -178523 -269435 151219 242101
18730 242101 387038 471964 13386 -52841 -417668 -607629 -309625 -236582 -59126 -81890
18720 -81890 105785 -175124 -120038 11169 -108129 -101816 161953 112313 201473 161331 -130031
18709 -130031 -26464 107468 89261 230977 216440 7044 -92957 795 -33557 -309256
18699 -309256 -441542 -266522 -3228 286530 143488 255380 292448 70403 -25459 134638
18689A34638l54223j5596N4928q1117J51611J17686K00048l78689j9315J50959
18679c9070K50814p4184o5029r8676j72198N4717K1160J85059M8749L9281L10981
18668D61604J62781o2689k10987n7558j15796n2418J59283J50354j46755j04608
18658A83211K2672l3404j74789j06947p4919j26905L76295M66736m08834n5612
18648F7504L2725J00796N992R8642k73874j01930J70173J68636J92300j89073
18638B71891J11105j85863j71722m0889K30924K06768l97419m1956J23213N91222
18628F97274K21663j5257J78645l4052K7779K32436L34212j05503j1439j35183
18618A390575j85823k93127j29769J43175O4868j81793J02377J74778q2130J84024
$$ plain form
18689 134638 -219585 -235181 -180253 -261370 -109759 7927 207975 -170714 -190029 -39070
18679 -39070 211744 137560 72531 -26145 -198343 -143626 -122466 62593 111342 150623 461604
18668 461604 624385 561696 350709 293151 177355 124937 284220 434574 287819 183211
18658 183211 205883 172479 -2310 -109257 -184176 -311081 65214 531950 123116 67504
18648 67504 100229 201025 207017 305659 31785 -70145 100028 268664 460964 271891
18638 271891 382996 197133 25411 -15478 215446 422214 24795 -17161 106052 697274
18628 697274 918937 903680 1082325 1048273 1076052 1308488 1642700 1537197 1525758 1390575
18618 1390575 1204752 911625 781856 925031 989899 808106 910483 1085261 1003131 1187155
18608A187155p2317J07334j36665l61721j72850j80972n1220J1818K06568K6540
18598E63670J82857p6168q2554k26275j55339K93204k3332L0156K0926J30707
18588F57852j0554L5050k71703k28858Q5990L33880Q0737J92951K89979p4700
18578A090624K71440l7745J3148l19618r8370n4199O67022O58328L4718n6718
18568B168630q9987n1293p3355R4227M02112P2612p4047j97061O8176K57037k08273
18557B368778k46883K1729k99102n52659j82673J19953J41958K07238J333l2875
18547A546797Q746k07500O7786J51743J71431k31014k88614j55397j86662J45048
18537A022364K26577J3446m2593r671r8066n55193j78111Q5537J63121j05690
$$ plain form
18608 1187155 1114838 1222172 1085507 723786 550936 369964 318744 330562 537130 563670
18598 563670 746527 670359 587805 361530 206191 499395 476063 506219 527145 657852
18588 657852 647298 682348 410645 181787 267777 601657 682394 875345 1165324 1090624
18578 1090624 1362064 1324319 1337467 1017849 919479 865280 1532302 2190630 2225348 2168630
18568 2168630 2078643 2027350 1953995 2048222 2450334 2522946 2448899 2251838 2320014 2577051 2368778
18557 2368778 2121895 2143624 1844522 1291863 1109190 1229143 1371101 1578339 1579672 1546797
18547 1546797 1555543 1348043 1415829 1567572 1739003 1507989 1219375 1063978 877316 1022364
18537 1022364 1248941 1262387 1219794 1210123 1112057 556864 378753 464290 627411 521721
18527E21721q7340j82605j40976M13085J88638q751J01326M879R5876j93402k16779
18516D95672r6149J83184K39459K3164J57872K52191j96627k56829l98179j87020
18506B16738K84503J71189O686J43246L400j99252q996J14559J21359j35698L73106
18495A090840K71596K04090m27328l68683K01837q8390r5514l93695j28512J17815
18485C84056k12852q7171M487J21419J39294J15626J64771O1826k15856j93268
18475B82332M23254j23190k01978k61770j64699O2925q8228j3191J29666K86568
18465C31689K68994J39412L0005k24703q369j80088l63738j598j41485O7041L69777
18454B86937O14665J97152r2457l04420k37268j1227m4040P180K26053J39093
$$ plain form
18527 521721 434381 251776 110800 523885 712523 703772 805098 809977 905853 712451 495672
18516 495672 399523 582707 822166 845330 1003202 1255393 1058766 801937 403758 216738
18506 216738 501241 672430 679116 822362 825762 626510 617514 732073 853432 717734 1090840
18495 1090840 1362436 1566526 1139198 770515 972352 883962 788448 394753 266241 384056
18485 384056 171204 84033 88520 209939 349233 464859 629630 691456 475600 282332
18475 282332 705586 582396 380418 118648 -46051 16874 -71354 -84545 45121 331689
18465 331689 600683 740095 770100 545397 537028 356940 -6798 -8396 -149881 -82840 286937
18454 286937 901602 1098754 1006297 701877 464609 453382 409342 416522 642575 781668
18444G81668r2956k29401k51571j1100L66914j3690m1368k04241j98234J98641
18434C04662P5186j97507K21042M60966j48744k42029K20810k71937l47056r555
18424F5838L55427l9588j19830M191K08112k21506O2183J76661N7633R6525Q3906
18413G29552J72972J11105j17206J55168j37325N4813R9880k12483O1183k26923
18403F90736N2311L49159K74505l7909J15573J42411L69546J87538l25503N7972
18393A876339K21216N7561J26713j30134N4870j26137j41129j34097k14379O1239
18383A652062J16706L6966J53459j61223J34656k11508j55424J8459J99890j69812
18373A614231n0485k21481L33100K19754l22594j32772M04535J02189K63565L0260
$$ plain form
18444 781668 688712 459311 207740 196640 563554 549864 508496 304255 106021 304662
18434 304662 379848 182341 403383 864349 715605 473576 694386 422449 75393 65838
18424 65838 421265 381677 261847 266038 474150 252644 314827 491488 549121 645646 729552
18413 729552 902524 1013629 896423 1051591 914266 969079 1068959 856476 917659 690736
18403 690736 743047 1092206 1366711 1328802 1444375 1586786 1956332 2143870 1818367 1876339
18393 1876339 2097555 2155116 2281829 2151695 2206565 2080428 1939299 1805202 1590823 1652062
18383 1652062 1768768 1805734 1959193 1797970 1932626 1721118 1565694 1584153 1784043 1614231
18373 1614231 1563746 1342265 1675365 1895119 1572525 1439753 1844288 1946477 2210042 2240302
18363B240302j61905k97789o1943L68836K77383N5779M71385J09203m00187j19725
18353B481339n6208l9074J06070n7224j28229k48944N04447K29692k0286j92239
18343B579344k50296k91238j84455M8000J2837J97258r9310k92198j40359n7707
18333A521876K13063J76987K2039R8071j29299P0055J94867L8460o7597m6516
18323B092006K58234k13030j11375q7526P5981j19939q1341j77129l1500L76709
18313A981090j90854p4406J46589n6055k4744P7412j07821N4340M11285K50197
18303B467033n7770k08990k20813j21344o8280N7529k6606r7495Q9527M5779l41537
18292A517033k91127k65340J99157J43799J03420J87494j4641J82800Q096o8444
$$ plain form
18363 2240302 2078397 1780608 1718665 2087501 2364884 2420663 2892048 3001251 2601064 2481339
18353 2481339 2425131 2386057 2492127 2434903 2306674 2057730 2562177 2791869 2771583 2579344
18343 2579344 2329048 2037810 1853355 1901355 1914192 2111450 2012140 1719942 1579583 1521876
18333 1521876 1734939 1911926 1933965 2032036 1902737 1972792 2167659 2206119 2138522 2092006
18323 2092006 2350240 2137210 2025835 1938309 2014290 1894351 1813010 1635881 1604381 1981090
18313 1981090 1790236 1715830 1862419 1806364 1781620 1859032 1751211 1805551 2216836 2467033
18303 2467033 2409263 2200273 1979460 1858116 1789836 1847365 1820759 1723264 1812791 1858570 1517033
18292 1517033 1225906 960566 1159723 1303522 1406942 1594436 1579795 1762595 1770691 1702247
18282A702247k6934J61430m52112l29724M8219r7148K31102J83221j27431l09192
18272I83678l59219J77956N4658L56661L38958L47157J68112O6249k2208k06043
18262A905959j55050K74194J66865J57358N9220k83659k58088J12567M6408K22697
18252B248471K45278k01719l614k2166r6823j75149J4658K70098n4348m74006
18242A750680o8738r894k27181J26913l0087j17627K98714M1446q6987L1311o7104
18231A641446m08079q1172L95589K87306m01328j87473M8705M0467J22964J62647
18221A621072P1923K43329J63520J67850M4504K05595L62164L34958Q3865l46037
18211B952743p0576M26024o7934K26698l4913j12811o7167o6502K0853P3902J11314
$$ plain form
18282 1702247 1675313 1836743 1384631 1054907 1103126 1005978 1237080 1420301 1292870 983678
18272 983678 624459 802415 857073 1213734 1552692 1899849 2067961 2134210 2112002 1905959
18262 1905959 1750909 2025103 2191968 2349326 2408546 2124887 1866799 1979366 2025774 2248471
18252 2248471 2493749 2292030 2288416 2266250 2169427 1994278 2008936 2279034 2224686 1750680
18242 1750680 1681942 1672048 1444867 1571780 1541693 1424066 1722780 1764226 1677239 1708550 1641446
18231 1641446 1233367 1152195 1547784 1835090 1433762 1246289 1294994 1335461 1458425 1621072
18221 1621072 1692995 1936324 2099844 2267694 2312198 2517793 2879957 3214915 3298780 2952743
18211 2952743 2882167 3308191 3240257 3466955 3432042 3319231 3252064 3185562 3206415 3280317 3391631
18200C391631K2586J06768J48141O6774l19683N2856K41053j98302N4601J15419
18190C681844J33242k49643L93005K74349k87004k91661N3594L19123J4322J00241
18180D141412J26419Q718r4436K59734O9745q9094J20453J76014j46561j7638
18170D554766M55668k1081j52846L21586L31365J99263J36187j43775N623K39567
18160E926323M6043j6106N9045N9389J82917M08638O49820N82011J49503j06453
18150G941130L4886J09512J39110K95772O21489M84618L44751k1153J53175O56713
18140A0760003O34341M77646J47890Q4502L06546P18152J191849P72917N70857
18131A5664703R12095J206591J849233J959865K274785L011685L203276L434918
$$ plain form
18200 3391631 3414217 3520985 3669126 3735900 3416217 3469073 3710126 3511824 3566425 3681844
18190 3681844 3815086 3565443 3958448 4232797 3945793 3654132 3707726 4026849 4041171 4141412
18180 4141412 4267831 4276549 4182113 4441847 4511592 4422498 4542951 4718965 4572404 4554766
18170 4554766 5010434 4989353 4836507 5158093 5489458 5688721 5824908 5681133 5686756 5926323
18160 5926323 5972366 5956260 6015305 6074694 6257611 6666249 7316069 7898080 8047583 7941130
18150 7941130 7976016 8085528 8224638 8520410 9141899 9626517 9971268 9950115 10103290 10760003
18140 10760003 11394344 11871990 12019880 12104382 12410928 13129080 14320929 15093846 15664703
18131 15664703 16576798 17783389 19632622 21592487 23867272 26878957 30082233 33517151
18123C3517151K575791J367398O71296N83659N63266Q25979J580189J084219O34311
18114D3403259O24615L68242O68001J381277J478954J358058J290220K068419
18106E2641045K490186L342657M125066N122181O158206P369430R316197J2355435
18098A02920403J5370819J9319567K4036563K8979127L2966442L5831085L4196927
18091B93620933K7652318K0153478J6752514J5980952J4051009O029255r467331
18084C84773128k4450671l2317459l2708712k9325570k3544970j6619226j0503893
18077B15302627n313383n21289L637393O717133Q382653R431795J0772007J3353878
18069B61762814J6213496J9115196J9328705J4636622O650075o38399n143711
$$ plain form
18123 33517151 36092942 37460340 38131636 38715295 39278561 40104540 41684729 42768948 43403259
18114 43403259 44027874 44396116 45064117 46445394 47924348 49282406 50572626 52641045
18106 52641045 55131231 58473888 62598954 67721135 73879341 81248771 90564968 102920403
18098 102920403 118291222 137610789 161647352 190626479 223592921 259424006 293620933
18091 293620933 321273251 341426729 358179243 374160195 388211204 394240459 384773128
18084 384773128 360322457 328004998 295296286 265970716 242425746 225806520 215302627
18077 215302627 209989244 209467955 213105348 219822481 228205134 237636929 248408936 261762814
18069 261762814 277976310 297091506 316420211 331056833 337706908 337068509 331924798
18062C31924798n688017l253713K46488K325197J590205O19978K567307O559871
18054C36892114J1976271J7846438K2600901K5263958K4028123J6117518J834322
18047D56559645j4422132k7821701l5276669l6348277l2781362k6867675k1832397
18040B61209432j9474752j8762238j7436673j6347266j5349776j4632916j4333404
18033A44872407j3213614j1779184r965437q436229p366605o278083m946438m198656
18025G8688161l652284l507333l141771k886074k929485k230868j826880j824003
18017E6689463j888476j676568j330153o82640o66798n82193p30965k18913L93696
18008D9306453J060078K044566K373673K676173K657075J672105K77217p86559
$$ plain form
18062 331924798 326236781 322983068 323229556 325554753 327144958 327764936 330332243 336892114
18054 336892114 348868385 366714823 389315724 414579682 438607805 454725323 456559645
18047 456559645 442137513 414315812 379039143 342690866 309909504 283041829 261209432
18040 261209432 241734680 222972442 205535769 189188503 173838727 159205811 144872407
18033 144872407 131658793 119879609 109914172 101477943 94111338 87833255 82886817 78688161
18025 78688161 75035877 71528544 68386773 65500699 62571214 60340346 58513466 56689463
18017 56689463 54800987 53124419 51794266 51111626 50444828 49862635 49131670 48912757 49306453
18008 49306453 50366531 52411097 54784770 57460943 60118018 61790123 62067340 61280781
18000F1280781j651462k943480m129860m814837n133767n022486m349692l239020
17992B9996177k529238k443249j896475j624774j279348j205901j013766j043763
17984A6959663r41089q28829p70665n13314l17403k27906m38272l54255m42129
17975A2125801l97142j14197k48971r8170n43033n58351l38376l75889m30457
17966I021215m35446l23638m1050k73853n15895l00619K2364j39554j08865n1578
17956F853081l12251l23881n68405n59052j15553j2090J8916m74789J06241L1773
17946D643990j79250q7672J59449l29760m14486j24926J3992M4711L1424k6901
17936C730571J68105k01777n29962r6554K99289J17142M5655r1407J45505L21712
$$ plain form
18000 61280781 59629319 56685839 52555979 47741142 42607375 37584889 33235197 29996177
17992 29996177 27466939 25023690 23127215 21502441 20223093 19017192 18003426 16959663
17984 16959663 16018574 15189745 14419080 13905766 13588363 13360457 12922185 12567930 12125801
17975 12125801 11728659 11614462 11365491 11267321 10724288 10165937 9827561 9451672 9021215
17966 9021215 8585769 8262131 8221081 7947228 7431333 7130714 7153078 7013524 6904659 6853081
17956 6853081 6540830 6216949 5648544 5089492 4973939 4961849 4980765 4505976 4612217 4643990
17946 4643990 4464740 4377068 4536517 4206757 3792271 3667345 3681337 3726048 3757472 3730571
17936 3730571 3898676 3696899 3166937 3070383 3369672 3486814 3532469 3441062 3586567 3908279
17926C908279Q6924J27190m09560O569l5001k26917J64346J65362K70022l1790
17916D025424j62518L3005R158k02783k24889L02122J49844J42111j19126k19030
17906C733318j2077J04349o8688J28939K3763J10643K0205J80832q4783J83620
17896D320121Q1627j22096J11917Q7438J90334K06882J84963J26269l93560l47879
17886D446016L15719J86033J9139L29405J79078J14792K27292R7692J60625O0752
17876F136543K30993N48120M46301N3521j56188K05563K91597K74561L92982N66409
17866H990402M13384K35291K66192L44424O76875O17072M05710Q84043O71637
17857A3505030J071307J125082J525431J684808K075944K758593L014912K459078
$$ plain form
17926 3908279 3995203 4122393 3712833 3719402 3684401 3457484 3621830 3787192 4057214 4025424
17916 4025424 3862906 3895911 3905069 3702286 3477397 3779519 3929363 4071474 3952348 3733318
17906 3733318 3721241 3825590 3756902 3885841 3909604 4020247 4040452 4221284 4136501 4320121
17896 4320121 4401748 4279652 4391569 4479007 4669341 4876223 5061186 5187455 4793895 4446016
17886 4446016 4761735 4947768 4966907 5296312 5475390 5590182 5817474 5915166 6075791 6136543
17876 6136543 6367536 6915656 7361957 7415478 7259290 7464853 7756450 8031011 8423993 8990402
17866 8990402 9403786 9639077 9905269 10249693 10926568 11543640 11949350 12833393 13505030
17857 13505030 14576337 15701419 17226850 18911658 20987602 23746195 26761107 29220185
17849B9220185K892128L016694L161960L921811N135372O815211Q103764J0123794
17841G2390919J3197244J6588695K1414787K7966946L6382094M6645539N9141339
17834B93727563P2433601Q0498239O7258206K1278561l3404360o5029982p3369568
17827C63392260o8905790n7979517m5614269l4557193k5944210j9604304j5175487
17820I5611490j2056037r398253p369610n885406m310379l474927k665303j987223
17812D8464352j915009j708190j975550k091068k255081k220522j935945j503166
17804C2859821j372352q60931l21514n53775m39627j68176k8300m51570p00584
17795B7962992r01577j545791j188093q47044r59929j473787j261334r47452r51731
$$ plain form
17849 29220185 32112313 35129007 38290967 42212778 47348150 54163361 62267125 72390919
17841 72390919 85588163 102176858 123591645 151558591 187940685 234586224 293727563
17834 293727563 366161164 446659403 513917609 535196170 501791810 436761828 363392260
17827 363392260 294486470 236506953 190892684 156335491 130391281 110786977 95611490
17820 95611490 83555453 74157200 66787590 60902184 56591805 53116878 50451575 48464352
17812 48464352 46549343 44841153 42865603 40774535 38519454 36298932 34362987 32859821
17804 32859821 31487469 30626538 30305024 29751249 29311622 29143446 29115146 28663576 27962992
17795 27962992 27061415 25515624 24327531 23480487 22520558 21046771 19785437 18837985 17886254
17786A7886254j168324q66890j008997o23040k39876o72837r51600n85927n70614
17777A1198149p54578m41767m66525l64021o37614n87258m20153l07181l97655
17768F821397j68331N3293k34160k47584l81861k81783p5907m34370n1381j46731
17758D852582m98531l04822j48949j30010r2053p4237O2317j06227l30825k93531
17748B935714j0210k29225k53586M4151q9388j41458j41648l21660k12509k50089
17738A330092R5147J98222L4638L0875l3812J61386k06806q0280N6426j25962
17728A459926O7587j93112N4242J97046l25605l4043j0938O9018L41133R9152
17718A724406j5371k86665n52858L05782K75836J67881k6631j64206J88732r1907
$$ plain form
17786 17886254 16717930 15851040 14842043 14219003 13979127 13306290 12354690 11768763 11198149
17777 11198149 10443571 10001804 9535279 9171258 8533644 7946386 7526233 7219052 6821397
17768 6821397 6653066 6706359 6472199 6224615 5842754 5560971 5485064 5050694 4999313 4852582
17758 4852582 4354051 4049229 3900280 3770270 3678217 3603980 3666297 3560070 3229245 2935714
17748 2935714 2925504 2696279 2442693 2486844 2397456 2255998 2114350 1792690 1580181 1330092
17738 1330092 1425239 1623461 1658099 1688974 1655162 1816548 1609742 1529462 1585888 1459926
17728 1459926 1527513 1334401 1388643 1585689 1260084 1226041 1215103 1284121 1625254 1724406
17718 1724406 1709035 1422370 869512 1175294 1451130 1619011 1592380 1428174 1616906 1524999
17708A524999N4296K66075k29293o07213j29375k73465k86698J13285q6047k10300
17698A36264P8662l9222K61203J39205j3758l58998j56259k1923M8275n2310N02706
17687E23845l19618l73897p5500N56794J25876j73368J05241j03969j02089K22456
17677C85771m6901Q0961J5392k45462j77120K429J0679L452K8245J22539K37250
17666D17235R0560P2798k23461k42887K12400L2048o7212l5691k03896r4633J29802
17655H7063K33888j08504K23689K08743l44316l22363K15775N8202N6479K89094
17645E97750m20608k12468J32147M1629j35205J09821l2281K4757n8291l08337
17635b61086P8212J86047k96406M9997K63488N41054k3558n49003l32499k9971
$$ plain form
17708 1524999 1579295 1845370 1616077 1008864 879489 606024 319326 432611 346564 136264
17698 136264 214926 175704 436907 576112 562354 203356 47097 25174 73449 21139 523845
17687 523845 204227 -169670 -245170 311624 437500 264132 369373 265404 163315 385771
17677 385771 338870 419831 435223 189761 12641 15070 25749 29201 57446 179985 417235
17666 417235 507795 580593 357132 114245 326645 358693 291481 255790 51894 -42739 87063
17655 87063 320951 212447 436136 644879 300563 -21800 193975 252177 308656 597750
17645 597750 177142 -35326 96821 138450 3245 113066 80785 105542 47251 -261086
17635 -261086 -182874 3173 -293233 -243236 20252 561306 537748 -11255 -343754 -373725
17625c73725n350K41934j98990K51033J97940N76492J29449l52915m27771j46857
17615a08760J84450j8574Q8526M08389M12182K78185J50523l37262k17676o8352
17605G71631O6009j27390J1815q1691O5545L78962L19517J70536M1901k09413
17595A407422J3333j76732k47547j20836Q2598L11225Q7243o6742k75430n7229
17585I57305O3879J47574j27109k19214j79795j99832k70590P9055N4362N0406
17575C56041K24053L63674N09593j86761l56067Q8145R1571N4762J10413P692
17565A263116J97031o860r9978j00225L10350J87247J30878p2743K62897M487
17555B076200J47786O21030R9725j76309j39249k57715o0911N0862J26759m0907
$$ plain form
17625 -373725 -379075 -137141 -336131 -85098 112842 689334 818783 465868 38097 -108760
17615 -108760 75690 57116 145642 554031 966213 1244398 1394921 1057659 839983 771631
17605 771631 837640 710250 722065 640374 705919 1084881 1404398 1574934 1616835 1407422
17595 1407422 1420755 1244023 996476 875640 958238 1269463 1356706 1289964 1014534 957305
17585 957305 1021184 1168758 1041649 822435 642640 442808 172218 251273 305635 356041
17575 356041 580094 943768 1453361 1266600 910533 998678 1090249 1145011 1255424 1263116
17565 1263116 1460147 1453287 1353309 1253084 1563434 1750681 1881559 1808816 2071713 2076200
17555 2076200 2223986 2845016 2944741 2768432 2629183 2371468 2310557 2361419 2488178 2447271
17545B447271l63184j27797j36449j42065J54543K15760j48879k18641j78712
17536A501847p2623m48091n76261j24477Q5613K10880K75507M22140m6447l26110
17526I01978n24825q0495K14290J8889k08173K67166n598j78423Q4134L5099N7458
17515E81500j70008j70167K0151J79796K74719L666n6634k3936j78271j08724
17505C52092n1645M21009n7276l01702j44899n6881J36762J09018j80634k97256
17495g1412k6109j5086m4272K86639Q2025j46798k20201L0007J77081K4457P672
17484H4003J6798q6799k5587p5361N2953p8586J95428J98003p0590L007m3548
17473A69721l7286M0589J57037P1520M2625j20014J34952K9659j39606P9875J29899
$$ plain form
17545 2447271 2084087 1956290 1819841 1677776 1832319 2048079 1899200 1680559 1501847
17536 1501847 1429224 981133 404872 280395 366008 576888 852395 1274535 1228088 901978
17526 901978 377153 296658 510948 529837 321664 588830 583232 404809 488943 524042 581500
17515 581500 411492 241325 261476 441272 715991 719657 663023 639087 460816 352092
17505 352092 300447 721456 664180 362478 217579 160698 297460 406478 225844 -71412
17495 -71412 -97521 -112607 -156879 129760 211785 64987 -155214 -125207 51874 76331 84003
17484 84003 100801 14002 -11585 -86946 -33993 -112579 82849 280852 210262 213269 169721
17473 169721 132435 173024 330061 401581 444206 324192 459144 488803 349197 429072 558971
17462E58971o1250j4950q2611k75210J00272K92384J82639P2204j72540n7831
17452E42078p599Q7980n9884j73382j12027K73198K81845M2107l4294j48613n0154
17441F41255K10090J76246l03597j6370K99320J77948k63119k02953J48500L16151
17431A183471j1860P3511j45305o1229J46232J66457r0240P0183p8702J46218
17421A398736J51791m95909m7377K60853M4809L34173Q1690j33051M52203K35908
17411B283826K7574p0764J42257K38708J12669J71737n7914P6658K7985J39598
17401C092334L72286K57508L03092L07110J19562O87341M57030M26945R79397
17392G002605J123808J303497J284741J075834L82611j22640n55315o95369q92352
$$ plain form
17462 558971 497721 482771 400160 124950 225222 517606 700245 772449 599909 542078
17452 542078 534479 622459 562575 389193 277166 550364 832209 874316 840022 691409 641255
17441 641255 851345 1027591 723994 707624 1006944 1184892 921773 718820 867320 1183471
17431 1183471 1171611 1245122 1099817 1038588 1184820 1351277 1261037 1331220 1252518 1398736
17421 1398736 1550527 1054618 1007241 1268094 1312903 1647076 1728766 1595715 2047918 2283826
17411 2283826 2311400 2240636 2382893 2621601 2734270 2906007 2848093 2924751 2952736 3092334
17401 3092334 3464620 3722128 4025220 4332330 4451892 5139233 5596263 6023208 7002605
17392 7002605 8126413 9429910 10714651 11790485 12173096 12050456 11495141 10799772 9907420
17383I907420l97772o2137J63751L08519N28769N71521P64522R30820J490760
17374A4206173J836126J699562J830388J499040J066380Q21810R59921J419205
17366B5338605J910371K856876M160417N111433O322825P607562Q467881Q451790
17358G0227760O284048K396687k307354m371265m828871m114134k881671j614320
17350E8790880K06183K347661L922640N481053O732382Q014839R201131J0457120
17342A05153889J0202447Q387211K453782n236230j0023785j1894123j1480642
17335H7562549r916284p832600n620684l696597k101235m34257P30172K383888
17327F1074952M123761N364398P216021R039664J0021148Q727082M529076n61937
$$ plain form
17383 9907420 9509648 9447511 9611262 9919781 10448550 11020071 11784593 12715413 14206173
17374 14206173 16042299 17741861 19572249 21071289 22137669 22959479 23919400 25338605
17366 25338605 27248976 30105852 34266269 39377702 45700527 53308089 61775970 70227760
17358 70227760 76511808 78908495 76601141 72229876 67401005 63286871 60405200 58790880
17350 58790880 58997063 61344724 65267364 70748417 77480799 85495638 94696769 105153889
17342 105153889 115356336 123743547 126197329 120961099 110937314 99043191 87562549
17335 87562549 77646265 69813665 64192981 60496384 58395149 57960892 58691064 61074952
17327 61074952 65198713 70563111 77779132 86818796 96839944 105567026 110096102 109534165
17319A09534165m146049o538221p089121o130264m694879l606492j942597p92715
17311G4593827M35512J382165K724334L894109M977929O108705O277767N752375
17303A06146723M126482J235772k237847n768756q804756r956007q507770p040877
17295F9192964n820009m648533l048883j152641M56022J383541K804220M066143
17287F3232824M658461M812310L188046m28006l807391o506955p752097p214734
17279E0182458o512655m907583m092470l237736k130754j622866j026361j159571
17271B5492462p60785q94175q63748p25315o78680n80787r57825q70937p66256
17262A8393954n83418n83329n92895m51987o6289q0565k21414l21614p01257r84532
$$ plain form
17319 109534165 105388116 98849895 91760774 85630510 80935631 77329139 75386542 74593827
17311 74593827 75029339 76411504 79135838 83029947 88007876 94116581 100394348 106146723
17303 106146723 110273205 111508977 109271130 103502374 94697618 84741611 76233841 69192964
17295 69192964 63372955 58724422 55675539 54522898 54978920 56362461 59166681 63232824
17287 63232824 67891285 72703595 75891641 75463635 71656244 65149289 57397192 50182458
17279 50182458 43669803 38762220 34669750 31432014 29301260 27678394 26652033 25492462
17271 25492462 24731677 23837502 22973754 22248439 21569759 20988972 20031147 19160210 18393954
17262 18393954 17810536 17227207 16634312 16182325 16116036 16035471 15814057 15492443 14791186 13806654
17252A3806654j170839q23151r04692q90587r04352m19092o21564j49261j93458
17243G729658m97441n69257m85623m59606m78636o25399l4185K01181j63508m11284
17233D205900k92829q2870l33305k80026j03688k24115N8213j92094m44919j22371
17223B187896N2629J53469J94250m20388k69243k73365l07677m40696N5181R7609
17213A029665J75314J90027j41029k55015m181J87036K83880k73781l01731j07775
17203G82410J01176m61824j86050J06701P2731j9028j32412j39740J06510L11211
17193E41685k9927j54207M305o1397K23693J89787k57952l75378J06538j59364
17183B7783J0354L7118P2021J95482L73023l61047l93925K6749K98178K08438
$$ plain form
17252 13806654 12635815 11812664 10907972 10017385 9113033 8693941 8072377 7923116 7729658
17243 7729658 7232217 6662960 6177337 5717731 5239095 4613696 4579511 4780692 4617184 4205900
17233 4205900 3913071 3830201 3496896 3216870 3113182 2889067 2947280 2755186 2310267 2187896
17223 2187896 2240525 2393994 2588244 2167856 1898613 1625248 1317571 876875 932056 1029665
17213 1029665 1204979 1395006 1253977 998962 994781 1181817 1465697 1191916 890185 782410
17203 782410 883586 421762 235712 342413 415144 396116 263704 123964 230474 541685
17193 541685 511758 357551 361856 300459 524152 713939 455987 80609 187147 27783
17183 27783 38137 75255 147276 342758 715781 354734 -39191 -12442 285736 494174
17173D94174J71860m86232n6923K01944j59667k04895J67276O3154n7409L2026
17163A65308l32815n1732P1808L4158j45742p5585k03163j81147K58132L50219
17153a10559M49625J06959j54782K64722J3233m83096j42467L2674p4378k53306
17143c51375r1899O30779K79077j15740o899j04870p2900m18720j81708L39617
17133i4638M40601n2516k22246r1822k27979J67252K43838N6369j24138j8721
17123G6000k76407n9236J8776L70225j39945j0394J5137q7693j87508J66300j90485
17112c05230k06036m0515J47372J2422M1274K41746l15922p7471j09756k6899
17102f39015J85212R0293J08824l13771J83590K01454j40266j18087K31814K19384
$$ plain form
17173 494174 666034 179802 122879 324823 165156 -39739 127537 190691 133282 165308
17163 165308 -167507 -219239 -147431 -113273 -259015 -334600 -537763 -718910 -460778 -110559
17153 -110559 339066 446025 291243 555965 569198 86102 -56365 -23691 -98069 -351375
17143 -351375 -443274 187505 466582 350842 343943 239073 166173 -252547 -434255 -94638
17133 -94638 345963 293447 71201 -20621 -248600 -81348 162490 218859 94721 76000
17123 76000 -200407 -259643 -240867 129358 -10587 -20981 -5844 -93537 -281045 -114745 -305230
17112 -305230 -511266 -551781 -404409 -391987 -350713 -108967 -424889 -502360 -612116 -639015
17102 -639015 -453803 -363510 -254686 -568457 -384867 -183413 -323679 -441766 -209952 9432
17092I432k802k0589j27960k31029j94270j7717J30213K19478Q6072o6400k69794
17081d85366j52903k170R7809M4712m9500k32456k2327L12193q3842J45306J81717
17070b46827k31832K93299l7613l74727l07358O9246J30799J33434j00973M5062
17060f27490K28559J58767K0821k40395r7860j28184J51465J47479j25207p6919
17050e88964O5820L89296K46823P2352k18971l92816k7403j48146R4814R3057
17040d14138O7268J34754K4974J9620Q7793k39076j62077m0179j50913l103N8829
17029f16248j94460k53940j33102n4607m3074L13592J83156J56363K43432k737
17019d01625k325j8042p6682j05354k02847k03293m9056k33213J03746K03715
$$ plain form
17092 9432 6630 -13959 -141919 -372948 -567218 -584935 -454722 -235244 -149172 -215572 -485366
17081 -485366 -638269 -640439 -542630 -497918 -547418 -779874 -802201 -490008 -573850 -428544 -246827
17070 -246827 -478659 -185360 -222973 -597700 -905058 -835812 -705013 -571579 -672552 -627490
17060 -627490 -398931 -240164 -219343 -459738 -557598 -685782 -534317 -386838 -512045 -588964
17050 -588964 -523144 -133848 112975 185327 -33644 -426460 -453863 -602009 -507195 -414138
17040 -414138 -346870 -212116 -187142 -167522 -79729 -318805 -480882 -521061 -671974 -675077 -616248
17029 -616248 -810708 -1064648 -1197750 -1252357 -1295431 -981839 -798683 -642320 -398888 -401625
17019 -401625 -403950 -421992 -498674 -604028 -806875 -1010168 -1059224 -1292437 -1188691 -984976
17009i84976O9036R2760M5707O5205K48320R750j49557M42756M25007j31928k47008
16998a14928J33799k09753p9512q1024j57495P7117j52929K13176J78637j76259
16988c69171J18481j79502k93620L01072J36774p9750L62508R8605k31364m7061
16978a83028j85866l32459j33095L33628R9060k88956j85437P4213J93705j74168
16968g82403j57966k2046J17824O9389M7594J42250j23620k6903J72203J9190
16958e44488M4385J64726K03536j75050k31633J8304J06508J0456k2748k198j50979
16947e79181j40925J0645j10525q1956K00963K82997J16668l2574j55369K14592
16937b74665J41616j65637j82101j01678K15991p0122l41395n4053j05016l3810
$$ plain form
17009 -984976 -915940 -823180 -777473 -712268 -463948 -454198 -603755 -160999 264008 132080 -114928
16998 -114928 18871 -190882 -270394 -351418 -508913 -431796 -584725 -371549 -192912 -369171
16988 -369171 -250690 -430192 -723812 -422740 -285966 -365716 -3208 95397 -135967 -183028
16978 -183028 -368894 -701353 -834448 -500820 -401760 -690716 -876153 -801940 -608235 -782403
16968 -782403 -940369 -962415 -844591 -775202 -727608 -585358 -708978 -735881 -563678 -544488
16958 -544488 -500103 -335377 -131841 -306891 -538524 -520220 -413712 -403256 -426004 -428202 -579181
16947 -579181 -720106 -709461 -819986 -901942 -700979 -417982 -301314 -333888 -489257 -274665
16937 -274665 -133049 -298686 -480787 -582465 -366474 -436596 -777991 -832044 -937060 -970870
16927i70870J68828J05681J87015n9417J55760L4586p8855k60490L5578L28609
16917c53575L12980j16248j20838j65440p9679K401j6457L21213j23957o5504
16907d05104L3749p8580k46615r6543J40529J12722o876K11329M6848o4190j76652
16896e29383k81126j03670l4198N5809J47905K34655q814l36687j23323N8573
16886i20259K89257j97546j4831N08630J92951j39179l57313K91631K78127j17472
16876a86004j13832M9863n16458k98919J8768P5476M8642K34298L88184N22153
16866B22171q829l89702L44925j02222k47142k45864J00509m2473n3586j43279
16856e65492K2664K30357j7524j58135J42216L1952r2110k6863K36441J29717
$$ plain form
16927 -970870 -802042 -696361 -509346 -568763 -413003 -378417 -457272 -717762 -682184 -353575
16917 -353575 -40595 -156843 -277681 -443121 -522800 -520399 -536856 -215643 -339600 -405104
16907 -405104 -371355 -449935 -696550 -793093 -652564 -539842 -546718 -335389 -288541 -352731 -529383
16896 -529383 -810509 -914179 -948377 -892568 -744663 -510008 -518822 -855509 -978832 -920259
16886 -920259 -631002 -828548 -843379 -334749 -141798 -280977 -638290 -346659 -68532 -186004
16876 -186004 -299836 -249973 -766431 -1065350 -1046582 -971106 -922464 -688166 -299982 222171
16866 222171 213342 -176360 168565 66343 -180799 -426663 -326154 -368627 -422213 -565492
16856 -565492 -542828 -312471 -329995 -488130 -345914 -313962 -406072 -432935 -196494 -66777
16846f6777p5331r3005k12795Q9963j33891p9089J09371k7192p0163K8695j93304
16835g23518O9108J88888Q6876J46426L51513o2695k30287l24278m0172O7099
16825d71040L6282J79131Q7408k7593J2692j58673j66661p5026J4965o8180Q0633
16814e56062L71023L45516P5886l49531j88007K15717M1144j59681J08189p249
16804a03055J7035J61308R2871j17821j27275k01842J0887p8329J88276J48085
16794i860j5758j91848r3445J07278j01111j16135k39854r1799J77169L16718
16784b58645K26649K17868J53593J7030n9426n18j5353M5438p4642m2054l07248
16773i7308R4661l5227J35332k4592R2059K02535K02205l06276k23472m39312
$$ plain form
16846 -66777 -142108 -235113 -447908 -357945 -491836 -570925 -461554 -488746 -558909 -530214 -723518
16835 -723518 -654410 -465522 -378646 -232220 119293 56598 -173689 -497967 -538139 -471040
16825 -471040 -434758 -255627 -168219 -195812 -183120 -341793 -508454 -583480 -568515 -636695 -556062
16814 -556062 -185039 160477 236363 -113168 -301175 -85458 -44314 -203995 -95806 -103055
16804 -103055 -86020 75288 168159 50338 -76937 -278779 -267892 -346221 -157945 -9860
16794 -9860 -25618 -217466 -310911 -203633 -304744 -420879 -660733 -752532 -575363 -258645
16784 -258645 -31996 185872 339465 356495 297069 296551 281198 326636 251994 209940 -97308
16773 -97308 -2647 -37874 97458 72866 164925 367460 569665 263389 39917 -399395
16763c99395j20627L51927l6660l42995j0324j91372P4016J41259J20693o6344
16753d79822k01810m6336K3156r2774j05895K41633K32116j75578j02860K51869
16743d56301j53940k64090J41414M217j43410L3212l3250K07797J32781k21725
16733g53295J8581K17195J72483N2108M6129K64204J14738j83115k19874j9283
16723b90129J2670l43757r007M4406J16370K68541L99583j20255k63623m13495
16713e98696o5564R5061J10636l6400J7440J39924n433k11907j96390p4202L47028
16702d78503J55515k87165J46500J85672k1269r8682k31101J44973p8804j62889
16692g25753o3867J26647j80510K8617K52447K67798K61807P1238m04366l81104
$$ plain form
16763 -399395 -520022 -168095 -204755 -547750 -558074 -749446 -675430 -534171 -413478 -479822
16753 -479822 -681632 -727968 -704812 -797586 -903481 -661848 -429732 -605310 -708170 -456301
16743 -456301 -610241 -874331 -732917 -728700 -872110 -838898 -872148 -664351 -531570 -753295
16733 -753295 -734714 -517519 -345036 -292928 -246799 17405 132143 -50972 -270846 -290129
16723 -290129 -277459 -621216 -630223 -585817 -469447 -200906 198677 78422 -185201 -598696
16713 -598696 -664260 -569199 -458563 -494963 -477523 -337599 -343032 -554939 -751329 -825531 -478503
16702 -478503 -322988 -610153 -463653 -277981 -299250 -397932 -629033 -484060 -562864 -725753
16692 -725753 -789620 -662973 -843483 -814866 -562419 -294621 -32814 38424 -365942 -747046
16682g47046l42245k91882r8545K64513O8206J48352K23774l5225J51695R8486
16672e59917J2081q4240j20304j13971j13998R6940J42881N7269K85950R3490
16662c03819K8442j08458n4740l29880K27777K01780o7883K76815k56559l49854
16652g36379r1090K23154J14349M7933J43856j51413q3115K80473L87072j98490
16642f3650J02511J84641o8773q7741j41838j34773j77613K29742k07199k66083
16632f30776Q1108K30509q8499O414l83311j58961m3561l816K17262K84167O5672
16621d23792k5749j67674R0179n0632J85927K42787j29498J45550j11893j29102
16611c73897J19023K14778m7240j85055K25752r3809j66684k22688J4842J71118
$$ plain form
16682 -747046 -1089291 -1381173 -1479718 -1215205 -1146999 -998647 -774873 -810098 -658403 -559917
16672 -559917 -547836 -632076 -752380 -866351 -980349 -883409 -740528 -683259 -397309 -303819
16662 -303819 -275377 -383835 -438575 -768455 -540678 -338898 -406781 -129966 -386525 -736379
16652 -736379 -827469 -604315 -489966 -442033 -298177 -449590 -532705 -252232 134840 -63650
16642 -63650 38861 223502 154729 66988 -74850 -209623 -387236 -157494 -364693 -630776
16632 -630776 -549668 -319159 -407658 -401244 -784555 -943516 -987077 -990893 -773631 -489464 -423792
16621 -423792 -449541 -617215 -527036 -577668 -391741 -148954 -278452 -132902 -244795 -373897
16611 -373897 -254874 -40096 -87336 -272391 -46639 -140448 -307132 -529820 -514978 -343860
16601c43860K1222k38747o4926j01980k59734K25240K10307Q2967P0591q694j27245
16590e34859j10178M8248L265J36246M9192l88867P7345L41260J30461j30508
16580c78395J19259J66673l17481j72705J33998J98486k6598j35361k3115O6701
16570c68538J79316j07665k81718J71084j21101J28264j17260J3705m77917k6466
16560a008296K47452K11058n5387J08591L33338j50526O2122m360l6038M5317
16550b46729R2021j84432J43549M2859l16536j1525l58974K22990J42583j76722
16540f50916P1566M90860L60498Q3072k54311O0135j40123j96726K1037j49100
16530c04008l17682l21262M0291J6729N3010J63557k1361k27076l8819L03080
$$ plain form
16601 -343860 -322638 -561385 -626311 -728291 -988025 -762785 -552478 -469511 -398920 -407614 -534859
16590 -534859 -645037 -596789 -593524 -457278 -408086 -796953 -719608 -378348 -247887 -378395
16580 -378395 -259136 -92463 -409944 -582649 -448651 -250165 -276763 -412124 -435239 -368538
16570 -368538 -189222 -296887 -578605 -407521 -528622 -400358 -517618 -503913 -981830 -1008296
16560 -1008296 -760844 -549786 -605173 -496582 -163244 -313770 -251648 -256008 -292046 -246729
16550 -246729 -154708 -339140 -195591 -152732 -469268 -480793 -839767 -616777 -474194 -650916
16540 -650916 -579350 -88490 272008 355080 100769 160904 20781 -175945 -154908 -304008
16530 -304008 -621690 -942952 -902661 -885932 -832922 -669365 -690726 -917802 -956621 -653541
16520f53541M92692J43946j40032l6640n7274k42398k46649j02073j02222J98959
16510g45232J61538j23149j52052Q969J63644K45896J4375j33706j22850k14179
16500h96746j80597m3461M75971J55045q2544J24529K0310j59419M08739Q4097
16490i4076N8335J86719j11642k13993k10041j17552J58681L58238J52326p07118
16480e40123j55106N9242j67386M10272J01655j46450p1467m9480J65674j36052
16470e29221M9504Q5565P7845q9482m19039m4919K86692K31420J04309j24587
16460c71913k60979j05304M52430L82344J7002m96591n1564O9738J17327J91863
16450e5647j1040r542k57100l76129N5350j0222K22259n4108J66200k19220k67517
$$ plain form
16520 -653541 -160849 -16903 -156935 -193575 -250849 -493247 -739896 -841969 -944191 -745232
16510 -745232 -583694 -706843 -858895 -849926 -686282 -440386 -426011 -559717 -682567 -896746
16500 -896746 -1077343 -1120804 -644833 -489788 -572332 -447803 -427493 -586912 -178173 -94076
16490 -94076 -35741 150978 39336 -174657 -384698 -502250 -343569 14669 166995 -540123
16480 -540123 -695229 -635987 -803373 -393101 -291446 -437896 -509363 -558843 -393169 -529221
16470 -529221 -479717 -394152 -316307 -405789 -824828 -869747 -583055 -351635 -247326 -371913
16460 -371913 -632892 -738196 -285766 96578 113580 -383011 -434575 -364837 -247510 -55647
16450 -55647 -66687 -76229 -333329 -709458 -654108 -664330 -442071 -496179 -329979 -549199 -816716
16439h16716K8734O790K41219N6507J01968K85999J84695L33594J3758l57447
16429G9101l81579J51355P649k16644m4603J64305L0511k45285j21731O7060N5810
16418d54051L08159K12701P671N6672k79799m42891l1968j05891K37518M62699
16408b9180j74462j64092j30394j2321p8342K9021L32440K9168o2138m7699j15072
16397d23071r7032j37211j4108R5006k07465L9464Q0059J32867K66563n13259
16387g78187r9434L03388L36752J71484j8109m39173J20010Q2849k23044j21138
16377f64602J41704K29265O0113l84896Q8533K13811Q3629m927K79146K4661J6478
16366H2915L34481R4101j72771l43131k02427j52909j36878k16503p3019L1850
$$ plain form
16439 -816716 -787982 -781192 -539973 -483466 -381498 -95499 89196 422790 436548 79101
16429 79101 -302478 -151123 -143474 -360118 -404721 -240416 -209905 -455190 -576921 -509861 -454051
16418 -454051 -145892 66809 74480 131152 -148647 -591538 -623506 -729397 -491879 -29180
16408 -29180 -203642 -367734 -498128 -510449 -588791 -559770 -227330 -198162 -260300 -307999 -423071
16397 -423071 -520103 -657314 -671422 -576416 -783881 -744417 -664358 -531491 -264928 -778187
16387 -778187 -877621 -574233 -237481 -65997 -84106 -523279 -403269 -320420 -543464 -664602
16377 -664602 -522898 -293633 -233520 -618416 -529883 -316072 -232443 -237370 41776 66437 82915
16366 82915 417396 511497 338726 -4405 -206832 -359741 -496619 -713122 -786141 -754291
16356g54291k6788N606K77227J86638L12816j09314j06950q4099k03364k1744
16346e24263k57119J78286L48825r8961l97547M25228P2974n02246r9039j51179
16336a005041L10094K71683k5281L3186Q2388j20406J98870j56145K2309J64227
16326b24116L0412l40558j66227p3966J4646K31299J16720J980j26483r7594J18554
16315e15333K94446k04892k84426J97742M42134P9389n3049J21699J91361Q3217
16305C52288k87173k41199j52155J09444L04543K49454k26331j89226q8060j47080
16295c15495K35384L8481j47759O3538l5448r5558N9053K14244J43282j54922
16285D800j39868N9490j40995O400J05008l09935k05386J79405L83025K7247k37631
$$ plain form
16356 -754291 -781079 -775473 -498246 -311608 1208 -108106 -215056 -299155 -502519 -524263
16346 -524263 -781382 -603096 -254271 -353232 -750779 -325551 -252577 -754823 -853862 -1005041
16336 -1005041 -694947 -423264 -448545 -415359 -332971 -453377 -254507 -410652 -388343 -224116
16326 -224116 -193704 -534262 -700489 -774455 -759809 -528510 -411790 -409810 -536293 -633887 -515333
16315 -515333 -220887 -425779 -710205 -512463 -70329 9060 -43989 77710 269071 352288
16305 352288 65115 -176084 -328239 -218795 85748 335202 108871 -80355 -168415 -315495
16295 -315495 -80111 -41630 -189389 -125851 -161299 -256857 -197804 16440 159722 4800
16285 4800 -135068 -75578 -216573 -210173 -105165 -415100 -620486 -441081 -58056 -30809 -268440
16274b68440K04664K50484L749L85n1693L3583j20669k9132k70050l63598R1611
16263e19106J31435p2266J33121J04026K15363r779j61669J01730j64958k38838
16253d80941J565K44273L2523m5745J07783l37868j20516L05794o4633K23202
16243a34563j00507l85371K1459K80253N5393O4975k3239p8643J04745n6734O0430
16232a91802p2923k31265K1307Q0302k50739l58905j27745M15337K40521j44256
16222f20168K65778K89911M1960k20862K3140K80956L80396J38155k64337l77522
16212f2593j31267K4741p4851J5863k30801k0332N5676K48756M34475J07210j07519
16201B59358l46665k46652M0049r1274k81652k56759K25861L75582M17551R9521
$$ plain form
16274 -268440 -63776 186708 190457 190842 139149 172732 52063 22931 -247119 -610717 -519106
16263 -519106 -387671 -459937 -326816 -222790 -7427 -17206 -178875 -77145 -242103 -480941
16253 -480941 -479376 -235103 -202580 -248325 -140542 -478410 -598926 -293132 -357765 -134563
16243 -134563 -235070 -620441 -598982 -318729 -263336 -198361 -221600 -300243 -195498 -252232 -191802
16232 -191802 -264725 -495990 -474683 -394381 -645120 -1004025 -1131770 -716433 -475912 -620168
16222 -620168 -354390 -64479 -22519 -243381 -220241 60715 441111 579266 314929 -62593
16212 -62593 -193860 -169119 -243970 -228107 -458908 -479240 -423564 -174808 259667 366877 259358
16201 259358 -87307 -333959 -293910 -385184 -666836 -923595 -697734 -322152 95399 194920
16191A94920M99n9162l78796j6364J03982j30823k12689k88449j6459K66237j58865
16180f95969R3559j37499K48492J20301k12625J72052J41846J96987p1732k38219
16170c82807P338m9594p6971N3014N2479L0981J42732J77131k77246K41277J08137
16159B6471j77764j78349K2488J11516M4608J25367j52062m50945J37834J26892
16149c63944O6089K0521j88487j83967j59694P0041L10460J09140R3617J11952
16139a14272R1273j26841k08569j2425r5011l37992J37484K49682J24132L44460
16129E1921K70962n83018k75754J27926J9232J53137K04327J32131P8649k88491
16119a08978K06470K24807k12180k48799k3924l07444K049N8607J4590m442j76568
$$ plain form
16191 194920 195419 136257 -242539 -258903 -154921 -285744 -498433 -786882 -803341 -537104 -695969
16180 -695969 -602410 -739909 -491417 -371116 -583741 -411689 -269843 -72856 -144588 -382807
16170 -382807 -375469 -425063 -502034 -449020 -396541 -365560 -222828 -45697 -322943 -81666 26471
16159 26471 -151293 -329642 -307154 -195638 -151030 -25663 -177725 -628670 -490836 -363944
16149 -363944 -297855 -277334 -465821 -649788 -809482 -739441 -428981 -319841 -226224 -114272
16139 -114272 -22999 -149840 -358409 -370834 -465845 -803837 -666353 -416671 -292539 51921
16129 51921 322883 -260135 -535889 -407963 -388731 -235594 -31267 100864 179513 -108978
16119 -108978 97492 322299 110119 -138680 -162604 -470048 -467999 -409392 -394802 -399244 -575812
16108e75812K79535k28416r5182k00974P6627J29220R8608j44618K77807M54718
16098G1513m8754k4311l4671k20320r0379k9970l7122J52032K56353j50433k49168
16087d05230j12042o9098L5803K20869L78332J8292o6068n4181m79971l06326
16077h39620K7743P1142Q3588k16300j47127L44380L19322K23885k2726j97627
16067c53340l84141Q5057K1940j21901J29269Q4339J66346P643l24994k58416
16057i48198m1072J56492J00893J22561J92624j32856J76049L19441k34678J14956
16047a73788q7448M2903K8853j7328j096K24240K41168O3585N9398k56526j44182
16036b0221k87050K13621L15111L11479J18527k94625l81834j37744j50841o4735
$$ plain form
16108 -575812 -296277 -524693 -619875 -820849 -744222 -615002 -516394 -661012 -383205 71513
16098 71513 22759 -1552 -36223 -256543 -346922 -376892 -414014 -261982 -5629 -156062 -405230
16087 -405230 -517272 -586370 -550567 -329698 48634 66926 858 -53323 -533294 -839620
16077 -839620 -811877 -740735 -657147 -873447 -1020574 -676194 -356872 -132987 -155713 -353340
16067 -353340 -737481 -652424 -630484 -752385 -623116 -538777 -372431 -364788 -689782 -948198
16057 -948198 -989270 -832778 -731885 -609324 -416700 -549556 -373507 -54066 -288744 -173788
16047 -173788 -261236 -218333 -189480 -206808 -207904 16336 257504 321089 380487 123961 -20221
16036 -20221 -307271 -93650 221461 532940 651467 356842 -24992 -162736 -313577 -378312
16026c78312r5002m2816r3132J39186p6767J01779p063j36992J76818L76129J6370
16015a9802K10596P2648j51923l58045l5810N6148l4238J78538K24255K06127
16005C48494j82075j11499j6466J4757k06580J09636J98120m2507K59850K52368
15995F24098J15402j44044m53124l50285k25101k80149O639N01970m9504k16417
15985d70515M8830P6622K96507J07004q9213K03245O7236m12426m28392q6513
15975f87615K90688P9194L00853L44320J00644j99924j69087k21113j40825P890
15965b94975j30569m2541J53825K01083j03530q4085l0084K80494M00835q7478
15955B62975k20685l42103J58174R5520l09008N3005q0065j40123j61702j96779
$$ plain form
16026 -378312 -473314 -516130 -609262 -470076 -546843 -445064 -452127 -589119 -412301 -36172 -19802
16015 -19802 190794 263442 111519 -246526 -282336 -226188 -260426 -81888 142367 348494
16005 348494 166419 54920 38454 53211 -153369 -43733 154387 111880 371730 624098
15995 624098 739500 595456 142332 -207953 -433054 -713203 -706564 -204594 -254098 -470515
15985 -470515 -421685 -345063 -48556 58448 -30765 172480 239716 -172710 -601102 -687615
15975 -687615 -396927 -317733 -16880 327440 428084 228160 59073 -162040 -302865 -294975
15965 -294975 -425544 -468085 -314260 -113177 -216707 -300792 -330876 -50382 350453 262975
15955 262975 42290 -299813 -141639 -46119 -355127 -302122 -382187 -522310 -684012 -880791
15945h80791P4732m0640J66701K20430L79023l523k40683k11017n5151j05112
15935f96031M3954J98868K61690L44981N6383k23762j26503J97469K56519k93211
15925B0357j49232L34570q9632m31078m9526j88695L7577N47k6651K31774Q251
15914c01738R2082j75770o0943O4194L95912K10798j50525M7186J57205P5891
15904C54292q1702P3350j82603o9820J38225j59816l06514M5693j11123j3976
15894c13994J49349J87845j21930j70992j33628o549k6898J31372O5822P4419
15884a65184r1099J16998l1968J8659r3468K58295J73782j13804k71535k42909
15874d42233k89442Q4962K01708o3934N4215J73052r8930J83012O4535r9522m9292
$$ plain form
15945 -880791 -806059 -846699 -679998 -459568 -80545 -84068 -324751 -535768 -590919 -696031
15935 -696031 -652077 -453209 -191519 153462 209845 -13917 -140420 57049 313568 20357
15925 20357 -128875 205695 116063 -315015 -364541 -553236 -515659 -515112 -541763 -309989 -301738
15914 -301738 -209656 -385426 -446369 -382175 13737 224535 74010 121196 278401 354292
15904 354292 272590 345940 163337 93517 231742 71926 -234588 -188895 -300018 -313994
15894 -313994 -164645 23200 -98730 -269722 -403350 -409899 -436797 -305425 -239603 -165184
15884 -165184 -256283 -139285 -171253 -152594 -246062 12233 186015 72211 -199324 -442233
15874 -442233 -731675 -646713 -445005 -508939 -454724 -281672 -380602 -197590 -133055 -232577 -281869
15863b81869j51926J98236j8831M35967j10434l18546M2885J70064J57004L13292
15853D35842j46032n52004o9478J93640L65333r4612J84510J5829n4204j98217
15843H0607k88691K31585L68423j9987m45651l88988n5382L85738j36016l08444
15833e76806q4389J55655r1052J66119k39009k648K42665J36923j23501p0886
15823d86929K65212o9529l0126j61438p1899P5750q3467J18104M93405J14894
15813A63977n66964l79282K04439M0510K39164L52752k54688j41989r51K60782
15803h2250K12351k20304k37510K00566P2538J62333j63841k96975J52320J39927
15793f0845J75361J68066K89813L27122j55815k00168j32331k99701j32029O3879
$$ plain form
15863 -281869 -433795 -235559 -254390 181577 71143 -247403 -204518 -34454 122550 435842
15853 435842 289810 -262194 -331672 -138032 227301 132689 317199 333028 278824 80607
15843 80607 -208084 23501 391924 371937 -73714 -462702 -518084 -132346 -268362 -576806
15833 -576806 -661195 -505540 -596592 -430473 -669482 -672130 -429465 -292542 -416043 -486929
15823 -486929 -221717 -291246 -321372 -482810 -554709 -478959 -562426 -444322 49083 163977
15813 163977 -402987 -782269 -577830 -537320 -298156 54596 -200092 -342081 -343032 -82250
15803 -82250 130101 -90203 -327713 -127147 -54609 107724 -56117 -353092 -200772 -60845
15793 -60845 114516 282582 572395 899517 743702 543534 411203 111502 -20527 43352
15783D3352j21752j70158l10882j19025L35570P3361l1991L83786K47443j11067
15773B18637k62485j20673l0546J48824j00377q4817J04396k2090o0012k305j37341
15762c48789J33878J12574p1502O6506p6189J24078J74496K508p0917M2424K68308
15751C57375M0132l22289R8198p5085l85322J61084K34488L6279m2081n2968M9694
15740I9505r2466k18073q3323K726N501p7693K06462K82348j40097k60876m41318
15729g17304k18975K65618N60295J77935k63791j82210M6819L53258J01240l6612
15719H6273k98861N6193J32440l20419l47963K29692j5448K28417J63887M7803
15709c7986J87737r0010K73568l2910j75405R4106k21562l57202j24144J14032
$$ plain form
15783 43352 -78400 -248558 -559440 -678465 -342895 -269534 -301525 82261 329704 218637
15773 218637 -43848 -164521 -195067 -46243 -146620 -231437 -127041 -149131 -209143 -211448 -348789
15762 -348789 -214911 -102337 -173839 -107333 -183522 -59444 115052 117560 46643 89067 357375
15751 357375 397507 75218 173416 98331 -286991 -125907 108581 144860 102779 49811 99505
15740 99505 7039 -211034 -294357 -291631 -286130 -363823 -157361 124987 -15110 -275986 -717304
15729 -717304 -936279 -670661 -110366 67569 -196222 -378432 -331613 21645 122885 86273
15719 86273 -212588 -156395 -23955 -344374 -692337 -462645 -478093 -249676 -85789 -37986
15709 -37986 149751 59741 333309 300399 124994 219100 -2462 -359664 -483808 -369776
15699c69776L08478k00947k05651J39993M09460j17338l1159Q0685J93781j08159
15689I9367k6750l94417k44734K4418K57832L726J58454J36251j18815n4836K01085
15678D1581K60372q3536J16138K8065l61716P2596q4016k85381J11737M59322
15668B75162K13749j63336n29250j11439Q0730N0134k88478J47226M49820J29316
15658B53634j70622K53169J69158k06948j74821P5957m91525j64857l9509K41971
15648b54393n6815n7864M43405K52069J105j60269n07384p0150M52439J28046
15638A70189L05220J91083K6908j92194l91054k79240n947m5418P8937r0410P7056
15627a54870K27765n170m10001l96404n9053K79088J508k05160M23098k3316l98183
$$ plain form
15699 -369776 -61298 -262245 -467896 -327903 81557 -35781 -66940 13745 207526 99367
15689 99367 72617 -321800 -566534 -542116 -284284 -280558 -122104 14147 -104668 -159504 41581
15678 41581 301953 218417 334555 362620 904 73500 -10516 -295897 -184160 275162
15668 275162 488911 325575 -203675 -315114 -234384 -184250 -472728 -325502 124318 253634
15658 253634 83012 336181 505339 298391 123570 199527 -291998 -456855 -496364 -254393
15648 -254393 -311208 -369072 74333 326402 327507 167238 -340146 -410296 42143 170189
15638 170189 475409 666492 693400 501206 110152 -169088 -175035 -220453 -141516 -231926 -154870
15627 -154870 72895 67725 -342276 -738680 -797733 -518645 -517137 -722297 -299199 -322515 -720698
15616g20698Q7608L79545J76413O3488J5318Q8602K3527M4566j77792N334L99184
15605C85095m7555k59314P4724j51800j34497r2825j89687m42410J03401N22202
15595b32666K36773j68241l11835K4206K56300J6508J72599K69627N8466k15248
15585A06489j98738j26005Q2570J12641J41683K53867n5021j04769j83306l9417
15575a0006k59775J4060J71188j82975k41517P1928J93856m5k7519K28764K413
15564c9628k4872j53858j41525J80522N77193J85335j21957k16838k15293M08757
15554D37836k4143k59663K54458L0913m99115k49904R1515l3501J70537K80131
15544A99064j34323m4043O5965k05506j17441J88417l9010k97332r9372N1943
$$ plain form
15616 -720698 -633090 -253545 -77132 -13644 1674 90276 113803 158369 -19423 -14089 385095
15605 385095 337540 78226 152950 1150 -133347 -226172 -415859 -858269 -754868 -232666
15595 -232666 4107 -164134 -475969 -451763 -195463 -178955 -6356 263271 321737 106489
15585 106489 -92249 -218254 -135684 -23043 118640 372507 317486 212717 29411 -10006
15575 -10006 -269781 -255721 -84533 -267508 -509025 -437097 -243241 -243286 -270805 -42041 -39628
15564 -39628 -64500 -218358 -359883 -179361 397832 583167 461210 244372 29079 437836
15554 437836 413693 154030 408488 439401 -59714 -309618 -218103 -251604 -81067 199064
15544 199064 64741 20698 86663 -118843 -236284 -47867 -86877 -384209 -483581 -431638
15534d31638o3618j19831J14036J02991O4814J6526Q8992P0804J30427q8561n8259
15523a73317J7360P3750J7972j92779M4136n4548P5828J89429k12058k27313L86087
15512e5453O2333j96294o4422J35291j53396m7320K3392M42050P0283j28661j32061
15501d4258m09121J3273M2062j69608L9984K10570K05658j07792j80442l28394
15491g28068J20979J19048q9306K60839L89405K06330r1014l74848j23385R6670
15481b13350j03417K05371K774o2463K67044K13505K45688Q9388j29817j2749
15471E01974k15484o9253k17987j59893J5260r7288J78006R9261K00570k43093
15461g927k30168J83344j1805m34521R6850J31176m1945j19968j49572l4195L52714
$$ plain form
15534 -431638 -495256 -615087 -501051 -398060 -333246 -316720 -227728 -156924 -26497 -115058 -173317
15523 -173317 -155957 -82207 -64235 -257014 -212878 -267426 -191598 -2169 -214227 -441540 -55453
15512 -55453 6880 -189414 -253836 -118545 -271941 -319261 -295869 146181 216464 87803 -44258
15501 -44258 -453379 -440106 -398044 -567652 -527668 -317098 -111440 -219232 -399674 -728068
15491 -728068 -607089 -488041 -577347 -316508 72897 279227 188213 -186635 -310020 -213350
15481 -213350 -316767 -111396 -108622 -171085 95959 309464 555152 644540 514723 501974
15471 501974 286490 217237 -750 -160643 -145383 -242671 -64665 34596 235166 -7927
15461 -7927 -238095 -54751 -66556 -501077 -404227 -273051 -314996 -434964 -584536 -618731 -266017
15450b66017j03372J69309l9817o2358J54737K53424J9466k02764k95697J62475
15440b10614j23766K64K20873J16821m74485j18345R4531J35928L16683L83489
15430C41379L0471n23721m60577k84341N6615L96124K06237N3040J94012J28350
15420A37589j17091m7939j33670p6797j1957P9641k05711M2427K07021k12381
15410c38868R5303L1796J64357j896k08922J90792J35553l0550k2397L922P7475
15399I6565K25869l50915k0921K52385L27547l9478k50426m166j19813p9031j38391
15388a00775k06154J97014K36746L3206J61752p8265J8722j18938J85582R8193
15378D27083p1049l19695l79728k2453K35300K06512K01549K72931j03578p1355
$$ plain form
15450 -266017 -369389 -200080 -239897 -302255 -147518 105906 125372 -77392 -373089 -210614
15440 -210614 -334380 -334116 -113243 3578 -470907 -589252 -494721 -358793 -42110 341379
15430 341379 371850 -151871 -612448 -896789 -840174 -444050 -237813 -184773 9239 137589
15420 137589 20498 -27441 -161111 -237908 -249865 -170224 -375935 -333508 -126487 -338868
15410 -338868 -243565 -211769 -47412 -49308 -258230 -67438 68115 37565 15168 19090 96565
15399 96565 322434 -28481 -49402 202983 530530 491052 240626 236460 116647 37616 -100775
15388 -100775 -306929 -109915 126831 160037 321789 243524 262246 143308 328890 427083
15378 427083 356034 36339 -343389 -365842 -130542 75970 277519 550450 446872 375517
15368C75517n1135k42339m64635N9951N34359K78764j9879l46424q2126J60714
15358B02767j18318J31560J7626P1236r5320o8568j50363j32157K04356O2301
15348A25120p0841L7J78056j10883k70349N5745j34483k61357K34809L07253p1274
15337a8167l63351p172K89690Q6861M1379K93087O8951J40459K1283k87162l28855
15326f2997k23988M1613L20246p3156p5297K60630j39515m5883M5136J19789K8895
15315A95473l43097k5622J42455J09437R2499j97610M5670k02064j61882N5015
15305b89726l6423J91947p9241j04835j5245J83756K04572k69712j56963L12489
15295e9381r4201J20431k375j8864K22023O5749q8089k24804P1163p0436L2665
$$ plain form
15368 375517 324382 82043 -382592 -322641 211718 490482 470603 124179 42053 202767
15358 202767 84449 216009 233635 304871 209551 140983 -9380 -141537 62819 125120
15348 125120 54279 54316 232372 121489 -148860 -93115 -227598 -488955 -254146 53107 -18167
15337 -18167 -381518 -388690 -99000 -12139 29240 322327 391278 531737 553020 265858 -62997
15326 -62997 -286985 -245372 74874 1718 -73579 187051 47536 1653 46789 166578 195473
15315 195473 -147624 -173246 -30791 78646 171145 -26465 19205 -182859 -344741 -289726
15305 -289726 -326149 -134202 -213443 -318278 -333523 -149767 54805 -214907 -371870 -59381
15295 -59381 -153582 -33151 -35526 -54390 167633 233382 145293 -79511 -8348 -78784 -46119
15284d6119j8073j46303L5666K39307k07342q8211o1600j76301n0932L75368K43637
15273I9097p1225R0990n624j74143m7359J14563l1366K13010m8746J11288Q9153
15262C39638P1086p6920p0758l29830K28076M13734k7560m46196j41443L8132
15252b041M6943k19886l52398j7579J38040m7358l6885J43957L65883L74149j0568
15241C82257j31412L0955j17510k08161p0468R1943k58823m21491m05493N9234
15231a048969M00669K28355J63534j0266K94212M10332m13551k52386L4696o3575
15221b56949K3308N8442k77131K4060J48970J53447M9078L22829R4455j57755
15211A82754j11241J28360J18123j09952m33282j06036K16331L35081R8441k578
$$ plain form
15284 -46119 -64192 -210495 -174829 64478 -142864 -231075 -292675 -468976 -519908 -144540 99097
15273 99097 27872 118862 113238 -60905 -108264 6299 -25067 187943 139197 250485 339638
15262 339638 410724 333804 263046 -66784 161292 575026 547466 101270 -40173 -2041
15252 -2041 44902 -174984 -527382 -544961 -406921 -454279 -491164 -347207 18676 392825 382257
15241 382257 250845 281800 164290 -43871 -114339 -22396 -281219 -702710 -1108203 -1048969
15231 -1048969 -648300 -419945 -256411 -266677 27535 437867 24316 -228070 -193374 -256949
15221 -256949 -233641 -175199 -452330 -428270 -279300 -125853 -76775 246054 340509 182754
15211 182754 71513 199873 317996 208044 -225238 -331274 -114943 220138 318579 316001
15201C16001m30277k29454K11196M3638k592N13692J98019k22529j57365L37270
15191E77599l83324J13190K68122k30465k02240Q8041m346j61041k65413l3624
15181b33501R3566l27501m74324R8883L36025K20177K669J7004J6466n9635J51859
15170a58312L5346j24449p2435O6339L34018L9055j73186j2459j97066p6394j09710
15159d49253j02799J19482K2240M92870j16978k39050r476J78761Q0734J34877
15149A11408k25923j50663L58069J23165j78211j79786M56418l4969J82632J65239
15139F27379k35134J7317j42816p2364k84328k06951L63137K27033k63901K26859
15129B56231J2067q0873r5862P4722j20411j12091l18597N10515M11212r2038
$$ plain form
15201 316001 -114276 -343730 -132534 -88896 -91488 422204 620223 397694 240329 577599
15191 577599 194275 307465 575587 345122 142882 230923 226577 65536 -199877 -233501
15181 -233501 -139935 -467436 -941760 -842877 -506852 -286675 -284006 -267002 -250536 -310171 -158312
15170 -158312 -122966 -247415 -319850 -253511 80507 119562 -53624 -66083 -263149 -339543 -449253
15159 -449253 -552052 -432570 -410330 82540 -34438 -273488 -282964 -104203 -23469 111408
15149 111408 -114515 -265178 92891 216056 37845 -141941 314477 279508 462140 627379
15139 627379 392245 409562 266746 194382 -89946 -296897 66240 293273 29372 256231
15129 256231 268298 187425 91563 166285 45874 -66217 -384814 125701 536913 444875
15119D44875P6896j77286l68072j71182J07593L03376J8246k43642p061k07663
15109b23920J22634Q7574p3097j33009K26746M2265l52748J21915R1210L28626
15099B38196L24619Q93J30769k64528k55676j3269m9231m069r473L0828k7543
15088A01516k30014J82436O1246L7527j64713m6949L27187l20286k53705J19368
15078a86387m4233K01725P8099k357M1233q368J95700J21820J95822K39969k59637
15067E73386l43854P5000J6119m49717l30632M7753J90425J82438N13147O8612
15057E42677j76776j23446o3042L31801K5344N6418K2468l84699n39051j73555
15047d81861L5047J88614M06968L27739j88123m00434j66763L1147j5977J65699
$$ plain form
15119 444875 521771 344485 -23587 -194769 -87176 216200 234446 -9196 -16257 -223920
15109 -223920 -101286 -13712 -86809 -219818 6928 49193 -303555 -181640 -90430 238196
15099 238196 562815 563708 694477 429949 174273 161004 111773 107704 98231 129059 101516
15088 101516 -128498 53938 115184 152711 -12002 -58951 268236 -52050 -305755 -186387
15078 -186387 -230620 -28895 49204 46847 88080 79712 275412 397232 593054 833023 573386
15067 573386 229532 304532 320651 -129066 -459698 -411945 -221520 -39082 474065 542677
15057 542677 365901 242455 179413 511214 536558 592976 615444 230745 -308306 -481861
15047 -481861 -446814 -258200 148768 476507 288384 -112050 -278813 -247666 -263643 -97944
15037i7944j3433N1330k0685J51330K17980K31602j84878k09243j72822j08873
15027a55636k89385l30975L75042M69058R6781l24391M4850N0933J2742Q4534
15017C3553j17234j15720J22601k18054j85864J57499K40126Q586O5264K9960
15007B0717O4943j3701j87063l15983n4695q7026M98856J62271J80131R1016k81711
14996G7755m3114K46745M73484r6323k25852q7336J57488p2971l40683j77139
14986h7946J24686o3477J75193n3838L887L19779J98095l41523m26718j4000M8577
14975a17285J40685L41091P2810j01925R5526l820j41380j60736L0357N6153K2709
14964B34185O1046K58120K09908k51346j58207J39758J3052k12899k82325K46380
$$ plain form
15037 -97944 -111377 -60047 -80732 70598 288578 520180 335302 126059 -46763 -155636
15027 -155636 -445021 -775996 -400954 68104 164885 -159506 -114656 -63723 -50981 33553
15017 33553 -83681 -199401 -76800 -294854 -480718 -323219 -83093 -74507 -9243 20717
15007 20717 85660 71959 -115104 -431087 -485782 -572808 -73952 88319 268450 359466 77755
14996 77755 34641 281386 754870 658547 432695 345359 502847 429876 89193 -87946
14986 -87946 36740 -26737 148456 94618 98505 418284 616379 274856 -151862 -165862 -117285
14975 -117285 23400 364491 437301 335376 430902 427082 285702 124966 155323 211476 234185
14964 234185 295231 553351 763259 511913 353706 493464 506516 293617 11292 257672
14954B57672J0688j19966K05737q0576M8112K12832l4427k03395m0967N29133
14944G84843M2197m97751k76226k2974J96385J91597q372l67247k94157J26369
14934a25336K66064q9716j47336N2720J09010k32448n4940j64330j7172K4422
14924c79062j56797K30461R11167J81163j28623j64780l04578m98475J0224K57518
14914d1782K98728L16346j58759l87318J5781j40243K82182K45008k54872j14471
14904F0600j87306J1423K02308q9568K44222Q1374J38460J41494J38746m9908
14894F91845k07872K35819L35240J0930k87397o5221j30426m39937l51264j52421
14884c60704P490J52215K49483J36993J56136K0933k45256k97547n9326L13898
$$ plain form
14954 257672 268360 148394 354131 273555 321667 534499 500072 296677 255710 784843
14944 784843 827040 329289 53063 30089 226474 418071 409699 42452 -251705 -125336
14934 -125336 140728 51012 -96324 -43604 65406 -167042 -221982 -386312 -403484 -379062
14924 -379062 -535859 -305398 605769 786932 658309 493529 188951 -309524 -299300 -41782
14914 -41782 256946 573292 414533 27215 42996 -97247 184935 429943 175071 60600
14904 60600 -126706 -115283 87025 -2543 241679 323053 461513 603007 741753 691845
14894 691845 483973 719792 1055032 1065962 778565 713344 582918 142981 -208283 -360704
14884 -360704 -353214 -200999 48484 185477 341613 362546 117290 -180257 -239583 74315
14874G4315k6173R4656j87535j27327J8580K32268K92223M01872N595l61684m5246
14863C71544L66773R8476j34227j49784k06033k56372k25901L0920L31240Q9802
14853C16438j53507j79086K12191l0953P1083j6871R1863M0503l72768k25354
14843b46461J54428l3511K12291L64687J12504J17999j13077m35849k52942j88844
14833c08775J10282L07983K00402r8052Q4774K193k8406J27033K46989o872m28572
14822B08979j81846j28458j41435L4097J27049K01424J72222K22691J79435J71868
14812H66026j23421o5180p6926j79453k73825j23880O298K66233K69715J55029
14802G20616j04287l80542r5965p9434J17592J67017j2377j24941j54494K00614
$$ plain form
14874 74315 48142 142798 -44737 -172064 -153484 78784 371007 772879 778474 416790 371544
14863 371544 738317 836793 702566 552782 346749 90377 -135524 -104604 226636 316438
14853 316438 162931 -16155 196036 165083 236166 219295 311158 351661 -21107 -246461
14843 -246461 -92033 -125544 86747 451434 563938 681937 568860 133011 -119931 -308775
14833 -308775 -198493 109490 309892 211840 296614 298807 270401 397434 644423 637551 208979
14822 208979 27133 -101325 -242760 -208663 -81614 119810 292032 514723 694158 866026
14812 866026 742605 677425 600499 421046 147221 23341 29639 295872 565587 720616
14802 720616 616329 235787 139822 60388 177980 344997 332620 207679 53185 253799
14792B53799O9361k74273n3278Q2441k24525R3858L8236O7513l3727Q5129P1542
14781A76076J9514R5658L927r6438k32049m922K18737j32715J46503j15617K1447
14770A00121J20421m5895M10688j3691k78500j51976M5233K70887R515j34759
14760C32044p1672k02387j75027l5512m4197J05715L63004J40663k41879J62515
14750C33267j20964j03434J47169J02247j27694J5698M953j28539J41498j39412
14740A24789J35952J81575L68042j635k09464k8532o763o1279M36342L76827l77823
14729I38031l86926k08048r9050l4851k04847J04956K78285J95566n024P3323
14719F51415j35290j49938j39860L3307k81688p7360K96676M50880k59496j87066
$$ plain form
14792 253799 323160 48887 -4391 78050 -146475 -52617 -14381 53132 19405 104534 176076
14781 176076 195590 291248 295175 198737 -33312 -38234 180503 47788 194291 78674 100121
14770 100121 220542 174647 585335 571644 293144 141168 186401 457288 466803 332044
14760 332044 260372 57985 -117042 -152554 -196751 -91036 271968 412631 170752 333267
14750 333267 212303 108869 256038 358285 230591 246289 251242 122703 264201 124789
14740 124789 260741 442316 810358 808723 599259 570727 563964 502685 939027 1315854 938031
14729 938031 551105 343057 244007 209156 4309 109265 387550 583116 578092 651415
14719 651415 516125 366187 226327 259634 -22054 -99414 197262 648142 388646 201580
14709B01580J23430K79370k02161k86300l31608o6738K89951L84592j12771l54414
14699g5069J28080j4417K2347p622q8077m422q8329l5773K49935P2460o0613k13902
14687a15402J02935K9725J73165K7966N6504k21636K89905Q2045q2325K84092
14677F26974k2570O0061Q5513n8649j0877l7151j91816k27392J25284j80149n4172
14666A15056K06416L74144k06915K8557j79410k14087K22569K25107j89779m98385
14656a16727k64238j48448J85702J35864K82924L63966p9364j8010N351n7576
14646B89444J5641j06414l14616J03752J5730O4155J09033J11622Q853J54578
14636D51778J97209J54373J25478L024k20267j7489j28877k89206R5198J37077
$$ plain form
14709 201580 325010 604380 402219 115919 -215689 -282427 7524 392116 279345 -75069
14699 -75069 53011 38594 60941 53319 -34758 -39180 -127509 -163282 86653 159113 98500 -115402
14687 -115402 -12467 17258 190423 218389 274893 53257 343162 425207 342882 626974
14677 626974 604404 664465 749978 691329 680452 643301 451485 224093 349377 169228 115056
14666 115056 321472 695616 488701 517258 337848 123761 346330 571437 381658 -116727
14656 -116727 -380965 -529413 -343711 -207847 75077 439043 359679 341669 347020 289444
14646 289444 305085 198671 -115945 -12193 3537 67692 176725 288347 297200 451778
14636 451778 648987 803360 928838 931862 711595 694106 565229 276023 371221 508298
14626E08298k33906j67158J33119K7387N1904m27810j42164L98094k3749K93153
14616D17168k8165k16878O5478J79372L00039K90229j19547k52772k17601J31649
14606E48972J82002p668n601k48349K7676q135O755j72561j95814k74042o941
14595a53706j53356P4976L08755J97530P8559j23250j90602O0453K8843J68961
14585B97163M41499m707k10442m74663J32270o029o3297P3273J76222R4447j48962
14574C06774j58341P6843J23159N6141m91675J30702K28342l64316p5987K33553
14564F5195K79050Q1271K21212J58547k30818k71181o0028L50482J80673J71686
14554I46089j11469J38791j53924l05337k70644j73168P3551K63375J94432j13794
$$ plain form
14626 508298 274392 107234 240353 267740 319644 -108166 -250330 147764 124015 417168
14616 417168 389003 172125 237603 416975 717014 1007243 887696 634924 417323 548972
14606 548972 730974 723306 717705 469356 497032 488897 495652 323091 127277 -146765 -153706
14595 -153706 -307062 -232086 76669 274199 352758 229508 38906 99359 128202 297163
14585 297163 738662 733955 523513 48850 181120 175091 111794 185067 361289 455736 306774
14574 306774 148433 225276 348435 404576 -87099 43603 271945 -92371 -168358 65195
14564 65195 344245 425516 646728 805275 574457 303276 243248 593730 774403 946089
14554 946089 834620 973411 819487 514150 243506 70338 143889 407264 601696 487902
14544D87902j16818J21050j25747q8141l2562K94043K93731O4770k42718k8886
14534F26624k46159k97325p3967J5597O5799q231k0342O3809p7406k4602J01049
14523A24846j46783R7954K09367R8587j53033J33034K44539J45264j82080o4990
14513E06705r8949j09843j6792K16880Q3971j44153M6397J38145J24177q4485
14503F62053J29696M2536j64966n50074k10171R427K77880K33299K50128m4927
14493F34881q857j40877j95260J9138M7670L18450k35649j09005j06388j71806
14483E2297J60818R0708k97338j7010N29179k8951J46731j79146J17801K16497
14473G91586J61141l15462K4641J54923r6216j70853k29842J71721l6513L4665
$$ plain form
14544 487902 371084 492134 366387 278246 245684 539727 833458 898228 655510 626624
14534 626624 380465 83140 9173 24770 90569 82338 61996 125805 48399 23797 124846
14523 124846 -21937 76017 285384 383971 230938 363972 608511 753775 571695 506705
14513 506705 407756 297913 281121 498001 581972 437819 484216 622361 746538 662053
14503 662053 791749 834285 669319 119245 -90926 -81499 196381 429680 679808 634881
14493 634881 626024 485147 289887 309025 356695 675145 439496 330491 224103 52297
14483 52297 213115 303823 6485 -10525 518654 489703 636434 457288 575089 791586
14473 791586 952727 637265 661906 816829 720613 549760 319918 491639 455126 489791
14463D89791M6067j20864l18305r6373N566J97807L9132L8375J80942O0432j40815
14452C81755M0538L1653k4555J16825j23860k67267J2577o1155J22608j59323
14442F9796j05490l20485j13856M90850Q3629K46888j09392k2957J91100Q2779
14432D92862L1034K17340J13966k22713j73513O9438J94127k20924q434J64628
14422F57811O7018R5842k1010L4914L34986Q7419l65693l64354r0581J29786k31916
14411C34222l1043k53089K32016L42623J19993j72195j59625j93650j63945O7164
14401A22471K72950P9011Q8234j09907Q4753j6517k25462K54851J15168m64779
14391B00773k21605J03115J11453r2372J28012J19337j32969J83624k9917K03301
$$ plain form
14463 489791 535858 414994 96689 316 5882 203689 242821 281196 462138 522570 381755
14452 381755 422293 453946 429391 546216 422356 155089 167666 106511 229119 69796
14442 69796 -35694 -356179 -470035 20815 104444 351332 241940 218983 410083 492862
14432 492862 523896 741236 855202 632489 458976 528414 722541 501617 493183 657811
14422 657811 724829 820671 799661 834575 1169561 1256980 891287 526933 436352 566138 334222
14411 334222 303179 50090 282106 624729 744722 572527 412902 219252 55307 122471
14401 122471 395421 474432 562666 452759 537512 520995 295533 550384 665552 200773
14391 200773 -20832 82283 193736 101364 229376 348713 215744 399368 369451 572752
14381E72752q3202k38188L4942M6497j78443M3239L50889L8750l10945j27873
14371A48418K5061N9871Q7751N109o2442p2686j04804k19605J29496K98882J04107
14360C99158J14508p8064m05056j25537K78619O5033Q6151P7618o6530J79277
14350E25177l10165k62189K93064J18490K47797j17734M4664n9927k18751k54451
14340E975J21575L18519K18984k2177n3950J47982O0617r5984J10431n6698l84233
14329C71041J89272j46113l49075J29041J98959j19214n8384j17258k8912o9961
14319f04m68439J05175L91687L30350j134p788K03768l9623k20959J3105l48230
14308d2692o4654N21745Q1237k46623j37227k17184n6168Q8992j10008J51484
$$ plain form
14381 572752 489550 251362 286304 332801 154358 197597 548486 587236 276291 148418
14371 148418 173479 233350 321101 326210 263768 191082 86278 -133327 -3831 295051 399158
14360 399158 513666 435602 30546 -94991 183628 248661 334812 412430 345900 525177
14350 525177 215012 -47177 245887 364377 612174 494440 539104 479177 260426 5975
14340 5975 127550 446069 665053 642876 588926 736908 797525 701541 811972 755274 371041
14329 371041 560313 414200 65125 194166 393125 273911 215527 98269 69357 -604
14319 -604 -469043 -363868 27819 358169 357035 349247 553015 513392 292433 305538 -42692
14308 -42692 -107346 414399 495636 249013 111786 -105398 -161566 -72574 -182582 -31098
14298c1098J36716L31714J9714r113O5606l20248m89335J4697K76435K55082r4602
14287A55568k32919K04503K74443J31042k24545N8070j74956k27454L1830N15140
14277E10722R1147J85278P2964l73591l82757J34438o2019m2516R5884k52392
14267b2842j53426K24449J34252P0776J6094m1571L14335L36725l59243l65957
14257A53592K43533J54956O0029m4555k77630k9331J34208P2146k28816j61808
14247G6324m1423k20361k34541O3054J60117J7331J36891K30550K96011k51890
14237B32063n85310j05374N6154K16056K32459P2862K6175J70950Q2784m11907
14227a3088L1311L41763K96499J65859K8116j56274j10215j08276K68176l3468
$$ plain form
14298 -31098 105618 437332 457046 447933 513539 193291 -296044 -281347 -4912 250170 155568
14287 155568 -77351 127152 401595 532637 308092 366162 191206 -36248 -4418 510722
14277 510722 601869 787147 860111 486520 103763 238201 176182 133666 229550 -22842
14267 -22842 -176268 48181 182433 253209 269303 227732 542067 878792 519549 153592
14257 153592 397125 552081 612110 567555 289925 260594 394802 466948 238132 76324
14247 76324 34901 -185460 -420001 -356947 -196830 -179499 -42608 187942 483953 232063
14237 232063 -353247 -458621 -402467 -186411 46048 118910 145085 316035 398819 -13088
14227 -13088 18223 359986 656485 822344 850460 694186 583971 475695 743871 710403
14217G10403j07079o088L38975J38129q5656P6023m844k01050J3926j49036k53030
14206D70673j10665Q7367p2321q9504J88528q848r5157J01564J42533k35430k66832
14195A11908K51204O3847J09668J69809N9948k23989j47944Q3660l6318k99894
14185A41899m0461K19232K24513J25365p158k0592j75438k40842j13805J74751
14175B87464K16013J4289q3044N9317M8712N539q5960P8210L6645k04305J57565
14164E30445k34689K22517R0811K09879o9541l19336P0895N851j97403K4553j43732
14153A90250J65058J67485J91853k01206j96904K81456K1749m56517k34661L47461
14143B76024M85951p3377j69466K79140p157j04696P0367K26510r5912n224l36923
$$ plain form
14217 710403 603324 597236 936211 1074340 988684 1064707 1059863 858813 872739 723703 470673
14206 470673 360008 447375 375054 285550 474078 465230 370073 471637 614170 378740 111908
14195 111908 363112 426959 536627 706436 766384 542395 394451 478111 441793 141899
14185 141899 101438 320670 545183 670548 663390 642798 467360 226518 112713 287464
14175 287464 503477 517766 434722 494039 542751 548290 462330 540540 577185 372880 530445
14164 530445 295756 518273 609084 818963 749422 430086 500981 506832 309429 333982 190250
14153 190250 355308 522793 714646 513440 316536 597992 619741 163224 -71437 276024
14143 276024 761975 688598 519132 798272 791115 686419 756786 983296 887384 882160 545237
14132E45237m04465O2684J57160r1370N1672K74355j91270j15482K33316j9099
14122E02738j72467j25639L1590J75196k71703m5425O62621J35148m43622j07479
14112C40958L35678L06367l14412j58384N5700j53349k2528J06644K9646J03321
14102F29641N6274k05619R3954j39220k59246r6203n5414K78116J34085k32992
14092B03376J81967M71284l8432l16322k16001m6627M86635L58476K0235k80929
14082H23662k18303j29990K35009N9729r5871r2999K08695k43190j82152m356
14072C60234Q6541m8779K21417l87279j9950M60181K86872k16835k33989k15129
14062B93284n1734R32K31937K08497J25898m36936j63544K18324J65997K20065
$$ plain form
14132 545237 140772 203456 360616 269246 320918 595273 404003 288521 521837 502738
14122 502738 330271 204632 236222 411418 139715 94290 756911 892059 448437 340958
14112 340958 676636 983003 668591 510207 565907 412558 390030 496674 526320 629641
14102 629641 685915 480296 574250 435030 175784 79581 24167 302283 436368 203376
14092 203376 385343 856627 818195 501873 285872 239245 725880 1084356 1104591 823662
14082 823662 605359 475369 710378 770107 674236 581237 789932 546742 364590 360234
14072 360234 446775 397996 619413 232134 212184 672365 959237 742402 508413 293284
14062 293284 241550 242482 474419 682916 808814 371878 208334 426658 592655 812720
14052H12720J34407k48966j74008K0107k93621l29762J93615Q4810j13998k12808
14042a27504l3979O7020R3468J88866Q0291M0940l0356J58529j0065k16019m6905
14031A64286K92032j13447r9093j27012j29594K28370j7741J35729M8140k9987
14021C51683R0772l76942p2290L16842J37888J29147K01252J54895j6456M626
14011I21417J00500j54476l18690k41663K11611L15186J38181k21537j23590K79281
14001I06220J43854j35321j42546n5082L4404j14679k99161k0102L44967m9132
13991F13422K31758P4703k72840k28071J98034p6786Q4305K78791j61316J3019
13981G55019n9828o8547l9267l11904j61321J61373P00002p3294l03134l38146
$$ plain form
14052 812720 947127 698161 524153 544260 250639 -79123 114492 199302 85304 -127504
14042 -127504 -161483 -94463 -995 187871 268162 309102 278746 437275 427210 211191 164286
14031 164286 456318 342871 243778 116766 -12828 215542 197801 333530 381670 351683
14021 351683 442455 65513 -6777 310065 447953 577100 778352 933247 916791 921417
14011 921417 1021917 867441 548751 307088 518699 833885 972066 750529 626939 906220
14001 906220 1050074 914753 772207 717125 751529 636850 337689 317587 662554 613422
13991 613422 845180 919883 647043 418972 617006 540220 624525 903316 742000 755019
13981 755019 695191 626644 587377 275473 114152 275525 975527 902233 599099 260953
13971B60953l83381j24147J05428L25300J89052l17545k05978J37261R5516M5598
13961A28057K67465m143j20011J69429J74758J51675l2938k94712L06508K69321
13951A015409J37020j40339k76589k65835r6362l94152j81756J22590K75344J84156
13941C79486k90877j91938O7089K36072J71912k50732M5784J309j54957K65810
13931B78958M9779k36538P347J30873L8260o9303R4022J45690L84916j09603j6534
13920F97867l87472k22612K48267L82527k12382l06524k69734L1769K01626J4461
13910A77793R0508p794J40721J00340l84081n2075j33714j55162k07311L40017
13900i0758L46895Q8154k3434n9417O9345p4702Q2846K07282M8969m204j55034
$$ plain form
13971 260953 -122428 -246575 -141147 184153 373205 55660 -150318 -13057 82459 128057
13961 128057 395522 391379 271368 440797 615555 767230 734292 439580 746088 1015409
13951 1015409 1152429 1012090 735501 469666 373304 -20848 -202604 -80014 195330 379486
13941 379486 88609 -103329 -36240 199832 371744 121012 166796 168105 13148 278958
13931 278958 328737 92199 99546 230419 268679 199376 293398 439088 824004 714401 697867
13920 697867 310395 87783 336050 718577 506195 199671 -70063 -38294 163332 177793
13910 177793 268301 260507 401228 501568 117487 65412 -68302 -223464 -430775 -90758
13900 -90758 256137 344291 320857 261440 330785 256083 338929 546211 595180 590976 435942
13889D35942j12765p7971J61410L4648L37732j78163k42913r999q9999K7268P5406
13878C60596j17581j87676O099K04686L06973J36979j53761m7417J01813J40494
13868G51205o8464J06043k36751j61569K83958q6004k23663n3244J55788J43256
13858F10555n8972k10283m02213P9744J65842N4429Q2234J83172L43337j72265
13848F75580j33357n5878l41638L6989P9684J97869L42490M4325J34210K00089
13838A180363k68414l93392k5862P7840m1043J32094M44722j87262l72121n2444
13828D94481Q6837J77550j00694j03356o1842m0707L8809K21759K40758O8683
13818A022278j23398j36395k53414j93578J16010J41505k4044j28360M6369Q224
$$ plain form
13889 435942 323177 245206 406616 441264 778996 600833 357920 347921 257922 285190 360596
13878 360596 243015 55339 61438 266124 573097 710076 556315 508898 610711 751205
13868 751205 682741 788784 552033 390464 674422 588418 364755 311511 467299 610555
13858 610555 551583 341300 -60913 18831 184673 239102 321336 504508 847845 675580
13848 675580 542223 486345 144707 181696 261380 459249 801739 846064 980274 1180363
13838 1180363 911949 518557 492695 570535 529492 661586 1106308 919046 546925 494481
13828 494481 581318 758868 658174 554818 492976 452269 491078 712837 953595 1022278
13818 1022278 898880 762485 509071 315493 431503 573008 548964 420604 466973 475197
13808D75197l17483q8856j58345R1060j23095R3260L43975J67678L6794k30916
13798B89269M7023k05630j4576J78911J93723K6996O6895L11205O3822m13654
13788E43984J1160K72242j11096N2557O786j53585j19651p1896j38387J20155
13778D12269L37462O7496l17931j26677q8262J18572M96458K8171j70949j63894
13768E92715l9971K37813K65752j7875l5380j21476j93590j87913k82676J72935
13758C90334J61210k8607J3075M4324P7K11398j1372j05694l07513O1625m4294
13747C84563p84n68067J22492K85953J38018P4269L6961j80940j21921J70924
13737C41468n826L0741o6531P3521K58050J50477J08451l73190q5924L571r1248
$$ plain form
13808 475197 157714 68858 -89487 1573 -121522 -28262 315713 483391 520185 289269
13798 289269 336292 130662 116086 294997 488720 515716 582611 893816 957638 543984
13788 543984 555144 827386 716290 768847 775633 622048 502397 430501 292114 412269
13778 412269 749731 817227 499296 372619 284357 402929 899387 927558 756609 592715
13768 592715 552744 790557 1056309 1038434 1003054 881578 687988 500075 217399 390334
13758 390334 551544 522937 536012 580336 580413 791811 780439 674745 367232 428857 384563
13747 384563 383779 -184288 -61796 224157 362175 436444 473405 292465 170544 341468
13737 341468 335642 366383 299852 373373 631423 781900 890351 517161 431237 434808 343560
13726C43560K45724r7268m0857l4584Q0385m6608r7456J8727K84553Q8242N1258
13715G95676k88198j00758J40773J51514J23764K00367j64507m32013l32161p4922
13705A9535L45461N83965k56102J70646j61888k19173K06991K17578J17785j95627
13695H29171j39827J72517j58959k55343R631J12116r2145O2148J97231m32804
13685C03736j17803L69684N7820J41352P5199l82085j71791k08183j09487K16013
13675A74455M52099L12776l03175o47878N9132L23218L08143K82164J48218j85524
13665I23628K06439K25202k71054l24188k10912o8269q7419K18951M01438R1969
13655A105785j5828J5075j85026p8392j3563J76285n2381O9024l37409j64275
$$ plain form
13726 343560 589284 492016 451159 416575 496960 450352 352896 371623 656176 744418 795676
13715 795676 507478 406720 547493 699007 822771 1023138 858631 426618 94457 19535
13705 19535 364996 948961 692859 863505 701617 482444 689435 907013 1024798 829171
13695 829171 689344 861861 702902 447559 457190 569306 477161 539309 736540 303736
13685 303736 185933 555617 613437 754789 829988 447903 276112 67929 -41558 174455
13675 174455 626554 939330 636155 -11723 47409 370627 678770 960934 1109152 923628
13665 923628 1130067 1355269 1084215 760027 549115 480846 393427 612378 1013816 1105785
13655 1105785 1089957 1105032 920006 841614 828051 1004336 951955 1020979 683570 519295
13645E19295J51758N22363k84089k65413J14343j10723j9962l34681j24169K08569
13635C77291k06401l12595J04740K27679M4528K04976K69971o547l91976k86952
13625B4714j76074K30915J60535J12415K21719k5774k20246J62716j58125j39980
13615A92815q0552j15933n5622J31315L331K9317J58537J21874Q8720L5993l79032
13604A30763j87935J0403L27709J66328L5183j23037K0953J17289J76909J8845
13594F93410q2784j58975l18080O0206L85633P0879K33277J33898n74021j2214
13584D31229P19n0037J0141J09647l4007M0317j77038j34856k51151L11921P6349
13573C33234j21498K25655J18104r2473J33068L27690j60202p9337K3824J41038
$$ plain form
13645 519295 671053 1193416 909327 643914 758257 647534 627572 292891 168722 377291
13635 377291 170890 -141705 -36965 190714 235242 440218 710189 703642 311666 24714
13625 24714 -151360 79555 240090 352505 574224 548450 328204 490920 332795 192815
13615 192815 112263 -3670 -59292 72023 75354 104671 263208 385082 473802 509795 130763
13604 130763 -57172 -46769 280940 447268 482451 359414 380367 497656 674565 693410
13594 693410 610626 451651 133571 193777 579410 650289 883566 1017464 443443 431229
13584 431229 431948 381911 392052 501699 467692 508009 330971 196115 -55036 256885 333234
13573 333234 211736 437391 555495 463022 596090 923780 763578 684241 708065 849103
13563H49103K97055j16295J0535P1944k63517k5050j6845m00416k6500K94246
13553F74260j65902j02745j56549P9810J34561j08067k13855N5923L23530O7187
13543E88153q1222K19350J20812p0902n4299k899k57198m86273K79729n864l7154
13532B12233r0949l69076J71813L39976J17887K96525L70884M0905r3281r9561
13522H97356j40990j37641j80929K11392n24759k61063N65941K91757r7504q308
13512F15252J78480Q2950l49079J14241M77484R2018J10695k29743j82912k87504
13502F21882p039K16072J19779J93457j20377j39479k25527j15548K25763k8370
13492G40613l05594j89342J7902M0791Q5350L80284J22112J31044m93495p561
$$ plain form
13563 849103 1146158 1029863 1040398 1112342 848825 823775 806930 406514 380014 674260
13553 674260 508358 405613 249064 328874 463435 355368 141513 197436 520966 588153
13543 588153 506931 726281 847093 776191 721892 718993 461795 -24478 255251 249387 212233
13532 212233 121284 -247792 -75979 263997 381884 678409 1049293 1090198 996917 897356
13522 897356 756366 618725 437796 649188 124429 -136634 429307 721064 623560 615252
13512 615252 793732 876682 527603 641844 1119328 1211346 1322041 1092298 909386 621882
13502 621882 614843 830915 950694 1144151 1023774 884295 658768 543220 768983 740613
13492 740613 435019 245677 263579 304370 389720 770004 892116 1023160 529665 522104
13482E22104j58482J22590k1241m1324O1825K5384K59165P7178L7064k52111p4101
13471E58051J99934j52149k7372K98919J82846j0294o3331m1123o5146j01843
13461G78492K5723n2934j95501n3027M7583K5332o2651m766M3479J2748Q02l8875
13449E26405J14597k41993l58988J42005L26394o550j4428L01748j32136j66162
13439D90892m1467L5831J20062R4658O3017J96315j99431r105J86891p3928j69187
13428F94548R1276J24338p7190K09504Q6611j11540k62012l32920L2492m533m6295
13417D04279j04983J12861J63448J78756J45838K18974j12092j28723J21138K9769
13407A029265j77407R2840j70893l96747j01899M7380J08107K47656K64374k78028
$$ plain form
13482 522104 363622 486212 464971 423647 485472 510856 770021 847199 884263 632152 558051
13471 558051 757985 605836 578464 877383 1060229 1049935 986604 945481 880335 778492
13461 778492 804215 751281 555780 502753 550336 575668 513017 508251 551730 564478 565280 526405
13449 526405 641002 399009 40021 182026 508420 501870 487442 789190 657054 490892
13439 490892 449425 485256 605318 699976 762993 959308 759877 750772 937663 863735 694548
13428 694548 785824 910162 832972 1042476 1129087 1017547 755535 422615 455107 450574 404279
13417 404279 299296 412157 575605 754361 900199 1119173 1007081 878358 999496 1029265
13407 1029265 851858 944698 773805 377058 275159 322539 430646 678302 942676 664648
13397F64648j65744K5321j04731L0405l8548R7681K07622j347M6433M2964J19026
13386I23730j29332j50495n5007j20788Q218k00197k44012Q127K01025J26985
13376C68254j82207l08734q562O10241J10572L374J02433j50392j98528Q0188
13366D26639j850p4042j54413q499j24051N3416o8491J27061J57479J76312l4272
13355D75289r6047L70725L88205j58403j00267R5061k66503l41319j45460j86635
13345C4646M18565L88946q1213j65544M44397j19526l22909K47965L2967K1732
13335I00026l77444k2815L3140k74607P2667K29667r1046k2480k5415L70933j55328
13324F37298o0551j54225R4625J53301J0141k13317K4162j25328k00502j11654
$$ plain form
13397 664648 498904 524225 419494 449899 411351 509032 716654 715307 761740 804704 923730
13386 923730 794398 643903 588896 468108 476326 276129 32117 40244 241269 368254
13376 368254 186047 -122687 -131249 478992 589564 592938 695371 544979 346451 426639
13366 426639 424789 350747 196334 187835 63784 117200 48709 175770 333249 509561 475289
13355 475289 379242 749967 1138172 979769 879502 974563 708060 366741 221281 34646
13345 34646 453211 842157 760944 595400 1039797 920271 597362 845327 878294 900026
13335 900026 522582 499767 532907 258300 330967 560634 469588 447108 421693 792626 637298
13324 637298 576747 422522 517147 670448 680589 467272 491434 366106 165604 53950
13314E3950P8177Q6116j76993J09809J8248J38390J06617j02157L17441L07310
13304I36908k9966j07688k06387j2769O2202R5058N4496J04216r8599K49800L56362
13293A403633l29984j28539k45501j05697L7651j05720Q7402J09383j75546J73713
13283G20795p446j14673p6374j1923O3891J1109o7900J4605r858J69413K44345
13272I35984K7497N8288M88859J56159l02923o83359j2121m7125m07470J8828
13262B32617M0245R1013K26854K29769N0014M0996L48388l09700n67970k4840
13252C57386K23945O6099j74434k16026o9463p3166j10812q379j19218K23128
13242I9060K20796j68524l14489J19225L13367M9243M54935K9148l17316k07477
$$ plain form
13314 53950 132127 218243 41250 151059 169307 307697 414314 312157 629598 936908
13304 936908 906942 799254 592867 580098 642300 737358 791854 896070 797471 1047271 1403633
13293 1403633 1073649 945110 699609 593912 631563 525843 613245 722628 547082 720795
13283 720795 713349 598676 522302 510379 574270 585379 517479 532084 522226 691639 935984
13272 935984 963481 1021769 1510628 1666787 1363864 680505 668384 621259 213789 232617
13262 232617 272862 363875 590729 820498 870512 911508 1259896 950196 382226 357386
13252 357386 581331 647430 472996 256970 187507 114341 3529 -4850 -124068 99060
13242 99060 319856 151332 -163157 -43932 269435 318678 773613 802761 485445 277968
13232B77968J02290K75812L16064j42969l9914p6140K08470j07641l2867l14088
13222D66985k79492K34361K65824o9487l77687j76479l682L89966K24747K4461
13212F99517k44260J05224M29778p4564j79790m1560j09471k220J85182O6708
13202H34544q5088J3925M0828j34723j59737L42916J08421j25525k68544k13881
13192C53136L88940J79782n13691k49996J58941K62615j08587N6175J03141m15923
$$ plain form
13232 277968 380258 656070 972134 829165 789251 713111 921581 813940 781073 466985
13222 466985 187493 421854 687678 618191 240504 64025 60343 450309 675056 699517
13212 699517 455257 560481 990259 915695 735905 694345 584874 582654 767836 834544
13202 834544 749456 763381 804209 669486 509749 852665 961086 835561 567017 353136
13192 353136 742076 921858 408167 158171 317112 579727 471140 527315 630456 214533
$$ [...]
##END NTUPLES=NMR SPECTRUM
##END=
