##TITLE=Analysis number 311295
Compound Code mo 01153
Book Reference 444/6
Project Code adrs
Chemist Name howarde
##JCAMPDX= 6.0         $$ Bruker NMR JCAMP-DX V2.0
##DATA TYPE= NMR SPECTRUM
##DATA CLASS= NTUPLES
##ORIGIN= Bruker BioSpin GmbH
##OWNER= NMR
$$ XWIN-NMR		Version 3.5
$$ Tue Jul  5 12:18:55 2005 GMT Daylight Time (UT+1h)  MAYBRIDGE\NMR@NMR_250MHZ
##.OBSERVE FREQUENCY= 250.131544655141
##.OBSERVE NUCLEUS= ^1H
##.ACQUISITION MODE= SIMULTANEOUS (DQD)
##.ACQUISITION SCHEME= undefined
##.AVERAGES= 16
##.DIGITISER RES= 18
##SPECTROMETER/DATA SYSTEM= dpx250
##.PULSE SEQUENCE= zg30
##.SOLVENT NAME= CDCl3
##.SHIFT REFERENCE= (INTERNAL, CDCl3, 0, 16.3922)
##AUDIT TRAIL= $$ (NUMBER, WHEN, WHO, WHERE, WHAT)
$$ ##TITLE= Audit trail, XWIN-NMR		Version 3.5
$$ ##JCAMPDX= 5.01
$$ ##ORIGIN= Bruker BioSpin GmbH
$$ ##OWNER= NMR
$$ C:\u/data/dgb/nmr/ADRS/5350/pdata/1/auditp.txt
$$ ##AUDIT TRAIL=  $$ (NUMBER, WHEN, WHO, WHERE, WHAT)
(   1,<2005-07-05 12:18:32.99 +100>,<MAYBRIDGE\NMR>,<NMR_250MHZ>,
      <created by zg, POWCHK disabled, PULCHK disabled
       configuration hash MD5:
       62 19 C7 07 E1 42 D1 B7 37 6C 3D D0 77 39 F9 E6
       data hash MD5: 64K
       C6 F8 EE 42 2B 0E 6E B6 7C 13 27 05 43 84 FB F2>)
(   2,<2005-07-05 12:18:45.63 +100>,<MAYBRIDGE\NMR>,<NMR_250MHZ>,
      <Start of raw data processing
       ef LB = 0.3 FT_mod = 6 PKNL = 1 SI = 32K 
       data hash MD5: 32K
       4A EE 15 20 E1 6E 33 4B 3A 03 EB F2 CA 2B FD D0>)
(   3,<2005-07-05 12:18:49.05 +100>,<MAYBRIDGE\NMR>,<NMR_250MHZ>,
      <apk 
       data hash MD5: 32K
       BA 04 0B 4B 4C 51 CA 3C DB D0 D6 0F 19 95 9A BE>)
(   4,<2005-07-05 12:18:49.91 +100>,<MAYBRIDGE\NMR>,<NMR_250MHZ>,
      <abs ABSG = 5 
       data hash MD5: 32K
       FD A7 5B ED C2 DD E8 10 99 3D 1C 94 1B 69 F8 0E>)
$$ ##END=
$$ 
$$ hash MD5
$$ 93 C2 C5 B2 BF A3 67 18 B9 9C F1 CE 5D 97 79 0E
##$RELAX= 
##$RELAX= 
##$RELAX= 
##$RELAX= 
##$RELAX= 
##$RELAX= 
##$RELAX= 
$$ Bruker specific parameters
$$ --------------------------
##$DU= <C:\u>
##$EXPNO= 5350
##$NAME= <ADRS>
##$PROCNO= 1
##$TYPE= <nmr>
##$USER= <dgb>
##$AMP= (0..31)
100 100 100 100 100 100 100 100 100 100 100 100 100 100 100 100 100 100 
100 100 100 100 100 100 100 100 100 100 100 100 100 100 
##$AQSEQ= 0
##$AQ_mod= 3
##$AUNM= <au_zg>
##$AUTOPOS= <28 >
##$BF1= 250.13
##$BF2= 250.13
##$BF3= 250.13
##$BF4= 250.13
##$BF5= 500.13
##$BF6= 500.13
##$BF7= 500.13
##$BF8= 500.13
##$BYTORDA= 1
##$CFDGTYP= 0
##$CFRGTYP= 5
##$CHEMSTR= <none>
##$CNST= (0..31)
1 1 145 1 1 1 1 1 1 1 1 1 1 1 1 1 1 1 1 1 1 1 1 1 1 1 1 1 1 1 1 1 
##$CPDPRG= <>
##$CPDPRG1= <>
##$CPDPRG2= <>
##$CPDPRG3= <>
##$CPDPRG4= <mlev>
##$CPDPRG5= <mlev>
##$CPDPRG6= <mlev>
##$CPDPRG7= <mlev>
##$CPDPRG8= <mlev>
##$CPDPRGB= <>
##$CPDPRGT= <>
##$D= (0..31)
0 1 0 0 0 0 0 0 0 0.06 0 0 0 0 0 0 0.0002 0 0 0 0 0 0 0 0 0 0 0 0 0 0 
0 
##$DATE= 1120562312
##$DBL= (0..7)
120 120 120 120 120 120 120 120 
##$DBP= (0..7)
150 150 150 150 150 150 150 150 
##$DBP07= 0
##$DBPNAM0= <>
##$DBPNAM1= <>
$$ [...]
##$SUBNAM7= <"">
##$SUBNAM8= <"">
##$SUBNAM9= <"">
##$SW= 20.6930455092707
##$SWIBOX= (0..15)
0 0 3 0 0 0 0 0 0 0 0 0 0 0 0 0 
##$SW_h= 5175.983436853
##$TD= 65536
##$TD0= 1
##$TE= 295.16
##$TE2= 300
##$TE3= 300
##$TEG= 300
##$TL= (0..7)
0 120 120 120 120 120 120 120 
##$TP= (0..7)
150 150 150 150 150 150 150 150 
##$TP07= 0
##$TPNAME0= <>
##$TPNAME1= <>
##$TPNAME2= <>
##$TPNAME3= <>
##$TPNAME4= <>
##$TPNAME5= <>
##$TPNAME6= <>
##$TPNAME7= <>
##$TPOAL= (0..7)
0.5 0.5 0.5 0.5 0.5 0.5 0.5 0.5 
##$TPOFFS= (0..7)
0 0 0 0 0 0 0 0 
##$TUNHIN= 0
##$TUNHOUT= 0
##$TUNXOUT= 0
##$USERA1= <user>
##$USERA2= <user>
##$USERA3= <user>
##$USERA4= <user>
##$USERA5= <user>
##$V9= 5
##$VALIST= <valist>
##$VCLIST= <CCCCCCCCCCCCCCC>
##$VD= 0
##$VDLIST= <DDDDDDDDDDDDDDD>
##$VPLIST= <PPPPPPPPPPPPPPP>
##$VTLIST= <TTTTTTTTTTTTTTT>
##$WBST= 1024
##$WBSW= 4
##$XGAIN= (0..3)
0 0 0 0 
##$XL= 0
##$YL= 0
##$YMAX_a= 557376
##$YMIN_a= -392894
##$ZGOPTNS= <>
##$ZL1= 120
##$ZL2= 120
##$ZL3= 120
##$ZL4= 120
##$ABSF1= 16.39221
##$ABSF2= -4.300961
##$ABSG= 5
##$ABSL= 3
##$ALPHA= 0
##$AQORDER= 0
##$ASSFAC= 0
##$ASSFACI= 0
##$ASSFACX= 0
##$ASSWID= 0
##$AUNMP= <proc_1d>
##$AZFE= 0.1
##$AZFW= 0.1
##$BCFW= 0
##$BC_mod= 0
##$BYTORDP= 0
##$COROFFS= 0
##$CY= 12.5
##$DATMOD= 1
##$DC= 0
##$DFILT= <>
##$DTYPP= 0
##$F1P= 14.0000005364418
##$F2P= -0.99999901652339
##$FCOR= 0.5
##$FTSIZE= 32768
##$FT_mod= 6
##$GAMMA= 0
##$GB= 0
##$INTBC= 1
##$INTSCL= 1
##$ISEN= 128
##$LB= 0.3
##$LEV0= 0
##$LPBIN= 0
##$MAXI= 10000
##$MC2= 0
##$MEAN= 0
##$ME_mod= 0
##$MI= 0
##$NCOEF= 0
##$NC_proc= -4
##$NLEV= 6
##$NOISF1= 0
##$NOISF2= 0
##$NSP= 0
##$NTH_PI= 0
##$NZP= 0
##$OFFSET= 16.39221
##$PC= 1
##$PHC0= 162.572
##$PHC1= -36.62381
##$PH_mod= 1
##$PKNL= yes
##$PPARMOD= 0
##$PSCAL= 4
##$PSIGN= 0
##$REVERSE= no
##$SF= 250.130032463285
##$SI= 32768
##$SIGF1= 0
##$SIGF2= 0
##$SINO= 400
##$SIOLD= 32768
##$SREGLST= <1H.CDCl3>
##$SSB= 0
##$STSI= 32768
##$STSR= 0
##$SW_p= 5175.98343685301
##$SYMM= 0
##$S_DEV= 0
##$TDeff= 65536
##$TDoff= 0
##$TI= <Analysis number 999999
Compound Code 99
Book Reference 9
Project Code 9>
##$TILT= no
##$TM1= 0
##$TM2= 0
##$TOPLEV= 0
##$USERP1= <user>
##$USERP2= <user>
##$USERP3= <user>
##$USERP4= <user>
##$USERP5= <user>
##$WDW= 1
##$XDIM= 32768
##$YMAX_p= 502246648
##$YMIN_p= -203198
$$ End of Bruker specific parameters
$$ ---------------------------------
##NTUPLES= NMR SPECTRUM
##VAR_NAME=  FREQUENCY,     SPECTRUM/REAL,   SPECTRUM/IMAG
##SYMBOL=    X,             R,               I
##VAR_TYPE=  INDEPENDENT,   DEPENDENT,       DEPENDENT
##VAR_FORM=  AFFN,          ASDF,            ASDF
##VAR_DIM=   32768,         32768,           32768
##UNITS=     HZ,            ARBITRARY UNITS, ARBITRARY UNITS
##FACTOR=    0.157963299565203, 1,           1
##FIRST=     4100.18402112433, 0,            0
##LAST=      -1075.79941572868, 0,           0
##MIN=       -1075.79941572868, -203198,     0
##MAX=       4100.18402112433, 502246648,    0
$$ Real data points
##PAGE= N=1
##DATA TABLE= (X++(R..R)), XYDATA
$$ [...]
20958 -8848 -6230 -2032 -4753 -5018 6120 10410 2301 -3432 1146 10877 441 -8240 892 11433
20944 11433 12064 14103 13992 6463 -2548 -4609 -2473 1190 419 -2781 -3662 1247 3677 6067 8897
20929 8897 1005 -14837 -19514 -14124 -12662 -18405 -11519 -2513 -6377 -158 851 2303 3164 2257 -2656
20914 -2656 9354 10369 8902 6799 1124 2050 8504 8626 8441 -1091 -6245 -4258 -9172 498 -3592
20899 -3592 -4088 -2189 -5266 -6326 -5746 -851 5376 12579 9603 6298 8072 2103 -12433 -16237 -11586
20884 -11586 -2061 1585 2054 2785 5192 6427 9205 10569 16864 20624 14051 6456 -1995 5797 20678
20869 20678 20812 6661 2739 10889 13280 12361 13692 7209 2693 6947 12249 24100 11925 1933
20855 1933 6246 6644 -1038 -3860 810 9814 13406 8961 2857 3299 12913 17991 15482 11851 6222
20840 6222 8451 9421 743 3008 533 444 8385 19179 17554 15554 24307 28076 26001 21278 18769
20825 18769 14765 4558 295 5585 -47 -3348 2463 -2302 -4921 -9682 -11750 -6440 -872 -3408
20811 -3408 -4477 4374 4798 7074 17989 13417 10791 15933 18778 11529 3256 -2657 1096 446 -6258
20796 -6258 6967 17057 10811 16721 12064 7794 6083 4248 5150 7234 4255 -9856 -6877 -2509
20782 -2509 606 -1698 -13895 -16544 -2118 11597 9534 1194 -5437 -8335 -1219 8395 14469 26314
20768 26314 20051 13394 9903 8069 11227 12538 2765 -7565 -1660 13790 20474 15869 6963 2216
20754 2216 6371 5803 -1618 -3519 3164 10033 6447 10904 9124 4146 9073 9741 1590 -7841 -9336
20739 -9336 -10742 -14295 -5973 1714 11391 4457 -8525 -13562 -15453 -12911 -10312 -10034 -641 11885
20725 11885 7978 -2168 -2639 3630 829 2364 3960 -7450 -11192 -8826 966 5632 -955 -6355
20711 -6355 -11769 -2494 8221 11714 8428 14949 19285 11404 10246 8828 2199 269 -8778 -11509
20697 -11509 -12633 -5570 -8347 -16334 -13519 -6931 -7620 -2670 1356 -4652 -10837 -5727 -2264 -256 -4084
20682 -4084 -11089 -8710 -9455 -8651 -2626 5066 2030 1166 7955 6253 950 -5982 -12552 -4104 1921
20667 1921 5599 1537 -4946 -2360 -4151 583 -11985 -18635 -22455 -24377 -20158 -11711 4597 20004
20653 20004 15736 3597 -3759 -2526 -2631 425 -95 -4703 -6146 -8508 -7925 -714 -119 -6139 -8669
20638 -8669 -957 11156 5933 5535 13653 12897 934 -6193 -3525 4191 13966 7725 189 1120 664
20623 664 -1505 -20991 -25435 -11422 -1354 1991 -2449 -7221 -289 1556 8294 6979 1052 -1001
20609 -1001 4604 1653 -7103 -7914 -842 -4917 5656 10323 6897 1345 -8217 -14060 -7651 -2585 -8074
20594 -8074 -9797 -15635 -20683 -14084 -6818 -5309 6165 2788 -2419 2785 7209 4807 4511 -10575
20580 -10575 -14572 -16650 -13094 -2235 -1244 -98 8358 3288 -1527 -11007 -12219 1309 9275 6985
20566 6985 8435 -592 -8621 -7467 3037 14082 8526 6972 14008 12196 3486 -8173 -8690 -1238
20552 -1238 -2650 -363 -1309 -5035 -4293 131 -7580 -4567 -539 -5414 -215 6377 6919 12753 11020
20537 11020 2894 2874 1321 -3183 -5061 -3483 -2051 956 2289 -1400 -6170 151 669 7367 9970
20522 9970 6221 -3657 -13541 -1954 5992 -729 -2147 -3395 -755 5875 27494 29826 24129 18765
20508 18765 18410 8375 -688 -156 -5790 -2925 137 13451 12003 10266 12605 6718 4021 10957
20494 10957 4694 -10471 -2289 9468 5511 1307 -919 7386 8776 1690 -8289 -5066 -1301 703
20480 703 4127 2254 -1933 74 4868 6806 4874 21803 27341 14058 -974 -1520 -7827 -10724
20466 -10724 -7143 -680 -5094 -3335 -1769 -1836 79 -1532 -5264 -367 3912 15919 17286 15295 16089
20451 16089 9249 -2444 -2588 2720 3573 -1959 -5133 -5696 -7561 901 4671 321 -716 6011 8122
20436 8122 2266 -3964 -2880 134 -3085 -2206 292 2279 -13414 -11755 -7625 -3294 261 5815 8494
20421 8494 7106 14705 6258 -5301 -8982 -1030 5606 10596 5495 1404 11097 5331 6790 14229
20407 14229 11952 1582 -1381 -1179 4836 -7180 -9550 -6424 -3888 3900 751 1678 3356 -279
20393 -279 -4848 -7562 3819 4396 3264 444 10462 9106 9987 10880 4870 -766 -2063 -10 7612
20378 7612 5604 -722 -1141 -2935 -5442 -9913 -11781 -6771 -2396 4531 8563 11285 6889 -5267 -1277
20363 -1277 -2952 -6462 -9299 -2740 3352 -2208 -7758 -4944 -3234 -6382 -6390 -4293 240 3077 5504
20348 5504 2316 2676 11802 12366 2044 6743 2526 1782 2629 2791 -1167 -700 5365 22 -5404 5013
20332 5013 6602 5455 -2703 5292 3210 1117 9205 10843 5656 14675 14009 10065 4381 6813 9564
20317 9564 1899 -17970 -27567 -20454 -10537 -1701 -5423 -13634 -14973 -11147 -2922 -470 -5004 -5695 1293
20302 1293 5893 3801 5191 -4589 -4331 5439 9073 3978 -1747 1494 2596 1689 -3080 -5860 -13877
20287 -13877 -21471 -14792 -14585 -10126 -944 5036 2870 4401 -3135 -12055 -8300 -3694 -698 4916 13903
20272 13903 20106 29245 18761 3098 -6511 1858 5140 7393 12182 24023 30701 25736 13040
20259 13040 817 -4451 -5939 -4149 1205 -3721 -2094 2170 -5375 -8198 3760 14265 9323 6177
20245 6177 2460 3231 3359 5629 11123 13792 20042 17516 15965 8586 5279 177 1034 2219 2614 4716
20229 4716 4877 6640 8302 9978 19373 13770 15950 11985 -1616 -1700 503 862 2213 -82 -5789
20214 -5789 -8147 -16136 -16807 -6877 2324 18775 28351 18631 14166 473 -8083 -4419 228 1422
20200 1422 -1504 -6670 -10838 -5879 -2450 4252 10485 13324 5674 -6153 -15875 -14264 -12171 -4587
20186 -4587 7544 9171 191 -4637 -719 5026 -341 -6822 -3312 831 -6948 -10866 -17121 -10467
20172 -10467 -3151 -2853 3560 12608 9334 6178 5552 -1359 -9884 1198 8749 8335 3844 4003 3947 4957
20156 4957 2340 6700 10382 6904 12348 23521 24932 13561 8827 6215 2121 9208 7847 6017
20142 6017 11448 10519 5162 -5755 -3013 1739 -2084 -9373 -2454 14089 13631 12599 7837 2722 -4315
20127 -4315 -10254 -5805 -2577 -815 7412 12821 10543 6307 4767 3325 5623 11575 16898 18552 11505
20112 11505 1253 -10674 -4813 -5008 -12743 -13787 -10427 2416 1708 1275 -5796 -10839 -23948 -31625
20098 -31625 -27257 -26919 -16222 6178 16612 18485 17657 11545 8939 10793 10286 5136 6774 -1316
20084 -1316 -3472 5 1991 5636 4254 218 5869 4778 9689 9364 11224 12076 11645 6739 7260 5710
20068 5710 8134 12189 1218 -4805 268 7965 12934 12434 11198 10347 5441 1801 1651 4157 -7136
20053 -7136 -10374 -10878 -10297 -10356 -6197 -7613 -4587 -3244 170 10323 10614 8533 12896 2248 -3863
20038 -3863 -6690 1132 5654 6241 3267 -11825 -16316 -17325 -8955 -7680 -8408 -7702 -6881 -9327 -9950 -5621
20022 -5621 5853 8482 -1888 505 2498 4693 3127 11740 15425 25939 23905 15780 8156 -2974
20008 -2974 -10568 -19559 -13301 -4945 -12021 -8018 4262 17141 18338 18407 16105 10171 7461 14285 14083
19993 14083 11462 11709 1949 -7077 -1996 -344 1114 7466 8702 17024 16081 7674 -1702 -4411 242
19978 242 8514 2037 3799 5156 11611 14331 8854 2589 1775 5653 8508 7615 2071 4522 10375
19963 10375 5365 88 -3901 4721 -1223 -5126 -1456 -2067 5366 6436 1150 2445 13334 12523 2869
19948 2869 -9292 -18078 -24286 -28399 -25422 -26810 -30919 -16337 -1479 734 3733 8493 69 -8036
19934 -8036 4586 13352 13252 6404 3910 8236 4803 -3821 -566 1455 11662 6024 553 -3466
19920 -3466 -490 5681 -2857 -10677 -1724 -4628 -6726 -7867 -9921 -4212 -9943 -8702 -13304 -19514 -13526
19905 -13526 -12793 -16421 -12941 -4725 863 655 6942 9225 3320 6038 10643 2627 -7311 -17223 -6725
19890 -6725 -2277 -6890 -4053 2406 7003 6284 3713 6510 4994 5277 7025 9073 3509 4568 4208
19875 4208 2630 4818 8996 5791 -4654 -13780 -8047 -966 7653 9654 6646 4107 6115 3625
19861 3625 -5442 -192 862 6974 18283 11782 6628 5380 -9575 -11809 -337 790 777 -5617
19847 -5617 -2788 3979 14545 11932 13618 10111 2058 -7677 -10764 -9823 -3644 -25 1645 8864 9486
19832 9486 3571 -2366 -13018 -6804 -4607 -245 3378 7136 9699 11737 11116 12088 8614 -1337 -1748
19817 -1748 -3612 -6700 -13655 -12641 -8611 -16414 -17607 -20076 -25174 -19854 -6431 -78 9029 8039 -958
19802 -958 404 3227 2132 5495 3924 2622 4494 4703 -8860 -20145 -20006 -22788 -9563 -4307 -6508
19787 -6508 69 3213 537 -2168 -4008 -7790 -14454 -14711 -11811 -1652 -254 -7215 -2049 -43 -4224
19772 -4224 -9037 -12281 -18577 -23324 -21473 -17184 -13920 -10820 -11206 -15186 -4973 -164 -833 2854 4467
19757 4467 1517 -10565 -12115 -1145 -2852 -3772 10290 14734 4476 8138 9174 1399 -3161 -2897
19743 -2897 -3524 453 13342 5397 -8098 -7833 -3405 -4771 -5359 -8987 -6935 -2854 -797 2037 8531
19728 8531 1129 -2038 -8078 124 -1186 1511 -790 -9344 -1927 1616 -1064 7443 3909 -2911 3834
19713 3834 9190 1171 1702 5908 4849 9792 6002 -796 -132 -1978 228 -2987 -5512 -4680 -8992
19698 -8992 -16674 -9448 -10083 -14780 -10583 -8023 -6562 -9918 -17338 -14951 -6596 -5621 -4595 -13057 -15176
19683 -15176 -16935 -12624 2595 7401 5795 -719 3174 -5524 752 16273 7789 6136 5029 2478
19669 2478 -1627 -5200 -10864 -16238 -14781 -8272 1956 9338 8154 4759 -10216 -13129 -7172 -3547
19655 -3547 -8339 -12014 -13537 -7817 -6285 -4742 -2760 -4656 -8575 -13079 -13868 -11168 -7575 1192 6602
19640 6602 5161 -1869 1766 3337 1991 3155 10833 8876 -4410 -12459 -2786 1177 5442 16019
19626 16019 8512 2806 12242 9592 1348 -1295 3488 7107 13054 13170 6850 -1128 4892 11885 19712
19611 19712 24948 19966 11503 70 -8718 -10969 1786 3810 5396 2241 10294 4663 3143 943
19597 943 2999 8242 2988 291 -6378 -4768 3227 7611 8816 9149 4523 3152 -1785 -2847 -2655
19582 -2655 296 -436 -5408 -7603 -1205 -11925 -14579 -10763 -7658 -10511 -10342 -14285 -13088 -4953 2710
19567 2710 8773 7620 8981 9871 1519 -6189 -5556 -6721 -8385 -11323 -14247 -11513 -13055 -6798 4875
19552 4875 15840 11980 -477 65 3928 4623 1897 6078 10272 16654 11623 7694 13617 11962 4418
19537 4418 -902 -468 -5232 1217 7907 10774 7249 4421 9769 -3171 -8883 -7578 -2597 -3998 -7750
19522 -7750 -1446 4038 -1865 -1054 -10336 -6836 -9837 -17689 -17976 -12473 -8636 -15044 -17768 -9969 -7260
19507 -7260 -5966 -11812 -8235 -7386 -6944 -9706 -10346 -1557 2015 -3313 -3241 -5939 -971 6138 426 -972
19491 -972 1674 6906 3380 1889 -4519 -5583 -6540 -14076 -12106 951 6218 6213 -1063 -7501 -5558 1102
19475 1102 -2153 -2091 4708 7551 3829 3482 3420 5341 12052 6792 -374 -14022 -13659 -8193 -6332 4261
19459 4261 4187 -4024 -7544 -2940 956 -8191 -15224 -6120 1389 -773 -367 -4520 -4346 -5875 1445 12996
19443 12996 6617 2039 3185 216 -4523 301 -2040 3104 5891 7659 -3701 -3576 2259 5100
19429 5100 19106 14290 1905 -2764 -1727 4639 12921 12552 9948 11033 3441 -4702 -2767 -6789
19415 -6789 -7614 -4840 -7811 -12356 -10801 -3850 -8986 -16665 -16196 -9119 -6740 -4242 -10536 -12177 -8014
19400 -8014 -10595 -7041 3410 12553 15792 12875 4349 -16433 -20790 -20233 -15195 -10326 -7913 -8701 -16499
19385 -16499 -15831 -8848 1431 15784 16539 16380 8488 5384 3163 468 -2654 -3019 5312 2646 192
19370 192 3153 -394 6393 19922 18522 9217 5569 8834 3969 274 -296 -2848 1392 7646 4356
19355 4356 -2272 -4404 -8842 -8895 1605 8137 1431 -11893 -6144 -7423 -8939 -5691 -4041 -646 1621
19340 1621 1095 -495 1714 5252 13917 15869 -9931 -23834 -12913 -4215 -9462 -4843 -6136 -9112
19326 -9112 -11372 -21267 -22399 -11912 -9260 -19543 -15845 -13875 -11572 -16199 -14605 -9619 -3414 57
19312 57 -2088 670 -11016 -14223 -16320 -24024 -19680 -2751 9202 12209 14791 6602 3101 3883 102
19297 102 -5681 3058 4696 -2668 -9092 -10315 -7813 -6020 -6315 -19914 -24885 -19727 -24111 -21468 -18337
19282 -18337 -8057 -3404 2409 6920 -3053 812 10765 16321 6062 -1705 -3101 -6455 -6765 -3849
19268 -3849 -5102 -7170 -16719 -24689 -22349 -10155 2021 -2740 -17869 -13067 -13061 -18280 -13265 -8632 -15304
19253 -15304 -20311 -18859 -9921 -9660 -4549 1839 2137 7986 -1023 -3177 7257 3328 2469 3156 14183
19238 14183 22054 17471 5103 -2453 -5821 -11239 -7700 -3620 8924 25305 24749 16899 2847 -2281
19224 -2281 1144 5239 5225 3655 -2180 -6565 -10686 -9084 -2800 4112 -1073 2505 5094 -5810 -2935
19209 -2935 -877 2763 11592 4274 -2706 -8245 -13341 -7934 -8037 -19985 -21460 -13144 -2843 5337
19195 5337 15561 11897 6953 11753 12699 10039 5079 -365 -8738 -8062 -10093 -9863 -8791 -8958 380
19180 380 9046 13720 10073 8836 5554 -7547 -14800 -8093 7788 4373 -6263 -7434 -6539 -10706
19166 -10706 -8989 -5561 -2502 3983 2955 -1001 2591 3140 4493 9533 9207 4030 1135 10778 13900
19151 13900 16981 10594 -746 -14394 -19833 -18344 -14550 -5792 2041 5093 10128 2110 -9086 -20485
19137 -20485 -29627 -22345 -20566 -20422 -10309 -4379 -3890 -7497 -1825 208 -651 -1060 -9440 -13475 -8492
19122 -8492 2181 19080 12375 3085 -8592 -20848 -26142 -23285 -11280 -17671 -17635 -14903 -11592 -9906
19108 -9906 -6329 -176 7657 5413 1778 -7260 -16797 -8097 -10778 -10958 -10704 -11696 -2096 -7957 -16344
19093 -16344 -18905 -14412 -12143 -6717 -1714 -1657 -16945 -21056 -14372 -15467 -19286 -24365 -31765 -28302 -25486
19078 -25486 -23396 -20361 -18417 -16462 -7807 -7863 -12118 -11944 -18109 -19442 -11771 -8032 -5604 -11730 -15685
19063 -15685 -20674 -15710 -10438 -10722 -635 2920 3185 4812 3686 -8730 -9696 -12462 -2077 3682
19049 3682 -1142 -9413 -8474 -6184 -9719 -13436 -19522 -19795 -6372 5519 11842 14845 7206 -10083
19035 -10083 -8259 -11543 -5678 -9691 -15715 -28184 -24937 -15743 -19263 -18198 -15043 -15184 -9692 -12518
19021 -12518 -16033 -22361 -21332 -16901 -17192 -8085 -5427 -2191 11704 4991 -7554 -10110 -9731 -2333
19007 -2333 -4725 -6562 -11304 -8302 -2813 -2159 -9054 -10711 -20632 -12923 -16591 -19121 -14452 -11513 -2607
18992 -2607 4713 -4249 -4737 -12070 -13965 -10121 -8485 150 1103 -3288 -2579 -3448 -4198 6004 9179 6162
18976 6162 -1379 -3462 -8108 -12014 -13108 -7315 -11534 -13631 -13111 -13212 -21970 -22577 -23137 -11443 -4331
18961 -4331 -7839 -74 2967 -6869 -8685 -4918 -2646 1381 -4109 -8529 -5792 -4353 -3710 -1932 -8618
18946 -8618 -14912 -6239 -924 -2811 -1949 57 -10309 -18567 -16441 -18237 -12769 -19930 -20329 -10847 -10952
18931 -10952 -12115 -14630 -17144 -14427 -17660 -21547 -23054 -18510 -28192 -19517 -13726 -12716 -12085 -8140 774
18916 774 6094 5585 2515 -10773 -9323 -8595 -10434 -16259 -12196 -16657 -19567 -16911 -5778 -2581 -4845
18901 -4845 -14313 -8324 -6066 -19197 -25089 -14951 -16820 -19773 -11264 -4553 -3025 -5371 -10174 -16879
18887 -16879 -22760 -23444 -25530 -19726 -8982 1226 3259 5950 9137 6037 1914 -3933 -13128 -4003
18873 -4003 -5545 -6506 -9805 -22793 -24888 -14608 -7202 -14748 -17859 -11099 -312 -651 -8788 -11828
18859 -11828 -17082 -16802 -12633 -20377 -22779 -8378 928 -6858 -9618 -9673 -420 -11763 -14780 -9078 -9502
18844 -9502 -15504 -11019 1753 -3924 -9469 -4162 -1861 -11155 -10484 -6531 -14852 -15183 -9371 -6891 -11305
18829 -11305 -15121 -20559 -18782 -16608 -15692 -14311 -27468 -27015 -21068 -20775 -12425 -13211 -2168 -8369 -13523
18814 -13523 -17915 -21781 -24163 -26199 -20586 -17645 -20000 -19980 -21562 -11084 -6945 -16149 -20146 -22749 -32762
18799 -32762 -26937 -22288 -12041 -4728 -7800 -15114 -18152 -18475 -18393 -13007 -5396 -7397 -7983 -14100 -12173
18784 -12173 -10053 -3255 -4847 -10652 -11812 -11804 4508 6972 -1481 1771 5712 8874 10380 19289 27452
18769 27452 38514 53131 38984 22730 8195 6840 10426 1813 -2626 -9240 -2852 -277 -1397
18756 -1397 2091 2904 -3766 3255 14165 7829 -6995 -12348 -7088 -5301 -7532 -5871 -8204 -11123
18742 -11123 -8965 -6088 1833 5178 8867 -1135 -7487 -7559 -12980 -21391 -28001 -30350 -21654 -16176 -15400
18727 -15400 -12611 -2458 -2387 -2536 -553 -7878 -15606 -13416 -3687 -6581 -14254 -19859 -15061 -12056 -13095
18712 -13095 -11630 -15649 -18685 -16616 -7718 -6624 -6977 -10743 -7898 -5145 -8707 -12047 -19904 -21218 -14264
18697 -14264 -5314 -4713 -9792 -2935 -2578 -7126 -2763 -1314 -4921 1444 7150 11226 8903 701 -5663
18682 -5663 -5354 -5742 2813 10122 1390 -4742 -8169 -9385 -5436 -5378 -10367 -17744 -22365 -23081 -27441 -19615
18666 -19615 -14085 -10780 -5561 788 -2519 -5752 -5785 -13765 -17042 -3940 -14677 -24954 -21150 -14947
18652 -14947 -11789 -3986 -3804 -7371 -8699 -12394 -12333 -13582 -20669 -17437 -9400 -19268 -15632 -10360 2217
18637 2217 7088 -2236 -10943 -11562 -3607 3503 -1181 -11995 -17581 -14636 -7901 -612 -3153 -17839
18623 -17839 -19877 -13345 -14025 -17700 -33680 -32565 -26950 -21597 -16365 -17825 -17170 -13954 -6739 -8895 -14248
18608 -14248 -11286 -8909 1428 4814 -88 -12051 -15761 -8230 -8882 -10011 -12364 -17956 -22130 -22138 -19425
18593 -19425 -27598 -34461 -27812 -25833 -28548 -38559 -35814 -24004 -18760 -23792 -20845 -20309 -19163 -21407
18579 -21407 -12755 -7073 -12758 -14286 -16295 -10914 -11323 -8192 142 -7468 -7634 -2119 -13369 -10440 -8569
18564 -8569 -14231 -12274 -5882 -5345 -6092 -9974 -12118 -28985 -43289 -34671 -22286 -17563 -18681 -22534
18550 -22534 -15638 -9574 -1852 152 -10696 -17906 -11101 -6712 -6991 -13982 -15785 -16850 -23901 -13884
18536 -13884 -7994 483 -7794 -22737 -14323 -9151 -5281 -9475 -11688 -17798 -15954 -16719 -24876 -29287
18522 -29287 -28000 -27293 -20327 -19248 -11352 -12242 -10734 -901 518 -10750 -18672 -25373 -24337 -24991 -27161
18507 -27161 -17904 -9599 -15981 -15954 -20090 -21610 -24918 -23030 -19954 -26582 -25784 -32622 -24105 -21705 -16978
18492 -16978 -19829 -16173 -11646 -8783 -8205 -15471 -27755 -28349 -10606 -13243 -10332 -12305 -20324 -24088
18478 -24088 -24581 -33321 -38557 -34171 -35436 -37910 -29653 -20257 -15822 -10671 -3981 -4366 -17467 -19425 -18513
18463 -18513 -16444 -18349 -15186 -9932 -15812 -21928 -14765 -10426 -14469 -16965 -23103 -13658 -19136 -30319
18449 -30319 -37168 -30171 -25923 -25686 -18951 -29546 -26552 -22972 -15249 -2610 -12855 -25829 -20889 -20395
18435 -20395 -11356 -10214 -26836 -27954 -20185 -29366 -36088 -34144 -30347 -21417 -20251 -14574 -10641 -23253
18421 -23253 -37967 -35677 -33117 -34453 -34875 -31087 -32729 -23469 -15597 -25335 -20849 -20005 -21502 -22938 -27513
18406 -27513 -25370 -20840 -27802 -33363 -33361 -36021 -23367 -4344 -8392 -12959 -15622 -22975 -22146 -22442 -26494
18391 -26494 -26231 -25382 -27494 -29190 -26194 -36788 -28052 -25343 -28528 -30717 -30541 -25930 -20835 -13578 -15579
18376 -15579 -20310 -18661 -12939 -6553 -17007 -25058 -23905 -23695 -23603 -14779 -9093 -8534 -6420 -6325 -1533 -8578
18360 -8578 -14188 -17026 -29524 -36899 -32848 -32409 -30637 -31986 -25150 -18837 -25598 -32887 -37121 -28344 -31405
18345 -31405 -34048 -47791 -54390 -43988 -29655 -18873 -20843 -18157 -17111 -21924 -29417 -29676 -30427 -28081
18331 -28081 -23464 -26780 -25969 -23612 -30161 -32303 -30920 -26243 -25516 -37523 -40699 -43194 -48251 -51677 -52337
18316 -52337 -54857 -41037 -35479 -30074 -25796 -33368 -36794 -33197 -34201 -31187 -35210 -35472 -28183 -24750
18302 -24750 -32779 -40173 -46745 -44582 -39873 -33571 -36601 -47091 -45994 -43704 -33625 -32745 -25106 -22326
18288 -22326 -24162 -33911 -33829 -35671 -42165 -48312 -45062 -30470 -31836 -45891 -54372 -62910 -63996 -58099
18274 -58099 -51695 -51759 -47575 -34526 -33426 -50931 -49020 -45733 -42533 -39887 -45349 -37048 -32535 -43033
18260 -43033 -37390 -33397 -40090 -44136 -48848 -49418 -56787 -52168 -51518 -41537 -33177 -32469 -39789 -38404 -41963
18245 -41963 -45746 -50775 -52103 -45324 -44583 -57354 -57782 -54904 -60789 -66101 -65977 -64142 -65994 -66424 -69057
18230 -69057 -64222 -49533 -54467 -60440 -74188 -76317 -71705 -68804 -70825 -70174 -69370 -60400 -49072 -51024
18216 -51024 -57287 -65431 -56649 -52049 -59948 -63480 -59793 -60232 -59387 -69619 -68469 -67186 -68199 -69989 -66050
18201 -66050 -68279 -70852 -71873 -67443 -69860 -70537 -63869 -69161 -62417 -64996 -68600 -73827 -73087 -77635 -78561
18186 -78561 -77547 -82031 -94311 -89455 -90610 -89659 -92168 -103517 -99205 -92887 -87400 -94774 -92411 -92098
18172 -92098 -90445 -84118 -87166 -88749 -92004 -90379 -99917 -105439 -99867 -102881 -99579 -97787 -103276 -113464
18158 -113464 -114451 -108655 -108110 -114227 -129172 -132990 -128732 -121482 -117883 -114181 -106916 -104102 -120073 -128165
18144 -128165 -123314 -123244 -109731 -110856 -117850 -118868 -117308 -109781 -102068 -100808 -103407 -97062 -75606 -54908
18130 -54908 -35867 -17735 1064 37913 78226 124304 177770 230808 300749 405620 560427
18119 560427 761600 1018386 1381460 1901979 2649459 3610693 4766568 6215344 7993802
18110 7993802 10020611 12088093 11980041 8875856 5915771 4205750 3223532 2613461 2201210
18101 2201210 1908050 1699398 1531818 1402138 1303015 1222191 1145410 1082443 1038392 1002834
18091 1002834 967910 929852 905239 885604 873138 849388 818044 806638 803819 803112 799733 813105
18079 813105 811944 781149 749747 722921 696288 659778 626687 595668 563996 538996 522602 496962
18067 496962 475804 465327 447205 428199 414096 395383 387501 381153 363553 351958 338360 324231
18055 324231 308117 295476 292612 286544 268689 249044 246830 238006 237486 228611 215530 214395 210465
18042 210465 203578 195745 188099 187968 186235 181346 178753 174751 168941 165608 158005 156286 153994 156480
18028 156480 158143 151905 145024 145507 130340 128847 128381 121576 118198 118902 119044 117616 119201 127431 123098
18013 123098 117968 106421 97765 89939 98322 99381 93990 91730 89094 82082 77007 82287 82534 79181
17999 79181 77378 74032 75143 69320 68416 78581 74899 81390 82340 81809 81192 81735 77631 65773 60866
17984 60866 64983 70879 78426 86937 73238 71771 74906 79253 75699 66493 63692 64132 64121 66812 62488
17969 62488 53052 54284 55635 54487 49055 53015 65516 62442 54922 61946 51033 50402 60218 59961
17955 59961 54491 51387 54429 60013 49309 50209 55680 54876 58524 67614 71293 70207 67158 57344 56441
17940 56441 53728 48150 43540 38654 38920 39068 42458 45534 40556 33935 43304 45196 47969 52724 55619
17925 55619 50333 42274 43296 45365 44596 50939 62108 66986 67034 64231 60789 51854 57299 57061 51554
17910 51554 47646 40875 34277 37869 48082 48065 47093 54200 55823 51681 49270 53691 63489 61153 54960
17895 54960 46318 43416 40470 45445 46784 39339 31330 43944 47545 43899 46399 43504 39345 31735
17881 31735 25256 28344 29854 28094 22592 22983 29833 22561 23022 35172 33062 31555 33225 26604 24190
17866 24190 29616 29140 33660 41491 40618 29968 30408 43410 43122 41049 34269 32378 27518 20599 18471
17851 18471 21291 14641 16604 21586 24624 35377 33492 29006 30331 32746 21735 22880 34756 26106
17837 26106 23963 22839 16295 22595 32232 35146 31416 39673 47215 47885 43807 47003 41591 34903 45648
17822 45648 45110 32510 28081 26756 26701 26802 23728 22505 25067 24070 26931 25838 15269 14483 15160 27552
17806 27552 37580 27044 12738 14616 26560 30854 16503 23093 32087 34213 25261 26391 27898
17793 27898 28544 17472 22129 15982 7934 14928 25875 36779 40863 36520 31375 23073 15311 5285
17779 5285 11672 16563 18781 21980 19594 14921 16324 18845 18255 14612 17614 25566 18213 12207 21013
17764 21013 22539 21632 15456 11690 16816 18547 15119 18009 34160 43704 45488 42919 30288 30055
17750 30055 33140 38955 43969 45480 40806 34965 32724 29159 25647 18857 23056 21049 20511 24552 19578
17735 19578 25434 25562 21088 23493 30626 37125 35026 30454 26662 28329 41434 36629 18994 14791
17721 14791 11084 8594 1863 -2776 11121 25227 33468 40135 34592 28036 24648 26387 17111 10641
17707 10641 5950 -4585 -5256 1359 17086 25233 23851 31626 37732 31414 24551 30212 31027 34453
17693 34453 40505 32735 28746 15274 10140 19906 21729 22032 24461 28069 33339 36815 35447 29809
17679 29809 27274 24200 31062 28522 29640 37695 35224 29492 22485 17571 7304 13656 26467 32967
17665 32967 34495 38293 28554 14474 14068 28039 32706 30252 27288 18531 6801 6501 18604 16155
17651 16155 15639 18904 13981 12756 13160 5322 7023 7617 4072 7148 14464 19192 19205 11985 19045 19802
17635 19802 22572 22022 21359 15067 17259 23681 22666 14185 18659 17724 14633 18522 18059 21560 25024
17620 25024 19905 16274 19420 30684 24749 15960 23520 27728 30320 23671 18459 25670 22889 16139
17606 16139 19979 17395 11691 26433 39301 44142 48687 43629 32177 29173 31031 38211 32934 23330
17592 23330 18965 10827 21348 23988 20897 15507 15688 13747 12326 9543 12915 14659 13204 16144
17578 16144 22482 28536 23998 21370 22259 11101 1216 18506 26836 34130 29165 14661 14659 11244 14504
17563 14504 19246 19184 16447 19502 18477 15519 19721 24309 27246 18701 19548 19590 16822 26851 32182
17548 32182 31066 37527 36928 28183 15032 14309 13234 15475 16718 22035 29144 21932 18754 26860 42620
17533 42620 51963 48767 40618 35775 20442 15721 19713 18201 16028 24554 26624 24029 27559 29730
17519 29730 33610 26678 24859 29253 20494 12039 8967 12194 10707 14838 16129 11930 4802 5696 6815
17504 6815 12031 25629 18057 7943 6493 10400 15917 14276 14274 23041 26485 18344 10746 2478 6212
17489 6212 1326 -435 5286 2350 5097 9716 4539 2935 2112 6545 9215 10820 16767 8783 12894
17474 12894 20185 17501 13603 13118 21581 26787 21886 15260 12802 11332 6190 7160 3545 4321 8971
17459 8971 13068 11506 11326 14409 11156 9614 -1283 -8200 -1211 5310 19403 17681 19408 37033
17445 37033 50346 59481 63568 64761 74129 63443 41509 29043 27441 32077 33483 26925 21851
17432 21851 8892 3189 -1511 -4627 6402 16216 13281 6184 12670 14945 19964 18137 10862 8316
17418 8316 -3564 -1703 3543 7761 8681 -5323 1444 13265 27113 35130 31610 26722 25273 23169
17404 23169 19003 11799 19119 22540 16576 15069 22371 20647 28249 32299 26639 18858 13013 6750
17390 6750 5025 1734 12569 15766 8869 10349 12159 2804 1570 11937 13638 16306 24310 29385
17376 29385 25363 37042 38903 27456 12820 10698 18770 17371 16087 10515 15315 16623 216
17363 216 -5772 1360 6670 1102 3231 10267 1404 -153 8354 7852 15880 17319 12306 7583 11732
17348 11732 17570 11382 6130 7793 10815 10878 7123 4158 3191 2975 -950 476 3080 -5303 -7925
17333 -7925 8272 21866 24542 27832 33661 25139 20086 13940 2943 -7915 -6124 -4582 -9213 -8564
17319 -8564 -3532 -5981 -157 10411 14468 9564 12143 15921 16468 18608 25809 20487 8946 9357 235
17304 235 12980 19390 20365 20443 22701 17815 10012 11474 17731 23493 20363 17172 11920 15138 13768
17289 13768 20503 16793 12661 12703 15089 12450 13788 20574 15495 6710 6130 7092 10411 15922 15263 10506
17273 10506 19041 16900 14519 14312 6891 6267 12957 8609 3595 7346 11532 8204 3528 2876 6509
17258 6509 12254 16481 20728 18818 13449 3726 10271 10575 1121 2202 -4159 -6529 -8925 -9974 -3872
17243 -3872 1898 7039 2966 -7609 -8982 -7757 -1152 -3362 -522 5220 7783 12531 11100 5524
17229 5524 6980 9768 10064 4748 11730 8732 6458 13726 22784 28394 22756 23348 28437 17225 8048
17214 8048 8116 11187 17873 19799 11994 16849 14984 11090 15944 15230 13548 1508 -501 -125 -4706
17199 -4706 -9437 -9357 -2585 -6055 -13165 -11202 -1316 10514 8903 -10564 -7635 -4008 5689 4958 -247
17184 -247 768 -2214 -7665 -1703 -2343 -5006 109 12275 19055 10933 10077 23426 21532 16347 21358
17169 21358 17452 14734 16339 19712 22456 18669 18865 8348 6480 11949 15659 15337 14256 22463 28324
17154 28324 19680 17561 13041 11521 13125 13138 12237 8953 7205 14381 17736 7709 7935 18552 19636
17139 19636 10203 3536 -4699 -6010 -5624 -7127 -13398 -6615 5621 1541 -2131 8035 14403 5785
17125 5785 7807 7083 6665 8683 6645 6720 7980 9014 9502 10096 8767 1545 -6424 -6940 -2156 4181
17109 4181 226 -117 -1057 9939 7574 3440 1270 5037 7638 12357 8887 5863 7083 11516 10390
17094 10390 2707 -4312 500 -1878 -7666 -9181 -9482 -11309 -4511 -5448 -61 2121 -10830 -13055 3323
17079 3323 8375 9593 15617 21954 24046 15901 12120 8803 3581 4410 12158 7238 -2328 2825 -10043
17064 -10043 -9802 -2236 -7199 -14082 -7767 4325 20476 17320 13354 8628 13157 17859 6748 -2385
17050 -2385 8559 14850 13743 1872 6638 17093 20715 19545 14544 21349 21266 15965 13779 15773
17036 15773 21816 27835 15455 9683 9933 9802 4315 5325 -431 -3191 -1571 -256 -3825 -9707 -6325
17021 -6325 -5935 -8309 -5350 1868 -1005 -14102 -6305 6148 7222 375 -3049 956 3390 2497 -1884
17006 -1884 1144 -1934 -2038 9029 21298 25005 24472 20062 18777 10737 1726 -1933 842 557 -4872
16991 -4872 -13386 -18087 -15804 -11048 -6496 -5452 4949 4268 391 3614 2390 2482 828 2357 -1081
16976 -1081 3298 10836 18370 24422 26570 15524 9045 1763 2428 5054 4046 10052 -836 -10163
16962 -10163 -3071 3900 1028 5044 605 -7220 139 9175 4921 -2133 -2236 3546 16819 8639
16948 8639 11329 15677 8507 6008 1729 -2809 2837 5009 9439 9761 5210 1465 704 -13314 -25955
16933 -25955 -19683 -11559 -3153 3552 -3804 -12841 -15105 -3500 11156 9309 6190 6523 -1234 -2560
16919 -2560 -4430 4847 9179 2070 -6767 305 7608 2164 2142 10131 5886 8397 9060 4374 -1021
16904 -1021 -192 2451 13154 14182 11838 7524 182 7449 6686 -2922 6201 6163 19433 22255 8744
16889 8744 -5211 -4648 -2684 -240 975 657 -3041 -1187 567 7852 7687 2837 3865 -2350 6721
16874 6721 10734 3447 16924 25676 13743 8449 8740 353 560 402 -12595 -12768 3259 13462
16860 13462 9341 5875 3044 3292 8653 7750 13713 5936 3817 -5216 2070 8077 20602 24510 15167
16845 15167 13716 10882 11614 10839 14648 18512 8255 -2704 -1288 3638 1726 2077 5795 7006 11838
16830 11838 10531 9767 18329 27788 31340 29878 21806 13053 11227 8620 768 1956 12265 8624
16816 8624 3985 3824 -971 -392 535 3536 3825 -1799 -3471 852 5755 -714 -1290 -2292 1861 13573
16800 13573 9533 12817 12740 9692 10111 7563 10961 6887 -6346 -9955 -4972 2305 -368 -10148 -7168
16785 -7168 -484 4492 -2096 -12287 -15032 -8718 -3988 1011 3896 5934 5443 -199 -2918 5847 5506
16770 5506 284 1287 2406 1960 3041 7926 10661 5170 5016 10043 18266 15738 5029 -12006 -13486
16755 -13486 -11616 -4605 -1473 2181 2034 113 -6666 -2148 10435 12985 11670 7131 3623 73
16741 73 -3747 -5524 4222 7093 8392 12857 11338 15671 11704 1321 4846 13541 3970 -11240 -17313
16726 -17313 -11809 -7098 -11429 -8438 -2610 5299 11322 10712 4453 755 387 481 3911 -3134 -13307
16711 -13307 -6961 4981 500 -3337 -5134 4479 15029 9343 -1969 -5585 -4288 -10321 -11508 -10570
16697 -10570 -598 10779 5041 7731 17585 16963 12363 13134 7887 -1265 2931 5623 -922 -4674 -5013
16682 -5013 -4169 -2778 -5001 -2796 2305 7083 12507 16877 12321 11753 11298 8879 6207 1345 -4315
16667 -4315 -4559 10449 6892 -6404 -8187 -7371 -2555 -8484 -13312 -6826 -6012 -9063 -8448 -859 -1616
16652 -1616 6671 11613 10201 12872 12173 10218 12612 15272 4558 1077 345 -3065 6702 9194 5352
16637 5352 3379 -1177 -3642 2832 1995 2048 9705 6856 1453 6406 12574 -2060 -11720 -9574 -6481
16622 -6481 1731 6676 6126 4362 -10502 -15941 -13195 -12172 -464 -306 2812 -828 -4863 -4310 5318
16607 5318 3362 -3927 -10534 -13771 -15160 -7228 822 4049 2579 54 -12104 -19038 -18782 -13622 -4250
16592 -4250 2223 -1823 1906 -5137 -9010 -12883 -1772 5054 3784 216 -5609 6514 -3297 2997
16578 2997 10478 9700 6989 -902 2764 801 2127 2127 -5695 -2011 5103 9154 3273 -673 -2456 -9317
16562 -9317 -6305 3952 11628 14457 10419 12087 13276 6288 10392 9260 3118 4218 3970 9257 16611
16547 16611 13370 13745 13665 12624 2873 965 7314 5501 1253 168 1365 641 -6919 -7319 -11844 -16519
16531 -16519 -16461 -11164 -3380 -7568 -12781 -18167 -18541 -4047 308 860 3417 -883 1132 -8476 -6738
16516 -6738 -1643 9888 15442 21992 18319 13126 13157 7078 70 -4925 5964 9098 2886 1105 9896
16501 9896 9973 19717 29731 40469 32891 32872 26759 29609 31256 22193 22004 10465 6381 8816 8149
16486 8149 4326 2166 7157 1162 9835 9484 11690 2512 -11789 -17230 -12760 -4883 -276 8281 8078
16471 8078 4028 -972 4214 9476 10974 8875 1072 -1391 -9152 -15837 -4793 8367 5778 -231
16457 -231 -521 3929 5435 -5689 -10667 -504 6390 6742 3604 -4418 1063 2687 5000 12379 14126
16442 14126 12729 11658 4220 3882 7313 10048 522 -7023 -11543 -12896 -13293 -5424 13404 18372 12287
16427 12287 13722 19528 15242 5057 8801 19256 15395 5910 -4928 -5922 -10017 -14721 -12505 -2298
16413 -2298 -4379 -1688 -1059 -1888 -8588 -2361 -4835 -4455 5322 -1167 -5748 -1595 -6026 -14220 -14038 -11079
16397 -11079 -4961 -8937 -5470 -3501 -4197 -3255 607 -635 2591 -7971 -843 -712 -15367 -20767 -11974
16382 -11974 -11233 -4859 7219 3941 2082 3900 7823 2441 3785 664 -659 -6990 -8672 -1961
16368 -1961 6015 8024 8461 1405 470 5554 11686 15192 5362 -10050 -16568 -10602 -3914 2267 8520
16353 8520 -1044 -5062 -5158 -3339 -5077 -8378 -1072 6336 3496 -12793 -11879 -4500 1032 219 -1231
16338 -1231 3388 -9358 -10487 -3635 -12691 -19573 -14779 -6660 247 7542 5609 -5094 -7612 -14917
16324 -14917 -7035 102 4248 -807 -1620 2366 -899 -6987 -6844 -4749 4982 1037 -3584 531 -2422
16309 -2422 1364 7481 8762 10006 5714 2056 -5371 -6697 -6320 -5820 -1484 -7222 -7657 -5240 2549
16294 2549 5692 -4938 -3964 -427 278 -5264 -4177 -2333 2643 -5051 -260 3645 8314 124 533
16279 533 1213 761 4405 7117 7558 10379 7384 -1249 -2108 8243 13297 13354 5960 2855 -4839 1683
16263 1683 -5698 -11257 -2315 5229 5980 1041 1829 -2607 6702 6585 -10215 -13417 -5897 -12424 -11685
16248 -11685 -12129 -19951 -23469 -10551 -2240 -3547 -198 742 -1293 -11836 -17400 -10136 -8706 -4642
16234 -4642 -3010 1024 -1161 668 -4255 -32 11784 15728 14740 22803 19266 15776 7239 679 -88
16219 -88 695 -3113 1558 8239 15916 5773 11670 4855 3174 2548 2200 5736 7586 3818 -1464 -7625
16203 -7625 -12110 -6191 516 -2380 -5386 -7401 -11939 -14721 -2355 9868 4574 -1873 -2436 -230
16189 -230 291 -437 -852 -5062 -12269 -7103 -699 635 1618 -2786 -10894 -16633 -15306 -7545 -7070 -3275
16173 -3275 -3895 -2595 -2413 467 12051 14665 8217 788 -90 -4621 -6518 -19733 -16948 -14766 -3416
16158 -3416 7484 9780 7798 7220 4226 652 5024 5712 7701 3729 -4280 2858 12826 16901 11227
16143 11227 2680 -572 5849 4965 7544 -2940 -9359 -5898 -13187 -11309 -5642 1172 7922 2261
16129 2261 -4696 750 5642 -4074 -12858 -9477 1217 5633 3194 -3342 -724 -3828 -8277 -12164
16115 -12164 -9424 -3198 3983 -1000 -51 6058 3429 5352 -2216 -4523 2228 -3282 -3218 -278 5931
16100 5931 16502 16943 12940 8540 3382 -6238 -9249 -10077 -11916 -4072 -3310 -8814 -15432 -17105 -13814
16085 -13814 -11094 -9862 -10303 -22304 -13225 -7892 -1881 5016 11713 9775 8822 6927 2495 2555 9546
16070 9546 10822 2957 -1367 3096 2444 7642 14428 13799 10730 10620 13367 6464 -2255 -2383 -1285 -6158
16054 -6158 -4380 -20176 -10617 2296 6296 15921 8730 1160 12 -10025 -18755 -20592 -12618 7052
16040 7052 4547 1434 5421 5100 4241 -3423 2916 2089 -5324 -3254 -4819 -9552 -1045 -6790 -3937
16025 -3937 7048 14429 15839 5619 2511 19881 25018 21707 19444 10928 -2139 -8373 -6149 -915
16011 -915 -216 -8005 -6908 5128 4050 4575 3052 -3406 -7253 -12879 -10768 -4668 -2071 -1530 -4796
15996 -4796 -3899 -7204 -5497 -348 11366 15515 10811 15475 14287 17085 6015 -2974 2510 6044
15982 6044 14424 19640 13488 9705 9694 12220 8617 -278 -8772 -8966 -8755 -7966 -4715 -2360 -4318 -3707
15966 -3707 -7614 -1675 -2911 -3341 -725 4541 8959 9667 5625 5864 6103 4925 -4702 -12664 -16010 -4294
15950 -4294 4862 5743 1206 772 12421 17142 15840 10600 13352 13072 13428 11139 6992 9029 11769
15935 11769 3178 150 264 -5782 -4119 1009 5947 9926 11911 11190 8043 3174 8003 5098 9079
15920 9079 16894 22135 16017 -884 -13311 -13806 -13488 -8042 -1225 71 -492 -11039 -14072 -11691 -1217
15905 -1217 3211 7079 -2875 -1477 -432 -5771 -14209 -9887 -3399 -6328 -3032 4003 7412 14205 15577
15890 15577 11820 -3761 -4485 8080 9938 3337 4823 4559 15838 23293 18578 8342 4920 11987
15876 11987 18583 13573 557 -5456 -6401 -5083 770 2318 5545 4246 4352 -1104 -10624 -9167 133
15861 133 5505 4187 10676 13254 11557 7752 -2836 -7463 -16423 -20138 -3294 8259 17640 17893
15847 17893 20904 11850 4057 4414 5193 6939 14160 16435 10219 17699 22107 14862 5604 2028 13423
15832 13423 15621 10726 4210 1901 -836 4590 3115 5306 3806 7276 13433 15665 15738 16915 16837
15817 16837 14100 14679 18138 17073 7122 6379 4201 2588 -348 2787 10624 24206 22907 16734 13700
15802 13700 10933 3956 6648 3949 518 8984 11092 2721 -5101 -4250 -619 285 -6857 723 14214
15787 14214 17657 5555 2814 9774 13850 21138 20259 19186 18535 13010 6509 5315 2993 1639 -6168
15772 -6168 -6761 -5827 -4046 -6810 -6042 3404 7187 1914 -1747 -4852 7415 9621 3012 6311 9858
15757 9858 7454 6835 4597 296 -1128 -5715 -14206 -10409 -7214 -2637 -2524 -11126 -16599 -11342 -8447
15742 -8447 -4419 3143 -5939 -2122 332 -4775 2223 3816 8583 8041 3435 8911 6975 1155 -912
15727 -912 -2182 -8016 -5645 2118 9081 2341 -6118 -2147 9864 11316 -939 -3742 -2345 4710
15713 4710 3065 -4393 -3308 1825 9903 12796 7446 1087 2416 8076 4679 -5928 -5264 -11549 -17974
15698 -17974 -12395 -13230 -17965 -18197 -10487 -9129 -3146 9489 9029 -1770 2154 580 -2331 6529 15072
15683 15072 15286 11852 2821 -8078 722 9768 8341 1453 7604 10428 21921 15425 8248 2985
15669 2985 4679 -1498 -5899 -6281 -9336 891 3352 -8918 -11786 -5561 -4833 -949 -10538 -8266 -3077
15654 -3077 6087 2992 4780 8388 6556 4933 3090 -8593 -14163 -8789 -7512 -3871 -244 -7696
15640 -7696 -16938 -21394 -12709 -4006 -2891 794 5047 9006 289 1756 4968 2786 2469 -6327 -9622
15625 -9622 -891 -3415 -7702 -9392 -4549 1127 1740 -2315 2062 4758 -3247 -14371 -12794 -4679 -14298
15610 -14298 -17330 -7093 -10791 -2531 1819 3382 5297 11353 11730 -6415 -14419 -11696 -14043 -15139
15596 -15139 -2740 -6513 -8985 -13648 -9430 -1475 -18314 -25747 -18885 -13587 -6138 -8042 -10807 -14926
15582 -14926 -17270 -15616 -8416 -13928 -19267 -14708 -9090 -7327 -2697 2703 8426 2858 -1082 7265
15568 7265 6907 -4773 -18379 -21188 -15065 -14216 -11696 -131 1450 -11759 -25553 -13796 3052
15555 3052 12968 27179 26428 7449 471 -4117 -13212 -20710 -16998 -9140 -7509 -1939 3097 -2234
15541 -2234 9307 20330 13616 9452 6087 8154 5782 9501 9611 400 3085 3302 -2151 -861 -649
15526 -649 -2446 -4719 -12584 -7588 -4617 -9079 -8244 -9122 -10108 -3142 -1256 2243 1000 -230 -6209 -6064
15510 -6064 -6771 -3170 4301 9028 8286 -83 -10386 -10847 -14605 -8950 -12419 -3692 3725 9401 4466
15495 4466 4511 7707 2123 -1385 -4369 -8451 431 3875 11707 14419 13878 10502 -7157 -16185 -9449
15480 -9449 -1857 1615 603 1146 7662 16847 14625 6909 10893 14710 19824 16994 9260 9296 -2310
15465 -2310 -5312 -4716 -8652 -4625 -7011 -5535 -9056 -15787 -15938 -17125 -7470 4771 1035 8045 4198
15450 4198 7598 3433 7833 17345 19334 15252 15677 13542 16023 9513 978 -1440 -1710 -10377 -11339
15435 -11339 -7127 -1833 -724 -5760 202 7620 -188 -1571 7607 1319 -5793 -2519 1167 514 7983
15420 7983 -987 -11517 -9629 4666 7720 -1426 -2154 -3403 -7282 -7840 -9678 -12305 -6567 -9297 1137
15405 1137 3102 1521 -6906 -6216 -4637 -7560 -7472 -3413 -9990 -13427 -11038 -1121 6319 7845 11645
15390 11645 15871 12469 1553 -7364 -16228 -11120 -6117 1989 2177 -9071 -20738 -14380 -19353 -9050
15376 -9050 3618 5048 -5186 -5951 4013 4791 6390 4111 5739 9115 -1358 -11215 -13746 -4426
15362 -4426 -1487 -3617 2502 968 2059 2675 -3964 -3372 -1668 -6555 -5256 -10580 487 2480 8903
15347 8903 4894 -3209 -2660 -5793 -10962 -9437 -6702 -5616 -6678 -2822 -3645 -8107 -3212 -1845 -7466
15332 -7466 -19087 -22068 -25056 -17165 -8303 -9610 -5399 -367 -3330 889 487 2266 2982 -1512 2797
15317 2797 4390 -991 -2394 -1029 -5408 -9622 -11375 -5255 1224 2311 708 48 919 310 -11408
15302 -11408 -16308 -12296 -7852 2182 16442 17450 6840 -2989 -6080 -2347 -8165 2971 17441
15289 17441 8610 -1084 -8717 -12912 -11331 -8166 376 469 -1531 8374 7554 5127 2822 -4641 -10540
15274 -10540 -8933 -4418 -5593 -5580 -5698 -10490 -10171 -3967 -8448 -20310 -15577 -2254 6892 6487 5523
15259 5523 8747 7670 415 768 884 -3200 -3879 -3411 -4294 -10786 -15272 -14151 -9079 -16453 -16231 -9541
15243 -9541 3333 3983 -6325 -4872 1188 -11479 -19539 -19025 -17492 -6876 -9695 -13075 -5940 4893
15229 4893 8897 3699 -564 -3082 -9036 -6358 -9286 -18772 -17237 876 3704 -4100 2393 -3419
15215 -3419 -7910 1141 -1919 -429 6189 11232 11561 3917 -4750 -4770 -4130 4666 16398 9659 2300
15200 2300 -4086 -4511 178 2873 -6342 -7405 1020 -2625 -9394 -8475 -13527 -13595 -10837 -7367 -8495 -23526
15184 -23526 -19209 -15538 -23530 -18797 -16689 -13744 -14380 -15103 -7808 -2603 -8272 -15390 -12737 -6851 -6948
15169 -6948 1448 -20 1449 116 -9790 -10872 -11683 -7726 -384 308 -2388 -372 2823 -70 8771
15154 8771 17274 1597 -5491 -4350 -7364 -1866 -494 6053 1800 5141 5802 6041 5747 13362 3589
15139 3589 -9853 -11285 -11143 -12067 4549 15939 2838 -780 1411 268 -3548 -4515 -14120 -18957
15125 -18957 -6198 2182 -292 -2097 -755 -2363 -4775 -4725 -8057 -2787 12922 18077 2241 118
15111 118 3395 -2370 -12763 -11735 -7491 1740 2218 -2299 -6165 -6330 4034 1698 -1384 -440 -4473
15096 -4473 -4343 -3268 -4851 -767 -1597 -5439 -11966 -18488 -9849 1547 8319 10001 9863 -2567 -19313
15081 -19313 -27816 -14014 -7080 5987 3670 -11485 -15303 -16231 -18436 -18623 -10672 -8428 -6460 -7099
15067 -7099 -9925 -12491 -13527 -3191 3920 -982 -8488 -2764 -1521 -863 -4138 -3447 -3871 -5227 -3272
15052 -3272 -1890 -479 -1361 900 -6458 -14942 -15063 -11401 -12884 -7888 33 5596 9979 10405 6393
15037 6393 -4121 -4301 8734 3834 -9557 -12457 -12410 -6569 -1090 7288 6765 9505 5207 -5766 -12644
15022 -12644 -12647 -6865 -3474 -2867 732 5501 -855 -11833 -12243 -10964 1623 5742 6474 6348 5255 -1331
15006 -1331 -6436 -8522 -4638 -3966 -10947 -17989 -14848 3639 10001 5745 -1624 -4072 -4584 4732 -2115
14991 -2115 -5247 -3801 -765 -5856 -6763 -4299 -236 -4902 5413 25596 10909 -189 -2499 -5850
14977 -5850 -445 -2529 -3008 3399 2114 3941 6278 5729 -4127 -10134 -8981 -9090 -2920 11298 20561
14962 20561 17522 289 -2058 3125 -1576 -2435 -14629 -18795 -20755 -18733 -11123 -10364 -16287 -9491
14948 -9491 1566 7775 2496 -1658 -4994 652 9539 10759 4775 4033 -1003 -7380 -6473 -3555 -2170
14933 -2170 -4024 -6125 -5438 -13960 -24789 -24651 -17282 -15188 -15269 -8382 -2638 -1390 -9107 -3627 2
14918 2 627 64 -8930 -1789 -6792 -10270 -1798 10118 15006 12517 14827 9473 15654 21529 28436 44513
14902 44513 59696 71982 89205 117775 161315 221502 298480 398476 517317 651466 817742
14891 817742 994585 1087426 899720 590479 389549 274638 222076 195098 171471 146617
14881 146617 123664 106195 101310 101590 93155 83131 78312 79891 79107 77441 68977 63363 61058 65775
14867 65775 62067 63016 65749 62979 59527 57405 58366 70142 56029 52391 66440 55162 43537 36886
14853 36886 40556 42660 46493 47916 43965 38158 25186 25478 32550 34164 30699 23143 14038 10809
14839 10809 13051 7311 -1055 -274 7980 12315 18245 24303 18823 14391 9290 18530 16652 19340 15745
14824 15745 20643 23946 8453 788 4980 4913 5642 13185 17386 6399 -729 4018 7205 6114 4982
14809 4982 11288 15986 12742 7142 -11448 -9258 2475 -4708 -3340 -3018 6997 9192 2663 -1672
14795 -1672 2137 6222 6074 3368 -3457 -9421 -4541 3104 7724 4584 -9588 -8781 -4214 3053 153
14780 153 -6808 -1594 -3834 -2984 16690 19500 13633 9502 6957 11189 5244 -8783 -14000 -6153 1756
14765 1756 7862 4507 -7791 -5142 -1092 10479 6084 -5336 -741 6838 2274 1333 1321 345 11825
14750 11825 13890 6945 -3088 -4577 -5663 -4397 -842 -3227 -3247 162 7071 6151 7915 390 274
14735 274 576 -4508 -5675 5732 13273 11503 9016 13828 14813 17231 15654 9742 -5262 -13461 -22447
14720 -22447 -23133 -9427 -9804 -25390 -31468 -18838 -20167 -24538 -23472 -14651 -4581 3662 -11854 -17169
14706 -17169 -15384 -11112 -2418 -836 4118 -668 -4907 -833 3784 -2515 -7244 -5668 -4612 -6248
14692 -6248 -12577 -9181 -10996 -4070 407 -4008 -15602 -21941 -13712 -6040 -929 4861 16753 10491
14678 10491 786 4884 3533 5153 6737 3133 3737 1150 644 3240 1984 -2522 -3719 -4605 -207
14663 -207 845 -7671 -12279 -15299 -12702 -18263 -10449 6074 -718 -11089 -13621 -11444 -5469 -5522 -3268
14648 -3268 -7469 -13650 -3920 -1126 4461 12000 4463 -364 142 -8673 -10324 -17872 -10629 -6596 -144
14633 -144 610 -3576 -5166 -16504 -10914 -1881 -9055 -9175 -1409 461 -4644 -7999 -13736 -15092 -6732
14618 -6732 6162 8051 5984 1734 -4251 -5171 -13402 -16045 -15636 -17626 -13744 -11742 -8879 -1224 6966
14603 6966 6867 121 2450 8167 9265 -4747 -8744 -5672 -10892 -4686 -3838 -5605 -1041 -5492 -14819
14588 -14819 -18823 -19583 -16394 -17330 -7264 3474 -2367 -2087 1991 1964 2835 -4507 -4662 -5681 -4277 9302
14572 9302 18570 18007 21871 17235 7351 2303 3829 8068 1236 -9829 -18502 -17019 1517 4074
14558 4074 925 -8184 -16941 -17844 -11493 -9521 -3023 3988 4664 -925 -11166 -17816 -7090 447 -114
14543 -114 -608 4368 15022 16932 15374 17780 13733 7393 856 -4512 -7803 -4204 430 4609 9971
14528 9971 9045 1120 -13529 -21419 -16212 -16012 -13907 -3386 1615 11013 12324 6477 3332 2332 -2428
14513 -2428 -8368 -806 -968 -4829 -2575 -245 3686 6432 884 -5249 1296 2658 -5510 945 8238
14498 8238 1840 2787 -13204 -3515 2539 1232 9966 14744 6350 -4446 -6752 -14325 -13913 -8889 -8075
14483 -8075 -3471 3181 2504 409 -306 -3660 -3892 -5102 -12840 -9196 -522 9065 9394 880 1399 4164
14467 4164 -326 -1505 -11960 -8991 -2866 1359 7298 2757 4007 4075 -7366 -15902 -7576 6470
14453 6470 8203 2343 7471 6913 6878 5481 -970 -7865 -5012 -5520 -1731 5044 8313 8545 7076 2443
14437 2443 -2235 -4465 -13498 -7960 -2062 760 11387 15456 18959 13776 11537 3180 -1305 -2349
14423 -2349 1659 -1838 -8535 -1297 5808 -812 -3366 -8668 -3122 3221 -1267 -4759 -16943 -9631
14409 -9631 -772 4817 826 -7300 -7668 976 2521 5122 2983 6549 5783 3366 946 5738 4278
14394 4278 -80 -8308 -7596 3023 12050 -6497 -9499 -3785 -6879 -14513 -21570 -14321 -7475 -10967
14380 -10967 -16575 -28572 -23447 -12643 -10726 -8098 -4450 3982 4412 -2079 -1365 -9158 -10993 -5782
14366 -5782 451 9278 8564 -440 -4800 -2975 -9243 -15602 -18437 -9283 6751 11558 2560 735 1166
14351 1166 -2665 -8270 -6343 -6983 -3528 -2656 -8323 -3589 -6805 -17106 -12581 -6214 -6869 -7818 -11079
14336 -11079 -11519 -2263 -5140 -9073 -1415 -5384 -11638 -7579 -306 -1886 -8884 -8753 -7827 -10360 -7158
14321 -7158 5921 4633 -3401 -2966 4869 -874 -6023 -6776 -6417 -12128 -14378 -7374 -4641 -2663 5922
14306 5922 4165 -5005 -5565 -12581 -8181 -9319 -12394 -10950 -10047 -8898 3339 6202 -8645 -16327 -20819
14291 -20819 -17529 -7014 -5120 -21248 -24467 -15432 -12734 -9415 -8541 -2764 5899 8597 490 -3839
14277 -3839 2490 1430 -1505 2874 -1098 -190 266 -348 -4678 -1792 -828 -8033 -9677 -5225 -8924 -15213
14261 -15213 -15173 -11023 -9230 -14832 -16575 -18044 -10229 -8964 -7567 -11123 -11049 -7569 -2785 -6777 -9436
14246 -9436 -9581 -11121 -10296 -1417 1404 5180 2050 -1293 -6244 -5851 -2063 -6123 -18516 -20849 -16358
14231 -16358 -19743 -17289 -20804 -14787 -13198 -24122 -31612 -26017 -27710 -24015 -10105 -5607 -4145 -5725
14217 -5725 -5475 -7061 -10940 -8792 7313 15762 4034 -1061 -5163 -3503 -3760 -6492 -4375 -6996 -3863
14202 -3863 -1702 -10590 -15781 -14497 -15792 -20232 -20299 -14947 -15877 -14197 -11336 -2343 -7155 -1486 1021
14187 1021 -4868 -7858 -15404 -16826 -2511 3825 -5498 -6339 544 -758 -4139 -6928 -10687 -9246 -2113
14172 -2113 6139 591 -862 -3795 -6553 -2351 -624 -7224 -9068 1650 2831 -1445 8587 2872
14158 2872 -10341 -17395 -16699 -17758 -15217 -10598 -12390 -10485 -17350 -13327 -1315 5885 3927 -4033
14144 -4033 -14109 -11048 -7333 276 4986 1485 -4388 -9145 -12973 -9134 -1372 -4131 -16379 -3406
14130 -3406 4755 5375 5948 15328 15806 7738 -1989 3919 1534 -2407 -2531 -11620 -16909 -8157 -1426 -4455
14114 -4455 -13511 -13581 -5680 -13498 -14700 -7636 -9167 -6670 -5266 116 -1654 -8673 -4098 -7349 -12665
14099 -12665 -15005 -17688 -15782 -8418 -12823 -18438 -17942 -23480 -25494 -17768 -8851 -7044 -4164 -1670 -235
14084 -235 630 -2802 -12710 -10741 -10081 -6431 -1010 -4496 -1164 5433 -2527 12 -2937 -1872 -1901 -6533
14068 -6533 -7504 -9570 -10573 -8160 -3530 -1243 -6317 -7680 -7045 -12690 -15773 -13209 -14354 -18640 -20562
14053 -20562 -16009 -13566 -8086 -10641 -12099 -17006 -21283 -15078 -13577 -16651 -13097 -11571 -14948 -13007
14039 -13007 -10807 -5841 -13669 -16904 -14471 2087 8868 -902 7127 13601 9753 4769 -2518 -5197
14025 -5197 -3895 -11868 -15755 -22979 -18888 -12391 -3195 -9120 -11590 -15854 -22041 -14084 -8676 -6638 -11855
14010 -11855 -10981 -6735 -971 1487 -9969 -5830 -989 -4966 -2726 -17421 -26080 -22513 -18302 -11509
13996 -11509 -14428 -10005 -8179 -14771 -22272 -23478 -17382 -14456 -16729 -7499 -11019 -8887 2745 -2293
13982 -2293 -12433 -19006 -21719 -16550 -10309 -5671 4700 5821 5259 939 2923 7364 8392 -512
13968 -512 -10168 -766 -1687 -6218 -2269 4355 2025 2947 8366 9415 4443 3287 -5707 -1462 2533
13953 2533 -2043 -5220 -7646 -7237 -10697 -12361 -9734 -9761 -6900 -3812 -4249 -4451 -849 -1299 -445 -3478
13937 -3478 -12847 -10842 -11291 -4134 -6175 -10148 -18211 -19014 -5465 -2122 533 2695 5267 4034 7111
13922 7111 9114 3380 1133 -1086 -14737 -26957 -29097 -18976 -7085 4315 8980 2284 8964
13909 8964 16344 7964 1083 -4026 -3415 27 1673 2781 -1274 -6916 -14113 -13011 -14818 -25126 -23511
13894 -23511 -12392 2949 10014 3620 3885 3945 452 -6338 -940 -3866 -3739 -8606 -2197 734 5053
13879 5053 -1610 -6693 -12047 -19739 -19420 -22259 -19206 -19744 -26933 -26489 -16301 -15114 -24357 -19606 -9095
13864 -9095 -5702 -2386 -168 -1360 -11739 -9228 -8613 -2738 -3977 366 -3052 1067 6183 8320 8594
13849 8594 9225 1809 6137 3943 -2671 -581 6776 7303 -1156 -6938 -1358 -5618 -10102 361 2515
13834 2515 -4167 -23 4629 8163 10161 10230 16466 13548 16003 17044 16511 23100 19762 12465 6898
13819 6898 9996 -1192 -2455 4333 6947 2248 -6329 -775 813 1606 -3344 -4987 -8195 -11389 -9177
13804 -9177 -9294 -16496 -12241 -7334 -272 697 5791 16405 20080 12741 11709 20116 10110 10054 9035
13789 9035 16665 14408 9739 4891 12877 20383 23709 18750 24508 25972 21688 19117 16537 3147
13775 3147 -2817 -1376 1457 -8222 -10456 -316 7089 6411 561 -8947 1360 13249 6254 -3803
13761 -3803 -2575 1611 4915 3294 5559 3116 3864 5130 11182 5280 88 -5592 -8880 -2960 1281
13746 1281 -3633 -5229 -3266 5252 17032 27889 21262 7352 8959 11683 11191 5403 4158 17289
13732 17289 11175 12611 12393 18330 10376 11298 6199 -2396 -630 -1399 12094 17141 11081 2165 -7276
13717 -7276 -10292 -5225 -1571 9948 8538 2803 1821 7084 6920 -7469 -13846 -14615 -11383 -10677 -14777
13702 -14777 -20213 -14673 -8031 -13264 -21752 -26598 -12499 3682 5122 -5096 -7661 1435 5563 1693
13688 1693 -4108 -8961 -12947 -14967 -17158 -13486 -13669 -14900 -15057 -17792 -16140 -14838 -14945 -10124 -3966
13673 -3966 -1916 4703 -1119 -8952 -14687 -10503 -3631 -4571 -8140 -9846 -19306 -24264 -17274 -11294 -13681
13658 -13681 -15531 -13057 -11976 -14958 -20546 -16262 -12764 -3875 -823 -6642 -16380 -23696 -23083 -14430 -11672
13643 -11672 -12327 -15936 -19664 -21478 -22324 -16765 -7196 6447 3064 -13366 -21954 -13796 -3989 -5502
13629 -5502 -5404 -6494 -8911 -9240 -12957 -21074 -23528 -13630 -2471 2569 4782 3493 -1167 -6569 -13778
13614 -13778 -10094 -5688 -8688 -8142 -16759 -23696 -25707 -25810 -27114 -33047 -24945 -13485 -2891 -4549
13600 -4549 -13201 -23111 -21082 -19805 -15864 -1882 7143 2170 3357 1583 -3180 -14608 -8731 -8742 -15466
13585 -15466 -6671 -8124 -13873 -21802 -12504 821 -4516 -13344 -14859 -11017 -8260 -9066 -10328 -14506
13571 -14506 -12827 -13431 -10845 -4788 -6168 -2477 4510 6829 6537 -2458 -9122 -5013 1745 3611 -2348
13556 -2348 -10830 -20264 -22286 -9716 3538 1953 -6525 -14357 -19861 -21730 -14208 -15357 -20219 -17463
13542 -17463 -7260 -7445 -8562 -6226 -11577 -17092 -13481 -5623 -3689 -5908 -6978 -17881 -18916 -25554
13528 -25554 -22047 -10560 1678 2982 -12409 -15262 -11220 -14122 -21476 -31674 -37810 -33361 -20861
13515 -20861 -5823 -10227 -16194 -10230 -6048 460 -6918 -18365 -10843 -12677 -14561 -17776 -9745 -7464
13501 -7464 -8873 -17635 -12446 -10872 -9893 -15177 -11356 -7637 -5283 -6758 -10829 -16410 -12914 -5441 -6412
13486 -6412 -11414 -19683 -18552 -19240 -13855 -6238 -933 -12025 -28769 -24721 -20184 -17553 -13083 -396
13472 -396 3142 1998 6904 7249 3079 -3496 -9308 -10334 -16734 -18226 -20607 -15812 -12280 -4392 2412
13457 2412 -3535 -12872 -15956 -19306 -3043 4951 -6516 -19275 -16122 -15401 -12985 -17106 -16811 -11409
13443 -11409 -9936 -10793 -12572 -15024 -16725 -21943 -18178 -6362 1094 5411 6085 3416 -3880 5514 6016
13428 6016 624 -5735 -7526 -9404 -19212 -20405 -15614 -20150 -21480 -14205 -14136 -19099 -15761 -8001 -7262
13413 -7262 -12637 -15429 -17011 -19117 -15414 -7627 -11190 -18102 -13948 -10175 -13039 -12694 -4484 -3914 -10315
13398 -10315 -5698 -658 -2318 -8318 -8352 1611 -215 5009 6103 -4850 -12330 -3844 -2193 4311 -2498
13383 -2498 -3414 896 -8025 -4759 -2392 -7045 -18204 -25133 -22025 -4726 4584 -2642 -15636 -21441
13369 -21441 -23934 -12390 -12605 -18714 -11902 -9161 -18808 -30594 -29321 -23135 -25856 -9983 -8101 -7838
13355 -7838 -20027 -20806 -16468 -18440 -9532 -7042 -10335 -13165 -13176 -5712 -4180 -8931 -9911 -8153 -10585
13340 -10585 -17427 -10227 1604 -5536 -5679 -4915 -5442 -11741 -9732 -3303 -2083 -8415 -9398 -5097 -6384
13325 -6384 -8888 -12096 -12494 -15417 -15831 -8976 -7098 -8644 -4539 90 2940 -7814 -13152 -10440 -3972
13310 -3972 -1330 -11342 -23224 -24681 -20130 -19750 -17293 -2938 2748 -633 -5710 -9300 -8929 -5510
13296 -5510 -7780 -17139 -19344 -22464 -19990 -25549 -31494 -23901 -21538 -19610 -24867 -26828 -24530 -17187 -17053
13281 -17053 -22283 -20788 -15699 -19286 -21344 -20852 -26592 -35735 -33304 -24375 -26481 -16149 -11051 -15239
13267 -15239 -20324 -13452 -9350 -4734 -6860 -12775 -10007 -8399 -15069 -21154 -16508 -15740 -16846 -13904 -10623
13252 -10623 -5352 6211 2884 -2075 -7491 -9555 -19154 -27652 -22494 -13584 -14125 -5493 -1063 -4303
13238 -4303 -11931 -19581 -15346 -16148 -12187 -20309 -24394 -19024 -20661 -20651 -6350 -4128 -17129 -26884 -28481
13223 -28481 -27784 -30448 -25484 -28113 -19008 -2808 2445 -10674 -15591 -13806 -19425 -20432 -19185 -16184
13209 -16184 -11854 -3811 -7061 -14450 -15978 -15944 -13531 -12538 -11995 -15465 -19254 -14242 -17950 -16088 -4377
13194 -4377 -3140 -5103 -4830 -12335 -17080 -14495 -10331 -1270 408 -3223 -9557 -18312 -19687 -6339 -10389
13179 -10389 -14195 -17519 -16379 -16623 -11029 -10214 -13624 -10442 -10008 -18016 -21190 -20556 -18133 -19495 -17411
13164 -17411 -20800 -17281 -18889 -19996 -19065 -16921 -9436 -19537 -27631 -18884 -8639 -2585 -825 -5368
13150 -5368 -8769 -14019 -15054 -16768 -16122 -24980 -26599 -19121 -16155 -11261 -13965 -6559 469 69 -7565
13135 -7565 -9215 -4090 -7169 -8505 -4659 -12104 -10697 -12631 -7458 3026 -5866 -6246 -1688 710 -677
13120 -677 1191 6582 1805 6749 9924 1394 1817 -3205 -22833 -25508 -22579 -16220 -648 2492 3825
13105 3825 10821 -4124 -8815 -12852 -12383 -11494 -8081 -3051 3978 3187 -8352 -18163 -20059 -15865 -5243
13090 -5243 -7724 -7753 -14158 -19572 -22816 -22248 -22229 -18197 -7551 -1634 6431 12681 20019 21458 26018 42671
13074 42671 51661 50595 43234 26917 27126 23946 9976 8 -5380 -10181 -13592 -6658 5861 14646
13060 14646 21655 6088 3891 3602 1673 4344 11171 6990 5727 12051 11547 17735 18737 20024 27079
13045 27079 19104 7727 6630 7207 18810 22299 24738 26951 36613 48559 67830 93241 115552
13032 115552 139812 158517 180416 200989 195185 171844 137851 102080 71567 51706 33833 28347
13020 28347 29182 31288 18339 13634 14536 13396 22954 18623 10862 17005 13957 7160 13575 14539 11030
13005 11030 8792 2924 -3127 -9561 5415 14679 17940 15949 13668 16794 20626 27989 39308 43527
12991 43527 45225 46749 58937 74702 118811 152755 173420 194271 201189 174720 128840 84557
12979 84557 61070 51808 53476 57531 44660 34226 27585 18623 19873 25820 18189 3319 6987
12966 6987 24602 26235 19597 10750 8409 16570 24923 23728 18561 6258 5291 6382 -2176 -3053 -3896
12951 -3896 -1819 4995 14941 15031 15566 9544 10917 10888 25720 37213 51112 65857 82404 81087 79975
12936 79975 74024 58500 35911 22742 21129 24094 19716 8271 9374 15650 5665 -3521 2771
12923 2771 3900 7406 1835 -20 9280 5419 -4064 -3767 -3909 3711 4139 -19 4879 7696 3781
12908 3781 -346 -2190 -6765 -11859 -22755 -23249 -5210 -8279 -9116 -6075 -8325 -13761 -19517 -17022 -15096
12893 -15096 -7586 -8479 -19445 -18888 -13008 -10107 2316 2565 -2822 850 4255 3898 -7328 -6713 6905
12878 6905 4392 2809 -2605 -1482 7690 14102 9273 -2066 -11793 -16215 -13898 -5460 -9492 -11131
12864 -11131 310 10476 3257 -11337 -12793 -6554 -6762 -9712 -12804 -10230 -8400 -6346 -15116 -17286
12850 -17286 -22534 -17465 -12847 -13665 -6981 -7624 -7345 2154 -3505 -8096 -5025 -17913 -18125 -5019 3001
12835 3001 -6240 -17787 -15299 -12881 -7075 -8817 -16983 -20147 -18039 -16448 -14764 -10165 -9574 -12313 -26383
12820 -26383 -27543 -19586 -16176 -16046 -18160 -8222 -5845 -784 1114 -7877 -9131 3471 5474 -5795
12806 -5795 -17023 -16733 -20726 -9498 -5392 -443 -1297 -918 1292 12962 13551 9650 5848 9401 13938
12791 13938 10815 -2749 -1779 -269 -10979 -11281 -8554 -6590 -4576 -14019 -14577 -11417 -5695 1348 -9554
12776 -9554 -7791 -4534 3335 7282 280 1933 268 -4574 -13696 -14878 -12394 -12780 -12024 -20684 -17611
12761 -17611 -4718 3214 582 -10515 -16005 -18449 -18469 -18585 -22034 -14635 -2236 1334 84 -13050
12747 -13050 -17245 -15432 -9127 4632 4950 -1793 1110 -2937 -10705 -11839 -15277 -14100 -12167 -22186
12733 -22186 -31083 -33553 -26292 -17997 -16273 -20732 -22767 -10220 -7629 -6488 -10627 -11904 -11094 -6636
12719 -6636 4255 6931 -1946 218 -2439 -5968 -11179 -7748 -7869 -17815 -15532 -8888 -6699 -11683 -702
12704 -702 -1261 -7214 -9375 -14688 -25227 -26986 -26750 -20881 -14369 -15812 -13103 -14535 -17958 -22129 -19912
12689 -19912 -23154 -23719 -18883 -5363 5714 11373 1023 -2593 -2036 -5868 -613 6467 11210 4888
12675 4888 -6411 -15461 -12346 -4508 -4817 -6301 -1783 -8434 -7667 -7963 -9601 -11615 -13060 -4349 -332
12660 -332 -2378 -1725 4530 7763 -1517 -12380 -25109 -26590 -18552 -21554 -16992 -15417 -14681 -14351 -12228
12645 -12228 -5547 -4543 -9174 -8319 -14860 -22311 -23398 -24118 -25409 -18748 -24430 -24423 -13315 -13804 -12413 -13311
12629 -13311 -16063 -13888 -18132 -18407 -9648 -3041 -2880 -10070 -12329 -16071 -18737 -18859 -30701 -31377 -26136
12614 -26136 -18647 -14768 -12809 -15108 -17484 -19467 -14899 -4541 -6239 -9585 -8436 -11297 -13906 -10838
12600 -10838 -2568 -5444 -9627 -20694 -27637 -18449 -14281 -14487 -721 3684 683 -6614 -6589 -3487 -6318
12585 -6318 -13860 -26372 -21366 -20384 -18318 -13996 -15557 -14450 -18735 -20752 -24513 -13841 -5785 -8880
12571 -8880 -6271 6091 7356 -855 -12410 -3657 6072 7424 19465 17835 15692 468 -164 -1082
12557 -1082 -8990 -17470 -19220 -16387 -7714 -5643 -10618 -6300 -11617 -8980 -13188 -15274 -8035 -2096 -6048
12542 -6048 -4098 -1442 -6436 -11045 -10985 -5616 -2572 -3277 -4761 -4046 -7939 -10738 -13256 -19577 -14613 -7629
12526 -7629 -5468 -6591 -14608 -13281 -11159 -16792 -19206 -20539 -18308 -15133 -20144 -20520 -17620 -12679 -10967
12511 -10967 -13367 -12167 -7106 -3288 -425 -12115 -17682 -15867 -22571 -29029 -17474 -16691 -9869 -11597
12497 -11597 -20067 -16495 -13960 -15423 -26287 -26189 -19869 -21561 -15908 -16811 -14184 -7482 -4979 -8608 -11692
12482 -11692 -12957 -11042 -13006 -12539 -10219 -14453 -22174 -18178 -22852 -19135 -11156 -5871 -6508 -15817 -17969
12467 -17969 -13890 -11188 -9023 -5044 -8368 -8465 -21032 -24742 -21662 -22011 -14494 -8183 -9183 -11072 -8119
12452 -8119 -4664 -1765 -4982 -8611 -3163 -10828 -16697 -3795 200 5997 1464 -4634 -4495 -3298 2083
12437 2083 10026 2706 -11227 -15933 -7622 5628 10318 2435 -4466 -10491 -7394 338 3101 3681
12423 3681 6659 4164 10182 15646 9809 12358 7896 12436 15481 14504 13134 7349 11654 17568 17320
12408 17320 12587 18285 3130 -12668 -2450 -564 -3665 -1757 635 5286 7057 3420 2145 -2538
12394 -2538 -1198 -3101 -11361 -16777 -10070 -3231 3248 4219 -7350 -7235 760 8541 11673 6171 3544
12379 3544 -450 4495 4533 -3324 -4371 -856 -3324 -4766 -11767 -8873 -6485 -6889 -16750 -24238 -19629
12364 -19629 -16346 -13983 -9869 -3573 2755 1187 -9601 -14214 -9179 -1557 3338 8080 8343 6106
12350 6106 -318 1777 1436 4372 -5541 -8327 246 10310 20696 22203 20469 17688 16493 20522
12336 20522 23552 15798 7901 7080 3249 9518 4762 2903 2934 9360 11719 7337 5535 12096 18715
12321 18715 13959 9390 3033 -9848 -24243 -30743 -26952 -6730 5286 -9196 -13198 -3349 1396
12308 1396 2431 16487 28297 20558 27802 35254 36918 35175 33457 40479 41084 56060 79357 96880
12294 96880 120286 133098 121255 95945 70750 44969 28365 18920 21407 21754 16570 8104 2044
12281 2044 6722 10320 4714 6611 1869 -6842 -5823 -6569 4135 6256 3006 10923 17641 11928 5427
12266 5427 3947 6882 3725 3459 20838 24901 15078 14099 6915 7605 17593 22986 36864 53209 62111
12251 62111 85855 104362 116451 132321 129638 102608 80841 64034 51765 28806 28052 30181
12239 30181 23804 26845 27717 20338 28990 25216 16748 16838 24110 24884 23678 21152 15112 17472 28102
12224 28102 40185 41703 42874 42216 30184 21374 23395 25150 34700 33146 39156 41541 54653 75036
12210 75036 87173 91695 83859 73217 84360 91833 92456 86333 68083 52742 44695 41419 45337
12197 45337 48349 28140 20015 14141 22819 25577 19543 13122 15462 16414 20947 20954 23588 22535 27591
12182 27591 27554 29975 32698 33552 36937 31757 22097 27467 33382 31840 27661 21513 24036 18252 24157
12167 24157 30628 41464 33474 19275 8625 9435 18918 7465 6954 8385 -436 1416 -1272 1461
12153 1461 8955 14928 15477 13711 10995 14421 14568 6288 -2155 -5102 -3071 -2557 1993 -2297 -12579
12138 -12579 -4092 10502 11497 15778 19388 10424 -2636 -1542 -3065 3911 7496 1917 -2755 -8810
12124 -8810 -5801 -2040 -6141 -5398 -2114 -5929 -10445 -2489 -971 -930 -5188 -7219 -21167 -19003 -10210
12109 -10210 -11894 -16897 -12136 -2445 -7553 -8542 -13185 -17711 -22524 -18970 -11957 -1212 -489 -3136 -4895
12094 -4895 4877 7279 5914 7182 -245 -6054 -6415 -11643 -6913 -3792 -6618 292 -2560 -6735 -5746
12079 -5746 -12067 -25370 -27186 -25383 -22901 -16970 -15912 -14026 -15816 -22241 -13914 -19840 -17598 -14146
12065 -14146 -3768 8508 15542 15316 10176 13299 13497 8372 9791 8047 8045 8 -9321 -9631 -15370
12050 -15370 -8648 1968 5294 -888 -4198 -11171 -14777 -20825 -18466 -14083 -18993 -21076 -24784 -17509
12036 -17509 -11580 -6630 -15991 -25400 -22094 -18261 -6968 -8458 -13416 -18658 -9056 -6582 -10630 -11562
12022 -11562 -6368 -3718 -2912 -3010 -5173 -13243 -14534 -19557 -31318 -22526 -16329 -13504 -11742 -8661 -8618
12007 -8618 -17966 -18617 -24823 -25666 -11956 -14013 -16357 -11652 -10783 -10780 -12248 -11633 -5244 -7514 -18034 -29950
11991 -29950 -28611 -28892 -26745 -18904 -13204 -12558 -11709 -11981 -12399 -17836 -10331 330 4478 -246 -3359
11976 -3359 -5964 8942 5360 -14707 -28736 -28046 -21228 -22141 -18415 -13341 -22617 -20701 -15500 -17010
11962 -17010 -14761 -16821 -20503 -21347 -23114 -25805 -23322 -27517 -29428 -26739 -24931 -17986 -10680 -8993 -7103
11947 -7103 -607 -3910 -15451 -20342 -20865 -14647 -14310 -7452 -1816 4208 6977 -1858 -12493 -8632 -6113
11932 -6113 -10807 -11820 -10641 -11543 -3496 1009 -1248 -3362 2006 3207 -4103 4263 2300 6733 11341
11917 11341 -7 -8202 -5776 387 -3852 -19768 -21280 -16559 -19376 -7367 -3759 -9930 -11460 -17954
11903 -17954 -16952 -6055 -3978 379 8846 12622 12564 8891 7330 3227 5199 5309 10434 8510 464
11888 464 14052 25224 21899 37194 56143 69014 82137 96474 128480 175488 221157 268992
11876 268992 337306 420859 523048 630332 705787 616948 414928 270098 188392 136684 105824
11865 105824 90288 71414 62917 62798 61748 66073 60653 42786 35451 34008 31871 32460 32761 33194
11851 33194 29771 30909 26181 25657 27051 34733 33718 35447 29811 21178 9014 4943 4757 9334 8086
11836 8086 14358 13153 13085 21827 24994 19790 18049 21163 16157 11209 9310 3020 -2381 -4016 -9682
11821 -9682 2572 7738 4397 678 -7212 -6369 -4564 -4589 -8154 -9650 -2563 4710 4759 -4580 -10974 -5979
11805 -5979 -7269 -11754 -14522 -19474 -21425 -29835 -25459 -17287 -3814 -6779 -11172 -7429 -3004 -8503
11791 -8503 -11312 -12086 -19687 -19116 -22790 -26077 -21394 -18720 -28356 -39951 -41388 -30297 -22587 -18230 -19557
11776 -19557 -19874 -23893 -20561 -19105 -18039 -16135 -23178 -24256 -22138 -22672 -22495 -27653 -29143 -33686 -36571
11761 -36571 -24914 -25359 -23692 -17955 -15254 -13906 -21889 -23469 -18228 -5683 -11140 -12076 -3491 -1781
11747 -1781 -5880 -6183 -17974 -21961 -21328 -13174 -17461 -21319 -21628 -18140 -8309 -6150 -15997 -24437 -39847
11732 -39847 -45601 -34642 -27358 -23139 -20030 -24875 -26759 -23540 -25701 -25030 -26102 -32721 -33698 -31240 -22150
11717 -22150 -24866 -23663 -32410 -39228 -42687 -44050 -41217 -36866 -38217 -43306 -43479 -36357 -37681 -38680 -33762
11702 -33762 -28273 -30317 -33018 -31411 -21632 -12561 -8483 -11390 -18907 -25725 -17000 -22201 -24251 -19539
11688 -19539 -12428 -16241 -19785 -7669 -5528 -11596 -9158 -2928 -5255 -15477 -23342 -27143 -21817 -25763
11674 -25763 -29668 -21728 -10898 -2031 -8463 -3279 -737 -977 -234 -9322 -8044 -12813 -11457 -12512 -11930
11659 -11930 -21164 -31561 -34316 -29847 -25391 -26446 -17488 -13490 -6653 -10573 -15576 -21171 -18634 -17034
11645 -17034 -19605 -23149 -24833 -17450 -10508 -16194 -9556 -12438 -27631 -27716 -27607 -29434 -24745 -18838 -10688
11630 -10688 -16060 -23121 -20624 -16484 -18993 -27837 -31131 -23548 -25813 -31289 -34378 -29252 -30428 -40204
11616 -40204 -43816 -51077 -52301 -48802 -52507 -43065 -29628 -30863 -36331 -28481 -20384 -14302 -18499 -25129
11602 -25129 -21774 -23434 -21295 -24656 -27649 -24394 -22275 -23786 -40710 -48717 -45199 -41659 -35726 -31344
11588 -31344 -34056 -26243 -19850 -14485 -16465 -25496 -31356 -33118 -28079 -19815 -26498 -27437 -19495 -19403 -21096
11573 -21096 -26664 -30072 -30614 -20569 -16346 -21819 -16472 -15863 -12880 -15755 -19009 -21772 -17347 -12312 -16923
11558 -16923 -19646 -19031 -21873 -25787 -27881 -26492 -30327 -27884 -28534 -28360 -28374 -32435 -37400 -38785 -33980 -31867
11542 -31867 -34460 -25956 -24403 -32147 -32375 -34136 -25016 -21290 -18533 -31600 -32835 -20274 -22609 -29625
11528 -29625 -23402 -12696 -12786 -7325 -6036 -10182 -16303 -10299 -8635 -10067 -8592 -6804 -4917 1737 6294
11513 6294 20034 22403 27171 36163 49742 67696 79920 87989 87260 75236 67433 67311 73199 80084
11499 80084 77885 77840 90231 103567 108093 112468 122477 133631 137133 139411 144071 155736 170656
11486 170656 176669 184205 186915 181983 183232 178961 171940 162735 165442 164720 168335 177133 191843 198056
11472 198056 199489 198542 194143 201169 206633 195173 175384 168848 166024 162602 148145 135767 126451
11459 126451 117659 111593 106929 114900 105859 95441 90634 89980 88059 82281 83129 82395 89919 103250
11445 103250 108799 99703 87868 70870 62921 79233 91569 89111 90277 101220 106776 112942 112861
11432 112861 119003 123680 131665 138958 148601 156791 161405 157291 142552 137090 152723 165440 174786
11419 174786 177106 172979 189644 211952 231188 240846 231413 230055 227042 239613 249387 255222 258317
11406 258317 253251 254907 245118 228586 231925 229429 227715 218406 203103 197361 197855 194254 182371 181579
11392 181579 178772 175921 170237 166270 170625 165079 164367 154230 140331 140443 144656 147152 136277 125789
11378 125789 134094 146219 149652 151972 151752 158858 165331 172643 173510 169697 157568 160205 170288 170369
11364 170369 169249 173147 172690 170298 156566 144394 129454 115297 101657 87513 85975 95897 98629
11351 98629 93800 79664 72986 68197 61877 44690 34114 38706 50376 66119 74952 70088 73204
11338 73204 84954 94745 107672 121489 126271 127726 136306 148641 158932 157045 165463 162486 158093
11325 158093 166564 159751 150180 161399 168680 178205 177107 163463 156472 149788 138209 120021 110491
11312 110491 116957 120621 118052 109728 99041 94992 102884 113945 100251 83088 66904 65556 71966
11299 71966 79737 66066 59390 55973 49346 47318 44100 40250 35677 39699 55055 56978 49659 34940
11285 34940 36225 33732 18283 3329 8093 -2079 -11153 -12337 -3282 -5049 -7956 -9946 -8523 -4283
11271 -4283 -10014 -17899 -16883 -16187 -14926 -6885 -14864 -18988 -17271 -11724 -14790 -14204 -4213 2606 -4416
11256 -4416 -1347 9506 13181 12275 22997 18884 17757 19627 15605 13432 20626 26632 36431 35732 28392
11241 28392 26179 31676 35397 32296 31003 34933 36073 39099 46643 50593 44810 47137 48401 47638 42748
11226 42748 53176 53895 54837 60980 72329 73021 63530 58409 62280 51730 55165 65309 83469 97346
11212 97346 99083 96760 106802 119573 121362 139707 160161 176607 196594 218561 251519 294085
11200 294085 335269 392966 453563 511201 551436 564824 557246 511778 437642 365167 303656 253100
11188 253100 223849 202156 185673 173245 157423 150279 147491 140363 133657 126839 140557 150605
11176 150605 156048 160372 168993 184360 193499 194171 206039 223015 251245 271254 284500 299840 320386
11163 320386 357171 387765 408739 430917 486110 550388 626536 714580 808365 908183 1020781
11152 1020781 1118592 1185417 1195602 1149644 1079430 1002528 917573 830403 754423 696315 651320
11141 651320 618877 596117 591887 591257 574953 572321 581273 572024 561654 542557 547018 566079 578816
11128 578816 580947 590071 602021 623590 649148 673381 695898 710661 734782 768609 807821 844733
11116 844733 890224 934252 984282 1051155 1111773 1178244 1265876 1356544 1462669 1581162 1695656
11105 1695656 1779674 1832690 1841927 1840209 1850274 1890998 1952593 2037292 2147127 2272193 2423491
11094 2423491 2588977 2780519 3005064 3244055 3498798 3782745 4105180 4480103 4945793
11085 4945793 5514238 6212081 7085638 8145138 9393822 10851380 12498339 14268294 16089596
11076 16089596 17850447 19403124 20600440 21339716 21655446 21742701 21849899 22175557 22805303
11067 22805303 23684555 24670979 25575449 26276803 26763455 27168203 27667050 28381151 29374553
11058 29374553 30653500 32238482 34153332 36395493 38849361 41346612 43660403 45513606
11050 45513606 46652676 46950018 46453069 45569765 44759882 44234849 43962088 43782327 43511744
11041 43511744 42978728 42082724 40853075 39452527 38035102 36694285 35451687 34250072
11033 34250072 33071989 31895795 30703841 29465555 28146974 26723348 25191692 23653504
11025 23653504 22242995 21027920 20031016 19203027 18448898 17695989 16964765 16326573 15829757
11016 15829757 15517332 15417556 15480573 15712067 16098878 16629534 17317584 18156510 19109431 20117432
11006 20117432 21111400 22063764 23044476 24174306 25494130 26949492 28425577 29825817
10998 29825817 31079418 32138006 33048163 33921158 34835411 35830274 36919013 38081282 39316172
10989 39316172 40638541 42051639 43476462 44818715 45981715 46901764 47652411 48449287
10981 48449287 49504172 50904436 52463685 53828331 54528679 54263404 53034291 51040684
10973 51040684 48638808 46189289 43946466 42053555 40523807 39272285 38191929 37192718
10965 37192718 36203637 35135507 33964959 32722716 31498646 30420270 29543907 28882068
10957 28882068 28349663 27810788 27051598 25912898 24339963 22456731 20458248 18549503
10949 18549503 16853651 15415319 14215004 13208221 12377637 11679615 11073050 10536826 10054842
10940 10054842 9618882 9224255 8848073 8509297 8190190 7869519 7572975 7278977 6990243
10931 6990243 6726540 6471620 6222972 5973782 5738626 5508300 5281625 5058845 4845901
10922 4845901 4643041 4441130 4256271 4079932 3916365 3755574 3608603 3478190 3348737
10913 3348737 3226505 3101789 2976638 2866348 2762983 2648476 2541118 2451599 2365309 2288119
10903 2288119 2211462 2127693 2065484 2011083 1941857 1863941 1799087 1752491 1704122 1649674 1599009
10892 1599009 1563105 1520035 1477059 1436566 1403644 1368169 1323830 1287824 1267374 1238592 1201889
10881 1201889 1167110 1138071 1115891 1086561 1066684 1048215 1026280 1000616 981850 967810 952151
10870 952151 935503 918250 898606 887372 877283 862501 845226 829917 821418 807762 794559 783275
10858 783275 783152 786520 769564 755914 742668 730293 725282 717342 726340 728131 721876 718148 715537
10845 715537 716986 721895 715597 718722 718658 715162 715689 718143 712518 708888 706287 701199 695238 686495 681674
10830 681674 674944 663615 657360 646611 648001 642828 630506 617739 610267 610247 610602 613768 605560 607497
10816 607497 605765 602005 605141 615712 630398 631044 626629 620350 624911 627828 630919 640204 648338 654796
10802 654796 653225 645293 637632 628639 614070 598238 582952 571972 570505 568967 566630 568129 548904
10789 548904 545625 535419 523191 520588 524043 521844 514845 505378 498412 492950 483309 485426 495680
10776 495680 506825 505146 499435 505404 513154 509626 516256 522939 535164 554703 564373 573367 584698
10763 584698 601105 631081 669778 699659 729407 767184 809636 871783 941086 1025869 1130395
10752 1130395 1252815 1404973 1605943 1837811 2076495 2320431 2544271 2676675 2668053 2488944
10742 2488944 2174460 1843975 1573434 1362210 1196559 1078294 998878 928209 873391 846417
10732 846417 822094 795611 765637 742257 725802 719964 710887 709029 708272 709063 712122 711152 706687 706074
10718 706074 715114 717345 718614 720980 718077 710715 718060 727699 734299 729583 728290 726002 730740 729376
10704 729376 722827 722390 719459 710496 705445 713474 713834 718868 715989 707151 707082 702224 702755 718137 728384
10689 728384 741048 747140 758517 769000 782053 799442 820311 825940 836010 864714 890281 910159
10677 910159 922818 942217 961296 976864 977960 978813 989164 989138 997102 997219 994495 984883 993262 1012137
10663 1012137 1032112 1051691 1066599 1094397 1139423 1176691 1212232 1253799 1293769 1340507 1388402
10652 1388402 1449840 1517390 1582686 1654394 1733265 1807988 1868148 1922548 1979070 2034084 2071019
10641 2071019 2079705 2092891 2083604 2071282 2075274 2066889 2058229 2053156 2057351 2055796 2063742 2072220 2079322
10628 2079322 2107922 2143574 2176577 2223275 2288691 2358258 2429339 2500700 2585687 2680919 2782406
10617 2782406 2893284 3011191 3132812 3266053 3421715 3590595 3798970 4042651 4324287
10608 4324287 4646877 5016443 5443281 5936265 6493834 7130288 7877746 8741274 9735714
10599 9735714 10875858 12200883 13736333 15528008 17622202 20139813 23255652 27151671
10591 27151671 32045177 38119072 45490569 54124730 63744073 73681789 82780489 89700722
10583 89700722 93264448 92880440 89014551 83152500 77162268 72275808 68785617 66410363
10575 66410363 64720948 63335720 62022133 60666066 59296939 58076223 57160583 56586029
10567 56586029 56291584 56213514 56340210 56700098 57337328 58296277 59640718 61423049 63612305
10558 63612305 66109950 68788014 71603595 74620312 77928888 81500660 85164393 88668445
10550 88668445 91706628 93951700 94972602 94153510 90845131 84674248 75892772 65615891
10542 65615891 55365439 46416615 39366306 34124112 30300130 27497377 25387178 23737086
10534 23737086 22370368 21155340 20034278 18971481 17969713 17075670 16305400 15650414
10526 15650414 15089498 14587520 14143702 13737856 13350039 12954870 12565703 12185361 11812376
10517 11812376 11427246 11023838 10619350 10209707 9793722 9368565 8945352 8557629 8190227
10508 8190227 7845974 7523846 7222561 6955668 6715688 6478220 6258776 6058200 5873297
10499 5873297 5708273 5550599 5404050 5264379 5149367 5069875 5001864 4955609 4956411 5006177 5086652
10488 5086652 5219574 5384313 5573689 5777361 5932395 5930295 5573946 4911629 4270012 3803732
10478 3803732 3465345 3210824 3011704 2843674 2704029 2586492 2495013 2412183 2336588 2267235
10468 2267235 2197770 2138245 2091860 2049945 2003424 1966973 1932839 1896800 1867988 1863437 1867592 1863274
10456 1863274 1853786 1843368 1816217 1773303 1720389 1665011 1614426 1569136 1534008 1494672 1458350
10445 1458350 1427852 1393635 1369538 1345204 1317217 1282478 1264492 1244722 1222213 1191283 1165929
10434 1165929 1142211 1109323 1080040 1059855 1033909 1025487 1009673 1002774 998381 999904 996772 987853
10422 987853 992475 993358 986056 971754 967395 959891 957520 943109 939557 923873 906802 908114 898901
10409 898901 885387 871046 861409 856650 851656 840596 836566 837256 830402 823772 822266 817862 819236 819219
10395 819219 815857 818780 823089 812527 807815 815545 816416 807861 802382 804422 815424 828759 838240 840550
10381 840550 840396 836992 830914 823018 812060 798704 780664 768206 764378 752707 742201 735537 729680
10368 729680 716432 711673 720065 736436 737041 724442 725135 719747 709111 697556 693661 695952 692190
10355 692190 684047 671753 668320 670319 666851 651315 645869 641559 634333 627634 622052 620452 637853
10342 637853 637462 624946 626650 616202 607878 609206 619795 646596 667718 684698 700682 733691
10330 733691 776983 828248 895083 962498 1040278 1124265 1178306 1194606 1171688 1128918 1093604
10319 1093604 1044248 971141 883596 798279 748343 728619 700154 661180 641358 639097 640597 638129
10307 638129 624204 614163 618064 614602 612078 617475 615407 608513 597382 590387 595530 600768 602363
10294 602363 610752 626096 634918 649196 651568 655991 661048 660932 655921 656472 656991 669435 673966 668494
10280 668494 665796 648546 635315 620424 604664 600358 610353 634787 650340 656362 658405 657570 666260
10267 666260 687909 701868 706153 697532 677207 654218 639660 625289 624284 627198 635985 666193
10255 666193 689345 723700 762815 799178 829316 851078 851975 853620 873033 902517 928448 949982
10243 949982 966912 969975 966376 957528 946605 941431 941175 951872 957891 961152 971185 986957 1012394
10230 1012394 1043096 1078865 1118878 1162243 1205110 1242878 1275627 1291541 1291219 1278965 1252306 1225745
10218 1225745 1212342 1190366 1170959 1161348 1168840 1182420 1193640 1208426 1234416 1260826 1286325 1316884
10206 1316884 1356798 1390891 1428175 1449644 1432961 1405545 1383586 1375131 1378352 1392959 1429944 1479273
10194 1479273 1498905 1476796 1544035 1661164 1669281 1613391 1565608 1525767 1495993 1473759 1456833
10183 1456833 1445405 1440801 1432247 1436365 1449575 1462088 1475355 1493435 1508740 1509946 1511364 1525467
10171 1525467 1535291 1550125 1562728 1587879 1629965 1695148 1785785 1885238 1987352 2098329 2209543
10160 2209543 2292888 2347731 2372143 2383495 2400354 2396301 2371168 2329443 2297750 2295188 2315336 2335011
10148 2335011 2348191 2360291 2367804 2398407 2442559 2477895 2516503 2562524 2594664 2616354 2640029
10137 2640029 2688252 2751669 2810647 2843685 2866046 2890991 2929461 2960852 2973836 2979717 3000663
10126 3000663 3045650 3124025 3216545 3309222 3385591 3437564 3462709 3480562 3487823 3507420 3562767
10115 3562767 3622256 3676144 3759861 3876963 4026426 4200400 4405940 4643370 4915376 5214591
10105 5214591 5553338 5880451 6211038 6586427 6978006 7402916 7873154 8405904 9000629
10096 9000629 9655726 10423583 11343729 12464344 13801297 15362761 17184713 19344155 21867005
10087 21867005 24683371 27764964 31114591 34746276 38526210 42172511 46018012 50988479
10079 50988479 57696919 66556756 78118520 93085713 112667091 138696024 172616212
10072 172616212 214451489 263267734 319042840 381252713 444154663 495784395 502246648
10065 502246648 429920396 316764627 224149965 164776032 127692474 103394961 86740303
10058 86740303 75054678 66722905 60623521 56040688 52523549 49768014 47630778 46029761
10050 46029761 44802104 43548178 41730659 39388410 37211187 35571610 34408986 33565582
10042 33565582 32956215 32553290 32393401 32468920 32645467 32481440 31619233 30252180 28692222
10033 28692222 27081340 25489582 23971546 22561356 21272496 20099192 19020146 18009235
10025 18009235 17063320 16160483 15328306 14558130 13834474 13138652 12443831 11789546 11186444
10016 11186444 10632656 10113597 9624271 9144364 8685639 8288223 7945528 7623267 7285888
10007 7285888 6942827 6612170 6308538 5997741 5694230 5418120 5166154 4946879 4745047
9998 4745047 4558734 4401740 4251154 4100206 3942192 3779856 3620935 3476444 3353553 3232117
9988 3232117 3110846 2987932 2854387 2727927 2616113 2523807 2447144 2355493 2242864 2134205
9978 2134205 2045818 1978156 1945220 1924068 1896080 1858161 1818842 1789784 1759566 1726154 1689767
9967 1689767 1634666 1580060 1535918 1489230 1436115 1395942 1362567 1323095 1298094 1279646 1265087
9956 1265087 1261565 1255680 1237767 1215339 1190910 1160085 1121377 1098918 1082668 1064336 1013386 960159
9944 960159 953901 1007584 1090202 1182322 1265122 1335772 1374336 1344436 1275554 1204704 1135456 1062923
9932 1062923 995962 949381 933627 915130 907872 919797 943835 964423 981094 1004272 990000 963338
9920 963338 935872 917416 900652 888194 866985 846357 834588 820283 815174 813277 840717 891468
9908 891468 955671 1010353 1064136 1116710 1166634 1207224 1236078 1258497 1278993 1278384 1278120 1268294 1248719
9895 1248719 1236400 1228652 1216895 1208594 1195387 1185321 1187235 1194648 1200094 1217676 1242571 1256763
9883 1256763 1249544 1229018 1230415 1252232 1269167 1272730 1267370 1253317 1220102 1172621 1123882 1095005
9871 1095005 1063882 1030929 1005140 983494 971853 960507 968024 974867 974486 967156 952503 942729 939206
9858 939206 923114 912028 906328 887166 856121 842534 836810 835432 852565 858822 859915 868301 861791
9845 861791 852852 848390 842796 832479 825752 816902 808838 820797 826311 820258 817254 800285 785770
9832 785770 774906 777583 787685 790727 798511 802427 801077 802443 800590 807684 818499 826335 830380 823447
9818 823447 822565 831858 839763 832486 823795 799765 782407 779519 774331 761677 757422 762501 760634 752041
9804 752041 738629 721933 700178 696854 708398 722322 704559 672281 648014 633962 625489 625517 617809
9791 617809 604696 602699 614928 619782 622615 614498 621801 626643 627027 626322 634181 640226 649892 663404
9777 663404 661528 645619 632394 631106 623339 622745 629254 629398 640368 646663 651168 651438 660409 660846 658379
9762 658379 653032 651546 642131 636901 637018 631689 632460 625733 625363 638225 646755 654698 665598 678037
9748 678037 696063 699458 711535 721588 723160 724722 728582 721484 713321 714135 718224 724498 728627 731341
9734 731341 736188 743053 760982 787990 821852 856992 886621 944803 1023157 1124569 1241438 1379552
9722 1379552 1523754 1611803 1578477 1399986 1177351 1010231 906944 855635 820285 783288
9712 783288 757968 737323 729404 725191 722120 722751 727895 714263 697458 689102 695155 691628 691550 699110
9698 699110 701462 706567 707688 702619 706382 722223 738372 754405 768191 772530 772463 778357 795929 813049
9684 813049 815255 819643 824923 837035 852118 874117 893465 930151 953448 984255 1029073 1090934
9672 1090934 1167373 1236508 1305708 1369497 1425884 1445658 1452013 1488263 1564062 1644238 1735399 1829647
9660 1829647 1893597 1901988 1842924 1779342 1759049 1794354 1866705 1974174 2099787 2233134 2383299
9649 2383299 2543509 2740932 3000550 3308125 3639597 3914887 3968485 3636240 3074779 2587411
9639 2587411 2261184 2057903 1942619 1879686 1845335 1816103 1802267 1796557 1798861 1805967 1822189
9628 1822189 1846712 1869685 1892807 1915928 1952878 1996055 2036899 2072516 2115904 2154008 2184307
9617 2184307 2226212 2272127 2319437 2376791 2433801 2496126 2556885 2636421 2734665 2842429 2955716
9606 2955716 3077754 3201404 3321982 3437352 3528176 3594715 3660572 3744025 3846804 3970654
9596 3970654 4130096 4317238 4523529 4755257 5020840 5311979 5646177 6005029 6394724 6814744
9586 6814744 7270524 7777887 8363516 9032851 9796211 10666462 11629146 12687112 13836622
9577 13836622 15042682 16290175 17534536 18739104 19831702 20691375 21255913 21568659 21701257
9568 21701257 21647254 21444571 21177750 20914554 20701894 20596951 20626674 20772404 20946456 21026608
9558 21026608 20949618 20769371 20525692 20217570 19830793 19420370 19070511 18846806 18783876 18812986
9548 18812986 18816353 18644665 18218570 17578428 16884632 16265842 15788830 15474301 15291063 15198490
9538 15198490 15184531 15217154 15254579 15276531 15272035 15281985 15344795 15466420 15653044 15889855 16150753
9527 16150753 16419311 16683793 16958924 17265105 17627754 18055372 18584462 19199980 19884304
9518 19884304 20635981 21471114 22393114 23412220 24545303 25825785 27266971 28847210 30518947
9509 30518947 32194278 33797505 35254438 36520604 37565321 38460560 39285846 40081379 40853274
9500 40853274 41607091 42313748 42850908 43150617 43251083 43159848 42804191 42245731 41652838 41137236
9490 41137236 40677823 40259464 39909102 39643337 39398573 39029416 38444125 37704710 36890668
9481 36890668 35945214 34815080 33587474 32322967 31059666 29885965 28891863 28073033 27325752
9472 27325752 26507781 25551289 24560706 23657512 22893729 22286397 21822515 21492607 21295491
9463 21295491 21192489 21154183 21134264 21092670 20998077 20791719 20483612 20124538 19763377 19440492
9453 19440492 19155082 18933861 18782420 18700790 18684337 18715895 18782562 18885131 19027103 19219360
9443 19219360 19487756 19833944 20224016 20650638 21104955 21596128 22101577 22608094 23114879
9434 23114879 23577225 23934192 24111278 24097456 24024683 24009146 24062203 24112657 24117191 24075775 23976313
9423 23976313 23830340 23707841 23599302 23439942 23222211 23012445 22881572 22831314 22779527 22667089
9413 22667089 22445989 22070622 21504773 20731968 19795902 18753724 17614458 16397358 15196631
9404 15196631 14099155 13118891 12263716 11535042 10903172 10359896 9869985 9401200 8947121
9395 8947121 8538529 8197348 7916696 7679548 7473509 7281151 7079122 6877219 6696761 6531578
9385 6531578 6357616 6195116 6050769 5918545 5791396 5674802 5552485 5437226 5308903 5167466
9375 5167466 5018237 4860204 4714399 4584146 4472629 4385575 4326828 4285534 4256096 4251440 4262156
9364 4262156 4292231 4327112 4360644 4382261 4358089 4317454 4290484 4272089 4186949 4014606 3831052
9353 3831052 3686916 3570133 3439787 3292335 3171482 3079199 3024281 3015834 3025339 3057776 3097432
9342 3097432 3133093 3173683 3225757 3265560 3295862 3331899 3376670 3421512 3475534 3530164 3581542
9331 3581542 3614372 3643479 3670476 3689136 3687747 3672537 3643517 3580991 3496124 3413721 3347364 3311814
9319 3311814 3312220 3324811 3359375 3427328 3509428 3592665 3685915 3771391 3849858 3943182 4037002 4122887
9307 4122887 4211338 4303097 4380002 4439246 4468602 4478133 4467277 4464202 4470476 4514156 4585420 4673677
9295 4673677 4792943 4944459 5118675 5293344 5473351 5645244 5814922 5980659 6141386 6307429
9285 6307429 6497007 6706677 6943005 7241072 7611791 8079502 8619509 9221556 9862199 10495873
9275 10495873 11138318 11792010 12464150 13193435 13964799 14753945 15539543 16300518 17025415
9266 17025415 17733079 18409000 19029299 19641573 20312535 21063863 21908489 22818656 23739086
9257 23739086 24594763 25338996 25969956 26521514 27061129 27628803 28218684 28804818 29385674
9248 29385674 29976996 30615030 31358453 32263570 33344659 34570852 35902882 37229243 38375197
9239 38375197 39183046 39550965 39498387 39082215 38349135 37328003 36141308 34979893 33999812
9230 33999812 33271803 32779781 32474456 32330873 32334225 32471113 32721215 33032751 33336225 33557170
9220 33557170 33669104 33702608 33680255 33573324 33315825 32908654 32423255 31973507 31687698 31629240
9210 31629240 31810215 32198623 32704235 33161249 33469194 33618133 33680949 33752485 33878927 34022860
9200 34022860 34160740 34297414 34470180 34687893 34918972 35137683 35319707 35478352 35657289
9191 35657289 35879168 36187270 36616278 37117822 37632980 38147795 38736035 39460818 40291582
9182 40291582 41052989 41498048 41432623 40842331 39877994 38759555 37633089 36594861 35672254
9173 35672254 34907842 34320170 33873376 33457633 32972342 32351481 31594098 30775668 29979007
9164 29979007 29236691 28451046 27517140 26447081 25349020 24365419 23618482 23126701 22826947
9155 22826947 22637280 22454619 22224628 21886839 21387499 20744328 20013280 19255792 18488446
9146 18488446 17712486 16942502 16186523 15426530 14671697 13943443 13252101 12629672 12085128
9137 12085128 11594198 11145402 10740672 10372718 10041383 9741547 9454494 9166860 8907940
9128 8907940 8684430 8471923 8260245 8060435 7889379 7759319 7657302 7527187 7363223 7203377
9118 7203377 7063695 6945800 6849447 6759090 6650477 6537908 6415651 6292633 6136082 5952137
9108 5952137 5740017 5520886 5322802 5173611 5050526 4939864 4834733 4735682 4636619 4544155
9098 4544155 4469350 4405578 4324425 4220440 4092854 3927505 3751553 3596054 3469066 3360840
9088 3360840 3267197 3188849 3127836 3065115 3014278 2980319 2959162 2928018 2897299 2851576 2787034
9077 2787034 2711559 2625119 2529559 2430944 2336405 2260346 2187150 2114185 2050234 1988461 1937904
9066 1937904 1894351 1846059 1812363 1775513 1747409 1721011 1682690 1652717 1630658 1608840 1581890
9055 1581890 1555590 1535433 1519792 1497713 1480888 1476318 1472673 1465662 1456752 1452071 1443293 1433051 1426182
9042 1426182 1417519 1404845 1384898 1364989 1343399 1319630 1305687 1297228 1283694 1278722 1273367 1280767
9030 1280767 1287345 1297123 1303444 1313369 1329035 1335642 1347161 1353763 1360353 1377935 1402958 1424220 1451345
9017 1451345 1479938 1497052 1529303 1559815 1604920 1647258 1703634 1773091 1837272 1881017 1928869
9006 1928869 1975249 2001491 2006508 1990071 1949782 1911702 1856219 1806360 1781706 1747678 1735256 1736168
8994 1736168 1757634 1792754 1833932 1897025 1969454 2042569 2095318 2106941 2065118 1986057 1906244
8983 1906244 1861848 1841031 1845121 1885229 1928656 1987639 2053051 2126448 2213115 2279642 2337918 2382195
8971 2382195 2419584 2445363 2452731 2427509 2386826 2331253 2257171 2182553 2098545 2013628 1955708 1907945
8959 1907945 1855083 1804144 1771691 1748749 1748897 1754067 1756265 1773440 1814816 1876685 1947951 2048558
8947 2048558 2152283 2246582 2343031 2430009 2494407 2520109 2506270 2466453 2391009 2298834 2224556
8936 2224556 2162349 2126867 2094322 2051824 1992458 1918379 1839576 1741770 1642455 1563699 1502136
8925 1502136 1448104 1392073 1347184 1318641 1289969 1263215 1241584 1229991 1221626 1219174 1206274 1198962
8913 1198962 1199785 1196772 1190212 1201385 1213919 1223105 1232442 1258993 1298848 1333795 1380999 1445157 1514057
8900 1514057 1586486 1632104 1669474 1670972 1613065 1513061 1412982 1343812 1283193 1247211 1222448
8889 1222448 1197745 1195453 1192380 1171447 1161010 1158140 1161179 1158284 1144691 1134345 1136055 1130453 1133733
8876 1133733 1140595 1139692 1140151 1138596 1140383 1147044 1156997 1176301 1194383 1207497 1199514 1188565 1185584 1188049
8862 1188049 1180858 1179199 1180194 1184554 1185625 1187294 1191117 1194101 1193846 1202982 1199777 1209122 1211403 1213957 1220809
8847 1220809 1222448 1219683 1217232 1206234 1200280 1198708 1187819 1174017 1174993 1169777 1167511 1175831 1190686
8834 1190686 1204314 1211544 1204138 1206828 1202561 1202592 1204895 1196444 1204230 1210894 1208215 1211758 1207298 1204196
8820 1204196 1210056 1223881 1234621 1239130 1240392 1240898 1241414 1252503 1273667 1282132 1279599 1289701 1295758
8807 1295758 1307581 1318775 1322346 1326831 1320440 1305712 1294008 1280559 1280056 1289272 1291841 1300604 1305923
8794 1305923 1314559 1321874 1337831 1342603 1351308 1365062 1382011 1399767 1413463 1417421 1412191 1404794 1412940
8781 1412940 1416642 1411359 1414274 1413434 1419144 1435137 1453139 1475732 1508881 1536520 1570004 1596007 1607170
8768 1607170 1599891 1595434 1591375 1579392 1567073 1558632 1546185 1532804 1520492 1509175 1510582 1503238 1506290
8755 1506290 1518692 1541625 1561067 1589464 1622509 1632582 1645487 1658536 1679829 1680364 1630771 1580175
8743 1580175 1549964 1536492 1531349 1530195 1535247 1543689 1542081 1544559 1538860 1543984 1541866 1539041 1526362
8730 1526362 1519381 1520583 1508978 1497896 1495229 1491232 1479126 1470846 1476159 1481559 1484850 1494502 1493089
8717 1493089 1487643 1492654 1499506 1507104 1518410 1535630 1543014 1549932 1552830 1553235 1555712 1553509 1552895 1550537
8703 1550537 1551790 1555672 1558506 1567305 1561550 1563164 1560020 1558800 1562233 1569754 1575918 1584544 1593110 1608071
8689 1608071 1614166 1606437 1608626 1620509 1639150 1651686 1651800 1664585 1667864 1665955 1675602 1696372 1713519
8676 1713519 1720855 1735321 1756733 1776062 1781054 1797371 1817580 1836555 1857424 1886671 1911377 1939345
8664 1939345 1961066 1962183 1969728 1986538 1998901 2008450 2014039 2022346 2037243 2054493 2082916 2111268
8652 2111268 2127252 2154337 2186110 2219684 2260058 2298879 2342375 2400025 2458736 2529714 2624707
8641 2624707 2740448 2868745 3010113 3155944 3289595 3413134 3509903 3530074 3463827 3364714
8631 3364714 3252614 3169774 3124977 3098250 3092811 3113575 3151884 3208797 3267442 3335713 3418824
8620 3418824 3517669 3621110 3718369 3801458 3869673 3927671 3958296 3978239 3999842 4042351 4111394
8609 4111394 4215279 4344283 4498428 4658346 4839420 5046185 5261094 5490125 5712440 5933445
8599 5933445 6157611 6356512 6489605 6540221 6516939 6457208 6372539 6276011 6167318 6047100
8589 6047100 5955014 5925305 5959862 6039949 6167130 6330046 6505230 6680238 6863579 7051904
8579 7051904 7231812 7402864 7573513 7747281 7930705 8137147 8363936 8636242 8942263 9263803
8569 9263803 9617225 9984713 10344675 10669655 10948247 11154098 11300140 11434660 11592811 11811129
8559 11811129 12081691 12383045 12671561 12904284 13079403 13228860 13405435 13624796 13870513
8550 13870513 14129893 14427551 14762483 15123620 15490431 15850682 16172948 16428778 16618131
8541 16618131 16766100 16925940 17122630 17382596 17730139 18192436 18770092 19496558 20380302
8532 20380302 21384067 22464538 23579727 24640704 25473045 26027597 26420754 26824041 27355880
8523 27355880 28111306 29106169 30288812 31607359 32962065 34269597 35356346 36086438 36419807
8514 36419807 36390370 36071283 35566583 35061842 34731219 34666071 34870396 35310935 35937806 36680356
8504 36680356 37556400 38635728 39953908 41475412 43088617 44652689 45988090 46897280
8496 46897280 47304557 47329070 47138349 46873513 46534415 46066243 45478779 44900067 44504749 44453868
8486 44453868 44850116 45710689 46990819 48623315 50505022 52514759 54560345 56566208
8478 56566208 58423393 60105453 61584334 62795080 63826017 64737569 65453463 65957952 66330749
8469 66330749 66808838 67548180 68446049 69211289 69702043 70092566 70644121 71485083 72618077
8460 72618077 73997206 75493840 76888669 78025314 78859787 79332858 79410109 79225721 78981066
8451 78981066 78670540 78087087 77076432 75634740 73769929 71509655 68997498 66424153
8443 66424153 63981266 61792250 59859675 58105446 56396461 54656652 52932186 51288952
8435 51288952 49781046 48344872 46941452 45581377 44308433 43155675 42185477 41410301
8427 41410301 40798682 40328652 39962812 39655594 39386683 39149193 38955910 38813530 38732279 38714716
8417 38714716 38767388 38888693 39078965 39358265 39722556 40148973 40602249 41055009 41507389 41965508
8407 41965508 42434425 42857668 43164857 43268777 43188777 42950609 42621160 42125241 41345892 40374770
8397 40374770 39438525 38686790 38177433 37914049 37877847 38078378 38480794 39050105 39752336 40498425
8387 40498425 41241112 41954697 42630765 43297279 43974165 44586091 44979772 45041932 44674360 43902425
8377 43902425 42864539 41749861 40649937 39631764 38750790 38016870 37415540 36920259 36493305
8368 36493305 36140580 35840317 35560759 35303213 35046367 34788564 34557315 34353619 34157115
8359 34157115 33927440 33664035 33345630 32991264 32600374 32218723 31891888 31624140 31384103
8350 31384103 31157412 30914657 30627490 30299336 29945655 29582185 29217471 28854679 28492626
8341 28492626 28145573 27814456 27475872 27137960 26828283 26508522 26177421 25840939 25510587
8332 25510587 25203442 24923270 24673003 24437918 24204347 23945119 23642748 23303076 22939673
8323 22939673 22593573 22262850 21922236 21567564 21188851 20795831 20394744 20001723 19616952
8314 19616952 19262809 18965770 18698403 18469266 18288066 18126115 17982506 17826856 17639665
8305 17639665 17400384 17056899 16626107 16167915 15721682 15303294 14892506 14474827 14049244
8296 14049244 13639125 13252495 12881897 12553035 12251833 11985008 11736848 11486699 11255661
8287 11255661 11042743 10840797 10633876 10452366 10274455 10088409 9915560 9736701 9556948
8278 9556948 9393908 9241599 9088125 8925722 8761318 8616537 8482955 8347064 8200392 8057457
8268 8057457 7914380 7784083 7652106 7527536 7406399 7283311 7171993 7053108 6938040 6835555
8258 6835555 6729905 6621972 6506157 6395401 6287653 6194837 6104939 6009883 5929328 5839751
8248 5839751 5745146 5669946 5602290 5509463 5413716 5318603 5225548 5149204 5066476 4985235 4907193
8237 4907193 4833339 4774930 4707182 4637465 4574312 4513529 4448071 4389319 4335825 4283864 4228696
8226 4228696 4169385 4111525 4059853 4013678 3958704 3910020 3861341 3817383 3768009 3722111 3685988
8215 3685988 3648277 3619912 3572859 3524211 3486864 3436572 3385354 3349856 3320882 3297925 3266943
8204 3266943 3240809 3219763 3196486 3174577 3162222 3146953 3103004 3043186 2982279 2923589 2883271
8193 2883271 2849381 2813779 2780273 2757187 2717508 2678473 2655341 2635849 2612627 2583163 2557099
8182 2557099 2538273 2504342 2472394 2443053 2426566 2423543 2412386 2408767 2396238 2377125 2357978 2336348
8170 2336348 2319478 2296365 2271273 2245785 2217469 2191485 2175305 2149713 2130122 2114601 2090242
8159 2090242 2070345 2063914 2057195 2053796 2049126 2030201 2013713 2008257 1986925 1961862 1948011 1940478 1936022
8146 1936022 1913269 1880174 1848530 1821111 1798157 1776589 1758679 1746066 1723917 1696867 1685629
8135 1685629 1665796 1657587 1643647 1631878 1625172 1614428 1606844 1591027 1582754 1571044 1554735 1543152
8123 1543152 1543625 1533082 1504583 1491059 1480729 1466584 1451733 1445617 1435947 1417011 1408922 1394280
8111 1394280 1395986 1387530 1359630 1350994 1342558 1344585 1343129 1341872 1330944 1323122 1321144 1323021 1322815 1317441
8097 1317441 1327104 1330759 1317799 1299774 1292195 1281572 1268784 1256501 1241274 1225841 1217664 1218407 1197712
8084 1197712 1191455 1193681 1184601 1180770 1173765 1170038 1173327 1186519 1183757 1169521 1170185 1160669 1138859 1121807
8070 1121807 1115555 1102686 1091329 1087257 1076646 1062816 1045017 1026775 1020278 1010181 994035 990982
8058 990982 990500 990425 986324 967716 956950 949804 938958 920978 908687 887698 876840 868194 868464 864553
8044 864553 863089 866595 862061 851905 839668 828065 826653 825726 833415 846212 840105 819746 814709
8031 814709 807448 798848 798950 799466 811900 820852 815614 816408 811470 810393 808376 808765 806350 798666 790385
8016 790385 780987 777951 771713 772883 759641 751417 747521 739303 736651 742536 746525 730214 720736 726339
8002 726339 723785 732828 735885 732682 721564 721730 711129 701652 695550 689239 682505 668951 668518 661603
7988 661603 647710 641109 639868 625087 601613 597263 605241 596949 582086 570900 565984 561234 553698
7975 553698 552148 548662 535791 529136 532878 524897 513330 505025 505382 519399 519768 509988 498072 485738
7961 485738 494962 490914 482894 486362 498958 503943 503779 495656 487581 487821 489888 492574 495760 490065 471014
7946 471014 466109 464301 458451 450195 454809 451845 438285 426245 419067 413008 410372 405563 395419 397413
7932 397413 397647 386922 388702 389568 386460 381397 381654 384094 375965 374092 384907 385640 376033 384027 389980
7917 389980 387456 388742 384983 376788 363121 354144 353874 350876 339119 334872 349782 348923 336836 331782
7903 331782 323700 322335 335163 340308 337066 329074 321360 311536 305698 311440 309472 307533 301630 296962
7889 296962 290321 288358 303087 304612 301210 302147 296341 299748 301547 298503 286817 281333 282242 275115
7875 275115 272455 276204 274321 272088 272066 270000 261763 254122 263178 280231 280674 284965 278624 273473 275856
7860 275856 269880 260130 253181 250517 242878 243073 247293 255259 253044 249878 253900 238975 231284 229895
7846 229895 232658 228445 226903 223055 209922 211004 208503 209120 221787 214450 209869 208576 213901 209923
7832 209923 206187 211573 213935 220286 214652 217445 216489 209519 202072 197459 192553 206885 205211 199764
7818 199764 202603 200936 196381 195442 198063 197479 199417 191084 188247 189929 192922 191897 186501 193402 193975
7803 193975 191961 190463 182122 183800 186435 186374 191742 200225 215658 223462 218337 228738 239722 249386
7789 249386 256864 259929 263890 260328 249338 230672 202551 192856 194620 187178 180934 169322 158315
7776 158315 168880 176313 177554 185988 185431 180174 176461 170042 160092 161424 164668 162947 172280 174515
7762 174515 169269 171464 176628 172143 168240 166102 169150 182938 183476 180964 191570 195923 198675 202049
7748 202049 201771 204739 217485 231266 253738 281665 295368 318793 340018 342967 326442 297285
7736 297285 273501 234882 204343 173006 156706 150880 146379 158002 162530 153016 144571 146549 143731
7723 143731 132047 133977 137747 141487 152314 156015 144665 136550 136914 141522 132926 140757 140494 139453
7709 139453 135121 127485 122060 121978 120216 126471 126053 134369 138408 144177 144991 146313 147274 151935 153439 156043
7693 156043 173014 179290 185374 180378 171163 153294 151821 136935 117422 108375 107463 103907 103379 109752
7679 109752 113141 109307 111995 113888 113844 119222 115041 110470 103761 97480 98416 100943 102581 107666 113584
7664 113584 118232 127306 127838 121037 107495 100511 104168 96998 88828 89449 96308 87814 86643 74042
7650 74042 70119 69846 78401 82401 80106 86167 82490 70406 69750 68784 67036 72767 75970 80474 79386
7635 79386 69809 74953 80200 75389 72948 76453 78008 73277 67997 64464 61804 62704 67323 81445 85007
7620 85007 81261 70616 66631 71164 73631 74637 66046 68801 62775 58973 68274 63555 65429 69632
7606 69632 81300 87394 80967 69414 62241 56716 62297 67007 65147 69578 74713 72722 72837 75632
7592 75632 76028 77405 62038 56542 54127 46330 44437 47983 62241 75623 79543 77266 70605 65294
7578 65294 70893 81209 73868 68540 61214 67290 63115 56525 54938 57549 70385 73195 61909 61782
7564 61782 60728 63477 67303 67968 66769 69501 67814 65991 60570 57324 58813 56125 60452 59982 48817
7549 48817 45271 47086 53143 55100 53400 53652 49163 45882 59363 73427 65019 59600 64135 71252
7535 71252 64251 52859 47228 46735 50008 50898 52836 52410 53442 55114 60494 60672 49440 49086 51127
7520 51127 56089 53186 58020 53410 49842 56586 55395 50031 48271 47327 43145 42766 48232 48996 46552
7505 46552 50824 45785 34685 36816 44742 45357 53699 53290 39266 36490 44736 39968 37962 40154 39923
7490 39923 35300 28469 27865 36466 32530 34892 36852 36263 28752 30275 32352 31355 32806 38698 39991
7475 39991 37760 37673 44173 41768 34292 34515 37298 38778 37914 35777 33769 26918 24847 27758 31401 29475
7459 29475 25707 35104 39355 32992 39407 37170 34583 41021 44050 45850 45762 42705 44957 45002 50719 46591
7443 46591 45898 37646 31610 24793 26794 33114 31024 29583 33440 35902 29729 23056 24117 29086 26739
7428 26739 20532 25630 25173 29901 30312 35323 38757 37506 37524 38529 41910 33183 23044 21574 23911
7413 23911 27753 26036 24089 17563 19196 18922 22233 18415 14984 21363 26078 21890 18076 25919 27391
7398 27391 18509 20892 20181 20246 18141 23912 28846 30711 30011 28126 29376 27047 16615 7407 11800
7383 11800 15181 17970 16374 10701 7867 13189 3751 2263 14139 19624 26398 34297 29548 22903
7369 22903 19514 17431 17688 26028 30623 31628 22540 32269 36998 28780 22294 24618 23948 17182 13826
7354 13826 17866 20794 25209 17524 19983 19530 15717 14610 17868 18207 26709 33721 36749 31130 29397
7339 29397 17438 -1811 -1244 2603 3676 1755 10103 12532 16118 17412 18412 24168 13289 2778
7325 2778 -1368 9718 16486 13517 19595 24789 29403 24477 15088 4834 -4792 3289 12385 13151 11950
7310 11950 16570 23208 27292 24544 20590 15212 22170 16079 6340 14518 12786 16358 16901 22270 19311
7295 19311 19218 15468 15798 20977 19623 12837 13567 17242 25035 18887 18574 21557 27274 23974 16925 22372
7279 22372 22733 17983 28693 41127 35684 31504 30463 23270 19465 10977 4844 9512 12510 7846
7265 7846 2754 4781 1987 -4786 -4527 4389 5217 9226 12045 12676 12785 14434 14133 3948 8329 6833
7249 6833 -4292 6249 19510 25037 30426 25987 23671 15617 25056 24171 12020 4712 -1892 7873
7235 7873 15718 14204 5810 924 -14726 -6275 346 4562 18901 18421 20972 24028 27256 23352 20384
7220 20384 6547 -3644 1658 951 -1754 1553 -188 -3147 1380 7301 10646 8816 8754 3501 8626
7205 8626 4071 2873 5507 8929 10675 5244 10649 11231 8575 -2659 -6753 -784 -690 -3572 1467
7190 1467 -8674 -15990 -14414 -9579 538 8091 12994 10749 5879 4783 8070 18381 18129 13779
7176 13779 10770 8127 9029 3450 -2278 1861 3680 4843 -5377 -1008 3981 3107 7246 611 -4315
7161 -4315 2761 4595 2184 -4126 -12562 -15915 -19997 -20413 -14438 -8307 -2893 -5970 -6194 -3926 3721
7146 3721 2064 -148 -1499 1492 1123 -4595 629 6571 11907 10807 5941 1922 -4736 -1479 6225
7131 6225 10464 5093 6824 421 -1565 6740 8256 -5810 -7853 -3855 2407 8133 13438 18111 20876
7116 20876 25135 23264 14955 14225 23671 15536 12502 2711 6011 8457 8909 5732 5334 16175 15126
7101 15126 10110 6698 4320 10617 12142 8864 1269 -1740 -7230 -16664 -21232 -10980 -1888 -1112 -828
7086 -828 989 454 4918 5360 -765 3883 9249 8325 3572 -2419 8159 10263 16539 17231 16027 4927
7070 4927 -7617 -10895 -7549 -5215 -6457 -6873 5944 15698 10558 4401 -3669 -8594 -3543 -1660 3628
7055 3628 6417 11226 8295 1074 1117 5592 11108 7081 4223 -4628 -9849 -5081 2277 750 -5093
7040 -5093 -12879 -11994 -8007 -7707 3949 -30 -12453 -1860 8687 21792 22087 14751 17267 22416
7026 22416 16996 6053 7550 9388 16965 13686 5032 5107 6634 3690 11 -3164 1443 15578 30947
7011 30947 31801 29334 29434 16264 12465 7523 4407 8799 6032 -512 -11187 -4073 4654 -4345 -5929
6996 -5929 410 -1043 2164 -658 4365 11170 13077 15732 14143 18857 24174 25670 17261 6246 -3360
6981 -3360 -8685 -11152 -8516 -13898 -11020 -5612 -1227 4353 9024 13931 7693 6091 9734 13890 11878
6966 11878 4148 2356 -2540 -3573 3147 4147 670 -5872 -2065 -5610 -8535 -2611 6790 8331 -1999
6951 -1999 -8201 -7669 -2584 6869 13326 15120 4500 -4762 -1333 -910 -6732 -6951 -13053 -16478 496
6936 496 13404 10352 6254 2035 4642 -4258 -3584 2880 -3118 -5936 7350 6813 9407 10885 9643
6921 9643 9317 5117 8260 10460 2813 -1032 -5668 -4830 -4372 -1995 -7137 -9595 -1402 5638 7284 6478
6905 6478 14005 6100 -3661 -10528 -7418 -13003 -17632 -12175 -15222 -10238 1318 2779 1158 -3283 -4591
6890 -4591 -10601 -12045 3426 11522 479 -3535 -5269 -15534 -14157 -19131 -12033 -3529 9 -4892
6876 -4892 -2874 -6719 -8527 -10570 -27412 -27462 -22685 -9488 7426 4543 -5119 -9925 -6043 -6077 -1487
6861 -1487 1841 -1929 -7793 -5412 -8354 -5693 -1036 -1225 5336 -1052 -508 1041 -764 2454 10557
6846 10557 4077 -114 781 4621 5549 -340 -10498 -22720 -26917 -21258 -12120 -4753 2222 10042 -3259
6831 -3259 -1439 -4459 -7277 -3245 10628 18279 11420 7404 -814 -4319 -7291 -16674 -19038 -20163 -14496
6816 -14496 -7981 -4892 1013 -2571 -12243 -28954 -25980 -15576 -14566 -4729 2395 4081 -4721 -7348
6802 -7348 -7 5291 9840 6989 -754 5681 10919 11343 9523 15796 20193 16666 8592 1907 2473
6787 2473 6890 6849 8520 14977 7650 4062 -366 -3060 287 2891 9491 15054 4602 -1081 -5097
6772 -5097 -6122 -10377 -15675 -9097 -5468 -6671 2995 -1425 -3742 -1563 -1461 -14273 -12306 -3959 -7685
6757 -7685 3195 947 5816 14388 18973 17857 17640 16537 18622 13955 9725 1580 -4019 -1675 2331
6742 2331 1946 134 -9911 -1226 4294 4202 -5538 -16414 -4267 254 2015 4741 1683 2232 -944
6727 -944 -1362 -9857 -13173 -11413 -7879 -7618 -12123 -6448 -4241 -5575 -5777 -3907 6971 3543 9174 13930
6711 13930 11330 5873 542 8714 16517 15810 22722 26433 28233 26153 26737 14369 4882 -261 188
6696 188 -3727 -11972 -10367 -7842 -5209 2983 505 -4386 963 2453 -1371 -4510 -5785 -7438 -6141
6681 -6141 -9145 -15377 -10430 -8561 -20286 -17285 -17012 -6715 8064 733 4243 79 1830 5365
6667 5365 4401 2954 13726 21884 25242 32536 35157 20787 13601 24917 27574 36935 41474 42379 54224
6652 54224 68836 75738 62007 41249 19544 4127 -1575 -2219 2886 3890 6969 9515 9522 8137
6638 8137 11123 19052 17396 17243 14811 10533 12176 7885 2145 -4042 -5023 6739 15033 12695 8608
6623 8608 10433 16712 13253 5935 -2821 -1513 2399 909 -1961 -6321 -3949 337 12362 9406 239
6608 239 7326 4003 -4753 2202 8086 11377 11777 10543 7046 6639 9833 17743 12187 5967 3901 -4166
6592 -4166 -1870 -2482 -4115 -16130 -21030 -17675 -6508 -4029 -6678 -3727 -5161 -5228 -17869 -20358 -13474
6577 -13474 -8268 -18411 -14135 -1779 13760 16910 11990 10394 -1093 -1500 -185 1686 7125 5630
6563 5630 -415 5587 10217 3805 -6790 -15518 -11185 -9101 -6443 -2837 -8674 -4060 -2573 -1641 -3959
6548 -3959 -6536 -16356 -10912 -1026 -6715 -3364 14090 17169 9641 1840 2105 116 -4342 3938 5150
6533 5150 3973 -424 -3986 2651 8667 6580 2603 5533 1336 -1487 10034 12546 8179 3240 -8564
6518 -8564 -3197 -5772 -5370 -2073 297 3090 3457 3122 -4869 1206 4410 -289 -5471 -8509 -11421 -12309
6502 -12309 -14319 -11878 -17571 -20295 -9623 -2791 8577 3087 6223 6642 3325 5998 12676 10766
6488 10766 5028 2741 1793 5229 -2474 -20644 -17774 -19515 -21355 -25074 -17803 -13580 -13639 -20287 -11869
6473 -11869 -14608 -14460 -4900 -2952 -1145 -8703 -13487 -22306 -16279 -13190 -2302 7753 -3509 -21124
6459 -21124 -30036 -31802 -28264 -17144 -5354 -628 6945 16601 9414 -3559 -1357 2759 11640 11625
6445 11625 1329 -13441 -17198 -15087 -7012 -7272 -7259 3359 -399 -7789 -10079 -14222 -687 11523
6431 11523 5959 3807 4321 -734 -9386 -10256 -10881 -6224 -3012 -4430 -13571 -16410 -7725 1468 550 66
6415 66 -1702 2980 5581 1906 -6269 -4667 -469 9752 4140 -3977 -5513 -6972 -8841 -9569 -12457
6400 -12457 -10840 -10600 1409 9646 19877 18787 6171 3182 -4816 -6897 -452 -875 -3891 -9708
6386 -9708 -10583 -2408 -2657 2269 9961 13201 13120 17085 13746 10702 7035 12541 8718 6073 10037 12980
6370 12980 8296 65 -10443 1993 -731 -13443 -3874 2218 7505 8729 12301 15327 16910 15537
6356 15537 11708 -2476 -10854 -12077 -11900 -7958 2599 11224 10949 -1815 -7162 -9803 -5625 -2694
6342 -2694 -4345 2294 2412 8467 1321 -8191 -5342 -2332 -15813 -21263 -17627 -22919 -20972 -13725 -10267
6327 -10267 -4167 -3075 7351 17225 13259 5649 405 -5115 -14204 -10042 -4375 -2182 -1313 54 -4437
6312 -4437 -9107 -11592 -12523 -8132 -7534 -7142 -12619 -10090 -1632 1422 9439 8858 2710 13898 18075 12389
6296 12389 3921 5282 2580 -3903 -18048 -13169 4696 4668 -1013 4609 105 670 4674 1363 -2403
6281 -2403 6323 2251 5106 3000 -596 -1637 1246 4554 11608 15330 18558 13632 10455 10146 10361
6266 10361 2160 -1637 -8075 -3575 -4946 -2155 4701 -360 2388 6652 11369 6613 9168 7022 -1659
6251 -1659 801 9745 4761 -6616 -10544 -6785 -3604 -10791 -18079 -16884 -12339 -10154 -11293 -4637 342
6236 342 -2839 -595 -4464 -8433 -2933 4205 7240 1612 -3023 -2186 -7864 -8230 -6902 -8439 4460
6221 4460 8062 2631 9309 6429 6084 3258 -1517 -5605 -9360 -10857 -13519 -10871 -12419 -11704 -8202
6206 -8202 -14237 -14797 -4849 -13374 -3026 13223 6919 -8930 -10282 -1618 -2186 -9588 -7610 -5689 -509
6191 -509 -129 4124 10823 7811 6621 8436 9989 2682 -11220 -11402 -3060 5196 7853 7472 -47 -1102
6175 -1102 -7417 -8160 416 3279 669 -8615 -14558 -14357 -15214 -14613 -5222 -10209 -13839 -20163 -19597 -20812
6159 -20812 -12303 -2015 4025 5342 9222 11269 5281 1925 2289 782 -5807 -17085 -16722 -8424 -951
6144 -951 -10363 -9660 -3653 -4675 -3329 -6133 -16299 -15455 -7142 9231 14126 -4233 -13593 -5924 2607
6129 2607 269 -2139 5257 10668 3886 -10688 -9673 -6350 -3932 -1984 -139 -4966 -9342 -8449 -13408
6114 -13408 -1310 714 -4521 -8206 -11698 -2045 -1947 2003 -884 175 -1496 -2400 -8730 -13870 -18585
6099 -18585 -7279 1793 -916 -3518 7 269 2596 1111 -9938 -6755 -17925 -17328 -14860 -6169
6085 -6169 -432 186 -7636 -5490 -3466 -1474 -1818 10136 8684 -1978 -13366 -11974 -14267 -11993 -7655
6070 -7655 -10315 -16641 -22756 -14848 -10843 -13185 -14558 -9036 -3469 2963 5160 -6071 -7398 -12283 -4194
6055 -4194 2175 1040 -8543 -6882 -5220 -12326 -13937 -6307 -5843 -15990 -12172 -1906 -7091 -2798 -2314
6040 -2314 -13216 -14172 -21875 -20636 -20010 -16010 -8914 -4166 -2466 -11057 -13545 -12223 -11736 -8249 -4794
6025 -4794 -5256 -16637 -11027 -16041 -16111 -14912 -17386 -25835 -20765 -1326 6672 -5869 -6077 4311 4505
6010 4505 880 7334 10668 -859 -15097 -23690 -16927 -4744 5021 10395 7949 1264 -6364 -4968
5996 -4968 -2971 6609 10759 7321 14011 19005 21584 10146 -1456 -682 4672 3608 4792 5277 101
5981 101 -4634 -5440 -327 -7275 -14436 -2272 14073 19749 11280 -934 -6305 -7812 -7103 -9402 -7117
5966 -7117 -13385 -20658 -18800 -17612 -22571 -20199 -14985 -5171 4593 6868 7019 -4244 -11305 -12050 -13757
5951 -13757 -14064 -11108 -4234 -839 4479 14044 13231 5256 -5450 -6448 -3405 -1145 2318 -4326 -5452
5936 -5452 -1327 -2180 -4372 -1157 -11189 -13675 401 2704 11601 24261 24182 20939 17778 16907 1150
5921 1150 635 -3591 -16478 -9234 -2370 -5083 -4672 -5286 -9825 -13506 -7578 -13132 -9750 -8689 -10530
5906 -10530 -12210 1914 11443 13737 -2639 -7431 -10121 -1529 -5051 -7051 -8473 -1657 1053 2100
5892 2100 -2364 5235 6571 -273 1467 341 -5100 10443 17490 4013 -8872 -13885 -11313 -3813
5878 -3813 2330 392 -1374 -4040 2596 2525 -639 -6405 3551 17681 20656 13427 4008 1159 2223
5863 2223 8682 12842 19457 18776 12535 10121 9576 6178 9679 10185 8421 6046 7695 1204 -2850 -2919
5847 -2919 -5112 -4448 3211 -4561 -17342 -15056 -5313 8276 5213 -63 4372 3488 4125 -7321 -8818
5832 -8818 4268 8926 9032 3424 3308 -1238 -9167 -11168 -9412 -12381 -7523 -8004 -4623 -5452 -10167 -10306
5816 -10306 -7907 -9014 -9361 -12343 -23158 -26104 -17143 -15258 -8662 -11245 -15460 -13215 -8333 -9264 -9831
5801 -9831 562 -2528 -7090 -7325 -3294 -6555 -10499 -13994 -2147 -1036 -8989 -4264 -4299 -8387 -17526
5786 -17526 -13940 -5068 -2651 1029 3779 2046 -8102 -17721 -20127 -14339 -24964 -19442 -1042 7670
5772 7670 1496 -3917 -4165 -5149 -9532 -11443 -3324 -816 64 3454 8095 -165 -5002 2051 6320 4819
5756 4819 5545 -2906 -4587 -8290 -1870 9699 2538 -3514 -7717 -17469 -13657 -12698 -14094 -2834 -10157
5741 -10157 -14376 -13731 -11376 -12920 -15948 -12808 -15260 -11876 -12889 -7172 -359 -2690 -1788 -9622 -6576
5726 -6576 -4302 -5935 -3479 3924 6689 5767 6211 8447 12349 -133 -11506 -17856 -11719 3636 10705
5711 10705 12675 15562 14715 23667 18887 11115 6314 -3269 -11403 -11999 -17903 -9662 2826 3543 1847
5696 1847 3610 -2194 -4861 -2709 -11722 -14836 -9346 -6131 -9882 -23776 -27532 -26618 -24085 -14789 -13784
5681 -13784 3562 -2187 -15718 -9752 -3754 4094 8380 3322 5115 -6519 -1615 6879 -959 940
5667 940 2476 2220 -2061 11645 14284 13850 11271 13985 14919 14815 12764 13365 3196 -6981 -11782 -19581
5651 -19581 -24480 -16506 -7017 -1167 -2119 8611 14660 18202 17054 14950 11047 9309 1712 -9634
5637 -9634 -8165 -5482 -5403 -6655 -7583 -15022 -12309 -11216 -9283 -13989 -14252 -18054 -14325 -9302 -8008 -4889
5621 -4889 59 -5290 -11157 -4368 883 -1324 150 -1165 -10459 -3778 9921 9686 5237 -3257 -13436
5606 -13436 -18357 -25579 -19101 -13010 -5517 3690 3866 821 2118 -5640 -9238 -1175 10192 7007 162
5591 162 -2946 -879 331 -210 -1335 3767 3532 1946 9733 13136 13413 13780 16239 16623 19034 11146
5575 11146 2657 1819 4501 10322 4753 6421 9547 1442 -5203 -6452 -1408 -2520 -7137 -12821 -8142
5560 -8142 876 5022 8218 5594 690 -3371 7291 9459 9477 -2774 -3125 7957 11396 4196 -5142
5545 -5142 -5589 -7021 -6969 -3987 -4847 -7911 -6202 3733 -1437 -7805 -5773 -4178 -3039 -2941 3448 8059
5529 8059 8347 6777 16646 20780 11677 -425 3897 9124 12804 6239 -1621 -5666 -5095 -4433 692
5514 692 630 4860 636 -6554 -5993 -11617 -13744 -8588 -6560 -256 530 -602 -4797 -1324 2433 4898
5498 4898 5330 5539 -1767 4001 10971 12080 7023 -87 4931 7196 -2504 -8724 -9155 -9758 -13462 -14591
5482 -14591 -12068 1530 -5571 -10803 -8256 -15308 -16140 -6645 -9328 -18828 -18059 -23035 -24653 -21832 -12974
5467 -12974 -8615 -2625 7365 -1189 -5885 -15095 -14562 -7211 -2759 4310 11789 7643 8763 4096 4773
5452 4773 14591 6151 -2307 -9395 -14677 -12702 2658 239 -10363 -21544 -19003 -15085 -7628 2305
5438 2305 522 -363 -2901 -10135 -6643 958 2116 -1451 -5266 2615 -4509 -4720 3828 5080 8086
5423 8086 -2093 -4416 2710 3324 5719 12479 1670 -8013 -6945 -6664 2405 4242 -1035 -1009 939
5408 939 -3302 -5135 -2707 -7331 -10820 -14134 -6407 -4386 -1702 4582 9819 3357 -6108 -4254 -10517
5393 -10517 -20067 -11641 -6900 -5701 -15514 -11984 -14102 -13949 -6033 1510 714 -5278 699 8546 10874
5378 10874 9577 6711 5205 -2923 -12572 -16133 -7650 -3776 -8001 -15502 -18254 -12943 -7002 -1362 6192
5363 6192 -6818 -12184 -5742 -6540 -3584 -6046 2126 6513 3295 12329 14671 5196 -3986 -8294 -16487
5348 -16487 -20671 -21752 -22970 -11723 -13228 -16881 -10191 -12887 -10166 -12012 -11310 -8226 -2000 -6013 3675
5333 3675 8330 8546 -1529 -13305 -7577 -7000 -4682 -7535 -11806 -13587 -11808 -11328 -11424 -7634 -7905 -9161
5317 -9161 -6083 1011 -4905 -5829 -2217 -587 -2312 -810 7999 1118 -1525 -6423 -16208 -17901 -12117
5302 -12117 -6172 -9523 -12865 -10276 -9739 -7295 -6141 -910 -2212 -7216 4064 -3954 -9663 -335 9970
5287 9970 4322 -6292 -2445 836 -4358 -2893 -181 6230 8730 8917 10139 10856 3217 -5713 -14795
5272 -14795 -11207 -1502 451 -4659 -11255 -10333 -6251 -1637 4493 8368 1872 -1118 -2580 -12188 -8865
5257 -8865 -11639 -23346 -21052 -13607 -10500 -8999 -9445 -7658 -6228 -7725 -13982 -10703 -3600 644 12997
5242 12997 17427 3733 3216 102 -6758 -8102 -6783 -6618 -11722 -14257 -6661 -7433 -11011 -736 6647
5227 6647 11726 6566 2718 3950 -2378 347 -6824 -16912 -19996 -12167 -7757 -268 4097 5841 1934
5212 1934 -3725 1915 886 -12123 -20823 -18406 -2053 6776 8863 17809 22506 20873 17990 14251
5198 14251 17452 5976 1500 -1570 1055 442 3055 8383 5221 3170 299 729 -2088 4324 8476
5183 8476 9884 8938 2364 11865 19050 9556 6865 7461 3794 -268 3007 3868 7585 4814 -2155 4688
5167 4688 14753 12718 11329 -1479 -11982 -10831 1278 8860 12111 8882 -6452 -5800 -5793 -6631 -7737
5152 -7737 -3645 -2852 -10102 -9672 -6308 -20238 -22844 -8252 -4891 -6317 -3061 -9221 -10123 -15123 -18503
5137 -18503 -26422 -25675 -27193 -25585 -25117 -18838 -11563 -12658 -7617 -5360 -63 3300 19420 18667 14172
5122 14172 2898 -3284 -6498 -12376 -15480 -11042 -6218 -4159 1969 7401 7729 5131 2509 -5583 -9937
5107 -9937 -15473 -6405 6192 1466 -6848 -1679 -9789 -17397 -20012 -7856 675 -216 414 599 -1136
5092 -1136 -1647 -4432 -10747 -8075 4248 9114 14864 10628 978 4 16132 13274 -114 -5522 1902
5077 1902 4691 5407 9003 -681 -11850 346 12952 7471 4655 5344 5993 5342 1630 -3086 -5672
5062 -5672 -7023 -6109 -12153 -2336 4040 7249 654 -6835 -1426 4581 11840 12445 2003 -815 8714
5047 8714 8741 4544 13021 6789 2705 3344 7723 8503 9662 12786 6806 -1429 -13794 -16427 -16075 -12622
5031 -12622 994 10079 6148 1869 1916 -1268 5230 13432 9597 7908 4855 -4957 -6543 -6551 -1598 1088
5015 1088 11266 18538 11332 15409 15092 2610 -9729 -13313 -10213 -14540 -11095 -10202 -311 -4598 -15792
5000 -15792 -13307 -6568 -1852 -3715 -495 1517 899 2042 -1213 1217 -1563 5971 11031 9184 1421
4985 1421 -6514 -14577 -18531 -14406 -9045 -13266 -26393 -24773 -10269 -2020 -2811 -4795 -2151 -1806 -1156
4970 -1156 -8444 -13345 -1709 8708 7186 7036 6540 -3064 -6875 5263 16380 21353 14069 13352 8649
4955 8649 -1110 -14232 -15833 -7035 6100 18272 18692 17129 10711 10481 17529 11675 1834 13224
4941 13224 8229 -5224 -365 7776 2800 3864 5603 4175 3888 2403 544 3835 4302 6304 16020
4926 16020 17152 6726 3411 6581 -6679 -8923 5793 8044 -4336 318 4474 8911 6638 -3965
4912 -3965 -10606 -16088 -12762 -2774 6917 5271 -3470 -13173 -16068 -2063 5724 4466 -8176 -10055
4898 -10055 -2856 737 -2070 -10562 -20126 -16699 504 7128 2697 -3505 -2885 -1575 -10845 -2072 6882
4883 6882 -2752 641 398 2171 4812 10019 21010 15296 3030 -5975 -4659 26 11740 13819
4869 13819 4135 14290 18054 14786 16167 16556 4628 -2743 -2350 6999 11377 10283 10286 7371 7667 11445
4853 11445 7582 4156 3209 3144 2537 -5990 -6480 -5325 -3336 -963 7948 12992 3561 -9017 -12487 -8492
4837 -8492 -8086 -11608 -11117 -11398 -2340 -568 -7167 -15371 -10240 -7783 778 4071 -1389 5677 12296 10386
4821 10386 -478 -2288 -2488 -1187 7042 8296 6431 -296 -6453 -2163 -4793 -4504 -1432 -1203 4882
4806 4882 9531 4289 -9640 -10863 -12023 -3149 8784 5750 2682 2306 3952 -548 -5136 -6016 666
4791 666 7987 7207 1209 -679 3829 -101 -368 -3316 1663 -2194 3430 2849 3359 -1875 -8001 -12750
4775 -12750 -7749 -6553 -3889 -8887 -15180 -14519 -10265 -10384 -1664 3386 2836 2865 616 3391 3103 2769
4759 2769 -6087 -9289 -2702 -8653 -4386 -445 -2174 -3692 -6394 -8649 -1527 717 643 -2276 1712
4744 1712 1822 8430 21582 22666 12973 12189 8727 5821 303 -1736 -1972 -10006 -16503 -14771 -16405
4729 -16405 -16621 -14033 -11457 -6757 -2599 -5575 -2736 566 899 4284 7009 15202 16448 8757 7670
4714 7670 4626 -5598 -3674 1515 -1179 -2778 -7096 -12434 -16898 -17308 -9720 -12581 -9825 -438 -3785
4699 -3785 -4118 -1529 -6818 -7548 -4090 2529 5130 3020 1290 1243 -4980 3051 4792 6086 5077 6013
4683 6013 8059 12437 7468 1182 5321 4952 5344 3515 2594 309 -2548 -2907 -5820 -3414 -4544 5209
4667 5209 5338 -3469 511 2092 -4459 -7607 -8346 -14629 -9022 -2758 -2528 -3941 -3772 -1797 -387 -804
4651 -804 16 -1955 3006 -8447 -12856 -1947 11389 15940 13541 18709 9526 -11418 -13316 -8262
4637 -8262 -10722 -5597 321 -2929 -127 -7197 -4522 -70 12605 10969 12010 14419 13409 20056 13386
4622 13386 -2139 -9160 -6403 197 -1937 1145 6348 4097 -1138 -6642 -1793 -3025 1092 6503
4608 6503 301 1841 2747 11566 13560 8689 5318 3935 1641 -521 6550 9228 8155 5993 7180
4593 7180 7526 5362 2372 3716 -1916 2148 9496 5799 9086 10345 5060 15630 13292 15526 11054
4578 11054 6968 3144 5055 -848 -12745 -14784 2633 22845 24193 13133 12153 10675 8569 6981
4564 6981 6969 8870 7370 4881 8202 8803 6715 5753 6137 16147 10101 11624 7268 2302 8930 20213
4548 20213 19993 27981 24471 17425 13457 16669 8738 7599 5685 6982 14420 18125 11365 -2278 -6591
4533 -6591 2089 2908 3331 -315 2665 20163 10241 5113 9737 7290 -1034 892 7838 8883 5180
4518 5180 6141 4744 3844 6946 8111 -1805 -3725 -10762 -12800 -9389 -11830 -3695 -2990 1698 -4384 -15264
4502 -15264 -20151 -7030 636 -5286 -2830 8648 13914 18090 16733 12000 12656 12389 10451 5232 1948
4487 1948 5674 -3137 -39 -1646 1568 7873 6072 4208 14968 14633 13545 13940 11993 8817 7145
4472 7145 5378 14089 13704 11352 988 175 -1330 1352 6471 11946 16373 26331 13078 9436 10436
4457 10436 22789 19076 15306 28105 19634 12620 17474 23531 18891 12002 7255 5438 7695 9606
4443 9606 4551 -816 3544 12306 10248 6333 -6753 -8625 -5503 -71 -91 6746 2745 -5810 -4845
4428 -4845 -6609 -7808 -11525 -1652 -4792 2631 7174 7901 7575 -2980 -7227 705 -1238 -5945 3082
4413 3082 2069 -4615 -6113 -46 -1444 -3097 -2509 -10575 -15596 -9184 -14033 -17715 -7292 -3212 -8329
4398 -8329 -7851 -4439 -1751 -3203 2114 -2648 -6890 -1580 5268 2899 -1090 -7717 -7906 -1893 8704
4383 8704 7603 9737 10244 256 -3265 -2942 -3816 -2003 2693 3446 7635 16591 15328 -1035 -6344 1144
4367 1144 110 -3966 -6354 -2301 6119 11808 8993 5610 9261 3150 -11459 -18304 -7851 -10166
4353 -10166 -7317 -5901 -62 488 -1825 6915 10183 2232 -10536 1916 13857 17287 17627 16068
4339 16068 12150 5541 -5578 -7217 -5400 -1597 2131 -634 -761 1214 -2825 -1417 -2057 1809 2454
4324 2454 -4113 -7311 -12236 -5722 -2458 -7492 -3209 6705 8346 687 492 1155 -765 -2269 4410
4309 4410 1538 -3918 -9164 -9071 -9010 -9173 -2481 5343 1941 -4440 -8198 -17290 -18074 -12199 -16556 -9594
4293 -9594 -16466 -15580 4532 9747 -550 12151 15295 18188 18856 5071 -4034 -958 2157 1672 1068
4278 1068 -3302 985 4973 -7536 -21280 -25414 -21625 -6371 -4022 -1547 -1002 -272 -1730 2422 3619
4263 3619 793 -7413 -15207 -19732 -15400 -3721 -3865 1870 866 -2100 2171 -3191 -9420 -17020 -13001
4248 -13001 -6283 -2029 1377 1909 4661 13977 1778 -1593 -1448 3483 11252 11640 4829 7559 4140
4233 4140 3523 8675 10905 8386 617 2712 5692 9449 17100 14501 13437 11174 3068 7846 9308
4218 9308 7473 2753 17528 18381 11189 11287 6831 4392 13899 9583 3088 4900 4315 -2352 -525 5256
4202 5256 3041 1586 944 2113 6633 14513 13022 2030 -3149 -5438 -5152 -3147 -3621 6515 11337
4187 11337 15474 14861 11773 6294 1367 -3131 -952 201 10147 4444 -4856 -7538 -2078 7662 9634
4172 9634 -3065 -8709 -8154 -4818 2348 9703 2889 -6705 -1759 8993 14998 11022 8951 -167 -17610
4157 -17610 -17107 -22206 -16709 -7579 -2154 -1856 -7375 -5166 8768 9524 10819 2443 3157 -8354 -10206
4142 -10206 -6598 -1413 9934 2970 -3379 4071 9296 13251 11628 8096 17577 26592 25647 20465 20736
4127 20736 20019 14627 1243 -873 1091 -5375 -12775 -2399 1526 -3615 -668 9181 9584 8596 13090
4112 13090 8128 10681 4055 -3673 -3514 1687 3859 15149 14172 12960 11663 9389 6791 4253 10859
4097 10859 10226 6002 7857 6367 522 -888 7832 16007 17314 15123 11789 13903 12479 6310 6897
4082 6897 3224 8347 12734 9872 6366 11490 18415 14293 12407 20635 20908 27228 30689 32233 26341
4067 26341 20238 19018 5655 -3141 2680 9104 13794 21954 10144 4442 2801 1867 3672 823
4053 823 1367 -1843 1364 -5475 -12084 -14104 -5596 -4500 -10295 -8553 -11987 -8687 -471 -2896 4036
4038 4036 11784 16044 13528 7942 4601 2781 -3771 -7243 -6138 -6829 -5290 809 3902 -410 -2670
4023 -2670 5700 11999 16968 25757 20352 21101 26978 22091 9401 5279 8827 7633 9558 4829 -9766
4008 -9766 -7846 -7452 -15154 -18819 -14422 -12930 -9507 9464 3373 3291 7131 12696 15889 7379 -6607
3993 -6607 -9130 -3997 -805 9484 13785 11982 12968 16380 24272 19214 9105 -4895 -4405 -3495 -5758
3978 -5758 -1966 6247 4629 -4716 -5152 2590 12941 21180 14979 5111 7226 13252 7128 2922 3848
3963 3848 3385 485 14703 17478 16620 16347 17259 19867 17000 17191 7581 1976 -3739 -6578 -743 2835
3947 2835 9940 10349 8137 10024 16609 8344 -4205 1490 11809 12876 3797 -2346 -936 2014 663
3932 663 23 5678 11758 7169 16354 20165 15615 15695 3910 5755 5807 -7746 -8526 -5833 -952 3303
3916 3303 10068 21494 17810 6340 560 4325 1924 -1424 6844 9002 -3684 -4390 768 3060
3902 3060 7461 16425 22239 12923 12531 13913 10462 11251 16878 8831 2267 1823 6374 2645 2410 2081
3886 2081 -3298 928 1458 -6674 -5344 -5416 708 -3168 5835 -243 7240 16798 23187 16959 7396 5452
3870 5452 10394 11983 -1355 -2170 -2330 -7 -2304 5582 15095 14744 12768 5195 5517 -1694 -6229 -2645
3854 -2645 -2896 -642 2775 6697 8327 807 4479 11576 3892 9329 20527 9424 6967 4289 2114
3839 2114 8063 57 4282 19269 18097 11622 18463 18322 6908 -2395 -1358 1537 5737 6987 3914
3824 3914 -1536 712 1637 4369 -2995 -377 -572 5969 10790 17015 17355 11527 10783 243 3970 10796
3808 10796 4592 -5816 1790 6686 9098 6090 3689 9544 12446 10726 17560 19985 11534 1058
3794 1058 -689 7535 8852 15564 16459 8862 5698 6640 2580 6707 -1247 -3571 7238 8349 12762
3779 12762 11804 1612 -5214 -9972 -14397 -16125 -10164 -6762 1655 3431 3176 -471 -10530 -6003 -4934
3764 -4934 1987 4876 -2422 -3836 -4777 -2955 -1401 -469 3990 2705 1001 4347 10577 8900 13024
3749 13024 7914 4792 7355 22 -222 6857 4736 -7241 -15828 -19578 -20232 -15570 -5826 226 8021
3734 8021 6496 -3518 -5363 1402 1068 -1280 441 -309 -300 9656 11991 10046 5543 7930 12084 6386
3718 6386 5720 7858 7003 2418 -8051 -8340 5726 9392 964 -814 -451 -541 1193 -6132 -2842 11689
3702 11689 16741 3625 -449 -1685 -5837 -7587 1337 -503 -3697 -9816 -16303 -17135 -16717 -13290 405
3687 405 9540 5782 2920 8233 2630 614 1997 -1883 2553 13619 10703 -3085 -2830 2534 4426
3672 4426 8501 12941 2268 -2501 -854 -8770 -8971 -13578 -16737 -14774 -3950 8212 -182 -3107
3658 -3107 -3697 -1948 -6810 -5208 6020 1879 265 5334 5786 7556 4143 -1592 -504 -6431 -6086
3643 -6086 -5262 5157 9828 -2178 -7016 -4368 1176 18421 14975 10668 13768 14506 9027 4217 4241
3628 4241 5483 7984 3079 -2260 -12485 -11263 -6940 3111 12313 11959 2534 2972 5152 9138 -562
3613 -562 -1208 -4001 3203 6744 6462 6857 12800 14456 12701 893 -3293 -2100 -1977 -3585 4540 3277
3597 3277 -7 1833 -2041 2771 15238 23385 20222 22985 18112 9225 10468 16828 12119 17958 17175
3582 17175 11061 8771 6072 2062 -7899 -10405 -5157 -586 3571 -5492 -22129 -20438 -4961 4692
3568 4692 16126 15261 13333 16744 8833 377 -8860 -10876 -13114 -19485 -13912 -12901 -15315 -63 9130
3553 9130 6187 -7436 -4867 -7616 -9580 6114 9641 7165 20995 24949 15042 10718 10183 3064
3539 3064 2310 -2843 -5492 -1988 2578 -3557 -7520 -12292 -5434 -8038 -12860 -5803 -5639 -12814 -2202
3524 -2202 15772 20954 13821 15679 18692 13898 15944 22125 17440 16018 12002 5647 1736 -1808 -7818
3509 -7818 -4366 8096 3828 602 5279 10851 18369 29455 30680 24583 15839 16200 17502 10199 1685
3494 1685 -4914 -516 6424 14726 20078 23458 24884 13831 3004 8539 4506 -1602 5949 5685 7481
3479 7481 10914 9866 9114 5983 10074 9440 13697 16020 7803 558 -4905 -6604 -7734 -6707 -3278
3464 -3278 -9026 -300 12751 14995 6973 5518 2811 -4684 -4358 -3081 -4719 -5885 -6588 -2865 -4679
3449 -4679 -2880 -3368 -4221 -6645 -6070 -2215 -704 788 3373 -259 -8841 -10902 -1992 1522 87 -8015
3433 -8015 -11712 -2743 1523 1157 13385 12287 -1539 -7403 -2011 -8530 -3577 9994 10486 5482 9215
3418 9215 741 -4134 -4453 -3410 -3085 -3715 1419 5624 10320 13475 15459 5441 -8384 -13514 -9131
3403 -9131 -3127 -9501 -6790 181 3513 -1307 732 -5838 -17625 -10584 -3754 -2244 -1419 4214 5936
3388 5936 8725 10429 10190 7925 7951 8314 11219 4831 3111 4005 2725 10004 11164 7457 3773 -603
3372 -603 -5332 -3410 -2307 -5958 -4070 -2575 -6528 -4300 -6266 -12242 -4940 3012 3378 10067 19538
3357 19538 15991 19839 19107 15202 8087 2213 -755 -1167 6422 15052 8741 -4141 -7778 -12052 -14366
3342 -14366 -19350 -12092 -7641 -3969 -5518 -1692 9179 6615 -2690 -6997 -8245 -6859 -2113 -6837
3328 -6837 -5599 -4942 -6310 -13931 -14670 -5899 4825 231 4284 3375 6613 6784 1059 2670 -38 -2573
3312 -2573 -5827 -8498 -4782 -1046 -1886 -2227 -3457 -2513 -9315 -8905 -8739 6400 12522 6540 -427 -9993
3296 -9993 -11682 -9053 4459 5398 -8349 -20410 -12560 2507 3007 1547 -128 210 7465 6608 13330
3281 13330 11760 1179 -9573 -7800 544 3250 -1760 -10101 -5521 -2619 12601 17572 6420 -4299
3267 -4299 -5650 6807 12296 7163 11887 7744 4149 9941 19426 9911 -401 -4152 809 7483
3253 7483 19029 17139 6133 -5250 -4637 -3328 4408 10777 8009 7674 8739 1088 7819 8694 -22
3238 -22 -923 -2512 -10491 -9656 -5096 -6876 -7994 -377 5897 14150 19198 8664 -10475 -14228 -12322
3223 -12322 807 -6417 -6379 -10868 -11577 -7641 -8257 -5003 -4534 -1181 -5360 -5456 -960 8860 16050 11676
3207 11676 6543 3476 -6027 -8851 -8357 -6115 -7782 478 3581 9903 15935 10468 2150 4460 3032
3192 3032 -5349 -11715 -7874 8938 19728 22686 20896 23097 14275 7042 -508 -10025 -3317 7118
3178 7118 8450 513 -8970 -18358 -18783 -16780 -11834 -11759 -5312 2099 3122 -4006 -7049 -9634 -10253 -9335
3162 -9335 -5594 3049 11376 12262 8288 6925 3797 -6747 -5552 -2166 -1009 -10603 -10314 1310 15403
3147 15403 24480 24339 15885 7162 7148 14583 25503 23454 16839 9575 7219 5425 9122 5844 12189
3132 12189 7065 5719 6892 12119 8647 13842 10761 11909 9790 200 4093 10493 13581 11728 12992
3117 12992 5068 8001 21769 25606 27417 22006 13294 6645 4474 -5126 -6670 -14279 -6176 -7619
3103 -7619 -21995 -19794 -13532 -17522 -13416 -1605 -3104 -408 13040 10644 5856 -6758 -13284 -14410
3089 -14410 -15459 -11523 -13995 -4703 1887 -743 -125 -3356 -6357 -4229 1832 7257 6541 8214 7086
3074 7086 7441 -2350 3173 5352 6803 6184 -2177 -7753 7789 16064 13727 4779 -3922 -8558 -6754
3059 -6754 -8214 -7231 -32 1436 6480 2710 -6568 -4390 402 2169 3192 2418 -3245 -8231 -13573
3044 -13573 -14454 -6732 -6410 4679 6013 359 -3265 6213 12137 3420 3313 2308 7424 11738 16556
3029 16556 13764 2155 6955 9488 6322 9000 13424 11751 13905 6572 1720 14256 26539 26762
3015 26762 20636 14433 8399 6437 -11794 -18310 -25126 -23988 -14720 -9878 -1754 9061 10607 856
3001 856 -3617 -2485 1164 8254 7443 5493 -3871 -58 -1263 -6753 -5373 891 4421 2940 -586
2986 -586 -551 -4393 -4156 -5735 -3189 -3088 601 8555 13435 9466 5750 5657 2977 3221 -3806 -69 5912
2969 5912 2696 3871 1492 4429 11492 8788 8857 11889 7614 -4741 -13017 -1395 9095 7450 6644
2954 6644 13912 10382 3723 -5066 -4693 -3726 3776 488 4507 9440 8612 768 2852 2358 -135 -3641
2938 -3641 377 -9058 -10322 -8525 -3451 -9326 -7373 -4155 379 1162 -5413 -8722 -16334 -8109 -2976
2923 -2976 367 12461 10056 9451 8644 -93 -2687 2594 6395 8724 4745 -1550 -7099 -171 16139
2908 16139 20528 11574 10322 4939 -6919 -8238 -3245 -1861 2942 14345 8411 -8033 -3750 -1119
2894 -1119 993 -2762 -1914 -3693 -5381 -6754 -2006 6148 3706 -2391 5380 15531 14488 12824 20157
2879 20157 20386 17371 11063 11533 11468 2383 -2646 -1163 2378 -4215 302 2761 7083 6824 2545 11593
2863 11593 17071 20256 12614 5891 844 1695 -2332 -287 6913 6276 10129 9394 11577 14112 6191
2848 6191 5352 11512 6115 -6974 -5796 -1413 7595 16330 15873 10646 17344 20397 13765 3015 -262
2833 -262 280 -694 1664 6340 2782 -1331 -2922 9053 10253 11978 11981 6392 -13535 -16030 -9019 6347
2817 6347 10801 11314 5397 27 -5965 -11439 383 11486 11141 1355 27 -11407 -11611 -3614 -4510
2802 -4510 -6446 -6548 -1249 496 4023 16741 23142 15584 13616 18069 21896 22629 24207 20668 1491
2787 1491 -166 -887 4425 4700 2096 -14082 -30148 -22842 -9282 -463 -3655 -10382 -6273 -453 -4430
2772 -4430 -5334 -3444 -9117 -5389 4920 4766 -5201 -2669 5208 4424 -1490 3752 6413 19 -7523
2757 -7523 -3331 2454 831 -2692 3942 10577 6701 -10969 -17048 -12016 -14922 -15635 -12313 -12219 -6554
2742 -6554 337 3565 2337 5212 5149 4583 5016 5638 5634 1875 -3009 -6607 1238 -4703 -7449 -9232 -11104
2725 -11104 -7394 -5132 -8639 -5494 6065 11269 18341 11273 2771 1164 -3143 -726 -4455 -15189
2711 -15189 -12566 -6455 -3729 -5749 2453 5474 1641 -1879 3035 -3635 -6953 -8102 27 2497 -7315
2696 -7315 -10926 806 10519 12186 13356 8059 6306 15831 13723 3025 -5786 -4790 -7971 -9399 -4841
2681 -4841 -4995 -4649 617 -1082 72 5360 5134 4387 5174 6537 2841 -2440 -1285 2819 12688 15458
2665 15458 10273 10802 14524 10724 -5296 -5593 -5148 -3912 -4742 -8457 -3675 347 3151 1251 5568
2650 5568 1226 6594 6022 6704 17974 23514 19987 11658 3886 2393 10394 7955 5433 7678 6338
2635 6338 55 -4315 4347 7238 5243 11844 17709 21895 11624 7256 7763 6155 3302 2810 -3523
2620 -3523 -1573 -2086 -1035 11578 20182 24309 21599 -2464 -7507 1971 4376 8544 2714 -7494
2606 -7494 -8509 -5032 -2050 -4639 -6320 -3300 -8432 -4290 -2439 -9244 -16769 -6658 -856 -8000 -6671
2591 -6671 -6238 -5891 -2999 -3642 908 -4701 -15701 -15802 -6265 -8346 -12596 -17723 -19233 -14200 -8518 -8364
2575 -8364 -8285 -5833 -6002 -7606 118 -277 -6294 -13309 -2994 3100 2444 -1947 -9837 -15011 -14417 -10193
2559 -10193 -8532 -9611 -9898 -11895 -13571 -6841 -4757 -5467 -3040 -1227 -19 4481 2965 3198 10834
2544 10834 8622 2764 11841 19181 17889 11134 4584 6317 10980 407 4871 310 -10270 -5327
2530 -5327 5427 3611 7004 4932 6305 13026 7576 3369 -9511 -7853 -277 -3965 -15655 -10930
2516 -10930 2702 10428 1353 -5991 -7760 -15451 -9251 594 -4078 -1964 3454 2655 -1458 503 -4316
2501 -4316 -4166 -2458 3466 1096 3783 1928 -1963 -10754 -2728 11881 9606 10221 2674 2052 3978
2486 3978 -1123 -10459 -10303 -622 5684 2861 1685 4933 3388 16548 12455 -2161 -4351 -5043 -6286
2471 -6286 -3463 -973 -11927 -18378 -16918 -6283 2031 8642 6339 -1847 -1971 -660 -11792 -11086 -15210
2456 -15210 -15851 -10009 -10420 -20309 -13867 -12186 -11545 -11803 -12516 -5398 873 6278 10282 7863 1854 1214
2440 1214 1108 4888 13195 20433 15662 2405 3186 1102 3994 10844 4361 -3010 -11950 -14500 -10928
2425 -10928 -7263 -9723 -12460 -3283 -4053 -8904 -5972 -9088 -5913 -4068 -5601 -14215 -6209 4176 4513
2410 4513 5744 13681 13546 -1474 -3779 4862 13861 22757 15890 2172 5990 725 6808 17696
2396 17696 24458 32990 31283 17385 13441 5679 -1062 2806 566 -4906 -6234 -1567 -4972 -11510
2382 -11510 -5579 4091 -4597 -10465 -5048 1268 7499 840 -4341 15844 24724 27356 21855 17588
2368 17588 15857 10785 9654 3944 2984 11215 6329 -818 -8595 -12875 -10930 -7830 -1000 3670 -2011
2353 -2011 -2534 -4530 -8151 -12136 -11212 -1262 5290 6764 5473 4800 -5225 598 5228 13540 18886
2338 18886 15084 3067 -1128 6588 5575 7094 3995 -1009 6864 4048 1435 4544 -1080 -1627 1874
2323 1874 18183 24771 13160 6695 4299 5551 -2066 -15131 -12246 -13312 -3415 3903 9774 6453
2309 6453 -1069 -3535 -1947 -7337 -8061 -5844 -8575 -2983 1739 -4966 -19843 -19397 -11740 -6382 -6199
2294 -6199 -6780 1157 8591 1599 272 -7326 -2047 -5676 -2314 3140 1097 5297 11659 7105 -11221
2279 -11221 -15187 -5018 2678 430 -1952 -5452 -2391 -5560 -7228 1343 5890 12542 20644 23170
2265 23170 19093 14258 21231 19579 15188 8084 2318 -6581 5102 5255 -6155 -7104 -6171 -10584 -15386
2250 -15386 -14538 -8673 -14305 -13848 -4532 5 -4096 1889 159 -1807 2915 8123 6118 -4215 7009
2235 7009 9959 3090 -2369 -1246 4835 10199 12055 10381 -68 -5278 -1668 4651 6597 -10922
2221 -10922 -11241 -11866 -16006 -11857 -10003 -12929 -13024 -8373 -10615 -9888 -4210 -5217 -15861 -15619 -3861 11202
2205 11202 14821 6447 -4989 -6305 -17745 -16938 -11390 -9569 -9756 -16640 -17890 -12042 -7197 -4731 -4894
2190 -4894 -2816 2730 1365 -3306 -6067 -10670 -3856 -6145 -8516 -4800 -2826 -2767 3653 483 -10005
2175 -10005 -10109 2677 -2752 -9986 -13206 -11440 -2629 8082 8233 5675 8061 9490 2533 -8864
2161 -8864 -9632 -2443 -4698 -1401 2842 6685 5388 730 204 5446 5881 -406 -7372 -1308 15493
2146 15493 19937 11906 12138 7566 13030 19208 18231 15709 18803 20840 24004 6787 1364 -6910 -11273
2131 -11273 -12106 -16023 -5073 6210 10863 1121 -10998 -20818 -12710 967 -2786 -14724 -27362
2118 -27362 -13735 -6932 -9877 -14351 -14136 -16821 -20067 -22349 -22498 -26105 -16206 -13968 -2649 -2885 -10194
2103 -10194 -12079 -13234 -11633 -3413 2926 -700 1551 -186 5051 -6214 -10705 -4156 4991 10205
2089 10205 2269 -3757 -2092 -8490 -14975 -12869 -7744 -3091 -1227 -2377 -8316 -159 4765 5727 -8680
2074 -8680 -22170 -19435 -18645 -5942 6076 -1475 -6108 -1498 -6893 -3240 -125 -1836 -7740 590
2060 590 9654 12173 16980 7443 3305 6258 2926 1345 -4279 -8256 -7850 -4198 -10675 -14371 -8345
2045 -8345 -6580 955 -6720 -16037 -20508 -10171 -3141 -6920 -8121 4362 18511 15189 10979 -11595
2031 -11595 -15619 -12473 -7066 11598 10376 -1116 -10033 -18512 -7376 -642 -4186 -4139 2088 -5261
2017 -5261 -1949 2827 2744 5569 -1022 -4135 5337 3381 6735 -4101 -11474 -11833 -11946 -10743 -5222 -5527
2001 -5527 -3384 1381 2825 7517 14624 14275 24783 33929 22464 7961 6531 11290 5885 573
1987 573 7574 6382 6663 12873 18015 8286 14909 18075 20066 6239 -149 5494 8893 -1326 -1486
1972 -1486 -5945 -12835 -4846 -516 1196 -1874 -8436 -17048 -8485 -9276 -9208 -10273 -4606 7124 9291
1957 9291 11608 13804 11099 9377 7071 5665 2772 -1966 525 6130 439 -832 -4986 -16194 -10428
1942 -10428 -6867 -9298 -15394 -10014 -1835 4958 5214 1482 -2391 -4799 -14529 -11441 -8443 -1417 822
1927 822 -2303 3777 -826 -10548 -12808 -9960 -7992 -1451 4478 4858 -1791 -6284 782 -883 -9234
1912 -9234 1861 9571 425 -1765 3208 -1111 -650 -2607 1867 3980 796 1613 -7058 -5980 -3189
1897 -3189 -14611 -15840 -13379 -3494 -1331 -8773 -13655 -11456 -6321 -3263 -5222 -7389 -8274 -2817 10856
1882 10856 10492 8745 2799 -5149 -2338 4110 11475 21042 26070 18981 11494 -272 2769 -8903
1868 -8903 -8543 -2435 3205 16980 21186 16325 9754 3172 2325 9426 15938 15335 12858 11648 -630
1853 -630 -9181 -15771 -21886 -16721 -8956 -11229 -4264 9459 8794 12837 18120 23661 16186 13404 3641
1838 3641 -519 2563 8233 6334 -2774 -4463 -5681 -10254 -3398 7453 15096 15646 18449 13818 11218
1823 11218 1760 -4156 -6383 -8658 -1656 1574 -2045 -251 69 1724 -4522 -1829 3613 1266 -3061
1808 -3061 -2771 -3618 -2595 3386 430 4940 7717 -655 2808 4373 -1254 4155 10169 9291 -1272
1793 -1272 -11562 -13530 -384 9458 7579 -2958 -10458 -408 13604 9151 2990 448 243 -1223
1779 -1223 5236 4684 9729 6806 9605 11974 1318 -3445 -6358 -10829 -6393 -5224 -1804 422 9103
1764 9103 14120 16810 17052 20250 16909 10698 10898 7842 1846 -1105 3858 4948 9981 9311 10955 6672
1748 6672 14735 2723 -1789 -5455 -11393 -8089 -5935 -7760 -14341 -5875 2168 -10698 -8892 -3304
1734 -3304 -287 5358 -1613 -4009 -4117 -1034 -5867 -7100 -5280 2384 -10341 -12838 -4280 8662 11633
1719 11633 13128 19329 14740 3630 5114 17767 14736 1798 -1321 -9205 -1360 2294 1786 5475
1705 5475 6576 9541 18729 10800 -750 -6775 -2654 -4644 -7507 -10553 -11656 -16195 -18601 -12558 -9091
1690 -9091 -8582 -7413 -3530 -9635 -10036 -7477 1852 4009 3161 -881 -4761 -8391 -11613 -2997 -4408 -16977
1674 -16977 -6569 1501 -87 -5471 -7764 -4729 48 -12416 -27576 -30816 -24399 -23070 -22111 -19018
1660 -19018 -18540 -23923 -23017 -27227 -20304 -7576 4168 -1046 -7681 -2934 12426 7082 7346 7563 13598
1645 13598 20349 15418 7447 4359 3237 -4943 -4261 28 4219 1749 -1538 -1417 -1700 -4433 -332
1630 -332 162 -4873 -2574 1176 -2197 -2620 -2206 -5406 1764 8441 5381 10669 10425 7779 10756 5254
1614 5254 -3306 -347 1533 1407 -4627 -7951 -9073 -14421 -8276 1221 2979 4150 6917 1879 -1150
1599 -1150 -9234 -8641 -6712 -5808 -7148 -6251 -8088 -9638 -8719 -4401 -1750 -8407 -5419 1480 2306 3719
1583 3719 -1662 -1863 -1103 2629 -10110 -3600 1576 7865 3453 -1457 1652 -6599 -14406 -7650 1636
1568 1636 1460 6216 7955 12168 14833 16362 19628 13136 12778 9667 2954 -2877 -504 -7202 -6109
1553 -6109 313 10150 10311 4666 6931 -3130 -2452 -10038 -3438 181 -10536 -6939 -2860 -2028 5411
1538 5411 8316 4165 1666 4797 5066 4223 -4360 -9026 -777 1666 -175 -7524 -6137 -8775 -13688
1523 -13688 -13221 -14298 -18235 -10537 -16437 -21070 -14828 -894 1972 4311 981 1285 -1554 2707 4480
1508 4480 8 -8158 -15834 -13978 -6807 -886 8816 13175 16523 5831 -6757 -2460 1955 10346
1494 10346 17090 20205 22081 15237 11787 7092 -5409 -8158 -5918 -2124 10016 10853 9409 -1011
1480 -1011 -10565 -10407 -6353 -6441 -9215 -345 10491 7585 3420 893 -3186 -3809 1418 9738 12995 3716
1464 3716 -2745 -1400 1966 4124 -2034 -3103 -5182 -9769 -12303 -7753 -1329 627 4071 11026 14087
1449 14087 9862 -7 -7323 -1540 6844 6211 3814 2037 -5419 -691 2316 -183 4345 6504 4723
1434 4723 3482 5983 7109 6913 3990 12573 16827 5221 7687 9887 8760 12747 7859 4057 2351
1419 2351 10519 10397 2497 6098 -1589 892 2776 -2880 3428 4296 10931 5442 -4686 -8184 -5558
1404 -5558 -10775 -4550 5514 9297 -1352 -4384 6299 13292 9731 2711 -9730 -18570 -13670 -14715
1390 -14715 -14372 -7841 -4204 -4363 -8224 -11763 -15275 -21895 -15900 -12275 -6897 -5609 -18506 -25049 -15985
1375 -15985 -4676 -8661 -16326 -19137 -21983 -16672 -11684 -2800 3831 -3288 -11772 -617 -4840 -10436
1361 -10436 -16733 -11375 -2097 7872 18860 11668 8395 -6246 -9529 -1949 2091 5681 8671 6463
1347 6463 -582 6767 11489 -505 -5254 1441 -6915 -18771 -10937 -6349 1506 6071 2928 -3273
1333 -3273 -11790 -7443 -11674 -12304 -8186 3408 3845 -2735 3132 11185 21310 14343 7299 -2807 -19715
1318 -19715 -22067 -19778 -11155 -1521 2445 2788 -4358 -10481 -9953 -6139 -5855 -7801 -7565 -5104 9214
1303 9214 10424 20277 26508 16823 11660 9579 568 -485 1295 4926 14706 6314 -4842 -4817 2465
1288 2465 15783 10885 932 -2801 -4934 -4584 2416 6789 1739 1678 16246 19203 20993 18431 16958
1273 16958 12214 19416 19597 12452 12973 4703 -504 -5750 -7824 -3318 2635 2850 -1390 -7037 -5177
1258 -5177 -2335 -4652 -2444 -621 -4057 -5647 -3865 3877 12666 8137 4611 5231 -1407 617 1120
1243 1120 -576 -4687 -1815 -9532 -11626 -16166 -10273 -6512 -16406 -10581 1308 2445 -4295 -4977 -2383
1228 -2383 -3810 -5060 -5822 -11504 -8860 -9522 -9615 -1047 4490 -749 -35 -7519 -10720 -8987 316 7813
1212 7813 8148 5761 -1136 1066 5446 13394 14566 5962 5218 5986 2457 -2609 -5098 -3203 -4075 -1063
1196 -1063 -7303 -15137 -11349 -970 -1800 -8950 -10377 -15334 -20931 -17717 -10682 -4709 3823 6353 8547
1181 8547 4198 -11225 -24702 -18212 -15967 -18869 -9612 -6401 17 -1817 -7855 -17276 -14847 -11924
1167 -11924 -18559 -23541 -25010 -15472 -1892 -3678 -5787 -8792 -15433 -20128 -8065 -11217 -19499 -13650
1153 -13650 -4091 -1850 -11240 -11889 -16624 -13506 -14027 -9811 -7122 -5162 -4566 -13810 -22527 -26577 -20997
1138 -20997 -14279 -11678 -10845 -18599 -9654 2707 8838 10615 17890 18854 5186 994 1283 -2465 -9176
1123 -9176 -13867 -11654 -836 3615 2636 1168 -4325 -6527 -7333 -9283 -14256 -13002 -8019 -13346 -13210
1108 -13210 -8143 -12204 -14227 -6792 -6946 -13191 -11648 -7697 -5843 2651 10379 -1521 765 11170
1094 11170 4473 -7257 486 4492 3535 8937 16514 3133 -3807 -9736 -12020 -4092 -1570 -9441
1080 -9441 -14176 -9171 -582 2910 -2534 -10167 -5724 -3425 3057 14088 12533 -776 -15078 -15993
1066 -15993 -8211 -13865 -19394 -15554 -14619 -13888 -7790 -2129 -570 -513 2094 -4689 -9680 -12904 -13934 -7726
1050 -7726 -13156 -13573 -11154 -9972 -16653 -13903 605 10061 11914 11457 5847 2322 1087 -1433 -10667
1035 -10667 -15858 -25121 -20149 -3814 6015 3053 -6515 -10893 -5843 -7536 -20819 -17729 -11529 -9289
1021 -9289 -11385 -14850 -17248 -11608 -8715 -3678 -3707 298 2423 1651 -2304 6172 5301 -4606 -3958 -8798
1005 -8798 728 2872 -3870 -11406 -6378 -8064 -8355 -5216 -10246 -7752 -2627 -6948 -3394 -8067 -19243
990 -19243 -12687 -8473 -14247 -18467 -11102 3492 9634 6219 2670 -1650 -4813 -1159 5162 1397 -5200
975 -5200 -12529 -5443 856 5549 8434 17023 13345 540 -11499 -11572 -10995 -15116 -11950 -8545 -9171 -11293
959 -11293 -8259 -12402 -14005 -12150 1711 4453 11603 4650 1589 3927 782 -2534 1937 5504 -630
944 -630 -5239 -4641 -4606 -3310 -12839 -8318 84 -7964 -3130 4913 10259 6856 1566 3570 -1544 -6545
928 -6545 -8347 -11651 -13573 -13359 -5877 4935 7622 2345 -275 -4168 -2722 4762 2047 -8005 -6234
913 -6234 -4645 -4926 -3378 -541 8925 2266 -2912 -407 6921 6389 3563 2200 479 9052 9247 599
897 599 -8494 -6435 -1847 -4159 -7796 -8667 -2356 -5353 -6310 -2795 3942 3777 3050 -5461 -7839 -13102
881 -13102 -10739 -12919 -18144 -12441 4524 5049 401 -6964 -8917 -1438 3119 -6001 -19001 -20126 -9096
866 -9096 -9723 -13693 -17003 -20995 -15752 -24165 -26343 -22372 -16502 -15322 -5493 -4886 -11627 -24082 -17696
851 -17696 -15696 -6749 -4341 -5485 -13543 -11661 -6638 1199 -4137 -20395 -18771 -4437 1430 -5709
837 -5709 -12243 -12357 -5477 -10434 -17021 -14850 -7714 -8519 -11226 -8350 -1030 2658 8823 -960 -1117 -2422
821 -2422 2104 4614 14620 13732 775 3856 9566 880 2162 5474 10048 11516 10171 12815 12830
806 12830 11681 12037 -7152 -15059 -18611 -15390 -13564 -8752 -9398 -2226 -4165 -7140 4589 2642 -2449
791 -2449 4446 8437 7186 9634 8199 -287 2908 11705 5607 -1086 -4806 -11921 -13478 -3448 -3575
776 -3575 1410 -2580 -3104 -4128 -9658 -4255 -2945 624 -5399 6130 22596 25410 24593 10174 -410
761 -410 -4242 -3429 5491 9264 370 -6409 -6975 -17341 -18001 -16586 -13467 -10122 1690 1740 -743 -3642
745 -3642 -5643 -1227 5568 13303 11192 10087 11098 6936 9021 10228 3664 -209 1828 10089 9670
730 9670 8178 7254 1450 2518 -5134 -11585 -12061 -8108 -4507 4237 14670 15388 19198 19497 12248 4818
714 4818 2787 -5116 -1498 272 3377 1076 3934 -472 -7338 -11633 -10256 -10551 -15782 3393 9265
699 9265 7006 440 -8611 -9009 -1319 2752 -2963 -10267 -1493 -6289 -6583 1446 14111 11191 2435
684 2435 -2919 -11782 -13403 -5181 5441 10149 5877 4027 3355 6797 15770 13462 7897 2472 -5510
669 -5510 3431 1877 -1946 -4415 -1809 -3666 -3834 5293 -3035 523 -358 -3347 4789 7656 3776 818
653 818 288 4094 -196 -17260 -11808 -4778 -7011 -5425 930 -1819 -11104 -8755 -8234 -2734 -2918 -10555
637 -10555 -6533 -4874 2966 6683 -2034 -7817 -618 8962 11861 10749 4418 -1110 4843 929 3901
622 3901 13844 16082 12938 2690 -9073 -10786 -4895 -2896 -3750 2875 6715 3848 3576 -2172 -389
607 -389 1317 4198 5390 8163 2993 -5 4731 9850 5598 4937 10686 10621 13465 5508 3163 -522
591 -522 -3529 4657 300 -10451 -12387 -10538 -4741 1245 -3444 -9997 -11099 -2133 7780 1189 3099
576 3099 9024 13346 6958 717 -8328 -22117 -11560 -1813 1085 -934 -1823 -2803 -2688 -8903 -3212
561 -3212 5002 242 -7119 -913 138 682 7051 13333 6678 -1609 -5003 -7757 -10202 -7847 2562
546 2562 10253 2638 1225 -1505 -14968 -14875 -14487 -8634 -1360 3125 -1631 -2926 -7378 -15068 -4699
531 -4699 635 -3610 -765 4654 1045 -2875 -683 22 -2618 -1013 -7601 -10644 -8620 -8123 4468
516 4468 2336 4979 7245 10033 5634 4468 4002 8019 17299 21273 15744 17245 18562 7519 3476
501 3476 -5190 2295 6446 324 -6692 3020 16008 15099 10664 5311 1709 5232 -2935 6123 3994
486 3994 -5147 -7376 -12565 -10045 -17139 -11727 -1840 4436 7886 2307 1794 -8730 -10504 11829 17902
471 17902 10570 -4639 -16145 -6529 -513 2309 -1639 -2249 5878 -847 -1443 -560 2934 7277 8313
456 8313 3312 -3561 -2518 -10210 -16688 -10923 952 2374 -456 -5693 -7520 -14625 -8927 -3754 -1648
441 -1648 480 -4337 -6029 -10449 -6741 3870 6117 3829 157 -7977 -14606 -11332 -12782 -10756 -1071
426 -1071 4114 9451 14217 9119 3304 7124 7430 -536 2147 -5747 -12065 -5650 -3900 -2860 -5715
411 -5715 -12341 -10322 -9531 -14769 -13453 -8415 -7650 -901 -2287 -11962 -17009 -21601 -21483 -13523 -3808 -1473
395 -1473 -4543 2495 -925 -4567 -4131 -1763 5745 6766 -2466 -1488 -9307 -12601 1415 3234 -9025
380 -9025 -5564 -4656 -12339 -17283 -20920 -25101 -20376 -7311 3472 4032 366 -3026 -4120 -6128 -6453
365 -6453 -6011 -6615 2911 -722 -5121 -582 986 8589 11494 9141 -1419 -7812 -15195 -20513 -24877
350 -24877 -20689 -10003 -8394 -16553 -16672 -10823 -13910 -15049 -8799 -5365 -8494 -4295 2116 4250 9349
335 9349 9357 14687 16373 18301 17791 4028 -334 -1442 -373 -2651 -3205 -1718 1285 4503 2372 -2785
319 -2785 -5373 -7254 -9896 -9583 -6352 -1192 5443 6750 2269 9779 11351 6212 4721 -1969 -6671
304 -6671 -1043 2992 2563 2334 796 -9980 -24192 -21246 -10732 -3863 -6269 -6973 -1795 7705 10754
289 10754 7627 3687 2449 -206 3607 7463 2660 521 -5232 -4713 4230 4071 5577 4687 3265 10972
273 10972 12754 6189 7061 10032 12984 11261 8601 873 -7584 -9717 -1285 781 -6792 -6964 -2029
258 -2029 1201 7215 4156 -564 972 -2956 2851 4651 -9498 -9915 280 3129 1467 -3537 -13305
243 -13305 -18293 -12326 -12407 -18025 -14556 -4181 6929 8029 -4149 -12232 -18382 -20704 -11020 -9567 -9859
228 -9859 -5493 -8260 -13058 -9533 -5985 -7469 -12923 -11614 -5831 3938 2685 4527 2168 -5443 -8983
213 -8983 -8096 -1585 415 8276 6304 9727 11321 3924 777 2749 4638 1354 2846 9212 10918
198 10918 6211 2669 -1021 622 1170 -332 -3875 -9524 -12346 -15120 -16436 -8329 -5910 -6348 -12594
183 -12594 -19473 -21885 -18553 -9558 -987 2038 5101 -85 -2986 -1086 540 3443 2565 -3600 -2339
168 -2339 -4430 -5701 -5544 -9729 -9661 -7408 -9545 -12433 -11733 -2516 1939 -35 -8516 -12834 -11495 -4215
152 -4215 135 -1037 -6262 -7312 -1528 6235 -141 -7597 -5942 -6616 -13863 -10764 -4671 -11014 -5652
137 -5652 -1014 -6443 -8877 -14790 -14987 -14127 -9616 -3134 -7278 -11339 -11685 -12484 -12744 -10208 -4417 -3558 -11788
120 -11788 -13908 -7486 -8145 -8088 -3883 -5277 -4967 -349 6599 1859 2915 -662 -3901 1530 2605 -2877
104 -2877 -1316 -3422 -5568 -5296 1077 4676 8930 91 -8887 -6114 -4485 -4929 -4142 -4694 -6925 -12669
88 -12669 -10116 -5145 -8168 -8843 -3649 -6257 -10201 -8277 -6156 -8441 -4141 -4281 78 2087 3919 -826
72 -826 -6058 -6980 -5243 -1864 1163 -3082 -10742 -6714 -8372 -8624 -11267 -13788 -9865 -10606 -8008 -6428
56 -6428 -10542 -11970 -5510 -3647 -1160 1890 3497 -790 -955 -436 1268 7744 13954 16205 10948 -66
40 -66 -2684 -618 397 -2264 -4629 -7443 -6929 -9491 -6990 -8679 -8503 -8544 -10959 -13198 -14787 -11708 -10365
23 -10365 -1949 2468 -4376 -8434 -10250 -3624 672 -2582 -5341 -2526 2232 1436 -2535 -9259 -6348
8 -6348 -6670 -5875 -4800 -7971 -10184 -13384 -11865 -4966
0 -4966
$$ Imaginary data points
##PAGE= N=2
##DATA TABLE= (X++(I..I)), XYDATA
32767 -289730 -291254 -293151 -292360 -288131 -285839 -281176 -278944 -273599 -276758 -277101 -273901 -271640 -266619 -263472 -257094
32752 -257094 -251177 -250802 -253693 -246122 -237743 -234108 -238434 -235467 -229633 -232825 -229954 -227089 -227350 -225958 -220668
32737 -220668 -217525 -216288 -219034 -214523 -211236 -206004 -203744 -203739 -200368 -190412 -199121 -201949 -201237 -194880 -186122
32722 -186122 -181456 -179928 -179300 -175515 -171498 -171760 -168869 -161097 -159901 -158878 -161033 -165765 -164193 -159965 -152173
32707 -152173 -150020 -152874 -152872 -146213 -139506 -137804 -132737 -134808 -130678 -122814 -115787 -112354 -116677 -117330 -119644
32692 -119644 -120941 -116559 -112032 -106463 -103665 -105366 -103716 -104894 -101128 -93073 -86482 -83999 -87789 -89164
32678 -89164 -84585 -74906 -75850 -72411 -66518 -60741 -60660 -64669 -63293 -65650 -61434 -52852 -49354 -51355 -50383
32663 -50383 -43839 -48343 -45330 -39323 -42481 -44504 -41986 -42227 -35200 -33397 -36647 -30091 -28201 -22501 -18389
32648 -18389 -17781 -11117 -7013 -5644 -4245 -4944 -7717 -4774 -1571 -1633 478 -2095 48 2682 4713
32633 4713 10278 12038 12645 18269 18736 14232 20974 25531 29489 32504 31196 26040 31860 32840 38300
32618 38300 36065 40635 44483 46675 45685 46820 49953 53570 60862 61704 65954 65586 63305 58139 57206
32603 57206 54907 53307 60095 65611 69364 77465 86573 95964 94063 94632 95397 96876 95516 97225 94971
32588 94971 99651 105685 110645 111912 109831 112445 114837 117828 118307 120296 120372 121379 118178 115397 119725
32573 119725 126384 126828 125217 119887 124618 137225 140820 144004 146692 143814 145449 150314 154128 150658
32559 150658 157087 154069 165820 164704 164107 161236 155472 155112 159144 166327 175392 172379 168564 161700
32545 161700 170290 174926 172154 177795 185311 192296 192059 187466 183421 183984 189501 186796 184210 184948 186491
32530 186491 181007 189116 204712 211784 218617 214478 205645 206158 204416 203795 212864 212967 207672 206485 210553
32515 210553 216592 218873 218467 230157 227601 226302 230665 227039 225783 230749 230449 231018 233063 224969 219392
32500 219392 220851 229548 241623 246315 242371 243188 254886 252550 240026 235562 241426 251651 254176
32487 254176 261416 262773 258017 259180 263426 263884 270726 276566 277333 265839 268867 274070 274212 277481 274621
32472 274621 273326 281753 287675 290620 278769 273343 284575 287685 279605 283598 293472 291579 295195 293956
32458 293956 295906 295398 291727 300683 302127 303254 308513 305786 295542 296268 301174 300304 299305 297760 312195
32443 312195 317786 318277 320657 312395 308214 308770 312094 315995 316555 317013 319112 323152 325093 318584 315811
32428 315811 322010 317580 315764 316408 323568 336003 347803 342037 334891 334724 336670 340985 351200 354942
32414 354942 354323 350328 345594 337111 336498 336924 333220 338982 346702 342501 338398 342885 352614 352743 347523
32399 347523 349702 350286 350742 352796 354715 357965 358704 364249 362124 365894 368560 375085 369517 365333 366481
32384 366481 364225 362851 365225 362262 357760 358157 363226 363781 361706 368932 368816 374942 371507 367111 367512
32369 367512 362895 366379 367695 370722 369995 377361 384269 376304 373172 368302 376394 387451 384060 386264
32355 386264 389383 389700 386422 384167 386250 395410 400149 399246 392455 392534 396182 394160 399963 398154 388029
32340 388029 377499 386510 391238 389218 382866 379542 379597 383874 393224 392924 395690 398090 398524 398558 402076
32325 402076 392954 380266 380212 390344 399607 403474 409968 411371 407711 408351 407202 400429 398681 400898
32311 400898 404855 398237 391950 394350 398766 406856 414107 408156 402848 408738 412286 412029 414636 414938 422937
32296 422937 422116 416364 416855 420529 424654 423938 413164 406866 417720 423125 427425 425413 420291 419227
32282 419227 415667 419658 424608 423109 424370 425822 425493 429080 420766 423541 428940 436622 435087 428699
32268 428699 429093 435579 438929 427455 416047 415006 424556 422520 422138 432693 440208 438926 436410 427616
32254 427616 423721 428952 440181 446869 445851 444721 440367 437188 436267 438679 439039 444111 439767 438040
32240 438040 429644 429361 434134 425958 420056 420468 423346 436032 437173 439553 450370 461847 467165 462074
32226 462074 458129 453889 443243 441832 445507 448011 445993 449025 449226 451144 456127 463479 457105 450625
32212 450625 455409 453683 448259 440834 427803 428861 438428 442087 450060 448580 436519 434819 434377 434545
32198 434545 428793 426482 433926 435709 446479 453588 454110 446983 441029 436205 433724 437666 443386 440223
32184 440223 445687 447481 448944 459622 466286 462936 462567 466564 462934 464755 460022 452890 447313 448422
32170 448422 449212 456409 459883 457718 460511 462901 463499 450504 452364 463060 462074 455218 452685 460343
32156 460343 455952 451955 458809 456159 456158 460171 459764 453400 451691 462648 468504 465337 448622 435159
32142 435159 446719 460171 461590 463805 464075 451578 447172 453997 451847 453238 451465 452184 455796 465899
32128 465899 465961 447641 442572 449034 452547 459157 454677 455404 453387 448382 453755 458458 454881 461984 460282
32113 460282 451892 443224 446929 456382 451683 445859 453401 459855 456814 461275 465861 463736 456126 451549
32099 451549 442939 445435 451114 445850 441722 451423 458627 452068 447502 447692 446180 443001 443089 445646 460717
$$ [...]
##END NTUPLES=NMR SPECTRUM
##END=
