##TITLE=Analysis number 308387
Compound Code mo 01252
Project Code adrs
Chemist Name matrix
##JCAMPDX= 6.0         $$ Bruker NMR JCAMP-DX V2.0
##DATA TYPE= NMR SPECTRUM
##DATA CLASS= NTUPLES
##ORIGIN= Bruker BioSpin GmbH
##OWNER= NMR
$$ XWIN-NMR		Version 3.5
$$ Tue May 24 12:57:39 2005 GMT Daylight Time (UT+1h)  MAYBRIDGE\NMR@NMR_250MHZ
##.OBSERVE FREQUENCY= 250.131544655141
##.OBSERVE NUCLEUS= ^1H
##.ACQUISITION MODE= SIMULTANEOUS (DQD)
##.ACQUISITION SCHEME= undefined
##.AVERAGES= 16
##.DIGITISER RES= 18
##SPECTROMETER/DATA SYSTEM= dpx250
##.PULSE SEQUENCE= zg30
##.SOLVENT NAME= DMSO
##.SHIFT REFERENCE= (INTERNAL, DMSO, 0, 16.522)
##AUDIT TRAIL= $$ (NUMBER, WHEN, WHO, WHERE, WHAT)
$$ ##TITLE= Audit trail, XWIN-NMR		Version 3.5
$$ ##JCAMPDX= 5.01
$$ ##ORIGIN= Bruker BioSpin GmbH
$$ ##OWNER= NMR
$$ C:\u/data/dgb/nmr/ADRS/3440/pdata/1/auditp.txt
$$ ##AUDIT TRAIL=  $$ (NUMBER, WHEN, WHO, WHERE, WHAT)
(   1,<2005-05-24 12:57:21.04 +100>,<MAYBRIDGE\NMR>,<NMR_250MHZ>,
      <created by zg, POWCHK disabled, PULCHK disabled
       configuration hash MD5:
       62 19 C7 07 E1 42 D1 B7 37 6C 3D D0 77 39 F9 E6
       data hash MD5: 64K
       DD 72 42 F7 F5 E3 51 F7 24 7E AC 65 29 E6 DA 33>)
(   2,<2005-05-24 12:57:31.92 +100>,<MAYBRIDGE\NMR>,<NMR_250MHZ>,
      <Start of raw data processing
       ef LB = 0.3 FT_mod = 6 PKNL = 1 SI = 32K 
       data hash MD5: 32K
       91 2F 09 3E DB D8 02 02 C8 AB 10 1E 16 1B 79 AA>)
(   3,<2005-05-24 12:57:34.07 +100>,<MAYBRIDGE\NMR>,<NMR_250MHZ>,
      <apk 
       data hash MD5: 32K
       DE AD C2 D0 25 C9 41 E5 0E 63 95 C5 37 FA A9 F1>)
(   4,<2005-05-24 12:57:34.81 +100>,<MAYBRIDGE\NMR>,<NMR_250MHZ>,
      <abs ABSG = 5 
       data hash MD5: 32K
       6D 9F D3 05 39 4C A8 D4 86 33 7C E3 C1 12 4B 50>)
$$ ##END=
$$ 
$$ hash MD5
$$ EA 01 32 70 30 9C 8C 9E B0 1E EF 3F D0 BB 2B 05
##$RELAX= 
##$RELAX= 
##$RELAX= 
##$RELAX= 
##$RELAX= 
##$RELAX= 
##$RELAX= 
$$ Bruker specific parameters
$$ --------------------------
##$DU= <C:\u>
##$EXPNO= 3440
##$NAME= <ADRS>
##$PROCNO= 1
##$TYPE= <nmr>
##$USER= <dgb>
##$AMP= (0..31)
100 100 100 100 100 100 100 100 100 100 100 100 100 100 100 100 100 100 
100 100 100 100 100 100 100 100 100 100 100 100 100 100 
##$AQSEQ= 0
##$AQ_mod= 3
##$AUNM= <au_zg>
##$AUTOPOS= <29 >
##$BF1= 250.13
##$BF2= 250.13
##$BF3= 250.13
##$BF4= 250.13
##$BF5= 500.13
##$BF6= 500.13
##$BF7= 500.13
##$BF8= 500.13
##$BYTORDA= 1
##$CFDGTYP= 0
##$CFRGTYP= 5
##$CHEMSTR= <none>
##$CNST= (0..31)
1 1 145 1 1 1 1 1 1 1 1 1 1 1 1 1 1 1 1 1 1 1 1 1 1 1 1 1 1 1 1 1 
##$CPDPRG= <>
##$CPDPRG1= <>
##$CPDPRG2= <>
##$CPDPRG3= <>
##$CPDPRG4= <mlev>
##$CPDPRG5= <mlev>
##$CPDPRG6= <mlev>
##$CPDPRG7= <mlev>
##$CPDPRG8= <mlev>
##$CPDPRGB= <>
##$CPDPRGT= <>
##$D= (0..31)
0 1 0 0 0 0 0 0 0 0.06 0 0 0 0 0 0 0.0002 0 0 0 0 0 0 0 0 0 0 0 0 0 0 
0 
##$DATE= 1116935840
##$DBL= (0..7)
120 120 120 120 120 120 120 120 
##$DBP= (0..7)
150 150 150 150 150 150 150 150 
##$DBP07= 0
##$DBPNAM0= <>
##$DBPNAM1= <>
##$DBPNAM2= <>
##$DBPNAM3= <>
$$ [...]
##$SUBNAM7= <"">
##$SUBNAM8= <"">
##$SUBNAM9= <"">
##$SW= 20.6930455092707
##$SWIBOX= (0..15)
0 0 3 0 0 0 0 0 0 0 0 0 0 0 0 0 
##$SW_h= 5175.983436853
##$TD= 65536
##$TD0= 1
##$TE= 295.16
##$TE2= 300
##$TE3= 300
##$TEG= 300
##$TL= (0..7)
0 120 120 120 120 120 120 120 
##$TP= (0..7)
150 150 150 150 150 150 150 150 
##$TP07= 0
##$TPNAME0= <>
##$TPNAME1= <>
##$TPNAME2= <>
##$TPNAME3= <>
##$TPNAME4= <>
##$TPNAME5= <>
##$TPNAME6= <>
##$TPNAME7= <>
##$TPOAL= (0..7)
0.5 0.5 0.5 0.5 0.5 0.5 0.5 0.5 
##$TPOFFS= (0..7)
0 0 0 0 0 0 0 0 
##$TUNHIN= 0
##$TUNHOUT= 0
##$TUNXOUT= 0
##$USERA1= <user>
##$USERA2= <user>
##$USERA3= <user>
##$USERA4= <user>
##$USERA5= <user>
##$V9= 5
##$VALIST= <valist>
##$VCLIST= <CCCCCCCCCCCCCCC>
##$VD= 0
##$VDLIST= <DDDDDDDDDDDDDDD>
##$VPLIST= <PPPPPPPPPPPPPPP>
##$VTLIST= <TTTTTTTTTTTTTTT>
##$WBST= 1024
##$WBSW= 4
##$XGAIN= (0..3)
0 0 0 0 
##$XL= 0
##$YL= 0
##$YMAX_a= 344718
##$YMIN_a= -401251
##$ZGOPTNS= <>
##$ZL1= 120
##$ZL2= 120
##$ZL3= 120
##$ZL4= 120
##$ABSF1= 16.522
##$ABSF2= -4.171173
##$ABSG= 5
##$ABSL= 3
##$ALPHA= 0
##$AQORDER= 0
##$ASSFAC= 0
##$ASSFACI= 0
##$ASSFACX= 0
##$ASSWID= 0
##$AUNMP= <proc_1d>
##$AZFE= 0.1
##$AZFW= 0.1
##$BCFW= 0
##$BC_mod= 0
##$BYTORDP= 0
##$COROFFS= 0
##$CY= 12.5
##$DATMOD= 1
##$DC= 0
##$DFILT= <>
##$DTYPP= 0
##$F1P= 14.0000005364418
##$F2P= -0.99999901652339
##$FCOR= 0.5
##$FTSIZE= 32768
##$FT_mod= 6
##$GAMMA= 0
##$GB= 0
##$INTBC= 1
##$INTSCL= 1
##$ISEN= 128
##$LB= 0.3
##$LEV0= 0
##$LPBIN= 0
##$MAXI= 10000
##$MC2= 0
##$MEAN= 0
##$ME_mod= 0
##$MI= 0
##$NCOEF= 0
##$NC_proc= -2
##$NLEV= 6
##$NOISF1= 0
##$NOISF2= 0
##$NSP= 0
##$NTH_PI= 0
##$NZP= 0
##$OFFSET= 16.522
##$PC= 1
##$PHC0= -93.22813
##$PHC1= 18.14532
##$PH_mod= 1
##$PKNL= yes
##$PPARMOD= 0
##$PSCAL= 4
##$PSIGN= 0
##$REVERSE= no
##$SF= 250.13
##$SI= 32768
##$SIGF1= 0
##$SIGF2= 0
##$SINO= 400
##$SIOLD= 32768
##$SREGLST= <1H.DMSO>
##$SSB= 0
##$STSI= 32768
##$STSR= 0
##$SW_p= 5175.98343685301
##$SYMM= 0
##$S_DEV= 0
##$TDeff= 65536
##$TDoff= 0
##$TI= <Analysis number 999999
Compound Code 99
Book Reference 9
Project Code 9>
##$TILT= no
##$TM1= 0
##$TM2= 0
##$TOPLEV= 0
##$USERP1= <user>
##$USERP2= <user>
##$USERP3= <user>
##$USERP4= <user>
##$USERP5= <user>
##$WDW= 1
##$XDIM= 32768
##$YMAX_p= 300726403
##$YMIN_p= -259250
$$ End of Bruker specific parameters
$$ ---------------------------------
##NTUPLES= NMR SPECTRUM
##VAR_NAME=  FREQUENCY,     SPECTRUM/REAL,   SPECTRUM/IMAG
##SYMBOL=    X,             R,               I
##VAR_TYPE=  INDEPENDENT,   DEPENDENT,       DEPENDENT
##VAR_FORM=  AFFN,          ASDF,            ASDF
##VAR_DIM=   32768,         32768,           32768
##UNITS=     HZ,            ARBITRARY UNITS, ARBITRARY UNITS
##FACTOR=    0.157963299565203, 1,           1
##FIRST=     4132.6476996994, 0,             0
##LAST=      -1043.33573715361, 0,           0
##MIN=       -1043.33573715361, -259250,     0
##MAX=       4132.6476996994, 300726403,     0
$$ Real data points
##PAGE= N=1
##DATA TABLE= (X++(R..R)), XYDATA
$$ [...]
21027 6683 16664 17423 20325 24750 28488 28267 34510 33115 42824 47411 43224 44909 39953 31526 38519
21012 38519 39799 32332 46876 48426 32959 42763 47742 35671 32222 32362 28361 33093 33549 26567
20998 26567 21720 21266 29413 27224 25248 20102 34285 49464 55350 56733 45136 27583 31735 30274
20984 30274 33974 27932 22030 33325 41955 35292 37824 35103 29133 22315 23348 38703 46845 41331
20970 41331 27527 16352 24216 34420 48948 50161 44927 34218 12079 9679 16231 22070 14087
20957 14087 16404 32951 33050 50793 55465 53093 63331 55947 48091 43815 50203 62520 64385 67316
20943 67316 71948 68676 54496 63606 64429 72076 69803 56407 48924 48624 63443 68962 74886 63730
20929 63730 60239 57195 59658 62879 64205 74423 86489 87710 78369 73247 87425 96838 107964
20916 107964 119511 150219 175587 199032 226320 263166 313792 386752 453772 482029 479524 483939
20904 483939 472867 437025 367254 295398 258016 223394 189586 153641 123428 92424 78439
20893 78439 80080 67180 56059 63158 56568 54982 49285 46310 64724 75975 65301 40314 19948
20880 19948 19004 42991 52688 71212 84637 81992 64963 58771 56327 57239 63407 68482 55620 47386
20866 47386 58710 81529 77074 77080 75707 63355 55371 55586 55767 42178 41095 43504 55460 74440
20852 74440 81111 74199 57924 47909 52610 54041 52266 38480 44344 57904 55034 61839 57550
20839 57550 65130 73636 73737 70408 62066 61279 61861 65797 53079 51305 61348 55974 44673 40292
20825 40292 45156 58595 57307 74324 73094 78372 84385 70579 70521 63363 67540 75398 59412 61716
20811 61716 54302 64214 82818 81106 84886 83031 85226 95931 80404 67728 62462 61594 62389 77726
20797 77726 78900 70341 65955 71695 84920 95578 96519 71351 58235 78831 89940 77806 69943
20784 69943 92804 103815 94061 73178 62651 57603 59166 58380 65804 68000 73536 73604 81344 78089
20770 78089 72029 66195 65898 62079 63562 60502 75245 78400 66701 56925 58393 50403 47142 43865
20756 43865 37155 35278 44869 57324 75844 73901 66462 61876 79898 83809 85683 83438 79633 72345
20742 72345 72337 77917 67661 54505 70109 70144 67077 70764 87672 103927 109885 98089 92711 84390
20728 84390 84299 84397 75181 72062 61934 63150 80472 86371 71800 51969 45087 55986 57523 65670
20714 65670 89624 88857 80739 75004 77924 72638 74712 75811 70746 79893 79333 72309 68044 76474 71513
20699 71513 67206 71661 72742 78255 71634 84973 100379 97535 93720 97552 115443 116756 102736
20686 102736 93315 83688 75360 71256 72367 69137 67122 80707 76380 76258 70480 70955 72309 85888
20672 85888 89934 83611 76168 77453 80111 67845 74884 90711 83018 86919 94048 83244 73601 68943
20658 68943 71658 75753 78812 76200 74281 74852 88132 94210 84162 77828 83461 71895 65746 77384
20644 77384 87700 102578 103552 90878 80133 84225 94838 89477 95728 88598 84763 82950 90128
20631 90128 97621 103274 102931 103476 100961 114978 103491 90620 71882 76689 83584 84413 85755 90452
20617 90452 96557 96895 90637 91892 98651 102429 99052 92567 94188 101376 113658 129813 134646 125093
20603 125093 110367 94427 81736 69312 74124 84918 93834 108701 118793 119182 107058 94674
20591 94674 98570 98649 102008 105609 100208 91481 98933 104684 107746 95456 87956 102839 122723 122715 116072
20576 116072 111723 114884 111013 103955 96178 109591 111260 108836 118754 109368 90316 91591 102654
20563 102654 108339 105322 102439 102178 106775 104967 109786 120189 107592 88902 77970 83188 89221
20550 89221 95837 94508 105111 106301 109529 118713 113626 98798 103338 106895 95406 105187 107068 105216
20536 105216 95072 96826 99158 80190 71219 79114 82161 90639 99888 105993 96076 96151 108191 100478
20522 100478 94934 98082 101020 108610 115626 121681 119495 108418 108643 98080 96845 93659 90330 114213
20508 114213 119700 122979 115680 101779 108155 119536 119048 111223 116406 122592 113677 106203 112191 101253
20494 101253 101911 117655 107554 97039 96259 103163 102545 109017 119992 116975 107924 98207 96558 101678
20480 101678 118360 134574 137356 130546 135822 134581 128259 117197 106185 102958 104592 109901 102163
20467 102163 86738 90280 93454 106533 121929 114409 100985 108723 101034 101063 102486 92704 92048 96742
20453 96742 106943 120856 109984 100507 120353 128725 128536 133546 141438 137472 128804 123159 108858
20440 108858 95493 102279 114840 133094 137024 125625 127776 124583 126340 127523 127680 119990 125385
20427 125385 119999 101640 92077 109101 116989 118824 110799 126166 125472 119755 120841 128573 144199
20414 144199 147578 144632 136648 137949 142958 132440 118559 101517 103874 122147 137486 145944 140045
20401 140045 135720 125622 128639 126538 121631 110142 107052 90479 93124 88276 95461 114629 112122
20388 112122 120052 123497 133824 132458 120274 108800 105333 117402 122304 126327 130030 122922 127259
20375 127259 144499 137122 136785 143090 148116 151360 149604 136483 121115 125564 132335 129612 130168 144272
20361 144272 154813 155388 145521 140495 132854 126941 112893 117036 136699 152059 147983 152028 161399
20348 161399 158068 140969 128582 129200 139435 133939 120274 127727 129863 129503 132714 136032 149101
20335 149101 133653 113492 118279 124363 121991 129384 145388 151921 144504 136096 138205 143665 131850
20322 131850 116522 120323 119801 127067 134343 147637 156081 144160 147983 162310 157731 148634 146335
20309 146335 132263 123991 129617 124090 121537 122764 132163 135971 134831 124544 126286 131321 138262 140344
20295 140344 127161 132977 150709 141185 127872 137394 141258 141801 153256 144483 128041 121465 108641
20282 108641 120051 148026 146695 133974 132714 142402 162749 153958 145059 149778 156087 139548 135486
20269 135486 140998 154442 161455 164756 151421 152005 160359 160461 148414 143017 153264 164804 162421
20256 162421 158976 155455 153407 167401 170473 163360 156823 153014 155408 145525 142401 137132 138913 137577
20242 137577 145217 157620 181338 195679 189486 178329 159208 150010 145374 142267 133926 139653 153718
20229 153718 149771 140721 146984 152400 158855 162225 169751 169985 170053 157994 151027 141646 154751 162607
20215 162607 176598 175061 158648 138462 138708 141780 147427 155641 172530 164019 161018 158395 157107
20202 157107 171166 154407 149346 174003 179428 183118 177591 179511 175734 172337 177583 183586 177873
20189 177873 169417 164221 159938 165992 174997 174776 175543 180868 167620 163944 162230 161709 159671 171792
20175 171792 179620 169603 154500 159924 168858 170998 172748 182054 196457 204414 199506 185063 176328
20162 176328 171902 177275 177855 164117 162773 182495 186836 179128 175333 161313 169400 169901 154566 151036
20148 151036 148178 154739 165851 172964 165676 172250 181206 171863 163726 170521 180488 187883 184985 177360
20134 177360 180113 183673 183826 172917 160433 161811 155229 144812 164697 174639 179646 187492 185525
20121 185525 174896 171258 173846 180454 178409 162696 159119 169244 176586 159676 177519 195574 208426
20108 208426 198841 183123 191870 194011 183988 182033 171303 166051 163776 155863 159462 189843 218940
20095 218940 212115 201018 188795 173200 176959 176445 167132 169183 161852 163667 181368 196413 189663
20082 189663 197200 191914 178749 172673 176280 181108 186881 181905 168286 167108 171335 166507 175946 169638
20068 169638 172627 165269 174339 179620 167255 173684 175256 169618 181734 181558 175964 175387 184413 205538
20054 205538 213203 199143 193231 187623 190798 199830 194032 195089 199169 197561 184999 184724 170425 169548
20040 169548 180396 194072 201417 208671 226681 234008 217529 202041 199930 207982 205228 205387 209927
20027 209927 194896 193127 188281 185295 195929 190267 178279 179292 207618 223138 228878 215419 202069
20014 202069 201882 194897 183036 192097 212549 203929 192502 177607 181054 169344 176936 193567 207708
20001 207708 211498 217147 219815 215620 222210 221857 218954 217321 212937 210684 202293 207513 202472 199946
19987 199946 200459 184729 186284 203309 212427 218126 222982 218734 211366 207170 203327 200819 208182 198633
19973 198633 199516 200824 215709 213222 210257 198824 199974 201799 196578 199664 214624 217390 220618 219765
19959 219765 221838 218208 216628 215675 216959 217308 221750 235399 233145 214176 197130 192112 206729 228525
19945 228525 227380 216153 223348 226785 224280 223230 214642 204474 199681 198824 188395 193842 202199 189856
19931 189856 176544 177988 200619 205281 203489 202018 209481 221679 225981 233057 213289 198164 203207
19918 203207 214489 217930 211159 205738 207842 215307 220812 218748 228627 232700 232790 226189 213907 200176
19904 200176 194982 205861 213637 222787 223228 224029 214157 219435 243912 256664 238698 220951 205034
19891 205034 208723 212074 213351 209145 203784 212609 213172 228137 235030 231999 227868 217685 204782 202667
19877 202667 211316 214119 209235 225087 224088 213392 211227 211376 217641 221423 224347 234481 234008 234006 233059
19862 233059 244317 240540 223892 223389 226180 223790 214460 227539 233869 223816 219210 218689 216960 224635
19848 224635 216304 209280 207836 207356 205452 205469 207905 202935 216071 224737 212726 215438 222425 226344
19834 226344 235847 237117 236569 238209 234352 237249 243718 242398 233975 228722 245409 246532 238284 234664
19820 234664 226778 229781 237296 236101 247386 275068 284206 276641 274423 269787 259713 249926 243124
19807 243124 246090 236795 233463 227281 237246 243283 257290 268163 262462 249847 246946 257299 257596
19794 257596 254985 253998 259216 259093 245612 235078 225575 236854 245168 242148 249640 247273 249417 242529
19780 242529 243650 245013 242904 236786 243409 249768 240576 241310 247392 248371 254279 244567 232644 227625
19766 227625 229004 237585 253693 249481 244322 252645 246085 235937 243758 248724 267999 274703 260333
19753 260333 253755 258913 269678 264781 267388 266439 266194 265148 261412 258063 273178 281797 285872 274455
19739 274455 271127 275920 265904 246608 260819 275208 276991 281035 296067 298445 304022 297528 273611
19726 273611 263887 252992 239384 257173 265968 271843 273515 268968 277343 283254 285117 273036 270659
19713 270659 274545 274376 265612 273851 268299 269050 273648 275232 285866 287932 287366 292161 282553 280938 271545
19698 271545 267036 268693 269809 278448 277881 278412 281090 281015 280857 282544 285928 296051 303734 282050 280896
19683 280896 273812 271886 279392 296372 307593 295666 277112 272030 263370 267306 276666 277580 274551
19670 274551 269076 267194 273357 281654 266296 257389 258524 260231 267920 291070 296021 295133 294054 277690
19656 277690 256949 265148 267770 259586 276317 268693 266181 276630 294384 307817 302547 282233 280631
19643 280631 286280 276400 275137 291290 299408 308245 315000 312431 313654 312471 292752 278912 289301
19630 289301 293894 301249 290555 293333 309689 312775 313008 304837 280838 278317 287985 304875 304682 297956
19616 297956 298565 316120 330430 321599 309691 316983 319604 315126 319789 322018 325623 322735 308281
19603 308281 296922 288272 295171 297607 309527 313665 310947 301489 291685 281331 287537 306261 303152
19590 303152 305777 303184 295659 299614 314752 320312 320294 307878 304093 306655 314308 308483 316751 330038
19576 330038 314339 303649 308242 316501 314804 306393 296536 293989 310964 318769 319201 327644 331697 311250
19562 311250 298567 290772 308102 306147 301641 307745 322397 330339 336835 321812 317706 309712 311576
19549 311576 306914 302782 294951 308175 320482 322765 325402 325427 321436 327664 333867 330568 316182 314074
19535 314074 303909 303274 307618 317075 325638 321159 310888 298214 303320 321963 330564 330084 334456 332540
19521 332540 324906 323704 323721 333504 322937 315461 319949 339649 357818 350941 340815 345064 336188 334398
19507 334398 349918 337478 333143 339676 334744 336757 344800 346298 336697 333589 343668 345590 341776
19494 341776 344968 343499 333030 325061 320258 330420 325522 317517 316699 330311 333882 349033 360238
19481 360238 358885 356672 354137 358283 368365 353205 348392 340250 338468 340422 335947 329317 330932 337257
19467 337257 328646 320905 327043 341801 346080 344585 343046 343280 339310 342747 341523 337418 338999 337835
19453 337835 345595 352654 347790 343891 333561 330291 338718 343430 336987 334170 333153 339933 346885 354972
19439 354972 353085 345833 351163 358395 348139 354429 356745 352555 346164 342022 347854 350344 356566 365277
19425 365277 362910 368145 362698 354822 348835 339124 342998 350369 373154 368528 361391 357890 347025 338608
19411 338608 344576 349765 364428 367983 363854 361802 366385 368665 367454 361566 358884 355116 352435 359117
19397 359117 371289 381815 372220 366970 370213 369674 383967 386337 372815 381661 398674 399070 390582
19384 390582 377358 375788 388759 385313 388576 388773 392622 388533 393571 399936 375498 373878 376748 383938
19370 383938 368504 355800 356659 359466 378702 364657 368405 377979 369236 372088 378990 382906 387645
19357 387645 380016 378168 378177 367467 378882 382773 384221 385643 389511 400837 391251 394822 403535 395249
19343 395249 375038 373995 384244 384047 371782 366052 368540 377268 395087 398638 402820 399725 397101
19330 397101 399713 406072 409957 404835 392710 381023 383333 392804 394415 393306 398178 408827 405949
19317 405949 392845 377113 390612 408931 409854 404671 404555 405206 403505 411160 411198 405519 391282 381705
19303 381705 392116 402304 416598 423746 424297 421558 408816 413571 422645 427157 421151 423545 432882
19290 432882 424876 412929 395636 388921 405911 413379 422911 428218 436154 448303 438207 424052 412210
19277 412210 411491 414742 417242 424674 412985 403532 422978 419781 408888 416797 419921 422832 432774 443966
19263 443966 439341 439775 443852 446913 439684 452698 464363 463583 447794 444313 444326 432026 418212 414612
19249 414612 416195 421764 429300 434632 440373 426714 429644 431765 426073 424590 431011 438340 441179 435911
19235 435911 431914 445997 459345 465469 471011 464248 464434 456897 450553 429071 432036 424094 418996 411231
19221 411231 428247 432851 437011 442971 454116 444376 442047 438016 433969 439075 443417 443022 439401 445600
19207 445600 443381 451293 463263 467337 464028 458418 461479 467683 468004 469845 482343 472606 471480 484797
19193 484797 474376 469815 475253 475432 480467 454600 446412 459498 462656 470950 478574 486633 486921 486332
19179 486332 484062 490494 495352 487389 476931 470154 468088 473249 473999 470961 469514 459294 449248 454418
19165 454418 465992 476504 494338 488736 487484 484704 477155 471738 464692 470136 470510 469983 479006 500885
19151 500885 481152 470525 488706 498889 498287 486460 490137 488434 481520 482403 482357 472395 468297 471665
19137 471665 479221 477098 463063 465038 464860 470279 498691 510295 506705 490095 497190 505309 493852
19124 493852 480570 496666 510728 509695 503585 498005 486555 484415 492096 506796 499419 491324 507489
19111 507489 529565 516242 500348 500011 506289 504509 518350 517717 520820 517513 509543 508804 522487 531707
19097 531707 519851 511634 500286 513989 521454 514330 511235 512525 521019 524730 520133 524965 540159
19084 540159 533176 525733 533988 536794 520931 518075 510381 506818 509405 508235 503003 504887 504773 501846
19070 501846 506482 510043 509478 519471 527691 518165 529142 532542 518455 510092 509308 523050 524849 521930
19056 521930 529026 532741 537343 546971 555399 549098 545318 546604 555344 544324 540950 544109 536018 545168
19042 545168 538442 532690 522259 535016 537204 540088 543811 540509 549826 554626 545098 530988 536616
19029 536616 545207 545708 560237 565150 550600 548030 560808 563975 548447 552873 569815 567205 574093
19016 574093 573888 567748 564918 566941 567528 552912 549288 549727 545266 544870 539978 530338 535089 523271 529600
19001 529600 554948 564580 575835 574855 572430 574532 576434 568706 552909 556948 549597 547995 547222 542099
18987 542099 555959 561038 562128 560159 550943 543569 546263 558465 568506 569701 569370 566366 573156 566626
18973 566626 566355 571847 592223 590253 577316 568177 568880 568063 565923 583275 590724 589365 584538 589794
18959 589794 591984 581649 561875 569070 581751 593098 583538 579544 563021 572207 577858 569683 573724
18946 573724 578928 595006 606969 598043 582518 584052 579452 579919 589492 600869 613988 620768 620502
18933 620502 625718 610420 600620 605834 613315 615090 627902 631250 627439 631849 639627 627050 619318
18920 619318 621367 615609 620889 616574 600241 604392 609711 613521 611637 604357 603500 625639 630409 617764
18906 617764 621338 599250 602562 620517 618349 627364 631236 632578 629297 624017 620253 632209 640797
18893 640797 627787 641355 638970 642891 646045 639923 643394 641894 623213 613990 608750 611591 616153
18880 616153 629497 641283 640181 641223 654092 652739 654292 651123 633776 624391 616444 614291 612770
18867 612770 621280 630575 622218 623662 631681 638253 639225 647306 651301 654036 650552 647557 647711 664623
18853 664623 674817 673546 659222 642658 636139 634972 633004 644679 653869 642645 638718 651048 648356
18840 648356 639609 652355 650632 642337 638854 655924 653610 645106 652000 655403 650162 643606 646936 659937
18826 659937 678385 673734 676229 670984 674814 660337 667955 667271 660159 654818 665041 658856 657079 657795
18812 657795 655287 665633 648607 639802 649761 658167 670639 674634 669389 685891 695890 674819 652282
18799 652282 662882 673897 670387 667835 667792 670090 670142 670790 666502 671471 680790 685687 691755 675950 662032
18784 662032 668073 683689 675412 668092 687401 681372 684859 700071 693904 686827 697233 693206 679480
18771 679480 687865 688107 686705 694186 700058 690006 683749 677576 684065 689703 687351 696123 705256 707664
18757 707664 703565 704383 721035 711887 715807 737579 737800 729968 722836 708089 705071 706845 710793 708975
18743 708975 721324 729019 729384 727319 717694 721010 732986 727871 726890 732736 731529 730564 714948 701069
18729 701069 703218 707539 709778 707993 710667 708348 710203 716571 717636 730163 739593 719033 716499 738784
18715 738784 747975 743431 756533 762864 752795 742156 741051 736770 740900 756617 755313 746121 734696
18702 734696 730555 740408 747017 747763 748614 748651 747033 743386 745608 753476 757099 746981 733293 725966 735160
18687 735160 742214 743424 742904 746036 744052 736580 731396 743605 756672 751233 751068 753289 757068 766384
18673 766384 772673 779124 781768 768594 762585 736207 723089 734991 749159 743366 745990 744881 729200
18660 729200 735125 760498 769826 764853 759387 759282 763582 758484 761845 767525 760242 764954 768704 786845
18646 786845 790224 792915 797574 799798 799103 801996 788537 768317 751592 757007 765887 770083 771224 785095
18632 785095 786007 790152 788941 782542 791234 796492 785409 775725 783629 786944 793686 793260 789561 796049
18618 796049 802486 802938 806810 814931 809277 800197 805219 803872 799098 795089 795948 797907 788163 777475
18604 777475 775372 783945 789129 803570 813060 814375 821055 816211 805105 798642 806720 813914 822951 818911
18590 818911 801166 793514 779948 776145 780471 798143 807372 797207 808603 816724 794533 794437 814489
18577 814489 820171 806183 796359 801993 807452 811309 818531 831834 831226 816807 810604 813554 819326 835773
18563 835773 835539 825553 813449 825279 837619 833331 847279 854206 850120 828687 822088 818445 823831
18550 823831 811987 807903 823380 821364 826478 842111 850760 850775 843868 848456 838047 836880 838601 842982
18536 842982 864983 888034 888408 883703 885983 893851 907153 908288 917558 919672 928960 924142 911833
18523 911833 896493 878470 882042 878390 868094 867882 878175 880124 874440 884078 887023 870335 855117
18510 855117 860288 855831 847767 846008 845119 852912 861727 855531 851817 846567 849575 847081 839200 840851
18496 840851 860365 868614 865595 859615 874255 878799 876443 881314 887723 888107 883897 877711 871354 881487
18482 881487 898745 908491 940925 959917 956848 948091 936805 924986 916932 901256 891715 890003 863440
18469 863440 852727 855171 860887 862888 833745 837844 861986 884889 880176 877233 869188 864472 862716
18456 862716 877616 878715 875508 880646 885254 869105 849728 853419 860292 857269 859894 864470 882282
18443 882282 897522 889623 891599 898529 902042 893316 888133 883473 872239 885291 905215 914492 909980
18430 909980 903239 889079 884333 883816 891068 916672 933190 930865 919252 912524 908900 909285 903150 899278
18416 899278 900671 909043 899656 907812 920257 914276 901995 894176 886405 895004 892599 895235 883131
18403 883131 876502 886315 899568 905508 903682 899896 912025 919347 908427 901801 905810 913426 910487
18390 910487 909695 913802 915686 920259 922972 915217 913352 899614 895118 904006 895690 890459 896501 898907
18376 898907 903246 894756 873208 872997 895637 894525 879765 883583 896513 908895 907436 913345 917724
18363 917724 911454 901223 895644 905131 904308 917444 917410 911878 897170 903035 914253 908703 904567 914847
18349 914847 921261 925048 912030 891171 897815 895592 915076 914898 906659 902003 903567 905987 916998
18336 916998 907681 906538 929110 933390 917138 898913 888940 897205 922233 912711 907903 916038 916036 924356
18322 924356 923260 922835 934725 936288 937754 947534 935318 924506 925469 938676 946693 938334 929364 939475
18308 939475 938243 934105 937392 951012 970668 986966 977836 967372 951853 923292 925128 927782 931373
18295 931373 949480 978068 993477 988714 956854 940662 947475 949564 944152 943135 940103 942600 943462
18282 943462 928584 916934 929062 943464 937492 930119 919947 917005 921717 927402 930154 921529 920035
18269 920035 925198 922055 918068 916510 914182 915949 924030 936907 950703 955676 950612 948450 952883 966993
18255 966993 971763 975303 961148 954455 956447 972453 977782 986479 988053 997666 979963 972140 965608
18242 965608 960595 955850 959113 960485 956000 934540 916231 922117 936579 937974 931426 916834 926542
18229 926542 926358 921144 927235 933505 935289 943043 939458 943309 960870 964142 951803 936992 945458 951093
18215 951093 945191 941629 912377 909688 907709 900515 905667 922511 914866 911992 914797 909212 924741
18202 924741 921788 916986 930903 935711 922896 913275 923205 933515 931471 937649 928708 926310 926822 929279
18188 929279 936775 948640 958650 956832 952242 946877 950493 965163 977459 978352 981460 999022 1013165
18175 1013165 1016077 1004627 977893 966100 956467 953590 958005 961934 960644 956517 939268 921366 923808
18162 923808 928130 930454 940946 942730 944079 925321 918939 928582 927240 914554 928377 929582 923801
18149 923801 920441 910686 915941 921828 923729 928901 929466 932744 937938 945334 951430 939002 928395 941055
18135 941055 942492 935039 930690 922853 908784 919341 931706 936628 944739 939976 939836 930624 928527 923130
18121 923130 929679 929910 935870 939177 934823 930816 946914 964542 962592 947584 938112 934664 940007 946122
18107 946122 956299 950308 937423 917050 917468 928334 934754 947029 951584 944113 937831 939230 943573
18094 943573 940894 933492 920082 916261 916345 914243 914249 914442 906983 924485 930834 916329 906302 923050
18080 923050 927850 916999 912691 912348 898106 895392 900771 917095 922241 921554 911729 914306 917507 915067
18066 915067 917740 921713 936377 928339 918274 921716 925649 916947 891747 902039 916092 921339 918006
18053 918006 918080 913209 907205 910072 912680 908652 912852 918768 914427 912972 909820 918293 914454 921390 922360
18038 922360 912598 899873 893384 904928 905548 900949 893336 888437 885918 892462 893311 891474 906491 920511
18024 920511 911256 903847 901307 897784 891016 887629 886071 878725 888024 897564 912212 906085 907323 920894
18010 920894 925372 916008 913205 896532 903758 915221 906992 899434 908849 918127 919185 921353 912163 913688
17996 913688 907934 897967 909977 919376 931149 921045 907261 906790 906455 891087 876206 871411 879900
17983 879900 885737 883362 887607 894538 883853 887667 893150 884358 875617 879931 881229 880693 877573 890385
17969 890385 880517 884362 880199 873940 886739 880957 881727 886564 878120 892079 889333 894427 890496 889396
17955 889396 890800 901717 907628 897840 896328 907492 910888 900782 897429 897918 907798 912064 910449 909644
17941 909644 905456 904851 908971 909725 903353 894942 880520 885409 885360 886735 883080 893109 898754 892885 894265
17926 894265 891904 887591 868704 855103 858108 864675 869362 878416 884600 890470 887940 864271 855981
17913 855981 857025 872131 876010 867446 868104 880899 882343 874507 862450 866024 880307 879685 887752 880255
17899 880255 858639 850623 856816 855530 853918 868139 870873 859119 863899 854610 846193 841022 835913
17886 835913 837605 832111 831643 837506 845132 845527 842697 839887 832665 820284 818999 833512 841270 846160
17872 846160 841141 858421 848987 847511 854127 856735 863048 866678 858574 838376 833559 842569 846776 842521
17858 842521 843053 859336 867728 879944 886099 904750 924651 916819 922065 920354 902696 876600 852877
17845 852877 851619 864650 864625 848822 833519 836183 841699 837158 835821 830909 839820 843971 843847 831438
17831 831438 828832 823850 831478 830567 830136 842158 838061 843265 844492 838469 833301 818535 832838 839933
17817 839933 836329 827443 825515 830072 835261 811780 809154 812391 813831 813708 827347 836414 840673 832359
17803 832359 823180 823325 812760 811127 820142 830038 816501 798093 779925 782078 795378 804366 797704
17790 797704 797942 796136 790583 791123 813065 813752 817645 809425 805488 807553 809315 812425 809529 806596 793536
17775 793536 783833 789164 797681 806781 813367 811021 812531 791711 787118 778560 798938 800957 794548 790100
17761 790100 782044 757112 762044 768621 780124 773991 775328 784112 786555 789125 786213 803093 813223
17748 813223 818182 814550 802578 799292 788866 781184 780661 783885 795433 788041 773351 783312 795762
17735 795762 793809 783934 782516 786282 792783 805296 804046 793541 791714 779522 770329 768872 771069
17722 771069 778128 774267 782084 779746 790483 790329 775302 764592 751230 737101 753411 764219 766431
17709 766431 763032 764741 760580 768821 767937 778886 767887 766285 763648 749724 761068 774875 762538
17696 762538 752820 749426 756707 762217 746529 751905 764887 777295 778557 768459 760510 760953 760266 761419
17682 761419 762423 754419 759150 755041 758724 774653 770473 773370 768496 765918 758367 740724 736776 755238
17668 755238 772518 769509 761505 758183 748676 745450 744363 720536 717883 715639 707888 710546 719532 723007
17654 723007 722719 728798 727368 723599 726573 732397 726305 719470 719938 718554 718720 720001 713446 713157 721303
17639 721303 727443 721249 721120 731006 737889 730344 719101 721446 726585 723092 716158 711431 714763 722961
17625 722961 722343 697986 701429 718294 722883 715374 699524 694863 697320 683161 688746 702669 706797
17612 706797 712737 719062 721391 724938 709881 704185 698288 693995 704696 708371 705246 699194 679832
17599 679832 681570 684551 687920 698050 684063 667927 685354 705007 701047 677429 677268 686396 682061
17586 682061 681547 685866 673515 675305 682700 676385 679370 683497 688363 681686 656361 663195 686404 698231
17572 698231 681462 663936 665648 669597 672518 670167 670461 664577 657278 664904 672971 672900 671482 668997
17558 668997 680525 686361 695137 687765 675132 678578 680014 687633 688992 680906 672054 665728 657993 667689
17544 667689 666494 647986 644160 653381 650976 662101 658591 666911 684036 692939 689097 688093 692250
17531 692250 702322 717022 725488 734592 730889 720325 712096 694710 672400 659473 646361 640124
17519 640124 639611 637408 645202 651832 656033 660172 654526 640114 627349 631267 642241 654757 663541
17506 663541 653470 651955 648685 641743 643630 633701 620169 606728 618046 633444 634461 616580 615863
17493 615863 637407 646889 648969 633009 615722 603458 608551 620619 616653 618390 609344 601989 604254
17480 604254 618746 631127 632778 623156 621260 636439 643612 643587 640676 637014 629890 617795 602451
17467 602451 599614 600934 600532 606507 605072 600628 601861 607002 616334 616446 616186 620659 620337 616886 615582
17452 615582 606227 597483 612193 619477 623053 617102 614604 612194 609998 615461 600531 593807 592232 609628
17438 609628 605737 592764 600723 596165 598285 589745 586085 593867 586106 584721 589660 590173 589676 586636
17424 586636 590630 594619 604659 598384 590724 589852 588088 583031 577398 576392 581671 584746 591332 592782
17410 592782 595046 589815 589404 579602 581578 562846 556738 570316 573512 575148 577669 581792 586016 590532
17396 590532 593182 601797 592898 583807 577172 565923 571581 574637 571928 566318 563485 555827 553357 551702
17382 551702 545593 557306 549196 547651 551425 539101 532233 549280 564051 562859 564878 565531 562158
17369 562158 552361 549857 552166 552968 558284 561455 553090 549935 552571 551846 541931 545200 547985 548507 545813
17354 545813 545472 547796 550059 548433 535009 546780 554609 551944 562053 558518 550767 545333 547014 539093
17340 539093 534575 534768 534872 533179 533205 543525 545722 543813 552395 565532 568075 555349 549504 551718
17326 551718 555694 548762 534059 527916 526121 519631 518499 516980 521084 535348 532949 534222 542186 549226
17312 549226 534573 509618 501693 516578 529058 527493 523087 516751 514839 505839 503317 502143 512021
17299 512021 509766 502438 504604 512893 524738 528756 519005 509468 504576 500643 504979 511111 509657 514495
17285 514495 515401 502602 498608 488750 504125 506592 515005 525703 520715 506468 496710 487651 487367 497921
17271 497921 514649 501828 495713 499295 505047 498474 481587 469203 475196 481794 488790 486785 487797
17258 487797 499076 505845 508996 506147 493137 494367 493566 488749 490371 489402 477432 471489 469142 485614
17244 485614 497144 502668 491862 490448 484830 473197 488355 483435 469243 484052 487954 489964 492119
17231 492119 486206 481361 473417 482013 490731 491016 483465 471888 481259 477781 469516 469858 481778 474777
17217 474777 457968 457451 470690 465132 462363 486598 494184 497120 495423 491918 490029 483350 479928 477480
17203 477480 469839 462329 461401 465003 478666 494455 504714 490982 483617 475791 464219 446779 442563
17190 442563 455076 457628 458631 460459 461117 465980 474944 446691 447127 444960 431563 445504 453671 451825
17176 451825 461481 455946 453850 462255 470784 471284 450602 439634 436264 440035 458445 456745 427516
17163 427516 426457 415134 411285 421846 431098 434649 424625 420977 432961 433283 420563 423431 421686
17150 421686 416922 424041 419415 418997 436714 433019 412381 417635 423379 414401 415082 420158 416883 412903
17136 412903 425456 440807 441569 429430 448555 463291 452354 439155 447653 438202 421161 425978
17124 425978 415525 410169 411925 405573 395825 407546 422853 434470 437205 455040 446553 424307 418516
17111 418516 416834 423832 420820 418005 417100 421486 427631 420894 410102 407837 406090 398622 400149 398346
17097 398346 395550 391759 391095 417294 423205 412481 408610 411971 410776 416804 399038 396185 406634
17084 406634 405365 392482 386442 391879 404020 405659 388092 396718 403356 404872 402940 398959 400041
17071 400041 411768 408037 395875 376763 380488 398432 421002 410204 397343 402404 421093 424011
17059 424011 419913 414144 396809 403786 398944 385628 384622 395381 422534 419352 397016 398603 409770
17046 409770 407386 399588 393792 391034 379652 365099 372594 381547 362104 375197 384589 380350 358938
17033 358938 352872 344769 360762 373150 376037 369870 359259 370152 380075 370688 381515 379695 372158
17020 372158 372048 364215 353717 372004 376665 372367 380134 382770 370558 369573 374855 366876 371365 377279
17006 377279 365371 363380 370306 377616 387189 396105 395287 385882 387448 390191 387324 378918 374316 387243
16992 387243 379742 370132 371406 386799 391204 385506 378481 367409 362951 352080 340369 340586 359373
16979 359373 350862 344076 344194 345340 364103 368497 357108 357908 360157 356341 350049 333805 349030 349533
16965 349533 345389 350345 347069 347225 347282 353638 342678 331933 337271 346946 361626 350554 352686 358639
16951 358639 355058 364867 364643 362036 360485 352613 346822 333650 341965 351268 352805 363079 349377 335888
16937 335888 335701 345528 357133 365480 358756 354078 352722 345020 336054 338992 347780 341587 345380 354176
16923 354176 357009 345306 334554 332075 343351 344447 342190 335348 347416 350998 331484 321481 319921
16910 319921 327536 327935 332217 320581 312902 315854 316857 331566 326609 314567 300956 309387 317428
16897 317428 326367 328846 343899 340212 318075 312085 321659 324435 326771 321883 305280 305723 316063
16884 316063 319213 310911 309336 305319 308612 314422 315008 315139 303912 300377 300321 310995 303921 300461 322930
16869 322930 337722 340651 340014 321969 318110 321368 330959 336919 322632 334819 332677 319177 309449
16856 309449 313864 315889 301765 287183 286631 287367 294259 296384 295618 286047 285706 295373 304498 308506 311942
16841 311942 299900 293571 292985 289673 290349 285573 291409 294694 291965 291089 303544 310118 290068 287201
16827 287201 275194 271965 278255 274210 287396 293515 289741 301232 300988 311560 319329 310908 302999
16814 302999 301689 295003 279449 275159 271319 271260 274190 291322 311589 324890 307510 291905 292803
16801 292803 291336 288487 288223 304907 300822 283695 264456 258918 254706 258551 258342 265625 272693 290561
16787 290561 301899 303604 295917 298747 313735 307264 288293 284600 271863 250036 246478 255972 267686
16774 267686 261839 277406 294119 303398 298798 293551 275054 265253 259224 260299 260683 276740 278220
16761 278220 272567 267348 252402 239990 234490 258946 275559 276540 265143 249832 247288 262098 257056
16748 257056 251725 254313 262942 251954 248427 255162 249615 243348 259603 267485 269141 260875 254401 263866
16734 263866 276795 276609 275126 270008 247915 246349 242557 250776 242138 240882 251751 263154 263985 270107
16720 270107 273697 274339 267559 278795 272353 272857 269346 277756 286830 276379 277238 287757 275986 270187
16706 270187 271843 264313 262189 270145 275090 282104 280219 270358 271469 280636 290164 268505 247432 238281
16692 238281 242134 252799 244903 247341 247139 253511 258842 266124 264126 268673 267804 261404 265692 286024
16678 286024 275566 266116 265107 269025 271952 266882 252362 251258 239575 235792 242562 239795 241545
16665 241545 252547 250307 237374 230354 225760 217332 223327 233185 241137 243142 245971 248679 243705 256867
16651 256867 260643 248743 242054 253247 258753 244960 240481 251005 241584 241817 238710 237024 235294
16638 235294 233362 235530 250505 261246 265353 245136 238145 245657 256837 255567 248913 234457 228685
16625 228685 241210 248070 253453 263122 267185 267282 243560 234317 231735 243677 244013 236950 238451 230346
16611 230346 224945 230432 226194 226930 238651 227079 238664 242382 240791 230933 226307 217612 223760 225607
16597 225607 227256 233959 236515 233612 236999 239569 241940 236301 234722 223958 225266 232732 221849 226405
16583 226405 232266 220203 220079 227452 239138 237772 234322 237037 230700 235234 229508 224632 227978 227717
16569 227717 207232 197848 205692 209896 206363 208617 215753 225527 226901 226134 218609 212927 224816 239600
16555 239600 245421 231792 219367 220186 223790 226220 218902 215745 200275 194912 203965 211948 210611 207079
16541 207079 199070 194171 200733 215491 230894 231168 230655 244533 234481 226707 227246 225679 219422 210925
16527 210925 218896 210410 210092 224628 237825 243960 238030 217167 209125 202847 206210 206083 197515 190486
16513 190486 203989 198818 192837 203121 200095 196809 182489 174645 191987 214931 227962 236186 230848
16500 230848 239972 232777 213798 198080 199288 207881 202205 197605 208480 217067 213520 215828 211061
16487 211061 203980 196949 196769 199833 201118 197481 202195 202362 197444 197451 206481 203505 206007 224400 238543
16472 238543 235928 234803 227214 211996 196165 195107 192120 196839 198866 196365 178286 180468 190623
16459 190623 189278 207833 218615 214763 203023 180544 175851 186094 179239 166878 174254 168923 151611
16446 151611 157198 171136 179924 187453 194053 184621 168750 176184 179810 195768 206332 214969 210171
16433 210171 187018 174926 170420 171548 182184 191964 204068 201646 196174 178564 173104 170067 167273
16420 167273 178716 162122 157950 154490 169455 172943 174031 190376 196269 189883 182068 175536 167187
16407 167187 162264 164349 168714 170968 176002 194389 189292 191315 191186 189065 175204 173034 180370 171879
16393 171879 167482 175093 177362 172641 167882 159493 177101 184629 182479 173957 164561 149712 156621 161232
16379 161232 164936 174315 182931 177967 166320 163979 179851 192689 190428 198727 202889 202495 191186
16366 191186 173144 173148 155783 146054 152103 151661 173299 181309 186119 186283 175502 176093 186136 186742 187168
16351 187168 187473 183018 186249 167973 160528 156945 166605 174533 197205 200839 188011 189209 192541 194504
16337 194504 187722 184075 189631 182453 172041 172547 155271 158925 180845 184278 173774 164274 169351
16324 169351 166043 168024 173221 189438 188547 175080 154591 148112 148222 140316 143138 165566 164988 154545
16310 154545 148856 136265 141151 161056 176188 167898 177306 173848 167805 172964 181961 171901 161871
16297 161871 171887 172486 163025 145588 142274 156043 148047 141260 151573 174798 183796 177232 168540
16284 168540 179841 159961 151189 160091 163255 169212 174571 183654 175129 166456 167212 160421 163560 171405
16270 171405 170379 157489 155950 150249 148856 153397 159618 159119 152813 144242 141106 142384 135399 129202
16256 129202 135067 154466 169151 150965 149322 144242 132543 152435 173502 178463 184878 185173 174783
16243 174783 164976 172912 177684 161140 149622 156783 160063 157050 142328 132217 139000 151815 160757
16230 160757 158924 145801 136155 139050 148021 147944 160675 166220 163747 169454 155129 154186 148722 140500
16216 140500 151480 156275 158733 170385 173878 161505 156511 149854 148939 141834 134655 138732 135707 149938
16202 149938 158081 147756 126620 117359 121286 127684 145616 144965 141839 133399 136227 139908 128546
16189 128546 118084 121871 122763 135378 149371 151104 151077 151514 162745 154243 141100 143544 146706 150089
16175 150089 149271 157394 154852 151746 153284 158729 158320 145337 141817 142254 145041 138359 119000 115970
16161 115970 123560 130570 127744 113036 121305 127933 123444 123388 127009 125594 122362 127217 141062 135364
16147 135364 121085 105134 119749 132477 135345 140131 135957 145411 153997 142670 134662 113613 100965
16134 100965 106826 103345 96411 106150 109420 103050 110063 121505 128832 131920 130619 133920 142224 138696
16120 138696 130294 125453 119332 127013 128616 129234 127639 137639 126232 130280 140134 143175 142100 131734
16106 131734 119566 126243 131186 120127 119584 130961 139953 130868 119597 119434 131804 140647 128674
16093 128674 120495 113055 115094 116797 132848 131549 130316 114969 119678 117097 111559 119550 127563 137796
16079 137796 144812 148779 133310 129443 136163 140027 130004 123956 113267 106265 119980 114826 113716
16066 113716 116521 117311 98324 116015 136239 134710 129655 109717 108688 114865 120551 139857 136330
16053 136330 116372 105944 108767 118049 119064 114164 111818 114051 106925 111940 118900 122502 117554 114879
16039 114879 112353 115086 120423 118779 117863 129378 120438 122541 129346 131040 120801 108222 120562
16026 120562 120106 117991 119882 129008 126574 117043 117419 119402 117361 108752 106860 98322 75648 87889
16012 87889 105254 107961 110513 114910 130562 129416 121223 113038 108006 126626 113027 92160 84287
15999 84287 107119 115040 99141 99661 109369 112253 110258 115894 115609 102912 98819 103325 103853 87394
15985 87394 86294 100095 109215 121740 126833 129823 121875 114789 121267 127348 134580 136960 134832 118832
15971 118832 119278 123693 114801 114865 118059 107944 108300 104701 102579 101435 91937 86884 94292 109427 121869
15956 121869 125611 121979 123133 117874 125408 124508 102667 90206 108320 103229 96901 89309 93634 114473
15942 114473 123101 121560 115717 107218 107816 107591 106343 106418 99354 102651 118241 123515 118525 111099 104155
15927 104155 110246 112449 115662 123228 124177 109907 96970 103712 108842 98751 98287 99815 109204 113449
15913 113449 106786 97142 97743 95933 87740 86192 94190 103039 112786 106796 95526 96357 106153 115022
15899 115022 127210 122258 108667 102514 113380 108709 101987 106624 97920 97847 105928 101984 97372 107235
15885 107235 122852 107431 106494 105031 106359 102128 98277 93363 103221 94021 76052 76329 99603 99554
15871 99554 99566 104726 98882 106004 110529 108431 91959 77967 77970 89515 79952 72853 80975 100332 97956
15856 97956 86519 91114 86859 89996 91888 97252 106412 95494 108275 125893 117127 92449 77912
15843 77912 84309 94164 97371 109692 101940 95675 108442 104622 98341 106682 105330 111392 115195 92727
15829 92727 78467 83613 86249 83094 74684 63218 60224 65471 75212 76267 77607 78312 72946 73231
15815 73231 81532 78495 68299 68140 81523 83343 92049 90885 85551 70586 79233 91638 107114
15802 107114 111396 114895 109329 105179 93021 74257 59750 66713 61315 65093 84921 85146 84102
15789 84102 75914 76027 76408 92839 101395 88315 93507 103403 97837 93294 92867 82931 86484 90250 93313
15774 93313 90931 94777 95575 90106 81198 92326 100130 110505 108345 83561 74265 79055 87579 87435
15760 87435 75252 66975 70868 73805 66565 47944 42363 55031 68668 75155 59391 72081 97254
15747 97254 95161 91999 84372 84375 82895 86572 76905 65370 66319 65169 68239 85281 96004 114036
15733 114036 119700 114067 107936 107142 89677 77825 65623 47690 45461 65766 64863 63128 65988
15720 65988 68702 88327 97461 97659 76472 65435 72566 74044 72780 79072 66773 60786 82782
15707 82782 91316 88862 86667 78597 61199 64909 68941 69396 71665 77495 76821 61883 59036 70361
15693 70361 74815 74979 72223 79090 81517 106111 107357 94125 81171 83220 98218 106561 91346
15680 91346 83435 79689 77296 73041 74194 72522 64090 55689 60608 65296 75046 72605 63225 65768
15666 65768 54082 46400 53745 78757 81334 78510 82031 78295 94241 107339 95455 75514 62043
15653 62043 70682 78624 86880 95789 96844 95006 103716 88477 64716 65299 72641 71300 87648 85223
15639 85223 73757 78459 87169 85816 90645 85231 69441 49759 33096 43805 58601 66704 79339
15626 79339 85873 79415 82199 70320 61287 75846 80207 66693 66017 80856 77662 68878 68787 72800
15612 72800 82409 87188 94745 87587 75485 71514 66604 67092 54909 57408 73465 66731 76490 72736
15598 72736 65366 61374 65141 58468 71008 78514 83776 75059 65297 56786 71161 66093 62951 72999
15584 72999 80651 61929 52008 68954 71112 65173 67142 65435 68633 71751 68300 62588 52338 51575
15570 51575 55734 58131 69489 67079 65253 62919 79327 90082 72243 50861 37042 38583 39841
15557 39841 39108 53053 70156 58080 46582 42805 42344 53198 59911 69250 86652 102320 95771
15544 95771 96784 93244 75079 61769 48188 48281 51717 67437 84988 83133 76401 76424 88613 87706
15530 87706 92459 99474 90056 81485 73614 70028 75033 78909 79438 90885 87433 76955 66074 57299
15516 57299 59257 67375 59672 50221 59045 50701 60771 56170 58503 48629 29927 25388 42416 61678
15502 61678 80481 76541 65992 59704 50674 50731 59918 63449 59342 59744 65945 68953 70484 58026
15488 58026 51225 70575 81834 84259 85770 76751 72309 54155 42155 67271 90057 73793 64921
15475 64921 78896 71427 67115 68286 63040 62176 48552 40449 32073 23089 41862 55661 53743 34840
15461 34840 32138 27632 21063 28962 36908 40509 54068 66479 67007 61815 61688 60315 60479 64533 71102
15446 71102 79273 73212 73290 64313 57256 59950 60284 62291 63805 63185 55568 41268 33631 27225 36881
15431 36881 45570 57414 50158 53088 54786 71730 83329 75099 67662 59509 60142 59216 63123 55566
15417 55566 53539 43511 37481 44283 64217 76520 68141 60300 59925 58793 71214 78552 71800 58807
15403 58807 56412 64835 60623 52615 46312 48166 28691 29423 50996 69893 65411 58264 69761 69343
15389 69343 62709 65585 63237 61153 55215 56242 66065 62018 44104 35118 43736 44577 35120 27196
15375 27196 25735 28471 45132 45722 40754 46606 54677 46983 46009 56517 58073 42108 42996 46975
15361 46975 37714 31000 32431 53949 66286 62333 63106 61294 60508 53754 49486 52409 50238 54988
15347 54988 42907 30313 33688 47675 47744 49951 40103 30501 41660 58792 73077 60255 54451
15334 54451 40103 36192 41431 44351 62579 64220 62451 65515 66986 44046 43063 56643 59609 51834
15320 51834 35016 30211 42382 60276 72249 55553 54136 48049 57246 66575 71257 78810 64060
15307 64060 48198 36046 34160 23893 26994 27936 38374 32873 30254 32953 22545 40256 50741
15294 50741 48275 39635 36793 30715 25144 14038 25341 31882 24438 32936 47117 40694 34489 26698
15280 26698 16968 14531 15538 21199 19241 30043 54289 77641 71297 54753 49003 42775 34857
15267 34857 27547 21653 28108 40379 57585 51205 44777 48623 51359 36618 35834 34971 34587 35760
15253 35760 53272 54058 42163 33693 20770 17295 16641 32559 30851 26351 29235 28804 33042 51371
15239 51371 51461 45046 41381 49708 51302 35175 22528 30707 55712 58786 50088 52180 38322 33515
15225 33515 38811 47832 48715 52427 48639 57456 56117 52788 56930 47265 36984 31556 32045 31743 33942
15210 33942 42324 53716 56658 55242 59442 62142 52901 49040 57140 56271 48425 49743 44942 42573
15196 42573 34829 23682 35131 45425 44418 40576 40246 44210 41867 36014 38811 38571 44803 39447
15182 39447 36173 25255 20806 17730 18577 9600 17936 26201 33844 52274 54149 59354 53925 60540
15168 60540 55671 45359 42938 56047 42675 31660 42934 56517 62111 51429 57075 63946 62589
15155 62589 43905 37437 29901 35781 40084 40907 29306 30334 43526 49528 49292 50704 49213 42144
15141 42144 40381 44749 23056 16819 24668 33848 30097 17191 26197 36341 40209 38637 37510 34000
15127 34000 27298 33669 34928 38158 48573 48954 42782 36095 34687 45223 38606 34139 32458 39787
15113 39787 45370 43339 55625 52558 42639 45865 48530 45504 41790 41139 29235 28873 31036 43668
15099 43668 41807 52185 55820 47782 26026 22026 42254 56433 50222 38251 32098 41391 37677
15086 37677 35502 38080 43680 39133 29222 25518 19998 25565 35536 47371 35713 31434 54781 57892
15072 57892 48033 60108 47553 35915 36340 37382 37148 47865 39971 24688 30034 38580 55607
15059 55607 44940 37350 50790 64160 52704 23771 25977 27989 30830 30185 40011 51056 50860
15046 50860 48383 46669 37935 28673 37390 46344 29963 20606 24824 34567 43596 27707 24388 37614
15032 37614 53510 57833 51833 38276 22718 30730 29931 40780 32981 29572 26310 20382 12456 13631
15018 13631 23932 26256 25988 28905 27474 21555 24506 23243 22387 15769 24931 31780 38898 46543 40325
15003 40325 32708 13050 16476 25929 23521 26254 33343 41181 48410 45948 48310 42458 30995 39858
14989 39858 41762 37187 30115 28245 35752 31135 26813 38594 53896 58950 33421 29832 44633
14976 44633 50131 28353 21295 17109 20410 24357 14416 6714 7856 3437 15856 15724 14229 24139
14962 24139 14801 17939 13995 22554 31686 39228 40342 33374 17723 9113 3020 15292 24788 26839
14948 26839 25177 42538 42689 32954 16882 17982 24944 40638 54529 48864 36218 30981 18569
14935 18569 16841 19451 28363 27931 25896 20076 16639 20836 9569 2861 8139 21476 28107 23628
14921 23628 21330 23106 34565 47381 40515 12389 5161 9862 5137 7225 -1286 -1884 7574 14913
14907 14913 24455 23105 14144 7706 23187 29323 21689 18414 18919 17401 16493 12517 13217 15416 15049
14892 15049 27805 18781 14690 25773 25464 23906 8459 6562 26729 32843 23055 33484 25001
14879 25001 17955 20472 35382 45050 47113 46151 26918 22118 18429 13504 10404 -1016 2280 7399
14865 7399 4976 12559 17043 19793 27593 33420 27722 20800 31187 19495 5417 17764 30034
14852 30034 31352 27216 25225 26247 31717 28912 26554 15083 12001 15513 15026 35741 45982 42999
14838 42999 24365 -3570 -5118 14159 16921 1366 -3719 -1609 8916 33587 41060 37958 40145
14825 40145 36767 30835 23134 19820 13061 12820 18521 25301 14328 12840 12841 19259 40809 35525 30576
14810 30576 26923 23930 26648 28104 38397 46271 37192 38324 34107 40647 40174 47972 47722 32097
14796 32097 34587 25403 26455 22684 28544 27194 22035 17801 18231 38129 38941 29291 21347 35809
14782 35809 44197 30749 32784 29036 21833 10623 -2074 2790 20547 20024 18516 28296 28311 34239
14768 34239 30848 35332 45977 37327 24378 14711 25041 35797 17652 2258 184 16759 30638
14755 30638 40794 48150 38446 29576 25889 34947 42810 25257 15034 11623 9177 22546 26552
14742 26552 22230 26893 28510 19720 16682 22772 29609 34901 26519 32404 25402 22595 26192 21696
14728 21696 28000 16122 14527 18523 3216 6453 28622 29951 36835 37969 19593 11098 22286
14715 22286 30832 35215 26916 27387 29680 35082 35594 41787 32573 13939 22370 27962 23501 22636 32570
14700 32570 46086 36406 29321 27942 12310 23220 23558 11329 2097 8122 8615 13723 11148 2313
14686 2313 19616 43949 46251 31015 28755 30143 18956 22044 26480 19220 14422 4187 -679
14673 -679 -1956 8877 19086 33212 43623 37811 23357 22453 9099 13854 19419 17089 10816 1684
14659 1684 2037 23852 29114 20635 24402 19312 28807 27011 19321 39265 44889 31845 28285 15341
14645 15341 17245 31650 18313 18078 11073 16427 30910 34618 10290 2483 2695 9702 22807 18058
14631 18058 18986 18428 12841 7036 14179 13141 16638 13518 9472 9098 20293 24069 22772 27726 32974
14616 32974 44183 53363 43667 51066 52950 43225 26128 11552 5755 4452 12452 17445 33500
14603 33500 37474 26690 22127 24662 15686 21863 33092 43895 37085 13383 10576 15392 25916
14590 25916 24786 11850 6788 17612 31644 46498 34932 19122 12802 17887 25423 16804 7427
14577 7427 13660 17279 12300 13603 7659 6260 12029 17236 28376 18563 23139 25415 31612 35684
14563 35684 32027 30543 30710 37717 32480 19911 14484 23530 41315 50622 36470 28919 19430 11359
14549 11359 10049 13112 9027 7710 11933 8387 3038 15421 26807 25245 25500 30253 22142 6070
14535 6070 -3735 3842 4891 5860 19256 20265 14815 17609 23441 24226 19140 24034 12813 14489 23471
14520 23471 25915 34032 20653 18477 16698 13744 11138 11841 1090 10806 22650 22472 18575 8751
14506 8751 4193 9235 20886 33529 43793 39920 19529 19273 37055 32040 20722 18621 11312
14493 11312 -7037 -18369 -10745 8986 16403 5189 -6982 -3302 13223 19185 4352 -11162
14481 -11162 -6139 15711 23467 5117 -1127 11145 16410 10855 14332 17819 21058 18886 12378 23241
14467 23241 42479 52028 46006 35130 27530 26040 23375 10321 5300 8162 25892 30611 34875
14454 34875 31151 19601 10529 5754 13967 15427 19297 30919 34057 16531 20448 12247 7036 9282
14440 9282 7018 22866 28853 20537 20797 7875 13202 27222 30557 20075 14670 6753 12076 9356
14426 9356 16787 23102 29657 21716 10875 -2180 463 4070 13915 32586 24421 23546 7333 -4084
14412 -4084 3722 8058 8257 31922 37211 28135 9194 2884 17259 16225 22265 26645 18147 16889
14398 16889 18593 14055 1805 6131 15207 16927 30627 41415 42935 30897 25954 25655 25271 19480
14384 19480 3109 5585 6817 -8459 -16872 -1603 7726 5144 1359 13977 19205 11249 5749
14371 5749 11485 15838 12800 8079 1923 -1909 7340 20310 27597 32659 29010 19517 16501 18453
14357 18453 12948 7942 13575 26816 28091 22032 14316 2572 -2235 11038 9465 6716 14935 -697
14343 -697 2998 -492 -5568 6996 18246 32938 37339 32383 33303 27884 25653 31854 29097 23366
14329 23366 8301 -7189 -6423 9377 8217 5870 13092 17561 19323 19590 28099 25058 11822 -1010
14315 -1010 -2882 2620 -7215 -232 1549 -9109 95 7113 16234 19493 776 -7918 -7009 -318
14301 -318 10691 20015 31983 39172 48379 40025 41401 42616 29950 14451 6425 -1991 1219 -236
14287 -236 -8792 2629 16970 10821 4549 6642 19917 28174 19731 15315 10197 3021 6307 12905
14273 12905 25039 29155 36825 25321 -1828 -15119 -15598 1317 6740 4456 -6857 -8900 -915
14260 -915 22317 29528 35475 26875 23491 7855 12957 16551 17490 18539 16922 9587 9493 1631 -2655
14245 -2655 4822 -2198 -6728 -9989 -2830 6573 11947 13407 5096 8867 11359 9334 13696 8445 5670
14230 5670 9167 10921 12989 11087 1950 -3274 -13865 -11903 -8800 215 2623 -9996 -7545 15087
14216 15087 15980 19258 34044 15960 17136 13419 5912 10658 19749 20087 26292 30076 32431 24961
14202 24961 6636 -680 27 6669 -4093 -7592 -3470 -220 -3211 -2693 -10671 -11213 -2405 6793 8587
14187 8587 951 -3610 937 -4142 -8679 -14284 -14741 -7616 2379 10278 21741 18837 21232 21927 13330
14172 13330 1489 -1798 -4689 -5083 -4437 4003 10273 14824 17726 21916 34782 35454 28418 27062 18436
14157 18436 14523 19176 8803 10336 -2750 -4019 21988 27620 13802 5932 -621 -4933 441
14144 441 -1224 -845 -12787 -18361 -17241 149 6070 7410 4856 -95 -3345 -5716 -2029 3492 550
14129 550 6820 7735 13141 4863 3910 6629 1499 7783 6492 3342 13505 27116 23379 24754 29295
14114 29295 21688 17688 8896 8034 10213 12229 12877 8239 1396 8799 3965 10867 7442 -222 2725
14099 2725 8620 4111 13218 5847 5441 8391 16698 22403 15101 17225 21449 17179 1791 2677 2006
14084 2006 14560 32715 30153 20411 11461 7891 15891 26200 12508 7216 7030 -1763 7159 14689
14070 14689 13317 14171 9390 12492 20647 22639 16231 5008 -5569 -10902 11351 19320 10934 -5608
14056 -5608 -12212 -6773 -5685 -495 7653 4088 -5841 -4178 -2320 -2139 4304 7731 -1840 -21373 -13473
14041 -13473 4435 13722 25218 17881 39 1398 -7804 -24822 -27290 -5832 -1254 -23495 -24127
14028 -24127 -2759 10724 8887 3503 3835 -920 -4232 1039 -5333 2909 9454 17767 34616 27710
14014 27710 17663 1877 980 5208 -3314 1865 10361 8257 11274 10190 604 10063 20949 19087
14000 19087 18006 1355 -10137 -12858 -1991 -5250 -16369 -17025 -16409 -8191 7375 8757 9431 14669
13986 14669 14541 12512 7726 15274 15268 13433 17224 6997 -629 2547 12253 14730 3617 7637 7242
13971 7242 10055 8471 7158 3657 2987 -328 -12315 -17607 -2039 1412 -2082 -1009 367 5966
13957 5966 8815 12267 10717 11524 11438 7220 -3067 -14481 -15995 -1826 2854 -6572 -1851 15357
13943 15357 5625 -4294 -11591 1947 -2534 -6901 -3056 2272 12120 11473 14088 3631 -3065 3014
13929 3014 6339 21718 30881 13653 7808 -141 212 9913 8721 -4539 -4174 -15628 -17301 -6289
13915 -6289 15771 14325 -415 5913 10883 605 -1865 -15761 -7300 9210 21109 6369 -4757
13902 -4757 -7403 7897 16751 -9474 -12426 1426 7182 10238 8488 -4234 -7405 3638 1051
13889 1051 3820 -8425 -29812 -35715 -19679 -3188 4661 5103 2256 1390 -2662 -7447 -3637 -2577
13875 -2577 1292 -1036 -1955 -20662 -22401 -20704 -16282 -13559 -1644 12735 20613 20651 14765 14134 17840
13860 17840 16463 7249 -14995 -23072 -18807 -26441 -17913 -11900 -3700 -8643 -11925 -13898 -18622 -22553
13846 -22553 -21181 -9131 3959 9969 18306 16413 3046 6957 3136 1845 2317 -1256 -8177 -14008
13832 -14008 -5229 1401 -7219 4582 24677 7656 -6613 -8459 5238 -2534 1291 3681 -1293
13819 -1293 -12569 -16542 -3636 -5515 -3996 -1389 -3096 3719 11642 14595 8874 7418 2518 5401
13805 5401 12544 22874 23195 15784 24471 24939 11761 9447 18259 14372 6312 15197 16826 2038
13791 2038 10247 23816 1724 -3160 -2289 -4272 -6882 -6262 -22077 -24320 -18228 -5045 -154 5079
13777 5079 22607 18422 17265 18595 15231 3946 -3349 -6538 6606 2492 -818 -1464 -16804 -11424
13763 -11424 10589 27250 26656 21015 9602 -18403 -22073 -5423 3198 -1324 -6237 2348 1807 -8590
13749 -8590 -9937 -1435 -145 -408 -12031 -12820 -9920 -9039 -437 1361 -13616 -12762 223 6801 612
13734 612 -9329 -25087 -22014 -7521 15334 14143 1775 2173 548 -16301 -25505 -17194 -11682 2796
13720 2796 5646 -702 -9488 1869 5751 4909 -4568 -7683 -13241 -21193 -15893 -11625 -11303 -12620 -5753
13705 -5753 -495 10855 -166 -8823 -10689 -28286 -34494 -14807 1713 18980 8126 -4932 -6592
13692 -6592 -9719 4121 17769 11756 -8689 -2572 6585 15005 12687 -1298 -12005 -18193 -11119
13679 -11119 11942 15095 14676 10104 5003 6302 5452 3822 6822 3507 -2259 -8119 -5253 2817 -12944
13664 -12944 -13111 -6168 999 -9912 -17145 -17448 -13554 1695 10649 6807 -4218 -7534 -15246 -11912
13650 -11912 -4108 -6681 -8001 -6413 -6183 -8220 -13511 -13468 -8351 -8034 -596 -3566 -4901 -11145 -11162 -6744
13634 -6744 272 4909 160 -10569 -11581 -13894 -23278 -24685 -29745 -27775 -22321 -13542 -20899 -22464
13620 -22464 -19919 -4714 10662 4786 2937 16161 7894 8686 8222 10072 7487 9764 2505 3937
13606 3937 9435 17206 18132 1715 -5407 2561 13820 7444 4983 21009 13313 4568 19786 30771
13592 30771 26021 23518 31938 28174 3044 -3858 -7773 -2209 -2584 7536 3031 -12628 -24773 -33229
13578 -33229 -27116 -22202 -18929 -18813 -9145 -19842 -23078 -14374 826 -7114 2740 6186 5270 -9995
13564 -9995 -5779 4080 -1790 -21586 -20943 -23681 -3088 4478 -6284 -17522 -29730 -28384 -15925
13551 -15925 -10048 -20376 -12521 -15251 -27101 -17879 -10788 -8829 3997 14215 11534 12147 15973 21077
13537 21077 19009 24728 20673 3698 -6823 -23645 -21758 -14546 -9828 -1156 -6888 -10023 -11763 -11527
13523 -11527 1890 1469 -9615 -4420 6823 269 6393 3564 7787 -7684 -24706 -18649 -13888
13510 -13888 7359 15243 26228 21241 22225 23626 17596 16974 38616 49421 50985 62557 77304
13497 77304 73031 58372 43444 36721 19135 17520 13586 7221 14765 17563 20533 18826 21811 14769
13483 14769 2132 -13419 -13566 -886 3960 5415 21260 14369 3235 -16531 -20765 -19745 -2343
13470 -2343 -3077 2278 3360 2523 3187 -17759 -12524 -6150 -4958 -6585 1161 804 -10861 -15268 -2341
13455 -2341 1777 -6550 -15090 -11963 7275 1143 -9367 -17827 -15521 -15377 -15998 -10501 -11504 -22483
13441 -22483 -16398 -19605 -23132 -9587 -4781 -12348 -27557 -37400 -26325 -26702 -28891 -16220 -11505 -25418
13427 -25418 -20970 -10617 -7869 -20021 -20668 -17460 -21842 -20039 -14450 -24915 -11678 5404 18982
13414 18982 10692 -2737 2325 -7300 -9736 -3214 -6650 -2034 -6314 -12078 -18027 -1807 4857 -2365
13400 -2365 11858 10915 2812 -2962 -697 -3356 -3027 -9718 225 1222 -13457 -5883 -3699 -1991 -11576
13385 -11576 -13526 9814 16744 17988 19573 12266 -8763 -11944 -19759 -20308 -19649 -16796 -9261 -6930
13371 -6930 -162 -4287 -6574 -2363 2891 8161 8129 4258 8851 9367 11788 15007 4874 -12044 -24011
13356 -24011 -19166 -14814 -25579 -21552 -16814 -22168 -11908 5371 -8242 -16390 -15076 -18844 -20886
13343 -20886 -22753 -24387 -28570 -33102 -30367 -14055 644 2810 10612 19030 23094 31197 46938 27308
13329 27308 4033 1299 -121 -3026 2422 3082 -339 1317 16051 15150 17220 12907 20452 10693
13315 10693 5824 1283 -9536 -5737 -6427 -12848 -12806 4179 11604 13011 8334 17914 18069 6888 10103
13300 10103 8151 8387 7707 -3648 4266 3138 -14055 -9603 -4700 -8983 -14210 -18237 -1536 16085
13286 16085 444 1109 15336 8727 -16061 -36379 -36520 -29211 -24042 -13208 -5522 -1011 -6587 -18128
13272 -18128 -19670 -33122 -20941 -5264 -7143 -17730 -12899 -6155 -17238 -21940 -19780 3009 -1773
13259 -1773 -30087 -31058 -5771 2261 -1922 -14472 -18541 -11308 -2721 -6152 -13710 -27779 -22462 -21700
13245 -21700 -17536 -14558 -16216 -8882 132 7077 -1047 -3752 -11232 -11392 -9130 -5926 -14421 -18422 -3718
13230 -3718 -17059 -18987 -8403 -3550 8103 6735 -1903 -9051 -13358 -12541 -6501 -3298 -1227 -1425
13216 -1425 -8244 -1428 -4161 -1935 9186 581 1739 -2352 -3073 5828 11977 8103 -3574 -17132
13202 -17132 -7738 3958 -11073 -13129 -3245 1282 -11504 -8362 -9648 -18751 -12854 -13702 -2879 -3351
13188 -3351 -7299 -3289 -1077 -2049 -13202 -19737 -16047 -6568 -7036 -14043 -18008 -14165 -3686 7253
13174 7253 20525 13860 13114 16962 3514 4501 10311 11654 4496 7523 9031 12757 17048 6282
13160 6282 61 -2622 -4957 -8226 -29945 -32931 -14325 -10825 -16428 -9115 -9158 -9178 -9960 -19516 -28627
13145 -28627 -28890 -14543 -18004 -28154 -39994 -19561 -8959 -11337 -8840 -11733 -5262 11499 10195
13132 10195 2355 1350 9478 13894 13877 15106 19148 20605 19654 26923 16933 -12133 -16133 -666 -435
13117 -435 -1053 -20878 -20876 -11079 -5919 -206 -7269 -13342 -12176 -13046 -10662 1770 13253 9072 -818
13102 -818 -5052 -586 8405 -1180 -10125 -4781 -6848 -3052 9127 12644 12667 4207 7626 -1297 -6844
13087 -6844 -6061 -2706 -12301 -12275 11425 7948 -23021 -27020 -30047 -20938 -6752 -283 -5478 -5509 1045
13072 1045 885 -1310 2330 -3597 -12084 -10883 -18662 -29507 -35631 -38127 -23325 -14575 -7671 11357
13058 11357 5686 -4836 1573 -13351 -12485 -7219 -5766 -18501 -6707 -6674 -11021 -13897 -11823 -18265
13044 -18265 -14729 -9818 -7522 -2848 -11969 -20473 -11503 -5023 -13123 -13373 -10105 -13539 -19773 -6870
13030 -6870 1104 1434 8521 3187 -24659 -28474 -14314 -17369 -8503 -10813 -12344 -11436 -14737 460
13016 460 2773 -4335 -4184 72 -10303 -14094 -17721 -10049 -1322 14672 3824 -8315 -7472 -11208
13002 -11208 -18319 -13514 -16628 -20223 -21406 -10653 -6644 -8449 -2211 1041 -1046 -12896 -21074 -24788
12988 -24788 -29930 -16768 -22411 -22163 -14460 -13694 -23361 -49922 -35835 -17187 -13924 -14792 -9906 -17679
12974 -17679 -18869 -18367 -8413 -8744 -11318 -5648 435 -444 -572 5700 1928 -12157 -18252 -11470 -3925
12959 -3925 88 -8191 -17052 -33779 -32399 -29756 -17313 -13784 -9277 1685 -1287 -5655 -2634 -7632
12945 -7632 -9206 -7673 -11671 -13222 -21241 -20563 -6153 -576 2053 10545 16819 13319 -8597 -14671
12931 -14671 -29787 -32253 -34248 -17587 -15508 -21099 -7485 -15140 -19532 -24919 -18637 -25801 -25185 -20816
12917 -20816 -12879 2686 -8399 -15721 -9440 -6518 -6741 -8229 -6893 20413 31229 31241 21466 11646
12903 11646 10740 2848 -3752 -2972 2333 12002 10277 299 -6362 -7168 296 -11078 -12774 -8455 -9177
12888 -9177 -9749 -947 -4757 -18000 -20488 -10678 -5815 -16896 -23042 -16685 -13902 -4819 15375 16546
12874 16546 8214 15862 19154 13307 6340 -4654 -3636 -4770 -16511 -18052 -7191 3774 -416
12861 -416 -15313 -19430 -13023 -9219 -5399 -15516 -8777 -1730 4649 7492 21469 23166 14619 9501
12847 9501 8551 -652 -9341 -16042 -20674 -19172 -13504 -24946 -29163 -25543 -20797 -14316 -9404 -17404 -24237
12832 -24237 -17437 -14443 -15876 -22462 -24832 -31348 -24332 -16485 -10061 -3921 2868 3656 -4035 -1791 130
12817 130 -8961 -1572 6914 16300 12911 2216 -11047 -14646 -20045 -22540 -11832 1929 10345 3744
12803 3744 -10395 -4824 6828 5009 3097 19461 16243 -8415 -5167 113 -1155 4635 -4021 -16213
12789 -16213 -12498 -9524 17 -4070 -331 5240 -7813 -22427 -35337 -22191 -9304 -11522 -8058
12776 -8058 2378 3860 -2337 -18677 -15758 7515 10487 900 -14613 -24665 -20764 -6095 1849
12763 1849 1454 -8221 -12233 -14191 -18233 -4304 10764 5577 -938 -6609 -653 16575 24534 20461
12749 20461 11354 -8232 -23645 -16586 -8491 -2450 -8521 -9019 -2288 -1685 2330 16406 8703 -7665
12735 -7665 -10058 1856 1433 -6154 -949 5040 1860 -3271 13093 12190 10551 7848 19007 18510 11145
12720 11145 7182 -12677 -33609 -23516 -13369 -4434 -11186 -21558 -18392 -4017 5114 -10437 -19236
12707 -19236 -24734 -16644 -19819 -15975 14 -4949 2073 3659 -7716 -17795 -10758 -22176 -21763 -6242
12693 -6242 -7017 -9216 -9447 -11916 -19409 -17832 -13557 -1201 4811 4439 15858 9763 -5047 -14944 -18216
12678 -18216 -11660 14100 24737 18838 21276 -3193 -18318 -16424 -17068 -9235 -3322 -16930 -32078
12665 -32078 -26844 -30962 -28230 -16017 -23097 -17960 -3658 -4380 -17576 -18114 -9134 17750 23468 30928
12651 30928 22036 21163 24576 23577 41567 39292 43972 56217 56953 73688 81558 97955 116427 160406
12637 160406 230159 342958 529374 900409 1478896 1972337 1979584 1542126 1021066 658913
12627 658913 442386 309604 219987 157035 105450 73449 68221 63967 70959 55998 45809 42357
12615 42357 22304 13674 12066 20130 29924 27055 22318 390 -24229 -27253 -26400 -15138 -8379 2100
12601 2100 8436 13529 15251 2121 -3547 -1836 -11187 -9803 -7254 -6954 -8373 -4294 -766 -7692 5512
12586 5512 3745 -3371 -16803 -13251 1358 10063 11327 -2069 -17804 -29873 -25099 -19912 -6865
12573 -6865 477 -10219 -20170 -17375 -19371 -14467 -7738 4110 2226 -8640 -15232 -9839 -1006 -2435
12559 -2435 -1901 -1876 -6705 -12306 -6280 4121 9365 8125 872 -6738 -10064 -18989 -22698 -23530 -18023
12544 -18023 -12780 -13896 -17812 -16464 -6693 -13292 -14462 -21546 -29110 -25336 -17836 219 35 -4442
12530 -4442 -10854 -5095 3191 -5888 -1201 11018 21587 12596 450 -7715 -9608 -11529 -17268 -7822
12516 -7822 -15351 -22489 -10612 -14763 -18065 -19446 -16563 -17025 -24976 -28280 -49881 -33036 -19017 -16531
12502 -16531 -27960 -26251 -12501 -12907 -25964 -29612 -28938 -21613 -7257 -4643 -5984 -16685 -3212
12489 -3212 290 706 3926 -7840 -31964 -29364 -9526 -9766 -18422 -24285 -18373 217 -4441 -14811
12475 -14811 -15058 -18633 615 11229 12618 2288 -5313 -10499 -8243 -113 10911 -2557 -21250
12462 -21250 -19313 -11546 -7938 -8808 -5227 4689 -319 -5056 -551 432 -8062 -6352 -1523 -18508 -35367
12447 -35367 -41529 -39565 -33859 -29679 -22922 -23507 -28652 -30132 -22855 -9934 -11118 -21376 -24521 -13304
12433 -13304 -7003 -10610 -5185 11247 11819 15377 13596 7094 3371 4745 -13103 -22995 -11366 -3298
12419 -3298 -19988 -30163 -15881 -8360 -4373 -2090 -9224 -8883 -5474 -4432 -2443 -3145 4808 10985
12405 10985 6050 7729 5779 -2597 -1849 -18411 -35190 -33829 -27259 -18382 -23694 -25962 -18933 -29509
12391 -29509 -22214 -9956 -11466 -20720 -11854 -11824 -7392 -14089 -13506 -12345 -22453 -11966 4440 -1391
12377 -1391 -1099 11721 17380 6329 -11291 -19378 -23479 -23285 -20912 -28671 -23232 -12492 2960 11147
12363 11147 13493 5518 -1150 -27894 -32343 -35730 -17117 -2850 7740 -4205 -20438 -13194 -2076
12350 -2076 -2413 4347 -3511 -13104 -14615 -6861 -1154 -6882 4999 16415 21 -7073 -12400 -6955
12336 -6955 -3459 -8648 -9353 -2348 1515 1889 -4975 -1854 -11043 -12268 -8695 -11879 -11194 -17034 -22463
12321 -22463 -14223 -12820 -14082 -11107 -3224 2747 1042 -2550 -2820 -5746 -14995 -22396 -19110 -19616 -19914
12306 -19914 -23716 -20809 -15015 -9128 3577 -7498 -24040 -27796 -11965 11794 2720 -11118 -2783
12293 -2783 11614 13831 13163 9537 21460 24595 15049 4749 -2697 -7608 6015 10823 4096 -1650
12279 -1650 -987 -88 8871 16201 10205 6362 9684 -3955 -26510 -19391 -21945 -16373 -3335 9425
12265 9425 10364 -3392 -18421 -26765 -33281 -33574 -26489 -14089 -1936 7668 1176 8467 11153 5488
12251 5488 -13373 -15253 -19491 -22011 -17882 -14745 -2154 -1059 576 -5218 -9563 -5881 -22853 -24799
12237 -24799 -4508 736 -9013 -8039 -4727 -6824 -2605 -12605 -20931 -7792 -15943 -19472 7266 13684
12223 13684 -9366 -21184 -38659 -40600 -21909 -9646 -11803 -4990 -4577 -10213 -14021 3219 854
12210 854 454 7802 -6206 -8711 -4789 -9116 -10941 -21065 -14807 -15828 -20697 -33016 -32554 -19117
12196 -19117 -12730 1522 5975 -5047 -1253 -5668 -5672 -10348 -3371 -7943 -18191 -12610 -11325 -15228
12182 -15228 -4031 -4649 -10083 -17883 -20780 -33425 -13059 5726 13096 9494 -6732 -5307 1054
12169 1054 2125 1610 13162 20426 3725 -3535 -7628 -12024 -12817 -11052 -18467 -4971 -5204 2159 1584
12154 1584 329 -2711 -6338 -21919 -24973 -29034 -20177 -16737 -12591 -12937 -23470 -19704 -21223 -18759
12140 -18759 -25383 -26366 -18999 -10566 -16252 -21300 -19197 -15302 -21009 -34533 -13897 1304 4995 8244
12126 8244 9812 7915 -4173 534 -332 -24825 -34301 -25765 -6013 -9258 -13071 -1289 -9638 -9634 -15953
12111 -15953 -9145 -6975 -4573 -4517 4026 12821 9888 -1719 1357 7383 19480 1043 -21910 -34235
12097 -34235 -19790 -10736 -4318 -10103 -12034 -26983 -29691 -27449 -10119 7693 6496 -129 2132
12084 2132 9656 -1922 -5846 -2422 5949 -9469 -12760 4524 5864 -671 -3106 -4294 128 5918
12070 5918 3636 5625 7412 -4252 -20034 -29773 -20582 -11824 -7923 -5659 16526 20267 6761 1505
12056 1505 9069 8543 -369 -13869 -6695 -3705 -1429 4873 -1151 12616 9950 5405 3435 -15809
12042 -15809 -12367 -14647 -31860 -30563 -23182 -25534 -28476 -17330 -2341 -5833 -10326 -10193 -19373 -21569
12028 -21569 -22528 -18462 -8582 -6688 -502 -1883 -14054 -11027 -4659 365 405 13469 25534 28533
12014 28533 19009 9873 -2952 -2323 13295 15059 8653 11695 18997 12909 4220 -4245 -5068 -1525
12000 -1525 5385 -4844 -18897 -14186 -14965 -6032 9375 1864 -237 9534 8239 4161 -8116 -13338
11986 -13338 -17179 -14996 -12408 -12547 -12847 -7729 -8515 -10756 -1466 2169 65 8912 17328 18547 22574
11971 22574 30288 52012 115570 219141 407421 664324 748920 610804 408502 260339 174987
11960 174987 108168 66318 48291 41018 29724 17002 10658 17685 16385 7284 19085 30154
11948 30154 14232 10221 15310 20793 24648 12696 8424 21459 20021 16492 15308 22352 15087 12410
11934 12410 15012 7457 -10551 -17765 -24957 -24840 -18490 -15869 -21375 -14653 -14268 -6592 -18262 -21309
11920 -21309 -17823 -5835 -16961 -15884 722 -869 -2217 8050 11329 3123 -3540 -6398 -11544
11907 -11544 -9106 -9294 -12434 -21184 -17875 -12522 -21031 -33597 -22676 -33778 -32531 -29149 -30043 -15084
11893 -15084 -11973 -12626 -11923 -694 2791 677 3007 5854 -9519 -17545 -30602 -32128 -17957 -8652
11879 -8652 3159 -2322 -7736 -15593 -25470 -32500 -35275 -20559 -17541 8652 10813 10298 5490 -12188
11865 -12188 -21588 -16614 -12922 -12877 -20858 -26944 -27026 -38098 -37673 -36288 -32298 -13353 -14233 -23859 -31542
11850 -31542 -42827 -21596 -5628 -3888 -8378 -20074 -18099 -23860 -22527 -28424 -24292 -17734 -29142
11837 -29142 -33261 -25278 -35340 -22272 -9851 -15738 -16988 -21818 -20231 -13995 -10256 -11983 -17768 -32304
11823 -32304 -38740 -29884 -10386 -6200 -8118 -12379 -9199 -8674 -5875 -3358 -17645 -19544 -7589 -4207
11809 -4207 2952 13702 12757 7020 10457 1297 -11729 -16028 -7327 -391 -2061 -3337 480 -1212
11795 -1212 -6272 -7878 -5285 -1098 8127 625 -3694 -12437 -15170 -16169 -11718 -12970 -25824 -25876 -12534
11780 -12534 -20064 -33049 -45070 -46623 -46519 -30549 -18068 -21076 -20679 -19173 -28959 -38627 -43927 -34076
11766 -34076 -23571 -9940 -6178 -18085 -30879 -38866 -33101 -17570 175 -1900 4620 6097 15001
11753 15001 14083 -7347 -16438 -10614 -22210 -26056 -14957 -14598 -10577 -20015 -21704 -13563 -8331 -7652
11739 -7652 -12872 -7766 -584 15904 9441 8814 197 -3260 -1176 926 -3908 -2946 271 7780 14478
11724 14478 -428 -16332 -22046 -19140 -14739 -13412 -8909 -9964 -20725 -14241 -2739 -7737 -17608
11711 -17608 -25677 -26314 -24977 -18516 -5151 -1281 -2611 -6100 -10961 -1659 6949 1647 -593 -5967
11697 -5967 -17324 -19630 -11910 -15985 -16809 -11645 -4004 9428 21102 25341 11050 3760 5172 373
11683 373 -11102 -7025 -16753 -28243 -16210 -18358 -27521 -14590 1163 -4495 -9206 -11317 -15849 -17998
11669 -17998 -18170 -14337 -5329 -5463 -6501 -1296 10907 6871 5296 1811 8213 8962 2277 -4360 -11199
11654 -11199 693 20604 29496 25526 17396 9413 10185 15282 1368 2357 20182 42055 45455 85294
11640 85294 157280 264750 369441 343218 242387 156767 103791 65535 40197 18395 14895
11629 14895 23797 4587 10981 18149 29235 34373 31799 31871 34588 33181 19244 17201 27249 41605
11615 41605 43661 18812 11361 30455 29584 3699 4062 17138 23968 22999 4400 -17259 -9372 6683
11601 6683 24584 18882 24773 14421 3729 53 442 -13644 -18943 -2335 32364 48073 41531
11588 41531 27545 24081 45602 59236 51804 41960 45982 32551 36483 53674 55244 53716 46885
11575 46885 41231 54528 66934 81461 90290 79341 64978 56720 61399 60492 57044 50699 42657
11562 42657 34900 24667 27001 31859 30968 18937 29463 39978 31858 26853 17781 22495 37310
11549 37310 45457 33812 29167 36862 49470 60173 58251 50506 61859 58323 62395 76752 86010
11536 86010 98997 100906 98801 101293 86519 68714 65479 83811 88820 75520 87426 80712 73591
11523 73591 77893 80701 64039 55942 46295 33370 29387 36123 51534 55632 49105 47695 36243
11510 36243 42054 46718 41324 46346 55504 66678 63467 68218 60891 59444 74339 76743 74896 75303
11496 75303 73995 79022 76116 49994 48162 42861 30973 23156 37005 51352 49976 22326 17582
11483 17582 20985 20199 35381 49760 42934 38639 33331 24744 19319 22602 32155 36703 36954 14218
11469 14218 1799 8310 14630 25892 35701 21705 -8625 -15313 -2623 4143 5015 8522 17437
11456 17437 12027 4939 10706 15969 17000 26577 29894 25780 14556 -5854 -2174 10005 21118
11443 21118 15889 7590 2175 -3750 -15918 -14940 -15403 -16114 -21232 -17134 -6821 -1411 -2108 -7970 -3699
11428 -3699 -1863 -304 -3849 -9494 -3429 -11338 -6720 -8191 -12374 -19241 -17984 -23003 -12446 -15235
11414 -15235 -23181 -21726 -19591 -7380 -1219 -452 -3167 -23312 -34313 -19457 -10931 -3825 6388
11401 6388 -12556 -8799 -8053 -15257 -13759 1009 11714 9501 -5283 -10432 -495 6932 -1133 -12960
11387 -12960 -28331 -16565 -5216 -8180 -19543 -31885 -24614 -13948 -5081 -3907 -3887 -17612 -11140
11374 -11140 -10009 -9119 4372 4793 5248 5737 -493 -12919 -4987 -11085 -8663 3398 10024 4684 -16411
11359 -16411 -24317 -15121 -5588 -377 5888 638 -10512 -6561 -6294 -18095 -26166 -16517 -12513 -18837
11345 -18837 1288 10536 148 -6063 -2068 12424 8617 558 -4658 -1739 -7634 -19557 -13661
11332 -13661 -18114 -9730 3131 489 -8537 -16303 -25105 -20665 -16276 2136 1615 -16032 -14828 5059
11318 5059 1709 800 6191 20465 15883 4630 2505 -19331 -24870 -15595 -6076 -2208 2740 10007
11304 10007 21983 23080 12675 -6132 -11226 1192 -2068 2762 3933 -6014 -6751 6167 13493
11291 13493 23688 9398 -16302 -36550 -36217 -26114 -13621 3738 10214 8650 -11062 -17783 -11291
11278 -11291 8338 19943 644 1073 1714 7926 7272 8689 15986 10581 -4547 -15671 -21491 -25283
11264 -25283 -11077 16724 14470 -5733 -9049 -10675 -19758 -13464 -4167 -8347 960 2042 -6924 -21536
11250 -21536 -11144 4193 3145 -15664 -12754 -9790 -15587 -3708 3617 -439 -631 -10612 -22041
11237 -22041 -18876 -9061 -6346 1886 12479 442 -11231 -4611 3569 1450 -518 6954 14511 -3869
11223 -3869 -17366 -8001 6015 -2040 -26263 -37701 -22734 -14787 -25011 -20665 5034 10831 -6687
11210 -6687 -15404 -21200 -4521 6006 -3880 -13026 -12121 -20268 -18144 -2893 6987 12426 10534 2745
11196 2745 4456 3792 -8230 -6151 3925 -7766 -32802 -35652 -8332 267 -9045 -13101 -12364 -8240
11182 -8240 -12665 -6225 8003 13579 2777 6437 810 -4320 -3629 -1468 -13104 -1390 8545 11559
11168 11559 4621 5455 12548 1582 7784 20213 23874 11939 1911 -16505 -25507 -18509 -15762
11155 -15762 -15522 -13180 -21713 -25773 -21522 -17753 -6948 -4819 -2914 1832 16919 30680 5023 -10614
11141 -10614 -5772 4476 7290 26736 33665 37489 17606 -17464 -12924 18403 28269 21610 16740
11128 16740 5659 -5689 -3515 -6557 -2030 -3906 -18361 -12811 -9481 -11076 -4638 -4890 3060 -2935
11114 -2935 -16397 -22206 -37657 -36734 -10472 -2151 -9623 -24771 -12163 7124 8236 13091 11094
11101 11094 2966 -4488 -5185 3579 10682 16039 11466 8374 12573 18339 16175 16615 15804 30949 40837
11086 40837 35212 31339 29067 15860 8011 3154 -699 -6330 -10655 -5827 -1561 -14 6482 -2098
11072 -2098 -13910 -19995 -24974 -17030 -9947 -7573 -6429 -14690 -9861 14744 7106 -489 -9546 -9552 -6567
11057 -6567 899 16989 17524 6944 7550 21342 25793 13663 7096 17380 20067 26054 30766 46844
11043 46844 67812 67036 67236 69659 67047 72349 72701 77714 104225 125378 146259 168403 181324 157265
11029 157265 143068 136080 120569 114632 114263 112454 112652 100289 112532 148377 137669 126683 134608
11016 134608 131925 108603 94906 82635 75366 74418 89591 97551 108649 115620 92038 82645 72329
11003 72329 47169 41325 49321 63352 55284 40246 26275 26592 32756 35682 37359 33509 20125
10990 20125 8823 415 9195 8930 14732 17814 13340 7543 -3037 -11204 -812 2910 1672 8253
10976 8253 3718 1707 -13406 -13551 875 -3496 -11703 -14429 -13697 -257 11138 9409 5925 13740
10962 13740 25264 20472 19898 24139 19880 17743 19751 17328 23346 16848 3623 -5023 -12237 130
10948 130 851 -69 -4193 -7682 -1981 2436 1963 -759 14550 22953 25945 24907 18492 18111 16576 16178
10932 16178 12278 -3950 598 211 -3609 6227 2716 -4843 -1734 -1248 9511 28542 38912 23449
10918 23449 15754 12805 11821 16958 -879 -7420 -550 15143 15811 10117 11247 6837 3632 18972
10904 18972 21595 19345 21940 16978 3509 1139 3679 -6517 -7633 2287 10536 10476 3640 9696
10890 9696 12907 9127 12674 14926 22289 26128 28155 29317 28951 15517 -8428 -23524 -16826 -5255
10876 -5255 17387 27747 25512 12334 5853 12237 15379 9444 -6172 -7607 -6566 -5145 -10927 -13137
10862 -13137 1537 13369 19758 27739 28491 32004 33558 40400 50334 45022 32321 33084 54323 54357
10848 54357 52283 46224 44121 45422 47001 47383 38857 45108 52283 46454 44204 47494 60175 57893
10834 57893 65843 71256 65475 41861 44033 45078 45739 48760 48088 42495 42989 43487 56374 75104 96564
10819 96564 104124 110944 124870 143884 189124 247336 333243 487621 722247 1052819 1370669
10808 1370669 1528272 1540749 1563343 1563491 1389381 1087734 787288 574549 431337 306964
10798 306964 233552 186270 148134 131718 116803 102893 75893 58999 57117 59657 70200 80769
10786 80769 81798 83132 78833 61804 30765 29406 37801 30028 35927 39806 45369 35616 20743 18708
10772 18708 23162 31998 32258 27536 16683 20463 29752 25763 20771 22425 18501 26777 19414 23259
10758 23259 26150 34919 48196 52509 40785 37262 36769 25585 16888 20469 17297 13700 15902 28754
10744 28754 39509 67693 81691 73838 68869 60844 64144 65294 53780 38238 32606 35290 42301
10731 42301 48916 53011 57625 34471 40814 56778 61175 74934 77573 73270 63680 63425 68151 56219
10717 56219 58375 65548 81136 90907 101041 93547 79459 81579 86946 89567 69292 54401 51504
10704 51504 58201 62527 52794 59451 75364 89615 85861 95332 113231 124100 120096 104354 92012
10691 92012 95685 96205 88076 69376 62306 65929 77237 64157 64161 62900 67609 72876 77228 90014
10677 90014 87273 89299 87709 86137 87330 97475 111861 112560 116609 106987 106709 106706 118681 129630 150587
10662 150587 165002 172122 179473 207877 241815 261208 259930 249264 257155 256570 247903 237220 224055
10649 224055 217684 218313 214708 227341 248584 255426 242382 243240 256146 256667 271979 273382 273040 274301
10635 274301 295298 325819 356650 383341 419105 460722 502179 551900 581730 623933 694367
10624 694367 779888 895031 1036605 1221378 1497048 1890189 2433291 3190298 4184435 5413050
10614 5413050 6718651 7773982 8256827 8159998 7765447 7353912 7138466 7283931 7887280
10605 7887280 9064236 10917465 13420229 16065478 17926909 18267983 17233260 15595334
10597 15595334 14063849 13086491 12831067 13396345 14857325 17289128 20507577 23720604
10589 23720604 25544912 25035643 22594616 19466234 16629513 14530382 13302271 12931681
10581 12931681 13386208 14616353 16359551 17961820 18502278 17479883 15285990 12765793
10573 12765793 10565613 8931325 7887966 7382471 7311461 7589067 8048519 8366415 8223517
10564 8223517 7514748 6391996 5160797 4045667 3143713 2455571 1944087 1556651 1259688
10555 1259688 1047495 892663 778777 696080 614752 555933 522097 483740 432684 395032 367885
10544 367885 337055 303652 284582 282073 282108 272577 260208 252333 243614 241675 255449 274894 328809
10531 328809 390832 448297 488502 504893 528801 543573 522940 490348 485859 457715 427068 415073
10519 415073 414988 400647 391523 378558 384170 378206 372382 377299 372829 361777 350654 335555 315893
10506 315893 308505 306701 312574 304467 297017 302657 313294 313695 303761 308228 294953 288053 275383 267199
10492 267199 255159 245740 251394 245921 237634 244988 261833 261466 258498 266542 297247 296883 297579 302739
10478 302739 307690 316567 324861 339397 344212 367013 385574 405916 411033 423472 427832 434660 454282
10465 454282 472958 478305 496517 523115 538464 553573 553972 562904 591173 607998 609251 635663
10453 635663 658704 668784 692908 727440 765007 824402 865807 896117 939824 977513 1002411
10442 1002411 1034759 1061397 1080325 1089320 1099310 1135005 1185912 1245057 1324945 1419341 1541470
10431 1541470 1676057 1848055 2051664 2300458 2610824 3065171 3643069 4158263 4563632
10422 4563632 5046028 5724412 6285629 6479187 6534932 6749376 7057887 7299929 7558784 8033851
10412 8033851 8866375 10120511 11835594 14051027 16919483 20766803 25861881 32774075
10404 32774075 42999321 59468428 87006436 133012549 200379213 264780468 291269549
10397 291269549 291268407 297081760 300726403 268277094 206141685 144502754 100251134 71310995
10389 71310995 52489094 40006553 31323441 24981187 20235829 16666265 13970445 11895963
10381 11895963 10285637 9034999 8099991 7445664 7048372 6773574 6395574 5969287 5640028
10372 5640028 5346528 4889263 4296925 3747731 3326256 2987261 2707901 2485672 2303940
10363 2303940 2165646 2054207 1934739 1832202 1760824 1668599 1565915 1484209 1386852 1272225
10353 1272225 1177628 1096575 1037870 980934 926102 885043 848919 821240 804541 783161 747334
10342 747334 706970 695406 679585 648022 621559 597692 558702 565018 561438 533619 505549 494315
10330 494315 467243 439911 421897 412964 395548 392965 402982 397602 394302 389847 377517 367112
10318 367112 378622 387748 387423 380050 371468 390386 384130 370703 366566 345380 323041 313873 302648
10305 302648 308462 311021 285079 287174 282354 279548 275535 262072 248216 224542 219709 221933 225710
10292 225710 220616 204478 205412 207691 193012 168921 156661 145652 131785 118712 99561 85757
10280 85757 73510 64273 45820 37785 35348 49068 54982 60134 64783 70154 71164 46020 14609
10267 14609 -12492 -10985 -9069 -28318 -58712 -63669 -49230 -17000 12658 30213 30822 41920 59538
10254 59538 70580 80875 81781 76895 77966 84371 94143 75342 63804 73929 81219 103484 109968
10241 109968 98063 88172 96114 112874 99413 76393 59437 50833 60922 63450 63999 47665 42331
10228 42331 41347 39661 37443 29289 21521 5921 -7288 -8715 -14446 -31703 -41308 -34723 -31231 -9329
10214 -9329 12761 18033 17058 24387 11685 18741 37836 44636 55739 53740 52054 32462 9522
10201 9522 -6765 -11137 -1783 -14473 -17924 -16177 -4273 3037 1157 -945 1268 6650 19447 34795
10187 34795 41649 46639 42136 33206 22877 18222 24327 41958 59506 68077 69151 80739 101523
10174 101523 112136 115147 105642 105313 115328 119038 124054 141065 155684 165933 169353 174422 166427
10161 166427 150650 141980 127251 114449 115823 131739 149346 161254 171219 190347 187821 162838
10149 162838 141851 153109 150537 134090 134373 144510 141043 135335 135201 154308 150150 129040 109971
10136 109971 93153 96300 103360 109039 106902 109878 112429 98876 85187 61469 40461 32041 25370
10123 25370 7785 -6405 211 -238 -10236 2948 3848 11650 10601 16023 26620 32982 30610 15998
10109 15998 25116 27323 29604 40246 46260 38055 28492 13725 8286 -1883 -23189 -13081 -8596
10096 -8596 -3645 -2981 -14057 -7329 3270 7242 16357 19360 23922 31848 36406 39051 29036 24299
10082 24299 7105 14838 13015 8421 5251 -445 -2586 -15468 -24263 -10099 -5368 -5589 14950 23318
10068 23318 25983 26795 31489 19477 6948 19184 27693 26857 11255 7947 -4257 -13593 -13403 -22219
10054 -22219 -25754 -23399 -9650 -13616 -21910 -2757 7122 2777 -6478 -17151 -10776 212 5383
10041 5383 -6555 -18499 -13449 4587 4867 -2373 6077 11859 8050 19253 10175 2928 2967 -4457
10027 -4457 1665 31357 51015 40670 43245 40694 31350 18633 15775 18007 24490 19450 22378 24207
10013 24207 28241 33923 48412 42515 24232 16204 29012 49387 65018 72983 71414 68631 58390
10000 58390 66647 67699 54025 52277 49466 49546 63086 78524 97055 114667 152559 192168 249150
9987 249150 355305 523865 777560 1127174 1404617 1506970 1522116 1564468 1558438 1353544
9977 1353544 1028057 734544 520127 389800 296226 224065 172144 137511 103667 84134 66292
9966 66292 50010 49501 49742 44126 38755 25826 38572 46451 43828 44122 40913 40268 41640 18844 -3672
9951 -3672 3344 13800 22341 23309 19130 16190 9149 13915 12763 2193 -5882 -12657 -5968 2202 5912
9936 5912 -7962 -9045 3218 10832 8729 24115 26827 31483 50049 63151 63927 40890 30932 49708
9922 49708 49793 29890 32911 34191 24096 14518 1359 6405 -3917 -1677 -1205 -11137 -14224 -11556
9908 -11556 -11410 -19112 -15928 4066 19610 24343 21431 26123 17250 3148 3744 8035 11314 4463
9894 4463 2293 -418 -5844 6292 18480 22572 23183 26105 19108 5578 5531 -2722 -8806 -13613 -10467
9879 -10467 -9759 -14113 -11668 -4172 -59 -3467 -621 -5930 -5635 3281 -1704 -4189 9520 4316 -12681
9864 -12681 -21221 -9003 1028 -3225 -4850 -3040 -3820 -5167 4029 10773 7275 -6821 -1961 9762
9850 9762 15527 2557 8025 12363 8020 10753 18024 22387 10524 -334 3780 9670 14540 -6494
9836 -6494 -4338 16098 14281 16612 4375 344 7050 7220 28687 31543 15128 5291 4554 -596
9822 -596 -16449 -9961 -2337 18190 19406 23023 26975 13715 19481 11615 3160 3730 2235 11955 14093
9807 14093 11710 8851 8652 11523 11986 -745 8551 10747 -1922 -3223 2756 18665 11715 6076
9793 6076 13728 26094 27971 37473 40351 26158 16746 11921 19731 12069 2379 -5151 428 7533
9779 7533 9975 -26 1953 4278 -6216 -15272 -6650 -1299 -5851 -19003 -15153 -5349 -2938 10135
9765 10135 24378 23210 21961 23203 25798 16630 5699 -1167 -458 -1161 841 -5134 -10890 -7191 -8828
9750 -8828 -11388 -6937 8589 20115 9762 13247 14407 5308 7897 14075 8652 2630 -288 2913
9736 2913 13859 14396 9573 -14757 -34378 -12321 10488 11862 1625 -11801 -16482 -18569 -21626
9723 -21626 -22774 -24811 -23575 -14453 -17397 -22083 -16414 -23002 -11244 5686 8737 -6790 -10352 -2135
9709 -2135 12838 18716 25337 18799 15199 34231 29074 26924 24330 -230 -13436 -5030 -9758 -10246
9695 -10246 -7820 4377 19925 20487 10994 2611 4210 8679 -1085 6314 22342 16629 10956 2991
9681 2991 6345 30632 29716 26569 15690 6791 -1442 208 5487 16752 13283 33114 59505 63876
9667 63876 64004 62597 49464 49668 62233 53899 38865 40479 32136 29088 7590 742 552 -4320
9653 -4320 -12462 -14355 -14932 -4691 7123 14425 33659 70792 85810 71273 42646 15970 2658
9640 2658 -4164 -14148 -18527 -18273 -10100 -16422 -19541 -11799 -6027 -21066 -18549 -6384 -3660 -6493 3641
9625 3641 29561 20770 8636 -506 770 -1084 -2252 -6327 -231 6159 11948 13212 4738 -6122
9611 -6122 2541 6390 17731 20946 5911 5258 2038 7114 8514 7559 -5856 -17425 -407 12595
9597 12595 7107 10656 4083 -3418 -11723 -2436 -487 3005 13728 18080 17413 18279 29090 30294 28445
9582 28445 23970 35280 50845 67097 66869 87150 108562 126151 135206 128860 88959 68608 62941
9569 62941 45062 35873 22960 4932 -1612 5916 12138 20605 23345 22446 23144 25053 51628 74079
9555 74079 70552 64664 52044 51307 76907 76459 77732 75045 58562 43400 41668 33781 34875 40366
9541 40366 47621 50811 35601 31759 47099 69410 90281 102478 134269 180987 230963 266967
9529 266967 277955 245154 188374 160084 138954 110879 88459 63977 51038 33278 22135 25177
9517 25177 51416 58364 63847 80835 84822 76977 89315 105063 95472 87206 80890 75087 89883
9504 89883 100444 83251 56592 47420 37701 30285 12655 111 1665 1123 -1089 -4766 -8487 2800
9490 2800 30323 37091 47864 68442 80299 85191 86864 73733 69214 51564 32667 27003 30497
9477 30497 37871 30866 17505 22775 24064 17982 14154 11551 4648 3939 3672 -5271 8073 5641 3076
9462 3076 4217 220 640 -7018 -6907 -2453 -8432 -5606 -4709 4640 17438 17688 5554 -1600 13358
9447 13358 27839 23321 19487 14048 12866 10088 1700 -19767 -30794 -14857 -4396 -10385 -11424
9434 -11424 -886 -7832 -8508 -907 26245 30226 21339 20047 18788 10623 8614 -5875 966 1471
9420 1471 910 664 6169 6291 -7565 -16346 -25019 -32764 -26862 -19347 -3196 -4968 -13737 -16244 -10428
9405 -10428 1446 10469 22777 27117 23720 19024 8987 683 9069 16691 15932 11943 5842 -3669
9391 -3669 -24242 -25412 -11301 -10801 -14472 -7772 -1819 129 9430 16754 15277 15609 18628 12243 16225
9376 16225 12131 -3269 -15374 -15458 -14336 -6537 -8315 -17334 -8858 103 -5115 -349 15705 14501
9362 14501 3406 5122 -8921 -7270 6766 6587 -8983 -19156 -9170 -315 5616 9320 13726 17019
9348 17019 -6398 -20633 -18941 -8834 4040 5555 31270 49502 40954 30625 15116 -6848
9336 -6848 -16351 -15689 -8774 -18845 -24400 -25452 -13612 -1291 5283 -3347 -13915 -10573 993 -600
9322 -600 -317 -2135 -9495 -2528 -9373 -11656 -2079 -4067 -6171 -5586 -16737 -16416 -16232 -25580 -22687 -30374
9306 -30374 -14749 3740 12915 10506 6824 -2904 7035 7064 -6704 -9486 -3950 -9655 -1036 3605
9292 3605 13794 11695 0 -6481 -19594 -27399 -14776 -6477 -15331 -26161 -22566 -16701 -21903 1420
9278 1420 3417 -4817 -14246 -11434 -18441 -11792 -13712 -28440 -28303 -13661 -7781 -16168 -15950 -17050 -13461
9263 -13461 -12082 -13633 2382 7682 355 963 3365 4112 -1851 10140 -3619 -2461 -4922 -16700
9249 -16700 -10727 -1767 -3857 -4598 -8506 -14840 -16193 -9379 -25009 -30982 -33143 -45175 -34276 -24305
9235 -24305 -15439 -17556 -13904 -15920 -20180 -26889 -23917 -25752 -32215 -26554 -28916 -15973 -8197 -5552
9221 -5552 -13943 -11777 -9219 -5425 7957 -4268 -11926 -19143 -22420 -29078 -43014 -40272 -34518 -29312
9207 -29312 -37877 -27270 -8392 -9838 -16195 -11153 -4142 -6620 295 6362 11391 5408 -720 -2419
9193 -2419 -6861 -2102 -5625 -10931 -11204 -21939 -31325 -38284 -33952 -26538 -9324 -3572 -14647 -28497
9179 -28497 -17746 -18234 -25659 -27212 -15208 -6495 -10566 -420 4553 1269 285 21 4271 1819 2146
9164 2146 -6078 -22290 -19575 3080 2425 1742 -4182 -14673 -21142 -19516 -20040 -11101 -5320 -18155 -13972
9149 -13972 -4078 -18851 -32850 -26827 -14102 -23191 -34051 -31400 -30328 -7315 9513 11516 6683
9136 6683 -2362 1162 7333 5608 1910 3163 -9296 -22912 -13014 -5580 -2038 -8442 -10211 2965
9122 2965 15335 2123 -18098 -23523 -31874 -30033 -16241 -1877 14503 12658 -1485 4010 515
9109 515 -10563 -1058 4578 289 -5612 -9207 -19702 -24424 -22334 -21325 -23007 -17554 -3292 10506
9095 10506 5962 14908 8189 11851 -790 -18864 -20779 -21047 -22484 -12842 -11807 -17041 3228 8746
9081 8746 2263 -360 10547 9761 -9950 -6956 -3046 -10569 -11793 -20420 -20793 -20845 -13439 -8318 -7506 -17626
9065 -17626 -10880 -15369 -20608 -23088 -14011 -15551 -8756 -9752 -17349 -12818 -11312 -6034 -9209 -9609 -18280
9050 -18280 -17211 -20971 -40049 -28787 -19127 -12200 -3833 -8350 -21639 -20118 -12030 -7658 -20626 -19973
9036 -19973 -21926 -19939 -32173 -26847 -7692 -11233 -25748 -35411 -37817 -30934 -27212 -36589 -42027 -33174
9022 -33174 -22638 -19710 -19905 -20465 -25634 -9777 -7873 -9066 -5291 -14274 -22697 -15807 8943 8120 -5826
9007 -5826 4445 8481 -1910 -23721 -23786 -11846 -8785 -1656 -10639 -25106 -21959 -14138 -12844 -12344
8993 -12344 -8121 -4900 -4569 -19618 -25585 -16702 -11783 -18202 -15957 -12193 -16993 -13214 -5957 -6382 -16317
8978 -16317 -14353 -14229 -12637 -20106 -9998 4059 -4895 -22516 -32371 -43085 -31683 -23373 -11994
8965 -11994 10990 22307 196 -12407 -1692 -9384 -16007 -16948 1022 9693 1954 -19101 -16948
8952 -16948 -14430 -11959 -9172 -7175 -23209 -23856 -23407 -18924 -15032 -5886 -1822 -14024 -18200 -10322 -11090
8937 -11090 -12686 -9956 -7155 792 6591 3759 -8452 -22839 -21606 -3654 11309 13744 5011 -14447
8923 -14447 -19094 -1572 9394 -5190 -15306 4394 -229 -14795 -18004 -21047 -33021 -28965 -29890
8910 -29890 -32638 -29689 -21212 -9434 -2805 3203 -7295 -3748 1941 9209 12685 15856 13839 1950
8896 1950 4734 -8255 -12106 -7402 -6903 -21482 -18000 -9119 -14445 -23302 -17921 -2524 -2069 -5215 -15325
8881 -15325 -14714 4237 13158 24574 22061 6725 -12018 -20571 -19028 -4414 797 -2088 -2200 382
8867 382 -7582 -1221 5377 -4874 -24074 -28775 -21204 -25306 -29710 -24462 -20702 -24440 -27226 -9382
8853 -9382 -3913 -1887 -9282 -25910 -18110 -19190 -27733 -20913 -26410 -27399 -25649 -10766 4621 8893
8839 8893 -11414 -22663 -36931 -43011 -35171 -15603 -5392 -9060 -9210 -4996 -6913 -2892 -4799 -23444
8825 -23444 -18390 -9786 -2965 -3530 -15459 -5485 -2626 -1918 -4216 -15164 -14795 -1001 -1400 -15416 -21892
8810 -21892 -22163 -12514 -12402 -34844 -38451 -27013 -19097 -5268 -3209 3905 -3241 -17850 -16677 -3826
8796 -3826 -4657 -9202 -33831 -28001 -5671 -356 -2397 4420 14883 12154 6478 6689 15279 24465 35833
8781 35833 8960 999 1625 7885 -1122 -5852 2571 13604 -336 -7485 -9715 -9505 -25204 -14055
8767 -14055 7532 15318 8660 2120 1396 2025 7199 9415 7952 9718 12470 15530 20649 23819 15251
8752 15251 633 -21345 -22984 -29342 -32251 -9946 -891 9552 5323 -9950 -8084 -14761 -25925
8739 -25925 -11436 -11924 -1801 2188 -7527 -9602 -8164 -6752 13523 11438 -7735 -14017 -12872 -21797
8725 -21797 -20851 -11830 -607 9117 8556 7715 5023 -3509 -15243 -16448 -12269 16 -5555 -23441
8711 -23441 -32362 -45320 -38741 -23256 -31085 -19814 -13345 -18020 -11197 -1675 -10892 -9031 2218 -8975
8697 -8975 -10770 -1595 -3583 8304 9587 -7506 -14907 -12457 -4426 -8344 -20141 -10113 -16004 -8903
8683 -8903 -8330 -4495 -16619 -32807 -35530 -24746 -24532 -22793 -2936 327 -6304 -18165 -19654 -823
8669 -823 21083 17942 10904 19319 5618 -4451 -6977 -13356 -11278 8237 18451 11410 7946 8113
8655 8113 3248 3950 1923 16991 25276 15463 4226 1255 8103 -9394 -18872 -21857 -28570 -23355
8641 -23355 -9499 -4511 -10772 -18460 -26758 -24851 -33587 -34833 -40063 -35816 -39431 -21322 -13465 -13751
8627 -13751 -18991 -21043 -17487 -3302 5217 2138 7974 20480 10938 8789 -9144 -7330 5682 10604
8613 10604 6408 -6940 -5904 -4750 5977 6035 -4073 5058 -10205 -12539 -9393 -7830 -7227 -11603
8599 -11603 -27478 -28555 -21744 -5413 -10819 -13644 -10651 -7124 -3944 -13982 -18844 -11438 -4891 -10164
8585 -10164 -18145 -16764 -16738 -11567 -11641 -11656 -6904 -7575 155 14104 29124 33652 40986 43994 31300 26540
8569 26540 31919 36462 22501 1524 8962 10282 9941 12609 18153 18147 2302 -10443 -15433 -21681 -19998
8554 -19998 -14965 3963 9093 -433 17884 25061 18055 24341 12838 -2771 -6314 7606 19643
8541 19643 17784 13456 -2298 -3117 184 1166 5716 -8515 -14198 837 9007 1378 3023 -3452
8527 -3452 -15457 -8727 -11725 -13385 -19457 -36964 -51543 -52775 -44891 -24161 -23411 -27780 -23134 -21111
8513 -21111 -19872 -28208 -28851 -35590 -24297 -3174 8783 7561 17322 17080 7969 10870 6335 -221
8499 -221 -696 -3280 -2602 -1757 -8878 -7733 -8051 -7598 -6491 -11145 -6889 6184 15439 8029 1712 6599
8483 6599 12771 7541 -8627 -12134 -12644 -9980 -3176 -1655 -8490 -9407 124 7991 105 -7994 2301
8468 2301 7758 -1917 -182 15952 10936 6180 -5971 -9613 -7855 -1588 -1115 2036 342 1115 -10121
8453 -10121 -12509 -11740 -12971 -128 2318 -5063 -27031 -32757 -17376 -19810 -16985 -20239 -35678 -37990
8439 -37990 -31960 -28512 -21988 -12675 8394 18783 21560 2811 -12001 -1278 10858 -2241 -9388
8426 -9388 -17022 -11395 -659 -4517 1129 6944 -15454 -24971 -6260 7284 9355 -3878 -18999
8413 -18999 -13364 3978 13730 13120 10125 1195 -10348 -18658 -33675 -26687 -30639 -34230 -43338 -42677
8399 -42677 -42367 -48753 -54242 -53084 -46338 -39528 -40764 -48883 -27992 -20600 -26038 -29121 -16414 -1353
8385 -1353 -891 -14790 -11817 3418 10448 9357 332 3460 10741 10665 -12247 -19188 -15700 -27870 -28240
8370 -28240 -21747 -21318 -20423 -6756 -4315 6956 -10174 -25875 -23452 -22057 -18992 -18520 -13265 -8954
8356 -8954 -8196 3232 8876 5925 -6918 -18729 -32570 -24694 -5010 9864 3089 5930 6708 -2999
8342 -2999 -9062 -16146 -18313 4709 10484 7351 4877 -6586 1684 -735 -3337 3975 6457 2863
8328 2863 -14298 -18801 -9435 -5239 -7362 -10562 -16413 -11065 -10867 -15659 -24306 -14812 -8194 -5738 -6279
8313 -6279 -8155 -5137 9884 12243 46 -7458 -16750 -25970 -22164 -4731 -9613 -3236 -835 -17428
8299 -17428 -37658 -25492 -7102 -4470 -3493 6883 17592 19939 16674 8644 -4927 -12325 -10364
8286 -10364 -17511 -7626 -13822 -21298 -21245 -7192 2066 7033 136 7410 14156 15310 468 3467 4797
8271 4797 1490 5996 10555 3268 -1365 -4953 -11782 3099 81 -6680 -889 1420 -4316 -16557
8257 -16557 -10509 -4161 -3259 5426 18746 30630 26759 13835 5793 8604 1602 1948 -2423 -4637
8243 -4637 -6706 -925 14226 2100 -20783 -31473 -18261 3214 -201 4118 3486 -19692 -24135
8230 -24135 -27930 -33703 -29260 -19720 -22966 -21045 -16066 -18114 -12571 -2897 -11186 -12849 -14078 -8708 -16398
8215 -16398 -15072 5639 26356 39844 27102 24842 20503 17496 23679 27260 12044 -1637 -24879
8202 -24879 -17602 -9555 -1634 4553 7534 1915 -1163 -8389 -14477 -4449 19329 23357 20639 1728
8188 1728 -12646 -11569 -4134 -7590 -6244 -4464 3592 172 -1022 12954 11698 -10927 -4828 12187
8174 12187 8148 1534 2877 -7562 -12731 -28267 -33521 -17831 -7168 -12451 -20703 -27651 -24858 -16684
8160 -16684 -36763 -28444 -18329 -23352 -10875 49 3004 7515 6555 -14442 -10879 -5804 -11261 -20510
8146 -20510 -6833 -933 177 9816 10761 11833 12830 5897 14162 11989 3075 3308 -6009 -10136 -14547
8131 -14547 -16245 422 19808 19318 -437 -17517 -10224 -5301 -3965 -4450 -1001 8928 2872 -14267
8117 -14267 -15790 -14675 -8462 -4587 -6516 -13430 -9289 961 2436 176 -8095 -23578 -26696 -15542
8103 -15542 -10707 -10758 -8986 6122 18157 18558 16006 16791 19264 5010 -14289 -18803 -13801 -9311 -5355
8088 -5355 4136 -4982 -9314 -11635 -17251 -15204 -8754 3777 -7155 1064 4508 -4955 -9372 -26282
8074 -26282 -28315 -15640 -7885 -10398 -17913 -13892 -16491 -9971 -1381 -8361 -2732 7239 -1735 -17579
8060 -17579 -24086 -34971 -34488 -28259 -42624 -44782 -29208 -32221 -25525 -23493 -31865 -24092 -15906 -8240
8046 -8240 -5055 -5121 -14673 -6349 1156 8045 1505 -4695 4557 15007 23458 24230 13837 4440 -187
8031 -187 -1210 -1738 -11717 -14544 2873 10667 3054 1845 3057 5994 2484 223 -6793 -9161 -24697
8016 -24697 -22566 -5723 8262 23709 14405 -7607 -29942 -12667 6488 -3528 -11304 -15984 -10719
8003 -10719 -2332 -15225 -3203 5731 -13229 -15423 -14699 -15403 8865 15727 4288 2690 9318 3335
7989 3335 -12930 -7721 -9736 -17365 -18430 -22175 -20552 -8447 -3560 -5908 -5897 5454 4724 4082 1300
7974 1300 -6543 -6812 2325 9178 209 -4695 -10343 -13587 -4147 3945 15204 10954 -13992 -10915 -18159
7959 -18159 -28179 -9809 2647 -6284 -14071 -8181 -7348 60 -11506 -18714 -6680 -6449 -22245 -20457
7945 -20457 -6271 -4081 -403 -3727 -18145 -25796 -17194 -7666 12906 18525 8530 -2466 -4717 -4413
7931 -4413 -12457 -4751 7605 8909 8994 -8558 -5328 -4462 -21538 -30820 -26882 -12746 -2702 945
7917 945 6423 1558 7313 18107 22173 13297 -8478 -9133 -7519 -11040 -17050 -10320 11753 25803
7903 25803 24914 5942 1992 10002 7858 5130 6139 20890 28487 34711 5899 3318 19350 18413
7889 18413 24199 25633 5778 -1497 -16392 -22956 -5159 708 -2109 9 -4208 -12359 4963 33446
7875 33446 30082 25253 15845 3846 -302 -2664 -7597 6210 14526 -1322 -18274 -16434 -19385 -8516
7861 -8516 -15673 -16073 -11130 -8724 -17685 -25879 -27902 -25250 -26812 -28993 -20670 -2714 6138 1401 -4333
7846 -4333 5860 13610 16785 9834 6074 2782 -3252 -18974 -23015 -19855 -11663 -14971 -14600 -15284 -18410
7831 -18410 -10729 -19405 -13249 3135 8370 4864 1331 -19203 -35521 -24207 -22628 -26338 -33165 -21313
7817 -21313 -16242 -10741 68 6636 11473 7476 -10081 -15651 -4455 2608 3149 -7179 -21043 -11009
7803 -11009 -1019 -4848 -2400 2382 6169 -6422 -8776 5499 -2347 -10498 11647 31120 24955 3971
7789 3971 2581 11468 9124 233 -13407 -40118 -43558 -18249 -25946 -32868 -20942 -20422 -10811 1181
7775 1181 -5692 -7015 -14057 -18228 -18254 -17597 -19982 -11994 -5937 -16791 -17644 -12395 -20422 -11946 -13538 -26371
7759 -26371 -12397 -18528 -11822 4551 15758 13448 13628 11894 2041 -12241 -16708 -7102 -15537 -23275
7745 -23275 -31493 -25744 -29642 -24320 -17137 -16828 -596 10124 17064 8662 -6959 1139 -2269 -1012
7731 -1012 -2463 -9236 -18573 -20439 -10756 -896 871 14897 24097 28082 17368 695 -960 -733
7717 -733 -6925 -846 2463 4259 11914 2547 -2744 -2518 1323 13987 17783 6850 -8608 -13704 3697
7702 3697 7790 -7037 -19534 -10334 1245 8869 14919 5028 -10375 -18758 -17129 -7109 -8087 -16263
7688 -16263 -20202 -17948 -2323 7846 4752 1759 692 -9479 -4536 -2737 -9137 7032 11745 12864
7674 12864 13658 10296 10417 12322 4511 -12867 -11419 -9404 -5508 -11604 -16320 -14170 -15081 7047 10289
7659 10289 3825 -8393 -16722 -15779 -7498 -10079 -15573 -8867 6313 -955 -7369 -2297 -2712 -9911 -15847
7644 -15847 -8928 4045 1604 -2553 -9348 -14321 -5789 14657 14685 -3141 -20397 2738 10786 4649
7630 4649 -8383 -14365 -20111 -24164 -23562 -19863 -11007 -13969 -17738 -14560 -7943 -9997 -11985 -816 1844
7615 1844 4360 -3956 -3206 -3770 -8470 -25106 -22333 -8638 -15898 -18088 -24510 -32610 -10213 5287
7601 5287 10266 9623 2851 -9893 -13767 -9618 -18233 -4629 8904 -1061 -11558 -11640 -14973 -18506 -15543
7586 -15543 -14170 -7152 -12976 -16979 -8894 -12724 -13761 -5158 -7517 -13039 -25976 -32222 -11430 1437
7572 1437 -6901 -10581 -11419 -18648 -24181 -20282 -15144 -9220 -4482 -1822 15547 5905 -21109 -31575
7558 -31575 -13855 2078 4991 5656 3209 2907 -11469 -7018 -13984 -11070 -11106 -4130 24267 47174
7544 47174 35358 20375 6777 4652 7984 5360 11028 18895 13076 9053 1190 1568 -7292 -7417
7530 -7417 -1692 -13807 -18117 -14923 -16861 -24422 -32577 -36264 -37945 -40467 -37254 -25377 -11046 -11748
7516 -11748 -17764 -14505 -20885 -12413 -4631 -3740 -9998 -15877 -173 9472 9313 10303 -1369 -18574 -31435
7501 -31435 -22565 -22706 -17067 2674 12695 11115 6904 3509 -4385 -16985 -13783 -15985 -7866 4933
7487 4933 9118 11257 6301 3930 19173 18288 1669 -3747 -1432 -4119 -4687 -2879 53 14647 38492
7472 38492 29412 28291 21326 -2191 -5304 -8835 -2711 -2045 -14636 -18113 -16405 -16860 -167 9847
7458 9847 14054 2821 -1373 -2656 -4928 9171 21274 14425 14887 4990 -6860 -11370 -17623 -7004
7444 -7004 -11109 -14166 306 -173 2062 -11019 -20029 -12761 -12499 -8769 -4642 -1835 1353 -5209 1839
7429 1839 -8164 -5805 1533 -3253 4500 4416 -14683 -23416 -16691 -20569 -28150 -22556 -22326 -11517 -2410
7414 -2410 -406 -3570 -134 1479 12365 30858 41930 31227 9535 2160 -7210 -3673 -11289 -23341
7400 -23341 -20002 -9270 -14399 -7614 17001 18311 17280 12861 630 50 7432 16108 6767 7806
7386 7806 10743 13586 -1187 -12523 -15163 -14394 -4967 -2194 -5661 -5533 -483 -2693 -7620 -14270 -32892
7371 -32892 -43574 -25098 3018 9615 1329 247 -13544 -33141 -31703 -21945 -27152 -12892 -7200
7358 -7200 -13998 -23302 -25517 -23846 -17541 -12141 343 -2286 -11349 3691 11769 13144 715 -9054
7344 -9054 -5347 -10122 -15432 -4675 -3834 -565 9039 13351 21386 6541 1571 -8264 -10397 -3979 3058
7329 3058 7127 11465 -4302 -12608 -19372 -12448 -19905 -23444 -24122 -20130 -23716 -19256 -17681 -16233 -20024
7314 -20024 -26265 -14856 3379 2630 1000 -16601 -26626 -10378 -12268 -9231 -9854 -30860 -25724 1382
7300 1382 -169 4378 3829 2405 5769 -6073 -26311 -22294 -17956 -9083 2684 6813 4824 1066
7286 1066 12354 19810 9718 5061 3291 -16964 -31813 -27188 -24249 -26301 -10854 -4562 6138
7273 6138 5507 -3129 2118 -3683 -4437 -10302 -14474 -13510 -17603 1513 7189 -3697 -17377 -24921 -20128
7258 -20128 -22762 -22469 -21788 -20458 -16942 -26829 -27243 -17890 -2064 624 -4404 -9586 -20121 -3422 7006
7243 7006 2568 4358 4255 3476 496 10413 22483 7711 -9575 -14913 -26009 -25222 -17688 16752
7229 16752 31910 18405 11476 13696 7272 2525 -3275 5291 9653 7690 11625 9069 1567 749
7215 749 -2472 20023 22791 12487 10716 1933 -20824 -26508 -14146 -13224 -10373 -15352 -12277 -4822
7201 -4822 -6527 -11782 -9755 -9138 -11579 -16858 -21530 -27547 -7772 2682 -5296 -2437 -21013 -28497
7187 -28497 -18009 -3992 -3452 -4342 -288 1656 -7815 -14335 -14188 -7607 12796 17627 10064 -7225
7173 -7225 3130 13449 18812 3751 -8732 -13202 568 10706 13649 7729 2425 -433 13215
7160 13215 17791 4004 -8713 -13565 -22836 -29888 -31019 -37176 -39242 -35341 -29941 -30507 -23822 -16453
7146 -16453 -4965 -1859 -3952 -5330 1804 7265 -4041 -5720 -7474 -10142 -5141 4059 3997 7510 12284
7131 12284 14018 3198 18714 18654 18078 16210 3927 -1295 1528 -5486 -13158 -26776 -23210 -3968
7117 -3968 -12718 -19854 -14810 -20782 -24460 -12947 -3088 1088 11936 24760 7750 6365 11341 5017
7103 5017 8123 14996 3976 3986 11719 13798 16385 15940 8575 -10195 -17738 -15642 -16812 -8931 11408
7088 11408 17139 15426 14816 6378 2240 -9290 -12774 -644 10244 7336 9924 4110 1241 -4561
7074 -4561 -6360 -10894 -16086 -14340 -20707 -17849 -18574 -16020 -11147 9321 19248 25228 25292 20723 23012
7059 23012 14600 10999 -906 -4148 -10471 -26881 -16718 -6814 -7164 5881 14948 10158 -2600 6877
7045 6877 10790 -2067 196 1148 -5442 -21617 -25593 -26156 -12582 9891 24261 27202 22522 14758
7031 14758 3341 9150 10910 16895 17871 1349 -3707 -5661 2236 4237 14805 17831 9178 -6829
7017 -6829 -10031 -16989 -9478 3757 3767 3169 10183 11091 12351 13235 4128 2723 -5915 -1240 5990 10872
7001 10872 5811 -6353 -30586 -32373 -14413 -6526 -10236 -16757 -16655 -12459 -6273 7379 149 -1879
6987 -1879 669 -801 -6837 -13897 -15270 -4603 -6625 -12413 -2610 5 2989 11624 20214 15060 169
6972 169 -17517 -15333 -5731 -11312 -13824 -18027 -13632 -4636 9420 -3946 -13460 -6679 -2441 2457
6958 2457 5305 11389 16127 -6502 -10842 -13213 -2485 2981 5645 -11942 -5641 -8672 -3840 7091
6944 7091 -1305 -8430 -12339 -8696 4515 12212 16080 10807 9406 13122 21251 1314 -4124 7755
6930 7755 28621 24191 14810 12320 11622 10221 10823 6835 8060 11889 7740 13807 19275 22389 26289
6915 26289 30352 27848 22412 8118 -955 -4914 -5120 -15467 -25667 -16074 -21925 -18624 -21740 -19673
6901 -19673 -175 7724 8976 -7823 -10422 -1706 -9250 -7668 -4986 -1207 -7285 -15948 -27899 -28248
6887 -28248 -16522 -9768 -3672 3508 3563 -153 9618 12609 13622 8860 8849 -1770 -12543 -8344 1151
6872 1151 -16931 -19214 -13099 4992 -1614 -12648 -5870 3015 10108 23584 24311 15740 29034 26758
6858 26758 6791 5925 7944 12150 -712 -12369 4572 16507 23371 18316 20070 25956 9325
6845 9325 -6251 -8291 -6018 877 22523 15908 21481 33099 27582 17704 2253 -4436 -8360 -1937
6831 -1937 -998 -1526 3431 1000 -15412 -26621 -15034 -2656 5780 7528 8804 8139 1482 -3574 -6343
6816 -6343 -12667 -3757 8080 -5880 -11357 -5576 -1459 1770 3900 5577 -11247 -11035 1719 18992
6802 18992 28618 25883 17671 5500 2533 -11481 -17796 -28753 -25134 -5611 3393 5886 11803 153
6788 153 -2125 -5566 3276 10630 11136 9733 4653 3290 8808 12689 -12769 -16942 -5051 8703 4562
6773 4562 6602 26258 13033 -2765 -8409 -13307 -9342 2014 11805 8323 7657 14182 15730 -6891
6759 -6891 -16013 -8538 -6569 -5020 645 12175 8916 19479 22873 26068 37524 28628 11678 2196
6745 2196 -7694 -6377 -10960 -7468 -6344 -7529 -3827 -1231 2703 12157 15002 6701 16109 12928 5095
6730 5095 1242 9813 10753 6327 11613 18489 31157 29218 10035 5626 979 13277 27207 32509
6716 32509 16193 3810 -3131 10220 25604 34108 14372 -10662 -21773 -20633 -20930 -8422 -13082
6703 -13082 -20540 -19977 -16303 -9605 -13389 -9901 -10099 -8937 5434 10691 14075 2497 -13230 -12241 -6026
6688 -6026 -16227 -7 11249 6992 -794 5445 18310 22278 14245 -1915 -10889 -11206 -17449 -24471
6674 -24471 -42441 -32817 -14857 -3384 -9967 -2815 1641 -1860 2016 4599 -1331 -5691 -8248 -29703
6660 -29703 -29490 -10923 1874 18958 19779 7917 13819 4599 -7185 -9643 5274 20808 -1171
6647 -1171 -7380 -3443 -5940 -1684 8941 2258 -4381 11744 28264 26228 24301 17071 12343 12493
6633 12493 8799 6435 6371 12476 16890 13866 4938 -3915 -11884 -12010 -11126 -16840 -5735 5373 3232
6618 3232 -1624 -9130 7271 2149 3222 -7831 -7461 -1478 -4294 -1982 -5241 -21120 -26756 -15870
6604 -15870 -4431 -1067 -989 -253 6381 7515 4971 -14776 -16308 -8324 5555 32888 35881 24733
6590 24733 25112 16247 6804 -3117 -6946 -3180 -6556 -7074 -2459 5940 16257 27503 20005 14075 12444
6575 12444 20661 27677 25743 10448 4447 4964 13281 6395 -6947 -12352 -22892 -21749 -15543 -10685
6561 -10685 -4123 -1033 -7951 -3663 2700 15366 29100 32635 27450 28638 10407 10802 16610 18992
6547 18992 21976 24468 39355 24305 6471 14728 7032 -15 -573 -1521 -4511 3565 4206 10899 11792
6532 11792 1883 4083 3279 -8625 -10746 -5413 -12367 -10510 13145 32684 34662 25219 18865 13618
6518 13618 1503 -5593 -1895 -1227 889 8650 17671 17139 622 -7689 -3988 8046 2051 -3667
6504 -3667 -6782 2151 2804 -21246 -18710 -217 -4678 -9926 -22572 -21514 -18852 -21496 -24493 -38557
6490 -38557 -36716 -22773 -7933 1316 -480 6044 9937 5732 6860 8354 7091 4327 13720 27450
6476 27450 38771 21730 19532 22848 21576 7924 8509 4617 12021 12504 1584 -5803 9517 3482
6462 3482 6672 8791 -5090 -9668 -5695 -10070 -12241 -17173 -7747 3807 12667 9561 5347 10394
6448 10394 12138 27578 31697 25414 13327 15997 9690 362 7512 -3377 -11989 680 7703 -1929
6434 -1929 1282 4950 -1818 1167 17957 22854 7750 4405 12446 23823 13378 3202 236 4331
6420 4331 1656 -4510 -4427 13786 1592 -4463 -285 4854 -2222 -23342 -43232 -31089 -10615 -4656
6406 -4656 -16086 -20828 -1685 7436 8561 -1149 -15995 -20661 -6270 -13951 -10511 2819 10994 15432
6392 15432 32785 30476 24657 12221 7135 4714 -2497 488 5955 2924 5910 14237 24478 12890
6378 12890 -3123 -4652 -6443 -3591 -4237 872 1310 20727 19358 9217 5900 13068 21434 25844
6364 25844 33801 19682 3133 1445 4828 2182 5019 425 3228 2206 459 -2417 -808 9882
6350 9882 22659 22690 29115 22268 19992 15167 3783 48 8360 26857 26468 9603 6954 2266 4639
6335 4639 11391 22601 28645 23071 7973 -2217 651 2518 -1702 -1816 1736 6979 5764 1071
6321 1071 -7267 -2804 2453 12018 13048 9767 5262 -5452 -2685 -543 -7140 -19746 -35813 -36293
6307 -36293 -26288 -17776 -16072 -12963 3691 10504 11296 7860 8636 1566 -2501 -2512 -8053 -12941 -16225
6292 -16225 -22356 -15272 1206 -12662 -14085 -12243 -13562 -19981 -18122 -15664 -18915 -7724 -7612 -16196
6278 -16196 -38798 -45565 -44041 -31053 -5576 2496 15172 10803 8137 12750 4757 4114 6919 17622
6264 17622 9527 -4997 2198 16461 21702 16726 -2757 -10282 -3007 -11242 -19587 -25137 -15984 3435
6250 3435 12978 895 1580 5919 10301 1212 -9260 -8352 -6485 -12646 -17792 -17844 -11383 -4288 6207
6235 6207 19198 13896 16669 13316 22271 22619 15691 788 -11058 -9173 4366 5232 13992 19206
6221 19206 21475 25727 21432 13505 14459 11065 -2662 -3962 -7099 3880 15493 7451 10217 3767
6207 3767 -8432 -12736 -17063 -21621 -14033 7095 11784 6925 5713 -7460 -16593 -5255 1435 10218
6193 10218 13663 7628 -10605 -9174 4399 -3142 -15443 -17361 -14209 -17056 -11142 -7092 -4631 5829
6179 5829 2647 6623 21167 19789 9114 -122 3162 14007 15637 20965 15687 8312 692 12658
6165 12658 10006 -10452 -9618 3356 4968 9986 5689 2873 8550 21335 9204 -2604 -5162 -1615
6151 -1615 6729 3675 -6420 -11672 -13901 -22121 -30523 -30297 -20247 -15271 -19656 -8646 2042 8385
6137 8385 5440 276 -4795 -1442 -2685 -5393 12645 -4921 -15059 -12104 1499 13742 6324 514
6123 514 12400 10201 1543 -13499 -15083 -11484 -7732 4375 17639 20711 6171 5623 18482 21296
6109 21296 10881 6775 2829 -2214 -21047 -16850 -6995 -17277 -27808 -28053 -16798 4609 12006
6096 12006 15604 -3054 -6725 1345 -8054 -18636 -7045 8433 14258 7053 10431 20114 15682 7594
6082 7594 -6560 -14339 -2046 20167 29222 22114 4748 -8529 -19598 -17955 -6372 10905 14101
6069 14101 -3226 -9723 -6854 1048 8380 9742 21023 28187 21724 15186 11204 16516 12866 11792
6055 11792 15270 4197 -3367 -6376 8358 7247 8277 12001 7106 19173 24137 14330 7917 10451
6041 10451 22500 4738 1772 -1759 6182 10231 16835 14358 -3241 -14450 -15766 712 16283
6028 16283 15822 904 -6315 2488 14773 17593 8580 5987 16725 11037 3292 12308 9663 -4434
6014 -4434 -12565 1938 15580 15805 6806 -12826 -16038 -4952 3204 1345 2834 2806 11793 -781
6000 -781 -5480 -2283 4018 -4695 -7005 -1253 7583 11845 15180 26251 23825 19814 23669 21882 18828
5985 18828 29285 14502 12781 -519 8100 11854 3584 2403 9481 1491 2049 5050 20236 11023
5971 11023 1294 -7716 -10393 -513 7194 3075 -12628 -28076 -30400 -28355 -7267 15579 29473
5958 29473 36435 26594 13164 -7647 -3393 -10425 -8423 2299 11951 9934 11848 7350 12915 25875
5944 25875 17017 -10369 -14214 -5030 -17171 -16541 -9381 380 5321 13045 20393 10898 10282 6185 -6907
5929 -6907 -4726 -4183 -4461 3810 -1819 -6143 -7694 -22196 -14429 273 2527 -1439 -1828 7184 9302
5914 9302 -502 -16417 -11233 -9652 7109 19997 20176 27084 23185 14243 6728 3536 2331 4637
5900 4637 -947 5633 6128 1537 688 -9616 -19604 -9063 -1032 5110 12263 3524 -5137 -4976 2386
5885 2386 6405 -617 1038 -5911 -18572 -25050 -41111 -57094 -40008 -20112 4255 8053 4620
5872 4620 -3159 -7228 -9263 -1311 4342 5690 6420 12004 2902 543 8214 12917 26441 30376 30184
5857 30184 30185 26706 18735 14123 11215 14654 15592 16482 24184 26486 14041 12879 16031 25190 22588 26741
5841 26741 26083 11645 10673 15931 14914 16457 3777 -6473 3253 -5770 -7549 1554 -3390 8868
5827 8868 8039 10369 8059 6796 4807 6305 11566 23081 25781 22682 24756 20550 16341 15204 4899
5812 4899 -4877 -7615 -10864 -29174 -38223 -26595 -17156 -17801 -14166 -10007 -20359 -18756 -14282 -11400
5798 -11400 3134 11010 -2193 -11271 1382 -2387 -6142 -10955 -17579 -5057 -8089 -15750 -19336 -27708
5784 -27708 -23149 -155 -5234 -3214 4554 -1847 -6164 -9665 -3398 -3344 12403 21535 19874 -3327
5770 -3327 -12497 -15984 -29105 -26157 -11580 3034 11679 -3592 -10067 -5869 -6048 1589 15810 15266
5756 15266 411 -2454 -7230 71 7885 8129 11574 -5208 -4905 -5870 -4363 -9023 -2724 -8122 3952
5741 3952 23007 18904 7190 -4031 -1788 4603 8511 16474 9585 -7251 -12635 -6305 -8443 975
5727 975 -3497 647 5303 9809 8840 4025 -10764 -10980 -2515 5876 12707 10122 2058 -7649 -25280
5712 -25280 -31736 -23794 -17062 -5359 -5428 -7927 -11397 -7875 -6482 1402 -424 -14728 -23211 -13366 -2826
5697 -2826 6736 12210 10524 15213 18393 14829 20669 21098 19130 16245 14464 14078 15458 25746 21511
5682 21511 15752 27543 28386 19892 -198 -8772 -13646 -4479 -8907 -9632 8631 14626 12511 8866
5668 8866 7218 15034 9693 -1945 -1593 11168 19049 14024 982 -2940 7003 15328 6239 -910
5654 -910 -1881 12037 11648 1474 3265 15748 23381 42784 23747 16073 18476 22683 20330 21028 27126
5639 27126 20458 7825 5546 13149 14571 5870 2704 -7769 2348 4188 9733 18673 6147 2454
5625 2454 -3408 -15632 -13879 -6592 -326 6038 15130 18500 11876 4191 -584 2306 -1014 -2287 -5747
5610 -5747 -17866 -22613 -16949 -872 2744 -3672 -5847 -20302 -21322 -26109 -27176 -28037 -44889 -48597
5596 -48597 -35061 -17027 -2409 -7974 -29365 -41045 -32594 -32561 -36173 -22032 -26973 -17511 -8720 -1035
5582 -1035 -5464 -19086 -22049 -13867 -17658 -7104 -2262 -4366 -10484 -11958 -11381 -19177 -12644 7795
5568 7795 13460 6998 9423 5107 1801 -357 1015 9789 12460 458 180 -321 10846 14233 10085
5553 10085 4771 1564 -3262 -14140 -13857 -14170 -10857 -808 15625 2162 -734 -1686 -7618 8638
5539 8638 9667 21122 21290 13616 10238 14027 7758 9694 14751 -3127 -20530 -13880 -9617 -1404
5525 -1404 -4646 -1301 5788 -1091 -7379 1957 3524 4199 3587 11693 10091 1015 -6820 -4124 3960
5510 3960 14495 10847 1531 -7431 -7127 -4687 10489 5897 19280 22139 22550 15160 6067 4641 393
5495 393 10312 13874 11730 11028 7393 -9721 4345 4520 683 1060 -1530 -8078 -5173 -5241 -15224 -24749
5479 -24749 -17898 2974 5844 16630 1568 -8104 -21314 -17181 -9976 -1290 11100 7099 -9095
5466 -9095 -10837 6930 11479 4358 4573 4498 -8827 -6190 -188 -18074 -29235 -13883 -11768 -9964
5452 -9964 -15952 -14200 -9461 -1345 18032 18134 8499 -6901 -8478 8088 8834 12457 9834 -11351
5438 -11351 -17783 895 3653 -10196 -29409 -24760 -22394 -19434 -29865 -33993 -22184 -12418 -9313
5425 -9313 7347 -3531 -21263 -23914 -15729 -15693 -14571 -4843 -6660 1588 -6970 -2804 -11966 -10954 2591
5410 2591 -10287 -12319 -8478 -10365 -7917 7156 18649 24822 13650 11285 24082 31408 26831 17189
5396 17189 15919 8603 4221 17274 19641 21777 22758 19417 12602 4843 2221 7360 12971 16769 19602
5381 19602 21912 20681 15878 1042 -7142 -6184 -9481 -12665 -3913 12207 21233 13340 18194 27214
5367 27214 36828 32759 6329 -999 6176 -6924 -367 11686 7817 -4812 4130 5319 6483 12267
5353 12267 6767 -2300 -3668 -2468 -10592 -23267 -21961 -6646 6389 -2881 -217 -2571 -11403 -23517
5339 -23517 -25811 -17978 -12694 -27440 -27788 -17020 -19667 -6202 9974 15165 39159 45068 32120
5326 32120 27255 21309 4922 8956 4264 -3914 -3879 -6236 -13026 -12879 -13695 -1642 -5766 -13377 -9198
5311 -9198 -9419 -14775 -10260 -3849 8070 12384 20960 3443 6582 12658 18687 23107 14332 28483
5297 28483 37150 34410 33136 28597 20392 18253 22064 23771 8265 -2549 -21438 -34038 -28339 -14195
5283 -14195 -1870 -9026 -18761 -15016 -11436 9626 14931 17976 14276 2597 7618 8335 3823 13503
5269 13503 25084 30799 28701 22399 8030 7750 8104 -4706 -12113 -19367 -4259 14499 18474 26827
5255 26827 15289 14079 24425 30334 36744 47114 42294 33620 13232 -4682 -17048 -16271 -16983 -30231
5241 -30231 -34362 -14978 7586 28005 32219 21191 8347 8849 4912 11121 8458 -4481 724
5228 724 9108 7105 -3727 -20983 -11421 -5765 8535 14752 22429 13490 8163 2333 1819 -6382 -9750
5213 -9750 3136 16754 22720 22095 8168 -6460 -7124 -6159 -1814 6902 12384 6717 452 2842 10610
5198 10610 18380 11838 1605 -1811 -4244 -7712 748 12478 15052 28625 21215 -564 6778 16099
5184 16099 29235 28373 25343 21999 14843 20443 26561 12813 9256 8286 -12794 -15576 -14454 -11495
5170 -11495 4459 18389 3384 142 -942 9516 18315 5415 -4708 8736 13254 9565 8156
5157 8156 4381 19142 27528 18483 12429 14675 -1619 -5009 7869 6617 -11895 -15903 -457 -966
5143 -966 -11850 -2624 7889 15469 9835 2552 9756 15630 14654 1494 7977 1001 -15234 -23299
5129 -23299 -26116 -19724 -1411 11051 15760 15142 16335 9038 6186 13332 5224 5564 10118 9126 10003
5114 10003 9756 2457 3175 13464 14196 13731 19969 33344 42732 33621 25385 31765 28012 39831 46206
5099 46206 36514 30679 27449 11807 13092 20329 13925 7124 21178 23599 12669 6984 -7380 -21905
5085 -21905 -9614 -12062 -15875 -12403 -8351 3594 9088 8468 8728 2153 -8766 -4443 1377 11672
5071 11672 5538 -1639 -630 -11988 -11410 2928 2112 -4499 3543 5072 5211 1446 8476 12706 4592
5056 4592 -6529 -5274 -799 -4188 -7758 -14334 -1663 -2055 896 2310 3537 1597 295 1349 5327
5041 5327 1826 -11560 -11689 -1549 4238 18268 11505 -4306 -5710 -6962 -21146 -27079 -13609 9857
5027 9857 4758 -5874 -16242 -8441 10072 13680 -8991 -14779 -17357 -23531 -16972 -6831 8966
5014 8966 11515 17103 10389 2491 -2819 -11026 820 13152 7522 -9359 5231 14685 2974 7783
5000 7783 -1795 -11770 -2932 258 -4394 -4755 5745 14291 14825 17002 22685 13790 13169 13814 4667 -4223
4984 -4223 10453 24910 22424 8257 -2849 -2393 8375 16283 22013 27688 23931 12799 11264 8287
4970 8287 13392 7903 2494 539 9941 8056 16600 8928 6719 -3942 1504 12060 9595 -6458
4956 -6458 -5782 8923 10314 30174 26339 19535 19088 9580 2238 3688 8282 15541 17965 14525 14212
4941 14212 27708 24732 14749 14270 11876 493 1569 -324 -5244 -6666 1620 11063 1249 -19542
4927 -19542 -9062 9059 -6151 -4517 3624 7059 13161 1861 3215 427 5566 10326 11244 25608
4913 25608 33699 15050 3644 -2895 -20763 -30787 -15904 -6259 -5044 -1318 6801 2035 12443
4900 12443 1721 -2000 -5518 -5425 1334 4845 15973 19099 12378 7962 17717 25540 11690 7937
4886 7937 -5807 3543 -589 -3800 -6019 -2697 8754 16141 6579 2000 -17714 -32285 -31914 -20556
4872 -20556 -16848 -29209 -29410 -16110 927 10046 8564 220 -2041 254 -3816 3946 7131 -1592
4858 -1592 -5153 -19904 -25258 -25490 -27119 -22836 -7929 -2153 16755 11501 -1255 -18384 -27908 -34856
4844 -34856 -13946 7565 -3330 -7888 10536 26691 19891 8274 3903 -2537 47 -4393 -1346
4831 -1346 -5616 14986 20573 9533 7004 5363 -4712 -16656 -3606 -6092 -6055 -5894 -2888 -1585
4817 -1585 -21876 -19327 -3784 11447 17262 2361 -5163 -12305 -4138 2167 1534 5166 16457 18019
4803 18019 11472 7205 6758 16239 4965 1539 7603 16063 16564 10936 3274 68 10851 9137 -4495
4788 -4495 -5831 2229 -3284 -12049 -27229 -23434 -7818 13881 23026 9806 11943 1292 -15557
4775 -15557 -22551 -16628 -17982 -16103 2803 19007 -4027 -5407 -7828 -11941 -670 79 3221 4407
4761 4407 10794 17811 -2531 -9059 -16490 -29653 -16679 -9623 -16128 -24672 -19371 -7250 4997 9364
4747 9364 12128 7219 4251 8528 26123 28394 31567 40919 25316 12364 16735 22084 19952 12915
4733 12915 5442 4272 8826 6352 8683 13536 18318 11730 697 5205 3201 4215 3452 -4859 -972
4718 -972 -5183 -5358 2497 -6922 -16727 -21270 -14001 -2135 21557 14958 -5544 -16391 -21284 -22984
4704 -22984 -14713 3737 12086 15970 18388 14545 7344 15672 22242 11541 540 1115 5007 -5514
4690 -5514 -10161 -4700 -10075 -8490 -8910 -11711 -11513 2838 -173 -7550 -17035 -26105 -19017 -4315 7647
4675 7647 9991 14083 1180 -1203 8716 20214 17168 -3592 -10036 -563 12056 23451 29437 16281
4661 16281 -537 7276 20641 18937 12217 9520 7150 14292 8407 -11139 -11530 8529 24232 31410
4647 31410 8841 5189 18206 12467 6338 4813 1875 -233 1408 26223 33244 21489 13808 7351
4633 7351 -3979 -2142 4497 5941 12246 18331 22467 31064 37396 18686 2645 -7578 -15925 -4523
4619 -4523 1008 9474 6057 1155 -1568 -3020 -8778 -8566 -7235 1769 -1695 11346 8124 9918 14366
4604 14366 7056 3590 8831 26057 33332 30580 21330 14485 30291 29235 29738 9967 8735 12758
4590 12758 11558 20319 15717 24865 10084 -8136 -2274 4113 -12575 -12327 7686 22748 24317 19530
4576 19530 6260 -2439 -4962 5126 4010 -2770 -12864 -26188 -20707 -66 6649 7373 4139 3935
4562 3935 -3336 476 12659 23349 21257 19611 29745 38975 30280 9703 -3178 -5146 -3391 -4516
4548 -4516 -2342 4490 -6004 -7715 734 12567 17260 9658 12432 11018 17330 11507 14377 17272
4534 17272 29610 6101 -15317 -11695 -8114 -1069 297 5084 -7182 -12518 -10830 -6880 -10123 -14082
4520 -14082 -31333 -25790 -17749 -15057 -10989 -11296 -11355 -5406 317 3726 13824 12373 8162 9196 9573
4505 9573 6824 4093 7820 8892 6845 -4252 -1736 4345 16845 11885 5066 6733 4734 -2893
4491 -2893 -7011 -7786 5876 6151 1575 -481 -1271 -1212 388 8518 5104 -12845 -19341 -7817 -5287
4476 -5287 -4782 -5607 2771 12598 -2570 5193 14021 1929 5861 12499 -2057 9083 13950 7227
4462 7227 7658 5413 107 -4134 -7337 -4460 -10119 -17916 -22323 -16999 -2115 -1760 6635 18029 16313
4447 16313 3433 8265 15243 24398 21372 20478 11820 2811 11845 24802 26744 20987 14521 17835
4433 17835 17984 17313 11058 -612 2343 -10465 -4389 1636 -13289 -5543 7613 11087 2213 -359
4419 -359 -184 -6470 -12469 -7317 743 6120 14996 8152 -94 2421 25489 20458 13542 5790 -204
4404 -204 -767 7324 7219 -19 -5818 2031 10955 10294 8346 1061 2647 -4887 4820 15770 25781
4389 25781 18461 10955 2263 -6909 -11442 1823 14402 21027 14225 11681 -198 -10139 -2479 -3551
4375 -3551 -3917 -5690 -5495 5039 3820 973 7507 -1868 4358 9221 11499 11453 3435 2722 3436 -12793
4359 -12793 -11125 -2354 -447 4478 9408 10104 20327 15753 10397 7516 -3333 4064 -11148 -20911
4345 -20911 -21722 -14565 -13302 379 355 -760 -932 1567 -722 -12504 -18520 -18429 -22984 -11492 10470
4330 10470 19279 5927 -652 -2000 6077 1982 -2766 -6936 -9526 3500 6179 1866 8155 12094
4316 12094 -14559 -20200 -16294 -4384 -2002 6305 1197 102 9035 -1681 -12668 -10185 819
4303 819 2594 -1843 -558 -18594 -25583 -20785 -11055 -2958 -19508 -27611 -18918 -13252 -13406 -2466 2205
4288 2205 -11525 -14502 -12273 -3469 15545 14155 -11532 1311 12029 11086 1254 -5540 -11400 -2697
4274 -2697 2941 -864 3631 5163 -8787 -11533 -424 11171 21527 14315 17797 21461 18184 19287
4260 19287 13574 12463 19691 18331 12288 5327 4744 6576 -12324 -14488 -26044 -31061 -9110 -8541
4246 -8541 -2327 -9763 -8568 -11693 2250 24542 32528 25088 23069 27682 26983 16068 13415 23098
4232 23098 21745 25067 12719 9505 20210 21633 5349 9438 8759 18307 10284 -1822 -13696 -6362
4218 -6362 -872 -825 5096 25125 25784 14789 12711 25312 20556 8300 2066 4293 8992 27016
4204 27016 16555 -2805 -5474 123 -1167 19143 17510 3066 -611 5562 965 -3108 4684 -4184
4190 -4184 -13958 -22814 -3308 6292 2965 -3435 -7977 2599 -4427 -10892 -24986 -10054 -2863 7450
4176 7450 26503 21592 14459 8763 16815 14278 15761 9621 4225 16922 20259 21290 21409 17005 12203
4161 12203 21880 13268 11668 8457 5 -6086 -7761 967 14406 15762 2919 -12248 -2558 -2382
4147 -2382 501 9740 12269 -4388 -6951 -2779 -3716 1352 -15206 -6266 -2037 1477 1791 -3252 -3593
4132 -3593 16363 18457 2879 13900 15534 19456 22294 3290 -3247 3205 -6058 -1909 12631 13565
4118 13565 20717 15238 8913 18407 16149 27672 30835 19101 -1178 -8614 -13323 -5832 9959 17569
4104 17569 2708 -2254 9268 4403 -2342 1338 3802 3879 17067 22264 19166 23299 18117 10313
4090 10313 4396 5762 5422 -6023 -2618 -2878 -3411 14657 22134 244 105 5103 8767 -1234 -13216
4075 -13216 -16304 -4820 -6095 -12943 -22466 -12620 6436 5445 247 -7956 -2129 6288 13182 20526
4061 20526 9441 3952 19686 10053 -4662 -1442 7870 6183 7093 13536 12778 7416 1474 -10048
4047 -10048 -4959 -4292 -2440 9452 18238 24276 15534 7610 8889 2030 3856 8536 21254 12493
4033 12493 20010 20312 15785 13449 22975 18947 21232 15101 14357 12291 4785 436 -14454 -15853 -11092
4018 -11092 75 13740 26160 16191 -5697 -263 20037 19678 15069 20526 26345 31494 37430 14804
4004 14804 14366 9470 -8343 -8641 -4983 2671 -4731 -7479 -3506 -326 187 -8766 -7468 -6678 -16465
3989 -16465 -6493 3552 16430 8197 -8317 1663 14069 10141 9853 10791 -999 -3672 -148 11920
3975 11920 15945 11581 6185 10278 19320 26874 22170 24649 24417 26893 7533 1401 1474 -14288 -28325
3960 -28325 -16672 2956 11109 33735 39388 31208 11721 8774 14285 28367 21805 20673 15244
3947 15244 3967 -6272 4133 10540 2364 2873 3721 4267 -8866 -5210 136 -1518 -6311 2366
3933 2366 -9 22 -6259 -19630 -23195 -11321 3511 16001 24611 29507 30124 22082 4716 -13837
3919 -13837 -6373 5451 1071 17068 28304 10926 5153 6552 8407 8547 -2649 -2070 5970 23354
3905 23354 16937 17954 15737 9000 -3974 -14863 -15341 -12598 -16615 -646 12483 4901 250 -1844
3891 -1844 -3692 6916 16244 10759 5891 18550 32347 23038 7001 -11503 -10453 1503 1633 -1018
3877 -1018 -10019 -4802 2664 7990 18472 20396 16429 15402 -1584 -6181 -1271 12586 19941 14788
3863 14788 20833 17153 15800 12226 24474 20985 19142 17922 16715 19064 27701 21869 11987 15270
3849 15270 17022 4518 -6192 -3407 -4184 -2462 -6385 954 21063 15240 10682 13093 -357 465
3835 465 7966 15320 14058 2784 -6979 -16864 -18511 -15628 -15994 -20605 -8911 -3298 6586 5820 -4375
3820 -4375 -24050 -30035 -17493 -1502 -155 -5874 -6746 10668 8432 -2144 -8043 -19750 -21351 -12075
3806 -12075 -18053 -17416 -20437 -22663 -12056 7825 14628 6482 13580 11789 17343 9664 3462 -6450
3792 -6450 -14426 -3231 9322 13823 11734 -10623 -4468 1814 9229 18626 13865 -1881 -8893 16612
3778 16612 32929 31960 21136 12176 -6789 -5897 -8233 -16736 -21254 -19750 -2578 15697 14437 11995
3764 11995 4188 865 -150 -11777 -6687 -4269 -5533 -11798 -9005 -7286 -19319 -22446 -16081 -1238
3750 -1238 -533 6548 21248 30715 21480 10635 -16730 -21003 -5215 6797 7160 12519 5795 8542
3736 8542 9523 11602 7706 -1853 -4535 -20657 -27536 -28183 -27409 -14922 -7118 7056 23010 13360 6604
3721 6604 3553 13790 8518 -3731 -9312 -5461 -1225 5188 430 -5460 -8267 -6841 -921 1267
3707 1267 5420 8998 5963 -16807 -9911 -6516 5154 -3323 -18859 -2677 19418 17780 8778 7916
3693 7916 12620 21683 24543 18595 13661 10486 4326 3060 -2020 7433 8411 4373 -10102 -12295 -12318
3678 -12318 25694 33158 26908 20749 14281 11228 12647 26124 23505 15393 12220 9096 10230 1951
3664 1951 3716 4371 9591 10913 4055 8494 -1495 -7895 -7117 -7984 -17674 -2652 13458 11802 6685
3649 6685 -3723 185 7495 7482 15181 9708 877 8544 16708 -1798 2174 12621 23041 13787
3635 13787 3701 -2785 -11485 -8433 -2284 1276 18957 20709 21356 18274 13330 15306 12241 5737
3621 5737 3574 9321 4268 446 7531 16521 9223 15119 18198 25928 37611 30908 22031 33201
3607 33201 30302 20323 15641 12697 12354 7435 7462 4623 8194 11749 31552 17934 -4110 2065 8714
3592 8714 2215 5765 9686 18509 23675 32969 25770 29298 27739 21674 18009 19732 11302 7305 7129
3577 7129 -6588 -4654 -1752 -6957 1103 6997 6896 2961 10545 -5968 -20088 -16936 -19309 -10879
3563 -10879 -10252 -19367 -24547 -24129 -11108 -1470 -663 -16883 -13111 351 4894 8270 11358 11953 11229
3548 11229 13149 16197 4814 6383 6724 -18048 -27749 -24433 -19344 -15969 -18513 -15119 -20644 -16697
3534 -16697 -14581 -13694 -17363 -21157 -16927 -4343 2414 8751 6023 2774 1830 5596 2779 3480 16195
3519 16195 24094 19616 16237 3547 4830 7303 8072 13023 6510 4975 -1800 -41 -622 4711 5414
3504 5414 -273 13021 11893 11214 6058 11900 16037 6157 5237 3976 6265 10432 15695 11597 -24
3489 -24 2391 -2084 18541 19349 17344 1601 -15772 -12772 3403 9189 -5562 -13473 -8527 -4399
3475 -4399 2787 6896 -9547 -13000 -3915 -5876 -156 2570 5489 9585 3289 1639 2014 3870 2515
3460 2515 15390 27380 28975 18810 12368 18878 9481 -5647 -7202 -1610 7852 10487 13308 12625
3446 12625 17022 11953 2530 1608 9356 20779 25166 22905 14359 17303 7854 -5316 -10922 -19046
3432 -19046 -15840 -7030 -6604 5501 2263 -1206 -9497 -5387 2676 -12702 -11491 5023 20383 38238
3418 38238 21393 -5538 -19752 -18533 -18254 -2354 12641 23717 10992 -4136 -2202 6185 7277
3405 7277 5309 5206 -959 4677 3897 4673 4783 14029 17113 23552 28578 30132 20021 14674 5547 -4398
3389 -4398 -7649 -4737 11105 22906 27072 23895 9978 3132 10060 11321 14897 26061 36720 22272
3375 22272 16727 28626 39169 44189 34733 27661 23964 24421 7341 1850 4122 18159 27053 11436
3361 11436 3637 6452 10138 11640 18627 4829 8636 21393 24619 25353 21795 15815 18718 23070
3347 23070 22796 23922 23830 18742 19689 22068 16480 22918 21437 11002 16647 15438 -1179 2152 4950
3332 4950 2140 2678 -5377 987 -5748 -12586 -2846 8238 8791 -6413 -14877 -11215 1165 15561
3318 15561 13946 25827 13474 8236 6103 5846 1284 -7209 -14040 -18193 -19842 -9614 4043 7364
3304 7364 18213 18845 14897 2229 -3679 -628 9980 27633 31938 19508 -4405 -14632 -8349
3291 -8349 2249 16341 15007 13690 21507 23361 22101 22654 9725 -715 -9747 -148 27305 26507
3277 26507 18293 15765 2742 5503 15195 14186 -33 93 -2232 -2702 3157 -3146 1162 4629 2845
3262 2845 7348 3042 -6024 -11786 -23768 -20351 5171 17582 12986 5772 20553 22633 37213 38259
3248 38259 43649 49505 39005 27192 23409 30148 26109 20598 7041 4589 11144 13220 11119 8129
3234 8129 10727 -1320 -222 11415 14611 15104 31287 24656 17702 9888 2500 -8360 -7206 -417
3220 -417 -4487 -12260 -20864 -1290 11400 17080 10808 8398 5605 5977 19232 20093 14882 16897 22795
3205 22795 22023 591 -14178 -14232 -8940 -7551 -19813 -7109 2358 2920 4796 -10550 -10219 -12331 -5336
3190 -5336 20807 31792 32993 27493 14961 6379 16003 24920 17909 16217 28663 34891 7094 4798
3176 4798 -2536 -10156 -9637 -1588 2705 -220 -1094 -1492 4114 4598 -1757 6769 11536 283 1000 -5865
3160 -5865 -3999 708 -2420 -10226 -3432 18483 32151 18812 21471 22553 19416 4837 8206 5110
3146 5110 14158 18836 10567 14919 -2277 -12233 -8483 14431 29650 27312 26968 21772 7905 6988
3132 6988 12462 12386 17155 7724 5507 -10721 -8323 -8865 -762 6929 8214 5692 1439 -1653 2200
3117 2200 -2900 -22393 -19926 -17518 -7787 2517 -12884 -16176 -16758 -1918 -3830 -5720 -2077 -7098
3103 -7098 -8049 -3015 -10767 -11924 -5395 -10645 -19807 -19543 -19499 -6550 -1939 -44 -6767 -2884 8177
3088 8177 11600 10897 3212 2872 4602 -8645 -2543 7092 1832 2057 -3763 1867 -3991 -1275 7574
3073 7574 10688 17845 19417 22269 15262 17995 8642 -6071 -19731 -26733 -33864 -23252 -20172 -12350
3059 -12350 -3088 -2921 -4720 -1140 -4964 -11031 -18127 -11676 5753 2942 4551 8902 13972 6424 2038
3044 2038 8694 28364 28467 7360 -3191 -8072 -10446 -13563 -14276 -19832 -9668 -364 4188 11060
3030 11060 14661 29868 33028 34728 19340 14611 12138 8191 -2254 -6778 -22034 -28065 -15316
3017 -15316 -2164 -12295 -1539 -2237 -1738 6373 -16108 -24695 -31265 -19632 -14758 -21396 -26870 -20303
3003 -20303 9430 20093 6856 -5031 2946 7374 -16258 -20202 -18927 1734 8132 10293 1499
2990 1499 -2510 -4900 4790 8349 -1511 -8689 -6374 -562 5745 19487 19517 12141 22300 20645 19360
2975 19360 23276 18533 7034 -6290 -1836 5972 -2118 -11869 -7886 3159 4309 6918 11481 7385
2961 7385 -4371 -6104 -11335 -8886 -11446 -12545 -8681 11225 8980 -12042 -11336 -9723 4386 22021
2947 22021 12809 -785 -7052 -17511 -4973 7214 3801 5042 3127 4096 -6695 -15421 -19408 -21771
2933 -21771 -11918 2619 6308 11950 3425 4455 4309 7717 10702 4588 10698 18819 19363 19339 1444
2918 1444 647 18508 19984 23455 9162 -832 -5460 -1323 4022 -2591 -788 11912 40047 42471
2904 42471 14863 1736 -3428 -1152 -341 4220 1686 19537 29563 13686 1172 2000 2054 -5220
2890 -5220 784 7881 13511 15097 13175 2680 2862 7057 7937 -1015 -7 9049 11119 16165 12396
2875 12396 8173 15253 18799 13482 525 3942 10414 5466 3639 2635 -4619 -3669 -41 4963 6936
2860 6936 -1504 10683 21943 9846 -14215 -11431 -4293 9008 21354 19678 14771 2160 -8052
2847 -8052 -17341 -6789 10603 24777 15642 12668 11474 16210 20874 29155 32105 16010 3556 16037
2833 16037 17443 15587 31903 15045 -511 -6724 -9518 -9306 -5084 -6396 -4120 -9589 -17235 -14783
2819 -14783 -2771 -1575 -10944 8886 18338 154 -1471 -17563 -17931 -8630 -2462 6154 2431 -3096
2805 -3096 8145 9913 -2044 -2021 -877 -10006 -1061 13968 9134 1059 5486 444 -5300 -7842 -1786
2790 -1786 1735 3213 10307 11095 3905 849 -8200 -18778 -4576 -5494 -15044 -15303 -18203 -22343 -21974
2775 -21974 -31159 -31239 -16179 -13424 2784 11958 27118 23928 12019 8523 6527 3712 1366 -18945
2761 -18945 -31879 -28847 -10136 -4446 -2104 -6873 -840 -4552 -13029 -12251 -3840 2572 -2598 -1983 5477
2746 5477 20362 25312 22668 20691 9898 5696 4472 -1083 -5082 6507 30312 33894 24132 9776
2732 9776 147 -5483 -868 14446 22643 18915 7582 -1715 12620 9764 -7731 -14384 -857 11379
2718 11379 4555 -1314 -7216 457 19740 30412 29872 15332 12124 1283 -5700 -12793 -8847 -7902
2704 -7902 -7083 5468 6133 10738 29273 37460 22035 -2510 -13331 -9756 -1590 10233 8417 9708
2690 9708 6357 5884 677 1577 -2279 -1809 -10130 -6475 -883 1496 -4349 8522 12261 296 -3699
2675 -3699 -8318 -3998 2261 -6468 10143 29752 13120 -14308 -20040 -24822 -9858 357 -13903
2662 -13903 -11175 6112 15342 32007 28427 34283 36781 33731 24217 6433 -6767 -10760 -15075 -5008
2648 -5008 6478 11670 5391 -8958 -6002 -4420 308 6702 -1126 -6249 -5500 15140 14308 -218
2634 -218 -5161 -14178 -11527 -1194 4591 17356 16984 13064 19854 20095 26096 26665 23041 -3215 -10526
2619 -10526 3899 6801 9104 2341 7478 14645 -4668 -15951 -12272 -14914 5519 3320 -10831
2606 -10831 -8709 -9469 -11587 -5038 3836 17720 22542 12751 3705 -4923 5393 5841 2745 12287 6096
2591 6096 -10260 -21903 -28790 -26488 -18362 -2267 3842 -1085 -17344 -6447 -2455 -8665 -9881 -14926
2577 -14926 -17701 -9869 -15861 -12546 6485 13838 13544 14411 11188 15367 900 -4957 7506 -2114
2563 -2114 -917 8826 10411 11493 15659 9984 9599 11302 7175 9497 1335 -5542 1331 13498 10172
2548 10172 -4808 -15974 -3710 -733 -982 8767 5334 4245 26248 31277 20904 21257 12959 14136
2534 14136 4203 -2633 5941 847 -4833 -6111 8997 8508 8263 16705 11699 -4525 -18952 -22069
2520 -22069 -25101 -13535 -4545 6530 8685 13796 15126 769 4439 2177 10837 16708 1533 4487
2506 4487 -1777 -15000 -17897 -17786 -8248 347 9078 12498 18105 30401 45049 34413 19241 33498
2492 33498 26463 -1336 -14869 -21848 -21347 -23350 -15255 -19715 -26164 -31564 -5085 10025 -2500 1937
2478 1937 15025 14068 78 7670 -3968 -13358 -24680 -29087 -20955 -12556 -9551 -5211 4563 1552
2464 1552 -4612 -4964 -5784 -11291 -10603 -10447 -17776 -20276 -18062 -28634 -10136 -12303 -10466 538 19726
2449 19726 19349 17157 5629 -4387 -12544 -13967 -4336 3811 266 1960 -2785 -1707 -1249 17612
2435 17612 30753 25004 16511 7016 2883 7672 7613 7897 13773 20037 26172 8748 -2644 3361 12967
2420 12967 3317 -8953 -11567 -3633 7078 6058 -8696 -8692 -8814 -4235 3842 12568 16344 11601 4285
2405 4285 -10121 -26993 -22914 -20429 -15408 -20213 -10102 -1861 8124 503 -7165 1434 -6553 -692
2391 -692 -7340 -6610 -1618 -1778 -8912 -14171 -6722 7002 15005 11292 5864 6646 -1976 -14212 -8637
2376 -8637 15335 15233 -30 -611 -17344 -30004 -37908 -21610 -13709 12055 6920 2714 -1289 -4098
2362 -4098 -15416 -18668 -19200 -12808 -18472 -20268 -2252 12045 14420 11347 17 9416 278 -7480
2348 -7480 -17844 -29386 -35484 -17493 -5759 12037 20042 4283 -4318 -2240 4499 7581 12782
2335 12782 14073 7357 17244 16644 5777 -11186 -7818 1496 6186 18365 6833 -6838 -5335 -611
2321 -611 10222 -3373 -16410 -13488 -4931 -4650 -10712 -13342 -7533 3553 11601 5665 6075 9960 990
2306 990 -10957 -20992 -18642 -6230 -9121 -16143 -20124 -40406 -42151 -27748 -18490 -4756 4036 980
2292 980 -2578 -2353 8768 8674 3220 15899 19259 12413 8786 18155 16615 18533 11556 3888 -2434
2277 -2434 -5530 -23009 -9573 11779 12867 5374 -1576 10441 11379 8698 5982 13163 14743 21176
2263 21176 17431 13768 5298 -807 7455 13258 7689 9744 9809 8771 430 -17727 -9919 6502 14429
2248 14429 8367 13335 12936 4155 977 1275 -2632 -3817 -4826 -1056 6804 11941 5429 5683 7525
2233 7525 16367 20159 -4590 -1451 811 -8164 -25548 -31713 -24109 -17340 -1556 -1377 -115 6408
2219 6408 7840 4271 5390 11155 14467 8820 -3309 -14233 -15725 -9248 2372 7018 -7506 -7140
2205 -7140 -820 -6833 -13528 -10176 -2748 3687 615 -10523 -12848 -5229 7672 716 -14430 -12809
2191 -12809 -3428 9917 11711 5873 125 -3501 -4999 -5143 6372 4439 9890 17962 8691 9377 15198
2176 15198 17972 -1567 11312 20259 13269 10012 16578 9090 2083 -6718 -1415 5205 22721 30549
2162 30549 24127 15784 10119 17672 16469 19346 4498 -6943 565 1880 7259 13056 18301 9639
2148 9639 8237 250 -4062 -4828 -17059 -34856 -30148 -17831 -19431 -13921 -1404 6861 12091 10591
2134 10591 9345 14421 10193 9495 -2763 -13052 -8050 -2931 -5037 -1976 13172 19929 16107 17512
2120 17512 14994 6528 -11660 -17944 -25445 -22438 -31703 -36452 -28774 -26230 -16530 -3426 12868 6860
2106 6860 -2106 2055 6603 -6557 -9976 -6942 5132 4204 -8862 -6660 -5357 -18148 -26302 -26911
2092 -26911 -21681 -19980 -12760 -11266 1830 -3709 -4252 2746 8364 -717 -3478 2210 19520 20005 -440
2077 -440 11033 20549 10274 6854 7612 6925 6239 7915 1668 -14512 -33206 -33260 -1163 28310 31510
2062 31510 3479 -12421 -10618 -20381 -12077 -12317 2511 11295 14540 16734 9493 18962 9910 -1029
2048 -1029 -9368 -13968 -15429 -14138 -1422 -3896 -12084 -25700 -27596 -29710 -22239 -9609 -529 7300
2034 7300 16125 26540 18974 14172 4444 4405 4301 -3024 -8163 -2896 6510 14295 19429 19487 17969 18261
2018 18261 18780 13213 12281 21411 22074 6420 -2555 917 -1247 -13497 -18054 -11117 -294 -10136 -11366
2003 -11366 2451 6305 -3156 -10683 -4539 -1964 -13079 -23322 -13411 -13263 -13817 -10525 -20233 -4158
1989 -4158 -8794 -12884 -519 -1174 -3186 6266 18068 9608 1750 2728 10560 7817 2632 -4623 -17690
1974 -17690 -24737 -6285 12341 10470 2006 0 -9519 -13252 -3562 -28 3895 -5076 -267 262
1960 262 -262 2449 1566 -10559 -17732 -16082 -19472 -23912 -15878 -10755 6114 13156 11412 7377 12142
1945 12142 16922 25382 22105 8450 -3224 -5081 -19566 -8994 -6424 -11186 -19163 -29097 -18415
1932 -18415 -5304 -17078 -22357 -16910 -4888 -148 -5338 201 2702 -1657 -3901 12606 23158
1919 23158 14517 2338 -2860 62 9419 10908 5844 -3715 -11538 -13088 -14202 -2858 -1771 4048
1905 4048 11234 13925 17134 12759 14178 14277 10375 4059 -16026 -16989 -20430 -25775 -14629 -16600 -27175
1890 -27175 -44226 -41584 -39297 -6192 2063 -10359 -14692 -2248 5519 2737 2039 17673 19076 38872
1876 38872 32699 5732 -3335 -2548 -9206 -12092 968 1070 -15477 -20673 -20307 -9281 -2991 -2213 -1858
1861 -1858 -7502 -13566 -13248 -4506 -2556 -9483 -8144 -14646 -11754 -16057 -20102 -20405 -20791 -2643 2720
1846 2720 5026 3793 2217 10388 18040 17494 22506 19937 22110 16995 1088 -4066 -11138 -6304 -449
1831 -449 -11865 -7623 324 6242 -8068 -20238 -15996 1377 4538 9048 2052 -7724 -12880 -7674
1817 -7674 -9180 -1293 -2632 -6657 -16566 -16105 -26194 -25884 -34224 -32935 -18296 -12216 -7103 -3991 6815
1802 6815 8430 -7435 -18941 -12683 -1968 -2776 -8113 -25931 -39384 -46942 -27889 -27980 -19276 -16723
1788 -16723 -21231 -25420 -30739 -16317 -6203 -496 4841 8149 20171 17678 6026 5235 4743 -2261
1774 -2261 -2690 4591 4243 14462 9824 7670 6975 13118 9255 -1956 -7495 -2539 3341 4127 -8436
1759 -8436 -14166 396 811 4918 5749 951 -5104 -8113 -6845 -380 -1619 4135 19158 12351 -6069
1744 -6069 928 1386 6950 20840 23016 2254 -13572 -4224 -6619 -15380 -13179 -8569 8160 28113
1730 28113 29264 11817 1966 8143 4385 -7360 -14985 -23035 -16710 -16994 -142 9286 3598 -905
1716 -905 9843 10452 10301 1637 -9951 -16064 -27894 -32065 -13016 -12622 -15325 -6372 -11555 -34168 -40229
1701 -40229 -47156 -23265 -2964 804 5387 -4242 -3694 -3389 -1141 917 -2309 -8505 11665 14224
1687 14224 10 -16317 -33311 -36093 -12999 -2663 -2553 -2798 -6443 -2508 5949 11782 5395 -6963
1673 -6963 -15677 -8747 -12638 -13983 -10228 -17231 -5493 6415 2036 -3661 -14018 -2474 3787 9209
1659 9209 3009 13520 23279 11558 -1226 -1027 -2927 -5829 488 5020 6972 1265 -10920 -9658
1645 -9658 5459 -1868 -1904 -4274 -10167 -15814 -11162 -3668 -10813 -23799 -9282 7754 3699 5403
1631 5403 153 3823 5826 1404 -8683 3312 15059 5844 -1845 -1341 2015 -2914 -15895 -11526
1617 -11526 -5736 2045 -746 -11168 -17388 -10373 -3286 -18341 -26244 -3462 4292 1680 -204 -8820
1603 -8820 -5846 3827 7920 11183 14481 5853 4487 10454 14469 10201 -7775 -12168 -15451 -26640
1589 -26640 -5303 -273 -7753 -1299 -16615 -9721 -667 -5753 -9294 -7782 -6911 -1821 -7911 -10182
1575 -10182 -4484 -8064 -12953 -3467 -2962 -7115 -8565 7816 -415 7194 2779 2873 112 -11784 -19944
1560 -19944 -5267 690 -8092 -6142 -7523 -5766 -9109 -7107 -13440 -8640 -264 8956 15502 6659
1546 6659 14289 20714 -882 -10719 -11218 -20910 -22392 -29726 -21374 -16666 -18878 -33613 -36688 -40016 -18236
1531 -18236 -1250 -3021 -19341 -23281 -9782 -1271 -1157 5238 12997 19203 2713 -10594 7098
1518 7098 12301 4116 12332 5436 -398 -2841 -10628 2991 3809 -16731 -35183 -29529 -16055 -5337
1504 -5337 -15448 -18226 -13363 -15719 -21111 -5943 10463 3638 -11729 -10963 -10901 -10594 -5860 -18192 -26072
1489 -26072 -21187 -6908 -1739 -7576 -13358 -16661 -5420 856 12691 17884 7049 9560 9293 7500
1475 7500 -2768 -17498 -15994 -7413 2292 -1473 1990 5580 1815 2245 -1135 8244 3400 1355 -3076
1460 -3076 -6134 -26956 -31157 -16499 -10972 5896 9782 15854 8179 -2226 -6667 -17127 -16976 1673
1446 1673 1879 -14842 -25174 -25832 -21603 -19065 -19183 -10472 -6574 -4669 1247 1903 -8020 -17826 -16395
1431 -16395 -11339 -13618 -15041 -20474 -30235 -31896 -34599 -38032 -38852 -30794 -21768 -15955 -8888 3516 12702
1416 12702 -7707 -24176 -11964 11250 5784 -249 -2188 -551 6911 6325 8286 1434 -3806 -5574
1402 -5574 -7004 162 8884 19119 21862 -8 -5446 -8696 -20417 -8145 -3611 2191 16516 27405
1388 27405 23642 9171 -4029 -11404 -1782 2255 3380 -3650 -12276 -27601 -41508 -34809 -22569
1375 -22569 -18917 -20886 -19206 49 10552 3904 3470 389 12306 18733 6377 8643 9169 1723
1361 1723 -996 -12632 -17548 -12328 -3177 -20590 -29852 -20863 -3893 14403 11803 -2955 -2364 7608
1347 7608 14479 17071 15391 2777 -14319 -16242 -12191 -30 -3597 -1038 3339 11313 3064 -5534
1333 -5534 -16671 -1926 10651 25047 23501 24526 29523 29058 27766 24084 26299 17269 1277 6245
1319 6245 3877 2622 15594 23440 7315 6289 7023 -3755 -3822 -1191 -2255 -5127 2827 -7588 -9139
1304 -9139 -8910 -9376 -19958 -18857 -21778 -28159 -20531 -4197 2612 -5830 -12018 -19569 -18987 -15277 -12950
1289 -12950 -20394 -14715 -5311 -10084 -24769 -16819 -6726 1116 782 -14215 -24341 -20416 -8744 -9145
1275 -9145 -4120 -8513 -7456 6790 6528 2802 -2819 -6041 -2483 -7496 -4518 -90 7609 7489 -15311
1260 -15311 -25320 -9919 225 8760 -10807 -14326 -580 -15083 -18841 -7111 970 -6855 -12035
1247 -12035 -7657 -16508 -21753 -15179 -17115 -11874 -5632 1871 2080 -4402 -3882 1717 11007 20029 19667
1232 19667 5890 5905 -3456 -12097 -8275 2381 7956 11600 18407 24244 19030 21206 32493 25276
1218 25276 5468 -3477 5905 7647 -1045 -10842 -20432 -11860 -275 -8014 -13077 -3569 -2074 -11612
1204 -11612 -19559 -28966 -12693 -396 -940 12019 24649 29831 29257 17497 5843 4162 -4792 -15587
1190 -15587 -19734 2684 9088 379 -7074 -1816 -8169 -10972 -14491 -20403 -9005 3368 -4807 -6206
1176 -6206 -9491 -5144 2396 5292 -5126 -20098 -33167 -24054 -8440 3561 4667 1703 4736 3497
1162 3497 6266 -3744 -8958 -7896 -13574 -25987 -25133 -15164 -16617 -17229 -16373 -11180 -10327 -8268 -15083
1147 -15083 -17953 -15134 -11807 -10465 -14174 -14879 -15540 -11922 2898 7381 -4869 -7860 1371 2529 7750
1132 7750 -9707 -26297 -26366 -16022 -6868 -6203 -13057 -21712 -20935 -500 38 -13607 -12557 -6405 1319
1117 1319 11724 27271 18624 8769 -6687 -7946 -15186 -1633 -1182 -13904 -27732 -11708 2995
1104 2995 116 -9675 -6816 -7577 -7488 -9968 -10006 -3723 1262 9222 12028 14202 457 -28715 -34983 -30765
1088 -30765 -7469 -13842 -14400 -17343 -18996 -21578 -24051 -21729 -14493 -15418 -11634 -17782 -12506 -2923 -3658
1073 -3658 -4367 -17057 -29127 -41944 -33498 -25528 -20971 -20091 -20772 -36878 -40043 -33785 -37301 -47344
1059 -47344 -46777 -38963 -30672 -20021 -4526 -11043 -11261 -8229 -770 19597 14906 4886 5275 -5228
1045 -5228 -15589 -14751 -15262 -12448 -2169 10649 -3983 -6469 -9818 -15676 -11282 -5816 1767 -5842
1031 -5842 -18849 -8832 -1234 -632 6690 16514 670 1827 7171 11533 12802 -5062 -11340 -7677
1017 -7677 -8740 -7375 -5299 -3477 1595 2355 -1452 1125 2911 5789 -1195 5148 -4745 -12286 -5545
1002 -5545 -3855 -16100 -25464 -25940 -17646 -9809 -22452 -32122 -20093 -11820 -5047 -12041 -13124 -19992
988 -19992 -26966 -10257 3792 8279 4990 6293 5722 -5245 -14217 -7872 10560 17542 14220 11439
974 11439 8008 -4304 -11388 -11355 -12124 -10953 -15496 -15174 -20292 -24477 -10854 8 -13267 -28320 -23771
959 -23771 -23245 -26588 -19340 -8697 -586 -2707 -11647 -21852 -19587 -23322 -22844 -26476 -28893 -15419 -3313
944 -3313 7143 10211 2014 1303 11119 14549 16806 6233 -5197 -993 -1972 8071 9252 5266 -8279
929 -8279 -24395 -29447 -25275 -21768 -6466 -7126 -12251 -18804 -18522 -21234 -19993 -12978 -13592 1891 -9110
914 -9110 -9151 -2593 -11107 -5839 4641 -8821 -1341 11022 5363 2306 14438 9648 -2221 -13504
900 -13504 -11899 -5594 -9185 -4143 3371 12946 2274 -12849 -23151 -22023 -15623 -8522 6791 10673
886 10673 -5008 -10621 -5488 -586 -502 2380 2272 -8095 -2195 -1273 -5728 -12015 1007 9553 12227
871 12227 -4422 -10876 -7929 -8257 -5329 -45 6400 -580 -13728 -16581 -2139 7979 14645 15875
857 15875 5074 6542 779 -14182 -22456 -15722 -16249 -19572 -20319 -2102 3702 -17 -2515 2006 -245
842 -245 -3148 3790 -7487 -7373 -7638 -12749 -32221 -38003 -23033 -15793 -20776 -2580 6976 5255 1998
827 1998 -3775 -17729 -12051 -7697 -9070 -21283 -22476 -7799 9060 3029 -1928 -3864 -12862 -24958
813 -24958 -27124 -20468 -19621 -6013 3900 -4382 -22674 -23241 -2686 -405 -3793 1732 2176 -5016 -15671
798 -15671 -26315 -17199 -13031 -14696 -2153 1231 -5287 -20126 -22014 -17960 -13735 -24036 -23616 -20434
784 -20434 -8563 -6005 -14845 -12789 -14151 -18162 -21299 -19957 -2552 6543 6159 2003 1549 -6590 -15627
769 -15627 -15199 -24806 -15830 -13375 -23247 -17486 -477 -1430 -6031 -12272 -7725 -502 106 1707 4702
754 4702 11411 -1960 -10700 -24448 -20997 -7647 -9363 -15308 -19978 -15991 -5148 -6490 -18028 -11065
740 -11065 -1028 -5406 -14372 -17055 -13201 -18102 -10748 -14725 -15656 -6253 -3069 -4895 -1830 -4925 -12727
725 -12727 -18831 -16916 -1440 -451 -13482 -14232 -15684 -14543 -4846 -6358 -3907 -5000 -9691 -41676 -33277
710 -33277 -29628 -19681 -2551 10885 5708 3680 12142 19811 22646 11797 16231 9823 -219 9
696 9 5714 -2796 -20069 -18757 -20360 -24415 505 439 -12135 -5814 3454 -4479 -21419 -33380 -41127
681 -41127 -46310 -29953 -16477 -27116 -19229 -8792 -15465 -7079 -87 -9070 -13311 -16226 -10258 457
667 457 9733 13472 12551 5118 -5198 -20525 -13654 -12028 -5046 2462 9635 246 -19680 -25651 -17607
652 -17607 -28914 -34585 -14788 -7182 -9655 -28244 -41088 -39707 -27455 -22033 -16074 5567 14439
639 14439 12869 -280 -15571 -15817 -12772 -18925 -27197 -22562 -6054 -7462 -4338 181 2360 -7851
625 -7851 -24098 -29926 -31216 -38861 -37071 -15821 -46 -229 -8995 -21351 -15045 -15774 -2167 -1334 -6628
610 -6628 1321 12738 2994 -13192 -13279 -16779 -10016 -12215 -13746 -34356 -29878 -25142 -24932 -10766 -13178
595 -13178 -26561 -19926 -16048 -24197 -27353 -26023 -20712 -11948 -12180 -9124 -5773 -9076 -18231 -22483 2977
580 2977 21143 29222 28579 21184 12497 -10275 -15773 -13025 -18861 -31252 -33215 -17234 -18465 -6401
566 -6401 628 -11346 -19230 -18823 -15329 -23946 -23821 -23543 -22880 -16485 -22925 -18677 -16122 -16520 -13223 -4874
550 -4874 -12069 -27215 -23790 -21403 -23015 -20907 -16528 -12866 -14558 -19786 -16798 -16797 -8239 9546 1871
535 1871 -15547 -25566 -9016 1747 -3723 10194 22205 5138 -14870 -14642 -15834 -12644 -5861
522 -5861 244 -12252 -12441 -5508 5273 8294 5428 -3360 -6232 -10739 -14153 -22612 -22853 -20130 -18453
507 -18453 -5729 -100 -9018 -16923 1716 2140 -5937 2668 -226 -4613 -10175 -2366 -2482 -6293 -7181
492 -7181 -12812 -6403 5563 11192 -4053 -12424 -10754 -5570 -9995 -16902 -14216 -9347 5006 4612 -6069
477 -6069 -14605 -5225 2148 -9967 -25126 -30210 -31054 -20916 -12371 -5765 -853 -1489 -4730 -25715 -33468
462 -33468 -12506 -4312 -14266 -7449 -7339 -13188 -13293 -759 1997 4752 -9871 -15473 -9428 -2131 3157
447 3157 6302 4758 1071 -489 8067 3957 -3685 -2305 -17262 -21674 -16775 -12902 -10762 -12873 -26446
432 -26446 -38947 -36168 -29370 -13351 -997 -3456 -8685 -11730 -16439 -15001 2118 638 -15711 -14939
418 -14939 -13654 -26494 -20406 -7877 -21124 -30787 -30243 -18714 -9035 7380 15441 11181 -7468 -19034
404 -19034 -24644 -12246 -8780 -5703 -7660 -11761 -7865 -15658 -31123 -29920 -20767 -16124 -22218 -29762
390 -29762 -28975 -27485 -21274 -7590 -578 878 -1424 -7883 -3775 -3997 -4312 -4095 429 -16993 -32644
375 -32644 -40507 -40368 -38845 -22666 -8492 -4203 -13369 -10495 5420 -3975 -4079 -15790 -20320 -18709
361 -18709 -15871 -17874 -14349 -7439 -11720 -18057 -27592 -38506 -33756 -23207 -19436 -8791 -7044 1858
347 1858 11996 7306 3655 5283 5085 6581 6607 2734 -3794 -5913 -6817 -9541 -4577 -8747 -12380 -13145
331 -13145 -15130 -22746 -30377 -22146 -3301 5391 1713 858 1754 6735 6137 -1812 -2043 -4769 -5108 -4754
315 -4754 -16874 -21839 -28320 -27534 -17959 -14034 -5550 724 -13399 -25680 -19193 -22766 -22974 -16639 -8631
300 -8631 -9488 -7273 -4321 -5621 -5779 -23569 -30458 -17259 -6182 670 6585 5194 -12512 -16239 -6810
285 -6810 -1757 -842 -3024 -7111 -15957 -19525 -13140 -15059 -26506 -23752 -20188 -14593 -9876 -4940 -9929
270 -9929 -14690 -20775 -19510 -17097 -16633 -12879 -4079 -12384 -26719 -38023 -48014 -40818 -22237 -6343
256 -6343 -5041 -4015 -13888 -25599 -24349 -21817 -17852 -15753 -17684 -12170 -10114 -12647 -12646 -13632 -18146 -25104
240 -25104 -42717 -49198 -48483 -45968 -39762 -25858 -23377 -28269 -23370 -14338 -3947 -4455 -6280 -5930 -9589
225 -9589 -14637 4763 7814 -7187 -2787 -5608 -12529 -25852 -21095 -18881 -11475 -3999 -4682 -6066 -7936
210 -7936 -10091 -15625 -12552 -995 11899 5692 -5109 -7304 -8468 -11735 -13632 -2889 7255 3873
196 3873 3556 -7875 -10069 -12581 -18763 -17858 -25135 -18792 -8599 -3766 -3839 -5559 -14659 -21499 -23786 -30899
180 -30899 -38730 -44307 -33230 -13700 -11848 -2700 -1940 -15914 -34271 -38484 -35875 -19840 -19276 -19453
166 -19453 -22446 -25150 -30071 -32488 -27813 -18448 -21035 -33959 -32666 -23215 -10038 -7745 -3400 -10729
152 -10729 -7482 -1761 658 -8012 -15153 -20381 -22449 -26194 -12411 548 3563 6249 2865 -7138
138 -7138 1484 -1350 -1475 -3743 -18074 -17454 -11754 -13824 -16304 -16704 -3320 -11323 -18331 -14548 -15846
123 -15846 -14734 -10210 -8495 -6580 -9965 -14999 -8536 -8744 -13997 -16286 -12408 -78 -6337 -12608 -12052
108 -12052 -14761 -9124 -8307 -7789 -13826 -17804 -7902 8117 7993 6820 9482 5740 2786 10397 6429
93 6429 10442 7938 2999 5287 11188 12684 8680 8012 -3312 -15560 -23925 -19670 -19331 -27735 -29252
78 -29252 -24218 -12541 -10572 -9438 -9160 -16770 -17463 281 1405 -8811 -12279 -16609 -19990 -28093 -31097
63 -31097 -28240 -22973 -10077 -11184 -20767 -34292 -40820 -37875 -32092 -24852 -10102 -1466 -1217 -13977
49 -13977 -7892 -14503 -16788 -13069 -16905 -14227 -13910 -20704 -18958 -23906 -22908 -21307 -18118 -16538 -13206 -13304
33 -13304 -13424 -12201 -10409 -8661 -8187 -10278 -20088 -19328 -13878 -10104 -9160 -12675 -22935 -29551 -24778 -12041
17 -12041 -2896 -2641 -9228 -12931 -19083 -30686 -20089 -16025 -14362 -9712 -5430 -6038 -8499 -12991 -18450
2 -18450 -14451 -6576
0 -6576
$$ Imaginary data points
##PAGE= N=2
##DATA TABLE= (X++(I..I)), XYDATA
32767 57620 61005 55354 54862 68368 71062 65037 54856 52909 51243 58363 68252 69595 76997 73982
32753 73982 68179 65895 66535 60651 57681 52477 53058 58336 67172 77979 74297 76957 67763 56338
32739 56338 56713 54217 58284 63765 63873 67576 71912 70081 69660 71798 75272 68406 62678 67086 69093
32724 69093 69621 68970 75298 79939 69358 71496 85983 80483 76911 78176 82037 87543 82207 84858
32710 84858 86851 80398 84034 85393 82212 86960 88552 89902 90505 92499 79570 85044 78013 72077
32696 72077 76354 65874 70163 82859 79475 75425 76556 84952 87108 96909 109756 104262 94674 94517
32682 94517 99252 97714 96642 98862 99175 99525 99157 91867 88244 90305 87446 73045 73789 82040 94873
32667 94873 99927 95387 99352 91401 85912 84519 83951 83785 85133 102956 108896 112712 111956 103494 102825
32652 102825 100242 94792 102075 104625 95364 97049 113801 125417 122424 112561 107070 117471 115062
32639 115062 116885 116019 110729 108102 107775 106964 103014 101168 106732 107447 107564 104618 109170 121151 123701
32624 123701 121587 125394 119402 122517 121838 109377 108175 102995 94489 94088 95751 98778 105019 104816 99866
32609 99866 105286 109298 111620 110141 100168 97977 99758 104664 110436 107229 122183 121052 118947 116707
32595 116707 117336 117725 128282 133956 138721 129944 120810 112356 97977 100744 105723 108021 116472 112902
32581 112902 112094 113187 108533 107088 119177 119427 123656 124226 132228 143452 135143 126553 131159 124462
32567 124462 116458 113039 113069 114739 114154 113752 110895 124494 143825 151225 139977 132141 129729 135073
32553 135073 145480 149530 145587 148623 147766 139599 139508 123480 124514 126608 135244 135625 139333 134177 135512
32538 135512 143980 141143 138041 127673 115296 119620 121476 128494 142130 140844 152443 155949 144289
32525 144289 131579 117217 110606 119368 128368 134767 135885 138704 147696 144786 147333 155330 158080 149984
32511 149984 143101 142666 143432 145091 152925 144227 140727 146709 157917 157837 153673 155822 153531 154525 155389
32496 155389 144539 137739 135355 133141 135828 133878 144846 148544 150075 143467 141995 152773 152863 149671
32482 149671 155377 162594 165221 171772 168352 160810 165331 170308 152023 143272 153861 159802 163760 165611
32468 165611 158453 149391 143266 144634 160706 160155 158038 161165 159805 155624 149034 142880 149038 158187
32454 158187 153182 142033 143256 149408 150834 159294 181300 169182 145521 146320 150673 139910 143753
32441 143753 153553 159793 167513 164632 147303 149763 167748 169540 168616 161980 158642 152106 137297 145950
32427 145950 156552 158534 165399 164256 159267 157798 163290 159878 161772 163056 178229 184673 188717 176264
32413 176264 166970 155946 157167 154217 142923 150422 155170 155911 157262 165555 164024 167455 166202 161397
32399 161397 152397 149260 166446 170253 167150 167611 168868 165511 165354 175508 168941 162234 160611 155179
32385 155179 163937 152025 141914 153328 159724 166866 164868 174276 184956 188159 183875 176152 177903
32372 177903 176412 177028 175791 163942 167138 175081 191294 192691 172960 166357 150496 151583 159206
32359 159206 165598 173700 171354 160423 151186 146180 151039 156669 158858 161997 172070 176816 183140 180408
32345 180408 170819 155761 149959 154459 162763 169566 173105 182085 188605 190385 196723 211678 213006 213168
32331 213168 217530 223409 215404 199820 194342 177548 168664 173731 172527 171099 165571 172202 183578
32318 183578 162082 165653 189379 197253 178060 172719 164357 171930 187925 198470 194889 178440 168576
32305 168576 170634 169122 171460 163439 166214 168940 165267 175340 188539 181511 185903 205335 206482
32292 206482 196151 187154 189802 184622 176302 179990 184352 185887 177297 152222 141757 151485 160060
32279 160060 161211 177560 182710 177897 184475 185895 184120 168126 161169 170163 169242 166881 164685 171371
32265 171371 175583 176570 175811 178378 176009 167372 153812 150849 151164 166707 160849 172290 180746 176174
32251 176174 164684 162546 173312 189926 189990 176970 182313 200667 205648 197621 194539 177930 160833
32238 160833 160509 177207 193531 189251 188783 183290 184309 184206 186417 195539 195264 182304 184321 199370
32224 199370 198888 195959 200506 188198 184822 186096 192282 181062 178329 188451 198676 192758 183589
32211 183589 176725 178542 170667 159040 172984 182593 189280 185266 180963 169883 166251 163767 166290
32198 166290 173055 193334 200213 192392 186268 181116 180099 183678 196759 196529 185699 188187 196757 202216
32184 202216 182700 166502 173017 179702 188725 200777 197251 193093 185797 184105 177879 161788 174922
$$ [...]
##END NTUPLES=NMR SPECTRUM
##END=
