##TITLE=Analysis number 307693
Compound Code mo 01269
Book Reference 408/154/2
Project Code adrs
Chemist Name laurenf
##JCAMPDX= 6.0         $$ Bruker NMR JCAMP-DX V2.0
##DATA TYPE= NMR SPECTRUM
##DATA CLASS= NTUPLES
##ORIGIN= Bruker BioSpin GmbH
##OWNER= NMR
$$ XWIN-NMR		Version 3.5
$$ Mon May  9 16:00:58 2005 GMT Daylight Time (UT+1h)  MAYBRIDGE\NMR@NMR_250MHZ
##.OBSERVE FREQUENCY= 250.131544655141
##.OBSERVE NUCLEUS= ^1H
##.ACQUISITION MODE= SIMULTANEOUS (DQD)
##.ACQUISITION SCHEME= undefined
##.AVERAGES= 16
##.DIGITISER RES= 18
##SPECTROMETER/DATA SYSTEM= dpx250
##.PULSE SEQUENCE= zg30
##.SOLVENT NAME= CDCl3
##.SHIFT REFERENCE= (INTERNAL, CDCl3, 0, 16.522)
##AUDIT TRAIL= $$ (NUMBER, WHEN, WHO, WHERE, WHAT)
$$ ##TITLE= Audit trail, XWIN-NMR		Version 3.5
$$ ##JCAMPDX= 5.01
$$ ##ORIGIN= Bruker BioSpin GmbH
$$ ##OWNER= NMR
$$ C:\u/data/dgb/nmr/ADRS/2780/pdata/1/auditp.txt
$$ ##AUDIT TRAIL=  $$ (NUMBER, WHEN, WHO, WHERE, WHAT)
(   1,<2005-05-09 16:00:40.45 +100>,<MAYBRIDGE\NMR>,<NMR_250MHZ>,
      <created by zg, POWCHK disabled, PULCHK disabled
       configuration hash MD5:
       62 19 C7 07 E1 42 D1 B7 37 6C 3D D0 77 39 F9 E6
       data hash MD5: 64K
       B1 B9 C6 04 3F 83 91 0E 03 A4 05 77 AF 63 B1 B1>)
(   2,<2005-05-09 16:00:51.21 +100>,<MAYBRIDGE\NMR>,<NMR_250MHZ>,
      <Start of raw data processing
       ef LB = 0.3 FT_mod = 6 PKNL = 1 SI = 32K 
       data hash MD5: 32K
       0A 5C DE 7D F8 C6 80 6B 27 18 AB B2 76 A7 08 0B>)
(   3,<2005-05-09 16:00:53.15 +100>,<MAYBRIDGE\NMR>,<NMR_250MHZ>,
      <apk 
       data hash MD5: 32K
       56 D7 55 32 85 AA F6 48 DB D0 7F D8 31 F0 84 F2>)
(   4,<2005-05-09 16:00:53.90 +100>,<MAYBRIDGE\NMR>,<NMR_250MHZ>,
      <abs ABSG = 5 
       data hash MD5: 32K
       CD 5A 1F 9E DC B6 27 67 C7 DF 8E 6A 81 21 8B E9>)
$$ ##END=
$$ 
$$ hash MD5
$$ 0D B1 5E C9 B3 97 D5 11 40 4D 7C 33 8C 26 45 B8
##$RELAX= 
##$RELAX= 
##$RELAX= 
##$RELAX= 
##$RELAX= 
##$RELAX= 
##$RELAX= 
$$ Bruker specific parameters
$$ --------------------------
##$DU= <C:\u>
##$EXPNO= 2780
##$NAME= <ADRS>
##$PROCNO= 1
##$TYPE= <nmr>
##$USER= <dgb>
##$AMP= (0..31)
100 100 100 100 100 100 100 100 100 100 100 100 100 100 100 100 100 100 
100 100 100 100 100 100 100 100 100 100 100 100 100 100 
##$AQSEQ= 0
##$AQ_mod= 3
##$AUNM= <au_zg>
##$AUTOPOS= <27 >
##$BF1= 250.13
##$BF2= 250.13
##$BF3= 250.13
##$BF4= 250.13
##$BF5= 500.13
##$BF6= 500.13
##$BF7= 500.13
##$BF8= 500.13
##$BYTORDA= 1
##$CFDGTYP= 0
##$CFRGTYP= 5
##$CHEMSTR= <none>
##$CNST= (0..31)
1 1 145 1 1 1 1 1 1 1 1 1 1 1 1 1 1 1 1 1 1 1 1 1 1 1 1 1 1 1 1 1 
##$CPDPRG= <>
##$CPDPRG1= <>
##$CPDPRG2= <>
##$CPDPRG3= <>
##$CPDPRG4= <mlev>
##$CPDPRG5= <mlev>
##$CPDPRG6= <mlev>
##$CPDPRG7= <mlev>
##$CPDPRG8= <mlev>
##$CPDPRGB= <>
##$CPDPRGT= <>
##$D= (0..31)
0 1 0 0 0 0 0 0 0 0.06 0 0 0 0 0 0 0.0002 0 0 0 0 0 0 0 0 0 0 0 0 0 0 
0 
##$DATE= 1115650839
##$DBL= (0..7)
120 120 120 120 120 120 120 120 
##$DBP= (0..7)
150 150 150 150 150 150 150 150 
##$DBP07= 0
##$DBPNAM0= <>
##$DBPNAM1= <>
$$ [...]
##$SUBNAM7= <"">
##$SUBNAM8= <"">
##$SUBNAM9= <"">
##$SW= 20.6930455092707
##$SWIBOX= (0..15)
0 0 3 0 0 0 0 0 0 0 0 0 0 0 0 0 
##$SW_h= 5175.983436853
##$TD= 65536
##$TD0= 1
##$TE= 296.16
##$TE2= 300
##$TE3= 300
##$TEG= 300
##$TL= (0..7)
0 120 120 120 120 120 120 120 
##$TP= (0..7)
150 150 150 150 150 150 150 150 
##$TP07= 0
##$TPNAME0= <>
##$TPNAME1= <>
##$TPNAME2= <>
##$TPNAME3= <>
##$TPNAME4= <>
##$TPNAME5= <>
##$TPNAME6= <>
##$TPNAME7= <>
##$TPOAL= (0..7)
0.5 0.5 0.5 0.5 0.5 0.5 0.5 0.5 
##$TPOFFS= (0..7)
0 0 0 0 0 0 0 0 
##$TUNHIN= 0
##$TUNHOUT= 0
##$TUNXOUT= 0
##$USERA1= <user>
##$USERA2= <user>
##$USERA3= <user>
##$USERA4= <user>
##$USERA5= <user>
##$V9= 5
##$VALIST= <valist>
##$VCLIST= <CCCCCCCCCCCCCCC>
##$VD= 0
##$VDLIST= <DDDDDDDDDDDDDDD>
##$VPLIST= <PPPPPPPPPPPPPPP>
##$VTLIST= <TTTTTTTTTTTTTTT>
##$WBST= 1024
##$WBSW= 4
##$XGAIN= (0..3)
0 0 0 0 
##$XL= 0
##$YL= 0
##$YMAX_a= 413210
##$YMIN_a= -531731
##$ZGOPTNS= <>
##$ZL1= 120
##$ZL2= 120
##$ZL3= 120
##$ZL4= 120
##$ABSF1= 16.522
##$ABSF2= -4.171173
##$ABSG= 5
##$ABSL= 3
##$ALPHA= 0
##$AQORDER= 0
##$ASSFAC= 0
##$ASSFACI= 0
##$ASSFACX= 0
##$ASSWID= 0
##$AUNMP= <proc_1d>
##$AZFE= 0.1
##$AZFW= 0.1
##$BCFW= 0
##$BC_mod= 0
##$BYTORDP= 0
##$COROFFS= 0
##$CY= 12.5
##$DATMOD= 1
##$DC= 0
##$DFILT= <>
##$DTYPP= 0
##$F1P= 14.0000005364418
##$F2P= -0.99999901652339
##$FCOR= 0.5
##$FTSIZE= 32768
##$FT_mod= 6
##$GAMMA= 0
##$GB= 0
##$INTBC= 1
##$INTSCL= 1
##$ISEN= 128
##$LB= 0.3
##$LEV0= 0
##$LPBIN= 0
##$MAXI= 10000
##$MC2= 0
##$MEAN= 0
##$ME_mod= 0
##$MI= 0
##$NCOEF= 0
##$NC_proc= -4
##$NLEV= 6
##$NOISF1= 0
##$NOISF2= 0
##$NSP= 0
##$NTH_PI= 0
##$NZP= 0
##$OFFSET= 16.522
##$PC= 1
##$PHC0= -74.60422
##$PHC1= 7.039634
##$PH_mod= 1
##$PKNL= yes
##$PPARMOD= 0
##$PSCAL= 4
##$PSIGN= 0
##$REVERSE= no
##$SF= 250.13
##$SI= 32768
##$SIGF1= 0
##$SIGF2= 0
##$SINO= 400
##$SIOLD= 32768
##$SREGLST= <1H.CDCl3>
##$SSB= 0
##$STSI= 32768
##$STSR= 0
##$SW_p= 5175.98343685301
##$SYMM= 0
##$S_DEV= 0
##$TDeff= 65536
##$TDoff= 0
##$TI= <Analysis number 999999
Compound Code 99
Book Reference 9
Project Code 9>
##$TILT= no
##$TM1= 0
##$TM2= 0
##$TOPLEV= 0
##$USERP1= <user>
##$USERP2= <user>
##$USERP3= <user>
##$USERP4= <user>
##$USERP5= <user>
##$WDW= 1
##$XDIM= 32768
##$YMAX_p= 362520659
##$YMIN_p= -530491
$$ End of Bruker specific parameters
$$ ---------------------------------
##NTUPLES= NMR SPECTRUM
##VAR_NAME=  FREQUENCY,     SPECTRUM/REAL,   SPECTRUM/IMAG
##SYMBOL=    X,             R,               I
##VAR_TYPE=  INDEPENDENT,   DEPENDENT,       DEPENDENT
##VAR_FORM=  AFFN,          ASDF,            ASDF
##VAR_DIM=   32768,         32768,           32768
##UNITS=     HZ,            ARBITRARY UNITS, ARBITRARY UNITS
##FACTOR=    0.157963299565203, 1,           1
##FIRST=     4132.6476996994, 0,             0
##LAST=      -1043.33573715361, 0,           0
##MIN=       -1043.33573715361, -530491,     0
##MAX=       4132.6476996994, 362520659,     0
$$ Real data points
##PAGE= N=1
##DATA TABLE= (X++(R..R)), XYDATA
$$ [...]
24203 8481 5326 10397 15245 -5567 -41232 -49962 -42431 -27549 -30023 -42565 -38999 -30200 -24998 -36275
24189 -36275 -44740 -40457 -36099 -62920 -47683 -37729 -19940 -4414 571 48599 75125 46731 21721
24176 21721 47353 24270 15342 -14335 -41563 -55135 -57262 -35597 2260 12978 -14521 -53139
24164 -53139 -40790 -43877 -35327 -17242 -27540 -9224 -13673 -13804 -10218 -21593 -55510 -33585 -20424
24151 -20424 -9858 -6661 -7688 -27036 -21236 -1040 8937 -6358 -458 19689 3552 -13286 -26642
24138 -26642 -23666 -4184 18108 13423 -23039 -12523 30751 52822 57320 102869 80487 61810
24126 61810 41365 41881 64033 62986 21330 -9642 -2523 6934 -3548 -22936 -17160 -29222 -27960
24113 -27960 -38573 -10375 6599 -11696 65 32752 58035 57520 34221 5938 -8548 21715
24101 21715 48379 92381 76573 77183 61447 36880 38640 49933 71191 106647 70419 42060
24089 42060 24444 55560 87429 90456 68905 57266 52781 42110 -1987 -14252 -2554 -6705
24077 -6705 -10315 -41721 -85081 -56157 -76600 -55991 -24268 14875 43493 73461 63172 15475
24065 15475 -28104 -48669 -29359 -7373 28031 962 -23520 -35554 -7423 17467 -24219 -27582
24053 -27582 -11739 -4300 -47032 -40377 445 33096 15361 8367 5493 -6689 -18555 -42818
24041 -42818 -51522 -78938 -90664 -103918 -113483 -99984 -71934 -47718 -47504 -58762 -46076 -42060 -57744
24028 -57744 -76768 -55160 -55153 -56748 -50997 -41827 27258 47538 -22550 -32627 -11526 -7123 -16890
24015 -16890 -62944 -53118 -19248 42100 56829 31 -1389 29118 31550 4786 -13224 -11533
24003 -11533 -14183 -14349 -4920 7145 8088 -12920 11732 17683 40140 71522 89125 69995 34605
23990 34605 38845 48653 38208 16931 -9398 -9831 -38321 -15804 45589 42385 37782 27375 34974
23977 34974 61597 44989 21790 -20224 -29236 -21278 -19370 -33352 -29159 -7271 -20836 -23062 -52000
23964 -52000 -23565 -1372 -17229 19957 30758 31710 38879 23260 24459 13983 -21639 -41253
23952 -41253 -20501 -370 -12688 -41714 -17986 -5362 17591 4784 19558 28490 9499 35846
23940 35846 32262 -17100 -31937 -24186 5654 4645 2132 30333 32152 94835 100318 67484 24594
23927 24594 -2072 -14611 -43451 -51270 -15367 32798 -986 -33692 -44923 -9102 1679 -24945
23915 -24945 -18687 4009 10921 19744 23758 30520 -554 -6964 -2148 -1444 -25969 -32180 -29822 -31676
23901 -31676 -65372 -53385 -25377 -19069 -11687 -8618 46276 37841 1771 -28172 -52301 -60477 -43769
23888 -43769 -4480 -5594 -39243 -26828 -6935 -9244 20983 24523 13189 14218 56009 50391 52406
23875 52406 33824 15010 -8977 -40180 -57927 -37244 17956 53129 56977 22766 18321 11546
23863 11546 21168 40758 10907 -17248 -6578 -11529 13225 35682 24876 15987 6962 -9251
23851 -9251 -40410 -61614 -41086 -20811 -19248 -4851 35474 45140 43956 12586 20963 40285 38024
23838 38024 6672 -19063 -34180 -29756 11574 14865 12943 28535 7991 8784 10687 13360 34280
23825 34280 50901 48023 47878 42466 24502 46592 50419 42832 28756 25934 20566 -10561 -10671 -5221
23811 -5221 -7004 495 2899 -11321 -65232 -65427 -35670 -7279 -26874 -16145 11829 -49033 -61587
23798 -61587 -37771 -7918 -23109 -22229 -16316 -9455 23609 52267 59307 13674 -23751 -4895 8019
23785 8019 12459 14865 20335 2614 -37858 -42772 -50757 -59823 -63312 -61962 -49550 -21479 -4758
23772 -4758 15948 10297 -4904 -24592 -22982 -7517 22288 20528 1978 13174 19727 2216 -9134
23759 -9134 -48675 -28479 687 -9691 22369 49613 38431 64394 85127 86205 31929 29329
23747 29329 24647 5764 -15802 18636 76739 33433 -19254 -18924 -4530 3674 4911 -13628 -48188
23734 -48188 -62999 -15732 -10658 34112 26244 -3390 -3103 -18981 -45323 -38500 -767 14768 23350
23721 23350 16491 44721 47243 54638 65073 25416 -10703 -47155 -78618 -82710 -54363 -71227
23709 -71227 -56540 -31838 -39216 13191 29594 17670 -12372 -12097 1894 -35418 -3275 67028
23697 67028 37413 21127 -1021 -11106 -547 -12656 -57489 -29019 18770 43245 34195 6469
23685 6469 10941 8440 -27307 -38478 -29308 -16493 -22052 -17337 20666 28119 17235 16954 9438 9752
23671 9752 12972 7928 17672 1558 -3216 8255 8714 -11742 -30229 -46718 -55386 -64081 -42442
23658 -42442 -33018 -39188 -23105 -9780 -9736 -13128 -6319 -8306 -18816 -19452 -21178 8524 47191 40296
23644 40296 41660 19783 -38054 -23516 -10779 12705 48648 53061 58233 37572 11928 23130
23632 23130 28378 63135 58261 56211 34789 31328 12582 -18951 -31656 -13752 6245 1374 116
23619 116 -16483 -21221 -17413 -17036 -27993 -15904 -5879 24454 8498 25338 15738 -392 2743
23606 2743 1748 23530 41644 50091 24746 2211 9899 40051 21199 -7601 -5488 -15040 7003
23593 7003 34010 37827 37758 50975 49101 36107 2088 -41955 -96971 -80256 -42238 -29125 -23254
23580 -23254 -42032 -9703 -15299 -9376 -3638 13420 43929 12016 -37067 -8696 19013 38929
23568 38929 41758 17521 8572 24167 30822 49517 54401 44108 36730 21146 16951 -9984 -62290
23555 -62290 -91284 -47313 -8861 -30758 -49041 -33137 -37141 -29761 -5537 -2549 5864 3293 18891
23542 18891 13259 36568 62985 49527 37102 8280 -11700 -10032 -49755 -46719 -31841 631
23530 631 24453 5416 -11619 -33692 -49814 -9061 -588 7132 -1346 -9025 -16952 -30550 -37896
23517 -37896 -6602 22924 55790 46300 62108 82010 41274 27160 26867 43995 31553 13774
23505 13774 -30132 -52703 -30802 3845 30784 29967 12433 -18731 -27729 -31649 -13939 -609
23493 -609 -55251 -114089 -77699 -49177 -30966 -3104 22858 5259 2826 1696 25349 31042 10118
23480 10118 -11400 -27634 -30900 -20278 -4940 5128 4043 -13270 8946 14659 7043 8597 12082
23467 12082 26445 10110 -25456 10243 31140 17510 11119 20260 26122 32918 13046 -9665
23455 -9665 -9005 16392 47422 91057 103588 70435 75449 103988 95698 62509 -42586 -79993
23443 -79993 -57921 -62428 -82671 -70757 -38521 -66822 -54042 -35590 -63565 -28693 -8705 -6578
23431 -6578 -24739 -36237 -18830 -4295 3176 22173 11498 14679 -14200 -12078 2042 -12122
23419 -12122 -30982 -20456 -7077 -24344 -9198 -17807 4752 12812 45173 19401 -1006 19886
23407 19886 32805 30766 40971 25557 27840 33152 4935 8195 25029 44246 39302 29282 9682
23394 9682 -19392 -15682 3935 11683 16256 172 -22363 -31114 -28258 -28272 -2937 453 42663 17745
23380 17745 -33306 -63383 -72992 -94974 -77251 -38598 -19278 -51593 -52163 -8432 31412 47990
23368 47990 73979 82307 59276 24746 39217 29368 -1349 -28837 -26758 6336 30832 12244
23356 12244 -5489 10869 25604 18948 54035 33789 -13498 -7112 -14852 -15622 -31344 -29487 -32024
23343 -32024 -44443 -68337 -42698 6856 -12501 -5801 18618 30170 12965 -23500 -49170 -36579
23331 -36579 -39184 -18273 17901 19140 35615 -1833 -48250 -15854 20652 3660 -220 -1741
23319 -1741 11580 10564 4391 -4894 56742 72948 39992 22727 44056 42475 44864 64597 70393
23306 70393 47861 51744 17692 -35242 -58306 -60197 -29541 -14614 -15500 402 -17233 -52212
23294 -52212 -65156 -32412 -20548 -11033 12507 28700 22982 39593 -1147 -16951 -3846 -5897
23282 -5897 -3387 -2215 -4698 -14338 -6259 51049 35670 6906 -31247 -73956 -49201 -11912 -8412
23269 -8412 -16001 2908 2427 8406 18760 22368 34120 24788 18461 14977 4974 -38570 -48423 -14359
23255 -14359 16726 18907 13667 -3214 -34732 -81197 -87228 -55432 -53951 -50943 -33599 -13644 -10470
23242 -10470 -10474 14011 4826 409 16135 -20620 -65469 -45317 566 2654 -28234 -62114 -46644
23229 -46644 -24541 -12239 -19412 -26642 -21830 -46131 -67550 -48698 -26592 -17413 -25758 -17213 11815
23216 11815 30913 34358 39834 -2764 13406 20973 368 -31064 -31908 -3833 -22582 -26127 -21117
23203 -21117 -18020 -42824 -17525 -36803 -35069 -8083 9251 2256 -26300 -19229 -8133 -7109 8501
23190 8501 3817 2350 2240 5924 -17804 -24949 -9727 -45814 -62605 -24696 1585 -2890 6135
23177 6135 10019 21035 -27467 -28604 16146 12707 -5680 -14204 -45765 -78989 -74295 -41323 -9997
23164 -9997 6036 -13238 -5396 -3933 -5986 4662 9422 -15473 -19457 -30935 -38348 -18307 25562
23151 25562 19728 4945 24227 49891 5836 -21404 -57165 -67751 -25573 -14583 -33554 -39589
23139 -39589 -22432 -22177 -42396 -45783 -7500 751 30167 12192 -11859 -14869 -21046 -28099 -37689
23126 -37689 -14675 -183 -17765 -11223 -10812 -14018 22838 38364 11814 -21221 -27450 -30761 -22247
23113 -22247 -33605 -57436 -45606 -51482 -51471 -69280 -68271 -59351 -72792 -46711 -20907 12053 -13528
23100 -13528 -36868 -25916 -8421 -1796 7946 36179 51671 -25124 -55650 -43324 -30921 -7472
23088 -7472 -5727 12214 -5427 11375 44724 18232 16703 12541 -13351 -50598 -58184 -51717 -35815
23075 -35815 -28616 -3993 -641 15879 -5689 -27601 -15876 -34478 -31410 2684 38892 20217
23063 20217 12954 29803 35674 56164 64593 9553 -2540 15659 -15279 4064 25986 68968
23051 68968 59235 33561 27119 32299 29703 21742 15538 -10438 -23772 3197 8031 -6400 -37475
23038 -37475 -23646 -5010 -17145 -988 4464 -6618 -7349 -7311 -24047 -73142 -46382 3652 28212
23025 28212 29067 15301 8249 4731 8637 19130 13821 -10412 -11435 9520 -34480 -65022 -71740
23012 -71740 -50783 -44667 -43648 -81969 -93230 -80597 -56531 -58972 -37742 -20548 -10638 293
23000 293 8979 1952 6949 -6517 -16510 -7978 -26254 -35561 -26854 2713 9443 60514 53445 35329
22986 35329 36695 14327 -45411 -74142 -77315 -67124 -32650 -2167 2217 15810 16051 -7924 -19187
22973 -19187 -10273 -26754 -27815 -20779 -18010 -30806 14298 35893 28183 -6821 -26415 -63777 -93448
22960 -93448 -74735 -63765 -65689 -82229 -59128 -44631 -48677 -15910 -30018 -56432 -44897 -28114
22948 -28114 -11539 7318 25368 -14816 -46458 -87709 -76866 -50152 -48286 -26534 949 24863
22936 24863 18299 27274 -11746 -44402 -29823 611 15118 -34935 -60921 -67275 -76009 -61877
22924 -61877 -91515 -110599 -73945 -16549 9271 25275 -6550 -13284 -1040 -30531 -20827 -25146
22912 -25146 -19900 -7429 -39497 -54434 -40126 -34919 12589 51539 74136 63614 13604 5902
22900 5902 44876 15682 18230 -20472 -18855 1147 -10857 -335 -2819 37085 13602 -7977
22888 -7977 -21753 -44664 -51477 -19813 -38340 -67675 -17868 36506 54113 44308 26657 33295
22876 33295 48035 25913 7614 5603 1370 -24427 15744 31651 24144 14123 -19568 -44452
22864 -44452 -22608 -14121 -15458 -26957 -39847 -6817 9128 -12444 -10299 -25 -2679 22355
22852 22355 568 -20998 -21802 -25744 -22743 -27366 -43034 -19454 -27115 -52799 -47021 -22804 -22629
22839 -22629 -42639 -28715 27453 9542 -18966 -46216 -34481 -10004 15351 8295 -30948 -13004
22827 -13004 -15883 -32753 -49506 -32917 -18850 -5004 5761 24431 27632 37359 12202 2574
22815 2574 -10453 5493 17004 33823 34071 30387 36911 12787 29342 2912 -28082 -28925 16927
22802 16927 51935 30628 -2159 18367 -4466 -37061 -41703 954 -6210 -30324 -26677 -28022
22790 -28022 -21114 -31084 6133 4261 -6810 -32443 -54062 -27074 25195 37716 49682 29772
22778 29772 16212 11847 18834 18922 494 9490 36193 83628 82972 47653 69862 24687 -4074
22765 -4074 -21260 -11069 5023 43136 58215 62042 42203 25308 -10292 -24930 -13585 8534
22753 8534 24764 38616 46087 48159 45291 9394 31479 30122 -4765 -4121 -19716 -5430 21543
22740 21543 37687 21865 -5100 -11472 40130 50458 26618 23756 25948 -16085 -7043 1927 43281
22727 43281 28506 12869 43508 28170 39063 67869 41750 11555 2050 24001 -21069 -22362
22715 -22362 9578 46256 32591 1226 -41823 -60495 -41904 -14244 -2463 14894 28370 30707
22703 30707 -14370 -22703 -30798 -60703 -55743 -79068 -73447 -57058 -35936 -28245 -55123 -40553 -22467
22690 -22467 -41174 -24403 18521 21281 15428 30016 51585 32062 10738 -5381 -34200 -60188
22678 -60188 -53345 -36914 -41645 -35447 -17678 -27525 -68988 -77714 -71315 -79923 -111772 -73987 -29797
22665 -29797 -15625 -24387 -35909 -17233 6229 2000 -11238 -17895 1076 9556 -41700 -28730
22653 -28730 -20622 -10533 -709 -12513 -35950 -35306 -15772 -7292 -18238 -19039 -662 19189 14228
22640 14228 -37311 -65855 -17479 16 -6152 14236 25021 16425 3735 1490 -12908 -38094
22628 -38094 -13378 35216 44478 9582 8242 -31789 -58992 -65404 -51023 -64521 -36716 -10102
22616 -10102 -13191 -56140 -86987 -55054 -30948 -43260 -51317 -14542 5423 4177 -35771 -29637
22604 -29637 -36865 -39842 -22483 423 12569 27219 33395 6543 2967 795 -14298 -13946 -15090
22591 -15090 -4784 67563 79814 22602 -11493 -63231 -42625 -25841 -4028 -18615 -19779 -11307
22579 -11307 4774 8131 -18864 -29080 -40667 -41604 500 26621 23427 -15075 6034 31015
22567 31015 742 -17433 -26755 -26751 -23269 6263 -20755 -37622 -24886 -26417 -42824 -39574 -27634
22554 -27634 4302 22419 -18377 -48898 -14287 11684 10892 -8195 7340 -21421 -10550 -7511
22542 -7511 6324 41336 28739 1268 -20858 -15744 -14539 -23572 -24848 -36397 -39856 -20548 -20380
22529 -20380 -29419 -37564 -35869 -10393 35788 27925 35171 25057 42885 41379 43356 64892 60948
22516 60948 20470 4511 16531 1798 -4377 -20653 -24180 -9805 -15766 11884 11997 29844 41174
22503 41174 76545 65424 53601 15386 -15174 2231 -1119 17214 25896 -14727 -95635 -121005
22491 -121005 -95568 -68465 -72977 -74480 -41674 -30673 -39775 -39458 -30517 -45323 -18562 35163 47128
22478 47128 31298 -11834 10448 24028 -3351 -5048 -38095 -42953 -18796 -34308 -63180 -63534
22466 -63534 -20948 6424 4322 16572 7449 9089 12019 -7659 -12238 -2172 -15555 -743 -17506
22453 -17506 -23801 -59623 -33159 10034 -13941 -28189 23589 13733 -60376 -32885 23467 33031
22441 33031 26560 19045 -7523 -2645 -10534 -8305 -18968 1289 5272 7425 3341 16534 66143
22428 66143 64365 37918 16424 8332 23056 13682 20047 40978 26178 -40339 -88906 -97664 -101801
22415 -101801 -112316 -90114 -40597 -24231 -24548 -8157 -21234 -31297 -5782 -1961 -29036 -66726
22403 -66726 -47351 -14284 -4044 5289 3738 11155 -16609 -43200 -8891 10470 17711 70066
22391 70066 85811 32547 26598 32482 22473 25404 51372 39369 17295 22517 34277 6985
22379 6985 -22442 -10620 -2055 -42480 -38499 -24068 -12952 -8608 -29049 -46601 -65547 -59528 -29045
22366 -29045 7229 27366 73982 54804 19398 10510 -14735 -36071 -29949 7188 25248 16558
22354 16558 -10267 -9604 8035 12256 5613 23143 49866 38940 -8127 -40896 -21063 -9707
22342 -9707 -34779 -55648 -44833 27380 56908 8495 -3686 -1690 -15639 -17086 -21019 -38471
22330 -38471 -61134 -60510 -40935 -25486 3759 14824 19202 -8545 -36698 -30762 -15775 -47478
22318 -47478 -33505 -30930 -60333 -71714 -62622 -59822 -56256 -53138 -25739 -8600 -4923 -3799 -31241
22305 -31241 -40357 -12958 31414 19230 -15178 -23826 -26898 3330 21832 31400 24590 -4461 -43056
22292 -43056 -32235 -37407 -52229 -82186 -51549 -13105 -21871 -29467 -35780 -28175 -47846 -28476 10299
22279 10299 39218 8203 11389 15552 44297 14497 -4932 -11063 -39884 -25157 1253 16973
22267 16973 -5572 5964 28707 16919 -6054 -35295 -39476 -25408 -13408 5884 36182 52624
22255 52624 50109 27492 -3731 -26684 -19415 -25158 -29978 -4486 -19455 -58922 -65010 -43603 -52287
22242 -52287 -70195 -44335 -50877 -24426 5556 -5571 22242 36526 13696 -11959 -22574 3996
22230 3996 1864 -31214 -56149 -48386 -35469 -40302 -67753 -85364 -56376 -44126 -18273 571
22218 571 15722 45280 58522 54303 15746 -13295 -40083 -26590 -30835 -1826 -734 -6504 -43397
22205 -43397 -25542 -5371 18380 -25039 -66439 -57827 -20654 25292 39300 34234 -1657 -6789
22193 -6789 36110 18643 -10526 -31192 -17183 -35427 -81765 -71440 -53203 -69282 -53123 -36473
22181 -36473 -44465 5826 52231 37460 -104 -7018 7011 56031 41066 -10596 -27055 3357
22169 3357 37969 -4836 -43675 -20719 -16049 -1729 -19441 4815 24692 10819 32191 -20937
22157 -20937 -19529 8099 9713 8269 26577 58125 45712 60596 7238 -12088 -25406 -10582
22145 -10582 -3107 -28348 -45904 -2695 14614 32983 41462 29188 27415 24246 34097 -8698 -64060
22132 -64060 -52803 -15943 -33429 -62606 -55104 -27740 -35316 -58846 -78259 -60084 -55328 -42284
22120 -42284 -45676 -39135 -2671 3714 18995 3159 -32540 -70032 -64745 -31073 -6641 27566
22108 27566 37522 -4157 -37680 -44316 -32775 -31290 -51231 -24641 -1760 18785 30027 50617
22096 50617 56545 23237 3465 -33042 -42181 -16934 21936 8388 28828 25106 1388 -38594
22084 -38594 -36335 -12486 -22833 -48754 -39039 -17851 6596 6663 9631 19541 18915 28326 25364 34600
22070 34600 42693 41640 14633 13607 -12725 9423 41693 35103 12187 13020 -17057 -39940 -68390
22057 -68390 -67433 -60641 -67269 -20633 4297 -11044 2205 35767 14118 -18641 -21413 -1323 21077
22044 21077 4183 3484 18891 11862 40745 66673 56247 55495 68713 30291 14648 1847 -33114
22031 -33114 -32488 -54447 -32473 -28452 -55860 -24885 31246 39498 20711 36693 40924 21886 14151
22018 14151 34152 40533 42433 14285 32316 57690 74805 58261 42879 16026 -6209 -22507
22006 -22507 -48151 -32027 11845 8162 -665 -3142 1702 17141 27023 56835 42560 -18967 -37250
21993 -37250 -60010 -102634 -94457 -42648 -39623 -41871 -24347 -20033 -4770 -1907 -23207 -8320 29772
21980 29772 9894 6297 19885 1037 -9425 -32974 -49004 -22075 -12570 19298 12101 33229
21968 33229 57878 19594 8409 11755 -8751 -17545 -19260 -50242 -73120 -56060 -11315 -10580 -27425
21955 -27425 -6654 -8799 -18182 -41776 -18714 -16848 -44125 -40324 -22604 -4996 -19217 6301
21943 6301 -5033 -4877 13432 12732 -3853 -4763 17188 16748 2915 -3679 27213 52341 11730 15185
21929 15185 25992 22603 -14255 -8108 12055 42612 29128 3486 37918 72620 95749 85041
21917 85041 64481 41878 5321 -17758 1217 4096 35229 -8960 -71883 -31671 3705 14032
21905 14032 -20789 -30535 -18063 -8661 -15576 -2003 15847 22186 1669 -14872 8068 6409 19304
21892 19304 8140 -4248 -10016 -11921 44132 47799 10158 8063 -22645 -37315 -40019 -44719 -40595
21879 -40595 -18493 9277 53105 62685 22029 -23079 11412 46437 42638 20495 24025 45461
21867 45461 22462 14191 -14331 -8238 -17239 -14717 -5292 -3445 40579 42831 11014 5257 23387
21854 23387 -3528 -3424 -4748 -3620 349 -36778 -35166 13414 7817 23353 7830 -14059 17785
21841 17785 13189 -6864 2124 2815 2471 -36000 -15536 9298 16842 28965 5194 9683 -8091
21828 -8091 -4489 -5703 -48205 -16221 18310 12266 37179 37910 34065 38208 57069 48782 33122
21815 33122 -10076 -31314 -49161 -33840 -37906 -68509 -43591 -21300 5326 -43039 -63629 -69396
21803 -69396 -71555 -37119 -22260 -37418 -46675 -40941 -29851 -23981 -15003 -14996 -14551 -881 -13506 19500
21789 19500 35238 32871 -3582 -10635 -8564 -20065 -18874 -15627 -28746 -19194 -32684 -30399 -26555
21776 -26555 -39098 -23685 25808 55853 38724 39450 33135 -34247 -98305 -69897 -37214 -5777
21764 -5777 29427 49264 76098 69346 16326 -2909 3627 2469 -3859 -10564 11198 15373 33686
21751 33686 -4148 -20255 28974 43239 22051 17723 -15970 -78512 -75201 -57242 -41280 -5681
21739 -5681 -11693 -4928 1320 13707 -10259 -59215 -77644 -70760 -53404 -62861 -103972 -102133 -61819
21726 -61819 -61073 -30136 -36643 -39819 -70996 -69589 -25593 37793 63087 46439 43571 38311 31372
21713 31372 14778 -17391 -26255 -26275 -27533 -36116 -24856 10285 -5247 -18261 -36305 -46543 -48692
21700 -48692 -75231 -42186 1507 16353 23026 48365 43635 14242 -8045 -4650 -12385 -25796
21688 -25796 -11312 19263 4497 -16713 -25385 -28951 12122 18644 6554 3150 -2259 -14886 -2596
21675 -2596 -6427 10725 14397 -33102 -86095 -93892 -65307 -74591 -62895 -52390 -47569 -3845 18125
21662 18125 32564 30330 12585 8746 33307 42074 -11810 -17452 1288 31756 57376 15853
21650 15853 14648 -21718 -17682 -39725 -77918 -68608 -40935 -896 10126 3205 20502 68567
21638 68567 50348 23506 8228 22623 31665 4908 -15915 12879 18700 1112 -23418 -40557
21626 -40557 -55292 -37610 20803 42491 10784 12086 -13028 -33574 -18477 -15803 -55679 -73807
21614 -73807 -39999 -55166 -73921 -29769 -15610 7344 21894 5548 6439 -37483 -39858 -25054
21602 -25054 288 49389 49880 31174 40872 43922 13012 -18166 -35848 -32693 -26258 1596 22052
21589 22052 32977 23778 44302 33513 24094 12995 26037 36419 -4706 -27853 -40748 -26893
21577 -26893 29304 73049 87428 75080 57678 10078 263 13959 -8079 -30977 -4698 44399
21565 44399 48799 27307 33493 37820 39946 39679 2212 -28364 -25299 24658 38395 1384 -19030
21552 -19030 -6745 -1485 13929 7610 -1264 29864 45322 41135 19128 15560 3247 -5566 12844
21539 12844 13148 -6287 -10598 -8092 -46435 -47697 -3687 -14384 -18963 -3337 -21 -3204 22072
21526 22072 26146 9110 12186 -4585 -34036 -24816 -28674 -83605 -73451 -47533 -33836 -30801 -32651
21513 -32651 -41694 -43819 -69550 -86593 -75712 -51674 -30029 19563 29617 -1195 4110 -20301
21501 -20301 -13099 3542 -23205 -19799 12939 14276 -7227 -39141 -53789 -33520 -38495 -43792 -25040
21488 -25040 -20481 2931 6732 2532 10908 8516 37850 36690 -5120 -17045 -21243 -23436 13101
21475 13101 51703 61226 32004 23645 29283 42709 11939 37997 36813 50520 60548 22524
21463 22524 -14434 4363 41359 42487 36020 28723 -4555 -3061 8874 -2936 -8087 -13519 18540
21450 18540 -14990 4246 16903 11727 8335 11727 20970 34253 34732 3761 -29385 -32873 -748
21437 -748 17834 15607 17467 26873 11957 -3814 -14588 -11714 -20364 -37581 -3103 23497 46948
21424 46948 73147 74318 51733 17139 -913 -1046 29259 56079 36792 11465 1182 9049
21412 9049 42877 8839 -21224 -31712 -48317 -29975 -48268 -42355 -48046 -62577 -5228 -19570
21400 -19570 -9297 17002 8071 12416 -21070 -40044 -40215 -21167 -27785 -8743 -25408 -2531 18387
21387 18387 56430 65393 51088 16101 -10943 -1461 -31468 -46710 -17031 21291 45508 12537
21375 12537 -8316 1167 7117 26938 12998 20357 -7994 -31851 -45638 -63241 -46133 -46449 -80831
21362 -80831 -95599 -77545 -64831 -31459 -45065 -46273 -57047 -52884 -15060 15694 48186 27541
21350 27541 5908 -11965 2457 37028 33430 6520 -26040 -25416 -38782 -24368 -32271 -55132
21338 -55132 -53648 -44592 -60703 -120617 -115619 -57301 -18778 -6101 -7469 -31232 -79640 -71001 -15898
21325 -15898 19408 -1693 -626 -21472 -31316 8218 51745 21000 6323 18058 30968 19437
21313 19437 -11701 -5053 -14173 -38061 -59174 -61535 -53124 -51204 -59163 -105538 -93730 -76621 -51544
21300 -51544 -29418 -29797 -17683 -25801 -60177 -26970 44669 96012 74228 33366 -6251 11385
21288 11385 19237 50730 41225 -44729 -46963 -20496 -3060 -6175 -35257 -55708 -55356 -75877 -65253
21275 -65253 -39771 -40059 -43110 -30014 8548 22359 -11754 -9776 6165 11368 -18190 -18726 19584
21262 19584 35813 9344 20582 -2775 -1992 6164 -15010 -1959 11451 -5270 -56002 -63537
21250 -63537 -4259 19165 -13771 -40180 -38393 -16083 -24508 -72187 -79148 -77821 -77553 -78331 -63432
21237 -63432 -7576 8753 232 -2541 -7155 31294 42655 5952 26400 89402 95102 54597
21225 54597 2498 -2911 -26739 -41929 -5574 -38882 -23526 2538 22136 12396 14405 30837
21213 30837 30228 19016 30119 19649 24203 13897 29789 5669 -10754 -16887 -60669 -34327
21201 -34327 -17258 -12189 -25114 -26736 -44302 -69812 -66366 -65853 -53593 -11079 33451 34982 -18877
21188 -18877 -12564 -11787 -23856 -17128 -44228 -46332 28996 47971 26434 16886 50549 38376 21641
21175 21641 40061 41757 28038 5960 -8423 4637 21236 50873 49470 29495 30678 22044
21163 22044 -17209 -36245 -23800 -20349 -20152 -21233 -7781 29385 46402 31663 18672 -3371
21151 -3371 -8931 -38104 -35428 -18635 -33277 -12846 17331 12678 -4435 -53253 -49516 -52495 -46000
21138 -46000 -38245 -39992 -20004 -17713 -11048 -14703 -12510 -29576 -42127 -31467 -27290 -28780 -6553
21125 -6553 -1948 -10417 -14015 -35865 -37816 -48737 -27965 -21336 -18431 -2157 -12286 -30429 -18106
21112 -18106 -7645 -21743 -10552 -8179 14402 -4142 -8404 -28326 -34906 13481 22263 -4916
21100 -4916 -9997 -7632 -13580 24012 23140 -32568 -64952 -70439 -75950 -31056 -31807 -51058 -62078 -32432
21086 -32432 -8685 12581 45251 58416 41675 63839 46498 10337 15168 34261 29595 14855
21074 14855 -10417 -29728 -19830 -22168 -16301 -25822 -41680 -71262 -70887 -70292 -49439 -57169 -67819
21061 -67819 -4424 -8243 1237 -458 24605 -1567 -44498 -34446 2318 9994 36265 25695
21049 25695 27727 29911 21536 -7066 9064 43954 9606 -21436 -15262 -18276 -21292 -4738 -30758
21036 -30758 -21376 -1067 5011 19602 -31676 -50176 -48383 -38688 -47276 -54878 -43386 -33418 -4315
21023 -4315 29979 19708 -33833 -50392 -53065 -57622 -34171 4218 14159 10338 10777 2473 -2964
21010 -2964 -8600 -6436 -35072 -38221 -12797 -35930 -71793 -53656 -26479 4895 -2744 -32428 -50037
20997 -50037 -17155 -19254 -37791 -29662 -26805 -44686 -21781 -8170 -5328 -44883 -52456 -3210 39611
20984 39611 28288 -6347 19128 11584 6296 14616 10200 7799 -35095 -29102 -41900 -48865 -29348
20971 -29348 -24128 14606 -921 -8598 -62443 -75456 -58855 -56324 -83416 -96008 -46844 -16142
20959 -16142 -11625 -18868 551 4577 4722 -13458 -4602 -12451 -38620 -35156 -4881 -27121 -77601
20946 -77601 -89697 -46754 2789 -39120 -28145 -4791 -12626 -4530 -10407 -33227 -47525 -26808
20934 -26808 7750 11838 6749 12929 9052 13915 11278 21521 15929 24430 8301 -35609 -57174
20921 -57174 -29664 -38241 -25080 -10998 3374 11309 -3971 11611 11348 340 -52709 -69875
20909 -69875 -19761 -28310 -70861 -51322 -12322 11361 23576 58682 73097 35386 20016 23632
20897 23632 14374 -13587 -10924 783 32831 79508 107553 104406 60739 -5452 22769 20021
20885 20021 40005 55261 -1579 -35454 -27537 -18722 -13842 -4378 6269 -12446 -19438 -28974 -33254
20872 -33254 -45369 -3723 13536 8540 34827 34241 -770 -6527 -847 -18797 -28391 -36761 -24312
20859 -24312 -21384 -7668 1962 -6701 -19833 27515 22517 -40823 -13125 16469 4448 -29859
20847 -29859 13301 55655 68882 -3512 -34366 -39760 -41076 20152 57491 78636 67499 16891
20835 16891 -7597 -13557 3315 10388 -9381 -34108 -8305 -14383 -23901 -5889 1671 -2008 -9484
20822 -9484 -55986 -38749 -15165 -25683 -53527 -63986 -25616 -38421 -53367 -68138 -69788 -62503
20810 -62503 -11388 2495 800 -704 -6405 -21697 9781 9078 -8691 -41021 -33226 -19002 -9635
20797 -9635 12173 4111 17811 21301 19258 11826 -35521 -25608 4727 25977 52120 46367 25288
20784 25288 44797 47024 27710 -6180 -36320 -29260 -38897 -13247 -33672 -72719 -66786 -76320 -70138
20771 -70138 -59102 -24741 -1411 14263 -13392 -34210 -45569 -72993 -60904 -43191 -69531 -79991
20759 -79991 -36288 -14842 -34090 -19753 -24470 -28429 -14404 2134 -7993 -2309 16417 13099
20747 13099 11733 6238 20901 -14678 -25815 3355 57024 49588 65481 51760 45502 26809
20735 26809 18459 24750 16677 20774 67833 65149 52348 2070 -37914 -53858 -60899 -46435 -21287
20722 -21287 -33691 -29872 -39621 -45851 -26179 -7948 -36119 -37736 -31971 23909 79174 73448 39117
20709 39117 -17663 -27946 -34740 -23998 -26373 -57797 -77810 -49410 -21517 -19552 -10463 -9919 -19723
20696 -19723 -9889 21619 16116 26672 14248 28383 21931 -348 6940 -36488 -68784 -46121
20684 -46121 -34003 -20954 -13209 5410 4666 -7257 -32553 -42454 -38596 -58146 -89631 -65078 -31167
20671 -31167 -14179 -9440 -18061 -34179 -4478 15724 22657 16900 -17155 -29539 -9930 -9143 3790
20658 3790 14584 -28661 -57414 -34824 -11593 11863 13335 -1041 705 -23077 -31621 -38381 -29418
20645 -29418 15803 69901 56922 56424 41324 19504 13039 57601 67023 16516 -32276 -12387
20633 -12387 19390 34516 25934 36377 33415 48213 71668 68823 68290 64797 57326 31521 28386
20620 28386 -6457 -3422 9467 3645 -10991 26765 32709 10530 -4387 -1973 47015 4565
20608 4565 -19079 -11378 -7509 -8052 -8018 -12153 -42021 -29901 -24587 -17239 -6381 67132 90145 46627
20594 46627 33256 27963 30204 25873 28515 31076 19910 38132 33035 13282 22252 43566 41470
20581 41470 11790 -19440 -27041 -16902 5342 -23416 -46838 -24456 -9415 -11365 -51845 -30968
20569 -30968 -26393 -2962 21636 -7828 -77593 -101358 -79578 12707 33057 39368 53453 39836
20557 39836 9993 -1315 -24164 -6373 20666 20895 9836 -12088 -7958 -7538 -21362 -45966 -76868
20544 -76868 -63323 -6982 16873 11099 -17320 -3373 11326 -21625 -52275 -75914 -111349 -84327
20532 -84327 -24163 -5831 -38263 -22704 3096 -14094 -24510 -18357 -10464 35092 12660 18084
20520 18084 30362 48731 67109 74435 62253 46703 62469 44535 13019 22783 42 -9471
20508 -9471 -2280 8601 -355 -20400 -58510 -33406 15303 19404 21066 15199 -631 -9661 13459
20495 13459 6099 -8350 -26932 -44975 -30767 -38609 -20116 15833 34598 5040 -13546 -11051
20483 -11051 13889 30018 2026 -23976 -14956 1400 34570 58076 27178 5308 -12879 -20136
20471 -20136 -3014 -28034 -84835 -103213 -91540 -73231 -44668 -3975 916 13109 30407 36829
20459 36829 33556 22228 23843 -8601 -21359 -6143 10668 16459 -23261 -46524 -65053 -61652
20447 -61652 -51780 -23709 -24135 -53235 -61897 -57662 -64132 -56214 -13155 12004 -7315 -33406 -22802
20434 -22802 -35489 -30264 -8903 -11017 -27300 -42139 -50264 -46573 -3255 20956 4256 8909 9581
20421 9581 -15997 16564 14597 2985 -22813 -27237 -40234 -22639 -27652 -48551 -32463 -23386 -29700
20408 -29700 -26159 -9121 42777 45065 40190 14096 32184 35496 19765 9 -19141 -19161 -37229
20395 -37229 -23067 -69478 -81727 -25095 8316 -22117 -25177 -37209 -67706 -22296 9492 15074
20383 15074 35454 27971 32953 26547 -265 -21358 -26737 -3802 -10304 -16861 -4861 4484 26527
20370 26527 28061 51351 13659 -21148 -10729 -3993 -16713 6120 7150 22180 35280 43443
20358 43443 46839 56966 44206 47382 38786 19772 13772 14634 -13318 -4224 -17592 -49195 -66585
20345 -66585 -60301 -40150 -58789 -40888 -60021 -43866 -36543 -60812 -59628 -49493 -41455 -14227
20333 -14227 -1803 -1311 6330 14841 3174 -4708 16601 38426 35842 42285 62922 28879 -24692
20320 -24692 -52 22612 -5154 17522 22093 36299 22238 -16207 -30652 -51175 -10375 18265
20308 18265 -10186 11880 22962 1863 -30486 -40732 -65433 -72096 -74972 -23848 -1731 -550
20296 -550 -535 -4282 7375 20402 15361 28404 27539 40041 62435 19090 -13522 -37058 -47477
20283 -47477 -30546 5258 -22828 -28631 -9463 35410 26439 -44889 -48316 -40541 -22090 -12432 19732
20270 19732 21329 -233 -1629 -7422 19620 57852 73461 34491 17618 15671 37935 4736
20258 4736 -10051 -22218 2629 21727 -2253 -10315 5419 40433 26351 43760 47812 43266
20246 43266 57394 30301 -5296 -31904 83 -902 -12699 -19331 -18550 -15875 -15661 13423 20764
20233 20764 25314 3709 5493 11676 21096 39553 48507 1880 -11095 15050 10941 27756 30136
20220 30136 13618 2474 10098 8158 29770 4447 -26645 -42394 -12016 33932 18662 3986
20208 3986 11816 -20976 -20722 -6644 2922 -3746 21873 -9124 -9420 8176 7788 -13136 -36328 -50602
20194 -50602 -4657 34655 27065 -24978 -59471 -47193 -24402 12155 10159 -20940 -3172 22425
20182 22425 22474 27050 37356 63543 61168 47501 25814 -22142 29353 70261 79806 35478 46015
20169 46015 60561 10552 8906 14990 1393 -11336 -51923 -42591 -30436 -34281 -13551 -7124 -13167
20156 -13167 -11213 13937 -610 18652 -299 -17522 614 17827 12880 -16003 -26007 23557
20144 23557 45804 -18295 -8252 23072 24009 8366 -27611 14596 43869 26219 2361 -940
20132 -940 -249 -55499 -85268 -89454 -68010 -50834 -20081 -22433 -37056 -52662 -57662 -20306 21850
20119 21850 -22706 -34737 -21117 -20560 22104 34609 8098 -14572 -17078 -25269 -17703 -10524 -20824
20106 -20824 -29791 -26638 -21093 -15901 -15893 -45056 -68530 -56395 -64691 -80217 -78450 -52863 -63381 -64496
20092 -64496 -40366 -31194 -6285 18606 24940 -9454 -22751 -25805 -25637 -16770 -30246 -26019 -5406
20079 -5406 9715 19294 21268 20133 -2628 -37254 -31831 -18633 -23052 -9082 -33797 -55223 -12608
20066 -12608 -2818 -11377 -10563 5500 51857 34080 31152 28901 621 -23224 -5856 -30739 -66282
20053 -66282 -54237 -6958 4977 20227 18318 -1152 -14434 -37757 -34240 -31583 -17613 -19799
20041 -19799 -32613 -23173 18500 35285 39121 27310 13550 47273 90230 48412 19229 33761
20029 33761 7440 -221 46044 81817 127442 243691 262132 283404 297125 335084 354279 338221
20017 338221 312357 272192 215828 215085 210349 215197 233319 235976 271553 295488 320696 318344 259187
20004 259187 175047 126119 119694 108544 102470 132234 94986 114195 188024 184955 162298 161966
19992 161966 177469 201072 237225 258545 267065 257214 238109 235748 228830 184281 183494 224685 253028
19979 253028 289340 264329 259971 255822 229056 203685 154551 97279 68994 24534 9782 21699
19967 21699 24493 41738 41343 30125 20697 7082 17190 20269 39787 16003 4860 -16016 6866
19954 6866 5093 25584 46298 74565 102646 90701 44045 24222 33828 39279 57090 114424
19942 114424 110847 63197 -25 -669 29845 24894 -3518 -32411 -77042 -74825 -59212 -54319 -38088
19929 -38088 -20205 -4946 -27102 -4717 18961 20415 -4249 -36600 -21958 -18987 -13227 315
19917 315 5219 10500 25791 17757 -1637 -18473 -14191 10881 12396 11245 6148 20223 15719 33325
19903 33325 24809 43822 35019 -1624 -32360 -6195 10466 26825 34516 40341 22598 18704 -15839
19890 -15839 833 -5695 2153 -4665 185 13292 13311 31417 51524 31788 41852 45576 17087
19877 17087 7834 15784 59206 41512 12499 -2470 19166 34352 22440 29965 74770 79163
19865 79163 79173 39162 55438 35775 15231 13323 669 13069 39967 48527 18492 12392 6702
19852 6702 23413 35356 52344 20942 9927 38399 38738 28963 39596 31323 -30634 -22547 -5260
19839 -5260 -32527 -27617 30672 49494 23321 4705 21878 30551 29582 29922 6821 -14191 -29839
19826 -29839 -33733 -29830 -66515 -101518 -74162 -43474 -28002 -32740 -52806 -46633 -59152 -70591
19814 -70591 -43057 3120 18358 24269 27023 -13472 -690 26814 4237 11940 20759 6695
19802 6695 2669 13694 15468 30284 53878 26643 5866 -13223 -73047 -124531 -100014 -48188
19790 -48188 -12532 -27527 -47916 -54139 -47529 -21499 21938 21322 -25058 -54965 -46823 -26373 -2827
19777 -2827 11861 -7812 -1124 -23782 5596 34544 30355 6201 -8335 -434 -7090 -3648 -18444
19764 -18444 -37205 -43789 -50167 -56745 -80145 -93666 -85956 -87014 -68150 -80143 -102240 -50876 -10285
19751 -10285 -31990 -45922 -47308 -42976 20895 37607 59388 70983 65078 61488 41362 43108 76932
19738 76932 109349 138414 105928 45832 25284 8442 -17095 -8081 42138 68877 89112 77269
19726 77269 87716 86721 98833 122308 108328 101591 114517 101044 136738 135504 83183 69544
19714 69544 83580 85647 68534 75693 71567 61815 79811 83524 77187 98547 87308 57925 25157
19701 25157 9110 3710 -22906 -17475 31691 49595 46933 74917 98063 63456 66605 65799 60594
19688 60594 74845 73276 69123 94172 124454 83444 78490 90061 93960 66013 57693 82953 106259
19675 106259 104465 99582 75744 58989 29106 -2664 30277 33346 30240 46119 15650 32293
19663 32293 23665 26553 57504 53833 66004 84957 90636 64645 -10 -25959 -1822 5284 25316
19650 25316 47431 49014 14620 19550 24538 42755 74099 77838 59158 82087 78249 93777 116483
19637 116483 98253 87172 68000 63806 63528 54548 81391 97562 71853 64484 92653 73565
19625 73565 44437 43300 50576 73895 43699 35563 64788 90734 91095 73307 66924 105159 135120
19612 135120 152534 114708 113104 98782 121074 120387 115072 81888 68234 76867 62401 58982 70378
19599 70378 78935 93523 92612 113308 125919 91185 75253 73925 80110 82106 123389 119232 128326
19586 128326 155362 136020 137779 106225 106595 109789 139359 150187 175722 199185 201137 192030 191198
19573 191198 196361 191970 220124 201780 140913 111356 101397 124487 130843 100346 120978 132913
19561 132913 142085 164329 183395 152253 155612 193557 200356 195042 200780 251422 305684 296685 264272
19548 264272 262550 258319 263851 281084 299142 299996 329553 323841 320629 322451 355588 380824 360049
19535 360049 326212 332326 336466 315687 340184 384926 393025 375383 362820 379957 434884 450744
19523 450744 423803 421901 467073 490184 532391 552654 570624 588308 585546 571770 581682 646508
19511 646508 747336 829157 911272 1005420 1126645 1227352 1328257 1376671 1354257 1405976 1481365
19500 1481365 1497411 1523479 1611438 1708364 1841930 2010100 2228576 2461932 2669076 2823178
19490 2823178 2952077 3096177 3207778 3321649 3483256 3677816 3916723 4209141 4639526
19481 4639526 5192978 5797782 6542468 7429839 8568432 10063139 12136536 15176755 19601605
19472 19601605 25815268 33483633 41727894 49569577 54814105 55923732 53771949 49426602
19464 49426602 44133072 39434765 36474175 35957079 38244260 42946806 48995604 55206152
19456 55206152 59289882 59287842 55783865 49852244 42530340 35248171 29068918 24311244
19448 24311244 20882791 18679255 17542707 17370611 18192604 20335068 24232008 30156817
19440 30156817 37671302 45802524 53446438 58278020 58862162 56127330 51223526 45424083
19432 45424083 40315726 37083965 36435807 38644051 43235251 49083368 54998553 58620413
19424 58620413 58051395 53966412 47428103 39614411 31928529 25185191 19770487 15582480
19416 15582480 12363102 9971607 8212550 6861952 5848005 5038128 4396337 3895963
19408 3895963 3482516 3158977 2929203 2753305 2621788 2498173 2436079 2390560 2320122 2262284
19398 2262284 2147890 1985466 1836950 1644703 1478729 1388325 1278972 1247701 1268790 1288739
19388 1288739 1289225 1228138 1193663 1131384 1062949 974780 881750 802056 759387 691287 659718 643172
19376 643172 557240 522791 513763 473449 445267 441269 453520 435019 402216 373272 368585 337361
19364 337361 326295 321765 316211 312383 287485 285892 305169 307505 280527 274068 278982 229616 249069
19351 249069 261484 223501 236973 222628 199173 237189 243709 229157 202704 169705 163914 192924
19339 192924 214967 205903 211521 207998 216323 184966 186098 228560 227496 228584 215224 185392 193230
19326 193230 166893 144748 155018 164105 177776 153611 141372 106987 113928 113567 106081 97709 99721
19313 99721 86186 102173 137482 125255 91381 113282 159044 183337 160211 132804 78201 41050
19301 41050 89424 76412 75276 67552 81844 84134 87580 131715 145069 116004 122811 97586 82083
19288 82083 75523 84023 92904 57155 23246 4916 15362 4921 -26348 -26552 -11724 -8933 37483
19275 37483 84153 74468 42354 10430 5533 9156 23720 16055 25756 14589 30400 49136 42104
19262 42104 50991 58438 87693 105328 63072 55298 82534 79307 60778 50251 92451 84808 62298
19249 62298 68319 52706 32356 24657 8120 -23499 -18369 2804 38729 49368 44308 51991 65593
19236 65593 34557 65177 78607 43859 37031 86175 114141 89528 49659 41935 51726 46546
19224 46546 57745 62662 56801 7832 -50121 -78060 -39138 -4987 25652 32294 29329 18132
19212 18132 1106 34245 9324 16254 50804 18454 -25 12663 15117 8788 17579 9303 2600
19199 2600 41670 53659 40049 33045 34103 32161 62488 73840 30999 26133 18320 32193 26552
19186 26552 38430 -5624 -20047 -48246 -31472 18117 39401 39138 9857 19946 57933 49294
19174 49294 25396 -16425 -55346 -44556 -25544 14588 41953 51210 28845 7357 -19450 4005
19162 4005 6725 2913 -4296 5293 33767 71888 73006 72180 15228 -3171 -11177 -11144 11197 47511
19148 47511 33043 12043 764 12473 47701 74021 72834 49227 27287 23428 31146 42367
19136 42367 91285 110738 104683 95808 98775 102457 61766 29192 5783 25644 60532 887
19124 887 -26136 -46372 -42956 -9082 -1982 -13835 32080 23648 7772 21438 65145 87113 125255
19111 125255 136175 58424 22445 35879 44444 31221 25623 38360 13751 13039 49544 77947
19099 77947 111931 148751 126261 83694 78882 61291 33232 12095 -18592 -10586 2166 -24644
19087 -24644 -30868 11497 27841 18835 6915 -4682 16318 36043 32014 77111 56939 46957
19075 46957 -186 -43158 -71605 -41287 -4202 25070 -1672 -43670 -84373 -46952 -40080 -34383
19063 -34383 -59360 -63733 -28359 1204 30986 25275 12410 11332 20431 25598 34968 45040 48507
19050 48507 -8214 -3899 -17656 -21597 -35108 16943 41942 38539 27036 12199 24584 19494
19038 19494 2612 -19427 -36758 -36593 -11968 2122 -25719 -8235 -25501 -39258 -54323 -53843
19026 -53843 -55547 -38259 -31240 -8020 905 -3539 9078 14501 13133 -10534 -26976 -47159 -52150
19013 -52150 -51077 -52505 -30326 6067 21107 37791 48059 61114 29531 1429 -7469 23057
19001 23057 37287 14721 55530 54381 1027 -31005 -24401 1889 5768 2314 12441 49830
18989 49830 37899 50246 41922 33685 4246 823 42784 32549 39355 27649 24885 30765 28044
18976 28044 73280 57467 45549 60643 82523 103664 200980 233785 226461 246837 300335 311447
18964 311447 309148 274352 295783 273505 237251 220086 256109 285181 272094 296336 338631 375380
18952 375380 372387 336500 299933 266319 231212 195828 143315 80981 80542 79103 55168 18203
18940 18203 -9413 -8102 -5476 21222 48017 47159 23994 37536 65926 110444 109131 101771 132343
18927 132343 133828 161908 150670 143609 155876 194625 231062 264165 276816 286677 296688 311511
18915 311511 306750 331734 355854 386822 436823 490629 522286 567179 615793 583897 535435 462397
18903 462397 413624 371882 357568 353128 345831 383681 404529 407447 417417 402393 369309 273946
18891 273946 226441 199944 176727 141778 115137 119092 114570 115014 159530 133542 118109 130934
18879 130934 181917 240155 294769 317757 320721 304827 267834 253246 235436 221710 219859 255977
18867 255977 292405 286173 293618 309775 285596 267301 248158 213609 146024 121810 100996 64596
18855 64596 90821 113665 92262 80613 26532 5483 -4873 4979 20032 6652 2633 28800
18843 28800 22772 -9649 -19133 -17972 -16076 30697 38432 26810 26219 45976 55469 -4867 -31334
18830 -31334 -13317 -24611 -41763 -70603 -69237 -69231 -53345 -18859 -7777 -15095 3775 25934 8440
18817 8440 -24254 -9792 -13568 -21337 -7596 13727 3298 -32747 -24002 -38019 -54462 -73002
18805 -73002 -66694 -22586 10633 -14527 -55892 -59716 -28312 -36271 -24493 -22418 -66398 -136430
18793 -136430 -191199 -128167 -94953 -101785 -79121 -53302 -78564 -62380 -32616 -40281 -36644 -20469
18781 -20469 7829 12528 -23606 -14580 -31002 -1796 -23158 -26906 -18879 2151 5113 38529 123124
18768 123124 225884 339472 406884 351459 275081 208704 130288 50875 12531 14350 -9406
18757 -9406 -28456 -18690 8978 39640 -17822 -54930 -115701 -99671 -49618 -46005 -49389 -61589
18745 -61589 -53201 -54313 -71843 -48860 32143 71006 48955 3275 -6846 -11721 -20652 -34136
18733 -34136 -17524 -17129 -6457 27757 41065 39451 89140 108943 92245 100292 78319 73551 61391
18720 61391 39653 43518 69686 96572 98851 106177 105623 63032 44727 60961 75460 58672 42383
18707 42383 58791 29639 14830 29195 58857 93289 79466 62821 45277 69086 61520 57891
18695 57891 74909 49188 30070 16588 15882 29079 40831 42832 52831 58133 46109 60935 54600
18682 54600 44601 24803 26305 48963 28505 39958 81398 65544 58892 57966 70380 69225 70370
18669 70370 70052 55722 64392 66438 15740 -21971 21261 21555 25090 61789 51953 13695 31221
18656 31221 27459 43457 53587 73708 78663 29576 39784 98361 84964 54630 63873 96610
18644 96610 67867 38915 50777 67311 74809 50361 41766 15716 18448 29132 21844 8134
18632 8134 9361 -4934 -720 19851 31896 57765 44897 44165 14280 2195 -1890 5624 18231
18619 18231 34035 9769 -1463 8938 33835 49111 69478 97570 96167 107741 95034 129888
18607 129888 129203 158214 119947 85261 104806 122802 126498 117154 125217 125096 95888 98047 120009
18594 120009 123086 135406 92947 103570 101485 87419 64558 99144 136551 149681 112887 134931
18582 134931 151112 195790 228034 214282 138970 150152 149422 130781 99803 106362 134650 150888
18570 150888 147881 169991 182792 219465 219864 223951 220974 223108 226485 230368 231995 229889 207812
18557 207812 213692 224627 205461 178951 173190 178882 189032 220265 228581 267936 306428 276684
18545 276684 246244 259758 245385 248731 220912 184862 194315 219439 258615 292777 325331 337627
18533 337627 298524 278410 291764 327232 363496 364713 390883 441056 405318 389832 393025 392035
18521 392035 408436 428105 467536 475720 484408 512452 516099 499975 544909 592142 602452 641866
18509 641866 671737 706169 733270 756806 790076 847814 903661 968999 1087187 1201420 1310376
18498 1310376 1466931 1615935 1781062 1933338 2090440 2255126 2397141 2508734 2648096
18489 2648096 2821225 3029294 3251931 3462030 3777478 4141237 4548628 5029377 5687001
18480 5687001 6489765 7496720 8990008 11309069 14919199 20202596 26378390 31811697
18472 31811697 37190511 44254991 50903910 52700323 50710368 48472118 46244644 43088681
18464 43088681 40003361 39021290 40082989 41507599 43407235 47638288 52533945 53217089
18456 53217089 49780102 45916775 42035371 36828548 30444202 24433134 19469282 15637056
18448 15637056 12796838 10710762 9198608 8167507 7430463 6942774 6654974 6512093 6445247
18439 6445247 6486366 6641402 6870217 7226837 7690837 8301189 9171408 10493291 12607964
18430 12607964 16029633 21204763 27671604 33630949 39112507 46245142 54051975 57409785
18422 57409785 55663141 53053963 50741690 47502200 43783992 41825678 42251751 43523581
18414 43523581 45193624 48991537 54383693 56409239 53458705 49169885 45041920 39753232
18406 39753232 32912842 26088719 20306958 15738179 12265842 9671363 7766981 6382940
18398 6382940 5409306 4646496 4054721 3603418 3276866 3003860 2761245 2520898 2336587
18389 2336587 2168404 2027659 1870870 1749197 1644224 1528864 1396850 1248486 1133172
18380 1133172 1042438 941465 820453 724509 714479 723367 694404 667860 670645 638113 554792
18369 554792 465278 438618 452799 427363 424971 406412 402141 401556 359912 344742 330983 294953
18357 294953 277838 264534 253806 253337 278934 272263 248329 218667 177643 209348 206549 165782
18345 165782 145815 191131 238011 256556 226985 193874 163553 200345 211016 182899 140972
18334 140972 136634 148536 149516 170503 168619 177514 210740 210075 204227 206776 207686 188010 187660 142505
18320 142505 136156 156663 172726 151944 125952 137234 98348 55822 53933 59472 83289 68802
18308 68802 67352 63689 81024 76154 66273 44975 64971 65297 78255 86209 89718 83571 88674 107520
18294 107520 133605 144694 132675 120080 116145 99442 126742 141071 136891 130319 99199 85015
18282 85015 106058 124717 151191 131800 126604 150526 125929 107386 94424 122296 134190 114188
18270 114188 98639 88616 75516 51659 38948 56683 86074 76662 75236 56098 35556 14429
18258 14429 38720 100450 127084 106299 102266 64075 48785 59318 32570 14507 49654 46858
18246 46858 57685 84245 68631 32421 31298 55918 55226 38052 33661 41496 19187 3864 28730
18233 28730 21721 14937 57457 113684 102501 80715 98770 101960 66112 62972 89846 76750
18221 76750 68149 84376 52752 79725 89407 88559 97331 88993 73568 82634 95373 79228 82734
18208 82734 133325 164687 149650 137826 83071 47162 33559 66301 88737 83302 76721 60796
18196 60796 50087 60440 84329 101606 140102 169498 169801 174858 184071 174572 163919 125544 120091
18183 120091 139246 122476 101287 55511 32078 79864 147696 148450 112005 101708 74423 98311
18171 98311 115308 127576 145249 123159 113683 101380 100742 129950 143895 173636 183014 153887
18159 153887 151835 154555 154045 168835 150231 147678 176794 220787 241393 260513 298212 335652
18147 335652 338508 324313 327135 351874 371529 428141 455639 463204 489175 542239 575343 623185
18135 623185 685081 736258 778647 802213 893365 1013728 1111748 1153508 1223736 1337355 1437774
18124 1437774 1554186 1707916 1937541 2186662 2460344 2758484 3085662 3533138 4202279
18115 4202279 5191343 6515337 8442834 11548935 17115549 27959903 47236294 67033226
18107 67033226 69540500 58336442 45545163 34236515 25256648 18060896 12795024 9293947
18099 9293947 6924427 5281435 4126731 3254386 2648189 2200239 1847350 1552251 1337684
18090 1337684 1189415 1098655 1022046 926187 833921 752622 711707 681115 643234 556187 478265
18079 478265 411947 313136 260201 251540 290881 315038 313830 252953 194677 193412 199840 198951 207054
18066 207054 195251 207023 238513 228976 223012 201179 174711 108741 104460 148503 173355 161413
18054 161413 95555 67353 58375 76789 73589 77389 99454 113850 73345 75386 77174 84104 82501
18041 82501 47717 43232 77412 67104 52102 48006 34318 25767 92410 97585 81057 53713
18029 53713 65555 63560 52527 61761 64579 19242 -48562 -22679 4075 -30790 -43115 -28532
18017 -28532 261 16881 21684 41597 47732 54742 21481 23430 16742 19724 34376 26200 18675
18004 18675 33123 19209 38694 77803 49363 9998 -30280 -31928 31572 60286 50927 59655
17992 59655 68112 64679 -3936 -28947 -9970 -27050 -35952 -15635 18423 35416 54095 68955
17980 68955 90599 92319 131407 167288 136744 125731 94101 54012 92256 154614 191499 241574
17968 241574 276344 322734 325888 303445 300109 287284 250460 231404 191311 152011 133896 167433
17956 167433 176491 176267 197460 224003 240205 205526 183251 159630 82885 52711 50504 18405
17944 18405 27006 25523 9272 -27375 -34859 7736 42818 19370 3991 7327 39671 65284
17932 65284 69639 23769 -15498 -36200 29762 88021 133022 164941 178369 213649 228082 235565
17920 235565 234097 228901 232970 212859 179062 189448 202704 189311 175289 199700 224210 248661
17908 248661 307459 352401 318818 256222 210998 152311 129422 141232 184890 179370 130095 84724
17896 84724 71123 54710 48689 23786 10199 38616 34856 33007 44126 59464 36085 -1418
17884 -1418 -12569 20894 39826 46902 36009 27817 30418 33103 42962 29173 7603 4336 3544
17871 3544 2579 -23846 -22667 -16930 15067 44972 33660 32125 47863 55330 77120 43755 47391
17858 47391 44216 29417 12214 -11030 -21711 -23307 -20238 -60649 -96021 -114385 -86585 -49524
17846 -49524 -7985 15572 20850 -11232 -31121 -34506 -27523 -46512 -61509 -47942 -33096 -41990
17834 -41990 -37348 -281 -15951 -29500 -15538 -5401 -3946 7465 22069 20684 18855 37787
17822 37787 45709 37511 38839 56853 70591 65561 63830 64369 10326 -29926 -48558 -27311 -16194
17809 -16194 -24274 -19903 -13250 27594 23184 57507 66073 79190 80163 66147 30249 -4189 431
17796 431 27167 52467 36106 -7769 -9734 -17237 3044 267 -32354 -22152 30688 77140 61415
17783 61415 25004 -3766 -11873 9781 14086 31757 69836 80003 72340 38540 43406 43207 -28277
17770 -28277 -26575 -24008 -20823 -12550 -13543 22027 47907 53409 43527 25002 -30860 -38351 -23032
17757 -23032 -20795 -8053 -9107 -33077 -47617 -47869 -48723 -53638 -8880 12004 893 -430 -29297
17744 -29297 -2175 -10981 -33965 -20357 -37458 -23850 -29128 -54419 -70380 -23025 30711 35895
17732 35895 40737 61365 54080 21987 -2339 6369 -18906 -8105 27996 5937 -10295 34333
17720 34333 55380 33028 -17785 -22120 10141 -583 5096 16416 25257 12891 7570 12086 -2545
17707 -2545 -27432 -2990 15118 15913 847 -2517 37181 93527 101680 138114 173005 217358 251870
17694 251870 247783 273192 283640 258204 218715 181959 148861 119756 82583 84080 60083 61407
17682 61407 64154 66542 48220 25536 12052 43946 84870 83017 80482 47583 44977 53198 79676
17669 79676 119656 115338 139575 204187 284411 297731 285641 274945 241887 211826 173041 142071
17657 142071 144168 108552 66872 87024 105718 154230 211326 265475 286312 314316 323054 244577
17645 244577 212409 202250 172538 155227 151324 153641 94970 106314 80892 40341 -19834 -45617
17633 -45617 -8591 -17760 -5600 -6862 -44292 -35850 -6145 -15339 -8481 31344 31046 28883 57053
17620 57053 80523 105518 181559 261479 258521 218755 172882 117652 109022 84858 47443 44562
17608 44562 41958 67086 106937 87092 55446 5754 17779 32240 41688 62543 28844 -4603
17596 -4603 -9141 16076 28015 30338 35653 28999 19560 18242 -9099 12751 45625 51607 24025
17583 24025 8288 6364 16813 19698 246 -4196 10446 33341 40434 -12138 -48801 -57269 -66258
17570 -66258 -50584 -30583 -38029 -32240 -24932 -20650 2816 15197 314 -30001 -23142 6876 -25786
17557 -25786 -45028 -18087 14347 15483 -3090 -4287 5858 21763 11416 -6119 -4602 15405
17545 15405 15219 16707 18811 17413 45235 45696 61560 38123 16328 31975 17234 -28015 -795
17532 -795 44094 37677 1927 7017 -18074 16544 26073 6772 27103 6090 -40798 -23611 -9677
17519 -9677 -3321 -13163 7809 -6072 2207 12831 3954 -43112 -52207 -45349 -41204 -59473 -63752
17506 -63752 -37135 -6876 -28431 -36664 20559 70171 29893 -44747 -101284 -102277 -88085 -85609
17494 -85609 -52551 -1758 14443 4360 3846 -12917 2129 -7418 12263 34777 1643 -7672
17482 -7672 2810 8970 -29900 -87174 -119703 -71853 -51266 -73251 -75772 -45799 -42423 -72655
17470 -72655 -66610 -16611 16184 21162 -2111 -3295 -10403 -19041 -36949 -6043 18905 3975 27992
17457 27992 67159 46109 52669 45614 -16979 -45964 -57295 -67303 -62406 -14315 14212 58814
17445 58814 98886 98723 162440 275695 361560 306126 255185 221633 208462 189212 134062 111443
17433 111443 97095 76128 76147 98754 62553 75580 93558 118299 88849 41315 11481 -13462
17421 -13462 5911 40858 42971 25633 8926 999 38936 23115 -14760 19524 39895 32688
17409 32688 48607 61812 61405 64301 69222 68403 68386 68606 36086 28746 34144 15337 25407 67560
17395 67560 20566 -1634 4760 -6968 -11698 -13821 5838 12539 31056 56408 46611 27181 8256
17382 8256 -2550 23875 53178 62096 15206 -23423 -20595 -10271 2866 -39762 -77227 -32876
17370 -32876 55 5779 -7545 -3879 14477 44617 47729 57798 86713 98246 99783 97600 78921
17357 78921 72314 94677 109997 116778 136437 120733 83821 53823 52485 50501 44219 41024 53614
17344 53614 32040 43494 54220 20187 19107 37364 52064 61862 36244 27756 6192 -2456
17332 -2456 -9106 -4808 975 35216 80448 92015 54431 9075 683 21944 40453 61897 70048
17319 70048 61874 73180 66291 61918 65530 89848 79644 60555 41333 15399 -3702 -13179 -32304
17306 -32304 2091 2888 -24023 -6329 24683 55381 60792 43956 73267 110461 109832 85994 73349
17293 73349 88944 80837 95980 104079 76262 67372 65671 52611 93274 99648 96582 94911 117328
17280 117328 105476 89114 78818 63384 23768 70742 102937 113133 111369 105874 109725 108830
17268 108830 129433 153437 123450 83496 80148 90731 103723 121471 102289 84902 98057 128445
17256 128445 141244 128803 164357 212929 203954 190038 209182 250633 245752 256070 231547 193905
17244 193905 202477 233859 237109 274815 312009 285750 306536 291780 298836 290443 277378 279619
17232 279619 251087 256209 285376 335951 304566 288240 300639 316183 351509 402102 427693 446679
17220 446679 448387 431900 440475 497429 510457 521744 554682 587640 629056 716275 710159 738991
17208 738991 790466 832687 874447 944233 1005454 1080619 1185606 1298715 1434541 1578975 1730162
17197 1730162 1917452 2109880 2254127 2335723 2444596 2617482 2835791 3107378 3462908 3894302
17187 3894302 4416184 5083583 5916963 7021151 8610244 10929141 14456930 20002373 28174595
17178 28174595 38787138 50281753 59619533 63739221 61614550 54737329 45551236 36270371
17170 36270371 28148252 21660652 16847443 13356308 10921414 9205905 8006460 7202148
17162 7202148 6655378 6292286 6110419 6070665 6196514 6470319 6886803 7480073 8235878 9330526
17152 9330526 10917319 13228558 16806547 22299275 30338781 40713007 51782256 60601826
17144 60601826 64283152 61980594 55282579 46606181 38102401 30961613 25603748 22139125
17136 22139125 20591636 21087618 23939921 29643398 38147331 48113872 56967349 61558628
17128 61558628 60443975 54587564 46129602 37179877 29137623 22607298 17579433 13878271
17120 13878271 11263686 9432349 8121103 7192808 6536925 6058807 5731379 5563180 5545637
17111 5545637 5670433 5929888 6324340 6848565 7611070 8762771 10553704 13406967 18027199
17102 18027199 24920771 34128182 44476592 53306150 57669681 56300892 50364305 41994092
17094 41994092 33331833 25597895 19304118 14514289 10987993 8443654 6665132 5381484
17086 5381484 4402947 3727611 3238111 2856929 2539502 2285287 2083533 1915595 1761946
17077 1761946 1582130 1419181 1241621 1145246 1049555 942436 838264 767616 712695 699430
17067 699430 663849 583228 565011 556849 528722 496075 478813 440913 365463 348722 343520 311875
17055 311875 329445 373419 395640 396039 374444 367052 351568 313010 295708 272007 249903 281589
17043 281589 309970 304263 281034 270279 265069 237722 224555 210019 199699 230237 216946 198549
17031 198549 168705 131863 121159 132222 125287 102688 81972 61897 61938 87932 91596 76353
17019 76353 75699 98011 113370 134893 153139 167531 190712 177980 143621 110731 104628 103020
17007 103020 81398 65895 107111 127305 128128 152470 148141 120463 136120 142007 134228 95492
16995 95492 82734 94295 98704 118290 101711 66353 50020 20536 -14877 -3712 49801 35153
16983 35153 15335 -6904 4248 2821 23306 66351 53205 33791 39776 53385 54939 73357
16971 73357 89891 99446 115795 102520 67540 18131 30647 63713 76655 31301 23112 34451
16959 34451 31814 30825 26334 32586 17816 22313 18843 26995 29440 39973 68364 68137 94900 121836
16945 121836 103392 84222 42972 13898 6585 21024 -6603 -3942 11100 34991 46439 74741
16933 74741 41537 23105 25943 56016 66448 37309 18356 16578 -13033 -15460 5633 29001
16921 29001 38437 19959 20743 30456 48606 35132 26236 21737 10746 12646 10872 18403 8557 -11668
16907 -11668 -29574 9349 26137 1632 15264 24515 36904 42138 29235 16925 -4839 10085
16895 10085 12338 -18486 -3140 188 6270 37092 24698 374 -8897 10768 43291 54177
16883 54177 23450 31185 45966 31515 18147 -6489 708 9667 33039 49212 12961 -1083
16871 -1083 20535 8424 29012 11022 -22593 -587 18816 6327 -15063 6511 33062 29696
16859 29696 25299 -17645 4215 17697 28949 37874 63475 58788 71301 91146 73527 64457
16847 64457 73765 60043 52101 21404 12324 8212 26311 40600 4628 -19123 -4331 16016
16835 16016 17078 -6997 -2223 -10116 -21531 -15485 -23759 9955 4414 24313 37121 18648 25923
16822 25923 13852 16691 61726 96092 125239 112113 92859 43223 -15202 18212 43874 65034
16810 65034 94260 60948 74377 92884 71649 63480 25641 14879 62003 73973 31904 2750
16798 2750 8796 16978 37427 10563 31088 62477 61129 44532 37431 33037 6887 14966 -12423
16785 -12423 -25385 -962 15984 -1154 -17250 -28492 -9067 -8688 12045 20339 27325 56731
16773 56731 72478 90079 92941 90772 62285 21578 -12394 -14777 -15703 -12986 -14943 22480 24190
16760 24190 26668 74243 76128 35481 -19532 -19380 18392 62801 50413 47761 26281 -10955 -27395
16747 -27395 -37629 -44792 -60459 -43002 -43637 -43448 -56681 -52758 -32147 -55981 -77841 -58481 -44336
16734 -44336 -41345 -77220 -69766 -45163 -29494 -37918 -37852 -63507 -38551 -44493 -41081 -5501 21477
16721 21477 11342 17123 6700 -5175 -13816 -20495 -12775 287 14158 2798 -16954 -2510
16709 -2510 7886 -37604 -59737 -88408 -99562 -86414 -66387 -28315 -45582 -59512 -36667 -6782
16697 -6782 7878 34971 33815 24369 35505 39301 48593 31796 9072 21050 -17010 -31891 -16072
16684 -16072 -6808 -56579 -49549 -30358 8589 9458 26519 40940 81968 101350 94909 72221 41979
16671 41979 8205 37590 14211 -27321 -44749 -33155 -19199 -17546 -51008 -36655 27920 81726
16659 81726 90312 84547 77754 76368 72921 85313 130233 204452 291615 279489 273965 259733 210603
16646 210603 166496 130216 68910 50884 23214 11462 21119 50837 55130 42124 59910 85351
16634 85351 65222 -4187 -37417 3818 26978 -3459 2481 70501 94158 104992 142014 203237
16622 203237 247433 271892 287224 322693 365816 331866 271754 227593 166889 142695 154813
16611 154813 147712 145078 163769 173941 196718 251805 289240 289453 304927 293499 264399 215780
16599 215780 163248 158432 97690 59865 24105 -13623 -46442 -44890 -31953 -7174 17625 49785
16587 49785 6878 -9263 16209 26766 12987 -35577 -43493 18294 66327 104109 133316 177613
16575 177613 252723 289396 285290 286021 285339 216576 137038 114552 104628 72723 63047 28036 7050
16562 7050 -12668 -36707 -51269 -39883 -36242 -61834 -60813 -62308 -26674 -41464 -50524 -1488 23044
16549 23044 18086 2397 15520 6375 -489 -18962 -28393 -22954 -41091 -53064 -52498 -28151 -22619
16536 -22619 -2189 20131 42624 58736 68087 74796 45665 5158 -31015 -55738 -23311 -3609
16524 -3609 -3166 12290 -14398 -4853 -9257 -24993 -26528 -41046 -25327 -35915 -77407 -66662 -42367
16511 -42367 -38781 -31437 -53867 -53639 -48625 -38465 -12659 28519 11329 -37690 -19212 -6137 -28805
16498 -28805 -10529 -50923 -64767 -14749 11569 -11970 -6103 19983 13157 -38310 -46143 -27564
16486 -27564 -41102 -50570 -38893 -64273 -47884 -78445 -90845 -49846 -26884 -6068 -15536 -37038
16474 -37038 -43027 -54062 -58389 -47730 -56024 -74015 -58486 -63944 -58201 -79656 -63076 -33914 -31555
16461 -31555 -29217 -1232 -37264 -83380 -81910 -80693 -61018 -42755 -10147 -15472 5536 4150 38649
16448 38649 56332 43897 40817 35047 40722 3789 -17924 -25358 -48973 -42814 5869 8108 -4490
16435 -4490 -24298 -32673 -81555 -81498 -14841 -4541 -14094 30103 67701 43970 -2653 -24206 -26743
16422 -26743 -59694 -41590 -43995 -50484 -42192 -24446 8612 30425 29319 -2440 -12090 -26023 -2702
16409 -2702 -44168 -39434 -22370 -56454 -27419 379 -6636 4310 -1220 -13667 -22620 -10771 10656
16396 10656 -2553 -34679 -28147 20865 3568 -16928 -13098 -24459 -46756 -81412 -52539 -34576
16384 -34576 -19982 -12272 -24660 8236 17580 10212 -16750 -43053 -58520 -11659 238 -22812
16372 -22812 -27726 -36198 -22442 -44834 -70823 -83561 -100764 -95258 -74091 -69234 -53968 -18226
16360 -18226 -10154 -3971 -7288 859 -42614 -58796 -72727 -83070 -54226 -39116 -8501 12931
16348 12931 24746 6296 -42733 -30320 -35156 -19010 -26935 -492 19621 27942 37046 32928 -11349
16335 -11349 -9734 16713 2800 -18011 -7567 -8287 6748 20553 -8335 -15102 11128 4884 -7734
16322 -7734 -22981 31719 41085 5430 4239 20143 7379 -14934 -14377 24188 18109 -15090 -12082
16309 -12082 2751 -643 24069 15432 -41438 -105629 -116251 -96100 -114167 -129058 -40130 -5366
16297 -5366 -24304 -44324 -47060 -59370 -39157 -23825 -14669 24913 47207 21196 -23311 -28724
16285 -28724 -68171 -98402 -101013 -79994 -89995 -60404 -30102 -3681 -10853 -43246 -63939 -80352
16273 -80352 -69258 -80378 -85694 -87999 -46556 -61751 -69453 -48542 -33186 -9658 48643 35193
16261 35193 19764 33713 27244 8647 9255 16459 6275 -28010 -54644 -57912 -70133 -82199 -74796
16248 -74796 -102022 -77779 -54908 -59002 -62955 -46823 -64036 -96494 -82402 -69824 -56170 -21162
16236 -21162 2375 -31733 -24143 -12335 -41072 -37616 -44720 -69256 -35513 2303 9577 7067 3781
16223 3781 -1581 -44665 -40429 -29292 -13428 12987 21539 16895 4192 -1079 6240 -8677 -18203
16210 -18203 -21499 -27548 -24039 -41907 -81642 -97508 -89730 -66845 -62303 -77924 -60560 -58396 -56305
16197 -56305 -47114 -8348 5762 -9002 -27818 -42115 -6357 2822 6859 -4445 -2780 -20402
16185 -20402 -69795 -57793 -3158 11026 -5497 -1165 -9478 8170 28897 23583 279 -14877
16173 -14877 -26373 14490 44298 48349 4521 -40489 -45053 -3810 14132 8524 54547 42847
16161 42847 37082 -15126 -23701 -27252 -12325 -8816 11281 11252 -11805 -15572 -14435 -5367 -14239 -42057
16147 -42057 1520 31370 43304 19528 -17123 -69543 -94561 -48228 -8263 -15563 -31473 1940
16135 1940 16761 19380 -3214 3158 -10449 -18861 -24562 -39277 -46667 -19435 15 -25186 -7449
16122 -7449 33754 24920 34726 76426 63196 28557 5716 -1551 21245 -7912 -35262 -1408
16110 -1408 -21550 -40647 -26685 -19736 -16762 -31979 -29578 -53524 -68194 -97260 -74120 -16447
16098 -16447 -4242 26966 52374 46223 35006 -12036 -50792 -38358 -48689 -29300 -35934 -46943
16086 -46943 -33563 -54919 -44988 -48316 -33505 -9033 -12733 -25108 -60044 -48976 -13072 18498
16074 18498 -4721 2889 -18225 -36525 -49114 -35184 -30886 -21693 -21337 -8257 -9308 -31408 -33853
16061 -33853 -28965 -50978 -41533 -65807 -68613 -79923 -53660 -12079 -35592 -54468 -64704 -57827
16049 -57827 -37472 -30441 -37710 -16973 -3095 -20555 -55772 -31332 -42644 -48786 -54219 -81863
16037 -81863 -87550 -112447 -97769 -64700 -66294 -57525 -43202 -1903 8183 9904 30689 27613 9181
16024 9181 1868 -24460 -32027 -25419 -35372 -22862 -24524 -37782 -31227 -11085 -1981 -1959 -257 16852
16010 16852 20173 -4803 -39901 -64028 -28588 -32883 -31991 -17666 19337 36374 5752 -56665
15998 -56665 -78573 -40662 -15973 -37458 -39453 -36227 -27990 -16674 -27105 -40062 -80282 -76818
15986 -76818 -62749 -43168 -30139 -23057 -28972 -50824 -43772 -62875 -18857 -20878 -41656 -72120
15974 -72120 -59827 -42193 -10479 18034 -17469 -38632 -40004 -50731 -28016 -21580 -52348 -72515
15962 -72515 -40213 4453 199 -9763 3323 4741 11450 6211 5554 26235 28216 27891 -7943 -27285
15948 -27285 1120 8564 13316 -20331 5970 35951 24285 -7823 4476 7528 12326 2204
15936 2204 -5270 -20986 -43724 -70830 -67973 -29038 -8840 -1630 -2716 9357 -10405 3627 -29252
15923 -29252 -47277 -58918 -29087 -4739 -8641 -11635 -35952 -66954 -73190 -55236 -54743 -99327 -94415
15910 -94415 -76923 -68833 -65367 -53831 -67921 -36570 -13215 -30650 -64884 -92573 -93234 -54848
15898 -54848 -29563 -28059 3432 26438 -2314 -3575 15613 -9003 -35566 -33439 -33048 -61065 -38276
15885 -38276 -1642 -8164 -41077 -43911 -46009 -24438 -12252 10674 6572 1965 -2884 -11552 -25576
15872 -25576 -36574 -10995 -16019 2877 -2064 -14989 28023 21521 -18276 -21699 16235 7898 -3221
15859 -3221 14831 9475 10165 3160 -14193 -16861 -14481 -23869 1687 -9591 -43593 -32534 25479
15846 25479 16808 -26817 -25659 -22689 -53331 -57979 -55568 -77907 -49028 -24498 -40435 -25368 -22375
15833 -22375 -5186 -4023 -1278 -40117 -26268 -31984 -32643 -1195 -19592 -15931 -10950 -10397 -1245 -37624
15819 -37624 -52315 -22483 -3534 451 11570 24241 10467 -21865 -26456 -71467 -64606 -68439
15807 -68439 -84863 -89373 -86286 -88792 -75629 -53365 -33001 -23620 -38881 -68767 -76173 -36276 -45497
15794 -45497 -29310 1451 8261 23114 18820 16839 9394 29116 26046 -6489 -12268 -16710 -49959
15781 -49959 -10397 -20390 -37124 -30177 -20658 -24610 -19172 17105 27335 -10188 8630 21487 -38547
15768 -38547 -15856 8875 20112 -19025 -9108 2626 -19953 -60642 -47579 -15037 9418 -3678
15756 -3678 -6812 -2538 17138 569 -18071 -12080 21046 42252 48272 44895 31093 32249 17917
15743 17917 -16266 -46375 -49155 -53567 -61662 -53384 -71346 -75933 -84545 -83076 -40958 -7655 -25678
15730 -25678 -2764 50695 8893 7266 -19446 -33754 -40366 -33687 -17013 1410 13720 16130
15718 16130 41733 38013 23529 9781 15155 5158 -49898 -53276 -19165 -5913 1298 -28291 -70160
15705 -70160 -73248 -81140 -82017 -79371 -96965 -62359 -82235 -44438 -528 -9972 -19083 579 16694
15692 16694 -7637 -4208 13383 23197 1616 -3792 26376 -28364 -53676 -40417 -664 -38651
15680 -38651 -53018 -65381 -44845 -54163 -59755 -58654 -35107 -18815 -34444 -47122 -24476 -11571
15668 -11571 -18566 -53194 -91321 -59035 -32579 -50787 -63540 -25695 -22606 -7192 -23256 -3969
15656 -3969 -17047 -15942 3261 -31499 -57671 -36281 -66698 -71420 -52971 -14225 22410 49681
15644 49681 31324 34546 29387 9543 13639 9187 7956 -14512 -34481 -26062 -29083 -34492 -29741
15631 -29741 -45229 -27498 -3120 -16996 -53694 -93103 -60666 -5538 11 -18251 -21935 -20411
15619 -20411 -19237 34021 22153 -10320 -4967 -14333 -47522 -76599 -90232 -21612 -6437 4584
15607 4584 10379 -8578 -37291 -53072 -43926 -46907 -41989 -37244 -72086 -43571 -6710 -22532 -46852
15594 -46852 -28518 -28781 -27518 -26808 -11378 -12997 -20410 -12420 -13321 -27382 -48186 -53552 -22195 -17548
15580 -17548 -51797 -68335 -61878 -60476 -45697 -16111 130 30689 60842 37295 24339 28203
15568 28203 30290 26245 11169 -33899 -32623 -7868 -30175 -57043 -54475 -17451 10600 38033
15556 38033 37238 32515 2628 -6958 15639 31651 37747 17186 3026 -13027 2980 19122 -14985
15543 -14985 -13542 -19527 -29560 -36525 -15505 9083 -16499 -3613 13265 5411 13563 -20804 -31310
15530 -31310 -55593 -51079 -52152 -53887 -44667 -21858 -7789 -31061 -64938 -53571 -43305 -18540
15518 -18540 3817 -18376 3956 25738 13191 -28327 -30807 -38848 -54754 -37722 26884 9323
15506 9323 -19599 6310 19670 -4509 -9279 -17390 -20510 2100 31109 10068 -53195 -72263
15494 -72263 -25392 -8713 28209 23510 18005 -8999 -34700 36548 41577 -9284 -35748 -24791
15482 -24791 -29779 -7010 -19941 -4634 -16771 -46591 -59340 -18279 -37970 -48351 -34522 -12408
15470 -12408 -4793 -30458 -38001 -60910 -77807 -42225 15017 22758 36620 54632 44932 -4206
15458 -4206 -17181 -28412 -22426 -3662 -25116 -46505 -45609 -17420 -18432 -45466 -44377 -17239 8230
15445 8230 -8393 -22406 -634 15593 1346 -23552 -32974 1207 -2991 -9904 -10242 -6766 3154
15432 3154 10463 22854 24876 27182 49046 57523 14192 -1690 17145 37527 37721 18917 2425
15419 2425 25839 -17364 -54305 -54330 -26215 -4015 31164 35061 19561 -6355 14269 37808 12702
15406 12702 3762 -30003 -33728 -42397 -25222 -39163 -26749 -25470 14872 -13993 -3870 -18610
15394 -18610 -26716 -68963 -77298 -66135 -70032 -57994 -31655 -22827 8465 37100 14610 -9804
15382 -9804 -22914 -12506 -10797 -17908 -26158 -66225 -47252 -43862 -65175 -64383 -54741 -52139 -66493
15369 -66493 -68123 -52083 -30768 -22450 -6703 -38266 -31308 -45735 -58468 -36407 -66158 -39235
15357 -39235 -6689 17600 32723 30213 16804 18735 27972 26540 70465 96846 60120 30050
15345 30050 42088 72077 84464 59931 41408 5437 104 -25152 -50432 -83383 -55651 -55960
15333 -55960 -45012 -28234 -19558 26412 30316 804 -18319 -19595 -31626 -474 13742 -1254
15321 -1254 -27657 -26086 2824 -4790 -31748 -23923 3152 3119 2523 8211 -22556 -51631 -33598 -47284
15307 -47284 -23050 1152 -10322 -6563 13982 10332 72 -27193 -30292 9590 24410 7182
15295 7182 -18188 -25962 -8630 34881 14305 -26661 -35895 -33491 -14689 -4301 24989 17646 380
15282 380 -23426 -50416 -40532 -7571 4140 7642 -10745 -6260 8566 6302 -24176 -15388 -29535
15269 -29535 -27840 -5913 20305 16759 -6681 -33179 -38768 -44645 -89792 -110246 -82254 -55957
15257 -55957 -84104 -120236 -95200 -58323 -48301 -2969 20792 -24756 -34717 4119 6000 -31543
15245 -31543 -70076 -63811 -19855 -22642 -5577 -9161 -14162 8646 29411 52533 20126 -21761
15233 -21761 -24556 -4919 -13026 -10011 11139 20783 16830 -3359 -8576 -25278 -20410 13864 48219
15220 48219 28970 -36149 -61686 -52091 -27142 -9137 -25628 -1240 -13977 -29615 -53232 -34306
15208 -34306 -4719 -8016 -25763 -55226 -15544 29207 17414 -17875 -49989 -32040 -8481 -22306
15196 -22306 -57484 -60724 -21942 -1452 22836 -13761 -25756 -2203 4702 10280 14297 -15743
15184 -15743 -4362 6144 -43002 -91994 -93354 -57222 -30739 -5818 23220 24356 -4520 -43530
15172 -43530 -40241 -43616 -40038 -19908 -30979 -18879 -31250 -1095 3876 9989 9888 -15207 -33203
15159 -33203 -65651 -92017 -97869 -75252 -58676 -37373 -1685 21692 -13556 -43092 -70708 -55374
15147 -55374 -28849 -22586 9238 10774 6330 33949 12003 -17572 -49210 -38112 -12885 11078
15135 11078 18146 5889 -30060 -36488 1433 26906 -8823 -15968 -23050 -19139 -17579 -25915 -48093
15122 -48093 -89543 -74914 -64340 -39044 -26587 -20398 -2264 -4545 12254 -4865 5045 -10476
15110 -10476 -31139 -31984 -37539 -9767 -19253 -51435 -56424 -47075 -55603 -88818 -82205 -83045 -51016 -33096
15096 -33096 -28287 -16289 -37513 -49791 -50326 -3618 41261 38029 24994 12286 10451 -16026 -2561
15083 -2561 -31589 -70916 -66694 -534 32988 -20650 -27248 -31685 -24299 -51877 -103867 -84945 -31366
15070 -31366 -4902 -12522 -2356 11057 -26792 -58755 -23299 -410 10629 20138 40833 35077
15058 35077 47504 28354 2125 10648 33233 16868 6775 43345 54198 47386 20795 -39
15046 -39 -12079 -16957 -38074 -26969 -4523 -26007 -27867 -12941 -10149 -2077 22885 18166 -10670
15033 -10670 -11310 -8622 -9455 -59971 -69474 -29549 8647 -6532 5258 25451 34928 43506 47723
15020 47723 46135 6055 4418 1833 3406 -18626 -15957 17707 5461 42839 55330 32514 32433
15007 32433 37144 -8548 -26611 9184 22334 14968 19631 22125 7227 6946 20853 42723 44873
14994 44873 44013 86167 165525 217955 319723 544088 813044 918859 780822 589816 407550
14983 407550 274297 181535 124907 98848 66668 71018 64579 53561 24904 6607 15349 3630
14971 3630 -13796 2411 25861 27508 27970 1184 -14011 -37922 -4656 22222 4237 -1495 19055
14958 19055 18336 -30357 -51594 -31835 -32474 -34718 -52673 -42148 -29401 -14505 2393 5254 -6883
14945 -6883 -6201 18427 8924 -13091 -33931 -66427 -26232 -30607 -15169 -5784 -4118 18004 47996
14932 47996 9532 -2437 -7153 -35480 -43824 -39069 -53367 -50335 -15611 19572 56578 56792 20203
14919 20203 12970 -45202 -89547 -52009 -27688 -39715 -35054 -50319 -18543 10455 12753 7254
14907 7254 -66409 -67138 -188 22835 35770 66808 48933 55970 32865 25966 25564 -1886 -38848
14894 -38848 -52776 -52708 -57161 -66379 -53784 -38126 -33631 -26532 -26711 -9002 -8905 -13987 -11426 -12168 14443
14879 14443 59386 77975 45098 32714 -34229 -80071 -70447 -18442 -6528 -5977 -38263 -4793
14867 -4793 17678 -2367 -17366 -5310 -10827 -34965 -47393 -60672 -40429 2224 13977 6608
14855 6608 -45456 -68998 -33674 -44107 -55188 -40348 -28841 -14437 23084 9269 -44516 -48932
14843 -48932 -38696 -34183 -61766 -54471 -39454 -58082 -103884 -91673 -45724 -20120 -5405 -793
14831 -793 -32522 -13711 -30259 -63280 -71323 -62549 -45261 -35387 -13431 26417 17010 14063 -2809
14818 -2809 23137 36054 41893 -16028 -37391 -28021 -26436 -65803 -93745 -87920 -59914 -35424 -13322
14805 -13322 11295 17582 14942 33903 61033 19673 24701 31539 12293 -43902 -40673 -59352 -77428
14792 -77428 -42059 -25810 -24638 -19749 -32147 -52269 -55145 -46583 -41374 -58469 -19807 71 14943
14779 14943 13903 27307 27353 21428 -20681 -29896 -24841 -29776 -18084 -16917 -23306 -22707 -12592 -12603 -36469
14764 -36469 -14052 -21540 -27684 -34824 -21805 13812 15940 -6328 -10836 -5066 5005 4948 -37300
14751 -37300 -43243 -17117 5515 13099 -24009 -37320 -26074 -4939 9106 21132 -13526 -22032
14739 -22032 12573 18517 16922 30283 44191 54991 55814 77499 54741 24899 1460 -265 35281
14726 35281 -6076 8353 16369 -17544 -53751 -75974 -78069 -61307 -31442 -33205 -14381 39425
14714 39425 56621 38733 23146 22956 33401 43341 11866 -20864 -12683 14741 72103 96551
14702 96551 79185 77958 18741 -30623 -20208 -15675 -12663 9083 2275 -3441 -4246 12990 -4427
14689 -4427 -35175 -15719 4509 14956 8093 4476 9403 -4392 -33886 -73344 -47555 -37069
14677 -37069 -57438 -58967 -33913 -17933 1788 11794 -8956 -15548 -31906 -8905 24791 30657
14665 30657 13331 16794 1238 -3005 -13999 -25643 -678 43922 57523 41761 -764 -61960
14653 -61960 -47840 -51635 -59696 -76926 -105557 -93839 -84001 -40736 -38100 -42046 -8537 -3057 -17277
14640 -17277 -12999 -25270 27728 84390 86750 56678 41572 25269 19266 -4102 12820 35590
14628 35590 14419 28347 20691 23813 4823 -34087 5004 977 13422 22445 -36821 -19756
14616 -19756 -24304 -13909 5450 -43120 -56981 -32010 5966 17214 -32005 -30786 -29173 -43806
14604 -43806 -20561 2241 -6725 -2863 17825 -1944 -22122 -24794 -23457 -10099 2911 36123
14592 36123 54879 44386 21439 -23739 -25941 -18649 -15963 -1691 26689 47050 -876 -44531
14580 -44531 -48323 -27274 699 -20985 4418 3559 19368 62747 54172 12487 -1494 19843
14568 19843 54367 61231 73876 65573 38264 23757 15308 31026 22219 6874 14820 -3639 -59783
14555 -59783 -64255 -53154 -26880 7058 20686 19566 5122 -23198 -38515 -67055 -47748 -60559
14543 -60559 -72644 -56273 -30978 -31664 -42177 -12762 18644 -5563 6859 25739 -22980 -31100
14531 -31100 -8613 6856 39836 45916 14610 -24377 -48417 -33732 -35399 -18837 6448 8232
14519 8232 13593 24641 36917 56411 98638 103960 65629 27630 33527 43252 75853 71425 71609
14506 71609 59755 50674 72393 79871 69545 58974 47016 37514 59320 79160 72819 56345
14494 56345 78404 78631 121253 97156 98796 146246 169997 224235 265142 323325 361539 435266
14482 435266 559921 727867 914001 1093012 1311304 1575198 1795847 1873005 1893234 1864213
14472 1864213 1736722 1489266 1256342 1022932 838009 687069 563931 410090 305338
14463 305338 266078 267622 226197 200516 169716 116773 135614 140207 155340 132338 90070 65524
14451 65524 83697 54748 49734 26478 8869 20185 14458 33506 69516 44907 25082 8905
14439 8905 -417 -5104 -7423 -127 1029 25962 28404 736 -2266 10074 -6897 -32991 -22814
14426 -22814 -30283 -17108 -9379 29230 -1582 -6232 -13604 13372 14005 23019 26653 14911 13073
14413 13073 7284 -30415 -27102 -10749 -7756 26797 41176 28036 32349 23961 1414 5838 6994
14400 6994 -5526 1522 12626 13417 47891 59478 14235 -22560 -26480 -48644 -35314 14069 50632
14387 50632 26068 19152 8721 965 6957 8896 -14563 -17632 -14645 -24417 -38003 -4875 16121
14374 16121 -12761 -26032 18294 -6911 -20500 2379 -16328 -37073 -57780 -85313 -38910 -43110
14362 -43110 -92257 -116005 -90352 -85946 -166105 -198016 -212649 -223783 -286876 -386627 -440494 -450958
14350 -450958 -489413 -512644 -530491 -498440 -435454 -367365 -288692 -245280 -194936 -126091 -62863
14339 -62863 -14309 27697 67787 80309 113207 134580 122341 101536 64395 50656 51919 66938
14327 66938 63883 86845 102766 83588 49636 55957 84534 67851 44561 65922 90524 85725
14315 85725 99234 85987 88861 89505 48199 29470 -6683 -14669 19907 39424 88878 116648
14303 116648 82686 85393 47557 23441 39664 72401 74613 105795 109630 94413 89921 64907
14291 64907 39259 72685 61071 46561 42222 61275 87880 155500 199313 227901 255962 267423
14279 267423 274362 308571 296043 298013 301495 281698 290924 292549 293574 261194 199928 125804 108813
14266 108813 133703 139159 92091 79576 59536 77843 81846 45625 12198 4214 45612 70029
14254 70029 98374 108191 88763 92721 111664 68118 61823 63645 56061 56488 69774 78237 58536
14241 58536 73099 58849 53512 24234 -3471 21323 63363 68466 69595 30697 -3124 979
14229 979 7587 21407 -25304 -70036 -80267 -46305 -26539 -53930 -64741 -84272 -76126 5199
14217 5199 74975 88089 136781 164038 153472 162644 154202 148908 178049 202451 185185 176976 200309
14204 200309 202914 227471 186536 155794 129518 142893 164985 211094 210937 200525 203150 198893
14192 198893 233246 205366 202302 248595 248109 252097 283760 295374 294207 321792 347677 317312
14180 317312 310785 327021 346689 323630 288066 273387 266429 250832 238055 222281 219814 220479
14168 220479 188942 129424 145883 143708 123234 89213 81802 121689 175489 197218 174658 139888
14156 139888 58512 21259 14191 -13444 31737 91244 114069 155132 265226 341470 349016 394402
14144 394402 457748 455977 438363 452182 461412 441864 435678 430145 423416 427335 449646 438424 412544
14131 412544 397203 415977 402983 398704 423451 446691 456882 500256 527334 529763 530396 555326
14119 555326 594925 610741 613491 641717 646093 634876 644324 674926 732055 777459 781715 760924
14107 760924 720131 736431 781949 819553 878796 935427 969384 973848 996799 1009816 1002975 1056889
14095 1056889 1094636 1109678 1131465 1144148 1166550 1203393 1260796 1301831 1343803 1361913 1361343 1431294
14083 1431294 1485443 1526150 1593143 1628121 1672743 1729294 1800930 1843747 1881663 1991996 2099544
14072 2099544 2158302 2232534 2356577 2494027 2613152 2755387 2909612 3097427 3253116 3417085
14062 3417085 3550227 3733597 3980421 4240945 4517191 4892617 5323448 5749253 6248114
14053 6248114 6775019 7338598 7978206 8716060 9467219 10308235 11282085 12430125 13769741
14044 13769741 15282756 16997886 18979409 21192090 23760132 26692803 30001418 33840761
14036 33840761 38406587 44098537 51436805 61334905 75432148 96058042 125695077 164392955
14028 164392955 208994707 255880485 299892531 334768029 356492242 362520659 351524750
14021 351524750 325077883 287690545 243840313 198908653 158303203 124650278 98218622
14014 98218622 78040321 62900664 51625243 43161376 36685074 31516916 27318833 23820989
14006 23820989 20847976 18292211 16080008 14150543 12489504 11103731 9940193 8935871
13998 8935871 8105289 7391684 6753960 6205099 5767537 5380525 5049040 4751444 4501627
13989 4501627 4254920 4007714 3832459 3646597 3484327 3342521 3224158 3111205 2983616
13980 2983616 2824992 2685443 2559335 2414529 2281056 2126098 2005329 1939891 1881827 1819857
13970 1819857 1756061 1673286 1605004 1556562 1503080 1463913 1416811 1383452 1325654 1309566 1269019
13959 1269019 1224338 1175162 1090282 1073809 1059731 1038936 1012625 1014735 1063570 1106925 1109532 1076192
13947 1076192 1031246 1059566 1022474 929865 864924 812325 772693 733306 701707 666603 688433
13936 688433 685929 607173 601783 600782 594020 595072 583260 502797 482553 507734 450920 418296
13924 418296 410999 405142 433801 453462 450777 428958 381618 337191 360212 390337 373858 339881
13912 339881 316518 304825 332531 311706 307982 314016 330465 319904 281372 250842 267450 303105
13900 303105 343122 401789 479638 534726 591213 657526 662693 664093 628292 578728 564464 560780
13888 560780 543606 515344 473418 420938 355505 349353 346830 294953 260420 290001 323838 313042
13876 313042 279018 275495 219910 197570 209994 181910 141858 130880 125043 111653 77988 64116
13864 64116 70093 71714 69358 57776 50755 65999 90401 126330 112518 108098 84204 108878 136717
13851 136717 143361 150872 163511 133055 139780 127028 117571 60382 39816 71015 50200 58721
13839 58721 69813 72557 41615 48241 68584 88461 133262 119006 162129 224958 280727 334153
13827 334153 358067 386842 387131 363582 368160 301737 286960 265615 197001 165798 198095 197814
13815 197814 217073 191154 179987 183211 183174 161045 152574 143227 113068 122353 131743 120493 103423
13802 103423 93271 79841 51557 46221 47210 63702 87421 112955 117997 120377 127737 131129 146704
13789 146704 93221 61405 3675 -7321 27186 72814 97265 91568 82434 76953 58871 35335
13777 35335 49573 70687 75611 86597 112000 115723 117240 113085 119225 105352 94204 87807 96321
13764 96321 120874 89736 56749 54869 41294 80845 102817 90737 101045 70042 84969 103174
13752 103174 112461 100605 92093 75548 69840 79172 57210 71457 64761 61323 86929 101808 88749
13739 88749 69673 60934 42717 24372 603 20862 11529 19355 29964 10721 30978 62433
13727 62433 96946 47663 62508 79338 86760 83838 74424 61313 84933 44760 -21022 -15898
13715 -15898 9819 35212 66106 42429 7120 -7255 40306 118434 98330 98277 147944 228589
13703 228589 326670 431879 466679 517346 540329 541107 505804 487746 438532 406021 379828 370682
13691 370682 351033 260522 227824 193943 204291 211108 203021 194232 191370 135400 104351 86517
13679 86517 69854 41753 35073 31930 51912 67417 87449 92821 93508 52298 17536 25664 71018
13666 71018 122089 161407 161809 143696 112866 127367 123920 103047 77292 58817 81804 92678
13654 92678 34949 -18321 12821 76160 86923 56907 46363 49423 26800 17656 54935 73911
13642 73911 49955 47083 38885 47273 39226 58071 132528 141239 102465 68175 41534 35523 60339
13629 60339 59593 60967 62814 114319 127894 134029 137921 166921 203127 295661 279275 222210 168842
13616 168842 147664 114320 105161 110468 103137 90406 110184 84217 99558 99299 81403 63290
13604 63290 56694 56157 91452 103517 96852 97787 79708 61877 61825 57689 67920 69184 49112 65892
13590 65892 94247 82370 83431 102815 140798 150496 152973 158479 163231 191032 222750 278776 327345
13577 327345 401222 518362 623113 697144 736609 837272 1031490 1189026 1372803 1558087
13567 1558087 1713771 1818742 1877577 1872499 1725755 1484089 1279958 1053978 855979 687867
13557 687867 533474 438304 391546 386571 327580 228508 210111 236478 225677 186788 140276
13546 140276 135355 105139 58294 72844 103115 92656 80752 78829 63276 53202 51724 51744 66224
13533 66224 78078 99959 102984 97477 87702 100233 112518 101751 81545 49681 23596 9079
13521 9079 24973 23014 19459 21472 -15525 -64738 -41403 -71328 -82598 -16594 24200 10148
13509 10148 7817 2812 8302 -4944 5241 53292 38384 5872 -1482 -15549 -11524 27515 35803
13496 35803 36156 39156 36322 20075 24491 16886 12973 40009 46553 19856 62619 73349 49224
13483 49224 62178 53813 68131 93111 69720 20506 12939 -11168 -23835 -1617 21857 45003
13471 45003 56547 27711 14662 4482 -3761 -13288 -14500 -50008 -52128 -17669 8928 20284
13459 20284 -712 -2921 50378 37187 55936 68976 12542 -22041 -13853 -5204 8181 24308
13447 24308 28215 37084 23344 60465 64683 56708 39674 27497 15059 -2686 -24096 -25486 -3338
13434 -3338 -16070 -22714 -25862 -134 -15490 -40209 -41593 -29724 -37053 -30013 1424 32633 27449
13421 27449 49899 28489 -3287 -44811 -36524 -17303 4216 -1 -19439 -15550 28496 66193
13409 66193 76013 42478 -8767 -27283 -32273 3719 12292 -29724 -23528 -25205 -2573 -6167 -8805
13396 -8805 -11586 -8417 -45275 -54522 -13800 -10980 -16000 -21313 -1428 19717 36404 353 -26388
13383 -26388 -36886 -32683 -13283 -10694 16806 48384 1474 -39626 -9078 -3222 -44100 -61162
13371 -61162 -30305 -29513 -45941 -75595 -73181 -58708 -22301 9044 17360 5848 -16662 417
13359 417 853 3271 10336 -3611 -5131 10208 5948 11717 25743 -3983 -4593 -19198 -21070 -13628
13345 -13628 9077 20923 14310 -3581 -6239 21887 33360 37773 50733 59329 67949 49762 9646
13332 9646 -23901 -8473 -5326 -5095 -13857 -31613 -33766 -46635 -51337 -58045 -42602 -32315 -30417
13319 -30417 -17517 5053 -4651 -5526 -14403 -36781 -50327 -62354 -47295 -28086 -10098 -30445
13307 -30445 -28462 -16678 4528 -386 -23874 -39409 -48174 -36721 -5484 7530 8310 5651 -15683
13294 -15683 -12261 -8405 -27992 -26631 -45339 -17237 -47126 -67542 -32415 5670 -6469 -33523
13282 -33523 -16062 -37264 -66174 -75820 -92930 -76619 -59957 -48882 -84772 -88378 -88308 -52429 -40106
13269 -40106 -18818 15394 8182 6597 -10090 -17218 -30654 -38139 -19804 -37233 -43990 -49659 -62927
13256 -62927 -56247 -31481 17836 8968 14011 -7626 -33305 -20311 17190 35022 32399 9447
13244 9447 599 10965 -5172 -34736 -29636 2814 18754 15010 9419 -3348 -4908 -23760 -27279
13231 -27279 -29606 -51185 -14247 -14882 -31214 -13079 5403 37404 44352 28614 20610 47451 27300
13218 27300 3533 -31402 -58805 -61204 -52098 -61335 -68720 -74095 -72754 -57928 -59098 -17668 -8989
13205 -8989 -16069 -47285 -83312 -51923 -4484 -952 -8912 -33268 -64142 -83874 -36331 18772
13193 18772 -3141 17040 22742 -15983 -42800 -74457 -14976 15056 10441 17477 3045 -9440
13181 -9440 -10373 23766 54320 55239 26157 33771 7830 894 22023 36754 42060 35028 14979
13168 14979 -10350 -12977 4999 -5027 6709 -4437 9504 11002 14490 64942 87914 60454
13156 60454 64006 38256 27072 37210 11699 -13238 21886 20983 -25392 -28101 -19373 848 -20388
13143 -20388 -32957 -12180 -8287 9002 17028 40840 41111 12809 -16398 -43517 -34400 -40639 -54217
13130 -54217 -23439 -35598 -66535 -80570 -53466 10752 49842 64995 75176 24343 -14005 37532
13118 37532 52497 51229 41592 47120 24319 9182 19121 -8161 15260 25142 -572 -11459 -24479
13105 -24479 -32215 -17483 -28141 -1236 -21535 -3421 8258 -12960 -10677 -25821 -22163 -13258
13093 -13258 2693 -3396 14279 40591 26592 25271 23623 11372 -9814 -15225 -27111 -43703
13081 -43703 -47867 -13025 6760 11164 28087 20365 1534 12716 2909 -47531 -20073 -105
13069 -105 -663 -45566 -76732 -63955 -31569 -5736 -37069 -44517 -22250 -18436 -33458 -30968 -3053
13056 -3053 20607 19073 -6183 -13848 -7299 -21660 -21429 24039 64841 31324 -27413 -38827 5119
13043 5119 16779 13556 9452 12394 3614 9890 22899 -17240 -42067 -50823 -64992 -84541 -55942
13030 -55942 -43367 -17498 3095 3388 23427 31 -17432 1936 52957 28187 29036 37261 46049
13017 46049 37744 39462 56009 80388 63207 62186 25973 15384 24840 8347 -18545 -14028 -2722
13004 -2722 -25790 -43824 -29939 -19422 7893 15770 -25146 -50995 -75174 -56388 -33364 -16190
12992 -16190 -14984 -4536 23267 34701 17959 -5097 2870 5868 17733 25532 47979 39464 15349
12979 15349 11228 35241 43841 31578 38187 53334 16047 2873 3059 3802 -11059 -47548 -51796
12966 -51796 -36304 -49669 -23062 20602 54402 42290 41593 40818 38352 25299 1801 -38374 -37726
12953 -37726 -14869 -1523 31748 17760 14608 47356 40781 -692 -45500 -79462 -83623 -94125
12941 -94125 -56120 -30894 1190 -1521 -23413 -36309 -50281 -58360 -50108 -13725 18918 60319
12929 60319 68985 82213 63118 37052 49376 76420 53542 32318 17937 1669 -2352 -40351
12917 -40351 3073 10930 27583 55746 22757 -2217 27721 16624 37388 19239 40735 72039
12905 72039 66279 42595 31813 9386 19838 38977 40812 40459 2569 28338 47084 25811
12893 25811 -2149 -20118 -35821 -6341 16814 -1789 3989 17437 -26877 4379 13885 14494
12881 14494 8006 -22279 -39944 -25245 -27402 -27833 -38546 -42069 -30089 -21394 1976 23734 35254
12868 35254 24939 49809 56314 1447 -43613 -76037 -45827 -25962 -19767 -19134 -38380 -59748
12856 -59748 -52157 -38740 -35249 -6465 26355 4967 -4991 -22255 -28153 1758 18542 31018
12844 31018 49457 23297 -8339 9802 30223 -4200 -10298 4108 -10586 -16384 -13132 -1450
12832 -1450 16363 20535 15429 7756 -1703 -13554 20581 41573 35573 33472 22182 -16062 -16695
12819 -16695 5447 -22914 -14492 -23163 -51139 -30514 -53237 -66061 -40297 -10955 775 8903
12807 8903 13408 10813 -8488 -31190 -37259 -58681 -53258 -52644 -39552 -6337 19608 37584 9197
12794 9197 -21215 -15627 52351 56498 47994 46050 44559 37217 12153 -1829 -4268 -12449 1659
12781 1659 32949 77842 92297 60290 18375 -2416 20911 28869 10108 4443 7161 -4237
12769 -4237 4045 20388 77256 86532 66009 46389 40794 31935 39757 53203 51448 42641 75093
12756 75093 29286 12187 20536 5761 732 43156 101323 103371 86584 66597 101493 139613
12744 139613 112612 88979 93619 98158 97226 74501 84069 82153 76570 83157 77606 110061 127944
12731 127944 109242 103542 121129 115953 102032 93384 142537 138689 135282 191076 236997 267913
12719 267913 287429 309894 359048 395500 456345 521395 556171 600806 631200 597615 510874
12708 510874 452704 415513 417420 411648 405183 378815 372259 395088 394387 395624 380220 370106 392610
12695 392610 381115 361400 395132 405305 393352 403568 387161 381860 366452 378350 383544 382307
12683 382307 395190 436614 483155 493732 529090 540857 551583 555448 654757 800368 973995
12672 973995 1220781 1479018 1643766 1705369 1634015 1508978 1308808 1072160 880771 735131
12662 735131 627352 588541 578639 540863 515889 521331 541003 538108 537836 560162 559329 557115 546106
12649 546106 532646 492658 446657 412761 369919 334173 332625 351383 322705 315649 340059 361450
12637 361450 368433 321503 321012 319259 348200 400739 406990 448324 550712 634491 674268 658412
12625 658412 600744 507971 415262 339903 322949 322149 269192 225548 173415 145543 149459 127507
12613 127507 82129 96717 89518 87666 74120 74756 51338 33355 23026 55401 30943 24477
12601 24477 41758 40627 10625 -21045 -6427 -1997 -56797 -87691 -74743 -63029 -38572 -38102
12589 -38102 -46817 11597 45367 67238 19700 -12595 -44322 -52932 -41900 -21477 -5544 4343
12577 4343 -31700 -84282 -117021 -105514 -64635 -71884 -80411 -74982 -92076 -136487 -137913 -95762 -71703
12564 -71703 -43012 -20687 10164 2964 -20357 -58587 -78055 -103624 -120298 -203132 -260952 -268558
12552 -268558 -287161 -358777 -422637 -414121 -330626 -266628 -164183 -96793 -29301 32857 76199
12541 76199 56038 13086 1423 18991 21767 15589 30480 26687 7190 -17390 -31359 -31239 -11604
12528 -11604 -14222 40109 96517 113435 133941 129323 138732 114399 122895 124231 148981 159357 122323
12515 122323 123686 109781 108938 141035 147240 88769 50488 59981 57673 30021 39787 77096 144749
12502 144749 155326 181490 186062 187654 257394 301335 260021 230356 208768 183640 206495 230277
12490 230277 224482 222850 210402 233516 238319 224594 240689 314499 378562 404382 437697 470310
12478 470310 466021 462609 422500 406248 372827 334087 351401 354457 361495 346158 341971 323267
12466 323267 307457 313341 326825 365692 404471 458092 543021 577976 581997 668749 760909 911024
12454 911024 1153670 1358782 1463115 1474099 1390021 1294285 1193838 1081190 966616 907424
12444 907424 920080 904191 893962 932443 989592 1080572 1099601 1110176 1156028 1154049 1145831 1160878
12432 1160878 1209491 1261699 1307608 1315282 1303240 1312977 1333198 1284694 1284336 1336108 1399616 1541110
12420 1541110 1708600 1920990 2219431 2609140 3009400 3256702 3289153 3136997 2878718 2588242
12410 2588242 2313605 2085386 1920797 1763516 1634367 1569104 1510234 1494811 1493031 1441811
12400 1441811 1417953 1373566 1329017 1298479 1228206 1191743 1186852 1210861 1247535 1248834 1225099 1233425
12388 1233425 1203131 1170213 1162490 1161648 1156858 1203183 1308832 1450656 1630047 1786463 1877250
12377 1877250 1867172 1707214 1542068 1400950 1255916 1086097 982090 907335 891459 882461
12367 882461 894098 923183 930273 914139 926703 947252 962169 980418 973983 996597 1005391 998496
12355 998496 999075 1016269 1059777 1059000 1083698 1170334 1237843 1322342 1460854 1623149 1844466 2060191
12343 2060191 2299580 2512305 2697269 2855337 2895209 2848138 2717585 2595065 2539042 2459705
12333 2459705 2376570 2328678 2338803 2302604 2303842 2355207 2428235 2503607 2675271 2890355 3053619
12322 3053619 3126894 3136765 3087989 2980683 2850293 2730647 2641747 2587522 2586088 2621749 2670528
12311 2670528 2739748 2803262 2883894 3055352 3237648 3382570 3667708 4043358 4514966 5090293
12301 5090293 5743830 6366386 6864252 7281648 7652601 7997845 8342582 8837492 9527395
12292 9527395 10446345 11433231 12371620 13197199 13892402 14512906 15153945 15814374 16331254
12283 16331254 16730502 17081892 17526145 18188947 19161957 20543087 22604273 25659532 30263065
12274 30263065 37280281 47802416 62827393 82231528 102719589 117401133 120574098
12267 120574098 113194276 100534162 87125034 75500451 66696786 60718940 57102395
12260 57102395 55053827 54041239 54028548 55158727 57640239 61333653 65592475 68989511
12252 68989511 70560279 70628609 70252457 70358672 71263653 72828737 75194287 78955976 84074739
12243 84074739 89110727 92568958 93803508 92971480 90724446 88063540 86180232 85880306
12235 85880306 87330318 90412258 95347083 103527401 117804352 142402948 181879076 236206059
12227 236206059 291775102 324061473 320364324 289976413 248849560 208058540 172968188
12220 172968188 145226744 124568115 109680467 99399294 93084030 90276583 90418380
12213 90418380 92604613 95470619 97233459 96369905 92885343 88047972 83185043 78817889
12205 78817889 75195768 72574331 71337051 71500827 72223484 72134204 70383797 67214156 63577719
12196 63577719 60336313 57830844 56219276 55471931 55295102 55467514 56401146 59217107 65411041
12187 65411041 76660230 93543829 112850953 126853280 128993911 119662857 103738519
12180 103738519 85940644 69227689 55044931 43918302 35634230 29666868 25404889
12173 25404889 22442036 20459117 19111840 18283935 17760279 17284027 16787174 16216543 15673087
12164 15673087 15153747 14520362 13753492 12782494 11693069 10675001 9832613 9171055 8664064
12155 8664064 8281540 7887419 7462324 6918079 6298010 5637571 5036458 4521699 4087995
12146 4087995 3720701 3444692 3252021 3087463 2982635 2930888 2919382 2873535 2836439 2816158
12136 2816158 2806205 2847052 2979053 3099553 3238167 3348513 3412308 3349371 3240865 3098332
12126 3098332 2975609 2812691 2680499 2596754 2518280 2478709 2432478 2427321 2475280 2557576 2651235
12115 2651235 2807425 2975967 3063593 3077255 3041809 2902754 2662536 2390508 2131424 1812455
12105 1812455 1549252 1413495 1356606 1331222 1293101 1277260 1263124 1261601 1284581 1329865 1322493
12094 1322493 1294817 1297893 1291954 1257949 1208032 1132989 1057533 959929 900819 869107 810878 755775
12082 755775 730935 747344 763845 739268 696862 694255 670949 674180 675192 697343 687880 630202
12070 630202 562976 528840 494470 468088 452233 429678 429508 446999 439369 422756 440995 446892
12058 446892 468698 518800 570787 581166 563931 521025 510417 475059 434042 431889 416319 400151
12046 400151 389793 402243 439232 419159 392531 385187 356704 329602 351349 346410 300612 295372
12034 295372 293883 299630 326466 346816 342744 341202 320449 325447 332772 351186 372703 362558 335813
12021 335813 329634 286589 307148 333893 359393 324248 303685 301138 282536 286144 306167 333322
12009 333322 310588 259234 253779 262250 278535 274002 255747 258022 249041 226748 211208 203514 218046
11996 218046 224355 226021 245085 255422 254148 258033 275743 294191 263380 260612 272644 267756 234566
11983 234566 237526 246636 253970 264041 248507 226937 197671 217843 227608 218308 198726 219859
11971 219859 253751 260134 247466 265003 251280 225791 211890 195234 181047 195830 211871 197517
11959 197517 205208 218502 205179 191164 185876 195498 174178 150525 139050 128570 110506 133944
11947 133944 198895 247135 306223 312736 281079 269086 278909 234028 206228 173840 180425 180471 210097
11934 210097 195446 164210 190052 169402 181765 190911 180504 175544 115530 129462 153998 170163
11922 170163 170484 175076 193382 267929 265889 230350 212111 210429 230542 217090 185344 173191
11910 173191 184557 194137 168132 168851 175258 188809 298079 460456 573461 583469 548783 498763
11898 498763 440702 403751 369254 351982 308525 305964 285661 267840 288584 294273 260033 217246
11886 217246 205194 238428 253840 230632 214151 218488 270934 324746 345259 314896 281850 262813
11874 262813 243216 236831 219498 211700 161777 166591 189131 206135 200111 189061 219044 234120
11862 234120 232230 271839 327262 345589 299780 267963 259041 249139 215046 174079 172465 170622
11850 170622 193976 202103 165244 156361 166391 143078 131850 120143 127560 115553 126471 111258
11838 111258 127589 154378 158957 155529 200274 228554 218257 200880 227909 263829 274853 283980
11826 283980 313770 328134 337665 357282 390826 477171 557044 607943 652971 669731 645585 575339
11814 575339 513485 477610 461173 403937 343316 331072 375541 402581 397694 349641 342367 343782
11802 343782 307871 274871 286530 356167 390318 439004 504913 518830 518225 555504 612362 626006
11790 626006 610466 585767 568547 557505 535483 506526 518738 531998 576960 648291 787527
11779 787527 972876 1156638 1375639 1600429 1712110 1677704 1536750 1359934 1189500 997545
11769 997545 810277 670757 584006 500429 445763 437561 449313 460903 427850 418768 433295
11758 433295 450932 432832 438134 449703 451878 453946 443157 422330 366788 333972 362778 398010
11746 398010 418992 427601 430868 410655 366956 368918 390638 414619 443340 491494 568593 645695
11734 645695 698266 709362 715553 680240 583171 516022 440397 349452 273027 201591 170277 172590
11722 172590 177189 183125 167951 153293 169433 173306 154362 138758 132405 157533 166644 147952
11710 147952 151804 134865 135086 132518 116121 95587 61339 50586 69328 30789 3893 20692
11698 20692 51255 73588 93042 110118 127903 122648 101949 80578 79701 81320 85074 80740 37260
11685 37260 29290 54521 89930 98231 100897 72771 39636 38209 21705 7509 49450 41839 29398
11672 29398 51925 43195 66894 72596 33626 12039 40503 69633 72096 35004 18951 24128
11660 24128 52411 48965 100496 75951 25787 20778 36541 62146 58447 57807 32222 36008 27751
11647 27751 36755 33352 39668 40367 63463 91544 63839 13542 22484 51147 62949 61303 75956
11634 75956 60832 60992 91609 50505 10350 3525 -22949 -29588 -5108 21106 11138 -10364 29177
11621 29177 62303 50741 18562 22569 2848 -10938 4349 -4281 -8365 27371 29408 38393 46877
11608 46877 75239 69385 29470 -8543 -12822 -2988 -4661 6179 -443 37569 32961 30650 48757
11595 48757 65575 53174 21393 -2309 -15178 4241 -6799 6444 15625 13365 23958 46971
11583 46971 46767 48506 12758 -33488 15607 48775 51519 64811 64313 53597 62746 34866 68870
11570 68870 60123 43729 53883 43844 27724 38477 79687 97471 85400 56467 49084 67076
11558 67076 65458 48786 51161 38291 27702 13506 20915 13313 15919 14013 9782 23036 19248
11545 19248 26046 29131 6027 -12085 -1654 24451 24219 16093 7080 -13484 -13851 -10179 24920
11532 24920 37995 48016 61365 28167 -3011 -21981 -50339 -51373 -21593 7980 22658 55984
11520 55984 78875 93663 63315 48844 30861 12547 33913 44871 45731 73377 111360 121140
11508 121140 110798 65610 45017 31412 41454 54250 58562 52199 13895 30519 50104 36203
11496 36203 36091 41025 53585 66004 26728 -12413 -20923 -13372 15622 8604 9406 35825 49823
11483 49823 29275 14329 18033 15798 9930 23171 70005 96689 120532 150505 109406 82494
11471 82494 99358 84758 17146 -18980 -29345 -9029 8853 -28919 -48533 -34900 -15896 6615
11459 6615 27315 8850 -18870 31860 51145 60803 81231 82575 76741 33297 35197 72125 108939
11446 108939 56030 23822 18857 3471 -2258 45818 52752 71978 81019 103427 77108 30028
11434 30028 21865 -6181 -4261 18644 62650 83336 85778 55981 14785 33951 41705 50144 28044
11421 28044 -20549 -57609 -56191 -10517 9462 24432 26512 22510 35264 48265 43936 34288 10479
11408 10479 -5627 4194 34090 61370 73405 82764 43275 5101 13932 -30846 -58621 -19076
11396 -19076 -9280 -11779 4718 22840 18604 33102 34201 42850 80106 63674 72901 77130 31593
11383 31593 -15580 5064 28647 54429 64097 33116 33535 35082 53744 18799 -8062 2927
11371 2927 -10210 -13709 -9014 -18906 -23400 4702 5323 31 8707 28766 45198 43265 30868 2177
11357 2177 -6465 -11530 -46758 -7375 56240 23743 -25193 4943 37725 34157 32986 10147 -3144
11344 -3144 -2910 -2155 -6733 3903 23575 30240 36635 44210 40827 3183 -20885 -26416 -21991 -2334
11330 -2334 -24450 -36338 -17735 6755 34554 53634 58264 44529 57701 51494 24228 34323
11318 34323 40722 55853 67686 46801 6871 -6577 8855 10309 26783 56161 76214 98869
11306 98869 60041 66335 56333 51507 82012 68638 54637 43332 49135 46022 23023 33076
11294 33076 43428 54222 59080 41898 9332 15477 55673 40432 19168 -25924 -11677 15255
11282 15255 7847 874 36922 45915 39356 24975 33082 64720 91608 49858 30747 -2723 -9512
11269 -9512 -12494 -25233 -21948 -12560 1660 -18823 -30130 -33055 -16903 -3381 16264 23766 8669
11256 8669 10515 1300 -12191 23422 30507 57139 41664 1645 -4858 -3468 -12042 -4288 20508
11243 20508 35283 10073 28424 73781 90325 99400 74878 46356 27051 32142 36192 34736
11231 34736 17130 17664 25372 3167 11928 45070 44582 45730 68542 89392 84929 59149 87866
11218 87866 85587 70589 102925 85217 52873 49028 53869 44761 58484 60308 59058 54787 29716
11205 29716 16309 59949 50529 49654 54789 13416 -9344 -20521 11024 46968 88965 59296
11193 59296 49311 32342 56043 33631 27205 28063 67967 34308 49526 45748 21059 14557 5842
11180 5842 39241 51123 66725 51460 30455 13107 10517 13977 56964 77903 63423 72542
11168 72542 47797 53730 72464 101383 98996 70459 56858 50441 62131 24819 43797 47462
11156 47462 26356 21194 2603 -12101 -18985 -9702 -8874 -19394 -15461 5096 -515 -3019 -19221
11143 -19221 -10139 -12593 -7405 -1209 42975 39655 18835 41758 29833 -11541 23907 54261 54958
11130 54958 31090 24808 60354 58000 43147 13658 37687 51825 29451 10082 26283 56653
11118 56653 72410 96254 85446 56054 85785 75592 63587 65051 57115 22345 27641 15540
11106 15540 14191 55277 67108 77310 97191 64471 32154 -775 -13381 2005 50114 58185
11094 58185 29713 13344 20655 33516 47769 60515 107993 134439 126939 87356 76145 84746
11082 84746 86915 90992 104568 76261 56964 47456 59147 29973 53139 88371 89681 94040 77975
11069 77975 51963 61593 45818 46237 36776 51394 91070 87866 56249 65636 100048 74210 75100
11056 75100 109266 115198 122449 99581 107485 126499 147122 128146 129953 154447 137449 111188
11044 111188 107419 102988 91012 78954 60345 75446 95107 60788 45612 28119 -10310 1897
11032 1897 54726 95870 61993 19789 6283 -10 18954 38047 51491 68751 76860 105921
11020 105921 101901 80189 97114 92768 88495 71465 49515 77872 80802 60028 53631 73848
11008 73848 78725 39774 44167 73146 78607 64677 65099 77134 67456 71453 117074 126967 92319
10995 92319 79028 104983 127030 136869 77539 53835 63394 44580 55502 57188 63417 68684 78995
10982 78995 99839 121824 143169 122246 76508 102107 140463 133140 172148 147112 134511 112357
10970 112357 95299 91859 104017 95920 72978 65520 48620 87041 144334 141080 103493 81059
10958 81059 87978 132054 157613 162022 143422 143182 160463 154940 146238 96172 95045 97836 102688
10945 102688 100456 120813 131532 148091 146742 110173 93414 93271 113480 139542 174301 184674
10933 184674 162245 190477 188976 154962 132738 122764 115358 108183 132539 127732 86706 58991
10921 58991 92295 129434 113255 123640 121898 133020 155216 147314 132541 109446 103687 124397
10909 124397 139788 126717 144468 176108 199197 185949 184064 215279 224500 199359 195590 194769
10897 194769 184200 168127 151827 151497 157373 179915 184820 201848 182879 182649 209686 232428 224750
10884 224750 175162 174220 199023 243309 240071 219636 218462 224781 242538 279865 259081 226127
10872 226127 220578 234173 217047 219516 240069 247266 244991 231155 222239 239596 233212 201436 182418
10859 182418 189134 214141 207064 216686 222549 264542 266386 256175 246895 266577 313927 293680 251142
10846 251142 219508 254928 298370 326954 357580 385513 400290 348698 304888 324122 342728
10835 342728 358627 366589 373557 339813 317584 326836 307933 333083 335836 320801 335757 333495
10823 333495 357591 408257 413896 401264 411889 384620 365044 382146 402947 441307 468256 474437
10811 474437 469642 458348 484517 497185 509297 472343 428510 447233 466078 440621 435442 422008
10799 422008 399827 411981 435541 484850 495731 463201 506268 522282 538957 536599 519886 509554
10787 509554 561236 606279 589555 568217 546674 537009 554910 572769 599158 585384 546931 534343
10775 534343 537037 568141 566663 564254 587157 610970 602260 609929 654719 673322 679681 687423 691270
10762 691270 674520 660547 672192 678489 717166 721997 723344 735625 756985 781383 795014 830310
10750 830310 837323 857372 877916 884633 862162 837033 838361 836400 834717 878675 903503 910855 940984
10737 940984 952084 954025 981614 1013963 997494 984132 958264 955696 958940 991469 996409 1017572
10725 1017572 1068076 1076498 1093318 1102296 1144804 1162556 1209700 1231958 1197582 1206391 1244451 1219610
10713 1219610 1253793 1241480 1230872 1249788 1309434 1366457 1391670 1367309 1372392 1430379 1483227
10702 1483227 1538873 1515878 1514982 1548508 1565484 1580596 1644257 1674946 1691004 1704960 1732768 1743528
10690 1743528 1759048 1815707 1880032 1954659 1992786 1992027 2019489 2027599 2060421 2118513 2167192 2220796
10678 2220796 2276646 2284030 2306520 2320842 2347357 2370773 2430047 2525472 2623395 2652805 2673376
10667 2673376 2724038 2808952 2904002 2976445 2986812 3016021 3138388 3229124 3291822 3310935 3355846
10656 3355846 3440249 3564296 3633767 3689773 3765123 3859355 3977366 4028309 4090400 4198002 4305514
10645 4305514 4402186 4488714 4600098 4717803 4825086 4910406 5048311 5175366 5285534 5397999
10635 5397999 5523749 5659395 5834921 5981280 6106233 6263477 6474652 6643788 6801082
10626 6801082 6987042 7146862 7308439 7493420 7699250 7892088 8063884 8257329 8482479
10617 8482479 8741976 9023566 9299699 9552202 9790300 10045122 10289418 10593678 10863969
10608 10863969 11188182 11511347 11841952 12188087 12512394 12863277 13217831 13591234 13962313
10599 13962313 14371579 14769213 15140956 15519382 15924957 16337897 16694789 17090965 17502947
10590 17502947 17931957 18376318 18785390 19168513 19566365 19933794 20247545 20627394 21036008
10581 21036008 21385218 21658236 21945106 22230436 22480337 22696313 22878650 23040230 23174398
10572 23174398 23321034 23406977 23444321 23454506 23475124 23455194 23371990 23261094 23121037 22952865
10562 22952865 22776366 22545307 22288859 22016574 21742654 21455115 21127979 20777885 20458926
10553 20458926 20090964 19743581 19380157 18991161 18619037 18227493 17812453 17385828 16968372
10544 16968372 16571174 16219173 15874703 15511994 15116473 14755682 14371554 14056242 13758008
10535 13758008 13400269 13061982 12771985 12450758 12109565 11804614 11508135 11234523 10986170
10526 10986170 10728894 10497891 10262791 10026145 9767006 9526648 9338987 9125005 8886950
10517 8886950 8689500 8480556 8288146 8082699 7915585 7770256 7603820 7447806 7278212
10508 7278212 7090950 6952187 6803938 6649181 6485453 6363834 6212485 6078229 5949537
10499 5949537 5824535 5714367 5635566 5562558 5447985 5327306 5232483 5165814 5062934 4959659
10489 4959659 4869395 4810495 4712639 4617232 4536562 4427415 4334476 4270798 4216753 4148480 4109957
10478 4109957 4017468 3937463 3872153 3788443 3717728 3673333 3628631 3560179 3508639 3451880 3396734
10467 3396734 3337193 3284139 3239066 3178501 3158928 3130765 3097425 3021258 2984512 2931971 2904786
10456 2904786 2845639 2779495 2746815 2706374 2691293 2682258 2682031 2610118 2533453 2519498 2487099 2425194
10444 2425194 2373733 2350028 2351182 2355544 2354932 2321069 2259879 2224936 2206519 2158701 2125003 2103008
10432 2103008 2100400 2130569 2133831 2087398 2051581 2028578 2035701 2018198 1984923 1968424 1915495 1880729
10420 1880729 1841714 1825486 1808127 1794144 1756875 1763656 1776307 1749694 1725870 1688725 1714482
10409 1714482 1720853 1697527 1663182 1635367 1613007 1598020 1584166 1544829 1554135 1611561 1628252 1573436
10397 1573436 1502672 1465483 1436808 1435856 1463809 1429693 1400171 1397961 1367878 1351912 1349718 1349050
10385 1349050 1314235 1301912 1299529 1255740 1247999 1244796 1251033 1236039 1221620 1249121 1224624 1208309
10373 1208309 1219364 1211499 1180012 1156368 1160393 1144335 1113918 1121348 1148641 1154838 1143071 1139978
10361 1139978 1093487 1070882 1045159 1034172 1063992 1063056 1072941 1066372 1040237 1032552 987895 955619
10349 955619 987050 1033311 1067567 1028159 1002283 993479 973478 971765 968872 972860 947762 937061
10337 937061 912533 871999 899692 895964 904618 913472 891669 898740 936347 913070 912568 934811 934979
10324 934979 924804 940185 949768 926629 895337 927592 924907 891048 862512 843984 854585 825528
10312 825528 807409 780617 785122 787971 759092 761660 811669 829819 822681 837677 825418 804275
10300 804275 792861 800577 787826 749655 712722 725134 734509 741027 703713 665071 658147 695610
10288 695610 730029 759148 789611 709961 654812 672522 712803 694246 648402 604538 597364 598224
10276 598224 608631 652908 642259 613017 577534 578527 611982 629171 634105 648417 650585 654775
10264 654775 639997 636812 652833 666228 686053 661483 652615 658309 647588 637477 637545 668627 695182
10251 695182 659934 640206 652726 680163 674292 654495 625575 636826 650114 655361 617121 585062
10239 585062 580946 592633 614125 630533 621246 546849 512292 542387 596751 579023 600983 649479
10227 649479 665976 655700 627555 597892 626258 662168 627586 599240 570104 567828 572424 570600
10215 570600 572581 575348 570367 593554 601483 573841 545542 535730 539345 539025 535494 560594 589530
10202 589530 569312 552170 569374 574659 567765 576351 605923 589639 535651 496421 514120 546376
10190 546376 558175 558015 559143 557144 556168 552397 578395 596456 597895 626191 652520 663561 656453
10177 656453 647434 679031 695330 652999 620289 555137 545304 562485 560129 552871 544277 549993 564939
10164 564939 574108 559427 553472 557105 534979 484632 484143 502753 491222 491011 472683 474753 503871
10151 503871 533468 521438 515990 540587 548003 535636 531101 542183 607594 626363 647511 731310
10139 731310 836266 970266 1088971 1167026 1253381 1291098 1308793 1316174 1272861 1173335 1073285
10128 1073285 964718 842328 770741 688320 618909 584822 573039 586067 582198 553110 561587
10117 561587 567415 500875 484874 536031 524969 497244 490589 524710 536484 530223 552101 573671
10105 573671 556454 575128 607105 618204 634948 687848 742082 821483 890261 979539 1109133
10094 1109133 1238364 1368887 1527190 1664954 1718088 1757494 1728670 1618512 1454819 1263743
10084 1263743 1114974 1016655 897937 780621 681220 630865 609543 604512 581931 535800 486681
10073 486681 487629 503156 525494 531446 516768 502779 500978 488878 501660 509188 495802 502905 509016
10060 509016 495831 458076 498661 531812 580133 635429 690259 772139 808226 866857 999277
10049 999277 1186108 1300222 1344162 1326039 1236076 1054038 902023 787982 669642 597052
10039 597052 572561 533252 509190 512071 470842 436790 442024 465067 457561 442476 386927 352958
10027 352958 357627 372150 351953 318596 296269 273347 248010 263303 281094 260118 266856 252289
10015 252289 256787 298119 337199 364477 403833 402874 441374 482756 539764 525862 534247 508723
10003 508723 448870 372880 279210 166624 99388 116783 146918 172696 259918 316096 341391
9992 341391 358542 329733 338225 364063 339543 326175 326589 359702 376311 351071 300695 282190
9980 282190 291569 296755 322465 365539 411221 431773 449139 443948 438445 422701 427202 439317 477635
9967 477635 474027 449623 424144 436403 448880 393118 360374 372665 374076 361959 354833 348985
9955 348985 339297 359451 384416 406369 445420 507276 545826 564240 557161 527958 529116 511101
9943 511101 492406 495395 475063 439767 439851 465884 493433 480202 490697 551482 566465 589382
9931 589382 592345 587168 604441 609911 604558 593303 576195 540579 485958 462662 505941 544504
9919 544504 508096 503273 486416 449260 439425 451464 456757 470202 488083 542628 564360 576900
9907 576900 576936 568575 569215 535096 516047 497075 484510 507383 521523 488568 469386 503812 502165
9894 502165 466112 449372 480279 535507 559153 557637 542926 533047 511411 530515 608245 652506
9882 652506 649550 613226 601267 566666 547368 533534 560902 527093 507114 473916 469364 480995
9870 480995 481103 470944 480363 523362 603790 641262 646238 648035 659145 673301 650026 647078 598369
9857 598369 603145 613070 628478 624934 595996 597298 604730 603561 603081 583274 546454 528096 569050
9844 569050 603116 649195 672521 682286 753097 816752 799262 782239 775667 821626 815989 778334
9832 778334 761892 788157 765796 723703 679837 688916 710202 736148 731416 746488 792053 836085
9820 836085 846068 847041 858234 902824 934613 966865 998562 1030005 1079637 1076285 1089266 1066389
9808 1066389 1021067 993658 977539 997975 1020008 1023419 1034531 1091501 1186036 1314160 1452645
9797 1452645 1616553 1742619 1884651 2059764 2219788 2380653 2579449 2799500 2952221 3116904
9787 3116904 3244793 3330203 3438140 3551153 3799022 4082356 4250826 4310668 4362039 4397709
9777 4397709 4379726 4283571 4169871 4024460 3895721 3774475 3669803 3573529 3497504 3501027 3521115
9766 3521115 3612311 3794387 4152152 4632647 5281462 6213108 7396792 8627414 9619101
9757 9619101 10239652 10534989 10619345 10536590 10274022 9845783 9357152 8827764 8375330 7993440
9747 7993440 7701437 7445999 7215687 7091669 6998080 6987382 7026808 7114314 7290792 7624049
9737 7624049 8128935 8766549 9503909 10308003 11175543 12079475 13030857 14067314 15284322
9728 15284322 16748189 18666311 21338888 25092880 30297255 37634074 48028397 62606227
9720 62606227 81890877 103667709 120899149 126526167 120806200 108654304 94189985
9713 94189985 79966711 67465791 57488962 50200064 45334532 42670624 42118715 43569457
9705 43569457 47100186 52929858 60804690 69669624 78564869 87064167 94479687 99986974
9697 99986974 103865112 107341453 110496314 112336358 112410331 110787445 107118820 101367668
9689 101367668 94793850 88940510 84209952 80349127 77463168 76296725 77866038 83141936
9681 83141936 93682528 111964132 141040955 183636990 238853679 293394552 322252530
9674 322252530 315448732 284690411 243535326 201459829 163738550 132812029 109508081
9667 109508081 93267756 83018184 77655540 75929644 76616660 79159899 83509761 89095610
9659 89095610 94879001 100196208 104626839 107499462 108154128 107471801 106791222 105799729 103176397
9650 103176397 98159421 90573454 81022394 70892517 61507045 53590810 47319379 42744311
9642 42744311 39947036 38891500 39659583 42334919 47295361 55177886 66729274 82125182
9634 82125182 99682748 114153477 118913913 112423354 98916947 83008981 67580835
9627 67580835 54024922 42875594 34244502 27782612 22982555 19487683 16933132 15070364
9619 15070364 13604124 12378712 11344466 10489008 9773891 9072838 8396011 7742060 7215770
9610 7215770 6773197 6477020 6296520 6203516 6221888 6256195 6337167 6471478 6672770 6906690
9600 6906690 7257451 7774119 8397083 9000845 9500333 9877832 10126962 10160409 9831310 9081038
9590 9081038 8043971 6993839 6067687 5307007 4699888 4207668 3839520 3606988 3408602
9581 3408602 3229785 3163654 3198223 3252466 3340420 3455747 3584920 3737444 3862007 3952690
9571 3952690 4030813 4098748 4118221 4066332 3933769 3767574 3610855 3442798 3294775 3219961
9561 3219961 3166162 3093115 2891132 2652259 2476827 2308372 2142406 1997597 1855017 1710048
9551 1710048 1643333 1580627 1576983 1618867 1676335 1683997 1642438 1554835 1491646 1449569 1427517 1400694
9539 1400694 1331128 1300111 1265855 1219887 1200830 1172516 1158323 1135256 1149689 1125840 1085811
9528 1085811 1084515 1128088 1149283 1101879 1074614 1055668 1060087 1063310 1009705 984567 967380 969410
9516 969410 986461 960994 960347 929506 921139 874717 853260 874471 857972 892739 905007 894675
9504 894675 902501 947929 949257 962288 982023 988698 956984 932248 903943 915672 899620 870797
9492 870797 855583 840510 821120 821477 822619 775743 788906 790477 776956 797720 790781 814305 807314
9479 807314 808621 788463 815540 826578 803329 785442 774017 780203 804334 789642 732873 691783
9467 691783 708959 749380 754033 752272 741135 719468 702515 700789 701464 689197 697575 702188 700266
9454 700266 710484 720285 719015 713073 685171 676874 649344 634226 642640 615118 576342 531252 539728
9441 539728 584221 634100 646777 657565 651598 628873 619531 638919 642391 621118 626040 613710
9429 613710 625928 616617 613073 663922 675798 657088 621259 577621 537115 529379 533307 556305
9417 556305 556259 536629 492128 459226 479508 483429 484627 505778 468213 475582 506517 517967 521045
9404 521045 535486 540972 536501 563426 576057 523532 492759 517133 587032 609439 662278 662309 647506
9391 647506 626262 609458 606257 562243 547003 549144 536541 539277 529442 535353 519251 491203 507152
9378 507152 551100 558381 556263 607942 640353 584296 581607 595997 592148 575032 571102 565581 539473
9365 539473 554161 574093 526195 484014 456352 481022 488430 505527 514231 535848 599648 663239
9353 663239 775588 904620 983544 993265 978090 956760 908511 864927 842742 840913 824813 834210
9341 834210 801197 781815 798145 810707 799058 785895 776405 793769 800306 776450 737852 710357
9329 710357 670802 658598 650549 612423 642571 634099 602453 608369 623178 622390 626844 607247 608992
9316 608992 584843 592999 590211 592737 631131 652139 654722 698380 748248 762252 766562 772471 798281
9303 798281 824291 880146 984805 1154965 1317941 1460789 1543534 1579026 1552451 1466951 1328971
9292 1328971 1204481 1119239 1044167 995027 944730 904228 920108 943313 1015954 1143910 1308532
9281 1308532 1548820 1825075 1935215 1888754 1715035 1554832 1398558 1256792 1121321 1037475
9271 1037475 998935 958286 973807 1048745 1179157 1346089 1514217 1646754 1770606 1887677
9261 1887677 1946440 2003980 2125047 2276538 2437827 2582907 2678673 2703823 2695859 2642860 2573966
9250 2573966 2481416 2405454 2322090 2309644 2536968 2965905 3451082 3955182 4198416 4018109
9240 4018109 3593357 3103280 2653196 2219082 1877112 1680383 1541286 1447693 1359670 1327662
9230 1327662 1310655 1311661 1359952 1400619 1460209 1538143 1616676 1719466 1787037 1779168 1703391 1593958
9218 1593958 1450805 1349695 1309891 1311247 1370506 1456294 1514327 1546890 1627355 1719568 1920326
9207 1920326 2117981 2252032 2219215 2060529 1866877 1550672 1254823 1033531 864335 739383
9197 739383 682314 622616 546034 484499 449259 431214 383331 354327 355454 352795 340802 347125
9185 347125 354861 348144 342735 308616 362252 397019 346306 299711 313759 315294 315605 308983 318861
9172 318861 358126 383161 356499 402790 435747 461273 465931 454325 465699 440617 382617 369957
9160 369957 342541 332209 300097 291734 286912 277054 276922 297412 285413 241999 237231 233490 277719
9147 277719 332861 326902 293666 271248 290139 288743 276340 241159 225302 272747 227784 212997
9135 212997 219324 206002 154780 151280 156331 157335 178521 173044 199562 193267 190694 177821 201103
9122 201103 191251 172313 174773 186493 222826 193679 174348 202815 220134 228306 210871 149979
9110 149979 103302 109080 158021 187627 226930 195351 152597 150707 119235 55625 64819 102471
9098 102471 138882 136217 151948 167135 165027 155428 104275 119555 122646 122783 125963 129889 146107
9085 146107 129914 115633 104177 81645 106193 100883 98826 79643 92257 117620 134359 118525
9073 118525 114523 143625 130724 94358 100957 123735 86463 89664 107041 83270 91969 154737
9061 154737 158620 130361 116973 120591 131927 158082 147540 119234 149147 114463 95308 122239
9049 122239 105526 96628 77042 97013 83441 80166 87288 82882 109559 82953 63093 51721
9037 51721 46095 66562 80674 59093 63862 63841 83784 88088 83693 88891 117180 112195 92268 56379
9023 56379 56474 52033 66578 72856 84578 91386 87022 58943 20188 13271 58938 94405 85806 108645
9009 108645 168071 153852 108820 107015 92825 82911 108027 116862 75878 54935 91114 92700
8997 92700 72021 86362 83102 88841 86340 61732 68156 54298 39265 -6973 -9003 25948 32893
8984 32893 11549 28969 45580 59600 60018 59952 73108 82327 79235 79345 65542 79723 78153 87836
8970 87836 79248 34992 27696 27125 9691 43205 57823 39992 26296 7398 18489 79777 115048
8957 115048 107492 100287 122450 158794 158566 136813 152019 141996 121009 103153 69879 80194
8945 80194 123874 134652 105127 59992 31102 35499 39710 59820 47965 15958 39614 54224
8933 54224 47060 65801 95649 85211 73410 51651 60787 65542 34132 68061 89932 64256
8921 64256 19083 9487 30501 53567 55482 76225 59855 47173 52566 64341 88662 85361 79539
8908 79539 85292 75710 79734 110530 95579 41426 62429 68650 42627 49982 30909 -14641 -20262
8895 -20262 22329 21146 9518 15858 -3979 11337 -1056 841 31510 60495 74725 123718
8883 123718 117490 105564 66281 44016 53599 84204 93589 60910 71724 100150 99721 91530 116913
8870 116913 183529 245593 256443 205843 179761 155132 138088 128112 102941 96898 84961 78174
8858 78174 84244 108662 153459 129319 107287 102116 86803 83003 79076 44660 43977 79386 81988
8845 81988 98307 99544 95599 118441 108795 78883 102327 91210 67616 60224 58977 62664 102711
8832 102711 158227 155089 129973 145782 196144 271166 355130 487388 611969 599067 501212
8821 501212 416339 348611 323194 269925 221997 175662 112593 117317 78915 86071 113551 123283
8809 123283 103992 78473 64714 50927 67379 70379 76220 76612 84277 86819 85182 74148 69521
8796 69521 103001 139486 143868 132821 134949 149087 114406 97744 102873 84723 91596 109972 153895
8783 153895 140308 120939 164832 254030 322836 288004 243051 205466 179364 144844 110052 92491
8771 92491 77258 71783 76391 69581 46906 19277 26017 44208 62584 59077 79665 79644 77732 68399
8757 68399 60797 49098 73608 81718 93701 115101 112707 75353 58866 30477 20638 7013 16700
8744 16700 18863 49512 51792 32577 21101 3718 2876 3996 -11154 3172 46615 75711 97684
8731 97684 105140 111844 64554 10365 19380 22149 25489 59576 72441 16395 -35348 -19412 -8716
8718 -8716 12006 16603 33959 42406 72238 81548 64047 41850 6931 -1568 62333 68581 62692
8705 62692 93270 100341 99629 79985 62724 63013 47081 11545 15746 33873 69108 73495 79908
8692 79908 50306 81876 74054 95223 110081 117340 107175 92537 99520 119702 93749 47780
8680 47780 44242 47745 59942 40410 27386 40896 81724 98855 69829 22621 26930 69432
8668 69432 59918 57926 35205 44438 56179 72775 116391 91568 44242 12939 -11096 30078
8656 30078 63402 97936 111446 113792 90802 81535 29893 13560 18120 30386 47577 70927
8644 70927 82582 81970 91237 110101 103880 115693 103234 88873 120890 127605 131361 139964 158512
8631 158512 163899 118199 91949 77431 42760 30863 69409 95441 87159 45849 17746 46906
8619 46906 91209 158603 175645 132825 119739 136836 138152 148609 162713 169001 204438 207754
8607 207754 201749 198622 200144 212376 195451 211043 221083 220455 223930 202641 169793 148604 106002
8594 106002 53700 78741 132337 156206 175562 161532 144429 116885 116103 176215 198048 166106
8582 166106 115176 110492 109176 134055 129232 108174 112707 94925 74375 81908 53959 84242 115803
8569 115803 103437 55216 40372 45686 12515 24687 61817 55237 17573 -12878 9544 17928
8557 17928 23527 30506 72279 88798 84914 42874 12088 7403 32786 23861 -1810 23847 77270
8544 77270 67491 38854 36832 57880 29005 21294 12577 8505 40688 49430 7380 18028 26414
8531 26414 45366 53893 51563 70155 46117 45735 41922 49220 26358 29199 27671 -2117 -14028
8518 -14028 3170 3296 7910 -7686 -16016 -15392 -8117 -6667 32325 46748 47109 48587 70889 88066
8504 88066 70824 53471 39332 22755 657 -22137 -3848 24495 59888 71806 44474 49213
8492 49213 74357 92128 98489 104656 51360 -381 -10294 7574 -8528 13961 27733 51536
8480 51536 47938 35634 39847 36407 50850 54798 51568 28658 46070 53237 62502 34458 44333
8467 44333 54873 15899 26299 19821 36833 40387 12818 1235 9215 -231 4304 20073 8500
8454 8500 9571 26370 30146 10816 -24297 -42649 1164 29706 15241 -3434 -14854 -293
8442 -293 19432 30656 5505 35025 24699 8366 -21934 -58782 -38175 -42041 -44039 -41943 -21780
8429 -21780 -9363 -22129 -10725 -29309 -14044 22540 41760 21328 7119 -14901 4236 44892
8417 44892 82081 75615 14505 -36808 -31699 -22131 -13180 -1444 18416 24734 14988 25625 19190
8404 19190 -26678 -51347 -63247 -55143 -64572 -63132 -22870 20738 -26434 -7531 17314 21344 31696
8391 31696 34530 37120 27712 27693 36243 87338 80542 19213 -24992 -36036 -11978 51084 25310
8378 25310 9938 -7258 -11764 -67035 -81758 -39326 9237 14371 -15361 -22932 -27375 -13736 -863
8365 -863 -6152 12487 -1040 -21651 -18422 19828 45999 15913 -23858 -43813 -54397 -10930 14354
8352 14354 -28173 -22748 -13626 -2007 18380 26109 51775 38772 19165 -7709 -1982 21832 33661
8339 33661 44029 -7163 30443 96178 88808 32825 1427 33377 48613 16997 24476 26226
8327 26226 35426 22219 19749 30617 32146 51402 40341 24266 36980 41861 38911 62236 70916
8314 70916 39581 5595 9619 53015 62293 63170 41372 27301 11624 14396 45619 40792 15255
8301 15255 11123 12881 -13303 -10609 24040 69101 80114 43778 -3680 -40480 -31540 27850 32603
8288 32603 -21062 -64199 -47450 -31872 2610 32399 15370 -7385 -9404 10519 25063 16051
8276 16051 4645 5632 5104 8220 -13793 -45700 -67517 -65454 -19040 5183 22481 41487 68096
8263 68096 39798 23615 -18567 -22221 12144 2934 25962 52395 50535 26307 3934 11212 42966
8250 42966 37955 6948 -12171 -27222 -42175 -30065 -31925 -14443 -16610 7700 46339 64870
8238 64870 58490 35056 52865 58161 61859 29758 -2341 -6158 1919 32878 15123 12477 15159
8225 15159 16747 27479 54120 65003 31139 5691 15905 25688 29832 -206 -15914 -3003
8213 -3003 8703 19965 52869 32917 28944 43203 34746 54077 22782 15115 33277 11550 -35996
8200 -35996 -17058 9273 14400 15351 3135 -22777 -39309 -4822 17035 23457 27341 -6222 -60154
8187 -60154 -52095 17426 24904 -4136 -8814 -6119 5215 8646 8703 -4353 -3474 25853 19594 24569
8173 24569 25586 40366 7869 3939 6630 -37448 -61835 -27232 7932 44682 29910 -15097
8161 -15097 3844 9429 1374 18475 172 10897 5720 9674 14374 12663 -383 -2294 10884
8148 10884 10988 -138 25681 56810 55115 13448 -12736 -403 23069 38759 38023 18319 26778
8135 26778 -1631 -9172 -18854 -6697 5439 14603 39607 61023 64222 60592 6698 -33888 -49908
8122 -49908 -38826 -29387 5779 16037 -15819 14017 18205 -30656 -27783 3130 -38302 -47519 -9162
8109 -9162 -5391 24311 35684 67705 82542 42028 7288 17982 12497 -18212 -30044 -28754 -1465
8096 -1465 894 -16221 -40905 -20949 -7114 -16625 11491 30044 10151 17477 8013 28752 33363
8083 33363 41788 15904 -21474 -23701 -23217 -63941 -66657 -59925 -43893 6555 44649 28015 37247
8070 37247 49167 48365 53332 41780 12470 -5727 22770 17528 14013 36860 9336 7753 37990
8057 37990 56489 42195 42513 64232 58292 55564 26740 27931 36903 -5722 19484 43873 41624
8044 41624 21440 19948 24734 58774 82314 86484 94752 110408 121529 124027 122177 153145 148239
8031 148239 94671 89800 60288 46775 70734 71732 85449 95366 78938 72106 36222 40467 99955
8018 99955 71717 70644 87763 61565 47418 32401 39286 70456 40035 29160 8901 1543
8006 1543 11400 37109 70862 79636 99372 123209 181679 199170 199747 206918 211939 233437 264092
7993 264092 221317 203123 193922 170775 136942 157001 141526 151750 168707 212512 206112 210030
7981 210030 195837 153500 122750 89347 87787 91541 65338 40632 43661 29044 25671 11497
7969 11497 23521 53498 106850 129985 106760 71515 60516 72088 93473 128903 119843 98170
7957 98170 117089 138979 109893 126708 170203 169266 128013 155533 167275 159598 180326 135681
7945 135681 142197 158991 155805 179185 189629 180145 163871 109698 103264 102755 87240 62399 44524
7932 44524 33411 21698 -3077 12527 12157 -23231 -23091 17155 56340 44737 39788 57565 73563
7919 73563 113848 119340 93113 128959 125310 126986 95688 80455 89227 63948 57139 87273 60046
7906 60046 59433 83366 93572 87809 75572 76271 41461 11847 38548 34777 -31215 -58705 -40093
7893 -40093 -9926 23613 23527 -17382 -32697 -49254 -44551 -37783 -37235 -18460 7927 36768 59259
7880 59259 60463 73685 87026 115693 117600 95224 49884 -2009 -71123 -82604 -70887 -68959
7868 -68959 -56396 -55423 -62296 -63710 -81847 -74285 -21297 -3254 -5095 -2979 16508 23660 42658
7855 42658 46533 60440 47187 39606 12622 -4616 12716 12895 8808 36447 23307 -14524 -53829
7842 -53829 -60571 -48985 -37744 4813 16908 -28745 -198 27633 11160 -14453 -33178 -28784
7830 -28784 4797 -12842 23334 50073 48987 25717 11901 -16174 -41045 -47484 -27264 -14717
7818 -14717 -21384 -14854 -7387 -21458 -27754 -10487 17837 11170 -1772 37187 66942 70927 87183
7805 87183 65002 11925 -35628 -35210 -24532 -25060 -40994 -22459 -5385 11220 35282 53664 57062
7792 57062 63596 58862 48342 49349 46962 27601 2406 -13670 -24345 -32558 -18944 -41194 -73353
7779 -73353 -36318 -22348 9268 -10620 -46351 -55541 -40847 -47505 -33504 -13342 -23477 -13477
7767 -13477 21644 39680 22236 4472 -14797 9983 39108 35817 39893 39342 -4221 -20395 27449
7754 27449 61319 27225 -27649 -42064 -25699 9557 -2956 -32904 -10118 -12695 -7994 8374
7742 8374 3608 12712 -17301 -61384 -24673 -14873 -29571 -37676 -13059 -8378 11106 26433 15602
7729 15602 3353 -8485 -182 -16665 -1720 -21459 -67754 -69783 -57313 -59365 -31153 -53915
7717 -53915 -70670 -61287 -72747 -77215 -61361 -45948 -22048 -9122 139 -32806 -1019 13183
7705 13183 30114 18695 25022 39720 62077 40298 12658 3942 19442 13806 1466 20697
7693 20697 30779 -1977 -8882 -37045 -47495 -28207 -20539 -21770 -9894 1078 -21937 -12496 -22515
7680 -22515 -36884 -47904 -38540 -36549 -35036 -75763 -60690 -55836 -30026 -3360 3703 2995 -10432
7667 -10432 -42551 -51392 -76595 -47269 14255 14856 19386 -10981 -21607 -50715 -87952 -68830 -24445
7654 -24445 -46252 -56532 -38542 -36977 -31743 -23063 -14173 -3499 -19780 35438 57357 42698 50006
7641 50006 -6635 -34725 -40191 -29706 7244 59598 57028 42154 3482 -9484 -28444 -24670
7629 -24670 1060 12618 27731 16539 3578 19398 10422 -17715 -2683 10974 10542 18310 36894
7616 36894 5191 -7280 -15999 14748 13407 25674 40315 42006 27177 -30178 -57979 -88021
7604 -88021 -74919 -23428 12218 17901 -13839 -18541 -13595 -37309 -20428 -43836 -45038 -23690 5694
7591 5694 38217 12400 -6588 -16082 6151 34258 34599 5918 18227 15016 16568 -1027 26300
7578 26300 47407 50116 -1151 -31199 -4656 39228 36914 16438 7420 32777 26741 31741 27133
7565 27133 1641 -21936 -41673 -55239 -30406 -23877 -65456 -59014 -18223 -14459 -26960 -14723
7553 -14723 -1758 -18401 -21394 -9325 6646 -11862 -11014 -805 -27206 -28734 -1108 33904 42201
7540 42201 44634 4677 -23290 -994 15221 25534 1330 18292 38117 7662 -2074 8334
7528 8334 29018 22278 -14413 -28593 -50296 -19025 6817 2253 -18720 -19457 -33418 -11923 22323
7515 22323 30308 13837 355 -5951 10448 18544 3372 13284 6602 29998 11770 10001 23368
7502 23368 -7902 -19510 -25870 22091 61803 83022 65936 33090 4501 -42214 -64101 -61136
7490 -61136 -39816 -41866 -22100 -16096 -40398 8418 17251 9677 -6015 -17892 17001 31191 -5496
7477 -5496 -31662 -44766 -48236 4373 43082 55676 5343 -41354 -9617 -14123 -7804 19433 407
7464 407 -19975 -31027 -31973 -42135 -12596 -97 37964 27318 4170 -5630 -3006 25216 33604
7451 33604 27957 29108 18411 -35493 -27948 -36981 -51892 -24153 -12021 -17696 -8330 -19049 10916
7438 10916 2683 7073 15779 -44881 -41794 -40891 -27352 -43503 -33555 -30717 9314 35895 34271 12553
7424 12553 -7484 -38896 -33563 4444 16726 24766 -11610 -60894 -52533 -40611 -16693 -4252
7412 -4252 28881 33453 9737 24548 34680 28098 1344 6570 13067 42311 45035 35484 9504
7399 9504 -22616 10464 18553 18546 18267 20798 26199 -3980 -51498 -41362 19627 70536 59474 -2479
7385 -2479 -51863 -46835 6036 14052 12168 14521 31951 37872 53597 14417 -31252 -25806 -10813
7372 -10813 19051 25932 1981 -40506 -37436 -31446 -44833 -39697 -19866 -26411 -47097 -37202 15561
7359 15561 25753 13496 21157 39608 19023 -3716 24359 63329 64287 60704 44851 36965 39183
7346 39183 34876 41740 40518 71503 53367 25375 15136 43081 23229 20314 -4616 -25753 -24861
7333 -24861 -52671 -74723 -54796 -22411 14239 48354 35499 3574 -22481 207 9474 -33904
7321 -33904 -44299 -45018 -17188 -4365 -4364 37809 -555 -28079 -63613 -62902 -76117 -65939 -26837
7308 -26837 -4896 20984 14153 26776 34676 47832 20606 -8555 5750 5375 1412 31625 51350
7295 51350 35391 41610 21833 44639 62946 33368 -26294 -25192 3127 43435 34736 43613 61323
7282 61323 40908 1241 980 26353 37574 2706 44750 76392 52173 29732 56448 53479
7270 53479 52572 32998 21041 2384 21897 7104 3837 8343 18981 23223 -11952 -6101 9001
7257 9001 -4686 9298 24081 8186 13268 -28822 -61072 -79107 -64145 -27868 -8900 -1702
7245 -1702 -19684 5784 1228 -2370 -12745 -36658 -27759 2939 -21424 -24252 42403 74210 52310
7232 52310 41404 10392 7677 34292 44152 23815 5391 13491 25110 25569 16122 33458 25697
7219 25697 -14379 -9641 12360 28482 23408 20989 49628 46363 21316 -10086 -17764 -18714 -36748
7206 -36748 -15103 -26668 -41794 -16436 14006 984 7404 -18235 1266 60553 75381 51546
7194 51546 24419 54774 46742 31411 38882 28538 -22948 -43622 -55298 -58064 18511 64823
7182 64823 30004 -839 634 -4889 -23643 -7709 50161 36410 21798 5184 -19285 -5356
7170 -5356 -34171 -19145 -30926 -5961 31052 44405 49814 29951 -10094 -21656 -13193 -13892 770
7157 770 -16583 -44142 -14273 24066 -1562 -33825 -52722 -49446 -39211 -14819 -4139 -34751
7145 -34751 -35561 -52046 -10684 15463 2320 16269 20422 40373 41105 24875 -13407 -24078 -39536
7132 -39536 -101637 -113645 -103046 -82840 -28878 12606 1372 15328 13695 -17248 -55533 -73267
7120 -73267 -89770 -67144 -31813 -37481 -29886 6269 40926 18957 21731 44812 42521 62108 66049
7107 66049 51446 24305 30292 38858 26950 22037 30402 7282 -17274 -27946 -26935 -32169 -49724
7094 -49724 -96976 -54012 8858 -16524 -23937 -27506 -13104 -2793 9366 32051 39917 25460
7082 25460 30359 61436 40882 16072 33847 44427 65534 43402 38805 27803 9361 -13194
7070 -13194 -62339 -99414 -73323 -16372 -9257 -41709 -41607 -36211 -49577 -33482 9501 17883 32548
7057 32548 11921 18 -28583 -59764 -12427 9370 582 8005 1495 -16659 -46394 -11666
7045 -11666 1704 -4880 19196 -9661 -18255 -6880 8384 15587 23301 -10387 -12052 -29403 -41364
7032 -41364 -33340 -10260 -25736 -50939 -56986 -20125 -20112 -15585 21336 -365 -30005 -25333 -18338
7019 -18338 -11940 -24749 -21269 -38117 -21638 -17891 26957 41257 -17854 -19601 -18578 -18487 -12716 -6525
7005 -6525 -12835 -17277 -4642 -5035 -21590 -53154 -48115 -11022 21335 9599 -17492 -59490 -64147
6992 -64147 -47995 -25261 -34417 -11255 3926 23702 43371 48743 50384 38979 3643 -28588
6980 -28588 -17843 -20687 -17795 -35805 -49779 -40589 -15408 -4370 -19714 -21397 -19867 -27757 -10964
6967 -10964 4599 3985 -12067 -7747 1071 -23659 -42386 -41936 -57409 -63076 -52392 -56254 -39038
6954 -39038 -25123 -34078 -30365 9850 21323 34409 53381 58317 20271 -39150 -18322 -38499
6942 -38499 -55395 -25912 -33594 -33253 -9980 -17014 -29741 8461 35481 19083 818 -970 20728
6929 20728 14152 723 -61493 -56676 -52975 -63623 -47105 -24799 1435 8058 -2095 6409 25465
6916 25465 -42669 -43672 -47868 -27236 -16093 18896 4125 -42904 -16091 6896 33280 38042
6904 38042 70064 61008 51942 36935 14731 -17096 -8370 -2277 -10132 -27601 -70352 -53546 -6590
6891 -6590 4205 25 8672 25656 19344 4068 -12625 9127 -508 9552 7538 -5892 24768
6878 24768 20655 18905 6035 -15632 -40367 -62162 -26065 -7886 3819 -19687 -42408 -51803
6866 -51803 -20844 7936 41637 46063 43312 14159 -14379 -28578 -40964 -20646 -13735 -19933 -39189
6853 -39189 -39178 -52015 -61641 -35766 -20098 -13302 -38418 -56482 -17562 10377 14948 -1280 -6025
6840 -6025 -24844 -9075 19698 36145 44756 23078 19455 2963 -37326 -48547 -47857 8166 36005
6827 36005 28084 5991 6978 9993 -8936 -14391 2053 -5411 16081 54827 51695 -8035 -14702
6814 -14702 -14301 -14274 -30671 -32590 -4035 26771 53780 28169 -709 -8215 2848 29026 41761
6801 41761 57718 77611 88177 54593 16886 28601 45630 49028 68154 70646 67934 60732 86300
6788 86300 26073 671 949 19749 14549 20459 27765 20206 22533 5052 26 -35392 -47038
6775 -47038 -38227 -48369 -64833 -37138 -22141 -22985 -6604 -27262 -14739 14139 -10889 16247
6763 16247 21521 4015 25192 39425 22417 -20770 -32942 -33151 -20930 -8964 -17674 -9124 -7985
6750 -7985 -8326 -30699 -11214 -12633 -736 -511 7207 -42717 -82453 -69069 -50236 -17287 28346
6737 28346 41047 45320 47953 28931 10614 3142 25989 3372 539 -3632 -29136 -55082 -32372
6724 -32372 -32797 -37881 17014 33299 56605 50980 -13235 -16978 -8876 -1474 2225 -5865 -7021 5352
6710 5352 11192 -24708 -19131 -19945 1923 -7024 -16178 -40801 -42988 -7529 -2163 -34668 -55626 -49177
6696 -49177 -56288 -49836 -85096 -90791 -86147 -37341 -11924 15034 -20174 -72790 -70867 -50788 -14295
6683 -14295 -15720 -15361 2715 17404 -2457 3472 5356 -1748 1967 -21462 -25885 -38470 -66617
6670 -66617 -51937 -30218 -45898 -38022 -38883 -29890 -59142 -67701 -51033 -31956 -35686 -60240 -60855
6657 -60855 -33850 -26493 -29831 -27241 -15807 -54434 -53325 -48194 746 25488 28054 1556 -23837
6644 -23837 -5827 25448 -8130 -32094 -27320 -34017 6706 4088 -14193 -16047 8092 -15734 -1807
6631 -1807 12877 7675 4268 6918 -10086 -37697 -32977 -10374 10878 2545 -48816 -42072 -10188
6618 -10188 -3566 -24400 27917 79729 78444 64254 59160 54891 47517 61738 52064 8293 -10979
6605 -10979 3368 -10281 -27086 -10266 13801 11721 1348 17381 -4015 11944 36238 33722
6593 33722 10165 21639 47819 32169 41540 13078 -53705 -32663 -44315 -34186 11420 16872
6581 16872 -20672 -36054 -38476 -14509 -41625 -44473 -83722 -76264 -35621 -242 -15853 -42744
6569 -42744 -36082 -12312 -17205 -39432 -40732 -45572 -61521 -53343 -45417 -50886 -60527 -35161 -2715
6556 -2715 -2580 -10752 5848 5369 4197 22414 39111 36070 46871 57924 49617 20871 9582 39771
6542 39771 28746 -4631 -20679 -8256 -13631 -5595 -5894 -30748 -23036 -7443 -10087 3506 21030
6529 21030 41228 51660 52595 33760 49961 41758 27331 13057 -3481 -8111 22586 30159 -4853
6516 -4853 -33788 -16577 -51107 -56969 -17739 -39352 -70904 -74330 -51306 -42564 -16766 9198 12602
6503 12602 11550 19748 -7389 9452 25724 25940 4463 -18553 -10546 40164 39361 33587 11902
6490 11902 -23269 -38845 28182 62682 30421 -28688 -21853 26649 3873 15431 -2234 -35353
6478 -35353 -42405 -23835 -40135 -18846 -193 -12217 -28461 -12924 9940 -4272 -46704 -31051
6466 -31051 14899 38176 27149 27845 23513 -8439 -2279 43051 15805 50646 70452 63170 63733
6453 63733 45674 4289 27922 51609 47746 25007 26906 17540 -9136 -29380 -34380 5481 -4994
6440 -4994 16352 28953 25546 11009 30380 30183 -13597 -4493 -33524 -59526 -49372 -23271 -39711
6427 -39711 -29693 -19218 -23929 -50555 -43937 -11472 29224 62688 54416 44296 32391 -15061
6415 -15061 -77060 -55013 6711 14459 -620 -34418 -5050 11898 22863 12770 -7391 -32940
6403 -32940 -52422 -77785 -50499 -50113 -36265 -17826 10127 13319 44531 13805 2210 63801
6391 63801 84620 50883 28325 47643 37600 43410 4187 -31614 -24030 7982 17316 14624 -43909
6378 -43909 -84819 -74237 -34744 3434 28376 905 12852 52704 61623 85406 68341 29880
6366 29880 2726 -13364 -17285 -13318 21041 17067 -7761 -3228 23864 38226 54038 54650 51137
6353 51137 20602 62 -8533 14238 9976 -12494 -4823 -6971 28394 20604 14793 2758 -23257
6340 -23257 -25800 -51676 -28010 24524 69782 98491 89922 84695 56600 39909 25054 2608
6328 2608 -16607 -35004 -43921 -39043 -43324 -21678 -20372 -56887 -89876 -90776 -107606 -102323 -77812
6315 -77812 -74762 -64488 -29289 -45979 -59244 -62204 -21121 5027 -17401 -62027 -55653 -30851
6303 -30851 -6813 -20577 -64475 -83414 -25827 8042 3431 -11934 6597 24128 11473 -19318
6291 -19318 -16017 -38568 -62832 -64175 -29010 14458 8979 -4644 -1752 -3377 33738 -12588 -47187
6278 -47187 -28888 -21202 11168 27216 28299 19751 -30669 -35412 906 22927 23619 4584 20908
6265 20908 20627 -47006 -86121 -48383 6237 27669 19666 -46128 -53400 -59039 -31037 -30045 -56000
6252 -56000 -68591 -46070 -9766 -19590 -24527 -11161 -37662 -47675 -65949 -108290 -112069 -58448
6240 -58448 1354 20919 11305 5209 -7545 6137 19454 -19820 -27887 -12510 -23389 -59338
6228 -59338 -46201 -5806 13209 -24559 -22604 -5052 -7354 5539 42080 -4883 -46555 -40943
6216 -40943 -29225 -28584 -34791 -3642 33912 65682 85692 89260 67141 11187 7656 -5459 -1160
6203 -1160 6129 16691 -3412 -20552 -31556 -38512 -28766 -7171 -19752 -19267 -27596 -49574 -14319
6190 -14319 -9211 9955 239 -18749 -29413 772 23913 20945 -857 1960 -19487 14954 -2729
6177 -2729 -22442 -21912 -30308 -37244 -7289 -2820 5518 20208 20753 19919 4319 -5794 -8433 -5965
6163 -5965 -7107 -17425 -30036 -27015 -42219 -40060 87 13922 15016 23257 17055 1206 -12866
6150 -12866 -35087 -45739 -50255 -5185 34664 63758 35079 18334 -5360 -42338 -28124 5812
6138 5812 34837 20229 830 -7129 2200 -11383 -32745 -404 6146 -8630 20582 35778 34824
6125 34824 2259 -2253 13275 37266 35122 3793 -45596 -52265 -67394 -48032 -34596 -478
6113 -478 24217 9621 13917 -8497 7993 20543 27405 -1114 1237 -12058 -28369 -44784 -22616
6100 -22616 38712 34930 47610 49566 27169 24830 49659 53508 55156 33196 -10954 -7718 21129
6087 21129 33483 41375 13633 13639 -14501 -15944 -15440 4969 28742 22862 46359 57327 26515 3789
6073 3789 -9648 -6033 -9180 6185 -9823 -26526 963 24074 25606 10178 -3563 9600 -5180
6060 -5180 19417 24374 33822 37731 47295 73104 91217 86032 58892 4175 -30526 -22409 17009
6047 17009 17617 28466 15260 14084 41253 28288 13006 36415 59022 31952 1084 3855 22348
6034 22348 49187 45563 37912 10880 4893 14490 8790 -25293 -25677 -16045 9646 -8436 -8683 -55994
6020 -55994 -90297 -61339 -48240 -46083 -20588 -24212 -44363 -5594 -4890 -13811 -46067 -31723 -24000
6007 -24000 -2658 -11749 -8380 -39574 -34836 15648 18301 21028 40973 33542 5624 4820 -17347
5994 -17347 -35941 -54431 -24086 25881 42803 53206 28756 5009 -16960 -26564 18079 47134
5982 47134 65698 28220 12965 33385 24123 10333 30089 41335 36135 -9571 -51306 -69443
5970 -69443 -63894 -39563 7106 -11026 -15048 -64283 -90327 -82500 -83930 -61849 -34421 -56799 -87992
5957 -87992 -56501 -51267 -35547 -6432 3568 9786 11574 1448 -14310 -16066 2697 25948 49362
5944 49362 33545 17634 -41476 -52415 -40417 -52800 -37786 2987 725 -9428 18643 28504
5932 28504 18078 1625 22007 36367 63717 59324 30214 29753 40257 35469 -14016 -46706 -41824
5919 -41824 -31368 -23400 -63563 -77637 -39778 -37991 -51888 -52671 -15509 -15199 -24946 -26765 9610
5906 9610 25685 49939 49803 20206 7298 -6213 -18428 -28567 -37015 -49318 -57844 -50030 -11522
5893 -11522 -2929 -30537 -56293 -65065 -78885 -66551 -88802 -78972 -51589 -21059 38849 14129
5881 14129 13045 21138 17819 -21069 -37307 -28928 -7465 -4801 -32688 -30169 -2797 11405 33486
5868 33486 7093 -90124 -83597 -35068 -18106 -33846 -23097 -33835 -7286 -9642 -30643 -26692
5856 -26692 -1865 -4722 -35557 -35719 -34118 -17113 1684 19262 5500 12741 27954 29322 23372
5843 23372 -9118 -8540 -45189 -50446 -33673 -50689 -51358 -21845 11067 15381 -4879 -1126 -27870
5830 -27870 -61792 -30780 -8291 -18333 -12738 -27672 -38392 -20003 -25250 -49002 -35705 -17119
5818 -17119 -35329 -50721 -47494 2975 25042 30320 26354 7702 6758 9750 33610 38686 26355
5805 26355 40267 46658 32297 24423 56111 76828 85234 78237 68243 21595 2724 10629 499
5792 499 8652 -35790 -50600 -27606 -49175 -34720 -15828 -51183 -36278 -14195 12459 45354
5780 45354 44366 42353 35961 24531 52932 56295 43613 20818 8232 25659 27150 16586 -3528
5767 -3528 1976 -49553 -65762 -21854 -29866 -11127 -10406 -33423 -68270 -16205 29969 20829 19635
5754 19635 19159 17841 22541 3722 -24655 -27784 23650 32087 29322 22090 6597 759 993 39064
5740 39064 63871 37323 13865 8097 3416 -11169 -3359 10179 19918 3872 -4046 5292 28931
5727 28931 31577 38560 27557 24650 25333 -11381 -17560 -14330 -5823 -28823 -41060 -43415 -51556 -45263
5713 -45263 -51738 -47206 -52506 -20688 -10865 -37288 -20723 -39846 -22959 -27771 -52111 -38865 -61309
5700 -61309 -92197 -51731 -31014 -42341 -52518 -58016 -55766 -21743 -11542 10374 22343 -13378
5688 -13378 -56005 -82188 -62009 -30585 -12678 18639 13088 -39990 -66926 -54155 -4906 15519
5676 15519 8758 861 -319 -3192 -7229 20586 101 -13066 -7804 -15238 2585 16479 1317
5663 1317 -1547 10139 -21588 -56214 -47442 -43046 -49251 -76327 -49211 -39490 -52775 -54416 -21937
5650 -21937 15254 -11440 -19860 -19034 -37418 -33811 -29672 -40422 -44668 -34460 -26130 -21262 -7177
5637 -7177 40208 45152 24323 18976 906 -27289 -20050 -57403 -69587 -63837 -26763 16138 47006
5624 47006 42540 53779 54348 59431 43185 76195 78115 69659 38334 -10938 6879 -6509 -31459
5611 -31459 -25288 -9022 -20811 -6462 3610 -8431 -33157 -41282 -34503 -25999 -4117 53682 32158
5598 32158 17594 5133 -25970 -23206 -20955 -21707 16262 24094 9824 44166 12152 -1472 -5205
5585 -5205 -18305 5321 11271 -25297 -66319 -70367 -72687 -64375 -38115 -35220 7696 -397 -13204
5572 -13204 -38273 -62672 -26944 -45169 -56928 -34963 -7065 4325 7091 -7028 -20028 10309
5560 10309 21711 5942 -52792 -35331 520 -29785 -46832 -19837 -19497 10019 39594 55173
5548 55173 41916 25634 15043 6384 -53 838 -21423 -50142 -89843 -65933 -31521 -38135 -31758
5535 -31758 -29290 -24752 3648 42086 53032 26531 14617 41912 44899 29586 15509 24414 26864
5522 26864 11414 4675 -14577 -17866 -20782 -16972 -13072 -27154 -23402 -39925 -29425 -55599 -87548
5509 -87548 -90777 -78458 -59616 -38946 -15864 -30280 -18208 8729 6800 -2505 313 -19572 -21900
5496 -21900 2271 47664 59423 21650 -7155 4638 5456 -11686 -16305 -4167 -3972 -43543 -62082
5483 -62082 -42768 -31939 -12641 22904 18546 27541 36750 59767 102999 80753 54286 40143
5471 40143 16782 30904 72242 72627 47101 54293 50805 72266 72118 56734 64596 78400 80050
5458 80050 62497 25878 41998 49099 41347 36394 59773 65926 67734 30434 25454 31910 3790
5445 3790 -8718 3637 -9771 -31522 -29656 -10599 -10756 5334 18822 38919 -8471 -48709 -58637
5432 -58637 -32485 -16294 -14965 -45430 -14381 49648 42791 14886 -40702 -38416 -15519 -11239 6464
5419 6464 9022 24318 65031 17434 -21727 -39858 -73465 -25075 10698 -17379 -54938 -56658
5407 -56658 -81891 -93164 -56691 -7609 -5223 25296 30722 9220 7841 -17502 -28282 -43686
5395 -43686 -59895 -62412 -65269 -60045 -36778 -25997 -62032 -48024 -29606 -4591 18174 -14837
5383 -14837 -27268 -36791 -17462 -10880 -53286 -54156 -42286 -31658 -24634 -6990 -7357 -4054 -27242
5370 -27242 -50095 -50240 -14917 -1187 -24688 -48618 -37160 -23798 -27922 12099 27111 -2003
5358 -2003 -38913 -54158 -66702 -45447 1013 -1342 6264 29208 -1742 5363 15853 5859 -13305
5345 -13305 26530 21822 9336 -3272 -21208 -47735 -43932 -55880 -55681 -17933 -1327 -14428 -37864
5332 -37864 -73255 -99171 -82905 -29268 13515 29491 63337 50941 43175 48358 22539 18485
5320 18485 696 -30723 -38143 -43120 -30241 -32619 -44087 -50875 -63998 -57045 -41982 -26458 -13023
5307 -13023 3850 14107 32964 63357 44960 -3313 -27277 -54515 9781 43358 41334 30706
5295 30706 26212 6483 -3042 4230 -7495 -27700 -17424 13107 21691 15064 2890 -35106 -47670
5282 -47670 -36382 7539 20746 17862 3685 -22182 -36268 -11263 22499 -949 -3415 -5997
5270 -5997 -7211 -14527 -9762 2649 17238 22350 21144 -18101 -43843 -5334 5454 -194 -13482
5257 -13482 -40576 -45412 -62859 -35163 -9826 23021 22821 49560 62960 66922 37503 2616 8239
5244 8239 -16208 -46296 -13135 11138 35355 29693 2759 -6836 -38403 -28177 -9043 -481 -2619
5231 -2619 52 11163 -7769 -43268 -26306 -31334 -39183 -39900 -6249 -13988 -19095 5795 41189
5218 41189 38037 15678 992 -23380 -18630 4430 39336 62006 33108 6705 3234 -14928
5206 -14928 -42806 -15057 -18575 -40655 -26766 -3576 -13402 -44506 -73460 -86281 -81231 -68855
5194 -68855 -68805 -58642 -10663 -16135 -39965 -74595 -49724 -52354 -8501 1017 -13180 -39814 -51358
5181 -51358 -47731 -49755 -98590 -95074 -51879 -46159 -51102 -18989 6574 -34587 -36912 -4915 15211
5168 15211 3459 -14132 4529 -4998 -25328 -20085 -23580 -38563 -14926 -25118 -62341 -24840
5156 -24840 -16145 -44723 -65604 -44730 -13764 6473 46290 58181 51186 38046 3775 25594
5144 25594 57716 94556 60310 31735 10917 -6666 -30081 -56702 -44425 -28055 -33952 -15317
5132 -15317 -11786 4391 26732 38301 23324 24803 6626 -55844 -73673 -21813 4486 5972
5120 5972 29521 27704 18063 14575 19854 998 -16255 -28225 -30035 -23020 -14522 -12418 2769 6615
5106 6615 7683 2063 11190 -3664 -23719 -10232 -3214 -10317 12474 17609 4847 -46011 -58724
5093 -58724 -45761 -28915 -5768 -30420 -64758 -51731 -11758 -9535 -63376 -40668 4222 -340
5081 -340 -12617 -29473 -43467 -37331 -48654 -34895 -36200 -55362 -79045 -63021 -47276 -43479 -36381
5068 -36381 -39090 -11290 10149 13046 -15548 -36359 -17326 -15693 -23090 -20028 8938 23602 11638
5055 11638 6732 23760 30647 46886 53429 49836 51330 25938 -27314 -46578 -61575 -40192 -48273
5042 -48273 -54804 -37176 -27296 -21143 -1045 -14956 -27831 -31790 -19275 -43667 -47257 -59609 -71619
5029 -71619 -54609 -34636 -14825 -8269 -16537 -25963 9092 -3520 6528 15273 97 -3125 -13237
5016 -13237 -43090 -50814 -46675 -10798 -877 7734 16836 -7981 -10654 -2220 -4412 14839 -2544
5003 -2544 -37482 -37508 7572 27783 22492 7338 6542 2229 15506 28636 1821 22542 12208
4990 12208 10023 31510 35201 18885 43559 55470 8870 3238 46661 41993 27176 -7318 15441
4977 15441 56559 40284 29976 50183 64176 11458 14898 3317 -27826 -28043 10490 23086
4965 23086 20080 59338 55942 30617 10003 -18302 -46877 -36919 12929 29384 41540 64249
4953 64249 62959 53556 -4980 -12079 -14471 -18286 22238 60808 45516 41061 20789 8589 -5088
4940 -5088 -9395 -36494 -33945 -19989 -8216 -4006 8589 25399 -23839 -22969 6542 -22010 -53300
4927 -53300 -1050 75271 78165 25850 -19293 -30726 -23679 -8551 -2680 -38606 -57745 -58190 -42369
4914 -42369 -40831 -55443 -79753 -67010 -35904 -8108 -4932 5420 -2451 2565 -14408 2380 13168
4901 13168 3148 -10618 16189 48637 62181 60872 66278 53988 21215 9008 -45678 -80492
4889 -80492 -55043 -21021 -1951 16545 27259 56486 95685 78328 82803 51863 9503 18940
4877 18940 16181 -5886 -29512 -66147 -65467 -82671 -63714 -7659 20695 4316 -18140 -7722
4865 -7722 -1752 24003 36899 29116 -9795 -35659 -7467 6981 -1236 -21502 -19439 -22599 -30678
4852 -30678 -27388 -11597 35962 48354 9067 22685 51675 26970 4451 15510 34173 42392
4840 42392 13411 -16765 -24141 -24440 35826 14308 7229 -10698 -15407 -37047 -36336 -35126 -42361 -35459
4826 -35459 -46275 -33888 -27364 -13982 -13663 -9371 -26363 -36901 -18678 -5958 -5388 29655 -341
4813 -341 -26791 -34765 -7737 29632 42663 25398 -19162 -14129 -2044 35686 49354 30191 61462
4800 61462 54472 3907 -21882 2237 -3750 -14400 25264 34881 6225 -4040 -28314 -22237 1804
4787 1804 17288 3286 -8656 4594 12710 -6082 17766 45649 -4528 -81179 -106407 -109474
4775 -109474 -95108 -36982 -7680 -9726 -19951 -21073 5226 6912 -1301 -3586 -22760 -88938 -96783
4762 -96783 -55748 -23917 -10100 -32126 -46436 -42767 -35156 -6940 -30790 36 13730 15453
4750 15453 8578 -10199 -41956 -50872 -52230 -68990 -55702 -53426 -22411 11221 -25445 -30948 -25500
4737 -25500 -5203 25963 1851 -20111 -20338 5964 6677 -1545 6003 21962 6503 -9595 1457
4724 1457 27414 3596 -9521 -25889 -48084 -35117 -26580 -9826 -2959 7563 11691 22426 -15100
4711 -15100 -37428 -29089 -25396 -16955 -21705 -75689 -108117 -128816 -123457 -86476 -69163 -66863 -37864
4698 -37864 -10152 -44959 -71141 -40656 -19310 -12402 15572 33311 9707 8173 19265 4831
4686 4831 21419 46361 68197 65460 23214 44026 44151 15608 750 24451 17066 13214 -9642
4673 -9642 -32023 -38517 -46293 -63891 -36879 -18081 11346 -467 -34229 -39893 -31427 -36321 -24135
4660 -24135 -13203 -38231 -91524 -96664 -78793 -44525 3036 10654 5790 -1421 16696 30434 24964
4647 24964 13760 13623 28344 44352 63775 59971 40324 2539 -16957 7199 17155 11618 42194
4634 42194 39837 5616 -3182 -29871 -10443 -16265 -3552 -12242 -13202 -10947 11363 21691 13226
4621 13226 24089 21934 21049 23116 30988 16651 28695 28656 5195 -7189 20538 54869 30022
4608 30022 20136 17906 16938 -11607 -25421 -17305 -24154 -18848 371 4300 6827 -3885 13682 13663
4594 13663 186 -15153 23132 13551 27477 20685 -30153 -20223 2953 -26274 -39417 -29899 -51579
4581 -51579 -60191 -42453 -2758 -12554 -868 28978 17218 8502 31790 35417 27071 21860 -16228
4568 -16228 -23083 -9699 -25406 -32775 -28610 -33709 -30806 -15221 -16350 -12451 -6268 -17715 -27208 -6672
4554 -6672 20007 -928 -40591 -90020 -74347 -59495 -66146 -43100 -20588 21835 88189 69916
4542 69916 29636 29837 27169 -742 -1937 -16270 -13728 -2780 -10676 -19159 -13331 -35064 -37129 -21643
4528 -21643 -36111 -76848 -81639 -80254 -26547 5856 6058 -6602 -15003 -73599 -67308 -39913 -21278
4515 -21278 -27149 -16790 14866 19444 20132 -6532 34082 46662 7051 -26816 -17887 -13017 -41780
4502 -41780 -22082 -16383 -28247 3614 13994 44134 59855 71478 59129 31399 12395 35464
4490 35464 24247 54893 78727 62929 24590 -6133 -22820 -22346 -26347 22100 4822 -18152
4478 -18152 -18487 7087 15083 12616 12549 19663 -708 -25303 -25111 -16129 -13010 1786 64148 90276
4464 90276 70948 30482 33980 31395 1866 -3108 17576 20269 -12064 6777 44138 19895 1614
4451 1614 14619 4182 32918 48631 75643 61971 59199 44950 -472 -34410 -12753 -10031
4439 -10031 -2144 -11731 -20905 -21232 13332 13145 -6892 -29223 -33651 -29439 -25562 -45800 -26605 -4786
4425 -4786 -36814 -65797 -53744 -71413 -24421 -21078 -52392 -52989 -44127 -32084 1386 -5350 -11807
4412 -11807 -7933 -48584 -50381 -19598 -8123 -21600 -51580 -70862 -44826 -16647 -15242 -58716
4400 -58716 -54181 -19475 -12876 -8383 -30511 -10131 2898 -6104 -10983 -3015 4834 489 -2940 27707
4386 27707 38542 41785 -3534 -34714 -9266 -10516 -32023 -39935 -24791 -3258 -2365 -13993 -31475
4373 -31475 -11327 -27044 -32226 8470 10246 -2625 -45676 -51616 -33098 -40961 -33732 9398 18804
4360 18804 10251 -6052 -45200 -41297 -33240 -22106 -27457 -45298 -53634 -60754 -58819 -50906 -5234
4347 -5234 -258 9164 -10050 -25631 -45303 -70112 -62432 -65927 -61469 -34540 -4948 -4582 -45685
4334 -45685 -45973 -28432 -15694 -4130 48268 17985 -19287 -35584 -19377 19843 28846 26121 3525
4321 3525 2939 10224 -22012 -4242 17669 24375 63039 71961 82468 73523 58652 5304 -30828
4308 -30828 -1967 21260 33127 26025 25126 43104 64496 -2103 -27365 6687 -28203 -61465
4296 -61465 -25207 2252 -1789 -61138 -54286 -50367 -60205 -57772 -29412 -48388 -49957 -53920 -22825
4283 -22825 -22988 -12265 3102 10142 -21651 2538 50213 58826 53737 62078 47242 63571 73894
4270 73894 30370 1011 12087 33552 44128 45792 29415 15783 -5970 -18151 -33709 -23218
4258 -23218 22917 14743 -15804 -21454 24007 34571 28103 18943 -11573 -15714 -17671 -51670 -55591
4245 -55591 -56003 -34958 -4928 30371 48310 43880 -4203 -52474 -38925 9285 28664 21285 39442
4232 39442 24053 32354 57235 50613 59746 55163 17394 11237 -5008 -9384 -20113 -17770 -7377
4219 -7377 -8389 -3259 5329 -1172 15363 16689 17227 -4997 -43048 -56374 -17654 3142 33386
4206 33386 24188 -6821 -7612 9191 1853 -4678 -25465 -15327 -1868 -39773 -54700 -65232 -51425
4193 -51425 -38325 -33852 -4636 25050 28365 20681 6696 24430 8021 33605 74778 106954
4181 106954 73264 73634 78167 28132 -10662 -20218 -17213 24890 51593 57353 25939 38798 3580
4168 3580 -5846 -586 -12301 -20076 -26830 -8364 10946 -23303 -18740 -8911 3753 17143 26555
4155 26555 5251 -27135 -16561 -368 -48648 -47338 -22299 4706 13924 -21567 -32511 -17297
4143 -17297 -3955 -12518 -32760 -28202 -58879 -85818 -88469 -62909 -33313 -25677 -80347 -111874 -73171
4130 -73171 -54971 -73488 -53991 -23546 -8407 -6590 -8012 -30923 -13735 30161 20660 10573
4118 10573 42392 10882 -2576 3867 40645 50878 21383 -2839 1008 -17224 5805 37258
4106 37258 30497 -1119 -46983 -32257 -12018 -50953 -62431 -55385 -25470 6124 26191 31745
4094 31745 4427 -11970 16590 30069 7147 -23106 -25236 -9524 -32843 -37713 -7922 -38558
4082 -38558 -54292 -51197 -47023 -36140 -34762 -34246 -35691 -46034 -48104 -22994 -11980 -14225 17931
4069 17931 48292 45204 -5883 -22217 -35063 -54785 -21763 -28427 -23736 -22115 -21302 21481 51840
4056 51840 61150 65231 16637 -15856 -34689 -47324 -36803 13084 5032 -1808 7445 8269 20696
4043 20696 15679 2888 2720 -36121 -52161 -65361 -52108 -41414 -35947 -18739 30163 20728 14929
4030 14929 15405 -3948 5054 23259 21858 6955 21811 27598 23800 12818 31408 17059 -9174
4017 -9174 -22544 2845 -1613 -14640 -38657 -32135 -21985 -855 20988 32658 9096 13719 50165
4004 50165 23340 -25384 -60462 -57552 -42824 4020 6351 -206 3473 10776 34679 23362 42251
3991 42251 50311 -1465 26330 51608 44322 29818 15879 -16928 -54402 -29068 -11212 -5242
3979 -5242 -32565 -66627 -65642 -79499 -39280 29060 30872 40550 43012 35453 54405 49242 20287
3966 20287 37877 60360 23880 -16349 11511 37135 16028 -4507 -10163 -18326 -56013 -30570
3954 -30570 19123 21748 29163 33549 41162 10612 1125 -20769 -19104 609 12947 -7183 -11660
3941 -11660 -45991 -24660 -26310 -37656 -37319 -20477 -38281 -40052 -69521 -32747 3217 24339 29379
3928 29379 24560 16382 -14349 -10042 5754 4108 2057 37406 14841 -12462 -22539 -3770 55669
3915 55669 70252 157 -45418 -24743 -5316 25765 19026 -4998 -4563 8909 -13311 -35864
$$ [...]
##END NTUPLES=NMR SPECTRUM
##END=
