##TITLE=Analysis number 307594
Compound Code mo 01275
Book Reference 411/189
Project Code adrs
Chemist Name miguelg
##JCAMPDX= 6.0         $$ Bruker NMR JCAMP-DX V2.0
##DATA TYPE= NMR SPECTRUM
##DATA CLASS= NTUPLES
##ORIGIN= Bruker BioSpin GmbH
##OWNER= NMR
$$ XWIN-NMR		Version 3.5
$$ Mon May  9 11:21:45 2005 GMT Daylight Time (UT+1h)  MAYBRIDGE\NMR@NMR_250MHZ
##.OBSERVE FREQUENCY= 250.131544655141
##.OBSERVE NUCLEUS= ^1H
##.ACQUISITION MODE= SIMULTANEOUS (DQD)
##.ACQUISITION SCHEME= undefined
##.AVERAGES= 16
##.DIGITISER RES= 18
##SPECTROMETER/DATA SYSTEM= dpx250
##.PULSE SEQUENCE= zg30
##.SOLVENT NAME= CDCl3
##.SHIFT REFERENCE= (INTERNAL, CDCl3, 0, 16.522)
##AUDIT TRAIL= $$ (NUMBER, WHEN, WHO, WHERE, WHAT)
$$ ##TITLE= Audit trail, XWIN-NMR		Version 3.5
$$ ##JCAMPDX= 5.01
$$ ##ORIGIN= Bruker BioSpin GmbH
$$ ##OWNER= NMR
$$ C:\u/data/dgb/nmr/ADRS/2750/pdata/1/auditp.txt
$$ ##AUDIT TRAIL=  $$ (NUMBER, WHEN, WHO, WHERE, WHAT)
(   1,<2005-05-09 11:21:22.15 +100>,<MAYBRIDGE\NMR>,<NMR_250MHZ>,
      <created by zg, POWCHK disabled, PULCHK disabled
       configuration hash MD5:
       62 19 C7 07 E1 42 D1 B7 37 6C 3D D0 77 39 F9 E6
       data hash MD5: 64K
       4A 06 32 42 8E 4E D6 95 E3 0C 06 FC 08 DE A8 50>)
(   2,<2005-05-09 11:21:34.85 +100>,<MAYBRIDGE\NMR>,<NMR_250MHZ>,
      <Start of raw data processing
       ef LB = 0.3 FT_mod = 6 PKNL = 1 SI = 32K 
       data hash MD5: 32K
       FF 00 2B 7B 10 9C AB 7F BA A4 85 BF ED F0 13 F8>)
(   3,<2005-05-09 11:21:36.74 +100>,<MAYBRIDGE\NMR>,<NMR_250MHZ>,
      <apk 
       data hash MD5: 32K
       B0 A5 E4 75 5B 61 81 EE 16 97 50 41 DA 76 E6 F3>)
(   4,<2005-05-09 11:21:37.48 +100>,<MAYBRIDGE\NMR>,<NMR_250MHZ>,
      <abs ABSG = 5 
       data hash MD5: 32K
       99 49 01 14 8A 58 6D 68 65 96 3A 5A 51 B3 44 6E>)
$$ ##END=
$$ 
$$ hash MD5
$$ 69 43 0E 2F 2E 41 83 AA 06 A0 E9 81 4F 32 D5 22
##$RELAX= 
##$RELAX= 
##$RELAX= 
##$RELAX= 
##$RELAX= 
##$RELAX= 
##$RELAX= 
$$ Bruker specific parameters
$$ --------------------------
##$DU= <C:\u>
##$EXPNO= 2750
##$NAME= <ADRS>
##$PROCNO= 1
##$TYPE= <nmr>
##$USER= <dgb>
##$AMP= (0..31)
100 100 100 100 100 100 100 100 100 100 100 100 100 100 100 100 100 100 
100 100 100 100 100 100 100 100 100 100 100 100 100 100 
##$AQSEQ= 0
##$AQ_mod= 3
##$AUNM= <au_zg>
##$AUTOPOS= <5 >
##$BF1= 250.13
##$BF2= 250.13
##$BF3= 250.13
##$BF4= 250.13
##$BF5= 500.13
##$BF6= 500.13
##$BF7= 500.13
##$BF8= 500.13
##$BYTORDA= 1
##$CFDGTYP= 0
##$CFRGTYP= 5
##$CHEMSTR= <none>
##$CNST= (0..31)
1 1 145 1 1 1 1 1 1 1 1 1 1 1 1 1 1 1 1 1 1 1 1 1 1 1 1 1 1 1 1 1 
##$CPDPRG= <>
##$CPDPRG1= <>
##$CPDPRG2= <>
##$CPDPRG3= <>
##$CPDPRG4= <mlev>
##$CPDPRG5= <mlev>
##$CPDPRG6= <mlev>
##$CPDPRG7= <mlev>
##$CPDPRG8= <mlev>
##$CPDPRGB= <>
##$CPDPRGT= <>
##$D= (0..31)
0 1 0 0 0 0 0 0 0 0.06 0 0 0 0 0 0 0.0002 0 0 0 0 0 0 0 0 0 0 0 0 0 0 
0 
##$DATE= 1115634081
##$DBL= (0..7)
120 120 120 120 120 120 120 120 
##$DBP= (0..7)
150 150 150 150 150 150 150 150 
##$DBP07= 0
##$DBPNAM0= <>
##$DBPNAM1= <>
$$ [...]
##$SUBNAM7= <"">
##$SUBNAM8= <"">
##$SUBNAM9= <"">
##$SW= 20.6930455092707
##$SWIBOX= (0..15)
0 0 3 0 0 0 0 0 0 0 0 0 0 0 0 0 
##$SW_h= 5175.983436853
##$TD= 65536
##$TD0= 1
##$TE= 295.16
##$TE2= 300
##$TE3= 300
##$TEG= 300
##$TL= (0..7)
0 120 120 120 120 120 120 120 
##$TP= (0..7)
150 150 150 150 150 150 150 150 
##$TP07= 0
##$TPNAME0= <>
##$TPNAME1= <>
##$TPNAME2= <>
##$TPNAME3= <>
##$TPNAME4= <>
##$TPNAME5= <>
##$TPNAME6= <>
##$TPNAME7= <>
##$TPOAL= (0..7)
0.5 0.5 0.5 0.5 0.5 0.5 0.5 0.5 
##$TPOFFS= (0..7)
0 0 0 0 0 0 0 0 
##$TUNHIN= 0
##$TUNHOUT= 0
##$TUNXOUT= 0
##$USERA1= <user>
##$USERA2= <user>
##$USERA3= <user>
##$USERA4= <user>
##$USERA5= <user>
##$V9= 5
##$VALIST= <valist>
##$VCLIST= <CCCCCCCCCCCCCCC>
##$VD= 0
##$VDLIST= <DDDDDDDDDDDDDDD>
##$VPLIST= <PPPPPPPPPPPPPPP>
##$VTLIST= <TTTTTTTTTTTTTTT>
##$WBST= 1024
##$WBSW= 4
##$XGAIN= (0..3)
0 0 0 0 
##$XL= 0
##$YL= 0
##$YMAX_a= 499380
##$YMIN_a= -486205
##$ZGOPTNS= <>
##$ZL1= 120
##$ZL2= 120
##$ZL3= 120
##$ZL4= 120
##$ABSF1= 16.522
##$ABSF2= -4.171173
##$ABSG= 5
##$ABSL= 3
##$ALPHA= 0
##$AQORDER= 0
##$ASSFAC= 0
##$ASSFACI= 0
##$ASSFACX= 0
##$ASSWID= 0
##$AUNMP= <proc_1d>
##$AZFE= 0.1
##$AZFW= 0.1
##$BCFW= 0
##$BC_mod= 0
##$BYTORDP= 0
##$COROFFS= 0
##$CY= 12.5
##$DATMOD= 1
##$DC= 0
##$DFILT= <>
##$DTYPP= 0
##$F1P= 14.0000005364418
##$F2P= -0.99999901652339
##$FCOR= 0.5
##$FTSIZE= 32768
##$FT_mod= 6
##$GAMMA= 0
##$GB= 0
##$INTBC= 1
##$INTSCL= 1
##$ISEN= 128
##$LB= 0.3
##$LEV0= 0
##$LPBIN= 0
##$MAXI= 10000
##$MC2= 0
##$MEAN= 0
##$ME_mod= 0
##$MI= 0
##$NCOEF= 0
##$NC_proc= -5
##$NLEV= 6
##$NOISF1= 0
##$NOISF2= 0
##$NSP= 0
##$NTH_PI= 0
##$NZP= 0
##$OFFSET= 16.522
##$PC= 1
##$PHC0= -73.92338
##$PHC1= 6.254518
##$PH_mod= 1
##$PKNL= yes
##$PPARMOD= 0
##$PSCAL= 4
##$PSIGN= 0
##$REVERSE= no
##$SF= 250.13
##$SI= 32768
##$SIGF1= 0
##$SIGF2= 0
##$SINO= 400
##$SIOLD= 32768
##$SREGLST= <1H.CDCl3>
##$SSB= 0
##$STSI= 32768
##$STSR= 0
##$SW_p= 5175.98343685301
##$SYMM= 0
##$S_DEV= 0
##$TDeff= 65536
##$TDoff= 0
##$TI= <Analysis number 999999
Compound Code 99
Book Reference 9
Project Code 9>
##$TILT= no
##$TM1= 0
##$TM2= 0
##$TOPLEV= 0
##$USERP1= <user>
##$USERP2= <user>
##$USERP3= <user>
##$USERP4= <user>
##$USERP5= <user>
##$WDW= 1
##$XDIM= 32768
##$YMAX_p= 346706461
##$YMIN_p= -445560
$$ End of Bruker specific parameters
$$ ---------------------------------
##NTUPLES= NMR SPECTRUM
##VAR_NAME=  FREQUENCY,     SPECTRUM/REAL,   SPECTRUM/IMAG
##SYMBOL=    X,             R,               I
##VAR_TYPE=  INDEPENDENT,   DEPENDENT,       DEPENDENT
##VAR_FORM=  AFFN,          ASDF,            ASDF
##VAR_DIM=   32768,         32768,           32768
##UNITS=     HZ,            ARBITRARY UNITS, ARBITRARY UNITS
##FACTOR=    0.157963299565203, 1,           1
##FIRST=     4132.6476996994, 0,             0
##LAST=      -1043.33573715361, 0,           0
##MIN=       -1043.33573715361, -445560,     0
##MAX=       4132.6476996994, 346706461,     0
$$ Real data points
##PAGE= N=1
##DATA TABLE= (X++(R..R)), XYDATA
$$ [...]
20654 76764 -10995 -73917 -55165 6194 98070 89962 100951 4157 -71674 -128298 -35030 107219
20642 107219 189433 67457 113457 106050 -14924 -141239 -186501 -173835 -81104 -35028 -132652
20631 -132652 -159103 -58307 -22693 -117180 -159198 -81729 -104893 -166918 -135819 -127257 -195433
20620 -195433 -196179 -95449 -35208 -67590 -8014 -3530 100705 155759 96089 30557 103021 163508
20608 163508 173228 138209 140646 98495 115244 -26277 -64395 -143245 -192552 -199485 -92930 -27470
20596 -27470 -18468 63552 102423 52585 82698 -22941 65195 174190 2635 -66587 -6556
20585 -6556 47735 -44733 -6545 127783 19789 -85170 -92847 -16825 75422 68102 53417 70196
20573 70196 7766 28773 27398 17345 47891 -29691 -26543 -34422 21349 130810 80177 36441
20561 36441 36717 40137 21670 22948 64403 105722 149487 87010 17327 -10883 45278 84981
20549 84981 43755 33723 84030 80300 21210 -90411 -36707 58666 161645 159190 73562 71829
20537 71829 104817 129024 115168 84368 62503 127446 88772 182154 302720 252269 141646
20526 141646 124806 204969 127232 -20165 -126979 -50747 -16642 3111 -20519 -35362 -89796
20515 -89796 -30762 95803 100008 83626 16333 -44269 -55815 30763 -22120 -37469 51712 106848
20503 106848 225558 254316 226198 66855 -50739 -115405 -191439 -141204 -109485 -49395 74833
20492 74833 88597 13700 -7761 -84800 -75865 11818 -36878 -1468 12910 22469 37521 6980
20480 6980 -38821 -38413 32051 -72047 -125328 -137805 -95301 -114254 -139524 -118919 -55816 -13953
20468 -13953 -113548 -126159 -136127 -110291 -122589 -80511 -62461 -94041 -20704 41828 50293 -70391
20456 -70391 -31214 -31861 -75844 -64568 -76442 25395 -1820 -87689 29172 120499 72918 34197
20444 34197 -42738 -73197 70495 146394 61271 -46455 -69664 -110238 -115292 -30320 110046
20433 110046 142369 13883 -175067 -174288 -132439 -102661 -39833 6442 83600 132386 103572
20422 103572 61962 -12896 -18982 -14680 10518 120380 196793 135187 50605 90300 112651 90958
20410 90958 81956 -3847 1286 -33177 -129868 -159411 -25675 32020 72610 110382 101093 120662
20398 120662 134340 -25113 -129888 -85820 -34685 12056 14430 -7129 39482 3078 -112463
20387 -112463 -51396 68642 136089 133786 178338 110004 60547 82688 120280 82131 130623
20376 130623 113980 108492 33883 14766 40953 -13546 -155426 -127615 -88224 -14489 17483
20365 17483 51539 37377 34843 25067 104373 61988 7926 -46534 -45327 50551 101470 80614
20353 80614 73901 69694 44924 72582 126543 41971 -151746 -110638 30070 97291 121840 163041
20341 163041 127643 102331 34180 -19894 -11525 -93353 -65285 -28171 -67323 -60549 -43194 -64180
20329 -64180 -93245 -52258 -69917 21546 56463 -47328 -115654 -160387 11135 72492 78634
20318 78634 5153 73223 90529 52941 -153255 -220258 -165688 -34802 -8786 16689 -1244
20307 -1244 -38818 -49908 15613 -1975 -121665 -152148 -79389 -90186 -106052 -53761 3507 -45216
20295 -45216 -15845 16718 21056 41006 95363 44094 61733 64257 -14184 -28609 -962 44522
20283 44522 118346 91518 23544 38098 133068 196567 259155 226513 127995 -5988 -37151
20272 -37151 58132 216429 224243 159600 77828 15231 -38244 -103324 -7655 32481 65188 22322
20260 22322 -133129 -154833 -171042 -132684 -95848 -62234 -17472 16490 -38301 8205 72664
20249 72664 122234 162653 99787 91494 46175 34706 53712 -36983 -32812 57267 117171 64764
20237 64764 -47708 -81520 -87832 -34206 -123722 -112999 -157242 -152880 -127644 -87050 4389 22059
20225 22059 5889 -19291 -34459 -46143 -51897 -111519 -160645 -129200 -92770 -55521 -10375 78421
20213 78421 44528 57704 26429 3406 -13262 -55763 12184 18977 55903 213724 200299 44187
20201 44187 -35023 8487 24639 29657 89729 153926 122757 68991 47038 157790 108063 80444
20189 80444 6526 -28055 -63320 -42624 90290 96443 -80918 -42896 24036 35985 55041
20178 55041 -9834 36810 -65632 -75646 -62922 27572 79809 -88636 -104622 12558 61320
20167 61320 53921 74679 64501 -45187 -58169 -21124 34548 18967 12776 18120 -74786 -110439
20155 -110439 9907 28497 -19146 48833 78456 59821 47473 124346 149039 107233 66132
20144 66132 62084 21437 -18146 -153446 -155677 -86137 -95885 -58267 -29913 62927 142762 60575
20132 60575 50423 -49936 4343 11636 -81392 -22005 55228 172677 139975 27610 20123
20121 20123 64260 7238 -60755 -47044 -16651 94357 163220 165403 213050 209630 199887 268131
20109 268131 130481 20768 18613 8695 -72022 -62246 -32470 4565 91811 116366 119575 169947
20097 169947 181199 102392 36305 42056 115214 225462 280188 221597 114644 57346 120478
20086 120478 118402 95105 135847 156873 81598 25685 60926 67145 111360 124002 160563 198546
20074 198546 85959 154103 148955 103760 106612 75326 54162 117389 106599 16342 -29025 -6468
20062 -6468 13707 64018 124377 77676 65414 100495 221823 299752 283182 237852 222774 320349
20050 320349 316186 373120 397470 478799 550611 649670 798984 935895 1109952 1264149 1405503
20039 1405503 1561912 1639837 1559670 1547043 1361494 1114831 942534 848417 1023664 1053394
20029 1053394 1099636 1230758 1464367 1730539 1828054 1744596 1698816 1552266 1344591 1094821
20019 1094821 941571 810984 770515 713781 587249 479808 410212 293650 104825 94475
20009 94475 216018 344123 377204 354149 235349 135896 85384 297 -47486 -52760 -119074
19998 -119074 -126024 -3321 21826 11768 90430 51349 82069 50089 15393 11065 47160 8758
19986 8758 -8324 12197 -68077 -27982 115061 219536 222449 121716 30724 9595 -45514
19975 -45514 14468 31663 23487 -37793 -33423 -5357 33275 22881 63783 57441 -37142 -123506
19963 -123506 -115203 -6083 14580 6852 -127518 -246794 -141069 93778 140830 138219 4924
19952 4924 -10785 147162 239359 299787 338309 347443 290443 219638 224086 145080 -6706 -60430
19940 -60430 -62156 -25952 34518 111208 168788 116931 84921 160225 141507 186593 106977 80767
19928 80767 51115 -43718 -44753 -31431 -15491 48426 21318 -76320 -8126 48116 139848 117830
19916 117830 110254 188314 203068 201236 127775 56831 -31791 -97968 -18044 59354 -8699 14339
19904 14339 36713 36626 -30638 38093 64981 96581 152960 143872 147445 6311 14336 113710 120762
19891 120762 84589 30402 8590 -41490 -23757 34135 78712 109489 56705 -909 60855
19880 60855 142459 102723 -30069 -135442 -150650 -149893 4684 22737 22432 2280 1012 66867
19868 66867 138976 164826 139972 74822 23801 27687 61283 37741 1465 -5747 -54913 26519
19856 26519 43536 -5688 -123230 -210732 -212262 -105979 -98622 -186501 -75999 -13037 -101021
19845 -101021 -304510 -373478 -378624 -445560 -398722 -289786 -235156 -294949 -309681 -303076 -112439
19834 -112439 20005 6115 -1924 25274 -658 -34040 -70290 -81706 -16100 -26228 16880
19823 16880 63846 84973 250639 366268 406813 325386 321064 403153 307584 164282 210970
19812 210970 270525 309505 363979 355394 389131 346276 401975 454880 499086 364140 306799
19801 306799 299540 377694 356590 288884 194514 165277 204745 308810 281443 288806 221952 215560
19789 215560 354180 392820 366790 291373 298508 334094 254402 218008 325474 385069 351348
19778 351348 328540 271503 290835 249887 122048 167055 218632 212815 159984 140863 182813
19767 182813 290364 286572 377707 499594 475703 336053 318238 368204 498408 467396 386099
19756 386099 285900 326654 398190 327260 366672 501577 512584 523768 616245 622447 603422
19745 603422 609331 584685 461158 437124 338680 354942 366009 368858 308187 293515 174941
19734 174941 79117 10524 -20945 46960 126492 163299 151085 275730 340173 341201 188026
19723 188026 167445 288331 277299 233048 291729 428675 337533 230084 184311 234753 173786
19712 173786 47151 41401 155964 133891 108361 128932 162664 204017 270116 317036 318865
19701 318865 257459 222844 332650 350974 321514 189217 170737 237162 277825 429850 524179
19690 524179 439144 359688 310051 344119 309053 330088 382375 479957 566150 601169 649787
19679 649787 689632 610720 627582 678476 756931 752087 706685 786848 811346 820413 830249 809080
19667 809080 770349 761633 643247 554209 610809 641567 669800 645635 725455 763050 851992
19656 851992 806836 672628 720044 703988 567031 531438 573715 675822 634316 670859 593927
19645 593927 417396 539278 703850 671133 694372 623556 612648 694480 673070 730913 635883
19634 635883 491302 575244 635880 692720 642075 577128 654455 675134 658595 565296 630306
19623 630306 689013 619840 632611 681892 640884 668678 589054 514178 441436 469939 506689
19612 506689 565728 601885 600047 575251 626715 586711 543753 583740 758468 866064 861886
19601 861886 927854 1021403 1010499 870253 827934 918087 934045 900315 954410 937566 871687
19590 871687 971469 1195514 1284178 1260342 1216605 1216726 1233031 1225825 1218929 1217589 1189875 1258317
19578 1258317 1318454 1270043 1311396 1355864 1437298 1532380 1521699 1664339 1809012 1740714 1671184
19567 1671184 1698516 1733056 1756670 1799234 1900873 1908425 1913925 2079106 2102552 2136942 2237611
19556 2237611 2402976 2508667 2602913 2669692 2779723 2914677 2991499 3142392 3381286 3563216
19546 3563216 3774288 3834419 4010026 4237170 4549879 4762439 4953166 5226658 5569577 5941125
19536 5941125 6394037 6906202 7475675 8088454 8796551 9554453 10570283 11644522 12787624
19527 12787624 14111754 15565888 17017538 18594493 20394138 22442546 25011239 28102982
19519 28102982 32009831 36911985 43298322 51823547 63501440 79889729 102488547 131384695
19511 131384695 165770681 205015255 243671995 273904707 294365513 301564843 291863189
19504 291863189 271033659 244430026 216053214 191795360 176671058 173271415 182152280
19497 182152280 201417337 229754001 261445086 286450142 302015305 305428526 291534067
19490 291534067 264470849 230067793 191657916 153917205 120669615 93548873 72400288
19483 72400288 56580874 45063238 36753741 30717102 26230907 22887574 20270788 18269830
19475 18269830 16682276 15173762 13775828 12541015 11312221 10219764 9206713 8212695
19467 8212695 7270315 6461155 5795753 5136512 4580548 4292070 4037670 3830107 3663293
19458 3663293 3391022 3213241 3095238 3037273 2823580 2651218 2459068 2248784 2138809 2014894
19448 2014894 1887565 1754218 1648114 1558206 1612719 1713601 1532597 1550886 1563405 1491826
19438 1491826 1550379 1408411 1264822 1209704 1172245 1227153 1140268 1103673 1201510 1268703 1166683
19427 1166683 1100420 1131849 1155591 1055297 943926 909907 963550 1009886 927565 821111 697784
19416 697784 632348 694470 680654 704254 736195 755667 755844 656077 536317 551411 638336 705905
19404 705905 662175 531309 508023 496397 421516 432891 487503 466020 563134 568849 565856 650968
19392 650968 565464 430646 453862 464090 508757 553119 565534 541532 618269 626774 627259 593688
19380 593688 646379 689670 650049 590472 642318 652662 558992 516689 562254 571015 602360 704572
19368 704572 752911 698248 669784 557546 512416 453927 365931 350904 343965 335108 341055 331575
19356 331575 429769 498107 418877 437329 503224 395884 474508 434766 392098 403885 433710
19345 433710 542120 503832 395341 414100 480859 427876 361220 260004 206523 235191 264504
19334 264504 336910 278360 194765 142864 89263 75281 148882 195352 135913 44228 23933
19323 23933 12370 -66912 -89217 -53490 -15738 45756 88008 44745 -3061 13004 28773 54018
19311 54018 64009 144431 391195 383968 327677 365992 265740 309522 353666 308131 302616 328069
19299 328069 394099 365744 434522 514546 587822 628756 661730 586149 538498 469666 516649
19288 516649 519058 548880 498998 449907 469178 343218 331022 311502 330338 125325 15755
19277 15755 111286 163667 90975 -21175 44294 36027 58507 77196 158375 168737 211283 154444
19265 154444 163624 111536 131457 129708 93555 38287 47649 -28918 -41560 -11968 -19216 -104229
19253 -104229 -94343 121524 213184 108048 140851 142028 15222 16769 -26314 -8425 -13505 49497
19241 49497 21632 -11711 -59685 -77435 -52016 10831 65771 97950 98337 57864 35656 81127
19229 81127 122642 11846 -25901 96880 135263 40906 -31743 13725 105141 170436 120203
19218 120203 79227 25963 -8509 42531 -13814 -119008 -94509 -6305 -57636 -97044 -147256
19207 -147256 -164744 -247890 -244951 -74559 -34346 -110706 -113433 -153249 -130622 -79942 -30629 16783
19195 16783 -31358 -127154 -93542 -143892 -114147 -148028 -156842 -212550 -227828 -203232 -136543 -148392
19183 -148392 -210217 -179320 -180027 -229112 -243903 -106397 93709 228333 318239 343775 448499
19172 448499 413754 359607 289159 156553 175729 241120 260452 210797 230975 327925 322136
19161 322136 362675 358844 353332 416259 464284 427774 524474 600184 489503 316308 320975 440883
19149 440883 525746 455651 496098 480161 412383 454468 566005 724764 903249 1127697 1265109
19138 1265109 1222427 1093600 1042703 924237 797354 701835 654473 674768 656232 559292 516904
19127 516904 628554 848022 872332 882012 974473 850616 716425 600564 507457 358583
19117 358583 366802 440209 484237 368443 331285 428004 401043 357733 328667 273621 353390
19106 353390 334560 346955 297564 117292 16124 95580 225209 214553 237598 308421 326998
19095 326998 449059 484437 498891 566104 650605 630651 755287 1027060 1129387 988681
19085 988681 911426 830348 746681 716066 583518 418089 439421 580422 693321 798386
19075 798386 963699 1193695 1226968 1109855 982196 932688 800680 672605 535992 318471
19065 318471 213288 225006 186077 78736 101932 47769 58265 102550 159869 145472 86973
19054 86973 68860 79648 79187 78380 50213 -8117 128336 83029 11180 6043 22130 2697
19042 2697 -10910 1168 -36523 -34550 15921 83832 88472 81871 111968 50558 -25713 -8095
19030 -8095 21897 -3293 -31665 -13848 48897 82324 -51946 -61884 103054 193284 145079 129265
19018 129265 173900 284575 328994 306817 340967 254465 101567 127624 179144 114927 135811
19007 135811 52787 -8874 -23142 12993 50062 93234 156510 170601 141382 134475 74858 41784
18995 41784 26113 38040 70745 24204 49961 25695 28809 145907 219392 273398 196654 157161
18983 157161 237158 331813 325597 357136 445657 418855 530400 697978 864537 1013034 1204800
18972 1204800 1486953 1614820 1688716 1801916 1837323 1712528 1561446 1458184 1288088 1208025
18962 1208025 1294339 1296210 1262994 1332424 1439698 1580652 1646915 1697582 1562079 1411434 1231847
18951 1231847 1134431 913355 672889 473595 401172 350576 429203 444436 331151 251948
18941 251948 172816 188917 253096 221056 74604 35886 29970 34156 167518 226044 262191
18930 262191 270815 351703 468289 469829 462414 405140 444366 461557 409282 379728 368514 431666
18918 431666 455220 420589 290812 292532 346797 451800 422224 425047 344477 217869 162035
18907 162035 132960 66698 -21405 -46128 12528 -7316 -44684 -106906 -137987 -161043 -82156
18896 -82156 -155516 -180675 -84302 74574 82950 110698 223452 214167 150236 162099 221010 148586
18884 148586 160652 157437 131634 157510 148836 310746 444056 514300 531071 531883 544387 607907
18872 607907 604002 576792 573943 640525 649019 627246 650536 650318 654677 631249 627364 664758 633132
18859 633132 619624 595167 620320 698158 702528 546520 481190 440428 453716 508938 501177 295266
18847 295266 267876 352974 390044 461009 498514 521751 570413 455569 224679 119307 132861
18836 132861 224348 273087 350184 327153 281442 285847 108377 37143 97637 124284 152502
18825 152502 244184 271304 396649 394636 293395 304879 329245 301541 216190 219445 259489
18814 259489 291595 294332 307525 204508 221533 256730 284044 452141 592795 610957 648509
18803 648509 639910 549001 512743 514820 571391 520610 492310 474176 405002 451742 499389 523169
18791 523169 515738 575053 628433 533529 430719 414542 469410 528517 498080 400261 340448
18780 340448 384614 420847 454931 486302 558092 577700 562431 564386 599090 682916 653711 635435
18768 635435 863253 1074538 1281278 1271179 1250548 1277132 1180549 1075825 1017559 901773
18758 901773 844237 798975 839056 888432 902569 886177 940762 1009920 960976 929071 844577
18747 844577 718486 769577 742691 729923 759998 711654 658615 593803 619482 655722 596056
18736 596056 653018 788871 759789 724028 752720 753802 724238 810895 810638 730388 629466 500429
18724 500429 493958 518567 483815 527639 667204 757037 735076 738091 722740 702683 810694
18713 810694 809281 780897 687852 638629 629635 711083 709480 736370 752627 785635 782501 767451
18701 767451 792120 806220 739718 692869 820042 925371 1014682 1068087 1060212 1037840 1105473
18690 1105473 1139196 1124317 1076166 1159045 1102361 1059377 1083080 1124969 1154651 1283853 1290052
18679 1290052 1295338 1191132 1202352 1145324 1186528 1224128 1199972 1207300 1277280 1287669 1317324
18668 1317324 1312744 1342025 1478156 1560559 1691003 1726591 1788186 1860325 1915315 1936227 1971469
18657 1971469 2036284 2106702 2124149 2139060 2339888 2444678 2554810 2736265 2996594 3222756
18647 3222756 3483325 3691730 3899844 4210596 4599739 5070297 5428512 5703978 6083124
18638 6083124 6409867 6885483 7465040 8066542 8820921 9636677 10693416 11801561 13061156
18629 13061156 14749067 16796289 19095332 22031259 25846406 30961506 38112360 48541043
18621 48541043 63734554 84887393 110899404 138121223 159806311 168804370 164309707
18614 164309707 149131717 128469978 107602534 90101710 77919304 71574995 71347261
18607 71347261 78188376 92374185 112901502 136048720 155557558 163809000 158974265
18600 158974265 143106727 120912574 97587000 76437669 59120828 45921694 36534604
18593 36534604 30120361 25607965 22478749 20079644 18418685 17205841 16314929 15564111
18585 15564111 15241135 15253648 15424302 15780358 16344438 17114073 18203594 19493154 21148425
18576 21148425 23223669 25831589 29283552 33859215 40015590 48905019 61977684 81079193
18568 81079193 107140340 138241137 169101931 190801117 196782995 187942919 167967223
18561 167967223 143238174 119537800 100561711 87873583 82211778 83987742 94017961
18554 94017961 112544243 137800058 164621174 184481656 189750458 180254136 159071311
18547 159071311 132065526 104710595 80578855 61287583 46703315 36317420 29025545
18540 29025545 23811971 19783269 16703975 14388955 12480166 11054342 9936644 9045184
18532 9045184 8182258 7499872 6921405 6441117 6054629 5701431 5279693 5026612 4566902
18523 4566902 4070246 3756874 3428781 3094736 3027171 3000867 2872108 2591178 2412912 2226737
18513 2226737 2159124 1999647 1871225 1850912 1759041 1742013 1772234 1561973 1393802 1378102
18503 1378102 1426677 1505658 1426605 1369274 1374847 1331005 1294766 1240092 1129872 1128647 1138048 1153326
18491 1153326 1022924 911956 956115 1136775 1179597 1121101 1170166 1224723 1196839 1175138 1163679
18480 1163679 1155369 1092852 1031775 933961 821248 890204 860770 884826 1001862 918862 843567
18469 843567 625641 636304 702239 663877 588342 603172 625337 602473 533595 500633 556240
18458 556240 596906 679215 842735 986733 1118136 1200337 1351408 1432721 1551452 1700079
18448 1700079 1818016 1872584 1920859 1884252 1835989 1767769 1697783 1511587 1297247 1244304 1172102
18437 1172102 1203593 1182030 1033197 918920 911305 915068 842880 854220 970847 1070042 905905
18426 905905 744981 626947 690976 716328 692564 654397 610892 496083 432996 413346 380813
18415 380813 485915 550974 580851 532630 421495 287911 237323 311299 421683 516459 622193
18404 622193 689999 725106 741962 780201 834465 806322 914651 1086013 1167578 1154487 1121569
18393 1121569 1115361 1207229 1241423 1100520 1000743 934243 930893 869141 722148 706967 684559
18382 684559 609233 640183 593803 492860 355581 338803 381799 388591 409317 336052 206785
18371 206785 147252 114449 198807 198999 241532 276301 282406 383500 458149 426232 383560 345173
18359 345173 300098 266407 224733 271085 364718 416199 347845 293949 356682 415795 530498
18348 530498 592904 537152 508849 516338 504948 378324 368662 366224 355913 352347 365711 330256
18336 330256 384062 343109 314107 335080 313605 458009 531480 415851 354524 301810 184687
18325 184687 175087 226512 263872 256882 262627 220290 197514 199820 201421 224387 174382 186043
18313 186043 135468 77991 193473 238298 202464 175035 179209 42468 -55647 -76460 28858
18302 28858 153923 88911 75031 147777 216520 280717 304793 332308 459228 455671 460216 363078
18290 363078 256906 256722 208225 307410 336719 385798 455073 429737 337810 294550 322970 228859
18278 228859 88833 89761 118078 176986 224836 269049 309287 418826 600071 629612 587766
18267 587766 455174 423222 478425 506690 588114 611767 651878 514882 563905 610637 454306
18256 454306 420640 460787 401434 441086 436030 428471 421912 446079 502909 455450 398390 347325
18244 347325 415472 364192 336435 301390 339159 254691 198982 237111 304155 413607 531567
18233 531567 504842 560242 532134 488171 395133 396533 341489 246490 299416 405742 438612
18222 438612 408901 513095 718333 832642 776109 888169 1006805 1028732 989170 913177
18212 913177 822674 858069 935921 1011636 1101566 1140216 1130645 1141751 1067957 945222 892285
18201 892285 930303 920006 803085 742509 794211 855311 814419 839300 679346 562303 603114
18190 603114 716469 873823 981996 945799 944933 896128 910137 888736 846998 813302 849533
18179 849533 968723 1022366 1064773 1016347 945833 906166 917025 1020185 1098501 1115426 1133560
18168 1133560 1149418 1135935 1154381 1230615 1291699 1278858 1211254 1138815 1157468 1241065 1223778
18157 1223778 1290452 1237177 1133735 1117643 1164173 1226096 1208495 1143121 1150357 1254111 1295059
18146 1295059 1306794 1355119 1420764 1534776 1749111 1821096 1730521 1821035 2136818 2310379
18136 2310379 2526156 2637465 2690972 2832166 2989499 3164546 3258769 3508750 3751521 4064822
18126 4064822 4518906 4999528 5640080 6273815 6916287 7702600 8697084 10041712 11550433
18117 11550433 13315355 15706391 19017364 23621494 30171263 39835154 54857107 79358343
18109 79358343 117659530 158431526 173342811 162494060 139116242 109982603 81797116
18102 81797116 58859914 42075251 30513660 22748400 17330932 13589536 11050130 9315850
18094 9315850 7902772 6814421 6226335 5671497 5200928 4853210 4494436 4136485 3804494
18085 3804494 3512900 3273651 3071510 2950911 2951214 2831366 2772959 2726143 2806351 2749793 2600092
18074 2600092 2483252 2202292 2096899 2178982 2124164 2023892 1956120 1893396 1782566 1689098
18064 1689098 1696928 1504531 1434298 1473380 1424049 1323405 1294803 1427708 1489865 1482022 1354739
18053 1354739 1230909 1138794 1258810 1272641 1319542 1322505 1391072 1443285 1670429 1771817 1809966
18042 1809966 1978638 2153235 2332048 2472129 2479919 2327461 2193131 2129113 1952675 1741634
18032 1741634 1646159 1619021 1767502 1921167 2129815 2365448 2412686 2415996 2310824 2313678 2211857
18021 2211857 2017261 1838111 1649563 1654822 1641830 1484292 1366794 1322934 1322882 1374419 1394130
18010 1394130 1334216 1366535 1397800 1485182 1518363 1510623 1517042 1606651 1703115 1757308 1829710 1856512
17998 1856512 1955926 2167745 2278340 2295939 2429816 2604422 2719146 2922707 3072145 3288600
17988 3288600 3503148 3761795 4018420 4200599 4391401 4466215 4664277 5022035 5282719 5531606
17978 5531606 5710729 5868516 6182659 6378461 6558350 6806319 7192358 7495667 7827204
17969 7827204 8379578 8945189 9543279 10352406 11244559 12231964 13332019 14607875 16159807
17960 16159807 17993366 20296059 23080366 26526074 31292607 37624463 46218263 58257634
17952 58257634 74633939 94784265 115873263 136503786 156679071 176272534 197581638
17945 197581638 218679680 234138768 244003196 245624007 236522875 221933951 204664702
17938 204664702 185853221 166698550 146066714 123831845 101958416 82244460 65689950
17931 65689950 52531454 42576364 35056812 29420232 25446948 22492958 20177694 18451391
17923 18451391 17161806 16027360 15126913 14467939 13995265 13739256 13736410 13668245 13803092
17914 13803092 14131303 14681074 15181993 15899212 16899242 18069512 19557967 21452632 23908104
17905 23908104 26992416 31033616 36446991 44030606 54847778 69500672 86837554 104358103
17897 104358103 121552372 138342119 155182044 173751070 190806763 202663497 209935253
17890 209935253 209286285 200049362 186851478 171513023 155052270 138268755 119778595
17883 119778595 100076695 81117917 64280152 50401422 39596717 31419681 25316178
17876 25316178 20861213 17698901 15418164 13530466 11888599 10560688 9452259 8648510
17868 8648510 7974088 7347960 6720104 6301969 5865669 5594184 5234957 4817974 4576659
17859 4576659 4279179 4133680 4090918 3993081 3848285 3665974 3424922 3194718 2998651 2814793
17849 2814793 2567308 2401195 2250402 2013425 1886574 1772274 1540730 1452114 1429249 1390773
17839 1390773 1311178 1337470 1355958 1274479 1201124 1099504 990483 936087 966425 965547 999938
17828 999938 990257 1026759 1068152 1065038 1079628 1012587 942691 1028497 1028176 1015793 1013443 933496
17816 933496 818279 721602 771502 814494 778407 839617 891289 820695 850838 927439 911647
17805 911647 861117 763908 669128 753458 766649 750507 660734 589449 522906 558770 594806
17794 594806 450187 512477 545239 465426 477385 495463 463215 413767 367260 340868 293432
17783 293432 288636 312300 333508 361678 302712 322434 505138 560187 555007 549734 593090 562303
17771 562303 563109 538159 530193 462494 398415 523002 517886 577937 714827 659347 601293 415594
17759 415594 410128 529099 537722 569016 619079 617978 508882 512654 497538 505001 517272 411431
17747 411431 275693 304615 284266 269527 287844 299832 283171 240319 175528 147683 133421
17736 133421 205453 252968 268146 284046 238400 197728 185990 183103 70850 85125 199246
17725 199246 208494 249528 145954 61094 74514 166660 230592 205538 205700 206130 219194 163111
17713 163111 104469 69528 80875 106176 -10473 -35290 8188 40522 140367 131385 155046
17702 155046 82740 5457 141846 219792 87382 -13941 43566 87854 96359 130558 131205
17691 131205 176105 209097 274744 209139 159882 187951 196972 323192 302701 130505 33397
17680 33397 -29541 39828 132286 160366 142291 162567 230339 257113 282083 357387 225055
17669 225055 72157 67471 15925 101731 216318 334656 308641 174744 55986 113704 154983
17658 154983 94390 8736 73857 140041 161795 178216 62459 37123 129252 107001 98571
17647 98571 137390 140736 68788 -32842 -44516 -34801 -15249 125971 88287 11291 55157 117652
17635 117652 21229 -52397 -74033 -141504 -133230 -227167 -288560 -284335 -144088 -65500 -30717 43107
17623 43107 -11570 -45499 -73639 -99015 21511 171184 199826 128403 134352 226158 492935
17612 492935 567768 513846 460911 432490 442686 531448 515201 440138 510480 451681 312151
17601 312151 264199 293104 214266 111006 54477 33986 163914 91125 11368 -27926 36697
17590 36697 553 18276 -21450 -45526 44614 116723 89148 108819 172122 160491 179478 182685
17578 182685 174978 93606 51765 89639 90077 135396 109882 22732 9725 89169 90426 72203
17566 72203 85602 56481 134374 262710 381046 326464 319664 379706 378405 258820 249581 326642
17554 326642 367421 244579 175509 217049 185751 51348 94515 145239 238767 333617 335790
17543 335790 253892 227930 295371 297463 339359 178856 149242 160072 221783 252365 219388
17532 219388 113185 153091 95443 19688 24049 133311 309627 325411 225109 124070 110929
17521 110929 12424 22293 34341 -40360 -124744 -50681 122438 114460 24775 -39824 -72004 7909
17509 7909 42766 41382 124251 198155 196055 61373 -135264 -97345 -102593 -136156 -76874 -35768
17497 -35768 -70626 28962 79357 52812 72904 27957 28592 20718 -40104 9725 81841 70935
17485 70935 94317 66315 57614 -26041 -18305 57020 156298 83422 -62560 48100 149511
17474 149511 143883 146467 184002 35252 -43018 -119273 -95484 -43159 -89239 -39756 93673
17463 93673 90124 46425 115024 108475 119435 169606 129139 170867 130068 62971 96149 93574
17451 93574 44372 161102 242731 209293 352750 516669 564569 683853 907507 1117888
17441 1117888 1212723 1269573 1307934 1260172 1154820 1145516 1298333 1386719 1321341 1392113 1429566
17430 1429566 1375008 1201021 1230284 1271986 1187852 1003726 905282 815937 616946 544550 408816
17419 408816 211054 74319 63960 98476 117635 87107 30590 24896 82579 9167 -3028
17408 -3028 13572 12549 -47842 38157 86075 203398 107029 155451 114910 63980 50235 51007
17396 51007 66470 107790 82021 200628 221454 149167 144029 144044 227526 352427 427162 581440
17384 581440 744311 891923 1026466 1132524 1239904 1280668 1312437 1232067 1202596 1143719
17374 1143719 982165 877620 809218 718727 762472 630356 478985 390887 255311 196451
17364 196451 247464 314672 148032 70533 75707 9079 -12049 133504 166456 139189 124321
17353 124321 117467 7793 -45049 -48833 -114054 -127500 -127751 -91531 28555 101318 75632 53046
17341 53046 76501 25297 -26715 -88085 -51591 -184632 -193907 -154217 -133846 -26899 -62735
17330 -62735 -78950 -89654 -67353 54450 -1972 -128724 -165698 -106804 -39128 9926 143846
17319 143846 161741 249045 289833 253160 73752 16745 20949 44796 2321 42593 97327
17308 97327 107712 54935 -6700 -17643 8680 13451 -46470 -98571 -58124 -79694 -13657 28688
17296 28688 -5599 -31568 -1752 19827 -4775 130942 238100 222395 92579 -52092 -25736
17285 -25736 -36579 -3773 35436 -50956 -49863 21342 67681 103208 138096 131461 38507 94870
17273 94870 65009 61882 45983 -69223 -137334 -41784 -54371 -147855 -291816 -238734 -212935
17262 -212935 -227546 -74175 27384 124385 73123 58938 -7642 -49 134678 163280 117532
17251 117532 127236 138878 147177 119794 76194 105802 -4505 -158831 -194626 -117572 -32235
17240 -32235 11450 13588 50779 38639 -60474 -124199 -66243 -111958 -130087 -34624 31748 -123531
17228 -123531 -30585 -28211 -233705 -249389 -188091 -212372 -275711 -169208 16638 42423 109946
17217 109946 130333 158986 67486 -62937 -3314 23590 -51162 -107449 -83717 -70936 -111119
17206 -111119 -114172 -35770 18503 33256 -952 12908 -100661 -207635 -183391 -86047 -23661
17195 -23661 -71498 -42173 -65540 -129346 -237570 -218207 -85587 6879 -83747 -10761 18351
17184 18351 15953 24895 7836 7247 -58477 3431 96594 126484 119348 13231 27820 -63167
17172 -63167 -102712 -17749 579 2443 -37604 -166982 -88036 93250 133135 100984 85152
17161 85152 25522 -28111 -56991 -139017 -53173 -33993 -55788 -19777 -87782 -164978 -122666 -110775
17149 -110775 -172147 -166418 -136417 -115463 -116241 -175509 -221452 -191461 -104499 -55676 27610 115142
17137 115142 101396 31798 -4893 -6926 6425 -55796 -53793 -46738 -2991 33397 -22049 -52288
17125 -52288 -49801 -58937 -29843 -60489 -129015 -193188 -50153 -24475 -80422 -71818 -10110 -97003
17113 -97003 -63328 40046 34248 111204 62827 53501 -31561 -151120 -148664 -186625 -144189 -43194
17101 -43194 -30413 -97125 -118720 -161942 -152699 -25323 -45854 -6283 38386 65914 118271 116548
17089 116548 49007 42830 25771 39864 113294 74488 25026 16601 -23784 135 136436 51487
17077 51487 -51913 -16507 87492 99580 -78630 -217422 -281320 -281632 -175076 -34400 76782
17066 76782 56428 89274 130045 109780 144503 6193 -17793 -39812 -75222 -21452 -97936
17055 -97936 -128933 -104663 -15421 69414 -12049 -14905 -75004 -47633 9066 -33293 -30614 -97381
17043 -97381 -111578 -108790 -40313 4996 33153 -35973 -99115 -3756 3849 -57911 -12994 -72939
17031 -72939 -50544 -15177 25472 -25520 -27803 -101353 -152234 -94657 -107648 -108348 -159226 -73116
17019 -73116 -47307 -200910 -214521 -102761 -90875 -52748 -44331 -137707 -215115 -226844 -210237
17008 -210237 -165369 -73035 -11402 41743 42112 95855 76699 12698 96109 101387 85384 41682
16996 41682 -7169 -32272 -49326 -11492 75554 23626 41678 103051 155832 205122 223491 238166
16984 238166 213003 49119 -207295 -288081 -173476 -63038 -73562 -46586 6864 -36235 -88132
16973 -88132 -131971 -218261 -293119 -301885 -230021 -59523 -8000 -90484 -127310 -97861 -83498 -48903
16961 -48903 -19923 -68087 -26894 2309 -33919 -45217 -59062 -110434 -70765 -137190 -203968 -143246
16949 -143246 -211491 -260684 -215977 -104054 -102264 -134518 -67375 -24902 485 63307 111721
16938 111721 88874 36496 58131 60176 107982 169091 113320 4088 -22502 -124761 -157256
16927 -157256 -205337 -113483 -58738 -143708 -215070 -132081 -135539 -12957 67560 28606 52976
16916 52976 77835 -19296 -22039 -22892 -47033 -175170 -235171 -162590 -159333 -161320 -100632 -95165 -109933
16903 -109933 -89989 25764 -37618 -63193 -32443 51873 96901 123523 30804 -8927 10145
16892 10145 -82953 -82017 -97016 -58988 20166 -3082 -123321 -238963 -181335 -174746 -178514 -151301
16880 -151301 24184 42153 -73321 -150460 -81357 -84914 -118503 -140318 -155360 -138117 -189064
16869 -189064 -216266 -199275 -200784 -142974 -103257 -7781 38225 40993 39017 19447 99465 222989
16857 222989 111994 -8320 -39031 -45573 -3040 1011 -32281 -65359 -48260 -2510 -44540
16846 -44540 -98726 -82368 -104016 -123689 -68107 13042 26897 -74954 -173733 -18429 207624
16835 207624 211147 241133 166022 47615 -33418 -28108 -100238 -98911 14784 78036 101695 134728
16823 134728 67854 12897 -74888 -177117 -113716 -78201 -78376 -147137 -99944 -98773 -102905 -92913
16811 -92913 -115879 -61263 -71717 -70807 37574 73399 -24398 -102432 -88319 -84081 -184562 -161168
16799 -161168 -157197 -196285 -196252 -152094 -149801 -144311 -68539 -12965 -15451 -39411 31815 -4432 -56762
16786 -56762 -53479 -46235 -120269 -87247 -109484 -30326 33476 61297 105203 162025 120629 -42052
16774 -42052 -60514 -26691 -31666 -8334 30435 60504 -33131 -42429 -93072 -53777 -107058 -193030
16762 -193030 -167022 -251907 -318536 -270906 -142096 -43492 -109350 -126050 -55133 13545 2592
16751 2592 -81758 -66224 45612 141714 51850 -85756 -4135 22583 9414 31876 -65497
16740 -65497 -159466 -131433 -53867 -64229 -39039 31426 74288 49484 94243 70161 27867 30700
16728 30700 13970 -101269 -135891 -71489 12818 31546 27650 131254 58117 -17808 20159
16717 20159 24557 -15281 51688 1463 -109780 -63809 -120363 -159737 -133696 -121923 -107241 -43545
16705 -43545 -92433 -135946 -136436 -72172 -80009 -66054 -10399 -8408 -42036 41613 -25322 21187
16693 21187 8375 44519 -17324 -164583 -265515 -171719 -87609 -9076 -74745 -82615 60397
16682 60397 22307 -108020 -48442 -64312 -93611 -126426 -198335 -81379 22605 66732 -5532
16671 -5532 -30223 5350 65867 47745 33644 -61543 -41917 69756 69752 3635 12298 34819 1881
16658 1881 -20246 59319 15323 20231 69926 13742 -93574 -94955 -114078 -58435 -50541 -137842
16646 -137842 -242974 -270087 -293637 -247209 -184476 -186083 -196437 -16097 99344 175553 77420
16635 77420 122552 104623 97114 86066 45581 54003 -1203 37652 84848 -14734 -68494 -53731
16623 -53731 -57015 -51356 -50376 64920 82407 137663 119781 39344 -5744 -73786 -58727 1281
16611 1281 5956 -48498 13257 42123 41896 -61465 -118819 -41383 -19679 9011 -39226 -20866
16599 -20866 66121 108259 51842 -26898 -134018 -186860 -173259 -146020 -188410 -131250 -77911
16588 -77911 -108717 -27667 66886 11750 47741 114695 101503 21946 -23529 -45247 -119626 -102807
16576 -102807 68872 120209 122962 166150 157047 -2894 -17528 -72779 -145480 -25951 8383
16565 8383 -74951 -127256 -177539 -101844 -64781 12056 65680 65848 -2249 22220 -7765 -104757
16553 -104757 -65291 117291 109372 69123 59726 33753 49494 -39830 7598 51802 87077 112052
16541 112052 76985 57081 146562 170525 53303 -10352 -79686 -70303 -133013 -162360 -107752
16530 -107752 -835 98094 128815 126046 136691 177789 90889 -29895 -111429 -136257 -228351
16519 -228351 -186456 -168035 -173222 -173464 -77912 -47164 -20826 -16558 -109752 -156709 -126771 -173901
16507 -173901 -120410 -10159 85796 90330 -37937 -85239 -49592 -45388 -69982 -79488 28516
16496 28516 87148 -19773 -66070 13723 -9865 -24095 -56813 -46578 50922 100640 -88549
16485 -88549 -145446 -191652 -112013 22491 127786 197484 220357 141975 61649 11697 -59851
16474 -59851 91 72324 44401 -44465 -38117 -37329 -61461 -62694 29529 -755 -6842 -75230 -76779
16461 -76779 -13628 2371 23130 36239 120969 28247 -24318 -53938 -24622 75303 65004 66456
16449 66456 90774 -9422 23911 41261 9317 14288 -10310 -34660 24140 59466 -39265 -100750
16437 -100750 -34057 -46430 29130 26007 8705 22009 15370 -16056 -318 -45269 -98265 -55249
16425 -55249 92488 35851 21177 22368 57838 161372 116591 -16811 -117022 -194294 -201787
16414 -201787 -188912 -174382 -78933 -73702 -176654 -206898 -218742 -133010 -107061 -65003 -111630
16403 -111630 -125415 -127600 -78459 42591 253903 211049 44088 -45165 -82909 -175025 -176406
16392 -176406 -168786 -242633 -202298 -135620 -113100 -109304 -151635 -141545 -88499 6635 -20917 -196485
16380 -196485 -226194 -94456 5447 -15627 -33375 -15490 -5246 20388 -40015 9302 8859 -17233
16368 -17233 -39702 -24824 73188 107801 62323 -32733 -83291 -142497 -151511 -187201 -112823 -57509
16356 -57509 -31951 61488 40436 39172 56958 68629 -30115 -102102 -96187 39207 67127 24528
16344 24528 97257 59570 -86638 -231119 -153953 -222175 -230776 -119112 -16328 -1344 -38195
16333 -38195 28193 -13262 27704 23985 -24428 54391 63719 50295 -5787 30171 88923 73881
16321 73881 58137 119 -17719 23407 36778 31797 -52954 -132110 -171596 -137521 -114462 3457
16309 3457 125567 56312 40959 42732 -3066 -5026 206882 258564 225074 220687 217493 202450
16297 202450 147052 116658 125688 45869 -51905 53424 56465 52607 85489 27231 11022 50068
16285 50068 46539 8427 -145909 -175668 -97913 -133904 -78236 21984 -11717 -84891 -29399
16274 -29399 9188 -69793 -112378 -97670 6065 19694 4457 32667 15413 -69893 -135036
16263 -135036 -123409 -69136 -40373 -44267 -87445 35096 86078 4565 -34130 -113878 -202690
16252 -202690 -136287 -149607 -139862 -71466 27188 10436 -42533 21423 183205 168522 77671
16241 77671 -58719 -168852 -173237 -130068 -194501 -216716 -236865 -165530 -160320 -104298 -36526 34711
16229 34711 -18090 5498 67002 32571 56016 -1642 -191681 -141710 -81395 -69088 -108516
16218 -108516 -130694 -171998 -175584 -217176 -230446 -155534 -164111 -178188 -78486 -71872 -72392 -111876
16206 -111876 -163576 -101846 -61081 -28926 -116368 -121030 -103579 -51248 -37136 -92445 -109028 -119713
16194 -119713 -106997 -89262 -174334 -160625 -165543 -100758 -79013 -150566 -213851 -213690 -149747 -46675
16182 -46675 -2375 -63347 -78203 39809 -3024 -61607 -152475 -31965 375 -2418 47032
16171 47032 -33804 -120723 -114542 -46704 -69462 -153878 -119010 -122249 -154826 -25730 -27675 -100862
16159 -100862 -135100 -119683 -29315 -27343 46256 27250 -160344 -163579 -124895 -84500 12702 44375
16147 44375 105617 96497 32011 -86234 -169628 -147351 -131313 -159954 -191805 -261143 -141814
16136 -141814 -24232 -28808 19742 124201 77810 -56492 -157906 -103008 6000 -72231 -45939
16125 -45939 3805 39333 50035 33734 8677 -46725 -108913 -159950 -139385 -43301 -92900 -172230
16113 -172230 -137828 -128197 -77137 -53267 -17492 -10816 30039 35314 1383 -73202 -33131 10179
16101 10179 8370 -44374 -104207 -120881 -116610 -58579 -65764 -77442 -139219 -146624 -75099 -124267
16089 -124267 -94451 12433 12353 41974 65060 77461 32163 13372 -29307 23876 157664 124697
16077 124697 182450 102641 -393 -25626 22293 19474 -28969 -123770 15095 77480 38107
16066 38107 -89891 -168548 -115772 -14480 185308 197176 219598 126083 -12645 -202565 -222426
16055 -222426 -160356 -176407 -72755 -47959 -7904 -8575 -70555 -187194 -132921 -28758 -68948
16044 -68948 -57845 -61038 -81510 81937 95504 66202 -47170 5049 4352 -33075 -55998 -86595
16032 -86595 -117628 -50887 42450 170387 204793 192113 108643 74421 -12097 -24009 -121254
16021 -121254 -120500 -132962 -59021 -71597 -81288 -17010 62128 177144 163344 72413 106461 57673
16009 57673 15670 72189 -33156 -49560 24260 139096 112798 67488 6686 -14537 -12305
15998 -12305 19611 93532 130209 88180 73477 61720 20328 -28212 -100718 -163673 -238718 -185401
15986 -185401 -141319 -102916 -116740 -27459 62756 90575 -23027 4309 68407 -21198 -82865
15975 -82865 -126243 -127050 -147563 -218292 -281593 -233497 -321275 -363081 -283963 -91346 -79079 -75798
15963 -75798 -88209 -80742 -67310 14585 36136 -44450 -40124 -85154 -107493 -59323 -44965 15020
15951 15020 21005 4906 -3653 -2333 99532 262212 280930 231901 134121 38581 15990 56997
15939 56997 15064 -36908 -90394 -51391 4896 1960 -51201 -109948 -132473 -118716 -32198 10716
15927 10716 31811 7050 15275 50622 2602 -65533 -79350 -71435 -133357 -185535 -180890 -190566
15915 -190566 -148617 -167249 -124239 -130306 -147938 -138152 -55858 -50456 -76924 -116501 -206543 -190053
15903 -190053 -111891 -28790 -26456 8683 -41292 -37583 -78790 -80573 19196 -39117 -30308 15441
15891 15441 49065 104828 40796 -21809 -41071 3723 88897 64218 -8414 -84555 -64148 46621
15879 46621 -2008 -44539 -89755 -131698 -113388 10556 80915 25952 -1337 1487 -44343 -94856
15867 -94856 -32595 -1189 -169260 -184988 -192815 -140552 -35612 -44846 -63829 -49508 -38544 70906
15855 70906 51756 -37757 -5849 53790 76152 -19359 -19070 -13697 -40141 48823 117271 -12355
15843 -12355 -72664 -4154 87959 49772 35829 125727 91694 87576 62222 -37218 34683 14074
15831 14074 -49544 -58889 -120284 7220 151567 171521 148077 138288 86311 80237 13275 -3702
15819 -3702 -32081 14430 95642 165447 98553 125105 200852 256188 243805 120972 -1409
15808 -1409 30164 62283 61714 61836 112128 70545 58831 151688 122027 83286 102835 151517 83898
15795 83898 32366 46567 88001 35186 107553 134956 -22134 -64277 -103283 -76963 -146224
15784 -146224 -69200 31956 420 -23831 27679 -27578 -67932 -41800 -14749 -21584 65337
15773 65337 -48763 -159526 -108688 51072 57224 1803 50894 62675 50820 10361 -99433
15762 -99433 -78329 -80572 -20177 76686 -78551 -148063 -241735 -290293 -233177 -146786 -173903 -160770
15750 -160770 -153314 -96190 -27884 -66971 -163768 -137626 -126053 -35314 11806 -38802 -70649 34370
15738 34370 -32809 -80496 -71535 23451 103276 168471 185128 158559 125958 168647 175658 134458
15726 134458 -33012 -108746 -155774 -70761 -57749 17010 34297 -106247 -222823 -168700 -142191
15715 -142191 -86186 -79006 -104581 -126731 -131995 -137406 -87689 99060 200431 135469 111617 101576
15703 101576 97823 162464 121266 112997 105896 67390 73788 48647 153358 151269 -7406 -65731
15691 -65731 -112880 -7075 -18917 15257 7744 21378 -56382 -72293 122 42375 113469 200849
15679 200849 144722 92177 40452 -11226 -57468 -28970 -50499 -57661 32518 38984 -13551 -34486
15667 -34486 -26737 -37402 -21250 69422 187283 250430 193783 149714 85836 80315 56730 8400
15655 8400 -46600 -159167 -59374 131770 249843 219723 31563 -64284 -82031 -134434 -175110
15644 -175110 -120112 -110889 -82363 -56292 -37580 63820 28107 103133 193973 107249 124208
15633 124208 113801 11237 -47419 -130465 -153403 -6757 55241 11043 -64242 -153459 -140724
15622 -140724 -99555 -45434 33769 90630 16289 2018 88255 84958 52890 116139 132865 117538
15610 117538 1525 -67596 12853 61334 167287 203023 105865 -5562 -112978 -85249 -36452
15599 -36452 52504 10128 -131517 -214325 -187093 -154104 -83630 -80248 -68475 -61236 -38033 22144
15587 22144 9553 -54369 -75470 -97003 -149075 -203405 -238767 -180563 -94344 -111437 -131031 29267
15575 29267 50798 -66533 -21912 20045 -6665 -83501 -129599 -117383 -32165 -24687 -74449 -107343
15563 -107343 -58088 -29166 -67468 58803 115036 88269 91678 -3990 53883 23771 -44816
15552 -44816 -115107 -74786 -51041 -95107 -51646 -65795 19326 -35658 -139921 -71919 -95625
15541 -95625 -81383 -72408 -64537 2960 84306 93224 55708 114098 86623 81759 42069 -4550
15529 -4550 28304 52009 44748 61000 41664 65518 150118 265080 167224 61877 1193 49412
15517 49412 13808 -38591 7118 21051 36498 52202 22717 25998 -32414 -66250 -55534 -10441
15505 -10441 15175 95907 35876 -10345 26858 -17882 46 19141 -924 -19360 -4212 39869
15493 39869 -1194 -52547 -98908 -62889 -213152 -211924 -139124 -25621 53849 70397 24600
15482 24600 33165 -41415 -92527 -86469 -142820 -116930 -40018 42236 27902 -29011 -82558 -145290
15470 -145290 -163463 -177880 -134204 -29702 -60057 -163657 -238862 -177903 -78615 -146281 -128053
15459 -128053 -160829 -90223 -52278 -59597 -94067 -122950 -159150 -142058 -29269 13181 -21696
15448 -21696 -46329 55611 145706 123893 125924 106475 15965 70576 22024 -83924 -104466
15437 -104466 -48367 60229 -4501 -61485 -81459 -78513 -82308 -23413 65535 137820 76630 24810
15425 24810 -3324 -49800 -157500 -189558 -94769 -3915 -42802 -46983 -71479 9016 80994 142358
15413 142358 140542 35817 12198 -49269 -109115 -111800 -122779 -106885 -127076 -87587 29439
15402 29439 98555 139034 128061 132226 145570 37758 -27121 -21295 -11493 -112396 50580 195477
15390 195477 146217 825 -7919 44763 127177 159735 149009 47108 21662 8049 -78142
15379 -78142 -158736 -126230 -62544 -132587 -149799 -91790 -97552 -26556 -71654 -102867 -79947 -156339
15367 -156339 -99724 -43138 -36618 -66379 -84348 -65822 -2006 20339 -22835 47285 30855 30518
15355 30518 54988 23281 -14231 -30568 -154244 -169675 -39512 -1569 -48255 -80375 -28230
15344 -28230 -12872 30705 54151 51244 -30997 -42989 -21411 -9243 132521 177508 174225 114427
15332 114427 91121 14389 -98279 -144662 -67016 -88031 -102047 -127205 -87524 -33232 -20657
15321 -20657 -7322 -100657 -157628 -86749 -45384 -104342 -93905 -32235 -22922 -88040 -62085 67573
15309 67573 51281 35237 -63464 -27854 -33878 -58079 14179 -3349 64576 44461 -68565 -156974
15297 -156974 -141770 -117053 -45432 30825 135222 1990 -45156 22646 101162 43400 -65581
15286 -65581 -79020 -73440 -59019 4420 -15718 -1173 -13998 -90236 -166372 -82688 -25072 7596
15274 7596 83711 60675 -18148 -46314 -33272 -86564 -88285 -169714 -98312 -95126 -216372 -193915
15262 -193915 -142675 -33817 -60572 -51240 -188033 -279307 -261289 -132062 4520 19074 21507
15251 21507 -10562 -48946 -55269 592 -49000 -146414 -200424 -211303 -155152 -107991 -125572 -128921
15239 -128921 -133207 -90523 -19195 9436 60812 47405 41107 -36198 -163677 -157487 12862 32004
15227 32004 -71806 -100660 -171111 -90078 27689 -21043 -33085 -17563 -46949 -77905 -65550
15216 -65550 37253 68073 -6009 34159 28519 60016 68354 -28680 -49542 59443 135844 86183
15204 86183 97183 -38346 -127679 -95107 -126354 -47350 63467 -39366 -235957 -207277 -278706
15193 -278706 -262456 -200555 -183746 -81923 -17920 14482 -44878 -51429 -38000 15032 77067
15182 77067 -4785 -86185 -165355 -126587 -45629 -76213 -4781 58304 100143 -34884 -90613
15171 -90613 -16854 146760 139781 -15814 -82710 -124554 -187540 -152306 -133169 -162768 -63385
15160 -63385 45702 -32908 -255 -29400 -92037 -54946 -93890 59873 45452 -8708 -56801
15149 -56801 -99994 -141585 -160799 -52928 59442 70831 104471 54180 31190 33266 -52128
15138 -52128 -95805 -104807 -108136 -100315 -125281 -108208 -36170 -30849 39657 -3247 -71966 -33963
15126 -33963 -34045 -63189 -80415 -57794 -109389 -172743 -184173 -133554 -29631 -43109 -118948 -78918
15114 -78918 47593 31119 -44213 -23085 -107226 -50816 -14709 -42863 -97758 -120571 -121832 -66572
15102 -66572 -112319 -154666 -51340 -35750 -45513 -98215 -61007 52686 112765 72665 153938
15091 153938 226486 202937 151685 63340 25649 26704 147696 74184 5396 48461 3476
15080 3476 -87448 8033 52438 -21175 57591 137573 64103 -28453 -65231 -76499 -41306 -30263
15068 -30263 6390 -70127 33790 93813 34383 72869 44502 126270 149020 64334 3748
15057 3748 -66113 -83691 -22567 -12705 47803 -36725 -17495 12828 -64378 -33699 39469 12711
15045 12711 -42401 -130420 -174135 -120016 -54729 83770 76367 -37926 -38940 -9828 -22663 -80057
15033 -80057 -117385 -87034 -32020 36554 142535 16877 -76488 44292 150198 204579 148664
15022 148664 13109 -67229 -32843 22569 133835 87082 60202 39133 -36872 8871 129978
15011 129978 129860 80188 63515 157655 163097 73865 49415 63474 81580 135840 242348 360914
14999 360914 459609 657916 1133000 1812270 2065840 1907125 1618259 1275845 886177 605001
14989 605001 458900 414556 305093 95118 -2204 86146 91989 48457 186136 160307 81379
14978 81379 115783 127246 144375 88580 30384 93963 140737 94300 51783 91716 95150 52960
14966 52960 -4608 -96886 -89183 -73178 37491 39322 58984 65003 77599 63131 4992 3181
14954 3181 -3810 40961 -8941 -33434 -113857 -61613 53452 12103 8442 63133 144913 153937
14942 153937 79168 -67040 -93690 -66736 -55649 -57891 -25791 -56260 -37914 -4540 76719
14931 76719 119512 116015 109470 112156 99593 43285 8054 49784 112165 14418 -77433 -4885
14919 -4885 24822 -10819 10641 -76620 -95171 -41571 -69009 -82724 -22180 -23313 -80408 -93749
14907 -93749 25121 46127 -33866 -55553 -75295 -59792 -34857 -56494 -47370 52711 64768
14896 64768 9647 -84333 -47893 -48364 -65987 -54548 39010 117750 106229 -68677 -35216 36363
14884 36363 67757 3720 -70986 -97074 -2998 121003 6191 -60909 11089 83821 46089
14873 46089 28339 118590 177275 210004 235057 205139 84821 59736 37237 9458 21691
14862 21691 -50678 -36286 30289 22181 -15732 65730 119973 71812 69651 -15676 10186 24448
14850 24448 -67279 -80294 -76065 -131969 -72491 10192 33301 -65645 -138903 -147238 -86666 -73270
14838 -73270 -37768 -39274 -44185 -83040 -91496 -69829 -17903 34188 44965 -1114 -24283 -97594
14826 -97594 -192294 -151465 -110866 -122840 -69149 -2151 -7320 -145748 -162887 -37597 51055
14815 51055 135214 259369 276349 222061 158668 99637 101044 80673 8800 -29899 -25696 33667
14803 33667 -40222 -108054 6322 -87435 -199007 -252353 -168636 -61876 60558 102192 121227
14792 121227 224290 191649 62858 -56470 -148746 -94897 5260 9702 -50712 22223 38453
14781 38453 72395 18598 96083 135867 8266 -101923 -27842 -49796 -58308 4938 -49533
14770 -49533 -145187 -121074 -74368 -31485 -42532 -62306 -91210 -19432 71855 103218 132645 167475
14758 167475 113992 23436 -62335 25389 13146 -81740 6011 113299 111601 102899 57845 15818
14746 15818 -117644 -126696 -76585 -45305 -84354 -7850 -3670 -66507 -54228 74793 127950 97239
14734 97239 23446 72161 -4355 -4847 38881 113987 161844 25985 -37968 -51946 -9604 -21407
14722 -21407 -19915 -115093 -97212 -60609 -78434 -81333 -49275 -60841 62470 14971 4932 -10864
14710 -10864 -97621 -113849 -94676 -133920 -152188 -278249 -307413 -190415 -167652 -128927 -132099
14699 -132099 -68100 -15252 -2397 -101387 -189112 -203818 -83609 -24253 48709 128776 124068
14688 124068 89280 99870 49235 -35882 -155086 -135364 -40830 -85168 -107932 -68180 37482
14677 37482 74324 39070 120488 159445 1526 -27129 10534 -38206 -150992 -192966 -175787
14666 -175787 -86949 -33548 -31140 -71375 -65340 -94501 -147783 -197936 -98821 -87503 -135362 -437
14654 -437 -36932 -119228 -87796 -100867 -68308 11789 44787 90709 79102 -25552 -52117 -41791
14642 -41791 -109721 -42039 -32771 59295 110570 82965 7250 -75265 -94481 -82599 -84200 -100298
14630 -100298 -127577 -127726 -116651 -120642 -63002 -60196 25757 59042 -28889 -23350 -12358 16481
14618 16481 40178 98628 84388 25361 30927 97778 134792 42557 -27640 18795 155432 166205
14606 166205 115345 91876 111035 138245 95718 88479 -5655 -69952 3743 -2195 57658 76744
14594 76744 73544 71372 86497 18733 -51814 -6470 102980 19200 6596 -28555 -52196 28776
14582 28776 63572 5911 6476 18432 -14860 -35500 33245 114312 167315 64847 -15212 73565
14570 73565 118538 129846 98655 113796 128781 105511 109557 137300 132957 71278 37704 26853
14558 26853 41358 81195 66453 -1331 -134101 -172123 -208697 -256731 -262720 -185171 -42176
14547 -42176 -5603 -47314 -102113 -144170 -198377 -147495 -89945 -50313 -32309 -3149 21813 1418
14535 1418 -47382 67781 126472 108865 74155 69563 76383 59980 41530 33902 -35684 -79898
14523 -79898 -72187 1816 -13183 -118403 -107681 -84736 -179392 -107069 -124432 -100249 -46636 5003
14511 5003 -42931 67195 59074 67643 107826 -816 -61597 -21738 78148 92769 -11360 -75438
14499 -75438 -102848 -44322 -53899 -107948 -76728 -79442 -31772 15389 24303 24748 69949 99792 113356
14486 113356 66876 -3746 7438 -59749 -70854 -23725 -13278 88 17079 53971 149307
14475 149307 144110 88343 125729 123214 98703 4511 -29337 -6543 5769 -9456 28194 -87880
14463 -87880 -65413 -77721 -172501 -211217 -181655 -97721 -108921 -63383 -2061 15980 51334 -16378
14451 -16378 -33753 56474 108871 117604 44332 81497 224197 226776 111490 -66381 -117164
14440 -117164 -156974 -182661 -243448 -248641 -152615 -75637 -1669 991 -97896 -124646 -79952 535
14428 535 56238 -57959 -74803 15797 25625 -54542 -78966 -44229 -65294 -88786 -188171 -182979
14416 -182979 -161812 -48862 14401 22061 73215 22728 -7641 4568 26186 -52737 -102251
14405 -102251 -98722 -81252 -54206 -132559 -146604 -155533 -103204 -54633 -39106 -11985 56852 46692
14393 46692 -43157 32479 15611 -34957 -27922 -30861 55321 110468 38890 -30247 -55211 15816
14381 15816 -8084 -26903 -12380 -4425 17338 19613 -6751 -59722 -40474 -49539 -71882 -167229
14369 -167229 -200821 -90798 -32960 39596 46892 109656 149093 218706 215855 194814 118037 -11155
14357 -11155 -88285 -18845 4777 -63660 -56267 -43604 -4110 68148 147672 29067 -53509 -38546
14345 -38546 78722 -326 -40788 -16338 -44099 -98058 -58643 11527 -240 56711 -22722
14334 -22722 -107272 -63465 -56977 -69546 -102738 -101947 -20681 132202 101116 6356 28950 40427
14322 40427 43663 40812 -50646 -125804 -160031 -170105 -88369 -84469 -107057 -95163 -76939 -25503
14310 -25503 -28316 -71417 -72386 -3799 -218 -89098 105 -30857 -56498 23087 167926 200692
14298 200692 192266 53334 -6063 -58206 -13256 -45744 -101200 -191722 -138469 -115582 -43956
14287 -43956 60921 63641 -54782 -128296 -116834 -41639 -49218 -83927 -74597 -20643 101318 138358
14275 138358 22746 -61578 21027 44426 66215 70994 53083 89985 59686 51645 59315 111373
14263 111373 89340 69608 78400 88486 53007 49662 37859 72266 84882 6277 21626 62881
14251 62881 123746 75506 -11482 127029 72230 -52598 -35731 31962 88957 107397 125114
14240 125114 54014 67510 142908 60710 -8675 -56443 -8465 -35601 -75149 -13858 32095
14229 32095 91010 -10905 -90710 -83684 -45776 -12959 73217 96045 32675 -116342 -158735
14218 -158735 -84536 -86674 -80750 -94842 -35466 56794 137060 123070 107486 23130 65092 116540
14206 116540 116192 123767 76831 61735 106083 42006 -55981 -40702 -110893 -111917 -148886 -170575
14194 -170575 -73276 -28504 -86313 -102628 -116969 -118507 -195630 -177726 -108128 -73742 -58730 -36536
14182 -36536 -71968 -24341 -24966 -34252 -29067 -57946 -76979 24571 123727 109737 64253 908
14170 908 11654 -33265 -27564 36978 113494 179647 148227 31427 -6156 13679 -25170 125133
14158 125133 223321 151559 29128 36465 16064 -25756 -31192 4412 65132 17535 -69099 -34311
14146 -34311 47038 87748 100697 136210 9945 -47207 1248 -15462 -38976 20209 40087
14135 40087 -70616 -134822 -172267 -156755 -56896 -64165 -135341 -141635 -111538 -78841 -86378 -67532
14123 -67532 11851 42707 23593 -59443 -154871 -71601 -7035 -137760 -256095 -262609 -259829 -168576
14111 -168576 -70817 -52794 -40979 -44318 -113062 -162727 -177320 -47353 -33805 17513 964
14100 964 2221 -21410 2715 21071 -20826 50011 82819 54131 93148 83566 26544 20932 61137
14087 61137 -20910 -118810 -70865 -32753 -180531 -190559 -127161 -160210 -234389 -177979 -157541
14076 -157541 -38611 -40772 40741 -2390 -41573 25064 -82212 -181034 -138448 -37962 12461
14065 12461 8752 16423 -30730 -142148 -210883 -96636 -7060 -73269 -121332 -124319 -84526 -63375
14053 -63375 -83124 -132751 -140842 -163290 -175609 -70394 -40448 -18299 -33597 -19880 -69376 -184180
14041 -184180 -221458 -98730 -119542 -252874 -240302 -61417 53364 93337 122016 150876 74962
14030 74962 47462 -55486 2660 137825 109644 37283 -30075 -137455 -136751 -121802 -152513
14019 -152513 -154221 -44388 12921 841 67424 159150 216255 147006 18082 -11387 -20680
14008 -20680 -9837 -4458 21810 -28257 -87015 -55111 15822 24791 -14226 72527 99640 92993
13996 92993 76406 46250 14486 -2138 -162381 -114264 -32253 -15054 -33098 -50321 -81565
13985 -81565 -96770 -36652 69762 100851 26962 -9443 -46170 -52718 -24434 -60475 7335 -13474
13973 -13474 29236 61319 -13949 -90615 -85080 -14817 81418 105672 -13499 -114766 -138625
13962 -138625 -109139 -40315 -51865 -62981 27344 99430 164004 137398 73110 38129 16584
13951 16584 5470 49974 35956 31091 28988 -19476 14614 125385 176853 139774 28517 47591
13939 47591 65369 119518 70337 66867 54776 3547 -42732 -86949 -102709 -71600 21645 124363
13927 124363 67217 9671 -40288 -69898 -69189 -94986 -65766 34247 18075 31102 62191 104231
13915 104231 139001 40362 -67826 -84822 51602 162800 133129 16249 -39070 -48431 -49888
13904 -49888 -63469 -15813 138523 65803 14844 37385 -20028 -20545 -88506 -79370 -127586 -199951
13892 -199951 -147119 25383 99998 41274 -774 -61781 -23064 51644 -16024 -26299 -57475
13881 -57475 -54339 -85129 -102486 24895 41384 -49232 -104852 -51480 -48002 -57198 61596 61485
13869 61485 68329 33873 -5120 27268 15837 109311 148205 134928 3390 -76058 -96408 -61395
13857 -61395 -60814 -62075 -2906 60447 56129 45680 -14040 -97367 -159395 -182341 -128853 -228363
13845 -228363 -304828 -232986 -148343 -137773 -21752 -25834 -47145 2577 48426 125668 97004
13834 97004 -73912 -164608 -207704 -123502 -73413 -20080 69444 -36578 -126907 -151546 -113542
13823 -113542 -64837 -79443 -117216 -44436 -28011 23795 33821 132201 266139 235312 123686
13812 123686 85229 106122 37857 903 -9388 -56393 -79377 -18789 68301 -46572 -180726
13801 -180726 -95227 7193 109865 79023 23914 131676 142877 131829 87316 -6011 -72651
13790 -72651 -37876 -113652 -138902 -68746 -70231 -19741 11884 97806 39337 -37180 -37444 -42392
13778 -42392 -156071 -192065 -137107 -122095 -26758 107585 102960 151597 173992 84456 78572 77864
13766 77864 13163 -108092 -65865 -46959 4597 4504 38364 -20096 48563 71253 51870 91604
13754 91604 99530 23007 -23336 12558 100519 97673 26519 -126276 -179914 -100622 9389 87567
13742 87567 45089 65869 81380 98072 79993 59720 -11086 141385 218223 202662 61780
13731 61780 -42883 -105869 6481 -8053 -75166 -78052 -22763 5440 13302 -24187 -23111 -17021
13719 -17021 -136799 -50314 -27422 -91502 -47617 14802 106582 91996 108919 115121 141697 247546
13707 247546 203210 117938 9756 25447 21819 58274 119947 175373 162206 187158 203191
13696 203191 236548 224428 185861 32815 63624 150483 52148 9815 -4985 -51042 -91408
13685 -91408 -128985 -156561 -92303 -106564 -88442 24970 -25348 -15375 50536 45228 24548 17317
13673 17317 20872 22734 143287 139559 70779 106504 146122 24480 -6299 98906 55573 57080
13661 57080 -45231 -93544 18268 20455 -106991 -240833 -288164 -299331 -161151 -72556 7481
13650 7481 81167 185647 280890 136435 35055 118858 219288 200654 109391 -3777 -55646
13639 -55646 -6184 39345 71329 152270 127937 127006 166964 44234 -88134 -22440 13601 63772
13627 63772 19991 -7622 12527 -40960 -37274 -59147 2382 -18552 36555 -40678 -169874 -147866
13615 -147866 -212694 -167114 -74026 -47822 73151 77478 184957 287758 293185 184373 169219
13604 169219 161679 108376 30558 27476 107917 74731 25775 -8572 -21937 -106635 -115156 -65849
13592 -65849 19996 35213 14750 -25175 -52640 -115778 -117278 -64242 1479 -12395 -7197 -2687
13580 -2687 54907 -79979 -131620 -85670 -151786 -158780 -200104 -161650 -138081 -77700 14513 3262
13568 3262 1172 25031 -1433 -66550 -2282 4417 -92884 -124503 -60804 19613 37782 74961
13556 74961 -13010 -85927 -67866 -79755 -66478 -105643 -87129 -93327 -38211 -103943 -128704 -166807
13544 -166807 -173647 -182568 -70832 -28245 99116 179747 159640 156668 87357 -31686 -89807
13533 -89807 -53922 24625 85196 89155 40393 -108455 -30968 43150 -53217 6734 8808 -8421
13521 -8421 20185 50729 3765 21549 60357 -20750 -62738 11697 6996 5721 -561 -10553 -27261
13508 -27261 -51133 -20430 -20005 4002 -1595 3903 2966 -6560 -4520 62861 66721 -167324 -226145
13495 -226145 -170733 -211482 -224047 -213064 -116684 12620 31806 -2232 82945 80140 19544
13484 19544 -41064 -88709 -35196 -12131 4528 79564 69610 77039 80680 233530 224152 89013
13472 89013 -51297 -33311 -53315 -89549 -131706 -149976 -19945 7559 14350 58921 -24796
13461 -24796 -69309 -47743 -99782 -24644 62658 124672 91909 63592 111439 70288 -24934 -28447
13449 -28447 63127 114558 96282 43860 -1462 14385 84700 80143 117286 92852 -11318 -150741
13437 -150741 -154232 -65488 -121354 -61110 -79350 -125271 -100840 -42681 45418 -34626 -44024 1510
13425 1510 -44409 -62928 38792 162889 221197 85278 -27090 34727 11444 14524 -44862
13414 -44862 10472 -45156 12090 11002 -36038 -65491 -124652 -127427 15289 -33870 -111683 -166493
13402 -166493 -104037 -43532 -14616 -32841 -34660 -104681 -106031 -43859 -38570 40636 69369 38615
13390 38615 18780 49083 107484 69034 32985 31331 41264 36860 88371 51868 35447 -95947
13378 -95947 -96507 -17234 -32886 -114602 -206125 -216094 -93200 -47886 -5611 76038 26591 -8276
13366 -8276 -48101 -93764 -101162 -11972 -134316 -205986 -246781 -111843 10252 38420 53117
13355 53117 -28928 -99275 -130597 -170408 -190260 -148995 -81115 -8323 60420 139077 164463 238272
13343 238272 254481 64103 -66010 -65757 -47689 -104056 -97386 -41584 -32879 -5358 -30763 -69622
13331 -69622 -156537 -106890 2476 81582 148235 155044 97219 -53192 23323 170055 120525
13320 120525 42606 9724 -33714 931 -39842 -140512 -104797 -129311 -100421 -49196 -192181
13309 -192181 -172824 -110293 -101001 -51711 151260 225276 235518 216282 129600 83230 15421
13298 15421 -27677 -32287 34113 -1435 -47321 -54627 -32010 -117677 -111005 -106436 -61948 86163
13286 86163 134594 148086 77392 -13061 44027 -12949 12082 46208 19983 84031 17315 -13096
13274 -13096 92770 137282 126155 57809 -7313 15882 63905 -22207 -107099 -105577 -117882 17976
13262 17976 36085 103170 92034 84426 158546 149730 50792 -51215 64699 183286 219564
13251 219564 111315 -13631 -114014 -33119 3710 -10950 34864 163557 352773 294684
13241 294684 116615 39610 -11730 -13093 -9708 21747 96962 119660 154710 819 51932
13230 51932 219432 174736 13376 -29974 13847 59935 83263 78819 30053 41641 35861 -93335
13218 -93335 -121231 -121021 -104454 28779 133748 64555 -8307 73226 193199 248452 224604
13207 224604 145494 66937 41295 66103 151925 137556 35597 -60394 -34185 35207 66128
13196 66128 5246 -88851 -99574 -82087 -79182 -11857 -25885 22083 35596 39634 37330 33811
13184 33811 24803 145443 156805 108342 118637 78455 48156 106442 119015 114867 107924 91267
13172 91267 133796 91705 2507 11059 4863 -971 30091 47919 65705 13229 48620 49558 75794
13159 75794 77422 18746 22341 15695 -1198 -8226 -47478 3062 85867 147730 47185 65578
13147 65578 88233 121275 17352 38258 4517 54930 46746 40389 127035 147623 108548 178234
13135 178234 179582 144517 163611 136658 67565 85376 99561 107073 95156 51785 81025 133794
13123 133794 56960 -67301 -188910 -131758 10241 219055 237888 90475 -15956 7127
13113 7127 -29242 29218 -26733 -8476 18936 -24351 -96140 -84353 -12951 118444 43810 2808
13101 2808 -46687 -1105 77239 65707 71606 120322 -24355 -43219 -16878 55681 93197 16939
13089 16939 -38288 -63343 16195 108998 79303 28421 -13019 -17435 43518 44369 61083 62840
13077 62840 56092 153663 234941 159813 78978 41400 63343 30074 -2686 -47709 -89041 -141784
13065 -141784 -120373 -70812 -26513 -1421 -33812 53986 71902 101982 166720 123668 119522 127088
13053 127088 257244 168749 89828 157578 151659 133431 86779 -118 6438 53435 128544 138332
13041 138332 57111 -93881 -166421 -32579 39747 -6093 -24535 -40596 -41590 61008 159401
13030 159401 90568 147787 153984 145788 174442 152085 -46041 3284 -8870 -46523 -39518 45913
13018 45913 68349 94702 72935 -38905 -131384 -165765 -104633 -72079 -43796 -59548 37925
13007 37925 -28482 -28605 86908 110002 77350 55186 40814 108463 29592 -112480 -141542 -122097
12995 -122097 -134132 -92639 -58013 -172167 -126196 -6199 -29213 -166403 -172818 -118225 -152371
12984 -152371 -164258 -50411 9420 -3830 -44361 50588 -33196 -109038 -83655 -71698 -26838
12973 -26838 36893 -8571 -1113 -43207 90711 161796 39744 -70178 -49253 -58359 -55541 -121104
12961 -121104 -131428 -86085 -14052 87686 44089 -37758 -98117 -127878 -258662 -234561 -123492
12950 -123492 -33676 -49586 -111590 -70739 7367 19518 62080 164362 204733 165770 119246
12939 119246 45622 -21268 -78303 17334 111910 52729 35393 100431 250265 227528 159863
12928 159863 112160 -31828 15891 -7270 -112315 -129928 -122946 -32582 101188 138120 118305
12917 118305 93570 113259 194497 233181 146020 -116836 -154457 -45151 68240 209946 151771
12906 151771 7696 -18897 -45459 8571 33747 -109334 -119003 -40648 3515 40973 82133
12895 82133 67138 1062 -38581 -34514 70536 -8142 22084 42436 30604 15751 3096 101394
12883 101394 81637 19164 -29098 -60114 -104573 -117669 -92222 -83832 -29859 -53601 -107095 -67192
12871 -67192 -8590 -4053 11576 118737 82362 -3032 91503 176461 198880 145224 130538 -53437
12859 -53437 -195477 -141606 -16009 6874 9136 -36943 23164 34862 -78071 -151301 -51340
12848 -51340 -1122 -22364 -75501 -91217 22901 135140 108809 147184 77316 8116 11738
12837 11738 34301 27918 -52882 -25459 78303 31864 -91642 -94721 -18674 -20571 50962 54103
12825 54103 14671 12525 61608 107008 59833 58722 -49466 -24496 -13900 -50764 50343 -1076
12813 -1076 -11593 -22674 8223 16789 -96040 -147338 -49511 -60497 -101285 -55334 26214 165765
12801 165765 157812 195065 193028 89456 39629 -38649 -27195 64895 205824 185717 72637
12790 72637 52991 20253 5062 53226 20511 2440 33642 -749 32405 32049 78065 127243
12778 127243 54748 -22221 44162 36045 56246 81869 120262 121640 189736 200092 -15620 -67111
12766 -67111 -42005 44025 -16911 -65405 -7505 15705 -74771 -96032 -87742 -141264 -99393 9354
12754 9354 49858 4815 -47962 64934 88940 115330 98660 -21956 15202 87304 7361
12743 7361 -54669 -153822 -104996 33263 2979 82383 34888 -127446 -189786 -179276 -91375
12732 -91375 -127648 -114641 -3899 60387 124337 -3887 -163329 -225443 -167278 -91986 -58246
12721 -58246 -16926 -78949 9403 60660 66161 -23242 -104814 -2148 75230 5117 -3419 4565
12709 4565 62182 152577 109961 77856 1549 -51966 -21244 96990 119404 119243 53535 -63471
12697 -63471 -25150 5762 79900 177634 122717 162085 104463 -73742 -137005 -5184 96912
12686 96912 135928 42634 -81780 -89261 -56360 -48985 -60859 39910 138132 126377 45202 -18807
12674 -18807 -37918 -61231 -38938 26996 -11606 2019 4848 35378 53100 106900 117716 63813
12662 63813 -5277 -149195 -189979 -138644 -58604 -43319 116937 122606 100586 17115 -43561
12651 -43561 -15059 87721 71226 -17598 26949 129994 101242 93986 163836 207694 118272
12640 118272 116985 91200 291 50878 55283 6061 130910 161602 46906 45802 32417 -7574
12628 -7574 16301 -54373 -69685 -17321 5388 -55813 97890 192034 200576 77301 60324 88160
12616 88160 5692 3725 -17435 -75156 -82648 -94914 -67442 84959 234379 106728 67309
12605 67309 65802 123336 115120 93417 169020 139830 110832 72627 99261 210189 195604 139231
12593 139231 171122 17293 16125 -15735 -73400 -61142 95322 123430 371 -78803 -47425
12582 -47425 -43079 62791 102690 101800 160163 207035 166072 32472 24226 37792 -18869 -21104
12570 -21104 9051 69860 83617 96362 43050 44719 136904 141397 -113304 -108489 78083 145202
12558 145202 111960 39823 -31217 -30629 -66187 -73709 -58234 -17937 149370 92466 -53892 -54697
12546 -54697 35253 188347 167722 84517 31490 52117 13164 -7795 86372 126468 100625
12535 100625 111507 16216 -79464 -57133 -21345 -4374 8638 -71352 -89192 -104661 -133279
12524 -133279 -173979 -75490 27294 71931 167388 176975 114481 16906 67960 115681 51396
12513 51396 63993 37294 -10131 63051 191513 301799 265823 237845 59269 -172326 -164772
12502 -164772 -25404 50956 -3472 78172 216860 145071 102598 54773 -54104 -132850 -115831
12491 -115831 -70384 -87985 47643 72840 -18514 -31921 3879 -1418 63204 99638 145620
12480 145620 43870 75340 70196 46806 50797 -39369 -30115 -47451 -85965 -112201 -73536 -30709
12468 -30709 8544 893 85698 147134 143426 17454 94301 118510 89289 30119 21056 49942
12456 49942 72466 24058 15656 114641 189659 152644 123981 149528 83833 87761 132743 149419
12444 149419 156581 72194 12285 114138 59395 6959 12755 -101613 -202283 -132106 -167395
12433 -167395 -155401 -12662 -52325 -137663 -153350 -153770 -98618 -111635 -121079 -85306 -13621 145614
12421 145614 264562 289532 227469 197763 109122 42728 35405 87524 90719 48344 109968 150323
12409 150323 69051 -70022 -123202 -56144 7926 65861 121214 124296 100178 130825 -39954
12398 -39954 -216889 -223110 -170413 -121270 -116831 -74956 28175 26744 34458 137378 156129 117694
12386 117694 97146 77068 45042 66531 108947 111091 77218 -55595 -239667 -217010 -88847
12375 -88847 -63531 -15197 81710 155381 184028 46643 -3076 1231 53166 159665 260322
12364 260322 192537 113090 102580 133179 95452 85326 81941 102186 -8339 -21375 23262
12353 23262 -93045 -100366 -29510 30966 49186 59394 71890 18515 49072 68432 113791 192396
12341 192396 172247 52694 64170 121154 101263 87278 -8910 -65451 -164202 -126173 -19398
12330 -19398 -45131 -71920 53063 179302 230891 160519 101102 39670 72510 114393 168351
12319 168351 165600 36466 -7423 29171 86399 128621 121035 33828 -2521 109128 84224
12308 84224 40385 59062 -25456 -55846 -68642 65198 53677 -4794 36286 95234 157932
12297 157932 129710 135828 188171 156757 42021 -154 -81403 -46312 -82527 -27080 11246
12286 11246 48622 112651 109798 43860 168858 182750 195800 99514 53758 -36302 -45958 25273
12274 25273 33855 2427 32279 127510 93573 49127 18422 -17294 9052 81167 8606 46339
12262 46339 18820 69896 195379 219977 199000 184990 85606 79685 62863 -17957 -15982 31857
12250 31857 -14426 -93328 -96436 -33510 -28849 -51466 20865 32214 44124 160414 210877 229911
12238 229911 172408 78633 103113 87198 31973 52749 73718 143608 153895 25658 -33654
12227 -33654 9155 54199 57484 59453 140487 176170 167736 87623 132800 101755 257639 316124
12215 316124 187379 147334 70861 -24392 -69510 56249 79168 12676 -102400 -153372 -86096
12204 -86096 93521 141794 89553 67816 16393 36966 58409 129725 168455 108485 111600 158070
12192 158070 119964 -60000 -36979 81138 29598 60715 -4722 -31270 -3907 -53925 22287
12181 22287 -3730 76796 142768 54409 -89344 -69139 -14405 -143749 -72687 98789 71730
12170 71730 91272 11031 25651 10169 -77897 -25851 -32905 -42204 69620 57889 68117 145001
12158 145001 221303 193785 147725 46000 33153 63409 47780 -6520 -37018 -27462 60433
12147 60433 80238 22059 80572 156518 151201 79991 80449 161210 133954 -35769 -47029 -4594
12135 -4594 86035 93839 47937 47227 74095 -17965 -172398 -251087 -48653 90224 79822 119613
12123 119613 127424 64775 94181 107543 35956 33294 81998 31425 -10370 26813 43933 16030
12111 16030 -23589 -17073 -2650 -624 -104339 -174148 -117470 -102243 -85499 -64731 -58910 -27099
12099 -27099 29763 17102 56899 29437 8413 -58821 -132791 -142160 -98643 -52347 -15391 57414
12087 57414 90569 58463 4090 34270 97319 51796 11180 36987 142231 93942 115005
12076 115005 123076 54386 33315 16902 52851 36142 61016 38623 -57679 -8507 9406 33042
12064 33042 57849 144849 218694 301534 168935 -6662 -49455 2238 99144 95957 49298
12053 49298 -752 -102206 -58758 -5762 33867 204722 180748 94065 127786 94179 87593
12042 87593 99631 164000 208508 215630 213015 150782 40610 15460 9923 -5712 -9672 117507
12030 117507 50974 12086 54037 82444 -4650 -81644 25708 35226 31005 70702 140883 184917
12018 184917 116879 160005 121841 162185 186508 132595 189753 173758 158240 123332 40878
12007 40878 26158 -15105 37887 6273 -65715 -19491 17888 89846 176250 195895 142937 108649
11995 108649 33976 77337 191981 182835 144092 178661 134009 161789 93489 21907 43769
11984 43769 -64298 -133397 -114385 -120086 -161561 -44553 29241 -9242 30432 68278 10344
11973 10344 33421 126608 114954 66522 53036 92765 87187 28786 74467 52323 -80925 -92882
11961 -92882 28686 81305 76198 157887 105967 91252 160684 135824 127136 31976 3638 108561
11949 108561 113980 25349 66 -16714 -28525 67543 178731 252725 256586 237643 157454 96108
11937 96108 24963 60566 107589 109674 53923 124792 162138 116203 109502 118878 7699 -69624
11925 -69624 5307 -19020 73767 231673 97454 -38667 -28144 61081 26599 77968 63327
11914 63327 30529 92644 170434 140090 129957 103974 -20619 -1318 47041 228136 195733
11903 195733 59607 23094 30003 68310 31374 -6090 -10191 -28915 -34677 94591 82298 38725
11891 38725 62149 151589 72057 66218 153781 150079 9606 4608 71443 105477 162940 241082
11879 241082 247718 115592 57064 110848 89615 35383 54300 91862 76924 165546 216584
11868 216584 238075 138083 178285 232875 233355 149202 88307 53640 30025 -12627 48235 -9324
11856 -9324 -37397 16655 4805 3488 106163 136123 130689 109976 182509 203470 90194 47583
11844 47583 84029 154910 172775 117010 156198 147167 95171 87484 95414 144701 151440 204468
11832 204468 246665 196604 177112 125716 171422 225757 249180 225250 118391 2372 -22814
11821 -22814 -10605 -33372 119772 259258 253426 177641 168833 177402 187749 178072 202121 131378
11809 131378 143347 181548 90755 52191 122187 177230 135647 137512 212392 330987 302620
11798 302620 313391 337364 250866 246994 285008 272232 196739 102563 20021 58693 163675
11787 163675 212050 136473 124737 97928 120674 131554 116390 133676 130034 104380 73861 176294
11775 176294 116710 88784 93086 226818 275781 196362 231178 289374 213155 213302 102921 41537
11763 41537 61222 84063 78299 120930 149845 90447 75776 97470 93067 41402 191345 186599
11751 186599 291780 251672 171131 239413 369722 441850 348795 361746 395931 268622 267670
11740 267670 336184 350970 289631 227962 231331 270819 239201 307973 500671 468077 436383
11729 436383 371819 345474 310490 238719 156913 148212 181255 141186 162862 191504 211422 179871
11717 179871 101734 93559 236118 319484 253952 281563 207787 157526 116051 82308 174782
11706 174782 269172 271234 318839 370434 377837 222731 265822 337047 254220 148898 -33680
11695 -33680 -174139 -137917 -9387 146424 238456 196970 97829 1555 49499 166164 194755
11684 194755 269882 203735 206962 200856 255724 298384 255687 316325 231053 202453 300308 244441
11672 244441 292369 361685 390079 505982 691685 831735 964493 1093069 1174826 1195438
11662 1195438 1123762 1092076 1045375 1151960 1192072 1285779 1185473 1023677 923505 879971
11652 879971 745010 633571 700686 685159 590917 573401 584423 573423 553054 428004 410392
11641 410392 559977 507213 425390 509806 615555 557090 505163 625947 786818 816140 878555
11630 878555 1068173 1306268 1456923 1561581 1549380 1663250 1760589 1789818 1988877 2028610
11620 2028610 1979032 1959357 1853771 1706554 1472426 1426352 1316998 1081268 1030937 1069194
11610 1069194 1008257 801417 624755 702266 618923 593543 521852 461613 399998 426370 424943
11599 424943 456776 428058 464975 535020 554362 440848 502284 516553 590942 787711 823337
11588 823337 958147 1062631 1110733 1179369 1266170 1317322 1199909 1175301 1119597 1145920 1185395
11577 1185395 1160531 1034962 865141 782914 705366 650897 614049 526390 358075 308924 327235
11566 327235 292091 239335 164429 165388 234051 286287 278836 254807 84939 17601 168963 99396
11554 99396 -60533 -95845 -18977 31026 -57724 -25164 58220 127529 194089 181366 193117
11543 193117 318794 437120 528669 552117 598029 608975 624072 563480 412464 406671 453138
11532 453138 544271 677462 644742 516362 437705 382387 468418 515628 473980 487627 495479
11521 495479 380343 389972 453414 445902 358871 345801 376097 415137 393470 413889 446832 468888
11509 468888 445790 552179 592317 612196 621185 740372 793899 757764 699015 721518 720822 652708
11497 652708 655730 735941 728005 737139 718499 706793 695631 749634 733715 794316 729996 737397
11485 737397 794213 782622 749615 823067 781482 731466 833748 837137 834221 870700 877902 882328
11473 882328 784197 728810 735346 885541 983692 947870 927048 963366 936905 912568 870177
11462 870177 772802 750971 782112 856573 868169 783030 729490 862941 968217 948650 891773
11451 891773 816893 755802 694844 821317 896664 883326 854517 748561 724859 808633 915624
11440 915624 897706 799096 865464 851055 823969 833007 919706 985184 938974 877879 948873 1026753
11428 1026753 1055222 1080609 1101799 1091501 881310 841235 838573 693362 603165 692871 750776
11417 750776 733899 876391 966909 905004 987997 1020720 1066883 1163408 1165457 1189971 1199983
11406 1199983 1195225 1201002 1232279 1264884 1181617 1084124 1032167 978386 1034050 1218799 1265374
11395 1265374 1239716 1292790 1232171 1111108 1069379 1228843 1246162 1195782 1290428 1237342 1141164
11384 1141164 1075169 1017913 1019146 1038622 1107585 1092216 989571 1004298 1059874 1150324 1174169
11373 1174169 1122289 1155521 1282459 1378614 1306944 1324380 1383673 1482974 1472417 1373285 1281631
11362 1281631 1283990 1387654 1406320 1509039 1563916 1641539 1721153 1689930 1734143 1845426 1876639
11351 1876639 1849627 1866414 1758121 1719174 1817502 1784610 1717004 1607371 1723017 1786384 1841015
11340 1841015 1927929 1776230 1659086 1650148 1845772 1907237 1867328 1777317 1795596 1909351 1821995
11329 1821995 1849742 1983808 1987907 1988354 1969674 1916935 1915604 1956273 2105153 2220816 2342834
11318 2342834 2450895 2615341 2714834 2888181 3129533 3338825 3389917 3358600 3402838 3397530
11308 3397530 3368601 3433801 3517975 3696623 3873119 4050769 4198193 4227377 4295850 4366715
11298 4366715 4428993 4467839 4711707 4953712 5101958 5306978 5502613 5730973 6000803 6348958
11288 6348958 6617891 7072222 7530718 7979524 8490587 9050585 9800598 10715749 11526174
11279 11526174 12589932 13907295 15385394 17126772 18954988 20904971 23265498 26081568
11271 26081568 29378424 33286172 38123536 44101705 51446847 60826035 72589198 86732117
11263 86732117 103176762 121444792 140447927 158795239 175386824 188995115 198979172
11256 198979172 205018541 206890467 204354083 197718168 187188743 173459228 157855242
11249 157855242 141374633 125269934 110536764 97926508 87590032 79580965 73521934
11242 73521934 68968549 65713271 63419420 62147328 61909804 62468503 63896029 66230206
11234 66230206 69564517 73894984 79797878 87735997 98341695 112056525 129369643 149988691
11226 149988691 173328058 198592124 224677146 250530476 275245134 297998756 317674690
11219 317674690 333026662 342973138 346706461 344001188 335142700 320823593 302446524
11212 302446524 281112929 257974487 234116265 210232971 186775855 164674713 144383352
11205 144383352 126280181 110675957 97601674 86931237 78573495 72271692 67788950
11198 67788950 64978478 63630796 63316963 64060942 65495988 67803918 71232812 75930373
11190 75930373 82193069 90416658 100873668 113623586 128435408 145090417 162771381
11183 162771381 180568438 197250317 211603245 222539728 229242109 231255462 228229341
11176 228229341 220148264 207607806 191332970 172357121 151940694 131304663 111435679
11169 111435679 93348295 77516884 64204671 53346037 44828502 38335850 33398163
11162 33398163 29443688 26125999 23450419 21072906 18957240 16998771 15255722 13720484
11154 13720484 12419188 11236139 10281415 9416198 8598216 7927068 7331829 6730010 6209439
11145 6209439 5830354 5534672 5287476 4935649 4724538 4496651 4212009 3932535 3667862
11136 3667862 3558556 3411511 3346843 3202151 3093881 2993806 2939074 2846166 2783803 2793100
11126 2793100 2739653 2646792 2504728 2422073 2287342 2318849 2330346 2386555 2446871 2386764 2338906
11115 2338906 2320892 2320859 2436953 2413348 2262598 2146264 2152192 2156450 2040169 2000422 1946692
11104 1946692 1915513 1815384 1702355 1706612 1718390 1697616 1757587 1804166 1689459 1561937 1514453
11093 1514453 1489926 1557962 1565326 1459605 1396939 1396980 1377039 1373415 1385475 1377104 1398420 1534823
11081 1534823 1563091 1510600 1428719 1402637 1397261 1359010 1385046 1415804 1492384 1356754 1257454
11070 1257454 1249628 1288190 1205571 1180476 1265700 1321941 1290774 1274431 1243969 1229201 1298760
11059 1298760 1391298 1468966 1586897 1621849 1603909 1685600 1695472 1604265 1423671 1292521 1222849
11048 1222849 1231349 1247783 1248464 1178167 1181037 1177843 1137701 1060806 1048761 1021914 1062084 1089458
11036 1089458 1153283 1163898 1245297 1396995 1502358 1753650 1737605 1642952 1634528 1625497 1575031
11025 1575031 1565392 1431146 1353706 1315116 1222476 1206430 1258161 1312470 1251825 1169399 1151545
11014 1151545 1207794 1303423 1224416 1165730 1145805 1129138 1057745 927633 932062 918173 974035
11003 974035 930433 874886 979962 1119855 1218950 1170237 1166795 1179333 1216612 1326977 1433707
10992 1433707 1484568 1521554 1574250 1578558 1565718 1458157 1430600 1347298 1321703 1306019 1284448
10981 1284448 1333710 1358520 1293318 1138959 1096629 1098605 1126567 1257945 1307200 1294704 1190284
10970 1190284 1091931 1147103 1124105 1160935 1155014 1063270 954059 972111 1029053 1066910 1039346
10959 1039346 987192 986728 942599 840300 766278 819222 802587 971061 1071092 1059816 1105726
10948 1105726 1166235 1282359 1381124 1463867 1480726 1485567 1402398 1422818 1440005 1401360 1504282
10937 1504282 1490562 1309368 1214204 1223051 1286803 1431780 1484561 1487961 1574100 1705389 1661933
10926 1661933 1602745 1656856 1699900 1814351 1924830 2034446 1993844 1941569 1971643 1914360 1813553
10915 1813553 1869173 1942905 1917070 1949143 1948297 1903292 1863727 1934245 2041007 2178653 2253136
10904 2253136 2347793 2323966 2273678 2265130 2365274 2407521 2471015 2621621 2692928 2739877 2802098
10893 2802098 2894029 3061386 3307001 3379124 3524620 3619477 3723274 3946023 4089247 4245615
10883 4245615 4371324 4470810 4606589 4782210 4909531 5037931 5161032 5361224 5503744 5820888
10873 5820888 6177164 6508052 6876285 7138212 7435817 8079172 8612573 9318077 10134361
10864 10134361 11018340 12106715 13328952 14438358 15668812 17080030 18790952 20624220
10856 20624220 22610536 24989914 27873302 31490926 35999423 41757311 49426346 59680435
10848 59680435 73620555 92096257 115501653 142986545 171565338 198379493 221232180
10841 221232180 237366891 244881211 242847376 231469519 211952085 187199545 160942949
10834 160942949 136561196 115600511 98422989 84500165 73408252 64790337 58505074
10827 58505074 54331448 51850229 50325604 49319096 48604668 48090900 47767884 47585861 47837972
10818 47837972 48728166 50447049 52976503 56747948 62035459 69371875 79468912 93452984
10810 93452984 112464427 137189602 166589930 198571591 231460945 264070951 294552948
10803 294552948 319839662 336719807 344621052 343796176 335094486 320833713 304526696
10796 304526696 290037258 279416303 271213194 263227734 253482440 238166092 216036865
10789 216036865 189168535 160530127 133206697 109569272 90520039 75967894 65188567
10782 65188567 57611165 52572206 49254161 47257051 46426741 46323990 46724772 47527365 48886064
10773 48886064 50853501 53954943 58244272 63592662 69854393 76878465 85023167 95252943
10765 95252943 108676656 125666383 146724006 173497057 206832646 243428730 276754632
10758 276754632 301158469 312692749 308484758 288305374 256351312 219307621 182387407
10751 182387407 148584997 119360481 95334527 76278198 61402545 50111866 41651080
10744 41651080 35348511 30518075 26781079 23842389 21510161 19596778 17945208 16465120
10736 16465120 15126029 13869948 12795224 11604381 10503225 9623100 8890846 8226821
10728 8226821 7519668 7006002 6585409 6228892 5786338 5444913 5309141 5131019 4953769
10719 4953769 4700558 4493629 4294167 4032541 3796247 3660100 3482956 3371536 3328475 3281071
10709 3281071 3203479 3053536 2852315 2618631 2618996 2695027 2733264 2683362 2637061 2554634 2418135
10698 2418135 2237269 2138312 2045248 1986986 1940817 1939432 2020918 2018098 1862603 1737492 1823209
10687 1823209 1924619 1879616 1799700 1754072 1662151 1683495 1586552 1561594 1675404 1706613 1713225
10676 1713225 1692232 1631434 1570847 1450757 1397436 1468630 1538872 1425217 1289297 1274677 1253565
10665 1253565 1236159 1264268 1291637 1201202 1075701 1163075 1138147 1031936 895426 785155
10655 785155 773118 807337 846420 833447 865909 864393 798789 760287 764797 860207 918042 980188
10643 980188 1084751 1177771 1193832 1080531 1014672 1053391 1100601 1120744 1077895 1090219 999947
10632 999947 899918 900536 917189 917979 906169 782899 735892 729595 719037 701103 621468 638746
10620 638746 583500 414567 458156 560383 649685 760297 900340 1057990 1106407 1291763
10610 1291763 1583692 1821160 1898604 1808056 1631113 1468717 1313906 1338692 1288025 1173094
10600 1173094 1095404 957870 917512 891796 782799 589531 528919 521318 398814 350397 430130
10589 430130 511724 476051 464350 514030 447630 369650 364498 400610 396598 386751 361245 383120
10577 383120 357225 329364 317646 415835 406891 439485 490721 409875 261572 253630 291101 280708
10565 280708 243696 310322 302975 362821 372407 388708 417215 451283 454076 453279 246086 126312
10553 126312 43937 195887 256156 208574 265019 403347 501930 529921 470559 279123 270215
10542 270215 349806 375703 428960 348562 292551 281241 243027 277119 213803 115985 80736
10531 80736 90899 203805 206281 185511 232306 225432 182972 152906 99853 138216 109984 95257
10519 95257 135803 113033 97896 144584 177714 215682 259877 266509 354413 382087 393641 441271
10507 441271 532759 539788 522197 342811 199641 141724 193308 212868 195625 226893 270117
10496 270117 286568 301358 271459 239839 382011 431520 384147 408706 362745 330488 216411
10485 216411 101455 101032 148547 160541 150783 257157 286859 280118 276357 358811 502039 457088
10473 457088 510845 687312 792626 906425 910596 945359 1060501 1149469 1138941 1112089 1146246
10462 1146246 1072925 1062708 1062683 1027686 1026573 1013533 936492 793101 693546 733756 749762 725426
10450 725426 728949 742869 761824 788645 777173 690682 641462 655783 803768 907924 1019163
10439 1019163 1190020 1391913 1637361 1728981 1786808 1881668 1990685 1980522 2207130 2326197
10429 2326197 2464202 2496933 2432197 2439493 2420097 2426447 2374281 2216631 2033830 1845043 1627981
10418 1627981 1508986 1392452 1166301 1100227 1027834 996343 957746 931952 929393 908991 937114
10407 937114 915663 1042293 1124233 1213688 1421396 1566050 1709753 1869047 2031776 2240516
10397 2240516 2458934 2734238 2931883 2983742 3059018 3187389 3200668 3199910 3177364 3042338 3142683
10386 3142683 3203854 3153194 3052036 2927128 2704472 2403103 2141475 1914646 1774911 1519338
10376 1519338 1351492 1168320 979466 1002707 941958 858035 874833 714895 705743 838567
10366 838567 935589 838981 819931 871892 954570 1015220 1030947 1121680 1176580 1231231 1398183
10355 1398183 1602292 1867504 2113240 2371287 2571015 2634171 2701590 2742207 2756894 2690028
10345 2690028 2601599 2387786 2175121 1991298 1766547 1434746 1204636 943913 870642 914609
10335 914609 858854 820366 725121 662777 724322 702333 521384 390480 377229 406718 431950
10324 431950 434316 394396 467970 468181 342918 268009 249425 316612 331902 428231 426892 456106
10312 456106 519982 673348 708875 656953 669006 665406 594276 592024 622428 695554 737403 782701
10300 782701 728751 755345 710518 669757 635617 568941 553733 571567 628643 685671 693244 606836
10288 606836 579736 590413 604514 509289 404592 465373 476641 448047 430636 542512 637362
10277 637362 679401 836152 829982 714198 604129 508944 566019 650924 775182 966386 981237
10266 981237 860560 868854 835558 834047 843476 877752 921652 911486 865522 847586 982302 1067971
10254 1067971 944000 875106 825448 850684 756363 641150 652550 591257 602453 584772 650200
10243 650200 657516 680603 769087 771437 762161 754964 740455 868810 913909 875325 829457 864710
10231 864710 784784 810082 906658 899673 864284 927055 926448 961548 985551 1068323 1055149 1057382
10219 1057382 1149409 1253999 1249054 1307579 1339857 1416276 1557542 1607694 1486213 1426288 1259650
10208 1259650 1165708 1190884 1193987 1190342 1296313 1347087 1265976 1152096 1179476 1207019 1237667
10197 1237667 1136965 1010574 958288 1092171 1146111 1202350 1202482 1238932 1143939 1049651 1155168
10186 1155168 1091585 1009989 1007135 1039430 1140427 1190140 1229303 1184415 1111917 1075043 996760
10175 996760 1003228 1188129 1531062 1729060 1860015 1918825 1928158 1977232 1984917 1934797 1834913
10164 1834913 1756313 1697992 1617022 1522612 1533730 1480144 1480027 1436405 1315217 1428818 1478035
10153 1478035 1451051 1458360 1430310 1438450 1462112 1475786 1457941 1459711 1474808 1439051 1341574 1371952
10141 1371952 1392554 1453588 1609848 1678272 1733703 1799848 1822120 1803572 1733507 1731240 1689555
10130 1689555 1566929 1561918 1624491 1517105 1587578 1618554 1645159 1681119 1731696 1769120 1807681
10119 1807681 1818517 1782592 1873613 1969919 1914961 1993808 1991623 1969589 2004921 2059259 2085858
10108 2085858 2157794 2131496 2186656 2242029 2258048 2355316 2412849 2412701 2527115 2618533 2704272
10097 2704272 2816202 2833272 2887481 3113916 3207914 3271984 3449407 3689245 3946658 4121090
10087 4121090 4399160 4608064 4917950 5266000 5617176 6034044 6619015 7188241 7812209
10078 7812209 8432142 9166947 9827708 10606542 11725024 13023633 14560255 16465658 18862171
10069 18862171 22158993 26497721 32290424 40191149 50320600 62099910 73765406 83432840
10061 83432840 89398914 90225220 85413808 76714655 66659048 56917705 48781765 42737638
10053 42737638 38957449 37246595 36604277 35949877 34826757 33118634 31094781 29029295
10045 29029295 27263829 26081727 25444359 25366014 25792653 26661351 28013055 29828207 32273823
10036 32273823 35384627 39577536 45065136 52554058 62827751 76421823 92722458 109025154
10028 109025154 122316217 131314003 137891661 145295488 155732676 169233788 183199870
10021 183199870 195483251 205530999 212017566 212604767 205951589 193955297 179051537
10014 179051537 162292002 144304012 125950465 108243038 92667116 79721599 69787527
10007 69787527 62372364 56776397 52754572 49899704 48363663 48142870 49354491 51766306
9999 51766306 55442684 60690772 67624605 76259680 85340769 92510281 97432972 101970483
9991 101970483 107634891 115227432 124623411 135381231 148659260 166090937 187828866
9984 187828866 211688028 235446455 257174972 272993849 280107318 278807132 269017489
9977 269017489 251521149 229998444 208264843 188065802 170035750 154499142 139962641
9970 139962641 124595694 109063212 94695761 82516402 72936095 65555705 59640983
9963 59640983 54866538 51241468 48689489 47250041 46600008 46593931 47235849 48882767 51793092
9954 51793092 56062364 61290240 67607257 75309858 84173537 92743141 100686728 109466567
9946 109466567 120198085 132278288 144010209 154246875 163093230 170514093 175991960
9939 175991960 179187919 179737296 175879412 165857384 149739456 129746976 108722671 89163234
9931 89163234 72493512 58983761 48567853 40726543 35059335 30985483 27775945 25356589
9923 25356589 23772061 22615926 21842221 21646888 21911330 22568018 23863641 25671647 27326268
9914 27326268 28129814 27879578 26957474 25756618 24721050 24394445 24826804 26433022 29691458
9905 29691458 34621876 41301620 48942068 56044119 61247543 64021769 63300057 58915356
9897 58915356 51783058 43682524 35690345 28641308 22962480 18590609 15304179 12915844
9889 12915844 10992926 9612235 8599923 7737761 7048592 6451602 6023429 5696666 5271225
9880 5271225 4771262 4386968 3962598 3698086 3440141 3223911 3030902 2878994 2724546 2617394
9870 2617394 2442097 2372578 2327421 2292987 2268524 2145871 1989392 1990202 1984351 1956223 1892129
9859 1892129 1813401 1735364 1686153 1630784 1604170 1588859 1629526 1589663 1540808 1550442 1599342 1579251
9847 1579251 1472536 1402825 1276526 1151012 1112360 1208828 1143426 1050184 1008787 1075893 1020421
9836 1020421 993404 1068279 1062398 1096797 1192788 1157190 1009642 1014555 941906 991748 1075796 981617
9824 981617 968830 1071175 1150605 1149641 1130188 1033981 1034298 944374 988980 985969 989366 984323 919116
9811 919116 817238 738826 649858 611607 579090 470642 439625 454202 504365 679107 800631
9800 800631 655105 598534 559921 635909 743976 840967 857767 946553 1038550 1044005 1052529 989341
9788 989341 878567 817250 761940 746676 652720 584022 475963 541050 568241 601911 732498
9777 732498 634301 637541 698589 648465 538475 489765 541894 604851 658445 639940 651483 568981
9765 568981 307877 329884 385073 348501 362702 488355 505137 472200 402652 414209 504791
9754 504791 533371 532610 470780 538468 612716 615494 514979 571566 696866 697200 791581 776697
9742 776697 732585 705921 607229 444640 440880 535886 558015 491992 556356 511816 448809 444880
9730 444880 465155 558201 597693 536712 536491 544560 463530 436057 469985 476471 486444 500292 420362
9717 420362 328175 330003 346955 395430 407735 313834 299287 340992 253772 240799 347528 324609
9705 324609 244634 149069 36658 84747 259197 252836 170379 117981 256470 399616 450917
9694 450917 568767 570059 568912 626256 598173 634262 731670 835255 844636 732007 782850 767534
9682 767534 667696 612495 620805 624745 591592 562166 638706 555354 387377 444802 467548 433063
9670 433063 385188 313752 299651 324146 256615 211216 241342 240340 205095 263407 360422 405168
9658 405168 361979 436104 532765 439770 345185 424476 535173 661533 704007 851916 1064347
9647 1064347 1215998 1235109 1314231 1249990 1176253 1111711 1022069 842544 731768 661006 616232
9636 616232 712059 708830 661936 738114 713999 726064 766461 612804 511326 441599 468847
9625 468847 453225 453325 388660 502676 538891 569573 613459 704118 718324 717945 722023 863750
9613 863750 1091541 1301888 1317117 1500396 1665047 1790439 1820529 1815866 1800642 1719078 1642682
9602 1642682 1614228 1536783 1432544 1399122 1278065 1115646 1053654 910064 868282 864312 864933
9591 864933 781900 671855 673821 656819 615925 532073 537002 649404 795672 797619 785046 888809
9579 888809 1040125 1246162 1306440 1197092 1141898 1169029 1211462 1321732 1402449 1561944 1864156
9568 1864156 2014978 2103582 2149287 2168296 2088957 1876109 1779711 1741554 1581235 1472678 1359394
9557 1359394 1253304 1180914 1072580 984581 899740 841433 963571 944674 836041 811105 795737
9546 795737 742572 672040 656472 582918 594739 632012 765062 831121 789192 810498 911015
9535 911015 1014676 1069261 1091948 1085256 1112272 1159082 1239805 1422894 1412326 1252976 1293781
9524 1293781 1464897 1544214 1459550 1412876 1295619 1191366 1110603 979644 789416 569729
9514 569729 491715 461485 519088 545297 489135 496804 529363 536980 394316 356323 489165 537643
9502 537643 499078 615198 704822 677227 555673 338409 224520 177278 256112 414939 550640
9491 550640 589047 531299 621329 667486 743046 858386 984794 882886 811925 732285 690689
9480 690689 607710 474974 427724 492626 470834 418308 379307 396021 384632 388221 417324 395910
9468 395910 430854 492258 460746 419141 352948 429413 468510 469647 401022 301756 263979 360404
9456 360404 366602 170226 141497 178249 163328 200353 244100 439141 406350 352650 291841
9445 291841 106835 117349 142116 153020 181593 228810 330645 187668 131215 205534 301877
9434 301877 337470 229763 181458 174835 309703 251240 149866 41726 133056 199080 304453
9423 304453 320125 204862 260149 299963 394966 412841 476646 480242 456737 373627 432693 354444
9411 354444 352007 377857 284569 206722 213888 246719 234773 263549 222206 212437 144657 105830
9399 105830 86905 115010 265222 315995 245605 135305 67469 92019 255074 386261 462561
9388 462561 540336 497223 480204 410237 298433 266500 284849 229521 275222 241523 250754 216653
9376 216653 124755 71840 208494 307370 345234 422240 424772 395389 351076 293173 341208 398381
9364 398381 366053 431305 311434 234172 415915 520036 479548 337454 354091 464968 441419
9353 441419 416142 365191 410434 437302 416285 372105 351978 304882 251088 322920 345717 442785
9341 442785 438449 335280 232976 175943 214700 233166 236452 373967 410466 311021 325776
9330 325776 313625 329663 309837 163743 199297 336124 418681 308079 159205 156388 236864
9319 236864 291917 250994 220454 152005 141605 177065 231620 247482 212620 209957 250580 249836
9307 249836 227016 330017 442777 315980 235464 268897 332885 387649 322921 294160 269956
9296 269956 244843 114863 100521 220639 299599 377236 256868 311196 362210 354001 286001
9285 286001 198911 210538 222939 138131 183780 332220 300128 245826 238045 249825 170936 160556
9273 160556 -6739 -72428 40905 71477 182681 202954 241792 312738 269394 209187 19649
9262 19649 -19044 40739 105784 144017 107545 145101 142624 189366 244261 235913 229865 105664
9250 105664 55892 158753 123448 70719 155270 289454 280187 141652 96121 234805 222297
9239 222297 200477 195044 176764 209270 215760 110513 4040 -21587 178773 135655 150506
9228 150506 228795 191116 131783 9655 -58490 24489 107898 238777 234143 309467 281940
9217 281940 122584 72294 101019 65509 42396 53146 90987 62510 150082 115073 16570
9206 16570 52276 98534 101940 103441 108179 290113 354749 344039 226070 112407 114878 129407
9194 129407 87635 160481 132168 81123 120854 127886 98045 166345 99121 47598 25500 20496
9182 20496 -22661 -59502 -2427 17079 3491 58046 73838 201570 83984 -22702 15307
9171 15307 62210 109453 -14973 -2660 12145 -35274 -37816 12948 51509 49959 65785 -3936
9159 -3936 -11981 -20034 103327 188927 219568 187417 174391 201874 86774 52692 181732 257841
9147 257841 121328 60717 104477 9739 6543 35103 -8743 -21772 74880 172007 217334 150531
9135 150531 71999 45993 61309 156284 199562 138297 49678 86296 49499 24631 87405 145847
9123 145847 167784 65093 109605 111636 99548 10710 -64258 -32558 50273 98438 181298 136695
9111 136695 111537 132540 129442 52615 -35484 -80639 -105178 -71060 10250 4448 -75452 -62531
9099 -62531 -32041 -32417 29873 18530 17076 54897 103838 132123 186673 196128 255180 188938 175254
9086 175254 159286 149897 231344 242807 225929 225927 170888 173786 257543 243836 106319 78232 160903
9073 160903 185560 125611 115914 140639 209405 295715 402610 409655 348230 315645 312541 261523
9061 261523 135290 114086 -24201 81832 215111 204882 150375 130159 49798 46541 78466
9050 78466 12535 61807 126175 137648 78699 17171 82861 109690 167874 132512 188371 205614
9038 205614 210313 186447 91266 183046 213888 257635 276929 177008 41523 23964 -3297 66219
9026 66219 109678 181126 160932 130492 191643 179376 88430 58929 45551 -19132 -32132 -77271
9014 -77271 -67718 9345 59013 60563 27168 -39611 -2077 -5845 -75300 -14720 73955 132470
9002 132470 211411 278896 319072 290035 201830 105766 120324 100300 133666 199674 248696 168196
8990 168196 110823 128127 90042 86341 106816 90310 59923 62179 24022 100575 184903 187524
8978 187524 43661 -4919 47693 41323 66239 117118 25001 16420 90826 151963 93673 -25357
8966 -25357 -36224 -46693 -69512 1213 86541 107112 75843 147036 234139 195464 184529 174868
8954 174868 25610 22308 22132 -86202 -7008 16213 -10589 -38819 38748 145320 135144 71447
8942 71447 131226 195938 56112 57967 168629 166221 110443 102571 21818 -33395 -32283 56156
8930 56156 -21608 -32819 4271 21349 39642 13933 -27952 -39365 -36649 19496 40797 171733
8918 171733 78487 -118559 -156821 392 -5966 -60186 -49886 28501 92075 112696 6628
8907 6628 -72365 -17028 84830 114383 103238 125784 71297 -5695 72820 101873 89265 135490
8895 135490 214451 194357 152592 146393 56551 79399 49801 -11128 8531 -295 30955 13642
8883 13642 -24347 25883 -318 -121722 -129174 56039 30421 63810 72430 -11564 15030 89904
8871 89904 151722 95218 -13525 81124 125645 191212 239638 265324 167763 79240 27142 -64524
8859 -64524 -118614 49229 111935 89739 93423 168281 205956 122216 59379 -1924 -49045 -72572
8847 -72572 -97367 -65895 -48985 -8945 70582 -38322 -100667 -82129 -196544 -245189 -164786
8836 -164786 -109243 -55413 -87051 52721 90563 76633 55159 60608 7068 23914 124585
8825 124585 115794 95324 -95838 -119352 -14555 3138 4231 -20081 -56 13999 132004
8814 132004 123039 116357 105498 30639 28612 -21456 29380 93151 54520 94122 95072 61220 81943
8801 81943 66263 38166 137227 173104 206951 213992 105643 34708 -37025 -100338 18453 50587
8789 50587 -45242 -119485 -22748 78111 104523 25856 16052 37551 -21028 20208 64081 51149
8777 51149 52350 18871 -9320 19215 -48024 -93671 18359 -111923 -71619 101511 147187
8766 147187 19036 23798 55706 105662 69901 3941 8655 135140 164809 136076 139879 29786
8754 29786 41180 -19821 118332 135360 32479 -67327 -72046 -115159 -46125 -2852 4477 -256
8742 -256 -29192 -44550 61029 41161 -9358 -105860 -211786 -189153 -89892 -30441 -54107 13681
8730 13681 13307 125766 172215 64150 48754 84001 212254 248218 217197 151985 67591 81539
8718 81539 82456 45869 -39462 8391 -2419 88118 186580 178674 165367 103619 -41800 -163478
8706 -163478 -213887 -100872 -8705 72611 46393 -39734 -29731 -38525 -31350 53233 9136 -9854
8694 -9854 -98906 -130254 -21412 57198 9294 15581 145263 168710 78249 52479 143740 159350
8682 159350 116587 56988 18293 11385 80521 85586 143997 123892 148309 140427 21968 -15772
8670 -15772 -13049 85413 67402 62496 54542 -9359 -9107 57301 -7920 -94398 8476 123458
8658 123458 103432 81689 -13203 23484 42125 38591 -56772 -119772 -31902 128355 104444 47226
8646 47226 -27371 47910 -36070 -14607 72833 175890 205784 108725 76409 133529 86709 190752
8634 190752 257471 266789 312367 294537 233503 194084 221699 172101 110091 107333 124781 75684
8622 75684 157717 242093 174451 247453 461127 530303 406601 204035 155369 242981 312975
8611 312975 201947 176794 208013 207184 253140 266655 312522 378480 366230 424162 434765 350291
8599 350291 328281 338536 328615 316017 306002 227286 218261 298481 279532 188067 188499 252619
8587 252619 300366 166841 628 30042 82629 98305 130682 103636 76934 36871 -45376
8576 -45376 -57705 -9377 -9423 -39226 -26016 -3798 137389 109729 121496 1036 -107695 -210008
8564 -210008 -166970 -58215 40058 56660 41819 94232 21040 -17972 -11470 -37084 -85909 -105840
8552 -105840 -211714 -112868 -60957 -124242 -26215 13469 -50903 -18733 -79274 -90515 -118926
8541 -118926 -78703 -61605 -225999 -178348 5427 33308 -38612 -66679 5498 60591 46391
8530 46391 66932 56840 33425 8299 -56420 -86707 -62019 -93817 12457 102341 87434 44195
8518 44195 -21124 -53392 386 -36452 -56359 46653 62818 12303 -37477 -36251 -25890 -33642
8506 -33642 -52088 -73756 -3716 63695 40051 26027 94604 145446 28741 -137633 -123501
8495 -123501 -39173 -3107 -57152 -71807 75370 162491 176788 249350 168253 130062 11944
8484 11944 -1120 111202 127566 70260 -31654 -84731 -70402 -61589 -42662 38309 61239 129981
8472 129981 92173 -1911 -47461 -172374 -177752 -112007 -10923 -29145 30865 -12284 -13145 19382
8460 19382 37598 210348 208132 50136 -39847 4214 -14404 7735 56346 -29714 -27856 7459
8448 7459 109081 226800 167612 41348 -19085 -60721 -110552 -155234 -72851 -50566 -3275
8437 -3275 9983 30485 13874 104302 128116 158688 156202 143836 17096 -112828 -114299 -72421
8425 -72421 -41030 111901 171421 139972 230654 202197 134802 115030 103835 71828 103168 -3623
8413 -3623 -4096 18707 89318 98146 26032 -34906 -16450 51389 31411 -47259 -47806 2698 69978
8400 69978 111278 56205 -41481 2986 -7289 -149584 -130283 -86384 -76486 -81732 41843 37540
8388 37540 1577 26032 4921 45557 -5399 -33613 -44110 56028 87516 112703 171178 231232
8376 231232 154782 114718 87122 130817 109462 25720 -106627 -210766 -172080 -142275 -71684
8365 -71684 -29553 -23059 22746 128754 82798 -55478 -104726 -135112 -115938 -79251 -96456 -72305
8353 -72305 -93545 87473 106827 80643 57603 150748 316405 339477 271666 110299 66543
8342 66543 100179 11906 -73418 -17315 -89861 1106 40527 -32551 -32437 30131 -44140 -185329
8330 -185329 -175844 -129684 -111171 -116607 -18352 10349 -108975 -143304 -95587 -36280 -7259 7863
8318 7863 8915 4009 48142 66037 98992 43186 22870 4274 24114 101292 112238 24063
8306 24063 -31340 48480 62672 25182 -91980 -34860 51331 54201 66816 34509 20538 39003
8294 39003 -28203 2470 -7833 -36793 -35559 -123582 -194244 -149437 -126350 -63767 -59931 -58814
8282 -58814 -3063 72198 79449 2861 -95065 -191916 -194429 -202922 -227338 -169763 -21986 27155
8270 27155 56537 -36589 -93128 -129791 -77669 46159 -55512 -219595 -198202 -68160 -27689
8259 -27689 -32663 -60701 -28624 13316 43489 39428 41675 -54392 -121387 -104520 -35547 -91126
8247 -91126 -213992 -231060 -163122 -86011 1636 9925 -1491 112730 183461 144789 129899 30687
8235 30687 -159067 -235712 -138516 -119573 -136629 -113045 31019 47148 50491 40901 -225 -43883
8223 -43883 -74100 -38308 -47409 -60766 -82357 -117558 -140000 -131947 -86551 -59017 -131896 -83663
8211 -83663 -17789 -51468 -16463 -59755 -154168 -130122 -143049 -116449 -114506 -4022 38556 122661
8199 122661 149332 132566 202554 153271 107516 44633 48334 56472 29606 10474 65666 179465
8187 179465 224291 177276 22270 -63883 -14962 37375 -10514 -92767 -82620 37529 -1230
8176 -1230 13186 -83299 -71928 23484 5398 31832 78870 81601 29039 -46478 -83111 -133891
8164 -133891 -130197 -94537 -92401 -6267 79668 30284 -114887 -188488 -98157 -96759 -110989 -66432
8152 -66432 -177738 -114676 23530 70104 29034 36301 61808 71190 81699 63432 202843 291930
8140 291930 258249 120071 4799 -65604 -116725 -183646 -109941 -42740 43296 75824 22182
8129 22182 19334 -39221 -46449 -15673 75859 75805 62749 109763 12619 -61666 -48303 24762 147070
8116 147070 101304 27260 67916 152825 169578 190249 155002 80930 91641 31948 -49426 29279
8104 29279 96169 -2350 -36942 -88002 -143800 -87442 -66531 -51029 -125710 -117772 -73363 -97025
8092 -97025 -167376 -249445 -268814 -190043 -71565 47833 -1046 -53662 -47558 -69575 -138524 -140126
8080 -140126 -153665 -110886 -117042 -151042 -168876 -112637 -189620 -167471 -49235 -64857 -82340 -211133
8068 -211133 -232511 -171008 -133474 -114642 -8202 52499 18359 34299 4312 -38712 -28910 6787
8056 6787 7318 80334 151324 128639 135958 140378 123856 53519 47018 -391 23253 99454 94541
8043 94541 119953 116247 105212 109381 135286 90434 39236 105121 233286 194132 134563 120683
8031 120683 110112 130764 116407 88899 154567 266735 290962 253311 270570 221239 89810
8020 89810 20925 38889 112974 124433 147593 204248 180861 155199 118122 217074 208675 200067
8008 200067 146382 157679 187539 79543 58209 142777 200261 212917 254264 246121 295385 288866
7996 288866 277211 217406 231601 242579 167798 247537 247957 359363 425601 341941 349577 409156
7984 409156 445276 406460 260747 67652 23895 52155 -52639 -154916 -46108 -37462 -3508
7973 -3508 -24018 -86365 -24764 49787 37021 27726 71484 91051 40530 100054 86392 112476
7961 112476 144729 89582 36091 124981 239930 305073 302700 344246 361601 387444 358975 325330
7949 325330 336627 266531 148204 93700 104739 79458 59473 150667 246294 235319 175397
7938 175397 40793 -14768 73446 142220 57699 -30126 -72932 47273 86509 54552 86185
7927 86185 80032 -44161 23098 83847 82666 115905 64918 8461 57842 67298 -19485 -34265
7915 -34265 84839 209720 187532 161654 102946 138320 179472 151571 114214 80014 16956
7904 16956 -51430 21774 23123 -100 20634 -10136 -39026 33156 75988 76967 63444 63979 15626
7891 15626 -29625 -73127 -187970 -146936 -71199 -15554 -86295 -253851 -308156 -255900 -212531
7880 -212531 -77858 -98502 -101931 -9673 48007 -32867 -49660 27458 60005 409 -83482 -56437
7868 -56437 28813 105596 68017 8078 -21001 2789 -4437 -5460 60595 73923 -11259 -36817
7856 -36817 -20959 -29317 -77411 -80061 -40644 -81042 -95264 -61231 -90642 -101720 -123241 -162114
7844 -162114 -156314 -38329 81147 28184 -23723 40179 14400 -193992 -315098 -243802 -178296
7833 -178296 -108538 -78329 -101972 -67535 -94118 -63524 -89220 -42445 15826 -98014 -139844
7822 -139844 16666 43145 -75229 -182011 -175939 -189525 -255743 -254674 -116344 -37346 33975
7811 33975 77896 63224 -30670 -17854 -44476 20338 -24720 -9186 40123 145158 196973 151618
7799 151618 96374 61165 153573 120306 21835 -47686 -67429 -33919 -72189 -103088 -132089 -178586
7787 -178586 -105688 -198661 -280512 -200919 -206299 -171266 -123398 -16599 -40055 -158315 -124406
7776 -124406 -50591 61449 6136 16767 43859 65313 30409 6092 54199 84077 85575 16140
7764 16140 -125251 -39154 45876 38892 -21678 -28036 40813 79735 31544 -40779 -33232 -53856
7752 -53856 -65178 19414 51024 -16214 -93484 -126225 -37247 46777 66200 54375 111909 33465
7740 33465 1085 39555 -289 4694 -62645 -88384 -69102 -24214 -262 -97077 -255292 -226201
7728 -226201 -78636 -22338 -90720 -101266 33684 123099 40331 -44538 -110952 33027 80060
7717 80060 100009 129820 146830 48591 -17165 -70688 -88315 -107269 -151847 -142438 -178677 -218891
7705 -218891 -215474 -275609 -281444 -95290 -7715 -43220 -16056 -63269 11766 56316 35074 -2237
7693 -2237 51243 77432 141826 208700 143246 92669 100881 101372 29667 43666 18055 -85865
7681 -85865 -93143 -147854 -200522 -172326 -138519 -82023 65772 70623 20349 80042 176128 245391
7669 245391 224658 54053 -16478 112107 137270 115955 116482 17944 -65788 -49528 -65782 -126973
7657 -126973 -112951 -46286 23072 64356 -26865 -113153 -88924 -86115 -110034 -177844 -192323 -162407
7645 -162407 18037 53208 25445 -29046 21520 41640 -32531 -30964 -74295 -92835 -14104 -7166
7633 -7166 29802 129641 72255 29314 -51530 7634 -19042 -52474 12224 -10385 85581 171932
7621 171932 86315 -3616 19535 -3286 5826 -17659 -61304 -30535 11552 18671 12915 9309
7609 9309 -36666 -129288 -172166 -116823 -8971 57577 80513 60161 42459 53241 127816 159558
7597 159558 29812 -43868 -41011 -87554 -180154 -132073 -97611 -78544 -40937 70528 80509 97087
7585 97087 69805 17823 -48301 -49596 -212375 -216934 -123502 -76681 -96064 -61504 33276 -34428
7573 -34428 -143647 -42410 -67971 4529 36566 41079 -52100 -109142 -136775 -108652 -130616 -17302
7561 -17302 69794 96368 108538 134268 109160 63209 152227 122171 -13483 51575 77905 130692
7549 130692 202610 164364 138968 46161 21574 -88609 -128390 -123974 -99060 55884 52967 71054
7537 71054 62289 -15824 -81403 -117451 -27963 7778 -53552 -60176 -82933 -163774 -131055 -109485
7525 -109485 -83238 -96170 -67536 -86124 -21756 53310 116717 27800 17653 89365 71865 53242
7513 53242 -41215 -51863 -48231 -19120 71260 157419 267984 226008 157898 218445 241453 173650
7501 173650 21502 59136 166001 182191 104183 -18687 15936 29188 76681 157298 71769
7490 71769 -16050 -32868 -14436 -61757 -29590 63487 111869 45108 29548 33121 -52282 -134305
7478 -134305 -111885 -41698 66953 124317 96154 44218 -95938 -236726 -168218 -83386 17348
7467 17348 144063 126795 70824 12654 67912 99235 -14025 -63470 1978 98166 85728
7456 85728 5893 92668 113265 7179 -35467 -99388 -91044 -92004 -146620 -148027 -37161 71245
7444 71245 10275 6362 14709 23078 17129 23381 208748 271243 159978 117341 134059 143986 88859
7431 88859 -1660 -113739 -117346 -179802 -234703 -257538 -199578 -163271 -48581 20004 11351 -41419
7419 -41419 -153272 -234555 -146521 -15726 32178 6442 -88341 -48354 74237 106737 151227
7408 151227 26108 -86340 -138491 -96399 -14861 31157 44964 68717 92151 40636 -38880
7397 -38880 -67693 10493 6950 -42702 -82762 27272 -16068 -21984 -78942 -51147 -144409 -148090
7385 -148090 -99105 -88293 -113101 -45349 29981 138156 63837 49485 50751 -3353 -24382 -13826
7373 -13826 -42186 -45995 14428 40592 25360 57957 26880 -112304 -46640 118085 136438 168950
7361 168950 61039 -128376 -217449 -244945 -100209 -105584 -189602 -214573 -139275 -59036 -51072
7350 -51072 -67745 -207035 -213037 -103787 -22029 -48692 -74958 -72028 -91001 -157652 -118660 -13533
7338 -13533 -84475 -121590 -13579 92370 47325 36979 -17292 -18425 -56309 -106421 -97032 -144774
7326 -144774 -194432 -102874 -68193 -20632 25632 13718 -81133 -160508 -174809 -201318 -74380
7315 -74380 -4058 -21074 -20991 -44833 -130039 -139205 -157879 -89066 -61158 -30825 -77973 -96638 -80717
7302 -80717 -119039 -135526 -80656 -148438 -119487 -74969 -101644 -119010 -60731 -41383 -46082 -85104
7290 -85104 -107080 -62833 -82099 -60670 -19339 24088 27294 59370 90380 133214 178027 256995
7278 256995 257218 187359 77363 4965 13453 17862 56193 94489 93807 6023 -89690 -116448 -207343
7265 -207343 -223658 -47246 138765 193126 272692 345426 292471 282256 244085 103445 -43943
7254 -43943 -139200 -138408 -15630 24361 72934 81320 88103 22716 -56859 6736 -31736 -126946
7242 -126946 -120386 -34062 -8478 -27724 -3892 -28702 21600 -26819 -49050 -70502 -66461 -9389
7230 -9389 36905 107867 112566 110951 133536 69193 37605 -99461 -158020 -174542 -6429 34608
7218 34608 118728 166927 181047 166959 50307 -89272 -138826 -23206 57619 68844 78084
7207 78084 -8399 33232 152527 103369 71782 100410 40422 -1589 -50788 -127052 -139684 13888
7195 13888 73335 -4810 -22763 -122027 -80898 -38189 -75562 -34497 30849 38237 47588 117323
7183 117323 157648 117145 143215 99463 43318 15973 63969 59763 84782 194516 217058 209400
7171 209400 263636 197820 7053 -48591 -68443 -70090 -60431 -123446 -116844 -150530 -43465 72047
7159 72047 43204 -4075 -44444 -32330 -45401 -90782 -126365 -109105 -138297 -65114 -73199 -128948
7147 -128948 -129790 -27961 47903 76052 187875 178290 168029 18625 11127 38968 102339 141059
7135 141059 180541 125954 -12650 -56208 -74433 -135016 -78742 -62277 -63588 66447 111169
7124 111169 84512 76387 32920 -80589 -71712 -99488 -88134 -73887 -92132 -135529 -111543 -94621
7112 -94621 -47460 70525 127219 51445 24379 -7596 -12354 649 16078 -28037 -33379 -132945
7100 -132945 -128553 -54339 11298 22171 29061 41113 107142 189108 194995 214353 165350 99204
7088 99204 83173 80245 15498 -91836 -23762 30414 575 35709 31195 36340 42444 -5598
7076 -5598 760 -32700 -69862 -24254 -34799 -188685 -261083 -243467 -194674 -258844 -289793 -196465
7064 -196465 -121171 -16520 58215 63775 46872 42477 27014 25771 62127 104560 25312 -43684
7052 -43684 -76496 7767 59612 126297 -50809 -186668 -89492 -45544 20063 140112 93910
7041 93910 86500 137865 135993 68621 150518 93237 135107 97983 22419 -135003 -169634 -82417
7029 -82417 -40898 -25663 -31477 -68207 -128155 -115710 -15325 70546 84270 49198 18984 4101
7017 4101 -39702 -71167 -122010 -86488 -74500 -71555 -67251 1237 -4273 -41515 -63637 910 49850
7004 49850 55786 -35031 -28505 -1076 3127 54634 10738 -135719 -239779 -183614 -129578 -112620
6992 -112620 -15586 42122 12743 11401 36760 20752 83299 49487 -5833 -3977 60019 16819
6980 16819 -21586 -2716 -59932 16953 75975 105170 80948 13178 -27757 -96554 -24976 51564
6968 51564 129102 116738 85068 21278 -68102 -34066 -51868 -133623 -129673 -118466 -106373 -161334
6956 -161334 -70465 -182532 -256718 -113419 33921 89183 58915 -5536 47510 113324 222756
6945 222756 126184 35725 119730 51384 -9648 -80333 -133656 -261024 -258297 -160835 -89775 -11840
6933 -11840 45043 114551 1609 -129189 -155372 -208337 -180638 -132059 -20829 131586 143578
6922 143578 153636 25811 -115933 -141403 -192317 -133710 -126350 -201074 -163206 -68652 -56265
6911 -56265 -148096 -54415 5497 41307 31309 85556 60859 13917 -43770 22712 17256 -49124
6899 -49124 -36099 -13244 26133 -51482 -156141 -132736 -167096 -68166 -47592 -57677 1167 -58765
6887 -58765 -165746 -173440 -113631 -84202 4582 94081 88042 50184 -43329 -17437 61182 142435
6875 142435 78122 54041 -352 8226 -23738 46929 96777 46849 -3678 -15333 -42838 -56404
6863 -56404 -26537 4358 75019 32254 14258 -9951 15347 77763 76456 -1138 -90673 -60458
6851 -60458 31124 77281 -24456 11863 -7471 -48340 -48291 -56585 -76719 -163232 -152182 -64423
6839 -64423 -3345 -8149 -193318 -214767 -83955 -4618 -45393 -33426 -56798 -32429 -109412 -222256
6827 -222256 -209951 -138622 -248103 -312765 -197579 -131229 -96369 -18487 -67276 -60556 -43964
6816 -43964 7832 40917 -686 -123448 -137078 -150676 -154554 -1091 68313 -15971 -69204 -20835
6804 -20835 -120849 -85699 12389 -37381 -1056 -21009 -70972 -57376 -62642 -80222 -137617 -77224
6792 -77224 -27348 30784 53354 81497 41002 -41706 -188092 -235396 -234238 -129937 -33817 -20754
6780 -20754 -28816 -17707 65810 34816 -28495 -51484 15265 17631 -29477 -48225 20814 93254
6768 93254 49848 107153 182758 168784 153206 51300 4136 -100920 -120133 2862 80642
6757 80642 100346 97713 120721 75878 -13278 -123452 -16889 85277 113169 51047 10588
6746 10588 -40334 -111649 -201301 -251256 -129440 35 19221 -36109 -95994 -121648 -117649 -12261
6734 -12261 42091 53277 -2188 4705 -9081 -61177 -151573 -22846 91940 61339 71171 44178
6722 44178 59211 43816 -21620 52473 84771 42593 107088 213708 220217 133632 89518 134433
6710 134433 86390 80095 84561 52941 41981 -25219 -135488 -250216 -165898 -93345 -124471 -176489
6698 -176489 -126153 -109626 -123070 -86996 -62565 -112524 -42894 11278 63617 20117 -28924 -138884
6686 -138884 -2052 88283 9960 -33136 -111168 -198253 -191089 -248103 -281935 -195479 -37601
6675 -37601 8899 91110 87812 86481 160725 132449 70923 101345 61020 -25738 -616 30620
6663 30620 24137 -21331 -77393 -35986 -35715 79626 52365 -44636 -27368 -13701 2395 32043
6651 32043 -37471 -160496 -76992 -68259 -47939 -55129 44188 68175 86344 45792 42446 -12829
6639 -12829 -52003 57996 115344 128649 61698 -13969 10486 44542 21440 -69406 -197032
6628 -197032 -208010 -151413 -79143 27578 50226 73221 1629 -100828 -188141 -78713 34220
6617 34220 22935 -43850 110428 110670 56014 103400 58692 57907 144833 126285 71667 -8674
6605 -8674 -59107 -71610 23652 65854 31513 -46387 6356 136507 64916 -30649 -14487 -63272
6593 -63272 18220 103208 50415 3272 -73764 -107121 52901 198448 137581 -92731 -113920
6582 -113920 -176555 -185395 -153043 -116793 17156 140807 75317 100284 54984 -58396 -150884
6571 -150884 -194261 -224206 -255528 -186762 -139480 -100643 -71534 -103132 -113552 -5135 17891
6560 17891 62169 32588 -3778 -107769 -174655 -119565 -195209 -191820 -165937 -114510 -26191 76112
6548 76112 60983 15301 -5376 26610 33634 40225 -7242 -36855 42235 129439 87144 2275
6536 2275 -39193 -148255 -152065 -101130 -57765 -31052 -39884 -120502 -122066 -34239 -95026 -191876
6524 -191876 -145974 -91986 -66731 -83491 -66884 -8391 -95634 -146437 -34225 -101776 -160130
6513 -160130 -200801 -114713 -129348 -214573 -2840 131015 63803 56302 29580 29828 6669 -4489
6501 -4489 73538 109732 135045 117326 153684 147561 78420 24058 -49690 -92054 -134149 -67660
6489 -67660 -63682 -146110 -227289 -165265 -95808 -31910 -32006 29528 66536 45924 28905 22519 -60755
6476 -60755 -109698 4150 33333 -43068 27026 39901 -71098 -50776 -14784 -134984 -103112
6465 -103112 53544 39457 19550 -142681 -139317 -47789 -58259 -38711 -79894 -145743 -110460
6454 -110460 -113263 -98588 2201 87442 127816 134318 91534 6515 -103719 -287519 -329404
6443 -329404 -282763 -270185 -217402 -224975 -261086 -233245 -141351 -101652 35753 27035 10977 -52467
6431 -52467 -69765 -134572 -146297 -183178 -125923 -184949 -240803 -198513 -193834 -177144 -89103 56570
6419 56570 156707 209989 111064 89017 92998 94570 127720 5075 7910 -57107 19948 81188
6407 81188 -12919 -56554 -131124 -139777 -127646 -98683 10391 125227 58369 -41140 -75841 -49895
6395 -49895 -104660 -149904 -179237 -155749 -90672 15659 38060 47217 74262 74799 -6651 -47531
6383 -47531 -137840 -172700 -108158 -110864 24546 165080 173852 104662 39540 77004 59829 8308
6371 8308 96894 150222 197379 224526 102329 -320 7788 100052 73255 29000 100152 93574
6359 93574 -8183 -68969 -39689 -18653 -35448 15157 11878 29639 10091 -46532 -45176 -164
6347 -164 9345 -33260 -34925 -2914 40846 -28878 -153276 -222917 -233538 -280889 -299774 -316259
6335 -316259 -279865 -160076 -63647 -54907 -108069 -125815 -4155 14938 16449 -31608 -102641 6009
6323 6009 -7285 -94265 -30200 -19634 45507 11800 -504 10006 -71911 -99791 -76160 -118840
6311 -118840 -116593 -141777 -232521 -169906 -137635 -126756 -109935 -204843 -126089 -27831 -17785 -64171
6299 -64171 24859 121573 45150 -37088 -53597 -95150 -54714 55602 23946 56734 20521 48783
6287 48783 38042 -92044 -80918 -92030 -3880 23373 39285 29908 -6941 1840 -56732 -7079
6275 -7079 -32499 14712 22192 58054 74996 65455 83908 93505 114010 31311 -426 25689 404
6262 404 13474 59513 84647 138321 106033 110626 93549 148084 126648 152826 91771 124411
6250 124411 70469 -8389 -23101 25124 -40522 -105674 5146 7410 -143611 -228061 -139173
6239 -139173 -215731 -195276 -117844 -83322 -21291 40126 17235 -28495 -51847 -108696 -51912 -47069
6227 -47069 -16954 -4923 -114620 -149459 -96878 -126235 -121335 -17637 44869 132083 242581
6216 242581 215000 144011 74314 126110 140599 166094 225960 248581 230174 94541 -15590
6205 -15590 -90107 -90471 -66334 -3747 -22565 -43043 -73928 -71580 -38284 22769 -83005 -139793
6193 -139793 -69362 -6449 -39685 -37170 -44573 11217 9054 -99662 -38702 41724 -35392 -173246
6181 -173246 -131618 -74187 -14152 32076 56133 34611 -9889 20199 5355 -24240 -27672 -7652
6169 -7652 -38343 -77257 -131471 -237777 -198264 -80665 -10864 12324 -18722 -161729 -280068
6158 -280068 -249364 -149479 -120958 -101841 -7531 10880 -49328 -72666 -34510 -101003 -244833
6147 -244833 -249736 -206651 -160209 -119869 -109773 -54366 29731 57821 16881 9221 -34620 62982
6135 62982 124540 27208 -3431 69642 120416 33516 -9334 -124782 -102533 -98207 -21268 61255
6123 61255 32033 43295 109814 181353 160614 12337 -55864 -33765 73976 97301 -2541
6112 -2541 -116583 -46767 597 -47174 -59809 41360 52168 -2406 -2423 -18709 53206 26801
6100 26801 54266 -22748 -73247 -13508 54396 83197 73606 30984 93132 87496 12751 76132
6088 76132 168540 38529 4259 32366 5256 -53116 -40885 -56633 -93924 -110898 -90559 -15732
6076 -15732 -101788 -216658 -208932 -148243 -74106 -71338 -77558 -87871 -119281 -209060 -248757 -148551
6064 -148551 -120842 -48954 -28863 -138680 -103185 -108880 -76753 -5702 19499 -17321 -5556 59967
6052 59967 -19308 -38601 11155 28801 403 44762 -19206 -171079 -184648 -152318 -117196 23113
6040 23113 -23035 -106968 -178625 -256715 -241593 -183606 -165637 -118347 -938 70805 3621 -110097
6028 -110097 -21173 -64648 -96373 -101498 -165053 -76773 22461 73918 27596 -19019 -71105 -42130
6016 -42130 43474 106893 160181 62627 10068 -1298 -56295 82709 119990 23889 -75466 -95129
6004 -95129 -47707 -52573 8784 44363 37476 76981 34023 48463 87376 113301 147862 92113
5992 92113 73482 -85213 -105480 -83262 -89924 37969 59637 -78766 -171892 -235580 -262173
5981 -262173 -220063 -172857 -104435 -20251 39322 52545 34814 63648 17497 -45624 -86067 -100863
5969 -100863 -68074 41726 38854 30794 65684 -36455 -76749 -33516 18031 18622 -26342 9586
5957 9586 -19946 14445 87089 115169 58152 -73961 -150596 -157161 -53032 11675 16473 16529 77065
5944 77065 37067 4556 -33611 -3149 80178 94138 139252 79204 35960 -24294 -159605 -193464
5932 -193464 -86847 21682 6432 -57397 -15751 35032 16414 77789 71610 83338 -7978
5921 -7978 -22698 58749 85994 47836 52590 39598 -10384 -19665 55067 27345 -115727 -88207
5909 -88207 -49081 -77614 -133080 -32516 6366 67625 78767 7323 32507 28836 18442 62946
5897 62946 113751 73920 70104 24579 20363 10212 -20686 9425 17507 86540 -13591 -81125
5885 -81125 530 61520 3394 10686 15014 -14961 -38649 -60512 -42135 -55830 -29050 108369
5873 108369 129395 129924 228309 182357 229763 158110 17719 -134155 -108875 -64280 -20114 4281
5861 4281 12721 24134 32358 62499 -7545 -57467 -33703 26364 120740 167576 38519 -36171
5849 -36171 -10085 46613 119087 166557 70782 14276 -23791 12746 -41850 -87025 -86533 -41647
5837 -41647 -50338 -344 36822 -30193 -127846 -204060 -59094 -75180 -184439 -103460 -46697 -50572
5825 -50572 -41188 -83013 -75655 23179 152701 147348 208854 197062 -26558 -42203 15037 52617
5813 52617 2594 29765 56608 -40306 -26729 21558 -44767 -140574 -119063 7262 98124 40747
5801 40747 15528 -7906 -86664 -77664 -140242 -166268 -63091 -110345 -127387 -89553 -48578 -67238
5789 -67238 -61480 -118985 -162645 -121228 -32941 34258 57566 8043 -29587 217 68351 34586
5777 34586 47859 72201 32050 7285 -22578 96206 65283 -33251 -47065 -17625 -29087 23834
5765 23834 66125 24675 -5057 131543 103255 44545 66599 22424 -1196 62591 22981 -54527
5753 -54527 -34440 -166176 -212336 -192554 -281225 -205459 -117670 -181862 -283098 -240338 -286653
5742 -286653 -275124 -231183 -110965 -229749 -319348 -271433 -108772 29214 42037 101753 80671
5731 80671 -24687 -14714 56083 90194 44788 -91171 -153090 -177800 -140460 -48633 -12684 79230
5719 79230 117398 100943 91922 49077 10777 -60724 -36913 -25862 -103506 -191009 -272325 -210537
5707 -210537 -22570 86883 38195 -15248 -10296 -11999 -25641 11498 3304 -50123 -30188 76485
5695 76485 81134 1290 -63206 -113879 -114224 -11533 31926 101876 127939 92360 38161 12112
5683 12112 -69756 -61839 3941 8654 -76029 -181877 -169362 -189687 -174802 -101612 -81750 -43542
5671 -43542 365 28559 77302 86836 23867 92345 133560 137045 53592 14725 4371 -51625
5659 -51625 -14685 74595 156531 232949 172731 93588 -46355 -27210 36609 11035 -81539 -60300
5647 -60300 -42474 -132870 -27085 75687 113298 30865 -13374 13384 25693 -838 -41948
5636 -41948 -139019 -155079 -99713 -32659 26326 65802 99037 66855 44266 -36308 -383 67691
5624 67691 58255 -9132 -62091 -73953 -71945 -100181 -125589 3609 67774 -19485 -119912 -36455
5612 -36455 6310 -42860 -96988 -130607 -32534 3526 30837 7110 59206 104151 52191 53818
5600 53818 35992 51676 -9722 -23624 -70472 -44943 67556 72406 92937 45424 57870 -6721
5588 -6721 19749 44001 -42959 -23650 -44138 12483 63625 80241 23756 -34854 83094 142139
5576 142139 108611 71414 64404 -23206 -83533 -100206 -77691 -59711 -109745 -146156 -39029 -60150
5564 -60150 64548 -1525 -18382 92099 65451 -95133 -263456 -153218 -44508 46732 126208
5553 126208 83112 -29652 23152 100305 -32785 -116870 -169079 33672 152526 198076 150600
5542 150600 85326 -97070 -108816 -84708 -19590 38788 -49358 -192369 -155018 -140877 -138108
5531 -138108 -136872 -125740 -117744 -140432 -143361 -64177 6589 62278 64701 -16765 -26644 -7728 9383
5518 9383 25761 871 11218 70165 161105 122303 21588 8262 12203 34429 32242 6109
5506 6109 4522 28507 -36005 -85869 -96184 -87163 -181293 -239370 -296377 -227281 -210543 -207317 -123614
5493 -123614 -124228 -159631 -104751 -133404 -146028 -169880 -212871 -160260 -121256 -74521 -48458 28739
5481 28739 30940 35569 100647 151819 46611 8976 -44129 -17125 34159 107383 174754 152511
5469 152511 107777 21321 47139 4021 -135369 -93733 -97524 -164070 -152287 -178771 -103413 -99685
5457 -99685 -90374 -2355 -16058 -82311 -83794 -31142 -59135 -124364 -179229 -79336 -127290 -223184
5445 -223184 -242377 -194363 -195743 -211929 -184823 -123681 -87763 -55726 -39486 -49225 -31938 -65167
5433 -65167 -86215 -97496 -105299 -105944 -4852 97818 35434 18558 -36944 -56643 -148558 -199891
5421 -199891 -116624 -55503 -58246 -35829 -48474 -11434 -10156 46902 28469 -2436 -17047 43293
5409 43293 64812 -58240 -85331 -129212 -234274 -217052 -160684 -49803 -15922 14284 -91254
5398 -91254 -96576 -109670 -124346 -80109 -15395 -15623 31922 81076 78845 -45489 -98550 -117287
5386 -117287 -132284 -3424 -14940 -101323 -110513 -26136 -34803 -43277 51090 70189 26519 65655
5374 65655 -24151 -116053 -174063 -241859 -153797 -46725 193 -27127 52848 113458 -5275
5363 -5275 -118464 -46582 -302 30549 9788 51649 34192 -28379 -87728 -144047 -75457 -35084
5351 -35084 -102230 -764 -74622 -66281 -1294 -5714 -44928 -72893 -135694 -43489 -1390 20901
5339 20901 76941 146948 135593 94808 50278 -3916 32660 18249 -71327 -79521 -146672 -32278
5327 -32278 88761 107509 38069 -3505 8756 -27697 3862 62737 91009 85784 -18599 -42217
5315 -42217 -117723 -151172 -124185 -148367 -186850 -166548 -188139 -183708 -190005 -200752 -163942 -178962
5303 -178962 -177290 -250938 -228986 -179848 -118114 -84553 -78228 -105300 -53675 -21674 -124766 -96078
5291 -96078 -48228 -3710 33223 -45058 -22225 -75996 -195278 -181358 -110497 -90924 51411
5280 51411 63227 51509 9237 20032 19932 -34937 -831 29011 27059 -23856 -95618 -70567
5268 -70567 -44101 -60191 -104187 -86699 8188 62771 38184 27812 -1072 42245 30017 -7522
5256 -7522 -17237 -15671 -96454 -100790 -33728 -49335 -45229 -32037 18745 36622 16531 44776 -32751
5243 -32751 -101943 -97255 -84626 -8907 48431 27696 84365 54656 56087 106238 50839 2600
5231 2600 -132296 -105658 -56940 -11693 117902 201599 160184 41221 50212 36071 -15025 -57685
5219 -57685 -50158 -96669 -114545 -119166 -104059 -194270 -134938 -43593 -96538 -106732 -3391 -49249
5207 -49249 -101526 -72185 -47544 16391 56003 32201 45834 20133 5463 -111355 -130191 -84759
5195 -84759 -72602 -139999 -184957 -89440 -26964 -19300 116690 116940 32607 -21541 15136 140904
5183 140904 90006 15427 -65731 52299 106432 111274 132004 67459 -52314 -20353 61037
5172 61037 86414 -4045 -81564 -113135 -51736 -20769 -19895 -126424 -70379 21795 62348 11144
5160 11144 -41879 -85969 -85955 -38954 54493 33197 -4630 -21247 -34194 -136592 -135855 11231
5148 11231 94955 107308 178291 162170 -37193 -85968 -29055 1324 41371 44078 25042 84099
5136 84099 122321 -39295 -152112 -124065 -72530 -78106 -17608 34649 142027 178380 256149
5125 256149 319138 233635 208898 163878 120114 21677 30308 -71888 -158051 -112658 -79033 -39012
5113 -39012 -43123 -141751 -138343 33072 112546 57629 -63260 -84216 -135736 -96861 -125982 -122078
5101 -122078 -176942 -60680 33476 -11278 -50296 -65476 -84206 -42115 -18266 -54687 -82902
5090 -82902 5350 36063 36394 108219 116110 51202 21948 -10900 26809 7780 -14864 -46632
5078 -46632 -16063 -17307 -32119 -97342 -137500 -188921 -130427 -25440 65806 45544 14431 -29671
5066 -29671 20237 81450 112136 -33522 -158787 -237552 -159691 -149052 -191112 -82468 -101650
5055 -101650 -178948 -226461 -163486 -13157 -2145 -56817 -71068 -70821 -106150 -73114 -61197 16941
5043 16941 50707 51636 -38396 -19749 35841 -11523 -19480 -31178 -963 117005 65227 7683
5031 7683 1036 -19667 -95681 -54407 79677 153144 112086 -30752 -44649 24395 5187 -58880
5019 -58880 -72007 5819 -75133 -153512 -240832 -286795 -179744 -103345 -67118 -10653 30363 12322
5007 12322 -52985 -23006 -14225 26780 84270 66100 12499 -60865 -38476 -11195 18014 -67699
4995 -67699 -37207 -8815 57930 -2699 -15462 -15699 -30399 28144 -17728 -18794 -60948 -124633
4983 -124633 -94120 -85591 -56495 -60148 -83449 -211673 -177846 -203708 -199101 -223481 -223865 -84536
4971 -84536 -48070 -68803 -60209 2659 -100955 -178973 -134878 4597 169381 197953 165567
4960 165567 82131 175145 241864 115928 129236 105156 57097 7418 -33817 -13349 79847
4949 79847 130543 98716 127733 37918 24760 -6757 16607 28267 52534 152423 25074 -72558
4937 -72558 42762 53171 -8950 20436 9792 -78301 -43472 -3415 60559 124184 127818 106119
4925 106119 46042 13484 -7793 51140 39247 6632 -86194 -135914 -145295 -115165 9208 128980
4913 128980 178993 95911 -43243 -93889 -24851 117116 84192 76030 166755 76524 39856
4902 39856 28883 -58716 -70016 -99838 -136736 -93240 -40401 -18689 -57569 -22830 -41657 -16992
4890 -16992 -43878 -43428 -96379 -87132 86036 24512 -160620 -170345 -130400 -58935 38329 154184
4878 154184 123213 58421 -3660 -87910 -41821 -49662 -6811 15865 -55060 -89110 -97672 -45036
4866 -45036 57950 29885 -3403 12780 5551 -41626 -1279 -54552 -71466 -89410 -69789 -67656
4854 -67656 -28297 5024 -83070 -168882 -217336 -166219 -37368 19045 55406 87233 121890 240302
4842 240302 319973 364983 314540 289751 193675 96934 69790 122618 111414 177132 218210 194859
4830 194859 134422 112090 -10924 -3889 43082 88222 71404 122995 180567 99260 47181 98147
4818 98147 126633 123975 99335 7281 4224 -56305 -173939 -240889 -134057 20346 22939 -7944
4806 -7944 26166 -51966 -59200 1436 18352 114861 159794 83352 -20492 -70994 8313 24108
4794 24108 22381 -48186 -93768 -18445 114449 190309 166883 135301 243403 136434 47799
4783 47799 37439 -26974 -29221 -36783 -129280 -221070 -227953 -217011 -141032 -84290 -27536 -2468
4771 -2468 53106 74439 95574 105091 15980 -22437 41973 33923 -66732 31353 93514 38610
4759 38610 1501 14332 -45624 -16997 56845 44862 -50293 14693 65772 -36850 -27176 15386
4747 15386 59841 84674 18947 -16021 60624 15112 26929 -7137 -64075 -114911 -34926 -20352
4735 -20352 76166 208833 181800 87044 52573 87925 114503 24964 3640 30893 80712 107686
4723 107686 115009 -38693 -88988 -92564 -5148 87442 89013 118700 21299 -72096 -109225 -38479
4711 -38479 -8150 21942 13844 65889 179417 109902 54298 62580 42533 -54740 16790 -92568
4699 -92568 -81044 -62727 -70808 -50522 -31131 20307 37281 -111265 -207661 -243379 -239868 -138246
4687 -138246 2505 65714 84190 51629 23843 15718 11108 29038 33100 36258 -58505 -46633
4675 -46633 78129 66916 -102132 -140414 -46115 73361 64794 2410 -56649 -18041 116646
4664 116646 152269 150749 225045 143948 20562 -67446 -107470 -74730 -146979 -165423 -93252 1476
4652 1476 26334 31448 55459 -42443 -57136 -120521 -70514 -40724 -13031 -50366 -106119 -117206
4640 -117206 -44320 -49318 9253 60406 71768 117090 107098 135759 144762 202319 120426 25113
4628 25113 91940 70074 96168 163321 135606 101764 56282 13009 67494 44635 80662 152314
4616 152314 242240 204623 63667 -90268 -39879 83853 125665 150444 30527 -737 6199
4605 6199 56418 -21036 -93001 -68999 -93265 -162059 -121647 9503 -50887 -103725 -105022 -74813
4593 -74813 -40308 -33181 -72617 -264492 -261657 -193842 -108101 -144409 -55977 88558 193361 92826
4581 92826 64692 108885 192323 184659 238137 271109 171952 10050 -84741 -148530 -23990 75949
4569 75949 63962 1743 -46981 48238 135769 76783 -61182 -128295 -25911 7997 13358 15657
4557 15657 -70832 -15771 122339 69134 -78250 -97593 21209 200399 245805 297834 233200
4546 233200 102497 38976 -74538 -32513 -95969 -68045 -113765 -145181 -156729 -89769 -16852
4535 -16852 -2152 -54523 -9870 46751 36071 13269 83428 111291 55559 -6879 -22901 100192
4523 100192 132587 102391 70240 -1833 32010 28305 -35594 -26982 -51097 -75011 -138919 -180562
4511 -180562 -23330 64198 87135 107177 65362 5707 -20908 -77230 1863 95166 72969
4500 72969 -42142 -139115 -126955 -202909 -187878 -145144 -71170 65438 111186 68122 -3752
4489 -3752 57992 105720 11447 -72347 -83682 -42532 -32587 -96689 -228536 -227090 -182410 -22841
4477 -22841 -53060 -77310 -84790 -117256 -92114 -14674 115030 144992 109977 52191 115334 40174
4465 40174 -77228 -142811 -92146 -124088 -129282 -53971 -57593 -35654 31429 11067 -106834 -138315
4453 -138315 -143176 -60179 12150 -16995 -29689 10588 -52230 -107600 -72569 -38976 -11820 -20164
4441 -20164 -68157 -76383 -190571 -153909 -121564 -72383 -3468 -38110 27239 -35151 -24601 -84152
4429 -84152 -104103 -79643 -19512 -17254 78784 100423 90474 93703 74889 149116 202514 213766
4417 213766 185231 135054 16258 -93550 -166906 -246868 -207737 -93658 -63547 -81176 10363
4406 10363 120865 126722 108989 137902 89699 69908 122717 145861 154650 208628 220232 91709
4394 91709 24967 -53953 -22065 -60834 -70015 -69655 -119716 -127516 -158342 -102217 -48883 -6298 71111
4381 71111 98119 81864 63022 103438 206080 225518 61247 -46851 -45560 52379 44779 -72
4369 -72 -15277 -73456 -62257 -32902 -49764 -35053 -8788 -58848 -5115 22963 68420 77941 109263
4356 109263 72855 213237 198159 58601 86224 53079 -46114 -101442 -162859 -188808 -146142
4345 -146142 3627 108471 -1019 -111578 -159999 -127177 -124445 -141156 -145563 -152129 -141375
4334 -141375 -169342 -127233 -30865 83852 48658 -75763 -12045 29552 116772 175137 194019
4323 194019 199256 182871 91468 29669 22205 87357 181564 159742 46220 42763 56139 8064
4311 8064 658 18368 -32057 -63064 -92511 -5292 126088 190353 175176 116948 -77769 -140802
4299 -140802 -13584 110582 62438 33887 -109263 -217163 -207405 -141124 -55152 -94742 -115385
4288 -115385 -106026 -81880 -19492 -8327 -29229 -46912 -11244 10183 -58400 -18741 -17848 -131326
4276 -131326 -54185 34232 48685 -17535 -25501 27177 -4892 -82216 -22794 11716 37441 154734
4264 154734 153033 143294 66791 518 -3509 -89216 -130180 -94232 -36936 -23289 39104 57450
4252 57450 -39080 -61118 -38147 1213 19288 74733 21639 -20271 -65382 -67156 4775 59845
4240 59845 18126 59067 94014 17250 -56306 -92714 -75265 517 100812 119266 16892
4229 16892 30519 37823 -34232 72812 173902 208562 172236 144411 137938 170946 65692 -17330
4217 -17330 -8542 -14527 -18413 -33855 -48607 -71989 -80510 -99760 -33788 -17859 -40635 2556 6207
4204 6207 96139 198509 112878 125976 138811 196562 38678 -10070 99340 3131 -19522
4193 -19522 69059 62639 73810 148452 56830 41944 70912 -61994 -162351 -57841 31120
4182 31120 52950 102497 117651 25636 -15041 -69886 3644 61039 -28694 -108248 -102181 -18131
4170 -18131 138692 107193 -14163 -13264 684 38658 39669 43428 13433 -26145 -139169 -155468
4158 -155468 -80730 -42706 -71369 -98800 -20879 17704 -53138 -33893 12690 74918 127015 26306
4146 26306 74137 51605 61463 18113 -7947 -13455 -54146 -86370 -60986 -113248 -29637 13820
4134 13820 5207 -940 -10541 1364 -33746 273 29363 -37544 -122877 -106565 -108928 -124473 -39201
4121 -39201 24141 -53759 13619 159530 186935 134714 226635 213694 197920 78451 43420
4110 43420 12086 -11198 53444 170993 196335 93207 28517 62778 91964 139116 107580
4099 107580 28026 39536 15118 -16674 -20075 1670 10968 -82906 -138454 -149575 -155733 -63968
4087 -63968 7885 82275 53868 143347 273009 250237 163013 91371 41211 -53949 -10870 161581
4075 161581 228069 64269 13966 13443 23004 74631 58582 43291 -44500 -144487 -143065 -191764
4063 -191764 -94891 -122439 -193579 -134227 -109575 -156517 -180787 -110454 -132015 -63830 -39071 -26851
4051 -26851 -19727 -78249 -101825 71111 162834 17516 -83337 -89061 -24591 -37631 -79352 -75028
4039 -75028 69674 -22822 -152196 -208689 -80968 36122 127001 125790 28124 8130 -33360
4028 -33360 -73667 19258 55052 21100 -101594 -83351 33863 -18057 -85131 -80087 -71679 50043
4016 50043 21530 -60391 -44537 -48753 -79438 -5737 159313 63635 -21285 38099 -41356 -91887
4004 -91887 -143174 -113112 -38716 45812 147883 145321 107337 182735 96858 23947 -77596 -64168
3992 -64168 -80808 -171835 -214318 -232931 -271227 -202858 -107263 -76791 -54941 -55347 13155 156884
3980 156884 166605 90457 111827 131656 38562 38772 33998 -34185 -89601 -83389 -144698 -183657 -148289
3967 -148289 24707 138540 88313 -11599 57088 173239 47735 -58796 32580 3171 49845
3956 49845 65000 58146 -66507 -133149 -105218 -78456 -39785 3247 35634 76139 63764 33377
3944 33377 -94621 -116550 -142748 -72984 35773 81396 96441 97617 115010 92724 76073 29388
3932 29388 9719 -1584 44157 -6298 -49387 -30319 75113 134739 73685 50838 29008 13810
3920 13810 49110 13940 -16096 65070 55536 77895 36173 85312 10979 -53735 7378 34527
3908 34527 -20023 50323 147266 228700 172185 59659 8677 -103332 -110766 -96377 -19000 60319
3896 60319 2699 -63450 -105494 -65993 45017 180542 204321 88656 46505 56892 26823
3885 26823 42540 56849 -381 1357 94815 21416 -19013 -72153 -49512 76645 44144 -42787
3873 -42787 -40594 50663 51368 68131 48945 -2707 -76711 -116860 -144590 -159951 -108537 -24022
3861 -24022 -22442 -40818 99609 -15421 -43002 55338 -171 -57265 -20471 17842 9337 1692
3849 1692 45051 169187 205215 100564 -41399 -21613 -7337 -36711 -46695 -35522 3979 246
3837 246 -21460 -76859 -130269 -205752 -163154 -69830 -19658 -24627 112 -13012 13692 -79147
3825 -79147 -76929 -153100 -60804 93607 54437 4940 -50247 -84539 -60144 26394 -9689 -62693
3813 -62693 -72476 -65262 -115452 -150189 -70005 -9514 55251 106771 59168 20001 1000 -57349
3801 -57349 -111095 -130592 -40251 -116159 -6611 5571 1665 20803 86754 88346 27051 13700
3789 13700 -45947 4453 35498 69213 3119 -21193 39879 93094 51751 17737 -26905 -8337
3777 -8337 102553 78376 29171 27284 19369 77287 91495 111185 114452 45528 93609 75403
3765 75403 97065 103144 177809 132272 67479 109670 72270 -4132 30732 191996 195287 137257
3753 137257 25350 59417 142767 115395 38708 -27170 -97833 -105011 -130372 -169190 -195748 -173569
3741 -173569 -85544 -27242 -31325 -31947 51766 93328 -73714 -155104 -88363 -41420 -87768 -19513
3729 -19513 -9050 50786 -4956 -58576 -48058 -79453 -80962 -123891 -136397 -3049 6166 -104909
3717 -104909 -576 6856 -169792 -189173 -145534 -5738 77378 98082 29523 -74032 -55770
3706 -55770 61654 181395 213250 213233 302032 255324 158268 93744 -30276 -139782 -99101 36515
3694 36515 -80657 -150361 -201431 -202274 -235942 -147644 -194225 -208045 -134153 -62698 -55425 -84679
3682 -84679 -71178 -33335 -14016 -72615 -77603 -50036 -67421 -74783 -1117 -136206 -166334 -96887
3670 -96887 -65143 -77414 -64941 -38865 -27667 4235 103888 185415 168145 81210 -73053 -96144
3658 -96144 -16265 -23058 -74861 -40946 54640 63681 80764 49495 -3583 -110100 -123175 -75491
3646 -75491 -35341 -13585 34083 54880 29805 22792 -10933 19267 -76059 -103875 -137720 -150632
3634 -150632 -156458 -145525 -138896 -36136 -41653 -120420 -219093 -207219 -280101 -270215 -157218 -80469
3622 -80469 -68248 -70729 -89638 -100842 -61814 -47451 28619 -53952 -83821 -21473 56016 -53925
3610 -53925 -42851 11153 -7243 -2526 77715 45366 -66178 -8865 -46843 -57376 29201 7227
3598 7227 -25629 36976 153490 121532 24636 8227 -61179 -159969 -77469 21106 52231 -37755
3586 -37755 -41670 -72891 -80114 26056 43967 -52713 -67813 -46953 -66586 -21473 52275 63232
3574 63232 72375 73192 69655 -36926 -60609 36091 7421 5362 11248 3409 -6561 5282 8402
3561 8402 -12993 -49260 -47936 -21546 5006 17867 -45001 -42813 -18986 -73938 -12054 -21585 -64724
3548 -64724 -42291 -21452 -65790 -23642 7047 33148 -37798 -65993 -89182 8195 112832 105260
3536 105260 130873 161499 176112 28652 -201154 -254715 -185099 -104590 -20579 -23053 52772
3525 52772 70441 -4060 -78960 -186686 -117279 -43882 -57970 -132547 -96562 -180964 -149611 -134068
3513 -134068 -82590 60525 99832 124277 147926 105889 122998 71073 14669 25675 17079 -135495
3501 -135495 -261581 -156217 -119177 -153348 -21230 20939 25049 103804 99038 108727 20159 -49264
3489 -49264 6753 -90772 -28893 -38579 -30109 -31057 4230 100120 73092 -22962 5158 126303
3477 126303 70312 -75724 -183067 -90800 -110681 -112530 -37443 -38553 56640 37114 -5385 -103839
3465 -103839 -170867 -97320 -932 112780 -51391 -149747 -105131 -89556 -38475 -13862 -98227
3454 -98227 -13647 -27040 -101357 -132926 -271393 -285680 -269787 -166686 30003 200420 206570
3443 206570 158244 152677 108381 -97607 -204510 -49151 70434 71659 -14524 -39123 12181
3432 12181 3022 -18954 -52845 -138148 -114543 -56073 -6740 16886 -24425 -98139 -62998 -45532
3420 -45532 -129831 -84526 -90109 -58054 -34851 -16139 11719 -55638 -38822 -77183 -93049 -69306
3408 -69306 -112365 -70482 -20306 -38683 -27809 -23052 -62368 -28847 -38754 -14718 -3202 -5155
3396 -5155 -45502 -86767 -31117 11084 71016 1191 23358 65803 97425 75100 44145 25889
3384 25889 26483 -58019 -113540 -89727 -75684 -132582 -87415 -24819 33232 26749 18133 -67275 -46069
3371 -46069 36454 34829 92810 127676 147675 56359 -25522 -78287 16153 110100 81512 -2086
3359 -2086 545 40918 144618 167367 -22192 -128926 -169683 -113884 -16816 -31649 2085 69806
3347 69806 77139 90260 55476 148746 97866 118395 140038 15551 -59788 -7255 7851 -98909
3335 -98909 -103116 -49519 3843 65211 68315 99858 64380 37071 95183 100277 79546 57526
3323 57526 37936 55238 3889 -58425 -67492 -18311 -49601 -68434 -88638 -113164 5715 -44394
3311 -44394 -38780 -37904 -83146 -72340 -34962 -10462 -61300 -225544 -251427 -114812 43282 -101530
3299 -101530 -153071 -103193 -6335 27003 -63412 -51543 -64790 -98754 -134005 -205342 -67012
3288 -67012 -30750 33825 104881 112219 195890 234031 157179 94195 65877 -31771 -86939 -96817
3276 -96817 -134734 -126132 -46432 95224 119592 37455 -11865 -23742 -27096 -50994 29326 127632
3264 127632 32991 -31380 -50444 -68770 -72292 -93069 -40743 -10593 -128420 -82354 -62759 37559
3252 37559 75171 -13997 40231 32017 5630 33821 -42514 -134783 -116277 -71359 -91693 -96334
3240 -96334 -17795 -41999 -47429 -18172 -63058 -88461 -65888 -109596 -66391 6010 2970 -9545
3228 -9545 -19632 76437 108094 49122 -24764 -104248 -83599 86040 228830 138003 45884 12517
3216 12517 7943 -35573 -43512 -74316 -35048 -88597 -180392 -188520 -227044 -110743 -93141 -123569
3204 -123569 -15689 62211 -33434 -69727 -43440 -56369 -9123 -43745 13337 -26509 -69805
3193 -69805 35715 52382 -4649 7770 -21096 -20403 29645 102380 104338 117725 22420 -2365
3181 -2365 100642 108589 126654 30849 -32931 -45822 -124130 -147304 -110586 -5546 59237 98439
3169 98439 17203 76823 106835 15766 -71124 -42664 44751 -101491 -227456 -226789 -180973 -103871
3157 -103871 -74792 -26314 -50149 -91128 -48350 -19226 -70653 -129855 -103293 -136337 -149299 -152592
3145 -152592 -88303 6468 -44938 -96652 -64343 40233 118538 53791 25116 59635 -5916
3134 -5916 -8865 -30996 -4383 59140 -34285 -38028 -104706 -129947 -82864 -86945 44296 71525
3122 71525 33943 2565 -100416 -141535 -124526 15863 22700 8977 -46765 -106164 -84909 -114320
3110 -114320 -46013 -13075 -26010 -8210 -57803 -81281 -13042 -3930 -69870 -124514 -44523 -62789
3098 -62789 -22985 -15198 14257 -26546 19017 -4330 -23803 104476 110066 187487 192589 143720
3086 143720 126586 107506 62095 72121 12234 -62624 -76142 -43124 30376 -12053 17760 52763
3074 52763 55556 110217 159111 82745 47917 72977 103024 61844 -50422 -12020 -30698 -108485
3062 -108485 -113016 -96405 -47554 -9297 -12154 -71629 -11442 38560 75462 83465 -35896 -90874
3050 -90874 -110332 -107859 -76134 -84092 -60291 -89711 -129345 -93490 -76504 -164866 -137710 -150348
3038 -150348 -103240 2775 103169 48359 -89454 -101825 -104960 -134279 -77122 45203 98926
3027 98926 40912 -17772 -63739 -53199 41494 -18937 -17526 17645 24324 20354 -24745 -34571 -11243
3014 -11243 54889 150788 193129 97019 -113412 -142389 -88394 -67813 -52306 10471 105444 52249
3002 52249 7185 117318 145454 51765 138086 228846 299032 253179 137424 63491 -65948
2991 -65948 -45021 52411 93073 -23844 -16178 -25832 12905 117222 164360 157725 144769 127611
2979 127611 158001 170187 99413 39499 -19301 -53663 -65648 -66945 -114771 -129159 -50161 -15551
2967 -15551 45593 181565 106132 41007 -118456 -237968 -228911 -172277 -114220 21592 67162
2956 67162 89503 1213 -8002 44818 -19425 -19049 64689 134046 91752 71813 25329 3707
2944 3707 -2522 -53891 -58417 3585 116953 142850 67252 -86037 -126114 -180160 -71301 82650
2932 82650 61866 -71309 -84825 36923 97949 -1565 -50883 -117033 -70813 26983 75479
2921 75479 12065 -32152 -62378 -55254 -77470 -96140 -74979 -100487 -156517 -106262 -18566 25167
2909 25167 -394 -95470 -182750 -221430 -136317 -149629 -66637 94531 150970 89871 47842 -4805
2897 -4805 -55561 -26812 -21803 -40422 -89952 -16212 81282 72745 49498 -5893 54105 101312
2885 101312 -12290 -60597 -52898 -88484 -20559 12462 75316 88347 161942 111786 53548 25142
2873 25142 -14199 -47032 -39706 -4852 41261 43352 -62577 -124982 -95992 -84936 -92375 -8101
2861 -8101 19268 17139 -24947 -70058 -48767 -30650 16446 69561 13345 40038 70290 114565
2849 114565 140377 47077 67750 74557 129832 100950 55502 120952 165821 134003 154062 135738
2837 135738 61432 46295 -13321 8030 117911 145117 41238 -34787 -71103 -72867 -70115 -42870
2825 -42870 -41541 -57511 -50025 31428 96164 48602 76200 94735 151531 116780 5582 -17134
2813 -17134 55068 45472 -19328 9961 -20587 2423 26031 85177 42344 31614 -17413 -50163
2801 -50163 -53942 -55575 -124381 -94026 -97859 -113788 -106463 -39933 37699 29430 -5962 6896 -11737
2788 -11737 46491 58579 65905 55243 -54697 -89901 -29543 -73358 -99682 -17035 21902 58771
2776 58771 36098 -78492 -19469 144607 162739 157701 77757 47668 -69858 -47004 -101768
2765 -101768 -1026 -28099 -28508 -54307 -95017 -35862 13438 56515 -25119 -101003 -71261 -50174
2753 -50174 -59884 -127603 -74251 -32946 -86008 -138701 -198334 -121515 -136800 -2065 29723 -35508
2741 -35508 -73927 -6240 -24256 -37787 -92968 -187193 -123335 -97396 -82265 -108646 -8660 98865
2729 98865 115084 55331 35605 53604 103285 105902 64211 -34706 -99030 -117360 -35301 50073
2717 50073 90679 35285 15542 17726 -9010 -43417 -18004 -38036 -46213 36979 84945 48322
2705 48322 -9788 -12453 18878 69904 51601 -20441 -63880 -100412 -59935 -3998 -87179 -140273
2693 -140273 -156255 -215752 -204923 -131592 -185058 -287721 -223994 -161108 -32363 28985 7566
2682 7566 -30234 22533 134218 219385 145858 129095 191514 225409 157913 154773 74159 133477
2670 133477 82483 -59023 -165852 -197651 -167049 -122096 -101197 6406 118228 45524 27031
2659 27031 -2114 47892 118684 36439 61715 183005 227020 142281 45930 -38272 -27198 10648
2647 10648 17025 8711 402 -10712 -7019 -58467 -66722 -14782 10426 71573 -10692 -87256 -61684
2634 -61684 -48267 78729 70051 102614 210322 144074 42667 52935 56864 4828 42056 150303
2622 150303 150684 83552 -7995 -74133 69998 214264 213867 184940 184091 226936 237485 225983
2610 225983 191871 198535 53291 18496 37829 36686 -42492 -52116 7179 37711 63495 42256
2598 42256 -9868 11709 101139 165259 128165 80436 64110 37924 8561 -39762 -17855 -67778
2586 -67778 -81788 -70069 -178815 -146309 -40099 62415 90289 -11442 -116004 -2052 75594
2575 75594 112374 52352 58550 105594 116124 72087 21926 11726 30729 14264 -44303 -42213
2563 -42213 -141519 -159006 -158266 -17689 24189 35652 30191 85242 95927 179994 58528 103242
2551 103242 70379 9350 -18819 -76560 -8766 -32890 -92273 -101118 -88627 -160119 -71622 -87340
2539 -87340 -78702 -84804 -82507 -103131 -99200 -88825 -192508 -208703 -195440 -210475 -116733 25593
2527 25593 131860 100194 86387 134890 121783 102016 82664 19104 -114921 -233026 -170424
2516 -170424 -119422 81149 244305 253260 159682 146735 60510 25953 163 -5521 -78149 -96749
2504 -96749 -77897 -64885 -90795 -170832 -206246 -229774 -81462 22605 53830 72852 47954
2493 47954 79279 114300 83594 -38839 -143952 -147023 -146836 -186751 -67578 17302 -34062 -118156
2481 -118156 -131527 -85780 -8303 18532 -27543 -39798 -126632 -166873 -154003 -151873 -179783 -47659
2469 -47659 -10931 -133771 -252777 -272429 -178623 -218784 -174701 -89677 -35824 -5126 -66033
2458 -66033 -7982 79233 177510 112867 133988 142620 77429 37222 -25751 16320 -145 -27492
2446 -27492 84439 92968 79747 51019 123618 143797 84347 20087 52078 27762 -53312 -65484
2434 -65484 -79494 -33581 -35823 -42010 35220 82730 192205 271877 221092 60063 37873 127978
2422 127978 129535 7390 -49621 -79582 -13430 44668 85189 -3178 -57978 -93041 -91051 -84167
2410 -84167 -98029 -67368 18915 29756 40029 94336 84531 56016 142225 174645 52407 -49111
2398 -49111 -124821 -95436 -34658 -15663 -77812 -71349 -46834 63544 61627 43832 42177 -9455
2386 -9455 -2642 -23007 -114879 -147950 13741 239517 190194 82219 55323 -4850 -100869 -104716
2374 -104716 -20131 -56826 -20083 -67631 -100746 -99806 -49813 38425 81511 91070 57771 -15702
2362 -15702 -23135 -14708 12167 44803 -3548 48895 -76766 -69054 815 38192 74748 105848
2350 105848 113102 91053 95018 140739 107002 8504 -16873 93661 113075 112301 70212 133742
2338 133742 17633 -60943 -16496 73079 150328 138716 125990 83753 86823 120546 201798 183100
2326 183100 141081 95644 56860 75636 44887 72603 102893 97943 148743 216279 234962 277776
2314 277776 238674 231391 100807 -17293 7888 25346 26704 101625 176013 104510 106036 52973
2302 52973 47232 69567 59229 -32383 -98392 -69439 12236 -48178 -99431 -130460 -87521 -95147
2290 -95147 2737 67265 97836 165245 209298 147544 108585 120923 75173 38227 13673 24557
2278 24557 28565 27786 -22403 -112866 -55694 -38489 129778 141934 47584 -29142 -29305 -27739 -31813
2265 -31813 63831 195959 122377 87263 110680 32561 51746 103382 21432 47404 74776 120546
2253 120546 72632 39855 -27897 -12894 -19960 17742 42093 -10704 -58041 98652 213769
2242 213769 135053 101781 -45776 -136874 -164125 -76524 -123604 -83149 -140903 -119125 1728
2231 1728 123676 219072 215054 125218 147344 178117 217423 269386 236690 219968 183841 175642
2219 175642 114509 141742 96948 81247 178961 143435 143692 126257 130185 107902 2180 -9642
2207 -9642 34992 70031 -74419 -79062 -38168 -5787 -16120 35423 39088 -42064 -149452 -186907
2195 -186907 -91889 117261 282678 245073 195661 142111 63373 -43538 -79438 6313 44857
2184 44857 -36485 -97433 -67532 -78864 -75748 -6690 -43642 -84093 -97516 -33361 41123 49196
2172 49196 -43647 -63597 -98068 -97451 -89227 -80487 -45017 -3766 18907 100264 166102 165243 115770
2159 115770 30186 -94962 -113709 -28729 -44638 -97918 -63378 -71763 -101886 -109014 -97364 -24676
2147 -24676 76344 10539 3854 -5687 -1279 64246 92186 139773 136624 -20490 -35667 89360
2135 89360 154241 118998 112959 89474 -25138 -134210 -118820 -140436 -104244 -117174 -180182 -83410
2123 -83410 101137 39863 -134940 -213638 -95633 60841 60888 36175 14634 -116981 -105015
2112 -105015 -65500 -28635 -7314 44534 62682 -880 -53760 -52340 47313 92026 50631 -24295
2100 -24295 -48642 -59064 -35955 85417 209119 172923 28971 1714 124320 133149 154427
2089 154427 125449 59376 676 -25478 -2697 -103929 -89808 31385 -50311 -105075 -91925
2078 -91925 42544 -21838 -56550 -86042 -42880 -59513 -21441 106954 205285 188905 241124
2067 241124 176563 114078 52613 79631 164103 174283 78537 -16616 -30508 -39687 -3192 -75080
2055 -75080 -97109 -113031 -69102 22980 120410 153303 64371 3365 -24091 -125777 -123122 -10218
2043 -10218 53228 12725 43165 163724 187969 163429 147007 163622 113892 143204 72844 55091
2031 55091 17460 52072 18267 29895 -5458 -26325 44894 68615 8596 -80432 -151831 -72654
2019 -72654 -89314 -46776 41497 78880 -66471 -48094 6123 152818 102209 74993 11734
2008 11734 -92571 -90362 -23224 -16966 -48134 -95414 -114314 -90395 -2637 112851 48275 -4412
1996 -4412 -4550 77412 42215 -28669 -32400 7133 -68299 -175633 -70451 -51998 -52966 -33971 -109972
1983 -109972 -47258 -25912 16629 -18138 -118754 -202319 -178338 -140953 -56162 111835 154447
1972 154447 89604 122945 50148 38194 66410 111066 73097 161150 162598 133450 107967 26246
1960 26246 -102404 -250344 -171086 -91054 -52615 -71561 -15310 114416 -3511 -146236 -109844
1949 -109844 -56816 28694 119396 116614 95554 146423 64890 -12911 -83200 -135225 -64066 30229
1937 30229 100707 216238 219764 143787 567 2076 53654 82951 12639 23195 93573 27250
1925 27250 -33667 23886 43785 22593 71182 -23517 -38711 8887 -11588 -10130 -23275 32152
1913 32152 40906 7230 11274 56754 49939 -7317 -131270 -154352 -16987 77016 263248 334543
1901 334543 236859 144224 109594 10769 -61843 -39104 -24185 68450 41536 40786 32510 116948
1889 116948 168430 215034 237213 226863 94868 -55505 1456 -82568 -130211 -66009 50623
1878 50623 94393 119262 222340 152124 139368 122884 102978 144510 224656 116528 65619
1867 65619 64132 47572 -20098 -167877 -146844 -64923 -7254 4610 10229 22808 3663 -83486
1855 -83486 -110533 -115563 -21067 -16211 44617 164878 89141 5234 21114 111916 115282 140229
1843 140229 142155 112319 49010 69647 88987 205569 136211 113547 59518 78949 54772 -57566
1831 -57566 -58011 -60337 -155303 -185629 -50448 54593 117447 60318 -66054 -130878 -34458 -28665
1819 -28665 23076 72488 44155 9248 -53989 -126796 -184279 -215239 -95114 -45270 51200 107486
1807 107486 66374 -46063 -110415 28862 53227 31132 11778 -21919 -49754 -21572 97577
1796 97577 225414 203604 127498 150638 188391 78551 61228 68979 -100517 -149550 -54989
1785 -54989 -56992 -91745 -50637 -30465 -12742 25117 76324 96076 61348 -29424 -13495 21095
1773 21095 -64497 -98941 -74105 -115200 -56201 92009 95825 15930 24830 -63682 -73164 -68467
1761 -68467 3612 22174 69983 46196 72799 152323 124440 24246 39498 98363 56397 -22773
1749 -22773 40669 190954 161914 10352 -201406 -231040 -208701 -45878 101082 51319 19396
1738 19396 76565 38356 30912 27362 49222 52758 -47754 -123642 -212200 -178217 -97626 -47787
1726 -47787 -114220 -84177 14684 -79018 -132128 -38252 70857 76160 -41101 -91535 48207
1715 48207 49751 61657 72084 127206 219558 217988 137715 76186 54656 1705 32059 59119
1703 59119 13112 7486 126020 135562 69189 93543 117249 30504 -4958 -4694 -2767 27924 58261
1690 58261 89567 110527 42746 -129603 -183017 -97060 -7770 59903 10306 -15399 167494
1679 167494 304924 228363 70483 -36060 -23509 37242 1552 -31039 250 14387 -7026
1668 -7026 -115828 -199643 -180274 -246579 -208491 -30073 117395 102546 -2754 -32408 -40108
1657 -40108 30342 150837 -6378 -141523 -164933 -56051 -100993 -203042 -132114 -83078 -163746
1646 -163746 -122536 -114873 19351 84402 19170 -52670 -99687 -11706 4326 -124012 -121609 -24541
1634 -24541 135025 135161 68351 42621 125268 201073 129628 82158 56443 52762 53544 25022 -41517
1621 -41517 -86371 -126932 -50101 43426 118377 28955 29864 56372 1467 9907 9117 39460 107578
1608 107578 133743 177422 101443 100338 56177 8677 -35103 -74944 -30338 13328 168037 217465
1596 217465 237896 197921 138173 201233 91919 30226 26347 57479 195221 118528 19380
1585 19380 -32384 75891 203912 131176 -21832 -79553 31755 50441 11560 -19347 -10760
$$ [...]
##END NTUPLES=NMR SPECTRUM
##END=
