##TITLE=Analysis number 307347
Compound Code mo 01300
Book Reference 408/152/1
Project Code qc-cat
Chemist Name laurenf
##JCAMPDX= 6.0         $$ Bruker NMR JCAMP-DX V2.0
##DATA TYPE= NMR SPECTRUM
##DATA CLASS= NTUPLES
##ORIGIN= Bruker BioSpin GmbH
##OWNER= NMR
$$ XWIN-NMR		Version 3.5
$$ Thu Apr 28 11:25:43 2005 GMT Daylight Time (UT+1h)  MAYBRIDGE\NMR@NMR_250MHZ
##.OBSERVE FREQUENCY= 250.131544655141
##.OBSERVE NUCLEUS= ^1H
##.ACQUISITION MODE= SIMULTANEOUS (DQD)
##.ACQUISITION SCHEME= undefined
##.AVERAGES= 16
##.DIGITISER RES= 18
##SPECTROMETER/DATA SYSTEM= dpx250
##.PULSE SEQUENCE= zg30
##.SOLVENT NAME= DMSO
##.SHIFT REFERENCE= (INTERNAL, DMSO, 0, 16.522)
##AUDIT TRAIL= $$ (NUMBER, WHEN, WHO, WHERE, WHAT)
$$ ##TITLE= Audit trail, XWIN-NMR		Version 3.5
$$ ##JCAMPDX= 5.01
$$ ##ORIGIN= Bruker BioSpin GmbH
$$ ##OWNER= NMR
$$ C:\u/data/dgb/nmr/ADRS/2470/pdata/1/auditp.txt
$$ ##AUDIT TRAIL=  $$ (NUMBER, WHEN, WHO, WHERE, WHAT)
(   1,<2005-04-28 11:25:25.32 +100>,<MAYBRIDGE\NMR>,<NMR_250MHZ>,
      <created by zg, POWCHK disabled, PULCHK disabled
       configuration hash MD5:
       62 19 C7 07 E1 42 D1 B7 37 6C 3D D0 77 39 F9 E6
       data hash MD5: 64K
       D0 86 D2 77 17 78 30 F7 7E 44 C0 20 C0 38 3F 31>)
(   2,<2005-04-28 11:25:36.20 +100>,<MAYBRIDGE\NMR>,<NMR_250MHZ>,
      <Start of raw data processing
       ef LB = 0.3 FT_mod = 6 PKNL = 1 SI = 32K 
       data hash MD5: 32K
       78 5A 54 5D 64 60 BF 23 D0 D0 9D 0F D5 DC 97 E8>)
(   3,<2005-04-28 11:25:37.87 +100>,<MAYBRIDGE\NMR>,<NMR_250MHZ>,
      <apk 
       data hash MD5: 32K
       CB B7 DF 87 D9 2A 5E 75 FE 59 81 53 39 F3 49 28>)
(   4,<2005-04-28 11:25:38.60 +100>,<MAYBRIDGE\NMR>,<NMR_250MHZ>,
      <abs ABSG = 5 
       data hash MD5: 32K
       3E BD 69 57 38 C2 D8 9D 3F C6 E2 42 3C 0E 5E 70>)
$$ ##END=
$$ 
$$ hash MD5
$$ D1 25 CB 89 3F B3 07 83 A2 7D 2F 30 0E 7C 30 A1
##$RELAX= 
##$RELAX= 
##$RELAX= 
##$RELAX= 
##$RELAX= 
##$RELAX= 
##$RELAX= 
$$ Bruker specific parameters
$$ --------------------------
##$DU= <C:\u>
##$EXPNO= 2470
##$NAME= <ADRS>
##$PROCNO= 1
##$TYPE= <nmr>
##$USER= <dgb>
##$AMP= (0..31)
100 100 100 100 100 100 100 100 100 100 100 100 100 100 100 100 100 100 
100 100 100 100 100 100 100 100 100 100 100 100 100 100 
##$AQSEQ= 0
##$AQ_mod= 3
##$AUNM= <au_zg>
##$AUTOPOS= <16 >
##$BF1= 250.13
##$BF2= 250.13
##$BF3= 250.13
##$BF4= 250.13
##$BF5= 500.13
##$BF6= 500.13
##$BF7= 500.13
##$BF8= 500.13
##$BYTORDA= 1
##$CFDGTYP= 0
##$CFRGTYP= 5
##$CHEMSTR= <none>
##$CNST= (0..31)
1 1 145 1 1 1 1 1 1 1 1 1 1 1 1 1 1 1 1 1 1 1 1 1 1 1 1 1 1 1 1 1 
##$CPDPRG= <>
##$CPDPRG1= <>
##$CPDPRG2= <>
##$CPDPRG3= <>
##$CPDPRG4= <mlev>
##$CPDPRG5= <mlev>
##$CPDPRG6= <mlev>
##$CPDPRG7= <mlev>
##$CPDPRG8= <mlev>
##$CPDPRGB= <>
##$CPDPRGT= <>
##$D= (0..31)
0 1 0 0 0 0 0 0 0 0.06 0 0 0 0 0 0 0.0002 0 0 0 0 0 0 0 0 0 0 0 0 0 0 
0 
##$DATE= 1114683924
##$DBL= (0..7)
120 120 120 120 120 120 120 120 
##$DBP= (0..7)
150 150 150 150 150 150 150 150 
##$DBP07= 0
##$DBPNAM0= <>
##$DBPNAM1= <>
$$ [...]
##$SUBNAM7= <"">
##$SUBNAM8= <"">
##$SUBNAM9= <"">
##$SW= 20.6930455092707
##$SWIBOX= (0..15)
0 0 3 0 0 0 0 0 0 0 0 0 0 0 0 0 
##$SW_h= 5175.983436853
##$TD= 65536
##$TD0= 1
##$TE= 295.16
##$TE2= 300
##$TE3= 300
##$TEG= 300
##$TL= (0..7)
0 120 120 120 120 120 120 120 
##$TP= (0..7)
150 150 150 150 150 150 150 150 
##$TP07= 0
##$TPNAME0= <>
##$TPNAME1= <>
##$TPNAME2= <>
##$TPNAME3= <>
##$TPNAME4= <>
##$TPNAME5= <>
##$TPNAME6= <>
##$TPNAME7= <>
##$TPOAL= (0..7)
0.5 0.5 0.5 0.5 0.5 0.5 0.5 0.5 
##$TPOFFS= (0..7)
0 0 0 0 0 0 0 0 
##$TUNHIN= 0
##$TUNHOUT= 0
##$TUNXOUT= 0
##$USERA1= <user>
##$USERA2= <user>
##$USERA3= <user>
##$USERA4= <user>
##$USERA5= <user>
##$V9= 5
##$VALIST= <valist>
##$VCLIST= <CCCCCCCCCCCCCCC>
##$VD= 0
##$VDLIST= <DDDDDDDDDDDDDDD>
##$VPLIST= <PPPPPPPPPPPPPPP>
##$VTLIST= <TTTTTTTTTTTTTTT>
##$WBST= 1024
##$WBSW= 4
##$XGAIN= (0..3)
0 0 0 0 
##$XL= 0
##$YL= 0
##$YMAX_a= 271900
##$YMIN_a= -344268
##$ZGOPTNS= <>
##$ZL1= 120
##$ZL2= 120
##$ZL3= 120
##$ZL4= 120
##$ABSF1= 16.522
##$ABSF2= -4.171173
##$ABSG= 5
##$ABSL= 3
##$ALPHA= 0
##$AQORDER= 0
##$ASSFAC= 0
##$ASSFACI= 0
##$ASSFACX= 0
##$ASSWID= 0
##$AUNMP= <proc_1d>
##$AZFE= 0.1
##$AZFW= 0.1
##$BCFW= 0
##$BC_mod= 0
##$BYTORDP= 0
##$COROFFS= 0
##$CY= 12.5
##$DATMOD= 1
##$DC= 0
##$DFILT= <>
##$DTYPP= 0
##$F1P= 14.0000005364418
##$F2P= -0.99999901652339
##$FCOR= 0.5
##$FTSIZE= 32768
##$FT_mod= 6
##$GAMMA= 0
##$GB= 0
##$INTBC= 1
##$INTSCL= 1
##$ISEN= 128
##$LB= 0.3
##$LEV0= 0
##$LPBIN= 0
##$MAXI= 10000
##$MC2= 0
##$MEAN= 0
##$ME_mod= 0
##$MI= 0
##$NCOEF= 0
##$NC_proc= -5
##$NLEV= 6
##$NOISF1= 0
##$NOISF2= 0
##$NSP= 0
##$NTH_PI= 0
##$NZP= 0
##$OFFSET= 16.522
##$PC= 1
##$PHC0= -82.36242
##$PHC1= 8.850805
##$PH_mod= 1
##$PKNL= yes
##$PPARMOD= 0
##$PSCAL= 4
##$PSIGN= 0
##$REVERSE= no
##$SF= 250.13
##$SI= 32768
##$SIGF1= 0
##$SIGF2= 0
##$SINO= 400
##$SIOLD= 32768
##$SREGLST= <1H.DMSO>
##$SSB= 0
##$STSI= 32768
##$STSR= 0
##$SW_p= 5175.98343685301
##$SYMM= 0
##$S_DEV= 0
##$TDeff= 65536
##$TDoff= 0
##$TI= <Analysis number 999999
Compound Code 99
Book Reference 9
Project Code 9>
##$TILT= no
##$TM1= 0
##$TM2= 0
##$TOPLEV= 0
##$USERP1= <user>
##$USERP2= <user>
##$USERP3= <user>
##$USERP4= <user>
##$USERP5= <user>
##$WDW= 1
##$XDIM= 32768
##$YMAX_p= 301040401
##$YMIN_p= -577523
$$ End of Bruker specific parameters
$$ ---------------------------------
##NTUPLES= NMR SPECTRUM
##VAR_NAME=  FREQUENCY,     SPECTRUM/REAL,   SPECTRUM/IMAG
##SYMBOL=    X,             R,               I
##VAR_TYPE=  INDEPENDENT,   DEPENDENT,       DEPENDENT
##VAR_FORM=  AFFN,          ASDF,            ASDF
##VAR_DIM=   32768,         32768,           32768
##UNITS=     HZ,            ARBITRARY UNITS, ARBITRARY UNITS
##FACTOR=    0.157963299565203, 1,           1
##FIRST=     4132.6476996994, 0,             0
##LAST=      -1043.33573715361, 0,           0
##MIN=       -1043.33573715361, -577523,     0
##MAX=       4132.6476996994, 301040401,     0
$$ Real data points
##PAGE= N=1
##DATA TABLE= (X++(R..R)), XYDATA
$$ [...]
17135G4577525J469674o051962j1140988j2732962j0768188p588856m863323l009345
17127A9891575k193446j906431j674834j459201j373478r13041p95007p20259
17119H855878l14206j78231J6418L61833N56675J004221J878187K943713M304629
17110A9429117O941018J0432890J3810424J3786095P674814p83951p848204j2116578
17102E1325625j2519479r854677o437434l883237k595964j883246j751004j557136
17094A0843448j314343j172349j053944q95856q56375p21641o40326n45070l86798
17085C256746j98906n03893l45952j43376j84788p6230j03277j10625k35505j15697
17075A238497j64640l34226j23713N5329j1498J5288q3275j7019k50014n0025
$$ y = [74577525, 76047199, 69995237, 58854249, 46121287, 35353099, 27764243, 22900920, 19891575, 17698129, 15791698, 14116864, 12657663, 11284185, 10371144, 9576137, 8855878, 8541672, 8363441, 8379859, 8741692, 9298367, 10302588, 12180775, 15124488, 19429117, 26370135, 36803025, 50613449, 64399544, 72074358, 71290407, 63442203, 51325625, 38806146, 28951469, 22514035, 18630798, 16034834, 14151588, 12400584, 10843448, 9529105, 8356756, 7302812, 6406956, 5550581, 4828940, 4188614, 3643544, 3256746, 3057840, 2553947, 2207995, 2064619, 1879831, 1803601, 1700324, 1589699, 1354194, 1238497, 1073857, 739631, 615918, 671247, 659749, 675037, 591762, 574743, 324729, 274704]
17065B74704O5432r9475J24684J75437K6400L5114l1914P184J0261j15231k38200
17054B34396Q327q1779M5476Q1280j22038j10710p6863q9472P5092K55250N7373
17043B76332k48031m2571J19356o3081l0006J4291k8200r7155K7484K00496P2420
17032B01335q8916O5970o0489R2205P8467p533j96604p8988J62809R4568j91602
17021G1222m8341j115p961M3589O7373P6227J17881k19405n4914J05063Q5428
17010B35047P1161O1049n9088r0687L6928J22771m8852j30347j50839o5574J10332
16999I1901J48683j8371q0070p7667j1595n7577J3748K3914L6247n2899L2574
16988D8888O7344j25812K634k7189n0343n668J1590J54547j0976K6333m2398Q9701
$$ y = [274704, 340136, 240661, 365345, 540782, 567182, 602296, 570382, 577566, 587827, 472596, 234396, 242723, 160944, 206420, 287700, 165662, 54952, -21911, -111383, -36291, 218959, 276332, 28301, -14270, 105086, 42005, 11999, 26290, -1910, -99065, -71581, 128915, 201335, 112419, 178389, 117900, 210105, 288572, 281039, 84435, 5447, 168256, 262824, 71222, 22881, 21766, 13805, 57394, 124767, 200994, 318875, 99470, 44556, 149619, 235047, 306208, 367257, 308169, 217482, 254410, 377181, 328329, 197982, 47143, -18431, 91901, 240584, 222213, 142143, 64476, 52881, -4696, 9052, 32966, 69213, 16314, 48888, 116232, -9580, -6946, -34135, -84478, -90146, -78556, 75991, 65015, 91348, 48950, 138651]
16976A38651j62876l2166J09966j09650j54739M5269M7925K1738j05975L6515
16966a65342O0256O0192M3039J17423R3964r3350J094n3903j73315R1311R1983
16955G3352j44368j75291j12403Q7479J154j9882J8863P7517o0249L8190j21948
16944c37586M5650K08263N5799k5531l0376J6191p5532k03187r3259L498Q3889
16933c52181Q8749K26689j27249j86580p289N6923M3028J33818O9320j12144K9003
16922a37913J91031k5415n673N8059j33007N5424N6856p7894L5495p351J96L2459
16910D2267O0446O7795j14204j63864m6212l5376k0180k8982P6409K2715l8864
16899a78050j43946O6024J27762l3728M2047M0101M3888p9573l3542O8117m0759
$$ y = [138651, -24225, -56391, 53575, -56075, -210814, -165545, -117620, -95882, -201857, -165342, -105086, -44894, -1855, 115568, 209532, 116182, 117276, 63373, -109942, -18631, 73352, -71016, -246307, -358710, -271231, -270077, -289959, -271096, -193579, -253828, -215638, -337586, -291936, -83673, -27874, -53405, -83781, -67590, -143122, -346309, -439568, -436070, -352181, -263432, -36743, -163992, -350572, -357861, -300938, -257910, -124092, -54772, -166916, -137913, 53118, 27703, 22030, 80089, -52918, 2506, 59362, -18532, 16963, 9612, 9808, 42267, 102713, 170508, 56304, -107560, -153772, -189148, -209328, -238310, -161901, -139186, -178050, -321996, -255972, -128210, -161938, -119891, -79790, -35902, -115475, -149017, -80900, -121659]
16888a21659p7719M4192K36805l922j26228M0394Q693J5105N5136M7335n9029
16877E9103O2249J01389M7973l0863k0149j88838j62773j00142K852J23199j09377
16866b15377L8923J23948J38035m8994k9604Q3273j6832k4346m1513k2089K1944
16855G368r114J14445P0853n0766L7647j2293j89069M3826j0278N7481j0590m5603
16843C907l6019L9809J2479j67936o9872j4192K1021N8417M073R3488m2902M0406
16831e7321J39357q8216q656J03799p2946q0437N85p0272N3400O0431j33540j90180
16819c43996q0141J93683J42193j4665P1020J0852j03303o9729K6038J38216R6877
16808F7045L6243o2400p3182p2100k5564p0480j02281L1467K08730L3723M9466
$$ y = [-121659, -199378, -155186, 81619, 77697, -48531, -8137, 556, 15661, 70797, 118132, 59103, 121352, 222741, 270714, 239851, 219702, 30864, -131909, -232051, -229199, -106000, -215377, -176454, -52506, 85529, 36535, 6931, 90204, 73372, 49026, 7513, -14576, 7368, -1746, 112699, 183552, 132786, 170433, 158140, -30929, 12897, 2619, 60100, 49510, 3907, -32112, 7697, 20176, -147760, -217632, -231824, -210803, -152386, -148313, -54825, -97727, -57321, 82036, -6180, -14836, 88963, 16017, -64420, -63835, -134107, -80707, -20276, -153816, -343996, -424137, -230454, -88261, -102926, -31906, -21054, -124357, -194086, -168048, -29832, 67045, 103288, 40888, -32294, -104394, -129958, -200438, -302719, -271252, -62522, -28799, 20667]
16797B0667K09785Q7644o8898m5743M8509l276k63343j61846J53003j6092n2954
16786i2544Q249J63044R2547R3299q3373n0024J00137J9809j25952l5830P70m6439
16774D3693j26022r8208O700L3419J33805J1372M9657L4042j8958K3118L5969
16763A28587j15685j34667p6534J02159p868m9964m1294L57524J58623j58805
16753A62076j00674k8303j41054n5287J39837Q4739R8746m6451j06213Q5304l291
16742H9429K9647n5275m9761J467K26494j18031r3605n0470M1269r9218p8012
16731a56066J6804k6873q27J36667R3562j73918j56348M5972R5675J23101m3603
16720d5854n2225J03572K55964J03189o1424p6788k6530j6888k11126p636K3235
$$ y = [20667, 230452, 318096, 249198, 203455, 251964, 248688, -14655, -176501, -23498, -39590, -92544, -84295, 78749, 171296, 264595, 181222, 131198, 231335, 251144, 125192, 89362, 90132, 43693, -82329, -180537, -173837, -140418, -6613, 4759, 54416, 88458, 69500, 92618, 128587, 12902, -121765, -198299, -96140, -104008, -153972, -195266, 162258, 320881, 162076, 61402, 33099, -107955, -163242, -23405, 61334, 160080, 113629, 7416, 92720, 89429, 119076, 63801, 14040, 15507, 242001, 123970, 30365, -20105, 21164, -78054, -156066, -139262, -166135, -166962, -30295, 63267, -110651, -266999, -221027, -125352, -2251, -45854, -98079, 5493, 261457, 364646, 303222, 226434, 199904, 183016, -28110, -35746, -12511]
16709a2511J04417o8751l9768J6924P4311K8791J35873K4493N2506N1474j54763
16698B12996m8199k1784r4225J7020k7275l9271o1207J2492N001j16051k05969
16687c66472p5671J76840J89165j0413P2822N6693k3039j22424j3569m9582j0086
16676a75736L2401n8716k0404j1363l6795O360j29504j5474J15880J68199K06671
16665H1519P8506o1485n4123o3635m4100n472k074n6905N3993J05501N4351k7724
16653E8352l3769J09186L1192N7787P5506Q7037p6703m9619j68025k51655j53329
16642c14040J08753M6346R5945J35281K7583j15327J45177K3252m9273j10969
16632g272r126j38699n8569J700o81j00957o5131J92659J83447K9833J61215k9354
$$ y = [-12511, 91906, 23155, -16613, 311, 74622, 103413, 239286, 263779, 316285, 367759, 212996, 164797, 143013, 48788, 65808, 38533, -738, -61945, -49453, -44452, -160503, -366472, -442143, -265303, -76138, -86551, -13729, 42964, 19925, -102499, -116068, -165650, -175736, -143335, -202051, -222455, -233818, -270613, -264253, -393757, -409231, -293351, -125152, 81519, 160025, 98540, 44417, -19218, -63318, -68790, -70864, -127769, -73776, 31725, 86076, 58352, 24583, 133769, 164961, 222748, 298254, 385291, 308588, 258969, 90944, -160711, -314040, -205287, -158941, -62996, 72285, 99868, -15459, 129718, 152970, 103697, -7272, -16398, -155097, -213666, -211966, -212647, -313604, -378735, -186076, -2629, 27204, 188419, 159065]
16620A59065o7674R9872J892j29697j07233Q9368Q0989p3356N3610O0488r8289
16609F9035j07016J07447O3017J7699j02560Q7592p675m5642l5855k8952n4820
16598c7730J53197O0125J60447R5401j83636j60331n5570J02903J3137L255R4666
16587B45864r7557K8833L1321J1320p8489j2848L4744l9586j19367j16884r309
16576a21958K4805K503K04940J27882j4602j73969j11888j32984N6659O454K7140
16565a05018J35097J10576p2856q4391J6384Q0756J32745r4288j78154R577J27625
16554G8053p0171L965n5598M9866k6894k157J4675k3801r1530j55661J9895N5371
16542b03987J32392J37600o8909l3705J05031J24684m4515j9800j24751j15543
$$ y = [159065, 91391, 191263, 193155, 63458, -43775, 45593, 126582, 53226, 106836, 167324, 69035, -37981, 69466, 132483, 150182, 47622, 135214, 127539, 81897, 46042, 17090, -37730, 115467, 175592, 336039, 431440, 247804, 87473, 31903, 134806, 147943, 151198, 245864, 148307, 177140, 208461, 219781, 141292, 128444, 163188, 123602, 4235, -112649, -121958, -97153, -94650, 110290, 238172, 223570, 49601, -62287, -195271, -138612, -132158, -105018, 30079, 140655, 67799, -16592, -208, 80548, 213293, 119005, -59149, -49572, 78053, 7882, 11847, -43751, 6115, -20779, -22936, -8261, -32062, -123592, -279253, -259358, -203987, -71595, 66005, -2904, -36609, 68422, 193106, 148591, 128791, 4040, -111503]
16532a11503K5268o0827l8163j23927l0286l3939J12383P2261O2426J49741m122
16521A9312j54718j38468k238L7325J7707n6409j31016m3157J97184J49553o1436
16510a66361k0117J3429J64092K30220P6627o5729K0566m8036j79917r5608J6715
16499e4119j43328N4683L4176J3525n30R419k9517j3599J5603Q7544N2375Q0824
16487A07056j2132o7141l995J00509L7360m0586k8988j80890j16250O0790P6581
16476f7686o5866K0517L5219M880K8500o2128j16572o2841P0190k28579j5505
16465d59871K40947O8301N6826J60425n9121j24061M1297J70196L9763j47966
16455a3264M691m8134j36036j0469k9733r1906m0320R7104R6501Q835n2358l9444
$$ y = [-111503, -86235, -147062, -185225, -309152, -339438, -373377, -260994, -188733, -126307, 23434, 19312, -135406, -273874, -276112, -238787, -221080, -277489, -408505, -451662, -254478, -104925, -166361, -186478, -173049, -8957, 221263, 297890, 232161, 252727, 204691, 24774, -70834, -54119, -197447, -142764, -108588, -95063, -95593, -86174, -115691, -129290, -113687, -26143, 26232, 107056, 94924, 27783, 23788, 124297, 161657, 121071, 92083, -88807, -205057, -144267, -67686, -133552, -113035, -77816, -72936, -44436, -106564, -223136, -285977, -215787, -444366, -459871, -218924, -150623, -93797, 66628, 7507, -116554, -75257, 94939, 134702, -13264, -8573, -56707, -192743, -203212, -232945, -324851, -365171, -268067, -171566, -162731, -215089, -254533]
16443b54533k7303k5591M5816J50609k5744p0973J17123J24912J23665P7954j90307
16432D5628j67715l1106R263k8335K7452n2929K190M2406K09774Q1144M1359j40506
16420C8625n4292K890K06220k5370L3131O4516n4265K8558j2662j84141k0022
16409B3188N2018r4730j39482m022R1539R5729Q8341k0649R7103o4880L5706q4214
16397G5647j19064M8364j35695n2706l3937j13523q9111M7653J45864k2706o6878
16386c16092J64738Q9715q0520O9208o9527J54825Q8161k32078r0732J41250r80
16375h2032p0578R1806N6963J26069r377n9337n4227j53309k8052J65181J48240
16364A31347j55020r4781L9621o3621J0216M8836N8546J91060J71093j34374r6137
$$ y = [-254533, -281836, -307427, -261611, -111002, -136746, -207719, -90596, 34316, 157981, 235935, 45628, -122087, -153193, -143930, -172265, -144813, -197742, -195552, -153146, 56628, 137772, 179131, 38625, -15667, -12777, 193443, 168073, 201204, 265720, 211455, 240013, 227351, 43210, 23188, 75206, -19524, -159006, -163028, -71489, 24240, 112581, 91932, 189035, 124155, 159861, 75647, -43417, 4947, -130748, -183454, -217391, -330914, -420025, -372372, -226508, -249214, -316092, -151354, -61639, -142159, -72951, -142478, 12347, 100508, -131570, -222302, -81052, -82032, -152610, -60804, -3841, 122228, 112851, 53514, -713, -154022, -182074, -16893, 131347, -23673, -118454, -78833, -142454, -132238, -83402, -24856, 166204, 337297, 202923, 106786]
16353A06786N3156J9461J5994l9105j08886J6260K1769M383k4286l5503k9572
16342D57P0629K5198j0715q7207J0551M6179J09324j005k5260j36948j73107K9838
16330a42066L300q958p0913L8006J43507J54548J18097j22254j9319j8718j33142
16319e7912k26750n364J28684K20181M4904R6938K5587j35044m8487J42314N5099
16308B40150k15227n5523m5905P8460q2044j35099J23021N7204j0967n0002r2739
16297a88671N634M863J25298J49873j14650R8683j41968k9054J39877j48839j20150
16286b19104Q6465J14874J10139O0439l2640j79983j82472o524R4176J22741l3815
16275f5704J02865j05259k0654N1285k9068j04510p9764O6754R2802Q2519j0696
$$ y = [106786, 159942, 179403, 195397, 156292, 47406, 63666, 85435, 89818, 65532, 30029, 457, 71086, 96284, 85569, -1638, 8913, 55092, 164416, 163411, 138151, 1203, -171904, -142066, -138766, -147724, -218637, -180631, -37124, 117424, 235521, 113267, 93948, 75230, -57912, -284662, -290026, -161342, 58839, 103743, 200681, 226268, 91224, 42737, 185051, 240150, 24923, -30600, -76505, 1955, -80089, -215188, -92167, -34963, -45930, -95932, -188671, -183037, -178174, -52876, 96997, -17653, 81030, -60938, -89992, 49885, -98954, -219104, -132639, -17765, 92374, 152813, 120173, -59810, -242282, -248806, -154630, -31889, -65704, 37161, -68098, -88752, -37467, -66535, -171045, -250809, -184055, -91253, -8734, -19430]
16264a9430j81336p1997O4106J53684N801n5138k8755P170J20211r7503p8064
16253a81251L3019o2410J18087J03848M7046p1830K4730K9866j65749P945J82455
16242F5756R118k3484l1799j06485j17569r564N9922J07796O5474q811L2699P8987
16230A22040M7642J160K0877n8021j89767o8899L7616P8573n9751R2269n3j8740
16218D946n0177j55313J21650n0204j73961o1617J13561j8250K2216K18530K51580
16207B22961K8530k60254o8506l4788J01911K566j61960L1126j8454L1888O3182
16196f1798J81131J1374r1082m1910O5040L617j7378q0369j0292m4007J48373
16185F2699J15167J30553j41110j58028m0058j13337o5208k738M3221l0731m0328
$$ y = [-19430, -200766, -272763, -208657, -54973, -49172, -104310, -133065, -125895, -5684, -103187, -181251, -148232, -210642, -92555, 11293, 58339, -13491, 11239, 41105, -124644, -116699, 65756, 74874, 51390, 19591, -86894, -204463, -214027, -154105, -46309, 19165, 10354, 43053, 122040, 169682, 170842, 191719, 133698, -56069, -124968, -87352, -8779, -68530, 23739, 23686, 4946, -45231, -200544, -78894, -129098, -303059, -364676, -251115, -269365, -247149, -28619, 222961, 251491, -8763, -77269, -112057, -10146, -7580, -169540, -138414, -156868, -124980, -61798, 119333, 130707, 39625, -2285, 62755, 66372, 48994, -31375, -41667, -85674, 62699, 177866, 308419, 167309, 9281, -30777, -144114, -209322, -212060, -168839, -199570, -239898]
16174b39898j6328K142P9793M3965r7215N1202m2373j74378K6681J27200K26310
16163a2899N7206n4851P7104K5405J8116J7537R893K2220p630r2686k15611r697
16151a65893R8353N4782k1049O4713J33502N3622r0388N2435q5601k66549j02715
16140b74788O7997M8273n1349K7119K4710o3486N1575J58050N7460K8828q3091
16129h702l1426q8436o4941N92J30964K29133m4337k25061j8007P6644P9347M7818
16117H3588j50765j907P2127J11108o262m7942p728q3804K37931R927k53470k41883
16105b79080l1593J283j75139M5857P9413J15031j29636J644J62499K53691J72808
16094B16778o2594m7045o4116j43138k0309L3580J13288n4818o6443K2460O5508
$$ y = [-239898, -256226, -254084, -174291, -130326, -227541, -176339, -218712, -393090, -366409, -239209, -12899, 44307, -10544, 66560, 91965, 110081, 127618, 137511, 159731, 152101, 59415, -156196, -165893, -67540, -12758, -33807, 30906, 164408, 218030, 127642, 180077, 94476, -172073, -274788, -206791, -158518, -209867, -182748, -158038, -221524, -169949, -11899, 45561, 74389, -8702, -40128, -128564, -193505, -192913, -61949, 167184, 122847, -102214, -120221, -43577, 35770, 83588, -67177, -69084, 3043, 114151, 107889, 59947, 52219, -31585, 206346, 216273, -37197, -279080, -310673, -309390, -484529, -438672, -359259, -244228, -373864, -372220, -209721, 43970, 216778, 154184, 107139, 43023, -100115, -120424, -86844, 26444, -28374, -94817, -72357, -6849]
16083f849J16856n3259k104L9626j4150J66999n0491k9275J9616Q5012O5608n8568
16071B79021j10822p2938J11245m5324J9234n9764j05140j01554K3594R2203q7391
16060e7636J3760L5232N5057K1134J22309Q850o4812k84822p0903J57789K3372
16049d0670j55059l4652O2495j9391O0980N4726m9125j08273p2071l1585K2891
16038c09734K3843J77337O5397O000o9009q1086j06880P1019K18321k5086j01936
16027a31814j0512o9946R2668P5497k7804q3098J32804M0912K1608q5551l9075
16016h4311k22501J9841J5700O5826J9465j6292J28806O5901j32093J8358k7233
16005a48533O4065p9194J53067K93887n5863j09295q5003J1074N7157M3262q9766
$$ y = [-6849, 110007, 56748, 54644, 94270, 80120, 247119, 196628, 167353, 186969, 271981, 337589, 279021, 168199, 95261, 206506, 161182, 180416, 120652, 15512, -86042, -62448, 29755, -57636, -43876, -8644, 46413, 67547, 189856, 198706, 133894, -150928, -221831, -64042, -40670, -195729, -230381, -167886, -187277, -126297, -71571, -120696, -228969, -301040, -332625, -309734, -285891, -108554, -43157, -37157, -106166, -187252, -294132, -223113, -4792, -29878, -131814, -142326, -212272, -119604, -44107, -71911, -155009, -22205, 18707, 40315, -45236, -84311, -306812, -286971, -271271, -205445, -185980, -202272, -73466, -7565, -139658, -121300, -148533, -84468, -163662, -10595, 283292, 227429, 118134, 33131, 44205, 101362, 144624, 54858]
15994E4858j40004n7883l9254J3978J7940P7866J69335J0508J42517P5389n2329
15983B72921k34206j44133l0456J7255j16404j9362m1807j4037L3467J34882l3598
15972a75478k2J07243j49315L7215P4472m3436j02329l2595M6373J43567J07278
15961A2973M774r7077k02475J53316K35235O5581j2186N0861R7306j23532j26804
15950E7972m4163q8261M0723j9864J788r9480J37068M8341n8749j50605L3741
15939a41489K3988k43514m0823L5633R8531J77704k5715l7626R6046L7938k62467
15928b81794N7357J20682K57892K02925J36845o9592L3817j21730l62776n3943
15918h0317P9611M7525P2948p8872j2880o3596R03M7213J852j19506m2815L1539
$$ y = [54858, -85146, -143029, -182283, -168305, -150365, -72499, 96836, 107344, 249861, 325250, 272921, 38715, -105418, -135874, -118619, -235023, -254385, -296192, -310229, -276762, -141880, -175478, -175500, -68257, -217572, -180357, -105885, -149321, -251650, -284245, -237872, -94305, 12973, 17747, -79330, -281805, -128489, 106746, 172327, 160141, 211002, 308308, 184776, 57972, 13809, -74452, -33729, -53593, -51805, -151285, -14217, 34124, -24625, -175230, -141489, -117501, -361015, -401838, -366205, -267674, -89970, -115685, -153311, -57265, -19327, -281794, -224437, -103755, 154137, 357062, 493907, 424315, 458132, 336402, -26374, -80317, -706, 46819, 119767, 40895, 28015, -35581, -34678, 12535, 14387, -105119, -147934, -116395]
15906a16395K12471K2663p0095q1972R8563L0603o9983l356n9477P9858j42415
15895i9535j47522L5486L397o8152J92987P3951L2279J02669R2535J24036j59997
15884A82134r0504J2898m6455n8075O7290O7390P0161k09776j46090n0927J2681
15873a89273R746J30834J72398r2432l7624p6928q6386P3585J05557J78060J0760
15862A98297l6220q9428j05273J40499N7448p363j73804k37822J15893K93319
15852A55546K8p3900j34963j13127q0788J85062N4028k6892m8085l8570o1218
15841a82879J08400K21819J86131K7182j37529l7110q5496M873J27738j77381
15831E5748j29889J0416N8401J1220J63203J89027q4360j88044j84808o8529n4763
$$ y = [-116395, 96076, 118739, 48644, -33328, 65235, 95838, 25855, 22499, -36978, 42880, -99535, -247057, -211571, -208174, -276326, -83339, -9388, 22891, 125560, 218095, 342131, 182134, 91630, 104528, 58073, -2, 67288, 134678, 204839, -4937, -151027, -201954, -189273, -179527, -48693, 123705, 31273, -6351, -83279, -169665, -96080, 9477, 187537, 198297, 162077, 72649, -32624, 107875, 165323, 157960, -15844, -253666, -137773, 155546, 155574, 81674, -53289, -166416, -247204, -62142, -8114, -35006, -83091, -121661, -182879, -74479, 147340, 333471, 360653, 223124, 186014, 100518, 105391, 233129, 55748, -74141, -63725, -5324, 5896, 169099, 358126, 273766, 85722, -99086, -167615, -222378]
15820b22378m169Q2191j6553R9967J55444j90980j38037R2377N1401P7370J11107
15809I7740L028j24897k9121q9047m9406O7665J79952L0555r6757l9006p838n9285
15797a16417n2150O5073K128p385J8049Q987J45660j22511n4016J08737K5737
15786B1892j31408L6803K1792k00337K8274J27507j03408m8469Q0985Q8772Q371
15775f9226J02846j8761j465K2113Q6346j26827j12687O1794J37098q645o9635
15764B951m4618L7808Q59N2620J43681N624j65320q0004j5250K7693j134m5260
15752h0350N307O8386n4325j05802n8909j32093Q1283J20527q5760M9463K8491
15741a63782m6785J60475K05977J8172m3196N495N3933M8560p6054M0559K0667
$$ y = [-222378, -226547, -144356, -160909, -60942, 94502, -96478, -234515, -142138, -90737, -13367, 97740, 100768, -24129, -53250, -142297, -191703, -124038, 55914, 86469, -10288, -49294, -57132, -116417, -168567, -103494, -101366, -108751, -90702, -81715, 63945, -58566, -112582, -3845, 21892, -109516, -72713, -50921, -251258, -222984, -95477, -198885, -247354, -166369, -77597, -69226, 33620, 14859, 13394, 35507, 121853, -4974, -117661, -55867, 81231, 72586, 2951, -41667, -3859, -3000, 49620, 193301, 198925, 33605, -46399, -61649, -33956, -35090, -80350, -75043, -6657, -60982, -166784, -225693, -357786, -276503, -155976, -241736, -192273, -163782, -210567, -50092, 155885, 174057, 130861, 136356, 190289, 238849, 162795, 203354, 224021]
15730B24021q9875j55618N9636n4426L541n8707n6572J5637P1377J51152l2532
15719G7634n6532q8062j42673j79052m8922J03298J50994J77055q6274o5410j19401
15708b77345J12610m5596L8352R1970K2357r8224j7037N2500J00820J53995p312
15697A27090L9734p1595r4419K1577j40796m3854q3204n3250r0881J24070M610
15686b60918Q8796l3677q2749J3392J61210K15416k719m6893M4677Q6505j15579
15675F7461q0117j30L5022k0359j45925J28606Q8480m2012M661P1147O456p3313
15663C9977m7465P3171J06216p505L681J0083k3974K7158m1535k06538j53178
15652b19909o1867j0544j06851p087J57511n454n4334J13827J38728J81837q9684
$$ y = [224021, 134146, -21472, 38164, -16262, -12721, -71428, -128000, -112363, -40986, 110166, 77634, 21102, -66960, -209633, -388685, -437607, -334309, -183315, -6260, -92534, -157944, -277345, -164735, -210331, -171979, -80009, -57652, -155876, -172913, -120413, -19593, 134402, 127090, 166824, 95229, 810, 22387, -118409, -162263, -245467, -298717, -389598, -265528, -260918, -172122, -205799, -288548, -275156, -113946, 101470, 98751, 51858, 96535, 183040, 67461, -12656, -12786, 22236, 1877, -144048, -15442, 73038, 31026, 35687, 106834, 113290, 39977, -7488, 65683, 171899, 164394, 168075, 178158, 154184, 181342, 139807, -66731, -219909, -281776, -292320, -399171, -406258, -248747, -254201, -308535, -194708, -55980, 125857, 36173]
15641C6173J27112n384k9165j64181p0638M8192P8641r3621n8599o7317p0941
15630b69728R0954M8070R148j7980p0852N6085K3501k0606r2873n7543O7520J67453
15618f6851K7278l1210O9855J12542M2855m2455l0376K2784j19398l1755L0335
15607a6396J7705L5920j03660n3716q456L8747N2581P7215J10769j54058k04897
15596b08246L7485K16706l867j07925J63464O9389j5264k19275j00009M2272J23113
15585b157K1737r9690m5617J5932j10655J5832J41587m763j39521o8842Q3804
15574a92353J03990M4358L7956J1428k7788j33340Q9790J60345J4750r0185n6251
15563c7300p946p8503r1256J33249J96712J2063j63004j46382O8333K9736m5165
$$ y = [36173, 163285, 157901, 128736, -35445, -106083, -57891, 20750, -72871, -131470, -198787, -269728, -178774, -130704, -121556, -139536, -210388, -154303, -130802, -151408, -244281, -301824, -234304, -66851, -39573, -70783, -928, 111614, 154469, 112014, 81638, 104422, -14976, -46731, -16396, 1309, 37229, -66431, -120147, -128603, -89856, -37275, 39940, 150709, -3349, -208246, -170761, 45945, 42078, -65847, 97617, 167006, 151742, -67533, -167542, -125270, -2157, 19580, -80110, -125727, -109795, -220450, -204618, -63031, -67794, -207315, -276157, -192353, -88363, -44005, -6049, 5379, -22409, -155749, -65959, 94386, 109136, 18951, -37300, -45246, -123749, -215005, -81756, 114956, 127019, -35985, -182367, -114034, -84298, -129463]
15552a29463l2930L5320J5694O2203p910J0561J01803K4561q6481m0847p6840
15541a24329J58518K0566L6123J73111l7593k04311J2949J38620K3141j83817
15531A2978j70237Q9177K46229K18017J6874k35229n9091O5714O0623n5542j2371
15520A77142r1980M2229K3587j28801j7909L1229J11029q5984q7150q302J42208
15509A07298q0092Q326K06427j01214n8489l4433j03595j62095q0584J49622J32424
15498a6405p8636O2532J3197O3211J06087j25813n2349r6476j61831o891K05260
15487h8114L3481R6047j20050l5327l3837o0825J1782J77646J1116O7788m0337
15476A9370j24879p3934M4970L0618J02579P2580j41993j4937n8759J10670O8974
$$ y = [-129463, -162393, -127073, -111379, -49176, -57086, -46525, 55278, 79839, -6642, -47489, -124329, 34189, 54755, 90878, 263989, 226396, 22085, 35034, 173654, 196795, 12978, -157259, -68082, 178147, 396164, 413038, 177809, 118718, 184432, 245055, 189513, 177142, 85162, 127391, 150978, 22177, 4268, 35497, 146526, 60542, -26608, -34910, 107298, 27206, 35532, 241959, 140745, 82256, 47823, -55772, -217867, -298451, -148829, -16405, -95041, -32509, -19312, 43899, 149986, 24173, -28176, -124652, -286483, -293374, -88114, -54633, 41414, -78636, -113963, -147800, -208625, -196843, -19197, -8081, 59707, 19370, -105509, -179443, -134473, -103855, -1276, 71304, -70689, -85626, -144385, -33715, 35259]
15465C5259j67733P7745J24426P3391m856j06513j40918l1014L3259o8725M1126
15454a34553J8586J6844j37679q5881J92569K68094K1703m1625j01857J45481
15444A61682Q3547j61027j73777k7180Q9960J0982m8456j07230Q0586J68820J61658
15433B39565r5760k2799M0246n0261j10845M1044O2338q8547o3161j96244q7186
15422c31610K0396J2032j5164J3967m7594J30571O9638J17022j3136r7913o9129
15411b10920O0342M8762j01508j7983K4599n8633o4379J56279J82986L9702L2947
15400I2194n174j44035j25486K4389p3464J16492O8737j29648N1799p7017R2771
15389a08442J08538P7450N50j80318j569o199J75504k2185q8623l2934l6658N9562
$$ y = [35259, -132474, -54729, 69697, 143088, 138232, 31719, -109199, -140213, -106954, -175679, -134553, -115967, -99123, -236802, -322683, -130114, 137980, 159683, 118058, 16201, 161682, 245229, 84202, -89575, -116755, -26795, -15813, -64269, -171499, -90913, 77907, 239565, 143805, 121006, 161252, 110991, 146, 41190, 103528, 14981, -48180, -244424, -331610, -311214, -299182, -314346, -300379, -347973, -217402, -147764, -30742, -43878, -141791, -210920, -150578, -101816, -203324, -221307, -196708, -255341, -319720, -163441, 19545, 59247, 92194, 87020, -57015, -182501, -158112, -231576, -115084, -46347, -175995, -124196, -201213, -108442, 96, 77546, 78096, -102222, -103791, -109990, 65514, 43329, -45294, -78228, -114886, -55324]
15377e5324R2080J53451j34367j31129j60405K2658J04811n2943j11267K7273
15367b45162j1804J85569J78694N2421q1789j69726j12054J1858j8052j45400
15357c55445J68384Q1812J2256L1123j59714n9386r7952L8943J94732R2366r5312
15346a48193j04135R3560m124j21532M0073q8326O7318Q0206J18910R3260j7415
15335I602k10971J08786Q769L0234L5043l394J9469j9492J19696r2044J9422R0199
15323A15319J8629j3089q793q3202j13546Q182o7264K542N8930K6589J26660j37335
15311f6378K6938q316P1822J43232N6920l5531j78797j16278J35291O6727j43163
15300d7533o983J5082l0294l9656O1175Q2795o2096q7103m3232q9024O6525N0236
$$ y = [-55324, 36756, 190207, 55840, -75289, -235694, -213036, -108225, -161168, -272435, -245162, -256966, -71397, 107297, 159718, 77929, -91797, -203851, -191993, -210045, -355445, -187061, -105249, -92993, -61870, -221584, -280970, -378922, -339979, -145247, -52881, -148193, -252328, -158768, -162892, -284424, -244351, -332677, -265359, -185153, -66243, 27017, 9602, -201369, -92583, -83814, -53580, -18537, -21931, -2462, -21954, 97742, 5698, 25120, 115319, 133948, 120859, 112066, 28864, -84682, -76500, -143764, -141222, -82292, -55703, 70957, -66378, -39440, -47756, 24066, 167298, 224218, 188687, 9890, -106388, 28903, 95630, -47533, -54516, -39434, -69728, -109384, -48209, 34586, -27510, -114613, -157845, -246869, -180344, -130108]
15288a30108J11944J19130l0705j87696r5657M5804K6522O7223J61261r6707M3113
15277C4124J96513k9078j56533k00685j18830Q5903O0003j79071o5688K59995
15267a13347m4815N2004K0680Q1610P364P674Q6532L3083j8876J6928R6143M3018
15255B67998r8602K6417Q762n4118p6755m2059k15266l9267q4439P6737K14360
15244a6232L5130p4208r913k8280q0258N2122M2044r9373k1110J05117P5422O2111
15232D2572m8789j5959N7086J5324M79l524N1059q2188m8695k1901Q7943P0583
15220A03990J647o9063O9975j70239j8351J43244O2650N6231j37035Q844J34018
15209A85911L8130j26840j43108l4397J20288j51398l7785j08406J38528R3347
$$ y = [-130108, -18164, 100966, 70261, -117435, -213092, -167288, -140766, -73543, 87718, -8989, 34124, 230637, 201559, 45026, -155659, -274489, -188586, -128583, -307654, -373342, -113347, -158162, -106158, -85478, -3868, 3496, 11170, 97702, 130785, 111909, 128837, 224980, 267998, 169396, 195813, 204575, 150457, 73702, 31643, -183623, -222890, -307329, -230592, -16232, 18898, -55310, -65223, -93503, -173761, -121639, -79595, -178968, -200078, -94961, -19539, 42572, -6217, -22176, 34910, 50234, 50713, 47189, 98248, 16060, -32635, -54536, 33407, 103990, 105637, 36574, 106549, -63690, -82041, 61203, 123853, 180084, 43049, 51893, 185911, 224041, 97201, -45907, -80304, 39984, -111414, -149199, -257605, -119077, -25730]
15199b5730j46521j0717M6882j4642K78R75J74257O8614R0505j6786m3231o2774
15187F1110k8052l933j44257j31624o0287m6948K07315J36362M5435r3591M1737
15176a6733o7916q0998J83714r2920j9348J67216J07899l1058k58058n4823J24864
15165c8161n7460k15130j95678J3779K75929K03900m7174j30334L9839m2949q0907
15154b74346L5221N0415J29825l3726j89842J2927J14517J46346k4975j26928
15144a60566o2944j03197j22949O5121K07909J32004P1814Q0561p9465l8522l1909
15133d2143j21342O6941Q1934l8684o7413O3454r5874q8201M596R6195J11130
15122b9407p253l4463q591p6617p7448M0034M4665K53443J33359j10900m2332
$$ y = [-25730, -172251, -182968, -136086, -150728, -150450, -149475, 24782, 93396, 183901, 167115, 123884, 61110, 33058, 29125, -115132, -246756, -307043, -353991, -146676, -10314, 35121, -58470, -16733, -84649, -165647, 18067, -74853, -94201, 73015, 180914, 149856, -108202, -163025, -38161, -95621, -310751, -506429, -492650, -216721, -12821, -59995, -190329, -150490, -193439, -274346, -239125, -188710, -58885, -92611, -282453, -269526, -155009, -8663, -33638, -160566, -223510, -326707, -449656, -384535, -176626, -44622, 27192, 107753, 28288, -10234, -42143, -163485, -96544, -14610, -53294, -120707, -57253, -153127, -241328, -236732, -140537, -29407, -36660, -71123, -79714, -156331, -233779, -193745, -149080, 104363, 237722, 126822, 84490]
15111H4490M2032j66087k72771K9306K48498J23416j11294p6541L7348r320J8678
15100e2245M8593N3537J43833N4021r0194j76404j70299q8464J34466M9111J9911
15089g4134l7076o8068j08400n3165J21672n1942P2818N2636J00130N7763o2679
15078e0445n899M1874p8468o6967J0716P2983N7642j65641l0864L5147M4791J97945
15066F2814j9974k5528J23573r9571j32315l5540j02346M1523q512o2521q7775
15055c46172J52610K07579K00660k06741j05209Q4746l8013j807m1680O8470K9921
15044D364L3303n4582P0630K6481k7999J1729P31n1454j54490L164j6595Q295
15032a46423M8596p745J1931p7115j965J13656P3423R4810p6404j46414K38464
$$ y = [84490, 126522, -39565, -312336, -283030, -34532, 88884, -22410, -98951, -61603, -70923, -52245, -3652, 49885, 193718, 247739, 157545, -18859, -189158, -277622, -143156, -94045, -74134, -111210, -179278, -287678, -340843, -219171, -271113, -198295, -145659, -45529, 12234, -50445, -56344, -14470, -92938, -159905, -149189, -76206, -18564, -184205, -215069, -179922, -135131, 62814, 42840, 17312, 140885, 41314, -91001, -126541, -228887, -187364, -195876, -258397, -346172, -193562, 14017, 214677, 7936, -97273, -12527, -50540, -52347, -94027, -25557, 4364, 37667, -16915, 53715, 80196, 52197, 63926, 64657, 13203, -141287, -138123, -154718, -146423, -97827, -105572, -93641, -170756, -172721, -59065, 14358, 109168, 32764, -113650, 124814]
15021A24814J38480N6606j15890j37835P9504k54o9133J4537j18461K04775P7834
15010B54977L249j59242j42582Q6548p0341L4714L1218j18248k4475n4880J63916
14999D854R3671r8848N613N2578m1984j41880P057j36337P1470j20790J33836
14988a70760J78913J1742L5935p1595R7396R9367j92807k53994J08653R3393j5815
14977g9572j9521J0588q9031J36717Q4708k4563n3107q1582M3688r9973j8409
14966a90057M2321r6073M5466p412k9659n4493Q6806R6384J29405Q5670j84917
14955g6559j49836M4541J70443P1815L0469R2262j11793p2809J9547j64522J1263
14944a35179J24299L9489p2477j47371k7775q551M7563P3799P3898p8695j2949
$$ y = [124814, 263294, 319900, 204010, 66175, 145679, 145425, 76292, 90829, -27632, 177143, 254977, 258226, 98984, -43598, 42950, -27391, 7323, 38541, -79707, -104182, -159062, 4854, 98525, -323, 5290, 57868, 15884, -125996, -118939, -255276, -183806, -304596, -170760, 8153, 19895, 55830, -15765, 81631, 180998, -11809, -265803, -157150, -63757, -79572, -99093, -88505, -177536, -40819, 43889, 19326, -33781, -115363, -71675, -171648, -190057, -147736, -243809, -198343, -205755, -235414, -289907, -203101, -106717, 22688, 108358, -76559, -226395, -181854, -11411, 60404, 90873, 183135, 71342, -1467, 18080, -146442, -135179, -10880, 28609, -43868, -191239, -219014, -227565, -180002, -106203, -32305, -111000, -123949]
14933a23949j33180J33086K59053l4448j32672o1267L1551N5610J40258k8622
14923A05420J38197M7069q0126k27589J4521Q5846p2802q6444M511p5345L7923
14912a08819K6410o8756o0735j7166j36250R9479O4056P9532l298k9348o400K324
14900a58971l749m2430K5836J2904K2571j30712j30437j42809J14309L13951J14347
14889e190J9458M5392k5356r2770L0495O8268q408k05751q7417r1725M7492O5299
14877b40213N8754J11789L7785m4688k10359N2900K36541J7476K8348J32772n7391
14866A23714L4019J993k8471j07822J073Q2385j94136r6814R1073j1256j86948
14855b91190r662K2204J04367M2727J75037n4265j33941o1185P9117J18505J00095
$$ y = [-123949, -257129, -124043, 135010, 100562, -32110, -93377, -61826, -6216, 134042, 105420, 243617, 290686, 210560, -17029, -2508, 83338, 10536, -75908, -71397, -146742, -108819, -82409, -151165, -211900, -229066, -365316, -265837, -201781, -122249, -125547, -154895, -161295, -158971, -162720, -205150, -179314, -166410, -143839, -274551, -404988, -547797, -433488, -119537, -5190, 14268, 59660, 34304, -58466, -27971, 40297, 31889, -173862, -261279, -353004, -305512, -240213, -181459, -69670, -31885, -76573, -286932, -234032, 2509, 19985, 48333, 181105, 123714, 157733, 159726, 131255, 23433, 24506, 106891, -87245, -184059, -92986, -104242, -291190, -300852, -278648, -174281, -131554, 43483, -10782, -144723, -205908, -126791, -8286, 91809]
14844I1809J33620p9074k593n265j1162j0686p0578m0727r7983o4947j74717j7090
14832c49393K1296J493O0597J41570J38918J60722J9237j08136J8315K7522J17766
14821B49907R5318q1209j66678p5664p4114k5335o0274o883J1677j45527K5020
14810b53762M5830J39077Q5936J16988O3621l1097o7910j09675N4762J24783q3936
14799H4617j6724j34062o8840j64560K11514J06394o5241k0439M0650L870k9701
14788e2522j4631k966L8020J06267J10151j0448j9100p3660m5913L113j57334
14777a19023k7923Q0999Q62j03382O0367J34633J13825n7896j64997J63636R0969
14766A72070O0435j10128j43523r6444J51067J249p3458j56146p6146K63279K35743
$$ y = [91809, 225429, 146355, 143762, 138497, 127335, 116649, 46071, 5344, -92639, -157586, -332303, -349393, -328097, -326604, -266007, -124437, 14481, 175203, 194440, 86304, 104619, 132141, 249907, 345225, 264016, 97338, 21674, -52440, -77775, -138049, -144932, -133255, -278782, -253762, -207932, -68855, 17081, 134069, 197690, 166593, 98683, -10992, 43770, 168553, 84617, 67893, -66169, -135009, -299569, -88055, 18339, -46902, -67341, -26691, -22821, -52522, -67153, -70119, -32099, 74168, 184319, 173871, 154771, 81111, 35198, 38311, -119023, -146946, -65947, -65085, -168467, -108100, 26533, 140358, 82462, -82535, 81101, 172070, 232505, 122377, -21146, -117590, 33477, 34726, -38732, -194878, -271024, -7745, 227998]
14755B27998l5461q3562j4222R0440n5135j7581j72014m3874l7202j20476N9461
14744b01628J50032Q0307k4218K4757m6395k00362j05233R6171J17179l0793O4955
14733g5228O5845R4030m22p2380l4331O7803j22895K9626M1324p0147L8758Q3451
14721D5434j11595O4363j03249l5986J3035O8697r2770J04738J982o9932M7946
14710f7337j31494J5723O5126q6472K07882J2066P8877J12844j87410n3755O5232
14699C1282J6661j94060P0149q324N5369m3399q1671M9995J56677R8278L535k13324
14687e8832k4856j1840p7026J79253R3249n539j11662k6456L5541p9420j9755
14676a07343J30625Q7478k4979k1111K6145o5577j8220K62957J21246j46373o7395
$$ y = [227998, 192537, 108975, 94753, 185193, 130058, 112477, -59537, -103411, -140613, -261089, -201628, -51596, 28711, 4493, 29250, -17145, -217507, -322740, -226569, -109390, -140183, -75228, -9383, 84647, 84225, 11845, -22486, 45317, -77578, -47952, -6628, -76775, -38017, 45434, -66161, -1798, -105047, -141033, -127998, -59301, -152071, -47333, -45351, -115283, -67337, -198831, -183108, -117982, -204454, 3428, 15494, 94371, 207215, 19805, -33950, 31282, 47943, -146117, -75968, -84292, -28923, -72322, -153993, -103998, 52679, 150957, 154492, -58832, -83688, -95528, -172554, 6699, 99948, 94409, -17253, -43709, -8168, -87588, -107343, 23282, 110760, 85781, 64670, 90815, 25238, 7018, 269975, 391221, 244848, 177453]
14665A77453j88744j47880k4473N759R3592M6007J97468n5468k9510l1815m1084
14654A305J41424K05550o3812j11167O0635J0090k5821p8393K232r4940Q3198
14643A30301k5872J1467j0647m8596r9651j15124j27356M5785J49608P3330o0533
14632g7288K0532O4037N2474R6515N206o3727p0824j36536j0617J23378l2560
14621b9410j24135j7726j29976O7204o862N5158m7299j4719j2633K1839J83531
14610e5028J88658O4408j23045r2535q1229r6830J52218k0233m9283J45467K6392
14599E8960J9968L1784j12629m1206J26132k0167l1206K10669L2697j54325l0506
14588I0171l8978q0628j3142p7042M6406O2548Q2602k0192k11892L3698P305j32327
$$ y = [177453, -11291, -159171, -183644, -177885, -84293, -38286, 159182, 103714, 74204, 42389, 1305, 142729, 348279, 284467, 173300, 233935, 244025, 218204, 139811, 142043, 47103, 130301, 104429, 115896, 105249, 56653, -42998, -158122, -285478, -239693, -90085, -16755, -77288, -56756, 7281, 59755, 156270, 161476, 97749, 26925, -109611, -120228, 3150, -29410, -153545, -171271, -301247, -234043, -240905, -185747, -233046, -247765, -260398, -238559, -55028, 133630, 198038, 74993, -17542, -98771, -195601, -43383, -63616, -112899, 32568, 58960, 78928, 110712, -1917, -43123, 83009, 62842, 31636, 242305, 275002, 120677, 90171, 51193, -29435, -42577, -119619, -73213, -10665, 71937, 51745, -160147, -126449, -119144, -251471]
14576b51471J43642J63961Q7489J16946n274j20605p1073P8873M3103q6935m8129
14565E0527O2685k6869J45799J06259P0449j97578j92831j03764J60190l7096
14555C7771r2211m1495k6805m8734k9083K0101k6657k3572J85880J07774n1602
14544A1367n5289m3851j11783K843M9380j11791K91547J92222N7003j90750j9429
14533G1469j64837j6830O6269J33027l5222O556L7435O5309o6098j28830J776
14522b9976Q9765L828o2586j75212n408J21244N3868J4824o2775L4975k8787m0743
14510h6983j38563P0099O5640j160J75876l9032l48j7539q2630J6077M6176r6995
14498h9382k1554l4460o6574P0186J01171K2426n0677J30799j5060l9312o9673
$$ y = [-251471, -107829, 56132, 143621, 260567, 255293, 134688, 63615, 142488, 185591, 98656, 50527, 113212, 86343, 232142, 338401, 408850, 211272, 18441, -85323, 74867, 37771, -54440, -95935, -122740, -171474, -200557, -180456, -207113, -230685, -44805, 62969, 11367, -43922, -87773, -199556, -196713, -147333, -259124, 32423, 224645, 281648, 90898, 71469, -93368, -110198, -43929, 89098, 53876, 60432, 97867, 163176, 97078, -31752, -29976, 59789, 63617, 1031, -174181, -179589, -58345, -4477, 10347, -52428, -17453, -46240, -86983, -225546, -155447, -89807, -90967, 84909, 45877, 45529, 27990, -54640, -38563, 7613, -89382, -110936, -145396, -211970, -141784, -40613, -18187, -68864, 61935, 46875, 7563, -62110]
14487f2110Q6764M7835j23764o689N9373k9258J862P7732N2695n3827P8634J2548
14475A41795J1807j16387J4816o9507j36295J14377J20532J1426j96539j01291
14465b05266J79435L823Q1952Q898p2252j15347q1600M1848l7059j12663P8256
14454b29975m4527J5256J86518n3396q3502r818R846J47062M7466P3388j55083
14443i6765p7905K6923J19885N3250p5845R4273J61420j10057m4840J28319j10822
14432F7836k32248j43533K136J34081p8433M6487p1328k5764P9500O1920Q4328
14421g5018o0953j10865K3370Q1095o9455p8670K07354J71141J01358m4461p0301
14410G4595j89454j95789q627K63931J37334n9784O7421j4764r4586J00971o7219
$$ y = [-62110, 24654, 72489, -51275, -57964, 1409, -27849, -25987, 51745, 104440, 50613, 129247, 141795, 153602, 37215, 52031, -17476, -153771, -39394, 81138, 92564, -103975, -205266, -25831, -22008, 59944, 68842, -3410, -118757, -200357, -158509, -195568, -308231, -229975, -274502, -259246, -72728, -126124, -209626, -219444, -209598, -62536, -15070, 58318, -96765, -174670, -147747, -27862, 25388, -50457, 43816, 205236, 95179, 50339, 178658, 67836, -164412, -307945, -305809, -171728, -250161, -203674, -275002, -300766, -221266, -159346, -75018, -135971, -246836, -223466, -142371, -211826, -290496, -83142, 87999, 189357, 144896, 74595, -114859, -310648, -319275, -55344, 81990, 22206, 89627, 74863, -19723, 81248, 14029]
14399A4029p2073J07220N3169j51065j34852q5269M2220P6977J3162j18239P3438
14388a81283J93436K746K1055p1412J0583J40953o6254k70401n8978N7238L4427
14377a87890M8456L0564j3236n7823P750J59451P3768k45780J60020k9862J5372
14366c9210p5659q0341P1915J21320r299R9673M3546j47334j11237J15029J59397
14355A47800j25907k98078J6890J65872J12435M0360j46228J8060j52759j00087
14345c21642q456J51140K61342J89243J29348j24292k66701J04013Q2153n9091
14335A37057j3599O0157l0785k44374p5158p3854M1528K03392M3649m2709m0648
14324c5344J9032P8935j87183p1506J71867M4451q0678q8995j7744M142l0833
$$ y = [14029, -58044, 49176, 102345, -48720, -183572, -268841, -226621, -149644, -136482, -254721, -181283, 12153, 14899, 35954, -35458, -24875, 116078, 49824, -220577, -279555, -222317, -187890, -139434, -108870, -122106, -179929, -172179, -12728, 61040, -184740, -24720, -54582, -39210, -114869, -195210, -123295, -1975, -11274, 88399, 131945, -15389, -126626, -11597, 147800, 21893, -276185, -259295, -93423, 19012, 59372, -86856, -68796, -221555, -321642, -330098, -178958, 82384, 271627, 400975, 276683, 9982, 113995, 196148, 137057, 123458, 183615, 152830, -91544, -166702, -240556, -199028, 4364, 48013, 5304, -35344, -16312, 62623, -124560, -196066, -24199, 20252, -60426, -149421, -167165, -163023, -193856]
14313a93856N9482J12421r9102L3952R0476k00565p8024K15154R5503m609m2445
14302a1613J8709m0313j21643J5402L6389O2445L8898j05651j21194Q3424J25404
14291a9743K3021p6893M3442P734j30415J06527J57408N6418j8078j14875k41770
14280b07224J27331J7602o3626K5847M8418j2255J18466j8792M3519j72463q7291
14269a80468J36920l958J07667j1138o0021R0237J07786l4012j51776o5774j44692
14258b09229r8100p83p0394K4956J04275P4102J5795L3682n2499K6072p4009o0576
14246b86708J4080n54j24832P3191o1991q6169K4674j7006j4499N1927J73031
14235b54856J51471k1885J84410J45317n9284j24851J05049K062p8020j9290Q5001
$$ y = [-193856, -134374, -21953, -121055, -87103, 3373, -197192, -275216, -60062, 35441, 30832, -11613, 7096, -33217, -154860, -139458, -103069, -40624, -1726, -107377, -228571, -145147, -19743, 3278, -73615, -30173, -22439, -152854, -46327, 111081, 167499, 149421, 34546, -207224, -79893, -62291, -125917, -100070, -51652, -63907, 54559, 35767, 79286, -93177, -180468, -43548, -47506, 60161, 49023, -10998, 79239, 187025, 153013, 1237, -64537, -209229, -307329, -308112, -378506, -353550, -249275, -175173, -159378, -125696, -178195, -152123, -226132, -286708, -272628, -273182, -398014, -324823, -386814, -472983, -448309, -465315, -479814, -427887, -254856, -103385, -125270, 59140, 204457, 145173, 20322, 125371, 127433, 49413, 30123, 115124]
14224A15124j16783j10165K5309J34272q7843j56933M6406J62509O8426M5070
14214A25392O3091r5590r8937O0140j13097m7606k923J58732o0942m7335j9081
14203g8156k7202J00820r3896L2909J44172J59186j432q723J1258m7884R2027
14192B83079l2711j14362l8857j17437n1270N4179p3218j5289J9813L0142l7883
14181i3814k9973K9364o089N5498m8730N9224q5035O4956p6149O2533p1669m9465
14169a89349l883L5848j6341J8201K08184Q8699J14329J5512n9907Q3582r0440
14158B04435j56174j7973N1516r0079j46169N7484n7307l3329K15211J89196j79988
14147C6823n0376j47794l4094J03422N1291o3335N0500p7521K0293P8988m8766
$$ y = [115124, -1659, -111824, -86515, 47757, -40086, -197019, -150613, 11896, 80322, 125392, 188483, 92893, -6044, 54096, -59001, -106607, -109530, 49202, -11740, -59075, -78156, -105358, -4538, -98434, -65525, 78647, 237833, 236401, 227678, 238936, 191052, 283079, 250368, 136006, 97149, -20288, -71558, -17379, -90597, -105886, -86073, -55931, -93814, -123787, -94423, -100512, -45014, -93744, -34520, -119555, -54599, -130748, -68215, -139884, -189349, -193232, -157384, -173725, -155524, 52660, 141359, 255688, 271200, 211293, 294875, 204435, 48261, 30288, 81804, -8275, -154444, -96960, -154267, -187596, 27615, 216811, 36823, -13553, -161347, -195441, -92019, -40728, -104063, -53563, -131084, -110791, -31803, -80569]
14136h0569j7866j19020j01506J054p3339J37161Q0431M6501j61610Q050J36567
14125a44146J25061n9085j06155P5225O4242J43250n0656j28198q5779L17309
14115A51068J04060p4238j47858k06949k45906j04286J04025J89267q73L7025
14105a94665O442Q2723L0935Q0520m8322j27691j40047K31815K75647Q2127l7975
14094B41509j70424o3462P7985q1712k30844J64026q883j58078R7861L5292M2152
14083e4578m867j6221K4942q2068q8379J95924J82140O1282k8574j26746j55662
14072i2807O3186J48299N4511Q3571m5753j84211o8026N2934R7451J54529j5631
14061B48053r1399j40738K723n0612p3422J4416l8907J9958Q5708K7225J18458
$$ y = [-80569, -98435, -217455, -318961, -317907, -391246, -254085, -173654, -127153, -288763, -280713, -144146, -19085, -78170, -184325, -109100, -44858, 98392, 47736, -80462, -166241, 151068, 255128, 180890, 33032, -173917, -419823, -524109, -420084, -230817, -231690, -194665, -188223, -105500, -74565, 5955, -42367, -170058, -310105, -78290, 197357, 279484, 241509, 71085, 7623, 85608, 3896, -226948, -62922, -71805, -229883, -132022, -96730, -54578, -59445, -75666, -50724, -132792, -221171, -25247, 156893, 218175, 189601, 62855, -92807, -29621, 118678, 173189, 256760, 211007, 26796, -41230, 11704, 109155, 263684, 248053, 156654, 15916, 18639, -31973, -105395, -90979, -129886, -109928, -24220, 3005, 121463]
14050A21463l4397m7507Q034j7825j43797q8585M7717L02351N385o9783J490r9482
14038a4936l09373P6201J62075o2464N2988l2202r9665J77313O0723j4901j00068
14027a04309K3809q7828j38564J76015N1396L3051J56081J25061j51992j20471
14017c7751k25949M0405L69469R527l5834m045q7692l6109l3095J13975J08937
14006A81838j13147j34096O3121P5757k38735L6217m4632k76911m6954K34404
13996b63138L26686K41206j21862n5896l09560j31910J7815J43052J29688R4672
13986G0753j9939J1653j7480p8148J74714J80981n4869J7588j0465k63314j59250
13975a47776R6328J8763j05663K7719K6322j53598j6274O5586Q5231O0104j32219
$$ y = [121463, 87066, 39559, 47593, 29768, -114029, -202614, -154897, 147454, 152839, 83056, 84546, -14936, -324309, -248108, -86033, -148497, -95509, -127711, -227376, -50063, 10660, -4241, -104309, -80500, -168328, -306892, -130877, -79481, -46430, 109651, 234712, 82720, -37751, -263700, -223295, 146174, 155701, 119867, 115822, 28130, -7979, -41074, 72901, 181838, 68691, -65405, -2284, 73473, -165262, -129045, -173677, -450588, -497542, -263138, 63548, 304754, 182892, 126996, -182564, -314474, -296659, -153607, -23919, 70753, 50814, 62467, 44987, -33161, 141553, 322534, 267665, 285253, 274788, 11474, -147776, -51448, -32685, -138348, -110629, -84307, -237905, -254179, -188593, -103362, -43258, -175477]
13964a75477q6534m0171M9749J26475j3292J05262o698p154m487j47268k10756
13953d10351o036K63263n3230j20127J58606Q1310Q6209K9641j31330M976j6231
13942a13300r4859l3291r5134m8104J07910N9294P5637p5765j28360K08446N0061
13931h7465p9753j16740P0329n1820K087J10664J06686n8818O0338p2209J215
13920a15486K29549L9054k03555k0511P5553J06940p6766l9060j81067m0785R8528
13909a27606J01482j4505j82177R3144O1892Q1971J58671J2199J43661j08949
13899B19783j76039J04048o0667K6964P0124l0146j45709J743J6985L2080m459
13888E4707r7662N4105n4295L9018K9404j02173L4312k2489p1841m3977P1652
$$ y = [-175477, -262011, -302182, -252433, -125958, -139250, -33988, -40686, -47840, -52327, -199595, -410351, -416387, -153124, -206354, -326481, -167875, -86565, -356, 29285, -102045, -97069, -113300, -208159, -241450, -336584, -384688, -276778, -217484, -141847, -217612, -345972, -137526, -87465, -167218, -283958, -213629, -265449, -263362, -152698, -46012, -104830, -44492, -116701, -115486, 114063, 153117, -50438, -70949, 4604, 111544, 34778, -4282, -185349, -226134, -127606, -26124, -40629, -222806, -129662, -67770, 14201, 172872, 185071, 328732, 219783, 43744, 147792, 87125, 114089, 184213, 154067, 8358, 10101, 27086, 59166, 54707, -42955, 11150, -43145, -4127, 25277, -76896, -42584, -65073, -136914, -180891, -109239]
13877a09239o3703j18838K5627J62286J4288l0158n118M2147L2739j06477P8757
13866g7689O6519J36573j1443j07967J5269N1978Q1925O2603j24300m1285n8560
13855f377M5530J91975J9054N0867p186j87002r1553L9339J7964j17753Q5425
13844D0283J62589M7731k5209p3495l4288l8901k64769j82473R4482j05172n539
13833c84761K11176J29370L0530J2976j5624P4933J11991j08728j54485k8281
13823a20903K2119J11541J19834L3477n0341o4234k3402N6852K26039n9367j0391
13812B41224o3486k05693p3547k7793K03493J81099m7888o2168j95798n9412N9661
13801e0308J19180N0766R4820r3213l20742N5010J81878N828M6391q0021k863
$$ y = [-109239, -172942, -291780, -266153, -103867, -89579, -119737, -124855, -82708, -49969, -156446, -77689, -11170, 125403, 113960, 5993, 21262, 73240, 155165, 217768, 93468, 52183, -6377, 39153, 231128, 250182, 301049, 293863, 106861, 15308, 54647, 72611, -45142, 40283, 202872, 250603, 225394, 151899, 117611, 78710, -186059, -368532, -274050, -379222, -384761, -173585, -44215, -13685, -709, -16333, 58600, 170591, 61863, -92622, -120903, -98784, 12757, 132591, 166068, 115727, 51493, 28091, 84943, 310982, 251615, 241224, 177738, -27955, -101502, -129295, 74198, 255297, 207409, 145241, -50557, -109969, -50308, 68872, 119638, 214458, 121245, -199497, -144487, 37391, 43219, 89610, 9589, 6726]
13790F726j7248r1577N0826N5329L7480M15376M1815k07476j10467k00497j1231
13779c0944N2795J25053j10297n5892p216J5392L0853o0819k2147k6764j32796
13768b22782j44183L6139K17525K63902N9365k7550j08207j06999j44498j9599
13758a96887L6687R4694J57686K8623j28881l1083j72538m5371J62252K6137O6959
13747a722j0954J23460J01843n4515K7486O0787L933j56385j28470o9421P4604
13736b9354j8954j4943j7203o7663j28553o9385K14270K51260N3092j2363l0098
13725A30106j68690n1617m3874J46443j72410J658j04790K3456J21652K05556
13715H7490p2208k34432p0702J59802J04565j6002J4697j2311j3008n6094o4849
$$ y = [6726, -10522, -102099, -51273, 4056, 41536, 456912, 498727, 291251, 180784, -19713, -30944, 21851, 146904, 36607, -19285, -26501, -11109, 19744, -41075, -63222, -89986, -222782, -366965, -330826, -113301, 150601, 209966, 182416, 74209, -32790, -177288, -196887, -160200, -65506, 92180, 120803, -8078, -39161, -211699, -257070, -94818, -68681, -1722, -12676, 110784, 212627, 158112, 185598, 246385, 250318, 93933, -34537, -103958, -29354, -48308, -63251, -80454, -148117, -276670, -346055, -131785, 119475, 172567, 160204, 130106, -38584, -90201, -134075, 12368, -160042, -158384, -263174, -239718, -118066, 87490, 15282, -219150, -289852, -130050, -25485, -41487, -26790, -39101, -52109, -108203, -173052]
13704a73052j15822J0525Q9926J08821J77679m3390J0873K1349P8001k52696j35871
13693b23657m4612J9244l0611j6323N9905K7525j66541J0840J16337n193O8309
13682a84777L0711J01946K06863L0577n5530K6017R6186n7684j89175q5661L373
13671g7154k785N6430N8768J11539r815j00281j33534k3916K1858n0004K9588
13660a19306O503j9959K7970O6965k1978O7930J25189m6215N1172J9864j7539
13649A40596J2303q0432q4906M1282R1070N5975O347j88583j13039J61897K41613
13638B84123P8133j20838n5775j06388o829M682o6330J38904K19117q2206k03121
13627H3472J5569m7782J48934N6097L8615J18353K0911n4356k9150J57495J00609
$$ y = [-173052, -288874, -278349, -188423, -79602, 98077, 54687, 65560, 86909, 164910, -87786, -223657, -268269, -249025, -279636, -295959, -236054, -208529, -375070, -364230, -247893, -253086, -184777, -154066, -52120, 154743, 185320, 129790, 155807, 251993, 194309, 5134, -80527, -77154, -79939, -23509, 35259, 146798, 136983, 36702, -96832, -120748, -98890, -148894, -119306, -112803, -132762, -104792, -37827, -59805, 8125, 133314, 87099, 138271, 158135, 140596, 152899, 72467, -12439, 28843, 119913, 175888, 182235, -6348, -119387, 42510, 284123, 362256, 241418, 185643, 79255, 72426, 77108, 10778, 149682, 368799, 286593, 83472, 99041, 51259, 200193, 256290, 294905, 413258, 434169, 379813, 350663, 508158, 608767]
13616F08767j17319k32576j27826j4533L4140J54650J05848j30090j79083m2228
13606E9750J33861J72085O8479j29434j33480O1131Q2457j23701N5555J60815
13596D07518o5054q6634k0991O1803J07412j62846k55028K0860l5403J15853L9048
13585A26538J26476K6552k1605l8491j24081q5670J62694J34547J16333m4129
13575C79164j2937l5711j08874o0096N6015p318J03633J01152r1151j91794K1674
13564A53757o7546j44459j2708J78658L3199J9031O9088N3271j3640n7380j38468
13553G2803q9398k8091m1951N966O4265O7269r7312l7089j00520r5200K6240K56713
13541C695P9363j22278n5901J654L4771J18931o6095L3266l6923k6921Q7445J06605
$$ y = [608767, 491448, 258872, 131046, 116513, 150653, 305303, 411151, 281061, 101978, 59750, 193611, 365696, 434175, 304741, 171261, 232392, 314849, 191148, 246703, 407518, 342464, 255830, 234839, 296642, 404054, 241208, -13820, 7040, -28363, 87490, 126538, 253014, 279566, 257961, 219470, 95389, 9719, 172413, 306960, 423293, 379164, 366227, 330516, 221642, 161546, 217561, 210243, 313876, 415028, 323877, 132083, 153757, 86211, -58248, -70956, 107702, 140901, 159932, 229020, 282291, 268651, 211271, 72803, -16595, -44686, -86637, -80671, -16406, 50863, -46449, -83538, -184058, -279258, -253018, 3695, 83058, -39220, -95121, -93467, -58696, 60235, -5860, 27406, -9517, -36438, 51007, 157612]
13529A57612o8483k98495k03708J54585J67930K07360J0999j48195P8428k7308
13519C0725P0339j5527n6453K7029K1585n9149j15007N3130J18836j01113l0755
13508e6360J6797k8082l2679Q6136J5444L8346k6094J26883Q424j24020j40440
13497a15645l3515K12853J69236j64411r2105J08355j09698j66572K8503k2683
13487a85682M8379K15477J2632p971N6086j35488K1211o2399o5718R6677J7747
13476A0951n6680j2994n2812N004j18010q882Q7920R600J8753l8618J08716N8126
13464A1074j4148l7776o7930O3224L9233j31947L0149j0313r1970j8931J156j8501
13452b46680J81870L1203j19946J0309O9608k939K9799J28604l74o7194m6697
$$ y = [157612, 89129, -209366, -413074, -258489, -90559, 116801, 127800, -20395, 58033, 30725, 101064, 85537, 29084, 56113, 77698, 18549, -96458, -43328, 75508, -25605, -56360, -39563, -67645, -100324, -14188, 1256, 39602, 13508, 140391, 148815, 24795, -115645, -149160, 63693, 232929, 68518, -23587, 84768, -24930, -191502, -162999, -185682, -137303, 78174, 90806, 82835, 138921, 3433, 24644, -37755, -103473, -6796, 10951, -45729, -58723, -111535, -106531, -224541, -233423, -145503, -135903, -117150, -155768, -47052, 11074, -3074, -40850, -108780, -45556, -6323, -138270, -108121, -118434, -210404, -229335, -228179, -246680, -64810, -33607, -153553, -143244, -73636, -76575, -46776, 81828, 81454, 14260, -32437]
13441c2437q1708j45367J18061Q1904k3364J230M4781O9258M8708l4316J16255
13430A63005M8602j67895L6951O6730p5716j1124j15824J89064J40394q040q5507
13419A80640j26505m128K3648P0731p4543j19501R1103J41641k5456j34565Q348
13408C1413P4698P2723j48476j46844K9297j3923P4627J26159O250l1588o0107
13397A4229j24956j3225K15348K3179K8826k84463j23216K81261N2962R415L5799
13386A15159j35763r5710J47580r9241j51278J28456J01192M4200N843J97289
13376B57727J6967j48578p916n048l616j4058r6478J8769J25906j77858k19379
13365b53562J03949M7363r6670r6005P8010J43585J9122m9990m5119o1126N4413
$$ y = [-32437, -114145, -259512, -141451, -59547, -82911, -81681, -36900, 32358, 81066, 46750, 163005, 211607, 43712, 80663, 147393, 71677, 60553, -55271, 133793, 274187, 266147, 180640, 54135, 50007, 73655, 144386, 69843, -49658, 41445, 183086, 157630, 23065, 31413, 106111, 178834, 30358, -116486, -87189, -101112, -26485, 99674, 105924, 74336, 14229, -110727, -123952, 91396, 114575, 143401, -141062, -264278, 16983, 69945, 79360, 115159, -20604, -116314, 31266, -67975, -219253, -90797, 10395, 54595, 60438, 257727, 274694, 126116, 118200, 113152, 109536, 95478, -1000, 17769, 143675, -34183, -253562, -149613, -102250, -198920, -294925, -216915, -73330, -54208, -104198, -149317, -210443, -156030]
13354a56030L0588N1087J7078j26964j47929N8105J28611j7925Q08J10027K27818
13343A75274L0221j10972j37814p7562J23478O8271N5954j11351j53820p2182
13333b10503J65346p9683p2546K06447n9021k06076L1056J31336Q1374j28424
13323a40694J14617O8143o1828j37585j8224J09240L6592q6590r1521j0109p1056
13312b89015J7454K72708J7605j50439R4076j12542j16952J90316M7576n6607
13302h5820N295j25139P6141J04679j69420O5055N4099L8893q9173O217j994J0270
13290a10897J73128Q8830N0733l7037j0560j9342r5347j61794j17784N0046J33837
13279e6187J08997N8666O7811j41880k44606j08394J62936K5690Q8392P1753L2770
$$ y = [-156030, -125442, -74355, -57277, -184241, -332170, -274065, -145454, -163379, -162571, -52544, 175274, 205495, 94523, -43291, -120853, 2625, 70896, 126850, 15499, -138321, -210503, -45157, -124840, -197386, 9061, -49960, -256036, -224980, -93644, -12270, -140694, -26077, 42066, -19762, -157347, -175571, -66331, -29739, -116329, -207850, -217959, -289015, -271561, 1147, 18752, -131687, -37611, -150153, -267105, -76789, -29213, -85820, -80525, -205664, -129523, -24844, -194264, -129209, -75110, -36217, -125390, -119173, -121167, -110897, 62231, 151061, 201794, 164757, 154197, 134855, 39508, -122286, -240070, -190024, -56187, 52810, 111476, 179287, 37407, -207199, -315593, -152657, -126967, -38575, 33178, 65948]
13268F5948q1208q475L6150p0878P7624K1964K4235j1824R682n420N6707L3394
13256A47899j37762p0344j1822k7705j40609K1015J7587M5272m1412K30704J08299
13245A41122n1983J00726j67858j3526J90361L323j26559m7311o3271j78704Q4856
13234a28824R3871m6273J0542L6524O4608M8238n4468r0130K2751J55656K2482
13223A34977j22128J0436R3969j60248q2858R7675Q286P290j52660M16J20398
13212d4447P3138N6937N1584k01948q0631O9917P9598n3070l8027L8384o6686
13201a15251j7010R9121K17978J70364j09697k38068j45947r9354L6513R5137
13191a06214J3695k0520q7382P3301l8903K3523n1454J56112K74799K9240j20906
$$ y = [65948, -15260, -23735, 12415, -58463, 19161, 41125, 65360, 53536, 63218, 57798, 114505, 147899, 10137, -60207, -72029, -99734, -240343, -219328, -201741, -156469, -197881, 32823, 141122, 89139, 189865, 22007, 8481, 198842, 202165, 75606, 28295, -34976, -213680, -128824, -34953, -81226, -70684, -34160, 30448, 78686, 24218, -65912, -43161, 112495, 134977, 12849, 23285, 117254, -42994, -125852, -28177, -19891, -12601, -165261, -164845, -44447, 28691, 85628, 137212, -64736, -145367, -75450, 4148, -48922, -86949, -48565, -115251, -132261, -33140, 184838, 355202, 245505, 7437, -138510, -237864, -201351, -106214, -92519, -113039, -200421, -127120, -166023, -142500, -193954, -37842, 236957, 266197, 145291]
13180A45291K4365L7826j96456j41213n727j40112o9316J25837M9166J09047J25124
13169F3832r4162j72111o2464K0977J32624P554P1423M9618J44636J44190p1025
13158B35092j35578j94181j28566J14365P4016l102P2246q2118q7401j0526j02632
13147b48385N8253K8658J55423l5279q710Q9108J4637N2209M6699r7378q2290
13136b7055p5958p3412j8436O9631J21481k5089j2827P9097k16783p5374J76429
13125g8296K76761N454l7933q6459j02334l1534r2233l129J20764L7574L0197
13114C8832j41272r4536L6142J9776J02321r314k2178M6537N6576k8340l8143
13103c3599j27523j16246O7585Q0325J21545N7738j80070J24334q6308j06125
$$ y = [145291, 169656, 207482, 11026, -130187, -135914, -276026, -345342, -219505, -170339, -61292, 63832, -30330, -202441, -264905, -243928, -111304, -103750, -32327, 17291, 161927, 306117, 235092, 99514, -94667, -223233, -108868, -34852, -37954, 34292, -47826, -135227, -145753, -248385, -190132, -161474, -6051, -41330, -50040, 39068, 53705, 105914, 152613, 55235, -27055, -103013, -176425, -194861, -125230, -3749, -28838, -41665, 37432, -179351, -254725, -78296, 198465, 203919, 165986, 79527, -22807, -54341, -146574, -149703, -28939, 8635, 38832, -102440, -196976, -160834, -141058, -38737, -48051, -70229, -23692, 32884, 4544, -33599, -161122, -277368, -209783, -129458, -7913, 49825, -130245, -5911, -92219, -198344]
13093a98344l850J55625J40321Q1444j21285j53543n7121J9115o157P967K15641
13082G9813O9419j38143j9553m6108k7702J26266m8420p9835K2570j40603k0816
13071b23112R117J16800L9765J22886N854m1011K1721j32825r0364K7736q010
13060a51443j9534p820Q3976P2334l5214Q9801j02884q2839R8358o492j37676
13049a99433J29956J41548j04315q9808j8032j18394O8990J98274l5276m3407
13039f9897j2218O9392J2782j1673q9618J7895J75704J20762K2604r7269j98098
13028e9634j26128j0799J5850Q867K1775j9578N393L8032N1493n9546J2656L5016
13016h6603n2045N8210j25490k18944K412K01779O9896J01910Q3513o4988Q8171
$$ y = [-198344, -202194, -46569, 93752, 175196, 53911, -99632, -156753, -137638, -143795, -135828, 79813, 149232, 11089, -8464, -54572, -82274, 43992, -4428, -84263, -61693, -202296, -223112, -213995, -97195, -57430, 65456, 71310, 30299, 52020, -80805, -171169, -143433, -151443, -170977, -178797, -94821, -22487, -57701, 32100, -70784, -153623, -55265, -61757, -199433, -69477, 72071, -32244, -122052, -140084, -258478, -189488, 8786, -26490, -69897, -82115, -12723, 59, -11614, -101232, -83337, 92367, 213129, 235733, 138464, -59634, -185762, -196561, -180711, -171844, -150069, -169647, -164254, -126222, -74729, -134275, -121619, -86603, -138648, -80438, -205928, -424872, -422460, -220681, -150785, -48875, 34638, -30350, 57821]
13005E7821R2605j41145j25556J22792K14098J30006p1898p0088k1856j55138
12995C1641j0866j9554R6762j0562J23234j62466j60807J18870J52061r9659J1471
12984G0125m0477K309l0966K0157J25561J34428J3246q4399j05234o755j46490
12973d8495j24751j36867N3759Q1280N1150j593R0930q0282j71839J18043L16369
12962A47704N4183k3794j92823m5283K5569m564q6616o9934R2214J06734J2372
12951A5762l7845m93k1327m7871p722N740k7366O2576R6478M3142p0868n0247
12939d0041j4031O7333M5849p6182J37824q2561p5495M9667P2905J14295J08130
12928C07693j96371j46446k2930Q5627j3849j08947l2447M1066J97023L6164P5416
$$ y = [57821, 150426, 9281, -116275, 6517, 220615, 350621, 278723, 208635, 186779, 31641, 20775, 1221, 97983, 87421, 210655, 48189, -112618, 6252, 158313, 58654, 70125, 29648, 31957, 991, 21148, 146709, 281137, 294383, 209984, 104750, 97995, -48495, -173246, -310113, -256354, -175074, -123924, -125517, -34587, -114869, -286708, -168665, 147704, 201887, 178093, -14730, -60013, -34444, -39008, -125624, -195558, -103344, 3390, 15762, -22083, -22576, -43903, -91774, -99496, -93756, -121122, -58546, 37932, 81074, 10206, -40041, -54072, 13261, 59110, -17072, 120752, 38191, -37304, 12363, 85268, 199563, 307693, 111322, -35124, -58054, 27573, 13724, -95223, -127670, -86604, 110419, 146583, 221999]
12917B21999o4217j6370P291k4547j3196j61314l939j06205M2721K5753o9392
12906a61416j02207J38145J55454j29669J94190J04809o0131q6011n4588K8366
12896B6942j15885j29781Q4918L1887J3452q9917j50080K3240K11838Q4493J4498
12885E605p9744m1008J03335N1195O5860j61091q9768J48758K2718M2075J20576
12874A88511k0270J0599R8O0729N9785L7736k42726j72346o1005J15250J24574
12863A00935j04442j26233N6410m589P1529J23277q7907P751l2605R965J25901
12852A39992j06549q6537j11055J21303o0045j23020j3935J48504J36455N3488
12842I8601n2231K22643J4987j45858n642j35170q6299Q5674R1941p4677L9029
$$ y = [221999, 157782, 141412, 148703, 124156, 110960, -50354, -54293, -160498, -117777, -92024, -161416, -263623, -125478, 29976, -99693, 94497, 199306, 139175, 53164, -1424, 26942, -88943, -218724, -133806, -101919, -88467, -178384, -328464, -305224, -93386, -8893, 5605, -74139, -115147, -11812, 39383, 105243, -55848, -145616, 3142, 25860, 67935, 188511, 168241, 178840, 178938, 239667, 299452, 337188, 94462, -77884, -138889, -23639, 100935, -3507, -129740, -73330, -77919, -6390, 116887, 28980, 36731, 4126, 14091, 139992, 33443, -53094, -164149, -42846, -102891, -225911, -239846, -91342, 45113, 98601, 46370, 269013, 284000, 138142, 132500, -2670, -88969, -3295, 88646, 13969, 52998]
12831E2998k3698j39462j02854R9610K15187N7195j5682M518P9814J2116j42632
12820I7110p0639n1865J29805R3053k67119m4486J86531J58343K9030P8505q26
12809C37442l7449k05811j8690J5627K073o3558p0855N8584P6841Q6371R0966
12798B71541j06768n138n0029k44026j04218N0681j35593m3256J73087J63442
12788c0277M4321n2018j48083K9958o826N1163r8Q2120J06841N7503Q70k7255
12776A08219J50074M593j56289m8823O0928j2293k14340p1172J20284K20281J14864
12765B76326J00199o2242m7835j32961j53202j23618k0967M3145J26426K24116
12755B29387O6991j52010l2376q4420o9221Q8536l8640l93J20544p352l8130J09511
$$ y = [52998, 29300, -110162, -213016, -113406, 101781, 158976, 143294, 147812, 227626, 239742, 97110, 26471, -25394, 104411, 197464, -69655, -114141, 72390, 230733, 259763, 338268, 337442, 299993, 94182, 75492, 91119, 93192, 29634, -41221, 17363, 94204, 180575, 271541, 164773, 159635, 109606, -134420, -238638, -187957, -323550, -366806, -193719, -30277, 14044, -37974, -186057, -156099, -162925, -111762, -111860, -29740, 77101, 134604, 135474, 108219, 258293, 262886, 106597, 57774, 118702, 106409, -107931, -179103, -58819, 161462, 276326, 376525, 314283, 266448, 133487, -19715, -143333, -164300, -121155, 5271, 229387, 296378, 144368, 111992, 27572, -41649, 46887, 8247, 7854, 128398, 121046, 82916, 192427]
12743A92427Q4547j17450j8961k0249M1167N3766j36621p9929J57510J85190j27545
12732B13852j24818M6587M65L3137l3806j64288j45182L9734R2073J87658j72346
12721b6934o6264P8583o1072n1095J04865P4809j97126J53012K90354m4034j54941
12710A00157J6854Q7879j37635k96326p3279j62625P652L13864M1181l5031l8854
12699a76163l0683J09930L8641K2873J22145o732Q1757J27909n9910l8359N3687
12688B45095Q4260J05056k57638j15485p8854J05934m1869k29616J7611J89458
12678B3952J54257Q0686j99708m7246J9593M1330j1542j7868N5767J24489n1281
12667A72429p5176q0559r1777r1395n3272K16654O445q6473O69Q5047r7842O6999
$$ y = [192427, 276974, 159524, 140563, 120314, 161481, 215247, 78626, -1303, 156207, 341397, 213852, 89034, 135621, 136086, 169223, 135417, -28871, -174053, -134319, -42246, 145412, -26934, -93198, -14615, -75687, -126782, -21917, 52892, -144234, 8778, 299132, 255098, 100157, 117011, 204890, 67255, -229071, -302350, -464975, -457323, -143459, -102278, -137309, -176163, -206846, -96916, -58275, -35402, 86743, 80011, 161768, 289677, 229767, 191408, 245095, 329355, 434411, 176773, 61288, -17566, 88368, 46499, -183117, -165506, 23952, 178209, 258895, 59187, 11941, 31534, 72864, 61322, 43454, 99221, 223710, 172429, 97253, 16694, -75083, -166478, -219750, -3096, 3349, -83124, -82455, 2592, -95250, -28251]
12655b8251l4341P8356J43962r6956p6235J698J47936j10109r7029j3568Q6124
12644A587o988M0215J14633M0617j80366q7963j2594n2340L8483N0893p8184J02554
12632b9453K9053j97461j1510J00131P0999p63O0862j91907p1168P4191R8319
12621f8707k1026P9304k6950m4462P1981j9583m7108l1778l7570o9125J09777
12610a05247K3873L8903m4659j0741Q4291m1362q9811O7075J77608J43749J8391
12599B62070j68164n5481J08812M7978K5553N5385N2335k52695N7116O1499l6321
12588A58087k757j18771p9325M3358J20840K1549P6333j3998k9298P61N320j34352
12576D7747l9123K1240p3873K9808r0784k2421M2155P9417p6104m3587M5680K10193
$$ y = [-28251, -62592, 15764, 159726, 62770, -13465, -11767, 136169, 26060, -70969, -84537, 1587, -5401, 34814, 149447, 190064, 9698, -78265, -90859, -143199, -104716, -53823, -132007, -29453, -400, -197861, -209371, -109240, -38241, -39004, 21858, -170049, -241217, -167026, -68707, -89733, -10429, -37379, -81841, -9860, -29443, -76551, -108329, -145899, -215024, -105247, -81374, -42471, -87130, -97871, -13580, -54942, -144753, -77678, 99930, 243679, 262070, 93906, 38425, 147237, 195215, 220768, 276153, 328488, 75793, 132909, 194408, 158087, 155330, 36559, -42766, 592, 121432, 142981, 219314, 205316, 176018, 176779, 182099, 47747, 8624, 29864, -44009, -14201, -104985, -127406, -85251, -5834, -81938, -125525, -79845, 130348]
12564A30348M7077j10558j42978k35244J25656J79501j1550j03286L3981J04056
12554A7003j11528p8221k4853K3525J31458n7466m0257J72734K00830m0843P6338
12543B68720J17748o5220j80413q1224j36783R7115L5202O6644J8430p1233r7932
12532b8946J20401R7574K3988p0219O2636J54910k96819n5882o3340j48666m1559
12521b45922j605J87449J13127J29081k5915j81429j52267n8132J35449J31260
12511C1096N6173K5674Q4417j01478r0160L3620P4274N2874q180j2667j6813l5987
12499I2843L2893j036R7005M605j47693j12749p819L9234K04991J44937L4353
12488C81564j44495j63300N4895n0662j41788J21008J88840R9046j38411o2375
$$ y = [130348, 177425, 66867, -76111, -311355, -185699, -6198, -17748, -121034, -87053, 17003, -94525, -172746, -197599, -174074, -42616, -100082, -140339, 32395, 233225, 192382, 268720, 386468, 321248, 140835, 59611, -77172, 19943, 55145, 121789, 140219, 68986, -28946, 91455, 189029, 213017, 142798, 205434, 360344, 63525, 7643, -55697, -204363, -245922, -247527, -60078, 53049, 182130, 156215, -25214, -177481, -235613, -100164, 31096, 87269, 112943, 197360, 95882, 5722, 39342, 113616, 166490, 158310, 145643, 128830, 92843, 125736, 124700, 221705, 226310, 78617, -34132, -41951, -2717, 202274, 347211, 381564, 237069, 73769, 128664, 78002, -63786, 57222, 246062, 345108, 206697, 144322]
12478A44322n9922r9479r505n2373j63729p8938L0844J84956J82765K9689j07380
12467A250O5568j09333j86566P9231Q9397R9542N3852n415j20519p3571N3308
12456e3256j7449O4647J23458J1178r1931j70713k327R842O2461P2805L6034k2704
12444B2045j1857J00707N5207o993J1533j37572K8745J27559M1045j95590n1264
12433a6435Q2130N4212J32900l9360R4768J6447Q409J5458N949l0402k28420j10459
12421a4803o9842N6342J66635J37330J47501k5626j83025q8772o3273O4975J10223
12410B37665N5091q6188o3704L6661L6384M3986N7557q8626l8195p921m1521p135
12398A34054J17892K6491j9198q1026l8423M1707L6234J141J04257J89590K1487
$$ y = [144322, 84400, -15079, -24584, -76957, -240686, -319624, -288780, -103824, 78941, 108630, 1250, 66818, -42515, -229081, -149850, -60453, 39089, 92941, 87526, -32993, -106564, -53256, -70705, -6058, 117400, 128578, 36647, -134066, -136393, -126551, -64090, 8715, 44749, 22045, 10188, 110895, 166102, 159109, 170642, 33070, 61815, 189374, 230419, 34829, -16435, 65695, 119907, 252807, 213447, 308215, 324662, 333071, 348529, 354478, 324076, 95656, -14803, -84645, -28303, 138332, 275662, 423163, 397537, 214512, 125740, 62467, 127442, 237665, 292756, 206568, 142864, 179525, 215909, 259895, 317452, 228826, 190631, 182710, 141189, 134054, 251946, 278437, 259239, 178213, 139790, 181497, 217731, 218872, 323129, 512719, 534206]
12387E34206j71429j00262Q1315K9635P448O2556o7508o5340Q3685M0968l4089
12376D01185K4270J4731l5337J06200m1609m6949K021l127k881J74037J56299
12365G48840K9359k38068j36245K4485J37793J15360J0102o2224o1979j53800
12355D13623J00147J43494L264K368j50977M6640K0425j52233k409O6385q9135
12344D01592m1508K0197J08465J41383m7519P5117K03420N7299N0789N4482P1143
12333A094860m5307J51836L6659m226j09773r9913P822M3761k7911r879j8112
12322A019817j39587j50086j18149k9612j8823M1742j23740K744J25233J09726
12312G19265J16700j89849n7584J55568J03548m100k24368j50182M9791l7386
$$ y = [534206, 362777, 262515, 343830, 373465, 380913, 443469, 375961, 310621, 394306, 435274, 401185, 425455, 440186, 404849, 511049, 469440, 422491, 424512, 421385, 418504, 592541, 748840, 778199, 540131, 403886, 428371, 566164, 681524, 691626, 629402, 567423, 413623, 513770, 657264, 660528, 662896, 511919, 558559, 578984, 426751, 424342, 490727, 401592, 360084, 380281, 488746, 630129, 582610, 657727, 861147, 918446, 969235, 1023717, 1094860, 1049553, 1201389, 1238048, 1233822, 1124049, 1024136, 1031958, 1075719, 1047808, 1037929, 1019817, 880230, 730144, 611995, 582383, 563560, 605302, 481562, 484306, 609539, 719265, 835965, 646116, 588532, 744100, 847648, 843548, 619180, 468998, 518789, 481403]
12302D81403M4623K02254L5903l6103r902N1920R0901K4725j01669n0391n2255
12291F81409l8091m9286j04630j89743q6052J4641Q1686J29183R7654O6987n9246
12280E44512o4421j22908J30551m9733j26627j02115p3410J56085L1186j80371
12270A42749j26625l3192O9173J06417P8946K9059r9714k248Q337j460j56836
12259A4606p756M4517O2009k2181j7807L2491p6690Q1876j3225l2119J05321N2567
12247B23609l8668j17610M3922r0603M664L3341q2008N739K3185J27775q3317
12236E0029O1090J41642O6017K7218j08356j48996K05717O5434j28452j31368
12226I9975P888l896Q7293M9783j5327K7939J23630J52200o6111n1367q8541j5517
$$ y = [481403, 526026, 728280, 764183, 728080, 718178, 770098, 860999, 885724, 784055, 733664, 681409, 643318, 594032, 489402, 299659, 213607, 228248, 309934, 439117, 536771, 603758, 544512, 480091, 357183, 487734, 438001, 311374, 209259, 135849, 291934, 323120, 142749, 16124, -17068, 52105, 158522, 237468, 266527, 166813, 164565, 172902, 171442, 14606, 6850, 51367, 113376, 91195, 73388, 105879, 29189, 111065, 97840, 65721, 171042, 223609, 184941, 67331, 111253, 20650, 25314, 58655, -23353, -17614, 5571, 133346, 50029, 111119, 252761, 318778, 345996, 237640, 88644, 294361, 359795, 231343, 99975, 107863, 103967, 191260, 241043, 225716, 253655, 377285, 529485, 463374, 412007, 323466, 307949]
12214C07949o2179k8002j2918P4186J17166L3946j18098j05229J59899J80415
12204E47135K62947K00046k4321j81921j38055J72050P5159j58783k11948o4337
12194D77972j24417k8633R3938K42508O4364j75963j17769m1416J50402J51632
12184F92618J1416m2199j9276J20068K1875j10689J4855p9834l7674P745J29696
12173G08601N5419N620J98848J05200k07329k2297J59206K3153l4935K3268o4653
12162I50101j06668M797L6461Q0961q413n2002Q8705m6593Q4748j09852j74080
12151G48165O927J17315J33324M1448j10955K5846L3175q6814j36726J81309P4218
12140A027232o3422N8789K56697j81467o8977J0638m3476J18988l8486j68028
$$ y = [307949, 245770, 217768, 204850, 279036, 396202, 430148, 312050, 206821, 366720, 547135, 810082, 1010128, 985807, 803886, 665831, 837881, 913040, 754257, 542309, 477972, 353555, 324922, 418860, 661368, 725732, 549769, 432000, 390584, 540986, 692618, 704034, 661835, 642559, 762627, 784502, 673813, 688668, 608834, 571160, 578905, 708601, 764020, 769640, 968488, 1073688, 866359, 844062, 1003268, 1026421, 991486, 1014754, 950101, 843433, 848230, 884691, 965652, 957239, 905237, 993942, 947349, 1032097, 922245, 748165, 755092, 872407, 1005731, 1047179, 936224, 962070, 995245, 908431, 771705, 953014, 1027232, 963810, 1022599, 1279296, 1097829, 1028852, 1039490, 996014, 1115002, 1076516, 908488]
12130I08488M0948J09062J49697l7529j8337K5587n965o643K5470p2876k30453
12119H87449j69153O868J20285p9259O9668l097l8872O4204L5245n1897j7383
12108H24058J24982J5962l4619K2543O0177l265o2802J49023N8887r084l4920
12097A110942k5037N9313j66408m5214q705K11872N0034j42994j90809R189P8439
12086I40622J55980l2484N1520O0793O7150j62507j19952J82028N4347j38958
12076A058539j30085K745N60Q0118q8173l3792J12430P1997J12331N9337n1344
12065A194663p3671L3742J62861J67069q393j19803M2283Q9308r8101K1484R3518
12054A504960K12864J94502P0980O9231p7536j54057j54055r4334o3107P61Q3404
$$ y = [908488, 949436, 1058498, 1208195, 1170666, 1152329, 1177916, 1171951, 1165308, 1190778, 1117902, 887449, 718296, 725164, 845449, 766190, 835858, 832761, 793889, 858093, 893338, 841441, 824058, 949040, 965002, 930383, 952926, 1013103, 1009838, 947036, 1096059, 1154946, 1145862, 1110942, 1085905, 1145218, 978810, 933596, 924891, 1136763, 1186797, 1043803, 852994, 862183, 940622, 1096602, 1064118, 1115638, 1176431, 1243581, 1081074, 961122, 1143150, 1197497, 1058539, 928454, 931199, 931759, 1011877, 923704, 889912, 1002342, 1074339, 1186670, 1246007, 1194663, 1120992, 1154734, 1317595, 1484664, 1476271, 1356468, 1398751, 1488059, 1389958, 1411442, 1504960, 1717824, 1912326, 1983306, 2052537, 1975001, 1820944, 1666889, 1572555, 1509448, 1510209, 1593613]
12043A593613Q9495Q3878J94371J49785J50666j0259Q4761J33260j36118p9183
12033B254269o3116J63171j9595M2134J8909N5276Q0692J48573O5576m389J4903
12022B756403J06775J69487J40372N6894J8908L631j2487K81694O2989o2028P3262
12011C595900k9070q4749o8095K12741R8428R0286K09987K55905K37845K76831
12001D796009L45689J36909K19250J36359j15099K968K08113J71035L532R0727
11991E995492J19350K18706M3737N7734J43003k677J28579K41430K42001J65728
11981G353083J68619J40519J67462L06205K23530K50809K88237J19455J39416
11972I157335J58658O5280K12374M49837L27683L09253M07307N47172P90865O52844
$$ y = [1593613, 1683108, 1766986, 1961357, 2111142, 2261808, 2251549, 2336310, 2469570, 2333452, 2254269, 2191153, 2354324, 2334729, 2376863, 2395772, 2451048, 2531740, 2680313, 2745889, 2741500, 2756403, 2863178, 3032665, 3173037, 3229931, 3248839, 3252470, 3239983, 3521677, 3584666, 3522638, 3595900, 3566830, 3482081, 3413986, 3626727, 3725155, 3815441, 4025428, 4281333, 4519178, 4796009, 5141698, 5278607, 5497857, 5634216, 5519117, 5522085, 5730198, 5901233, 5904765, 5995492, 6114842, 6333548, 6377285, 6435019, 6578022, 6575345, 6703924, 6945354, 7187355, 7353083, 7521702, 7662221, 7829683, 8135888, 8359418, 8610227, 8898464, 9017919, 9157335, 9315993, 9381273, 9593647, 10043484, 10371167, 10680420, 11087727, 11634899, 12425764, 13078608]
11962A3078608O66309N84632N43602P54997R55504R50868J025318J128897J035111
11953B0723846J063394J387911J725122J617674J558003J571352J718604J716286
11945C3082192J965822K095535K424965K717417K955155L568410M238648N157161
11937E8205305O148490P229883Q455912R409649J0441911J1225371J1243384J0796066
11929A33155971R548768Q126392O693456N366521N029394N150468N869736P110334
11921A86051040Q188961R250312R807538R822966Q994497P543788N424661K835996
11913B47919759L67387k111396m502270o071360o872476p291835p466871o802972
11905B07167966o473252o109420n700581n273427m956593m479250l873777k988016
$$ y = [13078608, 13744917, 14329549, 14873151, 15628148, 16583652, 17534520, 18559838, 19688735, 20723846, 21787240, 23175151, 24900273, 26517947, 28075950, 29647302, 31365906, 33082192, 35048014, 37143549, 39568514, 42285931, 45241086, 48809496, 53048144, 58205305, 64353795, 71583678, 80039590, 89449239, 99891150, 111116521, 122359905, 133155971, 142704739, 150831131, 157524587, 162891108, 167920502, 173070970, 178940706, 186051040, 194240001, 203490313, 213297851, 223120817, 232115314, 239659102, 245083763, 247919759, 248287146, 246175750, 241673480, 235602120, 228729644, 221437809, 213970938, 207167966, 200694714, 194585294, 188884713, 183611286, 178654693, 174175443, 170301666, 167313650]
11897A67313650j657108K35999K080248M865559Q360490J2519672J6977548K1125812
11889B31821870K3240225K2127882J6572821P277603l582673j3405495k0044015
11882B64008218k2564698k2060470j9314374j5763186j2486576r724148p535216
11875A54559550o250504n278805m731915m472591m236626m213963m064330l912498
11867A17398318l847214l547821l099244k580341k424113k429443k293914k216250
11859I4959978k244104k211777k129644j832428j336807p89757r5R28575J834058
11850H7177999K579069L454595M179884M306552L695748K175188j20391k569621
11842A04879023m601054o419863p499004p648976p484427o956514n930065n274690
$$ y = [167313650, 165656542, 165892541, 167972789, 172838348, 181198838, 193718510, 210696058, 231821870, 255062095, 277189977, 293762798, 301040401, 297457728, 284052233, 264008218, 241443520, 219383050, 200068676, 184305490, 171818914, 162094766, 154559550, 148309046, 143030241, 138298326, 133825735, 129589109, 125375146, 121310816, 117398318, 113551104, 110003283, 106904039, 104323698, 101899585, 99470142, 97176228, 94959978, 92715874, 90504097, 88374453, 86542025, 85205218, 84415461, 84415366, 85343941, 87177999, 89757068, 93211663, 97391547, 101698099, 105393847, 107569035, 107448644, 104879023, 100277969, 93858106, 86359102, 78710126, 71225699, 64269185, 58339120, 53064430]
11834E3064430m426874l870115l288882k843433k475210k202738k106727j971046
11826B9879405j754800j599418j556182j465275j164711j352395j413443j165508
11818A8407673j049473j239550j033294q69009p66950o40945q16381p17395o51546
11809A0623130n72658o20995n52615m02585l66527l75173l08238j52043j46704
11800G125592q3089k17480k65403q0320J00562n309j85338j38487o9828n102j92966
11789E982832j18441j22044j51343m7390j51827m0284j32663j20270K02660J43495
11779E444725j40713j20569o7579j46124p2925k35729q4816n3022k04424k05755
11769D113069P871k46345j70294j8036o7998j07939k4982j44074j25470k6258
$$ y = [53064430, 48637556, 44767441, 41478559, 38635126, 36159916, 33957178, 31850451, 29879405, 28124605, 26525187, 24969005, 23503730, 22339019, 20986624, 19573181, 18407673, 17358200, 16118650, 15085356, 14216347, 13449397, 12808452, 11992071, 11274676, 10623130, 10050472, 9429477, 8876862, 8474277, 8107750, 7732577, 7424339, 7272296, 7125592, 7042503, 6825023, 6559620, 6479300, 6579862, 6574553, 6389215, 6250728, 6180900, 6175798, 5982832, 5864391, 5742347, 5591004, 5543614, 5391787, 5351503, 5218840, 5098570, 5301230, 5444725, 5304012, 5183443, 5115864, 4969740, 4896815, 4661086, 4576270, 4523248, 4318824, 4113069, 4120940, 3874595, 3704301, 3686265, 3618267, 3510328, 3485346, 3341272, 3215802, 3189544]
11759C189544j39268r8570j17828j74177J3399j67760k28073o8349Q0442j75510
11749B113850N0385m5223k55371o8707O2815J7181P2383j2755o4226j0293l3261
11738A826778R0053p6503j25787O2309K9695k07214n5401l1979q313R3250j04694
11727A492194k7541j5584M1935q7823j59260R5524J60788j41436l2821n1122m6587
11716A228267k91N8222J69653l7889q7014j13952r7800j54953o0151K282L9325
11705I45699l9763P2478r963m8527m6798j75394J5201N4201J04442l6193j75903
11694F59480J16326N3561r027O8816m4235q4005r5580p8946M7654l9213p8756
11683E16075n1627j15105o9018L7763n6942k7275k0843Q0731J51763o2979J4189
$$ y = [3189544, 3050276, 2951706, 2833878, 2659701, 2673100, 2505340, 2277267, 2208918, 2289360, 2113850, 2164235, 2119012, 1863641, 1794934, 1857749, 1874930, 1947313, 1934558, 1870332, 1860039, 1826778, 1916831, 1840328, 1714541, 1776850, 1806545, 1599331, 1543930, 1511951, 1503638, 1596888, 1492194, 1464653, 1449069, 1491004, 1403181, 1243921, 1339445, 1500233, 1358797, 1325976, 1274854, 1228267, 1227976, 1286198, 1455851, 1417962, 1330948, 1216996, 1119196, 964243, 904092, 906374, 945699, 905936, 978414, 968451, 919924, 873126, 697732, 712933, 767134, 871576, 835383, 659480, 775806, 829367, 820340, 889156, 844921, 760916, 665336, 586390, 634044, 594831, 516075, 464448, 349343, 280325, 318088, 261146, 233871, 213028, 293759, 445522, 382543, 396732]
11672C96732P0353M0813p4675l0167p0838L5456J31660j2610o5558J43895J69290
11661G34351L5883r9860j55370R9108L7518q1845J5955J88209J79789J42663r557
11650A086844R9538o5168j13140M5310j11958l6021k5891q4959q0577l6541J06776
11639G84213p8213o3468p1140o4811J62109J40340p7075j77828m3077j50786p914
11628C52350J49127j7637O6262K821M5770r4847M0032J49631K63008J24662m571
11617A076608j12243K2257r4379J02037q0082n9009L9992j16364j13788K64929
11607I29958L0360l5241k2053r1531n2436j4512j00139j69968Q5868M7442j24933
11596D82815l824M5906P1358n1231l1793N6078N4940m1303Q2196m7949j30690
$$ y = [396732, 467085, 507898, 433223, 403056, 332218, 367674, 499334, 486724, 421166, 565061, 734351, 770234, 670374, 515004, 614112, 651630, 569785, 585740, 773949, 953738, 1096401, 1086844, 1186382, 1121214, 1008074, 1053384, 941426, 905405, 879514, 794555, 713978, 677437, 784213, 706000, 642532, 571392, 506581, 668690, 809030, 731955, 554127, 511050, 360264, 352350, 501477, 483840, 550102, 552923, 598693, 503846, 543878, 693509, 956517, 1081179, 1076608, 964365, 986622, 892243, 994280, 914198, 855189, 895181, 778817, 665029, 929958, 960318, 925077, 903024, 811493, 759057, 744545, 644406, 474438, 560306, 607748, 482815, 478991, 524897, 596255, 545024, 513231, 569309, 624249, 582946, 665142, 617193, 486503]
11585D86503N770K5583J38231R1077R1247m4791R327L6211O9024o895p9027r4194
11573G28066j20622Q4719L2891m7520L4287m2831r3243J786n2522K5087m3958
11562E06140o2096P2010R7937L1230J2091k2654j83597j32019Q3267O4789l9101
11551D27997j7878Q2789J22748L2374p8916j46918q2287J9466J43798Q2024j47021
11540D38176m0103m4390O7169j7223R6917p5911j80787j98900K24800J49285M5547
11529D64580J52967l4232j31977j61282p3824j8037M2315K0984J37534m2441j9061
11518C37526M0133N9045J37113R4083k54329L7592J49577j02903k21366p0272
11508B06199L1315K2177P7755m3652p7299l6657k2594M2547J32949P394L0289
$$ y = [486503, 492273, 517856, 656087, 747164, 838411, 793620, 802947, 839158, 908182, 901287, 822260, 728066, 607444, 692163, 725054, 677534, 711821, 668990, 575747, 577533, 525011, 550098, 506140, 444044, 516054, 613991, 645221, 657312, 634658, 451061, 319042, 402309, 467098, 427997, 410119, 492908, 615656, 648030, 569114, 422196, 339909, 359375, 503173, 585197, 438176, 398073, 353683, 420852, 403629, 500546, 424635, 243848, 44948, 269748, 419033, 464580, 617547, 583315, 451338, 290056, 216232, 198195, 240510, 261494, 399028, 356587, 337526, 377659, 436704, 573817, 667900, 413571, 451163, 600740, 497837, 276471, 206199, 237514, 259691, 337446, 293794, 216495, 179838, 157244, 199791, 332740, 340134, 370423]
11497C70423J3212n8153l8871M8207Q8157j2972k772K4649q6567O9807N7543J031
11485D73694O5151J048L5237P8398L3595j4358J48812P2435p2611j66228j93725
11474D61448N7131L0580N4218J35010r7577p6149r2187P1141J9310m5454J04713
11463F22184J68230j851j16537r571J0130l6692K9221O2934J02274n4964k41218
11452E34140K3875J97539q2410j29455p0306l5656P6691N5116L573R52N0189J48045
11440G72293n183O6683Q0670l7068K7793K06936J08096J64952R1245J29118r6968
11429A508567j62781m8104r1309L1141m5743j46585k5544n5211q7917j27055j45654
11418F03805L3051J03742J6216k53907k6442K7210J04139J40235p2412o5433l4750
$$ y = [370423, 383635, 325482, 286611, 334818, 422975, 410003, 407231, 431880, 345313, 415120, 472663, 473694, 538845, 539893, 575130, 653528, 687123, 672765, 821577, 894012, 821401, 655173, 461448, 518579, 549159, 603377, 738387, 640810, 564661, 472474, 543615, 562925, 517471, 622184, 790414, 788563, 672026, 662455, 672585, 635893, 665114, 728048, 830322, 775358, 534140, 558015, 755554, 673144, 543689, 473383, 437727, 514418, 569534, 573107, 574059, 624248, 772293, 767110, 833793, 914463, 877395, 905188, 1112124, 1220220, 1385172, 1476417, 1605535, 1508567, 1345786, 1297682, 1206373, 1237514, 1191771, 1045186, 1019642, 964431, 876514, 749459, 603805, 636856, 740598, 756814, 502907, 476465, 503675, 607814, 748049, 675637, 610204, 575454]
11407E75454k641J03841o3882q6739J55245J41130M5029j04850j20016q003j7878
11396F16690p7558r7530K13723P4709j84136j79963R5329K01956J53398o7347
11386G49271j02878j05985r1140M9864p3349j1177M9768M5230M6915p2762j66263
11375C17494j16441J3206O4962K13779J05267n6020k74788q4039o3724l6903J50105
11364B32898L1490p8767j77618L0530J93087J02657j97344l4889K19319K4166
11354C45529q8187j64400p6793R5414O8309O0531j6645M2525k3116O3481k9499
11343B77149k14804k83535o5696K2066K26507J91740J86679k4943j56245l293
11333A55625K3675J7432P2479p0672j26679M3026J40129j86801J7300R0389M8831
$$ y = [575454, 572813, 676654, 612772, 526033, 681278, 822408, 867437, 762587, 642571, 634568, 616690, 539132, 441602, 655325, 730034, 545898, 365935, 461264, 663220, 816618, 749271, 646393, 540408, 449268, 499132, 425783, 414606, 464374, 509604, 556519, 483757, 317494, 201053, 214259, 279221, 493000, 598267, 542247, 267459, 183420, 119696, 82793, 232898, 264388, 185621, 8003, 38533, 231620, 334277, 136933, 102044, 321363, 345529, 257342, 92942, 16149, 111563, 179872, 240403, 223758, 266283, 243167, 306648, 277149, 62345, -221190, -286886, -264820, -38313, 153427, 340106, 315163, 158918, 155625, 179300, 196732, 269211, 198539, 71860, 114886, 255015, 68214, 85514, 175903, 224734]
11322B24734N2171j8773j07640R5067L936j06500k8095j85257j55920r1454l6476
11311c54207J06326J68666J33299L1584j05640j9585K095l3607J9127K0229k6735
11300e8448o716K22681J09857J9558l0192q0287j09801K7915K01710J82462k415
11289D76324k3119k32808r5563L3847K8887j08242k6486P5172J55084k0999J17501
11278C79598j76088j42163Q3537J92175L2977L688k0672j15458m7259l1655m5820
11267A12860Q6295j40250O5020K05112L6347l2722k60557n727m4840k216l3958
11256a4636k3950N8305J37261J7573q9621O0330K7185j05417p1505O3813Q5287
11245A44625Q1988J01071j10924r2754K8473j3113j09938j35364J1934K7624q6268
$$ y = [224734, 276905, 258132, 150492, 245559, 249495, 142995, 114900, -70357, -226277, -317731, -354207, -247881, -79215, 54084, 85668, -19972, -39557, -37462, -71069, -51942, -31713, -58448, -65164, 157517, 267374, 286932, 256740, 176453, 66652, 94567, 296277, 478739, 476324, 453205, 220397, 124834, 158681, 187568, 79326, 52840, 128012, 283096, 262097, 379598, 203510, 61347, 144884, 337059, 370036, 373724, 353052, 237594, 190335, 158680, 112860, 199155, 58905, 123925, 329037, 365384, 332662, 72105, 66378, 21538, 19322, -14636, -38586, 19719, 156980, 174553, 84932, 145262, 172447, 67030, -4475, 59338, 144625, 226613, 327684, 216760, 124006, 152479, 139366, 29428, -105936, -94002, -66378, -152646]
11234a52646o4417M9159J96831m7984q1513j75628m0843L14808R5150O9250l6758
11223A25409o6183P8107n7841l9952m3790J71687Q9575n3027n7061k80j50358
11212c714l2872j19972o0692J14295Q9066j10764J67471J37461j51701j51892
11202a23314j02529j06238J19671O1705N2726j06649m9566K08757J56180O2450
11192A73193l8428Q0676m4169r8254k14044j01972Q9746L7395j2644Q7328L2094
11181i079r832Q4838l6921j17343m5241q4397j066L1852j47942M9254n83r1454
11169c77914J90609J11175j99096Q469J19358Q9946j0895Q9036J39416J17503
11159B77607j86372j37963N9654R7650M1162M6241j07045j98374R8223J36048
$$ y = [-152646, -217063, -167904, 28927, -19057, -100570, -276198, -317041, -2233, 92917, 162167, 125409, 59226, 137333, 79492, 39540, -4250, 167437, 257012, 203985, 146924, 146644, -3714, -36586, -156558, -217250, -102955, -13889, -124653, 42818, 180279, 28578, -123314, -225843, -332081, -212410, -150705, -97979, -204628, -254194, -45437, 110743, 173193, 134765, 215441, 171272, 73018, -141026, -242998, -153252, -115857, -128501, -41173, -9079, -18911, 65927, 29006, -88337, -133578, -217975, -219041, -187189, -335131, -285877, -286460, -377914, -187305, -76130, -275226, -266757, -147399, -57453, -68348, 20688, 160104, 277607, 91235, -46728, 12926, 110576, 151738, 197979, 90934, -107440, -9217, 126831]
11149A26831l4136j22603m0367j6751n338Q8311L353m4851R7965J22110N856n4442
11137A25938J04234L8328n0350j02664m1059k29597p9371L7909K0930K89468K0228
11126A33994J8845j23237k07641m6943J09110K4679o6249o9827J8421J38603J37330
11115F7085Q2370k2329k99814m7186J54975M9749j9860p7115J17636o85p33o5497
11103f1404p3605P1925O2150J7986q328l4394K2951J34831k8601p9293Q3531P4413
11091A82162O5882k62172j01758q307M0305J14560k2889p8183L9352j887J09223
11080G6288k2538Q120M2739O5091J24859J31710q2991l4465L1458l8938n4221
11069B47112k2746j26068j20463N7385l9584K4671j5022q0889K4360O5057l8825
$$ y = [126831, 92695, -29908, -70275, -87026, -92364, -4053, -700, -45551, 52414, 174524, 180380, 125938, 230172, 268500, 218150, 115486, 74427, -155170, -234541, -196632, -175702, 113766, 133994, 152839, 29602, -178039, -224982, -115872, -91193, -157442, -227269, -208848, -70245, 67085, 149455, 127126, -172688, -219874, -64899, -15150, -35010, -112125, 5511, 4826, 4093, -61404, -135009, -63084, -934, 17052, 8724, -25670, -2719, 132112, 103511, 24218, 107749, 182162, 248044, -14128, -115886, -124193, -83888, 30672, 7783, -70400, -31048, -32935, 76288, 53750, 61870, 104609, 169700, 294559, 426269, 343278, 308813, 340271, 301333, 247112, 224366, 98298, -22165, 35220, -4364, 20307, 5285, -75604, -51244, 13813, -25012]
11058b5012o5148L7442l8178N3495P5610M4104l2346L3566O8684l7680J4418J42359
11046B71314M0846o9979r7249J02701N1949o1982K4666m7614K5783K16842J80768
11035F38045O1842j20871k2954J15520R9149j5839k2155p3068j31880M3857J01641
11024F73287K04457J57879N048M22J11987n4174n7281l4105M8538j19652j8856
11013I17550r1285k23398p7219P1688J92623J07494p7451p0194k15876o5587J3861
11002D82206J42785j37969k0913j01053j71306m5003K12324k5899j00123j00306
10992A34743J0035j92625l9054J61734Q1432o8705j17761k2922k2534J32245q6543
10981b9955l1160M5099P9027o8258m9005M1767j8157J01718J83396k6703k15294
$$ y = [-25012, -90160, -52718, -90896, -37401, 38209, 82313, 49967, 83533, 152217, 114537, 128955, 271314, 312160, 242181, 144932, 247633, 299582, 237600, 262266, 214652, 240435, 457277, 638045, 699887, 579016, 556062, 671582, 770731, 754892, 732737, 659669, 527789, 571646, 673287, 877744, 1035623, 1040671, 1041093, 1153080, 1098906, 1041625, 1007520, 1056058, 936406, 917550, 826265, 602867, 525648, 597336, 789959, 897453, 820002, 749808, 533932, 468345, 482206, 624991, 487022, 466109, 365056, 193750, 148747, 361071, 335172, 235049, 134743, 144778, -47847, -86901, 74833, 156265, 87560, -30201, -53123, -75657, 56588, -29955, -61115, -16016, 63011, -5247, -54252, -12485, -30642, 71076, 254472, 227769, 12475]
10970A2475n1899L571r5056J03606J58903J55534j06869q1319P45j9726j92492
10959a12527j32861J55561J92706R5004n7501Q3000J06374q7310p2227q5856r0195
10948e832O6939L5371k2071j08717K1720j37694J2906L7546Q5577j8597o813m1460
10936h1125l7374j12291p4766J47312K62691J30839j66665m2722J6371j23196
10926h0926p1058q7601L9385j2094J58697J14602N2594R7309j34671l2963r7849
10915e4575p9453l1101j6103K05506Q3414j27570P760J8119K3403J24500O3851
10904B17751m863J93946j09450j85216n2178R0089J41908J65233J33233k43233
10894C47220m3657L0738J16306r9156n9734l1902J1827J43599n6158p5192L4011
$$ y = [12475, -39424, -35853, -130909, -27303, 131600, 287134, 180265, 98946, 99691, 79965, -112527, -245388, -89827, 102879, 197883, 140382, 223382, 329756, 242446, 170219, 84363, -5832, 61107, 96478, 74407, -34310, -12590, -150284, -137378, -99832, -14255, -32852, -39665, -81125, -118499, -230790, -305556, -158244, 104447, 235286, 68621, 25899, 42270, -80926, -151984, -239585, -200200, -212294, -53597, 61005, 113599, 210908, 76237, 43274, -54575, -134028, -165129, -181232, 24274, 107688, -19882, -12122, 5997, 29400, 153900, 217751, 212888, 406834, 297384, 112168, 59990, 150079, 291987, 457220, 590453, 347220, 303563, 334301, 450607, 351451, 291717, 259815, 271642, 415241, 359083, 283891, 317902]
10883C17902k2518J40395O7217L7137j68644j36650K05001J52186m0286k51885
10873B99855k61279l0176J08414J05820o1497l4637J33253P7405j060J2953j83639
10862A65412Q4915K04431J09492K3884j010k29868j12726J5116R0362R0536L7347
10851D77891k861l2098k47183j56217J14821J63128k3277l2011Q7201J87865m4105
10840D93154r8913j27760j07939m1311J4142J15465n0556k7708Q687R8388N8335
10829C33984P7003m0478r1509r2413k09064j14445J23969p2738K28372J75926
10819C18607r5644O900j61908r9647P4082L6184l5527P5694n4855j08590P7792
10808C3088J20235J28088L6201j0387O9014j9005K217M7105J05727P413L0459
$$ y = [317902, 295384, 435779, 502996, 540133, 371489, 234839, 439840, 592026, 551740, 299855, 38576, 8400, 116814, 222634, 161137, 126500, 259753, 337158, 336098, 349051, 165412, 250327, 454758, 564250, 588134, 587124, 357256, 244530, 259646, 350008, 440544, 477891, 475030, 442932, 195749, 39532, 154353, 317481, 294204, 262193, 349394, 537259, 493154, 394241, 266481, 158542, 117231, 131373, 246838, 196282, 168574, 177261, 275649, 333984, 410987, 370509, 279000, 186587, -22477, -136922, -12953, -85691, 142681, 318607, 222963, 229863, 67955, -31692, 42390, 78574, 43047, 118741, 63886, -44704, 33088, 153323, 281411, 317612, 307225, 376239, 357234, 359451, 406556, 512283, 519696, 550155]
10797E50155j5065n2121l7732k71442j28475N6076K585R183m6035L2016K3538
10786A22683j77060o9384J29004J51486Q5749M1453O078j57165k2920M689j76589
10775f1976n9327R1390J41394Q7515p2642j9146N1345J15663L4490j91004j10659
10764G043K4872j45560N1364J04674P9473O5453p4100K7186O2801l5419N3068
10753B20855N6251j94221j78450K97761K11990j78342r2511O5637L3516Q9487
10743C31973K0784j05796k3471j301m3641j03300p439n0350n9499N0432n8848
10732e0456J60212J26446m6894J43664J56641L4820L7639j9743k07650k33692
10722A00987j6982P3250K026q8009L4334J57786R9892M7520M5015q3827k10963
$$ y = [550155, 535090, 482969, 445237, 173795, 45320, 101396, 103981, 113164, 67129, 99145, 122683, -54377, -123761, 5243, 156729, 242478, 283931, 290009, 132844, 109924, 114613, -61976, -121303, -29913, 111481, 198996, 126354, 107208, 158553, 274216, 308706, 117702, 7043, 31915, -113645, -62281, 42393, 121866, 187319, 113219, 140405, 203206, 167787, 220855, 277106, 82885, -95565, 202196, 414186, 235844, 143333, 208970, 242486, 331973, 352757, 246961, 223490, 222189, 178548, 75248, 67809, 17459, -42040, 8392, -50456, 109756, 236202, 189308, 332972, 489613, 524433, 562072, 542329, 334679, 100987, 84005, 157255, 159281, 71272, 105606, 263392, 363284, 410804, 455819, 371992, 161029]
10711A61029j20807o641j2879J08298P4265o2036j24468n8922J9678l4163J0808
10700d5838p1812L1169K18724J60527O6590k2750j02811m3307n4472N3296M7028
10689B36344J2594o0555j18551J64210j3109p1000j10909n1626M6249J34155N6504
10678B24306K1657J4751o2331n673J45584j3686q0141J33327J66283M8092m0377
10667E51792k18799k6506J14259k3077O0704J11640N9453r9856o0252J2687J30947
10656F12992J40512O7570k49k4811k2465J46476J50203j6878M3436J38753l2150
10645A203389j52490j83266l5694J69293J31531N2626K81233K25241J99986J59155
10635B051004O9094J56541L11036L13426M70558K27073L10594N15294L77158O99331
$$ y = [161029, 40222, 33581, 20702, 129000, 203265, 141229, 16761, -42161, -22483, -56646, -45838, -117650, -86481, 132243, 292770, 359360, 336610, 233799, 190492, 136020, 189316, 236344, 248938, 188383, 69832, 234042, 220933, 149933, 39024, -12602, 33647, 167802, 224306, 245963, 260714, 198383, 192710, 338294, 324608, 244467, 377794, 544077, 592169, 551792, 332993, 306487, 420746, 397669, 458373, 570013, 629466, 529610, 469358, 482045, 612992, 753504, 821074, 820825, 796014, 773549, 920025, 1070228, 1053350, 1096786, 1235539, 1203389, 1050899, 867633, 831939, 1001232, 1132763, 1185389, 1466622, 1691863, 1891849, 2051004, 2120098, 2276639, 2587675, 2901101, 3371659, 3598732, 3909326, 4424620, 4801778, 5501109]
10625E501109N38716P00807J173921J807444K342298L013842L855705N389376
10617B4323218P126136Q687943R412236Q274445N796818K467598m49912j683147
10609F3955335q75669J188126M291572Q174239J2793040J6905120J8277121J5147778
10601A39856662P916639m85974o797156r487961p936514l484403K800687R692173
10593A32074153J6203081K1252204K1900508J5642646L960405q108166j6970443
10586A85954388k0460720j8048967j1939444n143586J033304O318360J0151003
10579A47864338R901187M986355l165710j0966829j6118708j7405492j5074120
10572A00021021j0783119o404596k740829J35636J504445R59244j369169m639211
$$ y = [5501109, 6039825, 6740632, 7914553, 9721997, 12064295, 15078137, 18933842, 24323218, 31449354, 40137297, 49549533, 57823978, 63620796, 66088394, 65638482, 63955335, 63079666, 64267792, 68559364, 76733603, 89526643, 106431763, 124708884, 139856662, 147773301, 147287327, 140490171, 131002210, 123065696, 119581293, 122381980, 132074153, 148277234, 169529438, 191429946, 207072592, 211032997, 202924831, 185954388, 165493668, 147444701, 135505257, 130361671, 131394975, 137713335, 147864338, 157765525, 162751880, 159586170, 148619341, 132500633, 115095141, 100021021, 89237902, 82833306, 80092477, 80228113, 81732558, 82691802, 81322633, 76683422]
10564G6683422p461621r372424r614216q439981o970662n360505m097001l236442
10556B2130570k828121k532568j949542j620348j590135j416458j148160r30427
10548H114811q51338r81982n93374m83901m11944m64013l52307l30038k23298
10539C422616j27300j93839l68443l89215l03802K1645N5076j74785j76558J803
10529A767198j29502j20403r6350n9290j97450j44780J80414N6820J39799j74746
10519A221710k81458m9971J27581j28805M5262j8260m6571J8277M4197Q2646o2785
10508I51823k2168l1901Q3558j98043j6569J8319k8357p9936j06810j04256p1445
10497C94215P4971M5262O3146K0145o0837q1830o9430r7873P6574P7237J1661
$$ y = [76683422, 69221801, 59849377, 50235161, 41795180, 34824518, 29464013, 25367012, 22130570, 19302449, 16769881, 14820339, 13199991, 11609856, 10193398, 9045238, 8114811, 7263473, 6281491, 5688117, 5204216, 4792272, 4328259, 3975952, 3645914, 3422616, 3295316, 3101477, 2733034, 2343819, 2040017, 2061662, 2116738, 1941953, 1765395, 1767198, 1637696, 1517293, 1420943, 1361653, 1164203, 1019423, 1199837, 1256657, 1396456, 1221710, 940252, 890281, 1017862, 889057, 934319, 916059, 869488, 887765, 931962, 1014608, 951823, 929655, 897754, 981312, 783269, 766700, 785019, 756662, 676726, 569916, 465660, 394215, 469186, 514448, 577594, 597739, 536902, 455072, 385642, 287769, 364343, 441580, 453241]
10486D53241n1741p2541M7984l8431n1528r6717Q0637J5882N6674Q1353L53j88037
10474B37129O3483M8848o8926p7221P2288j0196k13981K15354J32135q4488Q4820
10463C99245K6566J58628j07715j71865q3786R111q6976L295N6457J64880K2064
10452C89904J01073r263J53408P6539o2933n5641j17218j76737k9733K36999P046
10441E13444r4371O9337l549L8143l0954p2110j07055L5099L1917R2437j86237
10430B86101p6268j10629j11873J01782K9233j9442k941K2262q0367j24806N2848
10419c4100J23518J62285P1825J46144n1499j97137J5951J10262N2292j28293
10409B71248j24149j6020K1114j48464m7921K18491J19894j19209L8916J15258
$$ y = [453241, 401500, 328959, 376943, 338512, 286984, 190267, 270904, 286786, 343460, 424813, 425166, 237129, 300612, 349460, 280534, 203313, 275601, 265405, 51424, 266778, 398913, 314425, 399245, 425811, 584439, 476724, 304859, 221073, 230184, 143208, 146503, 202960, 367840, 389904, 490977, 481714, 635122, 711661, 648728, 593087, 475869, 299132, 269399, 506398, 513444, 419073, 488410, 484861, 523004, 492050, 419940, 312885, 347984, 379901, 472338, 286101, 209833, 99204, -12669, 89113, 118346, 98904, 95963, 118225, 37858, -86948, -34100, 89418, 251703, 323528, 469672, 418173, 221036, 236987, 347249, 399541, 271248, 147099, 131079, 152193, 3729, -44192, 174299, 294193, 174984, 213900, 329158]
10399C29158m8034j88631m5399K8518j95716R4215J31629n015j5948L3091J50311
10388B68179k03504j98857J01032L6130j10744o6159J13742j69586j9523M7420
10378b01870J25176J6450j71073L6088J22258J44901J00022l9653m6386l1939
10368E3974L8158Q8222o1463p8088j78920Q6345M8148Q5591J81L0862J37011j03794
10356A46227k10516P0941J10482O3201M067j59000j00717L7896J10563k8069r3885
10345d8810n828J46637M8459N8986M3909j99758p1752j2734j9482N143l833m0276
10333i9339o3001N454M0896Q2646Q1841r62J3762N0649K8991r3964p3715k23002
10321b49744k2043O12K0806J05672J34525m3665j1148R5893Q8325m8017J52660
$$ y = [329158, 281124, 92493, 47094, 75612, -120104, -25889, 105740, 100725, 84777, 117868, 268179, 64675, -134182, -33150, 2980, -107764, -173923, -60181, -229767, -249290, -201870, -76694, -60244, -231317, -195229, -72971, 71930, 171952, 132299, 85913, 53974, 92132, 180354, 118891, 40803, -138117, -51772, -3624, 81967, 82148, 113010, 250021, 146227, -64289, 6652, 117134, 180335, 184402, 25402, -75315, -37419, 73144, 45075, -48810, -54638, 91999, 140458, 199444, 243353, 43595, -28157, -40891, -60373, -55230, -59063, -99339, -162340, -156886, -115990, -33344, 48497, 47535, 61297, 111946, 140937, 46973, -26742, -249744, -271787, -271175, -250369, -144697, -10172, -53837, -64985, 30908, 119233, 71216, 223876]
10310B23876K2970j21674j05175j42771o6150J1864J8956r72J0970l1962j37632
10299c17700p559J23876j59748J30572J70996Q0891J7485j3341J30308l3977j5187
10288A06616j49384j68116K7006J821j26142j10082Q2439J4146J36228J01328
10278h4140J56703P5347j71969j74726k2884P1830J99198N4994Q5332J22402j08812
10267B03275j8937Q1802Q4984O7538J6792O0856j4358j20342l4537J10487r7277
10256C40283j44641R6390j14846q5430n5390J2712L6624k00716k0033K2484o045
10245a18608J75112k7643m7449n1490l2044J57721J37982O2619O6583j00001r9795
10234A22987k6291O7700k1322n1551k947J89340J56058j33503q1348n239p6218
$$ y = [223876, 246846, 125172, 19997, -122774, -188924, -177060, -158104, -159076, -148106, -180068, -317700, -325259, -201383, -361131, -230559, -59563, 21328, 38813, 25472, 155780, 121803, 106616, -42768, -210884, -183878, -182057, -308199, -418281, -335842, -321696, -185468, -84140, 72563, 147910, -24059, -198785, -221669, -149839, 49359, 104353, 189685, 312087, 203275, 184338, 266140, 351124, 418662, 435454, 496310, 481952, 361610, 327073, 437560, 340283, 195642, 292032, 177186, 91756, 36366, 49078, 85702, -115014, -135047, -112563, -118608, 56504, 28861, -18588, -70078, -102122, 55599, 193581, 256200, 322783, 222782, 122987, 96696, 164396, 143074, 91523, 88576, 277916, 433974, 300471, 219123, 213884, 137666]
10223A37666R8126J58825m8831j2626q6225j80493J22002q153k9135j26001P6213
10212A01368k4130P8088J19609j10059n9494Q6064N1483M9773J2136Q0656o5789
10201C19705J9988m7192o2916j7244j39697j8306J81572k8276j59693l8393K4467
10190C4015J55879Q8745j75340P4885Q6337J43164j25095j13938R3885l4664Q325
10179B36198J429R5040J15278O7383j6273K5366J27203j9545j39261r4847O8703
10168D66674J00472Q7718N7292N7585P3015J39744j24620j99508q5020R3989P1077
10157G38418J11659J27612J59477K38208m2967L7878j80968j95004k44060j62820
10147E87433p9207R8400Q1663R6497K2952O5991J08104J92626n5075k93759l39445
$$ y = [137666, 235792, 394617, 345786, 333160, 246935, 66442, 188444, 180291, 151156, 25155, 101368, 77238, 155326, 274935, 164876, 105382, 191446, 242929, 292702, 304838, 385494, 319705, 339693, 292501, 229585, 212341, 72644, 54338, 235910, 207634, 47941, 9548, 34015, 189894, 278639, 103299, 178184, 264521, 407685, 282590, 168652, 262537, 227873, 236198, 237627, 332667, 447945, 515328, 499055, 524421, 651624, 632079, 492818, 397971, 466674, 567146, 654864, 712156, 769741, 842756, 982500, 857880, 658372, 573352, 667341, 738418, 850077, 977689, 1137166, 1375374, 1332407, 1370285, 1189317, 994313, 750253, 587433, 508226, 606626, 688289, 784786, 807738, 873729, 981833, 1174459, 1119384, 825625, 486180]
10136D86180j22542J33572j43124j4133L5442N7887J98809n8444r2833k73905
10126B06909j10556R6222J87745O3389j93239j13579R0406L9095P6884j08204
10116B35072L7607l0830k47378j48135J66712P1811P2616j7729k3566l2300N7865
10105A41745M0617l1597j23624n7260L7135J54772o5598O5854O5592j86448Q0212
10094A21400J01287m3585P8347J20350q8729K0961m1823n1318l305k9095j25436
10083E9054j06514J9162J77388L4929J0458K331Q6857J41087N1324K0139p6002
10072D20213j47632M2992N7461p3853r4859m7000l9114M0459l7908j60800J3268
10061b6773J94364N4448J4138o1780o1243j0893L6587j09312o4805J22053J14731
$$ y = [486180, 363638, 497210, 354086, 339953, 375395, 433282, 632091, 573647, 480814, 206909, 96353, 192575, 380320, 443709, 250470, 136891, 227297, 266392, 343276, 235072, 272679, 241849, -5529, -153664, 13048, 84859, 157475, 139746, 116180, 83880, 141745, 182362, 150765, 27141, -30119, 7016, 161788, 96190, 162044, 227636, 41188, 121400, 222687, 179102, 257449, 377799, 289070, 310031, 268208, 216890, 213585, 184490, 59054, -47460, -28298, 149090, 184019, 194477, 196808, 283665, 424752, 476076, 496215, 420213, 272581, 315573, 373034, 299181, 204322, 157322, 118208, 158667, 120759, -40041, -26773, 167591, 222039, 236177, 174397, 113154, 102261, 138848, 29536, -35269, 86784, 201515]
10050B01515J707j6821J999J00631k4131R0254J42466p8790j8182M6250R0594
10039E37492j39906j24101J9857J19407j6879J6088k1862q0931J00149J34557
10029E43871J31378r5451J1236n7420j05738k4549n219r6818l3164Q7471m8888
10018C06709r8520M7741p2482K6213J69478j21256j72794J00220o7256k0855J75162
10007B72360J08845J38900r7369j00430M8817n3427N1901J04799n6728n0594J51190
9996E18264Q2543p8287J6500J48878K0747J06401J46051O3012J07216m9227r7783
9985I84315K0707K5025R5947k19064k12481k02852j17350P9644n6678L8898M3128
9974D79239n9655n5955m8431J01766m2145k9529k8077K7234J5201n4225r8725
$$ y = [201515, 203222, 186401, 188400, 289031, 264900, 355154, 497620, 418830, 400648, 446898, 537492, 397586, 273485, 293342, 412749, 395870, 411958, 390096, 309165, 409314, 543871, 675249, 579798, 591034, 533614, 427876, 403327, 398108, 301290, 268126, 355597, 306709, 208189, 255930, 183448, 209661, 379139, 257883, 85089, 185309, 118053, 97198, 272360, 381205, 520105, 422736, 322306, 371123, 317696, 369597, 474396, 417668, 367074, 518264, 600807, 522520, 539020, 687898, 708645, 815046, 961097, 1024109, 1131325, 1082098, 984315, 1005022, 1030047, 1125994, 906930, 694449, 491597, 374247, 453891, 397213, 436111, 479239, 419584, 363629, 315198, 416964, 374819, 345290, 317213, 344447, 359648, 305423, 206698]
9963B06698j65346l4951J31320P3596o8332l7965k6763J04886J75296J46524m9797
9952D55166j63955M138Q3450J6503j12962M0686J08648P8122p5482j366l4954
9941C97994q4133J63171J13867n6369j65888j9064j17230j49870l2757j0284J00984
9930A40421J27240K10158o697k21910k38757r9303P3771m4785n5456o268j9550
9919a41136o022L7319J8018K76324N5252l0918r7634j25241J6058N4497R7373
9908A53890J35452P296j90446n1834o34K32876L9414j59387j88954j22893J14165
9897c1055O032k03464J9435P7173O0531P4051L6702J75010J49778q9755l0789
9886B43649o9402J16605J97197L2372N3584j70354n5790j04909l5686L4765J6803
$$ y = [206698, 41352, 6401, 137721, 211317, 142985, 105020, 78257, 183143, 358439, 504963, 455166, 291211, 295349, 378799, 395302, 282340, 323026, 431674, 509796, 434314, 432948, 397994, 313861, 477032, 590899, 534530, 368642, 349578, 232348, 82478, 49721, 39437, 140421, 267661, 477819, 471122, 249212, 10455, -88848, -15077, -59862, -115318, -121586, -141136, -147158, -109839, -91821, 184503, 239755, 208837, 111203, -14038, 2020, 56517, 153890, 289342, 296638, 106192, 54358, 53724, 286600, 326014, 166627, -22327, -145220, -31055, -25023, -228487, -209052, -131879, -71348, 2703, 39405, 214415, 364193, 274438, 243649, 174247, 290852, 488049, 520421, 574005, 403651, 347861, 242952, 207266, 242031, 258834]
9875B58834L5980M513J3188J33418J1042J36025M9644j46825k50336j68438K1078
9864I8123J26226J96293J02225j49957o9994k04154q3971K22993J37520j63040
9854B12264J07126J31225Q049L4585M864k3440q937L4978j34683j00378l0129
9843B35524M3294l731o0369P9272O4480j8381j92632o0223J14217J09450J06072
9832D16973L4173j16179L1831O2287Q2567L47001r9707j46338j8142n0627l6394
9821E07445j48186J61370N7175k2414J05640J1638r2205j7003j33094L8071l5411
9810D33026j29638O9717Q1992q4456K6635j1336M7686j38673L1084J21779K7601
9799D75417n471n2752n5801O6317q1027j03966L7136m2287j67053Q1828Q7490
$$ y = [258834, 294814, 299327, 312515, 445933, 456975, 593000, 642644, 495819, 245483, 77045, 98123, 224349, 420642, 522867, 372910, 302916, 98762, 14791, 237784, 375304, 212264, 319390, 450615, 458664, 493249, 498113, 474673, 465736, 500714, 366031, 265653, 235524, 278818, 275087, 214718, 293990, 358470, 340089, 147457, 87234, 201451, 310901, 416973, 451146, 334967, 366798, 429085, 511652, 858653, 758946, 612608, 594466, 543839, 507445, 359259, 520629, 577804, 555390, 661030, 672668, 580463, 563460, 430366, 468437, 433026, 303388, 373105, 455097, 370641, 397276, 385940, 433626, 294953, 326037, 447816, 475417, 469946, 417194, 361393, 427710, 346683, 242717, 279853, 237566, 70513, 152341, 239831]
9788B39831J54710O3887R2664m4019j00610R9561M5236q425m2107j25001o8831
9777C06896J99303K9695m466j65742o9927J04720J2708m4429N3932q6622q0382
9766B55686k4813n2110J47117J55333n3846j44892q0155L7406O0998j5224m5701
9755B39799o20o6833O7510J24907O1366p8020R3925Q4096Q2558j6533j24256J0953
9743D78852J29993J40598N1273L2870k2730K3941j32558j76311l9263m0322o8196
9732C78147j6322J25179J14761R7199J26574j27474j02589k2709O1548l2934L7235
9721F38615R7103M3579J4644p6132J49393N8869J43140m0694J45176J55367n3074
9710A275986p4986j8459P6332K0812j08820O495O6825j20094j19955K37929k8285
$$ y = [239831, 394541, 458428, 551092, 507073, 406463, 506024, 551260, 542835, 500728, 375727, 306896, 506199, 535894, 531428, 365686, 295759, 400479, 413187, 368758, 422690, 336068, 255686, 230873, 178763, 325880, 481213, 427367, 282475, 202320, 239726, 300724, 285500, 239799, 239179, 172346, 239856, 364763, 426129, 348109, 442034, 526130, 608688, 592155, 467899, 478852, 608845, 749443, 800716, 833586, 810856, 834797, 702239, 525928, 486665, 446343, 378147, 361825, 487004, 601765, 698964, 825538, 698064, 595475, 572766, 634314, 601380, 638615, 735718, 779297, 793941, 717809, 867202, 926071, 1069211, 1028517, 1173693, 1329060, 1275986, 1201000, 1182541, 1258873, 1279685, 1170865, 1177360, 1244185, 1124091, 1004136, 1242065, 1213780]
9699A213780J21013J75453J79053M7360j43469M1171P5789M3535J71981K11351
9689B137017J29717O9411J12950L61618J91894K24235K09750K04174Q7724J55001
9679C883491K47844o2938k0391K1564L09503J13882N3815J96365K926o3733q1208
9668D601120L09K20504K29971J38286O6914J32240K69782L73285K42677L38629
9658F613717N21412N93274N29932N48573K21515L34762L93288J74273m3480r5105
9648I792161J20139P865j5400N6966j91662l5522J42468M7697j34935N8060L80023
9637A0227860M71927M65606P07282O16011N06534P82342Q95430J257262J627453
9628A7557707J890838K189872K539998L046998L675647M386224N440640O317406
$$ y = [1213780, 1334793, 1510246, 1689299, 1736659, 1593190, 1634361, 1710150, 1753685, 1925666, 2137017, 2266734, 2336145, 2449095, 2810713, 3002607, 3226842, 3436592, 3640766, 3728490, 3883491, 4131335, 4068397, 4048006, 4069570, 4379073, 4492955, 4546770, 4743135, 4746061, 4682328, 4601120, 4601429, 4821933, 5051904, 5190190, 5257104, 5389344, 5659126, 6032411, 6275088, 6613717, 7135129, 7728403, 8258335, 8806908, 9028423, 9363185, 9756473, 9930746, 9887266, 9792161, 9912300, 9920165, 9904765, 9961731, 9770069, 9734547, 9877015, 9924712, 9789777, 9847837, 10227860, 10699787, 11165393, 11872675, 12488686, 12995220, 13777562, 14672992, 15930254, 17557707, 19448545, 21638417, 24178415, 27225413, 30901060, 35287284, 40727924, 47045330]
9620D7045330P349612P867302Q200565P977499O768785M807376K639329q3948
9612I2571850k132575l748174m525780m379908l654155k481932j566496n27058
9604F9555772N81605J638380K684085L698820M291316M853589N185940M870021
9596I7359528M443076L995531L337819K493967J806129J176220L37376m41941
9588A14507705j119609j477502j262499o69291J73520J647543L565431N939812
9580A21305110Q865319J2441099J6305504K0192823K3162208K3904712K0748312
9573B46925087J3075594K490934p789850j5847081k0152757k0619414j8799017
9566A79283496j5593522j2423707r849613p456317n265262l789297k248320q97513
$$ y = [47045330, 54394942, 62262244, 70462809, 78440308, 85209093, 90016469, 92655798, 92571850, 90439275, 86691101, 82165321, 77785413, 74131258, 71649326, 70082830, 69555772, 70137377, 71775757, 74459842, 78158662, 82449978, 87303567, 92489507, 97359528, 101802604, 105798135, 109135954, 111629921, 113436050, 114612270, 114949646, 114507705, 113388096, 111910594, 110648095, 109978804, 110152324, 111799867, 115365298, 121305110, 130170429, 142611528, 158917032, 179109855, 202272063, 226176775, 246925087, 260000681, 262491615, 254701765, 238854684, 218701927, 198082513, 179283496, 163689974, 151266267, 141416654, 133960337, 128695075, 124905778, 122657458, 121759945]
9558A21759945j91911K48630M03510J99389k43455q74024j594245k217050k852980
9549A14637809l738002m559316n148419n351486n517837n284826m877817l874689
9541G6285417k918226j824159p07205N33156J551135K698577L634472M011356
9533H3264523M148412L473266J855813l33321k549667m526449n948666p052783
9525G2331128p117771o575546n950320n203448m788712m387509l723217l255447
9517C1329158k810045k336081k259853j959447j761402j432974j295598r68717
9509A6505041j084413q94290p19206n76881o28143n49871m51092k74591j54951
9500A1171603r473l8727j47842j6271j14172j48986p7814j65147k97640l50495
$$ y = [121759945, 121568034, 121816664, 122220174, 122419563, 122176108, 121302084, 119707839, 117490789, 114637809, 110899807, 106340491, 101192072, 95840586, 90322749, 85037923, 80160106, 76285417, 73367191, 71543032, 70835827, 71368983, 72920118, 75618695, 79253167, 83264523, 87412935, 90886201, 92742014, 92408693, 89859026, 85332577, 79383911, 72331128, 65213357, 58637811, 52687491, 47484043, 42695331, 38307822, 34584605, 31329158, 28519113, 26183032, 23923179, 21963732, 20202330, 18769356, 17473758, 16505041, 15420628, 14526338, 13807132, 13230251, 12602108, 12052237, 11601145, 11326554, 11171603, 11162130, 11123403, 10975561, 10959290, 10845118, 10696132, 10618318, 10453171, 10155531, 9805036]
9490I805036l16770l03621o04986n95327m40609m94785l38704l34826k24294k19268
9480E931846k03455j60123k01984j01978K3311O5138j1575j33099k39360k55730
9470D712991j61242L0684P6050k148O723k51531k50343j54237j21997J04334j81426
9459C807858l79718j61002k7300j27288k63149j63118j63791q636o9989j54401
9449B289466j12502q3340N1427n3273r8896q005j67898j20091n7699J9953k688
9438A656454M4623n7536j17745j06254n0597k35942m983Q8106j33338K5879O9056
9427A177723J4732r6163j72253n6423O0302M2109q3876O6155K3058R2603m1475
9416A026492j44697k1454K6452q0114O271M4813n7385M4617R6421q2959p6799
$$ y = [9805036, 9488266, 9184645, 8579659, 7984332, 7543723, 7048938, 6710234, 6375408, 6151114, 5931846, 5728391, 5568268, 5366284, 5264306, 5287617, 5352755, 5341180, 5208081, 4968721, 4712991, 4551749, 4582433, 4658483, 4656335, 4663058, 4411527, 4161184, 4006947, 3884950, 3989284, 3807858, 3428140, 3267138, 3239838, 3112550, 2849401, 2686283, 2522492, 2513856, 2443867, 2289466, 2176964, 2093624, 2145051, 2091778, 1992882, 1984877, 1816979, 1696888, 1639189, 1659142, 1656454, 1701077, 1643541, 1525796, 1419542, 1368945, 1133003, 1128020, 1216126, 1082788, 1108667, 1177723, 1192455, 1096292, 924039, 867616, 927918, 970027, 886151, 952306, 975364, 1067967, 1026492, 881795, 860341, 886793, 806679, 812950, 857763, 800378, 844995, 941416, 858457, 781658]
9405G81658m5700Q7468o8607m2793M020J28318K43946j03127j36655j09265n3853
9394F85410K07901K26376p2270m2677r4893m9198O4137r0980l9896p3822P1595
9383G91683N9214j43997k39462j6182J2047Q1553o5373q7681n1978R9338j01720
9372C37442q0941q414j04821J13601M3499j9650j212m2947Q4856J89279R603k9344
9360D90951j12534j01468L8147R8245P0718L5764l916o7040j44241j00105o0563
9349A43958r8015o2713J16003J55631n9632J11366j6944l4577J7700J20674j57216
9338B36235j34431k7544P8971N879p1128j8915J04390K15617o7885J8436m7926
9327B91699k1771k2472j11612L8709N6458L4970j8982J0411J97828J48431j67826
$$ y = [781658, 735958, 823426, 754819, 712026, 716046, 844364, 1088310, 985183, 848528, 739263, 685410, 893311, 1119687, 1047417, 1004740, 909847, 860649, 924786, 833806, 793910, 720088, 791683, 850897, 706900, 467438, 451256, 463303, 544856, 479483, 391802, 339824, 439162, 337442, 256501, 248087, 143266, 256867, 300366, 280716, 279504, 236557, 321413, 510692, 520295, 490951, 378417, 276949, 315096, 413341, 484059, 519823, 515907, 448867, 304626, 204521, 143958, 45943, -16770, 99233, 254864, 195232, 306598, 289654, 255077, 272777, 393451, 236235, 101804, 74260, 153231, 159110, 87982, 69067, 173457, 389074, 321189, 339625, 291699, 269928, 247456, 135844, 174553, 231011, 265981, 246999, 257410, 455238, 603669, 435843]
9316D35843p2246j36497l7839N1242N677L1022j04771j35529O313j56764j22692
9305b36241J96638K68988K5002k7410j41124j65647N063n374J18320J66373N6543
9294B61131j47417j24609J71963J06091N0381R329j44003l2353l9427R1867J30298
9283C33251r4126n8649O916j25239O1031J11496r538p0884N4335j60422m1914
9272F257J24477J36677J21184l7209r9527r4638j62398m8729J32730J47108J90737
9261D16669j8750r1145k6323O8529k08646r4593P7925J06518j8113O5164K31975
9250E09210J31964J11740J32547O9372q9986k03480o3532R9602m1471j10r2921
9239E62935q8672Q0246J65661q7154j98390k4167j8618K13793J39862o8693M966
$$ y = [435843, 363597, 227100, 189261, 240503, 246180, 277202, 172431, 36902, 43215, -113549, -236241, -39603, 229385, 254387, 226977, 85853, -79794, -74731, -80105, 38215, 204588, 261131, 113714, -10895, 161068, 267159, 317540, 326869, 182866, 150513, 111086, 202953, 333251, 239125, 180476, 187392, 62153, 123184, 234680, 225142, 154258, 208593, 48171, 6257, 130734, 267411, 388595, 351386, 251859, 157221, -5177, -53906, 78824, 225932, 416669, 397919, 306774, 280451, 348980, 140334, 45741, 123666, 230184, 212071, 277235, 509210, 641174, 752914, 885461, 954833, 864847, 661367, 597835, 697437, 655966, 655856, 562935, 474263, 554509, 720170, 633016, 434626, 410459, 391841, 605634, 745496, 676803, 681769]
9228F81769K0659k06272k14111j44936n9695l2072J50085J45137j5529O0039P0202
9217D55276K0665O7360R1818J29357j27204m7751M596M2200J18892n8599q8885
9206F07725j0192J03556j5571n4926n1509J58995J61474L7300J09856m0520P9933
9195A086121J82084J13527o120r6131j19354j6930l4095r2409m0313k58763O5542
9184G83159R7680m7141k24450j64480j2966N8337j00593q8975J4892n7548J57380
9173D15295P9939M7683R153N9772Q3684l3101o6070m4453K5727M1369J7300O7625
9161G03923M3236Q3369J25564J62518J70899l3387k5431J4838o0982j3539L4083
9150A205091L238J35181o5067o4178q7514m1812o9347r7029q1466r7997j39131
$$ y = [681769, 702428, 496156, 282045, 137109, 77414, 45342, 195427, 340564, 325035, 385074, 455276, 475941, 543301, 635119, 764476, 637272, 589521, 594117, 636317, 755209, 696610, 607725, 597533, 701089, 685518, 630592, 579083, 738078, 899552, 936852, 1046708, 1006188, 1086121, 1268205, 1381732, 1375612, 1279481, 1160127, 1143197, 1109102, 1016693, 976380, 717617, 783159, 880839, 833698, 609248, 444768, 431802, 490139, 389546, 300571, 315463, 257915, 415295, 495234, 542917, 552070, 611842, 695526, 662425, 596355, 551902, 577629, 618998, 636298, 703923, 747159, 830528, 956092, 1118610, 1289509, 1256122, 1230691, 1245529, 1184547, 1171008, 1205091, 1208329, 1343510, 1278443, 1214265, 1126751, 1084939, 1015592, 918563, 837097, 739100, 599969]
9139E99969p0787L0140J44790N3848n5185o1265r940j9196o2629p3799j34782
9128C41164o620J8004L6521J91213p5407l8669K961K8570K31256J09206o8343
9117G69856N7280K7563J3337q5275m4685J9232N9128O0913k420r658p4609l8196
9105G52466j33657j21142l7905n3308p8438L9978Q4166n8785o9022r915M3956
9094C58394l1744J9022J8748n042j45850j86644R1889m6616r5282R4299R1025
9083A62199k1572J32273l4985q4492J51768K72149O0515j5249j87370L7183N5343
9072E27762p0120j5296j11888j73336J95924J97657q9562q3509j06062L7638J01988
9061D11196j22635j26253O4152j8281Q589l8916j06021q713M4900j08735P178
$$ y = [599969, 529182, 559322, 704112, 757960, 702775, 641510, 631570, 612374, 549745, 475946, 341164, 334544, 352548, 389069, 580282, 504875, 466206, 469167, 497737, 728993, 838199, 769856, 827136, 854699, 868036, 782761, 738076, 757308, 816436, 877349, 874929, 865271, 790662, 752466, 618809, 497667, 459762, 406454, 328016, 367994, 452160, 393375, 324353, 314438, 358394, 326650, 345672, 364420, 359378, 213528, 26884, 118773, 72157, -23125, 71174, 162199, 140627, 272900, 237915, 153423, 305191, 577340, 637855, 622606, 435236, 472419, 527762, 457642, 442346, 330458, 157122, 353046, 550703, 461141, 377632, 271570, 309208, 411196, 288561, 162308, 226460, 208179, 216768, 177852, 71831, 63118, 108018, -717, 6461]
9050F461K3896J01700n5485M8475m4720j28666l9427R4328r0139J23798O6515
9039A06736L9277p9560J22117N8500r1031l6017L1116j50224R103k8220P4507
9028E6304p587K6683j06673j07504Q8129Q0691n4469q1591l4536Q9646O1054Q0454
9016I0601k5078K3816Q8496n0465k6669M5442p2443k5102M7723J8681J4263Q6280
9004B15545M7760p1047m2898m6480N058J0582Q2434l6269j66799j08931Q8720
8993b2325Q6431j96777m9858P6798m4268K814K48340J63224j0599J18646j05241
8982B67185l11525o5930J60376R6137o4070k15914O7678r3590j58271m7223k3521
8971c88668J37555N9172N0524R6047o073J636J12599P2058j439p3515J5756l1268
$$ y = [6461, 30357, 132057, 76572, 125047, 80327, -48339, -87766, 6562, -83577, 40221, 106736, 146013, 66453, 188570, 247070, 156039, 120022, 151138, 914, 10017, -18203, 56304, 48717, 75400, -31273, -138777, -50648, 30043, -24426, -106017, -140553, -50907, 10147, 90601, 65523, 89339, 177835, 127370, 100701, 146143, 73700, 48598, 96321, 115002, 129265, 215545, 263305, 192258, 149360, 102880, 107938, 118520, 200954, 164685, -2114, -111045, -22325, 64106, -132671, -182529, -105731, -149999, -147185, 101155, 264379, 253780, 372426, 267185, -44340, -110270, 50106, 146243, 82173, -133741, -66063, -159653, -317924, -365147, -388668, -251113, -191941, -141417, -45370, -51443, -49807, 62792, 134850, 133411, 59896, 75652, 44384]
8959D4384j00298k2152J9329m341l2411J71447J06015J385l2834n0446K6304k2607
8947A03775k5829P186k2857L0042J4786k6849o6135q1606O4240O8269o4840Q5975
8935H6157J45123k3516j07106n3666P9005j00964j6509O866Q9071o3653K3491
8924F4299M8871K0454K1674j30603r7396l7570N1150K50170J33124k8486j65074
8913A30613p1638m2446k6382r2951M6462O157q0581M3063K691Q5865N0858o6273
8901a4562J14123r8788j49359k2770J5620q8254J86225J26901j19896J87249L6996
8890A73485o9441j31631L3201p0143p5646q6012L3545N2845l4944R7514k381R5975
8878A6367k8411j37J60821k753o8379j84008j37316J39858K06694l7961o428O8436
$$ y = [44384, -55914, -78066, -58737, -63078, -95489, 75958, 181973, 183358, 150524, 100078, 126382, 103775, 77946, 85132, 62275, 92317, 107103, 80254, 14119, -67487, -3247, 65022, 182, 86157, 231280, 207764, 100658, 46992, 125997, 25033, 8524, 15390, 104461, 40808, 64299, 113170, 133624, 155298, 24695, -72701, -110271, -59121, 191049, 324173, 295687, 130613, 58975, 16529, -9853, -102804, -56342, -50185, -130766, -87703, -85012, 853, 51711, -14562, 99561, 773, -148586, -171356, -155736, -243990, -57765, 69136, -50760, 136489, 173485, 104044, -27587, 5614, -64529, -140175, -226187, -192642, -139797, -174741, -77227, -79608, 16367, -12044, -12181, 148640, 145887, 77508, -106500, -243816, -103958, 102736, 64775, 58347, 126783]
8866A26783n3107k61491R4300P1709l7284o1372N1150J68969j149J16127q49N4215
8854B68001J06821r9439N3356J1741j26381j48139P4301M0735r273J58286p0419
8843B59590j82724j47374r4779q0123K05685N6163j22665Q6985L0190J02192l1539
8832H1601Q975K8041j17771j10716J18613K86549j00897j45432j81725J433J07625
8821b3704j0669p2668J90813R628L8534m0277p1807R7407J25273j01066j16415
8810B5049J07954K1296j49362j06142M3902Q7500l821J31029l1692p7396k59539
8799b11222n2550L5907Q1773R7610L6220J80509J08345o9312J1883M339j88606
8788C4896K8783n613K8046j3882n8309j25166l4010K58734O3869j50654j20837
$$ y = [126783, 73676, -187815, -93515, -21806, -59090, -120462, -69312, 99657, 98508, 214635, 213786, 268001, 374822, 275383, 328739, 340480, 214099, 65960, 140261, 180996, 171723, 330009, 259590, 76866, -70508, -165287, -245410, -39725, 16438, -106227, -19242, 10948, 113140, 81601, 90576, 118617, 846, -109870, 8743, 295292, 194395, 48963, -132762, -131329, -23704, -34373, -107041, 83772, 93400, 131934, 91657, 19850, 117257, 242530, 141464, 25049, 133003, 154299, 4937, -101205, -57303, 30197, 26376, 157405, 125713, 48317, -211222, -263772, -227865, -146092, -48482, -12262, 168247, 276592, 207280, 219163, 223502, 34896, 63679, 58066, 86112, 72230, 13921, -111245, -145255, 113479, 177348, 26694, -94143]
8777i4143L3041J44781J49513o5266j07585J07284Q871o1230j61843K3085j34805
8766a58297M4029J59053M2122L514k4384k5210j8586J0796O8790J66801r2232
8755A76396q5273L4923K5245p1989J01351J24688P6923L4280j95067p7565J30956
8744B74868j23567r1301n3928m0478k9666P9571J24560m9792k18137M5252J5328
8733f7290J6134R2278J36563O9379M556l7217K413O2580Q7358k48656k71854o2088
8721b15844N7801J36491K3887q8218O0347N4109j24012R6965K06361N873R4562
8710C08322P8261j3393r4968j49824q4174K1177Q2156j07765j45498O2313J68810
8699A25417k5600r6306J4492o2167l0053J3477k1547O7700J13878P9571j31884
$$ y = [-94143, -61102, 83679, 233192, 167926, 60341, 167625, 176496, 115266, -46577, -23492, -158297, -114268, 44785, 86907, 90421, 66037, 40827, 22241, 33037, 101827, 268628, 176396, 91123, 126046, 151291, 79302, 180653, 305341, 382264, 416544, 221477, 143912, 274868, 151301, 60000, 6072, -34406, -64072, 15499, 140059, 90267, -127870, -82618, -67290, -51156, 41122, 177685, 247064, 251620, 214403, 216816, 279396, 366754, 118098, -153756, -215844, -158043, -21552, 2335, -85883, -25536, 28573, -95439, 1526, 207887, 213760, 308322, 386583, 373190, 278222, 128398, 44224, 65401, 147557, 39792, -105706, -43393, 125417, 99817, 3511, 18003, -44164, -74217, -60740, -82287, -14587, 99291, 178862, 46978]
8688D6978k38584N7545J69714K41351p2566k31915L4582J03187l8953j90560j7706
8677a36927R5433R8676J08451l2429l5539J5369N3220L03816J2993j43514Q1911
8666D21460N4514r4178k19419j21483r7258P3314K2515o5438r895p1948m5903
8655a53719l1713K1454Q1871L8309l2040q5212q0544N3701j9593K50445l577k04501
8643a65119j41524R9079J29754n1116M5125k7305k5622J3943o2637J33516N1137
8632g69o4451k7814Q3696j2986J43882R5550j5120j03152j83956L8185O0459q5539
8620g2015j65755p4444J48508O7649P8829J32007m5460r8726j91692J22351n6944
8609a55692p3628o2089N877P1610J19798J06560J84448P1127J49238K2308n2207
$$ y = [46978, -191606, -134061, 35653, 277004, 204438, -27477, 7105, 110292, 71339, -119221, -136927, -41494, 57182, 165633, 133204, 97665, 113034, 166254, 470070, 483063, 339549, 421460, 475974, 381796, 162377, 40894, -56364, 16950, 39465, -25973, -35868, -107816, -153719, -185432, -163978, -82107, -43798, -75838, -161050, -241594, -187893, -207486, 42959, 39382, -165119, -306643, -207564, -77810, -128926, -83801, -111106, -136728, -122785, -185422, -51906, -769, -65220, -93034, -9338, -22324, 121558, 217108, 201988, 98836, -85120, -46935, 13524, -72015, -237770, -312214, -163706, -96057, -17228, 114779, 69319, -29407, -221099, -98748, -155692, -229320, -291409, -285532, -213922, -94124, 12436, 196884, 268011, 417249, 439557, 387350]
8598C87350j38536j19758o2230J09361L1217j40888P2473J43307M5519p8567k375
8587B46873k4759P8350j52543q8199J52383j1010m4728K460j25285O1154K45144
8576C39840k8133M2571p7076m1354R9056q6504l030o468k565p9294j0927M8843
8564A94959J08384j05264j37516j08639N3528N7640j723n7024o3977J1420M2283
8553e929J60760J3935p6258l470m9411K0227R3108R4825j64994R8515M2520j88873
8541C4955L497K1246L0400o2192j34235R4181J54764l7576o9122m0255N1324J68215
8529B15202l7468l3157J38520J7393o9369j15995j3779j7738q5156L9902o598
8518C1757o6638p5601J02212J55571j14104k12346J06890N3411l2906R2657K11043
$$ y = [387350, 248814, 129056, 66826, 176187, 207404, 66516, 138989, 282296, 327815, 249248, 246873, 222114, 300464, 147921, 59722, 212105, 201095, 156367, 158827, 33542, 94696, 339840, 311707, 354278, 277202, 235848, 334904, 248400, 245370, 238902, 236337, 157043, 146116, 194959, 303343, 198079, 60563, -48076, 5452, 63092, 61369, 4345, -59632, -48212, -5929, 154831, 168766, 92508, 89038, 39627, 59854, 152962, 247787, 82793, 181308, 223828, 34955, 38452, 59698, 90098, 27906, -106329, -12148, 142616, 105040, 35918, -4337, 46987, 215202, 177734, 144577, 283097, 300490, 231121, 115126, 101347, 83609, -1547, 38355, 31757, -34881, -110482, -8270, 147301, 33197, -179149, -72259, -18848, -51754, 40903, 251946]
8507B51946p5228J0659q952Q606j38878j13222k1372q6045m51N5127L1231Q4108
8495b471o0531l04386M5472K26121R30M8002l2901P4491Q4122N3291q4799K1367
8483F8708j04126J03246O784n9410q5718K976J00351P7115k17255j15386R9479
8472a23236K56643K6194j25947j22468P2822P3109N5672M0844j07463j6119Q9500
8461A19551K4309l5580R3218K48459j15737k13807p9926O7093n7664p6452K0763
8450e773L6307J01945N9955j08260N071Q014J55793J29818k6517l8019j59317
8439A59017J29518K9590j82220j0153J19352k1466o2748Q3056M6067r3283j26899
8428F9831M3632k0009m4930J41152l6732r743O8243j18364j85394L6296N9840
$$ y = [251946, 176718, 187377, 178425, 187031, 48153, -65069, -86441, -172486, -172937, -117810, -86579, -2471, -63002, -367388, -321916, -95795, -94865, -46863, -79764, -5273, 78849, 132140, 47341, 68708, -35418, 67828, 74612, 15202, -70516, -67540, 32811, 109926, -107329, -222715, -123236, 133407, 159601, 33654, -88814, -15992, 57117, 112789, 153633, 46170, 30051, 119551, 143860, 108280, 201498, 449957, 334220, 120413, 40487, 107580, 49916, -26536, -5773, 30534, 132479, 192434, 84174, 89245, 97259, 253052, 382870, 356353, 318334, 159017, 288535, 318125, 135905, 125752, 245104, 223638, 160890, 243946, 290013, 196730, 69831, 113463, 93454, 48524, 189676, 152944, 143201, 211444, 93080, -92314, -56018, 3822]
8417C822k4684P0728K15956j48388j21895N8909J64766Q1265j35228j21374n4588
8406a0711J21132j978J1585P7664R3987k30547j55856M7925k9470m5699j876l9777
8394a63621p8993J13219J6521j32414o140P3956j12007J9971L4113P3302N0606
8383a11487K2188j4749k0174l8535O0182J63958j0258K9133L2505j60575N9918
8372A2106K1279r1393r1127n1966L5088P0812L9102J27857K2360o3538j47950
8361a17370R8799J46772k9404J01830q7627r7699r0761R1053m1083k26645o9811
8350c21946Q9858R7536P8453O5820J64970m890j41032p5610l0982L6091P1144
8339B9412R7596j24619R333j20029m9500J55123m914j30053r7326q6404o1654
$$ y = [3822, -20862, 49866, 265822, 117434, -4461, 54448, 219214, 300479, 165251, 43877, -10711, 110421, 108443, 120028, 197692, 291679, 61132, -94724, -46799, -76269, -121968, -123844, -163621, -242614, -129395, -112874, -245288, -251428, -177472, -289479, -269508, -235395, -162093, -111487, -89299, -104048, -124222, -162757, -102575, 61383, 51125, 80258, 112763, -47812, 12106, 33385, -58008, -149135, -201101, -166013, -95201, -56099, 71758, 94118, 30580, -117370, -18571, 128201, 98797, 200627, 113000, 15301, -75460, 15593, -25490, -252135, -321946, -232088, -134552, -56099, 9721, 174691, 169801, 28769, -46841, -77823, -41732, 29412, 127008, 2389, 11722, -108307, -157807, -2684, -7598, -137651, -234977, -321381, -383035]
8328c83035N6521J86227R1311K0412q6027L9968O4505K8972Q1883J26451j20066
8317A07122J33693n4008j30004n2680R173P0250k8205l1308J30899N5462Q4749
8306B95143q4803m8288j54269j6584P6311P561m4191R62j65711j5482J5610K8100
8294a05641l5163R6273J76051J42427L9291j09344j18501L8236n2340j04444l7421
8283g0576J3888l4754L5955J64525o7584l8316J22677J37640j76639j7656K1503
8272I0663j54672j69070l8009J2874J38269K32789N0090k3497P7739o1009m6919
8261A09248l6503O0826Q1221q6238r9394J5375J52813J10044P615R621R511M8277
8249C82416r3444n2717j35038K5377J0311L4996k04460j45845Q7916R3453r585
$$ y = [-383035, -326514, -140287, -48976, -28564, -114591, -74623, -10118, 18854, 100737, 227188, 107122, 240815, 186807, 56803, 4123, 13296, 83546, 55341, 24033, 154932, 210394, 295143, 210340, 162052, 7783, -8801, 67510, 75071, 30880, 31842, -133869, -149351, -133741, -105641, -140804, -44531, 131520, 273947, 313238, 203894, 85393, 123629, 71289, -33155, -70576, -56688, -91442, -55487, 109038, 41454, 3138, 125815, 263455, 86816, 69160, 90663, -64009, -233079, -271088, -258214, -119945, 112844, 162934, 139437, 217176, 156167, 109248, 72745, 133571, 214792, 128554, 29160, 44535, 197348, 307392, 315007, 324628, 334139, 382416, 288972, 236255, 101217, 126594, 136905, 171901, -32559, -178404, -90488, 2965, -6620]
8238f620J14793J91314J07637j88886j25376L0323k07208r8370m3121K10431J90646
8227A75563o8754j03925p0792j2601J10542K1443J0231j49109o6434n7131j30349
8216c41316J29742J43984k0336P0686K1579J0673N9264j75710j6075J65067j9540
8205B8018J1821J6722q3304j66314K7984J1775o1829O2146n8289M0202J03657
8194f7411J04769n1291r2655j46377o9380K61665J53687P6158N6817j6963l0884
8183A78135j40217p8675j66125j01946N8196J34602j4433k1788L0799m7003l2056
8172b00511Q4585Q1432K03810r0936m0291k084r559J19307R7780j01770j44829
8161c066Q0406M1655O4187M0620R8329J4372n3206j05427j60980R0550Q84k50244
$$ y = [-6620, 108173, 299487, 407124, 218238, 92862, 123185, -84023, -182393, -225514, -15083, 175563, 106809, 2884, -67908, -80509, 30033, 51476, 61707, -87402, -153836, -210967, -341316, -211574, -67590, -87926, -17240, 4339, 15012, 74276, -101434, -117509, 47558, 28018, 39839, 56561, -26743, -193057, -165073, -153298, -215127, -152981, -211270, -171068, -67411, 37358, -13933, -106588, -252965, -322345, -60680, 93007, 169165, 225982, 209019, 178135, 37918, -40757, -206882, -308828, -250632, -116030, -130463, -152251, -121452, -168455, -200511, -115926, -34494, 169316, 78380, 38089, 36005, 26446, 145753, 243533, 141763, -3066, 77340, 118995, 183182, 223802, 322131, 336503, 283297, 177870, 16890, 107440, 108324, -141920]
8149a41920K6553L3906K3354j03069l8691O7131O0413l4091K3167J61265k8508
8138D9510L9840n5752k4664K1833J04137K8959j39580o083j7696j7427j12594
8127a29517j10661n8176K08877J57443M5704P5258j6860r2544p0460q8457m0759
8116a20152N2999J50954J45588J02137K1186J6121O252q2465j1979Q8493J1845
8105C80979l7845k35796O2447J42788j798J48512j39274j41122j71146J3819l0122
8094h558P727K9028j01596J08084K7714k4830p9019j14751m5174K9922J28854
8083d2599j4510l4249j1648q8211m2535P9414J11557l3611O9910M5518L5390P740
8071H2166J32645K9067L8327j11373q9502j46272r0108N4995J17109K4884p1120
$$ y = [-141920, -115367, -81461, -58107, -161176, -199867, -132736, -72323, -106414, -83247, 78018, 49510, 89350, 33598, 8934, 30767, 134904, 163863, 24283, 18200, 504, -16923, -129517, -240178, -298354, -89477, 67966, 113670, 188928, 172068, 79524, 9064, -79393, -120152, -67153, 83801, 229389, 331526, 352712, 368833, 375085, 292620, 280641, 369134, 380979, 343134, 107338, 169785, 312573, 310775, 459287, 320013, 178891, 7745, 21564, -8558, -831, 28197, -73399, 34685, 62399, 37569, -41450, -156201, -201375, -171453, -42599, -57109, -91358, -103006, -191217, -233752, -154338, -42781, -76392, -6482, 39036, 74426, 82166, 214811, 243878, 282205, 170832, 81330, -64942, -155050, -100055, 17054, 41938, -29182]
8060b9182p013J85779K7828k9721J09121J07833N1899n7499j61437N5763k7391
8049B25980r4011k56J96717Q228j7844J88579l6304k70159j39323O387J0486Q8986
8037A67466N4321n7247j51937O8951J65789K1779r2961r5549q7628l5060k9472
8026g1548O5812N9282r2823Q8803O4636k3241j53323j80235J09492N7755m9008
8015a24398n8549O4764J53080J08897j05552k44305J99700J45949k3210l4049
8005H2327J2156K1609k51091j13003J9389J81825J56577j38840n3144q7145m9545
7994b18885J13237J96492k4264p674k9992O2425K22187k8359r0543P120k40838
7983c9094p5604R4297M5032r3173K10501J98877l8504j64837m0408R1374r7465
$$ y = [-29182, -36195, 149584, 177412, 147691, 256812, 364645, 416544, 359045, 197608, 253371, 225980, 131969, 131713, 328430, 336658, 318814, 507393, 471089, 200930, 61607, 67994, 78480, 167466, 221787, 164540, 12603, 81554, 247343, 269122, 176161, 80612, -7016, -42076, -71548, -5736, 53546, -39277, 49526, 114162, 90921, -62402, -242637, -133145, -75390, -124398, -182947, -118183, 34897, 143794, 38242, -206063, -6363, 139586, 116376, 82327, 94483, 116092, -134999, -248002, -228613, -46788, 109789, -29051, -82195, -169340, -218885, -105648, 90844, 66580, 58906, 28914, 91339, 313526, 285167, 194624, 201744, -39094, -114698, -20401, 24631, -68542, 141959, 340836, 302332, 137495, 97087, 188461, 90996]
7972I0996j11496J18956J39716N357j70747j02746P3673K31177R4386j05358j09612
7961A54302J81990L24l878J54333J07823J71186Q4310J31667Q5059K83070O46355
7950A996541J222238J591051J419483P51726m22279r97881j340323j105796q61337
7941B253423n02297l03497k35125k86549k55271o598J10685J10375j1820j3332
7931H59994j74404j91452m3862M4134r645j720j64203p8113M3602J32635N4678
7920D71644k00485n3406o9996m1804J56468Q5712J35704N5103J35880L31671L01482
7909A307973L79626J007315J338501J464738P78644q4425q49357j201508j104424
7900C037083p95558m71754l69036j20430j36750k57899k26655N3463J15296j35629
$$ y = [90996, -20500, 98456, 238172, 243529, 72782, -29964, 43709, 274886, 369272, 263914, 154302, 336292, 336616, 332738, 487071, 594894, 766080, 850390, 982057, 1067116, 1350186, 1996541, 3218779, 4809830, 6229313, 6981039, 6558760, 5560879, 4220556, 3114760, 2253423, 1751126, 1447629, 1212504, 925955, 670684, 664086, 774771, 885146, 873326, 859994, 685590, 494138, 450276, 494410, 484765, 483045, 318842, 240729, 284331, 416966, 471644, 271159, 217753, 147757, 105953, 262421, 348133, 483837, 538940, 674820, 1006491, 1307973, 1687599, 2694914, 4033415, 5498153, 6276797, 6192372, 5343015, 4141507, 3037083, 2241525, 1769771, 1400735, 1280305, 1143555, 885656, 659001, 712464, 827760, 692131]
7890F92131j63882j12904j12899j0974J43297O9165q475j2493n3982p0814j87853
7879A70317j15017j931N2911J47731k9659j40109r7596r9381J83910O1798j13867
7868A9107K6622Q8921j4358K8691j3231j37120n1205r1417r525n2964j9241p25
7856b26445O5281J19371J27340R1301m9469q0107j25991o5020k4918J22429Q0605
7845C4377l9230R7845n3296j18106j8321O7927Q3509O0694R0261L0593m7583j19259
7833F9411j73140n0160J83789Q0306j43723R6108j17849j40092o6077k5917J10401
7822a76943n9927j01617J62846O5530J23244O5745j5651J43661k5470j20181p0264
7811i027J6388J1918J2679N7245J15077J55922j59569k55166M7802J84977j2393
$$ y = [692131, 528249, 415345, 302446, 291472, 434769, 503934, 495459, 482966, 428984, 358170, 170317, 55300, 53369, 106280, 254011, 224352, 84243, -13353, -112734, 71176, 132974, 19107, 45729, 134650, 120292, 148983, 135752, -1368, -52573, -143990, -153515, -206479, -225720, -226445, -161164, -41793, 85547, 176848, 127379, 47272, -78719, -143739, -168657, -46228, 34377, -4853, 92992, 39696, -78410, -96731, -28804, 54705, 115399, 205660, 236253, 188670, 69411, -103729, -153889, 29900, 110206, -33517, 62591, -55258, -195350, -261427, -287344, -176943, -236870, -338487, -175641, -110111, 13133, 78878, 63227, 206888, 181418, 61237, -9027, 7361, 19279, 31958, 89203, 204280, 360202, 200633, -54533, -6731, 178246, 165853]
7800A65853J2103l4910L2862j04372k0924O7883N121Q5605J22367q6605l8936
7789B06047Q4100n6627m0357k87277Q740J39088J33362M8441r518m8296o6315
7778A11388J5435q0743q1401J2901p3379m8191K4232K01860L5485r6815k5743
7767d971j01328Q4190M9567K8874k20589m9140Q8914N0454m9055O2206k3063J6903
7755f7038J8875R639j53869p7858N2277O7743l2732N6099Q4742N2875J35772j60792
7743a4267k9457J09593p9016J3929P7910O4419j49742k7175n6382j01867q720
7732b00775M5875K1406Q108M57O2236J0903j53234O112J79626j48476m7480J96994
7720a8248J53461P8703L062o249J8056Q104o3349r4755l7475L4388N3857l7791
$$ y = [165853, 177956, 143046, 175908, 71536, 50612, 118495, 123616, 209221, 331588, 244983, 206047, 290147, 233520, 193163, -94114, -85374, 53714, 187076, 235517, 225999, 177703, 111388, 126823, 46080, -35321, -22420, -95799, -143990, -119758, 82102, 117587, 20772, -4971, -106299, -22109, 27458, 56332, -164257, -213397, -124483, -74029, -123084, -60878, -83941, -67038, -48163, -38524, -192393, -270251, -217974, -150231, -182963, -126864, -42122, 10753, 146525, -14267, -43724, 65869, -13147, 782, 78692, 143111, -6631, -33806, -90188, -192055, -200775, -154900, -133494, -125386, -124929, -62693, -51790, -205024, -198912, -19286, -167762, -215242, -18248, 135213, 213916, 216978, 210729, 228785, 236889, 173540, 78785, 41310, 75698, 129555, 91764]
7708I1764l4977J04223q5246p1158j6806Q6769J32528N7227N6114j75882j09765
7697C4791j44420k2977q2902K8685J36302O9556K9763M1632P467k2729L8879Q0020
7685A94067P9818J6241j63940j26443j15821p2878k2404P5078K16473O6886k2510
7674A24567j2297r2359l9361j32210J78444j9297r9141l9029n3610J02505k9722
7663a11510Q0792J17839j73152L686J81373P1420J15288n0071k9199m6979k1122
7652A38365J30704r6489k68176j2985R8495j3816j34585P684J08317J27031M7329
7641A31874j60194j07220O3229J00125j46085q1843j5431j01353L16133J40848
7631A40083j84293p869R5631J05850P680o0440m3717l8980l6798m1074M3974N0426
$$ y = [91764, 56787, 161010, 75764, 4606, -12200, 74569, 207097, 264324, 320438, 144556, 34791, -109629, -132606, -215508, -186823, -50521, 19035, 48798, 90430, 97897, 75168, 114047, 194067, 273885, 290126, 126186, -257, -116078, -188956, -211360, -136282, 80191, 147077, 124567, 112270, 19911, -19450, -151660, 26784, 7487, -91654, -130683, -184293, -81788, -111510, -30718, 87121, -86031, -82345, 99028, 170448, 285736, 235665, 206466, 159487, 138365, 269069, 172580, -95596, -108581, -10086, -23902, -158487, -150803, -42486, 84545, 131874, -28320, -135540, -72311, 27814, -118271, -200114, -215545, -316898, -765, 140083, -44210, -52079, 43552, 149402, 157082, 96642, 52925, 13945, -22853, -63927, -19953, 30473]
7619C0473M6024o137j5847o2588J8086L714J50744j35387K864r9211p0209q8853
7607b26327k4844J22823L9331j35577r1278o495Q6648n1043L8211N3040K7057
7596a68454K34789L3648j52835j93545j93583M663J10681J52027J23948N001r7007
7585a40667M9629m6559L0895J1084J18294K43050p7583j23509K4684l1484n8820
7574i86k1916M779r9795L0864k3427m3799n9649O5770J69507L4103J7767r9693
7562b6475P4822K259p6425o6653P3108J07824J77576N6930j1745k43703l9186
7551B8332o8634q061p5329m4945K374r498L501N2009J41928J8604j70055N0808
7539g8966j0876J02960K9431m3002m5615r0104q8353Q1045j04943m998R3880R8866
$$ y = [30473, 76497, 70360, 54513, -8075, 10011, 13725, 164469, 29082, 31946, -67265, -137474, -226327, -251171, -128348, -89017, -224594, -315872, -322367, -235719, -286762, -248551, -195511, -168454, 66335, 99983, -52852, -246397, -439980, -435317, -324636, -172609, -48661, -43660, -140667, -91038, -137597, -106702, -95618, 22676, 265726, 188143, 64634, 89318, 57834, -986, -22902, -18123, -117918, -87054, -110481, -154280, -213929, -148159, 21348, 55451, 73218, -26475, 48347, 50606, -25819, -92472, -19364, 88460, 266036, 322966, 311221, 67518, 28332, -40302, -48363, -123692, -168637, -166263, -175761, -172260, -120251, 21677, 40281, -129774, -78966, -89842, 13118, 42549, -453, -46068, -136172, -224525, -143480, -248423, -253421, -159541, -60675]
7527f0675l3519J25798J45512p3171k2982r7194j69864L4304P7842N0877K5401
7516B329K07982l7098K5954p8972N6705p1688j37217M1983L8231K5680J53637
7505B27526k3301j01410p7527p681p0548l2261K94412N8439j08775k83486j45273
7494b69885N0281L4183j772J90964J73592m5379j6629J13332n1732j99587K821
7483a9811m275L4943L8718p2121k380M5877o143q3791p9551L2505k3363M7593
7471i1799J20278o1391j09090n1803O2572k6132J14143R7066O2292k18855O7166
7460c5553r920p3831L1396J51196o3441J5932J05206J74375K1971r3495n0749
7449A73087N685m395j32229j0471J63510J1029j12380k2291J14925Q3781k16419
$$ y = [-60675, -94194, 31604, 177116, 103945, 80963, -16231, -186095, -151791, -73949, -23072, 2329, 210311, 173213, 199167, 120195, 176900, 105212, -32005, 9978, 48209, 73889, 227526, 204225, 102815, 25288, 17607, -52941, -85202, 209210, 267649, 158874, -124612, -269885, -219604, -185421, -187193, 3771, 177363, 131984, 115355, 228687, 176955, -22632, -19811, -24086, 10857, 49575, -22546, -24926, 20951, 14808, -68983, -148534, -116029, -139392, -91799, 28479, -32912, -142002, -193805, -131233, -157365, -43222, 53844, 116136, -102719, -35553, -45473, -119304, -87908, 63288, -153, 15779, 120985, 295360, 317331, 223836, 173087, 178772, 174377, 42148, 31677, 195187, 206216, 93836, 71545, 186470, 270251, 53832]
7438E3832j37924J14403J34756J2379K0323j96517o0556o2869k0597J5467j6524
7427a43827l9319L2969O5664J4016m8683K8266N8182Q6957P6941p2130k13118
7416a54082j6398Q9230m1100K5503q355N6079J18563K30732M1342n7044l2518
7405B51952j10148l57J01432j30723r4165j41219j23470K9738L4157R1049J14918
7394B3164j89720j22151R2524J38371l7447n5519J76569J85855J2411J14922o4223
7383B74756j71172j84157O2261o8790r2057n4714Q0186j5047n2547O7659o523
7372a60145l9926J62631N488j06034L5769J89073J1276j38110q6407j04403J80000
7361e0788K46332j4596l4184n6317j51893J5235l5556l1372J8707Q8455j58506
$$ y = [53832, -84092, 30311, 165067, 177446, 197769, 1252, -59304, -122173, -142770, -127303, -143827, -183146, -150177, -84513, -70497, -119180, -90914, -32732, 54225, 131166, 59036, -154082, -170480, -81250, -122350, -96847, -105202, -49123, 69440, 300172, 341514, 284470, 251952, 141804, 141447, 242879, 112156, 17991, -123228, -246698, -216960, -182803, -91754, 23164, -166556, -288707, -196183, -57812, -95259, -150778, 25791, 211646, 224057, 338979, 274756, 103584, -80573, -18312, -87102, -179159, -233873, -153687, -168734, -221281, -153622, -160145, -200071, -37440, -31952, -137986, -102217, 86856, 98132, -39978, -126385, -230788, -50788, 195544, 180948, 146764, 90447, -61446, -46211, -81767, -113139, -94432, -5977, -164483]
7350a64483p07j4119K3475J62382J53133j5023L726j52389l229o4810o3465P1808
7338f3701j06866j9800J42547K11472K2351l6921r3280j12049n9186o7954K6302
7327a57085M9166p3032J87308K63138r4495j28373O1859m2876q6075J761j12124
7316a30828R33K3322N1692K04391l5101j42801l5020O8198K21861j09875j44653
7305b7881m6748j14339j0328J11429Q1970q5124j37200q7588L7336J99922P999
7294g0552m7946N8836o354q4148N9332J70638j8925r6099m9116M292O2667R745
7282g630j35736O2394K67019L3914j14407j52439j02851J77451J14190q6341p7781
7271b2217N8972O5009j53676q712M0686K0553n7083n6373L8653q18j47277J84270
$$ y = [-164483, -165190, -179309, -155834, 6548, 159681, 144658, 148384, -4005, -7234, -72044, -135509, -63701, -170567, -190367, -47820, 163652, 186003, 149082, 55802, -56247, -115433, -183387, -157085, -107919, -180951, 6357, 269495, 175000, 46627, 108486, 65610, -20465, -18704, -130828, -129895, -106573, -54881, 149510, 114409, -28392, -63412, 4786, 226647, 116772, -27881, -74629, -188968, -199296, -87867, -5897, -91021, -228221, -315809, -278473, -78551, -70552, -118498, -59662, -66016, -150164, -90832, 79806, 60881, -35218, -84334, -80042, -17375, -7630, -143366, -80972, 186047, 219961, 105554, -46885, -149736, 27715, 141905, 55564, -22217, 36755, 101764, -51912, -60624, -19938, 615, -56468, -112841, -74188, -75006, -222283, -38013]
7259c8013J82417J36096q5936k1466K2914n29N6730k303r0054n8989p7426m432
7247A9009j652j6177J49070j1867M5792n6903p3234r3805k01157l594K55843N2885
7235F4210n5059j9341m882R2189m3342l8905R20q5740j48991j81325K9849J01385
7223b89032J84935K40711N6597O2462j4193j08219p7942k6964K3616k2201P8896
7212A08666J35353P2621j74408r5198O5766m5026J02142O7846l7546P9824j53944
7201A26096Q054K801J7369J6970j52190L8710j4474p6259j6139L4241k6676q1933
7189a23430J0597j66432M1249R7941K52685R8j65735n7494L984M2720K08082K7297
7177A71562j27927j52759O9586k8534k1742N0885K52872m8606m1480L2608K8329
$$ y = [-38013, 144404, 280500, 194564, 173098, 196012, 195483, 252213, 249910, 159856, 100867, 23441, 19009, 17357, 1180, 150250, 138383, 184175, 127272, 54038, -39767, -240924, -244518, 11325, 64210, 9151, -10190, -15072, 77117, 33775, -5130, -4210, -89950, -238941, -420266, -390417, -289032, -104097, 136614, 193211, 255673, 241480, 133261, 55319, 28355, 51971, 29770, 108666, 244019, 316640, 142232, 47034, 112800, 67774, 169916, 237762, 200216, 280040, 126096, 134150, 136951, 154320, 171290, 19100, 57810, 43336, -32923, -49062, -14821, -41497, -123430, -112833, -279265, -238016, -140075, 112610, 112708, -53027, -110521, -106537, -63817, 144265, 171562, 43635, -109124, -39538, -68072, -89814, -38929, 213943, 165337, 123857, 156465, 184794]
7166A84794j14105o8012p0800k10275j8078J37800J13555m8103j6068K8962o9192
7155a49522n0545K0627J53058k7584j53349M9915k6238J53432l6132k69035n965
7144c41338J27974J08224L0100m8621m2103N2300j48463p3065J1212R1600J61177
7133g1003M5962j06041Q0706q090n3336P0516K3977j3628M1150J43431O6624j35714
7121H4554k3373O9948O7430M1664j31869j07394P3479J61826J06130k17671j30243
7110e519m9096R7685l5806N8106o8492N0783J20645j31531m5953J12434M1544
7099A44800r4665o9180l4773j03046j47358M2333J31455k7601o580m8884P411
7088b06088J94937R6846J24981j64955j88424n7372J2221R8376R0083p2034m3851
$$ y = [184794, 70689, 2677, -68123, -278398, -296476, -158676, -45121, -93224, -109292, -80330, -149522, -200067, -179440, -26382, -53966, -207315, -157400, -183638, -30206, -66338, -335373, -341338, -213364, -105140, -75040, -123661, -165764, -113464, -261927, -334992, -323780, -232180, -71003, -25041, -131082, -50376, -58466, -111802, -41286, -17309, -30937, 10213, 153644, 220268, 84554, 61181, 131129, 198559, 240223, 108354, 960, 74439, 236265, 342395, 124724, -5519, -54615, 43070, 7264, 65370, -3122, 47661, 168306, 36775, -9178, 103256, 144800, 50135, -19045, -53818, -156864, -304222, -261889, -130434, -158035, -164615, -213499, -206088, -11151, 85695, 210676, 45721, -142703, -200075, -187854, -89478, 605, -71429, -115280]
7077a15280J4212J3874j55134j43418J66813J63301q7530k33220N7202O4318J66613
7066h8249P4595p8944n1995K0115K0482m5130O6357L1673P7327K5069M2849r2244
7054A905j60636J52014J22363n1442K5004n3063r9732k9426J58131l5400R5326
7043A25044j06776j3137P8737m7237p1591k15033L7000K16865O2214J5079L3637
7032A14802K08810n6958k02097r4710m1062r1406p7136n1635J28006n8685Q5635
7021a36436R5672j6007k8395O6582J47241J58298j04559l6842j8837m9186J07070
7010A84601j40107j04024p3021n4333Q7377l368K15476Q9492j65271k49900r9382
6999c12460P8983Q306O9408P5733K02606K26252K7019j01227k5046j03420j95739
$$ y = [-115280, -101068, -87194, -242328, -385746, -218933, -55632, -143162, -376382, -319180, -254862, -88249, -13654, -92598, -144593, -124478, -103996, -149126, -82769, -51096, 26231, 51300, 94149, 1905, -158731, -6717, 115646, 64204, 89208, 36145, -63587, -93013, 65118, 29718, 125044, 18268, 5131, 83868, 36631, -34960, -249993, -212993, 3872, 66086, 81165, 114802, 323612, 266654, 64557, -30153, -71215, -162621, -239757, -291392, -163386, -222071, -136436, -40764, -56771, -85166, -18584, 128657, 286955, 182396, 145554, 126717, 77531, 184601, 44494, -59530, -132551, -186884, -99507, -102875, 112601, 202093, 36822, -213078, -312460, -233477, -225171, -155763, -80030, 122576, 348828, 375847, 274620, 249574, 146154, -49585]
6988d9585o4319q2761J75158r0994k79875o592J67978J1221O8498J57439J69333
6977A75501P239j9829Q082j54855j02034J53224L0467R1374j15856k25788J21242
6966c1233O7430l961j0258J15167Q0952J3920R2063J59750j99821m21655o031
6955a43677R6298m7153P2522J5125Q3207j9528j54208K2214N1369J92069J0901
6944A79139k87035n1686K15852m358j69066r021O1720k06821P0718Q2383n5806
6933a73981K53405Q6526o1066j30014j50688p4014j11995P5649J61688n3493j48570
6922c26553R3888L9532o0913P766J01104q91Q4716M972q3683q5352l7764O1014
6910b02164K7539O7318J05935M9590q946p1593j34752j06822n3862J95050K4091
$$ y = [-49585, -113904, -196665, -21507, -112501, -392376, -398968, -230990, -219769, -151271, 6168, 175501, 182740, 162911, 170993, 16138, -85896, 67328, 97795, 189169, 73313, -152475, -31233, 36197, 32236, 21978, 137145, 218097, 232017, 324080, 483830, 284009, -137646, -143677, -47379, -94532, -22010, -6885, 76322, 56794, -97414, -75200, -23831, 168238, 179139, -107896, -159582, 56270, 51912, -117154, -126175, -64455, -271276, -200558, -118175, -173981, 79424, 165950, 104884, -25130, -175818, -249832, -361827, -286178, -124490, -177983, -326553, -232665, -193133, -254046, -246280, -145176, -146067, -61351, -56379, -140062, -225414, -263178, -202164, -174625, -107307, -1372, 48218, 39272, -32321, -167073, -273895, -327757, -132707, -108616]
6899a08616J9228N7394L6638o0705j95999J59331J19368J1493l7655j2566P9320
6888F7231R5692m8136j00173R9340J5160m4155n6175K4320l9463l1065J562N6318
6876D0456J1704L6358k7701j7968j06407q1017J25033O036r5345j37347L6402
6865b09796j35844R1543J24738J763J19790m5204p0444Q5341Q289J11267Q3879
6854A65322l7174J0119J38625P2820j75065l8639n1865j45492J3600m8L8449R4432
6842H5084o4040N2568o1500L8380J82903O7758j9637l23986j31235L297K53680
6831H3272K52520n0897r8698O6966Q5300r6083k49389l2330m6756K8515J05794
6820D8214J60140p1641j05605j13533o4111l3557l4625J66942p7644q8332Q2042
$$ y = [-108616, -89388, -31994, 4644, -56061, -252060, -92729, 26639, 38132, 477, -12089, 67231, 162923, 114787, 14614, 113954, 129114, 84959, 28784, 53104, 13641, -17424, -15862, 40456, 52160, 88518, 60817, 42849, -63558, -144575, -19542, -13506, -108851, -246198, -209796, -345640, -254097, -129359, -127596, -7806, -53010, -123454, -38113, -29824, 81443, 165322, 128148, 138267, 276892, 349712, 174647, 136008, 84143, -61349, -47749, -47797, -9348, 85084, 21044, 73612, 12112, 50492, 233395, 301153, 281516, -42470, -173705, -170408, 83272, 335792, 284895, 186197, 253163, 338463, 242380, -7009, -39339, -86095, -57580, 48214, 208354, 136713, 31108, -82425, -146536, -180093, -214718, -47776, -125420, -213752, -131710]
6809a31710J1591q9359Q2100Q3202k1617k6812j070O4085j2888m5091j39765K0079
6797b07255J41675J52037l3829n5861J13057j33351j81773J87648q724K6758o3578
6786f3196K0746J5774K3617J9892j4722J24832k3408k55482N2918R9586j37631
6775a37074l3225j3576J29145K73230Q9689k23040M1394P8499j67923j37730p2309
6764a72920n733J86315L3013j41367J28476k2988j15198J62614k1959k48966j17170
6753c35883R9885K52998j1144j14300j28820J08366J49120j146p3708l8441K4991
6742f8082q349j6408J9699j65398J91002J52740K1647n5944m0271J46048K5408
6731B02092r9309p8917j18106J2505R3486O7617p4273p0848J976Q8293R8907p2164
$$ y = [-131710, -120119, -209478, -127378, -44176, -65793, -92605, -93675, -29590, -42478, -87569, -227334, -207255, -65580, 86457, 52628, -3233, 109824, -23527, -205300, -17652, -26376, 382, -63196, -42450, -26676, -3059, 16833, 2111, 126943, 103535, -151947, -99029, 557, -137074, -170299, -183875, -54730, 218500, 308189, 85149, 126543, 205042, 37119, -100611, -172920, -178653, 7662, 40675, -100692, 27784, 4796, -110402, 52212, 30253, -218713, -335883, -235998, 17000, 5856, -108444, -237264, -128898, 20222, 19076, -54632, -93073, -68082, -76431, -92839, -73140, -238538, -47536, 105204, 126851, 70907, 30636, 176684, 202092, 102783, 23866, -94240, -81735, 11751, 79368, 5095, -65753, -63777, 24516, 123423, 51259]
6719E1259Q845J44448r0186L2480m8861M543K5396o4247n2358M8269J32538p2213
6707A19913j20980r1903P5747Q8174k748n8828q2207j29946O5343L7648j6150
6696a15937L1978j64210l4304J65627M3568o9839J20086m0421p2159L3695l9280
6685a41196O7978M3858k96434J67840J27511o6042j26197o4559N6695l8956J22426
6674a47076J73849m9168o8886M3391j34525l0209K91328J23366k92041o0203J60102
$$ y = [51259, 60104, 204552, 114366, 146846, 97985, 102528, 127924, 63677, 11319, 59588, 192126, 119913, -1067, -92970, -17223, 70951, 68203, 9375, -72832, -202778, -137435, -99787, -115937, -83959, -248169, -282473, -116846, -73278, -143117, -23031, -63452, -135611, -101916, -141196, -73218, -29360, -325794, -157954, -30443, -96485, -222682, -287241, -230546, -269502, -147076, 26773, -22395, -91281, -47890, -182415, -212624, 78704, 202070, -89971, -150174, 9928]
$$ [...]
##END NTUPLES=NMR SPECTRUM
##END=
