##TITLE=Analysis number 311960
Compound Code mo 07001
Book Reference 1
Project Code adrs
Chemist Name flurochem
##JCAMPDX= 6.0         $$ Bruker NMR JCAMP-DX V2.0
##DATA TYPE= NMR SPECTRUM
##DATA CLASS= NTUPLES
##ORIGIN= Bruker BioSpin GmbH
##OWNER= NMR
$$ XWIN-NMR		Version 3.5
$$ Wed Jul 20 15:07:22 2005 GMT Daylight Time (UT+1h)  MAYBRIDGE\NMR@NMR_250MHZ
##.OBSERVE FREQUENCY= 250.131544655141
##.OBSERVE NUCLEUS= ^1H
##.ACQUISITION MODE= SIMULTANEOUS (DQD)
##.ACQUISITION SCHEME= undefined
##.AVERAGES= 16
##.DIGITISER RES= 18
##SPECTROMETER/DATA SYSTEM= dpx250
##.PULSE SEQUENCE= zg30
##.SOLVENT NAME= CDCl3
##.SHIFT REFERENCE= (INTERNAL, CDCl3, 0, 16.522)
##AUDIT TRAIL= $$ (NUMBER, WHEN, WHO, WHERE, WHAT)
$$ ##TITLE= Audit trail, XWIN-NMR		Version 3.5
$$ ##JCAMPDX= 5.01
$$ ##ORIGIN= Bruker BioSpin GmbH
$$ ##OWNER= NMR
$$ C:\u/data/dgb/nmr/ADRS/6160/pdata/1/auditp.txt
$$ ##AUDIT TRAIL=  $$ (NUMBER, WHEN, WHO, WHERE, WHAT)
(   1,<2005-07-20 15:07:00.72 +100>,<MAYBRIDGE\NMR>,<NMR_250MHZ>,
      <created by zg, POWCHK disabled, PULCHK disabled
       configuration hash MD5:
       62 19 C7 07 E1 42 D1 B7 37 6C 3D D0 77 39 F9 E6
       data hash MD5: 64K
       F9 06 94 DF 74 72 1F AA 38 78 BC A7 AE 2A 6D 85>)
(   2,<2005-07-20 15:07:13.29 +100>,<MAYBRIDGE\NMR>,<NMR_250MHZ>,
      <Start of raw data processing
       ef LB = 0.3 FT_mod = 6 PKNL = 1 SI = 32K 
       data hash MD5: 32K
       DA 1E 75 35 DF 91 E8 D1 76 C4 01 2E 98 49 65 29>)
(   3,<2005-07-20 15:07:15.22 +100>,<MAYBRIDGE\NMR>,<NMR_250MHZ>,
      <apk 
       data hash MD5: 32K
       BC 39 6A A2 20 C2 70 44 EB 2C 92 0D 23 E9 C9 05>)
(   4,<2005-07-20 15:07:16.13 +100>,<MAYBRIDGE\NMR>,<NMR_250MHZ>,
      <abs ABSG = 5 
       data hash MD5: 32K
       93 51 0C 06 D2 E3 D1 94 0C 65 F8 52 3D 74 7C 00>)
$$ ##END=
$$ 
$$ hash MD5
$$ EF 81 5D 14 79 B3 BA 5B 40 C9 11 76 C2 EC 75 D3
##$RELAX= 
##$RELAX= 
##$RELAX= 
##$RELAX= 
##$RELAX= 
##$RELAX= 
##$RELAX= 
$$ Bruker specific parameters
$$ --------------------------
##$DU= <C:\u>
##$EXPNO= 6160
##$NAME= <ADRS>
##$PROCNO= 1
##$TYPE= <nmr>
##$USER= <dgb>
##$AMP= (0..31)
100 100 100 100 100 100 100 100 100 100 100 100 100 100 100 100 100 100 
100 100 100 100 100 100 100 100 100 100 100 100 100 100 
##$AQSEQ= 0
##$AQ_mod= 3
##$AUNM= <au_zg>
##$AUTOPOS= <44 >
##$BF1= 250.13
##$BF2= 250.13
##$BF3= 250.13
##$BF4= 250.13
##$BF5= 500.13
##$BF6= 500.13
##$BF7= 500.13
##$BF8= 500.13
##$BYTORDA= 1
##$CFDGTYP= 0
##$CFRGTYP= 5
##$CHEMSTR= <none>
##$CNST= (0..31)
1 1 145 1 1 1 1 1 1 1 1 1 1 1 1 1 1 1 1 1 1 1 1 1 1 1 1 1 1 1 1 1 
##$CPDPRG= <>
##$CPDPRG1= <>
##$CPDPRG2= <>
##$CPDPRG3= <>
##$CPDPRG4= <mlev>
##$CPDPRG5= <mlev>
##$CPDPRG6= <mlev>
##$CPDPRG7= <mlev>
##$CPDPRG8= <mlev>
##$CPDPRGB= <>
##$CPDPRGT= <>
##$D= (0..31)
0 1 0 0 0 0 0 0 0 0.06 0 0 0 0 0 0 0.0002 0 0 0 0 0 0 0 0 0 0 0 0 0 0 
0 
##$DATE= 1121868419
##$DBL= (0..7)
120 120 120 120 120 120 120 120 
##$DBP= (0..7)
150 150 150 150 150 150 150 150 
##$DBP07= 0
##$DBPNAM0= <>
##$DBPNAM1= <>
$$ [...]
##$SUBNAM7= <"">
##$SUBNAM8= <"">
##$SUBNAM9= <"">
##$SW= 20.6930455092707
##$SWIBOX= (0..15)
0 0 3 0 0 0 0 0 0 0 0 0 0 0 0 0 
##$SW_h= 5175.983436853
##$TD= 65536
##$TD0= 1
##$TE= 295.16
##$TE2= 300
##$TE3= 300
##$TEG= 300
##$TL= (0..7)
0 120 120 120 120 120 120 120 
##$TP= (0..7)
150 150 150 150 150 150 150 150 
##$TP07= 0
##$TPNAME0= <>
##$TPNAME1= <>
##$TPNAME2= <>
##$TPNAME3= <>
##$TPNAME4= <>
##$TPNAME5= <>
##$TPNAME6= <>
##$TPNAME7= <>
##$TPOAL= (0..7)
0.5 0.5 0.5 0.5 0.5 0.5 0.5 0.5 
##$TPOFFS= (0..7)
0 0 0 0 0 0 0 0 
##$TUNHIN= 0
##$TUNHOUT= 0
##$TUNXOUT= 0
##$USERA1= <user>
##$USERA2= <user>
##$USERA3= <user>
##$USERA4= <user>
##$USERA5= <user>
##$V9= 5
##$VALIST= <valist>
##$VCLIST= <CCCCCCCCCCCCCCC>
##$VD= 0
##$VDLIST= <DDDDDDDDDDDDDDD>
##$VPLIST= <PPPPPPPPPPPPPPP>
##$VTLIST= <TTTTTTTTTTTTTTT>
##$WBST= 1024
##$WBSW= 4
##$XGAIN= (0..3)
0 0 0 0 
##$XL= 0
##$YL= 0
##$YMAX_a= 426605
##$YMIN_a= -497533
##$ZGOPTNS= <>
##$ZL1= 120
##$ZL2= 120
##$ZL3= 120
##$ZL4= 120
##$ABSF1= 16.522
##$ABSF2= -4.171173
##$ABSG= 5
##$ABSL= 3
##$ALPHA= 0
##$AQORDER= 0
##$ASSFAC= 0
##$ASSFACI= 0
##$ASSFACX= 0
##$ASSWID= 0
##$AUNMP= <proc_1d>
##$AZFE= 0.1
##$AZFW= 0.1
##$BCFW= 0
##$BC_mod= 0
##$BYTORDP= 0
##$COROFFS= 0
##$CY= 12.5
##$DATMOD= 1
##$DC= 0
##$DFILT= <>
##$DTYPP= 0
##$F1P= 14.0000005364418
##$F2P= -0.99999901652339
##$FCOR= 0.5
##$FTSIZE= 32768
##$FT_mod= 6
##$GAMMA= 0
##$GB= 0
##$INTBC= 1
##$INTSCL= 1
##$ISEN= 128
##$LB= 0.3
##$LEV0= 0
##$LPBIN= 0
##$MAXI= 10000
##$MC2= 0
##$MEAN= 0
##$ME_mod= 0
##$MI= 0
##$NCOEF= 0
##$NC_proc= -3
##$NLEV= 6
##$NOISF1= 0
##$NOISF2= 0
##$NSP= 0
##$NTH_PI= 0
##$NZP= 0
##$OFFSET= 16.522
##$PC= 1
##$PHC0= 127.118
##$PHC1= 1.539154
##$PH_mod= 1
##$PKNL= yes
##$PPARMOD= 0
##$PSCAL= 4
##$PSIGN= 0
##$REVERSE= no
##$SF= 250.13
##$SI= 32768
##$SIGF1= 0
##$SIGF2= 0
##$SINO= 400
##$SIOLD= 32768
##$SREGLST= <1H.CDCl3>
##$SSB= 0
##$STSI= 32768
##$STSR= 0
##$SW_p= 5175.98343685301
##$SYMM= 0
##$S_DEV= 0
##$TDeff= 65536
##$TDoff= 0
##$TI= <Analysis number 999999
Compound Code 99
Book Reference 9
Project Code 9>
##$TILT= no
##$TM1= 0
##$TM2= 0
##$TOPLEV= 0
##$USERP1= <user>
##$USERP2= <user>
##$USERP3= <user>
##$USERP4= <user>
##$USERP5= <user>
##$WDW= 1
##$XDIM= 32768
##$YMAX_p= 322106408
##$YMIN_p= -137505
$$ End of Bruker specific parameters
$$ ---------------------------------
##NTUPLES= NMR SPECTRUM
##VAR_NAME=  FREQUENCY,     SPECTRUM/REAL,   SPECTRUM/IMAG
##SYMBOL=    X,             R,               I
##VAR_TYPE=  INDEPENDENT,   DEPENDENT,       DEPENDENT
##VAR_FORM=  AFFN,          ASDF,            ASDF
##VAR_DIM=   32768,         32768,           32768
##UNITS=     HZ,            ARBITRARY UNITS, ARBITRARY UNITS
##FACTOR=    0.157963299565203, 1,           1
##FIRST=     4132.6476996994, 0,             0
##LAST=      -1043.33573715361, 0,           0
##MIN=       -1043.33573715361, -137505,     0
##MAX=       4132.6476996994, 322106408,     0
$$ Real data points
##PAGE= N=1
##DATA TABLE= (X++(R..R)), XYDATA
$$ [...]
$$ plain form
17772 15519 14492 11412 7311 8478 14825 12621 10872 9805 9805 7363 6038 5399 3017 6464 5194
17757 5194 4270 7988 9130 7313 5823 4039 1245 -1973 -1238 1697 4061 1028 2515 1135 7048
17742 7048 4619 -71 -5148 -7461 -10587 -11455 -9816 -15096 -19050 -21200 -20097 -19000 -16884 -13766 -12802
17727 -12802 -13073 -9555 -646 4539 7344 11503 15555 15189 18170 17751 20322 26740 34911 36960 36947 33341
17711 33341 25055 20671 20386 19466 18672 9599 5282 6660 11387 10303 8150 7829 14700 18558 21589
17696 21589 24089 24576 28426 32604 34163 38371 41344 47189 47897 48624 54036 63936 77734 96264 120354
17681 120354 145889 173958 207012 241490 266424 290619 303163 311262 316823 313456 301419 278443
17669 278443 251247 217937 190516 165097 135510 111725 95955 76836 62269 52666 45168 35223
$$ packed form
17772A5519j027l080m101J167O347k204j749j067%k442j325o39k382L447j270
17757E194r24L718J142j817j490j784k794l218P35K935K364l033J487j380N913
17742G048k429m690n077k313l126q68J639n280l954k150J103J097K116L118R64
17727a2802k71L518Q909N185K805M159M052l66K981m19K571O418Q171K049j3l606
17711C3341q286m384k85r20p94r073m317J378M727j084k153l21O871L858L031
17696B1589K500M87L850M178J559M208K973N845P08P27N412R900J3798J8530K4090
17681A20354K5535K8069L3054L4478K4934K4195J2544Q099N561l367j2037k2976
17669B78443k7196l3310k7421k5419k9587k3785j5770j9119j4567r603p498r945
$$ plain form
17657 35223 25481 25464 27417 22979 18928 17328 17027 17975 18649 24600 30448 36099 36432 39242 41906 39219
17641 39219 42273 41894 40035 47983 57211 65001 73191 85610 100728 124043 154199 181598 206362
17628 206362 229919 249329 266475 271430 268867 263124 251792 237071 208371 177191 149019 126738
17616 126738 109514 88529 67075 50073 42001 35701 29632 27532 27952 25386 20948 13492 13515 18018
17602 18018 18510 15354 15117 12317 10853 9974 9305 13744 14106 10583 7201 7065 2373 2447 5021 7823
17586 7823 341 -6208 -2402 -2330 -3936 -2537 3186 4941 7545 8522 5793 5428 4011 7391 9048 9940
17570 9940 6209 5292 10189 11053 9975 5874 1250 -3989 -428 4068 1084 3503 5708 5105 4747 5619
17554 5619 7434 6545 7148 3297 -1204 -3184 2605 2408 615 135 -3311 -877 -228 910 1648 2224
$$ packed form
17657C5223r742j7J953m438m051j600l01R48O74N951N848N651L33K810K664k687
17641C9219L054l79j859P948R228P790Q190J2419J5118K3315L0156K7399K4764
17628B06362K3557J9410J7146M955k563n743j1332j4721k8700l1180k8172k2281
17616A26738j7224k0985k1454j7002q072o300o069k100M20k566m438p456K3M503
17602A8018M92l156k37k800j464q79o69M439L62l523l382j36m692P4K574K802
17586G823p482o549L806P2j606J399N723J755K604R77k729l65j417L380J657Q92
17570I940l731r17M897Q64j078m101m624n239L561M496k984K419K205o03l58Q72
17554E619J815q89O03l851m501j980N789j97j793m80l446K434O49J138P38N76
$$ plain form
17538 2224 -1154 -6128 -3860 2873 -178 -827 -4475 -7373 -11944 -11518 -9077 -9924 -12763 -10396 -7580
17523 -7580 -4658 -1415 -1726 1212 331 -1822 -3482 -4934 -7718 -10019 -1853 1144 -1590 -3688 -3050
17508 -3050 -995 1988 1409 514 723 338 -493 700 1224 1617 3470 1344 1877 1970 -1093 -4246 -1644
17491 -1644 1643 -1763 -1774 -2922 -1011 -3958 -8350 440 7881 10086 11202 10860 6990 1248 -736
17476 -736 1897 -3268 -7158 -6307 -2709 2661 4458 2481 -655 -6063 71 3209 -849 -5301 -547
17461 -547 -835 -2066 -757 1434 3512 4209 -1316 -1776 1397 -1315 -4959 -1159 1909 -4 739 8541
17445 8541 9475 11214 22349 30122 42095 52182 47727 40405 33317 27472 20284 14242 6971 4899
17431 4899 8285 7915 7650 8570 5383 6538 2036 -3114 1742 1213 1934 3157 5030 5147 5678 4529
$$ packed form
17538B224l378m974K268O733l051o49l648k898m571M26K441q47k839K367K816
17523g580K922L243l11K938q81k153j660j452k784k301Q166K997k734k098O38
17508c050K055K983n79q95K09l85q31J193N24L93J853k126N33R3l063l153K602
17491a644L287l406j1j148J911k947m392Q790P441K205J116l42l870n742j984
17476g36K633n165l890Q51L598N370J797j977l136n408O134L138m058m452M754
17461e47k88j231J309K191K078O97n525m60L173k712l644L800L068j913P43P802
17445H541R34J739J1135P773J1973J0087m455p322p088n845p188o042p271k072
17431D899L386l70k65R20l187J155m502n150M856n29P21J223J873J17N31j149
$$ plain form
17415 4529 3588 1618 1843 676 602 5010 3770 1255 3571 2733 -1719 -39 -736 -3978 -3215 -49
17399 -49 4829 7144 4965 4124 209 1218 3494 2103 -2001 -5518 -3854 -3861 -5259 -3108 -4549 -5218
17383 -5218 1107 405 -3384 -3787 -1814 -4530 -8111 -11383 -14929 -14775 -11734 -7628 -3715 -6743 -9196
17368 -9196 -6523 -7318 -8076 -8306 -11014 -15796 -12971 -11607 -9797 -8681 -6987 -3156 -6163 -6601 -5134 -5606
17352 -5606 -5420 -6754 -12554 -14495 -10963 -7409 -2826 -1124 -1488 -520 -415 -1428 -1538 -6339 -7033 -5901
17336 -5901 -4307 -4534 -6507 -8779 -6483 -5730 -4151 -3888 -4731 -5462 -2993 -1237 3062 4067 3096 514
17320 514 -4627 -7127 -3756 -1170 -3897 -5398 -4595 -7167 -9576 -4114 415 808 1022 -653 -2149 -3231
17304 -3231 -2112 511 -9474 -14560 -5984 1154 1221 2322 193 -3009 -6341 -9196 -10804 -10142 -10986 -10518
$$ packed form
17415D529r41j970K25j167p4M408j240k515K316q38m452J680o97l242P63L166
17399d9M878K315k179q41l915J009K276j391m104l517J664pj398K151j441o69
17383e218O325p02l789m03J973k716l581l272l546J54L041M106L913l028k453
17368i196K673p95p58k30k708m782K825J364J810J116J694L831l007m38J467m72
17352e606J86j334n800j941L532L554M583J702l64R68J05j013j10m801o94J132
17336e901J594k27j973k272K296P53J579K63q43p31K469J756M299J005r71k582
17320E14n141k500L371K586k727j501Q03k572k409N462M529L93K14j675j496j082
17304c231J119K623r985n086Q576P138O7J101k129l202l332k855j608O62q44M68
$$ plain form
17288 -10518 -8747 -8536 -6313 -2839 1094 2031 1929 -2266 -4241 -5169 -1570 1414 -2 -3215 -449
17273 -449 6741 7890 3475 3174 -1197 -7336 -5967 -3231 761 3774 2354 -1425 -3742 -3378 -2672 -3934
17257 -3934 -4958 -2261 -766 4103 6251 7052 8062 5639 2980 316 4333 7815 6669 4734 2743
17242 2743 -2434 -2051 -4375 -6658 -3444 4036 -418 -8291 -7882 -6838 -3959 -2570 -1627 -2608 -5456 -4799
17226 -4799 -6066 -292 7723 9302 874 -2416 -2469 -119 1892 4493 2816 9 -420 -2265 556
17211 556 -490 1976 7709 10233 5837 2182 -324 -739 2771 3567 2861 486 -6805 -10316 -9665 -12742
17195 -12742 -16422 -21494 -14107 -8679 -8898 -8521 -8158 -4419 -3650 -5925 -7036 -4702 -3576 -4708 -9097
17180 -9097 -7394 -6417 -6723 -8092 -5461 -2376 -861 -720 283 -517 -1118 -307 1144 -598 -2735 282
$$ packed form
17288a0518J771K11K223L474L933R37j02m195j975r28L599K984j416l213K766
17273d49P190J149m415l01m371o139J369K736L992L013j420l779k317L64P06j262
17257c934j024K697J495M869K148Q01J010k423k659k664M017L482j146j935j991
17242B743n177L83k324k283L214P480m454p873M09J044K879J389R43r81k848O57
17226d799j267N774Q015J579q428l290n3K350K011K601j677k807m29j845K821
17211E56j046K466N733K524m396l655k506m15L510P96p06k375p291l511O51l077
17195a2742l680n072P387N428k19L77L63L739P69k275j111K334J126j132m389
17180i097J703R77l06j369K631L085J515J41J003q00o01Q11J451j742k137L017
$$ plain form
17164 282 4644 5452 2580 -1988 1787 398 -5881 -2382 -334 702 -968 -2769 -1835 1705 -1529
17149 -1529 -6531 -4208 -5670 -6186 -7329 -5343 -2067 -6588 -9717 -11229 -6435 -7251 -11778 -12801 -10826
17134 -10826 -3249 -1537 1514 4580 2522 1667 2421 -1101 901 3430 5742 7141 6712 717 -2959
17119 -2959 -5755 -8495 -7009 -3737 -2593 194 -147 -1780 -5975 -10779 -7213 -2134 -2790 -9769 -12308
17104 -12308 -9743 -10722 -9106 -6173 -7621 -7893 -7976 -2929 -2565 -1063 -1751 329 -1088 -2147 -3368 207
17088 207 2728 4837 2730 -910 -1443 -4326 -6396 -7895 -3717 -4543 -11115 -10879 -5198 -7915 -3267 -2345
17072 -2345 875 1541 -333 -4392 -6022 -8025 -4700 -7195 -9496 -5601 -2784 -2525 -2851 853 3033
17057 3033 5170 6082 -1049 -8245 -10263 -6453 -1024 1006 2454 -1041 212 -2812 -4704 -6598 -7413
$$ packed form
17164B82M362Q08k872m568L775j389o279L499K048J036j670j801R34L540l234
17149a529n002K323j462n16j143J986L276m521l129j512M794q16m527j023J975
17134a0826P577J712L051L066k058q55P54l522K002K529K312J399m29n995l676
17119b959k796k740J486L272J144K787l41j633m195m804L566N079o56o979k539
17104a2308K565r79J616K933j448k72q3N047L64J502o88K080j417j059j221L575
17088B07K521K109k107l640n33k883k070j499M178q26o572K36N681k717M648R22
17072b345L220O66j874m059j630k003L325k495k301L895K817K59l26L704K180
17057C033K137R12p131p196k018L810N429K030J448l495J253l024j892j894q15
$$ plain form
17042 -7413 -6568 -6476 -7209 -10043 -8895 -3047 2777 -2086 -2688 403 5866 5289 7054 4727 -51 -2884
17026 -2884 -2298 232 6331 8714 9106 3624 359 2153 1708 -3948 -5680 -2583 2272 99 -245 -2025
17010 -2025 -5937 -10173 -10917 -8635 -5652 -3937 -5216 -6465 -1861 -1010 -2416 -2904 -2840 -3547 -5493 -6311
16994 -6311 -4532 -5466 -4945 -3540 -9583 -10549 -8346 -3797 -2024 -5280 -8261 -11084 -10317 -8531 -1681 -2953
16978 -2953 -7537 -8662 -14164 -8507 -1887 -2011 -4790 -4490 -4247 -3040 -1739 -4200 -5268 -6255 -7351 -6461
16962 -6461 384 -1534 -1497 -3733 -6989 -7286 -5979 -2257 1583 2876 2827 -670 -6042 -9771 -6222 -3566
16946 -3566 -2874 -1718 -6830 -8376 -5730 -6697 -1516 2973 -2756 -3473 -4407 -4014 -939 -2236 -4546 -6192
16930 -6192 -3470 -637 -5064 -856 -1885 -5247 -8869 -11513 -11342 -15290 -13563 -6844 -188 860 1642
$$ packed form
17042g413Q45R2p33k834J148N848N824m863o02L091N463n77J765k327m778k833
17026b884N86K530O099K383L92n482l265J794m45n656j732L097M855k173l44j780
17010b025l912m236p44K282K983J715j279j249M604Q51j406m88O4p07j946q18
16994f311J779r34N21J405o043r66K203M549J773l256k981k823P67J786O850j272
16978b953m584j125n502N657O620j24k779L00K43J207J301k461j068r87j096Q90
16962f461O845j918L7k236l256k97J307L722L840J293m9l497n372l729L549K656
16946c566O92J156n112j546K646r67N181M489n729p17r34L93L075j297k310j646
16930f192K722K833m427M208j029l362l622k644J71l948J727O719O656J048P82
$$ plain form
16915 1642 -1612 -6962 -8717 -6896 -6141 -4943 -2982 -7799 -10695 -4821 -2570 2456 6552 647 1111
16900 1111 327 1807 5767 1360 390 791 2479 5634 4320 1737 1543 4203 4484 4910 7121 2381
16884 2381 -877 -4835 -7221 -7791 -5764 -3847 918 806 1738 3463 124 132 982 4241 4057 604 -2175
16867 -2175 -5486 -2233 1252 1288 -1600 -7071 -9635 -8295 -7115 -4104 2238 -14 -3441 -8212 -8994
16852 -8994 -500 3463 1725 951 -367 1366 2293 -215 -3196 -6791 -5420 1099 2738 -740 465
16837 465 650 -3597 -2058 3552 4925 4511 1355 302 181 -90 -6168 -7231 -6016 -3745 -3416 -32
16821 -32 848 -580 1490 2392 657 951 1043 -646 -925 785 1615 474 -2192 -2289 -3928 -5352 -3786
16804 -3786 -2821 -4239 -4995 282 -1357 -1931 2370 4112 2653 -1654 -1490 -3336 -2158 -1007 -117 -2755
$$ packed form
16915A642l254n350j755J821P55J198J961m817k896N874K251N026M096n905M64
16900A111p84J480L960m407r70M01J688L155j314k583j94K660K81M26K211m740
16884B381l258l958k386n70K027J917M765j12R32J725l339QQ50L259j84l453k779
16867b175l311L253L485L6k888n471k564J340J180L011O342k252l427m771p82
16852h994Q494L963j738p74j318J733R27k508k981l595J371O519J639l478J205
16837D65J85m247J539N610J373m14l156j053j21k71o078j063J215K271L29L384
16821c2Q80j428K070R02j735K94R2j689k79J710Q30j141k666r7j639j424J566
16804c786R65j418p56N277j639n74M301J742j459m307J64j846J178J151Q90k638
$$ plain form
16788 -2755 -4840 -3147 -3487 -6934 -5114 -2262 -2727 -3103 -5548 -5440 798 978 -2347 -2204 1738 984
16772 984 -1607 -2771 -5754 -2067 -1308 957 2041 2036 926 980 7804 6011 5845 2596 -1889 -3927 -1255
16755 -1255 -1115 -4734 -2205 -441 -4298 -6925 -6533 -858 -1164 -4259 -3137 -2003 147 -1815 -2194 -332
16739 -332 1247 -29 297 2980 1594 -3869 -5966 -9235 -13207 -15271 -6614 143 -258 -592 -2372 -6744
16723 -6744 -1328 343 -1694 -2562 -5275 -7455 -4475 -6572 -8954 -6625 -6552 -8318 -6968 -4331 -3286
16708 -3286 -5303 -5046 -541 4146 3901 2075 2516 3728 5981 6445 6924 5836 5908 5977 4688 618 -1931
16691 -1931 -2040 -3611 -6363 -5598 -5231 -5569 -4141 -5092 -6312 -6840 -2714 810 412 1138 2273 3209 3145
16674 3145 1088 -348 1082 -1921 -3709 -4789 -6564 -12504 -15386 -12337 -9335 -8743 -5905 -9742 -3983
$$ packed form
16788b755k085J693l40l447J820K852m65l76k445J08O238J80l325J43L942p54
16772I84k591j164k983L687P59K265J084nj110N4O824j793j66l249m485k038K672
16755a255J40l619K529J764l857k627L92N675l06l095J122J134K150j962l79J862
16739c32J579j276L26K683j386n463k097l269l972k064Q657O757m01l34j780m372
16723f744N416J671k037q68k713k180K980k097k382K329P3j766J350K637J045
16708c286k017K57M505M687k45j826M41J212K253M64M79j088P2O9j289m070k549
16691a931j09j571k752P65L67l38J428r51j220n28M126L524l98P26J135R36o4
16674C145k057j436J430l003j788j080j775n940k882L049L002N92K838l837N759
$$ plain form
16659 -3983 -1844 -7711 -7281 -4910 -4080 -5939 2517 8046 3410 285 -587 -51 75 -3862 -3860 677 5027
16642 5027 5075 9176 8557 3604 996 -5475 -6175 -4272 -7275 -10327 -7545 -7453 -5292 166 1530 795
16626 795 -3094 -3904 -5051 -6078 -3790 -5480 -8005 -5349 -2043 865 -3614 -7818 -7593 -4130 -1419
16611 -1419 64 1061 -1755 -3595 -4311 -9447 -10444 -12149 -7684 -9150 -7621 -8533 -9069 -11998 -11770 -4908
16595 -4908 -3718 -5568 -6562 -8320 -4470 440 3423 3320 1017 534 -1249 -3183 -2453 -5024 -1000 1345
16579 1345 269 1055 5497 3211 -4528 -6537 -6797 -5861 -4159 -2456 -3877 -5804 -4062 -7218 -9874
16564 -9874 -15523 -13632 -9357 -7060 -9321 -9704 -8604 -9987 -7776 -4514 -1606 1252 1820 1079 -945
16549 -945 -4598 -5848 -10440 -15740 -9918 -3241 -5863 -4149 -2088 -6765 -5246 -720 -2390 -2428 -1926 1647
$$ packed form
16659c983K139n867M30K371Q30j859Q456N529m636l125q72N36J26l937KM537M350
16642E027M8M101o19m953k608o471p00J903l003l052K782R2K161N458J364p35
16626G95l889q10j147j027K288j690k525K656L306K908m479m204K25L463K711
16611a419J483R97k816j840p16n136r97j705M465j466J529r12n36k929K28O862
16595d908J190j850r94j758L850M910K983j03k303m83j783j934P30k571M024K345
16579A345j076P86M442k286p739k009k60R36J702J703j421j927J742l156k656
16564i874n649J891M275K297k261l83J100j383K211L262K908K858N68p41k024
16549i45l653j250m592n300N822O677k622J714K061m677J519M526j670l8N02L573
$$ plain form
16533 1647 1262 -3007 -7054 -6121 -2626 165 -345 -936 -1321 -836 1174 2640 -627 1466 -368 -2832
16517 -2832 -1755 427 2462 -578 -4224 -5189 -4758 -7507 -6513 -7239 -4347 -2385 -6596 -4294 -1395 -1621
16501 -1621 -1800 -1812 -5288 -7995 -4856 2766 4027 2053 -193 -524 -2166 -3418 -5134 -3340 -2764 641
16485 641 3340 -322 -5352 -3381 -3509 -3672 -680 2540 1712 -458 -2615 -5867 -9846 -7422 -6569 -8762
16469 -8762 -7954 -7183 -5092 -213 -1574 10 -95 4793 7870 8989 4716 3599 4057 2086 330 -9374
16453 -9374 -6437 -5379 -5304 -4976 -5232 -4768 -5099 -10172 -9414 -9991 -9863 -2312 2621 -1833 -4562 -5431 -6135
16436 -6135 -4121 -5811 -5446 -4601 -2061 3855 5664 5720 6936 5855 -1539 48 1179 468 -175 -919
16420 -919 -3709 -3177 -3918 -5414 -3168 -5238 -3874 -2772 -2265 -2436 -3005 -1974 3194 8282 10523 4428
$$ packed form
16533A647l85m269m047R33L495K791n10n91l85M85K010J466l267K093j834k464
16517b832J077K182K035l040l646r65M31k749R94p26K892J962m211K302K899k26
16501a621j79j2l476k707L139P622J261j974k246l31j642j252j716J794N76L405
16485F41K699l662n030J971j28j63K992L220q28k170k157l252l979K424Q53k193
16469h762Q08P71K091M879j361J584j05M888L077J119m273j117M58j971j756r704
16453i374K937J058P5L28k56M64l31n073P58n77J28P551M933m454k729q69p04
16436f135K014j690L65Q45K540N916J809N6J216j081p394J587J131p11o43p44
16420i19k790N32p41j496K246k070J364J102N07j71n69J031N168N088K241o095
$$ plain form
16404 4428 2447 5169 2851 -4791 -7031 -4395 -3320 79 2080 -2692 -4400 -1792 -2215 -5601 -2965
16389 -2965 -3491 -4476 -2723 410 -1216 -3697 -7876 -5056 -4157 -4896 -1595 3046 6597 2152 -4742 -8607
16373 -8607 -7617 -6917 -8780 -8406 -5392 -5398 -6993 -6770 -5888 -4947 -3277 -7340 -9842 -7706 -350 3045 2868
16356 2868 2821 579 -1205 -4485 -6483 -5504 -3148 -2846 -4246 -8326 -8965 -5469 -2483 473 -1876 -3433
16340 -3433 -7012 -11466 -11121 -9399 -9725 -12354 -17836 -20395 -19769 -14900 -14821 -9400 -5043 -3426 537 -321
16324 -321 -1521 2963 3242 6112 6507 1476 -759 -1025 -1533 -2521 -2135 1276 918 -4519 -528 2517 4130
16307 4130 2156 255 -6218 -9079 -7510 -5335 -2572 -158 2723 986 423 572 2434 1043 1387
16292 1387 3179 2731 -1844 -8529 -9768 -7154 -4342 2354 3735 -1171 -1442 1302 5792 975 -239
$$ packed form
16404D428j981K722k318p642k240K636J075L399K001m772j708K608m23l386K636
16389b965n26r85J753L133j626k481m179K820Q99p39L301M641L551m445o894l865
16373h607R90P00j863L74L014oj595K23Q82R41J670m063k502K136P356L395j77
16356B868m7k242j784l280j998R79K356L02j400m080o39L496K986K956k349j557
16340c433l579m454L45J722l26k629n482k559O26M869P9N421M357J617L963q58
16324c21j200M484K79K870L95n031k235k66n08r88L86L411l58n437L991L045J613
16307D130j974j901o473k861J569K175K763K414K881j737n63J49J862j391L44
16292A387J792m48m575o685j239K614K812O696J381m906k71K744M490m817j214
$$ plain form
16277 -239 -2864 -6668 -3986 -1885 -363 -1212 -1738 -1555 -4734 -8041 -7184 -7433 -6481 -3591 -127 -189 -5360
16260 -5360 -5141 -4489 -7339 -5873 -5991 -6191 -2592 2795 4284 3028 -3002 -4288 -3082 312 5481 -365
16244 -365 -5709 -5674 -4578 -4079 -7114 -4607 -8426 -10420 -5811 -6254 -6957 -8111 -4158 -3731 -8108 -6980
16228 -6980 -3472 -3524 -3195 -2589 -2969 -74 -1022 -5377 -1747 3135 5007 2761 4668 7411 6421 2481
16212 2481 -828 -3580 -2202 -3699 -2832 -5146 -9030 -7136 -4560 -4296 -6113 -6725 -9607 -11382 -15915
16197 -15915 -14096 -6701 -4480 -1385 2515 3391 2697 1710 3947 8876 8705 6080 -899 -4837 -6245
16182 -6245 -5052 -4443 -2619 -1888 -8416 -8511 -7520 -7827 -8789 -10880 -8459 -5125 -6412 -7178 -7646 -1268 2641
16165 2641 -1999 -7032 -9218 -6233 -4185 -5030 -7494 -3233 -121 -4030 -5958 -4496 -4410 -237 2064
$$ packed form
16277b39k625l804K682K101J522q49n26J83l179l307Q57k49R52K890L464o2n171
16260e360K19O52k850J466j18k00L599N387J489j256o030j286J206L394N169n846
16244c65n344L5J096M99l035K507l819j994M609m43p03j154L953M27m377J128
16228f980L508n2L29O06l80K895r48m355L630M882J872k246J907K743r90l940
16212B481l309k752J378j497Q67k314l884J894K576K64j817o12k882j775m533
16197a5915J819P395K221L095L900Q76o94r87K237M929j71k625o979l938j408
16182f245J193O09J824P31o528r5R91l07r62k091K421L334j287p66m68O378L909
16165B641m640n033k186K985K048q45k464M261L112l909j928J462Q6M173K301
$$ plain form
16150 2064 -1609 -4625 -7063 -7968 -4338 -869 404 2460 -3818 -5087 -5874 -495 6683 5719 4478
16135 4478 3636 6099 6712 4401 849 -2245 -5216 -3089 424 3671 7688 3730 564 1002 4648
16120 4648 6385 4142 -1170 950 2629 2140 -1212 411 -319 -7104 -7675 -4723 -3420 -7218 -1698
16105 -1698 -4701 214 710 -531 1951 2588 -346 -3805 -5312 -5320 -5336 -7785 -6881 -7073 569 3103 5370
16088 5370 7196 4417 -546 -3744 -5542 -5785 -3152 113 4089 1450 -3157 -3669 -2757 -1659 -3865
16073 -3865 -330 4248 3144 -173 1149 1454 1113 -1474 -5953 -2746 -1433 -2818 -5791 -882 1893
16058 1893 -5230 -10218 -9437 -8676 -7948 -5929 -4412 -3839 700 5634 8400 6471 2993 -630 -2680 -818
16042 -818 2265 -1499 -5409 -4351 -3016 -1195 -1603 -2909 -2444 -2394 2098 6022 908 -4796 -4928 -2247
$$ packed form
16150B064l673l016k438r05L630L469J273K056o278j269p87N379P178r64j241
16135D478q42K463O13k311l552l094k971K127L513L247M017l958l166M38L646
16120D648J737k243n312K120J679m89l352J623p30o785n71K952J303l798N520
16105a698l003M915M96j241K482O37k934l459j507qj6k449R04j92P642K534K267
16088E370J826k779m963l198j798k43K633L265L976k639m607n12R12J098k206
16073c865L535M578j104l317J322L05l41k587m479L207J313j385k973M909K775
16058A893p123m988P81P61P28K019J517N73M539M934K766j929l478l623k050J862
16042h18L083l764l910J058J335J821m08j306M65N0M492L924n114n704j32K681
$$ plain form
16026 -2247 -3147 -3061 -6118 -7132 -6548 -1759 -1082 1726 352 -8663 -12135 -12617 -10375 -6341 -3863 -811
16010 -811 -8050 -8828 -6110 -6578 -4599 -113 67 192 -894 -3200 -621 -106 -3299 -8366 -6184 -1679
15994 -1679 2960 4979 7157 4895 3853 2013 6666 6617 -2598 -8324 -12972 -9297 -7514 -5557 -1359
15979 -1359 -2177 -4124 -3749 -6293 -6731 -7651 -7049 -11096 -7943 -3357 -1888 -1245 426 642 1660 3081
15963 3081 1152 336 -1231 -858 -1678 -7886 -6843 -1849 2886 3054 760 -3488 -4121 -6032 -10836 -10876
15947 -10876 -8450 -3579 2471 1697 2179 -1540 -7869 -2915 623 -1592 -6530 -442 1326 -580 -2265
15932 -2265 -926 6014 8257 1081 -139 -850 -5555 -7710 -3545 2930 3363 1443 1249 992 -3747 -7164
15916 -7164 -6193 -1620 492 -2176 -4591 -5089 -6961 -5871 -3829 -4088 -5864 -6621 -7407 -7218 -6823 -3298
$$ packed form
16026b247r00Q6l057j014N84M789O77K808j374r015l472m82K242M034K478L052
16010h11p239p78K718m68J979M486J80J25j086k306K579N15l193n067K182M505
15994a679M639K019K178k262j042j840M653m9r215n726m648L675J783J957M198
15979a359q18j947L75k544m38r20O02m047L153M586J469O43J671K16J018J421
15963C081j929q16j567L73q20o208J043M994M735J68k294m248o33j911m804m0
15947a0876K426M871O050p74M82l719o329M954L538k215m938O088J768j906j685
15932b265J339O940K243p176j220p11m705k155M165O475M33j920j94k57m739l417
15916g164R71M573K112k668k415m98j872J090K042k59j776p57p86J89L95L525
$$ plain form
15900 -3298 -400 691 1843 1415 -2354 -1352 1296 3461 24 1351 8021 8815 5593 -995 -5096
15885 -5096 -7855 -6092 -6706 -11909 -16392 -12533 -6324 -5721 -7414 -4862 183 1161 -33 -3125 -2869 1038
15869 1038 -92 -64 1589 3632 5725 2388 3138 1692 -3431 -10411 -8980 -4838 -1760 732 -110 2374
15853 2374 4597 1168 -4034 -3450 -177 1926 4159 3054 563 -1553 -1520 3129 7266 3718 833
15838 833 -540 3792 2814 -3114 -3849 -569 1044 2415 -3392 -7122 -5183 -5197 -2516 -1 -2808 -8841
15822 -8841 -7054 -70 6529 8568 4231 6083 4050 3926 4384 659 -553 -76 -2469 -897 -2778
15807 -2778 639 318 -1684 -6266 -6763 278 1718 268 3406 4951 -1001 -6433 -3664 -2017 -770
15792 -770 -1309 -952 981 3970 2263 2212 658 -7838 -6447 -7945 -4835 -610 2598 1205 2766 2731
$$ packed form
15900c298K898J091J152m28l769J002K648K165l437J327O670P94l222o588m101
15885e096k759J763o14n203m483L859O209O03j693K552N045R78j194l092K56L907
15869A038j130K8J653K043K093l337P50j446n123o980J431M142L078K492q42K484
15853B374K223l429n202N84L273K103K233j105k491k116L3M649M137l548k885
15838H33j373M332r78n928p35L280J613J371n807l730J939j4K681K515k807o033
15822h841J787O984O599K039m337J852k033j24M58l725j212M77k393J572j881
15807b778L417l21k002m582m97P041J440j450L138J545n952n432K769J647J247
15792g70n39L57J933K989j707n1j554q496J391j498L110M225L208j393J561l5
$$ plain form
15776 2731 3232 7498 7958 8271 3307 -6373 -10276 -8003 -8203 -13177 -11276 -5368 -4909 -4707 -650 -5359
15760 -5359 -3780 944 -1264 -1415 -757 1596 -1469 -5783 -5877 -2535 3016 5407 5211 3204 2854 5105
15744 5105 2764 4933 1198 -529 -2706 -4698 751 1143 319 1826 4870 7270 4964 -1750 -1642
15729 -1642 1139 4079 -1198 -2828 -1508 -4547 -3406 -2379 -6757 -10529 -10941 -4193 -1033 2526 3538
15714 3538 1780 3406 4231 4434 5308 6270 5356 -1600 -441 -2001 -2169 5573 6435 2442 462 1091 -2013
15697 -2013 -2302 -3120 -6655 -6912 -5703 -2961 -3161 -839 -4429 -7472 -1444 -851 1484 2702 1222 -391
15681 -391 1060 810 3338 2779 2360 573 -3336 2265 2992 2226 -2753 -7131 -9573 -5863 -2670 1488
15665 1488 942 307 2488 2154 3232 2466 4426 3018 689 1517 1675 -1424 -1379 -2552 2248 4581 4936
$$ packed form
15776B731N01M266M60L13m964r680l903K273k00m974J901N908M59K02M057m709
15760e359J579M724k208j51O58K353l065m314r4L342N551K391j96k007l50K251
15744E105k341K169l735j727k177j992N449L92q24J507L044K400k306o714J08
15729a642K781K940n277j630J320l039J141J027m378l772m12O748L160L559J012
15714C538j758J626Q25K03Q74R62r14o956J159j560j68P742Q62l993j980O29l104
15697b013k89q18l535k57J209K742k00K322l590l043O028N93K335J218j480j613
15681c91J451k50K528n59m19j787l909N601P27p66m979m378k442L710L193M158
15665A488n46o35K181l34J078p66J960j408k329Q28J58l099M5j173M800K333L55
$$ plain form
15648 4936 3450 1876 -350 -2113 -5649 -7147 -7009 -11313 -11422 -10180 -9394 -7426 -1814 2685 6151
15633 6151 6345 489 -2439 -1536 -3348 -6174 -6151 -3348 -3154 -1704 -5163 -7366 -5068 -261 765 -2435
15617 -2435 -1640 6598 4277 3410 5021 6561 2111 -3671 -8297 -4424 -4088 -8585 -4647 -1640 -4338
15602 -4338 -9061 -12096 -16031 -11393 -3757 -5037 -5462 -7456 -5868 -3031 -4236 -3436 1654 7192 3624
15587 3624 4155 5871 5507 3010 664 -1313 473 -563 -4415 -1677 1721 2767 4938 5585 6444 3064
15571 3064 266 374 348 -4696 -6069 -6524 -4879 -2499 -4600 -4403 -651 5665 9601 6359 359 1382
15555 1382 -4100 -5751 -2119 446 -1187 -5159 -190 2571 -3693 -6722 -6452 -8408 -8609 -10509 -13551
15540 -13551 -14776 -12490 -11033 -10396 -9790 -3541 -2889 -4242 -6270 -7009 -4333 -7810 -7748 -4725 -1389 -1576
$$ packed form
15648D936j486j574k226j763l536j498J38m304j09J242P86J968N612M499L466
15633F151J94n856k928R03j812k826K3K803J94J450l459k203K298M807J026l200
15617b435P95Q238k321q67J611J540m450n782m626L873L36m497L938L007k698
15602d338m723l035l935M638P636j280m25j994J588K837j205Q00N090N538l568
15587C624N31J716l64k497k346j977J786j036l852K738L398J046K171O47Q59l380
15571C064k798J08k6n044j373m55J645K380k101J97L752O316L936l242o000J023
15555A382n482j651L632K565j633l972M969K761o264l029K70j956k01j900l042
15540a3551j225K286J457O37O06O249O52j353k028p39K676l477O2L023L336j87
$$ plain form
15524 -1576 -3489 -4304 -2942 -2789 -5637 -4793 -1309 -936 -2300 799 8047 6363 4688 3539 2154 4131
15508 4131 4350 5525 2642 -276 -9141 -12854 -10765 -6099 -363 78 -1988 -1425 -954 -2527 -6195 -7031
15492 -7031 -7242 -4125 -2093 676 2158 1443 1126 -15 1603 -1097 -2834 408 1018 1449 800 -3447
15476 -3447 -7016 -10934 -10891 -6899 1579 3354 2924 1841 3777 5448 1896 -247 1218 -3564 -7753
15461 -7753 -5414 -2767 -2998 -3955 -3690 -4266 -4940 -3011 568 -419 -1077 3739 1923 -2556 -4498 -1395
15445 -1395 -3866 -4464 253 4303 4138 -739 -2228 -163 -953 -490 -3084 -6543 -3368 -5527 -3388 -201
15429 -201 -4182 -1984 1882 7496 10816 9249 7504 2691 -8859 -12608 -10808 -6825 -4134 -289 1067
15414 1067 2748 1568 2100 30 -4141 -7221 -12439 -11006 -4425 -3001 -4819 -5475 -5976 -4138 -4104 -3082
$$ packed form
15524a576j913q15J362J53k848Q44L484L73j364L099P248j684j675j149j385J977
15508D131K19J175k883k918q865l713K089M666N736M41k066N63M71j573l668q36
15492g031k11L117K032K769J482p15l17j141J618k700j737L242O10M31o49m247
15476c447l569l918M3L992Q478J775m30j083J936J671l552k143J465m782m189
15461g753K339K647k31r57K65n76o74J929L579r87o58M816j816m479j942L103
15445a395k471n98M717M050j65m877j489K065p90M63k594l459L175k159K139L187
15429b01l981K198L866N614L320j567j745m813j1550l749J800L983K691L845J356
15414A067J681j180N32k070m171l080n218J433O581J424j818o56n01J838L4J022
$$ plain form
15398 -3082 -2112 881 95 1039 3278 5050 4495 2152 -2901 -3369 -3425 -304 -3582 -10477 -6032 2576
15382 2576 6517 3102 2140 6092 10017 10123 2858 2748 2499 880 4245 5154 8868 10994 5681 3629
15366 3629 4213 4008 3728 4468 861 2218 -1299 -7460 -4253 878 -811 -2579 -4570 -2409 2099 2014
15350 2014 -2211 -5520 -119 2183 5120 5747 142 -9805 -7485 -908 -795 -3183 -3675 -4978 -8625
15335 -8625 -7459 -4677 -4479 -4870 -8659 -10566 -5083 -5023 -2708 -410 -5022 -8888 -7900 -3091 -449 150
15319 150 -3743 -2129 -3014 -2178 -861 -1125 -5147 -5876 -9848 -7213 -6379 -9066 -3910 -928 -3265 -3867
15303 -3867 -4873 -3836 -4381 -4964 -1287 -225 -6222 -4270 1943 6091 6326 3094 -85 -287 -4206 -5327
15287 -5327 -1181 5148 2455 2106 1700 1070 3641 159 309 5623 3994 622 -1149 -1349 4874 6638
$$ packed form
15398c082R70K993p86R44K239J772n55k343n053m68n6L121l278o895M445Q608
15382B576L941l415r62L952L925J06p265j10k49j619L365R09L714K126n313k052
15366C629N84k05k80P40l607J357l517o161L207N131j689j768j991K161M508q5
15350B014m225l309N401K302K937O27n605r947K320O577J13k388m92j303l647
15335h625J166K782J98l91l789j907N483O0K315K298m612l866R88M809K642N99
15319A50l893J614q85Q36J317k64m022p29l972K635Q34k687N156K982k337o02
15303c867j006J037n45n83L677J062n997J952O213M148K35l232l179k02l919j121
15287e327M146O329k693l49m06o30K571l482J50N314j629l372j771k00O223J764
$$ plain form
15271 6638 4088 1946 5173 1599 614 233 583 2697 -2567 -5087 -3985 -5009 -2238 1137 3521
15256 3521 2890 -466 -854 -74 -1188 -367 6455 110 -2595 -4383 -10490 -14547 -11716 -6645 -3204 -3912
15240 -3912 -4135 -4517 -4938 -6079 -3836 -1788 -1244 -3142 -3637 -2534 -5079 -4839 -645 3150 1641 -4722
15224 -4722 -8497 -6684 -5579 -4109 -1240 -3158 -3967 -2759 1239 4237 5938 3843 -1400 -45 3767
15209 3767 5772 4496 2275 860 5371 7271 4765 4398 4210 2969 4777 9631 14875 14126 9676
15194 9676 5920 4056 6309 7311 4101 6694 7261 4214 5143 6640 6544 6622 5611 -129 -3212 -1230
15178 -1230 3546 5240 3929 4790 2607 2680 4168 3421 -1928 -9864 -8706 -164 1195 100 -5192 -2259
15162 -2259 -4269 -5135 -5255 -8464 -6842 -9163 -7910 -6119 -5458 -3717 -1477 2044 5086 4549 5625 3658
$$ packed form
15271F638k550k142L227l574r85l81L50K114n264k520J102j024K771L375K384
15256C521o31l356l88P80j114Q21O822o345k705j788o107m057K831N071L441p08
15240c912k23l82m21j141K243K048N44j898m95J103k545K40M194L795j509o363
15224d722l775J813J105J470K869j918q09J208L998K998J701k095n243J355L812
15209C767K005j276k221j415M511J900k506l67j88j241J808M854N244p49m450
15194I676l756j864K253J002l210K593N67l047R29J497r6P8j011n740l083J982
15178a230M776J694j311Q61k183P3J488p47n349p936J158Q542J359j095n292K933
15162b259k010q66j20l209J622k321J253J791O61J741K240L521L042n37J076j967
$$ plain form
15146 3658 -356 -3574 -2712 -678 -3788 -2693 -4594 -2748 3759 2914 3198 832 -128 870 195 767
15130 767 -1518 -4421 -3750 1092 3325 659 320 720 1690 5893 7151 11762 13460 7782 4666 4981
15114 4981 5879 2114 -5413 -2455 -3332 -5027 252 1614 -1449 -1826 -1018 406 -2878 -5143 -8653 -7375
15098 -7375 -4938 -730 -168 -3630 -4704 -3955 -4435 -1353 466 420 -1376 2694 5601 6246 7498 4798
15082 4798 2447 4565 5242 4031 35 -625 -3814 -2993 -1106 -1419 467 1509 4003 1161 -2389 -2947
15066 -2947 -4825 -4828 -2564 -1417 -1655 -737 -300 1064 -784 -402 662 2335 2627 1976 1159 322 -815
15049 -815 -561 -2217 -1620 1362 816 2773 4651 2885 4915 -351 -274 -1093 -243 370 2461 4398 2222
15032 2222 1581 4987 6704 8469 8611 5475 1612 -636 532 761 3317 888 -1800 -2248 -546 -3579
$$ packed form
15146C658m014l218Q62K034l110J095j901J846O507q45K84k366r60R98o75N72
15130G67k285k903O71M842K233k666l39M00R70M203J258M611J698n678l116L15
15114D981Q98l765p527K958q77j695N279J362l063l77Q08J424l284k265l510J278
15098g375K437M208N62l462j074P49m80L082J819m6j796M070K907O45J252k700
15082D798k351K118O77j211l996o60l189Q21J887l13J886J042K494k842l550n58
15066b947j878lK264J147k38R18M37J364j848L82J064J673K92o51q17q37j137
15049h15K54j656N97K982n46J957J878j766K030n266P7q19Q50O13K091J937k176
15032B222o41L406J717J765J42l136l863k248J168K29K556k429k688m48J702l033
$$ plain form
15016 -3579 -6582 -2547 -2106 -1757 -2389 -3617 -2938 -3926 -5414 -4021 -2825 -2488 491 1584 3929 4699
15000 4699 3942 6820 4386 4073 4967 1206 2742 5627 2921 -848 485 8535 10565 5743 5634 7550
14984 7550 6945 4890 -220 -242 -981 378 569 -4510 -12599 -10900 -6697 -1194 4218 6050 5221 7070
14968 7070 1214 1211 -2507 143 4971 3731 3470 3716 548 1394 2348 208 17 1217 1525 -1001 -108
14951 -108 2679 4770 3128 3574 3422 1995 5191 7010 4521 2716 1897 3331 4626 7432 4206 5215
14935 5215 3242 6650 5105 3501 2882 3592 6807 2832 -3781 -6172 -2485 269 -1362 -7318 -5538
14920 -5538 -6379 -7706 -5833 -3182 -2423 -1258 973 290 2159 2045 4628 5225 -833 2562 6850 2128
14904 2128 -2667 -3647 1526 5791 3164 375 -815 667 1218 -582 341 436 1033 -146 -3693 -1433
$$ packed form
15016c579l003M035M41L49o32j228O79r88j488J393J196L37K979J093K345P70
15000D699p57K878k434l13Q94l761J536K885k706l769J333Q050K030m822j09J916
14984G550o05k055n110k2p39J359J91n079q089J699M203N503N412J832q29J849
14968G070n856ll718K650M828j240k61K46l168Q46R54k140j91J200L08k526Q93
14951a08K787K091j642M46j52j427L196J819k489j805q19J434J295K806l226J009
14935E215j973L408j545j604o19P10L215l975o613k391L687K754j631n956J780
14920e538q41j327J873K651P59J165K231o83J869j14K583N97o058L395M288m722
14904B128m795r80N173M265k627k789j190J482N51j800R23R5N97j179l547K260
$$ plain form
14888 -1433 526 -3127 -2376 -1978 1886 3118 3619 5429 1347 902 308 3580 3546 -1902 -5112 -5842 -4474
14871 -4474 2506 5196 3175 -262 -250 1481 5275 3464 330 2310 5023 5581 5360 6473 7431 7237
14855 7237 6568 -718 -3399 -4540 -396 -425 -5068 -523 1156 202 -859 -1068 -2562 -7935 -4990 -6921
14839 -6921 -10397 -7592 -5384 -1226 4106 2213 -231 3502 6236 8562 7441 -1102 -3718 515 7734
14824 7734 10466 5940 4615 3429 -4274 -5237 2903 4778 1092 -2176 -3137 -2909 794 2292 4172
14809 4172 2953 -937 -2215 -515 -1500 -1097 4075 1843 -2159 6721 10609 6425 6254 4562 -1400
14794 -1400 -1187 2765 4886 594 -1715 1623 541 -5275 -6202 -2899 -1173 2479 3659 518 2749
14779 2749 4142 2536 1746 3033 2393 2877 4659 3885 4917 6556 2340 3951 -97 266 2419 2219
$$ packed form
14888a433J959l653P51L98L864J232N01J810m082m45n94L272l4n448l210p30J368
14871d474O980K690k021l437J2J731L794j811l134J980K713N58k21J113R58j94
14855G237o69p286k681j141M144k9m643M545J679r54j061k09j494n373K945j931
14839f921l476K805K208M158N332j893k444L733K734K326j121q543k616M233P219
14824G734K732m526j325j186p703r63Q140J875l686l268r61K28L703J498J880
14809D172j219l890j278J700r85M03N172k232m002Q880L888m184j71j692n962
14794a400K13L952K121m292k309L338j082n816r27L303J726L652J180l141K231
14779B749J393j606p90J287o40M84J782p74J032J639m216J611m048L63K153k00
$$ plain form
14763 2219 -1730 -1227 -2005 -4507 -4363 -3310 -1275 867 1843 1109 2206 -502 4034 4062 2197 -1802
14747 -1802 -4365 -2225 -1753 -5864 -8207 -4090 -42 -605 1951 7908 6069 4616 1172 -908 -1508
14732 -1508 -370 243 -1072 -1795 6029 9668 5187 5731 3471 4127 9596 4422 2266 -1324 1011 4559
14716 4559 2162 -672 -3680 -2917 -4912 -4887 -6018 -4600 -8331 -12751 -9344 -8394 -7281 -2701 2632 5261
14700 5261 1673 3078 269 -1074 -2747 -5266 -4363 -6203 -4468 -1039 1259 1272 -1041 -813 868 5356
14684 5356 7734 6536 6754 4604 -2821 -3183 -1218 -4446 -6663 -9771 -7812 -254 5989 6043 4260 2563
14668 2563 5387 3486 7536 11685 10743 9094 5378 1795 2254 3436 3372 -495 -526 1773 2099 3087 5843
14651 5843 6530 5797 8810 10008 4177 -4667 -5447 -7647 -9414 -9715 -7343 -2314 1775 977 -1242 -4335
$$ packed form
14763B219l949N03p78k502J44J053K035K142R76p34J097k708M536K8j865l999
14747a802k563K140M72m111k343M117M048n63K556N957j839j453l444k080o00
14732a508J138O13j315p23P824L639m481N44k260O56N469n174k156l590K335L548
14716D559k397k834l008P63j995K5j131J418l731m420L407R50J113M580N333K629
14700E261l588J405k809j343j673k519R03j840J735L429K298J3k313K28J681M488
14684E356K378j198K18k150p425l62J965l228k217l108J959P558O243N4j783j697
14668B563K824j901M050M149r42j649l716l583M59J182o4l867l1K299L26R88K756
14651E843O87p33L013J198n831q844p80k200j767l01K372N029M089p98k219l093
$$ plain form
14635 -4335 -6103 -1475 1291 4159 7494 3476 640 -1800 -338 1081 7826 6620 5284 4090 -1217
14620 -1217 -121 4401 7965 8494 6765 3223 -1412 -5907 -3933 872 3304 6333 2922 2126 98
14605 98 411 1184 1148 -1701 -1198 -72 4929 7534 5186 2462 4077 2015 -2592 -2153 -3876 317 1964
14588 1964 4353 3159 -2532 -6318 -2812 1578 4489 4593 -1024 2450 -2260 -5438 -5759 -5407 259
14573 259 3690 3581 -1938 -6138 -7319 -4119 -2806 -5343 -5157 -4084 181 3128 -130 3542 7119
14558 7119 11508 13022 10349 5050 2860 2586 -2642 -5290 -4973 -7008 -8913 -6318 -3059 -2826 -2520 -5200
14542 -5200 -2440 -2930 -6967 -2941 3314 4687 256 -918 990 35 1465 1525 5102 1819 -1932 -1404
14526 -1404 2838 1895 1264 6342 8237 8253 2987 1928 -392 -1922 1849 1875 771 -621 2346 2038
$$ packed form
14635d335j768M628K766K868L335m018k836k440J462J419O745j206j336j194n307
14620a217J096M522L564N29j729l542m635m495J974M805K432L029l411p96k028
14605I8L13P73l6k849N03J126N001K605k348k724J615k062m607M39j723M193J647
14588A964K389j194n691l786L506M390K911J04n617L474m710l178l21L52N666
14573B59L431j09n519m200j181L200J313k537J86J073M265K947l258L672L577
14558G119M389J514k673n299k190k74n228k648L17k035j905K595L259K33L06k680
14542e200K760m90m037M026O255J373m431j174J908r55J430O0L577l283l751N28
14526a404M242r43o31N078J895J6n266j059k320j530L771K6j104j392K967l08
$$ plain form
14510 2038 1675 -1060 -373 -1973 -328 1279 138 1822 1871 -1304 -1118 2067 2522 2847 3250 5098 6877
14493 6877 8194 5287 3547 741 2409 4974 3109 5646 4178 883 1070 6705 7112 4127 -493
14478 -493 2448 8180 10676 8538 1215 -455 -1824 -3031 -2853 -3415 -2510 -1736 850 5913 7491 5088
14462 5088 5513 6700 5901 8433 7173 6347 7964 4356 1414 7014 10179 11925 10795 12886 7938
14447 7938 7670 4806 6103 5957 5606 5453 7168 7611 2143 -306 483 -917 -2861 -3906 345 5983
14431 5983 7150 8150 3816 -2018 -2177 -3862 -520 1603 1262 1875 3892 3304 987 -5536 -4405 600
14415 600 1317 -228 -661 -3100 -3360 628 1926 -616 1417 6071 7984 4236 3434 4705 7022 5639
14399 5639 1066 -1390 728 2052 -689 -2038 -1287 -4339 -4505 -4644 -5182 -5298 1989 3546 8969 9158
$$ packed form
14510B038l63k735O87j600J645J607j141J684M9l175J86L185M55L25M03J848J779
14493F877J317k907j740k806J668K565j865K537j468l295J87N635M07k985m620
14478d93K941N732K496k138p323j670j369j207J78n62R05P74K586N063J578k403
14462E088M25J187p99K532j260q26J617l608k942N600L165J746j130K091m948
14447G938k68k864J297j46l51j53J715M43n468k449P89j400j944j045M251N638
14431E983J167J000m334n834j59j685L342K123l41O13K017n88k317o523J131N005
14415F00P17j545m33k439k60L988J298k542K033M654J913l748q02J271K317j383
14399E639m573k456K118J324k741j349P51l052j66j39n38j16P287J557N423J89
$$ plain form
14383 9158 6685 7188 8799 2123 -964 5306 7308 8995 3940 2757 1553 3408 2919 4326 4319 1035
14367 1035 5001 7413 3337 1176 2702 4490 1574 221 985 4970 11555 14375 12096 7789 8443
14352 8443 9449 8256 7390 7531 2827 -4657 -4168 -243 1794 1044 1270 1991 2708 3718 4729 4132 1126
14335 1126 114 3583 7769 7789 8138 3347 3660 7410 7558 5974 7910 10655 13855 8257 4619 4308
14319 4308 2034 -299 -495 -725 3780 4590 3220 8363 10182 6865 3614 5172 5491 6289 8417 4516
14303 4516 731 1979 3031 6539 8602 14055 9161 2949 -2469 -2412 1639 3908 1530 864 1727 3087
14287 3087 2791 5816 9052 7007 7969 9648 12939 7605 2280 26 2301 -409 -1408 -2602 102
14272 102 7537 13407 11744 4577 4676 6239 6174 4662 641 1799 3205 6485 13044 7818 4614 4062
$$ packed form
14383I158k473N03J611o676l087O270K002J687n055j183j204J855m89J407pl284
14367A035L966K412m076k161J526J788k916j353P64L985O585K820k279m307O54
14352H443J006j193q66J41m704p484M89L925K037p50K26P21P17J010J011n97l006
14335A126j012L469M186K0L49m791L13L750J48j584J936K745L200n598l638l11
14319D308k274k333j96k30M505Q10j370N143J819l317l251J558L19P98K128l901
14303D516l785J248J052L508K063N453m894o212n418N7M051K269k378o66Q63J360
14287C087k96L025L236k045R62J679L291n334n325k254K275k710r99j194K704
14272A02P435N870j663p167R9J563o5j512m021J158J406L280O559n226l204n52
$$ plain form
14256 4062 7416 4025 9064 13739 12757 14107 10912 9238 9424 6712 8678 6292 1741 3509 3953
14241 3953 2235 4354 6481 2785 1778 3237 -38 3394 5868 9285 6487 10644 10978 10028 13141
14226 13141 11498 10353 6361 4293 5703 10008 10987 13902 11490 4706 2326 2994 2971 3544 -3001 -1948
14210 -1948 5571 4689 6324 8009 8386 6838 1018 -1251 -3074 -1352 -418 -990 201 1889 4913 10476
14194 10476 11711 16381 17620 8138 9836 7368 7293 7476 4952 5662 6997 4054 4699 5367 3751 -2603
14178 -2603 -2133 -1237 476 -400 2761 3014 3793 4422 898 1979 -129 4228 10157 9501 7074 6913 11418
14161 11418 9111 8450 10615 7438 3712 2014 -125 121 -509 490 2341 5850 9435 6740 1656
14146 1656 -74 4167 7629 8773 8421 7018 7064 6008 6173 3326 2751 3298 2743 1761 546 987 3522
$$ packed form
14256D062L354l391N039M675r82J350l195j674J86k712J966k386m551J768M44
14241C953j718K119K127l696j007J459l275L432K474L417k798M157L34r50L113
14226A3141j643j145l992k068J410M305R79K915k412o784k380O68k3N73o545J053
14210a948P519q82J635J685L77j548n820k269j823J722R34n72J191J688L024N563
14194A0476J235M670J239r482J698k468p5J83k524P10J335k943O45O68j616o354
14178b603M70Q96J713q76L161K53P79O29l524J081k108M357N929o56k427j61M505
14161A1418k307o61K165l177l726j698k139K46o30R99J851L509L585k695n084
14146A656j730M241L462J144l52j403M6j056J65k847n75N47n55r82j215M41K535
$$ plain form
14129 3522 2763 3625 5694 4456 3630 5796 7084 4043 4508 2178 712 -605 6168 14926 12408 1437
14113 1437 2551 1894 -63 -1907 -4383 -1302 5294 4385 3158 4971 4068 3472 -3162 -7307 -2276 2232
14097 2232 4657 11510 15548 14672 11947 13631 14220 7794 9759 12953 11325 12368 12475 13497 15373
14082 15373 15309 15322 12547 8763 6119 9771 10455 7004 1490 -1528 5590 14255 12355 15054 14450 14182
14066 14182 7728 -1971 -1706 2407 4201 5327 7267 6106 7203 8515 6030 810 -848 2739 5444
14051 5444 4809 6365 7036 8782 8501 9215 10840 8569 8482 9557 6497 7659 5643 8466 10313 10112
14035 10112 8435 8112 7630 7454 6762 4231 3008 7047 9839 12022 4822 -198 3673 6393 4595
14020 4595 -308 -1868 161 3477 6064 6664 6041 6364 7175 6862 6276 5490 1127 383 4608 3971 3016
$$ packed form
14129C522p59Q62K069j238q26K166J288l041M65k330j466j317O773Q758k518j0971
14113A437J114o57j957j844k476L081O596r09j227J813r03n96o634m145N031M508
14097B232K425O853M038q76k725J684N89o426J965L194j628J043J07J022J876
14082A5373o4J3k775l784k644L652O84l451n514l018P118Q665j900K699o04k68
14066A4182o454r699K65M113J794J126J940j161J097J312k485n220j658L587K705
14051E444o35J556O71J746k81P14J625k271q7J075l060J162k016K823J847k01
14035A0112j677l23m82j76o92k531j223M039K792K183p200n020L871K720j798
14020D595m903j560K029L316K587O00o23L23Q11l13n86p86m363p44M225o37r55
$$ plain form
14003 3016 4538 4534 3843 8258 6516 599 1771 585 3028 6576 9251 10259 10601 10278 8673 3427
13987 3427 1825 5207 4735 987 1292 5488 7410 6195 7011 3941 3177 4935 -938 -2495 2666 6236
13971 6236 3382 1735 5127 5088 1342 890 2336 1995 714 -883 -287 2121 343 -2249 -3536 -2033
13955 -2033 2432 9109 10844 7391 2406 826 2854 7067 7650 6879 6421 6059 6318 7083 3038 -1212
13939 -1212 -2259 -1686 -2068 -2000 -2198 -2260 308 2020 6391 7218 6625 7104 4267 5688 8811 7040 6796
13922 6796 8081 6679 9652 8869 12309 11074 6885 6718 5700 4563 3710 3374 2706 4635 3370 1598
13906 1598 4254 3838 1157 1299 4112 7561 8762 14035 14066 9050 7793 12176 13805 7446 7379 7196
13890 7196 6402 9630 4928 3886 6346 6247 6010 8377 11387 10062 10371 6627 6442 7471 6624 5796 4759
$$ packed form
14003C016J522mo91M415j742n917J172j186K443L548K675J008L42l23j605n246
13987C427j602L382m72l748L05M196J922j215Q16l070p64J758n873j557N161L570
13971F236k854j647L392l9l746m52J446l41j281j597N96K408j778k592j287J503
13955b033M465O677J735l453m985j580K028M213N83p71m58l62K59P65m045m250
13939a212j047N73l82O8j98o2K568J712M371Q27n93M79k837J421L123j771k44
13922F796J285j402K973p83L440j235m189j67j018j137q53l36o68J929j265j772
13906A598K656m16k681J42K813L449J201N273L1n016j257M383J629o359o7j83
13890G196p94L228m702j042K460r9k37K367L010j325L09l744j85J029q47q28j037
$$ plain form
13873 4759 2752 5980 8314 12636 9353 10745 13168 11377 7797 9021 7490 3487 870 276 2135
13858 2135 8407 8985 8321 8459 7654 6475 9252 7160 127 2954 4675 3912 937 6553 7821 6863
13842 6863 4871 5728 4908 2012 11 916 5175 8044 7999 5279 5596 4420 2241 6840 7246 6739 11130
13825 11130 9142 7824 7583 6319 3045 7653 10178 10120 8271 6553 3581 1704 3380 530 2475
13810 2475 8543 15469 20630 16825 14181 10336 11264 12184 16166 14482 10797 9402 9354 10277 6009 3031
13794 3031 3 344 5505 6508 9414 8665 5166 2398 833 -52 2777 8600 12494 12284 14435 15275
13778 15275 12297 7132 8567 4138 3723 1402 -522 5465 4734 7388 8775 4027 3437 1715 2147
13763 2147 -1068 2398 9247 13608 9871 6285 3912 5722 11075 10889 9423 7768 8041 10706 11029
$$ packed form
13873D759k007L228K334M322l283J392K423j791l580J224j531m003k617n94J859
13858B135O272N78o64J38q05j179K777k092p033K827J721p63k975N616J268r58
13842F863j992Q57q20k896k001R05M259K869m5k720L17j176k179M599M06n07M391
13825A1130j988j318k41j264l274M608K525n8j849j718k972j877J676k850J945
13810B475O068O926N161l805k644l845R28R20L982j684l685j395m8R23m268k978
13794C031l028L41N161J003K906p49l499k768j565q85K829N823L894k10K151Q40
13778A5275k978n165J435m429m15k321j924N987p31K654J387m748n90j722M32
13763B147l215L466O849M361l737l586k373J810N353j86j466j655K73K665L23
$$ plain form
13748 11029 8786 4426 1764 4559 5630 10261 13090 14190 15812 13462 8629 8893 7075 8803 8771
13733 8771 4357 903 8389 9270 5285 5015 7579 7248 7603 10810 12679 11749 10212 11346 10085 5534
13717 5534 -2030 -979 3523 4794 6199 5007 3044 5624 104 -1663 2357 7980 9916 11962 11326
13702 11326 10770 10551 8943 7010 2277 7749 11497 11281 11258 9507 7622 7215 10320 11972 12887 12945 12009
13685 12009 9066 10962 12154 10033 7421 1993 1140 -209 1511 3957 3213 5856 11456 10158 6085
13670 6085 5604 6964 9117 9117 8277 7289 7144 5074 7691 8245 6782 3763 8570 13425 13965 14887 11197
13653 11197 9149 9999 6722 8189 11064 11198 9842 6842 7400 9581 9938 13876 21794 24735 23238
13638 23238 16854 10197 10199 12975 4833 4834 7222 5547 3631 5557 5773 7238 3284 3638 8167 7909 6711
$$ packed form
13748A1029k243m360k662K795J071M631K829J100J622k350m833K64j818J728l2
13733H771m414l454P486Q81l985k70K564l31L55L207J869r30j537J134j261m551
13717E534p564J051M502J271J405j192j963K580n520j767M020N623J936K046o36
13702A1326n56k19j608j933m733N472L748k16k3j751j885m07L105J652R15N8r36
13685A2009k943J896J192k121k612n428q53j349J720K446p44K643N600j298m073
13670F085m81J360K153%q40r88j45k070K617N54j463l019M807M855N40R22l690
13653A1197k048Q50l277J467K875J34j356l000N58K181L57L938P918K941j497
13638B3238o384o657KK776q142JK388j675j916J926K16J465l954L54M529k58j198
$$ plain form
13621 6711 10888 7196 8053 9456 7892 2050 1857 7709 10348 7987 6818 10076 12902 12782 12314 10056
13605 10056 6929 8255 7456 4089 3187 6325 1535 -1350 3451 8712 8694 3868 9681 14223 13232 5482
13589 5482 9664 10078 9974 10599 11026 11503 9101 13121 12222 11368 13253 14041 14176 14608 17641 12963 7971
13572 7971 4589 8276 10879 3688 -4050 2940 11843 10224 10805 13695 15784 12948 11246 14470 16793
13557 16793 15058 11129 10399 16024 12954 7850 6369 6839 7648 10063 12397 6386 163 -335 5112
13542 5112 8951 12462 7672 9831 10734 8629 5208 7777 8339 7043 9283 6815 4139 8364 10761
13527 10761 7881 9459 12328 6784 9680 9214 12850 10844 9464 6605 6313 4921 1018 2600 3783
13512 3783 7126 7273 7600 7066 6759 6766 3683 822 1374 6110 6271 6629 7113 3070 3406 5929 6098 5011
$$ packed form
13621F711M177l692Q57J403j564n842j93N852K639k361j169L258K826j20m68k258
13605A0056l127J326p99l367r02L138m790k885M801N261j8m826N813M542r91p750
13589E482M182M14j04O25M27M77k402M020q99q54J885P88J35M32L033m678m992
13572G971l382L687K603p191p738O990Q903j619N81K890K089k836j702L224K323
13557A6793j735l929p30N625l070n104j481M70Q09K415K334o011o223m98N447
13542E112L839L511m790K159R03k105l421K569N62j296K240k468k676M225K397
13527A0761k880J578K869n544K896m66L636k006j380k859k92j392l903J582J183
13512C783L343J47L27n34l07Pl083k861N52M736J61L58M84m043L36K523J69j087
$$ plain form
13494 5011 2072 2113 5802 6557 5590 9743 9176 7084 7081 6072 4388 8778 12647 13135 18404 16166 9995
13477 9995 11412 11124 12446 12033 10571 10117 10235 12876 13879 15741 18147 16346 13451 8720 7085 6093
13461 6093 12462 14931 12177 12073 8889 9078 5134 8219 4372 7348 11716 7667 4098 3186 6977
13446 6977 12654 13166 10212 8901 13399 14287 16081 17810 19308 18268 15316 14000 17085 12779 12501
13431 12501 9700 10946 16857 16602 12289 13914 16478 16997 17973 21263 22946 21231 17994 13660 11584
13416 11584 18534 19738 13965 11424 10319 14537 17797 14162 9041 9310 7751 11817 15452 12265 14180
13401 14180 12420 8049 6422 10337 11056 11813 16522 15511 12884 8600 8301 10354 9497 5615 6228 7361
13385 7361 5746 5711 6315 8802 10768 14770 13571 10895 11541 13099 11045 15324 18268 20721 20675 17425
$$ packed form
13494E011k939M1L689P55r67M153n67k092lj009j684M390L869M88N269k238o171
13477I995J417k88J322m13j462m54J18K641J003J862K406j801k895m731j635r92
13461F093O369K469k754j04l184J89l944L085l847K976M368m049l569r12L791
13446F977N677N12k954j311M498Q88J794J729J498j040k952j316L085m306k78
13431A2501k801J246N911k55m313J625K564N19R76L290J683j715l237m334k076
13416A1584O950J204n773k541j105M218L260l635n121K69j559M066L635l187J915
13401A4180j760m371j627L915P19P57M709j011k627m284k99K053q57l882O13J133
13385G361j615l5O04K487J966M002j199k676O46J558k054M279K944K453m6l250
$$ plain form
13369 17425 13963 13359 14812 17658 14087 13874 10096 5696 1308 7305 12106 9165 11025 11365 11901
13354 11901 11488 7477 10242 13934 10558 9604 10764 11646 17521 16225 17469 15278 9206 8917 11211
13339 11211 12350 13731 14134 14129 17910 21085 15277 10243 13121 15422 14660 12848 11616 4842 5278 5511
13323 5511 6847 6228 6097 5765 4389 9256 14788 15884 14042 17767 20419 20203 19676 19092 17873 15901
13307 15901 14809 19926 19366 15831 15123 14981 17796 17260 17269 10819 9057 10607 16334 20446 22938 18834
13291 18834 14308 12713 7952 10302 11576 13765 15143 16238 15515 16339 13198 9351 5735 3476 6681
13276 6681 10349 9440 6572 6573 8689 12200 11000 12745 17995 19894 18669 18914 18391 16249 16847 15131
13260 15131 18107 20824 19376 14120 10658 10670 11127 13406 20578 24360 24559 22684 26689 28659 26220
$$ packed form
13369A7425l462o04J453K846l571k13l778m400m388N997M801k941J860L40N36
13354A1901m13m011K765L692l376r54J160Q82N875j296J244k191o072k89K294
13339A1211J139J381M03nL781L175n808n034K878K301p62j812j232o774M36K33
13323E511J336o19j31l32j376M867N532J096j842L725K652k16n27n84j219j972
13307A5901j092N117n60l535p08j42K815n36Ro450j762J550N727M112K492m104
13291A8834m526j595m761K350J274K189J378J095p23Q24l141l847l616k259L205
13276F681L668r09k868JK116L511j200J745N250J899j225K45n23k142N98j716
13260A5131K976K717j448n256l462J2M57K279P172L782J99j875M005J970k439
$$ plain form
13245 26220 24077 21517 20249 20609 17569 14226 13147 17560 14314 12430 8740 9388 14325 15950 19110
13230 19110 21704 20822 16926 17996 18460 21135 19661 21733 23921 20068 17152 9219 6881 7356 6181
13215 6181 7153 12423 12650 12900 15461 21658 17106 17062 20122 20457 21496 25907 24240 19072 12824 12004
13199 12004 9100 6707 10155 13692 16299 16755 16669 21311 18875 13094 10383 10758 10025 11302 6810 5354
13183 5354 7509 7077 6072 6954 3203 6657 12165 17303 15635 15451 14703 16316 11506 10920 11509 8493
13167 8493 7476 12176 15189 16195 22081 24232 22509 19605 25042 25394 27406 27653 19380 13982 10841
13152 10841 11087 10619 12236 7987 8637 8752 8080 5907 7622 15068 19347 18114 17093 19131 18349 22106
13136 22106 21783 12904 7026 5818 11821 11705 12939 14671 15682 12050 8023 13250 19995 18479 21714
$$ packed form
13245B6220k143k560j268L60l040l343j079M413l246j884l690O48M937J625L160
13230A9110K594q82l896J070M64K675j474K072K188l853k916p933k338M75j175
13215F181R72N270K27K50K561O197m552m4L060L35J039M411j667n168o248q20
13199A2004k904k393L448L537K607M56q6M642k436n781k711L75p33J277m492j456
13183E354K155m32j005Q82l751L454N508N138j668j84p48J613m810n86N89l016
13167H493j017M700L013J006N886K151j723k904N437L52K012K47q273n398l141
13152A0841K46m68J617m249O50J15o72k173J715P446M279j233j021K038p82L757
13136B2106l23q879n878j208O003j16J234J732J011l632m027N227O745j516L235
$$ plain form
13121 21714 16129 13253 15330 17633 21179 26248 25024 26064 26472 26232 27003 19039 12757 9344 13448
13106 13448 19175 23113 25470 19369 12521 16820 20514 21768 22410 19864 17359 17500 18420 22829 23282
13091 23282 22187 25395 29440 27081 24448 18587 19452 20881 16283 14076 14545 15240 22803 21287 18634
13076 18634 15147 13946 15744 20578 23227 21514 19239 21349 18598 21116 19411 16170 16912 16123 12684
13061 12684 16179 16499 19244 20966 20038 20587 22541 24455 24547 22096 24567 24134 23569 19962 20630 20459 22770
13044 22770 25971 25153 21074 21955 24845 25754 21247 18218 18289 17081 14617 15651 16272 15375 15232 15938 18688
13027 18688 22609 24851 23399 25541 21718 15629 12646 13093 15781 14733 13712 16698 20329 17408 15869
13012 15869 14857 13847 14194 19365 24327 22624 16872 16325 18665 18096 9550 10497 11522 11834 14369 15407
$$ packed form
13121B1714n585k876K077K303L546N069j224J040M08k40P71p964o282l413M104
13106A3448N727L938K357o101o848M299L694J254O42k546k505J41R20M409M53
13091B3282j095L208M045k359k633n861Q65J429m598k207M69O95P563j516k653
13076A8634l487j201J798M834K649j713k275K110k751K518j705l241P42p89l439
13061A2684L495L20K745J722r28N49J954J914R2k451K471m33n65l607O68j71K311
13044B2770L201q18m079Q81K890R09m507l029P1j208k464J034O21q97j43P06K750
13027A8688L921K242j452K142l823o089k983M47K688j048j021K986L631k921j539
13012A5869j012j010L47N171M962j703n752n47K340n69q546R47J025L12K535J038
$$ plain form
12996 15407 15442 15702 18006 17134 13977 10493 12277 13692 13607 18481 16249 10606 10369 15153 18664 20774
12980 20774 20010 15301 15197 14168 13279 16866 21392 21812 16813 14722 15042 15636 19159 17357 18255 15912
12964 15912 19252 23272 19165 18300 19838 21370 17692 14830 15763 13327 17833 25522 26703 22905 19331
12949 19331 15513 16704 16820 16501 16899 18671 18212 22528 22141 24957 24362 18182 16892 16369 16022 17657
12933 17657 21932 19796 18249 20693 19189 19486 18953 19020 17629 20015 24606 21121 22323 25612 24821 29013
12917 29013 25319 19437 19803 18306 19685 21537 18746 14294 10857 11603 12200 12244 13734 13183 8376 8374 14778
12900 14778 18570 20545 20557 19383 20666 23312 23129 20009 24943 25064 24863 19910 18847 21087 23774 24567
12884 24567 20179 16488 15558 14567 19607 20384 15648 7972 14423 16788 16470 20305 21046 19181 16125 15147
$$ packed form
12996A5407L5K60K304q72l157l484J784J415q5M874k232n643k37M784L511K110
12980B0774p64m709j04j029q89L587M526M20m999k091L20N94L523j802Q98k343
12964A5912L340M020m107q65J538J532l678k862R33k436M506P689J181l798l574
12949A9331l818J191J16l19L98J772m59M316l87K816n95o180j290n23l47J635
12933A7657M275k136j547K444j504K97n33O7j391K386M591l485J202L289p91M192
12917B9013l694n882L66j497J379J852k791m452l437P46N97M4J490n51m807kO404
12900A4778L792J975J2j174J283K646j83l120M934J21k01m953j063K240K687P93
12884B4567m388l691r30r91N040P77m736p676O451K365l18L835P41j865l056r78
$$ plain form
12868 15147 17670 19479 22349 27027 28864 30411 27018 25757 24049 20274 20062 23750 22532 24454 20126
12853 20126 18341 19130 21163 17834 15963 14837 14419 12311 13756 18409 17361 16050 18369 19763 21156
12838 21156 22130 16060 13571 17786 19749 16029 20130 28126 25089 27636 30444 25511 19925 18232 15129
12823 15129 13488 16428 19152 20202 21684 22533 27820 30485 26773 23133 20108 19567 18469 19544 25439
12808 25439 24159 24586 23871 25851 26444 26435 26658 24565 21516 21251 18282 17647 16516 16674 23489 25804 27917
12791 27917 24166 24316 20556 20841 23614 26534 27170 24708 24381 25591 27105 26538 27030 27388 26179 26921
12775 26921 26849 27626 34762 34577 30818 28966 22500 18285 20459 21538 20756 19889 18888 16945 21979 18241
12759 18241 14921 18874 25009 26601 30430 31011 23849 20160 17040 17352 20306 21135 20505 19733 16601 15304
$$ packed form
12868A5147K523J809K870M678J837J547l393j261j708l775k12L688j218J922m328
12853B0126j785P89K033l329j871j126m18k108J445M653j048j311K319J394J393
12838B1156R74o070k489M215J963l720M101P996l037K547K808m933n586j693l103
12823A5129j641K940K724J050J482Q49N287K665l712l640l025n41j098J075N895
12808B5439j280M27p15J980N93rK23k093l049k65k969o35j131J58O815K315K113
12791B7917l751J50l760K85K773K920O36k462l27J210J514n67M92L58j209P42
12775B6921p2P77P136j85l759j852o466m215K174J079p82q67j001j943N034l738
12759A8241l320L953O135J592L829N81p162l689l120L12K954Q29o30p72l132j297
$$ plain form
12743 15304 10053 14666 18174 18652 22798 25467 23042 16387 18212 22861 22728 20639 22585 22127 23845
12728 23845 20075 18363 19310 21564 27407 35202 33110 31159 27703 20576 18719 19694 19703 19177 22318 22862
12712 22862 23594 25072 24172 21414 22535 26441 26764 24091 25190 22597 24847 21534 18879 21933 23248
12697 23248 20605 24698 29591 31923 27461 27906 25323 21013 21248 25566 27623 30993 28305 23124 17626
12682 17626 9654 10472 18678 20836 22255 22765 25039 28150 31516 31854 29329 29062 30536 31577 29213
12667 29213 25077 23538 26553 30564 29816 30088 27425 28130 31436 32269 31434 34045 34736 33092 29980 24914
12651 24914 25943 28716 27887 26528 23894 25120 28872 26547 19769 20822 23483 24193 25840 21170 20439
12636 20439 22152 18601 15430 19708 22725 24041 26541 24677 22714 20057 18989 22178 23509 22581 26946
$$ packed form
12743A5304n251M613L508M78M146K669k425o655J825M649j33k089J946m58J718
12728B3845l770j712R47K254N843P795k092j951l456p127j857R75Rn26L141N44
12712B2862P32J478r00k758J121L906L23k673J099k593K250l313k655L054J315
12697B3248k643M093M893K332m462M45k583m310K35M318K057L370k688n181n498
12682A7626p972Q18Q206K158J419N10K274L111L366L38k525k67J474J041k364
12667B9213m136j539L015M011p48K72k663P05L306Q33q35K611O91j644l112n066
12651B4914J029K773q29j359k634J226L752k325o778J053K661P10J647m670p31
12636B0439J713l551l171M278L017J316K500j864j963k657j068L189J331r28M365
$$ plain form
12621 26946 33580 36716 31728 30322 30748 27441 25188 25058 29076 29637 29276 29135 29007 28509 25929 23090
12605 23090 25527 26962 29833 31806 28532 23135 25498 28994 31553 31289 31095 30437 30448 33843 31842 32311
12589 32311 31027 33225 35430 36088 38414 33947 32884 34940 32743 29130 34176 35305 33307 30245 31243
12574 31243 38389 37598 31222 28782 27548 24414 26055 30418 29846 30630 34507 34333 34030 37905 32774 28431
12558 28431 29708 28826 32805 35191 41454 46517 51268 57017 61468 64891 63358 58133 50543 39443
12544 39443 32721 27462 26398 31941 35368 39801 38457 39492 37402 34973 34638 32717 36550 35486 30391
12529 30391 28987 30780 31264 32634 35910 36418 36178 37040 37334 36359 33821 28065 30436 30366 27810 24289
12513 24289 22726 22069 21012 26129 29880 32977 32880 35620 38236 40170 39713 43184 50032 52281 50805
$$ packed form
12621B6946O634L136m988j406M26l307k253j30M018N61l61j41j28m98k580k839
12605B3090K437J435K871J973l274n397K363L496K559k64j94o58J1L395k001M69
12589C2311j284K198K205O58K326m467j063K056k197l613N046J129j998l062R98
12574C1243P146p91o376k440j234l134J641M363n72P84L877j74l03L875n131m343
12558B8431J277q82L979K386O263N063M751N749M451L423j533n225p590j1100
12544C9443o722n259j064N543L427M433j344J035k090k429l35j921L833j064n095
12529C0391j404J793M84J370L276N08k40Q62K94r75k538n756K371p0k556l521
12513B4289j563o57j057N117L751L097r7K740K616J934m57L471O848K249j476
$$ plain form
12498 50805 52341 44167 35039 30655 28958 26489 23711 31244 36028 38833 39883 39193 44443 43025 34062
12483 34062 28984 23794 27507 31283 32548 34936 36008 35255 32052 35990 39006 35717 32509 29936 25985
12468 25985 23268 24852 26258 29590 36087 35280 30617 29666 35091 41204 39888 37901 35518 35317 35270 32436
12452 32436 31277 31520 31198 28608 23827 27596 31586 31810 34372 35151 35029 35435 31349 29553 33299 33983
12436 33983 33841 34072 39623 42904 39226 38316 33814 28511 31611 31419 35193 38849 37185 31018 26975
12421 26975 27184 32932 37492 41214 42835 45996 50368 60649 76500 91416 102841 110331 112683 106475
12407 106475 92761 80795 67707 54495 45977 43301 41871 36625 34516 38261 37592 33670 29586
12394 29586 28808 29499 30177 31583 34416 33771 35805 36021 31802 32635 34166 34921 36134 33800 33713 35632 33679
$$ packed form
12498E0805J536q174r128m384j697k469k778P533M784K805J050o90N250j418q963
12483C4062n078n190L713L776J265K388J072p53l203L938L016l289l208k573l951
12468B5985k717J584J406L332O497q07m663r51N425O113j316j987k383k01m7k834
12452C2436j159K43l22k590m781L769L990K24K562P79j22M06m086j796L746O84
12436C3983j42K31N551L281l678r10m502n303L100j92L774L656j664o167m043
12421B6975K09N748M560L722J621L161M372J0281J5851J4916J1425P490K352o208
12407A06475j3714j1966j3088j3212q518k676j430n246k109L745o69l922m084
12394B9586p78O91O78J406K833o45K034K16m219Q33J531P55J213k334q7J919j953
$$ plain form
12377 33679 33512 31696 26047 24032 25049 26626 25869 30338 32926 32302 31727 32545 34766 33759 32036 30561
12361 30561 30337 27209 27932 32071 34028 29893 27547 29261 34030 31357 29849 28069 28674 30491 34993
12346 34993 33854 38031 33295 26276 21267 23354 27888 27957 27843 29218 28359 29033 28435 29889 29572 31163
12330 31163 29608 27530 28491 27765 30088 35072 39400 43349 43384 42728 39807 33837 33828 36560 39742 37351
12314 37351 35653 34810 31798 31912 37488 36719 29376 29682 34412 34519 32399 30718 31807 34360 31659 35699
12298 35699 42570 47265 47389 43593 40334 41417 45294 44989 40332 37468 43365 42970 39220 35956 37724
12283 37724 42189 40440 37561 41183 41359 41685 41447 41834 38808 35708 32141 34736 40855 42597 43345 45228
12267 45228 49020 47519 41110 36479 35503 36551 36193 34165 33764 38120 42554 41383 43897 45850 44179
$$ packed form
12377C3679j67j816n649k015J017J577p57M469K588o24n75Q18K221j007j723j475
12361C0561k24l128P23M139J957m135k346J714M769k673j508j780O05J817M502
12346C4993j139M177m736p019n009K087M534O9j14J375q59O74n98J454l17J591
12330C1163j555k078R61p26K323M984M328L949L5o56k921n970rK732L182k391
12314C7351j698q43l012J14N576p69p343L06M730J07k120j681J089K553k701M040
12298C5699O871M695J24l796l259J083L877l05m657k864N897l95l750l264J768
12283C7724M465j749k879L622J76L26k38L87l026l100l567K595O119J742P48J883
12267D5228L792j501o409m631r76J048l58k028m01M356M434j171K514J953j671
$$ plain form
12252 44179 49376 48312 47343 45649 43256 40456 40418 35407 35763 36782 39949 39256 42545 43072 42979 44856
12236 44856 43136 37307 36340 35909 33901 34999 35491 37984 40637 37669 38278 37648 37843 37391 35100 33926
12220 33926 40182 42072 46569 48354 47148 40722 41133 39142 36157 42355 44502 41030 39002 41231 42378
12205 42378 41345 40378 39122 40764 42024 41845 42870 38454 36569 38470 40876 37660 37385 36286 35745
12190 35745 31547 33753 40090 42470 42224 43761 48450 49476 47543 45329 47692 51961 52579 53775 46538
12175 46538 46256 44331 40195 42552 44720 41372 43401 41728 42242 44622 46853 47855 43809 40424 44701
12160 44701 46823 47282 48730 48926 47227 43487 45264 46398 43383 47213 45818 40942 42204 49512 49138
12145 49138 48959 50781 50176 46039 43869 43850 42428 42957 41835 37337 33361 37117 41244 43955 49020 50424
$$ packed form
12252D4179N197j064r69j694k393k800l8n011L56J019L167o93L289N27r3J877
12236D4856j720n829r67m31k008J098M92K493K653k968O09o30J95m52k291j174
12220C3926O256J890M497J785j206o426M11j991k985O198K147l472k028K229J147
12205D2378j033r67j256J642J260j79J025m416j885J901K406l216k75j099n41
12190C5745m198K206O337K380k46J537M689J026j933k214K363M269O18J196p237
12175D6538k82j925m136K357K168l348K029j673N14K380K231J002m046l385M277
12160D4701K122M59J448J96j699l740J777J134l015L830j395m876J262P308l74
12145D9138j79J822o05m137k170j9j422N29j122m498l976L756M127K711N065J404
$$ plain form
12129 50424 47642 51299 55339 55295 49534 45921 42344 39644 37210 39744 42721 44833 46007 41202 41554
12114 41554 39778 40727 44732 46014 42628 39339 38921 35502 33690 31962 35887 45486 47930 51352 58584
12099 58584 59770 56343 57886 57202 52606 54409 53044 51059 51214 51410 55454 53018 45921 47654 50840
12084 50840 50920 52489 54504 52629 51630 53950 50892 50367 48459 46882 51471 58303 56979 57391 57735 58090
12068 58090 59342 56945 54516 56995 55347 50915 47804 46987 46950 48597 53032 56837 63438 62765 58298
12053 58298 57822 58359 63200 65078 59637 56992 54389 55290 57533 57360 55031 56538 57044 62322 64463 65446
12037 65446 64134 58129 55050 56996 60644 60492 62116 62250 57974 57894 57070 58058 53590 52583 50892 48667
12021 48667 52960 55218 55064 52756 50506 51932 56879 57988 53435 45849 44331 45361 47950 51171 50196
$$ packed form
12129E0424k782L657M040m4n761l613l577k700k434K534K977K112J174m805L52
12114D1554j776R49M005J282l386l289m18l419j812j728L925R599K444L422P232
12099E8584J186l427J543o84m596J803j365j985J55J96M044k436p097J733L186
12084E0840Q0J569K015j875r99K320l058n25j908j577M589O832j324M12L44L55
12068E8090J252k397k429K479j648m432l111q17l7J647M435L805O601o73m467
12053E8298m76N37M841J878n441k645k603R01K243j73k329J507N06N278K141R83
12037F5446j312o005l079J946L648j52J624J34m276q0q24R88m468j007j691k225
12021D8667M293K258j54k308k250J426M947J109m553p586j518J030K589L221r75
$$ plain form
12006 50196 51844 51771 53382 53446 57320 57514 56248 54350 50784 53465 57342 59388 60304 55090 53618 53057
11990 53057 55947 56096 52887 52586 51045 47993 49524 50350 50536 51527 54782 53703 52112 51061 57870 63358
11974 63358 65014 64651 64691 66692 69096 67605 68449 67276 66935 65947 63564 63030 62419 60242 62439 60048
11958 60048 60006 63324 61135 54578 57522 57372 55074 52505 55124 56549 58956 62984 67254 69981 75421
11943 75421 77679 75377 71504 71166 66015 60625 58370 58776 55348 53443 55282 59095 65043 66824 64162
11928 64162 65323 67049 64854 63458 61507 55803 53089 45993 41637 44302 39887 35673 33083 33639 33524
11913 33524 32813 35768 32636 36460 40352 43822 47634 48368 53269 65442 70362 67374 66257 66965 64189
11898 64189 57435 52305 54294 52221 50302 49940 51157 53470 57718 64702 71002 69832 66609 65198 62613
$$ packed form
12006E0196J648p3J611O4L874J94j266j898l566K681L877K046R16n214j472n61
11990E3057K890J49l209l01j541l052J531Q26J86R91L255j079j591j051O809N488
11974F3358J656l63M0K001K404j491Q44j173l41r88k383n34o11k177K197k391
11958F0048m2L318k189o557K944j50k298k569K619J425K407M028M270K727N440
11943G5421K258k302l873l38n151n390k255M06l428j905J839L813N948J781k662
11928F4162J161J726k195j396j951n704k714p096m356K665m415m214k590N56j15
11913C3524p11K955l132L824L892L470L812P34M901J2173M920k988j117P08k776
11898F4189o754n130J989k073j919l62J217K313M248O984O300j170l223j411k585
$$ plain form
11883 62613 61179 63477 61118 57746 49311 49995 53138 54017 56511 57854 58219 59040 61408 63133 61839
11868 61839 61917 63759 63762 59993 62058 62206 63558 67252 71701 68513 62349 56007 52781 53212 53768 57862
11852 57862 58409 56720 57383 56179 56787 58272 60833 62040 61673 62656 65351 61800 60438 58972 57307 55193
11836 55193 55609 53230 53075 51954 49210 50909 52424 52411 51897 56877 64533 65052 66179 62828 62872 61530
11820 61530 58076 57604 59209 57883 57596 54317 53950 55758 57043 60384 64844 67156 62552 62031 59500
11805 59500 60524 66857 67478 65362 63697 67313 70349 72501 73062 69887 69163 71831 73969 72312 70368
11790 70368 72945 74620 69490 64312 68296 67678 67501 71052 71536 66038 65865 63361 62676 68338 72434 75022
11774 75022 78933 80917 78663 82289 82346 76064 74015 75384 73646 74264 73598 70024 75917 75541 73443 75441
$$ packed form
11883F2613j434K298k359l372q435O84L143Q79K494J343L65Q21K368J725j294
11868F1839P8J842Ll769K065J48J352L694M449l188o164o342l226M31N56M094
11852E7862N47j689O63j204O08J485K561J207l67R83K695l551j362j466j665k114
11836E5193M16k379j55j121k744J699J515j3n14M980P656N19J127l351M4j342
11820F1530l454m72J605j326k87l279l67J808J285L341M460K312m604n21k531
11805E9500J024O333O21k116j665L616L036K152N61l175p24K668K138j657j944
11790G0368K577J675n130n178L984o18j77L551M84n498j73k504o85N662M096K588
11774G5022L911J984k254L626N7o282k049J369j738O18o66l574N893l76k098J998
$$ plain form
11758 75441 76133 69990 69045 69320 70654 69561 68116 70607 69555 69401 68543 69322 69311 73555 77235 76775 72393
11741 72393 74013 75180 78042 84335 84225 81194 81184 81786 81309 80264 77554 75509 79102 81445 77851 79082
11725 79082 76283 74621 79930 80851 81742 81213 80469 81352 80539 85224 87935 88576 88587 92342 90142 85107 85268
11708 85268 84291 83949 84204 87868 86965 82334 78075 74342 74673 75988 81538 89202 91257 90992 95200 104048
11692 104048 103554 100821 100056 102985 102738 97829 89532 85776 91548 99164 98552 92556 89395 91482 92449
11677 92449 97300 93189 89463 92981 92454 93130 101311 108120 112795 119769 125224 128020 132276 142114 154517
11662 154517 163193 168249 179131 191499 204962 217814 241385 271874 308887 361760 435361 527464
11650 527464 642361 793400 968305 1157118 1347508 1538283 1705083 1819479 1895059 1927093
$$ packed form
11758G5441O92o143r45K75J334j093j445K491j052j54q58P79j1M244L680m60m382
11741G2393J620J167K862O293j10l031j0O02m77j045k710k045L593K343l594J231
11725G9082k799j662N309R21Q91n29p44Q83q13M685K711O41J1L755k200n035J61
11708H5268r77l42K55L664r03m631m259l733L31J315N550P664K055k65M208Q848
11692A04048m94k733p65K929k47m909q297l756N772P616o12n996l161K087R67
11677I2449M851m111l726L518n27O76Q181O809M675O974N455K796M256R838J2403
11662A54517Q676N056J0882J2368J3463J2852K3571L0489L7013N2873P3601R2103
11650E27464J14897J51039J74905J88813J90390J90775J66800J14396P5580L2034
$$ plain form
11640 1927093 1895025 1790470 1652464 1484032 1290843 1089474 896891 726871 586437 470543
11630 470543 380943 312910 265015 230859 206546 189289 178972 169968 159548 149280 140670 131106
11618 131106 123412 120182 113090 109126 106923 106363 104883 101323 102282 103458 106652 110782 106010 98202 96986
11603 96986 105351 105177 107855 108026 102898 104605 102385 105149 104451 102322 100393 100007 100159 101875 97838 96824
11587 96824 96967 97972 95307 96284 99232 100333 102590 105141 104408 101798 97510 95637 99365 101177 102783
11572 102783 102779 96494 94510 94758 97637 99675 97987 93105 94683 98271 100462 100861 94736 94671 94757 95908
11556 95908 96419 95211 97580 99942 105522 104641 99591 97756 99034 102546 107663 109540 108364 106646 103410
11541 103410 102476 103902 100516 94747 95534 100527 101448 97093 99912 98192 95465 97851 101477 100830 104637
$$ packed form
11640A927093l2068j04555j38006j68432j93189k01369j92583j70020j40434j15894
11630D70543q9600o8033m7895l4156k4313j7257j0317r004j0420j0268q610r564
11618A31106p694l230p092l964k203n60j480l560R59J176L194M130m772p808j216
11603I6986Q365j74K678J71n128J707k220K764o98k129j929l86J52J716m037j014
11587I6824J43J005k665R77K948J101K257K551p33k610m288j873L728J812J606
11572A02783mo285j984K48K879K038j688m882J578L588K191L99o125o5Q6J151
11556I5908N11j208K369K362N580q81n050j835J278L512N117J877j176j718l236
11541A03410r34J426l386n769P87M993R21m355K819j720k727K386L626o47L807
$$ plain form
11526 104637 108695 107965 105718 107443 110080 111398 107084 102395 99326 98688 102835 105042 104767 101365 101001
11511 101001 104507 104678 105189 101351 105261 105393 104728 105178 102910 104918 102965 101663 99585 101489 104108
11496 104108 109399 110993 109383 112096 110415 110506 108951 107021 110471 105495 104491 107896 110163 111209 114685
11481 114685 117761 119585 122343 116721 112437 113300 111699 109681 106771 110776 114951 116524 120093 119997 125444
11466 125444 119598 115080 117620 117574 112430 112355 115388 117264 120963 123432 127376 131016 132377 132496 132388 129969
11450 129969 126315 123247 115772 111349 117136 120936 122212 125710 126584 127400 127659 126810 120278 113095 110364
11435 110364 109330 105443 96385 93289 99758 102704 105974 111342 110823 108627 113888 124008 126902 134699
11421 134699 146682 151155 153396 155742 148202 135052 130379 127125 124237 115366 105065 94763 89359
$$ packed form
11526A04637M058p30k247J725K637J318m314m689l069o38M147K207k75l402l64
11511A01001L506J71N11l838L910J32o65M50k268K008j953j302k078J904K619
11496A04108N291J594j610K713j681R1j555j930L450m976j004L405K267J046L476
11481A14685L076J824K758n622m284Q63j601k018k910M005M175J573L569r6N447
11466A25444n846m518K540m6n144p5L033J876L699K469L944L640J361J19j08k419
11450A29969l654l068p475m423N787L800J276L498Q74Q16K59q49o532p183k731
11435A10364j034l887r058l096O469K946L270N368n19k196N261J0120K894P797
11421A34699J1983M473K241K346p540j3150m673l254k888q871j0301j0302n404
$$ plain form
11408 89359 90120 89674 81499 78271 78353 84278 85708 83289 79565 79031 71496 59072 47354 42855 34010
11393 34010 24709 22113 25923 33226 45266 63211 81616 106676 131792 152213 171915 187835
11381 187835 199655 206217 210007 208141 203577 198055 198646 198712 196817 194028 191309 190946 182889 177594 175445
11366 175445 173205 175612 175120 172004 172640 175969 177935 182840 190588 193203 195831 197816 198140 201986 206272
11351 206272 209627 219701 227375 234371 238743 249094 265625 284347 309625 343226 379275 432152
11339 432152 508212 606663 731517 881702 1051692 1234835 1421324 1602991 1766055 1889553
11329 1889553 1966954 1989232 1958291 1866037 1735983 1571523 1384391 1189106 1008213 842414
11319 842414 697052 576911 480807 408934 354304 318565 295708 279168 269083 257557 252378
$$ packed form
11408H9359P61m46q175l228Q2N925J430k419l724n34p535j2424j1718m499q845
11393C4010r301k596L810P303J2040J7945J8405K5060K5116K0421J9702J5920
11381A87835J1820O562L790j866m564n522N91O6j895k789k719l63q057n295k149
11366A75445k240K407m92l116O36L329J966M905P748K615K628J985L24L846M286
11351B06272L355J0074P674O996M372J0351J6531J8722K5278L3601L6049N2877
11339D32152P6060R8451J24854J50185J69990J83143J86489J81667J63064J23498
11329A889553P7401K2278l0941r2254j30054j64460j87132j95285j80893j65799
11319H42414j45362j20141r6104p1873n4630l5739k2857j6540j0085j1526n179
$$ plain form
11308 252378 246295 239429 233775 227763 220526 213664 207226 201190 192834 188854 189775 184891 182142 178044
11294 178044 175195 177019 175312 172661 172161 168559 172277 178211 181659 185545 182929 183750 185991 186412 190330
11279 190330 191506 192160 192378 194457 194616 194665 195271 192769 188508 184167 181311 181482 188816 191090 188356 191508
11263 191508 196653 195353 195710 196283 196604 195833 198531 203815 204588 202587 200260 201998 201254 206322 210709 210250
11247 210250 211933 215183 217410 225446 230491 233350 232905 237820 240289 237971 235567 234044 229440 225362
11233 225362 221198 213325 207752 201937 194480 192208 190874 188430 183883 183385 184416 188451 191568 198680
11219 198680 204799 207502 212448 218728 220479 219662 216538 218634 217092 219885 216879 217526 219897 223241 223646
11204 223646 222384 219877 225562 228937 233768 240618 244181 248980 255065 263582 272204 285734 305172 321013
$$ packed form
11308B52378o083o866n654o012p237o862o438o036q356l980R21m884k749m098
11294A78044k849J824j707k651n00l602L718N934L448L886k616Q21K241M21L918
11279A90330J176O54K18K079J59M9O06k502m261m341k856J71P334K274k734L152
11263A91508N145j300L57N73L21p71K698N284P73k001k327J738p44N068M387m59
11247B10250J683L250K227Q036N045K859m45M915K469k318k404j523m604m078
11233B25362m164p873n573n815p457k272j334k444m547m98J031M035L117P112
11219A98680O119K703M946O280J751q17l124K096j542K793l006O47K371L344M05
11204B23646j262k507N685L375M831O850L563M799O085Q517Q622J3530J9438J5841
$$ plain form
11190 321013 341538 361283 372983 386434 395566 404760 417206 427285 434486 434736 429899 421751 412055
11177 412055 402813 393108 385252 372390 357224 343988 332046 318204 307021 292129 283159 272303
11165 272303 266875 264955 258409 253378 251821 252219 256263 260563 270927 290855 321819 348799 370367
11152 370367 386681 392213 392830 386217 375590 354869 335054 315995 297756 279403 274901 272476 271626
11139 271626 275726 277895 277826 277808 280123 280715 283976 286322 285864 289913 292553 292805 300691 307810 321639 341776
11123 341776 371078 416145 492206 591140 699239 786391 832332 813394 741952 640779 534120
11112 534120 444168 373778 326453 297752 284973 280610 276775 283183 299362 309481 323869 343352
11100 343352 365397 385147 402226 418496 428213 436736 448161 459363 470764 485882 499134 509710
$$ packed form
11190C21013K0525J9745J1700J3451R132R194J2446J0079P201K50m837q148r696
11177D12055r242r705p856j2862j5166j3236j1942j3842j1183j4892q970j0856
11165B72303n428j920o546n031j557L98M044M300J0364J9928L0964K6980K1568
11152C70367J6314N532O17o613j0627k0721j9815j9059j8239j8353m502k425q50
11139B71626M100K169o9j8K315N92L261K346m58M049K640K52P886P119J3829K0137
11123C41776K9302M5067P6061R8934J08099Q7152M5941j8938p1442j01173j06659
11112E34120q9952p0390m7325k8701j2779m363l835O408J6179J0119J4388J9483
11100C43352K2045J9750J7079J6270R717Q523J1425J1202J1401J5118J3252J0576
$$ plain form
11088 509710 519219 531635 538946 538201 537065 532417 525476 519610 517732 516072 511356 508033 512238 516304
11074 516304 518174 522196 526056 538282 554838 566682 581660 599009 616785 639583 667622 702035
11062 702035 745218 794810 853912 916387 983428 1055571 1119865 1178321 1229691 1264271 1288128
11051 1288128 1291627 1280919 1253821 1216223 1166872 1118585 1076253 1041059 1015620 999883 986897
11040 986897 974861 962176 951287 938089 912689 883811 853580 824481 797486 773012 751823
11029 751823 745483 742530 743803 748099 757972 769310 779671 782148 786768 801483 811477 819851 825831
11016 825831 829720 836092 848352 865665 883048 900164 910834 919463 932996 949993 968372 990332
11004 990332 1008058 1021127 1037360 1058169 1080708 1106856 1139062 1183243 1232521 1290511 1354861
$$ packed form
11088E09710R509J2416P311p45j136m648o941n866j878j660m716l323M205M066
11074E16304J870M022L860J2226J6556J1844J4978J7349J7776K2798K8039L4413
11062G02035M3183M9592N9102O2475O7041P2143O4294N8456N1370L4580K3857
11051A288128L499j0708k7098l7598m9351m8287m2332l5194k5439j5737j2986
11040I86897j2036j2685j0889j3198k5400k8878l0231k9099k6995k4474k1189
11029G51823o340k953J273M296R873J1338J0361K477M620J4715R994Q374N980
11016H25831L889O372J2260J7313J7383J7116J0670Q629J3533J6997J8379K1960
11004I90332J7726J3069J6233K0809K2539K6148L2206M4181M9278N7990O4350
$$ plain form
10993 1354861 1426755 1504581 1580127 1646464 1705658 1752895 1795598 1827509 1853792 1875831 1904536
10982 1904536 1929300 1959252 2001137 2048495 2107591 2167494 2225394 2286525 2343205 2400435 2454653
10971 2454653 2507416 2558089 2603911 2657754 2709790 2772626 2850433 2940232 3051385 3182262 3336560
10960 3336560 3519767 3731820 3967663 4229766 4528460 4870108 5262156 5712439 6230218
10951 6230218 6831047 7524945 8319585 9228731 10256348 11411084 12696164 14121703 15691227
10942 15691227 17418509 19327805 21473879 23954196 26937087 30679216 35617986 42425709
10934 42425709 51914178 64725782 81395781 102638036 128615884 158425315 190386162
10927 190386162 223002886 253525791 280631343 301957522 316508036 322106408 319024075
$$ packed form
10993A354861P1894P7826P5546O6337N9194M7237M2703L1911K6283K2039K8705
10982A904536K4764K9952M1885M7358N9096N9903N7900O1131N6680N7230N4218
10971B454653N2763N0673M5822N3843N2036O2836P7807Q9799J11153J30877J54298
10960C336560J83207K12053K35843K62103K98694L41648L92048M50283N17779
10951F230218O00829O93898P94640R09146J027617J154736J285080J425539J569524
10942A5691227J727282J909296K146074K480317K982891L742129M938770O807723
10934D2425709R488469J2811604J6669999K1242255K5977848K9809431L1960847
10927A90386162L2616724L0522905K7105552K1326179J4550514N598372l082333
$$ plain form
10920 319024075 307547483 288931060 264417323 235507577 204142568 171884635 141223245
10913 141223245 113543188 89635634 69888642 54425883 42738730 34149084 27968553
10906 27968553 23515460 20229872 17704444 15665590 13933234 12410794 11040854 9787953
10898 9787953 8648446 7615807 6701383 5888902 5192684 4611203 4130256 3737985 3416017
10889 3416017 3164719 2963418 2798676 2655083 2523019 2394554 2264504 2138500 2010584
10880 2010584 1877859 1745916 1611651 1480541 1361689 1250119 1142396 1037984 952154 882511
10870 882511 819932 768277 720756 685959 656241 628981 606094 582587 569018 560211 556581 560928
10858 560928 565295 572006 577995 582979 589364 593739 601281 608528 610517 610603 610397 610484 603354 597935 585360
$$ packed form
10920C19024075j1476592j8616423k4513737k8909746l1365009l2257933l0661390
10913A41223245k7680057k3907554j9746992j5462759j1687153q589646o180531
10906B7968553m453093l285588k525428k038854j732356j522440j369940j252901
10898I787953j139507j032639r14424q12481o96218n81481m80947l92271l21968
10889C416017k51298k01301j64742j43593j32064j28465j30050j26004j27916
10880B010584j32725j31943j34265j31110j18852j11570j07723j04412q5830o9643
10870H82511o2579n1655m7521l4797k9718k7260k2887k3507j3569q807l630M347
10858E60928M367O711N989M984O385M375P542P247J989Q6k06Q7p130n419j2575
$$ plain form
10843 585360 583290 592455 612657 643544 686361 750529 835520 947527 1081849 1230051 1380110
10832 1380110 1540714 1702322 1844512 1946134 1999860 2016198 1993750 1924322 1813816 1663075
10822 1663075 1508049 1349214 1185711 1026258 879455 754839 653662 570065 502874 457427
10812 457427 423556 394387 367729 350816 341323 332379 322314 311158 301141 293266 287422 282422
10800 282422 278522 277686 279396 278771 278023 272874 265149 250846 235691 220495 206754 182878 158928
10787 158928 140378 122106 99366 83702 66843 55732 53488 45043 34679 34051 43716 44184 44478
10774 44478 50955 62596 71225 76497 82121 89873 95628 99981 98687 99240 101178 98384 96394 94362
10760 94362 91001 87188 81738 81855 77195 73042 75442 82475 87984 92459 94649 98638 109023 125341
$$ packed form
10843E85360k070R165K0202L0887M2817O4168Q4991J12007J34322J48202J50059
10832A380110J60604J61608J42190J01622N3726J6338k2448o9428j10506j50741
10822A663075j55026j58835j63503j59453j46803j24616j01177q3597o7191m5447
10812D57427l3871k9169k6658j6913r493q944j0065j1156j0017p875n844n000
10800B82422l900q36J710o25p48n149p725j4303j5155j5196j3741k3876k3950
10787A58928j8550j8272k2740j5664j6859j1111k244q445j0364o28R665M68K94
10774D4478O477J1641Q629N272N624P752N755M353j294N53J938k794j990k032
10760I4362l361l813n450J17m660m153K400P033N509M475K190L989J0385J6318
$$ plain form
10746 125341 136939 146985 164368 187447 209422 225741 247388 265396 275184 278519 274972 268113
10734 268113 267546 259765 243689 229143 219019 208142 193820 184713 178602 174588 172048 172936 172870 172023
10720 172023 174783 175596 172969 176259 180587 179719 172458 166899 160423 164108 167617 167828 173574 178265 181684
10705 181684 188715 197329 210501 226156 235536 251273 273315 297093 316790 341560 363865 383357
10693 383357 398129 410865 425807 442357 460938 483262 508889 527683 552297 589138 635279
10682 635279 692731 764909 861671 989247 1116684 1227540 1348455 1499530 1653179 1737979
10672 1737979 1764217 1785539 1808272 1781662 1684988 1552752 1414802 1273687 1114906 949949
10662 949949 800963 670135 550854 448274 371199 313058 267979 236338 213998 200299 187328
$$ packed form
10746A25341J1598J0046J7383K3079K1975J6319K1647J8008R788L335l547o859
10734B68113n67p781j6076j4546j0124j0877j4322r107o111m014k540Q88o6q47
10720A72023K760Q13k627L290M328q68p261n559o476L685L509K11N746M691L419
10705A81684P031Q614J3172J5655R380J5737K2042K3778J9697K4770K2305J9492
10693C83357J4772J2736J4942J6550J8581K2324K5627J8794K4614L6841M6141
10682F35279N7452P2178R6762J27576J27437J10856J20915J51075J53649Q4800
10672A737979K6238K1322K2733k6610r6674j32236j37950j41115j58781j64957
10662I49949j48986j30828j19281j02580p7075n8141m5079l1641k2340j3699j2971
$$ plain form
10651 187328 179504 175524 172964 168599 166468 165726 172166 176188 177393 181645 179603 175245 173331 167818
10637 167818 163041 158113 152677 149305 142481 139632 138374 133905 126512 125391 123550 120883 123452 127242
10623 127242 130716 127237 118989 114836 111328 99112 89865 85669 78345 74579 74846 73778 75790 79478
10609 79478 88103 99983 115018 129265 148366 163729 186050 210190 225049 236393 244888 259489
10597 259489 270645 279074 279198 285712 292356 295371 302750 304995 305930 306736 310011 307175 305334 308255 306497
10582 306497 313959 325553 334781 346902 355868 361520 370802 384475 400601 418478 437480 459844
10570 459844 478043 500943 533698 577204 622764 672539 732074 793461 858951 927948 996837
10559 996837 1063032 1117112 1149814 1171779 1181934 1176478 1151316 1106592 1047256 983602 923435 856426
$$ packed form
10651A87328p824l980k560m365k131p42O440M022J205M252k042m358j914n513
10637A67818m777m928n436l372o824k849j258m469p393j121j841k667K569L790
10623A27242L474l479q248m153l508j2216r247m196p324l766K67j068K012L688
10609G9478Q625J1880J5035J4247J9101J5363K2321K4140J4859J1344Q495J4601
10597B59489J1156Q429J24O514O644L015P379K245R35Q06L275k836j841K921j758
10582C06497P462J1594R228J2121Q966N652R282J3673J6126J7877J9002K2364
10570D59844J8199K2900L2755M3506M5560M9775N9535O1387O5490O8997O8889
10559I96837O6195N4080L2702K1965J0155n456k5162m4724n9336o3654o0167o7009
$$ plain form
10547 856426 794038 735826 684005 642053 610637 587256 574007 558155 547039 541518 548531 555070
10535 555070 566899 579947 598816 614760 626501 640028 655401 676678 697421 722286 757957
10524 757957 789897 830294 889986 959252 1047962 1159432 1303002 1473523 1661610 1868600
10514 1868600 2074649 2267374 2424636 2544082 2616439 2631665 2590686 2502401 2372909 2212225
10504 2212225 2035581 1857435 1686535 1545206 1432863 1345055 1286396 1261547 1256796 1269191
10494 1269191 1292362 1325620 1372015 1416490 1465737 1516462 1565074 1616369 1667337 1727386 1788069
10483 1788069 1845831 1909094 1972716 2033654 2098118 2159174 2208988 2255110 2302493 2351124 2402003
10472 2402003 2456833 2512048 2576021 2658436 2754669 2869843 3008052 3167166 3354566 3576510
$$ packed form
10547H56426o2388n8212n1821m1952l1416k3381j3249j5852j1116n521P013O539
10535E55070J1829J3048J8869J5944J1741J3527J5373K1277K0743K4865L5671
10524G57957L1940M0397N9692O9266Q8710J11470J43570J70521J88087K06990
10514A868600K06049J92725J57262J19446P2357J5226m0979q8285j29492j60684
10504B212225j76644j78146j70900j41329j12343q7808n8659k4849m751J2395
10494A269191K3171L3258M6395M4475M9247N0725M8612N1295N0968O0049O0683
10483A788069N7762O3263O3622O0938O4464O1056M9814M6122M7383M8631N0879
10472B402003N4830N5215O3973Q2415R6233J15174J38209J59114J87400K21944
$$ plain form
10462 3576510 3827805 4114332 4441912 4821281 5255489 5744421 6306328 6952508 7696810
10453 7696810 8544672 9500446 10581813 11798574 13154114 14642287 16287539 18118421
10445 18118421 20180364 22558868 25399777 28953814 33646602 40093225 48864907 60180951
10437 60180951 74455847 92823165 115756958 141587110 168448852 196383021 225049292
10430 225049292 252381760 274548346 290633623 300118645 304025348 301173839 291150356
10423 291150356 273812851 251464946 226310680 199195838 170932231 143013030 117433514
10416 117433514 94856136 75590875 59831384 47492526 38061246 31006403 25814170
10409 25814170 21964129 19026305 16673298 14712164 13022282 11527503 10175044 8958690
$$ packed form
10462C576510K51295K86527L27580L79369M34208M88932N61907O46180P44302
10453G696810Q47862R55774J081367J216761J355540J488173J645252J830882
10445A8118421K061943K378504K840909L554037M692788O446623Q771682J1316044
10437F0180951J4274896J8367318K2933793K5830152K6861742K7934169K8666271
10430B25049292K7332468K2166586J6085277R485022L906703k851509j0023483
10423B91150356j7337505k2347905k5154266k7114842k8263607k7919201k5579516
10416A17433514k2577378j9265261j5759491j2338858r431280p054843n192233
10409B5814170l850041k937824k353007j961134j689882j494779j352459j216354
$$ plain form
10401 8958690 7871445 6909602 6069051 5351003 4745625 4239900 3825307 3492010 3222927
10392 3222927 3004211 2821323 2668520 2538422 2418787 2308903 2208454 2108945 2009242 1913024
10382 1913024 1815362 1710764 1605695 1500038 1395868 1298641 1211203 1128211 1054280 987519
10372 987519 934356 897047 869664 850169 836856 821007 803886 782280 756218 725099 695109
10361 695109 667080 633327 601159 569550 544438 525789 509431 499562 488358 476420 461596 448894
10349 448894 439895 424018 402403 380020 358604 334833 313594 295317 279349 266384 253863 239516
10337 239516 226550 216207 207420 199562 189852 189445 185039 176641 171270 168476 168351 169276 171316 175929
10323 175929 178818 186422 198372 207308 204363 195586 185890 176479 165734 154513 147379 140451 133705
$$ packed form
10401H958690j087245r61843q40551p18048o05378n05725m14593l33297k69083
10392C222927k18716j82888j52803j30098j19635j09884j00449r9509r9703r6218
10382A913024r7662j04598j05069j05657j04170r7227q7438q2992p3931o6761
10372I87519n3163l7309k7383j9495j3313j5849j7121k1606k6062l1119k9990
10361F95109k8029l3753l2168l1609k5112j8649j6358r869j1204j1938j4824j2702
10349D48894q999j5877k1615k2383k1416k3771k1239j8277j5968j2965j2521j4347
10337B39516j2966j0343q787p858r710m07m406q398n371k794j25R25K040M613
10323A75929K889P604J1950Q936k945q777r696r411j0745j1221p134o928o746
$$ plain form
10310 133705 129416 126971 123433 121941 125021 121519 119865 128464 136220 135591 124865 118780 116138 103913
10296 103913 87134 76845 63848 46383 22858 -3488 -23447 -40721 -55840 -70945 -86075
10285 -86075 -99797 -106836 -105220 -109081 -113431 -111255 -111430 -107353 -101178 -95735 -91319 -85220 -79181 -73910
10271 -73910 -65176 -63983 -65765 -64983 -62879 -61601 -59161 -57402 -56559 -58618 -63981 -64623 -59660 -57879 -57522
10256 -57522 -65226 -66803 -65704 -62668 -56289 -49930 -41724 -29706 -18808 -479 20070 36266 50078
10243 50078 65604 79328 93350 97102 100726 99984 96043 89415 87389 83823 74503 70187 59618 50283
10229 50283 42475 32358 27832 27514 27979 27632 25697 28117 27296 32266 35668 35608 37877 45336 52006 60583
10213 60583 71057 85804 106496 133924 175629 236584 309403 401709 504645 613766 726509
$$ packed form
10310A33705m289k445l538j492L080l502j654Q599P756o29j0726o085k642j2225
10296A03913j6779j0289j2997j7465k3525k6346j9959j7274j5119j5105j5130
10285h6075j3722p039J616l861m350K176j75M077O175N443M416O099O039N271
10271g3910Q734J193j782P82K104J278K440J759Q43k059n363o42M963J781L57
10256e7522p704j577J099L036O379O359Q206J2018J0898J8329K0549J6196J3812
10243E0078J5526J3724J4022L752L624p42l941o628k026l566r320m316j0569r335
10229E0283p808j0117m526l18M65l47j935K420q21M970L402o0K269P459O670Q577
10213F0583J0474J4747K0692K7428M1705O0955P2819R2306J02936J09121J12743
$$ plain form
10202 726509 836885 936906 1018310 1074921 1096090 1088333 1051529 977748 878538 771479 662246
10191 662246 546034 437769 347563 268595 201657 151164 112645 81334 58088 41144 27207
10180 27207 15036 4276 -2349 -7435 -12971 -19800 -24922 -30770 -37255 -43028 -46135 -45795 -50043 -55847
10166 -55847 -58817 -60479 -67237 -69667 -70198 -72402 -73962 -73776 -70136 -68657 -63939 -65702 -66920 -66171 -64806
10151 -64806 -67130 -71464 -74807 -73373 -75139 -73826 -79916 -86612 -90184 -90225 -88848 -83807 -79610 -78650 -79600
10136 -79600 -80461 -82278 -81136 -75503 -76359 -75878 -74909 -73419 -66559 -60628 -59558 -63071 -71177 -67067 -66333 -70592
10120 -70592 -76967 -82128 -89581 -93771 -95194 -98470 -108391 -118390 -124305 -129167 -131300 -131646 -130383 -131022 -125861
10105 -125861 -118034 -113325 -113044 -108123 -105118 -98817 -95908 -96804 -96504 -99661 -99506 -95661 -93924 -92441 -97765
$$ packed form
10202G26509J10376J00021Q1404N6611K1169p757l6804p3781r9210j07059j09233
10191F62246j16212j08265r0206p8968o6938n0493l8519l1311k3246j6944j3937
10180B7207j2171j0760o625n086n536o829n122n848o485n773l107L40m248n804
10166e5847k970j662o758k430n31k204j560J86L640J479M718j763j218P49J365
10151f4806k324m334l343J434j766J313o090o696l572m1J377N041M197R60r50
10136g9600q61j817J142N633q56M81R69J490O860N931J070l513q106M110P34m259
10120g0592o375n161p453m190j423l276r921r999n915m862k133l46J263o39N161
10105a25861P827M709K81M921L005O301K909q96L00l157J55L845J737J483n324
$$ plain form
10090 -97765 -95264 -91827 -89139 -88803 -91105 -88871 -88094 -88621 -88071 -85973 -85408 -87793 -85476 -83303 -89115 -89962
10074 -89962 -90277 -90657 -88385 -87901 -91220 -91098 -91649 -90655 -89140 -91341 -89234 -83304 -76599 -74358 -71055 -72660
10058 -72660 -69369 -67455 -64352 -62717 -63127 -57988 -55498 -53971 -46636 -35821 -24301 -13294 -12438 -15989
10044 -15989 -20903 -19817 -22043 -23847 -17169 -4115 12309 23445 35946 53142 78601 115110 171601
10031 171601 241727 319319 424800 555734 702579 859162 1029424 1201711 1360100 1491646
10021 1491646 1586086 1639042 1651376 1619994 1542601 1421957 1277703 1118515 951494 781869
10011 781869 625681 486302 366979 275547 201615 139434 96025 64121 36104 20550 9476
10000 9476 -3126 -9860 -19791 -28988 -34045 -45049 -55317 -62636 -66160 -70250 -67057 -70428 -80675 -86037
$$ packed form
10090i7765K501L437K688L36k302K234P77n27N50K098N65k385K317K173n812q47
10074h9962l15l80K272M84l319J22n51R94J515k201K107N930O705K241L303j605
10058g2660L291J914L103J635m10N139K490J527P335J0815J1520J1007Q56l551
10044a5989m914J086k226j804O678J3054J6424J1136J2501J7196K5459L6509N6491
10031A71601P0126P7592J05481J30934J46845J56583J70262J72287J58389J31546
10021A491646R4440N2956J2334l1382p7393j20644j44254j59188j67021j69625
10011G81869j56188j39379j19323r1432p3932o2181m3409l1904k8017j5554j1074
10000I476j2602o734r931r197n057j1004j0268p319l524m090L193l371j0247n362
$$ plain form
9986 -86037 -85115 -85844 -86976 -92528 -94583 -95964 -99140 -104929 -108487 -107540 -113874 -120291 -124959 -131504 -135659
9971 -135659 -137505 -135893 -132225 -130325 -120856 -108462 -93890 -79382 -66141 -48032 -27322 -7448 7241
9958 7241 20393 25794 33336 38598 39496 37509 32950 21916 12892 4255 -4484 -17515 -25821 -35879
9944 -35879 -42899 -45840 -54358 -65774 -68966 -59934 -47183 -43388 -38339 -33940 -31097 -26217 -23719 -23798 -24934
9929 -24934 -21336 -23390 -31529 -38771 -40882 -49131 -60066 -62702 -63613 -66099 -66784 -60851 -62234 -63285 -67609
9914 -67609 -66779 -65301 -56691 -54482 -61576 -62958 -65026 -67214 -72348 -74601 -73668 -74773 -75998 -74193 -69455
9899 -69455 -71494 -71153 -71307 -75010 -77379 -75930 -77581 -77447 -78009 -80540 -77997 -75743 -75238 -76609 -76637 -76669 -78850
9882 -78850 -75277 -71455 -64291 -67137 -70446 -69243 -69037 -74882 -75015 -72854 -75342 -74844 -71689 -69959 -75040
$$ packed form
9986h6037R22p29j132n552k055j381l176n789l558R47o334o417m668o545m155
9971a35659j846J612L668J900R469J2394J4572J4508J3241J8109K0710J9874J4689
9958G241J3152N401P542N262Q98j987m559j1034r024q637q739j3031q306j0058
9944c5879p020k941q518j1416l192R032J2751L795N049M399K843M880K498p9j136
9929b4934L598k054q139p242k111q249j0935k636r11k486o85N933j383j051m324
9914f7609Q30J478Q610K209p094j382k068k188n134k253R33j105j225J805M738
9899f9455k039L41j54l703k369J449j651J34n62k531K543K254N05j371k8l2k181
9882g8850L573L822P164k846l309J203K06n845j33K161k488M98L155J730n081
$$ plain form
9867 -75040 -78681 -73442 -71067 -71553 -73929 -76796 -75389 -74966 -75259 -75023 -68863 -64394 -61453 -61173 -62114 -63119
9851 -63119 -74160 -70152 -68262 -67552 -70552 -68582 -66377 -70814 -70930 -64454 -59882 -63435 -64071 -62669 -63091
9836 -63091 -63659 -64689 -63828 -66952 -66860 -64521 -65955 -66748 -71016 -73883 -68997 -65308 -66396 -70477 -70800 -72157
9820 -72157 -71432 -68414 -67838 -63819 -62343 -62640 -62813 -64982 -68987 -67766 -68024 -66263 -66255 -63554 -59626 -60810 -67370
9803 -67370 -70250 -73657 -79718 -83272 -78776 -72624 -67140 -67295 -66374 -63309 -62599 -62073 -57960 -56972 -63551 -69730
9787 -69730 -64952 -62751 -65054 -66011 -64151 -65845 -67500 -68315 -66042 -67972 -66038 -62409 -65556 -67750 -70095
9772 -70095 -72943 -73313 -69368 -66323 -64129 -62058 -60981 -62226 -64026 -64207 -59516 -56468 -56804 -60555 -63173
9757 -63173 -65448 -63907 -61854 -60041 -64096 -65372 -61337 -62484 -62519 -60680 -61856 -66392 -67301 -70940 -73361
$$ packed form
9867g5040l641N239K375m86k376k867J407M23k93K36O160M469K941K80r41j005
9851f3119j1041M008J890P10l000J970K205m437j16O476M572l553o36J402m22
9836f3091n68j030Q61l124R2K339j434p93m268k867M886L689j088m081l23j357
9820g2157P25L018N76M019J476k97j73k169m005J221k58J761QK701L928j184o560
9803f7370k880l407o061l554M496O152N484j55R21L065P10N26M113R88o579o179
9787f9730M778K201k303r57J860j694j655q15K273j930J934L629l147k194k345
9772g0095k848l70L945L045K194K071J077j245j800j81M691L048l36l751k618
9757f3173k275J541K053J813m055j276M035j147l5J839j176m536r09l639k421
$$ plain form
9742 -73361 -69244 -67418 -68915 -69235 -67318 -61388 -59621 -62006 -61817 -61781 -62026 -59767 -59308 -59639 -56675 -60543
9726 -60543 -64929 -67850 -67627 -62926 -58560 -52397 -52413 -55815 -58573 -54992 -52702 -53995 -55224 -54017 -55515
9711 -55515 -59156 -57356 -59289 -58420 -57970 -59418 -58213 -53891 -50122 -50401 -53590 -54107 -56170 -61344 -66861 -64543
9695 -64543 -64086 -63653 -56491 -51615 -51054 -54593 -55984 -56265 -59266 -58311 -57484 -56593 -58191 -61075 -62744 -53991
9679 -53991 -52472 -54012 -57492 -57349 -54010 -50240 -51150 -45075 -44123 -46440 -44547 -47149 -53170 -54613 -55344 -58525
9663 -58525 -58790 -57045 -53550 -47881 -49637 -53093 -55738 -56445 -56323 -58412 -60955 -56767 -59539 -58950 -55190 -57182
9647 -57182 -56562 -56077 -57261 -61650 -66917 -66800 -64272 -60792 -62512 -67071 -66111 -64902 -60784 -58699 -58956 -58801
9631 -58801 -64399 -67444 -58916 -58167 -57507 -52507 -50840 -49078 -47668 -51738 -52342 -51394 -48276 -44410 -47637 -52860
$$ packed form
9742g3361M117J826j497l20J917N930J767k385J89L6k45K259M59l31K964l868
9726f0543m386k921K23M701M366O163j6l402k758L581K290j293j229J207j498
9711e5515l641J800j933Q69M50j448J205M322L769k79l189n17k063n174n517K318
9695f4543M57M33P162M876N61l539j391k81l001R55Q27Q91j598k884j669Q753
9679e3991J519j540l480J43L339L770r10O075R52k317J893k602o021j443p31l181
9663e8525k65J745L495N669j756l456k645p07J22k089k543M188k772N89L760j992
9647e7182O20M85j184m389n267J17K528L480j720m559R60J209M118K085k57J55
9631e8801n598l045Q528P49O60N000J667J762J410m070o04R48L118L866l227n223
$$ plain form
9615 -52860 -53639 -51731 -51366 -52836 -49329 -48560 -45323 -45725 -42739 -42834 -51642 -51992 -51088 -53043 -53886 -53038 -47671
9598 -47671 -47910 -47551 -45233 -45337 -46933 -45120 -46756 -46852 -51184 -54818 -51251 -47015 -44973 -43401 -49165 -47846
9582 -47846 -49204 -51298 -51689 -52775 -53624 -51816 -51534 -44964 -42023 -45737 -43729 -43540 -40205 -39978 -46601 -53300
9566 -53300 -47300 -39999 -41644 -47403 -50719 -49927 -48349 -51522 -51037 -47382 -45967 -38788 -37211 -37529 -38788
9551 -38788 -39297 -41710 -42367 -41556 -42901 -41024 -38517 -38339 -37981 -37092 -35112 -38044 -42872 -43247 -39647 -38808 -38977
9534 -38977 -36369 -35586 -38337 -40686 -42664 -39853 -41040 -42502 -42525 -40343 -36161 -32675 -33922 -34711 -32239 -30361
9518 -30361 -28492 -32221 -34888 -35942 -34995 -37072 -41421 -39942 -37899 -42423 -42481 -39546 -34852 -31824 -29799
9503 -29799 -26246 -29259 -32712 -32016 -31653 -33020 -35142 -37366 -39279 -33726 -31185 -30403 -26764 -27480 -21855 -21538
$$ packed form
9615e2860p79J908L65j470L507P69L237m02K986r5q808l50R04j955q43Q48N367
9598d7671k39L59K318j04j596J813j636r6m332l634L567M236K042J572n764J319
9582d7846j358k094l91j086q49J808K82O570K941l714K008J89L335K27o623o699
9566e3300O000P301j645n759l316P92J578l173M85L655J415P179J577l18j259
9551c8788n09k413o57Q11j345J877K507J78L58Q89J980k932m828l75L600Q39j69
9534c8977K608P83k751k349j978K811j187j462k3K182M182L486j247p89K472J878
9518c0361J869l729k667j054R47k077m349J479K043m524n8K935M694L028K025
9503b9799L553l013l453O96L63j367k122k224j913N553K541P82L639p16N625L17
$$ plain form
9487 -21538 -23417 -23642 -23247 -24160 -22430 -21572 -24291 -24117 -26386 -29624 -33688 -36616 -37117 -37413 -40210 -40043 -36237
9470 -36237 -35553 -37836 -36485 -35436 -35150 -34143 -33699 -32397 -27482 -29255 -29259 -25095 -28061 -29145 -28154 -25820
9454 -25820 -24149 -22730 -22819 -18459 -14154 -16584 -25783 -28196 -24165 -24994 -31130 -33153 -29883 -32472 -31785 -31130
9438 -31130 -33677 -36350 -37093 -38410 -40009 -36531 -29241 -25231 -20122 -16559 -16221 -15456 -13994 -9147 -6353
9423 -6353 -4703 -6934 -14920 -16492 -18508 -18361 -16784 -11550 -11298 -10719 -9151 -11430 -11883 -8536 -7306 -4452
9407 -4452 -6511 -6217 -7653 -6609 -7467 -2100 1074 1992 -546 2015 1431 802 5516 9336 8851 11642
9391 11642 16685 15749 13618 12966 16810 25739 25092 20732 18801 18383 19192 21458 19058 19526 28217 29959
9375 29959 31364 34281 36690 37938 39635 41571 46142 49530 49908 51451 53288 52598 63325 67403 70022
$$ packed form
9487b1538j879k25L95r13J730Q58k719J74k269l238m064k928n01k96k797J67L806
9470c6237O84k283J351J049K86J007M44J302M915j773mM164k966j084R91K334
9454b5820J671J419q9M360M305k430r199k413M031q29o136k023L270k589O87O55
9438c1130k547k673p43j317j599L478P290M010N109L563L38P65J462M847K794
9423f353J650k231p986j572k016J47J577N234K52N79J568k279m53L347J230K854
9407d452k059K94j436J044q58N367L174R18k538K561n84o29M714L820m85K791
9391A1642N043r36k131o52L844Q929o47m360j931m18Q09K266k400M68Q691J742
9375B9959J405K917K409J248J697J936M571L388L78J543J837o90J0727M078K619
$$ plain form
9360 70022 71240 71789 73053 76974 83701 87893 94106 99422 105747 109498 111781 121327 130534 131579 132895
9345 132895 140578 150533 156002 161636 165184 168402 175339 186892 196354 208192 219140 228817 236349 244397
9331 244397 255357 268405 284422 294926 307004 317079 327131 345987 366468 380128 397254 419176
9319 419176 438612 451476 468519 489810 509645 520760 528172 545972 557057 561093 573472 589062
9307 589062 603652 611195 616324 619222 616802 610947 603851 597054 592702 582675 571516 558035 546832
9294 546832 532348 518726 502631 490226 471473 452578 436907 421588 400709 385821 370907 355329
9282 355329 336092 317497 305977 294312 284547 277510 267616 248709 230374 216343 204216 194383
9270 194383 187590 179463 173646 169951 166672 164686 160902 148942 137478 129465 122783 113358 108088 102799
$$ packed form
9360G0022J218N49J264L921O727M192O213N316O325L751K283R546R207J045J316
9345A32895P683R955N469N634L548L218O937J1553R462J1838J0948R677P532Q048
9331B44397J0960J3048J6017J0504J2078J0075J0052J8856K0481J3660J7126K1922
9319D19176J9436J2864J7043K1291J9835J1115P412J7800J1085M036J2379J5590
9307E89062J4590P543N129K898k420n855p096o797m352j0027j1159j3481j1203
9294E46832j4484j3622j6095j2405j8753j8895j5671j5319k0879j4888j4914j5578
9282C55329j9237j8595j1520j1665r765p037r894j8907j8335j4031j2127r833
9270A94383o793q127n817l695l279j986l784j1960j1464q013o682r425n270n289
$$ plain form
9256 102799 102238 104286 101835 98007 89391 85040 86399 86710 82020 79767 74977 68017 61891 58924 56713
9241 56713 59681 54736 51150 54992 54212 50990 46519 46694 45061 36067 33983 37979 37884 37057 37345 35349
9225 35349 35358 31542 24368 29696 32932 35481 29653 26360 24150 25299 23705 18761 13118 7967 11151
9210 11151 13429 13185 12593 6479 5979 10128 12075 8451 8728 7886 7753 13630 14375 12655 13570 13109 9811
9193 9811 5709 4450 3485 -13 3784 2930 -377 -5211 -3864 -1783 -1717 -4359 31 943 -332 -221
9177 -221 -603 -4984 -4278 -6684 -5702 -4568 -3148 -7589 -8755 -10739 -9363 -5121 -7861 -13807 -14747 -15357
9161 -15357 -17851 -15605 -15454 -17477 -16430 -12934 -11927 -12027 -11332 -15926 -16481 -14542 -10311 -7293 -8480 -12125
9145 -12125 -11529 -9409 -10985 -17031 -20901 -20232 -14310 -12039 -15846 -18323 -18803 -20708 -19630 -20044 -20625 -16655
$$ packed form
9256A02799n61K048k451l828q616m351J359L11m690k253m790o960o126k967k211
9241E6713K968m945l586L842p80l222m471J75j633q994k084L996r5q27K88j996
9225C5349Rl816p174N328L236K549n828l293k210J149j594m944n643n151L184
9210A1151K278k44n92o114n00M149J947l624K77q42j33N877P45j720R15m61l298
9193I811m102j259r65l498L797q54l307m834J347K081O6k642M390R12j275J11
9177b21l82m381P06k406R82J134J420m441j166j984J376M242k740n946r40o10
9161a5357k494K246J51k023J047L496J007j00O95m594n55J939M231L018j187l645
9145a2125N96K120j576o046l870O69N922K271l807k477m80j905J078m14n81L970
$$ plain form
9129 -16655 -17512 -21552 -24381 -26006 -24560 -21406 -19571 -24578 -21066 -22452 -23555 -19578 -21617 -21758 -22506
9114 -22506 -23643 -22600 -25319 -27112 -23704 -20443 -22933 -22387 -24826 -21466 -20930 -23481 -26095 -29578 -26300
9099 -26300 -24352 -25876 -29260 -30971 -32197 -31673 -33850 -33041 -35782 -33584 -30490 -26755 -23657 -18478 -23507
9084 -23507 -28604 -27252 -23902 -27921 -28524 -27398 -24380 -17682 -14989 -19300 -20154 -25572 -27301 -24269 -17555
9069 -17555 -18591 -23894 -34171 -35490 -34398 -35977 -34173 -31457 -27406 -20942 -15062 -15330 -19048 -19880 -21603
9054 -21603 -21592 -19955 -19861 -23854 -27428 -32641 -31729 -26731 -24272 -28105 -26638 -23171 -22174 -19520 -21636 -26026
9038 -26026 -26358 -24951 -26341 -31508 -30626 -29276 -29258 -31343 -29194 -26959 -26347 -30771 -29375 -27757 -26931 -24882
9022 -24882 -22793 -26143 -27720 -27451 -22088 -24129 -25509 -23466 -25677 -27559 -25200 -21969 -22092 -19750 -21745
$$ packed form
9129a6655q57m040k829j625J446L154J835n007L512j386j103L977k039j41p48
9114b2506j137J043k719j793L408L261k490N46k439L360N36k551k614l483L278
9099b6300J948j524l384j711j226N24k177Q09k741K198L094L735L098N179n029
9084b3507n097J352L350m019o03J126L018O698K693m311q54n418j729L032O714
9069a7555j036n303j0277j319J092j579J804K716M051O464N880k68l718q32j723
9054b1603J1J637R4l993l574n213R12M998K459l833J467L467R97K654k116m390
9038b6026l32J407j390n167Q82J350J8k085K149K235O12m424J396J618Q26K049
9022b4882K089l350j577K69N363k041j380K043k211j882K359L231j23K342j995
$$ plain form
9007 -21745 -24997 -29706 -31357 -36298 -36984 -33905 -33145 -33420 -31465 -26045 -27395 -30736 -31078 -30070 -33587 -28726
8991 -28726 -32623 -38420 -39024 -35539 -32596 -35060 -34051 -26790 -25061 -28098 -26335 -23752 -25672 -28097 -28695
8976 -28695 -27362 -27872 -25301 -23930 -21580 -21833 -19626 -18062 -19311 -20220 -21001 -22938 -22278 -23180 -30626 -35599
8960 -35599 -37171 -39570 -36666 -29963 -26304 -25989 -26929 -28435 -29716 -28792 -26360 -24190 -19176 -20729 -23117
8945 -23117 -23991 -27826 -23855 -20827 -18091 -18136 -14807 -13293 -13091 -16763 -18459 -18572 -19245 -19534 -18189 -21624
8929 -21624 -27649 -27732 -26286 -27751 -31900 -33578 -33440 -34227 -35216 -33679 -32674 -33613 -36408 -35427 -30620 -26950
8913 -26950 -24965 -28855 -26496 -24211 -23837 -23450 -29095 -29820 -34142 -30909 -28957 -28353 -28553 -30626 -30863 -32257
8897 -32257 -32372 -29355 -29058 -30155 -27656 -28646 -29366 -27782 -30138 -29601 -24435 -26062 -27172 -21204 -25123 -25532
$$ packed form
9007b1745l252m709j651m941o86L079P60k75J955N420j350l341l42J008l517M861
8991b8726l897n797o04L485K943k464J009P261J729l037J763K583j920k425n98
8976b8695J333n10K571J371K350k53K207J564j249r09p81j937O60r02p446m973
8960c5599j572k399K904O703L659L15r40j506j281R24K432K170N014j553k388
8945b3117q74l835L971L028K736m5L329J514K02l672j696j13o73k89J345l435
8929b1624o025q3J446j465m149j678J38p87r89J537J005r39k795R81M807L670
8913b6950J985l890K359K285L74L87n645p25m322L233J952O04k00k073k37j394
8897c2257j15L017K97j097K499r90p20J584k356N37N166j627j110N968l919m09
$$ plain form
8881 -25532 -23450 -27072 -30906 -31619 -29243 -29604 -25410 -20489 -21072 -20343 -18794 -16290 -18110 -18478 -18581 -14045
8865 -14045 -13946 -18846 -16887 -17404 -19888 -23934 -21742 -24850 -28235 -28757 -28457 -27529 -30925 -28668 -27071 -27151 -31030
8848 -31030 -28536 -26300 -21616 -18644 -19061 -25860 -27529 -22194 -18951 -21659 -24243 -25699 -23669 -17407 -12992
8833 -12992 -10920 -10674 -13492 -16800 -20333 -23241 -21343 -16785 -15759 -21962 -23305 -23358 -22955 -19842 -20774 -20851
8817 -20851 -19853 -18082 -19691 -16851 -17781 -16904 -17417 -11340 -8234 -5100 -4070 -7037 -12624 -12415 -10855 -13806
8801 -13806 -16114 -14696 -14880 -17224 -18331 -17030 -10934 -10355 -10005 -11412 -13212 -12216 -9242 -10383 -14212 -14674
8785 -14674 -14011 -13222 -8292 -1846 -3251 -5050 -8530 -9726 -11650 -11087 -9432 -6989 -8146 -10844 -7306
8770 -7306 1049 2000 890 -523 843 4427 10451 16956 18235 16197 12665 9760 749 -4937 -3995
$$ packed form
8881b5532K082l622l834p13K376l61M194M921n83P29J549K504j820l68j03M536
8865a4045R9m900J959n17k484m046K192l108l385n22L00R28l396K257J597q0l879
8848c1030K494K236M684K972m17o799j669N335L243k708k584j456K030O262M415
8833a2992K072K46k818l308l533k908J898M558J026o203j343n3M03L113r32p7
8817b0851R98J771j609K840r30Q77n13O077L106L134J030k967n587K09J560k951
8801a3806k308J418j84k344j107J301O096N79L50j407j800R96K974j141l829m62
8785a4674O63P89M930O446j405j799l480j196j924N63J655K443j157k698L538
8770g306Q355R51j110j413J366L584O024O505J279k038l532k905r011n686R42
$$ plain form
8755 -3995 -7359 -11174 -8231 -6069 -6210 -7656 -2353 -1904 -2213 -3322 -1826 4478 4587 2044 -4342 -5771
8739 -5771 -4648 -7434 -10970 -6297 -897 -3460 -4431 -4927 -3819 -3273 -4545 -9351 -6082 -4609 -231 5815
8723 5815 13116 17134 14703 18195 23160 28629 34620 31536 26879 28718 27935 29832 42352 62351 90528
8708 90528 141224 214916 307625 377909 388817 347731 288330 222456 157930 112538 76778 48965
8696 48965 31237 26172 22836 19013 12828 13041 16842 17135 10930 10375 6956 6229 6071 4481 7714 9018
8680 9018 6419 6612 9220 7807 11664 19465 24479 23874 25073 28900 28637 35541 40423 47538 57188 65689
8664 65689 75656 93148 124672 175832 261224 402697 602070 753156 785049 719802 588223
8653 588223 437128 303590 209036 143135 101291 73077 54227 47405 44379 45148 50012 51791
$$ packed form
8755c995l364l815K943K162j41j446N303M49l09j109J496O304J09k543o386j429
8739e771J123k786l536M673N400k563r71m96J108N46j272m806L269J473M378O046
8723E815P301M018k431L492M965N469N991l084m657J839p83J897J2520J9999K8177
8708I0528N0696P3692R2709P0284J0908m1086n9401o5874o4526m5392l5760k7813
8696D8965j7728n065l336l823o185K13L801K93o205n55l419p27j58j590L233J304
8680I018k599J93K608j413L857P801N014o05J199L827k63O904M882P115R650Q501
8664F5689R967J7492L1524N1160Q5392J41473J99373J51086L1893o5247j31579
8653E88223j51095j33538r4554o5901m1844k8214j8850o822l026P69M864J779
$$ plain form
8641 51791 46615 41191 40472 36344 33928 25351 23454 21566 16190 14375 13330 13817 17094 18079 14809
8626 14809 14925 14006 21049 27556 26586 25631 26811 31423 39158 43368 50806 60576 70408 91176 129280
8611 129280 193199 274348 353220 384442 364288 314646 251987 193630 149644 119889 107955 100766
8599 100766 99855 110628 126989 140953 152985 175752 195740 207923 199749 184171 157515 124288
8587 124288 101566 85978 65176 53245 46999 36426 20745 13142 9402 3206 4184 7707 7300
8574 7300 6594 5193 3432 3102 -1950 -6911 -3110 -5815 -12662 -12725 -16095 -15659 -11589 -12702 -16741 -14415
8558 -14415 -9562 -7366 -9342 -12163 -10429 -12714 -15719 -8400 -8159 -10843 -3390 2969 -4794 -8755 -7628
8543 -7628 -11639 -19959 -23385 -22336 -13108 -15742 -21056 -20461 -19891 -19570 -24005 -22750 -18641 -20767 -25313 -26448
$$ packed form
8641E1791n176n424p19m128k416q577j897j888n376j815j045M87L277R85l270
8626A4809J16r19P043O507r70r55J180M612P735M210P438R770R832K0768L8104
8611A29280O3919Q1149P8872L1222k0154m9642o2659n8357m3986k9755j1934p189
8599A00766r11J0773J6361J3964J2032K2767J9988J2183q174j5578k6656l3227
8587A24288k2722j5588k0802j1931o246j0573j5681p603l740o196R78L523m07
8574G300p06j401j761l30n052m961L801k705o847o3l370M36M070j113m039K326
8558a4415M853K196j976k821J734k285l005P319K41k684P453O359p763l961J127
8543g628m011q320l426J049R228k634n314N95N70L21m435J255M109k126m546j135
$$ plain form
8527 -26448 -26724 -27889 -22594 -16283 -14356 -18742 -21063 -20843 -20773 -24608 -24207 -22394 -20964 -20893 -25655 -29343
8511 -29343 -28968 -26459 -20938 -21484 -25582 -31102 -28908 -27155 -27180 -23176 -16091 -15576 -18301 -23886 -21693 -17898
8495 -17898 -16509 -14539 -12507 -15077 -16559 -12557 -12548 -10295 -12577 -22516 -23827 -21849 -22899 -22886 -18906 -17142
8479 -17142 -21305 -24501 -21425 -19106 -18589 -21275 -22407 -18774 -20471 -21832 -23138 -27512 -28849 -27433 -23493
8464 -23493 -21138 -22312 -20384 -22658 -24517 -25887 -24236 -22487 -20621 -15898 -14474 -17934 -24331 -23265 -22286
8449 -22286 -19592 -22912 -25519 -26064 -25310 -22433 -24468 -28862 -26469 -26068 -25581 -23037 -22671 -23812 -23417 -18667
8433 -18667 -16465 -17805 -21138 -22893 -26029 -23673 -19902 -15399 -13973 -15619 -15757 -18478 -22731 -20756 -18011
8418 -18011 -22387 -24358 -20436 -20074 -19841 -23487 -23413 -21441 -20402 -23192 -26332 -26703 -26816 -29452 -28428 -26998
$$ packed form
8527b6448k76j165N295O311J927m386k321K20P0l835M01J813J430P1m762l688
8511b9343L75K509N521n46m098n520K194J753k5M004P085N15k725n585K193L795
8495a7898J389J970K032k570j482M002RK253k282r939j311J978j050J3L980J764
8479a7142m163l196L076K319N17k686j132L633j697j361j306m374j337J416L940
8464b3493K355j174J928k274j859j370J651J749J866M723J424l460o397J066R79
8449b2286K694l320k607n45P54K877k035m394K393M01M87K544L66j141L95M750
8433a8667K202j340l333j755l136K356L771M503J426j646j38k721m253J975K745
8418a8011m376j971L922L62K33l646P4J972J039k790l140l71j13k636J024J430
$$ plain form
8402 -26998 -27245 -23174 -20814 -16788 -12770 -13173 -18346 -17099 -19642 -18980 -16884 -15933 -18265 -18033 -18664 -17919
8386 -17919 -17370 -14556 -16045 -23901 -23044 -17591 -14287 -14283 -16935 -18397 -19827 -18560 -16917 -19345 -21908 -20281
8370 -20281 -20525 -20436 -21033 -19647 -16120 -16218 -15012 -16119 -19290 -16732 -15207 -16994 -20603 -22569 -25548 -25377
8354 -25377 -25284 -22377 -21950 -24043 -26273 -24279 -18570 -14579 -15678 -15033 -20420 -23828 -22269 -16045 -15012 -16962
8338 -16962 -20288 -21002 -20188 -24147 -29581 -26358 -20420 -23952 -25193 -25019 -21521 -25034 -31815 -31304 -26558 -22129
8322 -22129 -22082 -22526 -21843 -15330 -16463 -16911 -17201 -16555 -12554 -17205 -22436 -21686 -21344 -23236 -22146 -25038 -28614
8305 -28614 -27606 -21939 -17906 -16388 -12962 -16489 -21698 -18258 -18576 -18235 -14220 -13467 -19763 -22332 -19047
8290 -19047 -15917 -16845 -18422 -20003 -22865 -23438 -21303 -20825 -24201 -19902 -20631 -19209 -18434 -14366 -16521 -17601
$$ packed form
8402b6998k47M071K360M026M018m03n173J247k543O62K096R51k332K32o31P45
8386a7919N49K814j489p856Q57N453L304Mk652j462j430J267J643k428k563J627
8370b0281k44Q9n97J386L527r8J206j107l171K558J525j787l609j966k979J71
8354b5377R3K907M27k093k230J994N709L991j099O45n387l408J559O224J033j950
8338a6962l326p14Q14l959n434L223N938l532j241J74L498l513o781N11M746M429
8322b2129M7m44O83O513j133m48k90O46M001m651n231P50L42j892J090k892l576
8305b8614J008N667M033J518L426l527n209L440l18L41M015P53o296k569L285
8290a9047L130r28j577j581k862n73K135M78l376M299p29J422P75M068k155j080
$$ plain form
8274 -17601 -17132 -15724 -19753 -22435 -21610 -22446 -20041 -17700 -17304 -21171 -21701 -21262 -15481 -12996 -11196 -15368
8258 -15368 -17512 -14506 -16257 -19080 -16282 -11867 -7084 -11290 -18994 -20650 -17918 -18571 -16984 -14759 -18597
8243 -18597 -21373 -23079 -25014 -21939 -20932 -15955 -16694 -19975 -21836 -20108 -23146 -23270 -18681 -20515 -20609 -25142
8227 -25142 -22504 -23490 -21576 -19531 -19944 -23690 -24673 -23979 -24735 -24170 -24307 -22421 -18206 -17455 -16085 -17677 -20278
8210 -20278 -21041 -13594 -10937 -12817 -15670 -23197 -26317 -26233 -23347 -27643 -33460 -31462 -27207 -25359 -22544
8195 -22544 -21551 -26056 -25609 -21489 -18796 -18529 -18963 -17002 -18116 -20383 -18145 -17606 -20243 -23022 -25236 -24624
8179 -24624 -24945 -25517 -20389 -16352 -14709 -14509 -14636 -15793 -15561 -16424 -19966 -20673 -17532 -16300 -16633 -11146 -11172
8162 -11172 -13209 -13834 -13477 -14037 -14846 -18609 -20001 -19875 -16261 -10964 -9395 -14550 -18439 -18554 -22406 -18918
$$ packed form
8274a7601M69J408m029k682Q25q36K405K341L96l867n30M39N781K485J800m172
8258a5368k144L006j751k823K798M415M783m206p704j656K732o53J587K225l838
8243a8597k776j706j935L075J007M977p39l281j861J728l038j24M589j834r4m533
8227b5142K638r86J914K045m13l746r83O94p56N65j37J886M215P51J370j592k601
8210b0278p63P447K657j880k853p527l120Q4K886m296n817J998M255J848K815
8195b2544R93m505M47M120K693K67m34J961j114k267K238N39k637k779k214O12
8179b4624l21n72N128M037J643K00j27j157K32q63l542p07L141J232l33N487k6
8162a1172k037o25L57n60q09l763j392J26L614N297J569n155l889j15l852L488
$$ plain form
8146 -18918 -16491 -16644 -18582 -14154 -12080 -15737 -21295 -19871 -15830 -14799 -14516 -14633 -18259 -26955 -27635 -23707
8130 -23707 -19793 -18177 -12351 -10991 -11407 -13586 -18818 -17507 -18007 -21066 -20074 -16726 -12654 -11485 -12472 -14946
8114 -14946 -19193 -19132 -21628 -20568 -18034 -18029 -18583 -15396 -15651 -19472 -20138 -17989 -23021 -25928 -29061 -30657 -27456
8097 -27456 -24751 -19929 -22858 -18201 -15628 -14894 -16355 -13033 -14317 -19109 -25650 -30119 -30184 -28274 -30803
8082 -30803 -28688 -27070 -22200 -17075 -14835 -17649 -18896 -17131 -16905 -18044 -23326 -22560 -21948 -22549 -25804 -24073
8066 -24073 -22601 -18463 -16150 -11633 -13685 -14092 -16153 -12958 -11902 -12843 -11358 -11815 -9830 -13164 -14470
8051 -14470 -12305 -11721 -10824 -10791 -12735 -11914 -13498 -13584 -13297 -10310 -10167 -8600 -7092 -7237 -9642 -8112 -11051
8034 -11051 -14559 -12080 -10201 -7758 -10474 -14214 -10902 -8366 -7212 -8160 -8350 -10770 -10502 -10198 -8547 -4347
$$ packed form
8146a8918K427j53j938M428K074l657n558J424M041J031K83j17l626q696o80L928
8130b3707L914J616N826J360m16k179n232J311n00l059R92L348M072J169r87k474
8114a4946m247O1k496J060K534Nn54L187k55l821o66K149n032k907l133j596L201
8097b7456K705M822k929M657K573P34j461L322j284m792o541m469o5J910k529
8082c0803K115J618M870N125K240k814j247J765K26j139n282P66O12o01l255J731
8066b4073J472M138K313M517k052m07k061L195J056r41J485m57J985l334j306
8051a4470K165N84Q97L3j944Q21j584q6K87K987J43J567J508j45k405J530k939
8034a1051l508K479J879K443k716l740L312K536J154r48j90k420K68L04J651M200
$$ plain form
8018 -4347 -773 -528 -1579 211 178 -929 -7345 -13632 -12335 -6233 -1010 -3802 -6679 -7636 -5816 -1100
8002 -1100 2234 -908 -1476 2398 -3314 -4670 -801 5049 5674 1531 6295 4472 -2686 -5111 -1883
7987 -1883 -2339 -2375 -4919 -7910 -13512 -11745 -3852 2608 1656 -4088 -4131 -678 1789 -3942 -9115 -12768
7971 -12768 -13622 -11670 -14288 -16262 -14922 -11529 -8415 -9913 -7816 -9246 -7434 -11190 -13744 -10876 -3471
7956 -3471 1528 -2738 -1239 2353 2769 -748 -341 400 -1499 -1934 -1695 -473 -906 -4775 -3868 -1884 -2803
7939 -2803 -1350 -7668 -10558 -6824 -9928 -16531 -12970 -8524 -9674 -9887 -14568 -17751 -17216 -11552 -4995
7924 -4995 -6456 -8388 -11603 -9087 -3706 -2894 -3073 -4049 -4965 -3293 -7417 -10244 -8942 -8231 -6700 -4191
7908 -4191 -5074 -6834 -11201 -12512 -10273 -5070 -4187 -6625 -10491 -8412 -9552 -7718 -6463 -9311 -9478 -13123
$$ packed form
8018d347L574K45j051J790l3j107o416o287J297O102N223k792k877r57J820M716
8002a100L334l142n68L874n712j356L869N850O25m143M764j823p158k425L228
7987a883m56l6k544k991n602J767P893O460r52n744m3L453K467n731n173l653
7971a2768q54J952k618j974J340L393L114j498K097j430J812l756k554K868P405
7956c471M999m266J499L592M16l517M07P41j899m35K39J222m33l869R07J984r19
7939b803J453o318k890L734l104o603L561M446j150k13m681l183N35N664O557
7924d995j461j932l215K516N381Q12j79r76r16J672m124k827J302P11J531K509
7908d191q83j760m367j311K239N203Q83k438l866K079j140J834J255k848j67l645
$$ plain form
7892 -13123 -18209 -15802 -10632 -7965 -4580 -2773 -1424 -5701 -10268 -11083 -9497 -9941 -9348 -9401 -7719 -8146
7876 -8146 -6906 -8227 -8619 -5446 -4026 -2775 246 -1659 -512 -5067 -7200 -5476 -6341 -10734 -10971 -10718
7860 -10718 -14405 -17486 -15245 -14113 -13972 -18346 -18481 -16511 -15475 -11949 -12569 -14689 -19835 -23120 -21211
7845 -21211 -14308 -9860 -11804 -18641 -20174 -18068 -8253 -6443 -7835 -10203 -18146 -17400 -18425 -15343 -16405
7830 -16405 -17850 -18058 -18633 -24602 -22568 -15018 -15317 -13616 -13637 -12203 -11788 -16149 -15679 -15946 -16086 -16916 -18271
7813 -18271 -17112 -14666 -12876 -15564 -12405 -9846 -13634 -10223 -14581 -18598 -15228 -13517 -9978 -12427 -10442
7798 -10442 -10059 -13426 -14131 -10947 -11558 -13592 -12174 -14135 -14207 -13673 -18808 -20971 -19629 -19565 -18845 -17959 -14681
7781 -14681 -13459 -14404 -14456 -15945 -16339 -17645 -24003 -22660 -20531 -22354 -16595 -12789 -13620 -23173 -24399 -23563
$$ packed form
7892a3123n086K407N170K667L385J807J349m277m567q15J586m44N93n3J682m27
7876h146J240j321l92L173J420J251L021j905J147m555k133J724q65m393k37K53
7860a0718l687l081K241J132J41m374j35J970J036L526o20k120n146l285J909
7845b1211O903M448j944o837j533K106R815J810j392k368p943P46j025L082j062
7830a6405j445k08n75n969K034P550k99J701k1J434M15m361M70k67j40q30j355
7813a8271J159K446J790k688L159K559l788L411m358m017L370J711L539k449J985
7798a0442L83l367p05L184o11k034J418j961p2N34n135k163J342O4P20Q86L278
7781a4681J222r45n2j489l94j306o358J343K129j823N759L806q31r553j226Q36
$$ plain form
7765 -23563 -22169 -19065 -18021 -19379 -20891 -21544 -18827 -15255 -16275 -18510 -15988 -11765 -10353 -12395 -10862
7750 -10862 -8422 -11012 -10574 -7446 -6129 -4796 -6743 -12761 -16121 -18897 -22128 -24362 -24394 -24341 -21760 -17755
7734 -17755 -17043 -17844 -19170 -19168 -24174 -28621 -24714 -18682 -18600 -19766 -16350 -16138 -13801 -13095 -12628 -12908 -18706
7717 -18706 -21580 -17033 -13139 -13033 -14397 -14295 -13839 -13006 -10227 -10197 -10614 -8355 -9838 -6517 -7168 -14528 -20907
7700 -20907 -23249 -24210 -21191 -15653 -15553 -17100 -15551 -19337 -22210 -20681 -19003 -22417 -19929 -10131 -8666
7685 -8666 -5940 -9865 -14886 -9716 -11223 -12530 -13800 -13249 -14769 -15178 -18743 -17289 -17650 -18313 -16291 -12930
7669 -12930 -11841 -9930 -7419 -8526 -12284 -15959 -16809 -16593 -18066 -19411 -15671 -16379 -16753 -20000 -19142 -14789
7653 -14789 -13703 -17469 -21046 -23606 -24163 -18976 -14503 -12186 -15330 -18591 -17290 -16728 -13401 -13189 -14719
$$ packed form
7765b3563J394L104J044j358j512o53K717L572j020k235K522M223J412k042J533
7750a0862K440k590M38L128J317J333j947o018l360k776l231k234l2N3K581M005
7734a7755P12q01j326Kn006m447L907O032Q2j166L416K12K337P06M67k80n798
7717a8706k874M547L894J06j364J02M56Q33K779L0m17K259j483L321o51p360o379
7700b0907k342r61L019N538J00j547J549l786k873J529J678l414K488R798J465
7685h666K726l925n021N170j507j307j270N51j520m09l565J454l61o63K022L361
7669a2930J089J911K511j107l758l675q50K16j473j345L740p08l74l247Q58M353
7653a4789J086l766l577k560n57N187M473K317l144l261J301N62L327K12j530
$$ plain form
7638 -14719 -16629 -17727 -19571 -18440 -21208 -21302 -18423 -15925 -16890 -19241 -16127 -16386 -17202 -18405 -20340 -22472
7622 -22472 -20499 -18844 -17647 -14949 -14215 -13914 -20298 -21586 -17379 -16654 -18255 -18020 -17004 -13734 -16947 -20733
7606 -20733 -22035 -17261 -11447 -10198 -13027 -20130 -19746 -19231 -18479 -15722 -11991 -18387 -18845 -15740 -15551 -13004
7590 -13004 -8959 -13466 -17408 -16932 -24911 -19187 -14507 -15241 -12848 -13526 -10835 -10963 -17710 -20616 -20632 -19458
7574 -19458 -18649 -15138 -12630 -11500 -10401 -7669 -5891 -10224 -11175 -12277 -15868 -12846 -14243 -13858 -16843
7559 -16843 -15573 -16528 -12948 -9563 -10622 -8558 -14395 -22444 -22015 -16305 -15160 -14083 -15785 -18269 -18708
7544 -18708 -16370 -12274 -15156 -19399 -14769 -12596 -9659 -9338 -10823 -10425 -6104 -7564 -12481 -16269 -19605
7529 -19605 -17823 -15430 -10117 -7119 -7685 -8845 -4207 -6513 -12549 -14656 -16929 -16209 -10856 -9817 -7352
$$ packed form
7638a4719j910j098j844J131k768r4K879K498r65k351L114k59q16j203j935k132
7622b2472J973J655J197K698P34L01o384j288M207P25j601K35J016L270l213l786
7606b0733j302M774N814J249k829p103L84N15P52K757L731o396m58L105J89K547
7590a3004M045m507l942M76p979N724M680p34K393o78K691j28o747k906j6J174
7574a9458Q09L511K508J130J099K732J778m333r51j102l591L022j397L85k985
7559a6843J270r55L580L385j059K064n837q049M29N710J145J077j702k484m39
7544a8708K338M096k882m243M630K173K937L21j485L98M321j460m917l788l336
7529a9605J782K393N313K998n66j160M638k306o036k107k273P20N353J039K465
$$ plain form
7514 -7352 -7545 -13174 -12406 -14322 -18352 -17085 -17210 -15430 -13561 -10290 -9414 -12854 -13058 -10163 -12941 -12483
7498 -12483 -11712 -9532 -7781 -9739 -16089 -19557 -21485 -19553 -19551 -18227 -12650 -10411 -12329 -9416 -5589 -3210
7482 -3210 -4280 -8871 -9525 -14434 -13623 -8452 -8040 -7367 -7941 -9399 -10947 -8763 -8913 -14039 -16380 -15679 -14099
7465 -14099 -11080 -10365 -13595 -9736 -6848 -7045 -13311 -10837 -11949 -14378 -15044 -16747 -20029 -16959 -16228 -17694
7449 -17694 -16905 -13727 -12882 -9071 -8817 -10514 -13543 -11392 -14065 -16045 -17390 -17284 -11253 -9457 -12549 -15375
7433 -15375 -15678 -13924 -9908 -6862 -8729 -8783 -12592 -12200 -13360 -12162 -17618 -18295 -17406 -21207 -20520 -16026
7417 -16026 -14585 -12131 -8565 -7792 -12203 -13760 -13026 -10613 -11455 -17921 -18120 -15572 -16388 -14832 -15092 -15713
7401 -15713 -14959 -11324 -8635 -6761 -10658 -11939 -13774 -13358 -7788 -5330 -10973 -13844 -14912 -17074 -14901
$$ packed form
7514g352j93n629P68j916m030J267j25J780J869L271Q76l440k04K895k778M58
7498a2483P71K180J751j958o350l468j928J932KJ324N577K239j918K913L827K379
7482c210j070m591o54m909Q11N171M12O73n74j458j548K184j50n126k341P01J580
7465a4099L019P15l230L859K888j97o266K474j112k429o66j703l282L070P31j466
7449a7694P89L178Q45L811K54j697l029K151k673j980j345J06O031J796l092k826
7433a5375l03J754M016L046j867n4l809L92j160J198n456o77Q89l801O87M494
7417a6026J441K454L566P73m411j557P34K413q42o466j99K548q16J556k60o21
7401a5713P54L635K689J874l897j281j835M16N570K458n643k871j068k162K173
$$ plain form
7386 -14901 -13548 -14598 -15225 -12129 -12323 -11765 -10452 -9209 -4932 -6049 -9028 -7626 -1804 -1339 -1859 -6048
7370 -6048 -4809 -3111 -5130 -7266 -10869 -10867 -15503 -20291 -23457 -22743 -15149 -9597 -8382 -10115 -13130 -15531
7354 -15531 -13276 -8089 -6088 -9275 -12706 -13399 -13134 -11769 -10584 -10603 -10449 -11665 -8303 -10862 -12486 -17994
7338 -17994 -18989 -16092 -10509 -10561 -6932 -2636 -6245 -12169 -14686 -15331 -12808 -11183 -8842 -11044 -12334 -16692
7322 -16692 -17392 -16752 -16146 -11067 -11180 -9305 -6806 -9293 -13973 -12982 -12860 -9456 -9728 -6190 -9911 -13699
7306 -13699 -18409 -20786 -15592 -11643 -11874 -9955 -10739 -11104 -10218 -12597 -11190 -11572 -13048 -13257 -13086 -16249
7290 -16249 -12481 -7191 -7645 -6552 -3019 -1898 -3649 -8102 -8260 -8421 -10806 -11958 -10923 -10736 -10358 -10329
7274 -10329 -13423 -13663 -8997 -12087 -13823 -14503 -13277 -12987 -14070 -12195 -12754 -9688 -7900 -3433 -396 -3594
$$ packed form
7386a4901J353j050o27L096j94N58J313J243M277j117k979J402N822M65n20m189
7370f048J239J698k019k136l603Km636m788l166P14P594N552J215j733l015k401
7354a5531K255N187K001l187l431o93K65J365J185j9J54j216L362k559j624n508
7338a7994r95K897N583n2L629M296l609n924k517o45K523J625K341k202j290m358
7322a6692p00O40O06N079j13J875K499k487m680R91J22L404k72L538l721l788
7306a3699m710k377N194L949k31J919p84l65Q86k379J407l82j476k09J71l163
7290a6249L768N290m54J093L533J121j751m453j58j61k385j152J035J87L78K9
7274a0329l094k40M666l090j736o80J226K90j083J875n59L066J788M467L037l198
$$ plain form
7258 -3594 -10376 -9072 -5885 -7115 -10056 -13389 -15552 -15634 -15995 -19418 -19571 -19184 -22713 -19474 -11658 -10414
7242 -10414 -15775 -11943 -10426 -8514 -11772 -13410 -10389 -7368 -8465 -9876 -10634 -13307 -12997 -10765 -7629
7227 -7629 -5071 -4798 -10156 -11280 -5235 -2727 -3352 -5722 -3304 -1990 -1217 -8061 -13742 -17386 -13972 -11587
7211 -11587 -13196 -9520 -12384 -17750 -19929 -15472 -12120 -16268 -14144 -10729 -12054 -10600 -9315 -10202 -9210
7196 -9210 -13769 -18271 -16006 -12330 -8892 -8994 -9563 -8331 -12729 -13864 -16110 -15725 -11376 -8819 -4897 -1993
7180 -1993 -6409 -8662 -6746 -7452 -8947 -10413 -8054 -11566 -13397 -13392 -11624 -9763 -11406 -8390 -6190 -5649
7164 -5649 -8118 -10696 -12139 -10643 -11473 -12491 -10870 -8010 -7119 -14101 -16877 -18542 -20780 -16701 -16851 -17844
7148 -17844 -16743 -14529 -8539 -6627 -9748 -11147 -7214 -8587 -8848 -7733 -8504 -6092 -4819 -7811 -14296
$$ packed form
7258c594o782J304L187j230k941l333k163q2l61l423j53L87l529L239P816J244
7242a0414n361L832J517J912l258j638L021L021j097j411p58k673L10K232L136
7227g629K558K73n358j124O045K508o25k370K418J314P73o844n681l644L414K385
7211a1587j609L676k864n366k179M457L352m148K124L415j325J454J285q87R92
7196i210m559m502K265L676L438j02n69J232m398j135k246L85M349K557L922K904
7180a993m416k253J916p06j495j466K359l512j831NJ768J861j643L016K200N41
7164e649k469k578j443J496q30j018J621K860Q91o982k776j665k238M079j50r93
7148a7844J101K214N990J912l121j399L933j373k61J115p71K412J273k992o485
$$ plain form
7133 -14296 -17127 -14032 -11174 -7282 -4951 -5675 -6411 -7296 -7109 -5909 -4416 -7456 -6058 -4904 -8607 -4919
7117 -4919 -3056 -5554 -5922 -4120 -4215 -4686 -4394 -7658 -10868 -8586 -6548 -9772 -12254 -11977 -12962 -14215 -9693
7100 -9693 -8670 -6674 -6280 -5922 -7847 -8595 -6633 -5630 -6107 -5360 -4980 -5110 -9881 -16688 -20721 -18564 -13631
7083 -13631 -10913 -10089 -10400 -9604 -7483 -9369 -8910 -6759 -5387 -3787 -6106 -9571 -12368 -14838 -12929 -11977
7067 -11977 -8891 -8559 -9660 -7374 -8308 -11243 -16166 -16687 -14340 -9634 -7415 -9639 -8591 -6106 -6374 -8069
7051 -8069 -9022 -9936 -7128 -9845 -15327 -12205 -8083 -9116 -10914 -8701 -8513 -9084 -11709 -9767 -6027 -4661
7035 -4661 -6765 -10373 -5726 -598 -990 -3691 -6249 -1583 638 55 -6612 -8936 -7418 -6384 -8805
7020 -8805 -11784 -11442 -9983 -8433 -3558 -1983 117 -10 -6000 -10718 -13321 -9052 -2952 -5210 -13040
$$ packed form
7133a4296k831L095K858L892K331p24p36q85J87J200J493l040J398J154l703L688
7117d919J863k498l68J802r5m71K92l264l210K282K038l224k482K77r85j253M522
7100i693J023J996L94L58j925p48J962J003m77P47L80j30m771o807m033K157M933
7083a3631K718Q24l11P96K121j886M59K151J372J600k319l465k797k470J909R52
7067a1977L086L32j101K286r34k935m923n21K347M706K219k224J048K485k68j695
7051h069r53r14K808k717n482L122M122j033j798K213J88n71k625J942L740J366
7035d661k104l608M647N128l92k701k558M666K221n83o667k324J518J034k421
7020h805k979L42J459J550M875J575K100j27n990m718k603M269O100k258p830
$$ plain form
7005 -13040 -16969 -17553 -17153 -14844 -14053 -12503 -11020 -10649 -12359 -10170 -9695 -5562 -7227 -13555 -12133 -12130 -10939
6988 -10939 -9451 -10824 -11377 -9887 -4806 -10262 -15486 -11578 -14253 -15043 -10633 -9065 -8237 -9956 -11115
6973 -11115 -10272 -10506 -9457 -8493 -5603 -716 1398 -3821 -6679 -8679 -8951 -9265 -13195 -15102 -11754 -8272
6957 -8272 -6669 -7237 -6432 -6374 -7265 -8817 -9015 -14547 -17899 -16465 -10908 -10319 -15659 -16110 -9749 -4362 -3976
6940 -3976 -3800 -3299 -2349 -5063 -4479 -6666 -12284 -14385 -10570 -5147 -3948 -3996 -8963 -11077 -10470 -10073 -7579
6923 -7579 -11046 -15764 -14282 -12328 -16267 -13808 -12275 -7438 -4600 -7498 -8576 -6018 -4097 -6070 -6613
6908 -6613 -3613 -3257 -6232 -12961 -14158 -8700 -4222 -5262 -2494 -1004 2945 6084 8084 3270 -7737
6893 -7737 -11601 -14042 -16173 -13671 -9035 -5451 -3651 -2747 -152 -5916 -7451 -6586 -4834 -7018 -8330
$$ packed form
7005a3040l929n84M00K309P91J550J483L71j710K189M75M133j665o328J422LJ191
6988a0939J488j373n53J490N081n456n224L908k675p90M410J568Q28j719j159
6973a1115Q43k34J049R64K890M887K114n219k858k000k72l14l930j907L348L482
6957h272J603n68Q05N8q91j552j98n532l352J434N557N89n340m51O361N387L86
6940c976J76N01R50k714N84k187n618k101L815N423J199m8m967k114O07L97K494
6923g579l467m718J482J954l939K459J533M837K838k898j078K558J921j973n43
6908f613L000L56k975o729j197N458M478j040K768J490L949L139K000m814j1007
6893g737l864k441k131K502M636L584J800R04K595n764j535Q65J752k184j312
$$ plain form
6878 -8330 -10994 -7920 -5779 -6547 -5159 -3774 -4260 -7155 -10564 -14185 -14937 -11470 -10463 -6214 -5340 -10054
6862 -10054 -11119 -11075 -12602 -9772 -4566 -3186 -14 -1138 908 4491 412 -276 -566 -2856 -7620 -9231
6846 -9231 -9446 -11830 -15887 -19809 -15440 -9013 -5714 -4900 -5527 -3735 -4315 -7345 -6951 -10059 -14495 -13908
6830 -13908 -13631 -17375 -17453 -20398 -15661 -7955 -3777 -8755 -9933 -10215 -5923 2213 273 -335 -220 -3757
6814 -3757 -2832 -2405 -3971 -3891 -1812 -6536 -5099 -7657 -7685 -10722 -13621 -7612 -6290 -7928 -7540 -12467 -14151
6797 -14151 -10374 -4705 -10423 -13318 -9542 -6648 -6033 -9056 -14598 -12472 -14436 -12705 -10470 -5406 -3654
6782 -3654 -4082 -7003 -12454 -15877 -11503 -17388 -23222 -19002 -16238 -15951 -11626 -5169 -2130 -9357 -9763 -13512
6766 -13512 -15419 -11751 -10667 -9506 -9087 -7517 -4556 -1522 -1769 -2397 -629 -4520 -9600 -9080 -5472 -3188
$$ packed form
6878h330k664L074K141p68J388J385m86k895l409l621p52L467J007M249Q74m714
6862a0054j065M4j527K830N206J380L172j124K046L583m079o88k90k290m764j611
6846i231k15k384m057l922M369O427L299Q14o27J792n80l030L94l108m436N87
6830a3908K77l744p8k945M737P706M178m978j178k82M292Q136j940o08J15l537
6814c757R25M27j566Q0K079m724J437k558k8l037k899O009J322j638L88m927j684
6797a4151L777N669n718k895L776K894O15l023n542K126j964J731K235N064J752
6782c654m28k921n451l423M374n885n834M220K764K87M325O457L039p227m06l749
6766a3512j907L668J084J161M19J570K961L034k47o28J768l891n080N20L608K284
$$ plain form
6750 -3188 -512 856 1536 -258 -1901 -5783 -5549 -2777 -299 4580 4058 -1468 -6173 -7393 -9918 -13639
6734 -13639 -11526 -9821 -9797 -6085 -1679 -1375 -2010 -3421 -5485 -5197 -5377 -7968 -4575 -7866 -11045 -8304
6718 -8304 -8768 -3491 -993 1951 1278 1951 -2744 -3330 -7980 -9395 -6472 -4891 -6452 -3641 -4418 -6413
6702 -6413 -5546 -3534 -6909 -9373 -8690 -7299 -2747 -1330 -1338 -7377 -10648 -10104 -5249 -5119 -6622 -11400 -10139
6685 -10139 -4813 -4053 -5669 -6494 -7639 -6465 826 1689 -171 267 1888 -3805 -8625 -9548 -12461 -10719
6669 -10719 -6161 -7647 -8760 -11318 -10331 -8620 -6523 -4958 -6865 -8097 -11168 -11760 -4576 -104 -7370
6654 -7370 -13127 -10954 -7492 -7927 -13153 -11412 -4467 -2036 -5379 -6069 -9356 -11044 -10723 -10361 -11464 -9608
6638 -9608 -9939 -7508 -11283 -12278 -9146 -8789 -7813 -9806 -13134 -10733 -11883 -6490 -7248 -1216 3903 -263
$$ packed form
6750c188K676J368O80j794j643l882K34K772K478M879n22n526m705j220k525l721
6734a3639K113J705K4L712M406L04o35j411k064K88j80k591L393l291l179K741
6718h304m64N277K498K944o73O73m695n86m650j415K923J581j561K811p77j995
6702f413Q67K012l375k464O83J391M552J417qo039l271N44M855J30j503m778J261
6685a0139N326P60j616q25j145J174P291Q63j860M38J621n693m820r23k913J742
6669a0719M558j486j113k558R87J711K097J565j907j232l071n92P184M472p266
6654g370n757K173L462m35n226J741O945K431l343o90l287j688L21L62j103J856
6638i608l31K431l775r95L132L57R76j993l328K401j150N393p58O032N119m166
$$ plain form
6622 -263 -2780 -5402 -7211 -4182 -4617 -5836 -6772 -3760 -5175 -5544 -3551 -3268 2797 3601 -3294 -2603 -2992
6605 -2992 -2205 -191 -3905 -9235 -14118 -16213 -13999 -10625 -7105 -7593 -8444 -5272 -5785 -3595 -733 1931
6589 1931 1251 -2147 34 71 -929 -4943 -7851 -8256 -5898 -3756 -3842 -10695 -13553 -8817 -7192 -9038
6573 -9038 -7685 -6151 -6430 -11758 -11831 -11536 -10911 -9081 -6775 -9148 -14139 -10452 -8459 -9482 -3883 -2170
6557 -2170 -3337 -6021 -6373 -3670 -5057 -3906 -5426 -3243 -4342 -7538 -4080 1907 -201 -1775 -5573
6542 -5573 -8788 -10782 -10084 -7175 -10222 -10861 -5118 1011 2784 1738 2378 -723 -2548 -1863 -4519 -5622
6526 -5622 -5337 -7158 -7192 -3608 -5520 -8393 -8278 -6156 -5271 -4978 1740 977 -4628 -7829 -9466 -8702 -6936
6509 -6936 -6057 -1607 4476 1253 -4031 -5886 -7917 -8753 -6590 -10655 -6284 -918 -3641 -6813 -6843 -7926
$$ packed form
6622b63k517k622j809L029m35j219r36L012j415l69J993K83O065Q04o895O91l89
6605b992P87K014l714n330m883k095K214L374L520m88q51L172n13K190K862K664
6589A931o80l398K181L7j000m014k908m05K358K142q6o853k858M736J625j846
6573i038J353J534k79n328p3K95O25J830K306k373m991L687J993j023N599J713
6557b170j167k684l52K703j387J151j520K183j099l196L458N987k108j574l798
6542e573l215j994O98K909l047o39N743O129J773j046O40l101j825O85k656j103
6526e622K85j821l4L584j912k873J15K122Q85K93O718p63n605l201j637P64J766
6509f936Q79M450O083l223n284j855k031q36K163m065M371N366k723l172l0j083
$$ plain form
6493 -7926 -11324 -8563 -3158 4913 7354 6526 1974 -3032 -4277 -6027 -4886 -1625 -936 -1976 -3330
6478 -3330 -2483 -2725 -1275 -1223 -1848 -3813 -7349 -10513 -6490 -4456 -8885 -11826 -9718 -7660 -6376 -8811
6462 -8811 -6447 8 -1807 -3147 -3588 -2920 -7621 -13482 -14914 -12884 -9518 -8672 -13788 -11396 -5988 -6085
6446 -6085 -11081 -8730 -5893 -6017 -4807 -6170 -4091 -2012 -1462 -4431 -5528 -8854 -7288 -2221 -4108
6431 -4108 -8127 -9292 -6922 -5964 -2668 -7153 -13269 -13156 -6524 -6247 -8497 -8729 -8550 -5281 -7164 -10291
6415 -10291 -10582 -7941 -5392 -1569 -6151 -4722 -1101 -4822 -9890 -6504 723 -2958 -6251 -1228 1619
6400 1619 5363 4187 1810 -1452 -1467 -3020 -7239 -10194 -9450 -8882 -7118 -6455 -5550 -7674 -5205 3887
6384 3887 1064 -5718 -5881 -8366 -2225 -4540 -5789 -6217 -4144 -1715 -612 -588 -808 680 -3636 -2309
$$ packed form
6493g926l398K761N405Q071K441q28m552n006j245j750J141L261O89j040j354
6478c330Q47k42J450N2o25j965l536l164M023K034m429k941K108K058J284k435
6462h811K364O455j815j340m41O68m701n861j432K030L366Q46n116K392N408r7
6446f085m996K351K837j24J210j363K079K079N50k969j097l326J566N067j887
6431d108m019j165K370R58L296m485o116J13O632K77k250k32J79L269j883l127
6415a0291k91K641K549L823m582J429L621l721n068L386P227l681l293N023K847
6400A619L744j176k377l262j5j553m219k955P44N68J764O63R05k124K469R092
6384C887k823o782j63k485O141k315j249m28K073K429J103K4k20J488m316J327
$$ plain form
6368 -2309 -67 4286 3089 2048 -1072 -3980 -894 778 78 -2357 -2519 -7168 -10914 -12743 -12250 -10009
6352 -10009 -8560 -8049 -6910 -10227 -16925 -14941 -10538 -11056 -12967 -11356 -10363 -8601 -7577 -8578 -6643
6337 -6643 -930 3208 1323 247 1227 243 -586 -2767 -3105 429 2502 2266 431 418 5629 5658 -977
6320 -977 -1426 -1959 -6788 -8025 -6718 -7393 -11573 -15236 -13590 -8514 -4363 -1922 -3589 -3741 -4330 -3487 -5488
6303 -5488 -6724 -9716 -10059 -6494 -1706 1184 3782 1690 251 4214 2550 -4797 -4454 -5604 -9296
6288 -9296 -5986 -4848 -7271 -7676 -3872 -1917 -5685 -8301 -9677 -10218 -9119 -11199 -9290 -7098 -6847 -3696
6272 -3696 494 -949 -3964 -4016 -4021 -4953 -1044 124 1196 -1967 -4368 -6545 -8582 -7638 -7231 -5511 -5325
6255 -5325 -8034 -6271 -2919 -3508 -4549 -5094 -6875 -9996 -13442 -11643 -10025 -10673 -6926 -4370 -6318 -4604
$$ packed form
6368b309K242M353j197j041l120k908L086J672p00k435j62m649l746j829M93K241
6352a0009J449N11J139l317o698J984M403n18j911J611R93J762J024j001J935
6337f643N713M138j885j076R80r84q29k181l38L534K073k36j835j3N211K9o635
6320i77m49n33m829j237J307o75m180l663J646N076M151K441j667j52n89Q43k001
6303e488j236k992l43L565M788K890K598k092j439L963j664p347L43j150l692
6288i296L310J138k423m05L804J955l768k616j376n41J099k080J909K192K51L151
6272c696M190j443l015n2nr32L909J168J072l163k401k177k037R44M07J720J86
6255e325k709J763L352n89j041n45j781l121l446J799J618o48L747K556j948J714
$$ plain form
6239 -4604 -2266 -2340 -3455 -8394 -9538 -8032 -13070 -16144 -15490 -13462 -8029 -3831 -1355 5194 -45 -4671
6223 -4671 -6795 -9443 -12362 -15290 -14747 -12665 -11503 -8188 -9812 -9455 -4919 -7499 -10034 -7572 -4038
6208 -4038 -4544 -6452 -5120 -657 -603 -1226 2925 3747 -1318 -551 -4170 -11013 -11680 -9620 -10475 -6006 -6047
6191 -6047 -7360 -6810 -9651 -10872 -10393 -10998 -5512 -8093 -11730 -8619 -4947 -3977 -4183 -961 1905 9805
6175 9805 8619 3260 -3004 -7073 -4758 1197 6911 3639 -2614 -2277 -641 -4189 -8140 -9095 -11146
6160 -11146 -11692 -8156 -6449 -4531 -1852 -505 62 -3688 -4203 -3295 -147 1638 -690 -1774 1379 2746
6144 2746 594 -6068 -6339 -7199 -7971 -7896 -10780 -7491 -299 3891 5194 3243 -633 -6443 -8161 -4745
6128 -4745 -512 2774 538 -3730 -6347 -1484 805 -936 -5254 -7119 -9790 -9031 -11418 -5724 -5433
$$ packed form
6239d604K338p4j115m939j144J506n038l074O54K028N433M198K476O549n239m626
6223d671k124k648k919k928N43K082J162L315j624L57M536k580k535K462L534
6208d038n06j908J332M463N4o23M151Q22n065P67l619o843o67K060q55M469m1
6191f047j313N50k841j221M79o05N486k581l637L111L672R70k06L222K866P900
6175I805j186n359o264m069K315N955N714l272o253L37J636l548l951r55k051
6160a1146n46L536J707J918K679J347N67l750n15R08L148J785k328j084L153J367
6144B746k152o662k71q60p72P5k884L289P192M190J303j951l876n810j718L416
6128d745M233L286k236m268k617M863K289j741m318j865k671P59k387N694K91
$$ plain form
6113 -5433 -8422 -7184 -9432 -6370 -33 17 977 4951 6400 4650 2655 1784 -1273 -848 -4612 -6019
6097 -6019 -8464 -7457 -7324 -5060 -6679 -6792 -9441 -8109 -4659 -7559 -6538 -7134 -7767 -1891 -571 630
6081 630 -9 -2856 -5546 -1779 -590 -1318 928 1390 -4322 -6674 -4442 -1031 -4067 -4343 -2199 -5915
6065 -5915 -6961 -6867 -4886 -4015 1369 3301 5830 4831 -2067 -497 460 1246 1962 -1175 1832 6447 6362
6048 6362 6108 3448 1414 -2988 1597 1924 -1040 -3772 -4595 -2222 690 5183 10147 8273 5073 2937
6032 2937 1626 4328 770 1040 -1164 -3710 -7672 -9975 -2987 -148 401 -1403 -2262 -3190 -1024 2044
6016 2044 1928 -1592 -4187 -1610 -2415 -7292 -8515 -12234 -5320 -358 -376 -619 1350 -1736 -3869 -3354
6000 -3354 272 -236 -1197 -3876 -6930 -9462 -7468 -5573 -3833 -3401 -7950 -10990 -9256 -7154 -1328 2359
$$ packed form
6113e433k989J238k248L062O337N0R60L974J449j750j995q71l057M25l764j407
6097f019k445J007J33K264j619j13k649J332L450k900J021n96o33N876J320J201
6081F30o39k847k690L767J189p28K246M62n712k352K232L411l036k76K144l716
6065e915j046R4J981Q71N384J932K529r99o898J570R57P86P16l137L007M615q5
6048F362k54k660k034m402M585L27k964k732q23K373K912M493M964j874l200k136
6032B937j311K702l558K70k204k546l962k303O988K839N49j804q59r28K166L068
6016B044j16l520k595K577q05m877j223l719O914M962j8k43J969l086k133N15
6000c354L626n08r61k679l054k532J994J895J740M32m549l040J734K102N826L687
$$ plain form
5984 2359 -2874 -3919 633 2005 1007 -263 773 1507 8 -2059 -4540 -5421 -5005 -671 1793 2786
5968 2786 1179 2287 2932 3989 1784 -1053 -2384 -4505 -4718 -1611 -666 -4404 -2185 736 1070 -1253
5952 -1253 -3675 -740 -1385 -3325 -6978 -7360 -6500 -4216 -2822 -402 983 -794 -2082 -70 -2033 1377
5936 1377 8688 10226 7483 5337 236 -4844 -9113 -4835 582 224 3593 4838 2119 3313 1873
5921 1873 118 -1853 -2538 -5780 -5277 -5063 -2147 -1660 -3638 -3524 -6843 -3852 -2755 -1811 -1590 -4239 -3722
5904 -3722 -1356 -3299 -4867 -2807 -1648 -2416 -3343 -3497 -2904 -2639 125 5365 4266 -867 -419 -1019 -3930
5887 -3930 -7597 -12532 -14786 -10809 -6135 -3166 584 192 -21 -2420 -2340 -2444 -5971 -7655 -5468 -5798
5871 -5798 -8315 -10039 -10760 -10381 -6506 -5387 -4307 -958 -962 1500 1640 -1823 -6460 -1218 -1101 -3539 -1964
$$ packed form
5984B359n233j045M552J372r98j270J036P34j499k067k481q81M16M334K464R93
5968B786j607J108O45J057k205k837j331k121k13L107R45l738K219K921L34k323
5952a253k422K935o45j940l653l82Q60K284J394K420J385j777j288K012j963L410
5936A377P311J538k743k146n101n080m269M278N417l58L369J245k719J194j440
5921A873j755j971o85l242N03K14K916M87j978J14l319K991J097R44K21k649N17
5904c722K366j943j568K060J159p68r27j54N93K65K764N240j099n133M48o00k911
5887c930l667m935k254L977M674K969L750l92k13k399Q0j04l527j684K187l30
5871e798k517j724p21L79L875J119J080L349mK462J40l463m637N242J17k438J575
$$ plain form
5854 -1964 -383 -1240 -8558 -14956 -17021 -12588 -8562 -3809 -851 914 753 -4861 -9734 -9492 -8302 -8758
5838 -8758 -5485 -3482 -1964 -7196 -11121 -12211 -7914 -7644 -1897 -1659 127 -2194 -3810 -6462 -3247
5823 -3247 -35 -2109 -5332 -10563 -11266 -9921 -8259 -4518 -4335 -5466 -2212 -93 226 -4321 -6892 -8685
5807 -8685 -2668 2050 2889 7297 5570 -1351 -5832 -8992 -10469 -8693 -4818 -4778 -7303 -2927 1926 3227
5791 3227 1114 -4460 -7434 -5868 -2777 -2728 -5556 -2543 3168 5395 5143 5935 3358 -89 -950 3557
5775 3557 4817 1841 -59 -6008 -9655 -7790 -2968 -2893 -117 -1279 -4352 -4420 460 3560 -863 -3224
5759 -3224 -703 763 357 1699 2049 387 -760 -4925 -5007 -4626 -4695 -3085 -3967 -5405 -2126 -1615 -4779
5742 -4779 -6159 -4712 908 2761 2545 1202 -2543 -8704 -10670 -9040 -9211 -11127 -8968 -6098 -4247
$$ packed form
5854a964J581q57p318o398k065M433M026M753K958J765j61n614m873K42J190m56
5838h758L273K003J518n232l925j090M297K70N747K38J786k321j616k652L215
5823c247L212k074l223n231p03J345J662L741J83j131L254K119L19m547k571j793
5807h685O017M718Q39M408j727o921m481l160j477J776L875M0k525M376M853J301
5791C227k113n574k974J566L091M9k828L013N711K227k52P92k577l447q61M507
5775C557J260k976j900n949l647J865M822P5K776j162l073o8M880L100m423k361
5759c224K521J466m06J342L50j662j147m165q2L81o9J610q82j438L279N11l164
5742d779j380J447N620J853k16j343l745o161j966J630j71j916K159K870J851
$$ plain form
5727 -4247 -1975 4009 5871 4344 620 -5556 -7031 -3028 -4453 -1579 -3249 -3297 -2013 -8 1083
5712 1083 -1830 -1483 -2672 -2061 -931 -2769 -5265 -8373 -7932 -2618 9 1577 1869 3723 -507 -3516
5696 -3516 -2462 3192 6338 6373 5648 5988 -257 -526 -942 3084 6569 6724 5776 6816 8162 9035 7999
5679 7999 6866 3308 -1680 110 -4146 -6834 -7221 -9291 -9335 -10624 -11232 -6726 -3586 980 -1312 -5651
5663 -5651 637 3753 4731 1803 -2801 -2028 -918 -1584 -4937 -6329 -2885 -3472 -7183 -9274 -5133 -91
5647 -91 1296 -1284 -3764 -1454 -204 -2971 -3191 -1220 -1098 3132 2228 562 166 -1442 -5347 -7700
5631 -7700 -10498 -5702 -6995 -10236 -10835 -9944 -2557 -2266 -2799 -5183 -7981 -8101 -7279 -4776 66 -3003
5615 -3003 -4007 -539 400 1188 1538 -3131 -6312 -1022 -4116 -7103 -7331 -1625 -1944 -996 2268 -602
$$ packed form
5727d247K272N984J862j527l724o176j475M003j425K874j670m8J284K005J091
5712A083k913L47j189O11J130j838k496l108M41N314K627J568K92J854m230l009
5696c516J054N654L146L5p25L40o245k69m16M026L485J55r48J040J346Q73j036
5679G999j133l558m988J790m256k688l87k070m4j289o08M506L140M566k292m339
5663e651O288L116R78k928m604P73J110o66l353j392L444n87l711k091M141N042
5647i1J387k580k480K310J250k767k20J971J22M230r04j666l96j608l905k353
5631g700k798M796j293l241n99Q91P387K91n33k384k798j20Q22K503M842l069
5615c003j004L468R39P88L50m669l181N290l094k987k28N706l19R48L264k870
$$ plain form
5599 -602 -551 -121 1373 3733 5471 9156 6589 6715 7177 8162 3833 574 -2766 1536 1275 -1440 5941
5582 5941 10994 7048 9142 9160 2567 2813 2200 219 7231 9743 4592 4487 1862 490 3920 5309
5566 5309 6994 4813 -423 -1722 518 901 -1992 -4766 -6673 -5922 -2515 -5124 -7852 -6599 -7441 -9710
5550 -9710 -7597 -4638 3928 11068 10305 4029 -623 -97 -451 3025 3893 1149 304 -4453 -7022 -6401
5534 -6401 -6007 -4202 -1956 1178 3795 -810 -2513 -5807 -4310 -1102 1098 448 -4519 -10246 -12626
5519 -12626 -6836 -1014 3242 4010 7607 6272 274 -6109 -10479 -8441 -4273 -997 2641 5751 1136
5504 1136 2289 2125 2605 4603 7795 6773 7327 8192 6444 4422 3539 2932 1970 -255 -6120 -4867 -2064
5487 -2064 -873 930 2909 3807 2836 2876 1155 -2255 -3073 -565 -512 -1953 -8068 -6837 -5175 -7749 -6556
$$ packed form
5599f02N1M30J494K360J738L685k567J26M62R85m329l259l340M302k61k715P381
5582E941N053l946K094J8o593K46o13j981P012K512n151j05k625j372L430J389
5566E309J685k181n236j299K240L83k893k774j907P51L407k609k728J253q42k269
5550i710K113K959Q566P140p63o276m652N26l54L476Q68k744q45m757k569O21
5534f401L94J805K246L134K617m605j703l294J497L208K200o50m967n727k380
5519a2626N790N822M256P68L597j335n998o383m370K038M168L276L638L110m615
5504A136J153j64M80J998L192j022N54Q65j748k022q83o07r62k225n865J253K803
5487b064J191J803J979Q98r71M0j721l410q18K508N3j441o115J231J662k574J193
$$ plain form
5470 -6556 -5020 -2124 2665 4445 208 70 3517 -3237 -8720 -8273 -6692 -2252 2876 1454 -2021
5455 -2021 -5587 344 491 139 6980 7830 7805 6419 3907 3341 -2539 -5442 411 1032 984 2090 1439
5438 1439 343 -888 -1864 -946 1882 7173 5284 4098 3315 604 -643 -759 -5909 -5424 -2870 3875
5422 3875 5185 676 -3404 -8016 -10337 -11228 -6963 -242 -551 2071 1953 2597 5272 7981 10497 10946
5406 10946 6137 7337 5232 592 3764 6399 2965 5646 8235 10612 7535 5085 923 596 2139
5391 2139 6192 11374 10282 7217 3131 1964 3452 3124 675 505 -849 -1836 -2931 -5652 -7073 -4790
5375 -4790 -4985 -5692 -1876 1979 2383 -1193 -5742 -3330 -5501 -1985 -4709 -11501 -10947 -5022 2049 1987
5359 1987 3174 2078 -2423 -2735 -4896 -4475 -1668 -2466 -6883 -10094 -10511 -8154 -6534 -2302 -348 1193
$$ packed form
5470f556J536K896M789J780m237j38L447o754n483M47J581M440N128j422l475
5455b021l566N931J47l52O841Q50k5j386k512n66n880k903N853O21m8J106o51
5438A439j096j231r76R18K828N291j889j186p83k711j247j16n150M85K554O745
5422C875J310m509m080m612k321q91M265O721l09K622j18O44K675K709K516M49
5406A0946m809J200k105m640L172K635l434K681K589K377l077k450m162l27J543
5391B139M053N182j092l065m086j167J488l28k449j70j354r87j095k721j421K283
5375d790j95p07L816L855M04l576m549K412k171L516k724o792N54N925P071o2
5359A987J187j096m501l12k161M21K807p98m417l211m17K357J620M232J954J541
$$ plain form
5343 1193 3025 428 711 5911 8386 5279 -560 -798 -2517 -2666 246 2253 2184 6897 8129 7261
5327 7261 7707 11446 8711 4953 2204 3703 2504 2451 1717 4683 3033 -403 2599 3697 -3183 -9540
5311 -9540 -11203 -6863 1448 527 -1352 -982 1001 -2822 -5717 -5233 -2597 647 3414 900 -3371 -741
5295 -741 2112 2799 5059 3112 2927 -270 353 3009 6634 8130 6130 3025 6095 4184 826 -7134
5279 -7134 -10914 -7327 -11448 -8836 -4170 356 -2782 -5066 -5388 -5013 -5415 -1319 3868 3177 -1605 413
5263 413 1967 -793 -1700 842 5913 4611 2364 -3230 -6373 -5503 -2554 1954 398 -2039 -1114 -604
5247 -604 -1825 -1967 -1093 -1012 -1556 2567 2954 2219 -1793 -3768 -5549 -4635 -3850 -7157 -4703 -1091 6026
5230 6026 4844 1395 -956 340 2837 1099 -2239 -1930 -1738 449 -1017 -803 1139 4492 3310 354
$$ packed form
5343A193J832k597K83N200K475l107n839k38j719j49K912K007o9M713J232q68
5327G261M46L739k735l758k749J499j199n3p34K966j650l436L002J098o880o357
5311i540j663M340Q311r21j879L70J983l823k895M84K636L244K767k514m271K630
5295g41K853O87K260j947j85l197O23K656L625J496k000l105L070j911l358p960
5279g134l780L587m121K612M666M526l138k284l22L75m02M096N187o91m782K018
5263D13J554k760r07K542N071j302k247n594l143Q70K949M508j556k437R25N10
5247f04j221j42Q74Q1n44M123L87p35m012j975j781R14P85l307K454L612P117
5230F026j182l449k351J296K497j738l338L09J92K187j466K14J942L353j182k956
$$ plain form
5214 354 -394 4602 4082 -1216 -2303 -694 3258 5249 4633 754 -5151 -7685 -4832 -6364 -4677 -4154
5198 -4154 -4799 -4594 -1653 -264 -214 -2331 708 4208 4056 3805 7095 5847 4134 1947 2873 -2698 -6290
5181 -6290 -6782 -3243 -452 2948 5657 5297 5504 3768 2233 4015 5191 6899 3358 -1611 -7324 -8362
5165 -8362 -4947 -972 -250 -5142 -6326 -1489 4222 11962 10346 5670 3186 3636 535 -937 -5752
5150 -5752 -5722 -4832 -1363 -1079 -4784 -1624 5921 5962 1450 431 3625 5499 6109 9950 9134 7221 6106
5133 6106 3818 6894 7010 1860 -1498 -3239 113 7004 5562 5249 1393 4030 6845 3922 2079
5118 2079 -2121 -4665 -3255 2082 112 1665 5464 4946 3126 -745 1292 3885 -1704 -2977 3085
5103 3085 3963 940 421 -1465 -2635 -1545 -2270 -3785 -2511 3172 7070 6974 1618 -3525 -3988 -6724
$$ packed form
5214C54p48M996n20n298j087J609L952J991o16l879n905k534K853j532J687N23
5198d154o45K05K941J389N0k117L039L500j52k51L290j248j713k187R26n571l592
5181f290m92L539K791L400K709l60K07j736j535J782J176J708l541m969n713j038
5165h362L415L975P22m892j184M837N711P740j616m676k484M50l101j472m815
5150e752L0Q90L469K84l705L160P545M1m512j019L194J874O10L841q16j913j115
5133F106k288L076J16n150l358j741L352O891j442l13l856K637K815k923j843
5118B079m200k544J410N337j970J553L799n18j820l871K037K593n589j273O062
5103C085Q78l023n19j886j170J090p25j515J274N683L898r6n356n143m63k736
$$ plain form
5087 -6724 -5192 -182 1428 533 785 2582 6456 284 -3308 -10648 -12702 -9206 -7943 -5038 -6125
5072 -6125 -6396 -6922 -3323 714 -137 -6094 -3587 -2501 -3117 -1033 -572 -2338 -2136 -3017 -1980 -5151 -7905
5055 -7905 -6944 -9493 -3120 760 4551 3416 2547 8071 7570 7209 6658 6011 3794 6186 7870 8023 9473
5038 9473 10025 9543 9969 6907 -3477 -5794 -5060 -1654 -4460 -4329 2671 2178 1618 -1272 -2006 -1396 364
5021 364 -3983 -5591 -4417 -3741 225 -962 -3449 -4891 -8563 -6926 -5126 -7031 -8634 -7162 -2382
5006 -2382 1504 812 4350 3538 5524 9157 11445 10675 8389 3760 1911 2511 -40 200 -1645 -4616
4990 -4616 -4809 -3942 -2718 2196 1598 2775 833 -4443 -1869 394 578 -468 -5234 -9432 -2974 -1206
4974 -1206 -3312 712 2325 2157 2076 2240 -227 2327 1801 1867 2088 -1972 -3767 -5182 -426 4953 2767
$$ packed form
5087f724J532N010J610q95K52J797L874o172l592p340k054L496J263K905j087
5072f125k71n26L599M037q51n957K507J086o16K084M61j766K02q81J037l171k754
5055g905R61k549O373L880L791j135q69N524n01l61n51o47k217K392J684J53J450
5038I473N52m82M26l062j0384k317P34L406k806J31P000m93n60k890p34O10J760
5021C64m347j608J174O76L966j187k487j442l672J637J800j905j603J472M780
5006b382L886o92L538q12J986L633K288p70k286m629j849O00k551K40j845k971
4990d616j93Q67J224M914n98J177j942n276K574K263J84j046m766m198O458J768
4974a206k106M024J613j68q1J64k467K554n26O6K21m060j795j415M756N379k186
$$ plain form
4957 2767 -5325 -6970 -5957 -5532 -1493 3471 5406 5501 1695 -2908 346 1189 -3712 -3669 3525 8431
4941 8431 7206 5668 2712 -588 -3881 -2161 -2529 -4519 -25 3484 1351 1480 2462 4019 4877 1863
4925 1863 4763 7159 6893 -363 -4445 -2262 -483 -7219 -9752 -6006 -6580 -7578 -7603 -6913 -7696 -7232 -4697
4908 -4697 -3552 -6572 -1890 3677 6789 6681 4052 1871 498 -4030 -3691 1905 1457 -759 -2524 -2622
4892 -2622 1917 933 1644 1401 -1523 -4948 -5670 -1680 771 -236 -403 -310 -1802 -2391 -1733 -3454 134
4875 134 3063 6087 2952 1120 -4818 -4296 -4877 -6278 -5047 2893 2971 3904 5091 203 -5258 -2177
4859 -2177 -5214 -5080 -3059 -691 443 2035 -956 -525 -3433 -3826 -15 -2744 -7503 -7686 -2862 -235
4843 -235 1096 3174 1268 -1071 -2175 1856 3941 -683 1236 7253 8560 5064 -722 -4784 -5944
$$ packed form
4957B767q092j645J013M25M039M964J935R5l806m603L254Q43m901M3P194M906
4941H431j225j538k956l300l293J720l68j990M494L509k133J29R82J557Q58l014
4925A863K900K396k66p256m082K183J779o736k533L746n74r98k5O90p83M64K535
4908d697J145l020M682N567L112j08k629k181j373m528L39N596m48k216j765r8
4892b622M539r84P11k43k924l425p22L990K451j007j67R3j492n89O58j721L588
4875A34K929L024l135j832n938N22n81j401J231P940P8R33J187m888n461L081
4859b177l037J34K021K368J134J592k991M31k908l93L811k729m759j83M824K627
4843b35J331K078j906k339j104M031K085m624J919O017J307l496n786m062j160
$$ plain form
4828 -5944 -4703 -2413 203 910 5748 7567 2862 -2364 93 1895 1346 1483 1960 -701 -4345 -3323
4812 -3323 749 1570 2131 2439 -1329 -171 510 57 -175 1269 4305 2640 225 -5520 -4017 348
4796 348 -2666 -3991 -1889 -3808 -1224 -1206 -585 4057 6842 4306 7047 5974 3723 2166 115 -4836
4780 -4836 -3421 6197 10666 7895 4632 442 576 985 4735 6397 10887 7423 6090 4516 3078
4765 3078 4241 5629 6930 8090 6709 2685 1872 901 -1370 800 2431 3066 849 2871 5088 2018
4749 2018 2511 3210 3657 341 -2020 -2148 791 1092 1441 1540 664 1811 5734 4252 -1297 -3526 -2067
4732 -2067 1640 211 -1061 -4397 -8078 -549 5673 5998 7365 5487 -407 -508 1210 261 324 3521
4716 3521 7120 6779 7323 5170 3463 4534 -9 2271 6669 9096 9424 5284 5963 6782 2830 3298
$$ packed form
4828e944J241K290K616P07M838J819m705n226K457J802n49J37M77k661l644J022
4812c323M072Q21N61L08l768J158O81m53k32J444L036j665k415n745J503M365
4796C48l014j325K102j919K584J8O21M642K785k536K741j073k251j557k051m951
4780d836J415R618M469k771l263m190J34M09L750J662M490l464j333j574j438
4765C078J163J388J301J160j381m024q13r71k271K170J631O35k217K022K217l070
4749B018M93O99M47l316k361j28K939L01L49R9q76J147L923j482n549k229J459
4732b067L707j429j272l336l681P529O222L25J367j878n894j01J718r49O3L197
4716C521L599l41N44k153j707J071m543K280M398K427L28m140O79Q19l952M68
$$ plain form
4700 3298 3925 -215 3789 3024 4223 6699 12030 8588 3779 1922 1557 -533 -1883 -1791 5222 5888
4684 5888 2556 4678 8711 6880 3870 6334 10583 13366 13082 8555 9111 4734 2142 2579 1523 1892
4668 1892 1150 -792 2571 2948 3917 2409 0 3554 6271 9937 7357 8993 11970 8751 6651 6043
4652 6043 11003 6855 5717 3375 2105 7035 6984 4604 4716 2135 -5664 -8788 -6498 -2682 -3363 -639
4636 -639 512 1828 2757 -629 -5015 -6744 -6919 -5372 -1760 -815 -234 -2335 706 4575 4520 4852 4891
4619 4891 8883 12266 8180 5320 7108 6350 3174 4283 -178 -4821 -4537 3241 3382 1898 130 -3131
4603 -3131 2200 4912 3496 632 241 -2434 -2720 -781 -2153 1314 5408 6345 3992 978 -1479 -867
4587 -867 2313 3024 -1149 -6113 -2745 -1880 -2440 -1192 -771 1044 2815 2468 1590 4330 3824 -1542 -1832
$$ packed form
4700C298O27m140M004p65J199K476N331l442m809j857l65k090j350R2P013O66
4684E888l332K122M033j831l010K464M249K783k84m527N56m377k592M37j056L69
4668A892p42j942L363L77R69j508k409L554K717L666k580J636K977l219k100o08
4652F043M960m148j138k342j270M930n1k380J12k581p799l124K290L816o81K724
4636f39J151J316R29l386m386j729j75J547L612R45N81k101L041L869n5L32L9
4619D891L992L383m086k860J788p58l176J109m461m643K84P778J41j484j768l261
4603c131N331K712j416k864l91k675k86J939j372L467M094R37k353l014k457O12
4587h67L180P11m173m964L368Q65n60J248M21J815J771l47q78K740n06n366k90
$$ plain form
4570 -1832 -1940 -2812 758 560 1213 980 -360 -492 -363 3115 3320 1203 -1525 -1251 3252 5679 788
4553 788 -954 1960 8319 3927 1330 2722 6235 3240 2761 1193 -2501 -2484 -3054 -3152 -482 1114 -2344
4536 -2344 1214 1067 1397 3075 2687 2101 1228 138 -332 1927 3824 6167 7459 7625 4433 5029 602
4519 602 2951 3172 -192 6437 10451 8210 5908 1548 -4139 286 9967 10911 8913 9065 4789 -58
4503 -58 -1834 -2950 -55 1652 2440 2085 3093 3096 4060 4871 2352 1578 708 3572 1504 -638 491 -5466
4485 -5466 -5226 -3684 -4101 -1806 -3690 1175 3653 929 -2722 -2475 -1348 -3082 2581 4776 698 3041
4469 3041 8861 7195 3274 2652 3851 -540 833 2619 4578 3626 6798 12044 12065 15132 17136 14222
4453 14222 9563 11068 5158 -1377 -2422 644 1895 2418 3558 5653 6107 8519 2226 2792 6200
$$ packed form
4570a832j08q72L570j98O53k33j340j32J29L478K05k117k728K74M503K427m891
4553G88j742K914O359m392k597J392L513k995m79j568l694J7n70r8K670J596l458
4536b344L558j47L30J678l88n86q73j090m70K259J897K343J292J66l192N96m427
4519F02K349K21l364O629M014k241k302m360n687M425R681R44j998J52m276m847
4503e8j776j116K895J707P88l55J008LR64Q11k519p74q70K864k068k142J129n957
4485e466K40J542m17K295j884M865K478k724l651K47J127j734N663K195m078K343
4469C041N820j666l921o22J199m391J373J786J959r52L172N246K1L067K004k914
4453A4222m659J505n910o535j045L066J251N23J140K095M54K412o293N66L408
$$ plain form
4438 6200 5562 4527 5330 6886 11166 9180 4213 4795 10250 11961 7631 6245 7355 12260 10920 6002
4422 6002 7242 4202 1025 895 1796 3270 5344 4713 5091 3808 3440 9169 6016 4524 -510 -3313
4406 -3313 -1751 1409 3932 6190 6276 5042 5018 6510 7628 8670 10670 9548 9574 6200 8238 8792 8174
4389 8174 11375 12870 7782 3211 1456 -3074 -5842 1867 2699 -1888 -90 -144 -848 3689 662 4704
4373 4704 6781 8798 3061 870 -3329 -549 1594 5884 6556 7491 8775 10447 8176 2244 412
4358 412 3707 6934 8056 6496 6036 7851 5466 4274 4861 1089 1452 1859 1160 -1467 66 -430 -530
4341 -530 -2683 -3065 -3775 -4439 -853 -648 -771 52 1994 3517 -443 2467 4241 2072 -302 2192 1877
4324 1877 1019 4600 6829 12271 10465 5005 7021 7311 8454 11002 5293 4732 8755 4447 1490 2840
$$ packed form
4438F200o38j035Q03J556M280j986m967N82N455J711m330j386J110M905j340m918
4422F002J240l040l177j30R01J474K074o31L78j283l68N729l153j492n034k803
4406c313J562L160K523K258Q6j234k4J492J118J042K000j122K6l374K038N54o18
4389H174L201J495n088m571j755m530k768P709Q32m587J798n4p04M537l027M042
4373D704K077K017n737k191m199K780K143M290O72R35J284J672k271n932j832
4358D12L295L227J122j560m60J815k385j192N87l772L63M07o99k627J533m96j00
4341e30k153l82p10o64L586K05j23Q23J942J523l960K910J774k169k374K494l15
4324A877q58L581K229N442j806n460K016K90J143K548n709n61M023m308k957J350
$$ plain form
4308 2840 2628 4622 6451 6992 8012 3740 1314 6449 7486 2908 -812 4001 1703 256 -2108
4293 -2108 -2758 -2319 -1272 6990 5378 -2294 -3890 -3465 -520 7056 8616 3725 -1662 -2293 -1702 732
4277 732 -2543 -2235 -6753 -7291 -4604 -4217 -313 1899 890 1931 3916 4458 1214 561 -338 -1553 -613
4260 -613 5275 3323 4181 7042 7727 9769 2178 -3073 -1373 1233 5209 7656 6527 7959 8667 3381
4244 3381 636 318 3515 3007 2005 2843 4869 7605 9264 6409 4266 6892 6301 4212 3762 5569
4228 5569 2437 2350 2448 4609 9955 12378 11370 7764 6534 9413 5577 8550 12422 17538 16223 13072
4212 13072 10119 4872 5343 336 -3039 -6274 -9215 -4516 -4419 -6747 -4833 -4454 2856 8338 8411 7957
4196 7957 9025 9538 9074 10152 12413 10722 8927 10225 13569 11069 5666 5886 4772 3993 1253 -2761
$$ packed form
4308B840k12J994J829N41J020m272k426N135J037m578l720M813k298j447k364
4293b108o50M39J047Q262j612p672j596M25K945P576J560m891n387o31N91K434
4277G32l275L08m518n38K687L87L904K212j009J041J985N42l244o53q99j215R40
4260f13N888j952Q58K861O85K042p591n251J700K606L976K447j129J432P08n286
4244C381k745l18L197n08j002Q38K026K736J659k855k143K626n91k089m50J807
4228E569l132q7R8K161N346K423j008l606j230K879l836K973L872N116j315l151
4212A3072k953n247M71n007l375l235k941M699R7k328J914L79P310N482P3m54
4196G957J068N13m64J078K261j691j795J298L344k500n403K20j114p79k740m014
$$ plain form
4180 -2761 -2037 1622 4746 4660 7827 10266 6407 2447 5464 1562 -2955 2014 4768 4636 6330 8199
4164 8199 12305 7169 7620 8313 9943 8735 8251 6036 -43 -6622 -6059 785 5034 4301 6521 5850
$$ packed form
4180b761P24L659L124q6L167K439l859l960L017l902m517M969K754j32J694J869
4164H199M106n136M51O93J630j208m84k215o079o579N63O844M249p33K220o71
$$ [...]
##END NTUPLES=NMR SPECTRUM
##END=
