##TITLE=Analysis number 310484
Compound Code mo 07007
Book Reference 407/77
Project Code adrs
Chemist Name andyw
##JCAMPDX= 6.0         $$ Bruker NMR JCAMP-DX V2.0
##DATA TYPE= NMR SPECTRUM
##DATA CLASS= NTUPLES
##ORIGIN= Bruker BioSpin GmbH
##OWNER= NMR
$$ XWIN-NMR		Version 3.5
$$ Fri Jun 17 12:37:31 2005 GMT Daylight Time (UT+1h)  MAYBRIDGE\NMR@NMR_250MHZ
##.OBSERVE FREQUENCY= 250.131544655141
##.OBSERVE NUCLEUS= ^1H
##.ACQUISITION MODE= SIMULTANEOUS (DQD)
##.ACQUISITION SCHEME= undefined
##.AVERAGES= 16
##.DIGITISER RES= 18
##SPECTROMETER/DATA SYSTEM= dpx250
##.PULSE SEQUENCE= zg30
##.SOLVENT NAME= CDCl3
##.SHIFT REFERENCE= (INTERNAL, CDCl3, 0, 16.522)
##AUDIT TRAIL= $$ (NUMBER, WHEN, WHO, WHERE, WHAT)
$$ ##TITLE= Audit trail, XWIN-NMR		Version 3.5
$$ ##JCAMPDX= 5.01
$$ ##ORIGIN= Bruker BioSpin GmbH
$$ ##OWNER= NMR
$$ C:\u/data/dgb/nmr/ADRS/4190/pdata/1/auditp.txt
$$ ##AUDIT TRAIL=  $$ (NUMBER, WHEN, WHO, WHERE, WHAT)
(   1,<2005-06-17 12:37:10.52 +100>,<MAYBRIDGE\NMR>,<NMR_250MHZ>,
      <created by zg, POWCHK disabled, PULCHK disabled
       configuration hash MD5:
       62 19 C7 07 E1 42 D1 B7 37 6C 3D D0 77 39 F9 E6
       data hash MD5: 64K
       31 9E 10 EC FD 6B 5C 27 E2 F5 4C 47 CE A4 85 90>)
(   2,<2005-06-17 12:37:21.47 +100>,<MAYBRIDGE\NMR>,<NMR_250MHZ>,
      <Start of raw data processing
       ef LB = 0.3 FT_mod = 6 PKNL = 1 SI = 32K 
       data hash MD5: 32K
       EC F9 9A 5B 57 6D BD FC 3B 86 39 FC 9D BF 1E 23>)
(   3,<2005-06-17 12:37:23.21 +100>,<MAYBRIDGE\NMR>,<NMR_250MHZ>,
      <apk 
       data hash MD5: 32K
       45 64 6B F4 69 BC 86 55 EC D6 9F 70 F4 61 3B E8>)
(   4,<2005-06-17 12:37:25.00 +100>,<MAYBRIDGE\NMR>,<NMR_250MHZ>,
      <abs ABSG = 5 
       data hash MD5: 32K
       BB C3 2A 9E 4B 04 30 03 23 B6 55 F6 C5 97 50 75>)
$$ ##END=
$$ 
$$ hash MD5
$$ 67 43 88 3E 55 9B 01 49 89 A9 C3 0D 42 CB A7 33
##$RELAX= 
##$RELAX= 
##$RELAX= 
##$RELAX= 
##$RELAX= 
##$RELAX= 
##$RELAX= 
$$ Bruker specific parameters
$$ --------------------------
##$DU= <C:\u>
##$EXPNO= 4190
##$NAME= <ADRS>
##$PROCNO= 1
##$TYPE= <nmr>
##$USER= <dgb>
##$AMP= (0..31)
100 100 100 100 100 100 100 100 100 100 100 100 100 100 100 100 100 100 
100 100 100 100 100 100 100 100 100 100 100 100 100 100 
##$AQSEQ= 0
##$AQ_mod= 3
##$AUNM= <au_zg>
##$AUTOPOS= <23 >
##$BF1= 250.13
##$BF2= 250.13
##$BF3= 250.13
##$BF4= 250.13
##$BF5= 500.13
##$BF6= 500.13
##$BF7= 500.13
##$BF8= 500.13
##$BYTORDA= 1
##$CFDGTYP= 0
##$CFRGTYP= 5
##$CHEMSTR= <none>
##$CNST= (0..31)
1 1 145 1 1 1 1 1 1 1 1 1 1 1 1 1 1 1 1 1 1 1 1 1 1 1 1 1 1 1 1 1 
##$CPDPRG= <>
##$CPDPRG1= <>
##$CPDPRG2= <>
##$CPDPRG3= <>
##$CPDPRG4= <mlev>
##$CPDPRG5= <mlev>
##$CPDPRG6= <mlev>
##$CPDPRG7= <mlev>
##$CPDPRG8= <mlev>
##$CPDPRGB= <>
##$CPDPRGT= <>
##$D= (0..31)
0 1 0 0 0 0 0 0 0 0.06 0 0 0 0 0 0 0.0002 0 0 0 0 0 0 0 0 0 0 0 0 0 0 
0 
##$DATE= 1119008229
##$DBL= (0..7)
120 120 120 120 120 120 120 120 
##$DBP= (0..7)
150 150 150 150 150 150 150 150 
##$DBP07= 0
##$DBPNAM0= <>
##$DBPNAM1= <>
$$ [...]
##$SUBNAM7= <"">
##$SUBNAM8= <"">
##$SUBNAM9= <"">
##$SW= 20.6930455092707
##$SWIBOX= (0..15)
0 0 3 0 0 0 0 0 0 0 0 0 0 0 0 0 
##$SW_h= 5175.983436853
##$TD= 65536
##$TD0= 1
##$TE= 295.16
##$TE2= 300
##$TE3= 300
##$TEG= 300
##$TL= (0..7)
0 120 120 120 120 120 120 120 
##$TP= (0..7)
150 150 150 150 150 150 150 150 
##$TP07= 0
##$TPNAME0= <>
##$TPNAME1= <>
##$TPNAME2= <>
##$TPNAME3= <>
##$TPNAME4= <>
##$TPNAME5= <>
##$TPNAME6= <>
##$TPNAME7= <>
##$TPOAL= (0..7)
0.5 0.5 0.5 0.5 0.5 0.5 0.5 0.5 
##$TPOFFS= (0..7)
0 0 0 0 0 0 0 0 
##$TUNHIN= 0
##$TUNHOUT= 0
##$TUNXOUT= 0
##$USERA1= <user>
##$USERA2= <user>
##$USERA3= <user>
##$USERA4= <user>
##$USERA5= <user>
##$V9= 5
##$VALIST= <valist>
##$VCLIST= <CCCCCCCCCCCCCCC>
##$VD= 0
##$VDLIST= <DDDDDDDDDDDDDDD>
##$VPLIST= <PPPPPPPPPPPPPPP>
##$VTLIST= <TTTTTTTTTTTTTTT>
##$WBST= 1024
##$WBSW= 4
##$XGAIN= (0..3)
0 0 0 0 
##$XL= 0
##$YL= 0
##$YMAX_a= 417918
##$YMIN_a= -499319
##$ZGOPTNS= <>
##$ZL1= 120
##$ZL2= 120
##$ZL3= 120
##$ZL4= 120
##$ABSF1= 16.522
##$ABSF2= -4.171173
##$ABSG= 5
##$ABSL= 3
##$ALPHA= 0
##$AQORDER= 0
##$ASSFAC= 0
##$ASSFACI= 0
##$ASSFACX= 0
##$ASSWID= 0
##$AUNMP= <proc_1d>
##$AZFE= 0.1
##$AZFW= 0.1
##$BCFW= 0
##$BC_mod= 0
##$BYTORDP= 0
##$COROFFS= 0
##$CY= 12.5
##$DATMOD= 1
##$DC= 0
##$DFILT= <>
##$DTYPP= 0
##$F1P= 14.0000005364418
##$F2P= -0.99999901652339
##$FCOR= 0.5
##$FTSIZE= 32768
##$FT_mod= 6
##$GAMMA= 0
##$GB= 0
##$INTBC= 1
##$INTSCL= 1
##$ISEN= 128
##$LB= 0.3
##$LEV0= 0
##$LPBIN= 0
##$MAXI= 10000
##$MC2= 0
##$MEAN= 0
##$ME_mod= 0
##$MI= 0
##$NCOEF= 0
##$NC_proc= -4
##$NLEV= 6
##$NOISF1= 0
##$NOISF2= 0
##$NSP= 0
##$NTH_PI= 0
##$NZP= 0
##$OFFSET= 16.522
##$PC= 1
##$PHC0= -80.45569
##$PHC1= 7.355778
##$PH_mod= 1
##$PKNL= yes
##$PPARMOD= 0
##$PSCAL= 4
##$PSIGN= 0
##$REVERSE= no
##$SF= 250.13
##$SI= 32768
##$SIGF1= 0
##$SIGF2= 0
##$SINO= 400
##$SIOLD= 32768
##$SREGLST= <1H.CDCl3>
##$SSB= 0
##$STSI= 32768
##$STSR= 0
##$SW_p= 5175.98343685301
##$SYMM= 0
##$S_DEV= 0
##$TDeff= 65536
##$TDoff= 0
##$TI= <Analysis number 999999
Compound Code 99
Book Reference 9
Project Code 9>
##$TILT= no
##$TM1= 0
##$TM2= 0
##$TOPLEV= 0
##$USERP1= <user>
##$USERP2= <user>
##$USERP3= <user>
##$USERP4= <user>
##$USERP5= <user>
##$WDW= 1
##$XDIM= 32768
##$YMAX_p= 504684529
##$YMIN_p= -101155
$$ End of Bruker specific parameters
$$ ---------------------------------
##NTUPLES= NMR SPECTRUM
##VAR_NAME=  FREQUENCY,     SPECTRUM/REAL,   SPECTRUM/IMAG
##SYMBOL=    X,             R,               I
##VAR_TYPE=  INDEPENDENT,   DEPENDENT,       DEPENDENT
##VAR_FORM=  AFFN,          ASDF,            ASDF
##VAR_DIM=   32768,         32768,           32768
##UNITS=     HZ,            ARBITRARY UNITS, ARBITRARY UNITS
##FACTOR=    0.157963299565203, 1,           1
##FIRST=     4132.6476996994, 0,             0
##LAST=      -1043.33573715361, 0,           0
##MIN=       -1043.33573715361, -101155,     0
##MAX=       4132.6476996994, 504684529,     0
$$ Real data points
##PAGE= N=1
##DATA TABLE= (X++(R..R)), XYDATA
$$ [...]
18637A99446m1472o6113j4871N876j5583k9915l6679J1381O374k4864J0663L2270
18625C6513J3978J0739k3771m4799J0933J7275k319o865o864o141k447l223P109
18612A18m09p432j341J5559J2092j6747j4841r805j4369K9106j7592j0483q703
18599d4847k2026q098q122J2883K0534K539J3081K525m881K6011l716l543N414
18586a2246J4936m579J1550k3357k5575L0426O007k5855k3506j959p839K2517
18574c9480k696J4180K5522m936j8031j1188J6994K9229P239q775l1686k0771
18562d4399O719L4782J6638n617l885J1452L921n984r231k7494k4330j964m142
18549e3534l5062Q041K5632K9274J8882j2249n605L4568L939k4972N598J3542
$$ plain form
18637 199446 157974 91861 76990 82866 67283 37368 689 12070 18444 -6420 4243 36513
18625 36513 50491 61230 37459 -7340 3593 20868 18549 11684 4820 -1321 -3768 -6991 118
18612 118 -291 -7723 -9064 6495 18587 1840 -13001 -22806 -37175 -8069 -25661 -36144 -44847
18599 -44847 -66873 -74971 -83093 -70210 -49676 -47137 -34056 -31531 -36412 -10401 -14117 -17660 -12246
18586 -12246 2690 -1889 9661 -13696 -39271 -8845 -2838 -28693 -52199 -54158 -61997 -39480
18574 -39480 -42176 -27996 -2474 -7410 -25441 -36629 -19635 9594 16833 8058 -23628 -44399
18562 -44399 -37680 -2898 13740 8123 4238 15690 19611 13627 4396 -23098 -47428 -49392 -53534
18549 -53534 -88596 -80555 -54923 -25649 -6767 -19016 -24621 9947 13886 -11086 -5488 8054
18537H054J1750Q032o004k4225l1684l255L3822L172K9M19J6488n035n63k3821
18523a2821l3648o521J4241J6461m451o166J6471Q340q904J2958l186q338L932
18510a1632K7662r151j7344r054n968L486M782J8541J2741j2030o800M841n829
18497e755K2623l915M924l554m172r89K3943j7927j4764r675j2401J1359J1220
18484I17Q001J7757M631j0649j526m4145j9996M3332K8304j9432k9475l1598M013
18471d9866P324P526K5378j9451k528J0544J5306R039M270P854n20k5794k5491
18458c6409P318J9671k2428j4361K0859m954P566N5328o79k0926J0873j2701J2991
18445B2148J7803M853k8371r641J6813m9367R93J5480J4549j0487o271K5134l5471
$$ plain form
18537 8054 19804 27836 21832 -2393 -34077 -37332 -3510 -338 -309 110 16598 11563 11000 -12821
18523 -12821 -46469 -52990 -38749 -22288 -26739 -32905 -16434 -8094 -16998 -4040 -7226 -15564 -11632
18510 -11632 16030 6879 -10465 -19519 -25487 -22001 -17219 1322 14063 2033 -4767 74 -5755
18497 -5755 16868 12953 17877 14323 10151 9162 33105 15178 414 -9261 -21662 -10303 917
18484 917 8918 26675 31306 20657 19131 -25014 -45010 -1678 26626 7194 -22281 -53879 -49866
18471 -49866 -42542 -35016 -9638 -29089 -31617 -21073 -5767 3272 7542 15396 14876 -10918 -36409
18458 -36409 -29091 -9420 -31848 -46209 -25350 -30304 -22738 32590 31911 10985 21858 9157 22148
18445 22148 39951 44804 16433 6792 23605 -25762 -24769 -9289 5260 -5227 -11498 13636 -21835
18432b1835j3326J0054J3156J4424o168O732j7219k144j3329p66K3487J484q78
18419f328k4217k48j575l300J0905J3804j7944K4670J7416j3524Q234J0503q537
18406I859j3229k509J010M472p356j8455K2279l730L397M181L4887K7213K757
18393F4776l6069k9988J284l339j5134K194O881R995J4343R650l1496k3234L1454
18380A317O416p725p737J3777L33j266O469j8420j9350K318j0692J8759l268K0634
18366A565L2686N965l0059k0630j8548K5375M5985p66k3898O285k2357p555L2897
18353B6945N829J322J8591O211j990k1080k2486q425j1296n270j9199n54J7219
18340a4183N250R255Q148M268N317K0323l0572P02J5151j0336K159q667m800p225
$$ plain form
18432 -21835 -35161 -25107 -11951 2473 -3695 3037 -14182 -16326 -29655 -30421 -6934 -5450 -6328
18419 -6328 -30545 -30793 -32368 -35668 -24763 -10959 -28903 -4233 13183 -341 7893 18396 9859
18406 9859 -3370 -5879 -4869 -397 -7753 -26208 -3929 -7659 -4262 -81 34806 62019 64776
18393 64776 28707 -1281 3 -3336 -18470 -16276 -9395 600 14943 24593 -6903 -30137 1317
18380 1317 7733 8 -7729 6048 6381 5115 11584 -6836 -26186 -23868 -34560 -15801 -19069 1565
18366 1565 34251 40216 10157 -10473 -29021 -3646 42339 41573 17675 23960 1603 -5952 26945
18353 26945 32774 34096 52687 58898 56908 35828 13342 4917 -6379 -11649 -30848 -31402 -14183
18340 -14183 -8933 322 8470 12738 18055 38378 7806 8508 23659 13323 15482 6815 2015 -5210
18326e210L00q130j7024k04Q850K4016K7348J7838j3828j3454o519l894J9954
18313C0043O87n371J0398J8560L839j6454j8635o674J1422o342o025Q30j2104
18300D174l7984q75J1366J7671p649n180k1755K3040O735k2553k4146J3979K8258
18287a4919j7358k0212K5798N797j7462N936J1624k4228o563j693K5709J6120
18275a1451R142R985j0663k6R617j583R85J8532J4408j0991M079K8735o040j4405
18261D0324j1416J163k4887l006j4721r849j4890P254J4997N674K359m1206K0804
18248b7400K2834j9287K8097j0827l883L6371K1356J9239k1652l1007j4168j3701
18236a4028J7116J4614L192J2350J0772m799j0277m550P0j7117O87J1722L536
$$ plain form
18326 -5210 -4910 -13040 -30064 -30268 -21418 2598 29946 47784 33956 20502 13983 10089 30043
18313 30043 30730 25359 35757 54317 58156 41702 23067 16393 27815 21473 15448 16278 4174
18300 4174 -33810 -34685 -23319 -5648 -13297 -18477 -40232 -17192 -10457 -33010 -57156 -43177 -14919
18287 -14919 -32277 -52489 -26691 -20894 -38356 -32420 -20796 -45024 -51587 -53280 -27571 -11451
18275 -11451 -2309 7676 -2987 -3013 6604 5021 6006 24538 38946 27955 32034 60769 54729 40324
18261 40324 28908 30071 5184 2178 -12543 -22392 -37282 -30028 -15031 -9357 -6998 -48204 -27400
18248 -27400 -4566 -23853 4244 -6583 -10466 25905 47261 66500 44848 13841 -327 -14028
18236 -14028 3088 17702 20894 33244 44016 39217 28940 24390 24460 7343 8030 19752 23288
18223B3288o261p73K0980m712R56P474o069k3823j2957J0889L333k2426N368L
18209d730O440j1915J4165M8982K2265q203j1485J691q19M371J6528J925j8273
18196F0942J543M00j6955j190p278k3851R553J3788K6539L0628j3431k5527P93
18183E5954L6100q839k0739m251K869L888j127J9133O495l5009J6817K7055j3505
18170H4841n844m370K0370K529n097j52j5467j032l127J7793L2620J0468p633
18157A25899k938J2693L4587p360j6448m851p722K04J1705L3869J1042K9454K1980
18144B42114L844n23M799K3185M563L03r028Q921K6213j76j5907K2496O6603O3465
18130D40872L8401J3406J0240M8720Q5954Q7946O6089J02535J39812J96758K57896
$$ plain form
18223 23288 17027 16254 37234 32522 33478 40952 34883 11060 -1897 8992 12325 -10101 -4733 -4730
18209 -4730 1710 -10205 3960 52942 75207 67004 55519 57210 56391 60762 77290 79215 60942
18196 60942 62485 62885 45930 44740 37462 13611 23164 36952 63491 94119 80688 55161 55954
18183 55954 92054 83215 62476 58225 61094 64982 63855 82988 89483 54474 71291 98346 84841
18170 84841 78997 74627 94997 97526 92429 92277 76810 75778 72651 90444 123064 133532 125899
18157 125899 122961 135654 170241 162881 146433 141582 133860 134064 145769 179638 190680 220134 242114
18144 242114 245958 245435 250234 273419 277982 278285 269257 278178 304391 304215 288308 310804 377407 440872
18130 440872 479273 492679 502919 551639 637593 725539 791628 894163 1033975 1230733 1488629
18119A488629K81056L98132N69534P68168J008431J324186J834394K550050L813430
18110A4036010N847153P691446O683994Q38503m160818n334199n213392m825997
18102A5562700l867163k736358j896575j325846r60437p42787n83725m21754l10941
18093B717114k41556j96513j63021j48799j16711j02507r2653q4398r9001r8823
18083A373132l2589q466l9822m2130k9478q697j8404j4617n588Q224L1169K7499
18071A240233L7079L3759o801j6663m7331q4606q6962q0476p4085j9021j7440
18060H77686o5536q1851o7872j8732j8017l4154n4575k8247m6020m4800o26R865
18048D27121L496l1636j5646r274k2962l8314l225j278R661k7711l7345k5254
$$ plain form
18119 1488629 1769685 2167817 2737351 3505519 4513950 5838136 7672530 10222580 14036010
18110 14036010 19883163 27574609 34258603 35097106 30936288 25602089 20388697 15562700
18102 15562700 11695537 8959179 7062604 5736758 4776321 4033534 3449809 3028055 2717114
18093 2717114 2475558 2279045 2116024 1967225 1850514 1748007 1655354 1570956 1471955 1373132
18083 1373132 1340543 1332077 1292255 1250125 1220647 1211950 1193546 1178929 1173341 1181565 1212734 1240233
18071 1240233 1277312 1311071 1304270 1287607 1240276 1155670 1068708 988232 914147 895126 877686
18060 877686 812150 730299 662427 643695 625678 591524 536949 508702 462682 417882 417256 427121
18048 427121 430617 398981 383335 374061 351099 312785 309560 308282 317943 290232 252887 227633
18036B27633k4737J123k6886o753K8684J1769j6323j7483k3605k3132k3624M310
18024A10976J048m050q80l440j3870o093j2171j6733j5239q784K257J4975J9768
18011F7764j4924j1859K1221O114j7465j973P130P44k7755l4480P37J5051J0965
17998B1270J2645o603p148J1193J0834n185j0837L774J1751n742J71J760P610
17985D5493P83j1298k2077m205M950q592p877J8386k2350l0400K5289J7612q247
17972b533n065o178k4665j645K0059J0171r708M842K646r009j2266J2877j3325
17959c3799j5379J0909N048M864q382J8872L0808p336o3l379j0448j3163j4027
17946c5475j8266j828L238m608J5663J1025R035m523J3335l117J3674l739k026
$$ plain form
18036 227633 202896 204019 177133 170380 199064 210833 194510 177027 153422 130290 106666 110976
18024 110976 112024 107974 107094 103654 89784 83691 71520 54787 39548 30764 33021 47996 67764
18011 67764 52840 40981 62202 68316 50851 48878 56008 56752 28997 -5483 -4746 10305 21270
17998 21270 33915 27312 20164 31357 42191 37006 26169 29943 41694 35952 36123 37883 45493
17985 45493 46276 34978 12901 8696 13646 5054 -2823 15563 -6787 -37187 -11898 5714 -2533
17972 -2533 -7598 -13776 -38441 -40086 -20027 -9856 -19564 -14722 -12076 -21085 -33351 -20474 -33799
17959 -33799 -49178 -38269 -33221 -28357 -36739 -17867 12941 5605 5542 2163 -8285 -21448 -35475
17946 -35475 -53741 -55569 -52331 -56939 -41276 -30251 -21216 -25739 -12404 -15521 -1847 -5586 -7612
17933g612J3052m007k9152J0314J2219N576O600J8174K0092j275j1323l3967J4860
17920A3551J2538j2558k4690J0884j844K853J969J5034N476k3712k4699k7281
17908e2479J5035L4705K1611K691j463K2555q501j1222m0787J0473p336j1654
17896b6372J1550J0581R536J047K5846J695j9684j3031j3193p967n353r652K4592
17883a0405K3058J0775r633q83n198q300j056k1887k1108J7396Q283k1756K944
17870c7770K4797R764j1233R9l119J5262l744j703L7702J0328j8623R240k1610
17857I390Q837q77k8474j7260J4490O948k339j5184R595k2490o420K9287O98K1871
17843H072L431m7694J351N3742K1307k7283k4805j3691j091J1248K3830k494O719
$$ plain form
17933 -7612 5440 1433 -27719 -17405 -5186 390 6990 25164 45256 43981 32658 -1309 13551
17920 13551 26089 13531 -11159 -275 -2119 734 2703 17737 23213 -499 -25198 -52479
17908 -52479 -37444 -2739 18872 21563 20100 42655 34154 22932 -17855 -7382 -14718 -26372
17896 -26372 -14822 -4241 5295 6342 32188 33883 14199 1168 -12025 -19992 -25345 -34997 -10405
17883 -10405 12653 23428 13795 12912 7714 -586 -1642 -23529 -44637 -27241 -18958 -40714 -37770
17870 -37770 -12973 -3209 -14442 -14343 -17462 -2200 -5944 -7647 30055 40383 21760 31000 9390
17857 9390 18227 17350 -11124 -28384 -13894 -6946 -9285 -24469 -14874 -37364 -43784 -14497 -13799 8072
17843 8072 11503 -36191 -34840 18902 40209 12926 -11879 -25570 -26661 -15413 8417 5923 12642
17830A2642j8946k2192j2831K8328N490j3316l606N372K6250j822r500k9316l748
17817c7195J7148M168P697n197j8368N141N78k227J5358J0343K309J9783j4093
17804E445m802k8383R361K5633M384l1508k4756J4195P927J6099j1496K3414J6503
17791B2016J6528O815m560k6444k9400l1612L24J9924L5000j5193k1916l932J6345
17778a6105j3838o040m042O583K680l501O042m133N55j288P229j372J7125K026
17764h079j3670k6475J530L931J4313L4005j5599o052k959j469j551J9895Q781
17751F601R31L040m844L212j7046l9400k7639O792K5053J8258J2835j366k7263
17738d0836j7998K2608K1015n110j5028l024N126m313M444q001j637M404K6261
$$ plain form
17830 12642 -6304 -28496 -41327 -12999 -7509 -20825 -24431 -19059 7191 5369 -4131 -33447 -37195
17817 -37195 -20047 -15879 -8182 -13379 -31747 -26606 -26028 -28255 -12897 -2554 -245 19538 5445
17804 5445 643 -27740 -18379 7254 11638 -19870 -44626 -30431 -22504 -6405 -17901 5513 22016
17791 22016 38544 45359 40799 14355 -15045 -46657 -46333 -26409 8591 -6602 -28518 -32450 -16105
17778 -16105 -29943 -35983 -40025 -33442 -30762 -34263 -28221 -32354 -31799 -33087 -25858 -27230 -10105 -8079
17764 -8079 -21749 -48224 -46694 -42763 -28450 5555 -10044 -16096 -19055 -20524 -22075 -2180 6601
17751 6601 7532 10572 5728 8940 -8106 -47506 -75145 -68353 -43300 -25042 -12207 -13573 -40836
17738 -40836 -58834 -36226 -15211 -20321 -35349 -38373 -33247 -37560 -33116 -41117 -42754 -38350 -12089
17725a2089J201m913N982L285J0591o38q938m771K4356l259l0210K08k0552l046
17711d2793J0884J593M240k178q454J8305O809j3185O685J2075j0530j1548J2946
17698a5151J4162O289k5317n913K8706R640k2169o400j6992N470K3335p139j1711
17685b3190j1786n756j9241k277L5492J5023J4408k5719k7534R317J0297P063
17673b3903N13L6038O512k1711M530j5107l1781m1262J1513L9798M291M142j7414
17660d3841j0457n056J8366J9411n127J5403K1952J435k0794o599J6490k489Q113
17647F807J8792k8338j7090L092k2502p247O699K0857K625k1643J0642L5750n675
17634B769k4000o108j0536M824K9677o515k2515k7116K8470L0007j0161j2165
$$ plain form
17725 -12089 -10888 -15801 -9819 -6534 4057 3419 -5519 -10290 14066 10807 -19403 -19195 -39747 -42793
17711 -42793 -31909 -30316 -26076 -28254 -36708 -18403 -11594 -24779 -18094 -6019 -16549 -28097 -15151
17698 -15151 -989 5300 -20017 -25930 2776 12416 -9753 -16153 -33145 -27675 -4340 -11479 -23190
17685 -23190 -34976 -40732 -59973 -62250 -26758 -11735 2673 -23046 -50580 -41263 -30966 -23903
17673 -23903 -23390 12648 19160 -2551 1979 -13128 -44909 -86171 -74658 -34860 -30569 -26427 -43841
17660 -43841 -54298 -59354 -40988 -21577 -26704 -11301 10651 12086 -8708 -15307 1183 -1306 6807
17647 6807 25599 -2739 -19829 -16737 -39239 -46486 -39787 -18930 -16305 -37948 -27306 8444 2769
17634 2769 -21231 -27339 -37875 -33051 -3374 -9889 -32404 -59520 -31050 -1043 -11204 -23369
17622b3369j0441L910j6352j2504Q285K0245J9056j2994k4131N134J7915Q901
17610a6345K417m57Q224p150j468K0396J1376o171L849j3910J7581n339j5426
17597b423j6447k512J4367j4320K295J7480l446J1259N226o40k4428k2452j7198
17584e3239m522J3925k40K1348J9209J753L356n519r088k2492j546N808j9097
17571e0344j3325J8382J8831J2184p315M4011K0567j3506L389j3437j8696n056
17559d315r816K939Q069J4756J1775p892J1306j8078j4836K1917l039l6440j3604
17546c7258J7650r674K1264j5109k8076K2748K9026j4194j0369j9004J3731m498
17534c3763k034l248J7327K7062P795Q876l8954m3831N687J3806K6795K0456m537
$$ plain form
17622 -23369 -33810 -29900 -46252 -58756 -50471 -30226 -11170 -24164 -48295 -43161 -25246 -16345
17610 -16345 -13928 -14385 -6161 -13311 -14779 5617 16993 10822 14671 761 18342 13003 -2423
17597 -2423 -18870 -21382 -7015 -21335 -19040 -1560 -5006 6253 11479 10839 -13589 -36041 -53239
17584 -53239 -57761 -43836 -44076 -22728 -3519 -1766 1590 -3929 -13017 -35509 -37055 -31247 -50344
17571 -50344 -63669 -45287 -26456 -14272 -21587 22424 42991 29485 32874 19437 741 -4315
17559 -4315 -14131 -11192 -3123 11633 23408 15516 26822 8744 -6092 15825 12786 -23654 -37258
17546 -37258 -19608 -29282 -8018 -23127 -51203 -28455 571 -13623 -23992 -42996 -29265 -33763
17534 -33763 -35797 -39045 -21718 5344 13139 22015 -16939 -60770 -55083 -41277 -14482 5974 1437
17521A437k34J13r406J639J3741M834Q599j335m5428J3974j1724R2q567N086l91
17506b7570k2370j071o384q825k349J3893j0496L5722K4646J3124q394j890n992
17493g956L244K1132Q598M457q061J3035n142j3313j7027k2180k0620K6576J1323
17480e934N752J9563j3570l4678j3642r668k246k5236k398J0418K8848K7937L3534
17467A8680n899k3859j7368k7077L8850j2786m0626k5255K4781J1261K5023L7940
17455C665K5001J4728k7845j3826p718j2706L0368L9482k386n712M407R243M1577
17442I8278M3356J4387l0456m2583K451o426j1410k1598j0802L441K51p631j240
17429C0018Q028L244q74j569k6794j4672j133k885k0431K3938J932o551J83J5183
$$ plain form
17521 1437 1203 1316 -8090 -6451 7290 12124 20723 19388 -26040 -12066 -23790 -23698 -32265 -27179 -27570
17506 -27570 -49940 -51011 -57395 -66220 -68569 -54676 -65172 -29450 -4804 8320 -74 -1964 -7956
17493 -7956 -4712 16420 25018 29475 21414 34449 29307 15994 -1033 -23213 -43833 -17257 -5934
17480 -5934 -182 19381 5811 -28867 -42509 -52177 -54423 -79659 -82057 -71639 -42791 -14854 18680
17467 18680 12781 -11078 -28446 -55523 -16673 -29459 -70085 -95340 -70559 -59298 -34275 3665
17455 3665 28666 43394 15549 1723 -5995 -18701 11667 51149 48763 43051 47458 56701 98278
17442 98278 141634 156021 125565 82982 85433 79007 67597 45999 35197 38638 38889 31258 30018
17429 30018 38046 41290 40416 38847 12053 -2619 -3752 -6637 -27068 -3130 -1198 -7749 -7566 7617
17415G617j101p531k7260m797K557K6682L394J3031K2495l6944j8650j9574P22
17402c9359J1125q768r57J5456J2018j1773k542K2365M66k2615M028R229j6142
17389b7469J9872K2785o247m4001l1491L381K6878L5341J7694l692p358K852O857
17376A5402l3279j5464J4523O81K1346J5510J969j3501J7732j1653q571K2094
17364B6789k1867j2421o875j0251P289M455q767o255K4511J1738k1989q869K7812
17351E300L7950J8460N529J8466k4952o315l722k2361Q299J486j5073M155Q77
17338B8099J2771L7512Q64r954j9616J2697M02k0509j4508O551n649j525j0033
17325A7102j1121J3490K7993M154k1644j0504N84J2376K4182p642q531L4053L8660
$$ plain form
17415 7617 6516 -1015 -28275 -33072 -30515 -3833 -439 12592 35087 -1857 -20507 -40081 -39359
17402 -39359 -28234 -37002 -37959 -22503 -10485 -22258 -24800 -2435 -1969 -24584 -20556 -11327 -27469
17389 -27469 -7597 15188 8941 -35060 -66551 -63170 -36292 -951 16743 13051 5693 8545 15402
17376 15402 -17877 -33341 -18818 -18137 3209 18719 20688 7187 24919 13266 4695 26789
17364 26789 4922 -7499 -14374 -24625 -17336 -12881 -21648 -27903 -3392 8346 -13643 -22512 5300
17351 5300 43250 61710 67239 85705 60753 54438 50716 28355 36654 38140 23067 27222 28099
17338 28099 40870 78382 79246 69292 49676 62373 62775 42266 27758 34309 28660 27135 17102
17325 17102 5981 19471 47464 51618 29974 19470 20054 32430 56612 48970 40439 74492 113152
17312A13152K1416Q485R213M4047K4334M3918J6723J5862R928p40J2743r756j8991
17299B90334m282k0818m3286l2517o696l2387l2757j0055R206l40l5868l5054
17287D5480k1671J1567J8053J2203L4370L8027K1918k6013k6650Q689P094J6586
17275A39653K0499l6108j9586l3102q824M267N440j3559M752J5941P709k6302
17263F0780n8175k3679J1144L4593j369l2377J7879K5016N1109M4553L5850P371
17251A72695M1104M4111L716j6710J0143L3312m428N297K365k9084n1135m1910
17239A69476j6611j0739k0605l4598j7132l5083j3580P093o91j9047K8390K6598
17227F3471O152k0546R221Q63n0689o803L0437L4971j921j4841j5289j317J38
$$ plain form
17312 113152 134568 143053 152266 196313 220647 264565 281288 297150 307078 306338 319081 309325 290334
17299 290334 286052 265234 221948 189431 182735 150348 117591 107536 116742 116402 80534 45480
17287 45480 23809 35376 53429 65632 100002 138029 159947 133934 107284 115973 123067 139653
17275 139653 160152 124044 104458 71356 62532 66799 72239 58680 63432 79373 87082 60780
17263 60780 2605 -21074 -9930 24663 23294 -9083 8796 33812 84921 129474 165324 172695
17251 172695 213799 257910 261626 244916 255059 288371 283943 289240 291605 262521 211386 169476
17239 169476 152865 142126 121521 86923 69791 34708 21128 28221 27530 8483 36873 63471
17227 63471 69623 49077 58298 59161 8472 1669 32106 67077 65156 50315 35026 33709 33847
17214C3847K3040O856r229k2102k4525r50N330k4048l6990j0111J2199J5683J6471
17201a4529j5889K0926J1859j0994J6481j3903L7986Q724r422k6921j599M564
17189G283Q932j3631k1666k1015J9171J5090J3465K4238J573j068j1491k6647
17177e766J0607J8471P587n434l1083N759M977q967K7236K9623j866k2784k5249
17164C111K444m776j569l243p964J6974p863j7394K225j1319J9015j5342n348
17151c1049J4184J8803k4673q910J3151L943m756q101L6475J5012o648N466J1295
17138C4192m373N909k223m2J740j7214j8576j6375J3050L0257k147j2327J374
17125A3245J5228p585j2719Q580k189P966O4j4593n229Q327o462n260j2504J9165
$$ plain form
17214 33847 56887 63743 54514 32412 7887 6937 12267 -11781 -48771 -58882 -46683 -31000 -14529
17201 -14529 -30418 -9492 2367 -8627 7854 -6049 31937 40661 31239 4318 2719 7283
17189 7283 16215 2584 -19082 -40097 -20926 -5836 7629 31867 33440 32372 20881 -5766
17177 -5766 4841 23312 30899 25465 -5618 141 5118 -3849 23387 53010 51144 28360 3111
17164 3111 5555 779 -790 -4033 -11997 4977 -2886 -20280 -18055 -29374 -10359 -25701 -31049
17151 -31049 -16865 1938 -22735 -31645 -18494 -14551 -19307 -27408 9067 24079 17431 22897 34192
17138 34192 29819 35728 33505 33463 35203 17989 -587 -16962 -3912 26345 24198 11871 13245
17125 13245 28473 20888 8169 16749 14560 22526 22590 7997 2768 11095 4633 -627 -13131 6034
17111F034L543R094J5333J711j2052M477j4767O285p260M583q934n374k806q340
17097h473Q099p957K3756P588j2256k8530J626J3843K906J5734J2832j7666q933
17084B569j0592n105J1651O478Q613K8138Q187k0592q59j5143k1664l798J191
17071a0926L4634J7035j4849j5210Q515m798q224J205L992q784L828L9530r388
17058C6560Q19P551K7436J7691N18K2864j2685n622L835p274j3645Q381k8351
17045E8078j4053k4168J1495K0981j23K634j8607J3964N93P869n179L459K187
17032E9130R710j7118k0661m2262N325O209J9536O727J3531l379j8690J1221N660
17019C4939K26M091N990O784L7704J2197l8241m2820j0074J330K7320K9418Q795
$$ plain form
17111 6034 9577 18671 34004 35715 23663 28140 13373 19658 12398 16981 8047 2673 -133 -8473
17097 -8473 -374 -8331 15425 23013 10757 -17773 -16147 -2304 602 16336 29168 11502 2569
17084 2569 -8023 -13128 -1477 5001 13614 41752 49939 29347 28488 13345 -8319 -12117 -10926
17071 -10926 23708 40743 25894 10684 19199 14401 6177 7382 11374 2590 6418 45948 36560
17058 36560 37379 44930 72366 90057 90575 113439 100754 95132 98967 91693 78048 86429 58078
17045 58078 44025 19857 31352 52333 52210 54844 36237 50201 50794 58663 53484 56943 59130
17032 59130 68840 51722 31061 -11201 -5876 333 19869 26596 40127 36748 18058 29279 34939
17019 34939 35165 39256 45246 52030 89734 101931 63690 20870 10796 12126 39446 68864 77659
17006G7659P414o214j6735n130J4223L268l007j0693M714Q456J8077J0320L308
16993A05660K3567j2595n886M086K393J6198m626J6867j1453j6067o334Q597N375
16980A25782j8166R362m3232L4446K3860j2745m1466j2235n982l970J0841J6993
16968H3488J1161j463J615q635J9604j8874r774Q447q806j6778p434P245r242
16955E0554j154J4059n010k7177k0876J0375J1162j1878L890K1333K8068L3281
16943A06627p076j867m144M8r658r347j5422j667j5178K6998L7844P854k4107
16930I0905p712L338j8028K3154Q134K0238j517J4461M0511Q389O191M969O211
16917A99244k6282J234j750O684J0840J1811k8026k2806k0366J4664L6279J0640
$$ plain form
17006 77659 85073 78859 62124 56994 71217 74485 71478 60785 65499 73955 92032 102352 105660
16993 105660 129227 116632 110746 114832 117225 133423 128797 145664 134211 118144 111810 120407 125782
16980 125782 107616 116978 73746 108192 132052 119307 77841 65606 59624 55654 66495 83488
16968 83488 94649 93186 94801 86166 105770 86896 77122 85569 76763 59985 52551 59796 50554
16955 50554 49400 63459 58449 31272 10396 20771 31933 20055 23945 45278 73346 106627
16943 106627 99551 97684 93540 93588 83930 74583 59161 57494 42316 69314 107158 115012 90905
16930 90905 83193 86531 68503 91657 99791 120029 118512 132973 173484 181873 188064 193033 199244
16917 199244 172962 174196 172446 179130 189970 201781 173755 150949 130583 145247 181526 192166
16905A92166j5560l2758k775k258p046L7639K4998J0136j401J0071R731j6633
16893B06310j5537J05k0896l4591j5653J3605K0841K8901Q280R84j2028N161J2694
16880A98176R669K1318K2078K3554o072K7748K5477M8832P893r244L6256N9477
16868D65162P2461Q3434J09081J28040J56472J26874M6563L7536K4242K0371l6851
16857A233385q1500r6658j21609r2854n2498n4660n6412j3902J3994m0365l5067
16846F01854j8827k3174k8554r048K9566J1445J9849J0439m91L5903J9551q670
16834F39843K531J8915K5099M1456N6527N1622L3711M7324L9077K7375O2966N0259
16822A096705P5903R4195J07067J32482J23987J44918J60735J39738J68280J73887
$$ plain form
16905 192166 176606 143848 141073 138815 131769 169408 194406 204542 203141 213212 222943 206310
16893 206310 190773 190878 169982 135391 119738 133343 154184 183085 191365 192349 180321 185482 198176
16880 198176 207845 229163 251241 274795 268723 296471 321948 370780 378673 369429 405685 465162
16868 465162 537623 621057 730138 858178 1014650 1141524 1188087 1225623 1249865 1270236 1233385
16857 1233385 1151885 1055227 933618 840764 788266 733606 677194 663292 677286 636921 601854
16846 601854 583027 559853 531299 522251 551817 563262 583111 593550 593059 628962 648513 639843
16834 639843 642374 661289 686388 727844 784371 835993 869704 917028 956105 983480 1046446 1096705
16822 1096705 1172608 1266803 1373870 1506352 1630339 1775257 1935992 2075730 2244010 2417897
16812B417897K14304K83045L38061M11003N01180O34121P24397Q90942J157768
16803G572718J539239K041982K698412L587473M887227O661260Q439816R067208
16795D6495335P399882M194455K058822J615101J104471j087749m511347p069788
16787E0199182p898743p598705o644645n396649m120371l126857k365315j766015
16779A1281882j343767j016249p75930n90106m53518m13317l27958k78912k09082
16770E873043k02163j68546j56500j63672j35741o8229m5973m6520J5584M7630
16760D948913O5431J19365J34472J39952J42569J38358J33229J64608J76878K14499
16750F378274K95137L91694N28895P55806J088847J540599K072289K802255L854135
$$ plain form
16812 2417897 2632201 2915246 3253307 3664310 4165490 4799611 5524008 6414950 7572718
16803 7572718 9111957 11153939 13852351 17439824 22327051 28988311 37428127 46495335
16795 46495335 53895217 58089672 60148494 61763595 62868066 61780317 57268970 50199182
16787 50199182 42300439 34701734 28057089 22660440 18540069 15413212 13047897 11281882
16779 11281882 9938115 8921866 8145936 7555830 7102312 6688995 6361037 6082125 5873043
16770 5873043 5670880 5502334 5345834 5182162 5046421 4978192 4932219 4885699 4901283 4948913
16760 4948913 5014344 5133709 5268181 5408133 5550702 5689060 5822289 5986897 6163775 6378274
16750 6378274 6673411 7065105 7594000 8349806 9438653 10979252 13051541 15853796 19707931
16741A9707931N289510P083001Q528433Q302184N867715K876041J473011J248929
16733F0376755L20049k386524n622455p407838p641535p027719n940982m695481
16725A9974270l568896k665223j996907j477144j143571r15404p37612n56885
16717F912628m49093l61053l18030k72223k51418k08712k22011k13920j92307
16708D423861j59770j01632j36541j31375q2498o2913m3401m7654m733o696n1781
16697C594867p2504o4693n7061p2707r8273j26402j54380j49584j41272j38892
16687B519099j43948j33449j07809j10933j38112q6535p4606r8625n8254n6783
16677A510045q6285n5067k7148o2140l5668n9055n5551l0623J6494k700j1474
$$ plain form
16741 19707931 24997441 32080442 40608875 48911059 54778774 57654815 59127826 60376755
16733 60376755 60696804 58310280 52687825 45279987 37638452 30610733 24669751 19974270
16725 19974270 16405374 13740151 11743244 10266100 9122529 8207125 7469513 6912628
16717 6912628 6463535 6102482 5784452 5512229 5260811 5052099 4830088 4616168 4423861
16708 4423861 4264091 4162459 4025918 3894543 3812045 3749132 3705731 3658077 3653344 3646648 3594867
16697 3594867 3522363 3457670 3400609 3327902 3229629 3103227 2948847 2799263 2657991 2519099
16687 2519099 2375151 2241702 2133893 2022960 1884848 1798313 1723707 1625082 1566828 1510045
16677 1510045 1423760 1368693 1341545 1279405 1243737 1184682 1129131 1098508 1115002 1112302 1100828
16666A100828l8254n2894n3122l6742j1102j6037l7648m4782q1743o6756n6646
16655F05102m0730k8351o4500j5138j8662k0726q88l9661m5918J2790J4918j2841
16643C45395l4135q441j9844N099k6196m0326M051P644k7358l6659L166J6075
16631A88471J3592R131J108n692o859j1765J2756L131Q996M511k1745P822N993
16618B09450j0284K4909P3361M3499J6675K7420K0557N91J1179j7411k6845J0813
16606C83914m399l6345m6643m9534r969l4385l2241k7367j514j2133O651m180
16594A31855j0300K0898J8646j9147k5495k2056k616J019P571j7408J5385J3460
16582A11812J1517n543k187k489J4359l501k944j3893l3529j6291J3613N179n21
$$ plain form
16666 1100828 1062574 1009680 956558 919816 908714 892677 855029 810247 728504 661748 605102
16655 605102 564372 536021 471521 456383 437721 416995 416107 376446 330528 343318 358236 345395
16643 345395 311260 302819 282975 288074 261878 221552 225603 233247 205889 169230 172396 188471
16631 188471 202063 211194 212302 206610 199751 187986 200742 203873 212869 217380 195635 203457 209450
16618 209450 199166 224075 297436 340935 357610 385030 405587 406178 417357 399946 373101 383914
16606 383914 379515 343170 296527 246993 237024 202639 170398 143031 141517 129384 136035 131855
16594 131855 121555 142453 161099 141952 116457 94401 91785 92804 100375 82967 98352 111812
16582 111812 123329 117786 115599 113110 127469 123968 121024 107131 73602 57311 70924 76103 75582
16569G5582l378O837j2601j8147m697L5333L7637P133k6391q75K3790l938k8004
16556H8281k991J111R678N550p828j9202m801K6535O836J2944q034k2380j718
16543H3981j5789j4421L0850p822j824j750j9504j9168J702j8070k9149L5673
16531B4709L6081l407M247P722k4778j2400K0215k362K2282j2240j7904P113P462
16518E6740j8845j9575q824J1159L1842N830k0128r144J608M933j0282j5731K3668
16505C3251L8414M4919j1025m6034j7291Q453j8498p382n290j5562J5387J410
16493B0752J9777p597k4590j4740K4258j4672p687m538R551Q17q067K1294j754
16480A2804j517k4821q055R989r751N990m676l838L020M2168k2302n2412j0428
$$ plain form
16569 75582 72204 79041 66440 48293 43596 78929 116566 123699 97308 96433 120223 116285 88281
16556 88281 85290 86401 96079 101629 93801 74599 69798 96333 103169 116113 108079 85699 83981
16543 83981 68192 53771 84621 76799 74975 73225 53721 34553 36255 18185 -10964 24709
16531 24709 60790 57383 61630 69352 44574 32174 52389 50027 72309 60069 42165 49278 56740
16518 56740 37895 18320 9496 20655 52497 58327 38199 29055 30663 35596 25314 9583 33251
16505 33251 71665 116584 105559 59525 42234 50687 32189 24807 19517 3955 19342 20752
16493 20752 40529 32932 8342 -6398 17860 3188 -4499 -9037 514 1331 -6736 14558 12804
16480 12804 11287 -13534 -21589 -11600 -21351 -15361 -20037 -23875 -20855 21313 -989 -53401 -63829
16467f3829J2733J337M2506J5039J450Q911L1038p059m635O359j6766p91p850
16454A8443j2638j7646j8827m894L7713J9061J4067j3053j7286o069J5511K590
16442A6972J9566o789l0876K3885K3850j2524k9202k5885J4383O047K5824q213
16430A7038k0169M346R448R896j2587J274J2866q982k182n362M972m254q866J9609
16416A7047K8032K7225p007n436j4767j2637p016P504l3985l1368l348Q733Q675
16403a8348O234P194o800J6501K817r956o588j9667L012L1970K193j4531j3606
16390a9575J304J896l2025K07J2386J4415J1486r005j194J0617K84j3626K560
16377b0270j4881J644J2438K6021K2682K5735k7055j8481k2415j510L7145K8110
$$ plain form
16467 -63829 -51096 -49759 -7253 7786 9236 18147 49185 42126 37491 43850 27084 26293 18443
16454 18443 5805 -11841 -30668 -35562 2151 21212 35279 22226 4940 -1129 14382 16972
16442 16972 36538 29749 -1127 22758 46608 34084 4882 -21003 -6620 -573 25251 17038
16430 17038 -3131 1215 10663 20559 7972 9246 22112 13130 10948 5586 10558 6304 -2562 17047
16416 17047 45079 72304 65297 59861 45094 32457 25441 32945 -1040 -32408 -35756 -27023 -18348
16403 -18348 -12114 -4920 -11720 4781 7598 -2358 -8946 -28613 -25601 6369 8562 -5969 -19575
16390 -19575 -18271 -16375 -48400 -48193 -35807 -21392 -9906 -18911 -20105 -9488 -9204 -22830 -20270
16377 -20270 -35151 -33507 -21069 4952 27634 53369 26314 7833 -14582 -16092 21053 49163
16365D9163k4015M42m722j9055l600j3178j1760J6860K0363j5130n602n254l5232
16352e0720r831K8811m52r792K7291J1254l6699J265J4345K674L411K187j5L798
16338a2473J5457J3340j2770j8143J4335l229j4739j9505j8955k658K0167J7101
16326b2072R77q020J804J4052J2841o80j3870j1535J0446K1116j3782k801j3199
16313b4723j2050j0361K8545j1730j9906J7002P032Q312J6765j1410J932n076
16301a5668R363m3795q172L8742J2965J9201p631k3026j5257N019K2174J2851
16289F766J6992m572k946J008J1632M5146K3104K1487M0390O3018N1667m527j2065
16276B57100J6095K8471K3121m6762j7871k1385n0420q773k7568k6951l3173p450
$$ plain form
16365 49163 25148 25590 20868 1813 -1787 -14965 -26725 -9865 10498 -4632 -10234 -15488 -50720
16352 -50720 -60551 -31740 -32192 -41984 -14693 -3439 -40138 -38873 -24528 -21854 -18443 -16256 -16271 -12473
16338 -12473 2984 16324 3554 -14589 -254 -3483 -18222 -37727 -56682 -59340 -39173 -22072
16326 -22072 -21095 -29115 -27311 -13259 -418 -1098 -14968 -26503 -16057 5059 -8723 -11524 -24723
16313 -24723 -36773 -47134 -18589 -30319 -50225 -33223 -26191 -17879 -1114 -12524 -10592 -15668
16301 -15668 -6305 -50100 -58272 -19530 -6565 12636 5005 -18021 -33278 -28259 -6085 6766
16289 6766 23758 19186 16240 17248 28880 74026 97130 118617 159007 222025 273692 269165 257100
16276 257100 273195 301666 324787 278025 260154 238769 188349 179576 152008 125057 91884 84434
16264H4434l1859j6222j2968N036J1360k0639J8941L7699l4146k5933J9023M024
16252C8750k1546j3681J4415J1272j1395q469j2678j537L0538j0193J1556l645
16240B3387j1002j6760k3447J5392J3010O508R57L862K4451J6553j0038M322J7651
16227F4846r775K345J4250N1017K3961M4774J7316M8947M8319j9591j2333L9147
16215C13223L528n3596l0574n0190n5573j1872P731l2433k0677j3244j8432j894
16203C5997N69j5325l201K2183J6020j4822k2381n539L106N172P546m941r349
16190A5035J697m954J1778j3484j8775j1286K816J2543N5905k1642m8992m789
16178b4148R616L279j6766j4071M568J4029J2039j8812P74K2987J2827j4775j432
$$ plain form
16264 84434 52575 36353 23385 28421 39781 19142 38083 75782 41636 15703 34726 38750
16252 38750 17204 3523 17938 29210 17815 9346 -3332 -4869 25669 15476 27032 23387
16240 23387 12385 -4375 -27822 -12430 580 7088 8045 11907 36358 52911 42873 47195 64846
16227 64846 55071 57416 71666 122683 146644 191418 208734 257681 306000 286409 274076 313223
16215 313223 316751 263155 232581 182391 126818 114946 122677 90244 69567 56323 37891 35997
16203 35997 36566 21241 18040 40223 56243 41421 19040 13501 16607 21779 29325 24384 15035
16190 15035 16732 11778 23556 10072 -8703 -19989 -17173 -4630 51275 29633 -19359 -24148
16178 -24148 -14532 -11253 -28019 -42090 -37522 -23493 -11454 -30266 -29492 -6505 6322 -8453 -9885
16165i885l0612J6621j0127k1700n081J6669K9980J5199n258q900l6577k5651
16153g5322n932p50J5291J9969J6206M0990P108k0220k7463J3819J3058p929l1482
16140d2657J1817J2900j7902N064J1865K2453L011n0054j9077k866J7154K2331
16128b5961K4650j8041j9970J6896N223l961o701l3664J052o445j0881K2905P233
16115d7665J0704j819K014P830R207R468j1380j8259K0978l350l067L6826J030
16102A2517m3071l0928j6763r962J8710Q970j2479O122O870N311k7012j9440L918
16089i7237K8221K9805L6598j7029J3649j1936M743K4750j300j8808j1180J6362
16077c362J732j7586k435j5656o928M842j5649j1155K7043K8274o434r816K9267
$$ plain form
16165 -9885 -40497 -23876 -34003 -55703 -60784 -44115 -14135 1064 -4194 -13094 -49671 -75322
16153 -75322 -81254 -82004 -66713 -46744 -30538 10452 17560 -2660 -30123 -16304 -3246 -11175 -42657
16140 -42657 -30840 -17940 -35842 -30778 -18913 3540 6551 -43503 -62580 -65446 -48292 -25961
16128 -25961 -1311 -19352 -39322 -22426 -17203 -21164 -27865 -61529 -60477 -66922 -77803 -54898 -47665
16115 -47665 -36961 -38780 -36766 -28936 -19729 -10261 -21641 -39900 -18922 -22272 -25339 11487 12517
16102 12517 -30554 -61482 -78245 -88207 -69497 -60527 -73006 -66884 -60014 -54703 -81715 -101155 -97237
16089 -97237 -69016 -39211 -2613 -19642 -5993 -17929 -13186 11564 10264 -8544 -19724 -3362
16077 -3362 -1630 -19216 -21651 -37307 -44235 -39393 -55042 -66197 -39154 -10880 -17314 -27130 2137
16064B137K4370j1934q528q964q115K1466J5033p716L00j1467j5246L199M693
16051g72p852O579k6547o37K390p925j566o062K6581O933M223k1787k5235P671
16037d4006L4258R230K2071N510O346j5540m315l251k3336O763J1398J4797l828
16024A6097j2122K5986P751j8713N849j3619o045Q757j068j712P503k868l8412
16011b2616J353K2080Q407k2608k6100N342M834J070j690j2812o581k625P951
15998d3995J6543O542j8923l3233q465K6593Q534o338j2360j108K6308L492R197
15985b7213J3619q601k650K5279J7450k472k311k4497l878k970j0710K2014N19
15972f421p536J4464K4613N273j9475J7433J2580j3359k1611j2884j0352k1976
$$ plain form
16064 2137 26507 14573 6045 -2919 -11034 10432 25465 17749 18049 6582 -8664 -5465 -772
16051 -772 -8624 -2045 -28592 -29229 -26839 -34764 -36330 -42392 -15811 -8878 -4655 -26442 -51677 -44006
16037 -44006 -9748 -518 21553 27063 33409 17869 13554 10303 -13033 -6270 5128 19925 16097
16024 16097 3975 29961 37712 18999 24848 11229 5184 13941 12873 11161 18664 15796 -22616
16011 -22616 -21263 817 9224 -13384 -39484 -34142 -29308 -28238 -29928 -42740 -49321 -51946 -43995
15998 -43995 -27452 -20910 -39833 -73066 -81531 -54938 -46404 -52742 -65102 -66210 -39902 -36410 -27213
15985 -27213 -13594 -22195 -24845 434 17884 15412 13101 -11396 -15274 -18244 -28954 -6940 -6421
15972 -6421 -13957 507 25120 30393 10918 28351 40931 27572 5961 -6923 -17275 -39251
15960c9251k830K9838R524N572p122r516J8251k549l0794q468q005k9020J1950
15947f2420K3190J0246j4059J140l788J596k6322J8468J6005r052J331J8138K3639
15934a888j4228j8135M097j4344j8646O107K9623J3925K2887N071j4482q856l6225
15921d5094p323P908q009o637J1511L7633J6425o79m66J7132j7148K862j3014
15908d899m0746o985j5134j6267M550J1601j004K1590M764R972J4634K1037j2243
15895i130p447J5313J5026K808j8269M563M076m537J0613j6135j1895k2363j0242
15882d7619L8817j2915j6384K6775K1604r301L788J3163P664j492k4514k6483
15870b6897K411k1769L605P176M532K5822L616l238J5458j6524l2463o700L1210
$$ plain form
15960 -39251 -42081 -12243 -2719 2853 -4269 -13785 4466 1917 -28877 -37345 -45350 -74370 -62420
15947 -62420 -39230 -28984 -43043 -41903 -45691 -44095 -70417 -51949 -35944 -44996 -43665 -25527 -1888
15934 -1888 -16116 -34251 -30154 -44498 -63144 -57037 -27414 -13489 9398 14469 -13 -8869 -45094
15921 -45094 -52417 -44509 -52518 -59155 -47644 -10011 6414 5735 5269 22401 5253 8115 -4899
15908 -4899 -45645 -52630 -67764 -84031 -79481 -67880 -68884 -47294 -42530 -32558 -17924 3113 -9130
15895 -9130 -16577 -1264 13762 16570 -1699 2864 6940 2403 13016 -3119 -15014 -37377 -47619
15882 -47619 -8802 -21717 -38101 -11326 10278 977 4765 17928 25592 24100 -414 -26897
15870 -26897 -24486 -46255 -42650 -35474 -30942 -5120 -1504 -4742 10716 -5808 -38271 -44971 -13761
15857a3761k913k050J2265m570k9228J206j5502L1451j3771Q791K5494M060N010
15844F482j0902k7005k027k589J1178K8459j6927k1142K2384Q842j9268O434P307
15831h774P170k3334r697J6370k5474p739j7570J8751J2759k722j9562K2239J6371
15818b1212R087P026j5078j0389j4118l671r18K0131J2181r544q011J7671L783
15805a3062K0957M560j3696J0299K4278j2490k2345N946J5894l4485q481J8216
15793d409r139m930j31J4590m387k7379K385R658J0705N890j1436k168P567K3044
15779I860J5476m328j7798n43L3183M823l3848j7201N566n646o881m595N227O067
15765a0638q251n750K8454K9852l8389m514L457J2549m453j0363k960j616k0106
$$ plain form
15857 -13761 -16674 -18724 -6459 -11029 -40257 -39051 -54553 -23102 -36873 -28082 -2588 1472 6482
15844 6482 -4420 -31425 -33452 -36041 -24863 3596 -13331 -34473 -12089 -3247 -22515 -16081 -8774
15831 -8774 -1604 -24938 -34635 -18265 -43739 -51478 -69048 -50297 -37538 -40260 -59822 -37583 -21212
15818 -21212 -12125 -5099 -20177 -30566 -44684 -48355 -49273 -29142 -16961 -26505 -34516 -16845 -13062
15805 -13062 7895 12455 -1241 9058 33336 20846 -1499 4447 20341 -14144 -22625 -4409
15793 -4409 -13548 -18478 -18609 -4019 -8406 -35785 -33400 -23742 -13037 -7147 -18583 -20751 -13184 9860
15779 9860 25336 21008 3210 2667 35850 40673 6825 -10376 -4810 -10456 -17337 -21932 -16705 -10638
15765 -10638 -18889 -24639 3815 33667 -4722 -9236 -5779 6770 2317 -8046 -11006 -12622 -32728
15752c2728J1828O072J4896K4732j2941k2524J029p381m1954J8637K2563l935
15740b1706o776Q223r750Q42K3100n303j8638J5388L2456m824j7827k5684j776
15727c2275k4989J897N175j294j7564k490J5582K2992J9886K5186q522j4445K789
15714h072p625j3948k3159J608J5159K2223j1755j3050J9269n57M329q318k261
15701b6157R542J8077j2069k5424j9390k0572k0766L7580K8592n573m943N669
15689c5434p627j0893k8957M008J2452K1942p149N944L9018J2364j658J4050m7568
15676b9508k2170P746K1129j1132k3022R993O54M5084J9498k3082l9788j9713
15664f4311M533r356N53K2475K0466n119o350J6106j4891p494K3315K0721o509
$$ plain form
15752 -32728 -20900 -14828 68 24800 11859 -10665 -9636 -17017 -58971 -40334 -17771 -21706
15740 -21706 -28482 -20259 -30009 -29167 -6067 -11370 -30008 -14620 17836 13012 -4815 -30499 -32275
15727 -32275 -57264 -55367 -50192 -51486 -69050 -71540 -55958 -32966 -13080 12106 3584 -10861 -8072
15714 -8072 -15697 -29645 -52804 -51196 -36037 -13814 -25569 -38619 -19350 -19907 -15578 -23896 -26157
15701 -26157 -16615 1462 -10607 -36031 -55421 -75993 -96759 -59179 -30587 -36160 -41103 -35434
15689 -35434 -43061 -53954 -82911 -78903 -66451 -44509 -51658 -45714 -6696 5668 4010 18060 -29508
15676 -29508 -51678 -43932 -22803 -33935 -56957 -46964 -46310 -1226 18272 -4810 -44598 -64311
15664 -64311 -59778 -69134 -68581 -46106 -25640 -30759 -37109 -21003 -35894 -43388 -20073 648 -5861
15651e861l220j5852K9865O033j8925m06K1419J7469j4611Q249p230l8425K262
15638a9233k0174r165K7794O643j9179j0287K2694J1474l427q145M516J9479p044
15625d054L066j4085k2213Q94k0709j2584L5544j063m051J5528J2471p98n477
15612a7531M748J7635n480j7883j4840J634N015q076J2214Q657R707K2365k2124
15599c959k1771k6061J692N887L0824K353N674K043n802J607j1681L7318J9156
15586C7280j0766k5145k9406q763J6804J118l770J1167k1638l690J1755j890J9650
15573g294L0585j742l229o669j0214p045j4715k1933l1528l249J9429L236L725
15560e0643j236J102L2720R796j3441j8275J7673M213N694k037l168j6728M487
$$ plain form
15651 -5861 -9081 -24933 4932 10965 -7960 -8366 13053 30522 15911 24160 16930 -21495 -19233
15638 -19233 -39407 -48572 -20778 -14135 -33314 -43601 -20907 -9433 -12860 -21005 -16489 2990 -4054
15625 -4054 -988 -15073 -37286 -36392 -57101 -69685 -34141 -35204 -39255 -23727 -11256 -12054 -17531
15612 -17531 -12783 4852 -628 -18511 -33351 -31717 -26702 -34778 -22564 -13907 -4200 18165 -3959
15599 -3959 -25730 -51791 -50099 -44212 -13388 -11035 -5361 -3318 -9120 -7513 -19194 18124 37280
15586 37280 26514 1369 -28037 -36800 -19996 -18878 -22648 -11481 -33119 -36809 -25054 -26944 -7294
15573 -7294 23291 21549 18320 11651 1437 -5608 -20323 -42256 -73784 -77033 -57604 -54368 -50643
15560 -50643 -51879 -50777 -18057 -8261 -21702 -39977 -22304 -18091 -12397 -14434 -17602 -34330 -29843
15547b9843J7769J8384J432p490l3398M312M1016P139j6581j6882l2359J394k2178
15534f7285j2094K0500j0961o859J2314j2259k969j2158l529J6478J4257K1664
15522d2901o472K579L450P777J0099m702n757J0620J662k3947J3748K0207R833
15509c804k3763n43o158J1407j0968J1517M6560j3685k0843j7651P362j6782q467
15496d5818K3275L044R304P488j2983P529L849j2918K326K3825j3124k0171j8865
15483d3239j665J0982J8247k5581p593K4733l671j155j1735j2092L860K9685j9900
15470c9124J149M4498k8990k7643k1327o618L325j089K540J9957L3831M568M670
15457a0253l749j2273j1755Q213j5317j440K2831n096J5437j554j4684K249j4505
$$ plain form
15547 -29843 -12074 6310 7742 252 -33146 -28834 12182 19321 2740 -14142 -46501 -45107 -67285
15534 -67285 -79379 -58879 -69840 -76699 -64385 -76644 -79613 -91771 -95300 -78822 -64565 -42901
15522 -42901 -49373 -46794 -43344 -35567 -25468 -30170 -35927 -25307 -23645 -47592 -33844 -13637 -3804
15509 -3804 -27567 -28110 -34268 -22861 -33829 -22312 24248 10563 -10280 -27931 -20569 -37351 -45818
15496 -45818 -22543 -19499 -10195 -2707 -15690 -8161 -4312 -17230 -14904 8921 -4203 -24374 -43239
15483 -43239 -44904 -33922 -15675 -41256 -48849 -24116 -27787 -28942 -40677 -52769 -48909 -19224 -39124
15470 -39124 -37975 6523 -22467 -50110 -71437 -78055 -74730 -75819 -73279 -53322 -19491 -14923 -10253
15457 -10253 -14002 -26275 -38030 -29817 -45134 -46574 -23743 -28839 -13402 -14956 -29640 -27391 -41896
15444d1896J5562J2345J1464R055r974k7828p718m28K0488o902j7119o120m42
15431d9513N705O713J129J0120P508l991k0257k734L2031J850k5360J3311K4348
15418H60k8502j2636N318n282K549M623J5669j1156j5801J3823m054m205R170
15405b9624o314M5633K781Q621Q442j3237j1035k5932j8207k123J7068O612k855
15392b0170J3959l0988K1959K4971m91j2732J1077l650j4627n998k3649j2171
15380e2510k781J9852L9289N307k1970j1480j2353J4196J6507k007J6912J920
15368A0882q315J2703P859N927k707p897J2479r912j9545m883K5893j3283r170
15355C1j9218j6172K856n722J7972K34l2539n327K7748J0794p871M663R88o345
$$ plain form
15444 -41896 -26334 -13989 -2525 6530 -3444 -31272 -38990 -39418 -18930 -25832 -42951 -49071 -49513
15431 -49513 -43808 -37095 -35966 -25846 -18338 -22329 -42586 -45320 -13289 -11439 -36799 -23488 860
15418 860 -27642 -40278 -34960 -40242 -37693 -33070 -17401 -28557 -44358 -30535 -34589 -38794 -29624
15405 -29624 -35938 9695 12476 21097 29539 16302 5267 -20665 -38872 -40995 -23927 -17315 -20170
15392 -20170 -6211 -37199 -15240 9731 9240 -3492 7585 3935 -10692 -16690 -40339 -52510
15380 -52510 -55291 -35439 3850 9157 -12813 -24293 -36646 -22450 -5943 -7950 8962 10882
15368 10882 2567 15270 23129 29056 26349 18452 30931 21019 1474 -3409 22484 9201 31
15355 31 -19187 -35359 -32503 -38225 -20253 -20019 -52558 -57885 -30137 -19343 -27214 -22551 -21563 -27908
15341b7908P417J0138j7534k6477j1470K5746L6434J4087M920j3770q095j5146
15329b1658L628K0601P519j7562k0593j095j3765r230j2499P55N326L0413M010
15316b4150Q242L829k5433r625p465Q308K183q472L3197j2823l712K1389K318
15303a2214L1447N095j5418j843R74n608k2227J46J7178J0673j8002M096k6838
15290c2541j0840o93J1599Q018J5412R218m17n458k8324r500K5066J1748k0505
15277b7217K1985J0023o99n523j5855p581k0033Q901M292J7115J7367K699N396
15264A0870O51N748j5778J0997Q369j0543j1802n483M83j5291j9170P413R58k5239
15250e7817J2614K6504Q179n664k0510k0471L1599Q75k1854J293j3741L130J8831
$$ plain form
15341 -27908 -20491 -10353 -27887 -54364 -65834 -40088 -3654 10433 15353 1583 -6512 -21658
15329 -21658 -18030 2571 10090 -7472 -28065 -29160 -42925 -52155 -64654 -63899 -58573 -28160 -24150
15316 -24150 -15908 -12079 -37512 -47137 -54602 -46294 -44111 -52583 -19386 -32209 -35921 -14532 -12214
15303 -12214 19233 24328 8910 7067 8041 2433 -19794 -19648 -2470 8203 -9799 -5703 -32541
15290 -32541 -43381 -44074 -32475 -24457 -9045 173 -244 -5702 -34026 -43526 -18460 -6712 -27217
15277 -27217 -5232 4791 4092 -1431 -17286 -24867 -44900 -35999 -31707 -14592 2775 5474 10870
15264 10870 11521 17269 1491 12488 20857 10314 -1488 -6971 -6488 -21779 -40949 -33536 -32578 -57817
15250 -57817 -45203 -18699 -10520 -16184 -36694 -57165 -25566 -24691 -46545 -45252 -58993 -55863 -37032
15237c7032J9318J4235J2934k210j2237k3208L665k4050R70K1677P261K950K4592
15224H865l2893l5027J4472m019R905R372R415q394k6310r552K8787K3363J0338
15211a678j0417k4672o250p171j92J6328j1816J9787K8027K855P699l540k0603
15198a1643j3112m151O09J51p309j8100l18j1200J9572J814R737J1135j5479N54
15184c7740p200O434L3845J794J6900l0170r801P804j4824m8996R317M3182L3422
15171C967J1656k5659m660R520Q613j7681j6605k3995J4301N1454J0913j4363
15159G461J030J6345p333j1893k6713k32r745P112M955j803j0151n021J8237J9481
15145A730j7698q598n002j7697J0987M748O365j3630O787K7834k971j543j7679
$$ plain form
15237 -37032 -17714 -3479 9455 7245 -4992 -28200 -24535 -48585 -47615 -25938 -18677 -15727 8865
15224 8865 -24028 -59055 -44583 -48602 -38697 -29325 -19910 -28304 -54614 -64166 -35379 -12016 -1678
15211 -1678 -12095 -36767 -43017 -50188 -50380 -34052 -45868 -26081 1946 4801 12500 8960 -11643
15198 -11643 -24755 -28906 -28297 -28146 -35455 -53555 -53873 -65073 -45501 -43687 -33950 -22815 -38294 -37740
15184 -37740 -44940 -38506 -4661 -2867 14033 -16137 -25938 -18134 -32958 -81954 -72637 -29455 3967
15171 3967 15623 -10036 -14696 -5176 3437 -14244 -30849 -54844 -40543 10911 21824 7461
15159 7461 8491 24836 17503 5610 -21103 -21335 -31080 -23968 -19013 -20816 -30967 -35988 -17751 1730
15145 1730 -15968 -24566 -29568 -47265 -36278 -31530 -25165 -38795 -32008 -4174 -7145 -8688 -26367
15132b6367j3098j319m346O920J782J4569q287K5079M885M23k7205j4660j2059
15119e3683J4085L4612K2865n486m2060k0375K93J4378J2647j2556p872J1547
15107c1605P687J3313j1903k4286P297p011j0029K4240J5455J9925j4684k5616
15095c7217M200j6378r196K928n326J2821K9551l324O213k102J6378J6848j632
15082A3764j8870j9258K6649K4501j2055N499K459j5768k9876j3493j9389J858
15070e3979J7520J6176K9907J5237k2401m3159P533Q006J7181O148j6725J2934
15058e622j643R103k1986M071J755j3474J8328J7444o93j6778O429M278n743j9983
15044b4514L322K0215J5259o857k7755k4972k1183L3817L5457k8748j747K3941
$$ plain form
15132 -26367 -39465 -40784 -45130 -38210 -36428 -21859 -30146 -5067 -182 241 -26964 -41624 -53683
15119 -53683 -39598 -4986 17879 12393 -29667 -50042 -49749 -35371 -22724 -35280 -43152 -31605
15107 -31605 -23918 -10605 -22508 -46794 -39497 -46508 -56537 -32297 -16842 3083 -11601 -37217
15095 -37217 -33017 -49395 -58591 -55663 -60989 -48168 -18617 -21941 -15728 -17830 -1452 15396 13764
15082 13764 -5106 -24364 2285 26786 14731 20230 22689 6921 -22955 -36448 -55837 -53979
15070 -53979 -36459 -20283 9624 24861 2460 -40699 -33166 -25160 -7979 -1831 -18556 -5622
15058 -5622 -7265 1838 -20148 -16077 -14322 -27796 -9468 7976 7283 -9495 -3066 1212 -4531 -24514
15044 -24514 -21192 -977 14282 7425 -20330 -45302 -66485 -32668 2789 -25959 -27706 -3765
15032c765K610J2197k2082j0545K3075K030N73j3077k2822N492K1530M785j1136
15019a1135j812l918J0201R060j8881k2838m66n642l0013J3151K5415J2103K0629
15006d146J4740J1960j7825k0722k0631n533j8141J0145r175K738K0891J5258
14994b0441m28k5446O941J9194Q748R223L2776N311j0769J0213j5055j3942j0834
14981d509K8679k0644l84j400j1159n289n381n368j3035J781J2226j0393N895
14968b8981J288j6650J7183K9742J6358k5286r717L559J6181J1769l906r449j8203
14955a6112k1160P697k923l1888r867O024K4504K7204J4210j4387j5878o078j626
14942d0280m881k9142J4377K8450O617J9340L841J1396k0705l1481K35K0709l3982
$$ plain form
15032 -3765 -1155 11042 -11040 -21585 1490 3520 4093 -8984 -31806 -26314 -4784 1 -11135
15019 -11135 -12947 -16865 -6664 2396 -16485 -39323 -39789 -45431 -75444 -62293 -36878 -24775 -4146
15006 -4146 10594 22554 4729 -15993 -36624 -42157 -60298 -50153 -59328 -56590 -35699 -20441
14994 -20441 -20869 -46315 -39374 -20180 -11432 -2209 30567 35878 25109 35322 20267 6325 -4509
14981 -4509 24170 3526 3142 1742 -9417 -14706 -20087 -25455 -38490 -36709 -24483 -34876 -28981
14968 -28981 -27693 -44343 -27160 2582 18940 -6346 -16063 -12504 3677 15446 11540 2091 -16112
14955 -16112 -37272 -29575 -32498 -64386 -74253 -68229 -43725 -16521 -2311 -16698 -32576 -38654 -40280
14942 -40280 -45161 -74303 -59926 -31476 -24859 -5519 -1678 9718 -10987 -42468 -42233 -21524 -55506
14929e5506j344L1149j0944L15q583r202J6768J7526J2925k304J9291P682k4463
14916f690L048J028L8347j6135k137j3432k0132J061j4683p381M009l3365p22
14903f7184L1003N096p226j5631P230l968M746M64j311k3738J2339J4139j4153
14890e8194J6574K1863j9141O099l743o122L790L4344Q409q622N619r13J0806
14877A0769k6008j3609J2989n591l516K0407q309K214n603L648j1152l330j2570
14864c9661l374J2394Q086M155j2682j1898J8370K4567r369j058N369P474J8149
14851B0522r706k164m224r729j3113n608n370K0227j0941n974J373O631R673L849
14837d554j5243j7642N081L3971J1376k3556P989K4153O166M563k0471j3888K957
$$ plain form
14929 -55506 -56850 -25701 -36645 -36330 -44913 -54115 -37347 -19821 -6896 -9200 10091 17773 -6690
14916 -6690 -3642 -2614 35733 19598 17461 4029 -16103 -15042 -29725 -37106 -33097 -66462 -67184
14903 -67184 -36181 -31085 -38311 -53942 -46712 -50680 -45934 -45470 -46781 -70519 -58180 -44041 -58194
14890 -58194 -41620 -19757 -38898 -32799 -36542 -42664 -38874 -4530 3879 -4743 876 -37 10769
14877 10769 -15239 -28848 -15859 -21450 -24966 -4559 -12868 -10654 -16257 -12609 -23761 -27091 -39661
14864 -39661 -43035 -30641 -22555 -18400 -31082 -42980 -24610 -43 -9412 -10470 -5101 2373 20522
14851 20522 10816 8652 4428 -5301 -18414 -24022 -29392 -9165 -20106 -26080 -24707 -18076 -8403 -4554
14837 -4554 -19797 -37439 -32358 1613 12989 -10567 -2578 21575 27741 32304 11833 -2055 902
14824I02M390J4009j6002m3120Q432J6609l662j4500O149J3287j0913K3641q012
14811h790p980j3045j3739J118j2462q067J3501J1844R41j6475K3948O12j7928
14798d6522l35P925Q587J3387K7829Q941j0800j0183J905J304J0407J7857p079
14785B3223j5842j2254l7780P913J7608J5379n366K974o435o407J1385r077L2411
14772A7732L9256j4678m0319j9684j2900L508N788q88p196K639K6059J0106N965
14759A5388o157k2341k4600L020l885J521J3282p326r512r78J168K023q642J8542
14745b8497L8436m363n497O689K3513j6143k5657j0643j2621k796m057J3532Q144
14732a9960n654K6366J5160j6967j4143m304M767l656P383P658j08K3270j8524
$$ plain form
14824 902 5292 19301 3299 -39821 -31389 -14780 -18442 -32942 -26793 -13506 -24419 -778 -8790
14811 -8790 -16770 -29815 -43554 -42436 -54898 -62965 -49464 -37620 -36679 -53154 -29206 -28594 -46522
14798 -46522 -46857 -38932 -30345 -16958 10871 19812 9012 -1171 734 2038 12445 30302 23223
14785 23223 7381 -4873 -42653 -34740 -17132 -1753 -7119 -4145 -10580 -16987 -5602 -14679 17732
14772 17732 56988 42310 1991 -17693 -30593 -27085 -21297 -22185 -29381 -26742 -683 9423 15388
14759 15388 9231 -13110 -37710 -34690 -38575 -37054 -23772 -31098 -40610 -41588 -40420 -38397 -47039 -28497
14745 -28497 9939 5576 79 6768 30281 14138 -11519 -22162 -34783 -37579 -41636 -28104 -19960
14732 -19960 -25614 752 15912 -1055 -15198 -19502 -14735 -18391 -11008 -3350 -3458 19812 1288
14719A288m0397m174J322K2733R982j6407k0797M5817r526j0517k1903K905O154
14706c3520J0384L117j2838N921P283j4720J3910J5768P181k2833O226L1385M640
14693B1904J2334j0483k8096k0457K7231Q461k5931k6328J3567L1992K6188Q29
14681C1211k1139l0811k107O695K750n894j334r682j2156J9865J2105o082o204
14668b2783o895j7270J4127N101J6814K281j6369J9695r249j879m122R791j787
14655a2545k699j8594N440M3951K054j0530j4981k8443k581Q249l357J6891J0335
14642f810L8384R867j2646k1074j7099p665j2476r748l699J9205K7224j1154J0217
14629B526P433j8278j0666J931k775O239P177k4381j5017P30L5008r82j0312J4686
$$ plain form
14719 1288 -39109 -43283 -41961 -19228 -9246 -25653 -46450 -633 -10159 -20676 -42579 -39674 -33520
14706 -33520 -23136 -20019 -32857 -26936 -19653 -34373 -20463 -4695 2486 -20347 -14121 17264 21904
14693 21904 34238 23755 -4341 -24798 2433 10894 -15037 -41365 -27798 4194 30382 31211
14681 31211 10072 -20739 -22846 -16151 -13401 -19295 -20629 -30311 -42467 -22602 -10497 -16579 -22783
14668 -22783 -29678 -46948 -32821 -27720 -10906 -8625 -24994 -5299 -14548 -16427 -20549 -10758 -12545
14655 -12545 -15244 -33838 -28398 15553 17607 7077 -7904 -36347 -38928 -30679 -34036 -17145 -6810
14642 -6810 31574 41441 28795 7721 -9378 -17043 -29519 -39267 -42966 -23761 3463 -7691 2526
14629 2526 9959 -8319 -18985 -17054 -19829 -13590 -6413 -30794 -45811 -45081 -10073 -11055 -21367 -6681
14615f681K4393J8887K469j5924j9372L359Q743p180j5805j2734J4480J1497K1721
14602B7853j6233K511l0286k0192n581j7945r525K0349J0922P286K6318K4341
14590A9818J0748k8057j5225j5272J4528L3090m356R806j7858j3332J6956P725
14578A8571p813j5822O929j5135k0010q982J8710J6441j9155R34J3179J7503j3728
14565h378j8244M86R821M689M417p062J3968K1621k2956r355j6178K3229K1641
14552A7699k6235k7183o734K3102L1243Q35j3760J8493J4192m180k936p690J7022
14539C3868j6261k6128o502J5126j4264K797O217l043k0047j478L3969L2816J7936
14526E5006p987j4826m597l4738p043J3444n836k3390K9057M2176l51j9075K1415
$$ plain form
14615 -6681 17712 36599 39068 23144 3772 7131 15874 8694 -7111 -19845 -5365 6132 27853
14602 27853 11620 14131 -16155 -36347 -41928 -59873 -69398 -49049 -38127 -30841 -4523 19818
14590 19818 30566 2509 -12716 -27988 -13460 19630 15274 25080 7222 -6110 10846 18571
14578 18571 10758 -5064 1865 -13270 -33280 -42262 -23552 -7111 -26266 -25332 -12153 5350 -8378
14565 -8378 -26622 -26136 -16315 -11626 -7209 -14271 -303 21318 -1638 -10993 -27171 -3942 17699
14552 17699 -8536 -35719 -42453 -19351 11892 12727 -1033 17460 31652 27472 24536 16846 33868
14539 33868 17607 -8521 -15023 103 -14161 -11364 -5147 -8190 -28237 -29715 4254 37070 55006
14526 55006 47019 32193 27596 -7142 -14185 -741 -6577 -29967 -910 41266 40915 21840 43255
14513D3255j1696k9281k9132J3334o852J5419J1988K4635j0878j1348j6426q038
14501a5020j2145J7034J6926J8323J0862L2941J2287l1602k1709l933J6236p808
14489C2392M59M0527L4701j7080l9853q35n431l462J2653J6932q107l7943q599
14476A6354R229J0137N892o947k0194j899j639Q202j9544k145J0833K4865O809
14463C9953j0814K006K4254P368k0223j6351O628j1827J952L757K0254K3894o229
14450F4622J621p787K0121J8281j6804j076J7931k6357j1711L673m468j1892L35
14437D6489o747O979J7130l712J5068p219l870j2997K174J1931j4811J9975O400
14424G6790k2662J6662J4637J4593p480j4244j9215j8493j4018r717L9365j600
$$ plain form
14513 43255 31559 2278 -26854 -13520 -20372 -4953 7035 31670 20792 9444 -6982 -15020
14501 -15020 -27165 -10131 6795 25118 35980 68921 81208 49606 27897 23964 40200 32392
14489 32392 32851 73378 108079 90999 51146 50311 44880 41418 54071 71003 62896 24953 16354
14476 16354 25583 35720 41612 34665 14471 12572 10933 19135 -409 -2554 8279 33144 39953
14463 39953 29139 31145 55399 62767 42544 26193 32821 20994 22946 26703 46957 70851 64622
14450 64622 66243 58456 78577 96858 80054 78978 96909 70552 58841 62514 58046 46154 46489
14437 46489 39742 46721 63851 60139 75207 67988 64118 51121 53295 65226 50415 70390 76790
14424 76790 54128 70790 85427 100020 92540 78296 59081 40588 26570 16853 56218 54618
14412E4618j2708o133j5613j0958k511L760O380N614j4100J2115K0251j6132l976
14399B0607o648k3602N14J0896O223M135K0387j0629j3906p758P857J9096J3682
14386D0854L205r926r2q203k9822r231r01p911M391n155j3120j0908K4120J0347
14372a2352P419O750p897J0197j0485J0530K2399K3892L752k6050m0150n876m202
14359b2073r844J2525J8823J178m637j017j2533N651K3652k8533m122J7303n019
14346h646j7781M160k889K4126K2860N595j9247j1262l615m544j1653o62N867
14333a7691R889K1916J0353k2829K11q018k572K2606q344k1803J0468J561O036
14320A783J2351k0024j5356R498R341K8024J6511n541j5493k0418j3549l301k044
$$ plain form
14412 54618 41910 35777 20164 9206 6695 10455 16835 22449 8349 20464 40715 24583 20607
14399 20607 13959 -9643 -9129 1767 7990 12125 32512 21883 7977 219 8076 27172 40854
14386 40854 44059 34133 34041 25838 -3984 -13215 -14116 -22027 -17636 -22791 -35911 -46819 -22699 -12352
14372 -12352 -4933 1817 -6080 4117 -6368 4162 26561 50453 54205 28155 -11995 -17871 -22073
14359 -22073 -31917 -19392 -569 609 -4028 -5045 -17578 -11927 11725 -16808 -20930 -3627 -8646
14346 -8646 -26427 -22267 -25156 -1030 21830 27425 8178 -3084 -6699 -11243 -22896 -23558 -17691
14333 -17691 -7802 14114 24467 1638 1849 -6169 -8741 13865 5521 -16282 -5814 -4253 1783
14320 1783 14134 -5890 -21246 -11748 -2407 25617 42128 36587 21094 676 -12873 -16174 -18218
14307a8218M452J0170j1079Q856J2515o314L504l321n518m49L709N491o573j4307
14293a7082K0368J4524L512Q365P716j3329M534k3357k7614r873k5817j5241K5463
14280d7831J1333J142o543L798n426M322J1754K0695r730k5046J4688J4644J1548
14267f52j058J0785N005J1022J3035L940k1213k2796j917J5638J0259k8585k6363
14254c2900J493J3393K4929N133J0721M973m876N63k1022k3455J0158J5268o607
14241b229k4386k541K2663J3844l3198N839M1843J7836j9762l0044l636L0739
14229A6968K8898j8802m6079m611R843j6824j1389K0385J1051j115Q372j6051
14217a9354R980N2L8023J5816L865k6333l0516k5687k1677o402p056M687J7525
$$ plain form
14307 -18218 -13766 -3596 -14675 -5819 6696 382 3886 565 -4953 -5402 -1693 3798 -2775 -17082
14293 -17082 3286 17810 21322 29687 37403 24074 28608 5251 -22363 -32236 -58053 -73294 -47831
14280 -47831 -36498 -35356 -41899 -38101 -43527 -39205 -27451 -6756 -16486 -41532 -26844 -12200 -652
14267 -652 -1710 9075 14080 25102 38137 42077 20864 -1932 -3849 11789 22048 -6537 -32900
14254 -32900 -31407 -18014 6915 12048 22769 27742 22866 23429 2407 -21048 -10890 4378 -2229
14241 -2229 -26615 -29156 -6493 7351 -25847 -20008 21835 39671 19909 -10135 -13771 16968
14229 16968 45866 27064 -19015 -23626 -13783 -30607 -41996 -21611 -10560 -11675 -3303 -19354
14217 -19354 -9374 -9322 28701 44517 48382 22049 -8467 -34154 -55831 -62233 -69289 -64602 -47077
14204d7077n938K2979K6014K727K064P515q912q54K472j956q528l25N175M400
14190b44j5101k0798N062R73j1543j5956L854J4506J5654N581J4588m723j1743
14177a9890o30j3909k850J1031J2777J0867J71N327M063J5609j7673m720N046
14164E219P344j666k6460j5477K0212n275k323J9612K1556P676j7586j3643n365
14151f176j7095m349K2260p387k753J374O730K1968P854k112J857k8997k1023
14138b7849J3534Q155J6693n127q985k2104L411N996P966m608K843n599j8980
14125c4654k4140P258J907K0114J4326M670K304m184j3910j9642j4806J6499p736
14112e1994j0703J6559J4618j4224L604J7404K5349K7237j4349q630K3456J1192
$$ plain form
14204 -47077 -53015 -30036 -4022 -1295 769 8284 -628 -1482 990 -966 -9494 -9819 -4644 -244
14190 -244 -15345 -36143 -31081 -30108 -41651 -57607 -53753 -39247 -23593 -18012 -3424 -8147 -19890
14177 -19890 -20520 -34429 -37279 -26248 -13471 -2604 -2433 2894 6957 22566 4893 173 5219
14164 5219 12563 10897 -15563 -31040 -10828 -16103 -18426 1186 22742 30418 12832 -811 -6176
14151 -6176 -23271 -27620 -5360 -12747 -15500 -14126 -7396 14572 22426 20314 22171 -6826 -27849
14138 -27849 -14315 -6160 10533 5406 -3579 -25683 -22272 -16276 -8310 -12918 -10075 -15674 -34654
14125 -34654 -58794 -51536 -49629 -29515 -15189 -10519 -8215 -12399 -26309 -45951 -60757 -44258 -51994
14112 -51994 -62697 -46138 -31520 -45744 -42140 -24736 613 27850 13501 4871 28327 39519
14100C9519l867k1757j9755N262J4525J4295n034j8566j1509K297J7492q462k4048
14087a9608L329J9927P773K1614j1514k0531j674l403L2590J5443m1367j4242
14075a1663K7536R454J8481k3246k4322j4586M145L1979L4332P529q609k1206
14063B9824q937m906j4739J8382q779q523r848n14P664p229N000N012J5714k7706
14049i585j1570L029J7761p313j0851n886q667J9890J6168l501l692k215j5925
14036b2357k9240j2755j7398k8K0755k545K1149J1644R90J1578p833J3793J3667
14023A420j0173J170K1563l620q612n300m169j5898K4482J6271J8527M251k4834
14010A5078k0386J9864j5657q496j0557J8323R974j9225J5914m966k8962K5591
$$ plain form
14100 39519 35652 13895 -5860 -598 13927 28222 23188 4622 -6887 -4590 12902 4440 -19608
14087 -19608 -16279 3648 11421 33035 21521 990 -684 -4087 28503 43946 2579 -11663
14075 -11663 15873 25327 43808 20562 -3760 -18346 -14201 17778 52110 59639 51030 29824
14063 29824 20887 15981 1242 19624 10845 2322 -7526 -8040 -376 -7605 -2605 2407 18121 -9585
14049 -9585 -21155 -18126 -365 -7678 -18529 -24415 -33082 -13192 2976 -525 -4217 -6432 -22357
14036 -22357 -51597 -64352 -81750 -81778 -61023 -63568 -42419 -30775 -29785 -18207 -26040 -12247 1420
14023 1420 -8753 -7583 13980 10360 1748 -3552 -7721 -23619 863 17134 35661 39912 15078
14010 15078 -5308 14556 -1101 -9597 -20154 -1831 8143 -11082 4832 -134 -29096 -3505
13998c505k942J5392K1266n671j1363l8326R02M847L0987N997j7995j9616q51
13985b0878K2016p836k5142K984l443j3423J276J7982K0481j2674J853J5695p097
13972h206p574M859k6271M871L3011k559j9788j4270N213M0823N900j1942r058
13959d991j0572j8855J0675L008j0699J618L0133j8492k3292j3468j3158J970
13947f6123J0441K1755J4440m377L60K5586m355Q64L101J1921K0779q706k8531
13934b845j2918J8639M044J0790P060k3708K6380J1440j323k1146q846j882j273
13921D412r47j6810k1254m309K4259N4993K4714m2431k1814k755k8906l841P119
13908b7570K5112J0596J6376k112J0018L500k4298k7239k67K0431P174J6947k272
$$ plain form
13998 -3505 -6447 8945 30211 24540 13177 -25149 -24247 -19400 11587 17584 -411 -20027 -20878
13985 -20878 1138 -6698 -31840 -28856 -32299 -45722 -44446 -26464 -5983 -18657 -16804 -1109 -8206
13972 -8206 -15780 -10921 -37192 -32321 690 -1869 -21657 -35927 -30714 10109 16009 4067 -4991
13959 -4991 -15563 -34418 -23743 -20735 -31434 -29816 317 -18175 -41467 -54935 -68093 -66123
13947 -66123 -55682 -33927 -19487 -23864 -23504 2082 -2273 -1409 1692 13613 34392 25686 -2845
13934 -2845 -15763 2876 6920 17710 24770 1062 27442 38882 37559 16413 7567 5685 4412
13921 4412 3465 -13345 -34599 -38908 -14649 40344 65058 22627 813 -1942 -30848 -34689 -27570
13908 -27570 -2458 8138 24514 22402 32420 35920 11622 -15617 -15884 4547 11721 28668 26396
13895B6396r410l4458j4518J413k1189P725K5490j2613j3589J6998K2305M032
13883a418r26o465j2621N04l2420m347M7333J9672j8722L489j0218k6628K6420
13870a6347o207Q96M2796P80j3950P348l099j5226J7620k2826J4264J6522j870
13857B0701j4922K6959J2224q058j8964l70j5038J3107p46k6223k5974j2744K9301
13844b0747L602m245O362l993J7815M585o955j5140j8019r559o512q033P406Q283
13830d5150J0395Q234j7202p434N582L129K4711K8745j704j5156j1524M148L596
13817i630r055J2985m393k6720J7991J3635R941p966K814K4967q957n666J9429
13804B9375L2143J4576k6384k9191r848l489O583n285l7487l0219L2065M2342
$$ plain form
13895 26396 16986 -17472 -31990 -30577 -51766 -44041 -18551 -31164 -44753 -27755 -5450 -1418
13883 -1418 -2344 -8809 -21430 -20926 -53346 -57693 -10360 9312 -9410 -5921 -16139 -42767 -16347
13870 -16347 -22554 -21658 21138 21918 7968 15316 12217 -3009 14611 -8215 6049 22571 20701
13857 20701 5779 32738 44962 36904 17940 17570 2532 15639 14893 -11330 -37304 -50048 -20747
13844 -20747 -17145 -21390 -15028 -19021 -1206 3379 -3576 -18716 -36735 -46294 -52806 -60839 -53433 -45150
13830 -45150 -34755 -26521 -43723 -51157 -45575 -42446 -17735 11010 9306 -5850 -17374 -13226 -9630
13817 -9630 -18685 -5700 -10093 -36813 -18822 -5187 4754 -3212 -398 24569 15612 9946 29375
13804 29375 61518 76094 49710 20519 10671 7182 13765 8480 -29007 -59226 -27161 15181
13792A5181Q81r974J499k76j8187k7600N135K090N70k014J7284J6477L152k913
13778A305m713K944R278j4309r530K7822K686k4072l8384k0276K9246J2633k8343
13765e3713N169K1734L766J5188J2376k611J3233J8750J5708k7386l7497J3289
13753a994j5941n708J8121K7086K0603M495j4242r787j5396j7176k262L453J9251
13740A0503R475l0956k257J249j2924N459q026l122P055J9057J0193P074o8M989
13726A7701J9477k732k9096n2781j9944Q434L2568O831k579J4466q30o77J5999
13713F837N025j3814k1670j6792Q179m009J6435L1638K3770K9931J7609r266k3462
13700E0411l4431m3819j8975L7219J7647p765j7893J8583R364j321n924J1773
$$ plain form
13792 15181 16062 6088 7587 7311 -10876 -38476 -33341 -31251 -30681 -32695 -15411 1066 4218 1305
13778 1305 -3408 -464 8814 -5495 -15025 12797 15483 -8589 -46973 -67249 -38003 -25370 -53713
13765 -53713 -48544 -26810 -23044 -7856 4520 1909 15142 33892 49600 22214 -15283 -1994
13753 -1994 -17935 -23643 -5522 21564 42167 46662 32420 22633 7237 -9939 -12201 -8748 10503
13740 10503 19978 -10978 -13235 -11986 -24910 -19451 -27477 -30599 -23544 -4487 5706 12780 12712 17701
13726 17701 37178 34446 5350 -47431 -67375 -58941 -26373 -19542 -22121 -7655 -8485 -9162 6837
13713 6837 11862 -1952 -23622 -40414 -32235 -36244 -19809 11829 35599 65530 83139 73873 50411
13700 50411 15980 -27839 -46814 -9595 8052 287 -17606 977 10341 9020 3096 14869
13688A4869l253l2404J7299J0318q681o579j9919O26L966M3803rP63l816j0542
13674F441K57m100p950M359l6027m0501K5364L4021O246J5508P658k5647k640
13661a7011j2460Q695j0251j4997J4205j2524P701M151J5096M888J3257j0245
13649i495j8529Q204J7457O785M772q191J6556Q811M051J7459K008k8158m7774
13636b6044k2025O635J7483J3506J4999J259R99l836q232r736%j499j1898q61
13622b9250l188q201k114L4172M8693q400k504R362L487l0690j9990M9496k7707
13609A3166l6326J3260M163J2114N673m440J0063j5745J715K6504p419l3680R026
13596a926K626l718P267J3856o720p684l1712o617K4817K606M1933M806j9288
$$ plain form
13688 14869 11616 -20788 -3489 6829 -1852 -8431 -28350 -27724 -23758 20045 20036 20799 16983 6441
13674 6441 6698 2598 -5352 -993 -37020 -77521 -52157 -18136 -11890 3618 11276 -14371 -17011
13661 -17011 -29471 -20776 -31027 -46024 -31819 -44343 -36642 -32491 -17395 -12507 750 -9495
13649 -9495 -28024 -19820 -2363 4422 9194 1003 17559 26370 30421 47880 49888 21730 -26044
13636 -26044 -48069 -41434 -23951 -10445 4554 5813 6812 2976 -5256 -14992 -14992 -16491 -28389 -29250
13622 -29250 -32438 -40639 -42753 -8581 40112 31712 29208 38570 42057 11367 -8623 40873 13166
13609 13166 -23160 -9900 -5737 6377 12050 7610 17673 1928 3643 30147 22728 -10952 -1926
13596 -1926 700 -3018 4249 18105 11385 3701 -28011 -34628 -9811 -7205 34728 39534 20246
13583B0246k2164N401J0713J5459J953J9313j2403o007L539j0058J893P925J562
13570C7372R208j6735q505M908J652O611j3117J1808O107j2609k1612k532M219
13557F775J521k5395j0721K4643L343K3891L541k5387L93K268Q708q66J308k1962
13543g940L302J5616n05r357K876P953L374k0166K945L282j6762L190M0681Q072
13529C6561j0331M685k5695k3924N589k53M1487J8698k5374j9849m052r0j198
13516c746j5065L775K8039K0121P072k5570j1234j5029K7902K2542Q447j7027
13504C0227l8066j9046R605L7327J4706k1992M274J4457K4298j2937k2485j1146
13492I222J9194q346j1891j43M960L0222J310m211n231k5252j5075Q08J970k850
$$ plain form
13583 20246 -1918 3483 14196 29655 31608 50921 38518 32511 36050 25992 27885 35810 37372
13570 37372 46580 29845 21340 26248 27900 34511 21394 33202 39309 26700 5088 2556 6775
13557 6775 8296 -17099 -27820 -3177 166 24057 27598 2211 2604 4872 13580 12714 14022 -7940
13543 -7940 -4638 10978 10473 1116 3992 11945 15319 -4847 -1902 1380 -15382 -12192 28489 36561
13529 36561 26230 30915 5220 -18704 -13115 -13368 28119 46817 21443 1594 -2458 -2548 -3746
13516 -3746 -18811 -15036 13003 33124 40196 14626 3392 -11637 16265 38807 47254 30227
13504 30227 -7839 -26885 -17280 20047 34753 12761 17035 31492 55790 42853 20368 9222
13492 9222 28416 20070 8179 8036 12996 43218 44528 40317 35086 9834 -5241 -4433 -2463 -5313
13478e313o956M752n078O831J1583J1796j3159r689o292K2197J6931o517k8K710
13464B3768j0508j9915r395K1124q311J3583L6228P550j5734M357l490l254J1121
13451D7124q822J5162l270k4112l07m985N230J6859P869O540k5005j9810p542
13438D931p799K0159J8382n898M622J2187l274k5161l218O768k5854N87J4618
13425A1050O237m816o444j3239M477K9652J0993O357M597l2889j2837M5093J5243
13412F3474N8L844L506M372j3321j5410J584Q084O887j1475j2360J1950O067o035
13398E1225k7981l2868M466N997J1328K8733k0262n936l325J3910L87N413R837
13385D0924L128K9109q067l9498j0542J936Q856j484p73r124o230l0708J0649
$$ plain form
13478 -5313 -12269 -7517 -12595 -5764 5819 17615 4456 -5233 -11525 10672 27603 21086 21058 23768
13464 23768 13260 -6655 -16050 5074 -3237 10346 46574 54124 38390 42747 39257 36003 47124
13451 47124 38302 53464 50194 26082 25775 20790 26020 42879 50748 57288 32283 12473 4931
13438 4931 -2868 17291 35673 29775 34397 46584 43310 18149 14931 21699 -4155 -3568 11050
13425 11050 17287 12471 6027 -7212 -2735 26917 37910 44267 48864 15975 3138 48231 63474
13412 63474 63532 67376 70882 75254 61933 46523 48107 56191 63078 51603 39243 51193 57260 51225
13398 51225 23244 -9624 -5158 839 12167 40900 20638 14702 11377 25287 25674 31087 40924
13385 40924 44052 73161 65094 25596 15054 16990 25846 24362 23589 14465 8235 -22473 -11824
13372a1824K9142L1037J5375J0041J5144j3744k6329k4420j2276q363O501k450
13360G834L6864Q278J5684j6723k0613M150k5030l62R048L3926K7934N553k8716
13347E7827k6864j1279J4328k9189L436K1443J4575j757N028J5040j5470k2418
13335B4700L403j3936J5614K6625l994k4798q599k5559q460m580K6670L2691L6488
13322G6265j4964k6415j0983J1370O426P476j2765O906J4245K6890m1412k7007
13310A6032Q382J0248L727j3683N368n1j8730K2143K3542K2443n562m0954j6094
13297A6811J4254l120J0622K894N963p361R01P166J0083j712L028K0099k3093
13284E6535l56k2072j4899l1548m845p667k2093K402J1131K3416M6959J4446K184
$$ plain form
13372 -11824 17318 48355 63730 73771 88915 75171 48842 24422 12146 3783 10284 7834
13360 7834 44698 52976 68660 51937 31324 35474 10444 10082 19130 53056 80990 86543 57827
13347 57827 30963 19684 34012 4823 8259 29702 44277 42520 47548 62588 47118 24700
13335 24700 28103 14167 29781 56406 52412 27614 19015 -6544 -15004 -19584 7086 39777 76265
13322 76265 61301 34886 23903 35273 41699 49175 36410 43316 57561 84451 43039 16032
13310 16032 24414 34662 38389 24706 30074 30023 11293 33436 56978 79421 73859 32905 16811
13297 16811 31065 27945 38567 41461 47424 40063 40964 48130 58213 56501 59529 79628 56535
13284 56535 56179 34107 19208 -12340 -17185 -24852 -46945 -44543 -33412 -9996 36963 51409 53593
13271E3593l4917Q188J8134R326J7275J3502l2513k3937J9037K541q634k606P724
13258D6713J4678K9071l3580l1321j3862q746k0585K1225K0405J0446k620k8494
13246C330k334n905K3649J8194K471R444J235j7840r319R436q330J7308K9885
13233G1224l3725Q069r133k0764j2986j3804O016K8270J7201P307J4863j3064
13221D9474k3621M382N048L2408o329J0065J168Q669j9609j7004J6432r097j651
13208E0335j52n063r382J6361R132L301n925k1131j8544J2037K2736N909Q083
13195F7697j4338j5236J6076q080o03j9049J9456L2283J4881K469j2210r545K8639
13182A02440R667Q3l3074j7886K4504M6749K0075j3536j6830K4725K3239J8365
$$ plain form
13271 53593 18676 26864 44998 54324 71599 85101 52588 28651 47688 50229 41595 38989 46713
13258 46713 61391 90462 56882 25561 11699 2953 -17632 3593 23998 34444 31824 3330
13246 3330 996 -4909 18740 36934 39405 48849 50084 32244 22925 32361 24031 41339 71224
13233 71224 37499 45568 36435 15671 2685 -11119 -5103 23167 40368 47675 62538 49474
13221 49474 25853 30235 35283 67691 61362 71427 72595 81264 61655 44651 61083 51986 50335
13208 50335 50183 45120 35738 52099 61231 64532 58607 37476 18932 30969 53705 59614 67697
13195 67697 53359 38123 54199 46119 45516 26467 45923 78206 93087 95556 83346 73801 102440
13182 102440 112107 112190 79116 61230 85734 132483 152558 139022 122192 146917 170156 188521
13170A88521M3302L8410J0975N2686P4082N5712Q9671J52286J94060K75595L74071
13159A549371M53104M67527K01500j24007k98396l59078l67908l08788k59622
13150I53703j95027j41130q2091n1910n1426l5058j3094k9615j8370l6478k1725
13139B77779j0371O496j9534k2692o893R425J1274k3488J0946J0211l9544n754
13127A97855K9106m081l4457O809k360o803j1463K419J0755N787j2977R770l733
13114A86627j5935l3297j9850j7976J763n09j245k639K3660m147j020K6915j3661
13101A28686P273m148k2627j1113l711o09N881n51L630j4774j626J3663P780r236
13087I8518k407J1756k637k010q176k642n069J5769J3497J1847J0501L345k7479
$$ plain form
13170 188521 231823 270233 281208 333894 407976 463688 553359 705645 899705 1175300 1549371
13159 1549371 2002475 2470002 2671502 2547495 2249099 1890021 1522113 1213325 953703
13150 953703 758676 617546 535455 483545 432119 397061 383967 354352 335982 299504 277779
13139 277779 267408 273904 254370 231678 224785 234210 245484 221996 232942 243153 203609 197855
13127 197855 226961 222880 188423 195232 192872 186069 174606 177025 187780 193567 180590 190360 186627
13114 186627 170692 137395 117545 99569 101332 100823 99578 96939 120599 116452 115432 142347 128686
13101 128686 135959 131811 109184 98071 94360 93751 99632 99081 102711 87937 86311 99974 107754 98518
13087 98518 96111 107867 105230 103220 95044 92402 87333 103102 116599 128446 138947 142292 114813
13074A14813P569M944m648l391j0348j0085n577N064j405l6711k036J3047K0232
13061I1468J7327J9159K569j1984j5390j1435j7141r858J1147J957K1747n77j9252
13048G9737r799k0465J3629M6446J3225k3001k3157p973J3552j7408N451J2920
13036H3157r286j6356k0610J9611N2041n834j9765M976K5476r94k117k1750m3775
13023D4774M384L8499n573k0640K6291K2425j2051L79J309j0126j4980m1989k9602
13010C100J5235M2528M0435p636k0510J410J9558J4998O415O410J4495m75k5104
12997A10859k166J3061O196k8770l0890J2087K7058O156L358k1379K0625J5594
12985A31789j815p9P137J349K6605r608Q853P735J5218k3124m3645j8799K7013
$$ plain form
13074 114813 122382 127326 122678 119287 108939 98854 93277 98341 96936 60225 58189 71236 91468
13061 91468 108795 127954 130523 118539 103149 91714 74573 64715 75862 77819 99566 98989 79737
13048 79737 69938 49473 63102 109548 122773 99772 76615 68642 82194 64786 70237 83157
13036 83157 73871 57515 36905 56516 108557 102723 82958 87934 113410 112416 110299 88549 44774
13023 44774 49158 87657 82084 61444 87735 110160 98109 98488 99797 89671 74691 32702 3100
13010 3100 18335 60863 101298 93662 73152 74562 94120 109118 115533 121943 136438 135963 110859
12997 110859 108693 121754 127950 99180 68290 80377 107435 113591 116949 95570 116195 131789
12985 131789 129974 129895 137032 138381 164986 155378 164231 171966 187184 164060 120415 101616 128629
12972A28629J6300q255P790j677J4561P439K0395K4235L5310l079p999n710L0576
12959B58515M2988L2833M3114L9490N3127O3810O7997l2113n0894N2424J3547
12948E84838m3950n2758l8687j9573m5183o2842l5142L578L449m5317p298L863
12936B44978j7893l124M2400J9722K4490K1209K1993L9168N7176P3866J07652
12925F31637J51131R7159k6434q9085r8274j10161p3619p3293m4278l0895m9629
12914B84259l4739J1627k1274j391P650J2691k634J2387k8022j499Q239J2566
12902B59860l860k649K720l941J0147K3667R181N87J9549J9868m616k0559j2982
12889B96972N230j1775j5093j8281J145R082m396L5713Q796k7245m2937j2563
$$ plain form
12972 128629 144929 136674 144464 142787 157348 164787 185182 209417 244727 241648 233649 227939 258515
12959 258515 301503 334336 377450 416940 470067 533877 601874 569761 518867 571291 584838
12948 584838 540888 488130 449443 429870 384687 321845 286703 290281 293730 248413 241115 244978
12936 244978 227085 223961 266361 286083 310573 331782 353775 392943 450119 523985 631637
12925 631637 782768 879927 853493 764408 666134 555973 482354 409061 364783 333888 284259
12914 284259 249520 261147 239873 238482 246132 258823 256189 268576 240554 239055 247294 259860
12902 259860 256000 253351 256071 252130 262277 285944 295125 295712 315261 335129 330513 309954 296972
12889 296972 302202 290427 275334 257053 258198 267280 262884 298597 307393 280148 237211 224648
12877B24648K3448l549K3803M2480J3636P15j6096K1457L4641K8409J8600p968
12865D04224j268l108k3577k4426j0659l382J602k561p017J1540K8183M676L9151
12852D13378O755j5972r155l2012j5724O758Q028J2084Q354j6600l52O296L3065
12839D04903J7119r345J6609J647n501L8962K0961K0515J9686L2011L7019K6673
12827F21259M7288Q8895J24113J02667P6054o945n4988q4694q3192m1462m371
12816G84624l5342l624j6598k4707k0267k2065P721o336r248o008J3253L803k5973
12803F39233l5910r253L380K1663K2793M5706N7458L5230M3186K1503L6823N7105
12791I38917M5804M7940P7093Q4006R3864J61949J49349P0495l4384n2281m7094
$$ plain form
12877 224648 248096 244547 268350 310830 324466 325181 309085 330542 365183 393592 412192 404224
12865 404224 402956 399848 376271 351845 341186 337804 339406 336845 329828 341368 369551 374227 413378
12852 413378 420133 404161 395006 362994 347270 354028 362056 374140 382494 365894 365542 371838 404903
12839 404903 422022 412677 429286 430933 425432 464394 485355 505870 525556 557567 594586 621259
12827 621259 668547 757442 881555 984222 1060276 1053331 998343 913649 830457 788995 784624
12816 784624 749282 745658 729060 704353 684086 662021 669742 663406 654158 648150 661403 665206 639233
12803 639233 603323 594070 597450 619113 641906 687612 745070 780300 823486 844989 881812 938917
12791 938917 984721 1032661 1109754 1193760 1287624 1449573 1598922 1669417 1635033 1582752 1535658
12780A535658n1085k3820k9331p13J70L2850N2272K9312K5478R802M5424M5062
12768A671079J3430J5634J8516P0283N5349M3133N3801L5649J4153L6357M6175
12757B073559P6165Q6692O0347P1199P4215M1612K4686M9018K9489J0646N9264
12746B656892P5708M7605N4245Q5888J13577Q6886Q6257Q1852N9751J08527J95097
12735C652285K34447K13174K24130K49134K62146L03481L38240L90965L96391
12726F264393L78972L60100L65721M35711N63488O90284Q34667R80221J149651
12717A2023208J418869J766138K251256K978273L819122M410937M366876L949387
12709C6984066L972338M740358O493734R264057J3193227J8156453K4525861L3343933
$$ plain form
12780 1535658 1484573 1460753 1431422 1430709 1430879 1463729 1516001 1545313 1570791 1580593 1626017 1671079
12768 1671079 1684509 1700143 1718659 1788942 1844291 1887424 1941225 1976874 1991027 2027384 2073559
12757 2073559 2149724 2236416 2296763 2367962 2442177 2483789 2508475 2557493 2586982 2597628 2656892
12746 2656892 2732600 2780205 2834450 2920338 3033915 3120801 3207058 3288910 3348661 3457188 3652285
12735 3652285 3886732 4099906 4324036 4573170 4835316 5138797 5477037 5868002 6264393
12726 6264393 6643365 7003465 7369186 7804897 8368385 9058669 9893336 10873557 12023208
12717 12023208 13442077 15208215 17459471 20437744 24256866 28667803 33034679 36984066
12709 36984066 40956404 45696762 52190496 61454553 74647780 92804233 117330094 150674027
12701A50674027M7043602O7530180R0241650R5143904N4051166j6923498n9065175
12694D28695856o9815871p0031062o2748688m9709330l6592853k6473219j9271498
12687I4053335j4162503j0643408q125192o447418n365994m501358l768203l147009
12679C7892250k660956k270486j938245j649731j449841j247894j065484q62020
12671B4747593p42591o52905n80659n15242m60599l41657k07306o7636L6865J59004
12661B1374867K69149K70844M3322l40816o46301q39526q96108r21030q52242
12652A7462159q04756q03486p71252p36101o78248o21735o02184n67051n51464
12643A1325882n61994n51109n54425n30323n04354m80626m43321l75669l13301
$$ plain form
12701 150674027 197717629 265247809 355489459 450633363 504684529 487761031 428695856
12694 428695856 358879985 288848923 226100235 176390905 139798052 113324833 94053335
12687 94053335 79890832 69247424 61122232 54674814 49308820 44807462 41039259 37892250
12679 37892250 35231294 32960808 31022563 29372832 27922991 26675097 25609613 24747593
12671 24747593 24005002 23352097 22771438 22256196 21795597 21453940 21246634 21178998 21215863 21374867
12661 21374867 21644016 21914860 21958182 21617366 20971065 20131539 19235431 18314401 17462159
12652 17462159 16657403 15853917 15082665 14346564 13668316 13046581 12444397 11877346 11325882
12643 11325882 10763888 10212779 9658354 9128031 8623677 8143051 7699730 7324061 7010760
12634G010760l00998l18318l19350l08261k74507k32648k43689k38647k06077
12625D568265j94849j86261j65796j64311j58117j52751j59873j40124j05992
12616C140191j06404j09070j27285q6408q5234r9911n7307p8428q1800p2565o7770
12605B168009l7959m3412l8643l7815m9311l3943k3045m0981n1057p1587p5884
12594A664372m9270m1862n8326q9133r0600n0700k6407l3504k7735k7002n2896
12583A116937m3524k4J9435L752L5978L3007N4044L4747k480l2413j62969l07989
12571G48501k54685j48470j00894l1662P6948J13460Q6506N2670K1074k1530m4868
12560D97050j3418Q639K6099j6011j8497l3338k9079o778J0944j4953m8756q949
$$ plain form
12634 7010760 6709762 6391444 6072094 5763833 5489326 5256678 5012989 4774342 4568265
12625 4568265 4373416 4187155 4021359 3857048 3698931 3546180 3386307 3246183 3140191
12616 3140191 3033787 2924717 2797432 2711024 2625790 2525879 2468572 2390144 2308344 2235779 2168009
12605 2168009 2130050 2086638 2047995 2010180 1960869 1926926 1903881 1862900 1811843 1740256 1664372
12594 1664372 1615102 1573240 1514914 1425781 1335181 1284481 1258074 1224570 1196835 1169833 1116937
12583 1116937 1073413 1073389 1092824 1096576 1132554 1165561 1219605 1254352 1251872 1219459 1056490 748501
12571 748501 493816 345346 244452 212790 289738 403198 489704 542374 563448 541918 497050
12560 497050 483632 492271 518370 502359 483862 450524 421445 414667 425611 410658 361902 352953
12548C52953J2973K2349j3311j3921R00k3110k3107q46J3760J2199M0218L2971
12536D14028R652J1412k790O829L8912P191J5289K1308J8295L2553J0329k069
12524E80939J3703L8745M0280L9246J9072K8076L6257J8531K7698j4088j7714
12513H10745l3940o460m686J3940j7246J7184j0420k5338J987j3857P61k0769
12501G11901j7905l6393j3034p046j0352j845l0108k1292Q669N646J8815J3062
12489F20118Q29j3457j147L625L4715J1714N108K3064N596k9559R602N988o960
12476F69236j4633j594J5169J0679M941K0278K6085k2350j8069k1212m0011l7371
12464E91148j8182q409k715m118J2730l0109N52J8105j6877j5633K0035j0131
$$ plain form
12548 352953 365926 388275 374964 361043 361943 338833 315726 314880 328640 340839 381057 414028
12536 414028 423680 435092 432302 439131 478043 485234 500523 521831 540126 572679 583008 580939
12524 580939 594642 633387 673667 712913 731985 760061 796318 814849 842547 828459 810745
12513 810745 776805 770345 765659 779599 762353 779537 769117 743779 745766 731909 732670 711901
12501 711901 693996 657603 644569 637523 627171 625326 595218 573926 582595 588241 607056 620118
12489 620118 620947 607490 606343 609968 644683 656397 661505 684569 690165 660606 670208 676196 669236
12476 669236 654603 653009 668178 678857 683798 704076 730161 707811 689742 668530 628519 591148
12464 591148 572966 564557 561842 557724 570454 540345 540897 559002 542125 526492 546527 536396
12452E36396o1676J3410M7171L4297J694l7433k1866K2114J1040k1267l406r017
12440E11457m077k7015J4892K6749K2397J0004l429j997L0918l74k1272M962K3890
12427E87105Q58n2796L605M656N859l747l280P920J2687J5153k6349l6781j4425
12414E00465j2090N265K7288P263K590N910J0875K8340J7093P311K1935N538k458
12401F25325J1397J3699J4318J4575K4495J9892m683J0808Q075K7266K8587K6791
12389H20545P6448O0617J5035L6570K7319R815J5984K7083m1879m5913j0731K6871
12377A017764L1636p050O88K9552M0946N595k2221k3421J8237J8335K6075k913
12365A133223k05K8095L6667K5394M7929K3878K5509K7655K5861J3440r302K9974
$$ plain form
12452 536396 474720 488130 535301 569598 571292 533859 511993 534107 545147 523880 520474 511457
12440 511457 507380 480365 495257 522006 544403 554407 550978 548981 579899 579525 558253 563215 587105
12427 587105 587963 535167 538772 543428 549287 545540 542260 550180 562867 578020 551671 514890 500465
12414 500465 488375 493640 520928 528191 530781 536691 547566 575906 592999 600310 622245 627783 625325
12401 625325 636722 650421 664739 679314 703809 723701 719018 729826 737901 765167 793754 820545
12389 820545 896993 957610 972645 1009215 1036534 1046349 1062333 1089416 1047537 1001624 990893 1017764
12377 1017764 1049400 1042350 1043038 1072590 1113536 1119131 1096910 1073489 1091726 1110061 1136136 1133223
12365 1133223 1133018 1161113 1197780 1223174 1271103 1294981 1320490 1348145 1374006 1387446 1378144 1408118
12353A408118M3322M8731M9151K0268M1321M4217P4559O1689P0659R5475Q6615
12342B044125R2841O4902M4702R3346O3276O4661P5123Q1770J03930J46865J41477
12331C017018J21783J89966K12950J72126J85631K59107L36387M01277M60419
12322E356664N48164O46372P63842R05420J087032J339515J602247J961349K444384
12313A6654989L042383L793592M672088N549139O064105N979771N060194L411057
12305E4227318J188453j221342l269045m645864n254206n152686m665189l946489
12297B7260950l213125k546563j986456j552510j222371r99444q16846o60375
12289A4263260m63028l08681k08163r0493J8361J38068K21525M01487N56503P33270
$$ plain form
12353 1408118 1451440 1500171 1549322 1569590 1610911 1655128 1729687 1791376 1862035 1957510 2044125
12342 2044125 2136966 2201868 2246570 2339916 2403192 2467853 2542976 2624746 2728676 2875541 3017018
12331 3017018 3138801 3328767 3541717 3713843 3899474 4158581 4494968 4896245 5356664
12322 5356664 5904828 6551200 7315042 8220462 9307494 10647009 12249256 14210605 16654989
12313 16654989 19697372 23490964 28163052 33712191 39776296 45756067 50816261 54227318
12305 54227318 55415771 54194429 50925384 46279520 41025314 35872628 31207439 27260950
12297 27260950 24047825 21501262 19514806 17962296 16739925 15740481 14923635 14263260
12289 14263260 13800232 13491551 13283388 13192895 13211256 13349324 13570849 13972336 14528839 15262109
12279A5262109R48874J199955J436263J799281K171193K592757L157886L846444
12271C2414762M713165N891644P399857R297335J1717154J4540358J7561487K0091594
12263A23627356K0768534J8196595J1805078K775628o478854j3616138j7667705
12256A39410494j8745472j7697130j5469946j2859766j0313604q138684o422396
12249D9763496n103574m099552l328241k750351k280858j895126j546428j255393
12241B7503973r91255p26518m74898k30254j7306K42253N19082Q40157J180712
12232B7845946J606762K068023K530377K883809L131844L648698M534488N777766
12224E4027713P381813R393210J1901404J4877143J7959024K0389383K0684378
$$ plain form
12279 15262109 16210983 17410938 18847201 20646482 22817675 25410432 28568318 32414762
12271 32414762 37127927 43019571 50419428 59716763 71433917 85974275 103535762 123627356
12263 123627356 144395890 162592485 174397563 177173191 170694337 157078199 139410494
12256 139410494 120665022 102967892 87497946 74638180 64324576 56185892 49763496
12249 49763496 44659922 40560370 37232129 34481778 32200920 30305794 28759366 27503973
12241 27503973 26512718 25786200 25311302 25081048 25063742 25305995 25825077 26665234 27845946
12232 27845946 29452708 31520731 34051108 36934917 40066761 43715459 48249947 54027713
12224 54027713 61409526 70802736 82704140 97581283 115540307 135929690 156614068
12217A56614068J7497177J0427547R47122q301743j5195080j8845603j9586331
12210A23557157j8288468j5887561j3145847j0575538q404426o666686n325156
12203D5263475m353150l625016l040670k579188k182170j883644j585434j379332
12195B4634871j178626r44368p20216o01883m46897k78940j64637k4507J32530
12186B0407327L12651N13345P11461R61916J276131J653702K092507K617497L288754
12177C3835291M035283M872455N651219N993757N548684M216175K098744m20681
12169F5830927k888411m837750n951839o276359o012184n334298m526561l736281
12161B6267244l058163k482973k041637j674047j431518j231715j055209r17966
$$ plain form
12217 156614068 174111245 184538792 185485914 177184171 161989091 143143488 123557157
12210 123557157 105268689 89381128 76235281 65659743 57255317 50588631 45263475
12203 45263475 40910325 37285309 34244639 31665451 29483281 27599637 26014203 24634871
12195 24634871 23456245 22511877 21791661 21189778 20742881 20463941 20299304 20274797 20407327
12186 20407327 20719978 21233323 21944784 22906700 24182831 25836533 27929040 30546537 33835291
12177 33835291 37870574 42743029 48394248 54388005 59936689 64152864 66251608 65830927
12169 65830927 62942516 58104766 52152927 45876568 39864384 34530086 30003525 26267244
12161 26267244 23209081 20726108 18684471 17010424 15578906 14347191 13291982 12374016
12153A2374016q04298o82065o04068n58285m72181m45765l99021l23035k89256
12144G796042k77705k29590k03334k05668j66978j57403j66280j83449j66691
12135F038944j82379j88107j63302j55579j76937j59930j42839j38768j58065
12126D573038j68028j98071j85502j78311j94649j49199j47917j33384j06383
12117C111594j12069j09043j08666j15936r6440j11487r1597q1988j03596q7019
12107B093753r4035q0057o1235p7891n6331l0523k0427n463q230j1439l0560k4669
12095A592893l7265m4915o1330l9698o0888j04427j08616r6395j3554j1745k5314
12084I88746k914J5000r291j5481J4801r136m1330j6020j2818k3657j9450m5181
$$ plain form
12153 12374016 11569718 10887653 10283585 9725300 9253119 8807354 8408333 8085298 7796042
12144 7796042 7518337 7288747 7085413 6879745 6712767 6555364 6389084 6205635 6038944
12135 6038944 5856565 5668458 5505156 5349577 5172640 5012710 4869871 4731103 4573038
12126 4573038 4405010 4206939 4021437 3843126 3648477 3499278 3351361 3217977 3111594
12117 3111594 2999525 2890482 2781816 2665880 2569440 2457953 2366356 2284368 2180772 2093753
12107 2093753 1999718 1919661 1858426 1780535 1724204 1693681 1673254 1667791 1659561 1648122 1617562 1592893
12095 1592893 1555628 1510713 1449383 1409685 1348797 1244370 1135754 1039359 1025805 1014060 988746
12084 988746 985832 1000832 991541 976060 990861 981725 940395 924375 911557 887900 868450 823269
12072H23269j7060j1190j5051j8960j7995j6021K726j0640k0755j7967J0181k4800
12060F65737l2926r915K9510j9064J6376J0328p065J9159K0720K5837K74l1681
12048F87290r814r205l6242j4932j355J240J2506K9170J70j0682k634k6574l2771
12035E86167L223L5097K3194K2677R919o394n9139l9665j6058j3899j3669j845
12023E29608k3067j0675j0230Q995K5494K0068J2198m333j4238k7874r766r700
12011D86480J284j307J6337j7067j1281J0165K244n043O195Q248k4221j7542k6569
11998D27923J3914M362q742Q646n939k2342Q272K468J5818j0002m742k068Q897
11985D36465l357K96j315O826R050j0269K417J015K1572Q568j8111K4723M0403
$$ plain form
12072 823269 806209 795019 779968 761008 743013 726992 729718 719078 698323 680356 690537 665737
12060 665737 632811 622896 652406 633342 649718 660046 652981 672140 692860 718697 718971 687290
12048 687290 677476 668271 632029 617097 615742 616982 629488 658658 658828 648146 645512 618938 586167
12035 586167 589390 624487 647681 670358 680277 673883 614744 575079 559021 545122 531453 529608
12023 529608 506541 495866 485636 494631 520125 540193 552391 548058 533820 505946 496180 486480
12011 486480 487764 486457 502794 485727 474446 484611 486855 481812 488007 496255 472034 454492 427923
11998 427923 441837 446199 437457 446103 440164 417822 426094 428562 444380 434378 429636 427568 436465
11985 436465 433108 433404 432089 438915 447965 437696 440113 441128 462700 471268 453157 477880 518283
11972E18283J0846K4835K8299l2118k8617l8226j3802l3657j422k0944k5326J8017
11960D06168J6906j302r381j630J9574O221j6471r557j2513J0827j8739j4898
11948C75205n757R222L701l85N324o821k7957j640L4915J6811J2114L6507J6717
11935D67956p300Q437m306k0065K0564j289j0721L0072L5732K4413j3900L022
11923E32615j3420l9180m2257m1979l0330k277j4072k6073K13L9541K0685Q745
11911C92211O874k1570L900j4318k6915r63r460R17k1159j2725Q272J9710J2047
11898C36821j9010J1468O38p993K0711M9222L1084M61j3j4502J0029o929j1699
11885D00288O757O368R110Q813J8831j6048l006J425l1285l3675J4609J4469K4376
$$ plain form
11972 518283 529129 553964 582263 550145 521528 483302 469500 435843 434421 413477 388151 406168
11960 406168 423074 421772 412391 410761 430335 436556 420085 410528 398015 408842 390103 375205
11948 375205 369448 378670 382371 381986 387310 380489 352532 350892 385807 402618 414732 451239 467956
11935 467956 460656 469093 464787 444722 465286 463997 453276 483348 519080 543493 529593 532615
11923 532615 519195 480015 437758 395779 365449 363172 349100 323027 323240 362781 383466 392211
11911 392211 399085 377515 381415 367097 340182 339219 329759 330676 309517 296792 305064 324774 336821
11898 336821 317811 329279 329917 321924 342635 391857 422941 423402 423389 408887 418916 411987 400288
11885 400288 407045 413413 422523 431336 450167 434119 431113 432538 401253 367578 382187 396656 421032
11872D21032N6669K8114M212J952j603j0374l8357o2036l6809j423p307J0461
11860C64531o46j8479k832l3027j6452k1139k063K6438J2269n239K540K3434L1523
11847C60858J1831r499k2537k7753M563R777l544K9257K9706J0660n971J0943
11835C98291j855K8225K9250L6662Q3090J00135R1108Q9804O6950N2470L7694
11824A011824L820l723p6317q7791p2270n7884o4025m6014n0142n1548L441K044
11812E11415k6281l3276l9829k260P930j2633j6283k5577l2761j0900j1210R506
11800C17841J5890M80l5625j9449J4171K4832K6350L1637J6618k797P821N8879
11788D56648O0507L3846N7231Q8477J02501J14641Q6548O2142J4264p340j1284
$$ plain form
11872 421032 477701 505815 510027 511979 510376 500002 461645 399609 362800 361377 354070 364531
11860 364531 363885 345406 342574 309547 293095 271956 269893 296331 308600 303361 305901 329335 360858
11847 360858 372689 363190 340653 312900 317463 327240 323696 352953 382659 393319 387348 398291
11835 398291 396436 424661 453911 490573 573663 673798 764906 854710 921660 974130 1011824
11824 1011824 1015644 1011921 935604 847813 775543 717659 653634 607620 557478 505930 509371 511415
11812 511415 485134 451858 412029 409769 417699 405066 388783 363206 330445 319545 308335 317841
11800 317841 333731 334211 298586 279137 293308 318140 344490 376127 392745 389948 397769 456648
11788 456648 517155 551001 608232 696709 799210 913851 1000399 1062541 1076805 1069465 1058181
11777A058181p4155j07420j09314p3810r3050r5729l2135m852m0803k3424j5188
11766C88301p760j1283q936P049j8159l418l047L96j4828l1568j6265p239l412
11753B69831r102K809J5960K033j5767l0409o300L4750m010N800N8374K5552K0590
11740C70111L3032L2803J1167j4153O312J1309M598q826l2058m1089l3801j4060
11728C25345r23M402l6407m5468p638K8021J0838j0295l3783r404J004K914M157
11715B32763J0591o466P35o516k2945k2646j5556K2466k4546k0558J593j6633
11703A32282J0367K701m435K47j3783n264P417j1509K221J0056K5231M801J4208
11690A74540k8596j182p904K281n49J7436R433j9553r560O635N409K1239O984
$$ plain form
11777 1058181 984026 876606 767292 693482 600432 504703 472568 467716 426913 403489 388301
11766 388301 380541 369258 360322 367371 349212 345794 342747 343143 328315 296747 280482 273243 269831
11753 269831 260729 263538 279498 281531 265764 235355 229055 263805 259795 265595 323969 349521 370111
11740 370111 403143 435946 447113 432960 439272 450581 455179 446353 414295 373206 339405 325345
11728 325345 324422 328824 292417 246949 239311 267332 278170 267875 234092 224688 225692 228606 232763
11715 232763 243354 236888 237623 231107 208162 185516 169960 192426 167880 147322 148915 132282
11703 132282 142649 145350 140915 141162 127379 122115 129532 118023 120244 130300 155531 160332 174540
11690 174540 145944 144762 136858 139139 138590 156026 165459 145906 136346 142981 148390 169629 176613
11677A76613l7114m213L0O373J0045j1550k0143j5308J4658P521O085P220l843
11664A36374k2788K1315M860J151P152K4887l490j3373k7336r265M311P676K8274
11651A59748O82k0778j6637K0603L285O337J2541m2204m6772m478L2751K0230
11639A25308J0649J5559K7239j3173j6641l937L6492J9723K853K1589M4561M8115
11627C18337J3633L84R754q683J4008K2002j6572J3683J3950L0848O9257N4642
11615E35243Q6764J12874J35665J87181K34638K99945L58990M68043O38037Q67283
11605C924663J219627J810966K430764K592529J607956k89747j535342j923215
11597I838201j951080j722464j351362j002524o85455m77391l97601l21871k48538
$$ plain form
11677 176613 139499 135286 135316 141689 151734 140184 120041 104733 119391 126912 132997 140217 136374
11664 136374 113586 134901 139761 140912 148064 172951 169461 156088 128752 119487 123798 131474 159748
11651 159748 160430 139652 123015 143618 146903 153240 165781 123577 76805 72327 105078 125308
11639 125308 135957 151516 178755 165582 148941 145004 181496 201219 204072 225661 270222 318337
11627 318337 331970 332354 342108 333425 347433 369435 352863 366546 380496 411344 480601 535243
11615 535243 622007 734881 870546 1057727 1292365 1592310 1951300 2419343 3057380 3924663
11605 3924663 5144290 6955256 9386020 11978549 13586505 13296758 11761416 9838201
11597 9838201 7887121 6164657 4813295 3810771 3125316 2647925 2250324 1928453 1679915
11588A679915k13155j43261j02311p8619o6018m0713q9163n8437j1180l8413n3656
11577G84989n1066l4453k6199l4211m1606k6333K5674K1992O182K6958j8473l4567
11565E98887L62L4079J0229j2536m2867m7575o841M020j1737l8904n4992m5155
11553C86970O68j3521j055j1571l1507l0897M360M167j6146l07k0764k7553j5411
11540B27433l1500j3638K7954O101j487k0664j0430R817o542L215o77O357k8909
11527A67030k6837j3231j2297J4343P555o227r429q903r852J2192J9729K4173
11515A58246j2909j4304l135j278K2121p261Q241m578K8963M4500N0113M3479
11503C12198p325k1197l6366m8685k6486n278r525k5689l1712l8970L442K4549
$$ plain form
11588 1679915 1466760 1323499 1221188 1142569 1076551 1035838 946675 888238 877058 838645 784989
11577 784989 733923 699470 673271 639060 597454 571121 596795 618787 624969 651927 633454 598887
11565 598887 599249 633328 643557 631021 588154 540579 533738 537758 526021 487117 432125 386970
11553 386970 387638 374117 373062 361491 329984 299087 303447 307614 291468 291161 270397 242844 227433
11540 227433 195933 182295 210249 216350 214863 194199 183769 193586 187044 190259 189582 195939 167030
11527 167030 140193 126962 114665 129008 136563 130336 120907 112004 102152 114344 134073 158246
11515 158246 145337 131033 127898 126620 148741 141480 149721 145143 174106 218606 268719 312198
11503 312198 304873 283676 247310 198625 172139 166861 157336 131647 99935 60965 64407 88956
11491H8956j4772j8024K095j3196J7402k928m09O233j1498q342J565o668J6101
11478E6515J4034j3741L036k6992o406J479R004j0621L309k017q022k4929j0453
11465a5804J8214J8521m163J6140N612j0613r392m448N416J6138k139j9009O094
11452B0567N452k9989J4117l410o533o56J6098k13L66N517J2569K1071k683N346
11438E7619N453k5121j1237o984k5193o707N121k606P071P908K4927J5510j5159
11425C0602o951K158Q876l08p097j6095j2545L689r057N368J7249j9360j2542
11412a6013J0612q448q366M2309J3500P052k2649l5333J8378J0246L1865J8611
11400F1764J465k7725j4749J4642J6015l332k7761l864j5214q635J3615J4452
$$ plain form
11491 88956 74184 56160 58255 45059 62461 59533 59124 65357 53859 45517 47082 40414 56515
11478 56515 70549 56808 59844 32852 26446 27925 36929 26308 29617 27600 19578 -5351 -15804
11465 -15804 2410 20931 16768 32908 38520 27907 18515 14067 19483 35621 33482 14473 20567
11452 20567 26019 -3970 10147 6737 204 -452 15646 15433 15799 21316 33885 54956 52273 57619
11438 57619 63072 37951 26714 19730 -5463 -12170 -7049 -9655 -2584 5324 30251 45761 30602
11425 30602 23651 25809 34685 34377 27280 11185 -1360 2329 -6728 -1360 15889 -3471 -16013
11412 -16013 -5401 -13849 -22215 20094 33594 40646 17997 -17336 1042 11288 43153 61764
11400 61764 63229 35504 20755 35397 51412 48080 20319 16455 1241 -7394 6221 20673
11388B0673m0474o018M0208p247J3389J6501l3578l4760J9888R727p487J959N2419
11375D5200J1312j8449j668j7442m779N000J0155j3319l848p904l7565q290L3651
11362g946O452j936K5814J0648K1303q69k586k3193j2301j3988K1692k7548j7960
11349b2418J625K9308J2904l525K847K9430J2011k187j6563l5289O478Q531M788
11336B7940k5019M654L5921J8584q440k5980n219L7782K0364k1905k0228L034
11324D1488p730K143J7117J6943n380r748k7452j5883r23P256J7519R913j5245
11311C0018l0683j3665l195K5199L3384K7179J2863K785O886r594j3703l2700
11299C4774m564J6342j2673k4325L8935J2692J8117J1686j509k0234p765L0485
$$ plain form
11388 20673 -19801 -25819 14389 7142 20531 37032 3454 -31306 -11418 -1691 -9178 -7219 45200
11375 45200 56512 38063 36395 18953 14174 19174 29329 16010 12162 4258 -33307 -41597 -7946
11362 -7946 -1494 -3430 22384 33032 54335 53466 50880 27687 15386 1398 23090 -4458 -22418
11349 -22418 -20793 8515 21419 17894 20741 50171 62182 59995 43432 8143 14621 23152 27940
11336 27940 2921 7575 43496 62080 53640 27660 22441 60223 80587 58682 38454 41488
11324 41488 33758 35901 53018 69961 64581 54833 27381 11498 10575 17831 35350 45263 30018
11311 30018 -665 -14330 -17525 7674 41058 68237 81100 83885 90771 81177 67474 34774
11299 34774 30210 46552 33879 9554 48489 61181 79298 90984 89475 69241 61476 91961
11287I1961O1173L2372J7898K3289N8998O5715J17131J51308J89270K67415L59418
11276A435948L66813K78855J65264K7834j22552k81338l20558k85080k53270k14141
11266G97775j57009r8197j12154p2005n237k0233l1549m6233p2175j6954J3949
11255A79978P060o813l0832l4993j0586K1511j2937j2215j9859j1621j1783O038
11243F2948R216J7690P360k7874k2856j5683M611K5236L4860L8802l3005j8884
11231H2421P611N235k900k0872m640J5052k924j7019k64K066j6875p168J4712
11218E4435n344j9859k1860r084l2095N469M3686J258J0853P709j6213j2427P936
11205A4464j1031J5411J0688J9640J0150k3927j495m29k784l0753l6549K7133
$$ plain form
11287 91961 153134 185506 203404 226693 285691 351406 468537 619845 809115 1076530 1435948
11276 1435948 1802761 2081616 2246880 2274714 2152162 1870824 1550266 1265186 1011916 797775
11266 797775 640766 542569 430415 358410 353173 332940 301391 255158 182983 166029 179978
11255 179978 187038 180225 149393 114400 103814 125325 112388 100173 80314 68693 56910 62948
11243 62948 72164 89854 97214 69340 46484 30801 35412 60648 95508 134310 101305 82421
11231 82421 90032 95267 92367 71495 66855 81907 78983 61964 61700 63766 46891 39723 54435
11218 54435 49091 29232 7372 -1712 -33807 -28338 15348 16606 27459 35168 18955 6528 14464
11205 14464 3433 18844 29532 49172 59322 35395 33900 33471 30687 -66 -36615 -9482
11193i482K5386n456k6963P044K4161m14j29j4304j080K1303N250M75j516P265
11179C1540J6735P307j7209K3004K3516k078J2354M1287N8304L6804K6800N8082
11167C16446R6957J40112J92593K71954L55815L39995K12270P2333N9562N0090
11157B108127o5595k46657l05759l03585k69633j86420j25306j10193r6619o7792
11147C30568k4781k3412k4763j766l2465j3933M049l5937k6385k5238l139K2769
11135A45567k3394m1293N104O052k1484R026j2893J2459J3697O856l5708j6141
11123D7848J7582J8542K1469K5305j9533j7637n753k2344j8118N496K4855q805
11111F8907n087q176r322J3779k5930k1803j5126K6692R063M773o248k0637N670
$$ plain form
11193 -9482 15904 10448 -16515 -9471 14690 14276 14147 -157 -1237 20066 25316 25791 24275 31540
11179 31540 48275 55582 38373 61377 84893 82815 95169 136456 194760 231564 258364 316446
11167 316446 413403 553515 746108 1018062 1373877 1713872 1926142 1998475 2058037 2108127
11157 2108127 2042532 1795875 1490116 1186531 916898 730478 605172 494979 398360 330568
11147 330568 305787 282375 257612 255846 223381 209448 213497 177560 151175 125937 122798 145567
11135 145567 122173 80880 85984 92036 70552 79578 66685 79144 92841 99697 63989 47848
11123 47848 65430 83972 105441 130746 111213 93576 87823 65479 47361 52857 77712 68907
11111 68907 63820 55644 46322 60101 34171 12368 -2758 23934 32997 37770 31522 10885 16555
11098A6555J4706k2985J861m223k160R140j9538j7651L5681Q332j941M462J0525
11085C2764K7914j9007m1136j4060L6238j3180j3729j563J602K4850J1854j1994
11073B0553J4315l3973q962K2580k577j0959j845P639o654J6054K5386j1722l0459
11060f24k9362n135R920J1966L2636j7754j3846q340l782p442K3034P458Q347
11047G076R307k2385k0789j2811K1654L120J2445K0136m572j3492M114k1290Q05
11034a6682L7697L6288l4833r747j2660k5894J7395P915L574K3966J2799j2143
11022B7675J1431J2268k0102j878J8517q027j3921K604K2391J4651k1185l0024
11010A4400k5476m316K02K3450J5284p117k9336j2333J5064M906j1582j294j5183
$$ plain form
11098 16555 31261 8276 10137 5914 3754 12894 -6644 -24295 11386 19718 17777 22239 32764
11085 32764 60678 41671 535 -13525 22713 9533 -4196 -5759 -4157 20693 32547 20553
11073 20553 34868 895 -8067 14513 11936 977 -868 6771 117 16171 41557 29835 -624
11060 -624 -29986 -35121 -25201 -13235 19401 1647 -12199 -20539 -24321 -31763 -8729 -1271 7076
11047 7076 16383 -6002 -26791 -39602 -17948 -14828 -2383 17753 13181 -311 3803 -17487 -16682
11034 -16682 21015 57303 22470 12723 63 -25831 -8436 -521 3053 27019 39818 27675
11022 27675 39106 51374 31272 29394 47911 39884 25963 28567 50958 65609 44424 14400
11010 14400 -11076 -15392 -15190 8260 23544 16427 -12909 -25242 -10178 -5272 -16854 -18148 -33331
10997c3331K0863J7125j3117k355J1613J284j8580j1356M4476Q260l842j162K9674
10984D9552l906k1117k5065J0766R674M4j9741p903J0451k1372j1350K4141K7436
10971B1610j8820k0711N691J6988L024J0927j5911p394j3618m861j1700J1293
10959b3482L143J4293N122p628J4040j268P966L529K67R574L6083j531j6277j9937
10945B3894l2513j4400O878K734k809m295j8349R823K2878K8798k3974l0837M104
10932b8068J9271N473j5818K697N345j2074j0104p956J0875K2549j9143R251J8058
10919C56L277k1008j2942P816J630p835j4469K1542L4031m323r208J2320k898
10906H289J993n4J8855j4618m0737j9306m474M7163M1002L966N796J7679k6321
$$ plain form
10997 -33331 -12468 4657 -8460 -10815 798 2082 -16498 -27854 16622 24882 21040 19878 49552
10984 49552 45646 24529 -536 10230 19904 19948 207 -7696 2755 -18617 -29967 -5826 21610
10971 21610 2790 -17921 -12230 4758 7782 18709 2798 -4596 -18214 -23075 -34775 -23482
10959 -23482 -20339 -6046 -924 -8552 5488 4220 12186 15715 15982 25556 61639 60108 43831 23894
10945 23894 -8619 -23019 -16141 -13407 -16216 -20511 -38860 -29037 -6159 22639 -1335 -32172 -28068
10932 -28068 -8797 -3324 -19142 -16445 -11100 -23174 -33278 -41234 -30359 -7810 -26953 -17702 356
10919 356 3633 -17375 -30317 -22501 -20871 -28706 -43175 -21633 12398 8075 -1133 11187 8289
10906 8289 10282 10228 29083 14465 -26272 -45578 -50052 -2889 38113 42079 47875 65554 39233
10893C9233l7234n4976M357N2667J4063j3514P629p747n415j1476R645L6128K0369
10880E3729R158l7131J439R292J4173P323k070r597J9175j3379l5437l1421J224
10867a3522J1169J2336Q059p636j4973k6228q043K4465j0109J4402K3365K0922
10855C4207k941n108L557o028j8j9583q972k0645j2007L9241J8480k3901R680
10842E962J5709K3972p014r430p282k1061K0322K0915k3881K4778J3221j6277
10830C9934j2687j1939Q867L0141P006l0861j9941J306J600N414K0285P695Q71
10817D7691J4189J5798p608k7795K762L828j9002l0042K996M875M478K177P353
10804B1700r035l878j650j8729M853K2580K889J8006J4558k5625l6839Q470O060
$$ plain form
10893 39233 1999 -52977 -48620 4047 18110 4596 12225 4478 -937 -12413 -2768 33360 53729
10880 53729 62887 25756 27195 36487 50660 57983 55913 46316 65491 52112 16675 -14746 -13522
10867 -13522 -2353 9983 18042 10406 -4567 -30795 -38838 -14373 -24482 -10080 13285 34207
10855 34207 31266 26158 29715 23687 23669 4086 -4886 -25531 -37538 1703 20183 -3718 5962
10842 5962 21671 45643 38629 29199 21917 856 21178 42093 18212 42990 56211 39934
10830 39934 27247 15308 24175 54316 61322 30461 10520 11826 13426 18840 39125 46820 47691
10817 47691 61880 77678 70070 42275 45037 48865 29863 -179 2817 7692 12170 14347 21700
10804 21700 12665 8787 7137 -11592 -6739 15841 18730 36736 51294 25669 -11170 -2700 3360
10791C360l030j9601j2922J1377M232k026K3910J8261Q59l4422K0859J9083p008
10778B2932k6103j9301O001P619j966R937Q155j5042K286K334Q581J4081J285
10765B0799k5406M026K5683N400k5605j4953J8605L0303K5405J2891J3080j3201
10753G7027k4454R60r6l2982k1084q463J6561O104k4967n607K7360J9881k1258
10740H982p392n332j12j2486J2584k800K9231J0289j3950r557o713J3665J8946
10727C5355K381r231q207k7865k5824O733K6133K0286J854J1356J4364K0997J2435
10714H0767O067O086m302l6479l399j4864k1563J3801J7927J300j2016J1560K1865
10701F6750l5321k6593K1825J203k1331j0304R379N264O75j4622J8694J7684j5461
$$ plain form
10791 3360 330 -19271 -32193 -20816 -16584 -18610 5300 23561 24420 -10002 10857 29940 22932
10778 22932 -3171 -22472 -16471 -8852 -10818 -881 7274 -7768 -5482 -3148 5433 19514 20799
10765 20799 -4607 -581 25102 30502 4897 -10056 8549 38852 64257 77148 90228 77027
10753 77027 52573 53533 53437 20455 -629 -9092 7469 13573 -11394 -17001 10359 30240 8982
10740 8982 1590 -3742 -3854 -16340 -3756 -6556 22675 32964 19014 9457 2744 16409 35355
10727 35355 37736 28505 20298 -7567 -33391 -26658 -525 19761 21615 32971 47335 68332 80767
10714 80767 86834 92920 88618 52139 48740 33876 12313 26114 44041 45341 33325 44885 66750
10701 66750 31429 4836 26661 27864 6533 -3771 5608 10872 11547 -3075 15619 33303 17842
10688A7842J0807J9940J2435l0040n5344o728N124K8592K3004r772l7085J5086
10676f139K8027M108j4661j6291k1228j00L1889N3255j8122m3771j3486j2449
10664b8968j899J5093M8910n696J0938M429j7713j0031n445j4134p531M03k63
10651a1907n888j2187K7748O359K3365J4256j2496l8107j8701O511K0636L642
10639C231j782l217P353M830O693j1567k2475k1930K9270Q309J6944p427j0142
10626a910p860N859J323K3055J70k0044Q177j3931l415J1197K795p214r710J693
10612i815J7703J3973j7461k6230J0613j5753j2575M609K2074J3914J6673K045
10600A9770Q812k2021l6549M141j2205O724P413K1835J1780p189J969K2914Q449
$$ plain form
10688 17842 28649 48589 61024 30984 -24360 -31088 -25964 2628 25632 15860 -21225 -6139
10676 -6139 21888 25996 11335 -4956 -26184 -26284 5605 58860 40738 -3033 -16519 -28968
10664 -28968 -30867 -15774 33136 27440 38378 42807 25094 15063 9618 -4516 -12047 -11644 -11907
10651 -11907 -17795 -29982 -2234 4125 27490 41746 29250 -8857 -27558 -21047 -411 3231
10639 3231 1449 -1768 5585 10415 17108 5541 -16934 -38864 -9594 -1285 15659 8232 -1910
10626 -1910 -9770 -3911 -2588 20467 20637 593 8770 -5161 -8576 2621 5416 -1798 -11508 -9815
10612 -9815 7888 21861 4400 -21830 -11217 -26970 -39545 -34936 -12862 1052 17725 19770
10600 19770 28582 6561 -29988 -25847 -38052 -31328 -23915 -2080 9700 2511 4480 27394 35843
10587C5843j6765r115M310m089j1212j927L891j9372J0857J6500r072J4391K3988
10574C8228j6386j3272l04M618j2903k5372k7927l679L3218K1179L1186m693j1271
10561A2622j2880j5993J4804K904M078J3901J8300q810o703n772k1633K1767k842
10548A3743p832k624j5425M687N467J2717m44L054J4374J4107k7596j9335j5322
10535b0429q242J4628K5900K30l361j4175N82L3072J7185J3756K392k8579k0322
10522A2637j1393J9745J2907j9844l203P234L3109J8685j9970k725O909j7657
10510C6434j6471j4822j2357J4580K1557J4018k6550j8736l9967p004R248j0882
10498e0952K1087K5725n47p140n795n397J5592J3355l1455j6716k0506j7801L5128
$$ plain form
10587 35843 19078 9963 14273 10184 -1028 -2955 936 -18436 -7579 8921 -151 14240 38228
10574 38228 21842 8570 8266 12884 -19 -25391 -53318 -56997 -23779 -2600 28586 23893 12622
10561 12622 -258 -16251 -1447 1457 5535 19436 37736 28926 22223 16451 -5182 16585 13743
10548 13743 5911 3287 -12138 -7451 -1984 10733 10289 13343 27717 41824 14228 -5107 -20429
10535 -20429 -28671 -14043 11857 12087 8726 -5449 -4867 28205 45390 59146 61538 32959 12637
10522 12637 1244 20989 33896 14052 10849 18083 51192 69877 49907 47182 54091 36434
10510 36434 19963 5141 -7216 7364 28921 42939 16389 -2347 -42314 -49318 -40070 -50952
10498 -50952 -29865 -4140 -4687 -11827 -17622 -23019 -7427 5928 -25527 -42243 -62749 -80550 -45422
10485d5422M1164J5364J7905P361j9149j8732j8874R457j1922j0130K4459K0185
10473A1666K315j6656J1607m630K721P368l639n213n53k2810J408m266R61m203
10459b3924P725K5038O625j2388p219J2777k2329o764R129k4890q583K3095L7127
10446A5419K6632j5563l2193P554M7557J8067j8987l0790k5507Q005J5050k2732
10434g488o167L360k637o371j5358J5068J5110J0039j9861kK0691k1216J0637
10421d195K7241J2084K1405M582o899m1554l0776q441J8039l643K5846J4645k1733
10408F601j1509j3612k62M248O417J9613k566k2429l306p821K0741q010r115J6000
10394e010Q70l081r277J175J7462j6736j7978j4995L7483J3513O457l3943N115
$$ plain form
10485 -45422 -4258 11106 29011 36372 17223 -1509 -20383 -10926 -22848 -32978 -8519 11666
10473 11666 13981 -2675 8932 4302 7023 14391 10752 5539 4986 -17824 -16416 -20682 -19721 -23924
10459 -23924 -16199 8839 15464 3076 -4143 8634 -13695 -20459 -11330 -36220 -44803 -21708 15419
10446 15419 42051 26488 -5705 1849 49406 67473 48486 17696 -7811 194 15244 -7488
10434 -7488 -13655 -10295 -12932 -19303 -34661 -19593 -4483 5556 -14305 -14307 6384 -14832 -4195
10421 -4195 23046 35130 56535 61117 54218 12664 -18112 -26553 -8514 -12157 13689 28334 6601
10408 6601 -4908 -18520 -18782 -14534 -8117 11496 8930 -13499 -16805 -24626 -3885 -11895 -21010 -5010
10394 -5010 -4140 -7221 -16498 -15323 2139 -14597 -32575 -47570 -10087 3426 9883 -24060 -18945
10381a8945j6893r860M4382J7793J2848Q133J0392M448q717q947M433q91j5874
10368B2302j9730J5141k916k6321j3669j9919k7348L4862K3210p863j0909k711
10356c5871j9084P046K5617J6180J4045k256j4296J9754J3407L608p334o370j9336
10343d890K246j024j6023k0613J1566J9857j764J313J338j1608K0373l3745L428
10330b9546L477K4014L379j0332p21k5706j2600J5644J5953J3021J3437m54j855
10317G711J1658l09k704O348Q647o882j0082j4947J3225J4816j7950l8089J192
10304b7366J5690l72j5100J6304L148j5220J6764J0339k0198P504J3772j9340
10292a4075j9223j6238l9209n342K7555N628N434J787J0686K8089j7215j588Q989
$$ plain form
10381 -18945 -35838 -45698 -1316 16477 29325 37458 47850 52298 43581 34634 39067 38176 22302
10368 22302 2572 17713 14797 -11524 -25193 -45112 -72460 -37598 -14388 -22251 -33160 -35871
10356 -35871 -54955 -47909 -22292 -6112 7933 5677 -8619 11135 24542 28150 20816 14446 -4890
10343 -4890 -2644 -3668 -19691 -40304 -28738 -8881 -10645 -9332 -7994 -19602 771 -32974 -29546
10330 -29546 -26069 -2055 1324 -9008 -9729 -35435 -48035 -32391 -16438 -3417 10020 9566 7711
10317 7711 19369 19060 16356 22704 31351 24469 14387 -560 12665 27481 9531 -28558 -27366
10304 -27366 -11676 -12048 -27148 -10844 -7696 -22916 -6152 4187 -16011 -8507 5265 -14075
10292 -14075 -33298 -49536 -88745 -94087 -66532 -60904 -55470 -53683 -42997 -14908 -32123 -33711 -24722
10279b4722j0532K543J8503K4425o003j8282j7656p74K7542L0942j8455j1838
10267d307K948l761O779l849M891O428j1495K8799j832k2376r796l213j584J7541
10253E173k845J588j9644O306l13l743O637o281j5208R095j5007K3414J615j737
10239a0950j8742l404p638Q442L9278J3741j7701k6831n526j9m309J6811m656
10226b1504o433o115o772J353J9589J2862J1887L395J2721j0078n222R891Q626
10213B4200q728R15k7844L1133K4091k4110J6830J3094l252l2221J4504j3749
10201A4863j0344J1384K0960j637r934j0676k0618k167k6202q794O646K6301p534
10188a7752k5485J0904J5791O019m7157j7237o08L1231o1k99K1592Q038J1275
$$ plain form
10279 -24722 -35254 -32711 -14208 10217 4214 -14068 -31724 -32498 -4956 25986 7531 -4307
10267 -4307 -1359 -5120 1659 -2190 2701 9129 -2366 26433 24601 2225 -7571 -10784 -12368 5173
10253 5173 2328 3916 -15728 -9422 -9735 -13478 -6841 -13122 -28330 -19235 -34242 -10828 -9213 -10950
10239 -10950 -29692 -33096 -40734 -32292 6986 20727 3026 -23805 -29331 -29350 -33659 -16848 -21504
10226 -21504 -27937 -34052 -40824 -39471 -19882 -7020 4867 8262 20983 10905 5683 15574 24200
10213 24200 15472 16387 -11457 19676 43767 19657 36487 49581 46329 14108 28612 14863
10201 14863 4519 15903 36863 35226 25292 14616 -6002 -8169 -34371 -43165 -36519 -10218 -17752
10188 -17752 -43237 -32333 -16542 -10523 -57680 -74917 -75525 -44294 -44355 -44654 -23062 -15024 -3749
10175c749K1593K4309k0526k5108j7536l807L657L6043J3740j5413j7936J2240
10163G507O587r302j4572J1708j4546l166J4869Q207k115M313r129j2591l361
10150a5591j7176p621K2390p463J4514J8586l520J9994P250m352k5277k1787K844
10137a7209J4267j8509k074K7662K2604k1165J9729K0962k5754l0122l89J3653
10125C655R286M477l2099P792j1920o954J5303J485n556k7542j135J7548J2133
10112a3527K1476l739j0339k7807j7451J0422k688j6157O562L1802l893l0916
10100e6255q786N889L1574L7485K496k5337p240l331L531k0147p804J6992Q715
10087b2218N407J8798k6172r625O654J354J8893R294j0630R165R553n28L679J2399
$$ plain form
10175 -3749 17844 42153 21627 -3481 -21017 -24824 -21167 14876 28616 13203 -4733 7507
10163 7507 14094 4792 -9780 1928 -12618 -15784 -915 7292 5177 9490 361 -12230 -15591
10150 -15591 -32767 -40388 -17998 -25461 -10947 7639 4119 24113 31363 27011 1734 -20053 -17209
10137 -17209 -2942 -21451 -23525 4137 26741 5576 25305 46267 20513 -9609 -9998 3655
10125 3655 12941 17418 -14681 -6889 -18809 -25763 -10460 -8975 -14531 -42073 -43208 -25660 -13527
10112 -13527 7949 4210 -6129 -33936 -51387 -40965 -43653 -59810 -53248 -21446 -25339 -56255
10100 -56255 -65041 -59152 -27578 9907 12403 -12934 -20174 -23505 -19974 -40121 -47925 -30933 -22218
10087 -22218 -16811 1987 -24185 -33810 -27156 -25802 -6909 2385 -8245 920 10473 9945 13624 26023
10073B6023J81J7122N651n115k9728k3683Q766J1432j0146k7788L7198N0058P285
10060F7256j1268k9754l0649J1829p308Q19R664p007K088K1268J3058K6492L4049
10047A00537j5569l3135l1374M105K5567J4037k1385k3903J0935K97r102J7389
10035C8399k2100j9025q015R542J9067k344j1899J7024P527J0262n863j4887j6097
10022A591O463q749N281j5667m103m886Q962p151M0709M705m460q096j6044j3286
10008a4731J403l481Q917p91P330L98O808J220r131k8648o715L250M886n840L1008
9993d117R320j1326J0512K3098K8292l8130l6983l1655J08j913L887L2465N313
9980a1129o98O526j5161J06K9005N088j6753j5103k8564J0379M0945J2043r099
$$ plain form
10073 26023 26204 43326 48977 43862 14134 -9549 -783 10649 503 -27285 9913 59971 67256
10060 67256 55988 26234 -4415 7414 106 925 10589 3582 5670 26938 39996 66488 100537
10047 100537 84968 51833 20459 24564 50131 64168 42783 18880 29815 30112 21010 38399
10035 38399 16299 -2726 -10741 -1199 17868 15524 3625 20649 28176 38438 32575 17688 1591
10022 1591 8054 -695 4586 -11081 -15184 -20070 -11108 -18259 22450 27155 22695 14599 -1445 -14731
10008 -14731 -13328 -16809 -7892 -8683 -1353 -955 5853 7073 -2058 -30706 -37421 -34171 -29285 -35125 -4117
9993 -4117 5203 -6123 4389 27487 55779 17649 -19334 -50989 -50881 -52794 -48907 -16442 -11129
9980 -11129 -11827 -5301 -20462 -20356 8649 13737 -3016 -18119 -46683 -36304 4641 16684 7585
9967G585K352m4611k5488K3206k511q890K1190O586k5297k190K2935K9363P061
9954A1291P902k8619k7978K8419J7941R241K085k9710K86O047J0982k6012m4475
9941f2600K2799N7152j6856j8188K6702R043l2377j6095j2798k5808J2745M2214
9929a4067K9097k3948n5867j5574M5896L3255Q240j1284j474O603k30k6927R500
9916a6780k010j4902p366K6441m91p555L0947J1439k6820r841R453M044n958P168
9902b231J6607r735r239P370J3575K5708j186J3454R479L6875K1707l8970m9670
9889C3744r776R314N57o773J385j2767J3675j4232j889K6136R734J6408J2540
9876G8056K0592L509k1951j8434k5635J4444L350k1145R456J2009P663k5502Q012
$$ plain form
9967 7585 9937 -34674 -60162 -36956 -39467 -48357 -27167 -20581 -45878 -48068 -25133 4230 11291
9954 11291 19193 -9426 -37404 -8985 8956 18197 20282 -9428 -9142 -3095 7887 -18125 -62600
9941 -62600 -39801 17351 495 -17693 9009 18052 -14325 -30420 -43218 -69026 -56281 -14067
9929 -14067 15030 -8918 -64785 -80359 -34463 -1208 7032 -4252 -5726 877 647 -26280 -16780
9916 -16780 -18790 -33692 -41058 -14617 -15108 -22663 8284 19723 -7097 -16938 -7485 -3441 -9399 -2231
9902 -2231 14376 4641 -4598 2772 16347 42055 40869 54323 63802 100677 122384 83414 33744
9889 33744 23968 33282 33839 27066 28451 15684 29359 15127 13238 39374 49108 65516 78056
9876 78056 98648 102157 80206 61772 36137 50581 53931 32786 42242 54251 61914 36412 44424
9863D4424L2915J3874J1223j7213m0953j0563K0115J2925j0775j2158J4746j3199
9851D5361n930J1967N575m431j5278N985K5829j385K561k1748m4291N953K4883
9838C5051R119P635N744p085m2998k1522J9835R393J4253J9502k538J860q691
9825C9558j4n394p786j419q105J6344K701j5096o049N941K4423J2828j1436J4683
9811F1179k2009j3284K2227o387j9885O431j4967P974L089j2683O520L738j3535
9798H408j2855P235Q44J5470N859Q606J868o387k5683k7994N181K3199K8368k0936
9784A1183j8492j0432o574o783o683K6083K3520J7988k5307j0447n044J5762k115
9771B659p397K5263Q188j5763j6921K802J1136J5601j7922m209l530J9646j345
$$ plain form
9863 44424 77339 91213 102436 85223 44270 33707 53822 66747 55972 43814 58560 45361
9851 45361 39431 51398 56973 52542 37264 43249 69078 67693 70254 48506 4215 10168 35051
9838 35051 44170 51805 57549 50464 7466 -14056 5779 15172 29425 48927 46389 48249 39558
9825 39558 39544 34150 26364 24945 16840 33184 35885 20789 14740 20681 45104 57932 46496 61179
9811 61179 39170 25886 48113 41726 21841 28272 13305 21279 24368 11685 18205 21943 8408
9798 8408 -4447 2788 3632 19102 24961 33567 35435 29048 3365 -24629 -19448 3751 32119 11183
9784 11183 -7309 -17741 -24315 -31098 -37781 -11698 11822 29810 4503 -5944 -10988 4774 2659
9771 2659 -4738 20525 28713 12950 -3971 -1169 9967 25568 7646 3437 -93 19553 18208
9758A8208k1727m538R24L351j1309q962J8884J52P623M327J2775j7541q256N156
9744i33J6681N441O665j6651m089q468l361J8613j798j3350j1425j3097K031M99
9730b3242Q313N116J1180j2415l973j691j4069j3414J7877J5340K7442R44j3573
9717C835j2412j3118R310K0383J3659P427J4331j2875k840J0931j3781j6525K1550
9704B9875J5638j9818k0230R232j3622l436j7479N302j653R681K8749L2574J8443
9691G3256J6440j5131j9636j2894k7876j3915k707o126K1301P691p317j0550J0606
9678A3142K6444R175M15k1075l5436Q571K8872L1584J197j740j3869k7339j4352
9665E589m369j7166m65j2674K2993M8046M30p538l816K448P078q176p549o677
$$ plain form
9758 18208 -3519 -8057 -7133 -3782 -15091 -24053 -5169 -5017 2606 6933 19708 2167 -6089 -933
9744 -933 15748 21189 27854 11203 7114 -1354 -4715 13898 12100 -1250 -12675 -25772 -23741 -23242
9730 -23242 -14929 -9813 1367 -11048 -15021 -16712 -30781 -44195 -26318 -10978 16464 17408 3835
9717 3835 -8577 -21695 -12385 7998 21657 29084 43415 30540 27700 38631 24850 8325 29875
9704 29875 45513 25695 5465 14697 1075 -2361 -19840 -14538 -16191 -6510 22239 54813 73256
9691 73256 89696 74565 54929 42035 14159 244 -2463 -8589 12712 20403 13086 2536 13142
9678 13142 39586 48761 49176 28101 -7335 1236 30108 61692 62889 61149 47280 19941 5589
9665 5589 1220 -15946 -16411 -29085 -6092 41954 42384 34846 31030 33478 40556 32380 24831 18154
9651A8154j2034p838J5223K294k1355Q435J3145j960o271O777J1360j6440n468
9638D022J3107J8834k6948k7297J6962J7370k07M641Q766J7371J2262K518q972
9625E2429k0563j0922J2099j480O249k0840j6671R592L0704L50j2329k2961J521
9612G178K3926J5468k9813j0773M644q362j7583L124j2765R21K3199q703j234
9599a0773K3516m708j2962K574K2366K7156k4604k2127j0746J7751O912k750J9063
9586C0668o471L81M649J2919o259j3401K0089J9590j3139O904p116K433K3140
9573G4387q898k3198l6262j9509J1998K5976m023j8063P024R997j3484R271N066
9560B0282M564K1383J632K6998J6364k4413n380L159l9988j8989P57k948J3416
$$ plain form
9651 18154 6120 -1718 13505 15799 -5556 2879 16024 14064 7793 14570 25930 9490 4022
9638 4022 17129 35963 9015 -18282 -1320 16050 15843 20484 29250 46621 58883 61401 52429
9625 52429 31866 20944 33043 31563 37812 16972 301 9893 40597 40947 28618 5657 7178
9612 7178 31104 46572 16759 5986 10630 2268 -15315 -12191 -24956 -24035 -836 -9539 -10773
9599 -10773 12743 8035 -4927 -2353 20013 47169 22565 438 -10308 7443 14355 11605 30668
9586 30668 24197 24578 29227 42146 35887 22486 42575 62165 49026 55930 48814 51247 74387
9573 74387 65489 42291 6029 -13480 -1482 24494 20471 2408 9432 19429 5945 15216 20282
9560 20282 24846 46229 47861 74859 91223 66810 61430 64589 24601 5612 6369 3421 16837
9547A6837R003K7213J8034l5483k4773k051r617J6052J5972J5667q375j228J9275
9534E6526j1369o701k980k3002J3189K6525j4235n285J2108P699R489J6340j4101
9521F4203r465j2567Q914J9017N209j1593j1578Q001k575r238m799K726O305J3891
9507F6451K084j4375J6156J2976M887P513j3624m837j8640j0535K3585L8682L60
9494A10683p711k0527R02p368J6242L2984j1741k0223k408Q845K6286J714j3743
9481A13935m335K6418K2087k7227l476k465J1611K9332J2151M439O335J7484m158
9468B02131j2416N858O579L8230N474p66K1572N342M42n750m979J210L024L427
9454B69378M1656K5268J2097j3092P413J3151K8363M8624N7831J9247N722M361
$$ plain form
9547 16837 25840 53053 71087 35604 10831 8780 -837 15215 31187 46854 38479 37251 56526
9534 56526 45157 38456 35476 12474 25663 52188 37953 32668 44776 52475 61964 78304 64203
9521 64203 54738 42171 51085 70102 75311 63718 52140 60141 57566 48328 43529 46255 52560 66451
9507 66451 68535 54160 70316 83292 88179 95692 82068 77231 58591 48056 71641 110323 110683
9494 110683 102972 82445 83347 75979 92221 125205 113464 93241 90833 99678 125964 127678 113935
9481 113935 109600 136018 158105 130878 127402 124937 136548 165880 178031 182470 188805 206289 202131
9468 202131 189715 195573 202152 240382 245856 245090 266662 272004 272446 266696 261717 262927 265951 269378
9454 269378 311034 336302 348399 335307 342720 355871 384234 432858 490689 509936 515658 520019
9442E20019J1527J8867M0310M3959M6790N6437N4360Q4623Q4702N7606O0506Q6928
9430A166634J07766J18054J26986J49824J51556J86444K42867K65287L33374L53770
9420C202562L86137M11978M71326N50772O03865O29151O34523O31948N13878L67440
9410H403580K21394K0601j94282l43669m74638n34270n56674n63048n61238n32200
9400D885556m46310l91043l77018l36766k63303k08722k07106k21039j71098j40668
9390B122483j44856j17782j15809r1668p2431p3594n4619o3041l3617l2879m1459
9379A280728l1727m5300o2375k5797l7687l5582k7797k5561k5748m2503o1498
9368H59153j8397k8715l9926l5763k8545P323l090L095k1093o0930l2160K71j1729
$$ plain form
9442 520019 531546 550413 590723 634682 681472 737909 792269 876892 961594 1019200 1079706 1166634
9430 1166634 1274400 1392454 1519440 1669264 1820820 2007264 2250131 2515418 2848792 3202562
9420 3202562 3588699 4000677 4472003 5022775 5626640 6255791 6890314 7522262 8036140 8403580
9410 8403580 8624974 8645575 8451293 8107624 7632986 7098716 6542042 5978994 5417756 4885556
9400 4885556 4439246 4048203 3671185 3334419 3071116 2862394 2655288 2434249 2263151 2122483
9390 2122483 1977627 1859845 1744036 1652368 1579937 1506343 1451724 1388683 1355066 1322187 1280728
9379 1280728 1249001 1203701 1141326 1115529 1077842 1042260 1014463 988902 963154 920651 859153
9368 859153 840756 812041 772115 736352 707807 715130 712040 715135 694042 633112 600952 601223 589494
9355E89494r761k2393m7182n2928l5754J3326J0603j8821l5246k3528o133j0816
9343C50861J606j4515J796k3875k3127Q225j2482k4072N187l1296n607R754m245
9330B38210p462l0658j792J5878j84N62j0015j8271j5147M12j5150q783J0591
9317A58191R159N383K5320q676q979n95m4333j5846K1151K800Q181M188m1570
9304A14374J1937j3214k4114j6335N998k606M411K2562q027K373k123J681K0021
9291A16938K1800o09j8051m2409n3794l581K1521j137m326J349N283j928j2107
9278B8949K2274L7944l873k1616k2623J2053P942R592P762j2501j6254q905l118
9265C7626K9942K4119j568k1628l400P384m3623k6551K0349l810K635O335r342
$$ plain form
9355 589494 579733 557340 510158 457230 421476 434802 445405 426584 391338 367810 361677 350861
9343 350861 352467 337952 339748 315873 292746 300971 288489 264417 269604 238308 232701 242455 238210
9330 238210 230748 200090 198298 214176 213992 214554 204539 186268 171121 171533 156383 147600 158191
9317 158191 167350 172733 198053 189377 180398 179803 135470 119624 140775 143575 151756 155944 114374
9304 114374 126311 113097 88983 72648 78646 76040 80451 103013 94986 97359 95236 96917 116938
9291 116938 138738 138129 120078 77669 23875 20294 41815 40678 36352 37701 42984 41056 28949
9278 28949 51223 89167 85294 63678 41055 53108 61050 70642 78404 65903 49649 40744 37626
9265 37626 67568 91687 90119 68491 65091 72475 28852 2301 22650 18840 21475 27810 18468
9252A8468K995L657J6383K2978J2928m871O463K890l067j6811N132n977o973J533
9238E5728J884J7802l484J3452R631j587M865r968j8991o869O097J0140K7143
9225A05843L018k505l3874l2336J2176Q179j9435m766K2650M284J3024k1074M939
9212F0123J186L397K0417l833p514K93L426p428K574L7761n171j7003r559J4013
9198I2682j3435k266J0248j3247J3467J4220j6598m2830l1702L352J1893J1169
9186C6953J5649J8966j90k5223K968P466L2237j4323o529Q369j2783N676Q702
9173G7938Q085o735k5245M278L7286K0918k3890L928J295j2675M3J2280r849J7967
9159A05624k3896m094o506P858M134R332J0997j403m422j0160o747m075k024j0457
$$ plain form
9252 18468 21463 25120 41503 64481 77409 72538 79001 81891 78824 62013 67145 61168 54195 55728
9238 55728 57612 75414 71930 85382 95013 93426 98291 88323 69332 62463 68560 78700 105843
9225 105843 108861 106356 72482 40146 52322 60501 41066 36300 58950 63234 76258 55184 60123
9212 60123 61309 64706 85123 81290 73776 74069 77495 70067 72641 110402 105231 88228 78669 92682
9198 92682 79247 76981 87229 73982 87449 101669 85071 42241 10539 13891 25784 36953
9186 36953 52602 71568 71378 46155 49123 56589 88826 74503 67974 76343 63560 69236 77938
9173 77938 86023 79288 54043 58321 95607 116525 92635 96563 97858 85183 85226 97506 87657 105624
9159 105624 81728 77634 71128 78986 83120 92452 103449 102046 97624 87464 80717 76642 74618 64161
9145F4161j4362j8265j6703J8401L3434K5433j1841k1049l269L638J3956l288
9133G0246l999J4659K3034j5539j0369n309m472J4290L660m239k3085j2069J117
9120D7925l5480j2849K0915J0944M361q483j7197K8230J636R565K2285J9321j1296
9107G9877j4890j9355j9202J1999J3919K3341J9137n901j1562k500J3899j1799
9095G6963O683j7059j2943j7468n896Q826J1452q338j0241r943j094O837J7183
9082D4962Q772j1749O00j6412j8106J9797o469J0812K4835P891k8304j3672J6348
9069C9305n161j2824n737j7228j0793k252M0992L9221J7720J192J765O203j0809
9056H1594J1373p712l686j6518Q250K8701o64l2830o198j2914M497K3012m07R700
$$ plain form
9145 64161 49799 31534 14831 33232 66666 92099 80258 59209 55940 59578 73534 70246
9133 70246 66247 80906 103940 88401 78032 72723 68251 82541 86201 81962 58877 46808 47925
9120 47925 12445 -404 20511 31455 35816 27333 10136 38366 40002 49567 71852 91173 79877
9107 79877 64987 45632 26430 38429 52348 75689 94826 88925 77363 74863 88762 76963
9095 76963 83646 66587 53644 36176 30280 39106 50558 42220 31979 22036 20942 27779 44962
9082 44962 53734 41985 42585 26173 8067 27864 21395 32207 57042 64933 36629 22957 39305
9069 39305 34144 21320 15583 -1645 -12438 -14690 26302 65523 83243 84435 86200 92403 81594
9056 81594 92967 85255 81569 65051 73301 102002 101338 68508 62310 49396 53893 76905 76498 86198
9042H6198j2866l3827j966J7146J1290K4031K2749P430k6099l3644q169J6151
9030F8424J4219j6379j7808j9156J3606L2905K9533r679k1547J0955n204j5025
9018F4844l0373j6066o781K9644K3063o768j7224j693K3156K949p128K1296J1831
9005I0750j6276Q494l779M154J2262O501Q20p742Q302J1795j2358j9205k1234
8992F2484r375L926J6884N515j4046L311J0869k702M180M0409K7122O550J493
8979A56620J667k0255l3127Q010R642j0891j8929o321j0685j6328j5274L0964
8967G5093K6839J4083K7478Q989j879p00M314k36j8878n614J424L3951J4710j6127
8953A63447j3730L0390K5984O3389P6285O8758O7029R7275J01230J64701J89100
$$ plain form
9042 86198 73332 39505 37539 54685 65975 90006 112755 120185 94086 60442 52273 68424
9030 68424 82643 66264 48456 29300 42906 75811 105344 95665 74118 85073 79869 64844
9018 64844 34471 18405 11624 41268 64331 57563 40339 38646 61802 64751 57623 78919 90750
9005 90750 74474 82968 79189 83343 95605 102106 102926 95184 103486 115281 102923 83718 62484
8992 62484 53109 57035 73919 79434 65388 68699 79568 76866 81046 121455 148577 155127 156620
8979 156620 158287 138032 104905 112915 122557 111666 92737 86416 75731 59403 44129 75093
8967 75093 101932 116015 143493 152482 150603 149903 154217 153981 135103 129489 130913 164864 179574 163447
8953 163447 149717 180107 206091 269480 345765 414523 481552 578827 680057 844758 1033858
8942A033858J25806N3032l4914j05710j05034j05583r7089j11689r7249n6591
8932D98837k4237l9228l5547m355j2113k6370l4100k9648k2520k1060j8261k64
8920B31134Q089k4422r005K212K0185J0072K2727K8311K3295L7363J5095Q417
8908C73473K3171J6786M2282R9384J09818J31051J66370J89907K51589L21887
8898A725718L52956K72407J11919j00223k47180k81817k73101k49558k06009j66152
8888I38960j41477j03920q0965m7698m5230k9574l4861k9259k6687J247o690n7325
8876C36521k9852J3180J3440J6664l014l0074k3542P23J8076j8213l3536K9508
8864B89881M1881Q657J9037J2113J8995L6200P0881P4078J28837J60177J49327
$$ plain form
8942 1033858 1159664 1212696 1177782 1072072 967038 861455 764366 652677 555428 498837
8932 498837 474600 435372 399825 395470 383357 356987 322887 293239 270719 249659 231398 231134
8920 231134 239223 214801 205796 208008 228193 238265 260992 289303 312598 349961 365056 373473
8908 373473 396644 413430 455712 555096 664914 795965 962335 1152242 1403831 1725718
8898 1725718 2078674 2351081 2463000 2362777 2115597 1833780 1560679 1311121 1105112 938960
8888 938960 797483 693563 612598 564900 519670 490096 455235 425976 399289 400536 393846 336521
8876 336521 306669 319849 333289 349953 346939 316865 293323 294046 312122 293909 260373 289881
8864 289881 331762 340419 359456 371569 390564 426764 497645 571723 700560 860737 1010064
8853A010064J03007J02974L6719q2132j32432j23619j23593n7582q5724r5071
8843E52611n8708p0918l5996k6797l1050j636l0341q181K453K1470P594j3192
8831C07309l1594k3847j2510m731p071K8060J3851j4263k2532j3978l4134q266
8819A76294J5271K0555j54l7659j1691O270L2110k605J8892J2274l894J4532J0751
8806B50946N431J7465K3499J2680K5806L8683N1308J8818K733J3534j7924j1901
8794D31078m644l3487k8655o9946k3129K521J4216J9184j6226k7695K380q167
8782B57430l987p372J6553j412k5001j1786M415K9770k7851p629o51k1097q006
8769A93376O440P781J3937L3936j447K3652K8593J02L3033M8395L0214M8373M5170
$$ plain form
8853 1010064 1113071 1216045 1252764 1170632 1038200 914581 790988 733406 647682 552611
8843 552611 493903 422985 386989 360192 329142 327506 297165 288984 291437 312907 320501 307309
8831 307309 275715 251868 239358 234627 227556 255616 269467 255204 232672 218694 184560 176294
8819 176294 191565 212120 211966 174307 162616 168886 200996 198391 217283 229557 225663 240195 250946
8806 250946 256377 273842 297341 310021 335827 374510 425818 444636 447369 460903 442979 431078
8794 431078 426434 392947 364292 294346 271217 273738 287954 307138 290912 263217 265597 257430
8782 257430 253443 246071 262624 261212 236211 224425 228840 258610 230759 223130 222479 201382 193376
8769 193376 199816 207597 221534 255470 254023 277675 306268 306370 339403 387798 418012 466385 511555
8756E11555N0486L4522j976J2624M2862K4740Q374k0593n7335p4033j1220k6656
8744D93350m8154k7816J265L6377M803m5501M62n283j8065j1144J788P753o594
8731C83241O15J1827M217j4037k7121j5542j1365J5607J7442O143M806q074k6704
8718C41055k3727O943K2283Q105K9227M0759L1853K9007K2614J0401J3551N333
8706E37404L9034o551l1301k3041k0356l845j4208k8074m305J1566j7116N867
8694D45074l989j1069J0325K1288l659m9729k0840K6288K5888J655l827J2632
8682D50037j0128K0824K8379j8702k2680K0229N7293N6380O7952K9208J9792L1202
8670G29786M6449L8722L0032J1103K5904N7201K6803M9169M4294M4282J6489k1569
$$ plain form
8756 511555 562041 596563 594587 607211 650073 674813 683187 662594 605259 531226 520006 493350
8744 493350 445196 417380 418645 455022 459825 414324 414786 409503 391438 380294 382082 389835 383241
8731 383241 383856 395683 399900 385863 358742 343200 331835 347442 364884 371027 375833 367759 341055
8718 341055 317328 324271 346554 354659 383886 424645 456498 485505 508119 518520 532071 537404
8706 537404 576438 569887 538586 515545 495189 491344 477136 449062 444757 456323 439207 445074
8694 445074 441085 430016 440341 461629 457970 408241 387401 413689 439577 441232 437405 450037
8682 450037 439909 460733 489112 470410 447730 467959 525252 581632 649584 678792 698584 729786
8670 729786 776235 814957 844989 856092 881996 939197 966000 1015169 1059463 1103745 1120234 1098665
8658A098665m5104p2277m4847k9259m2155m8737n3957l1547l766N316J540o289
8646G27583N729l171J1452J9105J8082N470K1859L6506L3110K7846L1560L5095
8634I70226L3584M1374N1515O4641N0031Q4053J08742J21857J00624J04167N2464
8623A783278K8945K7065P377O4745Q0650J40872J65907J34346N2913k1990q6584
8612B377524j20603j21937p6823n6719p4061m5132j8621K1375K9310K3739L9977
8601A978029L0408N7122P3082O8691P9920P1527P8138L0029O3832R4455P4180
8590B699413P0262P3750J7831L0829O8449R4094J22918J21702J43303J72057J41206
8579C755814J83081J71039J77049K14158K04114J98188K44085K74796L15968L44919
$$ plain form
8658 1098665 1053561 981284 936437 907178 865023 816286 762329 730782 727016 732332 733872 727583
8646 727583 733312 730141 741593 760698 778780 784250 806109 842615 875725 903571 935131 970226
8634 970226 1003810 1045184 1096699 1161340 1211371 1295424 1404166 1526023 1626647 1730814 1783278
8623 1783278 1812223 1839288 1846665 1911410 1992060 2132932 2298839 2433185 2486098 2464108 2377524
8612 2377524 2256921 2134984 2058161 2001442 1927381 1882249 1863628 1885003 1914313 1938052 1978029
8601 1978029 2008437 2065559 2138641 2207332 2287252 2358779 2436917 2466946 2530778 2625233 2699413
8590 2699413 2769675 2843425 2861256 2892085 2960534 3054628 3177546 3299248 3442551 3614608 3755814
8579 3755814 3938895 4109934 4286983 4501141 4705255 4903443 5147528 5422324 5738292 6083211
8569F083211L29212L42978L61978M24601M69109N30752O73376P93012R74742J204081
8559A2187052J507112J820553K223929K660222L235992M051458N159402O635719
8551C9481439Q560640J1024228J4234930J8373539K3253342K7830430K9424237
8544A72182785K4359456J1555899m069403j6167790k2558725k4342230k2929010
8537A18030982j9724806j6013717j2526952r699589p476168n805404m443603l404786
8529C8935957k626221k101572j686714j366477j097400q29843n51087l01859o3322
8520B8311462K23892M42835P33354J077357J514286J962537K555788L280645M075965
8511D4178121M976919O122322P786787J0082314J3091622J6979413K1977360K8518183
$$ plain form
8569 6083211 6412423 6755401 7117379 7541980 8011089 8541841 9215217 10008229 10982971 12187052
8559 12187052 13694164 15514717 17738646 20398868 23634860 27686318 32845720 39481439
8551 39481439 48042079 59066307 73301237 91674776 114928118 142758548 172182785
8544 172182785 196542241 208098140 204028737 187860947 165302222 140959992 118030982
8537 118030982 98306176 82292459 69765507 60065918 52589750 46784346 42340743 38935957
8529 38935957 36309736 34208164 32521450 31154973 30057573 29227730 28676643 28374784 28311462
8520 28311462 28535354 28978189 29711543 30788900 32303186 34265723 36821511 40102156 44178121
8511 44178121 49155040 55277362 63064149 73146463 86238085 103217498 125194858 153713041
8503A53713041L7353388M8789783O0697706O5486297N1555433J6775513j9965281
8496D14405880m2328103n1598793n2583396m7575851l9447005l1093817k4072956
8489A25705959j8524896j4377000j1178861q654498o687990n260889m316920l721108
8481E2983797l241648k834075k397642k014406j641459j300458r69748o75241
8473C7909120m11104j16820J70127M95898Q77483J315931J840681K422505L125197
8464D7629018M058291N236910O760890Q582188J0789114J3639334J7386584K1811930
8456A35894259K5675454K6087509J9567385O028204q867578j9244874k3982554
8449A61157805k4584303k2518809j9039329j5312581j2028875r409094p364777
$$ plain form
8503 153713041 191066429 239856212 300553918 366040215 417595648 434371161 414405880
8496 414405880 372077777 320478984 267895588 220319737 180872732 149778915 125705959
8489 125705959 107181063 92804063 81625202 72970704 66282714 61021825 56704905 52983797
8481 52983797 49742149 46908074 44510432 42496026 40854567 39554109 38584361 37909120
8473 37909120 37498016 37381196 37551323 38047221 38924704 40240635 42081316 44503821 47629018
8464 47629018 51687309 56924219 63685109 72267297 83056411 96695745 114082329 135894259
8456 135894259 161569713 187657222 207224607 213252811 204385233 185140359 161157805
8449 161157805 136573502 114054693 95015364 79702783 67673908 58264814 50900037
8442E0900037n747451m555286l597812k934096k487566k145728j935986j742262
8434B5753850j546797j379797j226048j059476r38480q13542p16993o20125n44608
8425A6907984n04588m60303m13456l62845l03600k56763k07041j83470k19225
8416A3996693k21526k80788l84597m08499m60476m75673n08930m95521m98531
8407A0262152n06311m71049m40639l90619l75455l58402l23103l18113l00507
8398F777954k60500k54964j92728j93133j56249j65500j65388j63441j83395k21333
8388D821323k13082k07948k25328j84865j69920j14590r1693q7310r3223o0433
8378C372931m3642p2988r7546j37058k12140k60337k46170j87506j10078p6126
$$ plain form
8442 50900037 45152586 40597300 36999488 34065392 31577826 29432098 27496112 25753850
8434 25753850 24207053 22827256 21601208 20541732 19603252 18789710 18072717 17452592 16907984
8425 16907984 16403396 15943093 15529637 15166792 14863192 14606429 14399388 14215918 13996693
8416 13996693 13775167 13494379 13109782 12701283 12240807 11765134 11256204 10760683 10262152
8407 10262152 9755841 9284792 8844153 8453534 8078079 7719677 7396574 7078461 6777954
8398 6777954 6517454 6262490 6069762 5876629 5720380 5554880 5389492 5226051 5042656 4821323
8388 4821323 4608241 4400293 4174965 3990100 3820180 3705590 3613897 3526587 3433364 3372931
8378 3372931 3329289 3256301 3158755 3021697 2809557 2549220 2303050 2115544 2005466 1929340
8368A929340l6548J3597O820j6583j8002l1188l1653m0682m3651l1495k5776l9323
8356A634856l0112j7034m852l2125k1045l661o123k1615n783L85K5043Q687l9497
8343A487124o1030m7491n1461n9602m344j1995j4826j5951m1593j5228K5678J1214
8331A200495j0240k614p0423j11976p1418m4874r301K1594K8203M1536J4059m1054
8319I43987K615L1115M0833o137k0589j6676j1052j0047k2569Q196p212j7750
8307I14714m524j2056n119j4077P677m164K826j5749k0339j4780j5965l2138j2183
8294G74123L890K2343J758j0117J3811M298k4092L054J2516K2904L224o259j2975
8281H08478k4731P739r986l975J6266k0781j0538m233l6371k5996r089p209n261
$$ plain form
8368 1929340 1892792 1906389 1913209 1896626 1878624 1847436 1815783 1775101 1731450 1699955 1674179 1634856
8356 1634856 1604744 1587710 1582858 1550733 1529688 1526027 1519904 1498289 1492506 1492891 1517934 1526621 1487124
8343 1487124 1426094 1378603 1327142 1267540 1263196 1251201 1236375 1220424 1178831 1163603 1189281 1200495
8331 1200495 1190255 1187641 1117218 1005242 933824 888950 879649 901243 929446 970982 985041 943987
8319 943987 946602 977717 1018550 1012413 991824 975148 964096 954049 931480 939676 932464 914714
8307 914714 910190 898134 893015 878938 886615 882451 885277 869528 849189 834409 818444 786306 774123
8294 774123 778013 800356 802114 791997 805808 810106 786014 789068 801584 824488 827712 821453 808478
8281 808478 783747 791486 781500 777525 793791 773010 762472 758239 721868 695872 686783 679574 674313
8268F74313l5649j9012k3337J240j6328J4863L0726r669k3153l2492j283J6284
8256E76503R627j8151K401L3808n454K819L2615j6024l2483j6512l680K7824J2006
8243F05299j3620l965K266r818N914J1047j0997O201j8649k5979p420j2540l2437
8230D95302N906J4933J3496m4265k297l6678j3004R854o1624k7229r508J8805
8218C63691L994N099O128j7904L323O006m627J932M80J2019R876L136j1354m549
8204C77250k3607l1678k463L5680J7738J3502J6465l448k4534j2360q530l128
8192C50887k0990J6161L9158Q288j190J9829J7833j7333j8526K7672K0450J6517
8180D58756l165l3022m2359j0220k1503k9230Q143M30l108R540j0660J9561O320
$$ plain form
8268 674313 638664 619652 596315 597555 581227 596090 626816 617147 593994 561502 560219 576503
8256 576503 586130 567979 570380 604188 598734 601553 634168 618144 585661 569149 565469 593293 605299
8243 605299 591679 587714 589980 580162 586076 597123 586126 592327 573678 547699 540279 527739 495302
8230 495302 501208 516141 529637 485372 483075 446397 433393 443247 381623 354394 344886 363691
8218 363691 367685 372784 378912 361008 364331 370337 365710 367642 368122 380141 390017 393153 381799 377250
8204 377250 353643 321965 319502 355182 372920 386422 402887 399439 374905 362545 354015 350887
8192 350887 329897 346058 385216 393504 392314 412143 429976 412643 394117 421789 442239 458756
8180 458756 455591 422569 380210 369990 348487 319257 327400 327830 324722 334262 323602 343163 349483
8167C49483L0191j5918N229K534l706q70o977j9450J3709M472J462J0154N787
8154C76100P078j3098l1440r154L1108O1930Q4441N8144N5680P9341J23762J26513
8142I50405J51226J71708J17206J3899r1573r4141q8194j27292j15999r8570r4348
8131F94327n1428m4137j8594l8957m4713k3794j7176j9412L796j7670j7575K5000
8119D29667r789j1831O912j1442l1557j4599J2139J5547j3498M277O533J5042
8107C97401J8773L9874N6349O7796O5127R2925J19387J52055K08974L10035L51381
8096A880077L52581K48558K1821j65240k27927k84052k95671k52972k20900j36849
8086I19426j09243q9788n0258n6973m5433n5815n9760j0219J9628j9251k9331
$$ plain form
8167 349483 379674 363756 368985 371519 367813 366943 359966 340516 354225 358697 360159 370313 376100
8154 376100 383178 370080 338640 329486 360594 422524 506965 565109 620789 700130 823892 950405
8142 950405 1101631 1273339 1390545 1404444 1312871 1218730 1130536 1003244 887245 788675 694327
8131 694327 642899 598762 580168 541211 496498 472704 455528 436116 439912 422242 404667 429667
8119 429667 419878 408047 414959 403517 371960 357361 369500 385047 371549 375826 382359 397401
8107 397401 416174 456048 512397 580193 645320 738245 857632 1009687 1218661 1528696 1880077
8096 1880077 2232658 2481216 2503037 2337797 2109870 1825818 1530147 1277175 1056275 919426
8086 919426 810183 720395 670137 613164 567731 511916 452156 441937 461565 442314 412983
8075D12983p411n193l5619n5490Q863M721Q615J3922K9359K2982K3689j1714k8011
8062C81696j448L9509K5020K7289J8560K4062J8591P8177J33532J37880J28448
8051A011316J33129J13027J5024o7399j17192j55915j00097j22491r9145q0772
8041E29485n3414n5946l9822k1746M194J7156j8772m0129j5325J3287r693k0595
8029B88680M412k0036p33J65l1738j6762N062M7476K5304k4081l6751J5235M959
8016B61192K282l962k3436k3072p892J420k9523P757K1946J569P854j74k9603
8003A86358k7683p28M272j9293j2845L2685M8927r49k1694l787j4672j6326j1630
7990A42635M953N587j522J3932l207j4852J4875K7877L183j0104k590R749N103
$$ plain form
8075 412983 405572 400379 364760 309270 318133 322854 331469 345391 374750 397732 421421 409707 381696
8062 381696 380248 419757 444777 472066 490626 514688 533279 611456 744988 882868 1011316
8051 1011316 1144445 1257472 1272496 1205097 1087905 931990 831893 709402 610257 529485
8041 529485 476071 420125 380303 358557 362751 379907 361135 321006 305681 318968 309275 288680
8029 288680 293092 273056 272323 272488 240750 223988 229050 276526 301830 277749 240998 256233 261192
8016 261192 263474 259512 236076 213004 205112 206532 177009 184766 206712 208281 216135 215961 186358
8003 186358 158675 157947 162219 142926 130081 162766 211693 210744 189050 185263 170591 154265 142635
7990 142635 147588 153175 151653 165585 162378 147526 162401 190278 193461 183357 180767 190516 195619
7977A95619k1762m1870r387J3518J287l934L0499q877j8060k009o132n777l312
7964A19803J738J6428K4646k1443m298l865l971j7844k8627J1433o76R364J8308
7951A20996L1848J9337l548j6256k9842l2058k845K5887k716j4385R405r63j4500
7938I0360o175J3754K9558j1298k174l8419j6705J5743J8985K211O07j8159k6379
7925E1909K1345M7845J0453j6764J099J3518K4270k2268M781j9194o41J3624L811
7912A33788l2667r626j2872M105l026N649Q43L856M381p938P190J0858r989K7421
7898A21973j4028k9401K562P99J8922p382j9058J2670K7669j7329l257J7628J75
7885A11943N826O410k6460j5219j9459o617n56J7987K473n674L308j8288O965
$$ plain form
7977 195619 173857 131987 122600 136118 137405 133471 163970 155093 137033 135024 128892 123115 119803
7964 119803 121541 137969 162615 141172 136874 133009 129038 111194 82567 94000 93324 102688 120996
7951 120996 152844 172181 168633 152377 122535 90477 87632 113519 110803 96418 105823 104860 90360
7938 90360 84185 97939 127497 116199 114025 75606 58901 74644 93629 95840 96447 78288 51909
7925 51909 73254 121099 131552 114788 115887 129405 153675 131407 136188 116994 116353 129977 133788
7912 133788 101121 91495 78623 82728 79702 85351 86194 90050 94431 86493 93683 104541 94552 121973
7898 121973 107945 78544 81106 81905 100827 93445 74387 87057 114726 97397 94140 111768 111943
7885 111943 117769 124179 97719 82500 63041 56424 55868 73855 76328 70654 73962 55674 62639
7872F2639J2482K138k170r257N996k04j739N382L3032j9781J1848J5678q778j3159
7858I4107J4565l863O632r184k6749j1042J9879l3450j1915o718K5419n915j0930
7845D0836N549J6929J7359j6106l528M903O957k94j1634J4806p757k9975j0244
7832B7801n633N797o024J5397J5715K353k7608M967J7234L5976p964p712m752
7819F5547K759P772k6631n865k2871L066K4274L451K1642K8019p073m8603l4892
7806A0595j1548j6329o399J8377p359M74M405Q189L2067L185K8288R776k4378
7793D9343j6538p603K941l004j960J3180j7712k7261o719K4512Q65J6105K9892
7780E6041K2854l5661k1936q87N265k1151q497j688J0829M142R874k5412J221
$$ plain form
7872 62639 75121 77259 75089 65832 71828 71624 69885 75267 108299 88518 100366 116044 107266 94107
7858 94107 108672 104809 111441 102257 75508 64466 84345 50895 38980 32262 57681 51766 40836
7845 40836 46385 63314 80673 64567 61039 65942 72899 72605 60971 75777 68020 38045 27801
7832 27801 22168 27965 21941 37338 53053 55406 27798 32765 49999 85975 78011 70299 65547
7819 65547 68306 76078 49447 43582 20711 23777 48051 51502 73144 101163 94090 45487 10595
7806 10595 -953 -17282 -23681 -5304 -12663 -12189 -7784 405 32472 35657 63945 73721 49343
7793 49343 32805 25202 28143 25139 23179 36359 18647 -8614 -15333 9179 10044 26149 56041
7780 56041 78895 43234 21298 20411 25676 4525 -3972 -5660 5169 9311 19185 -6227 -5006
7767e006p80K192J5735J7116m646L177J3737j3206N021r87K972n290m527J7781
7753D3289L3001k3817l0863r233K0372N872J6624K1931k6715l4323J6677N643
7741C8458q746J01J4631j1924m4970J646L365J7615M0598J1361j6946q724J1393
7728D7858k5073k1363N207J1209P94k0104Q840K3590Q067k4180p028L692k963
7715H546o867k6626p278Q446J9568O717j1736P56J8672P682M32k321M020R985
7701B9996N933J7632R258j0880k1787j6990q222K7485J9902j018j7640L920j2803
7688B4786n119O838j9062j5055J8055J1918L5489J3867j9585l0977k1618m459
7676d922K0048J2729K996j5768L737j9M650J5025n532j1598P525j7110j0702R990
$$ plain form
7767 -5006 -5786 -3594 12141 29257 24611 27788 41525 28319 33340 32353 35325 30035 25508 43289
7753 43289 76290 52473 21610 12377 32749 38621 55245 77176 50461 16138 32815 38458
7741 38458 29712 29813 44444 32520 -12450 -10804 -7439 10176 50774 62135 45189 36465 47858
7728 47858 22785 1422 6629 17838 18632 -1472 7368 30958 39025 14845 7817 11509 8546
7715 8546 1679 -24947 -32225 -23779 -4211 2506 -9230 -8474 10198 17880 18312 15991 20011 29996
7701 29996 35929 53561 62819 51939 30152 13162 4940 32425 52327 51309 33669 37589 24786
7688 24786 19667 26505 7443 -7612 10443 22361 57850 71717 52132 21155 -463 -4922
7676 -4922 15126 27855 30851 15083 18820 18801 23451 38476 32944 21346 28871 11761 1059 11049
7662A1049r721j3648l602o567J3816M862L619R723K5688n271k0728P090k464p839
7648F007K1649O862K771K3002J6955k7653k7088J7937M718k5738J4532L0607k0728
7635D3833k4005j8374n0k0005k3115J2754M0539J3268m192k4817J0224J6754K3193
7622D6007P554j7469k1454j3098K702K4210k1501j7368J439k747m37J5457R44
7609D239j5866j3670J4381Q443m981j6543n759K304J639m528M6315K256j0901
7596G329K671j1012l8608q312L7297L4587K5368J840k2153k4218L974K1430Q939
7583C9132O68q637q890k7676l1370J2263K3585L0653M247k045Q509k4687N319
7570B1071J8941J9498j9913q419J996o380j6185N921M777j444l1087o118J65j3852
$$ plain form
7662 11049 1328 -12320 -15922 -22489 -8673 -3811 -192 9531 35219 29948 9220 16310 13846 6007
7648 6007 27656 34518 37289 60291 77246 49593 22505 40442 45160 19422 33954 64561 43833
7635 43833 19828 1454 1404 -18601 -41716 -28962 11577 24845 20653 -4164 6060 22814 46007
7622 46007 53561 36092 14638 1540 4242 28452 6951 -10417 -8978 -11725 -12162 3295 4239
7609 4239 -11627 -25297 -10916 -2473 -7454 -23997 -29756 -27452 -25813 -30341 15974 18230 7329
7596 7329 10000 -1012 -39620 -47932 -10635 23952 49320 51160 29007 4789 8763 30193 39132
7583 39132 39800 31163 22273 -5403 -36773 -24510 -925 29728 33975 31930 40439 15752 21071
7570 21071 40012 59510 39597 31178 33174 26794 10609 16530 21307 19863 -11224 -17342 -17177 -31029
7556c1029Q838J3598Q385R97P592k8548J1822J7325j0202K04K0824R55m21r158
7542A1182l827r99N568J2460J71l0489j8645L7918J6507N707p323k1369o46n778
7528D37J6169l552L936q619l2422j7837j0774R199R77M6280L24o687k864O996
7514A563R887j2254J898n94r166J964j3028k637J7524P96K4615J1185Q787K7617
7500F8157M74k4455k3115n911N2L2118j107o433r519k818L1476J6606k3046l4486
7486A7993k0500L652K8633J6788j1744k5001k3052P018l441q249m572o664j9521
7473d8660m080K0568M7336K5048o130k910j930J2360P134k0880j4438P164J1215
7460C1797l2945q491R138J7729k2862r834L5305k234O037K784j2234J884R237
$$ plain form
7556 -31029 -22191 -8593 -208 789 8381 -20167 -8345 8980 -1222 -1018 19806 20761 20340 11182
7542 11182 7355 6356 11924 24384 24555 -5934 -24579 13339 29846 35553 28230 6861 6215 437
7528 437 16606 13054 16990 8371 -24051 -41888 -52662 -43463 -42486 3794 4118 -2569 -5433 1563
7514 1563 11450 -804 1094 500 -8666 -6702 -19730 -22367 -4843 -4047 20568 31753 40540 68157
7500 68157 68631 44176 21061 15150 15202 47320 46213 39780 30261 27443 58919 75525 52479 17993
7486 17993 -2507 1145 29778 46566 34822 9821 -13231 -6213 -9654 -17903 -22475 -29139 -48660
7473 -48660 -52740 -32172 15164 40212 34082 31172 29242 41602 48736 27856 13418 20582 31797
7460 31797 -1148 -9639 -501 17228 -5634 -15468 19837 17603 23640 26424 14190 16074 25311
7447B5311r558j1107J8480R425j6076k5046R450L2692j5226o205l140K679j3223
7434a544k0170M69K283L1045K113j6230J853K1992l094j2501k4231J0797K0778
7421A3560P471j7992l2446J5814L3033j6463l476L2398j696j4597J1630J0173
7409C7409q143N037j0487k1620J535p495J1279k2955r603K4988J1233j7253j6628
7396b2703J1400j542j8613L0594o469K6201K6988L421p884o197o245J8317k1288
7383B5980j1603k2537N112P233J1688L294q336q013lO012L888J5328j3839l2056
7369a7852r193K887K7230L95k4962J1003L7401J6542k398k3049m487k3958l783
7356a4224L6555p8j6343P719K5540J783N836J2632j4890j4392p50j8945m969n408
$$ plain form
7447 25311 15753 4646 23126 32551 16475 -8571 879 33571 18345 12140 9000 11679 -1544
7434 -1544 -21714 -21245 -18962 12083 14196 -2034 -181 21811 18717 6216 -18015 -7218 13560
7421 13560 21031 3039 -29407 -13593 19440 2977 -499 31899 30203 15606 27236 37409
7409 37409 29266 34303 23816 2196 3731 -3764 7515 -15440 -25043 -55 11178 -6075 -22703
7396 -22703 -11303 -12845 -31458 -864 -7333 18868 45856 49277 41393 35196 28951 47268 25980
7383 25980 14377 -8160 -3048 4185 15873 19167 10831 2818 2815 8827 12715 28043 14204 -17852
7369 -17852 -27045 -24158 3072 3467 -21495 -10492 26909 43451 41053 18004 13517 -10441 -14224
7356 -14224 22331 22253 5910 13629 39169 40952 46788 59420 44530 30138 29388 10443 5474 66
7342F6N392j5102n884K4131J9571k5761k3889q145N932j4127j3376P317J7667
7329b6208K1254n985q634J005j2438L9041J9455j6173l215n103k800p877j2124
7316a9802L144j0440K2014K0934o610P575J3784n464m783k807R339j4211j1141
7303A532M1608J2145l1800j2896R187O663N385j7676o615K788J4668j3122k9085
7290a7218L6470L1884K1593K4447k5453l2952k9828l1164j3606k292j1940n07
7278e0566K3560L4566Q346K963n35k7873j6546k1732J1537L228M119Q443J5366
7265e124O556r842j9267J7052K579p888J5105o403N470N159N32N193k593k8124
7251b1595r087l521k721j4543K5237L8347j6228q487J0205k931j4264J1899K6505
$$ plain form
7342 66 5458 -9644 -15528 8603 28174 2413 -21476 -29621 -23689 -37816 -51192 -43875 -26208
7329 -26208 -4954 -10939 -19573 -18568 -31006 8035 27490 11317 8102 2999 199 -7678 -19802
7316 -19802 -16658 -27098 -5084 15850 9240 16815 30599 25135 20352 17545 26884 12673 1532
7303 1532 43140 55285 23485 10589 19776 26439 31824 14148 7533 10321 24989 11867 -17218
7290 -17218 19252 51136 72729 97176 71723 38771 8943 -22221 -35827 -38119 -50059 -50566
7278 -50566 -27006 7560 15906 18869 18334 -9539 -26085 -47817 -36280 -33052 -28933 -20490 -5124
7265 -5124 1432 -8410 -27677 -10625 -8046 -15934 -829 -7232 -1762 3397 3929 9122 6529 -21595
7251 -21595 -30682 -34203 -36924 -51467 -26230 12117 -4111 -12598 -2393 -5324 -19588 -7689 18816
7238A8816l1009J3457J4995R673r066J4160R380l3797R309j4780j8423j3362J3873
7225a6774O2932J9778m6980k1371k0051j2570M386K6015M2126L384j5920k3983
7213I72l0430j6723R031J0898M412P509M380J486R083Q411j9413j7529O978j2630
7199c3565J0044q628J7380m574k1161r475K4648J0414J2935j1646n313Q793L425
7186f723m690l0428l0472K4084K7786J6192J8763K9842j5717q283j8069r989J3014
7173E310j2543m752N587J4796q659p049P093Q973J0698L79k3981k0173R563K3516
7159H758n08j9226N144J2968J0796J9207k3084j0411K5592K2603p276j2834k1469
7146A0260J5243Q798k6507J1735j672o34j8984k3747J4606K6522j1386q203M324
$$ plain form
7238 18816 -12193 1264 16259 25932 16866 31026 40406 6609 15918 1138 -17285 -30647 -16774
7225 -16774 46158 65936 18956 -2415 -22466 -35036 -30650 -4635 37491 40875 24955 972
7213 972 -29458 -46181 -37150 -26252 -21840 -14331 -9951 -8465 618 9029 -10384 -27913 -20935 -33565
7199 -33565 -23521 -32149 -14769 -19343 -40504 -49979 -25331 -14917 -1982 -13628 -18941 -10148 -6723
7186 -6723 -11413 -41841 -72313 -48229 -20443 -4251 14512 44354 28637 20354 2285 -7704 5310
7173 5310 -7233 -11985 -6398 8398 -261 -7310 -217 8756 19454 19833 -4148 -24321 -14758 8758
7159 8758 8250 -10976 -5832 7136 17932 37139 14055 3644 29236 51839 44563 31729 10260
7146 10260 25503 34301 7794 19529 17857 17223 -1761 -25508 -10902 15620 4234 -3969 355
7133C55J6491q297l932J1020L430k8417K5p194k751k2169K083L2303J2959q216
7119b310k6033j0612J6873M5530k1916K307L5787J0463j2264q018k3406j6768
7107a0367j6518O154K2522L680l0349k8969Q797K3826K4828M96n734R427k6649
7094a8856J04L401l979o790j2226J1713J6069L404j7206l864J510j1748P118l557
7080c4907J7322J0406m106j529o494j7568j325m807L801L134J3012J5952J5716
7067H607J3253j5105m326O513j2429j6262J5557J5761n197j3861j522M303J9593
7054A4885K0265j4803p992j9081k5119K1244J5371k8051o159J783j6462j1919
7042e6038K5259M6177k4181k6204j7299k884R381J0048K2918l87J0381M539j5794
$$ plain form
7133 355 16846 8549 4617 15637 19067 -9350 -9325 -16519 -19270 -41439 -39356 -7053 5906 -2310
7119 -2310 -28343 -38955 -22082 23448 1532 3839 39626 50089 37825 29807 6401 -10367
7107 -10367 -26885 -20731 1791 5471 -24878 -53847 -45050 -21224 3604 4100 -1634 7793 -18856
7094 -18856 -18752 -15351 -19330 -26120 -38346 -26633 -10564 -7160 -24366 -28230 -26720 -38468 -31350 -34907
7080 -34907 -17585 -7179 -11285 -12814 -19308 -36876 -38201 -43008 -39207 -36073 -23061 -7109 8607
7067 8607 21860 6755 2429 8942 -3487 -19749 -4192 11569 6372 -7489 -9011 -4708 14885
7054 14885 35150 20347 12355 -6726 -31845 -10601 4770 -23281 -29440 -27657 -44119 -56038
7042 -56038 -30779 15398 -8783 -34987 -52286 -55170 -45789 -35741 -12823 -13210 -2829 1710 -14084
7029a4084p851K9153L1797j5866p858O532k9244J194n113j3308L7387J3994J2449
7016C9182r550q407P032P98j7900l5397r544J8173K8270J8706K671j0954j1422
7003A1658K393J5253j9478k6849q830j404J7328J3650J2305l051r845J8806J8898
6990D0834L644j2505L279j847q822l299j701J6231j3733l612k0426p073N258N047
$$ plain form
7029 -14084 -21935 7218 39015 23149 15291 21823 -7421 -6227 -11340 -24648 12739 26733 39182
7016 39182 29632 21225 28257 29055 11155 -24242 -33786 -15613 12657 31363 34034 23080 11658
7003 11658 14051 29304 9826 -17023 -25853 -27257 -9929 3721 16026 12975 3130 21936 40834
6990 40834 44478 31973 35252 33405 24583 21284 19583 35814 22081 18469 -1957 -9030 -3772 1275
$$ [...]
##END NTUPLES=NMR SPECTRUM
##END=
