##TITLE=Analysis number 307299
Compound Code mo 07009
Book Reference 407/63
Project Code adrs
Chemist Name andyw
##JCAMPDX= 6.0         $$ Bruker NMR JCAMP-DX V2.0
##DATA TYPE= NMR SPECTRUM
##DATA CLASS= NTUPLES
##ORIGIN= Bruker BioSpin GmbH
##OWNER= NMR
$$ XWIN-NMR		Version 3.5
$$ Wed Apr 27 12:49:35 2005 GMT Daylight Time (UT+1h)  MAYBRIDGE\NMR@NMR_250MHZ
##.OBSERVE FREQUENCY= 250.131544655141
##.OBSERVE NUCLEUS= ^1H
##.ACQUISITION MODE= SIMULTANEOUS (DQD)
##.ACQUISITION SCHEME= undefined
##.AVERAGES= 16
##.DIGITISER RES= 18
##SPECTROMETER/DATA SYSTEM= dpx250
##.PULSE SEQUENCE= zg30
##.SOLVENT NAME= CDCl3
##.SHIFT REFERENCE= (INTERNAL, CDCl3, 0, 16.522)
##AUDIT TRAIL= $$ (NUMBER, WHEN, WHO, WHERE, WHAT)
$$ ##TITLE= Audit trail, XWIN-NMR		Version 3.5
$$ ##JCAMPDX= 5.01
$$ ##ORIGIN= Bruker BioSpin GmbH
$$ ##OWNER= NMR
$$ C:\u/data/dgb/nmr/ADRS/2310/pdata/1/auditp.txt
$$ ##AUDIT TRAIL=  $$ (NUMBER, WHEN, WHO, WHERE, WHAT)
(   1,<2005-04-27 12:49:15.54 +100>,<MAYBRIDGE\NMR>,<NMR_250MHZ>,
      <created by zg, POWCHK disabled, PULCHK disabled
       configuration hash MD5:
       62 19 C7 07 E1 42 D1 B7 37 6C 3D D0 77 39 F9 E6
       data hash MD5: 64K
       FB 39 91 C8 A8 8F 6F 6C 7F 73 60 47 2F 9C 32 3C>)
(   2,<2005-04-27 12:49:28.24 +100>,<MAYBRIDGE\NMR>,<NMR_250MHZ>,
      <Start of raw data processing
       ef LB = 0.3 FT_mod = 6 PKNL = 1 SI = 32K 
       data hash MD5: 32K
       FE F3 6C 57 CC 73 AA 82 83 19 D5 82 D3 D8 B0 26>)
(   3,<2005-04-27 12:49:30.02 +100>,<MAYBRIDGE\NMR>,<NMR_250MHZ>,
      <apk 
       data hash MD5: 32K
       7E 23 42 F3 01 DA 65 55 24 1E E4 C8 C5 47 77 F3>)
(   4,<2005-04-27 12:49:30.74 +100>,<MAYBRIDGE\NMR>,<NMR_250MHZ>,
      <abs ABSG = 5 
       data hash MD5: 32K
       F6 07 6B 5A DF 45 C6 A0 86 46 CA E1 06 CE D1 10>)
$$ ##END=
$$ 
$$ hash MD5
$$ 64 E6 12 4B C3 FC 45 E9 15 60 EE 77 03 FC E0 C0
##$RELAX= 
##$RELAX= 
##$RELAX= 
##$RELAX= 
##$RELAX= 
##$RELAX= 
##$RELAX= 
$$ Bruker specific parameters
$$ --------------------------
##$DU= <C:\u>
##$EXPNO= 2310
##$NAME= <ADRS>
##$PROCNO= 1
##$TYPE= <nmr>
##$USER= <dgb>
##$AMP= (0..31)
100 100 100 100 100 100 100 100 100 100 100 100 100 100 100 100 100 100 
100 100 100 100 100 100 100 100 100 100 100 100 100 100 
##$AQSEQ= 0
##$AQ_mod= 3
##$AUNM= <au_zg>
##$AUTOPOS= <25 >
##$BF1= 250.13
##$BF2= 250.13
##$BF3= 250.13
##$BF4= 250.13
##$BF5= 500.13
##$BF6= 500.13
##$BF7= 500.13
##$BF8= 500.13
##$BYTORDA= 1
##$CFDGTYP= 0
##$CFRGTYP= 5
##$CHEMSTR= <none>
##$CNST= (0..31)
1 1 145 1 1 1 1 1 1 1 1 1 1 1 1 1 1 1 1 1 1 1 1 1 1 1 1 1 1 1 1 1 
##$CPDPRG= <>
##$CPDPRG1= <>
##$CPDPRG2= <>
##$CPDPRG3= <>
##$CPDPRG4= <mlev>
##$CPDPRG5= <mlev>
##$CPDPRG6= <mlev>
##$CPDPRG7= <mlev>
##$CPDPRG8= <mlev>
##$CPDPRGB= <>
##$CPDPRGT= <>
##$D= (0..31)
0 1 0 0 0 0 0 0 0 0.06 0 0 0 0 0 0 0.0002 0 0 0 0 0 0 0 0 0 0 0 0 0 0 
0 
##$DATE= 1114602554
##$DBL= (0..7)
120 120 120 120 120 120 120 120 
##$DBP= (0..7)
150 150 150 150 150 150 150 150 
##$DBP07= 0
##$DBPNAM0= <>
##$DBPNAM1= <>
$$ [...]
##$SUBNAM7= <"">
##$SUBNAM8= <"">
##$SUBNAM9= <"">
##$SW= 20.6930455092707
##$SWIBOX= (0..15)
0 0 3 0 0 0 0 0 0 0 0 0 0 0 0 0 
##$SW_h= 5175.983436853
##$TD= 65536
##$TD0= 1
##$TE= 300.16
##$TE2= 300
##$TE3= 300
##$TEG= 300
##$TL= (0..7)
0 120 120 120 120 120 120 120 
##$TP= (0..7)
150 150 150 150 150 150 150 150 
##$TP07= 0
##$TPNAME0= <>
##$TPNAME1= <>
##$TPNAME2= <>
##$TPNAME3= <>
##$TPNAME4= <>
##$TPNAME5= <>
##$TPNAME6= <>
##$TPNAME7= <>
##$TPOAL= (0..7)
0.5 0.5 0.5 0.5 0.5 0.5 0.5 0.5 
##$TPOFFS= (0..7)
0 0 0 0 0 0 0 0 
##$TUNHIN= 0
##$TUNHOUT= 0
##$TUNXOUT= 0
##$USERA1= <user>
##$USERA2= <user>
##$USERA3= <user>
##$USERA4= <user>
##$USERA5= <user>
##$V9= 5
##$VALIST= <valist>
##$VCLIST= <CCCCCCCCCCCCCCC>
##$VD= 0
##$VDLIST= <DDDDDDDDDDDDDDD>
##$VPLIST= <PPPPPPPPPPPPPPP>
##$VTLIST= <TTTTTTTTTTTTTTT>
##$WBST= 1024
##$WBSW= 4
##$XGAIN= (0..3)
0 0 0 0 
##$XL= 0
##$YL= 0
##$YMAX_a= 386576
##$YMIN_a= -575548
##$ZGOPTNS= <>
##$ZL1= 120
##$ZL2= 120
##$ZL3= 120
##$ZL4= 120
##$ABSF1= 16.522
##$ABSF2= -4.171173
##$ABSG= 5
##$ABSL= 3
##$ALPHA= 0
##$AQORDER= 0
##$ASSFAC= 0
##$ASSFACI= 0
##$ASSFACX= 0
##$ASSWID= 0
##$AUNMP= <proc_1d>
##$AZFE= 0.1
##$AZFW= 0.1
##$BCFW= 0
##$BC_mod= 0
##$BYTORDP= 0
##$COROFFS= 0
##$CY= 12.5
##$DATMOD= 1
##$DC= 0
##$DFILT= <>
##$DTYPP= 0
##$F1P= 14.0000005364418
##$F2P= -0.99999901652339
##$FCOR= 0.5
##$FTSIZE= 32768
##$FT_mod= 6
##$GAMMA= 0
##$GB= 0
##$INTBC= 1
##$INTSCL= 1
##$ISEN= 128
##$LB= 0.3
##$LEV0= 0
##$LPBIN= 0
##$MAXI= 10000
##$MC2= 0
##$MEAN= 0
##$ME_mod= 0
##$MI= 0
##$NCOEF= 0
##$NC_proc= -3
##$NLEV= 6
##$NOISF1= 0
##$NOISF2= 0
##$NSP= 0
##$NTH_PI= 0
##$NZP= 0
##$OFFSET= 16.522
##$PC= 1
##$PHC0= -82.90948
##$PHC1= 3.735518
##$PH_mod= 1
##$PKNL= yes
##$PPARMOD= 0
##$PSCAL= 4
##$PSIGN= 0
##$REVERSE= no
##$SF= 250.13
##$SI= 32768
##$SIGF1= 0
##$SIGF2= 0
##$SINO= 400
##$SIOLD= 32768
##$SREGLST= <1H.CDCl3>
##$SSB= 0
##$STSI= 32768
##$STSR= 0
##$SW_p= 5175.98343685301
##$SYMM= 0
##$S_DEV= 0
##$TDeff= 65536
##$TDoff= 0
##$TI= <Analysis number 999999
Compound Code 99
Book Reference 9
Project Code 9>
##$TILT= no
##$TM1= 0
##$TM2= 0
##$TOPLEV= 0
##$USERP1= <user>
##$USERP2= <user>
##$USERP3= <user>
##$USERP4= <user>
##$USERP5= <user>
##$WDW= 1
##$XDIM= 32768
##$YMAX_p= 278990117
##$YMIN_p= -120721
$$ End of Bruker specific parameters
$$ ---------------------------------
##NTUPLES= NMR SPECTRUM
##VAR_NAME=  FREQUENCY,     SPECTRUM/REAL,   SPECTRUM/IMAG
##SYMBOL=    X,             R,               I
##VAR_TYPE=  INDEPENDENT,   DEPENDENT,       DEPENDENT
##VAR_FORM=  AFFN,          ASDF,            ASDF
##VAR_DIM=   32768,         32768,           32768
##UNITS=     HZ,            ARBITRARY UNITS, ARBITRARY UNITS
##FACTOR=    0.157963299565203, 1,           1
##FIRST=     4132.6476996994, 0,             0
##LAST=      -1043.33573715361, 0,           0
##MIN=       -1043.33573715361, -120721,     0
##MAX=       4132.6476996994, 278990117,     0
$$ Real data points
##PAGE= N=1
##DATA TABLE= (X++(R..R)), XYDATA
$$ [...]
18663d135P939k233j2890j0720P841J8247l660O233L376j4113M503J7133o421
$$ -4135 3804 1571 -11319 -22039 -14198 4049 389 6622 9998 -4115 388 17521 11100
18650A1100o173j6449j544J3609Q61j6669j6332R860N85N771m549J654Q121K3840
$$ 11100 4927 -11522 -13066 543 1404 -15265 -31597 -21737 -21152 -15381 -19930 -18276 -10155 13685
18636A3685l563k0028M348j3343L3988J9948l8039l8038J4172J6960j0080Q623
$$ 13685 10122 -9906 -5558 -18901 15087 35035 -3004 -41042 -26870 -9910 -19990 -11367
18624a1367j9651k041J3670K5065l076n039k9009n162J140K0184q916M962k240
$$ -11367 -31018 -33059 -19389 5676 2600 -2439 -31448 -36610 -35470 -15286 -24202 -19240 -21480
18611b1480J6469n387j2238o266j2227J3791p812l457M174L1267K8402m341k5859
$$ -21480 -5011 -10398 -22636 -28902 -41129 -27338 -35150 -38607 -34433 -3166 25236 20895 -4964
18598d964j1840J7979J4450K9637j0719N494j8975l0827r251K003m206j1650j7537
$$ -4964 -16804 1175 15625 45262 34543 40037 21062 -9765 -19016 -17013 -21219 -32869 -50406
18585e0406L8802P065L318K709o60k357k1671j4831J3489J6728N416j834j217
$$ -50406 -11604 -4539 -1221 1488 828 -1529 -23200 -38031 -24542 -7814 -2398 -4232 -5449
18572e449R044J9911k0434j4606J2488J5121l663j5046p623J2288m2183j5148
$$ -5449 3595 23506 3072 -11534 954 16075 12412 -2634 -10257 2031 -40152 -55300
18560e5300N3211J1274k6726j943K2865K7895K8702p631l7773j9478m792M937
$$ -55300 -2089 9185 -17541 -19484 3381 31276 59978 52347 14574 -4904 -9696 -4759
18548d759M144L6223k4382m9383M359K2251k8977q769J7814L0093O899m02l0205
$$ -4759 -615 35608 11226 -38157 -33798 -11547 -40524 -49293 -31479 -1386 5513 5111 -25094
18535b5094l5593n340K0602M3921Q998O341O254m1300J8261M744p913Q968j3902
$$ -25094 -60687 -66027 -45425 -1504 7494 13835 20089 -21211 -2950 1794 -6119 2849 -11053
18522a1053R183m434o474j29J9908j5604n937O411j569j1763k0195l3776k3075
$$ -11053 -1870 -6304 -12778 -12907 7001 -8603 -14540 -8129 -9698 -21461 -41656 -75432 -98507
18509i8507K5870P838J474J7673q604K3095L5835m636q613K7483k3715m946L561
$$ -98507 -72637 -64799 -63325 -45652 -54256 -31161 4674 38 -8575 18908 -4807 -9753 -6192
18496f192J6986k670l0224k9779P424K1125K590q806j1347j5580m970O243L947
$$ -6192 10794 8124 -22100 -51879 -44455 -23330 -20740 -29546 -40893 -56473 -61443 -55200 -51253
18483e1253J6181L6895n079j6468q155o558l517j0893J3972J4892n849r291K1583
$$ -51253 -35072 1823 -3256 -19724 -27879 -34437 -37954 -48847 -34875 -19983 -25832 -35123 -13540
18470a3540J2316j995M33j3183k5650k3581K3974L0699O009k6250k78n008R846
$$ -13540 -1224 -3219 -2786 -15969 -41619 -65200 -41226 -10527 -4518 -30768 -31046 -36054 -26208
18457b6208K6852M4258J6967j0124J5449J5700j3338N355N686l6988q306J8575
$$ -26208 644 44902 61869 51745 67194 82894 69556 74911 80597 43609 35303 53878
18445E3878O224j6426p763j2854J5630M771R811l7604l4772J6608J6745j2678
$$ 53878 60102 43676 35913 23059 38689 43460 53271 15667 -19105 -2497 14248 1570
18433A570r221j1198J0981n027l218j0755J3782O880l01J2394Q303k333r814m008
$$ 1570 -7651 -18849 -7868 -12895 -16113 -26868 -13086 -6206 -6507 5887 14190 11857 2043 -1965
18419a965J2698K6436j1923l621o620K0123K823j6921J231l1511j7803N247K1640
$$ -1965 10733 37169 25246 21625 15005 35128 37951 21030 22261 -9250 -27053 -21806 -166
18406a66J5405n796j7827J3246o247j4362j966j1550j0442J7504J1501R735k8649
$$ -166 15239 9443 -8384 4862 -1385 -15747 -17713 -29263 -39705 -22201 -10700 -965 -29614
18393b9614l0530P865K8198J4100l3984m385K5348O892j6539o381L0015j3928
$$ -29614 -60144 -52279 -24081 -9981 -43965 -48350 -23002 -16110 -32649 -39030 -9015 -22943
18381b2943k0658L8478M0127k663j031K6711j6967p534k3194j1753L850M911p482
$$ -22943 -43601 -5123 35004 32341 31310 58021 41054 33520 10326 -1427 2423 7334 -148
18368a48K2705j6748Q781k764N041K7858j6844k9926k4728K784o549k93J5778
$$ -148 22557 5809 14590 11826 16867 44725 27881 -2045 -26773 -23989 -30538 -30831 -15053
18355a5053L0952l260k3135J5034j0608k8934k4235l3122L682J9873L2824m792
$$ -15053 15899 12639 -10496 4538 -6070 -35004 -59239 -92361 -88679 -68806 -35982 -40774
18343d0774j6446R345K2848J8764j2707J0083j4637m623J3065O055j3985k1728
$$ -40774 -57220 -47875 -25027 -6263 -18970 -8887 -23524 -28147 -15082 -9027 -23012 -44740
18331d4740M227o110K2271J1867K605J1380J7947J8232M766j8073j8102J7156
$$ -44740 -40513 -46623 -24352 -12485 -9880 1500 19447 37679 42445 24372 6270 23426
18319B3426o060j7126O404k968j150k7964m080K2378J8836j5255j4515J6104j1971
$$ 23426 17366 240 6644 3676 2526 -25438 -29518 -7140 11696 -3559 -18074 -1970 -13941
18306a3941K4329j4325k4787R449j0204J1005R503j9268J8113J9961j0574j2349
$$ -13941 10388 -3937 -28724 -19275 -29479 -18474 -8971 -28239 -10126 9835 -739 -13088
18294a3088n31K7732J7049j1687k948J491o637m667J7k3176n27K2794J9222l1340
$$ -13088 -13619 14113 31162 19475 16527 18018 11381 6714 6731 -16445 -16972 5822 25044 -6296
18280f296j3877j0062L8812J7771j3619J400j5864j0719K7878K9841q323m8007
$$ -6296 -20173 -30235 8577 26348 12729 14129 -1735 -12454 15424 45265 36942 -11065
18268a1065m9830R964L1376j4741r616J1830r469J7385k2279k0326j3944J1941
$$ -11065 -60895 -50931 -19555 -34296 -43912 -32082 -41551 -24166 -46445 -66771 -80715 -68774
18256f8774L1604M157M60K850J5636K1312p845j4674M651J435q587M911K7324
$$ -68774 -37170 -33013 -32553 -29703 -14067 7245 -600 -15274 -10623 -9188 -17775 -12864 14460
18243A4460J5869k111K845k0354k1880K26K1498p534j4218P540m883q739J2249
$$ 14460 30329 28218 31063 10709 -11171 -10945 10553 3019 -11199 -3659 -8542 -17281 -5032
18230e032n19J0714j5043J2091L675J4076J5551N330K669j4965l2607m0493j1082
$$ -5032 -5551 5163 -9880 2211 5886 19962 35513 40843 43512 28547 -4060 -44553 -55635
18217e5635M2980L8154J2969N46o942M856l1357j8309m939K5154K2144j4905Q533
$$ -55635 -12655 25499 38468 39014 32072 36928 5571 -12738 -17677 7477 29621 14716 23249
18204B3249J3322j871P213j8198j8798L891J2614O563o543J1201J4551L754k4737
$$ 23249 36571 34700 41913 23715 4917 8808 21422 27985 21442 32643 47194 50948 26211
18191B6211k910J2559k359j4507P0K4627Q946l0306l3871K1988K6925M626j3584
$$ 26211 23301 35860 33501 18994 19064 43691 52637 22331 -11540 10448 37373 41999 28415
18178B8415J3017R919q584L560K3464j5493K6738K0698l0060j7310Q103j2910
$$ 28415 41432 51351 42767 46327 69791 54298 81036 101734 71674 54364 62467 49557
18166D9557P928Q577M802j3247n70K8393K367l9691q466j180K2232Q70k666o400
$$ 49557 57485 66062 70864 57617 57047 85440 87807 48116 39650 38470 60702 61572 58906 52506
18152E2506o359K2952K7300J5730j428l000J693L655j593O050K5050L1274J8807
$$ 52506 46147 69099 96399 112129 110701 107701 109394 113049 111456 117506 142556 173830 192637
18139A92637J575j3517L1567L6952j3407j8193L3036K3383K9642K1915J0526M6412
$$ 192637 194212 180695 212262 249214 235807 217614 250650 274033 303675 325590 336116 382528
18127C82528P5244Q2011O0501Q0876R3331R0600J24078J50214K08836K64256L38832
$$ 382528 457772 539783 600284 681160 774491 865091 989169 1139383 1348219 1612475 1951307
18116A951307M90314O95818J049638J805256L267476O139484R510212N519552
$$ 1951307 2441621 3137439 4187077 5992333 9259809 15399293 24909505 30429057
18108C0429057l19538n2270j259193o444581p097668l853388j780194p40671k56581
$$ 30429057 30109519 30057249 28798056 22353475 15255807 11402419 9622225 8881554 8624973
18099H624973j58905k46225m94619p06864p20427n83264m19264k88777j36432
$$ 8624973 8466068 8219843 7725224 7018360 6297933 5714669 5295405 5006628 4870196
18090D870196q8055k6873q9905j25153k31556l64650l59252l05315l05373l15052
$$ 4870196 4782141 4755268 4665363 4540210 4308654 3944004 3584752 3279437 2974064 2659012
18080B659012l05564k62082k54262k37534k08118j73689j24003j36395j00848
$$ 2659012 2353448 2091366 1837104 1599570 1391452 1217763 1093760 957365 856517
18071H56517q4581m9916m9845n9391o8926n9046m2432j7830k6147n4300j9575
$$ 856517 771936 722020 672175 612784 543858 484812 442380 424550 398403 344103 324528
18060C24528k5737q983m413j4716N366k7550n5214j5133p716l878J6084j066k4077
$$ 324528 298791 289808 285395 270679 276045 248495 193281 178148 170432 166554 182638 181572 157495
18047A57495n124P347j0395l1987k6099k377L0562L1081k2792k7808p355n238
$$ 157495 152371 159718 149323 117336 91237 88860 119422 150503 127711 99903 92548 87310
18035H7310J5545R237l6647k9880K1845L329J063j3682r717n121J4444j8957j0787
$$ 87310 102855 112092 75445 45565 67410 70739 71802 58120 48403 43282 57726 38769 27982
18022B7982P405o921J6297j4005J2696L932k8910m839j625J162j29P136M724P18
$$ 27982 35387 28466 44763 30758 43454 47386 18476 13637 12012 13174 13045 20181 24905 25623
18008B5623J5617j0965j5606p867l3016j0237J6422L8700J0403l4512J1920L6128
$$ 25623 41240 30275 14669 6802 -26214 -36451 -20029 18671 29074 -5438 6482 42610
17996D2610j1140k2411K0935L4686k4416j6692M453L391n656j4271j883k4366
$$ 42610 31470 9059 29994 64680 40264 23572 28025 31416 25760 11489 9606 -14760
17984a4760l7646p828N033L6836K0600P148J5185j3231j0680j965k1963J2879
$$ -14760 -52406 -60234 -55201 -18365 2235 9383 24568 11337 657 -1308 -23271 -10392
17972a0392L4571R437j1878J7420M869K092j8851j0262L081j3373k514K587K89
$$ -10392 24179 33616 21738 39158 44027 46119 27268 17006 20087 6714 4200 6787 7076
17959G076j2734J446R786k4665J6755K3995L817K885K803n957J661P159q926k6004
$$ 7076 -5658 -4212 5574 -19091 -2336 21659 25476 28361 31164 25207 26868 34027 25101 -903
17945i03q725J2430J9004q027m1497j365K3266M080j6296m816p03r933k3214j1964
$$ -903 -9628 2802 21806 13779 -27718 -29083 -5817 -1737 -18033 -22849 -23552 -33485 -56699 -68663
17931f8663k461R256L0884M6259L6773l3203m1949l3082L1258l085N54l093L7980
$$ -68663 -71124 -61868 -30984 15275 52048 18845 -23104 -56186 -24928 -28013 -27459 -30552 7428
17918G428J8378j4523j8785J925R288l939P281j9944o500p270J1330k4082k3203
$$ 7428 25806 11283 -7502 -5577 3711 -228 7053 -12891 -19391 -26661 -15331 -39413 -62616
17905f2616J1021j6635L673j4211K2546J359r657l873L2896J6674j0690p757Q159
$$ -62616 -51595 -68230 -64557 -78768 -56222 -54863 -64520 -68393 -35497 -18823 -29513 -37270 -29111
17892b9111o3L164j3355l133L3113J3821O336J3317j210k096j9684Q82R200m567
$$ -29111 -29174 -26010 -39365 -42498 -9385 4436 10772 24089 22879 20783 1099 1981 11181 6614
17878F614K2820L6944N425k8672m0745o067r231k1341K8846j6194k9972M045J1403
$$ 6614 29434 66378 71803 43131 2386 -3681 -12912 -34253 -5407 -21601 -51573 -47528 -36125
17865c6125J5915J198k637j2107L577K0303K447L6348r635n1626p667l591L7100
$$ -36125 -20210 -19012 -21649 -33756 -30179 -9876 -7429 28919 19284 -32342 -40009 -43600 -6500
17852f500M4996j917J1524k6208k6311J4264p432k0756j9813J6287Q031J3789
$$ -6500 38496 36579 48103 21895 -4416 9848 2416 -18340 -38153 -21866 -13835 -46
17840d6l499q793j3631K9207j0124r955r9r33m328j3747K787J2877j3437k7535
$$ -46 -3545 -12338 -25969 3238 -6886 -16841 -16940 -17873 -22201 -35948 -33161 -20284 -33721 -61256
17826f1256j0886J5145J0597R859Q678J2503J813k0680j9600M2535K8111j4923
$$ -61256 -72142 -56997 -46400 -36541 -27863 -15360 -13547 -34227 -53827 -11292 16819 1896
17814A896n0104L370J3399m082j6448L2330l923l1279K7894K271j5551k2463K8169
$$ 1896 -48208 -44838 -31439 -35521 -51969 -19639 -23562 -54841 -26947 -24676 -40227 -62690 -34521
17801c4521K942j3060J111j0382K263M1568J5841m9021J469M673j1661J8621K6570
$$ -34521 -31579 -44639 -43528 -53910 -51647 -10079 5762 -43259 -41790 -37117 -48778 -30157 -3587
17788c587k1426l1326J137K1034l1685P634L2350J0462k6206j8244K2053j565
$$ -3587 -25013 -56339 -55202 -34168 -65853 -58219 -25869 -15407 -41613 -59857 -37804 -39369
17776c9369k6989m366L0992L797m804K8606R831J366k9855p67j0078l6940K2196
$$ -39369 -66358 -70724 -39732 -35935 -40739 -12133 -2302 -936 -30791 -31558 -41636 -78576 -56380
17763e6380j0131L0393J8166j311k9413o465K2781Q887J306m417J2808r454K319
$$ -56380 -66511 -36118 -17952 -19263 -48676 -55141 -32360 -23473 -22167 -26584 -13776 -23230 -20911
17750b0911j1664j2857L31k849P164J1250Q584K4973K211k3849j4822L934r034
$$ -20911 -32575 -45432 -45101 -47950 -40786 -29536 -20952 4021 6232 -17617 -32439 -28505 -37539
17737c7539J9536j1801k1909j722N99N261K1259K6306L133K079p991q345r722
$$ -37539 -18003 -29804 -51713 -53435 -52836 -47575 -26316 -10 3123 5202 -2789 -11134 -20856
17724b0856m0301K54M2255O542L6836K65l2133O979l485j4046l083p10J2961P939
$$ -20856 -61157 -60903 -18648 -12106 24730 24995 -7138 -159 -3644 -17690 -20773 -21483 -8522 -583
17710e83m16n350o145P769R501m258j4403m539M801J404j4774q579j6207M890
$$ -583 -999 -6349 -12494 -4725 4776 518 -13885 -18424 -13623 -12219 -26993 -35572 -51779 -46889
17696d6889o311J8496R101j5514j8078l5639k5887J6036M1267N9579P096M10q895
$$ -46889 -53200 -34704 -25603 -41117 -59195 -94834 -120721 -104685 -63418 -3839 3257 3667 -5228
17683e228M007N557M027Q440k678K380k3313n0747j4389J9841L2829q059j4381
$$ -5228 -1221 4336 8363 16803 14125 16505 -6808 -57555 -71944 -52103 -19274 -27333 -41714
17670d1714J157J8619K2381j0862K1048J553j0490n973n895J3590J6280k002j0751
$$ -41714 -40557 -21938 443 -10419 10629 12182 1692 -4281 -10176 3414 19694 17692 6941
17657F941P094L2325m132k9999j7550k0385J3185O786J655j5524J5171j0426k4671
$$ 6941 14035 46360 42228 12229 -5321 -25706 -12521 -5735 -4080 -19604 -4433 -14859 -39530
17644c9530Q285J0616K1136K4967o941j3332j2527J1302n775j2406J6136j2125
$$ -39530 -31245 -20629 507 25474 18533 5201 -7326 3976 -1799 -14205 1931 -10194
17632a0194j1584k591n843Q821Q401J0723k1022m625k2430N710K6464n786k6152
$$ -10194 -21778 -24369 -30212 -21391 -12990 -2267 -23289 -27914 -50344 -44634 -18170 -23956 -50108
17619e0108M88J225Q164L6824K0240m145k844K1470j1514l1134k3772l5034M919
$$ -50108 -49620 -48395 -40231 -3407 16833 12688 9844 31314 19800 -11334 -35106 -70140 -65221
17606f5221j446K2647K6914j1603k484K7826K0210K1267P442J2354o333k5903
$$ -65221 -66667 -44020 -17106 -28709 -31193 -3367 16843 38110 45552 57906 51573 25670
17594B5670k7276m7660j8334K1676L4210M1555J3222k4410J1757j3365J45p423
$$ 25670 -1606 -49266 -67600 -45924 -11714 29841 43063 18653 30410 17045 17190 9767
17582I767j149k5148p40o183n961j465p450j2230J146L6819o13j6779j6186j2697
$$ 9767 8618 -16530 -17270 -23453 -29414 -30879 -38329 -50559 -49413 -12594 -13207 -29986 -46172 -58869
17568e8869J1926n808J3399J4995O336j1524K1468K0524j132j1802P018j8903
$$ -58869 -46943 -52751 -39352 -24357 -18021 -29545 -8077 12447 11315 -487 6531 -12372
17556a2372k7540o652k2422L1242j3112j2466j81l777R240K7961j4217j5878Q690
$$ -12372 -39912 -46564 -68986 -37744 -50856 -63322 -63503 -67280 -58040 -30079 -44296 -60174 -51484
17543e1484J8914P561J4045k1314K877J6297o96r582o435K289n587N769l6196
$$ -51484 -32570 -25009 -10964 -32278 -29401 -13104 -13800 -23382 -29817 -27528 -33115 -27346 -63542
17530f3542J296m141K6420J4615N970l984k0988J2921K571n773q960j936j395
$$ -63542 -62246 -66387 -39967 -25352 -19382 -23366 -44354 -31433 -28862 -34635 -43595 -45531 -46926
17517d6926o277K272J5840L5092L0746r94L299l43k6629J4911R937l8041l4830
$$ -46926 -53203 -50931 -35091 1 30747 29753 33052 32709 6080 20991 30928 -7113 -41943
17504d1943o172J1648k2210k0217J4232J9277J7278k993k057k492R786N167P468
$$ -41943 -48115 -36467 -58677 -78894 -64662 -45385 -28107 -31100 -33157 -35649 -25863 -20696 -13228
17491a3228J1322J3563p645j8104j370l0926l9668l608L2069k608N136K572j0490
$$ -13228 -1906 11657 4012 -14092 -15462 -46388 -86056 -89664 -57595 -60203 -55067 -52495 -62985
17478f2985J023L801O446P266J9003j4444j0818J1921K3285N922O251k3135k0227
$$ -62985 -61962 -58161 -51715 -44449 -25446 -39890 -50708 -38787 -15502 -9580 -3329 -26464 -46691
17465d6691J5211r870K823J9708M4117j4771j6931K197p823j096J4145n17j1153
$$ -46691 -31480 -41350 -38527 -18819 25298 10527 -6404 -4207 -12030 -13126 1019 502 -10651
17452a0651P26k1353j2484q537J2607M7492P1680M614K7M6713M7603K2633m0527
$$ -10651 -9925 -31278 -43762 -52299 -39692 7800 79480 84094 84121 130834 178437 201070 160543
17439A60543l2360m8671m2664O273M1538l433j7908j2612m1120k4076r541J7011
$$ 160543 128183 79512 36848 43121 84659 81226 63318 50706 9586 -14490 -24031 -7020
17427g020L0015j160k1889N985K2569j9611k0812J9300K2686j4458j9637K4518
$$ -7020 22995 21835 -54 5931 28500 8889 -11923 7377 30063 15605 -4032 20486
17415B0486J0647l3611J9564J3269L969K7889l117o583k9761j0126j1047j9545
$$ 20486 31133 -2478 17086 30355 34324 62213 59096 52513 22752 12626 1579 -17966
17403a7966J7143K0o089r499p337J7719J2299j1602k2219j8226K3739J4417K1572
$$ -17966 -823 -803 -6892 -16391 -23728 -6009 6290 -5312 -27531 -45757 -22018 -7601 13971
17390A3971O93j8804m3365K0857J6568O129J6243j0670k8491p890l502j0911k3422
$$ 13971 14664 -4140 -47505 -26648 -10080 -3951 12292 1622 -26869 -34759 -38261 -49172 -72594
17377g2594K40K0112K2028j0974J0398K6582M923p133j4439J993J9642j5073j6000
$$ -72594 -72354 -52242 -30214 -41188 -30790 -4208 715 -6418 -20857 -18864 778 -14295 -30295
17364c0295l5270J2235J2852N307m143j977L486J8155K3195j9922m228J1644p319
$$ -30295 -65565 -53330 -40478 -35171 -39314 -41291 -37805 -19650 3545 -16377 -20605 -8961 -16280
17351a6280R302p21j3116q138J7127o494p253L511K4549l5674k3608M2268L7595
$$ -16280 -6978 -7699 -20815 -28953 -11826 -18320 -25573 -22062 2487 -33187 -56795 -14527 23068
17338B3068l420n006l666L844J1057M907k5330k28N644l1219J2158M158k1679
$$ 23068 19648 14642 10976 14820 25877 30784 5454 5226 10870 -20349 -8191 -4033 -25712
17325b5712j3127K2926J3669j4739J5353K0644j3037j1232m921L7381O038m2333
$$ -25712 -38839 -15913 -2244 -16983 -1630 19014 5977 -5255 -10176 27205 33243 -9090
17313i090j1582j8047j5175m67K1028J3230j184J0312K3732n454j4520J0779L0238
$$ -9090 -20672 -38719 -53894 -54361 -33333 -20103 -21287 -10975 12757 7303 -7217 3562 33800
17300C3800M46k0483q82N664R645k5658j2222J1542J9356J0805J2891r311n374
$$ 33800 34246 13763 12881 18545 28190 2532 -9690 1852 21208 32013 44904 35593 30219
17287C0219j6149l973k0146k8295J6350R519J6286J0582r027J4267K3314k0282
$$ 30219 14070 10097 -10049 -38344 -21994 -12475 3811 14393 5366 19633 42947 22665
17275B2665l4710j1373N563J4959K5169k2764l8854n931K9717K7758N705J691
$$ 22665 -12045 -23418 -17855 -2896 22273 -491 -39345 -45276 -15559 12199 17904 19595
17263A9595j7154k3458N382J2431j8472k68J4097R059J378K07K7614j0024m2403
$$ 19595 2441 -21017 -15635 -3204 -21676 -21944 -7847 1212 2590 2797 30411 20387 -22016
17250b2016m614q547l1421o330K9421N3176J176J3626M978j9714j8168Q700k527
$$ -22016 -26630 -35177 -66598 -72928 -43507 9669 10845 24471 29449 9735 -8433 267 -2260
17237b260M591K0620L243l6947j2428K2373K2224r530l3160J0315J0823K6310
$$ -2260 2331 22951 26194 -10753 -23181 -808 21416 11886 -21274 -10959 -136 26174
17225B6174p980L028K5353K1720M195k7405j8522M474Q54l1139j0948o414K527
$$ 26174 18194 21222 46575 68295 72490 45085 26563 31037 31891 752 -10196 -16610 -14083
17212a4083L2768r510j1745R114J6960l1328k1592M1192J0301k984M9103j0797
$$ -14083 18685 9175 -2570 6544 23504 -7824 -29416 11776 22077 19093 68196 57399
17200E7399j1170J463k8139J0690l238m5643j9674J5702J3256K2655j6136j5527
$$ 57399 46229 47692 19553 30243 27005 -18638 -38312 -22610 -9354 13301 -2835 -18362
17188a8362N92K5611J6387k3902p55L1823K1650k7424m5180J993o557k5247j8513
$$ -18362 -17770 7841 24228 326 -429 31394 53044 25620 -19560 -17567 -24124 -49371 -67884
17175f7884Q376K2461l706K325K3246r297j0705J8422L455l4352O502J6580o22
$$ -67884 -59508 -37047 -40753 -38428 -15182 -24479 -35184 -16762 -13307 -47659 -41157 -24577 -25199
17162b5199m969j0839M7k8929J3800M7160J9441k9338l4995k6618K4241L6862
$$ -25199 -30168 -41007 -40960 -69889 -56089 -8929 10512 -18826 -53821 -80439 -56198 -19336
17150a9336J7766N3027M1843K980J9926K0864M555K4223K8981k2198j8291j8183
$$ -19336 -1570 51457 93300 96280 116206 137070 141625 165848 194829 172631 154340 136157
17138A36157j5757l969k1254o490P044Q227N475l7812j9538j5739Q551Q219j2521
$$ 136157 120400 116431 95177 88687 95731 103958 109433 71621 52083 36344 44895 53114 40593
17125D0593p262P488j1119k1872k2456o397n392L7410J5619k3950K2099L3186
$$ 40593 33331 40819 29700 7828 -14628 -21025 -26417 10993 26612 2662 24761 57947
17113E7947J7439k1936k8703k7974j231p595o194K9336J810j7391j9930K3794
$$ 57947 75386 53450 24747 -3227 -4458 -12053 -18247 11089 12899 -4492 -24422 -628
17101f28L085q555n468R956O378j5356K022J1297N276k3690K8428O3041L8353
$$ -628 2457 -6098 -11566 -1610 4768 -10588 -8566 2731 8007 -15683 12745 75786 114139
17088A14139R570K1087j752j7147J2023j5054k7308N318J3542l691l6337j5142
$$ 114139 123709 144796 143044 125897 137920 122866 95558 100876 114418 110727 74390 59248
17076E9248J4931m230j2092r08N939J081j8742M839L369N053M513n711n2549k3928
$$ 59248 74179 69949 57857 56949 62888 63969 45227 50066 53435 58488 63001 57290 4741 -19187
17062a9187J2884L4952L567M135j5365l955O562j0227n884K3157k700k2090r608
$$ -19187 -6303 28649 32216 36351 20986 17031 23593 13366 7482 30639 27939 5849 -3759
17049c759j3602k06K1147J9635J2281J0751J9920o174k4197r480k5993k0030q976
$$ -3759 -17361 -17567 3580 23215 35496 46247 66167 59993 35796 26316 323 -19707 -28683
17036b8683j5516k982J1022L0199Km447P15P600j867k1534J9284K297J1246J9410
$$ -28683 -44199 -47181 -36159 -5960 -5958 -10405 -9690 -2090 -3957 -25491 -6207 -3910 7336 26746
17022B6746J8865L470P81j1672j7624L20k893k5869k3476Q316K875K79P050j2154
$$ 26746 45611 49081 49862 38190 20566 20886 17993 -7876 -31352 -23036 -20161 -19882 -12832 -24986
17008b4986J9102K1211l651o244j0374j0374K033K5854J2507o223j1157n605J1688
$$ -24986 -5884 15327 11676 5432 -4942 -15316 -13283 12571 25078 18855 7698 2093 13781
16995A3781j4705k1017M532m024j8130Q099q03L429K6264J1539k3492m0259J1646
$$ 13781 -924 -21941 -17409 -21433 -39563 -31464 -32267 -28838 -2574 8965 -14527 -54786 -43140
16982d3140L5348J2260N806r730o325L4066K1166k5640j5048K160R172o652P711
$$ -43140 -7792 4468 10274 544 -5781 28285 49451 23811 8763 10923 20095 13443 21154
16969B1154P182O253j3689l0919k9972K064K6547K0082K6741l592k1222k376k8
$$ 21154 28336 34589 20900 -10019 -39991 -37927 -11380 8702 35443 31851 10629 8253 8225
16956H225k9095O072K8705n186J1135M00j2092j2879k3410q300p516O196J0315
$$ 8225 -20870 -14798 13907 8721 19856 20256 8164 -4715 -28125 -36425 -43941 -37745 -27430
16943b7430j9584L939J2177K2528L1479n42j9619R892p056j0889K723J7835M562
$$ -27430 -47014 -43075 -30898 -8370 23109 22567 2948 12840 5784 -5105 -2382 15453 20015
16930B0015M208O310L641K6773o949k7202k0271O487j9577P622K857J93R932J4876
$$ 20015 24223 30533 34174 60947 53998 26796 6525 13012 -6565 1057 3914 4107 14039 28915
16916B8915N02J1304j6918k1817L6807O512R76k1105J0740J6216j8968l0166L765
$$ 28915 29417 40721 23803 1986 38793 45305 46281 25176 35916 52132 33164 2998 6763
16903F763J0301q518k2358l3910K9963K0803Q079k9490p729L0770J2286J2392
$$ 6763 17064 8546 -13812 -47722 -17759 3044 11123 -18367 -26096 4674 16960 29352
16891B9352J0783J6814J2385O722r489J294J2664k5280j1981j7024p446J1695
$$ 29352 40135 56949 69334 76056 66567 67861 80525 55245 43264 26240 18794 30489
16879C0489J3320J0976p99k3270K4753K0410l3613k5437Q565q690l1934j1132
$$ 30489 43809 54785 53986 30716 55469 75879 42266 16829 25394 16704 -15230 -26362
16867b6362J0764l059k0396J0941L3367k6053j8357N563N008Q415M656O250j1433
$$ -26362 -15598 -18657 -39053 -28112 5255 -20798 -39155 -33592 -28584 -20169 -15513 -9263 -20696
16854b0696p504k975K2844L0175M122k2108j265Q59j2213J633N704m962M02J3335
$$ -20696 -28200 -31175 -8331 21844 25966 3858 2593 3452 -8761 -7128 -1424 -6386 -5984 7351
16840G351O003J2819P729K4070J5653j2287k5763K0940K2040J1280Q399K2212
$$ 7351 13354 26173 33902 57972 73625 61338 35575 56515 78555 89835 98234 120446
16828A20446j0846l7572K310K0785r820l3874j7097j9866k4230K381K420m690
$$ 120446 109600 72028 74338 95123 85303 51429 34332 14466 -9764 -7383 -4963 -9653
16816i653p685M332K9321J8217o775J4648K870m2077k309j578Q618k3139j789
$$ -9653 -17338 -13006 16315 34532 27757 42405 45275 3198 889 -689 7929 -15210 -16999
16803a6999L374L2822K6487J0876k0640j3646M857j383l3515O084K106j0871K1282
$$ -16999 -13625 19197 45684 56560 35920 22274 27131 25748 -7767 -1683 423 -10448 10834
16790A0834K0622M145k8273J4243J8317P720M031Pj4487k3419L284j1416J4390
$$ 10834 31456 35601 7328 21571 39888 47608 51639 51646 37159 13740 17024 5608 19998
16777A9998L978k0755j218j5611N111J3479J0185k1527k1199J5433L7670K2406
$$ 19998 23976 3221 2003 -13608 -8497 4982 15167 -6360 -27559 -12126 25544 47950
16765D7950j3499j4412J5548l170l569j5743K5691M974o941K8001L297P577J4415
$$ 47950 34451 20039 35587 32417 28848 13105 38796 43770 36829 64830 68127 75704 90119
16752I0119j278o910l7688j0974K681Q761J2205J7175r068l155P930j3621M300
$$ 90119 88841 81931 44243 33269 35950 44711 56916 74091 65023 61868 69798 56177 60477
16739F0477k2372O252L7331J0171l046j1450O242J2818o596n456Q834k80k1710
$$ 60477 38105 44357 81688 91859 88813 77363 83605 96423 89827 84371 93205 92925 71215
16726G1215J9399L7678J7876j5453m1112j2412j3846P967J647j0982j2323m827
$$ 71215 90614 128292 146168 130715 89603 77191 63345 71312 72959 61977 49654 44827
16714D4827J324j0771K854M8458J5896j4948p737K5658L1446J1785k8223r450
$$ 44827 46151 35380 38234 86692 102588 87640 79903 105561 137007 148792 120569 111119
16702A11119J3376J4364l911L583Q707K4675K0621J8476l511k3550j7178K7894
$$ 111119 124495 138859 134948 138531 147238 171913 192534 211010 207499 183949 166771 194665
16690A94665o00j1488k781l386J7938L7309O558k421R091q160n755j5493j6067
$$ 194665 194065 182577 179796 176410 194348 231657 238215 235794 244885 236725 230970 215477 199410
16677A99410P467J3375l795J4127l2696J305N7811L4796j5738l037J8151L5060
$$ 199410 206877 220252 216457 230584 197888 199193 257004 291800 276062 273025 291176 326236
16665C26236L09K1581M9197K7637L0367N9450M6448J0264P975K2724M9288R3528
$$ 326236 326545 348126 397323 424960 455327 514777 561225 571489 579464 602188 651476 745004
16653G45004Q2118P2315J11394O0195O8860N6497P0932J19185J51856J72121K04455
$$ 745004 827122 899437 1010831 1071026 1139886 1196383 1267315 1386500 1538356 1710477 1914932
16642A914932K75453L56492M60493O70825R86501J448968K213294L450496M783068
$$ 1914932 2190385 2546877 3007370 3678195 4664696 6113664 8326958 11777454 16560522
16633A6560522N353063M632743L532016K947869K454872J195149n02157j698934
$$ 16560522 21913585 26546328 30078344 33026213 35481085 36676234 36174077 34475143
16625C4475143k285789l042794l920342l965459l166281k189845j466279j047545
$$ 34475143 32189354 29146560 25226218 21260759 18094478 15904633 14438354 13390809
16617A3390809p88391o82062o66879o84529o31391n41440m66538l90990l65471
$$ 13390809 12602418 11920356 11253477 10568948 9937557 9396117 8929579 8538589 8173118
16608H173118l61521l42877l31256l64763l82674m10408m62045m86779m13589
$$ 8173118 7811597 7468720 7137464 6772701 6390027 5979619 5517574 5030795 4617206
16599D617206l44503l06920k90050k52380k20284j79539j50757j17813r0172j4725
$$ 4617206 4272703 3965783 3675733 3423353 3203069 3023530 2872773 2754960 2664788 2650063
16589B650063j0407J4492N9986J22341K31601L62250M80379O71854J029821J604815
$$ 2650063 2639656 2654148 2714134 2836475 3068076 3430326 3910705 4582559 5612380 7217195
16579G217195K471495L691820M832607N029724M045054L043901K603866J943256
$$ 7217195 9688690 13380510 18213117 23242841 27287895 30331796 32935662 34878918
16571C4878918N51146r91886j950991k475876l239244l937733l692052k725126
$$ 34878918 35430064 34438178 32487187 30011311 26772067 22834334 19142282 16417156
16563A6417156j813628j246502q81928p25734o68932o63690o16588n82040n02096
$$ 16417156 14603528 13357026 12475098 11749364 11080432 10416742 9800154 9218114 8716018
16554H716018m47115l68808l61812l53454l58635l45813l98194m51622m79151
$$ 8716018 8268903 7900095 7538283 7184829 6826194 6480381 6082187 5630565 5151414
16545E151414m60790m17109m02281m05576l63396l35005k78169k56722k57776
$$ 5151414 4690624 4273515 3871234 3465658 3102262 2767257 2489088 2232366 1974590
16536A974590k11964j49357j39182j04905j10802j09845p5313r3575p3564n3919
$$ 1974590 1762626 1613269 1474087 1369182 1258380 1148535 1073222 979647 906083 852164
16526H52164n5850o1310p4055o5075m2164l4004k9424k4904q527l0733n2174m7686
$$ 852164 796314 735004 660949 595874 553710 519706 490282 465378 456851 426118 373944 326258
16514C26258J59L717j7605l3389j5718m2184o499o295j4389K661k107j6636J127
$$ 326258 326417 330134 312529 279140 263422 221238 214739 208444 194055 196716 194609 177973 179100
16501A79100j2138k4833j8611J3592N845k8352j9845J544l338j4612J3705R427
$$ 179100 166962 142129 123518 137110 142955 114603 94758 96302 92964 78352 92057 101484
16489A01484l5412k545J1859J2946K083J5390J1387K1242j1104k19J4914J860
$$ 101484 66072 63527 75386 88332 90415 105805 117192 138434 127330 127111 142025 143885
16477A43885l5201m0314K883N510j027m734p648R689p373k6660k3387J154K3450
$$ 143885 108684 68370 71253 76763 75736 71002 63354 73043 65670 39010 15623 16777 40227
16464D0227Q186J8672J3629m402J0360k1341J1575M04k6454Q066l854R702J2400
$$ 40227 48413 67085 80714 76312 86672 65331 76906 77310 50856 58922 55068 64770 77170
16451G7170R473J0728r322j865L224l458r617j8724l8969J0716J7410m529j959
$$ 77170 86643 97371 88049 86184 89408 85950 76333 57609 18640 29356 46766 42237 40278
16438D0278l6367r758L3387L5994n64l6991r019R391J445K5168p839R492j777
$$ 40278 3911 -5847 27540 63534 62970 25979 16960 26351 27796 52964 45125 54617 52840
16425E2840J610j550q299K2763J2724k3033k0736j4P475J1461j4367q413J8443
$$ 52840 54450 52900 44601 67364 80088 57055 36319 36305 43780 55241 40874 32461 50904
16412E0904K1884j4973k7745J1886k260j4227k0802J4619K6670J2555m080n584
$$ 50904 72788 57815 30070 41956 39696 25469 4667 19286 45956 58511 54431 48847
16400D8847N917n062q130j0770j2952J7860O446j3810Q631J8903l861l1646j702
$$ 48847 54764 49702 41572 30802 17850 35710 42156 28346 36977 55880 52019 20373 18671
16387A8671J0472K9681j4856l4640j5750K1183Q353J2408j1907k025K4972R32
$$ 18671 29143 58824 43968 9328 -6422 14761 23114 35522 23615 21590 46562 47494
16375D7494l0179j1542J0323K013l498j7697j8771k8127K2441P661J9225J1451
$$ 47494 17315 5773 16096 18109 14611 -3086 -21857 -49984 -27543 -19882 -657 10794
16363A0794k935P086j2041j2520l717k08M813j4889p783R461K3610N66J4546m770
$$ 10794 7859 14945 2904 -9616 -13333 -13541 -8728 -23617 -31400 -21939 1671 2237 16783 12013
16349A2013q506j4776j5609j485J593J7375K0271J4673o962J4308K3872l720m9014
$$ 12013 3507 -11269 -26878 -28363 -26770 -9395 10876 25549 18587 32895 56767 53047 4033
16336D033l1278J748l985J2233q413K085J6638J0086j05j3487K3809m275k8101
$$ 4033 -27245 -25497 -29482 -17249 -25662 -23577 -6939 3147 3042 -10445 13364 9089 -19012
16323a9012j572J5786j1377j3315j6095O41o932j6318J6166R740j2308L187J3650
$$ -19012 -20584 -4798 -16175 -29490 -45585 -44944 -51876 -68194 -52028 -42288 -54596 -51409 -37759
16310c7759J5799K2592j7035k3187k5716O850K8250M7656K0042m7695j9541J4628
$$ -37759 -21960 632 -16403 -39590 -65306 -58456 -30206 17450 37492 -10203 -29744 -15116
16298a5116Q903j5852O570j136O473n563j7061J021l22k4548l1606k8544Q71J3290
$$ -15116 -6213 -22065 -15495 -16631 -10158 -15721 -32782 -31761 -32083 -56631 -88237 -116781 -115910 -102620
16284a02620m81K2425J6447l786M869O793K2241j2543k2687J6550R133K1014K9283
$$ -102620 -103101 -80676 -64229 -68015 -63146 -56353 -34112 -46655 -69342 -52792 -43659 -22645 6638
16271F638Q428Q355M474j2642k6355j4141m084j6549j661J9897L4109p552k515
$$ 6638 15066 23421 27895 15253 -11102 -25243 -29327 -45876 -47537 -27640 6469 -1083 -3598
16258c598j772L248j7336J0865Q367k2191J2859q520L0612p762j0963l4974n055
$$ -3598 -5370 -2122 -19458 -8593 -226 -22417 -9558 -18078 12534 4772 -6191 -41165 -46220
16245d6220L8320o665j686j0309j2568R642J525K8189J0197p667j895j5804p186
$$ -46220 -7900 -14565 -16251 -26560 -39128 -29486 -27961 228 10425 2758 863 -14941 -22127
16232b2127k305K047r335k1371J5361j9053j8318q826K151K6870R042J5256M942
$$ -22127 -24432 -22385 -31720 -53091 -37730 -56783 -75101 -83927 -81776 -54906 -45864 -30608 -25666
16219b5666O093j5649L076M611n667O787J1432k1861j2430j5341K4849J4121j4228
$$ -25666 -19573 -35222 -32146 -27535 -33202 -26415 -14983 -36844 -49274 -64615 -39766 -25645 -39873
16206c9873R12L314J8698l312J2507J4606q058k5142O148J400J906q003J5033
$$ -39873 -38961 -35647 -16949 -20261 -7754 6852 -1206 -26348 -20200 -18800 -16894 -24897 -9864
16193i864J7968o001K1901J5941j5197K0355j8124l5745J1373p88r912K503m293
$$ -9864 8104 2103 24004 39945 24748 45103 26979 -8766 2607 1819 -8093 -5590 -9883
16180i883J478p262K9223N078J4509O645j5545j2049o177R984P490k9414q992
$$ -9883 -8405 -15667 13556 18634 33143 39788 24243 12194 6017 16001 23491 -5923 -14915
16167a4915k4101K0325J3681k4665m534J8211l605j8052N352q226r089K8314M1081
$$ -14915 -39016 -18691 -5010 -29675 -34209 -15998 -19603 -37655 -32303 -40529 -49618 -21304 19777
16154A9777r01k6382j8245j4172p780j0218K3615R816p863J5430J7973N138j5612
$$ 19777 18876 -7506 -25751 -39923 -47703 -57921 -34306 -24490 -32353 -16923 1050 6188 -9424
16141i424q474M788J314p583K8642P488N456k516l121K4081j1482j7196j6626
$$ -9424 -17898 -13110 -11796 -19379 9263 16751 22207 19691 16570 40651 29169 11973 -4653
16128d653j202j8659l6579L5356K9086J5963j350k8380l7085J2787K2185L3835
$$ -4653 -5855 -24514 -61093 -25737 3349 19312 17962 -10418 -47503 -34716 -12531 21304
16116B1304J2091l1J1373L9502K2821J0549K0567J1276O04k1688J298K4915J7641
$$ 21304 33395 33364 44737 84239 107060 117609 138176 149452 150056 128368 129666 154581 172222
16103A72222n6465m3917j9082K0759J382m2759m339O894j5109K8589K6645k6281
$$ 172222 115757 71840 52758 73517 74899 32140 27801 34695 19586 48175 74820 48539
16091D8539l2251O560j5856o774m518J6822J6580J0281l757j4633j5533l687J0749
$$ 48539 16288 22848 6992 218 -4300 12522 29102 39383 35626 20993 5460 1773 12522
16078A2522j352j0870K1222J3086k005j3297j3014k421R243K297k572k4196k9230
$$ 12522 11170 300 21522 34608 32603 19306 6292 3871 13114 15411 12839 -11357 -40587
16065d0587Q806K8691M9123L0114j9097l5001Q592O994M8478L5505L540R475L0541
$$ -40587 -31781 -3090 46033 76147 57050 22049 30641 37635 86113 121618 125158 134633 165174
16052A65174L6850r847l3573k084J2732k69j7761l5180k0468m4814k8410m206
$$ 165174 202024 192177 158604 156520 169252 168983 151222 116042 95574 50760 22350 18144
16040A8144K7141J2360j0381K8789O367j3712k445Q361J0204J9588k3154l2806
$$ 18144 45285 57645 47264 76053 82420 68708 66263 74624 84828 104416 81262 48456
16028D8456K51q160j4572j1341j896J8994q966k3211K350J8885j1977p006M093
$$ 48456 48707 40547 25975 14634 12738 31732 22766 -445 1905 20790 8813 1807 5900
16015E900M971j2360J4910o867q271P160k073j993j0809L4260j4640k8473k3051
$$ 5900 10871 -1489 13421 6554 -1717 5443 3370 1377 -9432 24828 10188 -18285 -41336
16002d1336P60L38J0360J6030K1408Q430m9394l7994K7014J8945j4971j3314j7922
$$ -41336 -40576 -40238 -29878 -13848 7560 15990 -33404 -71398 -44384 -25439 -40410 -53724 -71646
15989g1646Q988K3544J3598J569K0348p742n712q965l620J0272r406n50j7618
$$ -71646 -62658 -39114 -25516 -23947 -3599 -11341 -17053 -26018 -29638 -19366 -28772 -29322 -46940
15976d6940j8035q375r853J0220r314K7313q677k3563J4459L6614L446O716j811
$$ -46940 -64975 -73350 -83203 -72983 -82297 -54984 -63661 -87224 -72765 -36151 -32705 -25989 -27800
15963b7800j4472k4478J7699M0040Q335J575O652l4365k8799J0553L2732K5089
$$ -27800 -42272 -66750 -49051 -9011 -676 899 7551 -26814 -55613 -45060 -12328 12761
15951A2761j4395l6759q831J1430k5487l971K4762Q115l016J0666m663J6450P962
$$ 12761 -1634 -38393 -47224 -35794 -61281 -65252 -40490 -32375 -35391 -24725 -29388 -12938 -4976
15938d976j034k6938k1980J6569K0095l079l816j2389l7979J745P75J5874J2021
$$ -4976 -6010 -32948 -54928 -38359 -18264 -21343 -25159 -37548 -75527 -73782 -73007 -57133 -45112
15925d5112R237J3738K1983j5771l208k101n0J1759o962J8518L295K822j1370
$$ -45112 -35875 -22137 -154 -15925 -19133 -21234 -21284 -9525 -16487 2031 5326 8148 -3222
15912c222p72J8877j2755K1182j0514k6038K148K0379r672j8810l671K292j0067
$$ -3222 -3994 14883 2128 23310 12796 -13242 -11094 9285 -387 -19197 -22868 -20576 -30643
15899c0643N184M085j8554P763K0036J0135k5750k7983j6096m788p886K8747L1515
$$ -30643 -25459 -21374 -39928 -32165 -12129 -1994 -27744 -55727 -71823 -76611 -84497 -55750 -24235
15886b4235L5247o101j1342J8346k7976L133j6663k3618q353J1657J9392M937
$$ -24235 11012 4911 -6431 11915 -16061 -12928 -29591 -53209 -61562 -49905 -30513 -25576
15874b5576l186J0978k1172Q75M766l1650j4920M3710N4028P169P15k2853k9401
$$ -25576 -28762 -17784 -38956 -38081 -33315 -64965 -79885 -36175 17853 25022 25737 2884 -26517
15861b6517R830k5030j6750K7202L7379k118m888K2823j8161k5323J4512O650
$$ -26517 -16687 -41717 -58467 -31265 6114 3996 -892 21931 3770 -21553 -7041 -391
15849c91J8658o595k0468p47O794J3045L7779k1205l0483k600j8641j6811K2245
$$ -391 18267 11672 -8796 -9543 -2749 10296 48075 26870 -3613 -6213 -24854 -41665 -19420
15836a9420K4657K6532l227j3373M120K2030k3393o012k5523j5908J6637k987
$$ -19420 5237 31769 28542 15169 19289 41319 17926 11914 -13609 -29517 -12880 -15867
15824a5867k762K345L6818m0115j0466R731J0303r212k249o264o81j4616K7346
$$ -15867 -18629 -16284 20534 -19581 -30047 -20316 -10013 -19225 -21474 -27738 -28419 -43035 -15689
15811a5689J4353l4321j6065L189J5419r50L5602j2290q411M8455J292l2830j2076
$$ -15689 -1336 -35657 -51722 -48533 -33114 -34064 1538 -10752 -19163 29292 30584 -2246 -14322
15798a4322N313M2597J505n829l9676q935K7270J6313j7059J0449j1713l857q073
$$ -14322 -9009 33588 35093 29264 -10412 -19347 7923 24236 7177 17626 5913 2056 -6017
15785f017j1409p231R049m475k091J8321Q056q33r700K3838m821j3106J6938K6141
$$ -6017 -17426 -24657 -15608 -20083 -22174 -3853 4203 3370 -6330 17508 12687 -419 16519 42660
15771D2660k0865k4886j2315N188N764l536k4275m697L172J048j562J1744m335
$$ 42660 21795 -3091 -15406 -10218 -4454 -7990 -32265 -36962 -33790 -32742 -34304 -22560 -26895
15758b6895j026Q541J126o791k877K318j16k098K6886K4237m2278j0810j4033
$$ -26895 -27921 -19380 -18254 -25045 -27922 -25604 -25720 -27818 -932 23305 -18973 -29783 -43816
15745d3816J766K3004p613k6429j3151k068K9786K6198L0623m428j4675o022k0718
$$ -43816 -42050 -19046 -26659 -53088 -66239 -68307 -38521 -12323 18300 13872 -803 -6825 -27543
15732b7543N105r756K9867j2477j4172m727r851p08N039J0696K5991j1107j6750
$$ -27543 -22438 -32194 -2327 -14804 -28976 -33703 -43554 -44262 -39223 -28527 -2536 -13643 -30393
15719c0393J9074N615l100M992L0981Q930l227k4018j6472L7464j6501k4156p851
$$ -30393 -11319 -5704 -8804 -3812 27169 36099 32872 8854 -7618 29846 13345 -10811 -18662
15706a8662m462K6630J3124k2386j4933J3635J3834o622J0585L1905k3538j4320
$$ -18662 -23124 3506 16630 -5756 -20689 -7054 6780 158 10743 42648 19110 4790
15694D790l5678k0720L9572J6161q987m880J4743r239J4025j8233k7645K925J5302
$$ 4790 -30888 -51608 -12036 4125 -4862 -9742 5001 -4238 9787 -8446 -36091 -33166 -17864
15681a7864J0349J0510J1611l336K7264j611k9230r526l654k1869l753K4571P248
$$ -17864 -7515 2995 14606 11270 38534 36923 7693 -1833 -5487 -27356 -31109 -6538 710
15668G10k91j1426n333J2917L477q343j8841o347J6013q498P813J0784J6734q451
$$ 710 419 -11007 -16340 -3423 54 -8289 -27130 -33477 -17464 -25962 -18149 -7365 9369 918
15654I18o067J6774J1235J1165k0753N837o925j1803J0168j32j2943l3824j3041
$$ 918 -5149 11625 22860 34025 13272 19109 12184 381 10549 10417 -2526 -36350 -49391
15641d9391L639J4860K2022K3325K6907N394q02j9558j7334m4240j5191j7378
$$ -49391 -45752 -30892 -8870 14455 41362 46756 45954 26396 9062 -35178 -50369 -67747
15629f7747j1635O761P755P349Q689L7384o863j9687P495L2752L035q537j3699
$$ -67747 -79382 -72621 -64866 -57517 -48828 -11444 -18307 -37994 -30499 2253 5288 -3249 -16948
15616a6948M976p577k0388Q732M2035L5531o594j1270J5388K9018K6009J0003
$$ -16948 -11972 -19549 -39937 -31205 10830 46361 39767 28497 43885 72903 98912 108915
15604A08915K2951k1202m8343l2998P240j9811m9562n5977j345K2890J7632J8154
$$ 108915 131866 110664 62321 29323 36563 16752 -32810 -88787 -90132 -67242 -49610 -31456
15592c1456M589L400P942k1993n362n056O02m422L3248K1134N11r826J3424q483
$$ -31456 -26867 -23467 -15525 -37518 -42880 -47936 -47334 -51756 -18508 2626 3137 -6689 6735 -1748
15578a748l0501j2J1950K3824J3565j9385j7938k0592L808J1195P358L673J0648
$$ -1748 -32249 -32261 -20311 3513 17078 -2307 -20245 -40837 -37029 -25834 -18476 -14803 -4155
15565d155L0279K787o285j6981j5516l3445Q655L412J5255J8464L405O193l0920
$$ -4155 26124 28911 22626 5645 -9871 -43316 -34661 -31249 -15994 2470 5875 12068 -18852
15552a8852k6845k4076J2032L5060J7897K1090n744J847O53j3741R301k5854j4492
$$ -18852 -45697 -69773 -57741 -22681 -4784 16306 10562 12409 13062 -679 8622 -17232 -31724
15539c1724j2518j0566l830L0683J3594k39M016L160j6507r885J7681J0486L79
$$ -31724 -44242 -54808 -58638 -27955 -14361 -14600 -10584 -7424 -23931 -33816 -16135 -5649 -5270
15526e270k1963k144J1619J4334P317Q20K4031N405k9393k5972k007j3949J7459
$$ -5270 -27233 -29377 -17758 -3424 3893 4713 28744 34149 4756 -21216 -23223 -37172 -19713
15513a9713L3859m5q387j0148k285j4381J45J1452j3552p844K0372O633K950J7012
$$ -19713 14146 14101 5714 -4434 -6719 -21100 -20955 -9503 -23055 -30899 -10527 -3894 -944 16068
15499A6068J8977M639k217k6939j3890O29k1112J1385Q097R006m804q385J3396
$$ 16068 35045 39684 37467 10528 -3362 -2733 -23845 -12460 -4363 4643 -161 -8546 4850
15486D850k5059j3132J8468Q383O977j529K979K5759J4267J5104j7860j2526L090
$$ 4850 -20209 -33341 -14873 -6490 487 -1042 1937 27696 41963 57067 39207 26681 29771
15473B9771o187K775K155K0450j8216j9401j1083J6866J2748l352j4884N04j383
$$ 29771 23584 26359 28514 48964 30748 11347 264 17130 29878 26526 11642 12146 10763
15460A0763p590l9199K715K1487j4957l4138o771k1874K6763J0679N90L170J0650
$$ 10763 3173 -36026 -33311 -11824 -26781 -60919 -67690 -89564 -62801 -52122 -51532 -48362 -37712
15447c7712q561Q552J1798k823M5751K7320m4119j9345m915r958j744J1816K143
$$ -37712 -46273 -37721 -25923 -28746 17005 44325 206 -19139 -24054 -34012 -35756 -23940 -21797
15434b1797k302K907O851j2167k5544K4979L029r12J836l430J5543J7380L315
$$ -21797 -24099 -21192 -14341 -26508 -52052 -27073 -24044 -24956 -23120 -26550 -11007 6373 9688
15421I688J9745K6035j8084K2610n839j1344l2898j9201j0269k50K7047L0233
$$ 9688 29433 55468 37384 59994 54155 42811 9913 -9288 -19557 -19807 7240 37473
15409C7473m89p409k19n258L889m648k1682k1226q45L3869J1251j4003q1M562
$$ 37473 36984 29575 29356 24098 27987 23339 1657 -19569 -20414 13455 24706 10703 10622 15184
15395A5184j7820j1936Q824k3637j8447J6631n19k6L6018J7053j6507n651M030
$$ 15184 -2636 -14572 -5748 -29385 -47832 -31201 -31720 -31746 4272 21325 4818 -833 3197
15382C197j8373k1008L7263J7683j1744j2523O293p25j6797k1400K1277L2246
$$ 3197 -15176 -36184 1079 18762 7018 -5505 788 63 -16734 -38134 -16857 15389
15370A5389J9401j7246j4522J1382K2705k0506O294m535Q056Q3l0417k4250q964
$$ 15389 34790 17544 3022 14404 37109 16603 22897 18362 26418 26501 -3916 -28166 -37130
15357c7130L069m017J63L0314J2269m294J3620P192k1823q649K4234K4769j128
$$ -37130 -34061 -38078 -37915 -7601 4668 374 13994 21186 -637 -9286 14948 39717 38589
15344C8589J2995k4905J4087M538k9547j2940j0711J0251j3691J6065J3469R855
$$ 38589 51584 26679 40766 45304 15757 2817 -7894 2357 -11334 4731 18200 28055
15332B8055N148l3493J0200P541K0518o307l6090j2333L645Q390N356o30k6598
$$ 28055 33203 -290 9910 17451 37969 31662 -4428 -16761 -13116 -4726 630 0 -26598
15319b6598k62J0493M3340k2338k7624j8628R699r44R172M479Q351J0692j61J5390
$$ -26598 -26860 -16367 26973 4635 -22989 -41617 -31918 -32862 -23690 -19211 -10860 -168 -329 15061
15305A5061L3292j0730k4632q372n733l59m721j7551j1948Q005R326k1517j0731
$$ 15061 48353 37623 12991 4619 -1114 -1473 -6194 -23745 -35693 -27688 -18362 -39879 -50610
15292e0610J9775J0066r034j1588k4045j4343J9017K9736Q566K1825N18r177P730
$$ -50610 -30835 -20769 -29803 -41391 -65436 -79779 -60762 -31026 -22460 -635 -117 -9294 -1564
15279a564R597O922q231k3315l571J3005j4642j1608j348J5752M883K5556J1755
$$ -1564 8033 14955 6724 -16591 -20162 -7157 -21799 -33407 -34755 -19003 -14120 11436 23191
15266B3191n286j156j8397q075L7473j3074j7145k981k9111j5545J8766L0317
$$ 23191 17905 16749 -1648 -9723 27750 14676 -2469 -5450 -34561 -50106 -31340 -1023
15254a023j0457k2066J876m480j129K2425J5091k5650j2773J030L676K6920Q715
$$ -1023 -11480 -33546 -31670 -36150 -37279 -14854 237 -25413 -38186 -37156 -33480 -6560 2155
15241B155o265n144J0627O201p405J4475o294j4210j7653j4373Q952r180j4695
$$ 2155 -4110 -9254 1373 7574 169 14644 8350 -5860 -23513 -37886 -28934 -38114 -52809
15228e2809J7739K2294J4651k166k3118m214J935J5356m44j4021J64R642j6453
$$ -52809 -35070 -12776 1875 -291 -23409 -27623 -25688 -10332 -10776 -24797 -24633 -14991 -31444
15215c1444k805k071J0434K6784j808J8755K2875K012j1428j3798j1663n943K1327
$$ -31444 -34249 -36320 -25886 898 -910 17845 40720 42732 31304 17506 5843 -100 21227
15202B1227r855j1776N301K2210k6122m5510O086J9863L4972K5341J667j7663
$$ 21227 11372 -404 4897 27107 985 -44525 -38439 -18576 16396 41737 43404 25741
15190B5741j0834r84J5141p621k9297l4040k3285K107L9172K4978P080k1949J0884
$$ 25741 14907 13923 29064 21443 -7854 -41894 -65179 -63072 -23900 1078 8158 -13791 -2907
15177b907r295k846N217r887j2885l096Q177J469O802J4604Q707J810K707m4561
$$ -2907 -12202 -15048 -9831 -19718 -32603 -35699 -27522 -26053 -19251 -4647 4060 5870 8577 -35984
15163c5984k5238K4119J7287J3934K0514N552k7421j7064j9123p647j2727L8489
$$ -35984 -61222 -37103 -19816 -5882 14632 20184 -7237 -24301 -43424 -51071 -63798 -25309
15151b5309K1673J0431k6496Q035o695j3024j3056L471k82N860r823J6050L2605
$$ -25309 -3636 6795 -19701 -11666 -18361 -31385 -44441 -40970 -41252 -35392 -45215 -29165 3440
15138C440r927q486j227p471m0795j4074L4859O495Q24Q381R374L2946j0050j5698
$$ 3440 -6487 -14973 -16200 -23671 -64466 -78540 -43681 -37186 -36362 -27981 -18607 14339 4289 -11409
15124a1409q197k2574k0507K5730L9865p043M91J0719K1197R25r128L895j9369
$$ -11409 -19606 -42180 -62687 -36957 2908 -4135 -3644 7075 28272 29197 20069 23964 4595
15111D595l5446n142J5828o658K836j2976N221P92o550J1514K7499M2415K732
$$ 4595 -30851 -35993 -20165 -26823 -23987 -36963 -31742 -30950 -37500 -25986 1513 43928 46660
15098D6660k5204n162P017P300j5260l1424p901K5666k430q681j5356p728J3393
$$ 46660 21456 16294 23311 30611 15351 -16073 -23974 1692 -738 -9419 -24775 -32503 -19110
15085a9110L412J695J9989j2118k8050O216J3532j434J8703M56p747N157m852
$$ -19110 -15698 -14003 5986 -6132 -34182 -27966 -14434 -15868 2835 3291 -4456 701 -4151
15072d151j6733K2379Q704k508l180J4358l306k6772P181k573j73J8260o006J5628
$$ -4151 -20884 1495 10199 7691 4511 18869 15563 -11209 -4028 -6601 -6774 11486 5480 21108
15058B1108P142o014k6082k138K1438K1757j6124n1823j3053J4624K9792k435
$$ 21108 28250 22236 -3846 -5984 15454 37211 21087 -30736 -43789 -29165 627 -1808
15046a808l008r532j271j4813n400L0700K5665O344J4302M786R27k1842l4396
$$ -1808 -4816 -14348 -15619 -30432 -35832 -5132 20533 26877 41179 45965 46892 25050 -9346
15033i346j0984N279M3262r751j0716k3026r233O783l302j244K271R357j1307
$$ -9346 -20330 -15051 28211 18460 7744 -15282 -24515 -17732 -21034 -22278 -20007 -10650 -21957
15020b1957K4004K4227l659M635L2756k5422l7104Q267o154k6462j8235K5449
$$ -21957 2047 26274 22615 27250 60006 34584 -2520 5747 -407 -26869 -45104 -19655
15008a9655K5389O573J086q767k6029K4136L6750p84l9260o994O8J545j9557R66
$$ -19655 5734 12307 13393 4626 -21403 2733 39483 38699 -561 -7555 -7487 -5942 -25499 -24533
14994b4533j7534M7045J0739k9779j4725M151J1226K3228K4821k897m4889l8488
$$ -24533 -42067 4978 15717 -14062 -28787 -24636 -13410 9818 34639 31742 -13147 -51635
14982e1635K1613L0815k544Q286J5975J7464k946n083l2148O65K876J8207j2302
$$ -51635 -30022 793 -1751 6535 22510 39974 37028 31945 -203 462 3338 21545 9243
14969I243n957k2798k846r859r146J2959L2849j290j6591j0091J6762l520R28
$$ 9243 3286 -19512 -22358 -32217 -41363 -28404 4445 3155 -13436 -23527 -6765 -10285 -9357
14956i357q749j2768M924K3824J5690j5498K677j9074j6056K2856K680N801p944
$$ -9357 -18106 -30874 -25950 -2126 13564 -1934 743 -18331 -34387 -11531 -8851 -3050 -10994
14943a0994j644L2437k6129r609k948J8323J8130j4416j0103l446q976K908j041
$$ -10994 -12638 19799 -6330 -15939 -18887 -564 17566 3150 -6953 -10399 -19375 -16467 -17508
14930a7508n789J1325K723j6633j238L122k1740p40K7648P831M480J410K4176
$$ -17508 -23297 -11972 -9249 -25882 -27120 -23998 -45738 -46478 -18830 -10999 -6519 -5109 19067
14917A9067J566P679j0644l1598k1700J4321J263o957j9207K5502K1983j449k0474
$$ 19067 20633 28312 17668 -13930 -35630 -21309 -20046 -27003 -46210 -20708 1275 -174 -20648
14904b0648N002J85J1329M020j3985j3585k6572J4955K2716J4551J4110Q944r328
$$ -20648 -15646 -15461 -4132 -112 -14097 -27682 -54254 -39299 -16583 -2032 12078 21022 11694
14891A1694p916L063q838k1778J2122n446k163J2237j62K2596M2755O572k6655
$$ 11694 3778 6841 -1997 -23775 -11653 -17099 -19262 -7025 -7187 15409 58164 64736 38081
14878C8081k6357J0940q993k3098k0059j2985L290j8344J3006J1698M643N087
$$ 38081 11724 22664 13671 -9427 -29486 -42471 -39181 -57525 -44519 -32821 -28178 -23091
14866b3091j6852j578j6118P290j5474J679K7999L7465P063K3289j6619j4130
$$ -23091 -39943 -41521 -57639 -50349 -65823 -64144 -36145 1320 8383 31672 15053 923
14854I23l135l6939j9050K4525J8140M463j6384K0304J8098J463j2632J2232K2584
$$ 923 -2212 -39151 -58201 -33676 -15536 -11073 -27457 -7153 10945 12408 -224 12008 34592
14841C4592j041P690J2933k9938j171l2893k9208J4622N897r798k9469K566N1267
$$ 34592 33551 41241 54174 24236 23065 -9828 -39036 -24414 -18517 -28315 -57784 -55218 -3951
14828c951j5557n1286k3556n555K7679l022J7771K8716J3833P019L4902j919K424
$$ -3951 -19508 -70794 -94350 -99905 -72226 -75248 -57477 -28761 -14928 -7909 26993 25074 27498
14815B7498j0515k566l27l0198M641J9711j9455k7787M1425L2469m715J2794l135
$$ 27498 16983 14417 14090 -16108 -11467 8244 -11211 -38998 2427 34896 30181 42975 39840
14802C9840l576o754l5260j8630j0097K9696j7735j9648K0823J5782j111K0184
$$ 39840 36264 29510 -5750 -24380 -34477 -4781 -22516 -42164 -21341 -5559 -6670 13514
14790A3514j5719J6888R885j0191l0402J026J6630j2972P536J1156O321J1301
$$ 13514 -2205 14683 24568 14377 -16025 -14999 1631 -11341 -3805 7351 13672 24973
14778B4973l695j8179o846n566p138j6095p053L2580j5893p594J0410m075J2863
$$ 24973 21278 3099 -3747 -9313 -16451 -32546 -39599 -7019 -22912 -30506 -20096 -24171 -11308
14765a1308K7253j4284J525J8337m126j2289P271j0040l4869j4252K1630M22L701
$$ -11308 15945 1661 3186 21523 17397 5108 12379 2339 -32530 -46782 -25152 -24730 -21029
14752b1029M387J6130j0532j1331j9116N414n967k4972J8682J4636L600K2914
$$ -21029 -16642 -512 -11044 -22375 -41491 -36077 -42044 -67016 -48334 -33698 -30098 -7184
14740g184m473k8727j2611K971J6526K1413K7169J5195j3135q008j504j8706L27
$$ -7184 -11657 -40384 -52995 -50024 -33498 -12085 15084 30279 17144 9136 7632 -11074 -10747
14727a0747j1832J5642J655k156K3588j5566J7217o849j2058o504j5061O646K6609
$$ -10747 -22579 -6937 -5282 -7438 16150 584 17801 10952 -1106 -7610 -22671 -16025 10584
14714A0584P413j9109j2o516r664m548K1095L5627P292j4138n414J388j4950J0775
$$ 10584 17997 -1112 -1124 -7640 -17304 -21852 -757 34870 42162 28024 22610 23998 9048 19823
14700A9823q36j3997l2100q94K0730k2463q076l980j5685L008p112N816j1680
$$ 19823 18987 4990 -27110 -28004 -7274 -29737 -37813 -41793 -57478 -54470 -61582 -55766 -67446
14687f7446J9221K0646j165K123j1490k1426P985L2732j9253r234J0605k113J4801
$$ -67446 -48225 -27579 -28744 -26621 -38111 -59537 -51552 -18820 -38073 -47307 -36702 -38815 -24014
14674b4014P34k1129j0230J325K8194N6852O372k4938j0602K395k0625j4980P191
$$ -24014 -23280 -44409 -54639 -53314 -25120 31732 38104 13166 2564 4959 -15666 -30646 -23455
14661b3455r730m665J5558J7953O507j8650J4831N318l777N274N883m6J3549j4583
$$ -23455 -33185 -37850 -22292 -4339 2168 -16482 -1651 3667 -110 5164 11047 11001 24550 9967
14647I967o18J0250J3224j5961j5791j3040P142K0585L788k2390j6623j40m621
$$ 9967 9349 19599 32823 16862 1071 -11969 -4827 15758 19546 -2844 -19467 -19607 -24228
14634b4228J5883q989K5436j3546P781J0488j7691k5101R461J5340p99K1490j9129
$$ -24228 -8345 -17334 8102 -5444 2337 12825 -4866 -29967 -20506 -5166 -5965 15525 -3604
14621c604k6598J1845J3544P658Q805L585n717j9643L711q75M058K5383J2953
$$ -3604 -30202 -18357 -4813 2845 11650 15235 9518 -10125 -6414 -7289 -3231 22152 35105
14608C5105o897J4824J197j5517j4713q428k2879j8871K0800L3212p674Q946J6984
$$ 35105 28208 43032 44229 28712 13999 5571 -17308 -36179 -15379 17833 10159 19105 36089
14595C6089K535l0071n078k634r684J0796K026J650J7407N340k1200j4604k096
$$ 36089 38624 8553 3475 841 -8843 1953 3979 5629 23036 28376 7176 -7428 -9524
14582i524j232o03m276J0203K982K8539k033k7487j3837q351j4035J5207M501
$$ -9524 -10756 -11359 -15635 -5432 -2450 26089 24056 -3431 -17268 -25619 -39654 -24447 -19946
14569a9946q398r167J5276J3599P063q71k679L454m489o739P131K694N3249K7094
$$ -19946 -28344 -37511 -22235 -8636 -1573 -2444 -5123 -1669 -6158 -12897 -5766 -3072 50177 77271
14555G7271k1469k4165k4101j0595J2525J0994l382j0652j1716n941K3839L5469
$$ 77271 55802 31637 7536 -3059 9466 20460 17078 6426 -5290 -11231 12608 48077
14543D8077J4279j832m826j0248k7868L83R144k4999o205P290O783J8536j0132
$$ 48077 62356 60524 55698 45450 17582 17965 27109 2110 -4095 3195 9978 28514 18382
14530A8382n467M818J6207j4065l3231j2529m956p616K7779K2234K4804N251o000
$$ 18382 12915 17733 33940 19875 -13356 -25885 -30841 -38457 -10678 11556 36360 41611 35611
14517C5611l892Q44k0017k1050n641q23Q446q334j7586j5665j470O905L0766j2830
$$ 35611 31719 32563 12546 -8504 -14145 -14968 -6522 -14856 -32442 -48107 -49577 -42672 -11906 -24736
14503b4736R708K0455L681o282o606r719J0103k8404j1617n504K771Q845O375
$$ -24736 -15028 5427 9108 2826 -3780 -13499 -3396 -31800 -43417 -48921 -46150 -37305 -30930
14490c0930n04K6931O566O096J6564N293j8374q527j619L41j7191J8968l434k4563
$$ -30930 -31434 -4503 2063 8159 24723 30016 11642 3115 1496 1837 -15354 3614 180 -24383
14476b4383R711j9132J1557O718J678K1329R206l924J6779j7194m194N107m346
$$ -24383 -14672 -33804 -22247 -15529 -13851 7478 16684 12760 29539 12345 8151 13258 8912
14463H912J9035J9185j0031j2147p867o411O000j6322j9119j110j9292j2377L477
$$ 8912 27947 47132 37101 24954 17087 10676 16676 354 -18765 -19875 -39167 -51544 -48067
14450d8067K698o942O186K2412J9165k0762l5080l551L1632N3396J9424k3608
$$ -48067 -45369 -52311 -46125 -23713 -4548 -25310 -60390 -63941 -32309 21087 40511 16903
14438A6903j8164m726j3324K8730J1574k2111o46J9464j706J9122m706k2651j8522
$$ 16903 -1261 -5987 -19311 9419 20993 -1118 -1764 17700 15994 35116 30410 7759 -10763
14425a0763j4504p368K1451j783k8702o726K0886J5089J1528M109J0978K3446
$$ -10763 -25267 -32635 -11184 -12967 -41669 -48395 -27509 -12420 -892 3217 14195 37641
14413C7641j134r863M190k4621l5170M523K1750m716j1285J1813K0225m958J3595
$$ 37641 36507 26644 30834 6213 -28957 -24434 -2684 -7400 -18685 -6872 13353 8395 21990
14400B1990M421j0209J9607P982j3699k8958O320M521l1056J8048L0476o594j3357
$$ 21990 26411 16202 35809 43791 30092 1134 7454 11975 -19081 -1033 29443 22849 9492
14387I492j7773m4080J039K2522J1230J0875K2401j1867j0218J47k815j8580K3313
$$ 9492 -8281 -52361 -51322 -28800 -17570 -6695 15706 3839 -6379 -6232 -9047 -27627 -4314
14374d314J2644j439K1252j4830j754j5328p290j6851J5643J8081K283J2932n849
$$ -4314 8330 6891 28143 13313 11559 -3769 -11059 -27910 -12267 5814 8097 21029 15180
14361A5180j2259J1043j313J4831j0215j5596K252q902l0450n422K4543J5241
$$ 15180 2921 13964 12651 27482 17267 1671 3923 -4979 -35429 -40851 -16308 -1067
14349a067J8850k716j5263k0573j6284O900L8147L9600k185k85k1808j1626m671
$$ -1067 17783 15067 -196 -20769 -37053 -30153 7994 47594 45409 45124 23316 11690 7019
14336G019j6778R357J6998j0090m749j0311M836j85O535l546j5015J8839j5632
$$ 7019 -9759 -402 16596 6506 1757 -8554 -3718 -3903 2632 -914 -15929 2910 -12722
14323a2722q495N324K2035R692J6885m020j6268m1634J2671Q791M64O230M581
$$ -12722 -21217 -15893 6142 15834 32719 28699 12431 -29203 -16532 -7741 -7277 -1047 3534
14310C534j0637l1590k851q949j9181K7876M079Q092K2078L0321K6279K1910k7786
$$ 3534 -7103 -38693 -41544 -50493 -69674 -41798 -37719 -29627 -7549 22772 49051 70961 43175
14297D3175m8952j4921J9185O81o851J4666m310k9479j3354M8852K7809J769L497
$$ 43175 -5777 -20698 -1513 -832 -7683 6983 2673 -26806 -40160 8692 36501 38270 41767
14284D1767l605j468L010r694j4297l2597o692R377J0913K4100q983J3526J5491
$$ 41767 38162 36694 39704 30010 15713 -16884 -23576 -14199 -3286 20814 11831 25357 40848
14271D0848j801j1198M363j4395J3822O595k0668q903j1036j9027j839j6961J6563
$$ 40848 39047 27849 32212 17817 31639 38234 17566 8663 -2373 -21400 -23239 -40200 -23637
14258b3637J5595J0722j0819j2919j9327q183L2540L8248J8602L70m539K032p40
$$ -23637 -8042 2680 -8139 -21058 -40385 -48568 -16028 22220 40822 41192 36653 38685 37945
14245C7945k0652n2176k8348J4092K8826r995n207J4042k150O339k6364n1305
$$ 37945 17293 -34883 -63231 -49139 -20313 -30308 -35515 -21473 -23623 -17284 -43648 -94953
14233i4953N556Q5587K6675J556k114n048k781j0582l286L9099L945O283q046
$$ -94953 -89397 -3810 22865 24421 22307 17259 14478 3896 610 39709 43654 49937 41891
14220D1891j5001K479N417j0096J40l549J3178Q749p977J5504k2065k1967J2720
$$ 41891 26890 29369 34786 24690 24830 21281 34459 43208 35231 50735 28670 6703 19423
14207A9423P154j0662P616j0795J1753l2122k9049O604o7K8912j5592k3643K8948
$$ 19423 26577 15915 23531 12736 24489 -7633 -36682 -30078 -30145 -1233 -16825 -40468 -11520
14194a1520J2951q570j7226R976J410j6476j5160j954Q807Q35K0813N0085K0451
$$ -11520 1431 -7139 -24365 -14389 -12979 -29455 -44615 -46569 -37762 -36927 -16114 33971 54422
14181E4422j3351Q739k3436k6682J3224j3662L6439r685j9552k191q661O732n347
$$ 54422 41071 49810 26374 -308 12916 -746 35693 26008 6456 4265 -4396 2336 -3011
14168c011P584J7522J233j6575r842K4159J4967j5996j501J2626J5787j8507m967
$$ -3011 4573 22095 23328 6753 -3089 21070 36037 20041 18540 31166 46953 28446 23479
14155B3479P898m593j3307j8546m419q092o321J7999L799l710m325p50j180j6545
$$ 23479 31377 26784 13477 -5069 -9488 -17580 -23901 -5902 -2103 -5813 -10138 -10888 -12068 -28613
14141b8613r169J1306j3595k368J3506K6018J3168l173k4322j9751j1837J606
$$ -28613 -37782 -26476 -40071 -42439 -28933 -2915 10253 7080 -17242 -36993 -48830 -47224
14129d7224q337J921N786J4547j9241J2368J0818R029R53j1811l965j9524J7315
$$ -47224 -55561 -53640 -47854 -33307 -52548 -40180 -29362 -20333 -19380 -31191 -35156 -54680 -37365
14116c7365L0037M284r492j9983n128L433P977J7671q193l0141M991m494k860
$$ -37365 -7328 -3044 -12536 -32519 -37647 -34214 -26237 -8566 -16759 -46900 -41909 -46403 -49263
14103d9263K0091j4193q127O909M1283M5504O476l8723p693k6610J516O893p948
$$ -49263 -29172 -43365 -51492 -44583 -3300 42204 48680 9957 2264 -24346 -22830 -15937 -23885
14090b3885J4790j759K2975N111k0022k9947M14m218P934J5919K0466J4386k1035
$$ -23885 -9095 -10854 12121 17232 -2790 -32737 -32323 -36541 -28607 -12688 7778 22164 1129
14077A129m141Q669l150K1441K296l654q424P064n49K0743J5946K69l0916k4281
$$ 1129 -3012 5657 2507 23948 26244 22590 14166 21230 20681 41424 57370 57639 26723 2442
14063B442p044J9207P916m576j5679J50K421O307Q128P053K45L5571o225k6789
$$ 2442 -4602 14605 22521 17945 2266 2416 4837 11144 19272 26325 26570 62141 55916 29127
14049B9127p687J1975L2062j1160k9604l7686j2745n290P069J156L3792K0153
$$ 29127 21440 33415 65477 54317 24713 -12973 -25718 -31008 -23939 -22783 11009 31162
14037C1162k0643j4518k3162L842J1875l86K6526N929N334l0879j2255L1230N735
$$ 31162 10519 -3999 -27161 -23319 -11444 -11830 14696 20625 25959 -4920 -17175 14055 19790
14024A9790j1274K9639K6008j9172l1826K4177J5750j9473l5414N309k16j4115
$$ 19790 8516 38155 64163 44991 13165 37342 53092 33619 -1795 3514 3298 -10817
14012a0817j8525J320J2917j9933R7k5798L8972L6003J067k2261j5822p631j7825
$$ -10817 -29342 -28022 -15105 -35038 -34941 -60739 -21767 14236 15303 -6958 -22780 -30411 -48236
13999d8236J9848K8418N343k6994l434l9215K9235M7228K5640Q675l3345j1442
$$ -48236 -28388 30 5373 -21621 -25055 -64270 -35035 12193 37833 46508 13163 1721
13987A721M913k1316J6300J057J5746K581J6121k2480k5584j1753n129K1290N6557
$$ 1721 6634 -14682 1618 2675 18421 21002 37123 14643 -10941 -22694 -27823 -6533 50024
13974E0024J6286n9165l0354K6M1411K1411k4536j0869j393j8842J0711J986j8629
$$ 50024 66310 7145 -23209 -23183 18228 39639 15103 4234 2841 -16001 -5290 -3304 -21933
13961b1933K3019L9301j7090k6465j5430n192R025j7724J115k824l951J7815L9295
$$ -21933 1086 40387 23297 -3168 -18598 -23790 -14765 -32489 -31374 -34198 -38149 -20334 18961
13948A8961k449J0563O962j0665j1402j0845j896O61J1896j782J6729K0710j0056
$$ 18961 16512 27075 34037 23372 11970 1125 -771 -110 11786 10004 26733 47443 37387
13935C7387k5714p795O321j2731k6917j7306O421k611j1109N560J8919J1418J2828
$$ 37387 11673 3878 10199 -2532 -29449 -46755 -40334 -42945 -54054 -48494 -29575 -18157 -5329
13922e329k2966j8047J8062J0817L926P888K1833j0155k0138p031J8185j647j0197
$$ -5329 -28295 -46342 -28280 -17463 -13537 -5649 16184 6029 -14109 -21140 -2955 -4602 -14799
13909a4799k2232j3748N181K2922K3553K4998k1674j1759K3364j1541j5309K918
$$ -14799 -37031 -50779 -45598 -22676 877 25875 4201 -7558 15806 4265 -11044 -8126
13897h126J3383K2903j1033K377m9388k3038M752J075J3180L0166K474j5913L14
$$ -8126 5257 28160 17127 19504 -29884 -52922 -48170 -47095 -33915 -3749 -1275 -17188 -16874
13884a6874P753k4154k4806K1629M1467r340j7484K925j451M1394k064m3027q795
$$ -16874 -9121 -33275 -58081 -36452 5015 -4325 -21809 -18884 -20335 21059 18995 -24032 -32827
13871c2827L2662K267k725j4734j4917K2968L2442n937k0243m578j0091L91q173
$$ -32827 -165 2102 -623 -15357 -30274 -7306 25136 19199 -1044 -5622 -15713 -15322 -23495
13858b3495o872k6585P884L577K101l998K0213L9800l829k2587j0399J4209K5487
$$ -23495 -30367 -56952 -49068 -45491 -43390 -47388 -27175 12625 8796 -13791 -24190 -9981 15506
13845A5506j2938l3698M0142N4128j1430k4895K722o259p074M668O932j3559J1992
$$ 15506 2568 -31130 9012 63140 51710 26815 29537 23278 16204 20872 27804 14245 26237
13832B6237J9184j2991j9748l027k501k0117J7051j3665j0569n483K787K0141
$$ 26237 45421 32430 12682 9655 7154 -12963 4088 -9577 -20146 -25629 -22842 -2701
13820b701P812q088Q746J5946k0852q045p682K2215K1716J1553j8925J2417k867
$$ -2701 5111 -2977 5769 21715 863 -7182 -14864 7351 29067 40620 21695 34112 31245
13807C1245j7277j0735j3189Q652J1775l2945l0712K8170L0861J5696J1921J3960
$$ 31245 13968 3233 -9956 -1304 10471 -22474 -53186 -25016 5845 21541 33462 47422
13795D7422J3840j701l0208K370j2213k555K3108q369k7975k603m775k3552J821
$$ 47422 61262 59561 29353 31723 19510 16955 40063 31694 3719 1116 -3659 -27211 -25390
13782b5390K7796J8856k0151r279n46J0559j445L1204k1221j5368j1019J2049
$$ -25390 2406 21262 1111 -8168 -8714 1845 400 31604 10383 -4985 -16004 -3955
13770c955q052o773R188K7807K0129Q452O083j4497l4559j2222K503N831K6089
$$ -3955 -12007 -18780 -9592 18215 38344 46796 52879 38382 3823 -8399 -5896 -65 26024
13757B6024J3048p093j8331j525j4605K353J393J2191M17n99P57q677n718J169
$$ 26024 39072 31979 13648 12123 -2482 -129 1264 13455 13872 13273 14030 5353 -365 804
13743H04l7413Q46J5164O534J1537J1268P821j2900k1785Q204J0847J8306N794
$$ 804 -36609 -35763 -20599 -14065 -2528 8740 16561 3661 -18124 -9920 927 19233 25027
13730B5027k3047j1358k5785J7875n03k5055l035K3577N0495L069k8369l537J9223
$$ 25027 1980 -9378 -35163 -17288 -17791 -42846 -45881 -22304 28191 31260 2891 -646 18577
13717A8577J0444l5950j579K1747n260j1132J830L2175R855k3554J5247M224j2305
$$ 18577 29021 -6929 -8508 13239 7979 -3153 -1323 30852 40707 17153 32400 36624 24319
13704B4319p54l83l835J428J704r579M256K0081O515l7221r473n1658j6437J1915
$$ 24319 23565 23182 19347 20775 22479 12900 17156 37237 43752 6531 -2942 -54600 -71037 -59122
13690e9122K462K3389J0942J4649J4370K963j2050J4444r198J4478J5781O351
$$ -59122 -56660 -33271 -22329 -7680 6690 9653 -2397 12047 2849 17327 33108 39459
13678C9459j9559k5046k3971J3882J7479N863j329K352K4341m954j1333K1606
$$ 39459 19900 -5146 -29117 -15235 2244 8107 6778 9130 33471 28517 17184 38790
13666C8790L497j4442j0562n808L085m185q051J8475J9282J8135k1397k6250o522
$$ 38790 42287 27845 17283 11475 14560 10375 2324 20799 40081 58216 36819 10569 4047
13653D047J1520m006j3014o71J1374K9641J2754j5545o332j0956j9413j728j811
$$ 4047 15567 11561 -1453 -2124 9250 38891 51645 36100 29768 18812 -601 -2329 -4140
13640d140p199K3982K3164J4603K591M612N673J9996p432k0661l688p093j9013
$$ -4140 -11339 12643 35807 50410 53001 57613 63286 83282 75850 55189 51501 44408 25395
13627B5395m0788j3609O392J9301Q254K7874J259j5280k3646J4329J2191j0556
$$ 25395 -15393 -29002 -22610 -3309 4945 32819 34078 18798 -4848 9481 21672 11116
13615A1116l313r814k400q804L676n509J6247q576k5664n383K5545L3141J544
$$ 11116 7803 -2011 -4411 -13215 -9539 -15048 1199 -7377 -33041 -38424 -12879 20262 21806
13602B1806j7843L6009J7389p056o552M219P3j3902p178j5169P780O38j7163J2585
$$ 21806 3963 39972 57361 50305 43753 47972 48045 34143 26965 11796 19576 20214 3051 15636
13588A5636j2859l160j7324J5888K1465n413O217J1579Q529k4486j0570K1049
$$ 15636 2777 -383 -17707 -1819 19646 14233 20450 32029 40558 16072 5502 26551
13576B6551J070M240j4831Q82J5255k8448p234K6387J1509k3539l783m570j5771
$$ 26551 27621 31861 17030 17912 33167 4719 -2515 23872 35381 11842 8059 3489 -12282
13563a2282k56J5716J5113R306J6837Q243l6004j4591L5201K0318r509k3357K427
$$ -12282 -12538 3178 18291 27597 44434 52677 16673 2082 37283 57601 48092 24735 27162
13550B7162J4322j0451j204K9198j827m346O755k8362k4589J365L683J9093k8113
$$ 27162 41484 31033 29829 59027 57200 52854 59609 31247 6658 8023 11706 30799 2686
13537B686j816M2701P575p465l971j3880j6127j0099m699M873Q423J0661J935
$$ 2686 870 43571 51146 43681 39710 25830 9703 -396 -5095 -222 8201 18862 20797
13524B0797j5951Q893J0119j4887J1588L3695k776J256j1941r144l176k9153q538
$$ 20797 4846 13739 23858 8971 20559 54254 51478 52734 40793 31649 28473 -680 -9218
13511i218J382j2442R969L7395J5459J7980J1462k2011q490J433O220M745R456
$$ -9218 -7836 -20278 -10309 27086 42545 60525 71987 49976 41486 42919 49139 53884 63340
13498F3340k4720l6397J0451N172j208J2822K6680j2999j4341J861N390j2799
$$ 63340 38620 2223 12674 17846 16638 29460 56140 43141 28800 30661 36051 23252
13486B3252L129m370J8513j4898J3352n667Q813K1862m129j0452j3976J2714k5851
$$ 23252 26381 22011 40524 25626 38978 33311 42124 63986 59857 49405 35429 48143 22292
13473B2292k5121R121L4761L927j8031J1930O556k9436k4733Q227M152J457j4129
$$ 22292 -2829 6292 41053 44980 26949 38879 45435 15999 -8734 -507 3645 5102 -9027
13460i027M575M9079L0853k204J030j5000J8069K2432L43j26M712n56j8729J6729
$$ -9027 -4452 44627 75480 73276 74306 59306 77375 99807 100150 100024 104736 104180 85451 102180
13446A02180k2968m2627L673N387K714J432m269J6392k4120j0909O853J9395r611
$$ 102180 79212 36585 40258 45645 48359 49791 45522 61914 37794 26885 33738 53133 43522
13433D3522j2355O433N386j3582j1843j1029j8159m290K8285m223j297j5193J2916
$$ 43522 31167 37600 42986 29404 17561 6532 -11627 -15917 12368 8145 6848 -8345 4571
13420D571J5467j4489K7647J0851J8633n276j4957k4391k5158M440L4664K1145
$$ 4571 20038 5549 33196 44047 62680 57404 42447 18056 -7102 -2662 32002 53147
13408E3147O900j0054K691j7089j2141q541j0975J9543m443r901j0745n95j3222
$$ 53147 60047 49993 52684 35595 23454 14913 3938 23481 19038 9137 -1608 -2203 -15425
13395a5425Q134j6211J4140J944K258K3820L615q439J2313o984m225J9247K3324
$$ -15425 -7291 -23502 -9362 -7418 -5160 18660 22275 13836 26149 19165 14940 34187 57511
13382E7511P567j8406l4431k0031K6059L4854J4846p566j1788k3985J5816J5500
$$ 57511 65078 46672 12241 -7790 18269 53123 67969 60403 48615 24630 40446 55946
13370E5946J8404L669j4910j6506j4559o782m705K8320J3640j2644l5380k8346
$$ 55946 74350 78019 63109 46603 32044 25262 20557 48877 62517 49873 14493 -13853
13358a3853n524J2334J1231J2195j6758j45j0543k042K3560L4476J7604L393K107
$$ -13853 -19377 -7043 4188 16383 -375 -520 -11063 -13105 10455 44931 62535 65928 68035
13345F8035j0277j6252j617o519J3616K8663j709K0312k231j2317k1099k3830
$$ 68035 57758 41506 39889 33370 46986 75649 73940 94252 92021 79704 58605 34775
13333C4775p164l0747j6305L1637q707r600J8889K5493J1312q122N315o781O79
$$ 34775 27611 -3136 -19441 12196 3489 -6111 12778 38271 49583 41461 46776 39995 40674
13320D0674j5485j9155J2254J9453q006J0573m552K10j2231L2824n187J3643j6747
$$ 40674 25189 6034 18288 37741 29735 40308 35756 35966 23735 56559 51372 65015 48268
13307D8268k355j5057k1367Q811L1123J5025j9415J1400j2594K8313k7417j7409
$$ 48268 45913 30856 9489 18300 49423 64448 45033 56433 43839 72152 44735 27326
13295B7326r681J1676K0035q967R312Q725j577J1837j7830r311j1398N990K7445
$$ 27326 17645 29321 49356 40389 49701 58426 56849 68686 50856 41545 30147 36137 63582
13282F3582N926N636j4278J0511j7612j1416O935j530j0532j2232q545M040J4138
$$ 63582 69508 75144 60866 71377 53765 42349 49284 47754 37222 24990 16445 20485 34623
13269C4623L1518K0866M125j2842p940j5221J022J5832o225j8600K3741J4863
$$ 34623 66141 87007 91132 78290 70350 55129 56151 71983 65758 47158 70899 85762
13257H5762J7799j9871k5716J7446O930k2490l096j9358J721P845j0474j5415
$$ 85762 103561 83690 57974 75420 82350 59860 56764 37406 39127 46972 36498 21083
13245B1083k0251M575J8674K2125K5459J2726K708J704N395k04q001o180j7891
$$ 21083 832 5407 24081 46206 71665 84391 87099 88803 94198 93994 85993 79813 61922
13232F1922j8313O480n362J3226J8086R596L280m354l1338q083j0013N789k253
$$ 61922 43609 50089 44727 57953 76039 85635 88915 84561 53223 45140 35127 40916 38663
13219C8663n899r117l4278j0853M0456L2607j5788l1192K4804K9752J7366o666
$$ 38663 32764 23647 -10631 -21484 18972 51579 35791 4599 29403 59155 76521 69855
13207F9855K456j4822j2819J6350J0860Q013J3986N933L0720k2200k0950J3689
$$ 69855 72311 57489 44670 61020 71880 79893 93879 99812 130532 108332 87382 101071
13195A01071j6667o178Q27j839M561j389J5574Q842j2343J2715J6493L9047J1457
$$ 101071 84404 78226 79053 77214 81775 80386 95960 104802 92459 105174 121667 160714 172171
13182A72171J0690k3777j0057N7985N6966O5225J23605J73646K42266L42458K37710
$$ 172171 182861 159084 149027 207012 263978 329203 452808 626454 868720 1211178 1448888
13171A448888O8067p621p5641k15369k73297j66548r3732p4917o1529j047J8567
$$ 1448888 1516955 1509334 1433693 1218324 945027 778479 684747 609830 548301 547254 565821
13160E65821l8119n4306k6408j3231l3731k9515j7221m5444j4398l138M402l3416
$$ 565821 527702 473396 446988 433757 400026 370511 353290 307846 293448 290310 294712 261296
13148B61296l7283l691j1469P492k1236m3662m4791j7201r287r388k6258l8898
$$ 261296 224013 220322 208853 216345 195109 151447 106656 89455 80168 70780 44522 5624
13136E624L5619M6582k332l2640j9525J2514J4809K3529Q384K5659k6955l1749
$$ 5624 41243 87825 85493 52853 33328 45842 60651 84180 92564 118223 91268 59519
13124E9519l1543k8242r09J1430K8866K2891J4560L105k0217L922n780k8745j3344
$$ 59519 27976 -266 -1175 10255 39121 62012 76572 79677 59460 63382 57602 28857 15513
13111A5513K4268L1596M610j0550p503L514k0246M506q58K427J3783Q022Q789
$$ 15513 39781 71377 75987 65437 57934 61448 41202 45708 44850 47277 61060 69082 77871
13098G7871m852j5793J2346j9268J972N91M091J208l254l3502k7578K7074K095
$$ 77871 73019 57226 69572 50304 52276 52867 56958 58166 54912 21410 -6168 20906 23001
13085B3001J2162J8357J7571O453j1560j6299j8474N605M098K2170J455j4957
$$ 23001 35163 53520 71091 77544 65984 49685 31211 36816 40914 63084 64539 49582
13073D9582Q536m762k3121j7595J723R083K0114K7724R842j5601j4967Q473j62
$$ 49582 58118 53356 30235 12640 14363 23446 43560 71284 81126 65525 50558 59031 58869
13060E8869O827K5269N5704N7274R4386J41645Q1966M3676k4774o6281o4472p5838
$$ 58869 65696 90965 146669 203943 298329 439974 521940 565616 540842 474561 410089 334251
13048C34251j8168k5625K421L594J2825K5163O407m2199k0882j3531r1p791j6568
$$ 334251 316083 290458 292879 296473 309298 334461 340868 298669 277787 264256 264165 256374 239806
13035B39806K214j5051R086l190O130n27r075o751j0989l110k2110M51M240J0629
$$ 239806 242020 226969 236055 232865 238995 238468 229393 222642 211653 208543 186433 186884 191124 201753
13021B01753p335l754j3422j7111p430N427p766K2511K1467m6866M549L8189l1445
$$ 201753 194418 190664 177242 160131 152701 158128 150362 172873 194340 147474 152023 190212 158767
13008A58767j8038J2782O519k1397k600J4356J0017l933J0478Q076k8741o753
$$ 158767 140729 153511 160030 138633 136033 150389 160406 156473 166951 175027 146286 139533
12996A39533o232O153L7754J5888k0410k7274R638r30j1881K4827J2299k2823
$$ 139533 133301 139454 177208 193096 172686 145412 155050 154120 142239 167066 179365 156542
12984A56542j3869j0231j950J9091N182J6022N220l249K2840K6093K7238N0885
$$ 156542 142673 132442 130492 149583 154765 170787 176007 172758 195598 221691 248929 299814
12972B99814K6162M1135Q107j1544j103L001J228q932q360P685r987j1616q948
$$ 299814 325976 367111 375218 363674 362571 365572 366800 357868 349508 357193 347206 335590 326642
12959C26642j4892k8474j568K759j6623n1804n454L7022J703k3565j9385j5497
$$ 326642 311750 283276 281708 284467 267844 216040 210586 247608 249311 225746 206361 190864
12947A90864l031J3578L3380Q393N124j6364k555j6336k441M372k4369l1600r06
$$ 190864 187833 201411 234791 243184 248308 231944 229389 213053 210612 214984 190615 159015 158109
12934A58109K7229K8017K9008M314k1181o341J6437J557j6800Q417L5267J0792
$$ 158109 185338 213355 242363 246677 225496 219155 235592 237149 220349 228766 264033 274825
12922B74825j8679o4547k1140J4905P694j2365n837K3139M2261j382O802O92K693
$$ 274825 256146 191599 170459 185364 193058 180693 174856 197995 240256 238874 245676 246368 249061
12909B49061P596k6858j6982K3147q359J4248j7341k0050k5981k558J4120j845
$$ 249061 256657 229799 212817 235964 227605 241853 224512 204462 178481 175923 190043 188198
12897A88198n145J4263J4940n899j1567j606o27K9784j2092q456k2612p24n480
$$ 188198 183053 197316 212256 206357 194790 193184 192557 222341 210249 201793 179181 178457 172977
12884A72977J7323K9408n287P969O154o373o64K2363R095j7659k3046o664n25
$$ 172977 190300 219708 214421 222390 228544 222171 221507 243870 252965 235306 212260 205596 205071
12871B05071j4530q233k733j4018o285L0751M0227J285J0484K9994p836j8673
$$ 205071 190541 182308 179575 165557 159272 190023 230250 231535 242019 272013 264177 245504
12859B45504P45K570j3692j0708K3375J624j5633J9653L3119K0348j1590k9713
$$ 245504 246249 248819 235127 224419 247794 249418 233785 253438 286557 306905 295315 265602
12847B65602J7313J5554k075k3217L0396L5164M2291Q0206O7422J931j2795L7029
$$ 265602 282915 298469 296394 273177 303573 338737 381028 461234 528656 530587 517792 554821
12835E54821P345o4461m1748j3969j4204L214k300K738K3608j0121M0258M0093
$$ 554821 562166 497705 455957 441988 427784 430998 428698 431436 455044 444923 485181 525274
12823E25274K344N584J8466K0057m460m138o774k2892j5799L9572K3875k754K448
$$ 525274 527618 533202 551668 571725 567265 563127 556353 533461 517662 557234 581109 578355 580803
12810E80803j7489J5105L4349o19j1335q666q320K410r047r277j0899L2530N7998
$$ 580803 563314 578419 612768 612149 600814 592148 583828 586238 577191 567914 557015 589545 647543
12797F47543Q778k4103r324p77L5879M1392J9597K1974P676L6234Q722J2187J4933
$$ 647543 656321 632218 622894 622117 657996 699388 718985 740959 748635 784869 793591 805778 820711
12784H20711n048k032J9941j4099j4566J9910L4022M2388J0752L7879N602k9885
$$ 820711 815663 813631 833572 819473 804907 824817 858839 901227 911979 949858 955460 925575
12772I25575p173L339M6886L3044R348J4807M1817L0153K4270J5190J8309L027
$$ 925575 918402 921741 968627 1001671 1011019 1025826 1067643 1097796 1122066 1137256 1155565 1158592
12760A158592Q604J5567K5907K3363O0006O1823P3736O8164P1444Q4376Q8421
$$ 1158592 1167196 1182763 1208670 1232033 1292039 1353862 1427598 1495762 1567206 1651582 1740003
12749A740003Q4367R4129Q7193J27576K06800J59861J58649J21291J09005J40055
$$ 1740003 1824370 1918499 2005692 2133268 2340068 2499929 2658578 2779869 2888874 3028929
12739C028929J63918K22079K58860K27887K39354K93253K50097L21435M88129
$$ 3028929 3192847 3414926 3673786 3901673 4141027 4434280 4684377 5005812 5493941
12730E493941N81870P02844P64781Q79445J178119J449350J652998J822571K213927
$$ 5493941 6075811 6778655 7543436 8422881 9601000 11050350 12703348 14525919 16739846
12721A6739846K807608L558202M727990O785976J0102049J5642456K5678386M3229369
$$ 16739846 19547454 23105656 27833646 34619622 44721671 60364127 86042513 129271882
12713A29271882O5839367O3450922K0427946j245767p088149l4620808n8646362
$$ 129271882 195111249 258562171 278990117 277744350 270656201 236035393 177389031
12706A77389031m4981473k4886609j2600507n908764k810157k267155l447817
$$ 177389031 132407558 107520949 94920442 89011678 86201521 83934366 80486549
12699H0486549n394048o493089o064904n044979l979617k838256j915274j348794
$$ 80486549 75092501 68599412 62534508 57489529 53509912 50671656 48756382 47407588
12691D7407588j164016j315323j870072k714069l157517k915924k649197k752654
$$ 47407588 46243572 44928249 43058177 40344108 37186591 34270667 31621470 28868816
12683B8868816k909090k830226k609929k337852k075209j766788j514874j331002
$$ 28868816 25959726 23129500 20519571 18181719 16106510 14339722 12824848 11493846
12675A1493846j135960r71901q29583p25326o37654n90683n22443m67479l77587
$$ 11493846 10357886 9385985 8556402 7831076 7193422 6602739 6080296 5612817 5235230
12666E235230l25592l22799k99457k47549k09985k37810k42486k09156j88430
$$ 5235230 4909638 4586839 4287382 4039833 3829848 3592038 3349552 3140396 2951966
12657B951966j46070j39390j48734j39075j11028j19329j10364r3861r8348r0098
$$ 2951966 2805896 2666506 2517772 2378697 2267669 2148340 2037976 1944115 1845767 1755669
12647A755669r0111q3870n0479m3195n9158p2256p2679j2873o5349r3192p3743
$$ 1755669 1665558 1581688 1531209 1488014 1428856 1356600 1283921 1271048 1205699 1112507 1038764
12636A038764k0864j3917k7510k4051Q619j428j5719k9385k9664k5184l8965j28
$$ 1038764 1017900 1003983 976473 952422 961041 959613 943894 914509 884845 859661 820696 820568
12624H20568J131K6342K9363J3283q201l3537j5946k4365k0003R989M668J5224
$$ 820568 821699 848041 877404 890687 882486 848949 833003 808638 788635 798624 803292 818516
12612H18516J5007k0678m8200k727k0513n607L160j5196p092j5812l1134K804
$$ 818516 833523 812845 764645 761918 741405 735798 738958 723762 716670 700858 669724 672528
12600F72528k5028l8990j0910K0613O181o982J918J5319R636j0733j7893p790
$$ 672528 647500 608510 597600 618213 624394 617412 619330 634649 644285 633552 615659 607869
12588F07869j2344K5388q350n7929j243K3924K0183j1787n5917Q12J9969K5672
$$ 607869 595525 620913 612563 554634 553391 577315 597498 585711 529794 530606 550575 576247
12576E76247j844j2211j5055j4963J3578p862K546L930K858K7238n41n2706k0552
$$ 576247 574403 562192 547137 532174 545752 537890 540436 544366 547224 574462 573921 521215 500663
12563E00663j472o461j5705K7657M596j354M761L2116L4033L9855M2679Q602k9615
$$ 500663 499191 492730 477025 504682 509278 507924 512685 544801 578834 618689 661368 669970 640355
12550F40355j3194p253k7506k4304K268j3078k8643j3052r022k1667j0219j526
$$ 640355 627161 619908 592402 568098 570366 557288 528645 515593 506571 484904 474685 473159
12538D73159J641J5224L7215j0658o299K378k5898J758k3630j5344j4387l333
$$ 473159 474800 490024 527239 516581 510282 512660 486762 488520 464890 449546 435159 431826
12526D31826L5593R054o234J0760J02r624J1039o979j0370m476j0455j5864q166
$$ 431826 467419 476473 470239 480999 481101 471477 482516 475537 465167 460691 450236 434372 426206
12513D26206M744J4312J6703k6612m6442j08M563J7477J5857O456j5165j0801
$$ 426206 430950 445262 461965 435353 388911 388803 393366 410843 426700 433156 417991 407190
12501D07190k301L475M82J2539j4434j992J298n304K952N102j6593J6202Q253
$$ 407190 404889 408364 408846 421385 406951 404959 406257 400953 403905 409007 392414 408616 416869
12488D16869k2963j4979j870K3688o278q224J5329J7002J0838n90N88J2722L2821
$$ 416869 393906 378927 377057 400745 394467 386243 401572 418574 429412 428822 429410 442132 474953
12475D74953J5845K98k164j691k1627l2156P4K5982R844l1817R029n157R556R251
$$ 474953 490798 491096 488932 487241 465614 433458 433532 459514 469358 437541 446570 441413 450969 460220
12461D60220m096R830O418L1723M107J4774p772l159k667M156J1793o025k3578
$$ 460220 456124 465954 472372 504095 508202 522976 515204 512045 509378 513534 525327 519302 495724
12448D95724j4621L641O618j162n599m585R20Q454J9218J4501L139p718p387K2023
$$ 495724 481103 484744 491362 490200 484601 480016 480936 489390 508608 523109 526248 518530 511143 533166
12434E33166L1413K8382N403l1348k7016k588n741o035O494L559N285J4124K4661
$$ 533166 564579 592961 598364 567016 540000 537412 531671 525636 532130 535689 540974 555098 579759
12421E79759j0827m8891l169K1051K2054K7523K8137k5364k0751l230J678O857
$$ 579759 568932 520041 516872 537923 559977 587500 615637 590273 569522 566292 567970 574827
12409E74827r682j7837M563J0066K0587J5140r262p206J5978q802K463J050P43
$$ 574827 565145 547308 551871 561937 582524 597664 588402 581196 597174 588372 590835 591885 592628
12396E92628P090P09K3737J6008Q706O608R84J185j2543j318P01J7769O18k5778
$$ 592628 599718 600427 624164 640172 648878 655486 656470 657655 645112 643794 644495 662264 662882 637104
12382F37104o090j0527k4901J5050K6698K0066J9701k5577r957m5546l9885j3993
$$ 637104 631014 620487 595586 610636 637334 657400 677101 651524 641567 596021 556136 542143
12370E42143l3939j13935p9393L7393Q3575Q9364J19738P1040N8518p65J0301
$$ 542143 508204 394269 314876 352269 435844 525208 644946 715986 774504 773739 784040
12359G84040l254M302J3064n511K4370P1988R017K673Q097K3782K1474J0241J7195
$$ 784040 780786 785088 798152 792641 817011 888999 898016 900689 908786 932568 954042 964283 981478
12346I81478L0042M569J5779L6338Q778J5556J889j6197L8016L3124J4824L0187
$$ 981478 1011520 1016089 1031868 1068206 1076984 1092540 1094429 1078232 1116248 1149372 1164196 1194383
12334A194383K1530L4509J3639l0050l885L9667l286m693K0740K4919J2400K2690
$$ 1194383 1215913 1250422 1264061 1234011 1230126 1269793 1266507 1261814 1282554 1307473 1319873 1342563
12322A342563M3863L6971J5709M129L7671R101J2775L5378L5110M7797M6609J9418
$$ 1342563 1386426 1423397 1439106 1443235 1480906 1490007 1502782 1538160 1573270 1621067 1667676 1687094
12310A687094J4035L0980N5057L4125K2923L8804L6250K6256L0677N8590K9781
$$ 1687094 1701129 1732109 1787166 1821291 1844214 1883018 1919268 1945524 1976201 2034791 2064572
12299B064572M9134K2745M2330M8655N8055O0057N6284K7053M3858O6000L7050
$$ 2064572 2113706 2136451 2178781 2227436 2285491 2345548 2401832 2428885 2472743 2538743 2575793
12288B575793N3434Q4518P8137M6937N2260K7420K7377N8393O9439O5766Q3124
$$ 2575793 2629227 2713745 2791882 2838819 2891079 2918499 2945876 3004269 3073708 3139474 3222598
12277C222598M5527J01956J00307Q2801M8209N6147P9761O6417O7873Q4916J06025
$$ 3222598 3268125 3370081 3470388 3553189 3601398 3657545 3737306 3803723 3871596 3956512 4062537
12266D062537J12380Q8886J08095R1046R3184J34584J47190J06629J14940J30291
$$ 4062537 4174917 4263803 4371898 4462944 4556128 4690712 4837902 4944531 5059471 5189762
12256E189762J43523J66605J61971J84173K22324K10231K22454K29003L31304
$$ 5189762 5333285 5499890 5661861 5846034 6068358 6278589 6501043 6730046 7061350
12247G061350L77626M50102N52390N58021M14507K97080K73146J79254P0775J30587
$$ 7061350 7438976 7889078 8441468 8999489 9413996 9711076 9984222 10163476 10234251 10364838
12237A0364838K51534K90307L36948M13740M75299M87168M89748N10083N40655
$$ 10364838 10616372 10906679 11243627 11657367 12132666 12619834 13109582 13619665 14160320
12228A4160320N60321O57264P07322P00000P10862P47515P58231P51771P40923
$$ 14160320 14720641 15377905 16085227 16785227 17496089 18243604 19001835 19753606 20494529
12219B0494529P47840P36169P19192O82587O84712O24593N31309N76266N15421
$$ 20494529 21242369 21978538 22697730 23380317 24065029 24689622 25220931 25797197 26312618
12210B6312618M47210M66440M84010M48904M38966M60436M56053M57819M66815
$$ 26312618 26759828 27226268 27710278 28159182 28598148 29058584 29514637 29972456 30439271
12201C0439271M61270N09162N69687N72481N57305N31920O03904O38573O71906
$$ 30439271 30900541 31409703 31979390 32551871 33109176 33641096 34245000 34883573 35555479
12192C5555479O86964P36602P42346Q07864Q50496Q62675R00117R23826R76744
$$ 35555479 36242443 36979045 37721391 38529255 39379751 40242426 41142543 42066369 43043113
12183D3043113J037508J062233J064686J036487J032181J019134J011713R31739
$$ 43043113 44080621 45142854 46207540 47244027 48276208 49295342 50307055 51238794
12175E1238794Q39951P44963N95589M80937L51948K18738N8991n8358k16005l09213
$$ 51238794 52078745 52823708 53419297 53900234 54252182 54470920 54529911 54471553 54255548 53946335
12165E3946335l98470n04475n87491o11968o56436p15023o91758o81822p21072
$$ 53946335 53547865 53043390 52455899 51843931 51187495 50472472 49780714 49098892 48377820
12156D8377820p16399p21708p07206p19258p19916p01821o95950o73274o47091
$$ 48377820 47661421 46939713 46232507 45513249 44793333 44091512 43395562 42722288 42075197
12147D2075197o43031o13421n97556n82732n62092n82731n14300m78606m51558
$$ 42075197 41432166 40818745 40221189 39638457 39076365 38493634 37979334 37500728 37049170
12138C7049170m14739m03825l73712l35539l49395l54593l20341k55748k04255
$$ 37049170 36634431 36230606 35856894 35521355 35171960 34817367 34497026 34241278 34037023
12129C4037023k01899j65977j31546j66836l58754o22865q71517j032820j164824
$$ 34037023 33835124 33669147 33537601 33370765 33012011 32389146 31517629 30484809 29319985
12120B9319985j218073j154830j059015r73593r21480q44733q22769p98284p81469
$$ 29319985 28101912 26947082 25888067 24914474 23992994 23148261 22325492 21527208 20745739
12111B0745739p68606p44945o95740o61259o48629o48101o11919n53090n91830
$$ 20745739 19977133 19232188 18536448 17875189 17226560 16578459 15966540 15413450 14821620
12102A4821620n72632n54749n24003n01446n12783m88896m45308m41759m07297
$$ 14821620 14248988 13694239 13170236 12668790 12156007 11667111 11221803 10780044 10372747
12093A0372747m14772l66044l52702l35011l42615l07467k72701k89485k89818
$$ 10372747 9957975 9591931 9239229 8904218 8561603 8254136 7981435 7691950 7402132
12084G402132k48710k02636k50646k41665j87824j76557j85053j97252j79266
$$ 7402132 7153422 6950786 6700140 6458475 6270651 6094094 5909041 5711789 5532523
12075E532523j43439j13774j29157j44767j38657j49163j16079j07180j18042
$$ 5532523 5389084 5275310 5146153 5001386 4862729 4713566 4597487 4490307 4372265
12066D372265j13771p7560r4746j05503j00127r4246j04096n4030r6458j02680
$$ 4372265 4258494 4180934 4086188 3980685 3880558 3786312 3682216 3628186 3531728 3429048
12056C429048j09180j14223o4709p3710o2586m8649n6713o9521l6911o3889n6027
$$ 3429048 3319868 3205645 3140936 3067226 3004640 2955991 2899278 2829757 2792846 2728957 2672930
12045B672930p6734n5380m1082n5191p4308l7013m1370o2764n3504j8575m8655
$$ 2672930 2596196 2540816 2499734 2444543 2370235 2333222 2291852 2229088 2175584 2157009 2108354
12034B108354o3564k6020j3692l3724m7295j2522n3074p6159j1216l4946k4979
$$ 2108354 2044790 2018770 2005078 1971354 1924059 1911537 1858463 1782304 1771088 1736142 1711163
12023A711163k0969p330j8543j9222q2780o5678l4065k0521K085l6246j1742j3040
$$ 1711163 1690194 1682864 1664321 1645099 1562319 1496641 1462576 1442055 1444140 1407894 1396152 1383112
12011A383112k2931m1074m5539J246k1706k8356r493K018n210q854k3386N954
$$ 1383112 1360181 1319107 1273568 1274814 1253108 1224752 1215259 1217277 1212067 1203213 1179827 1185781
11999A185781j3808j7687m034l6877l6321m5270n3599j4801O699k4342k354M587
$$ 1185781 1171973 1154286 1150252 1113375 1077054 1031784 978185 963384 970083 945741 943387 947974
11987I47974k648J2131k7939k6085l213j1711j7919p451k938n8844k8479n493
$$ 947974 945326 957457 929518 903433 900220 888509 870590 863139 860201 801357 772878 767385
11975G67385p627N819J8468j7121n055K7699M291j9589N650o5879k1281P774k4632
$$ 767385 759758 765577 784045 766924 761869 789568 793859 774270 779920 714041 692760 700534 675902
11962F75902j764L4290l3437m7810k6481j5195J4232k8293j6606J3131O188l6542
$$ 675902 674138 708428 674991 627181 600700 585505 599737 571444 554838 567969 574157 537615
11950E37615l0985k094l139O253O447P225m751r087K254q739j8218J6777O30j963
$$ 537615 506630 504536 501397 507650 514097 521322 516571 507484 509738 500999 482781 499558 500188 498225
11936D98225q958k2328k586n700P64J7928J232n34m592k9655k5715p289l1151
$$ 498225 489267 466939 464353 458653 459417 477345 478577 478043 473451 443796 418081 410792 379641
11923C79641m612k4515N83r885Q742J4214J3512J0458j3337j1799J2483k0871
$$ 379641 375029 350514 351097 341212 349954 364168 377680 388138 374801 363002 375485 354614
11911C54614K1201j400k1570N335J9225j9029Q116m470k9741j5757N818M120j7784
$$ 354614 375815 374415 352845 358180 377405 358376 366492 362022 332281 316524 322342 326462 308678
11898C08678k7012j3648l107O814R760P663j597J7659k1610l9050J751J8227J7598
$$ 308678 281666 268018 264911 271725 281485 289148 287551 305210 283600 244550 246301 264528 282126
11885B82126K3695q183j6803k7081J7447k992J3778j0678l0102l661J9528n420
$$ 282126 305821 297638 280835 253754 271201 268209 281987 271309 241207 237546 257074 251654
11873B51654j9591j2908J5331n43r532l2208J88L0932K445k0411k3974j4979k1147
$$ 251654 232063 219155 234486 233943 224411 192203 192391 223323 225768 205357 181383 166404 145257
11860A45257M368l2669K7901K0064j5715J804R626j9445J627j0664P220K6000
$$ 145257 149625 116956 144857 164921 149206 151010 160636 141191 142818 132154 139374 165374
11848A65374J6510K1070k1270o976j2672k867k654J5206K1857j2474J3249k985
$$ 165374 181884 202954 181684 174708 162036 159169 156515 171721 193578 181104 194353 191368
11836A91368j4472J0247N340j1595j8226k966K490L5493L2653L6284K2556K1151
$$ 191368 176896 187143 192483 180888 162662 159696 162186 197679 230332 266616 289172 310323
11824C10323K3489K1671j0731O657j839M847J2469m565J2501L846o625k6472m0384
$$ 310323 333812 355483 344752 351409 349570 354417 366886 362321 374822 378668 372043 345571 305187
11811C05187K304L8776J2032j886k3306j7766q213J630J0301K5221J0872j2301
$$ 305187 307491 346267 358299 356413 333107 315341 307128 308758 319059 344280 355152 342851
11799C42851M692K5315J5343O581j0909k1223k9210R844L3012k4680J4945N596
$$ 342851 347543 372858 388201 394782 383873 362650 333440 343284 376296 351616 366561 372157
11787C72157K7020K2984J8661K3396K7739P7429N2657K2274L7626J2461N8205
$$ 372157 399177 422161 440822 464218 491957 569386 622043 644317 681943 694404 752609
11776G52609K0104k4802m1912o5758k9995j3152J5236j9346j7116l5650K68J9105
$$ 752609 772713 747911 705999 640241 610246 597094 612330 592984 575868 540218 540486 559591
11764E59591k880K5689J505k7363k6563j6343J2010R314q795j5374J1848M2861
$$ 559591 556711 582400 583905 556542 529979 513636 525646 534960 526165 510791 522639 565500
11752E65500J5923j3887j8672M045l1819l3095j7450j7713L4314l672J2689J7310
$$ 565500 581423 567536 548864 552909 521090 487995 470545 452832 487146 483474 496163 513473
11740E13473K5037K877p676J0857J0730J1029L4690M504j5838k4797n17K5369
$$ 513473 538510 541387 533711 544568 555298 566327 601017 605521 589683 564886 564369 589738
11728E89738J5861q82N117k5178l1677Q960p620r243j3733l1210k334m514R21
$$ 589738 605599 604717 609834 584656 552979 561939 554319 545076 531343 500133 497799 493285 494206
11715D94206j0287n69j539k4618k8916o154K3789j2072j3935P931l7010q996J1520
$$ 494206 483919 483350 481811 457193 428277 422123 445912 433840 419905 427836 390826 381830 393350
11702C93350n792j9078j7372J6847k3361N249k781k0802K1968j690j3484j4456
$$ 393350 387558 368480 351108 367955 344594 349843 347062 326260 348228 346538 333054 318598
11690C18598l2170j271n88J9520K5992j0206m7265l1491J3026P829n751o223J1455
$$ 318598 286428 285157 284569 304089 330081 319875 272610 241119 254145 261974 256223 250000 261455
11677B61455j397q009J8026j3725l311K6642l2223k9696j3030J6910K6386m235
$$ 261455 260058 252049 270075 256350 253039 279681 247458 217762 204732 221642 248028 243793
11665B43793l979K042l575k0046k745j2088J5017J0455m3595m3004K3332Q226
$$ 243793 239814 241856 238281 218235 215490 203402 218419 228874 185279 142275 165607 173833
11653A73833m4057k727J3463r886J7062J0364j9251l880l038j1997M743M9143
$$ 173833 129776 127049 140512 130626 147688 158052 138801 134921 131883 119886 124629 173772
11641A73772j101l2718j7733R81K2950p386j9764j828j935j3849J1887j1306K375
$$ 173772 172671 139953 122220 123201 146151 138765 119001 117173 115238 101389 113276 101970 104345
11628A04345o745j470N659L187j7877o999r368M030J5579K463j673J3829J3476
$$ 104345 97600 96130 101789 104976 87099 80100 70732 74762 90341 92804 91131 104960 118436
11615A18436j7532j3080J1854L722j0225p043M942J4592K8507k5362k1925j356
$$ 118436 100904 87824 99678 103400 93175 86132 91074 105666 134173 108811 86886 85530
11603H5530j3286p956L8304J2043J5248o023k6811k7670J5584J8998j2994m847
$$ 85530 72244 64288 102592 114635 129883 123860 97049 69379 84963 103961 90967 86120
11591H6120l2006M364N206J0360J2369J3379N019j386j8828j5303m105r726Q423
$$ 86120 54114 58478 63684 74044 86413 99792 104811 103425 84597 69294 65189 55463 63886
11578F3886K5064K9754p072m5919m5525J6773L1492P990k0960P224R303k3480
$$ 63886 88950 118704 111632 65713 20188 36961 68453 76443 55483 62707 72010 48530
11566D8530J8173K7251j1566m652l9102k4318J221k1718K627M667K8758q692j8705
$$ 48530 66703 93954 82388 77736 38634 14316 15537 -6181 -3554 1113 29871 21179 2474
11553B474L2227J0445j0637K8314J2233p278j9819k732J9446L1692k3555j5582
$$ 2474 34701 45146 34509 62823 75056 67778 47959 45227 64673 96365 72810 57228
11541E7228J437K2177L736j0017k5652K0571N076K3670m690j8370J1225k4443
$$ 57228 58665 80842 84578 74561 48909 69480 74556 98226 93536 75166 86391 61948
11529F1948J9319j884q421j0267k0985k0740j2036R110J7625p692l529q094L699
$$ 61948 81267 79383 70962 60695 39710 18970 6934 16044 33669 25977 22448 14354 18053
11516A8053n6l798N393J2596J1597J1481O112l2761r890K9830j9975Q032K9503
$$ 18053 17997 14199 19592 32188 43785 55266 61378 28617 18727 48557 28582 36614 66117
11503F6117J5119j0365j1679j6120k655J3572R572o659l208P599j470j8311r980
$$ 66117 81236 70871 59192 43072 40417 53989 63561 56902 53694 61293 59823 41512 31532
11490C1532k8334j5275L2752J2916k517L2957M3494n456m7668l4748L943N227
$$ 31532 3198 -12077 20675 33591 31074 64031 107525 102069 54401 19653 23596 28823
11478B8823J5439j1442J3972K2911N573J792o075l0022l6733N967M64K6023O151
$$ 28823 44262 32820 46792 69703 75276 77068 70993 40971 4238 10205 10669 36692 42843
11465D2843n599K3212j2159L452K8420l833j9663J5109l1650j988m127k0946M236
$$ 42843 37244 60456 48297 51749 80169 76336 56673 71782 40132 38144 34017 13071 17307
11452A7307L4478K3189r50k1675k4197j7377J2578P176p859p246r06J827j3450
$$ 17307 51785 74974 74024 52349 28152 10775 23353 30529 22670 15424 14518 16345 2895
11439B895j571K8834j1975k4543J0256P56q574j1174L4261J173j2276J5650J8239
$$ 2895 1324 30158 18183 -6360 3896 4652 -3922 -15096 19165 20338 8062 23712 41951
11426D1951J7238N955j6468l554O402R581j3878k4393r842k2222N441J7546j1104
$$ 41951 59189 65144 48676 45122 51524 61105 47227 22834 12992 -9230 -3789 13757 2653
11413B653k4004K7887J9632P310J7580m771j3499m1241J137J0721M512n608k249
$$ 2653 -21351 6536 26168 33478 51058 46287 32788 -8453 -7316 3405 7917 2309 60
11400F0J1819J1123j1509q761n808N140N255M848J1083K9860J1879Q004j9582
$$ 60 11879 23002 11493 2732 -3076 2064 7319 12167 23250 53110 64989 72993 53411
11387E3411m801j5241l5161P898J9652j1328j6092J2451N723j0770j9177L24J6297
$$ 53411 48610 33369 -1792 6106 25758 14430 -1662 10789 16512 5742 -13435 -13111 3186
11374C186j683j9574K0942J0938j383M5K674o853Q194k4661j6980o255j3765L7781
$$ 3186 1503 -18071 2871 13809 12426 12471 15145 8292 16486 -8175 -25155 -31410 -45175 -7394
11360g394K6901J7494J1891L935j2145m856J5109P077R97l166q173n512R903M814
$$ -7394 19507 37001 48892 52827 40682 35826 50935 58012 59009 55843 47670 42158 52061 56875
11346E6875k5586l5516O928J0893J2700k4565m0846k2977j2837o624O5542N3260
$$ 56875 31289 -4227 2701 13594 26294 1729 -39117 -62094 -74931 -81555 -16013 37247
11334C7247K5206j5039k7028L805j0145J6130K0801l5533l5900l170J1346J5358
$$ 37247 62453 47414 20386 24191 14046 30176 50977 15444 -20456 -23626 -12280 3078
11322C078o062M755K9666J475p501l425p045J658o759j2265K057L3587J7948Q454
$$ 3078 -2984 1771 31437 32912 25411 21986 14941 16599 9840 -2425 -368 33219 51167 59621
11308E9621p641j8224o26l2270j2341J9934P941l0126J0701R429L78R759j1554
$$ 59621 51980 33756 33130 860 -11481 8453 16394 -13732 -3031 6398 6776 16535 4981
11295D981N866q476M762J7060K0306K7355R03j8377q334j4673j350k0322L437
$$ 4981 10847 2371 7133 24193 44499 71854 72757 54380 46046 31373 30023 9701 13138
11282A3138M6334n910l0923j0870J246P971n747r527k5954K0738J8882L979K0330
$$ 13138 59472 53562 22639 11769 13015 20986 15239 5712 -20242 496 19378 23357 43687
11269D3687j359j7987p610j494N702R578K3084r609l0354K3919O409J9132J225
$$ 43687 42328 24341 16731 15237 20939 30517 53601 43992 13638 37557 43966 63098 64323
11256F4323k1965J0782O999J2865n198k2479k3513k8216J6341M5453j1685k0203
$$ 64323 42358 53140 60139 73004 67806 45327 21814 -6402 9939 55392 43707 23504
11244B3504m358J5164K4150n446m0540k8884J8142K4936o213j9874J037J2576
$$ 23504 19146 34310 58460 53014 12474 -16410 1732 26668 20455 581 1618 14194
11232A4194L478o161K692J6716p24K634N184j2330J9598J852L053l6162j497O39
$$ 14194 17672 11511 14203 30919 30195 32829 38013 25683 45281 47133 50186 14024 12527 13166
11218A3166L1569p461k1718j8974J0934K1430J7971l197k6353j4740P448l485
$$ 13166 44735 37274 15556 -3418 7516 28946 46917 43720 17367 2627 10075 6590
11206F590K497J5201N541j0038k7019J0254j7555R340J1433K513l3677K3623J3308
$$ 6590 9087 24288 29829 19791 -7228 3026 -14529 -5189 6244 8757 -24920 -1297 12011
11193A2011k1138L321j6349J8127L2903j7694M3812L2078m4733J8646K0041j5108
$$ 12011 -9127 -5806 -22155 -4028 28875 11181 54993 87071 42338 60984 81025 65917
11181F5917k3065J3794j2871J1446N070l1011j707O601j5774K642l701J7207j466
$$ 65917 42852 56646 43775 55221 60291 29280 27573 34174 18400 21042 17341 34548 33082
11168C3082j4006j7892m066L223p878J1868J8789m810k265N971Q059L773j6957
$$ 33082 19076 1184 -2882 341 -7537 4331 23120 18310 16045 22016 30075 33848 16891
11155A6891j1151j9363J4330O786M39J8539J7590j3078l678J4519j611l3336j3634
$$ 16891 5740 -13623 707 7493 7932 26471 44061 30983 27305 41824 40213 6877 -6757
11142f757P758M3348m43l0389k6201K3901L1224j5374L219r921j3574l995P353
$$ -6757 1001 44349 43906 13517 -12684 11217 42441 27067 30286 20365 6791 2796 10149
11129A0149N511j9766j5665K3333J9017k8282j6384j2205Q52M4852J0155n54k6801
$$ 10149 15660 -4106 -19771 3562 22579 -5703 -22087 -34292 -33440 11412 21567 21013 -5788
11116e788k8774j3060n461p940K7846J3685K0328K8267p770k4712r904k3967K5847
$$ -5788 -34562 -47622 -53083 -61023 -33177 -19492 836 29103 21333 -3379 -13283 -37250 -11403
11103a1403K6007j776p508p802R641M344q321J4129P605P359k8686M538j474L693
$$ -11403 14604 12828 5320 -2482 7159 11503 3182 17311 24916 32275 3589 8127 6653 10346
11089A0346M307K4620j2627p983L280K2765j2771j2008l966K981J9465j9834k3141
$$ 10346 14653 39273 26646 18663 21943 44708 31937 19929 15963 18944 38409 18575 -4566
11076d566J9198k19J612j619q453j4789k4622K029K1874J4030r531m2739L564
$$ -4566 14632 14413 16025 14406 5953 -8836 -33458 -31429 -9555 4475 -5056 -47795 -44231
11063d4231M442J109K0070N1603j7748l9959J1846o326r316k749K2075K2433M4267
$$ -44231 -39789 -38680 -18610 32993 15245 -24714 -12868 -19194 -28510 -31259 -9184 13249 57516
11050E7516J5853j2490j8299j8274j0504J7586l3143l0241J3009M576R930O12
$$ 57516 73369 60879 42580 24306 13802 31388 -1755 -31996 -18987 -14411 -4481 -3869
11038c869L5440K0928l297j0523j5286O165K1254L162j1276k1701k8606M319O814
$$ -3869 31571 52499 49202 38679 23393 29558 50812 53974 42698 20997 -7609 -3290 3524
11025C524Q320O290J7359r392j5982j5032o102N392o761N376K5579J6207n810
$$ 3524 11844 18134 35493 26101 10119 -4913 -11015 -5623 -12384 -7008 18571 34778 28968
11012B8968L778O360L6176O61j6561J2187L183r712j5287n08J5223j4901l1100
$$ 28968 32746 39106 75282 75943 59382 71569 74752 65040 49753 49245 64468 49567 18467
10999A8467o928l984n63N01J8785M974R847o038l4156l3296L1298J7150k7961
$$ 18467 11539 7555 6992 7493 26278 31252 41099 35061 905 -32391 -1093 16057 -11904
10986a1904k194j0432J8956O336r01J620p582q051K4356l374l3623L797p727J6633
$$ -11904 -14098 -24530 -5574 762 -139 1481 -6101 -14152 10204 6830 -26793 -22996 -30723 -14090
10972a4090k3611J1976L7965L2470q176K1458k653J1204j1794k2659j2941j0404
$$ -14090 -37701 -25725 12240 44710 36534 57992 55339 66543 54749 32090 19149 8745
10960H745j3741j2635K2913L6433l4090m109N211k173K473o327n611L5649Q823
$$ 8745 -4996 -17631 5282 41715 7625 3516 8727 6554 9027 2700 -2911 32738 41561
10947D1561m1890k2166K9240j8205j3454p75J8475J0620J9970j1081k091o344
$$ 41561 -329 -22495 6745 -11460 -24914 -25689 -7214 3406 23376 12295 10204 3860
10935C860J0848J747j0450j103m282q110j8429K0856K576K1209j165L612j1008
$$ 3860 14708 16455 6005 4902 620 -7490 -25919 -5063 -2487 18722 17557 21169 10161
10922A0161j0760L98J1680K552K8674J3420j3533o567J605j1103k437K488J5213
$$ 10161 -599 -201 11479 14031 42705 56125 42592 36025 37630 26527 24090 26578 41791
10909D1791J0292k3482j7836j3140l8915K834L2475O660m036J4890J4255J1908
$$ 41791 52083 28601 10765 -2375 -41290 -38456 -5981 679 -3357 11533 25788 37696
10897C7696J0352J4346J1463J3898n61l2969l1527J8764J2845l793r900j0464
$$ 37696 48048 62394 73857 87755 87194 54225 22698 41462 54307 50514 40614 30150
10885C0150k6628l0772K391R737N973n320l843J0162k6325M0601J3999J3098j3878
$$ 30150 3522 -27250 -24859 -15122 -9149 -14469 -18312 -8150 -34475 6126 20125 33223 19345
10872A9345r863r529R617P867K2858n492k3154l851j3435l3446J4360K5904P100
$$ 19345 9482 -47 9570 17437 40295 34803 11649 7798 -5637 -39083 -24723 1181 8281
10859H281P108l193n907P665k3296J6808K479k370j8506J1910J6297K4646Q357
$$ 8281 15389 12196 6289 13954 -9342 7466 9945 7575 -10931 979 17276 41922 50279
10846E0279k8778j769K2140j3488n314K1864K0848Q232n38j1992l6942j7379j4714
$$ 50279 21501 19732 41872 28384 23070 44934 65782 74014 73476 61484 24542 7163 -7551
10833g551j3322N686M353K7348K1215m377j3346m472J179R492L1895j4799k0561
$$ -7551 -20873 -15187 -10834 16514 37729 33352 20006 15534 16713 26205 58100 43301 22740
10820B2740N464J3663j9291o722J3686q282j3515K5995K2395J5080k9464m4145
$$ 22740 28204 41867 22576 15854 29540 21258 7743 33738 56133 71213 41749 -2396
10808b396R856K2021k5807J7646J7607j6287j2554l713l682l18J064L1143K0202
$$ -2396 7460 29481 3674 21320 38927 22640 10086 6373 2691 2373 3437 34580 54782
10795E4782J1160O952O203k4469j6517k2643J582J4162j969j5050p783K0050K0684
$$ 54782 65942 72894 79097 54628 38111 15468 17050 31212 29243 14193 6410 26460 47144
10782D7144r822j0584j5103N1836k4565j1721R782J766J3488k15q869n972j2680
$$ 47144 37322 26738 11635 63471 38906 27185 36967 38733 52221 52006 43137 37165 24485
10769B4485O184j8040k2188j2909K1550R296L241J784J7665Q132J7722k9259k2917
$$ 24485 30669 12629 -9559 -22468 -918 8378 11619 13403 31068 39200 56922 27663 4746
10756D746K7191k371J2729j0679o267M674R375J0506j6578m2873Q188o653k0353
$$ 4746 31937 29566 42295 31616 25349 30023 39398 49904 33326 -9547 -1359 -8012 -28365
10743b8365l509Q9J8047O385N773J1665J2263J665P465j3969k2760K998r53L5575
$$ -28365 -31874 -31785 -13738 -7353 -1580 10085 22348 24013 31478 17509 -5251 -2253 -3206 32369
10729C2369J3286O212J333n150j3752j5296J7513J8982l1164q073J3727O671K035
$$ 32369 45655 51867 53200 48050 34298 19002 36515 55497 24333 16260 29987 36658 38693
10716C8693j5890J2055j161k4919J1028L9423j5109J0695j1280l8316j2072l1
$$ 38693 22803 34858 33697 8778 19806 59229 44120 54815 43535 5219 -6853 -6884
10704f884J1426J0408j2469Q023K426J8116q510k4307R745N425k1937J4940J2259
$$ -6884 4542 14950 2481 10504 12930 31046 22536 -1771 7974 13399 -8538 6402 18661
10691A8661L386R570R630l297j3963J7714N305j0304r55J7822J7230k3773k9192
$$ 18661 22047 31617 41247 37950 23987 41701 47006 36702 35747 53569 70799 47026 17834
10678A7834l5660J6324K676M849J9034K0671J2771j9973j5895k0476N364K2574
$$ 17834 -17826 -1502 1174 6023 25057 45728 58499 38526 22631 2155 7519 30093
10666C0093K1859p141L266l291q387j3152p009J3665K8349q922j6237n784L43
$$ 30093 51952 44811 48077 44786 36399 23247 16238 29903 58252 49330 33093 27309 27652
10653B7652j0493o621j4993J7408k4791k0062Q680R822j4150o270J1447K0922
$$ 27652 17159 10538 -4455 12953 -11838 -31900 -23220 -13398 -27548 -33818 -22371 -1449
10641a449K1401J2274l060R817q284k0574K283L893Q630J3823L508J285L318J2175
$$ -1449 19952 32226 29166 38983 30699 10125 12408 16301 24931 38754 42262 43547 46865 59040
10627E9040k789k5079j7250j4711M8488K5473k207m1088m7813O715J5440j6270
$$ 59040 56251 31172 13922 -789 47699 73172 70965 29877 -17936 -11221 4219 -12051
10615a2051O765r260J2956O971k982o398O374N9k1710l1757O375K6406N2813L8492
$$ -12051 -5286 -14546 -1590 5381 2399 -3999 2375 2434 -19276 -51033 -44658 -18252 34561 73053
10601G3053P211l4870j3773N398r754k2945J3392j4497J5802L411k3648N166L0866
$$ 73053 80264 45394 31621 37019 27265 4320 17712 3215 19017 22428 -1220 3946 34812
10588C4812L9840M631n582L450q876l7930k9113l562L5331k0571k6785j1975O498
$$ 34812 74652 79283 73701 77151 68275 30345 1232 -2330 33001 12430 -14355 -26330 -19832
10575a9832J6644m908M151K9751L2164L063p968j0782O939n181j6051j875J0171
$$ -19832 -3188 -8096 -3945 25806 57970 61033 53065 42283 49222 44041 27990 26115 36286
10562C6286J8641k5025l9211N118K9864j165n14L0370J9519J429l5607j1139K74
$$ 36286 54927 29902 -9309 -4191 25673 24508 23994 54364 73883 75312 39705 28566 28840
10549B8840l9690k81L4705K3607Q118k6891r438j5823m672J609o535J8526p878
$$ 28840 -10850 -11131 23574 47181 55299 28408 18970 3147 -1525 84 -6451 12075 4197
10536D197o033J2855l0410J941K6956p942K7813L1218m553n187j9613o730q893
$$ 4197 -1836 11019 -19391 -17450 9506 1564 29377 60595 56042 50855 31242 24512 15619
10523A5619m554k0981n884k175n991Q875O598J8241J3710k582J0390k8621j6345
$$ 15619 11065 -9916 -15800 -17975 -23966 -15091 -8493 9748 23458 20876 31266 2645 -13700
10510a3700K0564J8149J8308J8940M212N860j7126k4846R192q929k5655n102N891
$$ -13700 6864 25013 43321 62261 66473 72333 55207 30361 39553 30624 4969 -133 5758
10497E758K5820L4181N704j5359l3322k0467q153M051L296L6799l513k7041K7213
$$ 5758 31578 65759 71463 56104 22782 2315 -5838 -1787 1509 38308 34795 7754 34967
10484C4967l568q081j0407p632r701m906K3017K2505J8130k0838q128l7579J01
$$ 34967 31399 23318 12911 5279 -4422 -9328 13689 36194 54324 33486 25358 -12221 -12120
10471a2120L0158K3764P053J0572j3408k5623j8488R351n229P326K7871j6370
$$ -12120 18038 41802 48855 59427 46019 20396 1908 11259 6030 13356 41227 24857
10459B4857m112M354j924o987L650J6978k0553k952J7163J9531Q12J0270o543
$$ 24857 20745 25099 23175 16188 19838 36816 16263 13311 30474 50005 50817 61087 54544
10446E4544J935q530k15J1425j7068J5338j0583j3912L472j7041K8641J8341j8705
$$ 54544 56479 47949 47734 59159 42091 57429 46846 32934 36406 19365 48006 66347 47642
10433D7642j1579q590J1446J3496j0749j4623M238L1623N615l220N965M333N845
$$ 47642 36063 27473 38919 52415 41666 27043 31281 62904 68519 65299 71264 75597 81442
10420H1442m020N720r272j4692r228q877L206K1063j1321l094M316j3201l0453
$$ 81442 77422 83142 73870 59178 49950 41073 44279 65342 54021 50927 55243 42042 11589
10407A1589q927O171M9431n258j6959j1714k4757n087K9211L0657j055j6473P195
$$ 11589 2662 8833 58264 53006 36047 24333 -424 -5511 23700 54357 53302 36829 44024
10394D4024J0193J9895J5854n515k4463O779j2155j0543J7934K4228N237j4654
$$ 44024 54217 74112 89966 84451 59988 66767 54612 44069 62003 86231 91468 76814
10382G6814k3902k4130j3876j39J5418K2823J8379Q751K9922l5892l0948P612
$$ 76814 52912 28782 14906 14767 30185 53008 71387 80138 110060 74168 43220 50832
10370E0832j1833m976L689j5281J0486J900Q268l072R135J6684L509l3752R152
$$ 50832 38999 34023 37712 22431 32917 34817 43085 40013 49148 65832 69341 35589 44741
10357D4741J5569J745o307K0474L5978l722j5896j2020n218k85J7145k914j6188
$$ 44741 60310 62055 55748 76222 112200 108478 92582 80562 75344 75059 92204 89290 73102
10344G3102O039j3157k8772j0470j6834J3825L1806L6691K5506j3880k1100j0541
$$ 73102 79141 65984 37212 26742 9908 23733 55539 92230 117736 103856 82756 72215
10332G2215j8510J3525k077K3568M3111j1460m4401j0853M6114J8786j5849k9324
$$ 72215 53705 67230 65153 88721 131832 120372 75971 65118 111232 130018 114169 84845
10320H4845R728L1698p165k4277J2102l050j0404J5005J3498j3405N636j4310
$$ 84845 94573 126271 119106 94829 106931 103881 93477 108482 121980 108575 114211 99901
10308I9901j7190P0j0263K8202M3298j8587k3818n92r71k3932N792J4698k621
$$ 99901 82711 82781 72518 100720 144018 125431 101613 101021 100050 76118 81910 96608 93987
10295I3987j2705O169q957Q622J424K9812M5116K514j85K5787K6305P997k8848
$$ 93987 81282 87451 78494 87116 88540 118352 163468 165982 165797 191584 217889 225886 197038
10282A97038O21K0508K7134K1669M7007J3782K9748M354k0625m2093j6211J2604
$$ 197038 197659 218167 245301 266970 313977 327759 357507 361861 341236 299143 282932 295536
10270B95536J113n1142l0476L0056Q207k067m982l2740k2901J4195j5360k2421
$$ 295536 296649 245507 215031 245087 253294 251227 246245 213505 190604 204799 189439 167018
10258A67018J9114K970j0782K1948K681j3782j5429R703j8853l362J120o002j0660
$$ 167018 186132 189102 178320 200268 202949 189167 173738 183441 164588 161226 162346 156344 145684
10245A45684p865K5287M7799M623L2845L1831M5949K8997L6452L8888J7774K6624
$$ 145684 137819 163106 210905 215528 248373 280204 326153 355150 391602 430490 448264 474888
10233D74888J5897K6771L998l3014l8265j6953l7268q470l8326j4056M08k6498
$$ 474888 490785 517556 521554 488540 450275 433322 396054 387584 349258 335202 335610 309112
10221C09112k8713k3210R665j2808m5917O130r606J2043J0898O498j5731j1087
$$ 309112 280399 257189 266854 254046 208129 214259 204653 216696 227594 234092 218361 207274
10209B07274r415o387J5080J5088j6636L271K7264R317J9235K0328K7521K6316
$$ 207274 197859 191472 206552 221640 205004 208275 235539 244856 264091 284419 311940 338256
10197C38256r781J4189R433K0164k12Q523J3290K6835M7824L7541m1661l8098
$$ 338256 328475 342664 352097 372261 372049 380572 393862 420697 468521 506062 464401 426303
10185D26303k6278l4387j7010l651q74k9408m3811k4654L3514J5046j7377j8076
$$ 426303 400025 365638 348628 344977 344103 314695 270884 246230 279744 294790 277413 259337
10173B59337O090o06r191j7772m661o140k0834j1093j384M0430L9047K132J3569
$$ 259337 265427 264821 255630 237858 233197 227057 206223 195130 193746 234176 273223 275355 288924
10160B88924K2184K8341K8238j8641n6772m4798k0035K345M3654N4252P195J595
$$ 288924 311108 339449 367687 349046 292274 247476 227441 229786 273440 327692 334887 336482
10148C36482m283N341o201L555r887m4048k8927n827K8459L468k6061j2717L0950
$$ 336482 332199 337540 331339 334894 325007 280959 252032 246205 274664 278132 252071 239354 270304
10135B70304P790k869j5761J8676l8095j0327J6912J5569J1447L8478K1527l6164
$$ 270304 278094 275225 259464 278140 240045 229718 246630 262199 273646 312124 333651 297487
10123B97487k5978k4026k307L1484p781J9928K4903p858P6j8945j1918k1337j6820
$$ 297487 271509 247483 245176 276660 268879 288807 313710 305852 305928 286983 275065 253728 236908
10110B36908J9827J0456l8258m6528j0094K9620M2129J0312p969r824q703J7390
$$ 236908 256735 267191 228933 182405 172311 201931 244060 254372 246403 236579 227876 245266
10098B45266J0098K2637O201O933j3872k3364J915j0746q905J4327J9012k8738
$$ 245266 255364 278001 284202 291135 277263 253899 255814 245068 236163 250490 269502 240764
10086B40764n478j6412K471K7102L7573M2770j0081l7420j0152K2690O49j2363
$$ 240764 235286 218874 221345 248447 286020 328790 318709 281289 271137 293827 294476 282113
10074B82113j3667m90P204m51N011J2620M0976K3283k9418l7999j5888K917l152
$$ 282113 268446 267956 275160 274709 279720 292340 333316 356599 327181 289182 273294 276211 273059
10061B73059J4964J403j3930j6247K410R282j1314J653M0649M0942j8749m1605
$$ 273059 288023 289426 275496 259249 261659 270941 259627 261280 301929 342871 324122 282517
10049B82517j707J0716j4468J80l68K4151J0293l0284Q38K3305K521L965K650
$$ 282517 280810 291526 277058 277238 276870 301021 311314 281030 281868 305173 307694 311659 314309
10036C14309M8399K4550j5115l3101l4598n846N469j6688l9596j5498L3554R039
$$ 314309 362708 387258 372143 339042 304444 298598 304067 287379 247783 232285 265839 274878
10024B74878q33J1590r448j5725J075K3700j0013j020k1994j8627K2741K3917
$$ 274878 274045 285635 276187 260462 261537 285237 275224 274204 252210 233583 256324 280241
10012B80241K6386j92L799q028l612q786P725k0966k1224P726J0388N119K4687
$$ 280241 306627 306435 310234 302206 298594 289808 297533 276567 255343 263069 273457 278576 303263
9999C03263J5272J065N216k9583m852R110J9001O292L3241J1637K635r712j3403
$$ 303263 318535 319600 324816 295233 290381 299491 318492 324784 358025 369662 372297 362585 349182
9986C49182K0218r107r19l828K2162N69n024J3237Q723k1564P293K0395J1561
$$ 349182 369400 360293 359374 355546 377708 378277 373253 386490 395213 373649 380942 401337 412898
9973D12898J8051P772K816J896J8966J8878P968L5860K8093j3249L424J9320J7949
$$ 412898 430949 438721 441537 443433 462399 481277 489245 525105 553198 539949 543373 562693 580642
9960E80642J2372j3123O304o60q179J507K419L6377q687K2595K5776J8978j2261
$$ 580642 593014 579891 586195 585535 577356 578863 581282 617659 608972 631567 657343 676321 664060
9947F64060O242P156L8269N0265K3245L9498M1699J5022n634M8033R0618N3193
$$ 664060 670302 677458 715727 765992 789237 828735 870434 885456 879822 927855 1018473 1071666
9935A071666N4773P3716J07833P8264P0140P3736L6188N3799N2829O8011J02393
$$ 1071666 1126439 1200155 1307988 1386252 1456392 1530128 1566316 1620115 1672944 1740955 1843348
9924A843348R5653N3607M4110J6163P340J7563L241j5026l579k6234Q867P4871
$$ 1843348 1939001 1992608 2036718 2052881 2060221 2077784 2081025 2065999 2062420 2036186 2045053 2119924
9912B119924K9259P653M5438Q8351R0529Q6452J35484J91241K18675K65574K55410
$$ 2119924 2149183 2156836 2202274 2290625 2381154 2467606 2603090 2794331 3013006 3278580 3533990
9901C533990K56970K06079J72745J21291L3763m654n359j3498n2268n2812n2660
$$ 3533990 3790960 3997039 4169784 4291075 4324838 4320184 4314825 4301327 4249059 4196247 4143587
9890D143587k3795M47j0119m2892j3672M315J5921K5123P0679J15439J33922J83038
$$ 4143587 4119792 4120239 4110120 4067228 4053556 4057871 4073792 4098915 4169594 4285033 4418955 4601993
9878D601993K58236K94049L22631L57593L77321M30375N11994O45903P99024J014434
$$ 4601993 4860229 5154278 5476909 5834502 6211823 6642198 7154192 7800095 8599119 9613553
9868I613553J277354J674990K198010K906313L753964M505289M874429M311499
$$ 9613553 10890907 12565897 14763907 17670220 21424184 25929473 30803902 35115401
9860C5115401K884975J181411m52863j890396k739325k743991k140489j388053
$$ 35115401 38000376 39181787 38728924 36838528 34099203 31355212 29214723 27826670
9852B7826670p20456k00501K03361N50910R16695J291762J655413J889773J993411
$$ 27826670 27106214 26905713 27109074 27659984 28576679 29868441 31523854 33413627 35407038
9843C5407038J939223J794129J501754J259693J117061J065581J021373R35904
$$ 35407038 37346261 39140390 40642144 41901837 43018898 44084479 45105852 46041756
9835D6041756P68970M48837j7176m94787q24012r55573r15026o31440p9374P00381
$$ 46041756 46810726 47259563 47242387 46747600 45923588 44968015 44052989 43421549 43342175 44042556
9825D4042556J630191K860379M442697O316067Q526902J0648105J1326204R241382
$$ 44042556 45672747 48533126 52975823 59291890 67818792 78466897 89793101 99034483
9817I9034483N166067Q40426l359723p192299r189464q815341p120120n158334
$$ 99034483 104200550 105040976 101681253 94488954 85299490 76484149 69364029 64205695
9809F4205695l437095k112354j237372p07148l58930j00692J50402K86388L66993
$$ 64205695 60768600 58656246 57418874 56711726 56352796 56252104 56402506 56688894 57055887
9800E7055887L07840Q6666j68511m02614o00409p60095r26665j120341j444979
$$ 57055887 57363727 57450393 57281882 56879268 56278859 55518764 54592099 53471758 52026779
9791E2026779j884191k276966k610892k772933k692212k389534j914148j403583
$$ 52026779 50142588 47865622 45254730 42481797 39789585 37400051 35485903 34082320
9783C4082320r01231m18665Q1508O85863J403978K150958K798991K998320K336969
$$ 34082320 33181089 32762424 32843932 33529795 34933773 37084731 39883722 42882042 45219011
9774D5219011R56164n96685k080777l354433m033213l948711l352480k675555
$$ 45219011 46175175 45578490 43497713 40143280 36110067 32161356 28808876 26133321
9766B6133321k081857j669089j434323j305644j251441j200810j136802j013793
$$ 26133321 24051464 22382375 20948052 19642408 18390967 17190157 16053355 15039562
9758A5039562q81314p61987o67988n96663n45064n12054m74062m71642m71032
$$ 15039562 14158248 13396261 12728273 12131610 11586546 11074492 10600430 10128788 9657756
9749I657756m59502l99678l94946m67025m57656m11190l64403l16817k44945j72322
$$ 9657756 9198254 8798576 8403630 7936605 7478949 7067759 6703356 6386539 6141594 5969272
9739E969272j50239r9940l7088q3384j08334j57995k05613k55793k96170k93697
$$ 5969272 5819033 5719093 5682005 5598621 5490287 5332292 5126679 4870886 4574716 4281019
9729D281019k77796k51650k08900j45116j38946j26077j76717j19419p6860p1908
$$ 4281019 4003223 3751573 3542673 3397557 3258611 3132534 2955817 2836398 2759538 2687630
9719B687630p2329p7495l0121n4802m5122k9508j1881n471m1039o6726o5672k0091
$$ 2687630 2615301 2537806 2507685 2452883 2407761 2378253 2366372 2360901 2319862 2253136 2187464 2167373
9707B167373m5621n2862n4781n4081k7610n7333r5874p1059q0462j10146j16551
$$ 2167373 2121752 2068890 2014109 1960028 1932418 1875085 1779211 1708152 1627690 1517544 1400993
9696A400993q3922p8346q2287m0618k4877n8416o2051m8664k4847p478j965k1771
$$ 1400993 1317071 1238725 1156438 1115820 1090943 1032527 970476 921812 896965 889487 887522 865751
9684H65751m7746p3355j4140j5498j7545L555o2823n4456l6955k4086J2315J0522
$$ 865751 818005 744650 730510 715012 697467 701022 638199 583743 546788 522702 535017 545539
9672E45539M503j3771j3312J7249O534q451j4213k3220l1935q652j4342p81J3173
$$ 545539 550042 536271 522959 540208 546742 538291 524078 500858 468923 460271 445929 445148 458321
9659D58321r401j6623o550l2597j2434r49L537j7m275J7229p341k4747j8946n654
$$ 458321 448920 432297 425747 393150 380716 379767 383304 383287 379012 396241 388900 364153 345207 339553
9645C39553J3069J8974K0520r534k4162o295k351n47J7762J563l9428m915o08
$$ 339553 352622 371596 392116 382582 358420 352125 349774 349227 366989 368552 329124 324209 323601
9632C23601j1753j9664l004M643K6063N037j4685Q428K4307k7773l4541P19J2325
$$ 323601 311848 292184 289180 293823 319886 324923 310238 318666 342973 315200 280659 281378 293703
9619B93703J9396j4211o083J5631j8506l3299j2526J7157K0243M273k8474j0170
$$ 293703 313099 298888 292805 308436 289930 256631 244105 261262 281505 285778 257304 247134
9607B47134P052L516j8863J9155O019q702l6137l505J220J448r548N417k6287
$$ 247134 254186 257702 238839 257994 264013 255311 219174 215669 216889 218337 208789 214206 187919
9594A87919J0783O615j3170m216k0183j025k55k256J4029R898j7027j0959J1033
$$ 187919 198702 205317 192147 187931 167748 166723 166468 164212 178241 188139 171112 160153 171186
9581A71186N314j8743K1922l183J573J7087J7437k8092j5889K8400J0604k4131
$$ 171186 176500 157757 179679 176496 178069 195156 212593 184501 168612 197012 207616 183485
9569A83485k200K016L6099L1342k232m3155m2258p268r734J6835L0204Q822j7354
$$ 183485 181285 183301 219400 250742 248510 205355 163097 155829 146095 162930 193134 201956 184602
9556A84602j4475p261j1068n620J5922K1269p334P807K4451j5563K5743J8476
$$ 184602 170127 162866 151798 146178 162100 183369 176035 183842 208293 192730 218473 236949
9544B36949J721p191p992n120j5000o481k2071J120J2564r522J268J5408K4647
$$ 236949 238670 231479 223487 218367 203367 196886 174815 175935 188499 178977 180245 195653 220300
9531B20300j5288k3749J7159k1127r563R545j6356K0599J8192j3225k9414j3260
$$ 220300 205012 181263 198422 177295 167732 177277 160921 181520 199712 186487 157073 143813
9519A43813J5222l884J723k8198M470N4468L6657k0600j6670n744J7687J541R445
$$ 143813 159035 155151 156874 128676 133146 187614 224271 203671 187001 181257 198944 200485 209930
9506B09930K443J562j806j3546o270J4919J0522J1272n247k1727k190L908Q058
$$ 209930 212373 213935 212129 198583 192313 207232 217754 229026 223779 202052 199862 203770 211828
9493B11828J8189p925j5767p92K426K5485L1399k675r76P534K2417M733n3407
$$ 211828 230017 222092 206325 205533 207959 233444 264843 262168 261192 268726 291143 295876 242469
9480B42469j2962J7345R103n296k8211m0138K6458J1878J2011L8021K1938N702
$$ 242469 229507 246852 255955 250659 222448 182310 208768 220646 232657 270678 292616 298318
9468B98318L276l80O697j9198p522M297l550N702j0859n763L5836j5110k6259
$$ 298318 301594 301214 307911 288713 281191 285488 281938 287640 276781 271018 306854 291744 265485
9455B65485J1231Q758N575k4271N987M8273L5788l403N242K6388N1502L2166L1990
$$ 265485 276716 285474 291049 266778 272765 321038 356826 353423 358665 385053 436555 468721 500711
9442E00711M8678M4930N0418K3807q211J623J1372k4389q222j4644j5924m3806
$$ 500711 549389 594319 644737 668544 660333 661956 673328 648939 640717 626073 610149 566343
9430E66343m0390j9896j3387j93J7014j4845J6103Q312j2510k84Q25O063J7915
$$ 566343 525953 506057 492670 492477 509491 494646 510749 519061 506551 506267 507092 513155 531070
9417E31070l563k3683K62K6200K971k1018j0871N130j4382M746Q964j94J1422
$$ 531070 527507 503824 504086 530286 533257 512239 501368 506498 492116 496862 505826 505632 517054
9404E17054J7488K893K5077M2611N8118K1610J9100N3554N9324M7366K790j8239
$$ 517054 534542 537435 562512 605123 663241 684851 703951 757505 816829 864195 866985 848746
9392H48746Q949k4765m0518k6746k5952k4804j5881j3505j8365j2129k8343j3774
$$ 848746 857695 832930 792412 765666 739714 714910 699029 685524 667159 655030 626687 612913
9380F12913k8965l854J825K065M277l7324l1351M875K9205J4526k7817m1406m282
$$ 612913 583948 580094 581919 583984 588261 550937 519586 524461 553666 568192 540375 498969 494687
9367D94687k459j8403J4644K2025j9139o443J5311J881J1820J5115J3352k267
$$ 494687 492228 473825 488469 510494 491355 484912 500223 502104 513924 529039 542391 540124
9355E40124L8822L1221J6355J4888K0017j8847j7601O420j155k8429k0193l0167
$$ 540124 578946 610167 626522 641410 661427 642580 624979 631399 630244 601815 581622 551455
9343E51455j9735J034j1539j461J0568j5131j5505j5592j0976k3053k2815r639
$$ 551455 531720 532754 521215 519754 530322 515191 499686 484094 473118 450065 427250 417611
9331D17611J1520J7901P646L27k8636k6296n215k6768O65J3625M5732j3090k9660
$$ 417611 429131 447032 454678 455005 426369 400073 394858 368090 368755 382380 428112 415022 385362
9318C85362J3502R85j1512k8509k2445K5061K1969O568J8231j5211j2008n153
$$ 385362 398864 399849 388337 359828 337383 362444 384413 390981 409212 394001 381993 376840
9306C76840J0552q023k1067k0207r786k45K1930n042j5886j1329m521k9760K900
$$ 376840 387392 379369 358302 338095 328309 328064 349994 344952 329066 317737 313216 283456 286356
9293B86356K4038J4469J2748k762o016J593R723q573J65K0752j6786m3479m339
$$ 286356 310394 324863 337611 334849 328833 330426 340149 331576 331741 352493 335707 292228 287889
9280B87889J5564l684m4347j9961p099K0899L975J9604l4861J075J7569M2380
$$ 287889 303453 299769 255422 235461 228362 249261 253236 272840 237979 239054 256623 299003
9268B99003J2398j5697k0499J0238m424l0215j24L753m38j680k737m9519j1132
$$ 299003 311401 295704 275205 285443 281019 250804 250680 254433 253995 252315 249578 200059 188927
9255A88927Q579K2029J9908k731l985j7302J3071J141n820j9460J8866J6842j9490
$$ 188927 197506 219535 239443 236712 232727 215425 228496 229637 223817 204357 223223 240065 220575
9242B20575k0228m745P514M005r537p31J6412M451k3131r591j7140J5455K2825
$$ 220575 200347 195602 203116 207121 197584 196853 213265 217716 194585 184994 167854 183309 206134
9229B06134J2270R766r436j5239k682J6587j6602j7001j1859o924J8551O302p203
$$ 206134 218404 228170 218734 203495 200813 217400 200798 183797 171938 165014 183565 189867 182664
9216A82664J918L829q548j9611p110J9203l761J2641Q603k9300j0355k781j2139
$$ 182664 184582 188411 179863 160252 153142 172345 168584 181225 189828 160528 150173 147392 135253
9203A35253K0267M4641j2346j5877j6373r315m894J3534r420M675J6281N7j3597
$$ 135253 155520 200161 187815 171938 155565 146250 141356 154890 145470 150145 166426 166483 152886
9190A52886l0358o4R738k6988L392J2160J3467J7498m257m769j7482l5145J0670
$$ 152886 122528 122464 132202 105214 108606 120766 134233 151731 147474 142705 125223 90078 100748
9177A00748j0852m354P088J0870J5303J9233R855n1k2480j26j5655J2591J9535
$$ 100748 89896 85542 92630 103500 118803 138036 147891 147840 125360 125234 109579 122170 141705
9164A41705k2290p700L663J2584n141J8999q39l5552k7206K5280K0139j2246l0301
$$ 141705 119415 111715 115378 127962 122821 141820 140981 105429 78223 103503 123642 111396 81095
9151H1095j516K1281j9965k990J8605j7503m1748L3835K1381q781O056M091J4126
$$ 81095 79579 100860 80895 77905 96510 79007 37259 71094 92475 83694 89750 93841 107967
9138A07967K3483m980k4346j884L106R882k4099p934J0488m064j6110j6376j4947
$$ 107967 131450 126470 102124 100240 103346 113228 89129 81195 91683 87619 71509 55133 40186
9125D0186K4226K3542q82l267r00r747R550J7530O438j7132j5787J5679J7672
$$ 40186 64412 87954 87072 83805 82905 73158 82708 100238 106676 89544 73757 89436 107108
9112A07108j8970k9776K9228o107N806P30P930K6042K3346J109Q063j0801k3031
$$ 107108 88138 58362 87590 81483 87289 88019 95949 121991 145337 146446 154509 143708 120677
9099A20677l625j116P191j8898j8753m372J119j5910j9779j9203R722j2570K2319
$$ 120677 117052 115936 123127 104229 85476 81104 82223 66313 46534 27331 37053 24483 46802
9086D6802M2870L0903r855k3460r726M313M749M825j0178q862K8464K4797J382
$$ 46802 89672 120575 110720 87260 77534 81847 86596 91421 81243 72381 100845 125642 127024
9073A27024k847l016k9285l2251O633l740M93k2166K5386L2040O24j7124P616
$$ 127024 124177 121161 91876 59625 66258 62518 63011 40845 66231 98271 98895 81771 89387
9060H9387r161l3514k4694k057J6396J3647K0054j2181n089q789j0756O673J5582
$$ 89387 80226 46712 22018 19961 36357 50004 70058 57877 52788 43999 33243 39916 55498
9047E5498M2722J1467J8689K1834j4237j9101o717k1974j7054j5277K71R215J7047
$$ 55498 98220 109687 128376 150210 135973 116872 110155 88181 71127 55850 56121 65336 82383
9034H2383j7742k1248R85p318l939K6020J1779J1551k974j6015j241j2259k8031
$$ 82383 64641 43393 44378 37060 33121 59141 70920 82471 79497 63482 62241 49982 21951
9021B1951J8090O209l36q958k396o893J1643M9067R117k6511Q845J3443R46p512
$$ 21951 40041 46250 45914 36956 34560 27667 39310 88377 97494 70983 79828 93271 94217 86705
9007H6705o029k736l5381l2235J3104Q576k2989j0585r352J4490P666N6619M2410
$$ 86705 80676 77940 42559 10324 23428 32004 9015 -1570 -10922 3568 11234 67853 110263
8994A10263j6408k8796k8282q444J4025q22j3041j7426K110K4175K2150j0385
$$ 110263 93855 65059 36777 28333 42358 41536 28495 11069 13179 37354 59504 49119
8982D9119m9386r859L1305K548m51R96J2446J1589J1103P1j2852O418k4752j2709
$$ 49119 -267 -10126 21179 23727 23276 24272 36718 48307 59410 59481 46629 53047 28295 15586
8968A5586K2880K4391J0117m806J3458j6832l5471m6556p90M488K2484K2782j8274
$$ 15586 38466 62857 72974 68168 81626 64794 29323 -17233 -18023 -13535 8949 31731 13457
8955A3457k3899K2309J7451J955J353n122k3884k0385J5989M6620J2966l7515
$$ 13457 -10442 11867 29318 31273 32626 27504 3620 -16765 -776 45844 58810 21295
8943B1295k5582k1104J1060J8927J1258P013r179n727N288K6112j1836J0513R832
$$ 21295 -4287 -25391 -14331 4596 15854 22867 13688 7961 13249 39361 27525 38038 47870
8930D7870J5019K0883j9366k0485N19K3910j968k6377K692O937j3624J137J4188
$$ 47870 62889 83772 64406 43921 44440 68350 66382 40005 42697 49634 36010 37147 51335
8917E1335R648M070N521l0724k8489j550P796n277M305Q972k67J4981q87o095
$$ 51335 60983 65053 70574 39850 11361 9811 17607 12330 16635 25607 25340 40321 39434 33339
8903C3339K519K3461j1475Q27J0384k978Q76j7418o556l0099j2910J4556J272
$$ 33339 35858 59319 47844 48671 59055 56077 56953 39535 32979 2880 -10030 4526 5798
8890E798P230L9898j684l3449j3303K508R572J6483o25J8001j6829m2527j401
$$ 5798 13028 52926 51242 17793 4490 6998 16570 33053 32428 50429 33600 -8927 -10328
8877a0328M349O183Q818q663N806J6364K0486K1192k3665n6794j3084K1031J9756
$$ -10328 -5979 204 9022 359 6165 22529 43015 64207 40542 -16252 -29336 -8305 11451
8864A1451k747L963L4870O890P210j1817j6403P11J2994n755n25k1054L3925k1985
$$ 11451 8704 12667 47537 54427 61637 49820 33417 34128 47122 41367 40842 19788 53713 31728
8850C1728k8145q033K6151K4647k513M565l780q274Q29j548Q585J2395J3596K422
$$ 31728 3583 -4450 21701 46348 43835 48400 44620 36346 37175 35627 44212 56607 70203 72625
8836G2625J0931n1116l1179n860k767L0805M1427L2479j6015q217j0993l495j5143
$$ 72625 83556 32440 1261 -4599 -7366 23439 64866 97345 81330 73113 62120 58625 43482
8823D3482k0946q5j1354Q886J9160J7676q66r720K4528j7935j8988j331M936K3103
$$ 43482 22536 22451 11097 19983 39143 56819 55953 46233 70761 52826 33838 32507 37443 60546
8809F0546M662m2005q454J9852j1103M436K7389N929K915j2275m5187m1879J1251
$$ 60546 65208 23203 14749 34601 23498 27934 55323 61252 64167 51892 6705 -35174 -23923
8796b3923L0181J9644K1221L70M363J7410M202k1737q564Q574Q504k6085M87K2905
$$ -23923 6258 25902 47123 47493 51856 69266 73468 51731 43167 51741 60245 34160 34647 57552
8782E7552M206l7071k7597l8188J36j1812J2940L3824j566L746K4238q724k417
$$ 57552 61758 24687 -2910 -41098 -40962 -52774 -39834 -6010 -7576 -3830 20408 11684 9267
8769I267J0590P574J2553l764k5876p022j371j0688k2378L6734L9699J2829p86
$$ 9267 19857 27431 39984 36220 10344 3322 1951 -8737 -31115 5619 45318 58147 57361
8756E7361j9608k0035j3832j6203K651M746J4251J5367Q542m3620K156L5886L5431
$$ 57361 37753 17718 3886 -12317 -9666 -4920 9331 24698 33240 -10380 -8224 27662 63093
8743F3093q027l864K2051J2863l1942l888j0366M793l9801k849o773M135L78M330
$$ 63093 55066 51202 73253 86116 54174 50286 39920 44713 4912 2063 -4710 -575 -197 4133
8729D133p184j1048K3492P799o119r57k2464N148J8079J9801l901m902r671N071
$$ 4133 -3051 -14099 9393 17192 11073 10116 -12348 -7200 10879 30680 26779 21877 12206 17277
8715A7277P027k402J1350J939K2811q347m2190Q920L9061j1926k2262j6104k9595
$$ 17277 24304 21902 33252 35191 58002 49655 7465 16385 55446 43520 21258 5154 -24441
8702b4441M296K3234k25j0692J5224J9587J1481J0080N584j6137k2787j8825L404
$$ -24441 -20145 3089 2864 -7828 7396 26983 38464 48544 54128 37991 15204 -3621 -217
8689b17L8978J9862n04L6788K0134j7662m4796J5422p299j7270J767j5007R674
$$ -217 38761 58623 58119 94907 115041 97379 52583 68005 60706 43436 45203 30196 39870
8676C9870J0952l0639m238K4435j8402m35Q100l097L3992M5146m7011k8089l2031
$$ 39870 50822 20183 15945 40380 21978 21543 29643 26546 60538 105684 58673 30584 -1447
8663a447o00O426J5460j2210n140j8803P005J4746J6588L4194J8190k0399k3198
$$ -1447 -2047 4379 19839 7629 2489 -16314 -9309 5437 22025 56219 74409 54010 30812
8650C0812j0389l2529j848J3946j8448N733K4846o244J093M8586K3975J341nl9547
$$ 30812 20423 -12106 -13954 -8 -18456 -12723 12123 5879 6972 55558 79533 80874 80869 41322
8636D1322l322N217K1828J8705r900q295k1419J76L2207j5787J1511O926j1557
$$ 41322 38000 43217 65045 83750 73850 65555 44136 44312 76519 60732 72243 79169 67612
8623F7612p853k0311j2666K3596J0952k6565p362K9145L2556j951j4837j7120
$$ 67612 59759 39448 26782 50378 61330 34765 27403 56548 89104 87153 72316 55196
8611E5196j0783K630J3264n282k5238K3519j1234m3482K720L1465L9948J5328
$$ 55196 44413 47043 60307 55025 29787 53306 42072 -1410 1310 32775 72723 88051
8599H8051p561k194j7328l3864P683K2265J2643M946K913K4357Q175k2582j7597
$$ 88051 80490 78296 60968 27104 34787 57052 69695 74641 77554 101911 110086 87504 69907
8586F9907j2256K7068J008R114r076l4776k5531K5503J9490J0267O216j8367N999
$$ 69907 57651 84719 85727 94841 85765 50989 25458 50961 70451 80718 86934 68567 74566
8573G4566n830m0700k0251K7965J5440P308L298j9618K243r167Q722J6195m578
$$ 74566 68736 28036 7785 35750 51190 58498 61796 42178 44421 35254 43976 60171 55593
8560E5593k6773K059m876l0100L637J0451P452L4011Q026M289N200j9359o857
$$ 55593 28820 30879 26003 -4097 -460 9991 17443 51454 59480 63769 68969 49610 42753
8547D2753j626J3047K971L4486N017j3742J6659r792k8707k3810R002K0556J3621
$$ 42753 41127 54174 57145 91631 96648 82906 99565 89773 61066 37256 46258 66814 80435
8534H0435l5561k9075J1252J1439k1904k4143j5356K9203M2208K2779J3681k0094
$$ 80435 44874 15799 27051 38490 16586 -7557 -22913 6290 48498 71277 84958 64864
8522F4864j8208k5548K6265J3452J3127m987l2033L144j473j2486L834O287j4810
$$ 64864 46656 21108 47373 60825 73952 68965 36932 40076 38603 26117 29951 36238 21428
8509B1428o310N979P986k4260J035q906L479K091J8241J2196l3726J3837N291
$$ 21428 15118 21097 29083 4823 5858 -3048 431 2522 20763 32959 -767 13070 18361
8496A8361K4130j0215m139j9799k0239L532J2943J2386j8704n173p951J0236K6226
$$ 18361 42491 32276 28137 8338 -11901 -8369 4574 16960 -1744 -6917 -14868 -4632 21594
8483B1594K1444K8999J4330P635k2540j9779m1258n516L8866j1886j7512m35J17
$$ 21594 43038 72037 86367 94002 71462 51683 10425 4909 43775 31889 14377 13942 14059
8470A4059K6175O491j3232o021N259K204P068K026k5722l722J259k0632L7749
$$ 14059 40234 46725 33493 27472 32731 34935 42003 44029 18307 14585 15844 -4788 32961
8457C2961L0096k148k7385k570N248j46j7109J8632k574q003r191K0032K3998
$$ 32961 63057 60909 33524 30954 36202 36056 18947 37579 35005 27002 17811 37843 61841
8444F1841J4106j4970k8943l105j5j0257j461J2116J2880k1830j8325J838k055
$$ 61841 75947 60977 32034 28929 28914 18657 17196 29312 42192 20362 2037 3875 1820
8431A820j140L152K0474j9840l492r9K2606O919P184j5093l612K3953J2505j3081
$$ 1820 680 3832 24306 4466 974 875 23481 30400 37584 22491 18879 42832 55337 42256
8417D2256o265J0934j2563j6621n919j7648p373P506J1531J5544J907k2204P467
$$ 42256 35991 46925 34362 17741 11822 -5826 -13199 -5693 5838 21382 23289 1085 8552
8404H552J0151J3756K591P772j3617P233J6823j3358j7655q641r665j1870J502
$$ 8552 18703 32459 35050 42822 29205 36438 53261 39903 22248 13607 3942 -7928 -6426
8391f426J6182k2146k014K4172J8156j0416k7372m001M674K833K110N996j4250
$$ -6426 9756 -12390 -14404 9768 27924 17508 -9864 -13865 -9191 -6358 -4248 1748 -12502
8378a2502j0893J3764J6251L908J1572R382j735j6586k1513j0703M478P847J0460
$$ -12502 -23395 -9631 6620 10528 22100 31482 29747 13161 -8352 -19055 -14577 -6730 3730
8365C730q580j2195Q823K0513K0978j7012j2757R30N178J2174j6508q165K0210
$$ 3730 -4850 -17045 -8222 12291 33269 16257 3500 4430 9608 21782 5274 -2891 17319
8352A7319L3917m0578l610j4832l752J2603M022R507J362M077J0467l743J660
$$ 17319 51236 10658 7048 -7784 -11536 1067 5089 14596 15958 20035 30502 26759 28419
8339B8419k2406o034J3691J4155o038j3809j1102p905M647K4270m253j0628J0794
$$ 28419 6013 -21 13670 27825 21787 7978 -3124 -11029 -6382 17888 13635 3007 13801
8326A3801L447k9976q18J337k849K196O385n9K5798m516j667l481q419J1798J097
$$ 13801 17248 -12728 -13546 -12209 -15058 -12862 -6477 -6536 19262 14746 13079 9598 1179 12977 14074
8311A4074k3719Q592L6187k8866j8048k727R682K162r531j54j20N581O158J5109
$$ 14074 -9645 -1053 35134 6268 -11780 -14507 -4825 -2663 -12194 -12348 -12468 -6887 -729 14380
8297A4380n361J0625j1223k2631j7155q861L0775K3960j5072m966n901K436J935
$$ 14380 9019 19644 8421 -14210 -31365 -40226 -9451 14509 -563 -5529 -11430 -8994 -7059
8284g059J3344r26l2376J1243l0508N059K2432Q279J2143k6609R302J2739K5751
$$ -7059 6285 5359 -27017 -15774 -46282 -41223 -18791 -10512 1631 -24978 -15676 -2937 22814
8271B2814R237m3591n542J1276p243O740j0279j3377q156K1236L9177J6885m2054
$$ 22814 32051 -11540 -17082 -5806 -13049 -6309 -16588 -29965 -38121 -16885 22292 39177 -2877
8258b877l6326K308K7340m581m299N125M439k2959k9757K1143K0002R767N930
$$ -2877 -39203 -36895 -9555 -14136 -18435 -13310 -8871 -31830 -61587 -40444 -20442 -10675 -4745
8245d745O846J4105n915j0295J5503k5203L948Q424n497j1443k1200J4783L5191
$$ -4745 2101 16206 10291 -4 15499 -9704 -5756 2668 -2829 -14272 -35472 -20689 14502
8232A4502o945k5266J8312K020k1165R690l131m155l849r899L755J5255J0656
$$ 14502 7557 -17709 603 2623 -18542 -8852 -11983 -16138 -19987 -29886 -26131 -10876 -220
8219b20p96k0245m907J4015K534R215J364K730K339k6393k5420m887K910J0109
$$ -220 -1016 -21261 -26168 -12153 -9619 -404 960 3690 6029 -20364 -45784 -50671 -47761 -37652
8205c7652K224m079K5199M342K472p950p048p670k14j4644M974L6360P313J6498
$$ -37652 -35428 -39507 -14308 -9966 -7494 -15444 -22492 -30162 -30376 -45020 -40046 -3686 3627 20125
8191B0125k529k8057J7180J7j4569J3156J5947K585O888j8352J6556o669J7055
$$ 20125 17596 -10461 6719 6736 -7833 5323 21270 23855 30743 12391 28947 22278 39333
8178C9333N486Q219M849o425k4917l1361j271l307o738k1646n419L1955J1189
$$ 39333 44819 53038 57887 51462 26545 -4816 -6087 -9394 -16132 -37778 -43197 -11242 -53
8165e3J0908j0433q94j4900k12k795k7754k1513K0794K4006J4598R207r276J6884
$$ -53 10855 422 -472 -15372 -15584 -18379 -46133 -67646 -46852 -22846 -8248 959 -8317 8567
8151H567R837J1762m635J0486j5342m47M709M857l2476j9590l075J3378J0846
$$ 8567 18404 30166 25531 36017 20675 20228 24937 29794 -2682 -22272 -25347 -11969 -1123
8138a123K8520L7423o193j0279l4693j8324K9123j4010J2656J8332o743M093L0569
$$ -1123 27397 64820 58627 48348 13655 -4669 24454 10444 23100 41432 34689 38782 69351
8125F9351Q446n0199m8176J7826r322K443J5905J1519l749j7187P443l719R485
$$ 69351 77797 27598 -20578 -2752 -12074 -9631 6274 17793 14044 -3143 4300 581 10066
8112A0066K1636J1534p713q253l3936p570O333P626N517o454j2915J1740N266
$$ 10066 31702 43236 35523 27270 -6666 -14236 -7903 -277 5240 -1214 -14129 -2389 2877
8099B877J1982j3559j3812k675Q945J2665K806J0982L1241j5444r896j3740n1516
$$ 2877 14859 1300 -12512 -15187 -6242 6423 9229 20211 51452 36008 26112 12372 -39144
8086c9144K8627O799p20m582j8176J248R590J5456J817o341k6857K614j005j1120
$$ -39144 -10517 -3718 -4438 -9020 -27196 -25948 -16358 -902 915 -5426 -32283 -29669 -30674 -41794
8072d1794j8342J5446R627Q025J7871P374j2409k8902m109L0405K9543j4294j1148
$$ -41794 -60136 -44690 -35063 -27038 -9167 -1793 -14202 -43104 -47213 -16808 12735 -1559 -12707
8059a2707k848J5470p701l8551m794L2168K4345r270J2466K4998j0769k9642l4892
$$ -12707 -15555 -85 -7786 -46337 -51131 -18963 5382 -3888 8578 33576 22807 -6835 -41727
8046d1727K5343J2341J976M78m32q29J9102K93k3569k041J0450j7967R408J6251
$$ -41727 -16384 -4043 -2067 -1589 -2021 -2850 16252 16545 -7024 -9065 1385 -16582 -7174 9077
8032I077j2615j2734N768j3257N767P343n634j6970j5024p88L2268Q934J1987
$$ 9077 -3538 -16272 -10504 -23761 -17994 -10651 -16285 -33255 -48279 -49067 -16799 -7865 4122
8019D122J0646n350n183k6919n877P724n08j2597P557k1325k2078J9601K6646
$$ 4122 14768 9418 4235 -22684 -28561 -20837 -21345 -33942 -26385 -47710 -69788 -50187 -23541
8006b3541J761p760p21J816O049o006j2796L2694K2650j2773m674j976k1716p912
$$ -23541 -21780 -29540 -30261 -28445 -22396 -28402 -41198 -8504 14146 1373 -3301 -5277 -26993 -34905
7992c4905p324M422J1229J7164L3024k0965j0849J6446l219l359J1156j4994j3341
$$ -34905 -42229 -37807 -26578 -9414 23610 2645 -8204 8242 5023 1664 12820 -2174 -15515
7979a5515P220O701N656o378R156K0604j2097M370K023k3903j6918J2877K4421
$$ -15515 -8295 -1594 4062 -2316 6840 27444 15347 19717 21740 -2163 -19081 -6204 18217
7966A8217k0437J0722J440P026j1258L172o574J829K062J5360n267j7642l4862
$$ 18217 -2220 8502 9942 16968 5710 8882 2308 4137 6199 21559 16292 -1350 -36212
7953c6212j0932L4117L3682J3386r587M4490J7039q797j5821j9156j3494l1812
$$ -36212 -47144 -13027 20655 34041 24454 68944 85983 77186 61365 42209 28715 -3097
7941c097j4370R260Q265k1074l454J0312L825R539Q042R061j7800n783K0266o369
$$ -3097 -17467 -8207 58 -21016 -24470 -14158 -10333 -794 7248 16309 -1491 -7274 12992 6623
7927F623k92n747L236J0279K0228K0116N682k2380n449k913K482N76M865r017
$$ 6623 6331 584 3820 14099 34327 54443 60125 37745 32296 29383 31865 32441 37306 28289
7913B8289j7213n585k953J3791P702L27N600k2165M74J7744k636j205J3644j706
$$ 28289 11076 5491 2538 16329 24031 24358 29958 7793 8267 26011 23375 22170 35814 34108
7899C4108k819K699k0448l5632k3307K1916p1j0204K1883j2458k975L2499L2319
$$ 34108 31289 33988 13540 -22092 -45399 -23483 -23554 -33758 -11875 -24333 -27308 5191 37510
7886C7510l1053n177o658l784m52M87K5453L406k752j3677k0373J8026k1351j2118
$$ 37510 6457 1280 -5378 -9162 -9614 -9127 16326 19732 16980 3303 -17070 956 -20395 -32513
7872c2513J5016L2298M741j3378q248K682J518J7657k79N040n157k4408j0855
$$ -32513 -17497 14801 19542 6164 -2084 598 2116 19773 19494 24534 19377 -5031 -15886
7859a5886M815J9361J9190k5154l2906k4071j2570M714L5277J4622l650k7028
$$ -15886 -11071 8290 27480 2326 -30580 -54651 -67221 -62507 -27230 -12608 -16258 -43286
7847d3286j1914K7077J0578R84l725j7165M839L512n09j1104L9317j0713l1094
$$ -43286 -55200 -28123 -17545 -16561 -20286 -37451 -32612 -29100 -29609 -40713 -1396 -12109 -43203
7834d3203Q061M0544K4665m142j97J6358K2883k3700l142n916k7757l4612l624
$$ -43203 -35142 5402 30067 25925 25728 42086 64969 41269 38127 32211 4454 -30158 -33782
7821c3782j6289O921o574j0119M4292R571m53k3504L421R636J732l449Q270k3377
$$ -33782 -50071 -43150 -49724 -59843 -15551 -5980 -6433 -29937 -26516 -16880 -15148 -18597 -10327 -33704
7807c3704K1789K9601Q870l974k0470j292M726k4761M055M1994j4735j7009M296
$$ -33704 -11915 17686 26556 22582 2112 820 5546 -19215 -15160 26834 12099 -4910 -614
7794f14M43O6k215k0866J4948R527k5305J0835q376k3312n013J0875L406J7029
$$ -614 -171 -105 -2320 -23186 -8238 1289 -24016 -13181 -21557 -44869 -49882 -39007 -35601 -18572
7780a8572O434j5741j2809N106R504n52j0176N587K4335Q236J9347R067O867P493
$$ -18572 -12138 -27879 -40688 -35582 -26078 -26630 -36806 -31219 -6884 1352 20699 29766 36633 44126
7766D4126j2827l1430j0732J1345J3238k1817N437K1738n820j3235m02L1445m415
$$ 44126 31299 -131 -10863 482 13720 -8097 -2660 19078 13258 23 -379 31066 26651
7753B6651O816o026p281J1866k0672k6351j572J0376j9094L117L744J9999N291
$$ 26651 33467 27441 20160 32026 11354 -14997 -16569 -6193 -25287 -22170 -18426 1573 6864
7740F864p516J909j3768j2503J3231j80m3742P178J6647K279L0045m238k5226
$$ 6864 -652 1257 -12511 -25014 -11783 -11963 -55705 -48527 -31880 -29601 444 -3794 -29020
7727b9020k410J1142J3744L1629K4339k3696j6045n920j3210o90o092Q998J7072
$$ -29020 -31430 -20288 -6544 25085 49424 25728 9683 3763 -9447 -10137 -16229 -7231 9841
7714I841j4629R167K4192Q677j1010o887K151k7319l5634j3034K2809R671j087
$$ 9841 -4788 4379 28571 37248 26238 19351 21502 -5817 -41451 -54485 -31676 -22005 -23092
7701b3092K5478J0494k6882j6246K0006K4782K7162k8002l7203J6615J0357N519
$$ -23092 2386 12880 -14002 -30248 -10242 14540 41702 13700 -23503 -6888 3469 8988
7689H988k590K038J3088k5583l4113L695o992M741J8225J0971M406p196R387P592
$$ 8988 6398 8436 21524 -4059 -38172 -34477 -41469 -36728 -18503 -7532 -3126 -10322 -935 6657
7675F657k2160j3205J2029K7771J3422O120n053J279l454j0275n257q429J4220
$$ 6657 -15503 -28708 -16679 11092 24514 30634 25581 26860 23406 13131 7874 -555 13665
7662A3665J6231o491j1121j1031p484J1951k1472p10p071J3325J8953n701j7380
$$ 13665 29896 23405 12284 1253 -6231 5720 -15752 -16462 -23533 -10208 8745 3044 -14336
7649a4336P25j8134N526r71N589K2059K0006l526j9418l36J4297L040j7594P60
$$ -14336 -13611 -31745 -26219 -27190 -21601 458 20464 16938 -2480 -2816 11481 14521 -3073 -2313
7635b313o534j2214j6636M05J2649J6848N796k0809j8196j5608L3153M0390r934
$$ -2313 -8847 -21061 -37697 -37292 -24643 -7795 -1999 -22808 -41004 -56612 -23459 16931 6997
7622F997N553q636p825M207l7960k1768O0L1678K84k5008P414J0914J1678k728
$$ 6997 12550 3914 -3911 296 -37664 -59432 -59372 -27694 -27410 -52418 -45004 -34090 -22412 -25140
7608b5140R873J3789J335J6580L394m847k4086j209O496K3110l701m650o613l8568
$$ -25140 -15267 -1478 -143 16437 19831 14984 -9102 -10311 -3815 19295 15594 10944 4331 -34237
7594c4237k2753j0814L5191K5081K6272M810J5593K2373j8885l9836j7519M727
$$ -34237 -56990 -67804 -32613 -7532 18740 23550 39143 61516 42631 2795 -14724 -9997
7582i997L0559K9988n003p226r147l9001m3931M464P821j180j585L6247J3658
$$ -9997 20562 50550 45547 38321 29174 -9827 -53758 -49294 -41473 -42653 -44238 -7991 5667
7569E667j3492K5205q432p287p929J0264L6171J478j2590j5621q933J0669p351
$$ 5667 -7825 17380 8948 1661 -6268 3996 40167 41645 29055 13434 4501 15170 7819
7556G819p993K648P73K719j5315o588M496P0K5643p934P13L1348k1706l7149j5712
$$ 7819 -174 2474 3247 5966 -9349 -15937 -11441 -11371 14272 6338 7051 38399 16693 -20456 -36168
7541c6168L376K7004M033n258o71M101O742l0565l7071K9445J8672j1363K444
$$ -36168 -32792 -5788 -1755 -7013 -7684 -3583 3159 -27406 -64477 -35032 -16360 -27723 -25279
7528b5279L78q776o357K5753J4661L786j7799j839l3895L608L2148Q706J3168
$$ -25279 -24901 -33677 -40034 -14281 380 4166 -13633 -15472 -49367 -45759 -13611 -4905 8263
7515H263o088j4838j5059P390j115K1113m890k7896j4383K2023P998k9395l631
$$ 8263 2175 -12663 -27722 -20332 -21447 -334 -5224 -33120 -47503 -25480 -17482 -46877 -50508
7502e0508K3152M4443m15k8872j8882R509n140J5911j6535P908J7109J4576k4063
$$ -50508 -27356 17087 16672 -12200 -31082 -21573 -26713 -10802 -27337 -19429 -2320 12256 -11807
7489a1807j7465M117j2364M460J3409K0905k5680k5518K5546Q433j4584j7506
$$ -11807 -29272 -25155 -37519 -33059 -19650 1255 -24425 -49943 -24397 -15964 -30548 -48054
7477d8054j7381K1513K2670m93q011L911j0843M912K9933K3323j0453j8307j4350
$$ -48054 -65435 -43922 -21252 -21745 -29756 -25845 -36688 -31776 -1843 21480 11027 -7280 -21630
7464b1630n220k4949M079J3310J3662l0832Q537K4841K7812j5729N404P15j391
$$ -21630 -26850 -51799 -47720 -34410 -20748 -51580 -43043 -18202 9610 -6119 -715 0 -1391
7451a391p468L744N337L0238J6570k1599j0068O757K2287l2441k0997N622J8741
$$ -1391 -8859 -5115 222 30460 47030 25431 15363 22120 44407 11966 -9031 -3409 15332
7438A5332k3166j9885K2206K2082o306k0389k3415j7560J5393K6760j908P25L2726
$$ 15332 -7834 -27719 -5513 16569 10263 -10126 -33541 -51101 -35708 -8948 -10856 -10131 22595
7425B2595o392j2040j1806L782J3797p689o733J1676q120J7580j0125k3794K3718
$$ 22595 16203 4163 -7643 -3861 9936 2247 -4486 7190 -930 16650 6525 -17269 6449
7412F449J1447P341l565j7642m948K8855J0111k5982k6664P774J0779j3800j3912
$$ 6449 17896 25237 21672 4030 -918 27937 38048 12066 -14598 -6824 3955 -9845 -23757
7399b3757J3603J6040J5049k7907K079j2883j4800k058J4767p995n649K81L2674
$$ -23757 -10154 5886 20935 -6972 -4893 -17776 -32576 -34634 -19867 -27862 -33511 -33230 -556
7386e56O288k0302J6085m383j6049N173M988j5544K2686J8657j3969o977J2986
$$ -556 5732 -14570 1515 -2868 -18917 -13744 -8756 -24300 -1614 17043 3074 -3903 9083
7373I083j8421m615K121j1373o774j61M7469J4647j3091k8928K5659N825R27k3887
$$ 9083 -9338 -13953 -11832 -23205 -29979 -30140 17329 31976 18885 -10043 15616 21441 22368 -1519
7359a519j9027Q249K1631r224j7596k5641R250L2577o572r554j8497J6995J8357
$$ -1519 -20546 -12297 9334 110 -17486 -43127 -33877 -1300 -7872 -17426 -35923 -18928 -571
7346e71p39j7066j6915K511O919J3739k073j2510J454k067K013j1538j3224Q877
$$ -571 -1310 -18376 -35291 -32780 -25861 -12122 -14195 -26705 -25251 -27318 -25305 -36843 -50067 -41190
7332d1190L6872N440j3536N9j9440k1390Q295q690K0960K3809L3077K094j1108
$$ -41190 -4318 1122 -12414 -12355 -31795 -53185 -44890 -53580 -32620 -8811 24266 26360 15252
7319A5252l2347j5173j7911r438K1375O1079j039j0179j2060K3388k2700k2912
$$ 15252 -17095 -32268 -50179 -59617 -38242 22837 21798 11619 -441 22947 247 -22665
7307b2665q494j658m5K5000K4573J3001j919j6626r636Q1J1641l0870n010J339
$$ -22665 -31159 -32817 -32862 -7862 16711 29712 27793 11167 1531 1612 13253 -17617 -22627 -21288
7293b1288J1843J2419r893m550M598l0590N219K5161k370r760K69O920j7219k1355
$$ -21288 -9445 2974 -6919 -11469 -6871 -37461 -32242 -7081 -9451 -19211 -18942 -12022 -29241 -50596
7279e0596Q642J4686J8937O460J7137j9046j3581m811k18j0668m3971N857M7027
$$ -50596 -41954 -27268 -8331 -1871 15266 -3780 -17361 -22172 -22390 -33058 -77029 -71172 -24145
7266b4145M3099K2816l910n1104k0031l899M191k820J643k824K9382L3230M288
$$ -24145 18954 41770 37860 -13244 -33275 -37174 -32983 -35803 -34160 -36984 -7602 25628 29916
7253B9916k0092j3938k0096k0428r059K7636R051k2751M888k963J0077L344j0583
$$ 29916 9824 -4114 -24210 -44638 -53697 -26061 -17010 -39761 -34873 -37836 -27759 -24415 -34998
7240c4998N440p116Q347K5136k457l6112j2232J5399q107K29j0575J3335K4152
$$ -34998 -29558 -36674 -28327 -3191 -5648 -41760 -53992 -38593 -46700 -46471 -57046 -43711 -19559
7227a9559L542j7126k504l586M855M448J5500l730K6874K090j8056j8074m691
$$ -19559 -16017 -33143 -35647 -39233 -34378 -29930 -14430 -18160 8714 10804 -7252 -25326 -30017
7214c0017L751J2557J1451L59r868M535j6492M7604K079k6876k2536n077O892
$$ -30017 -26266 -13709 -2258 -1899 -11767 -7232 -23724 23880 25959 -917 -23453 -28530 -21638
7201b1638j1794q879K6264L7379L3780j8811l8659l6303k1779M1454M9924q170
$$ -21638 -33432 -42311 -16047 21332 55112 36301 -2358 -38661 -60440 -18986 30938 22768
7189B2768j3856p078n1261k9911M534K6126O0496Q618N99k4313P321j4375l8784
$$ 22768 8912 1834 -49427 -79338 -74804 -48678 11818 20436 21035 -3278 4043 -10332 -49116
7176d9116p28J0117J8211L9940M343j4663l7007l1605K1462J8550K6371K481k3120
$$ -49116 -49844 -39727 -21516 18424 22767 8104 -28903 -60508 -39046 -20496 5875 8356 -14764
7163a4764l2325k452N422J5148j1161M62Q343l715J4625L8156K39m9238P566K3753
$$ -14764 -47089 -49541 -44119 -28971 -40132 -39670 -31327 -35042 -20417 17739 17978 -31260 -23694 59
7149E9L9322p711o356j4135J7265j8280J045Q082J1800j4893j9880P31k095P687
$$ 59 39381 31670 25314 11179 28444 10164 11209 19291 31091 16198 -3682 -2951 -5046 2641
7135B641j1210k2578j3780j0940K084P965r242q733J6150J5980j457N785R014
$$ 2641 -8569 -31147 -44927 -55867 -53783 -45818 -55060 -63793 -47643 -31663 -33120 -27335 -18321
7122a8321L624j4190n861K28j7847j544K343N074J4612L2717J1429R728J9537
$$ -18321 -14697 -28887 -34748 -34520 -52367 -53911 -51568 -46494 -31882 835 12264 21992 41529
7109D1529l0102j7357j0160N805K2300p084j0963j7014j5942L431j8517L575J6045
$$ 41529 11427 -5930 -16090 -10285 12015 4931 -6032 -23046 -38988 -35557 -54074 -50499 -34454
7096c4454J4014k4220L803j718P403j1773J3341J0064L4072J1465k1472k125M195
$$ -34454 -20440 -44660 -40857 -42575 -35172 -46945 -33604 -23540 10532 21997 525 -1600 2595
7083B595j97k776O926K716k1711k7494K9430K7879N914j4896k0944K400L192l1999
$$ 2595 2398 -378 6548 9264 -12447 -39941 -10511 17368 23282 8386 -12558 -10158 -6966 -38965
7069c8965N179J2011K5035K0520j5389J4766k4977l7984n913Q527K025J5279J6754
$$ -38965 -33786 -21775 3260 23780 8391 23157 -1820 -39804 -45717 -37190 -35165 -19886 -3132
7056c132J1071p464P93P817m113j7306J0924j832j9310J339r518J1122j1261n262
$$ -3132 7939 475 1268 9085 4972 -12334 -1410 -3242 -22552 -21213 -30731 -19609 -30870 -36132
7042c6132j1189o718L1993L6720J0443R130j9194m5070j5984O490K6891J9301
$$ -36132 -47321 -54039 -22046 14674 25117 34247 15053 -30017 -46001 -39511 -12620 6681
7030F681L273M509j0773j7767j1923j212J1582R624J4669K1503k1814j4444j408
$$ 6681 9954 14463 3690 -14077 -26000 -27212 -15630 -6006 8663 30166 8352 -6092 -7500
7017g500O950J428L44O079J5895k6919l3152P342J4084J0242k0107K692r910j8877
$$ -7500 -550 878 1222 7301 23196 -3723 -36875 -29533 -15449 -5207 -25314 -22622 -32532 -51409
7003e1409L2155K8160o813o056n529j4260o54K1582R315n746K114L544l8484L1417
$$ -51409 -19254 8906 2093 -3963 -9492 -23752 -24406 -2824 6491 745 2859 6403 -32081 -664
6989f64J4369r252M198M665R729N895j0960J0097p38k4633M837q451M036P675
$$ -664 13705 4453 8651 13316 23045 28940 17980 28077 27339 2706 7543 -908 3128 10803
6975A0803p97l811J3797n171j0488R605j6394N358j1204n230L632J465J8956k7993
$$ 10803 10006 6195 19992 14821 4333 13938 -2456 2902 -8302 -13532 -9900 -8435 10521 -17472
6961a7472j634J6066n49m299K4005j0634l1727k2236n168j0231L7228M3010q00
$$ -17472 -19106 -3040 -3589 -7888 16117 5483 -26244 -48480 -53648 -63879 -26651 16359 15559
6948A5559p496k8107j7812J005P12K6638L3304J3917O68Q328l227l3978k3319
$$ 15559 8063 -20044 -37856 -36851 -36139 -9501 23803 37720 38388 46716 43489 9511 -13808
6935a3808k5326j7067k8372N629M7998J1263r150j901L0156J0226o59L905l2837
$$ -13808 -39134 -56201 -84573 -78944 -30946 -19683 -28833 -30734 -578 9648 8989 12894 -19943
6922a9943m644J1669O059l4746o075K7206L5913K5837M147j9933l0394k5710l8057
$$ -19943 -24587 -12918 -6859 -41605 -47680 -20474 15439 41276 45423 25490 -4904 -30614 -68671
6909f8671k0679n642K8422m374J1007L7226L5783m16l1125k7335J894K3947L2634
$$ -68671 -89350 -94992 -66570 -70944 -59937 -22711 13072 12656 -18469 -45804 -43910 -19963 12671
6896A2671k771m749P83p910K966m549M267l3465j1474P894r796L7585L0727n496
$$ 12671 9900 5151 5934 -1976 990 -3559 708 -32757 -44231 -36337 -46133 -8548 22179 16683
6882A6683l3808k824j2627K144P571L449J3351P956K68K4883L09k1714p315p463
$$ 16683 -17125 -19949 -32576 -30432 -22861 -19412 -6061 1895 2163 27046 27355 5641 -1674 -9137
6868i137p601j9012j4047o511n322r637J5379R886m631R857L014m130N417L699
$$ -9137 -16738 -35750 -49797 -56308 -61630 -71267 -55888 -46002 -50633 -40776 -37762 -41892 -36475 -32776
6854c2776O690J8610k1556m876k51K0423J5632r650K7935n160k8496J4840J4339
$$ -32776 -26086 -7476 -29032 -33908 -34159 -13736 1896 -7754 20181 15021 -13475 1365 15704
6841A5704M565p554k5650R815k7R093m153j8914n690j4746J0940M727k2107k5204
$$ 15704 20269 12715 -12935 -3120 -3147 5946 1793 -17121 -22811 -37557 -26617 -21890 -43997 -69201
6827f9201q37J2924L040J2686N2385K4603m161k306k2409k2269R890J6598j0046
$$ -69201 -70038 -57114 -54074 -41388 10997 35600 31439 29133 6724 -15545 -5655 10943 897
6814H97J2110Q769p264k6499j8700O386O554K5586q654j3982k9320j9421k2330
$$ 897 13007 21776 14512 -11987 -30687 -24301 -17747 7839 -815 -14797 -44117 -63538 -85868
$$ [...]
##END NTUPLES=NMR SPECTRUM
##END=
