##TITLE=Analysis number 312104
Compound Code mo 07059
Book Reference 445/24/2
Project Code adrs
Chemist Name laurenf
##JCAMPDX= 6.0         $$ Bruker NMR JCAMP-DX V2.0
##DATA TYPE= NMR SPECTRUM
##DATA CLASS= NTUPLES
##ORIGIN= Bruker BioSpin GmbH
##OWNER= NMR
$$ XWIN-NMR		Version 3.5
$$ Tue Jul 26 10:00:56 2005 GMT Daylight Time (UT+1h)  MAYBRIDGE\NMR@NMR_250MHZ
##.OBSERVE FREQUENCY= 250.131544655141
##.OBSERVE NUCLEUS= ^1H
##.ACQUISITION MODE= SIMULTANEOUS (DQD)
##.ACQUISITION SCHEME= undefined
##.AVERAGES= 16
##.DIGITISER RES= 18
##SPECTROMETER/DATA SYSTEM= dpx250
##.PULSE SEQUENCE= zg30
##.SOLVENT NAME= CDCl3
##.SHIFT REFERENCE= (INTERNAL, CDCl3, 0, 16.522)
##AUDIT TRAIL= $$ (NUMBER, WHEN, WHO, WHERE, WHAT)
$$ ##TITLE= Audit trail, XWIN-NMR		Version 3.5
$$ ##JCAMPDX= 5.01
$$ ##ORIGIN= Bruker BioSpin GmbH
$$ ##OWNER= NMR
$$ C:\u/data/dgb/nmr/ADRS/6560/pdata/1/auditp.txt
$$ ##AUDIT TRAIL=  $$ (NUMBER, WHEN, WHO, WHERE, WHAT)
(   1,<2005-07-26 10:00:35.02 +100>,<MAYBRIDGE\NMR>,<NMR_250MHZ>,
      <created by zg, POWCHK disabled, PULCHK disabled
       configuration hash MD5:
       62 19 C7 07 E1 42 D1 B7 37 6C 3D D0 77 39 F9 E6
       data hash MD5: 64K
       8A 6C 50 D1 A7 B5 26 31 AD 23 5B E3 32 1F B5 C8>)
(   2,<2005-07-26 10:00:46.89 +100>,<MAYBRIDGE\NMR>,<NMR_250MHZ>,
      <Start of raw data processing
       ef LB = 0.3 FT_mod = 6 PKNL = 1 SI = 32K 
       data hash MD5: 32K
       4B EF 05 35 09 0A 6C F7 CE DE B4 5E 91 AA 2A BE>)
(   3,<2005-07-26 10:00:48.80 +100>,<MAYBRIDGE\NMR>,<NMR_250MHZ>,
      <apk 
       data hash MD5: 32K
       9C 28 8D C1 C7 AB F7 39 D9 91 3A 25 E3 E1 9D 2D>)
(   4,<2005-07-26 10:00:49.57 +100>,<MAYBRIDGE\NMR>,<NMR_250MHZ>,
      <abs ABSG = 5 
       data hash MD5: 32K
       30 AB 96 A1 92 B7 A5 95 04 8D BF F8 06 6D 76 D3>)
$$ ##END=
$$ 
$$ hash MD5
$$ 13 6B B3 80 81 E0 F5 24 22 EA 7D F1 F6 26 DA A7
##$RELAX= 
##$RELAX= 
##$RELAX= 
##$RELAX= 
##$RELAX= 
##$RELAX= 
##$RELAX= 
$$ Bruker specific parameters
$$ --------------------------
##$DU= <C:\u>
##$EXPNO= 6560
##$NAME= <ADRS>
##$PROCNO= 1
##$TYPE= <nmr>
##$USER= <dgb>
##$AMP= (0..31)
100 100 100 100 100 100 100 100 100 100 100 100 100 100 100 100 100 100 
100 100 100 100 100 100 100 100 100 100 100 100 100 100 
##$AQSEQ= 0
##$AQ_mod= 3
##$AUNM= <au_zg>
##$AUTOPOS= <11 >
##$BF1= 250.13
##$BF2= 250.13
##$BF3= 250.13
##$BF4= 250.13
##$BF5= 500.13
##$BF6= 500.13
##$BF7= 500.13
##$BF8= 500.13
##$BYTORDA= 1
##$CFDGTYP= 0
##$CFRGTYP= 5
##$CHEMSTR= <none>
##$CNST= (0..31)
1 1 145 1 1 1 1 1 1 1 1 1 1 1 1 1 1 1 1 1 1 1 1 1 1 1 1 1 1 1 1 1 
##$CPDPRG= <>
##$CPDPRG1= <>
##$CPDPRG2= <>
##$CPDPRG3= <>
##$CPDPRG4= <mlev>
##$CPDPRG5= <mlev>
##$CPDPRG6= <mlev>
##$CPDPRG7= <mlev>
##$CPDPRG8= <mlev>
##$CPDPRGB= <>
##$CPDPRGT= <>
##$D= (0..31)
0 1 0 0 0 0 0 0 0 0.06 0 0 0 0 0 0 0.0002 0 0 0 0 0 0 0 0 0 0 0 0 0 0 
0 
##$DATE= 1122368434
##$DBL= (0..7)
120 120 120 120 120 120 120 120 
##$DBP= (0..7)
150 150 150 150 150 150 150 150 
##$DBP07= 0
##$DBPNAM0= <>
##$DBPNAM1= <>
$$ [...]
##$SUBNAM7= <"">
##$SUBNAM8= <"">
##$SUBNAM9= <"">
##$SW= 20.6930455092707
##$SWIBOX= (0..15)
0 0 3 0 0 0 0 0 0 0 0 0 0 0 0 0 
##$SW_h= 5175.983436853
##$TD= 65536
##$TD0= 1
##$TE= 296.16
##$TE2= 300
##$TE3= 300
##$TEG= 300
##$TL= (0..7)
0 120 120 120 120 120 120 120 
##$TP= (0..7)
150 150 150 150 150 150 150 150 
##$TP07= 0
##$TPNAME0= <>
##$TPNAME1= <>
##$TPNAME2= <>
##$TPNAME3= <>
##$TPNAME4= <>
##$TPNAME5= <>
##$TPNAME6= <>
##$TPNAME7= <>
##$TPOAL= (0..7)
0.5 0.5 0.5 0.5 0.5 0.5 0.5 0.5 
##$TPOFFS= (0..7)
0 0 0 0 0 0 0 0 
##$TUNHIN= 0
##$TUNHOUT= 0
##$TUNXOUT= 0
##$USERA1= <user>
##$USERA2= <user>
##$USERA3= <user>
##$USERA4= <user>
##$USERA5= <user>
##$V9= 5
##$VALIST= <valist>
##$VCLIST= <CCCCCCCCCCCCCCC>
##$VD= 0
##$VDLIST= <DDDDDDDDDDDDDDD>
##$VPLIST= <PPPPPPPPPPPPPPP>
##$VTLIST= <TTTTTTTTTTTTTTT>
##$WBST= 1024
##$WBSW= 4
##$XGAIN= (0..3)
0 0 0 0 
##$XL= 0
##$YL= 0
##$YMAX_a= 606446
##$YMIN_a= -579552
##$ZGOPTNS= <>
##$ZL1= 120
##$ZL2= 120
##$ZL3= 120
##$ZL4= 120
##$ABSF1= 16.522
##$ABSF2= -4.171173
##$ABSG= 5
##$ABSL= 3
##$ALPHA= 0
##$AQORDER= 0
##$ASSFAC= 0
##$ASSFACI= 0
##$ASSFACX= 0
##$ASSWID= 0
##$AUNMP= <proc_1d>
##$AZFE= 0.1
##$AZFW= 0.1
##$BCFW= 0
##$BC_mod= 0
##$BYTORDP= 0
##$COROFFS= 0
##$CY= 12.5
##$DATMOD= 1
##$DC= 0
##$DFILT= <>
##$DTYPP= 0
##$F1P= 14.0000005364418
##$F2P= -0.99999901652339
##$FCOR= 0.5
##$FTSIZE= 32768
##$FT_mod= 6
##$GAMMA= 0
##$GB= 0
##$INTBC= 1
##$INTSCL= 1
##$ISEN= 128
##$LB= 0.3
##$LEV0= 0
##$LPBIN= 0
##$MAXI= 10000
##$MC2= 0
##$MEAN= 0
##$ME_mod= 0
##$MI= 0
##$NCOEF= 0
##$NC_proc= -4
##$NLEV= 6
##$NOISF1= 0
##$NOISF2= 0
##$NSP= 0
##$NTH_PI= 0
##$NZP= 0
##$OFFSET= 16.522
##$PC= 1
##$PHC0= -80.48785
##$PHC1= 5.583157
##$PH_mod= 1
##$PKNL= yes
##$PPARMOD= 0
##$PSCAL= 4
##$PSIGN= 0
##$REVERSE= no
##$SF= 250.13
##$SI= 32768
##$SIGF1= 0
##$SIGF2= 0
##$SINO= 400
##$SIOLD= 32768
##$SREGLST= <1H.CDCl3>
##$SSB= 0
##$STSI= 32768
##$STSR= 0
##$SW_p= 5175.98343685301
##$SYMM= 0
##$S_DEV= 0
##$TDeff= 65536
##$TDoff= 0
##$TI= <Analysis number 999999
Compound Code 99
Book Reference 9
Project Code 9>
##$TILT= no
##$TM1= 0
##$TM2= 0
##$TOPLEV= 0
##$USERP1= <user>
##$USERP2= <user>
##$USERP3= <user>
##$USERP4= <user>
##$USERP5= <user>
##$WDW= 1
##$XDIM= 32768
##$YMAX_p= 417261802
##$YMIN_p= -153601
$$ End of Bruker specific parameters
$$ ---------------------------------
##NTUPLES= NMR SPECTRUM
##VAR_NAME=  FREQUENCY,     SPECTRUM/REAL,   SPECTRUM/IMAG
##SYMBOL=    X,             R,               I
##VAR_TYPE=  INDEPENDENT,   DEPENDENT,       DEPENDENT
##VAR_FORM=  AFFN,          ASDF,            ASDF
##VAR_DIM=   32768,         32768,           32768
##UNITS=     HZ,            ARBITRARY UNITS, ARBITRARY UNITS
##FACTOR=    0.157963299565203, 1,           1
##FIRST=     4132.6476996994, 0,             0
##LAST=      -1043.33573715361, 0,           0
##MIN=       -1043.33573715361, -153601,     0
##MAX=       4132.6476996994, 417261802,     0
$$ Real data points
##PAGE= N=1
##DATA TABLE= (X++(R..R)), XYDATA
$$ [...]
18028E74025K63918L07008J46125k2647j24461j74269j56851j24962r0777l8415
$$ 574025 837943 1144951 1291076 1268429 1143968 969699 812848 687886 597109 558694
18018E58694J0880Q2385J83021L01168L51017K81423J31445J747j33879k67152
$$ 558694 569574 651959 834980 1136148 1487165 1768588 1900033 1901780 1767901 1500749
18008A500749l06808k44364j76048j25255p3492n323P6488J00099K05587K77999
$$ 1500749 1193941 949577 773529 648274 574782 569459 645947 746046 951633 1229632
17998A229632J41618j00167j93384k24377k28323j70659j07014j13677p9421l8593
$$ 1229632 1371250 1271083 1077699 853322 624999 454340 347326 233649 154228 115635
17988A15635q263J0805K065q599j4294j5995r861J594J645J799j076r116j2131
$$ 115635 107372 118177 120242 111643 97349 81354 71493 73087 74732 76531 75455 66339 54208
17975E4208j5836j6511K5672K4184m851k9277p303j3942j6057r096k430K9547
$$ 54208 38372 21861 47533 71717 66866 37589 30286 16344 287 -8809 -11239 18308
17963A8308N426J3965Q677j1967m01k1233J3668J1993K4645J0385M682K5012j4705
$$ 18308 23734 37699 46376 34409 34008 12775 26443 38436 63081 73466 78148 103160 88455
17950H8455j8233k2714l1254q457J3454L6763k1500k6916k3761k7423J0900J4365
$$ 88455 70222 47508 16254 7797 21251 58014 36514 9598 -14163 -41586 -30686 -16321
17938a6321J3647P211j9814K1478O343J1495K1082k4152q553o907j537J0509P267
$$ -16321 -2674 4537 -15277 6201 12544 24039 45121 20969 12416 5509 3972 14481 21748
17925B1748j9407m0318k70M1344l685l9470K917L4985m647o668J5507K8417K3849
$$ 21748 2341 -37977 -38247 3097 -588 -40058 -37141 -2156 -6803 -13471 2036 30453 54302
17912E4302j6058o636k1099r913L4407k805o600n773j9656J585J4614k671M7k0925
$$ 54302 38244 31608 10509 596 35003 32198 25598 19825 169 1754 16368 13697 13744 -7181
17898g181J9705L3859J2759j4206l9667m726k0714K295O274j5872k4471K1327
$$ -7181 12524 46383 59142 44936 5269 543 -20171 -17876 -11602 -27474 -51945 -30618
17886c0618k029k1563j9028L2719O741K8098M0353q64j906j2515o1712j0570L7202
$$ -30618 -32647 -54210 -73238 -40519 -33778 -5680 34673 33809 31903 19388 -42324 -52894 -15692
17873a5692N2804M102K874j8418k6387J1492J7195k1474J3400N011j4233J1835
$$ -15692 37112 41214 44088 25670 -717 10775 27970 6496 19896 24907 10674 22509
17861B2509K7772j7563k3171j1193k6688M479j2493J417J1455K1038K8631J6714
$$ 22509 50281 32718 9547 -1646 -28334 -23855 -36348 -34931 -23476 -2438 26193 42907
17849D2907K112m772k1996J406j6852j8474J5084J2544K34K920j902j4402k059
$$ 42907 45019 40247 18251 19657 2805 -15669 -585 11959 12193 15113 13211 -1191 -3250
17836c250k102j1124m812O006J048M940K696K4709J0843M330l0479j8562J7522
$$ -3250 -5352 -16476 -21288 -15282 -14234 -9294 -6598 18111 28954 33284 2805 -15757 1765
17823A765K2774N687M294k9768n1396K0858J9820k0417k3537L699K1912N054J6718
$$ 1765 24539 30226 34520 4752 -46644 -25786 -5966 -26383 -49920 -46221 -24309 -19255 -2537
17810b537j7738k884l879j079J513K0232M786J0058p618K2525O47J2235l2881
$$ -2537 -20275 -23159 -27038 -28117 -26604 -6372 -1586 8472 854 23379 24026 36261 3380
17797C380k7867j7356M202J4816K7135j0528q045K7334k5342m051O755K4281k790
$$ 3380 -24487 -41843 -37641 -22825 4310 -6218 -14263 13071 -12271 -16322 -9567 14714 11924
17784A1924l1443J6169j275K3493J8133j9474k4488r276J6079K7793l218N605
$$ 11924 -19519 -3350 -4625 18868 37001 17527 -6961 -16237 -158 27635 24417 30022
17772C0022K8442j569j6458J2813O347J2402K7970K2580P3007R8330J01212O9025
$$ 30022 58464 56895 40437 53250 59597 71999 99969 122549 195556 293886 395098 464123
17760D64123M0176n131k8230p7283r0863p6041n5364m2064l4436j2263q433k0192
$$ 464123 504299 499168 470938 393655 302792 226751 171387 129323 94887 82624 74191 53999
17748E3999P090O241j2063j5850R559Q692J7971P095j203k0259J663L0694M7365
$$ 53999 61089 67330 55267 39417 48976 57668 75639 82734 81531 61272 62935 93629 140994
17735A40994Q6851Q3826P6334P0580M9800k315j2271o3494r8145p0247m0682o3670
$$ 140994 227845 311671 388005 458585 508385 506070 493799 430305 332160 261913 221231 157561
17723A57561m3973r368L513k0757N666K009M7208O7627O0870O5508N3144P8547
$$ 157561 113588 104220 107733 86976 92642 94651 141859 209486 270356 335864 389008 467555
17711D67555J6575m3855n3186p7362q1413n2529m0789k899l0328l2532j1652J3225
$$ 467555 484130 440275 387089 309727 228314 175785 134996 132097 101769 69237 57585 70810
17699G0810J3952m520j5929l845o093K1435j0340N863L5233M1053J3873J4742
$$ 70810 84762 80242 64313 60468 54375 75810 65470 71333 106566 147619 161492 176234
17687A76234N7953P9786N9251O8924M2668K0339O357J8138M6279k2298n2724m7486
$$ 176234 234187 313973 373224 442148 484816 505155 511512 529650 575929 553631 500907 453421
17675D53421n1300r784N611l3677o2029n7623o1335m3419l0966l6066j4229j7073
$$ 453421 402121 392337 397948 364271 302242 244619 183284 139865 108899 72833 58604 41531
17663D1531K714n731O825j6950J3538L2594J8159j1598j8108j8347K2477M145
$$ 41531 44245 38514 45339 28389 41927 74521 92680 81082 62974 44627 67104 71249
17651G1249K0744M3452L9840Q2586P3537L7794L3815J4578K8950M8343n220p7436
$$ 71249 91993 135445 175285 257871 331408 369202 403017 417595 446545 494888 489668 412232
17639D12232r4544n3751l3882m7059l0547J2593N4902P1790N4244j363k4623K882
$$ 412232 317688 263937 230055 182996 152449 165042 219944 291734 345978 344615 319992 322874
17627C22874J1088J5599L375o3361p0582l9907l9402m7618l9480l0148J499K8198
$$ 322874 333962 349561 352936 289575 218993 179086 139684 92066 52586 22438 23937 52135
17615E2135K6899L5766K2796R786k2407l0429m7023k7510J6178N182K3675K9502
$$ 52135 79034 114800 137596 147382 124975 94546 47523 20013 36191 41373 65048 94550
17603I4550M2945L2683M2667O2518N9844J0704m624L1846M4091j7561l7462p2533
$$ 94550 137495 170178 212845 275363 335207 345911 341287 373133 417224 399663 362201 289668
17591B89668q9413m0264l2721p0085j2613J247J8994j2864j2774q057j3209k7436
$$ 289668 200255 159991 127270 57185 44572 45819 64813 51949 39175 31118 17909 -9527
17579i527J7462K1505J1525j1840l9591j6984J7975N768k4149q214K918K800L1367
$$ -9527 7935 29440 40965 29125 -10466 -27450 -9475 -3707 -27856 -36070 -33152 -30352 1015
17566A015L0711O566L379J7584J5365j2115j8309j0716j2772q342M643p597K1248
$$ 1015 31726 38292 41671 59255 74620 62505 44196 33480 20708 12366 17009 9412 30660
17553C0660p815l12k981J2020k1633j9390j729J0587o814N600O867j3842J0295
$$ 30660 22845 22533 19552 31572 9939 -9451 -11180 -593 -7407 -1807 5060 -8782 1513
17540A513j700k489M64N307J7953J4952k3801l3763j7854K6715K5358K5547L840
$$ 1513 -187 -2676 -2212 3095 21048 36000 12199 -21564 -39418 -12703 12655 38202 42042
17527D2042k4861k0052j8339l449K2017q254N822k2698j2598J8923O96J6273K4508
$$ 42042 17181 -2871 -21210 -24659 -2642 -10896 -5074 -27772 -40370 -21447 -20751 -4478 20030
17514B0030p502O532J8337k3048j7367j3225J9017Q994L361M6465q151k8590k2678
$$ 20030 12528 19060 37397 14349 -3018 -16243 2774 11768 15129 61594 53443 24853 2175
17501B175j2113O371J5351P699L1884J3455l248m555j2005J541J1371p291q554
$$ 2175 -9938 -3567 11784 19483 51367 64822 61574 57019 45014 46555 57926 50635 42081
17488D2081P53M883J0124J6478k0616l490m421k8092j1384j4271R409J2435P405
$$ 42081 42834 47717 57841 74319 53703 50213 45792 17700 6316 -7955 1454 13889 21294
17475B1294J4810o941k4818j4108R768J311o604J8515J7733Q620n571J3258J4605
$$ 21294 36104 29163 4345 -9763 5 1316 -5288 13227 30960 39580 34009 47267 61872
17462F1872j1997p194J9486J1830j8821M113J4479R792K1441K0706l4314q30p665
$$ 61872 49875 42681 62167 73997 55176 59289 73768 83560 105001 125707 91393 90563 82898
17449H2898l3674j2122K7059J2605q121Q212K5878R6553Q9331L7180j5088j6948
$$ 82898 49224 37102 64161 76766 68645 76857 102735 199288 288619 325799 310711 293763
17437B93763l1132l2470l7009k7474k254j8208J4787P352k9242k6965j9001k24
$$ 293763 262631 230161 193152 165678 163424 145216 160003 167355 138113 111148 92147 91923
17425I1923o485j1639J5535o933l9639J400J9399Q68j7453p983k7732q54K840
$$ 91923 85438 73799 89334 82401 42762 44162 63561 64429 46976 38993 11261 10407 13247
17412A3247L7252J0506M6514K4148J2390L680l917m574j8994k1862J1121o598
$$ 13247 50499 61005 107519 131667 144057 147737 143820 139246 120252 98390 109511 102913
17400A02913n498p297M424m009J3125M393l1587k2246l8293j5104J8053m679M769
$$ 102913 97415 90118 94542 90533 103658 108051 76464 54218 15925 821 18874 14195 18964
17387A8964j947L285O079R737j1138K802J3816Q924j0473M810L7893K7580k8970
$$ 18964 17017 20302 26381 36118 24980 27782 41598 50522 40049 44859 82752 110332 81362
17374H1362k5570J4137M706n004K6173L5376M016l5062j7750J0207J6052J1401
$$ 81362 55792 69929 74635 69631 95804 131180 135196 100134 82384 92591 108643 120044
17362A20044m932o639o548r133j8960q430J5464L6960Q140j5609j4969J5194L710
$$ 120044 115112 108473 101925 92792 73832 65402 80866 117826 125966 110357 95388 110582 114292
17349A14292k5421k3207j1226j609K4928M5869q15J003m989k3119l1795k2807
$$ 114292 88871 65664 54438 52829 77757 123626 122811 123814 118825 95706 63911 41104
17337D1104q792j019R088J5232M7420M7864O912K8169j1789k3216J3151J3239
$$ 41104 32312 31293 40381 55613 103033 150897 157809 185978 174189 150973 164124 177363
17325A77363j091n2892n2741j0543J5624K3640K7330J8546L263O191P485L6330
$$ 177363 176272 123380 70639 60096 75720 99360 126690 145236 148499 154690 162175 198505
17313A98505l411j3094J0778n541l0342k6006j1696k4061N080J6514J5990J5587
$$ 198505 195094 182000 192778 187237 156895 130889 119193 95132 100212 116726 132716 148303
17301A48303K341P141K3361J3565p081j0825J5050J4006p379J769L0036J9150
$$ 148303 150644 157785 181146 194711 187630 176805 191855 205861 198482 200251 230287 249437
17289B49437K9603K1796M148L0574N0011J9472J1871K022m990Q989J9080J4600
$$ 249437 279040 300836 304984 335558 385569 405041 416912 418934 413944 422933 442013 456613
17277D56613j4173R698k2957j5171J4696L9388L2930J5010M1142L4463L3423L4926
$$ 456613 442440 452138 429181 414010 428706 468094 501024 516034 557176 591639 625062 659988
17265F59988N707J1105N1868M3965M9240N6335P8505P3888J25635J77929J86961
$$ 659988 665695 676800 728668 772633 821873 878208 956713 1030601 1156236 1334165 1521126
17254A521126K30092K73557J92340K01823K22305J90429K47175L66085M87813
$$ 1521126 1751218 2024775 2217115 2418938 2641243 2831672 3078847 3444932 3932745
17245C932745O02729P05829R17288J216611J637775K319939L518175N578437Q957566
$$ 3932745 4535474 5241303 6158591 7375202 9012977 11332916 14851091 20429528 29387094
17236B9387094J3398575J7059735J7252604J2850649M854252m377530j1478700
$$ 29387094 42785669 59845404 77098008 89948657 94802909 90425379 78946679
17229G8946679j4622032j4475427j2413289r592300o867291m758128l219503k154560
$$ 78946679 64324647 49849220 37435931 27843631 20976340 16218212 12998709 10844149
17221A0844149j427591r59824n81884k55750k8881K22007M34323O74763R69961
$$ 10844149 9416558 8456734 7874850 7619100 7590219 7812226 8246549 8921312 9891273
17212I891273J393109K082740L252549N288945Q516241J2818625J6500738J6878074
$$ 9891273 11284382 13367122 16619671 21908616 30424857 43243482 59744220 76622294
17204G6622294J2778247N140386l878990j0964122j4138709j4079830j2067998
$$ 76622294 89400541 94540927 90661937 79697815 65559106 51479276 39411278
17197C9411278r228992o478064m167223k402280r84880K94223J716113L620384
$$ 39411278 30182286 23704222 19536999 17134719 16149839 16444062 18160175 21780559
17189B1780559O547271J0651937J4804175J6507791J3848301P302010j327814
$$ 21780559 28327830 38979767 53783942 70291733 84140034 91442044 90114230
17182I0114230r045111j3366523j4233849j2747501j0244262p625766n337905
$$ 90114230 81069119 67702596 53468747 40721246 30476984 22851218 17513313
17175A7513313l640976k458850j661675j119159p04614m22957j88645N0474K80504
$$ 17513313 13872337 11413487 9751812 8632653 7928039 7505082 7316437 7366911 7647415
17166G647415M81632P46281J081153J590159K510857M053126O695430J0569271
$$ 7647415 8129047 8875328 9956481 11546640 14057497 18110623 24806053 35375324
17158C5375324J4564023J6347853J3893578P549636r20685q677859j3091187j4046915
$$ 35375324 49939347 66287200 80180778 87730414 86809729 78131870 65040683 50993768
17150E0993768j2712332j0264898p652221n422459l740772k553538j774866j239802
$$ 50993768 38281436 28016538 20364317 14941858 11201086 8647548 6872682 5632880
17142E632880q89253o57083n25648m39926l22302k26661j60198j76672j99680
$$ 5632880 4743627 4086544 3560896 3120970 2798668 2572007 2411809 2235137 2035457
17133B035457j93159j60007j54945j43380j23319r4320r2772q3605q1509o4101
$$ 2035457 1842298 1682291 1527346 1383966 1260647 1166327 1073555 989950 908441 844340
17123H44340n2257p6417p1215m2650r714l7990m3456J9742M9p318N658Q042k7579
$$ 844340 792083 715666 644451 601801 592087 554097 510641 530383 530432 523114 528772 536814 509235
17110E09235j8428k9057k7638j7305j0642J8507k1995j3101m536j6818k714l2088
$$ 509235 490807 461750 434112 416807 406165 424672 402677 389576 385040 368222 365508 333420
17098C33420j1043K6682J5148m0021j4443J544l9885q114o337J1347J958M451
$$ 333420 322377 349059 364207 324186 309743 311287 271402 263288 256951 268298 270256 274707
17086B74707N834M675Q199O251K1222L5243K8053M566m694j301j6064o9304o0813
$$ 274707 280541 285216 293415 299666 320888 356131 384184 388750 384056 382755 366691 297387 236574
17073B36574l5641j5909j2096q660J6148P267j327L975l325L717K140L2515j1056
$$ 236574 200933 185024 172928 164268 180416 187683 186356 190331 187006 190723 192863 225378 214322
17060B14322J0873K0319K1391q795m3713k9627N202N089k6888j3395L2179K5419
$$ 214322 225195 245514 266905 258110 214397 184770 189972 195061 168173 154778 186957 212376
17048B12376J4128j0842j8322p638j4725l1909j3586j5806o603J8193j0068K526
$$ 212376 226504 215662 197340 189702 174977 143068 129482 113676 107073 125266 115198 117724
17036A17724J0699K0137k2024j1402L0682J8564Q881L608R459J2245l7387k9487
$$ 117724 128423 148560 126536 115134 145816 164380 173261 176869 186328 198573 161186 131699
17024A31699l292l276J0387k3038k5434k0880j5092P786J2625J772M400J7598
$$ 131699 128407 125131 135518 112480 87046 66166 51074 58860 71485 73257 77657 95255
17012I5255J5532n729j1446j5818m107o460P480j0237m624L1772L2254L0102J8848
$$ 95255 110787 105058 93612 77794 73687 67227 74707 64470 59846 91618 123872 153974 172822
16999A72822n475j7039l1667j5496r572k6692j2861p736K7907j1461p301j1168
$$ 172822 167347 150308 118641 103145 93573 66881 54020 46284 74191 62730 55429 44261
16987D4261L602m302o450j5014o633j8356N578m985o963J4900J1736j413o564
$$ 44261 47863 43561 37111 22097 15464 -2892 2686 -2299 -9262 5638 17374 15961 9397
16974I397j6500j9343N852j2205j346J2547P761R675J1399K2359q54J5109J5898
$$ 9397 -7103 -26446 -20594 -32799 -34145 -21598 -13837 -4162 7237 29596 28742 43851 59749
16961E9749j5810l5342k2133J0344K7751L323o197j921k4513k1273r632N113K7853
$$ 59749 43939 8597 -13536 -3192 24559 27882 21685 19764 -4749 -26022 -35654 -30541 -2688
16948b688K3075l576K0714K3935j3809M607L366O054l4714k878K079J0336L1204
$$ -2688 20387 16811 37525 61460 47651 52258 55624 61678 26964 24086 26165 36501 67705
16935F7705l719j4634k4375J0716K4036j7376j7441l1170j5428J7788J1535P752
$$ 67705 63986 49352 24977 35693 59729 42353 24912 -6258 -21686 -3898 7637 15389
16923A5389k3229K018K2399K810k9020j1480P116K996O102J5549J7563j3027j0662
$$ 15389 -7840 -5822 16577 19387 -9633 -21113 -13997 -11001 -4899 10650 28213 15186 4524
16910D524J135j2705J5674J1624J7914O222l0623r243L850j0984k2257p460K0967
$$ 4524 5659 -7046 8628 20252 38166 44388 13765 4522 8372 -2612 -24869 -32329 -11362
16897a1362K1335o696j3770j0526k729P413l497J9499K40k1507Q588P080Q071
$$ -11362 9973 3277 -10493 -21019 -23748 -16335 -19832 -333 -93 -21600 -13012 -5932 2139
16884B139J2506j2844o639N717l1047l0481J3578N0571J540l4968k3489J4338
$$ 2139 14645 1801 -4838 879 -30168 -60649 -47071 3500 5040 -29928 -53417 -39079
16872c9079L3375J1652q286l3042J697L8263K2208K1172J075k9002k4508k1193
$$ -39079 -5704 5948 -2338 -35380 -33683 4580 26788 47960 49035 20033 -4475 -25668
16860b5668j1700O355J6881Q083j496N226J3069M819p785r623j4420J7869n741
$$ -25668 -37368 -31013 -14132 -6049 -7545 -2319 10750 15569 7784 -1839 -16259 1610 -4131
16847d131j9j6253j1645K941J1681N1888K1262j4257k8090k8474J6136Q018j0668
$$ -4131 -4150 -20403 -32048 -29107 -17426 34462 55724 41467 13377 -15097 1039 9057 -1611
16834a611P807m607P950K2601K4533k867j452q85K458J8266j4782j5826K9683
$$ -1611 6196 1589 9539 32140 56673 53806 52354 51469 53927 72193 57411 41585 71268
16821G1268L939j4598j1601k4736j3465J6281K5864K5388K4178M181J7670L0861
$$ 71268 75207 60609 49008 24272 10807 27088 52952 78340 102518 106699 124369 155230
16809A55230J3121N3401J08270J68023K39559K74090K01133K2820p4294j40477
$$ 155230 168351 221752 330022 498045 737604 1011694 1212827 1235647 1161353 1020876
16799A020876j59083j60389r5290l6729k2526O3033J63604K43850K81612K98095
$$ 1020876 861793 701404 606114 569385 546859 609892 773496 1017346 1298958 1597053
16789A597053K28327M3487j21653k28256k77788k60062k23664j33825r0152j8503
$$ 1597053 1825380 1868867 1747214 1518958 1241170 981108 757444 623619 533467 514964
16779E14964M6202J05604J57914K27117J82457K6707j30973j90908j95955j93130
$$ 514964 561166 666770 824684 1051801 1234258 1260965 1129992 939084 743129 549999
16769E49999j75645j17270m7456l5301j6869j4096j3227r263l3830m6257L364
$$ 549999 374354 257084 209628 174327 157458 143362 130135 120872 87042 40785 44149
16758D4149K4519J4174j5489j7126m4013k6405K162L0598j7290K0357K2249K4807
$$ 44149 68668 82842 67353 50227 6214 -20191 -18029 12569 -4721 15636 37885 62692
16746F2692j0515j3128j4172k4242j1618M192K897R15M969o822k8999j3741j0149
$$ 62692 52177 39049 24877 635 -10983 -6791 -3894 -2979 1990 -4832 -33831 -47572 -57721
16733e7721K4039K3654l464m400j5009n276j3816J0482K8308J3203p899l5891
$$ -57721 -33682 -10028 -13492 -17892 -32901 -38177 -51993 -41511 -13203 0 -7899 -43790
16721d3790J9759K1768M762m855p578R27j895q671N954o294L113K488J1180J2112
$$ -43790 -24031 -2263 2499 -2356 -9934 -9007 -10902 -19573 -13619 -19913 -16800 -14312 -3132 8980
16707H980J5257K2377M5959K1458M1237M6811O8822Q7887N5305K1828j5274l5234
$$ 8980 24237 46614 92573 114031 155268 202079 270901 358788 414093 435921 420647 385413
16695C85413q1381p6598o1446n8560l8654l0583o156J7299k061k4415k1374J7603
$$ 385413 304032 227434 165988 107428 68774 38191 32035 49334 47273 22858 1484 19087
16683A9087K5092k0570O99j3017j0652Q352J1251M3612M8603N3243N1829O5210
$$ 19087 44179 23609 24308 11291 639 8991 20242 63854 112457 165700 217529 282739
16671B82739P6536P6999K7811j4245o9173r9182p3523l4903m3516k9070l2232
$$ 282739 359275 436274 464085 449840 380667 281485 207962 173059 129543 100473 68241
16660F8241j1343J4478K7036K544M264L1543L4929R6604J00797Q2714L6395j133
$$ 68241 56898 71376 98412 100956 105220 136763 171692 268296 369093 451807 488202 487069
16648D87069n9018r7925o5709o0784o0363o3509j2191J7006l64j038k3421l0174
$$ 487069 428051 330126 264417 203633 143270 79761 67570 84576 84212 83174 59753 29579
16636B9579l5358j6491J0440O014n976J860L2780N266K0531L7262J3176P2509
$$ 29579 -5779 -22270 -11830 -5816 -11792 -9932 22848 28114 48645 85907 99083 171592
16624A71592Q7186O2149N7137L0062L904k0650n5487p7912q9664n0065l4048j8593
$$ 171592 258778 320927 378064 408126 412030 391380 335893 257981 168317 118252 84204 65611
16612F5611j7204k099j5799k533q891j3319q557j4999j9719j8677J1742J9819
$$ 65611 48407 46308 30509 27976 19085 5766 -2791 -17790 -37509 -56186 -44444 -24625
16600b4625J0368N728j9435k4862j9070P903K5847J0198l0575K2499o630K3209
$$ -24625 -14257 -8529 -27964 -52826 -71896 -63993 -38146 -27948 -58523 -36024 -42654 -19445
16588a9445M1855q867j0413J8834q687n441M759J5950k4507j3070N852q305J1863
$$ -19445 22410 13543 3130 21964 13277 7836 12595 28545 4038 -9032 -3180 -11485 378
16575C78K836j7909r445m978K4758Q179J0794q105l3827m4867J844K4089r628
$$ 378 3214 -14695 -24140 -29118 -4360 3819 14613 6508 -27319 -72186 -70342 -46253 -55881
16562e5881j0224K7320J4292l212j4356k0279O452L1622K0376k3328K121J6619
$$ -55881 -66105 -38785 -24493 -27705 -42061 -62340 -55888 -24266 -3890 -27218 -25097 -8478
16550h478K2621j2606k5724J735J0232J2887r145k1569p90k336j0127R618L637
$$ -8478 14143 1537 -24187 -22452 -12220 667 -8478 -30047 -30837 -33173 -43300 -33682 -30045
16537c0045M451K2185j1637j6311L617J8734J5643j3601n971r606J0433K3548
$$ -30045 -25594 -3409 -15046 -31357 -27740 -9006 6637 -6964 -12935 -22541 -12108 11440
16525A1440o464q380m9287o56J5236p327j8705N018r65J4164L118K8180J4770
$$ 11440 4976 -3404 -52691 -53347 -38111 -45438 -64143 -59125 -60090 -45926 -42808 -14628 142
16512A42K8042J4210O122j0876j1093o578l7159j7970j1188K873q615K3105J920
$$ 142 28184 42394 48516 37640 26547 19969 -17190 -35160 -46348 -43475 -52090 -28985 -27065
16499b7065O607N746k525K8354O993k4469l747Q337J2526o999q128L55j707o094
$$ -27065 -20458 -14712 -17237 11117 18110 -6359 -10106 -1769 10757 3758 -4370 -4015 -5722 -11816
16485a1816N664j3927j3594k6836l688J0853l631r186J0928K6070K013R469k01
$$ -11816 -6152 -20079 -33673 -60509 -64197 -53344 -56975 -66161 -55233 -29163 -27150 -17681 -17882
16472a7882j3051k062K2867r709k6091j9651j4332p571L4076N2966K5331k6378
$$ -17882 -30933 -32995 -10128 -19837 -45928 -65579 -79911 -87482 -53406 -440 24891 -1487
16460a487l9093Q52K0935L269j4862o499J0304j7224k3320j9103J3074J119J4398
$$ -1487 -40580 -39728 -18793 -15524 -30386 -36885 -26581 -43805 -67125 -86228 -73154 -72035 -57637
16447e7637J5896k7390K0442L294P53K4673J2187k396k6076k5930J6945P757P953
$$ -57637 -41741 -69131 -48689 -45395 -44642 -19969 -7782 -10178 -36254 -62184 -45239 -37482 -29529
16434b9529k404k709R307O345N154O48Q224k947j7583j5350k045K1899P363j5353
$$ -29529 -31933 -34642 -25335 -18990 -13836 -13188 -4964 -7911 -25494 -40844 -42889 -20990 -13627 -28980
16420b8980J5625j8803j7059j0065j7992K570J0466J7417O399J3447j7400m4222
$$ -28980 -13355 -32158 -49217 -59282 -77274 -74704 -64238 -46821 -40422 -26975 -44375 -88597
16408h8597j8923K5297n454j3257l871l637L3106J9044K3983j1041q478J9349
$$ -88597 -107520 -82223 -87677 -100934 -104805 -108442 -75336 -56292 -32309 -43350 -51828 -32479
16396c2479J9251j6330l0065K019J4433m158J2888P165N133R554l0568q501L6196
$$ -32479 -13228 -29558 -59623 -57604 -43171 -47329 -34441 -27276 -22143 -12589 -43157 -51658 -15462
16383a5462K8514m3438j004L0219J813l590k7704J386J0887K7651J0022o961q659
$$ -15462 13052 -30386 -31390 -1171 642 -2948 -30652 -29266 -18379 9272 19294 12333 3674
16370C674J0182L590n8192l2943J4811r53J9732K8033J9332j5086j7591J6584
$$ 3674 13856 17446 -40746 -73689 -58878 -59831 -40099 -12066 7266 -7820 -25411 -8827
16358h827L725r927K58J5457l1323k6440M937o690J49K8875K3828j6444J830J04
$$ -8827 -5102 -15029 -14771 686 -30637 -57077 -52140 -58830 -58681 -29806 -5978 -22422 -20592 -20488
16344b0488j5688q981j3765J1389J0430J1871L135p133k1429J2010K3183k426
$$ -20488 -36176 -45157 -58922 -47533 -37103 -25232 -22097 -29230 -50659 -38649 -15466 -17892
16332a7892J7538J3296j3663o146j5369j0055J0517J5666j1801K4647p551k2973
$$ -17892 -354 12942 -721 -6867 -22236 -32291 -21774 -6108 -17909 6738 -813 -23786
16320b3786j900o056J7153K394k230q989J3368K2960j7609k5022j7527O423J9288
$$ -23786 -25686 -31742 -14589 -12195 -14425 -23414 -10046 12914 -4695 -29717 -47244 -40821 -21533
16307b1533n689j7752j5967j3857J1055N928k5920J179J1095M5539O476j5447
$$ -21533 -27222 -44974 -60941 -74798 -63743 -57815 -83735 -82556 -71461 -25922 -19446 -34893
16295c4893j0338K8435q102k1756L737m121p72J9130j3579o206L6097J2027k9962
$$ -34893 -45231 -16796 -24898 -46654 -42917 -47038 -47810 -28680 -42259 -48465 -12368 -341 -30303
16282c0303M326r144K878j0584O386J0071K5696q990k4824K079m692p163j7321
$$ -30303 -25977 -35121 -32243 -42827 -36441 -26370 -674 -9664 -34488 -32409 -37101 -44264 -61585
16269f1585L0846M2975k902k5040j2387j4321P841j0841k5343q71l878K2134L326
$$ -61585 -30739 12236 9334 -15706 -28093 -42414 -34573 -45414 -70757 -71628 -75506 -53372 -50046
16256e0046j969J1510L9112J7689l0934p750k5062K854J5875J2903j1868k4711
$$ -50046 -52015 -40505 -1393 16296 -14638 -22388 -47450 -44596 -28721 -15818 -27686 -52397
16244e2397K1444L5068l685k1590k3649J1287J0973K8842J4228j4115l4347k5496
$$ -52397 -30953 4115 430 -21160 -44809 -33522 -22549 6293 20521 6406 -27941 -53437
16232e3437P11J1756K0927K1202n879k875j8225O18P403N429j3701j040N083m444
$$ -53437 -52726 -40970 -20043 1159 -4720 -7595 -25820 -25202 -17799 -12370 -26071 -27111 -22028 -26472
16218b6472r323J0514L684l4482Q812Q004j9562M4241N105l0914p489L9064j518
$$ -26472 -35795 -25281 -21597 -56079 -47267 -39263 -58825 -14584 -9479 -40393 -47882 -8818 -10336
16205a0336j3077j1354r25J39k8359j9290L4580J9723P052O826p075o067j2589
$$ -10336 -23413 -34767 -35692 -35553 -63912 -83202 -48622 -28899 -21847 -15021 -22096 -28163 -40752
16192d0752k704K001J981m149n073J3419L4836M450k5385L762J6440O870J4766
$$ -40752 -43456 -41455 -39474 -43623 -48696 -35277 -441 4009 -21376 -17614 -1174 5696 20462
16179B0462K2703k733j8828j1574j5369l991k2944r81r919m846J457J5024J1428
$$ 20462 43165 40432 21604 10030 -5339 -9330 -32274 -33255 -43174 -48020 -46563 -31539 -20111
16166b0111k8828l822j0864J065K2616O594o067J0217K39J0060l616k164K5601
$$ -20111 -48939 -52761 -63625 -62560 -39944 -33350 -39417 -29200 -28961 -18901 -22517 -24681 920
16153I20K438j7283O233m065j225j2754m754q527N870J7279j3257j4241J2418
$$ 920 3358 -13925 -7692 -11757 -12982 -25736 -30490 -39017 -33147 -15868 -29125 -43366 -30948
16140c0948J7649k478L1196J6405k7812k8899k5535m854L5276J7862k3934m57
$$ -30948 -13299 -15777 15419 31824 4012 -24887 -50422 -55276 -20000 -2138 -26072 -26529
16128b6529K95Q760m789k7730M28M0441K7894l3105k7587j1155k0658R025j1694
$$ -26529 -26234 -17474 -22263 -49993 -49565 -9124 18770 -14335 -41922 -53077 -73735 -64710 -76404
16115g6404J2124J2527L6228K0554j8170o05O269k8002j2460J1651J65K448R368
$$ -76404 -64280 -51753 -15525 5029 -13141 -13746 -7477 -35479 -47939 -36288 -36123 -33675 -24307
16102b4307M024l2759l0964J6943J0874K1614j0573m238n012j2759J9437k511
$$ -24307 -20283 -53042 -84006 -67063 -56189 -34575 -45148 -49386 -54398 -67157 -47720 -50231
16090e0231k0887J7786q372p481L6641L0568J5303Q453j9811k0155j9698L369
$$ -50231 -71118 -53332 -61704 -69185 -32544 -1976 13327 21780 1969 -18186 -37884 -34515
16078c4515j0697J552m873M257M745N974J5050o182J486J8167j782O056l258J101
$$ -34515 -45212 -43660 -48533 -44276 -39531 -33557 -18507 -24689 -23203 -5036 -6818 -762 -4020 -2919
16064b919k8866n007J973K063J2058k2967k5282K677J4431K8597K4637k095q801
$$ -2919 -31785 -36792 -34819 -32756 -20698 -43665 -68947 -66270 -51839 -23242 1395 -700 -9501
16051i501J1125r650j0087N849j4521j0240J5503J188Q210j91R075K0954j7266
$$ -9501 1624 -8026 -18113 -12264 -26785 -37025 -21522 -20334 -12124 -12315 -3240 17714 448
16038D48j3506K8489J7335p736K0590K8133Q262l966M276Q395j1126q85j8309
$$ 448 -13058 15431 32766 25030 45620 73753 82015 78049 82325 90720 79594 78709 60400
16025F0400k5772K287k0662k5080j0052J2757L2152j685j5681m502P987p036k9482
$$ 60400 34628 36915 16253 -8827 -18879 -6122 26030 24345 8664 4162 12149 5113 -24369
16012b4369k5136L94J7051P545j6847J456R689J2457k367n599Q260J2702k1722
$$ -24369 -49505 -49111 -32060 -24515 -41362 -39906 -30217 -17760 -20127 -25726 -17466 -4764 -26486
15999b6486l9276J0855K5257K0924Q540O870m9969j8007R932P725L5552N764k5899
$$ -26486 -65762 -54907 -29650 -8726 -186 6684 -43285 -61292 -51360 -43635 -8083 -2319 -28218
15986b8218q846J1411P21l804J0861n992l3334k0814J0829J0221l387P152J1294
$$ -28218 -37064 -25653 -24932 -28736 -17875 -23867 -57201 -78015 -67186 -56965 -60352 -53200 -41906
15973d1906n598R618j6656P411L249r161K1774J7699o076L410K0721k217j8444
$$ -41906 -47504 -37886 -54542 -47131 -43882 -53043 -31269 -13570 -19646 -16236 4485 2268 -16176
15960a6176m145k335p570K076O213p248R851J5256P842o8J3344j593j4441j8786
$$ -16176 -20321 -22656 -30226 -28150 -21937 -29185 -19334 -4078 3764 3696 17040 15447 1006 -17780
15946a7780R553R53m454q232j3246L2005J1885O200j2139n568p745l131p908P200
$$ -17780 -8227 -7274 -11728 -19960 -33206 -1201 10684 16884 4745 -823 -8568 -11699 -19607 -12407
15932a2407n913K4730j7319l0494M965J2370J2069J9352M50P971O690o541j1781
$$ -12407 -18320 6410 -10909 -41403 -36438 -24068 -11999 7353 7803 15774 22464 15923 4142
15919D142J1043j546m1170J1491L5807K0548q460l758K9387J1099l5967k1322
$$ 4142 15185 13639 -27531 -16040 19767 40315 31855 28097 57484 68583 32616 11294
15907A1294k6918k068m363K988j3251J88K2854J6511j3042L307j3272l5774k0217
$$ 11294 -15624 -17692 -22055 -19067 -32318 -32130 -9276 7235 -5807 -2500 -15772 -51546 -71763
15894g1763J9593M2538K7212j3527K976K6687k468j5775j3389k0268j1219j6972
$$ -71763 -52170 -9632 17580 4053 7029 33716 31248 15473 2084 -18184 -29403 -46375
15882d6375j7204n82K3957L0722K5243k4288n633M385N229k775j4039j6224N907
$$ -46375 -63579 -64161 -40204 -9482 15761 -8527 -14160 -9775 -4546 -7321 -21360 -37584 -31677
15869c1677K7337k4846j8997J6248j1473j041K2825J6438p516M218k8993j5794
$$ -31677 -4340 -29186 -48183 -31935 -43408 -44449 -21624 -5186 -12702 -8484 -37477 -53271
15857e3271m609j2299J679K0693R597R357R282k417q387J0260R213K2735k8198
$$ -53271 -57880 -70179 -68500 -47807 -38210 -28853 -19571 -21988 -30375 -20115 -10902 11833 -16365
15844a6365j3359J0185K4730J0567m4886l2978J3863q959j9965j5279J6315P874
$$ -16365 -29724 -19539 5191 15758 -29128 -62106 -48243 -57202 -77167 -92446 -76131 -68257
15832f8257j394K1618J2758J6662N155J4000k1140L143L380q896k5924j3201J0770
$$ -68257 -69651 -48033 -35275 -18613 -13458 542 -20598 -17455 -14075 -22971 -48895 -62096 -51326
15819e1326R365M426l5800K026K5164Q355r361p812k501J7839J2057m769J8868
$$ -51326 -41961 -37535 -73335 -71309 -46145 -37790 -47151 -54963 -57464 -39625 -27568 -32337 -13469
15806a3469M919k2927o227L464k3680P872L3799K1604k365l555j2186l1339l1374
$$ -13469 -8550 -31477 -37704 -34240 -57920 -50048 -16249 5355 2990 -565 -12751 -44090 -75464
15793g5464N22R823K414O999K6897j1602j5740N611O437k4548k1654J9963M2984
$$ -75464 -74942 -65119 -62705 -55706 -28809 -40411 -56151 -50540 -44103 -68651 -90305 -70342 -27358
15780b7358j305K5777r515k3505j48L742m921n145j3866L411J6275J6578M307
$$ -27358 -28663 -2886 -12401 -35906 -36054 -32312 -37233 -42378 -56244 -52833 -36558 -19980 -15673
15767a5673J2773L221q944K9711Q859j5414k1830O322J300k7463k140J8015j166
$$ -15673 -2900 321 -8623 21088 29947 14533 -7297 -975 325 -27138 -29278 -11263 -12429
15754a2429p814J3796k3817O78J0609J8743l3670k7519M9466K4726l831j3608
$$ -12429 -20243 -6447 -30264 -29586 -18977 -234 -33904 -61423 -11957 12769 8938 -4670
15742d670j9534J0180K4118r04r452K3777o726m7304K633J0272N159k670n694
$$ -4670 -24204 -14024 10094 9190 -262 23515 16789 -30515 -27882 -17610 -12451 -15121 -20815
15729b0815P091J8314j5914j5115j3271n589J0502R132P776J9310p066r536k7664
$$ -20815 -13724 4590 -11324 -26439 -39710 -45299 -34797 -25665 -17889 1421 -5645 -15181 -42845
15716d2845j434p159R332N617K89K0732K2010J7303k0459k2670J1843j3762n541
$$ -42845 -44279 -51438 -42106 -36489 -36200 -15468 6542 23845 3386 -19284 -7441 -21203 -26744
15703b6744J9778J5212n659j7606M22o023R274n71j9771J6019J2184k4946k254
$$ -26744 -6966 8246 2587 -15019 -14597 -20620 -11346 -11917 -31688 -15669 -3485 -28431 -30685
15690c0685K1217j3134J4559R46P107q151o071k3181k554m382J2080J2802L997
$$ -30685 -9468 -22602 -8043 -7097 10 -8141 -14212 -37393 -39947 -44329 -32249 -19447 -15450
15677a5450p024M12Q446j6564l539l049K3308J671j7187r975j2636J428j5133
$$ -15450 -22474 -22062 -13616 -30180 -33719 -36768 -13460 -11789 -28976 -38951 -51587 -50159 -65292
15664f5292k22J8768J795J8303J4717q97k0542j4753n602K6923K9922j2004O481
$$ -65292 -65514 -46746 -44951 -26648 -11931 -12828 -33370 -48123 -53725 -26802 3120 -8884 -2403
15651b403k0065j4939K324k2590q574j0788L4526M764j6434J7942n073k6865J7034
$$ -2403 -22468 -37407 -35083 -57673 -66247 -77035 -42509 -37745 -54179 -36237 -41310 -68175 -51141
15638e1141K931L4552Q832J3440J9372k615q864j1691o834k3610j0644N696J6225
$$ -51141 -48210 -13658 -4826 8614 27986 25371 16507 4816 -2018 -25628 -36272 -30576 -14351
15625a4351j32k70p661q488j5959j0963K868k639J0086R774K0549J4319O477P766
$$ -14351 -14483 -14753 -22414 -30902 -46861 -57824 -54956 -57595 -47509 -37735 -17186 -2867 3610 11376
15611A1376Q830k3705o433J062k5661l5245J666P678L8308K5731j0667j0240j4101
$$ 11376 20206 -3499 -9932 -8870 -34531 -69776 -68110 -60432 -22124 3607 -7060 -17300 -31401
15598c1401L6517R905k0200m044J7251J004k9548k2597P664o97k92J0369Q356
$$ -31401 5116 15021 -5179 -9223 8028 9032 -20516 -43113 -35449 -36146 -36438 -26069 -17713
15585a7713l362Q156O322p969j9648m003P854q436k36j6101j3488J7391J9292
$$ -17713 -21075 -12919 -6597 -14566 -34214 -38217 -30363 -38799 -39035 -55136 -68624 -51233 -31941
15572c1941j7348l0775l112J6330k271O15K1675J7749j7756K8512J4451j9339
$$ -31941 -49289 -80064 -83176 -66846 -69117 -68502 -46827 -29078 -46834 -18322 -3871 -23210
15560b3210o43j1381J281K4456J0290k9237k2250m341K5384J3216M858k4761n601
$$ -23210 -23853 -35234 -33953 -9497 793 -28444 -50694 -55035 -29651 -16435 -11577 -36338 -41939
15547d1939Q182k1785J0699j1270j218K944P595k0334M077L8439O204l1361l670
$$ -41939 -33757 -55542 -44843 -56113 -57331 -54387 -46792 -67126 -63049 -24610 -18406 -49767 -53437
15534e3437j1751K9150J1613J4914p06o216m861J728Q393j20m824j9385k0350
$$ -53437 -65188 -36038 -24425 -9511 -10217 -16433 -21294 -19566 -11173 -11293 -16117 -35502 -55852
15521e5852j595j6583K3078K566R227J5819m600j6992j2885L6976J7551j220j5006
$$ -55852 -57447 -74030 -50952 -48386 -39159 -23340 -27940 -44932 -57817 -20841 -3290 -4510 -19516
15508a9516l020M62o913m514J7495J7173J7393r289l5032k253Q135K4123N041
$$ -19516 -22536 -22074 -28987 -33501 -16006 1167 18560 9271 -25761 -28014 -19879 4244 9285
15495I285j0488Q474j3581K1784J2515r7k319m19J2361l619k511k1730l8868j2478
$$ 9285 -1203 7271 -6310 15474 27989 27892 25573 25154 37515 33896 31385 9655 -29213 -41691
15481d1691l789M4476N072o041P675k1240k4352Q424Q026L096K5460J3553j4064
$$ -41691 -45480 -1004 4068 -1973 5702 -15538 -39890 -31466 -23440 -20344 5116 18669 4605
15468D605j2490k8382J594J6733L030J765R042k334R025J0754q926J2846k960
$$ 4605 -7885 -36267 -34673 -17940 -14910 -13145 -4103 -6437 2588 13342 4416 17262 14302
15455A4302k7418J6269L319J3441J0692j6779j8666j8634j6346O12K4949j6905
$$ 14302 -13116 3153 6472 19913 30605 13826 -4840 -23474 -39820 -39208 -14259 -31164
15443c1164j4409K8491j585K2958K6069j0208k5908j5688J2924m96l427r441j5141
$$ -31164 -45573 -17082 -18667 4291 30360 20152 -5756 -21444 -8520 -9016 -12443 -21884 -37025
15430c7025k0176J0094K8314J7575K109m633Q459P94o741N458R476O405j5077
$$ -37025 -57201 -47107 -18793 -1218 891 -3742 4717 5511 -1230 4228 13704 20109 5032
15417E032k2830n512k3508J1526J9545l023k5183P751M917K1363J672j7313j2025
$$ 5032 -17798 -23310 -46818 -35292 -15747 -18770 -43953 -36202 -31285 -9922 -8250 -25563 -37588
15404c7588J5632R979J60M730L079J3082n727p793q18j869M553n45M680o810j3950
$$ -37588 -21956 -11977 -11817 -7087 -4008 9074 3347 -4446 -5264 -7133 -2580 -3125 1555 -5255 -19205
15389a9205j8292K1971Q557o579J9069q554j4039J3439L826k2440k955J0830j5681
$$ -19205 -37497 -15526 -6969 -13548 5521 -3033 -17072 -3633 193 -22247 -25202 -14372 -30053
15376c0053M299j73O338J636k3468p038L486L4193l443k156n008P920K728l7104
$$ -30053 -25754 -25927 -19589 -17953 -41421 -48459 -44973 -10780 -14223 -16379 -21387 -13467 -10739 -47843
15362d7843J421J4008n13l370j645j835J566J7745J1689L039l713p23p389q415
$$ -47843 -46422 -32414 -32927 -36297 -37942 -39777 -38211 -20466 -8777 -5738 -9451 -10174 -17563 -25978
15348b5978J8935L439l62K5337o13r449J6845R233R446j7740k4807q092O31N332
$$ -25978 -7043 -3604 -3966 21371 20758 11309 28154 37387 46833 29093 4286 -3806 -3175 2157
15334B157L767j8998j2990L8999L046N803r147k0638k6808j8090j5382j703J7105
$$ 2157 5924 -13074 -26064 12935 15981 21784 12637 -8001 -34809 -52899 -68281 -69984 -52879
15321e2879N126j5410j1389J2981Q582K674j4429j0019L9990J1847k2641L28P128
$$ -52879 -47753 -63163 -74552 -61571 -52989 -50315 -64744 -74763 -34773 -22926 -45567 -45239 -38111
15308c8111K7268n61k0876j7570m961J4161K263o34J936K4246J670j3345N227
$$ -38111 -10843 -11404 -32280 -49850 -54811 -40650 -38387 -39021 -37085 -12839 -11169 -24514 -19287
15295a9287o646r165J3313L0255K663J0231k407k4317j8227l826L590q789O25
$$ -19287 -25933 -35098 -21785 8470 11133 21364 18957 -5360 -23587 -27413 -23823 -32612 -31987
15282c1987J2077j806j1681K258J8253k1162J2150J9919R274J217k2136j3157
$$ -31987 -19910 -21716 -33397 -31139 -12886 -34048 -21898 -1979 7295 8512 -13624 -26781
15270b6781J6093j19N165K6985n717j4099k438j3937j1896P528K0252J4279N524
$$ -26781 -10688 -10807 -5642 21343 15626 1527 -911 -14848 -26744 -19216 1036 15315 20839
15257B0839j2917l0012l8886j1624M2348j4936n508K4070J0497J0238M158N566
$$ 20839 7922 -22090 -60976 -72600 -30252 -45188 -50696 -26626 -16129 -5891 -1733 3833
15245C833m7266j9717o269J9649L1037J6866j5159l5114j0681L4491K0268J1283
$$ 3833 -43433 -63150 -69419 -49770 -18733 -1867 -17026 -52140 -62821 -28330 -8062 3221
15233C221j3442p643K890K9333R558J2248k3724k3387J9914n177k2934J2746M714
$$ 3221 -10221 -17864 -14974 14359 23917 36165 12441 -10946 8968 3791 -19143 -6397 -1683
15220a683p926k2825j946p077O714J2037Q929j92j1445j9452J7063L9497q527
$$ -1683 -9609 -32434 -34380 -41457 -34743 -22706 -13777 -13969 -25414 -44866 -27803 11694 3167
15207C167l2198j4218r027J3776K9288J6794k0158l579k8150q140L3390K6989
$$ 3167 -29031 -43249 -52276 -38500 -9212 7582 -12576 -16155 -44305 -52445 -19055 7934
15195G934J452k5320l4434p768J2269J4839Q466j2731k6026j2158l976J1929n490
$$ 7934 9386 -15934 -50368 -58136 -45867 -31028 -22562 -35293 -61319 -73477 -77453 -65524 -71014
15182g1014R878K3265j6887J755K7420j286J6776O819O657J3258k596k7091m7564
$$ -71014 -61136 -37871 -54758 -53003 -25583 -26869 -10093 -3274 3383 16641 14045 -13046 -60610
15169f0610k3964J2962Q406J3297L733L926J8601n091l333N346K1756k81k595
$$ -60610 -84574 -71612 -63206 -49909 -46176 -42250 -23649 -28740 -32073 -26727 -4971 -5252 -7847
15156g847Q998N632j3161k6252m033J2058J2182J9500J9040p94n885k6082j5446
$$ -7847 1151 6783 -6378 -32630 -36663 -24605 -12423 7077 26117 25323 19438 -6644 -22090
15143b2090L198j837n007m047J6127J742o294m153J2967J1794k2512M172R112
$$ -22090 -18892 -20729 -25736 -29783 -13656 -11914 -18208 -22361 -9394 2400 -20112 -15940 -6828
15130f828k1757n239K1495p600l2632r062j9936j0837J7983J3542j1187J6598
$$ -6828 -28585 -33824 -12329 -19929 -52561 -61623 -81559 -92396 -74413 -60871 -72058 -55460
15118e5460J4666r753j4415K785M53J2742j4136J3194L2277K8883j5917j2575
$$ -55460 -40794 -50547 -64962 -62177 -61724 -48982 -63118 -49924 -17647 11236 -4681 -17256
15106a7256j5814j2574K8763L066l7313l808o890m215K2767J4165O642r629j6598
$$ -17256 -33070 -45644 -16881 -13815 -51128 -54936 -61826 -66041 -43274 -29109 -22467 -32096 -48694
15093d8694o025L2175l424l861j6486Q830M670R244J8609J108j5402J521k3717
$$ -48694 -54719 -22544 -25968 -29829 -46315 -37485 -32815 -23571 -4962 -3854 -19256 -17735 -41452
15080d1452M781K307J3015n73J282K7284O870L947O539k116o12m404k2884j1813
$$ -41452 -36671 -34364 -21349 -21922 -20640 6644 13514 17461 24000 21884 21272 16868 -6016 -17829
15066a7829J2451o962r540j3151j9123q445K3409Q534L21k601K947m399k6256
$$ -17829 -5378 -12340 -21880 -35031 -54154 -62599 -39190 -30656 -30335 -32936 -29989 -34388 -60644
15053f0644P652Q313J2106L199R282K4522k547R94o70j638l474J5802n532m139
$$ -60644 -52992 -44679 -32573 -29374 -20092 4430 1883 2877 2207 569 -2905 12897 7365 3226
15039C226K0727J6918k0329m9932K773J6087L0928N988k6300k9032K1524k605
$$ 3226 23953 40871 20542 -29390 -26617 -10530 20398 26386 86 -28946 -7422 -10027
15027a0027j2391j4786j7882J5114L7880j7254M599K5866n683q979m420K8933
$$ -10027 -22418 -37204 -55086 -39972 -2092 -19346 -14747 11119 5436 -3543 -7963 20970
15015B0970J5541M636N974k556j305j5273R899j5071J276O220j1838q54j731r374
$$ 20970 36511 41147 47121 44565 43260 27987 37886 22815 24091 30311 18473 17619 15888 6514
15001F514q677n950m367K0665L81J527M260n458Q965J4042K6728q709m1839o855
$$ 6514 -2163 -8113 -12480 8185 8566 10093 14353 8895 17860 31902 58630 49921 8082 1227
14987A227J3168K7945K0529J2047k1718j5250K3267K2904M9560N5563O0676O5154
$$ 1227 14395 42340 62869 74916 53198 37948 61215 84119 133679 189242 249918 315072
14975C15072J02254J57716K54381N41398R37000J005843L05486l45229n41028
$$ 315072 417326 575042 829423 1370821 2307821 3313664 3619150 3273921 2732893
14966B732893o66652o17911m63727k98050j98540j57709p6598m9781l3147j9131
$$ 2732893 2066241 1448330 984603 686553 488013 330304 253706 203925 170778 151647
14956A51647k8924l4130m8679j9704J4794J6117k4235O661j6295k5856l4562k86
$$ 151647 122723 88593 39914 20210 35004 51121 26886 33547 17252 -8604 -43166 -43452
14944d3452p037K1137L7661O394n975j7829k8659J7716q495k4160J2996J4526
$$ -43452 -50489 -29352 8309 14703 8728 -9101 -37760 -20044 -28539 -52699 -39703 -25177
14932b5177P092j5023j2344J5217k887L357K1657j922j0917n729j0968L259o934
$$ -25177 -18085 -33108 -45452 -30235 -33122 -29765 -8108 -10030 -20947 -26676 -37644 -34385 -41319
14919d1319R366L644j0292K6852J1795k2664r755L074K2702j0383j9856J1485
$$ -41319 -31953 -28309 -38601 -11749 46 -22618 -32373 -29299 -6597 -16980 -36836 -25351
14907b5351Q216L5177K8756l7046j9266n500j792K8135J5065j7638p618L0494
$$ -25351 -17135 18042 46798 9752 -9514 -15014 -16806 11329 26394 8756 1138 31632
14895C1632K3345j8320m7147p15q991R16M5888J7158r565j815k1996p68j5141
$$ 31632 54977 36657 -10490 -11205 -20196 -19280 26608 43766 34201 32386 10390 9622 -5519
14882e519j5718m44q75J2968L221J7726J406j2584N998j0661j0494l6327k1730
$$ -5519 -21237 -21681 -22556 -9588 -6367 11359 12765 181 6179 -4482 -14976 -51303 -73033
14869g3033R73K5432J0115p831j0210J5948O081R624m773o956j742j633M663m257
$$ -73033 -72060 -46628 -36513 -44344 -54554 -38606 -32525 -22901 -27674 -34630 -36372 -38005 -33342 -37599
14855c7599k1871J9034K3036j3821J1089P544n062J2982J2193N129p578k4637
$$ -37599 -59470 -40436 -17400 -31221 -20132 -12588 -17650 -4668 7525 12654 5076 -19561
14843a9561J0817N950J8506j514n060l6896j5505N84l230m611j0648M832j1474
$$ -19561 -8744 -2794 15712 14198 9138 -27758 -43263 -42679 -45909 -50520 -61168 -56336 -67810
14830f7810l403J2476J0175n455n775Q167J3905K0721J9739j107K2967R229j4685
$$ -67810 -71213 -58737 -48562 -54017 -59792 -51625 -37720 -16999 2740 1633 24600 33829 19144
14817A9144j2367j2721j4285m262j0240r421m22Q662M676Q932J9001P166o089
$$ 19144 6777 -5944 -20229 -24491 -34731 -44152 -44574 -35912 -31236 -22304 -3303 3863 -2226
14804b226j1296j4770r441k525J632M03j569Q438j4352j1842J9633J4426L313
$$ -2226 -13522 -28292 -37733 -40258 -38626 -38223 -39792 -31354 -45706 -57548 -37915 -23489 -20176
14791b0176R41J1313o780j078J1357j1886J664l083K2848J7249j5454K4053N363
$$ -20176 -19235 -7922 -14702 -15780 -4423 -16309 -14645 -17728 5120 22369 6915 30968 36331
14778C6331P235p364P784o976k5763k07P748M067j1955K6551R513k0662k5414
$$ 36331 43566 36202 43986 37010 11247 11040 18788 22855 10900 37451 46964 26302 888
14765H88l3079q172o139J8077J6519K5965J3538L837M951j4232j9198Q125l6218
$$ 888 -32191 -40363 -46502 -28425 -11906 14059 27597 31434 36385 22153 2955 11080 -25138
14752b5138P90L3513r662j7878J8592K2608k707j736J7115j1814j7586J5726J5981
$$ -25138 -24348 9165 -497 -18375 217 22825 20118 18382 35497 23683 6097 21823 37804
14739C7804o564j729P50L836K237j0217k5721j266r243J2890J1420j5720J9749
$$ 37804 31240 29511 30261 34097 36334 26117 396 -870 -10113 2777 14197 -1523 18226
14726A8226l507r330K948Q479j4573j9113J5947J296J6665j5876l1698M604L4723
$$ 18226 14719 5389 8337 16816 2243 -16870 -923 373 17038 1162 -30536 -25932 8791
14713H791K3742n275K445O945q097k662L8630O605l0920q830r280r203N887M623
$$ 8791 32533 27258 29703 36648 28551 25889 64519 71124 40204 31374 22094 12891 18778 23401
14699B3401J1137k0335k6476j549o490j7299K4564J5090q694M349L1752J6955
$$ 23401 34538 14203 -12273 -13822 -20312 -37611 -13047 2043 -6651 -2302 29450 46405
14687D6405j3544k3467j2267K378j1976j7495k4989J3317J0888K7215M452j9079
$$ 46405 32861 9394 -2873 -495 -12471 -29966 -54955 -41638 -30750 -3535 917 -18162
14675a8162L469j6557N108j1932j4169P727M7233J8236J8071Q71q497l219P306
$$ -18162 -14693 -31250 -26142 -38074 -52243 -44516 2717 20953 39024 39895 31398 28179 35485
14662C5485O214j4671K4302K0253m4437j0912J3740P220M88r943n943J541J401
$$ 35485 41699 27028 51330 71583 27146 16234 29974 37194 37682 27739 21796 23337 24738
14649B4738j3244j7977L931J0671J2294o145j2499r543N804K5820K097j3001j271
$$ 24738 11494 -6483 -2552 8119 20413 14268 1769 -7774 -1970 23850 25947 12946 11675
14636A1675N595k3648J0506P92j7843l4861k0330Q431M841j1564J0548L9587j2342
$$ 11675 17270 -6378 4128 4920 -12923 -47784 -68114 -59683 -54842 -66406 -55858 -16271 -28613
14623b8613O603J595L50j238M269q749j9009K289J2295j1210J0461K6448J4585
$$ -28613 -22010 -20415 -20065 -21303 -17034 -25783 -44792 -42503 -30208 -41418 -30957 -4509 10076
14610A0076J7722j6310m1053j9245K566n343J6898K2048J3397k1445l0651L964
$$ 10076 27798 11488 -29565 -48810 -46244 -51587 -34689 -12641 756 -20689 -51340 -47376
14598d7376O078Q416J2561j4210R485J3569J5316j4223l657J4899n129j2198J2730
$$ -47376 -41298 -32882 -20321 -34531 -25046 -11477 3839 -10384 -14041 858 -4271 -16469 -3739
14585c739J0139O411k3844l6198R755K5077m865r835j3031L629K8514L050k1098
$$ -3739 6400 12811 -11033 -47231 -37476 -12399 -17264 -27099 -40130 -36501 -7987 -4937 -26035
14572b6035k6126L634J5619R399J4276p631k4764j2659K0217L3318M958m3345
$$ -26035 -52161 -48527 -32908 -23509 -9233 -16864 -41628 -54287 -34070 -752 4206 -39139
14560c9139j6966J2734K1604K4017M346j2597r196jJ1182l70j3030m542O019J3455
$$ -39139 -56105 -43371 -21767 2250 6596 -6001 -15197 -15198 -4016 -4386 -17416 -21958 -15939 -2484
14546b484m2495o468L0103L29r959m577J1573J5608P07p158l566o659k4745L836
$$ -2484 -44979 -51447 -21344 -21015 -30974 -35551 -23978 -8370 -7663 -14821 -18387 -25046 -49791 -45955
14532d5955J5934k533p826K1211O607p926k119K98O018j381K1067k3319q178M605
$$ -45955 -30021 -32554 -40380 -19169 -12562 -20488 -22607 -22309 -16291 -17672 3395 -19924 -28102 -23497
14518b3497j1378J7416K949l115j5991J2654J4761j0701q594L131j8283L1460
$$ -23497 -34875 -17459 -14510 -17625 -33616 -20962 -6201 -16902 -25496 -22365 -40648 -9188
14506i188L5479R607k3529l0486Q903K5139J1638o053L653o760j2780k4372j3500
$$ -9188 26291 35898 12369 -18117 -9214 15925 27563 21510 25163 18403 5623 -18749 -32249
14493c2249L581K0787R25m449J3175K6855m194k4646R145Q490p085J3643K5848
$$ -32249 -28668 -7881 -6956 -11405 1770 28625 24431 -215 8930 17420 10335 23978 49826
14480D9826J785j5146j638j7170K317K660j7565j1068l7708j440J7741J6263J6878
$$ 49826 51611 36465 34827 17657 19974 22634 5069 -5999 -43707 -45147 -27406 -11143 5735
14467E735r061O383j2649L1856N850j2268j3760J6809M103r176j0563K3953J6987
$$ 5735 -3326 3057 -9592 22264 28114 15846 2086 18895 22998 13822 3259 27212 44199
14454D4199m810k7370j7713j0963j8738J8148L5132N664n444k1946J293N597j3962
$$ 44199 39389 12019 -5694 -16657 -35395 -17247 17885 23549 18105 -3841 -2548 3049 -10913
14441a0913n728n791J9770n831m1714p298J4118M97K133j5795j662j831k2777
$$ -10913 -16641 -22432 -2662 -8493 -50207 -57505 -43387 -42890 -40757 -56552 -58214 -60045 -82822
14428h2822K0718L7135N913P522k6706O082m517r83o697N787J2862j705K207J5032
$$ -82822 -62104 -24969 -19056 -11534 -38240 -32158 -36675 -37658 -44355 -38568 -25706 -27411 -25204 -10172
14414a0172p091J0684K4972J5009K759j3931k1189r713j4302j0818P530K4202
$$ -10172 -17263 -6579 18393 33402 36161 22230 1041 -8672 -22974 -33792 -26262 -2060
14402b060N970l250j5073m515r494P030K1985o306k9744L394J2291R14J2462K9402
$$ -2060 3910 660 -14413 -18928 -28422 -21392 593 -5713 -35457 -32063 -19772 -18858 -6396 23006
14388B3006M33l7174R714K7382J515k3616J1874J1248j4251l0951q115J0989J4371
$$ 23006 23439 -13735 -4021 23361 24876 1260 13134 24382 10131 -20820 -28935 -17946 -3575
14375c575L223L359j0943K2082J8321J0152k2870m021J1343J8019l7129l0575
$$ -3575 -352 3007 -7936 14146 32467 42619 19749 15728 27071 45090 7961 -22614
14363b2614J4283j3368k5591J1822J6265L1438J4679K452j8212j7368m992o182
$$ -22614 -8331 -21699 -47290 -35468 -19203 12235 26914 29366 11154 -6214 -11206 -17388
14351a7388P133j0349j8152J4749O560J51j6812J0595M5614n266O329P213j9208
$$ -17388 -10255 -20604 -38756 -24007 -17447 -17296 -34108 -23513 22101 16835 23164 30377 11169
14338A1169j1064K0430j0039j80o460K177j0362O057P637J322p392j2413p446
$$ 11169 105 20535 10496 10316 3856 6033 -4329 1728 9365 10687 3295 -9118 -16564
14325a6564k531j182q718j104k6304m331J3450q698J4979J2251J3334K277k0514
$$ -16564 -19095 -20277 -28995 -30099 -56403 -60734 -47284 -55982 -41003 -28752 -15418 -13141 -33655
14312c3655k9518L0066M0194o635n727N459j2450J0714n611j0753k0062k1688
$$ -33655 -63173 -33107 7087 452 -5275 184 -12266 -1552 -7163 -17916 -37978 -59666
14300e9666J7243K0910O023k60P072j1890P631J2002j1350Q758k4444k0179K7735
$$ -59666 -42423 -21513 -15490 -15750 -8678 -20568 -12937 -935 -12285 -3527 -27971 -48150 -20415
14287b0415J1228j1063J0031J4812j3132j0289j706M464L2810K7458k0511m4788
$$ -20415 -9187 -20250 -10219 4593 -8539 -18828 -20534 -16070 16740 44198 23687 -21101
14275b1101j4234J7834J5323K756o238L5032j3566j5172q169k0414k0968k620
$$ -21101 -35335 -17501 -2178 578 -5660 29372 15806 634 -7535 -27949 -48917 -51537
14263e1537q279J7954q155r743N596J1099J8777P803J0077K6281o443k0490j6233
$$ -51537 -59816 -41862 -50017 -59760 -54164 -43065 -24288 -16485 -6408 19873 13430 -7060 -23293
14250b3293L772J0887J3638K401l2277K2453J2437k48l779k9668J440M6856J5562
$$ -23293 -19521 -8634 5004 7405 -24872 -2419 10018 9770 5991 -23677 -22237 24619 40181
14237D0181l3603j4882K511M566k0248j9352q68n260J6973P269J1201l72J7593
$$ 40181 6578 -8304 -5793 -1227 -21475 -40827 -41695 -46955 -29982 -22713 -11512 -11884 5709
14224E709j54n88J3521n632j5920j7474k691k2239p443J9382Q937j3769J3662
$$ 5709 5555 4967 18488 12856 -3064 -20538 -23229 -45468 -52911 -33529 -24592 -38361 -24699
14211b4699J0836k3144j8433m776P615r21K636O680R20r372j616K5690j1786k610
$$ -24699 -13863 -37007 -55440 -60216 -52601 -53522 -50886 -44206 -43286 -52658 -54274 -28584 -40370 -42980
14197d2980L3141j1579K259J3791o418j7154J6836N565J243Q283l020j8000l001
$$ -42980 -9839 -21418 -19159 -5368 -11786 -28940 -12104 -6539 -5296 2987 -33 -18033 -21034
14184b1034o50k190K3981J7485j1234j1653k379m172N088Q022J0504k1164j3770
$$ -21034 -21684 -23874 107 17592 6358 -5295 -7674 -11846 -6758 1264 11768 -9396 -23166
14171b3166J1189J4261j2766j5572J1425J7822K0374k6912K365j0396J2242N426
$$ -23166 -11977 2284 -10482 -26054 -14629 3193 23567 -3345 -980 -11376 866 6292
14159F292j9491j1218k5619o696L02p740K3590L8013P216k3632J493J5908K298
$$ 6292 -13199 -24417 -50036 -56732 -56430 -64170 -40580 -2567 4649 -18983 -17490 -1582 716
14146G16j6190O714L025o726m402J012m358K7159J5867N11m2399r800J9380J6507
$$ 716 -15474 -8760 -5735 -12461 -16863 -15851 -20209 6950 22817 23328 -19071 -28871 -9491 7016
14132G016R642m629k4179N924K2211q323j591j9822k1698l871n250l128J2180
$$ 7016 16658 12029 -12150 -6226 15985 7662 6071 -13751 -35449 -39320 -44570 -47698 -35518
14119c5518j0381J1599K2784R023j5485j7530M011N117j1108l4428K6677O428
$$ -35518 -45899 -34300 -11516 -2493 -17978 -35508 -31497 -26380 -37488 -71916 -45239 -38811
14107c8811j7188K5979K6500K868k062J0112p782j2037P644M040J1049o905l20
$$ -38811 -55999 -30020 -3520 -652 -2714 7398 -384 -12421 -4777 -737 10312 3407 3087
14094C087k2813K481J5087K142R7J1372J4737O52j7662K712L1456j4360j3699
$$ 3087 -19726 -17245 -2158 -16 81 11453 26190 26842 9180 11892 43348 28988 15289
14081A5289l99l1871j7194J5855M563n395l81j8286K9288r986k6053Q161J7140
$$ 15289 14890 -16981 -34175 -18320 -13757 -19152 -19533 -37819 -8531 -18517 -44570 -36409 -19269
14068a9269Q460r191j0493J2120K0674K220j9760o367M179r170L4388q749o106
$$ -19269 -10809 -20000 -30493 -18373 2301 4521 -15239 -21606 -17427 -26597 7791 -958 -7064
14055g064K033m359k059k167K6523K921k2489l9002p346K1786K8791l446Q099
$$ -7064 -5031 -9390 -11449 -13616 12907 15828 -6661 -45663 -53009 -31223 -2432 -5878 2221
14042B221m835j832q107J297J5423J158j9745q683J3003J6100k0708K174k722
$$ 2221 -2614 -4446 -12553 -11256 4167 5325 -14420 -23103 -10100 6000 -14708 -12534 -15256
14029a5256Q528J4646K5837l856j2031k115K515p240O414M318j5489k179j1239
$$ -15256 -6728 7918 33755 29899 17868 15753 18268 11028 17442 21760 6271 4092 -7147
14016g147J6722k249r875o736q159Q686p417k074J7847j4315r747R022j1901R200
$$ -7147 9575 7326 -2549 -9285 -17444 -8758 -16175 -18249 -402 -14717 -24464 -15442 -27343 -18143
14002a8143K1360J7841O127K126k9168k6243q788j9011N252k0757K9394L958K7509
$$ -18143 3217 21058 27185 29311 143 -26100 -34888 -53899 -48647 -69404 -40010 -36052 -8543
13989h543J623j4101K2662L0168k7059q285p599J0384O090j4057K357j8769j2709
$$ -8543 -6920 -21021 1641 31809 4750 -3535 -11134 -750 5340 -8717 -6360 -25129 -37838
13976c7838J3147k0676j5418K1066J4676J8715k0954J3839K2626J924j1289m702
$$ -37838 -24691 -45367 -60785 -39719 -25043 -6328 -27282 -13443 9183 11107 -182 -4884
13964d884O209K4231J9679k7560l7446j067J3921l6239j8169K9496J0753Q23p290
$$ -4884 1325 25556 45235 17675 -19771 -20838 -6917 -43156 -61325 -31829 -21076 -20253 -27543
13951b7543k7734j5000J6584J9962J2905J3829R509J0477j7939r301M418M867
$$ -27543 -55277 -70277 -53693 -33731 -20826 -6997 2512 12989 -4950 -14251 -9833 -4966
13939d966Q721K8516P277o897k7235m735R142J631k0858k3375L0073J5949K248
$$ -4966 3755 32271 39548 32651 5416 681 9823 11454 -9404 -32779 -2706 13243 15491
13926A5491j4055L047J7007J1544j7568J1116J2184j160k4416j5487J7378N440
$$ 15491 1436 4483 21490 33034 15466 26582 38766 37606 13190 -2297 15081 20521
13914B0521j6326k4039j3892j4702Q628J4733L2462J4647j9623j3475K160R216
$$ 20521 4195 -19844 -33736 -48438 -39810 -25077 7385 22032 2409 -11066 -8906 310
13902C10J3721k8469j1230Q35J3370O036M137R125L569n337j3698q047M67j039
$$ 310 14031 -14438 -25668 -24833 -11463 -5427 -1290 7835 11404 6067 -7631 -15678 -15211 -16250
13888a6250j0129j0970K8645K5389p318J2692R270J4056J725l4266j784j7673
$$ -16250 -26379 -37349 -8704 16685 9367 22059 31329 45385 47110 12844 11060 -6613
13876f613k2584j3212K4193R876J0153L349j2439O369J0218J2452K1288l6038
$$ -6613 -29197 -42409 -18216 -8340 1813 5162 -7277 -908 9310 21762 43050 7012
13864G012l2635K7824N387q701o024K231j1659J2613j005K6113p680j22k543j5280
$$ 7012 -25623 2201 7588 -1113 -7137 -4906 -16565 -3952 -4957 21156 13476 13354 10811 -4469
13850d469n363K895j2689j0631J462K9488K2960j7801q192o156m0749J7455j0303
$$ -4469 -9832 -6937 -19626 -30257 -28795 693 23653 5852 -2340 -8496 -49245 -31790 -42093
13837d2093k5j979K9703Q795L7737k589k1175Q989o386r268k4214q172j5854L0553
$$ -42093 -42118 -44097 -14394 -5599 32138 29549 8374 17363 10977 1709 -22505 -30677 -46531 -15978
13823a5978J9819r857Q438K0438j0686j9789m659M604L4431J1782O961J306k3281
$$ -15978 3841 -6016 2422 22860 12174 -7615 -12274 -7670 26761 38543 45504 46810 23529
13810B3529N836K7903K9797k29L7436L9017M6396Q2946J17415N4507m278o2554
$$ 23529 29365 57268 87065 86836 124272 163289 209685 292631 410046 464553 460275 397721
13798C97721j05989j13108k8627m711k1714k6343k1962m120l1587o359K1921j1644
$$ 397721 291732 178624 149997 145286 123572 97229 75267 71147 39560 33201 55122 43478
13786D3478m018l8609j4993J0683J7178J7746j3616Q186K356L423J8320N402o344
$$ 43478 39460 851 -14142 -3459 13719 31465 17849 26035 28391 31814 50134 55536 49192
13773D9192J9943J0095j2846J389M710l275M173J5794J6114N0095L5662O4550
$$ 49192 69135 79230 66384 67773 72483 69208 73381 89175 105289 155384 191046 255596
13761B55596R2783J47679K74883L91566L43186R9706j41979k56236k65065k12084
$$ 255596 348379 496058 770941 1162507 1505693 1605399 1463420 1207184 942119 730035
13751G30035j70391j70637j41932p4305n1142k0612j912p214o54l974O185m416
$$ 730035 559644 389007 247075 172770 121628 101016 99104 91890 91236 87262 93447 89031
13739H9031j0877j4841k6549L514J7795K2221J0274l6825l4907N710P298J696
$$ 89031 78154 63313 36764 40278 58073 80294 90568 53743 18836 24546 31844 33540
13727C3540J8527m275K3013m459n29J4006K0688J1767M7906M9021M6427J11593
$$ 33540 52067 47792 70805 66346 65817 79823 100511 112278 160184 209205 255632 367225
13715C67225J80488K84649L87560L03907M5585j55041k37591k55437k49146j72680
$$ 367225 547713 832362 1219922 1523829 1569414 1414373 1176782 921345 672199 499519
13705D99519j28123j27704o0674l3759l6129l4015l2917j1836k087K339l792j8690
$$ 499519 371396 243692 183018 149259 113130 79115 46198 34362 32275 34614 30822 12132
13693A2132k250L1213j45j7250R404J8739J3094m279m650j7826k3592j2066m505
$$ 12132 9882 41095 40950 23700 33104 51843 64937 60658 56008 38182 14590 2524 -1981
13680a981j621J3684K1954K6410K2668N758K2691J057J4689N2842P6546J14063
$$ -1981 -3602 10082 32036 58446 81114 86872 109563 110620 125309 178151 254697 368760
13668C68760J51375N6224j9666q8537q1806q9800q0430o2997n4497j8296p799
$$ 368760 520135 576359 556693 468156 386350 296550 216120 153123 98626 80330 72531
13657G2531q257j7287j1560j8424R974j1092k916J9908j7964l5255J79K9573L1137
$$ 72531 64274 46987 35427 17003 26977 15885 12969 32877 14913 -20342 -20163 9410 40547
13644D0547R590n0955m0643P778K6105Q130j9381p142J8488J1095j456l187m252
$$ 40547 50137 -818 -41461 -33683 -7578 552 -18829 -25971 -7483 3612 2156 -1031 -5283
13631e283J2688m207n744k7275j224R720L121j8703K2875K5814K9232l05m1010
$$ -5283 7405 3198 -2546 -29821 -31045 -21325 -18204 -36907 -14032 11782 41014 40709 -301
13618c01J0413J4054M606k3286k120K922J753j2209o428k6576J6369J2938K949
$$ -301 10112 24166 28772 5486 3366 6288 8041 -4168 -10596 -37172 -20803 -7865 -4916
13605d916j375j5767k107J1093n36R119o929j252L511O327r420K205L949R67Q147
$$ -4916 -6291 -22058 -24165 -13072 -13608 -4489 -11418 -12670 -9159 -2832 -12252 -10047 -6098 -5131 3016
13590C016r777j8918J5822j027m387R899J8221j6190R73M390J4736K1180l142
$$ 3016 -6761 -25679 -9857 -10884 -15271 -5372 12849 -3341 -2368 2022 16758 37938 34796
13577C4796K9754N998j9898k8728j963P714n454J3720j0007J108J1053K821k5899
$$ 34796 64550 70548 50650 21922 19959 27673 22219 35939 25932 27040 38093 40914 15015
13564A5015k3071Q142R464k0998K6658K4015R853o839j3781Q66J2193j4973j156
$$ 15015 -8056 86 9550 -11448 15210 39225 49078 42239 28458 29324 41517 26544 25388
13551B5388l462j9237j8905L1173K0409j4334J2191k4096o260J4243q016R565
$$ 25388 21926 2689 -16216 14957 35366 21032 33223 9127 2867 17110 9094 18659
13539A8659j9764q778m488J3793R656K6113J1642o729p721j1872j4156O353j6250
$$ 18659 -1105 -9883 -14371 -578 9078 35191 46833 40104 32383 20511 6355 12708 -3542
13526c542J7192K0370J3928l0653k9015J5780K4701Q729o404j4362K1266J097
$$ -3542 13650 34020 47948 17295 -11720 4060 28761 37490 31086 16724 37990 39087
13514C9087k1613L913J3354J191j8832k3102O488K6310J0843k1461K0310p724
$$ 39087 17474 21387 34741 35932 17100 -6002 486 26796 37639 16178 36488 28764
13502B8764r461j5209m089J4945o13r716m133J1804l371J2574l2436j227J2732
$$ 28764 19303 4094 5 14950 14337 4621 488 12292 8921 21495 -10941 -12168 564
13489E64J4040J7918J0627Q238l3938N455l964J207l247o5J9688r507p320o024
$$ 564 14604 32522 43149 51387 17449 22904 18940 20147 16900 16835 36523 27016 19696 13672
13475A3672k2503j524K5431K0120j8169o358J5975J4847k9702q8K3609J297k0587
$$ 13672 -8831 -10355 15076 35196 17027 10669 26644 41491 11789 11701 35310 36607 16020
13462A6020L220L7598p002k7019j8060j3875k815K4748J5276M184l4718j3453
$$ 16020 19240 56838 49836 22817 4757 -9118 -11933 12815 28091 32275 -2443 -15896
13450a5896K0909J8196P267j9763k4370n935K0155R795l10J489j7248L2238K2381
$$ -15896 5013 23209 30476 10713 -13657 -19592 563 10358 10048 11537 -5711 26527 48908
13437D8908j9451K427j9601j3218K1208K0457J2633k5136J673p353N052k5973
$$ 48908 29457 31884 12283 -935 20273 40730 53363 28227 29900 22547 27599 1626
13425A626k8617j2869L6213K9826j6712p808J8300q894j7973q589L4377J9061
$$ 1626 -26991 -39860 -3647 26179 9467 1659 19959 11065 -6908 -15497 18880 37941
13413C7941K889j1118k5954j8424j942j480n458R376J4364j2751L20J5587N649
$$ 37941 40830 29712 3758 -14666 -16608 -18088 -23546 -14170 194 -12557 -12237 3350 8999
13400H999j8229q100K8591J0519J1151J5863R71k2797p608J8845j5050j5907o456
$$ 8999 -9230 -17330 11261 21780 32931 48794 49765 26968 19360 38205 23155 7248 792
13387G92k3519N825J7079J9207j859j2203r171L0169J5325n502R28M2j9128l625
$$ 792 -22727 -16902 177 19384 17525 5322 -3849 26320 41645 36143 37071 37113 17985 14360
13373A4360O832K5468J9941K567M351j0439l1932k5109K7648J7899P748j2411
$$ 14360 21192 46660 66601 69168 73519 63080 31148 6039 33687 51586 59334 46923
13361D6923J1945M572N971L938L938J2986O950q322j0926R836P173K7373L056
$$ 46923 58868 63440 69411 73349 77287 90273 97223 88901 77975 87811 94984 122357 125413
13348A25413Q064o294l7496q928k506k4957k6058J71j1601L2274P408K5226r733
$$ 125413 133477 127183 89687 80759 78253 53296 27238 27409 15808 48082 55490 80716 70983
13335G0983l284o627J813O579L2240k393J408J1884J0490L731k5480m3721P371
$$ 70983 67699 61072 62885 69464 101704 99311 100719 112603 123093 126824 101344 57623 64994
13322F4994K277L358J3250M626j3939m623k127j2100j8132O85J8064J5031L1517
$$ 64994 67271 70629 83879 88505 74566 69943 67816 55716 37584 38269 56333 71364 102881
13309A02881K134M337j556k0872O799j4601k2458j106M783M106R403K4206N7885
$$ 102881 105015 109352 107796 86924 93723 79122 56664 55558 60341 64447 73850 98056 155941
13296A55941j1875l1040Q862J1934k6108l317k570j6280o292K1573J0716j2649
$$ 155941 144066 113026 121888 133822 107714 104397 101827 85547 79255 100828 111544 98895
13284I8895J1862j169j2680M115r811J2057q400k30R642J2742j0319K979r722
$$ 98895 110757 109588 96908 101023 91212 103269 94869 94639 104281 117023 106704 109683 99961
13271I9961k8338o86L110j681L6971J8623k0364Q355j8629k2538j830J8399n518
$$ 99961 71623 70937 74047 72366 109337 127960 107596 115951 97322 74784 72954 91353 85835
13258H5835k4598j4865K3112J8999j0036k498j5442J9949j1874j0035J809j5354
$$ 85835 61237 46372 69484 88483 78447 75949 60507 80456 68582 58547 60356 45002
13246D5002R981M405O992J008p468J364k7167j40j0513J3545p691K5166Q99k9426
$$ 45002 54983 59388 66380 67388 59920 61284 34117 33977 23464 37009 29318 54484 55383 25957
13232B5957k604p603j7068j4173J999L4565O0J0223p114K246n258J0130j274P555
$$ 25957 23353 15750 -1318 -15491 -13492 21073 21133 31356 24242 26488 21230 31360 30086 37641
13218C7641p844k2838N349j221K9756l855N493n62j5535k1385j4690P295J3961
$$ 37641 29797 6959 12308 11087 40843 36988 42481 41919 26384 4999 -9691 -2396 11565
13205A1565o049o381O84K0260J1696J011j4611n234L590j802J0003j4657K578
$$ 11565 5516 -865 -181 20079 31775 32786 18175 12941 16531 14729 24732 10075 12653
13192A2653J3030m637j0415r886j7427N5J5245J6794K1585P600j7925j3598m908
$$ 12653 25683 21046 10631 745 -16682 -16627 -1382 15412 36997 44597 26672 13074 8166
13179H166J1881K3341K1575J5166M257k5480k0632K0380N128K4342q862J4050
$$ 8166 20047 43388 64963 80129 84386 58906 38274 58654 63782 88124 79262 93312
13167I3312K3157K9627J5124j0510o1174n0230k1299R068K1356P114o328q315
$$ 93312 116469 146096 161220 150710 89536 39306 18007 27075 48431 55545 49217 40902
13155D0902l0663p208K5837M0503j0693j0506j0854j9984J6098K1137q341j5614
$$ 40902 10239 3031 28868 69371 58678 48172 37318 17334 33432 54569 46228 30614
13143C0614j8620m217J3479K0130q530J7042K1164j0506k1516O408J3593L4764
$$ 30614 11994 7777 21256 41386 32856 49898 71062 60556 39040 45448 59041 93805
13131I3805m725k1816Q680M692j47j2606K4661P0489Q8242N5190k5711n0102m2611
$$ 93805 89080 67264 75944 80636 80489 67883 92544 163033 251275 306465 280754 230652 188041
13118A88041m3171l4815K2137o499n8627k4039K0518J4200J1135M437k6018p024
$$ 188041 144870 110055 132192 125693 67066 43027 63545 77745 88880 93317 67299 60275
13106F0275K5695j8281k8367J354R514k1294N528J1416P948O030j5099J878J5331
$$ 60275 85970 67689 39322 40676 50190 28896 34424 45840 53788 59818 44719 46597 61928
13093F1928j0863j9442M903L46O673N451K4291K777J9165p805q492J5593m665
$$ 61928 51065 31623 36526 36872 43545 48996 73287 76064 95229 87424 78932 94525 89860
13080H9860J2316M1896Q5514P7582J417m0352l8442k9496m1672l1165k2466j5724
$$ 89860 102176 144072 229586 307168 308585 268233 229791 200295 158623 127458 104992 89268
13068H9268l0397j6794k3904o554j1699n830L2603J8513K301j8627j310M09n001
$$ 89268 58871 42077 18173 11619 -80 -5910 26693 45206 47507 28880 27570 27979 22978
13055B2978P171N917L063j9518O870K2192j8160k207n403K2909J9645K4518l34
$$ 22978 30149 36066 39129 19611 26481 48673 30513 28306 22903 45812 65457 89975 89641
13042H9641j4262j8634j0783K3806J779j3694J7267K3970K2915K6496j451n699
$$ 89641 75379 56745 45962 69768 71547 57853 75120 99090 122005 148501 147050 141351
13030A41351N73k1667l1186o053k0400l7469J1714N295M915J8378l273L476K6073
$$ 141351 141924 120257 89071 83018 62618 25149 36863 42158 47073 65451 62178 65654 91727
13017I1727K2560l6797k708l2313l2963J1041K070O169k436M341L1766m832r069
$$ 91727 114287 77490 74782 42469 9506 20547 22617 28786 26350 30691 62457 57625 48556
13004D8556j9851J0750J0651J508r532k2571j0904K289N341q288J3867P241j4452
$$ 48556 28705 39455 50106 51614 42082 19511 8607 10896 16237 7949 21816 29057 14605
12991A4605k169K5430J9285l7942j3657K4206m662k0355j3353L2732K7488o830
$$ 14605 12436 37866 57151 19209 5552 29758 25096 4741 -8612 24120 51608 44778
12979D4778j4747J083O050O625r285j3963k74J9086j8249l854J759L6285J8815
$$ 44778 30031 31114 37164 43789 34504 20541 20267 39353 21104 17250 19009 55294 74109
12966G4109j7203j1082K9164J7080j7710m512j5159n33P544k6751o814k728J2253
$$ 74109 56906 45824 74988 92068 74358 69846 54687 54154 61698 34947 28133 25405 37658
12953C7658K5222r682j902k7243k0853k4865r839J5066J0159P878L789O308J8129
$$ 37658 62880 53198 51296 24053 3200 -21665 -31504 -16438 -6279 1599 5388 11696 29825
12940B9825J0862L0173M813r25L0823j1915l1288k1813M790j930l600L2485J3268
$$ 29825 40687 70860 75673 74748 105571 93656 62368 40555 45345 43415 39815 72300 85568
12927H5568j1287L87k3731J5445k2628M258l637j4998j9542o708K9783j5855k6827
$$ 85568 74281 74668 50937 66382 43754 48012 44375 29377 9835 3127 32910 17055 -9772
12914i772l97K9155J1987K4726m70K135m3L9073m584k9085J1770R959m3032j6754
$$ -9772 -10169 18986 30973 55699 55229 57364 57321 96394 91810 62725 74495 84454 41422 24668
12900B4668J1203J3797j3402O833J3738j8547k1355J9027K7830m460l2802O949
$$ 24668 35871 49668 36266 43099 56837 38290 16935 35962 63792 59332 26530 33479
12888C3479L131n071K7964J6119l040k795k3331r172J4035P390k835P989k049
$$ 33479 36610 31539 59503 75622 72582 69787 46456 37284 51319 58709 55874 63863 61814
12875F1814j4387J3664j5014l115o819J1997L354j3630P738P640J8540n601j9966
$$ 61814 47427 61091 46077 42962 36143 48140 51494 37864 45602 53242 71782 66181 46215
12862D6215m817j010Q686J4858K7184P571L47N68j8327l1815r359P789n993k064
$$ 46215 41398 40388 49074 63932 91116 98687 99034 99602 81275 49460 40101 47890 41897 39833
12848C9833k5793j3330J7042L256k448K6015O159r827P807K0402M145q497J5912
$$ 39833 14040 710 17752 21008 18560 44575 50734 40907 48714 69116 73261 64764 80676
12835H0676J6373Q362r683N249k0061l6333j5855k777L5264J3216p44n229o518
$$ 80676 97049 105411 95728 100977 80916 44583 28728 25951 61215 74431 73687 68458 61940
12822F1940K2517r390l6070j4120K0746J7966K7097J6161K8344J5512j1084l6250
$$ 61940 84457 75067 38997 24877 45623 63589 90686 106847 135191 150703 139619 103369
12810A03369r469R127n65j3364j7978j2573K0274L9696j543j0618m263j3199k5524
$$ 103369 93900 103027 102462 89098 71120 58547 78821 118517 116974 106356 102093 88894 63370
12797F3370J3719K4841j6071p984j0603j7650j272J5207k602Q063Q383J1180j273
$$ 63370 77089 101930 85859 77875 67272 49622 48350 63557 60955 69018 77401 88581 87308
12784H7308k2791J0018l460K1745j7768Q815K0536o69o64N118J0551l658l3233
$$ 87308 64517 74535 71075 92820 75052 83867 104403 103734 103070 108188 118739 115081 81848
12771H1848k3400k2032j3898j5483K5126K1115q899Q377J4332n160K8720J4964
$$ 81848 58448 36416 22518 7035 32161 53276 44377 52754 67086 61926 90646 105610
12759A05610J2312l2349j0012r821J5043K4498L1418K142J1299j7088j410O160
$$ 105610 117922 85573 75561 65740 80783 105281 136699 138841 150140 133052 131642 137802
12747A37802j5011k998L3061J656P45O829j6563J1208K52j6515j1239k6335k272
$$ 137802 122791 119793 152854 154510 155255 162084 145521 156729 156981 140466 129227 102892 100620
12734A00620j5668K559L7356L6348J2408k621j1681o192J1138J2575k3437K472
$$ 100620 84952 87511 124867 161215 173623 171002 159321 153129 164267 176842 153405 155877
12722A55877l639K091K76O556J6621K0263l892l3351q065J5096J7049l4399r329
$$ 155877 152238 154329 154605 161161 177782 198045 194153 160802 152737 167833 184882 150483 141154
12709A41154J1594L9099J052j7955k035M620Q945P313R797j417O409R567q523
$$ 141154 152748 191847 192899 174944 172909 177529 186474 193787 203584 202167 208576 218143 209620
12696B09620j1998l749J9875M4340L6172n33J0292J5524J4449L0036P9187Q3377
$$ 209620 197622 193873 213748 258088 294260 293727 304019 319543 333992 364028 443215 526592
12684E26592N4930P2755R4777O4806K7242O053j5917k0602k6101l7113k5069k6417
$$ 526592 581522 654277 749054 813860 841102 847155 831238 810636 784535 747422 722353 695936
12672F95936k8545j5121L2041O962l0095k6457j4532k913J828J1735o56k904j3573
$$ 695936 667391 652270 684311 691273 661178 634721 620189 617276 619104 630839 630183 627279 613706
12659F13706k4822p901K903m341j1792l4387k3026J2968L4230J0441M5986L5537
$$ 613706 588884 580983 583886 579545 567753 533366 510340 523308 557538 567979 613965 649502
12647F49502K2335P2021J06311J37858J54455K00607K41127K20257K06521J53007
$$ 649502 671837 743858 850169 988027 1142482 1343089 1584216 1804473 2010994 2164001
12637B164001J8172m7455j04383j62301k25351j89849j81799j64638j37392o4595
$$ 2164001 2182173 2134718 2030335 1868034 1642683 1452834 1271035 1106397 969005 904410
12627I04410m0755l4477J3307J9050J7952k0554j5642k1288k8607k3074j1076
$$ 904410 863655 829178 842485 861535 879487 858933 843291 822003 793396 770322 759246
12616G59246l9807n6821m5867n1960k1188q457j5798J926J3658K3983K4048L631
$$ 759246 719439 662618 616751 564791 543603 535146 519348 521274 534932 558915 582963 586594
12604E86594K527J2404o085J0595L5278N2777O3455L9594N9432L1599o958k4700
$$ 586594 589121 601525 595440 606035 641313 694090 757545 797139 856571 888170 881212 856512
12592H56512n6046p4456o9133o6222o0987o3428l4035l6116l5818m3400j0724
$$ 856512 800466 726010 656877 590655 529668 466240 432205 396089 360271 316871 306147
12581C06147J5625k7367j2443k5410l1031j9785P018k791k7161O674P006j453
$$ 306147 321772 294405 281962 256552 225521 205736 212754 209963 182802 189476 196482 195029
12569A95029j1563r610J871L712N060J1313K7704L185K0233P877J9789j542r548
$$ 195029 183466 173856 175727 179439 184499 195812 223516 226701 246934 254811 274600 273058 263510
12556B63510l2162k5290O742R861j0619k2008J0420Q206RJ2924o435J8270N3805
$$ 263510 231348 206058 212800 222661 212042 190034 200454 208660 208669 221593 215158 233428 287233
12543B87233M0407j4220j4700M680l2126l7912N837Q210o334j7693j8528j8453
$$ 287233 327640 313420 298720 303400 271274 233362 239199 247409 241075 223382 204854 186401
12531A86401r626Q715o398k934n505j8761J5875Q198L94l6847m838O377K8174
$$ 186401 176775 185490 179092 176158 170653 151892 167767 175965 176359 139512 134674 141051 169225
12518A69225L4859J1508O775M519l764J2077l6859j8472k799K4524Q277j3621
$$ 169225 204084 215592 222367 226886 223122 235199 198340 179868 177069 201593 209870 196249
12506A96249K837J6046j092K887L039n097K1063L6229j8336k5713p212L604j9478
$$ 196249 199086 215132 214040 216927 219966 214869 235932 272161 253825 228112 220900 224504 205026
12493B05026l2229j8638K9038K4186K5489L2932K9802J5703R460j6655m5857j175
$$ 205026 172797 154159 183197 207383 232872 265804 295606 311309 320769 304114 258257 257082
12481B57082J7534K5926L772k7221k7461R447n85L267J4148K193K7413K8252Q829
$$ 257082 274616 300542 304314 277093 249632 259079 258494 261761 275909 278102 305515 333767 342596
12468C42596J9095R817q128k2368K618m320j5328K291M886J0115J4077r991k7310
$$ 342596 361691 371508 363380 341012 343630 339310 323982 326273 331159 341274 355351 345360 318050
12455C18050P284L758K7681L7687K5617J3445p833l857Q308O3262M5891n403r948
$$ 318050 325334 329092 356773 394460 420077 433522 425689 421832 430140 493402 539293 533890 523942
12442E23942M429L111M058O827j1612j6684k3652l5607n8599l157J23j175j7682
$$ 523942 528371 531482 535540 542367 530755 514071 490419 454812 396213 393056 393179 392004 374322
12429C74322Q547K1137J4812J499k1970J9826M419k2419j7001m2456n849J6612
$$ 374322 382869 404006 418818 420317 398347 418173 422592 400173 383172 340716 334867 351479
12417C51479L7073L0764M470l445o484Q851M461j0995J547j237k2632k3696n56
$$ 351479 388552 419316 423786 420341 413857 422708 427169 416174 417721 416484 393852 370156 369600
12404C69600J6128Q503K7753K2231L804R098P224M957J7103P699j5293L754j028
$$ 369600 385728 394231 421984 444215 448019 457117 464341 469298 486401 494100 478807 482561 481533
12391D81533P927k1622k4716l9876l6819K912O748j6689l4717K124R427K4436
$$ 481533 489460 467838 443122 403246 366427 369339 376087 359398 324681 326805 336232 360668
12379C60668K5481n142r84J0334L1205L8557j5927l4883J2905N179J4802J5004
$$ 360668 386149 381007 380023 390357 421562 460119 444192 409309 422214 427393 442195 457199
12367D57199l22j464J1213J2582N905M754J3476K2278K6820K9497J4645L397K1720
$$ 457199 456877 455413 466626 479208 485113 489867 503343 525621 552441 581938 596583 599980 621700
12354F21700j6725j6523J9911K5113l7943j7768j2530n3429o2111n3376l2131
$$ 621700 604975 588452 608363 633476 595533 577765 565235 511806 449695 396319 364188
12343C64188n547K6574M6748N3547O8727Q0131P9706L6525J8138M488l09n556
$$ 364188 358641 385215 431963 485510 554237 634368 714074 750599 768737 773225 772916 767360
12331G67360K2936M0652N8008M6423P4889O0370L3207K9631P5108O7549O7338
$$ 767360 790296 830948 888956 935379 1010268 1070638 1103845 1133476 1208584 1276133 1343471
12320A343471N8011O6504P0896O3945O8051M2553L3376J9354O1801M2577N0082
$$ 1343471 1401482 1467986 1538882 1602827 1670878 1713431 1746807 1766161 1827962 1870539 1920621
12309A920621N4741J05039J66607J55522J94823K11229J82577J78999J21192N1575
$$ 1920621 1975362 2080401 2247008 2402530 2597353 2808582 2991159 3170158 3291350 3342925
12299C342925M6039O3250P5643R4529L202m638k9055q1381o8611k302M0037P6512
$$ 3342925 3388964 3452214 3527857 3622386 3625588 3620950 3591895 3510514 3441903 3439601 3479638 3556150
12287C556150Q7545Q4335J25346J14547N0507o8087q7295j10762j53823j24471
$$ 3556150 3643695 3728030 3853376 3967923 4018430 3950343 3863048 3752286 3598463 3473992
12277C473992r3937l8055J0103L8233R7764J11608J23317J49586J69191K38639
$$ 3473992 3380055 3342000 3352103 3390336 3488100 3599708 3723025 3872611 4041802 4280441
12267D280441L14724L61916L84445M59839N87762O51641P30736P46508P29546
$$ 4280441 4595165 4957081 5341526 5801365 6389127 7040768 7771504 8518012 9247558
12258I247558P22679P98229R42798J103023J257400J347821J445182J406284J362031
$$ 9247558 9970237 10768466 11711264 12814287 14071687 15419508 16864690 18270974 19633005
12249A9633005J253068J118073R42450P67183P03839Q36971J234569J943742L070846
$$ 19633005 20886073 22004146 22946596 23713779 24417618 25254589 26489158 28432900 31503746
12240C1503746M589666O539487Q914282J1496143J4236154J6934318J8817972
$$ 31503746 36093412 42632899 51547181 63043324 77279478 94213796 113031768
12233A13031768J8003864J3220013N451090k542390q819306j2557256j3587951
$$ 113031768 131035632 144255645 149706735 147164345 138345039 125787783 112199832
12226A12199832j2370450r739377o758421l924857j542711M80713K238369L729068
$$ 112199832 99829382 90090005 83331584 79406727 77864016 78344729 80583098 84312166
12218H4312166M802673M959165L900635K169519P03022M7787K24643J070921K389479
$$ 84312166 89114839 94074004 97974639 100144158 100847180 100894967 101119610 102190531 104580010
12209A04580010L817966M959280N263042M348377K397965L53466j224033k016805
$$ 104580010 108397976 113357256 118620298 122968675 125366640 125720106 124496073 122479268
12201A22479268j691191k89242K006062M880866Q391468J3069602J9796421K9077174
$$ 122479268 120788077 120498835 122504897 127385763 135777231 148846833 168643254 197720428
12193A97720428M0223610N0248152N3451310M3992762K2517371k552152k3491759
$$ 197720428 237944038 288192190 341643500 385636262 408153633 405601481 382109722
12186C82109722l7386020m3470203m2649460l7466109l0552886k3523616j7024931
$$ 382109722 344723702 301253499 258604039 221137930 190585044 167061428 150036497
12179A50036497j1263196o439797k742244j71222J108974Q17583q09317k967279
$$ 150036497 138773301 132333504 129591260 129420038 130529012 131346595 130537278 127569999
12171A27569999m699554n590185n533233m562323k989223j316003p2596K61879
$$ 127569999 122870445 117280260 111747027 107184704 104195481 102879478 102806882 103068761
12163A03068761n67692k032273l334154m028541m141541l700860k839702j720510
$$ 103068761 102501069 100468796 97134642 93106101 88964560 85263700 82423998 80703488
12155H0703488m00163J453574M084092P593928J1627819J5223920J6779068J4542469
$$ 80703488 80303325 81756899 85840991 93434919 105062738 120286658 137065726 151608195
12147A51608195Q152820m96813q572520j4516250j7900933j8635209j7307861
$$ 151608195 159761015 159264202 150691682 136175432 118274499 99639290 82331429
12140H2331429j4852573j2042086r333714o912393m853040l224601k082061j413836
$$ 82331429 67478856 55436770 46103056 39190663 34337623 31113022 29030961 27617125
12132B7617125j100590r63164r15396r27631r83917j174238j417006j576745j593323
$$ 27617125 26516535 25553371 24637975 23710344 22726427 21552189 20135183 18558438 16965115
12123A6965115j528940j376108j191944r99686r12162q96080q50881q32492p68905
$$ 16965115 15436175 14060067 12868123 11868437 10956275 10060195 9209314 8376822 7607917
12114G607917p15646o46723n66666m94780m11570l42114k88871k30417j50963
$$ 7607917 6892271 6245548 5678882 5184102 4772532 4430418 4141547 3911130 3760167
12105C760167j00557o0950m3967J7177M4190Q8035J35961J63602J52447J18573
$$ 3760167 3659610 3598660 3554693 3571870 3616060 3704095 3840056 4003658 4156105 4274678
12095D274678O5779q140m1001o3673q1925r6190l9101L1020P6565J01083R0001
$$ 4274678 4340457 4332317 4291316 4227643 4145718 4049528 4010427 4041447 4118012 4219095 4309096
12084D309096M2930N01j6076m3384j535L0831m988n9207j75752k42931k81722
$$ 4309096 4352026 4352527 4336451 4293067 4291532 4322363 4317375 4258168 4082416 3839485 3557763
12073C557763k78848k01558j74673j97849j71385j31287j09726r1593r1113o4961
$$ 3557763 3278915 3077357 2902684 2704835 2533450 2402163 2292437 2200844 2109731 2044770
12063B044770m9044l1021l0942l7511n5362m1504p4540n4272n4275n4756m6686
$$ 2044770 1995726 1964705 1933763 1896252 1840890 1799386 1724846 1670574 1616299 1561543 1514857
12052A514857m9846q8111j00932n9560j0801j2811m1923o116K7594J3910K133
$$ 1514857 1465011 1376900 1275968 1216408 1205607 1192796 1150873 1144757 1172351 1186261 1188394
12041A188394K2819J4478K5867K4351K4327k1975p052k4628p7743q3210q9585
$$ 1188394 1211213 1225691 1251558 1275909 1300236 1278261 1271209 1246581 1168838 1085628 996043
12030I96043p3191o6725l8342R706M775K7705L8944N5036P818k0231k0265o4557
$$ 996043 922852 856127 817785 827491 832266 859971 898915 953951 961769 941538 921273 856716
12018H56716o9798m3564k7294n0715n0779l7703o677J1847L942l254k0479j9924
$$ 856716 786918 743354 716060 665345 614566 576863 570186 582033 585975 582721 562242 542318
12006E42318j0421j1751j6347J2973j2269l9610k3321j064K662L475j169P190
$$ 542318 531897 520146 503799 516772 504503 464893 441572 440508 443170 446645 445476 452666
11994D52666p875O273N065l9363m7169k5439k7274m7524j9017k3173O568O5751
$$ 452666 444791 451064 456129 416766 369597 344158 316884 269360 250343 227170 233738 299489
11982B99489J3944l4280n19m576r559R934j7128N877j7082Q253P791k5046l5606
$$ 299489 313433 279153 278634 274058 264499 274433 257305 263182 246100 254353 262144 237098 201492
11969B01492k1558l3461Q007N963J3166j5164j2646k269J5190Q913j459N065R333
$$ 201492 179934 146473 154480 160443 173609 158445 145799 143530 158720 167633 166174 171239 180572
11956A80572n108k4100k2935j3098l2938J809L1551K2151p214l5715k452m93j2518
$$ 180572 175464 151364 128429 115331 82393 84202 115753 137904 130690 94975 92523 92030 79512
11943G9512L1766K8865k843L922O593O596o967m948m197J820K1051m037M545K5136
$$ 79512 111278 140143 137300 141222 147815 154411 147444 142496 138299 140119 161170 157133 161678 186814
11929A86814j9449l5610j9767K0833J3780j094k922j0317p676j804J7350K3244
$$ 186814 167365 131755 111988 132821 146601 145507 142585 132268 124592 122788 140138 163382
11917A63382k7389l0715k963r732j0703K0010K725m975q110j565m625M450j3372
$$ 163382 135993 105278 102315 92583 81880 101890 104615 99640 91530 89965 85340 89790 76418
11904G6418p12O351J9078j6489r674K2603O170k8065k860J5438j8185l5564J229
$$ 76418 75706 82057 101135 84646 74972 97575 103745 75680 72820 88258 70073 34509 35738
11891C5738K9452k000L490J4655J6663O11N401J4842k1513k6362J5742J1438J3950
$$ 35738 65190 63190 66680 81335 97998 98609 104010 118852 97339 70977 86719 98157 112107
11878A12107K035j7j8638n094j6320j3819j025j1546j6660J9186k794K916j1576
$$ 112107 114142 114125 95487 90393 74073 60254 59229 47683 31023 50209 47415 50331 38755
11865C8755o541J677J3530J8448L1441N60P88l7730j2823J4700K3460J8959k984
$$ 38755 32214 33891 47421 65869 97310 97870 98658 60928 48105 62805 86265 105224 102240
11852A02240j8518k0202j6153P229L7179J0807Q587J1508P418m171k241k094M352
$$ 102240 83722 63520 47367 54596 91775 102582 111169 122677 130095 125924 123683 121589 125941
11839A25941j5690J0922L6113j9669n4928j1340j0621j1342O361R540O593P536
$$ 125941 110251 121173 157286 137617 82689 71349 60728 49386 55747 65287 71880 79416
11827G9416j395N41K1788J476j6761k8394j6129L4203r219L4371K3541l607m3756
$$ 79416 78021 78562 100350 101826 85065 56671 40542 74745 65526 99897 123438 119831 76075
11814G6075K58K482k2905N2971K1371n548j8280R578J2946j5078k1173j7978o24
$$ 76075 76333 78815 55910 108881 130252 124704 106424 116002 128948 113870 92697 74719 74095
11801G4095O659L8018K0399J9910l4435r024K8966j2925m1297q252K5930L5345
$$ 74095 80754 118772 139171 159081 124646 115622 144588 131663 90366 82114 108044 143389
11789A43389J2687j0683O466J4067L0848L8068M4430K8123N4751J05763J11311
$$ 143389 156076 145393 151859 165926 196774 234842 279272 307395 362146 467909 579220
11778E79220P6427O8489M9591K3504K768l8372o5944p2399k7209m3313n8867k9883
$$ 579220 655647 724136 773727 797231 799999 761627 695683 623284 596075 552762 493895 464012
11766D64012j06J3809p023l0568j0840K8163o054k054K1707L1303L1701J5555
$$ 464012 463906 477715 470692 440124 429284 457447 451393 449339 471046 502349 534050 549605
11754E49605M8608M7534L3375J4135K186K2142L3586M4230N35p767k5020j8219
$$ 549605 598213 645747 679122 693257 695443 717585 751171 795401 795936 788169 763149 744930
11742G44930l059J7020Q0874J19959J68460J97992K42103K15827J86460J20136
$$ 744930 741871 758891 839765 959724 1128184 1326176 1568279 1784106 1970566 2090702
11732B090702M1353m2972j22221k06892k16908k04782k06336j93118j43104r4461
$$ 2090702 2132055 2089083 1966862 1759970 1543062 1338280 1131944 938826 795722 701261
11722G01261n8491p4322q1501l7581J587K4150J9090p773J1532R171r056Q885
$$ 701261 642770 568448 486947 449366 450953 475103 494193 486420 497952 507123 498067 506952
11710E06952r380R992M204j7067p423J4394L5578K7861Q186L2708P199k7141k6570
$$ 506952 497572 507564 511768 494701 487278 501672 537250 565111 573297 606005 613204 586063 559493
11697E59493m059j2012J5786O1319P5351P3596K7862r312m9909n5871o6938o2313
$$ 559493 555434 543422 559208 620527 695878 769474 797336 788024 738115 682244 615306 552993
11685E52993o4362q1514r2729o9859j9446l0008k2876k0543p111l1527m9488k516
$$ 552993 488631 407117 314388 244529 225083 195075 172199 151656 144545 113018 63530 61014
11673F1014k1953o65J5482j5831J0040K0515k6702l542k7068m3827o042L5206
$$ 61014 39061 38396 53878 38047 48087 68602 41900 38358 11290 -32537 -38579 -3373
11661c373n710o393J3719M0128J4917j4945K801o239p767k008o736j4281R010
$$ -3373 -9083 -15476 -1757 38371 53288 38343 41144 34905 27138 25130 18394 4113 13123
11648A3123L929j6279j5067K135M822p150o433J3667J1392l085R440j3031P212
$$ 13123 17052 773 -14294 -12159 -7337 -14487 -20920 -7253 4139 1054 10494 -2537 4675
11635D675J516m643l0577k3026J6326J4431K590j055j9292M894k821q640K2460
$$ 4675 6191 1548 -29029 -52055 -35729 -21298 -18708 -19763 -39055 -34161 -36982 -45622 -23162
11622b3162R392q344K253N56l841j2794k3859J9103K5425O098l2131k35k08J6513
$$ -23162 -13770 -22114 -19861 -19305 -23146 -35940 -59799 -40696 -15271 -9173 -41304 -41539 -41747 -25234
11608b5234J1605j4002J4214J2278l1761j2524j4449n242Q139p4L4495j7187N975
$$ -25234 -13629 -27631 -13417 -1139 -32900 -45424 -59873 -65115 -56976 -57050 -22555 -39742 -33767
11595c3767J1429J4267j1584N944j0311N994J263J8482J1845j4775l801J0099
$$ -33767 -22338 -8071 -19655 -13711 -24022 -18028 -16765 1717 13562 -1213 -5014 5085
11583E085j4655k8087l234J8486R677R747m786j5741K5185L1555k7169j1415k473
$$ 5085 -9570 -37657 -40891 -22405 -12728 -2981 -7767 -23508 1677 33232 6063 -5352 -7825
11570g825l1831k5656J4216K4978j286L4594j5304n4338j5469O840K1933Q007
$$ -7825 -39656 -65312 -51096 -26118 -27404 7190 -8114 -62452 -77921 -71081 -49148 -41141
11558d1141J4001O392J2110j459q967K8070J4184l991L644l5408j6284q666R937
$$ -41141 -27140 -20748 -8638 -10097 -19064 9006 23190 19199 22843 -12565 -28849 -37515 -27578
11545b7578R671j8788j6034N964K946j4607K4381K2887O315o110J3759K0268k9742
$$ -27578 -17907 -36695 -52729 -46765 -43819 -58426 -34045 -11158 -4843 -10953 2806 23074 -6668
11532f668o596j0787j9467J1892k3260k904M630J3655K5745k3356k3887N383K421
$$ -6668 -13264 -24051 -43518 -31626 -54886 -57790 -53160 -39505 -13760 -37116 -61003 -55620 -53199
11519e3199K2282Q668J5521r667n320K3384M330m800J5701p131Q322k917j2577
$$ -53199 -30917 -22249 -6728 -16395 -21715 1669 5999 1199 16900 9769 18091 15174 2597
11506B597k3167j1181l919k5270r13L2124K4649P713j5426j62l437k0909j7417
$$ 2597 -20570 -31751 -35670 -60940 -61853 -29729 -5080 2633 -12793 -12955 -16392 -37301 -54718
11493e4718K421K2379J3719K8957o676k1641K659j3611p790L464J0766L1793N181
$$ -54718 -52297 -29918 -16199 12758 6082 -15559 -12900 -26511 -34301 -30837 -20071 11722 16903
11480A6903n122l9600O011O883M111m291N98J8818j4496Q469p030r191n23j2108
$$ 16903 11781 -27819 -21808 -14925 -10814 -15105 -14507 4311 -10185 -1716 -8746 -17937 -18460 -30568
11466c0568p20M292K3412J7128R013K0561k629l0097k0090n456j7205k8039j508
$$ -30568 -31288 -26996 -3584 13544 22557 43118 40489 10392 -9698 -15154 -32359 -60398 -61906
11453f1906L647J1897J0078o115L606P853q627O128j0919k7045K3826R020J6833
$$ -61906 -58259 -46362 -36284 -42399 -38793 -30940 -39567 -33439 -44358 -71403 -47577 -38557 -21724
11440b1724K1768k2889j2588K596K065j78K0852J7790j054o820J3293p624j8865
$$ -21724 44 -22845 -35433 -32837 -30772 -30950 -10098 7692 6638 -182 13111 5487 -13378
11427a3378l2463N610K8932J0398j2077l105J5527j4565k401K3963J4043K188
$$ -13378 -45841 -40231 -11299 -901 -12978 -16083 -556 -15121 -17522 6441 20484 22672
11415B2672L725q773J4661O491j6142o66o298K3816j574j452j1439k4942k1349
$$ 22672 26397 17624 32285 38776 22634 21968 15670 39486 37912 36460 25021 79 -21270
11402b1270K996P620L112J192J6801j780J0530n668m013J6746j8506k7188k107
$$ -21270 -18274 -10654 -7542 -6350 10451 8671 19201 13533 9520 26266 7760 -19428 -21535
11389b1535q909k0492l992K191K928P604P222j8916J0047L2360R106j7420n550
$$ -21535 -30444 -50936 -54928 -52737 -49809 -42205 -34983 -53899 -43852 -11492 -2386 -19806 -25356
11376b5356K0630P077l2374K0253q424j6937J5601M2730o197j8965r927j6877
$$ -25356 -4726 2351 -30023 -9770 -18194 -35131 -19530 23200 17003 -1962 -11889 -28766
11364b8766k2141Q26J4895Q162m432j1631J6018K796q842k4998J6352K4178K5889
$$ -28766 -50907 -50081 -35186 -27024 -31456 -43087 -27069 -24273 -33115 -58113 -41761 -17583 8306
11351H306J6074K603j0955k0196o459j3734o809K6538J2501N004j7569j6850j1260
$$ 8306 24380 26983 16028 -4168 -10627 -24361 -31170 -4632 7869 12873 -4696 -21546 -32806
11338c2806j2365j614K3758L5619J95R938L232k7626q752j2825J4669J4418J2246
$$ -32806 -45171 -46785 -23027 12592 12787 22725 25957 -1669 -10421 -23246 -8577 5841 18087
11325A8087j2501j5595J9092M921k7701j4887K1786J6565q054j3112R699P365
$$ 18087 5586 -10009 9083 14004 -13697 -28584 -6798 9767 1713 -11399 -1700 5665
11313E665j2545K39p690m2838J2135L7305Q744P158p817K493k179K1224J704m0074
$$ 5665 -6880 -6641 -14331 -57169 -45034 -7729 1015 8173 356 2849 670 21894 23598 -16476
11299a6476l5169P526K4065J5474J5591j3995m760K7392k5133k2418L1590J4175
$$ -16476 -51645 -44119 -20054 -4580 11011 -2984 -7744 19648 -5485 -27903 3687 17862
11287A7862j2734K3364K6554k9133k0575l2705l0982K985M3145M9052Q164l678
$$ 17862 5128 28492 55046 25913 5338 -27367 -58349 -55364 -12219 36833 44997 41319
11275D1319k0915l9896j0719L5535J2863J2235j6642m4691q065K0159Q063Q548
$$ 41319 20404 -19492 -30211 5324 18187 30422 13780 -30911 -38976 -18817 -10754 -2206
11263b206p897r330k113l332p265K0597m27N591R795j4148j1700O360J4263J5901
$$ -2206 -10103 -19433 -21546 -24878 -32143 -11546 -11973 -6382 3413 -10735 -22435 -16075 -1812 14089
11249A4089J025j1490k329j2019K0105k408j2341n638j317k416j518n226l624
$$ 14089 15114 3624 1295 -10724 9381 6973 -5368 -11006 -12323 -14739 -16257 -21483 -25107
11236b5107j2878O475K7950j433P040J1551M030K4784R647q780j3731k7234k9897
$$ -25107 -37985 -31510 -3560 -4993 2047 13598 17628 42412 52059 43279 29548 2314 -27583
11223b7583q26J930O640j820n689J1467k071p700j6687k478j4232n979L2193K1518
$$ -27583 -28409 -26479 -19839 -21659 -27348 -15881 -17952 -25652 -42339 -44817 -59049 -65028 -32835 -11317
11209a1317J5299J3350j2855m894L557j1501N207j3276K4852K533r809m110J7306
$$ -11317 3982 17332 4477 -417 3140 -8361 -3154 -16430 8422 10955 1146 -2964 14342
11196A4342L2814j8719l9766O353J0048K4736k3613m2136J1921M284r274K4863
$$ 14342 47156 28437 -11329 -4976 5072 29808 6195 -35941 -24020 -19736 -29010 -4147
11184d147P765j6740r743J2022P688l226q556J1799K522k2339K4613j5510j0314
$$ -4147 3618 -13122 -22865 -10843 -3155 -6381 -14937 -3138 -616 -22955 1658 -13852 -24166
11171b4166K0247j6040k8354R688L210k4715j4519l666K2576p02k1228o048m94
$$ -24166 -3919 -19959 -48313 -38625 -35415 -60130 -74649 -78315 -55739 -56441 -77669 -83717 -84211
11158h4211K8008M3706J9819Q639Q649r934j2938k9853o486P035l410p063n527
$$ -84211 -56203 -12497 7322 15961 24610 14676 1738 -28115 -34601 -27566 -30976 -38039 -43566
11145d3566L1786K5243K8402R73l769l4929k6571j18J0106j083k6388j5937j5950
$$ -43566 -11780 13463 41865 42838 39069 4140 -22431 -22549 -12443 -13526 -39914 -55851 -71801
11132g1801L3762P780j1252j4634J440k2797M356K4309M197Q093k578k1496j8635
$$ -71801 -38039 -30259 -41511 -56145 -54705 -77502 -73146 -48837 -44640 -36547 -39125 -60621 -79256
11119g9256o486L9309N0753k192r882r215P583K3274r571j3949j7559o138K7961
$$ -79256 -85742 -46433 4320 2128 -7754 -16969 -9386 13888 4317 -9632 -27191 -33329 -5368
11106e368J9929k5193k2014Q435o25j4788L649Q058J1351m166J356j5189k1564
$$ -5368 14561 -10632 -32646 -24211 -24836 -39624 -35975 -27917 -16566 -20732 -19376 -34565 -56129
11093e6129l341P864N821L5857O146k3846p546O974K3564M1391R032r131K9246
$$ -56129 -59470 -51606 -45785 -9928 -3782 -27628 -35174 -28200 -4636 36755 45787 36656 65902
11080F5902P456k0964j9843k8090L025n55k1778k3744J3780J6280k8407p490K4702
$$ 65902 73358 52394 32551 4461 7486 6931 -14847 -38591 -24811 -8531 -36938 -44428 -19726
11067a9726M2176L4867M413j1887j4759q698Q6j2936r787j3030J7855l304l522
$$ -19726 22450 57317 61730 49843 35084 26386 26472 13536 3749 -9281 8574 5270 1748
11054A748J1441K000m330j1134M89J4455O13k9224j5380r305K416J5433j694J5922
$$ 1748 13189 15189 10859 -275 214 14669 15282 -13942 -29322 -38627 -36211 -20778 -22472 -6550
11040f550R783j2420p978M995p217J4260J5385j8229L0453J0868l3875k1196k90
$$ -6550 3233 -9187 -17165 -12170 -19387 -5127 10258 -7971 22482 33350 -525 -21721 -22011
11027b2011o747p904J6585M448o909J2810J4337K0370M174N590k9747j0872m544
$$ -22011 -28758 -36662 -20077 -15629 -22538 -9728 4609 24979 29153 34743 4996 -5876 -10420
11014a0420J5963J3255j8936O985L231j8657j2176n776L0082J6777j5272J6627
$$ -10420 5543 18798 -138 6847 10078 -8579 -20755 -26531 3551 20328 5056 21683
11002B1683j2965j2411J458L806M80k0209K670j1397L388L4381J234j5215l5796
$$ 21683 8718 -3693 -2235 1571 2051 -18158 -15488 -26885 -23497 10884 12118 -3097 -38893
10989c8893J897R912J5060L2345j4547k3446j0573J7309L5150p440q293P088K9422
$$ -38893 -36996 -27084 -12024 20321 5774 -17672 -28245 -10936 24214 16774 8481 15569 44991
10976D4991j2410r853j4513q373r053O668n002Q667K1747J9191k168o701R038
$$ 44991 32581 22728 8215 -158 -9211 -2543 -7545 1122 22869 42060 39892 33191 42229
10963D2229J6033l289k1734j8967O652J8303j5257j1502J2221j207k2139k671
$$ 42229 58262 54973 33239 14272 20924 39227 23970 12468 24689 23482 1343 -1328
10951a328J8047J5350K687P288k0754m936r965k566k3356J5713L8166p220j1447
$$ -1328 16719 32069 34756 42044 21290 16354 6389 3823 -19533 -3820 34346 27126 15679
10938A5679q221J8151J4059j9187j0370k082L474M202P761k2307j3901M268J4181
$$ 15679 7458 25609 39668 20481 10111 8029 11503 15705 23466 1159 -12742 -8474 5707
10925E707k5599Q227j2198p193N023J0288K2911J6545M256P591J1851k4271m816
$$ 5707 -19892 -11665 -23863 -31056 -26033 -15745 7166 23711 27967 35558 47409 23138 18322
10912A8322Q912R357j8290l3875L6898K6127L951j3864l5964j3976R6L005J3032
$$ 18322 27234 36591 18301 -15574 21324 47451 51402 37538 1574 -12402 -12306 -9301 3731
10899C731K903M563J1240l21Q785j769j2720m243M574l321o996k1171o538L5373
$$ 3731 6634 11197 22437 22116 30901 29132 16412 12169 16743 13422 6426 -14745 -21283 14090
10885A4090J0262k1659l8237R954M5871k4348j4983q730L7020L1491k2936j8675
$$ 14090 24352 2693 -35544 -25590 20281 -4067 -19050 -27780 9240 40731 17795 -880
10873h80q019j5601k1146J1050J5283J8151M0834o90j5307k3931l100L40n599
$$ -880 -8899 -24500 -45646 -34596 -19313 -1162 39672 38982 23675 -256 -3356 -3016 -8615
10860h615J6148o688k0288n386j5269o176L295K8449l027J4628J2807J8340J7376
$$ -8615 7533 845 -19443 -24829 -40098 -46274 -42979 -14530 -17557 -2929 9878 28218 45594
10847D5594j8192j5261L2550N051m361O854j7840J4116n785K542j8411j1949p955
$$ 45594 27402 12141 44691 49742 45381 52235 34395 48511 42726 45268 26857 14908 6953
10834F953L167K1800k3489K913J4867J0074K114Q616R233j5859l3236L342J3894
$$ 6953 10120 31920 8431 11344 26211 36285 38399 47015 56248 40389 7153 10495 24389
10821B4389p595Q511J3308j6435q649n880M690P69J582j457J0098N081K6066O198
$$ 24389 16794 25305 38613 22178 13529 7649 12339 13108 14690 13233 23331 28412 54478 60676
10807F0676L893j9373J2480j778q11j1804L270m628N91j1192j8070k4140l149
$$ 60676 64569 45196 57676 55898 55087 43283 46553 41925 42516 31324 13254 -10886 -14035
10794a4035j0647J219O734M314K6518P255n641K229J1273n36j0449j0812J2917
$$ -14035 -24682 -23463 -16729 -12415 14103 21358 15717 17946 29219 28683 18234 7422 20339
10781B0339J3960l0043J7702l809l676q095M785j7887N887r481M503j0954k4986
$$ 20339 34299 4256 21958 18149 14473 6378 11163 -6724 -837 -10318 -5815 -16769 -41755
10768d1755K0476J8293K0723J0899l9683j2287J9083J8023J1356j559k2414k4635
$$ -41755 -21279 -2986 17737 28636 -11047 -23334 -4251 13772 25128 23569 1155 -23480
10756b3480L3988M1142j5316K3770K4025r652l0224m31J4778j6675k0745K7017
$$ -23480 10508 51650 36334 60104 84129 74477 44253 43822 58600 41925 21180 48197
10744D8197J270r152p748j983J2317P906j5899L0609Q197j0916M350j2076k7305
$$ 48197 49467 40315 32567 30584 42901 50807 34908 65517 73714 62798 67148 55072 27767
10731B7767p150J787J5104k00J2498j5433J0395P908k0016K0934j1066P241J6646
$$ 27767 20617 22404 37508 37308 49806 34373 44768 52676 32660 53594 42528 49769 66415
10718F6415J4850J448n449j005j0364l831j44l1911K1845J2700j0356j5217j2798
$$ 66415 81265 82713 77264 76259 65895 62064 61920 30009 51854 64554 54198 38981 26183
10705B6183p831j5354k3819j4236J8416K7825J5502j4981r090R454O777J9412
$$ 26183 18352 2998 -20821 -35057 -16641 11184 26686 11705 2615 12069 18846 38258
10693C8258k2760l9670K0366j1412M715P127J0533J7151j8410j3501L3258j091
$$ 38258 15498 -24172 -3806 -15218 -10503 -3376 7157 24308 5898 -7603 25655 24564
10681B4564j2177o663R247N24o307L423K0882J8730J2534k898M345j5619j7751
$$ 24564 12387 5724 14971 15495 9188 12611 33493 52223 64757 61859 66204 50585 32834
10668C2834o131N600r365j3273N347K4359J3564m107M518J502O503J7591R138
$$ 32834 26703 32303 22938 9665 15012 39371 52935 48828 53346 54848 61351 78942 88080
10655H8080j3076j6753k3659p261J0282j0453J5210j813M362O840l747K229o040
$$ 88080 75004 58251 34592 27331 37613 27160 42370 40557 44919 51759 48012 50241 44201
10642D4201j4731J3649J9745J1594K228l3462L849N845P322j4487j4082Q375O640
$$ 44201 29470 43119 62864 74458 76686 43224 47073 52918 60240 45753 31671 40046 46686
10629D6686J66N123J0224k3347Q539J668L6180J3989l358l2074p103K3378O269
$$ 46686 46852 51975 62199 38852 47391 49059 85239 99228 95870 63796 56693 80071 86340
10616H6340j2382k7170l393L070J9606O890j9289J8966K3580j349k6318j2215
$$ 86340 73958 46788 43395 46465 66071 72961 53672 72638 96218 94869 68551 56336
10604E6336j2819q099K7807J1389M69j726k041O485j6647k1652K3196J1270l162
$$ 56336 43517 35418 63225 74614 75083 73357 71316 77801 61154 39502 62698 73968 70806
10591G0806L722p681k5160r325L6499K2821K2975K4680R414R537m3458m5866k2223
$$ 70806 74528 66847 41687 32362 68861 91682 114657 139337 148751 158288 114830 68964 46741
10578D6741J8275J2322n74j1827j4821j1971p080K421K4060N293j4612l7318K1427
$$ 46741 65016 77338 76764 64937 50116 38145 31065 33486 57546 62839 48227 10909 32336
10565C2336K5418J0148J2776L207L973p730J7286J0220m763k5054j401j2446J2396
$$ 32336 57754 67902 80678 83885 87858 80128 97414 107634 102871 77817 76416 63970 76366
10552G6366K9290J0113j765m089j1979J052J2523q818l8118l7623o85K6016Q504
$$ 76366 105656 115769 114004 109915 97936 98988 111511 102693 64575 26952 26267 52283 60787
10539F0787n412J2021K297J019k2880k644J1468K6763J4075l2142j058q177J1110
$$ 60787 55375 67396 69693 70712 47832 45188 56656 83419 97494 65352 64294 56117 67227
10526F7227p734j2828q103J33J3001J4129m49P036j3916k1579P730k649n220r98
$$ 67227 59493 46665 38562 38695 51696 65825 65376 72412 58496 36917 44647 41998 36778 35780
10512C5780j9582K1731J3686m821K178P151j5670J3679O292k9629L0144K5068
$$ 35780 16198 37929 51615 46794 48972 56123 40453 54132 60424 30795 60939 86007
10500H6007J0274K659j4211K356J678j5685n22N594k3544J923j4123l1661J3960
$$ 86007 96281 98940 84729 87085 88763 73078 72556 78150 54606 56529 42406 10745 24705
10487B4705L432J0117p289J2187J5187k143j4617r992J7889J2064J1794P748k4677
$$ 24705 28137 38254 30965 43152 58339 56196 41579 31587 49476 61540 73334 81082 56405
10474E6405j8392J051J180J7988J3360K233k0596L058n549L925J7533j3531J853
$$ 56405 38013 39064 40244 58232 71592 73825 53229 56287 50738 54663 72196 58665 60518
10461F0518K4534J207l3566j6904q978J0364J5251J3431P424j6771j6837j3028
$$ 60518 85052 86259 52693 35789 26811 37175 52426 65857 73281 56510 39673 26645
10449B6645O77J2784m703J26k428O52J7009J913j3005j9754p123K1895k3566q522
$$ 26645 27322 40106 35403 35529 33101 33753 50762 52675 39670 19916 12793 34688 11122 2600
10435B600J644J7413J6552K822p055j5702J0996K0258J1366J2850m497q911J8321
$$ 2600 4244 21657 38209 41031 33976 18274 29270 49528 60894 73744 69247 60336 78657
10422G8657J4424l4097M005J6539p218l5232p882o788J6070N3103J1820m310k2751
$$ 78657 93081 58984 62989 79528 72310 37078 29196 22408 38478 91581 103401 99091 76340
10409G6340j4416j0254J9877M3328J4777j685k3169j5403m357j5823J7748J1770
$$ 76340 61924 51670 71547 114875 129652 127967 104798 89395 85038 69215 86963 98733
10397I8733P11p963Q615L129j8260k3649j787L012j0135J1091J1668j07J0408
$$ 98733 99444 91481 100096 103225 84965 61316 59529 62541 52406 63497 75165 75058 85466
10384H5466m763K824K0848k6589j9436R353l456M756K1135J5663R994j5916l7949
$$ 85466 80703 83527 104375 77786 58350 67703 64247 69003 90138 105801 115795 99879 61930
10371F1930J4309K1141K9573n651q232R289j1537m026J4136j4880j8746P916l357
$$ 61930 76239 97380 126953 121302 113070 122359 110822 106796 120932 106052 87306 95222 91865
10358I1865j2838j9793j622j4889J635K3061L8811J879j1992j0473l565p947L102
$$ 91865 79027 59234 57612 42723 44358 67419 106230 108109 96117 85644 82079 74132 77234
10345G7234j1213J6827O59j8037J6820J7501j815K3670R326J0834j7663j888q977
$$ 77234 66021 82848 83507 65470 82290 99791 97976 121646 130972 141806 124143 122255 113278
10332A13278j3231r045p083J4975J1989n397J2182M499l1783r497q819j5397N236
$$ 113278 100047 91002 83919 98894 110883 105486 117668 122167 90384 80887 72068 56671 61907
10319F1907K6641P643j0357J4639J498L500o013j6841K3190L2948q110j500J5239
$$ 61907 88548 96191 85834 100473 101971 105471 99458 82617 105807 138755 130645 129145 144384
10306A44384P256q110m952J905k59m856K856j9025L161k5958J3919J2967M730
$$ 144384 151640 143530 138578 140483 140224 135368 138224 119199 122360 96402 110321 123288 128018
10293A28018j7474Q824J0990k1998j6964J0075j49q680J9379J002K7959M38k3851
$$ 128018 110544 119368 130358 108360 91396 101471 101322 92642 112021 113023 140982 141420 117569
10280A17569k0883K4699L884p161l433J2052o426j3224k0731K2729M436P05m844
$$ 117569 96686 121385 125269 118108 114675 126727 120301 107077 86346 109075 113511 114216 109372
10267A09372k933J9319K2987J1633j8821p988q732j846K932l910m930k779M1854
$$ 109372 106439 125758 148745 160378 141557 133569 124837 122991 125923 122013 117083 114304 156158
10254A56158J1984r302j1321j299J6324J5500j5781K821R696k2619k0869J9306
$$ 156158 168142 158840 147519 146220 162544 178044 162263 165084 174780 152161 131292 150598
10242A50598K557n890R689J3376j80o286J8545L8014M3923l3364m4293q041Q400
$$ 150598 153155 147265 156954 170330 170150 163864 182409 220423 264346 230982 186689 178648 187048
10229A87048J7688J3432J2437j732J4778o96K6504L1003K8030M0790L4164M7191
$$ 187048 204736 218168 230605 228873 243651 242955 269459 300462 328492 369282 403446 450637
10217D50637Q141j5699j15k712l3133m6883k8749j0355N94k9826m7102l6382J1485
$$ 450637 458778 443079 442964 440252 407119 360236 331487 321132 321726 291900 244798 208416 219901
10204B19901N281k488j4673o291J3242J4865K190k938j3647p253L134n767l992
$$ 219901 225182 222694 208021 201730 214972 229837 232027 229089 215442 208189 211323 205556 201564
10191B01564K2391J2151N0447K9621J1711P5440O8117J2145J6939M2219Q9315
$$ 201564 223955 236106 286553 316174 327885 403325 471442 483587 500526 542745 632060
10180F32060J13298J14550J43033J30743Q0824M1119J3073j5159k6540r5018j26022
$$ 632060 745358 859908 1002941 1133684 1214508 1255627 1268700 1253541 1227001 1131983 1005961
10169A005961j02734j01729r1423q6207n3437l2445l4735l9504p4226m1794k7750
$$ 1005961 903227 801498 710075 623868 570431 537986 503251 463747 389521 347727 319977
10158C19977r99j6014J3278q22n772j7276J1137J5630R810J06j032K5565M9735
$$ 319977 318978 302964 316242 315420 309648 292372 303509 319139 328949 329055 328023 353588 403323
10145D03323M6853M4090N3361M1046O4105J05038J30907J24047J91194K15528
$$ 403323 450176 494266 547627 588673 652778 757816 888723 1012770 1203964 1419492
10135A419492K01853J36135J04739M9124n394p4381j36466j61934j81454j75737
$$ 1419492 1621345 1757480 1862219 1911343 1905949 1831568 1695102 1533168 1351714 1175977
10125A175977j75909j41003r9750r2543o6823m8397k3139l3619m0332l7637L335
$$ 1175977 1000068 859065 759315 666772 599949 551552 528413 494794 454462 416825 420160
10114D20160r205k2628O421q587n3995o566P205j1757j7357j9006J5637M4902
$$ 420160 410955 388327 394748 386161 332166 325600 332805 321048 303691 284685 300322 345224
10102C45224N4417L6613L4467O2175N2543N4867R2653R2010J49211J71464J57527
$$ 345224 399641 436254 470721 532896 585439 640306 732959 824969 974180 1145644 1303171
10091A303171J46596O1631j7329n3390r1287j26040j46183j43169j12971j10213
$$ 1303171 1449767 1511398 1494069 1440679 1349392 1223352 1077169 934000 821029 710816
10081G10816j04612p9550n7363n7580k7380q895k5463l1340l2882k3234k3385
$$ 710816 606204 526654 469291 411711 384331 375436 349973 318633 285751 262517 239132
10070B39132l676l00K6193R061k0189k3943J3512j0754j4785N578J2370O123J1930
$$ 239132 235456 235156 261349 270410 250221 226278 239790 229036 214251 219829 232199 238322 250252
10057B50252L0290K4601p732J4968J3297L5608O0424P0947O6609M2471J4356j6717
$$ 250252 280542 305143 297411 312379 325676 361284 421708 492655 559264 601735 616091 599374
10045E99374o8017n0760l2574l8476m0443k0702r111j7479l2789o1443j9390m727
$$ 599374 531357 480597 448023 409547 369104 348402 339291 321812 289023 227580 208190 203463
10033B03463K2446k1540l3547K0546M890j0933l418J6177J5645q446J9179P502
$$ 203463 225909 204369 170822 191368 196258 185325 181907 198084 213729 205283 224462 231964
10021B31964k2461l1691J6603K0666Q899P204K6129L2977K2399L1458N477k4440
$$ 231964 209503 177812 194415 215081 223980 231184 257313 290290 312689 344147 349624 325184
10009C25184l4367K065j0782l5773j5340l631R818K648L4663K3820r663l319K5451
$$ 325184 290817 292882 282100 246327 230987 227356 237174 239822 274485 298305 288642 285323 310774
9996C10774m137N37J8434J9624K6990J5607P143p249J4438n187L5068j0285l0287
$$ 310774 306637 307174 325608 345232 372222 387829 394972 387723 402161 396974 432042 421757 391470
9983C91470j3664k7269k2734j3072K1931J9136R613P468L2970L3449K2974M7458
$$ 391470 377806 350537 327803 314731 336662 355798 365411 372879 405849 439298 462272 509730
9971E09730P0776L7538k248j6429l0715j9556l1551o4354k8547m485q885J7532
$$ 509730 580506 618044 615796 599367 568652 549096 517545 453191 424644 420159 411274 428806
9959D28806K6335q649l3794m875L213J6553L510K4431M3632j8844m1533l389J1436
$$ 428806 455141 446492 412698 407823 411036 427589 431099 455530 499162 480318 438785 435396 446832
9946D46832J5790k2528j3616O65j897K8644Q392l4618l1544P765J3549N055J585
$$ 446832 462622 440094 426478 427143 425246 453890 462282 427664 396120 403885 417434 422489 424074
9933D24074J3297L5256P910K3392L398j8173N748K4961m525J1767O697J4870K1386
$$ 424074 437371 472627 480537 503929 507327 489154 494902 519863 515338 527105 533802 548672 570058
9920E70058Q268j0191l8659k7687Q091j1874n0465l4646j5643l6311k2113L6720
$$ 570058 578326 568135 529476 501789 509880 498006 447541 412895 397252 360941 338828 375548
9908C75548J8747L149J6060J2255q613k337J1659K6121K486k988K6208K5439j5152
$$ 375548 394295 397444 413504 425759 417146 414809 426468 452589 455075 452087 478295 503734 488582
9895D88582J0260J7626K9350K8742J1875J5810K5440P229j2059J2711J7284K5812
$$ 488582 498842 516468 545818 574560 586435 602245 627685 634914 622855 635566 652850 678662
9883F78662p922R577J0242J9793K0300L005j3610l3915o8778n1954n2037l7828
$$ 678662 670740 680317 690559 710352 730652 733657 720047 686132 617354 565400 513363 475535
9871D75535l6147l4073j1049L5654O9686O4606M6120Q0464N4766L7016O3799K8580
$$ 475535 439388 405315 394266 429920 499606 564212 610332 690796 745562 782578 846377 874957
9859H74957J9640J9215K9819L0265R352o286J5302M3244O9241M8133M2065O2381
$$ 874957 894597 913812 943631 973896 983248 976962 992264 1035508 1104749 1152882 1194947 1257328
9847A257328O5218O3730J00047R1732Q4521Q0522O8879O0954P9231M4220M1303
$$ 1257328 1322546 1386276 1486323 1578055 1662576 1743098 1811977 1872931 1952162 1996382 2037685
9836B037685J18249J23754R8930J17556J18785J29592K18495K71238K65368K61778
$$ 2037685 2155934 2279688 2378618 2496174 2614959 2744551 2963046 3234284 3499652 3761430
9826C761430J98498J92483K52118L57765M30173M10458K83264R8008J7004l354
$$ 3761430 3959928 4152411 4404529 4762294 5192467 5602925 5886189 5984197 6001201 5997847
9816E997847L1737J31969J77180J07134q0735j93716k38926k29255j74242j07779
$$ 5997847 6029584 6161553 6338733 6445867 6365132 6171416 5932490 5703235 5528993 5421214
9806E421214L5657J80626L25252M74428O58182R04172J085221J173591J206430
$$ 5421214 5456871 5637497 5962749 6437177 7095359 7999531 9084752 10258343 11464773
9797A1464773J116587Q01151M22491J36916l7134j56479l68167n97970p56970
$$ 11464773 12581360 13382511 13805002 13941918 13904784 13748305 13380138 12782168 12025198
9788A2025198p15381o49041n34966m56718l83117k87513j66878l035J64847L50224
$$ 12025198 11309817 10660776 10125810 9669092 9285975 8998462 8831584 8828549 8993396 9343620
9778I343620M72553O07528P81342R82471J213294J356910J555747J829781K223961
$$ 9343620 9816173 10423701 11205043 12187514 13400808 14757718 16313465 18143246 20367207
9769B0367207K782051L592536M678404O079983P764013R697758J2086138J5119263
$$ 20367207 23149258 26741794 31420198 37500181 45264194 54961952 67048090 82167353
9761H2167353J8758146K1741221K0733667J3241794K582280o470094j2399328
$$ 82167353 100925499 122666720 143400387 156642181 159224461 152754367 140355039
9754A40355039j5355382j6001796j4888150j2584338r624243o439864l334674
$$ 140355039 124999657 108997861 94109711 81525373 71901130 65461266 62126592
9747F2126592k72883K951238O467317R787064J1982059J2668219J2221751J0724158
$$ 62126592 61853709 64804947 71272264 81059328 93041387 105709606 117931357 128655515
9739A28655515Q144158N817866M970207M942476M207144K314993l89532l824559
$$ 128655515 136799673 142617539 147587746 152530222 156737366 159052359 158662827 154838268
9731A54838268p224825q964722q565338p061663n311914l232896l40346L565236
$$ 154838268 147613443 138648721 130083383 123021720 117709806 114476910 114136564 117701800
9723A17701800Q752432J5414918K3426179L2857622M4365926N7420471O2944838
$$ 117701800 126454232 141869150 165295329 198152951 242518877 299939348 362884186
9716C62884186M5094065R283551k0545450l9344495m8558535m8790085m3418677
$$ 362884186 407978251 417261802 396716352 357371857 308813322 260023237 216604560
9709B16604560l5713413k7457710j9505071j2482344o862669k711913N90581L880649
$$ 216604560 180891147 153433437 133928366 121446022 114583353 111871440 112462021 116342670
9701A16342670O808060Q431032Q505466P258487M618221J256276r70041j397386
$$ 116342670 123150730 131581762 140087228 147345715 151963936 153220212 152250171 150852785
9693A50852785j439501k552397n041397q362665j1738957j3849872j3961691j2473230
$$ 150852785 149413284 146860887 141819490 133456825 121717868 107867996 93906305 81433075
9685H1433075j0042722p206858m297084j500143J318431M195136P049249R779107
$$ 81433075 71390353 64183495 59886411 58386268 59704699 63899835 70949084 80728191
9677H0728191J2645693J5739068J7659628J5591028P756551k756071j1033515
$$ 80728191 93373884 109112952 126772580 142363608 150120159 147364088 136330573
9670A36330573j5904162j7650927j6976235j5109908j2827204j0453606q266741
$$ 136330573 120426411 102775484 85799249 70689341 57862137 47408531 39141790
9663C9141790o475389n009917l894598l045950k440326j909913j508479j240821
$$ 39141790 32666401 27656484 23761886 20715936 18275610 16365697 14857218 13616397
9655A3616397j051156q93450p21968o34122m84852k98469j51159o5470O0229J57454
$$ 13616397 12565241 11671791 10949823 10315701 9830849 9532380 9381221 9315751 9375980 9533434
9645I533434K10939L08435M91386O90274P67503O95243O06510N44052M05859J45911
$$ 9533434 9744373 10052808 10544194 11234468 12001971 12697214 13303724 13847776 14253635 14399546
9635A4399546k11815n27822q34916j009357j072188j052881r28628p76336n88052
$$ 14399546 14187731 13659909 12824993 11815636 10743448 9690567 8761939 7985603 7397551
9626G397551m44761l31912j32289l6892O4449J21503J69640J93609J80300J36591
$$ 7397551 6952790 6620878 6488589 6451697 6516146 6637649 6807289 7000898 7181198 7317789
9616G317789R7542R4057J51885K01646K14482J62817M9104o2185j59637k26906
$$ 7317789 7415331 7509388 7661273 7862919 8077401 8240218 8289322 8227137 8067500 7840594
9606G840594k08326j31425j19443j64881k23511k62494k21797j74512j47547j14693
$$ 7840594 7632268 7500843 7381400 7216519 6993008 6730514 6508717 6334205 6186658 6071965
9596F071965j44312j62144j33353j25233q9379q0794p6605o8388q5367j30741
$$ 6071965 5927653 5765509 5632156 5506923 5417544 5336750 5260145 5191757 5106390 4975649
9586D975649j15942j50699j29323j19499j24312j27903j11043j11297r3307r1090
$$ 4975649 4859707 4709008 4579685 4460186 4335874 4207971 4096928 3985631 3892324 3801234
9576C801234p5419q3667j15286j14306r2566n9673p0212p3058p7772m9587n5584
$$ 3801234 3725815 3642148 3526862 3412556 3319990 3260317 3190105 3117047 3039275 2989688 2934104
9565B934104m5322k7501l7003j7852o7119j16557j29821j07051j21440j04707
$$ 2934104 2888782 2861281 2824278 2806426 2739307 2622750 2492929 2385878 2264438 2159731
9555B159731q1675r5865r7504o1945k2385j3967j5340m0312l1715k6479l8381
$$ 2159731 2078056 1982191 1884687 1822742 1800357 1786390 1771050 1730738 1699023 1672544 1634163
9544A634163p378j6954m7917p9069o9561j0369k0761j9648k9182o1427o5975l9688
$$ 1634163 1626785 1609831 1561914 1482845 1413284 1402915 1382154 1362506 1333324 1271897 1205922 1166234
9532A166234o8063l2007k7987l8369o726r796J6162n349q534m961j7118k875j5248
$$ 1166234 1098171 1066164 1038177 999808 993082 983286 999448 994099 985565 980604 963486 960611 945363
9519I45363j499j4260l1051m8784l4741l7124o7299l4762l5985l1676p941L9451
$$ 945363 943864 929604 898553 849769 815028 777904 710605 675843 639858 608182 600241 639692
9507F39692J2832j6707n078P259j4559j9594J128j153l9981j1426J8609n152L493
$$ 639692 652524 635817 630739 637998 623439 603845 604973 603820 563839 552413 571022 565870 569363
9494E69363K226j7000m8130J2470q032k1809p464L860j7374k3999n660j8920m228
$$ 569363 571589 554589 506459 518929 510897 489088 481624 485484 468110 444111 438451 419531 415303
9481D15303J2596J4118K5519j9613k9669l4055K9080k108j3731r225o806n941
$$ 415303 427899 442017 467536 447923 418254 384199 413279 411171 397440 388215 381409 375468
9469C75468k3066r736j1561O166j5907J675L7848k4267j1764l317j1857j0378
$$ 375468 352402 342666 331105 337271 321364 323039 360887 336620 324856 321539 309682 299304
9457B99304j0148J1819L350j1338O677R78l088J935R389j434l076j7772J4341
$$ 299304 289156 300975 304325 292987 299664 300642 297554 299489 308878 307444 304368 286596 300937
9444C00937J2738k6704l5342m1604N936r071l3206O406K433J323J9628J4945K1113
$$ 300937 313675 286971 251629 210025 215961 206890 173684 180090 182523 183846 203474 218419 239532
9431B39532L0543J2330j7821j3445n417k099J9561k183k8877m4083j4895J6077
$$ 239532 270075 282405 264584 251139 245722 243623 263184 261001 232124 188041 173146 189223
9419A89223K4999J434K392j158K1213K5751r548l5214j5997j1683o209K0840K8858
$$ 189223 214222 215656 218048 216890 238103 263854 254306 219092 203095 191412 185203 206043 234901
9406B34901N927j3726J602j4676k5576M079J2929L235O818M714r788k9153n508
$$ 234901 240828 227102 228704 214028 188452 192531 205460 208695 215513 220227 210439 181286 175778
9393A75778J0091Q718j0113q378J9283N193k4692J8965L3902K4973L5956Q2736
$$ 175778 185869 194587 184474 176096 195379 200572 175880 194845 228747 253720 289676 372412
9381C72412O6998M9837L3496L6828N565q957j6531m0031o7631m3441l8990m3554
$$ 372412 439410 489247 522743 559571 565136 556179 539648 499617 431986 388545 349555 306001
9369C06001j9867j3889j7619k4553k2050N418M800N50k4829J0817M1496N195q000
$$ 306001 286134 272245 254626 230073 208023 213441 218241 218791 193962 204779 246275 251470 243470
9356B43470l2565k9374J6227L741K1694J6218J4844M150J6845L8941N1171M3853
$$ 243470 210905 181531 197758 201499 223193 239411 254255 258405 275250 314191 365362 409215
9344D09215L1170N7127P3772Q6064J00642J53522J45665J41713J45277J41927
$$ 409215 440385 497512 571284 657348 757990 911512 1057177 1198890 1344167 1486094
9334A486094Q4611j5604q9862j54049j90699j40718j51912j10121j01537j19572
$$ 1486094 1570705 1555101 1465239 1311190 1120491 979773 827861 717740 616203 496631
9324D96631m5159l0349n3895n2537j8587J4236r613j2626J7205O365j7345k3167
$$ 496631 451472 421123 367228 314691 296104 310340 300727 288101 305306 311671 294326 271159
9312B71159o085J7928R155M700J447J1426L1304K4740R528L1294P2641Q2361J05516
$$ 271159 265074 283002 292157 296857 298304 309730 341034 365774 375302 406596 479237 561598 667114
9299F67114J07736J44618J81654J79510K00504K18708J68253P0940j7737q0346
$$ 667114 774850 919468 1101122 1280632 1481136 1699844 1868097 1939037 1921300 1840954
9289A840954j48507j85204j92250k15042j84332j56641j38334p6998o7529p6145
$$ 1840954 1692447 1507243 1314993 1099951 915619 758978 620644 543646 476117 399972
9279C99972n6400j6667m3164k9955o118j1515l511r506p015R11j6866j2570J7716
$$ 399972 343572 326905 283741 253786 247668 236153 232642 223136 216121 217032 200166 187596 205312
9266B05312J2339n673R287j2430J9048M4830N3046J7299M4033N6041R0943R6272
$$ 205312 217651 211978 221265 208835 227883 272713 325759 343058 387091 443132 534075 630347
9254F30347J26757J52499J06072O1234K9249J4423P271l2588j15236j29959j27346
$$ 630347 757104 909603 1015675 1076909 1106158 1120581 1127852 1095264 980028 850069 722723
9243G22723j16779q5885q5568o0936n7347n9155j9935m4874k5896k3662P229q634
$$ 722723 605944 520059 434491 373555 316208 257053 237118 192244 166348 142686 149915 141281
9231A41281k7580o762j046k6077j6554M93k7602k6882K4353L4623J7759k0768
$$ 141281 113701 106939 105893 79816 63262 63755 36153 9271 33624 68247 86006 65238
9219F5238k0544J1664K058L4253K2474Q691L218K7862L8406M5317L3504j1237
$$ 65238 44694 56358 58416 92669 115143 123834 127052 154914 193320 238637 272141 260904
9207B60904l7556j361j0756j2692l9424j2392m940m2354l2844p720q028r036k38
$$ 260904 223348 221987 211231 198539 159115 146723 141783 99429 66585 58865 50837 41801 41563
9194D1563m933L60k2276r224J5067q38j9380o417M240o69j0764p887J4855L97
$$ 41563 36630 36990 14714 5490 20557 19719 339 -6078 -1838 -2507 -13271 -21158 -6303 -5906
9180e906P033M094N117L416j6429r169J3645O938o958J639K2552J4589j1284l7528
$$ -5906 1127 5221 10338 13754 -2675 -11844 1801 8739 1781 3420 25972 40561 29277 -8251
9166h251o24N716L1836J4932k3357r523J5984M804k8333k3264j6872M709L5573
$$ -8251 -8875 -3159 28677 43609 20252 10729 26713 31517 3184 -20080 -36952 -32243 3330
9153C330j2423k0496L1163K7450K6804l0128k1238n061n435j585j5709K1818J3802
$$ 3330 -9093 -29589 1574 29024 55828 25700 4462 -599 -6034 -7619 -23328 -1510 12292
9140A2292p106l034j1334M617J0630k9205p433k350J551Q724o874Q458q055j3680
$$ 12292 5186 2152 -9182 -4565 6065 -23140 -30573 -32923 -31372 -22648 -29522 -21064 -29119 -42799
9126d2799L922l02L565n277J0969M184J7419N710l1400k5042P803K1119K0272
$$ -42799 -38877 -39179 -35614 -40891 -29922 -25738 -8319 -2609 -34009 -59051 -51248 -30129 -9857
9113i857n883o524J7521M581k75R209R88J2568J188N117K135J0600j1843k0181
$$ -9857 -15740 -22264 -4743 -162 -437 8772 9760 22328 23516 28633 30768 41368 29525 9344
9099I344J12N500p309K4806K6319j2318k1919j5666j3566J3686m616j4531N507
$$ 9344 9456 14956 7647 32453 58772 46454 24535 8869 -4697 8989 4373 -10158 -4651
9086d651J8669o565j5041j7736n146N561K783L7698K1234l380J720l2870k4980
$$ -4651 14018 7453 -7588 -25324 -30470 -24909 -22126 15572 36806 33426 35146 2276 -22704
9073b2704m573j446j467N387n31J5834r934j1601K882M090q54J6586J1307j8917
$$ -22704 -27277 -28723 -30190 -24803 -25334 -9500 -19434 -31035 -28153 -24063 -24917 -8331 2976 -15941
9059a5941n651j3265J2783k679n151R387j937j3763j0752l226K134j49N110K7913
$$ -15941 -21592 -34857 -22074 -24753 -29904 -20517 -22454 -36217 -46969 -50195 -48061 -48210 -43100 -15187
9045a5187K2849k3769L400P405l4603L063J0519l069N701l2365m890K8915J9451
$$ -15187 7662 -16107 -12707 -5302 -39905 -36842 -26323 -29392 -23691 -56056 -60946 -32031 -12580
9032a2580J6368M543l1896k5762l153K332M3279K8580k2045P876J3747k1753l2968
$$ -12580 3788 8331 -23565 -49327 -52480 -50148 -6869 21711 -334 7542 21289 -464 -33432
9019c3432p038O437J3283p482K875J1985j154n847L3978P983L408J0098o710j0432
$$ -33432 -40470 -34033 -20750 -28232 -25357 -13372 -14526 -20373 13605 21588 24996 35094 28384 17952
9005A7952j2229k7943p115j774R192n634K0898L3808J6715l593k663j9544k7999
$$ 17952 5723 -22220 -29335 -31109 -21917 -27551 -6653 27155 43870 40277 37614 18070 -9929
8992i929l285k7798q711J3798K1977L6158K1379j3423K030j4060k1924M245n12
$$ -9929 -13214 -41012 -49723 -35925 -13948 22210 43589 30166 32196 18136 -3788 457 -55
8979e5N763q7L7k0733Q03m518K510r923R832L786j8849J6333K4519j4846j7161
$$ -55 5708 5621 5658 -15075 -14272 -18790 -16280 -26203 -16371 -12585 -31434 -15101 9418 -5428 -22589
8964b2589j5377j5637m223K239J7771J3883k026J4327j0781Q412L9042M306j4781
$$ -22589 -37966 -53603 -57826 -55587 -37816 -23933 -25959 -11632 -22413 -14001 25041 29347 14566
8951A4566j3327J2923J7884o626J7484j0759K020l692n310k428L3213L3504K8244
$$ 14566 1239 14162 32046 25420 42904 32145 34165 30473 25163 22735 55948 89452 117696
8938A17696L504m383P61J3530K3584J8899L7441N7920J37003J93953L27571M08533
$$ 117696 121200 116817 117578 131108 154692 173591 211032 268952 405955 599908 927479 1336012
8926A336012K79511J0699j72066k53424l06557k44266j89471j48399q7434m1168
$$ 1336012 1615523 1626222 1454156 1200732 894175 649909 460438 312039 224605 183437
8916A83437l7648j8782l9587j3645L2417k0900l9947k704k721j2788P506j6621
$$ 183437 145789 127007 87420 73775 106192 85292 45345 42641 39920 27132 34638 18017
8904A8017J7935K3065M69R76n054J4213N015J0265j2072J0095N1240K1276L733
$$ 18017 35952 59017 59486 60462 55408 69621 74636 84901 72829 82924 134164 155440 159173
8891A59173L4140K6974O2831Q7316J08546J49580K49864M28045O90387P96674
$$ 159173 193313 220287 283118 370434 478980 628560 878424 1306469 1996856 2793530
8881B793530M13841j25240l74965n00644n45186m69536l32694k46836j90237j17549
$$ 2793530 3207371 3082131 2707166 2206522 1661336 1191800 859106 612270 422033 304484
8871C04484o5320m6221m5418j4985l1898k0837M515l927l30k4012j1393k0327
$$ 304484 239164 192943 147525 132540 100642 79805 84320 80393 80063 56051 44658 24331
8859B4331m443R949l558j9498K669L7078J6143K6021J5761N559l072j46R116Q030
$$ 24331 19888 29837 26279 6781 9450 46528 62671 88692 104453 110012 106940 106794 115910 123940
8845A23940J1456J3465J5673N0015Q9314J18468K51600L93909L73624J43987j12543
$$ 123940 135396 148861 164534 214549 303863 422331 673931 1067840 1441464 1585451 1472908
8834A472908k25307k91625k47415j98211j19160r7504n2147n8005l2717n0873
$$ 1472908 1247601 955976 708561 510350 391190 293686 241539 183534 150817 99944
8824I9944k8177o008J1511N989l3299j2064J3459j4595k8953j4608K1083J8179
$$ 99944 71767 65759 77270 83259 49960 37896 51355 36760 7807 -6801 14282 32461
8812C2461R84k0835j9454j1202P926l916J2815R290j2189j91k3019p893K2261
$$ 32461 33445 12610 -6844 -18046 -10120 -14036 -1221 8069 -4120 -4311 -27330 -35223 -12962
8799a2962R699j1035J6926J0425l773p06J9907K699J5283n567l0290k8142J448
$$ -12962 -3263 -14298 2628 13053 9280 8574 28481 31180 46463 40896 10606 -17536 -16088
8786a6088R475R370J9873R234j7786m7387l4556R242K3045K8103K825j5311K581
$$ -16088 -6613 2757 22630 31864 14078 -33309 -67865 -58623 -35578 -7475 -4650 -19961 -17380
8773a7380j5788N404M3180r443k1336P111L830K7106K238j0934J6948J374O053
$$ -17380 -33168 -27764 15416 5973 -15363 -8252 -4422 22684 24922 13988 30936 32310 38363
8760C8363p424p680O673q900j0706J947R751o073l8721j3628N766K8080N527j1036
$$ 38363 30939 23259 29932 21032 10326 12273 22024 15951 -22770 -36398 -30632 -2552 2975 -8061
8746h061k0777K106j663J0787q704j2512J3408J9870J4784l0647p016q041j7234
$$ -8061 -28838 -26732 -28395 -17608 -26312 -38824 -25416 -5546 9238 -21409 -28425 -36466 -53700
8733e3700k3201l804L225J5318J607o6L98K7633K7110J724q45j0050N501R066
$$ -53700 -76901 -80705 -77480 -62162 -60555 -60621 -60223 -32590 -5480 -3756 -4601 -14651 -9150 -84
8719h4j998j6534o617j4907N547J5852K8408J0894Q846j5553j7158K5762N617
$$ -84 -2082 -18616 -25233 -40140 -34593 -18741 9667 20561 29407 13854 -3304 22458 28075
8706B8075j0238J185o961l3358j5947R207l3027j395L7995R164j1613J3872M1945
$$ 28075 17837 19022 12061 -21297 -37244 -28037 -61064 -62459 -24464 -15300 -26913 -13041 28904
8693B8904n760k3463m258R896j2220j5218j4541J4363K100K632P499R656K571
$$ 28904 23144 -319 -4577 5319 -6901 -22119 -36660 -22297 -20197 -17565 -10066 -410 2161
8680B161P737J3460N662j6466k0018m634J3613q1J636K5440R013o860r887k3905
$$ 2161 9898 23358 29020 12554 -7464 -12098 1515 1434 3070 28510 37523 30663 20776 -3129
8666c129j2504L911r912k0330J7409J5638J2943j8609J3038K8149q358j3769r764
$$ -3129 -15633 -11722 -21634 -41964 -24555 -8917 4026 -14583 -1545 26604 18246 4477 -5287
8653e287j8840L2898K7676O556j3950j5294R801k06j347Q052N679j1400L774L895
$$ -5287 -24127 8771 36447 43003 29053 13759 23560 23354 22007 30059 35738 24338 28112 32007
8639C2007k0924j5653N509o780j7080J9873L209N143l769k0747M149J2540K9309
$$ 32007 11083 -4570 939 -5841 -22921 -3048 161 5304 1535 -19212 -15063 -2523 26786
8626B6786n256j5872J9250k1165j3634J0628J5267J7972K6682K2026J3217K8592
$$ 26786 21530 5658 24908 3743 -9891 737 16004 33976 60658 82684 95901 124493
8614A24493O2107M4209N0812q991m5534n8940n0036l1661j1r992j4454l3431k5284
$$ 124493 186600 230809 281621 272630 227096 168156 118120 86459 86448 76456 62002 28571 3287
8601C287k2299j7960J7966K3844m4J8466o78j2627J8423R379j3084p096J518K9664
$$ 3287 -19012 -36972 -19006 4838 4794 23260 22582 9955 28378 37757 24673 17577 19095 48759
8587D8759K2889j8602k6896O11J7067j3569Q542P783J1452R278p210j4391l790
$$ 48759 71648 53046 26150 26761 43828 30259 38801 46584 58036 67314 60104 45713 41923
8574D1923K53K0566N9070P6557O7488J13182J50646O1879l936m9428r5072r4222
$$ 41923 42176 62742 121812 198369 265857 379039 529685 591564 587628 538200 443128 348906
8562C48906o5111n8323n1888l5347k2535l4478R252Q874j6036l6066j306J3815
$$ 348906 283795 225472 173584 138237 115702 81224 90476 99350 83314 47248 45942 59757
8550E9757l22j6981j4107j676j9226j8870N273J382p591P413M0144J2150J1437
$$ 59757 59435 42454 28347 26671 7445 -11425 -6152 -4770 -12361 -4948 35196 47346 58783
8537E8783k082l4148j5606K1526J6703j8578j4652j8190k19L099J2420K8198J631
$$ 58783 56701 22553 6947 28473 45176 26598 11946 -6244 -6463 -3364 9056 37254 38885
8524C8885N7892J06273N8967K8726k4470o0011n8791l4754j6063j7165l7804m0315
$$ 38885 96777 203050 262017 290743 266273 206262 147471 112717 96654 79489 41685 1370
8512A370n600p502n357P002K7970J4575k2708M438j634j9493n808o025J5096J9212
$$ 1370 -4230 -11732 -17089 -10087 17883 32458 9750 14188 12554 -6939 -12747 -18772 -3676 15536
8498A5536M955j2322k7499j9862J0361K2976K6028j3164l4024r892R236J188k725
$$ 15536 20491 8169 -19330 -39192 -28831 -5855 20173 7009 -27015 -36907 -27671 -26483 -29208
8485b9208K792j6767p045L601K846r182J5862L0411J6599K4626n550l1940k2764
$$ -29208 -26416 -43183 -50228 -46627 -43781 -52963 -37101 -6690 9909 34535 28985 -2955 -25719
8472b5719k78K642L6209J3891K2432J8078k6862l0231O440j702j5507k2713j2729
$$ -25719 -25997 -23355 12854 26745 49177 67255 40393 10162 16602 14900 -607 -23320 -36049
8459c6049R041J581l996k4708r762O089L3818P10j495o079K126J4191J4336O738
$$ -36049 -27008 -25427 -29423 -54131 -63893 -57804 -23986 -23276 -24771 -30850 -28724 -14533 -197 6541
8445F541Q793O08J2729o797l0369k0083K3091L7702J896j3789M936j3642J3694
$$ 6541 15334 15942 28671 21874 -8495 -28578 -5487 32215 34111 20322 25258 11616 25310
8432B5310k135p869k0807j8467n139K0903J3591k3215k2661K587O850q207k9398
$$ 25310 23175 15306 -5501 -23968 -29107 -8204 5387 -17828 -40489 -37902 -31052 -39259 -68657
8419f8657L569K5088J3289n096j6100L713K1235K1006k312Q659J9789j8375l274
$$ -68657 -65088 -40000 -26711 -31807 -47907 -44194 -22959 -1953 -4265 4394 24183 5808 2534
8406B534k0187k0464q023J0788J3673L239O312k4636K106K0978M400j8488L275
$$ 2534 -17653 -38117 -46140 -35352 -21679 -18440 -12128 -36764 -34658 -13680 -9280 -27768 -24493
8393b4493J5515J1565P236m78j4302L834Q742j8840n95k365J9302J109O564K9474
$$ -24493 -8978 2587 9823 9345 -4957 -1123 7619 -11221 -11816 -14181 5121 6230 12794 42268
8379D2268j5724n7059o563L2092j8130o601J1410J9023J8785m4817k9569k005
$$ 42268 26544 -30515 -37078 -4986 -23116 -29717 -18307 716 19501 -25316 -54885 -56890
8367e6890J9610o758P593J9534J6326m787q218o121J1050J2301l274k2139q519
$$ -56890 -37280 -44038 -36445 -16911 -585 -5372 -13590 -19711 -8661 3640 366 -21773 -30292
8354c0292k2818K02L2017M496m273j0888Q932n05l1129k033J8140J2111L1316
$$ -30292 -53110 -52908 -20891 -16395 -20668 -31556 -22624 -23129 -54258 -56291 -38151 -26040 5276
8341E276p655j2905j1597L5807j599k9858Q331M158k2048o282J6845P15j0863
$$ 5276 -2379 -15284 -26881 8926 7327 -22531 -14200 -10042 -32090 -38372 -21527 -20812 -31675
8328c1675J8810K1936j9103j7992j0220L47K0067J4362L023J12O667k34j9300
$$ -31675 -12865 9071 -10032 -28024 -38244 -37897 -17830 -3468 -445 -333 6334 6100 -13200
8315a3200o213k0605O284J6701K8823m280n638m387k3757J408o914j588J8485
$$ -13200 -19413 -40018 -33734 -17033 11790 7510 1872 -2515 -26272 -24864 -31778 -33366 -14881
8302a4881M6635J6059k9722o587J2620n88m0212r391l127J2033j4973p505L1412
$$ -14881 31754 47813 18091 11504 24124 23536 -16676 -26067 -29194 -17161 -32134 -39639 -8227
8289h227N979l0522K4246L6781N373m1027j0417J3784K5814J1169m2550l5852
$$ -8227 -2248 -32770 -8524 28257 33630 -7397 -17814 -4030 21784 32953 -9597 -45449
8277d5449k0471k571J4148J4142j502j8593o314J4717J9755j2320j0170j3102
$$ -45449 -65920 -68491 -54343 -40201 -41703 -60296 -66610 -51893 -32138 -44458 -54628 -67730
8265f7730p54K5413J7210Q597j0349j8236L0792L1089j6079m1933o814Q474J6391
$$ -67730 -68484 -43071 -25861 -17264 -27613 -45849 -15057 16032 -47 -41980 -48794 -40320 -23929
8252b3929L5643J0647Q198j0399l073j693j6884k4677P500j4838Q121L5173j4085
$$ -23929 11714 22361 30559 20160 17087 15394 -1490 -26167 -18667 -33505 -25384 9789 -4296
8239d296j3815l0875j0068J9124L7350K897j7322j4422j0973Q259J0875M891O222
$$ -4296 -18111 -48986 -59054 -39930 -2580 317 -17005 -31427 -42400 -34141 -23266 -18375 -12153
8226a2153L6554J3800j298l2820j7634L2357o521j7863k2350k3433K2828Q379
$$ -12153 24401 38201 36903 4083 -13551 18806 12285 -5578 -27928 -51361 -28533 -20154
8214b0154K6994K8914L207p74o444j1065n6581k7568J0220O993L563K3408K4719
$$ -20154 6840 35754 38961 38187 31743 20678 -35903 -63471 -53251 -46258 -42695 -19287 5432
8201E432K851Q694P968k3800k1521K4013M16j3561k1487L147P431j0418k6990
$$ 5432 8283 16977 24945 1145 -20376 3637 4053 -9508 -30995 -27848 -20417 -30835 -57825
8188e7825M39K4353J1399n384k8698m597K7817K2576L055J3031j4474k7666j2911
$$ -57825 -57386 -33033 -21634 -27018 -55716 -60313 -32496 -9920 -6865 6166 -8308 -35974 -48885
8175d8885J7944O849J6999J2975K866n847l452J3856k856l773k2958R465K4032
$$ -48885 -30941 -24092 -7093 5882 8748 2901 -551 13305 10449 6676 -16282 -6817 17215
8162A7215J751j6728J057n397J0804q576J053L2537j2888q079R389j4887j9083
$$ 17215 18966 2238 3295 -2102 8702 126 1179 33716 20828 12749 22138 7251 -11832
8149a1832j9802n284l906q02J4587j3729k5732j8386N807K4686K4295O627K3700
$$ -11832 -31634 -36918 -40824 -41626 -27039 -40768 -66500 -84886 -79079 -54393 -30098 -23471 229
8136B29K1561J613q804k2614j0946N300M184l511K6371J7410j9460l1913J0893
$$ 229 21790 23403 14599 -8015 -18961 -13661 -9477 -12988 13383 30793 11333 -20580 -9687
8123i687l184j1497J8652q580K226q028j7415K700J3309P285p368K9248l624R85
$$ -9687 -12871 -24368 -5716 -14296 -12070 -20098 -37513 -34813 -21504 -14219 -21587 7661 4037 5022
8109E022k1706k076J6016j2110n211m646l622L2773J7927r434N240Q868J3366
$$ 5022 -16684 -18760 -2744 -14854 -20065 -24711 -28333 4440 22367 12933 18173 27041 40407
8096D0407n703P837J5536l0911k2404j5317n409L716J8423M615j8531n416O873
$$ 40407 34704 42541 58077 27166 4762 -10555 -15964 -12248 6175 10790 -7741 -13157 -6284
8083f284o143L624J0341j0186K085L9397j8127l0412j6112j7065K7800O188n785
$$ -6284 -12427 -8803 1538 -8648 -6563 32834 14707 -15705 -31817 -48882 -21082 -14894 -20679
8070b0679p555P748J553J2597k0505J2490k4375j5705J1543K083N213M46R760
$$ -20679 -28234 -20486 -18933 -6336 -26841 -14351 -38726 -54431 -42888 -40805 -35592 -35146 -25386
8057b5386L7629P8M02j3663r172K2918J3402j4640J1247K4533K4530j1298j0288
$$ -25386 12243 12321 12723 -940 -10112 12806 26208 11568 22815 47348 71878 60580 50292
8044E0292o347j9578k1689j7994n546J6406K705J0897J0802m058J0295P559k366
$$ 50292 43945 24367 2678 -15316 -20862 -4456 -1751 9146 19948 15890 26185 33744 31378
8031C1378r985J17Q737j5364l166J0298j4485n588J114k722r082o982J603M945
$$ 31378 21393 21510 30247 14883 11717 22015 7530 1942 3056 334 -8748 -15730 -14127 -9182
8017i182M350R694q825J4388p051q713J3720K6114P236K4031P342k0043k6045
$$ -9182 -4832 4862 -3963 10425 3374 -5339 8381 34495 41731 65762 73104 53061 27016
8004B7016l2416L053K3372K259k3416K0890L0371P389j5849j331Q217r286k2659
$$ 27016 -5400 -2347 21025 23284 -132 20758 51129 58518 42669 41338 49555 40269 17610
7991A7610l056J8941j830j0440k1156j4733K0376R042N594p934k518M413J961
$$ 17610 14554 33495 31665 21225 69 -14664 5712 14754 20348 12414 9896 14309 16270
7978A6270j3939p65n287l281R891m927K004j8666l3444r583J4957R512N253J8874
$$ 16270 2331 1566 -3721 -7002 2889 -2038 -34 -18700 -52144 -61727 -46770 -37258 -32005 -13131
7964a3131L3809n523K123j1700p40K0403P441M996j4561l9324k7555R282J5203
$$ -13131 20678 15155 17278 5578 4838 25241 32682 37678 23117 -16207 -43762 -34480 -19277
7951a9277J3746j0941L823J5977k0899k3965K4582J4009J7439q361K3353n927
$$ -19277 -5531 -16472 -12649 3328 -17571 -41536 -16954 -2945 14494 6133 29486 23559
7939B3559j1533m076l0444j5755K8633J1477J0007L7151j739k1586j0828J9006
$$ 23559 12026 7950 -22494 -38249 -9616 1861 11868 49019 47280 25694 14866 33872
7927C3872R886j4311j177j6443J2030J0695R406j2173k4366l668N5255M765j9089
$$ 33872 43758 29447 28270 11827 23857 34552 43958 31785 7419 3751 59006 63771 44682
7914D4682j4382k969n752j4488k8796J5836J1268o777l663L465K9381j0528o957
$$ 44682 30300 27331 21579 7091 -21705 -5869 5399 -1378 -5041 -1576 27805 17277 10320
7901A0320m259K637k0101L749R335q837j8916J5472j1573m551K9821J3697K0022
$$ 10320 6061 8698 -11403 -7654 1681 -7156 -26072 -10600 -22173 -26724 3097 16794 36816
7888C6816J6250K879k0941P201j3979j8991p287K3511j2590j8464j9087J2960
$$ 36816 53066 55945 35004 42205 28226 9235 1948 25459 12869 -5595 -24682 -11722
7876a1722J493R337R161K5519J8733j4058k3909K4909K8809J837k460K3868l511
$$ -11722 -10229 -892 8269 33788 52521 38463 14554 39463 68272 70109 67649 91517 88006
7863H8006j2481j3670k5121l5246J686l3287n861J9983n048k4907p571p741J4187
$$ 88006 75525 61855 36734 1488 3174 -30113 -35974 -15991 -21039 -45946 -53517 -61258 -47071
7850d7071L1311j944j4611P488o133k7528j2745o150M653L9391L2307K237k5469
$$ -47071 -15760 -17704 -32315 -24827 -30960 -58488 -71233 -77383 -72730 -33339 -1032 1205 -24264
7837b4264l5272j9057p094K1140K2338N038K8634L0806P366M644q405J00O495
$$ -24264 -59536 -78593 -85687 -64547 -42209 -37171 -8537 22269 29635 34279 25874 25974 32469
7824C2469j3634j4759J3521K1481j3390n0968l0158K0497K8704Q573j0604r566
$$ 32469 18835 4076 17597 39078 25688 -25280 -55438 -34941 -6237 2336 -8268 -17834
7812a7834j6312O876R192n06j1941J4999M3782J4094j235m6353j0574k004k762
$$ -17834 -34146 -27270 -18078 -18584 -30525 -15526 28256 42350 41115 -5238 -15812 -17816 -20578
7799b0578j17r465J0817L560P026K9076k7822P553K1207N035k0054L523Q447J1696
$$ -20578 -20695 -30160 -19343 -15783 -8757 20319 -7503 50 21257 26292 6238 9761 18208 29904
7785B9904k0036j6926J240M62k2656k7752J5998M9401q260l3654J8295J2730J5960
$$ 29904 9868 -7058 -5818 -5356 -28012 -55764 -39766 9635 1375 -32279 -13984 -1254 14706
7772A4706J3362L921J0972k3767l3573l9020K3893K4620j3689N665Q670l7541
$$ 14706 28068 31989 42961 19194 -14379 -53399 -29506 -4886 -18575 -12910 -4240 -41781
7760d1781o560J5451P218K3189M708l212J7080J5752p324j6668j57j966j47k8420
$$ -41781 -48341 -32890 -25672 -2483 2225 -987 16093 31845 24521 7853 7696 5730 5583 -22837
7746b2837j167P093L1099j0729P870r550n977J4228J3635O842J3042j5379j5293
$$ -22837 -24004 -16911 14188 3459 11329 1779 -4198 10030 23665 30507 43549 28170 12877
7733A2877o880l201K417K200n777j1029m106p089k6658L5331N193j1071k4976
$$ 12877 5997 2796 5213 7413 1636 -9393 -13499 -20588 -47246 -11915 -6722 -17793 -42769
7720d2769m498l303L3682q195l9842N312K1565R123Q425O042M578N021j0542L320
$$ -42769 -47267 -50570 -16888 -25083 -64925 -59613 -38048 -28925 -20500 -14458 -9880 -4859 -15401 -12081
7706a2081J1892J7499l1491p706k290j50J7196L124j0205l114j777J7493Q110
$$ -12081 -189 17310 -14181 -21887 -24177 -24327 -7131 -4007 -14212 -17326 -19103 -1610 6500
7693F500J2980M335q714n943p52k1117k4821j0329J8076m723l78J0921J0081K479
$$ 6500 19480 23815 15101 9158 8406 -12711 -37532 -47861 -29785 -34508 -34886 -23965 -13884 -11405
7679a1405L135O792p112k975l731J9654m378N688j758k6144k913J5490k486J803
$$ -11405 -8270 -1478 -8590 -11565 -15296 4358 -20 5668 3910 -22234 -25147 -9657 -12143 -10340
7665a0340j8392O867K4745j387l17N549M661j7232j2881l158m514o022L2010J235
$$ -10340 -28732 -21865 2880 1493 1176 6725 11386 -5846 -18727 -21885 -26399 -32421 -411 824
7651H24l1668L0528L0657J0921o093R136J1090j7227r829k832k9193k0598r267
$$ 824 -30844 -316 30341 41262 35169 44305 55395 38168 28339 25507 -3686 -24284 -33551
7638c3551N426j8912j5228K5607J839L37K4458j2592J9954K1022j1108k3912k7209
$$ -33551 -28125 -47037 -62265 -36658 -34819 -34482 -10024 -22616 -2662 18360 7252 -16660 -43869
7625d3869L859j0264r403J8092p988j190N2299J3769j3620j7009J422R124Q354
$$ -43869 -40010 -50274 -59677 -41585 -49573 -50763 1536 15305 1685 -15324 -13902 -4778 3576
7612C576O841Q438m864J894K244J5921M176K5924j6839j4841k2477m018q828j1668
$$ 3576 10417 18855 13991 15885 18129 34050 38226 64150 47311 32470 9993 5975 -2853 -14521
7598a4521j3007k4703j1463p241J0307J8500J0970L726J6087M0184j0193j7892
$$ -14521 -27528 -52231 -63694 -70935 -60628 -42128 -31158 -27432 -11345 28839 18646 754
7586G54j8251r505N328q633n842J1319o650j124n174K6782N766K90j1163r296
$$ 754 -17497 -27002 -21674 -30307 -36149 -24830 -31480 -32604 -37778 -10996 -5230 -4940 -16103 -25399
7572b5399K2997L272R339k0660J1207J6444r766r282k795R418j2815m589m1458
$$ -25399 -2402 870 10209 -10451 756 17200 7434 -1848 -4643 4775 -8040 -12629 -54087
7559e4087o872K7842J138j9593l5741O370L0540K2669R819k8328l7251M6840N8487
$$ -54087 -60959 -33117 -31979 -51572 -87313 -80943 -50403 -27734 -17915 -46243 -83494 -36654 21833
7546B1833J726l3647j4414J9495J1292r141Q965Q066Q413J9832j3852j9983j8535
$$ 21833 23559 -10088 -24502 -5007 6285 -2856 6109 14175 22588 42420 28568 8585 -9950
7533i950k9505j4124q614K1906J4441j0603O056J5832l195l372J270M729P20r948
$$ -9950 -39455 -53579 -62193 -40287 -25846 -36449 -30393 -14561 -17756 -21128 -19858 -15129 -14409 -24357
7519b4357K5005L3552k322k038j3448J7032p687k3521k3636J2537J8876m8636
$$ -24357 648 34200 31878 29840 16392 33424 25737 2216 -21420 -8883 9993 -38643
7507c8643l0382N356R842J6627K4331L4172J441N104j6230o091j0233j4142j3300
$$ -38643 -69025 -63669 -53827 -37200 -12869 21303 22744 27848 11618 5527 -4706 -18848 -32148
7494c2148K214O469R886K0311q650k0361n459O664K6214n965k9986O309K5790
$$ -32148 -29934 -23465 -13579 6732 -1918 -22279 -27738 -21074 5140 -825 -30811 -24502 1288
7481A288j5300j8173J0798J2802J8121Q708r361j4992J5236J7781M011k4247j3662
$$ 1288 -14012 -32185 -21387 -8585 9536 18244 8883 -6109 9127 26908 30919 6672 -6990
7468f990n127o991r221k3139L8252K2781j529J2746j1505j9049J7311K852j3138
$$ -6990 -12117 -19108 -28329 -51468 -13216 9565 8036 20782 9277 -9772 7539 10391 -2747
7455b747J6917K1935j5143R81k434k8258k976j5391j6409R907J6682j7511J717
$$ -2747 14170 36105 20962 21943 19509 -8749 -11725 -27116 -43525 -33618 -16936 -34447 -32730
7442c2730Q993J5430Q288J2421J81J2931O36P180j4142k8987j0654J0053j8559
$$ -32730 -23737 -8307 -19 12402 12583 25514 26150 33330 19188 -9799 -20453 -10400 -28959
7429b8959Q949j2850p830K5903n28m991J7995K8357q666j0970j5012k0422J5314
$$ -28959 -20010 -32860 -40690 -14787 -15315 -20306 -2311 26046 17380 6410 -8602 -29024 -13710
7416a3710j2349K0621j517j0011J6754J2430J8286l233j3383j7380l275J3075
$$ -13710 -26059 -5438 -6955 -16966 -212 12218 30504 27271 13888 -3492 -6767 6308
7404F308L418j8520j4994j483o506J9904K4213n123r305n398j8323k3888L272
$$ 6308 9726 -8794 -23788 -25271 -31777 -11873 12340 7217 -2088 -7486 -25809 -49697 -46425
7391d6425K0290R184R907N12p555N597j7314j5058Q375J2261k0515l044M1652
$$ -46425 -26135 -16951 -7044 -6532 -14087 -8490 -25804 -40862 -32487 -20226 -40741 -43785 -2133
7378b133L3158k574m9208r586J0191P197p06l50j7684L976K176J951n683M868
$$ -2133 31025 28451 -20757 -30343 -20152 -12955 -13661 -14011 -31695 -27719 -25543 -23592 -29275 -24407
7364b4407J3579p085n758J2073J2294M067J60j8637L174j59J5740R340l1603j3237
$$ -24407 -10828 -17913 -23671 -11598 696 4763 4923 -13714 -10540 -10699 5041 14381 -17222 -30459
7350c0459O908K4744K885k0532K227L9034k1524k0821j1600P654J7294K0383L289
$$ -30459 -23551 1193 4078 -16454 -14227 24807 3283 -17538 -29138 -21484 -4190 16193 19482
7337A9482k2671k4794j748K1881R804p226J806N64J7604j0515j2883K914J1692
$$ 19482 -3189 -27983 -29731 -7850 1954 -5272 -3466 -2902 14702 4187 -8696 -5782 5910
7324E910p359k4737j4408K5257L3501O500j5030k0634J0650K2187j2631r325K4552
$$ 5910 -1449 -26186 -40594 -15337 18164 24664 9634 -11000 -350 21837 9206 -119 24433
7311B4433K2150r903l2209J221M658m2380k598K2684K62n52j2253n413J1731J6073
$$ 24433 46583 36680 4471 5692 10350 -32030 -34628 -11944 -11682 -12234 -24487 -29900 -18169 -2096
7297b096n539k535J5101M402l1782k6179N002K0387Q678R425K6807l43j0501J5502
$$ -2096 -7635 -10170 4931 9333 -22449 -48628 -43626 -23239 -14561 -5136 21671 21328 10827 26329
7283B6329J4144l742k3385j0175M3807J2694j0324k6490r703P176N580k2682j292
$$ 26329 40473 36731 13346 3171 46978 59672 49348 22858 13155 20331 25911 3229 1937
7270A937J176j255J1835o836J448J7413J1809J523l5344j0910n305k7424n531
$$ 1937 3113 1858 13693 6857 8305 25718 37527 39050 3706 -7204 -12509 -39933 -45464
7257d5464J2567K0263J7666j8056l8499K7670J5653k3256l2654o693L9051K7426
$$ -45464 -32897 -12634 5032 -13024 -51523 -23853 -8200 -31456 -64110 -70803 -31752 -4326
7245d326j693J235r778r082j957n010J4241K4784K530j1225o298q641R471j018
$$ -4326 -6019 -4784 -14562 -23644 -25601 -30611 -16370 8414 10944 -281 -6579 -15220 -5749 -6767
7231f767Q453k2092j1534P240j519J4013M004Q154R760p411k2318p100J0108J9672
$$ -6767 1686 -20406 -31940 -24700 -26219 -12206 -8202 -48 9712 2301 -20017 -27117 -17009 2663
7217B663k5626m2658L898K8722J7945r530o604m185R77P548J3787L374j3955l4408
$$ 2663 -22963 -65621 -61723 -33001 -15056 -24586 -31190 -35375 -34398 -26850 -13063 -9689 -23644 -58052
7203e8052j9501K7956J7425P45Q371L980J9753K1177N739k6342k1643j2332K4086
$$ -58052 -77553 -49597 -32172 -31427 -23056 -19076 677 21854 27593 1251 -20392 -32724 -8638
7190h638L618J3164J9857J8872k1741k4215K483m28Q510r523l2435j6414L1930
$$ -8638 -5020 8144 28001 46873 25132 917 3400 2972 11482 1959 -30476 -46890 -14960
7177a4960J2525L378l929J99J4196P896j3689q917m269p85L6040P84M892j8294
$$ -14960 -2435 943 -2986 -2787 11409 19305 5616 -3301 -7570 -8355 27685 28469 33361 15067
7163A5067k7126Q691j8062K583l240Q082J233K4839L424k5540N900R262q379K475
$$ 15067 -12059 -3368 -21430 -18847 -22087 -14005 -12772 12067 15491 -10049 -4149 5113 -3266 -791
7149g91l285K3588j0356k6932N918J5967R7J371J321L370P981N986j9970k4920
$$ -791 -4076 19512 9156 -17776 -11858 4109 4206 5577 6898 10268 18249 24235 4265 -20655
7135b0655Q091k661J709K9648j8471k3737K9557j8263l185L990P729J4450j276
$$ -20655 -12564 -15225 -13516 16132 -2339 -26076 3481 -14782 -17967 -13977 -6248 8202 6926
7122F926k597P350r583k7520j9603J8032n893j0448J1567L336l894J8452Q467
$$ 6926 4329 11679 2096 -25424 -45027 -26995 -32888 -43336 -31769 -28433 -32327 -13875 -5408
7109e408j3303j9168r610j114K5226K0044J6736l2103j5571p04j328m423q20j58
$$ -5408 -18711 -37879 -47489 -48603 -23377 -3333 13403 -18700 -34271 -34975 -36303 -40726 -41546 -41704
7095d1704k8052q992Q070L2951J0136j6326r48K1293K3424K727j4071o856k408
$$ -41704 -69756 -78748 -70678 -37727 -27591 -43917 -44865 -23572 -148 2579 -11492 -18348 -20756
7082b0756L2904j5862l8805O959J6839K4881J9480l683o849K445k2215m8636j4315
$$ -20756 12148 -3714 -42519 -35560 -18721 6160 25640 21957 15108 17553 -4662 -53298 -67613
7069f7613J0035P305Q926K2684k2066K4177O982j1838j8773r075K2230L1510K90
$$ -67613 -57578 -50273 -41347 -18663 -40729 -16552 -9570 -21408 -40181 -49256 -27026 4484 4774
7056D774O865j3780k2288J2862J6317N556q642k0539J1388J6204J442j1289l3693
$$ 4774 11639 -2141 -24429 -11567 4750 10306 1664 -18875 -7487 8717 10159 -1130 -34823
7043c4823K3338J9453j1174J0263r454q753n73J708J6225j159l2065K2303K0477
$$ -34823 -11485 7968 -3206 7057 -2397 -11150 -11723 -10015 6210 5051 -27014 -4711 15766
7030A5766n882j7801M02j859j0987L963Q995k458j3423o253k5504J429L9156N481
$$ 15766 9884 -7917 -7515 -9374 -20361 -16398 -7403 -9861 -23284 -29537 -55041 -53612 -14456 -8975
7016h975m338j624J7834l401k4946j1504J6138R028k5680j627K457L0368L0520
$$ -8975 -13313 -14937 2897 -504 -25450 -36954 -20816 -11788 -37468 -39095 -36638 -6270 24250
7003B4250j7518j3822J4608p8k6275J3790M156M741J2568L029j370N605p356j2146
$$ 24250 6732 -7090 7518 7440 -18835 -5045 -889 3852 16420 19449 18079 23684 16328 4182
6989D182k0795n254o75j897j5494J0705N088Q946j7608J2277J8800k4772k1473
$$ 4182 -16613 -21867 -22542 -24439 -39933 -29228 -24140 -15194 -32802 -20525 -1725 -26497 -47970
6976d7970L8440J3145j2030m083k3631j244K570p198J0082K6801J7456r951O780
$$ -47970 -9530 3615 -8415 -12498 -36129 -37373 -34803 -42001 -31919 -5118 12338 2387 9167
6963I167L1098q999k5711l3535l800J1061K3703l905m438j526k6742l743L0412
$$ 9167 40265 31266 5555 -27980 -31780 -20719 2984 -921 -5359 -6885 -33627 -37370 -6958
6950f958M131N109L8184K525k2997J1234l638m5838R076J1922J5227r598l6423
$$ -6958 -2827 2282 40466 42991 19994 31228 27590 -18248 -9172 2750 17977 8379 -28044
6937b8044m009K5623j8811N136k369o885O177J2748j5822k961N301n21j4555j3388
$$ -28044 -32053 -6430 -25241 -20105 -22474 -29359 -23182 -10434 -26256 -29217 -23916 -24437 -38992 -52380
6923e2380n086j96j1508J4277J7513J5554N720M869J762L0503q035l277J1872
$$ -52380 -57466 -57662 -69170 -54893 -37380 -21826 -16106 -11237 -9475 21028 12993 9716 21588
6910B1588J0608n523o055k141p731l4683j0366J9127J1355m009q601j3602r507
$$ 21588 32196 26673 20618 18477 10746 -23937 -34303 -15176 -3821 -7830 -16431 -30033 -39540
6897c9540j0113l636K6478P609m376K645j406N330l693k2753n906q933M725J1768
$$ -39540 -49653 -53289 -26811 -19202 -23578 -20933 -22339 -17009 -20702 -43455 -49361 -58294 -53569 -41801
6883d1801J4819N227J03K2280J1925L718L92j0343j6365j3677L411J4135k3732
$$ -41801 -26982 -21755 -21652 628 12553 16271 16663 6320 -10045 -23722 -20311 -6176 -29908
6870b9908j1257M914R232m591J4367J5597p077l67J1636m796k909j6944k9882
$$ -29908 -41165 -36251 -27019 -31610 -17243 -1646 -8723 -9090 2546 -2250 -5159 -22103 -51985
6857e1985K845R727P586L4080K2286J2975J3481m463l3899j9295p309n274P014
$$ -51985 -49140 -39413 -31827 2253 24539 37514 50995 46532 12633 -6662 -13971 -19245 -12231
6844a2231K6197j8350j5912M704M4544K70l6428k0658r97j4607O569Q872n795
$$ -12231 13966 -4384 -20296 -15592 28952 29222 -7206 -27864 -28861 -43468 -36899 -28027 -33822
6831c3822p503R647K5938J2134l6905m048J2720L454m162j4329r254j6961K0409
$$ -33822 -41325 -31678 -5740 6394 -30511 -34559 -21839 -18385 -22547 -36876 -46130 -63091 -42682
6818d2682o506N966J9871Q508q57j5696J2670j0247l0806R574J6688j1296J7299
$$ -42682 -49188 -43222 -23351 -14843 -15700 -31396 -18726 -28973 -59779 -50205 -33517 -44813 -27514
6805b7514J8667N174j3822k0017M214P301R339K089O99J8064J2892m453j3141
$$ -27514 -8847 -3673 -17495 -37512 -33298 -25997 -16658 -14569 -13870 4194 17086 12633 -508
6792e08R988J192l403K2289k2864J1208j7317n419K304J2944j0165P67Q594K320
$$ -508 9480 10672 7269 29558 6694 17902 585 -4834 -2530 10414 249 1016 9610 11930
6778A1930j4334J7448P014L523K564l0803j3272k036J1143J2960J5492j5235j6974
$$ 11930 -2404 15044 22058 25581 28145 -2658 -15930 -17966 -6823 6137 21629 6394 -10580
6765a0580N452J4898l1249n501J9558L3238l333k7580O385J6060m605k2546J5369
$$ -10580 -5128 9770 -21479 -26980 -7422 25816 22483 -5097 1288 17348 12743 -9803 5566
6752E566K177J1118L36k3199N641j1020k4744J87P351l199p574j2299K0214K5193
$$ 5566 7743 18861 19197 -4002 1639 -9381 -34125 -33938 -26587 -29786 -37360 -49659 -29445 -4252
6738d252M0371k440j9125k220j5893q391O91k7204Q508M0835J4325j8751o703
$$ -4252 36119 33679 14554 12334 -3559 -11950 -11259 -38463 -29955 10880 25205 6454 -249
6725b49K2609q128k4581K3643J4655j9161k9014J0577J3548K2988J0983O739j8560
$$ -249 22360 14232 -10349 13294 27949 8788 -20226 -9649 3899 26887 37870 44609 26049
6712B6049l4649j5499P180J7220K824N056M1012J6339o460L232j3898N57K1314
$$ 26049 -8600 -24099 -16919 301 3125 8181 49193 65532 59072 62304 48406 48963 70277
6699G0277J7028j2191k3178j4286j1743j8578j5580J2461J1725j6396R049J6717
$$ 70277 87305 75114 51936 37650 25907 7329 -8251 4210 15935 -461 8588 25305
6687B5305K374k4333J0651J2601j0284O161l104L493k7234l7758J8870J6127q129
$$ 25305 27679 3346 13997 26598 16314 22475 19371 22864 -4370 -42128 -23258 -7131 -15260
6674a5260Q641Q796j9594j1099J5223j8031j6135j0387J2137L0864K1733J374
$$ -15260 -6619 2177 -17417 -28516 -13293 -31324 -47459 -57846 -45709 -14845 6888 8262
6662H262R190K216j8460m551Q474j8792K580l073p076L735j2232K5292L3130R739
$$ 8262 17452 19668 1208 -3343 5131 -13661 -11081 -14154 -21230 -17495 -29727 -4435 28695 38434
6648C8434l6332k2386J3153p073j080l96j0714L780K1712L054j1491l0944k841
$$ 38434 2102 -20284 -7131 -14204 -15284 -15680 -26394 -22614 -902 2152 -9339 -40283 -43124
6635d3124L1808o880j9379K0269J140k4918M983p338J0397O584j0247N938K3691
$$ -43124 -11316 -18196 -37575 -17306 -16166 -41084 -36101 -43439 -33042 -26458 -36705 -30767 -7076
6622g076L6101O578k7519l0179o605J8496K232J4238L342J1392n777j3576J3326
$$ -7076 29025 35603 8084 -22095 -28700 -10204 -7972 6266 9608 21000 15223 1647 14973
6609A4973j3134k4720R673L0587J0829N990j7605j7234o07P981K8607R758r441
$$ 14973 1839 -22881 -13208 17379 28208 34198 16593 -641 -1248 6733 35340 45098 35657
6596C5657k0387J1741L375j8102j2097k7010j7852l834J6628L1299K233k7846
$$ 35657 15270 27011 30386 12284 187 -26823 -44675 -48509 -31881 -582 1651 -26195
6584b6195k4461J1455N328O709L3635j06k2881j3795j5430N899M593J8269K640
$$ -26195 -50656 -39201 -33873 -27164 6471 6365 -16516 -30311 -45741 -39842 -35249 -16980 -14340
6571a4340k361Q269P134J4494K5125k0148p066N536p303j1071l421m670L557q682
$$ -14340 -16701 -8432 -1298 13196 38321 18173 11107 16643 9340 -1731 -5152 -9822 -6265 -14947
6557a4947J4973J2372l1573n220J229k4759J2687K0012J2492n438J2367p259j4813
$$ -14947 26 12398 -19175 -24395 -23166 -47925 -35238 -15226 -2734 -8172 4195 -3064 -17877
6544a7877l0491Q602r558o745L1463J8570j428Q145J77J2055M206O64L466p416
$$ -17877 -48368 -39766 -49324 -56069 -24606 -6036 -7464 681 858 12913 17119 17783 21249 13833
6530A3833j1558Q299J4404N080q545k0333J207k6674m3606K1178J9145J8134L442
$$ 13833 2275 10574 24978 30058 21513 1180 2387 -24287 -67893 -46715 -27570 -9436 -5994
6517e994L79J7888m896k0362M153K61r993n045J9950k3070k453J9299N891j7711
$$ -5994 -5615 12273 7377 -12985 -8832 -8571 -18564 -23609 -3659 -26729 -29182 -9883 -3992 -21703
6503b1703J7504m204J5593K6810q095r140J7596Q233j8774k4071Q419J0926k4966
$$ -21703 -4199 -8403 7190 34000 25905 16765 34361 42594 23820 -251 8168 19094 -5872
6490e872m1884m460R043K8225L2638J2593j2363o127N518k2653j7822J0058J7651
$$ -5872 -47756 -52216 -43173 -14948 17690 30283 17920 11793 17311 -5342 -23164 -13106 4545
6477D545K2028j957m3972k241L2147K467j2127n160j69K9634m002l615k91r415
$$ 4545 26573 24616 -19356 -21597 10550 13017 890 -4270 -4439 25195 21193 17578 17287 7872
6463G872k2692J5413J7453j3358o953P907r101K5247l844K1540J3542l4048j7626
$$ 7872 -14820 593 18046 4688 -2265 5642 -3459 21788 17944 39484 53026 18978 1352
6450A352j1676J027O931j4473M470j0637q873N211j3219j7428K20M4551K0296
$$ 1352 -10324 -9297 -2366 -16839 -12369 -23006 -31879 -26668 -39887 -57315 -57095 -12544 7752
6437G752m1391j8200M2277L0415j9935j5899j4819J5839K5186K2934n051l9915
$$ 7752 -33639 -51839 -9562 20853 918 -14981 -29800 -13961 11225 34159 29108 -10807
6425a0807j5163J0933K0084m704R503n412j7674J3401J0503m526j0946j7413O047
$$ -10807 -25970 -15037 5047 343 9846 4434 -13240 161 10664 6138 -4808 -22221 -16174
6412a6174P685J6903k4969j6704J1446j973J7873K1660L76o259L928q615L073
$$ -16174 -8489 8414 -16555 -33259 -21813 -23786 -5913 15747 16123 9864 13792 5177 8250
6399H250j2205k3767R98J3016K2949O933K764n903o713j687P889K071j5983k639
$$ 8250 -3955 -27722 -26724 -13708 9241 16174 18938 13035 6322 4635 12524 14595 -1388 -4027
6385d027O59K1052j0449o498J9207J5599J0753n726k2694K275L445O629k1789
$$ -4027 -3368 17684 7235 737 19944 35543 46296 40570 17876 20151 23596 30225 8436
6372H436l5542j7147K0517J2488k136j668j6235k249J577k61K9819Q057k0645
$$ 8436 -27106 -44253 -23736 -11248 -13384 -15052 -31287 -33536 -31959 -32220 -2401 5656 -14989
6359a4989p920J4914O239n084q224k5766k898Q248J5659L1739J4417q836J0894
$$ -14989 -22909 -7995 -1756 -6840 -15064 -40830 -43728 -35480 -19821 11918 26335 17499 28393
6346B8393m385J1637k9899j5422j5280K623q77q790J9905J8020J951K4353J1285
$$ 28393 24008 35645 5746 -9676 -24956 -22333 -23210 -32000 -12095 5925 7876 32229 43514
6333D3514j6534k1747l776l646k2591j5168K1698J2312O478k217O582O613j0796
$$ 43514 26980 5233 1457 -2189 -24780 -39948 -18250 -5938 540 -1677 4905 11518 722
6320G22j3916k039J8216L253j3603n793J017q44O937K2095K700R351J914k59K759
$$ 722 -13194 -15233 2983 6236 -7367 -13160 -12143 -12987 -6050 16045 18745 28096 30010 29751 32510
$$ [...]
##END NTUPLES=NMR SPECTRUM
##END=
