##TITLE=Analysis number 307396
Compound Code mo 07066
Book Reference 332/160
Project Code adrs
Chemist Name craigr
##JCAMPDX= 6.0         $$ Bruker NMR JCAMP-DX V2.0
##DATA TYPE= NMR SPECTRUM
##DATA CLASS= NTUPLES
##ORIGIN= Bruker BioSpin GmbH
##OWNER= NMR
$$ XWIN-NMR		Version 3.5
$$ Fri Apr 29 11:37:54 2005 GMT Daylight Time (UT+1h)  MAYBRIDGE\NMR@NMR_250MHZ
##.OBSERVE FREQUENCY= 250.131544655141
##.OBSERVE NUCLEUS= ^1H
##.ACQUISITION MODE= SIMULTANEOUS (DQD)
##.ACQUISITION SCHEME= undefined
##.AVERAGES= 16
##.DIGITISER RES= 18
##SPECTROMETER/DATA SYSTEM= dpx250
##.PULSE SEQUENCE= zg30
##.SOLVENT NAME= CDCl3
##.SHIFT REFERENCE= (INTERNAL, CDCl3, 0, 16.4555)
##AUDIT TRAIL= $$ (NUMBER, WHEN, WHO, WHERE, WHAT)
$$ ##TITLE= Audit trail, XWIN-NMR		Version 3.5
$$ ##JCAMPDX= 5.01
$$ ##ORIGIN= Bruker BioSpin GmbH
$$ ##OWNER= NMR
$$ C:\u/data/dgb/nmr/ADRS/2580/pdata/1/auditp.txt
$$ ##AUDIT TRAIL=  $$ (NUMBER, WHEN, WHO, WHERE, WHAT)
(   1,<2005-04-29 11:37:22.29 +100>,<MAYBRIDGE\NMR>,<NMR_250MHZ>,
      <created by zg, POWCHK disabled, PULCHK disabled
       configuration hash MD5:
       62 19 C7 07 E1 42 D1 B7 37 6C 3D D0 77 39 F9 E6
       data hash MD5: 64K
       BB A1 BA 10 7C 53 BA 3D 6D DA 26 09 E4 C4 AE 95>)
(   2,<2005-04-29 11:37:37.07 +100>,<MAYBRIDGE\NMR>,<NMR_250MHZ>,
      <Start of raw data processing
       ef LB = 0.3 FT_mod = 6 PKNL = 1 SI = 32K 
       data hash MD5: 32K
       93 9D 0A A7 7A 97 CB AF BB ED 44 EB 98 3C F4 79>)
(   3,<2005-04-29 11:37:42.88 +100>,<MAYBRIDGE\NMR>,<NMR_250MHZ>,
      <apk 
       data hash MD5: 32K
       00 81 CE 3E 36 E7 DE 94 CE B6 26 D0 C7 12 45 E5>)
(   4,<2005-04-29 11:37:44.56 +100>,<MAYBRIDGE\NMR>,<NMR_250MHZ>,
      <abs ABSG = 5 
       data hash MD5: 32K
       72 9C C3 76 A9 A7 C7 6C 08 84 7F A3 B5 1C 97 4D>)
$$ ##END=
$$ 
$$ hash MD5
$$ A4 BE 3C 35 AD F2 90 04 87 FE 4C 40 00 DE AC 2B
##$RELAX= 
##$RELAX= 
##$RELAX= 
##$RELAX= 
##$RELAX= 
##$RELAX= 
##$RELAX= 
$$ Bruker specific parameters
$$ --------------------------
##$DU= <C:\u>
##$EXPNO= 2580
##$NAME= <ADRS>
##$PROCNO= 1
##$TYPE= <nmr>
##$USER= <dgb>
##$AMP= (0..31)
100 100 100 100 100 100 100 100 100 100 100 100 100 100 100 100 100 100 
100 100 100 100 100 100 100 100 100 100 100 100 100 100 
##$AQSEQ= 0
##$AQ_mod= 3
##$AUNM= <au_zg>
##$AUTOPOS= <21 >
##$BF1= 250.13
##$BF2= 250.13
##$BF3= 250.13
##$BF4= 250.13
##$BF5= 500.13
##$BF6= 500.13
##$BF7= 500.13
##$BF8= 500.13
##$BYTORDA= 1
##$CFDGTYP= 0
##$CFRGTYP= 5
##$CHEMSTR= <none>
##$CNST= (0..31)
1 1 145 1 1 1 1 1 1 1 1 1 1 1 1 1 1 1 1 1 1 1 1 1 1 1 1 1 1 1 1 1 
##$CPDPRG= <>
##$CPDPRG1= <>
##$CPDPRG2= <>
##$CPDPRG3= <>
##$CPDPRG4= <mlev>
##$CPDPRG5= <mlev>
##$CPDPRG6= <mlev>
##$CPDPRG7= <mlev>
##$CPDPRG8= <mlev>
##$CPDPRGB= <>
##$CPDPRGT= <>
##$D= (0..31)
0 1 0 0 0 0 0 0 0 0.06 0 0 0 0 0 0 0.0002 0 0 0 0 0 0 0 0 0 0 0 0 0 0 
0 
##$DATE= 1114771041
##$DBL= (0..7)
120 120 120 120 120 120 120 120 
##$DBP= (0..7)
150 150 150 150 150 150 150 150 
##$DBP07= 0
##$DBPNAM0= <>
##$DBPNAM1= <>
$$ [...]
##$SUBNAM7= <"">
##$SUBNAM8= <"">
##$SUBNAM9= <"">
##$SW= 20.6930455092707
##$SWIBOX= (0..15)
0 0 3 0 0 0 0 0 0 0 0 0 0 0 0 0 
##$SW_h= 5175.983436853
##$TD= 65536
##$TD0= 1
##$TE= 295.16
##$TE2= 300
##$TE3= 300
##$TEG= 300
##$TL= (0..7)
0 120 120 120 120 120 120 120 
##$TP= (0..7)
150 150 150 150 150 150 150 150 
##$TP07= 0
##$TPNAME0= <>
##$TPNAME1= <>
##$TPNAME2= <>
##$TPNAME3= <>
##$TPNAME4= <>
##$TPNAME5= <>
##$TPNAME6= <>
##$TPNAME7= <>
##$TPOAL= (0..7)
0.5 0.5 0.5 0.5 0.5 0.5 0.5 0.5 
##$TPOFFS= (0..7)
0 0 0 0 0 0 0 0 
##$TUNHIN= 0
##$TUNHOUT= 0
##$TUNXOUT= 0
##$USERA1= <user>
##$USERA2= <user>
##$USERA3= <user>
##$USERA4= <user>
##$USERA5= <user>
##$V9= 5
##$VALIST= <valist>
##$VCLIST= <CCCCCCCCCCCCCCC>
##$VD= 0
##$VDLIST= <DDDDDDDDDDDDDDD>
##$VPLIST= <PPPPPPPPPPPPPPP>
##$VTLIST= <TTTTTTTTTTTTTTT>
##$WBST= 1024
##$WBSW= 4
##$XGAIN= (0..3)
0 0 0 0 
##$XL= 0
##$YL= 0
##$YMAX_a= 304235
##$YMIN_a= -449713
##$ZGOPTNS= <>
##$ZL1= 120
##$ZL2= 120
##$ZL3= 120
##$ZL4= 120
##$ABSF1= 16.4555
##$ABSF2= -4.237673
##$ABSG= 5
##$ABSL= 3
##$ALPHA= 0
##$AQORDER= 0
##$ASSFAC= 0
##$ASSFACI= 0
##$ASSFACX= 0
##$ASSWID= 0
##$AUNMP= <proc_1d>
##$AZFE= 0.1
##$AZFW= 0.1
##$BCFW= 0
##$BC_mod= 0
##$BYTORDP= 0
##$COROFFS= 0
##$CY= 12.5
##$DATMOD= 1
##$DC= 0
##$DFILT= <>
##$DTYPP= 0
##$F1P= 14.0000005364418
##$F2P= -0.99999901652339
##$FCOR= 0.5
##$FTSIZE= 32768
##$FT_mod= 6
##$GAMMA= 0
##$GB= 0
##$INTBC= 1
##$INTSCL= 1
##$ISEN= 128
##$LB= 0.3
##$LEV0= 0
##$LPBIN= 0
##$MAXI= 10000
##$MC2= 0
##$MEAN= 0
##$ME_mod= 0
##$MI= 0
##$NCOEF= 0
##$NC_proc= -2
##$NLEV= 6
##$NOISF1= 0
##$NOISF2= 0
##$NSP= 0
##$NTH_PI= 0
##$NZP= 0
##$OFFSET= 16.4555
##$PC= 1
##$PHC0= -69.71252
##$PHC1= 3.44749
##$PH_mod= 1
##$PKNL= yes
##$PPARMOD= 0
##$PSCAL= 4
##$PSIGN= 0
##$REVERSE= no
##$SF= 250.130016632266
##$SI= 32768
##$SIGF1= 0
##$SIGF2= 0
##$SINO= 400
##$SIOLD= 32768
##$SREGLST= <1H.CDCl3>
##$SSB= 0
##$STSI= 32768
##$STSR= 0
##$SW_p= 5175.98343685301
##$SYMM= 0
##$S_DEV= 0
##$TDeff= 65536
##$TDoff= 0
##$TI= <Analysis number 999999
Compound Code 99
Book Reference 9
Project Code 9>
##$TILT= no
##$TM1= 0
##$TM2= 0
##$TOPLEV= 0
##$USERP1= <user>
##$USERP2= <user>
##$USERP3= <user>
##$USERP4= <user>
##$USERP5= <user>
##$WDW= 1
##$XDIM= 32768
##$YMAX_p= 281880666
##$YMIN_p= -59571
$$ End of Bruker specific parameters
$$ ---------------------------------
##NTUPLES= NMR SPECTRUM
##VAR_NAME=  FREQUENCY,     SPECTRUM/REAL,   SPECTRUM/IMAG
##SYMBOL=    X,             R,               I
##VAR_TYPE=  INDEPENDENT,   DEPENDENT,       DEPENDENT
##VAR_FORM=  AFFN,          ASDF,            ASDF
##VAR_DIM=   32768,         32768,           32768
##UNITS=     HZ,            ARBITRARY UNITS, ARBITRARY UNITS
##FACTOR=    0.157963299565203, 1,           1
##FIRST=     4116.01440090859, 0,            0
##LAST=      -1059.96903594442, 0,           0
##MIN=       -1059.96903594442, -59571,      0
##MAX=       4116.01440090859, 281880666,    0
$$ Real data points
##PAGE= N=1
##DATA TABLE= (X++(R..R)), XYDATA
$$ [...]
$$ plain form
15009 -1128 12942 1997 2992 7233 8425 1892 -21022 -27148 -23272 -26341 -14236 2113 8466 -8614
14995 -8614 -12486 -7417 -4876 -5799 -1272 -6073 -6212 -8353 -24919 -17507 -15285 -4278 -1254 1404 -4490
14980 -4490 2377 15649 17885 4125 -11543 -21000 -2871 7884 4521 9182 13834 11915 1987
14967 1987 3796 10277 -1827 -7491 2902 6075 -13842 -29530 -13382 4746 377 846 7236
14954 7236 4899 1076 3633 5750 6747 1173 5933 5001 -3392 -11708 -18190 -1226 -4199 -11698 -13099
14939 -13099 -24633 -18358 -14250 -14643 -7022 -1735 -7447 -13050 -22009 -20273 -10406 -9924 -14938 -20567 -15867
14924 -15867 -7165 1887 13492 13631 4579 12832 22812 26557 8711 -2867 47 14975 16030 -2378
14910 -2378 -14341 -13559 -15702 -22987 -16085 4564 20254 15041 4267 -15169 -21385 -3544 3801
$$ packed form
15009a128J4070j0945R95M241J192o533k2914o126L876l069J2105J6349O353j7080
14995h614l872N069K541r23M527m801j39k141j6566P412K222J1007L024K658n894
14980d490O867J3272K236j3760j5668r457J8129J0755l363M661M652j919r928
14967A987J809O481j2104n664J0393L173j9917j5688J6148J8128m369M69O390
14954G236k337l823K557K117R97n574M760r32q393q316o482J6964k973p499j401
14939a3099j1534O275M108l93P621N287n712n603q959J736R867M82n014n629M700
14924a5867Q702R052J1605J39r052Q253R980L745j7846j1578K914J4928J055j8408
14910b378j1963P82k143p285O902K0649J5690n213j0774j9436o216J7841P345
$$ plain form
14897 3801 -5492 -9290 -6693 -15983 -7562 970 -4898 -8660 -17699 -27092 -19472 -4619 3801 8506
14883 8506 11843 -2706 -15822 -26801 -25747 -16876 -32490 -40817 -36072 -38409 -38058 -28205 -28452 -27600
14869 -27600 -4435 -8585 -6274 -2851 -2354 2057 -15068 -11234 -8064 -23399 -27408 -13458 -2505
14856 -2505 -3464 -7800 -8486 -15656 -3352 -3160 -2953 12893 16653 7736 10697 10724 -116 -14413 -10346
14841 -10346 -13771 -12328 -7766 -7873 2333 5662 5855 3513 120 -5130 3577 -9583 -14515 -585
14827 -585 -2434 -13170 -18264 282 7697 -31 -3603 -8210 -5916 -2214 -1081 1183 9681 -364
14813 -364 4181 15558 19979 9959 6303 4760 2027 9836 4265 1899 945 -1307 8034 4475 -504
14798 -504 -9132 -13041 -7698 -11074 -20991 -11376 -1618 -3468 -3385 3226 16347 23200 9662 -199 -2298
$$ packed form
14897C801r293l798K597r290Q421Q532n868l762r039r393P620J4853Q420M705
14883H506L337j4549j3116j0979J054Q871j5614q327M745k337L51R853k47Q52
14869b7600K3165m150K311L423M97M411j7125L834L170j5335m009J3950J0953
14856b505r59m336o86p170J2304J92K07J5846L760q917K961K7j0840j4297M067
14841a0346l425J443M562j07J0206L329J93k342l393n250Q707j3160m932J3930
14827e85j849j0736n094J8546P415p728l572m607K294L702J133K264Q498j0045
14813c64M545J1377M421j0020l656j543k733P809n571k366r54k252R341l559m979
14798e04q628l909N343l376r917R615R758j850Q3O611J3121O853j3538r861k099
$$ plain form
14783 -2298 -9103 -11320 -18134 -16664 -9793 -2765 -11678 -13729 -2331 5960 22240 23982 7485 -17627
14769 -17627 -19465 -11296 2657 15017 18383 -725 -16312 -1695 16311 9279 -2152 -6984 -1302
14756 -1302 9257 10569 7228 9422 14190 14169 12503 1895 -5202 -11235 -17204 -3948 1615 8548
14742 8548 14702 10214 4243 2380 3837 -7005 -19175 -17187 -20618 -13920 -13086 -10023 -16640 -23093
14728 -23093 -41018 -34593 -22066 -20334 -10155 -5272 7206 26047 30929 13568 -1523 -4420 -8120
14715 -8120 -11964 -14959 -6686 12889 16415 17815 7939 -5161 -8500 -15549 -7868 2142 -5401 -3373
14701 -3373 11619 27275 14707 -2160 -16701 -15610 -4006 2326 3136 3908 6828 5790 -1331 3088
14687 3088 3526 7215 6143 21792 22210 22611 22626 16220 7769 -2321 -3907 -1601 3379 -5087 -17254
$$ packed form
14783b298o805k217o814J470O871P028q913k051J1398Q291J6280J742j6497k5112
14769a7627j838Q169J3953J2360L366j9108j5587J4617J8006p032j1431m832N682
14756a302J0559J312l341K194M768k1j666j0608p097o033n969J3256N563O933
14742H548O154m488n971j863J457j0842j2170J988l431O698Q34L063o617o453
14728b3093j7925O425J2527J732J0179M883J2478J8841M882j7361j5091k897l700
14715h120l844k995Q273J9575L526J400r876j3100l339p049P681J0010p543K028
14701c373J4992J5656j2568j6867j4541J091J1604O332Q10P72K920j038p121M419
14687C088M38L689j072J5649M18M01J5o406q451j0090j586K306M980q466j2167
$$ plain form
14672 -17254 -24485 -26652 -22679 -12319 4837 11824 23445 18126 -8965 -20069 -35953 -37628 -29841
14659 -29841 -18350 -12369 -21232 -18238 -16196 -17120 -8953 -3189 2064 59 -8267 -11540 -2231 2320
14645 2320 10464 2165 -20085 -18156 -3158 1036 -1958 -11843 -1681 -4884 2044 13211 12116 19057
14631 19057 14730 7837 -1034 -501 -2618 7263 16851 19840 12551 4300 -4830 -18271 -31572 -29573
14617 -29573 -27282 -19631 -16162 -26882 -40886 -33156 -26419 -22584 -32847 -35722 -35427 -36177 -29105 -15661
14603 -15661 -18151 -21039 -9606 -3461 -441 8064 -1552 -6644 -386 7008 8791 13341 19247 10257
14589 10257 2598 -4408 10958 16612 18174 19498 2250 10594 14047 -131 -9099 -12110 -10031 -18713
14575 -18713 -21091 -18856 -17819 -12046 -4650 -17036 -34289 -24979 -20118 -19526 -8013 -245 -3330 -6880
$$ packed form
14672a7254p231k167L973J0360J7156O987J1621n319k7091j1104j5884j675P787
14659b9841J1491N981q863K994K042r24Q167N764N253k005q326l273R309M551
14645B320Q144q299k2250J929J4998M194k994r885J0162l203O928J1167j095O941
14631A9057m327o893q871N33k117R881R588K989p289q251r130j3441j3301J999
14617b9573K291P651L469j0720j4004P730O737L835j0263k875K95p50P072J3444
14603a5661k490k888J1433O145L020Q505r616n092O258P394J783M550N906q990
14589A0257p659p006J5366N654J562J324j7248Q344L453j4178q968l011K079q682
14575a8713k378K235J037N773P396j2386j7253R310M861N92J1513P768l085l550
$$ plain form
14561 -6880 -7178 -6032 4229 421 -19762 -8307 14749 41182 47118 25156 1171 -21729 -31265
14548 -31265 -7129 812 -3281 379 -1305 -7370 -6846 -730 -3988 -4239 -9913 -1431 -18421 -33449
14534 -33449 -21491 -11864 -14525 -19853 -12860 -6904 -5928 -9471 -4905 3803 -3889 -4833 22 -8592 -19344
14519 -19344 -12529 -19240 -26583 -20559 -18969 -24856 -14883 -13732 -15321 -23941 -27628 -20196 -9247 8462
14505 8462 9352 -422 -3302 -11611 -12298 -2277 -5151 -4900 -7325 -17884 -13299 -6369 -9167 8098 11272
14490 11272 6267 3991 -924 8865 10664 16414 11997 3818 -4821 5258 8206 14265 14808 1685
14476 1685 10786 22442 23132 12651 -15142 -15178 -4804 15476 31839 37806 43263 21442 17718 18022
14462 18022 23007 15646 6290 -3237 -13236 -17850 -21383 -9168 -11324 -24052 -28471 -13488 -978
$$ packed form
14561f880k98J146J0261l808k0183J1455K3056K6433N936k1962k3985k2900r536
14548c1265K4136P941m093L660j684o065N24O116l258k51n674Q482j6990j5028
14534c3449J1958R627k661n328O993N956R76l543M566Q708p692r44M855q614j0752
14519a9344O815o711p343O024J590n887R973J151j589q620l687P432J0949J7709
14505H462Q90r774k880q309o87J0021k874K51k425j0559M585O930k798J7265L174
14490A1272n005k276m915R789J799N750m417q179q639J0079K948O059N43j3123
14476A685R101J1656O90j0481k7793l6J0374K0280J6363N967N457k1821l724L04
14462A8022M985p361r356r527r999m614l533J2215k156j2728m419J4983J2510
$$ plain form
14449 -978 7609 11321 -1867 -12174 -7262 5276 8742 -3767 -17253 -28956 -30547 -30101 -25564 -27024
14435 -27024 -29838 -25327 -24182 -7836 -11112 -16349 -7235 -3840 -9570 -20108 -29946 -25042 -30950 -34555
14421 -34555 -20746 -12399 -4808 -834 570 -17558 -15594 -4294 5745 14472 14534 18113 9765 2004
14407 2004 2449 12915 12542 10937 17794 25147 68 -437 7409 5353 -1980 3324 7847 -1161 -9367
14392 -9367 -19105 -18310 -15749 -9285 1170 12829 24058 18638 8216 -3204 -6466 3675 2781 -13129
14378 -13129 -9174 -13056 -1751 11452 12252 1093 10669 15319 6275 -9981 -30401 -32112 -12788
14365 -12788 -13199 -12612 -7185 -16743 -9722 -4170 -15983 -26850 -14838 14647 24240 15263 3109 3521
14351 3521 26096 23032 13138 23001 20443 21006 30322 28537 16197 9252 11493 12349 -9102 -12265
$$ packed form
14449i78Q587L712j3188j0307M912J2538L466j2509j3486j1703j591M46M537j460
14435b7024k814M511J145J6346l276n237R114L395n730j0538r838M904n908l605
14421c4555J3809Q347P591L974J404j8128J964J1300J0039Q727O2L579q348p761
14407B004M45J0466l73j605O857P353k5079n05P846k056p333N304M523r008q206
14392i367r738P95K561O464J0455J1659J1229n420j0422j1420l262J0141q94j5910
14378a3129L955l882J1305J3203Q00j1159R576M650r044j6256k0420j711J9324
14365a2788m11N87N427r558P021N552j1813j0867J2012K9485R593q977j2154M12
14351C521K2575l064r894R863k558N63R316j785j2340o945K241Q56k1451l163
$$ plain form
14337 -12265 -985 -2859 -19230 -29879 -33696 -26811 -16488 1137 6757 13306 769 -15738 -12908
14324 -12908 -18076 -8263 730 -10443 -6115 -1910 8876 15554 5629 8979 18729 14908 -910 -12129
14310 -12129 -3572 3833 -7063 -20960 -19244 -15592 -2433 8984 -8248 -13955 -10490 -4331 4337
14297 4337 7583 26884 32690 14692 14198 16339 21035 17161 17034 13150 13133 8764 8175 3198 -3095
14282 -3095 -4489 -1856 8370 678 -12925 -12264 -1597 5717 9775 12459 14973 -1380 -17202 -4688
14268 -4688 8339 -932 -10881 140 -2050 -20110 -24147 2941 19130 24829 15687 20298 16145
14255 16145 22535 14928 21637 31102 33378 21796 12810 13329 1179 -2990 5393 25591 28263 8359
14241 8359 193 14071 21108 18333 23744 23830 7509 -7635 -11568 601 10913 14721 10359 10939
$$ packed form
14337a2265J1280j874j6371j0649l817O885J0323J7625N620O549j2537j6507K830
14324a2908n168R813Q993j1173M328M205J0786O678r925L350R750l821j5818j1219
14310a2129Q557P405j0896j3897J716L652J3159J1417j7232n707L465O159Q668
14297D337L246J9301N806j7998m94K141M696l874j27l884j7m369n89m977o293
14282c095j394K633J0226p692j3603O61J0667P314M058K684K514j6353j5822J2514
14268d688J3027r271r949J1021k190j8060m037K7088J6189N699r142M611m153
14255A6145O390p607O709R465K276j1582q986N19j2150m169Q383K0198K672j9904
14241H359q166J3878P037k775N411Q6j6321j5144l933J2169J0312L808m362N80
$$ plain form
14227 10939 -5792 -23737 -18519 -6990 2693 1526 -2214 -1577 9764 2424 -26815 -28614 -22379
14214 -22379 -10990 4021 14983 10666 6717 2601 -436 -19115 -20498 -8992 10549 3985 4588
14201 4588 3792 4294 15999 32197 50199 62077 55933 47496 47460 44776 37524 31575 31976 30498 21913
14186 21913 26915 32805 14694 -3095 -3287 10192 32053 25294 10187 12924 19727 23496 24491 30412
14172 30412 33857 42491 41582 41144 42657 36810 31081 23857 24632 25340 15279 10973 17968 25924 23835
14157 23835 25413 14390 9361 27492 25246 23532 44646 47309 36668 39118 43845 31254 21407
14144 21407 14432 18232 25418 28109 32325 23828 17406 11205 -2754 -864 8370 361 210 14196
14130 14196 21273 23769 29847 20274 11653 16883 28881 23925 16542 4259 -7244 10286 27830
$$ packed form
14227A0939j6731j7945N218J1529R683j167l740O37J1341p340k9239j799O235
14214b2379J1389J5011J0962m317l949m116l037j8679j383J1506J9541o564O03
14201D588p96N02J1705J6198J8002J1878o144q437l6k684p252n949M01j478q585
14186B1913N002N890j8111j7789j92J3479K1861o759j5107K737O803L769R95N921
14172C0412L445Q634r09m38J513n847n729p224P75P08j0061m306O995P956k089
14157B3835J578j1023n029J8131k246j714K1114K663j0641K450M727j2591r847
14144B1407o975L800P186K691M216q497o422o201j3959J890R234q009j51J3986
14130A4196P077K496O078r573q621N230J1998m956p383j2283j1503J7530J7544
$$ plain form
14117 27830 23343 11021 11755 21860 14590 -6655 -9170 6184 19196 14362 16642 23961 26995
14104 26995 19760 17932 14025 -4859 -4699 -1220 -3611 4526 23100 27309 26253 23488 26487 17562
14090 17562 14280 14048 9591 9997 11943 13763 15716 16389 8931 13247 20266 4830 -2968 798 829
14075 829 6711 15568 17514 21494 15163 6292 9714 29724 19868 5150 21024 34108 40950 37217
14061 37217 29283 27381 18492 15616 9167 6545 2261 8500 23097 26281 7793 618 8244 10375
14047 10375 6821 4750 17941 8194 9010 3150 -10578 -22476 -3517 3809 18647 20587 12984
14034 12984 -5238 -7039 -3347 1212 2919 9907 6126 -332 2602 9852 16153 8940 -5690 -298
14020 -298 9832 12560 7809 3763 24602 26107 14560 12306 11301 21798 32161 26101 26292 35523
$$ packed form
14117B7830m487j2322P34J0105p270k1245k515J5354J3012m834K280P319L034
14104B6995p235j828l907j8884J60L479k391Q137J8574M209j056k765K999q925
14090A7562l282k32m457M06J946J820J953O73p458M316P019j5436p798L766L1
14075H29N882Q857J946L980o331q871L422K0010r856j4718J5874J3084O842l733
14061C7217p934j902q889k876o449k622m284O239J4597L184j8488p175P626K131
14047A0375l554k071J3191r747Q16n860j3728j1898J8959P326J4838J940p603
14034A2984j8222j801L692M559J707O988l781o458K934P250O301p213j4630N392
14020b98J0130K728m751m046K0839J505j1547k254j005J0497J0363o060J91R231
$$ plain form
14006 35523 52662 52630 40503 37671 41413 46031 32114 18665 26997 33760 37571 26837 33052 36983
13992 36983 21249 8622 15531 28980 34438 36655 44999 50004 48558 41469 33152 43092 53419
13979 53419 76630 78077 51476 32151 14643 15849 47693 44959 33262 21876 23503 34073
13967 34073 38205 49163 55609 42268 40553 32667 27997 39704 47808 54606 48995 50959 45185 31826
13953 31826 30807 14814 20987 33112 54185 54023 66428 79201 69294 45695 35090 51796 76964
13940 76964 77043 64737 64875 59175 63321 65488 59035 55196 59565 53420 57059 50096 49736 58173 51072
13925 51072 54673 71090 72398 72447 77422 78514 87381 75291 55815 55896 71091 89917 91500 101297
13911 101297 112495 125239 125132 118084 118253 125802 119499 104216 94382 104040 122167 117544 108164 102701
$$ packed form
14006C5523J7139l2j2127k832L742M618j3917j3449Q332O763L811j0734O215L931
13992C6983j5734j2627O909J3449N458K217Q344N005j446p089q317R940J0327
13979E3419K3211J447k6601j9325j7508J206L1844k734j1697j1386J627J0570
13967C4073M132J0958O446j3341j715p886m670J1707Q104O798n611J964n774j3359
13953C1826j019j5993O173J2125K1073j62J2405J2773r907k3599j0605J6706K5168
13940G6964P9j2306J38n700M146K167o453l839M369o145L639o963l60Q437p101
13925E1072L601J6417J308M9M975J092Q867j2090j9476Q1J5195J8826J583R797
13911A01297J1198J2744j07p048J69P549o303j5283r834R658J8127m623r380n463
$$ plain form
13897 102701 99159 106129 94818 89845 101063 116372 119808 124279 130919 131067 148335 150137 143608
13884 143608 150803 160730 164566 176773 185868 184526 181278 198225 219519 205566 203928 212500 218959
13871 218959 210845 209792 203415 217286 218906 224649 227472 238543 232741 228999 230537 231643 250401
13858 250401 263162 268497 264754 262103 270367 283240 291638 297068 299315 298088 295500 302702 307092 311891
13844 311891 332027 338242 355166 357466 352950 360430 373460 382719 403052 431271 461253 459809 457850
13831 457850 462845 463014 475625 495430 497291 491518 506508 517033 529257 536578 540808 540999 564082
13818 564082 576962 596693 610951 612429 621479 639227 656145 675776 702041 737279 762282 782827
13806 782827 784667 799367 818316 839250 851599 878553 892332 914601 933773 956471 986076 998791
$$ packed form
13897A02701l542O970j1311m973J1218J5309L436M471O640J48J7268J802o529
13884A43608P195R927L836J2207R095j342l248J6947K1294j3953j638Q572O459
13871B18959q114j053o377J3871J620N743K823J1071n802l742J538J106J8758
13858B50401J2761N335l743k651Q264J2873Q398N430K247j227k588P202M390M799
13844C11891K0136O215J6924K300m516P480J3030R259K0333K8219K9982j444j959
13831D57850M995J69J2611J9805J861n773J4990J0525J2224P321M230J91K3083
13818E64082J2880J9731J4258J478R050J7748J6918J9631K6265L5238K5003K0545
13806G82827J840J4700J8949K0934J2349K6954J3779K2269J9172K2698K9605J2715
$$ plain form
13794 998791 1017679 1027774 1044425 1078256 1104229 1127823 1164020 1195372 1209429 1232017 1250807
13783 1250807 1278178 1299441 1333059 1367482 1385844 1422982 1455007 1479555 1514057 1549258 1576564
13772 1576564 1620380 1653238 1687409 1716106 1757977 1778987 1806935 1841033 1872259 1915578 1953295
13761 1953295 1989907 2016883 2059278 2090990 2124098 2163568 2207746 2254572 2282428 2331031 2378853
13750 2378853 2421566 2465464 2507628 2543123 2573659 2610983 2643950 2693662 2744070 2788394 2823915
13739 2823915 2862834 2906856 2935234 2974011 3017381 3075168 3100958 3132154 3180810 3214195 3246453
13728 3246453 3290805 3339556 3385155 3426814 3465819 3508949 3546506 3572571 3614351 3650408 3691782
13717 3691782 3706658 3725220 3755613 3782947 3824301 3852750 3874336 3911549 3946011 3977627 4017226
$$ packed form
13794I98791J8888J0095J6651L3831K5973K3594L6197L1352J4057K2588J8790
13783A250807K7371K1263L3618L4423J8362L7138L2025K4548L4502L5201K7306
13772A576564M3816L2858L4171K8697M1871K1010K7948L4098L1226M3319L7717
13761A953295L6612K6976M2395L1712L3108L9470M4178M6826K7856M8603M7822
13750B378853M2713M3898M2164L5495L0536L7324L2967M9712N0408M4324L5521
13739B823915L8919M4022K8378L8777M3370N7787K5790L1196M8656L3385L2258
13728C246453M4352M8751M5599M1659L9005M3130L7557K6065M1780L6057M1374
13717C691782J4876J8562L0393K7334M1354K8449K1586L7213L4462L1616L9599
$$ plain form
13706 4017226 4041301 4062225 4068567 4079657 4086318 4096494 4107761 4135706 4161844 4177153 4177867 4182151
13694 4182151 4201342 4211974 4212822 4202853 4197680 4202942 4205195 4194618 4195995 4189267 4177709 4170494 4151869
13681 4151869 4144324 4135155 4122785 4105943 4091255 4094523 4096051 4086063 4062721 4046263 4030333 4015964
13669 4015964 4000360 3970606 3929827 3896656 3859883 3841219 3817124 3778831 3742233 3704720 3679791
13658 3679791 3658526 3627665 3602243 3572301 3532831 3492028 3454267 3419547 3382678 3329149 3295611
13647 3295611 3282691 3249648 3193781 3125758 3095390 3062684 3016432 2974105 2943931 2885959 2837677
13636 2837677 2799750 2773932 2732036 2684706 2645500 2597332 2550364 2507242 2475691 2438719 2396667
13625 2396667 2368683 2331718 2295781 2255957 2207458 2151649 2096478 2057024 2038338 2016652 1975152
$$ packed form
13706D017226K4075K0924O342J1090O661J0176J1267K7945K6138J5309P14M284
13694D182151J9191J0632Q48r969n173N262K253j0577J377o728j1558p215j8625
13681D151869p545r169j2370j6842j4688L268J528r988k3342j6458j5930j4369
13669D015964j5604k9754m0779l3171l6773j8664k4095l8293l6598l7513k4929
13658C679791k1265l0861k5422k9942l9470m0803l7761l4720l6869n3529l3538
13647C295611j2920l3043n5867o8023l0368l2706m6252m2327l0174n7972m8282
13636B837677l7927k5818m1896m7330l9206m8168m6968m3122l1551l6972m2052
13625B396667k7984l6965l5937l9824m8499n5809n5171l9454j8686k1686m1500
$$ plain form
13614 1975152 1939870 1915584 1882853 1845914 1821910 1801596 1762808 1727396 1678570 1633427 1606631
13603 1606631 1580708 1551328 1519415 1489993 1465334 1445558 1417536 1389047 1364742 1333853 1297588
13592 1297588 1272603 1247790 1211630 1179391 1152626 1129553 1106105 1093988 1076715 1043095 1019563
13581 1019563 1002785 993849 974300 956988 938071 922125 901018 879893 866493 848207 833183
13570 833183 821784 798681 784213 766260 743163 725865 698827 689998 678566 651067 644078 642592
13558 642592 624965 609307 593315 580288 569176 548924 538682 529231 526647 507523 483994 491278
13546 491278 491731 487030 473446 457522 451312 450077 447501 440384 443877 434322 424050 398605 370206
13533 370206 354256 341771 344647 345208 335062 334866 339475 327624 323840 322041 308783 308327 317048 314303
$$ packed form
13614A975152l5282k4286l2731l6939k4004k0314l8788l5412m8826m5143k6796
13603A606631k5923k9380l1913k9422k4659j9776k8022k8489k4305l0889l6265
13592A297588k4985k4813l6160l2239k6765k3073k3448j2117j7273l3620k3532
13581A019563j6778q936j9549j7312j8917j5946k1107k1125j3400j8286j5024
13570H33183j1399k3103j4468j7953k3097j7298k7038q829j1432k7499o989j486
13558F42592j7627j5658j5992j3027j1112k0252j0242r451k584j9124k3529P284
13546D91278M53m701j3584j5924o210j235k576p117L493r555j0272k5445k8399
13533C70206j5950j2485K876N61j0146j96M609j1851l784j799j3258m56Q721k745
$$ plain form
13519 314303 307928 285088 278031 269887 263365 252269 228369 212447 223753 256442 259753 245802
13507 245802 250519 241571 235957 221800 221079 225318 232631 239023 239669 213540 226824 231145 224250 213540
13493 213540 205840 205859 203190 187925 194514 204764 203479 196931 191627 188776 174260 173476 177277 166174
13479 166174 167374 173153 178212 179800 181926 179473 168507 172585 182060 171333 140409 131916 134689
13466 134689 136794 132641 138894 142326 136596 153090 174129 179779 180480 168517 169636 176861 174532 151079
13452 151079 136636 125060 122184 129455 132266 130522 121558 123620 135482 145276 149372 154384 180649
13439 180649 178724 169640 168434 181340 178115 173794 156354 153579 151524 141884 149626 166472 167277 145604
13425 145604 143417 141263 139332 144604 154878 152079 153970 157620 143076 147480 151665 149207 151220 150055
$$ packed form
13519C14303o375k2840p057q144o522j1096k3900j5922J1306L2689L311j3951
13507B45802M717q948n614j4157p21M239P313O392O46k6129J3284M321o895j0710
13493B13540p700J9k669j5265O589J0250j285o548n304k851j4516p84L801j1103
13479A66174J200N779N059J588K126k453j0966M078R475j0727l0924q493K773
13466A34689K105m153O253L432n730J6494K1039N650P01j1963J119P225k329k3453
13452A51079j4443j1576k876P271K811j744q964K062J1862R794M096N012K6265
13439A80649j925r084j206J2906l225m321j7440k775k055r640P742J6846Q05k1673
13425A45604k187k154j931N272J0274k799J891L650j4544M404M185k458K013j165
$$ plain form
13411 150055 152831 142359 143778 159597 158723 156349 141404 123775 123230 116540 121538 129715 136758 149933
13397 149933 142724 135481 133032 121560 122539 108816 100551 106022 116478 115206 104475 105017 121937
13384 121937 126440 128358 128162 139073 125576 110722 101415 89220 85726 94347 113723 116486 132449
13371 132449 141691 135004 121520 119698 115634 101550 85297 92167 106691 101204 87648 91301 109189
13358 109189 109048 107288 103001 114983 110039 101828 96456 96494 77846 74288 72113 95685 113704 102335
13344 102335 95776 101433 100395 94904 98569 104266 105801 101223 103940 100322 104213 108957 117847 118328
13330 118328 118489 120513 107504 84745 79894 89230 88365 93976 109909 120628 136473 140714 142827
13317 142827 137332 133649 135338 140408 138326 125146 121634 126819 111912 108342 110444 119390 138213
$$ packed form
13411A50055K776j0472J419J5819q74k374j4945j7629n45o690M998Q177P043J3175
13397A49933p209p243k449j1472R79j3723q265N471J0456j272j0731N42J6920
13384A21937M503J918j96J0911j3497j4854r307j2195l494Q621J9376K763J5963
13371A32449R242o687j3484j822m064j4084j6253O870J4524n487j3556L653J7888
13358A09189j41j760m287J1982m944q211n372L8j8648l558k175K3572J8019j1369
13344A02335o559N657j038n491L665N697J535m578K717l618L891M744Q890M81
13330A18328J61K024j3009k2759m851R336q65N611J5933J0719J5845M241K113
13317A42827n495l683J689N070k082j3180l512N185j4907l570K102Q946J8823
$$ plain form
13304 138213 131410 127117 122417 108034 121919 117343 117175 128220 126733 113745 110367 107860 105627
13291 105627 114553 117374 122536 128674 131953 132550 132336 131311 131172 109680 95325 97391 96217 97962
13277 97962 116865 116333 124380 133062 125351 115573 106291 111729 114258 124338 127677 129371 122231 126809
13263 126809 135294 136266 119382 93823 92880 108327 111355 107069 95863 81810 80814 87698 103978
13250 103978 119765 130098 131392 113876 117036 123217 120214 111053 109302 114424 104671 87865 84704
13237 84704 89449 85743 73747 77507 90857 92637 91300 82388 73455 76077 73608 73696 64962 73855
13223 73855 81121 73593 65879 71538 78111 73366 77811 83557 83268 73483 73478 69273 57422 62861 59685
13208 59685 66684 60937 61666 62196 48115 55287 68543 72436 74881 82840 85239 75136 64664 57896
$$ packed form
13304A38213o803m293m700j4383J3885m576j68J1045j487j2988l378k507k233
13291A05627Q926K821N162O138L279N97k14j025j39k1492j4355K066j174J745
13277I7962J8903n32Q047Q682p711r778r282N438K529J0080L339J694p140M578
13263A26809Q485R72j6884k5559r43J5447L028m286j1206j4053r96O884J6280
13250A03978J5787J0333J294j7516L160O181l003r161j751N122r753j6806l161
13237H4704M745l706j1996L760J3350J780j337q912q933K622k469Q8q734Q893
13223G3855P266p528p714N659O573m745M445N746k89r785nm205j1851N439l176
13208E9685O999n747P29N30j4081P172J3256L893K445P959K399j0103j0472o768
$$ plain form
13194 57896 65264 70571 69303 50569 43390 47124 42037 32543 49747 77187 67240 68448 93537
13181 93537 99468 103585 85505 86506 99897 102423 97555 84030 67232 70898 80537 82632 79718
13168 79718 66484 59745 51669 46698 45505 54081 63357 67852 61387 70225 73864 72448 72463 77177 84077
13153 84077 71645 58219 55066 66570 86133 79354 70610 65108 59824 63024 68671 72978 75710
13140 75710 63830 54684 47220 45989 47548 52383 40898 35876 30881 36784 44337 48208 32135 18859
13126 18859 31583 28513 14877 5006 8053 17892 26145 42571 42741 37293 35679 47984 51734 42930
13112 42930 20598 7507 8074 23019 37224 29978 36272 35484 27387 12349 11338 2816 -5502 5648
13098 5648 13189 10180 17519 37882 42156 24056 10705 9525 2539 -934 16819 16551 6709 9453
$$ packed form
13194E7896P368N307j268j8734p179L734n087r494J7204K7440r947J208K5089
13181I3537N931M117j8080J001J3391K526m868j3525j6798L666R639K095k914
13168G9718j3234o739q076m971j193Q576R276M495o465Q838L639j416J5M714O900
13153H4077j2432j3426l153J1504J9563o779q744n502n284L200N647M307K732
13140G5710j1880r146p464j231J559M835j1485n022m995N903P553L871j6073j3276
13126A8859J2724l070j3636r871L047R839Q253J6426J70n448j614J2305L750q804
13112D2930k2332j3091N67J4945J4205p246O294p88q097j5038j011q522q318J1150
13098E648P541l009P339K0363M274j8100j3351j180o986l473J7753k68r842K744
$$ plain form
13084 9453 27808 19077 7067 -3642 -16490 -25740 -8081 -436 -7446 -16284 -7171 -5572 -12531
13071 -12531 -13720 -12942 -9597 -5346 541 20498 29816 34009 29395 17802 20108 35297 33445 13021
13057 13021 7755 14089 27310 29285 25357 24104 25932 18670 11157 -707 -12725 -9691 -5825 -18749
13043 -18749 -13655 -8484 -7860 -10240 -7354 -1801 2490 -10584 -6762 -2649 -735 1640 -2818 -4018
13029 -4018 11981 23715 15479 19921 21587 13943 17166 4604 -3862 11360 22456 24771 20733
13016 20733 18548 18009 20511 18828 3100 -8989 -18459 -24112 -25133 -27867 -18999 -25643 -28821 -10607
13002 -10607 -3586 8753 5020 12226 12470 -1923 -9855 -539 7332 13949 14771 10204 8470 4865
12988 4865 -7522 -14398 -15656 -17464 -13814 -9723 7755 16310 10459 -2474 -6305 11667 19420 17705
$$ packed form
13084I453J8355q731j2010j0709j2848r250J7659P645p010q838R113J599o959
13071a2531j189P78L345M251N887J9957R318M193m614j1593K306J5189j852k0424
13057A3021n266O334J3221J975l928j253J828p262p513j1864j2018L034L866j2924
13043a8749N094N171O24k380K886N553M291j3074L822M113J914K375m458j200
13029d018J5999J1734q236M442J666p644L223j2562q466J5222J1096K315m038
13016B0733k185n39K502j683j5728j2089r470n653j021k734Q868o644l178J8214
13002a0607P021J2339l733P206K44j4393p932R316P871O617Q22m567j734l605
12988D865j2387o876j258j808L650M091J7478Q555n851j2933l831J7972P753j715
$$ plain form
12974 17705 3129 -13926 -27381 -27231 -26042 -17865 -10315 -3462 -3362 7951 12783 21399 18489 17777
12960 17777 12406 7445 14241 19444 7711 5826 16808 29959 17730 14799 14282 25815 29751
12947 29751 18752 21021 34712 30967 14878 6865 17388 18955 22322 12524 -4521 -10141 4546
12934 4546 13369 10151 21822 17000 14229 12572 5568 -354 14395 21146 18880 6123 3851 -2276
12920 -2276 9189 7080 1336 -3759 1778 126 6696 13352 15343 14986 16680 11847 17843 21609 16207
12905 16207 14574 14898 26322 27601 12928 18496 18258 7225 3406 3330 17017 16855 2161 -1696
12891 -1696 -3467 -8405 -17180 -12757 -3952 -9513 -27050 -43927 -38792 -32521 -18710 -11768 -5722 -6629
12877 -6629 -2744 1939 -8474 -8712 7755 -4421 -20531 -9933 5251 11687 7534 2810 -7954
$$ packed form
12974A7705j4576j7055j3455J50J189Q177P550O853J00J1313M832Q616k910p12
12960A7777n371m961O796N203j1733j885J0982J3151j2229k931n17J1533L936
12947B9751j0999K269J3691l745j6089q013J0523J567L367r798j7045n620J4687
12934D546Q823l218J1671m822k771j657p004n922J4749O751k266j2757k272o127
12920b276J1465k109n744n095N537j652O570O656J991l57J694m833N996L766n402
12905A6207j633L24J1424J279j4673N568k38j1033l819p6J3687j62j4694l857
12891a696j771m938q775M423Q805n561j7537j6877N135O271J3811O942O046r07
12877f629L885M683j0413k38J6467j2176j6110J0598J5184O436m153m724j0764
$$ plain form
12864 -7954 3642 23020 32771 23477 3717 -7196 -12820 -17469 -1421 3664 -12727 -8512 -2358
12851 -2358 5847 9884 10841 14966 8147 6188 -10380 -6988 -13998 -6211 2826 5820 5095 -2699 -22408
12836 -22408 -35328 -20737 -18047 -7932 -2124 1726 10535 6479 -1463 -5807 -279 2397 -2763 8165
12822 8165 16129 14177 -3109 -11324 -1961 7850 10079 21218 24216 18153 467 5274 -5564 -10254
12808 -10254 -2784 2328 6946 1890 -13167 -5890 4330 86 -8274 -9147 -1333 -2444 -2536 3178 6770
12793 6770 137 7787 6229 9417 17322 -2002 -28073 -21423 -12069 -8101 -1211 11440 15130 10558
12779 10558 11258 9716 19315 37902 34708 26763 21839 22081 25670 25800 19400 13774 13068 27467 21654
12764 21654 3922 -9298 -8449 -10673 -8961 5291 19475 15401 -9101 -19429 -1 12681 18408
$$ packed form
12864g954J1596J9378R751r294j9760j0913n624m649J6048N085j6391M215O154
12851b358Q205M037R57M125o819j959j6568L392p010P787R037K994p25p794j9709
12836b2408j2920J4591K690J0115N808L850Q809m056p942m344N528K676n160J0928
12822H165P964j952j7286q215R363R811K229J1139K998o063j7686M807j0838m690
12808a0254P470N112M618n056j5057P277J0220m244q360q73P814j111r2N714L592
12793F770o633P650j558L188P905j9324k6071O650R354L968O890J2651L690m572
12779A0558P00j542R599J8587l194p945m924K42L589J30o400n626p06J4399n813
12764B1654j7732j3220Q49k224J712J4252J4184m074k4502j0328J9428J2682N727
$$ plain form
12751 18408 12316 -6436 -10363 -2419 -4942 -6466 461 3975 -1965 3052 9374 6510 -1761 -5323
12737 -5323 -4077 -4980 2854 9819 5503 -8159 -25516 -32382 -18864 -7164 -1284 -3370 6269 8080
12723 8080 12439 12818 -6943 -19629 -9888 7519 26356 21964 9749 -475 -11862 -6479 -5499
12710 -5499 -17305 -9675 1354 -3986 -8811 -8812 828 -13937 -24244 -12211 9096 11636 6280 -2060
12696 -2060 -3138 4346 15320 -3399 -9319 2442 12707 25464 20969 9385 11157 8789 22146
12683 22146 30290 42072 32923 30361 11960 10378 9603 14554 28264 31470 29436 27114 17048 19621
12669 19621 18388 4787 4217 1188 -18945 -26118 -24278 290 5823 -4262 -20884 -36266 -31678
12656 -31678 -34938 -16696 -375 3096 -4045 -9116 -7134 8894 13194 7903 8193 16214 21543 10801
$$ packed form
12751A8408o092j8752l927P944k523j524O927L514n940N017O322k864q271l562
12737e323J246r03P834O965m316j3662j7357o866J3518J1700N880k086R639J811
12723H080M359L79j9761j2686R741J7407J8837m392j2215j0224j1387N383R80
12710e499j1806P630J1029n340m825jR640j4765j0307J2033K1307K540n356q340
12696b060j078P484J0974j8719n920J1761J0265J2757m495j1584J772k368J3357
12683B2146Q144J1782r149k562j8401j582p75M951J3710L206k034k322j0066K573
12669A9621j233j3601n70l029k0133p173J840K4568N533j0085j6622j5382M588
12656c1678l260J8242J6321L471p141n071J982J6028M300n291K90Q021N329j0742
$$ plain form
12642 10801 26058 28070 40653 32029 12617 -708 13672 16738 11147 1682 1346 3724 -4210
12629 -4210 -6142 1221 16638 21691 6177 8967 3265 961 21642 27343 24818 13638 21664 26309
12615 26309 18223 21623 12522 907 -6269 -8158 -2650 -2017 -12730 -8091 4330 8687 11019 13306
12601 13306 24414 19606 21351 29878 37879 29823 28305 29105 35895 31423 25533 13708 31092 28617
12587 28617 13778 20718 28891 13087 2820 11220 5188 1533 -68 417 -5996 -9939 15899 56372
12573 56372 73100 86260 117340 171138 251310 347556 389137 350159 273157 199277 139297 108596
12561 108596 82255 62082 55781 55937 49055 38568 38515 39108 45888 51818 50090 45855 48313 44890
12547 44890 44111 26235 24832 21390 21923 35175 44988 29066 22854 31186 36660 22955 4793 12013
$$ packed form
12642A0801J5257K012J2583q624j9412j3325J4380L066n591r465l36K378p934
12629d210j932P363J5417N053j5514K790n702k304K0681N701k525j1180Q026M645
12615B6309q086L400r101j1615p176j889N508O33j0713M639J2421M357K332K287
12601A3306J1108m808J745Q527Q001q056j518Q00O790m472n890j1825J7384k475
12587B8617j4839O940Q173j5804j0267Q400o032l655j601M85o413l943K5838M0473
12573E6372J6728J3160L1080N3798Q0172R6246M1581l8978p7002p3880n9980l0701
12561A08596k6341k0173o301J56o882j0487n3N93O780N930j728m235K458l423
12547D4890p79j7876j403l442N33J3252R813j5922o212Q332N474j3705j8162P220
$$ plain form
12533 12013 1501 -1831 8162 4961 5537 -7659 -14361 -19269 -18922 -1201 -3764 -1720 5376 9792
12519 9792 16950 11854 -3012 -15326 -14981 -14037 -15831 -10428 8825 34797 23772 25795 16549 18936
12505 18936 22406 26155 31058 40373 40412 52612 50489 41307 31237 15968 14385 1709 9747 14544
12491 14544 15966 13739 16937 22176 22402 30745 23091 17286 22416 29447 22939 22698 27140 19634 4414
12476 4414 11415 29373 43869 40417 26913 14060 16691 24587 47313 72468 82267 94773 112696
12463 112696 117482 142549 209353 309009 426227 594078 879461 1361367 2029681 2590082
12453 2590082 2655883 2292226 1708777 1203736 874605 673200 540169 462266 428215 432215
12443 432215 434888 432605 402228 361728 328893 324401 292020 269127 252577 228183 196184 166542
$$ packed form
12533A2013j0512l332R993l201N76j3196o702m908L47J7721k563K044P096M416
12519I792P158n096j4866j2314L45R44j794N403J9253K5972j1025K023r246K387
12505A8936L470L749M903R315L9J2200k123r182j0070j5269j583j2676Q038M797
12491A4544J422k227L198N239K26Q343p654n805N130P031o508k41M442p506j5220
12476D414P001J7958J4496l452j3504j2853K631P896K2726K5155R799J2506J7923
12463A12696M786K5067O6804R9656J17218J67851K85383M81906O68314N60401
12453B590082O5801l63657n83449n05041l29131k01405j33031p7903l4051M000
12443D32215K673k283l0377m0500l2835m492l2381k2893j6550k4394l1999k9642
$$ plain form
12431 166542 154910 144634 129096 118049 109320 116155 116035 104253 95762 88826 101605 89758 72989
12418 72989 63890 44938 33782 35018 35197 29469 26700 27039 16577 9981 21637 26516 19665 5101
12404 5101 15722 26655 31976 16557 10371 5069 3405 2420 1687 20985 31991 41750 24988 15176
12390 15176 5661 6355 7186 7361 6201 11584 57 -3516 -2686 7169 14636 11087 7551 795 3169
12375 3169 7168 -7849 -19213 -16553 -10966 -2011 3122 5483 7615 845 3854 8611 1577 10149
12361 10149 9271 3550 20213 36166 37063 20907 13256 -2156 -15342 -15599 -4622 -6055 -12510 -6735
12347 -6735 4334 -5088 -9924 4817 5349 1593 878 -513 4264 15856 15289 21694 9671 4222
12333 4222 1423 4963 12384 15397 3613 -11448 -26404 -31191 -28520 -20171 -9065 6360 18749
$$ packed form
12431A66542j1632j0276j5538j1047q729O835j20j1782q491o936J2779j1847j6769
12418G2989r099j8952j1156J236J79n728k769L39j0462o596J1656M879o851j4564
12404E101J0621J0933N321j5419o186n302j664r85p33J9298J1006R759j6762r812
12390A5176r515O94Q31J75j160N383j1527l573Q30R855P467l549l536o756K374
12375C169L999j5017j1364K660N587Q955N133K361K132o770L009M757p034Q572
12361A0149q78n721J6663J5953Q97j6156p651j5412j3186k57J0977j433o455N775
12347f735J1069r422m836J4741N32l756p15j391M777J1592n67O405j2023n449
12333D222k799L540P421L013j1784j5061j4956m787K671Q349J1106J5425J2389
$$ plain form
12320 18749 18348 24519 21767 14467 6048 773 9968 1564 1106 4135 2842 9556 4291 -2465 -4106
12305 -4106 54 4747 6656 14096 7405 3700 11342 9818 5467 12059 20483 20814 13025 6442 3192
12290 3192 -1173 -3208 -8116 14511 13143 -747 16985 23078 21111 13223 -5584 -587 11080
12277 11080 11034 9812 9806 -2267 -7345 -8742 -11049 -15564 -17044 -18513 -25121 -13265 -11046 523 -49
12262 -49 1297 5405 17756 8712 -8291 -10970 -3633 11037 20367 16834 6582 5749 9417 11160
12248 11160 6578 798 1566 622 -560 5707 12328 -3129 -2487 6600 8603 17390 18438 15067 -3418
12233 -3418 -6187 -4917 3400 2728 -5094 -3767 1656 9406 12269 9968 18369 19836 16633 -1633 -8426
12218 -8426 4204 5878 3626 8232 7241 7649 143 -4488 -16499 -25289 -21550 -4205 5410 -220
$$ packed form
12320A8749m01O171k752p300q419n275R195q404m58L029j293O714n265o756j641
12305d106M160M693J909P440o691l705P642j524m351O592Q424L31p789o583l250
12290C192m365k035m908K2627j368j3890J7732O093j967p888j8807M997J1667
12277A1080m6j222oj2073n078j397k307m515j480j469o608J1856K219J1569n72
12262d9J346M108J2351r044j7003k679P337J4670R330l533j0252q33L668J743
12248A1160m582n780P68r44j182O267O621j5457O42R087K003Q787J048l371j8485
12233c418k769J270Q317o72p822J327N423P750K863k301Q401J467l203j8266o793
12218h426J2630J674k252M606r91M08p506m631j2011q790L739J7345R615n630
$$ plain form
12204 -220 -13054 -14779 -14962 -2481 12523 25922 24094 17379 688 -5846 -9676 -13460 -6455 -681
12190 -681 1280 5827 5290 -5178 -6105 -61 9465 4854 7176 13115 17264 19344 3294 5348 4624
12175 4624 6179 2768 -849 3458 91 1768 4455 6327 -5890 -18631 -5044 -2320 -7902 1562
12161 1562 4711 1229 1478 -4217 -22756 -22616 -18301 -5710 -370 5535 -3973 -13552 -28254 -41238
12147 -41238 -30750 -21607 -5985 10796 6961 440 -6980 -16035 -19064 -16942 6813 8124 10065
12134 10065 11339 4811 1714 3281 25402 23045 15495 16798 19391 5438 1042 -3001 -346 3705
12120 3705 15195 16163 8117 -6220 -3273 6843 4447 6019 478 -13551 -14924 8743 17223 27461
12106 27461 36033 38165 50173 41811 33825 47736 68839 80118 78857 56429 33518 35923 25246
$$ packed form
12204b20j2834j725j83J2481J5004J3399j828o715j6691o534l830l784P005N774
12190f81J961M547n37j0468r27O044R526m611K322N939M149K080j6050K054p24
12175D624J555l411l617M307l367J677K687J872j2217j2741J3587K724n582R464
12161A562L149l482K49n695j8539J40M315J2591N340N905r508r579j4702j2984
12147d1238J0488R143J5622J6781l835o521p420r055l029K122K3755J311J941
12134A0065J274o528l097J567K2121k357p550J303K593j3953m396m043K655M051
12120C705J1490R68q046j4337K947J0116k396J572n541j4029j373K3667Q480J0238
12106B7461Q572K132J2008q362p986J3911K1103J1279j261k2428k2911K405j0677
$$ plain form
12093 25246 21135 22476 17862 11041 3650 6648 17176 17332 14205 9767 12655 24681 22217 20965
12079 20965 26820 13924 778 -2086 -13401 -12327 -5354 -15997 -16736 -9936 3078 16532 23383
12066 23383 12349 -22 3238 -4073 3883 2896 -1650 1637 6262 21749 14383 7538 7839 3958
12052 3958 -10125 -16484 -17484 -9483 4574 9467 -5119 -9648 -4727 -9433 -4343 -3957 -693 8675
12038 8675 11619 12792 9140 13341 17370 21725 20185 12193 -48 -8529 -5386 -10861 -15407 -8056
12024 -8056 4696 14078 26572 20188 10103 11021 28901 25611 17437 11611 10523 15407 3449 2954
12010 2954 -596 -5968 -6725 2216 1364 -457 896 -3967 -2206 5770 20310 27913 17098 7911 -5618
11995 -5618 -7834 924 -581 -6730 -8250 -4061 1857 12324 14610 3962 5245 8436 9864 10160
$$ packed form
12093B5246m111J341m614o821p391K998J0528J56l127m438K888J2026k464j252
12079B0965N855j2896j3146k864j1315J074O973j0643p39O800J3014J3454O851
12066B3383j1034j2371L260p311P956r87m546L287M625J5487p366o845L01l881
12052C958j4083o359j000Q001J4057M893j4586m529M921m706N090L86L264R368
12038H675K944J173l652M201M029M355j540p992j2241q481L143n475m546P351
12024h056J2752R382J2494o384j0085R18J7880l290q174n826j088M884j1958m95
12010B954l550n372p57Q941q52j821J353m863J761P976J4540P603j0815r187j3529
11995e618k216Q758j505o149j520M189N918J0467K286j0648J283L191J428K96
$$ plain form
11981 10160 11156 21152 3645 -6295 2006 -1387 685 -1306 -2309 -3943 -518 4191 -1933 -8031
11967 -8031 4471 15984 27844 10660 0 5011 -14198 -22690 -5790 17776 21747 20819 21305
11954 21305 661 -5207 -1296 -2165 -5826 6266 5190 -13182 -5108 8186 5233 8158 15465 27119
11940 27119 34545 48144 42588 36846 36056 23591 11629 18730 36207 41374 45888 31894 18610
11927 18610 12670 17661 34113 29224 24589 18578 15946 29854 29094 33021 42533 39754 29827 24167
11913 24167 25148 30184 45762 55349 59604 95879 133197 142072 134347 90631 55869 40081 35190
11900 35190 33720 40191 44128 32487 15344 13038 22305 47713 85124 110436 130883 137758 133713
11887 133713 119063 108546 84476 77761 81920 81945 80988 98221 118261 139726 171160 218292 263794
$$ packed form
11981A0160R96R996j7507r940Q301l393K072j991j003j634L425M709o124o098
11967h031J2502J1513J1860j7184j0660N011j9209q492J6900K3566L971r28M86
11954B1305k0644n868L911q69l661J2092j076j8372Q074J3294k953K925P307J1654
11940B7119P426J3599n556n742p90j2465j1962P101J7477N167M514j3994j3284
11927A8610n940M991J6452m889m635o011k632J3908p60L927R512k779r927n660
11913B4167R81N036J5578R587M255L6275L7318Q875p725m3716l4762j5788m891
11900C5190j470O471L937j1641j7143k306R267K5408L7411K5312K0447O875m045
11887A33713j4650j0517k4070o715M159K5r57J7233K0040K1465L1434M7132M5502
$$ plain form
11874 263794 268815 257921 246043 220958 206358 205250 210691 189410 160370 118057 84025 73043
11862 73043 65183 59863 37585 31264 52652 69335 79158 87188 100683 114960 112880 123289 100082
11849 100082 88744 74456 67368 56403 58736 66123 63311 71627 74176 78773 64801 49124 31452
11836 31452 29610 46858 59813 44081 26796 23332 20215 16153 28519 23834 4995 -2009 1823
11823 1823 -895 -7356 -6534 -3335 2281 6650 5519 -5662 -24811 -42930 -26117 -15957 -13970 -2738
11809 -2738 4988 -5075 -2638 10971 12489 5284 6364 19061 5829 -6799 -179 37 6317 7285
11795 7285 9611 7904 15260 6773 -6560 -6706 -4486 -5242 -16912 -19243 -10247 -7302 -6089 -8560 2094
11780 2094 10379 3391 -4717 -7785 -19732 -23421 -12825 -953 22821 11530 11502 5812 4730 9932
$$ packed form
11874B63794N021j0894j1878k5085j4600j108N441k1281k9040m2313l4032j0982
11862G3043p860n320k2278o321K1388J6683R823Q030J3495J4277k080J0409k3207
11849A00082j1338j4288p088j0965K333P387k812Q316K549M597j3972j5677j7672
11836C1452j842J7248J2955j5732j7285l464l117m062J2366m685j8839p004L832
11823A823k718o461Q22L199N616M369j131j1181j9149j8119J6813J0160J987J1232
11809b738P726j0063K437J3609J518p205J080J2697j3232j2628O620K16O280R68
11795G285K326j707P356q487j3333j46K220p56j1670k331Q996K945J213k471J0654
11780B094Q285o988q108l068j1947l689J0596J1872K3774j1291k8n690j082N202
$$ plain form
11766 9932 2621 -8433 -1100 6628 10344 -3644 -7395 1870 -7280 -9068 143 -13495 -15630 -19930
11752 -19930 -31245 -42634 -36060 -19693 -6358 -6433 -11865 -18053 -23822 -19402 -5883 -7885 -29551
11739 -29551 -23372 -14360 -15076 -21198 -18975 -14512 -15171 -5257 -2339 -4285 -4 -1827 -1133 -6535 -1576
11724 -1576 -5843 -3923 9344 19607 13533 -13624 -9066 -11201 -6858 -11117 -6857 -6383 -10076 -8032
11710 -8032 2939 12062 14483 15368 16758 10397 12054 29481 23896 2025 12074 19104 20516 17821
11696 17821 12935 11345 17413 26866 27788 9782 6188 14804 13647 17230 12122 31331 44156 40182
11682 40182 18399 18974 20952 37492 49672 39986 39324 22019 11768 9119 17826 35659 33539
11669 33539 33565 53576 51874 55045 69897 99721 112063 109546 108658 113491 146876 169598 171080 168375
$$ packed form
11766I932p311j1054P333P728L716j3988l751R265r150j788R211j3638k135m300
11752a9930j1315j1389O574J6367J3335p5n432o188n769M420J3519k002k1666
11739b9551O179R012p16o122K223M463o59R914K918j946M281j823O94n402M959
11724a576m267J920J3267J0263o074k7157M558k135M343m259M260M74l693K044
11710h032J0971R123K421Q85J390o361J657J7427n585k1871J0049P030J412k695
11696A7821m886j590O068R453R22j8006l594Q616j157L583n108J9209J2825l974
11682D0182k1783N75J978J6540J2180r686o62j7305j0251k649Q707J7833k120
11669C3539K6K0011j702L171J4852K9824J2342k517q88M833L3385K2722J482k705
$$ plain form
11655 168375 159502 147609 157444 185222 227221 284708 368062 491776 686575 995982 1437074
11644 1437074 2035454 2644751 2964693 2871245 2539007 2182613 1900529 1633052 1361591 1102343
11634 1102343 868144 712982 617212 544936 498828 483438 448250 431708 399772 371951 349308
11623 349308 327076 302374 273845 254444 221480 217624 214105 190606 156270 142915 136800 138866
11611 138866 128929 112530 92213 77225 75050 69340 54928 49097 43969 28488 14948 20888 38808
11598 38808 46370 35204 22256 14602 6726 10635 3558 -1076 -4416 -18526 -5440 17640 31291
11585 31291 35433 24028 20524 25395 26856 24843 24929 20549 17895 20578 29806 42887 54825 53435
11571 53435 55160 45837 36918 28765 41854 62551 78682 83231 87342 99048 111591 132894 165631
$$ packed form
11655A68375q873j1893R835K7778M1999N7487Q3354J23714J94799L09407M41092
11644A437074N98380O09297L19942r3448l32238l56394k82084k67477k71461k59248
11634A102343k34199j55162r5770p2276m6108j5390l5188j6542l1936k7821k2643
11623C49308k2232k4702k8529j9401l2964l856l519k3499l4336j3355o115K066
11611A38866r937j6399k0317j4988k175n710j4412n831n128j5481j3540N940J7920
11598C8808P562j1166j2948p654p876L909p077m634l340j4110J3086K3080J3651
11585C1291M142j1405l504M871J461k013Q6m380k654K683R228J3081J1938j390
11571E3435J725r323q919q153J3089K0697J6131M549M111J1706J2543K1303L2737
$$ plain form
11558 165631 205359 269989 365750 506862 701459 944827 1141239 1202835 1182884 1208231 1381685
11547 1381685 1767082 2320492 2798281 2817753 2422653 1840041 1321628 986638 776661 653839
11537 653839 563902 495505 443056 409768 388533 376044 361274 361276 338994 316629 285552 249958
11525 249958 225711 207392 199235 195072 186641 176297 147696 128414 119373 103887 69225 55358
11513 55358 59087 56399 51443 43684 43562 32222 15997 7728 11837 21631 30674 41770 39198 38177
11499 38177 47419 49220 39869 33927 27360 26577 18623 9326 15 -4334 6100 13131 4995 2160
11485 2160 574 11515 13360 -2132 9721 17724 23048 19752 15301 23999 42284 38418 24552
11472 24552 19266 24066 11409 9399 7437 -998 -6038 9090 8827 21403 28127 21085 11698 1920
$$ packed form
11558A65631L9728O4630R5761J41112J94597K43368J96412O1596j9951K5347J73454
11547A381685L85397N53410M77789J9472l95100n82612n18413l34990k09977j22822
11537F53839q9937o8397n2449l3288k1235j2489j4770Kk2282k2365l1077l5594
11525B49958k4247j8319q157m163q431j0344k8601j9282r041j5486l4662j3867
11513E5358L729k688m956p759j22j1340j6225q269M109R794R043J1096k572j021
11499C8177R242J801r351n942o567p83p954r297r311m349J0434P031q136k835
11485B160j586J0941J845j5492J1853Q003N324l296m451Q698J8285l866j3866
11472B4552n286M800j2657k010j962q435n040J5128k63J2576O724p042r387r778
$$ plain form
11458 1920 -14598 -2876 -6194 -13479 -23439 -20597 -7776 -4260 -9451 -5655 -10523 -12157 745 452
11444 452 10392 30516 32807 30092 19761 2722 5733 8419 6462 -6070 -18464 -18327 747 18937
11430 18937 17228 19007 9669 4521 -440 -954 1888 20273 36805 33575 14044 10528 5035 3744
11416 3744 -7520 4227 7522 1785 -5556 -7481 -10013 -14452 -7939 -12081 -15778 -12873 918 -5992
11402 -5992 -13499 3581 6049 8079 13521 26037 16491 8065 16407 23754 16843 12044 23649 24649
11388 24649 15488 2310 10018 4904 645 -9733 -10506 2928 9372 -2852 3996 23191 22951 13721
11374 13721 17103 26371 15453 15992 6587 1656 -736 17601 21205 12360 9729 14502 12317 8270
11360 8270 10435 31248 35536 22650 -2301 -13863 -1617 6511 3792 -2963 -304 -5464 -18062
$$ packed form
11458A920j6518J1722l318p285r960K842J2821L516n191L796m868j634J2902k93
11444D52R940K0124K291k715j0331j7039L011K686j957j2532j2394J37J9074J8190
11430A8937j709J779r338n148m961n14K842J8385J6532l230j9531l516n493j291
11416C744j1264J1747L295n737p341j925k532m439O513m142l697K905J3791o910
11402e992p507J7080K468K030N442J2516r546q426Q342P347o911m799J1605J000
11388B4649r161j3178P708n114m259j0378p73J3434O444j2224O848J9195k40r230
11374A3721L382R268j0918N39r405m931k392J8337L604q845k631M773k185m047
11360H270K165K0813M288j2886k4951j1562J2246Q128k719o755K659n160j2598
$$ plain form
11347 -18062 -8586 -2220 -9724 -13296 -6940 14820 22937 26181 26323 15179 19205 20717 20461 23716
11333 23716 16054 18342 24261 18914 3789 -8669 4224 7727 2377 10473 12268 26241 33653
11320 33653 38157 34014 27663 21822 19041 25576 12506 -9177 -24275 -15909 1678 17752 21639
11307 21639 21022 17909 15654 13369 12477 5324 7014 10828 13307 27869 26299 20548 17113 10409 22806
11292 22806 24552 18357 28346 38867 59218 55431 57570 50815 42589 34041 31197 41812 44126 37763
11278 37763 35895 32208 27987 38394 54466 44960 35048 49594 58626 55702 48060 44521 35970 26631
11264 26631 5587 -2485 4895 22631 37663 37201 29091 24515 28559 19752 20434 22616 33210 33265
11250 33265 22696 27114 33196 47006 49436 49826 52464 50843 49896 36306 26556 19692 22824 29183
$$ packed form
11347a8062R476O366p504l572O356K1760Q117L244J42j1144M026J512k56L255
11333B3716p662K288N919n347j5125j2458J2893L503n350Q096J795J3973P412
11320C3653M504m143o351n841k781O535j3070k1683j5098Q366J7587J6074L887
11307B1639o17l113k255k285q92p153J690L814K479J4562j570n751l435o704J2397
11292B2806J746o195R989J0521K0351l787K139o755q226q548k844J0615K314o363
11278C7763j868l687m221J0407J6072r506r912J4546R032k924p642l539q551r339
11264B6631k1044q072P380J7736J5032m62q110m576M044q807O82K182J0594N5
11250C3265j0569M418O082J3810K430L90K638j621r47j3590r750o864L132O359
$$ plain form
11236 29183 47308 50005 44135 37679 38591 35940 39511 41906 44487 51071 36506 28535 19343 30216
11222 30216 45750 55780 47003 54315 63123 55165 44576 57517 58740 39054 33581 26609 10018
11209 10018 14656 13694 29804 45679 60434 55952 61959 62388 60035 54020 52349 57269 61375 62467
11195 62467 59438 69816 70374 72658 70345 84182 97502 97054 91341 72841 46963 53248 78919
11182 78919 80331 74770 74571 67613 70414 87235 79148 76415 66453 49407 47681 64246 64034 65421
11168 65421 76340 76244 57859 62009 75063 76041 69134 80732 105943 104363 79981 74226 76034 82613
11154 82613 94547 93913 100268 92614 86040 89040 88385 78740 63076 69486 81798 79831 72712 95108
11140 95108 102311 91817 83526 67881 58097 72383 70175 68521 72251 72898 83107 96393 91298
$$ packed form
11236B9183J8125K697n870o456R12k651L571K395K581O584j4565p971r192J0873
11222C0216J5534J0030q777P312Q808p958j0589J2941J223j9686n473o972j6591
11209A0018M638r62J6110J5875J4755m482O007M29k353o015j671M920M106J092
11195F2467l029J0378N58K284k313J3837J3320m48n713j8500k5878O285K5671
11182G8919J412n561j99o958K801J6821q087k733r962j7046j726J6565k12J387
11168F5421J0919r6j8385M150J3054R78o907J1598K5211j580k4382n755J808O579
11154H2613J1934o34O355p654o574L000o55r645j5664O410J2312j967p119K2396
11140I5108P203j0494q291j5645r784J4286k208j654L730O47J0209J3286n095
$$ plain form
11127 91298 101258 102236 98392 94073 96238 87983 92828 98112 92678 92740 99522 105548 115021 112776 115271
11112 115271 118403 126605 121095 113128 107734 120775 139365 161689 150174 132644 151582 154923 152441
11099 152441 153108 152468 167586 181027 174215 162349 162038 169606 190992 172671 162664 153193 152928 174091
11085 174091 185790 172862 176307 182964 187146 190100 188740 192404 200057 206227 202502 209013 231911
11072 231911 239534 246146 232553 238930 245726 249540 253913 260663 266123 260156 263112 266102 278643 285852
11058 285852 291875 294699 304564 309817 310834 329273 339345 343834 335509 333458 353237 378877 393615
11045 393615 377474 368906 370617 381407 380422 378258 378748 380952 400189 410014 415706 426599 432797 432804
11031 432804 439324 470879 489829 498404 506407 509784 521137 526851 522518 535543 551240 562597 574716
$$ packed form
11127I1298R960R78l844m319K165q255M845N284n434O2O782O026R473k245K495
11112A15271L132Q202n510p967n394J3041J8590K2324j1515j7530J8938L341k482
11099A52441O67o40J5118J3441o812j1866l11P568K1386j8321j0007r471k65K1163
11085A74091J1699j2928L445O657M182K954j360L664P653O170l725O511K2898
11072B31911P623O612j3593O377O796L814M373O750N460n967K956K990J2541P209
11058B85852O023K824R865N253J017J8439J0072M489q325k051J9779K5640J4738
11045C93615j6141q568J711J0790r85k164M90K204J9237R825N692J0893O198P
11031D32804O520L1555J8950Q575Q003L377J1353N714m333J3025J5697J1357J2119
$$ plain form
11018 574716 572673 557925 556206 575088 594216 601995 611678 620506 630607 646660 671738 680574 681640
11005 681640 690327 712838 732081 749039 748708 743068 752752 756736 779876 797323 820455 828981 823855
10992 823855 827778 843189 871905 883462 892934 897247 898389 908517 922597 942477 955642 974752
10980 974752 985625 995116 1009881 1008236 1013272 1048073 1066943 1065836 1077620 1084475 1092078 1102393 1129425
10967 1129425 1149127 1160472 1177715 1183390 1187195 1189942 1215176 1234433 1229715 1234154 1248078 1260265
10955 1260265 1281053 1288538 1316270 1342687 1345610 1351195 1347147 1359038 1374438 1386880 1392504 1399617
10943 1399617 1417266 1440570 1465299 1471444 1456331 1448118 1458590 1479945 1494139 1495016 1513795 1530736
10931 1530736 1536324 1539857 1542588 1564801 1578762 1603343 1621099 1650082 1678214 1692269 1704657 1727050
$$ packed form
11018E74716k043j4748j719J8882J9128P779R683Q828J0101J6053K5078Q836J066
11005F81640Q687K2511J9243J6958l31n640R684L984K3140J7447K3132Q526n126
10992H23855L923J5411K8716J1557R472M313J142J0128J4080J9880J3165J9110
10980I74752J0873R491J4765j645N036L4801J8870j107J1784O855P603J0315K7032
10967A129425J9702J1345J7243N675L805K747K5234J9257m718M439J3924J2187
10955A260265K0788P485K7732K6417K923N585m048J1891J5400J2442N624P113
10943A399617J7649K3304K4729O145j5113q213J0472K1355J4194Q77J8779J6941
10931A530736N588L533K731K2213J3961K4581J7756K8983K8132J4055J2388K2393
$$ plain form
10919 1727050 1762103 1773520 1775005 1790926 1801666 1820688 1829381 1835555 1843395 1845773 1840823 1857467
10907 1857467 1867325 1878346 1889186 1894910 1916100 1931879 1933051 1923754 1941981 1960658 1979849 1976710
10895 1976710 1967191 1973767 1979588 2001947 2011660 2007525 2002939 2012201 2036661 2057922 2063918 2078415 2090887
10882 2090887 2121759 2120589 2132961 2139623 2140416 2142249 2151026 2165884 2184064 2186189 2188566 2204580 2218059
10869 2218059 2222924 2233072 2248476 2267899 2275710 2278344 2286545 2297126 2290723 2307318 2314904 2314744 2323709
10856 2323709 2333613 2336938 2343240 2349739 2353452 2355974 2346101 2354620 2359746 2355852 2358079 2357660 2364317 2375626
10842 2375626 2382071 2394139 2405305 2403996 2399117 2417452 2426627 2430369 2426327 2428551 2452685 2450825 2443223
10829 2443223 2422244 2403711 2408339 2406102 2403105 2411211 2415547 2412862 2409159 2402789 2395425 2388717 2387893 2376311
$$ packed form
10919A727050L5053J1417J485J5921J0740J9022Q693O174P840K378m950J6644
10907A857467R858J1021J0840N724K1190J5779J172r297J8227J8677J9191l139
10895A976710r519O576N821K2359R713m135m586R262K4460K1261N996J4497J2472
10882B090887L0872j170J2372O662P93J833Q777J4858J8180K125K377J6014J3479
10869B218059M865J0148J5404J9423P811K634Q201J0581o403J6595P586j60Q965
10856B323709R904L325O302O499L713K522r873Q519N126l894K227m19O657J1309
10842B375626O445J2068J1166j309m879J8335R175L742m042K224K4134j860p602
10829B443223k0979j8533M628k237k997Q106M336k685l703o370p364o708q24j1582
$$ plain form
10815 2376311 2370078 2361963 2346684 2349631 2356114 2370980 2367309 2365740 2367199 2365782 2352278 2346137 2332445
10802 2332445 2321374 2310657 2297716 2296320 2282719 2270410 2271467 2275056 2270734 2267353 2267162 2273209 2265829
10789 2265829 2246416 2231196 2213105 2224309 2243810 2232974 2229439 2223970 2203600 2188762 2177126 2170842
10777 2170842 2182403 2196587 2182099 2168592 2163530 2166935 2163972 2167705 2154759 2137226 2125236 2111491
10765 2111491 2108348 2112063 2107755 2077739 2068006 2054693 2025314 2017136 2020395 2016966 2012118 1999001 1994381
10752 1994381 1972896 1961446 1957086 1959937 1950094 1938527 1925939 1911968 1902426 1888953 1875480 1859704
10740 1859704 1860936 1865406 1848488 1836764 1822824 1820450 1802843 1790415 1788242 1792325 1773818 1750512
10728 1750512 1740168 1740625 1734279 1723630 1709759 1690363 1680259 1659532 1641999 1641143 1630607 1626905
$$ packed form
10815B376311o233q115j5279K947O483J4866l671j569J459j417j3504o141j3692
10802B332445j1071j0717j2941j396j3601j2309J057L589m322l381j91O047p380
10789B265829j9413j5220j8091J1204J9501j0836l535n469k0370j4838j1636o284
10777B170842J1561J4184j4488j3507n062L405k963L733j2946j7533j1990j3745
10765B111491l143L715m308l0016r733j3313k9379q178L259l429m848j3117m620
10752A994381k1485j1450m360K851r843j1567j2588j3971r542j3473j3473j5776
10740A859704J232M470j6918j1724j3940k374j7607j2428k173M083j8507k3306
10728A750512j0344M57o346j0649j3871j9396j0104k0727j7533q56j0536l702
$$ plain form
10716 1626905 1630023 1613099 1592411 1576219 1578656 1570737 1566541 1557530 1534941 1517132 1502044 1498534
10704 1498534 1489532 1471303 1455259 1440902 1437356 1435220 1433478 1424851 1404047 1392772 1392514 1371175 1343062
10691 1343062 1327865 1310926 1299194 1280016 1260479 1249772 1249440 1255853 1257546 1251307 1246358 1226882
10679 1226882 1200813 1180439 1160717 1141851 1117663 1109244 1099017 1092076 1084909 1077185 1065217 1047818
10667 1047818 1029106 1004058 994799 993358 984719 965425 948769 924936 897434 881610 869696 863192
10655 863192 835649 821717 816868 815914 790465 762165 743298 739701 735236 731223 730104 717545 696335
10642 696335 680483 675441 657771 633954 632124 621299 614751 606431 586904 568930 540995 522764
10630 522764 525151 522810 521340 513088 501644 499347 491526 479990 484011 467514 454744 456709 451458
$$ packed form
10716A626905L118j6924k0688j6192K437p919m196r011k2589j7809j5088l510
10704A498534r002j8229j6044j4357l546k136j742q627k0804j1275k58k1339k8113
10691A343062j5197j6939j1732j9178j9537j0707l32O413J693o239m949j9476
10679A226882k6069k0374j9722j8866k4188q419j0227o941p167p724j1968j7399
10667A047818j8712k5048r259j441q639j9294j6656k3833k7502j5824j1914o504
10655H63192k7543j3932m849r54k5449k8300j8867l597m465m013j119j2559k1210
10642F96335j5852n042j7670k3817j830j0825o548q320j9527j7974k7935j8231
10630E22764K387k341j470q252j1444k297p821j1536M021j6497j2770J965n251
$$ plain form
10617 451458 446193 436812 430164 422068 418234 397054 366387 376762 367792 368815 378055 370923 366672
10604 366672 370776 361240 342950 349181 350107 325817 331495 339247 333918 315638 305338 301074 297280
10591 297280 291782 305551 307451 299056 304811 295858 290992 279721 272615 258043 247766 251929 238364
10578 238364 235171 230567 235354 237824 232320 232184 206782 208577 216422 215650 198021 187436 190557 188403
10564 188403 188946 197200 194348 176283 165138 159638 168597 182616 187750 172813 151264 149935 141796
10551 141796 149519 151285 148155 159748 170422 168123 160646 162241 156537 151295 147643 145926 142641 127371
10537 127371 115656 131623 141557 142947 144995 141326 127682 112800 94123 93155 111241 122833 130090
10524 130090 131033 134695 120047 102604 109058 113484 104859 118258 140329 148987 124896 108156 100421
$$ packed form
10617D51458n265r381o648q096l834k1180l0667J0375q970J023R240p132m251
10604C66672M104r536j8290O231R26k4290N678P752n329j8280j0300m264l794
10591B97280n498J3769J900q395N755q953m866j1271p106j4572j0277M163j3565
10578B38364l193m604M787K470n504j36k5402J795P845p72j7629j0585L121k154
10564A88403N43Q254k852j8065j1145n500Q959J4019N134j4937k1549j329q139
10551A41796P723J766l130J1593J0674k299p477J595n704n242l652j717l285j5270
10537A27371j1715J5967R934J390K048l669j3644j4882j8677r68J8086J1592P257
10524A30090R43L662j4648j7443O454M426q625J3399K2071Q658k4091j6740p735
$$ plain form
10511 100421 97956 98506 99846 85516 91215 100923 105145 113490 111795 102445 108692 106546 97602 85838
10497 85838 102748 96151 96736 92928 86071 85840 94183 94244 111299 124789 114610 94714 75719 80836
10483 80836 86470 89380 92233 66509 63273 81144 80038 65225 71854 73073 80903 104049 96350
10470 96350 93191 102829 103968 92088 94970 95592 82917 86373 95521 97538 93084 92732 91277 99538
10456 99538 115970 121684 114698 112097 114178 105149 109215 108995 100330 87278 97462 85225 68735
10443 68735 65163 59494 65020 69177 82167 87591 76147 80076 95466 102448 90242 82909 88915
10430 88915 91977 90102 89639 95299 99602 95042 78565 87243 88313 85685 98773 100350 99013 96418
10416 96418 119036 131312 126712 125315 126996 133809 115071 91960 104240 113780 114251 114136 122799 142176
$$ packed form
10511A00421k465N50J340j4330N699R708M222Q345j695r350O247k146q944j1764
10497H5838J6910o597N85l808o857k31Q343O1J7055J3490j0179j9896j8995N117
10483H0836N634K910K853k5724l236J7871j106j4813O629J219P830K3146p699
10470I6350l159R638J139j1880K882O22j2675L456R148K017m454l52j455Q261
10456I9538J6432N714o986k601K081r029M066k20q665j3052J0184j2237j6490
10443F8735l572n669N526M157J2990N424j1444L929J5390O982j2206p333O006
10430H8915L062j875m63N660M303m560j6477Q678J070k628J3088J577j337k595
10416I6418K2618J2276m600j397J681O813j8738k3111J2280R540M71j15Q663J9377
$$ plain form
10402 142176 159789 180321 193785 186652 186188 204650 206675 214861 232070 245788 256171 268182
10390 268182 294620 321290 324835 344598 372918 412937 434411 436930 444465 446917 460932 486725
10378 486725 545120 612193 686903 780797 888426 995536 1140212 1327817 1582052 1941201
10368 1941201 2437871 3095553 3979509 5104090 6406588 7765110 8940688 9674123 9940612
10359 9940612 9952542 10043918 10516590 11472519 12767284 14057762 15008414 15368639 15200492
10350 15200492 14783411 14363539 14007646 13603530 12979003 12078598 11096814 10261894 9640858
10341 9640858 9151200 8697036 8253179 7748330 7118055 6385570 5635200 4954641 4381968
10332 4381968 3922097 3554949 3247518 2994184 2772101 2555012 2360691 2177808 2008316
$$ packed form
10402A42176J7613K0532J3464p133m64J8462K025Q186J7209J3718J0383J2011
10390B68182K6438K6670L545J9763K8320M0019K1474K519P535K452J4015K5793
10378D86725N8395O7073P4710R3894J07629J07110J44676J87605K54235L59149
10368A941201M96670O57682Q83956J124581J302498J358522J175578P33435K66489
10359I940612J1930R1376M72672R55929J294765J290478R50652L60225j68147
10350A5200492m17081m19872l55893m04116o24527r00405r81784q34920o21036
10341I640858m89658m54164m43857n04849o30275p32485p50370o80559n72673
10332D381968m59871l67148l07431k53334k22083k17089j94321j82883j69492
$$ plain form
10323 2008316 1864374 1723537 1566233 1422267 1300682 1214958 1116743 1022490 936164 855452
10313 855452 775195 723956 675950 632227 586176 554396 507580 444493 404860 391311 383209 368820
10301 368820 355020 352051 345169 351734 362755 362615 343115 322018 331798 332573 338064 333485 341424 346077
10287 346077 360352 352819 354518 371637 395011 419583 441150 442178 452389 494103 530782 582972
10275 582972 648478 741136 850254 956406 1113330 1351361 1684498 2134562 2641888 3154440
10265 3154440 3616875 4022683 4385810 4721070 5061660 5504332 6124853 6893620 7647416
10256 7647416 8290833 8817779 9292354 9758528 10169718 10351583 10207553 9793253 9254520
10247 9254520 8693381 8239619 7997160 7961471 8022558 7957732 7592328 6935231 6117616 5285317
$$ packed form
10323B008316j43942j40837j57304j43966j21585q5724r8215r4253q6326q0712
10313H55452q0257n1239m8006m3723m6051l1780m6816o3087l9633j3549q102j4389
10301C68820j3800k969o882O565J1021j40j9500k1097R780P75N491m579P939M653
10287C46077J4275p533J699J7119K3374K4572K1567J028J0211M1714L6679N2190
10275E82972O5506R2658J09118J06152J56924K38031L33137M50064N07326N12552
10265C154440M62435M05808L63127L35260L40590M42672O20521P68767P53796
10256G647416O43417N26946M74575M66174M11190J81865j44030m14300n38733
10247I254520n61139m53762k42459l5689O1087o4826l65404o57097q17615q32299
$$ plain form
10237 5285317 4554333 3960139 3478247 3102002 2774474 2511899 2303716 2143503 2009328
10228 2009328 1880575 1752280 1622878 1500160 1382247 1283536 1190211 1086992 997833 922155
10218 922155 830912 748824 678634 614421 565367 524937 493740 443861 395359 356010 336342
10207 336342 313860 280287 261822 249480 239979 224190 218743 206291 185168 178639 170384 167006
10195 167006 159449 159674 150948 138029 128725 134843 145493 145743 148554 140916 127038 121728 129880 124201
10181 124201 119490 125674 133611 134488 125314 111559 115322 131566 126000 113756 119273 116890 108938 105616
10167 105616 102860 90718 78743 78628 84273 89177 78444 69782 73905 74003 79943 80005 86608 75822
10153 75822 65496 60104 48071 57956 63547 68460 74572 68319 63044 63836 64294 78264 81910 87025
$$ packed form
10237E285317p30984n94194m81892l76245l27528k62575k08183j60213j34175
10228B009328j28753j28295j29402j22718j17913r8711r3325j03219q9159p5678
10218I22155r1243q2088p0190o4213m9054m0430l1197m9879m8502l9349j9668
10207C36342k2482l3573j8465j2342r501j5789n447j2452k1123o529q255l378
10195A67006p557K25q726j2919r304O118J0650K50K811p638j3878n310Q152n679
10181A24201m711O184P937Q77r174j3755L763J6244n566j2244N517k383p952l322
10167A05616k756j2142j1975j15N645M904j0733q662M123R8N940O2O603j0786
10153G5822j0326n392j2033R885N591M913O112o253n275P92M58J3970L646N115
$$ plain form
10139 87025 82332 68432 66128 73054 86123 90664 86285 77735 76879 83861 91088 89434 83116 95698
10125 95698 103839 115614 112240 99578 96541 93245 91716 97693 104594 116181 124743 119948 114986 121560
10111 121560 119907 110316 102997 107970 107069 111795 133580 144527 138636 138446 147130 161933 163844 137620
10097 137620 137574 141176 137124 147639 165548 169819 149446 152181 147304 149782 158555 169679 186580
10084 186580 182760 163819 167129 166278 170673 163582 161637 161691 161901 166290 161660 169733 182433 197058
10070 197058 201932 198763 185266 171897 170314 171694 174801 182776 182565 175725 179891 190411 193943 206853
10056 206853 232313 253898 254158 248594 267750 268247 270184 284609 297028 304196 329625 344864 360426
10043 360426 352962 348981 362055 375180 385958 384081 383445 396350 409281 433114 439169 419457 403584
$$ packed form
10139H7025m693j3900k304O926J3069M541m379q550q56O982P227j654o318J2582
10125I5698Q141J1775l374j2662l037l296j529N977O901J1587Q562m795m962O574
10111A21560j653r591p319M973r01M726K1785J0947n891j90Q684J4803J911k6224
10097A37620m6L602m052J0515J7909M271k0373K735m877K478Q773J1124J6901
10084A86580l820j8941L310q51M395p091j945N4K10M389m630Q073J2700J4625
10070A97058M874l169j3497j3369j583J380L107P975k11o840M166J0520L532J2910
10056B06853K5460K1585K60n564J9156M97J937J4425J2419P168K5429J5239J5562
10043C60426p464l981J3074J3125J0778j877o36J2905J2931K3833O055j9712j5873
$$ plain form
10030 403584 403174 405129 418664 432662 443096 460050 471859 482522 476564 472319 481333 495888 503268
10017 503268 512856 525505 538684 546729 558043 568331 587942 608476 624564 637058 658994 697449
10005 697449 733586 759528 803658 844517 867511 904713 940384 983419 1026653 1076872 1122953
9994 1122953 1140993 1166955 1186592 1183516 1189848 1197991 1216817 1225296 1245972 1289818 1329866 1386724
9982 1386724 1468252 1554348 1649986 1764294 1901602 2049081 2203503 2366141 2539653 2725886
9972 2725886 2899862 3076553 3229291 3371339 3500744 3594240 3665714 3721495 3782419 3833408
9962 3833408 3863615 3888502 3918415 3964856 4007657 4062838 4116256 4174103 4222195 4279861 4341958
9951 4341958 4421606 4498577 4562208 4632140 4689413 4747545 4779685 4771126 4745039 4700626 4642609 4562487
$$ packed form
10030D03584m10J955J3535J3998J0434J6954J1809J0663n958m245R014J4555P380
10017E03268R588J2649J3179Q045J1314J0288J9611K0534J6088J2494K1936L8455
10005F97449L6137K5942M4130M0859K2994L7202L5671M3035M3234N0219M6081
9994A122953J8040K5962J9637l076O332Q143J8826Q479K0676M3846M0048N6858
9982A386724Q1528Q6096R5638J14308J37308J47479J54422J62638J73512J86233
9972B725886J73976J76691J52738J42048J29405R3496P1474N5781O0924N0989
9962C833408L0207K4887K9913M6441M2801N5181N3418N7847M8092N7666O2097
9951D341958P9648P6971O3631O9932N7273N8132L2140q559k6087m4413n8017q0122
$$ plain form
9939 4562487 4482162 4413131 4340330 4298226 4278011 4272897 4299713 4346798 4404183 4469572 4552618 4640483
9927 4640483 4749808 4854926 4966290 5069586 5166917 5254150 5336418 5408440 5428593 5439854 5439579
9916 5439579 5438774 5413571 5359074 5283916 5201942 5112984 5033045 4949377 4863762 4783509 4710902 4665427
9904 4665427 4637416 4647405 4673141 4706550 4754654 4818962 4879600 4933325 4973403 5000797 5029259 5046012
9892 5046012 5063632 5094488 5118892 5138154 5156198 5185183 5230606 5299561 5347622 5384072 5436998
9881 5436998 5476918 5492677 5479023 5427595 5363078 5308016 5231089 5143233 5028354 4882721 4728629
9870 4728629 4584009 4420338 4229469 4037896 3863979 3690110 3529034 3368989 3210817 3064703
9860 3064703 2923753 2796543 2693398 2597209 2507430 2437600 2370522 2314865 2260771 2203662 2139543
$$ packed form
9939D562487q0325o9031p2801m2104k0215n114K6816M7085N7385O5389Q3046Q7865
9927D640483J09325J05118J11364J03296R7331Q7233Q2268P2022K0153J1261k75
9916E439579q05k5203n4497p5158q1974q8958p9939q3668q5615q0253p2607m5475
9904D665427k8011R989K5736L3409M8104O4308O0638N3725M0078K7394K8462J6753
9892E046012J7620L0856K4404J9262J8044K8985M5423O8955M8061L6450N2926
9881E436998L9920J5759j3654n1428o4517n5062p6927q7856j14879j45633j54092
9870D728629j44620j63671j90869j91573j73917j73869j61076j60045j58172j46114
9860C064703j40950j27210j03145r6189q9779o9830o7078n5657n4094n7109o4119
$$ plain form
9849 2139543 2065534 1984863 1921172 1856174 1806666 1766091 1700065 1619647 1553214 1500839 1445487
9838 1445487 1395748 1361992 1332172 1305488 1277006 1252894 1233142 1202176 1179041 1168029 1164046 1162606
9826 1162606 1159177 1150305 1107319 1078751 1052929 1025407 991664 968573 946026 925251 896168 865211
9814 865211 849448 833805 817455 812648 809612 796280 775367 752641 723499 697157 676337 663967
9802 663967 662176 654840 638926 620463 614764 621758 629966 615392 594680 575648 574340 558708 532823
9789 532823 524217 516566 498201 485469 467425 468569 473882 458958 450009 445131 461100 471824 462826
9776 462826 441993 421325 415461 426754 431000 417630 391260 377038 373943 373212 373729 376653 381451
9763 381451 356083 340003 341512 359169 370343 395109 406396 401497 398784 401034 400845 416785 439614
$$ packed form
9849B139543p4009q0671o3691o4998m9508m0575o6026q0418o6433n2375n5352
9838A445487m9739l3756k9820k6684k8482k4112j9752l0966k3135j1012l983j440
9826A162606l429q872m2986k8568k5822k7522l3743k3091k2547k0775k9083l0957
9814H65211j5763j5643j6350m807l036j3332k0913k2726k9142k6342k0820j2370
9802F63967j791p336j5914j8463n699O994Q208j4574k0712j9032j308j5632k5885
9789E32823q606p651j8365j2732j8044J144N313j4924q949m878J5969J0724q998
9776D62826k0833k0668n864J1293M246j3370k6370j4222l095p31N17K924M798
9763C81451k5368j6080J509J7657J1174K4766J1287m899k713K250j89J5940K2829
$$ plain form
9750 439614 467619 484932 498667 522290 526309 527335 550894 574231 598680 615693 620791 607850
9738 607850 617431 630671 640826 655669 646480 634084 620787 615255 612347 586196 571286 556432
9726 556432 548829 541901 514292 487729 477105 466470 444668 414439 386564 348300 319837 288986
9714 288986 286441 297825 301055 307729 297660 289098 292631 295580 291884 274275 271632 267994 247793
9701 247793 234096 229014 210822 203870 208333 212384 207622 210963 204556 190340 192809 181815 180234
9688 180234 180969 188680 168414 161380 168434 179500 184010 178526 171586 159239 147098 144268 131832
9675 131832 140636 144268 135248 139829 141747 126475 107750 107412 117026 130085 142106 130157 121834
9662 121834 110033 112854 116573 125685 123707 136644 133743 126127 112695 111961 118926 115130 108385 107422
$$ packed form
9750D39614K8005J7313J3735K3623M019J026K3559K3337K4449J7013N098j2941
9738F07850R581J3240J0155J4843r189j2396j3297n532k908k6151j4910j4854
9726E56432p603o928k7609k6563j0624j0635k1802l0229k7875l8264k8463l0851
9714B88986k545J1384L230O674j0069q562L533K949l696j7609k643l638k0201
9701B47793j3697n082j8192o952M463M051m762L341o407j4216K469j0994j581
9688A80234P35P711k0266p034P054J1066M510n484o940j2347j2141k830j2436
9675A31832Q804L632r020M581J918j5272j8725l38R614J3059J2021j1949q323
9662A21834j1801K821L719R112j978J2937k901p616j3432p34O965l796o745r63
$$ plain form
9648 107422 98979 110181 119986 113367 103761 105423 116054 126057 133266 134046 133683 133897 120552 117392
9634 117392 137245 152315 175503 182684 184319 195107 200646 202059 210307 228353 220871 213167 219266
9621 219266 206080 208535 204304 191734 184718 167656 146770 154063 168905 170569 169224 176056 170595
9608 170595 162233 156797 155875 164652 165961 164635 175247 198440 217397 219079 222515 219677 218532 211940
9594 211940 205939 205350 231951 250914 252542 260417 266827 285739 297556 323588 361827 395156 420097
9581 420097 445242 477786 495312 530155 577995 616832 650128 684039 722499 745650 777161 794470
9569 794470 777129 762231 763515 767237 750567 738259 722081 710467 716366 721930 723213 724183 714618
9556 714618 700838 697306 687198 659596 643664 632056 636272 658100 666219 682906 677094 655651
$$ packed form
9648A07422q443J1202R805o619r606J662J0631J0003P209P80l63K14j3345l160
9634A17392J9853J5070K3188P181J635J0788N539J413Q248J8046p482p704O099
9621B19266j3186K455m231j2570p016j7062k0886P293J4842J664j345O832n461
9608A70595q362n436r22Q777J309j326J0612K3193J8957J682L436k838j145o592
9594B11940o001n89K6601J8963J628P875O410J8912J1817K6032L8239L3329K4941
9581D20097K5145L2544J7526L4843M7840L8837L3296L3911L8460K3151L1511J7309
9569G94470j7341j4898J284L722j6670j2308j6178j1614N899N564J283R70r565
9556G14618j3780l532j0108k7602j5932j1608M216K1828Q119J6687n812k1443
$$ plain form
9544 655651 666903 670806 668245 680711 689779 677280 660911 638610 628010 617471 597940 582951
9532 582951 561047 549348 540064 530115 536830 538416 546108 539558 539333 534485 527180 531201 528684 507259
9518 507259 483689 460608 441275 423176 393970 377824 364251 352462 348078 355222 350029 326063
9506 326063 315029 309602 289465 286434 261531 242266 255819 241993 220390 232547 247414 267352
9494 267352 269947 262994 257284 257661 250069 243855 240303 239100 242098 239889 214923 197679 198684 210265
9480 210265 226663 222124 206881 202083 204382 205595 192945 209336 220232 212140 213422 214916 207425
9467 207425 192691 179905 176006 174410 164973 174075 175471 183319 192968 189100 174097 161306 157473
9454 157473 147383 155205 170178 169796 168580 170045 156772 152976 156559 150714 171781 197407 193354
$$ packed form
9544F55651J1252L903k561J2466R068j2499j6369k2301j0600j0539j9531j4989
9532E82951k1904j1699r284r949O715J586P692o550k25m848p305M021k517k1425
9518E07259k3570k3081j9333j8099k9206j6146j3573j1789m384P144n193k3966
9506C26063j1034n427k0137l031k4903j9265J3553j3826k1603J2157J4867J9938
9494B67352K595o953n710L77p592o214l552j203K998k209k4966j7244J005J1581
9480B10265J6398m539j5243m798K299J213j2650J6391J0896q092J282J494p491
9467B07425j4734j2786l899j596r437R102J396P848R649l868j5003j2791l833
9454A57473j0090P822J4973l82j216J465j3273l796L583n845K1067K5626m053
$$ plain form
9441 193354 185517 177722 178564 177133 170452 172672 194216 193826 181347 184510 185010 193382 193849 202517 210503
9426 210503 225489 243973 237428 242150 231335 224456 231507 257602 274716 268541 269098 279326 311442
9413 311442 327557 318900 319431 330377 340164 352682 362639 356453 365211 364036 368740 381081 372635 349817
9399 349817 342097 364050 365159 374065 389541 409119 418878 425820 430815 447040 469536 496032 522624
9386 522624 559617 614268 656189 721771 808340 912612 1012998 1109011 1193500 1249454 1273572
9375 1273572 1267684 1217581 1156687 1082294 1000217 922727 850286 762192 710601 676551 658366 632656
9363 632656 600709 583126 554702 535334 539258 520243 505499 503916 500313 490292 478174 465245
9351 465245 459768 456368 455959 440769 440844 431697 432318 432323 425890 426335 417383 406781 406913 419986 448358 464539
$$ packed form
9441A93354p837p795Q42j431o681K220K1544l90j2479L163N00Q372M67Q668P986
9426B10503J4986J8484o545M722j0815o879P051K6095J7114o175N57J0228L2116
9413C11442J6115q657N31J0946R787J2518R957o186Q758j175M704J2341q446k2818
9399C49817p720K1953J109Q906J5476J9578R759O942M995J6225K2496K6496K6592
9386E22624L6993N4651M1921O5582Q6569J04272J00386R6013Q4489N5954K4118
9375A273572n888n0103o0894p4393q2077p7490p2441q8094n1591l4050j8185k5710
9363F32656l1947j7583k8424j9368L924j9015j4744j583l603j0021j2118j2929
9351D65245n477l400m09j5190P5r147O21No433M45q952j0602J32J3073K8372J6181
$$ plain form
9335 464539 481997 502474 527736 538259 572735 618255 635190 657846 677752 691182 697635 727110
9323 727110 762603 801738 848610 897960 943160 1012036 1092362 1187963 1294362 1400603 1526774
9312 1526774 1675839 1832934 1966774 2065875 2148405 2204613 2239280 2246036 2234011 2184577 2111198
9301 2111198 2046391 1995756 1930580 1877752 1839433 1806932 1782724 1758595 1734655 1721926 1723564 1744106
9289 1744106 1767792 1804375 1844154 1885246 1927151 1967672 2045084 2142961 2243236 2366336 2508054
9278 2508054 2685218 2920146 3208101 3553204 3982516 4512668 5147409 5920662 6799462 7728675
9268 7728675 8655909 9516903 10238816 10816773 11234218 11509077 11637129 11579985 11321889 10870758
9258 10870758 10252296 9493863 8694409 7900704 7180418 6554979 6027185 5590358 5225443
$$ packed form
9335D64539J7458K0477K5262J0523L4476M5520J6935K2656J9906J3430O453K9475
9323G27110L5493L9135M6872M9350M5200O8876Q0326R5601J06399J06241J26171
9312A526774J49065J57095J33840R9101Q2530N6208L4667O756j2025m9434p3379
9301B111198o4807n0635o5176n2828l8319l2501k4208k4129k3940j2729J638K0542
9289A744106K3686L6583L9779M1092M1905M0521P7412R7877J00275J23100J41718
9278B508054J77164K34928K87955L45103M29312N30152O34741P73253Q78800R29213
9268G728675R27234Q60994P21913N77957M17445K74859J28052n7144k58096m51131
9258A0870758o18462p58433p99454p93705p20286o25439n27794m36827l64915
$$ plain form
9249 5225443 4908644 4625939 4380334 4163366 3958501 3769903 3618768 3489804 3361081 3246609
9239 3246609 3153977 3069049 2995762 2955906 2922893 2920720 2960373 3023094 3095189 3185006 3290754
9228 3290754 3420073 3601644 3833553 4124601 4454401 4820477 5235761 5723973 6280451 6917179
9218 6917179 7649161 8438048 9259064 10019056 10619297 10962789 10959073 10602671 9921761 9042561
9208 9042561 8092715 7191588 6389738 5711067 5140149 4690556 4336597 4055934 3829689 3637406
9198 3637406 3462560 3302511 3149532 2999493 2849029 2717111 2572363 2430203 2306472 2185172
9188 2185172 2078822 1979052 1897101 1822884 1765349 1720224 1646024 1582163 1547899 1523589 1509550
9177 1509550 1502914 1492453 1491634 1495902 1506016 1519858 1554211 1585847 1623192 1663530 1713884 1746310
$$ packed form
9249E225443l16799k82705k45605k16968k04865j88598j51135j28964j28723j14472
9239C246609r2632q4928p3287l9856l3013k173L9653O2721P2095Q9817J05748
9228C290754J29319J81571K31909K91048L29800L66076M15284M88212N56478O36728
9218F917179P31982P88887Q21016P59992O00241L43492l716l56402o80910q79200
9208I042561r49846r01127q01850o78671n70918m49593l53959k80663k26245j92283
9198C637406j74846j60049j52979j50039j50464j31918j44748j42160j23731j21300
9188B185172j06350r9770q1951p4217n7535m5125p4200o3861l4264k4310j4039
9177A509550o636j0461q19M268J0114J3842L4353L1636L7345M0338N0354L2426
$$ plain form
9165 1746310 1743379 1720321 1672767 1618530 1564380 1500132 1450328 1407135 1383672 1380293 1383297 1411335
9153 1411335 1477276 1595775 1789966 2078870 2516426 3180408 4193471 5647098 7398990
9144 7398990 8798615 9000624 8036026 6462458 4937733 3795448 3016540 2515307 2161427
9135 2161427 1918726 1755089 1635748 1542491 1473315 1419301 1394141 1361447 1304862 1217974 1125940
9124 1125940 1056032 994437 938262 875765 823530 780032 736370 698967 676302 633658 599699
9113 599699 576701 547598 524403 516116 502466 482860 460434 399499 317559 203636 116183 108717
9101 108717 161356 216418 255282 285524 300707 309351 319316 313006 313951 318319 331796 341985 344927
9088 344927 360484 372895 399222 414151 411417 405018 400696 410581 411025 418857 423035 428173 426681 429250
$$ packed form
9165A746310k931k3058m7554n4237n4150o4248m9804m3193k3463l379L004K8038
9153A411335O5941J18499J94191K88904M37556O63982J013063J453627J751892
9144G398990J399625K02009r64598j573568j524725j142285p78908n01233l53880
9135B161427k42701j63637j19341r3257o9176n4014k5160l2694n6585q6888r2034
9124A125940o9908o1595n6175o2497n2235m3498m3662l7403k2665m2644l3959
9113E99699k2998k9103k3195q287j3650j9606k2426o0935q1940j13923q7453p466
9101A08717N2639N5062L8864L0242J5183Q644R965o310R45M368J3477J0189K942
9088C44927J5557J2411K6327J4929k734o399m322R885M44P832M178N138j492K569
$$ plain form
9074 429250 442692 441747 434668 417086 408344 391697 381341 366465 340471 328228 331270 336905 338130
9061 338130 330721 348367 368777 363980 369300 378819 372225 381223 390485 407485 411437 406903 405221 414189
9047 414189 421395 431692 451084 468323 489357 491189 484635 486084 494362 502635 532046 561147 565359
9034 565359 555587 542554 530465 541130 570639 607688 657769 702132 739343 778711 807934 848230
9022 848230 892376 954940 1032583 1123854 1225770 1305760 1370330 1425948 1477242 1529378 1590919
9011 1590919 1674029 1768566 1917945 2071455 2199697 2317950 2472078 2654719 2848846 3102267
9001 3102267 3404664 3743827 4100941 4523217 5084203 5841942 6809169 8028775 9530026
8992 9530026 11322990 13340694 15498361 17799961 20643911 24571424 30314460 38772429
$$ packed form
9074D29250J3442r45p079j7582q742j6647j0356j4876k5994j2243L042N635J225
9061C38130p409J7646K0410m797N320R519o594Q998R262J7000L952m534j682Q968
9047D14189P206J0297J9392J7239K1034J832o554J449Q278Q273K9411K9101M212
9034E65359r772j3033j2089J0665K9509L7049N0081M4363L7211L9368K9223M0296
9022H48230M4146O2564P7643R1271J01916P9990O4570N5618N1294N2136O1541
9011A590919Q3110R4537J49379J53510J28242J18253J54128J82641J94127K53421
9001C102267L02397L39163L57114M22276N60986P57739R67227J219606J501251
8992I530026J792964K017704K157667K301600K843950L927513N743036Q457969
$$ plain form
8984 38772429 51508324 71113682 101334612 146074677 204939152 261339090 281880666
8977 281880666 257934548 207445699 154223290 113859814 86954139 69481925 58100914
8970 58100914 50618125 45643967 42338951 40241260 39050360 38479724 37978841 36818310
8962 36818310 34585885 31735704 28809050 26064877 23570473 21340634 19411488 17740863
8954 17740863 16268294 14913460 13660593 12546513 11555748 10686105 9897097 9084302 8198358
8945 8198358 7259405 6337871 5501305 4773963 4161446 3663819 3261947 2941377 2696271 2514999
8935 2514999 2362035 2244282 2134115 2035350 1956863 1884315 1824636 1789228 1781060 1770912 1769184
8924 1769184 1797018 1861677 1996805 2258787 2672506 3202787 3669953 3848689 3715762 3403995
$$ packed form
8984C8772429J2735895J9605358L0220930M4740065N8864475N6399938K0541576
8977B81880666k3946118n0488849n3222409m0363476k6905675j7472214j1381011
8970E8100914p482789m974158l305016k097691j190900n70636n00883j160531
8962C6818310k232425k850181k926654k744173k494404k229839j929146j670625
8954A7740863j472569j354834j252867j114080r90765q69643p89008q12795q85944
8945H198358r38953r21534q36566p27342o12517m97627m01872l20570k45106j81272
8935B514999j52964j17753j10167r8765p8487p2548n9679l5408q168j0148j728
8924A769184K7834O4659J35128K61982M13719N30281M67166J78736j32927l11767
$$ plain form
8914 3403995 3037492 2707478 2410032 2143487 1946792 1804730 1686695 1599279 1532973 1485381
8904 1485381 1452714 1438297 1405231 1361955 1321049 1275152 1237927 1209233 1200395 1207910 1197271 1148732
8892 1148732 1112979 1073524 1033657 987515 940927 894582 848287 790834 733010 719382 684256
8881 684256 635602 609740 582960 573533 564175 548494 530997 526690 498653 486209 474105 453120
8869 453120 434478 434566 426798 405341 383432 382295 375030 364911 370027 365401 367903 373402 389516 408612
8855 408612 441146 487416 561321 646594 684757 653381 577767 512672 475689 428502 387455 369088
8843 369088 359063 354664 354892 337358 340470 340987 357352 355595 358761 360258 377515 379699 375678 372538
8829 372538 384348 394393 386470 393771 392505 393124 394112 379684 381620 380121 377773 372026 366465 357294
$$ packed form
8914C403995l66503l30014k97446k66545j96695j42062j18035q7416o6306m7592
8904A485381l2667j4417l3066m3276m0906m5897l7225k8694q838P515j0639m8539
8892A148732l5753l9455l9867m6142m6588m6345m6295n7453n7824j3628l5126
8881F84256m8654k5862k6780r427r358j5681j7497m307k8037j2444j2104k0985
8869D53120j8642Q8p768k1457k1909j137p265j0119N116m626K502N499J6114J9096
8855D08612L2534M6270P3905Q5273L8163l1376p5614o5095l6983m7187m1047j8367
8843C69088j0025m399K28j7534L112N17J6365j757L166J497J7257K184m021l140
8829C72538J1810J0045p923P301j266O19R88j4428J936j499k348n747n561r171
$$ plain form
8815 357294 342688 315793 295199 278807 260179 247922 238942 228304 213844 213090 215591 197230
8803 197230 179751 187805 188937 193729 203074 209062 220830 236650 239627 230946 220194 207129 213306
8790 213306 219115 213967 211793 209355 190612 172236 164729 152407 137852 109784 88840 101071 94971
8777 94971 96702 101137 96830 100833 112886 122807 136686 137609 140352 131170 138112 152958 152046 139339
8763 139339 132336 129452 130793 136965 134289 121796 110849 99992 100608 124436 125092 128286 125521 126810
8749 126810 126924 128906 130000 127968 113114 108970 102410 100810 99764 101207 114857 119502 111009 117222
8735 117222 121325 114674 110522 98694 99871 113571 114163 111635 122493 126607 134167 145956 137451 125497
8721 125497 130896 125663 107421 110396 122367 113853 103447 99162 82465 83290 81995 77486 68918 58926
$$ packed form
8815C57294j4606k6895k0594j6392j8628j2257q980j0638j4460p54K501j8361
8803A97230j7479Q054J132M792R345N988J1768J5820K977q681j0752j3065O177
8790B13306N809n148k174k438j8743j8376p507j2322j4555k8068k0944J2231o100
8777I4971J731M435m307M003J2053R921J3879R23K743r182O942J4846r12j2707
8763A39339p003k884J341O172k676j2493j0947j0857O16K3828O56L194k765J289
8749A26810J14J982J094k032j4854m144o560j600j046J443J3650M645q493O213
8735A17222M103o651m152j1828J177J3700N92k528J0858M114P560J1789q505j1954
8721A25497N399n233j8242K975J1971q514j0406m285j6697Q25j295m509q568r992
$$ plain form
8707 58926 70520 76763 75200 93902 112912 117266 118624 108649 100530 94080 97110 93834 94544 83017
8693 83017 78818 107161 113184 101817 77486 79249 84650 77208 75813 79167 77329 79234 85599 88086
8679 88086 89310 91391 101315 112944 116773 101257 76157 65179 65292 53646 59758 73541 85345
8666 85345 101923 116814 112126 105616 83410 70624 72837 56926 57873 76491 76484 54681 36860 53858
8652 53858 71602 81269 76013 60367 47618 36011 46311 44281 30112 39513 65916 90529 121152
8639 121152 126138 131019 127549 120924 121349 106311 110914 107307 108299 103647 95725 104437 134643 136044
8625 136044 112850 114737 104527 92003 103192 107413 116382 122763 125588 125624 118527 120724 132575 127727
8611 127727 116423 112902 109001 111384 106479 122490 139023 160224 180674 196870 212274 228545
$$ packed form
8707E8926J1594O243j563J8702J9010M354J358r975q119o450L030l276P10j1527
8693H3017m199K8343O023j1367k4331J763N401p442j395L354j838J905O365K487
8679H8086J224K081R924J1629L829j5516k5100j0978J13j1646O112J3783J1804
8666H5345J6578J4891m688o510k2206j2786K213j5911R47J8618pk1803j7821J6998
8652E3858J7744R667n256j5646j2749j1607J0300k030j4169R401K6403K4613L0623
8639A21152M986M881l470o625M25j5038M603l607R92m652p922Q712L0206J401
8625A36044k3194J887j0210j2524J1189M221Q969O381K825L6p097K197J1851m848
8611A27727j1304l521l901K383m905J6011J6533K1201K0450J6196J5404J6271
$$ plain form
8599 228545 242409 258641 267300 276846 296503 310610 310414 310415 304762 301502 310053 321514 330046 335043
8585 335043 352172 380583 409829 464695 547185 635651 718346 809847 894179 969431 1022806 1042573
8573 1042573 1033962 982737 898473 813255 718852 630827 559109 495531 444687 399893 368165 341688
8561 341688 321478 294585 272108 250608 239739 219170 216276 203482 184464 184105 180828 183404 169488
8548 169488 169109 178016 168059 162608 154628 147398 146102 136137 122915 117130 119931 109069 106556 89525
8534 89525 97019 105511 104625 104471 92609 93476 100928 86774 80953 82030 74295 72001 74661 68346 77540
8519 77540 84871 88803 97096 93024 79309 69064 81049 90064 90790 86787 70705 82892 76639 59614
8505 59614 51473 52886 50794 52329 47381 57952 57878 63110 57456 45336 44044 61346 69713 72575
$$ packed form
8599B28545J3864J6232Q659R546J9657J4107j96Jn653l260Q551J1461Q532M997
8585C35043J7129K8411K9246N4866Q2490Q8466Q2695R1501Q4332P5252N3375J9767
8573A042573q611n1225q4264q5218r4403q8025p1718o3578n0844m4794l1728k6477
8561C41688k0210k6893k2477k1500j0869k0569k894j2794j9018l59l277K576j3916
8548A69488l79Q907r957n451p980p230j296r965j3222n785K801j0862k513j7031
8534H9525P494Q492q86j54j1862Q67P452j4154n821J077p735k294K660o315R194
8519G7540P331L932Q293m072j3715j0245J1985R015P26m003j6082J2187o253j7025
8505E9614q141J413k092J535m948J0571p4N232n654j2120j292J7302Q367K862
$$ plain form
8491 72575 65323 73892 78052 89217 87065 66788 55188 42497 32649 39543 61204 59174 63068
8478 63068 55999 63082 57392 50471 44722 37803 32609 33430 39798 56911 71739 75012 57116 47018
8464 47018 68769 78783 66196 69943 70517 51150 42760 39324 54014 61244 60388 53686 58615 51595
8450 51595 50554 54835 51719 56919 55571 53575 49748 43893 37579 37049 33705 30083 27880 35560 57829
8435 57829 69760 54979 39337 41244 44832 45498 49021 55128 64130 60155 54302 52865 56455 52923
8421 52923 53620 57618 59201 71294 66464 68137 59524 50801 38589 33878 39608 34577 35721 44474
8407 44474 69498 58719 36268 30768 29133 37983 36570 41698 47245 51934 49149 55521 70248 69153
8393 69153 59324 55061 62272 59191 47753 48667 41170 30619 26081 18947 30716 48028 39766 42721
$$ packed form
8491G2575p252Q569M160J1165k152k0277j1600j2691r848O894K1661k030L894
8478F3068p069P083n690o921n749o919n194Q21O368J7113J4828L273j7896j0098
8464D7018K1751J0014j2587L747N74j9367q390l436J4690P230q56o702M929p020
8450E1595j041M281l116N200j348j996l827n855o314n30l344l622k203P680K2269
8435E7829J1931j4781j5642J907L588O66L523O107R002l975n853j437L590l532
8421E2923O97L998J583J2093m830J673q613q723j2212m711N730n031J144Q753
8407D4474K5024j0779k2451n500j635Q850j413N128N547M689k785O372J4727j095
8393F9153r829m263P211l081j1438R14p497j0551m538p134J1769J7312q262K955
$$ plain form
8379 42721 50005 53559 52069 54902 46877 56639 58104 48170 49854 51736 46731 32792 20707 20302
8365 20302 25499 36099 37871 19909 21774 35737 49821 57213 46668 32087 21634 20460 20983
8352 20983 32535 41928 56534 43054 32162 8996 8596 25252 17401 18348 18950 11914 9674 17825
8338 17825 20443 14236 11494 21880 27474 30638 27187 956 -11215 9822 17768 10703 7895 12324
8324 12324 18224 33047 39184 39821 41199 44265 44998 51410 51465 35549 31888 36945 47189 42565 37991
8309 37991 37522 29289 13679 9973 3502 3023 6613 5052 10370 16884 24769 23711 31278 22179 26883
8294 26883 24859 28950 20224 19605 25708 21011 25580 31791 24453 29754 28312 14883 19316 27795 30218
8279 30218 22472 33017 33369 34950 37739 48225 43519 35231 25674 22058 17404 8260 390 5129
$$ packed form
8379D2721P284L554j490K833q025R762J465r934J684J882n005j3939j2085m05
8365B0302N197J0600J772j7962J865J3963J4084P392j0545j4581j0453j174N23
8352B0983J1552R393J4606j3480j0892k3166m00J6656p851R47O02p036k240Q151
8338A7825K618o207k742J0386N594L164l451k6231j2171K1037P946p065k808M429
8324A2324N900J4823O137O37J378L066P33O412N5j5916l661N057J0244m624m574
8309C7991m69q233j5610l706o471m79L590j561N318O514P885j058P567r099M704
8294B6883k024M091q726o19O103m697M569O211p338N301j442j3429M433Q479K423
8279C0218p746J0545L52J581K789J0486m706q288r557l616m654r144p870M739
$$ plain form
8265 5129 20147 21177 -1248 2792 11079 12360 13869 6301 7511 6356 1824 4518 4731 12480 38805
8250 38805 48776 42355 38327 38807 53357 55085 52120 52823 43699 42864 47524 36697 23278 15016 9073
8235 9073 -947 9684 23597 15866 16314 18685 19249 20746 25617 27731 27058 35499 33932 30166 25010
8220 25010 7124 10903 16480 7475 5795 13547 2619 -6530 1005 10209 20934 34068 13671
8207 13671 10333 17075 9457 2243 17474 19034 4516 -2946 10368 14729 9484 13081 32202 38433
8193 38433 32298 31046 32349 33866 32424 20360 13093 3223 -2131 7946 15200 8753 -882 12448
8179 12448 18197 16144 31151 43397 33284 20814 19138 24747 33800 37983 22426 5432 15464
8166 15464 19897 23350 35538 43018 32035 33524 31733 18933 18363 28621 21223 17319 19518 17083
$$ packed form
8265E129J5018J030k2425M040Q287J281J509p568J210j155m532K694K13P749K6325
8250C8805R971o421m028M80J4550J728k965P03r124q35M660j0827j3419q262n943
8235I073j0020J0631J3913p731M48K371N64J497M871K114o73Q441j567l766n156
8220B5010j7886L779N577r005j680P752j0928r149P535R204J0725J3134k0397
8207A3671l338O742p618p214J5231J560j4518p462J3314M361n245L597J9121O231
8193C8433o135j252J303J517j442j2064p267r870n354J0077P254o447r635J3330
8179A2448N749k053J5007J2246j0113j2470j676N609R053M183j5557j6994J0032
8166A5464M433L453J2188P480j0983J489j791j2800n70J0258p398l904K199k435
$$ plain form
8152 17083 9928 15571 30882 43643 43964 31267 22197 19584 23564 22211 34257 30647 28908 28803
8138 28803 37601 40681 38891 30898 33285 28113 25961 27052 38308 43402 40730 40895 36439 23788
8124 23788 11031 917 1680 1029 7215 6186 17053 20854 26801 28437 28871 40121 34614 31404
8110 31404 41631 36045 8408 3547 14324 23384 20803 26309 33027 31201 21492 27702 32840 24206
8096 24206 8696 26708 42025 34969 24856 26131 35249 40498 46760 47965 47547 49547 49596 51541
8082 51541 39619 23339 15489 17139 23767 40833 49499 45969 37145 29198 31974 43506 38026 34101
8068 34101 30408 22928 15012 8775 19086 31691 36415 34794 30639 28932 33503 27271 12455 3701
8054 3701 15494 13873 9097 14165 34144 43834 44293 29640 41302 29510 26188 34437 41024 53551
$$ packed form
8152A7083p155N643J5311J2761L21j2697r070k613L980j353J2046l610j739j05
8138B8803Q798L080j790p993K387n172k152J091J1256N094k672J65m456j2651
8124B3788j2757j0114P63o51O186j029J0867L801N947J636M34J1250n507l210
8110C1404J0227n586k7637m861J0777R060k581N506O718j826r709O210N138q634
8096B4206j5510J8012J5317p056j0113J275R118N249O262J205m18K000M9J945
8082E1541j1922j6280p850J650O628J7066Q666l530q824p947K776J1532n480l925
8068C4101l693p480p916o237J0311J2605M724j621m155j707M571o232j4816q754
8054C701J1793j621m776N068J9979R690M59j4653J1662j1792l322Q249O587J2527
$$ plain form
8040 53551 54135 48200 48882 51980 54722 53731 42679 42222 53648 68372 67089 64370 51434 34128
8026 34128 36985 36366 31869 32730 33945 44577 47069 59105 77102 89116 83480 64675 58675 68244
8012 68244 72798 63104 58425 52991 55535 52921 65449 57982 48217 53512 74190 86003 77916 66371
7998 66371 59700 82117 93655 91541 83787 88358 88798 81649 73696 72454 66547 73681 80473 79643 84974
7983 84974 92485 79755 76608 71421 72022 83921 73766 68911 55028 60114 64639 62401 55850 61601
7969 61601 48284 46000 54322 64118 75640 77342 65474 65484 52884 54203 60580 64013 68469 77966
7955 77966 84160 78063 86760 88853 83810 80611 66386 66225 72748 68306 73634 60540 55212 41101
7941 41101 39553 39743 43072 30984 30727 53817 68441 66096 68595 64722 47589 53331 59594 62629
$$ packed form
8040E3551N84n935O82L098K742r91j1052m57J1426J4724j283k719j2936j7306
8026C4128K857o19m497Q61J215J0632K492J2036J7997J2014n636j8805o000R569
8012F8244M554r694m679n434K544k614J2528p467r765N295K0678J1813q087j1545
7998F6371o671K2417J1538k114p754M571M40p149p953j242n907P134O792q30N331
7983H4974P511j2730l147n187O01J1899j0155m855j3883N086M525k238o551N751
7969F1601j3317k284Q322R796J1522J702j1868J0j2600J319O377L433M456R497
7955G7966O194o097Q697K093n043l199j4225j61O523m442N328j3094n328j4111
7941D1101j548J90L329j2088k57K3090J4624k345K499l873j7133N742O263L035
$$ plain form
7927 62629 64233 57101 48644 61259 67832 68011 60270 48783 48861 35646 43060 61065 50652 48699
7913 48699 54667 59551 63450 54868 49827 56996 62843 63231 48251 30058 34112 27635 35298 45147
7899 45147 44762 37226 39078 35936 10195 5489 7142 9599 19753 28795 38062 35711 35258 33837 26053
7884 26053 27530 17574 3618 7522 12936 8493 1654 5395 10622 13669 33563 34470 10626 -8233
7870 -8233 -519 4051 15515 22182 14767 2284 11673 18550 21071 36937 47253 40591 19235 11712
7856 11712 18459 23993 7569 11858 33395 41545 46695 34563 20604 22660 24998 23712 22839 15937
7842 15937 6379 10551 24359 21116 9844 7195 6066 5953 5149 23658 28888 24521 11326 10172
7828 10172 5374 -1174 5291 9705 2265 6901 7895 7414 14737 15138 15312 17431 18351 12553 16780 17045
$$ packed form
7927F2629J604p132q457J2615O573J79p741j1487P8j3215P414J8005j0413j953
7913D8699N968M884L899q582n041P169N847L88j4980j8193M054o477P663R849
7899D5147l85p536J852l142k5741m706J653K457J0154R042R267k351m53j421p784
7884B6053J477r956j3956L904N414m443o839L741N227L047J9894R07k3844j8859
7870h233P714M570J1464O667p415j2483R389O877K521J5866J0316o662k1356p523
7856A1712O747N534j6424M289K1537Q150N150j2132j3959K056K338j286q73o902
7842A5937r558M172J3808l243j1272k649j129j13q04J8509N230m367j3195j154
7828A0172m798o548O465M414p440M636R94m81P323M01J74K119R20n798M227K65
$$ plain form
7812 17045 17696 10189 5277 11238 19610 29996 26893 10981 -5933 -9567 -1228 5992 5442 14689
7798 14689 10150 -11166 -15210 -8806 -12743 1689 20255 17494 170 -7805 -1992 -3674 -13441 -11595
7784 -11595 6139 12055 9821 -3938 -2569 6258 8751 6677 15224 4093 -14958 -19928 -622
7771 -622 1289 -2095 6890 2463 -9154 640 -6387 -21597 -21189 -6302 -5403 4361 4726 3198 -1540
7756 -1540 -8865 -12586 -13025 7324 28805 24748 8051 -6590 -14385 -22356 -17957 977 -4193 -67
7742 -67 -4887 1979 20211 41123 33233 21806 20862 23207 24968 16345 14053 24685 30424 29167 14760
7727 14760 20674 20289 16192 22475 27769 34014 37260 35009 39345 35597 28725 28123 24483 23324 22785
7712 22785 5911 8763 4588 -2238 15369 6195 -6790 5849 19493 18533 19470 7276 -998 3594
$$ packed form
7812A7045O51p507m912N961Q372J0386l103j5912j6914l634Q339P220n50R247
7798A4689m539k1316m044O404l937J4432J8566k761j7324p975N813j682r767J846
7784a1595J7734N916k234j3759J369Q827K493k074Q547j1131j9051m970J9306
7771f22J911l384Q985m427j1617R794p027j5210M08J4887Q99R764L65j528m738
7756a540p325l721m39K0349K1481m057j6697j4641p795p971M399J8934n170M126
7742f7m820O866J8232K0912p890j1427r44K345J761q623k292J0632N739j257j4407
7727A4760N914l85m097O283N294O245L246k251M336l748o872o02l640j159n39
7712B2785j6874K852m175o826J7607r174j2985J2639J3644r60R37j2194q274M592
$$ plain form
7698 3594 12617 19312 5768 -9416 -6078 9336 22404 18182 7645 -333 3352 10801 16476 6663
7684 6663 -3964 -5391 2509 -99 -2324 3330 5941 -3324 -10841 -6981 8921 24411 12009 9991
7670 9991 13797 5706 1437 13195 25739 24298 20822 9297 -3138 -1868 586 9016 4536 -2112
7656 -2112 -8231 -5484 10711 17510 16392 8464 12489 21248 14213 20006 39932 33434 23419 25301
7642 25301 26472 29851 38778 31541 17073 16705 5780 11946 18536 14649 7997 9103 2338 8366
7628 8366 6616 -5412 -4054 6461 6998 4951 -4621 5911 27683 15765 11329 -6797 1384 2004
7614 2004 -14244 -15815 -19763 -18823 -13080 3387 -1930 -2228 17102 21888 17865 17870 12652 9048 19979
7599 19979 15093 14637 13142 13224 12641 5472 976 6341 13710 14313 3798 8880 7264 -746 -4392 -598
$$ packed form
7698C594R023O695j3544j5184L338J5414J3068m222j0537p978L685P449N675r813
7684F663j0627j427P900k608k225N654K611r265p517L860J5902J5490j2402k018
7670I991L806q091m269J1758J2544j441l476j1525j2435J270K454Q430m480o648
7656b112o119K747J6195O799j118p928M025Q759p035N793J9926o498j0015J882
7642B5301J171L379Q927p237j4468l68j0925O166O590l887o652J106o765O028
7628H366j750j2028J358J0515N37k047r572J0532K1772j1918m436j8126Q181O20
7614B004j6248j571l948R40N743J6467n317k98J9330M786m023Nn218l604J0931
7599A9979m886m56j495Q2n83p169m496N365P369O03j0515N082j616q010l646L794
$$ plain form
7583 -598 -2203 -8511 -6523 -10938 -9539 5347 1027 2956 -3378 2466 5192 7864 -8441 -10327 478
7568 478 17596 20228 31176 29109 25986 13316 7234 -834 1839 6047 9979 10951 6200 10187 15241
7553 15241 22442 13357 5162 -6687 -16773 -25417 -24430 -110 9026 -3865 -8466 10436 7106 3026
7539 3026 -222 2396 16580 23424 15000 1145 -14417 -18636 -16882 1241 2010 7248 8759 13773
7525 13773 2454 77 6436 7225 7823 -294 646 -2141 -4145 1474 6920 385 8470 -4941 -21279
7510 -21279 -9845 13934 11937 5535 -11632 -2430 16969 653 -11246 -3299 11335 23456 25186
7497 25186 9551 -1224 -8303 -16091 2860 11460 11435 6787 22548 21187 8741 -7419 -1555 -5438
7483 -5438 -8826 -9013 -1204 -555 4513 -5661 -18205 -7841 20342 30076 8784 -689 2585 -630
$$ packed form
7583e98j605o308J988m415J399J4886m320J929o334N844K726K672j6305j886J0805
7568D78J7118K632J0948k067l123j2670o082q068K673M208L932R72m751L987N054
7553A5241P201r085q195j1849j0086q644R87K4320R136j2891m601J8902l330m080
7539C026l248K618J4184O844q424j3855j5562m219J754J8123P69N238J511N014
7525A3773j1319k377O359P89N98q117R40k787k004N619N446o535Q085j3411j6338
7510b1279J1434K3779j997o402j7167R202J9399j6316j1899P947J4634J2121J730
7497B5186j5635j0775p079p788J8951Q600k5m648J5761j361j2446j6160N864l883
7483e438l388j87P809O49N068j0174j2544J0364K8183R734k1292r473L274l215
$$ plain form
7469 -630 -485 -1826 -391 6214 17336 25262 20278 12367 25911 24931 2598 -17905 -26122 -24607 -29309
7454 -29309 -23125 -14274 923 6716 4783 -7243 -19564 -5029 1153 -1066 2127 -494 -8419 -14991
7440 -14991 -30034 -35128 -32577 -14991 -3570 5961 13618 14068 4545 5296 -7157 -429 20016 11718
7426 11718 -266 8533 31258 31787 30347 25113 16000 12210 8242 17062 22755 13210 -2216 -6952
7412 -6952 -18080 -17824 -2119 8601 6505 20527 17485 5067 -8047 -10515 2124 7455 17081
7399 17081 16798 18761 18472 4317 -9398 -1310 2431 -9567 -14131 -13281 -8934 8412 17671 15552
7385 15552 12424 24134 26226 29386 12279 2751 1379 737 -3418 6278 6692 5299 -8870 -30282
7371 -30282 -19269 -8298 -17445 -21126 -3332 66 -8723 -2829 3958 1748 -11303 -1424 2750 6855
$$ packed form
7469f30J45j341J435O605J1122P926m984p911J3544r80k2333k0503q217J515m702
7454b9309O184Q851J5197N793j933j2026j2321J4535O182k219L193k621p925o572
7440a4991j5043n094K551J7586J1421R531P657M50r523P51j2453O728K0445q298
7426A1718j1984Q799K2725N29j440n234r113l790l968Q820N693r545j5426m736
7412f952j1128K56J5705J0720k096J4022l042j2418j3114k468J2639N331R626
7399A7081k83J963k89j4155j3715Q088L741j1998m564Q50M347J7346R259k119
7385A5552l128J1710K092L160j7107r528j372o42m155R696M14j393j4169k1412
7371c0282J1013J0971r147l681J7794L398q789N894O787k210j3051R879M174M105
$$ plain form
7357 6855 12351 24061 21149 19017 23512 17775 19428 18530 9635 -1888 9247 -3291 -7841 -6365
7343 -6365 -15567 -22361 -13426 -5953 16918 19981 27124 27450 35692 23786 9596 1311 -7537 -6901 -5631
7328 -5631 2971 164 1259 1665 14812 14264 8995 -842 -8369 -687 18375 13667 22756 30146 16517
7313 16517 11514 19467 27389 25106 21455 11447 8686 10448 -8645 -18074 -29005 -20669 -5406 15359
7299 15359 16298 11547 14963 17552 20705 18895 10434 6723 9871 6172 -4578 -15583 -273 14536
7285 14536 19327 15463 7229 2336 5705 -9068 -5437 -9195 -14570 -25710 -14839 -840 5048 4774
7271 4774 4725 -6204 -10798 -2494 16036 15976 697 12634 20084 17714 16918 22927 26916 16270 5494
7256 5494 -4875 -574 -5970 -10044 -6014 -10523 -18347 -27832 -12927 6863 14635 15248 5855 452
$$ packed form
7357F855N496J1710k912k132M495n737J653q98q895j1523J1135j2538m550J476
7343f365r202o794Q935P473K2871L063P143L26Q242j1906j4190q285q848O36J270
7328e631Q602k807J095M06J3147n48n269r837p527P682J9062m708R089P390j3629
7313A6517n003P953P922k283l651j0008k761J762j9093r429j0931Q336J5263K0765
7299A5359R39m751L416K589L153j810q461l711L148l699j0750j1005J5310J4809
7285A4536M791l864q234m893L369j4773L631l758n375j1140J0871J3999N888k74
7271D774m9j0929m594Q304J8530o0j5279J1937P450k370p96O009L989j0646j0776
7256E494j0369M301n396m074M030m509p824r485J4905J9790P772O13r393n403
$$ plain form
7242 452 11416 21346 17839 -5830 -9978 -2781 926 95 -65 6034 22522 30441 24032 14129 -526
7227 -526 -4650 881 9083 1896 11899 17702 9713 -6970 -8553 -4153 -3641 -7062 -204 953 -3677
7212 -3677 -936 -1191 -5656 3055 44 -7386 -4162 -2974 4306 24816 14786 36 -318 -1276 -3360
7197 -3360 -1258 5233 12836 10856 8109 -1491 -482 6246 8626 8425 1618 -282 -9155 -11781 -2972
7182 -2972 3767 5700 -9838 -3535 5956 3154 13441 14703 4776 1846 -385 -7524 48 11107
7168 11107 18403 21436 22220 15861 15382 2109 -1319 -9453 -15529 -3361 3925 6037 6682 7208 9349
7153 9349 6292 -3083 3457 15482 9752 -739 6486 10013 13726 11561 5308 -6416 -8943 566
7139 566 10292 18651 27435 23556 26487 20268 9278 -4070 -9278 -10361 -1409 -4826 -1620 5372 -486
$$ packed form
7242D52J0964R930l507k3669m148P197L707q31j60O099J6488P919o409r903j4655
7227e26m124N531Q202p187J0003N803p989j6683j583M400N12l421O858J157m630
7212c677K741k55m465Q711l011p430L224J188P280K0510j0030j4750l54r58k084
7197c360K102O491P603j980k747r600J009O728K380k01o807j900q873k626Q809
7182b972O739J933j5538O303R491k802J0287J262r927k930k231p139P572J1059
7168A1107P296L033P84o359m79j3273l428q134o076J2168P286K112O45N26K141
7153I349l057r375O540J2025n730j0491P225L527L713k165o253j1724k527R509
7139E66R726Q359Q784l879K931o219j0990j3348n208j083Q952l417L206O992n858
$$ plain form
7124 -486 -2220 -521 -256 12668 15252 7972 9471 10361 7880 1354 -7546 -13210 -8655 -4536 -5619
7109 -5619 -4368 -3107 -14186 -16157 -5883 -6948 -17898 -22792 -20168 -22915 -20271 -9924 15099 11583
7095 11583 6459 15180 5704 -6774 14200 18743 -83 -5929 -2510 81 6034 -3425 -9169 -14015
7081 -14015 -20464 -13572 -8191 -334 13421 9125 12762 7130 5442 4459 -181 -5065 -13506 -18437 -4289
7066 -4289 10133 21166 22384 16916 6335 -4573 -14963 -14022 -9805 -10578 -13388 -10221 -6228 5995
7052 5995 11247 5222 2700 11275 3722 -7834 1184 20215 38739 37919 36326 22071 9585 4275
7038 4275 7585 6029 5964 577 8391 13744 -220 440 11530 23453 26297 19014 13409 25106 30369
7023 30369 9988 -7465 -12245 -8156 -5585 11056 5679 -652 -1417 1337 4246 10490 1384 -7696
$$ packed form
7124d86j734J699K65J2924K584p280J499Q90k481o526q900n664M555M119j083
7109e619J251J261j1079j971J0274j065j0950m894K624k747K644J0347K5023l516
7095A1583n124Q721r476j2478K0974M543j8826n846L419K591N953r459n744m846
7081a4015o449O892N381P857J3755m296L637n632j688r83m640m884q441m931J4148
7066d289J4422J1033J218n468j0581j0908j0390R41M217p73k810L167L993J2223
7052E995N252o025k522Q575p553j1556R018J9031J8524q20j593j4255j2486n310
7038D275L310j556o5n387P814N353j3964O60J1090J1923K844p283n605J1697N263
7023C0369k0381j7453m780M089K571J6641n377o331p65K754K909O244r106r080
$$ plain form
7009 -7696 6815 4834 955 5815 7081 13377 14177 -3487 -6522 11355 15975 12980 16220 14479
6995 14479 2302 -2774 -20745 -16959 -6084 4785 3932 -3807 2548 3539 167 -3267 -10405 -6413
6981 -6413 -6631 -5844 4010 1449 -534 13577 18160 8114 -7095 7919 17040 14946 -1286 -11886
6967 -11886 -13101 -9776 -13671 -15154 -4979 -5515 17139 17600 9931 -8990 -21479 -13173 -5784 -15557
6953 -15557 -31428 -31662 -15824 -12730 -10981 -6390 -5094 -1839 6189 4225 8881 -238 -2080 -5826
6939 -5826 -8415 1928 5892 1538 -4320 -18817 -15973 -4606 -13604 -24171 -26406 -16133 -590
6926 -590 1347 5473 -13400 -27232 -31680 -18388 -7731 -5772 6162 6631 2303 5507 597 -2844
6912 -2844 -228 -12506 -33258 -22867 -5799 1574 -3038 -18104 -13885 -1242 4253 12057 12627 24177
$$ packed form
7009g696J4511j981l879M860J266O296Q00j7664l035J7877M620k995L240j741
6995A4479j2177n076j7971L786J0875J0869q53p739O355R91l372l434p138L992
6981f413k18P87R854k561j983J4111M583j0046j5209J5014R121k094j6232j0600
6967a1886j215L325l895j483J0175n36K2654M61p669j8921j2489Q306P389r773
6953a5557j5871k34J5838L094J749M591J296L255Q028j964M656r119j842l746
6939e826k589J0343L964m354n858j4497K844J1367q998j0567k235J0273J5543
6926e90J937M126j8873j3832m448J3292J0657J959J1934M69m328L204m910l441
6912b844K616j2278k0752J0391J7068P373m612j5066M219J2643N495P804N70J1550
$$ plain form
6898 24177 29992 22362 13978 14999 21853 18455 18683 10127 6883 11110 15524 2338 -25853 -34343
6884 -34343 -23946 -21378 -11170 -3603 -662 1020 6233 -314 -6597 -2459 -5749 -14850 -20383 -19758
6870 -19758 -2560 -7332 -12693 -2980 2662 9350 12788 12917 4492 -1862 8753 23022 30259 16004
6856 16004 4435 -5203 2026 12735 8605 2257 -8283 -1186 811 -4288 3030 6425 -12676 -16593
6842 -16593 -2947 -864 -5401 -14331 -22232 -28187 -23489 1466 7054 4922 11457 28749 25799 4202
6828 4202 -5539 -5851 895 1878 -2239 -1596 1937 -595 11170 15024 8480 17964 29210 24888 19591
6813 19591 14390 219 -14930 -20564 -13665 -2345 -4258 1377 -126 -1380 11169 5822 11718 13146
6799 13146 3522 4339 -804 -6859 -1468 5255 7702 2808 -8770 -20063 -10289 2470 2413 4619 -7017
$$ packed form
6898B4177N815p630q384J021O854l398K28q556l244M227M414j3186k8191q490
6884c4343J0397K568J0208P567K941J682N213o547o283M138l290r101n533O25
6870a9758J7198m772n361R713N642O688L438J29q425o354J0615J4269P237j4255
6856A6004j1569r638P229J0709m130o348j0540P097J997n099P318L395j9101l917
6842a6593J3646K083m537q930p901n955M698K4955N588k132O535J7292k950k1597
6828D202r741l12O746R83m117O43L533k532J1765L854o544R484J1246m322n297
6813A9591n201j4171j5149n634O899J1320j913N635j503j254J2549n347N896J428
6799A3146r624Q17n143o055N391O723K447m894j1578j1293R774J2759n7K206j1636
$$ plain form
6784 -7017 -5154 1897 -6221 -8678 -10401 -6013 751 473 -4956 -6124 3029 6897 16549 13369 8981
6769 8981 13373 15596 13449 11147 5227 5627 -5796 -9283 -11343 -9238 -4578 5335 -2209 -8722 -8748
6754 -8748 -4530 4668 12792 575 -11293 -7290 -13274 1107 23841 20677 10388 10417 2598 -5884
6740 -5884 8019 27506 20754 4051 662 6723 19883 31580 28617 25729 40209 43623 29005
6727 29005 24448 32189 24217 13971 26256 40284 63759 65751 75813 91747 104682 132263 174246
6714 174246 241761 321271 434480 534827 541329 458404 334912 234297 168952 134860 124396
6703 124396 110304 100700 79788 74499 64870 66394 71545 59991 46099 41990 51751 53948 48819
6690 48819 33753 38472 48025 41315 49455 42269 39135 42853 27389 18421 -2265 -9296 -7657 -10810
$$ packed form
6784g017J863P051q118k457j723M388O764k78n429j168R153L868R652l180m388
6769H981M392K223k147k302n920M00j1423l487k060K105M660R913p544o513k6
6754h748M218R198Q124j2217j1868M003n984J4381K2734l164j0289K9p819q482
6740e884J3903J9487o752j6703l389O061J3160J1697k963k888J4480L414j4618
6727B9005m557P741p972j0246J2285J4028K3475J992J0062J5934J2935K7581M1983
6714A74246O7515P9510J13209J00347O502q2925j23492j00615o5345l4092j0464
6703A24396j4092r604k0912n289r629J524N151j1554j3892m109R761K197n129
6690D8819j5066M719R553o710Q140p186l134L718j5464q968k0686p031J639l153
$$ plain form
6676 -10810 -12036 -15198 -5608 12388 26320 14262 5504 1625 -8404 -5822 10556 16996 15568
6663 15568 13663 20530 8033 -1868 7541 -7770 -13197 -7942 -4984 -120 8688 19877 6936 -7492
6649 -7492 -10413 -6061 -21588 -35641 -30821 -15724 3801 9271 7818 4710 12755 14170 7527 -9366
6635 -9366 -19211 -21121 -11228 1407 10374 4036 4793 771 -3970 -10133 -7021 -2939 3853 -4242 -3035
6620 -3035 -4959 -15579 -16652 -22903 -14224 -8527 -6400 646 13165 16398 19416 16056 16146 24215 21309
6605 21309 47611 36888 14233 7415 18994 34147 23077 15411 8716 5955 7263 12034 21392
6592 21392 10333 9 4526 7170 -1311 -8616 -12290 -28060 -15125 -808 -7718 -8943 -2492
6579 -2492 15175 19723 1335 -6377 -15091 -19025 -26476 -33076 -30508 -8232 -11014 -10710 -14141 -22860
$$ packed form
6676a0810j226l162R590J7996J3932j2058q758l879j0029K582J6378O440j428
6663A5568j905O867j2497r901R409j5311n427N255K958M864Q808J1189j2941j4428
6649g492k921M352j5527j4053M820J5097J9525N470j453l108Q045J415o643j6893
6635i366r845j910R893J2635Q967o338P57m022m741o163L112M082O792q095J207
6620c035j924j0620j073o251Q679N697K127P046J2519L233L018l360R0Q069k906
6605B1309K6302j0723k2655o818J1579J5153j1070p666o695k761J308M771R358
6592B1392j1059j0324M517K644q481p305l674j5770J2935J4317o910j225O451
6579b492J7667M548j8388p712q714l934p451o600K568K2276k782L04l431q719
$$ plain form
6565 -22860 -12162 -1473 -8520 -23557 -26957 -19204 -12422 -7720 1079 -2518 -3268 -1823 5138 15539
6551 15539 31185 26400 13875 8052 7521 7551 615 -9232 -4943 -2402 -2938 -4038 -8340 1975 8248
6536 8248 13145 16941 -2987 -14450 -3299 1843 2751 1300 -12736 -28719 -17724 -2907 -8816
6523 -8816 -7562 2574 3608 -14733 -4927 -7928 -17115 -20190 -14960 -9430 -8463 -12166 -6385 -5732 7222
6508 7222 10593 4471 -11475 -14157 -362 -3065 -8110 2159 -7783 -6880 -5815 -11761 -5789 1758
6494 1758 4298 840 -17766 -18020 1244 -6732 -7267 2613 12996 17508 20175 8541 -3951 -4972
6480 -4972 -3225 3731 8455 11448 17438 15031 -345 2625 1877 -670 -15330 -20371 -10871 -8250 -5144
6465 -5144 1667 -4132 -10375 2687 -7553 -697 125 8510 11806 -369 616 10241 6151 -10630
$$ packed form
6565b2860J0698J0689p047j5037l400P753O782M702Q799l597p50J445O961J0401
6551A5539J5646m785j2525n823n31L0o936r847M289K541n36j100m302J0315O273
6536H248M897L796j9928j1463J1151N142R08j451j4036j5983J0995J4817n909
6523h816J254J0136J034j8341R806l001r187l075N230N530R67l703N781O53J2954
6508G222L371o122j5946k682J3795k703n045J0269r942R03J065n946N972P547
6494A758K540l458j8606k54J9264p976n35R880J0383M512K667j1634j2492j021
6480d972J747O956M724K993N990k407j5376K970p48k547j4660n041R500K621L106
6465e144O811n799o243J3062j0240O856Q22Q385L296j2175R85R625m090j6781
$$ plain form
6451 -10630 -9690 -18608 -24199 -28320 -17167 10710 2588 -12088 -20239 -6745 -2855 -5392 -6154 -5728
6437 -5728 -3017 -1200 -3278 9990 358 -14716 -23047 -17917 -8988 -1964 45 -1672 7255 -2759
6423 -2759 -7678 1176 5512 6816 576 -555 13727 18541 9404 3253 -8043 -7724 -9040 -5871 2625
6408 2625 12584 7647 -7351 -24476 -17010 1313 7488 -5933 764 4503 2879 -2962 -1116 976
6394 976 -224 6426 -2492 -8686 -2027 -13668 -18077 -17376 413 8671 4937 -2794 -1778 -13481 -4436
6379 -4436 -6890 4350 10093 5840 -2369 -3412 4170 9572 4502 -7162 -14295 -15533 -18167 -3778
6365 -3778 10463 12288 7830 -11049 -19945 -2375 -12540 -11270 4661 564 -2864 -3939 -194 8721
6351 8721 9885 1542 -14560 -12994 -7311 1979 7851 1766 -1200 -2202 -8473 -2749 13278 10750
$$ packed form
6451a0630R40q918n591m121J1153K7877q122j4676q151J3494L890k537p62M26
6437e728K711J817k078J3268r632j5074q331N130Q929P024K009j717Q927j0014
6423b759m919Q854M336J304o240j131J4282M814r137o151j1296L19j316L169Q496
6408B625R959m937j4998j7125P466J8323O175j3421O697L739j624n841J846K092
6394I76j200O650q918o194O659j1641m409P01J7789Q258l734p731J016j1703R045
6379d436k454J1240N743m253q209j043P582N402n070j1664p133j238k634J4389
6365c778J4241J825m458j8879q896J7570j0165J270J5931m097l428j075L745Q915
6351H721J164q343j6102J566N683R290N872o085k966j002o271N724J6027k528
$$ plain form
6337 10750 505 -6878 -2604 1658 -7469 812 4579 11664 -1395 -2399 -13108 -25081 -14492
6324 -14492 -16601 -16655 -8979 -6780 -14320 -9710 -127 17215 6601 -7545 -9221 -19812 -6843 6053
6310 6053 11707 7563 1284 -440 -2916 -9343 -11865 -13983 -11645 5060 10901 12957 16579 19753 16133
6295 16133 18269 12034 -15667 -26314 -29065 -18480 -1723 15959 18073 -325 -1793 194 1822
6282 1822 12663 10755 2766 -7326 -3940 3394 3971 -9390 -9091 -9282 -7788 -621 -13407 -5722 5399
6267 5399 -4510 -11293 -11891 -5220 -13913 -33803 -27459 -4031 -9191 -1175 -13212 -23819 -15778 6467
6253 6467 9023 -528 -4260 -4456 548 -2489 -3310 -2927 -11975 -14489 -4791 -7849 -24210 -29592 -20625
6238 -20625 -5436 1862 2727 2548 -5958 -2264 4917 -5933 -15094 -15882 -3901 11185 13738 15487
$$ packed form
6337A0750j0245p383M274M262r127Q281L767P085j3059j004j0709j1973J0589
6324a4492k109n4P676K199p540M610R583J7342j0614j4146j676j0591J2969J2896
6310F053N654m144o279j724k476o427k522k118K338J6705N841K056L622L174l620
6295A6133K136o235k7701j0647k751J0585J6757J7682K114j8398j468J987J628
6282A822J0841j908p989j0092L386P334N77j3361K99j91J494P167j2786P685J1121
6267E399r909o783n98O671q693j9890O344K3428n160Q016j2037j0607Q041K2245
6253F467K556r551l732j96N004l037q21L83r048k514R698l058j6361n382Q967
6238b0625J5189P298Q65j79q506L694P181j0850r161p88J1981J5086K553J749
$$ plain form
6224 15487 16200 25384 21778 23269 21043 15445 4178 2504 -4220 -8458 -3726 -2027 1838 7197 13713
6209 13713 3824 7716 11589 5093 11978 11730 3835 -1938 -13328 -7602 5444 1871 -8920 -5667
6195 -5667 -293 -1200 -7733 -7343 -2599 -6794 -11146 -13940 -29045 -28173 -21606 -15449 -14315 -12839 -14788
6180 -14788 -8027 -13470 -21670 -11024 -11999 -4559 -10525 -5753 -908 -1651 10693 13886 8787 3316 -7430
6165 -7430 -10408 -13949 -8207 4868 -1202 -2568 -5777 5379 -429 -1427 9551 7812 -3947 -2292
6151 -2292 -1369 -3170 2150 -259 -5118 122 23680 15865 12051 1745 -3796 9876 11521 8693
6137 8693 366 -2705 12128 10104 6524 -7633 -16965 -15399 -26994 -20050 -15744 -12227 -5489 4809
6123 4809 3275 -1383 11494 14841 12663 11566 8868 9412 7407 2978 -7988 2524 1816 -11639
$$ packed form
6224A5487P13R184l606J491k226n598j1267j674o724m238M732J699L865N359O516
6209A3713r889L892L873o496O885k48p895n773j1390N726J3046l573j0791L253
6195e667N374r07o533L90M744m195m352k794j5105Q72O567O157J134J476j949
6180a4788O761n443q200J0646r75P440n966M772M845p43J2344L193n099n471j0746
6165g430k978l541N742J3075o070j366l209J1156n808r98J0978j739j1759J655
6151b292R23j801N320k409m859N240K3558p815l814j0306n541J3672J645k828
6137H693q327l071J4833k024l580j4157r332J566j1595O944M306L517O738J0298
6123D809j534m658J2877L347k178j097k698N44k005m429j0966J0512p08j3455
$$ plain form
6109 -11639 -15726 -11911 -18988 -22963 -16763 -19576 -7807 3420 11157 3658 492 5480 7139 12246
6095 12246 10697 -4930 -24295 -14826 8551 30648 21268 10845 15059 2547 -10303 -2446 -2628
6082 -2628 4589 15083 10275 10079 9224 -3596 -15720 -15420 -5304 8736 18120 7348 -2457 12494
6068 12494 -2721 -13161 -8533 -13700 -23368 -26635 -13124 -11896 893 305 -9919 -2058 -2931 -17544
6054 -17544 -8107 10797 7069 8481 9501 -5983 -21714 -20393 -3796 -4004 -13729 -6257 -3453 3552
6040 3552 8550 5062 3502 -2778 -4168 7805 9797 5801 -4884 -9409 -13802 -8257 -10977 -14983
6026 -14983 -34 9185 19546 25825 22531 2819 -7952 -10961 -9979 1925 5065 4376 12427 8664
6012 8664 4576 10711 5677 -5064 8737 21448 17685 23643 20310 2849 7309 12956 6427 -9821
$$ packed form
6109a1639m087L815p077l975O200k813J1769J1227P737p499l166M988J659N107
6095A2246j549j5627j9365R469K3377K2097r380j0423M214j2512j2850P857j82
6082b628P217J0494m808j96q55j2820j2124L00J0116J4040R384j0772r805J4951
6068A2494j5215j0440M628n167r668l267J3511J228J2789n88j0224P861q73j4613
6054a7544R437J8904l728J412J020j5484j5731J321J6597k08r725P472K804P005
6040C552M998l488j560o280j390J1973J992l996j0685m525m393N545k720m006
6026a4983J4949R219J0361O279l294j9712j0771l009R82J1904L140o89Q051l763
6012H664m088O135n034j0741J3801J2711l763N958l333j7461M460N647o529j6248
$$ plain form
5998 -9821 -7616 3445 13719 12559 -339 8198 13458 4339 6003 8679 15030 33530 27183 5817
5984 5817 -5553 4184 16595 6690 5159 11284 8839 4788 17687 1698 1458 1768 -10929 -15091
5970 -15091 -5182 2726 2283 -415 2809 20841 17824 30818 39775 24720 15314 2375 7035 23310
5956 23310 26521 8522 5995 5018 -3114 -10925 -21293 -21740 -10654 -2593 320 3787 2763 -8015
5942 -8015 1621 5860 -12632 -8625 -2727 -15296 -29232 -20676 -15971 -1350 9086 12411 6801 7649
5928 7649 7461 -379 -8727 -17648 -16690 -6648 -13005 -7021 1253 -2755 -23628 -25067 -13098 559
5914 559 -4660 7573 8979 -6288 -9623 -14980 -7554 7082 6778 5515 6396 1179 398 964 -8319
5899 -8319 -15054 -12093 -12318 -7943 -2742 -3068 -5187 -16185 -23041 -18525 -7428 2489 -5965 -17933 -24732
$$ packed form
5998i821K205J1061J0274j160j2898Q537N260r119J664K676O351J8500o347k1366
5984E817j1370R737J2411r905j531O125k445m051J2899j5989k40L10j2697m162
5970a5091R909P908m43k698L224J8032l017J2994Q957j5055r406j2939M660J6275
5956B3310L211j7999k527r77q132p811j0368m47J1086Q061K913L467j024j0778
5942h015R636M239j8492M007N898j2569j3936Q556M705J4621J0436L325n610Q48
5928G649j88p840q348q921R58J0042o357N984Q274m008k0873j439J1969J3657
5914E59n219J2233J406j5267l335n357P426J4636l04j263Q81n217p81N66r283
5899h319o735K961k25M375N201l26k119j0998o856M516J1097R917q454j1968o799
$$ plain form
5884 -24732 -21753 -20307 -27489 -30474 -19982 -16730 -26201 -14975 11035 10610 6829 9523 16429 10185
5870 10185 13277 12205 4907 3461 13834 12017 -2470 -11186 -3261 682 2126 -10250 -8508 -7040
5856 -7040 -4348 -10357 604 8238 7649 -495 -2114 -5740 -5534 -3178 5309 7310 -4624 883 2558
5841 2558 -1938 589 1827 -4267 -4408 -15752 -17211 -5204 -13885 -23160 -30162 -28219 -28750 -22584 -24029
5826 -24029 -15326 6974 3226 -614 -6824 -13057 -9944 -4306 -1805 10416 8422 8604 9661 21663
5812 21663 30867 20734 5228 10303 18727 14138 10114 17163 11326 2786 7237 -3773 -4767 -9967
5798 -9967 -20553 -1411 2161 8906 10814 3230 1721 251 -3444 -12366 -5738 -3033 5072 -10456
5784 -10456 -8743 -4783 2519 -902 5656 14478 11364 -2982 -7900 -10715 -6006 1880 1262 -1588 11072
$$ packed form
5884b4732K979J446p182k985J0492L252r471J1226K6010m25l781K694O906o244
5870A0185L092j072p298j446J0373j817j4487q716P925L943J444j2376J742J468
5856g040K692o009J0961P634n89q144j619l626K06K356Q487K001j1934N507J675
5841B558m496K527J238o094j41j1344j459J2007q681r275p002J943n31O166j445
5826b4029Q703K2300l748l840o210o233L113N638K501J2221j994J82J057J2002
5812B1663R204j0133j5506N075Q424m589m024P049n837q540M451j1010r94n200
5798i967j0586J9142L572O745J908p584j509j470l695q922O628K705Q105j5528
5784a0456J713L960P302l421O558Q822l114j4346m918k815M709P886o18k850J2660
$$ plain form
5769 11072 2546 -15566 -25474 -20336 -3738 -1340 -10975 7129 937 -10950 -9898 -378 8914 3372
5755 3372 -6560 -2506 522 9140 30418 21549 6088 -15323 -17441 -11748 -11454 150 653 3317
5741 3317 -633 -6931 -2 549 -8028 -1672 13218 8937 19308 15214 13497 13510 10006 18728 6526
5726 6526 -13171 -23178 -9837 -11051 -10854 -5679 4468 8021 -7280 -17191 -14757 -1185 -1105 -6304
5712 -6304 4421 -9644 -9830 -509 10939 3876 -9061 -13951 -6477 -2468 -11849 -12867 -6876 11289
5698 11289 21794 16320 -3019 -3977 -3690 -12866 -10338 -2263 4426 8008 1697 4764 810 8404 19550
5683 19550 24509 25247 5051 4055 5238 7243 11039 14337 11873 11047 1334 -4705 -5013 -13620 -8855
5668 -8855 2891 -1412 -512 16302 13043 2388 1319 4887 11804 14131 4588 -16072 -10328 15368
$$ packed form
5769A1072q526j8112r908N138J6598K398r635J8104o192j1887J052R520R292n542
5755C372r932M054L028Q618K1278q869j5461k1411k118N693K94J1604N03K664
5741C317l950o298O929N51q577O356J4890m281J0371m094j717J3l504Q722j2202
5726F526j9697j0007J3341j214J97N175J0147L553j5301r911K434J3572Q0n199
5712f304J0725j4065j86R321J1448p063j2937m890P474M009r381j018N991J8165
5698A1289J0505n474j9339r58K87r176K528Q075O689L582o311L067l954P594J1146
5683A9550M959P38k0196r96J183K005L796L298k464q26r713o039l08q607M765
5668h855J1746m303R00J6814l259j0655j069L568O917K327r543k0660N744K5696
$$ plain form
5654 15368 31416 18168 20877 24213 -1951 -24911 -17221 -4966 7217 3937 200 -443 -7441
5641 -7441 -20802 -30857 -24004 -22869 -9124 -8375 996 -960 -5499 -11413 -8173 -10587 -21636 -28859
5627 -28859 -18706 -18585 -14297 -14453 -19183 -11297 -4316 16889 21885 9434 10509 20083 25947 36722
5613 36722 30525 36278 33648 23484 15169 5903 10829 17980 3419 -18544 -27345 -23047 -25182 -23242
5599 -23242 -7025 -8726 -16404 -17090 -15643 -5601 15545 16211 15206 16796 16003 13805 14129 -1070 1376
5584 1376 3596 14898 12041 12454 3161 -1985 -13868 -4991 -434 -3880 -2365 9736 -971 -23310
5570 -23310 -23749 -16749 -18481 -25369 -16154 -22730 -19142 -13342 -9167 -8849 -4104 -9793 -9307 -11152 -1383
5555 -1383 -2140 -11858 2323 1994 -10446 -19627 -23248 -21084 -4588 3419 -5100 -11029 -5968 -12969 -8937
$$ packed form
5654A5368J6048j3248K709L336k6164k2960P690J2255J2183l280l737o43o998
5641g441j3361j0055O853J135J3745P49R371j956m539n914L240k414j1049p223
5627b8859J0153J21M288j56m730P886O981K1205M996j2451J075R574N864J0775
5613C6722o197N753k630j0164q315r266M926P151j4561k1963q801M298k135J940
5599b3242J6217j701p678o86J447J0042K1146O66j005J590p93k198L24j5199K446
5584A376K220J1302k857M13r293n146j1883Q877M557l446J515J2101j0707k2339
5570b3310m39P000j732o888R215o576L588N800M175L18M745n689M86j845R769
5555a383p57r718J4181l29j2440r181l621K164J6496Q007q519n929N061p001M032
$$ plain form
5540 -8937 -11274 -3773 4797 6759 9089 8775 1710 4592 14994 24463 19692 3797 -3538 -9720 -436
5525 -436 -6520 -9452 692 -5501 -10757 -14264 -5764 -4732 1967 11913 24343 18584 16702 10678 5710
5510 5710 15782 14066 10119 10257 18163 26802 15017 10378 13372 17462 16117 17191 -4382 -21753
5496 -21753 -11936 -17842 -29055 -22484 -3818 -5487 -4184 16820 19208 974 -4189 -8972 -10586 -26965
5482 -26965 -26096 -25547 -19682 -17518 -14286 -10804 -13661 -19423 -19093 -11341 -17613 -8667 6164 2478 7978
5467 7978 8272 11998 21466 21070 21004 20423 17269 23344 17047 4288 -6196 -8526 -9056 -6490 -4961 -17131
5451 -17131 -20961 -25013 -18078 -2473 11791 6130 -13831 -17639 -15870 -11729 -45 3347 -759 2425
5437 2425 12529 8131 17191 13716 -7160 -11758 4368 19407 11939 -500 -4731 4616 12301 1921
$$ packed form
5540h937k337P501Q570J962K330l14p065K882J0402R469m771j5895p335o182R284
5525d36o084k932J0144o193n256l507Q500J032O699R946J2430n759j882o024m968
5510E710J0072j716l947J38P906Q639j1785m639K994M090j345J074k1573j7371
5496b1753R817n906j1213O571J8666j669J303K1004K388j8234n163m783j614j6379
5482b6965Q69N49N865K164L232L482k857n762L30P752o272Q946J4831l686N500
5467G978K94L726R468l96o6n81l154O075o297j2759j0484k330n30K566J529j2170
5451a7131l830m052O935J5605J4264n661j9961l808J769M141J1684L392m106L184
5437B425J0104m398R060l475k0876m598J6126J5039p468j2439m231R347P685j0380
$$ plain form
5423 1921 2912 13043 7696 17161 10664 11621 17127 24220 23398 17110 23673 22701 19001 7398 -5514
5408 -5514 -13521 -7463 -3735 -9044 -12304 -21380 -9789 -1737 -2821 -9763 -15097 -16046 -27474 -6763
5394 -6763 21749 23486 15325 16615 14102 11947 3973 -5977 -4740 3940 6970 5411 5296 5322 18953
5379 18953 36543 32751 24314 4587 -7462 -13338 -9983 -7890 -11077 -8549 -2225 2959 13748 -4612
5365 -4612 -13918 1343 19529 21553 16829 5885 9450 6566 -9768 -18128 -1424 3817 -3689 -8374
5351 -8374 -7799 5243 760 135 -10843 -6806 9792 26896 42823 42387 24661 17824 11356 7280
5337 7280 2219 12846 35134 32290 10717 7191 9872 7444 3425 -991 -8340 -4791 -23213 -32237
5323 -32237 -24627 -20614 -13924 -11038 -9236 -7026 -1737 -11015 -7726 -5946 -8053 -16908 -23692 -12866
$$ packed form
5423A921R91J0131n347R465o497R57N506P093q22o288O563r72l700j1603j2912
5408e514q007O058L728n309l260r076J1591Q052j084o942n334r49j1428K0711
5394f763K8512J737q161J290k513k155p974r950J237Q680L030j559j15K6J3631
5379A8953J7590l792q437j9727j2049n876L355K093l187K528O324N184J0789j8360
5365d612r306J5261J8186K024m724j0944L565k884j6334q360J6704N241p506m685
5351h374N75J3042m483o25j0978M037J6598J7104J5927m36j7726o837o468m076
5337G280n061J0627K2288k844k1573l526K681k428m019m416p349L549j8422r024
5323c2237P610M013O690K886J802K210N289r278L289J780k107q855o784J0826
$$ plain form
5309 -12866 -10001 -8076 3889 3742 -13487 -38667 -32562 -8568 4880 1460 -9283 -18345 -4491
5296 -4491 -6095 -12051 -17496 -18760 -20523 -23765 -6994 -5869 -15842 -20137 -22687 -15636 -17575 -21312 -16708
5281 -16708 -5377 -9165 -6419 -3678 -13733 -14056 -7107 -5857 -5368 1059 8447 -3228 -10757 -14569
5267 -14569 -24401 -24028 -15549 -16244 -8432 6679 10350 -3629 -9461 7293 4000 5937 8187 11680
5253 11680 5486 14385 32625 19926 585 -13029 -16042 -10093 -5257 -1494 -2085 -2899 -6078 1744
5239 1744 7411 7536 9220 22680 24486 16956 16000 19848 25281 22473 17088 6688 11035 -8974 -21854
5224 -21854 -15439 -5758 7002 12830 11233 17166 23133 21085 8982 13963 8110 -4310 -6533 2392
5210 2392 7981 -575 -16726 -30453 -27270 -19465 -23435 -12861 -11411 -27936 -23734 -7805 13561
$$ packed form
5309a2866K865J925J1965j47j7229k5180O105K3994J3448l420j0743r062J3854
5296d491j604n956n445j264j763l242J6771J125r973m295k550P051j939l737M604
5281a6708J1331l788K746K741j0055l23O949J250M89O427P388j1675p529l812
5267a4569r832L73Q479o95P812J5111L671j3979n832J6754l293J937K250L493
5253A1680o194Q899J8240j2699j9341j3614l013N949M836L763n91q14l179P822
5239A744N667J25J684J3460J806p530r56L848N433k808n385j0400M347k0009j2880
5224b1854O415R681J2760N828j597N933N967k048j2103M981n853j2420k223Q925
5210B392N589q556j6151j3727L183P805l970J0574J450j6525M202J5929K1366
$$ plain form
5197 13561 22918 21943 19495 1725 -8231 -2802 -3959 2380 -8010 -7488 12619 19508 13304 13214 16654
5182 16654 4848 2545 5501 4198 -1882 -11060 -12097 -6101 -9549 -25912 -36977 -44387 -48164 -49812
5168 -49812 -35462 -17731 -18187 -20291 -17400 -22593 -20868 -9372 -11528 -597 -7610 -24467 -22399 -9998
5154 -9998 -6589 -16194 -8629 -3020 -14548 -2169 16688 17620 1612 5025 12538 18710 29605 33892
5140 33892 24981 24689 9513 348 4560 1523 -2566 -7482 -16722 -31079 -22776 -15628 -29430 -27477
5126 -27477 -20678 51 166 -11451 -2404 -157 3960 10868 -7865 -9305 -10256 -10428 -16369 -13746 -16426
5111 -16426 -28041 -20097 -20899 -25023 -21583 -4859 9828 6247 -13672 -15303 358 -4408 -1651 13023
5097 13023 5842 5152 -757 -21876 -19382 -14074 -12797 -15635 -9170 -7780 3539 -9765 -14180 -13089
$$ packed form
5197A3561R357r75k448j7770r956N429j157O339j0390N22K0107O889o204r0L440
5182A6654j1806k303K956j303o080r178j037N996l448j6363j1065p410l777j648
5168d9812J4350J7731m56k104K891n193J725J1496k156J0931p013j6857K068J2401
5154i998L409r605P565N609j1528J2379J8857R32j6008L413P513O172J0895M287
5140C3892q911k92j5176r165M212l037m089m916r240j4357Q303P148j3802J953
5126b7477O799K0729J15j1617R047K247M117O908j8733j440r51j72n941K623k680
5111a6426j1615P944q02m124L440J6724J4687l581j9919j631J5661m766K757J4674
5097A3023p181o90n909k1119K494N308J277k838O465J390J1319j3304m415J091
$$ plain form
5083 -13089 -7267 -9204 -23774 -21406 -10969 -8807 -25761 -26969 6381 34138 40989 23247 -1918
5070 -1918 -12623 -16774 -7770 -767 -7665 2827 9582 -179 -2301 7523 10241 11100 22520 31844
5056 31844 32670 16335 6145 -4045 -5201 2667 -3106 -6386 -3721 -8764 -12947 -8719 -8076 -7593 3616
5041 3616 -7899 -9400 -12214 -23934 -18475 -20296 -30650 -10091 7247 2973 -2501 -7757 -3510 644
5027 644 -6564 -6146 -8819 -7189 -21047 -25183 -23307 -35780 -27643 -20021 -19675 -5940 6154 -2986 -9105
5012 -9105 -14925 -29530 -17574 -13407 -27990 -30939 -26109 -25411 -25696 -25639 -17996 -13282 -3815 -1377 -16821
4997 -16821 -28954 -33695 -15004 8495 4916 -7481 -725 2683 -3469 -2886 -2726 474 8717 6228
4983 6228 2788 -19411 -27956 -20668 -14074 -21200 -14861 -9505 -17566 -22985 -37490 -29428 -8042 -677
$$ packed form
5083a3089N822j937j4570K368J0437K162j6954j208L3350K7757O851j7742k5165
5070a918j0705m151R004P003o898J0492O755r761k122R824K718Q59J1420R324
5056C1844Q26j6335j0190j0190j156P868n773l280K665n043m183M228O43M83J1209
5041C616j1515j501k814j1720N459j821j0354K0559J7338m274n474n256M247M154
5027F44p208M18k673J630j3858m136J876j2473Q137P622L46J3735J2094r140o119
5012i105n820j4605J1956M167j4583k949M830O98k85N7P643M714R467K438j5444
4997a6821j2133m741J8691K3499l579j2397O756L408o152N83J60L200Q243k489
4983F228l440k2199q545P288O594p126O339N356q061n419j4505Q062K1386P365
$$ plain form
4969 -677 -3366 201 4516 -3957 -24152 -29730 -3644 17541 22597 10553 8031 24230 22066 2203
4955 2203 -23352 -28792 -36315 -49488 -29078 -19496 -20093 -17163 -19000 -20839 -19488 -12252 -17398 -34495
4941 -34495 -20813 -7663 13157 4298 -1879 -4754 -216 -8248 10045 19538 6472 24679 12766
4928 12766 11464 22899 17210 3088 4911 4157 -11689 -7402 -9385 -2162 970 -6085 -11672 -11637 -16814
4913 -16814 -8058 -2019 -8067 -5779 -2374 5807 -18022 -30951 -27641 -25954 -30566 -23669 -11648 -299
4899 -299 -2840 -5813 -12466 -12694 2428 -3068 -18939 -25103 -9905 -1251 -9976 -12994 -2928 1034
4885 1034 -10544 -2039 2508 -1799 5352 -9997 -23796 -20853 -11924 -9180 -10644 -26441 -34162 -36117
4871 -36117 -32147 -15565 -6500 -5457 1726 3353 -9672 -19695 -22485 -23913 -30999 -31654 -26234 -1669
$$ packed form
4969f77k689L567M315q473k0195n578K6086K1185N056j2044k522J6199k164j9863
4955B203k5555n440p523j3173K0410R582n97K930j837j839J351P236n146j7097
4941c4495J3682J3150K0820q859o177k875M538q032J8293R493j3066J8207j1913
4928A2766j302J1435n689j4122J823p54j5846M287j983P223L132p055n587L5n177
4913a6814Q756O039o048K288L405Q181k3829j2929L310J687m612O897J2021J1349
4899b99k541k973o653k28J5122n496j5871o164J5198Q654q725l018J0066L962
4885A034j1578Q505M547m307P151j5349j3799K943Q929K744j464j5797p721j955
4871c6117L970J6582R065J043P183J627j3025j0023k790j428p086o55N420K4565
$$ plain form
4857 -1669 8850 1682 -10104 -10360 -11251 -652 2394 8525 11135 8404 4433 -3980 -3062 2452 5679
4842 5679 7743 12373 13355 10586 -3581 2016 8246 -4621 -15592 -10193 -20550 -29134 -26541 -16263
4828 -16263 -4061 5040 8368 -6334 -7393 -287 9259 8684 15961 18833 11113 9403 23409 29560
4814 29560 28584 21993 3997 5873 -16559 -7508 -5800 3955 1251 -3056 -2969 -25463 -39172 -29516
4800 -29516 -4490 -1329 -5942 1281 2450 4336 -7262 -13910 1254 8828 9834 15744 15133 15210 4826
4785 4826 -17 15478 22897 15334 299 868 2460 132 3555 8152 -4476 -589 11798 336
4771 336 -8533 -3367 11196 7532 -1260 -9373 -5814 11697 7099 4912 -6044 -18369 -20792 -23028
4757 -23028 -19946 -13533 8164 4375 -8974 -25788 -20892 -4790 -12025 -16500 -1834 -9632 -25143
$$ packed form
4857a669J0519p168j1786k56q91J0599L046O131K610k731l971q413R18N514L227
4842E679K064M630R82k769j4167N597O230j2867j0971N399j0357q584K593J0278
4828a6263J2202R101L328j4702j059P106R546n75P277K872p720j710J4006O151
4814B9560r76o591j7996J876k2432R051J708R755k704m307Q7k2494j3709R656
4800b9516K5026L161m613P223J169J886j1598o648J5164P574J006N910o11P7j0384
4785D826m843J5495P419p563j5035N69J592k328L423M597j2628L887J2387j1462
4771C36q869N166J4563l664q792q113L559J7511m598k187j0956j2325k423k236
4757b3028L082O413K1697l789j3349j6814M896J6102p235m475J4666p798j5511
$$ plain form
4744 -25143 -19647 -12356 -5948 -5211 -2168 115 4746 -2004 -12409 -10226 -15719 -7197 -1912 -6383 -22478
4729 -22478 -22631 -24877 -24175 -41522 -32395 -20468 -23683 -34904 -26645 -12318 -9692 -10789 1422 15950
4715 15950 1167 741 14431 23806 11003 -5254 -5142 -2256 2298 -2431 -5082 -6716 -14372 -10603
4701 -10603 -6218 -302 3002 8456 9816 -1106 -6711 -5352 6232 16124 8247 8194 9847 2112 -3188
4686 -3188 12155 11486 13046 10258 10597 15206 4090 -17455 -38785 -22775 -4882 17700 29194
4673 29194 24498 13295 12954 17504 13732 18832 16787 562 5899 -281 -4228 13879 14764 23700
4659 23700 22486 12060 15563 12201 13491 1908 -1093 15371 22441 5535 -6164 6147 4303
4646 4303 3681 6635 2323 -15172 -21148 -15942 -4907 -10795 -12966 -15051 -13719 -16662 -6502 -10651
$$ packed form
4744b5143N496P291O408P37L043K283M631o750j0405K183n493Q522N285m471j6095
4729b2478j53k246P02j7347R127J1927l215j1221Q259J4327K626j097J2211J4528
4715A5950j4783m26J3690R375j2803j6257J12K886M554m729k651j634p656L769
4701a0603M385N916L304N454J360j0922n605J359J1584R892p877n3J653p735n300
4686c188J5343o69J560k788L39M609j1116k1545k1330J6010J7893K2582J1494
4673B9194m696j1203l41M550l772N100k045j6225N337o180l947J8107Q85Q936
4659B3700j214j0426L503l362J290j1583l001J6464P070j6906j1699J2311j844
4646D303o22K954m312j7495n976N206J1035n888k171k085J332k943J0160m149
$$ plain form
4632 -10651 -16575 -14336 -29988 -39773 -36735 -27403 -24347 -6463 -6055 -10969 -13578 -25551 -23133 -10572
4618 -10572 7777 -6939 -1074 -1349 -4135 4245 18145 20495 18747 15010 7284 117 -9804 -1823
4604 -1823 -5982 -14834 -21553 -22502 -29813 -10955 -2559 -3063 2558 -6048 -9132 -4551 664 -15279 -16353
4589 -16353 -5334 3881 11706 15413 9075 -7824 -26546 -24913 -18492 -12704 -10022 4709 -1194 -3181
4575 -3181 11258 6604 -2840 2299 10551 4823 -40 -2663 -3737 -7020 -2581 -18061 -23850 -4907
4561 -4907 4179 -7975 -21660 -24641 -24967 -23191 -29230 -22776 -10043 -3967 -6499 3882 22884 24163
4547 24163 8958 -4286 -13943 -15593 -5606 -17139 -21828 -23357 -22390 -13280 -13084 -8329 -4959 1612
4533 1612 -1818 -5629 -5641 -5600 -8411 -7189 -2998 -10921 -11454 -17280 -14241 -8713 -2897 5083 16246 18352
$$ packed form
4632a0651n924K239j5652r785L038R332L056J7884M08m914k609j1973K418J2561
4618a0572J8349j4716N865k75k786Q380J3900K350j748l737p726p167r921P981
4604a823m159q852o719r49p311J8858Q396n04N621q606l084M581N215j5943j074
4589a6353J1019R215P825L707o338j6899j8722J633O421N788K682J4731n903j987
4575c181J4439m654r444N139Q252n728m863k623j074l283M439j5480n789J8943
4561d907R086j2154j3685k981l26J776o039O454J2733O076k532J0381J9002J279
4547B4163j5205j3244r657j650R987j1533m689j529R67R110J96M755L370O571
4533A612l430l811j2M1k811J222M191p923n33n826L039N528N816P980J1163K106
$$ plain form
4517 18352 9680 -807 -583 -13990 -8835 -6241 -11724 -12119 3818 1115 -643 826 -3260 5718
4503 5718 14193 14036 10505 14233 7766 2409 683 -13537 -13375 2964 1358 3800 8759 -1208 -6501
4488 -6501 -28505 -46857 -38750 -20947 -17906 -23843 -19825 -11765 -2140 8614 6296 -16228 -18614 -7899
4474 -7899 -2987 -8057 -6535 -14239 -25622 -18486 -9028 -10264 2213 14257 11399 8178 4933 2754
4460 2754 -7876 -14172 -15664 3512 12815 12277 8637 6646 611 1218 3660 -5887 -9890 294 8626
4445 8626 18244 24406 16329 18147 11076 4794 12073 5022 -2431 -6337 -8384 -3380 5626 10016 3397
4430 3397 -1952 10246 2069 -5817 -9707 3664 11607 -17025 -34322 -15932 5266 8654 -7741
4417 -7741 -10164 -18873 -13360 -4910 17751 24892 22664 15991 16686 20522 18214 -3003 -13268 -11641
$$ packed form
4517A8352q672j0487K24j3407N155K594n483l95J5937k703j758J469m086Q978
4503E718Q475j57l531L728o467n357j726j4220J62J6339j606K442M959r967n293
4488f501k2004j8352Q107J7803L041n937M018Q060R625J0754k318k2524k386J0715
4474g899M912n070J522p704j1383P136R458j236J2477J2044k858l221l245k179
4460B754j0630o296j492J9176R303n38l640j991o035O07K442r547m003J0184Q332
4445H626R618O162q077J818p071o282P279p051p453l906k047N004R006M390o619
4430C397n349J2198q177p886l890J3371P943k8632j7297J8390K1198L388j6395
4417g741k423q709N513Q450K2661P141k228o673O95L836k308k1217j0265J627
$$ plain form
4403 -11641 -1795 6464 8796 13932 15751 17438 14002 13777 13728 -3192 -15604 -15224 -7597 -2518 5691
4388 5691 -1817 -5426 497 -7110 -19076 -20139 -23026 -1979 7367 5494 -3495 1275 -2683 -7872
4374 -7872 -11419 -6049 1262 -6580 8671 7945 -4220 -15000 -8074 -7736 -11162 1395 1368 -3607 -7524
4359 -7524 2070 7278 4794 -3431 -4030 -5287 -15849 -14005 2923 711 -1933 7415 -2465 -4658 5231
4344 5231 13502 15594 9777 -4 -1790 -939 -8155 -13789 -12591 -13556 -15368 -12223 -2674 8088 11693
4329 11693 12276 10749 10892 2229 -13855 -15376 -23525 -15660 -8715 -16 3178 -3970 -11627 -11892 -16468
4314 -16468 -15680 -10008 -4533 5587 -1091 -10581 -11199 -25145 -21401 -21112 308 19577 31955 24304
4300 24304 15262 18453 -4050 -12345 4082 10407 3071 5541 18807 13272 -2278 -1786 -6808 -4011
$$ packed form
4403a1641R846Q259K332N136J819J687l436k25m9j6920j2412L80P627N079Q209
4388E691p508l609N923p607j1966j063k887K1047R346j873q989M770l958n189
4374g872l547N370P311p842J5251p26j2165j0780O926L38l426J2557k7m975l917
4359g524R594N208k484q225n99j257j0562J844J6928k212k644R348r880k193R889
4344E231Q271K092n817r781j786Q51p216n634J198r65j812L145R549J0762L605
4329A1693N83j527J43q663j6084j521q149P865O945Q699L194p148p657k65m576
4314a6468P88N672N475J0120o678r490o18j3946L744K89K1420J9269J2378p651
4300B4304r042L191k2503q295J6427O325p336K470J3266n535j5550M92n022K797
$$ plain form
4286 -4011 2533 6794 6562 5908 -758 485 1761 -12804 -13447 -1228 3270 2098 -6376 -9172 4235
4271 4235 7339 -3052 -15478 -5226 4720 11092 9359 -9324 -10290 -2295 -6738 -9117 -10940 -17118
4257 -17118 -12978 -13997 -21790 -6964 -909 -5581 -8574 -6813 -16880 -19399 -24647 -35088 -33118 -32759
4243 -32759 -38145 -35266 -22181 -7575 3650 12223 -11256 -28214 -27293 -30235 -18681 -8045 -979
4230 -979 13574 8542 11169 17726 6541 -8407 -7412 -16989 -7620 -1555 3310 6788 11466 21382 13711
4215 13711 10919 10535 17851 23113 22896 23027 20647 -2220 -13275 -4351 11416 17565 19009 10749 10399
4200 10399 2472 -169 -581 719 7566 11669 5436 3200 2769 22313 18883 9428 5268 5847 3070
4185 3070 7385 14378 4791 15562 40498 41713 36070 32140 20265 8430 21507 27955 16821
$$ packed form
4286d011O544M261k32o54o666J243J276j4565o43J2219M498j172q474k796J3407
4271D235L104j0391j2426J0252R946O372j733j8683r66P995m443k379j823o178
4257a7118M140j019p793J4826O055m672k993J761j0067k519n248j0441J970L59
4243c2759n386K879J3085J4606J1225Q573k3479j6958R21k942J1554J0636P066
4230i79J4553n032K627O557j1185j4948R95r577R369O065M865L478M678R916p671
4215A3711k792l84P316N262k17J31k380k2867j1055Q924J5767O149J444q260l50
4200A0399p927k641m12J300O847M103o233k236m31J9544l430r455m160N79k777
4185C070M315O993r587J0771K4936J215n643l930j1875j1835J3077O448j1134
$$ plain form
4172 16821 7179 -5179 -3956 -2843 11402 -783 -8217 -10665 -12830 -12005 -8981 833 -5309 2209
4158 2209 -4828 -10054 -13050 -11206 -13563 7971 23820 16382 2483 2526 4507 11373 14658 8568 6983
4143 6983 14555 8849 -1465 -10077 -9219 -6926 -11164 -2604 6707 1038 -7042 -8166 -11709 -10501 7433
4128 7433 17466 10916 6022 -1747 -8821 -5925 -189 1840 -690 2396 -429 -2971 -5960 -244 15862
4113 15862 28017 14164 -13039 -26549 -26426 -14950 -7440 -8989 -5986 -5946 -7142 -1176 -1175 -9263 -1895
4098 -1895 421 4002 10075 11927 6787 1248 -11386 -11295 -2326 70 -5873 -5116 -6788 10348 25729
4083 25729 19886 7128 -9590 -23288 -21638 -23337 -29238 -22969 -18466 -6677 2046 -15528 -17579
4070 -17579 -11141 -9238 9051 12483 3217 -11814 -9145 -16266 -3854 -8332 -17746 -27791 -25198 -24268
$$ packed form
4172A6821r642j2358J223J113J4245j2185p434k448k165Q25L024R814o142P518
4158B209p037n226k996J844k357K1534J5849p438j3899M3J981O866L285o090j585
4143F983P572n706j0314q612Q58K293m238Q560R311n669q080j124l543J208J7934
4128G433J0033o550m894p769p074K896N736K029k530L086k825k542k989N716J6106
4113A5862J2155j3853k7203j3510J23J1476P510j549L003M0j196N966Jq088P368
4098a895K316L581O073J852n140n539j2634R1Q969K396n943P57j672J7136J5381
4083B5729n843j2758j6718j3698J650j699n901O269M503J1789Q723j7574k051
4070a7579O438J903J8289L432r266j5031K669p121J2412m478r414j0045K593R30
$$ plain form
4056 -24268 -17840 -5672 7556 3500 -4017 -10792 -16384 -7998 10987 14451 3849 -3827 10602
4043 10602 15628 6850 694 518 -10902 -11888 -14199 -27472 -30573 -19451 -17893 -13248 -6414 2693
4029 2693 10280 20184 41552 45307 24024 13157 10956 3905 -13666 -20608 -18033 -10719 1562 14566
4015 14566 25069 23034 12712 10514 16667 15889 9203 6100 8833 6481 9021 -662 -9706 -7204
4001 -7204 -7308 4194 6413 5129 -1392 -13207 -820 -6713 -9352 9249 12414 677 1574 15620
3987 15620 8211 -9901 -12257 -4759 18072 24497 12071 1515 3488 5360 -3510 -11747 -7069 2831
3973 2831 8334 443 -16628 -13083 -6574 12213 13222 -3636 -2009 6322 -14736 -28317 -22411 -21530
3959 -21530 -6694 8211 1585 -1216 -5204 1492 12224 13400 8880 704 -3269 -8247 4590 8094
$$ packed form
4056b4268O428J2168J3228m056p517o775n592Q386J8985L464j0602p676J4429
4043A0602N026q778o156j76j1420r86k311j3273l101J1122J558M645O834R107
4029B693P587R904K1368L755k1283j0867k201p051j7571o942K575P314J2281J3004
4015A4566J0503k035j0322k198O153p78o686l103K733k352K540r683r044K502
4001g204j04J1502K219j284o521j1815J2387n893k639J8601L165j1737Q97J4046
3987A5620p409j8112k356P498K2831O425j2426j0556J973J872q870q237M678R900
3973B831N503p891j7071L545O509J8787J009j6858J627Q331k1058j3581N906Q81
3959b1530J4836J4905o626k801l988O696J0732J176m520q176l973m978J2837L504
$$ plain form
3945 8094 15211 20665 19672 7650 -8671 -4083 -5703 -9268 -8079 -3114 -1160 -5724 -14346 -16271 -22525
3930 -22525 -39071 -33290 -13259 -7516 -12148 -8683 2511 -15809 -12149 -9019 -11476 -11786 -3214 -11217
3916 -11217 -24520 -32393 -40116 -40433 -39667 -33081 -25593 -14967 -10584 -1923 -1 -9601 -20023 -6992
3902 -6992 3470 4332 7211 4275 3130 -6651 -19066 -14431 -3183 -10286 -15343 -10516 -20836 -24721
3888 -24721 -27978 -27654 -22094 -19788 -28406 -30672 -17729 -15593 -6928 -1771 -6820 -9080 -5392 6034
3874 6034 4649 15115 19742 11610 5418 -16081 -23883 -27947 -14089 -4618 9857 27564 21356 9872
3860 9872 5391 7450 5086 -7725 -13652 -699 -4920 -13247 -7718 -3494 -518 -9746 -12350 -7444
3846 -7444 -28594 -31277 -32383 -33311 -17838 -11217 -7650 -1038 -9428 -5692 6955 10010 7870 -9117
$$ packed form
3945H094P117N454r93j2022j6321M588j620l565J189M965J954m564q622j925o254
3930b2525j6546N781K0031N743m632L465J1194j8320L660L130k457l10Q572q003
3916a1217j3303p873p723l17P66O586P488J0626M383Q661J922r600j0422J3031
3902f992J0462Q62K879k936j145r781j2415M635J1248p103n057M827j0320l885
3888b4721l257L24N560K306q618k266J2943K136Q665N157n049k260L688J1426
3874F034j385J0466M627q132o192k1499p802m064J3858R471J4475J7707o208j1484
3860I872m481K059k364j2811n927J2953m221q327N529M224K976r228k604M906
3846g444k1150k683j106r28J5473O621L567O612q390L736J2647L055k140j6987
$$ plain form
3832 -9117 -808 7537 5915 11810 18889 15768 11691 6494 11073 7763 -7044 -12214 -3945 -2860 -6959
3817 -6959 7901 10478 4059 5512 13464 -1926 -18624 -14486 -10323 -7672 402 -238 2942 9722
3803 9722 26901 33445 46748 48288 33248 21107 22632 19325 22064 16505 152 -10329 -5287
3790 -5287 -8100 -1212 6777 10983 11251 7813 1961 -827 -13680 -10098 -7021 -10700 -12396 -2831 3430
3775 3430 1657 -4196 -15197 -18371 -34233 -36374 -32912 -28430 -19282 -11854 -9428 -13532 -26214 -20098
3761 -20098 -15121 -7090 -7460 -22678 -26852 -16077 10718 22099 37052 15879 -3126 -5464 -5605
3748 -5605 -15559 -6354 -3128 -4477 -4034 -14253 -13213 -509 -5244 -1 8389 11297 6669 2200 11361
3733 11361 11532 10595 2526 -18592 -26754 -13160 2865 7646 6027 -9036 -23135 -34981 -36640 -16907
$$ packed form
3832i117Q309Q345j622N895P079l121m077n197M579l310j4807n170Q269J085m099
3817f959J4860K577o419J453P952j5390j6698M138M163K651Q074o40L180O780
3803I722J7179O544J3303J540j5040j2141J525l307K739n559j6353j0481N042
3790e287k813O888P989M206K68l438n852k788j2853L582L077l679j696R565O261
3775C430j773n853j1001l174j5862k141L462M482R148P428K426m104j2682O116
3761b0098M977Q031l70j5218m174J0775K6795J1381J4953k1173j9005k338j41
3748e605r954R205L226j349M43j0219J040J2704m735N243Q390K908m628m469R161
3733A1361J71r37q069k1118q162J3594J6025M781j619j5063j4099j1846j659J9733
$$ plain form
3719 -16907 5588 4827 4192 -533 -4898 -866 -12507 -17312 -2193 10571 23964 11810 -5925
3706 -5925 -18790 -16132 -17870 -14757 -10177 -13331 -30435 -37684 -28824 -18651 -13369 -21697 -29552 -27572
3692 -27572 -18850 -17226 -20831 -8187 -9316 7631 14843 16578 14545 7499 2670 8580 7070 -6648
3678 -6648 -12896 -16849 3878 19052 21642 12698 3310 -14853 -27384 -22885 -6992 1638 18367
3665 18367 1126 -15000 -18744 -13006 -461 -14779 -19688 -5283 -447 -8091 -6112 914 5589
3652 5589 8070 9549 -1217 1634 -6605 -16145 -17457 6541 13602 27878 21553 4892 1395 -7408
3638 -7408 -16736 -29170 -24796 -9815 -15087 -15830 -2872 2519 11784 15393 2621 -7123 -1306 -5462
3624 -5462 -8315 -1339 -983 -23555 -16015 -2415 5891 6339 5907 261 1965 21690 14680 1384 -3374
$$ packed form
3719a6907K2495p61o35m725m365M032j1641m805J5119J2764J3393j2154j7735
3706e925j2865K658j738L113M580l154j7104p249Q860J0173N282q328p855J980
3692b7572Q722J624l605J2644j129J6947P212J735k033p046m829N910j510j3718
3678f648o248l953K0727J5174K590q944r388j8163j2531M499J5893Q630J6729
3665A8367j7241j6126l744N738J2545j4318m909J4405M836p644J979P026M675
3652E589K481J479j0766K851q239r540j312K3998P061J4276o325j6661l497q803
3638g408r328j2434M374J4981n272p43J2958N391R265L609j2772r744N817m156
3624e462k853O976L56k2572P540J3600Q306M48m32n646J704J9725p010j3296m758
$$ plain form
3609 -3374 -566 -2051 1397 17585 15342 7542 -2661 -5179 2672 -18253 -22852 -11302 -11836 5633
3595 5633 17398 7898 -12523 -7567 -9831 -14688 -18908 -32406 -19651 -11247 -6133 -8378 -23673 -27087
3581 -27087 -17475 -5531 4207 -5339 -4718 334 -4432 -1203 7917 563 -25066 -36855 -35625 -15017
3567 -15017 -26655 -32489 -13801 -6391 -5182 -8171 -14786 -5220 8601 -3110 6742 18224 918
3554 918 -1046 -8186 -6635 1121 -10498 -23028 -21415 -24545 -16064 -20805 -22652 -18631 -23279 -21935 -11464
3539 -11464 -3552 2463 3472 16980 18685 1416 6699 15445 11894 5925 8791 10194 8824 13963
3525 13963 12940 7382 -11863 -17661 -16501 -15808 -10573 281 -1277 -2271 5821 8676 15901 13865 22775
3510 22775 30033 23291 9735 -5253 -14770 -3573 -11195 -2848 7680 8832 -4230 -5806 5167
$$ packed form
3609c374K808j485L448J6188k243p800j0203k518P851k0925m599J1550n34J7469
3595E633J1765r500k0421M956k264m857m220j3498J2755Q404N114k245j5295l414
3581b7087R612J1944R738r546O21N052m766L229R120p354k5629j1789J230K0608
3567a5017j1638n834J8688P410J209k989o615R566J3821j1711R852J1482j7306
3554I18j964p140J551P756j1619j2530J613l130Q481m741j847M021m648J344J0471
3539a1464P912O015J009J3508J705j7269N283Q746l551n969K866J403j370N139
3525A3963j023n558j9245n798J160O93N235J0854j558r94Q092K855P225k036Q910
3510B2775P258o742j3556j4988r517J1197p622Q347J0528J152j3062j576J0973
$$ plain form
3497 5167 12264 19576 -12091 -26859 -16281 -22044 -14864 -7519 -10918 2355 12207 10949 9053 -3786
3483 -3786 -18026 -4600 -923 13091 21210 20436 14615 2853 -3177 -10361 -1022 9745 16200 12741
3469 12741 3284 -801 -7014 -8251 -8837 -18722 -11664 -10072 -8561 3919 10088 -4694 -11296 -14630
3455 -14630 -1917 -5623 -11314 -16156 -13360 -5083 -13989 -13202 1835 -4368 -18907 -20963 -10378 -5195
3441 -5195 -3278 -8037 -8380 -11575 -15627 -4277 9637 6110 -6283 12829 22021 21484 1709 2933
3427 2933 -4829 -7825 1230 20282 26483 30876 30809 23256 12950 -2754 -20670 -19102 -9815 5660
3413 5660 8223 1446 -7403 -22946 -26041 -18822 -9358 -12336 1288 13165 7981 13346 8312 6939
3399 6939 11414 4183 -478 3683 -4252 -2812 3961 -8497 -20125 -28087 -20773 -5613 10447 22405
$$ packed form
3497E167P097P312l1667j4768J0578n763P180P345l399J3273R852j258j896j2839
3483c786j4240J3426L677J4014Q119p74n821j1762o030p184R339J0767O455l459
3469A2741r457m085o213j237n86r885P058J592J511J2480O169j4782o602l334
3455a4630J2713l706n691m842K796Q277q906P87J5037o203j4539k056J0585N183
3441e195J917m759l43l195m052J1350J3914l527j2393J9112R192n37j9775J224
3427B933p762k996R055J9052O201M393o7p553j0306j5704j7916J568R287J5475
3413E660K563o777q849j5543l095P219R464k978J3624J1877n184N365n034j373
3399F939M475p231m661M161p935J440O773j2458j1628p962P314J5160J6060J1958
$$ plain form
3385 22405 20688 18155 8179 -14071 -31186 -15119 -1840 310 8459 -9225 -18204 -18962 -13474 -11044
3371 -11044 3773 2655 -4307 -24615 -26617 -19920 -11259 -11689 -28421 -22542 -2581 -1310 3049 2217
3357 2217 -2522 1963 9575 3464 1716 -225 11371 9143 -8646 -2473 8546 6889 8543 5536
3343 5536 1364 2305 -3739 -4134 -5764 573 2286 -11213 -8200 -6400 -5677 -3277 -4896 -1493 -1323 -14581
3327 -14581 -12068 -3477 -8931 -7633 2644 -371 -20592 -21658 -26960 -21165 -857 19380 16646 3714
3313 3714 641 -5327 -6627 -644 -6685 -13540 90 10256 7888 5099 1914 -8528 -9798 6278
3299 6278 1569 -2949 -13507 -32131 -27984 -20103 -31893 -27935 -15242 -10114 -2190 -3129 -17451 -18486
3285 -18486 -20606 -24632 -17638 2709 16091 15411 8024 -998 8661 11659 8491 13065 12008 10650
$$ packed form
3385B2405j717k533r976k2250j7115J6067J3279K150Q149j7684q979p58N488K430
3371a1044J4817j118o962k0308k002O697Q661m30j6732N879J9961J271M359q32
3357B217m739M485P612o111j748j941J1596k228j7789O173J1019j657J654l007
3343E536m172R41o044l95j630O337J713j3499L013J800P23K400j619L403J70j3258
3327a4581K513Q591n454J298J0277l015k0221j066n302N795K0308K0237k734j2932
3313C714l073n968j300N983o041o855J3630J0166k368k789l185j0442j270J6076
3299F278m709m518j0558j8624M147P881j1790L958J2693N128P924r39j4322j035
3285a8486k120m026O994K0347J3382o80p387r022R659K998l168M574j057j358
$$ plain form
3271 10650 -13740 -14898 7021 8047 3045 12353 6865 1008 -755 -2163 3012 -813 -1314 2658
3257 2658 -1904 -1355 -5426 -4547 -3901 1846 16678 21396 17849 22256 12539 11996 16626 14633 -1817
3242 -1817 84 3084 -3447 -24877 -15073 -7350 -8509 -8868 -11510 -14264 -12478 -7523 -13540 4764 20851
3227 20851 30742 31199 15160 7842 -1369 3851 27574 9400 -9534 1094 12842 1723 -10718
3214 -10718 -10863 -9043 1210 13634 791 11316 9646 10084 -2591 -13444 -8553 -3810 8569
3201 8569 19694 27640 22835 14260 13346 17577 11449 2630 4786 6527 -5036 -12124 -4161 5381 2093
3186 2093 1212 -409 -9110 5357 23432 12809 5294 9279 7567 9567 -4394 -10962 -2627 -3456
3172 -3456 6254 8533 -2401 -1085 -8909 -25492 -18413 -9658 -6767 -8192 -7651 1007 3336 -1545 -4370
$$ packed form
3271A0650k4390j158K1919J026n002R308n488n857j763j408N175l825n01L972
3257B658m562N49m071Q79O46N747J4832M718l547M407r717n43M630j993j6450
3242a817J901L000o531k1430R804P723j159l59k642k754J786M955o017J8304J6087
3227B0851R891M57j6039p318r211N220K3723j8174j8934J0628J1748j1119j2441
3214a0718j45J820J0253J2424j2843J0525j670M38j2675j0853M891M743J2379
3201H569J1125P946m805q575r14M231o128q819K156J741j1563p088P963R542l288
3186B093q81j621q701J4467J8075j0623p515L985j712K000j3961o568Q335q29
3172c456R710K279j0934J316p824j6583P079Q755K891j425N41Q658K329m881k825
$$ plain form
3157 -4370 4311 6410 167 -13502 -6298 -4024 -19418 -7392 -985 15082 18911 12013 7388 5123
3143 5123 5317 -2624 1311 2220 -6870 -18061 -17612 1797 6476 13467 15058 -5298 -6871 -2876 13940
3128 13940 9418 21119 26109 28730 13862 -13465 -28568 -19267 -5042 -5182 -17265 -17630 -1965
3115 -1965 20618 25894 24248 25425 33622 33463 20321 3903 -7902 -1551 -4853 -3666 4245 -8131
3101 -8131 -3151 1348 -4561 3390 13405 11694 5467 -3074 -1922 12483 29199 24557 9681 552
3087 552 -9338 -10859 -10461 -16236 -19201 -17053 -19387 -17380 -13298 -20319 -16780 -26240 -25196 -11266 -18230
3072 -18230 -12272 -23431 -35651 -23999 -5351 8188 6621 9697 7229 -2598 -9152 -7291 -14048
3059 -14048 -22790 -18806 -8614 2010 8375 17065 -1009 -13280 -3055 499 -6236 -6539 772 -507
$$ packed form
3157d370Q681K099o243j3669P204K274j5394J2026O407J6067L829o898m625k265
3143E123J94p941L935R09r090j1191M49J9409M679O991J591k0356j573L995J6816
3128A3940m522J1701M990K621j4868k7327j5103R301J4225j40j2083l65J5665
3115a965K2583N276j646J177Q197j59j3142j6418j1805O351l302J187P911j2376
3101h131M980M499n909P951J0015j711o227q541J152J4405J6716m642j4876r129
3087E52r890j521L98n775k965K148k334K007M082p021L539r460J044J3930o964
3072a8230N958j1159j2220J1652J8648J3539j567L076k468r827o554J861o757
3059a4048q742L984J0192J0624O365Q690j8074j2271J0225L554o735l03P311j279
$$ plain form
3045 -507 -4134 -7344 -1634 -5167 103 6751 1111 -9861 -7621 2268 13505 15324 7954 16818 16715
3030 16715 26182 15231 24357 13222 12094 -66 -5440 3304 6937 9849 8817 15146 -666 -12408
3016 -12408 -17847 -4656 -4279 7548 13670 7774 -10877 -11987 -5854 13926 25726 7939 -4189
3003 -4189 -6676 -10792 -17829 -18494 -6287 5293 8480 16330 22119 8937 6695 322 -4724 -12869
2989 -12869 -16273 -2177 13977 1763 2710 8082 12242 9841 1783 -4251 -5952 -4945 1355 10987
2975 10987 3526 774 -13358 -14543 -4784 -16255 -20585 -8846 -10900 -11075 -29637 -29574 -15865 2853
2961 2853 14058 9751 8638 19792 32310 26711 3957 -443 -7053 -5229 6370 16518 15679 18106
2947 18106 3607 -13188 -18362 -21444 -34758 -13865 3485 5037 6795 14935 5406 -8647 -6387
$$ packed form
3045e07l627l210N710l533N270O648n640j0972K240R889J1237J819p370Q864j03
3030A6715R467j0951R126j1135j128j2160n374Q744L633K912j032O329j5812j1742
3016a2408n439J3191L77J1827O122n896j8651j110O133J9780J1800j7787j2128
3003d189k487m116p037o65J2207J1580L187P850N789j3182k242o373n046q145
2989a2869l404J4096J6154j2214R47N372M160k401q058o034j701J007O300R632
2975A0987p461k752j4132j185R759j1471m330J1739k054j75j8562O3J3709J8718
2961B853J1205m307j113J1154J2518n599k2754m400o610J824J1599J0148q39K427
2947A8106j4499j6795n174l082j3314K0893J7350J552J758Q140r529j4053K260
$$ plain form
2934 -6387 -16336 -26890 -24097 -26490 -20499 -14891 2216 4558 -5239 -8939 -3377 -3648 16326 14130
2920 14130 146 -5998 -5540 -2846 -8646 6348 15080 3614 -3897 -18784 -19804 -12959 -18243 -22367
2906 -22367 -20691 -17500 4736 4905 -3186 -14969 -17905 -11175 2155 5246 5832 7718 7096 -1585 -7729
2891 -7729 -10490 -8441 -19008 -5581 10066 18338 18830 6633 -8219 -11366 -4060 -4153 -2892 -3989
2877 -3989 -5030 4425 12079 1724 -2160 11619 -3116 -24986 -9763 -4228 -9391 -10184 6660 2059
2863 2059 -3518 4448 12574 611 -5398 1932 1854 6859 -3333 -4196 529 -9097 -21766 -11786 -6659
2848 -6659 -9885 -6731 -452 -3690 4538 9193 9474 -3644 -4534 20968 25544 14130 23161 15400 3432
2833 3432 -14045 -24569 -9384 1258 10771 14562 17197 25601 23163 12026 -1455 -2518 -15
$$ packed form
2934f387r949j0554K793k393N991N608J7107K342r797l700N562k71J9974k196
2920A4130j3984o144M58K694n800J4994Q732j1466p511j4887j020O845n284m124
2906b2367J676L191K2236J69q091j1783k936O730J3330L091N86J886o22q681o144
2891g729k761K049j0567J3427J5647Q272M92j2197j4852l147P306r3J261j097
2877c989j041R455P654j0355l884J3779j4735k1870J5223N535n163p93J6844m601
2863B059n577P966Q126j1963o009P330p8N005j0192q63M725r626j2669R980N127
2848f659l226L154O279l238Q228M655K81j3118q90K5502M576j1414R031p761j1968
2833C432j7477j0524J5185J0642R513L791K635Q404k438j1137j3481j063K503
$$ plain form
2820 -15 -8250 -5764 5688 4735 14546 14293 7179 11876 23934 23537 21048 -3535 -18471 -15708 -3493
2805 -3493 10567 19484 13087 6680 -9097 -10928 -15101 -3751 11357 15522 8936 -842 11945 18385
2791 18385 13992 10983 9509 -196 10040 12935 843 -5461 -6318 -2208 8583 12474 12638 7648
2777 7648 1073 266 8877 3226 -3305 -1305 4283 -3553 -5526 -15086 -11848 -3646 6151 -4784 -10171
2762 -10171 -3832 -11939 -1402 6259 4900 10649 8737 9246 13176 -425 -18792 -34220 -35518 -14082
2748 -14082 -9682 -1207 12198 2728 1918 739 10893 9826 -2503 -5461 -6790 -14345 -24179 -24612
2734 -24612 -23143 -26386 -21779 -8384 -14992 -30451 -23504 -13222 -12920 -15774 -18047 -25408 -16757 -4070
2720 -4070 6299 24224 11673 -774 -15759 -18139 -23678 -19156 -7245 941 8228 16425 -1348
$$ packed form
2820a5q235K486J1452r53R811k53p114M697J2058l97k489k4583j4936K763J2215
2805c493J4060Q917o397o407j5777j831m173J1350J5108M165o586r778J2787O440
2791A8385m393l009j474r705J0236K895j2092o304q57M110J0791L891J64m990
2777G648o575q07Q611n651o531K000N588p836j973r560L238Q202R797j0935n387
2762a0171O339q107J0537P661j359N749j912N09L930j3601j8367j5428j298K1436
2748a4082M400Q475J3405r470q10j179J0154j067j2329k958j329p555r834m33
2734b4612J469l243M607J3395o608j5459O947J0282L02k854k273p361Q651J2687
2720d070J0369J7925j2551j2447j4985k380n539M522J1911Q186P287Q197j7773
$$ plain form
2707 -1348 -16238 -15875 -5920 -2337 -2663 -1379 1874 2276 -9438 -486 -3071 -1046 4530 7242 5747
2692 5747 -5334 -12337 -27945 -37538 -27427 -11247 638 1258 4191 6848 3763 11367 8105 -6836
2678 -6836 -5422 6097 29665 32188 15040 3022 9518 23729 30973 25640 19763 24932 25131 19220
2664 19220 8112 -5077 8260 1934 7615 11472 -997 -7162 -11070 2671 4221 5909 3434
2651 3434 11720 9987 -2566 -4037 -8971 -13670 -10560 -8086 3558 11623 9303 6094 5410 4585 8166
2636 8166 -1007 -16919 -11741 -13795 -23466 -5325 16913 12856 -1339 -3582 -11608 -21785 -22987 -27156
2622 -27156 -12034 -4574 -12449 -10408 -15645 -11303 -12502 -13532 -9364 -13980 -15989 -457 4683 -8091
2608 -8091 -16034 -22519 -21149 -18935 -13609 -19176 -31468 -26639 -17464 -10844 -8577 4882 8542 1039
$$ packed form
2707a348j4890L63R955L583l26J284L253M02j1714Q952k585K025N576K712j495
2692E747j1081p003j5608r593J0111J6180J1885O20K933K657l085P604l262j4941
2678f836J414J1519K3568K523j7148j2018O496J4211P244n333n877N169J99n911
2664A9220j1108j3189J3337o326N681L857j2469o165l908J3741J550J688k475
2651C434Q286j733j2553j471m934m699L110K474J1644Q065k320l209o84q25L581
2636H166r173j5912N178k054r671J8141K2238m057j4195k243q026j0177j202m169
2622b7156J5122P460p875K041n237M342j199j030M168m616k009J5532N140j2774
2608h091p943o485J370K214N326n567j2292M829R175O620K267J3459L660p503
$$ plain form
2594 1039 -2568 -3985 -16162 -29550 -32198 -13719 5914 -5049 -12177 -3519 -3828 -9555 -15506 -22638
2580 -22638 -24053 -5177 -4850 -14448 2970 11586 5392 -853 -1986 -8498 -9678 -12632 1005 -313
2566 -313 4888 7454 4012 8179 4905 -7896 -20519 -22356 -8467 8520 4964 144 -8318 -2318
2552 -2318 -5396 -7311 40 -1239 -9540 -12862 7501 14658 16618 13770 7952 2057 -5713 6856
2538 6856 -304 -14660 -16274 -15722 -24882 -26986 -27105 -27226 -21385 -23681 -16951 -18094 -23817 -36161 -28117
2523 -28117 -13510 -9116 -2354 13924 16105 16931 27120 23571 15256 1066 -16054 -18886 -16013 -11851
2509 -11851 1113 3514 3645 6327 8741 -1525 -13924 -14719 -12949 -1798 5451 14118 7556 -10241
2495 -10241 -15522 -10729 -2715 -2907 1429 -500 -1784 3246 10249 26203 26082 15592 19786 1420
$$ packed form
2594A039l607j417j2177j3388k648J8479J9633j0963p128Q658l09n727n951p132
2580b2638j415J8876L27r598J7418Q616o194o245j133o512j180k954J3637j318
2566c13N201K566l442M167l274j2801j2623j837J3889J6987l556m820q462O000
2552b318l078j915P351j279q301l322K0363P157J960k848n818n895p770J2569
2538F856p160j4356j614N52r160k104j19j21N841k296O730j143n723j2344Q044
2523b8117J4607M394O762J6278K181Q26J0189l549q315j4190j7120k832K873M162
2509a1851J2964K401J31K682K414j0266j2399p95J770J1151P249Q667o562j7797
2495a0241n281M793Q014j92M336j929j284N030P003J5954j21j0490M194j8366
$$ plain form
2481 1420 -2130 -1192 -20628 -26024 -7488 6526 19661 28217 19208 19224 20554 15201 11264 3306 233
2466 233 -5290 -25058 -34601 -37912 -31716 -22352 -11007 11874 20472 18183 -1427 5140 11589 11095
2452 11095 -10282 -8257 2212 10881 22650 24862 22043 30477 24722 5430 -8132 -8931 -18430 -15310
$$ packed form
2481A420l550R38j9436n396J8536J4014J3135Q556r009J6J330n353l937p958l073
2466B33n523j9768r543l311O196R364J1345K2881Q598k289j9610O567O449m94
2452A1095k1377K025J0469Q669J1769K212k819Q434n755j9292j3562p99r499L120
$$ [...]
##END NTUPLES=NMR SPECTRUM
##END=
