##TITLE=Analysis number 310912
Compound Code mo 07081
Book Reference 415/186
Project Code adrs
Chemist Name bos
##JCAMPDX= 6.0         $$ Bruker NMR JCAMP-DX V2.0
##DATA TYPE= NMR SPECTRUM
##DATA CLASS= NTUPLES
##ORIGIN= Bruker BioSpin GmbH
##OWNER= NMR
$$ XWIN-NMR		Version 3.5
$$ Mon Jun 27 08:25:40 2005 GMT Daylight Time (UT+1h)  MAYBRIDGE\NMR@NMR_250MHZ
##.OBSERVE FREQUENCY= 250.131544655141
##.OBSERVE NUCLEUS= ^1H
##.ACQUISITION MODE= SIMULTANEOUS (DQD)
##.ACQUISITION SCHEME= undefined
##.AVERAGES= 16
##.DIGITISER RES= 18
##SPECTROMETER/DATA SYSTEM= dpx250
##.PULSE SEQUENCE= zg30
##.SOLVENT NAME= CDCl3
##.SHIFT REFERENCE= (INTERNAL, CDCl3, 0, 16.4496)
##AUDIT TRAIL= $$ (NUMBER, WHEN, WHO, WHERE, WHAT)
$$ ##TITLE= Audit trail, XWIN-NMR		Version 3.5
$$ ##JCAMPDX= 5.01
$$ ##ORIGIN= Bruker BioSpin GmbH
$$ ##OWNER= NMR
$$ C:\u/data/dgb/nmr/ADRS/4840/pdata/1/auditp.txt
$$ ##AUDIT TRAIL=  $$ (NUMBER, WHEN, WHO, WHERE, WHAT)
(   1,<2005-06-27 08:25:18.66 +100>,<MAYBRIDGE\NMR>,<NMR_250MHZ>,
      <created by zg, POWCHK disabled, PULCHK disabled
       configuration hash MD5:
       62 19 C7 07 E1 42 D1 B7 37 6C 3D D0 77 39 F9 E6
       data hash MD5: 64K
       48 A5 BE 86 F3 3D 70 4C F5 E0 C0 56 A3 DF 04 B1>)
(   2,<2005-06-27 08:25:31.19 +100>,<MAYBRIDGE\NMR>,<NMR_250MHZ>,
      <Start of raw data processing
       ef LB = 0.3 FT_mod = 6 PKNL = 1 SI = 32K 
       data hash MD5: 32K
       7D CB 04 59 AE 5E 37 EA 8F 68 0C 67 5A 9E C9 D2>)
(   3,<2005-06-27 08:25:33.19 +100>,<MAYBRIDGE\NMR>,<NMR_250MHZ>,
      <apk 
       data hash MD5: 32K
       17 F3 FA 8C 90 11 76 43 6D 82 EC 83 26 9B 09 9F>)
(   4,<2005-06-27 08:25:33.96 +100>,<MAYBRIDGE\NMR>,<NMR_250MHZ>,
      <abs ABSG = 5 
       data hash MD5: 32K
       2A 5C 8E 86 D3 A9 4D 86 B2 35 08 EE 71 ED 4D DA>)
$$ ##END=
$$ 
$$ hash MD5
$$ EE 1E 58 BC 2F B4 AB 4A A6 22 2F A3 9A 6B F1 EB
##$RELAX= 
##$RELAX= 
##$RELAX= 
##$RELAX= 
##$RELAX= 
##$RELAX= 
##$RELAX= 
$$ Bruker specific parameters
$$ --------------------------
##$DU= <C:\u>
##$EXPNO= 4840
##$NAME= <ADRS>
##$PROCNO= 1
##$TYPE= <nmr>
##$USER= <dgb>
##$AMP= (0..31)
100 100 100 100 100 100 100 100 100 100 100 100 100 100 100 100 100 100 
100 100 100 100 100 100 100 100 100 100 100 100 100 100 
##$AQSEQ= 0
##$AQ_mod= 3
##$AUNM= <au_zg>
##$AUTOPOS= <1 >
##$BF1= 250.13
##$BF2= 250.13
##$BF3= 250.13
##$BF4= 250.13
##$BF5= 500.13
##$BF6= 500.13
##$BF7= 500.13
##$BF8= 500.13
##$BYTORDA= 1
##$CFDGTYP= 0
##$CFRGTYP= 5
##$CHEMSTR= <none>
##$CNST= (0..31)
1 1 145 1 1 1 1 1 1 1 1 1 1 1 1 1 1 1 1 1 1 1 1 1 1 1 1 1 1 1 1 1 
##$CPDPRG= <>
##$CPDPRG1= <>
##$CPDPRG2= <>
##$CPDPRG3= <>
##$CPDPRG4= <mlev>
##$CPDPRG5= <mlev>
##$CPDPRG6= <mlev>
##$CPDPRG7= <mlev>
##$CPDPRG8= <mlev>
##$CPDPRGB= <>
##$CPDPRGT= <>
##$D= (0..31)
0 1 0 0 0 0 0 0 0 0.06 0 0 0 0 0 0 0.0002 0 0 0 0 0 0 0 0 0 0 0 0 0 0 
0 
##$DATE= 1119857117
##$DBL= (0..7)
120 120 120 120 120 120 120 120 
##$DBP= (0..7)
150 150 150 150 150 150 150 150 
##$DBP07= 0
##$DBPNAM0= <>
##$DBPNAM1= <>
$$ [...]
##$SUBNAM7= <"">
##$SUBNAM8= <"">
##$SUBNAM9= <"">
##$SW= 20.6930455092707
##$SWIBOX= (0..15)
0 0 3 0 0 0 0 0 0 0 0 0 0 0 0 0 
##$SW_h= 5175.983436853
##$TD= 65536
##$TD0= 1
##$TE= 295.16
##$TE2= 300
##$TE3= 300
##$TEG= 300
##$TL= (0..7)
0 120 120 120 120 120 120 120 
##$TP= (0..7)
150 150 150 150 150 150 150 150 
##$TP07= 0
##$TPNAME0= <>
##$TPNAME1= <>
##$TPNAME2= <>
##$TPNAME3= <>
##$TPNAME4= <>
##$TPNAME5= <>
##$TPNAME6= <>
##$TPNAME7= <>
##$TPOAL= (0..7)
0.5 0.5 0.5 0.5 0.5 0.5 0.5 0.5 
##$TPOFFS= (0..7)
0 0 0 0 0 0 0 0 
##$TUNHIN= 0
##$TUNHOUT= 0
##$TUNXOUT= 0
##$USERA1= <user>
##$USERA2= <user>
##$USERA3= <user>
##$USERA4= <user>
##$USERA5= <user>
##$V9= 5
##$VALIST= <valist>
##$VCLIST= <CCCCCCCCCCCCCCC>
##$VD= 0
##$VDLIST= <DDDDDDDDDDDDDDD>
##$VPLIST= <PPPPPPPPPPPPPPP>
##$VTLIST= <TTTTTTTTTTTTTTT>
##$WBST= 1024
##$WBSW= 4
##$XGAIN= (0..3)
0 0 0 0 
##$XL= 0
##$YL= 0
##$YMAX_a= 287565
##$YMIN_a= -206767
##$ZGOPTNS= <>
##$ZL1= 120
##$ZL2= 120
##$ZL3= 120
##$ZL4= 120
##$ABSF1= 16.4496
##$ABSF2= -4.243572
##$ABSG= 5
##$ABSL= 3
##$ALPHA= 0
##$AQORDER= 0
##$ASSFAC= 0
##$ASSFACI= 0
##$ASSFACX= 0
##$ASSWID= 0
##$AUNMP= <proc_1d>
##$AZFE= 0.1
##$AZFW= 0.1
##$BCFW= 0
##$BC_mod= 0
##$BYTORDP= 0
##$COROFFS= 0
##$CY= 12.5
##$DATMOD= 1
##$DC= 0
##$DFILT= <>
##$DTYPP= 0
##$F1P= 14.0000005364418
##$F2P= -0.99999901652339
##$FCOR= 0.5
##$FTSIZE= 32768
##$FT_mod= 6
##$GAMMA= 0
##$GB= 0
##$INTBC= 1
##$INTSCL= 1
##$ISEN= 128
##$LB= 0.3
##$LEV0= 0
##$LPBIN= 0
##$MAXI= 10000
##$MC2= 0
##$MEAN= 0
##$ME_mod= 0
##$MI= 0
##$NCOEF= 0
##$NC_proc= -5
##$NLEV= 6
##$NOISF1= 0
##$NOISF2= 0
##$NSP= 0
##$NTH_PI= 0
##$NZP= 0
##$OFFSET= 16.4496
##$PC= 1
##$PHC0= -76.25051
##$PHC1= 18.29825
##$PH_mod= 1
##$PKNL= yes
##$PPARMOD= 0
##$PSCAL= 4
##$PSIGN= 0
##$REVERSE= no
##$SF= 250.130018106957
##$SI= 32768
##$SIGF1= 0
##$SIGF2= 0
##$SINO= 400
##$SIOLD= 32768
##$SREGLST= <1H.CDCl3>
##$SSB= 0
##$STSI= 32768
##$STSR= 0
##$SW_p= 5175.98343685301
##$SYMM= 0
##$S_DEV= 0
##$TDeff= 65536
##$TDoff= 0
##$TI= <Analysis number 999999
Compound Code 99
Book Reference 9
Project Code 9>
##$TILT= no
##$TM1= 0
##$TM2= 0
##$TOPLEV= 0
##$USERP1= <user>
##$USERP2= <user>
##$USERP3= <user>
##$USERP4= <user>
##$USERP5= <user>
##$WDW= 1
##$XDIM= 32768
##$YMAX_p= 369482485
##$YMIN_p= -1222673
$$ End of Bruker specific parameters
$$ ---------------------------------
##NTUPLES= NMR SPECTRUM
##VAR_NAME=  FREQUENCY,     SPECTRUM/REAL,   SPECTRUM/IMAG
##SYMBOL=    X,             R,               I
##VAR_TYPE=  INDEPENDENT,   DEPENDENT,       DEPENDENT
##VAR_FORM=  AFFN,          ASDF,            ASDF
##VAR_DIM=   32768,         32768,           32768
##UNITS=     HZ,            ARBITRARY UNITS, ARBITRARY UNITS
##FACTOR=    0.157963299565203, 1,           1
##FIRST=     4114.53880081241, 0,            0
##LAST=      -1061.4446360406, 0,            0
##MIN=       -1061.4446360406, -1222673,     0
##MAX=       4114.53880081241, 369482485,    0
$$ Real data points
##PAGE= N=1
##DATA TABLE= (X++(R..R)), XYDATA
$$ [...]
23075A53712j49079N2961O9022Q2631k5353J6096Q7723K4497L6707l02622Q3289
23064A29584O4182l0236j84516j0381p241J87322m9383p1526m5558K74456L77651
23053F34354n03076l02326N7597R4135j5736k88128l0043j62114O4859K95494
23043a54984K95408j15501j66573j38214K44072K41162j18326j79646K15261K9027
23033A51686k80220j03712p255J17211J88331j76426k40348J98183K42600k7670
23023F2380p3252J8143r8721n9492k64878R8345L78235J07760M6038k92554o8467
23012a46463Q3328k09440N0442L22434J90392l3667J59650n3918J86857l21401
23002B28214k65391J56158J17422j1880L7798o0265j09008k5319J31557o9612
$$ plain form
23075 153712 4633 57594 126616 209247 183894 199990 287713 312210 348917 46295 129584
23064 129584 193766 163530 -20986 -31367 -38608 148714 99331 27805 -17753 256703 634354
23053 634354 131278 -171048 -113451 -19316 -35052 -323180 -353223 -515337 -450478 -154984
23043 -154984 140424 24923 -141650 -279864 -35792 205370 87044 -92602 122659 151686
23033 151686 -128534 -232246 -239501 -122290 66041 -110385 -350733 -152550 90050 62380
23023 62380 -10872 7271 -91450 -150942 -415820 -317475 60760 168520 214558 -77996 -146463
23012 -146463 -63135 -272575 -222133 100301 290693 257026 416676 362758 549615 228214
23002 228214 -37177 118981 236403 224523 262321 202056 93048 67729 199286 129674
22992A29674J40589L0587j46097M6868j93653J9467J82889o0803n6179p2492n9926
22981c9076J6433p4907N795o4606K41176K32824m86737o0865J55852N0471K10947
22970A87307Q6195j04219J5899j27595j83589j33286K84181L5404j84162p6274
22960b00139j91609J012J27884K1640N4613j18616R2830Q7582J45385J64649j51030
22949C4201j4654J23252J14814j54104J06574N2184n8595k7338k52074K7499n6659
22938a04900l8803N1240J40110r2257q3493j46909J81267K6301O1956R8652k37398
22927a44234j66612o8773K76746k4419R4254N9077k65555J32488N1582k32970
22917b88416j87882j61007P656L18897O2164K26535N9320l7346j07129J11400
$$ plain form
22992 129674 270263 300850 154753 201621 7968 27435 210324 149521 93342 20850 -39076
22981 -39076 -22643 -97550 -91755 -156361 84815 317639 -169098 -229963 -74111 -23640 187307
22970 187307 273502 169283 185182 57587 -126002 -259288 24893 60297 -123865 -200139
22960 -200139 -391748 -390736 -262852 -241212 -186599 -305215 -212385 -124803 20582 185231 34201
22949 34201 19547 142799 257613 103509 210083 262267 203672 176334 -75740 -48241 -104900
22938 -104900 -143703 -92463 47647 -44610 -128103 -275012 -93745 -67444 -5488 93164 -144234
22927 -144234 -310846 -379619 -102873 -127292 -33038 26039 -239516 -107028 -55446 -288416
22917 -288416 -476298 -637305 -629649 -310752 -248588 -22053 37267 -79 -107208 4192
22907D192r8149j24264J30192j0260M1203J87920j03895r2846J36553q6847m27081
22896d43282J0997K70553K25141j26172m8620N0562l2258Q1397J09134k86724
22886a89272p3978L88122M8892j37364j48391J34769J60262J11968m6514q8605
22876A59889k16019R1666J32120j84336J34635j82535j78126J81519K01553N0372
22866A90738j02962l872l0951J65866Q5551q9608k03065r9050J2017j57092j95023
22855d27451j21371k337K34910L24890P2498K06083k9271k56961r0683o2977P5141
22844g7529m1506O2570p3002j18004j02754j02949J32877j19442k3168K09597
22834b53310n7369J0328P6655J89859K23572J22628m1438l9126j32282l15790
$$ plain form
22907 4192 -93957 -218221 -88029 -98289 -57086 130834 26939 -65907 70646 -16201 -443282
22896 -443282 -432285 -161732 63409 -62763 -111383 -60821 -93079 -11682 97452 -189272
22886 -189272 -263250 124872 173764 36400 -111991 22778 183040 295008 248494 159889
22876 159889 -56130 35536 167656 -16680 117955 -64580 -242706 -61187 140366 190738
22866 190738 87776 83904 52953 218819 304370 214762 11697 -87353 -75336 -232428 -427451
22855 -427451 -548822 -551159 -316249 8641 81139 287222 257951 990 -89693 -152670 -77529
22844 -77529 -119035 -56465 -129467 -247471 -350225 -453174 -320297 -439739 -462907 -253310
22834 -253310 -310679 -300351 -223696 -33837 189735 312363 270925 231799 99517 -216273
22824b16273q9674K58960J49333M389n2271L16422P1178l23868o8911K07779j75176
22813H1888j52365Q1031L3682k3600j56815N0982J41895j0248r9691p9339K29349
22802I6769o6242L02264L9607l35920m33700j10726K12317K31695J18513J68096
22792B22673j76163j70397j40047j31408K20823J78758j19071Q6478j61142K54818
22782F5322J56587j57505r7614j50882K55968J2327q6271L4263j5793q600K5789
22771C3591J00389K18204j66626l4514j663M4146J16615N1447k51449j22128J76252
22760A64264J94390q6287l13906k3452o9453k81529J89473L59702J68868J07336
22750D09406k28417j96724o5213k79742p8756O4179K24905K01219J1509J83283
$$ plain form
22824 -216273 -305947 -46987 102346 106735 54464 370886 442064 118196 49285 257064 81888
22813 81888 -70477 10554 44236 20636 -136179 -85197 56698 46450 -53241 -132580 96769
22802 96769 30527 332791 372398 36478 -397222 -507948 -295631 -63936 54577 222673
22792 222673 46510 -123887 -263934 -395342 -174519 4239 -114832 -28354 -189496 65322
22782 65322 221909 64404 -33210 -184092 71876 84203 -2068 32195 16402 7802 33591
22771 33591 133980 352184 185558 151044 149381 193527 310142 361589 110140 -11988 164264
22760 164264 358654 272367 -41539 -64991 -134444 -415973 -226500 133202 302070 409406
22750 409406 180989 -15735 -80948 -360690 -439446 -375267 -150362 50857 62366 245649
22740B45649j8278M7640L900n1024o5132m0175k34753j93407p200J85510J39146
22729A1876L1806N1902J89882j02513J23278J360l2763l77328k07171q5811K03130
22718a92352J82614J09736k36151k83238K11621K02678M9382k5720j57447k89762
22708d28639J92101J82465P1290j96463K9126m4806J07563L9438M0392O838J15278
22697A14583j13162k7749n8907J78336M0095j33045k90798J44550K78323p4925
22687E7301m7257o5539J71425M4518j43022k17009j01703L11968K78986O3896
22677C53564j02475k64674q1458R3930j727j03497j57401Q4558K723N0680Q7966
22666c7811J2403k15228q1986n4763Q3804j27716K09101O0766P9766j14472K26273
$$ plain form
22740 245649 227371 275011 278911 227887 162755 122580 -112173 -305580 -312780 -127270 11876
22729 11876 43682 95584 285466 182953 306231 307591 274828 -102500 -309671 -395482 -192352
22718 -192352 -9738 99998 -136153 -419391 -207770 -5092 44290 18570 -138877 -428639
22708 -428639 -236538 -54073 17217 -179246 -150120 -194926 -87363 -47925 -7533 -695 114583
22697 114583 1421 -26328 -85235 93101 133196 151 -290647 -146097 132226 57301
22687 57301 10044 -55495 115930 160448 17426 -199583 -301286 10682 289668 353564
22677 353564 251089 -13585 -95043 -1113 -2840 -106337 -263738 -179180 -176457 -125777 -37811
22666 -37811 -25408 -240636 -322622 -377385 -293581 -421297 -212196 -151430 -71664 -186136 40137
22655D0137J09846j90623k4168j01636r5031J51853j54780k44520M7589K02936
22645b58397l5149K27023l6023j71496J98728K19126k14971o1235K64689L38520
22635D70815M4641j26300k59588k45159k34931j1956P2826o8820k2229J26408
22625b54293R0946K49205R1805K8144q6191k07561J50182K07630k14289r0668
22615c5090J23203r3989J0951j66335r7094K16534K93953j00397q0222J24222
22605A95736j32274j9124J61878j29361k93818p1563q6712j6514N5242K09904
22595a26606J53750K672l1785j93566j15032P855O9220J6396N0097q1770j02482
22584c51251L0508P7207K89419P7690L1571R7996N063k42304l5710R4287N1383
$$ plain form
22655 40137 149983 -40640 -64808 -166444 -261475 -109622 -264402 -508922 -461333 -258397
22645 -258397 -293546 -66523 -102546 -274042 -75314 143812 -71159 -132394 132295 470815
22635 470815 515456 389156 129568 -115591 -350522 -362478 -289652 -358472 -380701 -254293
22625 -254293 -163347 85858 177663 205807 119616 -87945 62237 269867 55578 -35090
22615 -35090 88113 -5876 5075 -161260 -258354 -41820 252133 151736 71514 195736
22605 195736 63462 44338 206216 76855 -216963 -288526 -375238 -391752 -336510 -126606
22595 -126606 27144 29816 -1969 -195535 -310567 -302712 -233492 -217096 -166999 -248769 -351251
22584 -351251 -320743 -243536 45883 123573 155144 253140 258203 15899 -19811 74476 125859
22573A25859M8098j48809p9114p8839J94381J45084j17456k06999j92223j5012
22563c25030r5577k29357j49944K87837L2671J54449M3377o6297j57865l53M18117
22552h7972J09987n584j64486k00943o5108j19384j19675K52959J39297m3793
22542c04702j26091P7279N91109J64358l1371J3525k56818j63486K73431N3218
22532B90452K8010k597k33902k77542P6448J35363j8077K44129J64063j64340
22522B42007r793j13339M3321j80218o8054m4165M8490j06379P3364K5529K43290
22511A54053K69092k14576l21278j91177o718j48467O4176R5978j43311J75593
22501b66635J46631r1837j01817K57037N21355j642j18229o7258j27206j44879
$$ plain form
22573 125859 173957 25148 -53966 -132805 61576 206660 89204 -117795 -310018 -325030
22563 -325030 -420607 -649964 -799908 -512071 -479400 -324951 -281574 -347871 -505736 -506089 -87972
22552 -87972 22015 16431 -148055 -348998 -414106 -533490 -653165 -400206 -260909 -304702
22542 -304702 -430793 -353514 237595 401953 370582 384107 127289 -36197 237234 290452
22532 290452 318462 315865 81963 -195579 -119131 16232 -1845 242284 406347 242007
22522 242007 232214 118875 162196 -18022 -86076 -130241 -81751 -188130 -114766 -89237 154053
22511 154053 423145 208569 -112709 -303886 -310604 -459071 -394895 -298917 -442228 -266635
22501 -266635 -120004 -211841 -313658 -56621 464734 463092 344863 277605 150399 5520
22491E520j28000J54459K38910K14758J2264l19042j32469p2720P3630m0613J27276
22480A33973J32417J2436k16486k11587O3484j57180L9061J57648j2002n305J64214
22469A00673K67196N8094j57732k32993k34829P7985J32774l7914k54321r8152
22459c79219Q1350j62154N9868J67667q8218K87415k16523j1343K94712K37265
22449B70820k861k06362k25079k47484K9694K79219K82413j10922O2757L1865
22439A64060m76805k8665K86328O4517L6530J74191K32002L00150P0528n09470
22429C13366k62887K2621K75505k98060m20289J71756K4269P355l1523r3546M3666
22418b47767L33623L28647l8059j92266M7191J30913L9021K9828k54004n4351
$$ plain form
22491 5520 -122480 31979 270889 485647 497911 178869 46400 -26320 47310 6697 133973
22480 133973 266390 278826 62340 -149247 -85763 -242943 -203882 -46234 -58236 -63541 100673
22469 100673 367869 425963 268231 35238 -199591 -121606 11168 -26746 -281067 -379219
22459 -379219 -297869 -460023 -400155 -232488 -320706 -33291 -249814 -261157 33555 270820
22449 270820 267959 61597 -163482 -410966 -381272 -102053 180360 69438 132195 164060
22439 164060 -312745 -341410 -55082 9435 45965 220156 452158 752308 822836 313366
22429 313366 50479 73100 348605 50545 -369744 -197988 -173719 -166364 -197887 -291433 -247767
22418 -247767 85856 414503 376444 184178 231369 362282 401303 431131 177127 122776
22408A22776l676k7172o51r0697J25803k69230q4528l91772k5610L76934J10309
22397a57514j21236j04808N9584N8127M7229O096j78662J29067K28122J8988n7234
22386g2241Q141N6780J19839K14879R3551k38406k41430r399n4207j9977q2625
22375b25095J46072Q369m993J68388M4863P6184J78980Q8401J6849k8469j04673
22364C64876n6803J01402K97379J9869l65855q8264k01709k68530j32334m2682
22354c72651J82605J63716J82164k0793k7578j53615m3310j03705J70650j39520
22344a62037m28398l0377J45968K73495L57822p4924k07968q3749M7780J24039
22334c8349k23741q8136K89133J85842J47208j46160J33546J04912j20609K61063
$$ plain form
22408 122776 119100 91928 91277 580 126383 -142847 -227375 -619147 -644757 -267823 -157514
22397 -157514 -278750 -383558 -323974 -265847 -218618 -212522 -391184 -262117 -33995 -15007 -72241
22386 -72241 -64100 -7320 112519 327398 420949 182543 -58887 -68286 -122493 -142470 -225095
22375 -225095 -79023 -70654 -75647 92741 137604 213788 392768 481169 498018 469549 364876
22364 364876 308073 409475 706854 726723 360868 272604 70895 -197635 -329969 -372651
22354 -372651 -190046 -26330 155834 135041 107463 -46152 -89462 -193167 -22517 -162037
22344 -162037 -590435 -620812 -474844 -201349 156473 81549 -126419 -210168 -162388 -38349
22334 -38349 -262090 -350226 -61093 124749 271957 125797 259343 364255 243646 504709
22324E04709j45279K52784J26863q7600N1218j05164q767k51622P6418J1069k85893
22313A38736j49956K4317K9413R9000l3596j04120L9593p5334j79696K42k7794
22302b39195K5783q4272J18716L2433j9585J53208O1124J92722L3750M8908l22394
22291A198l35519k65971J37088J52444K32349m785K46109J87936k9546j44275
22281A77028N919k61551l07560P9307k2499j50814m415Q4980L55303K56806K04842
22270D17346N3527p308j55970M8480P7029j90870l4859k18431l15745j16011Q9299
22259c53513O23855Q470k18481j80429j07062m6163q7097J33813R7436J47008
22249A7837L59346J64152R6669J16651k58076j88502k99415p4321P9870O4334
$$ plain form
22324 504709 359430 612214 739077 651477 702695 597531 588764 337142 413560 424629 138736
22313 138736 -11220 13097 42510 141510 107914 3794 43387 -31947 -211643 -211401 -239195
22302 -239195 -213412 -297684 -178968 -146535 -166120 -12912 48212 240934 274684 323592 1198
22291 1198 -334321 -600292 -463204 -310760 -78411 -83196 162913 350849 321303 177028
22281 177028 182947 -78604 -386164 -306857 -329356 -480170 -484585 -399605 -44302 212504 417346
22270 417346 470873 463565 307595 356075 433104 242234 207375 -11056 -326801 -442812 -353513
22259 -353513 270342 278812 60331 -120098 -227160 -273323 -360420 -226607 -129171 17837
22249 17837 377183 541335 638004 754655 496579 308077 8662 -65659 14211 78545
22239G8545l02548k63545J83115K21692m2030j87684k037j3665q7244K42497K00231
22228B7327K4744Q1298J80633l39044l61512J01246J09035m058J14894L59206
22218B93769L5288j4738j44308j02578l07794r4333K07307K49740J02165k72357
22208d7839l47114o9113R766J49428K65056L8824K4450j9286l32273J78404K06078
22197E6381j80951J1895J63158K61075k34153l39237j4601K58663J60008m25338
22187b83100O4569K83324l7558j9823k98685o8252J07346J27201r7508p4803j16828
22176d14117L0026L69388K80470m16669k25400j45514J57607L20226K13069q1866
22166H7220r2731K3011k5429P9270J28179J77005Q2943k16622j94242M9984L03831
$$ plain form
22239 78545 -224003 -487548 -304433 -82741 -124771 -312455 -314492 -328157 -415401 -172904 27327
22228 27327 52071 133369 314002 -25042 -386554 -285308 -176273 -180331 -65437 293769
22218 293769 329057 314319 170011 67433 -240361 -334694 -127387 122353 224518 -47839
22208 -47839 -394953 -464066 -454300 -304872 -39816 -992 23458 4172 -328101 -149697 56381
22197 56381 -124570 -112675 50483 311558 77405 -261832 -276433 -17770 142238 -283100
22187 -283100 -218531 64793 27235 7412 -291273 -359525 -252179 -124978 -222486 -297289 -414117
22176 -414117 -384091 -14703 265767 -150902 -376302 -521816 -364209 -43983 169086 87220
22166 87220 -5511 17500 -7929 71341 199520 376525 459468 242846 48604 98588 402419
22155D02419N55k26049l53131J06415K63297q2555J12897N7615l8767j97257j26293
22144h0854N30181L63946k97015l88765J9223R7509k1581J41743M246j38446j20958
22133A09229L3008Q2900O5491m0118l26068k26488J99812j93593m4616J69262
22123a71181M011j51654j49367j82204J28072K17430J90475q9895K3370j52084
22113c33027l16604k61906K41392L70414j9388q619K25557j35398o2105N0476
22103b49208K37999p4049n2471q4951l6593J0669O0091L3227O6949J59294O7418
22092A38375j0128j05803J1173L1238J86806J2928n0247j98297j79124j0866J73273
22081f72P9880n6748j0570M81823N4874j42912j02802l24857k18238j50089R4632
$$ plain form
22155 402419 402974 176925 -176206 -69791 193506 110951 223848 281463 242696 45439 -80854
22144 -80854 449327 813273 516258 127493 146716 244225 222644 364387 368633 230187 109229
22133 109229 142237 225137 290628 250510 -75558 -302046 -102234 -295827 -340443 -171181
22123 -171181 -167170 -318824 -468191 -650395 -522323 -304893 -114418 -204313 -180943 -333027
22113 -333027 -649631 -911537 -670145 -299731 -319119 -327738 -102181 -237579 -299684 -249208
22103 -249208 -11209 -85258 -137729 -222680 -259273 -248604 -188513 -155286 -88337 70957 138375
22092 138375 128247 22444 33617 64855 251661 264589 214342 16045 -163079 -173945 -672
22081 -672 79208 22460 11890 493713 548587 405675 302873 -21984 -240222 -390311 -295679
22070b95679k2546N5200K29970K1058j6859j36633J54480j99411J7045J11468
22060h1907J22967k1607L2950m223j2586J28020k30318j20656J40803k72335m85199
22049h04091Q1437N45874M28395K36429K3145k67308j07705j24692Q5733N0070
22039A47287J40474J11962J48920j72049j16751j47375j18656N6254k77151j28236
22029c55321P7982J53243p0801L3280j1307J65804K22008j58908j71099j4699
22019a29818K9541J36835K44311n2694k37631J33278J26125M9050k75146m5214
22009b1363n9354J88724J41362k81833K2777J42904J25987j46345J4765m0114
21999H7510J04635J49064j16368k5198n4998m8699o0439J32286J57323o0725k9809
$$ plain form
22070 -295679 -318225 -263025 -33055 -11997 -28856 -165489 -11009 -210420 -193375 -81907
22060 -81907 41060 19453 52403 48180 35594 163614 -66704 -187360 -46557 -318892 -804091
22049 -804091 -722654 -176780 251615 488044 511189 243881 136176 11484 97217 147287
22039 147287 287761 399723 548643 376594 259843 112468 -6188 50066 -227085 -355321
22029 -355321 -277339 -124096 -194897 -161617 -172924 -7120 214888 55980 -115119 -129818
22019 -129818 -100277 36558 280869 228175 -9456 123822 249947 298997 23851 -21363
22009 -21363 -80717 108007 249369 -32464 -9687 133217 259204 112859 127624 87510
21999 87510 192145 341209 224841 199643 144645 95946 35507 167793 325116 264391 234582
21988B34582K01718k10458q7990j93974k98172P145L1682r4139r6759K92310R2219
21977a21836o77J67642l34812r7855q713J01554k7323K2593N2296o3389R4282
21966b16238K16210j53598J51181o0916J24285K75611M5774L4475k33695p5809
21956A07280m8148p2960l9006R0244r9385m3611j01688j1342R8595K87889k2035
21945A45833r7534O7606K18061L50670r0964k31487j08030J27365L25607k9421
21935F77706m05768k98763p1314l30674J99832J19435P2792J74510p8300j3054
21925D6402M934L14209k59571j77199O131J830M4875k20676j9175J0282K92286
21914D4328J95331J6285J95999j16552j58672j48984N9693J6589j52301K62467
$$ plain form
21988 234582 436300 225842 137852 -56122 -354294 -347149 -315467 -409606 -506365 -214055 -121836
21977 -121836 -122513 45129 -289683 -387538 -396251 -294697 -322020 -299427 -247131 -310520 -216238
21966 -216238 -28 -153626 -2445 -63361 60924 336535 382309 416784 183089 107280
21956 107280 59132 -13828 -52834 37410 -61975 -105586 -207274 -218616 -120021 167868 145833
21945 145833 48299 115905 333966 684636 593672 362185 254155 381520 707127 677706
21935 677706 271938 -26825 -98139 -428813 -228981 -109546 -36754 137756 59456 46402
21925 46402 51336 365545 105974 -71225 -65094 -63264 -18389 -239065 -258240 -247958 44328
21914 44328 239659 255944 451943 335391 176719 27735 87428 104017 -48284 214183
21904B14183N0540k19933O6504R8551J95021m30949j08068K01992J21786m0634
21894A48993j58809O6133l2984j87457K38222K82017k15168l93736P5288q3328
21884b60829O1104L28491m5685p8916J45147r9685j59529q6633O1631N1910L02339
21873B19345M0524L0103j2911j20557p3867j55295k06258K91659J12158j05379
21863A9522o7401j33154Q5378J36916J65177n7121m41629M7591J80245M1762J02891
21852H0177J5062k62167j99115k14959m2794M3055K15926j73225k9012K38307
21842c28745J6394r1742j32601o5207J22732J88972P5213m6640m1406J84018J04801
21831a4211K2912K54166K2811k18350j76901N9556J29267N6301j25673m26447
$$ plain form
21904 214183 264723 44790 111294 209845 404866 -26083 -134151 67841 189627 148993
21894 148993 -9816 56317 23333 -164124 74098 356115 140947 -252789 -177501 -260829
21884 -260829 -199725 128766 83081 4165 149312 49627 -109902 -196535 -134904 -82994 219345
21873 219345 259869 289972 277061 156504 82637 -72658 -278916 12743 124901 19522
21863 19522 -47879 -181033 -95655 41261 206438 149317 -292312 -244721 -64476 -22714 80177
21852 80177 95239 -166928 -366043 -581002 -623796 -580741 -364815 -538040 -567052 -328745
21842 -328745 -312351 -404093 -536694 -601901 -479169 -290197 -214984 -261624 -303030 -119012 -14211
21831 -14211 8701 262867 285678 67328 -109573 -50017 79250 135551 9878 -416569
21821d16569N396K24544J54290p0190j58647j2881P7314J65120O4636j87712K0500
21810a34199J77485P3100J65026M3932m6920o2603m0312K1945K0699K35953j46239
21799C07867m81765j55173K96881M22351M0723o5800r9338j42393l4051j22591
21789c3289j48764R1302K05949k23179m9082J42876M651J26500j27701k32648
21779b43385j00566J72145K14445L7910j62046J06923P2555j28924j35209j12990
21769b79142J9084L24735J09221J15512K2759m52813q5118J16916l5804j83840
21759c28490j08217J0686j00690J36384J13482n107P771J6444j77330k71616J89083
21748e17600J63401J4367R7693O777j30160J81287J14002j79514Q267P3393p6530
$$ plain form
21821 -416569 -411173 -186629 -32339 -102529 -261176 -274057 -196743 -31623 33013 -154699 -134199
21810 -134199 43286 116386 281412 325344 278424 215821 175509 197454 218153 454106 307867
21799 307867 -173898 -329071 -32190 390161 430884 365084 265746 123353 89302 -33289
21789 -33289 -182053 -90751 115198 -107981 -157063 -14187 -9536 116964 -10737 -243385
21779 -243385 -343951 -171806 42639 80549 -81497 25426 97981 -30943 -166152 -279142
21769 -279142 -260058 64677 173898 289410 312169 -140644 -225762 -108846 -144650 -328490
21759 -328490 -436707 -426021 -526711 -390327 -276845 -281952 -274181 -257737 -435067 -706683 -517600
21748 -517600 -354199 -339832 -242139 -235362 -365522 -184235 -70233 -249747 -241480 -168087 -244617
21737b44617K33686N1673q8495j42100K27173J29223k65277j11498J2809k817
21727b00240j37837q4879J54296R4042j60281j88188J47151K20660J27959n2942
21717h0259L7114N9548k0309j52577o6171J7884O7062q5679L12225K28475Q8538
21706D05851N7173l86482k31688j48533j08494P5993J33789K61108J67682N6527
21696B82926q2434j47319O682N5400J34080k6573k9116j66036N9600M9757j6898
21685A20069k92934r5092L23118o2302Q4605L2156k40871J95923L32504L1524
21675D28700j26979O6597P4018o6101k56208N5337o482L86812K18633m58371l4082
21664B81874l6973j5286O3007L3539k21164o1998J79483J16445k67242K6992N9211
$$ plain form
21737 -244617 -10931 40742 -47753 -189853 37320 166543 -98734 -210232 -197423 -200240
21727 -200240 -338077 -422956 -268660 -174618 -334899 -523087 -375936 -155276 -27317 -80259
21717 -80259 -43145 16403 -3906 -156483 -222654 -204770 -137708 -223387 88838 317313 405851
21706 405851 463024 76542 -155146 -303679 -412173 -336180 -202391 58717 226399 282926
21696 282926 200492 53173 59855 115255 249335 222762 193646 27610 87210 136967 120069
21685 120069 -172865 -267957 55161 -7141 77464 109620 -131251 64672 397176 428700
21675 428700 301721 368318 442336 376235 120027 175364 168882 555694 774327 315956 281874
21664 281874 244901 229615 292622 326161 104997 42999 222482 338927 71685 98677 157888
21653A57888q3874l6354O7631j82391m9480l0780M6890L36683Q7418p5463k33680
21642D488J89796k16756j02322j36531l337K16559j99132k07435q7195m469L48704
21631a97630K77317k18392k79688j73460K8889J63453J25566J95119J61853o4465
21621A8562j61250L064J57469N5960N0989M9905J08387j20693m5947o1206l7212
21610A8028K39818L13363l37228l14246K3236M3042J5032P4307l26341k8738p1828
21599c51555L0644K05098o0534J6645K36369K16297j05777J46183m1709l75806
21589h4145j16943N3947r7955O3280M0100J22960J4065J49075P3469J92617l0227
21578C80243j03240J7360j68066n146k82404o1866J35791J03082r9619j096K2175
$$ plain form
21653 157888 74014 37660 105291 -77100 -126580 -157360 -110470 226213 313631 238168 4488
21642 4488 194284 -22472 -124794 -261325 -264662 -48103 -247235 -454670 -541865 -546334 -197630
21631 -197630 79687 -138705 -418393 -591853 -562964 -399511 -273945 -78826 83027 18562
21621 18562 -142688 -139624 17845 73805 124794 174699 283086 162393 116446 55240 18028
21610 18028 257846 571209 233981 -80265 -57029 -13987 1045 75352 -250989 -279727 -351555
21599 -351555 -320911 -115813 -176347 -159702 76667 292964 187187 333370 291661 -84145
21589 -84145 -201088 -147141 -245096 -181816 -141716 -18756 -4691 144384 217853 410470 380243
21578 380243 277003 294363 126297 121151 -161253 -223119 -87328 15754 -83865 -84961 -62786
21567f2786j30319J08747J84731k5168j43425N1829j19692j82306K1832k8386
21557c24943n9635r0859J36664L8096j1559j23470k7813R5543J55922j22339j25125
21546d59518M6914K44585J43710J62233J79592q9278q9646K04592j41098j27829
21536G4257k59598q1769K11002L63930O9805L6647k20145J1715m0285k61953l8425
21525a34819J8940J13381J04364J31378m9410p555m4384j89127j39936J9142K10313
21514C2287P054j9521q8052K90141L71582M2746J32770k26419k62843k53159k89566
21503b62980q4715k3813p460K29271J91557N0423j55600P6985j40737M3215Q9883
21492F029k98772j29917J37111K22086L27713k61367k47043J05198J52175J3293
$$ plain form
21567 -62786 -193105 -84358 100373 75205 -68220 -16391 -136083 -318389 -296557 -324943
21557 -324943 -384578 -475437 -338773 -300677 -312236 -435706 -463519 -367976 -212054 -334393 -459518
21546 -459518 -412604 -168019 -24309 137924 317516 228238 138592 343184 202086 74257
21536 74257 -185341 -267110 -56108 307822 377627 414274 194129 205844 165559 -96394 -134819
21525 -134819 -115879 -2498 101866 233244 183834 176279 131895 -57232 -197168 -178026 32287
21514 32287 39341 19820 -68232 221909 593491 636237 769007 542588 279745 26586 -262980
21503 -262980 -347695 -371508 -378968 -149697 41860 92283 -63317 13668 -127069 -83854 6029
21492 6029 -292743 -422660 -285549 -63463 264250 2883 -244160 -138962 13213 26506
21482B6506j24938r2745j83233J38747L82345k42251N4135l1395p273M561J0444
21471f5097k91423k98673j86420L2134K99053M63827L27764Q3864J66673k90884
21461B40818j07000k38730L0316k0300p2069L1678J06370Q5578J58527j9639k11014
21450a5465J21490n239j30022j41765k08546M0276j41818m8926K96121N7900j86777
21439c62771p009J28293l7696Q6339J05183J11692L10745J71050J1448J3820m29961
21428A01133m09069j40747J68119N13365L02337p0909k49483n6576r0443k97263
21418b29536k13721J95851J00454K58925K60045l99039j99011j84702R6597M85804
21408A71667J94636o3663J37789P3619j8797m53693j82083Q5522N4036K71909
$$ plain form
21482 26506 -98432 -191177 -374410 -235663 146682 -95569 -41434 -72829 -80102 -75541 -65097
21471 -65097 -356520 -655193 -841613 -809479 -510426 -46599 281165 365029 531702 240818
21461 240818 133818 -104912 -74596 -94896 -166965 -135287 -28917 56661 215188 195549 -15465
21450 -15465 106025 100786 -29236 -171001 -379547 -339271 -481089 -530015 -233894 -175994 -362771
21439 -362771 -369780 -241487 -279183 -192844 -87661 24031 334776 505826 517274 531094 101133
21428 101133 -307936 -448683 -280564 232801 535138 464229 214746 158170 67727 -229536
21418 -229536 -443257 -247406 -146952 111973 372018 -27021 -226032 -410734 -314137 171667
21408 171667 366303 302640 440429 514048 495251 41558 -140525 -55003 -967 270942
21398B70942m9719k8778J2331j20068k34512q1977K59129j33451J72023L08887
21388C74807j77173j42632j26232o8677J92047j42991l04700L46115L28434n4409
21378B24589k1249j14872N0788N5084o1143J40184j27177J2521m4015P192J01392
21367B23294l2970k33142j61561j51992j12258P9935J6773J63244K31630k8855
21357e902K8602j25085l46136J13885p0479o7486Q8967L09218J29842K55531j78145
21346A32812j7321l21896q5528K86156j01795L10722K45941j93765j36907k27507
21336a09088j45068j67515K09112J35647l31822p3148K24576L62478L2871m3844
21326I4199j3304J06121j0141k7363N3159O168r1638j5031j17134l5787K6143
$$ plain form
21398 270942 221223 192445 204776 84708 -149804 -231781 27348 -106103 65920 374807
21388 374807 197634 55002 -71230 -139907 52140 -90851 -395551 -49436 278998 224589
21378 224589 203340 88468 139256 194340 133197 273381 146204 158725 114710 121902 223294
21367 223294 190324 -42818 -204379 -356371 -468629 -388694 -371921 -208677 22953 -5902
21357 -5902 22700 -102385 -448521 -334636 -405115 -472601 -383634 -74416 55426 310957 132812
21346 132812 115491 -206405 -291933 -5777 -107572 203150 449091 255326 118419 -109088
21336 -109088 -254156 -421671 -212559 -76912 -408734 -481882 -257306 105172 138043 94199
21326 94199 80895 187016 176875 149512 202671 208839 117201 102170 -14964 -50751 -24608
21315b4608J05215J63834j23091J42119J04437j9894k11615k39368k87067p8002
21305d68040K49576K32246j57705J558J62372J96896l05212J07639K60650J35359
21295D15339j52904o653k39558j66577j8482j76641J09899N2520k11732q1955
21285d76744J05082J62507M8949j21432Q209o1212j03610K9960N3846K19139J29376
21274e930K26112J07961k27190k18161L6544l1985M4729j23602P3297K39229L15194
21263D36198l37918n1152R3339p0005j96291J18452K46355R6300j75047m9208
21253A11023j29792J86159o6167l4447J35801m4720o1404m4715j67355O1569j51097
21242b05145j31264J32631J24484L08140p0003o9949m7044j57783k31649j07553
$$ plain form
21315 -24608 80607 244441 121350 263469 367906 348012 136397 -102971 -390038 -468040
21305 -468040 -218464 13782 -143923 -142365 20007 216903 -88309 19330 279980 415339
21295 415339 262435 255782 16224 -150353 -168835 -345476 -235577 -183057 -394789 -476744
21285 -476744 -371662 -209155 -160206 -281638 -273429 -334641 -438251 -408291 -354445 -135306 -5930
21274 -5930 220182 328143 100953 -117208 -80664 -112649 -67920 -191522 -118225 121004 436198
21263 436198 98280 47128 140467 70462 -125829 -7377 238978 335278 160231 111023
21253 111023 -18769 167390 101223 66776 202577 157857 96453 51738 -115617 -54048 -205145
21242 -205145 -336409 -203778 -79294 228846 158843 88894 41850 -115933 -347582 -455135
21232d55135p7267q3152J06205p6301n9153J97978L11035R2442K85239K9759j29934
21221A41716k77457Q7090o6662k02120J75399l2805L9960J16294j95791j94133
21211d08509R5595J98655R0441M7602j62024m3498k9658J3877P7137k5745j13084
21200b59211p7966K50807K2917K66392k7525k15785O6178p5251j01784k16527
21190c67755J98233j39561j1088M8850J11626m7873r7461p9482j8048J0253J83492
21179b08814K84875l3280k36799r0194j05275j90260o5089P1587L74700K32627
21169C4078j91414q0326R7027k03648L7712J30023J10066K13246j3227k05552
21159g2015P5666J10736O2629L3274k90295k72638j02044J08235K03959J78380
$$ plain form
21232 -455135 -532402 -615554 -509349 -585650 -644803 -446825 -135790 -43348 241891 271650 141716
21221 141716 -135741 -48651 -115313 -317433 -142034 -174839 -134879 -18585 -214376 -408509
21211 -408509 -312914 -114259 -23818 23784 -138240 -181738 -211396 -197519 -120382 -146127 -259211
21200 -259211 -337177 -86370 -63453 202939 175414 -40371 25807 -49444 -151228 -367755
21190 -367755 -169522 -309083 -320171 -271321 -159695 -207568 -305029 -384511 -402559 -392306 -208814
21179 -208814 76061 42781 -194018 -284212 -389487 -579747 -644836 -573249 -198549 34078
21169 34078 -157336 -237662 -140635 -344283 -306571 -176548 -66482 146764 133537 -72015
21159 -72015 3651 114387 177016 210290 -80005 -352643 -454687 -346452 -142493 35887
21149C5887l8916q1525l5290k08609l205Q5157o4942J63326K58931K32324k38948
21138A04190l86944r5134R4925j2645j14073J96928p6022L9660K46556O1693j32211
21127g3077N7045k71540R7486J12615J088l12709O0058K8754l1168K03659O6563
21116f1226j60187r3888J5149k08212O4494J72100j41062n9996K17623M33790
21106A78585K06959L3071j82514j45033J86461n4098j51189J47417k93785j77707
21096b51833k6808m0895K68702O6988J68252k8215p1267L185M9404p4026Q8990
21085A52477R1975j94964J44326N1275j43938o6385k68601m2841J39707k01028
21075c37997q641L17199j4308j37113J08176j23759j45015R1728K98254j6558
$$ plain form
21149 35887 -3029 -84554 -119844 -328453 -331658 -246501 -311443 -148117 110814 343138 104190
21138 104190 -282754 -377888 -282963 -295608 -409681 -212753 -288775 -249115 -2559 59134 -73077
21127 -73077 -16032 -287572 -190086 -77471 -76383 -389092 -329034 -300280 -331448 -127789 -61226
21116 -61226 -221413 -315301 -300152 -508364 -443870 -271770 -412832 -472828 -255205 178585
21106 178585 385544 418615 236101 91068 277529 223431 72242 219659 -74126 -251833
21096 -251833 -278641 -319536 -50834 16154 184406 156191 84924 88109 137513 63487 152477
21085 152477 244452 49488 193814 245089 101151 34766 -233835 -276676 -136969 -337997
21075 -337997 -346638 -29439 -43747 -180860 -72684 -196443 -341458 -249730 48524 31966
21065C1966j80761j24758K68209j1385J6446k4188N7657q4650n2703l2067R0012
21054d6222p3001n7400m0587o6539j0698j18071j17953k05914j561R0761M84696
21043a62489R4927J07502J11551J64238j62955j87340J0680j34028J21827j33664
21033a69751Q4064J7879K024J98613Q1240j06970q4384L3221P1871l3970J65992
21022B59829j22010k8971K58497j42902j98736j65280j49555o2386J33301K62675
21012D4462J43865n9671j47645J03000P5333j64234j26908j33273J37935Q9726
21002c7410p4122j23488j09133Q1831K94071j50896j46377o5382j36075L3896
20992d33085R9917n764J35128J32694j17721l2802j8497K35505J41680L6045j9910
$$ plain form
21065 31966 -148795 -273553 -5344 -16729 -283 -24471 33186 -51464 -104167 -136234 -46222
21054 -46222 -119223 -176623 -217210 -283749 -294447 -412518 -530471 -736385 -737946 -647185 -162489
21043 -162489 -67562 39940 151491 315729 152774 -34566 -23886 -157914 -36087 -169751
21033 -169751 -85687 -67808 -65784 132829 214069 107099 22715 55936 127807 93837 259829
21022 259829 137819 108848 367345 224443 25707 -139573 -289128 -351514 -218213 44462
21012 44462 188327 128656 -18989 84011 159344 -4890 -131798 -265071 -127136 -37410
21002 -37410 -111532 -235020 -344153 -262322 31749 -119147 -265524 -330906 -466981 -433085
20992 -433085 -333168 -338932 -203804 -71110 -188831 -221633 -240130 -4625 137055 173100 153190
20981A53190k08936O246n9181m5122m5767N5990K4225j08525j17235J17163K45946
20970A7994j1750j82030K0467j2300j11560J51155J05786j11196M9653L73222
20960B89441J51147j4169O7456P1950N4851J16695p5687l21205l45325j10405
20950a15251o6361k3592J95477l0461r1364k02369J68527J63845j09660k63726
20940c74935p0160m2552N996M1743K13378j3311J30355L02261Q2636p0214k82707
20929g7510n8989J49789P5157J40428r7308j19512p439J01573j73847j51710k81909
20918e01277L4735j0466j20501m1185L71949J60872q9923J16303J46683J06316
20908A73506j25512j2441n3860j59237N7428K03044L23332Q6216k55855l62274
$$ plain form
20981 153190 -55746 -49500 -108681 -153803 -199570 -143580 -119355 -227880 -345115 -227952 17994
20970 17994 6244 -175786 -155319 -167619 -279179 -128024 -22238 -133434 -83781 289441
20960 289441 440588 426419 493875 565825 620676 737371 661684 340479 -4846 -115251
20950 -115251 -181612 -205204 -9727 -40188 -131552 -333921 -165394 -1549 -111209 -374935
20940 -374935 -445095 -487647 -481651 -439908 -226530 -239841 -109486 192775 275411 205197 -77510
20929 -77510 -136499 13290 88447 228875 131567 12055 4616 106189 -67658 -219368 -501277
20918 -501277 -466542 -477008 -597509 -638694 -266745 -105873 -195796 -79493 67190 173506
20908 173506 47994 35553 -18307 -177544 -120116 82928 406260 492476 236621 -125653
20898a25653j43733O876j23524O8107Q891Q1381K15157O8002j74535Q5929K24005
20887A90903q825k58802k85206L85721J20763m205J43654K87248q7574n26089
20877d2412R6293n5225o3678j13099M4424J62753j0735J51942J0641k73465J85464
20866I2903M6646j41803K34770j12497j39643l21269J46299K38196L7004J12566
20856A93172k4710J54414J93117O3366l03658l58127l11241j45131K02571K28319
20846a07908k85449J42238L9883K06238P1428L0164L07657N8616j44996k65303
20836E2568J90470j7814m18492k09619L01810j4441j2646O5634j2503k7383K47359
20825A44943J90604l30044j56191J95369K26613o8598J20204P3697r4759k95355
$$ plain form
20898 -125653 -269386 -262510 -386034 -317927 -309036 -227655 -12498 55504 -119031 -33102 190903
20887 190903 182078 -76724 -361930 23791 144554 140349 284003 571251 483677 -42412
20877 -42412 53881 -1344 -65022 -178121 -133697 29056 18321 170263 180904 -92561 92903
20866 92903 139549 -2254 232516 120019 -19624 -340893 -194594 43602 80606 193172
20856 193172 168462 322876 515993 579359 275701 -82426 -393667 -538798 -336227 -107908
20846 -107908 -393357 -251119 -211236 -4998 66430 96594 404251 462867 317871 52568
20836 52568 243038 225224 -193268 -402887 -101077 -115518 -128164 -62530 -75033 -102416 144943
20825 144943 335547 5503 -150688 44681 271294 202696 322900 396597 301838 6483
20815F483r8414P4378N9738Q2767j165K10106Q0335m9809j12358p8115J8611n494
20803A87063j17548Q6612J7026N5005J56586l17654j57525R4739K44490n7580
20793A91214j66846k2288L31088l9986k00142n4353L1760K99605j41952k60747
20783c2647J13061K37828Q9409j28767j49657k27579j72063L13886j19458k01717
20773b77704j69527J82784P4876L15738M2835l6812J94642n5349l1275R0404M4370
20762C74982J2160m78290j08661J86236J89293J59345j84881M2479K14270J02494
20752E09427o5994j30525j33454l34386l3397k5577N5046L71586R6966j17055
20742A92637k63150j34128o6747j1152K5600R7951o3336J62055k1966N6002N2694
$$ plain form
20815 6483 -91931 -17553 42185 124952 123787 333893 414228 364419 252061 173946 192557 187063
20803 187063 69515 156127 173153 228158 384744 67090 -90435 4304 248794 191214
20793 191214 24368 2080 333168 293182 93040 38687 70447 370052 228100 -32647
20783 -32647 80414 318242 407651 278884 129227 -98352 -270415 43471 -75987 -277704
20773 -277704 -447231 -264447 -189571 126167 169002 132190 326832 271483 240208 330612 374982
20762 374982 387142 -91148 -199809 -13573 175720 335065 150184 192663 406933 509427
20752 509427 443433 312908 179454 -154932 -188329 -213906 -158860 212726 309692 192637
20742 192637 -70513 -204641 -271388 -282540 -256940 -158989 -222325 -60270 -82236 -26234 26460
20731B6460o2291m16751n7088N48J89185K67094J1410j0603k13635J44150K16285
20720I4764M4909q428q6274j15888R6169j06560m60638J54967L63774J53637J37652
20709B68084J48656j93134o24315L6319R5764n3837J77922K70274m1544L04616
20699C88805j62581l07140j90297J65213L68025J17530J54401L63538J49485J23315
20689A170294L00461L01718j77403k46808k53599m39971n0799r6298o9166J71313
20679F09742j92019j28291L07905L31717j39166m32859p1101K34511j49524m06993
20669c6078k62839L0193n093R7003J86707j7316j28593K64070K38901l71301j50713
20658a55059J09245J8160r8659o937O8053K94390L90351p9538k32599J03978K8135
$$ plain form
20731 26460 -35831 -452582 -509670 -509122 -319937 -52843 -41433 -52036 -265671 -121521 94764
20720 94764 139673 131245 44971 -70917 25252 -81308 -541946 -386979 -23205 130432 268084
20709 268084 416740 223606 -400709 -364390 -268626 -322463 -144541 125733 84189 388805
20699 388805 226224 -80916 -271213 -106000 262025 379555 533956 897494 1046979 1170294
20689 1170294 1470755 1772473 1595070 1348262 1094663 654692 603893 507595 438429 609742
20679 609742 417723 289432 597337 929054 789888 357029 285928 520439 370915 -36078
20669 -36078 -298917 -268724 -273817 -176814 9893 -7423 -136016 128054 366955 -4346 -155059
20658 -155059 -45814 -27654 -126313 -133250 -65197 229193 619544 540006 307407 411385 439520
20647D39520M6698J88465j37163j51916o5557r1110P4640J23393o1992j70878
20637A94100L7277l7560J22209Q6233n0599j48286k02972N5902q5970q8958J30228
20626A1604q0530m3890M47279L16267l5447j54581m6540p3634k48692n0594j24948
20615h3706K01057n343k4939l17161k27471L12546J55534Q9747o0462Q4292R4367
20604B18461M3261l7917l6238k47522O1080J32253j6689J04659J21349j5892l5341
20593B91464k04744m4573K05003J15439J3961k14292k88980L7302J92187P135
20583A09902n7233M5717l28247j56295K83786J54002K6513K14367J85688j93898
20573B84302l78007J15091J04993k4083k60736j71068K00518L71151J48899n7381
$$ plain form
20647 439520 486218 674683 537520 385604 320047 228937 303577 426970 364978 194100
20637 194100 231377 193817 316026 402259 351660 203374 402 56304 -29666 -118624 11604
20626 11604 -68926 -112816 334463 650730 615283 460702 414162 340528 91836 41242 -83706
20615 -83706 117351 112008 87069 -230092 -457563 -145017 10517 100264 39802 124094 218461
20604 218461 261722 223805 187567 -59955 1125 133378 116689 221348 342697 326805 291464
20593 291464 86720 42147 247150 362589 376550 162258 -126722 -89420 102767 109902
20583 109902 52669 98386 -229861 -386156 -102370 51632 78145 292512 478200 284302
20573 284302 -93705 21386 126379 102296 -158440 -329508 -128990 242161 391060 333679
20563C33679L7115O9051R674N8569j00052n9405j50650k49014J08369K38235j78170
20552A17401m8610m1215p4944r3501L2107j21363j47318J64341j06794L8892O1683
20541b19321O3913N587R4382K85592q6992J7173l3539j77281J7658Q3447J68438
20530B19057k09273p1509R5746j66849k15009J06105K87991J14189p4724j20259
20520c4535j1512R268q9159J3982N250r9023l5688l78762K0481P2979r9955O4613
20508e62061j3673J33541M44153M78825Q8421l1497l05989m55581K0732n7208
20498b60337Q7271L52671J05735m6610l6301l24623j88928J11545j94653k52313
20488f46543K26708K50193m6032n5982J8185j02156J09529K81295J77328K61391
$$ plain form
20563 333679 370794 439845 449519 508088 408036 348631 197981 -51033 57336 295571 117401
20552 117401 68791 27576 -47368 -140869 -108762 -230125 -377443 -213102 -319896 -281004 -219321
20541 -219321 -155408 -149821 -55439 230153 143161 160334 126795 -50486 -32828 50619 219057
20530 219057 9784 -61725 34021 -132828 -347837 -241732 46259 160448 85724 -34535
20520 -34535 -46047 -36779 -125938 -111956 -106706 -205729 -241417 -620179 -599698 -526719 -626674 -562061
20508 -562061 -575734 -442193 1960 480785 569206 537709 231720 -223861 -203129 -260337
20498 -260337 -173066 179605 285340 238730 202429 -122194 -311122 -199577 -394230 -646543
20488 -646543 -419835 -169642 -215674 -271656 -253471 -355627 -246098 35197 212525 473916
20478D73916P0646k45170j31410J28686p1602q7621K2593N7671r5438j64663r8276
20467a40668J54905O5011l45260J61476J13333p8507q8844j02346j72188m8657
20457d81745L21329k2638L5933j40756J86854Q5776j67405j0433J44824J66597
20447A18336k74562j23412j1661L56844J35727j083J05506J56447l0770k46179
20437A85193N1474j12092k07524N825J28936K05569k5586j01679q6102l5057L17895
20426C26852Q8393P4405L9842l37419j06206j98297Q8795J6871q1240k5301N7878
20415e5427l2026j85509J80238M9224R0909k06005j51202P0718J62773M6756N9040
20404B9489m9923j64819J77629J25371K952r387J01961l7597K00982j7276m21578
$$ plain form
20478 473916 544562 299392 167982 296668 225066 137445 160038 217709 122271 -42392 -140668
20467 -140668 14237 79248 -266012 -104536 8797 -69710 -158554 -260900 -433088 -481745
20457 -481745 -160416 -183054 -147121 -287877 -101023 -15247 -182652 -193085 -48261 118336
20447 118336 -156226 -279638 -291299 65545 201272 200189 305695 462142 431372 185193
20437 185193 236667 124575 -82949 -77124 51812 257381 231795 130116 44014 8957 326852
20426 326852 415245 489650 529492 192073 85867 -112430 -23635 -6764 -88004 -113305 -55427
20415 -55427 -87453 -272962 -92724 -43500 47409 -158596 -309798 -239080 -76307 -29551 29489
20404 29489 -20434 -185253 -7624 117747 120699 111312 213273 175676 376658 359382 -62196
20393f2196j93784J11019P6178K98748L38433p5630q0750l52984J4431J49715
20383B23180m6759p0342P1893o1509p9961k69893K39277Q8415m7809L3401n5103
20372B4790P6444J71909j19427j92511R0394J8451N0729j31732J6346J3387P048
20361B5828r3958j54671J26757J01158J05746J09191r6639j96162J16742N12940
20351E56932K36974k25784l01534k77900J13775K34781J24865L1058k42561J10504
20341C61110K06095J40887J02222j84671k38775o5328K03254N11258K9682j62033
20331I03701k10980j6806j56142j40298Q7472j89591l82908j19030K36645K0517
20321C2580l17230J3803L58182L0136Q5801j70899J24239K47699j33172k36600
$$ plain form
20393 -62196 -255980 -144961 -68783 229965 568398 492768 412018 59034 73465 223180
20383 223180 176421 106079 177972 116463 36502 -233391 5886 94301 46492 79893 24790
20372 24790 101234 273143 153716 -38795 51599 70050 120779 -10953 5393 18780 25828
20361 25828 -68130 -222801 -96044 5114 110860 220051 123412 -72750 43992 556932
20351 556932 793906 568122 266588 -11312 102463 337244 462109 493167 250606 361110
20341 361110 567205 708092 810314 625643 386868 321540 524794 1036052 1065734 903701
20331 903701 692721 675915 519773 379475 466947 277356 -105552 -224582 12063 32580
20321 32580 -284650 -270847 87335 117471 203272 32373 156612 404311 271139 34539
20311C4539Q501K47012k99566j70430j93604n3605K4286J18713L67298K50599
20301C33743q6871j53567j92119j87130j3736J38620K11221N358R4796J32510
20291B82825k47903o0561O8761j03862n2788j86988K31101L6240N6092j15332
20281i2415M7682J40810o4998n6041L03489K50349q1137j26976k29068l4211k18071
20270a60587O0563O1665P1499j5581k92888K2252L21270O8704o2702k1069P1909
20259A25035k6433m1203K26198J13675L01794L1335o797L732k98527m2676K59181
20248F45314J81234J84460J53970l2188k30505n31596r6750J11152q788J26038
20238E02341L8261J18614Q263k198q872j15459n3672k20180k05006J47434Q0337
$$ plain form
20311 34539 43040 290052 -9514 -179944 -373548 -427153 -402867 -284154 83144 333743
20301 333743 246872 93305 -98814 -285944 -299680 -161060 50161 55519 150315 282825
20291 282825 34922 -25639 43122 -60740 -113528 -300516 -69415 -33175 22917 -92415
20281 -92415 -44733 96077 31079 -24962 278527 528876 447739 320763 91695 57484 -160587
20270 -160587 -100024 -38359 33140 17559 -275329 -253077 68193 136897 74195 53126 125035
20259 125035 98602 57399 283597 397272 699066 730401 723604 727336 428809 386133 645314
20248 645314 826548 1011008 1164978 1132790 902285 370689 273939 385091 376303 502341
20238 502341 540602 659216 667479 665281 656409 540950 487278 267098 62092 209526 289863
20227B89863p2097M1438l6953O2984K25829j59925j56439K52521l0082k1075n0217
20216C45847j55472l7374K26452J03510P4309j51596L9999J4761p724p9085l9121
20205C34506j52677j60425k09499L20806J80431J0478o8876K51932L76332J97026
20195A080034j73960j70996r2256m7966J18945M3172k2050j33462k63210p3766
20185B64485J50171J8908j30809J60982L36520J67757k7560k18870o0892O0399
20175G21091J83597j55853k4481J0487K60382o8646J03026j04354j18110L9538
20165H46677k88599Q5007J51796J69064J13415M37416J37304J17085Q1626j0908
20155A839883M4713j43873j41783J75955J11285k94787o0361P5771q4407k46792
$$ plain form
20227 289863 217766 259204 222251 285235 511064 351139 194700 447221 417139 396064 345847
20216 345847 190375 153001 379453 482963 557272 405676 445675 460436 452712 373627 334506
20205 334506 181829 21404 -188095 132711 313142 323620 254744 506676 883008 1080034
20195 1080034 906074 735078 642822 594856 713801 756973 734923 601461 338251 264485
20185 264485 414656 433564 302755 463737 800257 968014 940454 721584 660692 721091
20175 721091 904688 748835 724354 734841 995223 926577 1029603 925249 807139 846677
20165 846677 558078 643085 794881 963945 1077360 1514776 1652080 1769165 1850791 1839883
20155 1839883 1884596 1740723 1598940 1774895 1886180 1591393 1531032 1606803 1522396 1275604
20145A275604O9200R0161J09043m3777L96727K91525J78607j31183m30778J4703
20135A819832Q5052K60022J8985L6115J63310K26838Q1801k16095k36242j70596
20125B069022J94410N61652l9947j35472J08802K92318J07588m1397r5010M40441
20115C462407L38235J71031K85341R0824N9880K92328N18838O67316P06295P32665
20105G325160N38152Q19174P22419P36799L23942K78721O57075L46683P69748
20096A2517873J449784K084614K876426L516989N043959P341744R723385J0463503
20088E5018277P963355M357897L007137M562413Q646736J5102242K5193442M1667050
20080A65518549O4167471P9496433O0300032n089488o3018977p4321402n4880392
$$ plain form
20145 1275604 1344804 1434965 1544008 1500231 1896958 2188483 2367090 2235907 1805129 1819832
20135 1819832 1904884 2164906 2183891 2220006 2383316 2610154 2691955 2475860 2239618 2069022
20125 2069022 2263432 2825084 2785137 2649665 2758467 3050785 3158373 3116976 3021966 3462407
20115 3462407 3800642 3971673 4257014 4347838 4407718 4700046 5218884 5886200 6592495 7325160
20105 7325160 7863312 8682486 9404905 10141704 10465646 10744367 11401442 11748125 12517873
20096 12517873 13967657 16052271 18928697 22445686 27489645 34831389 44554774 55018277
20088 55018277 62981632 67339529 70346666 74909079 83555815 98658057 123851499 165518549
20080 165518549 229686020 309182453 369482485 364392997 301374020 227052618 172172226
20073A72172226l4330198k1622404j5009199j1394988r063610o659835n051938
20066F9040054m189542l486073l219140k987897k871703k732357k250995j595590
20058D5706757j823785j370510r00165n53474K25840K23975l78018q93862q15260
20049C9421498k17557J12997O24303O63281j02617q40255r03402j199673j231263
20040C6327312j981443k140371j590860j667108j718645j532831j748168j467563
20032B2480323j060171j040283j205116j267390q15323p93720p91862j053904
20024A4452554q29380o79632n79157p13468n82876o37384p01513n02996l22873
20015H903275n52393p63081l62046m44753m6720m37972k85295j60348j96084k90358
$$ plain form
20073 172172226 137842028 116219624 101210425 89815437 80751827 74091992 69040054
20066 69040054 64850512 61364439 58145299 55157402 52285699 49553342 47302347 45706757
20058 45706757 43882972 42512462 41612297 41058823 41284663 41508638 41130620 40236758 39421498
20049 39421498 39203941 39316938 39941241 40604522 40501905 39661650 38758248 37558575 36327312
20040 36327312 34345869 32205498 30614638 28947530 27228885 25696054 23947886 22480323
20032 22480323 21420152 20379869 19174753 17907363 17092040 16298320 15506458 14452554
20024 14452554 13623174 12943542 12364385 11650917 11068041 10430657 9729144 9226148 8903275
20015 8903275 8350882 7587801 7225755 6781002 6734282 6296310 6011015 5850667 5654583 5364225
20005E364225n45784o5489k26732k65433k39421q6594k25694J02619j65577l33214
19995C312906k39271O2528R459Q712j58287k9197n5695k8462j76230k42987j15067
19984B348409J54632J35747j46158j65670p8702M288j59526r7943l52647j36098
19974A506332J86471P7859o7995p5471n01289l60198r2990K53730J15722n670
19964A036501j18647k954l8453K4126j03440K57137J29733l08324J25981J15411
19954A117071n6617n5602O1504Q3293o5985L6212j58915n5631j23750l05971j14615
19943C60994J25373j78961k07073J31690L97K14859p2373p2584Q9720O8034l25491
19932A34585j51260l3082m0229K76911J75554L77471j52519k82176k46413k8429
$$ plain form
20005 5364225 4818441 4752952 4526220 4260787 4021366 3934772 3709078 3811697 3646120 3312906
19995 3312906 3073635 3136163 3145622 3154334 2996047 2966850 2911155 2882693 2706463 2463476 2348409
19984 2348409 2503041 2638788 2492630 2326960 2248258 2252546 2093020 1995077 1642430 1506332
19974 1506332 1692803 1770662 1702667 1627196 1125907 765709 672719 926449 1042171 1036501
19964 1036501 917854 914900 876447 900573 797133 1054270 1184003 875679 1001660 1117071
19954 1117071 1060454 1004852 1066356 1149649 1083664 1119876 960961 905330 781580 475609 360994
19943 360994 486367 307406 100333 232023 232420 447279 374906 302322 392042 460076 134585
19932 134585 -16675 -49757 -89986 186925 362479 739950 587431 305255 58842 30413
19922C0413K8955l1558M1715L29692M6352N3637j25582J7699j5846j80108J10867
19911C06236K19816n435J8227K1110l5400J50203N8431L1382n1048J22775L9757
19900H76054n4955n3971k22055Q907O7271O44p5853j24710J68597K87028O092
19889H83049m15723k44155J53067K94513k0513J78908j07052m5308J63226j08890
19879G31122r710O0593M072k38103m98862Q3733M55618L03337k3761r1435M9228
19868H25832m10180j78795Q1557j02934P5835J15067N4774j47845J93638L8027
19858E44976l70213L3595J42950r6331m1847J43910P6482m7756L51699M1314j21466
19847F57313l20886k32547j76979o0510M6282J78802K92109j00843j14732K9109
$$ plain form
19922 30413 59368 27810 69525 399217 445569 499206 373624 391323 375477 195369 306236
19911 306236 526052 520617 538844 559954 524554 674757 733188 764570 713522 836297 876054
19900 876054 821099 767128 545073 553980 621251 621895 546042 421332 589929 876957 883049
19889 883049 467326 223171 376238 670751 650238 829146 722094 676786 840012 731122
19879 731122 721412 782005 786077 547974 49112 132845 588463 891800 868039 776604 825832
19868 825832 415652 236857 318414 215480 291315 406382 461156 313311 506949 544976
19858 544976 174763 208358 351308 254977 213130 357040 433522 385766 737465 778779 657313
19847 657313 336427 103880 -73099 -133609 -87327 91475 383584 282741 168009 197118
19837A97118R3314K25539J65916j96293q1998K11842m3640r4989p104o7104N347
19826D07948K08795J06051k45831q4622p7294j14062k75524J91104j76182M252
19816e5365P5658q5465L379k15311M307L29277K03391l24622j8022L17677j36079
19805I8825k791Q6882L87287K77848j25593q1674l78492l39929l7553R7377Q9108
19794G1295L0508M3686R6220n2610q1727J29559J16592l165j41618j02944p1298
19783C4498j40074o7312Q6905J61256K68122L43937L6633k88610j06463K93K17502
19772E46687P8143J57363K11920j59671L7151k83409r4974m0989J65951P5167
19762F93339K64060J02556P6429k19796k20295j71562R1681M9534J5533J59850
$$ plain form
19837 197118 290432 515971 681887 485594 403596 615438 571798 476809 469705 402601 407948
19826 407948 616743 722794 476963 392341 315047 200985 -74539 116565 -59617 -55365
19816 -55365 20293 -65172 -61793 -277104 -272797 56480 259871 -64751 -82773 234904 98825
19805 98825 96034 182916 570203 848051 722458 640784 262292 -77637 -115190 -17813 71295
19794 71295 101803 145489 241709 189099 107372 236931 353523 350358 208740 105796 34498
19783 34498 -105576 -172888 -85983 75273 343395 687332 723965 435355 328892 329185 546687
19772 546687 624830 782193 994113 834442 871593 588184 493210 452221 618172 693339
19762 693339 957399 1059955 1136384 916588 696293 524731 616412 665946 681479 841329
19752H41329j21750n1464l21255j12837j46393J94141N1779k75968N3448J71938
19742B82968k38453k07173J28044J03466J19942K05340N6713l7194j73606k90692
19732e0645K8786K12339J04915J94426J18328N6890j80406J53914K19906j73501
19722F84952q7168Q4082P3181L4303j72592n0130k3332m8603O3404Q065K4132
19711E90294n011J62180J23045j03893j18409j7445n9346J14034o6037j74784
19701D44628l5968o2450j28379J13601J87895j97959O0316j7517n2333J53597
19691D65431K45142K67898K0953r7447n6291k29844j20343j7852k08205N2887
19681C22329L22826k19086k11940m84l2407K43272M37465m3279n06488j49294
$$ plain form
19752 841329 719579 668115 346860 234023 87630 281771 333550 57582 111030 282968
19742 282968 44515 -162658 -34614 68852 188794 394134 450847 413653 240047 -50645
19732 -50645 -21859 190480 295395 489821 608149 665039 484633 638547 858453 684952
19722 684952 597784 681866 755047 789350 616758 566628 543296 494693 558097 566162 590294
19711 590294 585283 747463 870508 766615 648206 630761 571415 685449 619412 444628
19701 444628 408660 346210 217831 331432 519327 321368 381684 364167 311834 465431
19691 465431 710573 978471 999424 901977 845686 615842 495499 477647 269442 322329
19681 322329 645155 426069 214129 213645 181238 424510 861975 818696 312208 162914
19671A62914M02265r3845k9591K94351R4572k78557J37381j51932k02268j84841
19661A50449K5102L73103K08793k15391j26369J31918k22692k61654J09252L9161
19651B11672o8596J32046K62292Q7690q1955l32261l8167K77741j38831j40237
19641A71394J73091J18929j39974J42320M9557k27079J76444L15640Q1496j85145
19631F76673j15716R800n0751P4887k9299L5887J60170j50001k43111J42167Q8960
19620E99666J92541K29533J57745q3436j96443k88055J77584L47994K51730p0168
19610A318691Q108r8055m9545l6378L9468J72153p3859j48011P8149J21000K57527
19599A589248M31729N8775l2297k23499L1654j12268L3914O5595K12203J79972
$$ plain form
19671 162914 565179 471334 441743 736094 830666 552109 689490 537558 335290 150449
19661 150449 175551 548654 757447 542056 415687 547605 324913 63259 172511 211672
19651 211672 143076 275122 537414 625104 543149 210888 172721 450462 311631 171394
19641 171394 344485 463414 323440 465760 515317 288238 464682 780322 861818 676673
19631 676673 560957 570757 520006 594893 565594 601481 761651 611650 368539 510706 599666
19620 599666 792207 1021740 1179485 1096049 899606 611551 789135 1137129 1388859 1318691
19610 1318691 1326799 1228744 1179199 1142821 1182289 1354442 1280583 1132572 1210721 1331721 1589248
19599 1589248 2020977 2079752 2047455 1823956 1855610 1743342 1777256 1842851 2055054 2235026
19589B235026O562j08592J85363J6782j67789P3117j19056K1583J32374j1078
19579B264292j65849k21729m7388m9778j13947L13282L27049K19738l1544n1781
19569B442345J42682j28916j1142L36920Q2351L2280K89524K00641q7689P1052
19559C370048n1281K37545j8312M7697L53350L13796L00292K70903L91430K60904
19549E476372J85540M77404N47150N54697N47262N30925P77224P12991Q60235
19540A0669800Q64578J015503J391591J601334J996481K080072K516611K832498
19532B4968468L172246L794562M161482M287252M250289M920859O502076P899672
19524F3956906Q228486P709287P515316R369198J1822413J2172959R524303N604474
$$ plain form
19589 2235026 2241588 2132996 2318359 2335141 2167352 2240469 2121413 2142996 2275370 2264292
19579 2264292 2098443 1876714 1829326 1779548 1665601 1978883 2305932 2525670 2494126 2442345
19569 2442345 2585027 2456111 2444969 2781889 2864240 2896520 3186044 3386685 3298996 3370048
19559 3370048 3318767 3556312 3538000 3585697 3939047 4252843 4553135 4824038 5215468 5476372
19549 5476372 5661912 6139316 6686466 7241163 7788425 8319350 9096574 9809565 10669800
19540 10669800 11534378 12549881 13941472 15542806 17539287 19619359 22135970 24968468
19532 24968468 28140714 31935276 36096758 40384010 44634299 49555158 56057234 63956906
19524 63956906 72185392 79894679 87409995 96779193 108601606 120774565 130298868 135903342
19516A35903342M115278N562799O078045L095473j738031n118442m952929m287976
19508A38657559m781699o315760o794145o718806o769033o279434n420718m422953
19500I1155011m174374m526015n040488m709125l521276k895452k322464k180500
19492F1785317k244054j392882r78286o18868J20686M76783Q78844J336612J811731
19483F1175883K391413L230767L671833L816388M147414M941460N969166O237981
19475I5582305N545080N292201N893961P550416Q540394Q185515Q350482Q819796
19467A53760150R465489Q268616P112038P508981P850061M605864q04681m297525
19459A93468993m547729l379247n358484j0281272j3099394j2555364j0069017
$$ plain form
19516 135903342 140018620 145581419 151659464 154754937 153016906 147898464 142945535 138657559
19508 138657559 133875860 127560100 120765955 114047149 107278116 100998682 95577964 91155011
19500 91155011 86980637 82454622 77414134 72705009 69183733 66288281 63965817 61785317
19492 61785317 59541263 58148381 57170095 56551227 56671913 57148696 58027540 59364152 61175883
19483 61175883 63567296 66798063 70469896 74286284 78433698 83375158 89344324 95582305
19475 95582305 101127385 106419586 112313547 119863963 128404357 136589872 144940354 153760150
19467 153760150 163225639 171494255 178606293 186115274 193965335 198571199 197766518 193468993
19459 193468993 188921264 185542017 180183533 169902261 156802867 144247503 134178486
19452A34178486q610678q577832q976933q715325p039280n215409m149431m376472
19444G8517126m370894l830426l114812k852065k910689k706283j997016j740155
19436E4994786j375762j238328j507934j382245j016562p63011j131250j431323
19428D5148371j444055j278113q99197j278643j502031j674959j469457j207217
19420C4394699j424938j440251j368294j177954j385298j513503j385548j157262
19412B3541651j264286j244070q28621j112981j341941j109040q50318p84659
19404A5005735p44664o31846o86190n74772p18770o08845m96205m32356k83336
19395I828751l13054l33868n00712p42976l48618m50723l40155k15634k95261
$$ plain form
19452 134178486 125567808 116989976 108013043 99297718 92258438 87043029 82893598 78517126
19444 78517126 74146232 70315806 67200994 64348929 61438240 58731957 56734941 54994786
19436 54994786 53619024 52380696 50872762 49490517 48473955 47710944 46579694 45148371
19428 45148371 43704316 42426203 41527006 40248363 38746332 37071373 35601916 34394699
19420 34394699 32969761 31529510 30161216 28983262 27597964 26084461 24698913 23541651
19412 23541651 22277365 21033295 20204674 19091693 17749752 16640712 15790394 15005735
19404 15005735 14261071 13629225 12943035 12368263 11649493 11040648 10544443 10112087 9828751
19395 9828751 9515697 9181829 8681117 7938141 7589523 7138800 6798645 6583011 6287750
19386F287750j3000l36570l50881m8212J4991j55823l93498n33527k96747k66432
19376C908051l78663r772L01120q6392j177k47663j02851l28926k02266J3599
19366B865060Q3271n08506o60703k10287K53113J01402K7456j53151k47478J4008
19356A564185j10907m138J58288J98880P2821k53338J070J4896j43989L72l6407
19345A461733L6931L53822J78191k75317j63625j20757L6219j3432j63986R8025
19335A427804k83768l6235L47005J58738j26709O6280m4296l65529k1031n6051
19325A066208l5422j5198J3124k5152j18827j10067L9888l447M6387k3743r7945
19314G35806l3079j1190J73395p601k66671M3036L48273J07254j28345k55170
$$ plain form
19386 6287750 6274750 5938180 5587299 5539087 5554078 5398255 5004757 4471230 4174483 3908051
19376 3908051 3529388 3519616 3820736 3734344 3733167 3485504 3382653 3053727 2851461 2865060
19366 2865060 2948331 2439825 1779122 1568835 1821948 1923350 1950806 1797655 1550177 1564185
19356 1564185 1453278 1449140 1607428 1806308 1879129 1625791 1626861 1641757 1497768 1498140 1461733
19345 1461733 1498664 1852486 2030677 1755360 1591735 1470978 1507197 1493765 1329779 1427804
19335 1427804 1144036 1107801 1454806 1613544 1486835 1553115 1508819 1143290 1122259 1066208
19325 1066208 1030786 1015588 1028712 1003560 884733 774666 814554 811107 857494 833751 735806
19314 735806 702727 691537 864932 857331 590660 633696 981969 1089223 960878 705708
19304G05708J7447L0756P2825j63539K54480J46122p8164m4513q7478Q149j3651
19293H48142K86706J86237k54009L65706J69827q9600P5417N666k32008l71337
19283I90747j0515J98869P4731m8197j9755j53300p2099k55272p2983J15513J59780
19272I07519L19027k1521O6523j15404j33548m4232J41308L5441j45424j54280
19262H55409l48536j58628K27139q0989J53514L2685n0206q9450k23824R2672
19252D09786K09103J0311j17404n3844k2223N2m25339O097L26995L56287J19471
19241H19292J50523k78791l76813K7699J92536k14761j46787O159m9209q3684
19231D6164Q4788M9549m4509j47211L3290L13737L38076j15911l52093J30390
$$ plain form
19304 705708 723155 753911 826736 663197 917677 1063799 985635 941122 853644 861793 848142
19293 848142 1134848 1321085 1067076 1432782 1602609 1513009 1588426 1594092 1362084 990747
19283 990747 980232 1179101 1253832 1205635 1185880 1032580 960481 705209 632226 747739 907519
19272 907519 1226546 1205025 1271548 1156144 1022596 978364 1119672 1155113 1009689 855409
19262 855409 506873 348245 575384 494395 647909 680594 630388 540938 317114 409786
19252 409786 618889 629200 511796 457952 435729 435781 10442 16539 343534 699821 819292
19241 819292 969815 691024 314211 341910 534446 319685 172898 179057 129848 46164
19231 46164 130952 180501 135992 -11219 22071 335808 673884 557973 205880 336270
19221C36270k03499l0950K47847K04524K34297j95060j11800K5790J35849j7515
19211F25753j21866K19828K76963k69612l26793k82403n2806K30696N1524p7205
19201B74079j24909J45961j1254K4953J07756L5556Q154j24233j69227k13215
19191d6379k18020K57437j33012o7331K20684J72513J62945R5185P8480Q1836
19181F04338j11219K6826j95049J15171J27112l9480j52836o2861K86776K56952
19171H55730j8442r4107p0463o1207J75018P2137j67851L1036M2215N8027K459
19160H24552P0231l7055j73049l5518K15623K5855k31705l6092j99771k68962
19150A54109p2956J38185L48143L2379M7492M5223k2743N6129R4158J442L08165
$$ plain form
19221 336270 132771 101821 349668 554192 788489 593429 481629 507419 643268 625753
19211 625753 503887 723715 1000678 731066 404273 121870 69064 299760 351284 274079
19201 274079 149170 295131 283877 308830 416586 452142 460296 336063 166836 -46379
19191 -46379 -264399 -6962 -139974 -207305 13379 185892 348837 444022 522502 604338
19181 604338 493119 519945 324896 440067 567179 527699 374863 312002 598778 855730
19171 855730 837288 743181 672718 611511 786529 858666 690815 721851 764066 822093 824552
19160 824552 894783 857728 684679 649161 864784 890639 658934 622842 423071 154109
19150 154109 81153 219338 567481 599860 647352 692575 669832 725961 820119 821561 1129726
19139A129726j93372k81493q8049k2356j38065J7179J61744r0194P9597k5928
19129E48789P3233n2917R9156J40233p1736k10371j51399Q7449n9636j79394m2165
19118A81242L0220Q2647L83547j7975p0286O7142N4974O8110O4638j39146k52848
19107D52265N1002k10385n116j04054j58534j23024L70915L0235J3302k15803
19097A00803J21408M3935R4179q638J14891R3842O8753o6534j68260L03440K16195
19086I14014Q9733j18896k44287j89182Q5513K89869l01789q9722K03029O4319
19076G02601j0961j28291J7491O4287j30449j59336J16549Q1949K33428J2994
19066H00262k17778j36058j3710k43006m99J77823J79221l05413J4284K26735
$$ plain form
19139 1129726 936354 654861 566812 544456 406391 423570 585314 495120 574717 548789
19129 548789 622022 569105 668261 808494 736758 526387 374988 462437 402801 223407 181242
19118 181242 211462 294109 677656 659681 589395 656537 711511 779621 844259 705113 452265
19107 452265 503267 292882 287766 183712 25178 -97846 273069 303304 316606 100803
19097 100803 222211 266146 360325 351687 466578 560420 629173 562639 394379 697819 914014
19086 914014 1003747 884851 640564 451382 536895 826764 524975 435253 638282 702601
19076 702601 691640 563349 580840 645127 514678 355342 471891 553840 787268 800262
19066 800262 582484 446426 432716 189710 189211 367034 546255 240842 255126 481861
19056D81861K88838P384O0757k68340k37754q070K30440J7741n7691r6019j06486
19045C12661J08998J62425N2652q492o0923J57847K14782J63202q4475k20826
19035G97851J2553M6336R104J6107O042j74799l5917L9245J82181j35097l16163
19024D47443K51479J45454P2006K8566n5686K0542K7601J99115L04990J56332
19014A597842k47746J23367P4456l5232j08148N7354l1428J09886J00445K57298
19004A898094J51751L11506j00090k45325j70636j129K26554J41958o9245P908
18994B151346J36211m5748L7516k33148j65922J46454K55679q0565n1341L33118
18984B483600O7000j84703j21240j51120J50501n5809J60001L5346K06275P324
$$ plain form
19056 481861 770699 778083 838840 570500 332746 324676 555116 572857 515166 419147 312661
19045 312661 421659 584084 636736 628244 567321 725168 939950 1103152 1018677 797851
19035 797851 810404 856740 865844 881951 887993 713194 677277 716522 898703 763606 447443
19024 447443 698922 844376 916382 944948 889262 909804 937405 1136520 1441510 1597842
19014 1597842 1350096 1473463 1547919 1512687 1404539 1461893 1430465 1540351 1640796 1898094
19004 1898094 2049845 2361351 2261261 2015936 1845300 1844171 2070725 2212683 2143438 2151346
18994 2151346 2287557 2241809 2279325 2046177 1880255 2026709 2282388 2201823 2150482 2483600
18984 2483600 2550600 2365897 2244657 2093537 2244038 2188229 2348230 2383576 2589851 2597175
18974B597175j59098j75597K4700K35332R526R0909M42054K07107k5111L24524
18964C571521P7862o2983J79028Q7152P1251q732J31880K40863N18180M90687
18954E296709L76585J87158L35132L88501M25206J73829M48484L09069K40052
18945H180725P09024P61804O03294J051947J109197R23819J120151J483306J370181
18936A7313448J796481K440769L008365L282142L703509M186689M765931N322182
18928D5819516N537364N532862O031981P779731R299581J0061831J0610399J0925951
18920A11599216J2787006J5149734J5571114J2183651P593202O628983P146817
18913A88659723L955895k681858p164941p267912p182705r275177j0466394r252264
$$ plain form
18974 2597175 2438077 2262480 2287180 2522512 2532038 2622947 3065001 3272108 3246997 3571521
18964 3571521 3649383 3586400 3765428 3852580 3923831 3915099 4046979 4287842 4806022 5296709
18954 5296709 5673294 5860452 6195584 6584085 7009291 7183120 7631604 7940673 8180725
18945 8180725 8889749 9651553 10254847 11306794 12415991 13339810 14459961 15943267 17313448
18936 17313448 19109929 21550698 24559063 27841205 31544714 35731403 40497334 45819516
18928 45819516 51356880 56889742 62921723 70701454 80001035 90062866 100673265 111599216
18920 111599216 124386222 139535956 155107070 167290721 174883923 181512906 188659723
18913 188659723 192615618 189933760 182768819 175500907 168318202 159043025 148576631 139324367
18905A39324367p703583o997613o884731o330309n304862m524295m668061n689848
18897I1221065n735603m657089l755345l779053l691109k652256j879244j600903
18889F3470463r41909l10131L3801L85129P04204J151183J426239K109784K536415
18880G0565178K758268L151815L777552M816903M942658N130785M927270M514667
18872A04585096N107378N713720O146288O103375O867318P965732Q014107O420000
18864A56923014N780613O765376O905256K584878l147471n268076m419150n566896
18856A60557544r752878j2484017j2032736r790226q425038q128077p737209o771870
18848H5435493n565865m464880l703443l572862l364394l286087k721337k763237
$$ plain form
18905 139324367 131620784 124623171 117738440 111408131 106103269 101578974 96910913 91221065
18897 91221065 85485462 80828373 77073028 73293975 69602866 66950610 65071366 63470463
18889 63470463 62528554 62218423 62252224 62637353 63341557 64492740 65918979 68028763 70565178
18880 70565178 73323446 76475261 80252813 85069716 90012374 95143159 100070429 104585096
18872 104585096 109692474 115406194 121552482 127655857 134523175 142488907 150503014 156923014
18864 156923014 162703627 169469003 176374259 178959137 175811666 170543590 166124440 160557544
18856 160557544 150804666 138320649 126287913 116497687 108072649 99944572 92207363 85435493
18848 85435493 79869628 75404748 71701305 68128443 64764049 61477962 58756625 55993388
18840E5993388k511368k112029j803163j264678j686533j715468j231442j038470
18832D2630237q77653j067864r69453q77296j030774j096794j198278j046300
18824C4465825j142310j411813j396793j264919j249237j231995j353269j149184
18816B4266305j121975j211764j303786j043027q65887n61472p96028j111742
18808A6250624r39210p19229q00528j046121o39593l98929l38612m04970n77365
18799A0386067l68027n64599n69687o13436m93952K2255k21452l04445k90419
18790F982305m33618k02143n51036m03505k05629k66418k32507N4255j65436l39214
18780D237054n2561l11139k54847j2583M5792j38608l01692j26763O0759n8205
$$ plain form
18840 55993388 53482020 51369991 49566828 48302150 46615617 44900149 43668707 42630237
18832 42630237 41752584 40684720 39715267 38837971 37807197 36710403 35512125 34465825
18824 34465825 33323515 31911702 30514909 29249990 28000753 26768758 25415489 24266305
18816 24266305 23144330 21932566 20628780 19585753 18719866 18158394 17362366 16250624
18808 16250624 15311414 14592185 13791657 12745536 12105943 11707014 11368402 10963432 10386067
18799 10386067 10018040 9453441 8883754 8270318 7776366 7798621 7577169 7272724 6982305
18790 6982305 6548687 6346544 5795508 5392003 5186374 4919956 4687449 4741704 4576268 4237054
18780 4237054 4184493 3873354 3618507 3605924 3651716 3513108 3211416 3084653 3145412 3087207
18770C087207l47200j74740J90352N09395K53317j43569m55299k74912l86171
18761B258380J54693p6145j39684j68011k39901n11517p4255N7832Q6057K47562
18751A595011J73549j1038l50897k83289l776P2060K24260J82614o9078J63243
18741A692659J87216m3157J0214k58636j04867J8971n8862J9307l1178r0590J26437
18730A467514J02425L2778J8820k75886m6629K02090J33391j17737j72587m9204
18720A294975k33692J00285M6887K07466L6108r0296k79583N0576o9263l31649
18710G31814k28843K94305M06215P7716j14651q2399j11832L0981K49200j55517
18700A096989l02280n1915o3901K08697J46846p0901n25R9482p8757j20267p3250
$$ plain form
18770 3087207 2740007 2565267 2755619 3265014 3518331 3374762 2919463 2644551 2258380
18761 2258380 2413073 2336928 2197244 2029233 1789332 1277815 1203560 1261392 1347449 1595011
18751 1595011 1768560 1757522 1406625 1123336 1119560 1191620 1415880 1598494 1529416 1692659
18741 1692659 1879875 1836718 1846932 1588296 1483429 1502400 1443538 1462845 1431667 1341077 1467514
18730 1467514 1569939 1602717 1621537 1345651 1299022 1501112 1634503 1516766 1344179 1294975
18720 1294975 1061283 1161568 1208455 1415921 1452029 1361733 1082150 1132726 1063463 731814
18710 731814 502971 797276 1203491 1281207 1166556 1084157 972325 1003306 1252506 1096989
18700 1096989 794709 742794 678893 887590 1034436 963535 963010 1062492 983735 863468 790218
18689G90218k66867P022J86889K88925J59588l7286P2473q608J88655K8078M6491
18678A455578J1662M6970J00422J1581j794l32916l04656m7610K29499O8M1193
18667A209997k7285k94092j32017Q2183K5063j2253M6195P8313j65999J73950
18657I84055j02525l29521j48946j33410J58712Q3866R1973R8187K17930J11869
18647A032190R7899j09424m00331j61331J86994k23295Q1996K40596r7501k63105
18637C84688j91191j39834k93201K98492K41415K18898J53035j76461j11633p4029
18627C10179j30792o5785K44129q2684J42106j14245Q0132L63808O2409k67332
18617E41925p013L1675k4280K5198j01904j32667q8369k16706k08177l1197K46114
$$ plain form
18689 790218 523351 530373 717262 1006187 1165775 1128489 1200962 1192354 1381009 1409087 1455578
18678 1455578 1467240 1514210 1614632 1626213 1624419 1291503 986847 939237 1168736 1168804 1209997
18667 1209997 1182712 888620 756603 838786 863849 851596 897791 976104 810105 984055
18657 984055 881530 552009 403063 269653 428365 512231 604204 702391 920321 1032190
18647 1032190 1130089 1020665 620334 459003 645997 422702 504698 745294 647793 384688
18637 384688 193497 53663 -239538 58954 300369 519267 672302 495841 384208 310179
18627 310179 179387 113602 357731 275047 417153 302908 383040 746848 809257 541925
18617 541925 534912 566587 542307 567505 465601 332934 244565 27859 -180318 -211515 34599
18606C4599J6745L4879p6530j75496P007J66833L27165J42603J4857R3321R6783
18595F82766j28572k92647j03705K73467J94805Q3683q6767L3522l16013k45697
18585I4842q5392l8953J09786L25561J46254l39378k08658K72197K04826j17521
18575C63564j01233m0866j06366M4318l3231N2564M2962M9371P0662O8550k8077
18564C82218L02807j54086m21838K2565K24827K79309L9514j54588j48694K77198
18554F49232J26892j17188J69564J26341k04457k96405q3576j57919K1842J10050
18544C44376K9597J20630p5575n8734M57072K7232o9933k50505p9248j8789O0029
18533D86152J27652j68820k0094j4639J84565Q7206j84341n5258j32468r8611
$$ plain form
18606 34599 51344 86223 9693 -165803 -158796 8037 335202 477805 492662 585983 682766
18595 682766 554194 261547 157842 431309 626114 709797 623030 656552 340539 94842
18585 94842 9450 -29503 80283 405844 552098 212720 4062 276259 481085 363564
18575 363564 262331 221465 115099 159417 126186 178750 221712 271083 341745 410295 382218
18564 382218 685025 530939 109101 131666 356493 635802 675316 520728 372034 649232
18554 649232 776124 658936 828500 954841 750384 453979 370403 212484 234326 344376
18544 344376 373973 494603 419028 360294 817366 844598 774665 524160 444912 426123 486152
18533 486152 613804 444984 424890 410251 594816 682022 497681 442423 309955 211344
18523B11344M3503j38994K43768K31230R3538q1513L16110k7651m1737r2734l05685
18512D51179k55076m2060K6232J39193K81624O9331j79999l78561R4110j14168
18502I1805K5403K98640J39027j39771j09113L6211M2822L6450o6147N7288n8881
18491C53734j15983j79679j36723J58443M11401J48916r5809j27524k55169j52989
18481H618N4091N4109m9826J5390r4461j84263J68784J12822J873k56237k00790
18470c69890J85992q902J24326R5519J36177J69907k0823J0488o4314k01734P425
18459F4171q9260M9852J66667r1856J15326J22651P5806n9593p3289j83046j55044
18448e7615o8300m60692Q3835K90592L91441o9070j16495j0844m9297k28766L59788
$$ plain form
18523 211344 254847 115853 359621 590851 684389 602876 918986 891335 849598 756864 451179
18512 451179 196103 154043 180275 319468 601092 670423 490424 111863 205973 91805
18502 91805 117208 415848 554875 415104 305991 342202 385024 421474 355327 412615 353734
18491 353734 237751 58072 -78651 79792 491193 640109 544300 416776 161607 8618
18481 8618 62709 116818 66992 82382 -12079 -196342 -27558 85264 87137 -169100 -369890
18470 -369890 -183898 -192800 -68474 27045 163222 333129 312306 322794 258480 56746 64171
18459 64171 -25089 24763 191430 99574 214900 337551 413357 353764 280475 97429 -57615
18448 -57615 -125915 -586607 -502772 -212180 179261 110191 -6304 -17148 -66445 -295211 64577
18437F4577K40970j53459k97144j36121n9926j82602K97359L55439J55320j14704
18427A69709k02418J48760P3868J35528J34179k73122O8500N4621k52214O3432
18417A20843J90026j81995K47087l4245q9042m2851l7997j46400o7519K0113P0896
18406D8916K50653L52614P7910r1276l2676Q4368j94976K86173L52415J56525
18396A290646R2001m91388j54709J64944j66780L2443J76015N6004R6547l43305
18386G52418q5365K951J66092K00159j45712k30591K5618J04777K18306o7560
18376I41093k44325k70630r0346J6762K06596K11117J88685L2214J16761j5307
18366A092620k06624q1464J83428J28603k18563r6916J62835j36910l05275k41385
$$ plain form
18437 64577 305547 152088 -145056 -281177 -341103 -523705 -226346 129093 284413 169709
18427 169709 -32709 116051 189919 325447 459626 186504 255004 309625 57411 120843
18417 120843 310869 128874 375961 341716 252674 209823 171826 25426 -42093 -21980 48916
18406 48916 299569 652183 730093 638817 606141 690509 495533 781706 1134121 1290646
18396 1290646 1382647 891259 736550 901494 734714 767157 943172 999176 1095723 752418
18386 752418 667053 670004 836096 1036255 890543 659952 685570 790347 1008653 941093
18376 941093 696768 426138 335792 352554 559150 770267 958952 991166 1107927 1092620
18366 1092620 885996 804532 987960 1116563 898000 801084 963919 827009 521734 280349
18356B80349j25898O5971J35146K85790J64994J4345l7240O327j3623l13227Q2905
18345E45839N22882J65090p9423k17988o2448m8305j44550j49271J8192q1223
18335D68795N85J06706K67961j04030k19459r9226m3161k03815j32772K53940
18325B95524O3550J3323J94239J22227r3555m0101j69646J17155J30817l46533
18315B87000k63468j38394J34212J048k78045l5386L53435J50664K31246n2283
18305C90029n4095J46833j18454m50313K14077K9703j48862J33393J19015l6041
18295B25285L26202K06222k88986r1105J51580j23919J0403p2964j32752J56290
18285C66256K6599l8437q4253K23898J58747K50626k08402k06313q8813k19892
$$ plain form
18356 280349 154451 220422 355568 641358 806352 820697 783457 789784 776161 462934 545839
18345 545839 1068721 1233811 1154388 936400 873952 825647 681097 531826 550018 468795
18335 468795 469380 576086 844047 740017 520558 421332 378171 174356 41584 295524
18325 295524 359074 372397 566636 688863 595308 555207 385561 502716 633533 287000
18315 287000 23532 -114862 19350 20398 -257647 -293033 60402 211066 442312 390029
18305 390029 335934 482767 364313 -86000 128077 157780 8918 142311 261326 225285
18295 225285 551487 757709 468723 377618 529198 405279 415682 342718 209966 366256
18285 366256 392855 354418 270165 494063 652810 903436 695034 488721 399908 180016
18275A80016N1568R8194n8721K05118J42634k42450n8304O3792J37718m2465Q0178
18264E57278M91193K08883k06409k63773k43395k33542j89457n3214K93902K48503
18254F09969p7961n3002R7796m741J889j30808k19838P1959l3687m2050J28929
18243C48455K143q5972K6878J53206j48382q5953J30741k4023M4139J7320j93260
18232A85292k2637j20543n5235L4327J24089p684j8468j59236J5541J5181J60211
18221A50838N8382J89871j61027j74744m9859m1666r2446R8590J05362j51291
18211f7990k3417K11182M15260R852k94796l3550j59302Q4032K71979J21491R4927
18200F29668M13668K35421J0685k12807j2485J94996p7193J1645J6275j1867l07930
$$ plain form
18275 180016 231584 329778 271057 476175 618809 376359 318055 381847 519565 477100 557278
18264 557278 1048471 1257354 1050945 787172 543777 310235 120778 67564 361466 609969
18254 609969 532008 479006 576802 572061 573950 443142 223304 295263 261576 219526 348455
18243 348455 350598 264626 291504 444710 296328 210375 341116 317093 361232 378552 185292
18232 185292 162655 42112 -13123 21204 145293 137609 119141 -40095 -24554 -9373 150838
18221 150838 209220 399091 238064 63320 13461 -28205 -120651 -22061 83301 -67990
18211 -67990 -91407 119775 535035 544887 250091 216541 57239 141271 413250 534741 629668
18200 629668 1043336 1278757 1289442 1076635 1064150 1259146 1181953 1193598 1209873 1198006 890076
18189H90076k8507J40192q7044K8747r8979O7601J52610j22014n100j54567j27496
18178F55519l864N7243j65329J92822L10991J62237J01455k2247j11895r8107
18168A078825K42390J58033M8922j59139P2755K40499j31188k59631k79401j7224
18158I94841K24303L06439Q1777o070J2589K51833L5995k80845J47046j2881j34090
18147A620937J39821J36002L8752L9316N8086J48317K00741r2123J19708N06496
18137B916053L13325L66301K64236K39209K11426K92106N85063O10034O49558
18128F447311R15087J079282J306487J697439J752197K430607L684665N438745
18120B4751820P511332P865214O055666L027997J861529K988323O120112J1214169
$$ plain form
18189 890076 861569 1001761 914717 943464 844485 912086 1064696 942682 937582 783015 655519
18178 655519 651655 708898 543569 736391 1047382 1209619 1311074 1288827 1176932 1078825
18168 1078825 1321215 1479248 1528170 1369031 1441786 1682285 1551097 1291466 1012065 994841
18158 994841 1219144 1525583 1607360 1601290 1613879 1865712 1901707 1620862 1767908 1755027 1620937
18147 1620937 1760758 1896760 1935512 1974828 2032914 2181231 2381972 2289849 2409557 2916053
18137 2916053 3229378 3595679 3859915 4099124 4310550 4602656 5187719 5797753 6447311
18128 6447311 7362398 8441680 9748167 11445606 13197803 15628410 19313075 24751820
18120 24751820 32263152 40128366 46184032 49212029 51073558 54061881 60181993 71396162
18112G1396162J8986603L2203240N0771810O5577384N0141646q534350n4641048
18105B25901447n9310472m0764791k4880165j5986790j0829621q138763o387142
18098E9603703m930302m012098l339399k727561k447478j937061j592372j770594
18090C6846838j646852j427151j397785p69356q43716r29669n93274m28029m6420
18081B8764586J73055o1084p7959P4713R37860N81603k51142n01830l26174r43222
18071B8370406j502318j479699j297691j343185j340564j254467j302629j152621
18063A7697232r42258j003470q95241q56544q90884n71531n62273p78489n48971
18054A0647571n47425m80583m24624m08672p24299m93066k04543m68876k40042
$$ plain form
18112 71396162 90382765 122586005 173357815 238935199 289076845 280542495 225901447
18105 225901447 166590975 125826184 100946019 84959229 74129608 65990845 59603703
18098 59603703 54673401 50661303 47321904 44594343 42146865 40209804 38617432 36846838
18090 36846838 35199986 33772835 32375050 31605694 30761978 29832309 29239035 28811006 28764586
18081 28764586 28937641 28876557 28798598 28873311 29811171 30392774 30141632 29639802 29313628 28370406
18071 28370406 26868088 25388389 24090698 22747513 21406949 20152482 18849853 17697232
18063 17697232 16754974 15751504 14856263 13999719 13108835 12537304 11975031 11196542 10647571
18054 10647571 10100146 9619563 9194939 8786267 8061968 7568902 7364359 6895483 6655441
18045F655441j00558m75209m08619j68487J6393K1971k40849m81516l10107l09911
18035D198549r6875k63532l20162k19359m89600q054O4109j51377k15147k16869
18025B281683l1942J05592J12274j64031j69337j09923r7189n3795k07656l98981
18015A266695m1320J61947o056k39803j25562M4965K12250J46976M551N0667r5228
18004A380082l12537J59656N0249q9141l13097j24750N9085J96283J30822L4284
17994A170936j39544q2732j6905Q1629J55795j13983K86255R9570j98839j27690
17984A114492P6671j09333m7883j0037P1349J63084J36487j16268j98269k36344
17974H43949k32261j8696M1040q2094M7244M3885p4929j98853o8231K30470k8973
$$ plain form
18045 6655441 6554883 6079674 5671055 5502568 5518961 5540932 5300083 4818567 4508460 4198549
18035 4198549 4101674 3838142 3517980 3298621 2809021 2800967 2865076 2713699 2498552 2281683
18025 2281683 2249741 2355333 2467607 2303576 2134239 2024316 1927127 1873332 1665676 1266695
18015 1266695 1225375 1387322 1381266 1141463 1015901 1060866 1273116 1420092 1424643 1475310 1380082
18004 1380082 1067545 1227201 1277450 1188309 875212 750462 809547 1005830 1136652 1170936
17994 1170936 1031392 948660 931755 1013384 1169179 1055196 1341451 1441021 1242182 1114492
17984 1114492 1191163 1081830 1033947 1023910 1095259 1258343 1394830 1278562 1080293 843949
17974 843949 611688 592992 634032 551938 599182 643067 568138 369285 301054 531524 502551
17963E02551K5644j57918k33535l7691J77397R4697l2408K4982k75547m0627K23158
17952B70703q5785l25826k9992p7066p1430K03323J77487J05014J19576L32651
17942F18655K45539K1417J8652n1709p3353l53213j8898J19245p8605j89109p3492
17931A85129K76580K45852j90151k06876j47801J68292R0176J78997K1402O3823
17921F85423k95049k8463K56477J85020n5536j0041j44120K24787K53666L4433
17911A106597l50989k72297k68046q8718J89266N0836N1075M4561j19286j17298
17901B25701p2067K09501J58494j96834J56738p339Q1463Q6469p9748k87760J69318
17890D43936L0528k19544O2409J32245j68877O5285J16335r5957k4423n1912j15878
$$ plain form
17963 502551 528195 370277 136742 99051 276448 371145 338737 363719 88172 47545 270703
17952 270703 184918 -140908 -170900 -247966 -319396 -116073 61414 166428 286004 618655
17942 618655 864194 885611 904263 852554 779201 425988 407090 526335 447730 258621 185129
17931 185129 461709 707561 517410 310534 162733 331025 421201 600198 621600 685423
17921 685423 390374 361911 618388 803408 747872 737831 593711 818498 1072164 1106597
17911 1106597 755608 483311 215265 126547 315813 366649 417724 462285 342999 225701
17901 225701 153634 363135 521629 324795 481533 474194 555657 642126 562378 274618 443936
17890 443936 474464 254920 317329 449574 280697 345982 462317 366360 341937 290025 174147
17879A74147j82455r4164r538K3252J03437P2804J21981J27146j97680J13582
17869B52512J95455r3143k09377L30665L68268j6895j11526m0060j74484J46432
17859F47847l40536n6643K87972J51778k74240j63401Q9058J45090k09403j16265
17849A61257j46822k73741j49256j18515m0006L51914J14440k19039J37447L07053
17839A24732N24564P0404k67221k75459k93860l8419L39612K56616r0995n02131
17829a52157j48863J18079K61922j82590k17353R6777p5314j31449J47570j14458
17819c97836j01839J47814Q5962K50321K97390j14257j94729j4512K01537J09010
17809B68861o7467M6195J62200k32053j73614j33326r9950J298O0082K28771L88233
$$ plain form
17879 174147 -8308 -102472 -112010 -88758 14679 87483 209464 336610 138930 252512
17869 252512 447967 354824 145447 476112 844380 827485 715959 675899 501415 647847
17859 647847 307311 250668 538640 690418 416178 252777 341835 486925 277522 161257
17849 161257 14435 -259306 -408562 -527077 -567083 -215169 -100729 -319768 -182321 124732
17839 124732 649296 719700 452479 177020 -116840 -155259 184353 440969 349974 -152157
17829 -152157 -301020 -182941 78981 -103609 -320962 -224185 -299499 -430948 -283378 -397836
17819 -397836 -499675 -351861 -265899 -15578 281812 167555 -27174 -41686 159851 268861
17809 268861 201394 247589 409789 177736 4122 -129204 -229154 -227856 -167774 60997 449230
17798D49230K5812l01982Q961K59445j90878k9538K37878o4217L2024J15270j15621
17787D26384j98736J23020J5518j18703k96610j22072k1060J70163p9125m1952
17777a43173J90626K06209q2171K3978J92912J57123M4317l66760j4240j32125
17767G6696k60097J68863L29596n4426j97168j68453k586j29638L6744M18134
17757B17665q171j60467q0884K2707o8375R0349J84611J72324J28606l42980k79041
17746a23656o3949L1117n410K35513R3874J24139K12714J738j68766j51302j99863
17735a3851l2213O5585M28990q7718r1014J43246J67233L6492R2094o9549J9119
17724F58414R5728n1893l08202m33960k24767J01859K02945K13216J18562j27514
$$ plain form
17798 449230 475042 173060 182021 441466 250588 221050 458928 394711 426735 542005 426384
17787 426384 227648 350668 366186 247483 -49127 -171199 -192259 -22096 -101221 -143173
17777 -143173 47453 253662 171491 195469 388381 545504 589821 223061 208821 76696
17767 76696 -183401 -14538 315058 260632 63464 -104989 -107575 -237213 -200469 217665
17757 217665 209494 49027 -31857 -9150 -77525 12824 197435 369759 498365 155385 -123656
17746 -123656 -187605 -156488 -161898 73615 167489 291628 504342 506080 337314 186012 -13851
17735 -13851 -46064 19521 448511 360793 269779 413025 580258 616750 708844 639295 658414
17724 658414 754142 702249 394047 -39913 -264680 -162821 40124 253340 371902 244388
17714B44388r0783j83732Q8874m7580L39630j0851q0724k35111n0626M8294p1031
17703d9252k761p5164j18332n9457J50294J29814J93952J29384k05189M2736m4868
17692I1157k19556J28274J16040j22377k06802j52593j73178J40041K97509L43744
17682B42259L6485k60253l87031J1944K44060O0549K2190l9433j02980J69772
17672b438J66992j19032j72068k4981N8746Q106K86202p1005p5194J77960Q1006
17661C14294J0996j02973n3891M0584o7259M2472L63359n68k37838m38070q1575
17650b10469q0186Q8468P3415J46149K14107J35441J54374j32731l72642j52055
17640a36129J32086J06520k2614J45790k1479k48090j67414L2824J29383K74788
$$ plain form
17714 244388 153605 -30127 58747 11167 350797 339946 259222 24111 -26515 21779 -49252
17703 -49252 -52013 -127177 -245509 -304966 -154672 -24858 169094 298478 93289 136025 91157
17692 91157 -128399 -125 115915 -6462 -213264 -365857 -539035 -398994 -101485 242259
17682 242259 278744 18491 -368540 -356596 -112536 -51987 -29797 -69230 -172210 -2438
17672 -2438 164554 45522 -126546 -151527 -92781 -84675 201527 130522 55328 233288 314294
17661 314294 325290 222317 168426 209010 141751 184223 547582 547014 309176 -128894 -210469
17650 -210469 -290655 -202187 -128772 17377 231484 366925 521299 388568 15926 -136129
17640 -136129 -4043 102477 79863 225653 204174 -43916 -211330 -178506 -49123 225665
17630B25665j1792k091j61845O1619O4863k21184k16916j2860P999q4461R0864
17619b60139J22247J45634j26146J43226m5083J7341J35831n08957P2660J92384
17609a11002K18824k0003k89711K9847k4479P8498O1405L18683o8523k96526j35783
17598b38770J96720q3288r5753J56210K90621k86593l80550M166K07191j23710
17588c53756P4665K77863K36329Q2023l04986j31553J88580K51685j2752P1265
17578C79363j48424k83020j59092J61936K5526Q149l5821j55412j11631k20056
17568e38482j84182K3211K78365J70854Q3483q1407j94449N562L24800O416Q8645
17557a7184p3800o3627J77078k16689j32414K51532J82715K34194j07617k71881
$$ plain form
17630 225665 213873 211782 49937 111556 176419 -44765 -261681 -274541 -266542 -351003 -260139
17619 -260139 -137892 7742 -118404 24822 -20261 -2920 132911 -376046 -303386 -111002
17609 -111002 107822 87819 -201892 -172045 -196524 -118026 -56621 262062 193539 -102987 -238770
17598 -238770 -42050 -125338 -221091 -64881 225740 -60853 -441403 -437237 -230046 -353756
17588 -353756 -279091 -1228 235101 317124 12138 -119415 69165 320850 308098 379363
17578 379363 230939 -52081 -211173 -49237 -23711 -15562 -51383 -206795 -318426 -538482
17568 -538482 -722664 -699453 -421088 -250234 -166751 -248158 -442607 -437045 -112245 -105829 -17184
17557 -17184 -90984 -154611 22467 -194222 -326636 -75104 107611 341805 234188 -37693
17547c7693j56128P9012P2457m2191j84096k99982J28213L39283L7747L6695L20347
17536B93664l5972m4576j11205J22127K82732j93108j26592P8399J12028Q822
17526C86319K14338l05814J5330J20620k96812l33365k58643N2973K14155P9603
17516a11296K34444M6989l93246j66897J77074J02548J34096K84960L04153K6535
17506F39360l1602l21090j80931j05186K60331J71901o5084J31965L7955k93233
17496B44386j76716O3315J18673J39450L1555l0267l7661k62798k53178m0577
17486b03818J15903N8188m2325L1124k19416J0517K47771J96019p3064J674j3416
17475A09157m7096k8697J70961j25037k95481j16466j6277J80459Q1833J94172
$$ plain form
17547 -37693 -193821 -114809 -42352 -84543 -268639 -568621 -440408 -101125 -63378 -26683 293664
17536 293664 257692 213116 101911 224038 506770 313662 187070 265469 377497 386319
17526 386319 600657 294843 310173 430793 133981 -199384 -458027 -405054 -190899 -111296
17516 -111296 123148 170137 -223109 -390006 -212932 -110384 23712 308672 612825 639360
17506 639360 607758 286668 105737 551 260882 432783 367699 499664 537619 244386
17496 244386 67670 130985 249658 389108 420663 390396 352735 89937 -163241 -203818
17486 -203818 -87915 -29727 -72052 -40928 -260344 -249827 -2056 193963 120899 122573 109157
17475 109157 62061 33364 204325 79288 -216193 -332659 -348936 -168477 -86644 107528
17465A07528J9817q8116P5249J43591K78511n1706k39817j59216L20248R6113
17455E02202L2147k18574m18416m0789J88374M1741o5126j25578M40879L61402
17445F98262R954L2568j8749M79249P6361J20245j29081j08596K4121n70040l92649
17434B21645R1799J93483P5339m52939k46451o9400n8868k5713J27584k66388
17424d09909N6036K09905j47538M8212K68886K80598l6787j98195j11672p7689
17414a18153J53909J05511l3136Q958o2382L8721M65644r7495j09886J6912q3415
17403B85188j44899J63129k67895k16000k65365l16014P0787K16266K95260K62848
17393H3305k8249q2874J37844j08641L4505L66737q063K4152j42312k31470j35889
$$ plain form
17465 107528 127345 39229 114478 258069 536580 484874 245057 85841 406089 502202
17455 502202 534349 315775 -102641 -143430 44944 86685 21559 -104019 336860 698262
17445 698262 708216 740784 722035 1201284 1277645 1397890 1268809 1160213 1184334 614294 221645
17434 221645 313444 506927 582266 129327 -117124 -186524 -245392 -271105 -143521 -409909
17424 -409909 -353873 -143968 -291506 -243294 25592 306190 269403 71208 -40464 -118153
17414 -118153 35756 141267 108131 117089 54707 93428 559072 461577 351691 368603 285188
17403 285188 140289 303418 35523 -180477 -445842 -761856 -691069 -474803 -179543 83305
17393 83305 55056 -27818 110026 1385 35890 402627 394564 418716 276404 44934 -90955
17382i0955L911O3119L9938J72248m5145j7086L5703j38560O9941k48179l1134
17371a86199r8266P264L19159k24166j9985J77132M39360K06547l22128k66367
17361C2351q7115n7359J0280j54683l58546k78884K44900J03771Q9833O0235J89049
17350b06168J33851K04174K74968Q0620j62631m12196l18724L26387J40863j63824
17340a02680j22452J26767k69215M5152M11446R9889R8051P3777j72139j95081
17330f485j54752j44748j5012l9671J95329R8262J36067Q647j60504j38686J71661
17319d9892L61973J57027k33809p9418j92662N2152K94764l2627k37703J19572
17309A59377l265j26864r021p6011q1657J5203m1416j32050n0318j07756j36649
$$ plain form
17382 -90955 -87044 -23925 16013 188261 143116 126030 161733 23173 93114 -155065 -186199
17371 -186199 -284465 -277201 41958 -182208 -202193 -25061 414299 620846 298718 32351
17361 32351 -54764 -112123 -101843 -256526 -615072 -893956 -649056 -545285 -455452 -395217 -206168
17350 -206168 -72317 131857 406825 487445 324814 -87382 -406106 -79719 61144 -102680
17340 -102680 -225132 -98365 -367580 -322428 89018 188907 286958 360735 188596 -6485
17330 -6485 -161237 -305985 -320997 -360668 -165339 -67077 68990 77637 -82867 -221553 -49892
17319 -49892 312081 469108 235299 155881 -36781 15371 310135 277508 39805 159377
17309 159377 156112 29248 20227 -55784 -137441 -122238 -163654 -295704 -346022 -453778 -590427
17298e90427K3025J92672J90477J66447j46908l282K18785J72761o6722k63108
17288a06280k67663J3987J6271K0220j02242L476J55773R190L68951n3599l74743
17277c16659J1473K10102O6039o7552q503j94893J39681K94137O7185N8770K0503
17266B80283j90481L3601p556k03993q3645K11348L04027J74773j29964k00926
17256A87467j04255J68280l3729q3472k3688p1677K0903L30066j37992k04439
17246D7464j14856k19477j64061j69356J33652Q1416K03926M893l6875J83049
17236e0225m7189k6803q2L14040K81775J16797l08473j29000N5722j3896K53043
17225D45709L7358j74166j12163l97382m0011J81000K03857Q5396K69428k03213
$$ plain form
17298 -590427 -567402 -374730 -184253 -17806 -164714 -167996 50789 223550 156828 -106280
17288 -106280 -373943 -359956 -343685 -323465 -425707 -422231 -266458 -257268 111683 58084 -316659
17277 -316659 -305186 -95084 -29045 -96597 -105100 -299993 -160312 133825 201010 259780 280283
17266 280283 89802 123403 115847 -88146 -171791 39557 343584 518357 388393 187467
17256 187467 83212 251492 217763 134291 110603 38926 59829 389895 251903 47464
17246 47464 -67392 -286869 -450930 -620286 -486634 -405218 -201292 -196399 -233274 -50225
17236 -50225 -97414 -124217 -124299 189741 471516 588313 279840 150840 206562 192666 445709
17225 445709 483067 308901 196738 -200644 -240655 -59655 144202 229598 499026 295813
17215B95813l69625J3541j31450K914J3580J81779k7898k18595J88037O8596p1940
17204e5248k51686J28958J01983n0795j5631K43957Q2255J65603k5391r8987k70708
17193d5690K00509P6811k83877j48145J15267J63602m3793j50183k58804J55413
17183b18890J94705j7055K9115j79099o7365n4211J78084K05353K9549r1638k42431
17172b33883K4768n2375k85750k32296L02803L09023p055J58712m5938k65850
17162c27841N1088K89287j64010O8897J10383j56766J11402J8810o9961j77402
17152b46113j49609O0951J11230O0309J11754K36770M1151n879j96406j86896
17142a62738J49992j47424j89957Q2134K74361M9019k71432j74909K67572O3804
$$ plain form
17215 295813 -73812 -60271 -191721 -188807 -175227 6552 -21346 -239941 -51904 16692 -55248
17204 -55248 -306934 -177976 -75993 -126788 -142419 101538 183793 349396 324005 225018 -45690
17193 -45690 154819 231630 -52247 -200392 -85125 78477 34684 -115499 -374303 -218890
17183 -218890 -24185 -41240 -12125 -191224 -258589 -312800 -134716 70637 100186 8548 -233883
17172 -233883 -209115 -261490 -547240 -779536 -476733 -167710 -174765 -16053 -61991 -327841
17162 -327841 -276753 12534 -151476 -82579 27804 -128962 -17560 1250 -68711 -246113
17152 -246113 -395722 -334771 -223541 -163232 -51478 185292 226443 220564 24158 -162738
17142 -162738 -12746 -160170 -350127 -267993 6368 55387 -216045 -390954 -123382 -59578
17132e9578j10089Q1530M13260l9650j05870p9346K02747J64095k56380l36040
17122a25321J85396p9356q6146J24069Q4996j45385o8385J64284j41768L0436
17112e7180O8165p468L42741j62633k86945J7450J12712J10023j32133j58239
17102a53507M6138K7533K6106o7942R0088K28664J45974k5192k77937k1763Q6325
17091A04487o9533J43823k5644l0559L55589Q7921l40774k12756o2123M390l04404
17080c49583m5933L27920M93952K82800m1350j0130J89541q3368k45203j51828
17070C66818k02099N9180J96460J4519K9405r5719r1896l4783j28122M0309p5214
17059G8858j95653m17490l14097l74291M62729N73533J55917o1585R4735M1487
$$ plain form
17132 -59578 -169667 -88137 325123 285473 179603 100257 303004 467099 210719 -125321
17122 -125321 60075 -19281 -105427 18642 103638 -41747 -110132 54152 -87616 -57180
17112 -57180 10985 3517 346258 183625 -103320 -85870 26842 136865 4732 -153507
17102 -153507 -107369 -79836 -53730 -121672 -31584 197080 343054 317862 39925 18162 104487
17091 104487 34954 178777 153133 122574 478163 566084 225310 12554 -49569 -45179 -349583
17080 -349583 -395516 -67596 426356 709156 667806 657676 847217 763849 518646 366818
17070 366818 164719 223899 420359 434878 464283 368564 276668 241885 113763 154072 78858
17059 78858 -116795 -534285 -848382 -1222673 -759944 -186411 -30494 -92079 2656 44143
17049D4143j4660J62256O9582n4919J54969o3895k37380J31525j55133J90897
17039B27385L9939j01256K4841P2905J47389m5046k01844K3792o0826l36554k00385
17028d09660J96866M6366M8036k2422R8435L22569L6995K18805J55580m53068
17018B38502n34239p1353J24629K14715o371J871k59788k11996L6618L13527K01377
17007D7492k18065q7400L25240N67996M4500l19921k04854j66428N4323j58351
16997a15468j79070q3716J62472M9263K40133j09997k001M39114J12694j09344
16987D04080j49602K4911o0195l11384j6515N7373k87674j24732r2608J39056
16977d17290N43901k1231o4991J14836L1509O3553l6623J239k74553n09939P8633
$$ plain form
17049 44143 29483 191739 261321 206402 361371 297476 60096 191621 36488 227385
17039 227385 267324 166068 190909 263814 411203 366157 164313 188105 127279 -209275 -409660
17028 -409660 -212794 -166428 -118392 -140814 -42379 280190 317185 535990 691570 238502
17018 238502 -295737 -367090 -242461 -27746 -34117 -32246 -292034 -504030 -467412 -153885 47492
17007 47492 -170573 -257973 67267 635263 679763 359842 154988 -11440 42883 -115468
16997 -115468 -294538 -378254 -215782 -166519 73614 -36383 -38384 400730 513424 404080
16987 404080 254478 279389 219194 -92190 -108705 -51332 -339006 -463738 -556346 -417290
16977 -417290 126611 105380 40389 155225 186734 250287 213664 214903 -59650 -569589 -490956
16966d90956L86305J57855L06444m0246L6572k50856l09124k3064N7272p827J22333
16955e5292m2954K5346R62J09799J4950l93772M4651K51755J22666k170k1155
16944E4786l5164Q0506q5743l99054l2532J50756p8038J0504J54444m557j00973
16933b85065j37585K51444R1030Q7271p417K60309L8584j09885j63668K8977J8323
16922G2318k29650J02800j47008j748J49907K9434L8866j1366N5820j16159k02874
16911b59660j44856J68189O6028j62286K14158J57649k6418O4540J63255K80474
16901E21073M0950l35020q8J71969J23043k71654q7495N6344p185o4556O3546
16890B10927m4183J07197j03165M3224L55921j11744j50884j04749p278J01124
$$ plain form
16966 -490956 -104651 53204 359648 319402 355974 105118 -204006 -227070 -169798 -177625 -55292
16955 -55292 -98246 -72900 -71938 37861 52811 -340961 -296310 -44555 78111 75941 54786
16944 54786 19622 100128 14385 -384669 -417201 -266445 -344483 -333979 -179535 -184092 -285065
16933 -285065 -422650 -171206 -80176 7095 -322 259987 298571 188686 25018 53995 72318
16922 72318 -157332 -54532 -201540 -203288 -53381 -23947 14919 3553 59373 -56786 -259660
16911 -259660 -404516 -236327 -170299 -332585 -118427 39222 12804 77344 240599 521073
16901 521073 562023 227003 226915 398884 521927 250273 162778 219122 211937 147381 210927
16890 210927 166744 273941 170776 214000 569921 458177 307293 202544 195266 296390
16880B96390l84934l59589P2168K99993j08710k27660M19689K89714p2717k70204
16870d5860k4186J74902j51226l5326n7948k05203k21510k5944O606j60188o261
16859g52144M35274j42494m32J75368J76399Q753K7944k04350q22K49750k5407
16848e2161j01952J42614R0959j36550l15526j01469K35293L3298o0162M57667
16838A92011N5070j29460M8424M5660j22035o3409O8604o4420L9917J37807N88
16827B08757k09958j07350k36269P6388J66986J452q6452k11313K43768R6672
16817e7319p5643K41307K85191o6037j40156k11522q3460j107N0975J5334m6207
16806h8644K88476o0823j80924l80980n8499Q6632M12479J63239R279l4810k16021
$$ plain form
16880 296390 -88544 -448133 -375965 -75972 -184682 -412342 7347 297061 224344 -45860
16870 -45860 -70046 104856 -46370 -81696 -139644 -344847 -566357 -592301 -585695 -745883 -752144
16859 -752144 -316870 -459364 -459796 -284428 -108029 -99276 -71332 -275682 -276504 -26754 -52161
16848 -52161 -154113 -11499 79460 -57090 -372616 -474085 -238792 -205494 -265656 192011
16838 192011 247081 117621 166045 211705 89670 26261 94865 30445 70362 208169 208757
16827 208757 -1201 -108551 -344820 -268432 -101446 -99994 -186446 -397759 -153991 -57319
16817 -57319 -132962 108345 393536 327499 187343 -24179 -107639 -108746 -57771 -42437 -88644
16806 -88644 199832 139009 -41915 -422895 -481394 -394762 17717 180956 190235 155425 -60596
16795f0596l22836J8190L24699L76225k28057k76873j62001O8647K52948r8546
16785a08200l8439r548k9913L145J72684J18227j59439j11000J17886J07189J00188
16774A62780j92150r363q7723Q5014O6626k06950j85754J02579N1894n0580k9377
16763b93004J80319J02046o4289J37291j2982k03276m6954p2299R6485p6089j32862
16752c85614K10953J88436P8086p418r8631q5831K06396J57854j67746k18979
16742a22494P151K80485J72481o0114L85853L1536k62904J25189j20203k46200
16732A90780P7320l6644M3607j39348n8175j34034L5683R0234m7595j85842N0218
16721a13796m8902l7427L09411J164o6079J24663L3151O953M2628q5801n5940
$$ plain form
16795 -60596 -383432 -365242 -40543 335682 107625 -169248 -331249 -262602 -9654 -108200
16785 -108200 -146639 -156187 -186100 -182955 -10271 107956 -51483 -162483 -44597 62592 162780
16774 162780 -29370 -38733 -126456 -41442 25184 -181766 -367520 -264941 -213047 -263627 -293004
16763 -293004 -112685 -10639 -74928 62363 49381 -153895 -200849 -273148 -176663 -252752 -385614
16752 -385614 -174661 13775 91861 84443 -14188 -100019 106377 264231 96485 -122494
16742 -122494 -115343 165142 337623 277509 663362 694898 431994 557183 436980 190780
16732 190780 268100 231456 275063 135715 77540 -56494 -20811 69423 21828 -164014 -113796
16721 -113796 -162698 -200125 109286 110450 44371 169034 202185 209138 251766 165965 110025
16710A10025J36945k10533j96197J48630j06470J2040k392Q1966K97207J339j07228
16699A65332p6801J18648J94061l4435k64436p9480J00489k20756p5789K91057
16689A17890L11386j79563r7553j9034P3201J16434O1865k2072o9306j33055j77314
16678a7121k39174K09454J10330r3977O1645k903L7070K83711R1281J33010k51150
16667C22176j76973k61570o3577J52630J56462P2852k9099N4322J37446N70J83986
16656E49225p7407k25915j04598J51958l5903N1512q5163j57918N8398j34792
16646a0603K44981J29796L3818l42919j78478j04979J76473R2896k25832m7677
16636b32524L5685K33077L08247j32023m54378L8258Q9246J04603k23963l534
$$ plain form
16710 110025 246970 36437 -159760 -11130 -117600 -105560 -107952 -25986 271221 272560 165332
16699 165332 88531 207179 401240 366805 102369 22889 123378 -97378 -173167 117890
16689 117890 429276 249713 152160 133126 206327 322761 384626 362554 293248 160193 -17121
16678 -17121 -256295 -46841 63489 -30488 31157 28254 65324 349035 440316 573326 322176
16667 322176 145203 -116367 -179944 -27314 129148 202000 172901 227223 364669 365239 549225
16656 549225 471818 245903 141305 293263 257360 308872 223709 65791 124189 -10603
16646 -10603 234378 364174 397992 55073 -123405 -228384 -51911 40985 -184847 -232524
16636 -232524 -196839 36238 344485 212462 -241916 -203658 -114412 -9809 -233772 -237306
16626b37306J47521l1617m811J66756o2882j48499j26034k0091O1387l9202j08470
16615d03248K20579K26191J1676j44585j34407j15888J75749J92477j17365R7082
16605H261o1370k24968K567Q0173J2088O4822j93606O4982r909L0428J13125L15505
16593B02098J53991j973m9742k40911j41827n4817J22898J19933k54324J58689
16583A4015N2932j36825K5659O379j1079o6363n8554j16350J77221K86904K30438
16572D04377P0317k63353o2195L0204K50606j58283k50005j33610p5000k2202
16562b09144J93153J46995J8671k62822k98136J49441K79149q874k11289k02222
16552d05078J03936L57404M6844O4468J04821j07959j73249j15829m5975J57260
$$ plain form
16626 -237306 -89785 -121402 -126213 40543 -22339 -170838 -296872 -316963 -255576 -294778 -403248
16615 -403248 -182669 43522 55198 -89387 -223794 -339682 -163933 28544 -88821 8261
16605 8261 -53109 -278077 -275510 -195337 -183249 -118427 -312033 -247051 -256960 -226532 -113407 202098
16593 202098 356089 354116 304374 63463 -78364 -133181 -10283 109650 -144674 14015
16583 14015 66947 -69878 -44219 -37840 -48919 -115282 -173836 -290186 -112965 173939 404377
16572 404377 474694 211341 149146 179350 429956 271673 21668 -111942 -186942 -209144
16562 -209144 -15991 131004 149675 -113147 -411283 -261842 17307 8433 -202856 -405078
16552 -405078 -301142 56262 103106 167574 272395 164436 -8813 -124642 -170617 -13357
16542a3357j97226p8966J36273m0781O4257J56684o7027l0061J18388k04673k42641
16531c99130k8559j5485K7474J90042R80J10832K60857k46806k32230J28336L83023
16520A79334K20102j18561l31793m55112k260J15613J32388J9275K32045j2396
16510b1365k889j40968j51384l31488q8894J30978J26621N15518K31199o6995
16500B00333p0834k29484j60976J28402j80336k9290L44698Q4995j21684R4875
16490F0699J97379N0639M9759k12356j7303J7071j18412J13491j25559J15049
16480A30457J8524K1045M1359Q8311k32716p5893n9592L7147J1335n0263l9360
16469a09646L9312L9453J53108J57236K9266j28878j52228O0958n417O96n7809
$$ plain form
16542 -13357 -210583 -289549 -153276 -194057 -129800 26884 -40143 -70204 48184 -156489 -399130
16531 -399130 -427689 -443174 -415700 -225658 -224678 -113846 147011 -99795 -332025 -203689 179334
16520 179334 399436 280875 -50918 -506030 -508290 -392677 -260289 -241014 -8969 -21365
16510 -21365 -24254 -165222 -316606 -648094 -736988 -606010 -479389 36129 267328 200333
16500 200333 129499 -99985 -260961 -132559 -312895 -342185 2513 87508 -34176 60699
16490 60699 258078 308717 358476 146120 128817 145888 27476 140967 15408 130457
16480 130457 148981 170026 211385 299696 66980 -8913 -68505 -31358 -20023 -70286 -109646
16469 -109646 -70334 -30881 122227 279463 308729 179851 27623 88581 83164 83860 26051
16458B6051m5255m1825J14717R671k69341n1050n2955J38659J91844O0359j44378
16447f3503J0625j08189J31229J14332K33285P9961Q7718J00178k20920j52033
16437B12683p8702j63257O7604j1612k12881J26873K0721K17566j37321j01285
16427e9611J23249J02057k04781l6933J70624n6926j7482o9389O5177P6312J6820
16416A09117J2776l5430J4954j6274k11669L0143M5222o0256r7550j13307J99589
16405a22685J28331k40506k35599P6463K9270J54571R6944K40652n2663j2273
16395F2505K01760j02184p0974j00961j87637Q099J26053L76325K1794j65889
16385A68891k11442j47397o5n8941J49458N4937l9157R5568K13619J67932k38965
$$ plain form
16458 26051 -19204 -61029 53688 63359 -205982 -257032 -309987 -171328 20516 80875 -63503
16447 -63503 -52878 -161067 -29838 84494 317779 397740 485458 585636 364716 212683
16437 212683 133981 -29276 38328 26716 -186165 -59292 -38571 178995 41674 -59611
16427 -59611 63638 165695 -39086 -76019 94605 37679 20197 -49192 15985 92297 109117
16416 109117 121893 86463 101417 85143 -126526 -96383 -51161 -111417 -208967 -322274 -122685
16405 -122685 5646 -234860 -470459 -393996 -364726 -210155 -113211 127441 74778 62505
16395 62505 264265 162081 91107 -9854 -197491 -189392 -63339 312986 334780 168891
16385 168891 -42551 -189948 -190013 -248954 -99496 -44559 -83716 11852 225471 393403 154438
16374A54438n51882k21800j3879K32012L82307O8588r1780j89317j37787j43719
16364e12819n316L53275K74479K04509j36905j8329r8183k87682L5914J45177
16354d5880K95631K0279j07227J1910K46639Q3766l3300k54711j52120J42445
16344B07432m2288j82596J32446M7375q756o7039L4131j05530p6391l52528j12931
16333e26675L78760L1768m0176k15148j11734K82783M69673j97885k47472N1625
16323a24481K76239j91747l03983R5764J57979K43105Q3326k55742K73468J41615
16313C95543p2969L8489o3152k265J02874m5496l06705k1561o5292q5638m266
16302a30438j13533Q1263K15396P7405k33222P1515K01876j29196o7036J44249
$$ plain form
16374 154438 -397444 -619244 -633123 -401111 -18804 49784 -41996 -231313 -369100 -512819
16364 -512819 -518135 -164860 109619 314128 177223 158894 60711 -226971 -191057 -45880
16354 -45880 249751 270030 162803 174713 421352 505118 471818 217107 64987 207432
16344 207432 165144 -17452 114994 162369 153613 86574 120705 15175 -61216 -413744 -526675
16333 -526675 -147915 -116147 -156323 -371471 -483205 -200422 269251 71366 -176106 -124481
16323 -124481 151758 -39989 -343972 -248208 -90229 152876 236202 -19540 253928 395543
16313 395543 322574 361063 297911 295646 398520 353024 46319 24758 -40534 -126172 -130438
16302 -130438 -243971 -162708 52688 130093 -103129 -31614 170262 41066 -25970 118279
16292A18279j40945k685J19419L4900O2465o1432k9332O3224j10955k11499l54621
16281e13182j36822J39223L49623J26730m4044k86287k23284O8363J86332K90234
16271d3114K32093P2840m4910J3780P5942L6370j04228K99653l24665m09115M3265
16260a52089j34674R5232J48595K45669J97506j50542m0364m74796k87975L18406
16250b35032J41837K20906k62190n0630r2566j19599j18465J67264L69789J24964
16240A46278q9145j06992P5057j33477k7344J27859J08178p8567r5722m4141M5116
16229g2900N4331J78749l7092N2046j71937p219M2651k07328j38912M7255n0341
16218c10697P4637J81094l8090k32669o0497R5351j75450R5282J40155J18423
$$ plain form
16292 118279 -22666 -25351 94068 128968 191433 130001 100669 163893 52938 -158561 -513182
16281 -513182 -650004 -510781 -161158 -34428 -78472 -364759 -588043 -519680 -333348 -43114
16271 -43114 188979 261819 216909 230689 306631 343001 238773 538426 213761 -195354 -152089
16260 -152089 -286763 -191531 -42936 202733 400239 249697 209333 -265463 -553438 -235032
16250 -235032 -93195 127711 -134479 -185109 -277675 -397274 -515739 -348475 21314 146278
16240 146278 57133 -49859 25198 -108279 -135623 -7764 100414 21847 -73875 -118016 -72900
16229 -72900 -18569 160180 123088 175134 3197 -4022 38629 -168699 -307611 -260356 -310697
16218 -310697 -236060 -54966 -93056 -325725 -386222 -290871 -466321 -371039 -230884 -112461
16208a12461N2419j77071j14514o6224J4627k36980L59729L51298j17666J20007
16198G3164J27890l43696j18407K32207r6684j82956J27995k21152J11834j08651
16188c98456r5811K5608J81415K66001J10381j22259o1521m4908j39516m4081
16178c23147k7637J53515J13718j7167M1750k857l8389n6904L1841J87625M8495
16167A10843j04617k38951j22585R4870L07993Q2361j96119k4084J2255l1495
16157a09529j7425J2739Q0420K344J82148K84831Q8759n0794j48590k92413j63232
16146a30742m8465L39120J32034M2951J289k12478j50322j9690r8458l17240K87735
16135a74266J25138J66086K5517j47888K13588J14996j69996m1073l5355N6290
$$ plain form
16208 -112461 -60042 -237113 -351627 -417851 -403224 -640204 -280475 70823 -46843 73164
16198 73164 201054 -142642 -261049 -28842 -125526 -308482 -180487 -401639 -289805 -398456
16188 -398456 -494267 -468659 -287244 -21243 89138 -33121 -94642 -139550 -279066 -323147
16178 -323147 -350784 -197269 -83551 -100718 -58968 -61825 -100214 -157118 -125277 62348 110843
16167 110843 6226 -232725 -355310 -260440 47553 129914 -66205 -90289 -78034 -109529
16157 -109529 -126954 -114215 -33795 -31451 150697 435528 524287 473493 324903 32490 -130742
16146 -130742 -179207 159913 291947 334898 336187 123709 -26613 -46303 -144761 -462001 -174266
16135 -174266 -49128 116958 142475 -5413 208175 323171 153175 112102 76747 133037
16125A33037J47833o8261j64479k76607l9639J3515L58438L46237r5012J49002
16115E04064j86598m52393j18855J3199j06459j43983J92417j62253j26182L14062
16105b72981L10488J02500M4789m3475O1098j18760j48813r322N1514j67019l6670
16094b26651J90857k49910j37084K40109J07615q2453J66625O5081j21395r9704
16084a46910N6426p2445K00408K96104R3809p3737n09757j99332n139J28444m6267
16073b78396R6918L1968l24235J4345Q5972j85283J44555K90525L7310j98114
16063b84435J2468K50310Q2864n6577j28370k38074m0079J04901J33136K00673
16053C6817Q5666J20952J59614j98590Q5555n000k29567K8526M31255M4443m14538
$$ plain form
16125 133037 280870 212609 48130 -228477 -268116 -254601 103837 450074 355062 504064
16115 504064 317466 -134927 -253782 -240583 -347042 -491025 -298608 -460861 -587043 -272981
16105 -272981 37507 140007 184796 141321 202419 83659 -65154 -74476 -22962 -189981 -226651
16094 -226651 -35794 -285704 -422788 -182679 -75064 -157517 9108 74189 -47206 -146910
16084 -146910 -90484 -162929 37479 333583 427392 353655 -156102 -355434 -360573 -232129 -278396
16073 -278396 -181478 -149510 -473745 -459400 -373428 -558711 -414156 -123631 -86321 -284435
16063 -284435 -271967 -21657 61207 4630 -123740 -361814 -401893 -296992 -163856 36817
16053 36817 122483 243435 403049 204459 290014 285014 55447 83973 515228 559671 145133
16042A45133j65235J08233j87569J6153N3960j1332R5394N2078J64321k6035K18534
16031D63635l7731J13798J94506k57290k58947r8978q2940q1942K45533j5993
16021A83651k50928J573K74286J41147j8155j85270k2323j4864l40056k70868
16011e01807j11449M5272K50999J90125J46303J83575L9936j52145P8586l32718
16001a63323J21243J56423k94462k06057k5940M52189r7169m38326k9708J73540
15991c51590L01160m8740k3455O4303m8073K4218J26977L2584k67378p1965k0384
15980b82343J04759J09895J06762j8308L89140N7884q4057k32670Q4353M8697
15970B84112j13327j76083L7180q5046l6672J5106K71483M5243j26557k8169Q38
$$ plain form
16042 145133 -20102 88131 -99438 -83285 -29325 -40657 54737 106815 271136 245101 463635
16031 463635 425904 539702 734208 476918 217971 118993 36053 -45889 199644 183651
16021 183651 -67277 -65704 208582 349729 331574 146304 123981 109117 -230939 -501807
16011 -501807 -613256 -567984 -316985 -126860 19443 203018 242954 90809 169395 -163323
16001 -163323 -42080 114343 -180119 -386176 -412116 40073 -57096 -495422 -525130 -351590
15991 -351590 -50430 -99170 -122625 -58322 -106395 -82177 44800 77384 -189994 -261959 -282343
15980 -282343 -177584 -67689 39073 20765 409905 467789 383732 151062 235415 284112
15970 284112 170785 -5298 31882 -53164 -89836 -74730 196753 241996 115439 87270 88108
15959H8108J25925o9n6934n4920l17220p8241J70833K11897m8650J01091j80440
15948c8620j30746J72352J69863M2340j67521j88816k70801j18540j9476L7788
15938e12177J60340M6946m6201p448J43124K3298j07667j57419k6382M35252L78719
15927C30385l55175l13059K80613Q2441K094K09347J5390n0628j22756j9405l6521
15916B2726j60795j2193o8812J93227J96552j58731j6126k7527O0859j71900N2889
15905h9831n7725k22633M8976K75479m1961K0962K33649J52075k30577j79026
15895i0612J74273L9537q2436j94398j25959k20806L48397J84681J03915j22478
15885A4114j8116P5543k50285j03960J31776r3712K64371Q5486j95627j00641
$$ plain form
15959 88108 214033 213964 157030 102110 -215110 -293351 -122518 89379 40729 141820 -38620
15948 -38620 -169366 2986 172849 215189 47668 -141148 -411949 -530489 -549965 -512177
15938 -512177 -351837 -304891 -351092 -358540 -215416 -192118 -299785 -457204 -483586 -48334 330385
15927 330385 -24790 -337849 -57236 25205 27299 236646 252036 201408 78652 59247 22726
15916 22726 -138069 -150262 -219074 -25847 170705 11974 -4152 -31679 29180 -142720 -89831
15905 -89831 -147556 -370189 -321213 -45734 -87695 -66733 166916 318991 88414 -90612
15895 -90612 83661 123198 40762 -153636 -279595 -500401 -152004 32677 136592 14114
15885 14114 -4002 71541 -178744 -282704 -150928 -244640 19731 105217 -90410 -191051
15875a91051k28343j2291K35097K99412J6481p2446N8415q2680J78296J86508
15865C87398l28764k04258K88645R1550l45777l29124k2228K11758L67181k09991
15855i3610J92536K50122J6524M4163q6069k06671k3909l4050j64356j15227j87870
15844d08417m7328K05473L9843j7771J5266K80580J48052J35982Q6969j51881
15834B86768l30797o1815o5227J23113J31637J25145M4676k01785j61317P127
15824a02475J23368k27539K86550L92552j82752j29772l797J2j22976j1044r86
15813B1141j26362O3572K3121k39553j90648Q7964J88515L3861K54752Q5086j29195
15802G2254q35k08982n0391J73567M2553J59148J68625J00908J19017j88329l56496
$$ plain form
15875 -191051 -419394 -431685 -196588 102824 119305 46859 105274 22594 200890 387398
15865 387398 58634 -145624 143021 234571 -111206 -440330 -462558 -250800 116381 -93610
15855 -93610 98926 349048 365572 409735 323666 116995 93086 59036 -105320 -220547 -408417
15844 -408417 -455745 -250272 -210429 -228200 -212934 67646 215698 351680 438649 286768
15834 286768 -44029 -105844 -171071 -47958 83679 208824 253500 51715 -109602 -102475
15824 -102475 20893 -206646 79904 472456 289704 159932 156135 156147 33171 22127 21141
15813 21141 -105221 -41649 -18528 -258081 -448729 -360765 -172250 -138389 116363 201449 72254
15802 72254 71419 -137563 -187954 -14387 28166 187314 355939 456847 575864 387535 31039
15791C1039Q9058K87450r3407j84483j72195J33947K39132k257l7234n3115N9824
15780B97759p1492J04639k2984p2786j33696m43593r6312J26840P0987L45232
15770A04594M3380l46340m2823J2236K90595K03800R9531J5487j06954L1003K31304
15759E35813J80747q8518l59660k76131K19430j32654j35526q378o9580K42573
15749A08116K57420p718j11012N2121j93767l9274m4800j1561j23150p6865J52835
15738c7655l6966p7162K46028J69904k99752j42434n2200J45410K33615L8368
15728A87156k77852N4318j7363r6226J32092o3059J96400J46371j55314K387L9438
15717A48348l60480k58925K0204m364L1690K14487P0444K74802L9563j80867M4446
$$ plain form
15791 31039 120097 407547 314140 129657 -42538 91409 330541 328284 291050 237935 297759
15780 297759 226267 330906 307922 235136 101440 -342153 -438465 -311625 -240638 104594
15770 104594 147974 -198366 -241189 -228953 61642 265442 364973 380460 273506 304509 535813
15759 535813 716560 628042 268382 -7749 211681 79027 -56499 -64877 -134457 108116
15749 108116 365536 357818 246806 298927 105160 65886 21086 9525 -113625 -190490 -37655
15738 -37655 -74621 -151783 94245 264149 -35603 -178037 -230237 -84827 148788 187156
15728 187156 -90696 -36378 -53741 -149967 -17875 -80934 115466 261837 106523 108910 148348
15717 148348 -212132 -471057 -450853 -455217 -423527 -209040 -138596 136206 175769 -5098 39348
15706C9348J0767M0206k5378o3364o6219j51083K23816N8564P4262K87185l19762
15695A08342n0858R3295j8768q1521l24580m4571j17579k7182K44255r6880j46116
15684d62163l1973J09995L35697j99046L2628J57525J13018M7277m03012k63824
15674e63878J00137M9332J46713J2867J12031m599J76403k9733J93512j79823
15664A2962n3868J88701j65610k51410j34749K73785m3131p3540k68883J59592
15654c56151K45788L19567k31852P400k43548Q2453L7384q5031j76307n2959K46591
15643b06665K07797J52109k14624N6178J09161K99165j25485L2316j9267m20091
15633a29406j43241J67390J95635L0814j72619k23142m9851r0841K04731J61764
$$ plain form
15706 39348 50115 90321 64943 1579 -64640 -215723 8093 66657 140919 428104 108342
15695 108342 57484 150779 132011 50490 -274090 -318661 -436240 -463422 -219167 -316047 -462163
15684 -462163 -494136 -384141 -48444 -247490 -214862 -57337 55681 102958 -300054 -563878
15674 -563878 -463741 -414409 -267696 -254829 -142798 -147397 29006 -727 192785 12962
15664 12962 -40906 147795 -17815 -269225 -403974 -130189 -173320 -246860 -515743 -356151
15654 -356151 -110363 209204 -22648 -15248 -258796 -176343 -138959 -223990 -400297 -453256 -206665
15643 -206665 1132 153241 -61383 -5205 103956 403121 277636 309952 290685 -129406
15633 -129406 -272647 -105257 90378 121192 -51427 -274569 -324420 -415261 -210530 -48766
15623d8766J16267J63019J47552J08606j97101n3662Q8591J35124p092j12280
15613C40258j65177q9349R1423N024j85111n5484q6951J31584J14645j55340j90389
15602b44867J08497M5048p0239k44532J5292L86462K06501K13171j84801j38378
15592I2154p337l10113j16665L69268J78772j94320N5760J50050K74558L8022
15582E30149n1435m87947j24776J37601j26235J55990P6196m1374J6422n0373
15572C4218j4554k23302j21114J30372o5256k20839M7383L79290M4711q0225J78712
15561H9396J32157j00424l76753j05120K17933J18258O5212J37060k046r445q5869
15550H0359l4959q4866k74009j3713J79246k8909m4671M7505L1143K56826Q3185
$$ plain form
15623 -48766 67501 230520 378072 486678 289577 235915 324506 459630 452538 340258
15613 340258 175081 85732 177155 182179 -2932 -58416 -145367 -13783 100862 -54478 -244867
15602 -244867 -136370 -91322 -161561 -406093 -390801 -4339 202162 415333 230532 92154
15592 92154 84817 -225296 -341961 27307 206079 11759 67519 217569 492127 530149
15582 530149 478714 -9233 -134009 3592 -122643 33347 109543 68169 84591 34218
15572 34218 19664 -203638 -324752 -194380 -259636 -480475 -433092 -53802 -9091 -89316 89396
15561 89396 221553 121129 -255624 -360744 -142811 -24553 40659 177719 175673 166228 80359
15550 80359 45400 -39466 -313475 -327188 -147942 -176851 -221522 -174017 -142874 113952 197137
15539A97137j59845P029l1410J91484p9812L8403k78236j00964J03290j6070l52182
15528d81176O0810J8073K52269n0644O4895L64323J33656j6353Q278j17739n1481
15517A84911Q7926k97183l44389j3246K61224K3454K563r4659J71939q6789k69521
15506c73770Q0079K88030J1585q9422l23500o0153K58758L7524J92637K08773
15496B30541K13325j41818m16061l9892J50066J63497K08789j00475k04800j43053
15486g9881Q3001p7311K1084l61o88l9644j12371R5802L0541n5586P2086j69740
15474b33068o840K62288J51557j99237k26275P4024L02217j4621J5893J41905
15464B67843r5822j71093k04478j05017M259J28172K34745K65324r4227m61105
$$ plain form
15539 197137 37292 44321 12911 204395 124583 162986 -115250 -216214 -112924 -128994 -481176
15528 -481176 -420366 -402293 -150024 -200668 -135773 228550 362206 345853 354131 236392 184911
15517 184911 272837 -24346 -368735 -381981 -120757 -97303 -94740 -189399 -17460 -104249 -373770
15506 -373770 -293691 -5661 5924 -83498 -406998 -467151 -208393 -170869 21768 230541
15496 230541 443866 302048 -114013 -153905 -3839 159658 368447 267972 63172 -79881
15486 -79881 3120 -74191 -53107 -53468 -54156 -93800 -206171 -110369 -79828 -135414 -63328 -233068
15474 -233068 -239908 22380 173937 -25300 -251575 -177551 124666 110045 125938 267843
15464 267843 172021 928 -203550 -308567 -304308 -176136 58609 323933 229706 -231399
15454b31399k46158K736J10670K06325K03990K64138J7651k62319j14722K85508
15444B36420R7161j04384k06008k6179J53807k50560k09273J33649L11536r1295
15434D4874k46450N5389Q2744k49044l00761J99212J46665k35147L3901L40913
15424a27704R0192k46497k04361j0788K27912R9096K2690o1996J37668N3233J76994
15413A56439K2875l41131j62002n5347k2175Q4161J63547o2548k280J01368K4230
15402i2863j90095Q3548J5956p4347Q1665J60688J8227K54331j6202p6214K22686
15391C87380n8726l16962k1640j27229n0578Q9807j18864j01244J7804K66548
15381c3704K59641J07663m10186j25194J49216o0696M520k5914K52999j59135
$$ plain form
15454 -231399 -477557 -474821 -364151 -157826 46164 310302 327953 65634 -49088 236420
15444 236420 333581 229197 23189 -2990 150817 -99743 -309016 -175367 136169 44874
15434 44874 -201576 -146187 -63443 -312487 -613248 -414036 -267371 -502518 -468617 -127704
15424 -127704 -37512 -284009 -488370 -499158 -271246 -172150 -149460 -211456 -73788 -20555 156439
15413 156439 179314 -161817 -323819 -379166 -401341 -317180 -153633 -216181 -218461 -117093 -92863
15402 -92863 -282958 -199410 -183454 -257801 -176136 -15448 2779 257110 240908 164694 387380
15391 387380 328654 11692 -9948 -137177 -187755 -97948 -216812 -318056 -300252 -33704
15381 -33704 225937 333600 -76586 -201780 -52564 -113260 -108740 -134654 118345 -40790
15371d0790o3997j6171Q3316J73167J21916j52803r1538j1711r176q8534j16316
15360b12637Q6409R9684J5967k81832k92854n4586O5831K57389J52457k69104
15350d33276j16951K486k0845K28395L86149N5358j8541J74533n4728L0738L2568
15339B65886k70368P4642R6464M9399k24282k67071R6679O5142k10588K84546
15329c9551J39014j43651L17720K97103J88048l6102L800k18717L2947j09390
15319D31221k44367k21869j92255l57645l32416K65217L64935Q354K77225J16435
15309A14835j83069J5317K09660Q4553j10921k8965l0127k60871N4394r3097J7830
15298b10461O1386R7975K25434J20683r0990j55565m6923p8896r2659J84784M879
$$ plain form
15371 -40790 -104787 -120958 -37642 135525 257441 104638 13100 1389 -7787 -96321 -212637
15360 -212637 -126228 -26544 -10577 -292409 -585263 -639849 -574018 -316629 -164172 -433276
15350 -433276 -550227 -547741 -568586 -340191 45958 101316 82775 257308 202580 233318 265886
15339 265886 -4482 70160 166624 216023 -8259 -275330 -178651 -113509 -324097 -39551
15329 -39551 99463 -44188 273532 570635 758683 722581 726381 507664 540611 431221
15319 431221 186854 -35015 -227270 -584915 -917331 -652114 -287179 -278825 -1600 114835
15309 114835 -68234 -52917 156743 241296 130375 101410 71283 -189588 -135194 -228291 -210461
15298 -210461 -149075 -51100 174334 295017 204027 48462 1539 -77357 -170016 14768 19647
15287A9647k20926Q2498L02085j37656j85812K3784M79352K00330j12369j61344
15277B89589l08710P4559L20001m6209j92827l47046m7716J03068j75789j10518
15267d41598k8404R4262J5328j15480P5344P2246J77997l3392J11772R6169J55473
15256A79717k28416j89450N949J74940q8218R5213L41786n0776j66411l7664k4550
15245A2120r7786L1539M4650L68445J3240k8619J19129k34924l70601J61317K36629
15234B55139Q1656j68983J8557j55452r0450J60922K835k06870j25684M44L26146
15223I8260L28094K2666l16840k77273J1295j09596P3611O3639o6821k0186j09780
15212c02931J14218K1538o9739j90365L5457P6457J62200J20137j65696R9874
$$ plain form
15287 19647 -201279 -118781 183304 45648 -140164 -116380 362972 563302 450933 289589
15277 289589 -19121 55438 375439 329230 136403 -210643 -258359 -155291 -331080 -441598
15267 -441598 -470002 -375740 -360412 -475892 -400548 -328302 -150305 -183697 -71925 24244 179717
15256 179717 -48699 -238149 -232200 -57260 -145478 -50265 291521 240745 74334 36670 12120
15245 12120 -85666 -54127 -9477 358968 372208 343589 462718 227794 -142807 18510 255139
15234 255139 336795 167812 186369 30917 -59533 101389 104224 -102646 -228330 -227886 98260
15223 98260 426354 449020 132180 -145093 -133798 -243394 -169783 -106144 -172965 -193151 -302931
15212 -302931 -188713 -167175 -236914 -427279 -391822 -315365 -153165 -33028 -198724 -98850
15202i8850j77481j2114O9098J56579j2993j17344J0526M48911J84983m22352
15192B8963l7336k0080j90294M5765L55051J59325k09027j49758j30996R4933
15182e3454M0174M2956K0232m2602J34653M7581j44776K88242J22169k62241m12520
15171b19586K54868J3746j78689j6494j9187L5673p8895K61180O6349K0034M0367
15160A79366k5148j4625j30757K1679L0254o6925q5304j58753M3117Q4034P2487
15149e0575O7079l9473K97703J74757O974r9225j38400k3451R5057J72853l0443
15138D32856k24561k36793m3783J57245p5856k80855O4080L48231Q6084p1131
15128A55517k63836j10740M12188R2440p7300l0141J16134j03149k09043J20540
$$ plain form
15202 -98850 -276331 -288445 -219347 -62768 -75761 -193105 -182579 266332 451315 28963
15192 28963 -8373 -28453 -218747 -172982 182069 341394 132367 -17391 -148387 -53454
15182 -53454 -13280 29676 49908 7306 141959 189540 44764 333006 455175 192934 -219586
15171 -219586 35282 49028 -129661 -146155 -165342 -129669 -208564 52616 118965 138999 179366
15160 179366 154218 139593 8836 30515 60769 -6156 -91460 -250213 -207096 -123062 -50575
15149 -50575 16504 -22969 274734 449491 456465 357240 218840 195389 290446 463299 432856
15138 432856 208295 -28498 -72281 84964 9108 -271747 -207667 140564 226648 155517
15128 155517 -108319 -219059 193129 285569 208269 178128 294262 191113 -17930 102610
15118A02610Q5425R1935j21485r9625L2671K3088j91837l31891k24639L10038
15108c23710J50443J92118K61581M8056k70558j73858J04433L39479L16157o2252
15098E81889Q1342k21128l34751k09395O0802Q6610P3953K21073p9008l10304
15088d8917O0424J20831j23975Q9503o7793P9828o7110n0426K29074j11966l4539
15077G4934N2299O3747P5723J3384M2992P1008q7684j15667O7682J0529j33160
15066A35787K6287K4238m0212J37459J1861L8846l1768p0873k28339l06511q7935
15055c91160L30050J46727k0447L91782q9518k63499j15872J99217o3583p1778
15045E1919P2039k2111j81036l7351J43297O4609K6882r1549J7700J0348J28338
$$ plain form
15118 102610 188035 279970 158485 58860 91531 114619 -77218 -409109 -633748 -323710
15108 -323710 -173267 18851 280432 328488 57930 -115928 -11495 327984 644141 581889
15098 581889 663231 442103 107352 -102043 -41241 45369 119322 340395 261387 -48917
15088 -48917 11507 132338 8363 97866 30073 109901 42791 -7635 221439 109473 74934
15077 74934 127233 190980 266703 280087 323079 394087 306403 190736 258418 268947 135787
15066 135787 162074 186312 146100 283559 295420 334266 302498 231625 3286 -303225 -391160
15055 -391160 -61110 85617 65170 456952 367434 103935 -11937 187280 123697 51919
15045 51919 123958 101847 -79189 -116540 26757 91366 118248 26699 44399 54747 183085
15034A83085R9035L3437o2129j01609j25787J59490K71286Q2047k04046k36946
15024I7863j32250n2022K22927K48715j91915l85410j55159K75622K39269m3522
15014A24118R5949J41067k00906j00234J71292M9745n5332n6108M4409j1933j1747
15003A90320r1475j68909L22276L60267L0129p9374j37661p3083N8037J43800
14993E54327o9280j99972n2622J740p9585m3513l8290L3287k9738P4651j34347
14982A6658j20001J55385r2447n8046J69303n2594k13574P5446J56751N8847j9769
14971G5959j81952k44149q5492K56835L5535J94131j51840k0182P2755J18057
14961F9657l924K67597j1162M1888J66092k1269P5867N9390o5720J26883K33680
$$ plain form
15034 183085 282120 315557 253428 151819 26032 185522 456808 538855 334809 97863
15024 97863 -34387 -86409 136518 385233 193318 -192092 -347251 -71629 167640 124118
15014 124118 220067 361134 160228 59994 231286 281031 225699 169591 214000 202067 190320
15003 190320 98845 -70064 252212 612479 642608 563234 425573 352490 410527 554327
14993 554327 485047 285075 232453 234193 154608 111095 72805 106092 76354 151005 16658
14982 16658 -103343 52042 -40405 -98451 70852 18258 -195316 -119870 36881 95728 75959
14971 75959 -105993 -350142 -435634 -178799 -143264 50867 -100973 -121155 -48400 69657
14961 69657 65733 333330 322168 364056 530148 508879 584746 644136 578416 705299 938979
14950I38979M3184k05066j28102j87928j74822j8205L2866j81286l36147k23376
14940d39903R2924M05424k19752k39752r5445j13206L91659M82748J52247l41984
14930G4960l14569J1826J27355J38300J5135K6091J94358k5475k82873O1891O6750
14919I3749K19079j45352j3736r528j47320j0657J16746R3460k42376n838K39181
14908A87408P2542N3093n2463k62363j30447m0965j50756J1231j17865J66037
14898b64548M7757J6253r6851j53630J90386K17550J23325Q3105J08100L4900
14888C06347j99459k92949J27618J90387K34623P4983k71969n45397k86936K01516
14878d61236J68624R4583J5423J46318K75945j40861j86635R6798R6750K40361
$$ plain form
14950 938979 982163 777097 648995 461067 286245 268040 300906 119620 -216527 -439903
14940 -439903 -346979 58445 -161307 -401059 -496504 -609710 -218051 264697 416944 74960
14930 74960 -239609 -227783 -100428 37872 53007 79098 273456 247981 -34892 26999 93749
14919 93749 312828 167476 153740 144212 -3108 -13765 102981 196441 -45935 -51773 187408
14908 187408 259950 313043 260580 -1783 -132230 -173195 -323951 -312720 -430585 -264548
14898 -264548 -216791 -200538 -297389 -451019 -260633 -43083 80242 163347 271447 306347
14888 306347 106888 -186061 -58443 131944 366567 441550 169581 -375816 -662752 -461236
14878 -461236 -292612 -198029 -182606 -36288 239657 98796 -87839 8959 105709 346070
14868C46070R2646L5170j66373k17603J20083J66609k01478k64968j21775Q3484
14858a28135M93648j3778k42143Q5784L2129Q2322k07816k14557K361Q903j05987
14847b07269L1823j21175K80657N7536J4637j03753k28061j78355l0554n8071
14837e42585K12814J51493J28351J03847o0912p555m5063l6213J45585K23877
14827B73639m4280m1089o6509j5734j33716q2127L0935L12226k8131j16860p5292
14816A3062J63190J53230P0184p4685j35627L4867J04000m1737k17033m2545J92918
14805B19824P6698O9606l4809r9392j00717j20920J25307J72442P6832k22557
14795A62314k47054Q5590J20683j30248j28594J03126M05925J46305L0087k38410
$$ plain form
14868 346070 438716 473886 307513 89910 209993 376602 175124 -89844 -211619 -128135
14858 -128135 365513 351735 109592 195376 227505 309827 102011 -112546 -110185 -101282 -207269
14847 -207269 -175446 -296621 -15964 41572 56209 -47544 -275605 -453960 -484514 -542585
14837 -542585 -329771 -178278 -49927 53920 -6992 -14547 -59610 -95823 49762 273639
14827 273639 229359 188270 121761 106027 -27689 -109816 -78881 233345 205214 88354 13062
14816 13062 176252 329482 399666 324981 189354 224221 328221 286484 69451 26906 219824
14805 219824 296522 366128 331319 231927 131210 10290 135597 308039 384871 162314
14795 162314 -84740 850 121533 -8715 -137309 -34183 371742 518047 548134 309724
14785C09724j61913K47553Q7821j69497P9578J02326J59230l20183l26663k9558
14775b1582J89614j12156l9483J16126J94208j73221k52091L46244J77051k75035
14765A49675l3932j85680j40255Q7098K18454L22763P5387k60637q8366p503q9548
14754D7456l43394k75447K43305K93474r6231J6309J40881K3992K37520j9396
14744B68469M7933L3236Q9410j55010j27884k9779l9534R2018Q8475J20626j89031
14733A98929o1769J37096p0673J1053j0385p4122j27854j57785J04906J35192
14723H4588p6115k07345j73690R2804P8640J74551J49502j364O9171o9525J0739
14712A31956p2626M6588m3025o1874o0702J23158J49982j9296M0387j13506j92200
$$ plain form
14785 309724 147811 395364 483185 313688 393266 495592 654822 334639 7976 -21582
14775 -21582 168032 55876 16393 132519 326727 153506 -98585 247659 424710 149675
14765 149675 115743 -69937 -210192 -123094 95360 418123 493510 232873 144507 137004 47456
14754 47456 -295938 -571385 -328080 -34606 -130837 -114528 26353 50345 287865 268469
14744 268469 316402 349638 439048 284038 156154 126375 86841 178859 267334 387960 198929
14733 198929 137160 274256 203583 214636 204251 130129 2275 -155510 -50604 84588
14723 84588 8473 -198872 -372562 -279758 -201118 -26567 122935 121571 190742 121217 131956
14712 131956 59330 105918 62893 1019 -59683 63475 213457 194161 234548 121042 -71158
14701g1158J40902n5939q6438J59243K4247k42784l86700K67188J74611N3609
14691b3219N0858J13389M2510k88351R683J5957o1912k16503J75301K45663L1175
14680I4551o2043P2877p299j80527k12203O6759L76894L0695m4737P5454J15102
14669C25523J29000k0634k22727K12473k81541k83578k8803k404O6812K118L9861
14658f3900K70862J69738k02480j41387L8312j57251q739L0557J26039N7091r994
14647A08848J85858j8261k7051j49401O895k34254k20661Q5119M16544K41277
14637C94913L8538k76070N8346K57204l80289j62802j02880K8288Q2248M2406
14627b0098K08233J36080M1611j18532k81255k3386o0980j66081M00720n2078
$$ plain form
14701 -71158 69744 13805 -72633 86610 110857 -131927 -518627 -251439 -76828 -23219
14691 -23219 27639 141028 183538 -104813 -95130 -79173 -141085 -357588 -182287 63376 94551
14680 94551 32508 105385 98086 -82441 -294644 -227885 149009 179704 134967 210421 325523
14669 325523 454523 433889 211162 423635 142094 -141484 -170287 -172691 -105879 -103761 -63900
14658 -63900 206962 376700 174220 32833 71145 -86106 -94845 -64288 61751 118842 108848
14647 108848 294706 276445 249394 99993 106888 -127366 -348027 -262908 153636 394913
14637 394913 433451 157381 215727 472931 92642 -70160 -173040 -144752 -62504 -20098
14627 -20098 188135 324215 365826 247294 -33961 -57347 -118327 -284408 116312 64234
14617F4234k15496Q4182J1332O9784q1738j91438J92164j0610r6537K35317n173
14606E6021p1846m416K9479K24017K00127j00437j39304O5721M4303l572Q6349
14595C86442J32141j21659j26475o4762l6545j23298J74627m3457Q60k43085J07980
14584D2769J02917j12178p9867r0957L9496r6902p2472K34K37468K54819j34189
14573I1138k2233j31407m3436J07422J45904O3955l8979j69735n8435j49327j60359
14562c65492Q4309O2783p0830M1674J78591J74752J09006k53451K8256Q8675L9140
14551A17413J73361j34752m526j18760q5998K46626J73046o8844r1416l92234
14541a86084J59342L68467L6854J17798O7464p2367m77514l72359r3780L14955
$$ plain form
14617 64234 -151262 -67080 -55748 14036 -67702 -259140 -66976 -77586 -174123 61194 56021
14606 56021 -15825 -20241 9238 233255 433382 332945 193641 259362 303665 300093 386442
14595 386442 518583 396924 270449 205687 169142 45844 220471 177014 177874 -65211 42769
14584 42769 145686 33508 -46359 -137316 -97820 -194722 -267194 -266960 -29492 225327 91138
14573 91138 68905 -62502 -105938 1484 147388 211343 172364 2629 -55806 -205133 -365492
14562 -365492 -281183 -218400 -289230 -247556 -68965 105787 214793 -38658 -10402 78273 117413
14551 117413 290774 156022 151496 32736 -53262 193364 366410 297566 206150 -186084
14541 -186084 -26742 341725 378579 496377 563841 491474 13960 -358399 -452179 -137224
14531a37224K76105J48366J2769J13413j30299j95658j65843m6953O6282K05390
14521A46348J08796P2952j01624j71783k37357k05371J04995K68471m8564r4700
14511a57837J03077M05j67913j53158J71650L4650K42612M9474j19748j82679
14501a79467K09783P0352k11146j19090L4629J83614j3769j1440o5974j12479
14491b14987n7773O6239l3246J02552J45277j28690R2821j36054k2715J27210
14481e9366J77925K75566K7734j25797m2600N2676K8571j34205j88247q8523J18877
14470D2611j8598j62225O5841m0860p0142n9375p5959q959L15835K45598j61035
14459G2732j01919j85269k88283j93531K65709K91150J45106J13140J65124l09384
$$ plain form
14531 -137224 138881 287247 300016 413429 283130 87472 -78371 -125324 -59042 146348
14521 146348 255144 328096 226472 54689 -182668 -388039 -283044 -14573 -63137 -157837
14511 -157837 -54760 -54355 -222268 -375426 -203776 -169126 73486 122960 3212 -179467
14501 -179467 30316 100668 -110478 -229568 -194939 -11325 -25094 -36534 -102508 -214987
14491 -214987 -272760 -206521 -239767 -137215 8062 -120628 -27807 -163861 -186576 -59366
14481 -59366 118559 394125 421859 296062 253462 306138 334709 200504 12257 -76266 42611
14470 42611 24013 -138212 -72371 -113231 -183373 -242748 -318707 -327666 -11831 233767 72732
14459 72732 -29187 -214456 -502739 -696270 -430561 -139411 5695 118835 283959 -25425
14449b5425l47158j40428O6243L55696O7677Q6251L3784J35935j55654j75047
14439i8126r7158K07673L21234J91502o1460j99234l710K2391K876j17053j49135
14428A9800k00553M9317J23310J80920j93307N754K0635Q2702o3443j16873J70068
14417G8330o4355J0598L88513J35618k44744n6208j87288J911K92918m6225k64415
14406D4653j67095r362J43490J80170J78284k25239j51210J27073j33637J47310
14396A34437q6681j56603J86614J32862j861j43689j49932J78379J82510k3870
14386B52166j45342l29608L7884L7155l9173k6637m6985l9698n586K6003K2869
14375b56952L56966K54908k15850p2178k2191M6100n595o9502o5047j08497k59071
$$ plain form
14449 -25425 -372583 -513011 -446768 -91072 -23395 62856 96640 232575 76921 -98126
14439 -98126 -195284 12389 333623 525125 463665 264431 260721 283112 285988 168935 19800
14428 19800 -180753 -131436 -8126 172794 -20513 -14759 5876 88578 25135 -91738 78330
14417 78330 13975 24573 413086 548704 303960 247752 60464 62375 355293 309068 44653
14406 44653 -122442 -131804 11686 191856 370140 144901 -6309 120764 -12873 134437
14396 134437 47756 -108847 77767 210629 208768 65079 -84853 93526 276036 252166
14386 252166 106824 -222784 -184900 -147745 -186918 -213555 -260540 -300238 -305824 -279821 -256952
14375 -256952 100014 354922 139072 66894 44703 90803 85208 15706 -49341 -157838 -416909
14364d16909j83548K19783L29197K75303L97535J16268p2045l06665q1017j06111
14354A71791k90126L2442J41110K71355N4321l76355m4233J18056m9521j22317
14344i3477R4073K74163j8039l8280J8901j93015k25934O0382K437l80024r5215
14333e94028K78016L22447j18782k1221J1068L58292M81457j55138k88867j37357
14323A35887j86012o5392M0963J93330p991p219q9552j94018M2242j27882J38702
14312a26942J72592q8368q4450J135J84788J70688k21086j95643l988J56298J21655
14301H6679J86098M5181J74877k88866k6627R8617k15306l47635K58409J11279
14291H2706l209P5673q941l70930k66551J62240J52710M3551O8066j55999K33226
$$ plain form
14364 -416909 -600457 -380674 -51477 223826 621361 737629 665584 358919 277902 171791
14354 171791 -118335 -85893 55217 326572 380893 4538 -39695 78361 28840 -93477
14344 -93477 596 274759 256720 218440 237341 44326 -181608 -121226 -118789 -498813 -594028
14333 -594028 -316012 6435 -112347 -133568 -122500 235792 717249 562111 273244 135887
14323 135887 -50125 -115517 -74554 118776 110785 103566 14014 -180004 -137762 -265644 -126942
14312 -126942 45650 -42718 -127168 -126033 58755 229443 8357 -187286 -191274 -34976 86679
14301 86679 272777 317958 492835 203969 177342 275959 60653 -286982 -28573 82706
14291 82706 79497 155170 146229 -224701 -491252 -329012 -176302 -132751 -64685 -220684 12542
14280A2542j17918j58610L02187L1927j15242l0330K33941P6056J3395j30822
14270A17126p5799j55302P521J21419o1297N949O3640P0174p9920J27523k19037
14259g8003j13606J57287P4004r0365j76169K9628l6664q7273K64602J82179p7333
14248D8287j41147P8489J39257L3784j96787n4617j35944j07299O997j20773K85475
14237a64278M06209q7158l74445p3883o6432J86167J85499K00398K66469n382
14227D73164k31888k91066J00437J25840l1065o3212n0245K35678K36228j33184
14217C70687j71940r1962J94210J11120Q8028k03373j09357R6992O1912j26067
14207B20250k44411P4413J51625j49908K4513k248J63194k07576k41310p3522
$$ plain form
14280 12542 -105376 -263986 38201 70128 -45114 -75444 158497 234553 247948 117126
14270 117126 41327 -113975 -106454 14965 -46332 -40383 23257 93431 13511 141034 -78003
14259 -78003 -191609 -34322 39682 -50683 -226852 -197224 -233888 -321161 -56559 125620 48287
14248 48287 -92860 -14371 124886 158670 -38117 -92734 -228678 -335977 -328980 -449753 -164278
14237 -164278 241931 154773 -219672 -293555 -359987 -173820 11679 212077 478546 473164
14227 473164 241276 -49790 50647 176487 145422 82210 31965 267643 503871 370687
14217 370687 198747 106785 300995 412115 500143 296770 187413 284405 346317 220250
14207 220250 -24161 50252 201877 51969 76482 74234 237428 29852 -211458 -284980
14197b84980l8362j1116L26820O2083L3790K4371q9651L9715K3184q5270l1558
14186c0974N043J6729R0126q8033J11730N5194r7548k7938N7088R3284o1526O477
14174A29652j05801o7544J68598J29711l12570j16570K08918j18706j32730q0319
14164b97361j13263k74270J50442J20229L05399K17708J57423J5448r965k2640
14154B49150r2673m8600k2048n1504P0444K2519k63595o7769P3471q2485J3741
14143a99349K33195J44464O3614j98843p9373j64886M3008J77358o6029p5838
14133a22679P9153q785k09097K10816J14502J12828k15371L8443L19936K93483
14123F13229o4294j82075k64773o5356K48694L6710j94025K8531p1523J13590
$$ plain form
14197 -284980 -323342 -334458 -7638 54445 88235 112606 22955 62670 85854 584 -30974
14186 -30974 -25931 -9202 80924 -7109 104621 159815 62267 34329 91417 184701 123175 129652
14174 129652 23851 -43693 124905 254616 -57954 -174524 34394 -84312 -217042 -297361
14164 -297361 -410624 -684894 -534452 -414223 -108824 108884 266307 281755 271790 249150
14154 249150 156477 107877 85829 34325 104769 127288 -136307 -204076 -130605 -213090 -199349
14143 -199349 33846 178310 241924 43081 -36292 -201178 -158170 19188 -46841 -122679
14133 -122679 -43526 -52311 -261408 -50592 63910 176738 -38633 -190 319746 613229
14123 613229 548935 366860 102087 36731 285425 322135 128110 156641 85118 198708
14113A98708p1572J09549K0240q5524j38402k85378j22098m0597K46263K79187
14103A10376j19655q4284J27372J25210j25690r097J3100j36170k24019j66989
14093d89846L18091J46795J15665k29753P3552J07979K70128K01046K6323j18254
14083D21726k21957j16710q0028j58929l74162J28788K69433n6296Q7096L4918
14073f6121n4570r8473j5974J94347N37405J15711l05761j57744j36016j0903
14063A901j67067k5402Q8286k79280J28267K64759o8676j41626J58113K18536
14053A77811P5290q5962j7049O1005J12688k09590k42656p3734j13718L3600J49664
14042a32651j23473J58194R0859m8845j17756L00649J28951p4227k64942q5620
$$ plain form
14113 198708 127136 236685 256925 171401 32999 -252379 -374477 -415074 -168811 110376
14103 110376 -9279 -93563 33809 159019 33329 24232 37332 -98838 -322857 -489846
14093 -489846 -171755 -24960 90705 -139048 -65496 42483 312611 513657 539980 421726
14083 421726 199769 83059 3031 -155898 -530060 -401272 -131839 -188135 -101039 -66121
14073 -66121 -120691 -219164 -235138 -40791 496614 612325 306564 148820 12804 1901
14063 1901 -165166 -190568 -102282 -381562 -253295 11464 -57212 -198838 -40725 177811
14053 177811 253101 167139 150090 211095 323783 114193 -128463 -202197 -315915 -282315 -132651
14042 -132651 -256124 -97930 -7071 -55916 -173672 126977 255928 181701 -83241 -168861
14032a68861j68285J03079p5521j11937K26712M81882j57072k92857m3756J58971
14022d7645k82323j30926K29281m9433P3499J08461p899K41459K25683l1723j55999
14011A72435o6286j18379j28935J74629j46057j0164K37120j46334j7122P2578
14001B3485j69110j6579P0787O5713J58704m646J6572l80169J06263p3224J46967
13990e5237K23620j75039l83448P6093K74867K45305R3204r9752M8862O013q8281
13979A66207j61708j55750k77234J44574J60603J18510P0033l77686p4840M49117
13969F1826J08974k60937j47405j35735K92061J11516J73849k82080j96375Q5668
13959a88638J06598M4450k05410m2297L02559J69874J55711j59615k43298O8984
$$ plain form
14032 -168861 -337146 -234067 -309588 -421525 -194813 287069 129997 -162860 -206616 -47645
14022 -47645 -329968 -460894 -231613 -281046 -207547 -99086 -106985 134474 360157 328434 172435
14011 172435 106149 -12230 -141165 33464 -112593 -122757 114363 -31971 -49093 23485
14001 23485 -145625 -162204 -91417 -25704 133000 128354 144926 -235243 -128980 -202204 -55237
13990 -55237 168383 -6656 -390104 -314011 -39144 206161 299365 199613 248475 254488 166207
13979 166207 4499 -151251 -428485 -283911 -123308 -4798 65235 -312451 -387291 61826
13969 61826 170800 -90137 -237542 -373277 -81216 30300 204149 -77931 -274306 -188638
13959 -188638 -82040 -37590 -243000 -285297 17262 187136 342847 183232 -60066 8918
13949H918K37707P3990j78422k30189R2492j45976j23385K0198L1539j45326K12723
13938a45731J91664l49636P8114L23690J11407l3422j67104j23561K09358n1870
13928D2909m0786r8616R5100q709j00241q8171L758P4242r5705K47575K27234
13917B58590k13529L3127r6762j13189O7420j3953j53954K99677K15317J81328
13907D64072J41773j67390o3366L625k10811j88482K48246o078r8522N7533J96440
13896C77040K43641j81295l95806J96698K73470l31009k33312M5291K77189j06853
13886A65054J1389j69097J09693j81887o8723L54879k29641k83922j03786J24671
13876b71370j65891P0967J20899J43756K0162k06189l0553L29232J30808k30244
$$ plain form
13949 8918 246625 320615 142193 -87996 4496 -141480 -264865 -244667 -213128 -358454 -145731
13938 -145731 45933 -303703 -225589 98101 209508 176086 8982 -114579 94779 42909
13928 42909 2123 -96493 -1393 -10102 -110343 -198514 -194756 -120514 -216219 31356 258590
13917 258590 45061 78188 -18574 -131763 -64343 -78296 -232250 67427 282744 464072
13907 464072 605845 438455 375089 378714 167903 -20579 227667 221589 123067 180600 377040
13896 377040 620681 439386 43580 240278 513748 182739 -50573 -5282 271907 165054
13886 165054 176443 7346 117039 -64848 -133571 221308 -8333 -292255 -396041 -271370
13876 -271370 -437261 -366294 -245395 -101639 -81477 -287666 -318219 11013 141821 -88423
13866h8423J35728O5283o5190n5342j69602j75576K75562J93015o8612l37493
13856b90650j0136n9805j35672m425K55983q2768N6494R6858K72959l4668J02844
13845A67014l88689j00432r4033O8037K76508N0734o1260n7710k7577K2536j06707
13834b51579k08641K75736K24649K79776J45942N520J8633j51884j36811N1444
13824B52785R4068k77165k27414k421j60018j44076K06691L17885K14856q0958
13814A94233q3908r9518P43j35664K906q7079l60635J01192M73786K28210m3765
13803A90501m30759O317L2012l1428N9373R298J40752R6109j27433M1609P0886
13792E7237j71060J49890K00610J05314j00966k57736r0623n969J14884k49347
$$ plain form
13866 -88423 47305 112588 47398 -7944 -177546 -353122 -77560 115455 46843 -290650
13856 -290650 -300786 -360591 -496263 -500688 -244705 -327473 -270979 -174121 98838 64170 167014
13845 167014 -221675 -322107 -416140 -348103 -71595 -20861 -82121 -139831 -167408 -144872 -251579
13834 -251579 -460220 -184484 40165 319941 465883 471403 490036 338152 201341 252785
13824 252785 346853 69688 -157726 -160147 -320165 -464241 -257550 60335 275191 194233
13814 194233 110325 10807 11550 -124114 -121208 -208287 -568922 -467730 6056 234266 190501
13803 190501 -240258 -233941 -201929 -233357 -173984 -164686 -23934 72175 -55258 -13649 57237
13792 57237 -113823 36067 236677 341991 241025 -16711 -107334 -113303 1581 -247766
13782b47766l7731J61982J22228j77042m21932N460K05408J21090K0725m0754
13772b88332j83620j42212L20335J70623J49688K58352L62976j28884k19378k99846
13762b98j65601J19397J54146j57781P3513M9908L7302q2826n6742J16167j3786
13751G3399k18152J92548R8116l10219L775J13981J75021j03597k28833p6748
13741b80709J58505K60690P9462J69268M7084k0776j20045k17252J47594j5020
13731B08801Q3103J11352q0707j67477l29073J00634K50215Q2242K4817n0095
13721B33812j15088J53094j4354k13449l8333o1714p16J76598l2805j09096r1304
13710a13355q3437J13996J27099j02680k73459K00230K25807j96408k36311J10628
$$ plain form
13782 -247766 -285497 -123515 -1287 -178329 -600261 -594801 -389393 -268303 -247578 -288332
13772 -288332 -471952 -614164 -293829 -123206 26482 284834 647810 518926 299548 -298
13762 -298 -165899 -46502 107644 -50137 23376 73284 110586 27760 -28982 87185 73399
13751 73399 -144753 47795 145911 -164308 -160533 -46552 128469 24872 -203961 -280709
13741 -280709 -122204 138486 217948 387216 434300 413524 293479 76227 223821 208801
13731 208801 291904 403256 322549 155072 -174001 -73367 176848 259090 283907 233812
13721 233812 118724 271818 257464 44015 5682 -56032 -56748 119850 87045 -22051 -113355
13710 -113355 -196792 -82796 44303 -58377 -331836 -131606 94201 -102207 -338518 -227890
13700b27890n1673j9601K13191J72191K3851K89502j17068l23337o9661J6460
13690i4035K43445m2556k00611N6672k22178Q528L23152J30590o986J31342K2846
13679C50209N3852q6766n5167k81879k21085k2114J14822L49963N6014j61165
13669I6684j9435K60194K17244J81766j54329j89892l68655q7982k3473J46900
13659E9022K2282K05183k2324J6480l25911j81403L35943k5553J2238Q8783P4827
13648B59567N89584k7873j69389j2693m6841j65812r8949j45697J84676j84202
13638A82371O3382j49829Q195J45011Q1239k72092l2639J1720p7217J36856O7849
13627A64846l9442j50671O9350J17828j9569n1268j34112N6931p0421n0609j81079
$$ plain form
13700 -227890 -279563 -299164 -85973 86218 110069 399571 282503 -40834 -110495 -94035
13690 -94035 149410 106854 -93757 -37085 -259263 -250735 72417 203007 196021 327363 350209
13679 350209 404061 317295 262128 -19751 -240836 -262950 -148128 201835 257849 96684
13669 96684 77249 337443 554687 736453 582124 392232 23577 -64405 -87878 59022
13659 59022 81304 286487 264163 280643 -45268 -226671 109272 83719 95957 184740 259567
13648 259567 849151 821278 651889 639196 592355 426543 327594 181897 366573 182371
13638 182371 245753 95924 104119 249130 330369 58277 25638 37358 -39859 96997 164846
13627 164846 125404 -25267 44083 161911 142342 91074 -43038 13893 -56528 -107137 -288216
13616b88216o5045L21617j36619q5971j48450J0712L57562J06917k0896r3168
13606d1557k74244q7463K13814P539R1870L37910P2650O5314l8204m8081J1298
13595C10846l54015Q86Q5202q5371j9403J1259J6800L225j16233l14885k40482
13584g02171L30979K82976N9899k16811K2612M23548L22488J28117l30945m4270
13574B76422o4604k60396M7700K7221n3203K30445o9928k79800j65572j34621
13564d46336P0037K81549L10314k4545j22886J3966K144J26817J28716k44358
13554I5418k52874q7005j68341K03072K62125l1407j00758N5363R7226J39950
13544B12769j01298k62977k95687l1887K39689J72023k15978J1198K84769K04265
$$ plain form
13616 -288216 -353261 -31644 -168263 -254234 -402684 -391972 -34410 72507 51611 -41557
13606 -41557 -315801 -403264 -189450 -181911 -90041 247869 320519 385833 347629 299548 310846
13595 310846 -43169 -42283 42919 -42452 -61855 -50596 -33796 -30571 -146804 -461689 -702171
13584 -702171 -371192 -88216 -28317 -245128 -222516 201032 523520 651637 320692 276422
13574 276422 211818 -48578 -878 26343 -26860 203585 133657 -146143 -311715 -446336
13564 -446336 -376299 -94750 215564 191019 68133 82099 84243 211060 339776 95418
13554 95418 -157456 -244461 -412802 -209730 52395 20988 -79770 -24407 72819 212769
13544 212769 111471 -151506 -447193 -479080 -239391 -67368 -283346 -272148 12621 216886
13534B16886r551k95446k26357j83774J45579R9198p3843j32547k0591J21712
13524c58734r9778j48981J11347j75203m1925K14566K70158L56675K21345L7979
13514C87449j70133j22852k15411k7732J72982J50426L4419J05451J21237j57155
13504B78681j94322k38257k58033J44218L06965j33402p1700o0830J34566R5171
13494C057K25427k13067l47147m6608J23585J78719L43573k1155o5640o770j53104
13483B0870k14169P6878m4913j1528J45633l9993k96608k77083J89566K77384
13473a73963J72390J61812k699n4243j54195q3300r4361J83421m1462J9853J91104
13462A24357j32869j00705L1578J29612J60265L7248p6197m05855M3915R2723
$$ plain form
13534 216886 207335 -88111 -314468 -498242 -352663 -253465 -327308 -459855 -480446 -358734
13524 -358734 -458512 -607493 -496146 -671349 -713274 -498708 -228550 128125 349470 387449
13514 387449 217316 94464 -120947 -148679 24303 174729 209148 314599 435836 278681
13504 278681 84359 -153898 -411931 -267713 39252 -94150 -165850 -226680 -92114 3057
13494 3057 228484 15417 -331730 -378338 -254753 -76034 267539 246384 180744 173974 20870
13483 20870 -193299 -116421 -161334 -172862 -27229 -67222 -363830 -640913 -451347 -173963
13473 -173963 -1573 160239 157540 103297 -50898 -134198 -228559 -45138 -86600 -66747 124357
13462 124357 -8512 -109217 -77639 51973 212238 249486 173289 -232566 -188651 -95928
13452i5928J93510j99001K6262r4184J50884K97929K19862j20508l29712k58701
13442b09587k44375M0028M02519M54632R0328M6674j22961K9796K11238k29189
13432D69103k98227q5458K7669j06376N6178j7957j71522J05519O9610j08746
13422f0207m9785j78774q4603O8449N402o800J67795L60417n3742k45581m4592
13411a22021J75419K89687k519m7956j71820L3230J59559k11207q546j3287p893
13400G2646J6894J17915n4541k27168k29845J92084j4268J67375k3807r9032k6083
13389a07830j20141J64737J68579k06095k89755j55923J25947p6504K7828K07886
13379b61271m5582L98002J24745J01693r2495j42031P8890N3503j79841R610K10139
$$ plain form
13452 -95928 97582 -101419 -75157 -169341 -18457 279472 499334 378826 49114 -209587
13442 -209587 -453962 -413934 -11415 443217 533545 580219 457258 487054 698292 469103
13432 469103 170876 85418 113087 6711 62889 44932 -126590 -21071 48539 -60207
13422 -60207 -109992 -288766 -373369 -304920 -299518 -306318 -138523 221894 168152 -77429 -122021
13411 -122021 53398 343085 340566 292610 120790 154020 313579 102372 93826 80539 72646
13400 72646 89540 207455 152914 -74254 -304099 -112015 -126283 41092 17285 -81747 -107830
13389 -107830 -227971 -63234 105345 -100750 -390505 -546428 -420481 -496985 -469157 -261271
13379 -261271 -306853 91149 215894 317587 225092 83061 161951 215454 35613 45223 255362
13368B55362L251r6318k48143J42501J66084l8564p0892j30779M05273J15886
13358E03661l83185L8524J61397j431m95074j59959K66084J00566J25541k29322
13348g3198j89436j10341K61161N5229m6320j56770j50598k4015L03467R3835
13338c6986J32325j32205j33022M4161K48756q99j50233O9901J08102K79692Q650
13327D38242l97718j14101K09480k45069k21944Q9976K09819N3198J9887k25854
13317a84084L1125J2961j92222J07070K03901J40007L24863j18587j98148N8316
13307A85202M166O0012L0793J69381p8961r7216j41029K0081k34770K1099j63886
13296b25128J4157J94136N8691k22779K6539L60m832j48509J98388J07657j26082
$$ plain form
13368 255362 258613 162295 -85848 56653 222737 184173 113281 -17498 387775 503661
13358 503661 120476 159000 320397 318966 -176108 -336067 -69983 30583 156124 -73198
13348 -73198 -262634 -372975 -111814 -56585 -102905 -259675 -410273 -434288 -130821 -36986
13338 -36986 95339 -36866 -169888 -125727 123029 122130 -28103 41798 149900 429592 438242
13327 438242 40524 -73577 135903 -109166 -331110 -241134 -31315 21883 41770 -184084
13317 -184084 -152959 -139998 -332220 -225150 -21249 118758 443621 325034 126886 185202
13307 185202 189368 249380 280173 449554 370593 273377 132348 152429 -82341 -61242 -225128
13296 -225128 -210971 -16835 41856 -180923 -154384 -154024 -158856 -307365 -108977 -1320 -127402
13285a27402J1639j60907m555J47368q1683k9827p2579j16115j5506J32434J20475
13274a96658J59162j5910J7953p1638k48103o3075J52979K92865L03930L9762
13264C71267k7283j4571j40803j54418J26949J08977J83760l22554j9488p8828
13254C3008p4764l4754m2487k49079k7509J53279l6466J97769P5766R7875J11110
13243B03748J00291k28307l1402j13089j44412J84368P7937Q8141K57074l9816
13233C54533j52672J74021m035m940n0790j22215j04577j95162K21346J00922
13223B16431k95796k50532K27313K69679Q2693N7738k09996l24122k34750J91493
13213b69849K76933j23695L18930J22103n0745j70141j75116P1144K84083M196
$$ plain form
13285 -127402 -115763 -276670 -281225 -133857 -215540 -245367 -317946 -434061 -449567 -317133 -196658
13274 -196658 -37496 -53406 -35453 -107091 -355194 -418269 -265290 27575 331505 371267
13264 371267 343984 329413 188610 34192 161141 270118 453878 131324 111836 33008
13254 33008 -41756 -76510 -118997 -368076 -395585 -242306 -278772 -81003 -5237 92638 203748
13243 203748 304039 75732 44330 -68759 -213171 -28803 49134 137275 394349 354533
13233 354533 201861 375882 371847 366907 316117 193902 89325 -105837 115509 216431
13223 216431 -79365 -329897 -102584 167095 249788 307526 97530 -226592 -461342 -269849
13213 -269849 7084 -116611 202319 324422 273677 103536 -71580 -436 283647 287843
13203B87843n8300j95852p7990l4610P0388O2945n1255k08125K8842Q0242j55454
13192b51326J26314J12581M4605K73309j57625m90424k24926O3529J89965J4538
13182b99460Q7121K30139O281q5560n8943M3995m4225l7816J42975k45777k92439
13171e53709J88498M13559M10261j20743j62942k37849j02008j8331K56537P8106
13161A51379j86917l4158P6034N2848r7466k9991J02366j32639k3084J22226l86001
13150c85403m7569K99316N86370N50m06108l3486L29987M3283M8863o9919j80416
13139A85468l57973n0822k5384j5948J91685j28483j46664n9420n8434j24155
13129e90130J10214K31403J79334J37923J98644n9785k82254n4027Q2222K1422
$$ plain form
13203 287843 229543 33691 -44299 -78909 -8521 54424 3169 -204956 -176114 -95872 -251326
13192 -251326 -125012 -12431 32174 305483 147858 -342566 -567492 -503963 -313998 -299460
13182 -299460 -212339 17800 24081 -61479 -120422 -76427 -120652 -158468 -15493 -261270 -553709
13171 -553709 -365211 48348 458609 337866 174924 -62925 -164933 -183264 73273 151379
13161 151379 -35538 -69696 6338 59186 -38280 -68271 34095 -98544 -121628 598 -385403
13150 -385403 -432972 -133656 452714 453264 47156 13670 343657 386940 435803 365884 185468
13139 185468 -172505 -223327 -248711 -264659 -72974 -201457 -348121 -407541 -465975 -590130
13129 -590130 -479916 -248513 -69179 68744 267388 207603 -74651 -128678 -46456 -25034
13119b5034J70921j53716r5066j25044M8643K03867L1014j64185l7299M6354q0270
13108a79815K66232L52249k48078k14296K8636k10782j28164j56486k3479K19237
13098b94746O1706k28334J02347K33844L36120r9698q819L72192k8995k23385
13088B22232l51854j93338l5257k4083k07218K33061L85332N1618q1114p0671
13078g1292L2964J81118M8563K51458j58193j40227k12771J9910K34743k40140
13068e3867k54934K35712M6617l2721l1717n4558j8948j09796Q9381P3396J72185
13057F0750j53297j21146O2008K533k56467j3299L54802L49460Q7869j06028k74763
13046g578j08600j43298r1365K96800r077j33130j75035J7186K75653j4748j31470
$$ plain form
13119 -25034 145887 -7829 -102895 -227939 -179296 24571 55585 -108600 -145899 -99545 -179815
13108 -179815 86417 438666 190588 -23708 4928 -205854 -334018 -490504 -513983 -294746
13098 -294746 -233040 -461374 -359027 -125183 210937 111239 102420 474612 445617 222232
13088 222232 -129622 -322960 -358217 -382300 -589518 -356457 28875 80493 -621 -71292
13078 -71292 -38328 142790 191353 442811 284618 144391 -68380 -48470 186273 -53867
13068 -53867 -308801 -73089 -26472 -59193 -90910 -145468 -164416 -274212 -184831 -111435 60750
13057 60750 -92547 -213693 -151685 -149152 -405619 -418918 -64116 285344 373213 267185 -7578
13046 -7578 -116178 -259476 -350841 -54041 -63118 -196248 -371283 -354097 -78444 -93192 -224662
13035b24662j17382R6539m6055N2083j08k7065J62306K6275m04772P1902J14998
13024b95941L9057j8163K48479J94538P9284K2388k5649o7926j0446j40957j66836
13013a42172l3186K03171M4201R6811j79002R624K62863J98668j9663l96525j07437
$$ plain form
13035 -224662 -342044 -245505 -291560 -239477 -239585 -266650 -104344 -78069 -482841 -410939 -295941
13024 -295941 -256884 -275047 -26568 167970 247254 269642 243993 176067 165621 24664 -142172
13013 -142172 -175358 27813 72014 168825 -10177 -553 262310 460978 441315 44790 -62647
$$ [...]
##END NTUPLES=NMR SPECTRUM
##END=
