##TITLE=Analysis number 311377
Compound Code mo 07100
Project Code adrs
Chemist Name vekton
##JCAMPDX= 6.0         $$ Bruker NMR JCAMP-DX V2.0
##DATA TYPE= NMR SPECTRUM
##DATA CLASS= NTUPLES
##ORIGIN= Bruker BioSpin GmbH
##OWNER= NMR
$$ XWIN-NMR		Version 3.5
$$ Thu Jul  7 14:17:54 2005 GMT Daylight Time (UT+1h)  MAYBRIDGE\NMR@NMR_250MHZ
##.OBSERVE FREQUENCY= 250.131544655141
##.OBSERVE NUCLEUS= ^1H
##.ACQUISITION MODE= SIMULTANEOUS (DQD)
##.ACQUISITION SCHEME= undefined
##.AVERAGES= 16
##.DIGITISER RES= 18
##SPECTROMETER/DATA SYSTEM= dpx250
##.PULSE SEQUENCE= zg30
##.SOLVENT NAME= DMSO
##.SHIFT REFERENCE= (INTERNAL, DMSO, 0, 16.522)
##AUDIT TRAIL= $$ (NUMBER, WHEN, WHO, WHERE, WHAT)
$$ ##TITLE= Audit trail, XWIN-NMR		Version 3.5
$$ ##JCAMPDX= 5.01
$$ ##ORIGIN= Bruker BioSpin GmbH
$$ ##OWNER= NMR
$$ C:\u/data/dgb/nmr/ADRS/5500/pdata/1/auditp.txt
$$ ##AUDIT TRAIL=  $$ (NUMBER, WHEN, WHO, WHERE, WHAT)
(   1,<2005-07-07 14:17:33.74 +100>,<MAYBRIDGE\NMR>,<NMR_250MHZ>,
      <created by zg, POWCHK disabled, PULCHK disabled
       configuration hash MD5:
       62 19 C7 07 E1 42 D1 B7 37 6C 3D D0 77 39 F9 E6
       data hash MD5: 64K
       2B 78 A5 A0 7F C9 B8 D0 59 06 2E 5E F2 BC 2B 67>)
(   2,<2005-07-07 14:17:45.77 +100>,<MAYBRIDGE\NMR>,<NMR_250MHZ>,
      <Start of raw data processing
       ef LB = 0.3 FT_mod = 6 PKNL = 1 SI = 32K 
       data hash MD5: 32K
       6D EE FC FC D4 52 B2 2C 24 B0 A0 70 74 21 28 D3>)
(   3,<2005-07-07 14:17:47.58 +100>,<MAYBRIDGE\NMR>,<NMR_250MHZ>,
      <apk 
       data hash MD5: 32K
       69 AA C3 B3 2A ED 26 EC F1 F6 87 09 44 25 80 85>)
(   4,<2005-07-07 14:17:48.35 +100>,<MAYBRIDGE\NMR>,<NMR_250MHZ>,
      <abs ABSG = 5 
       data hash MD5: 32K
       A7 7F 32 AC 38 0B 06 EA 23 78 AB CD C0 FD A0 FF>)
$$ ##END=
$$ 
$$ hash MD5
$$ 4B 22 30 87 7E A5 4C 0D 5C AC 8D 7E 5D 73 FE 9D
##$RELAX= 
##$RELAX= 
##$RELAX= 
##$RELAX= 
##$RELAX= 
##$RELAX= 
##$RELAX= 
$$ Bruker specific parameters
$$ --------------------------
##$DU= <C:\u>
##$EXPNO= 5500
##$NAME= <ADRS>
##$PROCNO= 1
##$TYPE= <nmr>
##$USER= <dgb>
##$AMP= (0..31)
100 100 100 100 100 100 100 100 100 100 100 100 100 100 100 100 100 100 
100 100 100 100 100 100 100 100 100 100 100 100 100 100 
##$AQSEQ= 0
##$AQ_mod= 3
##$AUNM= <au_zg>
##$AUTOPOS= <39 >
##$BF1= 250.13
##$BF2= 250.13
##$BF3= 250.13
##$BF4= 250.13
##$BF5= 500.13
##$BF6= 500.13
##$BF7= 500.13
##$BF8= 500.13
##$BYTORDA= 1
##$CFDGTYP= 0
##$CFRGTYP= 5
##$CHEMSTR= <none>
##$CNST= (0..31)
1 1 145 1 1 1 1 1 1 1 1 1 1 1 1 1 1 1 1 1 1 1 1 1 1 1 1 1 1 1 1 1 
##$CPDPRG= <>
##$CPDPRG1= <>
##$CPDPRG2= <>
##$CPDPRG3= <>
##$CPDPRG4= <mlev>
##$CPDPRG5= <mlev>
##$CPDPRG6= <mlev>
##$CPDPRG7= <mlev>
##$CPDPRG8= <mlev>
##$CPDPRGB= <>
##$CPDPRGT= <>
##$D= (0..31)
0 1 0 0 0 0 0 0 0 0.06 0 0 0 0 0 0 0.0002 0 0 0 0 0 0 0 0 0 0 0 0 0 0 
0 
##$DATE= 1120742252
##$DBL= (0..7)
120 120 120 120 120 120 120 120 
##$DBP= (0..7)
150 150 150 150 150 150 150 150 
##$DBP07= 0
##$DBPNAM0= <>
##$DBPNAM1= <>
##$DBPNAM2= <>
##$DBPNAM3= <>
$$ [...]
##$SUBNAM7= <"">
##$SUBNAM8= <"">
##$SUBNAM9= <"">
##$SW= 20.6930455092707
##$SWIBOX= (0..15)
0 0 3 0 0 0 0 0 0 0 0 0 0 0 0 0 
##$SW_h= 5175.983436853
##$TD= 65536
##$TD0= 1
##$TE= 295.16
##$TE2= 300
##$TE3= 300
##$TEG= 300
##$TL= (0..7)
0 120 120 120 120 120 120 120 
##$TP= (0..7)
150 150 150 150 150 150 150 150 
##$TP07= 0
##$TPNAME0= <>
##$TPNAME1= <>
##$TPNAME2= <>
##$TPNAME3= <>
##$TPNAME4= <>
##$TPNAME5= <>
##$TPNAME6= <>
##$TPNAME7= <>
##$TPOAL= (0..7)
0.5 0.5 0.5 0.5 0.5 0.5 0.5 0.5 
##$TPOFFS= (0..7)
0 0 0 0 0 0 0 0 
##$TUNHIN= 0
##$TUNHOUT= 0
##$TUNXOUT= 0
##$USERA1= <user>
##$USERA2= <user>
##$USERA3= <user>
##$USERA4= <user>
##$USERA5= <user>
##$V9= 5
##$VALIST= <valist>
##$VCLIST= <CCCCCCCCCCCCCCC>
##$VD= 0
##$VDLIST= <DDDDDDDDDDDDDDD>
##$VPLIST= <PPPPPPPPPPPPPPP>
##$VTLIST= <TTTTTTTTTTTTTTT>
##$WBST= 1024
##$WBSW= 4
##$XGAIN= (0..3)
0 0 0 0 
##$XL= 0
##$YL= 0
##$YMAX_a= 320378
##$YMIN_a= -451956
##$ZGOPTNS= <>
##$ZL1= 120
##$ZL2= 120
##$ZL3= 120
##$ZL4= 120
##$ABSF1= 16.522
##$ABSF2= -4.171173
##$ABSG= 5
##$ABSL= 3
##$ALPHA= 0
##$AQORDER= 0
##$ASSFAC= 0
##$ASSFACI= 0
##$ASSFACX= 0
##$ASSWID= 0
##$AUNMP= <proc_1d>
##$AZFE= 0.1
##$AZFW= 0.1
##$BCFW= 0
##$BC_mod= 0
##$BYTORDP= 0
##$COROFFS= 0
##$CY= 12.5
##$DATMOD= 1
##$DC= 0
##$DFILT= <>
##$DTYPP= 0
##$F1P= 14.0000005364418
##$F2P= -0.99999901652339
##$FCOR= 0.5
##$FTSIZE= 32768
##$FT_mod= 6
##$GAMMA= 0
##$GB= 0
##$INTBC= 1
##$INTSCL= 1
##$ISEN= 128
##$LB= 0.3
##$LEV0= 0
##$LPBIN= 0
##$MAXI= 10000
##$MC2= 0
##$MEAN= 0
##$ME_mod= 0
##$MI= 0
##$NCOEF= 0
##$NC_proc= -4
##$NLEV= 6
##$NOISF1= 0
##$NOISF2= 0
##$NSP= 0
##$NTH_PI= 0
##$NZP= 0
##$OFFSET= 16.522
##$PC= 1
##$PHC0= -88.71335
##$PHC1= 8.574422
##$PH_mod= 1
##$PKNL= yes
##$PPARMOD= 0
##$PSCAL= 4
##$PSIGN= 0
##$REVERSE= no
##$SF= 250.13
##$SI= 32768
##$SIGF1= 0
##$SIGF2= 0
##$SINO= 400
##$SIOLD= 32768
##$SREGLST= <1H.DMSO>
##$SSB= 0
##$STSI= 32768
##$STSR= 0
##$SW_p= 5175.98343685301
##$SYMM= 0
##$S_DEV= 0
##$TDeff= 65536
##$TDoff= 0
##$TI= <Analysis number 999999
Compound Code 99
Book Reference 9
Project Code 9>
##$TILT= no
##$TM1= 0
##$TM2= 0
##$TOPLEV= 0
##$USERP1= <user>
##$USERP2= <user>
##$USERP3= <user>
##$USERP4= <user>
##$USERP5= <user>
##$WDW= 1
##$XDIM= 32768
##$YMAX_p= 412342354
##$YMIN_p= -222772
$$ End of Bruker specific parameters
$$ ---------------------------------
##NTUPLES= NMR SPECTRUM
##VAR_NAME=  FREQUENCY,     SPECTRUM/REAL,   SPECTRUM/IMAG
##SYMBOL=    X,             R,               I
##VAR_TYPE=  INDEPENDENT,   DEPENDENT,       DEPENDENT
##VAR_FORM=  AFFN,          ASDF,            ASDF
##VAR_DIM=   32768,         32768,           32768
##UNITS=     HZ,            ARBITRARY UNITS, ARBITRARY UNITS
##FACTOR=    0.157963299565203, 1,           1
##FIRST=     4132.6476996994, 0,             0
##LAST=      -1043.33573715361, 0,           0
##MIN=       -1043.33573715361, -222772,     0
##MAX=       4132.6476996994, 412342354,     0
$$ Real data points
##PAGE= N=1
##DATA TABLE= (X++(R..R)), XYDATA
$$ [...]
17998G3651N4519P9935m1535l5714l5043o6368l8421L6099K8841k9887k849M3397
17986F6625K8579M9679j7711n7829j6557K0015m0075l1062l205L7326Q9038J2699
17974A37522j4838o2237j9909j6395K0951N4611J0852j0722L3093J0831Q538j7484
17962A34813k8107J3988K4003j5431k491m4085K208K7163Q328N5634J2508O592
17950A95123m8428p7722j0316K9003J12L3125O0917l3910n1781l3098l0331p90
17938C1904l545N486J7246j8710k9697l0914L7077K5563L1724K6041k185j9433
17926G0557M2338j0691n0792k3603M2641l6076K369l9488J1416O6740M1149q65
17914A15695p8911n3701J444P205k4987O538K6194K9553J3854L7562p8797n5439
$$ plain form
17998 73651 128170 208105 166570 130856 95813 29445 -8976 27123 55964 26077 23228 66625
17986 66625 95204 144883 127172 69343 52786 72801 32726 1664 -1541 35785 124823 137522
17974 137522 122684 60447 40538 24143 45094 99705 110557 99835 132928 143759 152297 134813
17962 134813 106706 120694 144697 129266 126775 82690 84898 112061 120389 176023 188531 195123
17950 195123 146695 68973 58657 87660 87772 120897 181814 147904 96123 63025 32694 31904
17938 31904 28359 33845 51091 32381 2684 -28230 8847 34410 66134 92175 89990 70557
17926 70557 112895 102204 51412 27809 70450 34374 36743 -2745 8671 75411 116560 115695
17914 115695 36784 -16917 -15473 -8268 -33255 -26717 -523 29030 42884 80446 1649 -53790
17902e3790N8238P9656l1556l5969K2030K1250K3625M4497n600n364j0972J0401
17890A16446K346M9387l40k7330k2134o3690k4636L0548K9481o130o6423J4063
17878C1588k1669L4477l814K9723j4066q64K8371N2611K5552j7165P476o6514
17866H5706J1849O6019k7794m567L1790j4350l8687j4885n00n588J7727L2677
17854A39397k8425M0426N245r231L4037O9753L0190K1823L2971L6623m5515l032
17842C24262N3230N0271J9770n2575m9484J9096P2704j4760o9477K0167K2226
17831C95430J5536j8198p4707n2355k1958j6584l6715M583K1497o440j8886m8934
17819A42269J6600N1409P905l3957k1453K8804J0054l0223J6956j7602N287j5788
$$ plain form
17902 -53790 4448 84104 52548 16579 38609 59859 83484 127981 122381 117017 106045 116446
17890 116446 118792 168179 167839 140509 118375 54685 30049 60597 90078 83948 17525 31588
17878 31588 9919 44396 40582 70305 56239 55375 83746 136357 161909 144744 152220 85706
17866 85706 97555 163574 135780 131213 163003 148653 109966 95081 94581 88993 106720 139397
17854 139397 110972 151398 156643 147412 181449 251202 281392 303215 336186 372809 327294 324262
17842 324262 377492 427763 447533 394958 345474 364570 437274 422514 353037 373204 395430
17831 395430 410966 392768 318061 265706 243748 227164 190449 195032 216529 210089 191203 142269
17819 142269 158869 210278 218183 184226 162773 191577 201631 171408 188364 170762 176049 160261
17807A60261l383N2743l3914m6774L9828J5085r88O3921O1745M3512p726j3478
17795C30832L6257J7265L4763N7977K4100J1755J1658K4463J2911l3286l5436
17784D93259q9155j2902L0425O571r981j5154J2042n102M7610P5219M0477o5059
17772E08250r8975m5303N330L912j6932n9302o1494m1715m3823o6297m2342k1897
17760A9412j2784m0537K8232Q8968P593p827j737J7043L2467M1600L475k5343
17748A50562o0405K6640P868L2634J555j0176K7217j2605o25N7035k3056n4279
17736A42365n3055l6666l2601N680L6762m4076l5917p163K0088K1140N0142o441
17724F0258K296K3695J7169O5436L1646p4970j0069O6342K3734l327j4819j5220
$$ plain form
17807 160261 156878 209621 175707 128933 168761 183846 182858 246779 308524 352036 344310 330832
17795 330832 367089 384354 419117 477094 501194 512949 524607 549070 561981 528695 493259
17784 493259 404104 391202 421627 428198 418217 403063 415105 410003 457613 532832 573309 508250
17772 508250 409275 363972 369302 373214 356282 296980 235486 193771 149948 83651 41309 19412
17760 19412 6628 -33909 -5677 83291 90884 83057 81320 98363 130830 172430 175905 150562
17748 150562 90157 116797 124665 157299 158854 148678 175895 163290 162665 219700 196644 142365
17736 142365 89310 52644 20043 25723 62485 18409 -17508 -24671 -4583 16557 66699 60258
17724 60258 62554 86249 103418 168854 200500 125530 115461 181803 205537 202210 187391 172171
17712A72171p356O1666Q4707J7941l6249J0990K9014M531m2608P5820P1199n9946
17700C81880q292l1080J6345l2397J1762J695k3299L2367L1365n255J1680P1856
17688D58627J8469J0193j0789r0180m0161k5687k2550o7926J2039L7409k7793
17677B51651K2442J5144m8236n5130l2582j9961k0704J9408K0004J1079n2515
17666A10600J7522M8430J4431m285j9128L6311O8652m699k4115m5005J0233M299
17654B13246p550k1822L1755P547J9014N3243N2718J00623l349m2639j9473R159
17642C92472M371l2988n7419L1372J6329K0137l3325l7218k1878k687L3187R0663
17630D03016j4706q5893l5523j8921K7938o1887n5889M6374K1325k0604J5601
$$ plain form
17712 172171 164815 226481 311188 329129 292880 303870 332884 337415 294807 370627 441826 381880
17700 381880 373588 342508 358853 326456 338218 339913 316614 348981 380346 375091 386771 458627
17688 458627 477096 487289 476500 386320 346159 320472 297922 229996 242035 279444 251651
17677 251651 274093 289237 241001 185871 153289 133328 112624 132032 152036 163115 110600
17666 110600 128122 176552 190983 186698 167570 203881 272533 267834 243719 198714 208947 213246
17654 213246 205696 183874 215629 223176 242190 295433 348151 448774 445425 402786 383313 392472
17642 392472 396843 363855 306436 337808 354137 374274 340949 303731 281853 279166 312353 403016
17630 403016 388310 302417 266894 247973 275911 214024 158135 204509 225834 205230 220831
17619B20831J2228j5804k960J4381m6718m5448J3435M3629J2568k8189n356o3664
17607A08933m0803J7828P5744o950j19q060j704j9721j777J34L9774k7282k4033
17594A11964L0723N2620K1472l4392o0361l7450K1887Q180L965Q6527l0678K5
17582A74482k4040k135j4483j7688O958P49K0784L7361K4712p190m4798j3706
17570A41006k8933K3063K8269K3522l5374J7390J317J2797M8844O555r082O115
17558B35489k1823N355R245j0289J6019O6817L4633q000o27o7047j8417L1553
17546B72908K3788j4794L4211L7648N5018P4096M0832Q9182L5841O3961L3066
17535G45757J1509j6678m2623o8619l319N9686m3145l9071q0026n0117l9167l5392
$$ plain form
17619 220831 233059 217255 214295 228676 181958 136510 149945 193574 206142 177953 172597 108933
17607 108933 68130 85958 161702 154752 154633 146573 144869 125148 123371 123505 163279 135997 111964
17594 111964 142687 195307 216779 182387 122026 84576 106463 114643 118608 205135 174457 174482
17582 174482 150442 148307 133824 116136 123094 123843 144627 181988 206700 199510 154712 141006
17570 141006 112073 135136 163405 186927 151553 168943 170260 183057 231901 238456 229374 235489
17558 235489 213666 219021 228266 217977 233996 300813 335446 327446 326819 259772 241355 272908
17546 272908 296696 281902 316113 353761 408779 482875 523707 612889 648730 712691 745757
17535 745757 757266 740588 697965 629346 626027 685713 642568 603497 523471 473354 434187 398795
17523C98795q3207o934K2846l5460N852N9378J3545j3871K0237J3596q2114n6792
17511B55871N4383M0911k5291m4772o9068Q141K2171N4579k4595n4071J8452J01726
17499C38437j485l2517L2434M4062L4001j528m2252k8991j2709J8956M918N6589
17487D09915Q3114L0460Q9772O0100K7712n7109M7952J100j28254p3815L7889
17476E28836L1834j9179m1821r9533p5011K7744N4250L03j7404J9667k5755m9379
17464C34552j2504j1234k2397K7501P9464M0413J6709m7079o6756O834L894k2142
17452C27255l0425p3K7541L1930j7130n3993l1802J6282k4230n7982M4586N6586
17440B88545J3429l507k1356m4306J2590k2536O167J7888k5337m0566Q870k9252
$$ plain form
17523 398795 315588 308654 331500 296040 301892 361270 374815 360944 381181 394777 312663 255871
17511 255871 310254 351165 325874 281102 212034 220175 242346 296925 272330 218259 236711 338437
17499 338437 336952 304435 336869 380931 414932 413404 371152 342161 329452 348408 353326 409915
17487 409915 493029 523489 613261 673361 701073 643964 691916 693016 564762 490947 528836
17476 528836 560670 541491 499670 400137 325126 352870 407120 407423 390019 409686 383931 334552
17464 334552 322048 310814 288417 315918 395382 435795 452504 405425 338669 345503 349397 327255
17452 327255 296830 296757 324298 356228 339098 285105 253303 269585 245355 187373 231959 288545
17440 288545 301974 298467 277111 232805 245395 222859 229026 246914 221577 181011 189881 160629
17428A60629m1604K650J689K8486J321L1237M770K0108k078o7354K4182Q4054
17416B48090N0873K5616o8172o5964J9752L2412n834N6693L7061K664k854l8409
17404B91928K646q695p8718q9804N510Q4518p974J2561K6413N0377k5464J8048
17392B81346J2900k7525L0939j6691l1870L0285N75k8433k2693J8152J8824m0324
17380B25485n089l1710p1411p9041J2624P9830L3120Q567O7476q49p5503o7618
17368I5881N4754o158J731p20J5267K5952k161m2219q118N128N9362K4810K370
17355B25879M5677M8813J04899L153l4179o5506j6437P17N482P665J5370m737
17343C36796K0035l8152P873K2006r525l0145n2709J429O8306J6193j0462N2474
$$ plain form
17428 160629 119025 121675 123364 151850 153171 184408 189178 209286 207208 139854 164036 248090
17416 248090 298963 324579 256407 190443 210195 242607 236773 293466 330527 333191 330337 291928
17404 291928 294574 285879 207161 117357 122867 207385 199411 211972 238385 288762 263298 281346
17392 281346 294246 266721 297660 280969 249099 279384 279959 251526 228833 246985 265809 225485
17380 225485 220396 188686 117275 38234 50858 130688 163808 172375 239851 239002 163499 95881
17368 95881 150635 144477 146208 145488 160755 186707 184546 142327 134209 139337 198699 223509 225879
17355 225879 271556 320369 425268 428421 394242 328736 312299 313016 318498 326163 341533 336796
17343 336796 356831 318679 326552 348558 339033 308888 256179 257608 325914 342107 331645 384119
17331C84119O0641k5793K510K9655k9711Q989K0636J5522k1205K0085J5558K741
17319D83747M8957K8929l7885n2315K4671O2415k4925k939N0386L2608k1430j5447
17307E76772l192N1310K6274m851l4719L1999K3328k4104O141M1567K141n8145
17295F34521M0489J10132O4660m4524j2953M5296J8605o793l9616K4193n330N8255
17283H86935p953r630N6286N6521K5162O4694J8485J1963N8092m0711L4661O7317
17271A221822l5173K905Q0524J21577M1636J6199K5596J2817Q1863O3323L81J4245
17259A647715K213O8214N7007K9366K737K0317O5400N7402O7406R7190J09679
17248B224646Q6974R6213N0812M0840P9881J26060J10244R0968Q1037R8971J44775
$$ plain form
17331 384119 444760 418967 421477 451132 421421 430410 451046 466568 445363 465448 481006 483747
17319 483747 532704 561633 523748 471433 496104 558519 533594 530655 581041 613649 592219 576772
17307 576772 573580 624890 651164 646313 611594 643593 666921 642817 648958 690525 692666 634521
17295 634521 675010 785142 849802 805278 792325 837621 856226 849433 809817 834010 828680 886935
17283 886935 878982 869352 925638 982159 1007321 1072015 1090500 1102463 1160555 1119844 1154505 1221822
17271 1221822 1186649 1189554 1270078 1391655 1433291 1449490 1475086 1487903 1569766 1633089 1633470 1647715
17259 1647715 1649928 1718142 1775149 1804515 1807252 1827569 1892969 1950371 2017777 2114967 2224646
17248 2224646 2311620 2407833 2458645 2499485 2579366 2705426 2815670 2906638 2987675 3086646 3231421
17237C231421K36436J74633K15250J67164K00334K45747K88432L15419L36705
17228E411541M42421M74286N40651O04304O89502Q08210R55093J153881J351572
17219A2431461J554511J677442J617730J349626R77314M84052L08941M04097R21610
17210B1726784J553352K329821L362020M615279O165312Q120669J0436001J2555816
17202G0865054J3671675J3025222J0232572M932962k128381q168239j1232006
17195I1198859j1771452j0615742q393284n905170l681972j933093q13283l67054
17187D7717809n97647j487885k611152l625238m038512l794453l107978k421110
17179B6033834j836379j290569q95609o45356m92464k32626o2854j2026J2750
$$ plain form
17237 3231421 3467857 3642490 3857740 4024904 4225238 4470985 4759417 5074836 5411541
17228 5411541 5853962 6328248 6868899 7473203 8162705 8970915 9926008 11079889 12431461
17219 12431461 13985972 15663414 17281144 18630770 19608084 20092136 20401077 20805174 21726784
17210 21726784 23280136 25609957 28971977 33587256 39752568 47873237 58309238 70865054
17202 70865054 84536729 97561951 107794523 112727485 110599104 102430865 91198859
17195 91198859 79427407 68811665 60418381 54513211 50831239 48898146 48084863 47717809
17187 47717809 47120162 45632277 43021125 39395887 35357375 31562922 28454944 26033834
17179 26033834 24197455 22906886 22011277 21365921 20873457 20640831 20577977 20565951 20578701
17170B0578701J18008K28193L44161M72353O78980J062998J462145J936981K462506
17161B9345026L034580L429275L464080L069513K246799J223109M61012N54777
17153D6828171J531075L105568N110218P229894R113472J0176831R915179P901710
17145A00912118M016709j128601o599934j1417220j3577387j2627054j0112773
17138D9465858p457001n411349l922250k885109k101203j497407j029562n99930
17130B4562047l70690l79942n60046r24568j287106j483065j424890j333380j127669
17121A5670691q66163o88792n53718n41654n72383m59158m52959n52522n47945
17112A0435397n23953n53823m45456m25416m20937m27440m24976l64735k82670
$$ plain form
17170 20578701 20696709 20924902 21269063 21741416 22420396 23483394 24945539 26882520 29345026
17161 29345026 32379606 35808881 39272961 42342474 44589273 45812382 46273394 46828171
17153 46828171 48359246 51464814 56575032 63804926 72918398 83095229 93010408 100912118
17145 100912118 104928827 103800226 97200292 85783072 72205685 59578631 49465858
17138 49465858 42008857 36597508 32675258 29790149 27688946 26191539 25161977 24562047
17130 24562047 24191357 23811415 23251369 22326801 21039695 19556630 18131740 16798360 15670691
17121 15670691 14804528 14115736 13562018 13020364 12447981 11988823 11535864 10983342 10435397
17112 10435397 9911444 9357621 8912165 8486749 8065812 7638372 7213396 6848661 6565991
17103F565991k94442l19128k74665k45275j72488k08953k38179j94199j75444
17094D443218j72850j44162j70187k05642j48432j70896j13305j66174p2824r2372
17084B986374j01971j06683j74780q0440m9841j15475j31096r5373q8796j23875
17074A918044m5840j2602n1935q7914k8829L751q5802j35027j60599q1122j0666
17063A221459l1822p6150k9383l2673p536L0282l4095m4273n4970p1666k5167
17052H44006M170n9191k475j2251k401j15316k8023m9038k4514N2907L3578k0430
17040F21022J659J0211N299J1442K1523l8257l4286J7895K9090j596j0454p6598
17028E56950j4740r939M2197J07407m3446j04621P983K1684M1175J3141p565L433
$$ plain form
17103 6565991 6271549 5952421 5677756 5432481 5259993 5051040 4812861 4618662 4443218
17094 4443218 4270368 4126206 3956019 3750377 3601945 3431049 3317744 3151570 3078746 2986374
17084 2986374 2884403 2777720 2602940 2522500 2472659 2357184 2226088 2130715 2041919 1918044
17074 1918044 1872204 1859602 1807667 1719753 1690924 1694675 1608873 1473846 1313247 1232125 1221459
17063 1221459 1189637 1113487 1084104 1051431 1043895 1074177 1040082 995809 940839 869173 844006
17052 844006 848176 788985 786510 774259 771858 656542 628519 579481 554967 607874 641452 621022
17040 621022 622681 632892 638191 649633 671156 632899 598613 616508 645598 644002 633548 556950
17028 556950 542210 532271 574468 681875 638429 533808 541791 563475 604650 617791 610226 613659
17016F13659K0571L7895k6020p7216j2420l2461n6008m566j6896k3019M6943o9218
17004D01244j4719O7596K0608L9562j1130q0227J0319P2091J1387j1500k8572
16993D76659n3731L094n263K8903k2930q0163K3158O2488j4621k9800L2910J0379
16981D31083L9655j0883k1540n8222L0422j3322R789L2323R232Q844l2115K2104
16969D47370P0450J0236k722K2083n5447o3411l143J2400l1385j0893l1185R44
16957C65297q412L5423j2216m8405K8869R4089M1163j03040r3652O0177j056m5024
16945C13213K8168M3371o8699m6982j8475l9473K8942O3918M2401L6004n9402
16934C22986o601j4412n820J5922o1428k5928r257n1731k3844K6282J18618K9357
$$ plain form
17016 613659 634230 672125 646105 568889 556469 524008 468000 463434 446538 423519 470462 401244
17004 401244 386525 454121 474729 514291 503161 422934 433253 505344 516731 505231 476659
16993 476659 422928 426022 420759 449662 426732 346569 369727 432215 417594 387794 420704 431083
16981 431083 470738 459855 438315 380093 410515 397193 406982 439305 448537 457381 425266 447370
16969 447370 517820 528056 525334 547417 491970 428559 425416 437816 406431 395538 364353 365297
16957 365297 356885 392308 380092 331687 360556 454645 495808 392768 299116 359293 358237 313213
16945 313213 341381 384752 316053 269071 250596 211123 240065 303983 346384 382388 322986
16934 322986 316385 301973 296153 312075 250647 224719 215462 163731 139887 166169 284787 314144
16922C14144n8678m4561m9248j4600J9248K3367O1598j3036K8617J344p782L1754
16910B92167k5787j9862o719m3492k6577J9396J0427q755j1094J3670l027j6911
16898A73436K0953l120j7068M2707J4126o4149l0135K4597L1986k7172n8316K6276
16886A34121j0621K688k3820R365M6537k3619m3331N2363P4358j6644n1978l3551
16874A15868K3553l0179m9933l7369k3039K9785O1761k6251l0213J5476q761K3679
16862F4377j9782o5554K1269O0627L8706N1991J2865l6155n7303l1417Q924Q470
16850E7018O3814L5718k6401l2247n7059j6271K7163K9265K0951j4928J8954k1490
16838H4487j7529r456P477n4749p796M4248J1029j4065P6640P63o7745m0761o743
$$ plain form
16922 314144 255466 210905 161657 147057 166305 189672 251270 238234 266851 268195 260413 292167
16910 292167 266380 246518 239799 196307 169730 189126 199553 190798 179704 193374 190347 173436
16898 173436 194389 191269 174201 216908 231034 166885 136750 161347 193333 166161 107845 134121
16886 134121 123500 126188 102368 111733 158270 134651 91320 143683 218041 201397 149419 115868
16874 115868 139421 109242 59309 21940 -1099 28686 90447 64196 33983 49459 40698 64377
16862 64377 44595 -20959 310 60937 99643 151634 164499 128344 71041 39624 48548 57018
16850 57018 120832 156550 130149 97902 40843 24572 51735 81000 101951 87023 105977 84487
16838 84487 66958 57502 64979 10230 2434 46682 57711 43646 120286 121049 53304 12543 5800
16825E800M8173L293j2180R857n2442L4408P7225N2766k2751j541n49k2613p2962
16812D6484j4293L3922N43K1637L2505J4520k5092o9572j917O4296K8675k5777
16800A05931l4429q00j5891o6463m6947P709m696N2387K9647M2313J7331K3391
16788A09483P6215k9151m8753l9306o8848P955K7527K3532l8677J6895M2152j6147
16776F2877j1156L0668J1254q4635l1745N554l7197M4998J7645l3738L9718J5825
16764C0068Q3034L3972k7949j2410j8326o1373p6210l9855K8067J6994j0322N5428
16752A118J5809N8361K015n3758m2407n8667k5946O4959Q4467k719J9341n0158
16740A2415k4925P092o183k9941O0884J2573k4949M8929K0179L9777J9921m5L9395
$$ plain form
16825 5800 53973 57266 45086 54943 2501 36909 114134 166900 144149 142608 142059 119446 46484
16812 46484 32191 66113 66656 88293 120798 135318 110226 40654 38737 103033 131708 105931
16800 105931 71502 70702 54811 -11652 -58599 -50890 -55586 -3199 26448 68761 86092 109483
16788 109483 185698 156547 107794 68488 -360 7595 35122 58654 19977 36872 79024 62877
16776 62877 51721 82389 93643 9008 -22737 -17183 -54380 -9382 8263 -25475 14243 30068
16764 30068 113102 147074 119125 106715 88389 27016 -49194 -89049 -60982 -43988 -54310 1118
16752 1118 16927 75288 77303 23545 -18862 -77529 -103475 -38516 45951 43232 62573 12415
16740 12415 -12510 -5418 -11601 -41542 19342 31915 6966 55895 76074 115851 135772 135727 175122
16727A75122m2902r6870o1705K9780K8201R074r027J9947N1895K0762J6383N6406
16715A97066L3163l9216m609L3259j7083J9828n422P2709O2095l3625m7223J7926
16703B88868L835P6861J08993N8073n3996q7117j2338K8428K6833P279k151j9106
16691D24462J5684j2741p5871o5327o632m2567l2139J9827J0679o2719l5405l607
16679A33644K034O3937O7420L3342o2985m5005j3845k7868l201K3327n618j465
16667A63717k8821K5444K3594q927L0919j7559q974K158K9132L101L8122j4703
16655B37203l502Q1865J7949J7326L1971j8338n804L0854N088j5643k6226k8164
16643C24579k367J7070p645O945L417l9448j8697K8291p446m9047l1221l3842
$$ plain form
16727 175122 132220 35350 -26355 3425 31626 40700 31673 51620 103515 124277 140660 197066
16715 197066 230229 191013 186404 219663 202580 222408 216986 289695 351790 318165 270942 288868
16703 288868 292703 369564 478557 536630 482634 395517 383179 411607 438440 445719 443568 424462
16691 424462 440146 427405 351534 286207 279575 237008 204869 224696 235375 172656 137251 133644
16679 133644 135678 199615 267035 300377 237392 192387 178542 150674 147473 170800 165182 163717
16667 163717 134896 160340 183934 175007 205926 188367 179393 181551 210683 213784 251906 237203
16655 237203 233701 315566 333515 350841 382812 364474 358670 389524 394612 378969 352743 324579
16643 324579 322212 339282 331637 338582 341999 302551 283854 312145 304699 255652 224431 190589
16631A90589o157K4969k2M066K6338m3825l4416P495j8811k7409N5450M2848n914
16618B15201k1699p691l2575m9678n1505l4251J5306J0128k6049k2569K0327m636
16606A0309L9779M0318K84J8137K1434k7774n0042O557M874k3790J8138k4119
16594C4105j6725r079l9265J4250k1628k8358M3672L3891l4144l3243N6478M4011
16582D3965j866l4398j4859L5837O8152j0148n2479J040q753n2328p839j4711
16570d8387j0934L7995n568M3836K0843l8246R145R940m2181l5388R259J121j5974
16557f4539J3426m1817l9295N9937l1315m3625J9851K3036O5963O4486M3940J2432
16545H2480j848r542p0853n5430k6250n990K0898j4616m119L7876k678j2830J6472
$$ plain form
16631 190589 184432 209401 209379 213445 239783 195958 161542 169037 150226 122817 178267 221115 215201
16618 215201 193502 185811 153236 103558 52053 17802 33108 43236 17187 -5382 14945 10309
16606 10309 50088 90406 90690 108827 130261 102487 52445 59002 63876 40086 58224 34105
16594 34105 17380 8301 -30964 -16714 -38342 -66700 -23028 10863 -23281 -56524 -46 43965
16582 43965 42099 7701 -7158 28679 96831 86683 34204 35244 26491 -25837 -33676 -48387
16570 -48387 -59321 -21326 -26894 16942 37785 -461 8684 18624 -23557 -58945 -49686 -48565 -64539
16557 -64539 -51113 -92930 -132225 -72288 -103603 -147228 -127377 -104341 -38378 26108 70048 82480
16545 82480 80632 71090 237 -55193 -81443 -87433 -66535 -81151 -85270 -47394 -50072 -62902 -46430
16532d6430N686k9669k0563K0328M0869J3071J8074L2181J0584m3020q6398k9315
16520a14602P7307M3928j2875J2603M8397j6153l0608k7352N636M4162o077l2635
16508h269l1494l7443k886O5117O7891K5552n4463k955n3821J4386l1759p7603
16496a27747N9313J8283O5359K2181m2074p0037L1480M0139n6846N4027O5821
16485E9899k2849K581K121k0482n1707L0508M3785k1891n8031L9311m377k7593
16473b8725J0334K857J377m7361J7441N4956J4540n662K4016K3491p3451K2144
16461A5957M585J7271M3181J5950o2089k8751m886j3076L0583J4292j363n628
16449B6026p198J1637O8281L544n2568o8405o8425M4154J1574K5854j4183K9954
$$ plain form
16532 -46430 -40744 -70413 -90976 -70648 -29779 -16708 1366 33547 44131 1111 -85287 -114602
16520 -114602 -37295 6633 -6242 6361 54758 38605 7997 -19355 -13719 30443 24366 -8269
16508 -8269 -39763 -77206 -80092 -14975 52916 78468 24005 21050 -32771 -18385 -50144 -127747
16496 -127747 -68434 -50151 15208 37389 -4685 -74722 -43242 -3103 -59949 -5922 59899
16485 59899 37050 39631 41752 21270 -30437 71 43856 21965 -36066 3245 -1132 -28725
16473 -28725 -18391 -15534 -14157 -61518 -44077 10879 25419 19757 43773 67264 -6187 15957
16461 15957 20542 37813 80994 96944 34855 6104 1218 -11858 18725 33017 31654 26026
16449 26026 18828 30465 98746 102290 49722 -18683 -87108 -42954 -31380 -5526 -19709 10245
16437A0245J9656k3099m2116j5536L9249m7954R307N4728k2849J2232o1880l1305
16425i9322k8088L4621L3123K6834J8312R195K0736j3972J0347k8826j8158O271
16413b8927m6922K9142L1917K7332m2806j7932N3267k459M7764K2844l0264n8615
16401a5659l5487K8864P2927r14o5405M6045L9095K779m2124k3894K5156K6631
16389E8014M007p049K461k0969J8582k6994k1314K162n072m4124o649M4789J3578
16376A1422j753j077p8950l5359O0529L0362n0632R129J3261L7746M8346J7396
16364F0420o4728J0957P508n397O011k8060R555l3275k7074L195K8496L600M2066
16351A3274K115K4892L3204l4197m8829l7490J0691L7998k8218M4508N3074r978
$$ plain form
16437 10245 29901 6802 -35314 -50850 -11601 -59555 -50248 4480 -18369 -6137 -68017 -99322
16425 -99322 -127410 -92789 -59666 -32832 -14520 -5325 15411 1439 11786 -17040 -35198 -28927
16413 -28927 -75849 -46707 -14790 12542 -30264 -48196 5071 2612 50376 73220 42956 -15659
16401 -15659 -51146 -22282 50645 49731 -15674 30371 69466 72245 30121 6227 31383 58014
16389 58014 62021 54972 57433 36464 55046 28052 6738 8900 3828 -40296 -46945 -2156 11422
16376 11422 9669 8592 -70358 -105717 -45188 -14826 -65458 -56329 -43068 -5322 43024 60420
16364 60420 -4308 6649 14157 8760 14771 -13289 -3734 -37009 -64083 -60888 -32392 -28792 13274
16351 13274 15389 40281 73485 39288 -9541 -47031 -36340 1658 -26560 17948 71022 61044
16339F1044O4759p293l586j1333m7249k5359Q894j8859j8587O513K4635o0260
16327b6681j0244J5995K4605J5552j2486p3239J6597K5847J4723O8398P195l0743
16315C5519k0903L3372K1772K5057l7198m960N47j0975j2932K0794j8449M284
16303C5928J3567R491m3005m0743L385j3727j3014J6981O6976J2336l229j2429
16291C2517n7829m6658j8078K3582M9569M2951K3746J320m7847L4344M7988m7349
16279C8256j04163l2365M709N6891L0980k6338k2815j6374n168L3691N7335L1092
16267D5731j5001j1476j6230j5802M0155N607k4641p9114L4521N4173J6321K2075
16255E6319O744l8087j1619P323j504m3674J8286K8479k6771L2124j0349L3397
$$ plain form
16339 61044 125803 118510 114924 103591 56342 30983 39877 21018 2431 8944 33579 -26681
16327 -26681 -36925 -20930 3675 19227 6741 -66498 -49901 -24054 -9331 59067 66262 35519
16315 35519 14616 47988 69760 94817 57619 52659 53206 42231 29299 50093 31644 35928
16303 35928 49495 58986 15981 -24762 -21377 -35104 -48118 -31137 35839 48175 44946 32517
16291 32517 -25312 -71970 -90048 -66466 -16897 26054 49800 51120 3273 37617 85605 38256
16279 38256 -65907 -98272 -93563 -36672 -5692 -32030 -54845 -71219 -76387 -42696 14639 45731
16267 45731 30730 19254 3024 -12778 27377 32984 8343 -70771 -36250 17923 34244 56319
16255 56319 63063 24976 13357 20680 19176 -24498 -6212 22267 -4504 27620 17271 50668
16243E0668m3044q9181l730L2292J0820L1840o084m3054L3780M0950K300J0830
16231B8387J4837l475n3817k5396O1467o229O041O2730m5315n4393k0890m8759
16219h4812j8878k4901p398M2744O9156k0028n4094J5510O8126M8401J0584j9524
16207B4886j5282J1583J6650m6200l8988K6578P7941J441K6043J0782p5967p3670
16195e4203J5194M7539m0092k8486k8376j8017J5524l9796O886J6906Q8678P6661
16183E8418o5612j2168N3783j2407O1248n1979m6556K0710M0029l4408n9105K4042
16171b4005m192Q378K0606L2420j6495j7531k0481M8579k0971p441M5729J3454
16159E8050l797p075m3914K6343m650q808n9954P309k383K6076K6152k7551k2575
$$ plain form
16243 50668 7624 -81557 -85287 -52995 -42175 -10335 -16419 -59473 -25693 15257 17557 28387
16231 28387 43224 39749 -14068 -39464 22003 15774 21815 84545 39230 -15163 -36053 -84812
16219 -84812 -103690 -128591 -135989 -93245 -24089 -44117 -98211 -82701 -14575 33826 44410 24886
16207 24886 9604 21187 37837 -8363 -47351 -20773 57168 58609 84652 95434 19467 -54203
16195 -54203 -39009 8530 -31562 -60048 -88424 -106441 -90917 -130713 -123827 -106921 -18243 58418
16183 58418 -7194 -19362 34421 22014 83262 31283 -15273 5437 45466 11058 -48047 -24005
16171 -24005 -28197 -19819 787 33207 16712 -819 -21300 27279 6308 -1133 44596 58050
16159 58050 54253 47178 3264 29607 24957 16149 -43805 -36496 -38879 -12803 13349 -14202 -36777
16146c6777K9435M72K803j0984r609j5719K289K8456k4958K3708j6489o0216j572
16133h9161L5774O7153J0352K0768j1102k3666J2197Q3803q461k0932m644K4320
16121I6401j3788K2672J5012l2021p0192p0163p311p0248o2583N4369R2479M4009
16109a364N686J2454L1339L0399n0506j5556K2807j8450J2267j6438j6733L2681
16097B8586k9327k9529j636L3128K6931n1990m4393J1398j4854M295j5466k0264
16085a03121O184j0529j1875L8393j2640J2252l6795O7462l3382J222K1561L2512
16073b8756Q836o2523o8821l7720K0452J9858L0080L0108N0654J7726K2611j8398
16061a5893N7752K6801o3067j652O9871K2750k3132j00029o3389k0189L4921J09967
$$ plain form
16146 -36777 -7342 -6870 -4067 -15051 -24660 -40379 -38090 -9634 -34592 -10884 -27373 -87589 -89161
16133 -89161 -53387 13766 24118 44886 33784 10118 22315 106118 97657 76725 72081 96401
16121 96401 82613 105285 120297 88276 18084 -52079 -59390 -129638 -192221 -137852 -45373 -1364
16109 -1364 4322 16776 48115 78514 28008 12452 35259 16809 29076 12638 -4095 28586
16097 28586 -741 -30270 -31906 1222 28153 -23837 -68230 -56832 -71686 -67391 -82857 -103121
16085 -103121 -96937 -107466 -119341 -80948 -93588 -81336 -118131 -50669 -84051 -82829 -61268 -28756
16073 -28756 -19920 -82443 -151264 -188984 -168532 -148674 -118594 -88486 -37832 -20106 2505 -15893
16061 -15893 41859 68660 5593 3941 73812 96562 73430 -26599 -89988 -110177 -75256 34711
16049C4711J6275l2317K9088j1630k119N8016k1932m7241K7610O3570J9468n4731
16037G8768j8607j7838K6995R2100l898m1533L986k1547r745L464n896q269M055
16024H2035J6381l6274p3987j693K4464k0521j7284L0784N8285j6298m0734o555
16012a397K3368j8608k1160p808M7799K426n7184n1918J0750O2312J0534m7402
16000d8288L1872j1774j2141J3408J7492K9976n714o783k0176J3848L0695q791
15988B3624R64n02k6739J4138M1110k6362n6635m3263P0353L6278l7859k1955
15976b6848J042l5424k2341K2698Q84J3312N1721L3832J2007j3804p882m7713
15964a8516k4302J3697L6644J9523O512J7216l6268l9784Q344K5490N462N285
$$ plain form
16049 34711 50986 18669 47757 36127 34008 92024 70092 22851 50461 114031 133499 78768
16037 78768 60161 42323 69318 161418 157520 115987 119973 98426 88681 92145 86249 77980 82035
16024 82035 98416 62142 -11845 -13538 10926 -9595 -26879 3905 62190 45892 5158 -1397
16012 -1397 21971 3363 -17797 -25605 22194 24620 -32564 -84482 -73732 -11420 -886 -48288
16000 -48288 -16416 -28190 -40331 -26923 -9431 20545 14831 8048 -12128 1720 32415 23624
15988 23624 24588 24086 -2653 11485 52595 26233 -30402 -73665 -3312 32966 -4893 -26848
15976 -26848 -25806 -61230 -83571 -60873 -59989 -46677 5044 38876 50883 37079 29197 -18516
15964 -18516 -42818 -29121 7523 27046 33558 50774 14506 -25278 -16934 8556 14018 19303
15952A9303J5971L2612M1146l4327J1962k4112k5721M777l7742k7427J084L1510
15940I036n868L5955O3402L6075o7933n3700K8977K1270Q492K2075m1060k6590
15928C0131j4001k7786K44L7588K620K194M7320M6341q3535P054J6070l4000k2345
15915G895j0487J72k732K101j6924o694O6443J7002N9210K7877n2510J0204k3918
15902G7639r965j3886m2302j8582O4502N9607k4435p278j5094N6125P164J990
15890A35485M021j0259p9475r8299k5238K9958N463K6533M0374J4764l1586M048
15878A5789k5401j6991Q5658j8635j929k7820L3651N816M520J3301L3041J2393
15866A13393m2239L520M151j0560k3139o30Q188J9963k2453k7802M4426N7441
$$ plain form
15952 19303 35274 67886 109032 74705 86667 62555 36834 41611 3869 -23558 -22474 9036
15940 9036 3168 39123 102525 138600 70667 16967 45944 67214 75706 97781 56721 30131
15928 30131 16130 -11656 -11412 26176 28796 30990 78310 124651 41116 48170 64240 30240 7895
15915 7895 -2592 -2420 -5152 -3051 -19975 -26669 39774 56776 115986 143863 91353 101557 77639
15902 77639 67674 53788 11486 -7096 57406 117013 92578 85300 70206 126331 133495 135485
15890 135485 139506 129247 49772 -48527 -73765 -43807 -38344 -11811 28563 43327 11741 15789
15878 15789 -9612 -26603 59055 40420 38491 10671 44322 50138 54658 67959 101000 113393
15866 113393 71154 74674 78825 68265 45126 44496 52684 72647 50194 22392 66818 124259
15854A24259n6076r3735l9124O516L2091M9714L2043j148l2399k0404J0955K8474
15842D1166M6715M1480N006o0359k2580K0651L5795l0189k1119o26K9775L5095
15830A20810K7037j4640n0349j9641J9798N4995L1593l4788m2549m909J8475k6053
15818G9779L0516N1327k4230m0709K2632K0827k0317J9692k4206k5897O295j1783
15806H3926J0660L3872J0113n876K8273j4888k6898j4012j5877K7372M6995J3384
15794A77044j4258Q927J226l2445n1508K9088O2636J2951m3883k7937J8345m0090
15782A00096k8056n041L106Q6925o569n1912k5004K336M2652l2644l389L831L1421
15769A17752M524m3162Q882J296l5991J7822J5874L5140o867l5117L0297o091
$$ plain form
15854 124259 68183 -25552 -64676 -58160 -26069 23645 55688 54540 22141 1737 12692 41166
15842 41166 87881 129361 134367 74008 51428 72079 107874 77685 56566 55940 85715 120810
15830 120810 147847 133207 82858 63217 83015 138010 169603 134815 92266 87357 105832 79779
15818 79779 110295 161622 137392 96683 119315 140142 119825 139517 115311 89414 95709 83926
15806 83926 94586 128458 138571 132695 160968 146080 119182 105170 89293 116665 163660 177044
15794 177044 162786 171713 172939 140494 88986 118074 180710 193661 149778 121841 140186 100096
15782 100096 72040 66999 70105 157030 150461 98549 73545 75881 118533 85889 82500 86331 117752
15769 117752 122276 79114 87996 89292 53301 71123 86997 122137 115270 80153 110450 104359
15757A04359O1508m044k0922k9625J3077j0845J6812L9000n635n2642r871Q342
15745A09514j8916M2367L7211n1156L8200J8403o1009P375l848M502N1361J0109
15733A84113j3046K8956r750l4143l5623n035j516L50n819r278n872k7246J0048
15720G6139K3865K4132N8138K8561j7475p2470J0731P5272R184n4205r997J4064
15708A65939k397J5774j0487L9598M0331k2233J0734k1168l7224L0325M8986j0227
15696B47951Q167J7346O251K1692J1370k8359J8981J7391L4116k0793N96P4313
15684D09022R572N5292L7888j6335p09M8463M9955L3232M3635Q359M2598M6604
15672G67576O9933O7013N5898K6631M5837M1421M2978J5410m6885q5282n1527
$$ plain form
15757 104359 165867 161823 140901 111276 124353 113508 130320 169320 163685 111043 101172 109514
15745 109514 90598 132965 170176 119020 157220 175623 114614 121989 118141 122643 174004 184113
15733 184113 171067 200023 190273 156130 120507 115472 113956 114306 108487 99209 93337 66091 76139
15720 76139 100004 124136 182274 210835 193360 120890 131621 206893 216077 161872 151875 165939
15708 165939 163542 179316 168829 208427 248758 226525 237259 216091 178867 209192 258178 247951
15696 247951 256118 273464 279715 301407 312777 284418 303399 320790 354906 334113 334709 409022
15684 409022 418594 473886 511774 495439 494730 543193 593148 626380 670015 678374 720972 767576
15672 767576 837509 904522 960420 987051 1032888 1074309 1117287 1132697 1085812 1000530 949003
15661I49003o393l2660p2035q4957Q004q72m5899q522k979o6418j5211J00316
15649G21377L2619n1921L3773j1795q6781n8164N3064k59k1558o0927k6683k2608
15637E00137L136J3659r4039j5457J2677K1016K1276j6488p617k4579l7382M0001
15625D16340j0674Q687k2678k5932J6861R3227M7578j1354r383m743k3882L6241
15613E10288j6247K7073K3392J2342q0727n4686L0674M7778j9792J9527l1642
15602D67980J2960K6007l7207K3314K4484K8992l3055k0129L320J4452N1362R880
15590E72360n3829l354n368m4378Q114N7820j7670R451N5983K1401J1722K9437
15578F41689k2114J7432j7239n0473l3592O0106J237J6734J5488K8768J2154N3387
$$ plain form
15661 949003 942610 909950 837915 752958 760962 760090 714191 705669 702690 636272 621061 721377
15649 721377 753996 702075 735848 724053 637272 579108 632172 631913 610355 549428 522745 500137
15637 500137 503273 516932 422893 407436 420113 441129 462405 445917 438300 413721 376339 416340
15625 416340 405666 414353 391675 365743 382604 475831 523409 512055 502672 497929 474047 510288
15613 510288 494041 521114 544506 556848 476121 421435 452109 499887 480095 499622 467980
15602 467980 480940 506947 469740 493054 517538 546530 513475 493346 496666 511118 562480 572360
15590 572360 518531 515177 509809 465431 473545 531365 513695 523146 579129 600530 612252 641689
15578 641689 619575 637007 619768 569295 535703 595809 597046 613780 629268 658036 670190 723577
15566G23577j0787j2991K1142O203r68K0023J8304J1181K014q880O0208m407j6299
15553H08320J7797J6675l8509L7130J6216J6555q630p544M8658L4515L6650P4506
15541A052339K4488L9459M5991M158m4713m0461J875K148L9807K1274L6122L0426
15529A212913O8077M226k0163J3995K3592M5462K8368N3004J065r838N3188N8474
15517A532363O3830Q256Q24K334K3074J0504K7042K4560O1371P971K8341J03840
15505A894310N6057P1052L4745K4974r877J0393M962L5194O8390O7363M783L1482
15493B293828K9909Q8233M8607N0134N7755P9561O6319O7579Q931P7899N8434
15482B927189L5230J13990P6444Q7615N103L7093J28837R7394R7450R7411J12805
$$ plain form
15566 723577 712790 699799 720941 727144 726176 746199 764503 775684 777698 768818 829026 824619 808320
15553 808320 826117 842792 804283 841413 857629 874184 865554 858010 906668 941183 977833 1052339
15541 1052339 1076827 1116286 1162277 1166435 1121722 1081261 1083136 1085284 1125091 1146365 1182487 1212913
15529 1212913 1280990 1285216 1265053 1279048 1302640 1348102 1376470 1429474 1430539 1420701 1473889 1532363
15517 1532363 1596193 1604449 1605273 1607607 1630681 1641185 1668227 1692787 1754158 1762129 1790470 1894310
15505 1894310 1950367 2021419 2056164 2081138 2071261 2081654 2086616 2121810 2190200 2257563 2262346 2293828
15493 2293828 2323737 2411970 2460577 2510711 2568466 2648027 2714346 2781925 2790856 2868755 2927189
15482 2927189 2962419 3076409 3152853 3240468 3245571 3282664 3411501 3508895 3606345 3703756 3816561
15471C816561J04453J33030O4658Q2974J50695P3502Q2837J14810R2807J50062
15461D866389J78757J60473J59944J09643J23875J69030J36956K52488K35435
15452F392990K23538J75654K32045K52412K51797K51514K39197K99646L56791
15443H675584L98277L00794M10530M66001L62412M51831N97732N44275N56886
15434A2764322O09438O90550P02679P66465Q01974Q32664R42022J033524J057371
15425B0201009J254547J408550J519007J560723J769504J882863K029032K325685
15417C3950920K510398K716907K918041L246055L559636L852151M215887M540714
15409F1510709M872525N132355N320714N388817N353036N078463M704400M078142
$$ plain form
15471 3816561 3921014 4054044 4118702 4201676 4352371 4425873 4508710 4623520 4716327 4866389
15461 4866389 5045146 5205619 5365563 5475206 5599081 5768111 5905067 6157555 6392990
15452 6392990 6616528 6792182 7024227 7276639 7528436 7779950 8019147 8318793 8675584
15443 8675584 9073861 9374655 9785185 10251186 10613598 11065429 11663161 12207436 12764322
15434 12764322 13373760 14064310 14766989 15533454 16335428 17168092 18110114 19143638 20201009
15425 20201009 21455556 22864106 24383113 25943836 27713340 29596203 31625235 33950920
15417 33950920 36461318 39178225 42096266 45342321 48901957 52754108 56969995 61510709
15409 61510709 66383234 71515589 76836303 82225120 87578156 92656619 97361019 101439161
15401A01439161L224368K182086R74378k32383j487424k539660l387018m110553
15393I6062955m578139m868858m881034m868873m731777m437348m083590l804334
15385E9809002l479722l192403k983768k713086k412894k236136k009413j890735
15377C8890845j761778j634602j464228j366084j312437j191841j143808j085438
15369B7930629j094719j077434j050143r11775q61802q91092r16285q06320p97901
15360A9523158q08192p05915p23832p25787p11430n96830o19714n87832o14159
15351A3429467m72942m52111m89906m78311m36085m30239l65031l05210l39113
15342I660519m21994l83538l05878k58774l14569l06705l36214l04206j92751
$$ plain form
15401 101439161 104663529 106845615 107819993 107587610 106100186 103560526 100173508 96062955
15393 96062955 91484816 86615958 81734924 76866051 72134274 67696926 63613336 59809002
15385 59809002 56329280 53136877 50153109 47440023 45027129 42790993 40781580 38890845
15377 38890845 37129067 35494465 34030237 32664153 31351716 30159875 29016067 27930629
15369 27930629 26835910 25758476 24708333 23796558 22934756 22043664 21127379 20321059 19523158
15360 19523158 18714966 18009051 17285219 16559432 15848002 15251172 14631458 14043626 13429467
15351 13429467 12956525 12504414 12014508 11536197 11100112 10669873 10304842 9999632 9660519
15342 9660519 9238525 8854987 8549109 8290335 7975766 7669061 7332847 7028641 6835890
15333F835890j59424k15279k09494k63991j97662j55925j62600j97203j70303
15324E104009j43568j04178j64871j45782j08103k19888j71077o7674j53123j42449
15314C683296p3003q3065r0277j16685l0328l4360o9110j65042j16438m7232r6897
15303B760859p6698p3399l3091l9416j05849r8762k9915m9411q9879k8236l2746
15292B103457q8041q2796n9183o1936J6256L069j4717n1723o4973L408j1155o5625
15280A626041o2256M3420J6543o607k9380m6M027m6923L544l5899n6688q3345
15268A372431n3113K1492J0674p0843L1876N2359l1905n9688j9125j2539n4565
15257A187054j0118q140O493l5554K083K049l5731o9791j9291m259N6594L777
$$ plain form
15333 6835890 6676466 6461187 6251693 5987702 5790040 5634115 5471515 5274312 5104009
15324 5104009 4960441 4856263 4691392 4545610 4437507 4217619 4046542 3978868 3825745 3683296
15314 3683296 3610293 3527228 3436951 3320266 3289938 3255578 3186468 3021426 2904988 2857756 2760859
15303 2760859 2684161 2610762 2577671 2538255 2432406 2333644 2303729 2254318 2164439 2136203 2103457
15292 2103457 2015416 1932620 1873437 1811501 1827757 1830826 1816109 1764386 1699413 1702821 1691666 1626041
15280 1626041 1563785 1607205 1623748 1617141 1587761 1587715 1591742 1544819 1548363 1512464 1455776 1372431
15268 1372431 1319318 1340810 1351484 1280641 1312517 1364876 1332971 1273283 1254158 1241619 1187054
15257 1187054 1176936 1168796 1175289 1139735 1141818 1143867 1108136 1038345 1019054 1014795 1071389 1075166
15245A075166J6606l3101j549p5857m7776j8439N9787K2540j3983m8556J2452
15234I47290O2762L7955k0196L202k4113O0372J2695k1204l8149m1611M714r914
15222I73803m4865j2124p104q384L7873Q772n7118p0304L6985P9819M417m8676
15210H93094p1776n1587Q93M9170K1745m3064q7170j2881L222r805K7113O1014
15198G79968m3245J3795K4088l619K4601o014k4061j9424K607M265l7271L0610
15186G46300k5955j0692k7812K515q3298k9965J4860J234n3063K551O5777N641
15174F08093k500n2970m0253m8644j2851k507m3088N3328M0754L8388J2376J9355
15162E69481J3303K1207m3505l8564P71m7412n1901J3575J1457n341M7681K3398
$$ plain form
15245 1075166 1091772 1058671 1057122 981265 933489 915050 974837 997377 983394 934838 947290
15234 947290 1010052 1048007 1027811 1031013 1006900 1067272 1079967 1058763 1020614 979003 983717 973803
15222 973803 928938 916814 909710 901326 939199 947971 890853 820549 857534 937353 941770 893094
15210 893094 821318 769731 770624 819794 841539 798475 711305 698424 701646 691841 718954 779968
15198 779968 736723 750518 774606 770987 795588 789574 765513 746089 748696 752961 715690 746300
15186 746300 720345 709653 681841 684356 601058 571093 585953 587187 534124 536675 602452 608093
15174 608093 605593 552623 512370 463726 450875 448368 405280 458608 499362 537750 550126 569481
15162 569481 582784 603991 560486 521922 522693 475281 423380 436955 448412 443071 490752 514150
15150E14150n8849k1755K4216k4817j2974J7278k1107l6501j4956M7692K036o169
15138D08244P307M9881M6530K988K6235L4107Q5672q33j446M4237K4585k9775
15126F97732r1626j15144r0766k712j3662o0692M5629N0893K0322k8450o5985
15115C45539l905n4336k8118O838K7041m2597M629K0807N5909k2937J0180M066
15103C23116r518m3065m1372K5229O420l7574L9337R149l5017L3685J3742n1832
15091B32300L2696R880l5938l9564N7891L3414k9478J9392j3194J5704r20L1617
15079C13800l978k3562L7721l3646q6163k0558O8995j1146L7004R27l1131M2963
15067B91226q210q3270k0224M989p2416L6799K1699J0000O6468k1043n4371R724
$$ plain form
15150 514150 455301 433546 457762 432945 419971 437249 416142 379641 364685 412377 414413 408244
15138 408244 415551 465432 511962 514950 541185 575292 660964 660131 658685 702922 727507 697732
15126 697732 606106 490962 400196 397484 383822 323130 368759 419652 439974 411524 345539
15115 345539 341634 287298 259180 266018 293059 250462 255091 275898 331807 308870 319050 323116
15103 323116 313598 270533 229161 254390 260810 223236 262573 271722 236705 270390 284132 232300
15091 232300 264996 274876 238938 199374 257265 290679 261201 280593 267399 283103 282183 313800
15079 313800 309822 286260 323981 290335 204172 183614 252609 241463 278467 279394 248263 291226
15067 291226 283016 199746 179522 184511 112095 148894 170593 180593 247061 226018 171647 181371
15055A81371P039J5184k6661p415P424j8473r717k6775q286R4329N3304n350l0773
15042B25201m8917m5721j440k0971M0407J4942R320J5734k9532j7120k4393K6727
15030A44237J3132K9979k899l5124k332J2963M0366J750k5073o219Q943K3206
15018B02929j787J248P823m0705L2316L1250Q199l1070J332J9586J2850m4913
15006A99058l8760K1227L8517p8693o2776l760j6878M0165L9680l4375k6128K3055
14994A00332L9326K5791k5608L4504p797k4122l2656o4814K783O9706J3302L5281
14982A66028N1888k83n2263p6989m609k854r17N591k7048J8886M6324J8071K0150
14969A61975q2k4601n9115J7159J309J8029O2991j9149n3184l0091M1069K6212
$$ plain form
15055 181371 188410 203594 176933 169518 176942 158469 148752 121977 113691 208020 261324 255974 225201
15042 225201 176284 130563 129123 108152 148559 163501 172821 188555 159023 141903 117510 144237
15030 144237 157369 187348 184449 149325 146993 159956 200322 202072 176999 170780 179723 202929
15018 202929 201142 202390 210213 169508 201824 233074 241273 210203 211535 231121 243971 199058
15006 199058 160298 181525 220042 141349 78573 74813 57935 98100 137780 103405 77277 100332
14994 100332 139658 165449 139841 174345 166548 142426 109770 44956 47739 117445 130747 166028
14982 166028 217916 217633 165370 88381 83772 80918 80001 85592 58544 77430 123754 141825 161975
14969 161975 161893 137292 78177 95336 96645 114674 177665 158516 105332 75241 116310 142522
14957A42522o0385q0282k061K6835l59J6815N28M3293k6896n0161L09L7100K0627
14944F7885o0972J3515M2562J1540n8129j1635M4358O8105R1085p580k7271n489
14932A67974o69k0996j016M7239q5150N100j1444j4502J9539p907n0023J4543
14920F2688m23l9226r499N1439N984J8834o160O876L1802M6295K3642l1252k9125
14907A31875r515o0443l4632l7065n032K4917Q941k4405k8582L1096k5088j4990
14895d2923P1892L2518l9250n4971M1003L0578N8587k0699p6963J0977L3922k1193
14883B3478P696M2836K3271J8243j3104O895j8481q009R489l6587m6476k2791
14871a3540L9529L1818K594r212J494K4678N1502L7421k4529o3634k2233J5142
$$ plain form
14957 142522 82137 1855 -206 26629 26270 43085 43613 86906 60010 9849 10158 47258 67885
14944 67885 6913 20428 62990 74530 16401 4766 49124 117229 208314 200734 173463 167974
14932 167974 167305 146309 145293 192532 107382 112482 101038 86536 106075 98168 48145 62688
14920 62688 62265 23039 13540 64979 70963 89797 83637 90513 122315 168610 192252 161000 131875
14907 131875 122360 61917 27285 -9780 -14812 10105 19046 -5359 -33941 -2845 -27933 -42923
14895 -42923 28969 61487 22237 -32734 8269 38847 97434 76735 -228 10749 44671 23478
14883 23478 31174 74010 97281 115524 102420 109315 90834 82825 92314 55727 9251 -13540
14871 -13540 25989 57807 60401 51189 52683 77361 128863 166284 141755 78121 55888 71030
14859G1030j903l2662l7631k306l0761k4190J8138j212P0302P0550m4342o9739
14847a4726j4337K1282L8987j7056p071r012o1133l7712J0373J0863K1814N6054
14835a674M359L3050j1346K5062M764j2747j1759j2504J0594o2947J0594K7567
14823C013m2337j6163O2616M1862J8891L1757r798n8905K2317L2610l7914k1254
14811B6695J7103q500O2674K4376k8488m5432j3670l947J2497k865l9907l4580
14799c4044K5667L2646K5876k2107J949L043k7269Q922l2524j7936N9417N6678
14787H0318K8449J3174l1460n1121k9716m3966M2465L1982l8589j7408L0973j6993
14775a892K6451R505N4554N38k7933J2967M7733l6141n501L210J7877m713Q632
$$ plain form
14859 71030 69127 36465 -1166 -3472 -34233 -58423 -40285 -41497 28805 99355 55013 -14726
14847 -14726 -29063 -7781 31206 14150 7079 -1933 -63066 -100778 -90405 -79542 -57728 -1674
14835 -1674 2685 35735 24389 49451 54215 41468 29709 17205 27799 -35148 -24554 3013
14823 3013 -39324 -55487 7129 48991 67882 99639 89841 30936 53253 85863 47949 26695
14811 26695 43798 35298 97972 122348 93860 48428 34758 30811 43308 40443 536 -34044
14799 -34044 -8377 24269 50145 28038 29987 33030 5761 14683 -17841 -35777 23640 80318
14787 80318 108767 121941 90481 39360 9644 -34322 8143 40125 1536 -15872 15101 -1892
14775 -1892 24559 34064 88618 89156 61223 74190 121923 85782 80281 83491 101368 96655 105287
14762A05287j8374k3117O446k1426j8605K6224j2519l0554N868m1260n6801j6222
14750i5053M9699N0648N7094Q429q4062l8797k377N1729k1663P15K8836J7132
14738B2330p788L1734J3897k4058n2619k8685J5412L5894n801k6935j2858Q111
14726c1366J2995M3525J9188K8731J9086n1172l7013J9804l5693m612J3250j3151
14714a6428N4518k851K945k522K090n47J3420l2809R461m7802k8821m846M114
14701e0078q318R014N1669k0165m772l5060q0729J6164L4543Q1813L5892m0857
14689a0884j574M6440J7378n4144m6881J9109L9205J9367K5806l717q5283p494
14677d2672o184q5279j3938J1721J04554J11304L1096n2517m4166n3412n2282
$$ plain form
14762 105287 86913 63796 70242 48816 30211 56435 43916 13362 19230 -22030 -78831 -95053
14750 -95053 -45354 5294 62388 70817 -13245 -52042 -54419 -2690 -24353 -23638 5198 22330
14738 22330 14542 46276 60173 36115 -16504 -45189 -29777 6117 316 -26619 -39477 -31366
14726 -31366 -18371 25154 44342 73073 92159 40987 3974 23778 -11915 -16527 -3277 -16428
14714 -16428 38090 35239 38184 35662 37752 37205 50625 17816 27277 -20525 -49346 -54192 -50078
14701 -50078 -58396 -49382 2287 -17878 -22650 -57710 -138439 -122275 -87732 -5919 29973 -10884
14689 -10884 -12458 33982 51360 -2784 -49665 -30556 8649 28016 53822 50105 -35178 -42672
14677 -42672 -48856 -134135 -148073 -136352 -31798 79506 110602 58085 13919 -39493 -91775
14666i1775K7311M2351M6932R013P320o4976m9336L6704J4777k0206q6K9763L4261
14653B2053m1292n338m3856k3116j605N2762M8993O8255K8752J6139l8990m428
14641G8329K9504l1090j5753n906n5239N8055q682J8055K9013K533j6683J2046
14629I4182l369m7049j216K3052m2193m8638k7307p359M0136J1453J3379L69o0678
14616e5238J9165L3189J0647j8668n541J2037K0007p140p652l0629P693l7568
14604e9698k5263j4249P2980N0832l7006j4089L1384j5647J7532l8298l6819J3534
14592e4807Q7755J8674p8808J1726M7832j3374k5348p8058O596L7488K2947L0537
14580A3160p011J3778k815J066K7226J0169m7912k8707N5542k2903n4343J0392
$$ plain form
14666 -91775 -64464 -22113 24819 33832 41152 -23824 -73160 -36456 -21679 -41885 -41971 -12208 22053
14653 22053 -19239 -24577 -68433 -91549 -93154 -40392 8601 76856 105608 121747 82757 78329
14641 78329 107833 76743 60990 55084 -155 57900 49218 67273 96286 98819 82136 94182
14629 94182 90813 43764 42548 65600 23407 -25231 -52538 -59897 -19761 -8308 5071 5440 -55238
14616 -55238 -36073 -2884 7763 -10905 -16446 -4409 15598 8458 806 -29823 -22130 -59698
14604 -59698 -84961 -99210 -26230 24602 -12404 -26493 4891 -10756 6776 -31522 -68341 -54807
14592 -54807 32948 51622 -27186 -15460 32372 18998 -6350 -84408 -77812 -40324 -17377 13160
14580 13160 6149 19927 17112 18178 45404 55573 7661 -21046 34496 11593 -42750 -32358
14568c2358l529J9159k4241K7545R480p778K1159l0938J9246K0243m023l124j4379
14555c538K712l9027l3936L6909P9727Q0093l816p6713o9046n4781Q234M4447
14543b8735L9586j6893O457L6980J6144n5446K4391M7227L1649L606k0106o3228
14531B1632l7409L4755O614L8623P557n0084n6598k5012L1675N9645L2931j6148
14519D8181K5252J2769j4379l8759m5144L0768N1660j02388r3355L6290N1771
14508c7334M5655M3004Q726j8439j9126l5962q641K0744J5689P863l9796j6465
14496c4082M1429M7484J5213L507m460O7177O13m396k3240m4386k3969Q5561K0191
14483A46642j0569J2253n2880l839j874l698Q210j081j1439l1677m325m1257o8936
$$ plain form
14568 -32358 -35887 -16728 -40969 -13424 -3944 -11722 9437 -21501 -2255 17988 13965 10841 -3538
14555 -3538 -826 -39853 -73789 -36880 42847 122940 119124 42411 -26635 -81416 -73182 -28735
14543 -28735 10851 -6042 415 37395 53539 -1907 22484 69711 101360 104966 84860 21632
14531 21632 -15777 18978 25592 64215 71772 21688 -34910 -59922 -28247 31398 64329 48181
14519 48181 73433 86202 71823 33064 -12080 18688 70348 -32040 -125395 -89105 -37334
14508 -37334 8321 51325 60051 41612 22486 -13476 -22117 -1373 14316 22179 -17617 -34082
14496 -34082 7347 54831 70044 73551 69091 136268 136881 132485 109245 64859 40890 126451 146642
14483 146642 136073 148326 95446 91607 89733 86035 94245 93164 81725 50048 45723 4466 -64470
14470f4470j5140j1872K7331K5343k9372l6085J7863K6779M0021k4601O7634l3380
14458i949o7080J4499O5404j2077K0699N443J2248q40M1951N5843k0577o0450
14446D5114j8628K397J8200N1170M3693k9108m8116o6207l9715K873K1885J0557
14434e885K3310p5070m5663q975L0448J1646J7239K4796l3826q6147l753M5259
14422a06621J445M9283K0956K2975P218k6508p140k6J3182m4424o0335l6793L2919
14409a33869M3387K2427O2546N8336m54r270j647J1618J4995m729j5112j1310
14397C6918j3642j2010K026M6937L5985L8731n4397j15018p4588L1630M3940P5085
14385D1597k3499l2520k1714O1264K034k3726l3839J6370j8012j3568J03M4709
$$ plain form
14470 -64470 -79610 -91482 -64151 -38808 -68180 -104265 -86402 -59623 -19602 -44203 23431 -9949
14458 -9949 -77029 -62530 2874 -9203 11496 16939 29187 28347 70298 126141 105564 45114
14446 45114 26486 28883 47083 98253 141946 112838 64722 -1485 -41200 -38327 -16442 -5885
14434 -5885 17425 -57645 -103308 -112283 -81835 -70189 -52950 -28154 -61980 -148127 -151880 -106621
14422 -106621 -105176 -55893 -34937 -11962 -4744 -31252 -38392 -38418 -25236 -69660 -129995 -166788 -133869
14409 -133869 -90482 -68055 -5509 52827 52373 43103 41456 53074 68069 63340 48228 36918
14397 36918 23276 11266 13292 60229 96214 134945 80548 -34470 -109058 -77428 -33488 41597
14385 41597 18098 -14422 -36136 25128 27162 3436 -30403 -14033 -32045 -45613 -45510 -801
14373h01n524o5628M7350M130l7265p975O191J6802K1151j8917m932K4643J8057
14360b718J3644j431j6423L339K5349l6494l429O3973M8307k9025n0145n5074
14348d0127J223J12022M0488o1473m6937L407M1610K6192o2220k7298l0741j0486
14336e4340R4118O3165K7880P36l3012p8636k7165l2076o159L1079L1034P9538
14324I6162L7733r3528o6819k8101L1744J8519O990k5949O9566M2485j900k391
14312H4511n6351m7386o0182K7748k3112J1473O6000P120K7490M7652k6210l0171
14300B8582M159l0477P026j1438j936L2072k2726k4985K293j6932k0084K6667
14288b7779J8251K5689j1021L60K5127K3241r857n8249N499j9075K8856K6575
$$ plain form
14373 -801 -6325 -71953 -24603 -20473 -57738 -65713 -59522 -42720 -21569 -40486 -45418 -20775 -2718
14360 -2718 10926 9495 -6928 -3589 21760 -14734 -18163 45810 94117 65092 14947 -40127
14348 -40127 -38904 73118 113606 52133 5196 8603 50213 76405 14185 -13113 -43854 -54340
14336 -54340 39778 102943 130823 131559 98547 19911 -7254 -39330 -45489 -14410 16624 96162
14324 96162 133895 40367 -26452 -54553 -22809 -4290 2700 -23249 46317 88802 86902 84511
14312 84511 28160 -19226 -79408 -51660 -74772 -63299 2701 9821 37311 84963 58753 28582
14300 28582 32741 2264 9290 -2148 -4084 27988 5262 -19723 -17430 -34362 -54446 -27779
14288 -27779 -9528 16161 5140 5500 30627 53868 44011 -14238 -8739 -27814 1042 27617
14276B7617R808p0645l0942L6769J4273L6899L4819K372k7198L4963l0274J2121
14264E0582n8510l9926J0357m3505M4234K1891j7231o370m5784o8170K9905L7917
14252h4610K4452p5346P316p9224L6470J02481O9013j5104l2338j0785M5235J2106
14240c34N3575J6950m1158k5869l9742l9384K5376J9617P0l4187M53L6298J1710
14227a6625k4793n336M4844L4715k373L3692M8672P607o7508l8591J7690P2554
14215A04548J3139n4740k0478m3434n8970j8350N998j1640j0502M9309O0387k5643
14203a0376l8607p548J1995J0487P212k3279R928K937p534M0108M4476k9363M2155
14190E2591P727l3165m0439N281L6762j4856l9539Q72R835L1831m530M0676O9895
$$ plain form
14276 27617 37425 -33220 -64162 -27393 -13120 23779 58598 60970 33772 68735 38461 50582
14264 50582 -7928 -47854 -37497 -81002 -36768 -14877 -32108 -38478 -84262 -152432 -122527 -84610
14252 -84610 -60158 -135504 -128188 -207412 -170942 -68461 552 -14552 -46890 -57675 -12440 -334
14240 -334 53241 70191 29033 3164 -36578 -75962 -50586 -30969 -30899 -65086 -64633 -28335 -16625
14227 -16625 -41418 -46754 -1910 32805 30432 64124 112796 120403 52895 14304 31994 104548
14215 104548 117687 62947 42469 -965 -59935 -78285 -72287 -83927 -94429 -45120 15267 -10376
14203 -10376 -48983 -56531 -44536 -34049 -26837 -50116 -40188 -37251 -44785 -4677 39799 10436 52591
14190 52591 60318 27153 -13286 -8005 28757 13901 -25638 -24766 -14931 16900 12370 53046 122941
14177A22941n837m5877j7087n7019R835p919j9918O449N4221M0337p0123p0622
14165f0619k0199K7447K5979l3430m3241L4546J9623p397L3898L1850J7543m5405
14153a9405o5768k8711P0988K0683j8045O0273l4128l4287J4618j8777M0802L6741
14141B4984n367m8604q2961m4790M1095L0568J416p1353K2109N2212L347P2324
14129e020K5655O443j3821n364m7283J6391P695M2460O188k5864o076J7205J2276
14116C0885j9092j0392k5595p199L2306K8045p119R732N741n0736j8342k0361
14104e2127n517k701k120n508j0383M7326M0004J0027Q829l0765Q512M3423K9354
14091G8354k9175j5937j2118m005j9486m7386l3240R1604L5966K3606L0374k079
$$ plain form
14177 122941 117104 71227 54140 -2879 6956 -963 -20881 -14432 39789 80126 10003 -60619
14165 -60619 -80818 -53371 -27392 -60822 -104063 -69517 -49894 -57291 -23393 8457 26000 -19405
14153 -19405 -85173 -113884 -42896 -22213 -40258 20015 -14113 -48400 -33782 -52559 -11757 24984
14141 24984 19617 -28987 -111948 -156738 -115643 -85075 -83659 -155012 -132903 -80691 -77344 -5020
14129 -5020 20635 27078 13257 7893 -39390 -22999 -15304 27156 33344 7480 1404 18609 30885
14116 30885 11793 1401 -24194 -31393 913 28958 21839 31571 37312 -13424 -31766 -52127
14104 -52127 -57644 -60345 -62465 -67973 -78356 -31030 8974 19001 27830 -2935 5577 49000 78354
14091 78354 49179 33242 21124 17119 -2367 -49753 -82993 8611 44577 68183 98557 96478
14079I6478o7912o0791j699l1382j4666j1232K3415L730K1354K1390k4891L4742
14067a1464O5976J4534N0033K7743o7623p7071O218R497l354l0851l6851k4755
14055g7968L2287k9243j3862l646l6558L2069L6932M4406J9524l8764j7167M8359
14043c631n291K3362M3512K3897m5575n6280O776n1209K1420O6571L913m5160
14031a7695o1271K1225L3307k4290O457J9814K6347N4165k9462k0141J1127J8882
14019C8465J583N53n3325l2729k6327j4358O2856K1424M6420n4652m3086Q312
14007d4864o876K6773N2240j6924n1647k0977L2096K6289L8757o031k0374j0074
13995a612j535j2776L435p4949m1448M797L0998J7114N810K1324p058K580n0979
$$ plain form
14079 96478 28566 -32225 -33924 -65306 -79972 -91204 -67789 -64059 -42705 -21315 -46206 -11464
14067 -11464 54512 69046 119079 146822 79199 2128 8346 17843 14489 -16362 -53213 -77968
14055 -77968 -45681 -74924 -88786 -92432 -128990 -96921 -59989 -15583 3941 -34823 -51990 -3631
14043 -3631 -8922 14440 57952 81849 36274 -20006 -13230 -64439 -43019 23552 27465 -17695
14031 -17695 -78966 -57741 -24434 -48724 -42267 -22453 3894 58059 28597 8456 19583 38465
14019 38465 40048 40601 -12724 -45453 -71780 -86138 -23282 -1858 44562 -10090 -53176 -44864
14007 -44864 -51740 -24967 27273 10349 -41298 -62275 -30179 -3890 34867 28836 8462 -1612
13995 -1612 -3147 -15923 -12488 -87437 -128885 -124088 -93090 -75976 -70166 -48842 -55900 -53320 -104299
13982a04299k1753O093n537J2316K6009j3166o761J8035n647k2807p977N070m3737
13969a64161P1125O1862K4466K2814J3423k5454k4638l0635j5544M395J7694Q8629
13957D3976O4996k3270l7415l1063j6473n5475k3967o1879P411O9658M3596J4048
13945e857l0174l0963o386J1920L4764M4713j4522j0069l746m1460n202J478J2072
13932d3432j576K4900L3533l0417m7814L5595J1673P73n1999K2442K6104K5899
13920E681l4677k3829K9914N189L6567j5298k0229J0630N8616K2151l2191o9666
13908b7142o9336m849l96K3113p5319l0658Q7845N5611j5875K4669J7512j3389
13896b8214j429l291O5745M3010q897l3233m1397K7413j3194o9206m6510J5972
$$ plain form
13982 -104299 -126052 -119959 -125496 -113180 -87171 -100337 -107098 -89063 -94710 -117517 -125494 -120424 -164161
13969 -164161 -93036 -31174 -6708 16106 29529 4075 -20563 -51198 -66742 -62347 -44653 43976
13957 43976 108972 85702 48287 17224 751 -54724 -78691 -140570 -133159 -63501 -19905 -5857
13945 -5857 -36031 -66994 -73380 -61460 -26696 18017 3495 -6574 -10320 -51780 -56982 -55504 -43432
13932 -43432 -45008 -20108 13425 -16992 -64806 -29211 -17538 -16765 -68764 -46322 -20218 5681
13920 5681 -28996 -52825 -22911 -17722 18845 3547 -16682 -6052 52564 74715 42524 -27142
13908 -27142 -96478 -101327 -101723 -78610 -153929 -184587 -96742 -41131 -57006 -32337 -14825 -28214
13896 -28214 -29643 -32934 32811 75821 66924 33691 -7706 19707 6513 -62693 -109203 -93231
13884i3231K8396N0230L0978R352k0855o3714l3838j8904l24K3156P0407q0565
13872i8912k4127N2152L1194R442j6789K7885M485m6367k2402j5528J7593j3567
13860i4941J0475K4686O617J0417p70l5440O0141k3597m4974K2966J3607N898
13848d4915n1270p770R006M2556j4749J7069m0205J6121M6725M337o929J3299
13836a6725L831K6155J343J8617K1092l7057O887l5619j05799k1497L7141Q3463
13824a8168P2312j4922q0591K9480O4421j3471j8766m9991n6640L2927K6283m5867
13812g2993n4101M7002N1478N0201k1819l4844L0084M0126L2330m7042j7652n0136
13800d7366L7027r676r942r733M9452L2955J3389l2145m2560L6329J3621O916
$$ plain form
13884 -93231 -64835 -14605 16373 25725 4870 -58844 -92682 -111586 -111910 -88754 -18347 -98912
13872 -98912 -123039 -70887 -39693 -30251 -47040 -19155 -14670 -61037 -83439 -98967 -81374 -94941
13860 -94941 -84466 -59780 -53163 -42746 -43516 -78956 -18815 -42412 -87386 -64420 -50813 -44915
13848 -44915 -96185 -103955 -94949 -52393 -67142 -50073 -90278 -74157 -27432 -23095 -30024 -16725
13836 -16725 -12894 13261 14604 33221 54313 17256 24143 -11476 -117275 -138772 -101631 -18168
13824 -18168 54144 39222 -41369 -11889 52532 39061 20295 -29696 -86336 -53409 -27126 -72993
13812 -72993 -127094 -80092 -28614 21587 -232 -35076 -4992 35134 67464 20422 2770 -47366
13800 -47366 -10339 -20015 -29957 -39690 9762 42717 56106 23961 -18599 17730 31351 38267
13788C8267l0372k4554k3172m781J02922K1782q5660q7141J8517q879j3229j310
13776i7610L2256O5081N1013j5937o9094J1098o168m1463N9992J883k5354J1040
13764b3263m594L6586m1761k4474l1049l9298q584N9014J10143N955j2190l0589
13752d104J4701l1525l4749L5432M443m550L8779j0495j6179M6699j7678j2846
13740G928l97m0383j3493j5353j9769K4702K5449m1474K9177N292K5163k061L047
13727a2172M6182O7004K5914j2605p4567p8144l228l8223m559P480l1129L5241
13715g2806L8949L2664J2400P0931l4353l7148M0890J910j5952p6290p1368n179
13703a15352J9721L2156K1128J9563N722L185J5851M448J9102k2335k291O315
$$ plain form
13788 38267 7895 -16659 -39831 -44612 58310 80092 -5568 -92709 -74192 -83071 -96300 -97610
13776 -97610 -65354 -273 50740 34803 -34291 -23193 -29361 -70824 -10832 -8949 -34303 -23263
13764 -23263 -27857 8729 -33032 -57506 -88555 -127853 -136437 -77423 32720 38675 26485 -4104
13752 -4104 10597 -20928 -55677 -20245 -15802 -20352 18427 7932 -8247 38452 20774 7928
13740 7928 7531 -32852 -46345 -61698 -81467 -56765 -31316 -72790 -43613 -38321 -13158 -15219 -12172
13727 -12172 34010 101014 126928 114323 39756 -38388 -41616 -79839 -84398 -76918 -108047 -72806
13715 -72806 -33857 -1193 11207 82138 47785 10637 51527 53437 37485 -38805 -110173 -115352
13703 -115352 -95631 -63475 -42347 -22784 -17062 -13877 1974 6422 25524 3189 898 7213
13691G213k679J1408Q1382j650J0745k7719m8248l2196l1261m3636n9548L4774
13679a01415L2025L6334P2365l5966j3082L8560J4328n2098n8853l3898k3460
13668a25160M9324N2393L5716Q412J4650P343k6793k2030l332L7636K25M607k3624
13655I367j09206l6667N4783j7737N2878L7572j785k4602L9289Q9025p98p438
13643H4681j6329k8890m7880p578K4415m283J1086K0555l1705j6811O2325p227
13631D2359n9712p7689l5706n356J6357O9958M6812J3278k9812K720m1938p617
13619f6346P086p24k7029M7821K1549M699J9367l0359k4027k8403J54P945K0112
13606d8155J6264L3202J9230q455q028k2252n0655O955K3222J5418K872j1303
$$ plain form
13691 7213 4534 15942 97324 95674 106419 78700 30452 -1744 -33005 -76641 -136189 -101415
13679 -101415 -69390 -33056 39309 3343 -9739 28821 43149 -8949 -67802 -101700 -125160
13668 -125160 -75836 -23443 12273 20685 35335 42678 15885 -6145 -9477 28159 28384 32991 9367
13655 9367 -99839 -136506 -81723 -99460 -46582 -9010 -10795 -35397 3892 92917 92119 84681
13643 84681 68352 39462 -8418 -15996 8419 4136 15222 35777 4072 -12739 49586 42359
13631 42359 -17353 -95042 -130748 -136104 -119747 -49789 -2977 10301 -19511 -16791 -58729 -66346
13619 -66346 -59260 -59984 -87013 -39192 -17643 -12944 6423 -23936 -47963 -76366 -76212 -68267 -48155
13606 -48155 -31891 1311 20541 12086 4058 -18194 -68849 -61894 -38672 -23254 -20382 -31685
13594c1685L6824q210J2017P3370J9148M5148K3158m5012l2296M3545J6069J2614
13582A64690m4572o7833l8686m5709K0315J931n146l5114m5339j6978R4129K4746
13570F434K7969J1478P56L9456R937o7419K5401O8392N7557O2467O3460R2657
13558C98545N3205J5481j6268j06071q5608m0338m0699o4357l4082j4105k7321
13547C8382K0929K5070N674K6909J8258N8501K1607j6870L7851l6932o710Q626
13535B01295R9192M3813N6317J1459K200p0555p6905k8681j5386k8581k1897k5713
13523A46558q105j0094r7051j477K9548k1403j1181k0637k4611k0839K0985l978
13511b2285M8722N7735n0408q1215M8046j6488j04200N233M1671J5309j2502L2308
$$ plain form
13594 -31685 5139 -3071 8946 82316 101464 146612 169770 124758 92462 136007 152076 164690
13582 164690 120118 52285 13599 -32110 -11795 -9864 -15010 -50124 -95463 -112441 -18312 6434
13570 6434 34403 45881 46637 86093 96030 28611 54012 122404 179961 242428 305888 398545
13558 398545 451750 467231 450963 344892 259284 218946 178247 113890 79808 65703 38382
13547 38382 59311 84381 90055 116964 135222 193723 215330 198460 236311 199379 192669 201295
13535 201295 300487 344300 400617 412076 414276 343721 266816 238135 222749 194168 172271 146558
13523 146558 138453 128359 31308 29831 59379 37976 26795 6158 -18453 -39292 -18307 -22285
13511 -22285 26437 84172 33764 -47451 595 -15893 -120093 -114860 -73189 -57880 -70382 -38074
13499c8074M9236K2973n4307q9308k0137K4825L4925l868L1573K6023J6907L289
13487D057k7649N0097j70J3729k2790m8090p753k9052k9604k7303p6708N2588
13475a48648O6226R328j2987M1189Q6472P691k6919M024M5616j6322j2068M2540
13463H6142j2020n9364l6296k2530K3680m467k0741n078N366q044K8476J7312
13451g564m850k612L7907j3932o6711N758l6649k4248P287n5754K5320L5218O0665
13438d0165M996L0420K138l1807q37P6445N7067J2516l8946n2668m7553K9867
13426A473P4251J0976k8315l2309j2030m7454k3166j5795L0218l3890j7799K8170
13414f5670M4542M606j4540K1957j9380j5255J9355m248j6136l641K5066N645
$$ plain form
13499 -38074 11162 34135 -20172 -109480 -129617 -104792 -69867 -73735 -42162 -16139 768 4057
13487 4057 -23592 26505 26335 40064 17274 -30816 -38569 -67621 -97225 -124528 -201236 -148648
13475 -148648 -82422 -73094 -86081 -44892 41580 49271 22352 26376 71992 55670 43602 86142
13463 86142 74122 14758 -21538 -44068 -20388 -24855 -45596 -50674 -45308 -53352 -24876 -7564
13451 -7564 -12414 -15026 22881 8949 -57762 -52004 -88653 -112901 -105614 -161368 -136048 -100830 -40165
13438 -40165 -35169 -4749 -2611 -34418 -35255 41190 98257 110773 71827 19159 -28394 1473
13426 1473 75724 86700 58385 26076 14046 -33408 -56574 -72369 -42151 -76041 -93840 -65670
13414 -65670 -21128 -16522 -31062 -9105 -28485 -43740 -24385 -28633 -44769 -48410 -23344 -17699
13402a7699j9995k9690K1567L3108m0465l5455j7143l241P5446N6354j3197l0759
13390b1169p0702k4797M1582L6452l875M2824M7131j8177n1599n1714m6013N2238
13378f7819j92N9386L3546m9269k928j9354q949k6496j4560M3894L9305m6022
13366e9458j0409l3420j5075R908N3346p250Q1201j9979l5236N4516L9758J3193
13354G1095q0084R396P338j3196O482J0464J7255j0233n9974J3879K5531L9459
13342C7412k6823n1344j8691K1374l5972q526k83L5947Q3991J00565m2667r8721
13330c738K3810n1223p7515j5849P8012l1k6080j173n4413O6868O0963j3301L0077
13317A6407J8419K753j6611n2289k9509L8129R059k6960j2968J4767n5189L4938
$$ plain form
13402 -17699 -37694 -67384 -45817 -12709 -53174 -88629 -105772 -109013 -33567 22787 9590 -21169
13390 -21169 -91871 -116668 -75086 -38634 -42509 315 47446 29269 -22330 -74044 -120057 -67819
13378 -67819 -68011 -8625 24921 -24348 -27276 -46630 -55579 -82075 -96635 -52741 -13436 -59458
13366 -59458 -69867 -103287 -118362 -108454 -55108 -62358 18843 -1136 -36372 18144 57902 71095
13354 71095 -8989 407 7745 -5451 1031 11495 28750 18517 -41457 -27578 -2047 37412
13342 37412 10589 -40755 -59446 -38072 -74044 -82570 -82853 -46906 37085 137650 94983 -3738
13330 -3738 20072 -31151 -108666 -124515 -46503 -46534 -72614 -73787 -128200 -61332 -369 -13670 16407
13317 16407 34826 37579 20968 -31321 -60830 -22701 -13642 -40602 -53570 -38803 -93992 -59054
13305e9054L4187M4781J2468j457K9185R895k873l4193o4321K3378M4540M794
13293D1330l7428k435j5486j2457l3298R636q372k195K5840l697J6363O5852Q496
13280E2149n9190n6609j0606L0224K6482r838l8811J211J0916j052l3948N2215
13268c6857M8985K1977L562n068j1202l9076o5226l7731L2531j5367K3539P981
13256g1952n4773K5686Q287J7171R991L0193O3074J1866l8167Q559J7561O62m0341
13243a2183k6213j3274J7055m6878K3007O1248m7401l1470M2732K5058J7858M901
13231A4440l0444j0355M8250k2296j6700J175J5662l5896k7852L5592K1761n5827
13219f2490k0692o497j9699P228m236K7908O835L8789N445l4549k3850L5827m6935
$$ plain form
13305 -59054 -24867 19914 32382 30925 60110 70005 67132 32939 -31382 -8004 36536 41330
13293 41330 3902 1467 -14019 -26476 -59774 -50138 -58510 -60705 -34865 -38562 -22199 43653 52149
13280 52149 -7041 -63650 -74256 -44032 -17550 -27388 -66199 -64988 -54072 -55124 -89072 -36857
13268 -36857 12128 34105 37667 32599 21397 -17679 -82905 -120636 -88105 -103472 -79933 -71952
13256 -71952 -126725 -101039 -92752 -75581 -65590 -35397 27677 39543 1376 9935 27496 28158 -12183
13243 -12183 -38396 -51670 -34615 -81493 -58486 2762 -44639 -76109 -33377 -8319 9539 14440
13231 14440 -16004 -26359 21891 -405 -17105 -15930 -268 -36164 -64016 -28424 -6663 -62490
13219 -62490 -83182 -89679 -109378 -102150 -106386 -78478 -71643 -32854 -27409 -61958 -85808 -49981 -96916
13206i6916L5890P7525k6452n9676r6662J2589N9019N8938M7343P943n462J6111
13194C0190L2119m9882p1136k3761M4062N1714q4386n0350K5586Q5675Q2816J9598
13182I2245m9627J2934j1198m1316m0896k9374L7282N4697N1100j1511k7518J2563
13170D9381n2298m4550L4021O6414J6128m3791j6782k5708j4993m7672R990N4341
13158a5519k2432k7344N96o480L589L7604O3493K1126l4663j6312m4042j3705
13146e4089P536m1764J8034N5210l0731L0393j9542l7893j8463J2609O2683M3037
13134B7020J7895l3091p3954n5654J8329K3591l7486j9059N4156J7205K2212L8441
13122c95n5810k6031N7545M4517P698K4352n8466p0382K3706N2409r620j0489
$$ plain form
13206 -96916 -61026 16499 -9953 -69629 -166291 -153702 -94683 -35745 11598 19541 14079 30190
13194 30190 62309 12427 -58709 -82470 -38408 13306 -71080 -121430 -95844 -10169 72647 92245
13182 92245 42618 55552 44354 3038 -37858 -67232 -29950 24747 75847 64336 36818 49381
13170 49381 -2917 -47467 -13446 52968 69096 25305 8523 -17185 -32178 -79850 -69860 -15519
13158 -15519 -37951 -65295 -64699 -71179 -67590 -29986 33507 54633 19970 3658 -40384 -54089
13146 -54089 -46553 -88317 -70283 -15073 -45804 -15411 -34953 -72846 -91309 -78700 -16017 27020
13134 27020 44915 11824 -62130 -117784 -99455 -75864 -113350 -132409 -78253 -61048 -38836 -395
13122 -395 -56205 -82236 -24691 19826 27524 51876 -6590 -76972 -53266 -857 -10477 -20966
13110b0966k493M5831J1117L4084k5053J8652n3782n1086K0543j0896j7754J0071
13098d1732M5928J015m2166J0997m4841M092M4612K8643J9369p053l4112m2647
13086e7895m333L944J4587P475j2598m660L288K2304L0349m0661m6916r621M5351
13073d9386J0498J2339R8893J9982j0346m1569j6885n4171J4333j0212p700m850
13061c9074k4103N029K5826M020j2634M6328l1651l0131k5472L930M0719N1349
13049A4136r568l9444P406J6111n4592k4604K4296O9362J1546J5757l667l7379
13037a0640L9682K5192p1964l8084l6079m1632j3152O3476R282M524j6774m072
13025i0241j6364O9462P0834L8414o65q2305P011p5800k236P7563k0478k3878
$$ plain form
13110 -20966 -23459 22372 33489 67573 42520 61172 7390 -43696 -23153 -34049 -51803 -41732
13098 -41732 4196 5211 -36955 -25958 -70799 -66707 -22095 6548 25917 18864 -15248 -57895
13086 -57895 -62228 -58284 -43697 -36222 -48820 -53480 -50192 -27888 2461 -38200 -85116 -94737 -49386
13073 -49386 -38888 -26549 72344 92326 81980 40411 23526 -30645 -16312 -26524 -34224 -39074
13061 -39074 -63177 -58148 -32322 -28302 -40936 5392 -26259 -56390 -81862 -77932 -37213 14136
13049 14136 4568 -34876 -27470 -11359 -65951 -90555 -66259 3103 14649 30406 26739 -10640
13037 -10640 29042 54234 -17730 -55814 -91893 -133525 -146677 -83201 -73919 -69395 -86169 -90241
13025 -90241 -106605 -37143 33691 72105 71440 -10865 -3854 -79654 -81890 -4327 -24805 -48683
13013d8683q991L2568P412k7664J472l8300n1698L1065R2227L8532M668p679q333
13000A6596m565j4095j6809j7499q7717m3535O7377L4580N6541r502k8040q517
12988e5185j9029m4734j5465j6578l2329j708R285L7169M5306j9279K1201j3913
12976a05259L1142N13n1007J8112L2305J6797j6378l7694m781J7887Q1199P9698
12964F2534M1389m6059p6329k6397O6331M6025K4106m4131l5389N5029M9879J9657
12952A36645l6411m9750J9774p279l4891L4308N3489m6808M529L3665J9174k6503
12940I9942k090r218J3676k5372l0636k9505j0343K1652K7110J1665k3488J0093
12928E3486o3457l2894K0574R729m5953K4995N101J7162M2668P2591K328M2738
$$ plain form
13013 -48683 -57674 -25106 -17694 -45358 -43886 -82186 -133884 -102819 -10592 27940 32608 24929 16596
13000 16596 12031 -2064 -18873 -36372 -124089 -167624 -100247 -65667 -9126 -18628 -46668 -55185
12988 -55185 -74214 -118948 -134413 -150991 -183320 -185028 -175743 -138574 -93268 -112547 -91346 -105259
12976 -105259 -74117 -73604 -124611 -106499 -74194 -57397 -73775 -111469 -116250 -98363 -17164 62534
12964 62534 103923 57864 -18465 -44862 21469 67494 91600 47469 12080 67109 116988 136645
12952 136645 100234 50484 70258 62979 28088 62396 115885 69077 73606 107271 126445 99942
12940 99942 97852 88634 102310 76938 46302 16797 6454 28106 55216 66881 43393 53486
12928 53486 -9971 -42865 -22291 -12562 -58515 -33520 -28419 -11257 31411 104002 106330 149068
12916A49068N8173m5408o7329q3726j8768k16K6661L3320m8737m8776K1001M6894
12904B2157J9945k7103K4777N8903O1172M0582N4660K5442M2336L1850K3310Q3906
12892D61937M8012P9872R4287J45670K10916K67038K42818K52216J47800J28547
12882B079113k4067j55533k18993k32420k76524j81181j64734j34349o1009j4745
12872F15558o9722p1876j02592q3411M3030K6062o8877j6132m9885n2037N4369
12861B24487K6768L4059J3523k4181q725J2396j2952l0448j6026M18K2375n2453
12849A89241n8916j5140J922K820M0219L8690r080p109l4813k6231J0229n175
12837A26657M0496J6181l4831n0793r2321K2259P2768j8329N3895M2232N8422
$$ plain form
12916 149068 207241 161833 94504 10778 -7990 -8206 18455 51775 3038 -45738 -24737 22157
12904 22157 42102 14999 39776 98679 159851 200433 255093 280535 322871 354721 378031 461937
12892 461937 509949 589821 684108 829778 1040694 1307732 1550550 1802766 1950566 2079113
12882 2079113 2055046 1899513 1680520 1448100 1171576 990395 825661 691312 630303 615558
12872 615558 545836 473960 371368 287957 330987 357049 288172 272040 222155 170118 224487
12861 224487 251255 285314 298837 274656 265931 278327 265375 234927 218901 219319 241694 189241
12849 189241 130325 115185 117107 119927 160146 198836 189756 182647 147834 121603 131832 126657
12837 126657 167153 183334 148503 97710 5389 27648 100416 82087 135982 178214 236636
12826B36636O109n0513r9610J580J5252M7078n5822N9862M2974r0514l9342j1755
12814F1935j130j8184j2266j7518k156k4102M8843L1858O454J1793Q176o383k061
12801H5259j1276J2431n235o5253k4754J780L642j2508K7594N8729j1589n8186
12789F34J4765R292k4536O773k7843K740O0946l2512j4808K8484K0718K888k1444
12776B6097j0608n044K1909J00285J01835K5897m8192j0917j3413M1545L7992
12765B67386j6971j6853k1725l4412p565o488K1679j1637q6747p6833M8810Q6156
12753A44800L3452L7242L9142j4154l1944L2247L3165Q218j6720M6850J1870P466
12741C31634J3435m1249l5500N5113L1188l2576O0137Q1492L6267L5592J09453
$$ plain form
12826 236636 242745 192232 92622 94202 109454 156532 100710 160572 203546 113032 73690 61935
12814 61935 60805 42621 30355 12837 10681 -13421 35422 67280 73734 85527 93703 87320 85259
12801 85259 73983 86414 81179 15926 -8828 -7048 -3406 -15914 11680 70409 58820 634
12789 634 15399 24691 155 6928 -20915 -18175 42771 10259 -4549 23935 44653 47541 26097
12776 26097 15489 10445 32354 132639 234474 260371 212179 201262 187849 229394 267386
12765 267386 250415 233562 211837 177425 169860 163372 185051 173414 86667 9834 58644 144800
12753 144800 178252 215494 254636 240482 208538 240785 273950 282168 265448 312298 324168 331634
12741 331634 345069 303820 268320 323433 354621 322045 382182 463674 499941 535533 644986
12730F44986R3482L4976P6737Q9398J37496J27088J66279K35414L47216M45948
12720B399020L63297L56040L17354K24448J03454j12169k71477l34747k75277
12711B769943j84592j50607r3326o569J6052r5454j21687o7873p6530J3690k0958
12700A982089r0426l4617q8141r3166j19882r3031n2956j04050o6753n6977n6870
12689A125220k3862J588p3868P465o505q6469j44161m4391k1425o7081m6879j0827
12677F08805m030O8250L3636p0078k7591o7842m4391N190k2932J5317J0550m1788
12665D63096J1125N40k0612M506Q598O9836L6232j6170l6762n765M3060O3749
12653F21433K5458l9447j1090o8644n8187J0893k1744l5652k5802L4865N7697
$$ plain form
12730 644986 738468 773444 850181 939579 1077075 1204163 1370442 1605856 1953072 2399020
12720 2399020 2762317 3118357 3435711 3660159 3763613 3651444 3379967 3045220 2769943
12711 2769943 2585351 2434744 2341418 2334849 2350901 2255447 2133760 2065887 1989357 2003047 1982089
12700 1982089 1891663 1857046 1768905 1675739 1555857 1462826 1409870 1305820 1239067 1182090 1125220
12689 1125220 1101358 1102946 1029078 1036543 1030038 943569 799408 755017 733592 666511 619632 608805
12677 608805 604775 673025 706661 636583 608992 541150 496759 501949 479017 494334 504884 463096
12665 463096 474221 474761 454149 458655 467253 537089 573321 557151 520389 514624 557684 621433
12653 621433 646891 607444 596354 527710 469523 480416 458672 423020 397218 432083 489780
12642D89780l9240q5238l6672O4546M2165P137M4399k0167J4573l8060k0945K0980
12630D43258K2050j4150O4003M7600o767N771j1476j3593j4786k8687k4542L7844
12618E06525K2058o2337n613J23728R939p7243l0335J42J0961L2867r959J2849
12606E33582L9444M4251l4076n0329j7376K6570l05k9095K2848J6415M1984J09079
12594G02992J00881P4900N0049O767p5153j540J606k2127j0117l6178m472O065
12582G93673J5024L1227K7419J9850m1065k4775K8363K207R2372O0585k6607j5438
12570I62835M4487n188P3382J07744J01269J52293J11585J34732J39166J01638
12560A923943J08485J50351J14214Q1392O8106l21K6411k9171j54337p9808p3654
$$ plain form
12642 489780 450540 365302 328630 393176 435341 442478 486877 466710 481283 443223 422278 443258
12630 443258 465308 451158 515161 562761 555994 561765 550289 536696 521910 493223 468681 506525
12618 506525 528583 466246 460633 584361 594300 517057 486722 486864 497825 530692 520733 533582
12606 533582 573026 617277 583201 532872 515496 542066 541761 512666 535514 551929 593913 702992
12594 702992 803873 878773 928822 935589 860436 858896 860502 838375 828258 792080 787608 793673
12582 793673 808697 839924 867343 887193 846128 821353 849716 851923 944295 1004880 978273 962835
12570 962835 1007322 1002134 1075516 1183260 1284529 1436822 1548407 1683139 1822305 1923943
12560 1923943 2032428 2182779 2296993 2378385 2446491 2446170 2472581 2443410 2289073 2209265 2135611
12549B135611r4511r2326m1159N0514N2390N7035K7584L3530J02069J28358K3544
12538B382639J12765J12852L6249Q0922M9017p6693l0384J2557m2811P476K2854
12527B667443J546M8472l4769l0983m4503m739J6989J0646M6396R9699O9961L8376
12515B884534N6936L4136P6788J03104N5794j0651L7837O4416P5449R4338R2633
12504C565314P5746M1383J09100R3134R4727P7846J21594J38953M8444N6292J13515
12493D536048J33227J30749R4011P4116J49637J39820J25140J61551J58400K63210
12483E965909K78492K51075K43024K21455K98170L81850M15307M69017M92925
12474I017224N38623N92399O53648O76895P79747R13839Q87478Q20515R23220
$$ plain form
12549 2135611 2041100 1948774 1907615 1958129 2010519 2067554 2095138 2128668 2230737 2359095 2382639
12538 2382639 2495404 2608256 2644505 2725427 2774444 2697751 2667367 2679924 2637113 2644589 2667443
12527 2667443 2668989 2717461 2682692 2651709 2607206 2602467 2619456 2630102 2676498 2776197 2846158 2884534
12515 2884534 2941470 2975606 3052394 3155498 3211292 3200641 3238478 3302894 3378343 3472681 3565314
12504 3565314 3641060 3682443 3791543 3884677 3979404 4057250 4178844 4317797 4366241 4422533 4536048
12493 4536048 4669275 4800024 4894035 4968151 5117788 5257608 5382748 5544299 5702699 5965909
12483 5965909 6244401 6495476 6738500 6959955 7258125 7639975 8055282 8524299 9017224
12474 9017224 9555847 10148246 10801894 11478789 12258536 13172375 14059853 14880368 15803588
12465A5803588Q83766P77142Q45570J013248J302371J514392J828148K099868
12457B6068093K396416K799122L225631L851726M628323N654169O981281Q662039
12449F4266800J0917756J3865202J7877207K3113701K9886728L8032286M6123196
12442B44082876N1706280N1416048M2263631K2873519m694848l2003160n0379678
12435C25264668n6186829n0732623m0301109l0284788k2411782j6896537j3116129
12428I5334871j0421262q621871p264714o023769n100349m239075l479983k889694
12420D7294154k410458j986311j593357j317239j202237j001046q22365p12218
12412C6248923o27722o04684o90039q15529j080554j349508j458937j444672j478849
$$ plain form
12465 15803588 16687354 17464496 18310066 19323314 20625685 22140077 23968225 26068093
12457 26068093 28464509 31263631 34489262 38340988 42969311 48623480 55604761 64266800
12449 64266800 75184556 89049758 106926965 130040666 159927394 197959680 244082876
12442 244082876 295789156 347205204 389468835 412342354 407647506 375644346 325264668
12435 325264668 269077839 218345216 178044107 147759319 125347537 108451000 95334871
12428 95334871 84913609 76291738 69027024 63003255 57902906 53663831 50183848 47294154
12420 47294154 44883696 42897385 41304028 39986789 38784552 37783506 36961141 36248923
12412 36248923 35621201 35016517 34326478 33510949 32430395 31080887 29621950 28177278 26698429
12403B6698429j455272j364419j274608j171378j088282r99585r71393q87334
12395A7486158q11911p79391p75798p73869p49765o55580o43745o30076n66109
12386A1099914m72756m40233m30015m56164m38726l58208l98170l80136l80119
12377G345387l40707k92430k36544k12409k29571k35798k07446k25104k87302
12368E078076k37084j80273j65792j72453j95697j54098j25637j75885j72259
12359C498898r1199j40937j33330j15664j66014j13557n6587o1907q8125j22619
12349B408959q9448r8929o2800p5958n7781q0439o4191o8083j10098o5505n5344
12338A580383k3639k2960j959o4299n1125j1188j7969M1147J4811m0295p2808
$$ plain form
12403 26698429 25243157 23878738 22604130 21432752 20344470 19344885 18373492 17486158
12395 17486158 16674247 15894856 15119058 14345189 13595424 12939844 12296099 11666023 11099914
12386 11099914 10627158 10186925 9756910 9300746 8862020 8503812 8105642 7725506 7345387
12377 7345387 7004680 6712250 6475706 6263297 6033726 5797928 5590482 5365378 5078076
12368 5078076 4840992 4660719 4494927 4322474 4126777 3972679 3847042 3671157 3498898
12359 3498898 3407699 3266762 3133432 3017768 2851754 2738197 2681610 2619703 2531578 2408959
12349 2408959 2319511 2220582 2157782 2081824 2024043 1943604 1879413 1811330 1701232 1635727 1580383
12338 1580383 1556744 1533784 1531825 1467526 1416401 1405213 1387244 1428391 1443202 1402907 1330099
12327A330099j34692l2973O7463n1745O1646K2278j2825K990o1018l0299j1971
12316A148953N097Q099J00836Q3311r265q7089j8028N1244j9825n9952n7484k7756
12304A118141l4634n9067l2922o2411p7536L7516L8229J2663l5068J0497M845
12293I20253m1221k1744m5171q2611j3042n5745m7456j580k7208M0075Q3581K9570
12281G37701M3839J05689J43050M9608j2490P6980J29049O5859K9618q0983m4839
12270A243081o1205n8218k1648j0201m4735J4350K0549j515j4077L562K619l264
12258A069298M5546l6196l7523m7547m9806p6498R023n7237q7957K5022Q0746
12247H36871j9963J8500Q0271M2877l4860k6118L64J7422o0020m9277M6133N5638
$$ plain form
12327 1330099 1195407 1162434 1229897 1178152 1239798 1262076 1249251 1252241 1191223 1160924 1148953
12316 1148953 1154050 1162149 1262985 1346296 1337031 1249942 1231914 1283158 1263333 1203381 1145897 1118141
12304 1118141 1083507 1024440 991518 929107 851571 889087 927316 939979 904911 915408 920253
12293 920253 879032 857288 812117 729506 716464 660719 613263 611683 584475 624550 708131 737701
12281 737701 781540 887229 1030279 1079887 1067397 1144377 1273426 1339285 1368903 1287920 1243081
12270 1243081 1181876 1123658 1102010 1091809 1047074 1061424 1081973 1080458 1066381 1069943 1072562 1069298
12258 1069298 1114844 1078648 1041125 993578 943772 867274 876297 819060 731103 756125 836871
12247 836871 816908 835408 915679 958556 923696 897578 897942 915364 855344 806067 852200 907838
12235I07838k0322o7924n3021J245J3411J9905j2542o865n8896l1999m0048k4261
12223F26521L6942L40l0005m0785L4479l1399o0587n2071J1845L9267K8034J5200
12211E77781N1101K4864o7421o8714j1419J3514L4519L7579K5953m0265o0315
12200E17177L174J9095M8250j3857K5328K8297L0605j8249M939N038j3215o3593
12188E72989K1198j1149m3347j8898j4729n6294m4297k0528m997m77J2818J7742
12176D10031k1556n3903k5350K7028K8098q604k4130K0293J5007L6342o528K8350
12164D25078j0912n8610o2702N2813K4963K0513J3775p7089K6309n139m7773K2343
12152C23569L7121n9743M0915J2432q324K8275K4261j2469m6369j9240k4476M7571
$$ plain form
12235 907838 887516 819592 766571 767816 781227 801132 788590 781725 722829 690830 650782 626521
12223 626521 663463 663803 633798 593013 627492 596093 535506 483435 495280 534547 562581 577781
12211 577781 628882 653746 586325 517611 506192 519706 554225 591804 617757 577492 517177
12200 517177 520351 539446 587696 573839 599167 627464 658069 639820 644759 649797 636582 572989
12188 572989 594187 583038 539691 520793 506064 449770 405473 384945 379948 379471 392289 410031
12176 410031 388475 334572 309222 336250 364348 355744 331614 351907 366914 403256 396728 425078
12164 425078 414166 355556 292854 345667 370630 391143 404918 327829 354138 348999 301226 323569
12152 323569 360690 300947 341862 354294 345970 374245 398506 386037 339668 320428 295952 343523
12140C43523J2812o2181L5079K4165k2880k309O2712K5813o0007K2047O8648O0682
12128E08104M5117j213k2266J0278k1938L959n561n2391q859N079K5587K2764
12116E08660j8574l927k3533k6457J4984j8508j224m1366q308j8633K6217N6503
12104D45834K973L942j4494l9749N430K6391R2891J0285o6225k6551K1752N3319
12092E15798J6925j6327j5464j1440M039N3177M0675m0073q449q918J052M7560
12080E78555J4342j1441m6473p8486L4722M4428J4690p191l9593R684J04434N5771
12068F73442L3185m7901q5600L8897M379l1828o640Q4173Q4672m1844o6941k1828
12056F16166l1176k8980M4348j0390m634L3700L4184k019k2894M0944L0225K1658
$$ plain form
12140 343523 356335 294154 329233 353398 330518 328209 390921 416734 356727 378774 447422 508104
12128 508104 553221 552008 529742 540020 518082 522041 516480 464089 455230 460309 485896 508660
12116 508660 490086 486159 462626 436169 451153 432645 431421 390055 381747 363114 389331 445834
12104 445834 448807 452749 438255 398506 403936 430327 523218 533503 467278 440727 462479 515798
12092 515798 532723 516396 500932 489492 493531 546708 587383 547310 538861 529943 530995 578555
12080 578555 592897 581456 534983 456497 491219 535647 550337 543146 503553 513237 617671 673442
12068 673442 706627 658726 573126 612023 616402 584574 577934 662107 746779 704935 637994 616166
12056 616166 584990 556010 600358 589968 585334 619034 653218 651199 628305 669249 699474 721132
12044G21132o828l1680Q815m2951j0326M8798P6116M4149J2936R278L1125O0330
12032I20894j225j9023k9999P5481L9791Q4137M6561O951k303J1487J1972K683
12020A147407M6896N8599J8067K0050k3572l239O8577K3234q830J9010K2264P9816
12008A468279K060k807L3816K068R7366J17964K9789K3445P8737Q0588J53132
11997B084437J41261J26766J69405J71783K03536L10661K86783K73206K90295
11988D058133K06762N3133o5419j62809j52092j82392j85045o2212m8606l2067
11978C427386J4950J03754R8064Q5655J49633K48644J61310J39313J44355J79913
11968D752977J44991J64177L27654L07384L76435M08654M17158M82479N60497
$$ plain form
12044 721132 714304 682624 691439 648488 638162 686960 763076 807225 820161 829439 860564 920894
12032 920894 919669 900646 870647 946128 985919 1070056 1116617 1123568 1121265 1132752 1144724 1147407
12020 1147407 1194303 1252902 1270969 1291019 1267447 1264208 1332785 1356019 1347189 1366199 1388463 1468279
12008 1468279 1470339 1467532 1501348 1503416 1600782 1718746 1748535 1771980 1850717 1931305 2084437
11997 2084437 2225698 2352464 2521869 2693652 2897188 3207849 3494632 3767838 4058133
11988 4058133 4264895 4318028 4252609 4089800 3937708 3755316 3570271 3508059 3459453 3427386
11978 3427386 3442336 3546090 3644154 3729809 3879442 4128086 4289396 4428709 4573064 4752977
11968 4752977 4897968 5062145 5389799 5697183 6073618 6482272 6899430 7381909 7942406
11959G942406O36660O78737P56681Q75568J041674J159185J375749J597168J897671
11950A7961499K366386K905373L682585M718047O016211P826557J0418948J4102248
11942F9997854J8703945K3896213K8611548L0286685K6262348J5834150q72384
11935B12720359k0758532l3364750l3176538k6633515j9616228j4055546j0160453
11928E4954797p505675n740667m582989l637944k985233k563632k126333j783593
11920B4028731j458633j172038r54852p81273o55264n60451m92745m25941k90926
11911A7236608k82807j85843j38214k88689l71585m60441n98251o92502o60854
11902A3557422o59150o49280p15159o35582n43205m68942m62093m42541m43444
$$ plain form
11959 7942406 8579066 9257803 10014484 10890052 11931726 13090911 14466660 16063828 17961499
11950 17961499 20327885 23233258 26915843 31633890 37650101 45476658 55895606 69997854
11942 69997854 88701799 112598012 141209560 171496245 197758593 213592743 212720359
11935 212720359 191961827 158597077 125420539 98787024 79170796 65115250 54954797
11928 54954797 47449122 41708455 37125466 33487522 30502289 27938657 25812324 24028731
11920 24028731 22570098 21398060 20443208 19661935 19006671 18446220 17953475 17527534 17236608
11911 17236608 16953801 16767958 16629744 16341055 15969470 15509029 14910778 14218276 13557422
11902 13557422 12898272 12248992 11533833 10898251 10355046 9886104 9424011 8981470 8538026
11893H538026m57169m80478m05472l52826l69277l61321l41372k79338k27460
11884E263313j64054j98069k82509k87473k21969k28326j25381j35157j41264
11875C479111j63406j34282j73211j28428m6857o4087r8909j12027j34780j37859
11865B285265j01279n9927o8966j00511m3198r0904o8885o0774n6699j00706j14191
11854A419225l5546o6825l4958n7137p4519n1113m1047l3886N5653J7342l7581
11843A059608l5370K7726o7553q0359p7341n3795K358j8245j4615j3394l5983
11832F93037k0486l0306n251j6809P616r195O5167J7772n7194n0071j5110J7991
11820E97161N032O3223L1732q2546o8421l1050M1961N3119L1426P496r163l2740
$$ plain form
11893 8538026 8080857 7600379 7194907 6842081 6472804 6111483 5770111 5490773 5263313
11884 5263313 5099259 4901190 4618681 4331208 4109239 3880913 3755532 3620375 3479111
11875 3479111 3315705 3181423 3008212 2879784 2832927 2768840 2669931 2557904 2423124 2285265
11865 2285265 2183986 2124059 2055093 1954582 1911384 1820480 1751595 1690821 1634122 1533416 1419225
11854 1419225 1383679 1316854 1281896 1224759 1150240 1099127 1058080 1024194 1079847 1097189 1059608
11843 1059608 1024238 1051964 984411 904052 826711 772916 775274 757029 742414 729020 693037
11832 693037 672551 642245 636994 620185 627801 618606 683773 701545 644351 594280 579170 597161
11820 597161 602193 665416 697148 614602 546181 515131 557092 610211 641637 649133 639970 607230
11808F07230j6244M5253l1765n5714O316k8629k8372m8229o7980j2888m6157l285
11796C19536J8627K2551K1651J840K4817j0392K7478P6876K8183r342m6447l7766
11784D37612j35059p6890J5197Q9320P8495O4260O09M0135j2822P703J2676o6042
11772D55194n3599N634J2010m88M0361P9664L1821M9015n1427r6311Q391J7092
11760D97357M7170j101M1445m5446k8763J5692k2909p0103k9208r521k4296j2909
11748C57408j9980J6505k1007J667P1370L5307q151p6976j8678J6109N4220m9109
11736C58685k5656O874k8539P538l8886L4180j6357P846J0565J2380n247k2664
11724C00719N8251N3451L3071o173j1088k6673o0104K3250n7591m0113p5929k9541
$$ plain form
11808 607230 590986 636239 604474 548760 555076 526447 498075 449846 381866 368978 322821 319536
11796 319536 338163 360714 382365 384205 409022 398630 426108 502984 531167 521825 475378 437612
11784 437612 302553 225663 240860 330180 408675 472935 473544 513679 500857 508560 521236 455194
11772 455194 401595 407229 419239 418751 459112 538776 570597 619612 568185 471874 480265 497357
11760 497357 544527 543426 584871 539425 510662 526354 503445 433342 404134 394613 370317 357408
11748 357408 337428 353933 332926 334593 405963 441270 433119 356143 337465 353574 407794 358685
11736 358685 333029 339903 311364 318902 280016 314196 297839 305685 316250 328630 323383 300719
11724 300719 358970 412421 445492 439319 428231 401558 341454 364704 307113 267000 191071 161530
11712A61530L6323N5359J6322k6021p228p128J8354Q647j461j782K4154o111j9066
11699B51892K8262J1562l3776n2939l0667l5229J2340M9883Q3721N81l7000m4630
11687B04000k2307P547L9736n4136k5117R158L7747K425L138n200K0343m080O9233
11674B82487N107O423k0680o1255L064M1181m5802l381l6988m8084k9334m9027
11662D3711o25J6449K0547l892J7674L2761J5176L0307L9774M1473k1555k9357
11650B02443K0014n1717n3416M2008k4474m0848N9458N2472l071l4346j9217m896
11638A44410L7486J8296J4567p176j3426J0841M3418K0825n1893Q379q537l1194
11626A85996r079n8361p4712K9301J2614O028k5511R503j3367r670M4998l6816
$$ plain form
11712 161530 197853 253212 269534 243513 236285 229157 247511 256158 254697 252915 277069 270958 251892
11699 251892 280154 291716 257940 205001 174334 139105 151445 201328 285049 285630 248630 204000
11687 204000 181693 189240 228976 174840 149723 158881 196628 199053 202191 196991 217334 213254 282487
11674 282487 287594 294017 273337 212082 215146 256327 210525 207144 170156 122072 92738 43711
11662 43711 43086 59535 80082 76190 93864 126625 141801 172108 211882 253355 231800 202443
11650 202443 222457 170740 117324 159332 134858 94010 153468 205940 202869 168523 149306 144410
11638 144410 181896 200192 214759 207583 194157 204998 248416 269241 217348 225727 217190 185996
11626 185996 176917 118556 43844 73145 85759 91787 66276 75779 62412 52742 97740 60924
11614F0924M500J7946k7406L6314L9555K3234l9403j5088J4157j6898j2275K7904
11602A13464j6868l467J9833K6739N078m4262K245K272n2028J0729O741j5696
11590E4780k493m3427m8447N2195N3114K7549j307K3820k7802k7589n9346J6823
11578A7870M4239O4354k5181n6759l8250R101K8554K4737N0819K504n2961l2391
11566C6636m8771J7712J6687q1543l1004Q5852Q3477n8821L8589Q1965n3600p3641
11554A3538m5413L6965Q8183p214k0287N0017K3426l3081o1228R646j370K5678
11542G8860J6694o8104L4927J671k0667q81N6266l557l6470N1634L436m0274k8333
11529D5202M938M6502R8956K3960j0122j10742p2225K3316j2222Q731J9440N2276
$$ plain form
11614 60924 65424 83370 55964 92278 131833 155067 115664 100576 114733 97835 85560 113464
11602 113464 96596 93129 112962 139701 144779 100517 102762 105034 53006 63735 70476 54780
11590 54780 52287 8860 -39587 12608 65722 93271 91964 115784 87982 60393 1047 17870
11578 17870 62109 126463 101282 44523 6273 15374 43928 68665 119484 121988 69027 36636
11566 36636 -12135 5577 22264 -59279 -90283 -4431 79046 20225 58814 140779 87179 13538
11554 13538 -31875 5090 93273 86059 65772 115789 139215 106134 44906 54552 53182 78860
11542 78860 95554 27450 62377 64048 43381 42500 98766 95209 58739 110373 113809 73535 45202
11529 45202 50140 96642 195598 219558 209436 98694 26469 49785 37563 46294 65734 118010
11517A18010n5911o3730q687J2212M8738N4561m109k6996K9943o074L1433j2830
11505A16560R828k2844o860M2342m1066n1271J759j2429K6063L6493n911n9513
11493C3151j4155p752L3490K2723K8327J4139k2622l3059l7968j6239m263m1281
11481d5509K9336R639K9813l4322k5287M2469P902M2091M2082n316k5151J0092
11469G7839M3948L5522N454j4750k48K3479L5311R494l1789j3792j4329M471l0187
11456A30423k791j0968m2515L5077k4494m2640L4275O5484Q114N909l4883k5117
11444I5874n7691k9611q365L183L6730M4526j5446l672O3171J2204J5829n75m3019
11431A13138k8240Q985p971N207K1590k5415L4945j4463l0974k4967j6171K0214
$$ plain form
11517 118010 62099 -1631 -10318 1894 50632 105193 101084 74088 104031 97957 129390 116560
11505 116560 126388 103544 96684 139026 97960 46689 48448 36019 62082 98575 92664 33151
11493 33151 18996 11244 44734 67457 95784 109923 87301 54242 16274 35 -4228 -45509
11481 -45509 -16173 -6534 23279 -11043 -36330 6139 14041 56132 98214 92898 67747 77839
11469 77839 121787 157309 162763 148013 147765 171244 206555 216049 184260 170468 156139 160610 130423
11456 130423 127632 116664 74149 109226 84732 42092 76367 141851 149965 155874 120991 95874
11444 95874 38183 8572 207 3390 40120 84646 69200 65528 128699 140903 156732 156157 113138
11431 113138 84898 93883 85912 91119 112709 87294 122239 107776 76802 51835 35664 55878
11419E5878n4339m4602K6566N0228J9397l0105k9227Q061L3944l6657q866O6028
11407E6306Q5308m083l6656o8736L3737P7455J0736J4340q6958O407L003K4989
11395A15848r235k0982J1858M848K4766k2806k2540j3512N3118L5944R851N0765
11383B17923J3997n708q006o7073n2095K888k6123n224l0266Q084K0021Q657m5446
11370C1629M920O4559j1735j0692j9023K3841n601l3048m3542K6953M1661o271
11358F3651k5530N9067J2076j4167j8944J2134K6218M2081J3196k3288n1161L6395
11346A31728M5224k4892p4904K6009L2807l528o2399P264l2858l248K3214M1951
11334A06368l7276j9372L5037P8511l9996l3610j9006j2800l5176J5834M7639
$$ plain form
11419 55878 1539 -43063 -16497 33731 53128 23023 -6204 1857 35801 -856 -9722 56306
11407 56306 141614 137531 100875 32139 65876 143331 154067 168407 81449 87856 90859 115848
11395 115848 106613 85631 97489 102337 127103 104297 81757 68245 121363 157307 167158 217923
11383 217923 231920 226212 218206 151133 99038 101926 75803 70579 40313 48397 68418 77075 31629
11370 31629 36549 101108 89373 78681 59658 83499 77898 44850 1308 28261 69922 63651
11358 63651 38121 97188 109264 95097 76153 88287 114505 156586 169782 146494 95333 131728
11346 131728 176952 152060 77156 103165 135972 132444 70045 77309 44451 41203 64417 106368
11334 106368 69092 49720 84757 163268 123272 89662 70656 57856 22680 38514 86153
11323H6153L3139j7372k1682M1980J5309q514m287R562K384O430j891K6399N1956
11310B19566K7809j7340J0814K5662J268L8050n1903N8430P8766J3962j3921P3719
11298D64882K2700P80L8676R9027J45460J53790J60945K04878K73040L50504N04588
11287B419270O15486O93819O76130L89233J3719l97245p17224q14627o86802m17230
11277A774529l15067k43192j65567o4653p2598n9803n9303p5239O90r6617n4228
11266E68952m3063J4325J2566M4907l1029n4145j2013k3217k6637m9936j9208
11255C81502J0178j7479J3649r969K2881j7037K1917l8218j5589O109J4463N3634
11243D26041Q04k9631l0327k3031k1563m513L9750K8004k5888K5039r2654r361
$$ plain form
11323 86153 119292 101920 80238 122218 137527 129013 124726 134288 136672 143102 141211 167610 219566
11310 219566 247375 230035 240849 266511 267779 305829 253926 312356 391122 405084 391163 464882
11298 464882 487582 488362 527038 626065 771525 925315 1086260 1291138 1564178 1914682 2419270
11287 2419270 3034756 3728575 4404705 4793938 4807657 4410412 3693188 2878561 2191759 1774529
11277 1774529 1459462 1216270 1050703 986050 913452 853649 794346 719107 719797 623180 568952
11266 568952 525889 540214 552780 597687 566658 512513 500500 477283 450646 400710 381502
11255 381502 391680 374201 387850 377881 400762 383725 405642 367424 351835 357944 372407 426041
11243 426041 426845 397214 366887 343856 322293 317780 357530 385534 359646 384685 292031 282670
11231B82670N6359Q084O4658K9432N2414J7739J3421N253J398M7376J8445P4538
11219F71787L0483R17j2314K8484J81359J51204Q0584J33563K19300K14345L29304
11208B029016M89587O16942P84412J041856J331785J451112J431238J146628N04382
11199A0826958k15187q36082j270783j595279j534673j159600q50119n98923l76288
11190B390024k62433k44657j34693p8532j64064j69538j03195o9811p8808q7492
11180I96801o366k436j9504k2562j0332J4535l3154o6418o3574K1255J357N377
11168H14979n73l5562j7261n4533l9001k9310m5028J7601o6478m4988l2522l983
11156D63341N716K645l3381l049o2146n4266l2378j3684l0537j6431K2741j8188
$$ plain form
11231 282670 339029 347113 411771 441203 493617 511356 524777 530030 531428 578804 597249 671787
11219 671787 702270 703187 690873 719357 900716 1051920 1132504 1266067 1485367 1699712 2029016
11208 2029016 2518603 3135545 3919957 4961813 6293598 7744710 9175948 10322576 10826958
11199 10826958 10611771 9775689 8504906 6909627 5374954 4215354 3365235 2766312 2390024
11190 2390024 2127591 1882934 1748241 1669709 1505645 1336107 1232912 1163101 1084293 996801
11180 996801 990435 987999 968495 945933 935601 950136 916982 850564 786990 808245 809602 814979
11168 814979 814406 778844 761583 707050 668049 638739 593711 611312 544834 499846 467324 463341
11156 463341 469057 471702 438321 435272 373126 318860 286482 272798 242261 225830 248571 230383
11144B30383j003K0699Q815l5106l5436j8340K7103N1941o4870p496K6734J0193
11132B13617k1639l671N2493l0726L780N1129N8250l3554m8549l6040k5747q196
11120A71147k3720o190L272R48K4755m3502J2358O5129J0647l3768J0579K5983
11108B17638N4432N5273K3825P4175P4282M2773K4300l2320N5114J35628N5855
11097G80975n9247k7524n1012o0022o7767n3377n2983n2848p0697j8020j9930
11086B47548o648j2059R756j806p0820M9237O3004O5297K3049o8772k6450Q0477
11074C51813Q7551N2269J04493O2601P2668M3792j6272M3097k0197r658j07720
11063F64437j30055n5296m9835j2210L6842k0321p617j0101R499K5143r945k9342
$$ plain form
11144 230383 229380 250079 258894 223788 188352 170012 197115 249056 184186 176690 203424 213617
11132 213617 191978 188307 240800 210074 213854 264983 323233 289679 241130 205090 179343 171147
11120 171147 147427 141237 144509 145457 170212 126710 139068 204197 214844 181076 191655 217638
11108 217638 272070 327343 351168 425343 499625 542398 566698 534378 589492 725120 780975
11097 780975 721728 694204 643192 583170 515403 462026 409043 356195 285498 267478 247548
11086 247548 240900 228841 238597 236791 165971 215208 278212 343509 366558 297786 271336 351813
11074 351813 439364 491633 596126 658727 731395 775187 758915 802012 781815 772157 664437
11063 664437 534382 479086 429251 417041 453883 433562 425945 415844 425343 450486 440541 411199
11051D11199L4948J6219L0505O6117P6175J06819K3006O9098J26981J39720K33763
11040A334550K64215K86252M03401M88742M62539M70053L76685K42292k3198j46979
11030D158552l05556m42031m43977m38360l82181l39538k93252k14134o2508q84
11020A236131o7707r0660l1116p1534m1396r2310m2215m8270m9662l7364R345
11009F73242J0015L6455K5048j7794J2743j9370q1065q0723O0047J6529l3438
10998F01689m3008l3410j2803Q758k3970j9850m7353o8128p053L673l1706J5876
10986C42715J4327j6955n5793j269j3687J3994J4068P9081N1860K527K4528m2777
10974D12619j9374L3183O483L8607M3704M2624K6909J7781N4680P4074O7153O5427
$$ plain form
11051 411199 446147 462366 492871 558988 635163 741982 764988 834086 961067 1100787 1334550
11040 1334550 1598765 1885017 2288418 2777160 3239699 3709752 4086437 4328729 4305531 4158552
11030 4158552 3852996 3410965 2966988 2528628 2146447 1806909 1513657 1299523 1237015 1236131
11020 1236131 1168424 1077764 1046648 975114 933718 841408 799193 750923 701261 663897 673242
11009 673242 683257 719712 744760 726966 739709 720339 639274 558551 618598 635127 601689
10998 601689 558681 525271 512468 521226 497256 477406 430053 361925 354872 358545 326839 342715
10986 342715 357042 340087 284294 283025 269338 283332 297400 376481 428341 430868 455396 412619
10974 412619 393245 426428 432911 471518 515222 557846 584755 602536 657216 731290 798443 863870
10962H63870J89595J98323K06388K53316L52979M79387N76865Q03931R95677J228914
10952F149245J340148J201695Q29304K99430j28676m27322o73897j010247j359319
10943F220361j325990j043911p08004n41246l36622k80980k05459j59631j96495
10934A422023j22151k2550o6302j61499j00190K135K4498L8795J0670l798j4862
10923A006769l4129j5473L1749l6124k1101n0412l1867l4447o3054k6456n7625
10912F67830l1827o1023o9892m8553K5832j0105N268K1370m3901o3860l0702L1725
10900C92162p782l1963P652r4N195o939p0052o3766M311M6741j5821l4413m06
10887B24825J4411j9917J1318L5390N16j4812m2916q141J7884k3225m7319j9665
$$ plain form
10962 863870 1053465 1251788 1458176 1711492 2064471 2543858 3120723 3924654 4920331 6149245
10952 6149245 7489393 8691088 9520392 9819822 9691146 9263824 8589927 7579680 6220361
10943 6220361 4894371 3850460 3142456 2601210 2264588 1983608 1778149 1618518 1422023
10934 1422023 1299872 1277322 1211020 1049521 949331 951466 975964 1014759 1025429 1021631 1006769
10923 1006769 972640 957167 988916 952792 931691 881279 849412 814965 751911 725455 667830
10912 667830 636003 574980 505088 456535 482367 472262 477530 498900 454999 391139 360437 392162
10900 392162 384380 352417 360069 359975 365170 358231 288179 224413 228724 275465 259644 225231 224825
10887 224825 239236 219319 230637 266027 266543 251731 208815 200674 218558 195333 148014 128349
10875A28349J3025l4395k4624O6217j0720j956L7652j8137K3870k2748J3869R1951
10863B62353k0185r9690n0084N5337j7167k8386m4409L1909Q483J8008O196o201
10851A16164K2321N4518p025J5182N87Q955k4090P074k413l4259L0191o390k917
10838A77898k2793k8749L011K1691j2161O3266J8898n0117j43o802m9621j2686
10826A01692k4851O7278P9511j4047k5086L9765N2030m801n3325j00651n839l4599
10814G7077o6977O8677M6946l2972n6165n0728L8153L3682J3211l8230L2683Q6153
10802A51510M0825j7626Q19K7825m7871n3172n7745j4959N3796k1551q4285J0406
10790a2028O6280K9628K5245K5704j140n3451n1982k7816J4622J0173q938K2816
$$ plain form
10875 128349 141374 106979 82355 148572 137852 135896 173548 155411 179281 156533 170402 262353
10863 262353 242168 142478 92394 147731 130564 102178 57769 89678 98161 116169 122365 116164
10851 116164 138485 193003 185978 201160 201747 210702 186612 193686 191273 157014 187205 180815 177898
10838 177898 155105 126356 129367 151058 138897 202163 221061 170944 170801 163999 114378 101692
10826 101692 76841 144119 223630 209583 184497 224262 276292 271491 218166 117515 111676 77077
10814 77077 10100 78777 125723 92751 36586 -14142 24011 57693 70904 32674 65357 151510
10802 151510 192335 174709 175528 203353 155482 102310 44565 29606 83402 61851 -22434 -12028
10790 -12028 54252 83880 109125 134829 133689 80238 28256 440 15062 25235 16297 39113
10778C9113J7299k1748j5229K5137p297N96N3530M2175j7130K822j1866J0919
10766A18321N3614K8827k7061M0671L1219k6897j3007k9351l8958n3596J6071
10755I9853K9152q262n075J1493l7899L469J0667L8092l37l4274N8351N7392p113
10742B15509o8746o3199P7454N1541o948k7453n3268q156J2741P5528J0921K4000
10730B39924k3293k9532j4629j4792l4754j3801R36J7141J5785L1782J6185N4281
10718B45233q970j4575L7168L929K3455j49n2967k9019M8041L204k1010K7446
10706B61786m75M787m629m627r199j8M0037P3778O9591l020n3988n2870J869R1895
10692D14917L5654l0297j5229N3075j051J3076M6387p006R081l415k5286k4777
$$ plain form
10778 39113 56412 34664 19435 44572 37275 37871 91401 133576 116446 119268 107402 118321
10766 118321 171935 200762 173701 214372 245591 218694 205687 176336 137378 83782 99853
10755 99853 129005 120743 115668 127161 89262 92731 103398 141490 141153 106879 165230 222622 215509
10742 215509 146763 83564 161018 212559 205611 178158 124890 116734 129475 205003 215924 239924
10730 239924 216631 187099 172470 157678 122924 109123 110059 127200 142985 174767 190952 245233
10718 245233 236263 221688 258856 262785 286240 286091 233124 204105 252146 255350 234340 261786
10706 261786 261311 266098 261469 256842 247643 247625 287662 361440 431031 428011 374023 321153 323022 414917
10692 414917 450571 420274 405045 458120 457069 470145 516532 509526 518607 515192 489906 465129
10680D65129M1796P92l488k6396L1796O460M5422k3556q069M8472Q0572M2181
10668G01111m0214j5373N956Q6704K4316j3640j702K0362M8616O4436J2859M9200
10656I42631Q455p0955L0378L6522K6269P9495P1054N7078J2102k1345L3120P2370
10644A277174M2091O2833O6997P0132M3610Q5513R7265M8829N9383J46481J31199
10633B131507J20166K05746K26905K07607J53188J96197K55386L18670L90863
10624D206235L64356M73996O35201P71551J022620J169377J375237J723519J924758
10615A3666850K063755J999269J681038J232912P49021M26202L74165O76209J259292
10606B4128713J905653K623401L247468L454574L178108K406533J284464n680
$$ plain form
10680 465129 506925 507717 504229 477833 509629 516089 561511 537955 529886 578358 658930 701111
10668 701111 660897 645524 651480 738184 762500 748860 747158 767520 816136 880572 893431 942631
10656 942631 951086 880131 910509 947031 973300 1052795 1123849 1180927 1193029 1171684 1204804 1277174
10644 1277174 1319265 1382098 1449095 1519227 1562837 1648350 1745615 1794444 1853827 2000308 2131507
10633 2131507 2251673 2457419 2684324 2891931 3045119 3241316 3496702 3815372 4206235
10624 4206235 4570591 5044587 5679788 6451339 7473959 8643336 10018573 11742092 13666850
10615 13666850 15730605 17729874 19410912 20643824 21392845 21819047 22193212 22869421 24128713
10606 24128713 26034366 28657767 31905235 35359809 38537917 40944450 42228914 42223234
10598D2223234r11725j077223m55193N54129J729500K768547L498520L651700
10590E1981489L152961J779642j96790k159149l449029l660679k964768j892626
10582D2591051o47451L58012R97214J190825Q57044j37091j458999k729459l408541
10573C7612605l379220k831288k032310j364179q02641l77009k34696m48259q72579
10564B5270424j402138j877791k086441k040520j819155j580023j296405j057080
10556A2110871q89257p83245p38569o16929n14114l79890l34212l55882l05205
10547G193568l48459k88847k36641k83845l25751k27390k17047k48836k48922
10538D767830k07268j96545k38343j52506j95393j28567j41253j77800j76084
$$ plain form
10598 42223234 41311509 40234286 39779093 40333222 42062722 44831269 48329789 51981489
10590 51981489 55134450 56914092 56717302 54558153 51109124 47448445 44483677 42591051
10582 42591051 41943600 42301612 43298826 44489651 45346695 45209604 43750605 41021146 37612605
10573 37612605 34233385 31402097 29369787 28005608 27202967 26825958 26591262 26143003 25270424
10564 25270424 23868286 21990495 19904054 17863534 16044379 14464356 13167951 12110871
10556 12110871 11221614 10438369 9699800 9082871 8568757 8188867 7854655 7498773 7193568
10547 7193568 6845109 6556262 6319621 6035776 5710025 5482635 5265588 5016752 4767830
10538 4767830 4560562 4364017 4125674 3973168 3777775 3649208 3507955 3330155 3154071
10529C154071k16224j41533j18982j01000r3375p9992j34095j13270j21647j13138
10519A920815p9140p9140p3009j21980n3756k3491q8108j4623p6084l7639o9010
10508A204835m2833l3042o9168l2993l1412m7900j0623J9504r391k2721j21483
10497H02773n5298m7974m7958J7066J4515l9014n3492k7468J5396K9428m2368
10486E65606o0735K6673n2293n9026K6643n0594k74L8785P924k1810m2189p1630
10474C07080k4602j1960M5713N2430j9042L341K6327k857l0159M2351K3753m5229
10462C67146k4659J2127j7380k5473k9533n0504l8690O289p58K8195k4964O285
10450B08081k5891k3401L1601R9558N5005k7254l5390l8570k6066l342M6849J1168
$$ plain form
10529 3154071 2937847 2796314 2677332 2576332 2482957 2402965 2268870 2155600 2033953 1920815
10519 1920815 1841675 1762535 1689526 1567546 1513790 1490299 1402191 1387568 1311484 1273845 1204835
10508 1204835 1162002 1128960 1059792 1026799 995387 947487 936864 956368 946977 924256 802773
10497 802773 747475 699501 651543 668609 683124 644110 590618 563150 578546 607974 565606
10486 565606 504871 531544 479251 420225 446868 396274 396000 434785 442709 420899 378710 307080
10474 307080 282478 270518 316231 368661 349619 352960 379287 376430 346271 388622 412375 367146
10462 367146 342487 354614 337234 311761 282228 231724 193034 199323 198565 226760 201796 208081
10450 208081 182190 158789 190390 289948 344953 317699 282309 243739 217673 214331 261180 272348
10438B72348j0412j5659L3132k621l4205j5155Q065J3013o847K792J6975O138
10426B67564K0397J511R700K8717M6799k1425k4733o3882J6364L0790n445j6450
10414B89907l8637k7630m04n128K8066L3857q599J3708n7944M0042K3062L4953
10402C25253m7638l0528k052r876k7290J733n985K44K6875k6914j6413n579J656
10389A83486k1681j0992P1915N4442l5836m4246M0250N433J8984K6359J6072N1282
10377C55468l8141n3092J7114n3079r8911q0346r628j7331M9849O8599j1469q433
10365A20600m1540K6685K3139J7721l3895J1609j1475j7447m6960J3150N1000
10354A12587K9167r494k2223M3721j4949j9568K1839L0794j6672o2475l0304J3192
$$ plain form
10438 272348 261936 246277 279409 276788 242583 227428 235493 248506 241659 244451 261426 267564
10426 267564 287961 289472 299172 327889 374688 353263 328530 264648 281012 311802 306357 289907
10414 289907 251270 223640 223236 218108 246174 280031 271432 285140 227196 267238 290300 325253
10402 325253 277615 247087 245035 235159 207869 209602 203617 203861 230736 203822 187409 181830 183486
10389 183486 161805 150813 222728 277170 241334 197088 237338 242771 261755 288114 304186 355468
10377 355468 317327 264235 281349 228270 129359 49013 39385 22054 71903 140502 129033 120600
10365 120600 79060 105745 128884 146605 112710 124319 112844 95397 48437 61587 112587
10354 112587 141754 132260 110037 153758 138809 119241 141080 171874 155202 92727 62423 75615
10342G5615j9484l4307R467K2502K4348O7859n1895K6791N793K8013K2282p0592
10330A06392n4820k9414L1362O465P385M4066o769l4228o1892l104l160j6314
10318a4031P45J1338L2118N9545m6153n5984j4040M8911N2473L827m955k8037
10306D5757m052R627o213M163J3771M5239m814K105l0356j1574j1190L5618l4116
10293E3965j5134l2116k2128K8591L3367J1744p805K405Q5195J7444o6269k2431
10281F6828N6662k5051l7214K9905O8698J071k5971J3922J1935k0736n6830j9163
10269F4056N565l7515l0561j5334J6849L8468L9599N8018K0560n0372m2294K8833
10257I5872J7229k1094J506l2061n7559P62N2844K7845J2380N9967l8055m1017
$$ plain form
10342 75615 56131 21824 31291 53793 78141 146000 94105 120896 126689 154702 176984 106392
10330 106392 51572 22158 53520 59985 67370 111436 104667 70439 8547 5443 2283 -14031
10318 -14031 -13286 -1948 30170 89715 43562 -12422 -26462 22449 74922 78749 73794 45757
10306 45757 41705 51332 45119 49282 63053 108292 103478 105583 75227 63653 52463 88081 53965
10293 53965 38831 6715 -15413 13178 46545 58289 50484 52889 138084 155528 89259 66828
10281 66828 123490 98439 61225 91130 159828 160899 134928 148850 160785 140049 83219 64056
10269 64056 69621 32106 1545 -13789 3060 41528 81127 139145 159705 109333 67039 95872
10257 95872 113101 92007 93513 61452 3893 4655 57499 85344 97724 157691 119636 78619
10245G8619m2885k9800j6999N7407L2986j8407l257l98N5491M618R069n056j3867
10232A07521N9202O2937l1674o4000o089j6635l7781N0087p0056k9723j3160j3291
10220b662j5131K9508k1833K7601K957j0781m390J3947r058k3898O6820J028j9074
10207C5034L0543R561p768k0424J4517J7124r190k7051l777L8368p954m677J700
10194F6006J7628o63R570L599j9782J0847J1129M9814J7590j0174m5360l9624
10182G0580l5156P218N436N5904K9709L1733P7602k451J4218j0913l7478l9422
10170A66980k6484l0267k8290K4430K3299O8034L9943N1628K3630j7951K3854
10159C18806j4469m0185j696j1960K1222m5243k6760M5301L5249j9382l6579J6318
$$ plain form
10245 78619 35734 5934 -11065 46342 79328 60921 57664 57266 112757 117375 126444 121388 107521
10232 107521 166723 229660 197986 133986 127897 111262 73481 123568 53512 23789 10629 -2662
10220 -2662 -17793 11715 -10118 17483 20440 9659 5269 19216 10158 -13740 53080 54108 35034
10207 35034 65577 75138 67370 46946 61463 78587 69397 42346 38569 76937 68983 64306 66006
10194 66006 83634 82971 92541 96140 76358 87205 98334 148148 165738 155564 110204 70580
10182 70580 35424 42642 48078 103982 133691 165424 243026 240575 254793 243880 206402 166980
10170 166980 140496 110229 81939 106369 129668 197702 237645 289273 312903 294952 318806
10159 318806 304337 264152 262456 250496 271718 226475 199715 245016 280265 260883 224304 240622
10147B40622L6075N1722J585r299k1348L6724L7000l2728m4311l0838n052m4612
10135B15540n3765J0116K4245m969l7668J9431N5453j5119O785J4035j5847p8594
10123A39643l1333j5801L3828N1201J2928k2222l4695k8571J6959L3558K1927
10112A77422Q701J5419j05480j15519L9335M9843J8764J9146P283l1620l4638
10101D8656k698J9805M3333Q835m5286m508l0219K747Q568J3307N591l1911K5772
10088F1992n746K968K9778K125n4596l2238j8587M5310q880l8306l3388l2278
10076h1846j9409L5056Q7266l333M2j0726p616M7803j2406j1405J2805K479J9084
10063E7794m2574p3286J7226L9342N0215p334R6103l239n1006n9393P077J7077
$$ plain form
10147 240622 276697 328419 330004 320705 299357 336081 373081 340353 296042 265204 260152 215540
10135 215540 161775 171891 196136 191167 153499 172930 228383 213264 220049 234084 218237 139643
10123 139643 108310 92509 126337 177538 190466 168244 133549 104978 121937 155495 177422
10112 177422 186123 201542 96062 -19457 19878 69721 88485 107631 114914 83294 48656
10101 48656 45958 65763 109096 117931 72645 68137 37918 40665 49233 62540 68131 36220 61992
10088 61992 56246 59214 88992 91117 36521 4283 -14304 31006 22126 -16180 -49568 -81846
10076 -81846 -101255 -66199 21067 17734 17776 7050 -566 47237 34831 23426 36231 38710 57794
10063 57794 15220 -58066 -40840 -1498 48717 41383 137486 134247 83241 23848 30925 48002
10051D8002k314p669J7030k3945k2208L3840O4652P2383K1088n2024q5989m0424
10039B2422k0738K2507o3807K4136P3091K3825k5480m8568Q438M6072J2807L3117
10027A07822n4220n1470K8055J683o484k3199Pk4386Q17k0706L1346q921L7084
10014A7428j2728J3021j9884N6063J4420r7870k8042P5459J5563J4188k5420k2727
10002e29M4826M3828K6065o8010m1805L8976K7263k0074j131K190Q090n2947m2198
9989c5456k6937q956R1560J05992O0715l9440n9612R80J0680P874m4639j5472
9977D7289J3186K547k0194l9486k4333Q5883K1440k5241j2700l3337j8109j0078
9965a3133j9873P415P2813l0652q6104k4109K8071L4141N729k2043K0131O6324
$$ plain form
10051 48002 45688 38019 55049 31104 8896 42736 107388 179771 200859 148835 62846 22422
10039 22422 1684 24191 -39616 -15480 57611 81436 55956 7388 15826 61898 74705 107822
10027 107822 53602 2132 30187 31870 25386 2187 2194 -22192 -21375 -42081 -10735 -19656 17428
10014 17428 4700 17721 -2163 53900 68320 -29550 -57592 17867 33430 47618 22198 -529
10002 -529 44297 88125 114190 46180 4375 43351 70614 50540 49409 51599 59689 6742 -35456
9989 -35456 -62393 -71349 20211 126203 186918 147478 87866 88846 99526 107400 62761 47289
9977 47289 60475 63022 42828 3342 -20991 64892 86332 61091 48391 15054 -3055 -13133
9965 -13133 -33006 -25591 47222 16570 -69534 -93643 -65572 -31431 -25702 -47745 -27614 38710
9953C8710r615j2002N1389k9646m9069K35N6058k5987k0296O1095M363n65j3380
9940E1290j5910K9925O606j4154m7872K6286N0095K1092K2090J111n194L5879
9928A61244J5049R913m003o459m3452p1639o9138l1004l573K4345M7580j101l9840
9915a2078J4067O813L0407J5723l413j5971j3199L6307M2855R599j5907n480k7833
9902F1890m2989J546J5429J0551K9672J503k0687j0979N341m0714j5245L665m6965
9889d7982o1225m731Q1049O433o782j0006L9690R480q751L3492K8265k4319J9869
9876E4482J3809O293m4797m0663k2297N5384K6751q5453J5215L0609k1484K3610
9864A1459K6015p797R264k4559l5347L0354M1045n7894o0064M6570p631R453P937
$$ plain form
9953 38710 29095 17093 68482 38836 -10233 -9998 46060 20073 -223 60872 65235 64670 51290
9940 51290 35380 65305 71911 57757 9885 36171 86266 107358 129448 130559 125365 161244
9928 161244 176293 186206 182203 175744 132292 60653 -8485 -39489 -43062 -18717 28863 27762 -12078
9915 -12078 1989 8802 39209 54932 51519 35548 22349 58656 101511 111110 95203 89723 61890
9902 61890 18901 20447 35876 46427 76099 77602 56915 45936 51277 10563 -4682 -1017 -47982
9889 -47982 -109207 -113938 -32889 -26456 -33238 -43244 -3554 5926 -2825 30667 58932 34613 54482
9876 54482 68291 74584 29787 -10876 -33173 22211 48962 -36491 -21276 9333 -12151 11459
9864 11459 37474 29677 38941 14382 -20965 9389 50434 -7460 -67524 -20954 -28585 -19132 -11195
9851a1195K2303M668n269n296R236j77j0906K5860O5005K4542j3970k7516m3806
9838C3479o4855P875o901n179Q173n450j1775L3328N0332J6443n2686k5290K2299
9825b07j2887p963O8926K5922J8841K6315K2680L2268k6492n8162J2800n706l6131
9812F0204J1265k859J4966l3285m2360j5295L2403L8595L3428o094m0008j5907
9800C5053l5491j5580K5477J8144M4915l3829n745K0844k4643n8234n681N7583
9788B2813M8156M4307K0665j5310r4072o1219K2152J4469k567J9000K72j9260
9776e94j7943k561k695j0043J7633O5764k7691n9988K1570N8821K1259k0403K6614
9763F9743J3029M681J6663K1789k3674r8671n5159K9510L8714l27k346K5986K2556
$$ plain form
9851 -11195 11108 15776 10507 5211 14447 14270 3364 29224 94229 118771 104801 77285 33479
9838 33479 -31376 -23501 -30402 -35581 -27408 -32858 -44633 -11305 39027 55470 2784 -22506 -207
9825 -207 -13094 -21057 47869 73791 92632 118947 141627 173895 147403 89241 102041 96335 60204
9812 60204 71469 68610 83576 50291 7931 -7364 25039 63634 97062 90968 50960 35053
9800 35053 -438 -16018 9459 27603 72518 38689 32944 53788 29145 -29089 -34770 22813
9788 22813 70969 115276 135941 120631 26559 -34660 -12508 1961 -606 18394 18666 -594
9776 -594 -18537 -21098 -23793 -33836 -16203 49561 21870 -38118 -16548 42273 63532 43129 69743
9763 69743 82772 87453 104116 125905 102231 3560 -51599 -22089 16625 16298 13952 39938 62494
9750F2494O8408Q5191J2578n6709L3080M812M9278M2038L914m7717J5740O3961
9738C37068O0313R0167J77161J03630J32627K42488L13967K46268L76762N39085
9728B619536M91736M20114K99156J40849l0563k35786l50576m78662m20734l76119
9718B078951l94878l22714k23757j36422j43245j01045q7063n1863k1831o4781
9708E31352p3337j4044o1102o3821j9870K0594P2664k118q056m0199J043M9188
9696C92294p7944n3151K9364k7817j10101j5217M1706P0175n960m5649k2573N588
9684A80715m9356r117q994m520M3992K9142k0820K6472Q933n1780l0681j1852
9672A02134o369M3567L16k8303k5910q944j893j4980L4005J9514n7517l8385j684
$$ plain form
9750 62494 130902 216093 228671 171962 205042 209854 259132 301170 305084 257367 273107 337068
9738 337068 397381 487548 664709 768339 900966 1143454 1457421 1703689 2080451 2619536
9728 2619536 3111272 3531386 3830542 3971391 3940828 3705042 3354466 2875804 2455070 2078951
9718 2078951 1684073 1361359 1137602 1001180 857935 756890 669827 617964 596133 531352
9708 531352 458015 443971 382869 319048 299178 319772 392436 390318 382262 342063 343106 392294
9696 392294 314350 261199 290563 262746 152645 137428 179134 249309 243349 197700 175127 180715
9684 180715 131359 122242 113248 108728 152720 181862 161042 187514 196447 144667 113986 102134
9672 102134 95765 139332 139648 111345 85435 76491 74598 59618 93623 113137 55620 17235 15551
9659A5551M8187M8291L4628m1904k5585J8688J8132k9387k665L5891M9000j2332
9647A56495n2568l8563K4223O3645l0807p3526J017Q7957K3357l1903m8396k7839
9635E3092N245k9781o517J1342L4801K6827n3827n6799P840k8622j8860L4191
9623b1068M5286L1619J1142l4063l8398K2415K5156K9000n259l6770O4602K2715
9611A16377M926n3130p2044k7508M6831j1623k321J6114j2087J5754L6151k507
9599E4933j1533k2259K220L1499N3205K4053l5372p5847k7431K2193J8813m204
9587C0270j8339m1696l8264N7088N1315j6580m4827K3238j8351R203R6485k0559
9575F8983q5590J114l37o540p966J704M1625k8850j7872J7898k9420j582M0439
$$ plain form
9659 15551 63738 112029 146657 104753 79168 97856 115988 86601 83936 119827 168827 156495
9647 156495 103927 65364 89587 153232 122425 48899 49916 137873 161230 129327 80931 53092
9635 53092 58337 28556 22039 33381 68182 95009 41182 -15617 -7777 -36399 -55259 -21068
9623 -21068 24218 55837 66979 32916 -5482 16933 42089 71089 65830 29060 93662 116377
9611 116377 121303 68173 -3871 -31379 15452 3829 1508 17622 5535 21289 57440 54933
9599 54933 43400 21141 23361 54860 108065 132118 96746 20899 -6532 15661 34474 30270
9587 30270 11931 -29765 -68029 -10941 40374 23794 -21033 2205 -16146 -6943 89542 68983
9575 68983 -16607 -15493 -15830 -22370 -30336 -28632 12993 -15857 -33729 -15831 -45251 -46833 -6394
9562f394k5237l7341N7278O3030o735l8924J8769L0201M726J7570l1586p8520
9550c3163k5526R8207L2028l6942n5012O74K3533J7226n0500n5766L8148M9772
9538B679k5316O818K1675K50k7797j5032K7779M6576K5645K8741l6871l1722o592
9525A6833J6386J8121K2599m5492k5497m0360k1108M1745J4174k2329o614L4132
9513B590O049K6726K8674K816j7953o1439m4699l4315M1204K7528N1504m1451
9501a2766k5548J6036o602M0110J3348k8265r3355j2038M5219L3442K1547k6905
9489c5777J4933k760J6102j0677l3035k6856q510O0067P757N1017J392P697j8679
9476B2671J1220O2144l7161k880j97o203j5567m0298k0966J6424J542n6617k8635
$$ plain form
9562 -6394 -31631 -68972 -11694 51336 44601 5677 24446 54647 59373 76943 45357 -33163
9550 -33163 -58689 39518 71546 34604 -20408 -19734 3799 21025 -29475 -85241 -47093 2679
9538 2679 -22637 -15819 5856 6106 -21691 -36723 -8944 37632 63277 92018 55147 23425 16833
9525 16833 33219 51340 73939 28447 2950 -37410 -58518 -16773 -2599 -24928 -31542 2590
9513 2590 8639 35365 64039 66855 48902 -12537 -57236 -91551 -50347 -22819 28685 -12766
9501 -12766 -38314 -22278 -28880 11230 24578 -3687 -97042 -109080 -63861 -30419 -8872 -35777
9489 -35777 -20844 -23604 -7502 -18179 -51214 -78070 -86580 -26513 -18756 32261 33653 41350 22671
9476 22671 33891 96035 58874 55994 55797 49594 34027 -6271 -27237 -10813 -9271 -65888 -94523
9463i4523J8015M1425K0263k2002R940J4386R901J7034K6623l4494l1387J1690
9451a3129K8916k7039p31K5088j7673r491O103j7797L0898N8151k8741l8258k0359
9438b4062L2500M5515j7558n2198l1031k0089K4004j3570M720K239P375j3353
9426e5508p4970N9879J8631J7822Q4753l4219m2748n5239Q322L6438o608J7500
9414b5947K4919j7032j9311O5469k9211J579O72R118K2340l9996l8560N5597L1938
9401D1575n759K6116l6705p8425j6338J9442O6885K581j7619k9666k8171O4828
9389H744J2487o7153L9347L049K4733K2373l7476j9497K2097M7069j4140m2252
9377f19k5843O011l89r373m1567l946N523r118L8559K9378P1963J6866m1208l0911
$$ plain form
9463 -94523 -76508 -35083 -14820 -36822 -26882 -12496 -2595 14439 41062 6568 -24819 -13129
9451 -13129 15787 -11252 -11983 13105 -4568 -14059 -7956 -25753 5145 63296 34555 -3703 -24062
9438 -24062 8438 53953 36395 -15803 -46834 -66923 -42919 -56489 -51769 -49530 -42155 -55508
9426 -55508 -130478 -70599 -51968 -34146 50607 16388 -26360 -81599 -73277 -36839 -43447 -25947
9414 -25947 -1028 -18060 -37371 28098 -1113 466 1138 10256 32596 -7400 -45960 9637 41575
9401 41575 35816 61932 25227 -53198 -69536 -50094 16791 19372 1753 -27913 -56084 8744
9389 8744 21231 -45922 -6575 -3526 21207 43580 6104 -13393 8704 55773 41633 -619
9377 -619 -26462 -20451 -20840 -30213 -71780 -75726 -70203 -79321 -40762 -11384 60579 77445 36237 5326
9363E326l6201p671j2397k7960K9221N0642n7312O5558J0051q283J1861l4773
9351a1938L302L4445L8662J3971l2071n3161K3653l3602K1139j1293N792j0707
9339a1808m4407O951M5584q055n2434m6020m240j0390L3983N1614l804K731o858
9326d7153K9236k4667J9935R2548k2890k8513m3399J4898L3951n438p281l6142
9314b4915R69k2313n0952K8976O6572O2008k6686j04062l9273O5652K8119J3483
9302b422n3005L4800N6397m3809n356M2576R424j7857n5431j5128l2898J2308
9290g0401L8757k0326L3434k9360l0666N4122J04314K4640R111l6962n9041M912
9278B2534J27876j6808n1475k0933k5704n095K2802l0174n797L5720n957o5331
$$ plain form
9363 5326 -30875 -38546 -50943 -78903 -49682 960 -56352 9206 19257 10974 22835 -11938
9351 -11938 -8636 25809 64471 78442 46371 -6790 16863 -16739 4400 -6893 -1101 -11808
9339 -11808 -56215 -49264 -3680 -11735 -64169 -110189 -114429 -124819 -90836 -39222 -43026 -40295 -47153
9326 -47153 -17917 -42584 -22649 69899 47009 18496 -24903 -10005 23946 18508 11227 -24915
9314 -24915 -23946 -46259 -97211 -68235 -1663 60345 33659 -70403 -109676 -44024 -15905 -2422
9302 -2422 -55427 -20627 35770 -8039 -13395 29181 38605 20748 -34683 -49811 -82709 -70401
9290 -70401 -31644 -51970 -18536 -47896 -78562 -24440 79874 104514 113625 76663 17622 22534
9278 22534 150410 133602 82127 61194 35490 30395 53197 23023 17226 52946 46989 -18342
9266a8342m4705J5370K3956k0825j9332J5228O5177K9549K2225m195R581J6051
9254H9738m686P98n0723K7180K1115n5429j0130J3751J1096k2312k357M1733l7233
9241B2541k5948J1358j1212R599J1659K2131P794K5253q808k8429M936q3555l5331
9228g8012Q738J3937L0166L6933L494J8739k5230j4371K2719l9779p343o83J8499
9215a2193p952k1750n598O1733p783l3999J357q180l1100M0324K7263O1642l1724
9202C2040n840p3782P352P2155m8735m3127J4456l1104j7016P0283P0396j3653
9190C3425k9650N841N6492L7165k2913J8620j1043m1126o176k863o8855L470K4974
9177b639K668K1238L8834J2001m0250p852K006o5183J0985p896N6955k1649q763
$$ plain form
9266 -18342 -63047 -47677 -23721 -44546 -63878 -48650 16527 46076 68301 64106 73687 89738
9254 89738 85052 85850 35127 62307 83422 27993 17863 31614 42710 20398 18041 59774 22541
9241 22541 -3407 7951 -3261 6338 17997 40128 47922 73175 64367 35938 40874 -42681 -78012
9228 -78012 -69274 -55337 -25171 11762 15256 33995 8765 -5606 17113 -22666 -30009 -30692 -12193
9215 -12193 -20145 -41895 -47493 14240 6457 -27542 -26185 -34365 -65465 -25141 2122 63764 32040
9202 32040 26200 -47582 -40230 31925 -16810 -59937 -45481 -76585 -93601 -23318 47078 33425
9190 33425 3775 9616 66108 103273 80360 98980 87937 46811 40635 37772 -31083 -27613 -2639
9177 -2639 29 21267 60101 72102 31852 24000 26006 -39177 -28192 -36088 20867 -782 -9545
9164i545J1702L6743O5371k6740l2701m170J2000l268j7789N295o850k7646k7188
9151b4786j5932J9736J9610J132k0967l4929n812J1787N16l0094M6652R7904L0423
9138I5240M790p1903m7629M6359l7836P1762j8713n8853K5550j2325j7475L6027
9126A4994O0819m2288n0619n2277L8610Q0153M4908L2609r247k1495n8226J1889
9114D9830q713k3602J8516L4548n337j4158k5723J9142O8258m0855m3131o6074
9102c7299j6959L0872K070L0217K3416K2483J9750n0336l1937J2303l4635r034
9090c9089m5990R2679Q6667l5484m8049k7535l6275J5336L8553k0878p2859J0264
9078h2660K9808N6866k6608K672l0663K1979L2124K7763J7899o724L002n7993
$$ plain form
9164 -9545 2157 38900 104271 77531 44830 40660 52660 49392 31603 36898 30048 2402 -24786
9151 -24786 -40718 -20982 -1372 -240 -21207 -56136 -61948 -50161 -49645 -79739 -33087 64817 95240
9138 95240 100030 28127 -19502 26857 -10979 60783 42070 -16783 8767 -3558 -21033 14994
9126 14994 75813 33525 -17094 -69371 -30761 49392 94300 126909 117662 96167 37941 49830
9114 49830 41117 17515 36031 70579 65242 51084 25361 44503 112761 71906 28775 -37299
9102 -37299 -54258 -23386 -21316 8901 32317 54800 74550 24214 -7723 4580 -30055 -39089
9090 -39089 -85079 7600 94267 58783 10734 -16801 -53076 -37740 813 -20065 -92924 -82660
9078 -82660 -52852 4014 -22594 -19922 -50585 -28606 3518 31281 49180 42456 45458 -12535
9066a2535o3684m9680K0821N2025L7108j6636K0840L2655L2980q294k0993K5258
9054D9865J4008j6105n2428l178m7343m8287Q993M7903K0903n4096p0357L0367
9042a19755L5840n735j0986o645K1951J3323Q718j5389r33J8593N4019J1342m9283
9029d4940l5742K1774J03060N3340m2838l6986J2336k8851n0577N8664N4654L4734
9017I8628j6441n3696M118n803J0994M877l7523j8867n4654k3963p812N0715J9518
9004b9909M4249L3374L6002k4392j8247r926o1054l1334J7878j6995L2335k2028
8992e0047l445L5149L8516o8351j8480N5193J6942Q32k2996J7582R398K7128k6462
8979A0959N654k706L0132j7462m9815N968N9481l8802J5589K0454j3933n396J0608
$$ plain form
9066 -12535 -76219 -125899 -105078 -53053 -15945 -32581 -11741 20914 53894 45600 24607 49865
9054 49865 63873 47768 -4660 -7838 -55181 -103468 -94475 -46572 -25669 -79765 -150122 -119755
9042 -119755 -83915 -89650 -100636 -107281 -85330 -72007 -63289 -78678 -79611 -61018 -6999 4343 -44940
9029 -44940 -80682 -58908 44152 97492 54654 17668 30004 1153 -49424 9240 63894 98628
9017 98628 82187 28491 32609 26806 37800 42677 5154 -13713 -68367 -92330 -100142 -49427 -29909
9004 -29909 14340 47714 83716 59324 41077 31151 -29903 -61237 -43359 -60354 -28019 -50047
8992 -50047 -53492 -18343 20173 -48178 -66658 -11465 5477 6309 -16687 895 10293 37421 10959
8979 10959 16613 13907 44039 26577 -23238 -17270 42211 3409 18998 39452 25519 20123 30731
8966C0731m9792O32N1134M5792m9427m6715L1583o818J8078r444j0907m7971l5458
8953g8582J0264N5703K3644j9541l3980m3777l5471L9991L2299K2085J86K2717
8941d462j594k4825O8081K1694k2008J873L1274k8466n6521m8775K0301N873M0794
8928C239P3044J2517m6303n2119j3820N66M9778p909n8097l3036l160K9633R084
8915c6583J0481r373n5673J072m2111N7120Q0233K8085o5n1508n2969L839p504
8902g4956K9839K3944M76O900O99j5477K7635k0314l9143J7966J1073J614J8732
8889a1012P172K6214K2774L5087p4836k4898L1861J0435q0488l469J9247J6549
8877b5364M2238j0314m5540k2590j0995J3839r184l6550l0248L3317O3346M01
$$ plain form
8966 30731 -19061 -18429 32705 78497 29070 -17645 13938 7120 25198 15754 4847 -43124 -78582
8953 -78582 -68318 -12615 11029 -8512 -42492 -86269 -121740 -81749 -49450 -27365 -27179 -4462
8941 -4462 -6056 -30881 37200 58894 36886 38759 70033 41567 -14954 -63729 -43428 -37555 3239
8928 3239 76283 88800 42497 -9622 -23442 -22876 26902 18993 -39104 -72140 -75300 -45667 -36583
8915 -36583 -26102 -35475 -91148 -90076 -132187 -75067 5166 33251 33186 -18322 -71291 -67452 -74956
8902 -74956 -45117 -21173 -20697 -13797 -13098 -28575 -940 -21254 -60397 -42431 -31358 -29744 -11012
8889 -11012 -3840 22374 45148 80235 5399 -19499 12362 22797 -57691 -61160 -41913 -25364
8877 -25364 16874 6560 -38980 -61570 -72565 -58726 -67910 -104460 -134708 -101391 -38045 -37644
8865c7644L2732j0254m2814Q8035N6903k5815r2341j4950K2086l92j4119J3821
8853b4752L3404N7890j0130K7440R633j3654L1920n395m5600n370J5185j4601
8841E5970k0429p9135j985j6101L618m257J548m899K3836J1637J4186N4175O0253
8828I8417J2941j4045j8728K272J6752k8801m5516m0851N644J5041r768J4124
8816G482N8056M1739j5294r1202k1744o9417o136l7424m227L4989K3827p192k0294
8803a06837n347L8795N5051K7438L3875m476j1049j4144r507J7100k9878L738
8791e241K3001r392k8878J4567J9253j4467R59K8533j8810k9303m0889K3208M1224
8778C765L2354j5490J946R040K7467p3557n3144N1681M1082K558J7828k6525K3702
$$ plain form
8865 -37644 -4912 -15166 -57980 30055 86958 61143 -31198 -46148 -24062 -24454 -38573 -24752
8853 -24752 8652 66542 56412 83852 93485 79831 111751 106356 60756 55386 70571 55970
8841 55970 35541 -43594 -45579 -61680 -58062 -62319 -60771 -65670 -41834 -30197 -16011 38164 98417
8828 98417 111358 97313 78585 80857 97609 68808 23292 -17559 -11915 3126 -6642 7482
8816 7482 65538 107277 91983 781 -20963 -90380 -96516 -133940 -138167 -103178 -79351 -86543 -106837
8803 -106837 -112184 -73389 -18338 9100 42975 38499 27450 13306 3799 20899 -8979 -5241
8791 -5241 17760 8368 -20510 -5943 13310 -1157 -198 28335 9525 -19778 -60667 -37459 3765
8778 3765 36119 20629 22575 31615 59082 -14475 -67619 -15938 25144 27702 45530 19005 42707
8765D2707P495L9188L7843n7985p2288J5907J2932n264m3680M7604k3462J3198
8753A4195k1534j2838L1359o099J8023j4375o3923L7742k2439n0495L7651j8267
8741g1000O206J6462K6154k2144m3673N9277r135j4971k2910O5647N3823j5178
8729B8558R397j1531l0566l8678j1830R274J5025J9556M727j4811j7111J7101
8717b0889K3625j502L5159r701m3027k9032K5424N4945M8624l6927l0604l6296
8705b0201j7353R009M260l355j6234P8921N9890n0247J0813K0885m5033L3467
8693F4822l6018m364N398j1518L7954Q225O287m5755j5999J2266l6055j2432K2077
8680e112L2666J3207M0591m2790l809L5567j211q046l2855l9311p2506K8252L3670
$$ plain form
8765 42707 50202 89390 127233 69248 -3040 12867 25799 20535 -23145 24459 997 14195
8753 14195 -7339 -20177 11182 5083 23106 8731 -55192 -17450 -39889 -90384 -52733 -71000
8741 -71000 -64794 -48332 -22178 -44322 -87995 -28718 -37853 -52824 -75734 -10087 43736 28558
8729 28558 37955 26424 -4142 -42820 -54650 -45376 -30351 -10795 -6068 -20879 -37990 -20889
8717 -20889 2736 1234 36393 26692 -16335 -45367 -19943 35002 83626 46699 16095 -20201
8705 -20201 -37554 -28545 -24285 -27640 -43874 35047 94937 44690 55503 76388 31355 64822
8693 64822 28804 24440 29838 18320 56274 64499 70786 25031 9032 21298 -14757 -27189 -5112
8680 -5112 27554 40761 81352 38562 34753 70320 69109 61063 28208 -11103 -83609 -55357 -21687
8667b1687Q49M0019P618N0937N0910l5450m5505p1657m3304k4884L3002k11n731
8654f5094j6123K036N976j4146M2502P0570L6214p6556j7950k543K7246l185J9857
8641H804J877M6460K3873l37p1962l017M8124m7774j943M256K4458j0453k3126
8628g60k9915k8921L379M6248N2660N2325K645n4341n3821o150K6135K6481R443
8615D5408J0050m4659L963J3948P9358l5661o7642k7185K5199N6576K855J430
8603F3640n6091j9303M8109L6283j6826o6028J8460J9282m0386P167k0565k4553
8591e0811j6870L7527N2139L7876L6024J0494k5453J4134j7352n391k7289N0188
8579I5216N493r932m8665k3550M3136P420L9575R767p8422k4879M9677M0400l572
$$ plain form
8667 -21687 -20838 19181 26799 77736 128646 93196 47691 -23966 -67270 -92154 -59152 -59363 -65094
8654 -65094 -81217 -79181 -73205 -87351 -44849 25721 61935 -14621 -32571 -35114 -7868 -11053 8804
8641 8804 10681 57141 81014 80677 8715 5698 53822 6048 4105 8361 32819 22366 -760
8628 -760 -30675 -59596 -56217 -9969 42691 95016 97661 43320 -10501 -16651 9484 35965 45408
8615 45408 55458 10799 14762 28710 108068 72407 4765 -22420 2779 59355 62210 63640
8603 63640 7549 -11754 36355 72638 55812 -10216 8244 27526 -12860 -5693 -26258 -50811
8591 -50811 -67681 -30154 21985 59861 95885 106379 80926 95060 77708 72317 45028 95216
8579 95216 100709 90777 42112 18562 61698 69118 108693 118460 40038 15159 64836 105236 101664
8566A01664k0060m411n4635l059k6102o4337m3435Q7015N3480j9538l8191o413
8554c8022Q0741L1381r345k3684P293n443P1610p2035p6145j1505n16k3689J4702
8541e4657M2732N5397j2996L766j107m5162n6692n7457O399O040K9351L4733j7618
8528f7271N1907O3176K8602J3990k4748n852o4182j4301P1521k6676p0785o222
8516e0841j6169L7124j3415K786k292o032l4439J428J2521J0535K3829L1621l247
8503f591k7882j7592L0147J1274j2171J6374L3768j9525J5846K3451K6945j7972
8491E6072q2738m8493L700L1211P4729Q170q773j4609l6701m0851l2857J8966
8479g2174J9477J1727L795J4114r028k5989l800L9797k2520q412J2471K5932m951
$$ plain form
8566 101664 81604 77193 22558 19499 -6603 -70940 -114375 -27360 26120 6582 -31609 -38022
8554 -38022 42719 74100 64755 41071 48364 42921 114531 42496 -33649 -45154 -45670 -69359 -54657
8541 -54657 -11925 43472 30476 34242 33135 -12027 -68719 -126176 -119777 -113737 -84386 -49653 -67271
8528 -67271 -15364 47812 76414 90404 65656 59804 -4378 -18679 52842 26166 -44619 -50841
8516 -50841 -67010 -29886 -43301 -40515 -42807 -48839 -83278 -81850 -69329 -58794 -34965 -3344 -6591
8503 -6591 -34473 -52065 -21918 -10644 -22815 -6441 27327 7802 23648 47099 74044 56072
8491 56072 -26666 -75159 -71459 -40248 34481 42651 33878 19269 -17432 -58283 -91140 -72174
8479 -72174 -52697 -40970 -37175 -23061 -32089 -58078 -61878 -22081 -44601 -53013 -40542 -14610 -19561
8466a9561k242R976l0886J846n868m096L8573J0214j9236J2552j49l7631L3272
8453a3236O688R504L6609j4520l3025j0722J666l044L8754O4231j7169O551J5157
8440H7444j0263R777J9336P304K0268J5987J1157l54p6820K0415Q226j9836j8792
8427G3849m648n825Q329k0682p0139q093J2945N467L581L6265M1956M5017N2701
8414A70723o3116p5920r245j832k015k7212j6352K6192L8732l8083J5970N9837
8402G7679R889j06050M358K1619p002k5326M319R8651M5819k6959n4679M323K1442
8389F8083l2077O620R358n4439L630L8582K8150J3007L850m2769j2112P363m9271
8376a2025m7002N8912K2012J1783o470p763l4071l9085J5591J19733K8268q7858
$$ plain form
8466 -19561 -21803 -11827 -42713 -40867 -46735 -50831 -12258 -2044 -21280 -8728 -8877 -46508 -13236
8453 -13236 -6548 2956 39565 25045 -7980 -18702 -17036 -20080 18674 82905 65736 72287 87444
8440 87444 77181 86958 106294 113598 133866 149853 161010 160656 83836 104251 112477 92641 73849
8427 73849 69201 63376 71705 51023 -19116 -27209 -14264 -8797 -5216 31049 73005 118022 170723
8414 170723 107607 31687 22442 20610 18595 -8617 -24969 1223 39955 1872 17842 77679
8402 77679 87568 -18482 -14124 7495 493 -24833 -20514 78137 123956 96997 42318 46641 68083
8389 68083 36006 42626 51984 -2455 1175 39757 67907 80914 84764 41995 29883 37246 -12025
8376 -12025 -59027 -115 21897 33680 27210 19447 -14624 -53709 -38118 81615 109883 22025
8364B2025o4690n3411M7933P3634L3852J7946K6426k6496r5937k5917Q2948N7567
8352I5880l9070k1847M0441M740l040j2930M1926J8175N5937L0511j6348J4520
8340B08895J4731p7602n3514L3911N10o5987K399m8976j6296K4496l4921J9784
8328G430K7730k156J8964O3667L4396M8359o4242n9781m1672k6307k7346K1839
8316H81N8740M401K0258P515J6654K904O4343j794o3811m5401M4686N6018N4956
8303B20350J21725O6036O2893N2751Q2303J03039J30684O8829K3032N0883J42931
8292A125456J93925L12166L69173L25224J87107j6168l10140n03283m10123k82275
8282I91062k30258j40403q4439o4781o6137J060L4064j4402r4219n610J7909M6848
$$ plain form
8364 22025 -42665 -96076 -48143 25491 59343 77289 103715 77219 -18718 -44635 38313 95880
8352 95880 56810 34963 75404 80144 77104 64174 106100 124275 180212 210723 194375 208895
8340 208895 223626 146024 92510 126421 126931 60944 63343 14367 -1929 22567 -12354 7430
8328 7430 35160 33004 51968 115635 150031 198390 134148 74367 32695 6388 -20958 881
8316 881 59621 64022 84280 91795 108449 111353 175696 173902 110091 64690 109376 165394 220350
8303 220350 342075 408111 471004 523755 606058 709097 839781 908610 931642 982525 1125456
8292 1125456 1319381 1631547 2000720 2325944 2513051 2496883 2186743 1683460 1273337 991062
8282 991062 760804 620401 535962 471181 405044 406104 440168 425766 331547 325937 343846 390694
8270C90694L5177j4834l9308l8353K5401J7001K1408j015J9866L0210J6968O8675
8258E31890Q2022O5836J45025K31823K71340K87520L39761L04812K70815J22876
8248B653720j70709m63079m63181m26987l14859j39331o0822o1193n9694k6745
8238D67120m4231j528K4728l4233l8056p2318p7683p691M187J2006J0143m5439
8226A97005j258j4071l6526M2204l8485k3352L3771M9196k5056K7323O1063n7299
8214B14515p2334n8660m1105L5273o3082L0356K3124k7403j1839P4017L2808m7467
8202H8203k1303j8034J4915k4158j0811J6698K0996n813K1444j0136k9816k816
8190C9369J0302O767J7409J1004J5101n4015k9223M8837j8227l8123n2519L3931
$$ plain form
8270 390694 425871 411037 371729 333376 358777 375778 397186 396171 416037 446247 463215 531890
8258 531890 613912 679748 824773 1056596 1327936 1615456 1955217 2260029 2530844 2653720
8248 2653720 2483011 2019932 1556751 1129764 814905 675574 614752 553559 493865 467120
8238 467120 422889 421361 446089 411856 373800 301482 223799 216108 220295 232301 242444 197005
8226 197005 195747 181676 145150 187354 148869 125517 159288 208484 183428 210751 271814 214515
8214 214515 142181 83521 42416 77689 14607 44963 68087 40684 28845 102862 135670 88203
8202 88203 66900 48866 63781 39623 28812 45510 66506 60693 82137 72001 42185 39369
8190 39369 49671 56438 73847 84851 99952 45937 16714 65551 47324 9201 -43318 -9387
8178i387M7822L0494n238m284Q822n5612j6049O276k2219K7295j6582P3761K5010
8165I0109n8150k1213N0032J5795K2901l0337m5682j3463K0882O172k9246p1304
8153f3504j6523R437K9367Q5313l425j1773O0834L0419o1260q3342k5484j3582
8141f3523j6697n9234q889L5827j8852j0269J9228R969M0781J03365j050m6156
8129a5500J5904k1421p073N2250L8711j0576J517k9577j5901K7075m823L2747
8117F3333J6384o3327j9679k0498m1550Q198O0149L7798o4260q4604K3635N4040
8105c0381j5726n266K7262K9934P0026k2319n5243k1476o851l6549K9191M3894
8093F496q405N3000M0145K0454N5441l347q6802l2598n040O8j2414j9219q540
$$ plain form
8178 -9387 38435 68929 63691 59407 68229 12617 -3432 2844 -19375 7920 -8662 65099 90109
8165 90109 31959 10746 60778 76573 99474 69137 23455 9992 30874 37046 7800 -63504
8153 -63504 -80027 -70590 -41223 44090 40665 28892 89726 120145 58885 -24457 -49941 -63523
8141 -63523 -80220 -139454 -148343 -112516 -131368 -141637 -122409 -112440 -71659 31706 30656 -15500
8129 -15500 404 -21017 -28090 24160 62871 52295 53812 24235 8334 35409 30586 63333
8117 63333 79717 16390 -3289 -23787 -65337 -57139 3010 40808 -23452 -108056 -84421 -30381
8105 -30381 -46107 -51373 -24111 5823 75849 53530 -1713 -23189 -30040 -66589 -37398 6496
8093 6496 -1909 51091 91236 111690 167131 163784 76982 44384 39344 39412 26998 7779 -761
8080g61r850l9878L6573n9774k2422N4477J5304R3981K4368k3603j1872O380M99
8067F3422m5333m9974j3074K6832K4255N259m4925P4837Q0112K9656p0983l1955
8055D8129k7788n1360l2674K3829N7591M3806k7860o1101J2112K8172m0614m6207
8043g3965P448j8189j5993J5393L6277K7214j3081R363J2740K6106k1734k9398
8031c7819l7926L0704K4276J1228K6890O6875Q973q484j02673J088N379O1494
8019E0005K4881P819L756n8309n4859o823J1983O9642m3006M5559O3295j9970
8007I3973q7419j4682M0008J1212M617o2808K3336P4275l2450n8965k8161J8048
7995a9016M2125m839p6020j3992K6169L3391j3058J7916O4097l8637J8693m165
$$ plain form
8080 -761 -10611 -50489 -13916 -73690 -96112 -41635 -26331 67650 92018 68415 56543 62923 63422
8067 63422 18089 -31885 -44959 -18127 6128 11387 -33538 41299 121411 151067 80084 48129
8055 48129 20341 -31019 -63693 -39864 17727 61533 33673 -27428 -15316 12856 -27758 -73965
8043 -73965 -66517 -84706 -100699 -85306 -49029 -21815 -34896 -25533 -12793 13313 -8421 -37819
8031 -37819 -75745 -45041 -20765 -9537 17353 84228 93201 84717 -17956 -16868 -11489 50005
8019 50005 74886 82705 86461 28152 -26707 -33530 -21547 48095 5089 50648 113943 93973
8007 93973 6554 -8128 31880 43092 47709 -15099 8237 82512 50062 -8903 -37064 -19016
7995 -19016 23109 18270 -57750 -71742 -45573 -12182 -25240 -7324 56773 18136 36829 32664
7983C2664K7497K3390l471P927j4847o2445k4464J9486K1312N818m540N693j8682
7970A5338L9492K5597j3494o3600l0415j1885K3574J5419N7715j934l2319K3494
7958D6982K8467j2624o4658j4463n827q181L3135K3978K068R649k7757l50P2302
7945H2721K7420k0961o5876L772M1209l3868j07214o7300L0628O4993J145N5202
7933A1871K1659j7548j0316P610O312O481n3909o287l3626k990L4166K8164l1750
7920d0163k7752k8128K154P950j2144j8966J7706R509j3162N2161L7828n2183
7908f5190l0934R085L3876J7462M818j3120K7831N217J1268n6710n4622O435j3288
7895a17872O0058P8377R739k1800k5539K7485K8293j7787j0504P4441j3823k1322
$$ plain form
7983 32664 60161 83551 80080 88007 73160 10715 -13749 5737 27049 32867 28327 34020 15338
7970 15338 54830 80427 66933 3333 -27082 -38967 -15393 26 57741 55807 23488 46982
7958 46982 75449 62825 -1833 -16296 -22123 -30304 2831 26809 28877 38526 10769 10419 82721
7945 82721 110141 89180 23304 27076 68285 34417 -72797 -140097 -109469 -44476 -43331 11871
7933 11871 33530 15982 5666 13276 19588 26069 -27840 -34127 -67753 -70743 -36577 -8413 -40163
7920 -40163 -67915 -96043 -93889 -85939 -98083 -117049 -99343 -89834 -102996 -50835 -13007 -65190
7908 -65190 -96124 -87039 -53163 -35701 -30883 -44003 -16172 -10955 313 -56397 -111019 -104584 -117872
7895 -117872 -57814 20563 30302 8502 -17037 10448 38741 20954 10450 84891 71068 49746
7883D9746J6649j5175l8190K1402l0710j3430j3224K9453L4577P499p1626l3479
7871e6508L0064P4395K0812o1374R853J5696j6691J6699J0367l6721m1852j8904
7859e4164M3934k8474J4881R067M0455Q117p399j9603L0497m112J3853L2524m172
7846G5404k6949j3167n387m1447n421L5600o0826k0890L8867j5507o1353o569
7834a07645Q1317N0725L5667m4424m131J47o7975k4322l0563m3847L2877O4533
7822e7641N1174K7066R846k6478o2670n2121J577N7739J2136o3776M6250P9544
7810B2646M9097k0243M50P056l2179p0708j439R1111N7049o948o5749l9431J5149
7797E861k3555M8697j0649m3727k2356k536M5376K327k190l3567j7139m393o543
$$ plain form
7883 49746 66395 51220 13030 34432 3722 -9708 -22932 6521 41098 48597 -23029 -56508
7871 -56508 -26444 47951 68763 7389 17242 32938 16247 32946 43313 6592 -35260 -54164
7859 -54164 -10230 -38704 -23823 -14756 25699 33816 26417 6814 37311 33199 47052 79576 75404
7846 75404 48455 35288 29901 -11546 -16967 18633 -42193 -63083 -24216 -39723 -101076 -107645
7834 -107645 -26328 24397 60064 15640 11509 11656 -56319 -80641 -111204 -155051 -122174 -57641
7822 -57641 -6467 20599 30445 3967 -58703 -110824 -109247 -51508 -39372 -103148 -56898 22646
7810 22646 71743 51500 51950 59006 26827 -43881 -45320 45791 102840 95892 30143 -9288 5861
7797 5861 -17694 31003 20354 -23373 -45729 -48265 -2889 -562 -2752 -36319 -53458 -57851 -64394
7784f4394N2394J9234j2422j9427m0979p737j4474O4541O020O433K1952J5850
7772B6991L9789j8978l7009J200N384o8599K9440J6146m2405k6003J6796O3309
7760F061J8785K6242K0538L800o8939m5501P6947j4318l1393O488K7729L2154
7748E8593j9469j1342j7913l0794m2008k6793N4324j710q1957n096O0896M2253
7736b1016M0908j0083K7482K754k7660O676k5458o0028K2841M0598K7081m504
7724A9591j6703k11L7690n2482l7800k707L9955J7437l5442j8359K2907l8785
7712f4909k3849m4288K0900P219j0792j434R992L0303l719j2127L5861l21q4703
7699a41867j6244Q5010O5242m785L686Q570K588K6621q458m5216j6277o921M2106
$$ plain form
7784 -64394 -12000 7234 -5188 -24615 -65594 -73331 -87805 -23264 -17244 -10811 11141 26991
7772 26991 66780 47802 10793 11993 17377 -51222 -21782 -5636 -48041 -74044 -57248 6061
7760 6061 24846 51088 71626 75426 6487 -39014 37933 23615 -7778 -1290 26439 58593
7748 58593 39124 27782 9869 -20925 -62933 -89726 -35402 -37112 -119069 -124165 -63269 -21016
7736 -21016 19892 9809 37291 40045 12385 19061 -6397 -66425 -43584 -2986 24095 19591
7724 19591 2888 2677 40367 -12115 -49915 -52622 -12667 4770 -30672 -49031 -26124 -64909
7712 -64909 -88758 -133046 -112146 -104927 -115719 -117153 -107161 -76858 -80577 -92704 -56843 -57164 -141867
7699 -141867 -158111 -73101 -7859 -12644 -8958 -388 2200 28821 20363 -24853 -41130 -48051 -5945
7686e945L9935J6978p4647P996L9310j7627k4722L8218m6860m8873j1009M9356
7674c7890K9031J5674J7390M3513k7830l3329O275J6551J5456q368o0971m2940
7662f7438j8876Q0176M5684M6783l910q1807o4255N4946M8565L695m6382l8975
7650d1794j3089l3392J8490O0148O5852j5365k8546M1008k2961L1995o507j17248
7638f1409j4821M160l2109l6156M7191P3046L1433K5220n429l6874J1629l5688
7626b9807n9523Q435R6554P1063m0126p5638m9819L3514R987l6857Q671L6260
7614b7286L1615K7952M9721L823j2918p2726l3692k4081K0982P4657J2629l5006
7602A5670j6340K0928M9443j8167k576p32o5165m1386j5082r474M8820r462k2702
$$ plain form
7686 -5945 33990 50968 -23679 -15683 23627 6000 -18722 19496 -27364 -76237 -87246 -37890
7674 -37890 -8859 6815 24205 67718 39888 6559 12834 29385 44841 36473 -24498 -67438
7662 -67438 -86314 -6138 39546 86329 82419 612 -63643 -8697 39868 43563 -2819 -41794
7650 -41794 -54883 -88275 -69785 -9637 56215 40850 12304 53312 30351 62346 55839 -61409
7638 -61409 -76230 -72070 -104179 -140335 -93144 -20098 11335 36555 31126 -5748 5881 -29807
7626 -29807 -89330 -80895 15659 86722 46596 -29042 -78861 -45347 -35360 -72217 -63546 -27286
7614 -27286 4329 32281 82002 85825 72907 181 -33511 -57592 -36610 38047 50676 15670
7602 15670 -670 20258 69701 51534 48958 48226 -16939 -58325 -73407 -82881 -34061 -43523 -66225
7589f6225O210J0297J1744O6521L9777m506L4585K667l6643j3684o2832l436l8617
7576e4142J7184j754M438K6922K4310M375k08r473j4667m0364n8669L6667J08243
7563D2862J6666J5039l3071o0359l4956N1442K0499R03k6720q867L6160l529j2778
7550C291J6461N4705L4322l1585k0287j0535l9197j5099Q71n6848k865O4937P667
7537E838J171l1834k9954M7604K322n3861j9278J9773R894J1975P943L437L6595
7524A1625j0931m8366j7258K7517J8271L7740j0555o2638n1079J2613J4368M0286
7512c8407M4087K47n7737n2355l72K3021O5864J2511P230K7837j388J3441K5905
7499F9884q6171q7361k9833M2164R876J5615j1367M723J6484M3881K2057l3459
$$ plain form
7589 -66225 -60015 -49718 -37974 28547 68324 63818 98403 101070 64427 50743 -12089 -15525 -54142
7576 -54142 -36958 -38712 -34274 -7352 16958 21333 21125 11652 -3015 -43379 -102048 -65381 42862
7563 42862 59528 74567 41496 -18863 -53819 -2377 18122 19025 -7695 -16562 19598 16069 3291
7550 3291 19752 74457 108779 77194 56907 46372 7175 -7924 -7053 -63901 -66766 -1829 5838
7537 5838 7009 -24825 -54779 -7175 -4853 -58714 -77992 -58219 -48325 -36350 -28407 -24970 11625
7524 11625 694 -47672 -64930 -37413 -19142 18598 8043 -54595 -105674 -93061 -78693 -38407
7512 -38407 5680 5927 -51810 -104165 -104537 -81516 -15652 -3141 4089 31926 30538 43979 69884
7499 69884 -16287 -103648 -133481 -91317 -81441 -65826 -77193 -72470 -55986 -12105 9952 -23507
7487b3507K0726r290k0611P884l6233k3283j2979M3426j0608p949Q8715M4650
7475F0941m7025l3941K2319n132m8227J195J7608K4882J2872n1549O6721L4274
7463E4938j295j0462k8073j4040m4084j0832k0328J6931K0846M0384J4663o996
7451A1652j6655k1017K9742J1601k5320k2406L0080m0893q176N0627q13o4480
7439f6058K4033p94L528L0334K3734K317K4042O8803n3447k9477j4837m3699L453
7426b8068l4232N346N173K8542m011k078K1787L3040l567p1244o3977q330J9927
7413a01692M5790L6823K4172J6156p4589l6453O9105j4009J1180R4564J973l8626
7401C4394j4559o5702j2077O1902l892J4244M2839l0371k8275O726O415m698j5854
$$ plain form
7487 -23507 -2781 -12071 -32682 -24798 -61031 -84314 -97293 -53867 -64475 -72424 16291 60941
7475 60941 13916 -20025 2294 -2838 -51065 -49870 -32262 -7380 5492 -46057 20664 54938
7463 54938 53643 43181 15108 1068 -43016 -53848 -74176 -57245 -36399 3985 18648 11652
7451 11652 -5003 -26020 3722 15323 -9997 -32403 -2323 -43216 -51392 -765 -1578 -66058
7439 -66058 -42025 -42819 -39291 -8957 14777 17094 41136 109939 56492 27015 12178 -31521 -28068
7426 -28068 -62300 -56954 -51781 -23239 -27250 -29328 -7541 25499 21932 -49312 -113289 -121619 -101692
7413 -101692 -55902 -19079 5093 21249 -53340 -89793 -20688 -34697 -23517 71047 73020 34394
7401 34394 19835 -45867 -57944 3958 66 14310 57149 26778 -1497 5229 11644 6946 -8908
7388h908o612O600o299N2632j7859m2219j2918L9232r685M3095j8664l3423J0782
7375d246L1568K1528l8324m5966l7989l6019q748j4032P0734J03025R540q302
7363D2769o0179l0091M5192o425n27L5247m7448J9056M4055M0383k2752m9188
7351A0092m409l797L0100j7813o4010K6190J6303l0634O4407k4169j6995Q419
7339f316K1232L1038l67l1523n9143k4756K0635N3760J3444l471j0657j1803l2347
7326d0274m2889j616J2818M1297P052j6934R827M0241J0533j7733j273K4364J7478
7313D2891L2367K3399o9321j27540k2644J03939M8168J9154Q335r445m1686l0971
7301b3354K2567L6393O291k4661k5529m0356L0855j7189m967J5829O8336P753
$$ plain form
7388 -8908 -15520 -8920 -15219 37413 19554 -22665 -35583 3649 -6036 37059 18395 -15028 -4246
7375 -4246 27322 48850 10526 -35440 -73429 -109448 -118196 -132228 -61494 41531 51071 42769
7363 42769 -17410 -47501 -2309 -8734 -9261 25986 -21462 -2406 41649 82032 59280 10092
7351 10092 5683 1886 31986 14173 -49837 -23647 -7344 -37978 26429 2260 -14735 -6316
7339 -6316 14916 45954 45587 14064 -45079 -69835 -49200 4560 18004 14533 3876 -7927 -40274
7326 -40274 -83163 -84779 -71961 -30664 -23612 -40546 -30719 9522 20055 2322 1049 25413 42891
7313 42891 75258 98657 29336 -98204 -120848 -16909 31259 50413 58748 49303 7617 -23354
7301 -23354 -787 35606 41897 17236 -8293 -48649 -17794 -34983 -39950 -24121 44215 51968
7289E1968l9076l7165m2881K3414P5643l9802P798j1943L2143P5689J3442r1564
7277A7666p0824l8663k0295P7815L1813M5393j682r330j14M7243L5016j0262l1199
7264G2577l1198o2245m0585l322K6413M4921l8825j6231K4662P4830O140n1761
7252E376J9183k6580N5459K4941j8817o9983K345j9154P785J0362J0112N8159
7240E9188Q2984j2153n8469m4677m738o6164j0168O5103O1951l5781m3874m1484
7228d8282J7539m4730K7099L7655J1517M1059J9807p699p6186n245J2251J082
7216a4133k5212K7013J0134m2172k6981j175N2097R9446L0782l7585k5650r815
7204C6749K793p343J637J6511j0669o106k3671k3719n3861q457P5476Q6696N719
$$ plain form
7289 51968 12892 -24273 -67154 -43740 31903 -7899 -101 -12044 20099 95788 109230 17666
7277 17666 -53158 -91821 -112116 -34301 -2488 42905 41223 31893 31779 79022 114038 103776 72577
7264 72577 41379 -20866 -61451 -64773 -38360 6561 -32264 -48495 -23833 50997 57137 5376
7252 5376 24559 -2021 53438 78379 59562 -10421 -8076 -27230 -19445 -9083 1029 59188
7240 59188 142172 130019 71550 26873 22135 -44029 -54197 10906 72857 37076 -6798 -48282
7228 -48282 -30743 -75473 -48374 -10719 798 41857 61664 53965 -22221 -27466 -15215 -14133
7216 -14133 -39345 -12332 -2198 -44370 -71351 -72526 -20429 79017 109799 72214 46564 36749
7204 36749 39542 32199 33836 50347 39678 33572 9901 -13818 -67679 -76136 -660 86036 91755
7191I1755r2269L4179K3242j944q5766l1654P1636K9042l0029m9041m0170N5199
7179b5820O0964L0791l2769n2040j8800k8407J1747N7327Q388k2877M5325m9322
7167a5493p2056Q647N781L3044N3976l7782q5544p0740M9099O5252M1867O4526
7155D0577M6091j5315j2294l1974o0351j6500M5839k9520l2747L6856N282K7510
7143C454l2299J5875j5150L9333j6166J7210j2469j2703l3197l8544j0497r825
7131a04978K2953o053L0196N719J3531j9854p52M4463L3014j3025R302k4789L3477
7118B3204M1513k8672n6746j9026j7192l6182J4836N9590K7771J8798N53j5594
7106A2853N984L9305J8675J4595m3960m1593Q400k6379n1825J764O0511o352J1372
$$ plain form
7191 91755 -514 33665 56907 54963 -30803 -62457 9179 38221 8192 -40849 -81019 -25820
7179 -25820 35144 65935 33166 -18874 -37674 -66081 -54334 2993 11381 -11496 33829 -15493
7167 -15493 -87549 -78902 -73121 -40077 13899 -23883 -109427 -180167 -131068 -65816 -23949 40577
7155 40577 86668 71353 59059 27085 -33266 -49766 -3927 -33447 -66194 -29338 -24056 3454
7143 3454 -28845 -12970 -28120 11213 -4953 12257 -212 -12915 -46112 -84656 -95153 -104978
7131 -104978 -82025 -88078 -57882 -52163 -38632 -58486 -59238 -14775 18239 5214 14516 -10273 23204
7118 23204 64717 36045 -20701 -39727 -56919 -93101 -78265 -18675 9096 27894 28447 12853
7106 12853 18837 58142 76817 91412 47452 5859 14259 -12120 -63945 -62181 -1670 -8022 3350
7093C350O664N145J6536J7085l893j9410m9915j8062J877M1418k208r041K9264
7080A8810m5462n273j3386l2444M4134Q2806J7017o6219q2479K295N6894j0193
7068c3500R554P00M660K9851n130J721K3187K9257j0625k8196k9285j0765J1402
7055g169R99Q304J4508K9962N730l2713K9821j7164n1149J0942p0730J9392R7640
7042C8373Q353m6780k3288n5528K4281l593n6253P6677P9905k6872Q777L3463
7030E7515N068L449L7058k1332o301l1249n1567k4401Q2961K4870l7062M608k0973
7017B2644R771l461o7711n157m2959k1801K531N8994N2193j6122k9173J6886k9742
7004e3107O665O574K3860j6150P155j2096m7483K348M0330K5892M2035K1865j8766
$$ plain form
7093 3350 10014 15159 31695 48780 44887 25477 -24438 -42500 -40623 795 -1413 -10454 18810
7080 18810 -26652 -31925 -45311 -77755 -33621 49185 66202 -17 -82496 -80201 -23307 -33500
7068 -33500 -23946 -23246 -18586 11265 6135 7856 31043 60300 49675 21479 -7806 -18571 -7169
7055 -7169 -6170 2134 16642 46604 52334 19621 49442 32278 -18871 -7929 -78659 -59267 38373
7042 38373 46726 -54 -23342 -78870 -54589 -58182 -114435 -37758 42147 15275 24052 57515
7030 57515 62583 66032 103090 81758 75457 44208 -7359 -31760 51201 76071 39009 43617 22644
7017 22644 32415 28954 -38757 -43914 -86873 -108674 -106143 -47149 5044 -11078 -40251 -23365 -53107
7004 -53107 -46442 -39868 -16008 -32158 -25003 -37099 -84582 -82234 -41904 -16012 26023 47888 29122
6991B9122m3888n991K7025m2622q8502J742M2313N0607K6859M292R131M1636j1029
6978D0695p612Q194k9747n2701k9260N4016O2449n7443p0551j9749J4354k6053
6966a13408L3659N7114N6862M724M553j8986M4386J5537j2113m5055m3452L2145
6954A5966L9222L9481r436J7611n3924n3892n0500j8349n5208J6215P5180N0599
6942A2965Q877j0953j3241K4217M5558j8101p2125L956Q5618n868k7470K0738
6930E4171K6901k7777R890J3551l7210q559j01807n3415L7427L3700L1550j6495
6918c8073Q010L1417J8564k5960j0936K4705N9241L8751l2943K7141n9939r7485
6906e7507K9903j6330N1103l73j8126m0551m299M8415o1521n850j6005P907M108
$$ plain form
6991 29122 -14766 -20757 6268 -36354 -124856 -123114 -80801 -30194 -3335 957 10088 51724 40695
6978 40695 33083 41277 11530 -41171 -70431 -16415 46034 -11409 -81960 -101709 -87355 -113408
6966 -113408 -79749 -22635 34227 38951 43504 24518 68904 84441 72328 27273 -16179 15966
6954 15966 55188 94669 85233 102844 48920 -4972 -55472 -73821 -129029 -112814 -37634 12965
6942 12965 21842 10889 -2352 21865 67423 49322 -22803 -18847 66771 60903 33433 54171
6930 54171 81072 53295 63185 76736 39526 30967 -70840 -124255 -86828 -53128 -21578 -38073
6918 -38073 -30063 1354 19918 -6042 -16978 7727 66968 105719 72776 99917 39978 -57507
6906 -57507 -27604 -43934 7169 6796 -11330 -51881 -56180 -7765 -69286 -75136 -91141 -83234 -79126
6893g9126k7890J6613L7808J850j8502L616O2417K8450k1811m9602n0268M8064
6881d8381O9712j2354p4096q194O376K6963J5002k3628l6879M9982O384J9224
6869i889j444K7201n956k5298k4689P4867o508j05156p013L8239J3939k994Q805
6856b5896J9240K9067k0704K0695L278k6512N562L6363P543k4604k1092M801k3180
6843a5439k9033J3734M3487M7140l5242L876j724l9673j5794l8609k3072q393
6831i8742k17K2712l9465l0363O1056O5916j3923l7327R995Q4349K6634k7988
6819B2637j5414n6004K4512j6930j0992l651J4183Q543k5358L3328K2114r197
6807a2229m5768K5802K1057L6891o83k5377J4779J6776L440n0416k5637M810J3419
$$ plain form
6893 -79126 -107016 -90403 -52595 -50745 -69247 -65631 -3214 25236 3425 -46177 -96445 -48381
6881 -48381 21331 8977 -65119 -73313 -66937 -39974 -24972 -48600 -85479 -35497 -29113 -9889
6869 -9889 -11333 15868 9912 -15386 -40075 34792 28284 -76872 -83885 -45646 -31707 -34701 -25896
6856 -25896 -6656 22411 1707 22402 25680 -832 4730 41093 48636 24032 2940 7741 -15439
6843 -15439 -44472 -30738 12749 59889 24647 28523 26799 -12874 -28668 -67277 -90349 -98742
6831 -98742 -98959 -76247 -115712 -146075 -85019 -19103 -33026 -70353 -60358 23991 50625 22637
6819 22637 7223 -48781 -24269 -41199 -52191 -55842 -41659 -33116 -58474 -25146 -3032 -12229
6807 -12229 -57997 -32195 -11138 25753 25070 -307 14472 31248 34688 -15728 -41365 -36555 -23136
6794b3136K5552o948J793j0216j2781J8858k3163k6893L63%J0230k354M2817J2209
$$ plain form
6794 -23136 2416 -4532 -2739 -12955 -25736 -6878 -30041 -56934 -56571 -56571 -46341 -48695 -5878 6331
$$ [...]
##END NTUPLES=NMR SPECTRUM
##END=
