##TITLE=Analysis number 310625
Compound Code mo 07116
Book Reference 407/81
Project Code adrs
Chemist Name andyw
##JCAMPDX= 6.0         $$ Bruker NMR JCAMP-DX V2.0
##DATA TYPE= NMR SPECTRUM
##DATA CLASS= NTUPLES
##ORIGIN= Bruker BioSpin GmbH
##OWNER= NMR
$$ XWIN-NMR		Version 3.5
$$ Tue Jun 21 12:04:55 2005 GMT Daylight Time (UT+1h)  MAYBRIDGE\NMR@NMR_250MHZ
##.OBSERVE FREQUENCY= 250.131544655141
##.OBSERVE NUCLEUS= ^1H
##.ACQUISITION MODE= SIMULTANEOUS (DQD)
##.ACQUISITION SCHEME= undefined
##.AVERAGES= 16
##.DIGITISER RES= 18
##SPECTROMETER/DATA SYSTEM= dpx250
##.PULSE SEQUENCE= zg30
##.SOLVENT NAME= CDCl3
##.SHIFT REFERENCE= (INTERNAL, CDCl3, 0, 16.522)
##AUDIT TRAIL= $$ (NUMBER, WHEN, WHO, WHERE, WHAT)
$$ ##TITLE= Audit trail, XWIN-NMR		Version 3.5
$$ ##JCAMPDX= 5.01
$$ ##ORIGIN= Bruker BioSpin GmbH
$$ ##OWNER= NMR
$$ C:\u/data/dgb/nmr/ADRS/4410/pdata/1/auditp.txt
$$ ##AUDIT TRAIL=  $$ (NUMBER, WHEN, WHO, WHERE, WHAT)
(   1,<2005-06-21 12:04:36.61 +100>,<MAYBRIDGE\NMR>,<NMR_250MHZ>,
      <created by zg, POWCHK disabled, PULCHK disabled
       configuration hash MD5:
       62 19 C7 07 E1 42 D1 B7 37 6C 3D D0 77 39 F9 E6
       data hash MD5: 64K
       6F 31 6D BA 9A B2 AE EB D1 56 F6 41 A1 35 6C 56>)
(   2,<2005-06-21 12:04:47.68 +100>,<MAYBRIDGE\NMR>,<NMR_250MHZ>,
      <Start of raw data processing
       ef LB = 0.3 FT_mod = 6 PKNL = 1 SI = 32K 
       data hash MD5: 32K
       2E AC DC 8F 48 28 D9 DF 92 8A 45 BF 42 A4 7B D4>)
(   3,<2005-06-21 12:04:49.35 +100>,<MAYBRIDGE\NMR>,<NMR_250MHZ>,
      <apk 
       data hash MD5: 32K
       BD 0E 0B 3A 45 BA EB 81 EB A8 B9 0E C2 72 34 4C>)
(   4,<2005-06-21 12:04:50.05 +100>,<MAYBRIDGE\NMR>,<NMR_250MHZ>,
      <abs ABSG = 5 
       data hash MD5: 32K
       B3 8D 64 44 20 D8 F7 00 09 96 9B 50 7B 25 B2 EE>)
$$ ##END=
$$ 
$$ hash MD5
$$ C3 68 0D 50 46 44 E1 07 62 33 C5 4D BE 7E 40 F1
##$RELAX= 
##$RELAX= 
##$RELAX= 
##$RELAX= 
##$RELAX= 
##$RELAX= 
##$RELAX= 
$$ Bruker specific parameters
$$ --------------------------
##$DU= <C:\u>
##$EXPNO= 4410
##$NAME= <ADRS>
##$PROCNO= 1
##$TYPE= <nmr>
##$USER= <dgb>
##$AMP= (0..31)
100 100 100 100 100 100 100 100 100 100 100 100 100 100 100 100 100 100 
100 100 100 100 100 100 100 100 100 100 100 100 100 100 
##$AQSEQ= 0
##$AQ_mod= 3
##$AUNM= <au_zg>
##$AUTOPOS= <20 >
##$BF1= 250.13
##$BF2= 250.13
##$BF3= 250.13
##$BF4= 250.13
##$BF5= 500.13
##$BF6= 500.13
##$BF7= 500.13
##$BF8= 500.13
##$BYTORDA= 1
##$CFDGTYP= 0
##$CFRGTYP= 5
##$CHEMSTR= <none>
##$CNST= (0..31)
1 1 145 1 1 1 1 1 1 1 1 1 1 1 1 1 1 1 1 1 1 1 1 1 1 1 1 1 1 1 1 1 
##$CPDPRG= <>
##$CPDPRG1= <>
##$CPDPRG2= <>
##$CPDPRG3= <>
##$CPDPRG4= <mlev>
##$CPDPRG5= <mlev>
##$CPDPRG6= <mlev>
##$CPDPRG7= <mlev>
##$CPDPRG8= <mlev>
##$CPDPRGB= <>
##$CPDPRGT= <>
##$D= (0..31)
0 1 0 0 0 0 0 0 0 0.06 0 0 0 0 0 0 0.0002 0 0 0 0 0 0 0 0 0 0 0 0 0 0 
0 
##$DATE= 1119351875
##$DBL= (0..7)
120 120 120 120 120 120 120 120 
##$DBP= (0..7)
150 150 150 150 150 150 150 150 
##$DBP07= 0
##$DBPNAM0= <>
##$DBPNAM1= <>
$$ [...]
##$SUBNAM7= <"">
##$SUBNAM8= <"">
##$SUBNAM9= <"">
##$SW= 20.6930455092707
##$SWIBOX= (0..15)
0 0 3 0 0 0 0 0 0 0 0 0 0 0 0 0 
##$SW_h= 5175.983436853
##$TD= 65536
##$TD0= 1
##$TE= 295.16
##$TE2= 300
##$TE3= 300
##$TEG= 300
##$TL= (0..7)
0 120 120 120 120 120 120 120 
##$TP= (0..7)
150 150 150 150 150 150 150 150 
##$TP07= 0
##$TPNAME0= <>
##$TPNAME1= <>
##$TPNAME2= <>
##$TPNAME3= <>
##$TPNAME4= <>
##$TPNAME5= <>
##$TPNAME6= <>
##$TPNAME7= <>
##$TPOAL= (0..7)
0.5 0.5 0.5 0.5 0.5 0.5 0.5 0.5 
##$TPOFFS= (0..7)
0 0 0 0 0 0 0 0 
##$TUNHIN= 0
##$TUNHOUT= 0
##$TUNXOUT= 0
##$USERA1= <user>
##$USERA2= <user>
##$USERA3= <user>
##$USERA4= <user>
##$USERA5= <user>
##$V9= 5
##$VALIST= <valist>
##$VCLIST= <CCCCCCCCCCCCCCC>
##$VD= 0
##$VDLIST= <DDDDDDDDDDDDDDD>
##$VPLIST= <PPPPPPPPPPPPPPP>
##$VTLIST= <TTTTTTTTTTTTTTT>
##$WBST= 1024
##$WBSW= 4
##$XGAIN= (0..3)
0 0 0 0 
##$XL= 0
##$YL= 0
##$YMAX_a= 445324
##$YMIN_a= -552539
##$ZGOPTNS= <>
##$ZL1= 120
##$ZL2= 120
##$ZL3= 120
##$ZL4= 120
##$ABSF1= 16.522
##$ABSF2= -4.171173
##$ABSG= 5
##$ABSL= 3
##$ALPHA= 0
##$AQORDER= 0
##$ASSFAC= 0
##$ASSFACI= 0
##$ASSFACX= 0
##$ASSWID= 0
##$AUNMP= <proc_1d>
##$AZFE= 0.1
##$AZFW= 0.1
##$BCFW= 0
##$BC_mod= 0
##$BYTORDP= 0
##$COROFFS= 0
##$CY= 12.5
##$DATMOD= 1
##$DC= 0
##$DFILT= <>
##$DTYPP= 0
##$F1P= 14.0000005364418
##$F2P= -0.99999901652339
##$FCOR= 0.5
##$FTSIZE= 32768
##$FT_mod= 6
##$GAMMA= 0
##$GB= 0
##$INTBC= 1
##$INTSCL= 1
##$ISEN= 128
##$LB= 0.3
##$LEV0= 0
##$LPBIN= 0
##$MAXI= 10000
##$MC2= 0
##$MEAN= 0
##$ME_mod= 0
##$MI= 0
##$NCOEF= 0
##$NC_proc= -4
##$NLEV= 6
##$NOISF1= 0
##$NOISF2= 0
##$NSP= 0
##$NTH_PI= 0
##$NZP= 0
##$OFFSET= 16.522
##$PC= 1
##$PHC0= -78.44315
##$PHC1= 6.055645
##$PH_mod= 1
##$PKNL= yes
##$PPARMOD= 0
##$PSCAL= 4
##$PSIGN= 0
##$REVERSE= no
##$SF= 250.13
##$SI= 32768
##$SIGF1= 0
##$SIGF2= 0
##$SINO= 400
##$SIOLD= 32768
##$SREGLST= <1H.CDCl3>
##$SSB= 0
##$STSI= 32768
##$STSR= 0
##$SW_p= 5175.98343685301
##$SYMM= 0
##$S_DEV= 0
##$TDeff= 65536
##$TDoff= 0
##$TI= <Analysis number 999999
Compound Code 99
Book Reference 9
Project Code 9>
##$TILT= no
##$TM1= 0
##$TM2= 0
##$TOPLEV= 0
##$USERP1= <user>
##$USERP2= <user>
##$USERP3= <user>
##$USERP4= <user>
##$USERP5= <user>
##$WDW= 1
##$XDIM= 32768
##$YMAX_p= 281799305
##$YMIN_p= -217421
$$ End of Bruker specific parameters
$$ ---------------------------------
##NTUPLES= NMR SPECTRUM
##VAR_NAME=  FREQUENCY,     SPECTRUM/REAL,   SPECTRUM/IMAG
##SYMBOL=    X,             R,               I
##VAR_TYPE=  INDEPENDENT,   DEPENDENT,       DEPENDENT
##VAR_FORM=  AFFN,          ASDF,            ASDF
##VAR_DIM=   32768,         32768,           32768
##UNITS=     HZ,            ARBITRARY UNITS, ARBITRARY UNITS
##FACTOR=    0.157963299565203, 1,           1
##FIRST=     4132.6476996994, 0,             0
##LAST=      -1043.33573715361, 0,           0
##MIN=       -1043.33573715361, -217421,     0
##MAX=       4132.6476996994, 281799305,     0
$$ Real data points
##PAGE= N=1
##DATA TABLE= (X++(R..R)), XYDATA
$$ [...]
$$ plain form
14775 25068 25994 11700 28357 59807 52017 12175 19040 8969 -17017 3964 -1061 -13822 -63743
14762 -63743 -74438 -82751 -67369 -53646 -44152 -60079 -59138 -3820 30792 3661 4526 34097 21624
14749 21624 4383 -29259 -93368 -42541 -48373 -16810 51846 97078 93059 60847 34311 20489
14737 20489 18507 -8865 -7414 37642 73860 32844 12322 21467 -9590 8302 -2780 -18986
14725 -18986 1196 34475 44057 75663 18120 -40754 3169 24032 24946 -21718 -37396 -45658
14713 -45658 -38783 -56392 -96851 -94093 -61027 24966 45788 110810 88386 20658 41497 56499
14701 56499 95574 93666 38316 -21995 -51352 -45053 -28372 -8633 -57309 -92542 -36781 -62423
14689 -62423 -54585 7975 51480 47309 -9456 -12529 -2371 -33440 -42582 -12122 40801 -6788
$$ packed form
14775B5068R26j4294J6657L1450p790l9842O865j0071k5986K0981n025j2761m9921
14762f3743j0695q313J5382J3723R494j5927R41N5318L4612k7131Q65K9571j2473
14749B1624j7241l3642o4109N0827n832L1563O8656M5232m019l2212k6536j3822
14737B0489j982k7372J451M5056L6218m1016k0522R145l1057J7892j1082j6206
14725a8986K0182L3279R582L1606n7543n8874M3923K0863R14m6664j5678q262
14713d5658O875j7609m0459K758L3066Q5993K0822O5022k2424o7728K0839J5002
14701E6499L9075j908n5350o0311k9357O299J6681J9739m8676l5233N5761k5642
14689f2423P838O2560M3505m171n6765l073J0158l1069r142L0460N2923m7589
$$ plain form
14677 -6788 -36822 -36447 -21961 -8203 25731 78809 69616 43880 34868 -1843 -22011 -22175 -44055
14664 -44055 -74027 -79488 2569 9489 2640 -67116 -135750 -188594 -114901 -27238 -13455 -29670
14652 -29670 -14266 25233 32934 13465 24978 35562 33147 25203 -43860 -73345 -94525 -96143
14640 -96143 -66191 -53626 -95053 -85923 -53734 -30269 -2930 15714 -2782 -49474 -93225 -84689
14628 -84689 -89290 -43105 -14532 -59156 -98548 -114933 -63899 -40179 -32332 -31120 2293 -3392
14616 -3392 -1567 4544 -23341 -77232 -51563 -44773 -72481 -73820 -32894 -39562 -49896 -61817 -49400
14603 -49400 -24049 -42456 -56723 -39446 -11468 24517 12747 -11372 25595 45254 -26195 -47951
14591 -47951 -27940 -57087 -71829 -118169 -106267 -56655 -78003 -62257 -44991 -19033 2189 -24928
$$ packed form
14677f788l0034L75J4486J3758L3934N3078r193k5736r012l6711k0168j64k1880
14664d4055k9972n461Q2057O920o849o9756o8634n2844P3693Q7663J3783j6215
14652b9670J5404L9499P701j9469J1513J0584k415p944o9063k9485k1180j618
14640i6143K9952J2565m1427R130L2189K3465K7339J8644j8496m6692m3751Q536
14628h4689m601M6185K8573m4624l9392j6385N1034K3720P847J212L3413n685
14616c392J825O111k7885n3891K5669O790k7708j339M0926o668j0334j1921J2417
14603d9400K5351j8407j4267J7277K7978L5985j1770k4119L6967J9659p1449k1756
14591d7951K0011k9147j4742m6340J1902M9612k1348J5746J7266K5958K1222k7117
$$ plain form
14579 -24928 -38316 8465 22657 -11837 -55840 -97214 -125171 -64277 24610 38047 9747 -77609
14567 -77609 -139653 -93074 -28593 2404 28158 38953 8487 2136 18106 -72852 -75207 -81444
14555 -81444 -114536 -127996 -108380 -102360 -57953 -58710 -25140 3384 -30214 -34693 43355 32802
14543 32802 -10544 -7663 17204 23817 51256 38325 10184 4458 -4316 -9368 -1069 -25170 1902
14530 1902 3298 -14716 -21943 -61217 -65742 -60432 -68329 -67714 -69219 -52621 -4874 -4968 18376 -8930
14516 -8930 -28518 -1210 12632 -63433 -77032 -50476 -47612 -24683 -12356 -20117 -40070 -15226
14504 -15226 22023 10816 9728 14572 39588 39948 6178 23794 87306 85563 99762 87136 48307
14491 48307 13050 -9761 4176 -5267 37917 24831 -38186 -34184 -9041 -42683 -3704 65598
$$ packed form
14579b4928j3388M6781J4192l4494m4003m1374k7957O0894Q8887J3437k8300q7356
14567g7609o2044M6579O4481L0997K5754J0795l0466o351J5970r0958k355o237
14555h1444l3092j3460J9616O020M4407p57L3570K8524l3598m479P8048j0553
14543C2802m3346K881K4867O613K7439j2931k8141n726q774n052Q299k4101K7072
14530A902J396j8014p227l9274m525N310p897O15j505J6598M7747r4K3344k7306
14516h930j9588K7308J3842p6065j3599K6556K864K2929J2327p761j9953K4844
14504a5226L7249j1207j088M844K5016L60l3770J7616O3512j743J4199j2626l8829
14491D8307l5257k2811J3937r443M3184j3086o3017M002K5143l3642L8979O9302
$$ plain form
14479 65598 116453 145718 88918 59391 37405 44246 28996 19417 -12965 -8310 -7017 -16322 26525
14466 26525 62782 58255 54376 17668 -34894 -3321 19170 37295 90828 117318 90110 76281
14454 76281 70557 59786 19675 14548 -10087 18636 -3238 -28451 -16658 -37919 4785 3233
14442 3233 25120 50518 8110 -10705 -25954 -19035 8811 23488 -19325 -59865 -33204 -4795
14430 -4795 -32272 -42382 6426 1983 -85882 -95847 -51016 -60595 -68423 -72332 -63732 -24226 -43636
14417 -43636 -75525 -80289 -54480 -35817 -18541 -9532 -13538 -6988 2427 -10264 -5536 -12028 -9024
14404 -9024 -26657 -16097 20705 37711 32028 30032 69689 57693 25195 -3872 -65000 -54281
14392 -54281 -38194 -22601 4455 1470 -9531 -13330 28148 4519 -2134 33374 2361 -20212
$$ packed form
14479F5598N0855K9265n6800k9527k1986O841j5250r579l2382M655J293r305M2847
14466B6525L6257m527l879l6708n2562L1573K2491J8125N3533K6490k7208j3829
14454G6281n724j0771m0111n127k4635K8723k1874k5213J1793k1261M2704j552
14442C233K1887K5398m2408j8815j5249O919K7846J4677m2813m0540K6661K8409
14430d795k7477j0110M8808m443q7865r965M4831r579p828l909Q600L9506j9410
14417d3636l1889m764K5809J8663J7276R009m006O550R415j2691M728o492L004
14404i024j7633J0560L6802J7006n683j996L9657j1996l2498k9067o1128J0719
14392e4281J6087J5593K7056k985j1001l799M1478k3629o653L5508l1013k2573
$$ plain form
14380 -20212 31702 40772 49455 101136 30227 -47895 -28358 -15362 5457 -25216 -18711 -28188
14368 -28188 -18092 23987 41201 3459 -9052 26718 38032 17787 -15798 -50928 -19411 -14247
14356 -14247 -20901 18158 -4338 -25797 -22569 10488 3532 -36285 -9113 3809 18451 51682
14344 51682 23889 51721 18302 16692 54929 43219 -10269 -5898 24581 16395 4160 18729
14332 18729 49014 20240 -8700 8838 521 -9606 -9404 7158 2109 -27435 3895 -6661
14320 -6661 -26576 -19156 -2730 -21904 -909 63619 37340 -172 27816 17683 54765 78885
14308 78885 58098 20387 -17772 -7727 -2012 -74133 -64411 -56636 -79269 -35122 15855 9551
14296 9551 -9756 -57286 -38574 -19283 -200 -7019 -21610 11280 54246 65334 55136 38685
$$ packed form
14380b0212N1914R070Q683N1681p0909p8122J9537J2996K0819l0673O505r477
14368b8188J0096M2079J7214l7742j2511L5770J1314k0245l3585l5130L1517N164
14356a4247o654L9059k2496k1459L228L3057o956l9817K7172J2922J4642L3231
14344E1682k7793K7832l3419j610L8237j1710n3488M371L0479q186j2235J4569
14332A8729L0285k8774k8940J7538q317j0127K02J6562n049k9544L1330j0556
14320f661j9915P420J6426j9174K0995O4528k6279l7512K7988j0133L7082K4120
14308G8885k0787l7711l8159J0045N715p2121R722P775k2633M4147N0977o304
14296I551j9307m7530J8712J9291J9083o819j4591L2890M2966J1088j0198j6451
$$ plain form
14284 38685 25417 30320 25914 18062 -16943 3390 22351 -4400 20509 9336 -19877 32986
14272 32986 39354 -17413 -19611 -331 8882 10097 60915 63861 42945 76153 58631 55490 38889
14259 38889 13470 14226 64277 76137 67127 33003 1352 3062 18421 31004 27705 28535 50027
14246 50027 61387 88224 130812 128803 113078 108874 143785 176582 194854 165591 182414 202513
14234 202513 270416 270313 241213 282681 305004 422348 531536 606932 618560 637529 693746
14223 693746 653634 629073 645143 624443 632689 642634 604562 595157 646839 656398 623401 557842
14211 557842 539338 523106 513247 478211 415763 376717 353247 336100 268731 190594 177932 176584
14199 176584 241708 262638 208693 185544 119685 102446 116667 109426 119538 207751 230371 209128
$$ packed form
14284C8685j3268M903m406p852l5005K0333J8961k6751K4909j1173k9213N2863
14272C2986O368n6767k198J9280R213J215N0818K946k0916L3208j7522l141j6601
14259C8889k5419P56N0051J1860r010l4124l1651J710J5359J2583l299Q30K1492
14246E0027J1360K6837M2588k009j5725m204L4911L2797J8272k9263J6823K0099
14234B02513O7903j03k9100M1468K2323J17344J09188P5396J1628J8969N6217
14223F93746m0112k4561J6070k0700Q246R945l8072r405N1682R559l2997o5559
14211E57842j8504j6232r859l5036o2448l9046k3470j7147o7369p8137j2662j348
14199A76584O5124K0930n3945k3149o5859j7239J4221p241J0112Q8213K2620k1243
$$ plain form
14187 209128 148230 113409 131709 143759 116941 102130 129490 147915 125482 58880 48546
14176 48546 76560 74448 27720 44928 61110 40938 -36607 -29799 14627 1985 22647 51598
14164 51598 58130 6422 23061 51033 89684 98417 64724 73820 20090 3584 31415 8771
14152 8771 -13364 1189 50641 96948 66528 -24338 -3591 18863 14351 -4386 18973 17652
14140 17652 -10447 -34745 -48103 -66116 -51493 -23685 -29095 -4742 18999 38874 -12369 -20612
14128 -20612 -59608 -81092 -58101 -66089 -31278 -21428 -7658 35915 19129 -5655 4454 -10513
14116 -10513 -22741 -37462 -62478 8364 75059 57959 77656 117463 84024 92455 142148 148563
14104 148563 109647 87205 66338 29224 76384 77708 17289 57887 102873 115176 74752 86606
$$ packed form
14187B09128o0898l4821J8300J2050k6818j4811K7360J8425k2433o6602j0334
14176D8546K8014k112m6728J7208J6182k0172p7545O808M4426j2642K0662K8951
14164E1598O532n1708J6639K7972L8651Q733l3693R096n3730j6506K7831k2644
14152H771k2135J4553M9452M6307l0420r0866K0747K2454m512j8737K3359j321
14140A7652k8099k4298j3358j8013J4623K7808n410K4353K3741J9875n1243q243
14128b0612l8996k1484K2991p988L4811R850J3770M3573j6786k4784J0109j4967
14116a0513j2228j4721k5016P0842O6695j7100J9697L9807l3439Q431M9693O415
14104A48563l8916k2442k0867l7114M7160J324o0419M0598M4986J2303m0424J1854
$$ plain form
14092 86606 85084 101930 89401 86428 60973 41252 61126 46372 34441 27239 64264 104463
14080 104463 106885 108953 92564 -9579 -48445 -40745 -28414 -13836 21391 -1701 5338 -9742
14068 -9742 6729 -4691 20853 81091 82640 34655 -1968 3344 25660 20928 48485 63650
14056 63650 111611 97223 100404 112265 180094 150749 146614 127874 68238 79371 122242 161739
14044 161739 165651 137539 139853 101624 122649 159454 153394 141902 133174 98086 69172 46795
14032 46795 82041 83905 40251 75688 156282 153606 157404 152804 149362 134742 156197 164677 152161
14019 152161 158365 177291 152882 149169 117348 112785 114313 117074 94553 135394 143713 104435 63976
14006 63976 41535 -20758 -10751 -2871 -28222 19248 49911 127464 172361 123318 113478 93721
$$ packed form
14092H6606j522J6846j2529k973k5455j9721J9874j4754j1931p202L7025M0199
14080A04463K422K068j6389j02143l8866P700J2331J4578L5227k3092P039j5080
14068i742J6471j1420K5544O0238J549m7985l6623N312K2316m732K7557J5165
14056F3650M7961j4388L181J1861O7829k9345m135j8740n9636J1133M2871L9497
14044A61739L912k8112K314l8229K1025L6805o060j1492q728l5088k8914k2377
14032D6795L5246J864m3654L5437Q0594k676L798m600l442j4620K1455Q480j2516
14019A52161O204J8926k4409l713l1821m563J528K761k2521M0841Q319l9278m0459
14006F3976k2441o2293J0007P880k5351M7470L0663P7553M4897m9043r840j9757
$$ plain form
13994 93721 88907 85313 -735 -38789 -6336 50071 85432 134100 97056 84516 97447 67967
13982 67967 91763 71893 75441 91114 68788 100119 81661 77940 75299 75611 100859 134010 146319
13969 146319 141258 104736 98824 98001 107658 73574 78062 105216 115697 105620 125564 169368 142573
13956 142573 86368 120214 109568 87955 52351 40642 22891 85903 77565 56009 38754 45915
13944 45915 60450 63462 117541 112141 127239 97733 78526 83112 121397 105977 118337 98877
13932 98877 95115 145020 223416 215790 217827 214334 225926 216282 191042 164823 193172 209717 211595
13919 211595 184385 199429 205617 235893 277765 284141 336229 337721 253397 234783 237146 270871
13907 270871 245997 210797 216957 216577 263173 308074 310781 293300 341174 385575 401161 403423
$$ packed form
13994I3721m814l594q6048l8054L2453N6407L5361M8668l7044j2540J2931k9480
13982F7967K3796j9870L548J5673k2326L1331j8458l721k641L12K5248L3151J2309
13969A46319n061l6522n912q23R657l4084M488K7154J0481j0077J9944M3804k6795
13956A42573n6205L3846j0646k1613l5604j1709j7751O3012q338k1556j7255P161
13944D5915J4535L012N4079n400J5098k9506j9207M586L8285j5420J2360j9460
13932I8877l762M9905P8396p626K037l493J1592r644k5240k6219K8349J6545J878
13919B11595k7210J5044O188L0276M1872O376N2088J492q4324j8614K363L3725
13907B70871k4874l5200O160l80M6596M4901K707j7481M7874M4401J5586K262
$$ plain form
13895 403423 390393 396697 371083 359162 341757 341596 353703 372732 368810 351102 388755 401206
13883 401206 457940 441235 399666 420286 450503 473688 471890 473410 453172 500303 593435 629923
13871 629923 612975 598819 590403 587885 615811 606759 589693 674892 737930 739020 809027 859955
13859 859955 884541 910796 965533 1023217 1044063 1007412 959863 1016793 1068922 1137654 1192894
13848 1192894 1201516 1205744 1243661 1278783 1385734 1495317 1514127 1517108 1571446 1642632 1726289
13837 1726289 1780600 1804791 1931451 2083552 2215761 2323810 2399231 2474862 2597131 2664247
13827 2664247 2769666 2902179 3000337 3146742 3351757 3521264 3678860 3857788 4074338 4321891
13817 4321891 4536077 4750267 5078348 5479256 5803873 6127547 6511010 6943641 7412020
$$ packed form
13895D03423j3030O304k5614j1921j7405j61J2107J9029l922j7708L7653J2451
13883D01206N6734j6705m1569K0620L0217K3185j798J520k0238M7131R3132L6488
13871F29923j6948j4156q416k518K7926r052j7066Q5199O3038J090P0007N0928
13859H59955K4586K6255N4737N7684K0846l6651m7549N6930N2129O8732N5240
13848A192894Q622M228L7917L5122J06951J09583J8810K981N4338P1186Q3657
13837A726289N4311K4191J26660J52101J32209J08049P5421P5631J22269O7116
13827B664247J05419J32513R8158J46405K05015J69507J57596J78928K16550K47553
13817D321891K14186K14190L28081M00908L24617L23674L83463M32631M68379
$$ plain form
13808 7412020 8007124 8626395 9248240 9919655 10706128 11605890 12548041 13503263 14687593
13799 14687593 16034104 17519213 19120441 20848188 22712521 24833922 27185259 29755881
13791 29755881 32651345 35859669 39440465 43437566 47779857 52532481 57701839 63360010
13783 63360010 69453409 75924230 82830695 89942035 97113884 104133110 110786246 116929604
13775 116929604 122178721 126280679 129093012 130453262 130331176 128706148 125716404 121538035
13767 121538035 116458107 110771995 104684688 98283549 91825082 85547051 79576656 73946907
13759 73946907 68639720 63745492 59223842 55067274 51205435 47685549 44520242 41678471
13751 41678471 39036215 36612372 34394618 32461551 30776540 29144159 27588413 26198935
$$ packed form
13808G412020N95104O19271O21845O71415P86473Q99762R42151R55222J184330
13799A4687593J346511J485109J601228J727747J864333K121401K351337K570622
13791B9755881K895464L208324L580796L997101M342291M752624N169358N658171
13783F3360010O093399O470821O906465P111340P171849P019226O653136O143358
13775A16929604N249117M101958K812333J360250j22086j625028k989744m178369
13767A21538035n079928n686112o087307o401139o458467o278031n970395n629749
13759G3946907n307187m894228m521650m156568l861839l519886l165307k841771
13751D1678471k642256k423843k217754j933067j685011j632381j555746j389478
$$ plain form
13743 26198935 24987327 23881018 22784165 21822106 21007738 20181654 19313697 18547460 17881134
13734 17881134 17235421 16633939 16037655 15443852 14786081 14154810 13604054 13009624 12463842
13725 12463842 11919071 11426100 10970943 10539570 10088841 9661136 9250919 8840333 8442659
13716 8442659 8088115 7781146 7436782 7080057 6790085 6436921 6114109 5842566 5568357
13707 5568357 5302908 5076147 4887497 4648332 4478851 4273793 4088632 3916443 3749439
13698 3749439 3612242 3409147 3277823 3207067 3084496 2933562 2847267 2682974 2551661 2432231
13688 2432231 2342830 2304231 2185702 2091965 2062467 1952043 1852053 1781615 1726711 1657573 1588996
13677 1588996 1502445 1445636 1421188 1348731 1294403 1230512 1201346 1197786 1136214 1124112 1064257
$$ packed form
13743B6198935j211608j106309j096853r62059q14368q26084q67957p66237o66326
13734A7881134o45713o01482n96284n93803o57771o31271n50756n94430n45782
13725A2463842n44771m92971m55157m31373m50729m27705m10217m10586l97674
13716H442659l54544l06969l44364l56725k89972l53164l22812k71543k74209
13707E568357k65449k26761j88650k39165j69481k05058j85161j72189j67004
13698C749439j37197k03095j31324p0756j22571j50934q6295j64293j31313j19430
13688B432231q9401l8599j18529r3737k9498j10424r9990p0438n4904o9138o8577
13677A588996q6551n6809k4448p2457n4328o3891k9166l560o1572j2102n9855
$$ plain form
13666 1064257 989442 903344 928179 962786 985859 1009586 1032478 1011000 963183 879430 851951
13655 851951 808233 787947 788825 773498 752716 736474 785199 718666 623318 589196 623912 684292
13643 684292 738641 751071 716210 650231 571896 606390 583393 485417 492563 505887 518863 470942
13631 470942 463906 476807 403400 355814 293430 326408 344821 341751 288859 278537 354013 365178
13619 365178 383472 372417 353974 362504 356768 329673 349303 360319 342212 326139 359825 357789
13607 357789 306111 321379 301082 252270 210828 257942 278851 212065 242980 288270 296060 263455
13595 263455 283826 349573 352606 384851 326097 332387 323159 281485 235269 253282 270778 228957
13583 228957 236814 262862 307737 317296 260441 265084 317413 343378 329757 294076 300603 278987
$$ packed form
13666A064257p4815q6098K4835L4607K3073K3727K2892k1478m7817q3753k7479
13655H51951m3718k0286Q78j5327k0782j6242M8725o6533r5348l4122L4716O0380
13643F84292N4349J2430l4861o5979p8335L4494k2997r7976P146J3324J2976m7921
13631D70942p036J2901p3407m7586o2384L2978J8413l070n2892j0322P5476J1165
13619C65178J8294j1055j8443Q530n736k7095J9630J1016j8107j6073L3686k036
13607C57789n1678J5268k0297m8812m1442M7114K0909o6786L0915M5290P790l2605
13595B63455K0371O5747L033L2245n8754O290r228m1674m6216J8013J7496m1821
13583B28957P857K6048M4875R559n6855M643N2329K5965j3621l5681O527k1616
$$ plain form
13571 278987 294537 396797 396209 338700 339187 369435 387985 335951 290889 288932 235846 191720
13559 191720 221565 263660 254994 239732 263592 279066 285756 242603 224177 262189 227319 211000
13547 211000 228343 235804 147812 106500 127124 162232 193886 193876 150266 183390 230065 248660
13535 248660 216102 190702 158710 201947 260926 262884 256467 230318 213435 217825 167845 97458
13523 97458 107399 111314 74740 73533 104530 121437 84456 36791 32244 41745 81167 109257 123719
13510 123719 94737 94877 147040 165565 160558 120195 133350 119469 54190 16461 35021 50706
13498 50706 47679 77493 110440 81135 78720 99291 74377 42392 71877 126395 137610 115889
13486 115889 84587 36184 15251 24327 75299 93783 100353 81616 89786 60533 94649 194580
$$ packed form
13571B78987J5550J02260n88n7509M87L0248J8550n2034m5062j957n3086m4126
13559A91720K9845M2095q666j5262K3860J5474O690m3153j8426L8012l4870j6319
13547B11000J7343P461q7992m1312K0624L5108L1654j0m3610L3124M6675J8595
13535B48660l2558k5400l1992M3237N8979J958o417k6149j6883M390m9980p0387
13523I7458R941L915l6574j207L0997J6907l6981m7665m547R501L9422K8090J4462
13510A23719k8982J40N2163J8525n007m0363J3155j3881o5279l7729J8560J5685
13498E0706l027K9814L2947k9305k415K0571k4914l1985K9485N4518J1215k1721
13486A15889l1302m8403k0933R076N0972J8484O570j8737Q170k9253L4116R9931
$$ plain form
13474 194580 202682 137005 113919 91522 77874 77980 98313 80206 79724 88170 71764 57737 57683
13461 57683 39848 42480 54425 53702 23938 10012 31712 69565 25034 22501 71964 62611 36162
13448 36162 34469 32463 2899 -8202 -35998 -35112 2789 -3603 3841 65374 120668 145388 153085
13435 153085 99576 33751 91149 96544 63578 113149 149577 156037 197446 203217 134680 119872
13423 119872 104917 100615 62699 43430 37348 86752 125916 108573 134173 186573 170852 78569
13411 78569 -4918 -29058 18301 36547 36805 33562 44715 88773 122796 101961 107826 67908
13399 67908 32208 -15263 -19973 36953 88131 75263 51541 74457 42921 -2889 9974 61247
13387 61247 78968 64790 15171 34774 -17422 -55710 -301 49929 62277 81082 47303 -25926
$$ packed form
13474A94580Q102o5677k3086k2397j3648J06K0333j8107m82Q446j6406j4027n4
13461E7683j7835K632J1945p23k9764j3926K1700L7853m4531k533M9463r353k6449
13448C6162j693k006k9564j1101k7796Q86L7901o392P444O1533N5294K4720P697
13435A53085n3509o5825N7398N395l2966M9571L6428O460M1409N771o8537j4808
13423A19872j4955m302l7916j9269o082M9404L9164j7343K5600N2400j5721r2283
13411G8569q3487k4140M7359J8246K58l243J1153M4058L4023k0835N865l9918
13399F7908l5700m7471m710N6926N1178j2868k3722K2916l1536m5810J2863N1273
13387F1247J7721j4178m9619J9603n2196l8288N5409N0230J2348J8805l3779p3229
$$ plain form
13375 -25926 7086 34385 26334 29267 60644 36965 -3020 70422 80597 85351 58377 43283
13363 43283 -58777 -66161 32617 63829 94071 100179 57493 51788 70333 98394 74385 69974
13351 69974 34288 77911 126217 105975 113907 95910 85188 115738 94439 99161 128408 172338
13339 172338 238865 210815 164453 165222 153771 165661 215830 236062 234752 263248 303170 369737
13327 369737 455313 532056 570801 598753 579586 582857 631296 662226 648385 637767 646102 637568
13315 637568 623937 650106 667028 653543 606220 574471 511933 491248 437640 406007 352070
13304 352070 289325 275967 292260 323661 347739 379353 321641 242773 204318 187484 189652 184312
13292 184312 220183 192904 152676 142509 113093 127494 140040 147392 172799 182758 199719 145245
$$ packed form
13375b5926L3012K7299q051K933L1377k3679l9985P3442J0175M754k6974j5094
13363D3283j02060p384R8778L1212L0242O108m2686n705J8545K8061k4009m411
13351F9974l5686M3623M8306k0242P932j7997j0722L0550k1299M722K9247M3930
13339A72338O6527k8050m6362P69j1451J1890N0169K0232j310K8496L9922O6567
13327C69737Q5576P6743L8745K7952j9167L271M8439L0930j3841j0618Q335q534
13315F37568j3631K6169J6922j3485m7323l1749o2538k0685n3608l1633n3937
13304C52070o2745j3358J6293L1401K4078L1614n7712p8868l8455j6834K168n340
13292A84312L5871k7279m0228j0167k9416J4401J2546P352K5407R959J6961n4474
$$ plain form
13280 145245 152628 182212 166288 131133 140133 146905 173727 177000 145911 107012 36966 40398
13268 40398 89032 134257 99119 39614 78665 119627 166060 174207 179782 178838 131021 60242
13256 60242 51763 82118 53388 33266 6690 16305 76964 87402 50245 10329 31604 49091
13244 49091 66162 63443 96082 60839 65834 77913 93404 121500 137964 112941 113622 97098
13232 97098 66966 2955 -54092 -85053 -73537 -62977 -26410 36416 44453 -15352 -81855 -79741
13220 -79741 -19680 -11568 26136 13540 4989 -1461 -3497 19863 -1593 -10054 34267 37462 41665
13207 41665 41266 52568 54758 19082 57160 49004 19595 -2472 -58765 -68906 -60978 -56369 -17619
13194 -17619 -23791 -791 10612 43861 74500 53938 31496 13190 6026 23180 53643 60806
$$ packed form
13280A45245P383K9584j5924l5155R000O772K6822L273l1089l8899p0046L432
13268D0398M8634M5225l5138n9505L9051M0962M6433Q147N575r44m7817p0779
13256F0242q479L0355k8730k0122k6576R615O0659J0438l7157l9916K1275J7487
13244D9091J7071k719L2639l5243M995J2079J5491K8096J6464k5023O81j6524
13232I7098l0132o4011n7047l0961J1516J0560L6567O2826Q037n9805o6503K114
13220g9741O0061Q112L7704j2596q551o450k036K3360k1456q461M4321L195M203
13207D1665l99J1302K190l5676L8078q156k9409k2067n6293j0141P928M609L8750
13194a7619o172K3000J1403L3249L0639k0562k2442j8306p164J7154L0463P163
$$ plain form
13182 60806 23235 -15872 -37490 -37439 -48610 -47940 -90162 -83071 -16328 39268 53733 30920 19854
13169 19854 30794 24310 24007 15915 70032 81661 24972 -5306 -8583 -9832 32775 56564 75316
13156 75316 49291 50649 6089 -7521 -17392 18388 -516 -32057 -24531 -25018 -7003 80566 107014
13143 107014 31624 -5779 16532 24255 -8489 19760 32398 -891 4764 40114 92034 84387
13131 84387 81050 144605 144732 121610 74497 26072 73146 133134 80209 33512 30240 10781
13119 10781 61 11350 19273 -32237 -11757 45834 92752 65489 62753 40959 -16785 -31209
13107 -31209 70 -8452 -35960 -35842 -18412 18551 36611 16532 39657 13623 -14210 12188
13095 12188 14523 7614 -10565 51390 57022 -333 -21273 19991 29279 4544 -25838 -30000 -9300
$$ packed form
13182F0806l7571l9107k1618N1j1171O70m2222P091O6743N5596J4465k2813j1066
13169A9854J0940o484l03q092N4117J1629n6689l0278l277j249M2607K3789J8752
13156G5316k6025J358m4560j3610r871L5780j8904l1541P526m87J8015Q7569K6448
13143A07014p5390l7403K2311P723l2744K8249J2638l3289N655L5350N1920p647
13131H4387l337O3555J27k3122m7113m8425M7074N9988n2925m6697l272j9459
13119A0781j0720J1289P923n1510K0480N7591M6918k7263k736k1794n7744j4424
13107c1209L1279q522k7508J18J7430L6963J8060k0079K3125k6034k7833K6398
13095A2188K335o909j8179O1955N632n7355k0940M1264R288k4735l0382m162K0700
$$ plain form
13082 -9300 -21716 -50676 -14119 -7617 -75732 -69717 -57002 -28620 16852 42952 47136 5169
13070 5169 -25333 5567 8384 45174 76717 82833 31801 -29062 -12224 -7093 -60412 -46131
13058 -46131 17539 29549 10108 23675 45790 78121 77851 68929 83388 76040 47155 35678
13046 35678 64885 78802 95104 41300 -4191 -19270 2761 43977 51151 9935 -12175 1474
13034 1474 49521 55444 35777 11848 -5649 56207 80389 95019 86573 59822 21578 35349
13022 35349 43410 30251 79583 57413 31367 42350 90211 54076 18345 4558 -631 12210
13010 12210 50878 57201 69652 47272 -2022 -29303 -95469 -96558 -56082 -10566 29376 73819
12998 73819 102990 73238 23164 -23321 -48758 -80924 -94672 -72787 -60023 -58308 -26155 -18631
$$ packed form
13082i300j2416k8960L6557O502o8115O015J2715K8382M5472K6100M184m1967
13070E169l0502L0900K817L6790L1543O116n1032o0863J6838N131n3319J4281
13058d6131O3670J2010j9441J3567K2115L2331k70q922J4459p348k8885j1477
13046C5678K9207J3917J6302n3804m5491j5079K2031M1216P174m1216k2110J3649
13034A474M8047N923j9667k3929j7497O1856K4182J4630q446k6751l8244J3771
13022C5349Q061j3159M9332k2170k6046J0983M7861l6135l5731j3787n189J2841
13010A2210L8668O323J2451k2380m9294k7281o6166j089M0476M5516L9942M4443
12998G3819K9171k9752n0074m6485k5437l2166j3748K1885J2764J715L2153P524
$$ plain form
12986 -18631 43432 75939 38579 14240 35165 57452 87744 90077 78212 61026 43522 12467
12974 12467 -55665 -83378 -65148 -38154 -18835 22188 25391 29374 33350 -2960 40517 67238
12962 67238 32590 -6767 -1259 22406 6105 -29893 -63950 -33097 863 -16630 48288 62706
12950 62706 69436 33337 -33091 32283 54770 61983 43626 36757 81006 117966 96135 81117
12938 81117 41124 -7658 -18261 13601 33474 74120 39046 3828 7974 -38180 9569 35952
12926 35952 40211 27958 69799 110908 76619 11752 -44584 -59681 -44047 31145 59495 25290
12914 25290 17782 11043 26827 46106 -3091 -7106 19145 -5303 -61637 -74225 -66119 -14429
12902 -14429 45481 44768 10495 -81591 -143267 -87812 -72233 -32395 59265 151798 128812 70211
$$ packed form
12986a8631O2063L2507l7360k4339K0925K2287L0292K333j1865j7186j7504l1055
12974A2467o8132k7713J8230K6994J9319M1023L203L983L976l6310M3477K6721
12962F7238l4648l9357N508K3665j6301l5998l4057L0853L3960j7493O4918J4418
12950F2706O730l6099o6428O5374K2487P213j8357o869M4249L6960k1831j5018
12938H1117l9993m8782j0603L1862J9873M0646l5074l5218M146m6154M7749K6383
12926C5952M259j2253M1841M1109l4289o4867n6336j5097J5634P5192K8350l4205
12914B5290p508o739J5784J9279m9197m015K6251k4448n6334j2588Q106N1690
12902a4429N9910p13l4273r2086o1676N5455J5579L9838R1660R2533k2986n8601
$$ plain form
12890 70211 38963 -12893 -47603 -32890 -23138 23273 79208 83140 36890 27915 -10036 -50718
12878 -50718 -45869 -5281 32283 39962 18056 -14848 -62569 -60206 -7809 20967 17671 24392 -18627
12865 -18627 -778 14537 37963 -6524 -18594 10313 24110 32245 694 17768 40774 33853
12853 33853 -18888 -19899 -31825 -13732 -22912 -23615 -10804 -3872 -27095 -50797 -42534 -39425 3806
12840 3806 -4790 -16040 -19332 4376 62141 88862 110043 67764 49317 47466 58148 59285 78880
12827 78880 69551 67745 35288 28870 -20783 -9374 27837 57806 43756 61537 73827 84394
12815 84394 77179 38435 18080 56508 62156 57502 24759 42545 15603 -41462 -20420 20666
12803 20666 43676 29206 28890 40582 23105 43411 68167 74219 69076 64682 61595 84771 81500
$$ packed form
12890G0211l1248n1856l4710J4713R752M6411N5935L932m6250q975l7951m0682
12878e0718M849M0588L7564P679k1906l2904m7721K363N2397K8776l296O721m3019
12865a8627J7849J5315K3426m4487j2070K8907J3797Q135l1551J7074K3006o921
12853C3853n2741j011j1926J8093r180p03J2811O932k3223k3702Q263L109M3231
12840C806q596j1250l292K3708N7765K6721K1181m2279j8447j851J0682J137J9595
12827G8880r329j806l2457o418m9653J1409L7211K9969j4050J7781J2290J0567
12815H4394p215l8744k0355L8428N648m654l2743J7786k6942n7065K1042M1086
12803B0666K3010j4470l16J1692j7477K0306K4756O052n143m394l087K3176l271
$$ plain form
12790 81500 18788 -4082 -35168 -67632 -50820 -39406 17923 55266 23806 7772 2895 23059
12778 23059 12623 -25084 -18058 15512 -14886 -33740 -86211 -71387 1101 55556 54169 20030
12766 20030 13387 49030 96262 119344 104462 113976 112259 130580 103208 63024 20513 31687
12754 31687 95921 89540 -8311 4088 10522 -8526 -12048 18804 26071 49065 69107 49376
12742 49376 752 -2180 64021 66240 49510 20606 4924 38144 48540 51865 101956 144126
12730 144126 51252 28974 22391 -1177 -36320 -54241 4687 70902 66866 26019 -35976 -57165
12718 -57165 -17807 51898 49885 7233 26982 48510 98656 97027 99242 132323 146423 145139
12706 145139 127847 43619 -4620 34417 12292 5482 2654 31752 97867 113862 37988 -13218
$$ packed form
12790H1500o2712k2870l1086l2464J6812J1414N7329L7343l1460j6034m877K0164
12778B3059j0436l7707P026L3570l0398j8854n2471J4824P2488N4455j387l4139
12766B0030o643L5643M7232K3082j4882R514j717J8321k7372m0184m2511J1174
12754C1687O4234o381r7851J2399O434j9048l522L0852P267K2994K0042j9731
12742D9376m8624k932O6201K219j6730k8904j5682L3220J0396L325N0091M2170
12730A44126r2874k2278o583k3568l5143j7921N8928O6215m036m0847o1995k1189
12718e7165L9358O9705k013m2652J9749K1528N0146j629K215L3081J4100j284
12706A45139j7292q4228m8239L9037k2125o810k828K9098O6115J5995p5874n1206
$$ plain form
12694 -13218 16372 18917 56544 4325 -67773 -61808 1418 70532 93265 56091 27730 103905
12682 103905 182279 173537 99893 85818 94593 98151 98820 101419 76681 96509 72294 70087 122164
12669 122164 144147 110537 115387 96149 116619 100097 77990 114605 140097 104909 92261 111291
12657 111291 140008 169802 166528 178044 254355 338845 351608 378192 403762 458289 544833 532262
12645 532262 513805 506903 503174 460730 421958 375761 332840 368630 421996 423268 437606 467594
12633 467594 480836 429163 445365 424261 436077 505015 554087 570459 542281 562722 525665
12622 525665 538213 583316 641742 675101 693541 710024 700291 668930 666232 733332 773932 763982
12610 763982 767320 773667 752121 729670 703147 699464 725910 754607 744991 711568 718589 731627
$$ packed form
12694a3218K9590K545L7627n2219p2098N965O3226O9114K2733l7174k8361P6175
12682A03905P8374q742p3644j4075Q775L558O69K599k4738J9828k4215k207N2077
12669A22164K1983l3610M850j9238K0470j6522k2107L6615K5492l5188j2648J9030
12657A11291K8717K9794l274J1516P6311Q4490J2763K6584K5570N4527Q6544j2571
12645E32262j8457o902l729m2444l8772m6197m2921L5790N3366J272J4338K9988
12633D67594J3242n1673J6202k1104J1816O8938M9072J6372k8178K0441l7057
12622E25665J2548M5103N8426L3359J8440J6483r733l1361k698O7100M0600r950
12610G63982L338O347k1546k2451k6523l683K6446K8697r616l3423P021J3038
$$ plain form
12598 731627 721512 692895 737613 770414 703134 605239 605169 596797 591144 583937 553559 541103 524060
12585 524060 509784 535771 529556 537717 535750 506571 474886 517876 512745 504126 414379 371934
12573 371934 279715 229829 199191 198921 214910 180951 212715 235080 221196 176628 176186 241240
12561 241240 280165 305551 306517 300844 269700 229621 203430 137947 103569 145846 201927 191446
12549 191446 182472 169790 210345 245790 235547 191889 208601 227791 246845 272529 252562 187096
12537 187096 178535 212325 254081 309457 326071 328981 333806 337450 348264 294975 250433 224442
12525 224442 215800 227831 249268 219668 236294 284762 284047 246369 215242 176519 161729 207423
12513 207423 188366 136534 124905 186984 217334 222149 197315 190870 277420 307388 284342 220534
$$ packed form
12598G31627j0115k8617M4718L2801o7280r7895p0q372n653p207l0378j2456j7043
12585E24060j4276K5987o215Q161j967k9179l1685M2990n131q619q9747m2445
12573C71934r2219m9886l0638k70J5989l3959L1764K2365j3884m4568m42O5054
12561B41240L8925K5386R66n673l1144m0079k6191o5483l4378M2277N6081j0481
12549A91446q974j2682M0555L5445j0243m3658J6712J9190J9054K5684j9967o5466
12537A87096q561L3790M1756N5376J6614K910M825L644J0814n3289m4542k5991
12525B24442q642J2031K1437k9600J6626M8468p15l7678l1127l8723j4790M5694
12513B07423j9057n1832j1629O2079L0350M815k4834o445Q6550K9968k3046o3808
$$ plain form
12501 220534 189646 206418 210790 229949 237645 292492 299966 267534 236220 227086 221584 177844
12489 177844 181211 200107 167062 161180 158126 237470 303488 281812 270066 261196 301195 388423
12477 388423 437328 369537 359517 359779 351656 399112 424912 437780 408144 424715 450592 437203
12465 437203 470147 461236 513007 562143 500734 511372 534830 493669 455491 469915 508574 539102
12453 539102 530125 491255 453277 550064 581779 542797 570061 573328 577820 583497 582192 624548
12441 624548 731344 789485 833218 900777 940019 986606 915372 833238 762584 742811 741795
12430 741795 711174 693400 652191 599616 628572 579687 512443 473397 479454 537322 568400 606900
12418 606900 621701 555454 554778 518711 426426 433168 446177 422166 432697 471651 485198 481549
$$ packed form
12501B20534l0888J6772M372J9159P696N4847P474l2432l1314r134n502m3740
12489A77844L367J8896l3045n882l054P9344O6018k1676j1746q870L9999Q7228
12477C88423M8905o7791j0020K62q123M7456K5800J2868k9636J6571K5877j3389
12465D37203L2944q911N1771M9136o1409J0638K3458m1161l8178J4424L8659L0528
12453E39102q977l8870l7978R6787L1715l8982K7264L267M492N677j305M2356
12441F24548J06796N8141M3733O7559L9242M6587p1234q2134p0654j9773j016
12430G41795l0621j7774m1209n2575K8956m8885o7244l9046O057N7868L1078L8500
12418F06900J4801o6247o76l6067r2285O742J3009k4011J0531L8954J3547l649
$$ plain form
12406 481549 441656 379234 369397 408553 487082 464238 477514 434497 387947 382759 399909 432433
12394 432433 434270 410802 382083 338609 302129 297315 264542 249521 239330 211598 192803 251627
12382 251627 291358 276898 258158 241210 214259 201884 225642 310983 366521 359975 331734 344424
12370 344424 370806 376717 354750 362739 383435 391577 400109 411282 414737 374114 375470 366308 413519
12357 413519 462623 434986 403667 404409 424620 446934 439773 416057 417543 456849 442060 405849
12345 405849 413690 459782 503893 491556 452292 431248 478874 505612 535909 573502 485572 440129
12333 440129 448030 440239 499099 529459 578483 607802 579791 566661 581870 618776 658535 660972
12321 660972 614364 631593 646731 653482 665637 700374 772585 769431 767719 835295 871654 864196
$$ packed form
12406D81549l9893o2422r837L9156P8529k2844J3276m3017m6550n188J7150L2524
12394D32433J837k3468k8719m3474l6480m814l2773j5021j0191k7732j8795N8824
12382B51627L9731j4460j8740j6948k6951j2375K3758Q5341N5538o546k8241J2690
12370C44424K6382N911k1967P989K0696Q142Q532J1173L455m0623J356r162M7211
12357D13519M9104k7637l1319P42K0211K2314p161k3716J486L9306j4789l6211
12345D05849P841M6092M4111j2337l9264k1044M7626K6738L0297L7593q7930m5443
12333D40129P901p791N8860L0360M9024K9319k8011j3130J5209L6906L9759K437
12321F60972m6608J7229J5138O751J2155L4737P2211l154j712O7576L6359p458
$$ plain form
12309 864196 861352 837740 850173 890215 868940 853020 880394 923461 902945 893854 842121 870253
12297 870253 953166 1042770 1070339 1079118 1125075 1216539 1298018 1325759 1384330 1395131 1478474 1517742
12285 1517742 1528969 1567382 1626324 1668368 1667450 1733731 1866773 2021809 2110613 2202627 2304550
12274 2304550 2390340 2430840 2516546 2543497 2566087 2695419 2820145 2909515 2953832 2984413 3068348
12263 3068348 3200651 3372205 3552144 3762733 3933194 4127897 4336850 4552744 4796773
12254 4796773 5026217 5265294 5519465 5821123 6168319 6601657 7109393 7595945 8104995
12245 8104995 8521618 8946274 9480653 10101866 10857200 11782843 12790322 13816968 14856166
12236 14856166 15838122 16922528 18066868 19416802 20965032 22782968 24791096 27083825
$$ packed form
12309H64196k844k3612J2433M0042k1275j5920K7374M3067k0516r091n1733K8132
12297H70253Q2913Q9604K7569Q779M5957R1464Q1479K7741N8571J0801Q3343L9268
12285A517742J1227L8413N8942M2044r18O6281J33042J55036Q8804R2014J01923
12274B304550Q5790M0500Q5706K6951K2590J29332J24726Q9370M4317L0581Q3935
12263C068348J32303J71554J79939K10589J70461J94703K08953K15894K44029
12254D796773K29444K39077K54171L01658L47196M33338N07736M86552N09050
12245H104995M16623M24656N34379O21213P55334R25643J007479J026646J039198
12236A4856166R81956J084406J144340J349934J548230J817936K008128K292729
$$ plain form
12228 27083825 29762575 32958746 37031617 42165229 48253578 54895415 61372088 67105991
12220 67105991 71802562 75558576 78261191 79798815 80079600 79398077 78106967 76584351
12212 76584351 75175010 74180061 73626888 73522222 73843214 74752636 76222781 78258732 80748356
12203 80748356 83461973 86214062 88745314 91070315 93390837 95873493 98467623 101161265
12195 101161265 103921118 106666440 109438542 112321605 115568681 119493266 124273135 129772278
12187 129772278 135414241 140175293 143055031 143750886 142736074 140810812 138437819 135853106
12179 135853106 133260506 130480517 127317694 123975531 120658203 117496079 114544229 111798269
12171 111798269 109117597 106695085 104730796 103267314 102357173 101774663 101378125 100930760
$$ packed form
12228B7083825K678750L196171M072871N133612O088349O641837O476673N733903
12220F7105991M696571L756014K702615J537624K80785o81523j291110j522616
12212G6584351j409341r94949n53173j04666L20992R09422J470145K035951K489624
12203H0748356K713617K752089K531252K325001K320522K482656K594130K693642
12195A01161265K759853K745322K772102K883063L247076L924585M779869N499143
12187A29772278N641963M761052K879738O95855j014812j925262k372993k584713
12179A35853106k592600k779989l162823l342163l317328l162124k951850k745960
12171A11798269k680672k422512j964289j463482r10141n82510l96538m47365
$$ plain form
12163 100930760 100314693 99281470 97634354 95447618 93009405 90622245 88478234 86323192
12155 86323192 83852187 80975561 78039975 75309699 72809045 70024514 66513624 62258935
12147 62258935 57843348 53713186 50133822 47104797 44477855 42193701 40123077 38193367
12139 38193367 36364823 34721871 33167055 31628918 30001502 28427836 26952282 25565586
12131 25565586 24199817 22906102 21773053 20736099 19793364 18928017 18111313 17376072 16768888
12122 16768888 16206181 15618604 15067889 14562751 14059957 13628620 13154824 12666860 12130580
12113 12130580 11568515 11101695 10708894 10349872 9976425 9562110 9150442 8783248 8483904
12104 8483904 8185363 7800852 7464857 7186258 6948055 6699352 6428812 6163779 5944851
$$ packed form
12163A00930760o16067j033223j647116k186736k438213k387160k144011k155042
12155H6323192k471005k876626k935586k730276k500654k784531l510890m254689
12147F2258935m415587m130162l579364l029025k626942k284154k070624j929710
12139C8193367j828544j642952j554816j538137j627416j573666j475554j386696
12131B5565586j365769j293715j133049j036954r42735q65347q16704p35241o07184
12122A6768888n62707n87577n50715n05138n02794m31337m73796m87964n36280
12113A2130580n62065m66820l92801l59022l73447m14315m11668l67194k99344
12104H483904k98541l84511l35995k78599k38203k48703k70540k65033k18928
$$ plain form
12095 5944851 5707302 5438566 5175156 5002489 4798997 4578458 4399913 4178384 3992023
12086 3992023 3829544 3690906 3516962 3330510 3239661 3170024 3008750 2898411 2801273 2728445
12076 2728445 2656478 2593988 2553310 2452320 2373985 2272846 2186514 2148568 2121544 2060149 2036507
12065 2036507 2058894 2008628 1911263 1834390 1746741 1675096 1605825 1605685 1534872 1478664 1483938 1488302
12053 1488302 1500727 1433564 1367607 1299693 1237576 1179261 1201516 1219734 1229055 1179303 1141196
12042 1141196 1083642 1057602 1033129 1056916 1056438 982377 955599 926051 957676 971688 987847 961477
12030 961477 931852 864322 826974 802698 808814 815857 787810 781677 758064 738067 732453 695482
12018 695482 708779 694112 666988 710875 728629 679696 572374 514467 576133 571315 564982 596995
$$ packed form
12095E944851k37549k68736k63410j72667k03492k20539j78545k21529j86361
12086C992023j62479j38638j73944j86452r0849o9637j61274j10339r7138p2828
12076B728445p1967o2490m0678j00990p8335j01139q6332l7946k7024o1395k3642
12065B036507K2387n0266r7365p6873q7649p1645o9271j40p0813n6208N274M364
12053A488302J2425o7163o5957o7914o2117n8315K2255J8218R321m9752l8107
12042A141196n7554k6040k4473K3787m78p4061k6778k9548L1625J4012J6159k6370
12030I61477k9625o7530l7348k4276O116P043k8047o133k3613j9997n614l6971
12018F95482J3297j4667k7124M3887J7754m8933j07322n7907O1666m818o333L2013
$$ plain form
12006 596995 563673 557135 599524 584937 587421 625561 675674 697921 733355 723385 674831 607048
11994 607048 596864 617312 649381 641432 650378 659795 632833 637887 649848 656798 626115 593355
11982 593355 579335 605216 592456 578175 548369 533450 612780 627281 611531 577863 513216
11971 513216 495177 458372 430467 451010 496902 513273 474756 396678 379425 361658 370331 372997
11959 372997 419975 433869 442810 473679 470252 437764 403865 442662 447450 440074 408828 358913
11947 358913 282532 258847 339141 343106 280695 296381 292063 295671 327560 325132 370098 360002
11935 360002 323542 317322 305499 309751 314572 319684 282845 211142 202518 204124 253085 302522 291112
11922 291112 280779 277723 262032 243297 276985 294067 247235 233364 280154 313404 276420 232126
$$ packed form
12006E96995l3322o538M2389j4587K484L8140N0113K2247L5434r970m8554o7783
11994F07048j0184K0448L2069p949Q946R417k6962N054J1961O950l0683l2760
11982E93355j4020K5881j2760j4281k9806j4919P9330J4501j5750l3668o4647
11971E13216j8039l6805k7905K0543M5892J6371l8517p8078j7253j7767Q673K666
11959C72997M6978J3894Q941L0869l427l2488l3899L8797M788p376l1246m9915
11947C58913p6381k3685Q0294L965o2411J5686m318L608L1889k428M4966j0096
11935C60002l6460o220j1823M252M821N112l6839p1703q624J606M8961M9437j1410
11922B91112j0333l056j5691j8735L3688J7082m6832j3871M6790L3250l6984m4294
$$ plain form
11910 232126 217874 263322 327062 325272 274443 221888 264069 281627 263162 220055 196940 168041
11898 168041 140048 143390 165526 216891 216943 247834 273658 211087 170389 153657 133963 116234
11886 116234 70587 92940 93480 96402 134386 162837 165657 201149 215460 180727 137081 133731
11874 133731 163678 155678 157672 165171 172333 164468 149717 171542 141365 109062 69598 76910 133136
11861 133136 125744 156310 166545 148850 87713 118282 132294 143736 201181 247370 230774 177563
11849 177563 175571 155213 161403 88411 99591 51982 48271 69337 88706 99074 183326 207379
11837 207379 223515 183582 146534 205155 237410 200983 182876 164779 185687 160406 154349 128873
11825 128873 108007 129166 164604 138064 121684 179490 203136 221141 198001 191946 213762 186950
$$ packed form
11910B32126j4252M5448O3740j790n0829n2555M2181J7558j8465m3107k3115k8899
11898A68041k7993L342K2136N1365N2L0891K5824o2571m0698j6732j9694j7729
11886A16234m5647K2353N40K922L7984K8451K820L5492J4311l4733m3646l350
11874A33731K9947q000J994P499P162p865j4751K1825l0177l2303l9464P312N6226
11861A33136p392L0566J0235j7695o1137L0569J4012J1442N7445M6189j6596n3211
11849A77563j992k0358O190p2992J1180m7609l711K1066J9369J0368Q4252K4053
11837B07379J6136l9933l7048N8621L2255l6427j8107j8097K0908k5281o057k5476
11825A28873k0866K1159L5438k6540j6380N7806K3646J8005k3140o055K1816k6812
$$ plain form
11813 186950 121471 125877 175805 165105 177948 140984 141375 128105 185323 202486 233917 223537
11801 223537 215420 194357 195413 207173 245957 206131 228011 219016 285284 338340 297499 338848
11789 338848 395438 444836 436164 419511 415627 430165 423665 393535 389386 402125 386728 373433
11777 373433 405840 456762 486281 474734 506618 430718 464565 564177 540162 534312 515818 540263
11765 540263 545488 571662 611432 643048 660350 709848 759563 754740 760305 700095 657060 695757
11753 695757 775863 802702 768742 767445 790210 746834 707851 706388 732066 736378 733053 746820
11741 746820 686207 684970 727438 646768 569464 550815 566492 542966 519519 542882 504391 498809
11729 498809 554983 552487 508887 534219 560281 556155 481461 520496 541856 569188 572749 566824
$$ packed form
11813A86950o5479M406M9928j0700J2843l6964L91j3270N7218J7163L1431j0380
11801B23537q117k1063J056J1760L8784l9826K1880q995O6268N3056m0841M1349
11789C38848N6590M9398q672j6653l884J4538o500l0130m149J2739j5397j3295
11777C73433L2407N0922K9519j1547L1884p5900L3847R9612k4015n850j8494K4445
11765E40263N225K6174L9770L1616J7302M9498M9715m823N565o0210m3035L8697
11753F95757Q0106K6839l3960j297K2765m3376l8983j463K5678M312l325J3767
11741G46820o0613j237M2468q0670p7304j8649J5677k3526k3447K3363l8491n582
11729D98809N6174k496m3600K5332K6062m126p4694L9035K1360K7332L561n925
$$ plain form
11717 566824 530744 472336 421990 379908 333367 308812 288875 325450 331105 322032 282480 284234
11705 284234 284216 311047 317067 322651 305025 299466 245415 230700 183632 157921 94611 89764 114973
11692 114973 131947 100211 155748 145691 130123 137576 134451 118365 88087 123577 137430 100999
11680 100999 39887 102194 119030 77754 56774 71892 54958 53389 38684 17017 9520 42810
11668 42810 7641 20526 12993 37586 89188 79167 95535 104150 142122 135801 93757 39460
11656 39460 5811 -367 47054 58346 31290 15750 47672 71585 107594 89108 12324 841
11644 841 41887 90068 133772 132670 56257 32371 3625 -11346 10115 51372 30236 -55219
11632 -55219 -4351 76214 89436 60016 16817 65343 87036 91912 77902 39971 22466 64652
$$ packed form
11717E66824l6080n8408n0346m2082m6541k4555j9937L6575N655r073l9552J754
11705B84234j8K6831O020N584j7626n559n4051j4715m7068k5711o3310m847K5209
11692A14973J6974l1736N5537j0057j5568P453l125j6086l0278L5490J3853l6431
11680A00999o1112O2307J6836m1276k0980J5118j6934j569j4705k1667p497L3290
11668D2810l5169J2885p533K4593N1602j0021J6368Q615L7972o321m2044n4297
11656C9460l3649o178M7421J1292k7056j5540L1922K3913L6009j8486p6784j1483
11644H41M1046M8181M3704j102p6413k3886k8746j4971K1461M1257k1136q5455
11632e5219N0868Q0565J3222k9420m3199M8526K1693M876j4010l7931j7505M2186
$$ plain form
11620 64652 71165 85021 42048 -5757 33284 99448 120938 69138 39411 67433 24308 8925
11608 8925 41855 25953 -32140 -45873 -3868 45812 69371 31763 23992 45303 41330 -4363
11596 -4363 29760 105017 124168 119939 147253 142199 134131 118367 93533 54457 29769 55607
11584 55607 65681 37664 55101 43639 48345 44942 26109 59155 71520 64859 -1499 16278
11572 16278 10698 -13958 4104 50774 56130 8531 -17565 -5642 23699 37797 -30533 -99414
11560 -99414 -52436 6851 36144 25691 -9477 -20472 -5326 16721 -16906 -72985 -48967 32147
11548 32147 90853 67225 59869 57439 -3781 -5362 -81019 -53597 399 44916 55781 29583
11536 29583 32437 -23557 -38513 -32296 -34301 -31260 -23399 -3585 -10501 -16811 -18301 13766 19210
$$ packed form
11620F4652O513J3856m2973m7805L9041O6164K1490n1800k9727K8022m3125j5383
11608H925L2930j5902n8093j3733M2005M9680K3559l7608p771K1311l973m5693
11596d363L4123P5257J9151m229K7314n054q068j5764k4834l9076k4688K5838
11584E5607J0074k8017J7437j1462M706l403j8833L3046J2365o661o6358J7777
11572A6278n580k4656J8062M6670N356m7599k6096J1923K9341J4098o8330o8881
11560i9414M6978N9287K9293j0453l5168j0995J5146K2047l3627n6079K4018Q1114
11548C2147N8706k3628p356k430o1220j581p5657K7422N3996M4517J0865k6198
11536B9583K854n5994j4956O217k005L041P861J9814o916o310j490L2067N444
$$ plain form
11523 19210 -30243 -55783 15516 21469 766 12812 -3901 45218 98552 52724 -36817 -46786
11511 -46786 -20053 -6139 -24672 -70910 -52456 22338 15593 -29041 -41876 -40708 -5238 -3907
11499 -3907 -20146 -31567 -36764 5078 -27926 -11734 4099 17953 24933 26929 22849 59939 13230
11486 13230 -54257 -58449 -19133 -20205 22548 40879 -8869 -5807 -3241 23762 10726 23657
11474 23657 61579 22710 22071 -9686 -12371 -25599 -57304 -4887 581 -758 22888 68406 60000
11461 60000 35821 96826 41074 -27144 -64587 -50853 -71439 -104051 -97373 -66246 -62542 -42304
11449 -42304 -16030 2702 -11284 5500 2013 -17409 -21726 22335 63829 54560 61911 68452 46784
11436 46784 33497 8381 -9449 -22315 -5829 -10937 8167 1903 -64883 -55736 1641 29902
$$ packed form
11523A9210m9453k5540P1299N953k0703J2046j6713M9119N3334m5828q9541r969
11511d6786K6733J3914j8533m6238J8454P4794o745m4634j2835J168L5470J331
11499c907j6239j1421n197M1842l3004J6192J5833J3854O980J996m080L7090m6709
11486A3230o7487m192L9316j072M2753J8331m9748L062K566K7003j3036J2931
11474B3657L7922l8869o39l1757k685j3228l1705N2417N468j339K3646M5518q406
11461F0000k4179O1005n5752o8218l7443J3734k0586l2612O678L1127L704K0238
11449d2304K6274J8732j3986J6784l487j9422m317M4061M1494r269P351O541k1668
11436D6784j3287k5116j7830j2866J6486n108J9104o264o6786R147N7377K8261
$$ plain form
11424 29902 -4569 -47628 -54561 -49999 -93939 -77891 -63933 -13228 12947 -2503 -55922 -87393
11412 -87393 -52389 -28666 -18644 9326 48240 29234 57559 21766 -9922 24365 2521 -35724
11400 -35724 -51673 -74005 -71754 -91696 -43109 -46870 -97317 -103303 -79406 -46772 -85690 -76594
11388 -76594 -27681 881 -42838 -66762 -23864 15874 11187 -16779 -87954 -101229 -75988 -32161
11376 -32161 21642 24348 32231 -11545 17453 43078 18420 21674 15360 -8125 -32349 -74609
11364 -74609 -37001 -13796 -23336 -38312 -31023 -36560 -8855 4957 11225 2460 19458 31452 3431
11351 3431 33904 46979 14852 25910 22021 -14667 -39847 -42603 -35174 -40565 -20578 35936 49290
11338 49290 42599 7406 -24516 1292 -5250 -48399 4540 33445 37584 3726 17694 70777
$$ packed form
11424B9902l4471m3059o933M562m3940J6048J3958N0705K6175j5450n3419l1471
11412h7393L5004K3723J0022K7970L8914j9006K8325l5793l1688L4287k1844l8245
11400c5724j5949k2332K251j9942M8587l761n0447n986K3897L2634l8918R096
11388g6594M8913K8562m3719k3924M2898L9738m687k7966p1175j3275K5241M3827
11376c2161N3803K706P883m3776K8998K5625k4658L254o314k3485k4224m2260
11364g4609L7608K3205r540j4976P289n537K7705J3812O268q765J6998J1994k8021
11351C431L0473J3075l2127J1058l889l6688k5180k756P429n391J9987N6514J3354
11338D9290o691l5193l1922K5808o542m3149N2939K8905M139l3858J3968N3083
$$ plain form
11326 70777 48966 28425 -21907 -35804 -25556 -5476 -8707 -27263 -83558 -108325 -89404 -66023
11314 -66023 -83438 -75564 -5328 34450 47510 56453 64122 45335 117530 148426 90744 -12913
11302 -12913 -36646 -3092 5517 5077 -7536 -35971 -33078 -10561 -10455 11184 13855 -50506 -73910
11289 -73910 -56477 -57922 -43996 -8705 -12002 9264 -10449 -22457 15328 57378 46832 45249
11277 45249 639 -34411 -78732 -41502 -23489 4336 -306 39353 33005 -13418 -49885 -70383
11265 -70383 -63818 -37997 -19749 -14352 32158 24563 1494 -6301 -19347 -29424 -52505 -58151 -41403
11252 -41403 14163 8481 22043 -36871 -63192 -51407 -48908 -10934 36637 25999 -18624 -1882
11240 -1882 35398 27214 36668 89655 52268 31607 52755 6416 -19614 -44867 -68823 -100407
$$ packed form
11326G0777k1811k0541n0332j3897J0248K0080l231j8556n6295k4767J8921K3381
11314f6023j7415P874P0236L9778J3060Q943P669j8787P2195L0896n7682j03657
11302a2913k3733L3554Q609m40j2613k8435K893K2517J06K1639K671o4361k3404
11289g3910J7433j445J3926L5291l297K1266j9713j2008L7785M2050j0546j583
11277D5249m4610l5050m4321L7230J8013K7825m642L9659o348m6423l6467k0498
11265g0383O565K5821J8248N397M6510p595k3069p795j3046j0077k3081n646J6748
11252d1403N5566n682J3562n8914k6321J1785K499L7974M7571j0638m4623J6742
11240a882L7280q184R454N2987l7387k0661K1148m6339k6030k5253k3956l1584
$$ plain form
11228 -100407 -44109 -72477 -4899 20676 -5186 2157 -6850 -17283 -13123 52805 55730 17800
11216 17800 19117 9906 -13642 -29823 -33385 -54183 -28631 -19694 -12130 25153 27924 8680 795
11203 795 -18236 -10777 -40018 -25005 -80191 -32251 19459 79165 120903 33184 7844 -4141
11191 -4141 48180 115584 120067 52179 -6343 -17237 -31700 2854 31864 37949 17267 -549
11179 -549 -33377 -34914 -42366 -32806 -28785 -44370 -68537 -72922 -77100 -101554 -37256 -4048 36246
11166 36246 11149 -54124 -66166 -6321 21478 -27262 -70248 -90209 -87135 -51210 -26922 -1251
11154 -1251 15674 -29339 -89793 -87620 -37314 -579 49244 33812 -22776 -21104 -23100 6922
11142 6922 22500 -28045 -46362 -25732 -12244 -737 -2734 25684 41794 8716 24205 32474
$$ packed form
11228a00407N6298k8368O7578K5575k5862P343r007j0433M160O5928K925l7930
11216A7800J317r211k3548j6181l562k0798K5552Q937P564L7283K771j9244p885
11203G95j9031P459k9241J5013n5186M7940N1710N9706M1738q7719k5340j1985
11191d141N2321O7404M483o7888n8522j0894j4463L4554K9010O085k0682j7816
11179e49l2828j537p452R560M021j5585k4167m385m178k4454O4298L3208M0294
11166C6246k5097o5273j2042N9845K7799m8740m2986j9961L074L5925K4288K5671
11154a251J6925m5013o0454K173N0306L6735M9823j5432n6588J672j996L0022
11142F922J5578n0545j8317K0630J3488J1507j997K8418J6110l3078J5489Q269
$$ plain form
11130 32474 40890 73309 42786 -5144 -28478 -75019 -75389 -52761 -22276 12660 35788 4176
11118 4176 -4072 -31137 -34978 -51024 -60572 -2422 52984 11006 11665 -37513 -61644 -42952 -11597
11105 -11597 -49700 -71166 -22654 -4793 -28776 16003 35535 -14353 -24445 -44233 -75074 -61928
11093 -61928 -87215 -51920 -23150 41476 9626 -59675 -51067 -13051 -14690 -27727 -26665 -22993
11081 -22993 -38228 -64083 -49472 -32120 -9427 -2456 28622 47717 -3975 -8065 -26405 -43751
11069 -43751 -59347 -39522 -35359 -28345 8595 -1775 8454 28999 73169 25049 -4072 -18571
11057 -18571 -45899 -22645 -6575 -51765 -77302 -48451 -67248 -15907 -11887 9786 25414 30147
11045 30147 -15393 -103665 -126471 -107306 -79962 -88514 -101143 -113535 -165484 -178901 -131188 -28154
$$ packed form
11130C2474Q416L2419l0523m7930k3334m6541l70K2628L0485L4936K3128l1612
11118D176q248k7065l841j6046r548N8150N5406m1978O59m9178k4131J8692L1355
11105a1597l8103k1466M8512J7861k3983M4779J9532m9888j0092j9788l0841J3146
11093f1928k5287L5295K8770O4626l1850o9301Q608L8016j639j3037J062L672
11081b2993j5235k5855J4611J7352K2693O971L1078J9095n1692m090j8340j7346
11069d3751j5596J9825M163P014L6940j0370J0229K0545M4170m8120k9121j4499
11057a8571k7328K3254J6070m5190k5537K8851j8797N1341M020K1673J5628M733
11045C0147m5540q8272k2806J9165K7344q552j2629j2392n1949j3417M7713J03034
$$ plain form
11033 -28154 31491 -9940 -86978 -56389 10743 3656 -32266 -1222 -1210 7028 30059 23059 -14487
11020 -14487 -21623 -25210 -42863 -18420 -16973 47484 44473 67059 28195 -51982 -71852 -6378
11008 -6378 30221 35994 38486 14639 -8432 -31177 -1812 -2933 -17552 28233 57254 32515
10996 32515 -12800 -43669 -54807 -21328 -36966 -8102 14466 22333 38317 73272 81971 46717
10984 46717 22468 -28306 -36988 -9373 -4382 -9768 -14235 -13346 -7969 720 -46155 -48588 -59025
10971 -59025 -47399 -28587 -7465 24244 74185 73473 61945 38982 344 -44595 -36256 -9875
10959 -9875 -4026 -36668 -42528 -19889 4460 30655 38681 25624 -58404 -57617 -26344 -28474 -29573
10946 -29573 -54188 -74616 -20906 -9910 -17123 18664 20619 -30742 -42492 -59559 -36861 -30337
$$ packed form
11033b8154N9645m1431p7038L0589O7132p087l5922L1044J2Q238K3031p000l7546
11020a4487p136l587j7653K4443J447O4457l011K2586l8864q0177j9870O5474
11008f378L6599N773K492k3847k3071k2745K9365j121j4619M5785K9021k4739
10996C2515m5315l0869j1138L3479j5638K8864K2568P867J5984L4955Q699l5254
10984D6717k4249n0774q682K7615M991n386m467Q89N377Q689m6875k433j0437
10971e9025J1626J8812K1122L1709M9941p12j1528k2963l8638m4939Q339K6381
10959i875N849l2642n860K2639K4349K6195Q026j3057q4028P87L1273k130j099
10946b9573k4615k0428N3710J0996p213L5787J955n1361j1750j7067K2698O524
$$ plain form
10934 -30337 -17198 -30623 -24229 -29146 -59114 -52291 -26895 2239 -8567 -34749 1087 51094
10922 51094 41887 12708 -23239 249 -2658 -31128 -3761 -12031 -31500 -49963 -96906 -51030
10910 -51030 -31515 -37432 -39273 -34798 -39293 -46001 -16202 -8247 -36961 -56949 -42509 -21267 -33567
10897 -33567 -36419 -8992 -9767 -47785 -52895 -86053 -113487 -111499 -87044 -59501 -55917 -77855 -57058
10884 -57058 -77418 -34769 -9670 15694 -657 -18035 -20091 -68653 -65422 -37391 -12203 -6565
10872 -6565 -356 -31498 -5659 -9549 -41711 -29757 -23822 -41347 -35403 -24152 -4843 -4902 -69701
10859 -69701 -73418 -32171 24111 24137 29637 15693 -48085 -64604 -34090 8362 20738 6435 -20048
10846 -20048 -5180 -14390 -35794 -14871 12699 -15091 -23386 -3992 -33329 -32935 -26984 -45917 -109020
$$ packed form
10934c0337J3139j3425O394m917k9968O823K5396K9134j0806k6182L5836N0007
10922E1094r207k9179l5947K3488k907k8470K7367q270j9469j8463m6943M5876
10910e1030J9515n917j841M475m495o708K9799P955k8714j9988J4440K1242j2300
10897c3567k852K7427p75l8018n110l3158k7434J988K4455K7543L584k1938K0797
10884e7058k0360M2649K5099K5364j6351j7378k056m8562L231K8031K5188N638
10872f565O209l1142K5839l890l2162J1954N935j7525N944J1251J9309n9o4799
10859f9701l717M1247N6282K6N500j3944o3778j6519L0514M2452J2376j4303k6483
10846b0048J4868r210k1404K0923K7570k7790q295J9394k9337L94N951j8933o3103
$$ plain form
10833 -109020 -158516 -157615 -104606 -87558 -52147 -98311 -99120 -59139 -78350 -83803 -54643 -44779 -61754
10820 -61754 -62030 -30302 -18341 -6631 -22344 -29114 -28494 5406 29879 -61231 -74193 -30292 29533
10807 29533 -44311 -84662 -87932 -120155 -57247 30095 -17543 -50021 -47403 -58262 -32886 -44419
10795 -44419 -74688 -19639 71663 67203 5989 -722 -41464 22451 35229 9840 -1130 -20665
10783 -20665 -4715 6138 29859 37384 46806 42699 -8848 -21465 -72838 -89301 -82526 -115985
10771 -115985 -120407 -55739 -57856 -49023 -94507 -91571 -76463 -85279 -53597 44574 77250 34404
10759 34404 -36099 -71732 -38428 -47287 -50734 -28556 30232 57460 21229 10837 -11530 -47982
10747 -47982 -49568 24518 22049 2351 -53831 -76242 -68504 -63305 -15755 -2561 -16192 -36889
$$ packed form
10833a09020m9496R01N3009J7048L5411m6164q09L9981j9211n453K9160R864j6975
10820f1754k76L1728J1961J1710j5713o770O20L3900K4473r1110j2962M3901N9825
10807B9533p3844m0351l270l2223O2908Q7342m7638l2478K618j0859K5376j1533
10795d4419l0269N5049R1302m460o1214o711m0742O3915J2778k5389j0970j9535
10783b0665J5950J0853K3721P525R422m107n1547j2617n1373j6463O775l3459
10771a15985m422O4668k117Q833m5484K936J5108q816L1682R8171L2676m2846
10759C4404p0503l5633L3304q859l447K2178N8788K7228l6231j0392k2367l6452
10747d7982j586P4086k469j9698n6182k2411P738N199M7550J3194j3631k0697
$$ plain form
10735 -36889 -61040 -27791 -11289 -75673 -133872 -131314 -132431 -26636 38331 -8868 -10520 26195
10723 26195 66939 48475 -48378 21262 102308 87113 63622 78676 50995 41288 26382 558
10711 558 -10761 884 18875 -7022 -4599 -7329 28218 45880 7297 -23492 -24108 9748 27438
10698 27438 6768 -13633 6463 -17465 -18456 -42438 -77058 -63752 -32233 -58287 -61366 -34767
10686 -34767 -147 -22960 -38824 -24796 -18075 12102 -31461 -57360 -87984 12811 52685 62216
10674 62216 16602 2762 2753 -25988 -50647 -40397 12093 12070 28634 51896 30177 -17488 -3225
10661 -3225 6875 -17454 -76402 -61310 -58476 -55728 -13515 28669 3944 -46496 -25663 40777
10649 40777 67317 38477 51849 34010 23403 1243 38326 81832 96621 34230 -58104 -28628
$$ packed form
10735c6889k4151L3249J6502o4384n8199K558j117J05795O4967m7199j652L6715
10723B6195M0744j8464r6853O9640Q1046j5195k3491J5054k7681r707j4906k5824
10711E58j1319J1645J7991k5897K423k730L5547J7662l8583l0789o16L3856J7690
10698B7438k0670k0401K0096k3928r91k3982l4620J3306L1519k6054l079K6599
10686c4767L4620k2813j5864J4028O721L0177m3563k5899l0624J00795L9874R531
10674F2216m5614j3840rk8741k4659J0250N2490k3J6564K3262k1719m7665J4263
10661c225J0100k4329n8948J5092K834K748M2213M2184k4725n0440K0833O6440
10649D0777K6540k8840J3372j7839j0607k2160L7083M3506J4789o2391r2334K9476
$$ plain form
10637 -28628 65386 123533 76594 100182 98244 62299 47039 34937 -27501 -7705 -1618 -33271
10625 -33271 457 -5716 -5109 11681 42226 67082 94269 34948 -28813 -31653 -55223 -73401
10613 -73401 -61564 -85301 -64881 -31272 -11267 -63998 -57073 16361 98941 112712 65508 24225
10601 24225 2760 -31302 -52346 1523 46309 6378 -78615 -41079 -170 44609 -1239 -17164
10589 -17164 -106 25257 -24259 -55691 -18538 -49014 1034 10809 -12875 -33125 -21601 -33330
10577 -33330 -27177 -20286 -22895 -43916 -76074 -130462 -80087 -44823 -8886 -49891 -31504 -53704
10565 -53704 -42706 -36263 -43235 -97277 -107584 -82489 -54677 -17334 1257 -43749 -76806 -40404
10553 -40404 13726 34791 67537 26685 -16999 -25820 -26420 -45731 -42683 -6220 38448 58050
$$ packed form
10637b8628R4014N8147m6939K3588j938l5945j5260j2102o2438J9796O087l1653
10625c3271L3728o173O07J6790L0545K4856K7187n9321o3761k840k3570j8178
10613g3401J1837k3737K0420L3609K0005n2731O925P3434Q2580J3771m7204m1283
10601B4225k1465l4062k1044N3869M4786l9931q4993L7536M0909M4779m5848j5925
10589a7164J7058K5363m9516l1432L7153l0476N0048R775k3684k0250J1524j1729
10577c3330O153O891k609k1021l2158n4388N0375L5264L5937m1005J8387k2200
10565e3704J0998O443o972n4042j0307K5095K7812L7343J8591m5006l3057L6402
10553d0404N4130K1065L2746m0852m3684q821o00j9311L048L6463M4668J9602
$$ plain form
10541 58050 40774 11419 -41348 -48605 -43848 -48623 -46896 -39886 -65079 -49855 -44113 -98098 -102650
10528 -102650 -27597 61541 60046 109474 94119 54313 9945 35002 57026 6616 -51188 -67386
10516 -67386 -77410 -82498 -40278 -27804 -5136 571 14888 15395 7482 43994 4071 4851 29106
10503 29106 51348 109814 92943 37480 27932 19784 75732 71273 36870 7388 62787 129374
10491 129374 104896 125688 82457 37677 28255 73280 54122 23745 36442 68336 124824 111975
10479 111975 74939 95288 74435 42715 74042 12163 -65160 -105843 -74096 -39061 -40379 -20444
10467 -20444 17953 14429 57016 88088 107700 92998 66817 52506 57832 116038 107721 67032
10455 67032 71050 78743 81663 71642 35182 42613 9111 4023 16167 9212 18878 20732 -7690
$$ packed form
10541E8050j7276k9355n2767p257M757m775J727P010k5193J5224N742n3985m552
10528a02650P5053Q9138j495M9428j5355l9806m4368K5057K2024n0410n7804j6198
10516f7386j0024n088M2220J2474K2668N707J4317N07p913L6512l9923P80K4255
10503B9106K2242N8466j6871n5463r548q148N5948m459l4403k9482N5399O6587
10491A29374k4478K0792m3231m4780r422M5025j9158l0377J2697L1894N6488j2849
10479A11975l7036K0349k0853l1720L1327o1879p7323m0683L1747L5035j318J9935
10467b0444L8397l524M2587L1072J9612j4702k6181j4311N326N8206q317m0689
10455F7032M018P693K920j0021l6460P431l3502n088J2144o955R666J854k8422
$$ plain form
10442 -7690 14942 78796 96529 71633 1930 -15428 -32095 -57909 -25511 -68882 -41353 16747
10430 16747 58236 66295 59694 85454 53093 -17673 -29771 314 17553 20566 49290 81960
10418 81960 94488 60931 44068 10392 4695 88697 133426 39213 41698 25339 -31366 3850
10406 3850 56171 74166 46962 58199 56962 85868 125419 74809 64510 38519 484 -23105
10394 -23105 31726 50298 35498 117610 89895 -7617 -66238 -98783 -77897 -46733 -51337 -21070
10382 -21070 32738 25353 2896 -46307 -53199 -23234 -3715 24998 3622 -36309 -53082 -61710
10370 -61710 -73233 -72981 -17710 52421 27051 1034 -22797 -44600 -40471 -44769 -49896 -99028 -50426
10357 -50426 -20389 -7253 -33438 -88507 -91787 -33849 46100 27993 16565 52919 76717 88729
$$ packed form
10442g690K2632O3854J7733k4896o9703j7358j6667k5814L2398m3371K7529N8100
10430A6747M1489Q059o601K5760l2361p0766j2098L0085J7239L013K8724L2670
10418H1960J2528l3557j6863l3676n697Q4002M4729r4213K485j6359n6705L5216
10406C850N2321J7995k7204J1237j237K8906L9551n0610j0299k5991l8035k3589
10394b3105N4831J8572j4800Q2112k7715r7512n8621l2545K0886L1164m604L0267
10382b1070N3808p385k2457m9203o892K9965J9519K8713k1376l9931j6773q628
10370f1710j1523K52N5271P0131k5370k6017k3831k1803M129m298n127m9132M8602
10357e0426L0037J3136k6185n5069l280N7938P9949j8107j1428L6354K3798J2012
$$ plain form
10345 88729 69915 72190 87039 101357 68514 3654 -57251 -62542 -9198 9516 25898 50951
10333 50951 33428 -22192 -22962 -9992 4225 36866 84194 46944 28953 56820 102490 104672
10321 104672 81352 112007 108306 76829 68293 75136 51699 57098 31165 17348 26742 -15588
10309 -15588 44471 61000 35087 17350 23367 40606 66169 77425 86443 63481 38275 26605
10297 26605 38639 70674 108093 71964 15230 37836 35287 78951 103429 115665 120813 101448
10285 101448 106686 98077 93763 100590 117231 64553 86353 95527 73573 57639 45369 52000 91006
10272 91006 78828 60488 22929 -42535 -39463 -25617 -5026 55047 65901 106926 99998 68084
10260 68084 131484 149401 89377 76403 53143 37094 12748 43850 101538 103656 48249 26197
$$ packed form
10345H8729j8814K275J4849J4318l2843o4860o0905n291N3344J8714J6382K5053
10333E0951j7523n5620p70J2970J4217L2641M7328l7250j7991K7867M5670K182
10321A04672k3320L0655l701l1477q536O843k3437N399k5933j3817R394m2330
10309a5588O0059J6529k5913j7737O017J7239K5563J1256R018k2962k5206j1670
10297B6605J2034L2035L7419l6129n6734K2606k549M3664K4478J2236N148j9365
10285A01448N238q609m314O827J6641n2678K1800R174k1954j5934j2270O631L9006
10272I1006j2178j8340l7559o5464L072J3846K0591O0073J0854M1025o928l1914
10260F8084O3400J7917o0024j2974k3260j6049k4346L1102N7688K118n5407k2052
$$ plain form
10248 26197 28460 68539 101984 97381 106140 130399 149617 113632 22671 -14889 -255 50274
10236 50274 97175 97361 96273 123618 83906 -3278 -2733 14099 30913 16585 15684 7969 6615
10223 6615 34279 38804 110285 131625 124884 167490 116003 93521 97767 106665 119195 190383 181656
10210 181656 161809 129429 135622 114338 90393 88486 82517 61238 115285 165235 167645 67145
10198 67145 46266 45048 67775 119921 111976 92114 65596 28589 83232 150284 185030 126209
10186 126209 78253 80636 86958 77713 47145 22215 28160 -16643 6758 75057 151151 169817
10174 169817 138499 94365 43908 26967 40269 80841 70962 105013 99323 106961 133440 138296
10162 138296 126293 121812 31641 26783 76126 56483 43247 57817 73142 67490 111798 128710
$$ packed form
10248B6197K263M0079L3445m603Q759K4259J9218l5985r0961l7560J4634N0529
10236E0274M6901J86j088K7345l9712q7184N45J6832J6814j4328r01p715j354
10223F615K7664M525P1481K1340o741M2606n1487k2482M246Q898J2530P1188q727
10210A81656j9847l2380O193k1284k3945j907n969k1279N4047M9950K410j00500
10198F7145k0879j218K2727N2146p945j9862k6518l7007N4643O7052L4746n8821
10186A26209m7956K383O322r245l0568k4930N945m4803K3401O8299P6094J8666
10174A69817l1318m4134n0457j6941J3302M0572r879L4051n690P638K6479M856
10162A38296j2003m481r0171m858M9343j9643j3236J4570J5325n652M4308J6912
$$ plain form
10150 128710 94311 104047 99792 115260 74240 -1892 514 25392 24422 33890 7910 13870 5111
10137 5111 -211 45279 132946 167829 138637 89881 89325 86893 60726 57442 92860 76082 24091
10124 24091 11576 55642 86127 78832 120091 170237 165489 171136 178551 118200 108460 150755 120121
10111 120121 132834 172291 181163 157807 92195 59622 62303 96245 74677 46652 -28331 -93782
10099 -93782 -23053 78509 98956 103933 109329 109570 53767 30420 7161 -14213 19676 38064
10087 38064 51104 58211 58564 67589 48127 75533 129473 172473 121161 83161 90270 73050 50812
10074 50812 24597 36124 97061 110599 89966 1929 21625 78867 60264 61474 120464 175722
10062 175722 244313 258173 251938 216935 181074 216514 253205 263574 257774 310679 379007 410087
$$ packed form
10150A28710l4399R736m255J5468m1020p6132K406K4878r70R468k5980N960q759
10137E111n322M5490Q7667L4883k9192m8756n56k432k6167l284L5418j6778n1991
10124B4091j2515M4066L0485p295M1259N0146m748N647P415o0351r740M2295l0634
10111A20121J2713L9457Q872k3356o5612l2573K681L3942k1568k8025p4983o5451
10099i3782P0729J01562K0447M977N396K41n5803k3347k3259k1374L3889J8388
10087C8064J3040P107L53R025j9462K7406N3940M3000n1312l8000P109j7220k2238
10074E0812k6215J1527O0937J3538k0633q8037J9696N7242j8603J210N8990N5258
10062A75722O8591J3860o235l5003l5861L5440L6691J0369n800N2905O8328L1080
$$ plain form
10050 410087 522889 709475 967434 1315862 1728276 2460543 3674887 5542283 7819760
10041 7819760 8667906 6994265 4949356 3522956 2506511 1826811 1429890 1211821 990519
10032 990519 840445 742689 716012 663855 511121 379860 390311 376857 371185 414145 419012
10021 419012 378531 374991 338506 305394 289747 269965 251875 287099 266140 236882 236768 250072
10009 250072 190420 224770 257145 216874 186255 200774 206624 180702 215423 189387 174508 166746
9997 166746 191157 167174 175547 188449 132121 125085 106866 128898 185286 176720 154705 129521
9985 129521 131322 93318 38770 12224 8002 105015 170152 106758 87068 109579 67276 72414
9973 72414 72558 90624 98423 31427 101273 141397 133011 74420 61131 94491 113997 94650 37769
$$ packed form
10050D10087J12802J86586K57959L48428M12414P32267J214344J867396K277477
10041G819760Q48146j673641k044909j426400j016445o79700l96921k18069k21302
10032I90519j50074r7756k6677n2157j52734j31261J0451j3454n672M2960M867
10021D19012m0481l540l6485l3112j5647j9782j8090L5224k0959k9258j14J3304
10009B50072n9652L4350L2375m0271l0619J4519N850k5922L4721k6036j4879p762
9997A66746K4411k3983Q373J2902n6328p036j8219K2032N6388q566k2015k5184
9985A29521J801l8004n4548k6546m222R7013O5137o3394j9690K2511m2303N138
9973G2414J44J8066P799o6996O9846M0124q386n8591j3289L3360J9506j9347n6881
$$ plain form
9960 37769 22728 33329 32832 71200 74313 68450 65731 82697 38243 88959 92822 76830 47145
9947 47145 106557 162039 148313 53307 52397 85942 112674 78608 -13772 -11902 -17717 -713 40168
9934 40168 45281 34756 58706 71915 102947 96702 105462 160480 131882 128863 122038 142616 151295
9921 151295 56440 54681 68960 31869 21444 -299 42013 66509 48341 75048 133231 87449
9909 87449 19347 23688 24688 20994 32273 94958 112841 132155 97198 57558 54348 107441 108166
9896 108166 83762 58745 67623 105126 110629 83534 105709 114207 88188 78247 43576 10500
9884 10500 7495 45769 33146 699 11215 35775 80407 111065 114008 110427 177020 184185 103159
9871 103159 73315 53148 73036 44307 6392 20518 53334 28472 -24939 -29543 -22636 -40619
$$ packed form
9960C7769j5041J0601m97L8368L113n863k719J6966m4454N0716L863j5992k9685
9947D7145N9412N5482j3726r5006r10L3545K6732l4066r2380J870n815J7004M0881
9934D0168N113j0525K3950J3209L1032o245Q760N5018k8598l019o825K0578Q679
9921A51295r4855j759J4279l7091j0425k1743M2312K4496j8168K6707N8183m5782
9909H7449o8102M341J000l694J1279O2685J7883J9314l4957l9640l210N3093P25
9896A08166k4404k5017Q878L7503N503k7095K2175Q498k6019r941l4671l3076
9884A0500l005L8274j2623l2447J0516K4560M4632L0658K943l581O6593P165q1026
9871A03159k9844k0167J9888k8729l7915J4126L2816k4862n3411m604O907j7983
$$ plain form
9859 -40619 3962 26474 50612 125585 135597 138386 74022 88243 142680 130604 74506 49817
9847 49817 27474 53042 30497 12818 38890 13004 20719 42944 76224 126565 111986 86168
9835 86168 62791 19939 -7226 25332 84167 105461 96853 73817 59549 58356 33428 42836
9823 42836 72780 129061 113711 75411 128512 128159 51949 79335 168407 129352 78517 73726
9811 73726 62565 113631 75858 16438 3347 84944 103608 93517 23830 33013 19795 6151
9799 6151 13477 41786 110880 97256 90101 82929 55911 -7770 -41816 10635 12299 -12001 -34469
9786 -34469 -61352 -26096 2506 31224 26045 3554 -4976 -28937 -18838 44135 72419 63135
9774 63135 27069 -10142 -51085 -62737 -10907 86548 121135 97199 60895 64522 81207 100426
$$ packed form
9859d0619M4581K2512K4138P4973J0012K789o4364J4221N4437j2076n6098k4689
9847D9817k2343K5568k2545j7679K6072k5886P715K2225L3280N0341j4579k5818
9835H6168k3377m2852k7165L2558N8835K1294q608k3036j4268j193k4928R408
9823D2836K9944N6281j5350l8300N3101l53p6210K7386Q9072l9055n0835m791
9811G3726j1161N1066l7773n9420j3091Q1597J8664j0091o9687R183j3218j3644
9799F151P326K8309O9094j3624p155p172k7018o3681l4046N2451J664k4300k2468
9786c4469k6883L5256K8602K8718n179k2491q530k3961J0099O2973K8284r284
9774F3135l6066l7211m0943j1652N1830R7455L4587k3936l6304L627J6685J9219
$$ plain form
9762 100426 104789 68496 28524 33450 90631 81257 65105 61642 53257 64949 77525 110588 139128
9749 139128 127146 124935 143249 134665 108228 82595 49924 4989 -22445 44343 128570 135976
9737 135976 107257 115378 113729 138700 112852 64738 59177 76924 53734 81598 94563 74129
9725 74129 79401 46153 43701 99485 91279 66912 88129 119697 98022 122194 104260 105432 142413
9712 142413 123000 45982 7813 5433 51390 107562 149603 198442 231067 214516 185335 179641
9700 179641 164987 114388 114524 199731 237910 204917 181419 143871 151242 152639 136675 163185
9688 163185 193107 177526 196199 190741 191677 186649 180607 153213 142161 130260 98482 73131 62090
9675 62090 103561 128706 159109 203789 243119 240639 240867 238001 276806 317681 383062 382839 336903
$$ packed form
9762A00426M363l6293l9972M926N7181r374j6152l463q385J1692J2576L3063K8540
9749A39128j1982k211J8314q584k6437k5633l2671m4935k7434O6788Q4227P406
9737A35976k8719Q121j649K4971k5848m8114n561J7747k3190K7864J2965k0434
9725G4129N272l3248k452N5784q206k4367K1217L1568k1675K4172j7934J172L6981
9712A42413j9413p7018l8169k380M5957N6172M2041M8839L2625j6551k9181n694
9700A79641j4654n0599J36Q5207L8179l2993k3498l7548P371J397j5964K6510
9688A63185K9922j5581J8673n458R36n028o042k7394j1052j1901l1778k5351j1041
9675F2090M1471K5145L0403M4680L9330k480K28k866L8805M0875O5381k23m5936
$$ plain form
9662 336903 366937 350176 342265 324412 340392 400602 415580 411391 437218 418243 392520 396667
9650 396667 464407 509903 528702 503985 470398 438438 443360 461048 406063 387395 441911 432783
9638 432783 433251 456953 430582 440344 499474 503442 525136 561485 591991 604042 649347 634339
9626 634339 687785 691197 667291 659286 709508 757437 752355 800949 855815 852474 885509 932707
9614 932707 966739 1022096 990825 883975 822327 802974 773507 789890 819109 803185 755628
9603 755628 761441 808649 847419 801955 790538 805293 812840 860776 882898 866203 900633 976898
9591 976898 985320 962806 957200 963799 944313 883251 935006 969029 1031388 1065906 1080086 1120936
9579 1120936 1133111 1130692 1083077 1059242 1036112 1016018 1028892 1043839 1061414 989988 947112 925639
$$ packed form
9662C36903L0034j6761p911j7853J5980O0210J4978m189K5827j8975k5723M147
9650C96667O7740M5496J8799k4717l3587l1960M922J7688n4985j8668N4516r128
9638D32783M68K3702k6371R762N9130L968K1694L6349L0506J2051M5305j5008
9626F34339N3446L412k3906q005N0222M7929n082M8594N4866l341L3035M7198
9614I32707L4032N5357l1271j06850o1648j9353k9467J6383K9219j5924m7557
9603G55628N813M7208L8770m5464j1417J4755P547M7936K2122j6695L4430P6265
9591I76898Q422k2514n606O599j9486o1062N1755L4023O2359L4518J4180M0850
9579A120936J2175k419m7615k3835k3130k0094J2874J4947J7575p1426m2876k1473
$$ plain form
9567 925639 951780 959554 945756 979346 1024196 1004873 948596 929516 916660 952452 941151 975121
9555 975121 1008876 1023355 956806 864036 892766 972040 1004174 1018982 1055117 1050447 1007145 1022475
9543 1022475 1057043 1081761 1107389 1093389 1069372 1096117 1180898 1264008 1225186 1221591 1229771 1186747
9531 1186747 1159444 1173312 1232893 1196259 1169525 1157740 1156744 1187506 1253478 1346240 1351170 1334404
9519 1334404 1350843 1356230 1396466 1431573 1480637 1502827 1518717 1509225 1521225 1566779 1627270 1694916
9507 1694916 1765456 1794284 1845152 1846535 1881334 1940736 2049808 2092069 2132360 2203069 2344718
9496 2344718 2462172 2575497 2746748 2809953 2867533 2920627 2967667 3063171 3230115 3385394
9486 3385394 3517543 3639449 3793657 3950212 4125847 4333944 4520002 4754608 4921036 5112791
$$ packed form
9567I25639K6141P774j3798L3590M4850j9323n6277j9080j2856L5792j1301L3970
9555I75121L3755J4479o6549r2770K8730P9274L2134J4808L6135m670m3302J5330
9543A022475L4568K4718K5628j4000k4017K6745Q4781Q3110l8822l595Q180m3024
9531A186747k7303J3868N9581l6634k6734j1785r96L0762O5972R2762M930j6766
9519A334404J6439N387M0236L5107M9064K2190J5890r492J2000M5554O0491O7646
9507A694916P0540K8828N0868J383L4799N9402J09072M2261M0291P0709J41649
9496B344718J17454J13325J71251O3205N7580N3094M7040R5504J66944J55279
9486C385394J32149J21906J54208J56555J75635K08097J86058K34606J66428J91755
$$ plain form
9476 5112791 5336954 5647359 5869719 6104010 6370266 6689599 7010514 7309368 7653429 8022697
9466 8022697 8351582 8740644 9090160 9506151 9986102 10466779 10956715 11438681 11974025 12537107
9456 12537107 13108605 13703477 14349421 15004308 15684804 16331915 17076483 17844166 18691519
9447 18691519 19576764 20413994 21261763 22167102 23072504 24028780 24935281 25922369 26917776
9438 26917776 27894058 28800923 29632579 30494640 31327144 32032583 32695444 33342203 33847128
9429 33847128 34293798 34632251 34802489 34888769 34875196 34829973 34640879 34385592 33982618 33540470
9419 33540470 33047618 32465736 31836409 31220351 30598508 29946793 29258744 28515533 27785457
9410 27785457 27034147 26300486 25662523 25039578 24437676 23815368 23205247 22573264 21940048
$$ packed form
9476E112791K24163L10405K22360K34291K66256L19333L20915K98854L44061L69268
9466H022697L28885L89062L49516M15991M79951M80677M89936M81966N35344N63082
9456A2537107N71498N94872O45944O54887O80496O47111P44568P67683Q47353
9447A8691519Q85245Q37230Q47769R05339R05402R56276R06501R87088R95407
9438B6917776R76282R06865Q31656Q62061Q32504P05439O62861O46759N04925
9429C3847128M46670L38453J70238Q6280j3573m5223j89094k55287m02974m42148
9419C3540470m92852n81882o29327o16058o21843o51715o88049p43211p30076
9410B7785457p51310p33661o37963o22945o01902o22308o10121o31983o33216
$$ plain form
9401 21940048 21324560 20763232 20209400 19680503 19202909 18744055 18299494 17792320 17347238
9392 17347238 16881650 16395556 15987578 15633966 15277398 14883646 14499273 14150039 13772468
9383 13772468 13466956 13154930 12823957 12524016 12274524 12012672 11744513 11452245 11207804
9374 11207804 10989024 10759856 10575796 10338629 10119839 9984976 9849802 9644844 9449923
9365 9449923 9284516 9114924 8990470 8865685 8769407 8684471 8524397 8406153 8359057 8303821
9355 8303821 8224727 8114629 8008487 7916067 7810226 7690297 7631058 7581210 7578143 7557397 7511846
9344 7511846 7500499 7457882 7419631 7394448 7365885 7309114 7294508 7282132 7279510 7274145 7268085 7185301
9332 7185301 7126460 7104299 7119236 7127850 7058677 6969812 6947128 6940029 6886194 6844407 6839581 6865869
$$ packed form
9401B1940048o15488n61328n53832n28897m77594m58854m44561n07174m45082
9392A7347238m65588m86094m07978l53612l56568l93752l84373l49234l77571
9383A3772468l05512l12026l30973k99941k49492k61852k68159k92268k44441
9374A1207804k18780k29168j84060k37167k18790j34863j35174k04958j94921
9365I449923j65407j69592j24454j24785r6278q4936j60074j18244m7096n5236
9355H303821p9094j10098j06142r2420j05841j19929n9239m9848l067k0746m5551
9344G511846j1347m2617l8251k5183k8563n6771j4606j2376k622n365o060q2784
9332G185301n8841k2161J4937Q614o9173q8865k2684p099n3835m1787m826K6288
$$ plain form
9320 6865869 6851077 6762066 6712831 6674817 6624216 6622112 6516726 6483782 6473982 6379425 6265680
9309 6265680 6215390 6120858 6049894 5954420 5943430 5899207 5862751 5836548 5857765 5932054 5969440
9298 5969440 6009321 6012295 5996268 5938408 5879220 5808947 5785131 5716822 5717936 5790355 5928972 6077008
9286 6077008 6159045 6296280 6392661 6428730 6493326 6600836 6686396 6784659 6829411 6839248 6832347
9275 6832347 6832361 6835094 6863655 6896716 6971104 7070612 7192074 7391807 7600243 7788203 8071635
9264 8071635 8493377 8924652 9450024 10019168 10538301 11023994 11385922 11678595 12033858 12432401
9254 12432401 13019367 13764746 14543871 15412453 16280355 17161077 18155972 19254100 20422210
9245 20422210 21693088 22884814 23949003 24804109 25422419 26024747 26798341 27828804 29006658
$$ packed form
9320F865869j4792q9011m9235l8014n0601k104j05386l2944r800r4557j13745
9309F265680n0290r4532p0964r5474j0990m4223l6456k6203K1217P4289L7386
9298E969440L9881K974j6027n7860n9188p0273k3816o8309J114P2419J38617J48036
9286F077008Q2037J37235R6381L6069O4596J07510Q5560R8263M4752R837o901
9275F832347J4K733K8561L3061P4388R9508J21462J99733K08436J87960K83432
9264H071635M21742M31275N25372N69144N19133M85693L61928K92673L55263L98543
9254A2432401N86966P45379P79125Q68582Q67902Q80722R94895J098128J168110
9245B0422210J270878J191726J064189Q55106O18310O02328P73594J030463J177854
$$ plain form
9236 29006658 30363132 32067384 34148888 36555911 39510878 43125534 47558504 52946683
9228 52946683 59525437 67526076 76967323 87725474 99251945 110978728 122465604 133071267
9220 133071267 141740793 147856802 152048610 155871284 160715597 167151184 174947103 183284983
9212 183284983 191451696 198782778 204906675 209935528 214149192 217991969 222011980 227000542
9204 227000542 233864014 242838267 253182625 263586635 272598022 279054718 281799305 279468282
9196 279468282 272098965 261337475 249238170 237430525 226722596 217297773 209133400
9189 209133400 201642559 193969627 185279258 175778253 166472564 158013682 150596487 144441225
9181 144441225 139728026 136311215 133905893 132133248 130415684 128206245 125221205 121610017
$$ packed form
9236B9006658J356474J704252K081504K407023K954967L614656M432970N388179
9228E2946683O578754Q000639R441247J0758151J1526471J1726783J1486876J0605663
9220A33071267Q669526O116009M191808L822674M844313O435587P795919Q337880
9212A83284983Q166713P331082O123897N028853M213664L842777M020011M988562
9204B27000542O863472Q974253J0344358J0404010R011387O456696K744587k331023
9196B79468282p369317j0761490j2099305j1807645j0707929r424823q164373
9189B09133400p490841p672932q690369r501005r305689q458882p417195o155262
9181A44441225m713199l416811k405322j772645j717564k209439k985040l611188
$$ plain form
9173 121610017 117542955 112919767 107777541 102305501 96726611 91254653 86123600 81666992
9165 81666992 78083407 75307049 73297054 72013222 71390751 71132819 70908210 70419598 69369684
9156 69369684 67638678 65342468 62745952 60117974 57571230 55103528 52768921 50440076
9148 50440076 48054451 45609274 43119836 40617217 38178601 35975930 33946367 32162416
9140 32162416 30616547 29248281 28080691 27117048 26271253 25497107 24799429 24174758 23628996
9131 23628996 23120070 22579166 21921705 21186414 20349047 19437347 18617715 17868392 17109474
9122 17109474 16446397 15813353 15223468 14753763 14331667 13917704 13461889 12917953 12414363
9113 12414363 11890943 11308387 10825721 10369161 9983450 9712380 9401579 9039525 8626213
$$ packed form
9173A21610017m067062m623188n142226n472040n578890n471958n131053m456608
9165H1666992l583585k776358k009995j283832o22471k57932k24609m88612j049914
9156F9369684j731006k296210k596516k627978k546744k467702k334607k328845
9148E0440076k385625k445177k489438k502619k438616k202671k029563j783951
9140C2162416j545869j368266j167590r63643q45795p74146o97678o24671n45762
9131B3628996n08926n40904o57461p35291q37367r11700q19632p49323p58918
9122A7109474o63077o33044n89885m69705m22096m13963m55815n43936n03590
9113A2414363n23420n82556m82666m56560l85711k71070l10801l62054m13312
$$ plain form
9104 8626213 8212349 7854106 7571657 7335372 7057004 6782024 6552945 6355512 6127195 5885815
9094 5885815 5681593 5482568 5305068 5191729 5087500 4962456 4858905 4702697 4526355 4374419
9084 4374419 4265466 4188211 4101379 4055292 4010451 4021934 3923666 3829863 3695919 3538041 3347981
9073 3347981 3224779 3106634 3045444 2947806 2813957 2705341 2608936 2533969 2436316 2342824 2253260
9062 2253260 2178629 2068185 1987897 1970735 1949494 1860978 1797227 1804061 1776217 1741720 1653175
9051 1653175 1571278 1585258 1534810 1511293 1452738 1358833 1393258 1460482 1423175 1416912 1375007 1310477
9039 1310477 1313344 1294872 1290149 1295853 1288064 1242703 1252422 1244325 1223486 1213713 1218017 1196250 1211586
9026 1211586 1179773 1169518 1178241 1162155 1151085 1219762 1251272 1233164 1208977 1201258 1159635 1136158
$$ packed form
9104H626213m13864l58243k82449k36285k78368k74980k29079j97433k28317k41380
9094E885815k04222j99025j77500j13339j04229j25044j03551j56208j76342j51936
9084D374419j08953p7255q6832m6087m4841J1483r8268r3803j33944j57878j90060
9073C347981j23202j18145o1190r7638j33849j08616r6405p4967r7653r3492q9564
9062B253260p4631j10444q0288j7162k1241q8516o3751O834k7844l4497q8545
9051A653175q1897J3980n0448k3517n8555r3905L4425O7224l7307o263m1905o4530
9039A310477K867j8472m723N704p789m5361R719q097k0839r773M304k1767J5336
9026A211586l1813j0255Q723j6086j1070O8677L1510j8108k4187p719m1623k3477
$$ plain form
9014 1136158 1125919 1063233 1018201 1062816 1117394 1062459 1013307 982384 1050581 1097322 1076987
9003 1076987 1054702 1079055 1094080 1106577 1034696 1024026 1035574 1027824 1017328 1005996 991983 989802
8991 989802 975493 951219 946160 905266 902388 880382 841875 816418 856976 862904 865404 897218
8979 897218 921215 845671 751508 760832 803710 836348 837774 818866 801810 749564 702456 726423
8967 726423 742767 774097 741512 673156 632968 627990 639188 621372 586757 641498 618661 606485
8955 606485 582911 598849 627756 587493 559943 505831 510138 516008 538406 545871 549260 552186 588719
8942 588719 568461 554033 494609 422651 372595 395958 435711 433496 424272 406307 362724 398953
8930 398953 407537 353861 270336 287002 374666 423705 417778 363716 295134 255524 286567 332925
$$ packed form
9014A136158j0239o2686m5032M4615N4578n4935m9152l0923O8197M6741k0335
9003A076987k2285K4353J5025J2497p1881j0670J1548p750j0496j1332j4013k181
8991I89802j4309k4274n059m0894k878k2006l8507k5457M0558N928K500L1814
8979H97218K3997p5544r4163R324M2878L2638J426j8908j7056n2246m7108K3967
8967G26423J6344L1330l2585o8356m0188m978J1198j7816l4615N4741k2837j2176
8955F06485k3574J5938K8907m0263k7550n4112M307N870K2398P465L389K926L6533
8942E88719k0258j4428n9424p1958n0056K3363L9753k215r224j7965m3583L6229
8930C98953Q584n3676q3525J6666Q7664M9039n927n4062o8582l9610L1043M6358
$$ plain form
8918 332925 429564 481827 440364 406204 410946 407927 422858 404600 373285 347178 396309 386975
8906 386975 342995 371077 364966 254001 212092 271685 358598 346176 303068 277011 287054 247368
8894 247368 274960 324059 303226 282217 253823 274915 291086 288223 277321 273523 252758 341017
8882 341017 372578 342121 383372 391654 433416 468587 459774 450106 409987 421909 428730 452726
8870 452726 447697 434419 435404 390889 388027 397935 393788 458590 531214 641061 706864 663005 664641
8857 664641 643272 539507 537433 605407 564612 531923 571090 584583 519039 421311 368589 363413
8845 363413 418001 475445 531534 598196 630657 622868 606778 621363 642998 670292 711408 686710
8833 686710 684654 677318 648246 672313 669307 683618 706312 718207 719284 718987 736781 748970 783137
$$ packed form
8918C32925R6639N2263m1463l4160M742l019J4931j8258l1315k6107M9131r334
8906C86975m3980K8082o111j10965m1909N9593Q6913j2422m3108k6057J0043l9686
8894B47368K7592M9099k0833k1009k8394K1092J6171k863j0902l798k0765Q8259
8882C41017L1561l0457M1251Q282M1762L5171q813r668m0119J1922O821K3996
8870D52726n029j3278R85m4515k862R908m147O4802P2624J09847O5803m3859J636
8857F64641k1369j03765k074O7974m0795l2689L9167J3493o5544r7728n2722n176
8845C63413N4588N7444N6089O6662L2461p789j6090J4585K1635K7294M1116k4698
8833F86710k056p336k9072K4067l006J4311K2694J1895J077k97J7794J2189L4167
$$ plain form
8820 783137 850093 875448 867822 838562 754751 671608 656346 658021 680968 705604 705586 751511 780949
8807 780949 821394 826877 820669 882696 859449 790032 795528 810306 784821 765485 737227 731832
8795 731832 736243 740427 759416 777315 748403 712535 728237 753322 747392 729314 767952 797809
8783 797809 806886 860283 827181 794735 779455 792220 809177 844555 785367 686373 640412 666297
8771 666297 729307 753010 726441 759770 784877 737495 715061 723544 722016 736307 729144 700127
8759 700127 705433 681908 643546 625737 663677 663850 634031 636995 638237 609736 566784 614463 664717
8746 664717 585501 514047 485986 489279 470276 475818 525342 514483 470183 447707 420910 456235
8734 456235 520310 493465 473105 412042 473720 540350 555167 468691 413939 346631 372428 396632
$$ packed form
8820G83137O6956K5355p626k9260q3811q3143j5262J675K2947K4636j8M5925K9438
8807G80949M0445N483o208O2027k3247o9417N496J4778k5485j9336k8258n395
8795G31832M411M184J8989J7899k8912l5868J5702K5085n930j8078L8638K9857
8783G97809R077N3397l3102l2446j5280J2765J6957L5378n9188r8994m5961K5885
8771F66297O3010K3703k6569L3329K5107m7382k2434Q483j528J4291p163k9017
8759G00127N306k3525l8362j7809L7940J73k9819K964J242k8501m2952M7679N0254
8746F64717p9216p1454k8061L293j9003N542M9524j0859m4300k2476k6797L5325
8734D56235O4075k6845k0360o1063O1678O6630J4817q6476n4752o7308K5797K4204
$$ plain form
8722 396632 394277 445083 463631 408209 448079 428603 377641 394110 407054 412088 398129 341729
8710 341729 328273 344846 319112 298417 289120 237142 211965 228227 225370 203262 180704 161262
8698 161262 153077 152625 177189 184119 191853 205968 212371 242327 260647 239788 227425 243231 256288
8685 256288 237674 171671 83231 99767 165590 164369 163483 206155 201162 118521 152458 167904
8673 167904 133109 155641 172308 151637 141786 143806 165834 191635 182584 214643 175958 157681
8661 157681 157572 175128 206150 187998 153136 178602 181659 155197 191086 240806 274238 297765
8649 297765 299523 273261 257441 219077 184496 172046 137631 160069 141478 103627 129778 131948
8637 131948 135027 127933 168264 162287 191874 151274 149105 165861 176107 181147 207258 233238 279894
$$ packed form
8722C96632k355N0806J8548n5422L9870j9476n0962J6469J2944N034j3959n6400
8710C41729j3456J6573k5734k0695r297n1978k5177J6262k857k2108k2558j9442
8698A61262q185m52K4564O930P734J4115O403K9956J8320k0859j2363J5806J3057
8685B56288j8614o6003q8440J6536O5823j221q86M2672m993q2641L3937J5446
8673A67904l4795K2532J6667k0671r851K020K2028K5801r051L2059l8685j8277
8661A57681j09J7556L1022j8152l4862K5466L057k6462L5889M9720L3432K3527
8649B97765J758k6262j5820l8364l4581j2450l4415K2438j8591l7851K6151K170
8637A31948L079p094M0331n977K9587m0600k169J6756J0246N040K6111K5980M6656
$$ plain form
8624 279894 319387 317498 297084 356631 415291 402872 340467 300720 377884 427910 376490 325305
8612 325305 278533 326955 414453 417439 420610 373748 360891 349977 359469 364875 376107 348304
8600 348304 346347 411734 435130 356676 312720 358908 404952 383678 391766 348857 291691 264113
8588 264113 273288 259394 210685 195528 197123 213966 218621 193958 222830 206924 197671 212164
8576 212164 175112 158028 134039 120664 133124 184411 202663 200909 183441 186510 202220 155933
8564 155933 132686 158678 129193 138325 132686 157710 168987 175103 188535 160301 133520 98911
8552 98911 105900 149483 157044 122448 96683 76124 70508 47854 59628 61938 114196 132368 110276
8539 110276 104486 98717 129177 167844 180334 107503 79592 59953 107336 102671 99428 97714 53234
$$ packed form
8624B79894L9493j889k0414N9547N8660j2419o2405l9747P7164N0026n1420n1185
8612C25305m6772M8422Q7498K986L171m6862j2857j0914R492N406J1232k7803
8600C48304j957O5387K3396p8454m3956M6188M6044k1274Q088m2909n7166k7578
8588B64113R175j3894m8709j5157J595J6843M655k4663K8872j5906r253J4493
8576B12164l7052j7084k3989j3375J2460N1287J8252j754j7468L069J5710m6287
8564A55933k3247K5992k9485R132n639K5024J1277O116J3432k8234k6781l4609
8552I8911O989M3583P561l4596k5765k0559n616k2654J1774K310N2258J8172k2092
8539A10276n790n769L0460L8667J2490p2831k7911j9639M7383m665l243j714m4480
$$ plain form
8526 53234 31118 54173 107026 92763 69822 67120 95829 104759 147659 129235 109012 93851
8514 93851 82601 92293 38871 23571 16544 23813 31470 24797 69416 116159 114929 52441 3073
8501 3073 22798 6640 47388 103248 156433 145007 92050 62078 69608 42295 55459 85421
8489 85421 74574 92962 120343 138803 145479 165644 181625 150805 33084 8583 69663 110139
8477 110139 110009 112154 128892 98421 72961 41762 34270 -12233 -8384 -6160 -23561 -29548 18269
8464 18269 16508 -21664 17669 56727 38969 17866 -7068 -4435 10891 -31790 -25071 84238
8452 84238 137138 101547 32476 -4918 52282 65616 43371 86798 123071 114007 105530 61557
8440 61557 49361 63512 57583 53489 76924 62051 93282 104517 20052 -32767 -14829 -6227
$$ packed form
8526E3234k2116K3055N2853j4263k2941k702K8709Q930M2900j8424k0223j5161
8514I3851j1250R692n3422j5300p027P269P657o673M4619M6743j230o2488m9368
8501C073J9725j6158M0748N5860N3185j1426n2957k9972P530k7313J3164K9962
8489H5421j0847J8388K7381J8460O676K0165J5981l0820j17721k4501O1080M0476
8477A10139j30K145J6738l0471k5460l1199p492m6503L849K224j7401n987M7817
8464A8269j761l8172L9333L9058j7758k1103k4934K633J5326m2681O719J09309
8452H4238N2900l5591o9071l7394N7200J3334k2245M3427L6273r064q477m3973
8440F1557j2196J4151n929m094K3435j4873L1231J1235q4465n2819J7938Q602
$$ plain form
8428 -6227 20867 -6139 -13644 21581 20472 28159 26450 38850 11697 -44687 -19750 -431 31873
8415 31873 39276 87180 138945 129116 116631 67921 7708 -1567 21828 79875 88803 33744 -26338
8402 -26338 -3536 6432 -2164 -40209 -50362 -52198 -27800 -23134 -21075 42625 54301 6978 369
8389 369 27277 43556 31930 56131 38036 -12543 -26704 -77568 -83405 -72381 -8831 23619
8377 23619 42428 83978 88185 63368 28860 55198 80553 69769 5314 -33920 -17545 -38999
8365 -38999 -21440 36570 83983 108837 74183 44464 45456 110161 133543 144296 90402 54272
8353 54272 44461 50446 34680 59008 82206 18767 44425 49553 7344 229 -21659 -16433 20409
8340 20409 17565 -3561 -21243 -35552 -33547 25020 70743 34224 30549 10201 -40264 -62700
$$ packed form
8428f227K7094k7006p505L5225j109P687j709J2400k7153n6384K4937J9319L2304
8415C1873P403M7904N1765r829j2485m8710o0213r275K3395N8047Q928n5059o0082
8402b6338K2802R968q596l8045j0153j836K4398M666K059O3700J1676m7323o609
8389C69K6908J6279j1626K4201j8095n0579j4161n0864n837J1024O3550L2450
8377B3619J8809M1550M207k4817l4508K6338K5355j0784o4455l9234J6375k1454
8365c8999J7559N8010M7413K4854l4654k9719R92O4705K3382J0753n3894l6130
8353E4272r811N985j5766K4328K3198o3439K5658N128m2209p115k1888N226L6842
8340B0409k844k1126j7682j4309K005N8567M5723l6519l675k0348n0465k2436
$$ plain form
8328 -62700 -41204 2335 -41945 -67188 -36507 -35723 -42893 -33508 -25202 -31303 -19496 31671 79803
8315 79803 71273 32438 34438 -22007 -58924 -49873 -53424 3581 41785 27362 38647 121416 139010
8302 139010 84066 73927 67012 70015 -3170 -21164 69337 48981 38407 64544 60902 21461
8290 21461 43781 69480 46874 52709 39649 30035 11373 12279 17801 74003 89018 80716 99750
8277 99750 118885 95340 104872 111520 87232 20362 3218 70241 99331 85456 54830 46161
8265 46161 50236 55573 36759 23552 32588 71614 104345 95344 87386 91171 107113 82408 83944
8252 83944 157217 137219 75758 4783 -17272 -15524 16214 47950 45832 21172 -1578 52333
8240 52333 43473 24996 -18374 -43382 43380 93542 97456 84201 21052 21486 8020 45848 77570
$$ packed form
8328f2700K1496M3539m4280k5243L0681P84p170R385Q306o101J1807N1167M8132
8315G9803q530l8835K000n6445l6917R051l551N7005L8204j4423J1285Q2769J7594
8302A39010n4944j0139o915L003p3185j7994R0501k0356j0574K6137l642l9441
8290B1461K2320K5699k2606N835j3060r614j8662R06N522N6202J5015q302J9034
8277I9750J9135k3545R532O648k4288o6870j7144O7023K9090j3875l0626q669
8265D6161M075N337j8814j3207R036L9026L2731r001p958L785J5942k4705J536
8252H3944P3273j9998o1461p0975k2055J748L1738L1736k118k4660k2750N3911
8240E2333q860j8477m3370k5008Q6762N0162L914j3255o3149M34j3466L7828L1722
$$ plain form
8227 77570 63800 88561 104346 93207 92938 79853 46250 8801 -11848 -42302 5040 29249
8215 29249 70783 67445 10221 32550 24585 -12529 922 29378 27698 43599 32716 26222 20152
8202 20152 25139 23371 18445 56984 47445 28708 23487 30037 54277 98116 38777 1565 -13024
8189 -13024 37637 17620 -1736 12323 42360 24780 66703 59443 42966 33991 9617 -69668
8177 -69668 -66486 -30268 5219 15711 -16531 -30346 -38535 8924 15964 -2477 -34414 -44685
8165 -44685 -14571 15054 16223 35969 77661 87372 103908 94603 64756 47076 36412 45723 85864
8152 85864 105393 112984 137620 114355 90444 87113 22593 23029 20093 32574 8294 -62464 -78874
8139 -78874 -124104 -167306 -112032 -64627 -25540 23631 80753 90577 131493 117762 52956 51278
$$ packed form
8227G7570j3770K4761J5785j1139k69j3085l3603l7449k0649l0454M7342K4209
8215B9249M1534l338n7224K2329p965l7114J3451K8456j680J5901j0883o494o070
8202B0152M987j768m926L8539r539j8737n221O550K4240M3839n9339l7212j4589
8189a3024N0661k0017j9356J4059L0037j7580M1923p260j6477q975k4374p9285
8177f9668L182L6218L5487J0492l2242j3815q189M7459P040j8441l1937j0271
8165d4685L0114K9625J169J9746M1692R711J6536r305k9847j7680j0664R311M0141
8152H5864J9529P591K4636k3265k3911l331o4520M36k936J2481k4280p0758j6410
8139g8874m5230m3202N5274M7405L9087M9171N7122R824M0916j3731o4806j678
$$ plain form
8127 51278 96900 86723 24914 -11524 -3345 40590 50250 -15283 -61729 -74458 -21669 45436
8115 45436 46697 -11314 -15865 42215 75929 70923 77016 21755 16536 18953 28005 1662 -47498
8102 -47498 -47728 -41287 -32511 -9033 -25262 -22423 -24293 -12365 17216 -32258 -52627 -58501 -57306
8089 -57306 -67616 -59250 -37352 -45578 -72085 -40217 -4964 39250 16189 -6680 34743 31248
8077 31248 -23637 -40379 -53075 -83580 -75573 -54419 -52818 -21042 70935 149523 50282 62486
8065 62486 97251 36998 64436 96446 111626 119822 90897 86069 54842 23071 27741 44242
8053 44242 16144 14669 23052 92153 53913 -11958 -25544 50833 87431 58680 106512 166323
8041 166323 154539 143569 102528 71788 98638 116233 125745 182030 202889 257870 222491 168160
$$ packed form
8127E1278M5622j0177o1809l6438Q179M3935R660o5533m6446j2729N2789O7105
8115D5436J261n8011m551N8080L3714n006O093n5261n219K417R052k6343m9160
8102d7498k30O441Q776K3478j6229K839j870J1928K9581m9474k0369n874J195
8089e7306j0310Q366K1898q226k6507L1868L5253M4214k3061k2869M1423l495
8077C1248n4885j6742j2696l0505Q007K1154J601L1776R1977P8588r9241J2204
8065F2486L4765o0253K7438L2010J5180Q196k8925m828l1227l1771M670J6501
8053D4242k8098j475Q383O9101l8240o5871j3586P6377L6598k8751M7832N9811
8041A66323j1784j0970m1041l0740K6850J7595R512N6285K0859N4981l5379n4331
$$ plain form
8029 168160 136311 112607 138124 164943 184704 101639 15400 -20284 15820 43986 24438 83258
8017 83258 62612 35584 46014 90810 125595 157889 160644 163707 151230 138922 181581 240252
8005 240252 252420 345709 422100 485191 548537 587226 550053 458703 356465 323155 315801 328845
7993 328845 319519 313127 351943 386592 418252 436394 433341 337427 265586 262974 240917 203142
7981 203142 227515 246696 206886 186296 133877 109579 146629 163734 147119 147951 185339 237633
7969 237633 249329 230508 227423 193208 162187 192678 200625 179148 186556 251700 341734 333321
7957 333321 396244 446783 420221 418229 395081 366098 328053 296200 337137 403698 397774 339209
7945 339209 329499 254450 184656 185075 170431 149303 134187 188548 130430 48072 61855 83138
$$ packed form
8029A68160l1849k3704K5517K6819J9761q3065q6239l5684L6104K8166j9548N8820
8017H3258k0646k7028J0430M4796L4785L2294K755L063j2477j2308M2659N8671
8005B40252J2168R3289P6391O3091O3346L8689l7173r1350j02238l3310p354J3044
7993C28845r326o392L8816L4649L1660J8142l053r5914p1841k612k2057l7775
7981B03142K4373J9181l9810k0590n2419k4298L7050J7105j6615Q32L7388N2294
7969B37633J1696j8821l085l4215l1021L0491P947k1477P408O5144R0034q413
7957C33321O2923N0539k6562j992k3148k8983l8045l1853M0937O6561n924n8565
7945C39209r710p5049o9794M19j4644k1128j5116N4361n8118q2358J3783K1283
$$ plain form
7933 83138 84752 100060 103556 78655 69511 84004 73252 2174 -1495 72092 140095 194007 160147
7920 160147 136354 81415 88369 175103 207174 205894 237967 269064 189076 129641 85484 80939
7908 80939 47457 18027 41410 75878 164828 211834 200900 148763 157374 140742 117130 69223
7896 69223 48068 15036 16909 24213 38424 121696 101774 61604 55600 80120 75858 13787 11029
7883 11029 11932 -17944 -17454 2935 31985 42812 10468 -24665 -41546 -40391 16169 66397 78320
7870 78320 1601 -67457 -75373 -48616 -56664 -54315 -3723 44909 24667 16022 13502 -6277 -63300
7857 -63300 -85671 -96341 -101927 -65840 -16142 21618 12718 1993 -14057 -34645 -32326 -7240
7845 -7240 -3342 -770 -40360 -66836 -63211 -52676 11423 44923 -18819 -63807 -49079 -20794 -65329
$$ packed form
7933H3138J614J5308L496k4901r144J4493j0752p1078l669P3587O8003N3912l3860
7920A60147k3793n4939O954Q6734L2071j280L2073L1097p9988n9435m4157m545
7908H0939l3482k9430K3383L4468Q8950M7006j0934n2137Q611j6632k3612m7907
7896F9223k1155l3032J873P304J4211Q3272j9922m0170o004K4520m262o2071k758
7883A1029R03k9876M90K0389K9050J0827l2344l5133j6881J155N6560N0228J1923
7870G8320p6719o9058p916K6757q048K349N0592M8632k0242q645k520j9779n7023
7857f3300k2371j0670n586L6087M9698L7760q900j0725j6050k0588K319K5086
7845g240L898K572l9590k6476L625J0535O4099L3500o3742m4988J4728K8285m4535
$$ plain form
7832 -65329 -130635 -92062 -45794 -29901 -56474 -53283 -77727 -70484 -41103 3324 -3588 -27534
7820 -27534 -2494 -3027 -28578 13244 1550 16620 39596 17795 26757 -5560 -58518 -62496 -55406
7807 -55406 -80014 -23821 -56272 -73043 -50281 -66466 -100446 -70702 19652 29476 -6788 11526
7795 11526 2761 32583 48776 47610 84118 96108 54005 13596 -25695 -41164 10957 35347
7783 35347 5228 -9297 -12240 43012 38767 43963 9962 -16152 9561 11228 9751 14134 39681
7770 39681 44696 40377 15351 38018 10947 7854 11551 15006 21466 47400 60380 51940 45880
7757 45880 52263 61927 -27355 -22560 19318 -37799 -48632 -32839 9949 27534 30360 20779 -23298
7744 -23298 -47240 -34017 -36519 -52930 -13019 13832 15124 26290 33180 44933 54115 20566 -28011
$$ packed form
7832f5329o5306L8573M6268J5893k6573L191k4444P243K9381M4427o912k3946
7820b7534K5040n33k5551M1822j1694J5070K2976k1801Q962l2317n2958l978P090
7807e5406k4608N6193l2451j6771K2762j6185l3980K9744R0354R824l6264J8314
7795A1526q765K9822J6193j166L6508J1990m2103m0409l9291j5469N2121K4390
7783C5347l0119j4525k943N5252m245N196l4001k6114K5713J667j477M383K5547
7770C9681N015m319k5026K2667k7071l093L697L455O460K5934J2980q440o060
7757D5880O383R664q9282M795M1878n7117j0833J5793M2788J7585K826r581m4077
7744b3298k3942J3223k502j6411L9911K6851J292J1166O890J1753R182l3549m8577
$$ plain form
7731 -28011 -8489 -3224 -50037 -66656 -70379 -65348 -36972 -56729 -83691 -79594 -81164 -63146 -24897
7718 -24897 -38513 -40611 -27363 -56491 -77336 -52318 -5307 -1990 60705 80388 64965 23934
7706 23934 13275 -17082 -35762 -25767 -39841 -46509 -4130 8653 13044 24891 30153 -20931 -51655
7693 -51655 -40116 -9545 364 -18807 -10044 -932 -7353 -14885 -10460 14785 48711 17783 -7353
7680 -7353 30451 17322 50354 73370 36198 10930 -17971 -50351 -104509 -110652 -40551 -29275
7668 -29275 -30052 -55110 -26206 -52013 -68824 -24882 37413 45877 63000 32900 39441 -18381 -3797
7655 -3797 -20402 -37248 -55361 -39295 -53026 -21110 11004 29919 36986 -36140 -23029 6529
7643 6529 -51943 -61786 -80679 -45936 -7778 36863 37800 -7810 -51389 -8700 22816 66653 44270
$$ packed form
7731b8011J9522N265m6813j6619l723N031K8376j9757k6962M097j570J8018L8249
7718b4897j3616k098J3248k9128k0845K5018M7011L317O2695J9683j5423m1031
7706B3934j0659l0357j8680R995j4074o668M2379J2783M391J1847N262n1084l0724
7693e1655J1539L0571R909j9171Q763R112o421p532M425K5245L3926l0928k5136
7680g353L7804j3129L3032K3016l7172k5268k8901l2380n4158o143P0101J1276
7668b9275p77k5058K8904k5807j6811M3942O2295Q464J7123l0100O541n7822J4584
7655c797j6605j6846j8113J6066j3731L1916L2114J8915P067p3126J3111K9558
7643F529n8472r843j8893L4743L8158M4641R37m5610m3579M2689L1516M3837k2383
$$ plain form
7630 44270 27996 21137 -30929 -42212 -40360 -14074 -23248 38061 22916 28175 -2557 -13598 37826
7617 37826 89894 93126 87997 84890 56906 32005 57443 9548 -48718 -32582 -32888 -52178 -48501
7604 -48501 43682 70257 85611 124030 98641 80239 83717 79670 64142 40971 -14148 -74873
7592 -74873 -85822 -42375 35346 17773 27434 44241 39978 14832 18233 -12378 14512 21642 -15228
7579 -15228 -5307 8399 -5670 -23383 -35944 -2543 -40801 -62382 -91941 -89871 -44070 -8124
7567 -8124 -13878 1253 3645 -39037 -85437 -64746 -59634 -26138 20868 110759 82273 10448 31712
7554 31712 23576 -31309 -52286 -7400 23098 9671 -32815 -18891 -57906 -51047 -43646 9640
7542 9640 23045 -6243 -5566 -38687 -10352 -74189 -85249 -132838 -182560 -125825 -65348 -60618 -28530
$$ packed form
7630D4270j6274o859n2066j1283J852K6286r174O1309j5145N259l0732j1041N1424
7617C7826N2068L232n129l107k7984k4901K5438m7895n8266J6136l06j9290L677
7604d8501R2183K6575J5354L8419k5389j8402L478m047j5528k3171n5119o0725
7592g4873j0949M3447P7721j7573R661J6807m263k5146L401l0611K6890P130l6870
7579a5228R921J3706j4069j7713j2561L3401l8258k1581k9559K070M5801L5946
7567h124n754J5131K392m2682m6400K0691N112L3496M7006Q9891k8486p1825K1264
7554C1712q136n4885k0977M4886L0498j3427m2486J3924l9015O859P401N3286
7542I640J3405k9288O77l3121K8335o3837j1060m7589m9722N6735O0477M730L2088
$$ plain form
7529 -28530 28239 51624 75323 94447 67227 -14794 -47990 -63007 -68215 -36927 15892 26171
7517 26171 34021 -14290 -14548 26435 -10770 -47714 -36451 -47923 -92920 -85772 -75731 -83579 -72649
7504 -72649 -50175 9359 1258 12514 65454 128133 105271 52002 47534 66488 61923 89111
7492 89111 55326 54991 31993 -22985 -45950 -58404 -52242 -51788 -26111 6824 11356 -4826 -22239
7479 -22239 -61422 -20378 -22485 -95673 -87447 -31726 -46471 -15197 15207 9594 4768 23658 -7675
7466 -7675 -30007 -64908 -110750 -118105 -58112 16014 25670 4407 37310 59137 -6598 11666
7454 11666 35619 49309 25669 -2520 10222 -15084 -4484 -41498 -30607 4348 36565 42846
7442 42846 63024 26842 -566 -24619 -31672 1874 -17697 7887 -16883 -27879 19504 59618
$$ packed form
7529b8530N6769K3385K3699J9124k7220q2021l3196j5017n208L1288N2819J0279
7517B6171P850m8311k58M0983l7205l6944J1263j1472m4997P148J0041p848J0930
7504g2649K2474N9534q101J1256N2940O2679k2862n3269m468J8954m565K7188
7492H9111l3785l35k2998n4978k2965j2454O162M54K5677L2935M532j6182j7413
7479b2239l9183M1044k107p3188Q226N5721j4745L1274L0404n613m826J8890l1333
7466g675k2332l4901m5842p355N9993P4126R656k1263L2903K1827o5735J8264
7454A1666K3953J3690k3640k8189J2742k5306J0600l7014J0891L4955L2217O281
7442D2846K0178l6182k7408k4053p053L3546j9571K5584k4770j0996M7383M0114
$$ plain form
7430 59618 31556 -3733 -8779 -46918 9821 99023 56820 9967 45021 12988 -40357 -60865
7418 -60865 -100425 -58351 23781 75429 74494 29370 4778 12281 2224 -31391 26273 43707
7406 43707 2420 -11826 14357 22832 51049 61918 66940 39081 -6255 -17596 -27593 -48921
7394 -48921 -15207 -27835 -59834 -71755 -41588 -34493 -66976 -66908 -58761 -56448 -36960 -14214 -31611
7381 -31611 -43771 -48010 -17849 6985 18609 27489 17448 68434 97874 94291 32855 -21684
7369 -21684 11008 36244 30957 34881 30069 12895 4525 -21343 -22876 -54163 -66075 -9703 27371
7356 27371 -4801 49 -14656 -28758 46195 78456 16063 -435 -46053 -60011 -64769 -44357
7344 -44357 3388 50503 79730 68302 28177 26222 38833 745 44805 -13852 -66180 -49056
$$ packed form
7430E9618k8062l5289n046l8139N6739Q9202m2203m6853L5054l2033n3345k0508
7418f0865l9560M2074Q2132N1648r35m5124k4592P503j0057l3615N7664J7434
7406D3707m1287j4246K6183Q475K8217J0869N022k7859m5336j1341r997k1328
7394d8921L3714j2628l1999j1921L0167P095l2483O8Q147K313J9488K2746j7397
7381c1611j2160m239L0161K4834J1624Q880j0041N0986K9440l583o1436n4539
7369b1684L2692K5236n287L924m812j7174q370k5868j533l1287j1912N6372L7074
7356B7371l2172M850j4705j4102P4953L2261o2393j6498m5618j3958m758K0412
7344d4357M7745M7115K9227j1428m0125j955J2611l8088M4060n8657n2328J7124
$$ plain form
7332 -49056 -48446 -74489 383 86675 49725 -1762 -41618 -19576 14020 51467 60438 52121 -3511
7319 -3511 -37852 -45630 -40138 -8242 46102 50190 49443 56466 64533 122438 91059 54712 33037
7306 33037 54751 21819 -5310 -58123 -108610 -125699 -155484 -180839 -146901 -62882 -34942 -5448
7294 -5448 23483 -329 -11576 -15554 12377 13542 -1990 -45343 -29318 17622 30059 50815
7282 50815 69949 916 35076 53643 55051 71475 67958 17652 -5376 -47198 -21633 -1352
7270 -1352 44084 61069 46540 27462 15475 -46002 -142502 -96973 -51795 -29542 -11424 -9767
7258 -9767 -26800 917 -15051 -52564 -66250 -23175 -21901 -48361 -76621 -95597 -102729 -73949
7246 -73949 -47172 -51800 -37171 -27407 -2327 -8163 44981 33092 -25523 -40008 -61738 -52018 -51100
$$ packed form
7332d9056O10k6043P4872Q6292l6950n1487l9856K2042L3596L7447Q971q317n5632
7319c511l4341p778N492L1896N4344M088p47P023Q067N7905l1379l6347k1675
7306C3037K1714l2932k7129n2813n0487j7089k9785k5355L3938Q4019K7940K9494
7294e448K8931k3812j1247l978K7931J165j5532m3353J6025M6940J2437K0756
7282E0815J9134o9033L4160J8567J408J6424l517n0306k3028m1822K5565K0281
7270a352M5436J6985j4529j9078j1987o1477r6500M5529M5178K2253J8118J657
7258i767j7033K7717j5968l7513j3686M3075J274k6460k8260j8976p132K8780
7246g3949K6777m628J4629R764K5080n836N3144j1889n8615j4485k1730R720R18
$$ plain form
7233 -51100 -73912 -61150 -29075 36222 -17664 -39097 -9914 1780 -20086 12087 42863 15860
7221 15860 -14508 -46614 -40977 -53480 -45999 -25021 -47201 -53133 -21873 -22621 -70794 -53473 -26487
7208 -26487 -32344 -60798 2905 -13113 -49352 -97565 -114375 -84282 -37416 -23448 -24390 -50693
7196 -50693 -49333 -47042 -76801 -62493 -113852 -152440 -138554 -92811 -86483 -85861 -60615 -59137 -40924
7183 -40924 -22674 -37616 -78708 -92230 -111360 -45714 1950 17415 24087 30821 51631 46366
7171 46366 -2230 14376 27835 28035 24697 2321 -5339 -18165 34140 39348 -2639 -17716 -44823
7158 -44823 -55252 -15613 -8419 -13935 5601 -20885 -20790 -31323 -34515 -80075 -115603 -60613 -3716
7145 -3716 -6103 -94365 -78246 -59408 -72015 -66006 -83081 -76764 -75417 -53996 -23712 -28235 -12701
$$ packed form
7233e1100k2812J2762L2075O5297n3886k1433K9183J1694k1866L2173L0776k7003
7221A5860l0368l2106N637j2503P481K0978k2180n932L1260p48m8173J7321K6986
7208b6487n857k8454O3703j6018l6239m8213j6810L0093M6866J3968r42k6303
7196e0693J360K291k9759J4308n1359l8588J3886M5743O328O22K5246J478J8213
7183d0924J8250j4942m1092j3522j9130O5646M7664J5465O672O734K0810n265
7171D6366m8596J6606J3459K00l338k2376p660j2826N2305N208m1987j5077k7107
7158d4823j0429L9639P194n516J9536k6486R5j0533l192m5560l5528N4990N6897
7145c716k387q8262J6119J8838j2607O009j7075O317J347K1421L0284m523J5534
$$ plain form
7132 -12701 53253 50504 70623 102660 58019 81633 55623 44659 65245 74354 63776 36332
7120 36332 7236 -13779 -26993 -11385 -1467 11326 23492 12257 -9153 -14294 -16930 -20316 -16354
7107 -16354 10666 -30851 -31813 12354 24788 -2618 -16857 -3996 -2100 34254 56785 12961
7095 12961 33804 -24169 10545 76276 85035 79324 23377 -20192 -14559 6535 25874 10221
7083 10221 -11688 23686 32568 3041 -17259 -24947 -32217 59763 70381 -4523 -51426 -43966 -15662
7070 -15662 32411 78731 -161 -37917 -11217 10380 13612 25792 -12563 -7365 -37098 -47512
7058 -47512 -8089 -294 -22174 -64190 -52621 -42334 -34508 -28523 5257 2081 -15896 25053 76574
7045 76574 12380 -52757 -53518 12015 -30165 -58453 -57036 -28498 -37387 -22787 -5759 40929 56220
$$ packed form
7132a2701O5954k749K0119L2037m4641K3614k6010j0964K0586R109j0578k7444
7120C6332k9096k1015j3214J5608R918J2793J2166j1235k1410n141k636l386L962
7107a6354K7020m1517r62M4167J2434k7406j4239J2861J896L6354K2531m3824
7095A2961K0843n7973L4714O5731Q759n711n5947m3569N633K1094J9339j5653
7083A0221k1909L5374Q882k9527k0300p688p270R1980J0618p4904m6903P460K8304
7070a5662M8073M6320p8892l7756K6700K1597L232J2180l8355N198k9733j0414
7058d7512L9423P795k1880m2016J1569J0287P826N985L3780l176j7977M0949N1521
7045G6574o4194o5137p61O5533m2180k8288J417K8538q889J4600J7028M6688J5291
$$ plain form
7032 56220 1228 4806 39705 21741 11391 -36974 -26888 -19607 -34856 -57901 -84750 -42921
7020 -42921 23003 42438 69812 53977 -1835 -13346 -12749 10563 -6778 -7882 -8857 -20458 19408
7007 19408 51367 50222 22266 -28501 -51125 -29935 -25528 -37646 -8749 57330 21986 58166
6995 58166 73009 55746 42078 45057 52968 5386 -38206 -18780 -5175 -22117 26629 -30176
6983 -30176 -52146 -84812 -117128 -86481 -58245 -40358 -52554 -71485 -96154 -65257 -44055 -64916
6971 -64916 -86222 -82805 -58015 -58872 7288 21112 24025 -6433 -11725 -17301 -24382 -36061 -94395
6958 -94395 -120184 -106208 -102336 -59606 -69470 -116485 -98973 -82304 -47272 -8677 22792 -22737
6946 -22737 -24245 -3137 -298 -8486 1638 -21601 -62536 -42411 5811 -18962 -57562 -67563
$$ packed form
7032E6220n4992L578L4899j7964j0350m8365J0086P281j5249k3045k6849M1829
7020d2921O5924J9435K7374j5835n5812j1511N97K3312j7341j104r75j1601L9866
7007A9408L1959j145k7956n0767k2624K1190M407j2118K8897O6079l5344L6180
6995E8166J4843j7263j3668K979P911m7582m3592J9426J3605j6942M8746n6805
6983c0176k1970l2666l2316L0647K8236J7887j2196j8931k4669L0897K1202k0861
6971f4916k1306L417K4790q57O6160J3824K913l0458n292n576p081j1679n8334
6958i4395k5789J3976L872M2730r864m7015J7512J6669L5032L8595L1469m5529
6946b2737j508K1108K839q188J0124k3239m0935K0125M8222k4773l8600j0001
$$ plain form
6934 -67563 -16258 -34801 -39202 -30885 24027 16727 -15462 26804 48065 62815 31583 39452 29028
6921 29028 -12499 -45391 -31814 -58938 -97951 -87568 -37414 -9668 -14954 -41332 -43343 5041
6909 5041 -288 12560 23485 -6471 -26352 -32141 -54055 -48975 -7652 -17139 19838 33602 33176
6896 33176 23550 -11456 -46867 -88620 -126688 -133012 -104219 -98108 -83658 -46166 -24667 10981
6884 10981 41339 -21950 -32021 40726 47667 28465 30509 37204 12163 34189 31978 -26681 -65411
6871 -65411 -87888 -69768 -62573 -37861 -23293 3558 53040 30414 -36387 -46159 -8389 4105
6859 4105 -34465 -42044 -48798 -52002 -20296 -31056 -41325 -20718 -53212 -4546 40868 25485 -11325
6846 -11325 -4955 13213 -24995 -10865 41480 37356 -36419 -72938 -90716 -59697 -30067 -88374
$$ packed form
6934f7563N1305j8543m401Q317N4912p300l2189M2266K1261J4750l1232P869j0424
6921B9028m1527l2892J3577k7124l9013J0383N0154K7746n286k6378k011M8384
6909E041n329J2848J0925k9956j9881n789k1914N080M1323r487L6977J3764m26
6896C3176r626l5006l5411m1753l8068o324K8793O111J4450L7492K1499L5648
6884A0981L0358o3289j0071P2747O941j9202K044O695k5041K2026k211n8659l8730
6871f5411k2477J8120P195K4712J4568K6851M9482k2626o6801r772L7770J2494
6859D105l8570p579o754l204L1706j0760j0269K0607l2494M8666M5414j5383l6810
6846a1325O370J8168l8208J4130N2345m124p3775l6519j7778L1019K9630n8307
$$ plain form
6834 -88374 -93475 -15172 -17997 -72179 -52087 -82350 -79650 -44439 6873 -29017 -4622 -39780
6822 -39780 -86696 -79023 302 32595 38658 70165 75172 26970 -1074 -93759 -113706 -100666
6810 -100666 -107024 -89036 -66939 -40884 -9216 -12020 -30298 -68185 -39232 -6378 -6524 -56888
6798 -56888 -14281 58756 47567 47492 69572 17684 -1776 -10367 4047 -27061 -22589 22540 4391
6785 4391 -25204 16364 -47322 -57543 -5554 24971 30611 42848 33386 49220 49789 20416 10233
6772 10233 2608 -37840 -61042 -79283 -34639 -44207 -1122 26310 21991 19667 -3305 -27332 6344
6759 6344 -26136 -80745 -38889 -4900 17547 -3169 -160 48264 51938 10866 -58019 -67089 2475
6746 2475 38376 44832 53003 -8479 -39513 19643 24939 18175 -41369 -29787 22815 16765 -42265
$$ packed form
6834h8374n101P8303k825n4182K0092l0263K700L5211N1312l5890K4395l5158
6822c9780m6916P673P9325L2293O063L1507N007m8202k8044r2685j9947J3040
6810a00666o358J7988K2097K6055L1668k804j8278l7887K8953L2854j46n0364
6798e6888M2607P3037j1189p5K2080n1888j9460q591J4414l1108M472M5129j8149
6785D391k9595M1568o3686j0221N1989L0525N640J2237r462J5834N69k9373j0183
6772A0233p625m0448k3202j8241M4644r568M3085K7432m319k324k2972k4027L3676
6759F344l2480n4609M1856L3989K2447k0716L009M8424L674m1072o8885r070O9564
6746B475L5901O456Q171o1482l1034N9156N296o764n9544J1582N2602o050n9030
$$ plain form
6733 -42265 -28769 14195 34569 33784 60361 118766 91688 -1650 -22235 -73300 -59257 14081
6721 14081 7429 -25390 -10174 19347 87366 148174 133620 98469 63627 58700 56297 -2092
6709 -2092 -64152 -73223 -49540 20218 -2112 -50685 -21433 2506 20778 19647 49827 47084 -10906
6696 -10906 -9521 13422 2489 6888 63216 78077 99041 72617 42226 -18911 -16116 -13482 -17401
6683 -17401 -53935 -45667 -14213 4567 14647 22422 58273 41902 41014 59651 72594 43062 31750
6670 31750 30765 21488 43680 38822 -16653 -37238 -31591 -62190 -42993 -22350 11 -16600 -74470
6657 -74470 -65557 -58961 -77714 -67682 -50807 -76846 -70875 -59770 -92462 -99407 -62833 -59430 -42960
6644 -42960 -45504 -40464 -29438 -42200 -18324 31741 -23390 -47050 -97877 -163732 -183637 -118369
$$ packed form
6733d2265J3496M2964K0374p85K6577N8405k7078r3338k0585n1065J4043P3338
6721A4081o652l2819J5216K9521O8019O0808j4554l5151l4842m927k403n8389
6709b092o2060r071K3683O9758k2330m8573K9252K3939J8272j131L0180k743n7990
6696a0906J385K2943j0933M399N6328J4861K0964k6424l0391o1137K795K634l919
6683a7401l6534Q268L1454J8780J0080P775L5851j6371q88J8637J2943k9532j1312
6670C1750r85r277K2192m858n5475k0585N647l0599J9197K0643K2361j6611n7870
6657g4470Q913O596j8753J0032J6875k6039N971J1105l2692o945L6574L403J6470
6644d2960k544N040J1026j2762K3876N0065n5131k3660n0827o5855j9905O5268
$$ plain form
6632 -118369 -85295 -95946 -48324 -23799 26702 -2881 -72983 -83409 -51419 -94528 -86451 -74187
6620 -74187 -9485 7081 26107 52070 48968 -8940 -39314 -38489 -35576 -42518 -36842 -9095 9174
6607 9174 -23659 -46747 -76714 -116250 -120577 -33452 -24704 -1784 49831 51714 -3367 -41102 -53154
6594 -53154 -30061 -12615 21176 44241 31348 -12596 -42696 -90092 -104304 -102120 -89362 -93251
6582 -93251 -68780 28624 90661 90906 68483 7986 -32700 -59566 -27428 9451 19967 -9099
6570 -9099 3991 979 -10981 -19340 -20100 -4135 34296 -1785 -60140 -78864 -65202 -33167 -46199
6557 -46199 -35372 -4537 -14815 -47676 -53732 -48537 1295 4388 -17759 24079 26328 32008 -19056
6544 -19056 -105179 -146606 -114481 -55410 -32731 -38340 4965 31018 22531 -5273 61137 65428
$$ packed form
6632a18369L3074j0651M7622K4525N0501k9583p0102j0426L1990m3109Q077J2264
6620g4187O4702J6566J9026K5963l102n7908l0374Q25K913o942N676K7747J8269
6607I174l2833k3088k9967l9536m327Q7125Q748K2920N1615J883n5081l7735j2052
6594e3154K3093J7446L3791K3065j2893m3944l0100m7396j4212K184J2758l889
6582i3251K4471R7404O2037K45k2423o0497m0686k6866L2138L6879J0516k9066
6570i099J3090l012j1960q359p60J5965L8431l6081n8355j8724J3662L2035j3032
6557d6199J0827L0835j0278l2861o056N195M9832L093k2147M1838K249N680n1064
6544a9056q6123m1427L2125N9071K2679n609M3305K6053q487k7804O6410M291
$$ plain form
6532 65428 36950 26852 34190 19389 15187 26495 -23928 -23545 -39393 17092 11906 -41951 -49318
6519 -49318 -69670 -46657 -50169 -46957 -10717 32272 43162 1346 64 44413 82771 46865
6507 46865 70037 44900 32260 11102 12931 -19007 -58443 -42725 -1583 -7465 -54817 -88022
6495 -88022 -95554 -71100 -64327 2916 11162 2700 20674 -13189 -8117 -34368 -92523 -80396 -81210
6482 -81210 -62087 -13658 -33894 -12177 318 -41073 -41207 -23048 -40308 -29558 16168 15280 -2464
6469 -2464 1165 60241 47161 27491 -5963 -13720 -43943 -35571 -12898 -5995 -8817 -1721 -13423
6456 -13423 5017 -16677 -36102 24856 -21742 -21172 -54943 -63938 -50320 -45681 -36922 -24632 -10778
6443 -10778 17308 -18727 11320 11995 1504 27051 30700 -11761 -20844 -26951 6509 -22198 -14726
$$ packed form
6532F5428k8478j0098P338j4801m202J1308n0423L83j5848N6485n186n3857p367
6519d9318k0352K3013l512L212L6240M2989J0890m1816j282M4349L8358l5906
6507D6865K3172k5137j2640k1158J829l1938l9436J5718M1142n882m7352l3205
6495h8022p532K4454O773O7243Q246q462J7974l3863N072k6251n8155J2127q14
6482h1210J9123M8429k0236K1717J2495m1391j34J8159j7260J0750M5726q88j7744
6469b464L629N9076j3080j9670l3454p757l0223Q372K2673O903k822P096j1702
6456a3423J8440k1694j9425O0958m6598N70l3771q995J3618M639Q759J2290J3854
6443a0778K8086l6035L0047O75j0491K5547L649m2461r083o107L3460k8707P472
$$ plain form
6430 -14726 -54814 -60742 -50204 -23757 -63708 -67138 -43374 -53929 8924 38946 39024 -9972 -30544
6417 -30544 -51654 -61442 -34066 -19880 -28122 -28287 2923 9929 -420 -8842 -2649 22503 49125
6404 49125 36238 20235 -22995 -52893 -26456 2942 19220 -15415 -24457 -20860 -24897 -28357 -38916
6391 -38916 -19688 -23584 -30232 4696 12137 1661 -13607 -13854 7553 20195 37363 55487 82445
6378 82445 43574 -22378 24509 18891 2942 32792 41362 11394 -26361 -17846 15219 46931
6366 46931 38879 57069 44031 -29389 -13340 -26416 -47304 -90557 -41617 -13102 -15490 12369
6354 12369 55059 20700 -18485 -4257 -13807 -45678 -21512 21306 -1025 -67397 -34118 37367
6342 37367 60652 -24084 -55400 -58469 -59556 15385 -24092 -67969 -59961 -1402 18913 39326
$$ packed form
6430a4726m0088n928J0538K6447l9951l430K3764j0555O2853L0022P8m8996k0572
6417c0544k1110r788K7376J4186q242j65L1210P006j0349q422O193K5152K6622
6404D9125j2887j6003m3230k9898K6437K9398J6278l4635r042L597m037l460j0559
6391c8916J9228l896o648L4928P441j0476j5268k47K1407J2642J7168J8124K6958
6378H2445l8871o5952M6887n618j5949K9850Q570k9968l7755Q515L3065L1712
6366D6931q052J8190j3038p3420J6049j3076k0888m3253M8940K8515k388K7859
6354A2369M2690l4359l9185J4228r550l1871K4166M2818k2331o6372L3279P1485
6342C7367K3285q4736l1316l069j087P4941l9477m3877Q008N8559K0315K0413
$$ plain form
6330 39326 -7218 -50257 -14357 32373 11113 -37695 -17566 -16383 -21838 2449 46906 65299
6318 65299 10905 -9309 39113 54907 3254 -54194 -3550 37599 6331 -4286 3 -35113
6306 -35113 -42350 -39409 -33160 -56468 -78537 -47160 -24268 -3047 16354 45973 54535 61952 83363
6293 83363 90321 58146 21155 21818 44586 40228 31008 -24891 -11152 -40028 -26991 36688 111953
6280 111953 116739 54029 21651 33243 59617 45787 -21796 9336 6614 -17398 -37755 -52541
6268 -52541 -81752 -77410 -72257 -30526 -15550 -50927 -72475 -79415 -121300 -95237 -18126 -11038 -47184
6255 -47184 -7013 43984 78964 64599 53889 47045 60289 43104 56328 74127 82134 108181
6243 108181 116395 45876 41200 47238 22538 9595 -11260 -14306 -4856 22956 69289 49126 83430
$$ packed form
6330C9326m6544m3039L5900M6730k1260m8808K0129J183n455K4287M4457J8393
6318F5299n4394k0214M8422J5794n1653n7448N0644M1149l1268j0617M289l5116
6306c5113p237K941O249k3308k2069L1377K2892K1221J9401K9619Q562P417K1411
6293H3363O958l2175l6991O63K2768m358r220n5899J3739k8876J3037O3679P5265
6280A11953M786o2710l2378J1592K6374j3830o7583L1132k722k4012k0357j4786
6268e2541k9211M342N153M1731J4976l5377k1548o940m1885K6063P7111P088l6146
6255d7184M0171N0997L4980j4365j0710o844J3244j7185J3224J7799Q007K6047
6243A08181Q214p0519m676O038k4700j2943k0855l046R450K7812M6333k0163L4304
$$ plain form
6230 83430 149279 72855 35185 38760 15679 36778 37985 62604 71834 50509 43875 74537 75125
6217 75125 86824 51575 -18149 -92039 -73722 -34573 -3190 27210 48849 64832 34787 -23689
6205 -23689 -32422 15710 25806 -31908 -78231 -43008 30281 11576 -1961 440 32798 7776
6193 7776 -52842 -13107 8809 16351 -15760 -90790 -91107 -75025 -101993 -102064 -53131 -60435 -103719
6180 -103719 -58600 -36961 17507 24275 -17319 -88875 -54745 -15204 7734 -32752 -87809 -73571
6168 -73571 -45905 -57681 -78067 -56624 -20260 -35647 -54726 687 18554 -48 31257 24858
6156 24858 31178 102181 99019 79621 77116 51004 57126 -38480 -76309 6863 57347 46984 67842
6143 67842 82181 62341 27889 -31360 -35966 -22737 -82390 -91140 -42113 -22299 -3374 -9651
$$ packed form
6230H3430O5849p6424l7670L575k3081K1099J207K4619R230k1325o634L0662N88
6217G5125J1699l5249o9724p3890J8317L9149L1383L0400K1639J5983l0045n8476
6205b3689q733M8132J0096n7714m6323L5223P3289j8705j3537K401L2358k5022
6193G776o0618L9735K1916P542l2111p5030l17J6082k6968p1M8933p304m3284
6180a03719M5119K1639N4468O768m1594p1556L4130L9541K2938m0486n5057J4238
6168g3571K7666j1776k0386K1443L6364j5387j9079N5413J7867j8602L1305o399
6156B4858O320P1003l162j9398k505k6112O122r5606l7829Q3172N0484j0363K0858
6143F7842J4339j9840l4452n9249m606J3229n9653q750M9027J9814J8925o277
$$ plain form
6131 -9651 -33843 -47189 -15936 -12355 28976 18427 -4009 -22543 -36098 19646 30083 -22384
6119 -22384 -62749 -109901 -92922 -49178 -1571 -2289 2406 -23900 -59166 -30340 10764 -7361
6107 -7361 -4285 -19911 -45846 -29283 10141 3455 35155 65452 81610 77250 87213 84243 20210
6094 20210 -47896 -16777 3334 -7217 -32182 -40760 7812 45918 26884 -23985 -50131 -98837
6082 -98837 -104607 -73116 -53104 -44964 -56290 -12183 23030 -7252 -8409 -4876 -12215 -50061 -50479
6069 -50479 -42010 7945 37080 30818 -20641 -98511 -115264 -89184 -45975 11108 63393 59155
6057 59155 76445 89124 46692 49911 59791 30346 19384 38468 86279 125170 136211 69328
6045 69328 -15790 42645 70400 26976 -15374 887 -39927 -48329 -29954 -23618 -82518 -72980
$$ packed form
6131i651k4192j3346L1253L581M1331j0549k2436j8534j3555N5744J0437n2467
6119b2384m0365m7152J6979M3744M7607p18M695k6306l5266K8826M1104j8125
6107g361L076j5626k5935J6563L9424o686L1700L0297J6158m360R963k970o4033
6094B0210o8106L1119K0111j0551k4965q578M8572L8106j9034n0869k6146m8706
6082i8837n770L1491K0012Q140j1326M4107L5213l0282j157L533p339l7846m18
6069e0479Q469M9955K9135o262n1459p7870j6753K6080M3209N7083N2285m238
6057E9155J7290J2679m2432L219R880k9445j0962J9084M7811L8891J1041o6883
6045F9328q5118N8435K7755m3424m2350J6261m0814q402J8375O336n8900R538
$$ plain form
6033 -72980 -58351 -75825 -75286 -73809 -60428 -82248 -40913 -46340 -36343 -11212 -25346 -33243 -42034
6020 -42034 -47270 -17655 -16210 -8463 -55951 -44956 -41499 -41895 -26791 -72892 -96853 -75601 -57257
6007 -57257 -49041 -85056 -78871 -55257 5525 43992 9740 -49690 -52905 -52790 16522 33434 -1740
5994 -1740 -27724 2783 -5802 -18309 5229 -47716 -65766 -51251 -70449 565 -9579 -28103
5982 -28103 -67061 -50892 26568 73557 48370 54215 21582 -15818 -53341 -23382 -25932 -21866
5970 -21866 -33431 -39284 -32132 -65482 -74401 -79786 -83933 -37236 -16013 -28148 -40485 -2719 82854
5957 82854 35791 -30264 -23210 -16662 3190 762 19533 43790 44955 -14961 -25689 8356 41968
5944 41968 46016 1563 -45475 -78140 -76403 -81757 -47812 -46233 50754 84142 98872 75155 28056
$$ packed form
6033g2980J4629j7474N39J477J3381k1820M1335n427R997K5131j4134p897q791
6020d2034n236K9615J445P747m7488J0995L457l96J5104m6101k3961K1252J8344
6007e7257Q216l6015O185K3614O0782L8467l4252n9430l215J15O9312J6912l5174
5994a740k5984L0507q585j2507K3538n2945j8050J4515j9198P1014j0144j8524
5982b8103l8958J6169P7460M6989k5187N845l2633l7400l7523K9959k550M066
5970b1866j1565n853P152l3350q919n385m147M6697K1223j2135j2337L7766Q5573
5957H2854m7063o6055P054O548J9852k428J8771K4257J165n9916j0728L4045L3612
5944D1968M048m4453m7038l2665J737n354L3945J579R6987L3388J4730k3717m7099
$$ plain form
5931 28056 23679 -4972 -45539 -116891 -136122 -99395 -64741 -2302 32254 1048 -33682 -85390
5919 -85390 -65950 -41043 -37253 -72848 -74651 -95239 -71276 -67134 -40387 -3936 42905 62970
5907 62970 57051 28875 12042 -42338 -44749 -5310 32972 42439 10019 -12403 -60177 -61350 -39227
5894 -39227 -25319 -80200 -77644 -83510 -126384 -137912 -82474 -65242 -26669 -16112 -51961 -36944
5882 -36944 -23964 -22204 -12272 6469 3520 -39825 -32011 17846 24953 -9519 -28900 -71505 -98851
5869 -98851 -63131 -13653 -47339 -73981 -40228 12762 13535 3204 -3976 -6564 29053 76741 83830
5856 83830 52234 27983 -6822 -59981 -121069 -127964 -90871 -106955 -98292 -98589 -86410 -87994 -77230
5843 -77230 -38135 3507 31791 42729 18051 5538 -48386 -96901 -117306 -88784 -94121 -79260
$$ packed form
5931B8056m377k8651m0567p1352j9231L6727L4654O2439L4556l1206l4730n1708
5919h5390J9440K4907L790l5595j803k0588K3963M142K6747L6451M6841K0065
5907F2970n919k8176j6833n4380k411L9439L8282R467l2420k2422m7774j173K2123
5894c9227J3908n4881K556n866m2874j1528N5438J7232L8573J0557l5849J5017
5882c6944J2980J760R932J8741k949m3345P814M9857P107l4472j9381m2605k7346
5869i8851L5720M9478l3686k6642L3753N2990P73j0331p180k588L5617M7688P089
5856H3830l1596k4251l4805n3159o1088o895L7093j6084Q663k97J2179j584J0764
5843g7230L9095M1642K8284J0938k4678j2513n3924m8515k0405K8522n337J4861
$$ plain form
5831 -79260 -59164 -3805 -7176 -13279 -8450 12130 -20095 -18157 -4941 1698 -13230 -3970 35875
5818 35875 42946 33309 29347 -14322 -19708 -50833 -62864 -43231 -22563 -31160 -17063 16212 26557
5805 26557 9787 -78491 -47357 -30022 -40905 -40647 -64547 -43336 -12261 -24685 -45924 -63435
5793 -63435 -41345 7116 10680 -51183 -88347 -80552 -37232 -56 73507 66430 5267 -12835
5781 -12835 -29825 -28757 4070 4931 43324 13453 15046 24501 27880 -17129 -26618 11559 16448
5768 16448 -29322 -3799 22801 26025 46958 -9697 27868 48846 6409 62598 49218 20024
5756 20024 -45814 -66714 -71313 -55838 17140 65428 43187 -29409 -26292 -26660 -14316 -9307 438
5743 438 -3484 -1501 26319 29754 40417 82631 83526 49761 51961 -11856 -31324 -48120 -61174
$$ packed form
5831g9260K0096N5359l371o103M829K0580l2225J938J3216O639j4928R260L9845
5818C5875P071r637l962m3669n386l1125j2031J9633K0668q597J4097L3275J0345
5805B6557j6770q8278L1134J7335j0883K58k3900K1211L1075j2424k1239j7511
5793f3435K2090M8461L564o1863l7164P795M3320L7176P3563p077o1163j8102
5781a2835j6990J068L2827Q61L8393k9871J593R455L379m5009r489L8177M889
5768A6448m5770K5523K6600L224K0933n6655L7565K0978m2437N6189j3380k9194
5756B0024o5838k0900m599J5475P2978M8288k2241p2596L117l68J2344N009R745
5743D38l922J983K7820L435J0663M2214Q95l3765K200o3817j9468j6796j3054
$$ plain form
5730 -61174 -27260 -44413 -32023 -60118 -63254 -63577 -46422 -24197 -13459 -9520 -17836 43243 118462
5717 118462 126382 73066 26416 71548 87558 45779 24128 3476 14357 2096 7214 693
5705 693 -73234 -57692 -50382 -52026 -43349 -55279 -15898 -32821 -44343 -34583 -25827 -9064 7255
5692 7255 -39839 -28851 4985 62066 52921 21131 28382 24753 -48721 -9894 68211 114214 126907
5679 126907 84041 12108 12499 -47581 -31213 -27445 -64862 -39006 -10064 -10981 -22670 -9392 -54315
5666 -54315 -80539 -43840 -73216 -66485 8346 -18578 -31424 -23167 15987 23289 56202 40278
5654 40278 55229 48642 26440 24813 3932 -22360 -43343 -32410 -21628 -11089 -55298 -90749
5642 -90749 -1696 -8110 43903 13883 -10023 -4923 9126 24679 63133 57100 -1809 -69690
$$ packed form
5730f1174L3914j7153J2390k8095l136l23J7155K2225J0738L939q316O1079P5219
5717A18462P920n3316m6650M5132J6010m1779k1651k0652J0881j2261N118o521
5705F93p3927J5542P310j644Q677j1930L9381j6923j1522R760Q756J6763J6319
5692G255m7094J0988L3836N7081r145l1790P251l629p3474L8827P8105M6003J2693
5679A26907m2866p1933L91o0080J6368L768l7417K5856K8942r17j1689J3278m4923
5666e4315k6224L6699k9376O731P4831k6924j2846Q257L9154P302L2913j5924
5654D0278J4951o587k2202j627k0881k6292k0983J0933J0782J0539m4209l5451
5642i0749Q9053o414N2013l0020k3906N100J4049J5553L8454o033n8909o7881
$$ plain form
5630 -69690 -99369 -73299 -45974 5856 43324 -16898 -63041 -70482 -34360 -20780 -26443 -29423
5618 -29423 -61279 -79735 -82493 -67491 -68100 -26621 -28929 -47148 -58331 -73064 -74181 -21349 15671
5605 15671 34657 46350 27365 -6682 -6330 -1277 3039 -17804 1479 28328 41728 44413 46702
5592 46702 48506 42523 9820 55550 50356 57485 41376 31426 31720 7172 -23020 -36862 -28201
5579 -28201 -55907 -47532 -36392 -295 -10540 -29484 -80778 -124639 -140127 -151202 -86902 -50723
5567 -50723 -60413 -12878 44780 43682 13303 -16897 21948 48700 6417 -42547 -30079 -43355
5555 -43355 -71857 -47552 -54036 -16147 -30925 -23166 -10528 35316 64982 43902 10460 -19778
5543 -19778 -44619 -11629 9624 -30676 -14761 23949 -1719 9967 69483 82937 31746 18417
$$ packed form
5630f9690k9679K6070K7325N1830L7468o0222m6143p441L6122J3580n663k980
5618b9423l1856j8456k758J5002o09M1479k308j8219j1183j4733j117N2832L7020
5605A5671J8986J1693j8985l4047L52N053M316k0843J9283K6849J3400K685K289
5592D6702J804n983l2703M5730n194P129j6109r950K94k4548l0192j3842Q661
5579b8201k7706Q375J1140L6097j0245j8944n1294m3861j5488j1075O4300L6179
5567e0723r690M7535N7658j098l0379l0200L8845K6752m2283m8964J2468j3276
5555d3355k8502K4305o484L7889j4778P759J2638M5844K9666k1080l3442l0238
5543a9778k4841L2990K1253m0300J5915L8710k5668J1686N9516J3454n1191j3329
$$ plain form
5531 18417 -13344 -48302 -57250 -57966 -48633 -63837 -106454 -75833 -39981 34514 57470 64057 8084
5518 8084 -505 -11288 -9664 3612 -16387 -53479 -61774 -66211 -72732 -94017 -101850 -84490 -54008
5505 -54008 -63139 -56061 -49206 -93418 -151731 -99794 -35074 -51244 -68060 -40736 -5159 27631
5493 27631 25098 19763 59176 30208 11241 15363 40125 45949 -279 -35069 -48277 -90521 -58856
5480 -58856 12381 55277 72473 30895 16561 30375 33564 21401 55186 57692 56258 58444 64641
5467 64641 79854 99626 96031 58415 20406 -31417 -81154 -48428 -42685 -67889 -31659 30779
5455 30779 92790 59519 29879 -5778 -16729 27899 27702 -23865 -68531 -73485 -36699 -13693
5443 -13693 -2280 -23702 -26459 -57774 -90734 -61710 -30817 -7445 20139 22457 -4514 33455
$$ packed form
5531A8417l1761l4958q948p16R333j5204m2617L0621L5852P4495K2956O587n5973
5518H084q589j0783J624J3276j9999l7092q295m437o521k1285p833J7360L0482
5505e4008r131P078O855m4212n8313N1937O4720j6170j6816K7324L5577L2790
5493B7631k533n335L9413k8968j8967M122K4762N824m6228l4790j3208m2244L1665
5480e8856P1237M2896J7196m1578j4334J3814L189j2163L3785K506j434K186O197
5467F4641J5213J9772l595l7616l8009n1823m9737L2726N743k5204L6230O2438
5455C0779O2011l3271k9640l5657j0951M4628j97n1567m4666m954L6786K3006
5443a3693J1413k1422k757l1315l2960K9024L0893K3372K7584K318k6971L7969
$$ plain form
5431 33455 61149 61156 68052 52561 52621 58613 40399 44995 -2776 -23579 -45496 -48416 -82294 -100380
5417 -100380 -49421 9674 -2616 -76581 -119490 -137003 -87882 -30973 -31093 -45748 -63188 -25153
5405 -25153 -23605 -3480 -35208 -27133 -31892 7563 20162 -62406 -87559 -30182 26893 15704
5393 15704 -12625 -17694 8170 -23153 -54681 -63366 -64874 -62382 -67964 -34142 -18114 -652 -31561
5380 -31561 -68329 -107425 -123452 -72086 -57694 -72433 -54204 -29080 -14053 4885 13362 57654
5368 57654 61412 55966 -9171 1116 49275 24086 -2136 -18218 -28115 -48389 -84129 -102120
5356 -102120 -108554 -78612 -24701 -14772 -12144 -13909 30124 6671 16214 -43413 -231 17823 -8009
5343 -8009 -33308 -40148 -27931 -5710 -26004 -43999 -65637 -48754 -33432 -60314 -107320 -129838
$$ packed form
5431C3455K7694PO896j5491O0N992j8214M596m7771k0803k1917k920l3878j8086
5417a00380N0959N9095j2290p3965m2909j7513M9121N6909j20j4655j7440L8035
5405b5153J548K0125l1728Q075m759L9455J2599q2568k5153N7377N7075j1189
5393A5704k8329n069K5864l1323l1528q685j508K492n582L3822J6028J7462l0909
5380c1561l6768l9096j6027N1366J4392j4739J8229K5124J5027J8938Q477M4292
5368E7654L758n446o5137J0287M8159k5189k6222j6082r897k0274l5740j7991
5356a02120o434K9942N3911R929K628j765M4033k3453R543n9627M3182J8054k5832
5343h009k5299o840J2217K2221k0294j7995k1638J6883J5322k6882m7006k2518
$$ plain form
5331 -129838 -101384 -12204 28740 59815 42892 -405 17411 53484 3957 1676 4479 -9568
5319 -9568 -6411 30530 47998 81546 57753 22807 3610 -58025 -72081 -81840 -90103 -73981 -55305
5306 -55305 -130741 -70418 -46109 -39546 -101158 -105223 -89587 -37282 -36867 -47794 -16226 -17596 890
5293 890 -12130 31696 99159 131270 58843 -21635 -46471 -27655 -40186 -32606 46776 50625 51068
5280 51068 32531 -3153 -21302 19983 30519 10555 -10043 -25687 -66253 -60005 -73772 -12499
5268 -12499 3688 47678 21343 -18239 -31193 -59522 -53731 -24225 -22154 -73456 -125184 -154522
5256 -154522 -153427 -87483 -32569 -24464 16205 20388 -18593 -5336 -69433 -81012 -80148 -56242 -33326
5243 -33326 -5108 -22807 -58242 -10243 -4664 21850 40038 -16475 -1686 -25846 -10023 20486
$$ packed form
5331a29838K8454Q9180M0944L1075j6923m3297J7816L6073m9527k281K803j4047
5319i568L157L6941J7468L3548k3793l4946j9197o1635j4056r759q263J6122J8676
5306e5305p5436O0323K4309O563o1612m065J5636N2305M15j0927L1568j370J8486
5293H90j3020M3826O7463L2111p2427q0478k4836J8816j2531P580P9382L849M43
5280E1068j8537l5684j8149M1285J0536j9964k0598j5644m0566O248j3767O1273
5268a2499J6187M3990k6335l9582j2954k8329N791K9506K071n1302n1728k9338
5256a54522J095O5944N4914Q105M0669M183l8981J3257o4097j1579Q64K3906K2916
5243c3326K8218j7699l5435M7999N579K6514J8188n6513J4789k4160J5823L0509
$$ plain form
5231 20486 22004 33722 2869 -17736 -11148 -12482 -1941 -111 37056 27704 9355 -50782 -88673
5218 -88673 -69312 -86760 -84921 -63539 -58697 -42081 -27629 -21692 -63362 -78439 -12408 3515
5206 3515 -2515 -21655 -62533 -63094 -33569 16082 74025 84000 24043 -29598 2207 3677 -23105
5193 -23105 -13540 33446 -3089 -36472 -76812 -70297 25499 83233 86522 70398 36771 12383
5181 12383 10130 6287 6241 67889 81307 67002 53534 51309 60487 75637 52017 67156 57738
5168 57738 19898 -46507 -50847 -49854 -52481 -27724 -31834 -12801 7902 8897 5457 -4007 2336 -3452
5154 -3452 -50839 -70860 -27516 -4832 -35535 -72364 -110773 -94055 -67788 -24409 -7032 5220
5142 5220 -20961 31388 68779 57343 31099 67596 103775 86491 105711 165488 96720 -29917
$$ packed form
5231B0486J518J1718l0853k0605O588j334J0541J830L7167r352j8349o0137l7891
5218h8673J9361j7448J839K1382M842J6616J4452N937m1670j5077O6031J5923
5206C515o030j9140m0878n61K9525M9651N7943R975n9957n3641L1805J470k6782
5193b3105R565M6986l6535l3383m0340O515R5796N7734L289j6124l3627k4388
5181A2383k253l843m6O1648J3418j4305j3468k225R178J5150k3620J5139r418
5168E7738l7840o6405m340R93k627K4757m110J9033K0703R95l440r464O343n788
5154c452m7387k0021M3344K2684l0703l6829l8409J6718K6267M3379J7377J2252
5142E220k6181N2349L7391j1436k6244L6497L6179j7284J9220N9777o8768j26637
$$ plain form
5130 -29917 -64048 -33880 -2720 -3031 -28092 -20685 -52583 -19452 7990 13048 7480 1352 31434
5117 31434 99686 85804 63697 56013 45285 67610 125490 122887 151044 137015 77827 2911
5105 2911 9783 42090 47466 50854 53332 -9691 -33864 -2302 -3026 17190 77939 83956 9271
5092 9271 -34383 9590 25537 51106 15965 13462 14034 66682 77133 21190 -16080 -21271 -11685
5079 -11685 -26059 -38242 9451 7586 1132 6902 -28997 -70284 -64556 -69491 3039 71729 68515
5066 68515 36409 48119 76706 74183 82933 72060 36793 25731 47790 44742 31158 87885
5054 87885 126991 119513 131711 114725 107739 84515 104580 57799 -11170 -51182 -123789 -70463
5042 -70463 -21562 -33568 -19685 -40996 -14994 18098 26843 79054 73444 50883 51929 6827
$$ packed form
5130b9917l4131L0168L1160l11k5061P407l1898L3131K7442N058n568o128L0082
5117C1434O8252j3882k2107p684j0728K2325N7880k603K8157j4029n9188p4916
5105B911O872L2307N376L388K478o3023k4173L1562p24K0216O0749O017p4685
5092I271m3654M3973J5947K5569l5141k503N72N2648J0451n5943l7270n191R586
5079a1685j4374j2183M7693j865o454N770l5899m1287N728m935P2530O8690l214
5066F8515l2106J1710K8587k523Q750j0873l5267j1062K2059l048j3584N6727
5054H7885L9106p478J2198j6986o986k3224K0065m6781o8969m0012p2607N3326
5042g0463M8901j2006J3883k1311K6002L3092Q745N2211n610k2561J046m5102
$$ plain form
5030 6827 -40364 -34804 -19367 -13619 -7257 -14699 -12212 24803 -3478 -92409 -139869 -121332 -92874
5017 -92874 -84264 -75855 -21983 -74992 -96924 -42597 -17049 -2881 -33637 -15847 -11196 -16096 -30652
5004 -30652 -15535 -7758 5175 -1934 -90369 -119373 -81025 -57176 -26595 -26669 -84423 -89904 -49432
4991 -49432 -55229 -52072 -31384 -31235 -69878 -84876 -82144 -119448 -76949 -48741 10870 -5457 -3884
4978 -3884 49191 54086 33871 3644 -19707 -34329 -68036 -121274 -124017 -102099 -22786 -27890 -25907
4965 -25907 -20481 -8757 -73006 -82746 -63306 -59798 -48288 -35792 -24495 -4742 -10819 43649 57476
4952 57476 5551 -59494 -86864 -84338 -52002 -34009 -50202 -8146 -18835 -19508 -2144 -1623 17759
4939 17759 52858 71458 25952 -23410 -32864 -49876 -46249 -44349 -84829 -81432 -45617 -1508 -12177
$$ packed form
5030F827m7191N560J5437N748O362p442K487L7015k8281q8931m7460J8537K8458
5017i2874Q610Q409N3872n3009k1932N4327K5548J4168l0756J7790M651m900j4556
5004c0652J5117P777J2933p109q8435k9004L8348K3849L0581p4n7754n481M0472
4991d9432n797L157K0688J49l8643j4998K732l7304M2499K8208N9611j6327J573
4978c884N3075M895k0215l0227k3351j4622l3707n3238k743K1918P9313n104J983
4965b5907N426J1724o4249r740J9440L508J1510J2496J1297J9753o077N4468J3827
4952E7476n1925o5045k7370K526L2336J7993j6193M2056j0689o73J7364N21J9382
4939A7759L5099J8600m5506m9362r454j7012L627J900m0480L397L5815M4109j0669
$$ plain form
4926 -12177 -18547 -36703 8607 16885 17101 -12872 32641 -1567 -76182 -19527 32825 10680 -74793
4913 -74793 -31170 -13256 -15178 16448 -707 -1150 -1798 46976 25074 40515 54219 7709 -46537
4900 -46537 -31863 -56924 -92846 -102119 -56939 -91877 -45261 14444 -1346 13212 23792 22179
4888 22179 -11209 -85945 -84735 -113930 -116141 -57233 -68466 -95655 -81103 3923 60325 55379
4876 55379 24040 8663 39727 49368 -3026 -54341 22 5118 -6339 14453 34416 16356
4864 16356 11679 14215 6211 -14723 -28517 -14411 -48712 -48531 10585 25177 -6101 -19527 -27906
4851 -27906 -19067 -25670 -9241 5131 -68439 -47248 -8410 -46264 -70998 -67472 -53944 -13029
4839 -13029 -20482 -24154 -28955 -29162 -1206 40383 67380 57986 35837 58127 32157 19861 39061
$$ packed form
4926a2177o370j8156M5310Q278K16k9973M5513l4208p4615N6655N2352k2145q5473
4913g4793M3623J7914j922L1626j7155m43o48M8774k1902J5441J3704m6510n4246
4900d6537J4674k5061l5922r273M5180l4938M6616N9705j5790J4558J0580j613
4888B2179l3388p4736J210k9195k211N8908j1233k7189J4552Q5026N6402m946
4876E5379l1339j5377L1064R641n2394n1315N4363N096j1457K0792J9963j8060
4864A6356m677K536q004k0934j3794J4106l4301J81N9116J4592l1278j3426q379
4851b7906Q839o603J6429J4372p3570K1191L8838l7854k4734L526J3528M0915
4839a3029p453l672m801k07K7956M1589K6997r394k2149K2290k5970j2296J9200
$$ plain form
4826 39061 25623 36792 25518 6818 -12710 -8258 -47366 -49578 -39745 -22384 41012 45895 46834
4813 46834 70595 76038 99193 62102 20167 -12378 -29240 -66083 -82649 -48182 -12347 42605
4801 42605 91769 93046 71488 60315 56884 41808 -7913 -60612 -28833 6070 -14671 -8351
4789 -8351 -88 24468 26477 4517 38843 33461 39541 44026 82663 85727 73274 36734 31292
4776 31292 66334 29643 -17976 16051 52617 69116 81922 71279 66282 37010 52089 67880
4764 67880 53761 40122 43735 63448 71887 11060 4799 45494 52081 26132 -53732 -87704 -34319
4751 -34319 -16084 -20951 3939 7869 -42678 -25152 -16211 -53085 -19436 -10323 -4993 16023 9388
4738 9388 905 -29433 -48080 -31939 -14091 -5942 -17768 9141 20356 -21376 -83333 -56042
$$ packed form
4826C9061j3438J1169j1274j8700j9528M452l9108k212R833J7361O3396M883R39
4813D6834K3761N443K3155l7091m1935l2545j6862l6843j6566L4467L5835N4952
4801D2605M9164J277k1558j1173l431j5076m9721n2699L1779L4903k0741O320
4789h351Q263K4556K009k1960L4326n382O080M485L8637L064j2453l6540n442
4776C1292L5042l6691m7619L4027L6566J6499J2806j0643m997k9272J5079J5791
4764F7880j4119j3639L613J9713Q439o0827o261M0695O587k5949p9864l3972N3385
4751c4319J8235m867K4890L930n0547J7526Q941l6874L3649R113N330K1016o635
4738I388q483l0338j8647J6141J7848Q149j1826K6909J1215m1732o1957K7291
$$ plain form
4726 -56042 -22880 -37207 -22364 9165 13290 10882 27671 18882 32323 61312 29011 6880
4714 6880 5115 -5513 49753 96639 96959 73012 76763 54229 75303 61275 80429 57686 54332
4701 54332 78145 76228 24891 526 -15649 -55678 -52758 -3082 -48094 24006 58088 56900
4689 56900 36467 42226 61995 50372 64905 139913 142353 63218 19097 -16623 -19279 -54791
4677 -54791 -58145 -71221 -42970 -55986 -112891 -118112 -79852 -64272 -101905 -74015 -24712 -51911
4665 -51911 -69892 -88279 -105473 -41416 24565 38290 36308 18851 -19420 -52450 -55656 -4047
4653 -4047 -14092 26722 -5723 -43131 -21138 30679 42026 28024 33681 110238 91428 65779
4641 65779 55503 41029 56972 24919 14716 9012 3346 22843 -18988 581 65255 104911
$$ packed form
4726e6042L3162j4327J4843L1529M125k408J6789q789J3441K8989l2301k2131
4714F880j765j0628N5266M6886L20k3947L751k2534K1074j4028J9154k2743l354
4701E4332K3813j917n1337k4365j6175m0029K920M9676m5012P2100L4082j188
4689E6900k0433N759J9769j1623J4533P5008K440p9135m4121l5720k656l5512
4677e4791l354j3076K8251j3016n6905n221L8260J5580l7633K7890M9303k7199
4665e1911j7981j8387j7194O4057O5981J3725j982j7457l8271l3030l206N1609
4653d047j0045M0814l2445l7408K1993N1817J1347j4002N657P6557j8810k5649
4641F5779j0276j4474J5943l2053j0203n704n666J9497m1831J9569O4674L9656
$$ plain form
4629 104911 63235 44599 16423 5386 7637 61727 101016 99008 112554 93548 48808 5246
4617 5246 67939 92280 71317 21695 -21748 -38856 -79797 -28524 1296 2651 38736 13497
4605 13497 -41533 -23334 9217 28337 52871 74128 61349 48730 -36047 -42309 -16102 -15802
4593 -15802 -36631 -61616 -65501 -79025 -28960 37712 62395 34481 8349 168 10689 39675
4581 39675 33430 21298 56025 41255 -31903 6354 35098 -16661 -1755 11942 36013 75653
4569 75653 90426 58749 -4528 -36099 -61336 -50630 -17665 12895 32151 74831 74388 38861
4557 38861 -11673 -11904 -45514 -3418 39217 42187 45806 -1150 -10781 6552 61445 43528 2244
4544 2244 32711 26971 63577 53413 49367 80109 66949 49346 60513 54252 84450 84848 65763
$$ packed form
4629A04911m1676j8636k8176j1037K251N4090L9289k008J3546j9006m4740m3562
4617E246O2693K4341k0963m9622m3443j7108m0941N1273K9820J355L6085k5239
4605A3497n5030J8199L2551J9120K4534K1257j2779j2619q4777o262K6207L00
4593a5802k0829k4985l885j3524N0065O6672K4683k7914k6132q181J0521K8986
4581C9675o245j2132L4727j4770p3158L8257K8744n1759J4906J3697K4071L9640
4569G5653J4773l1677o3277l1571k5237J0706L2965L0560J9256M2680m43l5527
4557C8861n0534k31l3610M2096M2635K970L619m6956r631J7333N4893j7917m1284
4544B244L0467n740L6606j0164m046L0742j3160j7603J1167o261L0198L98j9085
$$ plain form
4531 65763 29977 36673 42569 21249 -7707 -77055 -82013 -12115 34546 12708 -22936 -32016 -34810
4518 -34810 -60894 -24532 -13561 -11472 1938 6748 36661 61884 62202 45023 -2895 -49233 -73561
4505 -73561 -55480 -49498 -51355 -27524 17024 73020 91109 70509 7104 2345 14181 -6399
4493 -6399 -15709 -21965 -60450 -39231 -25788 -10940 1037 -8117 5412 -5847 -5414 -5919 -74560
4480 -74560 -89427 -58644 -30461 -23621 25344 9182 -12703 -17477 -4724 37781 42857 56954
4468 56954 -11448 -14952 -23297 -11845 39787 81588 29185 19 -43274 -89257 -31398 14545
4456 14545 -64421 -106964 -129341 -105930 -50009 31059 42079 10821 -45766 -31233 -34025 -35611
4444 -35611 -15788 32422 23952 26071 23407 -18681 -10982 -29364 -50389 -61310 -89265 -75980 -30784
$$ packed form
4531F5763l5786O696N896k1320k8956o9348m958O9898M6661k1838l5644r080k794
4518c4810k6084L6362J0971K089J3410M810K9913K5223L18j7179m7918m6338k4328
4505g3561J8081N982j857K3831M4548N5996J8089k0600o3405m759J1836k0580
4493f399r310o256l8485K1219J3443J4848J1977r154J3529j1259M33n05o8641
4480g4560j4867L0783K8183O840M8965j6162k1885m774J2753M2505N076J4097
4468E6954o8402l504q345J1452N1632M1801n2403k9166m3293m5983N7859M5943
4456A4545p8966m2543k2377K3411N5921Q1068J1020l1258n6587J4533k792j586
4444c5611J9823M8210q470K119k664m2088P699j8382k1025j0921k7955J3285M5196
$$ plain form
4431 -30784 8969 4109 1026 -18841 -6691 -1238 -25971 -61798 -31706 -30882 -36366 -12606 -7143
4418 -7143 36585 37751 2292 37738 54482 67151 99527 66238 7486 -19611 -61238 -45677
4406 -45677 24375 40158 34490 4792 -31511 -31109 -24429 -27304 -44893 -22708 -30566 -58616 -93592
4393 -93592 -87809 -79777 -32331 -23500 -51043 -55677 -54344 -62155 -94247 -88346 -21088 34869 43147
4380 43147 9412 22160 -30737 -81054 -75482 -33832 -10643 7697 -27039 -36639 -22509 -28345
4368 -28345 -17361 -23976 -34429 -18683 -10665 -12788 -38230 -21037 866 31956 73007 46137
4356 46137 3479 -45262 -40599 -22408 -17342 -61983 -88592 -69417 -68370 -94921 -111593 -148124
4344 -148124 -138654 -92029 -15440 4132 -10908 -1021 74947 52258 -16896 -27866 -47684 -48819
$$ packed form
4431c0784L9753m860l083j9867J2150N453k4733l5827L0092Q24n484K3760N463
4418g143M3728J166l5459L5446J6744J2669L2376l3289n8752k7097m1627J5561
4406d5677P0052J5783n668k9698l6303M02O680k875j7589K2185p858k8050l4976
4393i3592N783Q032M7446Q831k7543m634J333p811l2092N901O7258N5957Q278
4380D3147l3735J2748n2897n0317N572M1650K3189J8340l4736r600J4130n836
4368b8345J0984o615j0453J5746Q018k123k5442J7193K1903L1090M1051k6870
4356D6137m2658m8741M663J8191N066m4641k6609J9175J047k6551j6672l6531
4344a48124R470M6625P6589J9572j5040R887P5968k2689o9154j0970j9818j135
$$ plain form
4332 -48819 -43794 142 28028 71581 117384 100910 40470 36193 36910 5692 21207 16479 29996
4319 29996 54263 34122 -22038 -56120 5801 30516 51432 37871 51861 56839 12457 -44530
4307 -44530 -64682 -56502 -55051 -30965 3048 -16424 -22864 -29156 -23069 32200 35619 12936 -4200
4294 -4200 49202 17419 -51836 -69833 -57765 -45904 -15272 -17029 -33066 2506 -1814 -25378
4282 -25378 -41073 -83796 -93665 -44868 -41924 -43386 152 23550 -6261 26028 24397 -820 -24820
4269 -24820 -22080 -44445 -60576 -55041 -1502 -53841 -92265 -72611 -49824 -60480 -47800 1306
4257 1306 12330 33132 -5922 -5154 -24533 -730 15354 -49777 -28513 -51346 -50855 -57122 -67931
4244 -67931 -75141 -65339 -2659 49715 -30545 -71700 -18545 -1516 -13886 -6828 -50379 -83008
$$ packed form
4332d8819N025M3936K7886M3553M5803j6474o0440m277P17l1218J5515m728J3517
4319B9996K4267k0141n6160l4082O1921K4715K0916j3561J3990M978m4382n6987
4307d4530k0152Q180J451K4086L4013j9472o440o292O087N5269L419k2683j7136
4294d200N3402l1783o9255j7997J2068J1861L0632j757j6037L5572m320k3564
4282b5378j5695m2723r869M8797K944j462M3538K3398k9811L2289j631k5217k4000
4269b4820K740k2365j6131N535N3539n2339l8424J9654K2787j0656J2680M9106
4257A306J1024K0802l9054P68j9379K3803J6084o5131K1264k2833M91o267j0809
4244f7931p210R802O2680N2374q0260m1155N3155J7029j2370P058m3551l2629
$$ plain form
4232 -83008 -8749 -40559 -53406 -25914 -17476 18012 49582 71182 56200 25507 1919 -3094
4220 -3094 8020 27120 5752 -54909 -34337 -44043 -47636 -50644 -67896 -84952 -67537 -239 -24661
4207 -24661 9937 20831 47741 34907 -18850 -33852 -5109 -20949 10440 13752 -3491 -6137
4195 -6137 24177 35006 -16026 -17268 6764 24486 33865 -18564 -40210 -6156 51421 53598 -8119
4182 -8119 -20625 -7825 -57512 -28509 -7841 -12225 30421 62223 16559 -116 -29982 -6155
4170 -6155 16378 9927 -1821 -27357 -15650 30182 49261 2021 -55215 -78049 -98101 -106680
4158 -106680 -65893 -87140 -96047 -77974 -72411 -69855 -69721 -66744 4589 55612 45144 -1681 -69485
4145 -69485 -42529 -21118 -39056 -52303 -34400 -24769 -20252 -4174 22321 23541 -20792 16448
$$ packed form
4232h3008P4259l1810j2847K7492Q438L5488L1570K1600j4982l0693k3588n013
4220c094J1114J9100k1368o0661K0572r706l593l008j7252j7056J7415O7298k4422
4207b4661L4598J0894K6910j2834n3757j5002K8743j5840L1389L312j7243k646
4195f137L0314J0829n1032j242K4032J7722R379n2429k1646L4054N7577K177o1717
4182h119j2506J2800m9687K9003K0668m384M2646L1802m5664j6675k9866K3827
4170f155K2533o451j1748k5536J1707M5832J9079m7240n7236k2834k0052q579
4158a06680M0787k1247q907J8073N563K556J34K977P1333N1023j0468m6825o7804
4145f9485K6956K1411j7938j3247J7903R631M517J6078K6495J220m4333L7240
$$ plain form
4133 16448 -20407 -3391 55596 51800 45978 -3039 -64993 -89159 -25763 5426 19320 35670
4121 35670 28567 39174 40273 34367 23379 20997 34228 45128 30356 26363 65086 73390 33590
4108 33590 41699 83176 63728 34991 23824 27467 56617 35883 -7016 -49376 -38381 -128
4096 -128 -12202 -19847 54791 32611 11237 16832 12511 3814 -7559 -18583 -34598 -45250 -44818
4083 -44818 -43977 15041 -37212 -65968 -29529 -29668 -66095 -90294 -123032 -85524 -101572 -147631 -90304
4070 -90304 -41957 19756 16585 5392 16206 12183 10435 -1355 -25559 15755 27520 17780 10371
4057 10371 -13116 30846 79220 71968 22689 -14123 -35947 -55127 -62933 613 -38441 -74491
4045 -74491 -50769 -30490 -12635 -70186 -94210 -70991 -56691 -17016 -61562 -86306 -55101 -28193
$$ packed form
4133A6448l6855J7016N8987l796n822m9017o1954k4166O3396L1189J3894J6350
4121C5670p103J0607J099n906j0988k382J3231J0900j4772l993L8723Q304l9800
4108C3590Q109M1477j9448k8737j1167L643K9150k0734m2899m2360J0995L8253
4096a28j2074p645P4638k2180k1374N595m321q697j1373j1024j6015j0652M32
4083d4818Q41N9018n2253k8756L6439j39l6427k4199l2738L7508j6048m6059N7327
4070i0304M8347O1713l171j1193J0814m023j748j1790k4204M1314J1765r740p409
4057A0371k3487M3962M8374p252m9279l6812k1824j9180p806O3546l9054l6050
4045g4491K3722K0279J7855n7551k4024K3219J4300L9675m4546k4744L1205K6908
$$ plain form
4033 -28193 -76413 -62676 -27342 -48200 -89875 -66423 -50543 -16946 -4135 -20535 -21582 -82692
4021 -82692 -79075 -67545 -33826 31684 48586 48818 86423 58388 25198 52102 42070 41756 33946
4008 33946 25893 -9420 -72345 -52993 14607 70096 102592 73549 66756 10972 26903 44297
3996 44297 4857 -5343 1859 42429 89946 47764 -12077 -546 28357 92068 96657 41121
3984 41121 -13177 10172 11209 17558 -17381 -12424 2204 -1914 -30655 -21532 -66520 -107621 -63845
3971 -63845 -64280 -82877 -93443 -77040 -48580 -10452 -51876 -63665 -21518 -27274 20252 -1373
3959 -1373 -68937 -41325 2064 21573 -18318 -238 38386 62384 55799 17954 29564 25895
3947 25895 44613 50421 -2124 2232 31047 23963 32626 243 -20176 -47401 -66065 -19819 28709
$$ packed form
4033b8193m8220J3737L5334k0858m1675K3452J5880L3597J2811j6400j047o1110
4021h2692L617J1530L3719O5510J6902K32L7605k8035l3190K6904j0032l14p810
4008C3946q053l5313o2925J9352O7600N5489L2496k9043o793n5784J5931J7394
3996D4297l9440j0200P202M0570M7517m2182n9841J1531K8903O3711M589n5536
3984D1121n4298K3349J037O349l4939M957J4628m118k8741R123m4988m1101M3776
3971f3845m35j8597j0566J6403K8460L8128m1424j1789M2147n756M7526k1625
3959a373o7564K7612M3389J9509l9891J8080L8624K3998o585l7845J1610l669
3947B5895J8718N808n2545M356K8815p084Q663l2383k0419k7225j8664M6246M8528
$$ plain form
3934 28709 54617 92470 62438 16956 3505 4453 39611 -44057 -69116 -34461 -74941 -122790
3922 -122790 -88235 -59701 -44380 18474 28611 -16874 -10793 8256 82961 122180 164178 134507
3910 134507 150616 168839 129491 73507 53335 46933 53858 69039 36892 12608 66598 45512
3898 45512 56702 97220 85617 27461 33166 22238 14270 -23283 -33055 27349 87503 101661
3886 101661 66605 21415 -12306 -17885 -8927 6313 10173 26039 46440 100500 29411 -32738
3874 -32738 -70864 -34780 -9266 15970 26354 8210 -34885 -53675 -42331 -47715 -38800 -11275
3862 -11275 73404 69867 -8101 -19417 24369 54898 74756 100065 85954 52165 55771 36975
3850 36975 -26492 -57436 -35130 -41183 -67771 -9774 53574 46548 65834 32406 -20608 -30784
$$ packed form
3934B8709K5908L7853l0032m5482j3451R48L5158q3668k5059L4655m0480m7849
3922a22790L4555K8534J5321O2854J0137m5485O081J9049P4705L9219M1998k9671
3910A34507J6109J8223l9348n5984k0172o402O925J5181l2147k4284N3990k1086
3898D5512J1190M0518j1603n8156N705j0928p968l7553r772O0404O0154J4158
3886A01661l5056m5190l3721n579Q958J5240L860J5866K0401N4060p1089o2149
3874c2738l8126L6084K5514K5236J0384j8144m3095j8790J1344n384Q915K7525
3862a1275Q4679l537p7968j1316M3786L0529J9858K5309j4111l3789L606j8796
3850C6975o3467l0944K2306o053k6588N7997O3348p026J9286l3428n3014j0176
$$ plain form
3838 -30784 -8335 34878 16337 -3679 -15342 -37287 -37100 -2616 20619 -6201 -35891 -907
3826 -907 24604 -19098 25006 55724 24610 20471 67250 1730 -86984 -12677 75336 65347 91804
3813 91804 93480 57814 36402 15923 25545 40197 63149 101467 69261 -382 -47463 -126059
3801 -126059 -140851 -83479 281 10003 2192 -6976 -58474 -64567 -37832 -60014 -25610 26635
3789 26635 45061 10992 17798 60880 17580 21608 898 -28309 -38098 -7977 -35924 677
3777 677 44174 69219 125141 72548 50335 84779 19407 -33792 -24260 11095 12281 12918 16548
3764 16548 3702 27089 20566 32457 23465 5279 5293 19660 -1557 -12247 -36566 -88678 -92910
3751 -92910 -58572 17889 46403 59473 45848 29506 33689 1763 -14492 28637 53772 34955
$$ packed form
3838c0784K2449M3213j8541k0016j1663k1945J87L4484K3235k6820k9690L4984
3826i07K5511m3702M4104L0718l1114m139M6779o5520q8714P4307Q8013r989K6457
3813I1804J676l5666k1412k0479R622J4652K2952L8318l2206o9643m7081p8596
3801a26059j4792N7372Q3760R722p811r168n1498o093K6735k2182L4404N2245
3789B6635J8426l4069O806M3082m3300M028k0710k9207r789L0121k7947L6601
3777F77M3497K5045N5922n2593k2213L4444o5372n3199R532L5355J186O37L630
3764A6548j2846K3387o523J1891q992j8186J4J4367k1217j0690k4319n2112m232
3751i2910L4338P6461K8514J3070j3625j6342M183l1926j6255M3129K5135j8817
$$ plain form
3739 34955 40166 29729 -1792 -24492 -71118 -46300 18391 32307 -15790 -46152 -24156 27710
3727 27710 38095 13725 19631 19268 15955 -21113 25847 13478 -20134 -38142 -14590 9514 16122
3714 16122 -14598 -59598 -68385 -56499 -25550 -30164 -23389 12399 14823 -29514 -19605 -25319 -19252
3701 -19252 -16959 -5373 -10608 -29169 6264 -30038 -49489 -54408 -64549 -38023 -46584 2825 -6833
3688 -6833 -15680 34551 59618 34635 14584 21172 401 -31610 -63526 -11889 33789 71402
3676 71402 85359 36003 -1623 -56312 -35898 33241 13993 -22037 -33398 -26871 -21636 -11819
3664 -11819 45500 62655 341 -27793 -36517 -7576 18860 3956 37427 38428 5331 -13947
3652 -13947 641 27490 37376 48959 37490 52586 89369 86292 59931 3487 -11483 -24565
$$ packed form
3739C4955N211j0437l1521k2700m6626K4818O4691J3916m8097l0362K1996N1866
3727B7710J0385k4370N906l63l313l7068M6960j2369l3612j8008K3552K4104O608
3714A6122l0720m5000q787J1886L0949m614O775L5788K424m4337R909n714O067
3701a9252K293J1586n235j8561L5433l6302j9451m919j0141K6526q561M9409r658
3688f833q847N0231K5067k4983k0051O588k0771l2011l1916N1637M5678L7613
3676G1402J3957m9356l7626n4689K0414O9139j9248l6030j1361O527N235R817
3664a1819N7319J7155o2314k8134q724K8941K6436j4904L3471J001l3097j9278
3652a3947J4588K6849R886J1583j1469J5096L6783l077k6361n6444j4970j3082
$$ plain form
3640 -24565 -45694 -47709 -56645 -25160 -44569 -74541 -111153 -143735 -105734 -97715 -93904 -26856 -42813
3627 -42813 48285 105752 93810 67969 9461 -52283 -40474 -33834 -65079 -69089 -15181 -26559
3615 -26559 -25526 -21103 -48538 -75158 -11393 -6697 -45777 -83599 -54374 -47123 -34716 -35067 -24820
3602 -24820 -58347 -35085 -47448 -55219 -18580 -43992 -17379 -12246 17921 31211 -11490 -47523
3590 -47523 -15788 7697 10590 66373 17377 -31597 1606 9879 2986 65913 83896 70433
3578 70433 4514 2103 21361 61583 2771 -30996 -7672 -9434 -13437 13314 12336 -21904 -81775
3565 -81775 -69662 -64029 -38869 -6862 15082 44114 29794 60645 97260 124147 67363 6230
3553 6230 -16182 -19275 12744 41709 48678 19482 32744 -5089 -20424 2145 21298 58375
$$ packed form
3640b4565k1129k015q936L1485j9409k9972l6612l2582L8001Q019L811O7048j5957
3627d2813R1098N7467j1942k5841n8508o1744J1809O640l1245m010N3908j1378
3615b6559J033M423k7435k6620O3765M696l9080l7822K9225P251J2407l51J0247
3602b4820l3527K3262j2363p771L6639k5412K6613N133L0167J3290m2701l6033
3590d7523L1735K3485K893N5783m8996m8974L3203Q273o893O2927J7983j3463
3578G0433o5919k411J9258M0222n8812l3767K3324j762m003K6751r78l4240n9871
3565h1775J2113N633K5160L2007K1944K9032j4320L0851L6615K6887n6784o1133
3553F230k2412l093L2019K8965O969k9196J3262l7833j5335K2569J9153L7077
$$ plain form
3541 58375 29202 23600 34458 21421 34974 9818 37088 47501 43435 12396 18658 13489 2498
3528 2498 -45285 -16565 31388 23820 2252 -56613 -74567 -92762 -114759 -137637 -121052 -66093
3516 -66093 -35649 -86406 -129423 -130607 -154091 -45654 -5034 -16471 -44241 -38121 -87630 -171631
3504 -171631 -149498 -98721 -83577 -104495 -113102 -94469 -105585 -118257 -57869 -71239 -94596 -48982
3492 -48982 -17899 21512 65665 50266 12016 -11603 14863 29697 14294 26453 54165 77638
3480 77638 83098 89654 81402 21160 17915 39296 -27926 -57195 -22002 -35938 -62783 -33396 -36931
3467 -36931 -9733 12175 21644 17418 -2045 -1506 14334 34319 9742 8274 -9491 -20723 4195
3454 4195 12318 84932 98092 88918 68592 58561 56695 96696 93559 42079 37702 79773 45673
$$ packed form
3541E8375k9173n602J0858j3037J3553k5156K7270J0413m066l1039O262n169j0991
3528B498m7783K8720M7953p568k1568n8865j7954j8195k1997k2878J6585N4959
3516f6093L0444n0757m3017j184k3484J08437M0620j1437k7770O120m9509q4001
3504a71631K2133N0777J5144k0918q607J8633j1116j2672O0388j3370k3357M5614
3492d8982L1083L9411M4153j5399l8250k3619K6466J4834j5403J2159K7712K3473
3480G7638N460O556q252o0242l245K1381o7222k9269L5193j3936k6845K9387l535
3467c6931K7198K1908R469m226j9463N39J5840J9985k4577j468j7765j1232K4918
3454D195Q123P2614J3160r174k0326j0031j866M0001l137n1480m377M2071l4100
$$ plain form
3441 45673 12866 -3394 2792 16109 54994 108663 52230 17159 -77941 -94278 -81601 -70877
3429 -70877 -25820 -2613 16089 22124 -42186 -96633 -83300 -40841 5965 5313 12749 15621 31959
3416 31959 -16989 -37183 -14693 -24663 -68727 -22340 -43822 -99823 -83191 -84715 -39879 21282
3404 21282 -4263 -8422 -7376 -2538 15440 -38006 -56327 -54496 -46689 -22208 14378 5694 -7285
3391 -7285 -43875 -112181 -95379 -101240 -81937 -41238 -23158 -16878 -38736 -31340 -46570 -27988 2387
3378 2387 -6472 11632 2052 3375 -43744 -30195 32043 23529 15699 21438 878 -8849 4913
3365 4913 41085 36144 97650 151082 132731 60581 20559 -1847 7664 20629 43465 -43126
3353 -43126 -59169 -57108 -53152 -69552 -15876 9466 -4713 10259 58076 72750 74705 41913
$$ packed form
3441D5673l2807j6260O186J3317L8885N3669n6433l5071r5100j6337J2677J0724
3429g0877M5057K3207J8702O035o4310n4447J3333M2459M6806o52P436K872J6338
3416C1959m8948k0194K2490r970m4064M6387k1482n6001J6632j524M4836O1161
3404B1282k5545m159J046M838J7978n3446j8321J831P807K4481L6586q684j2979
3391g285l6590o8306J6802n861J9303M0699J8080O280k1858P396j5230J8582L0375
3378B387q859J8104r580J323m7119J3549O2238q514p830N739k0560r727J3762
3365D913L6172m941O1506N3432j8351p2150m0022k2406R511J2965K2836q6591
3353d3126j6043K061L956j6400N3676K5342j4179J4972M7817J4674J955l2792
$$ plain form
3341 41913 42048 34285 2067 -45658 -31940 5651 12120 -6187 -10553 -13427 -5057 23377 -13032
3328 -13032 -52700 -26323 30451 34807 5272 -15554 -52174 -93627 -107204 -58870 -1106 60362
3316 60362 48243 43033 34599 46587 17928 -16105 -4851 36543 41717 23979 15737 -33066 -14286
$$ packed form
3341D1913J35p763l2218m7725J3718L7591O469j8307m366k874Q370K8434l6409
3328a3032l9668K6377N6774M356k9535k0826l6620m1453j3577M8334N7764O1468
3316F0362j2119n210q434J1988k8659l4033J1254M1394N174j7738q242m8803J8780
$$ [...]
##END NTUPLES=NMR SPECTRUM
##END=
