##TITLE=Analysis number 310758
Compound Code mo 07117
Book Reference 407/85
Project Code adrs
Chemist Name andyw
##JCAMPDX= 6.0         $$ Bruker NMR JCAMP-DX V2.0
##DATA TYPE= NMR SPECTRUM
##DATA CLASS= NTUPLES
##ORIGIN= Bruker BioSpin GmbH
##OWNER= NMR
$$ XWIN-NMR		Version 3.5
$$ Thu Jun 23 09:50:15 2005 GMT Daylight Time (UT+1h)  MAYBRIDGE\NMR@NMR_250MHZ
##.OBSERVE FREQUENCY= 250.131544655141
##.OBSERVE NUCLEUS= ^1H
##.ACQUISITION MODE= SIMULTANEOUS (DQD)
##.ACQUISITION SCHEME= undefined
##.AVERAGES= 16
##.DIGITISER RES= 18
##SPECTROMETER/DATA SYSTEM= dpx250
##.PULSE SEQUENCE= zg30
##.SOLVENT NAME= CDCl3
##.SHIFT REFERENCE= (INTERNAL, CDCl3, 0, 16.522)
##AUDIT TRAIL= $$ (NUMBER, WHEN, WHO, WHERE, WHAT)
$$ ##TITLE= Audit trail, XWIN-NMR		Version 3.5
$$ ##JCAMPDX= 5.01
$$ ##ORIGIN= Bruker BioSpin GmbH
$$ ##OWNER= NMR
$$ C:\u/data/dgb/nmr/ADRS/4590/pdata/1/auditp.txt
$$ ##AUDIT TRAIL=  $$ (NUMBER, WHEN, WHO, WHERE, WHAT)
(   1,<2005-06-23 09:49:46.38 +100>,<MAYBRIDGE\NMR>,<NMR_250MHZ>,
      <created by zg, POWCHK disabled, PULCHK disabled
       configuration hash MD5:
       62 19 C7 07 E1 42 D1 B7 37 6C 3D D0 77 39 F9 E6
       data hash MD5: 64K
       FE 1C 1C A1 FD 04 85 30 AA B7 4D 78 F6 B5 81 1B>)
(   2,<2005-06-23 09:50:03.64 +100>,<MAYBRIDGE\NMR>,<NMR_250MHZ>,
      <Start of raw data processing
       ef LB = 0.3 FT_mod = 6 PKNL = 1 SI = 32K 
       data hash MD5: 32K
       C5 86 D3 A5 99 FF 38 F0 94 BF 4F 3C EA F7 0E 65>)
(   3,<2005-06-23 09:50:05.54 +100>,<MAYBRIDGE\NMR>,<NMR_250MHZ>,
      <apk 
       data hash MD5: 32K
       23 70 91 FD 9D FE 80 4B 86 B4 1D D5 61 43 F5 59>)
(   4,<2005-06-23 09:50:06.24 +100>,<MAYBRIDGE\NMR>,<NMR_250MHZ>,
      <abs ABSG = 5 
       data hash MD5: 32K
       2A D3 63 A5 1D F3 81 74 57 5B 49 E8 75 57 4B 52>)
$$ ##END=
$$ 
$$ hash MD5
$$ 49 73 21 AE 2F 9E E9 17 01 FA FF 8A 98 67 1F 01
##$RELAX= 
##$RELAX= 
##$RELAX= 
##$RELAX= 
##$RELAX= 
##$RELAX= 
##$RELAX= 
$$ Bruker specific parameters
$$ --------------------------
##$DU= <C:\u>
##$EXPNO= 4590
##$NAME= <ADRS>
##$PROCNO= 1
##$TYPE= <nmr>
##$USER= <dgb>
##$AMP= (0..31)
100 100 100 100 100 100 100 100 100 100 100 100 100 100 100 100 100 100 
100 100 100 100 100 100 100 100 100 100 100 100 100 100 
##$AQSEQ= 0
##$AQ_mod= 3
##$AUNM= <au_zg>
##$AUTOPOS= <59 >
##$BF1= 250.13
##$BF2= 250.13
##$BF3= 250.13
##$BF4= 250.13
##$BF5= 500.13
##$BF6= 500.13
##$BF7= 500.13
##$BF8= 500.13
##$BYTORDA= 1
##$CFDGTYP= 0
##$CFRGTYP= 5
##$CHEMSTR= <none>
##$CNST= (0..31)
1 1 145 1 1 1 1 1 1 1 1 1 1 1 1 1 1 1 1 1 1 1 1 1 1 1 1 1 1 1 1 1 
##$CPDPRG= <>
##$CPDPRG1= <>
##$CPDPRG2= <>
##$CPDPRG3= <>
##$CPDPRG4= <mlev>
##$CPDPRG5= <mlev>
##$CPDPRG6= <mlev>
##$CPDPRG7= <mlev>
##$CPDPRG8= <mlev>
##$CPDPRGB= <>
##$CPDPRGT= <>
##$D= (0..31)
0 1 0 0 0 0 0 0 0 0.06 0 0 0 0 0 0 0.0002 0 0 0 0 0 0 0 0 0 0 0 0 0 0 
0 
##$DATE= 1119516585
##$DBL= (0..7)
120 120 120 120 120 120 120 120 
##$DBP= (0..7)
150 150 150 150 150 150 150 150 
##$DBP07= 0
##$DBPNAM0= <>
##$DBPNAM1= <>
$$ [...]
##$SUBNAM7= <"">
##$SUBNAM8= <"">
##$SUBNAM9= <"">
##$SW= 20.6930455092707
##$SWIBOX= (0..15)
0 0 3 0 0 0 0 0 0 0 0 0 0 0 0 0 
##$SW_h= 5175.983436853
##$TD= 65536
##$TD0= 1
##$TE= 295.16
##$TE2= 300
##$TE3= 300
##$TEG= 300
##$TL= (0..7)
0 120 120 120 120 120 120 120 
##$TP= (0..7)
150 150 150 150 150 150 150 150 
##$TP07= 0
##$TPNAME0= <>
##$TPNAME1= <>
##$TPNAME2= <>
##$TPNAME3= <>
##$TPNAME4= <>
##$TPNAME5= <>
##$TPNAME6= <>
##$TPNAME7= <>
##$TPOAL= (0..7)
0.5 0.5 0.5 0.5 0.5 0.5 0.5 0.5 
##$TPOFFS= (0..7)
0 0 0 0 0 0 0 0 
##$TUNHIN= 0
##$TUNHOUT= 0
##$TUNXOUT= 0
##$USERA1= <user>
##$USERA2= <user>
##$USERA3= <user>
##$USERA4= <user>
##$USERA5= <user>
##$V9= 5
##$VALIST= <valist>
##$VCLIST= <CCCCCCCCCCCCCCC>
##$VD= 0
##$VDLIST= <DDDDDDDDDDDDDDD>
##$VPLIST= <PPPPPPPPPPPPPPP>
##$VTLIST= <TTTTTTTTTTTTTTT>
##$WBST= 1024
##$WBSW= 4
##$XGAIN= (0..3)
0 0 0 0 
##$XL= 0
##$YL= 0
##$YMAX_a= 360384
##$YMIN_a= -536410
##$ZGOPTNS= <>
##$ZL1= 120
##$ZL2= 120
##$ZL3= 120
##$ZL4= 120
##$ABSF1= 16.522
##$ABSF2= -4.171173
##$ABSG= 5
##$ABSL= 3
##$ALPHA= 0
##$AQORDER= 0
##$ASSFAC= 0
##$ASSFACI= 0
##$ASSFACX= 0
##$ASSWID= 0
##$AUNMP= <proc_1d>
##$AZFE= 0.1
##$AZFW= 0.1
##$BCFW= 0
##$BC_mod= 0
##$BYTORDP= 0
##$COROFFS= 0
##$CY= 12.5
##$DATMOD= 1
##$DC= 0
##$DFILT= <>
##$DTYPP= 0
##$F1P= 14.0000005364418
##$F2P= -0.99999901652339
##$FCOR= 0.5
##$FTSIZE= 32768
##$FT_mod= 6
##$GAMMA= 0
##$GB= 0
##$INTBC= 1
##$INTSCL= 1
##$ISEN= 128
##$LB= 0.3
##$LEV0= 0
##$LPBIN= 0
##$MAXI= 10000
##$MC2= 0
##$MEAN= 0
##$ME_mod= 0
##$MI= 0
##$NCOEF= 0
##$NC_proc= -4
##$NLEV= 6
##$NOISF1= 0
##$NOISF2= 0
##$NSP= 0
##$NTH_PI= 0
##$NZP= 0
##$OFFSET= 16.522
##$PC= 1
##$PHC0= -79.46589
##$PHC1= 6.750104
##$PH_mod= 1
##$PKNL= yes
##$PPARMOD= 0
##$PSCAL= 4
##$PSIGN= 0
##$REVERSE= no
##$SF= 250.13
##$SI= 32768
##$SIGF1= 0
##$SIGF2= 0
##$SINO= 400
##$SIOLD= 32768
##$SREGLST= <1H.CDCl3>
##$SSB= 0
##$STSI= 32768
##$STSR= 0
##$SW_p= 5175.98343685301
##$SYMM= 0
##$S_DEV= 0
##$TDeff= 65536
##$TDoff= 0
##$TI= <Analysis number 999999
Compound Code 99
Book Reference 9
Project Code 9>
##$TILT= no
##$TM1= 0
##$TM2= 0
##$TOPLEV= 0
##$USERP1= <user>
##$USERP2= <user>
##$USERP3= <user>
##$USERP4= <user>
##$USERP5= <user>
##$WDW= 1
##$XDIM= 32768
##$YMAX_p= 340311843
##$YMIN_p= -111466
$$ End of Bruker specific parameters
$$ ---------------------------------
##NTUPLES= NMR SPECTRUM
##VAR_NAME=  FREQUENCY,     SPECTRUM/REAL,   SPECTRUM/IMAG
##SYMBOL=    X,             R,               I
##VAR_TYPE=  INDEPENDENT,   DEPENDENT,       DEPENDENT
##VAR_FORM=  AFFN,          ASDF,            ASDF
##VAR_DIM=   32768,         32768,           32768
##UNITS=     HZ,            ARBITRARY UNITS, ARBITRARY UNITS
##FACTOR=    0.157963299565203, 1,           1
##FIRST=     4132.6476996994, 0,             0
##LAST=      -1043.33573715361, 0,           0
##MIN=       -1043.33573715361, -111466,     0
##MAX=       4132.6476996994, 340311843,     0
$$ Real data points
##PAGE= N=1
##DATA TABLE= (X++(R..R)), XYDATA
$$ [...]
14056A3221Q262K0081M985n148j6098k4188P645L1905J5897l3896r355Q841O141
14043B8293P479o962K1256K752J3515o725j2094R412N221l858j5276J0760K0484
14030G4257J9247K4818p912P369O87j691n72p797J110K3086P804j5614r231j1064
14016A04497p197K6178J1965k9223j5659j1879j901Q185J6179o613O144J1931
14004A12607J745N210J0007K6255J7215k7073o384k537P780j0085m8995O402J8734
13991A10881J9127J6579r239j7914m0399j6324K2333K9024n570o192o70K4985
13979A26621J936k6549k0757k320o310J0197k2477p200K4664j53k3090q464r738
13966C6360J3229J6183l603r439J0607j0987l3246q768J0471J8036n546q64N381
$$ plain form
14056 13221 21483 41564 46549 41401 25303 1115 8760 40665 56562 22666 13311 22152 28293
14043 28293 35772 28810 50066 52818 66333 59608 47514 56926 62147 58289 43013 53773 74257
14030 74257 93504 118322 110410 117779 118466 116775 116203 108406 109516 132602 140406 124792 115561 104497
14016 104497 97300 123478 135443 106220 90561 78682 76781 84966 101145 94532 100676 112607
14004 112607 114352 119562 129569 155824 173039 145966 139582 137045 144825 134740 85745 92147 110881
13991 110881 130008 146587 137348 119434 79035 62711 85044 114068 108498 102306 101636 126621
13979 126621 128557 102008 81251 78931 72621 82818 60341 53141 77805 77652 54562 46098 36360
13966 36360 49589 65772 62169 52730 63337 52350 19104 10336 20807 38843 33297 32433 37814
13953C7814j0486k0736o7j9996N258L1686j3745k8446J0452K4801J7439q042j1680
13940A4252q246O257r20K771j3455J0986K6555K8327K0005P431k9347l2880K0031
13927E1767N463n305J8864J5520j2958J750P90L77o587j7175J4519L3084N765
13914A05874k7326j5153j2189L5726J7309q291J2601L066J049M5417o082m8451
13902A03550J9260L3517M238M008J221r43J6138L7967m784n440K4621K1912J020
13889B56285j2296l1717l5126k0877J5188l911r532m469l0101q307J1922J7664
13877A44723p279J4779j2748L824r178m836k1164R719J2885J8751K515J625J7864
13864A71480J6673Q600j3505j912Q803n8J1946K6917L1473K9144k1570r767K1219
$$ plain form
13953 37814 27328 6592 6525 -13471 -8213 23473 9728 -18718 -8266 16535 33974 25932 14252
13940 14252 6006 12263 11343 14114 659 11645 38200 66527 86532 93963 64616 31736 51767
13927 51767 57230 51925 70789 86309 73351 75101 75891 76268 69681 52506 67025 100109 105874
13914 105874 78548 63395 51206 86932 104241 95950 108551 111617 112666 158083 152001 103550
13902 103550 122810 156327 160565 164573 165794 164851 180989 218956 214172 208732 233353 255265 256285
13889 256285 243989 212272 177146 156269 171457 167546 158014 153545 123444 115137 127059 144723
13877 144723 137444 152223 139475 143299 134121 129285 108121 117840 130725 149476 151991 153616 171480
13864 171480 188153 196753 183248 181336 190139 190081 202027 228944 260417 289561 267991 258224 279443
13851B79443L0391K6092J2541j05K9287J7159K768j7315M512L7504K7607L7438
13839D87322L7220L3512r72L949J5166L6678K9201N3830O411j8706J0718M0961
13827G35290N2265K1058K2527O6388K3568l880J4398L6369L2189P398P396M3850
13815A058816M4214K7168L4176J5646J805M4324O7374M0751L2789M1383M9129
13804A457575L6168K0734M7500L5977O8931N5523K9637N1642O1826P9768Q0659
13793B025940N4834N7506P0755Q0942P4351J03028Q8643Q4919R8022J23157J16325
13782B978422J38316J43774J49839J77609J86180K12667K31411K56891K40295
13773D715404K84027K86908L15472L42539L54688L89668M42899M90408N26782
$$ plain form
13851 279443 309834 335926 348467 348362 377649 394808 397576 380261 384773 422277 449884 487322
13839 487322 524542 558054 557082 561031 576197 612875 642076 695906 702317 683611 694329 735290
13827 735290 787555 808613 831140 897528 921096 917216 931614 967983 1000172 1007570 1014966 1058816
13815 1058816 1103030 1130198 1164374 1180020 1181825 1226149 1293523 1334274 1367063 1408446 1457575
13804 1457575 1493743 1514477 1561977 1597954 1666885 1722408 1752045 1803687 1865513 1945281 2025940
13793 2025940 2080774 2138280 2209035 2289977 2364328 2467356 2555999 2640918 2738940 2862097 2978422
13782 2978422 3116738 3260512 3410351 3587960 3774140 3986807 4218218 4475109 4715404
13773 4715404 4999431 5286339 5601811 5944350 6299038 6688706 7131605 7622013 8148795
13764H148795N82031O16332O90569P33792P58299Q43047R26535J010255J084125
13755A5393780J148141J237847J353869J464306J588955J695002J835135J985288
13747B7702323K115435K253548K356387K495767K627634K813228K943791L043206
13739D8351319L158363L309718L464929L568239L657820L702761L713258L669076
13731G6595483L529768L333067L015096K582911K051405J507619Q57917J79100
13723I3652366m86685j120292j676298k168884k543155k804514k987667l096570
13715G6768301l149116l124912l041515k940306k807492k675077k561868k389688
13707E4078327k214443k054742j947306j791535j665216j573311j483230j337410
$$ plain form
13764 8148795 8730826 9347158 10037727 10771519 11529818 12372865 13299400 14309655 15393780
13755 15393780 16541921 17779768 19133637 20597943 22186898 23881900 25717035 27702323
13747 27702323 29817758 32071306 34427693 36923460 39551094 42364322 45308113 48351319
13739 48351319 51509682 54819400 58284329 61852568 65510388 69213149 72926407 76595483
13731 76595483 80125251 83458318 86473414 89056325 91107730 92615349 93473266 93652366
13723 93652366 93165681 92045389 90369091 88200207 85657052 82852538 79864871 76768301
13715 76768301 73619185 70494273 67452758 64512452 61704960 59029883 56468015 54078327
13707 54078327 51863884 49809142 47861836 46070301 44405085 42831774 41348544 40011134
13699D0011134j255494j192310j104953j047884j021981r64130r42997r60505
13691C1520880r21825r11150r23154q86451q89285q90511r39096r00426r01047
13682B3357935q92168q98947q58769q24266q03746p78255p82705p41318p10828
13673A6066933p22395p11014o59247o31278o09711n48329n66197n21623m63479
13664A0633660m82379m51817m43190m16086l81467l78409l73786l50213l42939
13655G013374l04263k88559k90527k77436k65068k35886k08414k19728k01537
13646D721956k09271k29658k21270j94310k03452j53587j50386j47685j41297
13637C071040j25509j35455j28676j18504j01704j14750r7411j09201o0505p5767
$$ plain form
13699 40011134 38755640 37563330 36458377 35410493 34388512 33424382 32481385 31520880
13691 31520880 30599055 29687905 28764751 27878300 26989015 26098504 25159408 24258982 23357935
13682 23357935 22465767 21566820 20708051 19883785 19080039 18301784 17519079 16777761 16066933
13673 16066933 15344538 14633524 13974277 13342999 12733288 12184959 11618762 11097139 10633660
13664 10633660 10151281 9699464 9256274 8840188 8458721 8080312 7706526 7356313 7013374
13655 7013374 6709111 6420552 6130025 5852589 5587521 5351635 5143221 4923493 4721956
13646 4721956 4512685 4283027 4061757 3867447 3663995 3510408 3360022 3212337 3071040
13637 3071040 2945531 2810076 2681400 2562896 2461192 2346442 2249031 2139830 2079325 2003558
13627B003558j02146p9913q1907o0391m7798m3244o9571p4583o9467p9344p1361
13616A223833m1741m7004l1889o194l5492o5367p3572n0675l2798k4857l4182
13605G80062k3920K341J3625l2038m0906k4311j0491N3500K9539j2430j3371l27
13593G21273J445k865k7153j6535j548j8958n762o82L4944L3913k6249k1318M661
13580F75166r510m0582j2482m364k2031J567J6252J6793k9001l3129l6618L2910
13568E54971J5764k2885k770O32q936L240M276J0518j3698k6727k1331K7716J0353
13555E31123r926M2127J1817Q264j0293J8244J8017q229P030O206p76j489L49
13542F12464M379q484j1533J2834j2815m796L1476N170j7993P079M916M482m272
$$ plain form
13627 2003558 1901412 1821499 1739592 1679201 1631403 1588159 1518588 1444005 1374538 1295194 1223833
13616 1223833 1182092 1135088 1103199 1097005 1061513 996146 922574 871899 839101 814244 780062
13605 780062 756142 758483 772108 740070 699164 674853 664362 717862 747401 734971 721600 721273
13593 721273 722718 719853 692700 676165 674617 655659 649897 649215 684159 718072 691823 670505 675166
13580 675166 665656 625074 612592 608228 586197 587764 604016 620809 591808 558679 522061 554971
13568 554971 570735 547850 545080 545712 536776 540016 544292 554810 541112 514385 493054 520770 531123
13555 531123 521197 563324 575141 583405 573112 591356 609373 601144 608174 614380 613604 612115 612464
13542 612464 616843 608359 596826 609660 596845 592049 623525 628695 610702 617781 622697 627179 622907
13529F22907K1226K040k8948j7487M593K7428L1251p020k9900k0177m213k2982
13517E78718L459j986j2283p757n626o081k0856n644P407J8762k8254l1799r55
13504D87105N054k4744j7623p112J4392R414m747j0132j3115m673q810m026n460
13491D15523j6564j8153l157j4112K1585o134k7475o822j5586R521l030j9761
13479C15835k5972q60n684J818Q872l184J0942O725O26p086k2252k5077j6153
13466B38550K6378P130k333L3856j7414m6046k7735M002m109L017j1295r863q579
13453A85559J5429O107j7312j9038k2852N002K0669o382q795j2103M2057K0965
13441B09306q018n871l6444k4398l529K2748L953M387r242k869J6002J4607m4002
$$ plain form
13529 622907 644133 646173 617225 599738 604331 631759 663010 655990 626090 605913 601700 578718
13517 578718 582177 580191 567908 560151 554525 548444 527588 521944 529351 548113 519859 488060 487105
13504 487105 492159 467415 449792 442680 457072 466486 461739 451607 438492 433819 425009 420983 415523
13491 415523 398959 380806 377649 363537 385122 378988 351513 344691 329105 338626 335596 315835
13479 315835 289863 289003 283319 285137 294009 290825 301767 308492 309118 302032 279780 254703 238550
13466 238550 264928 272058 269725 303581 286167 240121 212386 216388 212279 215296 204001 194138 185559
13453 185559 200988 207095 189783 170745 147893 152895 173564 167182 158387 146284 188341 209306
13441 209306 201288 195417 158973 134575 131046 153794 157747 162134 152892 150023 166025 180632 136630
13428A36630l255K0491L858m1356l1653J4229J3715J783J2292O763k4022j7087
13416I2388J6329Q984j7339K1190P215k4222O744M4195N014N171k3715q429p38
13403A32787j6953J2240J4105r468j2619K9167P111p304k929K4019J9283m2676
13391A46763k0083O080J9234L7230O73L535r494k4167j5832J8501j3212k8108
13379A21120j2658p387J0896J3780J7224R9J5190J5413p497K946j4582K2056J1481
13366A88081j1799j93j5878n68n532j4447k3590R75M4385J5153j4335j3045Q400
13353A57607p944n636j8205J2152J5305j4901k4117J6351O474n258j8734k6911
13341H6183k2839J6585Q123J2830J0104l388k2000l046K8652J111k0253j1200
$$ plain form
13428 136630 133375 153866 157724 116368 84715 98944 112659 114442 126734 133497 109475 92388
13416 92388 108717 117701 100362 121552 128767 104545 111289 155484 160498 165669 141954 133525 132787
13403 132787 115834 128074 142179 132711 120092 149259 156370 149066 146137 170156 189439 146763
13391 146763 126680 132760 151994 189224 189897 193432 183938 159771 143939 162440 149228 121120
13379 121120 108462 101075 111971 125751 142975 143074 158264 173677 166180 169126 154544 176600 188081
13366 188081 176282 176089 160211 159643 154111 139664 116074 117049 161434 176587 162252 149207 157607
13353 157607 149663 144027 125822 137974 153279 138378 114261 130612 137086 131828 113094 86183
13341 86183 63344 79929 88052 100882 110986 107598 85598 82552 111204 112315 92062 80862
13329H0862K3048l533j5824J4873N91J4825o842j873k0007n010K93O683j5581
13316G2505J4063n299q092J4534J4642K565j013J7464r789k1743n309J3349j760
13303I6117J3149L0685J2394O879R136O588M045K2038K3604k4273J6998L565K8851
13290B49776J3246j0091k429J8179O157K4839L3464J0570j272J0413M4396K1900
13278D19148K7478q054J3350Q446J6997K2499L5532j0340M338K3425m355j1862
13266E36602n2204O21l815l5342r339j6034j0383J1627j7108l0434j2875k8705
13254C32611j0849k5479k6257N898J9379J022l850J3220L215l3413m5748n077
13242B24672l108k188k1998k2718L992K9670n383k083J7612J0626l1162l8295
$$ plain form
13329 80862 103910 100377 84553 99426 100017 114842 108000 106127 86120 81110 81403 88086 72505
13316 72505 86568 81269 73177 87711 102353 104918 103905 121369 111580 89837 84528 97877 96117
13303 96117 109266 139951 152345 159224 168360 174948 178993 201031 224635 200362 217360 220925 249776
13290 249776 263022 252931 250502 268681 274838 299677 333141 343711 342439 352852 397248 419148
13278 419148 446626 438572 451922 460368 477365 499864 535396 525056 529394 552819 548464 536602
13266 536602 484398 485019 481204 445862 436523 420489 410106 421733 404625 374191 361316 332611
13254 332611 321762 296283 270026 275924 295303 296325 292475 305695 308910 275497 229749 224672
13242 224672 221564 219376 197378 174660 178652 208322 202939 200856 218468 229094 197932 159637
13230A59637P371q29j4323L391j5699k3160j6445K6631j620q011r134K1090o24
13217A28275k7606l700J444n515j5066J150L4j2269K577j3512p259N600K0119
13204G4272P694M701J964r078m1322p234J6814K0371j0157j6047j2341M436O439
13191D0512p916l446o172o419L250K3912R55k2189n692M661M357j7175O537j6770
13177a595l969J2828O740N860q980J0941J506k2845j5001P908J9589N084R832
13164B7898N120q718j4522K1870N695j8686J3333J6599J3933k4881k0986j4525
13152B130n093O291M544J1656J1750q78o487j8183q232Q359j4182N392J5201r602
13138B666N565k4223o249J8924N52j0549N185J5431K3254L4597J2089q508k1905
$$ plain form
13230 159637 167008 166179 151856 155247 139548 116388 99943 126574 124954 116943 107809 128899 128275
13217 128275 100669 96969 98413 92898 77832 78982 79016 66747 69324 55812 48553 54153 74272
13204 74272 81966 86667 88631 79553 38231 30997 47811 68182 58025 41978 29637 34073 40512
13191 40512 32596 29150 22978 16559 19809 43721 44676 22487 16795 21456 25813 8638 15175 -1595
13177 -1595 -5564 7264 14004 19864 10884 21825 23331 486 -14515 -6607 12982 18066 27898
13164 27898 33018 24300 9778 31648 37343 18657 31990 48589 62522 37641 16655 2130
13152 2130 -2963 3328 7872 19528 31278 30400 23913 5730 -2502 5857 -8325 -2933 12268 2666
13138 2666 8231 -15992 -22241 -3317 -2765 -13314 -8129 7302 30556 65153 77242 68734 46829
13125D6829j0803p817q610n498j3128L239J4544k2578j7610p986J3572j1268O051
13112b1063L1475J8742j0367k2949Q701J7296K5912j7284r026k382K1255J252
13100D1562k2520J5630j9265K2390L4630k0161n3474j0284J1946J5408J3859J653
13088C1374l970j3843j3175p963N58J2903L1693O935j414k3194j4841O597J6259
13075B7919r912j4254o910Q448j4226k4244r457O630k447J6629J692Q583J2029
13062D80J0322j3218K526J0323J695j0067P429j7939L303J3327j8086m979K3020
13049H136K1839j08q578j4388J1031j2117M039L2938j0958J0496j7718j3926j1985
13036a299j1249m622j050J0444J2070l78N54L1499J7484j1274O975L174j4128
$$ plain form
13125 46829 36026 28209 19599 14101 973 4212 18756 -3822 -21432 -29418 -15846 -27114 -21063
13112 -21063 10412 29154 18787 -4162 4539 21835 47747 30463 21437 19055 40310 41562
13100 41562 19042 34672 15407 37797 72427 52266 -1208 -11492 454 15862 29721 31374
13088 31374 27404 13561 386 -7577 -7019 5884 37577 44512 43098 19904 5063 11660 27919
13075 27919 18007 3753 -3157 5291 -8935 -33179 -42636 -36006 -38453 -21824 -20132 -11549 480
13062 480 10802 -2416 110 10433 12128 2061 9490 -8449 -5146 8181 -9905 -14884 8136
13049 8136 29975 29867 21289 6901 17932 5815 9854 42792 31834 42330 24612 10686 -1299
13036 -1299 -12548 -17170 -18220 -7776 4294 3916 4470 35969 53453 42179 49154 52328 38200
13023C8200M012M57l626j4446l3684j4088m829J8201J7978R355k0864k0276L9529
13010A5919P6571O652j1194j7534l4578j1227J6130J9093m444Q742r389o73q058
12997D6010j6871k3876k5821n078l873Q633K0959J9215J9278q699K2819J8402
12985G1098l1320j5119L1382p141k0972k084J8537J4580n567k2825j8789K4254
12973C6034M5294k4221m3111j0747K823J943J5098j723j0692J4791Q283J4333
12961D8105n524l315n394L225J75q262M479P203k1448L238m157P339J7046J7580
12947F0290k9967j6083J0p101J896m526j5704j1956Q528L5971R711k7578J3174
12934A6665l094o30P950l24n998q140p650J1361k2100n388R870J4302J0820J7163
$$ plain form
13023 38200 42212 42669 39043 24597 -9087 -23175 -28004 -9803 8175 17530 -3334 -23610 15919
13010 15919 92490 99142 87948 70414 35836 24609 40739 59832 55388 64130 54741 54068 46010
12997 46010 29139 5263 -20558 -25636 -29509 -20876 83 19298 38576 29877 52696 71098
12985 71098 39778 24659 56041 48900 27928 25844 44381 58961 53394 30569 11780 36034
12973 36034 81328 57107 13996 3249 6072 8015 23113 21390 10698 25489 33772 48105
12961 48105 42581 39266 33872 37097 37272 29010 33489 40692 19244 22482 18325 25664 42710 60290
12947 60290 30323 14240 14250 7149 9045 4519 -11185 -23141 -14613 21358 31069 3491 16665
12934 16665 13571 12941 20891 20567 14569 6429 -1221 10140 -11960 -17348 -7478 6824 17644 34807
12920C4807M46N731o929l2735j3545j8233K539L9688M7088K6040k433k6962k3636
12907C1866k3545m06J2967J4657j2325o89K1570Q41q892j0702J3013K3251L523
12894F5129J7353j4717k1882j5227q005o935L1345N670j3265N984m513k2842m452
12881A3643n497j0044n533o025l405J2989K4589j1458J4251N635o224k5015m178
12868f272Q691j349J773j659L669M060L1873l600k3832j488j8672q566J5562j590
12854a400N0102J7394J6791k3664k8414l2576K01n907n604J890l689J4206k2643
12841b3313J0177J1194P213k148J8398Q50r494J0316J8678K7948L6026R891j2282
12828A03454m8328j2888l016j3953L7851J5970N432K0913J4644Q341O2986Q3389
$$ plain form
12920 34807 35253 40984 34055 1320 -12225 -30458 -27919 11769 58857 84897 82464 55502 31866
12907 31866 8321 7915 20882 35539 23214 22525 44095 44936 36044 25342 38355 61606 65129
12894 65129 82482 67765 45883 30656 22651 15716 47061 52731 39466 45450 40937 18095 13643
12881 13643 8146 -1898 -7431 -13456 -16861 -3872 20717 9259 23510 29145 22921 -2094 -6272
12868 -6272 2419 1070 2843 1184 4853 8913 40786 37186 13354 11866 -6806 -15372 190 -1400
12854 -1400 48702 66096 82887 59223 30809 -1767 -1566 -7473 -13077 -11187 -14876 -670 -23313
12841 -23313 -13136 -1942 5271 3123 21521 22371 12877 23193 41871 69819 105845 115736 103454
12828 103454 55126 42238 39222 25269 63120 79090 84522 105435 120079 128420 191406 274795
12816B74795K8842o2877r6779m0143j1304K249j4776N873q560Q846M803q987j1242
12803G0740k7459K399J5567R682j3897l782k610j6853l4301N63K7994l0044N650
12790C649J6812j725n813J0226K6633O859K7571J4447j0093l7667k9085r573K655
12777A4896j602p894J9407J3699j8449j0290J2368Q645L980j1962N70M309l1897
12764d220k2325K1526K4091J558K2395k0205k2825K747L478j2771k1237j4833
12752d2621n973J7686P631M289p252J1742K203Q231o145K3519K2709p560o717
12739B1742O622n089l7391k3413R489J2309O189K0839N276m829j2594J7197J1517
12726B7864j08k0466L191L9971J5514j2630j6311l76L10k1690j2106M245Q791
$$ plain form
12816 274795 303637 240760 143981 103838 92534 94783 80007 85880 77320 86166 90969 81982 70740
12803 70740 43281 45680 61247 70929 57032 53250 50640 33787 -514 49 28043 -2001 3649
12790 3649 20461 18736 12923 23149 49782 56641 84212 98659 88566 50899 21814 12241 14896
12777 14896 13294 5400 24807 38506 20057 9767 22135 30780 34760 22798 23368 27677 -4220
12764 -4220 -26545 -5019 19072 20630 43025 22820 -5 2742 6220 -6551 -27788 -42621
12752 -42621 -48594 -30908 -23277 -18988 -26240 -14498 -12295 -4064 -10209 13310 36019 28459 21742
12739 21742 28364 23275 -14116 -37529 -28040 -15731 -9542 11297 16573 11744 -850 16347 27864
12726 27864 27756 7290 10481 50452 65966 53336 37025 36649 36959 15269 3163 7408 16199
12713A6199Q130K4821Q635J2884K2331J004l6636m0699p90J1620K3736J1119k2673
12700C9681k2839j6188K3896o719O626K5734J4055m549m7113Q770K9850Q676p686
12687E2194k4357J6987P189l1867R740M0557M131m0307j5601K252L4369p03J9379
12674G3963j7350k2960K7458L525l8499O06K2907j0099K532J0254n724j8163j0572
12661A7878K4017J3011j4508J525O780J9824K6977J6064P916K4843J1001J9328
12649A74656J7670P182J4358N2868K6318q157k2588J7679k8791k5221k0320k4005
12637A81649j1609k6872K3653m629j6116j370j9311k990R573K671J1558K2001
12625A68208o727k1006k3345J8319L3785P075j2980J8149K0178O90J9561L8923
$$ plain form
12713 16199 24329 49150 57785 70669 93000 94004 57368 16669 15879 27499 51235 62354 39681
12700 39681 16842 654 24550 17831 24457 50191 64246 59697 12584 21354 51204 59880 52194
12687 52194 27837 44824 52013 20146 29886 70443 74574 34267 18666 20918 55287 54584 73963
12674 73963 56613 33653 61111 64636 26137 26743 49650 39551 42083 52337 46613 28450 17878
12661 17878 41895 54906 40398 41923 48703 68527 95504 111568 119484 144327 155328 174656
12649 174656 192326 199508 213866 266734 293052 284895 262307 279986 251195 225974 205654 181649
12637 181649 170040 143168 166821 162192 146076 144706 125395 122405 131978 134649 146207 168208
12625 168208 161481 140475 117130 135449 169234 176309 163329 181478 201656 202346 221907 260830
12613B60830L7983m825K9339R7l550J3269R780J5529K3527O9837Q6787Q6859P1759
12600F97221M8556J8450j7261l3523j4984p2483m7896j7298o3395o2025j5479
12589D19883k1708l1220K710j0957k4246j9236l823J5982K1945o647l0010o763
12577C05910R298K7180n812K0043N3312j1124l6740m378M3946N6750K1143l881
12565D75647O646J2873L2801M7421Q0891Q6852Q5548O8549P5201M6846M2366K3835
12553A085476l1140o8478p3641m9402q6526o6096m6993m0645l1442k9492O999
12542E68620J6621K096k1385l4549j4371o566J4245K7494r319M000M8906M1611
12530F37403J4588k6444l4708j8038P624q528L8630K1171K991L3750M9322Q0542
$$ plain form
12613 260830 298813 293988 323327 323424 319874 333143 342923 358452 381979 451816 538603 625462 697221
12600 697221 745777 764227 746966 713443 698459 625976 578080 560782 497387 435362 419883
12589 419883 398175 366955 369665 358708 334462 315226 311403 327385 349330 342683 312673 305910
12577 305910 315208 342388 336576 356619 409931 398807 362067 357689 401635 458385 479528 475647
12565 475647 482293 495166 527967 575388 656279 743131 828679 897228 972429 1019275 1061641 1085476
12553 1085476 1054336 985858 912217 862815 776289 710193 663200 622555 591113 561621 568620
12542 568620 585241 587337 565952 531403 517032 510466 524711 552205 542886 546886 595792 637403
12530 637403 651991 625547 590839 572801 580425 571897 610527 631698 634689 668439 717761 798303
12518G98303P8440O5775K3208n846l8627o5823k715L6869k0382j6765l8223m8789
12506G65425m1272l4961m9867m485K7954L360n5105l1602j3122k5077k6723P893
12494E22418R772k918j7496K523k148l2892L258L525j4492M303K35M675M9660
12481E30423M401j244p122j2910j1588K528R766J8914k8231l1612m1694l683M092
12468D32040k9118k7350n27K2490J9628j1197k6823J1157k0956m7208k5754N264
12456C01646J3807J1188j7622n381l9724K508M4343l083j6836J2078K6469P281
12444C36674K3848L373l610q960m434o90N703J5242N591j4913j7039K3237k0671
12431C43351k1639j1021o378J4040J9552j7898p381p687K4518q784J3374K2170
$$ plain form
12518 798303 876743 942518 965726 959880 921253 855430 852715 889584 869202 852437 814214 765425
12506 765425 724153 689192 639325 634840 662794 666154 611049 579447 566325 541248 514525 522418
12494 522418 532190 529272 511776 514299 512151 479259 482517 486042 471550 475853 476088 480763 530423
12481 530423 534824 533580 526458 513548 501960 504488 514254 533168 504937 473325 431631 427948 432040
12468 432040 402922 375572 375045 397535 417163 405966 379143 390300 369344 322136 296382 301646
12456 301646 315453 326641 309019 303638 263914 266422 310765 307682 290846 302924 329393 336674
12444 336674 360522 363895 360285 351325 346891 346201 351904 367146 372737 357824 340785 364022 343351
12431 343351 321712 310691 304313 318353 337905 320007 312626 304939 329457 320673 334047 356217
12419C56217j0508l1900n589Q15j1112j7453p250J0106P950J7093K2072o322L1466
12406C55585K926j0617J0476j3768j9789k8735J4831Q246q3J4690J8586j5223
12394C37125p857j1846j0178J6704J3291M352k4832n1334j6612L1540L2234k5771
12382B86816j7309j8981k9307Q303K9882M66j8380j6170K34J8615J5563P520k1112
12369B46140k9555l678k051k388O159J5222j7329k2872j1665O818R095K3079L0128
12356B47103K2l5585q738j4851J3886L8501k976M53J8727L1411Q78o430o582q130
12342B67689O726M384o081L0763O543r113j2618m2469k7898P275K1061J669J877
12329B49808r168j5085J012N194K789J99M683J4494N105N778j3747P198J2824
$$ plain form
12419 356217 345709 313809 308220 309035 297923 280470 273220 283326 291276 308369 330441 324119 355585
12406 355585 358511 347894 358370 344602 324813 296078 310909 319155 319072 333762 352348 337125
12394 337125 329268 317422 307244 323948 337239 341591 316759 265425 248813 280353 312587 286816
12382 286816 269507 250526 221219 229522 259404 259870 241490 225320 225554 244169 259732 267252 246140
12369 246140 216585 212907 210856 208468 214627 229849 212520 189648 177983 184801 193896 216975 247103
12356 247103 247125 211540 202802 187951 201837 240338 237362 237815 256542 287953 288831 282401 275819 267689
12342 267689 274415 278799 272718 303481 310024 300911 288293 245824 217926 225201 246262 247931 249808
12329 249808 240640 225555 226567 231761 234550 234749 239432 253926 259031 264809 251062 258260 271084
12316B71084J1542K8306P466M185M689K4898M937K4710J5656L1475r397p295L6017
12303D48273L0495J0072L6348M0420p893J4715K7984j008R498M1301J5763K098
12291F68066p810o782J2718K6988J1975J2800P463k0976Q457O362J4261K8708
12279G62230K8388L2141N0681M8881M6139J9687j8034L0278L0557L435K9006p121
12267A056268L6077Q1273Q3045M6498L2414M6786L1534N8312K4268O6285O7870
12256A630630O6786Q3338Q5430Q7505R0046J11042J06257J28508J18523J36357
12246B644422J70352K36740K72933K96580L30548M34691N23811N91593O98469
12237F200139Q23597R21976R59714R15221Q63044P77468O63630N98199N54350
$$ plain form
12316 271084 282626 310932 318398 322583 327272 352170 357107 381817 397473 428948 419551 412256 448273
12303 448273 478768 488840 525188 565608 557715 572430 600414 599406 608904 650205 665968 668066
12291 668066 660256 653474 666192 693180 705155 717955 725418 704442 712899 719261 733522 762230
12279 762230 790618 822759 873440 922321 968460 988147 970113 1000391 1030948 1034383 1063389 1056268
12267 1056268 1092345 1173618 1256663 1303161 1335575 1382361 1413895 1472207 1496475 1562760 1630630
12256 1630630 1697416 1780754 1866184 1953689 2043735 2154777 2261034 2389542 2508065 2644422
12246 2644422 2814774 3051514 3324447 3621027 3951575 4386266 4910077 5501670 6200139
12237 6200139 7023736 7945712 8905426 9820647 10683691 11461159 12124789 12722988 13277338
12228A3277338O18358Q72995J276673J851773K662658L561913M492170N171678
12220C3785556N189574M256816K553951M57663j750165l472425m351137m372880
12212C2296953l757146k969606k268062j697465j286162j000258p76945o06873
12204A7934436m42771l21135j67089j4426J59381L32260N33369P56114J028842
12195A9798981J335060J713893K088981K495061K847998K977429K918341K602224
12187C8777968K132685J602420J216554J126805J440184K263601L654032N585023
12179E7799272Q133634J1243942J4608259J7404505J8123930J5183827Q034090
12172A50531459j722299j0622839j5703023j6539231j4658996j1760833r049595
$$ plain form
12228 13277338 13895696 14768691 16045364 17897137 20559795 24121708 28613878 33785556
12220 33785556 38975130 43231946 45785897 46243560 44493395 41020970 36669833 32296953
12212 32296953 28539807 25570201 23302139 21604674 20318512 19318254 18541309 17934436
12204 17934436 17491665 17170530 17003441 16989015 17148396 17480656 18014025 18770139 19798981
12195 19798981 21134041 22847934 24936915 27431976 30279974 33257403 36175744 38777968
12187 38777968 40910653 42513073 43729627 44856432 46296616 48560217 52214249 57799272
12179 57799272 65932906 77176848 91785107 109189612 127313542 142497369 150531459
12172 150531459 148809160 138186321 122483298 105944067 91285071 79524238 70474643
12165G0474643o855229n252411m120336l292466k717990k307514j998725j735510
12157D2194462j413771j099548p86647m46598j64482J69720N26672R70347J448997
12148D1399152J936924K383344K734825K866449K752024K439784J966740J479395
12140E9958637J143305J005215J317665K198184L628769N718366Q466083J1757421
12132I5193645J5188313J7625174J7405016J3005917M495516n664919j3636364
12125A43612298j7262972j7057203j4648615j1649459q991765o939801n462116
12118F1600367m390412l614565l082997k722752k409464k172081j888528j615329
12110C9704239j362476j124175r03943o41632m46025k40688K0491K38333L80946
$$ plain form
12165 70474643 63619414 58367003 54246667 50954201 48236211 45928697 43929972 42194462
12157 42194462 40780691 39681143 38894496 38447898 38283416 38453136 38979808 39950155 41399152
12148 41399152 43336076 45719420 48454245 51320694 54072718 56512502 58479242 59958637
12140 59958637 61101942 62107157 63424822 65623006 69251775 74970141 83436224 95193645
12132 95193645 110381958 128007132 145412148 158418065 162913581 157248662 143612298
12125 143612298 126349326 109292123 94643508 82994049 74002284 67062483 61600367
12118 61600367 57209955 53595390 50512393 47789641 45380177 43208096 41319568 39704239
12110 39704239 38341763 37217588 36313645 35672013 35225988 34985300 35005791 35244124 35625070
12101C5625070N68982O77506O55537O09668N35864M25851K85507J89090K45949
12092C9819024M40137Q56870J551163K485104L505588M358790M501879L667964
12084F1186519J852306m25022k713704m504213n504186n574809m974385m145891
12076C5196615l337358k667096k204679j850199j555874j360698j199175j127766
12068A9893770j048569r01877q27038p38586o25814n84404n72288n25408m50957
12059A3618829l95325l45116k93695k43229k37130j97704j55602j51658j82998
12050A1416372k06162k92811l31856l40890m14322m04466l74256m00676m14929
12041H236004l90644l44195l24228l40011l16159l00785k95235k49759k29798
$$ plain form
12101 35625070 36194052 36871558 37527095 38136763 38672627 39098478 39383985 39573075 39819024
12092 39819024 40259161 41116031 42667194 45152298 48657886 53016676 57518555 61186519
12084 61186519 63038825 62613803 59900099 55395886 49891700 44316891 39342506 35196615
12076 35196615 31859257 29192161 26987482 25137283 23581409 22220711 21021536 19893770
12068 19893770 18845201 17943324 17116286 16377700 15751886 15167482 14595194 14069786 13618829
12059 13618829 13223504 12878388 12584693 12341464 12104334 11906630 11751028 11599370 11416372
12050 11416372 11210210 10917399 10585543 10244653 9830331 9425865 9051609 8650933 8236004
12041 8236004 7845360 7501165 7176937 6836926 6520767 6219982 5924747 5674988 5445190
12032E445190k26120k26519j86688j80857j81600j92364j98973j66838j83369
12023C701862j56281j55587j53445q7755p8214j21144j39103j27045r1706r8284
12013B493298j09122r7742l9673o5703m3847k8564n6663m8042o2847m2975l8581
12002A859539l5563j6620j7248k5852k8942k7253o2648l7845k8602j7571R838
11991A571233J1676j4325j150j5227J950J5339K50j1167l3771j4464k9800k2124
11979A458420l4187n6776o3417l2959k3445l4977k9232k7820k5858l984L070k204
11967A126631q127m952k0098l1126j7114J6268J4403J682N363l1307K188K0898
11955A074709P779L3313L1342m0983k6426l506L365L5781J1931n281l365r861
$$ plain form
12032 5445190 5219070 4992551 4805863 4625006 4443406 4251042 4052069 3885231 3701862
12023 3701862 3545581 3389994 3236549 3148794 3070580 2949436 2810333 2683288 2591582 2493298
12013 2493298 2384176 2286434 2246761 2181058 2137211 2108647 2051984 2003942 1941095 1898120 1859539
12002 1859539 1823976 1807356 1790108 1764256 1735314 1708061 1645413 1607568 1578966 1561395 1571233
11991 1571233 1582909 1568584 1567434 1552207 1554157 1569496 1569746 1558579 1524808 1510344 1480544 1458420
11979 1458420 1424233 1367457 1304040 1271081 1247636 1212659 1183427 1155607 1129749 1125765 1128835 1126631
11967 1126631 1118504 1113552 1093454 1062328 1045214 1061482 1075885 1077567 1082930 1051623 1053811 1074709
11955 1074709 1082488 1115801 1147143 1106160 1079734 1076228 1079593 1115374 1127305 1122024 1118659 1108798
11943A108798K3483R9l5520l7926j2801k071j7640k3365J6731o703j2587K5893
11931A026391k2931l6004m906M592k0946k1044O70p242M129l823K073k0875M795
11918I04879R314l767k4957p35k9441k1194p715j546o315J151P236N814l347j5719
11904H13658J1705R770k5004k8023j0242r831k6353m8393Q80L63j9358K6014K0681
11891G15867o184k1420j457J2714M60j2207k5466l1677k5278N839K0219l20k4709
11878F06381k7420k738K08R503L753k0213l1924j9116j8824p252j8980R90j29
11865D74239j0482n080l4159o289P169n133J5269q994k5170N875N181q50N024
11852D16600K4555J1349m089k498k6816j9178K433K5780J0847r719J980J7763
$$ plain form
11943 1108798 1132281 1132380 1096860 1058934 1046133 1044062 1026422 1003057 1019788 1013085 1000498 1026391
11931 1026391 1003460 967456 962550 967142 946196 925152 925822 918580 922709 918886 920959 900084 904879
11918 904879 914193 910426 885469 884734 855293 834099 826384 824838 818523 819674 826910 832724 829377 813658
11904 813658 825363 835133 810129 782106 771864 762033 735680 687287 688167 688530 669172 695186 715867
11891 715867 709683 688263 686806 699520 699980 687773 662307 630630 605352 611191 631410 631090 606381
11878 606381 578961 576223 576431 585934 589687 569474 537550 518434 499610 492358 473378 474368 474239
11865 474239 463757 458677 424518 418229 425398 420265 435534 426540 401370 407245 412426 411576 416600
11852 416600 441155 452504 448415 445917 419101 399923 402356 428136 438983 429264 431244 449007
11840D49007l258j7203K0968j0039k6081l619k7027n703J448l575L015k7843l1890
11827C18200n489j605N400J0804p187K5806L6170Q759J8114O480j5060l2222j5769
11814C52401J4097L0841L0457o444q095J5045J209l4564o941r037j5366L6990
11802D00593J456q755K738j4244K7664J6331j2269j2405k837N1920M4151J1556
11790E05899K7815K79M7093K8930P944K696P13j9303k1590k4286k9280j0218j130
11777E15562j5153k2706N362J8923J7647J1465k4408l5387k2863J976J7602N2745
11765E20765L5688K826L058j8974j9404Q127L0718j1606j1575Q46K5023J5231
11753E80723O64N095L4583K6452O557j0232K4968N4460L8045N9004J11840Q4015
$$ plain form
11840 449007 445749 428546 449514 439475 413394 409775 382748 377045 378493 374918 377933 350090 318200
11827 318200 312711 311106 316506 327310 320123 345929 382099 390858 408972 415452 400392 368170 352401
11814 352401 366498 397339 427796 421352 413257 428302 429511 394947 388006 378969 363603 400593
11802 400593 402049 393294 396032 381788 409452 425783 413514 401109 398272 450192 494343 505899
11790 505899 533714 533993 581086 610016 617960 620656 621369 602066 580476 556190 526910 516692 515562
11777 515562 500409 477703 483065 501988 519635 531100 506692 471305 448442 450418 468020 520765
11765 520765 556453 559279 562337 543363 523959 532086 562804 551198 539623 540469 565492 580723
11753 580723 581387 586482 621065 647517 654074 643842 668810 723270 761315 820319 932159 1016174
11741A016174O6582K3294l8562m8942o2551p5966p3204n9460k9124k0481J0405
11730G08165O883k1883j7167k1891l3635n0072k8244J6702P612j4360J6557K5095
11718E93762K9659j775l0627m879M657k4389k7301p401m898M0559L5234L3824
11706F36425j4128J2443Q506L2890j28J7150M9767P5441Q2109O6932L0540K0213
11694A018160l345o2993m1610p3390q4684o5136k1254l6694j6664j8005l984k1494
11682E68907j4276k914l4969j7349l947l1667p549J8794R535p903q834j9057j1492
11669D37279K0439j9219j1163J5280j4645m1867k2231J925o330j7325R974K5064
11657C77181k752q325M2187L0705J7693K3616j4889j8672k1164M769K1464l819
$$ plain form
11741 1016174 1082756 1106050 1067488 1018546 955995 880029 806825 747365 718241 697760 708165
11730 708165 715048 693165 675998 654107 620472 570400 542156 558858 566470 552110 568667 593762
11718 593762 623421 621646 591019 586140 590797 566408 539107 531706 526808 567367 602601 636425
11706 636425 622297 634740 643246 676136 676008 693158 742925 818366 900475 967407 997947 1018160
11694 1018160 1014815 951822 910212 836822 752138 687002 665748 629054 612390 594385 590401 568907
11682 568907 554631 551717 516748 499399 495452 463785 456236 475030 484565 476662 467828 448771 437279
11669 437279 457718 438499 427336 442616 427971 386104 363873 365798 359468 342143 352117 377181
11657 377181 374429 366104 408291 438996 456689 480305 465416 446744 425580 430349 451813 447994
11645D47994j9974n1775m6373r445L944j4963k4483k5398k8749r728j9747J0620
11633B11923M1108o774j2993K0957K324j4625m693j8160K1110J370j6611K385
11621B27321P247J9547k90l9569k2158L207j4084j7228L505O333j9374j9163K3981
11608A59275k573l4424j4743K1995L1525K3839j6638k951L1584o636o47n9822
11596A29784k0147J9864J6817L823j6822Q127J563J8026Q121j4669l645J2147
11584A62989L4949L378k1009k6293k2386K099j4098P348K0633J660j2515j4051
11572A22704R741J6795J3612k1194l3456J436j4057N147J6821J0703q225j5720
11560A04307p497R335J7266j0704k0434J1396J2843K3855M048j6657j9544j0431
$$ plain form
11645 447994 428020 376245 329872 320427 324371 309408 284925 259527 230778 221050 201303 211923
11633 211923 253031 246257 233264 254221 256545 241920 237227 219067 240177 241547 224936 227321
11621 227321 234568 254115 253825 214256 192098 195305 181221 163993 167498 173831 154457 135294 159275
11608 159275 156702 122278 107535 129530 161055 184894 168256 165305 196889 190253 189606 129784
11596 129784 109637 129501 146318 150141 133319 141446 143009 161035 169156 154487 150842 162989
11584 162989 197938 201316 180307 154014 131628 133727 119629 126977 147610 149270 136755 122704
11572 122704 132445 149240 162852 141658 108202 109638 95581 100728 117549 128252 120027 104307
11560 104307 96810 106145 123411 112707 92273 103669 116512 140367 144415 127758 108214 97783
11548I7783J1405k2292j1498J1908J4416M542J792P524j9427k353J6157p951K1184
11535A23190R176q846q797k4439J1332N7770j3003l5569j9489J4574j3579Q322
11523A00642M5075J7638q69j4195k6271o844J6966J774K419o057m225L2130j3645
11510A44538K1905p957k5109o344K7516K8872l014K5690J47P921K6556M3086M7714
11497C31521M2042N1407P7064J10725J37261J75945K14198J94257K13943J73287
11487A721650J15432K2465k6227l4506l3251L1192J00420K20922L95296O13436
11477C126829Q89123J329354J888489K076179J353107l18938j800256j990107
11469F553780j412861q98223o33774m71885l16674k05813j92134j73979j01466
$$ plain form
11548 97783 109188 86896 75398 87306 101722 106264 108056 115580 96153 93800 109957 102006 123190
11535 123190 132366 123520 114723 90284 101616 159386 146383 110814 91325 105899 92320 100642
11523 100642 145717 163355 162486 148291 122020 115176 132142 133916 136335 130278 126053 158183 144538
11510 144538 166443 158486 133377 127033 154549 183421 180407 206097 206244 214165 240721 283807 331521
11497 331521 373563 424970 502034 612759 750020 925965 1140163 1334420 1548363 1721650
11487 1721650 1837082 1859547 1833320 1798814 1765563 1796755 1897175 2118097 2513393 3126829
11477 3126829 4015952 5345306 7233795 9309974 10663081 10344143 8543887 6553780
11469 6553780 5140919 4242696 3608922 3137037 2820363 2614550 2422416 2248437 2146971
11460B146971j31775j57628j32324p6742m4391l0950m2183m1247p6264n3817k6138
11449A333512k7576j4128k2872l5785j8623J0320n581J8289L5849K199m587j1921
11437A259096l9941m8487l5883m2251n5461m9095o7770o6414n6690m4426j3232
11426G39446k8873l1777m9864l5636n3432j6306l7676k6764l4348r765q206l4640
11414C72159n1715L275J4509j8878r385j9121m3979P586R800j0579l2885J007
11402B21794J3513K082r319m488P050j3647Q052j5891k1738J1363P2181M7326
11390C18278J958N336j9493m3056m8898j2963j1709j3246k2363j422q703j5318
11378A28401Q803L3161N103m8646J3575j1374j5624r152N424j0014q773K5105
$$ plain form
11460 2146971 2015196 1857568 1725244 1648502 1604111 1573161 1530978 1489731 1413467 1359650 1333512
11449 1333512 1305936 1291808 1268936 1233151 1214528 1224848 1219267 1237556 1273405 1275604 1271017 1259096
11437 1259096 1219155 1170668 1134785 1092534 1037073 987978 920208 853794 797104 752678 739446
11426 739446 710573 678796 628932 593296 539864 523558 485882 459118 424770 415005 406799 372159
11414 372159 320444 323719 338228 319350 309965 290844 246865 254451 264251 253672 220787 221794
11402 221794 235307 237389 228070 223582 230632 216985 225037 209146 187408 198771 270952 318278
11390 318278 320236 325572 306079 263023 214125 201162 189453 176207 153844 152422 143719 128401
11378 128401 137204 170365 175468 126822 140397 129023 113399 104247 109671 99657 90884 115989
11366A15989j108Q674k6855l2868l248J04J0177j836j8851O442J1941o927j892
11353E9742K8312j1069J6358K6807j2782n0822j1025K0862J4243l6500j9456J9850
11341D4520J8506k0302k5409J4644n694j4003O620K4981J9455k4119o72J9306
11329E7833K764k2527L698J4331l0901K059l324K8914O668l0334o086k592J3898
11316C4401J4465j8715m1923J1071L5428J4979Q386L1132r483k0401k9393l103
11304B6844p267J7455L610n024m226l638r959n058J9866J1041k0781L0541L226
11291E6630j5855j2178k9108n461L8665K8489K5445j2259j0671l2596k7118k2433
11279a8450k4780K0393K3873J1146K0120K1709K051O599J6216j0883m2071o451
$$ plain form
11366 115989 114881 123555 96700 63832 60584 60688 70865 69029 50178 56620 68561 61634 59742
11353 59742 88054 76985 93343 120150 107368 56546 45521 66383 80626 44126 24670 44520
11341 44520 63026 42724 17315 31959 26265 12262 18882 43863 63318 39199 38527 57833
11329 57833 60597 38070 41768 56099 25198 27257 23933 52847 59515 29181 23095 20503 34401
11316 34401 48866 30151 -11772 -701 34727 49706 58092 89224 79741 59340 29947 26844
11304 26844 19577 37032 40642 35618 31392 27754 17795 12737 32603 43644 22863 53404 56630
11291 56630 40775 28597 -511 -5972 32693 61182 86627 74368 63697 31101 3983 -18450
11279 -18450 -43230 -22837 1036 12182 32302 54011 56062 62661 78877 67994 25923 19472
11267A9472J3406J3945K300R674R57R42j8183n37M500k9577k1946K0630J5165
11254C0748Q060n831l826m427o114k400L0706J4286p41k0492j2734O614L353j3521
11240B3681l9744R735L4048K7767J3794p743l0277k3250M896k4030o89J0953j3743
11227a4602K2129K5369L199j680N606M945J0332L049k0948j8615n991m943n443
11214B407J0641N224J1343k2599k219K2901K999J1412j5358K594M303k6335j5526
11201h213n29l549n663J5427K950J0030K0337o503q812l103M596K7255N973p288
11187D2908j3628P649N174j7864n124K578K6154r888n017J0282L400j385l165
11174D2074p538P32k0895O938K8580J7422j4354J1230k4062m4557k0924K592J006
$$ plain form
11267 19472 32878 46823 49123 58797 59754 60696 42513 41976 46476 16899 -5047 15583 30748
11254 30748 38808 32977 29151 24724 18610 16210 46916 61202 60461 39969 27235 33849 37202 23681
11240 23681 -16063 -6328 27720 55487 69281 61538 31261 8011 12907 -11123 -11812 -859 -14602
11227 -14602 7527 32896 36095 34415 40021 44966 55298 58347 37399 18784 12793 7850 2407
11214 2407 13048 18272 29615 7016 4797 27698 30697 42109 26751 29345 33648 7313 -8213
11201 -8213 -8742 -12291 -17954 -2527 423 10453 30790 24287 15475 12372 16968 44223 50196 42908
11187 42908 29280 36929 42103 24239 19115 21693 47847 37959 32942 43224 46624 45239 42074
11174 42074 34536 35268 14373 21311 49891 67313 52959 64189 40127 -4430 -25354 -22762 -21756
11161b1756P941K9064M3009K391j1384j4805O135K053J2992m999p451j2564p34
11148B9892p763l9012o779j6419k8985J0994K5210l760j433R291m896J3791J5420
11135d449J568j613j3049j0292K2966M696J4522j5242j3764J8839J2824J3618
11123C0624Q431k5153k1096J4429J4350P083m025r124p559j4491j5068J1345J1698
11110A444N590J6128O308p461j4502j0725j4588J296l2142K8055L3615l3450o857
11097b7289R315N94K6999j27j0685o091n755k4766j5546J7784N2801j308l0055
11084a4129R434J4003P113J3111K0121L1694j4029k1486q575k9067j5698j3232
11072b0740L501L312J9511J5671J037j7682k2790J1379q469K757q277O170j3494
$$ plain form
11161 -21756 -13815 15249 58258 60649 49265 34460 40595 42648 55640 50641 43190 30626 29892
11148 29892 22129 -16883 -23662 -40081 -69066 -58072 -32862 -36622 -38055 -28764 -33660 -19869 -4449
11135 -4449 -2881 -4494 -17543 -27835 -4869 -173 14349 -893 -14657 4182 17006 30624
11123 30624 39055 13902 -7194 7235 21585 28668 24643 15519 7960 -6531 -21599 -10254 1444
11110 1444 7034 23162 29470 22009 7507 -3218 -17806 -16510 -48652 -20597 13018 -20432 -27289
11097 -27289 -17974 -17380 9619 9492 -1193 -7284 -13039 -37805 -53351 -35567 17234 15926 -14129
11084 -14129 -4695 9308 16421 29532 49653 81347 67318 45832 37257 8190 -7508 -20740
11072 -20740 -17239 -13927 5584 21255 22292 4610 -18180 -6801 -15270 -12513 -20790 -14620 -28114
11059b8114J0053Q347j5830J7374M327j3481j4368O206J4653K1244j0256m14L705
11046C446J723P31K9062l341j0036j6788O851L7470L3485J3418k8673o939M260
11033F4669J6372j6588k2480j8401J570L3455j5449j2058P268k4771j5242J3462
11021A1807L2649j7623Q445J5205k2977j3125K7500o243r028k8081k0585L2772
11009A0716R215J9862m15K072K8718r962j9194R986j9384n489n130j6882N700
10996I813l490K4381J700j4649j0435k3527l1506J3653O537J3129L2989J0908
10984B9503K3270N320j3883j9929J8587P89j259n2595l7746J1105L0498q326j8191
10971c2857J3152J8910K5436J4523K722K395k1610j8836K3177K1265j728j4157
$$ plain form
11059 -28114 -18061 -9714 -25544 -8170 -3843 -17324 -31692 -25486 -10833 10411 155 -259 3446
11046 3446 5169 5900 34962 31621 21585 4797 11648 49118 82603 96021 67348 60409 64669
11033 64669 81041 64453 41973 23572 25142 58597 43148 31090 38358 13587 -1655 11807
11021 11807 44456 26833 35278 50483 27506 14381 41881 35638 26610 -1471 -22056 10716
11009 10716 19931 39793 39378 41450 70168 60206 41012 50998 31614 26125 20995 4113 9813
10996 9813 6323 30704 32404 17755 7320 -16207 -47713 -34060 -27523 -14394 18595 29503
10984 29503 52773 58093 44210 24281 42868 43657 42398 -10197 -47943 -36838 -6340 -14666 -32857
10971 -32857 -19705 -795 24641 39164 41886 44281 22671 3835 27012 48277 46549 32392
10959C2392J3295K4043l039l064k3880l0531l0052j0401L4071L2061l6816J522
10947c99K5677q117l018J4986J467j4189L691k3008j2191M425L8594K094k9556
10934D56q355N488l58K0265n011J7193j6818j8349m1699K0650k663J2394K7886
10921A1079J6201m248j6288l832J3040j0468q006m186K0372L3601n962J2779m047
10908E0035R054K9303N672l7254j3016k1667j5208J587J2422r981k3275J7778
10896E450J409l052L862J5553L0626K4043L494q208k125j5853j6250j4749j7007
10883G193l1433Q525K0707L224q311N910J8197K5373L051k5168j6937o275r785
10870e729R602J9668j4338j2835J7692l13n119p081Q744L5966K6167j0934j1684
$$ plain form
10959 32392 45687 69730 66691 63627 39747 9216 -20836 -31237 2834 34895 -1921 -399
10947 -399 25278 17161 14143 29129 30596 16407 20098 -2910 -15101 -10676 27918 30012 456
10934 456 -7899 -2411 -2769 17496 12485 29678 12860 -5489 -47188 -26538 -29201 -16807 11079
10921 11079 27280 23032 6744 2912 15952 5484 -2522 -6708 13664 47265 41303 54082 50035
10908 50035 59089 88392 94064 56810 43794 22127 6919 8506 20928 10947 -12328 5450
10896 5450 6859 3807 7669 23222 53848 77891 81385 73177 71052 55199 38949 24200 7193
10883 7193 -24240 -15715 4992 8216 -95 5815 24012 49385 52436 27268 10331 4056 -5729
10870 -5729 3873 23541 9203 -3632 14060 13747 8628 1547 10291 46257 72424 61490 49806
10857D9806n848m767l433k533k6999q89J698j3706J6504Q42n979J1000n071o151
10843D474J0792R101m633q331j4682K090J8249j6362k6872j5842K3974L7541J8557
10830C8056J113M827o034J1142J2274R273Q132j7211j1109p226K2070J7201l342
10817G9166k5361l3180L227J2395n808J6901J7881n390k2800k5618l2422k0938
10805d1947q995L3210K1340j4734p033K0821Q277M94r512L2152j827k53j4459
10792A7534J0304j403l504N549P21O349K9671K821j7562n68l200J8631K2060k898
10778H4505k3240j0092l883J1547j1635k6583k0437K0400j3573P81K571j5270
10766d909r827j0857M814J8732L558J9334O340K8905j6280l5099k5703O416K7466
$$ plain form
10857 49806 43958 39191 35758 33225 6226 5337 7035 -6671 9833 10675 4696 15696 10625 4474
10843 4474 15266 24367 19734 11403 -3279 -1189 17060 698 -26174 -42016 -18042 19499 38056
10830 38056 39169 43996 37962 49104 61378 70651 78783 61572 50463 43237 65307 82508 79166
10817 79166 53805 20625 23852 36247 30439 47340 65221 59831 37031 11413 -21009 -41947
10805 -41947 -50942 -17732 3608 -11126 -18159 2662 10939 11433 1921 34073 32246 31993 17534
10792 17534 27838 26435 22931 28480 29201 35550 65221 68042 50480 49912 46712 65343 87403 84505
10778 84505 61265 51173 47290 58837 47202 20619 182 20582 7009 7790 10361 -4909
10766 -4909 -14736 -25593 -20779 -2047 1511 20845 27185 56090 39810 4711 -20992 -14576 12890
10753A2890R374L4841j1086l0628P564K096j5239k2316K0819J9101p629m818P745
10740B2714J6358N786M51j3400k2704P0J4522K8465l030j0680R673q794j4873
10727B4558k0409J1909K9237K2186J9214k2345j4987r541J1090P226m683j9897
10715C3558O875k058L1442J6555J742m599J6949r231l4018j7153j0739l1758M544
10702B109K4352M799k0616k4857j0868M408j053N909N082P188K7161K17j1233
10689A2598J9727O307J3145J994r883l6684p467M6967K0002l5003j7406L468P971
10676B5736K155J6428l405p663O697j754J58p560J6861K840j0394k2775r001J1150
10662A9473J2624Q568l000P710O46k490J5763L634m384k3029J1537J3388o280
$$ plain form
10753 12890 22264 57105 46019 15391 22955 25051 9812 -12504 8315 27416 19787 14969 22714
10740 22714 39072 44858 45309 31909 9205 9275 23797 52262 49232 38552 48225 39431 24558
10727 24558 4149 16058 45295 67481 86695 64350 49363 39822 50912 58138 53455 33558
10715 33558 40433 38375 69817 86372 88114 83515 100464 91233 57215 40062 29323 -2435 2109
10702 2109 26461 31260 10644 -14213 -25081 -20673 -21726 -15817 -10735 -3547 23614 23831 12598
10689 12598 32325 38632 51777 53771 43888 7204 -263 46704 66706 31703 14297 17765 25736
10676 25736 27891 44319 40914 33251 39948 38194 38352 30792 47653 50493 40099 17324 8323 19473
10662 19473 32097 40665 37665 45375 46021 43531 59294 62928 58544 35515 47052 60440 54160
10649E4160K574K422R703k5493O579R134P051K9714O183k7840r655K4474N848
10636I4854K2955J549m794l978R060k801Q111m669l0660m4844L01K8829Q323J820
10622H4056j0150p393J0814Q008j664k977O07J8644j918l76R367J5791o715L79
10608A16473M1581Q887n527M39k8630j611K9339J1198l295k107k079o233r027
10595A49408l6270r471K9018K6617j2137J69J9487K4781n151m3996j3546o440
10583A22469j4371k6783k007M5851M942n642l7289j9729L5348M5871r96m5691
10571A01973j1456K5464M148j2445p185q450L484J9702K4400L4490l2983k1785
10559A19357J1014M893K108k0144O64K4043K2105k5704j4732J7418K1757j1010
$$ plain form
10649 54160 56734 59156 68859 43366 49945 59079 66130 95844 102027 74187 64532 89006 94854
10636 94854 117809 119358 114564 110586 119646 116845 124956 120287 89627 44783 45084 73913 82236 84056
10622 84056 73906 66513 77327 85335 83671 80694 81301 99945 98027 97651 107018 122809 116094 116473
10608 116473 158054 166941 161414 161853 133223 131612 160951 172149 168854 166747 164668 158435 149408
10595 149408 113138 103667 132685 159302 147165 147334 166821 191602 186451 142455 128909 122469
10583 122469 108098 81315 79308 125159 130101 124459 87170 67441 102789 148660 147664 101973
10571 101973 90517 115981 120129 107684 100499 92049 95533 115235 139635 174125 141142 119357
10559 119357 130371 135264 137372 117228 117892 141935 164040 138336 123604 141022 162779 151769
10547A51769k1480o949j0882j0827r093M421J5981J3217j5730k2638j5422k0422
10535E1945q046Q522J9129L1612K6138j2401J0577q070j3664J7506J0223k4058
10523A09413k5702J4481J1700n786J8985L8593r692l3945k0017k3610n2255J0681
10511C2846M1438Q02J0117K7069j6434j7832j443K4600K0934J7399k6087m5766
10499F7643l2268l408o359k4955R723J3509L895k0975Q418J6124j2323j3736p04
10486D584L563M7786K4555L581J1873J733r960j4786m81R703j8496J72L1003K916
10472I7746Q892j024k0703o924M163J0839j6145Q387q003k2584q720J2073L311
10459F1308r647k0440J6366L3192l104j4891j6950j1884K8612L3967m731k2432
$$ plain form
10547 151769 130289 123340 112458 101631 92538 96959 112940 126157 110427 87789 72367 51945
10535 51945 43899 52421 71550 103162 129300 116899 127476 119406 105742 123248 133471 109413
10523 109413 83711 98192 109892 104106 123091 161684 151992 118047 98030 74420 22165 32846
10511 32846 74284 75086 85203 112272 95838 78006 76563 101163 122097 139496 113409 67643
10499 67643 35375 31967 25608 653 10376 23885 27780 6805 15223 31347 19024 5288 4584
10486 4584 8147 55933 80488 84069 95942 97675 87715 72929 72448 82151 63655 63827 94830 97746
10472 97746 106638 105614 84911 77987 82150 92989 76844 85231 77228 54644 45924 57997 61308
10459 61308 51661 31221 47587 80779 77675 62784 45834 33950 62562 96529 91798 69366
10447F9366j8957j546m126J3140j1154m03n987K0571K779l034K8861o920l1110
10434E1480p371r399k289k977n388j864J7012J7342J250j6074m514O924j3129
10421C1003p374K0201m348J691R902j4345M20K7048N631r41J878j884n388L96
10407F3890j314L728k7867k5239o543K3646J7739q237j8795j2108J2521M613J1670
10394C7704j1080k967J2740J305k3092m419L1534r185J444J6160L511k702o365
10381D4588r416j170J7623K772L561J3509K4391J7172j3676M643n340k1477j9862
10368E7318r151k817j5895N784J9108M010k2069k2622p45L274K9058k483k6436
10355A6334N588K5229P464J972J2894J5466j6320l1062J620L75J790L742J414
$$ plain form
10447 69366 50409 48863 44737 57877 46723 46320 40333 60904 63683 60649 89510 82590 51480
10434 51480 44109 34710 32421 29444 24056 22192 39204 56546 57796 41722 37208 44132 31003
10421 31003 23629 43830 39482 41173 51075 36730 37150 64198 69829 68888 70766 68882 63494 63890
10407 63890 62576 66304 38437 13198 6655 30301 48040 39803 21008 8900 21421 26034 37704
10394 37704 26624 23657 36397 37702 14610 10191 41725 32540 33984 50144 53655 50953 44588
10381 44588 35172 34002 51625 54397 57958 71467 95858 113030 99354 103997 98657 77180 57318
10368 57318 48167 45350 29455 35239 54347 58357 36288 13666 12921 16195 45253 42770 16334
10355 16334 21922 47151 54615 56587 69481 84947 68627 37565 39185 39560 41350 45092 46506
10342D6506l342o380N294j294k9497j8063L0012o358Q063Q534j851j0521P473
10329B8576M2821j1589r959J7298Q196r803k2089M391j5978L121m482J7511J9458
10316F7472R763k3530n1824j4226R360K7765J0411J7683P864j2037Q184k681J2926
10303F7130n550j7487o274K467K4580j6391M22K4657O282Q018j0041j0380L4611
10290A02044M4064j6596r136o755k9884j1310J872J0933m771K0892q13K3640K585
10277A26765l8631k4120J5409r315J6459K7549J8111k1678k2399j0386j7036j1566
10265D9162k0416J7515L0582P392Q153l850R180N239O731k4163j9397M19n872
10252F0675j2455j5451k5191j2248K2429J0445L6789j9028j8916q811Q638Q141
$$ plain form
10342 46506 43164 36784 42078 40784 11287 -6776 23236 16878 24941 33475 31624 21103 28576
10329 28576 71397 59808 49849 67147 75343 65540 43451 47842 31864 34985 30503 48014 67472
10316 67472 77235 53705 1881 -12345 -2985 24780 35191 52874 60738 48701 56885 54204 67130
10303 67130 61580 44093 37819 40286 64866 48475 48897 73554 79836 87854 77813 67433 102044
10290 102044 146108 129512 120376 113621 83737 72427 74299 85232 80461 101353 100540 124180 126765
10277 126765 88134 64014 79423 70108 86567 114116 132227 110549 88150 77764 60728 49162
10265 49162 28746 46261 76843 84235 92388 88538 97718 102957 109688 85525 66128 66547 60675
10252 60675 48220 32769 7578 -4670 17759 28204 64993 45965 27049 18238 26876 35017
10240C5017J1192L863j1682j8930K4187K2407j5593r269j1742j5507n001l702
10228E240J6253K472j7835P004J4140J2955O971k063L556j0471r67m513J5632
10215D8374J8849j0754k5068j5109J6907L1932j6226m9042J4250J2418p982P144
10203B5693O745J1563O173k0861M120J7591Q136Q004q687k281J6102o105n054
10190F1139n194k3400k5803j4009K3248O651L021o958p967P566l767K9677J8282
10177F2486k8608k9029K6371J3092k6983O836O264J3464j627l6098O121L4082
10165D6371P072M858l6717J2853O805l6774j4623N409J24N544K0200j0213O853
10152A7762K43N83J0114K385J7830N149k7294J095J7581K2559L036l616k16K1925
$$ plain form
10240 35017 46209 50072 38390 19460 43647 66054 50461 41192 29450 13943 8942 5240
10228 5240 21493 23965 6130 13134 27274 40229 47200 45137 48693 38222 37255 32742 48374
10215 48374 67223 56469 31401 16292 33199 65131 48905 -137 14113 26531 18549 25693
10203 25693 32438 44001 50174 29313 33433 51024 59160 67164 58477 56196 72298 66193 61139
10190 61139 55945 32545 6742 -7267 15981 22632 25653 18695 10728 18294 14527 44204 62486
10177 62486 33878 4849 31220 44312 17329 24165 30429 43893 42266 6168 12289 46371
10165 46371 53443 58301 21584 34437 41242 4468 -10155 -4746 -4622 922 21122 10909 17762
10152 17762 18005 18588 28702 31087 48917 54066 26772 27867 45448 68007 71043 67427 67211 89136
10138H9136m590j4082o759j6779j5883J0052k096n575n411L427Q493N922l2412
10125A3443m832K6188K4237j0316j7353m957J8835J0916J9022j3605j478k8678
10113C1422k0871L64J7508K5957o132P595Q15p277J724j2022k9450q207L845K6429
10099C1700Q145l700M2498K7873j7589n3515j2464q571k997j9880P253R559K482
10086A0794l017K0101K8753J1283N586j6667j202k655j0607o482k5510J066L166
10073A4609j281j6731K8464J3488j6546Q202M1440J0898m545m066N539L1862m260
10060A07073j121K950J3294K032p6j4736l0721k1441N892J8056J0408M1009M047
10047A36666k3957k3128k3160j0794L3945L124j2337J8610N0984J6920N564J6540
$$ plain form
10138 89136 84546 70464 63705 46926 31043 41095 38999 33424 28013 31440 39933 45855 13443
10125 13443 8611 34799 59036 48720 31367 26410 45245 56161 75183 61578 60100 31422
10113 31422 10551 10915 28423 54380 48248 55843 56658 49381 51105 39083 9633 1426 5271 31700
10099 31700 39845 36145 78643 106516 88927 35412 22948 14377 11380 -8500 -1247 8312 10794
10086 10794 7777 27878 56631 67914 73500 56833 55631 52976 42369 35887 10377 11443 14609
10073 14609 13328 -3403 25061 38549 22003 30205 71645 82543 77998 73932 79471 111333 107073
10060 107073 105952 108902 122196 124228 124152 109416 78695 57254 63146 81202 91610 132619 136666
10047 136666 112709 89581 66421 55627 89572 92696 80359 98969 149953 166873 172437 188977
10035A88977J3201J2841K5683O573K7806M694J7829M305J0208k737j1915K7498
10023C24963O0789O5562P5266R9787Q1247N9744P3359N3872M2043n598j6666l5600
10011H78768k2945j4589l2916o5008l1926n1322n9086k0911j2821n5865o0804
10000D50575l5555k117k4941k2398q255n885k0543N815K2185p732k5377j4805
9988C10967K7332J7660j0794j0902l898j2252j8189K860J1862k2374J1145r86
9976C02431k8421Q677Q796J04o675j3997j7075k5489j7773M281j0235j9617M547
9963A89554K394j1476k0110K545J0190k4519J9804J355J8415J6439n840j8588
9951A80163j4097k3250k6320K1729J4189K650r222J6241M739J69L000m127M113
$$ plain form
10035 188977 202178 215019 240702 247275 275081 279775 297604 301909 312117 309380 297465 324963
10023 324963 385752 451314 526580 626367 707614 767358 840717 894589 936632 931034 914368 878768
10011 878768 855823 841234 808318 743310 711384 660062 600976 580065 567244 511379 450575
10000 450575 415020 412903 387962 365564 357309 351424 330881 336696 358881 351149 325772 310967
9988 310967 338299 355959 345165 334263 330365 318113 299924 302784 314646 292272 303417 302431
9976 302431 274010 282687 291483 291587 284912 270915 253840 228351 210578 214859 204624 185007 189554
9963 189554 191948 180472 160362 162907 173097 148578 168382 169737 188152 204591 198751 180163
9951 180163 166066 142816 116496 138225 152414 155064 145842 162083 166822 166991 169991 165864 169977
9938A69977j3921l0944k7482M6177M2750K4482r799q132j9187k2396j0334K4014
9926A65205K0727J8682k6585r506M7460J9882N333J0349m890l8111p113o259r979
9913A85195j8497P398L3964J6363o57J4973J5950K6280M0415m790n565j9232p564
9900B84233j3895k0408L228j2831J3030L1309J1046J1979l5935j3496N1446j555
9888C08151l2116k396J4737n526l178o183p400J1442J2900K4147j6421j1566L4352
9875C20943K3706N602J475j6679M231P61l057M029J5375J4270j111j2966j5601
9862C40978J9684J7750J18k645J9221J3619K1610q27K11J4693J5646m584k1448
9849D34026j0521K7529m547r520J2641M503J6987J6619O94L1443L1629J4236m434
$$ plain form
9938 169977 156056 125112 97630 143807 186557 211039 201240 193108 173921 151525 141191 165205
9926 165205 185932 204614 178029 168523 215983 235865 241198 251547 246657 208546 201433 195174 185195
9913 185195 166698 174096 208060 224423 223766 238739 254689 280969 321384 316594 311029 291797 284233
9900 284233 270338 249930 253158 240327 253357 284666 295712 307691 271756 258260 309706 308151
9888 308151 276035 273639 288376 282850 279672 273489 266089 277531 290431 314578 298157 286591 320943
9875 320943 344649 350251 351726 335047 339278 340039 336982 341011 356386 370656 369545 356579 340978
9862 340978 360662 378412 378530 375885 395106 408725 430335 429508 429719 444412 460058 455474 434026
9849 434026 423505 451034 446487 436967 449608 454111 471098 487717 488411 519854 551483 565719 561285
9836E61285n977j5935n672M2438K9238r41J4287J1004k3423m582M4803M6155N808
9823F98488J4408m448J1436K3902M7498L0221N1593m860m503J9807K9264L4220
9811I47026N3331L3485o748J3207K0943L4309L6835K1838N4214M6154J2811o13
9799A266792N6123O2602K0779K6705J6001N7210P4659N3192L4220M6715Q0075
9788A795073Q6240O6932M7718P5755P6626P7219O2905O6407O4155Q8081J16975
9777B624086J48701J10103J02999J13433J31401J34949J40698J46794J79025J69668
9767D001857J62335J80617K16372K18632K18769K13462K13004K29757K51656K90172
9757F196633K94136K96518L04640L40199L63497L77191L63888L71342M10171M26088
$$ plain form
9836 561285 555308 539373 533701 576139 605377 604436 618723 629727 606304 601722 646525 692680 698488
9823 698488 712896 708448 719884 743786 791284 821505 873098 868238 863735 883542 912806 947026
9811 947026 1000357 1033842 1027094 1040301 1061244 1095553 1132388 1154226 1208440 1254594 1267405 1266792
9799 1266792 1322915 1385517 1406296 1433001 1449002 1506212 1580871 1634063 1668283 1714998 1795073
9788 1795073 1881313 1948245 1995963 2071718 2148344 2225563 2288468 2354875 2419030 2507111 2624086
9777 2624086 2772787 2882890 2985889 3099322 3230723 3365672 3506370 3653164 3832189 4001857
9767 4001857 4164192 4344809 4561181 4779813 4998582 5212044 5425048 5654805 5906461 6196633
9757 6196633 6490769 6787287 7091927 7432126 7795623 8172814 8536702 8908044 9318215 9744303
9747I744303M53159M65149M78108N15182N60339N46290N49951O14416O02902O12587
9737A5142386O49757P05241P28062P09974P40729P48203P37373P28812P54976
9728B1645513P91951Q05613P57287P48546P44577P29723P09922O74474O33518
9719B8241124N87745N14011M72180M18225L20495K22900J47167O4696p167r4508
9709C0886868j59578k24034k81392l15497l46671l89581m62455m51743m68023
9700B7787894m91290m73250m81954n08055m79738m72946m61300m56566m78000
9691B3484795m34078m41035m50234m44770m46345m30325m17042m09613l86422
9682A9624931m00143l87475l77919m10365l98840l75586l68827l98417l80203
$$ plain form
9747 9744303 10197462 10662611 11140719 11655901 12216240 12762530 13312481 13926897 14529799 15142386
9737 15142386 15792143 16497384 17225446 17935420 18676149 19424352 20161725 20890537 21645513
9728 21645513 22437464 23243077 24000364 24748910 25493487 26223210 26933132 27607606 28241124
9719 28241124 28828869 29342880 29815060 30233285 30553780 30776680 30923847 30988543 30981376 30886868
9709 30886868 30727290 30503256 30221864 29906367 29559696 29170115 28707660 28255917 27787894
9700 27787894 27296604 26823354 26341400 25833345 25353607 24880661 24419361 23962795 23484795
9691 23484795 23050717 22609682 22159448 21714678 21268333 20838008 20420966 20011353 19624931
9682 19624931 19224788 18837313 18459394 18049029 17650189 17274603 16905776 16507359 16127156
9673A6127156l29862l50636l68983l62866l29601l33549l11444l18488k92661
9664A3129066k95750l34521k95804k44342k76527k76684k43997k39377k34962
9655A0687102k50183k54701k31235k26281j79794j73153j85700j77624k13170
9646H795261j76228j62606j68438j61207j41276j47608j47009j51856j36855j28221
9636G273957j68965j38603j47762j25201j22613j44059j36747j34330j48587r4904
9626E912186j21601j49447j44307j18877j02274j22658j05247j34398j47696j37156
9616D628525j13704j09586j27381j15028j14024j21022j11448r4286r0045j05196
9606C526805r9192r1679j06898j01864j09476r5642q1438o8086o1734o9054q4342
$$ plain form
9673 16127156 15797294 15446658 15077675 14714809 14385208 14051659 13740215 13421727 13129066
9664 13129066 12833316 12498795 12202991 11958649 11682122 11405438 11161441 10922064 10687102
9655 10687102 10436919 10182218 9950983 9724702 9544908 9371755 9186055 9008431 8795261
9646 8795261 8619033 8456427 8287989 8126782 7985506 7837898 7690889 7539033 7402178 7273957
9636 7273957 7104992 6966389 6818627 6693426 6570813 6426754 6290007 6155677 6007090 5912186
9626 5912186 5790585 5641138 5496831 5377954 5275680 5153022 5047775 4913377 4765681 4628525
9616 4628525 4514821 4405235 4277854 4162826 4048802 3927780 3816332 3722046 3632001 3526805
9606 3526805 3427613 3335934 3229036 3127172 3017696 2922054 2840616 2772530 2710796 2641742 2557400
9595B557400q0009q0708r1887q1689l9310p6516o8602n9643k4910l8677m7020
9584A868429o3344m4891o2109l6108j9294k3088m6439l8725n9039m8935k0865
9573A405592j734k3953k1294l0188k5356Q566n758M013M396o366l5704m4011k9742
9560A198461k6725j3753k4878o4412o5873l3850j7832J2161k105N032k819l371
9548I60036K3337M3472K2831j8575k2862J106j3910O825l2192k0006L2420R679
9536I92161J7580q334j7025n2258j8405r172l124J3393L242L9676O1794P4509
9524A094037O9364P3349L9929k0472p7418q1852p1664p0529l3109m4389m9133
9513H28113j6221M0674R442R329l657m0365l4286K6139J7056p714r073L70j7871
$$ plain form
9595 2557400 2477391 2396683 2304796 2223107 2183797 2107281 2038679 1979036 1954126 1915449 1868429
9584 1868429 1805085 1760194 1698085 1661977 1642683 1619595 1573156 1534431 1475392 1426457 1405592
9573 1405592 1403858 1379905 1358611 1328423 1303067 1311633 1305875 1309888 1314284 1307918 1272214 1228203 1198461
9560 1198461 1171736 1157983 1133105 1068693 1002820 968970 951138 963299 961194 966226 963407 960036
9548 960036 983373 1026845 1049676 1031101 1008239 1009345 995435 1002260 970068 950062 982482 992161
9536 992161 1009741 1001407 984382 932124 913719 904547 901423 914816 918058 957734 1019528 1094037
9524 1094037 1163401 1236750 1276679 1256207 1178789 1096937 1025273 954744 921635 877246 828113
9513 828113 811892 852566 862008 871337 867680 827315 793029 819168 836224 828510 819437 819807 801936
9500H01936j770j1120j3808l4845j5145M149j9939m8637k9687j2771Q1K394O539
9487F27377q816K11n211r624r801J0174K1598q20M466m8141l4247j318l416m2537
9473D99895n6150k7479k012q356k8451P094L889j5577J6116j4750l0032k859L951
9460C45279k4105n603J0632n982k5672j864R215Q563J4084j1141l6417l822J3390
9447B86557K794m807j2506k0958M937j2006J2344J4653j6745J3428j0348l7672
9435B19671j6393o471J1815k0447L393j4j1517k000O117J660j3557L492J5907
9422A91656l0654r742P345J4562M254M584k1330m3884k6004j2358K0877K1734
9410A21040J7105j143j1945J8503J0882J8003j1324k0254k9219j411q235r297
$$ plain form
9500 801936 800166 789046 775238 740393 725248 729397 709458 660821 631134 618363 618444 620838 627377
9487 627377 618561 618772 613561 603937 594136 604310 625908 625088 629554 581413 547166 545848 542432 499895
9473 499895 443745 416266 414254 405898 377447 384541 388430 372853 388969 374219 344187 341328 345279
9460 345279 321174 315571 326203 320221 294549 292685 301900 310463 324547 313406 276989 273167 286557
9447 286557 289351 284544 272038 251080 256017 244011 256355 271008 254263 267691 257343 219671
9435 219671 203278 196807 208622 188175 191568 191554 180037 178037 184154 185814 172257 175749 191656
9422 191656 161002 151260 158605 173167 177421 182005 160675 116791 90787 78429 99306 121040
9410 121040 138145 137002 125057 143560 154442 172445 161121 140867 111648 110237 102002 92705
9398I2705o447L332j0263j1772J6186L2069K6484N625j4200L118m951j3126l2429
9385H6331J6056L2188n384k4036n129j9512j9474k8858K6602K9547K9687J6764
9373A34782j0220j647k0959j7603Q366m029l978Q366K384R324L243j577p596j0017
9359H8839J762J1681k518K653K1956J3017l1922k6551J8340J2037j3255J159j1315
9346H5883J1040J071J2915J4727j4709p243l8199o487Q530q650j6619n455m042
9333C2762N097J7673R513K8025K4320j3504K2755J8041m1254k1509N990m179k5756
9320E7974K622j4064K860J3963j365r587L641N090p113P640K4285l183j7225O702
9306G2240J2377J164k1196k0747M0092J4858j7956O480J9300k5039p687l0225
$$ plain form
9398 92705 86258 89590 79327 67555 83741 115810 142294 147919 133719 136837 131886 118760 86331
9385 86331 102387 134575 129191 105155 100026 80514 61040 32182 58784 88331 118018 134782
9373 134782 124562 122915 101956 84353 92719 88690 84712 93078 95462 104786 108029 106452 98856 88839
9359 88839 90601 102282 99764 102417 124373 137390 105468 78917 97257 109294 96039 97198 85883
9346 85883 96923 97994 110909 125636 110927 103684 65485 58998 67528 58878 42259 36804 32762
9333 32762 37859 55532 65045 93070 117390 103886 126641 144682 103428 81919 87909 83730 57974
9320 57974 60596 46532 49392 63355 61990 52403 56044 61134 54021 61661 85946 82763 65538 72240
9306 72240 84617 85781 64585 43838 83930 98788 80832 87312 106612 81573 73886 43661
9294D3661j84m37Q22K1871K2704J0012j5154k1247J2948M2919K6918K0137n043
9281A59927q792K6703p647L1809J4366P107J303q838m247k5985n0189k5885O527
9268A16159J1605K0538J8159L2505l050M178K0244q686K3623Q011m3565l7832
9256A61889J8080K6201o122k2943k0140k6869j344J7323K9643J0505J3999m147
9244A96075Q889J6582K0401K7186j4193k2912L56J1454m2196j9609K56m0507n241
9231A36541J3688K6396K609p220l0762j8049K5653O398j556K2347J3697J3058
9219B02800m2097l3630R853n582j16N900j0174M7845K7406K4676O2J148J2918
9206B41009j7002Q628k581l9516j3819J5774J6939j2028k1957l0471n848K1650
$$ plain form
9294 43661 43477 43040 43862 65733 88437 98449 83295 62048 74996 117915 144833 164970 159927
9281 159927 151135 177838 170191 202000 216366 223473 224776 215938 211691 185706 135517 109632 116159
9268 116159 127764 148302 166461 198966 195916 200094 220338 211652 235275 243286 199721 161889
9256 161889 179969 206170 200048 177105 156965 130096 128752 146075 175718 186223 200222 196075
9244 196075 204964 221546 241947 269133 254940 232028 232384 243838 201642 182033 182289 141782 136541
9231 136541 150229 176625 179234 172014 141252 123203 148856 155254 153698 176045 189742 202800
9219 202800 160703 127073 136926 131344 131228 137128 126954 174799 202205 226881 226943 228091 241009
9206 241009 224007 232635 230054 190538 176719 192493 209432 197404 175447 144976 139128 160778
9194A60778K490j713J7058J6014o281K0407Q729j3289l617k0064k7069J609J0952
9181A66004n390m79n469r361o506R991J1922l362j6354K794L3149r475j7845k8440
9167A21179N591K5638M23m4357J3538J8294J644n914N624j9241j1320O890J0548
9154A28537j2070j8143q057N917p18o281J2123K2771r184l6862j0953j4807M143
9141E6416k0270J1677J2092p674O635P284J7531J0593L238j7271L176K628r489
9128G6566n78q67L3701J733j795K709L413m934k7028k8110N818J5346K419m0334
9114C8059q015J7397J4661q227o140Q408N541L451j3396k0795J8860Q972j0720
9101D8056K9805J5021m233n615m8820j646J5319r436o845J4079K6590J8322m0121
$$ plain form
9194 160778 163268 161555 178613 194627 188346 208753 217482 204193 200576 180512 153443 155052 166004
9181 166004 160614 160135 154666 145305 138799 148790 160712 157350 140996 143790 176939 167464 149619 121179
9167 121179 126770 152408 152831 108474 122012 140306 141950 136036 141660 122419 111099 117989 128537
9154 128537 116467 98324 90267 96184 95466 89185 101308 124079 114895 78033 67080 52273 56416
9141 56416 36146 47823 59915 52241 58876 66160 83691 94284 97522 80251 83427 86055 76566
9128 76566 75988 75121 108822 110555 108760 111469 114882 109948 82920 54810 60628 75974 78393 38059
9114 38059 30044 47441 62102 53875 47735 56143 61684 65135 51739 30944 49804 58776 48056
9101 48056 77861 92882 88649 83034 34214 32568 47887 38451 31606 45685 72275 90597 50476
9088E0476k5437J7590K005J3773l8099j5260J1774K308j0105P972Q290J3742l356
9075C5673J6749K8422k292m4000j5646p661N384l087K1031J0992L619j1176o507
9062C1501L3650J1861r767j7708K4597j3018j9260R491R671m277l6824j7016k824
9049G7J7042j1277k7114L0726L908k776R722J0875j9562k4325j7785M2789K2762
9036C5062k3003N517p195j7445J5839J1487J1540k621n263J0757p290j3625J3533
9023B7293K094l561m162j4849K0307L5531R341j9910j1403j789p539k659p465
9010B1229j3365K630J1727K460j6608P721K1755J1308j0388n040P073k9418p68
8997A0316J3899L4653J5284l4228l281J0039j4984K845J5664p009L278P11j8365
$$ plain form
9088 50476 25039 42629 44634 58407 20308 5048 16822 19130 9025 16997 25287 39029 35673
9075 35673 52422 80844 78552 34552 18906 11245 16629 13542 34573 45565 49184 38008 31501
9062 31501 65151 77012 67245 49537 74134 61116 41856 51347 61018 56741 19917 2901 77
9049 77 17119 5842 -21272 9454 13362 10586 20308 31183 11621 -12704 -30489 12300 35062
9036 35062 12059 17576 10381 -7064 8775 20262 31802 29181 23918 34675 27385 13760 27293
9023 27293 29387 25826 21664 6815 27122 62653 71994 52084 40681 38892 31353 28694 21229
9010 21229 7864 10494 22221 24681 8073 15794 37549 48857 38469 33429 40502 11084 10316
8997 10316 24215 58868 74152 39924 36643 46682 31698 34543 50207 43198 46476 47187 28822
8984B8822K3935K0354k0698q240k0077l0967M656J6593J6680J0329m6j4124J8223
8971D5440J9578j5635k2971J3470j4911M699q031j7873J7258K3934N667k8024
8959B2601J7900J8679m957q223R902J324J4362n028r015j1142J0798j6305j0085
8946C0811J4027k923K9079Q667O971O578J0694j2518r6j7716K5853j771k2862
8933G4794j0994L9689K292k0795o534q488K7629J6764L005j4012k6320J7256j244
8920I3042R673J0516L790O481J9025K5181J8874K1851N697j6756l226J6043j2212
8907A97979j439L4216K7531M7249K7981L2500M8496O8009J11624J39801J40144
8896H74091P3365J2697q3161j19205o3614o1216q3935l4534m5523m6018m1545
$$ plain form
8984 28822 52757 73111 52413 44173 24096 -6871 -2215 14378 31058 41387 41341 27217 45440
8971 45440 65018 49383 26412 39882 24971 29670 21639 3766 21024 44958 50625 22601
8959 22601 40501 59180 54223 46000 55902 57226 71588 66560 57545 46403 57201 40896 30811
8946 30811 44838 41915 70994 79661 86632 93210 103904 91386 91290 73574 99427 97656 74794
8933 74794 63800 103489 105781 84986 78452 69964 97593 114357 117362 103350 77030 94286 93042
8920 93042 102715 113231 117021 123502 142527 167708 186582 208433 214130 197374 194148 210191 197979
8907 197979 196540 230756 258287 305536 333517 366017 414513 482522 594146 733947 874091
8896 874091 947456 960153 876992 757787 694173 632957 549022 514488 468965 422947 381402
8885C81402m2300j9920R655P753k6436m5925j3355R455l099R528K996P997J4980
8872B92731K5394K4451R143L1280P0018M4611J1176K2434N9561M0813r788J7718
8860F39542J2916K3436N4596O5288R9295J35623J87592K83384K47821J38406n5179
8849A832720k00962k29739j84892j49176j11568j31228r8138p3579m6921m2937
8839E63580k4885J7121O62j2275n5610l0161k2857k4486L840J2393r956k102j6746
8826C98518m213K7074L2338j665Q262L7375o035m050j3126J1084K7125J6518L7930
8813E67135K5406J8889M7783O7213R8218R7215J01854N7399n1703r7396j15308
8802H16705r7315q6793n2577k6898m3237k2638n1276m6216k1290n35R987J4499
$$ plain form
8885 381402 339102 319182 328837 336590 310154 264229 250874 260329 257230 266758 269754 277751 292731
8872 292731 318125 342576 351719 382999 453017 497628 508804 531238 590799 631612 621824 639542
8860 639542 652458 675894 730490 795778 895073 1030696 1218288 1501672 1749493 1887899 1832720
8849 1832720 1631758 1402019 1217127 1067951 956383 825155 727017 653438 606517 563580
8839 563580 538695 555816 556478 544203 488593 458432 435575 411089 414929 427322 417366 415264 398518
8826 398518 394305 421379 453717 452052 460314 497689 491654 487604 474478 485562 512687 529205 567135
8813 567135 592541 611430 659213 726426 824644 921859 1023713 1081112 1029409 932013 816705
8802 816705 719390 632597 580020 553122 509885 487247 435971 389755 368465 367930 377917 392416
8790C92416J2072q392k4418k6138k6509q626R573k2559P295l0221m9212k6909
8778A98372K0600K0956k988K2291P652K8675N666q125R64L5708L6534L849m342
8765C65812l707j2477k651J3970m766M867L540l4747n4666R876K3032k3958k464
8752B81661N952l501k313j1116m748J4905o303k100J4875J4228L562m939m9890
8739B50273k6125J1300R441r324k3136J7399j5546N391L9585K2676j6706r905
8727B55323O08R272p077K0967M8770K7213J7972l0843J968J6586Q884J0477J4839
8714C94959o786q150m093j2896l5491k4483k0159l0161k6738M267J6367j6562
8702B30074l2116R46q260J9179K8146j0435q184j4376o80m746N29k309l4941m4822
$$ plain form
8790 392416 404488 396096 371678 345540 319031 310405 319978 297419 304714 274493 225281 198372
8778 198372 218972 239928 236940 259231 266883 295558 301224 293099 294063 329771 366305 370154 365812
8765 365812 362105 349628 346977 360947 356181 361048 364588 329841 275175 285051 308083 284125 281661
8752 281661 287613 284112 281799 270683 265935 280840 274537 272437 287312 301540 305102 300163 250273
8739 250273 224148 235448 244889 235565 212429 229828 214282 219673 259258 281934 265228 255323
8727 255323 255931 265203 258126 279093 327863 355076 373048 342205 344173 360759 369643 380120 394959
8714 394959 388173 380023 375930 363034 327543 303060 282901 252740 226002 230269 246636 230074
8702 230074 197958 198904 190644 209823 237969 227534 219350 204974 204294 199548 200077 197768 162827 118005
8688A18005J1710L1068K5157j0822j2257K8589K4177R943J889J6097O494J4977
8676B65027N661n121k985M003J8956O210O583k1208j567J5683j3190j3688j3595
8663B50769j5736L462K872m5217k2998J5047J5922k5470N492r805k8986k1879
8651A23473n630O255N673n00K5013j4528n218K0002L3725J1744Q403k0073j2321
8638A76018M5887P217j7825q364J2150K3718L7315M1098J494J0875P581K3975
8626C61139n191J2759J1274j4792L35J4537Q142K8291L2096O995K179K499l387
8613D56876j5647K3758j539p036K5610J9286q401L0757J8202K7434M6600K6109
8601F42009l477J648N495J9362J3971J7707K9859K2138L4943O9090M8770O2110
$$ plain form
8688 118005 129715 160783 185940 175118 162861 191450 215627 225570 227459 243556 250050 265027
8676 265027 270688 265567 262582 266585 285541 291751 298334 277126 275559 291242 278052 264364 250769
8663 250769 235033 238495 241367 196150 173152 188199 204121 178651 184143 174338 145352 123473
8651 123473 117843 124098 129771 129271 154284 139756 134538 154540 188265 200009 208412 188339 176018
8638 176018 221905 229122 211297 202933 215083 238801 276116 317214 318708 329583 337164 361139
8626 361139 355948 368707 379981 365189 365524 380061 388203 416494 448590 455585 457764 460263 456876
8613 456876 441229 464987 463448 456412 482022 501308 492907 523664 541866 569300 615900 642009
8601 642009 638532 640180 645675 665037 679008 696715 726574 748712 783655 852745 901515 963625
8589I63625M0201j474K3369O9263R6609J00327R6871Q1461M8797L9876J2547j1333
8577A560139k5915k0132j7423K6906L7785J0446Q110L0125J8648P803M2632J6673
8565A695797K3309L5679L3191J5133O8395J00087P5645Q9270R0415R0968Q3620
8554B401509M0631N2345O5611M9255K9976J02673J21768J03345R9916Q4427Q6445
8543C237901J06348J21064R3936R1594J69536K30199K41945K63418K48000K00715
8533E004656J62201J65495K28357K49305L07943L78042M40765N67677P09996Q58878
8523I073315R99288J190040J494041J858385K268791K697391L059468L265559
8515B5906278L258876K967157K411484J714195J158876R18247J188661K068383
$$ plain form
8589 963625 1003826 1002352 1025721 1094984 1191593 1291920 1388791 1470252 1519049 1558925 1571472 1560139
8577 1560139 1534224 1514092 1496669 1523575 1561360 1571806 1579916 1610041 1628689 1636492 1679124 1695797
8565 1695797 1719106 1754785 1787976 1803109 1871504 1971591 2047236 2136506 2226921 2317889 2401509
8554 2401509 2442140 2494485 2560096 2609351 2639327 2742000 2863768 2967113 3067029 3151456 3237901
8543 3237901 3344249 3465313 3559249 3650843 3820379 4050578 4292523 4555941 4803941 5004656
8533 5004656 5166857 5332352 5560709 5810014 6117957 6495999 6936764 7504441 8214437 9073315
8523 9073315 10072603 11262643 12756684 14615069 16883860 19581251 22640719 25906278
8515 25906278 29165154 32132311 34543795 36257990 37416866 38335113 39523774 41592157
8507D1592157L464714N423988P956424J1150171J4956882J8891983K1553952K0475898
8499A45466169J3557003J451713j0926083j7987918j8705689j6016957j2604052
8492H4234186r641457p361077n661743m403122l457282k766999k216967j735363
8484D6990176j337281j012561o32937k31039J73633O36114J134638J719914K418961
8475D9859618L257693M244641N245317O095930O461672O256131N383909L989719
8467I0794630K485531J400702J088913J807228L602257O529824J0639079J6047332
8459A34395496K3060412L1760087M1066310M6939340M2133462K0956736j1686097
8452C28625746l6798864m3198193l7982391l0204608k3357597j7984957j3966316
$$ plain form
8507 41592157 45056871 50480859 58437283 69587454 84544336 103436319 124990271 145466169
8499 145466169 159023172 160474885 149548802 131560884 112855195 96838238 84234186
8492 84234186 74592729 67231652 61569909 57166787 53709505 50942506 48725539 46990176
8484 46990176 45652895 44640334 44007397 43776358 43949991 44586105 45720743 47440657 49859618
8475 49859618 53117311 57361952 62607269 68703199 75164871 81421002 86804911 90794630
8467 90794630 93280161 94680863 95769776 97577004 101179261 107709085 118348164 134395496
8459 134395496 157455908 189215995 230282305 277221645 319355107 340311843 328625746
8452 328625746 291826882 248628689 210646298 180441690 157084093 139099136 125132820
8445A25132820j0940595q727263p087250n862592m879984m118767l586479l165544
8437G6764346k752452k227195j735305j276365q29622l33659J99637P36654J303431
8428F9849470J880714K325287K587601K572545K303123J847752J402803R15555
8420H5684850N06149M89515J073796K371893M320687O970701J0337381J4117877
8412A25872849J7423739J8306967J4192328M135958q579411j7665178k0142249
8405A33545003j8189708j4829103j1752844r188516p283558n928296m836169m038538
8397E7498271l427214k939005k600679k340588k183834j989258j784425j579247
8389C8654021j402622j281377j160626j020978r13016p96119o71763o07485m68711
$$ plain form
8445 125132820 114192225 105464962 98377712 92515120 87635136 83516369 79929890 76764346
8437 76764346 74011894 71784699 70049394 68773029 67943407 67609748 67809385 68546039 69849470
8428 69849470 71730184 74055471 76643072 79215617 81518740 83366492 84769295 85684850
8420 85684850 86190999 86680514 87754310 90126203 94446890 101417591 111754972 125872849
8412 125872849 143296588 161603555 175795883 179931841 171352430 153687252 133545003
8405 133545003 115355295 100526192 88773348 79584832 72301274 66372978 61536809 57498271
8397 57498271 54071057 51132052 48531373 46190785 44006951 42017693 40233268 38654021
8389 38654021 37251399 35970022 34809396 33788418 32875402 32079283 31407520 30800035 30331324
8380C0331324l84601k93911k11799j91843l06076n17522p79755r68446j090118
8371B5587253j168946j176343j156436j107765j067416j028051r69046r08211
8363A7005039q58098q35841p86408p15576o41826o45065o16773n41600n00017
8354A0863835m75424m62526m58698m47228m09070l81953l47025l36069l27085
8345G218757l06834l14754l05860k52568k56603k64635k09394j75957j96465k04416
8335D731271j60455j27946j49034j59261j39856j38684j29735j10054p8145p7434
8325C460667p7045m5814n0529l325l5264n3639p7199q2944p4524j8246J9503K850
8313B964491J0584L8012n058k9135m9154n8252j01879r7502p2922p0401q3467
$$ plain form
8380 30331324 29946723 29652812 29441013 29249170 28943094 28425572 27645817 26677371 25587253
8371 25587253 24418307 23241964 22085528 20977763 19910347 18882296 17913250 17005039
8363 17005039 16146941 15311100 14524692 13809116 13167290 12522225 11905452 11363852 10863835
8354 10863835 10388411 9925885 9467187 9019959 8610889 8228936 7881911 7545842 7218757
8345 7218757 6911923 6597169 6291309 6038741 5782138 5517503 5308109 5132152 4935687 4731271
8335 4731271 4570816 4442870 4293836 4134575 3994719 3856035 3726300 3616246 3538101 3460667
8325 3460667 3383622 3337808 3287279 3283954 3248690 3195051 3117852 3034908 2960384 2942138 2961641 2964491
8313 2964491 2975075 3013087 3008029 2978894 2929740 2871488 2769609 2672107 2599185 2528784 2445317
8302B445317o8869o1938n3825m2197o7312q2296l5752j9753j8022k1914l3264
8291A940175k4677M655k658k072M150m031o636K4174K3446O766J6946L1200N2952
8278B064390J6479P522K25J2250J980j769J2246J1429O419Q932L2521M2239M0999
8265B255862K8849J4090k3438k8375q3143o2983k9771j7350j7082n3328p564j7189
8253A958578m0454K4587k1665l0473m8556k8788J2029J1831n171k9361J0728J2069
8241A825354J3077K8928K3369O009K4597L2463k8604k6900m5817k6847j1862n2514
8229A761253n3464j5313j4894j4600o822r723j6228L501j922n677m084O445M060
8216A632532l6978l9769j8731k5821l903j4946j1180l4460l6395k0517l4497l3145
$$ plain form
8302 2445317 2376448 2314510 2260685 2218488 2151176 2068880 2033128 2013375 1995353 1973439 1940175
8291 1940175 1915498 1920153 1917495 1915423 1919573 1915542 1908906 1933080 1956526 1963292 1980238 2011438 2064390
8278 2064390 2080869 2088391 2088616 2100866 2102846 2101077 2113323 2124752 2131171 2140103 2172624 2214863 2255862
8265 2255862 2284711 2298801 2275363 2246988 2163845 2100862 2071091 2053741 2036659 1983331 1975767 1958578
8253 1958578 1918124 1942711 1921046 1890573 1842017 1813229 1825258 1837089 1831918 1802557 1813285 1825354
8241 1825354 1838431 1867359 1890728 1896737 1921334 1953797 1925193 1898293 1852476 1825629 1813767 1761253
8229 1761253 1707789 1692476 1677582 1662982 1656160 1646437 1630209 1633710 1631788 1626111 1622027 1628472 1632532
8216 1632532 1595554 1555785 1537054 1511233 1507330 1492384 1481204 1446744 1410349 1389832 1355335 1322190
8204A322190K601j5113l297k0503m2236k9686j9701k284K6373q890j2987J377
8192A197844k9133r459j5962j6619l3486n3985m905l519k522n122k2695l9223
8180I61214J905K0831p279k8106j8487J7867K922n861j115p480l478j3443k0661
8167H98829m7806k86p325m3725k7122O264K5188j3062k0223k2167k088P098k7599
8154G25976o276l0536l5487k5848K31J451M628j1153k7280j1787J2652J7458k4473
8141E89556n779K5279j688r242j888r195J1315J1554R346j311l1943K0221K9205
8128F35430K0612J3234k7272j8938j0067j3706k6284O966K1685J847K0140J4737
8116F38384rQ226K2451J4013J3614N184O242Q965o647k851K8693m85N603K1337
$$ plain form
8204 1322190 1324791 1309678 1306381 1285878 1243642 1213956 1194255 1191971 1218344 1209454 1196467 1197844
8192 1197844 1168711 1159252 1143290 1126671 1093185 1039200 1034295 1030776 1028254 1023132 1000437 961214
8180 961214 963119 983950 976671 948565 930078 947945 950867 945006 943891 936411 932933 919490 898829
8167 898829 851023 850737 843412 799687 772565 778829 804017 790955 770732 748565 746477 753575 725976
8154 725976 719700 689164 653677 627829 628060 629511 634139 622986 595706 583919 596571 614029 589556
8141 589556 583777 609056 607368 598126 596238 587043 598358 609912 619258 617947 586004 606225 635430
8128 635430 656042 669276 642004 623066 612999 599293 573009 579975 601660 603507 623647 638384
8116 638384 638375 646601 669052 683065 696679 701863 708105 717070 710423 707572 736265 735780 741383 762720
8102G62720M6856O0712R9305J04241J24265R8885O1575j5525q3683j15829j29386
8091A014136n9891m2203n0923l9498l0719n307l5515k9398j1359P719J3928j3489
8079G17481m4752m5015N044J8525M540J475J874j0154K9965M4946N4063P1336
8067H49328L3920N631J6003J1476P511M05J7744K7681M1749M1730R8837J64858
8055A316873J97834K38640K36969K01232L0853j72853k43716k36065j94756j60509
8045A214502r2638o3117n5229n8417p7870m1892l5567j6123j7130q243m260N625
8033G49641j3245l5114j7848P686M630k0755j1524O368J5223J0091j873K5746
8021G19026K1283m779J1422o626J191k057m0846R334K6044N7137P4271J00034
$$ plain form
8102 762720 809576 870288 969593 1073834 1198099 1296984 1358559 1343034 1259351 1143522 1014136
8091 1014136 954245 912042 861119 821621 790902 785595 750080 720682 709323 717042 730970 717481
8079 717481 672729 627714 632758 651283 655823 657298 659172 649018 678983 723929 777992 849328
8067 849328 883248 888879 904882 916358 923869 924274 942018 969699 1011448 1053178 1152015 1316873
8055 1316873 1514707 1753347 1990316 2191548 2222401 2049548 1805832 1569767 1375011 1214502
8045 1214502 1121864 1058747 1003518 945101 867231 825339 789772 773649 756519 748276 744016 749641
8033 749641 736396 701282 683434 691120 695750 674995 663471 669839 685062 695153 693280 719026
8021 719026 740309 735530 746952 740326 741517 739460 698614 707948 733992 791129 865400 965434
8009I65434R7345J15614P2215j7955r5522j17689r6374q9228n7492m8925l6391
7998F91032l2882j7707k0524k5511p801l4574j4675m6204k4084K567l2371m1386
7986C95880q473J4899J6081q120P427k1393Q35k8418l547L9563J5433k915k0556
7973C96696j860m3928l1453M837K465J7722K0144n163j4187j6017j2329n3J1879
7960C28753J6082n920j0122l7488n787j812j662J8290k3607j7149j6001M6013
7948B89590J9214M502j5865j207k1529k9322R753J1958j6337q457M135J6912L307
7935B66654j6855m191j2003J1288J7533n860r293l0703p279m432l451l52L252
7922B04308q721J4400J5696J4328K7418p381j6511k6490j3548J7625j8316r515
$$ plain form
8009 965434 1062779 1178393 1250608 1232653 1137131 1019442 923068 833840 776348 727423 691032
7998 691032 658150 640443 619919 594408 586607 552033 537358 491154 467070 469637 437266 395880
7986 395880 387407 402306 418387 410267 417694 396301 397136 368718 365171 404734 420167 417252 396696
7973 396696 394836 350908 319455 324292 326757 344479 364623 359460 345273 329256 316927 316874 328753
7960 328753 344835 338915 328793 291305 285518 283706 282044 300334 276727 259578 243577 289590
7948 289590 308804 313306 297441 296234 274705 245383 255136 267094 250757 242300 246435 263347 266654
7935 266654 249799 245608 233605 244893 262426 256566 247273 216570 209291 204859 201408 201056 204308
7922 204308 195587 209987 225683 240011 267429 260048 243537 217047 203499 221124 202808 193293
7910A93293K8457K5401p338L505j4572l8008j0292J239J584N940K1042o292m14
7897B03545j6682j9958P651o068j858K655J0138L741j1052J033L841m533K619
7884A75072J8724R24l2334l7122J9137K5417Q133j1600k6370Q110M231K086O992
7871A61400J5878l992J3666m743j0464k1433j0857J0073j1372m8374j6374J4096
7859H7504L2542P178J6955L5996l796k6653j783K3522j9544J0509J7479J1164
7847A91073q894k183n776K358p181j3854R274k375k3123n183q576j404O962l5902
7833I5216P674K3197j5758K1342J8697k3482N657K3553O763j6804K086J7930k9215
7820A36856p552j6266K45p877j810L2341L58K141p58j7855R77M681k207j6083
$$ plain form
7910 193293 221750 247151 239813 243318 228746 190738 180446 181685 183269 189209 210251 203959 203545
7897 203545 186863 166905 174556 168488 166630 169285 179423 183164 172112 173145 176986 172453 175072
7884 175072 193796 194720 162386 125264 144401 169818 177951 166351 139981 148091 152322 154408 161400
7871 161400 177278 173286 186952 182209 171745 150312 139455 149528 138156 89782 73408 87504
7859 87504 120046 127224 144179 180175 176379 149726 147943 171465 151921 162430 179909 191073
7847 191073 182179 179996 174220 176578 169397 155543 164817 162442 139319 134136 125560 124156 131118 95216
7833 95216 102890 126087 110329 131671 150368 126886 132543 156096 162859 146055 148141 166071 136856
7820 136856 129304 113038 113283 105406 103596 135937 136295 138436 137678 119823 120800 125481 123274 107191
7806A07191j6686O988J5564j1717k2973N716J1480N328J6045N849q077O617k0539
7793A00786j906M27j172J922M395l4396l1967K2352J2762J9339P788O164J2669
7780A19163k1567j0642J7199J1334j3366K052k7368j9756j4280J8150K1886q067
7768G4738p464o306J7071k217j8417q680q472K1046K4084Q577j4104J4395K1797
7755A16048K728o782j5750l630k0544K527L5847q207P239k3370n072m2171j9655
7742A9208K6316K0925L273m81k0217k3484J7489J6419K0652K2883J4016k4891
7730I2108j0390Q369J3803j9467l2338r935L3572L0057n781k4564j9222q901K8691
7717G6002K2223j6587J3276j7812j0627l1466l217R821J3947P552K1918J2199
$$ plain form
7806 107191 90505 97493 113057 101340 78367 84083 95563 100891 116936 122785 114708 121325 100786
7793 100786 98880 99307 98135 100057 104452 70056 38089 60441 73203 92542 100330 106494 119163
7780 119163 97596 86954 104153 115487 102121 104173 76805 57049 42769 60919 82805 74738
7768 74738 67274 60968 78039 75822 57405 48725 40253 61299 85383 93960 79856 94251 116048
7755 116048 118776 111994 96244 92614 72070 74597 110444 102237 109476 86106 81034 38863 19208
7742 19208 45524 66449 69722 69241 49024 25540 43029 59448 80100 102983 116999 92108
7730 92108 81718 90087 103890 84423 52085 42150 75722 105779 99998 75434 56212 47311 76002
7717 76002 98225 81638 94914 77102 66475 35009 31792 41613 55560 63112 85030 97229
7705I7229k4453k43J7840J031l4618j6652j2133L1203M6878k7918m7193L203L5817
7692F9991Q337j2995m973k4629K2654M794j2378n842m059j5212K6049N4022l905
7679A01854k3381q553p757k6891K576L0532P265j8087m100k4109R349J9649O600
7666F4947L073J0012P169m705k3548l4002J904L3354Q403O608R607L67q574n715
7652F8900j4017Q74l783l430J3468j3210J0047L6852j1005L014J5960k458k65
7639A00947n472k5775k650k2524j3705M172J3366J3654L632j3206j1205j297J0789
7626E0726j0147n676K5550K3135Q42J889j4021k4563j2709J5880L60K859Q936
7613F3061Q369j7514j9284m515j4013J3127M159j0228k307K772K8948J2227l408
$$ plain form
7705 97229 72776 72533 90373 91404 56786 40134 28001 59204 106082 78164 30971 34174 69991
7692 69991 78328 65333 60360 35731 58385 63179 50801 44959 40900 25688 51737 105759 101854
7679 101854 78473 69920 62163 35272 37848 68380 75645 57558 53458 29349 38698 58347 64947
7666 64947 68020 78032 85201 80496 56948 22946 24850 58204 66607 73215 82822 83189 74615 68900
7652 68900 54883 55757 51974 48544 62012 48802 58849 95701 84696 87710 103670 101212 100947
7639 100947 95475 69700 67050 44526 30821 34993 48359 62013 65645 52439 41234 39937 50726
7626 50726 40579 34903 60453 83588 84430 86319 72298 47735 35026 50906 51266 54125 63061
7613 63061 71430 53916 34632 30117 16104 29231 33390 23162 20855 23627 52575 64802 61394
7600F1394k2502j2604J5828R840n066o07j695J2627J7933N574k1663m1117k6080
7587h138P814K3456Q0l2551m620J1189J2496K6354j39J134j6795M606j0255p927
7573F704J886r199M653Q434N678n244Q765j7378K0442J9997r959O874J2012k2530
7559C1135q635J2365J5229j9931o949j3764j4572l570j2029L3960K9206N214j2645
7546C5014j3495L719k2010m358K0071K671J2000N201J5620k1986j7960L4595K1311
7533G0393p263j1761O711K7121K789l2099l1705n683J2267J3162P518J6356j8745
7520D9061j2890j5276L478k673k5469L601J1911K6029p496j7045j1911Q09L821
7507E950L272J3785M813k3815l521p870J2602K3427j2557L35m189j8160J2487
$$ plain form
7600 61394 38892 26288 42116 51956 46890 46283 44588 57215 75148 80722 59059 17942 -8138
7587 -8138 -324 23132 23212 -9339 -13959 -2770 9726 36080 35941 37075 20280 24886 14631 6704
7573 6704 8590 -609 4044 12478 18156 12912 21677 4299 24741 44738 34779 41653 53665 31135
7559 31135 22500 34865 50094 30163 23214 9450 -5122 -8692 -20721 13239 42445 47659 35014
7546 35014 21519 25238 3228 -1130 18941 21612 33612 38813 54433 32447 14487 49082 70393
7533 70393 63130 51369 58080 85201 87990 55891 24186 18503 30770 43932 51450 67806 49061
7520 49061 36171 20895 24373 21700 -3769 -168 11743 37772 30276 13231 1320 2129 5950
7507 5950 9222 23007 27820 4005 484 -7386 5216 28643 16086 16421 12232 -5928 6559
7494F559J077M388o79J7470k681l195n515k1417O140K3932K7523q126j7734j0761
7480A6981q8m644k9078P272J0265K0377J1813N917p923l748r307j1754J8676J7431
7466D2190J5675K5502r818m2495k2819o852O129J9970j635K0573r279l1774N693
7453A1060K277K1765j1923l391j523l1980J3288L3829K1160J0667l582l9611k1126
7440I10R694M43J030j664M486j1306J5015K3687l015O408J5054J2443k1656j5858
7426C5671q603J26k4203l297L2191N273j270K175J6362K4086m571j5890j777J4045
7412G0318k2040o672m545Q246l0065j117K6107J4324N93k513O629r288p023q172
7398C4782k7999j9029l509J5010K3678J2631M747j6664k2046M218P216m189J2382
$$ plain form
7494 6559 7636 12024 11345 28815 26134 22939 17424 -3993 2147 26079 53602 45476 27742 16981
7480 16981 16893 12249 -16829 -9557 708 21085 32898 38815 30892 27144 17837 6083 24759 42190
7466 42190 57865 83367 73549 31054 8235 1383 7512 27482 25847 46420 37141 5367 11060
7453 11060 13337 35102 23179 19788 18265 -13715 -427 33402 54562 65229 61647 22036 910
7440 910 10604 11047 12077 10413 14899 3593 18608 42295 39280 45688 60742 73185 51529 35671
7426 35671 27068 27194 2991 -306 31885 37158 35888 38063 54425 78511 73940 58050 56273 70318
7412 70318 48278 41606 37061 45307 15242 14125 40232 54556 55149 52636 59265 49977 42954 34782
7398 34782 6783 -12246 -15755 -745 22933 35564 40311 23647 1601 5819 13035 8846 21228
7385B1228R685J9333K3058j3532l1431J638m236R585R693L3974j4618J064p519
7372E7922m1656k4945M835J6227J4969J2834j744k3862J815n036j7890J4698q189
7359b2j1736J8198J5338j8131j0952J7962j9262j0917J9874l344J6858K678J652
7346A8196Q233r798k7705q637J9954K5927J095j0127P533k8775P528L5300J7061
7333E5785l3830k2311K8666J155j9917M842l697j6881P69J876J1371j762K1433
7320B7499M627q445r336j5466Q847J2631R271j2765j5774J5605K902J2815Q501
7307D0912k839q095L643O757m131k667m0648m7301K8412L9595J9918j2871j3144
7294G541j5023j6282K0414P777J5411K8118r703R10M153L036m757q621j7094p99
$$ plain form
7385 21228 30913 50246 73304 59772 28341 29979 25743 35328 45021 78995 64377 65441 57922
7372 57922 16266 -8679 -3844 12383 27352 40186 38442 14580 16395 11359 -6531 8167 -22
7359 -22 -11758 6440 21778 3647 -7305 10657 -8605 -19522 352 -2992 13866 16544 18196
7346 18196 26429 16631 -11074 -19711 243 26170 27265 17138 24671 -4104 3424 38724 55785
7333 55785 21955 -356 28310 29465 9548 14390 10693 -6188 -5419 -3543 7828 6066 27499
7320 27499 32126 23681 14345 -1121 7726 20357 29628 16863 1089 16694 19596 32411 40912
7307 40912 38073 29978 33621 40378 36247 33580 -7068 -54369 -25957 13638 33556 20685 7541
7294 7541 -7482 -23764 -3350 4427 19838 47956 38253 39163 43316 46352 41595 32974 15880 15081
7280A5081K536k8416l8218r479K0156Q663J3139j2350N358J149J0229O884q216
7267a3484O675J2923N716l610p828j0843M246L796K302J1575J1665j3476n475
7254D182J3032K5385J1003m741K5747k4106k1384R459j1989l9030j4722J8663
7242h501m285J531j8431J5809K7242j7728O366L3202k0698o939O497J3144j7619
7229I590j0360Q027M6475K9011j1501k8473j2009j9781J6282o283q044k5097J900
7216a0263P026l682q299K975O7K0973m275K931J428k166J4901R619J1966j5042
7202B8159j5080j4432O500o502m3979N017L4347J7406L801l222r230M6265o095
7189D2955k2843q13m01n49L102L482q08k2361m535J2639j7684J4626k0947j701
$$ plain form
7280 15081 17617 -10799 -49017 -58496 -38340 -29677 -16538 -28888 -23530 -22381 -12152 -5268 -13484
7267 -13484 -6809 6114 11830 8220 392 -10451 -6205 -2409 -107 11468 23133 9657 4182
7254 4182 17214 42599 53602 48861 74608 50502 29118 38577 26588 -12442 -27164 -8501
7242 -8501 -12786 -11255 -29686 -13877 13365 -4363 2003 35205 14507 7568 14065 27209 9590
7229 9590 -770 7257 53732 82743 71242 42769 30760 10979 27261 20978 12934 -12163 -10263
7216 -10263 -3237 -6919 -15218 -12243 -12176 8797 4522 7453 8881 6715 21616 31235 43201 28159
7202 28159 13079 -1353 5147 -1355 -45334 -40317 -5970 11436 15237 12015 2785 49050 42955
7189 42955 20112 19299 18898 18349 21451 24933 24125 1764 -2771 9868 -7816 6810 -14137 -15838
7175a5838L71O150J5722j7218r183J8514K3311O454j5464J92k741Q410k6j8204
7161D50k476N570K5326Q586M425r536k4135k047k0359J1504n943J0620R476L898
7147A5359o992k4749P325K2778M337P389O416k4037j8777J4442J748K8112J7820
7134E1171r144k9224k830J8204J22L422p075j9663j2678K3601j0181Q046L2265
7121D6036j390j6240p850j1593J9492P92k6040q097O217J3038o404N964o977J6531
7107B3479J6848k8266J3588L0203m874j9732j3081j7898J7309l806j7245k3020
7095b6495P287P996l663J1398j790L115O820k0803j8195n606J5019R868J6646
7082A597R878N303L594k726J932q554J5232K1743j9707l0160l7096J6094N543
$$ plain form
7175 -15838 -15467 -9317 6405 -10813 -19996 -1482 21829 28283 12819 13011 10270 18680 18654 450
7161 450 -2026 3544 28870 37456 41881 32345 8210 6163 -14196 -2692 -8635 1985 11461 15359
7147 15359 8367 -16382 -9057 13721 18058 25447 31863 7826 -10951 3491 5239 33351 51171
7134 51171 42027 12803 9973 28177 28299 31721 24646 4983 -7695 15906 5725 13771 46036
7121 46036 44646 28406 20556 8963 28455 29247 3207 -4890 1327 14365 7961 13925 6948 23479
7107 23479 40327 12061 25649 55852 50978 31246 18165 267 17576 13770 -3475 -26495
7095 -26495 -19208 -11212 -14875 -3477 -5267 -2152 4668 -16135 -34330 -39936 -24917 -15049 1597
7082 1597 11475 16778 20372 17646 19578 11024 26256 47999 28292 -1868 -38964 -22870 -17327
7069a7327J797M2415L839j8801q93j1977Q786j9570R179J1049K805m461J1093
7056A7934L5840j6747m8186K265L0931J0666j0252j7339J484N902R626l619r609
7043H896N678R871J4926J0731R105o4458m5539J6485L075J5556L3624j0916L762
7030A0796K5530O736j824q857k2599l44o310j0527O105J0543N217J4924j2382
7017A7008k1624j4118L858M4204j5489j5264Q774L038j7256k428K2520k8415k219
7004a7411J2558R946J8045k215l733k3537j7537K4750K9062L817j2781j6200j2128
6991g364k2254r775Q289J7833J5727O850J1614p545j7179m112j0069J115J100
6978a5770k879J019J6695K7886l899p638k981N217K285j384Q037o623q086J8337
$$ plain form
7069 -17327 -15530 26885 30724 11923 11030 -947 7839 -11731 -2552 8497 11302 6841 17934
7056 17934 53774 37027 -11159 -8894 22037 32703 22451 5112 6596 12498 22124 18505 8896
7043 8896 14574 24445 39371 50102 59207 -5251 -50790 -34305 -31230 -15674 17950 7034 10796
7030 10796 36326 43062 41238 32381 9782 9438 3128 -7399 -1294 9249 14466 29390 17008
7017 17008 -4616 -18734 -14876 29328 13839 -1425 7349 10387 -6869 -9297 13223 -15192 -17411
7004 -17411 -4853 5093 23138 20923 17190 -6347 -23884 866 29928 33745 20964 4764 -7364
6991 -7364 -29618 -39393 -31104 -13271 2456 9306 20920 13375 -3804 -7916 -17985 -16870 -15770
6978 -15770 -18649 -17630 -935 26951 23052 15414 12433 17650 19935 18551 26588 19965 11879 30216
6964C0216k4640j5306j2135j2039k2410O909J9668J5832J8845K995q041K0938
6952B0832K6267j867P628q445j9903k0451j6758p843l146J7139j267n315j824
6939a4953j480j7122p309M2397J9139M194k0067j8812J9804j0798k7931p329J2173
6926b8094j1989J0997j30m518l919J6483J6703J796j233p385o526Q983l1675K439
6912c8068j2364k675J1794K0850L1104J802l6637p003j338L941K442J9868j854
6899h138j2016N60J1287J0347j0493j4155j779j584L8902K1808m185j0778k0514
6886g38K020J9712Q427k901P20j8449j9893j6793J4333Q158L225p703q429j325
6872a9636J5169K2512n027m831M782j5765J7853J4215l559Q966J7434l81n927
$$ plain form
6964 30216 5576 -9730 -21865 -33904 -56314 -49405 -29737 -13905 4940 7935 -106 20832
6952 20832 47099 45232 52860 44415 24512 4061 -12697 -20540 -23686 -6547 -7814 -13129 -14953
6939 -14953 -16433 -33555 -40864 1533 20672 24866 4799 -14013 5791 -5007 -32938 -40267 -28094
6926 -28094 -40083 -29086 -29216 -33734 -37653 -21170 -4467 -2671 -3904 -11289 -17815 -8832 -40507 -38068
6912 -38068 -50432 -53107 -41313 -20463 10641 12443 -24194 -31197 -32535 -28594 -26152 -6284 -8138
6899 -8138 -20154 -19594 -8307 2040 -8453 -22608 -24387 -25971 12931 34739 30554 19776 -738
6886 -738 1282 20994 29421 26520 27240 8791 -11102 -27895 -13562 -5404 -2179 -9882 -18311 -19636
6872 -19636 -4467 18045 13018 8187 12969 -2796 15057 29272 25713 34679 52113 51732 45805
6859D5805j4112j5984o515J0696o331Q146J0146M756k0912J4299J8279J205j3183
6846C6295j3308j220O612n202Q133j8949l1121r161J9729j6993R67N387J3185
6833e646J3821l1751j9184L3168J2925k673R437k0354k087n447j8631r309n153
6820e0884P516j126L0702L9106p64j9762j0109J3383J6607k0498m413J5335k3505
6807h412j3480j3459m247J7028J9399K2502m253J9786j404j7725J744P662q602
6794A6539j9121j2561j2186m189J641K2613J9953o680q766j3553M433j6510r195
6781c7582K9332K616k5754J4504K0654p270m697J9891l56o927j7873J0005N204
6768A747M655k5250J8910L770j7397k3817r875K6354L5398j9535j157J3629P850
$$ plain form
6859 45805 31693 15709 9194 19890 13559 21705 31851 36607 15695 29994 48273 49478 36295
6846 36295 22987 21767 28379 23177 31310 12361 -18760 -27921 -8192 -25185 -24218 -18831 -5646
6833 -5646 8175 -23576 -42760 -9592 3333 660 10097 -10257 -12344 -17791 -36422 -45731 -50884
6820 -50884 -43368 -44494 -13792 25314 24550 4788 -5321 8062 24669 4171 -242 15093 -8412
6807 -8412 -21892 -35351 -39598 -22570 -3171 19331 15078 34864 33460 15735 17479 25141 16539
6794 16539 -2582 -15143 -27329 -31518 -29877 -7264 12689 6009 -2757 -16310 -11877 -28387 -37582
6781 -37582 -8250 -5634 -31388 -16884 3770 -3500 -8197 11694 11338 4411 -13462 -3457 1747
6768 1747 6402 -18848 62 3832 -13565 -37382 -47257 -20903 14495 -5040 -6197 7432 15282
6755A5282O145k09j2093l0612k6712J5765N78J563R717L2167Q168J666k2163l131
6741c869p14L2645M623j9999K2524j1978l7689K0365K9678m178J610q666j6781
6728G571O657r808J1433K7696m491k5938j9695J1198L2496O850l2046k8883J1918
6715e042K922K2187P058J0422O268J4054J0111R792k0580j3455j0796r344O32
6702B4229j319p463j5580k3261Q386N549L0704M1434j5694o880o54p649K50j2331
6688A9721q512o86M12O371j476j7873K7671J9233J808j374P433k9563k3843j2610
6674a3288J0429j36j255J8797k8382j1325J1763L230K4490K999l3554j5632J6481
6661a5383K4134J977j6417J4129m267k0411j5709j542J8764m828l0286j2216K8630
$$ plain form
6755 15282 21427 21218 9125 -21487 -48199 -32434 -31856 -30293 -20576 11591 19759 21425 -738 -3869
6741 -3869 -4583 28062 32685 12686 35210 23232 -14457 5908 35586 31408 33018 24352 7571
6728 7571 14228 4420 15853 43549 39058 13120 -6575 4623 37119 43969 11923 -16960 -5042
6715 -5042 -2120 20067 27125 37547 43815 57869 67980 77772 57192 43737 32941 23597 24229
6702 24229 22910 15447 -133 -23394 -15008 -9459 21245 62679 46985 40105 39451 31802 32052 19721
6688 19721 11209 10523 10935 17306 15830 -2043 25628 44861 46669 45295 52728 23165 -678 -13288
6674 -13288 -2859 -2995 -4250 14547 -13835 -25160 -13397 -10167 14323 17322 -16232 -31864 -15383
6661 -15383 8751 10728 -5689 8440 4173 -16238 -31947 -33489 -14725 -19553 -49839 -62055 -33425
6648c3425M3664j4080M2J4131K4067k912J7990k1113k1310K8151n418k6308m089
6635f10M578P580o904j8439j1510J9945j398n360k3910m9523J8833N1788O612
6622h318k58N719K622q982j5736j4910N258J3523N293J7256m741l772j153M679
6608c520p302j7949L5479R795J237Q943P102j3324l7629j0789m424K4407M543
6595c431p691q455n559N308J5512j0823j2412L830K145O629j9985j778m60N01
6581c6669J6678n845J6044J2565j0573k3941j1781q18K4853N342j1175j4006J3178
6568b6148K365k3759j7365K6045K2669K2332J4994j523j7873j8078j2856j4484
6556d3681K0177J7418K810L0382J9634k0511j2480l747l0495l2640J4857L9047
$$ plain form
6648 -33425 10239 -3841 -3799 10332 34399 31487 49477 28364 7054 35205 29787 3479 -610
6635 -610 3968 11548 4644 -13795 -25305 -5360 -6758 -12118 -36028 -85551 -66718 -14930 -8318
6622 -8318 -8576 -2857 -235 -9217 -24953 -39863 -34605 -21082 -15789 1467 -3274 -7046 -8199 -3520
6608 -3520 -10822 -28771 6708 16503 17740 26683 33785 20461 -17168 -27957 -32381 -7974 -3431
6595 -3431 -11122 -19577 -25136 -19828 -4316 -15139 -27551 -23721 -21576 -14947 -34932 -36710 -37170 -36669
6581 -36669 -19991 -25836 -9792 2773 -7800 -31741 -43522 -44340 -19487 -14145 -25320 -39326 -26148
6568 -26148 -23783 -47542 -64907 -38862 -16193 6139 21133 19610 1737 -16341 -29197 -43681
6556 -43681 -23504 -6086 -3276 27106 46740 26229 13749 10002 -20493 -53133 -38276 771
6544G71J8082N338j0339j5518N264J7094L933j0502q444M80L3594J0549k0321
6531B9981j4174M945o631j2827j947R126L226J3735J5598l7107j0099j1322M994
6518a2502K4907J3140j6107k3299j14Q611K3078m956m437K4629J1922N565k2622
6505B7815k5195J0154j5935m749k5402N299K338r028L7446J0688R10J8995O277
6492C9613J973j3879j4177j2059j9053L5427J5877J0411j9569q370K5054r985
6480C1263j0200J5044J5433j3669k2042j8286j0174J1043L0157k979j6232j7967
6468h609J1459r863J0107p833n692J0179R64r759k284J3338K001n88m364j9489
6454b0433M788N403Q618J9674O997o690k6164j1617j0143J9256J045k5453j623
$$ plain form
6544 771 18853 24191 13852 -1666 3598 20692 24625 14123 5679 6159 39753 50302 29981
6531 29981 15807 20752 14121 1294 -653 8473 11699 25434 41032 3925 -6174 -17496 -12502
6518 -12502 12405 25545 9438 -13861 -13975 -5364 17714 12758 8321 32950 44872 50437 27815
6505 27815 2620 12774 -3161 -7910 -33312 -28013 -25675 -34703 2743 13431 14341 33336 39613
6492 39613 41586 27707 13530 1471 -17582 17845 33722 44133 24564 16194 41248 31263
6480 31263 21063 36107 51540 37871 15829 -2457 -12631 -1588 28569 25590 9358 -8609
6468 -8609 2850 -7013 3094 -4739 -10431 -252 712 -9047 -11331 2007 4008 3420 -944 -20433
6454 -20433 -15645 -10242 -1624 18050 25047 18357 -7807 -19424 -29567 -10311 -9266 -34719 -36342
6441c6342K0072K9295r708j1640j5532J2450n009j6681R250J3548O172M874k2110
6428b1361m5407M723L2967K7293P082j4908Q131j3982l041j5109j5366J1524J8240
6415a9214Q640K4808l5783J1744L3586j3008k2107Q149K2715j310l0459N288n685
6402a2636j4201J9333K6584k897k8569j5344K756J3572j9598M422R702j0610Q13
6389b6673R356j6205R495K3721K1088j6124k5865j2669j0620O945K5164M879J5268
6376G760J0457R11m1431k4603L9186J9388r882n819k2283J6543j0981l4459O158
6363d9055K7091J4870m792j5746k7132L1857K7954l555j5698j5493K264J5331
6351a2104J5077r02j584n696r537J8037K7757J0452k3419j3729J2731K4656O799
$$ plain form
6441 -36342 -16270 13025 3317 -8323 -23855 -11405 -16414 -33095 -23845 -10297 -4125 749 -21361
6428 -21361 -66768 -62045 -29078 -1785 5297 -9611 -1480 -15462 -18503 -33612 -48978 -37454 -19214
6415 -19214 -10574 14234 -21549 -9805 23781 10773 -11334 -3185 19530 18220 -12239 -6951 -12636
6402 -12636 -26837 -7504 19080 16183 -12386 -27730 -24974 -11402 -31000 -26578 -16876 -27486 -26673
6389 -26673 -17317 -33522 -24027 -306 20782 4658 -21207 -33876 -44496 -37551 -12387 -7508 7760
6376 7760 18217 19128 -22303 -46906 -7720 11668 1786 -4033 -26316 -9773 -20754 -55213 -49055
6363 -49055 -21964 -7094 -11886 -27632 -54764 -22907 5047 1492 -14206 -29699 -27435 -12104
6351 -12104 2973 2071 487 -5209 -14746 3291 31048 41500 18081 4352 17083 41739 48538
6338D8538m364k3990k7272k0713J3357N630k178J6444j5206R8Q875J3360J2870
6325B5449K709j0765J6603j6532k6357O895n948j5780m040M65j0561R332J5124
6312a3406J0040j8214R870K1209M072p494k2717J184q80j3417K8950L0853l0101
6299e1k0689L621K6128O063k5136o04M780J2031P879q074K351J7312k8015K1486
6285A9082M801k3597j613r729j8015J4554J4716P93j1368j2325m281L5790j1935
6272c127k2962M394p001n546J2929J1630r389J9485R965k1044j390J5886m004
6259a74l0249p745J1273M991k8784r486M0737L034q58l921J9661j4273q544j1649
6245c5987J3048J5527l1092j2198K7996O197j271J4177J4100P01n87O601Q59l2179
$$ plain form
6338 48538 44174 20184 -7088 -27801 -14444 -8814 -10992 5452 -9754 -9656 -781 12579 25449
6325 25449 28158 17393 33996 17464 -8893 -1998 -7946 -23726 -27766 -27301 -37862 -28530 -13406
6312 -13406 -3366 -21580 -11710 9499 13571 6077 -16640 -15456 -16336 -29753 -803 30050 -51
6299 -51 -20740 -17119 9009 15072 -10064 -10668 -5888 6143 14022 5948 8299 25611 -2404 19082
6285 19082 23883 286 -1327 -11056 -29071 -14517 199 992 -10376 -22701 -26982 8808 -3127
6272 -3127 -26089 -21695 -28696 -34242 -21313 -9683 -19072 413 10378 -10666 -12056 3830 -174
6259 -174 -30423 -38168 -26895 -21904 -50688 -60174 -19437 -16403 -17261 -21182 -1521 -15794 -24338 -35987
6245 -35987 -22939 -7412 -38504 -50702 -22706 -16509 -17780 -3603 10497 11198 10611 17212 18071 -14108
6231a4108k3319Q905R52K8732J9120p415j1259R64j2843N69k201k7823k0079o477
6217f6282l518L0873J7552L9J8573J8629k371m3769k1099J2168J4642K6956K3094
6204B5487r546k1563p094K2593J7195M11p90J1113r701j8837q15k0607j8444r178
6190c9776J4824j4700j5643P053M571L5626J8314k500k110N642R967j4942O713
6177A3039r149m4986L478L5382j0820j9703Q646J5315j1799J8254R612k8740j9298
6164d0769l982M2342P350K295N767j5205j9871j9465p793K8787J5304R063k206
6151A617l360j1193j543l120j4258J791J6937M73J2863j7058M509j7418R877R081
6137a0802K419J4997r384J170K8185Q589l491k1753j6420L5221k6203j8690M36
$$ plain form
6231 -14108 -37427 -28522 -27570 1162 20282 12867 1608 2572 -10271 -9702 -11903 -39726 -59805 -66282
6217 -66282 -69800 -38927 -21375 -21336 -2763 15866 13495 -30274 -51373 -39205 -24563 2393 25487
6204 25487 15941 -5622 -12716 9877 27072 27483 26693 37806 28105 9268 8453 -12154 -30598 -39776
6190 -39776 -24952 -39652 -55295 -48242 -43671 -8045 10269 7769 5659 11301 21268 6326 13039
6177 13039 3890 -41096 -37618 -2236 -13056 -32759 -24113 -8798 -20597 -2343 7269 -21471 -40769
6164 -40769 -44751 -2409 4941 7236 13003 -2202 -22073 -41538 -49331 -20544 -5240 3823 1617
6151 1617 -1743 -12936 -14479 -17599 -31857 -30066 -13129 -12656 207 -16851 -12342 -29760 -19883 -10802
6137 -10802 -8383 6614 -2770 -1600 26585 35174 31683 9930 -6490 28731 2528 -16162 -15726
6124a5726j4432j7642J3144M721k4433J4734K580r377O859J0901k658M781J0827
6111a5721q148K2339m059J5435R897j2755r887J291r301k0202K4399J6131j2878
6098c459k5709j3893K0072J7370j0342q167R781K137k334n056O953N331P188J0156
6084A0028K4041m765l4662l2P749j4244r789J1078J5337K810m647j1295j3495
6071b1886P242Q634j4355o047j3895K2320M4076Q925n098k7454l1523R908J5744
6058c409K04k0872r833J5311J767p208k2179M179J6259l655j8403k1027O951L1328
6044c0587L3394j058j6395j301o675J8309n24J275l324k860j3706K481K9419Q005
6030A6453k9250J51J5952j1968M694j1148m315N614n571p782J9911k2844k6414
$$ plain form
6124 -15726 -30158 -47800 -34656 -29935 -54368 -39634 -37054 -46431 -39572 -28671 -31329 -26548 -15721
6111 -15721 -23869 -1530 -5589 9846 19743 6988 -2899 -1608 -10909 -31111 -6712 9419 -3459
6098 -3459 -29168 -43061 -22989 -5619 -15961 -24128 -14347 -12210 -14544 -19600 -12647 -7316 -128 10028
6084 10028 34069 29304 -5358 -5390 2359 -11885 -21674 -10596 4741 7551 2904 -8391 -21886
6071 -21886 -14644 -6010 -20365 -26412 -40307 -17987 26089 35014 29916 2462 -29061 -19153 -3409
6058 -3409 -3205 -24077 -33910 -18599 -16832 -24040 -46219 -42040 -25781 -29436 -47839 -68866 -61915 -30587
6044 -30587 2807 1749 -14646 -15947 -22622 -4313 -4837 -3562 -6886 -9746 -23452 -20971 8448 16453
6030 16453 -12797 -12646 3306 -8662 -3968 -15116 -19431 -13817 -19388 -27170 -7259 -30103 -56517
6017e6517j4775L1122M3763k273k7941j7224K0430L2025R790k9130j0054M694
6005a6090M340l0761P647J5464k097J2519N06J8976J0377j2609k6019k709N761
5992a4695P637j8747L318Q792J2319k109k6028M652L0292n377J008M913r346l1196
5978c4567j7647J0222K9908J9165j0066j7222J308J5590N988J9856p307j0053
5966E175m689k194r545j3128J978J6530K140K3639j1752j801J8523r077j0444
5953E355j1310P69j9610J1247K824J8464k537j6611N562M586j2590K1863K8252
5940C6264Q366k2544j6935L2130J6939m2732j828l647J1833K127j9252J9617j9541
5927G97l7014J3752n322R077M879J8982j0821j3415o077J155M3955l4185p757
$$ plain form
6017 -56517 -71292 -40170 3593 1320 -26621 -43845 -23415 8610 18400 -10730 -20784 -16090
6005 -16090 -11750 -42511 -34864 -19400 -21497 -8978 -8472 10504 20881 8272 -17747 -20456 -14695
5992 -14695 -7058 -25805 -22487 -13695 -1376 -3485 -29513 -24861 5431 54 1062 5975 -3371 -34567
5978 -34567 -52214 -41992 -12084 7081 -2985 -20207 -18899 -3309 2679 22535 15228 5175
5966 5175 486 -1708 -11253 -24381 -22403 -5873 -3733 19906 8154 6353 24876 15799 5355
5953 5355 -5955 -5186 -24796 -13549 -10725 7739 5202 -11409 -5847 -1261 -13851 8012 36264
5940 36264 44630 22086 5151 37281 54220 11488 9660 6013 17846 19973 721 20338 797
5927 797 -36217 -22465 -27787 -18710 -13831 5151 -5670 -19085 -25162 -24007 19948 -14237 -21994
5914b1994L4276N837j86J4874j8895K522q404j848N911k0605j2024j1201J3883
5901a7854j2872q466N920J2075k3599p793n579K0427J7992J0036j6374p657K0982
5888a2762q621m887L959j310j2783k1086j497J0902j105q031j295L8938J7500
5875b078R770j5568j2421J4053R575o245N391Q75r017J8556J5781j1958k7500
5862a0786k1229K1077K5137R990m0414j4705J5843k4911k3024j3528J008J0623
5850f4919J0391n562L4071J9961J1252l282Q289R639j7222j7550q021K171O668
5837a4114K888k1223j0165J1643M1307K9901j4986j0699j0291M713K137j5793
5825d682l0546n379J1042K5386L1145J3229o901P991p621p0076j0551M2583K1438
$$ plain form
5914 -21994 12282 18119 17933 32807 13912 16434 8030 6182 12093 -8512 -20536 -31737 -17854
5901 -17854 -30726 -39192 -33272 -21197 -44796 -52589 -58168 -37741 -19749 -9713 -26087 -33744 -12762
5888 -12762 -21383 -26270 -22311 -23621 -36404 -57490 -58987 -48085 -49190 -57221 -58516 -19578 -2078
5875 -2078 7692 -7876 -20297 -6244 3331 -2914 2477 3352 -5665 12891 28672 16714 -10786
5862 -10786 -32015 -10938 14199 24189 -16225 -30930 -15087 -39998 -63022 -76550 -75542 -64919
5850 -64919 -54528 -60090 -26019 -6058 5194 1912 10201 19840 2618 -14932 -22953 -20782 -14114
5837 -14114 -11226 -32449 -42614 -30971 10336 40237 25251 14552 4261 8974 11111 -4682
5825 -4682 -35228 -40607 -29565 -4179 26966 40195 33294 41285 33664 -36412 -46963 -4380 17058
5812A7058m1831N891k479q420j511P601K0912J3210o197l0735K3263J1597m215
5799D144k365j2443M010j6184K0670J9678j6569l569J6099L206j8901j1364K7160
5786A3572k8992k0847K4511r63O677m444O58o83j3891J8367j712j1332j609J7336
5772c352j5629L429o270k677Q955J409n633J9820j0170K1819J86j9723k5006l670
5758c6512J0854M190P730J1700k5802l4150J5929M434j3885p735L413K2396n095
5745d2533J2098J9360q349j1111Q056J8221J5760L0132O597j7491p203j126r613
5732A2798M921j4825J2573K984j51j6683r349M800P713O84j9713K357K45P54J1615
5717G23Q342j9904k8382Q638o165k3165J0948M053K484j8611O640J8745r095q97
$$ plain form
5812 17058 -24773 -18882 -21361 -29781 -31292 -23691 -2779 10431 4234 -26501 -3238 8359 4144
5799 4144 1779 -10664 -6654 -22838 -2168 17510 941 -2628 13471 16677 -2224 -13588 13572
5786 13572 -15420 -36267 -11756 -12719 -6042 -10486 -9828 -10511 -24402 -6035 -7747 -19079 -20688 -3352
5772 -3352 -18981 -15552 -21822 -24499 -15544 -14135 -19768 52 -10118 11701 11887 -7836 -32842 -36512
5758 -36512 -25658 -21468 -13738 -2038 -27840 -61990 -46061 -41627 -55512 -63247 -59834 -37438 -42533
5745 -42533 -30435 -11075 -19424 -30535 -22479 -4258 11502 41634 48231 30740 23537 22411 12798
5732 12798 17719 2894 15467 18451 18300 1617 -7732 -2932 4781 5465 -14248 -11891 -11646 -10892 723
5717 723 9065 -10839 -39221 -30583 -36748 -59913 -48965 -44912 -42428 -61039 -54399 -35654 -44749 -45646
5703d5646J8579J6974N663k5952K729J2657r695J7416k389l6024j0801J5774K8774
5690a1941K1039Q245P525J738m979l272J9758K8856k3774q898j0607j1921R961
5677B1730k9685j5195M006J2919Q063J755j497N334k2738q55L4187J0096k1593
5664F527j8648j6033J2394j0072q058L5758l161j4934j2216n601J8914K95o381
5651b1216j4503n376J5026m804J4855N17k1972R721J0594R656K5235m413l997
5638I323K5234k627l9449j5873j4840J9581N814K9483K1178J457l0234j9881O191
5625d643j5620J120J663j5639J0076M95K1405J845j4897j4071K8535M837k916
5612B190j7573j4404l224J0796j0895P857K8843L2717J027q577j8314j869j4591
$$ plain form
5703 -45646 -27067 -10093 -4430 -30382 -27653 -14996 -24691 -7275 -9664 -45688 -56489 -40715 -11941
5690 -11941 9098 17343 24868 26606 21627 18355 38113 66969 43195 34297 23690 11769 21730
5677 21730 -7955 -23150 -19144 -6225 1838 3593 2096 7430 -15308 -16163 18024 28120 6527
5664 6527 -12121 -28154 -15760 -25832 -33890 1868 -1293 -16227 -28443 -34044 -15130 -14835 -21216
5651 -21216 -35719 -41095 -26069 -30873 -16018 -15501 -37473 -27752 -17158 -7502 17733 13320 9323
5638 9323 34557 31930 -7519 -23392 -38232 -18651 -12837 16646 37824 39281 9047 -10834 -4643
5625 -4643 -20263 -19143 -17480 -33119 -23043 -22548 -1143 702 -14195 -28266 269 5106 2190
5612 2190 -15383 -29787 -33011 -22215 -33110 -25253 3590 36307 37334 28757 10443 8574 -6017
5599f017j0049N679l380O135j6852r290N161q444k6244j3367R008L0378o251J1999
5585c1534J3913J428R492k1856k1546O547K203K5628K7029k2176l1321K5858K4107
5572G772p800L2164j4981j9594K591n379J3987l480J765L2742R043j2988j8819
5559A7023j2188n945p870J286n617O939J531M668p969o679J3145R848j2455j1005
5545a5288L201J8143R693j022j5845o351J2294R981L904L927P123m720M567O198
5531C5805j1222m517k6841j8461j3933k474K2234m599J9452K9528m020k1184j0441
5518a0673J4543q419K728M7068K2461k3785l8529q032j4942j681J7192R583l4483
5505b6969j5981L1395o134O060j282j3145r73N402L19J887J7628m089P111O082
$$ plain form
5599 -6017 -16066 -10387 -13767 -7632 -24484 -33774 -28613 -37057 -63301 -76668 -67660 -37282 -43533 -31534
5585 -31534 -17621 -16193 -6701 -28557 -50103 -43556 -41353 -15725 11304 -10872 -42193 -16335 7772
5572 7772 -28 32136 17155 -2439 152 -5227 8760 5280 7045 39787 48830 35842 17023
5559 17023 4835 -1110 -8980 -7694 -13311 -6372 -4841 -173 -8142 -14821 -1676 8172 -4283 -15288
5545 -15288 -12087 6056 15749 14727 -1118 -7469 4825 14806 18710 22637 29760 25040 29607 35805
5531 35805 24583 20066 -6775 -25236 -39169 -41643 -19409 -24008 -4556 24972 20952 -232 -10673
5518 -10673 3870 -4549 -1821 45247 67708 43923 5394 -2638 -17580 -19261 -2069 7514 -26969
5505 -26969 -42950 -11555 -17689 -11629 -12911 -26056 -27029 -21627 -21308 -19421 -1793 -5882 1229 7311
5491G311k3662j151R417J8317r191n1931r774L1370J2025q709j3208J591j666
5478c9261J9683J2461J0444l0387k2232l335K2557K0183j8357j0883R014N803
5466b4310j0767j6459M1594J2675M61J1090j8179l1655K6781M0138J7907l5792
5454A3484l763j742j397m039k8440L815l072J4185J5524j590R104o477j6075K2514
5440A2031o79k5756m690P872J339j2577J123k045O555K674N414J2509J7291N002
5426B6063k2033P159l1506o435K1190j5694P841K7124j2663M423R546k300j1425
5413A290j5435q289R171N251j8349l865J3623m013k3475j0942m300j355L2167
5400b8521J5938O741K576P106j9798k9107N506L7799J2868o77k0540j2871J7650
$$ plain form
5491 7311 -16351 -17502 -8085 10232 1041 -50890 -60664 -29294 -17269 -25978 -39186 -37595 -39261
5478 -39261 -19578 -7117 3327 -27060 -49292 -52627 -30070 -9887 -28244 -39127 -30113 -24310
5466 -24310 -35077 -51536 -9942 2733 3194 14284 -3895 -35550 -8769 31369 49276 13484
5454 13484 9721 7979 6582 2543 -25897 -22082 -25154 -10969 4555 2965 12069 5592 -10483 12031
5440 12031 11352 -14404 -19094 -11222 -9883 -22460 -21337 -23382 -16827 -14153 -8739 3770 21061 26063
5426 26063 4030 11189 -20317 -26752 -5562 -21256 -13415 13709 1046 5469 15015 12715 1290
5413 1290 -14145 -22434 -13263 -8012 -26361 -30226 -16603 -20616 -44091 -55033 -59333 -60688 -28521
5400 -28521 -12583 -5842 -3266 3840 -15958 -45065 -39559 -1760 11108 10431 -10109 -22980 -5330
5387e330J3034J5193k1797k616L896j4973j279n109K893N2M461m312P20J37j0403
5372b5433J6159J6868Q320k5843r886l092J5791J428J7523n364Q424j435r511
5359C949J2678n076k0581q891J6561j447k8573J5435J1690J3024j0155J99k430
5346c617Q677J6755O731k009l137l6481k87M670l835l321J0177M188k3849Q8J2851
5331a2399r184p911N436R968J2138j6869j7491j438L426j965j1165j275K6955
5318b1774J7885R952K026K211j1905j2619K557l220K240K0761j9428k5040K233
5305c4121Q576J2546J1531K2086l941j2190M44R899L388l5082q480K0244l087
5292h187o881j0613j9793p616M0818L218p493m773N782J5914j2434j0022R949
$$ plain form
5387 -5330 7704 22897 1100 -1516 2380 -12593 -13872 -18981 -16088 -16036 -11575 -15887 -15167 -15030 -25433
5372 -25433 -9274 7594 15914 -9929 -19815 -22907 -7116 -5688 11835 6471 14895 13460 3949
5359 3949 16627 11551 -9030 -17921 -1360 -2807 -31380 -15945 -4255 8769 -1386 -1187 -3617
5346 -3617 5060 21815 28546 26537 23400 -13081 -13368 -8698 -12533 -15854 -5677 -1489 -25338 -25250 -12399
5331 -12399 -21583 -29494 -24058 -14090 -1952 -18821 -36312 -37750 -34324 -36289 -47454 -48729 -21774
5318 -21774 -3889 6063 8089 10300 -1605 -14224 -11667 -14887 -12647 8114 -11314 -36354 -34121
5305 -34121 -25545 -12999 -1468 20618 16677 4487 4931 14830 18218 -16864 -25344 -5100 -8187
5292 -8187 -15068 -25681 -45474 -53090 -12272 -9054 -16547 -21320 -15538 376 -12058 -22080 -12131
5279a2131r470p945J9443j3523k7834L616J7909J7231O947N400J8929m099O124
5266B0597r751k8420k3045k858P959K9591j9365k7327R587J0986K6779p131r637
5253b2035p470j8374J157J2607O270p306M754k517j7827j879M609J8979O599M284
5239a8149k733j6659j2655j1118j0183K8077R082J8387L900j8017J5568J9432
5227D932j4203K0981J7033q91q049l6044l4994L3391L549k9343k1509j515L3485
5214c3177j8060r288J8245M496J3242L692l235m2010j7960q320K814M1702L286
5201d4573j0304K0666l710p485J6609J1416j8657Q506k554m259M891p763L663
5188c3554M0588N36l1708k0018J6205O957n650J7076Q608q874m129k431j6757
$$ plain form
5279 -12131 -21601 -29546 -10103 -23626 -51460 -47844 -29935 -12704 -5757 -357 18572 14473 20597
5266 20597 10846 -17574 -40619 -43477 -35518 -5927 -25292 -52619 -43032 -32046 -5267 -12398 -22035
5253 -22035 -29505 -47879 -46722 -34115 -27845 -35151 -30397 -32914 -50741 -52620 -48011 -29032 -22433 -18149
5239 -18149 -20882 -37541 -50196 -61314 -71497 -43420 -34338 -15951 -12051 -30068 -14500 4932
5227 4932 -9271 11710 28743 27852 19803 -16241 -51235 -17844 -14295 -43638 -65147 -66662 -33177
5214 -33177 -51237 -60525 -42280 -37784 -24542 -20850 -24085 -66095 -84055 -92375 -89561 -47859 -44573
5201 -44573 -54877 -34211 -37921 -45406 -28797 -17381 -36038 -27532 -30086 -34345 -29454 -37217 -33554
5188 -33554 7034 7570 -24138 -44156 -27951 -20994 -26644 -9568 -960 -9834 -13963 -16394 -33151
5175c3151j4137J5659P468j138J8492p530j772k849K5710J9444k3519j8316j2469
5162b8108J3704N132l635m158J1787K0311K6710J0678m218k2365j4846k8015q961
5149b5984O709K4242L0314R562p472l5452j0175o038O574r669j4533o514k404
5136d0840m216J9650J5526J1533K1247J4367J1649j3084k3694l3464j9461M036
5124c6751J2521O742J1822l429p23l812n18j001O695j329j6019k481j7709k870
5110d8862J3114M659K1597j6520l1401J711J3890J898j0544l52K1583M099j9685
5097d4813L372m192P608j557J4049L918Q872o707J3561L0457J3860m3833k3029
5084b8434j3604K3328K1995j2124j960O595K0596J4610j8259l455j9683Q183J2677
$$ plain form
5175 -33151 -47288 -31629 -24161 -25299 -6807 -14337 -16109 -18958 6752 26196 2677 -15639 -28108
5162 -28108 -14404 -9272 -12907 -17065 -5278 15033 41743 52421 48203 25838 10992 -17023 -25984
5149 -25984 -19275 4967 35281 44843 37371 1919 -8256 -14294 -7720 -17389 -31922 -38436 -40840
5136 -40840 -45056 -25406 -9880 1653 22900 37267 48916 35832 12138 -21326 -40787 -36751
5124 -36751 -24230 -17488 -5666 -9095 -9818 -13630 -14148 -15149 -8454 -9783 -25802 -28283 -45992 -48862
5110 -48862 -35748 -31089 -9492 -26012 -57413 -55702 -41812 -39914 -50458 -50810 -29227 -25128 -44813
5097 -44813 -41441 -45633 -38025 -39582 -25533 -21615 -12743 -19450 -5889 24568 38428 -5405 -28434
5084 -28434 -42038 -18710 3285 -8839 -10799 -4204 16392 31002 12743 9288 -10395 -2212 10465
5071A0465k5283J0421K891r580j600j2957n313k867o249M275J7384K3412q377
5058c378j8853L596K0261L479Q90j7262M998L757J9633m757M165p922o520j2330
5044a0243J9512J1748k2488j2649J1499M0204O895j2001k0301J2747J820k2531
5032D212p012J6008M306p003j6440j8580O98K7801l212K9965J5386O366j9451
5019C3044m1917l0646j8189j149J7419p074j714J5117M608k299J5445K7203q92
5006H956j8127J1763L0542j1772l1380r185O262k8685r807R951Q969J3381j6083
4993c5215J0246O619j4465k2498k2318K3428M0069J0028n936l980k3119K6352
4981a0789L1773j553j5492K396k1720l2719j5621M30L7465K2239L448K7104K4394
$$ plain form
5071 10465 -14818 -4397 -1506 -11086 -12686 -25643 -30956 -33823 -40072 -35797 -18413 4999 -3378
5058 -3378 -22231 -18635 1626 5105 5995 -11267 -6269 -2512 17121 12364 16529 8607 2087 -10243
5044 -10243 9269 21017 -1471 -14120 -2621 37583 44478 32477 12176 24923 26743 4212
5032 4212 -2800 13208 17514 10511 -5929 -24509 -23811 3990 778 30743 46129 52495 33044
5019 33044 -8873 -39519 -57708 -58857 -41438 -48512 -50226 -35109 -30501 -32800 -17355 9848 8956
5006 8956 -9171 2592 33134 21362 -10018 -19203 -12941 -41626 -51433 -41482 -32513 -19132 -35215
4993 -35215 -24969 -18350 -32815 -55313 -77631 -54203 -14134 -4106 -10042 -14022 -37141 -10789
4981 -10789 20984 19431 3939 6335 -15385 -48104 -63725 -63295 -25830 -3591 -143 26961 51355
4968E1355j9735p243j1504j0665j7610J1739K8653K2848Q370q136l0427k7495
4956i850k2907J6034J5149J8782j1519k5086k06M85q422q941L832K9109n059j4146
4942b2745O68K666q740Q222K9866p639k2748n606J3048J7889k1639m112K4920
4929D050j6731k8705j3128j0944K023L0557K3154K4982J5652j7206j5155J0371
4917H920P897n1580k4528J0863J1297J1225L7363M950k3925J0947K5724K1064
4905E0217l0392k9087j4649O764k315j446j0492p781J3209p809j2672R939l571
4892d0085M02L2893q011Q806K3131M659k529k3827o148K842L892J6178J3618Q678
4878C4499j6514j5047P607J0094j2705m322q492n894n019j5566K315J033j4252
$$ plain form
4968 51355 31620 24377 12873 2208 -15402 -3663 24990 47838 56208 48072 17645 -9850
4956 -9850 -32757 -16723 -1574 17208 5689 -19397 -19603 -19118 -27540 -36481 -32649 -3540 -8599 -22745
4942 -22745 -22077 -19411 -28151 -19929 9937 2298 -20450 -26056 -13008 4881 -16758 -20870 4050
4929 4050 -12681 -41386 -54514 -65458 -63435 -32878 -9724 15258 30910 13704 -1451 8920
4917 8920 16817 -34763 -59291 -48428 -37131 -25906 11457 16407 -7518 3429 29153 50217
4905 50217 19825 -9262 -23911 -17147 -19462 -20908 -31400 -39181 -25972 -33781 -46453 -36514 -40085
4892 -40085 -39683 -6790 -14801 -5995 17136 21795 19266 -4561 -10709 -7867 -3975 12203 25821 34499
4878 34499 17985 2938 10545 20639 7934 3612 -4880 -10774 -15793 -31359 -29044 -28011 -42263
4865d2263J627P706R597K3939J9475m486k1663m467q923j6321P007K9056p476
4852g192l4446j1520J3193K1388n180j9410L536M7065N68p395j9522k2897M135
4839c7677K5846n757n862J5794J4061K642k3470j0143p733P111K0651L2105J5824
4826D3392k1243O7O599K0785l0397m3076p136K163j7928J8675L5631j0506k5465
4813b8439j0499O505J3675l236j3956j0657M0795L5909j1302k6868O171J533n105
4800e474j086K507p387k9951k4883J0114k1971j6190j168R479K9828Q627l295
4787e0850K1959M1832J1776L4706K0600J4600J246j2032l0579l0834j0215j2108
4775A01P082j2559r423N011k928l9976k775R093K9929k405j0590k8966k5724p216
$$ plain form
4865 -42263 -40636 -32930 -23333 606 20081 15595 -6068 -10535 -19458 -35779 -28772 284 -7192
4852 -7192 -41638 -53158 -39965 -18577 -23757 -43167 -39631 7434 8002 607 -18915 -41812 -37677
4839 -37677 -11831 -17588 -23450 -7656 6405 9047 -14423 -24566 -32299 -25188 -4537 27568 43392
4826 43392 22149 22216 28815 49600 19203 -23873 -31009 -28846 -46774 -28099 7532 -2974 -28439
4813 -28439 -38938 -32433 -18758 -21994 -35950 -46607 -5812 30097 18795 -8073 -1902 -369 -5474
4800 -5474 -6560 -4053 -11440 -41391 -66274 -56160 -78131 -94321 -95489 -86010 -56182 -47555 -50850
4787 -50850 -28891 12941 24717 59423 80023 94623 95869 83837 53258 22424 12209 101
4775 101 7183 -5376 -14799 -9788 -12716 -52692 -55467 -46374 -16445 -18850 -29440 -58406 -84130 -91346
4761i1346L0488n41K4172n837P251L1957J3111j4152j8684K910K381j5960J6892
4748a7358Q339j1331K2202J5849k3446l363N266k150R984K186K196K9411K4862
4735F2647k839O321j805j1313j3031j8130j0721q435l041m429j4122k404q257
4722b9559P730J7555j8495j3834L477J4778R16k9538o923P268o475K278O047J8970
4708b5805K1021k43J049J6927j7436l8556M390J8116M619j2822l1186k4920J1646
4695g3200J8698J2580J9163L439K0785j8001n484N934J181K0185j8640J523J6544
4682D707l722r483j9900j6090m576J3973K0936K3593J6574o560j4969m340q574
4669h431j97k5013m370J74Q270R841n771r139j9196m867k917j8810R390L1868
$$ plain form
4761 -91346 -60858 -61399 -37227 -43064 -35813 -3856 9255 -4897 -23581 -20671 -18290 -34250 -17358
4748 -17358 -9019 -20350 1852 17701 -5745 -9108 -3842 -5992 3992 6178 8374 37785 62647
4735 62647 59808 66129 64324 53011 39980 21850 11129 2694 -347 -4776 -18898 -21302 -29559
4722 -29559 -21829 -4274 -22769 -36603 -33126 -18348 -17432 -46970 -53893 -46625 -53100 -50822 -44775 -25805
4708 -25805 -4784 -5027 -3978 12949 -4487 -43043 -38653 -20537 -15918 -28740 -59926 -84846 -73200
4695 -73200 -54502 -41922 -22759 -19320 1465 -16536 -22020 -16086 -14905 5280 -13360 -11837 4707
4682 4707 985 -8498 -28398 -44488 -49064 -35091 -14155 9438 26012 19452 4483 143 -8431
4669 -8431 -8628 -33641 -38011 -37837 -29567 -19726 -25497 -34636 -53832 -58699 -61616 -80426 -71036 -39168
4655c9168J1685P23l378O829L0943M413j9189N738k4252r941J5991N278j1809
4642b6137L301M615j1320O796J5462j1978P763o42L858j5286p490J8147L343n986
4628a5554j801J3193N290J455k5148l8639J7529K015j3126K725J3437K6835J064
4615a0725l9309j4054R580j565L273L0550J3842j1530r016j1973J7625K812j2320
4602c2810J5427K5223m4777k1313R25L567Q286N854L8817r97q080l8212q702K976
4588e3816J7915N3422K1012Q528k2078k0082l3973r385K1982P133j640j602L123
4575i461K8523l438k8650j8716J0133K0325k862l2782j3734O381L1482M023k9438
4562c8214K4212J5604L173k5018l023Q802K255K8106J7038n468r216j0020k1391
$$ plain form
4655 -39168 -27483 -26760 -30138 -23309 7634 12047 -7142 -1404 -25656 -35597 -19606 -14328 -26137
4642 -26137 -22836 -18221 -29541 -22745 -7283 -19261 -11498 -12140 -8282 -23568 -31058 -12911 -9568 -15554
4628 -15554 -17355 -4162 1128 2583 -22565 -61204 -43675 -41660 -54786 -52061 -38624 -11789 -10725
4615 -10725 -50034 -64088 -54508 -56073 -52800 -22250 -8408 -19938 -28954 -40927 -23302 -20490 -32810
4602 -32810 -17383 7840 -36937 -58250 -57325 -53758 -45472 -39618 -801 -1798 -9878 -48090 -56792 -53816
4588 -53816 -35901 17521 38533 47061 24983 4901 -29072 -38457 -16475 -9342 -10982 -12584 -9461
4575 -9461 19062 15624 -13026 -31742 -21609 -1284 -4146 -36928 -50662 -44281 -12799 -8776 -38214
4562 -38214 -14002 1602 4775 -20243 -23266 -14464 -12209 15897 32935 27467 18251 8231 -13160
4549a3160J6536P1q30l420k5096j1772j2219J2461J9569j7476j7648M2198j869
4536a2655M185k854o748P429J4166n934R671j382J4399o455j2115K0870K0383
4523D2960P105j6615j315j7538k2279q829J7564K2440M078j1616k7969k1966K0999
4510a2981o607j2530p172l000J4677J9686R095M506J5856P28k9405j187J831k0845
4496b7348P758l7795P32J8423j4436J971K3963J0125N320l961l907j6607J1583
4483b4179J8714R568L4505l932j5928n851k0536j8286k1625o517J2510j01J9936
4470b1722M919j7048J4954k4100Q650L3010L0476o38l3634k3510p018J2009J1642
4457a2010N729K48K6675J5155k0242k8228r665k282J6487K2542j9890r432M314
$$ plain form
4549 -13160 3376 3447 2617 -803 -25899 -37671 -49890 -37429 -17860 -35336 -52984 -10786 -12655
4536 -12655 -8470 -11324 -18072 -10643 3523 -2411 7260 5878 20277 13822 1707 22577 42960
4523 42960 50065 33450 32135 14597 -7682 -16511 1053 23493 27571 15955 -12014 -33980 -12981
4510 -12981 -19588 -32118 -39290 -42290 -27613 -7927 1168 5674 21530 22258 -7147 -8334 -6503 -27348
4496 -27348 -19590 -57385 -56653 -38230 -52666 -50695 -26732 -16607 -11287 -15248 -19155 -35762 -24179
4483 -24179 -5465 4103 38608 34676 18748 12897 -7639 -25925 -47550 -54067 -41557 -41658 -21722
4470 -21722 -16803 -33851 -18897 -42997 -34347 -1337 29139 28501 -5133 -28643 -35661 -23652 -12010
4457 -12010 -6281 -6033 20642 35797 15555 -12673 -22338 -24620 -8133 14409 -5481 -14913 -10599
4444a0599J5602j932k0771j3491L0033K6874q315j2998q997O455j7038l62l2530
4431d8069P310J705J0921M8009r658k8865O279L0619p4k0942k8046k5892J9975
4418c6728J1708K4060p091k1183R663N635J9423L1627K589N9k0518k194J0688
4405B7738k0304r336J3548j8997n018J3j8871l6981r41p7J6271J0406O603j0102
4391d6048p921K8684J4421J2237j6702k3930l1694q276L889J8759J5357n681j2016
4378e8921J9468J0026L681J578N703N960l399n318p498j1698J864K2257r60p765
4364b5022K2027j3446P758m070Q21n622r35k3056P368L7416K949l2146J5466J6391
4350E899j9676J4097K2759k8991k2227j9745K577q548Q901Q905N539J354J5371
$$ plain form
4444 -10599 5003 3071 -17700 -31191 -1158 25716 17401 4403 -4594 1861 -15177 -15539 -48069
4431 -48069 -40759 -39054 -28133 19876 10218 -18647 -12368 18251 18177 -2765 -30811 -56703 -36728
4418 -36728 -25020 -960 -8051 -29234 -19571 -13936 5487 37114 39703 39762 19244 17050 27738
4405 27738 7434 -1902 11646 -7351 -12369 -12356 -31227 -68208 -69149 -69226 -52955 -42549 -35946 -46048
4391 -46048 -53969 -25285 -10864 1373 -15329 -39259 -70953 -79229 -75340 -56581 -41224 -46905 -58921
4378 -58921 -39453 -29427 -25746 -24168 -18465 -12505 -15904 -21222 -28720 -40418 -38554 -16297 -17257 -25022
4364 -25022 -2995 -16441 -8683 -12753 -11932 -17554 -18489 -41545 -34177 3239 6188 -25958 -10492 5899
4350 5899 -13777 320 23079 -5912 -28139 -47884 -45307 -53855 -44954 -36049 -30510 -29156 -13785
4337a3785j3831j2659J969L0436P286j7824j5925L1184k2294M550P71M755m263
4324a9630K0366N583q961J036N702j708j0380O916N515O477L515o254n241k4094
4310b1158J0085L2252q531j8748j1889O023j1719k8842L3010N898l770j7824j9949
4297e5162L0471J1694j4252j5491J1776J9705n300j4846P375J53M384p538j9167
4284d6198n359k765J1000N391J4215q462o860r434J4473K3930j0742n067J4603
4271a1275J8369L604p97J2720J885k244p130k9429j8054j1882l501N345J7001
4258b5388N372J1752Q971o040J0160k3062k0067j8914o789L01L7993O0508K3252
4245E8049m303l4619k2612p990k0911j7030j654j698P926P196K3446P699o173
$$ plain form
4337 -13785 -27616 -40275 -38306 -7870 -584 -18408 -34333 -3149 -25443 -20893 -20122 -15367 -19630
4324 -19630 736 6319 -2642 -1606 4096 2388 -7992 -1076 4439 10916 14431 8177 2936 -21158
4310 -21158 -11073 21179 12648 -6100 -17989 -11966 -23685 -52527 -19517 -13619 -17389 -35213 -55162
4297 -55162 -24691 -12997 -27249 -42740 -30964 -11259 -16559 -31405 -24030 -23877 -19493 -27031 -46198
4284 -46198 -51557 -54322 -43322 -37931 -23716 -32178 -39038 -48472 -33999 -10069 -20811 -25878 -11275
4271 -11275 7094 10698 9901 22621 24506 22262 15132 -14297 -32351 -44233 -47734 -42389 -25388
4258 -25388 -20016 -8264 707 -5333 4827 -18235 -38302 -57216 -64005 -63704 -25711 34797 58049
4245 58049 53746 19127 -3485 -11475 -32386 -49416 -51070 -52768 -44842 -37646 -14200 -6501 -12674
4232a2674J5277J395k5093l656l294p232n528N221Q111J8377J1431J3786M279
4219B0400k7732k679L0157J8079J2928j4073k3244j8818j2403J3052Q374J9988
4207B4029N525k2284j0773J6351K4048m779l055N752j6743L0588P567j3486j2712
4194C0028l038j3731k8055L77P910j3315Q471R674k084l6630r054J9527j4598
4181d4518m5799k1149K1272L4549K0557J249L2834J3832p472m539n690r51R348
4168C523l154K881O298k8972q188P490J1870L469J1347m08K2326k521o552l1299
4154a1890r800o837K0854K4670r620k7189k745K7026R910r634j3182q377j4530
4141c1344o136J0514J0622j5596k2142O503m614j8147N633J7153J2633J1399L119
$$ plain form
4232 -12674 2603 3998 -21095 -24751 -28045 -35277 -40805 -35584 -27473 -9096 2335 16121 20400
4219 20400 -7332 -10011 20146 38225 51153 37080 13836 -4982 -17385 -4333 4041 24029
4207 24029 29554 7270 -3503 12848 36896 32117 29062 34814 18071 48659 56226 42740 30028
4194 30028 26990 13259 -14796 -14419 -6509 -19824 -11353 -1679 -3763 -40393 -49447 -29920 -44518
4181 -44518 -90317 -111466 -90194 -55645 -35088 -33839 -1005 12827 5355 816 -4874 -5825 3523
4168 3523 369 3250 9548 -19424 -27612 -20122 -8252 -4783 6564 6156 28482 25961 19409 -11890
4154 -11890 -21690 -28527 -7673 16997 7377 -19812 -22557 4469 14379 4745 -8437 -16814 -31344
4141 -31344 -37480 -26966 -16344 -31940 -54082 -47579 -52193 -70340 -64707 -47554 -34921 -23522 -20403
4128b0403R358P252j2416O380Q016J6532j3562l9547n636K3428N845J288o622
4115b0087J8407J0863j7999n924J6153J3135J0285J408K6346O416k6490k3597
4103H916o037j0341J391j6262P015J9553N303j5749j3349j9916j747J9719m559
4090b6063l4277Q006K8192K2736n774q984J0831k4819o80J7660J3126M252N958
4077A0164K4204Q833m453l6520k8101O156q169L508k007J5805k928N304J3089
4064D885J0629O719n259j7582m4560k7676p09J1775K0820N584Q964N390j754K7716
4050D942N148J2791k2048l1652J8685J3841j4969j8826R365J7988j2762j9723
4038c7220P197J5915K2337J2190k4532n6859k1895o347q31O451K3455O408K4270
$$ plain form
4128 -20403 -11045 -3793 -16209 -9829 -1813 14719 1157 -38390 -44026 -20598 -14753 -13465 -20087
4115 -20087 -1680 9183 -8816 -14740 1413 14548 24833 26241 52587 59003 32513 8916
4103 8916 2879 -7462 -6071 -22333 -15318 4235 9538 -6211 -19560 -39476 -41223 -21504 -26063
4090 -26063 -60340 -52334 -24142 -1406 -7180 -16164 -5333 -30152 -30832 -13172 -46 4206 10164
4077 10164 34368 43201 38748 2228 -25873 -19717 -27886 -24378 -26385 -10580 -13508 -8204 4885
4064 4885 15514 22233 16974 -608 -45168 -72844 -73553 -61778 -40958 -35374 -26410 -21020 -22774 4942
4050 4942 10090 22881 833 -30819 -12134 1707 -13262 -32088 -22723 -4735 -17497 -37220
4038 -37220 -30023 -14108 8229 20419 -4113 -60972 -82867 -89214 -90045 -83594 -60139 -53731 -29461
4025b9461J0146k9k576K0123M48j3089P667l0525k4882J8204K5309L8863J3274
4012C3472k5309k0814R053J6499J39j3884o357J3155R618l023O268k8682k638
3999a2503K6692j7518j150k06n113K0657J96r242m7461l832K5667J8335j2668
3986a8146j7014J3905J7897k4838q141q597j3242Q52J0293J7314O462j4222J2961
3973b4516L610k953L908J132Q829M0416j8919k9864J4008L7776M584l8219J729
3960A521n897j6619j2576J3141K1570J2671p112j0005N52k1546r258N505J3615
3947a4438P380l045J1675L749J023l937j9936p219l477K6495J8120r145J7472
3934B4717j1378N177p740J7427j0652n264k362j0593j001J5893K391l187P568
$$ plain form
4025 -29461 -19315 -19344 -21920 -1797 -1349 -14438 -6771 -37296 -62178 -43974 -18665 20198 33472
4012 33472 8163 -12651 -3598 12901 13040 -844 -7201 5954 15572 12549 18817 -9865 -12503
3999 -12503 14189 -3329 -4479 -4685 -9798 10859 11055 1813 -45648 -49480 -23813 -5478 -18146
3986 -18146 -35160 -21255 -3358 -28196 -36337 -44934 -58176 -57324 -47031 -29717 -23255 -37477 -24516
3973 -24516 -20906 -23859 -19951 -18819 -9990 30426 11507 -18357 -4349 33427 38011 -208 1521
3960 1521 -4376 -20995 -33571 -20430 1140 13811 6699 -3306 -2754 -24300 -33558 -28053 -14438
3947 -14438 -7058 -10103 1572 5321 6344 2407 -17529 -24748 -28225 -1730 16390 7245 24717
3934 24717 13339 18516 10776 28203 17551 12287 9925 -668 -1669 14224 16615 13428 20996
3921B0996J0130j6580j8509K841K1759P836k8688j2059m416K383R988J1514q345
3908a150j905K596j7233J2979j577J721R06k5570j4797N608k7973J739L3790J4105
3894a6761j4870Q18J4228K2144Q883O484L2192O315j6582j8088j5449k7117N154
3881a2649K2616j0545j9342N903l760n787k0511j0208K3004J1297K2499j0838
3869h321j3313O762N489J7896M2562K658r507j9892l2386j8269q415j7169J8086
3856c3819Q578k07j0566O550L3872j1448j9408k9940k7569N801L2190J2381K6540
3843g045q713q736K7319K2165m014n054j5185o638O924k3701r331k0873J7126
3830c5756l73k9316n83J596L3945m92M61p659o339K4338j2571j892J9369N650
$$ plain form
3921 20996 31126 14546 -3963 -1122 20637 28473 -215 -12274 -16690 -14307 -4319 7195 -1150
3908 -1150 -3055 -459 -17692 -4713 -6290 -4569 -3663 -29233 -44030 -38422 -66395 -64656 -30866 -16761
3894 -16761 -31631 -30813 -16585 5559 14442 20926 53118 59433 42851 24763 9314 -17803 -12649
3881 -12649 9967 -578 -19920 -14017 -17777 -23564 -44075 -54283 -31279 -19982 2517 -8321
3869 -8321 -21634 -14872 -9383 8513 51075 53733 44226 24334 -8052 -26321 -34736 -51905 -33819
3856 -33819 -25241 -25448 -36014 -29464 4408 -7040 -26448 -56388 -83957 -78156 -45966 -33585 -7045
3843 -7045 -15758 -24494 2825 24990 20976 15922 737 -5901 1023 -22678 -32009 -52882 -35756
3830 -35756 -36129 -65445 -66028 -64432 -30487 -30979 -30518 -38177 -44516 -20178 -32749 -34641 -15272 -9622
3816i622j4201Q357q765o662l9464J82M2164L0219r432J0084K9789J2080j3406
3803C1323j0769n598J0263k650j1217j4036L391j6387P023J5619P018L671Q52
3790A8503J0940j8291o656J0762J7701k562k1344q738J4398k0641l833J947M547
3777c267n408J264J0866l726j1661M939j4269M726K5729K1002J9708l2755j9002
3764a854k1834m36j7820Q771R193L2410J0902p281j3091R558M26K4379p381j8441
3750G501J774j6971k4407j1233k1969j1653o888L377J6272L2941L1821J3999K203
3737A6767l2050l6924J1809J8753j93L2922M4149L0761j7418m8518n2433j72K0688
3724a1859K5937j810k3751p911j634p303m2785Q464J8355J2389J2574Q800L4334
$$ plain form
3816 -9622 -23823 -15466 -24231 -30893 -70357 -70175 -28011 2208 -7224 2860 32649 44729 31323
3803 31323 20554 14956 25219 22569 11352 -2684 707 -15680 -8657 6962 13980 17651 18503
3790 18503 29443 11152 4496 15258 32959 30397 9053 315 14713 -5928 -9761 -7814 -3267
3777 -3267 -8675 -7411 3455 -271 -11932 -6993 -21262 -16536 9193 30195 49903 17148 -1854
3764 -1854 -23688 -24124 -41944 -33173 -23980 8430 19332 12051 -1040 8518 8944 33323 25942 7501
3750 7501 9275 -7696 -32103 -43336 -65305 -76958 -83846 -80469 -64197 -31256 565 14564 16767
3737 16767 -15283 -52207 -40398 -21645 -21838 11084 55233 85994 68576 20058 -32375 -32547 -11859
3724 -11859 14078 12268 -11483 -19394 -21028 -28331 -71116 -62652 -44297 -31908 -19334 -10534 23800
3711B3800j56l0626Q91J9970J2784k7189j1638K3683l58l4548K7108J3618k3568
3698f229l2908O82J7934M117j3253K2767L8156j1768k1508j475j3418R422J0914
3685C433j1234l963O101J274r563l3579K15L0671j5166k672O071J3057P984j3246
3671b0617K4186J4383r862J3296K902j0372J9789J1361j1851k5550j7412p865
3659a7612J2382J0413j4365j816Q963J6382J1309l2833j0473N172J3290L997K442
3646G251j322K6681J1811j2261o16k3033k062K744L9646O125j7780k9011k0685
3633a2512k7169k7785K5783K4978k47J1392L615n096J47K9922O046r811K3101
3620D2364L202k5551q960l648j3969k221j3452j9155j3194Q744L8698K0856k9680
$$ plain form
3711 23800 23644 -6982 -6091 13879 26663 -526 -12164 11519 11161 -23387 3721 17339 -6229
3698 -6229 -39137 -38455 -20521 -16404 -29657 -6890 31266 19498 -2010 -3485 -16903 -7481 3433
3685 3433 -7801 -11764 -5663 -4389 -13952 -47531 -47316 -16645 -31811 -34483 -28412 -15355 -7371 -20617
3671 -20617 3569 17952 8090 21386 24288 13916 33705 45066 33215 7665 -9747 -17612
3659 -17612 -5230 5183 -9182 -10998 -2035 14347 25656 -7177 -17650 -12478 812 4809 7251
3646 7251 5929 32610 44421 32160 31544 8511 6449 9193 48839 54964 37184 8173 -12512
3633 -12512 -39681 -67466 -41683 -16705 -16952 -5560 -1945 -7041 -6894 23028 29074 19263 42364
3620 42364 45566 20015 11055 7407 -6562 -8783 -22235 -41390 -54584 -45840 -7142 13714 -15966
3607a5966j1595M0284K6570n404J5118k5755k3279J8821J1817n159j7892l5278
3595b7718k1951J3802M4796L2395M433k720k3705r244j704Q816J7362j2073l0268
3582g779O194K0222N627O640k0426p25O105j2402r740j697j1084Q66J1122R94
3568f083J901J7401k3938l06R165m496l839J6606L9116O598k1988l4924N213j2800
3554a2374k344P671N278r405j7554j675k7058m424J1769N680O044O12J810J2987
3540b2983N1616q007k0883p477p221J2014J8602k1380r702L2219m673k8201j0697
3527b6773J4188J0957L82k24k2140j4418J5408J4123k3244Q014M416m810J5611
3514h510j731k4867J1261J7037k4465j8886K7442J1778P970L211L6136j1848j3656
$$ plain form
3607 -15966 -27561 12723 39293 33889 49007 23252 -27 18794 30611 25452 7560 -27718
3595 -27718 -49669 -35867 8929 41324 45757 43037 19332 10088 8384 17200 34562 22489 -7779
3582 -7779 -1585 18637 24264 30904 10478 9753 15858 3456 -6284 -7981 -19065 -18199 -7077 -6083
3568 -6083 -4182 13219 -10719 -11025 -1860 -6356 -10195 6411 45527 52125 30137 -4787 426 -12374
3554 -12374 -14718 -7047 -1769 -11174 -28728 -30403 -57461 -61885 -50116 -44436 -38392 -37780 -35970 -22983
3540 -22983 28633 20626 -257 -7734 -14955 -2941 15661 -5719 -15421 16798 12125 -16076 -26773
3527 -26773 -12585 -1628 -1246 -1470 -23610 -38028 -22620 -8497 -31741 -23727 -19311 -24121 -8510
3514 -8510 -10241 -35108 -23847 -6810 -31275 -50161 -22719 -10941 -2971 240 36376 24528 10872
3501A0872l3081o239L575R036J8468K9243l276r598n91l053j5310k2258m948K4681
3487b479J4064r550n416O416j7690p445J356M437J2643O33o365J9446l194j9827
3473a2971o770O780m704K6661n270j5913L1525R731m16m43n868k7838j7040k4240
3459d6776K2982L4174l772J9241j2192p4K513R72l7200L521N1003L2814m0585
3446B6621j8054K1097j8280k8977k5340N800K3638L7449L3374j3105k4585j6738
3434B900N655m6797k3014J0731K4731J0573m374J5482K3302l8349l7895p352K2763
3421d1644L0526J0336j6619n409J0726K0963k9535j8033k1310j871J5933K2260
3409b3677K3145O32N237j50k2659l6917K2911J6803j1911O341j6288j8688L1016
$$ plain form
3501 10872 -22209 -28448 -24873 -15837 2631 31874 28598 19000 18409 15356 46 -22212 -27160 -2479
3487 -2479 11585 2035 -3381 3035 -14655 -22100 -20744 -16307 -3664 -3031 -9396 10050 6856 -12971
3473 -12971 -19741 -12961 -17665 8996 3726 -12187 19338 29069 28653 28210 22342 -5496 -22536 -46776
3459 -46776 -23794 10380 6608 25849 13657 13583 16096 17068 -20132 -16611 34392 67206 26621
3446 26621 8567 29664 11384 -17593 -42933 -37133 -13495 23954 57328 44223 19638 2900
3434 2900 8555 -38242 -61256 -50525 -25794 -15221 -19595 -4113 19189 -19160 -57055 -64407 -41644
3421 -41644 -11118 -782 -17401 -22810 -12084 8879 -20656 -38689 -59999 -61870 -45937 -23677
3409 -23677 -532 100 5337 5187 -17472 -54389 -31478 -14675 -26586 -20245 -36533 -55221 -24205
3396b4205K2566J3328Q496M145j7337r212J6116j5290j9125J2600r676j2797l770
3383c4161k189o824J7934L3706j6778R566j2930o574K0648k0807Q12O567J8359
3370G329J1967j1402o261J4170K271j0688L1595o004l5312J207R192k093m846
3357A125k736K3368L9304L717j7594n3486k6912k560K9916K5934p646J5952j4330
3344A4052l1472m819J343n310J7449n739K8000K599R789j1021M294J8091M481
3331D1737n716l6194L062R889n486K6599k2013j4269M318L506J007J9182Q740
3318C4362O597k814J8577p834r823L606m267j3989k0376p963j9124K4174K2992
3305B4118j9502k4086j757J177o380J4985J180R932L923O66k3705j2533J7040
$$ plain form
3396 -24205 -1639 11689 20185 24330 6993 -2219 13897 -1393 -20518 -7918 -17594 -30391 -34161
3383 -34161 -36350 -43174 -25240 8466 -8312 1254 -11676 -18250 2398 -18409 -17597 -11030 7329
3370 7329 19296 7894 1633 15803 18074 7386 38981 32977 -2335 -1128 8064 5971 1125
3357 1125 -1611 21757 61061 64778 47184 -6302 -33214 -35774 -5858 20076 12430 28382 14052
3344 14052 -17420 -22239 -20896 -26206 -8757 -14496 13504 16103 25892 14871 19165 37256 41737
3331 41737 36021 -173 2889 12778 7292 33891 11878 -2391 1927 5433 6440 25622 34362
3318 34362 40959 38145 56722 48888 39065 42671 38404 24415 4039 -3924 -23048 1126 24118
3305 24118 4616 -19470 -21227 -20050 -26430 -11445 -10265 -333 3590 4256 -19449 -31982 -14942
3292a4942Q36n516P720J1343J4441J0612m089j5509K943k2872O917O982l0238
3279c1372J6581J1174o777K6430o002J2090j6590j2211J8321J7589l211n6533
3267c0511j8536K2161m665k5425K4019L0375O500J0273k5953q310j5797J0958
3255b4911p54L009K1163J3977j4360k0276j6129k1551q294r946K8577K0136J2778
3242a6581Q270J5786J864k824k1321j444P337L1237n553o40o16N605l783l48p057
3227I932k4175J1245K2630o678k811O111J5671O992l3608p315J9789M793k6225
3214c649k421k071K003j7741k772K0933K7373o796q865R60R43l963J5428k0886
3200a524j1138o82K1792L9989j7522k3823P253j079j8586o280L4924R188K921
$$ plain form
3292 -14942 -14106 -19622 -11902 -559 13882 24494 20405 4896 7839 -15033 -8116 -1134 -31372
3279 -31372 -14791 -3617 -10394 16036 10034 22124 5534 -6677 11644 29233 26022 -30511
3267 -30511 -49047 -26886 -31551 -56976 -32957 -2582 3918 14191 -11762 -20072 -35869 -24911
3255 -24911 -25665 -22656 -1493 12484 -1876 -22152 -38281 -59832 -68126 -78072 -49495 -29359 -16581
3242 -16581 -8311 7475 9339 6515 -14806 -16250 -8913 22324 16771 16131 15515 21120 17337 16989 9932
3227 9932 -14243 -2998 19632 12954 10143 16254 31925 38917 5309 -2006 17783 22576 -3649
3214 -3649 -6070 -8141 -6138 -23879 -26651 -5718 21655 14859 5994 6954 7897 3934 19362 -1524
3200 -1524 -12662 -13344 8448 48437 30915 7092 14345 13266 -5320 -11600 23324 32512 35433
3187C5433q020k5688K403n132o320r08K0319R433J5413J766r509m80k677M342
3173C0375l2738k214J9680K0391k0906l759j7743q195Q424k91k0249j1669J4934
3160b3960M2205L2554j0023j1974j2985J484j92k7174j0692P659q146q860J7779
3147a2325m664j1972l0534j0567K6534K6981p727K81p976N326K5084L2516K1265
3134E2222j4360j7643j5877k321r198j619j554j2306R626J1136M635n255j9665
3121b2179k359J1382J2042j829j1467j4265L268j7885L508L3638R591M16j1534
3108g673j89J6421j9291l3534k74J4482J0533l3244j262M8487M1253l1376j6893
3095a2560J5886K838J594m0147J6069P671n430j3137K741J3413J9144J7873K0378
$$ plain form
3187 35433 27413 1725 4128 -1004 -7324 -8232 12087 21520 36933 38699 29190 28710 26033 30375
3173 30375 -2363 -4577 15103 35494 14588 10829 -6914 -15109 -6685 -6976 -27225 -38894 -23960
3160 -23960 18245 50799 40776 28802 15817 17301 17109 -10065 -20757 -13098 -21244 -30104 -12325
3147 -12325 -16989 -28961 -59495 -70062 -43528 -16547 -24274 -23993 -31969 -26643 -1559 30957 52222
3134 52222 37862 20219 4342 2021 -7177 -8796 -10350 -22656 -13030 -1894 2741 -2514 -22179
3121 -22179 -24538 -13156 -1114 -2943 -14410 -28675 -25407 -43292 -39784 -6146 3445 3861 -7673
3108 -7673 -7862 8559 -10732 -44266 -44540 -30058 -19525 -52769 -54031 -5544 35709 4333 -12560
3095 -12560 3326 6164 7758 -32389 -16320 -8649 -14079 -27216 -24475 -11062 8082 25955 46333
3082D6333J3706l8386j4641K0574J3243j7476L061J609j556K072m1373L939L7828
3069B8933J9250j4309k7881O516J4275l9265o1159l266O4522J6274k1765q74J8415
3056c34O570k2392q22q227j8338P658K7016j3130r175k1802P414J1085k331R713
3042b7095j433K3269K6762j5880l0682q499k90J7270p059O736J2040Q336l998
3029e23j3376O575o841K459J9341k8048N67K21k0651r391J6524L8671O921J5528
3015B7977k5353P446k258j3086J2089J7307M614O099j6745j7441p881r016q224
3002b4472J5895J1747k7888k1398m600L4850L1935R757k9818j9863J1966J2537
2990F48k1310k3539P427K3283K6424Q334m476o829l823Q791J1050k4122k6970
$$ plain form
3082 46333 60039 21653 7012 27586 40829 23353 26414 28023 26467 28539 -12834 -8895 28933
3069 28933 48183 33874 5993 12509 26784 -12481 -73640 -76906 -12384 3890 -17875 -18749 -334
3056 -334 6236 -16156 -16978 -25205 -43543 -35885 -8869 -21999 -31174 -52976 -45562 -34477 -36808 -27095
3042 -27095 -28528 -5259 21503 5623 -25059 -33558 -33848 -16578 -23637 -16901 -4861 3475 -523
3029 -523 -13899 -7324 -14165 -11706 7635 -20413 -19846 -19625 -40276 -49667 -33143 5528 12449 27977
3015 27977 2624 10070 7812 -5274 6815 24122 28736 34835 18090 649 -7232 -16248 -24472
3002 -24472 -8577 3170 -24718 -46116 -50716 -15866 16069 25826 -3992 -23855 -11889 648
2990 648 -20662 -44201 -36774 -13491 12933 21267 16791 9962 6139 14930 25980 1858 -25112
2977b5112L9315L7228j2083j2663k442q405Q010N024j4592p575J6711L8941j7386
2964D4971j4003k1169J2602k8968r58l863q131J5977o497k1180K497K3614J5494
2951A0386k4981j1239Q588L4120R173j1251J934J3157N887l8659N539K243J754
2938F651J224Q103j4290J2276n738l5965j568L599J392K9144J7018j9320j5058
2925a2532j8856o18p025n62J1870k0918J402L8563K5467J1513M55P125m171j4765
2911A6948R045j1565m028K1739p1r23L04R395O952r851q858n714N129J7340m449
2896D1393k1689j5044m302m749N322J0261J033O607o590J8641O048k9938j5231
2883h238j086m185q547M924j0397l008Q92o101l419K5552J5792N905P013l2992
$$ plain form
2977 -25112 14203 51431 39348 26685 24243 15838 23848 28872 14280 6705 23416 62357 44971
2964 44971 30968 9799 22401 -6567 -7525 -11388 -19519 -3542 -10039 -31219 -28722 -5108 10386
2951 10386 -14595 -25834 -17246 16874 26047 14796 16730 29887 35774 -2885 2654 4897 6651
2938 6651 7875 15978 1688 13964 8226 -27739 -29307 -25708 -24316 4828 21846 2526 -12532
2925 -12532 -31388 -32006 -39031 -39593 -27723 -48641 -47239 -8676 16791 28304 28759 35884 31713 16948
2911 16948 25993 14428 10400 32139 32068 31145 31449 40844 47796 37945 29087 23373 28502 45842 41393
2896 41393 19704 4660 358 -4391 931 11192 12225 18832 12242 30883 36931 6993 -8238
2883 -8238 -9324 -13509 -22056 -17132 -27529 -30537 -29645 -35746 -39165 -13613 2179 8084 15097 -17895
2869a7895k6162k812J08K15l703k700M517K5798J1677j7877j1461J5288Q725J0086
2855f196N171n946J828j3131l220N455J9525M219o633j5673J4980J6194N130k3681
2841a978j6738J6071J390k7375R419K163J1321J8706p417j1208J8125o438J1109
2828A7150l66j4109Q71K6802l942P701j2909k1233R370j3255j2790j1685j869
2815c0264R207M686m498J1806J5534L2720j2193l879k030J5291R020o569j8024
2802B0807M891l369K474J7946j9543k8119n780j6903J3909J8139M803l132L1299
2789C7422P824l176k980k4129k6588q015R840K9554J4179k6946j4355j303k643
2776a1316j5024J078R18Q110J2747Q240K3202q71l3786j8043k0760j4326L0624
$$ plain form
2869 -17895 -44057 -46869 -46761 -46546 -50249 -52949 -48432 -22634 -10957 -28834 -40295 -25007 -16282 -6196
2855 -6196 -1025 -6971 -5143 -18274 -21494 -16039 3486 7705 1072 -14601 379 16573 21703 -1978
2841 -1978 -18716 -2645 -1255 -28630 -19211 -17048 -5727 12979 5562 -5646 12479 6041 17150
2828 17150 16784 2675 3546 30348 26406 34107 21198 -35 9335 -3920 -16710 -28395 -30264
2815 -30264 -21057 -16371 -20869 -9063 6471 39191 26998 23119 21089 36380 45400 38831 20807
2802 20807 25698 22329 24803 42749 23206 -4913 -10693 -27596 -13687 4452 9255 6123 37422
2789 37422 45246 42070 39090 14961 -11627 -19642 -9802 19752 33931 6985 -7370 -8673 -11316
2776 -11316 -26340 -25262 -24344 -16234 -3487 4753 27955 27084 -6702 -24745 -45505 -59831 -29207
2763b9207J4619J5069M414K709r87m3168l3982K2362J9662J7447N832J208n260
2750i282J9252R56l0418J3516M905K061O617J2292l944k9284j2715K3606P791
2737E353j5446J1684J0652J1741j8764j618j0125k8001k830Q173j1471K2544M8240
2724C0132J9333m2040r309K14J4414K4182o32j6764J5636L205l6473j4410P231
2711e281N985j2403m645M40j863K8449j0230l2459J0663M635N148M81o048q253
2697b5381l581O338K656o219M2k2890j1377K7952j9995n962L2172M3321p670j4749
2683e343m567j829o812J1281O075J0783j3617m861M637J5686p732l795J2296o528
2669E674j2236j150L584q173q28r070o198r834k0060K291J2601J9534K8022K6540
$$ plain form
2763 -29207 -14588 481 4895 7604 6617 -36551 -70533 -48171 -28509 -11062 -5230 -4022 -9282
2750 -9282 9970 10926 -19492 -5976 -1071 990 7607 19899 15955 -13329 -26044 -2438 5353
2737 5353 -10093 1591 12243 23984 5220 3602 -6523 -34524 -37354 -29181 -40652 -18108 30132
2724 30132 49465 7425 -1884 -1670 12744 36926 36294 19530 35166 38371 1898 -12512 -5281
2711 -5281 704 -11699 -16344 -15904 -17767 10682 452 -32007 -21344 -16709 -11561 -11080 -17128 -25381
2697 -25381 -28962 -22624 -19968 -26187 -26145 -49035 -60412 -32460 -52455 -58417 -26245 17076 9406 -5343
2683 -5343 -9910 -11739 -18551 -7270 -1195 9588 -4029 -8890 -4253 11433 3701 -94 12202 5674
2669 5674 -6562 -7712 -4128 -12301 -13129 -22199 -28397 -38231 -58291 -56000 -43399 -23865 4157 30697
2655C0697o069l3677k514K4953K289k3373J4396J521j42O62k143m507J1903K1116
2641C5112J771k4801r599j6255j5774P647k6366r515M3905J5972k757L025l665
2628a300k529L6446J163m4880K663K8054K0757j5807l351j5944l825N799j0269
2615c023n702K8330K3333q239m050j0606j4816j4213k1702J2122L3250k408J63
2602A2439j3216k2092k797j2195J4057L9512K2532K0635Q35k4135j9749Q344O734
2589C0904j3234j6295J123M964p703j3650J7226J3790K0023j39R21L585M076j6692
2575B8899j5228P046m511J366j6309L80j677j9114J1687K383l293K751J598j7394
2561b1416N664J5865k2771R264q059Q345J8267j2183l4254K2248J7298J4099L703
$$ plain form
2655 30697 24628 -9049 -11563 13390 15679 -7694 6702 8223 8081 8743 6600 2093 13996 35112
2641 35112 36883 12082 2483 -13772 -29546 -21899 -48265 -57780 -13875 2097 -660 2365 -1300
2628 -1300 -3829 32617 33780 -11100 -8437 19617 40374 24567 21216 5272 1447 7246 -3023
2615 -3023 -8725 19605 42938 34699 30649 20043 5227 -8986 -30688 -18566 14684 12276 12439
2602 12439 -777 -22869 -25666 -37861 -23804 15708 38240 58875 59710 35575 15826 24170 30904
2589 30904 17670 1375 2498 7462 -241 -13891 3335 17125 37148 37009 37930 41515 45591 28899
2575 28899 13671 20717 16206 17572 1263 1643 -34 -19148 -7461 -5078 -8371 -5620 -4022 -21416
2561 -21416 -15752 113 -22658 -13394 -21453 -13108 5159 -7024 -41278 -19030 -1732 12367 16070
2548A6070P671o029J7490o847j6188k2889j2514O941j525P107J5072l469J826
2535B716J1160k3165j1397K4021p326j4044j5309J5784J4882R106K0683L083r194
2522B1000n774j6996j8345k8041m235M4398L6760l69k5639j9964l217M2315Q079
2509B9972o488j5721p707j5174j3272j99n751J6884J5102K8887k348M683n716
2496B3152m294j790q332m466p370k9951K2638J4672k040J9500J3968K0855K396
2483E8938N27R118n125r939m729k6982j0413j7974k6505p713J0958K1274J5407
2470F842J234J3820O602k0928J150k4977n708J0313m04J1385p657q523k5854O085
2456c6620L8884P247k5824J3557P276j5951K63J1976j8009L404J7113K0508m527
$$ plain form
2548 16070 23741 17712 35202 28355 12167 -10722 -23236 -16295 -17820 -10713 4359 890 2716
2535 2716 13876 -9289 -20686 3335 -3991 -18035 -33344 -17560 -2678 6428 27111 30194 21000
2522 21000 15226 -1770 -20115 -48156 -52391 -7993 28767 28398 2759 -17205 -20422 21893 29972
2509 29972 23484 7763 56 -15118 -28390 -28589 -34340 -17456 -2354 26533 24185 28868 23152
2496 23152 18858 17068 8736 4270 -3100 -33051 -10413 4259 2219 21719 35687 56542 58938
2483 58938 59465 68583 63458 53519 48790 21808 11395 -6579 -33084 -40797 -29839 -8565 6842
2470 6842 8076 21896 28498 7570 8720 -16257 -21965 -11652 -12056 -671 -8328 -16851 -42705 -36620
2456 -36620 2264 9511 -16313 -2756 4520 -11431 -11168 808 -17201 -13797 3316 23824 19297
2443A9297j881j9116j1144L668N932J536O414J1708R591Q423n03j6933j6343k3136
2429b2487j3926Q100R635K1148J0159j1482R765q358p745j5896L2476K6759K436
2416D0584J3261j8587k1973n020j8566N524o338k599K1275J8404J5976j1489J4484
2403D4936k332m161l5972m097Q725J6887j0497J0887j8386l1634J0700M2128R260
2390C6444K619L091L568m894r763j6985Q308k768o532o561J6345L225k5380R98
2376A715o336m395J3957K6608k0030q241r76J6600R868j6242j9336L562R784j2470
2362e932L547J4303O966q260k596q156K0595j3484n939J26j1606K31L306k002
2348h901k3726n134J5926j1063M985J4686j198M036J8272J863k4766q510K0398
$$ plain form
2443 19297 17416 -1700 -12844 -9176 -3244 -1708 4706 16414 26005 34428 33925 16992 649 -22487
2429 -22487 -36413 -28313 -18678 2470 12629 1147 10912 2554 -5191 -21087 11389 38148 40584
2416 40584 53845 35258 13285 8265 -10301 -4777 -11115 -13714 7561 25965 41941 30452 44936
2403 44936 42604 38443 2471 -1626 7099 23986 13489 24376 5990 -25644 -14944 27184 36444
2390 36444 39063 42154 45722 40828 31065 14080 22388 19620 13088 6527 22872 26097 717 1715
2376 1715 -4621 -9016 4941 31549 11519 3278 2302 18902 28770 12528 -6808 -3246 6538 -5932
2362 -5932 -2385 11918 18884 10624 8028 -128 20467 6983 1044 1170 -10436 -10205 -6899 -8901
2348 -8901 -32627 -37761 -21835 -32898 -27913 -13227 -14425 -10389 7883 9746 -15020 -23530 -3132
$$ [...]
##END NTUPLES=NMR SPECTRUM
##END=
