##TITLE=Analysis number 310842
Compound Code mo 07123
Book Reference 302/178
Project Code adrs
Chemist Name toml
##JCAMPDX= 6.0         $$ Bruker NMR JCAMP-DX V2.0
##DATA TYPE= NMR SPECTRUM
##DATA CLASS= NTUPLES
##ORIGIN= Bruker BioSpin GmbH
##OWNER= NMR
$$ XWIN-NMR		Version 3.5
$$ Thu Jun 23 13:34:47 2005 GMT Daylight Time (UT+1h)  MAYBRIDGE\NMR@NMR_250MHZ
##.OBSERVE FREQUENCY= 250.131544655141
##.OBSERVE NUCLEUS= ^1H
##.ACQUISITION MODE= SIMULTANEOUS (DQD)
##.ACQUISITION SCHEME= undefined
##.AVERAGES= 16
##.DIGITISER RES= 18
##SPECTROMETER/DATA SYSTEM= dpx250
##.PULSE SEQUENCE= zg30
##.SOLVENT NAME= DMSO
##.SHIFT REFERENCE= (INTERNAL, DMSO, 0, 16.522)
##AUDIT TRAIL= $$ (NUMBER, WHEN, WHO, WHERE, WHAT)
$$ ##TITLE= Audit trail, XWIN-NMR		Version 3.5
$$ ##JCAMPDX= 5.01
$$ ##ORIGIN= Bruker BioSpin GmbH
$$ ##OWNER= NMR
$$ C:\u/data/dgb/nmr/ADRS/4710/pdata/1/auditp.txt
$$ ##AUDIT TRAIL=  $$ (NUMBER, WHEN, WHO, WHERE, WHAT)
(   1,<2005-06-23 13:34:25.44 +100>,<MAYBRIDGE\NMR>,<NMR_250MHZ>,
      <created by zg, POWCHK disabled, PULCHK disabled
       configuration hash MD5:
       62 19 C7 07 E1 42 D1 B7 37 6C 3D D0 77 39 F9 E6
       data hash MD5: 64K
       06 2A 33 B7 BB 3E DC CD DF 9B D9 5F 40 94 BB 06>)
(   2,<2005-06-23 13:34:38.80 +100>,<MAYBRIDGE\NMR>,<NMR_250MHZ>,
      <Start of raw data processing
       ef LB = 0.3 FT_mod = 6 PKNL = 1 SI = 32K 
       data hash MD5: 32K
       FC 17 22 32 13 E4 49 85 77 DA B7 E9 02 75 51 91>)
(   3,<2005-06-23 13:34:40.60 +100>,<MAYBRIDGE\NMR>,<NMR_250MHZ>,
      <apk 
       data hash MD5: 32K
       7A 65 80 28 F1 93 55 05 BD 79 EB CB 24 76 4A 39>)
(   4,<2005-06-23 13:34:41.30 +100>,<MAYBRIDGE\NMR>,<NMR_250MHZ>,
      <abs ABSG = 5 
       data hash MD5: 32K
       B4 1C 9E B6 0E 21 45 6D 06 3F EE C8 5C F4 24 0B>)
$$ ##END=
$$ 
$$ hash MD5
$$ 32 E4 F8 73 F0 6F A3 A1 97 AC 06 DA 24 EC BF 15
##$RELAX= 
##$RELAX= 
##$RELAX= 
##$RELAX= 
##$RELAX= 
##$RELAX= 
##$RELAX= 
$$ Bruker specific parameters
$$ --------------------------
##$DU= <C:\u>
##$EXPNO= 4710
##$NAME= <ADRS>
##$PROCNO= 1
##$TYPE= <nmr>
##$USER= <dgb>
##$AMP= (0..31)
100 100 100 100 100 100 100 100 100 100 100 100 100 100 100 100 100 100 
100 100 100 100 100 100 100 100 100 100 100 100 100 100 
##$AQSEQ= 0
##$AQ_mod= 3
##$AUNM= <au_zg>
##$AUTOPOS= <24 >
##$BF1= 250.13
##$BF2= 250.13
##$BF3= 250.13
##$BF4= 250.13
##$BF5= 500.13
##$BF6= 500.13
##$BF7= 500.13
##$BF8= 500.13
##$BYTORDA= 1
##$CFDGTYP= 0
##$CFRGTYP= 5
##$CHEMSTR= <none>
##$CNST= (0..31)
1 1 145 1 1 1 1 1 1 1 1 1 1 1 1 1 1 1 1 1 1 1 1 1 1 1 1 1 1 1 1 1 
##$CPDPRG= <>
##$CPDPRG1= <>
##$CPDPRG2= <>
##$CPDPRG3= <>
##$CPDPRG4= <mlev>
##$CPDPRG5= <mlev>
##$CPDPRG6= <mlev>
##$CPDPRG7= <mlev>
##$CPDPRG8= <mlev>
##$CPDPRGB= <>
##$CPDPRGT= <>
##$D= (0..31)
0 1 0 0 0 0 0 0 0 0.06 0 0 0 0 0 0 0.0002 0 0 0 0 0 0 0 0 0 0 0 0 0 0 
0 
##$DATE= 1119530064
##$DBL= (0..7)
120 120 120 120 120 120 120 120 
##$DBP= (0..7)
150 150 150 150 150 150 150 150 
##$DBP07= 0
##$DBPNAM0= <>
##$DBPNAM1= <>
$$ [...]
##$SUBNAM7= <"">
##$SUBNAM8= <"">
##$SUBNAM9= <"">
##$SW= 20.6930455092707
##$SWIBOX= (0..15)
0 0 3 0 0 0 0 0 0 0 0 0 0 0 0 0 
##$SW_h= 5175.983436853
##$TD= 65536
##$TD0= 1
##$TE= 295.16
##$TE2= 300
##$TE3= 300
##$TEG= 300
##$TL= (0..7)
0 120 120 120 120 120 120 120 
##$TP= (0..7)
150 150 150 150 150 150 150 150 
##$TP07= 0
##$TPNAME0= <>
##$TPNAME1= <>
##$TPNAME2= <>
##$TPNAME3= <>
##$TPNAME4= <>
##$TPNAME5= <>
##$TPNAME6= <>
##$TPNAME7= <>
##$TPOAL= (0..7)
0.5 0.5 0.5 0.5 0.5 0.5 0.5 0.5 
##$TPOFFS= (0..7)
0 0 0 0 0 0 0 0 
##$TUNHIN= 0
##$TUNHOUT= 0
##$TUNXOUT= 0
##$USERA1= <user>
##$USERA2= <user>
##$USERA3= <user>
##$USERA4= <user>
##$USERA5= <user>
##$V9= 5
##$VALIST= <valist>
##$VCLIST= <CCCCCCCCCCCCCCC>
##$VD= 0
##$VDLIST= <DDDDDDDDDDDDDDD>
##$VPLIST= <PPPPPPPPPPPPPPP>
##$VTLIST= <TTTTTTTTTTTTTTT>
##$WBST= 1024
##$WBSW= 4
##$XGAIN= (0..3)
0 0 0 0 
##$XL= 0
##$YL= 0
##$YMAX_a= 296427
##$YMIN_a= -352849
##$ZGOPTNS= <>
##$ZL1= 120
##$ZL2= 120
##$ZL3= 120
##$ZL4= 120
##$ABSF1= 16.522
##$ABSF2= -4.171173
##$ABSG= 5
##$ABSL= 3
##$ALPHA= 0
##$AQORDER= 0
##$ASSFAC= 0
##$ASSFACI= 0
##$ASSFACX= 0
##$ASSWID= 0
##$AUNMP= <proc_1d>
##$AZFE= 0.1
##$AZFW= 0.1
##$BCFW= 0
##$BC_mod= 0
##$BYTORDP= 0
##$COROFFS= 0
##$CY= 12.5
##$DATMOD= 1
##$DC= 0
##$DFILT= <>
##$DTYPP= 0
##$F1P= 14.0000005364418
##$F2P= -0.99999901652339
##$FCOR= 0.5
##$FTSIZE= 32768
##$FT_mod= 6
##$GAMMA= 0
##$GB= 0
##$INTBC= 1
##$INTSCL= 1
##$ISEN= 128
##$LB= 0.3
##$LEV0= 0
##$LPBIN= 0
##$MAXI= 10000
##$MC2= 0
##$MEAN= 0
##$ME_mod= 0
##$MI= 0
##$NCOEF= 0
##$NC_proc= -5
##$NLEV= 6
##$NOISF1= 0
##$NOISF2= 0
##$NSP= 0
##$NTH_PI= 0
##$NZP= 0
##$OFFSET= 16.522
##$PC= 1
##$PHC0= -89.29656
##$PHC1= 10.31182
##$PH_mod= 1
##$PKNL= yes
##$PPARMOD= 0
##$PSCAL= 4
##$PSIGN= 0
##$REVERSE= no
##$SF= 250.13
##$SI= 32768
##$SIGF1= 0
##$SIGF2= 0
##$SINO= 400
##$SIOLD= 32768
##$SREGLST= <1H.DMSO>
##$SSB= 0
##$STSI= 32768
##$STSR= 0
##$SW_p= 5175.98343685301
##$SYMM= 0
##$S_DEV= 0
##$TDeff= 65536
##$TDoff= 0
##$TI= <Analysis number 999999
Compound Code 99
Book Reference 9
Project Code 9>
##$TILT= no
##$TM1= 0
##$TM2= 0
##$TOPLEV= 0
##$USERP1= <user>
##$USERP2= <user>
##$USERP3= <user>
##$USERP4= <user>
##$USERP5= <user>
##$WDW= 1
##$XDIM= 32768
##$YMAX_p= 392163419
##$YMIN_p= -709014
$$ End of Bruker specific parameters
$$ ---------------------------------
##NTUPLES= NMR SPECTRUM
##VAR_NAME=  FREQUENCY,     SPECTRUM/REAL,   SPECTRUM/IMAG
##SYMBOL=    X,             R,               I
##VAR_TYPE=  INDEPENDENT,   DEPENDENT,       DEPENDENT
##VAR_FORM=  AFFN,          ASDF,            ASDF
##VAR_DIM=   32768,         32768,           32768
##UNITS=     HZ,            ARBITRARY UNITS, ARBITRARY UNITS
##FACTOR=    0.157963299565203, 1,           1
##FIRST=     4132.6476996994, 0,             0
##LAST=      -1043.33573715361, 0,           0
##MIN=       -1043.33573715361, -709014,     0
##MAX=       4132.6476996994, 392163419,     0
$$ Real data points
##PAGE= N=1
##DATA TABLE= (X++(R..R)), XYDATA
$$ [...]
15442E2200P4015o9499J5916J04242m6977k8203j08233l7448J53530O1193r1379
15431G9357Q2297o3632p9088K8617L9002j14409r6350P4986k2360R6792J25463
15420A50675n9852j20533q3619Q2882K4375L1259J22910J8901j17916P6516l0333
15409I5265l4960l5849K867L6519P0814j18998n1454K5643n8844P2954J6213p9623
15397e9453K7010J39839j41682J1342l5466J40860J35781p1723j31314k14900
15387a99706l5806P8347J38517L5788J55706M8081k1764j16153k6475P746J30798
15376A95079j17926j13523j04594J62378J29588J12057o6544k06892O6865J61716
15366B18204j17492o3676m3588K5439j1838j06180k8579J47663K24737O7216q3960
$$ y = [52200, 126215, 56716, 72632, 176874, 129897, 101694, -6539, -43987, 109543, 170736, 79357, 161654, 98022, 18934, 47551, 86553, -27856, -124206, -49220, -71580, 25212, 150675, 90823, -29710, -113329, -30447, -6072, 25187, 148097, 166998, 49082, 125598, 95265, 60305, 24456, 27323, 63842, 134656, 15658, -35796, -10153, -68997, 3957, 20170, -59453, -32443, 107396, -34286, -22944, -58410, 82450, 218231, 146508, 15194, -199706, -235512, -157165, -18648, 17140, 172846, 220927, 199163, 83010, 56535, 64281, 195079, 77153, -36370, -140964, 21414, 151002, 263059, 196515, -10377, 56488, 218204, 100712, 37036, -6552, 18887, 7049, -99131, -127710, 19953, 244690, 311906, 227946]
15355B27946J459O4305N482q0343j27563j74062P6773R5699j2044J85935P5948
15344C39535n2366j51067r8682N4223N0630P8299j9195r829M7186J18352j0327
15333C46759R6651J4553m3925r9739q6632n6074m428k5744R2619P3R3147O1545
15321C88805j01417j29457n4579j37960J47847l4486o9127P5870K6858m9731k270
15310F0353o9432j24378J7197j4383O8221O611K1674K16091Q1919n6501q557k3628
15298A75187p8894k4776L6355L3906k64507K9189P4783j33391J83841J51182L3108
15287B15983l5068M385J19634J19884L503j51905o2320J26634j30292k04309j05243
15276i9114M6016J23021J29355Q2257k7824J21981M0559j73228K022L4668L7280
$$ y = [227946, 229405, 293710, 299192, 218849, 91286, -82776, -6003, 89696, 77652, 263587, 339535, 287169, 136102, 37420, 91643, 142273, 220572, 201377, 191548, 238734, 357086, 346759, 443410, 457963, 414038, 314299, 227667, 171593, 167165, 141421, 234040, 234113, 327260, 388805, 287388, 157931, 103352, -34608, 113239, 78753, 9626, 85496, 112354, 62623, 60353, -9079, -133457, -116260, -130643, -62422, -55811, -34137, 181954, 263873, 207372, 198815, 175187, 96293, 71517, 107872, 141778, -122729, -93540, -18757, -152148, 31693, 182875, 215983, 180915, 185300, 304934, 424818, 428321, 276416, 214096, 340730, 210438, 6129, -99114, -53098, 69923, 199278, 281535, 253711, 375692, 416251, 243023, 245045, 279713, 316993]
15265C16993o7733p2118O6924L478J18344m710j17451o4433K13860n9575j81393
15254A52186j90002m7666M0299j08427j71685q229J37678L00912N7457n6953N4871
15243A60441M2629j155p7631P0995J15048N9958q4997o7231L87p8095j01859O2640
15231A01130j34709J25506O4247J5304J82674k2027r8312P5004p0538n9979P7920
15220B56220J36800L3530L0088J06487q3231N2948n4915k14485q8256r04R4565
15209B68847k51069j4007O0913K63146P154j12758K1401l4293j18669m2873k08110
15198a60318K6656m9294j07142J057J35489K76383O5259o5590j24107M2785n4905
15187a3727K4015M0327j7447Q033L3346J79099J2920j00575L1602O3538N1505
$$ y = [316993, 249260, 177142, 244066, 247544, 365888, 361178, 243727, 179294, 393154, 333579, 152186, -37816, -85482, -45183, -153610, -325295, -333524, -195846, 105066, 162523, 105570, 160441, 203070, 201915, 124284, 195279, 310327, 370285, 285288, 218057, 218444, 140349, 38490, 101130, -33579, 91927, 156174, 171478, 354152, 332125, 233813, 308817, 238279, 178300, 256220, 393020, 426550, 456638, 563125, 479894, 532842, 477927, 263442, 175186, 174282, 268847, 17778, 3771, 64684, 327830, 334984, 222226, 243627, 209334, 90665, 47792, -160318, -133662, -182956, -290098, -289041, -153552, 122831, 188090, 122500, -1607, 41178, -13727, 10288, 50615, 33168, 41201, 74547, 253646, 266566, 165991, 197593, 261131, 312636]
15176C12636q9450R4009m4298j76058M6398P2497O5281N1102k32506r3076J12762
15165A19297m2509q925j9586R94K16729M0286k2039k4970l1074j28419J50551
15154B50335J45249k7145j40526q7522J47500O1718K1454j80156k31658P8100
15144C7349L19537J75364j47256l34666r7361m0497J40934J50691j7011J14458
15134C01542q5060n4731J29931m234o2595m7842j8244Q0305R1933n6361p5643
15123A99001M3716j04173p897J48038J24518n8459k9114K5671J02676k81801j13852
15112D8324P2487J13839O5964n3834J1287j51487m4852K6814j8401p6040L0064
15101B4165o6608l7552K46478J54378m6128l2608o4547o6336l0221L5040q9984
$$ y = [312636, 223186, 317195, 272897, 96839, 143237, 215734, 281015, 332117, 99611, 6535, 119297, 76788, 67863, 48277, 49271, 266000, 306286, 284247, 259277, 228203, 99784, 250335, 395584, 368439, 227913, 140391, 287891, 349609, 371063, 190907, -40751, 37349, 356886, 532250, 384994, 50328, -47033, -87530, 53404, 204095, 187084, 301542, 216482, 161751, 291682, 287448, 224853, 177011, 158767, 239072, 331005, 274644, 199001, 242717, 138544, 130647, 278685, 403203, 344744, 315630, 341301, 443977, 162176, 48324, 120811, 234650, 300614, 246780, 258067, 106580, 61728, 88542, 70141, -5899, 24165, -42443, -79995, 166483, 320861, 274733, 242125, 177578, 111242, 81021, 116061, 26077]
15090B6077L1325J06304L0688k6314N042J2895J2977q6238N5220K2470J7083n3469
15078A54060O6464J05395p2968j60132L2221J23983j54797q3833J64104M4630
15068B19127r1564J21474J12563j28153l87843L3046O9513Q3316N3644M1104O6650
15057A92877k544R2173k4395k5195P3916j389Q9026k4880j84056K2517J76236
15046C84286R0295j37099j54068j08891M2635J21426n2528o0728M2098J61942
15036C29368p913j82618q1127J3635P7768k1505l994M6597Q4699k15p3804j7210
15024A63681N447R4503N1227M4057J8030j67378l689l0201K8096m7823O86j15883
15012D0753j72632M1328j04145Q1619K54730O5368j60394m0582K88935J99571
$$ y = [26077, 57402, 163706, 194394, 168080, 173122, 186017, 198994, 112756, 167976, 190446, 207529, 154060, 220524, 325919, 252951, 92819, 125040, 249023, 94226, 10393, 174497, 219127, 127563, 249037, 361600, 233447, -154396, -121350, -51837, 31479, 85123, 126227, 192877, 190333, 282506, 258111, 232916, 306832, 305443, 394469, 369589, 185533, 208050, 384286, 474581, 337482, 183414, 74523, 117158, 238584, 186056, 125328, 167426, 329368, 321455, 138837, 57710, 71345, 149113, 127608, 123614, 170211, 254910, 254695, 180891, 163681, 169128, 263631, 314858, 358915, 376945, 209567, 205878, 175677, 203773, 155950, 156636, 40753, -131879, -90551, -194696, -113077, 141653, 207021, 46627, 6045, 294980, 494551]
15002D94551j59831j63166J3792O2358K0676J3215Q2018O7439k14968k38894l000
14991b5810R1509R4209M0476O7908r9761q046J95194j8912k27709j58936J23272
14980G3394K09457K6617k23769L5338J02243N947o0119J2158L8704k7530Q1719
14969B74159j23252p3530K1023N5022q0854n1237J24412j15271j6177P9454n3127
14958D0622N9311M9287J7601o0721o9453O8893o8846k40437J73342J36334K97
14947A06230m8542k7364L6093L4842N6249Q0774o354r667j31348l1900J14189
14936A73202L084Q4316n1367j82782q878J82126K08789O530L9124q9850l4808
14925C29486J56606n0264m2649L8357K5368K1888M3555k3473K6449n6255L5895
$$ y = [494551, 334720, 171554, 185346, 247704, 268380, 281595, 363613, 431052, 216084, -22810, -25810, 65699, 159908, 200384, 268292, 168531, 160485, 355679, 336767, 109058, -49878, 73394, 282851, 309468, 85699, 121037, 223280, 229227, 169108, 181266, 219970, 192440, 274159, 150907, 77377, 98400, 153422, 72568, 21331, 145743, 30472, 14295, 93749, 40622, 99933, 149220, 166821, 106100, 36647, 105540, 36694, -203743, -30401, 105933, 106230, 57688, 30324, 66417, 101259, 157508, 238282, 231928, 222261, 90913, 59013, 173202, 176286, 260602, 209235, 26453, 17575, 199701, 408490, 415020, 454144, 364294, 329486, 486092, 435828, 393179, 431536, 456904, 478792, 522347, 498874, 525323, 469068, 504963]
14914E04963L0472K9805m6554p7715l2566j09530j14624j9594n7923k7883j6623
14903F2228n925k2488j01317j14803K7273J82210K74878n7718P251P9017M4010
14892C74616J94941J14398K9855p652n5727p7723j49281j80857m1851J65790L0409
14881C96918j30779J9911K1562M3532j3450J405P829j42022k35915j12223L2763
14870a10469K12354J06700o0079N5772l041k6077M4581k7913J40374M2849q272
14859C66779n2066p6015k0030P2680p7103j9248J0863O1281J881p1689l2657J2205
14847A76881N5197q7504L9127J36478j1367J25162N4499j65252j04141J23197
14837C42277J23775l8966j30584J51789N3176n9139P278L9279k09001J8493O302
$$ y = [504963, 535435, 565240, 518686, 440971, 408405, 298875, 184251, 164657, 106734, 78851, 62228, 56303, 33815, -67502, -182305, -155032, 27178, 302056, 244338, 251589, 330606, 374616, 569557, 683955, 713810, 706158, 650431, 572708, 423427, 242570, 200719, 366509, 396918, 266139, 286050, 307612, 351144, 337694, 339099, 346928, 204906, -31009, -143232, -110469, 101885, 208585, 148506, 204278, 201237, 175160, 219741, 191828, 332202, 375051, 366779, 314713, 238698, 218668, 291348, 214245, 194997, 205860, 267141, 269022, 197333, 164676, 176881, 232078, 144574, 183701, 320179, 308812, 433974, 488473, 323221, 219080, 342277, 466052, 427086, 296502, 448291, 501467, 442328, 449606, 488885, 279884, 298377, 304679]
14826C04679r1443k0446j0454R030q6417o7685J25168j06956J43490K49923j6310
14815D32579K2137K662j78110p2559m7794J00735J64578q4941j74571k9356J68464
14804C03824L9534j14914K063L932L9716l2790k05964l6978J05979P0299K86522
14793D61223N4044j92176j13100j09931L686J30485r4022o2544K31773K46953
14783E56391o2760K0375j5404k19851l9884K11623o8937q2484J10379J05749j12263
14772D02934j02868l8342j16149l5637N4414k2978m6328J14506j1497j123J29421
14761C26353J03397N561j3018m6610o7179N2139j03965k02745M5040M2643R2563
14750B34179J39611n387J1820j06536q5334L6991Q1914J16038L1912j15237J5856
$$ y = [304679, 213236, 192790, 182336, 191366, 104949, 37264, 162432, 55476, 198966, 448889, 432579, 454716, 457378, 279268, 206709, 158915, 259650, 424228, 339287, 164716, 135360, 303824, 343358, 228444, 230507, 234439, 274155, 241365, 35401, -1577, 104402, 174701, 461223, 515267, 323091, 209991, 100060, 103746, 234231, 140209, 77665, 309438, 556391, 493631, 514006, 498602, 278751, 238867, 450490, 381553, 299069, 409448, 515197, 402934, 300066, 261724, 145575, 109938, 164352, 141374, 95046, 209552, 198055, 196932, 326353, 429750, 435311, 422293, 375683, 308504, 360643, 256678, 53933, 98973, 141616, 234179, 373790, 368403, 380223, 273687, 188353, 225344, 307258, 423296, 455208, 339971, 355827]
14739C55827J5604n873p9960p8978Q4040j1956j5194J15691J9003j11141O2714
14728C49777O6863m8672q9858q4491l7800P7078J40948J00868o2040j35470j39031
14717A38172j19689Q269J45663J54490j00026J6391p044J65726k3610q8617R3083
14706C82808m8453m5321p4m1100p1867n5608p6395O8685N7977o3928L7764O0760
14694B05248M2246R5556J48754n2764j43621l8771L4945P0864J1882J31624R1869
14683E97832j34368j03942j32316l479J13288m3506j27772j33152J25898R0273
14673B48756Q0545J7890M0002O1033r8845p7106J811k30668j24401J5313K04029
14662A38359J14209L7165Q961k1853R9915o367j07785o5965m9566O2067L9988
$$ y = [355827, 371431, 365558, 285598, 206620, 290660, 278704, 263510, 379201, 398204, 287063, 349777, 416640, 367968, 278110, 193619, 155819, 232897, 373845, 474713, 412673, 277203, 138172, 18483, 26752, 172415, 326905, 226879, 243270, 236226, 401952, 378342, 289725, 382808, 334355, 289034, 288960, 247860, 175993, 120385, 43990, 112675, 170652, 106724, 144488, 205248, 247494, 343050, 491804, 439040, 295419, 256648, 291593, 362457, 374339, 505963, 597832, 463464, 359522, 227206, 223727, 337015, 293509, 165737, 32585, 158483, 248756, 329301, 347191, 387193, 448226, 349381, 272275, 274086, 43418, -80983, -65670, 138359, 252568, 289733, 298694, 276841, 376756, 370389, 262604, 196639, 147073, 209140, 249128]
14651B49128O5455j5480q4595j9031m7655N9910J12784o0330O2060K8290K1774
14640C72310o8041J25942m1988Q4791J5850J5889J37721l8608k9575O6123k4498
14629F15916O6207o8909k23322j29020J45045Q066m2917K0311j86754N3780O4413
14618C22816n7903r3408J43344j14079j6996Q752m1139J43413r171m8643q1612
14607A55374M1196J64025R4707o418n7957P8811o7879j55580o2333J67274K81426
14596F32646K0618k46859k57214L9765J23277L1921Q8102j9165k6086m8813r5974
14585B42218J11464o6292j6133L789m0506J68644J33610j01052l05630j89822
14575e9710N7352K7674Q4258J55680N9768j3270q7686K9993P7557o5913m3618
$$ y = [249128, 314583, 299103, 214508, 195477, 147822, 207732, 320516, 260186, 322246, 350536, 372310, 304269, 430211, 388223, 473014, 488864, 504753, 642474, 603866, 574291, 640414, 615916, 682123, 613214, 389892, 260872, 405917, 413983, 371066, 391377, 204623, 258403, 322816, 264913, 171505, 314849, 200770, 183774, 192526, 151387, 294800, 285629, 236986, 155374, 196570, 360595, 455302, 448884, 390927, 469738, 401859, 246279, 183946, 351220, 632646, 653264, 406405, 149191, 188956, 312233, 344154, 432256, 413091, 387005, 338192, 242218, 353682, 287390, 271257, 275046, 234540, 403184, 536794, 435742, 130112, -59710, -2358, 25316, 109574, 265254, 325022, 311752, 224066, 254059, 331616, 265703, 222085]
14564B22085J44765L0768p0320J66918J56808j64954n3030J70070j03447j10312
14554C89351r2475R7981P5595m8783K4289j38342j46666l0423R089P9507J84156
14543D03279R7688K150j56156n4510k3812q3152O2189m5097o193J74303J84912
14532E55601n5372J4610r1393j13934J00642M7000j07040k05049r7749P2223J35740
14521B55279O0434L3367O8018j7476j59799N7016M1878j07888j11781k1342J18733
14510B16439q7797j11040J72033J96927K05832J58681P47j89916j7876j8743j04230
14499D21057j79783N2427J50130J23628M7520l4182k4890J07739j5791L9342l1734
14488F55463l811j72175j65929M1907L5923N9088j3063q5836r5283j04789k6555
$$ y = [222085, 366850, 397618, 327298, 494216, 651024, 486070, 433040, 603110, 499663, 389351, 296876, 394857, 470452, 421669, 445958, 307616, 160950, 130527, 139616, 219123, 403279, 500967, 503117, 346961, 292451, 268639, 185487, 247676, 202579, 196386, 370689, 555601, 500229, 514839, 423446, 309512, 410154, 457154, 350114, 145065, 47316, 119539, 255279, 315713, 349080, 417098, 399622, 239823, 296839, 338717, 230829, 119048, 97706, 216439, 128642, 17602, 189635, 386562, 592394, 751075, 751822, 561906, 544030, 525287, 421057, 241274, 293701, 443831, 567459, 614979, 580797, 555907, 663646, 647855, 687197, 655463, 651652, 479477, 313548, 355455, 391378, 450466, 437403, 351567, 256284, 151495, 124940]
14477A24940J28147J24230Q1647o5083q249R3744J58143p4209j61963j43065J5198
14466B73480J38586K4205J40267M8939j19748P2246o7052J4117p9570r9000j42252
14455B04218J4515J32919J15682j3283j5333k9387J33789j4357j43186j43196
14445B42381P9246J60378N4210j58888m3979J62078q5574L0027R0916Q6006J410
14434F18211k12466q9388J18575J80188o3848q6142q4103o773O3101N5538R804
14423E02697o6194L8879J7646M8368L2580j37226p2869J50707Q4239K5262J30453
14412G54542L1984r6493l2895l3494J5539J013l5207R6403J30007r4015n4155
14401F83229p55k8898k39826M731M6628Q8306L0812j39658j6788l4168J9148K16030
$$ y = [124940, 253087, 377317, 458964, 393881, 385632, 479376, 637519, 563310, 401347, 258282, 273480, 412066, 436271, 576538, 625477, 505729, 577975, 510923, 525040, 445470, 346470, 204218, 218733, 351652, 467334, 454051, 438718, 409331, 543120, 528763, 385577, 242381, 321627, 482005, 536215, 377327, 333348, 495426, 409852, 439879, 530795, 616801, 618211, 405745, 316357, 434932, 615120, 551272, 465130, 381027, 374254, 437355, 492893, 502697, 436503, 475382, 493028, 541396, 573976, 436750, 363881, 514588, 598827, 624089, 754542, 786526, 690033, 657138, 623644, 639183, 640196, 604989, 701392, 831399, 737384, 683229, 682474, 653576, 413750, 418481, 465109, 553415, 584227, 444569, 427781, 393613, 412761, 628791]
14389F28791j5883P47R6786K9728J9660O3673o2203k47415r955N8221m7372J7052
14377E31830n3520k8988j49544k7813R6642J9045j00247m5769J34491O5496o8909
14366C72714J41930R4413j75640q3473J27241J94462P477N8033n0446j37491O9782
14355F19002o3540p9534n6787l2805m2103o9352J18360J8389O1655P7228k0468
14344E30045J7265J14718j39879j9068M3813N8799j6822q668M95K9910j87863
14333D22745K0620M4765J4306M8418p0924p5787l6164J1569P6237R7767J46820
14322G00372J69897P3882j01212j91572p4466j00105r7690J1930R9690l161j17538
14311C70027j91320M9475K73326M2608M0351k2351R0959P8152J02384l6785j82222
$$ y = [628791, 612908, 613655, 710441, 740169, 759829, 823502, 761299, 513884, 503929, 562150, 514778, 531830, 478310, 449322, 299778, 271965, 368607, 387652, 287405, 241636, 376127, 441623, 372714, 514644, 609057, 433417, 349944, 477185, 671647, 679124, 737157, 686711, 549220, 619002, 555462, 475928, 419141, 386336, 344233, 274881, 393241, 411630, 473285, 550513, 530045, 547310, 662028, 522149, 503081, 546894, 605693, 588871, 580203, 580698, 610608, 422745, 443365, 488130, 502436, 550854, 479930, 404143, 367979, 379548, 455785, 553552, 700372, 870269, 944151, 842939, 651367, 576901, 476796, 379106, 391036, 490726, 487565, 370027, 178707, 228182, 501508, 544116, 584467, 562116, 653075, 731227, 833611, 796826, 614604]
14300F14604k995l7102n1067q722J24398K184j49846k4238o1517O9462J18152
14289E93313j7952p7831j41207r3425K6058J57206O5563J0385n8454o1194K8681
14278D31143q567P8465Q0125J27438P928j48788K0494J34372l3068k30571n8190
14267D00781N3205J16266M6036j38365j07814r7456k4771O1259J13953O7945j2652
14256D78387N226J30486J3785n1774N5640q7724J0998J5695j16401o910R2703
14245E40111J14607J6847l5846j53472N6150J62663j2328j32256j11955j715J91230
14234F34036K69479L1696j6076L5927j48972n69j03075j30836q735N9242N3183
14223F75300N87J4729q5285j60356m5877J40879L0948j1190j9364N5436N8139
$$ y = [614604, 611609, 574507, 523440, 514718, 639116, 641300, 491454, 467216, 405699, 475161, 593313, 575361, 497530, 356323, 262898, 288956, 446162, 511725, 522110, 463656, 402462, 431143, 422576, 501041, 581166, 708604, 716532, 567744, 588238, 722610, 689542, 458971, 400781, 453986, 570252, 616288, 477923, 370109, 272653, 247882, 309141, 423094, 491039, 478387, 483613, 614099, 627884, 576110, 631750, 544026, 555024, 570719, 454318, 447408, 540111, 654718, 671565, 635719, 482247, 538397, 701060, 688732, 556476, 444521, 442806, 634036, 903515, 935211, 919135, 955062, 806090, 805521, 702446, 571610, 562875, 622117, 675300, 675887, 690616, 605331, 444975, 399098, 539977, 570925, 559735, 540371, 595807, 653946]
14212F53946N1575M4036J20479K2154m3443r4875p7015m1859l773K71655R1520
14201I94400j47383q8684o5174k5002m1371l1435j81536j29985J08044k5694O8769
14190D34949N7224J00656R2544r0932r2211N8344J37729Q0152m5062k27189n3059
14179D53145L3206J12234J02051J0799r2374M6858J23606R0160J21373j08957
14169H92101j50820j69679p623p0457j19344o1779J38369J39032M5494K1773m3718
14158F13349j10768J13663o4660j05967J8730O5790l4707P6203O6857J24062J0981
14147G73533J8221n6133k2553r6154j56361m4531J14089K7610Q6875q5346J1019
14136E70269O1474q0150m8755q3259K1920J68103J22374l2849j40047o2013J55546
$$ y = [653946, 705521, 749557, 870036, 892190, 848747, 753872, 676857, 634998, 631225, 902880, 994400, 847017, 758333, 693159, 668157, 626786, 595351, 413815, 283830, 391874, 366180, 434949, 492173, 592829, 685373, 594441, 502230, 560574, 698303, 778455, 733393, 506204, 453145, 486351, 598585, 700636, 711435, 619061, 665919, 789525, 879685, 1001058, 892101, 741281, 571602, 563979, 493522, 374178, 312399, 450768, 589800, 635294, 657067, 613349, 502581, 616244, 551584, 445617, 464347, 530137, 495430, 571633, 638490, 762552, 773533, 791754, 735621, 713068, 616914, 460553, 416022, 530111, 557721, 644596, 559250, 570269, 631743, 551593, 502838, 419579, 441499, 609602, 731976, 699127, 559080, 497067, 652613]
14125F52613J5394k8607P421l253k8542K5166r9877j34467o0975m6790N9533R1897
14113D49513J73818K77762m7484r6265R6580K1463P8487j49413j42511j11098
14103E50852R8397J77210m2095p8458k01298o605J58963J41794k114J17346q1162
14092H32830p4428K4575j73459r7229n3013K21959J15372j12077N343O8780q8001
14081F70652l4306P2852M0812J22621R6618N4445l1116j2376j91696k11074j19777
14070D57655J06925j6552j16643j1568J21479o571j78O085M316p8352j3353K14451
14058F67694K3176j30626j32617l8664Q0511J45139J91246j275j66175J315J73848
14047H13572n0591k54464n5565j05780O7314R8996P3961q5878o8943L6438J24120
$$ y = [652613, 668007, 639400, 646821, 643568, 615026, 640192, 540315, 405848, 344873, 298083, 357616, 449513, 623331, 901093, 853609, 757344, 853924, 875387, 953874, 804461, 661950, 550852, 649249, 826459, 784364, 705906, 504608, 498003, 656966, 798760, 796646, 913992, 832830, 758402, 782977, 609518, 512289, 459276, 681235, 796607, 684530, 689873, 758653, 670652, 636346, 709198, 750010, 872631, 969249, 1023694, 992578, 980202, 788506, 577432, 457655, 564580, 548028, 431385, 419817, 541296, 534725, 534547, 540632, 544948, 466596, 453243, 667694, 690870, 560244, 427627, 388963, 469474, 614613, 805859, 804584, 638409, 639724, 813572, 762981, 508517, 452952, 347172, 414486, 513482, 587443, 501565, 432622, 469060, 593180]
14036E93180K33554J42211m9923l2724J02865l8844o8198p7000N2803k0903J3654
14025H50675m0085l09757O202J18271L213j9137j37841j63205J58798J12430L2303
14014F11867M685j44018K2109J17454R6746Q0676O9258j33587j0153L5762k9646
14003G21153j50975j89882P7872J42992J42724n4180J070J24060m8812j4987J25758
13992H76793l4784L499k58229L0322J35193J51216N0592j81437j64062J88285
13982G97388J32348L0825l6614j07227o2188K0216m1863O5318j62950r9043J31705
13971F67915J39748l6022j68931K6307j8456P7982K09028l6730J03558L4734j87802
13960H11331J03622J13303o3765j94108j90280l3039q088J7323P9925j17523J39090
$$ y = [593180, 826734, 968945, 919022, 886298, 989163, 950319, 882121, 805121, 857924, 837021, 850675, 810590, 500833, 507035, 625306, 628519, 609382, 471541, 308336, 467134, 579564, 611867, 616552, 472534, 494643, 612097, 708843, 789519, 858777, 725190, 715037, 750799, 721153, 570178, 380296, 458168, 601160, 743884, 689704, 690774, 814834, 766022, 751035, 876793, 842009, 845508, 587279, 617601, 752794, 904010, 954602, 773165, 609103, 797388, 929736, 960561, 923947, 816720, 754532, 774748, 732885, 798203, 635253, 536210, 667915, 807663, 771641, 602710, 629017, 610561, 688543, 897571, 860841, 964399, 999133, 811331, 914953, 1028256, 964491, 770383, 580103, 547064, 538976, 556299, 636224, 518701, 657791]
13949F57791K9973j54154J3562N0901j05165J3266R9931Q2705n9707l4774r6636
13938D97693Q7843o7188K4988j0908P235L5342K4402K0059j0743J31486J28272
13927H68481j574p8544R096Q0876O2166j14731n0136k5414M0641N3822j47872
13916F96811n4432Q9861J28973q9558n1166O1367j16878j01688P009J45503J9808
13905G35610o1637O6309J60598Q7224K1099j09277j57454r313o2784l255J11105
13894G78225Q2402r4987k05630J36430Q8178N6185q675n909N4490p5765k8930
13883G76014P6034J35064j47795j21693l6957M3585p2293j04769J52031R0406
13873G89627R6689P3086j7722q6907j42488m4389o7484K8787j16162j27211J65869
$$ y = [657791, 687764, 533610, 547172, 598073, 492908, 506174, 606105, 688810, 629103, 594329, 497693, 585536, 518348, 543336, 532428, 539663, 575005, 599407, 619466, 608723, 740209, 868481, 866907, 788363, 797459, 878335, 940501, 825770, 775634, 750220, 790861, 844683, 696811, 642379, 732240, 861213, 771655, 720489, 781856, 664978, 563290, 570299, 715802, 735610, 673973, 740282, 900880, 988104, 1009203, 899926, 742472, 733159, 670375, 667120, 778225, 860627, 765640, 560010, 696440, 784618, 840803, 832128, 826219, 880709, 804944, 776014, 852048, 987112, 839317, 717624, 680667, 724252, 651959, 547190, 699221, 789627, 886316, 959402, 941680, 854773, 712285, 667896, 600412, 629199, 513037, 385826, 551695]
13862E51695J78957J19888J9385N8932k4546k0705r1009o3125N7051M6189R9073
13851I31785N8233m6867j25886p3706J762K10094J01746q4634k22165K999J61916
13840I15277j15682j87383l8795k0083J04147J7278J84328J56740j6682n7443
13830I41702K2212n0402l791J59703J16697M9481j59828k18245J38583K26939
13820A223051p2783N2912R2678m1136m2522k32024j01537k49967J24264P2265
13810H25201l051K3463r5143J19737m3478k0327Q2208m9847j44935K7074P9489
13799H00391N8501J22025j24066N2150r4218j52809L6706O4806J30023R4591j23227
13788H64873l1924r4877O6360N8190J26872Q5554j11287k2920J04547j73452n1019
$$ y = [551695, 730652, 850540, 869925, 928857, 904311, 883606, 792597, 729472, 786523, 832712, 931785, 990018, 943151, 817265, 743559, 745321, 955415, 1057161, 972527, 750362, 753361, 915277, 799595, 612212, 573417, 553334, 657481, 674759, 859087, 1015827, 999145, 941702, 963914, 913512, 909721, 1069424, 1186121, 1235602, 1075774, 857529, 996112, 1223051, 1150268, 1203180, 1295858, 1254722, 1212200, 980176, 878639, 628672, 752936, 825201, 822150, 845613, 750470, 870207, 826729, 806402, 888610, 838763, 693828, 720902, 800391, 858892, 980917, 856851, 909001, 814783, 661974, 698680, 763486, 893509, 988100, 864873, 832949, 738072, 804432, 862622, 989494, 1075048, 963761, 940841, 1045388, 871936, 820917]
13777H20917Q6205J6236N7164o8165R05J5991J4205R352l1782O5165q2398p1943
13765H31852Q9955N2106n774Q6456p5960j43872J02988K1728n5091m0085m9272
13754H15031J2352j4064N3848m8151n4518P0368o1682Q4588J4692k6137K02927
13743A049254J56083k1064O0865M3341j71095j09200j63005j00907O1389L1874
13733H37535M7671O6386q0184n5913j3188j10410k5409K00814J78413R213o2667
13722I92261o4622J67944P3596l6798j62183p1193N5304J0609L5580j0139j65126
13711H25233j18416J00242P9441P94P928L1722L6445o3187j7525k7843j7511K1187
13699H58510K55482m6400j07949R2664j40248K3212J17210P7436j32884J698j3517
$$ y = [820917, 907122, 923358, 980522, 912357, 913262, 929253, 943458, 952810, 921028, 986193, 903795, 831852, 921807, 973913, 968139, 1054595, 978635, 834763, 937751, 959479, 904388, 864303, 815031, 827383, 813319, 867167, 819016, 764498, 834866, 773184, 857772, 872464, 846327, 1049254, 1205337, 1184273, 1245138, 1288479, 1117384, 1008184, 845179, 744272, 805661, 837535, 885206, 951592, 871408, 815495, 802307, 691897, 666488, 867302, 1045715, 1054928, 992261, 927639, 1095583, 1169179, 1132381, 970198, 899005, 954309, 964918, 1000498, 990359, 825233, 706817, 807059, 886500, 887294, 895222, 926944, 963389, 900202, 882677, 854834, 837323, 858510, 1113992, 1067592, 959643, 1052307, 912059, 935271, 1052481, 1129917, 997033, 998731, 985214]
13688I85214j52386N325R1881n646j8036J40197Q9562l3313k15979p1887L061
13677H17993J85216M2863j7734J8827j44366J0453J98900j20926n1462N1001J7331
13666A008096l1396K5389N6058r2259n4035p3857j4419K52767J60348j39689j29256
13655I67747N4216N2886j1101J4308l183M4083J3513j70105Q1273K06950j08120
13644A142467j39740L8790Q5588k6133r6656K7K68904M228j70478n5894j20789
13633I30314J4989L3449M289p3100j29296M248J1412M4090J53499J70229q2882
13622A081241j32113J28045P3661J38721p8735o3111r4318J7864j7627m958o5412
13611I83258j48376n2739J35225K49491O4127m6053l2355j24468l1399N4938N4668
$$ y = [985214, 832828, 838153, 930034, 924388, 906352, 1046549, 1136111, 1102798, 886819, 814932, 817993, 1003209, 1046072, 1028338, 1047165, 902799, 913252, 1112152, 991226, 939764, 990765, 1008096, 976700, 1002089, 1058147, 965888, 911853, 837996, 823577, 1076344, 1236692, 1097003, 967747, 1021963, 1074849, 1063748, 1078056, 1074873, 1118956, 1132469, 962364, 1043637, 1250587, 1142467, 1002727, 1041517, 1127105, 1100972, 1004316, 1004343, 1273247, 1277475, 1106997, 1051103, 930314, 945303, 978752, 983041, 909941, 780645, 784893, 796305, 840395, 993894, 1164123, 1081241, 949128, 1077173, 1150834, 1289555, 1210820, 1147709, 1053391, 1071255, 1053628, 1048670, 983258, 834882, 782143, 917368, 1166859, 1230986, 1184933, 1152578, 1028110, 996711, 1051649, 1106317]
13600A106317j03555j92140Q1764K1637P1653m8934M2201N3982M5606p414L8885
13589A110002P2256j18072J2786K6112K7325p4733j37519M0142K0453L2506l5012
13578I76246P9519L3216J15321O6782j82844m396o5015j44177J12547J27377R938
13567A124514n2787m7576j1058K52616k9847J13501O3904j41608O5334L1508j55770
13556A212731p4321J7373O9825j02712O5405J12955j944J20605O7900j37846n7218
13545A292753j13464m644K2487J06386P8951j60380j09404L421M2849n2244n5821
13534A050890j12115J0344J49507J417l8213J57874J01262N385j09464M6130N119
13523A268136Q972q1843n3012J3821j1558l9725L2766Q6944j4231N0760R0657
$$ y = [1106317, 1002762, 810622, 892386, 914023, 985676, 936742, 978943, 1032925, 1078531, 1071117, 1110002, 1182258, 1064186, 1076972, 1103084, 1130409, 1055676, 918157, 958299, 978752, 1011258, 976246, 1055765, 1088981, 1204302, 1271084, 1088240, 1083844, 1018829, 874652, 987199, 1114576, 1124514, 1071727, 1024151, 1013093, 1265709, 1235862, 1349363, 1413267, 1271659, 1336993, 1368501, 1212731, 1138410, 1155783, 1225608, 1122896, 1188301, 1301256, 1299312, 1419917, 1487817, 1349971, 1292753, 1179289, 1174645, 1197132, 1303518, 1382469, 1222089, 1112685, 1116106, 1158955, 1106711, 1050890, 938775, 949119, 1098626, 1100043, 1061830, 1219704, 1320966, 1326351, 1216887, 1263017, 1268136, 1277108, 1195265, 1142253, 1156074, 1144516, 1104791, 1137557, 1224501, 1210270, 1261030, 1351687]
13512A351687M2756m9480j11518l3121r3147j05494j2066o4852q5642O5059Q8464
13501I92646J48804J89151p6515j0390q770n2676j8548M873q7917m4834J73822
13490A209646N5775J05325o313o2186j56565j88759J02567R3892Q7144j7253p5308
13479A147965j11389j4763M840n2841M9126M0503j17224j23401M8763N9026J68944
13468A099549K44791p0354p3560n4698p9825p6417J52775J60891p6431j3981J0267
13457A223007J33242n0290K949J96194L3890l4161P3505p9133p8574j58803n6228
13446A205598j8749K4977R612M1101P9073P1476N3859M9528j4009o0690Q518l3262
13434A417032N5800j18385j72853J03513N3869m952j4806J2708J85034Q4536o9659
$$ y = [1351687, 1394443, 1344963, 1233445, 1200324, 1107177, 1001683, 989617, 924765, 839123, 904182, 992646, 1141450, 1330601, 1254086, 1243696, 1234926, 1182250, 1163702, 1168575, 1080658, 1035824, 1209646, 1265421, 1370746, 1364433, 1302247, 1145682, 956923, 1059490, 1153382, 1240526, 1223273, 1147965, 1036576, 1021813, 1026653, 973812, 1022938, 1063441, 946217, 822816, 871579, 930605, 1099549, 1344340, 1273986, 1200426, 1145728, 1065903, 989486, 1142261, 1303152, 1226721, 1212740, 1223007, 1356249, 1305959, 1308908, 1505102, 1538992, 1504831, 1578336, 1499203, 1420629, 1261826, 1205598, 1186849, 1211826, 1221438, 1262539, 1341612, 1413088, 1466947, 1516475, 1502466, 1441776, 1450294, 1417032, 1472832, 1354447, 1181594, 1285107, 1338976, 1334024, 1319218, 1331926, 1516960, 1601496, 1531837]
13423A531837j89106q4028K1911Q4453J2350J15152m4042P201o1295n9579l3285
13412A301569k3636R7461J00191Q3917k7533K6764K3752k8583r0904j12992j38082
13401A211924R0364p2722l2061L1108M7111O5547J16998J9069m6725K0823j2889
13390A438547o9669m7699o179J37679J61887n147O7052l2438o7669k10007j54493
13379A211864o6797J31394J67809Q8319q8414j1191J03711k7908j6339j49759
13369A342689j93587Q159K60941J49508n0560j03154r2563m0605J58566R7517
13359A536911o7188Q198q398k1842K7217O3702Q1759J0504L7284n8460q4178j68526
13347A356983j6676J68301J5071o291k3290J2075Q3142j43319k1421J81674l9334
$$ y = [1531837, 1342731, 1258703, 1280614, 1365067, 1377417, 1492569, 1448527, 1455728, 1394433, 1334854, 1301569, 1277933, 1375394, 1475585, 1559502, 1531969, 1558733, 1582485, 1553902, 1462998, 1350006, 1211924, 1302288, 1229566, 1197505, 1228613, 1275724, 1341271, 1458269, 1477338, 1430613, 1451436, 1438547, 1368878, 1321179, 1315000, 1452679, 1614566, 1609419, 1676471, 1644033, 1576364, 1366357, 1211864, 1145067, 1276461, 1444270, 1532589, 1444175, 1432984, 1536695, 1508787, 1492448, 1342689, 1149102, 1157261, 1418202, 1567710, 1517150, 1413996, 1321433, 1280828, 1439394, 1536911, 1469723, 1477921, 1469523, 1447681, 1474898, 1538600, 1620359, 1630863, 1668147, 1609687, 1525509, 1356983, 1340307, 1508608, 1523679, 1517388, 1494098, 1506173, 1589315, 1445996, 1424575, 1606249, 1566915]
13336A566915j99443q1221R308P839r7361J83097J00461r9303p2941L2989O5085
13325A415425l0752R1897l6381m0641m6010J20051J40799J18391p259M4228l4310
13314A735438l6331k48906J9781K07588J2709j71052q4947l4445j2116Q7146l7576
13303A437289P1413m5241j2729J4985J05298k1168K5503q4763k0980O5810j41536
13292A393881m4684j79J09445K4808o1063L3094P8107O6131K06077J16311p8622
13281A843306j58699P3998J1244M27n4865l3011k20058l0057n6546Q9579J31104
13270A596422k830j97603N4998M2476P8792J06753N3465k8040L805l194r8703
13259A606341j0792J12065R1991k7378m8819o6898l4145J6346q4540L7398J92437
$$ y = [1566915, 1367472, 1286251, 1295559, 1303398, 1206037, 1389134, 1489595, 1390292, 1317351, 1350340, 1415425, 1384673, 1476570, 1440189, 1399548, 1353538, 1473589, 1614388, 1732779, 1725520, 1769748, 1735438, 1699107, 1450201, 1469982, 1677570, 1690279, 1519227, 1434280, 1399835, 1387719, 1474865, 1437289, 1508702, 1463461, 1450732, 1465717, 1571015, 1549847, 1575350, 1490587, 1469607, 1535417, 1393881, 1349197, 1349018, 1458463, 1483271, 1422208, 1455302, 1533409, 1599540, 1805617, 1921928, 1843306, 1684607, 1758605, 1769849, 1770276, 1715411, 1682400, 1462342, 1432285, 1375739, 1465318, 1596422, 1593592, 1395989, 1450987, 1493463, 1572255, 1679008, 1732473, 1704433, 1708238, 1705044, 1606341, 1595549, 1707614, 1799605, 1772227, 1723408, 1656510, 1622365, 1638711, 1554171, 1591569, 1784006]
13248A784006K03403J23779j95487k59956K5944Q1047O1215k40189j39363R7758
13238A542157J02998O3185r709J55891j93445j72014j09997k8198R3832J16424
13228A561124J78710J8019O6637q6287k52716q4453J27226J21125R113K04330
13218A862828O8m1519J52563p373j78224q0436j11737Q5432Q6244o7939j11817
13207A588090J011J69841p9915l5541j44932r8134J73900K30760k6421M3146l5887
13196A785918J46357r5296k4395J71516n8958j89612M9721M256j21146P8284l6521
13185A710124M9961Q9764M3377M3766j9613o9496J01489q3836n3338l74J09003
13174A920827P6947k8442j44054o4325J3935p6516j34160J70500K48693j18350
$$ y = [1784006, 1987409, 2111188, 1915701, 1655745, 1681689, 1762736, 1823951, 1583762, 1444399, 1542157, 1645155, 1708340, 1698631, 1854522, 1661077, 1489063, 1379066, 1350868, 1444700, 1561124, 1739834, 1757853, 1824490, 1738203, 1485487, 1401034, 1528260, 1649385, 1658498, 1862828, 1862896, 1821377, 1973940, 1966567, 1788343, 1707907, 1596170, 1681602, 1767846, 1699907, 1588090, 1589101, 1758942, 1679027, 1643486, 1498554, 1400420, 1574320, 1805080, 1778659, 1821805, 1785918, 1932275, 1836979, 1812584, 1984100, 1925142, 1735530, 1785251, 1789507, 1668361, 1746645, 1710124, 1760085, 1849849, 1893226, 1936992, 1917379, 1847883, 1949372, 1865536, 1812198, 1811824, 1920827, 1997774, 1969332, 1825278, 1760953, 1774888, 1698372, 1564212, 1734712, 1983405, 1865055]
13164A865055k11581J02410J0262o5511j7080O0042K85718Q0499q7337j07684
13154A914793j59254q835K17815L6845N4468j1336k8602l8823j52203l9821L2900
13143A817947l7460J560P4686J84922J05084j36724j72339j39244n6042K01110
13133A843500R9897l5658r3268l3021J15887K08378mk27002k01726P4833J29039
13122A880855o6570J195K17528O0059q029l0716j39132M0575J3209M0058M3096
13111B052128J56621J9522o3234l0285j06743k6435M3931K2081O5186m6036p4941
13100B011795P8728K6045J1743M3544n0486o3279r3393K2131k3750Q8144n241
13089B045981j27675j75299J08711P1758J70842o6951Q6278J22072L8305k9706
$$ y = [1865055, 1653474, 1755884, 1766146, 1700635, 1683555, 1743597, 2029315, 2109814, 2022477, 1914793, 1755539, 1746704, 1964519, 2001364, 2055832, 2044496, 2015894, 1977071, 1824868, 1785047, 1817947, 1780487, 1782047, 1856733, 2041655, 2146739, 2010015, 1837676, 1698432, 1642390, 1843500, 1943397, 1907739, 1814471, 1781450, 1897337, 2105715, 2105711, 1878709, 1676983, 1751816, 1880855, 1814285, 1815480, 2033008, 2093067, 2085038, 2054322, 1915190, 1955765, 1968974, 2009032, 2052128, 2208749, 2228271, 2165037, 2134752, 2028009, 2001574, 2045505, 2067586, 2132772, 2086736, 2011795, 2090523, 2116568, 2128311, 2171855, 2121369, 2058090, 1964697, 1986828, 1963078, 2051222, 2045981, 1918306, 1743007, 1851718, 1923476, 2094318, 2027367, 2113645, 2235717, 2274022, 2244316]
13079B244316j83971j53388K1843N3079j42878j58389l9744J15766J45030J70147
13069B071811j8734Q5632k20911R1261J90222n5377o0625J03407M1673j31734
13059B096625j72705o2328J20551J56384J17236j52842m7959J66360j43259j58744
13049A919319O415J11188Q6743J64198Q3039p5613j32567k36249j2534K9722r8240
13038A845421k0867l2403J54601J35572K31957O870k06903O0959k9287M9548L4731
13027B230199k24439l3816K94533K06649j12090m1580M0009J70448O8608n7543
13017B540978j29765j68425n6305P310j4572J5679j10947J40910K00996O2193
13007B488052j92142m9216o1714J04302l2878j86383M211L9214J96032J35006
$$ y = [2244316, 2060345, 1906957, 1928800, 1981879, 1839001, 1680612, 1640868, 1756634, 1901664, 2071811, 2053077, 2138709, 1917798, 2009059, 2199281, 2143904, 2083279, 2186686, 2228359, 2096625, 1923920, 1861592, 1982143, 2138527, 2255763, 2102921, 2054962, 2221322, 2078063, 1919319, 1925734, 2036922, 2123665, 2287863, 2370902, 2295289, 2162722, 1926473, 1913939, 1943661, 1845421, 1824554, 1792151, 1946752, 2082324, 2314281, 2321151, 2114248, 2175207, 2145920, 2195468, 2230199, 2005760, 1971944, 2266477, 2473126, 2361036, 2319456, 2359465, 2529913, 2598521, 2540978, 2411213, 2242788, 2186483, 2193793, 2179221, 2194900, 2083953, 2224863, 2425859, 2488052, 2295910, 2246694, 2184980, 2289282, 2256404, 2070021, 2074232, 2113446, 2309478, 2444484]
12997B444484j17250o7885Q4704R4526m7447l4334J58388q486q3372K591N0709
12986B476628N1393J88345P7603Q1489p0245j83382p1567j38781k02444q2561
12976B126478J09914O3358n2169j2323R2178J61082J67836p5896p2322q0293r416
12965B418427q9262j2205l7785J3501l932p8271j35211N0604J03629k3259k8528
12954B177708J24109O3460K3302K7976m8342j53534J2895O3054m0569k8517J07529
12943B329071J87586P485Q9185R856J1236p5714O0762J55853q3306j61379R2112
12932B622747J67693j03704q6837o5693R6570k236m9859N4407K45768K8845l14566
12921B593135j80179m6091K25230J04886r7509J2273m8834N1548r2905p4464J41255
$$ y = [2444484, 2327234, 2259349, 2344053, 2438579, 2391132, 2356798, 2515186, 2506700, 2423328, 2425919, 2476628, 2528021, 2716366, 2793969, 2875458, 2805213, 2621831, 2550264, 2411483, 2209039, 2126478, 2236392, 2299750, 2247581, 2235258, 2327436, 2488518, 2656354, 2580458, 2508136, 2427843, 2418427, 2329165, 2316960, 2279175, 2292676, 2288744, 2210473, 2075262, 2125866, 2229495, 2206236, 2177708, 2301817, 2365277, 2388579, 2416555, 2368213, 2214679, 2227574, 2290628, 2250059, 2221542, 2329071, 2516657, 2524142, 2613327, 2623183, 2634419, 2558705, 2619467, 2775320, 2692014, 2530635, 2622747, 2790440, 2686736, 2599899, 2534206, 2630776, 2628540, 2578681, 2633088, 2878856, 2907701, 2593135, 2412956, 2366865, 2592095, 2696981, 2599472, 2611745, 2562911, 2614459, 2521554, 2447090, 2588345]
12910B588345J56373P7159R5058j02216J6394p6579j15838L0980l1334l7319R2233
12899B693256k2512r1777j73420j6530p9215l1679K3926Q379J55148J41201L3472
12888B640249O2001Q9766j78907p5644m4219R0278J76798p0166j92332j38483
12878B359341L9723O0419K0888K986M8645l6909J57002j8920j53407p3664K28705
12867B634809J02527m2097K8126J99560N3602k04750j28158K2555L3348K10228
12857B909750M9770j98734l5135J1952P332Q4359m9560n3388n3101J3058L8245
12846B724548L6707k02520p9876J17521J09962J33310j7104q9713N8945p467K0832
12835B805145j0645m0659M1559k3994M1314m729J87151L2013j20497n5542j16455
$$ y = [2588345, 2744718, 2821877, 2916935, 2814719, 2831113, 2754534, 2638696, 2669676, 2638342, 2601023, 2693256, 2670744, 2578967, 2405547, 2389017, 2309802, 2278123, 2302049, 2310428, 2465576, 2606777, 2640249, 2702250, 2792016, 2613109, 2537465, 2493246, 2583524, 2760322, 2690156, 2497824, 2359341, 2399064, 2459483, 2480371, 2483357, 2532002, 2495093, 2652095, 2633175, 2479768, 2406104, 2634809, 2737336, 2695239, 2723365, 2922925, 2976527, 2771777, 2643619, 2666174, 2699522, 2909750, 2959520, 2760786, 2725651, 2737603, 2744935, 2829294, 2779734, 2726346, 2673245, 2686303, 2724548, 2761255, 2558735, 2478859, 2596380, 2706342, 2839652, 2822548, 2732835, 2791780, 2784313, 2805145, 2794500, 2753841, 2795400, 2771406, 2812720, 2807991, 2995142, 3027155, 2906658, 2851116, 2734661]
12824B734661P6802p3276j14638M688R6949J4798k5903k2793l276J94763J16706
12813B999481k13010q7338P9585K45278j16459k0671K1825k5439j6952p3365o8311
12802B724624P7350K24545m1583j7730k969o2241J1530l4369J70566J42313l5491
12791C156545O8225k01801k14285q2364J11120K41201r258j91509L9886N9699
12781B977459j5910n8887r705K7721J87445R3806Q0624R4417j00824j56769m5187
12770C074190j10455j28950J21523J0088k4082J12230M7074K8068j50182m3393
12760B936111J49454J62808q1382J1161k315N2633J15412p1173j69088K4693J27061
12749C255375O2661k4897j19118M6527j04656r1097j36568Q6152K17871J31047
$$ y = [2734661, 2811463, 2738187, 2623549, 2628237, 2725186, 2739984, 2714081, 2691288, 2688012, 2882775, 2999481, 2786471, 2699133, 2778718, 3023996, 2907537, 2886866, 2908691, 2883252, 2866300, 2792935, 2724624, 2801974, 3026519, 2984936, 2967206, 2964237, 2901996, 2913526, 2879157, 3049723, 3192036, 3156545, 3224770, 3022969, 2808684, 2726320, 2837440, 3078641, 3069383, 2877874, 2917760, 2977459, 2961549, 2902662, 2892957, 2920678, 3108123, 3201929, 3282553, 3376970, 3276146, 3119377, 3074190, 2963735, 2834785, 2956308, 2966396, 2942314, 3054544, 3101618, 3129686, 2979504, 2936111, 3085565, 3248373, 3166991, 3178152, 3175837, 3228470, 3343882, 3272709, 3103621, 3128314, 3255375, 3318036, 3293139, 3174021, 3220548, 3115892, 3024795, 2888227, 2974379, 3192250, 3323297]
12739C323297k0977m2498n6459p5896Q3417m6922K7512q7843j18008P0323J84544
12728C240490J9088n6607j60416K07779J83726j84651m9318K6799Q4549K28283
12718C539722P9665j12170k44390j55276J58051P4074n4408j59870J23753J02454
12708C351605n077L6292j36535l1856k1804J5883K08159p7187j51715k40536J52517
12697C099746J51948n5607L5976M2675J51987J28695j32132j07472J10970K961
12687C429747j70189k9217O498L9797K05657R0393q7800k19527j22931l2602P2997
12676C182823J72523j9665l0976p4834J17955K76867Q450p1189Q5845k6479l8736
12665C582584k1023K3312P4470j39317r5982n0585m243Q8334K0897k5897m7822
$$ y = [3323297, 3302320, 3259822, 3203363, 3127467, 3210884, 3163962, 3191474, 3103631, 2985623, 3055946, 3240490, 3259578, 3202971, 3042555, 3250334, 3434060, 3249409, 3200091, 3226890, 3311439, 3539722, 3619387, 3507217, 3262827, 3107551, 3265602, 3339676, 3285268, 3125398, 3249151, 3351605, 3346528, 3382820, 3246285, 3214429, 3192625, 3208508, 3416667, 3339480, 3187765, 2947229, 3099746, 3251694, 3196087, 3232063, 3274738, 3426725, 3555420, 3423288, 3315816, 3426786, 3429747, 3259558, 3230341, 3236839, 3276636, 3482293, 3572686, 3484886, 3265359, 3142428, 3109826, 3182823, 3355346, 3335681, 3304705, 3229871, 3347826, 3624693, 3633143, 3561954, 3647799, 3621320, 3582584, 3561561, 3584873, 3659343, 3520026, 3424044, 3373459, 3369216, 3457550, 3478447, 3452550, 3404728]
12654C404728r8886O2936J07020J74080O96k44253J26463J80966l1459M7100P3260
12643C802651l144J35585j87968k35635R7595n968J3160L9300L8238j63410j44613
12632C385791J64009R0034r3277l1282J56611Q473j9817l7661P5517N5125L4530
12621C788053j39018j35592l2848J26478J14207N2474N8559r7603K5423m5208
12611C714925O53l0163N2024k8453J38114k9860o027L4828J21227p0494n7518
12600C839256R4932J70431l8915o2538j23137l3031m343n3695L5406J21839j20187
12589C826018j31801p3195n9450J22698K10455R2925J9389j30382P7805o1300
12579C893162k00642J72980K68132P699j51845N786K55863L3951j39442q5921
$$ y = [3404728, 3305842, 3368778, 3475798, 3649878, 3650574, 3406321, 3532784, 3713750, 3682291, 3729391, 3802651, 3799507, 3935092, 3747124, 3511489, 3609084, 3603116, 3616276, 3655576, 3693814, 3530404, 3385791, 3549800, 3639834, 3546557, 3515275, 3671886, 3680359, 3660542, 3622881, 3698398, 3753523, 3788053, 3649035, 3513443, 3480595, 3607073, 3721280, 3773754, 3832313, 3734710, 3760133, 3714925, 3715578, 3685415, 3737439, 3708986, 3847100, 3817240, 3811213, 3846041, 3967268, 3896774, 3839256, 3934188, 4104619, 4065704, 4003166, 3880029, 3846998, 3842655, 3788960, 3824366, 3946205, 3826018, 3694217, 3621022, 3561572, 3684270, 3894725, 3987650, 4007039, 3876657, 3954462, 3893162, 3692520, 3865500, 4133632, 4141331, 3989486, 3995272, 4251135, 4285086, 4145644, 4059723]
12569D059723J04232O2171n475J44526j81769j67160j37777M3068J61081l4079
12559D048541q7541O8056P4787m2756L3524L8014K0595n80k1045j8251n6297L2014
12547D089061J59555P3309n9348k50357j50909J64995Q0506j95836j46644L6888
12537C801220P132j09283J01833P2187J17857M6334O3743q1426j4209P2895M773
12526D083056l0165Q1310k0425j02972q1791J7069L9722M6750J01023j1362Q352
12515D130567J19283p9455n6424L7026J19903n3570J09733J134p1130j74210P0283
12504D153140J72325Q6549l414m7438j8502r4152j43256m7631m5509q5853K16792
12493D143051J33780j0416k4159r4882j077J03202J42202j48125j84190m3084
$$ y = [4059723, 4163955, 4226126, 4220651, 4365177, 4183408, 4016248, 3878471, 3921539, 4082620, 4048541, 3961000, 4029056, 4103843, 4061087, 4094611, 4132625, 4153220, 4152640, 4131595, 4113344, 4057047, 4089061, 4248616, 4321925, 4262577, 4012220, 3861311, 4026306, 4106812, 3910976, 3764332, 3801220, 3808352, 3699069, 3800902, 3873089, 3990946, 4037280, 4101023, 4019597, 4005388, 4078283, 4083056, 4052891, 4134201, 4113776, 4010804, 3929013, 3946082, 3985804, 4032554, 4133577, 4122215, 4130567, 4249850, 4170395, 4113971, 4150997, 4270900, 4217330, 4327063, 4328197, 4257067, 4082857, 4153140, 4325465, 4412014, 4408600, 4361162, 4342660, 4248508, 4105252, 4057621, 4012112, 3926259, 4143051, 4276831, 4266415, 4242256, 4147374, 4146297, 4249499, 4391701, 4243576, 4059386, 4016302]
12483D016302J28455M7371J00822o6181k099n8626l6119j8221J57582K24285J530
12472D495101n4146j14766J44313O6332m2145R6879n3956l9452M7656Q8712J36245
12461D770773O4820n8589j58633j01520M3657p9177r5913k1603M607J93162J9913
12450D581497j26859j73648R5442N8247j5825k5258J67983K34914l0446k45341
12440D520706r2697P6060r9125j39037L7809O7234J35716L2255J65438k1009j1360
12429D671990p3634j05320J22268Q3258j30099O6854O4215O0706n0746j20760
12419D588732r295J95349j15019j42043M0769j3468j50009J50980O2900l9037
12409D569859J93272m4780r1551l5042l0809N6586R8973J3866L4389J11330Q1887
$$ y = [4016302, 4144757, 4192128, 4292950, 4226769, 4224670, 4166044, 4129925, 4111704, 4269286, 4493571, 4495101, 4440955, 4326189, 4470502, 4536834, 4494689, 4591568, 4537612, 4498160, 4545816, 4634528, 4770773, 4835593, 4777004, 4618371, 4516851, 4560508, 4481331, 4385418, 4363815, 4368422, 4561584, 4581497, 4454638, 4280990, 4376432, 4434679, 4418854, 4393596, 4561579, 4796493, 4766047, 4520706, 4428009, 4504069, 4404944, 4265907, 4303716, 4370950, 4506666, 4538921, 4704359, 4683350, 4671990, 4598356, 4493036, 4615304, 4698562, 4568463, 4635317, 4699532, 4760238, 4709492, 4588732, 4579437, 4774786, 4659767, 4517724, 4558493, 4545025, 4395016, 4545996, 4608896, 4569859, 4763131, 4718351, 4626800, 4591758, 4560949, 4617535, 4716508, 4730374, 4764763, 4876093, 4957980]
12398D957980k7164j19828O4587j02810M4765R6085o2163l8155j53549n4531J1227
12387D616444K29311l321M9187k7449j28416j97554R1517L6037J15744J03420
12377D884920M2364J22556r3838o5190O5091K4226N9730K32j63853j88360k5172
12366D662706L5636Q5046N1708o1050J623k7888L9565J49781L5377j67901p0689
12355D733914O2517M2074Q1293J23015p0658m1600j0203O3588l8106J2763J00958
12344E059555P2839r609p2575p0217q6842j14117J05549K003Q5559k9368m9628
12333D893149K24332N7947R4915n7256J11411n1814q9100k10216R948l2921o4484
12322D885911K43874J47668n6098j29016Q6073j09775p4865Q1698m636j23376
$$ y = [4957980, 4930816, 4810988, 4875575, 4772765, 4817530, 4913615, 4851452, 4813297, 4659748, 4605217, 4616444, 4845755, 4842434, 4891621, 4864172, 4735756, 4538202, 4629719, 4665756, 4781500, 4884920, 4927284, 5049840, 4956002, 4890812, 4955903, 4980129, 5039859, 5040091, 4876238, 4687878, 4662706, 4698342, 4783388, 4835096, 4774046, 4775669, 4747781, 4787346, 4937127, 4972504, 4804603, 4733914, 4796431, 4838505, 4919798, 5042813, 4972155, 4930555, 4920352, 4983940, 4945834, 4958597, 5059555, 5132394, 5122785, 5050210, 4979993, 4893151, 4779034, 4884583, 4886586, 4972145, 4942777, 4893149, 5117481, 5175428, 5270343, 5213087, 5324498, 5272684, 5183584, 4973368, 4983316, 4950395, 4885911, 5129785, 5277453, 5221355, 5092339, 5178412, 5068637, 4993772, 5075470, 5070834, 4947458]
12312D947458P3705J44283o0437j12838Q4400J81211R0757K7856j80182j54286
12302E041927m03J39966L5497j6021m9629p3503m8129J36776J3086J7667r7956
12291E099278M0423L1849N4861J52842j09705o8054R7908N5748R0284l1641m069
12280E409724l0336q4890j54373R05o887P4952l8953k2088l5761j12968J91839
12269E191164K6098K8849P2386l5268J3331k1918L4141k5222j46297J5626J80559
12258E333449J69395j1867L9457q7053j59609Q2345j29648Q9148j4300k1552n4531
12247E235234P7291Q0734J41763j05043k27274K3055J80732L9223L3679Q1975
12237E561369j41483j13002k5541J4259Q2551j79359r903J74875P3964j75313
$$ y = [4947458, 5021163, 5165446, 5105009, 4992171, 5076571, 5257782, 5348539, 5376395, 5196213, 5041927, 5041524, 5181490, 5216987, 5200966, 5151337, 5077834, 5029705, 5166481, 5179567, 5197234, 5099278, 5139701, 5171550, 5226411, 5379253, 5269548, 5201494, 5299402, 5355150, 5445434, 5413793, 5409724, 5379388, 5294498, 5140125, 5141030, 5134143, 5209095, 5170142, 5148054, 5112293, 4999325, 5191164, 5217262, 5246111, 5318497, 5283229, 5296560, 5274642, 5308783, 5283561, 5137264, 5152890, 5333449, 5502844, 5490977, 5530434, 5443381, 5283772, 5366117, 5236469, 5325617, 5311317, 5289765, 5235234, 5312525, 5393259, 5535022, 5429979, 5202705, 5225760, 5406492, 5445715, 5479394, 5561369, 5419886, 5306884, 5281343, 5295602, 5378153, 5198794, 5188891, 5363766, 5437730, 5262417]
12227E262417j35335n9632Q5772R997J57037P8803q2917q7062o2823L56L44006
12216E510619J51702J2369j50035j26773n3894o4721J36067K9292p4084j39730
12206E230812j04122P9071M6894L4246J86247m5381j30480l7115N7333P4667J66834
12195E559006o7510j18858Q4188J89539R9647j14749o6162k0358J29279n0521
12185E623501j55045j39584J15207J89175l5843M5269O6116j46894j20361j0137
12175E431404j21073n1972m6150J90028K23663l406j00642R1091K9524j3344K6289
12164E655412k5347J43087N9787J40324q4835L5902n8448j46794L9688n4774P4926
12153E778928j12633j91291P5484N9921J33107M6290p4994r1986j3188O5997O0488
$$ y = [5262417, 5127082, 5067450, 5153222, 5163219, 5320256, 5399059, 5316142, 5229080, 5166257, 5166613, 5510619, 5662321, 5674690, 5524655, 5397882, 5343988, 5279267, 5415334, 5444626, 5370542, 5230812, 5126690, 5205761, 5252655, 5286901, 5473148, 5427767, 5297287, 5260172, 5317505, 5392172, 5559006, 5491496, 5372638, 5456826, 5646365, 5746012, 5631263, 5565101, 5544743, 5674022, 5623501, 5468456, 5328872, 5444079, 5633254, 5597411, 5642680, 5708796, 5561902, 5441541, 5431404, 5310331, 5258359, 5212209, 5402237, 5625900, 5622494, 5521852, 5612943, 5642467, 5629123, 5655412, 5630065, 5773152, 5832939, 5973263, 5888428, 5924330, 5865882, 5719088, 5758776, 5704002, 5778928, 5666295, 5475004, 5550488, 5610409, 5743516, 5789806, 5714812, 5622826, 5609638, 5675635, 5736123]
12142E736123j80108r2723K40767K22196j10298k77765m6067K24737K485q6015
12132E633332j6002r590K3797N1812N1607P0440j29613j56946J4501K10505J26089
12121E869932n7548j92176q3448R632k9856K15001M9906j46003j07067O2960J23085
12110E714418n8732K3548l3879j6974j43247n2170J02995p3119j11194k2643l2432
12099E296571O6678n5629N6213M6653K02805J39982n2532K2433L2492m5340n4458
12088E655868l8742k28668o925N3741n161J33460J87474l3834o1147J0969J1263
12077E678298l7391M561j39071j57078J81973J98414l9113N6017J10193l1149
12067E825654K3531j10906K4863j0855k8554l5944j7165l6652n2927p2768J94705
$$ y = [5736123, 5556015, 5463292, 5704059, 5926255, 5815957, 5538192, 5492125, 5716862, 5719347, 5633332, 5617330, 5607740, 5631537, 5683349, 5734956, 5805396, 5675783, 5518837, 5533338, 5743843, 5869932, 5812384, 5620208, 5536760, 5546392, 5516536, 5731537, 5781443, 5635440, 5528373, 5591333, 5714418, 5655686, 5679234, 5645355, 5628381, 5485134, 5432964, 5535959, 5462840, 5351646, 5329003, 5296571, 5363249, 5307620, 5363833, 5410486, 5613291, 5753273, 5700741, 5723174, 5755666, 5710326, 5655868, 5617126, 5388458, 5381533, 5435274, 5430113, 5563573, 5751047, 5717213, 5656066, 5667035, 5678298, 5640907, 5645468, 5506397, 5349319, 5531292, 5729706, 5690593, 5746610, 5856803, 5825654, 5849185, 5738279, 5763142, 5752287, 5723733, 5687789, 5670624, 5633972, 5581045, 5508277, 5702982]
12056E702982J76943k1558j13131j06299r6850m7636K2080O2067Q3310J48741
12046E810649j6576j85757o0764R9070J69637P1961L8994M2611J6241q325p8218
12035E899523j46503N5111M5824j94767k18724l5620J66498P6297j32491j6838
12025E498310r267N7419O7406j9j3699n7909j01917M84M5434o3350q7396K5616
12013E361112R5486m4850j80928Q4987O5611m4919m2695J4889J32983O9403k3613
12002E487466q3268l8530Q1447m2895J41593J84450n7874k35104l2226J48079
11992E553138J08131J91613R5030j08157j19684r6490r3839n0346l0796J29687
11982E578287N6247M2002p1325k00898J10415J5590j0304p5067n2498O8842J22587
$$ y = [5702982, 5879925, 5858367, 5745236, 5638937, 5542087, 5494451, 5516531, 5578598, 5661908, 5810649, 5794073, 5608316, 5547552, 5646622, 5816259, 5888220, 5927214, 5969825, 5986066, 5977741, 5899523, 5753020, 5808131, 5853955, 5659188, 5440464, 5404844, 5571342, 5647639, 5515148, 5498310, 5489043, 5546462, 5613868, 5613849, 5600150, 5542241, 5440324, 5440808, 5486242, 5422892, 5335496, 5361112, 5456598, 5411748, 5230820, 5315807, 5381418, 5336499, 5293804, 5308693, 5441676, 5511079, 5487466, 5404198, 5365668, 5447115, 5404220, 5545813, 5730263, 5672389, 5437285, 5405059, 5553138, 5661269, 5852882, 5947912, 5839755, 5720071, 5623581, 5529742, 5479396, 5448600, 5578287, 5634534, 5676536, 5605211, 5404313, 5514728, 5530318, 5520014, 5444947, 5392449, 5461291, 5583878]
11971E583878L236p7711j33579j14373n3099j8215J37834J33002K7481L586p7725
11960E414315j9320o6598l5604p4718J15412K55290P2825k8443n9448M5635J2589
11949E631935j06559j19861N6870J11841n7036l7953j17770n563L102J03386J05826
11938E568218J54579M4560m3857q1116o1285M1892K1450j60645k33468j49239
11928E101089Q1316K11526R315p8129n3500Q5802K4833j9401j01640K1557n5009
11917E227759J47517p8262o0303M4551j1448Q6313N7595R7522J07847o2260m4568
11906E512263N4649o5913l5538K5503j44379J05529L38O8160K7915J7995k055
11895E564467l7644j93269L331O2373r9350j81616m2705J89941M7936j46607j22120
$$ y = [5583878, 5587114, 5509403, 5375824, 5261451, 5208352, 5190137, 5327971, 5460973, 5488454, 5492040, 5414315, 5394995, 5328397, 5292793, 5218075, 5333487, 5588777, 5661602, 5633159, 5573711, 5619346, 5631935, 5525376, 5405515, 5462385, 5574226, 5517190, 5479237, 5361467, 5355904, 5359006, 5462392, 5568218, 5722797, 5767357, 5723500, 5642384, 5581099, 5622991, 5644441, 5483796, 5250328, 5101089, 5182405, 5393931, 5403246, 5325117, 5271617, 5357419, 5382252, 5362851, 5261211, 5282768, 5227759, 5375276, 5297014, 5236711, 5281262, 5269814, 5356127, 5413722, 5511244, 5619091, 5556831, 5512263, 5566912, 5500999, 5465461, 5490964, 5346585, 5452114, 5452452, 5520612, 5548527, 5566522, 5564467, 5526823, 5333554, 5336885, 5399258, 5299908, 5118292, 5075587, 5265528, 5313464, 5166857, 5044737]
11884E044737o3129j12170L9844R7410N9237K1633j06160J54334N3224m2876n9513
11873E086571J3381R4952q0756r623j8701R1597J33005Q0123L0770K580P6691
11862E500590j65957j72500K9663N3472o3400J37546p8570k85269r8504j3528
11852D843543k9402O6670N3974J56237J00447l4633o8606j1991P1124r6482j42017
11841D908864m0672P9405K46750J24212O2227q4180j40903n331j95n0542q3951
11830E015684J64297O3910j60533m1760O5735o8141M9913j30476k3096J65926
11820E101459J33497q6482n2009j06361n5000l501M309O9462J22426p3718r9221
11809D954861n8605J0153L3498N0044N8405J43923n2786l1709q2054j40727j11667
$$ y = [5044737, 4981608, 4869438, 4909282, 5006692, 5065929, 5087562, 4981402, 5135736, 5188960, 5146084, 5086571, 5099952, 5194904, 5114148, 5104525, 5085824, 5177421, 5310426, 5390549, 5421319, 5423899, 5500590, 5334633, 5162133, 5191796, 5245268, 5181868, 5319414, 5240844, 4955575, 4857071, 4843543, 4814141, 4880811, 4934785, 5091022, 5191469, 5156836, 5088230, 5076239, 5147363, 5050881, 4908864, 4868192, 4947597, 5194347, 5318559, 5380786, 5296606, 5155703, 5150372, 5150177, 5099635, 5015684, 5179981, 5243891, 5083358, 5041598, 5107333, 5039192, 5089105, 4958629, 4935533, 5101459, 5234956, 5148474, 5096465, 4990104, 4935104, 4931603, 4935912, 5005374, 5127800, 5054082, 4954861, 4896256, 4906409, 4939907, 4989951, 5048356, 5192279, 5139493, 5107784, 5025730, 4885003, 4773336]
11798D773336J25827m2033k6925J9579p1944N471K98972L1551l00659j68072j16962
11787D528141o0392Q0198J96472N8183J74968J62193r5009j59455Q7954p2334
11777D900919q9193l6478j22263n7427L8319R4202M5486j27181k3070J15600J52051
11766D890965o8455j23798J35328J83018r1590j36127j98878k00753J64340J53297
11756D707347n4102q2329M1714q4259Q5966J93339N3872p4072o9173K427J09364
11745D830094j4046r8541J3055M549j19605m4085K2027P1629K9322q5236n7718
11734D551445j15205J10510p8669q1255k08298P5948O0918R4151m8990N3609J42677
11723D556841j01900J16549N2744r9132j46567q4187l0434P7515K5731J05682
$$ y = [4773336, 4899163, 4857130, 4830205, 4849784, 4777840, 4783311, 5082283, 5113834, 4813175, 4645103, 4528141, 4467749, 4547947, 4744419, 4802602, 4977570, 5139763, 5044754, 4885299, 4973253, 4900919, 4811726, 4775248, 4652985, 4595558, 4633877, 4728079, 4773565, 4646384, 4623314, 4738914, 4890965, 4822510, 4698712, 4834040, 5017058, 4925468, 4789341, 4590463, 4389710, 4554050, 4707347, 4653245, 4570916, 4612630, 4528371, 4614337, 4807676, 4861548, 4787476, 4718303, 4720730, 4830094, 4816048, 4717507, 4730562, 4735111, 4615506, 4571421, 4593448, 4665077, 4694399, 4609163, 4551445, 4436240, 4546750, 4468081, 4386826, 4178528, 4254476, 4315394, 4409545, 4360555, 4414164, 4556841, 4454941, 4571490, 4624234, 4525102, 4378535, 4294348, 4263914, 4341429, 4367160, 4472842]
11713D472842J47862k4960p8984j44458p272J8798M925R23k4245J11405J43896
11702D620732K601J7733j79733N2921J57980j10036o8581j39298q2629R6980P0859
11691D439529j4385P6881J57736M2724j75234k20979o5166K3505j7662J825K7761
11680D276535j8342L9497l4056J11576o9455k6228j5637M1305j73657n8259M9306
11669D122585l5768M0601r738Q9072r5944r2669l176P0845Q1860J85333j10884
11658D242117q5738M2680q4421o2187M7678P4285j98838K4752J7141q6158J04121
11647D035432K7035R3123o9430p1179L9932J00093l2887j63645o6815J82255j9947
11636D053967K475n8686M868M8541P0586J10032q2361j54829R6995m2977q3481
$$ y = [4472842, 4620704, 4595744, 4516760, 4372302, 4365030, 4383828, 4388753, 4389676, 4365431, 4476836, 4620732, 4623333, 4641066, 4461333, 4514254, 4672234, 4562198, 4493617, 4354319, 4271690, 4368670, 4439529, 4425144, 4502025, 4659761, 4702485, 4527251, 4306272, 4241106, 4264611, 4246949, 4248774, 4276535, 4258193, 4297690, 4263634, 4375210, 4305755, 4279527, 4263890, 4305195, 4131538, 4073279, 4122585, 4086817, 4127418, 4117680, 4206752, 4110808, 4018139, 4014963, 4085808, 4167668, 4353001, 4242117, 4156379, 4199059, 4114638, 4052451, 4100129, 4174414, 3975576, 4000328, 4017469, 3931311, 4035432, 4062467, 4155590, 4086160, 4014981, 4054913, 4155006, 4122119, 3958474, 3891659, 4073914, 4053967, 4056442, 3997756, 4002624, 4051165, 4121751, 4231783, 4149422, 3994593, 4091588, 4048611, 3965130]
11625C965130M3299J26691J23916o5128j42794j02508o7118J4065J48518J1680
11615D055751j5482l2495K1871N6678p3586j6798j33138n459J24881J27327j6951
11604D092599k8562l7629q7892q9823k8415R5841J25618o6631L4992l9852p5986
11593C894260r7480Q9718J16361p0795j77407n8756k0997J26994N9147J0165N3629
11582C924839J1180j44419r3067J07126q3510N0518n832k9064J6391l7755q0201
11571C636206R6871N1157J08730J15299k30371j32605K9751K4370o9493O5953
11561C695868m4342j08303n3125p1418M5717J40680J22226r0947R1874K9237k11531
11550C545936j48746K03410K15396l2134j16837j15661J01646L2118j785J05969
$$ y = [3965130, 4008429, 4135120, 4259036, 4193908, 4051114, 3948606, 3881488, 3895553, 4044071, 4055751, 4040269, 4007774, 4029645, 4086323, 4012737, 3995939, 3862801, 3857342, 3982223, 4109550, 4092599, 4064037, 4026408, 3938516, 3848693, 3820278, 3916119, 4041737, 3975106, 4010098, 3970246, 3894260, 3796780, 3886498, 4002859, 3932064, 3754657, 3695901, 3674904, 3801898, 3861045, 3871210, 3924839, 3936019, 3791600, 3698533, 3805659, 3722149, 3772667, 3766835, 3737771, 3754162, 3716407, 3636206, 3733077, 3784234, 3892964, 4008263, 3777892, 3645287, 3675038, 3699408, 3629915, 3695868, 3651526, 3543223, 3490098, 3418680, 3464397, 3605077, 3727303, 3636356, 3728230, 3757467, 3545936, 3397190, 3600600, 3815996, 3783862, 3667025, 3551364, 3653010, 3685128, 3683343, 3789312]
11540C789312l8434k41462j09518P6489N391J876m6280J1429N763M5396K171q6857
11528C415276K4576J960o1098m1622J00990j52506j68990k0081M6617J77117K20418
11517C542657J29216K5061l4430o771m784j50507R3503K00083j07471k95513q2374
11506C308670m0395k7429k5010K3230n4624l6969R3005k9711L3728J46718j36539
11495C254674j08315L4650k629R5862l7141j70671j1943p913m0977p8459j7700
11484B909438J32015K24628J8698j48219N3704J80528k3502j6989R703J5606m1108
11473C314502p2589m8362M3051K7099q4986o3800O1979N6539O2500j77868n5380
11462C062685o8758N0377k1980L5275J28611P880k1164R0390m4525J36385K3039
$$ y = [3789312, 3750878, 3509416, 3399898, 3476387, 3481778, 3483654, 3437374, 3448803, 3454566, 3499962, 3502133, 3415276, 3439852, 3441812, 3380714, 3339092, 3440082, 3287576, 3118586, 3098505, 3145122, 3322239, 3542657, 3671873, 3696934, 3662504, 3655733, 3650949, 3500442, 3593945, 3794028, 3686557, 3391044, 3308670, 3268275, 3240846, 3215836, 3239066, 3184442, 3147473, 3240478, 3210767, 3244495, 3391213, 3254674, 3146359, 3181009, 3178380, 3274242, 3237101, 3066430, 3054487, 3046574, 3005597, 2927138, 2909438, 3041453, 3266081, 3284779, 3136560, 3190264, 3370792, 3347290, 3330301, 3340004, 3355610, 3314502, 3241913, 3193551, 3236602, 3263701, 3178715, 3114915, 3176894, 3233433, 3295933, 3118065, 3062685, 2993927, 3044304, 3022324, 3057599, 3186210, 3194090, 3172926, 3263316, 3218791, 3355176, 3378215]
11451C378215j98898k89693r3868l8644R2699K18668N8790r8482o8035m9783j16443
11440B794526l275l54J34838K1124J12673L6853m3057O2094j03421P3355r4870
11429B990486j94873l5052J89707K6773J9201j212r3286j1368J0137L6303n2658
11418B884158k4345K3390J34700R2954P4835o6515j14697j0215r1558M5786n232
11407B943261j06695L9137P6473j9948q2611O760Q3796N3108J1721O7093p1144
11396C000951r5696l2214R5734q523m3304O5569O9967r0610O54O9873K2770q4055
11384B971116l9606l6598K318k2706o3105M5154P7159n3936j4203p802k65723
11373B592068O5608J19984N0580o797k4954R4324k1365J1619J10004j9899l3545
$$ y = [3378215, 3179317, 2889624, 2795756, 2757112, 2849811, 3068479, 3127269, 3028787, 2960752, 2910969, 2794526, 2791251, 2790897, 2925735, 2946859, 3059532, 3096385, 3053328, 3115422, 3012001, 3085356, 2990486, 2795613, 2760561, 2950268, 2977041, 2996242, 2995030, 2901744, 2890376, 2900513, 2936816, 2884158, 2859813, 2883203, 3017903, 3110857, 3185692, 3119177, 3004480, 2994265, 2902707, 2948493, 2943261, 2836566, 2875703, 2952176, 2932228, 2849617, 2856377, 2940173, 2993281, 3005002, 3072095, 3000951, 2905255, 2873041, 2968775, 2960252, 2916948, 2982517, 3052484, 2961874, 2962528, 3032401, 3055171, 2971116, 2931510, 2894912, 2897230, 2874524, 2811419, 2856573, 2933732, 2879796, 2865593, 2857791, 2592068, 2657676, 2777660, 2828240, 2821443, 2796489, 2890813, 2869448, 2881067, 2991071, 2971172, 2937627]
11362B937627l9416k20257j01872K4418J49577p4488j13491Q1874Q3191j5969
11352B711194J1268j31999r4782R1715K87913q099l07096l2787O5114J24317Q6381
11341B803139k4317j85124l6848K1623M6262M1976O5871m3415l2452J28695j9325
11330B766085o8744j07865p9627R3907M8958K9187j5330q4839k3409J3783J03130
11319B675236o5440J4839Q810r6545O8506M0676J46182n8399o3024J12751j08168
11308B675424m2466K6531l4151J4146q3051J41472o2868j23040N033j18501m873
11297B393656R8151o4417Q2401J41363l5378o5531m8604j0465P2751j82059j25257
11286B256611P1835J40830O8386j5555J2133l9067l666l5410o6441o4786j14366
$$ y = [2937627, 2898211, 2677954, 2576082, 2600500, 2750077, 2675589, 2562098, 2643972, 2727163, 2711194, 2722462, 2590463, 2495681, 2587396, 2875309, 2867210, 2560114, 2527327, 2592441, 2716758, 2803139, 2778822, 2593698, 2556850, 2578473, 2624735, 2666711, 2732582, 2689167, 2656715, 2785410, 2766085, 2697341, 2589476, 2509849, 2603756, 2652714, 2681901, 2666571, 2581732, 2558323, 2572106, 2675236, 2609796, 2624635, 2633445, 2536900, 2605406, 2646082, 2792264, 2733865, 2670841, 2783592, 2675424, 2632958, 2659489, 2625338, 2639484, 2556433, 2697905, 2635037, 2511997, 2517030, 2398529, 2393656, 2491807, 2427390, 2509791, 2651154, 2615776, 2550245, 2501641, 2491176, 2563927, 2381868, 2256611, 2328446, 2469276, 2537662, 2522107, 2534240, 2495173, 2491507, 2456097, 2389656, 2324870, 2210504]
11275B210504M4121m4992P2528J1401k4508N2186J37598j4521n6113J97068k0749
11264B564523j02796p8853o746J5196o7011n1067M6790j8661j12366j05079j00499
11253A983431L3128J251q917k4944R928M8705J61567N5085j53387R957M3433M6576
11241B205813P712P6955O1915M4226p3939j36814L3645Q9656q5107L50K3534J01340
11229B349286o6040J04130n0797J26014K4646o2173j04417j09592R1677m5636
11219B257098j28240n9191J44745j6355p1682P3280J07614m5729O2168J30142
11209B453850q7816o6991j70555R4866L21578L71770J14703j06429M2064L9716
11199C006756j20602j54297k12512j40067n9856j72202j43041n5066k0445J69172
$$ y = [2210504, 2254625, 2209633, 2282161, 2293562, 2269054, 2321240, 2458838, 2444317, 2388204, 2585272, 2564523, 2461727, 2382874, 2376128, 2391324, 2324313, 2273246, 2320036, 2301375, 2189009, 2083930, 1983431, 2016559, 2017810, 2008893, 1983949, 1993877, 2042582, 2204149, 2259234, 2105847, 2115804, 2159237, 2205813, 2213525, 2290480, 2352395, 2396621, 2322682, 2185868, 2219513, 2309169, 2224062, 2224412, 2247946, 2349286, 2283246, 2387376, 2336579, 2462593, 2487239, 2425066, 2320649, 2211057, 2302734, 2257098, 2128858, 2069667, 2214412, 2198057, 2126375, 2199655, 2307269, 2261540, 2323708, 2453850, 2366034, 2299043, 2128488, 2223354, 2544932, 2916702, 3031405, 2924976, 2967040, 3006756, 2886154, 2731857, 2519345, 2379278, 2319422, 2147220, 2004179, 1949113, 1928668, 2097840]
11189B097840R1525m5341m2629k1617j47611q1933J32670O2249j38155L8169J46081
11178B091248l586o3941R4604K41207J2043p1465r9652J5890J07753n5535J03250
11167B371816P2107j76354j68859j45382P7J50378K3790m9146j83623J53795K3029
11156B071628n3610N32r8401n0839l9897J06267L0524n3156J34107R513l1817
11145B024851r8027J6265Q5479p9108L2551j297n484L5246m7248j80374N3593
11134A836447r056M235R117J28747R7612J81506k5963k84847k11320R467J29237
11123A865182K52630J47093r2419K8300j10156p7332o108o4712J0798q9423q3289
11112A780564O7424N5388K47452J09395q7471j84227q128J7416o6207Q4456r9100
$$ y = [2097840, 2189365, 2144024, 2101395, 2079778, 1932167, 1850234, 1982904, 2045153, 1906998, 1945167, 2091248, 2087662, 2023721, 2118325, 2359532, 2371575, 2300110, 2200458, 2216348, 2324101, 2268566, 2371816, 2443923, 2267569, 2098710, 1953328, 1953405, 2103783, 2127573, 2078427, 1894804, 2048599, 2071628, 2018018, 2018550, 1920149, 1869310, 1829413, 1935680, 1966204, 1913048, 2047155, 2056668, 2024851, 1926824, 1943089, 2028568, 1949460, 1982011, 1980714, 1975230, 2010476, 1963228, 1782854, 1836447, 1827391, 1831626, 1840743, 1969490, 2067102, 2248608, 2222645, 1937798, 1726478, 1735945, 1865182, 2117812, 2264905, 2172486, 2200786, 2090630, 2013298, 2007190, 1942478, 1953276, 1863853, 1780564, 1847988, 1903376, 2150828, 2260223, 2172752, 1988525, 1980397, 1997813, 1931606, 2016062, 1916962]
11101A916962n3119k7088J1316J26443P3454l8717p6407k7642k8842j27328k2149
11090A726883n8360m3506J28715K7759l5714J3109J72389o8925N1678j6696j13363
11079A783969J6246N5859m1575j32555Q7288K48408Q686o4220j68089j00341J34095
11068A827771J93730r0503Q603J10955N6683l3728j28569j37234k4234j6090n5576
11057A711808P1550j0182J08027J80966L1515j42603K7195J07813k828q3679q3438
11046A916144J6393J04273J73557j6546j7130O9963J02552N8691k28814J02883
11036B281966Q7618j9225J18479J76135k17699j72638O0296k0759M2139k9175
11026B307137j5335j33034J63389L07162K38360K15702j53792k1441j42206j68302
$$ y = [1916962, 1863843, 1836755, 1848071, 1974514, 2047968, 2009251, 1932844, 1905202, 1876360, 1749032, 1726883, 1668523, 1625017, 1753732, 1781491, 1745777, 1758886, 1931275, 1862350, 1914028, 1897332, 1783969, 1800215, 1856074, 1814499, 1681944, 1769232, 2017640, 2026326, 1962106, 1794017, 1693676, 1827771, 2021501, 1930998, 1939601, 2050556, 2107239, 2073511, 1944942, 1807708, 1783474, 1767384, 1711808, 1783358, 1773176, 1881203, 2062169, 2093684, 1951081, 1978276, 2086089, 2083261, 1999582, 1916144, 1932537, 2036810, 2210367, 2193821, 2176691, 2246654, 2349206, 2407897, 2179083, 2281966, 2369584, 2350359, 2468838, 2644973, 2427274, 2254636, 2314932, 2294173, 2336312, 2307137, 2291802, 2158768, 2322157, 2629319, 2867679, 3083381, 2929589, 2908148, 2765942, 2597640]
11016B597640M2007n459J3252J80678n0397j15682o5454j19094j27905L2813j03897
11005B278502j085j21385l22061J96598J14844Q0837Q4025J3323m8668k2138P8964
10994B331756P6213p4176k53843j21370K15018Q4041k47274l36556N6702J13444
10984A843955J65429p714l9179j73865n9257K41600R2386j26780p2223q8916k21729
10973A553707p5947M0679J22130J6566n5802n5923n5M9111j8640j28899J16264
10962A563191R6517J17195R4103R2388M0772p310P2278N3883J21864O7962n1817
10951B261026m9081Q724j89303r6093J17119O3996P8021l2487n4282j10197j01427
10940A896016q0772k8096J2937l8579j35722Q3838P9837Q1j74632L0948J64851
$$ y = [2597640, 2639647, 2634188, 2647440, 2828118, 2777721, 2662039, 2596585, 2477491, 2349586, 2382399, 2278502, 2277417, 2156032, 1833971, 2030569, 2145413, 2226250, 2310275, 2323598, 2274930, 2252792, 2331756, 2407969, 2333793, 2079950, 1958580, 2173598, 2257639, 2010365, 1673809, 1730511, 1843955, 2009384, 2001670, 1962491, 1788626, 1729369, 1970969, 2063355, 1936575, 1864352, 1775436, 1553707, 1477760, 1518439, 1640569, 1657135, 1601333, 1545410, 1545355, 1594466, 1575826, 1446927, 1563191, 1659708, 1776903, 1871006, 1963394, 2004166, 1996856, 2069134, 2123017, 2244881, 2312843, 2261026, 2211945, 2220669, 2031366, 1935273, 2052392, 2116388, 2194409, 2161922, 2107640, 1997443, 1896016, 1815244, 1787148, 1800085, 1761506, 1625784, 1709622, 1789459, 1789540, 1614908, 1645856, 1810707]
10929A810707j61614o1424K8308J28481N2973J24317j8659j25194r4723O7637
10919A750809j8349P681K7024l4315k6937o3785P8098J17987J649m6735k4283
10908A768844o4123j68430J8613n5451j76895J60413K65620J01193j17989j48471
10898A583324P0877J06964M3641J2395l5219n1174J1114L5071p1079q3520P4709
10887A697103m80K35214P8255j61785J167o6974k8652o1515q7343M0550J09372
10876A754912j716N4506N5552o3299p9474l3271J6957M4152n5507o4712R1777
10865A719877R755J34452R4707q778p4037o2058q8873m6236L2285N0692R0535
10854A852321j52M0091J08921l0638L5591l4434q228J10592J63291m6304m9450
$$ y = [1810707, 1649093, 1587669, 1615977, 1744458, 1797431, 1921748, 1903089, 1777895, 1683172, 1750809, 1732460, 1740141, 1767165, 1732850, 1705913, 1642128, 1720226, 1838213, 1839862, 1793127, 1768844, 1704721, 1536291, 1554904, 1499453, 1322558, 1482971, 1748591, 1849784, 1731795, 1583324, 1654201, 1761165, 1804806, 1817201, 1781982, 1730808, 1741922, 1776993, 1705914, 1622394, 1697103, 1696623, 1931837, 2010092, 1848307, 1849474, 1782500, 1753848, 1692333, 1604990, 1645540, 1754912, 1753196, 1807702, 1863254, 1799955, 1720481, 1687210, 1704167, 1748319, 1692812, 1628100, 1719877, 1729632, 1864084, 1958791, 1950013, 1875976, 1813918, 1725045, 1678809, 1711094, 1761786, 1852321, 1852169, 1892260, 2001181, 1970543, 2006134, 1971700, 1963472, 2074064, 2237355, 2191051, 2141601]
10843B141601Q036J06289j87290j66941j68099P650n1324p1759R2147J25857l1706
10832A804461j97480k6358O0740R7419O5796Q7917J6647r4275p590j14073k1202
10821A672002m8820J31552r793j74957L2108M3326R4385K4656k6559J9894j78899
10810A578895o5526R0578j33390K233l5780P9260Q8235j4373J08458L5285O3710
10799A797585R9109m7697k5056o3813l1268o557p2161J21299K0907M4408N9183
10788A895939O8906J35127L1307p984J72309L50800J94731K33846K66565J48755
10778C490301J29050M604k21258q09M7184m3973j56231k75668j44373j37175M8606
10767B740258j10211k05115k32496J6420L2092j4657o882P9591J4015j23985k46804
$$ y = [2141601, 2149637, 2255926, 2068636, 1901695, 1733596, 1741246, 1689922, 1618163, 1710310, 1836167, 1804461, 1606981, 1580623, 1641363, 1738782, 1804578, 1892495, 1909142, 1814867, 1807277, 1693204, 1672002, 1623182, 1754734, 1744941, 1569984, 1602092, 1645418, 1739803, 1764459, 1737900, 1757794, 1578895, 1513369, 1603947, 1470557, 1472790, 1437010, 1516270, 1604505, 1590132, 1698590, 1733875, 1797585, 1896694, 1848997, 1823941, 1760128, 1728860, 1722303, 1650142, 1771441, 1792348, 1836756, 1895939, 1964845, 2099972, 2131279, 2123295, 2295604, 2646404, 2841135, 3074981, 3341546, 3490301, 3619351, 3623955, 3402697, 3401888, 3449072, 3405099, 3248868, 2973200, 2828827, 2691652, 2740258, 2630047, 2424932, 2192436, 2208856, 2240948, 2226291, 2219409, 2299000, 2313015, 2189030, 1942226]
10756A942226o7500K12272K35648N2386j28567j64851l4721L6450n635n8341n7230
10745A962137k6974j22417O5988K50351M7490M877J36581m7795j1236M5394O0947
10734B365343L2828K2291o5274j39281j22076l4300L1716J31954M8734j02849
10724B169086j18446r4435J08707P0125o2524O8298J28878L6095j58860l8333
10714B108591J26510L1704J04413J4616l6865j29954L3926n4634j39905n8550
10704A999852J26986J65178J30226P856O021M9465m4742R387J99122J00416o0331
10693B689436n5772Q5306J48826J0229o9905j10444J86894R5657O5317k2207j70822
10682B852515k9377M2026J08917J18982l4973O8697n1096O344J0111J6191R2547
$$ y = [1942226, 1874726, 2086998, 2322646, 2375032, 2246465, 2081614, 2046893, 2083343, 2077708, 2019367, 1962137, 1935163, 1812746, 1878734, 2129085, 2176575, 2181452, 2318033, 2270238, 2259002, 2304396, 2365343, 2398171, 2420462, 2355188, 2215907, 2093831, 2059531, 2091247, 2223201, 2271935, 2169086, 2050640, 1956205, 2064912, 2135037, 2072513, 2140811, 2269689, 2305784, 2146924, 2108591, 2235101, 2266805, 2371218, 2385834, 2348969, 2219015, 2252941, 2198307, 2058402, 1999852, 2126838, 2292016, 2422242, 2430098, 2436119, 2485584, 2440842, 2450229, 2649351, 2749767, 2689436, 2633664, 2718970, 2867796, 2878025, 2808120, 2697676, 2884570, 2980227, 3045544, 3023337, 2852515, 2823138, 2865164, 2974081, 3093063, 3058090, 3126787, 3075691, 3082035, 3092146, 3108337, 3200884]
10671C200884k3226O2085L0369K26303J26652m5393l3027M5541R5076M3003K31148
10660C959415J32685J3284J13284J0905n8996l0977K5901Q9054Q4268J90053J55055
10649D683931K1502j5415m6818R1969m954J87347m421K8975K08922L84208J78697
10638E713943J08134K73179L85481L66826L93475K65014L45797M84354M32290
10629H768493K82938M40281O68433R09186J121241J503475K078365K418339L285334
10620B1476085M280699N325979O472283O882212O646727N085168K832437P48310
10612E9749900K88848P40989K034820L728446O250381R295207J1784862J3120863
10604A06994316J1569150P406300J944394k714190m679317l833927j157095K759019
$$ y = [3200884, 3177658, 3239743, 3270112, 3496415, 3623067, 3577674, 3544647, 3590188, 3685264, 3728267, 3959415, 4092100, 4105384, 4218668, 4229573, 4170577, 4139600, 4165501, 4254555, 4338823, 4528876, 4683931, 4705433, 4690018, 4643200, 4735169, 4730215, 4917562, 4913141, 4942116, 5151038, 5535246, 5713943, 5822077, 6095256, 6480737, 6847563, 7241038, 7506052, 7851849, 8336203, 8768493, 9051431, 9491712, 10160145, 11069331, 12190572, 13694047, 15772412, 18190751, 21476085, 25756784, 31082763, 37555046, 44437258, 51083985, 56169153, 59001590, 59749900, 60038748, 60779737, 62814557, 66543003, 72793384, 82088591, 93873453, 106994316, 118563466, 125969766, 127914160, 125199970, 120520653, 116686726, 115529631, 118288650]
10596A18288650O995886J1160940J4608646J5420148J2204952N260430l225082
10589A80714570r850339j2549185j1363925p888915l709454J97435L626256O101596
10581A45278039O675403M003877n40255o069111j0217686j1510787j0213217p513519
10573A09892744m866615k508543j023913J49615M28349q20935k845929n006560
10565I3398213o532092o773900o171598n325917m629786l590262l039602l016331
10557E4318725k447486k090734j670752j770505j734116j760760j735256j530970
10549C9578146j333217j260905j234548j323888j435799j370082j192697j114744
10541B9312266j194951j097640r91944r48551q69264j005113r42402r11891q64418
$$ y = [118288650, 125284536, 136445476, 151054122, 166474270, 178679222, 183939652, 180714570, 170864231, 158315046, 146951121, 139062206, 135352752, 135550187, 139176443, 145278039, 151953442, 155957319, 155417064, 149347953, 139130267, 127619480, 117406263, 109892744, 105026129, 102517586, 101493673, 101643288, 102071637, 101250702, 98404773, 93398213, 86866121, 80092221, 73920623, 68594706, 63964920, 60374658, 57335056, 54318725, 51871239, 49780505, 48109753, 46339248, 44605132, 42844372, 41109116, 39578146, 38244929, 36984024, 35749476, 34425588, 32989789, 31619707, 30427010, 29312266, 28117315, 27019675, 26027731, 25079180, 24209916, 23204803, 22262401, 21350510, 20486092]
10532B0486092q49152r18804r64873p72664n73235p18990p41397p32749p41987
10523A3472241m57654o07235o99960o75933m07045l68973m10651k51996l16470
10514I276324k95387j44885j18386k55240k81763l78553k40954k42873j81509
10505G136774l56263l89249j03309j03707J2161j28148j51937k63860k39425m31
10495E412606j96788m31757k61600j26988o2716J9567j8817R2255j13497n0579
10485D261686r9078q6722L2529R1026L4987M3810p3543j9360N2411L8286O4911
10474D340943J22292r266p6526j33220J52573J72504p2100q6962R5861J21776
10464D627875R6028O9904J3575J56578K04029J97168J82263J87137M1300P3411
$$ y = [20486092, 19636940, 18718136, 17753263, 16980599, 16407364, 15688374, 14946977, 14214228, 13472241, 13014587, 12407352, 11707392, 11031459, 10624414, 10255441, 9844790, 9592794, 9276324, 8980937, 8836052, 8717666, 8462426, 8180663, 7802110, 7561156, 7318283, 7136774, 6780511, 6391262, 6287953, 6184246, 6196407, 6068259, 5916322, 5652462, 5413037, 5412606, 5215818, 4784061, 4522461, 4395473, 4332757, 4352324, 4333507, 4425762, 4312265, 4261686, 4162608, 4075886, 4108415, 4199441, 4234428, 4278238, 4204695, 4185335, 4237746, 4276032, 4340943, 4463235, 4453969, 4377443, 4244223, 4396796, 4569300, 4497200, 4410238, 4506099, 4627875, 4723903, 4793807, 4807382, 4963960, 5167989, 5365157, 5547420, 5734557, 5775857, 5849268]
10454E849268P0494J9408k1622P7157J12279P7500J87028M2639O0851j269J38431
10443F612164J70071N9836K06007J40442p101Q0335J64067J69887K29680L61851
10433H187239K96783K38251J67407J55250R2060K32082L87112K51597R7068L04194
10423A0409043K18919L25535M00499L13461M66507M12842L94798K86813K84696
10414A3513113N21335O55297N20550N17014P50379P28902Q92104J016720J281772
10405B0397186J307192J590993J739644K023204K132588K427581K730842L178050
10397C7527280L650283M391065N027187O192543P549017R088602J1274263J4081996
10389I8782236J7700737K1706916K6147037L0325436L3507498L4947312L4539995
$$ y = [5849268, 5919762, 5939170, 5917548, 5994705, 6106984, 6184484, 6371512, 6414151, 6475002, 6473733, 6612164, 6782235, 6842071, 7048078, 7188520, 7181419, 7261754, 7425821, 7595708, 7825388, 8187239, 8484022, 8722273, 8889680, 9044930, 9136990, 9369072, 9756184, 10007781, 10104849, 10409043, 10627962, 10953497, 11353996, 11667457, 12133964, 12546806, 12941604, 13228417, 13513113, 14034448, 14689745, 15210295, 15727309, 16477688, 17206590, 18098694, 19115414, 20397186, 21704378, 23295371, 25035015, 27058219, 29190807, 31618388, 34349230, 37527280, 41177563, 45568628, 50595815, 56788358, 64337375, 73425977, 84700240, 98782236, 116482973, 138189889, 164336926, 194662362, 228169860, 263117172, 297657167]
10382B97657167L2019852K7267180K0514467J1963637K741116o650500j4983499
10375C70529420k1283063k5671647k8145575k8628315k7371835k4888515k1393862
10368A93146608j8003704j4917523j1941760r908717q271578o968016n919521
10361A17215789n238374m509141m028310l713617l524179k945313k581811k195485
10353H8479559j867229j570791j463620j344012j149386j324831j319616j310211
10345G7129863j373250j456362j640545j692561j713484j889506k021016k128442
10337F3214697k353148k552750k583962k425379k484454k538531k701449k384543
10329D3190481k393341k121802k130811k035828j651150j665170j827387j407788
$$ y = [297657167, 329677019, 356944199, 377458666, 389422303, 392163419, 385512919, 370529420, 349246357, 323574710, 295429135, 266800820, 239428985, 214540470, 193146608, 175142904, 160225381, 148283621, 138374904, 130103326, 123135310, 117215789, 111977415, 107468274, 103439964, 99726347, 96202168, 93256855, 90675044, 88479559, 86612330, 85041539, 83577919, 82233907, 81084521, 79759690, 78440074, 77129863, 75756613, 74300251, 72659706, 70967145, 69253661, 67364155, 65343139, 63214697, 60861549, 58308799, 55724837, 53299458, 50815004, 48276473, 45575024, 43190481, 40797140, 38675338, 36544527, 34508699, 32857549, 31192379, 29364992, 27957204]
10321B7957204j211658j188469j076325j016635j149551q94131p40421q84148
10313A9795866r06817p50275q48166o88749p74642n61495o73788o13882m88520
10304A3489532m61867m98520m77182m64732n12104k95066l99211l25490l08487
10295I746873m66148m50653m05854l33246l12489j87462j83316k41864l88301
10286F777540k21161k16266k17675k92593j63934J4625r9877k571k28202l52306
10276D997580K108L6921J54400N7623K29896K71188M1401K71925K57285m3018
10266F277309J06863j1440l00093k85272l31434q1866j95358l41607l13944l94357
10256D128801k71770j34631j76274L2238O926r7809j19946l90016l06805o5687
$$ y = [27957204, 26745546, 25557077, 24480752, 23464117, 22314566, 21420435, 20680014, 19795866, 18889049, 18138774, 17290608, 16601859, 15827217, 15265722, 14591934, 13978052, 13489532, 13027665, 12529145, 12051963, 11587231, 11075127, 10780061, 10380850, 10055360, 9746873, 9280725, 8830072, 8424218, 8090972, 7778483, 7591021, 7407705, 7165841, 6777540, 6556379, 6340113, 6122438, 5829845, 5665911, 5680536, 5580659, 5578088, 5349886, 4997580, 4999688, 5036609, 5191009, 5248632, 5478528, 5749716, 5791117, 6063042, 6320327, 6277309, 6384172, 6372732, 6072639, 5787367, 5455933, 5374067, 5178709, 4837102, 4523158, 4128801, 3857031, 3722400, 3546126, 3578364, 3585290, 3487481, 3367535, 2977519, 2670714, 2605027]
10246B605027L2406j04979j06118n6376j11654n7978j5132J0414k02825J53238
10236B146023N6320j21769j41815r8317M0034P2205J826L1279m5849L5182N0354
10225B025473r2164L91L705J38937J28953J22464K44421J09444j16082O2775J67778
10214B796095L1970m1940M2050P5945j15495K0486j06671q3312J47243O1391n1293
10203B776469j54115J8564J01957J20496m3683j01624q8812R6133Q5870R5281
10193B906536j24832l9672r217j08561j25307M2738K5842M3928J04927K9960j12619
10182B633723P193L8739P5072O3900L5831l6693j91364P626n3730M4353p0440
10171B554210N6504k6133l5471J28351J59492J20758j65019j62743j65985m7907
$$ y = [2605027, 2637433, 2532454, 2426336, 2369960, 2258306, 2200328, 2185196, 2195610, 1992785, 2146023, 2202343, 2080574, 1938759, 1840442, 1880476, 1952681, 1954507, 1985786, 1939937, 1975119, 2025473, 1933309, 1933700, 1937405, 2076342, 2205295, 2327759, 2572180, 2681624, 2565542, 2628317, 2796095, 2828065, 2786125, 2828175, 2904120, 2788625, 2809111, 2702440, 2619128, 2766371, 2827762, 2776469, 2622354, 2640918, 2742875, 2863371, 2819688, 2718064, 2629252, 2725385, 2811255, 2906536, 2781704, 2742032, 2732815, 2624254, 2498947, 2541685, 2567527, 2611455, 2716382, 2746342, 2633723, 2640916, 2679655, 2754727, 2818627, 2854458, 2817765, 2626401, 2634027, 2580297, 2624650, 2554210, 2610714, 2584581, 2549110, 2677461, 2836953, 2957711, 2792692, 2629949, 2463964, 2416057]
10161B416057j02289J37501Q0199j0359J71044J31093J90840m6311k00432p5887
10151B691456k50057o3665J22839p5596q2311L8044j75794o8745J4422J05604
10141B256197R0991l7766r1162r9648j49354j01454L6549J75150O1464j1812r7032
10130B032123j1170R8252J96462l6166j77816m2253j13601k27406K0949j67838
10120A571536o7641j1442o2125k8579K29582M1133j30997j22608j28126p3820
10110A216913P238o7483Q5758J77937j16839j73281J955j33386k252J33777q0271
10099A050066j19882J85067n0058l3786P3487r1508o0481N3775j2348Q0900l8382
10088A036850k32587j27012m4753J8064L3934J76858J13634j57629j85539J1575
$$ y = [2416057, 2313768, 2451269, 2531468, 2521109, 2692153, 2823246, 3014086, 2967775, 2767343, 2691456, 2441399, 2377734, 2500573, 2424977, 2342666, 2380710, 2204916, 2136171, 2150593, 2256197, 2347188, 2309422, 2218260, 2118612, 1969258, 1867804, 1904353, 2079503, 2140967, 2129155, 2032123, 2020953, 2119205, 2315667, 2279501, 2101685, 2059432, 1945831, 1718425, 1739374, 1571536, 1503895, 1492453, 1430328, 1401749, 1631331, 1672464, 1541467, 1418859, 1290733, 1216913, 1224151, 1156668, 1242426, 1420363, 1303524, 1130243, 1132198, 998812, 996560, 1130337, 1050066, 930184, 1115251, 1065193, 1031407, 1104894, 1013386, 952905, 1006680, 994332, 1075232, 1036850, 804263, 677251, 632498, 650562, 684496, 861354, 974988, 817359, 631820, 643395]
10078F43395M2975J40523J02400j86972j21625p9879J48597J99143N3077j99194
10068G42440n0952Q1049l4377L8634Q255o286l1855L3483J97124o7715q5094P3518
10056H98224j8507r7546L8951Q7260r3575l6939J41755j54395j57383r294J0565
10045F09116p3900l8126J39632K40692R7192m9663K3066o6684j34215L5012J54789
10034I36911J66724o5503o3296l8892j33280j1139m3580K9938K3550j17330p2745
10023F11358L8199J30330J83045O7316K4986l9897j28372j07409J17239Q034J3124
10012I17953l4605M7646P775Qj27526j27924l1826k2074N2947M952o2134n7884
10000E67308j11583J98420J53494M1580M6457P5265J17223j23945o2518M3160
$$ y = [643395, 686370, 826893, 929293, 742321, 620696, 540817, 689414, 888557, 941634, 742440, 691488, 772537, 738160, 776794, 785049, 778763, 746908, 780391, 977515, 909800, 824706, 898224, 879717, 782171, 821122, 908382, 814807, 777868, 919623, 765228, 607845, 598551, 609116, 535216, 497090, 636722, 877414, 974606, 924943, 948009, 881325, 747110, 782122, 936911, 1103635, 1038132, 974836, 935944, 802664, 791525, 747945, 777883, 801433, 684103, 611358, 649557, 779887, 962932, 1030248, 1055234, 1015337, 886965, 779556, 896795, 904829, 917953, 883348, 930994, 938769, 938777, 811251, 683327, 651501, 629427, 682374, 687326, 625192, 567308, 455725, 654145, 807639, 849219, 895676, 970941, 1088164, 964219, 901701, 944861]
9990I44861k1334J13482l9238J02748O4285q8121J91017K82917r684J01643K68601
9979A911177J73049J06598P9513J8322j3361k3618n2367j69586q7485o1119J61751
9968B042874k3031l08494k67646j04600n7709n7142o5352j00721j1817j51405
9958H94957n7418R7226m5909j7407N6050R4155R7015j33625O1066N5141j76991
9947I24260j25013o0621P6975J10856L5017P6160p2574j41732o2897J2803L9798
9936H13032q6972p8346p0367q2060K926R0161J16067N1021j49349Q226J00734
9925G15073j14044p7512Q6037O8604j64771o0998j2241q4839r3591K9155K41597
9914E32470M4297n6074J3155O7368l8991j07041m1179j8820Q8184K46097R0207
$$ y = [944861, 923527, 1037009, 997771, 1100519, 1164804, 1076683, 1267700, 1550617, 1540933, 1642576, 1911177, 2084226, 2190824, 2270337, 2288659, 2275298, 2251680, 2199313, 2029727, 1942242, 1881123, 2042874, 2019843, 1711349, 1443703, 1339103, 1281394, 1224252, 1158900, 1058179, 1046362, 894957, 837539, 934765, 888856, 871449, 927499, 1021654, 1118669, 985044, 1046110, 1101251, 924260, 799247, 738626, 815601, 926457, 961474, 1037634, 965060, 823328, 760431, 773234, 813032, 726060, 647714, 577347, 495287, 498213, 588374, 704441, 755462, 606113, 614339, 715073, 601029, 523517, 609554, 678158, 513387, 452389, 440148, 355309, 261718, 290873, 532470, 576767, 520693, 533848, 601216, 562225, 455184, 414005, 395185, 483369, 729466, 819673]
9903H19673k01476q7100J50614P5530L21185J03804q5153o1117m8320j56290j88834
9892F42516j16460M0885k0011j17635J5837J22070j01833j64138J43064P9111
9882E23406R7599j871r1172L2158j0763p7538J3810o6772j65332j2845P9727k995
9870C17412R8073N6437J58434J4185k17535j1994j35637J12432R7848j5218M7859
9859E22296m1764j47224j57065Q8520J57239M3621j24256j35847Q2961K6939N1278
9848C66698r918M067K3516K38895J00187k00706j73111k9575k16816n1812P7270
9837A28695J14117R7262O1907J54693q5550q5701n9923J47362q191j23616q2175
9826B58880N7631j9125J18357r6957K0668P1309r7340Q5915k0625r2222J14228
$$ y = [819673, 618197, 531097, 681711, 757241, 1078426, 1182230, 1097077, 1035960, 987640, 831350, 642516, 526056, 566941, 546930, 429295, 445132, 567202, 465369, 301231, 444295, 523406, 621005, 619134, 527962, 560120, 549357, 471819, 485629, 418857, 253525, 240680, 320407, 317412, 415485, 471922, 630356, 644541, 427006, 415012, 279375, 391807, 489655, 474437, 522296, 480532, 333308, 176243, 264763, 422002, 465623, 341367, 205520, 288481, 315420, 366698, 356780, 360847, 384363, 623258, 723445, 522739, 349628, 320053, 103237, 51425, 128695, 242812, 340074, 401981, 556674, 471124, 385423, 325500, 472862, 464671, 341055, 258880, 316511, 297386, 415743, 318786, 339454, 410763, 313423, 399338, 378713, 286491, 400719]
9815D00719K13261j15834p5074k8934j72611R9446O4873K6466K9401k9943j3181
9804C98589J7976J92348k8278q4623n1662R5175M7577p6509j29426j05952n9958
9793B15257k5283k8774J47273M2952Q3974o3314q839J03364J16056j3563k02459
9782C66644j7117J39884N0276J4641q712o7426R398R0146m739m7983m6316j4348
9770D64348J18857L5642J905k14469r9649k7684o221l7919M3723J19636j06184
9759B91985k8000J41262J45131k0340j29846n6212J95999K7065j91762K5006m9375
9748C50913r6802l0741J85075Q3156L6358l2270q9214j88601j60017m6509M7962
9737E9310L8575L9372J71741Q3123o6916j06027j21131J13928J19592o4799J06005
$$ y = [400719, 613980, 498146, 423072, 394138, 221527, 320973, 385846, 412312, 441713, 411770, 398589, 416565, 608913, 580635, 496012, 444350, 539525, 587102, 510593, 381167, 275215, 215257, 189974, 161200, 308473, 351425, 435399, 372085, 363246, 466610, 582666, 569103, 366644, 349527, 489411, 539687, 554328, 545616, 478190, 487588, 577734, 572995, 525012, 478696, 464348, 583205, 618847, 620752, 406283, 306634, 278950, 272729, 234810, 278533, 398169, 291985, 263985, 405247, 550378, 530038, 400192, 343980, 539979, 567044, 375282, 400288, 350913, 254111, 223370, 408445, 491601, 527959, 495689, 406475, 217874, 57857, 11348, 59310, 97885, 137257, 308998, 392121, 325205, 219178, 98047, 211975, 331567, 266768, 372773]
9726C72773K1670j47801j34856q5790J10057J06977P2776J99008o2619j51984
9716C00211k11532j00294O6187J46834J8580L6929m2139M194n2428o4889N0254
9705A51907M3050Q148K4584P3448j23959r2398Q5796J13917j32400Q9068j12420
9694A28741j00873J003P2256o7872q5481J84305J48208K685p3393r593j76791
9683B3195m6621R6331J21361R8314l3398j21625n3170P771O7139l6339J06481
9672B29439J01831K6515O6530l6201O2144J8796k06245j00048j25145N8360J34991
9661B30967p651k7170M5356K42908J73785J43129L5360k04840j47091J03871K651
9650E91275j60388j76247L9475Q6265r6167n0612L4828l584k9931J58117J05310
$$ y = [372773, 394443, 246642, 111786, 25996, 136053, 243030, 315806, 514814, 452195, 300211, 88679, -11615, 54572, 201406, 219986, 256915, 214776, 218970, 166542, 101653, 151907, 194957, 203105, 227689, 301137, 177178, 84780, 170576, 284493, 152093, 241161, 128741, 27868, 28871, 101127, 33255, -52226, 132079, 280287, 282972, 209579, 199986, 23195, -23426, 72905, 194266, 292580, 259182, 137557, 84387, 92158, 159297, 122958, 229439, 331270, 357785, 424315, 388114, 450258, 469054, 262809, 162761, 37616, 95976, 230967, 223316, 196146, 241502, 484410, 658195, 801324, 836684, 631844, 484753, 588624, 591275, 430887, 254640, 294115, 380380, 284213, 233601, 268429, 264845, 234914, 393031, 498341]
9639D98341m5442q8102L8711N241j09472P0712q9360j46364J10129M5148k9258
9628B60284R0700m409j54459j3070K4241J4640J41277j6667j44429n8263K9027
9617A68872J2727J03006j8851j27135O1656J33003M0810n9523j22788l0010l5694
9606A26073p4814J00521R6287m113K7630r4772r3504j0965J01884J06666N3089
9595C33982J8181l0030q594o8405j15672Q7331J35997j10182j17777j61361j21246
9584a57776q0552J29716J78143J0019Q8874N4296o6793n8384O4325l4214M6000
9573A73654K38250j7960k31153j01226j23534j7242R7740J11440J82949J71531
9563D84449R9465j28989n8566J25258j7427q1804q4525o7562l1946J5375j5565
$$ y = [498341, 452899, 364797, 403508, 408749, 299277, 369989, 280629, 134265, 244394, 289542, 260284, 350984, 346575, 192116, 179046, 203287, 217927, 359204, 342537, 198108, 139845, 168872, 181599, 284605, 265754, 138619, 200275, 333278, 374088, 314565, 191777, 161767, 126073, 51259, 151780, 248067, 243954, 271584, 176812, 83308, 72343, 174227, 280893, 333982, 352163, 322133, 313539, 245134, 129462, 216793, 352790, 242608, 124831, -36530, -157776, -238328, -108612, 69531, 79550, 168424, 222720, 155927, 97543, 161868, 127654, 173654, 411904, 393944, 162791, 61565, -61969, -79211, 18529, 129969, 312918, 484449, 583914, 454925, 396359, 521617, 504190, 422386, 337861, 270299, 238353, 253728, 238163]
9552B38163l4891J5640m92m9538p2386o521L8597r820O7195O1891j4091J8632
9540B52379p8323j11545m9340J11233m7808r8910o0418O0469J11361J23061M8010
9529B60169p8015j13514P0773O4580R0913N4214J12970M5835o3055j59040P785
9518B93615j33515j46969O7373J23029J03810J60021J4895j53044j71009M4642
9508B02848M7371J49261j0124j32728j55393L988J39442l29320l8853K68420j15700
9497B9212j20709J3624J53785J14740l8772j35053l3656Q0285K5254o2651K19908
9486B45967Q6285L9927M4647o6790j2355K9622p4705k18610k15357R7666L2120
9475a1583o0535p618M7423j4155J5567r293n9958J59337P1045J00695O6662m8668
$$ y = [238163, 203272, 218912, 218420, 168882, 96496, 89975, 128572, 118752, 185947, 247838, 233747, 252379, 174056, 62511, 13171, 124404, 76596, -22314, -82732, -22263, 89098, 212159, 260169, 182154, 68640, 139413, 203993, 294906, 349120, 462090, 507925, 444870, 285830, 293615, 160100, 13131, 80504, 203533, 307343, 467364, 482259, 329215, 158206, 202848, 250219, 399480, 389356, 256628, 101235, 105223, 244665, -84655, -123508, 144912, 29212, -91497, -77873, 75912, 190652, 151880, 16827, -16829, 63456, 88710, 26059, 245967, 332252, 372179, 416826, 350036, 337681, 367303, 292598, 73988, -141369, -43703, -11583, -72118, -79736, -32313, -46468, -30901, -40194, -100152, 59185, 130230, 230925, 297587, 248919]
9463B48919j44483l2531p9412Q1674N8593R0995n6928l3416j04087m8824J80197
9452A60697O5834j54553q9178l77J3653J86938L8491q0453j09887J12481J78332
9441C21978p9362N8738q5785j06481m8145K00172K01138q8538l313M1096j32374
9430B79124k90116r6665Q9239O4449N754L8926K6399Q5954n0690n1595Q1490j61546
9418B0723J05608Q7197K4580M4260M7924J53868O4651j39763j20717l4104M478
9407B58705o7063J08248j46990r2582o3102r0886m5313J777J39282K7119N2481
9396H1676J03635Q8761J11562j4983p1597K9860p6229p3033m7674O6070j76832
9385B1216k18475j2378Q462J7236o4238J86331N3106K60645K88528o5928j44390
$$ y = [248919, 104436, 71905, -7507, 74167, 132760, 223755, 166827, 133411, 29324, -19500, 160697, 226531, 71978, -17200, -17577, -3924, 183014, 221505, 141052, 31165, 143646, 321978, 242616, 301354, 215569, 109088, 60943, 261115, 462253, 373715, 370402, 411498, 279124, -10992, -107657, -18418, 46031, 51785, 90711, 117110, 203064, 152374, 100779, 182269, 20723, 126331, 213528, 238108, 282368, 330292, 484160, 548811, 409048, 288331, 254227, 258705, 191642, 299890, 152900, 60318, -2784, -93670, -138983, -137206, 2076, 29195, 81676, 185311, 274072, 385634, 370651, 299054, 328914, 252685, 179652, 131978, 198048, 21216, -197259, -209637, -201175, -183939, -248177, -61846, -8740, 251905, 540433, 474505, 330115]
9374C30115k50437o3843J63896O4602l9173p4272Q632j5958N877o8669j3285l8841
9362H644J21468N8033n7726K8608K1487j59405L6131J0328N7207J27785N7419
9351C09979j22350j16816Q7844J15230Q6778K1156j16590j2681P0820L6322n8767
9340C00925K121j18922L1279M8868j0129n2698l8011o6143j60818J86959J29981
9329B53412p210m8048O5886P7848j47783J1456k4045k1622M4717q4762P3321M3119
9317B36289k4979k0626j74648j9805P0546l6483r3408J23383J18976n5858j90340
9306f6953J59632M7837k5230o8508k5162j23381n67o8114j2704O3949R6680J84808
9294A62287o7751j11769j12089j8226J32408R4772J21512j55664j12982N3272
$$ y = [330115, 79678, 15835, 179731, 244333, 205160, 130888, 139520, 123562, 129439, 60770, 47485, 8644, 130112, 188145, 130419, 159027, 180514, 21109, 57240, 67568, 124775, 252560, 309979, 187629, 70813, 158657, 273887, 360665, 381821, 265231, 252550, 323370, 359692, 300925, 303046, 184124, 215403, 264271, 254142, 201444, 163433, 97290, -63528, 123431, 253412, 246202, 198154, 264040, 341888, 194105, 205561, 181516, 159894, 204611, 119849, 193170, 236289, 211310, 190684, 16036, -3769, 66777, 30294, -63114, 60269, 179245, 123387, -66953, 92679, 140516, 115286, 46778, 21616, -101765, -102332, -170446, -183150, -119201, -22521, 162287, 94536, -17233, -129322, -147548, -15140, 79632, 201144, 45480, -67502, -14230]
9284a4230O8280o0056n3154n767K4546M5403L9042p6126J20941L9673M6993j646
9272A73899j0681j19673o6306n648Q4380k0959j94617o0125K05165K49684N290
9261B40409j36381j31589R7930K6443q3845j21815Q5956N7084J3277j18273j421
9250g2225J63062R185p5116j66637o7522K20850m8373j5510R9647j28007P614
9239g3032M7200n3718R7176J71780o4765m1922Q2427j64891J28204J16725m2304
9228B02880L1595O0263l0361n9351q6935j7682j02979j30336J7132J86009J15603
9217A85838j45861l3567J12885j15184P8599J58905L3084K6556l5436j54936M1304
9206A52187O5446j17156j04074L6049J92398M2716k5633j53408o6986J1016j31043
$$ y = [-14230, 54050, -6006, -59160, -64927, -40381, 5022, 44064, -32062, 88879, 128552, 175545, 173899, 163218, 43545, -22761, -28409, 55971, 35012, -159605, -219730, -14565, 235119, 240409, 104028, -27561, 70369, 96812, 12967, -108848, -22892, 34192, 47469, -70804, -72225, 90837, 100022, 24906, -141731, -209253, 11597, -36776, -52286, 47361, -80646, -73032, -25832, -79550, 17626, 189406, 124641, 82719, 165146, 255, 128459, 245184, 202880, 234475, 294738, 264377, 205026, 118091, 100409, -2570, -132906, -115774, 70235, 185838, 39977, 6410, 119295, 4111, 82710, 241615, 274699, 301255, 265819, 110883, 152187, 217633, 100477, -3597, 32452, 224850, 267566, 241933, 88525, 21539, 32555, -98488]
9195i8488l9971M6322J09198j4701k5964Q2334M1314O6495K2477j24675o5385
9184a044Q5914J6132j31320m6607Q4335J02420O1976Q607l5757l6143j52302p366
9172e1155m7768Q3131M5086P6267O3444j39337j50884j1393L3722L3275J18617
9161E3005j09942J4093n2723m3592K15933n0588n6919k1176R3307L1113l3192
9150C9319j541j3745L7681j21334k3927J11488J0458j00614R7251Q8520j5611
9139A07945J7606q140M76R6954J66532j22109j83105k45318L226J39462O9489
9128D3018j00584q9132m1298K16291O7692j15982L3461Q7583K42747J23713k15658
9117B51851j41752J06910O8790J1975R9108j25013j79843n0737l8558j64757j26511
$$ y = [-98488, -138459, -92137, 17061, 2360, -23604, 58730, 100044, 166539, 189016, 64341, -1044, 84870, 101002, -30318, -76925, 7410, 109830, 171806, 180413, 144656, 108513, -43789, -51155, -98923, -15792, 29294, 105561, 169005, 29668, -121216, -132609, -98887, -65612, 53005, -56937, -42844, -95567, -139159, 76774, 26186, -30733, -51909, 41398, 72511, 39319, 37778, 24033, 61714, -59620, -83547, 27941, 38399, -62215, 35036, 123556, 107945, 125551, 117411, 117887, 214841, 381373, 259264, 76159, -169159, -165933, -26471, 43018, -57566, -146698, -187996, 28295, 95987, -19995, 13466, 101049, 343796, 467509, 251851, 110099, 217009, 285799, 297774, 396882, 271869, 92026, 41289, 2731, -162026, -288537]
9106b88537J66292K20536J20518P8184k7113m6905j16142k5558M3839O9340M6559
9095B41013j6618M0349p4807k0822L6760p0327L1641O9637j56436l9213m2142
9084i65j06306M6401Q2153L8681j39526j21126J278M9801l6642M251O4102O6555
9072e1343K8516K0930r8892J54501l028n5564N5763Q7076K52109j56519j41775
9061I1774J148J11284o887j86099k234J06835J49806o4005r9195K45703L1125
9050C79255o5255k0203l4184j7018m149M6304j05675J25576Q2286r2830j18290
9039A75817j64876q9044O2924m0332k6614K1646J29628J48392M5381m3452l9707
9028A79763k100j7682j51520j01282J34653J44479n579q1691m4425N3653Q0038
$$ y = [-288537, -122245, 98291, 218809, 296993, 269880, 222975, 106833, 81275, 125114, 194454, 241013, 224395, 264744, 189937, 169115, 205875, 135548, 167189, 236826, 80390, 41177, -965, -107271, -60870, 21283, 59964, -79562, -200688, -199410, -149609, -186251, -182000, -117898, -51343, -22827, -1897, -100789, 53712, 50684, -4880, 50883, 137959, 390068, 233549, 91774, 92922, 204206, 197319, 11220, 8986, 115821, 265627, 201622, 102427, 348130, 379255, 314000, 293797, 259613, 242595, 238446, 284750, 179075, 304651, 386937, 294107, 175817, 10941, -78103, -15179, -55511, -82125, -60479, 69149, 217541, 262922, 219470, 179763, 177663, 159981, 8461, -92821, 41832, 186311, 180732, 99041, 54616, 108269, 188307]
9017A88307j52322k2493J2484j19601j07068R0807N1614p7728J2033O1505N9155
9006c307k3130j38472L1011J04438J8533o6159O0404r3071L2892N8913l3190J33069
8994H1931O7224r1156j29526J4044J90846J37819j27777J51j1778j87180K3641
8983c1761J02190j28348M996N7204l096J66900J66567j24083k31134J8210J0838
8972H483j29400M8979K01762L5746r7962J16971m775j98839r7928K2427n7823
8961a52359n209p333L01645J63841p2910j13940M3446P8936m9971J609k694M0231
8949B25292p5698o9244K2895j0427j02985r6485J22229L4318J18955L9083q6751
8938A21182m4548l8366q4113J6996k2142k9948j709Q8037J03774J04686m900l0086
$$ y = [188307, 35985, 13492, 25976, -93625, -200693, -109886, -58272, -136000, -123967, -62462, -3307, -26437, -164909, -133898, -29460, -10927, -77086, -16682, -109753, -76861, -17948, -51138, 81931, 149155, 57999, -71527, -57483, 133363, 271182, 143405, 143556, 131778, -55402, -31761, 70429, -57919, -52923, 4281, 1185, 168085, 334652, 210569, -20565, -2355, 8483, -120917, -71938, 129824, 165570, 67608, 184579, 179804, -19035, -116963, -94536, -152359, -157568, -164901, 136744, 300585, 227675, 113735, 157181, 236117, 186146, 187755, 185061, 225292, 149594, 80350, 103245, 92818, -10167, -106652, 15577, 49895, 168850, 207933, 121182, 76634, 38268, -45845, -28849, -50991, -80939, -82648, 5389, 109163, 213849, 208949, 178863]
8926A78863J6016j54783k2193L1644K4311l291Q2411Q7827k02238p5163J45926
8915A09330R448P6149j00433j92909j07259M0509M7452J83050k9535k13891j23779
8904c01868P5145J4361R0703R3316M6019l9081Q9624n0437N547N6003K9888J1662
8892A20882O4343l6011P7211M0452p0196k35667j18396L7598J94993q4509q8568
8881i7868r6058K29962J6761n1465N5760R7347p7341J2357n2424M9165j07768
8870b1572m3296n671j9664J95775J24253N0661j14854n2499j6696O3874K3522
8859A83833M4650m0949o5032n1404j06718O327p431j872K0688J88121Q2694m199
8847B48708o4904j42791m7911L3168j34202j11173Q7347J90147J25782j10167
$$ y = [178863, 194879, 40096, 17903, 49547, 73858, 70567, 152978, 240805, 38567, -36596, 109330, 118778, 194927, 94494, -98415, -205674, -165165, -117713, 65337, 35802, -178089, -301868, -226723, -212362, -121659, -28343, 17676, -21405, 68219, 17782, 23329, 79332, 109220, 120882, 185225, 149214, 226425, 266877, 196681, -38986, -157382, -119784, 75209, -9300, -97868, -193926, 36036, 52797, 1332, 57092, 154439, 77098, 89455, 37031, 86196, -21572, -64868, -70539, -90203, 105572, 229825, 280486, 165632, 113133, 96437, 160311, 183833, 228483, 187534, 122502, 71098, -35620, -29293, -36724, -38596, -17908, 170213, 252907, 248708, 183804, 41013, -6898, 26270, -107932, -219105, -131758, 58389, 184171, 74004]
8837G4004J7846L1432Q9573M5943K0984n5045j06488N7723J01931j05823j66639
8826E441M585J5577J26O9794m1001J06663O242n8012o009k19218m1693N6344R2841
8813h320M0722o079j30253M7430j0847Q3919J11479N3931J2219n9988q630P4523
8801B00106j11627r5235l8458J16546M612j06356j72078k9115K5233J25692J27675
8790D6995j15323p3201n7351o311j9749Q3504J54655m6640p7658j14061J50503
8779g4637J55502J49552j53957q7770k0775J6126L9405P0226j0445l7963J6270
8768F1534k4993j57680M7347l3364o9498J54554K4537P1607R0661K17063k1029
8757C60739L4232Q91j54944j74561l8063m8765J43549N0716Q3604n5095n7821
$$ y = [74004, 91850, 123282, 212855, 258798, 279782, 224737, 118249, 175972, 277903, 172080, 5441, 10026, 25603, 25729, 95523, 54522, 161185, 167427, 109415, 103406, -115812, -157505, -101161, -8320, 32402, 26323, -103930, -56500, -67347, 16572, 128051, 181982, 194201, 134213, 125583, 200106, 88479, -6756, -45214, 71332, 75944, -30412, -202490, -231605, -206372, -80680, 46995, -68328, -141529, -198880, -205191, -224940, -141436, 13219, -33421, -111079, -225140, -74637, 80865, 230417, 76460, -11310, -32085, -15959, 23446, 93672, 83227, 45264, 61534, 36541, -121139, -73792, -107156, -176654, -22100, 2437, 74044, 164705, 381768, 360739, 394971, 395862, 240918, 66357, 28294, -20471, 123078, 173794, 257398, 202303, 144482]
8746A44482j74450k53005J46635K19005J6235p4771L9946J81739r3624p8859L05
8735G3638l4370K3751M5551m7523l4916o7967j0401l9111q6348j04319R5240j6315
8723b03090J37608P4506J36986J63387p9502k05857L44J29924r460m50J6913K4088
8711A85397j2051j09381o2543L8308J03549J21191j8983j27319k4389O6996n6342
8700A04433m8261J2752r1612J04303L9039J8530K4866j01595l3176L0404J4638
8689G4321J97539l6072m7359l372M9204j8224P5984K22391o1399j54369j39534
8678A59110n0483k4136j20408j33093l1567K28441P1553j05057J88615J60988
8668C43963q2484j65185O5752J74619j38319n988L9142J24748l9988j38836j42611
$$ y = [144482, -29968, -282973, -136338, 82667, 98902, 24131, 64077, 245816, 152192, 73333, 73638, 39268, 63019, 108570, 61047, 26131, -41836, -52237, -91348, -177696, -282015, -186775, -203090, -65482, 9024, 146010, 309397, 229895, 24038, 24382, 154306, 144846, 144396, 161309, 185397, 173346, 63965, 1422, 39730, 143279, 264470, 245487, 118168, 93779, 160775, 104433, 56172, 68924, -22688, 81615, 120654, 139184, 164050, 62455, 29279, 59683, 74321, 271860, 235788, 188429, 185057, 234261, 216037, 292021, 514412, 453013, 298644, 159110, 108627, 84491, -35917, -169010, -200577, 27864, 99417, -5640, 182975, 343963, 261479, 96294, 162046, 336665, 198346, 192358, 231500, 356248, 316260, 177424, 34813]
8657C4813o4886L3568J27907j1913j15256m301j21756l1313J02575K16696R1021
8646B57155J55745L0377k38519j44102J10082n3302l1693J94690R342j38464P4143
8635B25454n1033k395N0411j14304o7855Q8102R4858o0687j57599L8740J486j80040
8623a34862r9113O7687J07781L3813M3691k36762n5696j7862L7295Q0095J76259
8612B326P6105r7675j06481O497Q5705N1850j7050O0464k0657J83147n7151p6363
8600I0717l0395N363q6821k4284j7306j2886M1418J71525q458m8187l35883j44027
8588c99224J0510K05116J42915J20313N9200M6117o6293p7265J43945J15865o0791
8577B40408K0034M9313K9094J00759o5841l08579l2592N1354j15987j5385N0639
$$ y = [34813, -30073, 3495, 131402, 119489, 4233, -68, -121824, -153137, -50562, 166134, 257155, 412900, 443277, 204758, 60656, 170738, 117436, 85743, 280433, 289775, 151311, 225454, 174421, 172026, 222437, 108133, 40278, 128380, 223238, 162551, 4952, 43692, 45178, -134862, -233975, -166288, -58507, -24694, 18997, -217765, -273461, -291323, -254028, -173933, 2326, 78431, -19244, -125725, -119228, -33523, 18327, 1277, 61741, 41084, 224231, 167080, 90717, 60322, 65685, -21136, -45420, -62726, -75612, -34194, 137331, 128873, 80686, -255197, -399224, -388714, -183598, -40683, 79630, 138830, 184947, 118654, 41389, 185334, 301199, 240408, 260442, 309755, 338849, 439608, 373767, 65188, 32596, 83950, -32037, -47422, 3217]
8566C217n3537O9935o5332j9547M348N8805R7235J4333k2806j61936j79537n009
8554b59831Q8965j2316P7713l3716J07260N3745L0155J05865p4011P4107N5084
8543B13020l0100O3929L5875r427n2631O0315o0181o4248Q7327j11866j42144
8532a0131j9470J22461m8041j44596N6287J14786J06947J08902N6754j04528r908
8521B29463J94832j48317k64735p2184Q5229Q749n3533k9445n1317J25883J72500
8510A97125k716j91152J3990J96930j37754o4376K08609J58323K4237j51983j33082
8499A18151J4436J24610J5238l836l5963j737n0194j874j8843m6502r9697O1321
8487G5110R0252J7829M054j1179N5265j0921o9017m1050q7724j30525P80p6035
$$ y = [3217, -50320, 19615, -45717, -65264, -60916, -2111, 95124, 109457, 86651, -75285, -254822, -259831, -170866, -183182, -105469, -139185, -31925, 21820, 51975, 157840, 83829, 157936, 213020, 182920, 246849, 282724, 273297, 220666, 280981, 220800, 156552, 243879, 132013, -10131, -29601, 92860, 44819, -99777, -43490, 71296, 178243, 287145, 343899, 239371, 229463, 424295, 275978, 11243, -60941, 24288, 33037, -20496, -49941, -101258, 24625, 197125, 194409, 3257, 17247, 214177, 76423, 12047, 220656, 378979, 403216, 251233, 118151, 132587, 257197, 272435, 268599, 232636, 230899, 180705, 178831, 159988, 113486, 13789, 75110, 165362, 183191, 187245, 176066, 231331, 220410, 151393, 110343, 22619, -107906, -107126, -183161]
8475a83161j40203M954L9396J92735N1164n1746o7359L5676j5294K6089J20931
8464A3182J10395p6588j25460J8526k0616K0701J23170M6786j2935K3521j6328
8453A04354J73797Q1527J0622j20276J6150J56575j18933j60285O5208M5380j9910
8442B34209j00975M1359J75083L09023J2614k45935k91546j49589L1686J1421
8432B7350l1969L4774J4223O1056o5314J17676L4254J5951N996j50635o7688K7494
8420B3168j00334j47402M3370M6678K70225Q9432l926M4177l6880j669R7527M4815
8408C69181p8830m5511m9805j81576M1251J97086j30912k41838J4293K04307N9294
8397A56940N2376j11086P8854K013N9239N0305M1749p8382Q94J59455n5466j60767
$$ y = [-183161, -323364, -318410, -279014, -86279, -35115, -86861, -154220, -118544, -133838, -107749, 13182, 123577, 46989, -78471, -59945, -80561, -59860, 63310, 110096, 97161, 120682, 104354, 278151, 359678, 370300, 250024, 266174, 422749, 303816, 143531, 208739, 254119, 234209, 133234, 174593, 349676, 658699, 671313, 425378, 133832, -15757, 15929, 27350, -4619, 30155, 44378, 105434, 40120, 157796, 192050, 208001, 213997, 63362, -4326, 23168, -77166, -224568, -181198, -134520, 135705, 225137, 221211, 265388, 228508, 226839, 324366, 369181, 290351, 244840, 195035, 13459, 54710, 251796, 120884, -120954, -106661, 97646, 156940, 209316, 98230, 177084, 179097, 238336, 288641, 330390, 252008, 252902, 412357, 356891, 196124]
8385A96124j48626Q8922P6481j2682J08179L2571j46935m6240l3858r0819J18148
8374A41265L1750j08657Q6617m1073p242J44495r6553j7638m625j08194r9707
8363g9562Q6587l1361P535K2797Q0838n8163n6085j70486j05764J1866J47392
8352a44406K49532J52818J01436p0280l7006m9279k44319j44900J37353J26145
8342G7094N5213p5061j63335o4732O4116N1441J02521Q9307j00179l0831p2022
8331f6468J53984J59786r6634o9987j02985o3252J76602Q6849j08168o0488J3280
8320B2519m5390Q5988K2752k6650m2440J9378k749o5199q7413N1646j5663q3742
8308a66963N629O9676m018n3515N0662K0802k2024j970R2195l5450J08445J11641
$$ y = [196124, 47498, 136420, 212901, 200219, 308398, 340969, 194034, 147794, 113936, 23117, 141265, 173015, 64358, 150975, 109902, 102660, 247155, 150602, 132964, 128339, 20145, -79562, 7025, -24336, -16801, 5996, 86834, 28671, -27414, -197900, -303664, -291798, -144406, 105126, 257944, 359380, 289100, 252094, 202815, -41504, -186404, -49051, 77094, 132307, 57246, -106089, -170821, -106705, -55264, 47257, 136564, 36385, 5554, -66468, 87516, 247302, 150668, 80681, -22304, -85556, 91046, 177895, 69727, 9239, 22519, -22871, 63117, 85869, 59219, 16779, 36157, 33408, -31791, -119204, -67558, -83221, -166963, -161334, -91658, -95676, -149191, -98529, -77727, -99751, -101721, -9526, -44976, 63469, 175110]
8296A75110K6521O4704o7959j9166r4359k7377J05631R4423P398o4513j6693K2616
8284B06336K8435j45004j25369k2909l8420L5520J39637P5738o4046k7886k2134
8273C9898q7551P11m07r8431L4240Q9834R5759J57093J4027k44456j22675n7976
8261a79934L2706J72225J10909j06923r4177p0023J13103M6133M9112Q2667j29390
8250B6408j6480J43554j07381j4608o3404K837J65551k3256l3324m7912L0248
8239F2233p9656r9574r0351j81565k6601P0669J07042R8172J72059J41295l3805
8228A39918o3277n8245o8665P4699Q7899K3827r609K2505K0640M4393J602q9934
8216A25753M2923Q4977P7707k82927q2780J32752Q3718j9666J8109j20494j02347
$$ y = [175110, 201631, 266335, 198376, 179210, 84851, 57474, 163105, 257528, 264926, 200413, 183720, 206336, 234771, 89767, -35602, -58511, -96931, -61411, 78226, 153964, 89918, 62032, 39898, -47653, -46942, -47349, -145780, -111540, -21706, 74053, 231146, 245173, 717, -121958, -179934, -147228, 24997, 135906, 28983, -65194, -135217, -22114, 24019, 73131, 155798, 26408, 9928, 153482, 46101, 31493, -31911, -29074, 136477, 113221, 79897, 31985, 62233, -17423, -116997, -207348, -388913, -415514, -344845, -237803, -139631, 32428, 173723, 139918, 76641, 18396, -50269, 24430, 112329, 136156, 126547, 149052, 169692, 214085, 215687, 125753, 168676, 253653, 331360, 48433, -34347, 98405, 182123, 162457, 180566, 60072, -42275]
8205d2275q9542m9448J48270K49544Q9939n864J31038p5443k99828M3425J6171
8194A15987j46331P1850m873r2328L8101N6579M1868k6024J3049j09085n2991
8183i4198O118r2304L6626J1029J93433R7927j60750J00010Q0562o9979l2067
8172G6407J7033l2939j05816l5718J93190J4552j64523j35288O3211j9012J65290
8161C6387K21115l1446j28293j00141Q8913J1251K0181j1107j6332o0953o305
8150B3270N1897R2297J01656r5637j47894L3327J70161m7033r9218n7814l2000
8139f988j18232K8991J33739J70603l9514r987p5624p3511n2666N7508j11145
8128i6826j98738O3025P1416N9309j0882N0014r5968j14705l7900L5427N4817
$$ y = [-42275, -131817, -181265, -32995, 216549, 306488, 300624, 431662, 356219, 56391, 99816, 115987, -30344, 41506, 36633, -55695, -17594, 38985, 80853, 54829, 67878, -41207, -94198, -88080, -180384, -143758, -132729, 60704, 158631, -2119, 97891, 178453, 108474, 76407, 93440, 60501, -45315, -81033, 112157, 126709, -37814, -173102, -109891, -128903, 36387, 257502, 226056, 97763, -2378, 86535, 97786, 117967, 106860, 90528, 29575, 23270, 75167, 167464, 269120, 173483, 25589, 58916, 229077, 182044, 82826, 25012, -6988, -125220, -96229, 37510, 208113, 168599, 158612, 82988, 9477, -43189, 14319, -96826, -295564, -232539, -161123, -101814, -112696, -62682, -158650, -273355, -311255, -275828, -221011]
8117b21011J04326R8916O4989o7350j10603j9173j5529K2569L4097J7480J76333
8106H5044Q3573q3541j39675m2798j72492J01098K40062r9709r2915q7142L9909
8095a68586J06540N921j04475r0835R6639M5083J63604n8070j22978l7651Q4697
8084h0111l3002j22115K8442J9796k5183P3391J36979J38472r9p4810k6334j22099
8072h6673M0822J69946Q8267q8583O3580j4105J3238O1447n1109j27710j7268
8061E1852M4683P7256m8546j76074J57725K37168q5617j37319j5951o2583j00799
8050e8205O8333M4319J09250j33135p1665o1102N6321R8825l7085P8441J26590
8039B20887j28186o6990j8304j9618r8699l9020J773K105J44069J64229j5067
$$ y = [-221011, -116685, -17769, 47220, -20130, -130733, -149906, -165435, -142866, -108769, -91289, 85044, 168617, 85076, -54599, -97397, -269889, -168791, 71271, -28438, -121353, -208495, -168586, -62046, -56125, -160600, -251435, -154796, -109713, 53891, -4179, -127157, -164808, -80111, -113113, -235228, -206786, -186990, -212173, -138782, -1803, 136669, 136570, 61760, 35426, -86673, -45851, 124095, 212362, 123779, 187359, 173254, 186492, 247939, 196830, 69120, 51852, 96535, 173791, 125245, -50829, 106896, 344064, 258447, 121128, 105177, 42594, -58205, 10128, 54447, 163697, 30562, -41103, -102205, -45884, 52941, 15856, 94297, 220887, 92701, 25711, 7407, -12211, -110910, -149930, -148157, -146052, -1983, 162246, 147179]
8028A47179Q934q8297N1028O9627j40940m2322l3122O3690J2450j33081m5182
8017a30036K5530J71660K6660J9914J05033l3231r572o156j2998L8520m9887j73286
8005b7849o4451J41842K5091Q2199o450j02609k0462R7420K06496k2934J571n9282
7993B50582l3160O4356K2154N8592q0015j32259n7220j14146j09165l9287J6622
7982a52946K01175j63629o0927o5997j1543j0798O780J05267L9575r4110J7172
7971a89981l6880J75021J67715q7462k326M6423j20860N232R5695j9087j5005
7960A8485Q1051r5754J43398o8104p4618L7068j04067q2784J8377j07305M0320
7949a93933R4242L9676j4119n0732m949M1951J0502R1992J77785l8470j34986
$$ y = [147179, 156113, 67816, 118844, 188471, 47531, 5209, -27913, 35777, 48227, -84854, -130036, -104506, 67154, 93814, 113728, 218761, 185530, 175958, 169802, 156804, 195324, 145437, -27849, -92300, 49542, 74633, 156832, 150382, 47773, 27311, 124731, 331227, 308293, 309864, 250582, 217422, 281778, 303932, 362524, 282509, 150250, 93030, -21116, -130281, -169568, -152946, 48229, -115400, -176327, -242324, -253867, -264665, -257885, -152618, -113043, -207153, -189981, -226861, -51840, 115875, 28413, 26087, 72510, -48350, -43118, 52577, 33490, 18485, 99536, 3782, 147180, 79076, 4458, 41526, -62541, -145325, -126948, -234253, -193933, -99691, -60015, -74134, -124866, -129815, -87864, -77362, 14630, 192415, 153945, 18959]
7938A8959J04563k675n5394m8258J7577O1090J85692l14163l13699M815K29178
7927a12315J69056p6297J0304P7942m5433q1060n0344j32572M0290K6816J19576
7916e4037P481J34114J9512k02022j65230Q0726J00166J29903J06221j74610j69386
7905a87162M0969n4797j13917O072J24021O0872o7490M1659P3147Q5885N1910
7894F1169j07895j21599N4998l8631j9228J18371L0148k00843O886J1234q5523
7883b90913Q2944P6523k3798J9910Q8652O9042o7178J5630J3334J763J20763J22197
7871B28869j66027r8197j0972J00678L1486j74330M8675M2714r2270m6781j4229
7860a50384J55153J22221r9459o2018K00232n734l4273r8638q4596k0522J42145
$$ y = [18959, 123522, 120847, 65453, 17195, 34772, 95862, 281554, -32609, -346308, -341493, -112315, 56741, -19556, -9252, 68690, 23257, -57803, -108147, -240719, -200429, -173613, -54037, -46556, 87558, 107070, -94952, -260182, -179456, -79290, 50613, 156834, -17776, -187162, -146193, -200990, -314907, -308835, -184814, -123942, -191432, -149773, -76626, 9259, 61169, -46726, -168325, -113327, -151958, -171186, -52815, -22667, -223510, -216624, -205390, -290913, -207969, -131446, -155244, -135334, -46682, 22360, -44818, -29188, -15854, -14091, 106672, 228869, 62842, -35355, -46327, 54351, 85837, -88493, -39818, 2896, -89374, -136155, -150384, 4769, 126990, 27531, -34487, 165745, 160011, 125738, 27100, -57496, -78018, 64127]
7849F4127r667k03571l5853J35895m016p741o2684J43363j4094o6207n4469m6856
7837a61773l5702M6817P4499M3601j00227N649J40931J65827J42260L0654j33038
7826B19498k26030n4847j44642j8480J00716R1055q0101M6007l1954N8862q303
7815d8219k1442O5970Q3385Q8137N4477r1873n4998L9120l9096p1262j4766J07643
7803I7076J99030P8330o571j48787j15564k5842p4910k17045N1488K06960q2956
7792c8791L2365n1165L8951J36045P0677p2023j59017J17235j26046o5117J29480
7781A2594J65610K9409k8032J7279K5987J09753j2830k51772p0811k756p3363
7770g8932j19542k9167j09342Q473J45924n2399j35409P1376k8843J52009J27426
$$ y = [64127, 54460, -149111, -184964, -49069, -53085, -60826, -123510, 19853, 5759, -60448, -114917, -161773, -197475, -150658, -76159, -32558, -132785, -127136, 13795, 179622, 321882, 352536, 219498, -6532, -61379, -206021, -224501, -123785, -32730, -112831, -66824, -98778, -39916, -48219, -69661, -3691, 79694, 167831, 222308, 130435, 75437, 114557, 75461, 4199, -10567, 97076, 296106, 374436, 367865, 219078, 103514, 77672, 2762, -214283, -162795, 44165, -38791, -6426, -57591, -18640, 117405, 188082, 116059, -42958, 74277, -51769, -116886, 12594, 178204, 207613, 179581, 196860, 222847, 332600, 319770, 67998, -2813, -5569, -78932, -198474, -227641, -336983, -328510, -182586, -234985, -370394, -299018, -327861, -175852, -48426]
7759d8426N0305r3326m6566j6543M9039q2625r887J69771m2263n1098O8677l4528
7747h7470l0086J14572J66380O8670R21j18212M9145p1600j9946O7484j28973
7736A0885j3232j14816l573O934R3035m965j19248J0032N6749Q7953M9953n3070
7724F637P3306j21029R26l870m3929r5613K03415N7448N133J1867p4974N0391
7712F9708p137K907k4575k8111L8593Q6958o3125j05476j45170j14471j7302N7035
7700b50166o3423Q3634J07955P0174L0079J08333L1362L427o02m1088j87691Q8926
7688a9080R8123R152j69428q2386l8913K360N0615p8267j25581N2970O8570N2928
7676a78937J58535Q7412l1032r8155O7776J50566k0955p8540oo1920m2229n1446
$$ y = [-48426, 1879, -91447, -138013, -154556, -105517, -188142, -198029, -28258, -70521, -121619, -52942, -87470, -117556, -2984, 163396, 232066, 232987, 114775, 163920, 92320, 72374, 139858, 10885, -2347, -117163, -120736, -113802, -20767, -25732, -144980, -134948, -78199, 9754, 59707, 6637, 79943, -41086, -40160, -44030, -87959, -183572, 19843, 77291, 82424, 94291, 19317, 69708, 62571, 65478, 40903, 12792, 51385, 138343, 75218, -30258, -175428, -289899, -307201, -250166, -313589, -229955, -122000, -51826, -21747, 86586, 117948, 121375, 120773, 79685, -108006, -19080, 79043, 88195, -81233, -163619, -202532, -200172, -149557, -227824, -353405, -300435, -231865, -178937, -20402, 67010, 35978, -62177, 5599, 156165, 135210, 56670, 56664, -5256, -47485, -98931]
7664i8931j09706O6740N3843p5142M9789L01126j2561j3615m6711k05627k6981
7653a17776L4297J81307J49974j75826j08793o8744k7179P9483M8208l1719J05571
7642F8803J5512j7667r8969n3430j39189p0935L5692N4235J7954k195M2986m9661
7630a96864j19665j26448P7076K30010J79569n9878j21181j39423n3469J14830
7620b15443R2814j8611Q0892m232J4517O7428J33139N4772n5366q6068J1711j84019
7608a08466l09212l0612K53353J80072l9628q2593R3323J67348R6300N6263L1781
7597C07929o4081l9444j41953j90571q5436P8152N7260j0430j936q6054J6110
7586a60454J9272m1428R0817O0731J28072n3144k0981m5679J9315L5386j7040
$$ y = [-98931, -208637, -141897, -88054, -163196, -113407, 187719, 175158, 161543, 114832, -90795, -117776, -83479, 97828, 247802, 71976, -36817, -105561, -132740, -53257, -5049, -36768, 68803, 84315, 66648, -32321, -85751, -224940, -295875, -260183, -205948, -187994, -190189, -147203, -196864, -316529, -442977, -365901, -135891, 43678, -16200, -137381, -276804, -330273, -215443, -122629, -141240, -60348, -64580, -50063, 17365, 150504, 205276, 149910, 63842, 75553, -108466, -417678, -448290, -194937, -14865, -54493, -137086, -43763, 123585, 219885, 276148, 307929, 243848, 204404, 62451, -128120, -213556, -135404, -78144, -88574, -90510, -176564, -160454, -141182, -182610, -91793, -31062, 97010, 43866, 22885, -22794, -3479, 31907, 14867]
7575A4867k0203P843K1120O7673n9909q4355R906K22174r9918j9021j38267j5475
7563i3565J15055n2517q2497j07868N0004O4035l566J09191o3462q9604J21576
7552c3218R4643J4446j16318p8689M1533L8933O4331o6383j36391J5406Q6709
7541g4998n1130j41227R4696J22119q7097j38052J03943l2658j26438o5436L8501
7530c57777J19407K20913R3404j44208J82897Q7399o9781j55522n9001r2129k4216
7519a98614Q4565R5227R3364j3942L388j3283n6481l0496n5415j0142Q1279J92036
7507A71486j4123j61694j9963J4283k4306j00452R6445J8012j06712l9822l0142
7496a96988L3694J13585N3663j658n112j4283m4311j54879j2201N7469M013N0357
$$ y = [14867, -5336, 2507, 23627, 91300, 31391, -52964, -43058, 179116, 79198, 60177, -78090, -93565, 21490, -31027, -113524, -221392, -171388, -107353, -110919, -1728, -65190, -154794, -33218, 61425, 75871, -40447, -119136, -77603, -38670, 25661, -40722, -177113, -161707, -74998, -126128, -267355, -172659, -50540, -137637, -275689, -171746, -204404, -330842, -396278, -357777, -238370, -17457, 75947, -68261, 114636, 202035, 132254, -23268, -82269, -174398, -198614, -114049, -18822, 74542, 60600, 63988, 50705, -5776, -36272, -91687, -101829, -20550, 171486, 157363, -4331, -24294, -10011, -34317, -134769, -38324, -20312, -127024, -166846, -196988, -163294, -49709, 3954, 2296, -2816, -17099, -61410, -216289, -228490, -171021, -167008, -116651]
7484a16651j35902J07785J07329J101M9417j46207K9659N5281L889n440j90658
7473b40397N0690K13798j19955K3966N7500j17584p3111P3958l3013O1355K4349
7462g8444k4941M6291J44075J05857j35524l0205J70692p3419j11090k0559p8921
7451h6188J32730L1752o1123M9253J49131j33538k74206j09507J26322N0697l4890
7440a59567l8k2561p1032J24443q751k9537k0238J65913K53533l9355m6744j77123
7428c1057P1309n2920j9320q7517j00824J06505J8153Q4205J78182r0513J0857
7417H7060l41j12584j14716O8049k4333j79762j60374K4728J91891J53616J72387
7406A05621k3417k0050p5048l0818J6727J9536J1023j97316j02957J26041J9207
$$ y = [-116651, -252553, -144768, -37439, -36338, 13079, -133128, -103469, -48188, -44299, -49739, -240397, -189707, 24091, -95864, -71898, -14398, -131982, -205093, -131135, -164148, -102793, -78444, -103385, -57094, 86981, 192838, 57314, 27109, 197801, 124382, 13292, -7267, -86188, 46542, 78294, 17171, 66424, 215555, 82017, -192189, -301696, -175374, -124677, -159567, -159605, -182166, -253198, -128755, -137506, -167043, -187281, -21368, 232165, 192810, 146066, -31057, 40252, -12668, -31988, -119505, -220329, -113824, -95671, -11466, 166716, 76203, 87060, 86719, -25865, -140581, -72532, -96865, -276627, -437001, -412273, -220382, -66766, 105621, 82204, 62154, -12894, -43712, -26985, -7449, 3574, -193742, -296699, -170658, -151451]
7395a51451J14483P1119L4031P6854k10972j36533K5268O6248J2602l5391J09138
7384b4604K7724p1006Q8405j09817j6188J10914J6051m5593q6413m4077N9773
7373i4831J39704R6107J3863r6835j47811N8016N3928L4196k61302k3888n0272
7362b79125L2981K0338R2528j09341j76108N2643m6506q9686J86431J15702J95790
7351d353J26771O9799j93760r6539p200j50094m3481N1268l0394J3597q1636M3529
7339c02493P0695J41009J12001J7506K814J37614q231N911K2478j52043j76191
7328a28930K973M3856M731m1826j32926j06686J77857J39214o2667l1397J38892
7317C091J38448L0635p0351r8115N959N870O928j14541k8201Q0200R2093r0577
$$ y = [-151451, -36968, 34151, 68182, 145036, -65936, -202469, -177201, -110953, -98351, -133742, -24604, 3120, -67886, 20519, -89298, -105486, 5428, 21479, -24114, -110527, -154604, -94831, 44873, 140980, 154843, 58008, -89803, -31787, 22141, 56337, -204965, -228853, -279125, -246144, -225806, -133278, -242619, -418727, -366084, -412590, -502276, -315845, -200143, -4353, 122418, 192217, -1543, -98082, -105282, -255376, -298857, -247589, -277983, -264386, -346022, -302493, -231798, -90789, 21212, 38718, 41532, 179146, 170915, 176826, 199304, 47261, -128930, -125957, -82101, -77370, -119196, -252122, -358808, -180951, -41737, -104404, -135801, 3091, 141539, 172174, 101823, 3708, 9667, 15537, 22465, -92076, -120277, -40077, 52016, -38561]
7305c8561q2131j8073M4740N2009J4170J06910o3220K8429J00656o6986k07488
7294a29545l0001p7466M7285J94575N1010p9752p5958o4288K8030R6809Q5116
7283D5815k8867j10799j1828l9239k36555K1765R6510J12696n8746p9705J40715
7272a48238N0254J09416j18005j56563J82867M0413J8387M3315k024J5066n1949
7261a7061n4650m2075r6266O4107J25063J99084K1244J3222J0401l5545j74042
7250A3482r2468q3640j0865m88J4520P2062Q3743K0028N5853j9717j36410N9072
7238b4828J78778L4617j46670l8304q741J7548Q264j04356m9819O5662Q7656J38149
7226A57956j78504R5469J72491n7516M3767M0705j30359j33722j04705n2538k0454
$$ y = [-38561, -120692, -138765, -94025, -42016, -27846, 79064, 15844, 44273, 144929, 77943, -129545, -159546, -237012, -189727, 4848, 55858, -23894, -99852, -164140, -136110, -39301, 45815, 16948, -93851, -105679, -144918, -381473, -359708, -263198, -150502, -209248, -288953, -148238, -97984, 11432, -106573, -263136, -80269, -39856, -21469, 21846, 19822, 34888, -17061, -71711, -113786, -210052, -145945, -20882, 178202, 199446, 212668, 223069, 187524, 13482, -78986, -162626, -173491, -173979, -159459, -87397, -3654, 16374, 72227, 52510, -83900, -24828, 153950, 188567, 41897, 3593, -5148, 12400, 20664, -83692, -133511, -67849, 19807, 157956, -20548, 74921, 247412, 189896, 233663, 274368, 144009, 10287, -94418, -146956, -167410]
7215a67410J2407P0840l6167M9244r5395l2381j04068L2889M9086q7081l7241
7204c45277J44444J69785P0163N915n5759k3039J41751P5205p6342j76950j35048
7193b05152O937K3182J5424J4186m0279j6103M4043K191n1626o690Q6897J0357
7181a16633K5469n8511K19473P9398j56912j41332j12614J14558M6468j5446k82011
7170c98093j2144K47317J54595j08573j34221Q2701R8486j0431l2801P0585K8808
7159a3771M8055l1630M9596J4599j8676Q4819J3272l3657Q8326J00694J2847k33442
7147H1032O241M9200j8414l0257O528n6856j11823l148p6206J0277Q32O9381J02575
7134B9362j33623n657P8547p0886j6286J47713n6011k56206M5456K36636K2615
$$ y = [-167410, -155003, -84163, -120330, -71086, -166481, -198862, -302930, -270041, -220955, -308036, -345277, -200833, -31048, 39115, 45030, -10729, -33768, 107983, 183188, 106846, -70104, -205152, -198215, -175033, -159609, -145423, -185702, -201805, -157762, -155571, -207197, -213887, -126990, -116633, -91164, -149675, 69798, 149196, -7716, -149048, -261662, -147104, -100636, -116082, -398093, -410237, -162920, -8325, -116898, -251119, -168418, -69932, -80363, -113164, -42579, -13771, 34284, 2654, 52250, 66849, 48173, 132992, 146264, 112607, 200933, 301627, 314474, 81032, 87273, 136473, 118059, 87802, 94330, 37474, -74349, -77497, -153703, -143426, -142594, -73213, 29362, -104261, -109918, -31371, -102257, -118543, 29170, -26841, -283047, -237591, -955, 21660]
7123B1660k9499o5186r7180n9775O8399J59344k7744j9051Q710o3940Q1534J02182
7111G9454P8612O888J4460j12235o3804O9047m496k92236n6002J40083k5225n864
7099a71318k1359O2386p9021k08385L5811N6685M7700j10131P5091J66410J00506
7088d5625j86224l4698J48947J02022K9140j490q782J0336L3592p4742L6316P4601
7076H3393r2601P1129Q79L4051m3262R9528k5325p3734n0542k0154K8085L882
7064A5329l0124j5454J56561j399o039m4370m6286L0848n340Q0099n7812l3942
7052D2071P8248M1037J2929o7168l8555q700q1879j65734L8038K28614Q8554p2425
7040I5030j37438n5807j4841Q9216P9240k8655o5053r6628k4114M0427K6569Q7358
$$ y = [21660, -7839, -73025, -170205, -229980, -161581, -2237, -29981, -49032, -40322, -104262, -22728, 79454, 158066, 164954, 179414, 67179, 3375, 72422, 67926, -224310, -280312, -140229, -165454, -171318, -192677, -130291, -209312, -417697, -381886, -325201, -277501, -387632, -312541, -146131, -45625, -231849, -266547, -117600, -15578, 13562, 12072, 3290, 13626, 47218, -27524, 8792, 83393, -9208, 61921, 62800, 96851, 53589, 153117, 127792, 54058, 3516, -16638, 11447, 15329, -14795, -30249, 126312, 124913, 118874, 74504, 28218, 59066, 53726, 133825, 76013, 42071, 120319, 161356, 174285, 107117, 68562, 59862, -22017, -187751, -149713, 78901, 167455, 95030, -42408, -98215, -113056, -23840, 55400, 26745, -38308, -134936, -159050, -118623, -92054, -4696]
7028d696n237J52329K1598n1452J9198O569k48873k07101L2797M8679J20348R9426
7016a6415K2450j17064P9254L9035N893L4362R1550q2141j23228n7469J00235
7005b3538k8974K7509m7838j2408M7643P4065O8728j4728j38794p0134N2776L6990
6993b8703r8571K3848l8355L6199J801J21813k8147j60386j99224j82519L3946
6982e18298R1014K06046K01070r724M3474J23988j70210q0705O3159Q0326N759
6971C5899j79984K7695J58237J04033m4149K8876r2973n0399q0768o2525m1476
6960a97534J01650p3306J06781J08838J22825M4001r7119M2749l0559n4601k11503
6949a37778L441J72408K5227q0228k4419K0166m9718J8659p7199J4182l2741j62724
$$ y = [-4696, -9933, 142396, 163994, 112542, 131740, 138309, -110564, -317665, -284868, -236189, -115841, -16415, 6035, -111029, -31775, 7260, 13153, 47515, 139065, 56924, -66304, -123773, -23538, -52512, -25003, -72841, -85249, -37606, 36459, 105187, 90459, -48335, -118469, -65693, -28703, -127274, -103426, -141781, -105582, -103781, 18032, -10115, -170501, -369725, -552244, -518298, -427284, -221238, -20168, -29892, 13582, 137570, -32640, -113345, -50186, 30140, 35899, -144085, -116390, 41847, 145880, 101731, 130607, 37634, -12765, -93533, -156058, -197534, -95884, -169190, -62409, 46429, 169254, 213255, 116136, 158885, 128326, 73725, -137778, -134337, 38071, 63298, -16930, -41349, -21183, -70901, -52242, -129441, -115259, -148000, -310724]
6937c10724j0611K50397P1147N6030K4128j25280q331M4972o3526j66024l9577
6926b77399J80507O044q8465l59K19307J1802j12870q0167R0794J06217l7818
6915A7593m2166P6541j8854j52224j22149P4808J80453J92928o6770j52346j23985
6904a36171M4788J56868r0527N141l5394J3650j08362r5983N4313O3494R4276
6893c3907J70086J60563k37327l09663P1623J09330n4273l3070Q2480j25880j34810
6882c34848j2879K0506J56712K04925o1q4954m4085J23711n1365j44806m0449
6871b07593J3128O3868J79963J24749O9905j60334l9073q3677p1971j29021J34237
6860a05819l3754j29948P3875K02637p0390j25646P6061K01902J23304n5178j32403
$$ y = [-310724, -321335, -70938, 209, 56239, 80367, -44913, -53244, -8272, -71798, -237822, -277399, -96892, -90848, -179313, -179672, 39635, 51437, -61433, -141600, -50806, 55411, 17593, -24573, 51968, 33114, -119110, -241259, -166451, 14002, 206930, 140160, -12186, -136171, -91383, 65485, -25042, -19901, -55295, -41645, -150007, -245990, -191677, -128183, -33907, 136179, 296742, 59415, -250248, -178625, -69295, -123568, -156638, -74158, -200038, -334848, -347727, -327221, -170509, 34416, 34355, -50599, -94684, 29027, -22338, -167144, -207593, -194465, -130597, 49366, 174115, 244020, 83686, 44613, -39064, -111035, -240056, -105819, -139573, -269521, -195646, 6991, -63399, -189045, -112984, 88918, 212222, 157044, 24641]
6849B4641r1354p2825P1193K9606j42669L6161J09826J1999n5159R9583N1631
6838G2633j56287K015o7232q407J6850j70887J40754m9541J13841J10936k2307
6827a7632K0962q0835L6107m4924j35635O3116L3164P3753K0422J15687l2801
6816E1384l1111k0582j68730j35782M1564N1377Q7469M0570j16291k51K00812
6805D29L695j11362o9185P4355m5572k35074R1828M7759L890J81462L372j52232
6793b06635n0593r0152o8595J60735J75443M9488N0613P4113j47890n0108Q2843
6782b0738J39177m8756J21038j5746j04565j48811K1990O570L9176M8865q0286
6771d2086J3303M8772K5986j72974r8957k0706l1214J73170P3348q827n3557m8702
$$ y = [24641, -66713, -139538, -68345, -38739, -181408, -145247, -35421, -23422, -78581, 21002, 72633, -83654, -81639, -148871, -157278, -140428, -311315, -170561, -220102, -106261, 4675, -17632, 3330, -77505, -41398, -86322, -221957, -158841, -125677, -51924, -31502, 84185, 51384, 20273, -309, -169039, -304821, -263257, -211880, -124411, -83841, -200132, -200383, 429, 4124, -107238, -176423, -102068, -147640, -382714, -290886, -243127, -239237, -57775, -54403, -206635, -257228, -347380, -415975, -255240, -79797, -30309, 20304, 94417, -53473, -103581, -20738, 118439, 69683, 190721, 174975, 70410, -78401, -56411, -49841, -10665, 38200, -42086, -28783, 19989, 45975, -126999, -225956, -246662, -277876, -104706, -31358, -40185, -93742, -142444]
6759a42444R2517J88700Q1911r1769J185r7479p6177N7741n0446m219J9967q1755
6747a02268n7159k7327n2317M6435J98664J72217j10118l7815J48887r5237P3145
6736A57107K9945j8684j0192q4639r0098J61177J3415N5322j62565r2212j7463
6725e8887j9717l5021L169k4875R3172j1685k3001M10R4139P0460O04o0601r9949
6712g1782L3981O1502n2103Q6120J31363j78099K8016o5277m6904J50403m154
6701G3066o111j51851m7248J65778N8470q9764j44111j13164r6512K06580K58135
6690A13268k2653j24061l9182J38938J4808M4233j63084j32899j67746N0713J14169
6679a73496J13917J06331j79177J05613J50108L3881j20979k12428l9323k7391
$$ y = [-142444, -49927, 138773, 220684, 128915, 130100, 32621, -43556, 14185, -36261, -40480, -20513, -102268, -159427, -186754, -239071, -192636, 6028, 178245, 68127, 30312, 179199, 83962, 157107, 187052, 168368, 158176, 73537, -16561, 144616, 158031, 213353, 50788, -41424, -58887, -78604, -113625, -110456, -135331, -42159, -53844, -76845, -76435, 17704, 88164, 88768, 28167, -71782, -37801, 23701, -28402, 57718, 189081, 10982, 38998, -26279, -73183, 77220, 73066, 66955, -84896, -132144, 33634, 92104, 2340, -141771, -254935, -351447, -144867, 113268, 90615, -33446, -72628, 66310, 81118, 125351, -37733, -170632, -338378, -287665, -173496, -59579, 46752, -132425, -26812, 123296, 157177, 36198, -176230, -215553, -242944]
6669b42944r8404p2138J05659Q5442q405J19312N3124j03172o8688j02091N209
6658c27096N8630O5019L3670j8912Q7446o3980J9880J22197K17128j27604o4842
6647A536J5552O0489j9278j24074n2616q8747J36225R853j62647j57876P4126
6636c07457K70075L8076q9804r3628R1456J8888m0281J3786p2360K5556K05124
6625E9431J06528N2681J0754j29292M7653n843k067k6671o3518j57416r8355J73599
6613c2516P1231o5010j56337J82740J02948J8895P9077r421m6954q818m2791n8683
6601C4361n8733K4815j77099k02806N1435K12941J80858J33057m1479j64460n4560
6590f1670J4752j7446J2110k588l5103k8268j41276N5599K64046J53568p1306
$$ y = [-242944, -341348, -413486, -307827, -222385, -230790, -111478, -58354, -161526, -230214, -332305, -327096, -268466, -203447, -169777, -188689, -101243, -165223, -145343, -23146, 193982, 66378, 1536, 17088, 77577, 58299, -65775, -118391, -207138, -70913, -61060, -223707, -381583, -307457, -37382, 694, -89110, -182738, -91282, -72394, -112675, -98889, -171249, -145693, 59431, 165959, 218640, 229394, 100102, 147755, 141912, 139845, 113174, 49656, -107760, -206115, -32516, 38715, -26295, -182632, 108, 103056, 121951, 201028, 191607, 144653, 135835, 93044, 34361, -24372, 443, -176656, -379462, -328027, -115086, 65772, 198829, 157350, -7110, -61670, -46918, -64364, -52254, -54842, -89945, -118213, -259489, -203890, 60156, 213724, 142418]
6579A42418j8369k59860J10154l1443N6044j30197O1022R6756K0172R1452j3436
6568A24713j08997j7202J7306Q8149p4914m6316l7589J90117J01231p1089j6960
6557A48449p1247j4234p1903k1513J50030k9312O9152N0023j25958q2361q6279
6546h5153m5072M0668j0801j46187l3704N953L6561o9125r453M8337J41328K42511
6534A15863k6679j21133q8873L8824P2676k1839p235n2086J6887j6477j08405
6523a98477J02399J46653L6965Q4358p5511j3351q3413M7145J30434L6397r8199
6512A15400p3799K0908m7247P0723K11553l3350j18154j7946k03630q2182M8804
6501a08920N2515J06673l347k24446r8415m5255J67121O4466J14276O054R600
$$ y = [142418, 124049, -135811, -25657, -57100, -1056, -131253, -70231, 26525, 46697, 138149, 124713, 15716, -1486, 15820, 103969, 29055, -17261, -54850, 135267, 236498, 165409, 148449, 77202, 62968, -8935, -30448, 119582, 90270, 159422, 209445, 83487, 1126, -85153, -130225, -89557, -100358, -246545, -280249, -274296, -237735, -306860, -316313, -267976, -126648, 115863, 89184, -31949, -120822, -81998, -9322, -31161, -38396, -90482, -73595, -90072, -198477, -96078, 50575, 87540, 171898, 96387, 83036, -377, 46768, 177202, 213599, 115400, 41601, 62509, 15262, 85985, 297538, 264188, 146034, 128088, -75542, -157724, -108920, -56405, 50268, 46921, -177525, -275940, -321195, -154074, -89608, 24668, 30722, 40322]
6490D0322r6995j71287k8594Q7132M6569j63734j85818K28613K54944L1261j98771
6479a56358r2153J25917l7803p1169K66377J35728K1262J58635k01999j79092
6469c0655J000n832M8579m6169j29869K1755M8740p7487j06843r272M3678O1488
6457a80887K8828P6564K4918K0859k1772J112M4665M5887j02210o6494K9712J80851
6445H2033m1200j21060p384P3660o7079n4429P4917O4903r4261J2306K1368j2194
6433f8420n2870m6688M9426J4041J898k03089j7682K93331Q620q3227K5132o0179
6421a39707N010J1217J03553R4602m323k0318R3312k06617j38216J01605q7980
6410a87862j04119M6170j3653J29300n5434J70898J78220p3727j51518m8012K8383
$$ y = [40322, -56673, -227960, -256554, -169422, -122853, -286587, -472405, -243792, 11152, 42413, -156358, -248511, -122594, -160397, -231566, 34811, 170539, 191801, 350436, 148437, -30655, -29655, -35487, 13092, -33077, -162946, -141191, -92451, -169938, -276781, -286053, -242375, -180887, -152059, -75495, -50577, -29718, -51490, -50378, -5713, 40174, -62036, -128530, -98818, 82033, 40833, -80227, -87611, -13951, -81030, -135459, -60542, 4361, -89900, -77594, -56226, -68420, -121290, -167978, -118552, -104511, -102613, -305702, -323384, -30053, -21433, -104660, -79528, -139707, -134697, -123480, -19927, 74675, 70352, 50034, 143346, -63271, -201487, -99882, -187862, -291981, -245811, -259464, -130164, -185598, -14700, 163520, 89793, -61725, -109737, -81354]
6399h1354R2183k1452j11714K2509M0285l6396r1798Q0640R3829q7487M6673N3265
6387h17J2376L320N1092O2456n495P900j6312r3095j34473j21389j09420l5171
6375c79028Q06O3265J33658N6466M4282J2715J85668R2949k38956k0353m5925
6364i4453Q144N4241n1969l1400K918j642K1267Q3082O8429q8800j2719k177j4448
6351e9527j42169R558Q3815P4107J23016l3213O3975J44529K4249j77830j62052
6340e1542O2960p1281n2325n1081J15994J82352J75565n7455j19863j09713j9325
6329D286k9427m1813M5392J02587O5642j8599M1238j23584k72452k3661R2140
6318a58251J88084R3915m6064j03072l8844r8001j27024K3231N2058N1238J0592
$$ y = [-81354, 10829, -10623, -122337, -99828, -59543, -95939, -187737, -107097, -13268, -100755, -54082, -817, 11559, 14879, 65971, 128427, 122932, 130832, 114520, 21425, -113048, -234437, -343857, -379028, -378222, -314957, -181299, -124833, -80551, -67836, 117832, 210781, -28175, -48528, -94453, -86309, -32068, -84037, -115437, -112519, -114161, -92894, -9812, 58617, -30183, -42902, -45079, -59527, -201696, -192138, -108323, -34216, 88800, 55587, 119562, 264091, 288340, 110510, -51542, 11418, -59863, -112188, -163269, -47275, 135077, 310642, 253187, 133324, 23611, 4286, -25141, -66954, -21562, 81025, 146667, 128068, 169306, 45722, -226730, -250391, -158251, 29833, 123748, 77684, -25388, -64232, -162233, -289257, -266026, -213968, -162730, -152138]
6307a52138J08140J48623L5485k08413j52177j21344N0977N0587m1215n2079L8758
6296b94796K22852J90334n7671K8038k5570q2613J2013p4775K7327L2670R0127
6285F7936J26551k20399k2443j22470O2627m217k35094j2398O0501J11n4737k1880
6273c75912K09394K6062O6253R7928o1831k1767N1767M697Q9226j23582o6019
6262a03784j94575j34763j86387K52187L00775p3695N1470j29244Q663l5150R0384
6251a54119Q584l1509k6149N1856O6068J43037J69462j8733j16674n0875N115
6240D6063j38736J8670O3956l9560J9004n9543k1244K9300M8967O326P829J60122
6228A41154J48487k2176j96554j43365j66767m9748J14398m555O905o1795M3874
$$ y = [-152138, -43998, 104625, 140110, -68303, -220480, -341824, -290847, -240260, -281475, -333554, -294796, -71944, 118390, 60719, 88757, 63187, -19426, -7413, -82188, -54861, -22191, 67936, 194487, -25912, -48355, -170825, -108198, -112415, -347509, -359907, -299406, -299295, -354032, -375912, -166518, -140456, -74203, 23725, -38106, -59873, -8106, -3409, 85817, -37765, -103784, -298359, -433122, -619509, -367322, -66547, -140242, -88772, -218016, -209353, -244503, -154119, -145535, -177044, -203193, -151337, -85269, 57768, 227230, 208497, 91823, 40948, 46063, -92673, -74003, -10047, -49607, -30603, -90146, -111390, -82090, -33123, -26797, -18968, 141154, 289641, 267465, 70911, -72454, -239221, -288969, -174571, -179126, -172221, -234016, -190142]
6217a90142P0169L942J91945r2300J1093R3151q657n0130o3376J95644n4522q6712
6205B0105j27178Q719M0476q9232n0672O3928q2630k3222r1406L1935K2912N7081
6193b19184J21095l6914r2790M2224n9984j8285O2149J05192Q0155J30614k6355
6182H7917j05886p2646j59185J38844Q2021J09909k38700q3626J54198J73630
6172H6476k9374j33487J07603j04125q0075k3161J3667j39233J14132J31617O4363
6161H403k2723R287k419j00250l2185N9202J14951J32351j4049j64545q905N2890
6149C2008J5043o5501O2329J00435n6811m5981o5721o7424q3679j9837m845q3591
6137b83575o4465N2920l0181Q8387P7313K2713k2571p1786l7936J3094Q2360Q8255
$$ y = [-190142, -119973, -116031, 75914, -16386, -5293, 87858, 79201, 29071, -34305, 161339, 106817, 20105, -107073, -98354, -57878, -147110, -197782, -133854, -216484, -239706, -331112, -299177, -276265, -219184, -98089, -135003, -227793, -185569, -245553, -263838, -201689, -96497, -16342, 114272, 87917, -17969, -90615, -249800, -110956, -28935, 80974, -157726, -241352, -87154, 86476, 57102, -76385, 31218, -72907, -152982, -176143, -162476, -301709, -187577, -55960, 8403, -14320, -5033, -7452, -107702, -139887, -80685, 34266, 166617, 152568, -11977, -20882, 32008, 47051, -18450, 43879, 144314, 87503, 41522, -24199, -91623, -175302, -195139, -199984, -283575, -348040, -295120, -325301, -236914, -159601, -136888, -159459, -231245, -269181, -256087, -173727, -85472]
6125h5472Q9741j79568p2676R6629j38185L1129l038J08431J18617K6944L6554
6114B9106j09190j85740N9856M0423r6444J13825K1408O5514j9091r8698q1380
6103b60411j5891p7492J50922J73659K9173J90838P5412j95212P1584l4095p4649
6092C3838j08264j04796j4386J71690J2595j8088j03344j63284j41608J49372
6082b86275K91729J25957k8654K8950J04435j79006m8371j70626j73154J152O2538
6071b71325K2816Q0558J60667q4384M9652J87957M1603m1997j01145l1641L8294
6060E1055O0300L5597k8605j11488n4068J15764J3286j05693l8586l7909N3578
6049d6769J07286Q4589K2769N1829j42577r5847r4525K1460k3959J5246M2505
$$ y = [-85472, 4269, -175299, -247975, -151346, -289531, -258402, -261440, -153009, -34392, -7448, 29106, -80084, -265824, -205968, -165545, -261989, -148164, -126756, -61242, -80333, -179031, -260411, -276302, -353794, -202872, -29213, -40, 190798, 266210, 70998, 142582, 108487, 33838, -74426, -179222, -193608, -21918, -9323, -27411, -130755, -294039, -435647, -286275, 5454, 131411, 102757, 131707, 236142, 57136, 8765, -161861, -335015, -333863, -271325, -248509, -167951, -7284, -91668, -42016, 145941, 187544, 145547, 44402, 12761, 51055, 111355, 146952, 118347, 6859, -47209, 68555, 81841, -23852, -62438, -100347, -46769, 60517, 145106, 167875, 219704, 77127, -18720, -113245, -91785, -115744, -100498, -57993]
6038e7993M8204L2940N235j16567r7009J4150M6029k8247P2052J77643L8408j64928
6026c0083l4360j23189K0431K58139j16697j86457j12222J46255J69q7166L5738
6015b29442J71034P2226K04842J26570n4946j18082j37950k6168J40930j11442
6005C7572l4414M2693p7706j77851O0406O3423J61208l3756k5554r1466j10805
5994a86250R9600P5881r6467n0387q2995N4303J74947M8864K6843Q1811r3742
5983E2408j1127N9931J12343j74359N8319k982l4798l2081m5788J9853r5397o5053
5971a58731J58111L4994j5748q946q815O8264j20431p0221L299J08825J1186J11448
5959A13235p4372r0812l3117L367q1865J16122J22350n7023Q1132o594p7989J552
$$ y = [-57993, -9789, 23151, 28386, -88181, -185190, -171040, -125011, -153258, -81206, 96437, 134845, -30083, -64443, -187632, -167201, 90938, -25759, -212216, -324438, -178183, -178014, -265180, -229442, -58408, 13818, 218660, 345230, 290284, 172202, 34252, 8084, 149014, 37572, 3158, 45851, -31855, -209706, -149300, -85877, 75331, 41575, 16021, -75445, -186250, -86650, -10769, -107236, -157623, -240618, -186315, -11368, 37496, 64339, 146150, 52408, 41281, 101212, 213555, 39196, 97515, 94533, 59735, 27654, -18134, 1719, -93678, -158731, -620, 34374, 18626, 9680, 865, 69129, -51302, -121523, -118224, -9399, 1787, 113235, 38863, -51949, -85066, -81699, -163564, -47442, 74908, 17885, 99017, 92423, 14434, 15986]
5947A5986P9640K6842l7228M9205K6631k13067l9171J48461j0777j59327l0085
5936a42890J68432J00313j17237q001K9169J14808j7269k8738n4393n3993M8439
5925C8640J11059l6445l30195J32058K04912p3998j8481K1564j04635q4108R1067
5914d8562M9234O7892K2233r7168k74451j18700J38841m802J08108Q7788J50676
5903H1089O658j00704l2236j5039J766m9322j77887p92J99914l1456j14908M1807
5891a91110N7626J20525J19747p8744O4856M6976m4616m8950n8704p9425k1557
5880a13376q4639O645m7963L0332J33436J7030o4342Q7415J08382J30283j00137
5869A03066O6896j23495j99878j73r611m6057J6106j556K2255J28532J43083k4394
$$ y = [15986, 95626, 122468, 85240, 134445, 161076, -51991, -91162, 57299, 46522, -112805, -142890, 25542, 125855, 8618, 617, 29786, 144594, 127325, 98587, 44194, -9799, 38640, 149699, 113254, -216941, -84883, 120029, 46031, 27550, 49114, -55521, -139629, -48562, 672, 68564, 90797, -6371, -280822, -399522, -260681, -265483, -157375, -69587, 81089, 87747, -12957, -45193, -60232, -58466, -107788, -285675, -286467, -86553, -118009, -232917, -191110, -133484, -12959, 106788, 28044, 92900, 139876, 95260, 46310, -12394, -91819, -113376, -198015, -191370, -239333, -209001, -75565, -58535, -122877, -35462, 72920, 203203, 103066, 169962, 46467, -153411, -153584, -163195, -209252, -193146, -194702, -172447, -43915, 99168, 74774]
5857G4774k7372k7784j28360l1962l29K6873r91J9287j32493J851J34299J23141
5845C0934m9088j74796N5540J685r4688J18600J64357J48919j26016r8471j03568
5834a26592r8651k0245J05190J32577J67217j14312M6311j00212n3185O2628m5390
5823d4664N6686j41682j10972n0987p3369J10853M1741J37071J23396n0927n2505
5812e5359M5268N450J6625Q136J04276K5253M5737O3838r9758N571p002j14291
5800D3744k09044p5219O2802o5961J27684J15720j2161N6361P2852j85092j42009
5789b10323K41115J45824m06k71411k545R1362N8001L5446k04j23761m5620k6745
5777a09267N8733J00902k19862J06620K47920k7371j50603j53796j9538j7261
$$ y = [74774, 47402, 19618, -108742, -140704, -141033, -114160, -115151, -95864, -228357, -226506, -92207, 30934, -18154, -192950, -137410, -135725, -230413, -111813, 52544, 201463, 75447, -23024, -126592, -225243, -245488, -140298, -7721, 159496, 45184, 91495, -8717, -61902, 726, -44664, 12022, -129660, -240632, -291619, -364988, -254135, -212394, -75323, 48073, -2854, -55359, -10091, -4641, 11984, 20120, 124396, 149649, 195386, 259224, 159466, 165037, 158035, 43744, -165300, -240519, -177717, -243678, -115994, -274, -12435, 43926, 116778, -68314, -210323, 30792, 176616, 176210, -95201, -97746, -6384, 51617, 87063, 86859, -36902, -82522, -109267, -50534, 50368, -169494, -62874, 185046, 157675, 7072, -146724, -166262, -183523]
5767a83523N5470K7629j43491j9285R5328j3695l8973n6601J27813M6520m947
5756a07755K4914j5222p0617j49111j21842R0762K8349J82881N4630J11068L5539
5745F3596p5066m0639P5751r7990j32748M0167O5501o263L1896K4609K6168j46146
5733a71164J314M2128O3147K4106m9903P1653L0454j6893l219J09889O0716r4963
5721F7265M4963j07175n2228j952J37271K3336M7289j48986K4028K2311Q9202
5710A45324n9319j3066Q269l986j58171q7295R6143n8797J02427J62093j13275
5699B0347l25729k37788M0533O2549J65121J56237N0231l1833O225O808k32568
5688c19867j37292J93640J45146J36555K7023n8208J34356k672J6527k5445r1567
$$ y = [-183523, -128053, -100424, -243915, -263200, -167872, -181567, -220540, -277141, -149328, -102808, -107755, -82841, -98063, -168680, -317791, -439633, -348871, -320522, -137641, -83011, 28057, 63596, -11470, -52109, 23642, -74348, -207096, -166929, -101428, -107691, -75795, -51186, -25018, -171164, -169850, -127722, -64575, -40469, -90372, -18719, 11735, -5158, -8377, 101512, 162228, 67265, 112228, 5053, -47175, -49127, 88144, 111480, 158769, 9783, 33811, 56122, 145324, 86005, 72939, 81208, 77222, -80949, -168244, -72101, -130898, -28471, 133622, 20347, -305382, -543170, -502637, -440088, -274967, -118730, -68499, -100332, -94107, -87299, -319867, -457159, -263519, -118373, 18182, 45205, -13003, 121353, 118681, 135208, 109763, 18196]
5677A8196J25286o658j21368j73650P026n1611R985L89R6354J41194R6894j29154
5665A2883j28127j7979l1527l9507P5303M4858J00511J44570L8813j21020j00503
5654b1725j12134P196Q4749o987n0943m6910J7624p5228j3566J51966n0037K3678
5642i2317Q5942Q1203k01545j42778J07450J25062K7979L7021m9295J43985m4448
5631G8259q8893o501q218j92981M0254J79477J56621O3357l6127M1962j7363j11680
5619I8167J02582m7083n0588j0407q004o5242j805j64484m7688K34375J95383
5608B35206k73124k27487R1435K1510J32519l2396J6279o458j54975l0888J70389
5597e7990R2607P5690p8190j1329M1826J23988q1336j12105o7502K487M5242L3334
$$ y = [18196, 143482, 136824, 15456, -158194, -151168, -202779, -192794, -192405, -96051, 45143, 142037, 12883, -115244, -133223, -164750, -204257, -128954, -84096, 16415, 160985, 199798, 78778, -21725, -133859, -126663, -41914, -48901, -99844, -146754, -129130, -204358, -217924, -65958, -115995, -92317, -6375, 74828, -126717, -269495, -162045, -36983, -9004, 28017, -21278, 122707, 78259, -10634, -17135, -25353, -218334, -178080, 1397, 158018, 221375, 185248, 227210, 209847, 98167, 200749, 153666, 103078, 92671, 84667, 19425, 17620, -146864, -194552, 39823, 235206, -37918, -265405, -173970, -152460, -19941, -52337, -36058, -42516, -197491, -228379, -57990, 34617, 110307, 32117, 20788, 62614, 186602, 105266, -6839, -74341, -71854, -26612, 6722]
5585F722p6959j0230L4214M5626p2916R6311p8474r48R6363r7365N423l3622j1144
5572i6999j76711j27491o1296M0779J77534R6711N9196O6323P3697P2594j64745
5561d0408J8782P0584m1936j478J43727p743l9453q3451k05121r592N2992q124
5549a51221j27868l219Q3959J31784J42768P5007j13843J86899Q4649j22878r4433
5538I1604o7433r0881o393j7703K229P4572q711N2655K8043n1293j03884Q791
5526h8404J15542j41965j77837P1991J30395j20236m2028J33659O544n3255n3133
5515b18727k0374J76772L2128j7546J1111M7916K2419J24398q1558k03139p8563
5504b05163J6232L0320J41186k8483J5274J3598m5171m656L5095P259P507r7634
$$ y = [6722, -70237, -80467, -46253, -627, -73543, 22768, -55706, -56654, 39709, -57656, -52233, -85855, -96999, -273710, -401201, -462497, -421718, -244184, -147473, -88277, -21954, 51743, 124337, -40408, -21626, 48958, 7022, 5544, 149271, 141528, 102075, 18624, -186497, -196089, -143097, -151221, -279089, -282308, -198349, -66565, 76203, 151210, 37367, 224266, 308915, 186037, 91604, 24171, -66710, -73103, -90806, -88577, -14005, -22716, 29939, 57982, 6689, -97195, -88404, 27138, -114827, -292664, -220673, -90278, -210514, -252542, -118883, -112339, -165594, -218727, -239101, -62329, -30201, -47747, -36636, 11280, 33699, 158097, 76539, -126600, -205163, -188931, -158611, -17425, -45908, -30634, -17036, -62207, -66863, -31768, -24509, -17002, -114636]
5492a14636J8256K27985M6878o3458k2547J5287k32577J5181K2262r0448K28192
5481E0375J08906o0608P960l588j23069r5400n1906k7687J23932J36740N1294
5470A16949l553j86295K2335L8693j58716L9122K11075J8917j35827j04494l7517
5459a79311N9650M0877P0116J46032K6430n4764j15638j7850j489q003j0713m3388
5447h8051o6967n3659K19951K3264o6794R5416q0269P6137j31925P1221O1435
5436E9759J15812j94928n1216J22284n0800J03162k8861m9116K371J2909n1012
5425i636m7278J20577R8670M9038j73638j11293r031j253K7431j17994p1184M2748
5413b02843N8528J26154J18791J50799o5418r2553O1072j7385j31809j27352L6284
$$ y = [-114636, -96380, 131605, 178483, 115025, 92478, 107765, -124812, -109631, -87369, -177817, 50375, 159281, 98673, 106633, 103045, -20024, -115424, -167330, -195017, -71085, 65655, 116949, 113396, -72899, -50564, -11871, -170587, -131465, 79610, 98527, -37300, -141794, -179311, -119661, -78784, -8668, 137364, 163794, 109030, -6608, -24458, -25947, -33950, -44663, -88051, -155018, -208677, 11274, 34538, -32256, 63160, -17109, 59028, -72897, -1676, 59759, 175571, -19357, -70573, 51711, 911, 104073, 75212, 26096, 28467, 41376, -9636, -56914, 63663, 162333, 211371, 37733, -73560, -82591, -83844, -56413, -174407, -245591, -202843, -144315, -18161, 100630, 251429, 186011, 93458, 154530, 137145, 5336, -122016, -85732]
5402h5732K67715J37014m7186M7868k1644j78303j11617j48113j10416J18206
5392a32208J05439K9137N5698j6368O8530R1078k5779p9444n3883m8915j2209
5381a8924N446J24190m5450k84991r7567O3527Q3488J10524m5706N3731J42949
5370I1217j00338O692J8387l4985J039j53281l4236J56678K6017j896n6676k6019
5358a07401r3652j56336J5630J73681j36564l4530M0281J35632R2354N6734p573
5347b1744o8266P7641j37352m2676K83280M7825j35084J1706j33142m9460L7270
5336a30002K0663q1658j17006K4872L3064j08915k0348J38349o520o5406l278
5325c16185J35078O9440q7338O1807j40029R5883K14912j43312q6228n1807N4670
$$ y = [-85732, 181983, 318997, 271811, 319679, 298035, 119732, 8115, -139998, -250414, -132208, -26769, 2368, 58066, 41698, 110228, 201306, 175527, 96083, 42200, -6715, -18924, -13478, 110712, 65262, -219729, -317296, -253769, -170281, -59757, -105463, -51732, 91217, -9121, -2429, 15958, -19027, -17988, -171269, -205505, -48827, -22810, -24706, -81382, -107401, -201053, -357389, -341759, -168078, -304642, -339172, -298891, -163259, -70905, -14171, -21744, -90010, -12369, -149721, -192397, 90883, 138708, 3624, 15330, -117812, -167272, -130002, -109339, -190997, -308003, -283131, -250067, -358982, -379330, -240981, -247501, -312907, -316185, -181107, -111667, -199005, -137198, -277227, -181344, 33568, -109744, -195972, -247779, -193109]
5314a93109Q8342K5530Q9609l3898o8330n6425o6778J01454K507k6851m553r1354
5302b33856L9139K41673P8062j7295j1802j83141j60032l502M4839k2638k7144
5291b55697J52643Q6646P1685O6172O1447r6867p3850J52369l7794K1815M6006
5280A94575r494o1603M038O3915K3306k72908p7424J43552J46021l2559j15102
5269F317p4977K5544N8853O0034J49988N3497p3319r5854j72417l8766J43056
5258D1956j00044P2746k1756q6731l1257p3475P3308j44410j2795L7210Q880M1004
5246a95364j05888j04159k521P0701Q2627J83863P5408j587l9339P6870j02164
5235f1553j09265l9940J12809p3588p0540J17041J35798j18652M2102J35603P6459
$$ y = [-193109, -104767, -79237, 10372, -23526, -91856, -148281, -215059, -113605, -111098, -137949, -142502, -233856, -194717, 46956, 125018, 107723, 95921, -87220, -247252, -250754, -205915, -228553, -255697, -103054, -16408, 55277, 121449, 182896, 86029, 12179, 164548, 126754, 148569, 194575, 185081, 123478, 127516, 191431, 214737, -58171, -135595, 7957, 153978, 121419, 6317, -68660, -43116, 15737, 75771, 225759, 279256, 205937, 110083, -62334, -101100, 41956, -58088, 14658, -7098, -93829, -125086, -198561, -125253, -269663, -282458, -245248, -236368, -195364, -301252, -405411, -407932, -337231, -254604, -70741, 4667, 3080, -36259, 40611, -61553, -170818, -210758, -97949, -171537, -242077, -125036, 10762, -107890, -65788, 69815, 146274]
5224A46274j5152j2885r4691j33506P1981K2857j20136l0684L4804M86J32392
5213A740K0820o1963o4111J24769q7626M2298J23656q9548R0671O5449j38754
5202B7401O3107q9388r1992l7053q8354J49090K41323k2845k07545l8315k8266
5191a22837R733j07553M4333N6589L706M6360m8450p1425m548m0487p171M3104
5179a98646k4842p4839j5049q7943L1676J17136J90133J53272j15o5876j37169
5168a12262M3386J08870O5115J90744m8552j82800j47831j02964j5541K5485J5736
5157a60614n4752K794L0458l3620P8727J11101n9608P8561p0528r6988M7362M4179
5145h2928j60162l7351J95430J62404M8938q3684m0860r5336r9646O5827j3070
$$ y = [146274, 131122, 118237, 23546, -109960, -37979, -15122, -135258, -165942, -131138, -130652, 1740, 22560, -39403, -103514, 21255, -66371, -24073, 99583, 10035, 100706, 166155, 27401, 90508, 1120, -90872, -127925, -216279, -67189, 174134, 151289, -56256, -94571, -122837, -113104, -220657, -176324, -119735, -116029, -69669, -118119, -189544, -194092, -234579, -241750, -198646, -223488, -298327, -313376, -401319, -369643, -252507, -62374, 90898, 90783, 24907, -112262, -68876, 39994, 105109, 295853, 247301, 64501, -83330, -186294, -201835, -176350, -160614, -215366, -212572, -182114, -215734, -137007, -25906, -85514, -6953, -77481, -174469, -127107, -82928, -243090, -280441, -85011, 77393, 126331, 42647, 1787, -93549, -193195, -127368, -140438]
5134a40438O2582L890J28153n2649k05237k7132r8732J07810J09809q7540R8469
5123a01015K3986m1913N6062Q3373o6455o4340j33217m1821J10117K60353Q4750
5112A69880j28557r0188r2130Q8282J18631l210j6519K4970L127j20829Q6557
5101D0014j5887j32147J8408J67531k599L7301k2083J4088Q3987j14751m288m381
$$ y = [-140438, -77856, -73966, 54187, 1538, -203699, -230831, -329563, -221753, -111944, -199484, -101015, -77029, -118942, -62880, 20493, -45962, -110302, -243519, -285340, -175223, 85130, 169880, 41323, -48865, -140995, -52713, 65918, 62708, 46189, 71159, 74286, -46543, 40014, 24127, -108020, -89612, 77919, 75320, 112621, 90538, 104626, 188613, 73862, 69574, 65193]
$$ [...]
##END NTUPLES=NMR SPECTRUM
##END=
