##TITLE=Analysis number 310069
Compound Code mo 07136
Book Reference 414/86/5
Project Code adrs
Chemist Name mattw
##JCAMPDX= 6.0         $$ Bruker NMR JCAMP-DX V2.0
##DATA TYPE= NMR SPECTRUM
##DATA CLASS= NTUPLES
##ORIGIN= Bruker BioSpin GmbH
##OWNER= NMR
$$ XWIN-NMR		Version 3.5
$$ Fri Jun 10 10:46:55 2005 GMT Daylight Time (UT+1h)  MAYBRIDGE\NMR@NMR_250MHZ
##.OBSERVE FREQUENCY= 250.131544655141
##.OBSERVE NUCLEUS= ^1H
##.ACQUISITION MODE= SIMULTANEOUS (DQD)
##.ACQUISITION SCHEME= undefined
##.AVERAGES= 16
##.DIGITISER RES= 18
##SPECTROMETER/DATA SYSTEM= dpx250
##.PULSE SEQUENCE= zg30
##.SOLVENT NAME= CDCl3
##.SHIFT REFERENCE= (INTERNAL, CDCl3, 0, 16.522)
##AUDIT TRAIL= $$ (NUMBER, WHEN, WHO, WHERE, WHAT)
$$ ##TITLE= Audit trail, XWIN-NMR		Version 3.5
$$ ##JCAMPDX= 5.01
$$ ##ORIGIN= Bruker BioSpin GmbH
$$ ##OWNER= NMR
$$ C:\u/data/dgb/nmr/ADRS/4010/pdata/1/auditp.txt
$$ ##AUDIT TRAIL=  $$ (NUMBER, WHEN, WHO, WHERE, WHAT)
(   1,<2005-06-10 10:46:36.30 +100>,<MAYBRIDGE\NMR>,<NMR_250MHZ>,
      <created by zg, POWCHK disabled, PULCHK disabled
       configuration hash MD5:
       62 19 C7 07 E1 42 D1 B7 37 6C 3D D0 77 39 F9 E6
       data hash MD5: 64K
       6F 2A 9B 85 D1 57 2A CD 39 AA 1A CB D0 47 97 4A>)
(   2,<2005-06-10 10:46:47.29 +100>,<MAYBRIDGE\NMR>,<NMR_250MHZ>,
      <Start of raw data processing
       ef LB = 0.3 FT_mod = 6 PKNL = 1 SI = 32K 
       data hash MD5: 32K
       2E 2B F5 E0 28 D6 A0 D8 A9 C2 A3 65 63 AA ED EF>)
(   3,<2005-06-10 10:46:48.93 +100>,<MAYBRIDGE\NMR>,<NMR_250MHZ>,
      <apk 
       data hash MD5: 32K
       BE 14 41 D7 4B E1 AB 84 F0 93 82 6D 12 6D CD 3F>)
(   4,<2005-06-10 10:46:49.63 +100>,<MAYBRIDGE\NMR>,<NMR_250MHZ>,
      <abs ABSG = 5 
       data hash MD5: 32K
       4D 81 86 D9 AA 3D 3B FD C5 82 34 10 3E 27 54 0A>)
$$ ##END=
$$ 
$$ hash MD5
$$ 81 09 62 26 08 71 16 7B E5 35 71 86 58 14 E2 CA
##$RELAX= 
##$RELAX= 
##$RELAX= 
##$RELAX= 
##$RELAX= 
##$RELAX= 
##$RELAX= 
$$ Bruker specific parameters
$$ --------------------------
##$DU= <C:\u>
##$EXPNO= 4010
##$NAME= <ADRS>
##$PROCNO= 1
##$TYPE= <nmr>
##$USER= <dgb>
##$AMP= (0..31)
100 100 100 100 100 100 100 100 100 100 100 100 100 100 100 100 100 100 
100 100 100 100 100 100 100 100 100 100 100 100 100 100 
##$AQSEQ= 0
##$AQ_mod= 3
##$AUNM= <au_zg>
##$AUTOPOS= <10 >
##$BF1= 250.13
##$BF2= 250.13
##$BF3= 250.13
##$BF4= 250.13
##$BF5= 500.13
##$BF6= 500.13
##$BF7= 500.13
##$BF8= 500.13
##$BYTORDA= 1
##$CFDGTYP= 0
##$CFRGTYP= 5
##$CHEMSTR= <none>
##$CNST= (0..31)
1 1 145 1 1 1 1 1 1 1 1 1 1 1 1 1 1 1 1 1 1 1 1 1 1 1 1 1 1 1 1 1 
##$CPDPRG= <>
##$CPDPRG1= <>
##$CPDPRG2= <>
##$CPDPRG3= <>
##$CPDPRG4= <mlev>
##$CPDPRG5= <mlev>
##$CPDPRG6= <mlev>
##$CPDPRG7= <mlev>
##$CPDPRG8= <mlev>
##$CPDPRGB= <>
##$CPDPRGT= <>
##$D= (0..31)
0 1 0 0 0 0 0 0 0 0.06 0 0 0 0 0 0 0.0002 0 0 0 0 0 0 0 0 0 0 0 0 0 0 
0 
##$DATE= 1118396795
##$DBL= (0..7)
120 120 120 120 120 120 120 120 
##$DBP= (0..7)
150 150 150 150 150 150 150 150 
##$DBP07= 0
##$DBPNAM0= <>
##$DBPNAM1= <>
$$ [...]
##$SUBNAM7= <"">
##$SUBNAM8= <"">
##$SUBNAM9= <"">
##$SW= 20.6930455092707
##$SWIBOX= (0..15)
0 0 3 0 0 0 0 0 0 0 0 0 0 0 0 0 
##$SW_h= 5175.983436853
##$TD= 65536
##$TD0= 1
##$TE= 295.16
##$TE2= 300
##$TE3= 300
##$TEG= 300
##$TL= (0..7)
0 120 120 120 120 120 120 120 
##$TP= (0..7)
150 150 150 150 150 150 150 150 
##$TP07= 0
##$TPNAME0= <>
##$TPNAME1= <>
##$TPNAME2= <>
##$TPNAME3= <>
##$TPNAME4= <>
##$TPNAME5= <>
##$TPNAME6= <>
##$TPNAME7= <>
##$TPOAL= (0..7)
0.5 0.5 0.5 0.5 0.5 0.5 0.5 0.5 
##$TPOFFS= (0..7)
0 0 0 0 0 0 0 0 
##$TUNHIN= 0
##$TUNHOUT= 0
##$TUNXOUT= 0
##$USERA1= <user>
##$USERA2= <user>
##$USERA3= <user>
##$USERA4= <user>
##$USERA5= <user>
##$V9= 5
##$VALIST= <valist>
##$VCLIST= <CCCCCCCCCCCCCCC>
##$VD= 0
##$VDLIST= <DDDDDDDDDDDDDDD>
##$VPLIST= <PPPPPPPPPPPPPPP>
##$VTLIST= <TTTTTTTTTTTTTTT>
##$WBST= 1024
##$WBSW= 4
##$XGAIN= (0..3)
0 0 0 0 
##$XL= 0
##$YL= 0
##$YMAX_a= 379707
##$YMIN_a= -353994
##$ZGOPTNS= <>
##$ZL1= 120
##$ZL2= 120
##$ZL3= 120
##$ZL4= 120
##$ABSF1= 16.522
##$ABSF2= -4.171173
##$ABSG= 5
##$ABSL= 3
##$ALPHA= 0
##$AQORDER= 0
##$ASSFAC= 0
##$ASSFACI= 0
##$ASSFACX= 0
##$ASSWID= 0
##$AUNMP= <proc_1d>
##$AZFE= 0.1
##$AZFW= 0.1
##$BCFW= 0
##$BC_mod= 0
##$BYTORDP= 0
##$COROFFS= 0
##$CY= 12.5
##$DATMOD= 1
##$DC= 0
##$DFILT= <>
##$DTYPP= 0
##$F1P= 14.0000005364418
##$F2P= -0.99999901652339
##$FCOR= 0.5
##$FTSIZE= 32768
##$FT_mod= 6
##$GAMMA= 0
##$GB= 0
##$INTBC= 1
##$INTSCL= 1
##$ISEN= 128
##$LB= 0.3
##$LEV0= 0
##$LPBIN= 0
##$MAXI= 10000
##$MC2= 0
##$MEAN= 0
##$ME_mod= 0
##$MI= 0
##$NCOEF= 0
##$NC_proc= -2
##$NLEV= 6
##$NOISF1= 0
##$NOISF2= 0
##$NSP= 0
##$NTH_PI= 0
##$NZP= 0
##$OFFSET= 16.522
##$PC= 1
##$PHC0= -68.41164
##$PHC1= 1.099865
##$PH_mod= 1
##$PKNL= yes
##$PPARMOD= 0
##$PSCAL= 4
##$PSIGN= 0
##$REVERSE= no
##$SF= 250.13
##$SI= 32768
##$SIGF1= 0
##$SIGF2= 0
##$SINO= 400
##$SIOLD= 32768
##$SREGLST= <1H.CDCl3>
##$SSB= 0
##$STSI= 32768
##$STSR= 0
##$SW_p= 5175.98343685301
##$SYMM= 0
##$S_DEV= 0
##$TDeff= 65536
##$TDoff= 0
##$TI= <Analysis number 999999
Compound Code 99
Book Reference 9
Project Code 9>
##$TILT= no
##$TM1= 0
##$TM2= 0
##$TOPLEV= 0
##$USERP1= <user>
##$USERP2= <user>
##$USERP3= <user>
##$USERP4= <user>
##$USERP5= <user>
##$WDW= 1
##$XDIM= 32768
##$YMAX_p= 426942396
##$YMIN_p= -458932
$$ End of Bruker specific parameters
$$ ---------------------------------
##NTUPLES= NMR SPECTRUM
##VAR_NAME=  FREQUENCY,     SPECTRUM/REAL,   SPECTRUM/IMAG
##SYMBOL=    X,             R,               I
##VAR_TYPE=  INDEPENDENT,   DEPENDENT,       DEPENDENT
##VAR_FORM=  AFFN,          ASDF,            ASDF
##VAR_DIM=   32768,         32768,           32768
##UNITS=     HZ,            ARBITRARY UNITS, ARBITRARY UNITS
##FACTOR=    0.157963299565203, 1,           1
##FIRST=     4132.6476996994, 0,             0
##LAST=      -1043.33573715361, 0,           0
##MIN=       -1043.33573715361, -458932,     0
##MAX=       4132.6476996994, 426942396,     0
$$ Real data points
##PAGE= N=1
##DATA TABLE= (X++(R..R)), XYDATA
$$ [...]
24719B45M620o49M264L561J7546R739j673q158j0266j3460M613l835N569J0250
24705B2366J6380k7846k8711j1417J1779J4080N38j2964J2806l642k894M018o755
24692a2262j1902j3532K3108J2141j2193j4760K5899K3536N198l590k0198l445
24680b000P950R808l0608j1320N948J7846R345J5149j8464q71j7981n704M5453
24667B4551J1291k1210Q043R620j4378j7877k943J7328M892J0713j0694j8209
24655A127j0579k7209k177J2911J5214L7R225Q98j7576j8956k229J0815J3954
24642a4545J865K4209q382j5828k0726J5414J4080J8938M011m5557p892P024J0316
24629a7073O913J1442k168j0307J8638J631J6428k6200k6796p503K0513K449j3019
$$ y = [245, 4865, 4216, 8480, 12041, 29587, 39326, 37653, 29495, 19229, 5769, 10382, 6547, 12116, 22366, 38746, 10900, -17811, -29228, -17449, -3369, -2831, -15795, -2989, -6631, -9525, -5507, -12262, -24164, -37696, -14588, -2447, -14640, -29400, -3501, 20035, 25233, 21643, 1445, -2000, 5950, 15758, -14850, -26170, -20222, -2376, 6969, 22118, 3654, 2783, -15198, -20902, 24551, 35842, 14632, 22675, 32295, 17917, 40, -2903, 14425, 19317, 30030, 19336, 1127, -9452, -36661, -38838, -25927, -10713, -10676, -1451, -553, -18129, -37085, -39314, -28499, -14545, -12680, 11529, 3147, -12681, -33407, -17993, -3913, 15025, 19036, -26521, -34413, -27389, -17073, -10160, 1282, -886, -11193, 7445, 9076, 25504, -696, -27492, -34995, -14482, -12033, -25052]
24616b5052r168N058L2385j4995j2515j2054N176J0141J0906P47l0141j4851K9909
24603b4454L2784J2836j0255J1217o495k3381j366R862q495q106j842N732K7450
24590A5487M173J4152j3255l9490k4923K2351r878j0340J1508J2881l363J2014
24578h683j6141J7418J7206j0987j0239K429J4566N204Q10r002L223P036k0854
24565h014n923k254m695m909J6938k154j928j3327r463J8992R805J6222P151j0555
24551E886k5241r561K5635r187K766l208J6144m20J735M385j5319j6805o368J367
24537b8191n190R093J8936j6873J2919N907q216p060K9352k2046L975R473L017
24524E096k2260N546J9144P844k0519j7586r690M45L451K893O866L4010p035k0078
$$ y = [-25052, -34220, -29162, 3223, -11772, -24287, -36341, -31165, -21024, -10118, -9371, -39512, -54363, -24454, 8330, 21166, 10911, 22128, 15633, -7748, -9114, 748, -7747, -15853, -17695, -11963, 15487, 19660, 33812, 20557, -18933, -43856, -21505, -31383, -41723, -30215, -17334, -20697, -8683, -24824, -7406, 9800, -1187, -11426, -8997, 5569, 10773, 11583, 2581, 5804, 12840, -8014, -13937, -16191, -20886, -25795, -8857, -11011, -12939, -26266, -35729, -16737, -6932, 9290, 16441, 5886, -19355, -28916, -3281, -12468, -9702, -12910, 3234, 2814, 4549, 8934, -6385, -23190, -29558, -28191, -33381, -24288, -5352, -22225, -9306, -3399, -11615, -18675, 10677, -11369, -7394, 2079, 5096, -17164, -11618, 7526, 15370, -5149, -22735, -32425, -31980, -28529, -25636, -18770, 15240, 8205, -11873]
24510a1873K951J3154r143j0816J4119q843J6355k072k0423R275k0688j4551j040
24497d3595J562l099Q634K0529J1654O558M0517K9802j5117k9453k708k3251j9864
24484a7831K940j1610K923J4497L201q317J3416R383q3Q432j2340l293r291l33
24470h306J223N208L078K6434J204k4733j7418m286K509j483L635L0340J395j9154
24456c54J6890N064k949J2659J0285j5910q624k4978j9063L9811L2971j2098J2414
24443D6118k247l5620j0280q23p687L307q342m055k688j2032L975J970J4200L0212
24429A6008J748j2063P215p013p305l190R980j295j1609J2655k9827j5404M555
24416c5545j0691N534J2909K0031K5936L708P74j4049j8532k3537k7760J2459
$$ y = [-11873, -8922, 4232, -4911, -15727, -1608, -10451, 5904, 3832, -16591, -7316, -28004, -42555, -43595, -42033, -45132, -36498, -15969, -4315, 2243, 42760, 72562, 57445, 27992, 25284, 2033, -17831, -14891, -26501, -23578, -9081, -5880, -14197, -781, 8602, 8519, 16951, 4611, 1318, -7973, -8306, -7083, -1875, 1203, 27637, 28841, 4108, -13310, -17596, -15087, -16570, -12935, 17405, 18800, -354, 16536, 21600, 18651, 31310, 41595, 25685, 17061, -7917, -26980, 12831, 45802, 33704, 46118, 43871, 8251, -2029, -2852, -10539, -7232, -15574, -19629, -22317, -34349, -30374, -28404, -14204, 16008, 17756, 5693, 12908, 5895, -1410, -4600, 5380, 4085, -7524, 5131, -24696, -40100, -35545, -46236, -40702, -27793, -7762, 18174, 21882, 22656, 8607, -9925, -33462, -61222, -48763]
24404d8763m44J1297l876k7587P233L2850J6533j3434j0436M1137J1115k3021
24392g396k410J8889M3248J3940q802k7396l4666O42L5352R818l6823l087L919
24379E228q104o14l751J2221p519q39J6253j824q438J6332R228j9065r853j5778
24365a6523l738j0164j732J6217J7898L612q085q494O318K0502L450K3109j9697
24352B2673n964J1288j9091o366j1230J0565j452j4442m463p804m43K3380M253
24339I04p938j414O867O730J9173R947q661l6010j3554J6114M653J7862l284k0575
24325i186O370j1256j1786J7442J7042j595j9357M745j9507r523L678R648O170
24312a7115K0308J2726J7160q763k1929P589P250Q963j6244j1287o111L073j4295
$$ y = [-48763, -49207, -37910, -41786, -69373, -62140, -29290, -12757, -26191, -36627, 4510, 15625, -7396, -9806, 9083, 52331, 66271, 57469, 30073, -4593, -3951, 31401, 41219, 4396, 1309, 5228, -2876, -3490, -7241, 4980, -2539, -3378, 12875, 11051, 2613, 18945, 28173, 9108, -745, -16523, -20261, -30425, -32157, -15940, 1958, 5570, -2515, -11009, -4691, 15811, 19261, 42370, 22673, 16709, 27997, 8906, 2540, -8690, 1875, 423, -14019, -18482, -26286, -26729, -3349, 904, -7034, -8448, -1581, 5149, 24322, 34269, 25608, -10402, -23956, -7842, -3189, 14673, 11389, -9186, -2816, -14072, -25858, -8416, 8626, 7031, -12326, -7581, -27088, -36611, -32933, -23285, -17115, 3193, 15919, 33079, 24316, 2387, 9976, 17226, 26189, 9945, -1342, -7453, -4380, -18675]
24299a8675j3005J2645K972j7624r736k217J1486m007K2587J3571q30j1745J0433
24286d145k471m195l968j3976L7872K6427N616j3986k2565k6359q463j4529P689
24273c7053P456J5524n446O123L989P636p500j6961q728P058M111J9130R834o014
24259h41j5551J5491P774p360j1010K446R208k101Q420j2207Q881J9234J1108
24246C3492j9479k2780K322J800P974J576K312P94M982J2079p29J040j758j4639
24232H986q216l634M950j7884j0555J6038J0520J6674K1332o345j7975q055j0995
24219e159j1644k997k307q899r473P959N491L1063l971J382J3698k7124j1542
24206b3523Q300j675l695O846j1993k6938Q52J5332J4478R604J1243O265j441
$$ y = [-18675, -31680, -19035, -16063, -33687, -43423, -45640, -34154, -38161, -15574, -2003, -2833, -14578, -4145, -6616, -10811, -14779, -28755, 9117, 35544, 41160, 27174, 4609, -21750, -30213, -44742, -37053, -29597, -14073, -19519, -13396, -9407, -1771, -9271, -26232, -34960, -27902, -23791, -4661, 5173, -841, -16392, -901, 6873, -487, -11497, -9051, 157, -1944, 6476, -5731, 3150, 22384, 33492, 14013, -8767, -6445, -4645, 3329, 4905, 7217, 8011, 12993, 25072, 24343, 25383, 23625, 8986, 770, -2864, 2086, -15798, -26353, -10315, 205, 16879, 38211, 31866, 13891, 5836, -5159, -16803, -19800, -22107, -31006, -40479, -32520, -27029, 4034, 63, 1445, 15143, -11981, -23523, -15223, -16898, -20593, -13747, -25740, -52678, -51826, -36494, -22016, -12412, -1169, 5096, 3655]
24193C655M638L95M473J935j3378k6520k6985R624J6349j4696j1817J6611J9411
24180a6305K0488j4386j2498J657J1507m834j2943K922Q126L2904O378m959o286
24167A1771M036j1084j9139o815o371O380J6258J7780n842j4932o165l444n621
24154b3188j369n430K3617K1818j5979l828K5732K604j9987k37J50j5179M747
24141f529k809K47j3818n84K8563L482j2266j9843J347O869m410L412J3564r6
24127b871j1167n003J8378K7655L3471K9q469j8767r489L211j4170j4148j7872
24114a9212J0661J6802j7443k7335j1718L602L2149J1774k0385q422J0238M227
24102a5062J3196J0692J6189o377m636k0110r219L4096L3110Q130m3283j9568
$$ y = [3655, 8293, 8688, 13161, 15096, 1718, -24802, -51787, -42163, -25814, -40510, -52327, -35716, -16305, 4183, -10203, -22701, -21044, -9537, -14371, -27314, -24392, -16266, 16638, 23016, 18057, 11771, 15807, 4723, -14416, -21231, -27602, -21222, -4964, 12816, 6974, -7958, -14123, -17567, -23188, -24557, -29987, -6370, 15448, -531, -4359, 21373, 23977, 3990, 3753, 3903, -11276, -6529, -9338, -9091, -22909, -23493, 5070, 8552, -3714, -23557, -22210, -15341, -19751, -16339, -2775, -2871, -14038, -19041, -663, 26992, 60463, 60492, 52023, 33256, 23767, 26978, 12808, -1340, -19212, -8551, 8251, -9192, -36527, -48245, -44643, -12494, -720, -21105, -29527, -19289, -15062, -1866, 8826, 25015, 18638, 14002, -6108, -15327, 18769, 51879, 60009, 16726, -2842]
24090b842J2544q025Q33P770l7908M979N6073J4402o436k2731j0416r660J6855
24077A5438K3199n007j6124k4774l1674j0233K2326M718m602k833L630k33o976
24064c3145K883L8926J1098j4596j4458k560J5653r12J504O031k9103j7518R829
24051b6368J2358k296Q927P136j8976q066J8282P348R237J2013r506K4726J8086
24038E2901Q94l0902n928q773K301l251l89p414k8954j9313j705p947n099J3651
24024d9928j301J2769J3966J6401J4575k0278j9251l895J3348K2939R688L97m842
24011D588j1405k7620J883K3887Q600j7568K5748K579k5499j96K1585Q684l1191
23998a5925j4891K9984N549l525j3859J9015N753p710j3079O346K6387m43j3270
$$ y = [-2842, 9702, 1677, 2510, 10280, -27628, -22649, 33424, 47826, 41390, 18659, 8243, -1417, 15438, 38637, 33630, 17506, -7268, -38942, -49175, -26849, -22131, -26733, -29566, -25936, -26169, -33145, -30262, 8664, 19762, 5166, -9292, -11852, 3801, 2889, 4393, 10424, -18679, -36197, -26368, -14010, -16306, -7379, -243, -19219, -27285, -9003, -1655, 7582, 19595, 10089, 34815, 52901, 53795, 22893, 16965, 8192, 10493, 7242, 6853, -561, -29515, -48828, -50533, -58480, -63579, -49928, -51229, -38460, -24494, -8093, 6482, -13796, -33047, -36942, -23594, -655, 9033, 9430, 4588, -6817, -34437, -32554, -8667, -67, -17635, 8113, 10692, -14807, -15003, 6582, 15266, -15925, -30816, -832, 4717, 1192, -12667, 6348, 12101, 4391, -8688, -2342, 24045, 23602, 10332]
23985A0332M1900j1737k3917J561j2392o983R64P430q784o246Q818J5397j2131
23972D212J8106j434j4298j7016p076J904N766J771Q379N332J2881j3683k0230
23959a5386N138K598O835L377l402q584p056M909P849j224J3111J4948j2140L858
23945A4831j221j2353l2024J2069L2653P580N357L780J3031K507k964j773P648
23932D9121l430o664m0943k6302M272k084j0525M7773J7642j7556k486j3405l1039
23919c5626j7902O806P124Q077r252J4059L9562Q580j8494m568P248j4762P366
23906a782J2084O808j3517j7937j3711K8133L956j5935j8146j9173J5739L0404
23894c077J3460J1641j540R939j1061j4791j4060K5347J2054k1736j8121J094
$$ y = [10332, 52232, 40495, 16578, 18139, 5747, -1236, -272, 7158, -1626, -7872, 946, 16343, 4212, 22318, 20884, 6586, -10430, -17506, -15602, -9836, -8065, 314, 5646, 18527, 4844, -15386, -10248, -7650, -815, 2562, -840, -9424, -16480, -11571, -3722, -4946, 8165, 23113, 10973, 14831, 13610, 1257, -30767, -18698, 13955, 21535, 26892, 30672, 43703, 46210, 43246, 41473, 49121, 45691, 39027, -1916, -28218, -23946, -26030, -36555, 11218, 28860, 11304, 8818, -4587, -35626, -53528, -46722, -39598, -31521, -40773, -26714, 12848, 21428, 2934, -1634, 5614, -9148, -1782, 10302, 17110, 3593, -14344, -28055, 78, 4034, -11901, -30047, -49220, -33481, -3077, 10383, 22024, 20484, 30423, 19362, 4571, -9489, 15858, 27912, 6176, -11945, -10851]
23882a0851n43n283K5325J7060k0144l1010j3251j7988L573K0265J0695O743K034
23869a3375L207L5970M465P737J409j8777L103J8976j3150m625m442j2617o178
23856A703Q796N246n707j0884J6Q358j557l2186j3080J2662K1608J5680m181M166
23842A0640O631J0050k6395k7890Q310j5307N194J7739j2851k2075J8206J8846
23830h902j753K0635J5211j9405j1179o237M770J1300n391N228j1961l7508j312
23817d6504O690J6046L5290K5825P339K3985k2145l4611k181j360q716P858r678
23804b162j5442L759K370L897Q580k140k0669l770K289P846j405L5875J3048r812
23790B2264j142M830m180k5017M041L893M839J1615k6014j2394j9660Q944K7101
$$ y = [-10851, -11394, -16677, 8648, 25708, 5564, -25446, -38697, -56685, -53112, -32847, -22152, -15409, -13375, -10168, 25802, 30267, 38004, 39413, 20636, 23739, 42715, 29565, 24940, 20498, 7881, 1703, 10499, 15745, 10038, -846, -830, 7528, 5971, -26215, -39295, -26633, -5025, 10655, 6474, 10640, 17271, 27321, 926, -26964, -18654, -33961, -28767, -11028, -23879, -45954, -27748, -8902, -10655, 9980, 25191, 5786, -5393, -11630, -6860, 4440, -951, 4277, -7684, -45192, -46504, -39814, -23768, 11522, 37347, 44686, 68671, 46526, 11915, 9734, 8374, -342, 7516, -2162, -17604, -13845, -11475, -7578, 1002, -1138, -21807, -25577, -23288, -15442, -16847, 19028, 32076, 22264, 21122, 25952, 21772, -3245, 796, 4689, 9528, 21143, -4871, -17265, -36925, -27981, -880]
23777h80p457n769N913L14O874L8957K0025k3580j2598k6232O984O182k0773n753
23763a7793N910K490j8348J4439Q615J314K170J580K2689j6615j2718J0595m153
23750A75r807k6419q873M3195M9812J255j2861j8269j137K033J4982L2835q987
23737E7934l7653r044j427k11P633R083m322j2449L953J8018L476j9291k4920
23724i220J5543N023O202M29p852k2857k2556q621j253K0300P905R944K894J7403
23710A3284O928j0720j4648o87N872R834j2820j7150L533m722j0872m892K667
23697c4393P773j2149N586J4318K0648J4901J1897N787j793j0661q242J518J1470
23684B6660l278q335k2487l734k051j5888J3796J4047J1065K120o808L14O070
$$ y = [-880, -8337, -14106, -8193, -7879, -1005, 37952, 57977, 34397, 21799, -4433, 2551, 8733, -12040, -17793, -11883, -9393, -27741, -13302, -4687, -3373, -1203, 377, 23066, 6451, -6267, 4328, 175, -9632, -36051, -44924, -1729, 48083, 49338, 36477, 18208, 17071, 19104, 34086, 66921, 57934, 20281, 11237, 9810, 9599, 17232, 26315, 21993, 9544, 13497, 31515, 34991, 15700, -9220, 6323, 11346, 17548, 17977, 10125, -12732, -35288, -43909, -45162, -24862, -16957, -7013, -4119, 13284, 20212, 9492, -5156, -5843, 29, 9863, -2957, -20107, -16574, -21296, -32168, -37060, -34393, -26620, -38769, -33183, -18865, 1783, 16684, 28581, 34368, 32575, 21914, 13672, 15190, 26660, 23382, 15047, -7440, -11174, -13225, -29113, -15317, -1270, 9795, 11915, 5107, 5421, 11491]
23671A1491j3046L22k6K203L557N578K1741J5455q949k0659j5355j9599K7261
23658I974L782j0738k0332K0296K8402K724k1577j2161L390j0799k6743q41m816
23645c9439J8426J2789K1060J8215o623p383O114J1633n84k9118l2231k4224M346
23632d7019O01n669R303M709Q009m076j752R545K1185J9467l831m4235m070J2842
23618b4991K123j6940K1092p918N285K9009Q870J3645k9035r576R226l831j0316
23605a3357J6074K1619J3766L749q744j2994j6873p63j8095m961O090J0704K1183
23592A7398j8060O50K4511O174k7965m59r041j2679l103P23J8107M7407q36j6667
23578B6160j5784o925k38J2503q535k3811j8330j1715j7410J1557J1187p706K2946
$$ y = [11491, -1555, -1233, -1259, 944, 4501, 10079, 31820, 47275, 38326, 17667, 2312, -17287, 9974, 13756, 3018, -17314, 2982, 31384, 34108, 12531, 370, 3760, -7039, -33782, -34623, -39439, -21013, -8224, 12836, 31051, 24428, 17045, 23159, 34792, 34208, 5090, -27141, -51365, -47019, -46418, -52087, -42784, -38075, -30066, -34142, -35894, -26349, -5164, 14303, 10472, -33763, -37833, -24991, -22868, -39808, -18716, -26634, -21349, 7660, 16530, 30175, 1140, -8436, 790, -3041, -13357, 2717, 24336, 38102, 41851, 33107, 20113, 3240, 2477, -15618, -20579, -14489, -3785, 17398, -662, -12, 24499, 30673, 2708, 2249, -6792, -19471, -22574, -21851, -3744, 43663, 42827, 26160, 10376, 3451, 3213, 15716, 7181, -16630, -34960, -46675, -64085, -52528, -41341, -49047, -26101]
23565b6101J2331J9832J1142l7096k1181J2313L9846K3217k6656q123Q152J1029
23553A8705J643j3978j8100P73P617P022l77J1164K3215r38k3602q96j340K034
23539A2942J5907k1794j7371l844K3109j8926K5011K1470j5214k792j8483m371
23527d356j921k402K0125K6005l758m628k2808k722J7945k479j2002K40N485m883
23513G841k3916Q354J9274J2948k3209l909J10K2610n813K0132L5973m0774l9754
23500a0133k1039P975J585K860j7892m830K4560M000o695L3569O400k2872j7622
23487b0134Q547q880J1297R278J9179O740k9073p683O03j067J4129j4110l151
23474a4325K2038o36j568k3718k6277Q785K8484K3350n048K0421l775p873k3263
$$ y = [-26101, -13770, 6062, 17204, -19892, -41073, -28760, 11086, 34303, 7647, -476, 7676, 18705, 20348, 6370, -11730, -10957, -3340, 3682, 3305, 14469, 37684, 36746, 13144, 12248, 10908, 12942, 28849, 7055, -10316, -14160, 8949, -9977, 15034, 36504, 21290, 18498, 15, -4356, -6277, -8679, 11446, 37451, 33693, 29065, 6257, 3535, 21480, 19001, 6999, 7239, 12724, 7841, -16075, -7721, 11553, 24501, 1292, -2617, -2507, 20103, 14290, 34422, 70395, 29621, -10133, -31172, -23197, -21612, -18752, -36644, -41474, -16914, -12914, -19609, 13960, 20360, -2512, -20134, -11587, -20467, -9170, 108, 19287, 26027, -3046, -10729, -10126, -11193, 2936, -11174, -14325, 7713, 7077, 5509, -18209, -44486, -35701, -7217, 16133, 11085, 31506, 27731, 19858, -3405]
23461c405J2671N886J9474O725l2079q638j541J3583R569k1524J6649J1537k2878
23448F029k3584Q936o432j4188K3429J5306L768P826M5230j3659k5298j8677k0320
23435a1634n001N210k951O894J565k0633n160K8198J6408R003j2764j0878J3516
23422A1773L6091J539k3305j6199j7144O085K5351K1613r576j2933j4940P494
23410A5849j0490j8439J0864K0382Q909n479R48k8097k7810L2501N684n797J5274
23397A4299J7810j983l3928K726j0639O796K97J0429J438j1841j5062j5519k593
23384c7770J5296J8161J811N075J6641j6893o472J8779P176j9721k7684J5566
23372a0035P636J1288L739l6237N638O172N100J2363J902j0053r769Q555M463
$$ y = [-3405, 9266, 15152, 34626, 41351, 9272, 634, -907, 12676, 22245, 721, 17370, 28907, 6029, -17555, -8619, -15051, -29239, -5810, 9496, 13264, 21090, 66320, 52661, 27363, 8686, -11634, -16635, -11425, -14376, -7482, -5917, -26550, -31710, -3512, 12896, 21899, 9135, -1743, 11773, 47864, 49403, 26098, 9899, -7245, -1160, 24191, 45804, 36228, 23295, 8355, 15849, 5359, -13080, -2216, 18166, 27075, 21596, 22544, -5553, -33363, -862, 4822, -975, 14299, 32109, 30126, -3802, -1076, -11715, -4919, -4622, 5807, 7245, -4596, -19658, -35177, -37770, -22474, -4313, -2502, 2573, 19214, 2321, -4151, 14628, 21804, 2083, -25601, -10035, -2399, 8889, 12628, -23609, -17971, -11799, -6699, 5664, 7566, -2487, -12256, -3701, 762]
23359G62O905j860J6684j8234k874o614r945j2939n727J0467K9558Q202j6494
23346b109O000P223p993J88p685j1096M667L4862p001p826Q484l270q16r513k5105
23331b0990J2349J6434j9955R078k822l3942M947J4920N439q811l421j0122j1712
23318d8608Q278J5896L0427M474r213o028l3586P997o081K8179K0953R181k570
23305A9299K53j6417k5996K072j724j7276J1519L9577n683j4024j2580J753l135
23292b2362j712J3454k5442m0434j8402L0162M460J5065J642r077J9202Q752J2915
23279a1777p662j960J5080J2163P533J4619k6084k4881N364L1906j0161P43K311
23266G194j6730j2271r910o673J5944K5180O284M979j0002j265j3343R067J5463
$$ y = [762, 7667, 5807, 22491, 4257, 1383, -5231, -15176, -28115, -33842, -23375, 6183, 14385, -2109, 3891, 11114, 3121, 3309, -4376, -15472, -10805, 24057, 17056, 9230, 17714, 14444, 13628, 4115, -20990, -8641, 7793, -12162, -3084, -5906, -39848, -34901, -19981, -14542, -23353, -26774, -36896, -48608, -40330, -24434, 5993, 10467, 1254, -4774, -38360, -30363, -36444, -8265, 12688, 21869, 19299, 19552, 3135, -22861, -20789, -22513, -39789, -28270, 11307, 5624, -8400, -20980, -19227, -22362, -24074, -10620, -36062, -76496, -94898, -64736, -60276, -45211, -43569, -52646, -33444, -24692, -11777, -19439, -21399, -6319, 5844, 13377, 27996, 1912, -22969, -17605, 14301, 4140, 4883, 7194, -9536, -21807, -31717, -38390, -22446, 2734, 9018, 13997, 3995, 2730, -10613, -1546, 13917]
23253A3917k2615j3736J501q82n887j2898J7466L9233K5864k35L090j3648l0220
23240I50j2641L3082r509n690J9980K2232J577j09l6738m0235O884J2598O53P268
23226C02K8487J401K384j7604l3317j79R026J0415J538k693J0271K189k0760l2620
23212d1160J4017J2946Q033o963J3331P200j4844o381J42j4038q880K418q598
23199d2777L527K0862R390J2890J1352M936M859q223k38q590m364k5122k2376
23186d3874J0050l22K960L0406P693k4551j3950o534m860L1339K3092j1291J1757
23173A1915J1772k386k0820j6742l852m814J560J0765m269J727k5044J7155n245
23160b8278J196j6365q545K2832L580l0300J7227L5111J4588n859k986q268J628
$$ y = [13917, -8698, -22434, -20933, -21815, -27702, -40600, -23134, 16099, 41963, 41728, 44818, 31170, 950, -11691, 21391, 11882, 6192, 26172, 48404, 49981, 49872, 13134, -27101, -20217, -7619, -6966, 302, 28789, 30190, 32574, 14970, -18347, -18526, -9500, 915, 2453, -240, 10031, 12220, -8540, -41160, -27143, -14197, -6164, -13127, 204, 7404, -7440, -13821, -13679, -27717, -36597, -34179, -42777, -39250, -18388, -8998, 3892, 15244, 20180, 25039, 16816, 16578, 7988, 3624, -21498, -43874, -33824, -34146, -31186, -780, 6913, -17638, -31588, -38122, -42982, -11643, 11449, 158, 11915, 23687, 21301, 481, -16261, -20113, -24927, -23367, -12602, -16871, -15144, -40188, -23033, -28278, -27082, -43447, -51992, -29160, -25580, -55880, -38653, -3542, 11046, 5187, 2201, -6067, -4439]
23147d439K7981J6270k2399j8786k703K0424J9462L271o208j9918k56J827R442
23134B3968K706o53o306j2594o332l262m822N049L3719O506n805k9558k504L278
23120C390M141J8237J4559J1980l1924k9564k2193J588l459p762J0406K956R728
23107a7917P857j8927Q48K617K174R983P859n390j9588J3567L9507J7256l4358
23094E488k4355j05J5349Q023L650J1476q453L274m961o454P024l679j4425k6427
23080c4575K7161P02j8090k4231K489L1270J7636q592j5842L711p337J4947J8071
23067G320j1204O80p588J9372K3107J0738q947j1409J4378j2054o245N839j5092
23054H895J9628M947k44O089o845m375j3763k2329k7910J2448J6627N6044N32
$$ y = [-4439, 23542, 39812, 17413, -1373, -4076, 16348, 35810, 39081, 32873, 12955, 12699, 14526, 23968, 26674, 26021, 19715, 7121, 789, -2473, -7295, -2246, 31473, 37979, 32174, 2616, 112, 3390, 7531, 25768, 40327, 52307, 20383, -9181, -31374, -29786, -33245, -41007, -30601, -27645, -17917, -10060, -28987, -28139, -25522, -23348, -13365, -5506, -10896, -30484, -16917, 22590, 39846, 5488, -18867, -18972, -3623, 4400, 8050, 19526, 11073, 14347, 9386, 2932, 9956, 6277, -8148, -34575, -7414, -6712, -24802, -49033, -46544, -15274, 2362, -6230, -22072, -18361, -25698, -10751, 7320, -3884, -3204, -10792, 8580, 31687, 42425, 33478, 22069, 36447, 24393, 18148, 23987, 8895, 28523, 33470, 33226, 39315, 32470, 28095, 14332, -7997, -35907, -23459, -6832, 49212, 49744]
23041D9744j9735k7357n969K1660l0953p046Q757j1507j129M4819K0073j0182
23029C1175l1272J7276J9156q26m06j2632k1801J1151J2723K0799o553p1k3741
23016A4978n512q913j1161K3953J4018r537K7265L571k1222M863J0348l6764k0518
23003a4631j7117j524N666q748K893L4385J0762j3165M239j2835q117l526R106
22990a2612J9811j198j5864O128K2374N904k8538K6454J7479j7620p351J0953
22978B5920J1988j6888k2243n897K1005O979r346r400J5351J3925Q867p929k6991
22965E341j0046j1581J5681J5338j3356K0606M531o468r698J5901m924l3282j3108
22952b5065o174j2986N076J8651R044L2599j688N76j6687j0700p222K1097o511
$$ y = [49744, 30009, 2652, -3317, 18343, -12610, -19656, -10899, -22406, -23535, 21284, 41357, 31175, -97, 17179, 36335, 35509, 35103, 22471, 670, 11821, 24544, 45343, 38790, 38719, 14978, 9466, 553, -10608, 13345, 27363, 17826, 45091, 48662, 27440, 32303, 42651, 5887, -14631, -31748, -33272, -27606, -36354, -33461, 924, 11686, -1479, 2760, -10075, -18192, -21718, -12612, 7199, 6001, -9863, -3735, 18639, 24543, -3995, 22459, 39938, 22318, 14967, 25920, 37908, 21020, -1223, -7120, 13885, 20864, 11518, 2118, 17469, 31394, 40261, 32332, 5341, -4705, -16286, -605, 14733, 1377, 21983, 26514, 20046, 10348, 26249, 21325, -11957, -25065, -31239, -44225, -39149, -20498, -11454, 21145, 19457, 20033, 3346, -7354, -14576, 6521, 10]
22939A0j7004k452J6100k1805m3484q260O499L5970J3000k634l501M969J9640
22926b952L532k390J468q058l231m045Q174j908o79j542L1j9767L412r493n672
22911d3120J0025q244K732J8396L35j8499Q563J1071Q901O632k6727k810J7659
22898a5086L4709k395k5671J2006j9119r752J8014N120j6553j5433k150K1764
22886a4546L5143j4240n243q319R09J3725r133K961K2876L907o704j7242k039
22873B055J4484M18k5295j966m10j2331J0370J3952M967k0027k269K5175K5647
22860C4770R562q163k0751j8315j3244R186M871Q651L3573R889l593k6153o029
22847A4254N547p689J0776K637j1298O278K3672j4911p350q373q630k730K0674
$$ y = [10, -16994, -19446, -3346, -25151, -68635, -76895, -70396, -34426, -21426, -24060, -27561, -22592, -2952, 580, -1810, -342, -8400, -11631, -15676, -7502, -9410, -10089, -11631, -11600, -31367, -27955, -37448, -43120, -33095, -41339, -38607, -20211, -19876, -38375, -29812, -18741, -9840, -3208, -29935, -32745, -15086, 19623, 17228, -8443, 3563, -15556, -25308, -7294, -2174, -18727, -34160, -36310, -14546, 20597, 6357, 1114, -7205, -6296, 7429, -1704, 1257, 24133, 28040, 21336, 4094, 2055, 16539, 16957, -8338, -10304, -10714, -23045, -12675, 1277, 6244, -13783, -16052, 9123, 34770, 44332, 36169, 15418, -2897, -16141, -6955, -2084, 6567, 40140, 50029, 46436, 20283, 14254, 19801, 12112, 22888, 25525, 14227, 20505, 44177, 29266, 21916, 13543, 4913, 2183, 22857]
22834B2857K2825j6594K782J4017J7104k439O704j5688j0140j5572j3625k7952
22822a5721j3751J0154j3600q275J7368K004L2569l243K429R491o679J901N875
22809B0522k8981K939Q26k1998M284J4440K8716k234q117P997j1643M756K1610
22796C3117o679J867k342p511k8336K6156J7723j3820p855j6585q409J2340j4704
22783a5038L775l296m975J4181J5752J8110o409j3646j7069q617N473j3597r453
22770c4809N768L7047j0972r356M695L265K830J1573J6855j408j514j3690p076
22757C208m976r422o145J8392J7592k294L30J196l124L568J1813l0332M48K4804
22743B5058K6455o029j585j715J293k2691j7604K323j9437n72J2404J7865l988
$$ y = [22857, 45682, 29088, 31870, 45887, 62991, 60552, 67256, 51568, 41428, 25856, 12231, -15721, -29472, -19318, -32918, -41193, -23825, -21821, 10748, 7505, 9934, 19425, 12746, 14647, 20522, -8459, -5520, -4694, -26692, -22408, -7968, 20748, 18514, 10397, 18394, 6751, 11507, 33117, 26438, 28305, 25963, 18452, -9884, 16272, 33995, 20175, 12320, -4265, -12674, -334, -15038, -11263, -14559, -19534, -5353, 10399, 28509, 22100, 8454, -8615, -17232, -11759, -25356, -34809, -29041, 8006, -2966, -12322, -7627, -4362, -1532, 10041, 26896, 25488, 23974, 10284, 3208, -1768, -11190, -17335, 1057, 18649, 16355, 16685, 17881, 14757, 18325, 30138, -194, 254, 25058, 51513, 45484, 43899, 42184, 43477, 20786, 3182, 5505, -13932, -14504, -2100, 15765, 11777]
22730A1777q248j6579R520K280M828j613r360R488o868n220k0294J288l211o805
22716c9017J7134M61J0243O174P374m984q619j4204m294J775J3375j5357K760
22703b7179J116o146J63J6900P932j6589k0528K0065L471r603Q2O719J4605m754
22689a3746O743K580k3185Q21K9279j65M763o947J906N680k4321j166K0869J0897
22675A4008J4813r452r452K8327j1155J0417j0787l451n378j8468k823K7789k513
22662B1875K554k2341l6670J6718j8712N937K5174K7543R696n157l5654j7491
22650b6528R396P031K2181j0277o252O747P752N96m8070k3116J730M3997J1566
22637c247J2214K2273L5678p716l6190k1461Q723m633r057P459p668n47J7867
$$ y = [11777, 3529, -13050, -3530, -1250, 3578, 1965, -7395, 2093, -4775, -9995, -30289, -29001, -32212, -39017, -21883, -21422, -11179, -5005, 2369, -2615, -11234, -25438, -29732, -27957, -14582, -29939, -27179, -26063, -32209, -32046, -15146, -7214, -23803, -44331, -24266, -20795, -30398, -30316, -23597, -8992, -13746, -7003, -4423, -27608, -26787, 2492, 2327, 7090, 143, 2049, 7729, -16592, -17758, 3111, 14008, 28821, 19369, 9917, 38244, 27089, 37506, 26719, 23268, 17890, -578, -3401, 24388, 21875, 24429, 2088, -34582, -17864, -36576, -30639, -5465, 22078, 31774, 26617, -9037, -26528, -17132, -10101, 12080, 1803, -4449, 2298, 10050, 10646, -37424, -60540, -58810, -14813, -3247, 8967, 31240, 66918, 59202, 23012, 1551, 10274, 5641, -3416, 4043, -3625, -4172, 13695]
22624A3695j6010l817p362j4604j8713K5107N4170J6223k4566k9513j5097l5621
22612e6108j6849K0949L7555J5920k207j6064l048L5816K2432r069j1732N18q889
22599I224P557J5937j9591l4486k4002K8192n405K8864J1881k1158J1301j4623
22587f309k791P507j3376K898p935J0705J0970m345J8431J5843n330k5127k6909
22574b5768J1860L982K897K3460J1150o520N91l0777k7247Q527j306J3878K7082
22561A1809k4634j6168N817n623l471K9802J6386m547O404j3176J0881Q805n500
22548A6785J0548N696j0089j4570k2050K08k335J6874R420k1087J6276L573j1029
22535a780J8193R883k4798L468l024m755Q517N269J0012L285m013k9123j4984
$$ y = [13695, -2315, -6132, -13494, -28098, -46811, -21704, 32466, 48689, 24123, -5390, -20487, -56108, -72957, -52008, -14453, 1467, -740, -16804, -19852, 15964, 38396, 29327, 17595, 18113, 9224, 16781, 32718, 13127, -21359, -45361, -17169, -22574, 6290, 18171, -2987, 8314, -6309, -9100, -1593, -14969, -12071, -20006, -9301, 1669, -2676, 15755, 31598, 26268, 1141, -25768, -13908, -9926, -7029, 16431, 27581, 21061, 21652, -9125, -36372, -27845, -29151, -15273, 11809, -12825, -28993, -23176, -28799, -32270, -2468, 13918, 9371, 15775, 2599, 13480, 22285, 16785, 27333, 33029, 22940, 8370, -13680, -13472, -15807, 1067, 10487, -10600, 5676, 9249, -1780, 16413, 26296, 1498, 4966, 1942, -2813, 5704, 10973, 20985, 24270, 20257, -8866, -23850]
22522b3850J1461P773M912M268J8663j259j3705l6897K9344J7796r789Q692k871
22509A4538k2547K856N812n117j0296K6317L929j4306j0547n642M743J698J3303
22496D741J1765J1490j1191j9851M494N231p503Q23M4j9187j107J5195M191L382
22482B517o16L457k052n081J947P013J5531k498K437O927j9295o253j3232K5584
22468A6386O461n49l1905K729J3031m819l099j2461n598J9403K639L575J6096
22455B1889j5519j6417k6816R27J903J3407L3930J8837m571M355j4215O796K3065
22442D7571k973k0097p57P975k7725l9010K7160N079j4475n797n047J8778K0207
22429A0889k1899o334K1148J1061Q132j1880j9017J856J5916L542N244r064j8856
$$ y = [-23850, -12389, -4616, 296, 4564, 23227, 21968, 8263, -28634, 710, 18506, 8717, 17409, 14538, -8009, -5153, 659, -4458, -14754, 11563, 15492, 1186, -9361, -15003, -10260, -8562, 4741, 16506, 27996, 16805, -3046, 1448, 6679, -824, -1, 43, -19144, -20251, -5056, -865, 2517, 1901, 5358, 3306, -1775, 172, 7185, 22716, 20218, 22655, 29582, 10287, 4034, -9198, 16386, 22847, 22298, -9607, -6878, 6153, 1334, -1765, -14226, -19824, -421, 2218, 5793, 21889, 6370, -10047, -36863, -35936, -34033, -20626, 13304, 32141, 27570, 31925, 17710, 24506, 47571, 44598, 24501, 23744, 31719, 3994, -35016, -7856, -2777, -17252, -23049, -28096, -9318, 10889, -11010, -17344, 3804, 14865, 22997, 11117, -7900, -6044, 9872, 13414, 18658, 9594, -9262]
22416i262q224J6794p28M068K7724r320J79L898N778P706j6026j4824J8582l571
22402B2774j9125l035k0640j2821K2387J6018L600k9556j9600j0365Q376J9511
22390b2476Q823J0678N051J8198m2M33n746L723m633k8586j583J1513l602L366
22376d883O924k3655N685L882j7942j4465J0499J9937o344N566N849O812L308
22363A173l0323n02O452N466p13m936P728L4150J9212o157j095k0127j2876o195
22349h743j0302j169J7118R443j410L51j5128M516J9466m186l238j6065j1455
22336b0802J5413O414j4877j286j391J0486J7591q154K1139j3765j6331J8695
22324A3132Q901m489j5949j3450n504J8265N0067J3837m0456j5869j5038J893
$$ y = [-9262, -17486, -692, -1420, 2648, 30372, 21052, 21231, 25129, 30907, 38613, 22587, 7763, 26345, 22774, 3649, 614, -20026, -32847, -10460, 5558, 9158, -20398, -39998, -50363, -41987, -22476, -13653, -2975, 2076, 20274, 20232, 20665, 14919, 18642, 14009, -14577, -16160, -4647, -8249, -4883, 2041, -21614, -15929, -12047, -29989, -44454, -33955, -14018, -20362, -14796, -8947, -2135, 1173, -29150, -29652, -23200, -17734, -18447, -23383, -15655, 18495, 37707, 31550, 30455, 10328, -2548, -8743, -19045, -20214, -3096, 6347, 4937, 5288, -9840, -5324, 14142, 9956, 6718, -9347, -20802, -5389, 1025, -13852, -15138, -16529, -6043, 11548, 3394, 24533, 10768, -5563, 13132, 22033, 17544, 1595, -11855, -17359, 906, 50973, 64810, 24354, 8485, -6553, -4660]
22312d660k3J9887L972n725K616r159n677J0233K7750K993j4920j7896j9197O193
22298c613K4417j5548L910k2321l6194M3079O749k2091m960J5142J5964k5264
22286b0730J9675j153k5606k716o611O814K3742J107n122l220K5077o404l0840
22273b5987j6711K3257J2136k0355K6991n569j018J5926l809P126l029J7412P747
22260C4117k515r359k6657p111K0271L881M912M219L363j236k0353j5228p031
22247a8727o988J1395j162j6859l4974Q16J545J3232K8176J3170k6k339K209K5600
22233A5068R010k164j367K024k2801k2781J958o740j344M761K7724J7120o701
22220A3767K514M67Q414J2402j3636j7965n486n649r568j840J0094K6477P360
$$ y = [-4660, -4683, 15204, 19176, 13451, 16067, 6908, 1231, 11464, 39214, 42207, 27287, 9391, -9806, -3613, 20804, 5256, 9166, -13155, -49349, -6270, 479, -21612, -26572, -11430, 4534, -20730, -1055, -2208, -27814, -30530, -37141, -30327, -6585, -5478, -10600, -13820, 11257, 4853, -25987, -42698, -19441, -7305, -27660, -669, -6238, -7256, 8670, 4861, 11987, 8958, 26370, 34117, 31602, 22243, -4414, -11525, 8746, 12627, 17539, 21758, 25121, 23885, 3532, -11696, -18727, -25715, -14320, -15482, -32341, -67315, -66499, -64954, -51722, -23546, -10376, -10402, -12741, -10532, 15068, 24078, 21914, 20547, 22571, -230, -23011, -21053, -27793, -29137, -24376, 3348, 20468, 13767, 16281, 16748, 25162, 37564, 23928, 5963, 477, -5172, -14740, -16580, -6486, 19991, 27351]
22207B7351k7040j3444R463j4149k3649J4618R938K1335P938J035j1968O9J4236
22194A5733m883k7424l199O635k158q963K2004J0173o26P915p834k6181p337j3144
22180c9289J832j0311J4595K1606j277j5454J1981K437K136M483J3587j4019l3805
22167d1498J5528K8290R765j4374J9002K5136j1748K238M636r810j2781p698j622
22154E064k6763j9324K330J6504J5587J2022J7474j2311k1965p62J4402N35r083
22141f290J0355J5349j1347l197K531J3149K1364j0858j3484N290k2149k5034
22129b4321l310J4053j1250J1277o697J2969j3049O235l378M855K8449J0085k3555
22116B363j649q886j3880j995j9244l097J6961J3530K1946O000j6778l361k2959
$$ y = [27351, 311, -13133, -3670, -17819, -41468, -26850, -16912, 4423, 12361, 13396, 1428, 1497, 15733, 10850, -16574, -19773, -13138, -15296, -24259, -2255, 7918, 7292, 15207, 7373, -18808, -26145, -39289, -37457, -47768, -33173, -11567, -12844, -28298, -16317, -13880, -11744, -7261, 6326, -7693, -41498, -25970, 2320, 12085, -2289, 16713, 41849, 30101, 32339, 36975, 27165, 14384, 6686, 5064, -21699, -41023, -38693, -22189, -6602, 5420, 22894, 10583, -11382, -12144, 2258, 2793, -6290, 4065, 19414, 8067, 4870, 7401, 20550, 41914, 31056, 17572, 22862, 713, -24321, -27631, -13578, -24828, -13551, -20248, -7279, -20328, -14093, -17471, -12616, 15833, 25918, 2363, 714, -8172, -22052, -24047, -43291, -46388, -29427, -15897, 6049, 12049, -4729, -8090, -31049]
22103c1049j3988N88K6101J1170o303k290P135j364R903O192k0160R133K1472
22090A6540L202j71L930n936O192O651K616J0357k1796l0633m452m555J0935J6376
22076I256l944R257M750Q598o146q414j0049k6457j3672Q051n989J3844K3887
22063B972k779o290j1878k1625M52K3527J0870Q960K367L947K072k6860K1589
22050G324L5886J7814L016l7566k2946j7473j6055j0533J4519m8j2009L7688J9157
22037A8774k0757l0736K9108K2087J2117J954j3655j7635m5063m513K4599R641
22025a4079q886Q235J114j3490N900J8565J1795J4911N37k0183l2257N183K6637
22012C982L4631k2463j5525L870J805J736m844p156o367j8472n998o437K5354
$$ y = [-31049, -45037, -44449, -18348, -7178, -13481, -15771, -8636, -10000, -97, 6095, -14065, -4932, 16540, 19742, 19571, 23501, 17565, 23757, 30408, 33024, 43381, 21585, -9048, -13500, -18055, -7120, 9256, 5312, 14569, 19319, 27917, 21771, 13357, 3308, -23149, -36821, -28770, -34759, -20915, 2972, 193, -6097, -17975, -39600, -39148, -15621, -4751, 4209, 6576, 10523, 12595, -14265, 7324, 43210, 61024, 64040, 26474, 3528, -13945, -30000, -40533, -26014, -26062, -38071, -383, 18774, -1983, -32719, -3611, 18476, 30593, 32547, 18892, 1257, -43806, -48319, -23720, -14079, -22965, -14730, -13616, -27106, -21206, -2641, 9154, 24065, 24602, 4419, -27838, -22655, 3982, 38613, 16150, 625, 4495, 6300, 8036, 3192, -3964, -10331, -28803, -34801, -41238, -15884]
21999a5884Q551k1567J1021J9801o475l548j8043Q094M268J7690Q787N119k5978
21986h164k1153q928L353M983J3835J0398O766l858r586L366l652N404L4281j0929
21972A6116j6655N471n475M612L263Q930j5903j5165J273J8025J3370Q932j4963
21959A1831J0814Q965p810J6126j0624k7209J3635l899l3986j4002k3704K4375
21947c5488L5933r367j0258L8145N459O674j2244l208j629q21j667O72k1154l7160
21933d6113L479K5578J7454l113p317J5909O859n186m821j8180J0289m264j1290
21920b0716J3442J7824l5705k3487O439P577j6165j9315J166J1172K4391l589
21908c6966M593J8792O841n012j6210k6959n566j0826J1192R024J3202n733K365
$$ y = [-15884, -7333, -28900, -17879, 1922, -4553, -8101, -26144, -18050, -13782, 3908, 12695, 17814, -8164, -29317, -38245, -34892, -29909, -16074, -5676, 1090, -2768, -12354, -8988, -12640, -7236, 27045, 16116, -539, 4932, -543, 4069, 7332, 16262, 359, -14806, -13533, 4492, 17862, 26794, 11831, 22645, 31610, 23800, 39926, 29302, 2093, 15728, 11829, -22157, -36159, -59863, -35488, 445, -8922, -19180, 18965, 24424, 31098, 18854, 15646, 14017, 13196, 11529, 12201, -8953, -46113, -42634, -17056, 398, -2715, -10032, 5877, 12736, 7550, 2729, -15451, -5162, -9426, -20716, -7274, 10550, -25155, -48642, -42203, -34626, -50791, -70106, -68940, -57768, -33377, -36966, -32373, -13581, -6740, -11752, -27962, -54921, -60487, -71313, -60121, -51097, -37895, -43628, -41263]
21895d1263J7682L27J202n39j7151K3990L0336R8k6128l155J0609J6845L467m4554
21881b8234J3343K2094k7037J0561L2889K8920J6738k3478n1963j7948Q553Q917
21869f645N462R935p35j1571k9239m256K6794j6212j2750K5622R427j4586k0515
21856c9269j2911L021J8000P741o738J9328o595K4696j3290J2247j1950l8209
21844d3929L909L0043K7885R691j0497p894J1277p849n127j9600O436O476j1876
21831a1055k882J0749O746j3978L116L533N568R93J4497M407P777K07M30r760
21817B0348N983J0253n493n748o150J2221J266l1663j6467P306p143l36K561j2477
21803b5539J1600K736L6522J6517j6029j4125l2665p580M661J2366q091J6313
$$ y = [-41263, -23581, -23254, -22052, -22591, -39742, -15752, 14584, 14682, -11446, -14601, -3992, 12853, 16320, -28234, -14891, 7203, -19834, -9273, 23616, 52536, 69274, 45796, -6167, -24115, -15562, -6645, -1183, 8752, 8017, -3554, -32793, -37049, -10255, -26467, -39217, -13595, -4168, -18754, -39269, -52180, -49159, -31159, -23418, -30156, -10828, -17423, 7273, -6017, 6230, -5720, -43929, -40020, -9977, 17908, 27599, 17102, 9208, 20485, 12636, 7509, -12091, -5655, 821, -11055, -13937, -3188, 3558, -10420, -7304, -3771, 1797, 2790, 17287, 21694, 29471, 29678, 30108, 20348, 26331, 36584, 31091, 25343, 19193, 31414, 32680, 1017, -15450, -8144, -15287, -15623, -13062, -25539, -13939, -11203, 25319, 41836, 25807, 11682, -20983, -28563, -23902, -11536, -19627, -3314]
21791c314m061Q255K3910j0711k3955j0124N146j4214j4914J355K312J0324J6818
21778a3173J9142j3584j1520KL028q70l371L005K2807K3046n292k1121l0624K423
21764b6102K3847J6623m65j6530n113L885j6049J2860k12r473J4462R511L054
21751A0298o149K0461R201J246j0613l508k0867j7599J3165R548J2246j3875j0240
21738f686J616J2743j4842j8237L1354O584O054l5252j6453j0037J9821K3750
21726D15k3236j2098J0548J9789K2785j352j7274M505P849J245J5044k2543J8630
21713B4307r598n960j1785L084q816j2428J2852N646j4639K2277M083j5697M240
21700b434J3884K1727k2694j2413J0829k8725K3317O711j6611j1833j2559l478
$$ y = [-3314, -7375, 880, 24790, 14079, -9876, -20000, -14854, -29068, -43982, -42627, -40315, -29991, -13173, 5969, -7615, -19135, -19133, -16105, -16975, -20346, -17341, 5466, 28512, 23220, 2099, -28525, -26102, -2255, 14368, 13903, -2627, -7740, -3855, -19904, -7044, -7256, -16729, -2267, 7244, 10298, 4149, 24610, 33811, 35057, 24444, 20936, 69, -17530, -4365, 5183, 17429, 3554, -6686, -5070, 7673, -7169, -25406, 5948, 12532, 18586, -16666, -33119, -43156, -23335, 415, -22821, -34919, -24371, -4582, 18203, 16851, -423, 4082, 11931, 13176, 28220, 5677, 24307, 14709, 8749, -3036, 48, -8768, -21196, -8344, -2698, -17337, 4940, 9023, -6674, -2434, 11450, 33177, 10483, -1930, 8899, -19826, 3491, 10202, -6409, -18242, -30801, -34279]
21688c4279L6768J3695j5350j4029J0693j0144N022M56L734J2489k3778l776J8748
21675B49Q132n885j95Q929k5521R70P933L060N856k549j0759Q921J0077N377p228
21660G367j0542n982Q754k5719J5767K7282L158n18J6023p651j2901j2882M770
21647F926m45J2441K981j9524M923K1007N835J70j6575K094j3013o494j7710l1268
21633d8652K5629J3021J9533J5713j1874j6000j2282J4379P096N485J5276O357
21621C3681j9126k2957j506K9317q70k2123p538O375K7873L371q916j8117J2806
21608A2270j1959M544k0762J284J774n439L534k616j1386k949j6137O766K5333
21595a5743J8295p649k1482N320J2188M338k423N921j0155n044m171K632p106
$$ y = [-34279, 2489, 16184, 834, -13195, -2502, -12646, -7624, -7168, -3434, 9055, -14723, -18499, 249, 8381, 2496, 2301, 11230, -14291, -13321, -5388, -2328, 3528, 979, -9780, -859, 9218, 14595, 7367, -3175, -9157, -403, -26122, -10355, 16927, 20085, 19567, 35590, 27939, 15038, 2156, 6926, 6481, 18922, 21903, 2379, 7302, 28309, 34144, 34314, 17739, 19833, 6820, 326, -17384, -48652, -23023, -10002, 9531, 25244, 13370, -2630, -14912, -533, 6563, 12048, 27324, 33681, 14555, -8402, -9908, 19409, 18539, -3584, -11122, -4747, 23126, 26497, 17581, -536, 12270, 311, 4855, -15907, -14623, -12849, -18288, -14754, -17370, -28756, -31705, -47842, -41076, -15743, 2552, -5097, -26579, -21259, -9071, -4733, -7156, -1235, -11390, -16434, -20605, -17973, -25079]
21582b5079q349J0226J7235j5080j825k0798o621J4278P235j7040j4660J1725
21570d8753K9878J9563P526m0605k426L005j1765n269p563J0469J4826J7414n058
21557a8758k907J405q028l7235M391L2509J9334K5757k0j1293k7368O764K4724
21544I275K9596J3452J2474l2776k9684l823k515n516m43P706Q332J3191J872
21531B1141j682j045k0654k598J9737j2211j6826o873J0528L6274J6018k327j7111
21518B2371k3493l239J741q258Q212O550j4635l0121j138K8653J4355k3410n101
21505b7513P226p06R277J0872k6051O692m240o141J7310k9464k4907J9147J663
21492d6835j0718J0894M828O278K1234j0094j1268l774K1896K0165J2707k454
$$ y = [-25079, -33428, -23202, -5967, -21047, -22872, -43670, -50291, -36013, -28778, -45818, -60478, -48753, -18875, 688, 8214, -32391, -34817, -31812, -43577, -48846, -56409, -45940, -31114, -13700, -18758, -21665, -20260, -28288, -65523, -61132, -28623, -9289, 16468, 16448, 5155, -22213, -15449, 9275, 38871, 52323, 64797, 32021, 2337, -1486, -4001, -9517, -9960, -2254, 6078, 19269, 21141, 19459, 18414, -2240, -4838, 14899, 2688, -14138, -21011, -10483, 25791, 41809, 39482, 22371, -1122, -4361, -2620, -10878, -2666, 3884, -10751, -40872, -42010, -13357, 998, -22412, -27513, -20287, -20993, -11716, -844, -26895, -20203, -24443, -30584, -13274, -42738, -67645, -48498, -46835, -57553, -46659, -41831, -35553, -14319, -24413, -35681, -39455, -17559, 2606, 15313, 12859]
21480A2859p76j778j6006j7625j0982J4302k35k5847j5435K0480P527n936N130
21467c4322J2426P741j344M427j7200q679O103K027p690J010O376J7424K1921
21454A0220j1485j1793P555j048l8711p969Q24N907K6712K3769l418p430J1341
21441D474Q873K532l5468K478J6050J12J626P577j7996j7099j603j6058K8523
21428a5979K6280k8915r512K620J6834J3460J3305p192l372m66J837j863j0030
21415b993N102m141J154R457m590j4776r798J0203R850L517N735P852m113J4207
21401B6666l863k6485p776k2083j3135J0102j16K0865p275l4451p845M7355L5189
21388A7148p45j4763q468M964J4756n158J0027m828j4972j3914P079L800K4974
$$ y = [12859, 12083, 10305, -5701, -23326, -34308, -20006, -20241, -46088, -61523, -41043, -33516, -39452, -34322, -21896, -14155, -15499, -11072, -28272, -36951, -30848, -28821, -36511, -35501, -29125, -11701, 10220, -1265, -13058, -5503, -6551, -45262, -53231, -52407, -46500, -19788, 3981, 563, -6867, 4474, 13347, 15879, -19589, -17111, -1061, -949, 677, 8254, -9742, -26841, -28444, -44502, -15979, 10301, -18614, -28126, -25506, -8672, 4788, 18093, 10901, 7529, 7063, 8900, 7037, -2993, 2109, -2032, -878, 8579, 3989, -10787, -20585, -10382, -532, 2985, 8720, 16572, 12459, 26666, 22803, -3682, -11458, -33541, -46676, -36574, -36690, -15825, -23100, -57551, -65396, -18041, 17148, 16403, 1640, -6828, -1864, 12892, 7734, 17761, 12933, -2039, -15953, -8874, -5074, 19900]
21375A9900R083k9083l8912M862P820j7911q292J9055J4229Q453J8733P646J7457
21362C3040o030j4457j3996q947J3640L1657J3937j6301k7177K1806N875l206
21350B9841r416j0890K743k868j7346K2325J7779J3417p26k84k0554q991K264
21337A7294K622J0520k5650l7800L9176K4527Q604k3421n121J3091Q49M816K002
21324C1509k804m599l466k391J183j6496J2123J0171m726j6747L857n134J3132
21311A5612O60o718J3034m16m0567n7L34K852P50O322p668l678J9362K840L246
21296E908p295N09L224k1527r063N864P405J8710J1532k2389K546J6608p286q052
21282c306m321K8987J057k1278k2247n683K575L4707K639j6398j2623K0437q944
$$ y = [19900, 28983, -100, -39012, -34150, -26330, -44241, -52533, -33478, -19249, -10796, 7937, 15583, 33040, 27010, 12553, -1443, -10390, 3250, 34907, 48844, 32543, 5366, 27172, 33047, 29841, 20425, 9535, 12278, 9410, -7936, 14389, 32168, 45585, 44859, 44575, 24021, 15030, 17294, 19916, 30436, 4786, -33014, 6162, 30689, 39293, 15872, 10751, 23842, 24691, 29507, 31509, 28705, 24106, 20640, 18249, 19432, 2936, 15059, 25230, 20504, 3757, 7614, 2480, 15612, 16272, 9554, 22588, 22172, -18395, -18452, -18118, -15266, -14516, -8194, -15862, -19540, -178, 2662, 5908, -1387, -878, 2346, -19181, -28244, -22380, -14975, 3735, 15267, -7122, -4576, 12032, 4746, -3306, -7627, 21360, 22417, 1139, -21108, -26791, -24216, 10491, 13130, -3268, -15891, 4546, -4398]
21269d398r790K52L1147K1522q539k1873j0733j1296k5794k3784L529K1265J6952
21256b1540p430n983r571M570J3838J5370o21j2789L6486K2877r780n0739R289
21243a6023J1589r620O342j1276J2762J3210R215J7094o835o029J6150n975k3819
21230F785P449J0936j2132j3070J4896M346r760l989j4512K6793J2355j3710j2855
21217C532n263j3218p578J5762J9440k2816j6608M652K081P609m099r257R910
21204a5853Q299r925P601Q287l650O658J1129l577j3568P15Q074k7437j1082J0649
21190b3680K0224L6799o469l3751j980J5224L1067N198l3570L013J791j6309N294
21177B851J5041j1535O383q844K737k651m155M394P870N990J1646p624j2973J8709
$$ y = [-4398, -14188, -13936, 17211, 38733, 30194, 8321, -2412, -13708, -39502, -63286, -59757, -38492, -21540, -28970, -34953, -44524, -39954, -26116, -10746, -11367, -24156, 12330, 35207, 25427, -25312, -16023, -4434, -14054, -7712, -18988, -6226, 6984, 16199, 33293, 26458, 20429, 36579, 30604, 6785, 14234, 25170, 13038, -32, 14864, 19210, 9450, 5461, -9051, 17742, 30097, 16387, 3532, -1731, -14949, -22527, -6765, 12675, -10141, -26749, -22097, -20016, -12407, -16506, -25763, -15853, -7554, -17479, -9878, -1591, -5241, 1417, 12546, 8969, -4599, -3884, 4190, -23247, -34329, -23680, -3456, 33343, 26874, -6877, -8857, 6367, 37434, 42632, 9062, 12075, 13866, -2443, 2851, 17892, 6357, 12740, 3896, 6633, 3982, -173, 4221, 12091, 18081, 29727, 22103, 9130, 27839]
21163B7839p570l5330j338r711j4930m773J2197K7985m875j2236O534J442k2440
21150c7206J1091K2406J0728j0992j9878J0807k493K58L710M404n466J5038j5042
21137a2635k9356J3620k973K7411J2499p941r171J823k892J0428P047J6873O158
21124C0891N799j5209k1368j3782K0477J7990M740r832j5294O905M004o897K3101
21111C1525n780l8323p437Q801j137o703k8641m444j9827J5874M0220J9900K0874
21098B4902J264k6232j9538q684J8552j6553k4370K6272J8389K0016j7459j6854
21086b0295P749J9092Q578n506n981J4680J6490r123k7k4572o954L062L9871q354
21072B8710j8089j2093M981n616M846L964J0423R528Q052j2409l1143k162r682
$$ y = [27839, 20269, -15061, -16399, -26110, -41040, -45813, -33616, -5631, -10506, -22742, -16208, -14766, -37206, -26115, -3709, 7019, -3973, -23851, -13044, -15537, -15279, -11569, -7165, -12631, 2407, -12635, -41991, -28371, -31344, -3933, 8566, 625, -8546, -6723, -9615, 813, 7860, 24733, 30891, 36690, 21481, 113, -13669, 6808, 24798, 29538, 19706, 4412, 11317, 15321, 8424, 31525, 25745, -12578, -20015, -11214, -12351, -19054, -47695, -52139, -71966, -56092, -15872, 4028, 24902, 26166, -66, -19604, -28288, -9736, -26289, -50659, -24387, -5998, 14018, -3441, -20295, -12546, 6546, 15124, 9618, 3637, 18317, 34807, 25684, 25657, 1085, -5869, -2807, 37064, 28710, 10621, -1472, 3509, -2107, 2739, 6703, 17126, 26654, 34706, 22297, -8846, -11008, -20690]
21059b0690M775l169J9098L0902k119K5242J307m4116l4692J5962J2161J204q391
21046b526n276r364J404m844M60K3271L115j9947j266j2446k576K044L2373N527
21032I949j1794J026J6741M378l046j9629k629M326k173j1939q611q183J7082
21019a4502J9723N003k6429J2100K2065R682J7400j3587o156q668l3442M472K1532
21006I193k7277j0441O9O09J2646J2091k0206L954N069n687J9413K0276Q471j3853
20992A4327n13k2592j8875K5264J0849j3647k7081j0283K2646J6078k0713k2874
20980d7414J4747M836O811n794k9605P0K3195J1575j1181j9804L1314L3374j4340
20967b216M512Q179l853Q377J1978Q99k60J7866j7524k8837J5320J1200j2046
$$ y = [-20690, -15915, -19084, 14, 30916, 28797, 54039, 55346, 11230, -23462, -7500, 4661, 5865, -2526, -7802, -17166, -15762, -20606, -20146, 3125, 6240, -13707, -14973, -27419, -29995, -27951, 4422, 9949, -1845, -819, 15922, 20300, 17254, -2375, -5004, -678, -2851, -14790, -23401, -31584, -14502, 5221, 10224, -16205, -4105, 17960, 27642, 45042, 31455, 25299, 16631, -16811, -12339, 9193, -18084, -28525, -28456, -27847, -15201, -3110, -23316, -19362, -14293, -19980, -567, 19709, 28180, 14327, 13814, -8778, -27653, -2389, 8460, -5187, -32268, -42551, -19905, -3827, -24540, -47414, -32667, -27831, -21020, -26814, -56419, -56349, -33154, -21579, -32760, -52564, -21250, 12124, -2216, 2296, 10475, 6622, 14999, 26977, 27876, 27616, 45482, 27958, -879, 14441, 25641, 13595]
20954A3595l1264q858r63J03J018J8014l244n176K605l316M836K4248k8082n758
20940b2242J6910J3732M404O855P282j7805j7935k0318P100k91q647J682o155
20927c5428j6596J670J3710j5856K1476J9614N352P209K0782l665L639J3369k107
20914C3169j8954k4386J2302J1673K633j3061N79p31O07J1748K0003j6639j8449
20901D94m173k3382r635O707j693J4823J9868j8314j6312j2572J2421J8111N34
20888a3123R46J4918P866j3133j4261J2443j1181J069L8455J9436j973j2564n154
20875B3744o763j3826O437j1562k2859K3882M338j1214j0357O842P30n337M676
20862a1269K4487J7606l35P096J708k127R565j3847j6003j3898M100J4502J7773
$$ y = [13595, -17669, -26527, -27490, -27387, -26369, -8355, -11599, -16775, -14170, -17486, -12650, 11598, -16484, -22242, -5332, 8400, 12804, 19659, 26941, 9136, -8799, -29117, -22017, -22308, -30955, -29273, -35428, -52024, -50354, -36644, -52500, -31024, -11410, -6058, 1151, 21933, 18268, 21907, 35276, 33169, 14215, -10171, 2131, 13804, 16437, 3376, 3955, 3224, 3831, 15579, 35582, 18943, 494, -3679, -27061, -36696, -29989, -31682, -16859, 3009, -15305, -31617, -44189, -31768, -13657, -13123, -12177, 2741, 10607, -2526, -16787, -4344, -15525, -14456, 23999, 43435, 41462, 28898, 23744, 16981, 3155, 9592, -1970, -24829, -947, 3391, -7823, -18180, -11338, -10608, -15945, -11269, 13218, 30824, 30489, 37585, 39293, 37166, 46731, 32884, 16881, 2983, 7083, 21585, 39358]
20849C9358L463k3538o625r903r608p532l948J1600O439K0582J3214K7060J1979
20836G2541k0562k3870l1523J92J2630k0930j0177L857k5277J222J3540K3264
20824e093j438m882j1619K532k937R117P40o001K245J4737j4798j7066J8192J4974
20810a297O973o006N80j0310o783J483J6779L766n956K2627n391k7037j9367J9463
20796a0476j2758K522K5250K8489L540k0718k1864o587J1564l9286k590J6363
20784b6551J125L136K585r008l049j1970K7326K0699O747j6214M851J1811k269
20771I219k2683k32j3262K008k0337k241k094P613J4024J5303J1562k0920j7808
20758c9848j0367m075L0429K1547j5830k1658N986K254K1785J6620n882k2288
$$ y = [39358, 42821, 19283, 12658, 2755, -6853, -14385, -18333, -6733, -294, 20288, 33502, 60562, 72541, 51979, 28109, -3414, -3222, 9408, -11522, -21699, -17842, -43119, -41897, -28357, -5093, -6531, -11413, -23032, -20500, -23437, -14320, -13580, -19581, -17336, -2599, -17397, -34463, -16271, -1297, 5676, -330, 250, -10060, -16843, -15360, 1419, 5185, -771, 21856, 16465, -10572, -29939, -10476, -23234, -20712, 4538, 33027, 36567, 15849, -6015, -12602, -1038, -40324, -42914, -26551, -25426, -22290, -19705, -28713, -31762, -43732, -16406, 4293, 11040, -5174, -323, 11488, 9219, -13464, -13696, -26958, -24950, -45287, -47528, -49622, -42009, -27985, -12682, -1120, -22040, -39848, -50215, -54290, -23861, -2314, -18144, -39802, -33816, -31562, -9777, 6843, 961, -21327]
20746b1327p706J2789P535j308N590R747K3441j0892j5389O411M493N610j609
20733A7385M685j4513k1205j3008J395n660k0779p003M974J0695L6551L3075J9218
20720D5810k8023k3027K803j1881r907Q632j592P22k2947J7365Q487P285N488
20707g85j4639j8709L864M246J4026J1183l818j4270P02P839J0497K5215l950
20694B1401j5896J3579J644k1663k5436J973O713k78J3543O561p527J0756N486
20681A0856l4963k2354K8935K6272N874k88j3192k1749j0282j5596q035P153J7402
20668b9967K2151L689k9822j027l141P483K3512J0899o665J5418p070J163K6976
20655C3599j0550j5307J0685Q018J757j3357l4325J4061J3621q92o248k2690n365
$$ y = [-21327, -29033, -16244, -8709, -10017, -4427, 5320, 28761, 17869, 2480, 8891, 13384, 18994, 17385, 22070, 7557, -13648, -26656, -25261, -30921, -51700, -58703, -53729, -43034, -6483, 26592, 45810, 17787, -5240, -2437, -14318, -24225, -15593, -17185, -16463, -39410, -22045, -13558, -6273, -785, -15424, -34133, -30269, -26023, -11997, -814, -4632, -18902, -18200, -10361, 136, 25351, 21401, 5505, 19084, 20728, -935, -26371, -24398, -17685, -17963, -4420, 2141, -5386, 5370, 10856, -24107, -46461, -17526, 8746, 14620, 14332, 1140, -20609, -30891, -46487, -54522, -47369, -29967, -7816, -4127, -33949, -34976, -38117, -30634, -7122, 3777, -2888, 12530, 5460, 6623, 33599, 23049, 7742, 18427, 26445, 28202, 14845, -19480, -5419, 8202, 7310, 1062, -21628, -26993]
20642b6993J201J3932K3355O934o880Q963K0851q064N523j3445j7474p769J6241
20629A6375k0487l5993O003K7353m433L019r675Q24J0490O709l631M223M464j1985
20615f744o173P038k657J885L733Q363j7943l758n541J8461K5582k6974q09M927
20601f10m173j138n723j8779J5048L0190L586J8682p200m877j1981n857j153k6278
20587b0263l501J4904M264l0992N746K0791J4417J086J1504J9146P3l968k3486
20574I721J0111K1995k6304k8858J802N026J3440J0691j1923J1092L0205j0697
20562C6301j6936o230P077Q298n258k003j1891k5686J9685K0028j1853k6129l0336
20549d4933K705J8070K208J542J2703o400Q235q445J5970o943q34K528j7429q224
$$ y = [-26993, -25792, -11860, 11495, 18429, 11549, 20512, 41363, 33299, 38822, 25377, 7903, 134, 16375, -4112, -40105, -34102, -6749, -11182, -8163, -17838, -17014, -6524, 185, -3446, 777, 5241, -6744, -12917, -5879, -8536, -6651, -2918, 5445, -12498, -16256, -21797, -3336, 22246, -4728, -5537, -610, -4783, -5921, -11644, -30423, -15375, 14815, 18401, 37083, 29883, 25006, 13025, 7168, 6015, -20263, -23764, -8860, -4596, -35588, -29842, -9051, 5366, 6452, 17956, 37102, 37175, 33207, 9721, 19832, 41827, 15523, -13335, -11533, -6507, 6933, 17624, 5701, 16793, 46998, 36301, 19365, 13135, 20212, 28510, 23252, 21249, 9358, -16328, 3357, 23385, 11532, -14597, -44933, -42228, -24158, -21950, -20408, -7705, -14105, -5870, -14315, 1655, -5288, -6122, -3594, -21023, -29247]
20535b9247Q052k131JP092K2629j7332J0711n23O840J9837J7005j3676r621m0232
20521b0595l5717l548j1697J4040K7586K078j8845J5725K4811r998O13j342j0707
20508b7596Q149o070o882O161R798n758o069J900o742j693K8142K5856j2324j3557
20494f685J3400K3313r606P608K7856q18J138j5273l6q432K1549K6030j8253k5867
20480C5924n364p865J7815M868j3692K325j686P181K7374m636l643j4185k1571
20467B2845j7105n706j2417J2196j2332j8586p698M508J1969o619N131L688M695
20454a5431l320K6187k801k5007j4216M803R891J2939o396L7152J1044j8529l6682
20441b0366r023l80j4175K007J3313L3681K0974j4307j8680k442K7334l58j0606
$$ y = [-29247, -21195, -23326, -23325, -16233, 6396, -10936, -225, -748, 6092, 25929, 42934, 29258, 19637, -20595, -56312, -59860, -71557, -57517, -29931, -27853, -46698, -30973, -6162, -16160, -15547, -16889, -27596, -19447, -25517, -32399, -26238, -16440, -22198, -28267, -26367, -33109, -34802, -6660, 19196, 6872, -6685, 6715, 30028, 20422, 28030, 55886, 55068, 56206, 40933, 40897, 32465, 54014, 80044, 61791, 35924, 30560, 22695, 40510, 45378, 31686, 34011, 32325, 39506, 66880, 62244, 58601, 44416, 22845, 5740, 34, -12383, -187, -12519, -31105, -38803, -34295, -22326, -28945, -23814, -20126, -15431, -18751, 7436, 4635, -20372, -34588, -29785, -19894, -6955, -13351, 23801, 34845, 16316, -20366, -29389, -29769, -43944, -41937, -28624, 5057, 26031, 11724, -6956, -9398, 17936, 17578, 6972]
20428F972k0840l580Q782m767K1396R066j7807R16J8908q35L1115p60j3994l9881
20414e309o088K292K1753K2968l980l194j484k1452j0071j3671k2960Q444N8124
20401B5372J3629L650j6260k8889k8123k385R501K8567J253j1593j4390k6866
20389d6534J5474N963K2175j435p031k7731p925O247K2447O529j3015J1886M344
20376h606q74r820k0119Q831J6855L0997L767P363K6941m363k7443j8568J4810
20363A9771j1911J3516M108o895M003n193k834m349J684J9148P232l9652r960
20350a1332K5936J3508j0636j4521q656j5402O441Q698J4101k829J1929J323j3443
20337E117J650M042k030j1465M402O111m920j3767K1299P148j713j004k2897k9350
$$ y = [6972, -13868, -17448, -8666, -13433, 7963, 17029, -778, 138, 19046, 18211, 49326, 48566, 34572, -5309, -11397, -9105, 12648, 35616, 31636, 28442, 26958, 5506, -4565, -18236, -41196, -32752, 25372, 39001, 42651, 26391, -2498, -30621, -33006, -23505, 5062, 6315, -5278, -19668, -46534, -31060, -25097, -2922, -4357, -11388, -39119, -47044, -40797, -18350, -11821, -24836, -12950, -8606, -9480, -19300, -39419, -30588, -13733, 17264, 21031, 28394, 55335, 50972, 23529, 4961, 19771, 7860, 21376, 25484, 18589, 22592, 17399, 14565, 10216, 11900, 31048, 38280, -1372, -11332, 14604, 28112, 17476, 2955, -5701, -21103, -14662, -5964, 8137, 5308, 17237, 18560, 5117, 6767, 10809, 8779, -2686, 1716, 7827, 2907, -10860, 10439, 17587, 15874, 14870, -8027, -37377]
20323c7377K3118J8520K1816p708l170R961j5779r153J3760j1j0941j039J9504
20310B1501K0220n123j6266j9647n699L874j459j2012j1516O672k2360J7474j0473
20297c4814l0860L830O585J4961K0696R740j609j7581L2860O876j0948J616K408
20284C760J2458R322j4171P13J1487m900Q849l261M371p110r163k0170J3089K0293
20270B5567J3140k1113n913K650p982N953R226O778k0614r944k174j8347n93k5
20256b3391J0695N68Q943J0169R74J908L019k9788j7905R626j5702Q68q944L930
20242d5030K0275q985M603L062j9331J9131J7634k0297R631J2266Q071N442N278
20229A1750o170l0173j0369J0410l447j8177k61L1966j6341j9910o76J7275P567
$$ y = [-37377, -14259, 4261, 26077, 18369, 15199, 25160, 9381, 228, 13988, 13977, 3036, 1997, 21501, 41721, 36598, 20332, 685, -5014, -1140, -2599, -14611, -26127, -19455, -41815, -24341, -34814, -65674, -61844, -55259, -40298, -19602, -9862, -11471, -29052, 3808, 10684, -264, 1352, 3760, 16218, 25540, 11369, 12082, 23569, 18669, 27518, 24257, 28628, 21518, 12355, -7815, 5274, 25567, 38707, 17594, 11681, 14331, 6349, 12302, 21528, 28306, 7692, -2252, -4426, -22773, -23366, -23391, -12696, -12128, -3185, 6984, 7958, 9866, 12885, -16903, -34808, -25182, -40884, -40016, -48960, -45030, -24755, -33740, -29137, -26075, -45406, -26275, -8641, -28938, -19307, -7041, 1030, 6472, 11750, 5580, -24593, -34962, -24552, -27999, -46176, -46437, -14471, -30812, -50722, -51398, -34123, -26556]
20216b6556J0390L966j7500r110m599K7410M0916O68N259R233l9893l6464K654
20203c3626J7470M820O687K0135j1174J019n190J3160R792j7424j2709K4490l652
20190A3798k1345J7235j384m5813k0117K0090L7048L682r490j267q82q62L450
20177e857J6492O14P021l653j9581l6497l744J2655K241J7563K5710n613j0733
20164c382j955K6277J1601n7155l4647L7041M9849m922N296o637q674k2813r877
20151a9998j3720M2384j59k7800j4603J736J9821K7211J816N744p209j1800m4992
20138d1569M084r6O004J6954j8180k4291L390M52K2277K0134n277l811l865o469
20124c0263Q273q018K272R975j8002O105O656R145N511J0369M352l634j0511k559
$$ y = [-26556, -16166, -12200, -29700, -38810, -43409, -15999, 24917, 25585, 30844, 40077, 184, -36280, -33626, -16156, -11336, -4649, 15486, 4312, 5331, 141, 13301, 23093, 5669, -7040, 17450, 13798, -7547, 9688, 8304, -37509, -57626, -37536, -488, 3194, -6296, -7563, -8445, -9307, -5857, 10635, 11249, 18270, 14617, -4964, -41461, -45205, -32550, -30309, -12746, 12964, 7351, -3382, -5337, 20940, 32541, -24614, -59261, -22220, 27629, 22707, 28003, 21366, 12692, -10121, -19998, -33718, 8666, 8507, -19293, -33896, -32160, -12339, 14872, 16688, 22432, 15223, 3423, -41569, -37485, -37581, -31577, -14623, -32803, -57094, -53704, -53252, -30975, -10841, -16118, -19929, -23794, -30263, -21990, -30008, -27736, -17761, -35763, -29658, -23002, -13857, -8346, 2023, 6375, 2741, -7770, -10329]
20110a0329J2881l885K693J3390r8j3575l0670o334K9171o029K0110Q099q246
20097G178j671J6189n816l0198j9902J5004P197j2201J3046K5951J5316k4298
20085E795J318K042K129L7207L3007R459k1132k1932l3873m3092k1083L024K7869
20072a9262o912l0845R509M9407N019k3372j5200K3560n91K903J821R242R401
20059A4680q593k364R655K486j6916M308q630q729N974m731j9659k8331J5481
20046d5369k021J073K7529K1898J8126N732k1406j5716K3371l207j574k345L527
20033I618K967k82j2104m012M1613K3856j2352k3531k414P946j4058M88p842l6320
20019b6427p348n32J1910K9841L0250j775k6052m252N59K634P640n586k324Q09
$$ y = [-10329, 2552, -1333, 1360, 14750, 14652, 1077, -29593, -35927, -6756, -12785, 7325, 15424, 7178, 5507, 21696, 15880, -14318, -34220, -19216, -12019, -24220, -11174, 14777, 30093, 5795, 7113, 9155, 11284, 48491, 81498, 90957, 69825, 47893, 14020, -29072, -50155, -47131, -19262, -26174, -57019, -47510, 1897, 6916, -16456, -31656, -8096, -8687, -5784, -3963, 5279, 14680, 6087, 3723, 13378, 15864, -1052, 3256, -5374, -14103, -8129, -12860, -32519, -60850, -45369, -47390, -46317, -18788, 3110, 21236, 26968, 5562, -10154, 13217, 10010, 8436, 6091, 9618, 12585, 12303, 199, -3813, 37800, 61656, 49304, 25773, 23359, 31305, 17247, 17735, 9893, -26427, -33775, -34307, -22397, 7444, 37694, 35919, 9867, 5615, 6174, 8808, 16448, 10862, 8538, 9347]
20005I347R59p591l112l929q097K4856M874l5247r337m974n52P659J1039o511
19991b0616m472k0868J0398L1839K799K2812N932m433k0055J5687j25k7131j5558
19978b3791J1963L334k698J8763J2056j5228j4842m42j3086l484k737K6097J9085
19965A4990J141k0506M165Q765r193k709j452l722P606R145L990k5790q296Q31
19951b1035J4445p226k9622K0561q26j9321K3026j1489n63J5382k070j353O525
19938a3566K1255N654j2340n856J150M688J1889J1245o95J511m851k7761j2708
19925b0385j872J6970K1041R191L2090J1212l8459m1535J0688R277l736j0384
19913e902j0786o30P149O276Q727K677O668R68N14J6405O726j6576m5561P110
$$ y = [9347, 10306, 2715, -397, -4326, -12423, 12433, 17307, -17940, -27277, -32251, -32803, -25144, -14105, -20616, -25088, -45956, -35558, -3719, -920, 21892, 27824, 23391, 3336, 19023, 18898, -8233, -23791, -11828, -8494, -11192, 7571, 19627, 4399, -10443, -10885, -23971, -27455, -30192, -4095, 14990, 16131, -4375, -210, 8555, -638, -3347, -4799, -8521, -915, 8230, 12220, -13570, -21866, -21035, -6590, -13816, -43438, -22877, -23703, -43024, -19998, -31487, -32050, -16668, -18738, -20091, -13566, 7689, 13343, 1003, -4853, -3703, 985, 12874, 24119, 23424, 24935, 20084, -7677, -20385, -22257, -5287, 15754, 24945, 57035, 68247, 29788, -11747, -1059, 8218, 4482, -5902, -16688, -17318, -10169, -3893, 4834, 7511, 14179, 15147, 15661, 32066, 38792, 22216, -23345, -16235]
19899a6235J619J7806j1196J1682j2011R515L074k0418n390J5435J8379l0516
19887a8256J1812l585Q165L765k0540M556J1392q169J2795Q403M756J7850o592
19874B6352m03j6461j8297J3783M831N539l6062R79J9324K353J0319K6657Q238
19861D7152O397n77k1505j4112J9550n992K0172p672k1573m193j1110r900M429
19848A066j3561k7774r680Q54K0371K2374Q605k084L743J0500K386k9891l283
19835a6374J4791M073n178L302P38j4277k391n10j6406q777J2581K217P893K0456
19821B138q871L362Q978j6747p800l627r52P450N522M995J2907N572o380j205
19807E342j2773p074K3944R371p65j6994K1574r255o384p238j4925R768o860O120
$$ y = [-16235, -14616, 3190, -8006, 3676, -8335, 1180, 4254, -16164, -21554, -6119, 12260, -18256, -6444, -10029, -1864, 1901, -18639, -14083, -2691, -10860, 1935, 10338, 15094, 32944, 26352, 25949, 9488, -8809, 4974, 9805, 15344, -20718, -19739, -415, 1938, 12257, 38914, 47152, 53549, 52972, 31467, 17355, 36905, 30913, 51085, 43413, 21840, 17647, 6537, -3363, 1066, -12495, -40269, -49949, -49095, -28724, -6350, 2255, 171, 3914, 14414, 16800, -13091, -16374, -1583, 2490, -2688, 614, 1352, -12925, -15316, -15826, -32232, -41009, -28428, -26211, -18318, 2138, -6733, -3371, 5607, -11140, -18940, -22567, -23519, -16069, -10547, -5552, 7355, 12927, 6547, 5342, -7431, -14505, 9439, 18810, 18045, 1051, 22625, 13370, 6986, -252, -15177, -5409, -12269, -6149]
19793f149l877o224k672K0879J5679J3482j5934J783L396K252n923k6369J0113
19780D36j1747j4647L724q896N59J5808J5599n97J4820J2619k6617l6692K844
19767c2787L945j2365J9777P268p918J8970O737q540R970P066j2840J8097k499
19754A4881N646j6064k3987j0926L2625K3078j1561j2200J473L765j6555J7932
19742H107J2864N70R050j5421k0392K8067J521m4723k33m739j0563j8350J3943
19729d0299O550J2908m575M960J2406K2120J0768K4550j0767k5329j5592Q456
19717F156j1633j070J8435R112J8369j4898J1191p427q715k471m738j5706j1031
19704a4426J3608R47n095k1405K866K1931J7329K493q311k532m81J0737k1946
$$ y = [-6149, -10026, -16250, -18922, 1957, 17636, 31118, 15184, 16967, 20363, 22615, 16692, -9677, 436, -11311, -25958, -22234, -31130, -30571, -14763, 836, 239, 15059, 27678, 1061, -35631, -32787, -28842, -41207, -21430, -14162, -22080, -3110, 3627, -4913, 5057, 12123, -717, 17380, 14881, 20527, 4463, -19524, -30450, 2175, 25253, 13692, 1492, 2965, 6730, -9825, 8107, 20971, 21541, 30591, 15170, -5222, 22845, 24366, -20357, -20590, -25329, -35892, -54242, -40299, -33749, -20841, -25416, -20456, -8050, 14070, 24838, 49388, 38621, 13292, -2300, 6156, -5477, -6547, 11888, 21000, 39369, 24471, 35662, 28235, 19520, 17049, 12311, -3395, -14426, -818, 129, -4966, -26371, -23505, -1574, 15755, 18248, 9937, 7405, 6924, 17661, -4285]
19691d285j1154j023l72q012n674J340K2528K2876J6313J8k4108O619o577j098
19677G391J650j193j9453m218j611O79k0351J507K0906Q176J1680o752m78J379
19663f88j6096n902J9433J4554k1728J3581J857j0547j5028O636J3547J8801J098
19650A9518Q586N383k126l4191q772J826J6668K3861Q578m891K766j0328l3012
19637f134j7918j4135O779Q181J9286J1065P678J1708l656q058k568r986k7442
19624b5200j2846J3037K0616J3612K2756k2473j001K6154k026j6878j9100J2481
19612I132J5660m4415j9194M1875K729j433j1123l4515J6876K0865J4501j6167
19600e209K354Q480N791J4505J6528j3217p900p127j0813N29m300M571K604j684
$$ y = [-4285, -15439, -16462, -16834, -24846, -30520, -29180, -6652, 16224, 32537, 32555, 8447, 15066, 8489, 7391, 9041, 7848, -11605, -15823, -17434, -16755, -37106, -35599, -14693, -6517, 5163, -1589, -2067, -688, -16784, -22686, -3253, 11301, -10427, 3154, 5011, -5536, -20564, -13928, -381, 18420, 19518, 28104, 33487, 31361, -2830, -11602, -9776, 6892, 30753, 39331, 34440, 37206, 26878, -6134, -24052, -38187, -31408, -23227, -3941, 7124, 14802, 26510, 22854, 14796, 12228, 2242, -25200, -38046, -25009, -4393, 9219, 31975, 9502, 8501, 34655, 32629, 15751, -3349, 9132, 24792, -19623, -38817, 3058, 5787, 4354, -6769, -41284, -24408, -3543, 10958, -5209, -2855, 5625, 11416, 25921, 42449, 29232, 21332, 14205, 3392, 3921, -379, 4192, 6796, 5112]
19586E112L536j309M644J0711p685O5N099q199M220N185l31j1822j0934k6935
19572b8643o314P001k2319j026q480R502k8686Q964J3931J4837k951j1645k602
19559e8431L8808K2082J8477k7493J2996L5686Q693k2051k2146p458p519m031
19547a2387m735r938O25Q656J0382J4077KJ4428J0931m5162r639l601m6J5825
19533a0582Q882n812L216o500K4218J3407j5891j5786L2944N262l671J8856J2065
19520F0608j8981j2565o353j4862p605J3852J5073j0857j293J0236J7352n274
19508C9331k3580M415Q982k3665j6783Q135L3870K433k9206J0863m57Q5J1772
19495B6195j2753k0522j341j905M473J3414Q044j6397n852J440p742P31r696M850
$$ y = [5112, 8648, 7339, 11983, 22694, 15009, 15074, 20173, 11974, 16194, 21379, 21048, 9226, -1708, -28643, -34957, -27956, -50275, -51301, -59781, -50279, -78965, -70001, -56070, -41233, -44184, -55829, -58431, -19623, 2459, 20936, -6557, 6439, 42125, 50818, 28767, 6621, -837, -8356, -12387, -17122, -27060, -26435, -17779, -7397, 6680, 6682, 21110, 32041, -13121, -22760, -26361, -26407, -10582, -1700, -7512, -4296, -10796, 13422, 26829, 10938, -4848, 28096, 33358, 29687, 48543, 60608, 41627, 29062, 22709, 7847, 242, 14094, 29167, 18310, 17017, 27253, 44605, 39331, 15751, 20166, 29148, 5483, -11300, -3165, 30705, 33138, 3932, 14795, 14338, 14423, 26195, 13442, -7080, -8421, -10326, -5853, 7561, 15605, -792, -6644, -5204, -12946, -12215, -21911, -17061]
19481a7061K3175K3835r115o959J867K1678M93q25j2613j8043J4505R280j5175
19468A5042M868k158p976Q931P785q823j9441p175J0816Q874j191Q982K954k362
19454A9126j8591l691N409k2870j2687K4492r974k0060j2689J6839J1698K9970
19442F972L4113m884K331L961j2483M286j2982j4636L0345l525l1733M981J4264
19429B1010n732j0016j8446Q223j1359L069J1105K8533j0651j2622l0532j5344
19417d2762J3834k390P770Q565K878P440j0981j321L0827J4061L354J5017k8331
19404A7961k0816N523P908k6151p58R321J2423J6438J1487k0969j6162l2594K943
19391c3446K9022J8013p757n772K7839Q932r71r652q85J0031O432l384P210k9736
$$ y = [-17061, 6114, 29949, 20834, 13875, 15742, 37420, 37913, 37088, 24475, 6432, 20937, 30217, 15042, 19910, 17752, 9776, 18707, 26492, 17669, -1772, -8947, 1869, 10743, 9552, 18534, 21488, 19126, 535, -3156, 2253, -20617, -33304, -8812, -18786, -38846, -51535, -34696, -22998, 6972, 41085, 36201, 38532, 42493, 30010, 34296, 21314, 6678, 37023, 33498, 1765, 6746, 21010, 15278, 5262, -13184, -4961, -16320, -13251, -2146, 26387, 15736, 3114, -27418, -42762, -28928, -31318, -23548, -14983, -12105, -4665, -15646, -16967, 13860, 27921, 31275, 46292, 17961, -2855, 2668, 10576, -15575, -16333, -7012, 5411, 21849, 33336, 12367, -3795, -36389, -33446, -4424, 13589, 5832, 60, 27899, 36831, 35860, 26208, 25323, 35354, 41786, 38402, 45612, 15876]
19377A5876o477J6710K0291Q805j4229k9378j7320m867l452j4016J4618L0631
19365A7192Q270M268R428J984o351j0365k8082j5311J4171k7735L254n788N781
19352b9284L1246J0430k739o824l039N729J2858r164Q278o696j4331L448n6O85
19338E41K3347r377L807o240P224k1130q054J4820K2445J1517k1609j1666k0548
19325a4923j5239N702N833P952P682O845J3683p627p415R91m796J1478Q185K361
19311B0712k709k7611j0485J1990p637L238j1085j398J3380J6256L829J0797J906
19298B1183n452j8929k2597l892P994M986J2149J2409R316k4928q269p833q82
19285b4745j258J6137K1203j8545k9397j1482J4297K2134L3632J5177k1130Q01
$$ y = [15876, 9399, 26109, 46400, 55205, 40976, 11598, -5722, -10589, -14041, -28057, -13439, 17192, 25462, 29730, 39158, 41142, 34791, 24426, -3656, -18967, -4796, -32531, -29277, -35065, -29284, 1962, 12392, 9653, 2829, -210, 5519, 18377, 9213, 17491, 10795, -3536, -88, -144, 541, 23888, 14511, 18318, 12078, 19302, -1828, -9882, 4938, 27383, 38900, 17291, 5625, -14923, -30162, -24460, -18627, -10675, -2993, 3852, 17535, 9908, 2493, 3484, -1312, 10166, 18351, 20712, 18003, -9608, -20093, -8103, -15740, -12502, -23587, -24985, -11605, 4651, 8480, 19277, 21183, 15731, -3198, -25795, -29687, -21693, -16707, -4558, 7851, 17167, -7761, -16030, -23863, -24745, -26003, -9866, 11337, -7208, -36605, -48087, -33790, -11656, 21976, 37153, 16023, 16824]
19273A6824j6493k1955l108J0368M4820J6741k0688j3197Q968Q17M01P642k8692
19260B448o619j366k0284j5168J4154L701r069J0952L976k119N352K4435L664
19247A4057p643R365j445J5003m62m59O222J9852j894k7650j5190j8122K048K3747
19233A7429K27J8292L638p495r848p860j1963L016j5289M457k609r323J7937M714
19219E323L1980k1614j2520N818J5512J3718p751j4143k318K3410R765k1682j8304
19206G194j1579Q190r639j555j4366L9295K3184j1102L347j3029j0853P446L300
19193A9833k637j2340K932P199o571L451L549R204k7356J0930J5283R392K0062
19180E2931J1727L254Q43l226j3413j8869R693J9530j126j3330k3969j0467k9116
$$ y = [16824, 331, -21624, -24732, -14364, 30456, 47197, 26509, 13312, 22280, 23097, 23498, 31140, 2448, -4171, -5537, -25821, -40989, -26835, -23134, -32203, -21251, -17275, -19394, -14042, 10393, 14057, 6414, 15779, 14334, 29337, 28875, 28416, 34638, 54490, 52596, 24946, 9756, -8366, -6318, 17429, 17656, 35948, 39586, 32091, 22243, 14383, 2420, 5436, -9853, -5396, -8005, -17328, 609, 5323, 37303, 15689, 3169, 8987, 24499, 38217, 30466, 16323, 14005, 37415, 47180, 25498, 7194, -4385, 3805, -5834, -7389, -21755, 17540, 40724, 29622, 32969, 19940, 9087, 16533, 19833, 17196, 4856, 7788, 14987, 8416, 11867, 15416, 24620, -2736, 8194, 23477, 32869, 52931, 64658, 67912, 68755, 65529, 52116, 33247, 42940, 62470, 61344, 48014, 24045, 13578, -15538]
19167a5538J2338J9672J6761K1332k353p935L1068N3507K8403j4207k1810l4238
19155H7000k8336k7779L191L0662R681Q740M304N592j3295o3581j3464Q26J3085
19142A6626J2680L2814M39j7594p249J9308L3793K8063J617J0051P108N0635M5820
19129B34111M7772R4971J36954J37582K00302J87072P2632p1471r1295j30219
19119H18411j72837j53732j20269p2175k4776l8941k9703k2130j6883j5272j9626
19108A32067r808j859k4912k3492o22p312O350o566Q489K6967J2836r590k1368
19095H1180J0111K407q864q727J5551K280k882o781j1473o925M966K864N996L207
19081H2910j2170K1819K0438N357K8558J6850M4059N2023O7192R5820J43847K10915
$$ y = [-15538, -3200, 16472, 33233, 54565, 52212, 44277, 75345, 128852, 157255, 143048, 121238, 87000, 58664, 30885, 34076, 64738, 74419, 83159, 87463, 93055, 79760, 16179, 2715, 3541, 16626, 29306, 62120, 62559, 44965, 37716, 57024, 90817, 118880, 120497, 130548, 137656, 188291, 234111, 281883, 376854, 513808, 651390, 851692, 1038764, 1111396, 1039925, 948630, 818411, 645574, 491842, 371573, 299398, 274622, 235681, 205978, 183848, 166965, 151693, 132067, 122259, 120400, 95488, 71996, 71374, 64062, 70412, 63846, 72335, 99302, 112138, 102548, 81180, 91291, 93698, 84834, 76107, 91658, 93938, 91056, 84275, 72802, 65877, 70843, 73707, 79703, 82910, 70740, 92559, 112997, 118354, 146912, 163762, 207821, 259844, 327036, 422856, 566703, 777618]
19069G77618K43554K34782P5860n1642q5160j36449k17068k01425j36563q3985
19059D19522p7204n9779l3135j4141l0871j5841j2015j1315p200j1751J3173k166
19047A57277q727J2091M3763K7844j0344q286L736k4532m6448l8388K0737K4077
19035A52800k2028l1265j0354K3695p786j2878P120O086Q840o296k807j2191L619
19022I6555q218n298K43j7293m224K995J2763K904L546p813j946J2198J89K6104
19008A12705m319l0036L5228N6952M0714o219l5896m3304j2117K881n001J0871
18996A22459Q209J6397j8874m0239j9244J3391k620o724j732j683j5463j0545
18984D3332L1893O566k5180j0687N080K2012O131k3284J037K0156K0448J3082
$$ y = [777618, 1021172, 1255954, 1331814, 1280172, 1195012, 1058563, 841495, 640070, 503507, 419522, 342318, 282539, 249404, 235263, 204392, 188551, 176536, 165221, 158021, 146270, 159443, 157277, 148550, 160641, 204404, 232248, 221904, 213618, 217354, 192822, 146374, 107986, 128723, 152800, 130772, 99507, 89153, 112848, 105062, 92184, 99304, 105390, 114230, 107934, 105127, 92936, 96555, 88337, 83039, 83282, 65989, 61765, 64760, 77523, 80427, 83973, 76160, 74214, 86412, 86601, 112705, 108386, 78350, 113578, 170530, 211244, 205025, 169129, 125825, 113708, 116589, 111588, 122459, 130668, 147065, 128191, 87952, 68708, 82099, 79479, 72755, 71023, 69340, 53877, 43332, 75225, 81791, 56611, 45924, 51004, 73016, 79147, 55863, 56900, 77056, 97504, 110586]
18972A10586P567J969r593M982q287l2572M554L0346m892j4860j8524j7359j4322
18959C9595j5389j0337j0420m871L1074K3955l0231J998j5229j9773q705n288
18947b3621L2034J1134R68K4561J9543j8285j7926J2661J2755Q49J1542m910j3633
18934D7672q009J1726O351J1024R594P948m980P828P483o31j8337J1161K2835
18921A11665P840l748J3027J8209j1388j2178j1346l16k4434k602J2497r197p123
18908H0906J3745r208J9819L6706Q168j5683j6680L335j2650k3990l0119r165
18896D5184p061M788J3394l311k0417o72j0444j0121n872M891M024K396J8018
18883C4797J1943M177n592j6749K5234L950j4654n029J0115J0382L3791L11k0316
$$ y = [110586, 118153, 120122, 110529, 115511, 107224, 74652, 79206, 109552, 104660, 89800, 71276, 53917, 39595, 24206, 13869, 3449, -1422, 29652, 53607, 23376, 25374, 10145, -9628, -18333, -23621, 8413, 19547, 20515, 45076, 64619, 46334, 28408, 41069, 53824, 54673, 66215, 61305, 47672, 39663, 51389, 57740, 68764, 78358, 86306, 81326, 89154, 96637, 96006, 77669, 88830, 111665, 119505, 115757, 128784, 146993, 135605, 123427, 112081, 111765, 87331, 84729, 97226, 88029, 80906, 94651, 85443, 105262, 141968, 150136, 134453, 117773, 121108, 108458, 84468, 54349, 45184, 38123, 42911, 56305, 52994, 32577, 31905, 21461, 11340, 5468, 10359, 14383, 16779, 34797, 46740, 50917, 45325, 28576, 53810, 57760, 43106, 38077, 48192, 58574, 92365, 92676, 72360]
18870G2360j0910j523r03j4559l567R02J737R529J7903R154K0296k1173k7103
18857E2143j1213k3439Q686o642q154k213J1376L8747L4945p857j0407R468J0703
18844I6143j6208k8948k2618M352K5936r08j4234K8925K1920O1270O9691R4507
18832C19828J06046O6900K5072o86o455k1030n3557r3575q7784l4498k9942l2725
18820A57594M742Q738n17j366p367j2023q090j4262k807K1933J569L328n404J6689
18806A62757P670J0636K5842L0863J150J8210O2631N9035N7750N4650P5716J6411
18794E83321l7340l2262p701K829M224k1426p4495o1913k0163k9386k9564J103
18782B77227j5535m1140m5794k6906q858k0312m403o41Q582K4228Q721P874M2328
$$ y = [72360, 61450, 59927, 59024, 44465, 40898, 41800, 43537, 53066, 70969, 80123, 100419, 79246, 52143, 40930, 17491, 26177, 19535, 11381, 9168, 20544, 59291, 94236, 86379, 75972, 85440, 96143, 79935, 50987, 28369, 32721, 58657, 57749, 43515, 72440, 94360, 155630, 225321, 319828, 425874, 492774, 517846, 517160, 510705, 489675, 436118, 342543, 254759, 220261, 190319, 157594, 162336, 171074, 170557, 169191, 161824, 149801, 141711, 127449, 124642, 146575, 148144, 151472, 146068, 162757, 170427, 181063, 206905, 237768, 238918, 257128, 319759, 378794, 436544, 491194, 566910, 583321, 545981, 513719, 506018, 508847, 513071, 491645, 417150, 355237, 335074, 305688, 276124, 277227, 261692, 220552, 174758, 147852, 138994, 118682, 114279, 113638, 122220, 146448, 155169, 163043, 205371]
18769B05371L5652M3120J7646k1193j9133j1881l7784k9405p865J5807o399k9261
18757A54675j483j2537j3838K251K3470J5688O56l0156l7265q114m005J0492P96
18744A00630j4033J1734m37k7790j3858r353j590J2095M745J0830K3543L7747
18732A34263M604K1417J3396p603m191l7753j8063k417o950m4846j2754R056k3735
18719B4424j9398p65J2130J3620P019J6232Q1P93j2254P642P575O198L0948O02
18705I4847j8576O879K7888m112J2180M027K483K561j1908L397K8243K0410K3540
18692A91859K5913j5714j2272M054o886k4348J7912J1577k2405j9727l621j0031
18680A36311P88l297j0190J6349L2403L2077M400m644k9055p265n968o3654m8745
$$ y = [205371, 241023, 284143, 301789, 280596, 261463, 249582, 211798, 182393, 174528, 190335, 183936, 154675, 153192, 140655, 126817, 129068, 152538, 168226, 168882, 138726, 101461, 93347, 89342, 99834, 100630, 86597, 98331, 97894, 70104, 56246, 46893, 45303, 57398, 62143, 72973, 96516, 134263, 138867, 160284, 173680, 166077, 161886, 124133, 106070, 103653, 96703, 51857, 39103, 48159, 24424, 5026, 4261, 16391, 30011, 37030, 53262, 53343, 54136, 41882, 49524, 57099, 63297, 94245, 94847, 76271, 83150, 111038, 106926, 119106, 123133, 125616, 128177, 116269, 119666, 147909, 168319, 191859, 217772, 202058, 189786, 193840, 186954, 162606, 180518, 192095, 169690, 149963, 146342, 136311, 137099, 133802, 123612, 139961, 172364, 204441, 208841, 204197, 175142, 167877, 161909, 98255, 49510]
18667D9510J2882M7146J051j9038k3127k244M9119P0554O0746K1197P841J4891
18655B90528P732m034n1293m1826L29K2538J9068K155r880J9219K5974M063p316
18642B77257N374j3217P608j5571K1813J7962j55J6073J7099L2456K8477J8974
18630D14150J7056K4685M8612N0982J9180K7560K4149J4950M4329M1280O2437
18619G89370M6287K0201l023J1051O1114M3412K3581L6895M5270L7401m493r089
18607A097977R863M621J885J1709K4766K2625K8799L0843Q362j1974J8303O5052
18595A312831L7182K4025L7680L2493J8416L3919M7253M0797M1544P5611P1049
18584A772800P4700O4204M1973N8392P4533R7786J09124Q4938J10252J40602J39918
$$ y = [49510, 62392, 109538, 110589, 91551, 68424, 66180, 115299, 185853, 246599, 267796, 275637, 290528, 298260, 294226, 242933, 201107, 201436, 223974, 243042, 245197, 235317, 254536, 280510, 284573, 277257, 282631, 269414, 277022, 261451, 283264, 301226, 301071, 317144, 334243, 366699, 395176, 414150, 431206, 455891, 504503, 555485, 574665, 602225, 626374, 641324, 685653, 726933, 789370, 835657, 855858, 852835, 863886, 925000, 968412, 991993, 1028888, 1074158, 1111559, 1107066, 1097977, 1107840, 1112461, 1114346, 1126055, 1150821, 1173446, 1202245, 1233088, 1241450, 1229476, 1247779, 1312831, 1350013, 1374038, 1411718, 1444211, 1462627, 1496546, 1543799, 1584596, 1626140, 1701751, 1772800, 1847500, 1911704, 1953677, 2012069, 2086602, 2184388, 2293512, 2378450, 2488702, 2629304, 2769222]
18573B769222J36535J78145K23477K77112L49363L86721N27907O26034O34823
18564F109339N22701L68241K63669J85776K02240K28160L50282N39009Q53437
18555I622854J205747J470870J600004J802924K253787K886378L627037M725495
18547B9195096O394082Q482120J1459684J5956834K2067100L0303328M1698178
18540A65556422O0536878Q6814743Q7568688K6465665k1120177k4823502l7950800
18533C43047917p1344523p3653403n3779024l5256944k2706043j5382602j1039952
18526E9885426q151586o119334m707839l580985k751298k336935k025788j767522
18518B8444139j642572j561954j342946j091229q89899o99458m71306k92718j11971
$$ y = [2769222, 2905757, 3083902, 3307379, 3584491, 3933854, 4320575, 4848482, 5474516, 6109339, 6632040, 7000281, 7263950, 7449726, 7651966, 7880126, 8230408, 8769417, 9622854, 10828601, 12299471, 13899475, 15702399, 17956186, 20842564, 24469601, 29195096, 35589178, 44071298, 55530982, 71487816, 93554916, 123858244, 165556422, 226093300, 312908043, 400476731, 426942396, 405822219, 380998717, 343047917, 271703394, 198049991, 144270967, 109014023, 86307980, 70925378, 59885426, 51733840, 45614506, 40906667, 37325682, 34574384, 32237449, 30211661, 28444139, 26801567, 25239613, 23896667, 22805438, 21915539, 21216081, 20744775, 20452057, 20340086]
18509B0340086m4649j54423k67252l49543m02854l54338l33304j98276O0497J74872
18499A8470816j316m12171o85535q26691q71982q87962q57428p20933o69612o09684
18489A1927502n99204n63243n63306n42256m94394m60814m30204m17323l80332
18480G476426l69421l69857l35805k98230k94610k71514k55187k47335k36406
18471D798061k13115j85617j60083j70098j81186j53222j38887j74295k08586
18462C212972j66869j53688j46426j70209j28677j01507j12796j08878r2841n3055
18452A978026q1594q2909o0103o8566q6758o0256n4045o5552n0462m3276o9243
18441A255262n6783k5355P816k4339n3544p1219p4750n1621l3040m4202j7282
$$ y = [20340086, 20295437, 20141014, 19873762, 19524219, 19121365, 18767027, 18433723, 18235447, 18295944, 18470816, 18469500, 18057329, 17371794, 16545103, 15673121, 14785159, 13927731, 13206798, 12537186, 11927502, 11328298, 10765055, 10201749, 9659493, 9165099, 8704285, 8274081, 7856758, 7476426, 7107005, 6737148, 6401343, 6103113, 5808503, 5536989, 5281802, 5034467, 4798061, 4584946, 4399329, 4239246, 4069148, 3887962, 3734740, 3595853, 3421558, 3212972, 3046103, 2892415, 2745989, 2575780, 2447103, 2345596, 2232800, 2123922, 2031081, 1978026, 1896432, 1813523, 1753420, 1684854, 1598096, 1537840, 1483795, 1418243, 1367781, 1324505, 1255262, 1198479, 1173124, 1180940, 1156601, 1103057, 1031838, 957088, 905467, 872427, 828225, 810943]
18430H10943n5432m7933m2194O6L181k3265j316j0253l2565o326K5780K0199J9137
18417F60022N3724N8700M9869K9246J0334J1734J07406K08299R5485l7192m0255
18406A207372l8435p7664j09649j14066q4754q3418o9274k9517l7511m3378j6125
18395E03581r322k3669k8903k178q27m3537l1837M050j1950m5496n2499m502J0044
18382B62955R286m404j6502J2876M8702J7011J4547r257o34J3626N7572N8607
18370D64385J1035J711J9607k885J1858j0322o613J4171J829l619J6180J3533
18358E30870j898R921K6418k1800k6208n41k1701j3584K0175j3696l3846m7463
18346D06647j1387J4139j9793k0121J2410Q901J4237k937K391J7177J3019Q415
$$ y = [810943, 755511, 707578, 665384, 665450, 668631, 645366, 644050, 633797, 601232, 594906, 620686, 640885, 660022, 713746, 772446, 822315, 851561, 861895, 873629, 981035, 1189334, 1284819, 1247627, 1207372, 1168937, 1091273, 981624, 867558, 782804, 699386, 630112, 600595, 563084, 519706, 503581, 494259, 470590, 441687, 439509, 438682, 395145, 363308, 367358, 355408, 309912, 257413, 252911, 262955, 272241, 267837, 251335, 264211, 312913, 329924, 344471, 335214, 334580, 348206, 405778, 464385, 475420, 477131, 496738, 493853, 505711, 495389, 488776, 502947, 504776, 501157, 517337, 530870, 528972, 538893, 565311, 543511, 517303, 516762, 495061, 481477, 501652, 487956, 454110, 406647, 395260, 409399, 389606, 369485, 381895, 390796, 405033, 402096, 404487, 421664, 434683, 443098]
18334D43098O968j3885j6035J7010j1945j7212N126o459j2602j6252k2320O944
18322C62436j3309m8778j6322K0071n165k0670r315j3501j820J2890J5673M422
18310B86612J140l003k7956m2821k8366r316J5460J6189J6427L295R965K008P426
18297B47060l856J1860j604q198q065q848j7181j8500J1127L2128M3422J6860
18285B96205k2790m904l953j6768l8105l8936m1586l1517Q938J1071J965j0825
18273A08795k6595j394m130k8607m483Q7p909J1780R646K9433j3720k4358J884
18260E0429r503j6604j7110l1888M510L584r000N14k3843l2132k6762m086l3822
18247a45713n9691r5269j06614n1645L6745N2152K3566Q1292J28240P1861L6352
$$ y = [443098, 450066, 436181, 420146, 437156, 425211, 407999, 413125, 406666, 394064, 377812, 355492, 362436, 349127, 300349, 284027, 304098, 298933, 278263, 268948, 255447, 253627, 266517, 282190, 286612, 287752, 284749, 256793, 213972, 185606, 176290, 191750, 207939, 224366, 227661, 237626, 239634, 247060, 243204, 255064, 253460, 245262, 237197, 228349, 211168, 192668, 203795, 235923, 279345, 296205, 273415, 268511, 264558, 247790, 209685, 170749, 129163, 97646, 106584, 117655, 119620, 108795, 82200, 80806, 76676, 48069, 43586, 43673, 35764, 47544, 57190, 86623, 72903, 48545, 50429, 40926, 24322, 7212, -24676, -20166, -16582, -25582, -25068, -48911, -81043, -107805, -111891, -145713, -205404, -300673, -407287, -458932, -422187, -370035, -346469, -265177, -136937, -65076, -28724]
18236b8724M3091J9479p190Q173K7386J7083K7651J7287k044l0250j3404P021
18224H5559J6104J3234J7085K693K8381j1077O223n204K562J913o244K229j9530
18211A33928k316m086J6242J189Q35R612k2434j1057j2990j6346q033l335K4371
18198A05580K0779J2530L580r624k2210j5800J3839K0736K850K4132K1456L548
18186A81396J2308o581n47p360N92J5210p979k1535r115j3848P213J5902j3030
18173A52626q282J9446K6651J1320j4019Q393L502k2821j0104J9773J3648m1006
18161A59127j1653J1687L2276J1696j1242P927j3353k1602N469J7600K8532J3812
18149B30276O232N751J211n94o550J578j258M906R043J3622l183r11L9404L5200
$$ y = [-28724, 14367, 33846, 26656, 34829, 62215, 79298, 106949, 124236, 122192, 91942, 78538, 85559, 101663, 114897, 131982, 134675, 163056, 151979, 158202, 152998, 155560, 157473, 151229, 153458, 133928, 131612, 127526, 143768, 144957, 145792, 155404, 132970, 121913, 108923, 92577, 84544, 81209, 105580, 126359, 138889, 142469, 132845, 110635, 94835, 108674, 129410, 132260, 156392, 177848, 181396, 193704, 187123, 186576, 179216, 179808, 195018, 187039, 165504, 156389, 142541, 149754, 165656, 152626, 144344, 163790, 190441, 201761, 187742, 196135, 199637, 176816, 166712, 186485, 200133, 159127, 147474, 159161, 191437, 203133, 191891, 199818, 186465, 164863, 170332, 187932, 216464, 230276, 236508, 242259, 243470, 242876, 236326, 237904, 236646, 241552, 250595, 264217, 261034, 260123, 299527, 334727]
18135C34727J7914j2317P315L7021K4313K3037M2370L0548L8806L3924L8572R7209
18123G13439J38945J49585K01589K44416L13280L86167N29025P25200J041168
18114D442814J463067K069665K988801M427166O686431P457032K732610j625340
18106C0642246j943063k497024n388760n866530m312196k783684j809631j146853
18098D894505p82285n89122m76193l77364k71324j75413j52166j12268p1438q9641
18088A797291q8302r2376r1495n7360k1615n0888q3229l6588o596j7783k8932
18077A222127L12Q503R92p323J493J4533K8385r434k7029n0839k7952k4345o1830
18064A067593o2388m7185m5274n7430l8911l4388l6380j3226l4965n1714m5577
$$ y = [334727, 352641, 340324, 347639, 384660, 408973, 432010, 474380, 504928, 543734, 577658, 616230, 713439, 852384, 1001969, 1203558, 1447974, 1761254, 2147421, 2676446, 3401646, 4442814, 5905881, 7975546, 10964347, 15391513, 22077944, 29534976, 32267586, 30642246, 28699183, 26202159, 20813399, 14946869, 10634673, 7850989, 6041358, 4894505, 4112220, 3523098, 3046905, 2669541, 2398217, 2222804, 2070638, 1958370, 1886932, 1797291, 1708989, 1616613, 1525118, 1467758, 1446143, 1395255, 1312026, 1275438, 1268842, 1251059, 1222127, 1222439, 1230942, 1231934, 1224611, 1226104, 1240637, 1269022, 1259588, 1232559, 1181720, 1153768, 1129423, 1067593, 1005205, 958020, 912746, 855316, 816405, 782017, 745637, 732411, 697446, 645732, 600155]
18053F00155k1318k3279k0469m2029l1561k6267k0770o344o552j9388k0605j1815
18041C49758j0930r354k7079j1609N299J3556r046j7098j4709P597m4980m1750
18029A89655K7982j5453j7910L802K112k1364j1180N351m053L996j9804r03O335
18016A48566k100J5102K4480J7332n391O333K0722L11J0504M6377P6894J05468
18004D64598J16037J62831K45566K43268R6969m8285p1479j14057k03116k35588
17994F56744j71660j14776o2322l8076m0362L797K393l5568m0244N014j0375J0924
17982A65489K5029K8186j2555o438r093o004k2962j1712j3839o499P663j3401
17970A23864j7230q656j526K1463J3980j6512k0191K6818M357n09J3511j3916
$$ y = [600155, 578837, 555558, 535089, 493060, 461499, 435232, 414462, 408118, 401566, 382178, 361573, 349758, 338828, 329474, 302395, 290786, 296085, 309641, 300595, 283497, 268788, 276385, 231405, 189655, 217637, 202184, 184274, 188076, 190188, 168824, 157644, 162995, 158942, 162938, 143134, 142231, 148566, 146466, 161568, 186048, 203380, 197989, 204322, 225044, 225355, 235859, 282236, 359130, 464598, 580635, 743466, 989032, 1232300, 1329269, 1280984, 1209505, 1095448, 892332, 656744, 485084, 370308, 307986, 269910, 229548, 233345, 235738, 200170, 159926, 164940, 154565, 165489, 190518, 218704, 206149, 199711, 190618, 184614, 161652, 149940, 136101, 129602, 137265, 123864, 106634, 97978, 96452, 117915, 131895, 115383, 95192, 122010, 126367, 125858, 139369, 125453]
17958A25453M437L382j3527Q055L3176J9847K8050M8248N1272P5584Q1894J24198
17946E90069K03368K24070J20682k2263o8450r5897j78333j77675j62134r4571
17936C38866o2711n1183k2995k808p980l8918l3218k1683K2384j8264j7211j971
17924H2308K2799k373k3623J4772K5239k2335k4355M756L175L471J1459J3493
17912A08786j3618l2601K2407K3271l142R801k2774j5524J1409J0982j6508r576
17900G2913O930k0936k8822j3106j2186R856J6885K7694J5871j2213q842L657
17888E7701j3488k0850J8678P363l500p539R082Q86J449q831J0712O919R339j4689
17874E3232q700L298l9087k4806J6022K2909J2901K1245O048o936k0208O72K1776
$$ y = [125453, 129890, 133272, 119745, 127800, 160976, 180823, 208873, 257121, 308393, 383977, 465871, 590069, 793437, 1017507, 1138189, 1115926, 1047476, 951579, 773246, 595571, 433437, 338866, 276155, 224972, 201977, 199169, 191189, 152271, 119053, 97370, 119754, 101490, 84279, 82308, 105107, 102734, 79111, 93883, 119122, 96787, 72432, 77188, 80363, 83834, 95293, 108786, 95168, 62567, 84974, 108245, 105103, 114904, 92130, 76606, 88015, 98997, 82489, 72913, 79843, 58907, 30085, 16979, 4793, 14649, 31534, 59228, 75099, 62886, 54044, 57701, 44213, 23363, 42041, 49404, 45904, 38365, 47447, 48333, 49782, 40951, 51663, 58582, 67921, 53232, 44532, 47830, 8743, -16063, -41, 22868, 35769, 57014, 63062, 56126, 35918, 36590, 58366]
17861E8366J1380r310k6440k4074J2457L74r091j0049J3015L792k3031j373J7073
17848A3089N58P488n52n54j3169k3327j9448J1783J5113J1546O059k125m390k5408
17834b3337O544M2170L1609j6306j5269P643J0215j6349K290q676j8774K675O391
17821A0826J1628m956l5385j9545r130J0746o056J141Q414L372K8516K3545J1191
17808C4307j3449n806l046L497J7698K4316L832j1701k975m130Q791M171k6773
17795B8732J5791q447j0380R617J5967Q149R7o007p69j5440p303K3332j3782P102
17781D6659J2210l3462j0232k4358k2390K5961J4549Q88Q543J7272J1410O606
17769E3656k787k3319n211n823K3696q01l2044l933j1026j1587J4834K4647J7742
$$ y = [58366, 69746, 60436, 33996, 9922, 22379, 22753, 13662, 3613, 16628, 20420, -2611, -3984, 13089, 13647, 21135, 20583, 20029, 6860, -16467, -35915, -24132, -9019, 2527, 8586, 6461, 2071, -23337, -16793, 25377, 56986, 40680, 25411, 33054, 43269, 26920, 29210, 20534, 1760, 4435, 10826, 22454, 17498, -17887, -37432, -46562, -35816, -41872, -40731, -32317, -28945, -429, 23116, 34307, 20858, 15052, 12006, 15503, 33201, 57517, 61349, 49648, 46673, 42543, 51334, 55505, 28732, 44523, 36076, 25696, 35313, 51280, 59429, 59526, 53519, 52750, 37310, 30007, 53339, 39557, 46659, 58869, 25407, 15175, -9183, -31573, -5612, 8937, 9825, 18368, 35640, 47050, 53656, 50869, 27550, 22339, 16516, 40212, 39411, 7367, 3434, -7592, -19179, -4345, 20302, 38044]
17756C8044O904j847L737q797Q666j0531j2821M981K1105J2396j9695j2855q542
17743B0745l51N1796j142m9387j7224K7881J8331j1782M421J1693p23M35K7650
17730H2343J6525K938j1505k6792l4068k9564J3986N650J1973j1386P873L342
17718C1315O177q927j3442M2379J5702l2099j2650k3621l0234N966K2902R536
17706A3004j771K9245j8822k3692R864Q284J8837k03n418k215n831P75J2071J2157
17692D6285k2139o99p617P860r718j2093J7233L2314L191q886j6568j0081N977
17679B5059n419j9121j7397R320N21J3475j114K2848j794P00k1471j1417n644
17666a1454K155K0674J8159J0787o141j0887l0598k3915k5295K0815K4346Q852
$$ y = [38044, 44948, 43101, 46838, 38041, 46707, 36176, 23355, 28336, 49441, 61837, 42142, 29287, 20745, 20394, 72190, 71048, 21661, 4437, 32318, 50649, 38867, 43288, 54981, 54258, 54693, 82343, 98868, 101806, 90301, 63509, 29441, -123, 13863, 19513, 31486, 20100, 27973, 31315, 37492, 28565, 15123, 57502, 73204, 41105, 28455, 4834, -25400, -19434, 3468, 13004, 11233, 40478, 21656, -2036, 7828, 16112, 34949, 34746, 29328, 27113, 21282, 22057, 34128, 46285, 24146, 23447, 15830, 23690, 13972, 1879, 19112, 51426, 54617, 45731, 29163, 19082, 25059, 19640, 519, -16878, -7558, -7037, 6438, 5324, 28172, 26378, 27078, 5607, -5810, -11454, -9299, 11375, 29534, 40321, 34180, 23293, -7305, -31220, -56515, -35700, -11354, -2502]
17654b502R298R834Q838k099l891L68k974j4165m023j9131m295J6960q875M910
17640a1747J3239J1232j0341m241J909J5465J5850j0675j4982j6091j0787j4065
17628c5234J7720M2918M730m316k1360l09m56J1003m609j480K1624J1500L151
17615D4882O42J3680P179l955n547l5855J8601J0038k0953j0750j0158R412J3477
17602C0693k4577k436J2323o623j1622M551m847o79O518R790J3787Q388O401n14
17588D1153R784L335j2256r459r383K892j7211J6399k9265n780n283J02k760J9741
17574B009K2375r524k989R505M331k661k3723j420Q105M348k0429j0137j9630
17561c9840m956l477k666J2392L4848K0512k9890j5653K5787P983j9495j055P581
$$ y = [-2502, 6796, 16630, 25468, 23369, 19478, 19846, 16872, 2707, -1316, -20447, -24742, -7782, -16657, -11747, 1492, 12724, 2383, -1858, 51, 15516, 31366, 20691, 5709, -10382, -21169, -35234, -17514, 25404, 30134, 25818, 4458, 4149, 3693, 14696, 10087, 8607, 30231, 41731, 44882, 45524, 59204, 66383, 62428, 56881, 21026, 39627, 49665, 28712, 17962, 7804, 17216, 30693, 6116, 3680, 16003, 9380, -2242, 2309, -2538, -3217, 3301, 13091, 26878, 35266, 41667, 41153, 50937, 54272, 42016, 32557, 23174, 26066, 8855, 25254, -4011, -9791, -15074, -14972, -17732, 2009, 24384, 14860, 11871, 21376, 25707, 23046, -677, -2097, 6008, 10356, -10073, -20210, -39840, -44796, -48273, -50939, -38547, -3699, 16813, -13077, -28730, -2943, 5040, -14455, -15510, -7929]
17548g929K2199K0605J7309k420k7902P476J584Q428q061l2343J830M431J0108
17535A5315k4486O64Q689j6058k1751K1663L6715J0168J8643q679k6041n262N412
17522A4992K0952J3883l0421k7287J953M76J8616J5975m48J842L515L4164O928
17509G5140l856m355j0050k5752j216j4050J1154J5462k1305r749J0688J3113
17497C5224k4043m1462R417K4620J9725r968j4126K2096N444k335k5971o658q81
17484h918J1567K6122j1373j2867k2058J3697J4704j529n831M118m947K7779J6015
17471D6479J1439j8252O74j0997k5829J65j1749J2603O759J7202l289k0481k4467
17458a9743j864L66K4438n676k9140n058P284J8103M3303R43p667j6380K556L7370
$$ y = [-7929, 14270, 34875, 52184, 49764, 21862, 29338, 30922, 39350, 31289, -1054, 776, 5207, 15315, -9171, -8507, 182, -15876, -37627, -15964, 20751, 30919, 49562, 40883, 14842, 9580, 14992, 35944, 49827, 19406, -7881, -5928, -5452, 13164, 29139, 28691, 30533, 34048, 68212, 75140, 71284, 66929, 56879, 31127, 29911, 15861, 27015, 42477, 21172, 11423, 22111, 35224, 11181, -30281, -20864, 3756, 23481, 13513, -613, 21483, 26927, 24592, -1379, -8037, -8918, 2649, 28771, 17398, 4531, -17527, -3830, 10874, 9345, 3514, 7632, 2685, 30464, 46479, 57918, 39666, 40340, 29343, 3514, 3679, -8070, 4533, 11292, 28494, 25205, 4724, -19743, -21607, -21241, 3197, -2479, -31619, -36677, -29393, -11290, 32013, 32956, 25289, 8909, 11465, 48835]
17444D8835M6450K4529K4993k283K1662M559l5600m5700j8045j1724J903O527
17432F6106j936k3675j6866k5978J6664J675q209p425J0154o965j9996m799M515
17419a6735J3717q945k922O52J3947M4208Q278j2761K339R591P558m134L234j7577
17405D0450j1625N38p294J5751J9879N566n072k3637K763k0445j5801K295j034
17392B334L975J7636N134N381k97J9438j905k9513N708m515M5K0694r245j1087
17378B3783J599J2245n737m356k672j6220o617k158j1434l226R688K335o089N832
17364c027M799J6952L4066o557j6473l744j2524j0358j4189j1839j1165J5012
17352a9047J0640m887k7856K1755M612j3145j1800N474K1734J6395o212Q259n789
$$ y = [48835, 95285, 119814, 144807, 142524, 164186, 168745, 133145, 87445, 69400, 57676, 59579, 66106, 64170, 40495, 23629, -2349, 14315, 15990, 7781, 356, 10510, 3545, -16451, -21250, -16735, -3018, -11963, -14885, -14233, -286, 43922, 52200, 39439, 41778, 51369, 58927, 54793, 58027, 40450, 28825, 29363, 22069, 37820, 57699, 63265, 58193, 34556, 37319, 16874, 1073, 3368, 2334, 6309, 23945, 29079, 34460, 34163, 53601, 51696, 22183, 27891, 23376, 23421, 44115, 34870, 23783, 25382, 37627, 31890, 27534, 24862, 8642, 2025, -133, -11567, -14793, -5105, -2770, -8859, -3027, 1772, 18724, 52790, 46233, 29760, 26016, 13492, 3134, -11055, -22894, -34059, -19047, -8407, -13294, -41150, -19395, -14783, -27928, -39728, -34254, -12520, 3875, -2337, 5922, 133]
17339A33o656r176j0679M208K4552O14j1720J468J1020P485L153o89j0647Q330
17325A1396p820m0474j636P643J0892J9133j945l679M407P97L876k0274j3726
17312c1410K695O014L3701n663L641J8803L836m802l4669l0834P619J1748l816
17299b3137m676O22M402q8O10K0319P817J8635R228j6128N434j146l0375j1601
17285b0084O849J6604q226P20P587o287J7280M876j998P519K257j4949o773o776
17271a401j6663j9144J1468M7635J7976n528j4601k5674J1137L792J5032M632
17259B8661N469N729m549k2655J232J04j2163j3976q716J8100M1244n754l9979
17246g253k7861j4544L8735Q664q229j501J8643J0766J7154j4215k5760O157P325
$$ y = [133, -6523, -15699, -26378, -22170, 2382, 2996, -8724, -7256, 3764, 11249, 14402, 13713, 3066, 11396, 3576, -36898, -38534, -30891, -19999, -866, -2811, -6490, -2083, -1286, 2590, -17684, -31410, -28715, -22701, 11000, 5337, 8978, 27781, 31617, 26815, -7854, -38688, -31069, -19321, -23137, -27813, -27191, -22789, -22877, -22267, -1948, 5869, 24504, 33732, 17604, 23038, 21892, -8483, -20084, -13235, 3369, -4857, -4137, 3450, -2837, 14443, 19319, 17321, 24840, 27097, 12148, 5375, -1401, -18064, -37208, -25740, 21895, 39871, 34343, 19742, -5932, 5205, 8997, 24029, 28661, 34130, 39859, 35310, 12655, 13887, 13991, 1828, -12148, -20864, -2764, 38480, 32726, -7253, -35114, -49658, -10923, -2259, -10488, -11989, 6654, 17420, 34574, 20359, -5401, 756, 8081]
17233H081K917J9268J710q628L788N397j4937J2394J6166q013j7213k69m611k1883
17219e833j7994K3092J5323J3002p460J0382K446P189K73j9509j7939M048L2475
17206C9495Q113l1038k0906o43J5973O509Q14J0330l931K139r943J3605k257k8306
17192d6j0526k873K3067R101j9355k8666o712J5031M0743R229j5138l192o447
17179D216K3852J0024j7631k6477j1850J1182L5801j1251J4933k7691m0712j068
17167c6672J6433J0666J0539p699j7086j0030J7006J3164J5704J9445m211L721
17155C0980k0330j3945R80J0202Q873j8256k8551P478O532K5681K1890M566K431
17142C8531m0021j5666j0059j1918l533K0549L1427J9014K957q136m094o792j6209
$$ y = [8081, 10998, 30266, 31976, 23348, 27136, 32533, 17596, 29990, 46156, 38143, 20930, 20661, 16050, -5833, -23827, -735, 14588, 27590, 20130, 30512, 32958, 40147, 40420, 20911, 2972, 7020, 39495, 47608, 16570, -4336, -4979, 10994, 17503, 18317, 28647, 24716, 26855, 16912, 30517, 28260, -46, -10572, -13445, 9622, 18723, -632, -29298, -36010, -20979, 19764, 28993, 13855, 10663, 4216, 28068, 38092, 20461, -6016, -17866, -6684, 29117, 17866, 32799, 5108, -35604, -36672, -20239, -9573, 966, -6733, -23819, -33849, -16843, -3679, 12025, 31470, 27259, 30980, 10650, -3295, -2315, 7887, 16760, -1496, -30047, -22569, -16037, 9644, 31534, 36100, 38531, -1490, -17156, -27215, -39133, -42666, -22117, 9310, 28324, 31281, 23145, 19051, 12259, -3950]
17129c950k1879J2368K8134L6462j0558j1584j2354J9367J3849j2350l9210k7104
17117b8809M765k616K4980J3048j3577j6724M579J5737J3713j2912l363m238m340
17104i757J515J9609P100J6806K004k3700j0470M040k4043Q5L4364K6167r505
17091C4215k2370j1634j3126J2294P854N580L939r759j4191k2828K0413p263P230
17078i646P55j5835Q053J0807J8479k33j0892j6580j5050k319j583J033K3476
17065i535K8789l022p593L361J2183r990j0458m867l0194J0474O0018j6497k5848
17052c179j9351p211R754J8712l373k0380l4846K7588K3629J5964O142K698L74
17039A6521j0766P298r227k165j9022n608J9286R840j818k344J0155r044m887
$$ y = [-3950, -25829, -13461, 14673, 51135, 40577, 28993, 16639, 36006, 49855, 37505, -1705, -28809, -24044, -26660, -1680, 11368, -2209, -18933, -14354, 1383, 15096, 2184, -1179, -5417, -9757, -8242, 11367, 18467, 35273, 37277, 13577, 3107, 7147, -16896, -16811, 17553, 43720, 34215, 11845, 211, -12915, -621, 7233, 12813, 16752, 6993, -7198, -30026, -9613, -16876, -9646, -8891, -24726, -16673, -5866, 12613, 12380, 1488, -15092, -30142, -32461, -34044, -33011, -9535, 19254, 16232, 8639, 12000, 24183, 14193, 3735, -1132, -31326, -20852, 39166, 22669, -3179, -22530, -29741, -19987, -1275, -4648, -25028, -59874, -32286, -8657, 7307, 13449, 16147, 16521, 5755, 13053, 3826, 1661, -17361, -22969, -3683, 6157, 4339, 1995, 12150, 3106, -1781]
17026a781k101j1423R05p484J95K3739K0363j5160j0329q581j1773j1874N637
17013b9667J4586j5180m714J3151K0866j8325J4008k0705k1752n024Q360l274
17001d7670n91K1066O086M421q426J0736r280n630K1477K8685K0177r229j2618
16988A9204J901j0834n696j2370R35l315R842j2646M960J7409P878j912k2986
16975g630m1371j1121L0676K5733m923J5540O910m109J2453j9456j2100J5288
16963E890O359K320k575J960k0091j4455J7044J3776o993k391J0814P879J474
16950B1011k803p506K5095q428L157m697p779j3894j9270l58k1441k0011O697
16937e0227K2373J9749K4529j1544Q345J4619M171j947k073k6639k6581J3164
$$ y = [-1781, -3882, -15305, -14400, -21884, -21689, 2050, 22413, 7253, -3076, -11657, -23430, -35304, -29667, -15081, -30261, -34975, -21824, -958, -19283, -5275, -25980, -47732, -52756, -44396, -47670, -48261, -27195, -21109, -16688, -25114, -14378, -23658, -29288, -7811, 20874, 41051, 31822, 19204, 21105, 10271, 4575, -7795, -6860, -10175, -333, -12979, -8019, 9390, 17268, 15356, -7630, -49001, -60122, -29446, -3713, -8636, 6904, 13814, 9705, 22158, 2702, -9398, 5890, 12249, 14569, 11994, 13954, -6137, -20592, -3548, 10228, 3235, 844, 11658, 19537, 21011, 18208, 10702, 35797, 27369, 30526, 25829, 18050, 4156, -15114, -15472, -36913, -56924, -50227, -27854, -8105, 16424, 4880, 13225, 27844, 32015, 30068, 27995, 1356, -25225, -12061]
16925a2061P839k961P016q646n693J1251J077J7672j4379j7010K197M275J506
16912g917J9207J7801J802m026j1036J9472q295k9984j0106p912M46K794J9519
16899A765j2033P402J2465m581k6559q463K2248K2675M191j1433k3944o403R600
16886a3070o020K0647J9218J5767P182K583k725j6040j4039l0598L114J7327N448
16873H794J71R204k2217J366N724J5024K0802j3000j9615o083J296q735K29Q408
16859A368K676k0329J0481j2638O432K7021K1610k8818l6906J4004M4262p076
16847B2087j3123Q484L723l0285k4325N702J9558k114m782q668J8606K3140L588
16834B1591k8564O197n629l0326J934J1927j2356k0116K151K1890k469j4141j6824
$$ y = [-12061, -4222, -7183, -167, -8813, -14506, -3255, -2178, 15494, 1115, -15895, -13698, -9423, -7917, 11290, 29091, 30893, 26867, 15831, 35303, 27008, -2976, -13082, -20994, -20548, -17754, 1765, -10268, -2866, 9599, 5018, -21541, -30004, -7756, 14919, 19110, 7677, -16267, -22670, -13070, -19090, 1557, 20775, 36542, 43724, 46307, 43582, 27542, 13503, -17095, -13981, 3346, 8794, 8965, 18169, -4048, -2682, 3042, 18066, 38868, 25868, 6253, 170, 1466, -7269, -7040, 1368, 4044, -16285, -5804, -18442, -12010, 15011, 36621, 7803, -29103, -15099, 29163, 22087, 8964, 17448, 21171, -9114, -33439, -27737, -8179, -10293, -15075, -23743, -5137, 18003, 21591, -6973, -776, -6405, -36731, -34797, -22870, -35226, -55342, -53191, -31301, -33770, -47911, -64735]
16821f4735N202J2313J1280M760q092K2392O624n681K2949j8043j1326j855Q316
16808a5896O356J866Q119L541k8074M727K4198J6366j410m541r356o042l603K842
16794i07J2952K1420j1587l0146J604L1020m044j7792j382J9449M02q901j0440
16781A648j0472p322k4107q115M3695J7405O860R781l766J1161Q535j9247j6050
16768A0006j0856R104K2731j1102j583k0773j9779j2596q459J8593J2989k152
16756a3877K3757J905j1090n657J0538K7929Q663j0332j9560o481j0579k1926
16744b6710o843m237O837K264J2848J763j0302J0334K8528P859K063m304k2037
16731a937j7265K7476J9073k3320q445J2469Q222J1007K7116J8991m0784k0646
$$ y = [-64735, -59533, -47220, -35940, -31180, -39272, -16880, -10256, -15937, 7012, -11031, -22357, -24212, -15896, -9540, -7674, 445, 3986, -24088, -19361, 4837, 21203, 19793, 15252, 5896, -146, -3749, -907, 12045, 33465, 21878, -8268, -6664, 24356, 20312, 2520, 1138, 20587, 20989, 12088, 1648, -8824, -16146, -40253, -48368, -4673, 12732, 19592, 29373, 25607, 36768, 45303, 26056, 10006, -850, 8254, 30985, 19883, 18300, -2473, -22252, -34848, -43307, -24714, -11725, -13877, 9880, 11785, 695, -4962, 5576, 33505, 42168, 31836, 12276, 5795, -4784, -26710, -33553, -37790, -30953, -28689, -15841, -14078, -24380, -14046, 14482, 22341, 24404, 20100, -1937, -19202, 8274, 27347, 4027, -4418, 8051, 16273, 27280, 54396, 73387, 32603, 11957]
16719A1957j1782r941j5326J986o947J2594J5960J1805k992k9350L316O804N057
16706f859R164o247p428L576j75L0717o727k1133o010K0272l490k2721J0872K3204
16692A7015j162m562J6865J5002J3051M017M64j4120j3207J3589k0248J784l1385
16679b897j2732J6440Q535J8151n63j5528J6206n724p079O423N845n794P50R064
16665C1097K886j6683j4238n826k0933j0763K769K9096o608j7266j5665o510M259
16652d4385J0816J4951J4036j2807n496q948l896p83J7377p42K365K717j6158
16639c0953j5627L231K8049r668k3544J938L4372J3640j822l0249j904N040J7406
16626a0091K0680J3394j338j0350r417j2873K2186P937k8734k2756k257J8898
$$ y = [11957, 175, -9766, -25092, -23106, -30053, -17459, -1499, 10306, 7314, -22036, -18720, -11916, -6859, 2305, -3942, -11370, -7794, -7969, 22748, 16021, -5112, -11122, 9150, 5660, -17061, -6189, 17015, 15853, 11291, 28156, 43158, 56209, 60226, 60690, 46570, 33363, 46952, 26704, 28488, -2897, -15629, 811, 9346, 27497, 26934, 11406, 27612, 21888, 14809, 21232, 27077, 21283, 22033, 31097, 33983, 17300, 3062, -2764, -23697, -34460, -31691, -2595, -9203, -26469, -42134, -48644, -44385, -33569, -18618, -4582, -17389, -22885, -31833, -35729, -36512, -19135, -19877, -17512, -14795, -30953, -46580, -43349, -15300, -24968, -48512, -46574, -12202, 1438, -384, -30633, -32537, -27497, -10091, 10589, 23983, 22645, 12295, 2878, -9995, 12191, 20128, -8606, -31362, -33619, -14721]
16614a4721J6001Q431J7279r248j5708j2569L86j0940k707J3733J1452J6885n691
16601A2583j032L214R213J6635K562j1271k2544k3964K35p20R625Q275N61k1941
16587a8569l166J9591L1982r13j9286J049R634J5569J6816m7236p267R804l402
16574D606Q611J284j4558r183j4789J2529N03N339J241M542J6066J0417r528J173
16560A8253P467J2797N88K315j1588J1760p801q756J1726k9654k5281k873J9533
16547a514J1042r179j0153O879J9271j1858k0384l01O491j1535k378J3242n104
16534a5481k8613j2379J3554J7658J5292J280J343J3947l001M572O068k1723q672
16521a6155j4080o566J5903M1586R495k3885j3331j769N141j7810j861J3090K0068
$$ y = [-14721, 1280, 9711, 26990, 17742, 2034, -10535, -10149, -21089, -23796, -10063, 1389, 18274, 12583, 11551, 14765, 23978, 40613, 43175, 31904, 9360, -14604, -14369, -15089, -5464, 2811, 3372, -18569, -21735, -2144, 29838, 28925, 9639, 10688, 20322, 35891, 52707, 5471, -1796, 8008, 4606, 13217, 14501, -57, -9240, -24029, -11500, -10997, -5658, -4417, 125, 16191, 26608, 17080, 18253, 25720, 38517, 39105, 41420, 29832, 41592, 33791, 25035, 36761, 7107, -18174, -21047, -1514, 9528, 349, -9804, -2925, 16346, 4488, -15896, -16197, -9706, -21241, -23619, -10377, -15481, -44094, -56473, -42919, -25261, -9969, -8689, -7346, 6601, 3600, 8172, 14240, -7483, -16155, -30235, -36801, -20898, 20688, 30183, 6298, -7033, -8802, -3661, -21471, -23332, -10242, 9826]
16508I826K8165J3165j4508j0105K4002k1110p723M819r003j1871j0695K0633
16496A5595J2898J0888K7213j8171k0032j8318o957k5339k3535O883K9210r939
16484a9604J9706K4014J3815r218j9334j6581O232N050J0256K819p075K036J2699
16471B4815L146k0545K192K5161k0618l2243J519P612L061k8393j943K4484K3429
16458A1677m284q990k7976k2411K612K856N483p650J3376K9529o97J0935R631
16445A4091J3739j2758J1964J221M026J0375n953r189j8631j4718l426j2986J24
16432b2121o952J721Q248L6073M1655r159j1749k1035K2718N879J5164j6244k2007
16419B2191l0339K2657J1242l3509l411N579J3709J0222n290J0716j3083j8700
$$ y = [9826, 37991, 51156, 36648, 26543, 50545, 29435, 21712, 26531, 17528, 5657, -5038, 15595, 28493, 39381, 66594, 48423, 28391, 10073, 3116, -22223, -45758, -38875, -9665, -19604, 102, 24116, 37931, 28713, 9379, -7202, -970, 4080, 14336, 17155, 10080, 12116, 24815, 27961, 7416, 9608, 34769, 14151, -18092, -16573, -8961, -5900, -34293, -36236, -11752, 11677, 7393, -1597, -29573, -51984, -49372, -46516, -41033, -48683, -35307, -5778, -6475, 4460, 14091, 27830, 15072, 27036, 28257, 32283, 42658, 36705, 27516, 8885, -5833, -9259, -22245, -22121, -29073, -27352, -19104, 16969, 58624, 49465, 37716, 16681, 39399, 45278, 60442, 44198, 22191, -8148, 14509, 25751, -7758, -11169, -5590, 8119, 18341, 13051, 23767, 10684, -8016]
16407h016j7730l840P501M06J2641J2052M56k8281q398j2146j0902J0291J8303
16394b7663K5833K3684L364k078J6499Q972K428k715m725l621j4623j354o760
16381A7241N280Q740l5795J68P482M183O931k78P213r89l4153j7327J368k487
16367c2423K6103o778q171l511J5449k7694o441J7528L7142J8361J0670J7536
16355E7771k0230j3884j0354J956j4083J3841L215p300N254k0161k868K2647r050
16342F754j0296r119N936K3474n273j2899P517q0J7197j5385Q038J2012J079M349
16328C3304j0056k0283j2693o55q942N93J6985L3946K3948m470l2727q06R590
16315B7734j8142l5445j1616J6933J5662l590J5970J5076J1014p383j6734j5828
$$ y = [-8016, -25746, -29586, -22085, -21679, -9038, 3014, 3470, -24811, -33209, -45355, -56257, -45966, -27663, -1830, 21854, 25218, 23140, 39639, 48611, 51039, 48324, 43599, 39978, 25355, 24001, 17241, 22521, 31261, -4534, -4366, 3116, 7299, 14230, 13952, 21165, 20176, -13977, -31304, -29936, -32423, -6320, -13098, -21269, -24780, -9331, -37025, -43466, -25938, 11204, 29565, 40235, 57771, 37541, 23657, 13303, 15259, 1176, 15017, 18232, 10932, 16186, -3975, -6843, 15804, 6754, -3542, -12661, -6725, 16749, 11476, -1423, 6094, 6014, 23211, 7826, 15864, 27876, 28955, 33304, 23248, 2965, -9728, -10383, -19325, -18732, -1747, 32199, 56147, 51677, 18950, 18144, 27734, 9592, -25853, -37469, -20536, -4874, -8464, 7506, 22582, 33596, 26213, 9479, -6349]
16303f349r797K2388m929k5451L3712J9992J9284j1116k8841k265J5659J1930
16291C4217j075k3351l0306L873R654l52j949K4020J6899j4016k9160m205k7490
16278d3241J831K7211K1566L004j0605j0457P459J2480R338l1888j4997O648J420
16265b0231P034L5833l518k504K342j4265m735J5058o807k5854M016M640J2974
16252C983J6848J4342p484m0129q844l440j9438K780P421j5035K982J0574J3235
16239b2205K6919R639k1353p920j2562O113K3728P720j2918j7069k7013J1743
16227c5178p242k6439K1969J6914j9292m693m008J8839K4031P345m735j2508L039
16214b1958M00K5487L22m289k2412J6385K3896k1302l089R338r952m167o87m1761
$$ y = [-6349, -16146, 6242, 1313, -24138, 9574, 29566, 48850, 37734, 8893, 6628, 22287, 34217, 33142, 9791, -20515, -16642, -6988, -7340, -9289, 14731, 31630, 17614, -11546, -15751, -43241, -41410, -14199, 7367, 10371, -234, -10691, -3232, 9248, 18586, -13302, -28299, -21651, -20231, -13197, 22636, 19118, 16614, 18956, 4691, -44, 15014, 8207, -17647, -13631, -8991, 3983, 20831, 35173, 27689, -12440, -21284, -24724, -44162, -41382, -33961, -48996, -46014, -35440, -22205, 4714, 14353, -7000, -14920, -27482, -21369, 2359, 10079, -2839, -19908, -46921, -35178, -42420, -68859, -46890, -29976, -49268, -53961, -57969, -39130, -15099, -7754, -12489, -24997, -21958, -21558, 3929, 4251, -38, -22450, -6065, 17831, -3471, -6560, 2778, -7174, -11341, -12028, -53789]
16200e3789Q361l828m378J289K2488N437q252K3133J9364K2091L749j4643k6413
16187e391J0004K9079j6031k107P075K6287m843j8327J7616j4704l3530j5151
16175b0023J7187j0177K899L0093P455j3416k2710k9212O379k942J6134M36P150
16162a0747O608L0422p653k1327J689j1031j1018K724J0447M90k576l904J3528
16149b348L0884J488L176j448k0046k5073j6980j6745J0911M591M117J7777m440
16136a4136L1284k345O63J0622j1370k4688q35r723K3699j0842j4778N258o003
16123b3194n609M908O959J8178L736P054l347k5650m507j195m17O251Q226k462
16109a1069n639L359L6078K1585j0131k1912K636K6511N774r738l178r954j2095
$$ y = [-53789, -45428, -49256, -53634, -52345, -29857, -24420, -32672, -9539, 9825, 31916, 35665, 21022, -5391, 4613, 33692, 17661, 15554, 22629, 48916, 44073, 25746, 43362, 28658, -4872, -20023, -2836, -13013, -10114, 19979, 27434, 14018, -8692, -37904, -31525, -34467, -18333, -17897, -10747, -4139, 26283, 18630, -2697, -1008, -12039, -23057, -20333, -9886, -9396, -11972, -15876, -2348, 28536, 30024, 33200, 31752, 11706, -13367, -30347, -47092, -36181, -31590, -27473, -9696, -14136, 17148, 14803, 15466, 26088, 14718, -9970, -10805, -20528, 3171, -7671, -22449, -17191, -23194, -28803, -23895, -16936, 1242, 4978, 12032, 8685, -16965, -21472, -22667, -23084, -16833, -8607, -11069, -16708, -13349, 22729, 44314, 34183, 12271, 14907, 41418, 47192, 37454, 34276, 24322, 12227]
16096A2227j2430k0118J2337J3239j5614j0141N914K1237J0056j7487M561P00
16084D481q282l643Q550r451n388j0859r468r806m110K0452K7009l847k0752j6292
16070d1406j1849K8160K8657J9448j7504j1516j1086r836j719r4K1201K6901L0682
16057E0039j3339j5766J3534j6873l3190k2183K115L3369K9011K201k3741j0312
16045e135O163k0287q621K4364K9990L663j0179j5583j359J5138l6o321k5900
16032a4103P890J0932j9718q200J9764M313p141q89R04J9324K3138J7102j1992
16019D1324j0535j2842M728P763M601m161l794J079J247j5454p423K3004K3034
16006E2571l0585m4684j7190P926K2016J0358j6468j46J1788J3569m039J2186
$$ y = [12227, -203, -20321, -7984, 5255, -10359, -20500, -14586, 6651, 16707, -780, 3781, 4481, -3801, -7444, 1106, -8345, -13733, -24592, -34060, -43866, -47976, -27524, -515, -4362, -25114, -41406, -53255, -25095, 3562, 23010, 5506, -6010, -17096, -26932, -28651, -28745, -7544, 19357, 50039, 36700, 20934, 34468, 17595, -15595, -37778, -35663, -2294, 26717, 28918, 5177, -5135, 1028, -19259, -27880, -3516, 26474, 30137, 19958, 4375, 3016, 18154, 18118, 11797, -14103, -6213, 4719, -14999, -23199, -3435, 878, -6263, -7152, -6248, 13076, 36214, 53316, 41324, 30789, 17947, 22675, 30438, 35039, 30878, 27084, 28163, 29410, 13956, 6533, 29537, 52571, 21986, -22698, -39888, -31962, -9946, 412, -16056, -16202, -4414, 9155, 5116, 17302]
15994A7302k9742N556J2894q116j7193j6509Q849O902J697k648j284K1104J9688
15981A8500l5314l1507K4809L0889R40m485J176r038j0032k1838J6791J8473j5536
15968a6172j9120K3147L8747n020j907J2980N069o535n1008j3998j2438l921K1900
15955b8276K0360K2988M826k4492j8823J2978L0437J25R74j3666j7578J9813J5590
15942B5256k669l3078j530J3434O573O495r801J9086J7088j5413j7984j3496J4090
15929H051l188j9305o594J1220k251J6517n397q084L603q245l78O9K449j1066
15915b2599k908o309o0J6225L8439K4798q827j1845q336J2582n240l918k5410
15902c408o361J4634n680L736o463k7680K4043J544O676M443j1799R293k1695
$$ y = [17302, -12440, -6884, 6010, -2106, -19299, -35808, -26959, -20057, -18360, -21008, -22292, -1188, 18500, -16814, -48321, -23512, 7377, 8317, 3832, 5008, -4030, -14062, -35900, -19109, -636, -16172, -35292, -12145, 26602, 21582, 19675, 32655, 37724, 31189, -19819, -33817, -46255, -50176, -28276, -7916, 15072, 19898, -4594, -23417, -10439, 19998, 20123, 21097, 7431, -10147, 9666, 25256, 22587, -10491, -12021, 1413, 7986, 14481, 4680, 23766, 40854, 25441, 7457, -6039, 8051, 4863, -14442, -21036, -9816, -12067, 4450, -947, -9031, -5428, -13673, -14051, -13982, -11533, -22599, -25507, -31816, -31876, -15651, 22788, 47586, 38759, 26914, 18578, 31160, 25920, 22002, -3408, -9769, 4865, -815, 2921, -3542, -31222, -7179, -5635, 1041, 5484, -6315, 2978, -18717]
15889a8717k00K5854R444p844k60k6024j376O375J1177L4767K4152k395k2995
15876C1958L345j6492j5745J2904K5028r143j0820j0261l506J0395J5504o88l346
15863B9133k5090q493k781Q539p44O626j3538o916R339q256p738k926L799R170
15849i876R9J5907J7779p379j5220q400P064j1824k2629j3500L4833K5679l961
15836H572j5940j2355J0718J6046O928q406J959j5500O062j4276N042J2943J2307
15823A4100j3911J339R015j4987J3564l62j0305Q793m652J392k7467j2079R932
15810b5628R386K7595j1267j220J1663N890p154j481j7010j002J932J4035n359
15797C80j0574j9501k4972J5614K1899N129K0700j511k6645J2175J0042l842q176
$$ y = [-18717, -18917, 6937, 16381, 8537, 8277, -17747, -19123, -12748, -1571, 33196, 57348, 54953, 31958, 35303, 18811, 3066, 15970, 40998, 31855, 21035, 10774, 7268, 17663, 33167, 32479, 29133, 4043, -4450, -7231, 1308, 564, 7190, -6348, -13264, -3925, -12181, -19919, -22845, -19046, -9876, -9777, 6130, 23909, 16530, 1310, -7090, -26, -11850, -34479, -47979, -13146, 12533, 8572, -7368, -19723, -9005, 7041, 13969, 5563, 7522, -7978, -1916, -16192, -11150, 1793, 14100, 189, 1528, 10543, -4444, 9120, 8758, -1547, 7246, 2594, 3986, -23481, -35560, -25628, -16242, 11353, 86, -1134, 10529, 16419, 9265, 7784, -9226, -10228, -8296, 5739, 380, -10194, -29695, -54667, -39053, -17154, -12025, 8675, 7164, -19481, -7306, 2736, -1106, -9282]
15784i282k6771Q61j2183K753n866j772J1246J2346k0K7692K084K529J0966K089
15770A6672j4674l4512k4063J6566R575K3915N550o456l6802M5992N3551k9247
15758B6067j7415o792N437N20j1651R938M447J596n202j1844k5966J2763J2659
15745e443J7608j4956j551M301k4256J7197K905J3189Q744j5145J891K0826n033
15732B0277j8194k424K2956L249m0513j5264L035N374j0706m61J5390q607r905
15719c5793j5252o8k4079j1744J9422J0727K2853P923m248J3265J4293P392N917
15706A0608L81M518j6180n546J9877j3366j2882j7280J0191p398J5864J9967m274
15693D480l1271j4471j638q202K5214J2008j290j1742j501K2100K0320q957j7455
$$ y = [-9282, -36053, -35192, -47375, -44622, -50488, -52260, -41014, -28668, -28688, -996, 1088, 3617, 14583, 16672, 1998, -32514, -56577, -40011, -30436, -6521, -971, -7427, -44229, 1763, 55314, 26067, 8652, 1860, 7297, 7817, -3834, 6104, 10551, 12147, 6945, -4899, -30865, -18102, -5443, 12165, -2791, -4342, -41, -24297, -7100, -4195, 8994, 17738, 2593, 4484, 25310, 20277, 2083, -341, 22615, 25864, -14649, -29913, -26878, -21504, -32210, -32671, -17281, -25888, -35793, -51045, -51113, -75192, -86936, -67514, -56787, -33934, -26011, -30259, -16994, -2701, 4691, 10608, 10989, 15507, -673, -6219, 13658, 292, -12590, -29870, -19679, -27077, -11213, 8754, 4480, -26791, -41262, -42900, -51102, -25888, -13880, -15170, -26912, -28413, -6313, 14007, 5050, -12405]
15680a2405j724K5332J8214n338K2885k304j1181Q459J4577j9740l464k9839j2421
15667h949L0746N079m414q549j7615J916L0778K020j0795k6405K421J2935k7872
15654a8704J5398K0822j0451l2349O250L0104o287j2221J7655J6828L844k214
15642B8675k2318k0006j6523K3562K455j2933O054J9989J9993P893l2027j9834
15630a5020N951J0082L3657J1428k9590k0866j265Q449k1450M564J2970N106O789
15617A0805j0417J613J3520j653K1285j1518k964K8844j5459m0791J5077J6272
15605B4614j6096l1760p769K8645k314j7651J7321O860j7830j6890J2765j0669
15593c0774k4149K725L1144K4581J2145j4296j151j3606j6888m174J9670J155
$$ y = [-12405, -14129, 11203, 29417, 24079, 46964, 44660, 33479, 41938, 56515, 36775, 33311, 3472, -8949, 21797, 26876, 22462, 13913, -3702, -1786, 28992, 31012, 20217, -6188, -3767, 9168, -18704, -3306, 17516, 7065, -25284, -19034, 11070, 4783, -7438, 10217, 27045, 30889, 28675, 6357, -13649, -30172, -6610, -4155, -17088, -11034, 8955, 28948, 36841, 4814, -15020, -9069, 1013, 34670, 46098, 16508, -4358, -5623, 2826, -18624, -14060, -1090, 4016, 10805, 388, 2001, 15521, 13868, 35153, 23635, 20671, 49515, 34056, -6735, 8342, 24614, 8518, -23242, -31011, -2366, -4680, -22331, -5010, 1850, -15980, -32870, -20105, -30774, -54923, -52198, -21054, 3527, 15672, 1376, 225, -13381, -30269, -34443, -14773, -13618]
15581a3618J0651J9441j192k780l501k0555l0013r400N092J3553K1495J2743J4665
15568A6581Q203k3746m4518j9593J2983K7061J7931K696k2727j1545j6083J4886
15556c7871K4860K179J6875P444N251M605J4893o384j5480p364j0970j4702j3763
15543c0427m749M327K9934K8919l066J6065r591j3282j3171j9659M661j13R434
15530g18l96J7262J1896Q03q11P632K2304k6032l6931j4388q57j6929J1333O223
15516a9609L888L877P206n634K094j7603j1942o886j595K8308L9964j7027N221
15503A0262K3517n720k1964l3959P96j5699J2125L7498J6627j6101k6280o108
15491b5006j1201K3768K7853j04j5044j4769J5905J1534J7977M030l2916k2884
$$ y = [-13618, -2967, 16474, 15282, 12502, 9001, -11554, -41567, -50967, -45875, -32322, -10827, 1916, 16581, 24784, 1038, -43480, -63073, -50090, -23029, -5098, -2402, -25129, -36674, -52757, -37871, -13011, -10832, 6043, 13487, 18738, 23343, 38236, 31852, 16372, 9008, -1962, -16664, -30427, -35176, -30849, -915, 28004, 24938, 41003, 31412, 18130, 4959, -14700, -10039, -10152, -718, -1114, 16148, 28044, 28847, 28036, 35668, 57972, 31940, -4991, -19379, -20236, -37165, -25832, -19609, -15721, -11844, -4638, -10272, -8178, -25781, -37723, -44609, -46204, -17896, 22068, 5041, 10262, 33779, 28059, 6095, -27864, -27068, -42767, -30642, 6856, 23483, 7382, -18898, -25006, -36207, -12439, 15414, 15310, 266, -14503, 1402, 12936, 30913, 34943, 2027, -20857]
15479b0857J4200j4648j5121o926M805K345m550l379J0151K9930J4086j7344N152
15466b156K2709j7611k1056j1206q270K0122J2836O724M032n114j8163j51P059
15453a0245L143J0056n799m26J4690l886k3083P308J3220N412L155j1951r235
15440g641J2236K1938n628k4313j2128P657J0188Q528r232k6342m47M615R939
15427a0630N506j830J2323L459J010j2154l934J1340K148l522l66l4115p713J4827
15413b3651J4786L680J1925j4209R819j3655k1485j8960K1544K2168N539L42q118
15400a0275q04q99k55j4937n601K1547J0391N437P123k268j4719k332L894P850
15386D152l212J5124j6610k5115J8853K1038l10o457N489L494o358k134j2614
$$ y = [-20857, -6657, -21305, -36426, -43352, -38547, -36202, -40752, -44131, -33980, -4050, 10036, -7308, -2156, 20553, 2942, -18114, -29320, -37590, -17468, -4632, 2092, 6124, 1010, -17153, -17304, -10245, -7102, 2954, -2845, -3271, 11419, 7533, -15550, -8242, 4978, 10390, 13545, 1594, -7641, 4595, 26533, 20905, -3408, -15536, -7879, 2309, 10837, 1605, -24737, -25184, -20569, -10630, -5124, -6954, 5369, 8828, 9838, -2316, -6250, 5090, 7238, 3716, 3350, -30765, -38478, -23651, -8865, -5185, 6740, -7469, 2350, -11305, -32790, -51750, -30206, -8038, -2499, -2157, -10275, -11079, -11978, -12233, -27170, -32771, -11224, -833, 4604, 11727, 9459, -5260, -7592, -3698, 4152, 940, 16064, -546, -25661, -6808, 14230, 13920, 7463, 12952, 16446, 10088, 7954, -4660]
15373d660P191J8122J2292J1558K3712P433k9353j4743m227k2789q572K0386J1178
15360B7528N343j0810j7611j9997k465O814j1604k357j79J5108O958O729L326
15347F783j664Q764j1050j2979L67j2231K3338N693n266j1944k84N662k4828n190
15333c4829m812J5255L931j0543q160J7945R711J431J9208m006k061K982j3058
15320g006k3661N23N625K0530M483r445J2446K6895K1155k2057j6303L331K73
15307A6789j60n94k1358Q850K6050n646k4130L720L212n040p624o577n91J2406
15293f93O678K219J0500o553J0081J3921J863m907k4277r331J3437J2254q268
15280A6924q484q091K414P226o026k2565l3801R575J1228J44J4272R233J9971
$$ y = [-4660, 2531, 20653, 32945, 44503, 68215, 75648, 46295, 31552, 27325, 4536, -4036, 16350, 27528, 32871, 22061, 4450, -15547, -18012, -11198, -22802, -25159, -25338, -10230, -3272, 3457, 6783, 5119, 13883, 2833, -10146, -9779, -22010, 1328, 7021, 1755, -10189, -10473, -4811, -29639, -34829, -39641, -24386, -20455, -30998, -39158, -21213, -11502, -10071, 9137, 5131, 3070, 6052, -7006, -30667, -30144, -24519, -3989, 494, -8951, 3495, 30390, 51545, 29488, 13185, 16516, 16789, 16629, 16035, -5323, 3527, 29577, 23931, -199, 3521, 6733, 1693, -5931, -12508, -13099, -693, 5985, 8204, 18704, 12151, 22232, 36153, 38016, 33109, 8832, -499, 12938, 25192, 16924, 8440, 349, 2763, 9989, 3963, -18602, -52403, -42828, -31600, -31456, -17184, -7951, 12020]
15267A2020J9211R745j3275K5213k912l7721l1930j2105j9987N014L2028K1861
15255G162R42L495P447j5295q452j6790j658j6678J8530J5288m822j6200j3131
15242d0162r85J4991K3070o178l1393j9618R966L753J8543K2185p831j0645j0060
15229c4364K365P15J7493m637k1290K3919r636J2292L6547K3215j0648N021j0501
15216C0491n15L728o498j5012n108j4309j5078Q689k98L141J6589r000M592j0630
15202i218J7504J6333J146k2124j0425k860J9881L907j8419r286o492L0977K4688
15189C5612M88m544j1638m2210K0738R336J04q111l949L488j6219j1205K7232
15176h78N755L455J0201Q426K1316j4267k1724j6132L372J5165J591N823k4722
$$ y = [12020, 31231, 40976, 27701, 52914, 50002, 12281, -19649, -31754, -51741, -46727, -14699, 7162, 8104, 11599, 19046, 3751, -4701, -21491, -23149, -39827, -21297, -6009, -10831, -27031, -40162, -41147, -26156, -3086, -9264, -40657, -60275, -50309, -46556, -28013, -5828, -13659, -24304, -34364, -31999, -31284, -13791, -18428, -39718, -15799, -25435, -13143, 23404, 46619, 35971, 40992, 30491, 29976, 33704, 27206, 12194, 7086, -7223, -22301, -13612, -13910, -10769, 5820, -3180, 1412, -9218, 8286, 24619, 25765, 3641, -6784, -9644, 10237, 14144, -4275, -13561, -20053, 10924, 35612, 36100, 31556, 19918, -22292, -1554, 7782, 7886, -225, -4174, -686, -16905, -28110, -878, 4877, 8332, 18533, 26959, 48275, 34008, 12284, -3848, -476, 14689, 16280, 22103, -2619]
15163b619j5483j3922j670N812K4962j2985L822Q890L9513J4870l8324M673k995
15150A4544k1724K3622j3621o841J682l396o454J8742n428K9171N743k0880k7329
15137a2169j2509L772K143K2124o793j73K3703J7520k0464k8696J3541N6039j3261
15124D4777l8672k2141J6470J9311k3778k9763J5759L6287J9920j7784k905l599
15112A3882n560j7219o318J3513l661K7808K310O592O860J6131R431j5871l6231
15099A1667k3787L364Q931Q499k9P24k9780j9579Q069O196J9390O007k7672k653
15085c0653K0542l920R122J6784j4395k3648J2538J4038L012j5851q940K3569
15073B198m240j5180O960K9330K0347k6443k4218R242J1046J2102J1993k1111
$$ y = [-2619, -18102, -32024, -33694, -27882, -2920, -15905, -12083, -3193, 36320, 51190, 12866, 17539, 14544, -7180, 16442, 2821, -4020, -2338, -5734, -12188, 6554, 1126, 30297, 36040, 15160, -12169, -24678, -20906, -18763, 3361, -3432, -3605, 20098, 37618, 17154, -11542, 1999, 58038, 44777, 6105, -16036, 434, 19745, -4033, -33796, -18037, 18250, 38170, 20386, 17481, 13882, 8322, -8897, -15215, -1702, -5363, 22445, 24755, 31347, 38207, 54338, 63769, 47898, 11667, -12120, -8756, 175, 8674, 8645, 9369, -20411, -39990, -31921, -25725, -6335, -328, -28000, -30653, -10111, -14031, -4909, 11875, -2520, -26168, -13630, 408, 3420, -12431, -21371, 2198, -2042, -17222, -10262, 19068, 39415, 12972, -11246, -2004, 9042, 21144, 33137, 12026]
15061A2026j5243J1669K1043O583k8408n443n4574j5077N1800J9428P719j7663
15049f140j5224J0264J5231o789m565o448P998m288K152J9839k152K145j4997
15036b974l371M986j1269j6751r618J1858M929P009n112o898J6674n559o098k1186
15022d3380j3784L1471Q958L37j2513Q477N1614M734m4273k0860l935J373J9650
15009a2131J5059L974k3746J9170J7472o973j0746M63J0442J0900R193J642j3793
14996B0926r457q858m467k48l328l997j1090k343q813PJ8900K0508l851J7673
14982B1562J66l625r066r736J3332J3124N943j1209r611j6627P230R75j7373o794
14968b1709q769n032K5248o548j9136J8091K1966r418j1484J7188j528L909P730
$$ y = [12026, -3217, 8452, 29495, 36078, 7670, 2227, -52347, -67424, -15624, 3804, 11523, -6140, -21364, -11100, 4131, -2658, -7223, -13671, -5673, -9961, -7809, 12030, 9878, 12023, -2974, -6345, -1359, -12628, -29379, -38997, -27139, -22210, -15201, -20313, -27211, -10537, -16096, -22194, -43380, -57164, -25693, -16735, -16398, -28911, -20434, 31180, 35914, -8359, -29219, -33154, -31781, -12131, 2928, 6902, -16844, 2326, 19798, 12825, 2079, 2542, 12984, 23884, 33077, 34719, 20926, 11469, 2611, -1856, -2104, -5432, -9429, -20519, -22862, -31675, -31668, -12768, 7740, 3889, 21562, 21728, 18103, 9037, -699, 12633, 25757, 31700, 20491, 10880, -5747, 1483, 2458, -14915, -21709, -30478, -35510, -10262, -16810, -35946, -17855, 4111, -5307, -16791, 397, -1131, 2778, 10508]
14955A0508L1846j9916m8571M684J0390m116Q657J1754o762j9443M190o897J2297
14942a1379l707J4240r673k3900K4448J8165p571k7466j4576k964J1424J9340
14930a3619J247L440j8799J5344J6042k944j2437p908k6223J580J2142K6616J9156
14917A3637j798n892O646M188k2774k6335R009K7640K5106j8426k3625n639j5729
14904c3992l067K5315J3774K581j87M838k1569q615K5109J1047o164J2232j0078
14891A1224r734j6153k220J1582K5170L43o496k5061J8956J5447L542r679p977
14878H944J0971J9763J2465k0962j699J2468J2034k1744j9086o613o520K1091
14866B1112O358j0701j7987k0565o33O647l2564J2451J0647J8831J2132k8337
$$ y = [10508, 42354, 22438, -26133, -21449, -11059, -15175, -6518, 5236, -1526, -20969, -16779, -23676, -11379, -15086, -846, -10519, -34419, -9971, 8194, 623, -26843, -41419, -44383, -32959, -13619, -12372, -8932, -27731, -12387, 3655, 711, -11726, -19634, -45857, -44277, -32135, -5519, 13637, 11839, 5947, 12593, 16781, -5993, -32328, -23319, 4321, 29427, 11001, -12624, -18263, -33992, -37059, -11744, 2030, 4611, 4424, 9262, -12307, -20922, 4187, 15234, 9070, 21302, 11224, 1490, -14663, -16883, -5301, 19869, 20212, 13716, -11345, 7611, 23058, 26600, 16921, 8944, 19915, 39678, 52143, 31181, 29482, 41950, 53984, 32240, 13154, 6541, 21, 21112, 27470, 16769, -1218, -21783, -22416, -15769, -48333, -35882, -25235, -6404, 5728, -22609]
14854b2609Q154K3460J0126J0999o400k0285j3184P086J1199q235P411j342j0463
14841d083j6587K4191L196M153L46J3395J7166k887l6107P88o348N542k5531k7667
14827e0433n637K2497K1671J5489m074j4087j381q766q002N229J0877O476J4187
14814D046M4318R656j5776J0594k8703j1124O386R228q853P887O566j7472n800
14801A0953p99M450L124P46o331q844j020r720K4205J1089j8913n745J1135m517
14787I813n591O946j353J611j03M306k5893k7230K5254K6824J9101R091l969N223
14773D4030j1103j7094o377j3315j684o57O988k6092K1611J5845O078J1068J027
14760C0325R668j19k8576k1266j1510M189K2292l098K888Q443j4633j2605j704
$$ y = [-22609, -14455, 9005, 19131, 30130, 23730, 3445, -9739, -2653, 8546, 311, 7722, 6380, -4083, -20670, 3521, 6717, 10870, 11216, 24611, 41777, 38890, 2783, 3571, -2777, 2765, -22766, -50433, -56070, -33573, -11902, 3587, -487, -14574, -15955, -24721, -32723, -27494, -16617, -10141, 4046, 48364, 58020, 42244, 52838, 24135, 13011, 19397, 28625, 19772, 27659, 34225, 16753, 10953, 10154, 14604, 17728, 18474, 12143, 3299, 2279, -7441, 16764, 27853, 8940, 3195, 14330, 9813, 4222, 11168, 9815, 11426, 11323, 15629, -10264, -37494, -12240, 14584, 33685, 42776, 38807, 44030, 32927, 15833, 9456, -3859, -5543, -6200, 788, -25304, -3693, 12152, 18230, 29298, 30325, 39993, 39874, 11298, -9968, -21478, -17289, 5003, 1905, 4793, 13236, -1397, -14002, -15706]
14747a5706j3155Q235J9593j6465l706J1764P430K671R346J017j7832j0530O081
14734a1257M6403K7648p232m4125k1676L025N641j4321j3473n517J8424J6625
14722A65K4798k39k367m254n136k880p198j2644p229J7157p809N26N999L692L3813
14707C6394j3196k1456P73J0436J5012q142j5132j928M825p026j5079L406r01
14694a2014K168L847j5670K586n699J6964q202k4784m303O564Q689J8667J366
14681i821J4044J8361J1687j1727q663r613m0561L253K8422L1K0235n248o938
14668C462q624k95n391K463J5481J3394j7502L932K5823l79q012k8475j3080L881
14654a3322q158p465K0216J9733j4574j083m304Q344L436K0699Q239K415j5827
$$ y = [-15706, -28861, -20626, -1033, -17498, -21204, -9440, -2010, 661, 10007, 11024, -6808, -17338, -11257, 35146, 62794, 55562, 11437, -10239, -7214, -1573, -15894, -29367, -34884, -16460, 165, 24963, 24724, 22357, 18103, 12967, 10087, 2889, -9755, -16984, 173, -7636, -7110, -1111, 2581, 36394, 23198, 1742, 2515, 12951, 27963, 19821, 4689, 2761, 7586, 560, -14519, -11113, -12014, -9846, -5999, -21669, -19083, -24782, -7818, -16020, -40804, -45107, -38543, -29854, -11187, -9821, 4223, 22584, 34271, 22544, 13881, 4268, -36293, -33040, -4618, -4587, 15648, 10400, 3462, -5162, -5457, -10848, -8385, 7096, 20490, 2988, 6920, 32743, 32364, 24352, -4123, -17203, -13322, -21480, -28945, -8729, 11004, -3570, -4653, -8957, -613, 2823, 23522, 31761, 34176, 18349]
14641A8349k9097k9363P290L2006K6445j2658p880j524K2435O717M424m4529q020
14628a5405P943m293N243m135p002J43N181M247o121l402k883J0328j272M350
14614g078J3451j0206p556m537J6674O639J3633m471N885j8422j7936j2526J1667
14601a4783K5033J3446j1502j3787o610K220j6536J5746J0573q313J6617j2365
14589b61J5197J5241j1884M009r610K108K2128n147n738l3239j8986j490k070
14576b9742K202j6511l472Q173n392J8092q96Q461K0916n05J6425m505k2586P311
14562b029q450R845J4170l213j8049r10k229J0740M2322L2033k5969l4713k4227
14549a0679O540k748k6305j5856N66J1678K1668L3210k984j5531m836l9283K4089
$$ y = [18349, -10748, -40111, -32821, -815, 25630, 12972, 5092, 3568, 26003, 32720, 37144, -7385, -15405, -7462, -11755, -6512, -10647, -17649, -17506, -12325, -8078, -14199, -17601, -20484, -10156, -11428, -7078, 6373, -3833, -11389, -15926, 748, 7387, 21020, 16549, 22434, 4012, -13924, -26450, -14783, 10250, 23696, 12194, -1593, -8203, -5983, -22519, -6773, 3800, -4513, 12104, -261, 14936, 30177, 18293, 22302, 12692, 14800, 36928, 31781, 26043, -7196, -26182, -27672, -29742, -27540, -44051, -47523, -39350, -44742, -26650, -27546, -19085, 1831, 1326, 17751, 13246, -9340, -2029, -10479, -634, 13536, 10323, -7726, -8636, -10865, -125, 42197, 74230, 48261, 13548, -10679, -4139, -6887, -33192, -49048, -48482, -36804, -15136, 18074, 15090, -441, -5277, -44560, -20471]
14536b0471j7226j89J1284J7841L185J2079K0904j3217P24J344j2004o369J0490
14523H375K503j0859O92K775Q713l019J530o106j74K4469J8051k4375m825p945
14509I805j4766n790J6465J7964N762k8108j3014l158n403n462J2647K0938k973
14496D907k8255j355J0049J7729M606M935K0010J3007R307k0090j4924k0143n385
14483e602J2333J0367J5000j3645k3636O391J6116J3420O33j098L442j2654L539
14470B4606R825k6602j9266O038J1789J4087j5377J435K235R315m590r114k6855
14457b2474k2681L3232L0914R877L055j8811j7500K858n276J3372N3p047j2383
14444a2811j1640l99K3215P425L981r669n037K320k787J5441r379J8120J0239
$$ y = [-20471, -37697, -37886, -26602, -8761, -5576, 6503, 27407, 14190, 14914, 16258, 4254, -2115, 8375, 10878, 19, 711, 3486, 12199, 9180, 10710, 4604, 4430, 28899, 46950, 22575, 17750, 9805, -4961, -10751, 5714, 23678, 29440, 1332, -11682, -14840, -20243, -25705, -13058, 7880, 4907, -23348, -24703, -14654, 3075, 7681, 12616, 32626, 45633, 54940, 34850, 19926, -217, -5602, 6731, 17098, 32098, 18453, -5183, 1208, 17324, 30744, 31377, 30279, 33721, 21067, 24606, 34431, 7829, -11437, -5399, 6390, 20477, 5100, 6535, 8770, 18085, 13495, 4381, -22474, -45155, -11923, 18991, 28868, 31923, 13112, -4388, -1530, -6806, 6566, 6619, -428, -12811, -24451, -24850, -1635, 5790, 9771, 102, -4935, -2615, -5402, 10039, 660, 18780, 29019]
14431B9019k4498k6766j9234r783j9247N803L2486J7238J8210Q349J5786K444
14419B9807j6401N296o989Q370l84j9408j2358L266q165J7328J7438l1726j103
14406a5029K4933j7027M7p576j8361K0060N490P699P381j8359j1276p12J1205
14393a1525J0757m643J3749K5092J6772j9021j5995j9368N483J8761M914P979
14381C2955K246j1751j5367k326R312K914J4800j141J865m927k9060n081K9389
14368B3828K0067q715k2111J2604m393L435j4489J412K1358M676j0554k952r278
14355A4888l1218j9048L417K4322L8955J1191j2945n449l688j0669k0836K8060
14343A6980K3908r432l058p678M121L624j4205j6696J6140N152J2596M851j2444
$$ y = [29019, 4521, -22245, -41479, -51262, -70509, -64706, -32220, -14982, 3228, 11577, 27363, 29807, 13406, 18702, 11713, 20083, 19699, 291, -12067, -8801, -16966, 362, 17800, -13926, -15029, 9904, -7123, -7076, -14652, -33013, -12953, -7463, 236, 7617, -10742, -22018, -22730, -11525, -768, -5411, 8338, 33430, 50202, 31181, 15186, -4182, 1301, 20062, 24976, 32955, 35201, 23450, 8083, 5757, 15069, 17983, 32783, 31642, 33507, 28580, -480, -5561, 23828, 43895, 35180, 13069, 25673, 21280, 24715, 10226, 11638, 32996, 37672, 27118, 24166, 14888, -16330, -35378, -31961, -7639, 31316, 42507, 29562, 24113, 20425, 9756, -11080, 16980, 40888, 31456, 28398, 20720, 24841, 28465, 14260, -2436, 13704, 18856, 31452, 36303, 23859]
14330B3859j0025J4441L034k4884j9012R046K7134J4023j0291L421o267j4092
14318A0387j8396L4145L092p869O864J5375m238L455J1279j0762q955K2655N878
14305F2910k8639j1464k4894J991r000J1293Q427j2087J685N73j2292K6693k838
14292A2358j6779P26J0727k8928j1241R359L5159K447k9936o500n159j7536q092
14279e3395L2390K8281o440k6848o731j9606r048J8252R740J4558L0802p492r665
14266e202J0778j4984j7644R200J2025j4202J5147o837j7278k650M0918Q921L361
14253B1553O36j149K167k7779j0170j4726j2333j6966L6151L0118r548j2991r550
14240b4587J1491R891j1134J1467K2470O546N332o954k2398R207o477J2100m325
$$ y = [23859, 13834, 28275, 31309, 6425, -12587, -3541, 23593, 37616, 27325, 30746, 24479, 10387, -8009, 26136, 29228, 21359, 28223, 43598, 39360, 42815, 54094, 43332, 34377, 57032, 62910, 34271, 22807, -2087, -96, -9096, 2197, 10624, -1463, 222, 795, -11497, 15196, 12358, -4421, -3695, 7032, -21896, -33137, -23778, 11381, 13828, -16108, -22608, -27767, -45303, -53395, -21005, 7276, 836, -26012, -32743, -52349, -61397, -43145, -33405, -18847, 11955, 4463, -5202, 5576, -9408, -27052, -17852, -5827, -20029, -4882, -11719, -28997, -31647, 9271, 18192, 21553, 22189, 21040, 23207, -4572, -14742, -29468, -41801, -58767, -22616, 7502, -2046, -15037, -24587, -13096, -3205, -14339, -2872, 19598, 26144, 31476, 24522, 2124, 11331, 4854, 16954, 12629]
14227A2629k2429r722J3397j065M713j3187j1778J6654Q383J1867J1870O78r358
14214A2652j0353P970j3718K534O01n371J149O282J7764N497J3241q193j7560
14201A2495k2911l512o27n112j09K4635j1515k5080p320j5650K0892O221R424
14188a8169n554l1854R959N444J5314L1093n347J7433j8002j415J651R938k3736
14175a3245k916K1590J2375j0248j4273j1952q775J6315J62R416q1M807K1333
14162B4508j1110N141J561m717j8798j1214j1288N670L7588K9914K347O239j6257
14149C9584k2279r241L963k55K263k1218k2614N071K0457J764j6760K1499P805
14136A0039j67J024J3214J8526r438j5949m607l707J586k457q698K0326m827j9853
$$ y = [12629, -9800, -19522, -6125, -7190, -2477, -15664, -27442, -10788, -2405, 9462, 21332, 22010, 12652, 2299, 10269, -3449, -915, -314, -5685, -4536, 1746, 19510, 25007, 38248, 30055, 12495, -10416, -13928, -14555, -19667, -19776, 4859, -6656, -31736, -39056, -54706, -33814, -27593, -18169, -23723, -55577, -45618, -40174, -24860, 6233, 886, 18319, 317, -1098, 553, 10491, -13245, -16161, 5429, 17804, 7556, -6717, -18669, -27444, -11129, -10967, -1551, -1632, 3175, 24508, 13398, 18539, 20100, 15383, -3415, -14629, -25917, -20247, 17341, 47255, 49602, 55841, 39584, 17305, 8064, 12027, 11772, 14035, -7183, -29797, -24726, -4269, -2505, -19265, 2234, 10039, 9872, 10896, 24110, 42636, 33198, 17249, 12642, 8935, 10521, 8064, -634, 19692, 14865, -4988]
14122d988r422o669J3905L2042K3558k6060p465L447m861j8196J1885J5181n226
14109A7131k5497J2308J7206J5066M435Q166j5552k5093j3609m949k859P301J1597
14096E651j4370l8588j5160J5219j1375J4872K7853J0968J1041J136O225o957
14084F515J0177J2752o023q43O785r293j7072L295j245o340J3609L4071j4304
14071C2084l5228m739J8519l341J1858J7130P264L348j4765j2938L440R855k8778
14058C709j3262J118J6100n763j9610l151J1826q468J4523P975l0375k2721L5297
14045a2802M0622j8347j4245Q30K964j475L390j8337N432J0121o663O84J3118
14032E292J5930j0413k2791l518J0060n448n975J4071l734j3900n667j8856J1771
$$ y = [-4988, -14410, -21079, -7174, 24868, 48426, 22366, 14901, 18348, 13487, -4709, 7176, 22357, 17131, -8366, 3942, 21148, 36214, 40649, 48815, 33263, 8170, -5439, -10388, -13247, -5946, 5651, -8719, -47307, -62467, -47248, -58623, -43751, -15898, -4930, 6111, 7247, 13472, 6515, 16692, 29444, 23421, 22578, 29363, 20070, 2998, 6293, 5048, -1292, 12317, 46388, 32084, -3144, -7883, 10636, 7295, 19153, 36283, 43547, 46895, 32130, 19192, 22632, 32487, 3709, -9553, -8435, 7665, 1902, -17708, -20859, -9033, -17501, -2978, 4997, -25378, -48099, -12802, 27820, 9473, -4772, -3942, -978, -2453, 937, -17400, -11968, -1847, -8510, -7826, 5292, 21222, 10809, -11982, -15500, -5440, -10888, -16863, -2792, -6526, -20426, -26093, -44949, -33178]
14019c3178J2552M326L051K3178j4363m849j428Q052q033j4707k1392O541K4274
14006a5976J5788m95l0835J1936K1342l713J9345Q774k424k673q885M736K6536
13993D3456K1581j8553m2492k2732j373J0386J476O547p801M364J1257j4021O81
13980g224J1131j0812O600K311q099J0023k1536j4528j6J212P436J0719K5951
13967A3168j957K74J2710j6481l9307j730M4256r423k7389J7574k910j8144j410
13954c0769Q299m897p626J090J3130K2328J9305l623p88n349j1197J8135j775
13941A6263j3904r566k752j9026K0387K0439k1461l2599Q235J0905P686j2365
13929b7758q814K1242L1700M849j8117k5595n79J0370j7141k0423K4982L911K046
$$ y = [-33178, -20626, -16300, -13249, 9929, -4434, -9283, -10711, -2659, -10692, -25399, -46791, -40250, -15976, -188, -683, -31518, -19582, 1760, -1953, 17392, 26166, 23742, 21069, 12184, 16920, 43456, 65037, 46484, 3992, -18740, -20113, -9727, -8251, -1704, -9505, -5141, 6116, -7905, -7224, 3907, -6905, -305, 2006, -6093, 3930, -17606, -32134, -32150, -30938, -23502, -12783, 13168, 11211, 11485, 24195, 7714, -31593, -33323, 10933, 1510, -25879, -8305, -11215, -29359, -30769, -22470, -27367, -34993, -33903, -20773, 1555, 20860, 17237, 16449, 11100, -97, 18038, 16263, 2359, -7207, -9959, -28985, -8598, 11841, -9620, -42219, -33984, -23079, -15393, -27758, -36572, -15330, 16370, 21219, 3102, -22493, -23072, -12702, -29843, -50266, -25284, -21373, -19327]
13916a9327R878l615R046L3578m269o880J6860K972j1785j5149j5026m955K7855
13903A9183N136k137O265l590j0074J318J6490K579k1681o992Q202o562k482l499
13889B156n879j9713J0424J2228J1406k163J5807K4272m069j0505j4519j4734
13877D711j7066k5811q385L2618J4709N4o328R298J6722L72j4982j6067k2137
13864c2292r803L5471K8317j2320J2142M4380j95l2678j4328r098q591L2990o951
13851B7044j6373l3753R925N593j2424P024Q487j4714o929K773J6484L259K1019
13838A7415n936j781J7673L633J3441j9011j4082n206m036J4417r329j3826J935
13825d693J9049m172J3220N75j8870K700O225j1049O154L196J4580Q83J758J546
$$ y = [-19327, -9449, -13064, -4018, 29560, 25291, 18411, 35271, 38243, 26458, 11309, -3717, -8672, 19183, 24319, 22182, 28447, 24857, 14783, 16101, 32591, 35170, 13489, 6497, 14699, 8137, 5655, 2156, -3723, -23436, -13012, -784, 10622, 8459, 24266, 48538, 44469, 33964, 19445, 4711, -12355, -38166, -46551, -13933, 776, 830, -5498, 3800, 20522, 20894, 5912, -10155, -32292, -42095, -6624, 21693, 9373, 21515, 65895, 65700, 33022, 18694, 9596, 1005, 33995, 27044, 10671, -23082, -13157, -7564, -19988, -12964, -4477, -19191, -26120, -23347, -6863, -3604, 17415, 11479, 9698, 27371, 31004, 44445, 25434, 11352, 6146, 2110, 16527, 7198, -6628, -4693, 14356, 10184, 23404, 23979, 5109, 7809, 14034, 2985, 9139, 12335, 26915, 27798, 29556, 31102]
13811C1102j269p683j4624L587J1378m82l2137k4487p549R276L51J6562M370N823
13797e782j3322Q633R404j2675L812K3331J6836j0054j1237J765j0048p933j0490
13784a7760j2208J7987q866N6J4021J0907J5081p998k4095P706L20q556j514k5679
13770d0598J1495L5240j135M820k484j8586j7608N309J7735P265L4348J4073l1450
13757A8424j4183J2057N255O108J1855m156k1739j0609J6428R299n04r108j1134
13744G993j4497p400J0670J8021j0313r909P41Q279J5028K5940K8155j765k6852
13731D4091l5951m58N466k4332j0061Q987k1929J7837J4571j1362J3137J1383
13719A1379n511M843J3405K56L668J6957J92k0171J2579j2567n326p957j5985
$$ y = [31102, 29833, 22150, 7526, 11113, 22491, 22009, -10128, -34615, -42164, -32888, -32537, -15975, -11605, -5782, -19104, -10471, -1067, -13742, -9930, 13401, 30237, 20183, 8946, 10711, 663, -7270, -17760, -29968, -11981, -20847, -20791, -6770, 4137, 19218, 11220, -12875, -5169, -4849, -13405, -14919, -40598, -29103, 6137, 5002, 9822, 7338, -11248, -28856, -23547, -5812, 1453, 35801, 49874, 18424, 4241, 16298, 21553, 27661, 39516, 35360, 13621, 3012, 19440, 28739, 28235, 19127, 7993, -6504, -13904, -3234, 14787, 4474, -5435, -4694, 3585, 18613, 44553, 72708, 70943, 44091, 8140, 7682, 13148, -11184, -21245, -12258, -34187, -16350, -1779, -13141, -4, 11379, 5868, 10711, 24116, 24372, 28040, 44997, 45189, 25018, 37597, 25030, 19704, 11747, -4238]
13706d238k7020q82P140K2938j1194p47K3732r337O510p685J8342k1581j4278
13693a8300O290k2541J6917J0070J7893L274j1930R252Q273l909K558j3066M981
13680I762j5821k4775L3793K165J0313Q743j0063j3679l813L723J037P518j2689
13667c786J3484o615j5532j6608j8840k4605L45K033N366J7437K5820L2219O3294
13654G4012J5720n8369o2722k82J2531J729J1388q128J1457K5939m423k8839J4333
13641D346N701j6250k4384K8607J3600o063m669J0496J4596M265N143j1040k3485
13628H63j19j1128K2853J1542j2757L272j551J6080j4160J1176O822l517m894
13615B4482m418m54R148N391J0478n583k1791K991P030P835k3015k0462J0874
$$ y = [-4238, -31258, -32140, -25000, -2062, -13256, -14003, 9729, 392, 6902, -783, 17559, -4022, -18300, -12010, -34551, -17634, -7564, 10329, 13603, 1673, 10925, 19198, 15289, 17847, 4781, 9762, -6059, -30834, 2959, 5124, 15437, 24180, 14117, 438, -3375, 348, 1385, 8903, -3786, 9698, 3083, -12449, -29057, -47897, -72502, -72157, -70124, -64758, -47321, -21501, 10718, 74012, 89732, 31363, -31359, -31641, -19110, -17381, -5993, -14121, -2664, 23275, 18852, -9987, 4346, 10047, -6203, -30587, -1980, 11620, 5557, 888, 11384, 25980, 30245, 35388, 24348, 863, 744, -10384, 12469, 24011, 11254, 14526, 12975, 29055, 14895, 26071, 32893, 29376, 24482, 20064, 19610, 28758, 34149, 44627, 39044, 17253, 20244, 27274, 35109, 12094, -8368, 2506]
13602B506r675j5447q727k753k857J1415K4943K3778J0443j2440j8434J0348J0587
13589B3687J250j2585q509J9711K0055j8499j8487j4242K3685J7374J829o277
13577B8992J6826j837k2211n655p51O089r865j5816K289K4111P553j268k8834
13564c77j2566Q200J9975K423k6777j1486j2342K0771J0485R689P01r432J6567
13551A5831m073m722l670m670q862K262N055O591j1394l1485J373o450j9222O818
13537e6618J2641J1781J5550l11O146R015R229K2820K364j3570j7581k6420q636
13524c3590o215J3093J5612L57J495K5233q576J4459l0784J068j843j2898n450
13511b8039J2355L8271N571o072J8409j9293k63r517R775P446k0325p24N941k4222
$$ y = [2506, -7169, -22616, -31343, -34096, -36953, -25538, -595, 23183, 33626, 21186, 2752, 13100, 23687, 24937, 12352, 3843, 23554, 43609, 25110, 6623, -7619, 16066, 33440, 35269, 28992, 45818, 43981, 21770, 16115, 15364, 21453, 11588, -4228, -1939, 22172, 29725, 28457, -377, -12943, -4743, 15232, 17655, -9122, -20608, -32950, -12179, -1694, 7995, 8696, -736, 15831, 11758, 7036, 3366, -1304, -10166, -7904, -2849, 3742, -7652, -39137, -37764, -44214, -63436, -56618, -43977, -32196, -16646, -16957, -10811, -1796, 7433, 30253, 32617, 19047, 1466, -24954, -33590, -39805, -26712, -11100, -10743, -9248, 15985, 7409, 21868, -8916, -7848, -9691, -22589, -28039, -15684, 22587, 28158, 22086, 40495, 21202, 20939, 11422, 21197, 28643, 8318, 7594, 13535, -10687]
13497a0687J1336J1527j3161q484j6532L1754J4214r385l31m134k3868j2335K0721
13484i365K9417j0788p601j1835L282j4318j2361r640L423J5220j2573q794j3716
13471e9649J3323Q620p33K4464M765N403m897j5837j9726j0283J964j8787J3914
13458e7459J7444K8322M977K718J1314P064M013k0645p090p655Q120J7242r13
13445G452k2904r547K6370J0189k7158R027j379k1370j8967J5635M3047j8594
13433h199k2028o861J0122O123O356K3743j4523p475j9030n774J0068j0497J2528
13420b5447L35n528p010P849j1917Q029J8315l010j067k5769j968K8520K0358
13407A690J2786j4959j3709K0760J3821j4735k0837R382J5791j9283J2019M5951
$$ y = [-10687, 649, 12176, -985, -9469, -26001, 5753, 19967, 10582, 10251, 6117, -17751, -30086, -9365, 20052, 9264, 1663, -10172, -6890, -21208, -33569, -43209, -39786, -24566, -37139, -45933, -59649, -46326, -37706, -38439, -13975, -9210, -3807, -8704, -24541, -44267, -54550, -52586, -71373, -57459, -40015, -11693, -6716, -3998, 7316, 14380, 18393, -2252, -9342, -16997, -8877, 8365, 7452, -15452, -24999, 1371, 11560, -15598, -6571, -7950, -29320, -48287, -32652, 10395, -8199, -30227, -37088, -26966, -20843, -14487, 9256, -5267, -12742, -31772, -37546, -27478, -37975, -25447, -25112, -30640, -37650, -29801, -41718, -33689, -15374, -18384, -19451, -45220, -47188, -18668, 1690, 14476, -483, -14192, 6568, 20389, 5654, -15183, -5801, 9990, -9293, 2726, 48677]
13395D8677J0061m2085K735K4030j5787j9100P557J7873J5975L792K932j5668
13383D0992j0350n004n879j8153K872j2519l2781l867K7617q243R80N054m143
13370b3424K3983L5248K4882j2310k2665p656J2851k2072l4409q858R127K0353
13358d950p888o564m468Q012K1142K636p026p076q489l962p197M019L153n091
13344b3749J2636Q27N823N350L776M0201l5028k9918M6J647J0039K0645R70J2166
13330B5431k1520p04n400r704l069J0079M610j3061L149j881j2472m357J4870
13317a4029J8391J846N662K567m821j2724j3166p586J3310P803J465P745J8089
13304B4552R256p14j4288k9491R187J9020q389j1543k6338j0952J5106Q436K4773
$$ y = [48677, 58738, 16653, 19388, 43418, 27631, 8531, 16088, 33961, 49936, 53728, 56660, 40992, 30642, 25638, 19759, 1606, 4478, -8041, -40822, -44689, -17072, -25315, -24335, -19281, -23424, 559, 35807, 60689, 48379, 25714, 18058, 30909, 8837, -25572, -34430, -25303, -4950, -12838, -19402, -23870, -15858, 5284, 7920, 894, -6182, -14671, -18633, -25830, -21811, -18658, -23749, -11113, -10286, -4463, 887, 4663, 44864, 9836, -20082, -20036, -18389, -8350, 12295, 13265, 25431, 3911, 3207, -2193, -11897, -14966, -4887, -277, -13338, -10189, -12070, -24542, -28899, -14029, 4362, 6208, 11870, 14437, 9616, -3108, -16274, -23860, -10550, -2747, -1282, 6463, 24552, 33808, 33094, 18806, -10685, -1498, 17522, 9133, -2410, -28748, -39700, -24594, -16158, 8615]
13291H615j9828l1678K5736K9036R308k6288k4646k3749P483R827j1461J4L98
13278d7233J2870J4482J1824J1354J8359k576k1691l0355K2379K1955j2897r302
13266a0831N465J274R44R711J4234j9795j6812j2418p543M006J7625j018K0739
13253E581j828Q623P86P38J7476j182k1097k8785j4558j9387K8199N739k8713
13240d8408p79K0873J3450K2650m434k2047J1675K9156l345l999J5948J067m0891
13227i084j3437K096J8800K4721K4272q179n655J223K1627r913j5385j6675o395
13214H016j4312P454k7704Q498M4614j2001j5826Q145J4839r959k1350k6266L3230
13201b622K3941R999l118q71r270n502J2350J0098l842k5486l1181j7661L427
$$ y = [8615, -11213, -42891, -17155, 11881, 21189, -5099, -29745, -53494, -46011, -36184, -47645, -47631, -47233, -34363, -19881, -8057, 3297, 21656, 19080, -2611, -32966, -10587, 11368, -1529, -10831, -5366, -4092, -3148, 6563, 20797, 1002, -15810, -28228, -35771, -31765, -14140, -15158, 5581, 3753, 12376, 13162, 13900, 31376, 30194, 9097, -19688, -34246, -53633, -25434, -19695, -48408, -49187, -28314, -14864, 7786, 3352, -18695, -7020, 22136, 18791, 14792, 30740, 31807, -9084, -22521, -20425, -1625, 23096, 47368, 39189, 33534, 34757, 56384, 46471, 31086, 14411, 8016, -6296, 1158, -26546, -18048, 26566, 14565, -1261, 6884, 21723, 11764, -9586, -35852, -2622, 21319, 31318, 28200, 27329, 18059, 12557, 24907, 35005, 31163, 5677, -25504, -43165, -39738]
13188c9738J2101J2522M3178L7194J1125J1979L579j9418m32n474j1639j0423
13176D4554l0340k622L3358j3013j4777L1518K3929l7367m0287J9951K4474r009
13164C0369k2220N402P539N670j4922j2190K8649J6226O873P930K18m5991k059
13151A1494j768J7046J4355l291m140j9759j0363J6244M61J6201M1241L9096N1814
13138A68631O2931M7260o57k9567k4439j9355m0972m7570m6257l2894j7345O538
13126B6304m116N880R884j1563J0172M140J1558K9647n436l3042l4676o718J0654
13113A2688J625N819L859p079k299J6248J648n442j3415J5721Q761J1348k0671
13100B8811q111J2166K9728M5652N4215L7692K8429K7120N55j4665k4865k1968
$$ y = [-39738, -27637, -15115, 28063, 65257, 76382, 88361, 91940, 72522, 72090, 66616, 54977, 44554, 14214, 11592, 44950, 31937, 17160, 48678, 72607, 35240, -5047, 14904, 39378, 30369, 8149, 13551, 21090, 26760, 11838, -352, 28297, 44523, 51396, 59326, 59544, 13553, 11494, 9726, 26772, 41127, 37836, 33696, 13937, 3574, 19818, 20279, 36480, 77721, 116817, 168631, 231562, 278822, 278165, 248598, 224159, 204804, 163832, 116262, 70005, 37111, 19766, 26304, 22188, 28068, 37952, 26389, 36561, 40701, 52259, 81906, 76470, 43428, 8752, 2034, 12688, 14313, 20132, 23991, 16912, 14613, 30861, 32509, 27067, 13652, 29373, 38134, 49482, 28811, 20700, 32866, 62594, 108246, 162461, 200153, 228582, 255702, 256257, 241592, 216727, 194759]
13088A94759m745l2088m5136l314k5691k9352k1435m552j719j4555o179q647K408
13075b46o97j6397K787J6324J8431J4431O369m991j4520m337P650Q283j6875J2797
13061B9009K36J1135j4243J1348k666j659J3402j1255n049J0834J4773J611K5
13048E7501M189L4906P596q022l5363k2283J6237n137q072p483J396M443r92J125
13034D0041R599Q33K0189j4358k5460n053k244j9196O52m125K2171L555j6185
13021A0419j745j7049j3629j3158J0149K1385K7927L339m149j4767j3774o607
13009a1659J0434J388j4574L772J9675r142m854J7629L785k299R830J0r475r826
12995D694o691l968J7308R775Q174L757j7521o312L756J0700M074k3664J7171
$$ y = [194759, 190014, 157926, 112790, 109476, 83785, 54433, 32998, 28446, 26727, 12172, 5993, -2654, -246, -943, -17340, -14553, 1771, 20202, 34633, 41002, 36011, 21491, 17154, 24804, 33087, 16212, 29009, 29245, 40380, 26137, 37485, 34819, 33160, 46562, 35307, 30258, 41092, 55865, 57476, 57501, 61690, 96596, 104192, 96170, 60807, 38524, 54761, 49624, 41552, 34069, 35465, 39908, 38916, 40041, 49640, 50473, 70662, 56304, 30844, 25791, 23547, 4351, 5003, 878, 23049, 26604, 10419, 8674, -8375, -22004, -35162, -25013, -3628, 24299, 27638, 23489, 8722, -5052, -11659, -1225, 163, -14411, -10639, 9036, -106, -4960, 12669, 16454, 14155, 23985, 23995, 14520, 4694, -1997, -5965, 11343, 21118, 29292, 33049, 15528, 9216, 12972, 23672, 27746, 4082, 21253]
12982B1253N674l8277J572Q675K437L223j7354o516N85Q693L04j1416j7853r294
12968d8294J5101J0150K0011J2262k4899o280O758P376J3740j8358Q061J4176
12956I804J1772r95J410J3226j2611q952k411p902O828r999j9273o323P523J1854
12942f049L8933R686j5909k5157o420j7089m874r394o143J5774K3709J6871O229
12929B0167k3169j2664r069k3815J0547L3626o470K0620K5081j0190l268o900
12917A4496j2832J34O481J872K248J3550M791k1030k1903K0018l654j6815j4429
12904b7073j0929p554J6805j4697j2707M295K5066M610N021J7072m6j141k475
12891c753J7136K5560p437m7372j4962L1719J4766R23J5743l0910l3408j0187
$$ y = [21253, 26927, -11350, -9778, -1103, 1334, 4557, -12797, -19313, -18728, -10035, -9731, -21147, -39000, -48294, -33193, -23043, -3032, 9230, -15669, -21949, -15191, -7815, 5925, -12433, -4372, 9804, 21576, 20581, 21991, 35217, 22606, 13654, 11243, 3341, 10169, 170, -19103, -25426, -17903, -6049, 32884, 42570, 26661, 1504, -4916, -22005, -26879, -36273, -42416, -26642, -2933, 13938, 20167, -3002, -15666, -24735, -48550, -38003, -4377, -10847, 9773, 34854, 24664, 21396, 14496, 1664, 1798, 8279, 10151, 12399, 25949, 30740, 9710, -12193, 7825, 4171, -12644, -27073, -38002, -45556, -28751, -43448, -56155, -51860, -26794, -22184, -17163, -91, -137, -1278, -3753, 13383, 38943, 31506, -15866, -30828, 891, 15657, 16580, 32323, 1413, -31995, -42182]
12879d2182J6275J1283q037j0112P241J6702J2534L4780J1750k6273J802J1634
12867C7397k0358p375o167l803L210j3920q746m481j672p546K7825O951j716l1094
12853c1495k2239J2691L0597K804J3280m978p099j6918j3067J8803L3297M37K4910
12840D1023q074l3250j2886n39R916P159K2352j823j4397l480k9782K543P369
12827a3869J4704N152J216k4713l125k64n793j9575m441L1720L1656j3062K795
12814B401K3480J2743k7939k9154j5704K924J7220Q958J9095q234n117p517j0745
12801a7589k106K2460l870K0389L60n950n436j1428p908J0405q004j3744N129
12788a7292J1837q258n068Q768K729k5784j3216M8956K1942L580j9060j9101j2281
$$ y = [-42182, -25907, -14624, -22661, -32773, -25532, -8830, 3704, 38484, 50234, 23961, 25763, 37397, 17039, 9664, 3497, -306, 2904, -11016, -19762, -24243, -25915, -33461, -5636, 1315, -401, -31495, -53734, -41043, -10446, -7642, 5638, 660, -6439, -23357, -36424, -17621, 15676, 16113, 41023, 32949, -301, -13187, -13726, -3810, 3349, 25701, 23878, 9481, 6001, -23781, -21238, -13869, 835, 5987, 7203, -17510, -20635, -20899, -26692, -46267, -50708, -18988, 12668, -394, 2401, 25881, 38624, 10685, -18469, -34173, -31249, -14029, -5071, 14024, 5790, 673, -6844, -17589, -19695, 2765, -1105, 19284, 19644, 13694, 8258, -3170, -11078, -673, -8677, -22421, -17292, -5455, -13713, -18781, -10013, -7284, -33068, -46284, 2672, 24614, 28194, 9134, -9967, -22248]
12775b2248m690J530L2796J8987j755j2368r196r471l91r139J0588K2493M104
12762B1240Q384J3355k2600r841j2334j0800j6090P888j551j101K3175k1884j6685
12749c8844L994N511o230N412N0910J1519m1415n152Q84J0337r470l26K52p231
12735a9849P833O174R766q175m693k2212j9617P513L21Q788K4983L0732Q683k4028
12721F219j1119O447R200j8628k1352q635j3802j34J8129K5869J1930k6708o00
12708b3184n094P015O288R045K49p786j0742M987q73n101j0016K9705k1416n0886
12694g7809N325L1623Q907k3466l667J2504N3517J9440L726k4773l6082j7999
12682d8754K9659L6125K246j8940l958p054O408k9226j9307M9131O0452M654j6884
$$ y = [-22248, -26938, -25408, 7388, 26375, 24620, 12252, 3056, -6415, -6806, -15945, -5357, 17136, 21240, 29624, 42979, 20379, 10538, -1796, -12596, -28686, -20798, -22349, -23450, -275, -22159, -38844, -34850, -29339, -35569, -30157, 20753, 32272, -9143, -14295, -13411, -3074, -12544, -12870, -12618, -19849, -12016, -5842, 3924, -4251, -8944, -31156, -50773, -43260, -42939, -34151, -9168, 21564, 30247, 6219, -4900, 1547, 10747, -7881, -29233, -37868, -51670, -51804, -33675, -7806, 4124, -22584, -23184, -28278, -21263, -14975, -5930, -5681, -13467, -24209, -19222, -20095, -25196, -35212, -5507, -26923, -77809, -72484, -40861, -31954, -55420, -59087, -46583, 6934, 26374, 30100, 5327, -30755, -48754, -19095, 17030, 19276, 336, -3622, -10676, -4268, -33494, -52801, -3670, 56782, 61436, 44552]
12669D4552l3891k0751K0949r770Q248r171j5191J0485J0783K9172J66l0475m2370
12656c7264o176J0026J5316Q093J6522J0420J722N461J180j7964k0351J02k050
12643a4963J5743o326k1062J8395K5818j8330k9845p747Q568O514P431j2677K046
12630b6435j799K6843o141k9094q398K2521J4793j5517j548j6883o887K5310J9828
12617c407J8529P005j6984k1761m032J9159P139q93K2155j0049K413O347j4715
12604A0906k2619j561j100p593J0179K5498J7881J2816j0148k1212L677K6468
12592D3192p173l5434P982j112j5956j2822M652J9104J1952j3741k640O807J0437
12579A5248o329j1405L634p728o022R935J0964L4345J4737J0227k9914O941k2125
$$ y = [44552, 10661, -10090, 10859, 1089, 9337, 166, -15025, -4540, 6243, 35415, 35581, 5106, -37264, -43440, -33414, -18098, -10005, 6517, 16937, 18659, 24120, 25300, 7336, -13015, -12913, -14963, 780, -5546, -26608, -8213, 17605, -725, -30570, -38317, -29749, -23235, -15804, -28481, -26435, -28234, -1391, -7532, -36626, -45024, -22503, -7710, -23227, -24775, -41658, -48545, -23235, -3407, 15122, 22127, 5143, -16618, -20650, -1491, 5648, 4755, 26910, 16861, 19274, 25621, 10906, -11713, -13274, -14374, -21967, -11788, 13710, 31591, 44407, 34259, 13047, 16724, 43192, 36019, 585, 8567, 7455, -8501, -21323, -16671, 2433, 14385, 644, -1996, 4811, 15248, 8919, -2486, 1148, -6580, -12602, -2667, 8297, 42642, 57379, 67606, 37692, 44633, 22508]
12566B2508j7375L2795K270l1199j5851J7781L3141r835R719k3835k9840k1506
12554c1227k0126L619K6020L8874j5604r530O620l319j1853k131J9504M189J3598
12541A8634j2973P030j060M405Q339J0197K819p264j8007n250J3522M710j547
12528B3555J6011l895j8422p861J6010j5688m042Q589j4636L171M166J2678K894
12515B2530L1136j5721l0710j7952j379j596J4527J8134K7074q86j4766k4386
12503F005O853j418k5750r155J0906n37J7520j0493j0886j8183o735R745K6321
12490e807K968j6311k0203L069J9340J3017J934j3667o513J980j796o209J7803
12477a0395r248j414J3596K4079K6629j6780K967L6860k901l1399j2349O030p784
$$ y = [22508, 5133, 37928, 40198, 8999, -6852, 10929, 44070, 34235, 43954, 20119, -9721, -31227, -51353, -47734, -21714, 17160, 1556, -7974, -1354, -4673, -16526, -18657, 847, 5036, 18634, 5661, 12691, 11631, 16036, 24375, 34572, 37391, 30127, 12120, 6870, 20392, 25102, 23555, 39566, 35671, 17249, 9388, 25398, 9710, 5668, 14257, -379, 2792, 6958, 19636, 22530, 53666, 37945, 7235, -10717, -12096, -13692, 835, 18969, 46043, 45157, 30391, 6005, 12858, 11440, -14310, -23465, -12559, -13096, 4424, -6069, -16955, -35138, -41873, -32128, -5807, -2839, -19150, -39353, -36284, -16944, -3927, -1993, -15660, -22173, -20193, -21989, -28198, -10395, -19643, -21057, -7461, 16618, 43247, 26467, 29434, 66294, 63393, 31994, 19645, 25675, 17891]
12464A7891J8431j7878J371J1405n696k4184K180l069K4157J3555k0457j1010
12452F696k3576K872m541K0137j1989K3200q357k1043J3346k7232L133j1051k913
12439d1318L3681J3043M113M273P563n026q005r164j5066l667K4195l347k2754
$$ y = [17891, 36322, 18444, 19815, 31220, 25524, 1340, 3520, 451, 24608, 38163, 17706, 6696, -16880, -14008, -18549, 1588, -10401, 12799, 4442, -16601, -3255, -30487, -27354, -38405, -41318, -7637, 5406, 9519, 13792, 21355, 16329, 8324, -840, -15906, -19573, 4622, 1275, -21479]
$$ [...]
##END NTUPLES=NMR SPECTRUM
##END=
