##TITLE=Analysis number 312080
Compound Code mo 07193
Book Reference 407/87
Project Code adrs
Chemist Name andyw
##JCAMPDX= 6.0         $$ Bruker NMR JCAMP-DX V2.0
##DATA TYPE= NMR SPECTRUM
##DATA CLASS= NTUPLES
##ORIGIN= Bruker BioSpin GmbH
##OWNER= NMR
$$ XWIN-NMR		Version 3.5
$$ Mon Jul 25 11:54:52 2005 GMT Daylight Time (UT+1h)  MAYBRIDGE\NMR@NMR_250MHZ
##.OBSERVE FREQUENCY= 250.131544655141
##.OBSERVE NUCLEUS= ^1H
##.ACQUISITION MODE= SIMULTANEOUS (DQD)
##.ACQUISITION SCHEME= undefined
##.AVERAGES= 16
##.DIGITISER RES= 18
##SPECTROMETER/DATA SYSTEM= dpx250
##.PULSE SEQUENCE= zg30
##.SOLVENT NAME= CDCl3
##.SHIFT REFERENCE= (INTERNAL, CDCl3, 0, 16.4551)
##AUDIT TRAIL= $$ (NUMBER, WHEN, WHO, WHERE, WHAT)
$$ ##TITLE= Audit trail, XWIN-NMR		Version 3.5
$$ ##JCAMPDX= 5.01
$$ ##ORIGIN= Bruker BioSpin GmbH
$$ ##OWNER= NMR
$$ C:\u/data/dgb/nmr/ADRS/6530/pdata/1/auditp.txt
$$ ##AUDIT TRAIL=  $$ (NUMBER, WHEN, WHO, WHERE, WHAT)
(   1,<2005-07-25 11:54:29.89 +100>,<MAYBRIDGE\NMR>,<NMR_250MHZ>,
      <created by zg, POWCHK disabled, PULCHK disabled
       configuration hash MD5:
       62 19 C7 07 E1 42 D1 B7 37 6C 3D D0 77 39 F9 E6
       data hash MD5: 64K
       99 A8 30 87 E4 D1 E6 BB 8D 09 D0 C5 98 D5 44 AC>)
(   2,<2005-07-25 11:54:43.07 +100>,<MAYBRIDGE\NMR>,<NMR_250MHZ>,
      <Start of raw data processing
       ef LB = 0.3 FT_mod = 6 PKNL = 1 SI = 32K 
       data hash MD5: 32K
       10 93 6D D6 A9 93 30 C4 83 AF 44 CC B8 94 57 46>)
(   3,<2005-07-25 11:54:44.91 +100>,<MAYBRIDGE\NMR>,<NMR_250MHZ>,
      <apk 
       data hash MD5: 32K
       7E A6 75 90 7A 59 76 73 60 6A DA 8A 84 46 AC D0>)
(   4,<2005-07-25 11:54:45.68 +100>,<MAYBRIDGE\NMR>,<NMR_250MHZ>,
      <abs ABSG = 5 
       data hash MD5: 32K
       31 63 99 EC 7C 9C 16 A4 CB 0E 50 47 F2 99 CA 6B>)
$$ ##END=
$$ 
$$ hash MD5
$$ 14 21 5A 27 56 BE 66 B5 86 11 86 1F 7F D6 55 86
##$RELAX= 
##$RELAX= 
##$RELAX= 
##$RELAX= 
##$RELAX= 
##$RELAX= 
##$RELAX= 
$$ Bruker specific parameters
$$ --------------------------
##$DU= <C:\u>
##$EXPNO= 6530
##$NAME= <ADRS>
##$PROCNO= 1
##$TYPE= <nmr>
##$USER= <dgb>
##$AMP= (0..31)
100 100 100 100 100 100 100 100 100 100 100 100 100 100 100 100 100 100 
100 100 100 100 100 100 100 100 100 100 100 100 100 100 
##$AQSEQ= 0
##$AQ_mod= 3
##$AUNM= <au_zg>
##$AUTOPOS= <12 >
##$BF1= 250.13
##$BF2= 250.13
##$BF3= 250.13
##$BF4= 250.13
##$BF5= 500.13
##$BF6= 500.13
##$BF7= 500.13
##$BF8= 500.13
##$BYTORDA= 1
##$CFDGTYP= 0
##$CFRGTYP= 5
##$CHEMSTR= <none>
##$CNST= (0..31)
1 1 145 1 1 1 1 1 1 1 1 1 1 1 1 1 1 1 1 1 1 1 1 1 1 1 1 1 1 1 1 1 
##$CPDPRG= <>
##$CPDPRG1= <>
##$CPDPRG2= <>
##$CPDPRG3= <>
##$CPDPRG4= <mlev>
##$CPDPRG5= <mlev>
##$CPDPRG6= <mlev>
##$CPDPRG7= <mlev>
##$CPDPRG8= <mlev>
##$CPDPRGB= <>
##$CPDPRGT= <>
##$D= (0..31)
0 1 0 0 0 0 0 0 0 0.06 0 0 0 0 0 0 0.0002 0 0 0 0 0 0 0 0 0 0 0 0 0 0 
0 
##$DATE= 1122288868
##$DBL= (0..7)
120 120 120 120 120 120 120 120 
##$DBP= (0..7)
150 150 150 150 150 150 150 150 
##$DBP07= 0
##$DBPNAM0= <>
##$DBPNAM1= <>
$$ [...]
##$SUBNAM7= <"">
##$SUBNAM8= <"">
##$SUBNAM9= <"">
##$SW= 20.6930455092707
##$SWIBOX= (0..15)
0 0 3 0 0 0 0 0 0 0 0 0 0 0 0 0 
##$SW_h= 5175.983436853
##$TD= 65536
##$TD0= 1
##$TE= 296.16
##$TE2= 300
##$TE3= 300
##$TEG= 300
##$TL= (0..7)
0 120 120 120 120 120 120 120 
##$TP= (0..7)
150 150 150 150 150 150 150 150 
##$TP07= 0
##$TPNAME0= <>
##$TPNAME1= <>
##$TPNAME2= <>
##$TPNAME3= <>
##$TPNAME4= <>
##$TPNAME5= <>
##$TPNAME6= <>
##$TPNAME7= <>
##$TPOAL= (0..7)
0.5 0.5 0.5 0.5 0.5 0.5 0.5 0.5 
##$TPOFFS= (0..7)
0 0 0 0 0 0 0 0 
##$TUNHIN= 0
##$TUNHOUT= 0
##$TUNXOUT= 0
##$USERA1= <user>
##$USERA2= <user>
##$USERA3= <user>
##$USERA4= <user>
##$USERA5= <user>
##$V9= 5
##$VALIST= <valist>
##$VCLIST= <CCCCCCCCCCCCCCC>
##$VD= 0
##$VDLIST= <DDDDDDDDDDDDDDD>
##$VPLIST= <PPPPPPPPPPPPPPP>
##$VTLIST= <TTTTTTTTTTTTTTT>
##$WBST= 1024
##$WBSW= 4
##$XGAIN= (0..3)
0 0 0 0 
##$XL= 0
##$YL= 0
##$YMAX_a= 358469
##$YMIN_a= -430988
##$ZGOPTNS= <>
##$ZL1= 120
##$ZL2= 120
##$ZL3= 120
##$ZL4= 120
##$ABSF1= 16.45514
##$ABSF2= -4.238033
##$ABSG= 5
##$ABSL= 3
##$ALPHA= 0
##$AQORDER= 0
##$ASSFAC= 0
##$ASSFACI= 0
##$ASSFACX= 0
##$ASSWID= 0
##$AUNMP= <proc_1d>
##$AZFE= 0.1
##$AZFW= 0.1
##$BCFW= 0
##$BC_mod= 0
##$BYTORDP= 0
##$COROFFS= 0
##$CY= 12.5
##$DATMOD= 1
##$DC= 0
##$DFILT= <>
##$DTYPP= 0
##$F1P= 14.0000005364418
##$F2P= -0.99999901652339
##$FCOR= 0.5
##$FTSIZE= 32768
##$FT_mod= 6
##$GAMMA= 0
##$GB= 0
##$INTBC= 1
##$INTSCL= 1
##$ISEN= 128
##$LB= 0.3
##$LEV0= 0
##$LPBIN= 0
##$MAXI= 10000
##$MC2= 0
##$MEAN= 0
##$ME_mod= 0
##$MI= 0
##$NCOEF= 0
##$NC_proc= -3
##$NLEV= 6
##$NOISF1= 0
##$NOISF2= 0
##$NSP= 0
##$NTH_PI= 0
##$NZP= 0
##$OFFSET= 16.45514
##$PC= 1
##$PHC0= -80.91979
##$PHC1= 6.638727
##$PH_mod= 1
##$PKNL= yes
##$PPARMOD= 0
##$PSCAL= 4
##$PSIGN= 0
##$REVERSE= no
##$SF= 250.130016722969
##$SI= 32768
##$SIGF1= 0
##$SIGF2= 0
##$SINO= 400
##$SIOLD= 32768
##$SREGLST= <1H.CDCl3>
##$SSB= 0
##$STSI= 32768
##$STSR= 0
##$SW_p= 5175.98343685301
##$SYMM= 0
##$S_DEV= 0
##$TDeff= 65536
##$TDoff= 0
##$TI= <Analysis number 999999
Compound Code 99
Book Reference 9
Project Code 9>
##$TILT= no
##$TM1= 0
##$TM2= 0
##$TOPLEV= 0
##$USERP1= <user>
##$USERP2= <user>
##$USERP3= <user>
##$USERP4= <user>
##$USERP5= <user>
##$WDW= 1
##$XDIM= 32768
##$YMAX_p= 324748118
##$YMIN_p= -162755
$$ End of Bruker specific parameters
$$ ---------------------------------
##NTUPLES= NMR SPECTRUM
##VAR_NAME=  FREQUENCY,     SPECTRUM/REAL,   SPECTRUM/IMAG
##SYMBOL=    X,             R,               I
##VAR_TYPE=  INDEPENDENT,   DEPENDENT,       DEPENDENT
##VAR_FORM=  AFFN,          ASDF,            ASDF
##VAR_DIM=   32768,         32768,           32768
##UNITS=     HZ,            ARBITRARY UNITS, ARBITRARY UNITS
##FACTOR=    0.157963299565203, 1,           1
##FIRST=     4115.92423330866, 0,            0
##LAST=      -1060.05920354435, 0,           0
##MIN=       -1060.05920354435, -162755,     0
##MAX=       4115.92423330866, 324748118,    0
$$ Real data points
##PAGE= N=1
##DATA TABLE= (X++(R..R)), XYDATA
$$ [...]
14449C5493j8869l3037k933j1178L4145Q166q374j41J1253n350J3352p642p026
14436G859J7385L167N827j4377k6847r232o29M766K1649O888k853j9659j2358
14423a8414k8180j2508K3077J9933L3966n069o848j4757K5287N474O27R754M472
14410C6814l0806k2924j0496K4404K1386O909j5619k2776l7973m115M2079J9360
14398F243j234J3370P323Q16m774J410j1271k6284P27J4402L6271J123j6095j7691
14384D336J906K5424j0153k7322j9276K8650r750k7067J9520K5425L8397j725
14372D8365m3889k9385L1308J082j1977M463K1583O698l8278q486j6164O626J4384
14359a3670R723j2606L550l07j0508j7111J5122P587J8409M1367j9823K0835K7816
$$ plain form
14449 35493 16624 -16413 -19346 -30524 3621 11787 3413 3272 14525 9175 22527 14885 7859
14436 7859 25244 28411 34238 19861 -6986 -16218 -16847 -12081 9568 16456 13603 -6056 -18414
14423 -18414 -46594 -59102 -36025 -16092 17874 12805 5957 -8800 16487 21961 22588 32342 36814
14410 36814 6008 -16916 -27412 -3008 18378 25287 9668 -13108 -51081 -55196 -13117 6243
14398 6243 5009 18379 25702 26518 21744 23154 11883 -14401 -13674 728 36999 38122 22027 4336
14384 4336 6242 31666 21513 -5809 -25085 3565 -6185 -33252 -13732 11693 50090 48365
14372 48365 4476 -24909 6399 7481 -4496 -33 21550 28248 -10030 -18516 -34680 -28054 -13670
14359 -13670 -3947 -16553 -13003 -13310 -23818 -40929 -25807 -18220 189 41556 21733 42568 70384
14346G0384o189j7740j3303k4451J383p464q683k3820l0211K6431Q003K7260L4670
14333C6270j2730m25J7085k431k9827k6703R753J7254n557Q967o592k113j6292
14320a3341k0554K9238K7771m558j1674L772k051j9472M962m510k7910l996j557
14307d3880M251L758M7068p22k3151j4128K4614K8657o388l6692l461K2600J2495
14294A5021j6378j4395K2277n338K3712j9387j8248j8519j379K4078j478j4686
14282b4720N050J1393M563l256J9477j384n928j051q188R691J0074p351k1271
14269a2901L865J233k5825j8327J2678K2075Q866l883J0611L547k4704K2339M858
14256D432j0297j35R446l636k9640r461K9882k505k1826K323M909k1554j8897
$$ plain form
14346 70384 64195 46455 33152 8701 10084 2620 -6063 -29883 -60094 -33663 -25660 1600 36270
14333 36270 23540 23115 40200 37769 7942 -18761 -9008 8246 2689 11656 5064 2951 -13341
14320 -13341 -33895 -4657 23114 18556 6882 10654 8603 -10869 -5907 -10417 -38327 -42323 -43880
14307 -43880 -39629 -35871 11197 10475 -12676 -26804 -2190 26467 20079 -16613 -20074 2526 15021
14294 15021 -1357 -15752 6525 1187 24899 5512 -12736 -31255 -32634 -8556 -10034 -24720
14282 -24720 -19670 -8277 -3714 -6970 12507 11123 5195 4144 -4044 5647 15721 8370 -12901
14269 -12901 -9036 -7803 -33628 -51955 -39277 -17202 -8336 -12219 -1608 1939 -22765 -426 4432
14256 4432 -5865 -6000 3446 -190 -29830 -39291 -9409 -11914 -33740 -31417 -26508 -48062 -66959
14243f6959L391N302r119k1461j9011L9610K9171k9990k4239K0234J6407J748
14231e4916k1844L60O033o217j2001O058L1597K3323Q18Q503L25M802R771L704
14217C16j2776K1004J9527m477k6020r231J0161K352Q614o291l0722k4516K6277
14204b5782L4951J6225j2941K919j6158j2780m1357K1715K4188J0541N674J0561
14192A7756P537J3299J0636J3333k9106k9038m460P371P458m4295j0745J5841
14180b4413J4774K0837J8378j9666m4235m81M339k468n930l783j1436R257L0660
14167a4167p204J5125J9998p312j5039j2390Q945J4941J6143K4804j4667k9205
14155b8k6273M089j2732J9863M735K2220Q533p292q713k3929j2898J368J843j0536
$$ plain form
14243 -66959 -63568 -58266 -67385 -88846 -107857 -68247 -39076 -69066 -93305 -73071 -56664 -54916
14231 -54916 -76760 -76400 -70367 -76584 -88585 -82527 -50930 -27607 -26789 -18286 -17961 -13159 -3388 316
14217 316 -12460 8544 28071 23594 -2426 -11657 -1496 856 9470 3179 -27543 -52059 -25782
14204 -25782 9169 25394 12453 15372 -786 -13566 -54923 -33208 -9020 1521 7195 17756
14192 17756 25293 38592 49228 62561 33455 4417 -43 7328 14786 -29509 -40254 -24413
14180 -24413 -9639 11198 29576 9910 -34325 -34806 -30467 -32935 -38865 -42648 -54084 -44827 -14167
14167 -14167 -21371 -6246 13752 6440 -8599 -20989 -12044 2897 19040 43844 29177 -28
14155 -28 -26301 -22212 -34944 -15081 -10346 11874 20407 13115 4402 -19527 -32425 -31057 -29214 -39750
14141c9750j0124L7425p22j1642J9977L1587N428r865J0265q736j7986j6617k3752
14128c4512J9431M3894J9510M749J7973k5883m3621j78p941o908R274M22N132
14115A342j7354l0345q429K2115K506M265j3548J088L1686J1013k448K7537J5060
14102D4488n472m2023m543j0255p659o903J1632K7661j0431J3724K9899j7538
14090B2580q780q645J994o499q390j2135J3009k840l5647R61K4168k3036j6073
14077e9333J0834K4289L3380K9336k2150j4189o063r639n88J712R656j3217K359
14064a3613K189j7988K570l024K8407J0973k0910j7892K1690J007P043R922l977
14051F397O088N220j3053j1756j0805n288o666K4553J9604J9215K365j0655l6032
$$ plain form
14141 -39750 -49874 -12449 -13171 -24813 -4836 26751 32179 22314 32579 23843 5857 -10760 -34512
14128 -34512 -15081 28813 48323 53072 71045 45162 1541 1363 -6578 -13486 -4212 -3790 1342
14115 1342 -16012 -46357 -54786 -32671 -30165 -25900 -39448 -38360 -6674 4339 1891 29428 44488
14102 44488 39016 -3007 -7550 -17805 -25464 -32367 -20735 6926 -3505 10219 40118 22580
14090 22580 13800 5155 7149 650 -7740 -19875 -6866 -9706 -45353 -44392 -20224 -43260 -59333
14077 -59333 -48499 -24210 9170 38506 16356 2167 -3896 -13535 -14123 -12411 -2755 -15972 -13613
14064 -13613 -11424 -29412 -26842 -29866 -1459 9514 -11396 -29288 -7598 -6591 452 10374 6397
14051 6397 12485 17705 4652 -7104 -17909 -23197 -29863 -5310 14294 33509 35874 25219 -10813
14038a0813j7254m206j2091J8346K7974j0495l491l325j0597P341K0110L7062
14026C8561k1143J683j4192k071K4298q545k7583j350K9187K0929j4208K011K786
14013C0363R60k9163l2717L465L0452M960k88k1728j5679J3264j1270J5800j2948
14000b4529k8590R653J9836j8676j0319L7129J9157k3830o565K401j704j6877
13988d2914k1692j6865L4029M7423j932l148J4921Q752Pp816J446j9075k690k8537
13974c8091k3461P443J5905M1881j597j4130k679j1833j1780J6151J9045L0395
13962B7249j6080n27L7462Q214j8190k9008K1026M3773k9516k6483L919J3285
13950C5124j0020m1753p429N1346J9426N492k3441j6542O315J3193j7076P856
$$ plain form
14038 -10813 -28067 -32273 -44364 -26018 1956 -8539 -12030 -15355 -25952 -18611 1499 38561
14026 38561 17418 19101 4909 2838 27136 18591 -8992 -10342 18845 39774 25566 27577 30363
14013 30363 31323 2160 -30557 -27092 3360 8320 8032 -13696 -29375 -16111 -27381 -11581 -24529
14000 -24529 -53119 -43466 -23630 -42306 -52625 -15496 3661 -20169 -26734 -24333 -26037 -42914
13988 -42914 -64606 -81471 -47442 -19 -1951 -5099 9822 18574 18581 10765 12211 -6864 -9554 -38091
13974 -38091 -61552 -54109 -38204 3677 2080 -12050 -14729 -26562 -38342 -22191 -3146 27249
13962 27249 11169 10642 48104 56318 38128 9120 30146 73919 44403 17920 21839 35124
13950 35124 25104 -16649 -24078 27268 46694 52186 28745 12203 18518 31711 14635 22491
13938B2491Q783q275J179j4306j5113N538J1116J8459k374j6113l3956P508K0209
13925E146k9340l6021K2124N005K8433J0867L746L691j9216o744J2501J1886l0391
13912a8313j9126J4428J7783J1659j2962R968j672p915K0439K395j422N642l162
13899A7742j9756J581K3530n444k1671j5005K0327n662k7438J8936K6091J136
13887A4367o281k8904J9677K8619J4276j7735o195q955p36L36j6779j4731J0884
13874a2157J4790J7706r975o093l0008J6873Q35L691K8358j1164k7313j1416J090
13861b4783J9505J424k7027k2880M37N064K7681O4j5251m901j0744K5899k3183
13848d8695l3258L5900J5859l14L1132M925k5094j490k586m0787l705J1440L654
$$ plain form
13938 22491 31274 22999 24178 9872 -5241 297 11413 29872 27498 11385 -22571 -15063 5146
13925 5146 -24194 -60215 -38091 -33086 -4653 6214 9960 13651 -5565 -12309 192 12078 -18313
13912 -18313 -37439 -23011 -5228 6431 -6531 3437 1765 -6150 14289 16684 15262 20904 17742
13899 17742 -2014 -433 23097 17653 -4018 -19023 1304 -4358 -31796 -12860 13231 14367
13887 14367 8086 -20818 -1141 27478 41754 24019 17824 8869 8133 8469 -8310 -23041 -12157
13874 -12157 2633 20339 10364 4271 -25737 -8864 -8029 -4338 24020 12856 -14457 -25873 -24783
13861 -24783 -5278 -3854 -30881 -53761 -53324 -48260 -20579 -20515 -35766 -40667 -51411 -25512 -48695
13848 -48695 -81953 -46053 -30194 -30508 624 5549 -19545 -21035 -23621 -64408 -68113 -56673 -53019
13835e3019K4410j2870j14L557o310p743Q498r29m78L1933J8014j34n217K6387
13821B5985q623l795k8149n251o809K4480p303J5718L4077l3429l7685K96K7968
13808b520N796j3063p609p879Q80J4725j2415N697J7216k296k1826j315K4903
13795B94L1095o599q876L456j8981k8386O080o701R989J0231j5838j606K6159
13782C17l6380j1209L150M004K976J8200L9968l8445l1969K8465l038k3067j4979
13769f2007O450N1776L2295J2370O06j9462l7541J7200L2527p823k3529J0483
13757A3345m731J0684P915k7558n55k112K2946J1843j9504k2251k8284K9947J9189
13744A0874k2183o078J0828j1230k5957k1795j78K0586J8638j0529m050O335J4045
$$ plain form
13835 -53019 -28609 -41479 -41593 -38036 -44346 -52089 -43591 -44520 -44998 -13065 4949 4815 -402 25985
13821 25985 17362 13567 -14582 -19833 -26642 -2162 -9465 6253 40330 6901 -30784 -30488 -2520
13808 -2520 3276 -9787 -17396 -25275 -24395 -9670 -22085 -16388 828 -1468 -23294 -24609 294
13795 294 31389 24790 15914 19370 389 -27997 -21917 -28618 -18629 -8398 -24236 -25842 317
13782 317 -36063 -47272 -44122 -40118 -37142 -18942 21026 -17419 -49388 -20923 -23961 -47028 -62007
13769 -62007 -55557 -3781 28514 40884 41490 22028 -15513 1687 34214 26391 2862 13345
13757 13345 8614 19298 27213 -345 -900 -3012 19934 31777 12273 -9978 -38262 -8315 10874
13744 10874 -11309 -17387 -6559 -17789 -43746 -65541 -65719 -45133 -26495 -37024 -41074 -34739 -20694
13731b0694j2129j851O575j1851L4227K709J7825J343j1609R026J1505j4450k7784
13718a7158o99J3595J9908K3737j2564m0662m408K2706K5011k2325m3997K1907
13706a4949r275j1303k1877K3746K3023J8028J8236M483J2578j7172l0924j3663
13694a9069J6186Q7K2517l725k4464r521J0779J5791K8127J2774m5579k262J3427
13681A5068n143j2207p642o984m3702J8369L2964J1491j703l7027J8385J4466
13669c665k6823j5852N58j0117L1378L9878J8106k4793n747J6178j4255l3194
13657b8348k3802l10M9785L961n154K1232N373q034M042J3132j6568j6293k750
13644c734j8518J4009K3077K444l3619j0823K3301J4127Q076j4292o200Q407k808
$$ plain form
13731 -20694 -32823 -34674 -28099 -39950 -5723 -3014 14811 16154 4545 13571 25076 10626 -17158
13718 -17158 -17857 -4262 15646 39383 26819 -13843 -18251 4455 29466 7141 -36856 -14949
13706 -14949 -24224 -35527 -57404 -33658 -10635 7393 25629 30112 42690 25518 -5406 -19069
13694 -19069 -2883 -2796 19721 15996 -8468 -17989 -7210 8581 36708 49482 3903 1641 15068
13681 15068 9925 -2282 -9924 -16908 -60610 -42241 -9277 2214 511 -36516 -18131 -3665
13669 -3665 -30488 -46340 -45782 -55899 -24521 15357 33463 8670 2923 19101 4846 -28348
13657 -28348 -52150 -52460 -2675 1286 -3868 17364 22737 14703 18745 31877 15309 -984 -3734
13644 -3734 -22252 -8243 14834 17278 -16341 -27164 -3863 10264 18340 4048 -2152 6255 3447
13631C447K282j5474k2839P847J4945j2673J3058L2905k753j963l898n462q221
13618A201J2211L0652j9783j3431j961M338m75q798j8564l027M814j4103j607
13605b8533J9314k9109j6541K8154J8293J4586N531R753K3405j2322k890p145
13593B2496J28j6054J8097L2339l119l1514j3348M49J1161l79K4812k1920j8924
13580D224L137j7539L909k903l799P039J4279L491k1169J6025l193j4026j9290
13567b9815J7156J3446J3485j6825Q723r723L768M590j4217j1137L6403P761j4771
13554H844l449J0889o858R077J9312R536o920q283J6351k60n575p962k4184j4907
13540d389k3932M042J5657O194N510J1464k6374n04K0001l867K4148J0606l8614
$$ plain form
13631 3447 5729 -9745 -32584 -24737 -9792 -22465 -9407 23498 20745 18782 14884 9422 1201
13618 1201 13412 44064 24281 10850 8889 13227 12752 3954 -14610 -17637 -12823 -26926 -28533
13605 -28533 -9219 -38328 -54869 -26715 -8422 6164 11695 21448 44853 32531 29641 22496
13593 22496 22624 6570 24667 57006 53887 22373 9025 9474 20635 20256 45068 23148 4224
13580 4224 7361 -10178 -6269 -9172 -12971 -5932 8347 11838 -9331 6694 3501 -10525 -29815
13567 -29815 -12659 787 14272 -2553 6170 -3553 215 4805 -9412 -20549 15854 23615 8844
13554 8844 5395 16284 9426 18503 37815 47351 40431 32148 48499 48239 42664 34702 10518 -4389
13540 -4389 -28321 -24279 -8622 -2428 3082 14546 -11828 -12332 7669 3802 27950 38556 -58
13527e8j5314r556K3083J3884j3213j2192j5770k8649j6446J1520n397J1168P800
13514d9140k5995O906L4102K0961J1248k897k3806j1234j0522j4125J3447K9264
13502b1791N2k943J0280K7733J1511k396J628l3183k3052J0171J5389J332j5568
13489b0837l0068J2840n553n3507Q043M0225p385m1850L0323L9400L549J3572
13477a1248K87N391n144L664k499k7417l868O445N822R621j4853J1363K0423J0754
13463H741j0026j6253j2049j844O481k799n823j817j0080j2767K2789K1620m536
13450a8363j7374J7218K0897p556j6064L616m970m269j1518J8077p897j3999k8377
13437g0579J8992J7114K1153q3k0254J9732K2051J7218j2834k2741J8670P818
$$ plain form
13527 -58 -15372 -24928 -1845 12039 -1174 -13366 -29136 -57785 -74231 -62711 -68108 -56940 -49140
13514 -49140 -75135 -68229 -34127 -13166 -1918 -4815 -28621 -39855 -50377 -64502 -51055 -21791
13502 -21791 -21739 -24682 -14402 13331 24842 22446 24074 -9109 -32161 -21990 -6601 -5269 -20837
13489 -20837 -50905 -38065 -43618 -97125 -89082 -48857 -56242 -98092 -67769 -28369 -24820 -11248
13477 -11248 -10961 -5570 -10714 -7050 -9549 -36966 -40834 -34389 -28567 -18946 -33799 -22436 -2013 8741
13463 8741 -1285 -17538 -29587 -31431 -24950 -27749 -33572 -35389 -45469 -58236 -35447 -13827 -18363
13450 -18363 -35737 -18519 2378 -5178 -21242 -17626 -22596 -26865 -38383 -20306 -28203 -42202 -70579
13437 -70579 -51587 -34473 -13320 -13403 -33657 -13925 8126 25344 12510 -10231 8439 16257
13425A6257j1625k112j1266k3612J3591L0064PL598r442j8204m161L1559L6529
13412E1183M910l1764j1576L2433J4474J2407l0742m26L506k8707j8942J841r618
13399a1021L877J1638j8766j4791K089M0311p116k0411K2872J7906k3888j3830
13387a1130L8843l999l0040k7923L5802J5796k7910j7065O961K4221j2620M752
13375d312J5546j3146l0656j7420K8129R127p898K6770K2657p5K774l5634j0303
13362a4441J3371K5534o964j0344j4005o490J1296l508j4562o124j1244M6749
13350I268J6547k7448k2647K5547n098l545j5200j8242n494K6640K5513J1337
13338A7178j7537R81J1012K1193O823k1160j9507J4410l924j5132M913L552p66
$$ plain form
13425 16257 4632 2520 -8746 -32358 -18767 11297 11304 14902 5460 -12744 -16905 14654 51183
13412 51183 56093 24329 12753 45186 59660 72067 41325 40899 44405 15698 -3244 -1403 -11021
13399 -11021 -7144 4494 -14272 -29063 -26974 13337 6221 -14190 8682 26588 2700 -11130
13387 -11130 27713 23714 -6326 -34249 1553 17349 -10561 -27626 -20665 3556 -9064 -4312
13375 -4312 11234 -1912 -32568 -49988 -21859 -12732 -20630 6140 28797 28722 31496 -4138 -14441
13362 -14441 -1070 24464 17500 7156 -6849 -13339 -2043 -5551 -20113 -26237 -37481 9268
13350 9268 25815 -1633 -24280 1267 -3831 -7376 -22576 -40818 -46312 -19672 5841 17178
13338 17178 -359 622 11634 32827 39650 18490 -1017 13393 9469 -5663 -750 2802 2036
13325B036N771r052k3406N436N763L117j9153j7189J369L4085L7843r241l8326
13312b0947k9947k971N940j1422j9708K4463M5339j828J8599q727o322q250r092
13299b4873K1535k186j0071J4656J5086j7792m9432j2648K9251K2188j0061L265
13287b1082O454J7611k4213m6138K7052M1705K421J85o414p797j8548K1425O716
13274f23J7531o115J8614j7962J4255j8231M09q399j6801l822l025k09j7071k2491
13260f3940J6096K3748M081L053Q151L015J012r478K3989j1664p483J5652j8083
13247a1851J108j9315j023j1027J3155K3641J2429n378j988J6849J244l4466Q552
13234h070M284k7856m579M710K1737k2006k6730N309j623K1491l0640k9320m707
$$ plain form
13325 2036 7807 -1245 -24651 -19215 -13452 -10335 -29488 -46677 -45308 -11223 26620 17379 -20947
13312 -20947 -50894 -53865 -47925 -59347 -79055 -54592 -9253 -11081 7518 -1209 -7531 -15781 -24873
13299 -24873 -3338 -5524 -15595 -939 14147 -3645 -53077 -65725 -36474 -14286 -24347 -21082
13287 -21082 -14628 2983 -21230 -67368 -40316 1389 3810 3995 -2419 -10216 -28764 -7339 -623
13274 -623 16908 10793 29407 11445 25700 7469 7878 -521 -17322 -21144 -24169 -24378 -41449 -63940
13260 -63940 -47844 -24096 -20015 -16962 -8811 -5796 -4784 -14262 9727 -1937 -9420 6232 -11851
13247 -11851 -10743 -30058 -31081 -42108 -28953 -5312 7117 1739 -249 16600 17844 -16622 -8070
13234 -8070 -3786 -31642 -36221 -31511 -9774 -31780 -58510 -53201 -54824 -33333 -63973 -93293 -98000
13221i8000K1386M2206K8081j161k05Q136j3230K8529K4400P41k382J2243j0652
13208D0092k7892r017k7044R664j138k416p557Q220j1075J553j3177J2353m92
13195b7926j7805L2401J1515J4568J3301k2563k3182r855J488R37J3549Q804K5367
13182B0599R37k9804p30R620J747K7150L6629L007m784k0214k0775r448n136L25
13168I123j9973r245K2254J8533P130l6284k3408J2343K4678R884l0296j7994
13156c3255n833O630J1191n322l4301k618J8099K8433j1247J6667M615J0114o311
13143c138j782J2241j0152j3668l6755J7389J7032J836j7914L072J0947J721L3455
13130A4284J4401k016m711m7982N151L6525J2229j3006j2755l7033M07K1003M2203
$$ plain form
13221 -98000 -76614 -34408 -6327 -7488 -7693 443 -12787 15742 40142 40883 38501 50744 40092
13208 40092 12200 3183 -23861 -14197 -15335 -17751 -25308 -17088 -28163 -26610 -39787 -27434 -27926
13195 -27926 -45731 -13330 -1815 12753 26054 3491 -19691 -29546 -28058 -27121 -13572 -4768 20599
13182 20599 21536 -8268 -8998 622 2369 29519 66148 69155 64371 44157 23382 13934 8798 9123
13168 9123 -10850 -20095 2159 20692 27822 -8462 -31870 -19527 5151 15035 -15261 -33255
13156 -33255 -39088 -32458 -21267 -26589 -60890 -63508 -45409 -16976 -28223 -11556 -6941 3173 -3138
13143 -3138 -4920 7321 -2831 -16499 -53254 -35865 -18833 -16997 -34911 -31839 -20892 -19171 14284
13130 14284 28685 26669 21958 -26024 -20873 15652 27881 14875 2120 -34913 -34506 -13503 28700
13117B8700K1423Q731r631j2826n693o723l4538P60K847k863K0621R753k5562
13104e001M89m84N684J9857r8l4963k6411k058P196R924J103j8751R94k460j4449
13089e9428J1790K7313K0160k724l1280o621P420M759J844K130P064l0134J8007
13076b9700L257M8j7115m365J9160Q026J7874J0515J0509r260j0172m077k349
13063g649n30k2607J7760J939l3770k810J0237M890q138L651K8431J5024N520
13050A1948j0214J2446j9678j3381Q725J7682R897o341J1134K5146j4710j9189
13038A3465j6918o335P624k8336n734R118k871K3220K1634L2329k3797n3844k8787
13025e9232K1524L3616L3560k8886l595p51j6073j7719J144L1495M559L8984R501
$$ plain form
13117 28700 50123 58854 49223 36397 30704 23981 -10557 -9797 -6950 -9813 10808 20561 -5001
13104 -5001 -4512 -4996 688 20545 20447 -14516 -40927 -42985 -35789 -25865 -24762 -43513 -42519 -44979 -59428
13089 -59428 -47638 -20325 -165 -2889 -34169 -40790 -33370 -28611 -26767 -24637 -17573 -47707 -29700
13076 -29700 -26443 -26395 -43510 -47875 -28715 -20689 -2815 7700 18209 8949 -1223 -5300 -7649
13063 -7649 -8179 -30786 -13026 -11087 -44857 -47667 -37430 -32540 -40678 -37027 -8596 6428 11948
13050 11948 1734 14180 -5498 -18879 -10154 7528 17425 11084 22218 47364 32654 13465
13038 13465 -3453 -9788 -2164 -30500 -36234 -27116 -29987 -6767 14867 47196 23399 -30445 -59232
13025 -59232 -37708 -4092 29468 582 -3013 -3764 -19837 -37556 -36412 -4917 -358 38626 48127
13012D8127k490k1381j1642M434K0783k1806j0457l538m415k7085K6528J0700
13000G758J1068q984L254M2967N033j234J4780l610o292m6222q608l412j57l4074
12986b7733j3298K6278J9601R223J2307k762l095k3749J4096J7016J357J5317
12974D4558l213j5946k7798k100M5779J1436l493j7081k3436j6854k662k3700
12962c4510q285L0833o377m960L891P863m419Q149K3532j7500k1408l401L83M4730
12948A8521M781N035j7244q930o669l0267M925q268j9610N550L1023j3037j2792
12935d6982J2151o382j1667N935J9495K7435K0505Q353j2426j1386j2274l40J655
12922e928K6024K569M41J6790L228n528L492Q856l1710q696K3489J2828k251m5962
$$ plain form
13012 48127 45637 24256 12614 17048 37831 16025 5568 2030 -2385 -29470 -2942 7758
13000 7758 18826 9842 13096 56063 61096 59862 74642 71032 64740 18518 9910 6498 6341 -27733
12986 -27733 -41031 -14753 4848 14071 26378 23616 20521 -3228 10868 27884 29241 44558
12974 44558 41345 25399 -2399 -4499 41280 52716 49223 32142 8706 -8148 -10810 -34510
12962 -34510 -42795 -11962 -18339 -23299 -19408 -11545 -15964 -7815 15717 -1783 -23191 -26592 -26209 18521
12948 18521 23302 28337 11093 2163 -4506 -34773 -29848 -38116 -57726 -52176 -21153 -34190 -46982
12935 -46982 -34831 -41213 -52880 -46945 -27450 -15 20490 28843 16417 5031 -7243 -7583 -5928
12922 -5928 20096 22665 23106 39896 43124 37596 41088 49944 18234 9538 33027 45855 43604 -2358
12908b358j3767L7627Q021o209j4625j3834k3427J8278L3190Q346L204K34N133
12895C9813P711L634n772k1214j9420O019j441m2483m0848P449J7986n359K0502
12882c3423J4973J0090J6155M4199J665m5167k8613L206O701j9047K843J1111
12870a5307J4405L3275q003M630K838k7975j8493k96J4771p790j1109r203j9883
12857d8140J668K2764L040L0084R118J8188r978j9381Q823l1088K8497N212l814
12844A4993P881l990j0511n812Q182M600P143J6979l3577k4617Q173m000M6224
12831C1668l646j9548j867M246j2535j8525K4708K8260J0153j3115K3547J6810
12819G0156q849k1256L575L5336K6969j6053K185m609j8330Q998K2610P768o494
$$ plain form
12908 -2358 -16125 21502 29523 23314 8689 -5145 -28572 -10294 22896 31242 34446 34680 39813
12895 39813 47524 51158 45386 24172 4752 10771 9330 -33153 -74001 -66552 -48566 -53925 -33423
12882 -33423 -18450 -8360 7795 51994 53659 8492 -20121 -16915 -10214 -29261 -26418 -15307
12870 -15307 -902 32373 24370 29000 31838 3863 -14630 -14926 -155 -7945 -19054 -28257 -48140
12857 -48140 -46472 -23708 -20668 9416 18534 36722 26744 7363 16186 -14902 13595 18807 14993
12844 14993 22874 18884 8373 2561 10743 15343 22486 39465 5888 -18729 -10556 -14556 31668
12831 31668 28022 8474 6607 10853 -1682 -20207 4501 32761 42914 29799 53346 70156
12819 70156 61307 40051 43626 78962 105931 89878 92063 87454 69124 78122 100732 108500 102006
12806A02006J0354J1193J0066p734R045R728k6893m8969l435M1000M295l0270
12794H0386j7313p610J0981j0000k0126j5704L6898K6273K138l6218J2675L7691
12782A00071k6660j6880k09J7548K4135j5466l054J1794j336K1703K4330L8804
12770A74780K2531J3620L7845O5728M6660L1161K3934K6495J4164j3L8514M5788
12758E41207l0300n1261q8778o0889j5897l5890n8723l5007Q574l9702k8689k2648
12746H1997J879j1984j7185L448K8699K4101j8064Q821l520k5581j4962j3368
12734D4281L4623K9052R697J1421o308Q705L5159P206J726J2376M0582L6122J5107
12721B79749M2204M6196M3895O3107M9902L6522j8750l740m5399o8477l8866n3047
$$ plain form
12806 102006 112360 123553 133619 125885 134930 144658 117765 68796 65361 106361 110656 80386
12794 80386 63073 55463 66444 56444 36318 20614 57512 83785 85923 49705 62380 100071
12782 100071 73411 56531 56322 73870 98005 82539 79485 91279 89943 111646 135976 174780
12770 174780 197311 210931 248776 314504 361164 392325 416259 442754 456918 456905 495419 541207
12758 541207 510907 459646 370868 309979 294082 258192 199469 164462 173036 133334 104645 81997
12746 81997 83876 71892 54707 58155 86854 110955 92891 101712 98192 72611 57649 44281
12734 44281 78904 107956 117653 129074 122766 131471 166630 173836 175562 187938 228520 264642 279749
12721 279749 321953 368149 412044 475151 525053 561575 542825 539085 493686 425209 386343 333296
12709C33296m9763j2115m3949k9361k879k6055J420j3280j1051Q786j2714j3344
12697A28991j433j9546j3758M695j1618J9405j8040l8860P135K4699K0709L529
12685A05908j1353P381j9891N176j4473J3027L4779L05j4329J805K6606R075K1480
12672A65496J0330j114K509l103j7670k5898j2519N226J0348R33l8341o89M981
12659A00489j2962k1806o060q70n835j926L2921j1278j5150o597K891Q880O034
12646F8731O056L305M296Q752k4541M534j9210l9817k242m761O502P388K2167
12633D1160N446J8920m980m1591P514Q216K3737K3112q227k5490j9773K1607J2843
12620F2494J502n140k0237j4299k905p131Q633R590j925K129O801r763k0356p93
$$ plain form
12709 333296 283533 271418 227469 198108 195229 169174 170594 157314 146263 155049 142335 128991
12697 128991 127558 108012 94254 98949 87331 106736 88696 49836 56971 81670 102379 105908
12685 105908 94555 101936 82045 87221 72748 85775 120554 120859 106530 108335 134941 144016 165496
12672 165496 175826 174712 177221 174118 156448 130550 118031 123257 133605 134538 96197 95508 100489
12659 100489 87527 65721 59661 58791 52956 51030 83951 72673 57523 50926 53817 62697 68731
12646 68731 74787 78092 82388 91140 66599 71133 51923 12106 9864 5103 11605 18993 41160
12633 41160 46606 65526 60546 18955 26469 34685 58422 81534 73307 47817 28044 49651 62494
12620 62494 63996 58856 38619 24320 21415 14284 22917 32507 30582 32711 39512 29749 9393 8600
12606H600K6098k66r977l983L6296K8615J1947j9052O37L0112r858j4122k0656
12593F4391J138O003J4264m550K1378L9259n95j0804J09l109j1844m1674l0378
12580D3588O210O792Q884J6790j9411J7479R269j2998k4013p55j1834q087J7819
12567D9733K0742J9193K9687j7656q070p992o177r809j5878K3349J2842j0259
12555G9705j1612K3986J0962j6351p752N65M1491K9283O577J0434K7056J1186
12543B05530l4534l1430j0360J3653J3942k1398j749k839j7881j7531J1537l195
12531A03745L865K5626L8158J66l0995p700K996J2519J1034j7860k2445O878k905
12518A23082j5260J5526j1780M884m992m986L5795J8411k5894j206K4963N121
$$ plain form
12606 8600 34698 34432 24455 20472 56768 85383 97330 78278 78915 109027 99169 85047 64391
12593 64391 65529 71532 85796 81246 102624 141883 141288 130484 130593 127484 115640 73966 43588
12580 43588 49798 56590 65474 82264 62853 80332 89601 76603 52590 51835 40001 31914 49733
12567 49733 70475 89668 119355 101699 93629 85637 79460 69651 53773 77122 89964 79705
12555 79705 68093 92079 103041 86690 78938 79503 120994 150277 156854 167288 194344 205530
12543 205530 170996 139566 129206 142859 156801 135403 133654 130815 112934 95403 106940 103745
12531 103745 107610 133236 171394 171560 140565 132865 135861 148380 159414 141554 119109 125987 123082
12518 123082 107822 123348 111568 116452 111460 106474 142269 160680 134786 133580 158543 163664
12506A63664L7935L2283k4884K679j2603l431M135J9114J2022L802q502P30j0678
12493B16266j7539K1515J6820k6049J7243K4581m729l782j9752o432O028p671
12481B16499M704J882j0515P887P443P864L1043N408J2188l873k6764J1263J2657
12468B77686j3779l0j946K180p857p579J4599N3747P6436N6861k3098O012K0175
12455D53407p691K4280j0524l6904L847J2903k7072K9210J6787K655l210j6177
12443D41511l646L1491K7540K191P321Nm446O305j482J6170m230J6397K0154J2648
12429E67929m076j4991L3389N2717l911J5656K9694P4418M7335L2872R023J1778
12417H51833O0587P1884M3209O1661N6810L2110P6907N1708L3874L1585J8654
$$ plain form
12506 163664 201599 233882 208998 211677 199074 195643 199778 218892 230914 234716 226214 226944 216266
12493 216266 198727 220242 237062 211013 228256 252837 248108 244326 224574 218142 224170 216499
12481 216499 221203 223085 212570 220457 227900 235764 266807 272215 284403 280530 253766 265029 277686
12468 277686 263907 263877 261931 264111 256254 248675 263274 317021 393457 450318 427220 433232 453407
12455 453407 445716 469996 459472 422568 426415 439318 412246 441456 458243 460898 457688 441511
12443 441511 437865 469356 496896 499087 506408 506413 501967 508272 506790 522960 518730 535127 555281 567929
12429 567929 563853 548862 582251 634968 631057 646713 676407 750825 798160 831032 840055 851833
12417 851833 912420 984304 1027513 1089174 1145984 1178094 1255001 1306709 1340583 1372168 1390822
12406A390822M5767M2234Q2619J19804R8475J39306J69215J68689J88249J89115
12396B634295J80700K72144L16616L38991L83891M32040N13567O20251P25495
12387F417990Q54550J059731J273745J578405J940964K343821K740572L010989
12379B1220767L131413K884642K252914J255899O9432j076989k027535k659659
12371B5050884k897170k796824k547511k160109j785772j402551j134402q96914
12363I429631p28159n80645m27760l04382j81609j30883j6382O0203J48071K27324
12353G495409K84917M06669N31581O45203P45819Q82694J070658J309019J515671
12344A4887640J796289K135962K540124L006507L727232M617756N795915P121425
$$ plain form
12406 1390822 1436589 1478823 1561442 1681246 1779721 1919027 2088242 2256931 2445180 2634295
12396 2634295 2814995 3087139 3403755 3742746 4126637 4558677 5072244 5692495 6417990
12387 6417990 7272540 8332271 9606016 11184421 13125385 15469206 18209778 21220767
12379 21220767 24352180 27236822 29489736 30745635 30815067 29738078 27710543 25050884
12371 25050884 22153714 19356890 16809379 14649270 12863498 11460947 10326545 9429631
12363 9429631 8701472 8120827 7693067 7388685 7207076 7076193 7059811 7120014 7268085 7495409
12353 7495409 7780326 8186995 8718576 9363779 10109598 10992292 12062950 13371969 14887640
12344 14887640 16683929 18819891 21360015 24366522 28093754 32711510 38507425 45628850
12336D5628850Q534639R751009J0284511R699708P714720M320534J06684m116573
12328I1924082p517101r537371j0115750r628456q506503p092130n783473m627049
12320B9116249l709656k979289k382848j958142j625598j324843j061974q74615
12312A3199284p08470m85882k98546j75424j181J43077K29944M14307N75594P67505
12302A3660208R68198J185751J449092J724414K051084K498843L072944L752721
12294C0363255M678268N848664P241893Q676981R866305J0378561R720580P607363
12286I4381870M100864k44222m554945p982302r965147j0512492r951684q754659
12278D6517283p376135n964216m795670l884768l142355k581881k123442j770617
$$ plain form
12336 45628850 54163489 63914498 74199009 83898717 91613437 95933971 96040655 91924082
12328 91924082 84406981 74869610 64753860 55125404 46618901 39526771 33743298 29116249
12320 29116249 25406593 22427304 20044456 18086314 16460716 15135873 14073899 13199284
12312 13199284 12490814 12004932 11706386 11530962 11529781 11672858 11902802 12317109 12892703 13660208
12302 13660208 14628406 15814157 17263249 18987663 21038747 23537590 26610534 30363255
12294 30363255 35041523 40890187 48132080 56809061 66675366 77053927 86774507 94381870
12286 94381870 98482734 98238512 93683567 85701265 75736118 65223626 55271942 46517283
12278 46517283 39141148 33176932 28381262 24496494 21354139 18772258 16648816 14878199
12270A4878199j478236j237061j048179r12050p59052o00231m64033l36063k35527
12261G807767j58206n6459j3994N9451J51836K76042L95485N09131O24312P90910
12251A0386275R54012J256020J579774J939539K404307K788081L051401L121569
12243B7480978K810289K102591J049696k09841j456764k464326l058001l312358
12235B2942264l242729k921580k542285k085188j701490j365706j156623r58335
12227F968328p89146o60673n90844n27410m49771l91056l14271k66030k09047
12218B770080j91813j53686j40367j35060j01423q1332p4186j10782n7561m9395
12208A674475m1210k7553m7306l8006l5042l6513j8552n6859m9814j9643k0670
$$ plain form
12270 14878199 13399963 12162902 11114723 10202673 9443621 8843390 8379357 8043294 7807767
12261 7807767 7649561 7593102 7579108 7638559 7790395 8066437 8461922 8971053 9595365 10386275
12251 10386275 11340287 12596307 14176081 16115620 18519927 21308008 24359409 27480978
12243 27480978 30291267 32393858 33443554 33233713 31776949 29312623 26254622 22942264
12235 22942264 19699535 16777955 14235670 12150482 10448992 9083286 7926663 6968328
12227 6968328 6179182 5518509 4927665 4400255 3950484 3559428 3245157 2979127 2770080
12218 2770080 2578267 2424581 2284214 2149154 2047731 1966399 1892213 1781431 1723870 1674475
12208 1674475 1633265 1605712 1558406 1520400 1485358 1448845 1430293 1373434 1323620 1303977 1283307
12197A283307o0979n9087j304J1597j2211n3687l8242l0472l9996m8404m8400
12186I02122m4143n0155j0464l453l8001n9162l1028l1002q448K728J879M190
12174F35063l9633j3474k6866k8204J118j8148k7735k235k8166j4538L4357O1157
12162E32696R264j1878L2284K3939p359Q88k5542k7420j9546l2253j6400P20R167
12149D68560J5482N1734J5834l1288k6562p231k5710J6726O738m7992j5074j617
12137D19600k2062j6813k078r54r554j5157J414j2884J5470J7413K1860j1114
12125C85141R329j1188j8944l692n026P15K348j7500p620L337q510j953j8133
12112C08304r329k5782J5729R807j3462r642J2488J5339J4936k1620k6801k1654
$$ plain form
12197 1283307 1222328 1163241 1161937 1173534 1161323 1107636 1069394 1038922 998926 950522 902122
12186 902122 857979 807824 797360 793907 755906 696744 665716 634714 626266 628994 630873 635063
12174 635063 595430 581956 555090 526886 528004 509856 482121 479886 451720 437182 471539 532696
12162 532696 541960 530082 562366 586305 578946 579834 554292 526872 507326 475073 458673 459393 468560
12149 468560 484042 535776 551610 520322 493760 486529 460819 477545 484283 436291 421217 419600
12137 419600 397538 380725 378647 377693 368139 352982 354396 341512 356982 374395 396255 385141
12125 385141 394470 383282 364338 360646 355620 356335 358683 341183 333563 336900 328390 326437 308304
12112 308304 298975 273193 288922 298729 285267 275625 288113 303452 318388 296768 269967 248313
12100B48313J5462L6774K6681Q354J6081j8049k3784J1408K4203j7178k140J6293
12088C42418L3628O851m051O100k116j8054J0326J9851K318J4706k4571k3014
12076C64392j5793l3479l6362k2868o944o349j1276k348j3902J11K3698J3100
12064B51980k2728l2524j9378J68J4593L3466p154M330L985J0662L7964K2324
12052B97688K477q298M1914K7602J6806L4657K3449K702J0692J0937l6714j9820
12040D04092j4846l295R730n630L100R479O15j9977j3172j5541m2842l0022N821
12027B87512k0503k8680r84k4489p355Q295j7847n620K341l8974j7421N866J1836
12014A53977K9025j2993K3103P718k402o401O105Q136J8547K3699K6778J7877
$$ plain form
12100 248313 263775 300549 327230 335584 351665 333616 309832 321240 345443 328265 326125 342418
12088 342418 376046 382897 378846 384946 382830 364776 375102 394953 397271 411977 387406 364392
12076 364392 348599 315120 278758 255890 248946 242597 231321 228973 215071 215182 238880 251980
12064 251980 229252 196728 177350 177518 192111 225577 218423 222753 226738 237400 275364 297688
12052 297688 300165 291867 333781 361383 378189 412846 436295 438997 449689 460626 423912 404092
12040 404092 389246 385951 395681 390051 393151 402630 403245 383268 370096 354555 311713 281691 287512
12027 287512 267009 238329 237345 212856 205501 213796 195949 190329 192670 153696 136275 142141 153977
12014 153977 183002 170009 193112 200830 198428 192027 198132 206268 224815 248514 275292 293169
12002B93169J5112Q877J0847j0499j1567J869J5870m936k753j8611m979l635l5670
11989B53094m2899N574P079j3689l8393l782l525l020k2019L636J1192j207j1016
11976A41025O791L294j152k0552k4117J0082O207K224l2466P025m737p086K2871
11963A09409M4943r4J1498p437k4202J535L1086P807Q555j6709k0874N072L3089
11950A83678n771J1785q390k2198m354J8822M2893J5221k71N611j8423l287k1116
11937A94200L078p524k0271r65l6459n288K2910p049R239l2821k2604J2385J9431
11924A28262p924J6081J7645j0047j2019k6596k5586J4474K844P472K2489M9274
11912A76369j1774l4095k7366L7826J9821j5005J3088K7418J7813P875M1385M2892
$$ plain form
12002 293169 308281 317158 328005 317506 305939 307808 323678 318742 315989 297378 292399 288764 253094
11989 253094 210195 215769 222848 209159 170766 166984 163459 160439 138420 142056 153248 152041 141025
11976 141025 147816 151110 149958 129406 105289 115371 121578 123802 91336 98361 93624 86538 109409
11963 109409 154352 154258 165756 158319 134117 135652 166738 174545 183100 166391 145517 150589 183678
11950 183678 177907 189692 181302 159104 154750 173572 216465 231686 231415 237026 218603 215316 194200
11937 194200 197278 189754 169483 168518 132059 126771 149681 142632 151871 119050 96446 108831 128262
11924 128262 120338 136419 154064 144017 131998 105402 79816 94290 97134 104606 127095 176369
11912 176369 164595 130500 103134 140960 160781 145776 158864 186282 204095 211970 253355 296247
11900B96247K0097P1239K8021K5323M8311L5906J7941P828p668m2414m7261o5382
11888C88188m7674m9761m2174o9201l2213j9756j4544n582J5617M83K8099J6722
11876A68204N691L442j097k1537r053L679m793k2686J0965N103J844K1919j510
11863A60171J4283j769k8008K3336O3429j7889J7008K9416M0381P5902N1754L9001
11851D67015M0466M2794M9892J132k3089m7519n4068o3961m4839m8047k4671m3220
11839B51885n2164k1108J3687q640k9897k646k8435l4489k5313K8200j0979q74
11827G9227k558r110L4081J0255j8306k4193p384j5876K117J5353K6548J2052
11815A02206K2793j7667l8053O408K8915P423J1652L3190L2735J1647J6636L824
$$ plain form
11900 296247 316344 387583 415604 440927 489238 525144 543085 550913 543245 500831 453570 388188
11888 388188 340514 290753 248579 179378 147165 127409 112865 107283 122900 123383 151482 168204
11876 168204 173895 177337 176240 154703 145650 149329 144536 121850 132815 137918 139762 161681 160171
11863 160171 174454 172685 144677 168013 231442 213553 230561 259977 300358 376260 428014 467015
11851 467015 507481 550275 600167 601299 578210 530691 476623 412662 367823 319776 295105 251885
11839 251885 199721 178613 192300 183660 153763 151117 122682 88193 62880 91080 80101 79227
11827 79227 76669 67559 101640 111895 93589 69396 62012 46136 48253 63606 90154 102206
11815 102206 124999 107332 69279 75687 104602 112025 123677 156867 189602 201249 217885 221709
11803B21709j3172m838o499n37M899j9109j4002j0069O092k1424k8201l3868J2791
11790I3772K2023k7148p30l797r571J3221L896l513j6265l9042o027K2391K4492
11777G3702j6670j8813j1178J7978K2520r288j2127j3270L193P347K5574K8276
11765I7244j129m8654k4763P326K4862J5975K7195p516l2348j6650q278j1533
11753B1731O921J0845k9674j3552J260K1935j7708J0911Q786l4713r233J4509
11741g982K8521K9401M5132J3388l1722k8320Q949O518M490l46L065j1776j8740
11728D0578k3471j1601K6322K3016J9385Q528p470j534K6108m812k3263k2336
11716D9450J9662j722j7088L3870K6926j6720j7501O027k8549j8073J2366L3478
$$ plain form
11803 221709 208537 203699 197200 196663 201562 182453 168451 158382 164474 143050 114849 80981 93772
11790 93772 115795 88647 87917 84120 74549 87770 91666 88153 71888 32846 26819 49210 73702
11777 73702 57032 38219 27041 45019 67539 58251 46124 32854 36047 43394 68968 97244
11765 97244 96115 47461 22698 30024 54886 70861 98056 90540 58192 41542 33264 21731
11753 21731 28652 39497 9823 -3729 -2469 19466 1758 12669 21455 -13258 -22491 -7982
11741 -7982 20539 49940 95072 108460 76738 48418 57367 63885 68375 68029 71094 59318 40578
11728 40578 17107 5506 31828 54844 74229 82757 75287 73753 99861 95049 71786 49450
11716 49450 69112 67390 50302 84172 111098 94378 76877 82904 54355 36282 48648 82126
11704H2126J4203K9910O818j5995K6825O4273L6688L2696M6838Q0937J15447J93217
11692G13983K49088L46529M35418M23759K59331j9018k89834m06375l74197l20746
11682A017938k42665j89866j83188j16251n1207q648m0792j5037K550k9030o7716
11671G6088l454J6072n493r585m597k0351o81Q270j103j4033k0394j4248K7419
11658C3910J6880o558o493j7432J574K215K0941K5554l183j6390k5407J8462J7523
11645F1596k7936j2691O31k812J3215R285m467j8339J8846J6620l152J0774n01
11632F1069M229j2955Q442j611o408k1796J3158M582j7275R460j7737l140L65
11619B0383p483m814J9833J1489l8745p993p324O555l2198m129Q208J4241L2216
$$ plain form
11704 82126 96329 126239 133057 117062 143887 208160 244848 277544 324382 405319 520766 713983
11692 713983 963071 1309600 1745018 2168777 2428108 2409090 2119256 1712881 1338684 1017938
11682 1017938 775273 585407 402219 285968 234761 226113 185321 170284 172834 143804 76088
11671 76088 72634 88706 83213 73628 69031 48680 47999 56269 55166 41133 20739 6491 33910
11658 33910 50790 44232 37739 20307 21881 24096 45037 70591 67408 51018 25611 44073 61596
11645 61596 33660 20969 21600 18788 32003 41288 36821 18482 37328 53948 50796 61570 61069
11632 61069 65298 52343 60785 59174 52766 30970 44128 48710 31435 40895 23158 20018 20383
11619 20383 12900 8086 27919 39408 663 -7330 -14654 -8099 -40297 -44426 -36218 -21977 10239
11606A0239L990l652k0119J1134J6907k5593K013p991m701k816L6507N734J7055
11593C8707K6360L1652J6179J1368k0192k4887j4605r260K4540P510l5371N713
11581E7714j81l5479l8930J7408j053p515J7636K1998K1152l0558q041K5820j4178
11568B5793j2505N753J6841k7468k1075K9652J8645q647j0097L918K0862o059
11556C5613j2876L2972O814j9309j7935J14J7011m156k5835J4596J6395R271k7926
11543B4749j9232r405J5706p449p974j0451j6671N836m924j439j7356J4514K3797
11530a0299k2481k08J2538n544J6850L044J721J3224N717J699K7873J114k8305
11517A6943M081R736k027j6781m7637J7292M5547Q8l6004r931j1379j4770J9225
$$ plain form
11606 10239 14229 10577 -9542 1592 18499 -7094 -5081 -13072 -17773 -20589 15918 21652 38707
11593 38707 65067 96719 112898 124266 104074 79187 64582 55322 79862 87372 52001 57714
11581 57714 57533 22054 -16876 532 -521 -8036 9600 31598 52750 22192 14151 39971 25793
11568 25793 13288 19041 35882 8414 -12661 16991 35636 26989 16892 20810 41672 35613
11556 35613 22737 55709 62523 43214 25279 25393 42404 38248 12413 27009 43404 52675 24749
11543 24749 5517 -3888 11818 4369 -3605 -14056 -30727 -24891 -29815 -31254 -48610 -34096 -10299
11530 -10299 -32780 -32988 -20450 -25994 -9144 -6100 -4379 8845 14562 16261 44134 45248 16943
11517 16943 21024 30760 28733 11952 -35685 -18393 27154 27242 -8762 -18693 -30072 -44842 -25617
11504b5617K3808j2755j3046J2422K946M181M121j735J7992j3730J7769K3881
11492D0237L8l6634L381o654R608J046k0073j1180K5465J6325j2945J4267j0497
11479A2384o653j21q650P586M682J1298j143j7422j571L664j5089k8159J2663
11466b6531o740k528J8824P619j710n98M418M647j5614M060L1927O710p8L2646
11452E7052q038k119O172k5771k6303j5261p324j5257J243M0798p60J2962J4407
11439C1801r545l3044j79K0998N886J400L441N390l092J8264J7375R583R650K476
11425H0404J2155J7444k8097l5036n2980k1604j6186L0990L2141Q34r839k622
11413G604R911J7989q803j135p847j3926M582n077k375j152o020j4K181K2403
$$ plain form
11504 -25617 -1809 -14564 -27610 -15188 -12242 -8061 -3940 -5675 12317 -1413 16356 40237
11492 40237 40275 3641 7022 368 9976 11022 -9051 -20231 5234 21559 8614 22881 12384
11479 12384 5731 5610 -3040 4546 9228 20526 19383 1961 390 4054 -11035 -39194 -26531
11466 -26531 -33271 -35799 -16975 -9356 -11066 -11664 -7246 -2599 -18213 -14153 17774 24484 24406 57052
11452 57052 49014 46895 53067 27296 993 -14268 -21592 -36849 -35606 5192 4432 17394 31801
11439 31801 22256 -10788 -10967 10031 15917 17317 20758 26148 23056 41320 58695 68278 77928 80404
11425 80404 92559 110003 81906 46870 -6110 -27714 -43900 -12910 19231 20065 10226 7604
11413 7604 17515 35504 26701 25566 17719 3793 8375 3298 923 -229 -6249 -6263 -4082 18321
11399A8321M8743J2272k2307R287K5543J0770J6808o934k6020m0914l6155q307
11387A107O550J5247j9332l9371K4806K6163M749k020j1824K0209J0428K70l6300
11374F82k1072m379K8596r816k1673J6717L8780L513k6451l902p307N916O622
11361F226k5610k6151j7282K8419J7354L3588O903j3055l2665k3828r944K3278
11349c2767K3080Q972L561J0889j362j1353j9002L74M8312j793l8583j4073Q389
11336a5356r899n492J2140J1120q155k6710p740J2765K3199K2979K5845l6031
11324a335p206K3916m002L1759j4902m5884l7311M203J8260J7204N35P892K7314
11311B0443K2217j0655q406o893K6026l025j8164k5503k6705K6603K1613n579
$$ plain form
11399 18321 67064 79336 57029 66316 91859 102629 119437 112503 86483 45569 9414 1107
11387 1107 7657 22904 3572 -35799 -10993 15170 19919 17899 6075 26284 36712 36982 682
11374 682 -20390 -24769 3827 -5989 -27662 -10945 27835 31348 4897 995 -6312 -396 6226
11361 6226 -19384 -45535 -62817 -34398 -17044 16544 23447 10392 -22273 -46101 -56045 -32767
11349 -32767 -9687 -715 2846 13735 12373 1020 -17982 -17608 30704 28911 -9672 -23745 -15356
11336 -15356 -25255 -30747 -18607 -7487 -15642 -42352 -50092 -37327 -14128 8851 34696 -1335
11324 -1335 -8541 15375 11373 43132 28230 -17654 -54965 -50762 -32502 -15298 -14763 -6871 20443
11311 20443 42660 32005 23599 16706 42732 39707 21543 -3960 -30665 -4062 17551 11972
11299A1972k1403K4097j3348m882Q70q531q042K3613Q467p224j8419M758O28k1339
11285b8783j4977R614K8010K2529m697l4186j3667K581L5368L1633k0816N781
11273A8390J0107k3465j5800l7869J469J1888j0772L907P115j7452O039L5596
11261a0847j6285o631j4601Q391M0494J9633o277k2890K1316K2400k3180j9137
11249g614K3368j9689N011K943k1550j577M94J4862J590k9989m53m388j1379P808
11235d0563L362J5975M028K2906K0078p494j9188J839k763k7213L649J0938J2215
11222b231r367J0450j1097j6423j7097p209J6155R458n156j9694J2478L683k6274
11209f2324k347K8940M0864L0638J0893o927k3484k7399j7028K6799J6136j6792
$$ plain form
11299 11972 -9431 14666 1318 -3564 -2694 -11225 -19267 4346 12813 5589 -12830 -8072 -7444 -28783
11285 -28783 -43760 -34146 -6136 16393 11696 -22490 -36157 -33576 1792 33425 12609 18390
11273 18390 28497 5032 -10768 -48637 -47168 -35280 -46052 -42145 -35030 -52482 -46443 -10847
11261 -10847 -27132 -33763 -48364 -39973 521 20154 13877 -9013 12303 34703 11523 -7614
11249 -7614 15754 -3935 1076 4019 -17531 -19108 -18614 -3752 -2162 -32151 -32604 -36992 -48371 -40563
11235 -40563 -37201 -21226 -17198 5708 25786 18292 -896 943 -1820 -29033 -25384 -14446 -2231
11222 -2231 -11598 -1148 -12245 -28668 -45765 -52974 -36819 -27361 -32517 -52211 -39733 -36050 -62324
11209 -62324 -64671 -35731 5133 35771 46664 39737 16253 -11146 -28174 -1375 14761 -2031
11197b031j4340j831j3294J414J7701Q437p14L300K5514J9699j6543o24j5551
11184A1137J7728O142q226o666o362Q439k0594k3210K2155P77K4402k2003k7038
11171b3319q932j1539k3419J9720L6113J8027q217m461L1801k5635k6059m231
11159c0151J85L1798L8277M1696l1837m7560j1664j0510J5267j2728j1448P757
11147b0918K0262N339o972J6062J4585j9858m3539P025L0811O258k6229k9871
11135d7045j5289j1633L5884R26J0067K162r33J7802m010n944k2608j2365J1664
11122d1322J9976j4867k918P071K7383K8274J3761J020k1194j2175J1211k2799
11110f579k725r229j0476j4711M02O2476J1869j3401k0014O423k1357K4801M3250
$$ plain form
11197 -2031 -16371 -18202 -31496 -30082 -12381 -3944 -4658 -1358 24156 43855 27312 26688 11137
11184 11137 28865 35007 26781 20115 13753 22192 1598 -21612 543 1320 25722 3719 -23319
11171 -23319 -32251 -43790 -67209 -47489 -11376 6651 -1566 -6027 25774 139 -25920 -30151
11159 -30151 -29966 1832 40109 81805 49968 2408 -9256 -19766 -4499 -17227 -28675 -20918
11147 -20918 -656 4683 -2289 13773 28358 8500 -35039 -28014 2797 9055 -17174 -47045
11135 -47045 -62334 -73967 -38083 -37157 -27090 -24928 -25861 -8059 -12069 -18013 -40621 -52986 -41322
11122 -41322 -21346 -36213 -39131 -32060 -4677 23597 37358 38378 17184 5009 16220 -6579
11110 -6579 -9304 -18533 -29009 -43720 -43318 19158 31027 17626 -2388 4035 -17322 7479 50729
11097E0729n539K67j0821j2428j0343k48l0k691J2742j8893L202Q554j1832l3009
11083c0340j0102p249K6457J0461J6899M87l8595o591K4819L1093P835q738j8667
11070b231n81J8593J1568J6510q945k9534j6504j5116j5249M28k695Q413R547
11057b5796j824K568R902j3466j6835J3413o494o755L5184M5075J2311m4411n6299
11044e3427K9658k83o688J7864R028J278L5503R691K4955l523q462l7746m1514
11031b3666n356J0192J2640j755K1512M499j1509k748j4840K866J2789J906k0536
11018a4006j7766K0219N787J4909Q357k8065J0008L5008k5988k5356J8371J4371
11006A5849o780J3168J5813J0046j3328j0108J230o714l2303j8917j3976R261
$$ plain form
11097 50729 45190 45457 34636 22208 11865 11617 11587 8896 21638 2745 5947 14501 2669 -30340
11083 -30340 -40442 -47691 -21234 -10773 6126 6613 -31982 -38573 -13754 17339 25174 16436 -2231
11070 -2231 -2812 15781 27349 43859 34914 5380 -11124 -26240 -41489 -41061 -43756 -35343 -25796
11057 -25796 -27620 -25052 -15150 -28616 -45451 -32038 -38532 -45287 -10103 34972 47283 2872 -53427
11044 -53427 -23769 -24052 -30740 -12876 -3848 -2570 32933 42624 67579 64056 55594 17848 -23666
11031 -23666 -29022 -18830 -6190 -7945 13567 18066 6557 3809 -11031 -8165 4624 6530 -14006
11018 -14006 -31772 -11553 -5766 9143 17500 -10565 -557 34451 8463 -16893 1478 15849
11006 15849 9069 22237 38050 48096 34768 24660 25890 19176 -13127 -32044 -46020 -36759
10994c6759K9760J5735l1586q908N0o287r605J6135L743J9548J8145k3101l6094
10981d9224J4953L723J960L394P307j2469j1535J7921j9097k0120q98J5994K6365
10968b1726J5473O474j4830k2091M185J8733j0483j0430K59J37J2915K4904R267
10955A2787j5526o291j0329K7115j5770k6616K2067N9541j2776k7535r463j9164
10943b1960J2599K7335k2240J2493o614m975j3346J1094k628k2323r239L571O810
10930b9423J508K3606m576O202P211j2070m2369L925q18K3611K7854j0023j6876
10917b2238J4938j2419j0844k6218j0837M3575K1727O86j3376j0316j425k4776
10905e1523K4911L273r279J2593J590j4545K2324K2067R935K741j9164M26j5658
$$ plain form
10994 -36759 -6999 8736 -22850 -31758 -31708 -37995 -47600 -31465 -27722 -8174 9971 -13130 -49224
10981 -49224 -34271 -30548 -28588 -25194 -17887 -30356 -41891 -23970 -43067 -63187 -64085 -48091 -21726
10968 -21726 -6253 221 -14609 -36700 -32515 -13782 -24265 -34695 -34436 -34299 -21384 3520 12787
10955 12787 -2739 -9030 -19359 7756 -8014 -34630 -12563 46978 34202 6667 -2796 -21960
10943 -21960 -9361 17974 -4266 8227 1613 -3362 -16708 -5614 -8242 -30565 -39804 -36233 -29423
10930 -29423 -27915 -4309 -8885 -2683 4528 -7542 -49911 -45986 -46804 -23193 4661 -5362 -22238
10917 -22238 -7300 -19719 -30563 -56781 -67618 -24043 -2316 -1630 -15006 -25322 -26747 -51523
10905 -51523 -26612 -23339 -32618 -20025 -18435 -32980 -10656 11411 21346 24087 4923 5349 -10309
10892a0309J0648Q14q716j606j848N867q76q266L836J1688j5794k1882l276L4725
10878d995J1315J3254J2977k2789l1088O092N560K203k6578k7179J2070M714Q153
10865c6291n747J0451J7032J0090J1577J1911l2411k46j4601K3860o862J0007
10853a230J3623l4915J3725K2795K526q488P83J8722K1185j9409n472j1199k8059
10840a5413K972j1878j7665J0757Q605J1607n472j0975j878L1800J2891j1364
10828C987J4373M141j1238K044J3479l6994k6167K0322K7579M980m2607j6787
10816d2888K94J3883L6857j240j7612j6870J0223J771J0749K2447p458p974p171
10803d989M806j3430m473N574n901Q032j342k358J2554K3178J0799k680p57l1612
$$ plain form
10892 -10309 339 1153 -7563 -9169 -11017 -5150 -6026 -14292 -10456 1232 -14562 -36444 -39720 -4995
10878 -4995 6320 19574 32551 9762 -21326 -15234 -9674 -7471 -34049 -61228 -49158 -44444 -36291
10865 -36291 -42038 -31587 -14555 -4465 7112 19023 -13388 -13634 -28235 -4375 -11237 -1230
10853 -1230 12393 -22522 -8797 13998 16524 8036 8819 27541 48726 29317 23845 12646 -15413
10840 -15413 -12441 -24319 -41984 -31227 -22622 -11015 -16487 -27462 -29340 2460 15351 3987
10828 3987 18360 22501 11263 13307 26786 -10208 -36375 -16053 11526 16506 -26101 -42888
10816 -42888 -42594 -28711 8146 6906 -10706 -27576 -17353 -15582 -4833 17614 10156 2182 -4989
10803 -4989 -183 -13613 -18086 -12512 -18413 -10381 -11723 -14081 -1527 21651 32450 29770 29013 -2599
10789b599j2141L36K6992l856j0029L040N576K341J2924k7784j6427j2782j0066
10776d4475K0144L4294L2217J542r480k6265K2259J0481j8782M651J4986K450
10764D4022J2239l6355k8535j7197l0255L802M2774K5339K058l429p898p131l698
10751d264j4238j5894K3605K0232k6654k1706J5715J2131R161J2178q81O156p310
10738H231j8051k910K76R403J4891j3330j5691O01M470L0420l241j3246o337R808
10724E294J490m103m764J017r567q52J1252L137K5468l736j6713Q230j0924K074
10710G303J57J1085j3703K1436M481L343k0889P768K6546p29k1799k7012j0575
10697a2588o306J6491J3338o150j7672k2831J846M925j8452O823J7493K2242O600
$$ plain form
10789 -2599 -14740 -14404 12588 8732 -1297 1743 7319 9660 22584 -5200 -21627 -34409 -44475
10776 -44475 -24331 9963 42180 43722 34242 7977 30236 40717 21935 26586 41572 44022
10764 44022 56261 19906 -8629 -25826 -56081 -52279 -9505 15834 17892 14463 6565 -566 -4264
10751 -4264 -18502 -34396 -10791 9441 -17213 -38919 -23204 -11073 -1912 10266 9385 15541 8231
10738 8231 -9820 -12730 -12454 -3051 11840 -1490 -17181 -16580 -12110 18310 15069 1823 -4514 5294
10724 5294 6784 2681 -2083 -1066 -10633 -11485 -233 2904 28372 24636 7923 16153 5229 7303
10710 7303 7460 18545 4842 26278 30759 34102 13213 20981 47527 46798 24999 -2013 -12588
10697 -12588 -18894 -2403 10935 4785 -12887 -35718 -33872 -28947 -47399 -40576 -23083 -841 5759
10684E759K53j0735l6230j0203K6700J7470J1815n6k3389J7437L7724J7900o749
10671D7696m3957k8770N45p315P076r747j589K3662J9101R639j2197l2928k6880
10658e5664K0796J5829N506k5839n4807J9907L7427K1387K1450M463j508J8950
10646B7897k7248l1082Q648j2898k4145L479P773j5288K4957K6023o644k7666
10634d6194j689j4924J3280J0639Q991O016R595l0952q026O315K202N067K520
10621c7160K3101J2462M616j0999J2942m949R664L372N662j3141j8225q325K5917
10608D937L079J4385L817j7165l967j8226r949k5943j2356L846Q610Q118K5116
10595a5698K2331j242n450J148R769L0j4105l0166J001N933J7951l177j8919J3196
$$ plain form
10684 5759 6012 -4723 -40953 -51156 -24456 -6986 4829 4773 -18616 -1179 36545 54445 47696
10671 47696 3739 -25031 -24486 -31801 -24725 -34472 -36061 -12399 6702 16341 4144 -28784 -55664
10658 -55664 -34868 -19039 -13533 -39372 -94179 -74272 -36845 -15458 5992 10455 8947 27897
10646 27897 649 -30433 -21785 -34683 -58828 -55349 -47576 -62864 -37907 -11884 -18528 -46194
10634 -46194 -47883 -62807 -49527 -38888 -29897 -23881 -14286 -45238 -53264 -46949 -44747 -39680 -37160
10621 -37160 -14059 -1597 3019 -7980 4962 13 9677 13049 18711 5570 -12655 -20980 4937
10608 4937 8016 22401 26218 9053 5086 -13140 -23089 -49032 -61388 -57542 -48932 -40814 -15698
10595 -15698 6633 5391 -59 1089 10858 10888 -3217 -33383 -32382 -26449 -8498 -11675 -30594 -17398
10581a7398j0787J45l062j6423O955L7417J9874o293m9164k9711J3395L6696J3758
10568d598K0764J1453j2610j3996N751n243o95R598J8981J2714j7465k5500M15
10555d31J9471j1212K3259R921k7428j745o892l1299o100J1264J7300K3126J1460
10542C0694k7929k024N734K049M61j154k5804K274J1621p773J1365j7268l0900
10529d8654J5695J7994J2397L2952j9830j8854Q939l0336j1298l951J2750J2862
10517a9334q259K1547j0669k5843R773M771r779J6178J0741J4308O682r036k1196
10504b0116J429N389K777J5771j3956l554K864K116o300N271j6110R113K0517
10491E211J5164k4154O627o852Q64j0995J6500J1881j4607k5339J2012J3055J6611
$$ plain form
10581 -17398 -28185 -28040 -31102 -47525 -40570 -3153 16721 10428 -38736 -68447 -55052 -18356 -4598
10568 -4598 16166 27619 15009 1013 6764 1521 826 10424 29405 42119 24654 -846 -431
10555 -431 19040 7828 31087 41008 13580 11835 4943 -26356 -32456 -21192 -3892 19234 30694
10542 30694 2765 741 6475 8524 8985 7831 -17973 -15699 -4078 -11851 -486 -17754 -48654
10529 -48654 -32959 -14965 -2568 30384 10554 -8300 639 -29697 -40995 -44946 -32196 -19334
10517 -19334 -27593 -6046 -16715 -42558 -32785 -28014 -37793 -21615 -10874 3434 10116 1080 -20116
10504 -20116 -18687 -13298 -10521 5250 -8706 -12260 -9396 -7280 -13580 -8309 -24419 -15306 5211
10491 5211 20375 -3779 2848 -4004 -3140 -14135 2365 14246 -361 -25700 -13688 -633 15978
10478A5978q036j5580N042J0008K51l0253K8317J9981l1307k5964k26M000L1282
10465C493L1547J3992K0795q371m237j4743m0396j1122K1468Q854R98K2241K5947
10452G0466k1782n1168p322r819l2989J095L1845j5824q889L319J6832M2072j432
10439A6404l1741L62J8545j6801k1257j161J3277P289O051q158l3286j2511l532
10426f6519P28j0877K934K0282K5437J1117O628N16J0826m920N304J2862k1115
10413f797J8559K2034K3704k1285m1823k6232l031J4312K9909M402P941J2131
10401C3824k0108k447n052l5377j7139K0005K3340P394K8022l963l0353K6896
10389B5042J1034l925r309j5363l2196j5786N514k1519J0601J1446j4423r756
$$ plain form
10478 15978 7942 -7638 -2596 7412 7663 -22590 5727 25708 -5599 -31563 -31789 -27789 3493
10465 3493 35040 49032 69827 61456 57219 42476 2080 -9042 12426 21280 22278 44519 70466
10452 70466 48684 -2484 -9806 -19625 -52614 -51519 -19674 -35498 -44387 -41068 -24236 17836 16404
10439 16404 -15337 -14975 3570 -13231 -34488 -35649 -22372 -15083 -9032 -17190 -50476 -62987 -66519
10426 -66519 -65791 -76668 -73734 -53452 -28015 -16898 -10270 -9754 1072 -3848 1456 14318 -6797
10413 -6797 11762 33796 57500 36215 -5608 -31840 -34871 -20559 9350 13752 21693 33824
10401 33824 13716 11269 6217 -29160 -46299 -26294 -2954 4440 32462 28499 -1854 25042
10389 25042 36076 32151 22842 7479 -24717 -40503 -34989 -56508 -45907 -34461 -48884 -58640
10377e8640J904K1728n177J4588O03O039K2499l335J5752j8123k2533j6018N1117
10364A0404L9789P797l1379m9218J5959R853J6602M880j0609N67j6210k2861J649
10351b2777L5823K9693k1712l8822K5064L3063M71j0549J2984K045m819l1978
10339H486K213J5116k0812k2319j5081J8440J1921Q401j6966j3373M2724n031
10327A3719m4004k230p170L3962M122j730K0193L0930j2998k6236j7240q151J4363
10314b470O281L2273L0501q636j3132k1691j9161P519L529J6154P729n303o014
10301B7579J0026o217k0524j5569l541K1476L5550J3408j9263k5252k2264K115
10289b476n087L021n277J7407J0420l0856k4555o904N0447L6462j5806k9764k7904
$$ plain form
10377 -58640 -56736 -35008 -40185 -25597 -24994 -18955 3544 209 15961 -2162 -24695 -40713 10404
10364 10404 50193 57990 26611 -22607 -6648 3205 19807 24687 14078 14645 -1565 -24426 -22777
10351 -22777 13046 42739 21027 -17795 7269 40332 40803 30254 43238 45283 40464 8486
10339 8486 10699 25815 5003 -17316 -32397 -13957 -2036 6365 -10601 -23974 18750 13719
10327 13719 -30285 -32515 -39685 -5723 -1601 -3331 16862 47792 34794 8558 -8682 -16833 -2470
10314 -2470 3811 36084 66585 57949 44817 23126 3965 11484 15013 31167 38896 33593 27579
10301 27579 37605 31388 10864 -4705 -8246 13230 48780 62188 42925 17673 -4591 -2476
10289 -2476 -7563 -4542 -9819 7588 18008 -12848 -37403 -44307 6140 42602 26796 -2968 -30872
10276c0872L675K0181R93J1436R932K0168o960j0111K674j261k0412l659L695
10263e21l008l299k1243L400J43J9053j344N271J1145K881j5318m829Q740j506
10249d35j7997k3578J0368J7653j2935M734K8598J9956k2365j4354P87l777k0671
10236c4016M043O533k237j438j760J4062k1882Q682R613K1009P656J0636Q445
10223B9346m804k9831j1526k6213J071L475K0796L845r393r113K970N838J5680
10210g859j6261r657J1352K5398N279J2774j5755n160p126r319J8713o820O919
10197B478O926l238Q192P152J6294r19k3481J5694r961j8606k4978j4209J566
10184c7090J7289L846L4192j9067j1286o948j040R727K5810l55m5160k1741L3718
$$ plain form
10276 -30872 -27197 -7016 -6023 5413 15345 35513 28553 18442 21116 19855 -557 -4216 -521
10263 -521 -3529 -6828 -28071 -24671 -24528 -5475 -6819 -1548 9597 12478 -2840 -7669 1071 -435
10249 -435 -18432 -42010 -31642 -13989 -26924 -22190 6408 26364 3999 -10355 -9568 -13345 -34016
10236 -34016 -29973 -23440 -25677 -27115 -28875 -14813 -36695 -28013 -18400 2609 10265 20901 29346
10223 29346 24542 -5289 -16815 -43028 -41957 -38482 -17686 -13841 -23234 -32347 -29377 -23539 -7859
10210 -7859 -24120 -33777 -22425 2973 8252 21026 5271 111 -7015 -16334 2379 -4441 2478
10197 2478 9404 6166 14358 21510 37804 36885 13404 29098 19137 531 -24447 -38656 -37090
10184 -37090 -19801 -15955 18237 -830 -12116 -19064 -20104 -10377 15433 15078 -30082 -51823 -18105
10171a8105j5849j0458l941M8662J9765K5527k6145l2070Q211Q351j7302m6963
10159f0317O349J800j2847L379L4832J8901o928L231J219j0897P273R648j473
10146e830j1584P058k115j2940J6865k936j1444J6693J2887m251l0779m600J8757
10133a4219K8966K4490j1308p098p209j1199k9237o713k5424J801R211J0932J2959
10120b4048J4311j4763r281j0392J3612J0678L1436k590m237k0351J1247L8503
10108C4125k1789j6860l284L287q094o42k1118j2634J1656L022j3022k8922k99
10095g4574K0239k733j7622J9921K0920n619M780m188k3164K1478J6558j7528
10083d1532L046j4340K6233K6707J7176J766O195k5744k5627k2764J184J4481
$$ plain form
10171 -18105 -33954 -44412 -48353 309 20074 45601 19456 -12614 -4403 3948 -13354 -60317
10159 -60317 -53968 -52168 -65015 -61636 -26804 -7903 -14831 -11600 -10381 -21278 -14005 -4357 -5830
10146 -5830 -17414 -10356 -12471 -25411 -8546 -11482 -22926 -6233 6654 2403 -28376 -32976 -14219
10133 -14219 14747 39237 27929 20831 13622 2423 -26814 -33527 -58951 -57150 -47939 -37007 -24048
10120 -24048 -9737 -24500 -33781 -44173 -30561 -19883 11553 8963 4726 -15625 -4378 34125
10108 34125 12336 -4524 -7808 -4521 -12615 -13257 -34375 -47009 -35353 -32331 -45353 -74275 -74574
10095 -74574 -54335 -57068 -74690 -54769 -33849 -39468 -34688 -38876 -62040 -40562 -24004 -41532
10083 -41532 -38486 -52826 -26593 114 17290 19056 25251 -493 -26120 -48884 -47700 -33219
10071c3219J6410J6033q088J1488j711l71Q89p584j7234o261P951q86r787J0188
10057b2182m19j1604J4031K609J0439K0534k880j5266k2731K892L323p066J7704
10044a0616J5557M0345K8970R132N514J6521R737L8439J4574k3284k1115p477
10032A16297P22l4563n0366Q325L848K5975J4458M36l0049l3810j4583K3458J1744
10019D1892K4687J6761k84l0014O467p875n250j2430N240k2413l161l184j6933
10006f497P575p910k269J7918o476j1962R686j4206j3914R185q316K982M702J2748
9992f754k2640k8819j3831o29K3136R1J1412O656j4116J2012R23L1059l6814j6447
9978e4761J3608K4665J9322l427p378k2869N084r43k343J11p577Q325K3710O048
$$ plain form
10071 -33219 -16809 -776 -8864 2624 913 542 1431 -6153 -23387 -29648 -21697 -22583 -32370 -22182
10057 -22182 -22601 -34205 -20174 -17565 -7126 13408 10528 -4738 -27469 -24577 -21254 -28320 -10616
10044 -10616 4941 45286 74256 83388 88902 105423 115160 153599 168173 144889 123774 116297
10032 116297 117019 82456 32090 40415 44263 70238 84696 85132 55083 21273 6690 30148 41892
10019 41892 66579 83340 83056 53042 59509 51634 46384 33954 39194 16781 13620 10436 -6497
10006 -6497 1078 -6832 -9101 8817 2341 -9621 65 -14141 -28055 -18870 -27186 -24204 -19502 -6754
9992 -6754 -29394 -58213 -72044 -72673 -49537 -49446 -38034 -31378 -45494 -33482 -32559 -1500 -38314 -54761
9978 -54761 -41153 -16488 2834 -593 -7971 -30840 -25756 -26699 -29042 -28931 -36508 -28183 -4473 1575
9964A575j8145K587J2771m110J6424N476n723j8068r837M132N998Q325J8280m057
9950A5628n286j674j3214j9438J6992K999L2470K2261P01k8561j1840k195K2671
9937C1514M264k910k8642r774j1406K12K3516K4812j767k2780J7404J0903J5998
9924E1344j0501j0681j9619J5001J4871L084m785m0728j9908j5962L695K4522
9912i667j2137o005q1K4493L8387p732k9853l089K3967j5800k9205K8868O871
9899I017n240J3384J7204q188j9572Q886m554R204m750j2104o595j7160j342J7762
9885d048J3273R229J244k5138j6157K7322J6537Q725R04K757J475R01K458k7281
9871A2201j9926J1178j633L196L1368j7953j3589k711r614j4334o329q286O723
$$ plain form
9964 1575 -16570 -13983 -1212 -5322 11102 16578 10855 -7213 -17050 -12918 -6920 1405 19685 15628
9950 15628 10342 8668 -4546 -23984 -6992 -3993 28477 50738 51439 22878 11038 8843 31514
9937 31514 35778 32868 4226 -5548 -16954 -16742 6774 31586 29819 7039 24443 35346 51344
9924 51344 40843 30162 10543 25544 40415 43499 38714 -2014 -21922 -37884 -34189 -9667
9912 -9667 -21804 -27809 -27890 -3397 34990 27258 -2595 -5684 18283 2483 -26722 2146 9017
9899 9017 3777 17161 34365 26177 6605 15491 10937 20141 15391 3287 -3308 -20468 -21810 -4048
9885 -4048 9225 18454 19698 -5440 -21597 5725 22262 30987 31891 34648 36123 37024 39482 12201
9871 12201 -7725 3453 1820 5016 36384 18431 4842 2131 -7483 -21817 -28146 -36432 -29709
9858b9709J9749J0331l006j0899l1646J4087L2717j6047K5394K5454j6677q77
9846A8871k1988J9376J5720j8032j2565N676l294L925q288j875k3483M720K5600
9833D363r44K3994k204k0335K3387l0680j4966k222J0285M519J339J1628j161
9820G003L820k0799N419J1496p979k6742J3678J7878l784j0022O713N458O056
9807H195j3458l4157J9042J8468o717J3681j6319J4385J0767k7732k1092k240
9795c7177J7829K3473J184j518j2161j3328K236p414k1827R697J6700R188M368
9782h750K3382L6461L452k0162j4495l5547k4521o330J4523j6330j985M1979K3070
9769A4747k1757j2230J6537M2093j8976l1902L113Q100P927J3305N62o362O120
$$ plain form
9858 -29709 -9960 371 -2635 -13534 -45180 -31093 1624 -14423 10971 36425 19748 18871
9846 18871 -3117 16259 31979 13947 1382 7058 3764 7689 -599 -2474 -25957 -21237 4363
9833 4363 3419 27413 25209 4874 28261 -2419 -17385 -19607 -9322 -4803 -3464 8164 7003
9820 7003 10823 -9976 -4557 6939 -1040 -27782 -14104 3774 -10 -10032 -3319 2139 8195
9807 8195 -5263 -39420 -20378 -1910 -8627 5054 -11265 3120 13887 -13845 -34937 -37177
9795 -37177 -19348 4125 5309 3791 -8370 -21698 -19462 -26876 -48703 -39006 -22306 -13118 -8750
9782 -8750 14632 51093 54545 34383 19888 -15659 -40180 -46510 -31987 -48317 -50302 -8323 14747
9769 14747 -7010 -19240 -2703 39390 20414 -11488 -8375 -275 7652 20957 21519 15157 21277
9756B1277l4996k3555J4448K1937j6250j1027L9032j5487j6065j4292m874P63
9744c9089R686j2379m396K2921K4859J0388k0660j9211J762K8469j1316p66k582
9731a2314j2222j6098L199J7940j2996O858L4924K4768q062j6369n981l5437Q13
9718c0977M4016O600J233O932p460k5230j7047l6327j2222K2042R371n225j5194
9705e9488j8641k4792L2324M2122P775j3585l896J365n052k351K6592M1123K0432
9692D3928k4971l0304j3628j5854j182L1182J1647M944r793j464m56J5579K5265
9679C4893J83l7563j4435K9233N670k7789L287L440L798M913K8404J3976k4709
9666B3301j4548K665M604p096M86K7414k9963k9434J2019j9877J691K7723r199
$$ plain form
9756 21277 -13719 -37274 -22826 -889 -17139 -28166 10866 -4621 -20686 -34978 -39852 -39089
9744 -39089 -29403 -41782 -46178 -23257 1602 11990 -8670 -27881 -26119 2350 -8966 -9732 -12314
9731 -12314 -24536 -40634 -37435 -19495 -32491 -25633 9291 34059 25997 9628 3647 -31790 -30977
9718 -30977 13039 19639 20872 27804 20344 -4886 -21933 -58260 -70482 -48440 -39069 -44294 -59488
9705 -59488 -78129 -102921 -70597 -28475 -20700 -34285 -38181 -36816 -41868 -44219 -17627 23496 43928
9692 43928 18957 -11347 -24975 -40829 -42011 -10829 818 5762 -4031 -5495 -5951 9628 34893
9679 34893 35076 -2487 -16922 12311 17981 -9808 -6521 -3081 717 5630 34034 48010 23301
9666 23301 8753 11418 16022 8926 9412 36826 6863 -22571 -10552 -30429 -28738 -1015 -10214
9653a0214M360j031L7057O422r463J8270l2727l1197j7067J741n058N005L181
9640c0721K6274M1005n474j5921j2435r284j2642M367K410J7348L0892j8054j7007
9627G58J5870J6310j723l8805p428J437k6108L523J6717J1892J0973J7971j4701
9614F686k5687J876K0656K8442o589l1889j1313J9092N798J4896J3151o365j8737
9601A0017j5983j6648M0170J7520q797j1226j8710n484J9710k0843k773Q280J5422
9588A0655J6278N562J8254m70o90j9952k3546o262J7379o779q921j6001j0331
9575b4824J6233K1797L133K60Q035r428j9349o417O876j2849p393j666J0102J4817
9561f73r453k6298K1670j2629j2357M53R030j961r747K1126M2290J924r557k175
$$ plain form
9653 -10214 -5854 -6885 30172 36594 27131 45401 12674 -18523 -35590 -33849 -38907 -33902 -30721
9640 -30721 -4447 36558 31084 15163 2728 -6556 -19198 -14831 -12421 4927 35819 17765 758
9627 758 16628 32938 31215 -7590 -15018 -13581 -39689 -36166 -19449 -7557 3416 21387 6686
9614 6686 -19001 -17125 3531 31973 25384 -6505 -17818 1274 7072 21968 35119 28754 10017
9601 10017 -5966 -22614 17556 35076 26279 15053 -3657 -9141 10569 -10274 -13047 -4767 10655
9588 10655 26933 32495 50749 50279 49589 29637 6091 -171 17208 10429 1508 -14493 -24824
9575 -24824 -8591 13206 16339 16599 24634 15206 -4143 -10560 -3684 -16533 -23926 -25592 -15490 -673
9561 -673 -10126 -36424 -14754 -27383 -39740 -39287 -30257 -32218 -41965 -20839 21451 23375 13818 11643
9547A1643m118J738L5338j1765k8344j1705J654K3167r477k1492L59J5262N34
9534B794K5775J5830k39k2102r010o703J2317K2394l453j6956k7669j7871K3655
9521a238L5096J1854j5230j6384j4448J2961K3733l8882j2963J8076R180J5368
9509B7123j24k1023j0728K4926J4883o704j791R307j4376j298j6468N626k387
9496F966J622Q329l661j9402L939K4941K964j5732k1455J4021J6672O504M295
9483C0003j9182j9014j1191j5478M411K3672L9786K5628p620j2842j0018m5996
9471a7841n166J0540J1792J9329K7770J9771L3042m4227k7739j6755k56L448O599
9458B0307k0586l975j0004K9457M254j9736J5903K3878j9887J9301p541k1750
$$ plain form
9547 11643 7525 9263 44601 32836 4492 -7213 -5559 17608 8131 -13361 -13002 2260 2794
9534 2794 28569 44399 44160 22058 13048 6345 18662 41056 37603 20647 -7022 -24893 -1238
9521 -1238 33858 45712 30482 14098 -350 12611 36344 -2538 -15501 2575 11755 27123
9509 27123 26999 5976 -4752 20174 35057 28353 26562 35869 21493 20195 3727 9353 6966
9496 6966 8588 16917 13256 -6146 -2207 22734 25698 9966 -11489 2532 19204 25708 30003
9483 30003 10821 -8193 -19384 -34862 -30451 -6779 33007 58635 51015 38173 28155 -17841
9471 -17841 -23007 -12467 -675 18654 46424 66195 99237 55010 27271 10516 10260 13708 20307
9458 20307 -279 -4254 -14258 15199 19453 -283 15620 39498 19611 38912 31371 9621
9446I621J879O831k0782J6155R257K0806K489j5365k2940l582J3370J4228R950
9433D1917j8140j9571k5521L7108M8508J7002k9309k3969j3778l674n829j8289
9421a3545K0928K1670l605R805l908l205j2087k996m304PN891j8958k508q813
9407a5628m63J7072j8861k1554n579L5228K8465r262l546L7156l319k445K480
9394C9744j3472o875M491R428K2117j5310j7161K271J6752K0390J6274j7493l30
9381F0826O789q795j9168L742l544n353J6567M685K2624M804l0130k1659l8303
9368f915p586k314j0962K1084R665O2762L1169j2734j8747J3819j5497J3827J1507
9355H9078j2909J51k6225j290L872K7145N293n456L6056L3283k776k6811j2254
$$ plain form
9446 9621 11500 18331 -2451 13704 22961 43767 46256 30891 7951 4369 17739 31967 41917
9433 41917 23777 4206 -21315 15793 64301 81303 51994 28025 14247 10573 4744 -13545
9421 -13545 7383 29053 25448 35253 31345 28140 16053 13057 8753 8760 14651 -4307 -6815 -15628
9407 -15628 -16091 981 -17880 -39434 -45013 -9785 18680 9418 5872 43028 39709 37264 39744
9394 39744 26272 19397 23888 33316 55433 40123 22962 25233 41985 62375 78649 61156 60826
9381 60826 67615 58820 39652 43394 39850 34497 51064 55749 78373 83177 53047 31388 -6915
9368 -6915 -14501 -16815 -27777 -6693 2972 65734 96903 84169 65422 79241 63744 77571 89078
9355 89078 76169 76320 50095 48805 52677 79822 85115 79659 115715 148998 146222 119411 107157
9342A07157k9511p846j0321N352j9330P697O567o778J4135k2309J1286q76J0164
9329F5387q80N667L966j157n353J3555J0575K688J8597L6034M746K60N714J4930
9315A74729j457J0493j6860j4241Q251K370Q632r172j9293k9363j2647q217P340
9302A00565O17K0545K6822K4044R689J6275o542J2971K2236Q867K4921K1054q861
9289B73203P310k478J2727J1833K4587M4507L4525K3284m81J0120J579O674J1047
9276D58437K1610L7838N4913J0048K9919J8990J6225N6733N3535M7363K7184L6936
9264H69731N6824N0437Q5650R7063P5731J09251J01261J06500J09447J13850J33918
9253A909663J51225J69978J64755J92943K40246K39704K89136K87569L10507L16076
$$ plain form
9342 107157 77646 69800 59479 64831 45501 53198 59765 52987 67122 44813 56099 55223 65387
9329 65387 64507 70174 74140 72983 67630 81185 91760 94448 113045 149079 153825 154085 159799 174729
9315 174729 173272 183765 166905 152664 160915 163285 171917 162745 143452 114089 101442 93225 100565
9302 100565 101182 121727 148549 172593 182282 198557 192015 204986 227222 236089 261010 282064 273203
9289 273203 280513 278035 290762 302595 327182 371689 406214 429498 429017 439137 440716 447390 458437
9276 458437 480047 517885 572798 582846 612765 631755 647980 704713 758248 805611 832795 869731
9264 869731 926555 976992 1062642 1159705 1235436 1344687 1445948 1552448 1661895 1775745 1909663
9253 1909663 2060888 2230866 2395621 2588564 2828810 3068514 3357650 3645219 3955726 4271802
9243D271802L12482L33722L57181K85948K46341K02269J66763J00284l6434j00463
9233F139895j37461j71861k50864k97194l71850l50414l31820l34235l06080k58473
9223C329643k72177k70399k34527j96014j73377j41697j62705j56622j50470j25793
9213A445862p8557q0978o2149o8173p9321n6938o4838o0215m8879l7931k6385
9202G81498L253l7431p0045n8306k4879n8763l1141J4642n2015l6570k961N859
9190D33141m8064m519M365K9409q660n5096j274K057k0203o387n1818k4723k114
9177B46114K1356J2357J5466m562k7490l0037j1641l1763M759L502Q147n206K801
9164B03803l013j2594r239n358K6224j4556N681j3367l3732l4564j2636l076r582
$$ plain form
9243 4271802 4584284 4918006 5275187 5561135 5807476 6009745 6176508 6276792 6240358 6139895
9233 6139895 6002434 5830573 5579709 5282515 4910665 4560251 4228431 3894196 3588116 3329643
9223 3329643 3057466 2787067 2552540 2356526 2183149 2041452 1878747 1722125 1571655 1445862
9213 1445862 1367305 1286327 1224178 1156005 1076684 1019746 954908 894693 845814 807883 781498
9202 781498 784751 747320 677275 618969 594090 535327 504186 518828 466813 430243 427282 433141
9190 433141 385077 380558 384923 414332 405672 350576 349302 351359 331156 324769 272951 248228 246114
9177 246114 267470 279827 295293 290731 263241 233204 221563 189800 194559 198061 206208 201002 203803
9164 203803 200790 188196 178957 173599 199823 185267 190948 177581 143849 109285 96649 93573 83991
9151H3991J5022J4542O216L0245j311l5456j2428K4450j3796j5731j0039k1709
9139F3996J0963K858l4505R583N596J1827j3052j0196O892J1343o458j1084j767
9126D5996J0253n271P735J6703k503K7337L2392j7831j2883p734J177j7948k6820
9113E0603L000L6778L8911J8585j7836j4985o382J4696j3599k7397r60l4557j2229
9100C4628l12J0141o097M896l047k2834j1568k899J6805L766J5346J3951k3784
9087B8992J6447J7335r493r2j0186k0189o70n461l1590J5011K4238K9992J2884
9074F7218k3378j0391L1602j599k3092r914N62j3651n267j0582J767K9880J9918
9061E3073j2067j0186J4662m119J8386M678m238Q000Q095j1709n708K4282K090
$$ plain form
9151 83991 99013 113555 119771 150016 148705 113249 100821 125271 111475 95744 85705 63996
9139 63996 74959 77817 43312 52895 58491 70318 57266 47070 53962 65305 58847 47763 45996
9126 45996 56249 50978 58713 75416 72913 100250 132642 114811 101928 94194 95371 77423 50603
9113 50603 53603 90381 129292 147877 130041 115056 108674 123370 109771 82374 81414 46857 34628
9100 34628 34316 44457 38360 43256 40209 17375 5807 2908 19713 23479 38825 52776 28992
9087 28992 45439 62774 53281 53189 43003 22814 22144 16683 -14907 104 24342 54334 67218
9074 67218 43840 33449 65051 63452 40360 30446 31008 17357 12090 1508 3275 33155 53073
9061 53073 41006 30820 45482 41363 59749 64427 60189 68189 76284 64575 58867 83149 85239
9048H5239m0951j0243k2966l591R028J0137J1500M534J1201K626Q090j536r6j1170
9034E1802l531J6772k090k8443l2071M227L899r190K134j2255O11K7482J0806
9021C0153k5883L257L0164M753k8435j1164J4723K9088K3742j1618M247L4931
9009I7958K8418p314K0452Q225p315J4083j960M6550K5893O9672O9459N1513J31430
8996E47064J44501J19656P8903j9822r3556j47706j68576j15548l2269j7046m5544
8985B50057o1795k5389l2677m1921n436K2389K4900J787r631j2249j0809M003
8973A03229K0157j6780J5575J5439j2159k7099m193J4337P480L229j5226j170
8961A02819L0558L5280J5311L8768M4145M3177J08746J48651K12514K62509K85174
$$ plain form
9048 85239 44288 34045 11079 7488 16516 26653 38153 42687 53888 56514 64604 63068 62972 51802
9034 51802 48271 65043 62953 34510 2439 6666 10565 1375 3509 -8746 -8135 19347 30153
9021 30153 4270 7527 37691 42444 14009 2845 17568 46656 70398 58780 63027 97958
9009 97958 126376 119062 139514 147739 140424 154507 152547 199097 224990 294662 364121 415634 547064
8996 547064 691565 811221 890124 870302 776746 629040 460464 344916 312647 295601 250057
8985 250057 188262 162873 130196 88275 82839 105228 130128 131915 122284 110035 99226 103229
8973 103229 123386 106606 122181 137620 125461 98362 94169 108506 115986 119215 103989 102819
8961 102819 133377 168657 183968 222736 266881 310058 418804 567455 779969 1042478 1327652
8950A327652K88370J44861o3265k15566k87509k59264k31672j74811j11291r4690
8940C22815k5244m5347m0067l4840j7582r848Q528m671k2366k3981r690l223K260
8927I6744j0655l521J7350K702l0634J4949O52k899l7323L948J6849K8092L0230
8914A26484L9479j1991J2186L4525J6700N5075Q8439Q4859J13817J12393P5271
8903G47237L8048p0766j50117j22746j36947r1141n2394p1687l1758j9385j0130
8892B8214J6507q38j8332J657P65o694M88N036o657R032M387k4282n320j8151
8878a4188K6265J24j4380O840J0233L4377K3021n947j7407K2966L1155j2809l0036
8865F0214p318K6761l5475r788l66Q564K085J1026J9992L4223J9932q461K0571
$$ plain form
8950 1327652 1616022 1760883 1697618 1482052 1194543 935279 703607 528796 417505 322815
8940 322815 297571 252224 212157 177317 159735 149887 158415 153744 131378 107397 97707 94484 96744
8927 96744 86089 82568 99918 102620 71986 86935 87587 84688 47365 51313 68162 96254 126484
8914 126484 165963 153972 166158 200683 217383 272458 360897 445756 559573 671966 747237
8903 747237 785285 714519 564402 441656 304709 213568 161174 89487 57729 38344 28214
8892 28214 44721 43883 25551 27208 27973 21279 21767 26803 20146 29178 33565 9283 3963 -14188
8878 -14188 12077 12201 -2179 4661 14894 49271 72292 66345 48938 71904 103059 90250 60214
8865 60214 52896 79657 44182 34394 34028 42592 44677 55703 75695 109918 129850 121389 141960
8852A41960J3740j7938l8534k466L8024j7859k4212l2007l9054j6038J7931R558
8840C3105K1345l013l9243L596r441q18j0878k0090L409j0463l556O182j3338
8827d3203M0696R176J544J8265P326l6175l1385J9332P816J263K2480K9668J5146
8814F1949n103K2957L569J6591M4503K3797K5211K1039K211l0877j1579k498l079
8801A68691l2479m1961l4390k8366j407n836K003N6898J1177J0306k441k6993
8789G5202j8644j5684Q098L256J1582j595K1429K613j9464l8442K531Q085j4676
8776B4291o06J0666L7211Q109q983q690J8929P337k2789k6443J542J6992L0175
8763H7741N2650L1125j9168k5225N655k5999j9260J5042P06K170j318J5991J2341
$$ plain form
8852 141960 155700 137762 99228 96762 134786 116927 92715 60708 21654 5616 23547 33105
8840 33105 54450 51437 12194 15790 6349 5531 -5347 -25437 -22028 -32491 -36047 -29865 -43203
8827 -43203 -2507 6669 8213 26478 33804 -2371 -33756 -14424 -6608 -5345 17135 46803 61949
8814 61949 56846 79803 83372 99963 144466 168263 193474 214513 216724 185847 174268 171770 168691
8801 168691 136212 94251 59861 31495 30088 24252 26255 83153 94330 104636 102195 75202
8789 75202 56558 40874 48972 52228 63810 62215 83644 86257 66793 28351 30882 38967 24291
8776 24291 23685 34351 71562 79671 70688 61998 80927 88264 65475 39032 40574 57566 87741
8763 87741 140391 171516 152348 127123 132778 106779 87519 102561 103267 105437 104119 120110 132451
8750A32451J676L1805j0300o1062n9791k8422q733q426K5921N3581K3167J9396
8738A11263L525k3378k0468k3475l416K6757J3651n003m807k8785J328M0818M4341
8725A32351N3028P9581R6595P4598J972n9500o9207p8113m4514q823j1258m733
8713A61977J9654M1657L4399P3235P4892J00872J34396J80668J72186J24575J5799
8702A134310j26933j71140j68251j62561j19995m6888k8232k1562k2406k8665
8692B37677r057p738j6801k2381k20J8554O984l917N06l718R274O9117J31438
8679D09718K39491K61503J18136j06549j42988j24174r8766n7584n358L2334K3956
8668E49719j6094L2342O0023N9053R4391J56504K40573K77179L27475L08487J78750
$$ plain form
8750 132451 134127 165932 155632 94570 34779 6357 -2376 -10802 15119 68700 91867 111263
8738 111263 114788 91410 70942 47467 44051 70808 84459 79456 74649 45864 47192 88010 132351
8725 132351 185379 264960 361555 436153 438125 378625 309418 231305 186791 177968 166710 161977
8713 161977 181631 223288 257687 330922 405814 506686 641082 821750 993936 1118511 1134310
8702 1134310 1007377 836237 667986 505425 385430 338542 310310 288748 266342 237677
8692 237677 228620 220882 204081 181700 181480 200034 207018 203101 203607 199889 209163 278280 409718
8679 409718 649209 910712 1028848 922299 779311 655137 556371 498787 493429 525763 549719
8668 549719 533625 565967 625990 685043 779434 935938 1176511 1453690 1781165 2089652 2268402
8657B268402l643j80373l24042l13152k49723k03902j35045q7725m0010l9983
8647F90804l107J6100J9574M0468q526R803K1743L5847K9861K9584L4538O6326
8635I83015J28665J66637J80502R2776L992N599J2386J1139O7895R2198J36914
8624A881718J11886J42527J66450J91092K47640K75041L39091M09503N08445O02246
8614D875639O32514P29421Q22343Q91229R73300J123069J316296J551206J852850
8605A4767867K412702L240419M417982O362084R406777J3933121J9765202K5095155
8597I9401309K6818855K1960634R779940o195652j9465339k5453840k4481494
8590H2364413j9921293j4717821j0447484p355900n278831l869728k874021k146027
$$ plain form
8657 2268402 2264759 2084386 1760344 1447192 1197469 993567 858522 770797 730787 690804
8647 690804 687697 703797 723371 763839 755313 765116 786859 822706 852567 882151 916689 983015
8635 983015 1111680 1278317 1458819 1551595 1555587 1561186 1573572 1584711 1652606 1744804 1881718
8624 1881718 1993604 2136131 2302581 2493673 2741313 3016354 3355445 3764948 4273393 4875639
8614 4875639 5508153 6237574 7059917 7951146 8924446 10047515 11363811 12915017 14767867
8605 14767867 17180569 20420988 24838970 31201054 40607831 54540952 74306154 99401309
8597 99401309 126220164 148180798 157960738 151765086 132299747 106845907 82364413
8590 82364413 62443120 47725299 37277815 29921915 24643084 20773356 17899335 15753308
8582A5753308j607255j218824r67980p77799n93988m54952k85091j44336J1899
8573I714982J57095L00226M23676N75454P69100R72403J229567J558607J959159
8564A7660269K326159K720828L150318L706047M568229N955124Q239472J1931564
8556F0258010J7969343K7401906M0479371N3348713N8052872M7536205J9701698
8549C24748118j6888489m5514298n6149385n1402327m0145086k8794691j9984840
8542F5869002j3941705r963652p350191n493414m151963l119089k434261j998951
8534A7415776j666355j441507j229362j034207p93121n57952l77224k44071j29366
8525I942611K6856K17170K97947L51980N87456Q06724J032185J293945J556490
$$ plain form
8582 15753308 14146053 12927229 11959249 11181450 10587462 10132510 9847419 9703083 9714982
8573 9714982 9872077 10172303 10595979 11171433 11940533 12912936 14142503 15701110 17660269
8564 17660269 19986428 22707256 25857574 29563621 34131850 40086974 48326446 60258010
8556 60258010 78227353 105629259 146108630 199457343 257510215 305046420 324748118
8549 324748118 307859629 262345331 206195946 154793619 114648533 85853842 65869002
8542 65869002 51927297 41963645 34613454 29120040 24968077 21848988 19414727 17415776
8534 17415776 15749421 14307914 13078552 12044345 11251224 10693272 10316048 10071977 9942611
8525 9942611 9969467 10186637 10484584 10836564 11424020 12230744 13262929 14556874 16113364
8516A6113364J885041K321405L045907M177640O007625Q768646J2857645J8210980
8508G3388253K3316515K5107008K0651028R158198o290718j9294755k5104298
8501A00931231k4059927j9410311j4288932j0033389p046074n064462l776677
8494A7251459k847172k141603j694716j330243j087233r41339q10477p12192o10610
8485E075874n11098m19010l24021k73890k69270k24318j88225j90936j77472j48914
8475B348720j03957r3439n4348o7167n2295l7306l3910j07251j07230j04785r1598
8464A495434o8627m429J4905l9327n4143o1381k8878k3019k2935k3844j1346L2144
8452A204554R646j0567o2296q5114o5251o8229j87k0891o4000m9182j1387K412
$$ plain form
8516 16113364 17998405 20319810 23365717 27543357 33550982 42319628 55177273 73388253
8508 73388253 96704768 121811776 142462804 151621002 145330284 126035529 100931231
8501 100931231 76871304 57460993 43172061 33138672 26092598 21028136 17251459
8494 17251459 14404287 12262684 10567968 9237725 8150492 7209153 6398676 5686484 5075874
8485 5075874 4564776 4145766 3821745 3547855 3278585 3054267 2866042 2675106 2497634 2348720
8475 2348720 2244763 2151324 2096976 2029809 1977514 1940208 1906298 1799047 1691817 1587032 1495434
8464 1495434 1426807 1422378 1437283 1397956 1343813 1282432 1253554 1230535 1207600 1183756 1172410 1204554
8452 1204554 1214200 1203633 1141337 1056223 990972 922743 922556 901665 837665 788483 777096 779508
8440G79508j2425Q577l19k8528o9341k0655m4355K569K6336Q128J9413K1646K1676
8427G12230N6730R1949Q2522L3495l8840q5827q7169k7804m8310l9582j5727l08
8415F33359k6489o0988l0359l9417k6545l549j8031M217J0992j9576l042J1312
8403D31884J6585n844m893j6775k3330k2621j4302l613k0475J1976j1383k6446
8391C10763k3208j0164K0758M560J7631J5547j714o75K3285L9693L0053N2110
8379D78639M3407j6279l8776l1068m2067k4001J748j9201n997j8603L85j1020
8367C17167k1507k6131k2522M077k4167N190K4616J8348K6934M6514o164m036
8355C38319J237l2238m9709k6039l058J0273k0632k9403J1733M1062M0935j6015
$$ plain form
8440 779508 767083 775660 775341 746813 677472 656817 612462 615031 641367 649495 668908 690554 712230
8427 712230 768960 860909 943431 976926 938086 852259 765090 737286 688976 649394 633667 633359
8415 633359 606870 545882 515523 476106 449561 446012 427981 432198 443190 423614 420572 431884
8403 431884 448469 442625 437732 420957 397627 375006 360704 357091 336616 348592 337209 310763
8391 310763 287555 277391 298149 302709 320340 335887 334173 333498 356783 396476 426529 478639
8379 478639 522046 505767 466991 435923 393856 369855 371603 352402 346405 327802 328187 317167
8367 317167 295660 269529 247007 251084 226917 232107 256723 275071 302005 348519 342355 338319
8355 338319 339556 307318 257609 231570 228512 238785 218153 188750 200483 241545 282480 266465
8343B66465L572K789k1972j2622K0757r141m2496j0071j1438j5698K660K5806
8331A98611q101O66J1084j6024j945l084J0037o225j1075j198J0779r463j533
8318A72529j9236J6434J6107K695P033J1576j0627p677j9756Q63l2157K678J0243
8305A50705R849J3808J3598J2706M992O133L460j2308k7284l227r543r098j3627
8292A40164P134k2076j2004J8784J6226K718J6839j0424k5056j3732n570J7566
8280A30569K0698J6157k3189n236J9717r776P909k414k0090J0665L220l7419k5635
8267H5176P873N381n089j2003k088k012L496J2582l247K4673J9818k4348K6728
8254A36940L5002n531l7195l1880k093M2530N444l2674m2595N236L7057L3279
$$ plain form
8343 266465 270037 272826 250854 238232 258989 249848 207352 197281 185843 170145 172805 198611
8331 198611 190510 191176 202260 186236 184291 181207 191244 185019 173944 172746 183525 174062 172529
8318 172529 153293 169727 185834 188529 195562 207138 196511 188834 169078 169941 137784 140462 150705
8305 150705 160554 174362 187960 200666 205658 211791 215251 202943 175659 172432 162889 153791 140164
8292 140164 147298 125222 113218 132002 148228 150946 167785 157361 132305 118573 113003 130569
8280 130569 151267 167424 144235 138999 158716 148940 156849 154435 134345 145010 148230 110811 85176
8267 85176 93049 98430 93341 81338 79250 77238 80734 93316 90069 114742 134560 110212 136940
8254 136940 171942 166411 129216 97336 95243 137773 143217 110543 67948 73184 110241 143520
8242A43520n482r030P307N78Q991N164N027K7675n686j7957l5551k0892o967R87
8228I7684j1102m0344Q084q186P199J2288J8654J0603j4824m177J8759L6948n3
8215A31533j645m09k6191j4995L3151J1873q996L2158K3581O552M977J0450P989
8202B10028k6913L563J4158L2940M9856K4005L8214O0554J49127J95025J55533
8191I06090M9936j6570o1958j38828j30038j18147r2377p3606n5303m8968l1599
8180A88632k7213o810j6822k2704j9550K0585J4191Q516K008j5620j1757j822
8168A11634N564P665l6250j6194K304K5051L5912K4775K7978J8336K6591L2226
8156B65592L2892K0928R781L6031R1792J27897J66771K06190K97215L15820J87123
$$ plain form
8242 143520 138038 129008 136315 136893 145884 151048 156075 183750 178064 160107 124556 103664 96697 97684
8228 97684 86582 46238 54322 46136 53335 65623 84277 94880 80056 75879 94638 131586 131533
8215 131533 129888 129479 103288 88293 121444 133317 124321 156479 180060 186612 191589 202039 210028
8202 210028 183115 186678 200836 233776 283632 307637 345851 406405 555532 750557 906090
8191 906090 956026 939456 877498 738670 608632 490485 398108 324502 269199 220231 188632
8180 188632 161419 154609 137787 115083 95533 116118 130309 138825 140833 125213 113456 111634
8168 111634 117198 124863 88613 72419 74723 99774 135686 160461 188439 206775 233366 265592
8156 265592 298484 319412 329193 365224 457016 584913 751684 957874 1255089 1570909 1758032
8145A758032j887j89955k95304k86587k40773j94763r8532m2761p8092l9739j6418
8134B73221k1731m2672o1905k5969K2441J5663j4272J6054j140O815l5121o220
8122A25164L777K8509J1587j5806m516k3132l0690J422N628N104K1223M5762L0974
8109B05006n6l434L1594O5430J08232R4021J33549J45727Q6569m0056q7932j14044
8097F24606j45266j19967r4957l0804k4964m1149l9204k981K1603l4450l1546
8086H0921m137J8312k3714P89k411j804j7830k305J4661L5963K6496M185k4060
8073A05066k2266j2186L54j3451j8473l471J3964K1324J697K2060j0887k8428
8061E5303k4654P0J6000L378j3688j3557K4757M19j858p105k0584J2656J2313
$$ plain form
8145 1758032 1756145 1566190 1270886 984299 743526 548763 450231 407470 329378 289639 273221
8134 273221 251490 208818 146913 120944 143385 159048 144776 160830 159690 166505 131384 125164
8122 125164 128941 157450 169037 153231 148715 125583 94893 96315 101943 107047 128270 174032 205006
8109 205006 204950 201516 233110 298540 406772 500793 634342 780069 866638 826582 738650 624606
8097 624606 479340 359373 264416 233612 208648 167499 128295 125314 146917 112467 80921
8086 80921 76784 95096 71382 72171 69760 67956 50126 47821 62482 98445 124941 129126 105066
8073 105066 82800 70614 70968 57517 39044 35573 49537 70861 72558 94618 83731 55303
8061 55303 30649 30719 46719 50097 36409 22852 47609 48028 46170 39065 18481 31137 43450
8048D3450K0j391J21M872j6476j0355J9582N799k5804k2215J4444p183L6687p95
8034D0756l175J9886K337Q933L6657L565j4863j540J804j6089p253P966j8381
8021F0603j3605m020K5459P301l872k4068L361K8247M624j4525r118l5860k8640
8008d113O860K1194Q760J4054L0239J0878Q184j0508l835k4913m4923n715N9339
7995F5501m603k7214P794M997k4114j5941j1784L64J0787J0606M398j8784K759
7982D766J4245L1765J9353Q983P224j2528n866k1735j665N643j35J2276r228k1332
7968C1766J971J6614j3117j7679N264K5826k133j06j1628j2937L3760O496k569
7955F1528L202k147o23Q886n1J4517m502m0132j9485k3806k4164J2484k769J3585
$$ plain form
8048 43450 43470 42079 42200 47072 30596 20241 39823 45622 19818 -2397 12047 4864 41551 40756
8034 40756 37581 57467 59804 68737 105394 108959 94096 92556 94360 78271 71018 78984 60603
8021 60603 46998 42978 68437 75738 71866 47798 51159 79406 84030 69505 60387 24527 -4113
8008 -4113 2747 23941 32701 46755 76994 87872 96056 85548 81713 56800 11877 6162 65501
7995 65501 60898 33684 41478 46475 22361 6420 -5364 -5000 5787 16393 20791 2007 4766
7982 4766 19011 50776 70129 79112 86336 73808 67942 46207 44542 50185 50050 62326 53098 31766
7968 31766 33737 50351 37234 19555 24819 50645 48512 48406 36778 23841 57601 64097 61528
7955 61528 64730 62583 61960 70846 70795 85312 80810 40678 21193 -2613 -26777 -14293 -17062 -3477
7941c477L4287L1249N707r235j2006j7986l812N378J497j403J021J1710O011k7143
7927B1798l162q362J8434N414O108j1738P241K2339P041q02P529q520k3898J814
7913D1236k027K1631P593j5695J7931q856M979N515J611O32j1843j2572l025K7984
7899G5094j340j7006o17J6548j1291K3036L988J2787K8665M013l5731n3265p686
7886C7195j1783Q144O8L483K6408K1409n839k2183o958P474K3072j1825l4744
7873C3921k226J5783O395k1369j2119K3083K0573j6219p32j906k27K2760J1586
7860G9303k9944k5272j1094Q69L4577J8089l674j0434J5756K9763k9303k7982
7848D0654j6296J8340R58K236k1970R876j3014R533J6123j0984j715q278J3950
$$ plain form
7941 -3477 30810 62059 67766 58531 46525 28539 24727 30105 31602 30199 31220 42930 48941 21798
7927 21798 18636 10274 28708 34122 40230 28492 35733 58072 65113 64311 71840 63320 39422 41236
7913 41236 39209 60840 68433 52738 70669 61813 66792 72307 73918 74550 62707 50135 47110 75094
7899 75094 73754 56748 56131 72679 61388 84424 88412 101199 129864 133877 98146 44881 37195
7886 37195 25412 33556 33624 37107 63515 84924 79085 56902 49944 57418 80490 68665 33921
7873 33921 31695 47478 53873 32504 20385 43468 64041 47822 47090 45184 44957 67717 79303
7860 79303 49359 24087 12993 13862 48439 66528 62854 52420 68176 97939 68636 40654
7848 40654 24358 42698 43656 45892 23922 33798 20784 30317 46440 35456 33741 25463 39413
7835C9413M2169k3533l6266j2985l520J7523J6521k5852k6975j5978k2753L447
7823d8789K8498J9736K513K3248M1369K5646j1499l6332l3970r367K7728K1982
7811E0763N011k4351l3513k7007Q114M2954K767k703K6849k3021j2352n402O640
7798A4749K3560L4219Q180j9643j7682n023k5283j3256l855Q631J086m224K2756
7785B4215P622j7869k431J7636k67m059J2813K691N959k9605l0337j3103J045
7772b5690M2404K2123m263k706k1299J87K663J769k0516k4035J4134M7162J9425
7759E1358j2292m855p703M071K8890L190r659j8387j0569l3889j2412m42J5893
7746f806K6409j0502k5242N969K6477K3505Q197Q210m832J5011k2877m6517n637
$$ plain form
7835 39413 81582 58049 21783 8798 5278 22801 39322 13470 -13505 -29483 -52236 -48789
7823 -48789 -20291 -555 1958 25206 66575 92221 80722 44390 10420 1053 28781 50763
7811 50763 55774 31423 -2090 -29097 -20983 21971 24738 22035 48884 25863 13511 8109 14749
7798 14749 38309 72528 80708 61065 43383 38360 13077 -179 -4034 4597 5683 1459 24215
7785 24215 31837 13968 11537 29173 28906 24847 37660 40351 46310 16705 -13632 -26735 -25690
7772 -25690 16714 38837 34574 31868 10569 10756 13419 15188 -5328 -29363 -15229 31933 51358
7759 51358 39066 34211 26508 30579 59469 62659 53000 34613 24044 -9845 -22257 -22699 -6806
7746 -6806 19603 9101 -16141 -10172 16305 39810 48007 56217 51385 66396 43519 -2998 -8635
7733h635K011o726J402q203k027L8587J2485r23n189J6688k7540k7769l5831o210
7719e7880L0609M2004L2307j4821K258J6822k7164l6853J4270M165k218N872K42
7706I613q151n553r857N460j278j2596k0145J8689r871j21J2225K6393K8805j1754
7692B1859O215K1153j3158j919k0355j6713k7561J324K8635M3867J8127p137j5322
7679C9015j0226l1306k8284R603J7096J4730K0346K0424J7594j4805m5445j1600
7667b858m39K7833K4397k8306J3651l4J009R96l6940J0597K0197O713j2686k3239
7653H91o298K5876J1992L706O790m8999j8265J6157J8150J9228r969j5635K270
7640E894M26N907K1114L1508k2622k4155j3464k558K1073K8907J3929M356n561
$$ plain form
7733 -8635 -6624 -13350 -11948 -20151 -22178 16409 28894 27971 22782 39470 11930 -15839 -51670 -57880
7719 -57880 -27271 14733 47040 32219 34477 51299 24135 -12718 1552 5717 3499 9371 9613
7706 9613 1462 -4091 -13948 -8488 -9766 -22362 -42507 -23818 -33689 -33810 -21585 4808 33613 21859
7692 21859 28074 49227 36069 34150 13795 -2918 -30479 -29155 -520 43347 61474 54337 39015
7679 39015 28789 -2517 -30801 -21198 -4102 10628 30974 51398 68992 54187 8742 -2858
7667 -2858 -3297 24536 48933 20627 34278 34244 35253 36249 -691 9906 30103 36816 24130 891
7653 891 -5407 20469 32461 36167 42957 -6042 -24307 -8150 10000 29228 19259 3624 5894
7640 5894 6320 12227 33341 64849 42227 18072 4608 2050 23123 52030 65959 70315 64754
7627F4754J0800o854k3209N196j8659J5418m145j4187k908q306j3961p190J8153
7614A4902k673P901M754j3131l5789N206n056J9474M1377J0010k3213j7156K810
7601I416k098P155m3748k8929L6287L064k80L2293J6327K113k7007k9917k359
7588b7683J8688N576N234j4303K5784R910J4743J7820k2198l4214k323J4286K1046
7575C2366k3676m499J8745P337J5488k2875j025N223m09l2121M02k672j3919l6
7561b1671K1899k8211l847K3861l2001l021N912l525M4086J1815J4841J1034j0123
7548C1049J58k5081q908J6638Q726M1301p23m2727l8157j5749J3608J5295M178
7535c92r290n064m776M4839K4281l634o758r610m322p985k437l8222K755L3626
$$ plain form
7627 64754 75554 68700 45491 50687 32028 47446 43301 29114 26206 17900 3939 -3251 14902
7614 14902 12229 20130 24884 11753 -24036 -18830 -23886 -4412 36965 46975 23762 6606 9416
7601 9416 7318 14473 -29275 -58204 -21917 -18853 -19133 13160 29487 31600 4593 -25324 -27683
7588 -27683 -8995 -3419 1815 -12488 13296 23206 37949 55769 33571 -643 -2966 11320 32366
7575 32366 8690 4191 22936 30273 45761 22886 21861 27084 26675 -5446 -5044 -7716 -21635 -21671
7561 -21671 228 -27983 -31830 -7969 -39970 -42991 -37079 -40604 3482 15297 30138 41172 31049
7548 31049 31207 6126 -2782 13856 22582 63883 63160 20433 -17724 -33473 -19865 -4570 -392
7535 -392 -9682 -14746 -19522 25317 49598 45964 39206 29596 25274 17289 14852 -23370 -20615 13011
7521A3011J0360j0176L470j6607j5437N247J3645m710J3107Q508n440j9563j9570
7508b4155Q921n016J4001Q722j3404L0118J3804k398k6704k3647m72K3459J6533
7495A9762J0633j9446k1302K7998L755l1825O962J9911j3127k1100O281J1905
7483D07O854l859j001N264K2612K5508N712p177l900j664k1753j136o192N002
7469B4677J3750k9717q626j5360J5738K3616j1897m498K2350K682k2447q948K0535
7456B1855K057m0708K75M0414K0560K1046j733o877j6475j1453m0172k3209j4976
7443d9396n930j4444L2209K1320K2233Q740k4165l0537J144R414R507l48p034
7430b7287k3078k7455L7124K1213J511j8066J4839J5576j1960j0679R541P617
$$ plain form
7521 13011 23371 13195 16665 58 -15379 -10132 3513 -1197 11910 20418 14978 -4585 -24155
7508 -24155 -15234 -20250 -6249 2473 -10931 19187 32991 30593 3889 -19758 -20230 3229 19762
7495 19762 30395 10949 -10353 17645 21400 -10425 -3463 16448 3321 -17779 -11498 407
7483 407 7261 3402 2401 7665 30277 55785 61497 54320 50420 48756 27003 25867 19675 24677
7469 24677 38427 8710 84 -15276 462 24078 12181 7683 30033 32715 10268 1320 21855
7456 21855 23912 -16796 -16521 23893 44453 65499 63766 56889 40414 28961 -11211 -34420 -49396
7443 -49396 -55326 -69770 -37561 -16241 5992 14732 -9433 -39970 -38826 -29412 -19905 -20253 -27287
7430 -27287 -50365 -77820 -40696 -19483 -17972 -36038 -21199 -5623 -17583 -28262 -18721 -11104
7418a1104r458J7956J1557J4415R265o921o627q386k9730l228q13k452L115J6766
7404e645o236O4J7857K4268m359o624J1754J2990j4910j1702Q252k2072q939K2156
7390A6854k96O047N648J2735J5618j5876k4026nj5456l7575j7686q431L1017K3325
7376h107K5014M024k7841k71J3048K438J8919K1073l4082k1582r411K6331L2334
7363D1887n981n061J1585n31j0380j0949k170k3578l1432M265K7538J362n732
7350i177J147l88j8270k6373n322J5848l063L5297n884q767j9760j4903l455L7533
7336b5537K177K2950K5861k1981j5305j1168K2665K2757R048m473M454K9244K4447
7323H5139j6997j6619m8723l2336k73J8320k539j4075P213L0882N024l8731O035
$$ plain form
7418 -11104 -20562 -2606 8951 23366 32631 25710 19083 10697 -19033 -22261 -23074 -25526 -22411 -5645
7404 -5645 -11881 -11817 6040 30308 25949 19325 31079 44069 29159 17457 25709 3637 -5302 16854
7390 16854 16558 22605 28253 40988 56606 40730 16704 16699 1243 -36332 -54018 -62449 -31432 -8107
7376 -8107 16907 20931 -6910 -7181 5867 8305 27224 48297 14215 -7367 -16778 9553 41887
7363 41887 35906 30845 42430 41899 31519 20570 18400 -5178 -36610 -32345 -4807 -3445 -9177
7350 -9177 -8030 -8418 -26688 -53061 -58383 -42535 -45598 -10301 -16185 -24952 -44712 -59615 -63070 -25537
7336 -25537 -23360 -410 25451 3470 -11835 -23003 -338 22419 31467 26994 31448 60692 85139
7323 85139 68142 51523 2800 -29536 -29809 -11489 -14028 -28103 -20890 9992 15016 -23715 -17680
7310a7680O243j4262K7274L0138P143k1200p741R497k4032n32l610j4749j2600
7297c6111M277M146L869K6420J7443O998p903K386J4948J0352P001l606l6487
7284A3733m0862J2489P749J5311k64J4360J6398O868M554j3504l0242k0364O007
7271g767J8516m516j2389o701J3107J3162N29j749K5909j7977J3412J0956k0010
7258B4482l755o178p046J5473J7498l948M763Q527j8202j8675l1338j8342L4619
7245b122J816p772K6687J9737k3185J2357r212k000m450k817p482J3323J6935
7232C1815k6585n2209j384J4301K6842K9413k2954o481L446k0667p156P669J3191
7219a0759Q516j0506j5313j932j8992O971J9075P938l0612K2112L516L267m219
$$ plain form
7310 -17680 -11437 -25699 1575 31713 38856 17656 9915 19412 -4620 -5152 -8762 -23511 -36111
7297 -36111 -31834 -27688 -23819 2601 20044 27042 19139 21525 36473 46825 53826 50220 13733
7284 13733 -27129 -14640 -6891 8420 8156 22516 38914 45782 50336 36832 6590 -13774 -7767
7271 -7767 10749 6233 -6156 -12857 250 13412 13941 12192 38101 20124 33536 44492 24482
7258 24482 20727 14549 7503 22976 40474 36526 41289 49816 31614 12939 -18399 -36741 -2122
7245 -2122 -306 -8078 18609 38346 15161 27518 18306 16306 11856 9039 1557 14880 31815
7232 31815 5230 -46979 -48363 -34062 -7220 22193 -761 -7242 -3796 -24463 -31619 -23950 -10759
7219 -10759 -2243 -12749 -28062 -29994 -48986 -42015 -22940 -15002 -45614 -23502 -19986 -16719 -20938
7206b0938l1083R903J0048K2618q402J6773K7780n437j2120j7999j4632J3044
7194a0445l633J1837O869m985R038j7468K230J5081J6510r025j0507J4732j0210
7181A0024L787O332j485q336P116q208M374k4581J557J5487R412J8455j1994O739
7167B8679q164J1814j2249k369O884j8167N42j9489k1023K2196J2987q258J6183
7154I566J9300p717j2870o150J23l0569J461J0372J1370K371K630J7996J7565
7141C5448P202k2913l2226k189K850L4216J0541K3977j4121l0025l5301k6828
7129d9369K4475K4216K1309j7534k8942J04K3597K0927j509R881K6179p571m4874
7116H89K661L7892L797l0619k0225R790r995N963m328J8542J1813K989j0604K54
$$ plain form
7206 -20938 -52021 -42118 -32070 -9452 -17854 -1081 26699 21262 9142 -8857 -23489 -10445
7194 -10445 -14078 -2241 4628 -357 8681 -8787 -6557 8524 25034 16009 5502 20234 10024
7181 10024 13811 20143 18658 10322 17438 9230 13604 -10977 -9420 6067 15479 33934 21940 28679
7167 28679 20515 32329 20080 17711 24595 6428 6970 -12519 -33542 -11346 1641 -6617 9566
7154 9566 28866 21149 8279 2129 2252 -28317 -26856 -16484 -5114 -2743 -113 17883 35448
7141 35448 42650 19737 -12489 -14678 -11828 22388 32929 56906 42785 12760 -22541 -49369
7129 -49369 -24894 -678 20631 3097 -25845 -25741 -2144 18783 17274 27155 53334 45763 889
7116 889 3550 41442 45239 14620 -5605 4185 -5810 153 -4175 14367 26180 29169 18565 18819
7102A8819k1738l232P145j2810j092O037J1724J7431j1313n984k0972n929J7508
7089d406K094j5018J4374r8j0331R074J3944J6275M202p03M062k723j4883l19
7075A5544J9321n869j9318J1815L322k6531N85K7158J6225k9791r384P44j5819
7062a1998J4078L3936N234M050k0571k0562p384k1963j638K4043K3896K374M220
7049B7715l935K4704l358j9805l6958l2449k5809N669L5151K510P372j0279J7003
7036a2469O442J285Q099J5027J0042j3642r131l023K3898k598j1388j3935N255
7023C862M008j1095k1370m611M5057Q893j1048n783J5682m857j5320J5010O444
7010B4872Q216k0574k8724J1776M9382M848j6465k6629Q280j1970q74O412Q808
$$ plain form
7102 18819 -2919 -6151 994 -11816 -12908 -6871 4853 22284 10971 4987 -15985 -21914 -4406
7089 -4406 -2312 -17330 -2956 -3054 -13385 -4311 9633 25908 30110 29407 33469 30746 15863 15544
7075 15544 34865 28996 9678 21493 24815 -1716 -1131 26027 42252 12461 3077 3821 -11998
7062 -11998 2080 36016 41250 45300 24729 4167 -3217 -25180 -26818 -2775 21121 23495 27715
7049 27715 23780 48484 45126 25321 -11637 -44086 -69895 -64226 -29075 -26565 -19193 -29472 -12469
7036 -12469 -6027 -4742 3357 18384 28426 14784 5653 2630 26528 23930 12542 -1393 3862
7023 3862 7870 -3225 -24595 -29206 15851 24744 13696 7913 23595 18738 3418 18428 24872
7010 24872 33088 12514 -16210 -4434 44948 49796 33331 6702 14982 3012 2138 8550 17358
6997A7358O721K279j5811k753l1874l4982l792J4485Q031K2556q095n523J6286
6984a5114K2253J6110q934K0480k5288k7851J3508j5636L1180J4779j1162k9892
6972a5567J2847J2261j4625l826j9897j9705J2110J5208K6304k0627l4333j2433
6960f2283J7756J8301J2282J7892J1632j3378K9700L838j6913j8745k5919L241
6948b2596k496L321J3844p85M393J1244L1545k0887l3677k4090m471K2421o606
6935b8840J3051L644j019J6881r945M191P558K5154K7146J2938n393j6032m5303
6922D031l8950N765p077n303J2325J8991R017L191j6447o804j9238K0169m29k0516
6908d1275K7789j3526r397N505j6118m762K292l517J1222J0070j1027K4060L0345
$$ plain form
6997 17358 24079 26358 10547 7794 -24080 -59062 -62854 -48369 -40338 -17782 -25877 -31400 -15114
6984 -15114 7139 23249 14315 34795 9507 -18344 -4836 -20472 10708 25487 14325 -15567
6972 -15567 -2720 9541 -5084 -8910 -28807 -48512 -36402 -21194 5110 -15517 -49850 -62283
6960 -62283 -44527 -26226 -13944 3948 15580 2202 31902 35740 18827 82 -25837 -22596
6948 -22596 -25092 -21771 -7927 -8712 -4319 6925 38470 17583 -16094 -40184 -44655 -22234 -28840
6935 -28840 -15789 -12145 -13164 3717 -6228 -2037 5521 30675 57821 70759 65366 49334 4031
6922 4031 -34919 -29154 -36231 -41534 -29209 -10218 -1201 1990 -14457 -21261 -40499 -20330 -20759 -41275
6908 -41275 -13486 -27012 -36409 -30904 -47022 -51784 -49492 -53009 -41787 -31717 -42744 -18684 11661
6895A1661J1324J729j5942j1569P521K9981r327l1047l8484M980P819J4634N040
6882a1680P275l0215k3509R967L5960o281p10N770K5918j5225j6879p07L776q887
6868b5427j76k0646k1571J0995K4188P172J9574K2857K1596m798l0855j8954J5478
6855e67o776j3666j5649l6042R162K7996K5239j261j0706M396K0103j834R879
6842A0274L02O25l0493K687J8168J7037K374j6825m174j894j0945R80M985N492
6828a407r385k625N258J7684R840K5209R22J1960j9894j0732j1807O474O625O095
6814C4217J0439J33M3330J6889l7398k9219M915j9364j1567J6078K1286n672K053
6801D6120j6998j3909K4970j2919l1179l229O49K5667K6361j9152J246P536l5571
$$ plain form
6895 11661 22985 24714 8772 -2797 4724 34705 25378 -5669 -44153 -39173 -31354 -16720 -11680
6882 -11680 -4405 -34620 -58129 -48162 -12202 -18483 -19193 -13423 12495 -2730 -19609 -20316 -16540 -25427
6868 -25427 -25603 -46249 -67820 -56825 -32637 -25465 -5891 16966 38562 33764 2909 -16045 -567
6855 -567 -7343 -21009 -36658 -72700 -63538 -35542 -10303 -11564 -22270 -17874 2229 395 10274
6842 10274 10576 11201 -19292 -16605 1563 18600 20974 4149 -25 -1919 -12864 -11884 -6899 -1407
6828 -1407 -10792 -13417 -8159 9525 19365 44574 45496 57456 37562 26830 15023 21497 28122 34217
6814 34217 44656 44789 88119 105008 67610 38391 43306 23942 12375 28453 49739 44067 46120
6801 46120 29122 15213 40183 27264 -3915 -7144 -6495 19172 45533 26381 27627 35163 -408
6788d08J656K7839k4600r841K0036J516j9095L4411o68j0709l4904O310M4231
6775C5774M6866j8582k6935j3249k5693q195M5527K9017n269k5564q328j5636
6763I733N403J6730j5620j7658J6548M6358K958P457n23j309O315J7895n512J5207
6749A03982M205q881k1632j4600j5975J4354J7842O1842M1541K0469M3784L0126
6737B77057K6452J0920J331K4251k5854l3305k8368n041J1520j209J9462M2398
6725C19614M1745P264K3692O3613J04231J45791K07060K86801L72670N51996Q40147
6714B964624J103789J218389J049795M23147m25128j120303j306973j121138q44841
6705A941361n80510l78393k35617j59082j27974q2660p0449n5238j0017K2521
$$ plain form
6788 -408 1248 29087 4487 -5354 14682 16198 -2897 31514 30846 20137 -14767 -8457 35774
6775 35774 82640 64058 37123 23874 -1819 -10014 35513 64530 59261 33697 25369 9733
6763 9733 15136 31866 16246 -1412 15136 61494 64452 71909 71386 70077 76392 94287 88775 103982
6749 103982 108187 99306 77674 63074 47099 61453 79295 141137 182678 203147 246931 277057
6737 277057 303509 314429 315760 340011 314157 280852 252484 247443 258963 257754 277216 319614
6725 319614 361359 368623 392315 455928 560159 705950 913010 1199811 1572481 2124477 2964624
6714 2964624 4068413 5286802 6336597 6759744 6334616 5214313 3907340 2786202 1941361
6705 1941361 1360851 982458 746841 587759 459785 377125 306676 251438 241421 263942
6695B63942j2387m2227k6951L133m502R751L6384K3813j9245k4507m1143j7788
6683A48273l9183l0431o101R766J127J7335j80r740k2648J7159J4680M854k4013
6670H0898l4350r698K0042n23J9121Q769k2810J2666j4985j9328J2769k3033l8214
6657h676n836M6467J3136k1463N051j0234l6166K586K1029j301l3780N45J9679
6644h963K0310O154k2143o119l521l26J4525q373K334O367Q232N446J2642j972
6630B4593k4876L968k3445O926J7317M998J3332j426K754O645k5795M1J3088Q659
6616B6779K2743q942l447k2228m3328L390K6335j845K722p261j1514j9130K0078
6603a5648M249o156K8879k841O171l972L2938q737n1557k2872L2113m094q619
$$ plain form
6695 263942 251555 209328 182377 185510 181008 190759 227143 250956 231711 207204 166061 148273
6683 148273 109090 78659 72558 82324 83451 100786 100606 90866 68218 85377 100057 104911 80898
6670 80898 46548 36850 56892 56369 75490 84259 61449 74115 59130 39802 52571 29538 -8676
6657 -8676 -14512 31955 45091 23628 28679 18445 -17721 -15135 5894 4593 -29187 -28642 -8963
6644 -8963 11347 17501 -4642 -10761 -14282 -14608 -83 -8456 -6122 245 8477 13923 26565 24593
6630 24593 -283 3685 -19760 -12834 4483 9481 22813 21387 24141 30786 4991 5032 18120 26779
6616 26779 49522 40580 37133 14905 -28423 -25033 1302 -543 2179 -5082 -16596 -35726 -15648
6603 -15648 -11399 -17555 11324 8483 14654 10682 43620 34883 -16674 -39546 -7433 -11527 -20146
6590b0146K6337K2715J4092l6446j6979L455K9443M4920Q762j7838N082J6860
6578H0257l1325j2028L3N795l6984l0401q222N638L5739L2022j1124j0730Q795
6565B7465J7100J9986j0811k6413k0280k2776p722j4410J9941M2391p106k5961
6553h596o637j8005m820J691L0221l507p197J7670K1232j2328J581n585K704J5379
6539B3803K4904L205k0722k6221K9429K0262j4637r143K1876J0090k4784J144
6527C9206j4820k427J8483l4269l4956p069J1614J0941P625K092K484O889O103
6514A1896Q987o896k1039L810J5254L990M521L546j3404n463M586l7644Q246L7701
6500A8091k5172k5917K0142K8443L2675J1160l2651k8383n445J4058J2160K0821
$$ plain form
6590 -20146 6191 28906 42998 6552 -10427 -6972 22471 67391 76153 58315 63397 80257
6578 80257 48932 36904 36937 42732 5748 -24653 -32875 -27237 8502 40524 29400 18670 27465
6565 27465 44565 64551 53740 27327 7047 -15729 -23451 -37861 -17920 24471 17365 -8596
6553 -8596 -15233 -33238 -38058 -36367 -6146 -9653 -16850 820 22052 9724 11305 5720 8424 23803
6539 23803 48707 51912 31190 4969 34398 54660 40023 30880 52756 62846 38062 39206
6527 39206 24386 21959 40442 6173 -28783 -35852 -24238 -13297 -5672 -3580 -1096 5793 11896
6514 11896 20883 13987 -7052 -3242 12012 16002 20523 24069 10665 5202 9788 -27856 -19610 18091
6500 18091 -7081 -32998 -12856 15587 48262 59422 26771 -1612 -7057 7001 19161 39982
6488C9982J3312j5013j5395j6965M5631L1393j5115l7102q091j7423R84O917k3346
6475a0231j5602J0864P645j8912J8737J7536j3776k2185M069r103J463J5488Q377
6462e630j6816j2897K3020L88p174K626K978J7879J1743k338R58P539q851m3340
6448b9915M995J8578j11Q503R232k5289k2052P748K3121M295j7480J5832K9045
6435B6502K593J5671p404j2888J2001k3178l507J6219l6685o151L8737J4160k4831
6422A1239j8589P829j5301o469n93J092l660o667m883J0626J3765J2520L588j6171
6408a1674M451L926J4421k2333m229J4373r344J1775J0794J1243k4025k586l335
6395f543Q219j2017J9168l252m0603p572j1205L6055K4237n883l7740K1519K2247
$$ plain form
6488 39982 53294 38281 22886 5921 51552 82945 67830 30728 22637 5214 6198 13115 -10231
6475 -10231 -25833 -14969 -7324 -26236 -7499 10037 -3739 -25924 -21855 -30958 -29495 -14007 -5630
6462 -5630 -22446 -35343 -12323 -11935 -19109 -16483 -13505 4374 16117 13779 14737 22276 13425 -29915
6448 -29915 -24920 -6342 -6453 2050 11282 -14007 -36059 -28311 -5190 -895 -18375 -2543 26502
6435 26502 29095 44766 37362 24474 36475 13297 9790 26009 -10676 -16827 21910 36070 11239
6422 11239 -7350 479 -14822 -21291 -21884 -20792 -24452 -31119 -36002 -25376 -11611 909 4497 -11674
6408 -11674 -7223 -3297 11124 -11209 -15438 -1065 -10409 1366 12160 23403 -622 -3208 -6543
6395 -6543 1676 -10341 8827 5575 -35028 -42600 -53805 -17750 6487 604 -37136 -15617 6630
6382F630j7184L967M3606N129j905K21k0553k0300J309Q635J1867j9111K401l383
6368A329k9977J2796K6577J9442k2563J0958K2646m841m3540l7432k3112N436
6356f2281J7713j2599M1841L5274l448k8671K35J848j3820R725K7164l4641j1691
6343c3351L684J1159P55M1329P929L0983J8513k1817j6488r368O986l7643k8503
6330b5832j0344J3478J5354K993L09M144M645o752J5931J4540j4725k5712j9903
6317c1874m627P112J2092L9141Q746k1668J3995J7171k3642k4199L1532J3856
6305C7635l300j7486Q346q851o975l046R63q172j6546p028Q521R972P283k388
6291a072J0611l1282K850k1020K7454K4603q881j0748J238O578o492P105K4646
$$ plain form
6382 6630 -10554 -6587 37019 42148 40243 40464 19911 -389 920 9555 21422 2311 4712 1329
6368 1329 -28648 -15852 10725 30167 7604 18562 41208 36367 -7173 -44605 -67717 -62281
6356 -62281 -44568 -57167 -15326 19948 16500 -12171 -11936 -10088 -23908 -14183 12981 -21660 -33351
6343 -33351 -29667 -18508 -17753 23576 31505 62488 81001 59184 42696 33328 40314 2671 -25832
6330 -25832 -36176 -22698 -7344 -4351 -4042 102 4747 -2005 13926 28466 13741 -11971 -31874
6317 -31874 -36501 -29389 -17297 21844 30590 8922 22917 40088 16446 -7753 23779 37635
6305 37635 34335 16849 25195 16344 9369 6323 7286 -886 -17432 -24460 -15939 -5967 1316 -1072
6291 -1072 9539 -21743 -18893 -39913 -12459 12144 3263 -7485 -6247 331 -6161 944 25590
6278B5590o845n852j9212m590J315J2525l319k030K7194J8753j1247n046J3108
6265D0344n283j7322k6407j0865K2248K7477o41j7423J7876j8999l200K1667j3294
6252A6178r747r493j6534j4896J9487K4627K4780K7965j1972k4430k0655n702
6240c92j3943k6044j5004J4017J9471J0504p328j451J8623N029j9537j429J2882
6227d602n044k4147k920k0O44o285K1828r811j1398r516M5560N1117K1801l1962
6213C5245l3851P936K2392J1171m6009k1074K408k356N294K4318J1636j5367j3909
6200a2166Q161J7416k612k4751R512J3648j1699O034l0361k5108J8336J5194O032
6187a2364Q302l999J054j1477k4812K9601J7172M957J0957J1112K1745k6475l2862
$$ plain form
6278 25590 18745 12893 -6319 -10909 -9594 2931 -388 -2418 24776 43529 32282 27236 40344
6265 40344 35061 17739 -8668 -19533 2715 30192 29551 12128 30004 11005 7805 29472 16178
6252 16178 6431 -3062 -19596 -34492 -15005 9622 34402 62367 50395 25965 5310 -392
6240 -392 -14335 -40379 -55383 -41366 -21895 -11391 -18719 -20170 -1547 3482 -16055 -17484 -4602
6227 -4602 -9646 -33793 -36713 -36733 -36089 -42374 -20546 -30357 -41755 -51271 -5711 45406 67207 35245
6213 35245 1394 9330 31722 42893 -3116 -24190 -21782 -24138 -18844 5474 17110 1743 -12166
6200 -12166 -4005 13411 10799 -13952 -4440 9208 -2491 3543 -26818 -51926 -33590 -18396 -12364
6187 -12364 -4062 -8061 -7007 -18484 -43296 -13695 3477 8434 19391 30503 52248 25773 -7089
6174g089n829J959J4866j802k210P65J2376L602k7524n185J7942j3118j3613L7166
6160A2306o61o240k8040j755j0600o34J4852q987j0978j6254Q654n6K7308j9328
6146d0413j8876J2194J0014K1122L142L0853L919J5647j9517m018J677L038Q644
6133B7426m812N169m842k1411j9853m017K4706k0396J3152K2405j9456k8855K1072
6120i712q309O505K8361J8572j6514k9542j1417L7724j3707j1183l062j9932K6807
6107e409O497K823J3963j4555j5856k2593j4631o336L238K0424J4940p173o246
6094c0914j0060K249J6545K7609j242o769l266M798p186o924j0786J3774J2800
6081F28l187j5923P746j228J0652k783j083J7805K3082R501O114j4966k2286m2991
$$ plain form
6174 -7089 -12918 -10959 3907 2105 -105 660 13036 16638 -10886 -16071 1871 -11247 -24860 12306
6160 12306 11645 5405 -22635 -24390 -34990 -35624 -20772 -29759 -40737 -56991 -48337 -48393 -21085 -40413
6146 -40413 -59289 -47095 -37081 -15959 -12817 18036 21955 37602 18085 14067 15744 18782 27426
6133 27426 22614 27783 22941 1530 -18323 -22340 2366 -18030 -4878 17527 -1929 -30784 -9712
6120 -9712 -18021 -11516 16845 35417 18903 -10639 -22056 15668 1961 -9222 -12284 -32216 -5409
6107 -5409 1088 3911 17874 3319 -12537 -35130 -49761 -56097 -52859 -32435 -17495 -24668 -30914
6094 -30914 -40974 -38725 -22180 5429 4187 -2582 -5848 -1050 -8236 -15160 -25946 -12172 628
6081 628 -2559 -18482 -10736 -11964 -1312 -4095 -5178 12627 35709 45210 51324 36358 14072 -28919
6067b8919K2586J2262m478j7623k2000J0539K2555k3515j5100J9475J9382M627
6055b09J9460J4100J417k4199j8401J5671K1163k0789j4943J9065l980l047Q146
6042A3454j0934j0148j8052O371m031j656j5534J7660J652l117K0184Q377j0797
6029f571K4019j6345j5723p871k7408j3962J6954K1126O704k0816J624J2714J599
6016b3956k7381j2822J3641K1663Q472K4748p020l728j113L2502K9917l006j1510
6003D0407n368R625p855k2123k0076n16J3564p216r679j9433j9739p906J3149
5990d3166R492L2722k568j8001q523J221l592M1501j1732m885Q088J2055k0241
5977g629M741O066J2187K5142P332R263j4345m8384k5638J7894J0706j5488n783
$$ plain form
6067 -28919 -6333 5929 1451 -16172 -38172 -27633 -5078 -28593 -43693 -24218 -4836 -209
6055 -209 19251 33351 34768 10569 -7832 7839 29002 8213 -6730 12335 8355 5308 13454
6042 13454 2520 -7628 -25680 -19309 -23340 -24996 -40530 -22870 -21218 -24335 -4151 4226 -6571
6029 -6571 17448 1103 -14620 -22491 -49899 -63861 -46907 -25781 -19077 -39893 -38269 -25555 -23956
6016 -23956 -51337 -64159 -50518 -28855 -20383 4365 -2655 -6383 -7496 25006 54923 51917 40407
6003 40407 35039 44664 36809 14686 -5390 -5906 7658 442 -9237 -28670 -48409 -56315 -43166
5990 -43166 -33674 -952 -3520 -21521 -30044 -28823 -32415 9086 -2646 -7531 557 12612 -7629
5977 -7629 -2888 3178 15365 40507 47839 57102 42757 -5627 -31265 -13371 -2665 -18153 -23936
5964b3936j401J4707R019o044j7832j9383R265J5245J7061J0558J0295q073J5498
5951B4979j2074k385M992r107l7892n703K7083k909p670q187L17M1357K4248j2476
5937B4573q46j009j1224O146Q520O16l0223j5553P473P870J0419K623k2822P796
5923e641L8375J2855k3031m4097l953K3023J5626P296k8930p988M528q112K7035
5910F986P520j7354M340K4911P852j8968k6067p402K507J4039L5282K0147N950
5897E9743p143j8498m4022Q525j3146k6445J517J7579K3553K1715k6348j9142
5885b2112L0204K0790M26l2539j7426r43k6423j1298J8382J5810K1359J6063Q286
5872B0579k9083q277k97k843j2806j813K6406j0926l903J4161P464P722l370m11
$$ plain form
5964 -23936 -25337 -10630 -1611 -7655 -25487 -44870 -35605 -20360 -3299 7259 17554 9481 24979
5951 24979 12905 10520 15512 6405 -31487 -37190 -10107 -13016 -20686 -28873 -28556 12801 37049 24573
5937 24573 23727 22718 11494 17640 26160 26776 -3447 -19000 -11527 -3657 6762 9385 -13437 -5641
5923 -5641 32734 45589 22558 -21539 -25492 -2469 13157 20453 -8477 -16465 -11937 -20049 6986
5910 6986 14506 -2848 1492 26403 34255 15287 -10780 -18182 -15675 -1636 33646 53793 59743
5897 59743 52600 34102 -9920 -1395 -14541 -40986 -39469 -21890 1663 23378 -2970 -22112
5885 -22112 8092 28882 29308 -3231 -20657 -21600 -48023 -59321 -40939 -25129 -3770 12293 20579
5872 20579 -8504 -16781 -17078 -19921 -32727 -34540 -8134 -19060 -22963 -8802 -1338 6384 3014 2603
5858B603j5301J7764J1816j4720J0523n363J9754j8394r812Q81j5397k2074r131
5845d6851j5158K8524L0557q293J2772L1729j1718l9871o407M762K675k1239l284
5832d1802K2756j0019L007K015P427n330J1628R494J9655J1410J0086q647k1651
5819A0029q894J3271K905k4937j2382J8193n894k2874L5666p908K140K8040Q675
5806C6030l5222k0793o700N147M54j095R454j7989l5406K4313L3759K7594O51
5793B0197p179K5950J645k8417K611q687J946K772Q206j9542k4128j5375J8431
5780b1570J3814L1358K215p124r27j6856j6250P73J9309j6864o858l2398Q107
5767d3271O881j2970K1820L5688K9391q770k4924K0338j2556m0437k2201L3342
$$ plain form
5858 2603 -12698 5066 16882 2162 12685 7322 27076 8682 -1130 -249 -15646 -37720 -46851
5845 -46851 -62009 -33485 -2928 -11221 1551 33280 21562 -18309 -24716 -19954 -17279 -38518 -41802
5832 -41802 -19046 -29065 -26058 -24043 -16616 -21946 -10318 -824 18831 30241 40327 31680 10029
5819 10029 1135 14406 17311 -7626 -20008 -1815 -7709 -30583 5083 -2825 -685 27355 36030
5806 36030 808 -19985 -26685 -21538 -21084 -22179 -12725 -30714 -66120 -41807 -8048 19546 20197
5793 20197 13018 38968 40613 12196 14807 6120 8066 10838 19044 -498 -24626 -40001 -21570
5780 -21570 -7756 23602 25817 18693 17766 910 -15340 -14567 4742 -12122 -18980 -51378 -43271
5767 -43271 -36390 -49360 -27540 8148 37539 28769 3845 24183 11627 -28810 -51011 -17669
5755a7669J7653J8205N5J1655N498q615n834J1489r604m1699j2247J927j5816
5742d5002j2239K3550L3531J9577K8791O767j4601k4079o988J197m906j3533K9588
5729B1653L1874n911k2744o371J881k0214L566m625k1006O806K0407J8174k5785
5716b295K0768l744K1667j8675q786K305j8462m3857J8421l07r534J4014q29J0350
5702a8964Q561M728p506q726j1421j779J0429j4168J5740J3689P564q475Q823
5689a505L6641j0150M659R020q091k9926j238p659j817m324o700N576J2037J8765
5675A5288p461m145J8185K4910J1738j3615K582k4022R192L250l3314j668j2406
5662a1486k1610J2774R250L465R622j0477k0916j3498J5834J6244N4911o553l883
$$ plain form
5755 -17669 -16 18189 18244 29899 35397 26782 20948 32437 22833 -18866 -31113 -29186 -45002
5742 -45002 -57241 -33691 -160 19417 48208 54975 40374 16295 9307 10504 5598 -7935 21653
5729 21653 53527 47616 24872 18501 20382 168 3734 -891 -21897 -15091 5316 23490 -2295
5716 -2295 18473 14729 36396 17721 8935 11240 -7222 -51079 -32658 -32965 -42499 -28485 -29314 -18964
5702 -18964 -10403 -5675 -13181 -21907 -33328 -35107 -24678 -38846 -23106 -9417 -1853 -10328 -1505
5689 -1505 35136 24986 29645 38665 30574 648 -590 -8249 -10066 -14390 -21090 -15514 -3477 15288
5675 15288 7827 3682 21867 46777 58515 44900 47482 23460 32652 35902 2588 920 -11486
5662 -11486 -33096 -20322 -11072 -7607 2015 -8462 -29378 -42876 -27042 -10798 44113 37560 33677
5649C3677O209J3963l1526k6297K2418n476J7827M558k6702j3526K581K193J2930
5636A2829p77q212j986P591m966p923j0231J2597K4961n349p244N273j7800l86
5622a623j412k0358m689J1676L1105L8699j4037l878j6466p225K875r203R353
5609A4817j2121j8871k4033j5588K5441M6621k1305l2109p549J673K3790J8331
5597i03M572K7877J1626Q747m7962k7655k641K0519n194r101O854j5543J1129
5584a7675J0212J4375J3799L249r394j7707N242J8855j5367j5633j3229n02J931
5571b1844j291K449j6284R117j7669J0708K9806o241j8045k3243j0809K1718M144
5558c7484j6436j0257J410J6738K9053J6464k1213r750K0407J5255P650j506j3404
$$ plain form
5649 33677 39886 53849 22323 -3974 18444 12968 30795 35353 8651 -4875 -2294 -101 12829
5636 12829 12052 3840 1854 9445 4479 -3444 -13675 -1078 23883 18534 11290 16563 -1237 -1623
5622 -1623 -3035 -23393 -28082 -16406 14699 53398 39361 35483 19017 11792 14667 5464 14817
5609 14817 2696 -16175 -40208 -55796 -30355 16266 -5039 -37148 -44697 -43024 -19234 -903
5597 -903 3669 31546 43172 51919 3957 -23698 -26339 -5820 -11014 -20115 -13261 -28804 -17675
5584 -17675 -7463 6912 20711 23960 14566 -3141 2101 20956 5589 -10044 -23273 -23775 -21844
5571 -21844 -23135 -20686 -36970 -27853 -45522 -34814 -5008 -11249 -29294 -52537 -63346 -41628 -37484
5558 -37484 -53920 -64177 -62767 -46029 -16976 -512 -21725 -31475 -11068 4187 11837 10331 -3073
5545c073j4934O177Q600N154j8652j0128Q405J5664q939J0372r671K735J4626
5532F336j5586k0062P639k940K1074k2149o347J7799j016r717R057J668J1970
5519b274O572L971l9648l8403L401M611J8412J2357J4152Q603L653p24j35m761
5505a0213j3569J919K8498K7682l5294k4060J596r894P968J0748m123j2391J3033
5492a8100J1668j1374J5380l7395k4595J9221K3511L682j3093Q866K3121j4525
5480a3633q857R815K0395p804k9375m129l702R280o832J6283J0707j2625k1576
5467d2053o382q69r649k2003k2135J1480L7812K1428K7226J3789k835r117j9572
5454b2880j3264J9757R263j7123N9Q266p6n256P823k196q705J5411J2454J8530
$$ plain form
5545 -3073 -18007 -11830 -3230 1924 -16728 -26856 -18451 -2787 -11726 -1354 -11025 -8290 6336
5532 6336 -9250 -29312 -21673 -24613 -3539 -25688 -32035 -14236 -15252 -24969 -15912 -14244 -2274
5519 -2274 4298 8269 -31379 -69782 -66381 -61770 -43358 -31001 -16849 -8246 -4593 -5317 -5452 -10213
5505 -10213 -23782 -21863 6635 34317 -977 -25037 -23441 -33335 -25367 -14619 -18742 -31133 -18100
5492 -18100 -6432 -17806 -2426 -39821 -64416 -45195 -21684 -18002 -31095 -22229 892 -13633
5480 -13633 -22490 -12675 7720 -84 -29459 -33588 -37290 -28010 -34842 -18559 -7852 -20477 -42053
5467 -42053 -48435 -49304 -58953 -80956 -103091 -91611 -53799 -32371 -5145 8644 5809 -3308 -22880
5454 -22880 -36144 -16387 -7124 -24247 -24188 -15922 -15998 -21254 -13431 -15627 -24332 -8921 3533 22063
5440B2063M388k4649L931k1684j6087j6899J4384L1916J68j6858k6776L144J524
5427d1435Q831J5684J6052L515l0545l150K6444j0939j765L459q391p926m952
5414c5118J9461q795k083K4323L9088k0793n761L596J6990p335m559J1048K4644
5401E4706q465j7762r290L281L478j1773j6232k8829K277M920J347J9385m410
5388g367l135n108n482J3683J025R967l0m780k4198K5767K521K417J7879R658
5374C2817K0279J5036l5496j4613K356J416j4287j8040r386J1088J741j1267k6633
5361d4989j5170J6604K526J3779K0476J2758j2718j4771K6402Q043j635k2170
5349a0865J3761J656q914n555J3611N9j1278K75K1267p968n419j9378L260J8524
$$ plain form
5440 22063 26451 1802 5733 -15951 -32038 -48937 -34553 -2637 -2469 -19327 -46103 -42959 -41435
5427 -41435 -32604 -16920 -868 2647 -27898 -31048 -4604 -15543 -17308 -13849 -22240 -30166 -35118
5414 -35118 -15657 -24452 -26535 -2212 36876 16083 10322 13918 30908 23573 19014 30062 54706
5401 54706 46241 28479 19189 22470 25948 14175 -2057 -30886 -28609 -23689 -22342 -2957 -7367
5388 -7367 -10502 -15610 -21092 -7409 -6384 3583 3553 -1227 -25425 342 2863 5280 23159 32817
5374 32817 53096 68132 32636 18023 20379 21795 7508 -10532 -19918 -8830 -7089 -18356 -44989
5361 -44989 -60159 -43555 -41029 -27250 -6774 5984 -6734 -21505 4897 12940 11305 -10865
5349 -10865 2896 4552 -4362 -9917 3694 3753 -7525 -7250 14017 6049 630 -18748 -15488 3036
5335C036M232j032j1979n982l1996L186M012p626j236k027J0068L1386n438p229
5321a8625J5410J5766J11K4544O07l1145M058j5367j5893Q267k4793J7292L9135
5308A9367M083m2067P09J0197M125R571j5301L1245K2080r396l9273J3150R377
5295A7867n653k5702j715J2054M797o926J0041j911K0858l29j4413J4127P573
5282C0668k4972j8984p642Q168O678j1080P125M6323j7812j5424J687J847j5699
5269i117K7285L0720k0516k5946j0819k6614L234L0226k5809j2094K3212j2260
5257b8498j7536J0999N451J5509L9058M533j1011j3699j7571j4795q200l314R055
5244c0019J690J9040K2994l3087n36J9863M277p583R732O946P126j3967k8320
$$ plain form
5335 3036 7268 6236 -5743 -11725 -43721 -40535 -36523 -44149 -45385 -47412 -37344 -5958 -11396 -18625
5321 -18625 -3215 12551 12662 37206 37813 6668 10726 -4641 -20534 -12267 -37060 -19768 19367
5308 19367 23450 -18617 -17908 -7711 -3586 5985 -9316 21929 44009 34613 -4660 8490 17867
5295 17867 12214 -13488 -15203 -3149 1648 -5278 4763 2852 23710 23381 8968 23095 30668
5282 30668 5696 -13288 -20930 -12762 -6084 -17164 -10039 36284 18472 3048 4735 6582 -9117
5269 -9117 18168 48888 28372 2426 -8393 -35007 -31773 -1547 -27356 -39450 -16238 -28498
5257 -28498 -46034 -35035 -29584 -14075 24983 29516 18505 4806 -12765 -27560 -35760 -39074 -30019
5244 -30019 -28329 -9289 13705 -19382 -19918 -55 4222 -3361 6371 13317 20443 6476 -21844
5231b1844p858m737M369L3269p791k0561J8608j8941j7530J4996j724j4646J1480
5218c2910R223j159L696j2557J3179K7888K1368o478m2765p838L228J1729j900
5205a5296J2127k3360q206K5765O546j4737K51J9892J2941l1406j717o552p521
5192c1273K324k0103j9143P790r235P827L0838J9696K8342l4640l7256J6749J6444
5179b1640K3263M157nm710k0702r984K8799K5663m250k0676M776j8737K9967P674
5165B3595l2733j0338p214K4074K0631j0763P075O464n2082j0875j636L37J6107
5152b7358l164j8850L1584J2724j0891p809J222l828J7856K5717j462j4248j8909
5139a7416L4538J5162j0700k9381l8901J4394J0103k763K1084R725K4676J8973
$$ plain form
5231 -21844 -29702 -34439 -30070 3199 -4592 -25153 -6545 -25486 -43016 -28020 -29744 -44390 -32910
5218 -32910 -23687 -24846 -21150 -33707 -20528 7360 28728 22250 -20515 -28353 -25125 -13396 -15296
5205 -15296 -3169 -26529 -34735 -8970 -2424 -17161 -16910 2982 15923 -15483 -17200 -23752 -31273
5192 -31273 -28949 -49052 -68195 -60405 -69640 -61813 -30975 -11279 17063 -17577 -54833 -38084 -21640
5179 -21640 1623 5780 5775 1065 -19637 -29621 -822 24841 20591 -85 4691 -14046 15921 23595
5165 23595 -9138 -19476 -26690 -2616 18015 7252 14327 20791 -31291 -42166 -43802 -43465 -27358
5152 -27358 -30522 -49372 -17788 -5064 -15955 -23764 -22542 -26370 -8514 17203 15741 1493 -17416
5139 -17416 17122 32284 21584 -7797 -46698 -32304 -22201 -24964 -3880 5845 30521 49494
5127D9494m500q947j6061j3229J893J2880Q925p999k6592j1187J3478K8177l495
5114B2837j2278k0354k0658J410K5515J0491k107k8537j4290j3189K6336L4596
5102I772P191J807k4470m038p890j9764L538l4288L2928J9830j0412l896N124
5089b4568j6917l5078L4128K5986j8271p440N840l566L728J4184K90Q805N540
5076g339N374K7977O63k499j6981p600K4982N000k6265N202J1848J2956L913j8157
5062A9074k2302q585j940j3350k8084K341j305j1287j5672J5490K5452J0893L1442
5049B167n503J5850J0942R60N336j1358J297J8896p571L067K3429R968l1883j5548
5035B0049l805p944j2845J8123q640m617K3698J680o595m476o059L086l20m0451
$$ plain form
5127 49494 44994 36047 19986 6757 8650 21530 30455 22456 -4136 -15323 -1845 26332 22837
5114 22837 10559 -9795 -30453 -29043 -3528 6963 4856 -23681 -37971 -51160 -24824 9772
5102 9772 16963 18770 -5700 -9738 -17628 -37392 -33854 -68142 -35214 -15384 -25796 -29692 -24568
5089 -24568 -41485 -76563 -42435 -16449 -34720 -42160 -36320 -39886 -36158 -21974 -21684 -12879 -7339
5076 -7339 -1965 26012 26675 24176 7195 -405 24577 29577 3312 8514 20362 33318 37231 19074
5062 19074 -3228 -11813 -13753 -27103 -55187 -52846 -54151 -65438 -81110 -65620 -40168 -29275 2167
5049 2167 -3336 12514 23456 24416 29752 18394 19691 38587 31016 34083 57512 67480 35597 20049
5035 20049 16244 8300 -4545 13578 4938 321 24019 25699 19104 14628 8569 11655 11335 -29116
5021b9116K494L1418Q819o145j3904l977P676J7683l965j2303J4251n08j2172
5008B51j3695L504L5818j7574k9587L301L5351l62k857j0067j5775j1534j403
4995b4629L123j1912j1934pk404n690J0957J5054J5772K2803k5657J1422p537
4982a0639k5026m6169k3374J8139N8809M7743k1504k5587R967k385R53m648J869
4969b1852R695Q468j0548j8400n859K7346L3426J367J077k6269j2180J095L491
4956i143j1114O364j642j6391K0168L1598j0757m823m663j1078k5499k7123Q901
4943e5202K2568L029J0812K2853K5779n285O172K045j1610j9376j5912K8954L0293
4930D5120N947j5743l131R709o934l2848k7174n752Q182k323K2648j1336j3659
$$ plain form
5021 -29116 -26622 4796 13615 7470 -6434 -10411 -2735 14948 10983 -1320 12931 12423 251
5008 251 -13444 -9940 25878 8304 -21283 -17982 17369 17007 14150 4083 -11692 -23226 -24629
4995 -24629 -21506 -33418 -45352 -45359 -47763 -53453 -42496 -27442 -11670 11133 -14524 -3102 -10639
4982 -10639 -35665 -81834 -105208 -87069 -28260 19483 -2021 -27608 -17641 -20026 -19073 -23721 -21852
4969 -21852 -12157 -3689 -14237 -32637 -38496 -11150 22276 23643 24720 -1549 -13729 -12634 -9143
4956 -9143 -20257 -13893 -15535 -31926 -11758 19840 9083 4260 -403 -11481 -36980 -64103 -55202
4943 -55202 -32634 -29605 -18793 4060 29839 24554 30726 32771 21161 1785 -14127 14827 45120
4930 45120 51067 35324 32193 41902 34968 2120 -25054 -30806 -22624 -24947 -2299 -13635 -27294
4917b7294J9009J3719r355j1327L1363r448k5999J1424K0635o712l2406k0306
4905d6697R348j5236p033L7157P108k315j6216K9958K5520k949J7791P340k5235
4892A8541j3564j9085N793l951n608J6825M685K1742N917j976N181l2646l2107
4879c0253K3306L6242P891j7745j5472P972K4917J4163L3698M025l6921k4988
4867B6835N934L442j6011J3339l3442k4038J5291p927j5428j1024K3538p438o405
4854c3334k590J0700j8508J1618J7676K2189n37n6572k945m817K1387P600Q008
4841b0125K5278l865O91k5340k3355j1607j916K6742M6561O179j1755q216L851
4828C123j9900j1417r82q916q542J6190L1346m294J3653J3694q611k1723J717
$$ plain form
4917 -27294 -8285 5434 -3921 -15248 16115 6667 -19332 -7908 12727 6015 -26391 -46697
4905 -46697 -37349 -52585 -59618 -22461 -15353 -17668 -33884 -3926 21594 18645 36436 43776 18541
4892 18541 4977 -14108 -8315 -12266 -17874 -1049 3636 25378 31295 29319 34500 1854 -30253
4879 -30253 -6947 29295 37186 19441 3969 11941 36858 51021 84719 88744 51823 26835
4867 26835 32769 36211 20200 33539 97 -23941 -8650 -16577 -32005 -43029 -19491 -26929 -33334
4854 -33334 -35924 -25224 -43732 -32114 -14438 7751 7214 -49358 -52303 -57120 -35733 -28133 -20125
4841 -20125 5153 1288 1979 -23361 -46716 -58323 -60239 -33497 13064 19243 7488 -728 3123
4828 3123 -16777 -28194 -29176 -38092 -46634 -30444 902 -3392 10261 23955 15344 -6379 -4662
4815d662J9403J4242L3338N795k9058k4839K1526J8524k1188l4063o878k769J0474
4802a55o226p391R4p274K927K4274K1887J4129J9684m070k5317o489l4823j4070
4788b2820L1092N231M009k1906j145p499M987M057R203J2869K5792J5604k3404
4775C6070k7308j5042J1417K977p689J934k2777R51J9035K2478k3359k7238l523
4762c2074k9096J994N3039N444j1650N954P261j1068k5984l9753k2375K5745L7862
4749c4701J8217K9704o358j3461j3796K7468M016j7741O000J0492J0087L0522
4737E0449J3815q311n7509k2842J695k760K95L1417L9721j1969l8962q643O346
4724g258L315J126j1199K3358J1690m7400k7224k579L2657K1141j5976K8104K0260
$$ plain form
4815 -4662 14741 28983 62321 68116 39058 14219 35745 54269 33081 -982 -7860 -10629 -155
4802 -155 -6381 -13772 -13678 -20952 -18025 6249 28136 42265 61949 57879 32562 26073 -8750 -22820
4788 -22820 8272 13503 17512 -4394 -5539 -13038 -8051 -3994 5209 18078 43870 59474 36070
4775 36070 8762 -6280 5137 8114 425 2359 -20418 -19467 -432 22046 -1313 -28551 -32074
4762 -32074 -61170 -59176 -6137 -693 -12343 -6389 872 -10196 -36180 -75933 -98308 -72563 -34701
4749 -34701 -16484 13220 6862 -6599 -20395 7073 11089 -6652 -652 9840 19927 50449
4737 50449 64264 55953 -1556 -24398 -22703 -25463 -25168 6249 45970 34001 -4961 -13604 -7258
4724 -7258 -3943 -2817 -14016 9342 21032 -26368 -53592 -56171 -23514 -2373 -18349 9755 30015
4711C0015j2816k0400k8263j2308K3446L6370J3807l445k3488K0166J5116K618
4699D0818O130p009q584j9352R0o697k5659N644K3516J7253o518k4981j104L1580
4685B5127J2579m6104k3781L0213K0779o694K079l568m006j6521p21p035J184
4672a6469J7088L7052j0417K3560j1038j6758R916o7k9004j464j157k5892K279
4659b2371O86j3693J6079K7679k2683j1781J5215L927m111P525Q226o262j0016
4646a1580K220L9302N055l5308N371Q293j6252M841L329J3391o693O563k5306
4633f774j5859k9627j581J8155R948J8486K5882n639k5583k848Q820J4861J7162
4620B5403j9200j2565m910r175J4687k0781K0711J7446l034j8894J967R477j2588
$$ plain form
4711 30015 17199 -3201 -31464 -43772 -20326 16044 29851 26406 2918 23084 38200 40818
4699 40818 46948 39939 31355 12003 12093 5396 -20263 -14619 8897 26150 19632 -5349 -6453 25127
4685 25127 37706 -8398 -32179 -1966 18813 12119 14198 10630 6624 -9897 -10618 -17653 -16469
4672 -16469 619 37671 27254 50814 39776 23018 32934 32867 3863 2399 1242 -24650 -22371
4659 -22371 -21685 -35378 -19299 8380 -14303 -26084 -10869 -6942 -11053 -3528 4698 -1564 -11580
4646 -11580 -9360 29942 34997 -311 5060 13353 -2899 1942 5271 18662 11969 18532 -6774
4633 -6774 -22633 -52260 -53841 -35686 -25738 -7252 18630 12991 -12592 -15440 -6620 8241 25403
4620 25403 6203 -6362 -11272 -20447 -5760 -26541 -5830 11616 8582 -10312 -8345 1132 -11456
4607a1456j1118j210Q694N546k1400l7482L0098K7262j188j4911R550Q937l909
4594a2587j2703j412m418o494J0228L7407q823j9806p533l762j4185j929k037
4581d8054J3582J0576K8914l82j4112j5048J777J0397k201K849k9972k4213j0512
4568g6399r833L4900K1500J0608j8945J3423M249n292k46L4302J3485p697l3453
4555a9398l2555J7089M9138K3056l464l123m2859j7659k5410L8915K0719j8606
4543a4157N065J6557K2848j0163p044M439J9570K656r118k7255j5202K4302O810
4530A9308J070J6415l12l0716j9620K4379p811k6423j451L6700o118l8110k1023
4517e3712J1471L0715L291l458K3443k0225l0375o143J5703l26O533N800L734
$$ plain form
4607 -11456 -22574 -23784 -15090 -9544 -30944 -68426 -38328 -11066 -12254 -27165 -17615 -8678 -12587
4594 -12587 -25290 -26702 -31120 -37614 -27386 10021 1198 -18608 -26141 -29903 -44088 -46017 -48054
4581 -48054 -34472 -23896 5018 4636 -9476 -24524 -22747 -12350 -14551 -11702 -41674 -65887 -76399
4568 -76399 -86232 -51332 -29832 -19224 -38169 -24746 -20497 -25789 -26035 8267 21752 14055 -19398
4555 -19398 -51953 -34864 14274 37330 33866 30743 -12116 -29775 -55185 -16270 4449 -14157
4543 -14157 -9092 7465 30313 20150 13106 17545 37115 39771 30653 3398 -11804 12498 19308
4530 19308 20378 36793 36481 5765 -13855 10524 2713 -23710 -25161 11539 5421 -32689 -53712
4517 -53712 -42241 -11526 -8235 -11693 11750 -8475 -38850 -44993 -29290 -29616 -23083 -17283 -13549
4504a3549J7022L748q230K0010J9085l2463k5165m558j3690J3344Q93J089L078
4491a9386J6964l841l057l50k3350j6671K6330K543N125N707L1613J0900j6591
4478A5936j5680j7053k3988K8361J2941k0952J159j4242q379J2884N511L318J1380
4465h804J1257j8146k955Q832m0880J6090N874K7394L013l0788l652l342l432
4452c9539m208L2578J6060K9886O837k4596J8511m894n5488Q16N0957O413n0486
4439a7153l2681Q462M6939K5616j0919j5361K731Q754P507o155k9670Q722M9318
4426D6110q671n369j5377k5004o640L1608K7839l2829j6532J0230J7699J4854
4414C7918J283j4953o363J2267j588J0948k3721j9433m859K1732J9479l168j0948
$$ plain form
4504 -13549 3473 7221 -1009 19001 38086 5623 -19542 -24100 -37790 -24446 -23553 -22464 -19386
4491 -19386 -2422 -6263 -9320 -9670 -33020 -49691 -23361 -20818 -15693 -9986 21627 32527 15936
4478 15936 256 -16797 -40785 -12424 517 -20435 -19276 -33518 -41897 -29013 -23502 -20184 -8804
4465 -8804 2453 -15693 -18648 -9816 -50696 -34606 -28732 -1338 1675 -29113 -32765 -36107 -39539
4452 -39539 -43747 -11169 4891 34777 41614 17018 35529 30635 -24853 -24037 26920 33333 -17153
4439 -17153 -49834 -41372 5567 31183 20264 4903 7634 16388 23895 17740 -11930 -3208 46110
4426 46110 37439 32070 16693 -8311 -14951 16657 44496 11667 -4865 5365 23064 37918
4414 37918 39201 24248 17885 30152 28564 39512 15791 -3642 -8501 13231 32710 29542 18594
4401A8594m377N98J356J28l0265j4507O76R904K1872o321j6482J2281J0107k3420
4387a9856j8883l441J5494K97r376o530L5782K7772j398q259k189J6278k5568
4374A23j5562R226j3082m943j1128J6333J4422o923l942J0391K008R720j1391
4361d748q9K233J3053m008q973p482N355Q744J6539J1431j1067r220K0922J6304
4347D8994j6370k1270n222Q509j609k2975K7208P256k5556l508J0811N423J4923
4334B6614l6192k0863m19J9247J759J1341R393k1519K530J2425M5114j8009r687
4321B1734o320q457j688K775j4758j7707P532J2463O593r391J333r18j8900J9760
4307e949L063J3027K4628r338L979l208k636j6157k9656J4850J8127J9476P697
$$ plain form
4401 18594 14217 14815 16171 16299 -13966 -28473 -27797 -17893 3979 -2342 -18824 -6543 3564 -19856
4387 -19856 -38739 -42180 -26686 -26389 -35765 -42295 -6513 21259 19861 11602 9413 25691 123
4374 123 -15439 -6213 -19295 -24238 -35366 -19033 -4611 -11534 -15476 -5085 -3077 6643 -4748
4361 -4748 -4837 -2604 10449 6441 -2532 -10014 -4659 4085 20624 32055 20988 11768 32690 48994
4347 48994 32624 11354 6132 14641 13032 -9943 17265 24521 -1035 -4543 6268 11691 26614
4334 26614 -9578 -30441 -30860 -11613 -9854 1487 10880 -10639 -8109 4316 49430 31421 21734
4321 21734 15414 6957 5269 8044 -6714 -24421 -16889 -4426 2167 -7224 -5891 -6809 -25709 -5949
4307 -5949 -2886 10141 34769 25431 29410 26202 23566 7409 -22247 -7397 10730 30206 37903
4294C7903J1558J0100l3663k1843j487K4227J5231J8768M57m697J8617p367k8571
4281C9233k8472J338R260J0300m128J538j9301m18J166p143K2062J5311k0655
4268B0091k7205p667J4579k1701j314Q079K1084J4508J9786j1621j8305J8100
4256B8414K0938k3329J225L528j8485q120p529p149j2002l816m233m79L0843J3197
4242A3003p205k5092P352J4153n36p021P816N515k9973k744K1819L293Q495o701
4228B174o739J7411K556j5448o595Q611K9728J6987Q995J4855n418k5865l9619
4215A633k8026J7216L1098J4463j5430l3114K9493j2535n1152j6432N221K1356
4203c6209L126M123J0398J6022O147r384L348J5909n769K043j8210l3147j1705
$$ plain form
4294 37903 49461 59561 25898 4055 2568 26795 42026 60794 61251 56554 75171 67804 39233
4281 39233 10761 12099 21359 31659 27531 29069 9768 9350 10516 3373 25435 40746 20091
4268 20091 -7114 -14781 -202 -21903 -23217 -15138 5946 20454 40240 28619 10314 28414
4256 28414 49352 26023 27248 30776 12291 4171 -3358 -10507 -22509 -26325 -30558 -31037 -194 13003
4242 13003 5798 -19294 -11942 2211 1675 -5346 2470 7985 -21988 -24732 -2913 380 8875 2174
4228 2174 -4565 12846 15402 -46 -6641 1970 31698 48685 57680 72535 67117 41252 1633
4215 1633 -26393 -9177 21921 36384 20954 -12160 17333 4798 -46354 -62786 -57565 -36209
4203 -36209 -33083 -28960 -18562 -2540 3607 -5777 -2429 13480 7711 9754 -8456 -41603 -53308
4190e3308K2421J445k2846p93k48o64K7767o61j3543R961R570K8448L8280M451
4176E0280l1427k0758p807R883k5766j0440P559J3268K3046J2987j1259M850K955
4163A7371r735J1093J2794j1918N290R61J297j5206l3054l2241r675J9608M1821
4150a594K4851k4449p305j5596o422P622L1917J092q928l0488r13L1495L034K8037
4136C2353J8772l3056o359k2741l510K3036R167q774P165q039j0022k3599l919
4123b9526R801l977J1134l5652J1650K5331j235k1337j1709m419J7743r90j2886
4110d6072Q265J0452K2546j7513k541q468o059J9751O669J584J4429K1J7877K213
4096B3154j3608p278j007j2711j107M054P240r475r346l989Q720K6357l457k2730
$$ plain form
4190 -53308 -30887 -29442 -52288 -53081 -53329 -53993 -26226 -26887 -40430 -30469 -20899 7549 45829 50280
4176 50280 18853 -1905 -9712 171 -25595 -36035 -28476 -15208 7838 20825 9566 14416 17371
4163 17371 7636 18729 31523 19605 24895 25856 27153 11947 -21107 -53348 -63023 -43415 -1594
4150 -1594 23257 -1192 -8497 -24093 -30515 -22893 9024 10116 1188 -29300 -30213 1282 4316 32353
4136 32353 51125 18069 11710 -11031 -14541 8495 17662 8888 16053 8014 -2008 -25607 -29526
4123 -29526 -19725 -23702 -12568 -48220 -36570 -11239 -12474 -33811 -45520 -49939 -32196 -33186 -46072
4110 -46072 -37807 -27355 -4809 -22322 -24863 -33331 -39390 -19639 -12970 -11386 3043 3064 20941 23154
4096 23154 9546 2268 1261 -11450 -12557 -8503 -1263 -10738 -20084 -24073 -15353 11004 7547 -15183
4082a5183k63K375K829j2110K48Q255j2451N73j923r554L991J104K0273O92j5776
4067b6920N888n039J1236J920l711K8975j2561k6963k501n209J9047J6281O085
4054F528j6392r1l025N792j5326j6438r609K3690l051K3414M525N150j385q305
4040d523n798j54p99K9665m495j9813J7758K1386K803q585k3056j0901r037K512
4026a3037o989k9141R611N0876l444j3005L1583K6982k028k2548l893k7046l375
4013e454q261j0815m12K7775K1035J2883j8947j645j5583R596J171q641l263j2587
3999a3148M565J5659Q289k2800k2190k1786k8387j1562J7498N2110J6943r250
3987a4059j2571L1378o845L552J7791J4833p129k0926j1450K1947J8321l637j2066
$$ plain form
4082 -15183 -15446 -13071 -10242 -22352 -22104 -13849 -26300 -25727 -27650 -37204 -33213 -32109 -11836 -11144 -26920
4067 -26920 -21032 -26071 -14835 -12915 -16626 12349 -212 -27175 -29676 -34885 -15838 443 6528
4054 6528 -9864 -9955 -12980 -7188 -22514 -38952 -48561 -24871 -27922 -4508 17 5167 3782 -4523
4040 -4523 -10321 -10475 -11274 18391 13896 -5917 11841 33227 36030 27445 4389 -6512 -15549 -13037
4026 -13037 -20026 -49167 -39556 11320 7876 -5129 26454 53436 51408 28860 24967 -2079 -5454
4013 -5454 -13715 -24530 -24942 2833 23868 36751 17804 16159 576 10172 11343 2702 -561 -13148
3999 -13148 -8583 7076 15365 -7435 -29625 -51411 -79798 -91360 -73862 -21752 -4809 -14059
3987 -14059 -26630 4748 -2097 1455 19246 34079 26950 6024 -5426 16521 34842 31205 19139
3974A9139j0157j9724N779J9408O938L3496O778j0870m204j2105j6457r183j7433
3961h595l753K8403O661l9715m488M537M221l06N023J951j0216J8981J7995k2777
3947b078p914L9951r222q4M86j3716q83J2299J0975O342J3334r129j3963j1767
3933A4631j0356R908P914L6597J4040m4034n9753j8108j193M672J8466J8060O776
3920b380O615L696J0090q104j7234L925O35R962n617j2536p004k2651l9K4495
3906a6147J0105Q79n112j8415J0206j4714J0733J4741j0548J207M0354o454L3260
3893E0095K939l7805l7614q172M2158o303Q772l574L825R91o223k2672k594J1210
3879d967K8410K3314k557p16m887j4075k6777L1362R302j8800k1849j3162J9518
$$ plain form
3974 19139 8982 -10742 -4963 14445 21383 54879 61657 50787 46583 34478 18021 8838 -8595
3961 -8595 -12348 16055 22716 -16999 -21487 -16950 -12729 -13035 -8012 -6061 -16277 2704 20699 -2078
3947 -2078 -9992 29959 20737 20653 21139 7423 6540 18839 29814 36156 49490 40361 26398 14631
3933 14631 4275 14183 22097 58694 72734 28700 -31053 -49161 -50354 -45682 -27216 -9156 -2380
3920 -2380 4235 7931 18021 9917 -7317 -3392 -2757 7205 1588 -10948 -17952 -40603 -40642 -16147
3906 -16147 -6042 -5163 -10275 -28690 -18484 -33198 -22465 -7724 -18272 -17065 23289 16835 50095
3893 50095 53034 15229 -22385 -30557 11601 5298 14070 10496 14321 15312 9089 -13583 -16177 -4967
3879 -4967 23443 46757 44200 43484 38597 24522 -2255 29107 38409 19609 -2240 -15402 4116
3866D116j8950j7433J7397q793o87j766K1481K4637q838n097k4571O09j3441j18
3852c1454m116m79M305P135J5888m124K1089Q227J3108O570L0442j8866k7967
3839A9758j6696J5698O560j9836j6193j5160m283L1421q073M858J0614J7589J4405
3826D0662k7481l3673O791R608J5595M659k9002p027r589j4125L224L4168K0338
3813A4148j3273K800J4087J221k4809N419J130K3922k208m890J393j0076M658
3800A3522j6347J172L8593J5166k4354p529l4124J4352K1129Q341l2163k2581
3788b4823N317O092r873J6353j006m0249k6837O360K6460J138K4943O399L620
3775f106j027l325o837N66J8900l417K3866J433j7249r705N861k084K327j5071
$$ plain form
3866 4116 -14834 -32267 -14870 -23663 -24350 -26116 -4635 20002 11164 6067 -18504 -17895 -31336 -31454
3852 -31454 -35570 -36049 -31744 -24609 -8721 -12845 8244 16471 29579 36149 66591 47725 19758
3839 19758 3062 18760 25320 5484 -10709 -25869 -30152 1269 -6804 -1946 8668 26257 40662
3826 40662 13181 -20492 -13701 -4093 11502 16161 -12841 -19868 -29457 -43582 -40358 -6190 14148
3813 14148 875 3675 17762 18983 -5826 -407 723 24645 22437 17547 18940 8864 13522
3800 13522 -2825 -1653 36940 52106 27752 20223 -13901 451 21580 29921 -2242 -24823
3788 -24823 -19506 -13414 -23287 -6934 -7940 -48189 -75026 -68666 -42206 -41068 -16125 -9726 -6106
3775 -6106 -7133 -10458 -17295 -16729 2171 -1246 22620 24053 6804 -2901 2960 876 3203 -11868
3761a1868l1186k3024J1591Q993j695J388J7579K7770n444k201l226j8241k9566
3748e9130N703M7138J8499j8168l327r10j8496j4369j1378J5687K5633J4835J4551
3735A6268J3974r715m2314k6925K0652J9937N968k1734k600R862J0976L21K108
3722c222j2834j008K1882l5292J3391K4934j6131j4060R290K5418j6855J684P401
3709D598j6718k550r126p612J1386K3655j3280j3475j1598K3604M0137R828j2699
3696B6150m964k700Q13q741q732j3248K8690j045J2658m090k3222L969k6031k5872
3682d6365J0924L0227j9708m257M5106J7181n9546k3149L3766Q890J8294j548
3670I815n276j3774N628J3233j3669j7272O671J7749r379M856k861j445p118J7512
$$ plain form
3761 -11868 -43054 -66078 -54487 -45494 -47189 -45801 -28222 -452 -5896 -8097 -11323 -29564 -59130
3748 -59130 -53427 -6289 12210 -5958 -9285 -10195 -28691 -43060 -54438 -38751 -13118 1717 16268
3735 16268 30242 20527 -21787 -48712 -28060 -8123 -2155 -23889 -26489 -16627 -5651 -5330 -3222
3722 -3222 -16056 -17064 4818 -30474 -17083 7851 -8280 -22340 -13050 12368 -4487 -2803 4598
3709 4598 -12120 -14670 -23796 -31408 -20022 3633 -9647 -23122 -34720 -11116 29021 38849 26150
3696 26150 21186 18486 19299 10558 1826 -11422 17268 16223 28881 24791 1569 5538 -20493 -46365
3682 -46365 -35441 -5214 -24922 -29179 15927 33108 -26438 -49587 -15821 -6931 11363 9815
3670 9815 4539 -9235 -3607 9626 -4043 -21315 -14644 3105 -6274 -1418 -4279 -5724 -12842 4670
3656D670J0258K905K337p832m18k3659j0437m3570K129J6047J845M251P889O332
3642b7253K553J2408j5297j3141L8013Q734l1905q499K4081J7270m685j7344J3792
3629a273L2339j3983o653j834p804M342r379j3864J6792K8418k146k0781l7282
3616c3108p31p249L5809J1352r905j1899N476j0539j1450L617L3641j8652j8842
3603c2480M73j5478n320K2617N373J3603K0629l654q126j5822L578j5045K403
3590b7249K385p904k0032J5526K1854l954J1344O399K5106J10k6387j2229j9985
3577c5016J8964M0600K1874l1877j7439j5093k1646L828J3493k957K439K6278
3565C448l5068l6512L7577K3007L307N932K0935j0081j159N501k557j7834J7201
$$ plain form
3656 4670 14928 17833 20170 12338 11920 -11739 -22176 -65746 -63617 -47570 -45725 -41474 -33585 -27253
3642 -27253 -24700 -12292 -27589 -40730 -2717 6017 -25888 -34387 -10306 6964 2279 -15065 -1273
3629 -1273 31066 17083 10430 8596 792 5134 -4245 -18109 -1317 27101 24955 4174 -33108
3616 -33108 -33839 -41088 -5279 6073 -3832 -15731 -10255 -20794 -32244 -28627 5014 -13638 -32480
3603 -32480 -32007 -47485 -52805 -30188 -24815 -11212 9417 5763 -2363 -18185 -14607 -29652 -27249
3590 -27249 -24864 -32768 -52800 -37274 -15420 -19374 -8030 -1631 23475 23585 -2802 -15031 -35016
3577 -35016 -16052 24548 46422 14545 -2894 -17987 -39633 -35805 -22312 -25269 -22830 3448
3565 3448 -31620 -68132 -30555 -7548 -4241 1691 22626 12545 11386 16887 14330 -3504 13697
3552A3697j0155m971j2440k2141J7282k0111J1181j4354p429J1266N0237K0289
3540C2351k877L125J5209N27j4160k5199j0247J4873m977k4415n885m925L3143
3527F543j3712j7863Q452J535j3709k5573q378K3165Q761P444j5199j7443N923
3514e0054K8233j731k0404R799M9162K125l2051k3195K4774O106l8793q590L8376
3501a6243K0618J3067R532J2022j3898k745q419n190K767j3755n246J702J0359
3488D571J8827l2389j583J0430j3088j744L1763J5361N716j3174r886j3573N521
3475F752J0698q572m316J3582j2915n148J683J7255j4988K7253P361m652L091
3462C7084l934l5516q463J7037k748K2615K799j20n111Q366j8307m2656l3318
$$ plain form
3552 13697 3542 -1429 -13869 -36010 -18728 -38839 -27658 -42012 -49441 -38175 12062 32351
3540 32351 29474 32599 47808 48335 34175 8976 -1271 13602 8625 -15790 -21675 -26600 6543
3527 6543 -7169 -25032 -16580 -15045 -28754 -54327 -62705 -39540 -30779 -23335 -38534 -55977 -50054
3514 -50054 -21821 -23552 -43956 -34157 15005 17130 -14921 -38116 -13342 -7236 -46029 -54619 -16243
3501 -16243 4375 17442 26974 38996 25098 22353 13934 8744 11511 -2244 -7490 -5788 4571
3488 4571 23398 -8991 -10574 -144 -13232 -14976 16787 32148 37864 24690 14804 1231 6752
3475 6752 17450 8878 4562 18144 5229 81 1764 19019 4031 31284 38645 33993 37084
3462 37084 33150 -2366 -10829 6208 3460 26075 28874 28754 23643 32009 13702 -28954 -62272
3449f2272J2598K5747J7268k1454K22R521p790j0121j9866J0061J2980R884J7688
3436e534o434j0406K0259o935R898q809q549Q713K2314q921J7906p769L3199n887
3422D3045j3399o233k0350K662J3959j1062j6887P623K0918j4362J2862K9053
3410D7829j9300j9878O787m392M682p660j4826j6626p797K779k9607J0436K4643
3397b2930M208J4331M606R83m180j1871k2210O206L0628R393m605J020q415K475
3383c61n900p139J1491L0141J1016K2038r30j6950m818k9809k8057n40K3403J9382
3369B2967Q239P099k7965k0602j7468K9046L0932K5340l1974j8673j411k6683
3357b1153k3374K0866J3768j33J566M9892O656p315j1791o206M680J2279j7565
$$ plain form
3449 -62272 -49674 -23927 -6659 -28113 -27891 -18370 -26160 -36281 -56147 -46086 -33106 -23222 -5534
3436 -5534 -11968 -22374 -2115 -9050 848 -7961 -16510 -7797 14517 5596 23502 15733 48932 43045
3422 43045 29646 23413 3063 5725 19684 8622 -8265 -642 20276 5914 18776 47829
3410 47829 28529 8651 15438 11046 15728 8068 -6758 -23384 -31181 -28402 -58009 -47573 -22930
3397 -22930 -18722 -4391 215 1198 -2982 -14853 -37063 -30857 -229 9164 4559 5579 -2836 -361
3383 -361 -6261 -13400 -1909 28232 39248 61286 60356 43406 38588 8779 -19278 -19818 3585 22967
3369 22967 31206 38305 10340 -10262 -27730 1316 32248 57588 25614 6941 5530 -21153
3357 -21153 -44527 -23661 -9893 -10026 -8460 41432 48088 40773 28982 22776 27456 39735 22170
3344B2170j1962j6406J851L1784Q854l0578j9710k9794J4700J3277l784J3241
3332f357P625J101j9598J909k392K3355Q726j5382J4877J913R59K0989k3439m3714
3318b9428J8036K6405k066k025J5390r589o749O477j425l7626n5477J4980N8057
3305e040J2643R634J0794p261j5936o674r746j1563p078R69J2296j3349j1098
3292d1409L0269R722R789J6171k2690j6676K936K0620J7826L316j4124r43q735
3279F072j1512J6532J8678M783j2618n781J8182L049j96q511j5052K0685j7475
3266A6836r219q672o666j787K9613J4371o750p119o929l8055j5577K7850k115
3253a4219L114P936m109p626J7095K905k1277J211M945j6773J9798J0737K6823
$$ plain form
3344 22170 10208 -6198 -4347 27437 36291 5713 -13997 -43791 -29091 -15814 -19598 -6357
3332 -6357 1268 2369 -17229 -15320 -17712 5643 14369 -1013 13864 15777 16736 37725 14286 -29428
3318 -29428 -11392 15013 12947 10922 26312 16723 9974 16451 15026 -22600 -78077 -63097 -5040
3305 -5040 7603 17237 28031 20770 4834 -1840 -11586 -23149 -30227 -29258 -16962 -30311 -41409
3292 -41409 -11140 -1418 8371 24542 1852 -14824 -11888 8732 26558 29874 15750 14807 6072
3279 6072 -5440 11092 29770 34553 21935 16154 34336 37385 37189 28678 13626 34311 16836
3266 16836 7617 -1055 -7721 -9508 20105 34476 27726 20607 13678 -24377 -39954 -12104 -14219
3253 -14219 -11105 -3169 -7278 -14904 2191 5096 -16181 -14970 -10025 -26798 -7000 3737 30560
3240C0560O1996j1780n9473l1732j4207m870j1470k4190L5N3161L728N823k025
3227d444L078R919l656O940K7346K0331j3696O116R337N159j7169k2774j462m274
3213B0751j0488k2725j5967J6266M8395m116k2433J2716K147j5991J6146M087
3201B8788q518J5635L982m3580K950q880n74R763l4381j0876L6235J7538r164
3188a082k8026K7148r430k2662l239J3932J988q012L8758J7931Q871l0138q645
3175b606R209n73j2062k5138K676J2992K8811K5783p521j9948p295k1369j2417
3162b9458p16K926K6086j0344m280K4267P669K026k2453p482R969J21k6317p97
3148b8783K0303M259q646J2272Q39j7358P659O746k7714p160P646K5621J1170
$$ plain form
3240 30560 92556 80776 21303 -10429 -24636 -29506 -40976 -65166 -65131 -11970 -8242 -2419 -4444
3227 -4444 -1366 8553 4897 11837 39183 59514 45818 51934 61271 66430 49261 26487 25025 20751
3213 20751 10263 -12462 -28429 -12163 36232 32116 9683 22399 24546 8555 24701 28788
3201 28788 20270 35905 39887 -3693 -743 -9623 -10197 -434 -34815 -45691 -9456 8082 -1082
3188 -1082 -29108 -1960 -11390 -34052 -37291 -23359 -21371 -29383 9375 27306 36177 6039 -2606
3175 -2606 6603 6030 -6032 -31170 -28494 -15502 13309 39092 31571 11623 4328 -17041 -29458
3162 -29458 -30174 -27248 -1162 -11506 -15786 8481 16150 18176 -4277 -11759 -1790 -1669 -27986 -28783
3148 -28783 -8480 -4221 -12867 -595 244 -17114 -9455 -2709 -30423 -37583 -29937 -4316 6854
3135F854j2362J6593p857l1743j6206m386J2607L3262Jj1490n107n066l1830j4864
3121g1594l098L6324L3470j2643k706R910P418J4673N043J5961l3494L349L2822
3108C5435M174M738L964M559J1588k1637l4490l2384K556L821k6856J2272J0516
3095b1744k231n712R305K3745J532M987j0772K9740O252J540J0384O733l8183
3082A5576l0512J1402K4484L2355m777l7346l4847j351j0846j3361J0428J8634
3070b0161L286n113N185L3538J0456J4987R331j9006k107q40j8120m7j542r963
3056a16k9927j1419K8175l794q53j0868j2348R901J7122j950L0360j1947o794
3043d458Q027k2672Q095K5049K0368j4658j7444J9709l687k9443J5654J9474o794
$$ plain form
3135 6854 -5508 11085 3228 -28515 -44721 -49107 -36500 -3238 -3237 -14727 -19834 -24900 -56730 -71594
3121 -71594 -74692 -38368 -4898 -17541 -20247 -10337 -2919 11754 16797 32758 -736 2613 35435
3108 35435 39609 44347 48311 52870 64458 42821 8331 -24053 -21497 -17676 -44532 -32260 -21744
3095 -21744 -23975 -29687 -20382 3363 4895 9882 -890 28850 35102 36642 47026 53759 15576
3082 15576 -14936 -3534 20950 53305 48528 11182 -23665 -25016 -35862 -49223 -38795 -20161
3070 -20161 -16875 -21988 -16803 16735 27191 42178 51509 32503 30396 29556 11436 11389 9847 -116
3056 -116 -30043 -41462 -13287 -17081 -17934 -28802 -41150 -31249 -14127 -16077 14283 2336 -4458
3043 -4458 3569 -19103 -11008 14041 34409 19751 2307 22016 18329 -11114 4540 24014 17220
3030A7220p682J4968m35k9332r423Q878J5575J0653K1321J5317K5231J537l2599
3017E1229l2684j7321j2646N821j7793O363L7290k0339j2964M828N395K3215n008
3004A5386j407o423O592Q754k525m404J3470K2030l005m300j4321k367J6884n342
2990C9022j7299o355j1613K1976p425n387l0686J551L5186O918k325J9558J5560
2977E8681O741k7344J3434O103j944j0219p284p963q332k7849k439K462R459o484
2963b978k705J1593J5516m193J275j8107K706n110j2066P858M0881J6193k273
2950D8590k5453l2052o063l5197k3865L1476j351O977K9891j848k0654J4898L596
2937a1055N008J162J5050N3170p749l1052J7149j3148k0068N798J1264n200l0081
$$ plain form
3030 17220 9538 24506 24071 -5261 -14684 -5806 9769 20422 41743 57060 82291 83828 51229
3017 51229 18545 1224 -11422 -5601 -23394 -17031 20259 -80 -13044 -8216 -2821 20394 15386
3004 15386 13979 7556 14148 22902 20377 15973 29443 51473 48468 44168 29847 27480 44364 39022
2990 39022 21723 15368 3755 25731 18306 12919 -17767 -16216 18970 25888 23563 43121 58681
2977 58681 65422 38078 51512 57615 55671 45452 38168 30205 21873 -5976 -8415 -5953 3506 -2978
2963 -2978 -5683 5910 21426 17233 18508 401 3107 -2003 -14069 -6211 34670 50863 48590
2950 48590 23137 -8915 -14978 -50175 -74040 -42564 -43915 -36938 -7047 -8895 -29549 -14651 -11055
2937 -11055 -6047 -4885 10165 63335 55586 24534 41683 28535 8467 14265 25529 20329 -9752
2924i752k0848J2001K610N711m7714j5223L7790N2532j4188j5450J8022J1172
2912A6663n305k0512l0153j3361J2996jJ3898L1128K1046j9022j3360J0440J0431
2899A4888J7466k471k65P837j8357p495o648j5355N283j0562k9273M534K946j0532
2885d8004J3131K676j8583M823L3058K9824j2677L3062K0875q058l6245m8502
2873c4620k618J183Q867O337j0318j7793M664O989J3994l42o716j1223j1551L3134
2859b0013J3973p607j1044N460M4106j8163q544r942J0022J231P558K584j4742
2846e121j5441n502J5186k0297J5669K6681j531l908j0273j7843K0094J0284l0141
2833b2143L02J7252l040j319m009J7293J8002l5705p828K2353J6806k0233j1220
$$ plain form
2924 -9752 -30600 -18599 -15989 -10278 -57992 -73215 -35425 17107 2919 -12531 5491 16663
2912 16663 11358 -9154 -39307 -52668 -39672 -39673 -25775 5353 26399 7377 -5983 4457 14888
2899 14888 32354 29883 29618 37455 19098 11603 4955 -10400 -5117 -15679 -44952 -40418 -37472 -48004
2885 -48004 -34873 -32197 -50780 -45957 -12899 16925 4248 37310 58185 50127 13882 -34620
2873 -34620 -37238 -36055 -27188 -20851 -31169 -48962 -44298 -37309 -23315 -23657 -30373 -41596 -53147 -20013
2859 -20013 -6040 -13647 -24691 -19231 24875 6712 -1832 -11774 -1752 -521 7037 9621 -5121
2846 -5121 -20562 -26064 -10878 -31175 -15506 11175 9644 5736 -4537 -22380 -2286 7998 -22143
2833 -22143 -21841 -4589 -7629 -8948 -12957 4336 22338 -13367 -21195 1158 17964 -2269 -13489
2820a3489j0317M1957K7014j4977l7977l6821k5611j412K7879M7113K4772k3845
2808D286l3739J9826J4500l322J943j7388N156J0956k441N075K3062l2991l5079
2795d0156L2650R508j6420k1074J687R105p467J0150K843N68m792j3484J4176
2782b2706J3337k34J0298J193k91j4808J0844J3371n364J0080q962N101l364k1802
2768a3307J3806Q71j4319r709J3135R758Q484j0718j9454j8516r746q315J7889
2755d0141J369l656k644p617K4912L7595K2310r779k2457m623m570j2637N2K4306
2741B420m310J1983j3988k6543R477M846R554j565J0208J0354k7524k2130R648
2728b7570K3045L7061Q256l0543p980N750J118K0422M651P485K490J9225j2944
$$ plain form
2820 -13489 -23806 18151 45165 30188 -7789 -44610 -70221 -71633 -43754 3359 28131 4286
2808 4286 -29453 -9627 4873 1551 3494 -13894 -8738 2218 -223 4852 27914 -5077 -40156
2795 -40156 -7506 2002 -14418 -35492 -33805 -24700 -32167 -22017 -19174 -18606 -23398 -36882 -22706
2782 -22706 -9369 -9603 695 1888 1597 -13211 -2367 11004 5640 15720 6758 11859 8495 -13307
2768 -13307 499 1370 -12949 -22658 -9523 235 8719 -1999 -21453 -39969 -49715 -58030 -40141
2755 -40141 -38772 -42428 -45072 -52689 -27777 9818 32128 22349 -108 -4731 -9301 -21938 -21886 2420
2741 2420 -1890 10093 -3895 -30438 -20961 -16115 -6561 -8126 2082 12436 -15088 -37218 -27570
2728 -27570 -4525 32536 40792 10249 2269 8019 9137 29559 34210 41695 44185 63410 50466
2715E0466k4559l3898n328J3536m279K12M6173L5097j4362k0836k4643m2373n046
2702b9840q199J5005K5848J2468J9445p867j7488p796j9093j4855K5690m175J2364
2689A507Q081k94L95j8275n759J7253J4514m205j7321j0124Q896J3731l0267l2993
2675e4861m997L3666J5530N334K113j4354J1710L320Q024O255j998K1259J199
2662C2200k00p970k6228j972p062k3675M284K5254j1398j2806R806l389j1640
2649c4796L679n023Q639o788m785L537K6331J4989n563p537L4128O535k1678l4485
2635b2817k626K0484J3546k090J110p500J6933J544p858k754r694n130p154P22
2621a3284o249P008j4206l1186j5214J1952L6391O058n120j3935L7390L4966j7595
$$ plain form
2715 50466 25907 -7991 -13319 217 -4062 -3850 42323 77420 63058 42222 17579 -24794 -29840
2702 -29840 -38039 -23034 2814 15282 34727 26860 9372 1576 -17517 -32372 -6682 -10857 1507
2689 1507 9588 9294 9689 -8586 -14345 2908 17422 13217 -4104 -14228 -5332 8399 -21868 -54861
2675 -54861 -59858 -26192 -10662 -5328 -3215 -17569 -5859 -2539 5485 11740 9742 31001 32200
2662 32200 32000 24030 -2198 -4170 -11232 -34907 -30623 -5369 -16767 -29573 -19767 -23156 -34796
2649 -34796 -31117 -36140 -27501 -34289 -39074 -35537 -9206 5783 220 -7317 26811 33346 11668 -22817
2635 -22817 -25443 -4959 8587 6497 7607 107 17040 18584 10726 7972 -1722 -6852 -14006 -13284
2621 -13284 -19533 -12525 -26731 -57917 -73131 -61179 -24788 -18730 -23850 -37785 -395 34571 16976
2608A6976m4675J1014K1979P594L2502J4223k2428m0640m3220J0230J2441J9692
2596d312J8169l406N555l8175J9311K701m706L5830p009j9595n263j1643p813
2583b0356m15L864p100K1201M8807Q273l1375k2384l6167j794L0736K4855l766
2570A4379k7076j5832P900N866J7548j34K7534J0384k2571k0213p76J9636o3k0456
2556c874k1946J3126J5857O280q633k0623j7804l191L685O925l219M690N222J4241
2542i264J9361J7657j6833l016L162J9798M581l2173M861K4335M445k524q311
2529B6079r315M677k4045R324L315K7418j0222m2254J2842K7343q034l92K2580
2516C9316K773k2191j2257L19k374j4613k443o549M319L9749O492q715M705k643
$$ plain form
2608 16976 -27699 -16685 5294 12888 45390 59613 37185 -3455 -46675 -36445 -24004 -4312
2596 -4312 13857 10451 16006 -22169 -2858 -157 -4863 30967 23958 4363 -900 -12543 -20356
2583 -20356 -20771 -16907 -24007 -2806 46001 54274 22899 515 -35652 -37446 -6710 18145 14379
2570 14379 -12697 -28529 -20629 -14763 2785 2651 30185 40569 17998 -2215 -2991 16645 16582 -3874
2556 -3874 -25820 -12694 3163 9443 810 -19813 -37617 -40808 -37123 -30198 -33417 -28727 -23505 -9264
2542 -9264 10097 27754 10921 7905 11067 30865 35446 3273 8134 32469 36914 34390 26079
2529 26079 16764 21441 -2604 6720 10035 37453 27231 -15023 -2181 25162 17128 16736 39316
2516 39316 42089 19898 7641 7960 5586 -9027 -11470 -18019 -13700 26049 32541 23826 28531 25888
2502B5888k1119j1966j4836J3908L0791o974k1688l5686M2334K455J1101m471
2490I737j6267M626m444O591n596K1745Q689k7808k5564J8944j0820P481K5165
2477A2479M906k8680k9000j4654J7721L6657O825K491L313j1776M368N235n132
2464D753l995j0837K175m699j600J2532J645j497j4801R062l911P700j8051o683
2450b8207L2346Q239Q70J932j9664r207r617q471M3644J8243J2867j7900Q024
2437C3099O861j3901j0950j6498l88J8231L882j0716J0017j0765L42l516p818
2424b120r777M614j5359k0918K3875K625k103J6199K6609J8287j5972j0552J5173
2411C0581R23K22j4628k3453m000J9650K6282J8068j7402j4205K4347n138j3406
$$ plain form
2502 25888 4769 -7197 -22033 -8125 22666 15692 -5996 -41682 652 3107 14208 9737
2490 9737 -6530 -1904 -6348 243 -5353 16392 25081 -2727 -28291 -9347 -20167 -12686 12479
2477 12479 17385 -11295 -40295 -54949 -37228 -571 6254 8745 12058 282 4650 9885 4753
2464 4753 758 -10079 -7904 -12603 -14203 -1671 -26 -1523 -16324 -7262 -11173 -3473 -21524 -28207
2450 -28207 4139 12378 13248 15180 -4484 -13691 -23308 -31779 11865 30108 42975 25075 33099
2437 33099 39960 26059 15109 -1389 -1777 16454 20336 9620 19637 8872 9214 5698 -2120
2424 -2120 -11897 -7283 -22642 -43560 -19685 -17060 -19163 -2964 23645 41932 25960 15408 30581
2411 30581 31504 31726 17098 -6355 -10355 9295 35577 53645 36243 22038 46385 41247 27841
2398B7841J5379r301n7355j2333O81o99M5470M2619k2790N875M833j4804K035
2385B7451k5862J5230m133P02l2782J0885p869K4195K8945o240k5074q403P626
$$ plain form
2398 27841 43220 33919 -23436 -35769 -35088 -35787 9683 52302 29512 35387 40220 25416 27451
2385 27451 1589 16819 12686 13388 -19394 -8509 -16378 7817 36762 30522 5448 -2955 4671
$$ [...]
##END NTUPLES=NMR SPECTRUM
##END=
