##TITLE=Analysis number 307973
Compound Code mo 07396
Book Reference 414/74/1
Project Code adrs
Chemist Name mattw
##JCAMPDX= 6.0         $$ Bruker NMR JCAMP-DX V2.0
##DATA TYPE= NMR SPECTRUM
##DATA CLASS= NTUPLES
##ORIGIN= Bruker BioSpin GmbH
##OWNER= NMR
$$ XWIN-NMR		Version 3.5
$$ Wed May 18 12:38:53 2005 GMT Daylight Time (UT+1h)  MAYBRIDGE\NMR@NMR_250MHZ
##.OBSERVE FREQUENCY= 250.131544655141
##.OBSERVE NUCLEUS= ^1H
##.ACQUISITION MODE= SIMULTANEOUS (DQD)
##.ACQUISITION SCHEME= undefined
##.AVERAGES= 16
##.DIGITISER RES= 18
##SPECTROMETER/DATA SYSTEM= dpx250
##.PULSE SEQUENCE= zg30
##.SOLVENT NAME= DMSO
##.SHIFT REFERENCE= (INTERNAL, DMSO, 0, 16.522)
##AUDIT TRAIL= $$ (NUMBER, WHEN, WHO, WHERE, WHAT)
$$ ##TITLE= Audit trail, XWIN-NMR		Version 3.5
$$ ##JCAMPDX= 5.01
$$ ##ORIGIN= Bruker BioSpin GmbH
$$ ##OWNER= NMR
$$ C:\u/data/dgb/nmr/ADRS/3110/pdata/1/auditp.txt
$$ ##AUDIT TRAIL=  $$ (NUMBER, WHEN, WHO, WHERE, WHAT)
(   1,<2005-05-18 12:38:17.23 +100>,<MAYBRIDGE\NMR>,<NMR_250MHZ>,
      <created by zg, POWCHK disabled, PULCHK disabled
       configuration hash MD5:
       62 19 C7 07 E1 42 D1 B7 37 6C 3D D0 77 39 F9 E6
       data hash MD5: 64K
       35 62 E3 CD B5 ED 8E E2 FF 37 A3 8A B8 3E E5 7C>)
(   2,<2005-05-18 12:38:32.51 +100>,<MAYBRIDGE\NMR>,<NMR_250MHZ>,
      <Start of raw data processing
       ef LB = 0.3 FT_mod = 6 PKNL = 1 SI = 32K 
       data hash MD5: 32K
       70 81 F6 57 B1 6A 30 CC 37 08 73 D4 C2 22 23 74>)
(   3,<2005-05-18 12:38:38.76 +100>,<MAYBRIDGE\NMR>,<NMR_250MHZ>,
      <apk 
       data hash MD5: 32K
       25 1F AE 7D 4B 50 BC 0C F7 11 B2 5F 48 4D D7 A9>)
(   4,<2005-05-18 12:38:40.56 +100>,<MAYBRIDGE\NMR>,<NMR_250MHZ>,
      <abs ABSG = 5 
       data hash MD5: 32K
       52 5B 80 71 AA E1 F6 22 C1 0C 8C 36 6E 45 E2 72>)
$$ ##END=
$$ 
$$ hash MD5
$$ 9F 2A 4C F0 69 EE 64 ED 9C 81 BD 51 AF F0 B7 84
##$RELAX= 
##$RELAX= 
##$RELAX= 
##$RELAX= 
##$RELAX= 
##$RELAX= 
##$RELAX= 
$$ Bruker specific parameters
$$ --------------------------
##$DU= <C:\u>
##$EXPNO= 3110
##$NAME= <ADRS>
##$PROCNO= 1
##$TYPE= <nmr>
##$USER= <dgb>
##$AMP= (0..31)
100 100 100 100 100 100 100 100 100 100 100 100 100 100 100 100 100 100 
100 100 100 100 100 100 100 100 100 100 100 100 100 100 
##$AQSEQ= 0
##$AQ_mod= 3
##$AUNM= <au_zg>
##$AUTOPOS= <29 >
##$BF1= 250.13
##$BF2= 250.13
##$BF3= 250.13
##$BF4= 250.13
##$BF5= 500.13
##$BF6= 500.13
##$BF7= 500.13
##$BF8= 500.13
##$BYTORDA= 1
##$CFDGTYP= 0
##$CFRGTYP= 5
##$CHEMSTR= <none>
##$CNST= (0..31)
1 1 145 1 1 1 1 1 1 1 1 1 1 1 1 1 1 1 1 1 1 1 1 1 1 1 1 1 1 1 1 1 
##$CPDPRG= <>
##$CPDPRG1= <>
##$CPDPRG2= <>
##$CPDPRG3= <>
##$CPDPRG4= <mlev>
##$CPDPRG5= <mlev>
##$CPDPRG6= <mlev>
##$CPDPRG7= <mlev>
##$CPDPRG8= <mlev>
##$CPDPRGB= <>
##$CPDPRGT= <>
##$D= (0..31)
0 1 0 0 0 0 0 0 0 0.06 0 0 0 0 0 0 0.0002 0 0 0 0 0 0 0 0 0 0 0 0 0 0 
0 
##$DATE= 1116416296
##$DBL= (0..7)
120 120 120 120 120 120 120 120 
##$DBP= (0..7)
150 150 150 150 150 150 150 150 
##$DBP07= 0
##$DBPNAM0= <>
##$DBPNAM1= <>
$$ [...]
##$SUBNAM7= <"">
##$SUBNAM8= <"">
##$SUBNAM9= <"">
##$SW= 20.6930455092707
##$SWIBOX= (0..15)
0 0 3 0 0 0 0 0 0 0 0 0 0 0 0 0 
##$SW_h= 5175.983436853
##$TD= 65536
##$TD0= 1
##$TE= 295.16
##$TE2= 300
##$TE3= 300
##$TEG= 300
##$TL= (0..7)
0 120 120 120 120 120 120 120 
##$TP= (0..7)
150 150 150 150 150 150 150 150 
##$TP07= 0
##$TPNAME0= <>
##$TPNAME1= <>
##$TPNAME2= <>
##$TPNAME3= <>
##$TPNAME4= <>
##$TPNAME5= <>
##$TPNAME6= <>
##$TPNAME7= <>
##$TPOAL= (0..7)
0.5 0.5 0.5 0.5 0.5 0.5 0.5 0.5 
##$TPOFFS= (0..7)
0 0 0 0 0 0 0 0 
##$TUNHIN= 0
##$TUNHOUT= 0
##$TUNXOUT= 0
##$USERA1= <user>
##$USERA2= <user>
##$USERA3= <user>
##$USERA4= <user>
##$USERA5= <user>
##$V9= 5
##$VALIST= <valist>
##$VCLIST= <CCCCCCCCCCCCCCC>
##$VD= 0
##$VDLIST= <DDDDDDDDDDDDDDD>
##$VPLIST= <PPPPPPPPPPPPPPP>
##$VTLIST= <TTTTTTTTTTTTTTT>
##$WBST= 1024
##$WBSW= 4
##$XGAIN= (0..3)
0 0 0 0 
##$XL= 0
##$YL= 0
##$YMAX_a= 548264
##$YMIN_a= -654763
##$ZGOPTNS= <>
##$ZL1= 120
##$ZL2= 120
##$ZL3= 120
##$ZL4= 120
##$ABSF1= 16.522
##$ABSF2= -4.171173
##$ABSG= 5
##$ABSL= 3
##$ALPHA= 0
##$AQORDER= 0
##$ASSFAC= 0
##$ASSFACI= 0
##$ASSFACX= 0
##$ASSWID= 0
##$AUNMP= <proc_1d>
##$AZFE= 0.1
##$AZFW= 0.1
##$BCFW= 0
##$BC_mod= 0
##$BYTORDP= 0
##$COROFFS= 0
##$CY= 12.5
##$DATMOD= 1
##$DC= 0
##$DFILT= <>
##$DTYPP= 0
##$F1P= 14.0000005364418
##$F2P= -0.99999901652339
##$FCOR= 0.5
##$FTSIZE= 32768
##$FT_mod= 6
##$GAMMA= 0
##$GB= 0
##$INTBC= 1
##$INTSCL= 1
##$ISEN= 128
##$LB= 0.3
##$LEV0= 0
##$LPBIN= 0
##$MAXI= 10000
##$MC2= 0
##$MEAN= 0
##$ME_mod= 0
##$MI= 0
##$NCOEF= 0
##$NC_proc= -5
##$NLEV= 6
##$NOISF1= 0
##$NOISF2= 0
##$NSP= 0
##$NTH_PI= 0
##$NZP= 0
##$OFFSET= 16.522
##$PC= 1
##$PHC0= -87.90559
##$PHC1= 15.20225
##$PH_mod= 1
##$PKNL= yes
##$PPARMOD= 0
##$PSCAL= 4
##$PSIGN= 0
##$REVERSE= no
##$SF= 250.13
##$SI= 32768
##$SIGF1= 0
##$SIGF2= 0
##$SINO= 400
##$SIOLD= 32768
##$SREGLST= <1H.DMSO>
##$SSB= 0
##$STSI= 32768
##$STSR= 0
##$SW_p= 5175.98343685301
##$SYMM= 0
##$S_DEV= 0
##$TDeff= 65536
##$TDoff= 0
##$TI= <Analysis number 999999
Compound Code 99
Book Reference 9
Project Code 9>
##$TILT= no
##$TM1= 0
##$TM2= 0
##$TOPLEV= 0
##$USERP1= <user>
##$USERP2= <user>
##$USERP3= <user>
##$USERP4= <user>
##$USERP5= <user>
##$WDW= 1
##$XDIM= 32768
##$YMAX_p= 511837994
##$YMIN_p= -619930
$$ End of Bruker specific parameters
$$ ---------------------------------
##NTUPLES= NMR SPECTRUM
##VAR_NAME=  FREQUENCY,     SPECTRUM/REAL,   SPECTRUM/IMAG
##SYMBOL=    X,             R,               I
##VAR_TYPE=  INDEPENDENT,   DEPENDENT,       DEPENDENT
##VAR_FORM=  AFFN,          ASDF,            ASDF
##VAR_DIM=   32768,         32768,           32768
##UNITS=     HZ,            ARBITRARY UNITS, ARBITRARY UNITS
##FACTOR=    0.157963299565203, 1,           1
##FIRST=     4132.6476996994, 0,             0
##LAST=      -1043.33573715361, 0,           0
##MIN=       -1043.33573715361, -619930,     0
##MAX=       4132.6476996994, 511837994,     0
$$ Real data points
##PAGE= N=1
##DATA TABLE= (X++(R..R)), XYDATA
$$ [...]
25432 -11843 -34510 -21086 -241 -6740 -51658 -78516 -84024 -41512 -1523 92325 36390 -48179
25420 -48179 -22881 4041 12877 -33243 -37933 -61904 -22510 -44288 -73612 -59195 -72722 -51726
25408 -51726 -86812 -86969 -70325 -7147 -39193 -43351 -14041 -42375 -99577 -101591 -58746 -33398
25396 -33398 -51844 -49313 -31202 -69134 -72005 -25856 -29078 -56180 -4542 41351 16557 21568
25384 21568 15737 25535 5090 -32949 -31396 -10240 33957 29864 -23298 -46245 -1579 -27341
25372 -27341 -32852 29083 67224 95008 80289 41202 -31617 -58228 -35997 -18917 -12691 27777
25360 27777 30313 37259 53016 65467 61334 40764 61311 85104 110099 92385 43181 -13849
25348 -13849 -39053 -63473 -108708 -70344 -9408 -4788 29277 -44418 -81822 -62293 -39822 47897
25336 47897 75660 45286 17829 -24292 -9635 48514 93444 121367 93144 48267 5441 -9986
25324 -9986 -7282 -53332 -93021 -87151 -17745 -3490 -47908 -63586 -38751 -40847 -35374 -47550 -29106
25311 -29106 33304 66720 73657 26435 -55768 -124466 -81142 -32527 36865 28106 31916 18701
25299 18701 -4542 -63095 -29126 -19776 24833 40200 24225 46777 64378 23369 31752 59708
25287 59708 100113 107529 64272 11151 -9340 -11123 -31138 -34990 -24923 37513 37530 23943 -10140
25274 -10140 -73891 -62863 26922 -4215 -55538 -62691 -59275 -10134 51618 79605 90492 56892
25262 56892 5608 18572 55827 79782 104371 113753 84050 54399 15792 40089 -10721 -7014
25250 -7014 -23330 -9527 -3747 -2931 29261 44064 10575 -8304 -13928 5654 36795 40205 39919
25237 39919 -3888 -21868 11240 53225 48499 19791 -12515 -32422 -42065 -120791 -161261 -128183
25225 -128183 -87381 -56525 2635 48810 62788 31475 5313 15775 14116 23674 8715 -14315
25213 -14315 -6677 20448 527 2977 -14327 -33836 -38850 -62796 -29930 26215 5588 -46058
25201 -46058 28765 54406 49916 -9191 -25935 -9459 -42923 -25273 28120 5727 -8665 -35049
25189 -35049 -97050 -128615 -134041 -100611 -89671 -84423 -58309 -43903 -56267 -6790 62084 69997
25177 69997 76558 73552 38835 54525 64509 51120 -16519 -21835 -25430 -27164 9679 -5780 -52073
25164 -52073 -60920 -46009 -89071 -106348 -51860 7256 11706 -4932 8744 71244 83806 57948
25152 57948 21574 7607 -13492 19841 -6645 -19769 -50317 -10693 32916 48404 -927 -21584
25140 -21584 -55702 -85044 -90678 -77406 -70064 -68691 -64845 -84071 -110244 -91431 -95326 -81394 -54180
25127 -54180 -94622 -61230 -44132 -5633 31715 6667 27533 48930 38340 -2693 -11560 5045
25115 5045 -16436 -26709 17026 58059 45464 13527 -21255 -60351 -40648 -2529 1010 9222
25103 9222 -6275 -41108 -50801 2284 60738 85950 57898 17529 22015 56814 62687 46822
25091 46822 26617 36502 25443 -7732 -43848 -53376 -24766 -38081 -39772 4963 65787 72505
25079 72505 89002 93217 1773 -47217 -25485 6028 41400 27149 16836 32537 1408 -26440
25067 -26440 -38772 -33783 -92043 -113008 -59893 12620 10555 -16674 -19309 3002 2039 -11890 -58877
25054 -58877 -80749 -121504 -58136 -27338 -1926 33299 20408 -30252 -27651 -85373 -43717 29800
25042 29800 16390 -8250 -7681 41815 18947 21318 10880 -15987 -4651 33704 7178 1046
25030 1046 -13287 -28262 -44141 -38065 -27727 11470 19720 -3453 -46350 -27108 31599 8254
25018 8254 43901 31588 -30156 -43203 -64462 -65145 -46503 18855 95496 139711 98475 12063
25006 12063 -39216 -94494 -96740 -61825 -67725 -59621 -39279 -51397 -75943 -37724 4029 -42739
24994 -42739 -37969 -13139 6959 32101 4586 -5718 -43381 2812 6598 -33279 6288 46791
24982 46791 21854 42930 74714 47469 -42899 -33030 20226 50143 58060 48077 87409 77572
24970 77572 81233 63283 37661 10858 -51541 -44211 -26221 -29993 -46140 -71763 -72576 -172 10750
24957 10750 -12755 9768 34327 -41846 -75963 -79506 -30719 57401 67440 16325 -20891 -32932
24945 -32932 -72154 -76723 -39938 -57220 -100318 -131867 -113228 -56749 -8979 12671 60950 71038
24933 71038 22157 6185 26315 40568 59777 99085 158269 145290 57332 -22511 -57458 -49576
24921 -49576 -1620 -7343 4780 48653 22856 32483 27671 17796 21853 -13423 -13289 -31729 10577
24908 10577 75726 74689 60734 42137 24393 -9043 -19861 -12883 -19135 -21703 -65375 -26878
24896 -26878 45120 64146 15513 -24633 -20058 -11989 45637 110626 101201 78322 19890 -26717
24884 -26717 -43887 -7608 45218 45955 14412 -1192 -17986 -26829 -63798 -54600 -53804 -63579 -17475
24871 -17475 18017 43642 55368 79233 45973 53861 2418 -45647 -66214 -65306 -70003 -40010
24859 -40010 -43434 -64060 -72075 -63723 -77339 -71250 -53794 -44747 20262 -5511 -28484 -14703 32579
24846 32579 -7653 -56105 -10546 -20664 18825 10991 -59787 -78924 -87550 -102817 -65122 -60406
24834 -60406 -67345 -101340 -154299 -125288 -57480 -72943 -70881 -19809 7018 -4503 -22045 -6917
24822 -6917 5372 17122 69552 83715 107610 113880 85885 56302 11285 838 -7153 -7071 -24335
24809 -24335 -61076 14812 110252 148463 133081 104472 74509 87014 8825 -36009 -42119 -88472
24797 -88472 -91673 -87376 -65572 -26419 -22508 9873 -29653 -55370 -16833 -52630 -39844 -483
24785 -483 58595 83039 69261 53894 73076 97639 60592 55626 93688 101350 131187 104501
24773 104501 88872 98107 104439 93966 77933 81990 65567 15120 12693 34092 52003 26675
24761 26675 47577 55663 53752 52295 50407 15232 -47073 -71137 -49694 -59780 -86700 -53246
24749 -53246 23720 13741 -2601 -28549 -72540 -37625 -15423 -1636 27068 26493 17304 -4457
24737 -4457 51228 62649 26772 -9710 18561 51649 22380 -10392 -76467 -91342 -49917 -30870
24725 -30870 -26796 -63879 -114160 -128545 -145405 -107988 -87141 -20973 -20195 -31558 -53803 -43962
24713 -43962 -54727 -64359 -63791 -19714 17819 38361 -5590 -45294 -11303 -4626 20160 3239
24701 3239 -28826 9821 75089 86140 57171 52389 25540 83376 74589 48688 -2224 -29877
24689 -29877 -16535 3003 43390 41233 101539 112317 -4503 -45334 -21790 -23782 -50596 -60790
24677 -60790 -73562 -83028 -56436 -12471 36672 30314 39898 -1724 -36452 -53889 -69795 -89684
24665 -89684 -97882 -97911 -75928 -76129 -41837 -53966 -25400 -40916 -52819 -35312 -48121 -39916 -85278
24652 -85278 -69473 -28537 -5269 12383 59211 108229 93562 65573 7122 25839 18960 -14483
24640 -14483 -10219 41551 41650 89696 59205 35871 -2444 -52545 -21496 -5624 62610 77611
24628 77611 31991 -7724 -47212 -85075 -104868 -70181 -39148 -23952 -19449 -10989 -27674 -25585
24616 -25585 21087 31538 -355 12538 37393 -3599 -7127 7116 -43901 -35813 -27867 31688
24604 31688 59918 62672 45939 37947 -49687 -38723 36277 13127 62058 65337 62357 12222
24592 12222 -13927 -39206 -47784 -58899 -67152 -30091 42932 86221 45858 -11626 -6424 -28996
24580 -28996 -26074 -23669 -73314 -96598 -67715 -42469 -57194 10755 56082 43150 23008 461
24568 461 -26550 -27777 13321 -5706 -31974 -41643 -26276 13733 -16603 -93529 -142661 -125342
24556 -125342 -23220 -542 -31441 -18805 19305 11684 -28896 929 17558 -463 -5682 -17135
24544 -17135 5144 11954 -16877 6709 -3526 -36822 -41184 -49091 -98356 -88348 -64399 -79191
24532 -79191 -78176 -71149 -11889 52312 64968 44830 27882 -56155 -87188 -44808 8905 58297
24520 58297 70214 36594 -29849 -78121 -101454 -46158 -21275 -3934 38800 53193 4693 14056
24508 14056 36201 -8671 -46817 -64745 -64115 -39724 -47052 -63738 -50307 -43520 2120 35789
24496 35789 38328 40942 37951 68441 70454 103217 95309 48850 -22560 -2480 33628 20197 -22218
24483 -22218 -29739 -4575 -37639 -49776 -12134 -39076 -63265 -63584 -65255 -37643 18941 -2920
24471 -2920 -58766 -36161 62431 89111 43448 61276 57228 64268 56045 31403 -15541 -20703 5247
24458 5247 29731 57220 20216 21732 8742 -30803 -2419 15553 35692 39266 19118 42309
24446 42309 46062 -414 26092 37273 -9894 -31462 -36737 -18915 27940 37619 -12825 -2699
24434 -2699 18883 15162 -34543 -45193 -19543 -39949 -86717 -62433 -64037 -20999 -11129 34581
24422 34581 7657 10555 -27960 -43233 3605 -11815 -14149 22994 32751 91232 80430 40866
24410 40866 21397 11727 32202 27671 17653 10606 47097 22942 29079 74644 92368 83037 60807
24397 60807 15529 2416 65514 9100 -66645 -65011 -25095 -731 -4261 1118 7887 7473 10805
24384 10805 22039 77179 99809 62675 28400 -10015 24739 39508 60234 74143 78839 21121
24372 21121 -3347 -6330 5984 49277 76235 24440 26624 12040 2867 -20312 -28062 -31134 -21923
24359 -21923 1798 31260 131972 133933 106191 63652 43086 1343 -27076 47142 78391 95844
24347 95844 70831 45383 64726 54279 -2461 4802 21025 21969 19521 -26481 -58690 -49790 -43145
24334 -43145 35658 63933 19210 115 -186 -38070 -69698 -79455 -31953 -16913 -8080 64718
24322 64718 40387 -72795 -103631 -46999 -37346 -45570 -44888 -36537 -54821 -29187 33030 53001
24310 53001 44942 17237 19481 7119 -27874 -71326 -88571 -95358 -76526 -57453 -55407 -52418 -6360
24297 -6360 37716 12085 -36083 -85902 -67806 -73489 -79799 -48625 -75011 -104956 -43252 18108
24285 18108 26666 -14488 -38473 -944 6765 23589 9081 -37247 -30338 -37832 -20406 7219
24273 7219 12931 -4072 -2350 18924 37917 -4676 -18509 -18426 -16112 -16700 1354 7367 11334 44082
24259 44082 21246 21123 -4560 -7115 16768 42880 54199 42975 -19884 -27867 3554 16172
24247 16172 38656 -26945 -65794 -40171 -69460 -87762 -68151 -55715 -38598 -42203 4577 -15262
24235 -15262 -73252 -108061 -106402 -62420 -38658 -52782 -86976 -23892 11915 -24145 -12465 -27998
24223 -27998 17651 12221 10299 30314 56124 59877 -22706 -96639 -73605 -61746 -10102 4898
24211 4898 36270 6094 9694 69529 85019 70786 65478 64995 39959 36222 37262 30429 67256
24198 67256 33828 -3120 40838 34083 46595 53202 25233 31907 45339 37585 -6761 -2883 19219
24185 19219 39530 41897 -9426 -42199 -23342 -38290 -28348 -33868 -20245 36092 41963 30355
24173 30355 -40748 -48768 -21211 -37809 -64718 -77150 -87890 -40580 10979 54760 51473 20324
24161 20324 -39079 -8590 -50399 -61104 18379 26118 42849 26706 11867 12635 -66872 -88301
24149 -88301 -72760 -23711 49146 86618 5952 -75278 -91193 -77320 -53551 -51907 -19932 -34604
24137 -34604 -52179 -57419 -83422 -98044 -58436 -62666 -30600 -38858 -34504 9187 14525 15915 -57291
24124 -57291 -83552 -43780 4535 13294 33341 25789 -16724 -48807 -32286 -11993 6134 -2044
24112 -2044 8652 8578 39751 53664 22725 -21507 -76473 -52829 -30214 -28630 -51136 -63615 -58562
24099 -58562 -87558 -55036 -11628 -31142 -63912 -49839 5333 38392 40224 29831 17880 -9799
24087 -9799 67548 100074 55892 26072 36212 69137 70329 88050 63464 41721 50703 77422
24075 77422 83701 71826 103541 77341 33453 27014 20090 40458 243 -34498 -54826 5430
24063 5430 72868 63419 23819 -7922 -44407 -24454 -22721 4527 27491 -1228 -65221 -115198
24051 -115198 -112132 -49767 -6428 -16028 8815 49283 21258 27216 -15618 -29677 22204 22935
24039 22935 -11178 -53801 9579 59297 -3653 -45334 -114624 -139520 -110370 -77958 -75497 -97324
24027 -97324 -106002 -56707 -32751 -54785 -123860 -131008 -95295 -30454 16663 -13500 -2249 -44362
24015 -44362 -50177 6321 66860 72720 43827 26127 -5095 -64147 -97933 -97184 -79320 -69378 -42203
24002 -42203 -7011 21047 74392 113165 93896 51250 -6470 -40798 -20241 12331 14543 19833
23990 19833 10353 5322 -11742 -45057 -36815 -67766 -124515 -81606 -10328 20331 91456 137278
23978 137278 132896 117128 67156 36338 24040 29339 30125 17805 -1079 -7408 -36334 -29953 -32514
23965 -32514 -44154 -72792 -32004 17674 72000 94302 75406 60785 21514 -27122 -45700 -41234
23953 -41234 -55058 -15378 39590 43156 -22030 -35576 -19182 -27510 35005 31063 -1121 -12353
23941 -12353 6037 2652 27526 -40700 -45242 -29457 914 5976 -894 -11971 -19016 6141 -31968
23928 -31968 6652 64181 138995 105827 31209 3543 -18308 6844 46675 23640 -44163 -46711
23916 -46711 -10410 19851 -13537 -6221 -40235 -72157 -90379 -106031 -78257 -54831 -14806 -7207
23904 -7207 13486 25878 15034 37777 25702 -7218 -63829 -106554 -126827 -116392 -66353 -21414
23892 -21414 -49428 -35217 -15016 -18264 -19887 -19506 8892 -3213 -20153 -29681 -35908 32701 4669
23879 4669 -39920 -58636 -50343 -81189 -49470 -85631 -95746 -47385 -28689 -58382 -86369 -96293
23867 -96293 -44262 -8689 -53814 -123834 -129473 -54441 17294 -11260 -21893 -17136 17701 59243
23855 59243 38456 -25902 -64762 -42897 -47546 -27945 3925 -39457 -108602 -123759 -37828 -26234
23843 -26234 -5620 -13931 -33345 -11577 2719 912 -34151 -21914 -38562 -32865 7517 -12969
23831 -12969 -65114 -18773 27359 13561 34831 43659 5937 19399 15642 -16451 -21733 -27237
23819 -27237 -43023 -55868 -61195 -93687 -42785 -28193 -28274 -25134 -19462 -21171 -52910 -1364 4318
23806 4318 -13857 -25288 -42984 -43217 -27084 -44125 -30863 -58871 -105224 -93956 -57602 -15376
23794 -15376 6023 -12353 -52008 -25326 1277 -13353 -34747 -20497 26614 57693 55288 45914
23782 45914 20221 -69077 -55849 -55644 -63314 -69853 -84999 -111209 -88134 -66018 -84466 -67489
23770 -67489 -43938 -7070 26349 19955 52928 105403 91527 51558 12916 6340 -15949 -66285
23758 -66285 -67723 24234 66846 12729 12241 -4249 -76903 -63800 -59157 -66068 -68052 -92143 -77638
23745 -77638 -36155 -68304 -39630 1445 27203 -60912 -109661 -70888 7651 25453 49073 6453
23733 6453 -40920 11285 81951 100729 100053 109860 108988 64084 29154 33510 37417 82561 80619
23720 80619 90639 66980 43799 14924 -12665 -3334 -37763 -15682 -43439 -21898 7736 6979
23708 6979 -7232 -8763 -9834 13920 4868 -5850 -10420 -36226 -46909 16101 30200 -17771 -45572
23695 -45572 -28319 -62257 -74704 -67991 -112050 -116568 -136185 -100858 -148639 -148328 -72503 -65647 -65385
23682 -65385 -13646 33476 -21316 -21431 -77844 -96676 -94933 -72385 -36943 -41431 -65177 -39946
23670 -39946 -10271 64547 45788 5038 -16718 -47507 -9728 50384 71918 53846 -16014 -38307
23658 -38307 16615 58901 73067 62126 55159 -9450 -59166 -50718 -12000 -7467 11582 56188
23646 56188 44192 41561 34803 -19448 -62757 -43928 2612 69873 54751 23700 14262 8845
23634 8845 14429 1730 7435 23419 36711 31938 42807 13838 -31966 -41242 -45980 -22323 -37611
23621 -37611 -84023 -9866 28550 -11228 -33792 -1485 20604 -8061 -41689 -50927 -50788 -63263
23609 -63263 -58293 -55174 -112819 -55823 -14627 -19534 -67554 -62515 -78070 -45391 2907 -10551
23597 -10551 10552 3625 -72840 -60232 5376 -12104 16796 89880 102115 76742 35708 50157
23585 50157 51595 35212 43627 58772 27383 7275 -1639 48676 106582 71867 -15064 -48792
23573 -48792 -46885 -39411 -32959 -16126 -7497 -8097 38720 15934 -21058 -820 23822 -5861 -50531
23560 -50531 -58956 -47911 19300 30989 35058 41580 12596 -11536 -7134 4396 -47236 -69263
23548 -69263 -55997 -52485 -78464 -71169 -28634 -20663 -62561 -49463 -59173 -61157 -23636 -29123 -35550
23535 -35550 -28802 -7586 -64028 -98837 -82116 -80097 -108579 -119567 -105267 -50513 -35587 5234
23523 5234 49246 95850 89493 28322 -13244 -42283 -24325 -43897 -45904 -76570 -38723 5791
23511 5791 55149 56806 53283 12106 -53293 -80315 -62681 -17117 58168 90515 65132 29318
23499 29318 -38240 -38027 -35490 -55728 -68791 -63947 -102846 -65136 -15259 15044 45382 10829
23487 10829 -21085 -34230 -54015 -14416 2403 7482 17472 -5293 22032 54018 4989 -88489
23475 -88489 -104322 -69585 -113230 -112154 -88643 -73513 10001 -17576 -87875 -113405 -16363 25237
23463 25237 40240 7634 -33888 -29749 -18760 21970 32536 47052 100666 129011 93095 48880
23451 48880 38245 14487 36581 26944 31258 44680 2151 -33580 -13077 48896 96546 23394
23439 23394 -59221 -63066 -38799 -46994 -22193 -41035 -36987 48240 70966 45822 1104 -54411
23427 -54411 -64976 -50120 -2849 37425 23495 -19317 -15117 -36407 -60076 -40367 -70784 -97545
23415 -97545 -94364 -28928 -1198 -31099 -44316 -24211 -17350 -8255 -36130 -60051 -34231 -80
23403 -80 32604 23710 10798 4486 -16145 -23403 -20497 -38082 -56958 -60749 -86641 -120470 -99948
23390 -99948 -5420 21554 56350 51819 20679 42119 44752 15323 -10941 -39784 -35513 1087
23378 1087 35167 -27562 -73112 -70692 -74116 -77721 19873 5635 -31507 -54724 -71175 -88023
23366 -88023 -96968 -80403 -58088 -11515 -5335 16594 9014 47460 67626 63639 19258 -52769
23354 -52769 -84138 -87667 -38612 -10776 11027 3823 20322 87887 120361 84703 46148 29059
23342 29059 33366 -15039 -31994 -39087 -51288 -78383 -63762 -26627 -4943 -27796 15403 16472
23330 16472 10669 -25431 -26826 25572 32668 10494 -25191 -91209 -164096 -219871 -190406 -147080
23318 -147080 -109649 -69365 -40870 -45247 -51385 -36059 -15757 -15084 -65381 -63721 -2650 17491
23306 17491 12586 -13264 -29211 -29160 -25827 2865 13968 21409 9763 -86945 -89688 -4736 -51441
23293 -51441 -113836 -78259 -66913 -59233 -31360 23088 44416 9766 -17700 -63066 -27461 -15968
23281 -15968 30904 51885 -4916 -31563 -10001 8606 40496 68643 46048 30397 32585 5662
23269 5662 9739 59157 2155 -62059 -86413 -46954 -15270 -14003 -36673 -6585 18679 26921
23257 26921 75013 31142 -40906 -6317 49510 20070 -13520 -27288 -13874 -5089 -14377 -35829
23245 -35829 -26784 14968 6154 3244 85134 85512 49269 27964 10710 -6093 6792 52142 -23040
23232 -23040 -74009 -43081 -39684 -4914 -18029 -17776 -57267 -60806 -28522 -65724 -64871 -59680 -27906
23219 -27906 10309 35694 53187 72474 93662 57825 25843 -19554 -10657 -29659 -54489 -8562
23207 -8562 9362 -31229 -73246 -73771 -52437 -12263 60054 86503 74670 120413 112533 83350
23195 83350 60943 48488 32503 53891 65250 35530 32050 40573 18839 -2708 -20896 7922
23183 7922 -18058 -31863 23202 57756 31749 -31344 -41372 -70456 -95416 -84244 -58148 -55397
23171 -55397 -81853 -88029 -40511 -16551 -8511 22722 62278 73843 51102 44280 59900 45161
23159 45161 25070 15790 4968 13091 -14393 -46422 -30835 -8953 -26574 360 13563 7910
23147 7910 -35433 -20528 -16083 -31816 -38805 8866 88387 87296 52329 36988 20796 -22490
23135 -22490 -65980 -38429 -50901 -28094 -34019 -51182 -41263 -16959 -42181 -48620 -58468 -37066
23123 -37066 -62758 -29817 21647 32049 35694 92517 78126 43110 21367 -860 -1213 -8185
23111 -8185 37677 38845 31647 30362 -19884 -18812 -72485 -30999 29525 -22557 -73821 -94984 -79395
23098 -79395 -52720 3587 36700 -13848 -70130 -34810 26714 37112 -6149 -64917 -111955 -74300
23086 -74300 -28942 27864 42966 -2683 -29174 -35620 -12532 -9319 -40489 21480 47129 48421
23074 48421 28793 27410 6912 34501 71505 77038 33531 -28574 -49389 -23392 -13224 -54606
23062 -54606 -75913 -64608 -59648 -70100 -59507 -48925 -22670 -14504 -12731 -68289 -45511 -38978
23050 -38978 -44519 -28598 -40925 -12546 8925 46103 108450 102282 85108 70154 35432 -3209
23038 -3209 -18163 39120 75789 69859 77320 36253 -1122 -29779 -36079 -43156 -85582 -106925 -71622
23025 -71622 -40961 -36312 -14564 16814 40902 26294 -22435 -35992 -42905 -76081 -88533 -73958
23013 -73958 -85110 -107878 -24118 16010 -41995 -2413 7752 -25720 -53647 -33207 -23990 -1834
23001 -1834 48859 15660 -577 88533 79294 31590 -1979 -48033 -58018 -52173 -24341 -48177
22989 -48177 -51835 -26811 7545 51255 37522 -43982 -77572 -82644 -38558 -62551 -51130 -35243
22977 -35243 -14163 -19069 -29922 -65236 -80321 -82973 -10105 6448 -4613 -65957 -63410 -57927
22965 -57927 -55317 -66535 -66704 -46491 -32264 -76901 -99013 -113562 -101780 -134233 -152535 -119491
22953 -119491 -46751 -38210 -56253 -50287 -38946 -29752 -5942 26972 30136 -24961 -31737 -40033 -73255
22940 -73255 -83093 -55953 -36100 -61513 -75050 -49229 -37754 -25766 -34905 -32228 -22245 -27041 -78080
22927 -78080 -102365 -104268 -66949 -75216 -53444 -37640 -71988 -69380 -66669 -29376 -10882 949
22915 949 -43204 -33376 -37597 -52202 -97947 -53044 19276 47766 39477 18901 -7895 -23249 -53035
22902 -53035 -54440 14546 55773 -25389 -93400 -131458 -66963 -50680 -54234 -55574 9354 50913
22890 50913 -4268 7613 70995 58840 56329 3267 -20320 -37516 -18244 21115 87920 65620
22878 65620 68329 77866 73070 55481 29791 1685 -249 -2924 -40151 -85629 -103665 -65631 -2429
22865 -2429 -18907 -23030 33997 56392 57660 44776 24894 40828 24507 -10331 -8166 -16481 1869
22852 1869 -37621 -46210 -40475 -52757 -66258 -26965 22860 8649 -41150 -48350 -9724 27100
22840 27100 -15537 2918 51032 6976 -45382 -57650 -25822 -23565 -55417 -31950 28027 31867
22828 31867 -3202 -37158 -78294 -34753 1158 16290 21337 -5532 29030 49333 10202 -7215
22816 -7215 3054 -15765 -76168 -73790 -64655 -95945 -122953 -155425 -167455 -110571 -62795 -47096
22804 -47096 -66125 -37582 1043 35315 41194 -22058 -83283 -107143 -60218 18411 15925 -15545
22792 -15545 -55178 -74238 -62126 -19242 -40258 -47133 -10780 -9546 -31349 -40070 -37478 -3489
22780 -3489 -18013 -44413 -34507 -42735 -52526 -18770 6261 22246 -8084 2683 3704 39811 33061
22767 33061 -22423 -40672 -40432 826 33727 -4004 -29760 12688 11322 -28891 -16026 14629
22755 14629 87138 130877 140441 71732 46366 51530 54340 78670 14652 10458 48076 49505 3242
22742 3242 -48007 -8882 -40407 -15304 2164 -2010 22010 -18345 -35044 -14287 26191 13110
22730 13110 -12509 -30069 -52315 -58158 -33305 -88908 -41925 -23616 29075 51068 49551 19045
22718 19045 -31021 -56949 -29488 -17622 19359 -18655 -73277 -106436 -85664 -28936 -12411 -1955
22706 -1955 50734 64847 67712 97618 21761 -34484 -95602 -121132 -74431 -7982 20252 -11067
22694 -11067 -18868 7741 -3022 -32214 -28431 -19542 -6061 34871 14984 -63144 -80285 -29275
22682 -29275 -14072 10924 -3703 5957 -36388 -90838 -143200 -107029 -32491 -13856 -28277 -14754
22670 -14754 4771 -4530 -31863 -745 48409 43870 3251 -3514 9170 59487 44248 12254
22658 12254 -21013 -31087 -21107 -30224 -39803 -5463 15033 -34026 -77339 -62782 -24615 -28859
22646 -28859 5885 59680 53604 46007 26482 13840 10464 61252 106505 69605 54293 23366
22634 23366 -15079 -14855 -23372 2712 27542 20625 34192 53707 33575 -17801 -62190 -92084
22622 -92084 -58785 -63248 -78725 -55745 -116487 -103022 -76699 -82379 -69109 -64141 -68150 -72110 -73165
22609 -73165 23840 40307 -21376 -62565 -56281 -52700 -60636 -67078 -44530 17892 25987 2033 -30277
22596 -30277 -55005 -45550 -49768 -45322 -14762 30411 51415 17204 -13015 30657 69107 77624
22584 77624 15877 -3469 23214 -20549 -10360 -4950 -19686 -11998 20820 29609 -51442 -80692
22572 -80692 -44383 -20726 -21066 9147 17557 18655 -12588 -30427 -20877 -61949 -92416 -62542 -50402
22559 -50402 -81326 -100632 -32933 -4166 -72245 -101596 -52433 -43298 -55194 -62314 -45573 -27387
22547 -27387 -6152 24902 -1653 -29917 -64517 -26872 26741 87729 37356 -9918 6024 30252
22535 30252 20692 -25314 -23558 7885 54534 35380 -2839 -20245 9725 48775 40141 47535
22523 47535 61890 65622 97099 83639 6836 -5444 868 18357 -11705 -67775 -94035 -103664
22511 -103664 -102308 -108219 -100724 -72042 -39097 -23265 6184 -38877 -70554 -38275 -61790 -71640
22499 -71640 -60724 -102298 -152823 -111275 -66966 24016 68706 20869 -49358 -20562 20243 34819
22487 34819 -1837 -43281 -42582 -75790 -105553 -67080 39822 133290 125082 67798 59415 62770
22475 62770 39647 -25032 -4596 13444 2828 -1907 17895 15146 1460 25309 2164 -8274
22463 -8274 -29952 -39377 -11596 -24059 -46667 -727 930 2157 25600 79220 113847 102216
22451 102216 63600 20874 5374 12619 -2748 -3281 -15610 -18076 -47202 -47064 -15653 -19921 9860
22438 9860 -23764 -59765 -34762 -1286 26181 -8357 -1121 -30011 -115879 -113023 -81084 -94737
22426 -94737 -65457 -9760 -47297 -48712 -14820 -17685 -25447 -74128 -79134 -80776 -76604 -104598 -59512
22413 -59512 -22206 -16156 -3908 -13800 -25337 -74902 -92398 -56899 -46737 -27490 -15709 -40414
22401 -40414 -30053 -64765 -60113 -52207 -106309 -121540 -100508 -73375 -58028 -65227 -54187 -10610
22389 -10610 19555 17541 14723 -54079 -74141 -76013 -93463 -99605 -96174 -105930 -130135 -97440 -56501
22376 -56501 -49194 -97612 -106119 -42794 -99714 -138929 -105394 -71069 -34167 -5801 22803 3695
22364 3695 41259 66909 37632 83028 76438 82385 73318 20828 -14490 -57896 -46849 19374
22352 19374 33536 22326 7476 -1408 15493 -17898 -24432 -12671 -36522 -93402 -71647 -69135
22340 -69135 -59065 -67533 -76714 -59996 -79909 -85765 -72310 -53326 -68904 -59367 -13155 -1619
22328 -1619 39916 6839 -39006 -83014 -47413 13321 -47680 -82863 -9679 16983 5602 26928
22316 26928 41784 47326 23943 4899 -37099 -79389 -75304 -67828 -92394 -51056 -5689 1109
22304 1109 -31570 -78894 -70606 -73576 -38013 -6988 950 -48736 -88528 -104135 -121109 -64108
22292 -64108 -44954 -41832 -14959 8262 30672 63734 47387 -3867 -7185 24289 84201 55672
22280 55672 55008 27586 -14900 -21094 -26671 -14166 -37759 -17172 -8906 -41128 -48503 -11485 -28530
22267 -28530 2189 7381 19684 4329 8971 -21018 -41328 -19536 -28367 -76428 -86801 -69517
22255 -69517 -69537 -20232 -43807 -54540 -65500 -68540 -29247 -49262 -93229 -115017 -102190 -27017
22243 -27017 -17488 -38427 -48448 -64278 -39910 -77463 -67264 -68708 -42101 -37814 -52402 -91928
22231 -91928 -103573 1004 46841 33671 -2675 -73641 -111765 -93856 -72884 -82456 -64157 -51486
22219 -51486 4476 22596 19446 -11440 22222 68287 23266 17270 -4912 283 22306 3162
22207 3162 1185 27607 42042 26944 2590 15926 42146 27997 13948 11650 12348 58486 21361
22194 21361 8568 18742 -17118 -36221 -399 -10816 -2186 12907 -17176 17365 41229 35479
22182 35479 -29889 -54596 -47207 -1189 -10789 -31347 -42225 -68875 -65828 -34073 4474 -5664
22170 -5664 23578 -40711 -76865 -70939 -53418 -18026 -17222 -55685 2941 63811 18234 -3263
22158 -3263 14476 43562 -10114 -42712 -23388 -124 -3783 -15911 -34948 -79883 -49500 -9391
22146 -9391 9428 32939 -6868 -16985 -123 -16474 -45863 -97094 -55182 -36757 -41414 -62515
22134 -62515 -50161 -13900 25937 66262 73899 92616 55539 -1394 7395 -3084 -32599 -52422
22122 -52422 -37557 -78280 -88327 -53208 -51648 -16426 -28771 -46843 -24051 -11745 -35905 -8315
22110 -8315 7046 -13893 -23536 -56903 -77382 -95996 -78390 -50532 -64133 -67993 -16480 48538
22098 48538 39487 -26611 -16322 -27947 473 20859 -1095 -18077 -72734 -93668 -72996 -100553
22086 -100553 -101507 -52728 6026 36840 -22968 -50398 -7074 22699 19147 -910 12031 -31236
22074 -31236 -79157 -83244 -61185 -52773 -32282 -18459 -4573 38002 47852 17615 14178 1592
22062 1592 -20206 -50930 -21881 43862 37641 -2923 -23719 -26498 -103736 -79131 -4829 31938
22050 31938 47633 115052 66708 -157 -46994 -29099 -8204 8459 -2495 -14330 -39872 -30895
22038 -30895 -16819 15708 -24910 -12989 -26321 -17964 -50293 -88124 -101121 -97769 -60331 -39420
22026 -39420 -15452 28238 22057 34358 -14695 -35090 26242 50828 1708 35063 57447 25679
22014 25679 -9168 -38868 -20637 -45829 -52985 -36033 -11156 -11258 -46788 -66832 -57229 -6405
22002 -6405 5824 31844 41767 12314 8821 3225 4301 -29131 -67244 -23334 -34819 -72568 -98498
21989 -98498 -53122 -52506 -22931 -5861 27990 51768 26613 68682 69724 5943 -61499 -53254
21977 -53254 -3051 30668 38604 63041 60626 33615 19199 21555 43757 48462 3392 16824
21965 16824 51021 -8732 -30827 -37150 -47664 -45885 -45545 -98592 -81317 -64789 -26277 -12635
21953 -12635 -41434 -45333 -13544 -25233 -113731 -178441 -113515 -52062 -42431 -35934 -7898 11552
21941 11552 -6109 -30563 -30481 21225 19429 -62823 -89218 -51984 -15323 16005 3268 6993 12471
21928 12471 5324 14987 5038 -35371 -24219 -55151 -48290 -5046 -6245 37698 102905 43795 -28426
21915 -28426 -54917 -46454 -17967 -55858 -87775 -94160 -107480 -146797 -59298 -1103 11386 -30315
21903 -30315 -8770 -2453 -33223 -6118 -28114 -1656 -9777 -16828 -12637 -35259 -20531 -12460 -47256
21890 -47256 -29057 -1845 -26116 -7961 -2181 6718 -25291 -70208 -48232 -18306 19611 25076
21878 25076 27296 -57315 -111855 -77485 -62635 -67101 -63743 -62709 -95081 -77639 -75462 -37735 1206
21865 1206 23867 26094 30046 16370 20721 27888 41460 28695 26938 68687 61868 35593 45933
21852 45933 56836 64091 60365 33009 -45592 -64754 21958 10024 -56966 -72224 -32810 -12529
21840 -12529 21988 16949 -8725 -32704 -69162 -34851 -765 -30045 -38361 26485 20205 58369
21828 58369 77243 84209 45406 36079 51197 41577 67344 47448 16900 50145 46164 5784
21816 5784 -30037 11508 4754 -2140 -18970 5953 45796 24596 4448 33439 29065 43441
21804 43441 38257 3302 -22982 -85127 -103520 -98959 -103233 -29503 44458 10058 -15583 -7820
21792 -7820 7156 5654 -13428 21398 46899 51720 -1017 -29840 -22301 30725 7082 1181 15752
21779 15752 -34594 -69357 -47983 -21410 1400 -32914 -11579 -1768 -24585 -64479 -67665 -46204
21767 -46204 -808 11082 37268 30633 -43022 -33792 -23006 -20818 -59984 -77336 -58430 -107526
21755 -107526 -82544 -92375 -89718 -92318 -59541 -22152 -2644 -52 -53331 -81528 -113918 -68173
21743 -68173 -236 -14339 -20805 -40954 -46854 -52085 -35729 -55648 -39962 -33411 -17327 -26524 36871
21730 36871 93913 72676 24030 26924 41472 32289 15759 -34183 -55186 -43548 -63732 -120833
21718 -120833 -128064 -46994 -39753 -37762 -16073 9830 12591 31787 57051 -7052 -9949 -1349 -25150
21705 -25150 -3624 19571 52427 29642 64311 42881 -34992 -36060 -74537 -90474 -104793 -115825
21693 -115825 -132470 -168262 -180745 -125576 -45484 -18420 1918 -15236 -10562 -74550 -117819 -134499
21681 -134499 -117604 -66104 -28720 -34795 -40129 -37320 -35615 -38392 119 47597 44338 31379 -6197
21668 -6197 -12012 -35149 -47722 -87431 -82102 -37932 22812 27339 -6103 -62344 -98130 -136312
21656 -136312 -175351 -172437 -130591 -64013 -16514 7524 13969 4081 -4170 2089 -11714 1676
21644 1676 30499 -6658 -41072 -30232 -13708 7460 -2501 30179 8031 -29075 -21684 3425
21632 3425 496 -4939 51456 66000 -1218 -21931 25600 23421 -8832 1028 56252 57402 14311
21619 14311 -36550 -20723 7541 17442 17172 20759 60297 2925 -92132 -101712 -55887 -35041 -33515
21606 -33515 -10484 10196 17080 -2912 -41547 -73750 -97438 -113232 -65920 -33144 -21942 -45347
21594 -45347 -28427 -11653 -27332 5959 28343 45101 83485 60400 26112 -7160 -64462 -21950
21582 -21950 7386 -10044 -12319 -25523 -68968 -65673 -73291 -64827 -61359 -56404 27190 54881 73923
21569 73923 87987 48206 28130 19405 45052 5697 -33088 -42137 -53538 -45187 -27859 -16287
21557 -16287 8679 22978 16808 -11995 -41995 -40061 3314 17683 7747 1237 5923 -29996 2565
21544 2565 15028 -29836 -82510 -56784 4327 35956 3095 -782 -23254 -30601 -28326 -30750 -4886
21531 -4886 30279 38202 45134 87291 27008 -14001 1637 22708 -11099 -16614 24486 38379
21519 38379 72408 36167 -8642 -851 44626 19166 5784 -46531 -54997 -34273 -68287 -44533
21507 -44533 -72243 -54664 -18011 -8862 36719 13364 4651 10459 10206 -11586 -68821 -76533 -77981
21494 -77981 -92880 -60680 -32709 -63461 -76543 -49665 -30416 -47593 -15506 -10243 -54868 -63295
21482 -63295 -58570 -55439 -68676 -106920 -98696 -55921 -24326 -40104 5196 20807 8272 -11717
21470 -11717 25721 26060 23355 -1935 -33341 -21300 -39502 -19200 -42381 -42465 -102656 -108934 -113010
21457 -113010 -92958 -66443 -49357 -37279 -8681 1927 -43356 -96699 -61872 39651 7307
21446 7307 -65558 -80848 -88838 -72815 -20068 -41691 -37959 -4450 13664 16438 -26301 -38125
21434 -38125 -10653 -1225 12232 -25990 -39340 -7568 -79636 -77131 -87313 -80120 -37070 -42705
21422 -42705 -76488 -30275 -30291 -82334 -105365 -83182 -96713 -45476 -22943 -26666 -19075 6502 2646
21409 2646 -34761 -63770 -28432 -2464 -3743 12808 10587 -26145 -73459 -100132 -71597 -24660
21397 -24660 -4910 15769 17677 -44387 -72670 -53090 3931 -29746 -35409 -29239 -31042 -16365
21385 -16365 -28963 -61872 -91650 -34760 -45528 -21782 -685 -36861 -31348 -34423 -39660 -22951
21373 -22951 -18898 37817 64258 62408 31400 22162 -54895 -112446 -74219 -49988 -81103 -67811
21361 -67811 -66252 -83449 -77071 -62040 13136 16524 -25274 986 2035 -27156 -31938 -55489 -97577
21348 -97577 -151360 -126718 -109891 -85147 -76729 -53456 -31971 -61708 -94424 -58884 -57718 -96712
21336 -96712 -105488 -47509 -19572 -30835 -42098 -64917 -49583 -23444 -21391 21539 29098 31439
21324 31439 19587 34870 86478 40971 -701 11177 41486 23616 438 -43697 -33439 -16624
21312 -16624 -56744 -68236 -43866 -52565 -82811 -62041 15045 49728 -9052 -65640 -63843 -59231
21300 -59231 -37570 45930 77610 34586 -4743 -16808 65736 83497 36322 12960 13741 -13350
21288 -13350 -47822 -96156 -78808 -36638 -41268 -34892 -59311 -63258 -38399 -55955 -69736 -87949
21276 -87949 -55597 -13306 18686 4426 -59803 -83390 -37590 19794 22340 45514 32207 54403
21264 54403 60865 52325 74487 58524 19995 -14961 -84272 -93440 -81081 -73338 -50438 -62405
21252 -62405 -75643 -33993 10773 45504 44660 74139 31265 -28725 -45076 37286 80609 65191
21240 65191 -7943 -62759 -53121 -15990 -3427 33203 10976 -55399 -51823 -27031 -20343 11905
21228 11905 10686 2344 -34989 -23562 -61051 -118814 -140096 -85839 9084 8734 -33141 -68634
21216 -68634 -71056 -59332 -34301 33072 71122 -2301 -51105 14617 36430 -921 24026 60471
21204 60471 86772 56393 81113 26907 58262 60847 -28625 -52415 45748 46257 -38104 -18537
21192 -18537 -22643 -78507 -107386 -34188 7715 -34538 -51133 -33696 -23577 -16202 1060 -10260
21180 -10260 -43919 -46491 -65210 -40931 4065 38030 7092 -22446 -34052 -32234 7541 61223
21168 61223 94705 83096 67747 80289 -18740 -111544 -81288 -20029 -47253 -61172 -61312 -101234
21156 -101234 -41929 -39065 -18800 -14602 -69759 -129583 -134771 -102898 -3024 51162 39863 15289
21144 15289 -502 48634 64680 12770 -3638 27597 41302 53631 53178 18531 12692 52088
21132 52088 60074 39219 27308 -27834 -14998 -41505 -93538 -37370 25214 50478 94145 93911
21120 93911 99567 59319 16151 7386 -1466 -16401 32579 49538 43590 49533 69768 80444 69921
21107 69921 110428 119448 83148 42248 47467 26037 -53679 -25423 -27681 5003 -23536 -92650
21095 -92650 -83604 -47869 20797 25902 -43435 -123210 -93759 -93855 -105470 -108479 -80816 -28561 -31398
21082 -31398 -21094 -18331 -60547 -61469 -65444 -58140 -55342 -48772 -81461 -50884 8085 -12326 -36290
21069 -36290 14440 22656 14276 11166 -10592 -67838 -70003 -70208 -76502 -81893 -8049 47118 48150
21056 48150 57426 75418 37149 25985 29267 6926 30163 44007 46615 64019 28948 3079
21044 3079 39935 -7662 6381 18292 70350 106366 126839 116941 64926 60035 87319 72484
21032 72484 39083 53421 96717 106756 36232 2519 7174 -14496 -39286 -19399 -26493 19999
21020 19999 8105 -7427 -19771 -22820 -36273 -100831 -129114 -94888 -26764 -23838 -72818 -60751
21008 -60751 -50008 -65394 -31204 -26035 29247 38174 3687 -48608 -78182 -47865 -4054 27405
20996 27405 23218 27075 45695 28056 9077 -28785 -9470 -8099 -47202 -55806 -69783 -27261
20984 -27261 5415 44925 2849 -10173 -5994 -39842 15321 58802 44178 64953 80331 60104
20972 60104 67915 95329 77272 60388 61020 52528 22648 -33111 14543 -25737 -62261 -27549
20960 -27549 -34579 -41977 -102053 -134572 -122589 -56874 -21414 37812 16564 10298 29302 34467
20948 34467 36876 37187 36422 56840 79728 78177 82291 62001 29723 9944 59487 61337 30805
20935 30805 35696 33106 -13110 -87836 -83395 -65977 -59370 -5034 -14377 -25088 -13052 -23181 -69307
20922 -69307 -65902 -52115 -38603 -51671 17230 53034 33745 54789 30549 19147 -7278 10116
20910 10116 -2551 13361 -24354 -16584 26635 24855 21796 -30948 -111745 -94649 -93374 -53152
20898 -53152 -21431 -24428 15671 35744 51392 26445 -3979 -25389 -11255 18497 22257 41816
20886 41816 -3105 -33364 -56087 -13702 -14212 -51216 -50673 -58282 -42827 -42468 2736 5658 14149
20873 14149 10637 -1575 -6924 -25525 -59365 -2386 14720 -562 -19793 22033 43765 45653
20861 45653 52435 11717 -55081 -46129 -10180 37026 70993 73294 59839 39913 -18871 8917
20849 8917 -15684 -30637 -20125 -33953 -40959 -52164 -44764 -20507 -3710 -20545 -24060 -41967
20837 -41967 -29872 82284 117293 130380 126244 62957 43831 9830 -40564 -54477 -81960 -72346
20825 -72346 -70855 -35361 -1998 -823 31945 26326 -28624 -29411 -21996 -43830 -47597 -16060 -38388
20812 -38388 -37767 -53380 -42736 -7809 -5318 -35722 -14311 -22914 -80443 -110911 -73293 -47676
20800 -47676 -19934 50579 59978 22949 58591 51888 37441 -26554 -72980 -53506 -34651 -32621
20788 -32621 18781 32713 16443 19027 -15802 -12555 436 44788 9545 -6519 32982 81765
20776 81765 57469 31659 3614 1316 -66176 -89877 -63820 -10872 36656 59161 69884 20029
20764 20029 -50804 -84477 -22330 -3080 19119 -11663 -47115 -15781 5726 17583 -12279 -33368
20752 -33368 -38738 -93640 -152713 -88925 -56023 -22787 10270 20548 17003 -48633 -41563 8834
20740 8834 20968 -18094 -47779 -40906 -53447 -67383 -68305 -38552 -26017 -77605 -108096 -110518 -60171
20727 -60171 -5952 27115 93825 64221 -1909 18893 15350 57551 67544 57337 79505 62229
20715 62229 49181 67152 52096 38343 38258 49238 42402 20450 28112 28119 30661 -8031 -52059 -24542
20701 -24542 -14146 26893 44705 37159 -8396 -15852 8059 -43719 -63136 -41479 -1392 -25567
20689 -25567 -33019 25493 14234 -45360 -57132 -20508 42655 18256 -30124 -49807 -41690 -7458
20677 -7458 28286 15642 31142 36169 38864 485 -31944 -36460 18364 19538 7122 14146 -11071
20664 -11071 -7058 -2943 19586 70393 86628 60588 8380 -37663 -23822 7296 28736 26949
20652 26949 73388 84355 9530 -35377 -432 57806 38842 624 24212 27499 -54482 -78163
20640 -78163 -13381 42432 79448 68555 64388 39637 51469 64266 -3552 14892 41910 38978
20628 38978 6831 -45594 -35487 -17370 -7895 -27894 -36676 -12601 16129 -939 -13285 23328
20616 23328 95980 48767 25481 -11936 8081 28559 4210 -39380 -25824 -4821 -43719 -38358
20604 -38358 -41840 -51185 -16031 -42364 -61643 -59606 -39182 -2378 -23484 -21665 -24931 -71017 -59260
20591 -59260 -33940 49717 102437 111702 74575 27478 30773 -7796 -16480 41918 51520 -8344
20579 -8344 26187 76489 55772 42254 19878 14998 80909 109960 34993 -14162 -52138 -93534
20567 -93534 -88390 -31037 5738 56397 -24037 -76061 -52682 -15213 -8188 30686 56946 68045
20555 68045 94782 70267 25326 42143 26475 15432 20512 43010 81107 65708 22667 15789
20543 15789 37133 -38084 -56292 -17472 30804 12099 17553 16199 22247 55257 60941 34579
20531 34579 29839 79735 97066 74572 47705 15801 37683 14784 6668 36660 89177 89542
20519 89542 67069 24777 70420 52912 -22577 -9086 -26930 -5319 25360 62123 125780 117918
20507 117918 73178 46061 21914 4380 13927 25677 13257 -7625 2110 26340 28591 -6620
20495 -6620 -7424 20177 81362 100872 67207 9964 -30479 -62362 -102121 -71961 -8505 -18452
20483 -18452 -17947 -48798 -31114 15241 32597 22764 27360 46130 55758 100633 126047 144594 124655
20470 124655 75959 37398 -8470 -6350 -11148 9963 70718 116624 93556 98983 121973 146536
20458 146536 155767 171827 203464 185809 244753 381535 457154 405284 302743 190945 109317
20447 109317 29996 -13567 15789 24675 82827 95037 78368 56535 97124 85511 37810 -7971
20435 -7971 32043 51174 -25723 -89344 -42008 -22971 -32916 -44214 -23018 -953 42658 110200
20423 110200 100421 30356 1087 6622 15527 66848 66390 51430 47154 29057 52014 73201 42355
20410 42355 49192 52393 83006 70766 79609 73731 58480 91226 54662 75788 88067 37217
20398 37217 -28009 -64287 -6765 -2612 49064 50728 25400 3217 -8261 20615 50185 5527
20386 5527 -8340 27155 -8723 9514 3880 -28332 -36301 -5842 -30458 -8394 31188 50980
20374 50980 36089 36192 20309 4978 29489 -17756 -52862 924 15498 -9049 15048 53304
20362 53304 71561 34748 57267 63467 95042 104910 85365 82125 71329 47365 46996 42403 60080
20349 60080 -3081 -31770 4952 32906 53085 79134 100966 67189 64109 85186 68253 37366
20337 37366 19885 35729 76529 97870 98270 23915 -26004 -24353 37785 43063 68407 87014
20325 87014 82510 117651 141217 114433 79466 69943 84329 110133 93340 42854 -5480 -15146
20313 -15146 15798 47179 38048 30037 25944 37923 133210 104101 82469 46870 53327 63161 32618
20300 32618 -14256 9816 17967 -46680 -72885 -40323 10333 64866 72573 83336 90120 14695
20288 14695 1870 27691 40776 47815 45890 107221 87477 71478 59242 74618 86458 69219
20276 69219 51655 34956 -7086 -27884 -17348 14686 17575 2986 -21384 1721 20932 7897
20264 7897 -4416 3296 5034 13097 41583 35522 -10300 19256 44597 24969 7645 39936 60845
20251 60845 53908 96214 110761 111424 137936 70454 118789 124453 66982 76144 72572 27384 20030
20238 20030 70359 90682 61887 45296 17971 25354 61051 89907 64834 59412 -2479 -56308
20226 -56308 -63908 -51696 -58590 -27510 -11769 -33484 -76150 -60563 18875 -16956 -23866 -13981
20214 -13981 68223 82791 89189 81818 62366 77281 13480 -44467 -100116 -100437 -85895 -63932
20202 -63932 -64551 -60278 -48953 -29916 20326 47468 47300 45779 62958 85139 99592 73125 46796
20189 46796 51461 26757 -18049 -36406 48711 80032 60438 53317 18541 -18192 -16987 1816
20177 1816 -48272 -12647 54161 101347 117971 148526 128079 87827 42602 11381 -8691 -40939
20165 -40939 2210 96320 99579 66995 65003 59907 35362 29677 1336 4471 -27477 -28258 33220
20152 33220 33725 -54904 -76878 -72127 -51883 -32247 -10578 30115 3732 35732 -4234 -66630
20140 -66630 -74992 -39160 58418 113786 156971 124628 51230 20622 61028 43858 54094 55060
20128 55060 6979 30534 75707 55603 51897 63400 80346 120129 96938 77924 31728 31957
20116 31957 68517 94483 -2707 -60381 -65069 11914 80320 136700 156990 156416 107960 74752
20104 74752 76781 80667 55015 25224 17605 53703 83488 72187 68618 34512 -36250 -10655
20092 -10655 -6266 18220 41430 50558 72111 62348 80470 123264 151716 127923 108348 92831
20080 92831 84912 105332 139669 107166 72931 63400 45165 42028 -233 -31883 6255 14278
20068 14278 17892 7516 22271 38489 4691 49510 82537 59304 76609 95673 95775 64849
20056 64849 24289 53690 99868 49897 18113 24569 54824 81683 94926 61788 -16905 -33071
20044 -33071 10408 28218 44765 86030 53333 17758 32259 35260 51290 46997 36845 -4664
20032 -4664 23051 75665 80989 72460 56994 71230 121114 88628 105332 100559 72786 79288 127290
20019 127290 144960 156470 152739 127060 85068 81652 79848 9315 -23646 22362 14727 1595
20007 1595 51806 97578 50151 45577 11629 22718 69330 67954 96567 119875 135897 127793
19995 127793 60429 35453 53731 43291 57380 105131 95350 26175 25479 -7184 1415 27267
19983 27267 56107 53520 33128 56601 52207 38036 52081 106786 147932 111768 75119 67279
19971 67279 51210 40191 36234 27387 13054 35430 82191 114252 85857 123624 107448 79289
19959 79289 78976 82247 92513 68077 34521 66148 127933 195260 229025 235815 226597 183166 137393
19946 137393 134116 179599 210664 188229 162932 118819 144783 188476 275768 227129 185881 208045
19934 208045 218175 221270 241647 248992 236294 161976 140380 141676 106221 106477 133650 138128 84573
19921 84573 96611 88005 112016 158754 166276 155055 124762 164796 155866 131657 120509 103984
19909 103984 81410 43280 45913 76299 53882 33134 28265 39677 71378 71706 93005 155504
19897 155504 136849 117489 100413 105152 122631 150250 129782 126258 57441 35668 63623 108781
19885 108781 129153 120890 105021 92079 42972 34403 15519 20994 75889 96446 103101 84016
19873 84016 90022 94374 118382 122192 106702 89130 33948 98543 111149 129258 150697 163142
19861 163142 178099 144124 126114 102966 166613 184056 136487 157955 198508 180595 160225
19850 160225 85440 61724 84389 150483 192821 259215 284813 249895 298577 281080 278960 235406
19838 235406 221939 246693 284955 280538 267030 266751 253110 245645 216862 157373 168150 220537
19826 220537 269194 305903 285063 274465 250010 241523 221550 275451 291153 231679 210501 192255
19814 192255 194517 227653 271779 244997 287087 368873 395915 395847 383251 339425 382618 421570
19802 421570 394112 394200 444183 501860 498321 485379 478559 534570 584678 581664 583258 655251 760903
19789 760903 782775 839827 885091 973771 1096027 1135063 1183439 1335664 1587205 1864971 2163039
19778 2163039 2551980 3068714 3804543 4851632 6479822 9112158 13563106 21728447 36298176
19769 36298176 55015479 64772575 58129465 43312267 29300087 19478647 13300806 9474132
19761 9474132 6967081 5310239 4083362 3229370 2559482 2021678 1665108 1438076 1254266
19752 1254266 1128564 1017515 875363 805373 695901 655306 652592 610992 542247 444966 419546
19741 419546 396368 383097 360682 359987 302413 245110 287897 322233 290699 230759 256190 293171
19729 293171 301026 331791 267108 237854 247928 218553 172713 144781 120546 172985 211018 222275
19717 222275 198329 149174 99988 77982 139193 143341 141503 113309 114397 114957 127643 191371
19705 191371 215932 204126 173512 147769 145831 130693 133964 156448 158624 122257 97184 77411
19693 77411 146376 190288 164741 178079 240976 275863 230585 189194 198359 199591 110765 39185
19681 39185 42300 -4700 -33789 1273 70441 41726 65235 94582 74209 41732 128198 203450
19669 203450 172765 159031 147819 164717 127926 64206 73024 109107 98397 29688 34763 82014
19657 82014 120062 156698 185478 148772 185714 200948 167872 159515 172173 155754 120311 99422
19645 99422 74931 89728 126948 120221 155188 225452 217142 195581 189062 230103 253374 233898
19633 233898 163119 142233 135215 95722 48274 100465 127678 152926 151401 146730 138434 191684
19621 191684 163602 176542 180640 159674 196895 113540 22444 59214 99354 117150 181828 165245
19609 165245 111493 120511 116718 136855 159828 143464 152034 168117 154896 127678 77522 74462
19597 74462 126222 127355 142805 182907 180663 157691 131900 208265 285824 339202 314485 332571
19585 332571 365760 381534 401399 408357 383248 370786 383122 383510 418116 493047 541865 590015
19573 590015 710024 884456 1094667 1282547 1442945 1583320 1725193 1882708 1957247 2010920
19563 2010920 2101993 2130095 2098091 2032691 1930684 1863340 1826500 1786364 1733081 1787094 1860929
19552 1860929 1982745 2074606 2100934 2080099 2044987 2070239 2018690 1835607 1623090 1404841
19542 1404841 1219856 1031517 881148 806290 724566 597580 527563 471672 410332 380246
19532 380246 378240 397927 382140 332492 291602 337197 398083 408554 373277 338541 328881 318950
19520 318950 300990 257802 279148 285854 282253 285603 208329 248734 295128 256998 260762 231615
19508 231615 210683 185786 186500 232780 242755 223534 196844 207302 194040 184160 168465 222122
19496 222122 276018 246341 200217 173327 258691 280796 307438 279384 234410 225959 217827 211299
19484 211299 243990 277791 240469 235180 279168 291564 299113 258782 283714 279578 257077 244640
19472 244640 249456 255762 266565 293939 300075 327892 294003 286216 264676 194757 137390 125963
19460 125963 113221 103024 122348 129701 124950 145134 184072 221741 218651 242845 234841 229623
19448 229623 211298 169192 164146 156645 183980 253390 270489 239921 229884 205400 211767 194470
19436 194470 196207 195547 202101 205768 245620 236443 201468 215746 217895 218119 225897 252029 302445
19423 302445 351236 334553 265722 246235 198079 193346 242477 281883 267413 259456 277635 315643
19411 315643 301388 297773 277134 292382 290130 291222 293008 359528 365638 274852 215017 196600
19399 196600 236822 248155 210941 223789 285734 301839 293704 273078 285887 294386 276958 292971
19387 292971 379540 363682 314170 293921 305934 297344 308899 329085 304679 289671 306216 306244
19375 306244 286669 302645 335734 335592 319659 318773 370898 430414 352962 316042 354305 375299
19363 375299 415432 425585 366993 380516 392481 371683 412919 454125 461587 453484 468603 493618
19351 493618 491466 569201 536950 457011 484402 548827 562091 560514 607452 664314 677729 661482
19339 661482 686129 716291 783991 763739 761655 778185 781440 733592 705797 622494 596121 570323
19327 570323 526806 489295 470490 423072 388464 409210 426857 388252 343959 390245 413006
19316 413006 328382 259331 296620 347831 314357 173787 28346 -89896 -70337 -36809 4505
19305 4505 -21632 24732 74786 87547 96365 119909 133045 69242 93424 126258 134568 148526
19293 148526 119745 102273 64294 98388 161534 160777 185325 163007 212883 295171 337850 379114
19281 379114 398793 390013 409020 449073 460148 459333 463727 494805 536505 538418 505156 494238
19269 494238 464787 443137 454931 472225 431684 476720 535095 559842 618042 622722 620164 612356
19257 612356 605255 634447 612200 547424 542168 545571 530145 456363 337794 347971 347226 353527
19245 353527 349957 393019 356063 328741 402491 390906 338855 341166 371196 344398 336255 384941
19233 384941 403998 423059 431641 385584 376168 392218 394542 409690 445480 443877 396896 417523
19221 417523 435606 455229 437555 464086 477450 418909 398345 389379 449131 473039 479055 466874
19209 466874 412863 401410 386355 351285 418300 502975 492046 478855 466298 456096 458934 493906
19197 493906 529542 537057 486955 465541 511430 472244 532292 534910 514889 559374 649837 652658
19185 652658 589117 558368 546866 564266 665021 635921 575014 589576 596355 574574 539537
19174 539537 533825 558692 564476 621293 678790 706329 665230 637932 669417 663016 641035 651752
19162 651752 682865 708913 726177 716281 788588 848793 860970 899844 982735 1133083 1231111
19151 1231111 1287030 1297643 1321809 1385617 1399347 1412104 1430477 1397506 1363224 1334049 1358913
19140 1358913 1407257 1412443 1442793 1530678 1642047 1636235 1620870 1625449 1627585 1633898 1640246 1599537
19128 1599537 1617140 1634643 1603191 1607079 1621965 1575881 1510237 1477333 1504043 1525760 1550720
19117 1550720 1555868 1538234 1574433 1652043 1683186 1692471 1714758 1772624 1755749 1736271 1784814 1825792
19105 1825792 1835282 1805064 1788459 1844375 1896873 1933757 1990194 2082373 2098775 2042185 2020607
19094 2020607 2167317 2269737 2263489 2234954 2250624 2280495 2359735 2432839 2474648 2556271 2674825
19083 2674825 2769949 2882184 3000865 3034401 3125331 3282110 3441660 3618824 3748688 3772878
19073 3772878 3779273 3759531 3792935 3925457 4141613 4418296 4760328 5105458 5488116 5887319
19063 5887319 6390837 6888254 7344701 7689966 8036263 8387321 8737593 8998381 9219480
19054 9219480 9471565 9836500 10318860 10876394 11658663 12545556 13657117 14909325 16295045
19045 16295045 17720260 19160323 20675943 22298300 24172689 26116561 28385411 31216500
19037 31216500 34908292 39873829 46681507 56127592 69365164 87867524 112481631 142135869
19029 142135869 174529882 209583168 249575089 292011125 327003051 347768422 358650911
19022 358650911 367302313 373743962 369721561 351713345 328266253 309896876 299659796
19015 299659796 295569421 296137983 303400869 321134875 347143133 369669934 379120744 378844833
19007 378844833 376489665 372223640 357713158 327794355 288512155 248690611 211107285
19000 211107285 174994272 141119692 111747772 88105813 70058124 56626632 46682143
18993 46682143 39213897 33703300 29570460 26457273 24008653 22013305 20297961 18794512
18985 18794512 17397615 16144499 14927710 13652477 12384500 11259822 10293558 9481673
18977 9481673 8808304 8275491 7925422 7666252 7464162 7191610 6915876 6678706 6427678
18968 6427678 6061616 5599348 5085649 4608143 4197923 3822649 3434996 3069014 2824148
18959 2824148 2629855 2438380 2303333 2193579 2073953 1932598 1848108 1758902 1664489 1586610
18949 1586610 1428527 1319602 1304218 1276593 1161880 1069300 977543 928787 896079 919679 943319
18938 943319 926630 891797 837712 814496 816914 786987 738679 707356 733892 767713 786849 772876
18926 772876 716208 723000 683532 616214 566061 549528 532141 487527 491215 487117 486465 498450
18914 498450 496256 477089 488814 515303 545712 550983 511402 432324 368844 332373 284961 297215
18902 297215 330825 319344 259844 258076 255500 213779 205884 208448 198220 193572 198834 202056 182962
18889 182962 163996 115952 114149 86430 73801 37030 20761 -7540 -19931 -5288 -41629 -69354
18877 -69354 -18049 3649 -23215 -20617 41575 89087 110836 139190 150333 142986 105848 80702
18865 80702 93752 113850 106617 107101 69795 85872 104731 120676 140612 134738 130529 120109 86710
18852 86710 87951 110316 161516 141588 163020 196121 189919 175072 172267 185721 183865 175845 156855
18839 156855 148182 150416 150165 175813 174627 163145 138881 165249 203529 204743 213710 188782 180935
18826 180935 171141 169353 194945 205164 207967 165131 226011 222449 217563 214698 197659 226067 198925
18813 198925 116965 82599 96659 97507 97749 139413 169414 130247 110424 115512 119764 129861 118595
18800 118595 20625 3536 14900 48493 74118 84730 64015 63078 71147 38990 48512 55258
18788 55258 34378 62886 90164 61800 49799 63464 96533 103432 114704 135557 167179 144061
18776 144061 91477 114059 136476 184280 221823 158296 175344 194891 170684 174552 235339 247792
18764 247792 278332 319069 317468 291593 368301 412495 463135 509602 599382 755104 871726
18753 871726 1001071 1142022 1289864 1360850 1373506 1339829 1286307 1220468 1131064 1033944 976461
18742 976461 888796 808564 819038 887568 1012133 1141684 1204348 1280548 1292898 1227382 1144853
18731 1144853 1072607 974592 882394 766272 651240 630545 633182 595273 567044 564475 563032
18720 563032 494259 419153 310658 272359 267253 241398 149342 46629 18867 3736 -13493
18709 -13493 34412 87168 137289 214077 282208 296811 273514 292043 357562 492748 628975
18698 628975 671620 700121 725711 702044 627485 594835 548193 473162 400552 321147 285215
18687 285215 296590 453725 579295 754581 868965 987532 1026657 970697 838877 732685
18677 732685 608231 465206 335013 246073 194556 138959 154855 137344 135177 131994 105854
18666 105854 58011 71090 43773 6155 38701 47194 18992 -1802 6317 -36043 -71630 -86934
18654 -86934 -73643 -73384 -25081 33175 31340 39889 73950 27896 14470 17718 72011 88383 86247
18641 86247 44795 36472 7378 22698 19605 5153 35520 57679 76936 62101 25742 667
18629 667 40685 56731 40601 40298 180 -23677 20241 49354 -38710 -37814 1180 28667 6277
18616 6277 5427 10694 -34553 -93458 -62307 30308 87047 65552 100045 151400 138126 103162
18604 103162 66191 50087 107342 144120 136667 50198 30225 22417 75669 112607 125742 128966
18592 128966 161370 139317 111590 110974 123848 106218 113344 134096 172169 100874 105236 110257
18580 110257 119467 140609 169649 215375 274311 287608 238651 161364 170723 210919 275440 291461
18568 291461 301244 325989 312559 342445 349432 323638 322186 324839 278998 206640 142517 73422
18556 73422 71363 95420 158846 190078 202222 187635 190496 180175 152383 155220 146756 118341
18544 118341 105951 46394 -75915 -95231 -74829 -35738 -440 12214 13341 -11068 -29170
18533 -29170 -49354 -84964 -14851 19592 -12311 49580 110710 94291 77335 111741 141647 198863
18521 198863 201271 208046 215108 241702 270596 281627 304573 357064 450524 529573 578974 564035
18509 564035 529807 515904 492358 478180 374756 309202 287791 276610 218863 182013 221612
18498 221612 297605 378452 416448 484853 474438 449934 387253 363769 313608 221350 167884
18487 167884 182614 206265 241923 371753 461400 613311 776826 919332 1110057 1322484
18477 1322484 1498104 1613074 1713280 1793939 1846619 1828819 1760241 1733085 1680484 1666101 1637359
18466 1637359 1655534 1744958 1835481 1917071 2011152 2161626 2181837 2140690 2128352 2079077 2010504
18455 2010504 1924519 1796581 1612586 1406397 1264621 1043852 845319 741668 658926 570743
18445 570743 493527 448220 389090 333942 329797 355935 430087 471533 444231 398013 349780 298477
18433 298477 284047 282610 244968 215063 175531 151860 144903 134964 148892 186897 219149 242579
18421 242579 195466 213739 222245 233723 270301 326304 323919 291711 293031 290489 266262 247933
18409 247933 199642 205578 216413 218723 243062 252392 265291 284434 344699 352662 390997 375808
18397 375808 342792 301680 268887 208419 165677 218512 180669 166891 196171 270139 334518
18386 334518 367121 455659 493651 504683 531105 531805 617202 669212 646519 627455 628323 651251
18374 651251 591567 610427 641493 650812 649121 632855 656610 754505 803643 832634 879382 863551
18362 863551 854809 827994 773883 689814 672163 609174 584811 548523 626908 647971 647329 645645
18350 645645 598222 641616 705648 717349 675181 669866 696450 686634 663510 657435 697405 732718
18338 732718 778414 840902 955832 997278 1021957 1065203 1102695 1148304 1188423 1262678 1308005
18327 1308005 1351036 1326047 1385138 1408344 1332791 1359253 1396686 1378336 1305945 1240108 1262408
18316 1262408 1323104 1446267 1522660 1634535 1715429 1732994 1757404 1800736 1848121 1881509 1828466
18305 1828466 1817353 1793832 1861317 1952211 2009281 2012034 2033246 2122287 2193926 2322470 2441330
18294 2441330 2522347 2599597 2766920 2887269 3006787 3212901 3441730 3622103 3872630 4170332
18284 4170332 4552580 4996333 5484259 5983176 6452965 6854387 7339744 7758860 8109074
18275 8109074 8600759 9146741 9758936 10468295 11300284 12407242 13857329 15557766 17694267
18266 17694267 20349407 23614641 27901777 33746086 42102598 54265402 71635692 95468639
18258 95468639 125568647 159611942 193671378 223412278 242222219 244390285 231373542
18251 231373542 208695231 181436006 154138370 130968854 114899794 107590542 109782892
18244 109782892 121404882 141444372 167123201 194504605 219393400 235631951 236859562
18237 236859562 223069081 198821444 168957530 137925072 109494784 85901746 67645272
18230 67645272 54175556 44515609 37497537 32400685 28633406 25725770 23560268 21937762
18222 21937762 20752833 19991713 19613278 19499013 19695096 20250077 21176505 22487402 24143909
18213 24143909 26333157 29237227 33119775 38578429 46403195 57930478 74726277 98188886
18205 98188886 128393590 163449144 199916482 233319564 256793047 263367473 252874107
18198 252874107 230676665 201996511 171855235 145251467 125868392 115652260 115487301
18191 115487301 125634396 145188664 171599063 201085886 229384257 250207107 255650677
18184 255650677 243999906 219729164 187951016 153545211 121089235 93620610 72060338
18177 72060338 55949372 44177217 35563006 29159749 24294920 20525417 17619969 15291471
18169 15291471 13438126 11972142 10872023 9940410 9155017 8483273 7871891 7294418 6835673
18160 6835673 6388725 5864517 5321051 4807979 4326952 3869515 3568074 3325614 3102029
18151 3102029 2853163 2670976 2476040 2276107 2100312 1981274 1936022 1828228 1670491 1582112
18141 1582112 1499995 1365784 1272069 1226068 1243184 1184626 1108918 1073125 1044030 984001 864480
18130 864480 820492 798143 759879 667541 575046 548856 532351 507258 504860 488580 489428 527667
18118 527667 518725 483270 428794 392188 362333 357673 340750 283804 272611 238054 309358 361769
18106 361769 308044 271645 309635 313756 309259 338793 328530 232877 190257 214413 226928 154649
18094 154649 131057 196219 285642 281058 267823 212445 212968 256417 258509 255167 220034 196750
18082 196750 183759 124415 111910 108175 77806 55270 25475 978 -388 -2010 -32902 -38247
18070 -38247 7819 33757 54965 64907 80913 30113 26367 23426 18030 -2432 -32393 -36921 -57463
18057 -57463 -58929 -86842 -90171 -59245 -37697 -44872 -30389 -3251 23482 70378 104823 101427
18045 101427 52359 38709 53751 -36885 -37635 -41300 -51159 -35289 -31230 -36047 -22006 9251 -31273
18032 -31273 2979 55976 14310 -21884 197 -18120 -48317 26862 56634 64731 -5051 -49576
18020 -49576 -60749 -60826 -19295 8508 38716 12157 -32837 -88180 -45283 33655 38867 -384
18008 -384 4375 9697 -9129 -12363 22097 51988 106358 128169 113275 131364 183943 191273 150270
17995 150270 68546 16527 -20630 -21460 -10125 -42724 -59395 -75599 -97753 -90475 -57446 4712
17983 4712 -3936 -12032 -54347 -85350 -73348 -41791 -58801 -62886 -63375 -52353 -77107 -57636 -79526
17970 -79526 -19694 4929 -7391 -20581 41971 122407 128931 154284 173741 180276 181059 134165
17958 134165 137187 75541 56891 45656 53787 60823 32523 21086 4824 -27945 -13006 -79007
17946 -79007 -132623 -194217 -240678 -237594 -158711 -130642 -134653 -92258 -50728 -27446 -69404 -89146
17934 -89146 -95071 -184148 -236145 -264323 -309386 -387199 -400515 -354181 -294931 -258516 -192295 -145253
17922 -145253 -191981 -239141 -253796 -262563 -260889 -205029 -220493 -218788 -172875 -181620 -201028 -226728
17910 -226728 -195993 -176458 -172517 -134350 -115434 -97581 -113458 -102987 -73944 -21760 39696 50953
17898 50953 52355 43410 29632 -26935 -151935 -225877 -342598 -410567 -374648 -332707 -270352 -232317
17886 -232317 -235112 -214984 -200707 -187613 -190228 -222294 -247343 -340062 -451462 -538025 -568827 -619930
17874 -619930 -611593 -538629 -505416 -526263 -516663 -497776 -450151 -409818 -376333 -380177 -373353 -347683
17862 -347683 -338061 -301513 -245897 -292427 -271135 -228972 -214449 -238496 -299208 -286662 -249823 -262524
17850 -262524 -280904 -241727 -187765 -187666 -194803 -184915 -209324 -246722 -225650 -177299 -235832 -239065 -269856
17837 -269856 -245856 -196304 -214372 -220958 -189621 -173160 -217212 -252713 -236040 -201359 -185514 -145229
17825 -145229 -142391 -156554 -181929 -232624 -229957 -208988 -185379 -184946 -229418 -211340 -233480 -268314
17813 -268314 -292111 -260008 -270592 -253039 -193578 -194849 -192260 -226982 -226405 -204557 -185392 -178266
17801 -178266 -123213 -139796 -180742 -242336 -250411 -249713 -235698 -206894 -192658 -119158 -154505 -179685
17789 -179685 -171789 -176368 -197886 -181488 -202796 -226133 -261899 -278064 -234147 -125799 -112120 -157266
17777 -157266 -167350 -165601 -142210 -81752 -103135 -119410 -38487 -80883 -79357 -34368 -55389 -45352
17765 -45352 -48974 -90348 -60315 -7658 35823 53058 47111 119431 225896 350293 495748
17754 495748 639407 785891 874071 902945 887351 788573 726607 628187 562210 509793 480508
17743 480508 493039 484950 467373 507350 600337 708819 830271 908725 897871 829967 748881
17732 748881 615162 507976 416403 268683 113047 39911 1938 -4677 65477 72782 62039
17721 62039 6512 -75113 -72560 -27117 8222 24252 15092 -13563 9763 16967 19670 21205 29277
17708 29277 83697 137801 216100 299151 381412 475038 639924 776463 907892 1028587 1103112
17697 1103112 1146580 1132575 1054441 911536 746995 642810 529739 452644 423021 511404
17687 511404 686389 820486 973292 1102607 1149185 1160297 1061656 906636 745529 616981
17677 616981 529478 388271 298108 280267 224132 154978 75429 -1256 -50728 -33681 13635
17666 13635 -13930 -25372 -45951 -96078 -91803 -139484 -149772 -163079 -172938 -173647 -77928 -39987
17654 -39987 -16047 -78552 -97306 -72987 -42701 -69232 -116002 -119531 -105381 -115045 -132175 -128775
17642 -128775 -98783 -138490 -126393 -146788 -156591 -185544 -239921 -264320 -204526 -146398 -167535 -154670
17630 -154670 -129525 -128844 -139196 -135587 -123305 -129179 -118092 -87443 -136609 -140349 -140790 -156170 -144177
17617 -144177 -172619 -159078 -114544 -115291 -149559 -169747 -176125 -172257 -158896 -161122 -139649 -118798
17605 -118798 -104311 -130437 -128120 -148447 -118722 -141050 -162888 -179834 -142484 -125850 -141734 -174286
17593 -174286 -139626 -164873 -157246 -102705 -86294 -85386 -92982 -72698 -78610 -102213 -180686 -215702
17581 -215702 -186554 -135998 -132747 -136196 -79932 -73308 -121111 -71365 -51354 -108121 -145883 -101409
17569 -101409 -66447 -124823 -135670 -129322 -118440 -148556 -190392 -179340 -169461 -173578 -128197 -94141
17557 -94141 -89375 -103382 -75464 -81228 -77199 -33093 -70802 -161506 -172219 -138661 -163026 -144724
17545 -144724 -112177 -129125 -164268 -151440 -131201 -141873 -165191 -118085 -93478 -111903 -82327
17534 -82327 -50189 -104893 -122225 -126150 -123522 -89587 -48736 -27093 -58775 -119202 -164747 -161763
17522 -161763 -154373 -143264 -126199 -60506 -34055 -11492 16666 51330 -1671 4503 -25523 -43865
17510 -43865 -56216 -55857 -64570 -32253 -43617 -70789 -83781 -120191 -109427 -130707 -126151 -139787
17498 -139787 -166294 -183247 -122995 -90862 -92999 -148592 -121500 -116783 -128849 -139250 -120664 -79222
17486 -79222 -70458 -105481 -74569 -52472 -75963 -89779 -82415 -83335 -49847 -32987 -33267 -88164 -160767
17473 -160767 -159053 -119578 -109068 -93968 -54886 -5402 12244 16947 -16234 -23919 -84171 -152422
17461 -152422 -155126 -116376 -127746 -128906 -74828 -58857 -58819 -62541 -88623 -99920 -85328 -79758 -104322
17448 -104322 -114935 -100099 -27331 -14559 -78772 -120106 -101404 -56756 -77751 -71000 -26362 -79588
17436 -79588 -71889 -43645 -25596 -25721 -55994 -26322 -5153 -45746 -66236 -36322 -76609 -95954
17424 -95954 -90693 -98958 -72179 -57550 -26268 4129 -43052 -72940 -53277 -29249 -44649 -38432
17412 -38432 -39755 -30639 -23311 -42695 -44953 -119236 -113791 -74455 -56233 -62792 -78717 -162867 -166668
17399 -166668 -123789 -66008 -50514 -78318 -20865 17991 3974 -26047 -62531 -25835 15412
17388 15412 41903 21416 -82717 -107111 -105366 -89148 -67872 20072 2144 -14862 -41624 -69340
17376 -69340 -115621 -114505 -82769 392 60281 53496 -25039 -94399 -64133 -45802 -7090 -25843
17364 -25843 -59537 -109665 -115310 -51334 -10690 23599 46195 -12860 -45312 -80429 -63537 -15474
17352 -15474 3769 20431 68070 58131 67702 83728 57835 10872 37163 1713 4206 2501
17340 2501 52779 50302 48177 25707 16842 -337 23854 94441 134497 125585 84149 117645 183094
17327 183094 181559 213926 253105 251126 225975 275832 345141 451877 578929 758823 992378
17316 992378 1253819 1568151 1870548 2094027 2232763 2324648 2387782 2341030 2228255 2034242
17306 2034242 1748982 1451694 1165552 946895 687789 567842 509467 398427 318863 290275
17296 290275 249989 238331 188334 127827 124434 113003 124536 138271 214049 254058 157388 125160
17284 125160 170171 214570 188181 152101 124140 109402 163503 168590 131539 199183 259000 294390
17272 294390 323766 253447 262777 322746 381270 450635 542693 659990 848106 1044500 1332819
17261 1332819 1578281 1815245 1944724 1967856 2001534 1989076 1895568 1779857 1601142 1314881
17251 1314881 1011641 768752 570241 418501 341587 246390 159891 140343 103108 39282
17241 39282 32368 52550 73637 99812 125768 148905 133566 157042 173366 168495 128790 84465
17229 84465 89566 18999 -11553 11669 11826 34811 22774 40207 62446 90103 56665 65977
17217 65977 67112 94094 97882 86187 89594 117193 101579 117348 112618 119914 64380 52500 52566
17204 52566 98732 112576 48720 80091 137501 143145 131497 160292 109222 108522 78170 73805
17192 73805 104395 101156 64655 57114 101845 66921 70230 4660 -27450 -4658 11678 12607 57059
17179 57059 97140 134191 139126 83189 84109 97126 108174 95604 119585 113719 106362 110636 126633
17166 126633 133657 74530 68895 46693 37933 54394 75963 84778 107940 79375 120421 189697
17154 189697 197704 169464 135994 119949 137121 139664 116515 131326 169807 201328 212527 220104
17142 220104 194756 235824 241786 219259 193682 176064 169340 151045 179431 217776 206194 191244
17130 191244 180813 157693 194637 199496 138464 185384 218639 277082 305899 345216 367754 377162
17118 377162 426459 549858 606533 561587 572158 510968 437757 341285 238572 189823 84291
17107 84291 -55742 -190296 -248337 -296448 -331881 -290494 -257799 -275952 -201362 -137286 -74541
17096 -74541 20622 24500 8224 -2133 -11634 -11414 48232 77232 127840 115071 70314 75963 97141
17083 97141 112721 59408 73745 66563 48091 62016 75484 80801 94633 110917 119148 132566
17071 132566 86045 95849 176416 227984 227626 309959 427889 514502 619331 718396 756441 732832
17059 732832 701846 601811 545793 498268 403914 261122 153786 63588 -41724 -117811 -137070
17048 -137070 -243596 -281769 -210253 -146893 -112547 -96832 -89139 -124245 -177019 -150245 -129330
17037 -129330 -115748 -100620 -101535 -91698 -12717 -5924 25794 11936 -40826 -64438 -75370 -85237
17025 -85237 -63816 -62781 -30940 -52952 -25278 64605 84769 54818 38207 117213 103134 63478
17013 63478 79636 82504 95965 138136 199125 234186 323683 319755 313709 344178 352527 379687
17001 379687 357241 288688 273877 210736 165598 120383 59726 62827 27910 -2416 43592 65817
16989 65817 32783 28912 -8605 -12109 50824 108187 166791 145785 91888 120345 164904 193391
16977 193391 195473 189274 167722 150902 158174 166596 200911 197960 159235 192904 235692 183023
16965 183023 138297 122793 102537 130451 146354 170077 179022 156517 158388 219502 191522 156791
16953 156791 211567 281873 300313 350576 386097 375141 313727 302968 300936 316231 299262 319945
16941 319945 295200 287994 288413 302306 365905 421707 456928 535837 659725 736650 754811 744054
16929 744054 783248 871338 874864 901745 886993 836704 773287 695270 601808 575089 614493 613731
16917 613731 533329 452250 415494 432858 419380 466366 451117 409046 424373 422216 420120 394458
16905 394458 388872 410000 442103 532846 591737 626780 625546 657179 655998 656354 702308 747188
16893 747188 782438 778071 735779 769511 816235 857427 856752 872067 893148 971072 1032123 1087528
16881 1087528 1195047 1264291 1319436 1367294 1432698 1529343 1631055 1652989 1611884 1570584 1616221
16870 1616221 1653414 1627652 1583263 1600472 1623511 1695226 1737313 1724282 1670330 1645546 1706003
16859 1706003 1841344 1885360 1888874 1886885 1892642 1901835 1944418 2009057 2110648 2138469 2190327 2297802
16847 2297802 2410134 2529760 2669810 2797472 2923657 3079574 3220858 3412750 3673363
16838 3673363 3922815 4184601 4454699 4779628 5175622 5588038 6026026 6534970 7144764
16829 7144764 7930052 8809255 9781945 10696406 11616867 12547633 13700276 15093767 16618954
16820 16618954 18316592 20279340 22825115 26243471 30804148 36998724 45662208 58119001
16812 58119001 76526832 104360297 145971727 203430222 272957197 342073862 389993131
16805 389993131 409430482 413740733 418003798 424641784 418572109 384042051 325847656
16798 325847656 259148519 197511328 147982619 111349407 85121893 66475930 53156446
16791 53156446 43548370 36589375 31426175 27583568 24698816 22384776 20514291 19020940
16783 19020940 17798027 16852618 16023248 15271024 14570584 13966207 13593064 13481024 13579042
16774 13579042 13951322 14409524 14853915 15368140 16092027 17050808 18231854 19631492 21175123
16765 21175123 23116120 25754458 29435460 34554200 41645125 51932125 67171490 90360078
16757 90360078 125751784 176611850 240695641 307473252 357402911 379373487 384404137
16750 384404137 388371129 395728760 394484329 367344044 315775707 253569346 194122217
16743 194122217 145241995 108628740 82256486 63530820 50138284 40435770 33362306
16736 33362306 28122311 24204263 21238131 18854437 16890991 15255181 13881818 12748127
16728 12748127 11686550 10542072 9473961 8517411 7615066 6887763 6222484 5682632 5268291
16719 5268291 4917592 4601966 4281782 4029583 3897592 3782505 3571607 3432730 3343063 3222469
16709 3222469 3035806 2839745 2686157 2581028 2497811 2418795 2327359 2236479 2177062 2135339
16699 2135339 2111855 2062757 1991380 1836412 1753324 1682087 1693080 1642777 1542931 1426086 1346270
16688 1346270 1360809 1340525 1366312 1332510 1303458 1275899 1206377 1098138 965213 881321 816481
16677 816481 777256 742684 717547 696885 661998 678093 689567 712871 703393 688383 685807 689029
16665 689029 672439 711262 675722 670583 637845 629193 558740 456929 463192 500755 586085 608971
16653 608971 583999 549293 578168 571520 624701 658632 637213 621734 616552 609481 565678 538786
16641 538786 541861 544539 579688 585407 529505 533673 598692 629447 611149 626972 570662 563675
16629 563675 514494 399336 372136 360506 315432 316975 373638 294502 215319 220519 251235 344835
16617 344835 395932 418219 428807 441142 420314 409806 412015 405458 348377 296727 248877 213722
16605 213722 172948 171398 209136 277120 323430 344222 347353 346142 334268 306156 313467 291102
16593 291102 289181 340583 369769 345426 300449 330193 380139 366497 316162 276325 280527 299031
16581 299031 315208 318706 312770 371607 392250 337629 260609 206135 227817 225724 193281 208846
16569 208846 262013 309114 349321 380649 405454 402241 413598 428045 388438 364227 381000 397867
16557 397867 377700 316273 354102 350234 341113 340618 322349 277564 234427 208042 168557 182634
16545 182634 226138 278133 256895 214286 175274 204027 248609 266965 256889 225691 217577 202284
16533 202284 224074 247663 260851 269317 219940 196819 210302 308994 318344 318391 345261 327548
16521 327548 299181 257991 278297 341408 373610 386795 396636 368192 330882 309129 346587 395537
16509 395537 379555 377000 417505 474564 463744 466044 495503 514017 524605 441810 340082 237992
16497 237992 153809 55231 -22624 -131257 -239960 -304734 -297306 -257299 -237145 -134230 -54891
16486 -54891 -14319 -11752 33821 11445 -2481 12873 45890 74028 121295 130533 172873 185219
16474 185219 186201 184022 167672 127791 169293 200986 185255 160880 89933 110580 163677 209634
16462 209634 221357 219388 221092 228681 234944 191344 193427 252925 307908 347045 355925 386598 456540
16449 456540 436386 421354 308712 203225 75442 -1425 -43490 -83170 -144018 -281286 -397795
16438 -397795 -397007 -368610 -338331 -333215 -286966 -204151 -78746 -40690 -84090 -61897 -48115 24059
16426 24059 62420 87925 101247 106478 93139 69839 140976 158438 165111 135375 160030 171842
16414 171842 149475 109681 87721 70827 102726 119605 119224 131478 113641 84087 98637 97243
16402 97243 71825 85395 59153 45916 47409 76742 55236 102107 102343 63986 77700 106283
16390 106283 136893 173400 162217 138235 104366 90714 109809 183708 156510 140721 131431 116344
16378 116344 119337 98137 99826 97455 86582 105338 93058 132733 152270 182244 239853 271229
16366 271229 229901 238410 235038 213038 242853 230531 214855 195998 191760 180395 205154 264888
16354 264888 225996 163055 167360 251311 265107 237337 213169 241520 266582 215779 214106 275222
16342 275222 261328 225754 224633 267128 224608 181355 161829 189390 195176 231954 249619 236502
16330 236502 293259 330446 330156 342021 317560 300117 306746 270890 257927 243310 260850 311848
16318 311848 327631 341922 330805 306267 280874 336124 336976 288116 284869 301988 339173 382515
16306 382515 436927 428149 415002 436188 494305 590442 666420 813925 966791 1133237 1446918
16295 1446918 1752041 2030609 2242230 2396848 2461154 2442831 2425921 2330934 2251483 2016150
16285 2016150 1701878 1462589 1214793 1023500 888151 794275 763182 701348 677839 646388
16275 646388 627510 561408 494703 474291 488510 463306 451232 451091 438628 475909 504231 481314
16263 481314 455634 491740 481030 478979 547051 529894 524448 534857 537596 517969 446673 463093
16251 463093 486865 575855 641579 705970 835862 910704 1059746 1212636 1458167 1786860
16241 1786860 2119454 2340453 2431984 2430293 2453265 2446978 2403612 2249342 1987249 1761231 1556480
16230 1556480 1305807 1140589 1001652 870973 765068 767058 805513 758905 715817 710586 652624
16219 652624 572236 566523 610371 571569 550642 549662 575962 623720 626884 587259 615176 586734
16207 586734 588578 598811 625888 580552 544683 572904 584166 625718 630170 657116 615090 570158
16195 570158 582184 640795 725133 707874 673886 684912 673230 615774 618467 672856 663334 636120
16183 636120 654095 653634 611642 618114 612834 633016 615650 633851 676626 715697 699864 677781
16171 677781 759285 794001 766514 753443 719456 698058 709428 730612 701323 706010 784503 742601
16159 742601 703047 741359 751979 765444 761359 777433 797560 826937 867764 887149 916025 929238
16147 929238 923663 928187 909834 927991 944944 954886 992401 965000 940057 939050 941469 899366
16135 899366 915351 952061 994863 1008734 992087 1026643 1118902 1076438 1041690 1089999 1127327
16124 1127327 1152040 1131427 1112688 1114195 1115384 1143777 1232478 1258134 1214319 1241029 1278518 1268380
16112 1268380 1274516 1288418 1370310 1444195 1444338 1402740 1418026 1391888 1406371 1422065 1411039 1452026
16100 1452026 1447303 1396923 1342561 1345092 1313417 1260255 1199811 1137760 1114416 1123189 1136247 1109496
16088 1109496 1108860 1069734 998166 921220 896851 963487 994831 947246 914705 922699 928916 943867
16076 943867 979510 1038917 1073574 1054794 1094192 1100679 1129004 1260079 1360754 1482496 1552276
16065 1552276 1675666 1879325 2167095 2553625 2990579 3542570 4106625 4500094 4660210
16056 4660210 4503121 4115321 3662145 3245983 2896139 2604898 2325473 2132417 2052830 2056626
16046 2056626 1995820 1941361 1902051 1871063 1936532 1947705 1885597 1882218 1972085 1981056 1913064 1875642
16034 1875642 1864353 1853943 1822014 1836208 1848639 1824251 1776550 1765686 1773839 1800702 1853134
16023 1853134 1804302 1784799 1807502 1760575 1764567 1770339 1811228 1863329 1871859 1862639 1825854 1825087
16011 1825087 1863330 1872275 1908010 1884221 1890673 1950352 2025486 2086043 2159543 2136821 2124531 2140167
15999 2140167 2167566 2220257 2219655 2193512 2231617 2291590 2302450 2280479 2290649 2279601 2327267 2356452
15987 2356452 2346622 2369968 2459428 2530315 2537655 2563530 2585050 2574572 2573304 2544385 2548356 2557240
15975 2557240 2611983 2636553 2662128 2710051 2711634 2780588 2808389 2838002 2874288 2989632 3045812
15964 3045812 3099508 3097599 3054252 3096061 3183748 3258265 3294818 3321245 3371697 3401218 3426976
15953 3426976 3477201 3541844 3605001 3678475 3788109 3799991 3809899 3923524 3998965 4068998 4125700
15942 4125700 4171522 4199301 4257400 4347758 4412640 4478500 4550935 4609458 4668770 4757694 4898745
15931 4898745 4985943 5063824 5107563 5232509 5361727 5416871 5513342 5609266 5740521 5925859
15921 5925859 6104494 6187403 6272175 6362913 6461538 6531298 6598083 6762851 6923557 7009420 7100860
15910 7100860 7224980 7324713 7388220 7448034 7545687 7703093 7803746 7881813 7969073 8090109
15900 8090109 8224645 8358292 8487124 8625947 8755722 8897886 9098446 9265346 9360538 9517907
15890 9517907 9697242 9880232 10042739 10197064 10354981 10559739 10829553 11068849 11296534
15881 11296534 11542756 11777848 12024759 12264901 12450834 12744534 13068286 13356713 13677273
15872 13677273 13932070 14261353 14609696 14984814 15344205 15672640 16048847 16503857 16932352
15863 16932352 17354309 17800768 18295284 18766018 19214720 19692735 20277689 20889407 21481577
15854 21481577 22105867 22767957 23427303 24157884 24900278 25681668 26488955 27369481 28225830
15845 28225830 29129987 30114351 31152321 32211617 33392257 34626047 35858731 37195471
15837 37195471 38614254 40093567 41609737 43212409 44924107 46778339 48738504 50856450
15829 50856450 53105290 55494166 58060018 60723751 63644595 66766215 70030924 73527390
15821 73527390 77339360 81473216 85917497 90617658 95695175 101172695 107130681 113543735
15813 113543735 120477828 127988439 136089937 144945472 154502432 164907711 176175180 188399988
15805 188399988 201643137 215982968 231374013 248011023 265889199 284912342 305065644
15798 305065644 326230020 348215492 370767923 393454436 415853455 437441953 457527245
15791 457527245 475426179 490357907 501737991 508997945 511837994 510166909 504046674
15784 504046674 493826258 480081756 463412303 444392931 423763348 402143041 380163570
15777 380163570 358323383 336888872 316151461 296369539 277640572 260073385 243647987
15770 243647987 228339734 214092936 201028733 188958917 177761418 167356623 157685785
15763 157685785 148778051 140496206 132759630 125546965 118778336 112452513 106543578 101007017
15755 101007017 95811971 90913223 86290779 82011004 78046229 74330926 70778807 67488362
15747 67488362 64467361 61674897 58977377 56494912 54171014 51953948 49888355 47940356
15739 47940356 46067361 44342444 42713280 41220734 39796339 38406244 37059959 35777430
15731 35777430 34547602 33408408 32283435 31193376 30200124 29234456 28290670 27431152 26557996
15722 26557996 25729646 24957483 24194524 23523422 22840282 22139106 21468067 20889904 20380102
15713 20380102 19838082 19375832 18956062 18438352 17957642 17482446 17026729 16651861 16308926
15704 16308926 15884931 15483291 15132709 14815951 14449534 14156313 13894906 13551851 13257476
15695 13257476 12940659 12673334 12403911 12162321 11897771 11680918 11417811 11175960 10958951
15686 10958951 10727228 10513497 10333713 10160146 9949697 9724086 9558466 9435220 9313859
15677 9313859 9123663 8975660 8797043 8582667 8414400 8302778 8105433 7942401 7800696
15668 7800696 7658363 7475611 7333984 7206179 7058755 6963114 6830014 6714498 6591277 6499704
15658 6499704 6406256 6310634 6192328 6120743 6055425 5956077 5862703 5839123 5735642 5601928 5479751
15647 5479751 5438025 5375395 5346173 5233777 5131185 5071569 5005712 4983173 4918152 4832142 4735361
15636 4735361 4697286 4642558 4595324 4611803 4572758 4483281 4385955 4334643 4323378 4333309 4259674
15625 4259674 4172136 4171639 4108181 4045786 3995133 3946043 3924389 3828051 3820706 3790499 3754796 3690338
15613 3690338 3653787 3612542 3528328 3476669 3441195 3435544 3389875 3382335 3400651 3337682 3267145 3235889
15601 3235889 3220373 3183455 3223411 3209854 3109406 3052894 3016244 2987518 2955286 2919039 2874919
15590 2874919 2876345 2833215 2783621 2732060 2687155 2662353 2602770 2623061 2571229 2546573 2544104 2517889
15578 2517889 2495406 2482528 2431886 2446168 2484877 2424204 2342018 2308607 2336892 2353735 2342541
15567 2342541 2285460 2206621 2159960 2202414 2217607 2184133 2190769 2177755 2178570 2139268 2140814 2143673
15555 2143673 2211850 2219520 2203338 2185729 2137925 2101768 2060194 2042944 2066978 2060591 2015350 2017001
15543 2017001 2073474 2092297 2047479 2020035 1993260 1942776 1918482 1943651 1974193 1959859 1938490
15532 1938490 1960868 1981144 2013120 2029013 2074131 2117538 2127529 2204950 2325402 2470727 2690576
15521 2690576 3003550 3425762 3969050 4520548 4900672 5050398 4847132 4414995 3934298
15512 3934298 3445504 3094285 2796854 2574263 2340976 2176745 2091065 2026526 1949841 1907311
15502 1907311 1817745 1753233 1763327 1765642 1747767 1688587 1655541 1606987 1585126 1590360 1520066 1489867
15490 1489867 1484042 1449429 1374615 1323629 1238083 1165543 1125795 1017920 961718 916844 830720
15479 830720 719366 628966 641515 585984 532852 521903 468429 425559 411091 406436 408384 438360
15467 438360 487818 471279 405546 389229 413413 421893 471541 492651 504334 476571 405968 362261
15455 362261 393031 446258 475263 514177 553173 562497 542515 570884 548386 536729 529700 552365
15443 552365 558463 543071 520731 542255 504634 488040 495551 575867 561636 485253 420697 459154
15431 459154 469759 501865 526471 523167 521942 489441 476143 477279 473513 449777 492524 519231
15419 519231 495116 412808 443991 498286 524960 509045 498208 501009 521152 484065 432620 455717
15407 455717 471409 454202 405946 419302 415510 420157 445026 401647 330419 321553 342788 394627
15395 394627 404142 444389 473985 466089 433634 422432 360682 350080 299880 248908 266280 337743
15383 337743 334306 331209 351030 368498 353797 297210 302293 287133 270208 321288 367671 423475
15371 423475 426854 381311 316724 361136 371938 366213 358397 353681 279028 221118 224879 227181 245965
15358 245965 262222 270991 331616 321359 297935 318427 377282 440527 398651 316938 246589 229650
15346 229650 244078 265551 253413 259527 233976 218597 231821 221015 209931 195523 184608 200552
15334 200552 212478 198622 224420 203330 248931 260956 212646 188209 175287 193754 239284
15323 239284 205352 220355 219298 198426 234577 275282 293919 261754 245897 260340 292070 300250
15311 300250 278386 239986 237122 227029 241908 297833 315051 324420 289152 257972 220383 278079
15299 278079 310503 331542 322121 295286 273876 280870 360837 354520 311857 287195 295517 309011
15287 309011 285800 271768 234059 205600 193553 175822 174131 175725 117729 128305 218182 272493
15275 272493 282023 275484 268881 253383 293633 277147 270591 240649 244733 235138 207533 173321 158510
15262 158510 194675 172509 190631 175208 158916 165198 169375 125901 107718 121341 119666 121090
15250 121090 104838 108479 121379 97703 68635 44832 123266 166118 131104 133355 167194 191798
15238 191798 200199 230814 264316 239678 196440 195665 211971 238621 241528 239535 241963 216888 256238
15225 256238 274271 319556 287261 230342 206716 251313 236895 158126 80356 61000 76128
15214 76128 137345 160607 111452 160520 179320 152698 174652 172500 127924 125586 150910 181761
15202 181761 205583 232908 181282 182788 153273 109960 50923 30158 81354 135548 128171 105363
15190 105363 101506 101721 137393 168514 169940 160667 194908 203110 226707 190538 153707 134692 104789
15177 104789 133377 84788 64852 96487 69382 98960 86931 130845 182660 169889 185528
15166 185528 193480 138144 47146 104371 135470 138827 158223 127247 104888 145400 162177 133349
15154 133349 125803 153436 122486 88833 45495 66903 95734 106121 107090 97297 70966 75340
15142 75340 105460 153804 129085 95796 57589 29133 18540 58651 92889 43824 50696 53963
15130 53963 -15524 -20047 23662 5022 48792 103617 127644 106180 40612 20861 44014 72663
15118 72663 83 -23627 -10603 3175 -36392 -101775 -102194 -124705 -81850 -35780 12746 36137
15106 36137 32998 40842 69463 66170 53472 63082 83773 88870 78308 83862 28495 12484 48991
15093 48991 38720 26207 19655 9227 -10815 3622 20613 18731 50186 75124 105966 123469
15081 123469 144115 158544 132156 40382 -7485 57921 57687 30595 44543 29545 1991 -4558
15069 -4558 -3158 46698 42517 47658 100129 154931 134953 152357 201428 196765 152377 134461 98170
15056 98170 128711 138123 156674 124324 92983 108758 84472 23989 16319 35003 13637 -30937
15044 -30937 -40430 -17193 -1779 34112 29700 29707 62031 57383 113420 90871 35397 15777 8175
15031 8175 -4661 -11498 1835 35458 51240 79028 99236 123348 108590 97677 108971 85900
15019 85900 47481 12981 407 27255 29927 -1452 35050 30672 52230 53591 17835 21389
15007 21389 45943 75723 124220 146527 194036 153150 87454 65196 47851 55789 42148 58157
14995 58157 70034 30434 -25206 5765 25711 12696 -55201 3572 53628 45486 13368 36821
14983 36821 90560 111906 88465 32664 51391 95429 101552 115045 134713 108196 75398 -12492
14971 -12492 -33508 49440 63066 70548 55384 16293 50186 62979 27498 20454 49403 10249
14959 10249 26013 5238 30110 24999 32179 14650 -3484 40469 81881 130171 74919 28250
14947 28250 -9881 -29911 -16946 -9738 -3741 18406 13104 -14247 -31751 -19850 -40315 -31355
14935 -31355 22023 20045 -16976 -44 49456 11359 -4708 64630 121463 138738 57861 -8254
14923 -8254 -45685 -34669 -36400 -40133 3439 18123 29570 79007 99905 56071 18595 -35933
14911 -35933 -75300 -16346 28175 67358 79889 96288 101636 70016 85807 57018 55174 47488
14899 47488 34900 53928 66701 105520 123650 68572 72225 126237 85849 74464 47321 31004
14887 31004 58550 61423 -2799 -20229 -39246 -41578 -30375 32747 47868 46843 42569 30209
14875 30209 20168 -19554 41159 86662 149330 126275 77877 82743 83024 72770 47575 26269
14863 26269 5845 -30245 6390 40400 121782 151194 145511 172448 158148 145602 129252 86191
14851 86191 62893 58763 77546 94799 113398 95104 96126 92055 32226 87166 100856 124488
14839 124488 142248 120010 97462 72233 47844 96550 130295 132352 52105 -31204 -22718 -8742
14827 -8742 322 18872 49058 68605 77623 114036 116741 66913 87074 99020 78087 118212
14815 118212 152200 153093 118624 89763 74083 93201 115420 101464 92769 97450 146976 194608
14803 194608 214107 235944 189728 165307 152725 142397 121755 116188 227740 297208 322968
14792 322968 262960 175397 127215 211377 323004 278449 227534 213375 135082 95548 139206
14781 139206 154188 158749 172082 172254 197966 241796 190984 155917 200663 260073 236762 233845
14769 233845 240679 265327 260435 198884 177721 203688 201061 196084 200356 223827 198398 195191 220217
14756 220217 278714 294461 268294 244715 214699 209848 196964 155485 188130 235531 264466 271568
14744 271568 244064 214339 215097 223582 241606 271323 300831 274474 292180 323427 330166 305701
14732 305701 249319 230644 209882 237798 249752 221024 174554 198307 186457 219575 214081 180182
14720 180182 131671 131402 177592 171346 161742 150151 101225 137087 137033 121801 100556 143650 177486
14707 177486 159490 131500 119909 144883 104907 69645 112945 179683 175886 136398 157272 169500
14695 169500 154925 89228 98585 107258 109453 150965 197226 181440 138889 221385 277582 217643
14683 217643 233143 231176 217218 163923 127695 127218 114063 123896 148355 176580 206988 208877
14671 208877 211044 229356 251012 250802 223454 259762 272566 280155 266909 270393 293171 306115
14659 306115 293108 276798 278450 259181 257010 264009 278701 292959 293886 273348 229863 235971 242415
14646 242415 281659 296989 253839 257180 233951 220095 208915 281936 293518 293952 320956 300574
14634 300574 271576 229855 305813 324836 297019 255404 278819 297662 264825 227288 217328 238152
14622 238152 279430 363509 378241 354956 295499 284904 257182 229741 232360 275481 312419 336318
14610 336318 324577 358431 376761 419325 420520 363533 361684 426403 446036 428064 396042 444280
14598 444280 520447 506180 464711 462585 504257 491843 522589 536931 567643 575526 580958 582875
14586 582875 631165 610863 595667 564963 576294 646646 726721 762877 742518 725808 678471
14575 678471 642348 607267 645803 769741 808242 788628 818986 853199 808553 828665 894287
14564 894287 884087 893658 1008348 1069613 1055908 1028610 1053853 1038224 1082566 1112426 1189910
14553 1189910 1244312 1299442 1370416 1426281 1412867 1421725 1452857 1477343 1525636 1543355 1566665
14542 1566665 1611104 1639723 1639953 1636708 1682016 1729076 1765680 1802445 1843643 1891425 1909068 1929671
14530 1929671 1978125 2042403 2039323 2044743 2089607 2150120 2202248 2263944 2267233 2307974 2377554 2451294
14518 2451294 2581703 2707190 2805728 2898120 2933592 3032565 3087117 3118005 3188414 3270859 3428493
14507 3428493 3578472 3684843 3769826 3887758 4012499 4110400 4308406 4507725 4646638 4784940
14497 4784940 4872272 5053141 5243964 5441948 5599144 5805872 6099869 6354895 6615340 6976045
14487 6976045 7316286 7651916 7988714 8401152 8757559 9148415 9620960 10149913 10682899
14478 10682899 11263803 11924415 12603077 13310171 14113486 14973966 15911923 16926811 17977901
14469 17977901 19146729 20353157 21668101 23173850 24783008 26482989 28341475 30382977
14461 30382977 32553446 34870056 37312673 39915164 42710827 45615133 48609951 51775042
14453 51775042 55073685 58415503 61774442 65092781 68432362 71667773 74850731 77876402
14445 77876402 80783105 83516299 86128983 88617802 90915891 93189522 95399117 97546738
14437 97546738 99658592 101931844 104295258 106779391 109445252 112359811 115541648 118984274
14429 118984274 122786783 126967466 131538526 136514160 141839382 147457810 153317098 159379312
14421 159379312 165453067 171445015 177206071 182519136 187105357 190754854 193372479 194734436
14413 194734436 194788056 193552256 191079020 187485685 182882998 177494928 171533402 165224023
14405 165224023 158772151 152315846 146008797 139937285 134231736 128885263 123855180 119253395
14397 119253395 115135219 111311881 107804675 104594174 101716191 99193483 96883507 94702602
14389 94702602 92756461 90876636 89104958 87363712 85665909 83880947 82088553 80241883
14381 80241883 78245472 76130524 73854498 71452238 68909003 66249300 63476225 60726113
14373 60726113 57930644 55126429 52383404 49610061 46902665 44293134 41824465 39440244
14365 39440244 37096215 34896670 32862764 30930061 29088562 27359553 25818047 24379478
14357 24379478 23018817 21784463 20616116 19487288 18470624 17560079 16705281 15836663
14349 15836663 15079074 14290283 13553796 12924241 12391393 11812547 11263710 10830106 10412596
14340 10412596 9954027 9529944 9159380 8783098 8402515 8091813 7808468 7579920 7397046
14331 7397046 7132220 6878411 6597298 6351975 6126239 5931196 5784460 5639649 5419173
14322 5419173 5242524 5028403 4904850 4833378 4744654 4622265 4477728 4315131 4191756 4113983
14312 4113983 4051838 3902022 3817885 3739964 3692210 3614555 3534558 3399382 3287629 3258368 3225786
14301 3225786 3112392 3022901 2895376 2850077 2792558 2755441 2745584 2690678 2578372 2514951 2482301
14290 2482301 2446268 2373723 2324833 2293896 2252274 2203046 2166426 2139842 2148395 2113264 2049543
14279 2049543 2009712 1976544 1887463 1849109 1865999 1836058 1793524 1759985 1744018 1755082 1762304
14268 1762304 1713702 1630365 1608829 1611544 1594301 1599237 1583249 1531241 1510064 1435717 1435592 1427206
14256 1427206 1435829 1503953 1494678 1464395 1427758 1368652 1297365 1227704 1232471 1276464 1266350 1236330
14244 1236330 1215570 1234367 1211376 1171147 1171746 1174403 1119213 1101995 1091712 1089993 1072547 1049211
14232 1049211 1058492 1099595 1081570 1025944 1042680 1026466 974121 990251 988372 992990 984054 965850
14220 965850 944360 949204 908642 863909 847672 898390 916858 867177 878115 879208 877310 828607
14208 828607 791828 783365 804894 793538 785951 791420 836508 860790 866884 842229 805834 742390
14196 742390 758028 803590 799911 772842 802158 807123 755546 709075 750741 744051 754461 745690
14184 745690 708404 669477 667804 662093 655375 695796 686087 662808 689433 711017 686981 679543
14172 679543 745777 730995 670644 698055 669459 643863 632409 636205 664139 678676 682404 636774
14160 636774 626267 630940 624690 617465 590516 615350 600781 576433 570373 576792 606054 609452 575078
14147 575078 574346 547105 493740 457105 501438 532802 526052 507758 514019 540665 539194 533219 458994
14134 458994 405782 413385 421829 443779 414106 374855 411659 443456 436044 437737 442877 409915
14122 409915 419468 412105 421680 392818 396648 377788 361699 387494 400405 362810 327702 293330
14110 293330 316777 294595 241657 204745 153704 128371 115896 92718 98000 57252 6850 23476
14098 23476 55383 87560 63855 20820 27239 63349 58365 75999 91107 83067 46711 33174
14086 33174 62209 119251 157285 127481 116586 86866 55323 20709 22389 -1230 11981 57749
14074 57749 57172 66084 70577 115557 123304 147127 137440 123371 69863 -4372 29880 103683 115539
14061 115539 131778 134695 135075 135160 114131 129239 141065 107522 117175 106139 78216 88679 137254
14048 137254 180604 154822 114036 129090 155117 147122 124034 117481 112851 142548 140051 69627
14036 69627 7233 30072 89528 91798 77169 71836 86787 97981 122707 159171 198432 217359
14024 217359 174075 130898 101972 81348 103738 108178 84024 74059 87308 94969 107531 155429
14012 155429 122945 112714 101103 115236 112062 107644 128591 122071 125292 138427 138556 61577 118540
13999 118540 157088 130237 133401 145553 174652 120670 36248 78321 170171 211759 160444 45952
13987 45952 6524 57013 81882 79228 54708 39344 38030 12377 36862 46634 109906 111392
13975 111392 97849 96934 73893 28240 31321 10930 78676 104230 94613 76899 78639 59182
13963 59182 13418 32233 43070 23915 17904 34210 63997 22553 7194 8298 -38859 -25533
13951 -25533 15736 6897 35648 55107 52920 25772 -8412 -32487 36120 33157 -18595 -32570
13939 -32570 27819 45220 26189 -25184 -70126 -18893 40708 31359 38924 169017 215457 190149
13927 190149 161048 145818 188999 154546 136479 130470 157606 128704 131092 110896 119142 164217
13915 164217 152846 170325 142608 99627 169509 189705 227794 181676 116147 87843 121753
13904 121753 124420 83289 84892 128832 117888 155984 148385 129218 150041 146888 109722 99953
13892 99953 113595 123398 172990 235369 238433 196123 204231 222003 225915 237378 302791 392193
13880 392193 448127 483288 557951 581793 585791 685436 774626 843591 899127 951413 984202 1088865
13868 1088865 1204297 1366044 1460273 1611869 1732173 1891597 2031154 2154189 2260142 2348674
13858 2348674 2433184 2519888 2547727 2558044 2557165 2540990 2529466 2540959 2518782 2533070 2600901 2607073
13846 2607073 2647407 2611308 2601787 2562639 2601579 2612299 2538306 2496285 2476262 2476880 2487674 2510086
13834 2510086 2432143 2347711 2265358 2167386 2141655 2075674 1843850 1680379 1609072 1466494 1343404
13823 1343404 1189370 1085716 1036752 940308 847292 771985 751679 692551 647097 661587 645256
13812 645256 606937 573994 538005 467466 388701 382746 357136 327005 330522 312818 248790 288204
13800 288204 293202 248686 224556 232987 243378 253198 272293 273954 290340 282559 313631 302539
13788 302539 320997 301622 315246 281216 223835 212460 214322 209768 172788 135745 131633 210857
13776 210857 230063 201223 143678 110339 124886 144120 195407 191760 197119 185975 193622 229902
13764 229902 224083 246429 279594 291907 227571 214976 208890 256697 328170 361592 414064 370808
13752 370808 338450 327663 308288 296458 331305 394692 422510 415439 452880 433344 443899 423446
13740 423446 447976 511454 502381 500140 540037 591890 591296 556196 538816 556165 560163 538219
13728 538219 554154 539777 552698 485175 436205 434744 414031 383888 357279 331097 356572 337228
13716 337228 236910 227189 213102 166396 181556 212929 167743 155807 179187 118970 81859
13705 81859 91875 63278 20825 -65682 -89712 -87781 -151798 -243129 -287871 -327447 -360743 -341567
13693 -341567 -363222 -319509 -273889 -282542 -340213 -324059 -289229 -282567 -270195 -250410 -251108 -231614
13681 -231614 -193932 -205824 -234543 -217229 -201792 -186370 -114327 -47821 19524 73076 109785
13670 109785 122910 158873 169409 144642 122835 130907 177101 196909 159638 162636 137772 103088
13658 103088 92283 145110 194729 215347 219686 218741 199961 232910 251830 288345 266196 220536
13646 220536 217718 285961 303097 277200 261813 232946 245198 221259 157327 145151 99218 60827
13634 60827 119016 150530 142234 125121 118620 122765 133709 124113 105436 118568 113087 56034 34617
13621 34617 37706 96674 119266 153821 138890 127409 124006 98250 97022 151613 140568 153143
13609 153143 149150 158209 160068 134389 128828 164700 220997 219853 202317 139943 113877 87128
13597 87128 98582 150448 219639 264079 278300 209697 180411 120540 131671 202106 202271 193247
13585 193247 164854 136525 100728 164240 211942 209743 246672 191849 185048 228415 255456 244862
13573 244862 266937 298223 354946 367468 371651 415042 436324 432446 387746 370153 419815 480031
13561 480031 490876 522833 527664 515369 541097 602671 651392 645183 710399 734285 764652 755619
13549 755619 752865 843177 952166 1010875 1034292 1102215 1125883 1111503 1131530 1135851 1195261 1220951
13537 1220951 1254656 1304131 1316172 1315591 1332323 1307497 1335072 1384193 1376709 1391897 1463897 1519980
13525 1519980 1571152 1545691 1531330 1507879 1520300 1525689 1565554 1607623 1656874 1638112 1617115
13514 1617115 1663106 1620561 1647878 1726293 1770908 1775183 1792839 1832287 1840552 1837880 1885986 1935669
13502 1935669 1964329 1993678 2075162 2233873 2337199 2401462 2479859 2526598 2545660 2601649 2749793
13491 2749793 2875216 2923882 3031959 3172105 3344193 3503957 3658795 3768469 3884407 4013773
13481 4013773 4230071 4465885 4635003 4825684 5018200 5233117 5515530 5812539 6118321
13472 6118321 6436563 6800860 7149768 7525893 7958957 8414700 8902925 9428058 10043533
13463 10043533 10664530 11360617 12043426 12819444 13769639 14726076 15774464 16912146 18220988
13454 18220988 19681820 21259213 22978717 24837529 26825062 29125330 31675103 34499483
13446 34499483 37730954 41306250 45277630 49734524 54693926 60288501 66578300 73637077
13438 73637077 81566594 90449969 100430437 111600581 124068068 137970288 153365465
13431 153365465 170379120 188928039 209031481 230602488 253309389 276843848 300864490
13424 300864490 324845978 348392680 370829237 391558577 410258261 426629472 440511772
13417 440511772 451742300 460352395 466655503 470926702 473490671 474778682 475148913 475056427
13409 475056427 474704738 474341871 474290534 474548221 475207880 476240898 477509987 478753832 479802277
13400 479802277 480297986 479809834 477930408 474241170 468318396 459900885 448864593 435121577
13392 435121577 418649535 399756141 378765769 356117223 332410079 308196371 283992849
13385 283992849 260397335 237689679 216183212 196136106 177526019 160509881 145058048
13378 145058048 131062497 118528126 107324095 97292165 88362148 80347996 73151491
13371 73151491 66713214 60995556 55934887 51421614 47346215 43662900 40374513 37443772
13363 37443772 34807457 32383093 30200968 28268335 26525230 24864960 23369681 21990178
13355 21990178 20695921 19504524 18414182 17416165 16543081 15704999 14977640 14279664 13596084
13346 13596084 13027377 12506977 12014713 11518007 11037891 10567210 10133298 9762542 9395421
13337 9395421 9040702 8747859 8485716 8278620 8024730 7728821 7498996 7303356 7125576
13328 7125576 6910008 6701314 6483330 6316473 6170651 6037478 5826504 5691594 5524815
13319 5524815 5397625 5193507 5024688 4933623 4830476 4703684 4609575 4527855 4394082 4267761
13309 4267761 4163113 4014863 3915582 3849903 3749066 3698341 3640942 3568376 3532330 3455732 3405459
13298 3405459 3321835 3219403 3164798 3104332 3009429 2930939 2922130 2845081 2760237 2725721 2727581
13287 2727581 2658931 2591772 2521029 2460801 2430477 2434574 2393220 2333559 2306072 2285208 2210430
13276 2210430 2183846 2159801 2090940 2069700 2080131 1997782 1908881 1878222 1914407 1976527 1911052
13265 1911052 1826368 1764455 1738721 1769635 1780887 1750047 1719106 1748985 1718709 1675186 1616908
13254 1616908 1621597 1647325 1647801 1653258 1676305 1645899 1654893 1686791 1680185 1682053 1671085 1604179 1592676
13241 1592676 1622599 1622013 1602284 1545446 1513093 1562600 1634661 1638986 1573327 1530100 1552733 1548457
13229 1548457 1536464 1503768 1542540 1536403 1492190 1456059 1397659 1408640 1409748 1402067 1359297 1334418
13217 1334418 1336066 1309648 1307813 1261207 1247221 1267755 1294960 1290297 1287262 1303623 1300657 1316352
13205 1316352 1246053 1252373 1264748 1272458 1240308 1226691 1179007 1109263 1057023 1103643 1129504 1145065
13193 1145065 1162278 1183875 1185095 1193410 1203070 1184132 1130760 1056215 1090004 1086122 1076723 1067431
13181 1067431 1073987 1083561 1018509 1011829 1028034 1020187 985548 1035265 1090616 1130564 1128342 1103208
13169 1103208 1111581 1153725 1192557 1195783 1105160 1083814 1092373 1064508 1040344 1066371 1118576 1151155
13157 1151155 1098761 1083375 1084648 1049992 1052776 1084063 1131696 1153854 1151379 1086526 1078397 1050016
13145 1050016 1028137 1016457 997798 1029460 1033455 1022710 1028977 1011593 989238 957261 979463 1029914
13133 1029914 1065627 1061572 1089940 1104625 1090950 1017573 1035845 1059542 1093564 1190922 1218300
13122 1218300 1185797 1143313 1122381 1077400 1017469 998305 934879 845137 793014 779515 769797
13111 769797 782071 749118 619599 552757 528167 461954 454041 438037 403905 389649 313164
13100 313164 274806 275813 297715 282518 286942 276170 172861 125693 142145 159175 118890 55720
13088 55720 -2535 -41290 -54341 -57341 -131939 -164219 -171528 -157177 -160644 -123404 -86257 -85048
13076 -85048 -21463 51395 150806 373763 573867 716132 747185 677425 533071 357751 283080
13065 283080 303790 270497 207857 182461 196429 191372 178176 220398 256560 203199 168978 189103
13053 189103 187166 226043 232909 221580 256202 265305 247586 224197 185268 190042 257064 274349
13041 274349 212036 238667 281465 319014 338259 360595 429023 413377 440516 542938 755975
13030 755975 1045999 1438759 1918016 2468227 2877723 2896577 2594830 2110455 1613227 1189897
13020 1189897 934867 806101 716928 622157 547990 532986 506656 515664 510098 474069 392802
13009 392802 330114 395723 381563 369022 365262 367714 386271 381599 361587 408591 456314 437389
12997 437389 456760 458893 457129 512808 562665 667212 811820 890475 1010703 1151726 1273257
12986 1273257 1444373 1748453 2197918 2795030 3538950 4115596 4257629 4053053 3644854
12977 3644854 3240990 2986426 2850698 2828343 2785588 2693669 2725566 2774395 2813215 2826897 2824603
12966 2824603 2792278 2747111 2763221 2778529 2810429 2856908 2851268 2781010 2713691 2669162 2702246
12955 2702246 2757951 2738500 2715083 2710024 2691658 2690515 2648397 2591348 2562354 2499353 2353403
12944 2353403 2259555 2158750 2052523 2017508 1978912 1999119 2089540 2174547 2197552 2096639 1925523
12933 1925523 1639322 1375939 1159726 1053203 926192 794714 753041 741602 664297 583481
12923 583481 551227 542141 498177 491745 451530 390832 375022 399294 434974 423808 405083 366152
12911 366152 357457 349639 350939 323005 323003 357340 352271 319381 308844 250294 194948 201811 241606
12898 241606 223428 201465 257298 267787 281966 257040 241922 190465 196808 186680 186779 194516
12886 194516 200303 198964 197818 170689 172268 216149 227540 263950 269418 223959 199023 212476
12874 212476 221700 182190 144222 141225 172797 206293 201591 210304 219261 232326 245229 209059
12862 209059 198945 172783 164009 190856 190155 166244 195980 191217 164520 185498 177490 162392
12850 162392 132378 143605 158060 102422 97670 128867 109892 128309 126944 178142 159990 130565
12838 130565 185468 180355 175328 157146 80578 82298 103867 103500 133491 146037 133432 119566
12826 119566 135545 154020 160117 147748 150797 164643 245147 220785 191505 191163 174150 186588
12814 186588 206489 229764 217907 194343 234830 194667 153237 132759 108199 107582 109201 81139
12802 81139 88329 102932 67576 88265 93280 76956 87408 107838 133464 122929 85757 52252
12790 52252 95391 100827 151156 175306 121840 82338 113499 118247 131811 130453 123407 148386
12778 148386 185549 211247 180843 152402 124902 120503 151839 131360 133479 137596 161676 184932
12766 184932 211515 189604 155700 91268 79145 44074 13765 24473 58636 84740 117831
12755 117831 141887 125249 92553 97592 79215 128285 88995 67637 60822 75767 98257 88406
12743 88406 119654 137131 152030 194914 203901 162891 102152 84062 125186 150003 131796 121875
12731 121875 158828 159055 136015 142522 133964 132777 150213 166071 188168 140857 138272 125377 102829
12718 102829 84587 93415 95313 71593 55039 46364 36778 50488 94865 122611 143188 137260
12706 137260 156708 167366 118697 135514 125941 84731 105948 111676 82676 94377 153136 201950
12694 201950 205460 195632 177736 108381 119356 144404 154691 113794 76633 17298 35269 63444
12682 63444 62568 110822 144187 121059 71553 77620 119668 126458 101095 119667 120526 95166 85684
12669 85684 111589 112735 74751 27628 39280 86727 116066 71819 54244 54503 59103 41611
12657 41611 70881 77819 35960 8423 -8170 39680 87492 144424 94468 87068 105651 112208
12645 112208 127106 158777 144350 86777 54696 80053 137231 149683 165981 179570 165270
12634 165270 180163 181494 104013 59950 95557 144670 208552 156299 112468 156775 133956 69472
12622 69472 80636 67345 89344 102145 123059 177210 181479 174081 145529 76757 44183 66676
12610 66676 157474 198309 210123 208081 169088 116163 78167 51912 80097 172803 189779 163722
12598 163722 135687 113766 102889 166162 211776 214471 176096 124609 171074 197818 171230 74830
12586 74830 37518 44395 22807 15298 9577 970 19267 54854 104249 126344 188302 219901
12574 219901 189910 170795 163543 196679 156961 95830 107512 110348 128956 145010 125802 92963
12562 92963 94268 116161 112613 95470 73325 88263 117547 149550 191622 134810 90544 52364
12550 52364 40006 81914 131912 181167 166325 116054 54402 20758 52925 113157 103786 119255
12538 119255 137845 125656 172176 185022 200308 245202 232714 177156 173091 169342 120676 65888
12526 65888 62200 46921 31595 66502 108272 145919 153491 161697 73144 43478 41507 112626
12514 112626 139438 119416 155552 185307 236128 244918 213347 232221 227235 172384 186531 204221
12502 204221 275322 303025 289668 242933 199482 172410 182175 236944 231344 211409 225402 223222
12490 223222 213744 224541 191641 162248 142980 142983 165696 183177 162353 154738 212804 267563 253611
12477 253611 211553 234984 215225 194655 157398 119003 83720 86774 128632 172611 218383 209629
12465 209629 190820 165982 152233 163038 172117 210201 188522 147531 226340 252313 224242 204543
12453 204543 196373 113830 148082 219287 248858 193263 192374 237860 251102 224804 141841 158085
12441 158085 196286 218965 189745 156759 155874 125623 130927 148786 211094 183898 162854 181950
12429 181950 172660 123190 102181 129852 175617 170773 189372 171152 138341 101376 130865 161242
12417 161242 149867 144821 134836 122572 150359 112161 150363 151892 184387 157424 125095 167515
12405 167515 247394 203472 178623 190264 178218 179735 189364 216616 228264 238464 246607 274257
12393 274257 282665 270220 236808 170294 169978 131455 175686 225502 248760 218735 175059 168089
12381 168089 173211 203583 261315 281086 255648 229263 205631 180286 190220 206987 190814 171908
12369 171908 206249 240487 244003 252490 257870 271748 208302 166543 205486 223883 216032 198870
12357 198870 207155 212234 207693 202574 221434 214140 200675 238972 332307 302978 233690 218941
12345 218941 265448 278289 264367 256924 277660 283386 300678 339111 331221 294848 269377 282400
12333 282400 286050 276983 283823 283029 299877 316299 354628 318437 308304 348980 372152 374922 292505
12320 292505 208680 186840 206266 240715 256222 260206 242083 223987 279743 292176 285182 258660
12308 258660 268933 315273 311474 282374 225202 242457 255280 261663 272626 273177 243144 227607
12296 227607 248096 277110 278002 234034 236605 189238 239538 268217 248164 259520 254554 289429
12284 289429 289417 276836 324917 321091 304111 311143 274251 318749 358200 361786 305408 299587 268193
12271 268193 280764 307963 231864 180881 214237 265838 309495 250649 242877 283898 295215 268628
12259 268628 248343 272019 254956 228746 246502 268668 296258 265775 203840 198274 267214 273622
12247 273622 300582 345039 308548 254168 300482 284366 292362 314265 366608 381469 375903 326312
12235 326312 252681 300044 321740 300609 307902 247282 210733 222561 275573 300633 320417 285536
12223 285536 257643 272222 300200 275997 261753 323194 364175 357548 313707 331453 339271 358407
12211 358407 387306 378222 324402 353203 387623 418555 426430 386275 391660 383788 334257 382237
12199 382237 382425 362298 376145 412983 402035 372422 403014 448525 505127 544799 505342 487883
12187 487883 464637 487334 560471 479472 443632 463861 479695 518603 515273 442434 450116 502837
12175 502837 600575 640508 581426 533833 493492 508063 508296 491622 527089 599541 605411 630559
12163 630559 691550 723576 685346 660069 688495 702228 736162 771490 768381 801891 819997 842864
12151 842864 802216 744103 709786 706622 733754 761915 712374 732893 721905 738368 755491 718841
12139 718841 695408 695072 738880 790487 846557 840776 891553 980088 991670 906745 875128 944065
12127 944065 977367 997119 1023061 1073687 1093748 1054394 1096835 1171263 1212509 1191307 1208023
12116 1208023 1227757 1234898 1284778 1337519 1316510 1316510 1326012 1385518 1487416 1508279 1457118 1487452
12104 1487452 1505424 1511027 1519288 1547301 1561968 1581578 1655409 1731258 1708297 1724688 1808640 1902429
12092 1902429 1962648 1994866 2006550 2024413 2084499 2138938 2180669 2225112 2250398 2322303 2348906
12081 2348906 2425125 2515935 2608593 2673623 2721108 2828262 2897249 2897323 2922782 3032684 3122427
12070 3122427 3217948 3341008 3418921 3493383 3613286 3693634 3774965 3879013 4040721 4216947
12060 4216947 4330668 4456977 4541650 4688391 4852303 5053165 5237563 5440371 5652383 5870469
12050 5870469 6066832 6274321 6538392 6764052 6989470 7280077 7574535 7868578 8137910
12041 8137910 8446342 8777577 9174598 9544794 9901308 10284457 10690521 11093688 11568004
12032 11568004 12026243 12509432 12992342 13496761 14015169 14501443 15045586 15676333 16242496
12023 16242496 16771585 17350821 17953127 18513464 19153030 19702549 20204538 20745694 21234919
12014 21234919 21613522 21997210 22314433 22532607 22799759 22941553 23011525 23064372 22983494 22851174
12004 22851174 22681331 22446662 22212689 21923696 21480324 20998777 20519946 20001721 19467083
11995 19467083 18912751 18349828 17802476 17283071 16744849 16181270 15625977 15087771 14548424
11986 14548424 13977344 13517026 13050201 12582437 12151045 11681342 11249194 10841770 10474236
11977 10474236 10043659 9661536 9302620 9014003 8758745 8479366 8200784 7854485 7558357
11968 7558357 7317994 7061632 6866802 6674896 6452765 6209780 5978313 5716966 5516183
11959 5516183 5311350 5167108 5092807 4947875 4796419 4652097 4512598 4376230 4238616 4098074
11949 4098074 3998290 3864251 3707871 3581000 3462599 3366220 3229853 3105544 3034145 2949127
11939 2949127 2884778 2840038 2747064 2668056 2614503 2607183 2547326 2465662 2419935 2375800 2307424
11928 2307424 2246651 2191338 2128171 2044194 1962548 1927269 1893979 1844928 1851215 1828821 1769178
11917 1769178 1740011 1705058 1690120 1668328 1606389 1576204 1557179 1497323 1513552 1444366 1407135
11906 1407135 1389917 1359417 1352468 1288125 1308405 1316693 1348444 1296849 1237094 1207805 1223495 1190183
11894 1190183 1209859 1205804 1136566 1080312 1034828 988066 927995 915413 944888 968390 945385
11883 945385 936015 898671 806244 763124 760092 737475 774449 825597 828533 834955 811932 780762
11871 780762 770649 743063 708448 724218 753004 671808 620589 662992 700521 706779 707532 676184
11859 676184 607580 585772 566010 573385 538033 544735 532098 496839 526565 518646 510056 543244
11847 543244 546449 549920 511549 484636 510174 495780 489420 466192 468684 434766 443099 424460
11835 424460 394342 435324 488478 482505 425127 448301 473574 428536 441529 435369 386672 411797
11823 411797 434819 448999 433729 411341 410973 378208 352696 348611 377071 397342 388160 377907
11811 377907 378774 358077 340854 369515 325521 258564 310595 374254 366397 354299 315244 303570
11799 303570 318483 310353 317355 329160 333864 283146 249418 244341 268529 310397 293259 253863
11787 253863 221243 242373 260176 279241 314032 303701 288409 280635 302654 303673 270272 272507
11775 272507 340139 357799 326013 310454 313060 279253 293158 260634 292529 346432 366361 343497
11763 343497 302894 255933 245882 282745 258165 223755 211336 186717 195771 239581 247566 326573
11751 326573 345306 339956 293675 224966 179566 137857 132282 203245 246643 214098 145726 137761
11739 137761 174913 249595 339101 299728 201675 181404 175252 208202 134568 94067 126760 210115
11727 210115 264126 295158 335815 304815 264031 257541 244220 180249 181384 221513 256162 300666
11715 300666 256417 157412 114784 131764 171810 215441 211667 160862 98079 105404 88819 119012
11703 119012 184388 202089 158947 135734 176231 240570 230220 222354 179610 128957 101721 115694
11691 115694 182251 262984 267865 230832 178847 182017 165052 152558 158095 165477 202803 239901
11679 239901 272692 351454 387055 353582 367508 402621 470731 570866 611802 657772 697785
11668 697785 757267 793107 816710 899947 981250 1024132 1002875 1054269 1130099 1153303 1103013
11657 1103013 1105339 1095144 1115911 1125402 1094116 1034199 983712 895758 831355 767822 761996 722289
11645 722289 657951 591966 511280 451708 413993 344155 311002 285775 236033 241379 220754 137114
11633 137114 155731 150648 184463 204957 193018 186503 212279 197021 145595 120951 169856 169170
11621 169170 104385 69452 62997 61586 83411 103809 93647 83133 62570 66904 101713 108575
11609 108575 119658 64468 108041 108126 66671 89183 100545 74436 38250 48333 29892 52531
11597 52531 102561 84086 69081 21698 8421 -2573 80360 81934 43177 -13722 -47078 -52663
11585 -52663 -50740 -33814 -24410 -23894 -11195 -32093 -75735 -32126 -26505 -51550 -37300 -14437 41723
11572 41723 41389 9168 43968 48004 21796 16586 31185 -9290 -34452 -37884 -7322 -987 -15487
11559 -15487 10176 19975 27858 20986 15804 9220 66036 90314 111907 109036 107970 82690 346
11546 346 14879 63814 59104 103984 81222 59641 57615 60472 58294 75375 90502 112934 142672
11533 142672 209909 152971 86485 95145 135872 52279 56567 105788 119084 37969 -13168 24599
11521 24599 36965 13090 49167 52613 48409 113868 93693 72762 64186 94668 85626 71924
11509 71924 34429 40831 77576 41034 10631 -9540 -599 64796 51806 31435 -564 -31577
11497 -31577 -43658 -49339 -53676 -51991 -31717 -19403 -17919 -5066 -49114 -44266 20149 49467 64304
11484 64304 109321 86483 34040 -3300 21806 54069 47365 16412 27126 12671 -18075 -1936
11472 -1936 27686 -31926 -69810 -71847 -84607 -72288 -29674 -74094 -57271 -52667 -66924 -111579
11460 -111579 -128441 -90039 -58633 -58885 -90161 -59998 -14722 8681 28366 21979 5323 11305
11448 11305 61673 18771 -6057 -20589 18993 35445 7822 -35818 -35406 -54627 -68689 -28193
11436 -28193 -32892 -101067 -46390 59882 94002 137573 75714 5595 -35214 -20387 -42282 -67333
11424 -67333 -44346 -55212 -80726 -15774 15527 -31451 -44136 -46884 -37504 -46437 -62338 -72255
11412 -72255 -62349 -76714 -70457 -54198 -20239 14191 23336 32801 11953 28258 38440 6620
11400 6620 -2466 16005 15969 5038 -29141 -43793 -51408 -47573 -44948 6569 -9502 1110 13167
11387 13167 -15110 -60334 -51731 -9715 -2242 28120 92114 25068 -46296 -7617 -28716 -55401
11375 -55401 -1157 22743 -5746 1684 35056 54135 1270 -10479 -13027 -27799 -96517 -82643
11363 -82643 -37857 23513 69095 32206 -32003 -83891 -26763 -3271 29764 37721 15723 -38713
11351 -38713 14699 47514 -7530 -149075 -163571 -111807 7544 6350 -4102 38089 33056 55101
11339 55101 34606 23417 22238 48246 39258 19 19045 21845 93206 122196 66049 10747
11327 10747 -13123 -47801 -26276 -10605 44936 12731 -11741 -10831 -2788 -19570 -30001 -10135
11315 -10135 -16587 -66888 -106739 -125878 -81321 -97512 -60333 -29018 -2932 8970 -45088 -96756
11303 -96756 -69030 -65647 -53290 -59353 -44864 -30143 -21544 -7405 -3736 31568 63933 37554
11291 37554 7928 -9668 -35955 -28302 35743 77963 69123 69544 58981 3282 31897 55800
11279 55800 84392 66986 28765 29020 -48489 -48109 -47049 -5140 42766 -5344 -25335 -5227 64312
11266 64312 57665 19600 1053 20192 16752 -8838 53 -34158 -25436 -17751 -35577 7289 27742
11253 27742 -16251 -38227 -76563 -117789 -105509 -128747 -109718 -72096 -104183 -138557 -65592 -55554
11241 -55554 -72588 -36619 -58240 -66594 -99940 -85236 -50743 -52756 -25077 -33557 -52166 -56421
11229 -56421 -63547 -50347 -53668 -76327 -57941 20558 58379 19618 -46119 -60536 -99353 -57953
11217 -57953 -5059 -29161 994 30286 7515 -39285 -37738 -10649 -24413 -67193 -73257 -4486
11205 -4486 -43837 -57564 -26288 -48893 -82449 -68904 -14280 -4314 -40330 -38657 -12095 -1331
11193 -1331 -18497 -25837 -27798 -19009 6456 -17867 -46322 -44696 22777 16675 -13822 -45131 -68598
11180 -68598 -28553 -1215 -1436 10140 22991 -14744 -56028 -34819 -27492 -14303 -1378 -30799
11168 -30799 -54495 -51452 -74032 -115034 -127715 -95775 -67434 -17444 -2215 21264 18083 -10607
11156 -10607 1491 31006 48152 88890 81748 22578 31999 78506 51131 52912 38234 34412
11144 34412 69951 75378 63905 104928 108776 126686 95154 31960 -44436 -10173 8348 -14128
11132 -14128 -10599 -6359 27726 36479 73018 34794 12359 31206 26846 45174 65705 41640
11120 41640 45273 -25024 -35736 -12935 34682 58583 104549 59521 1428 -19536 -3727 20505
11108 20505 19386 19314 26022 18400 15780 45750 58610 43217 12270 -14033 -1135 15803 10842
11095 10842 -41554 -59919 -48351 -35617 -20449 26783 14981 -7602 -26663 -49627 -50395 -30738
11083 -30738 -23978 -49371 -97392 -99542 -38705 -8104 9121 28412 20230 -4848 26617 30297
11071 30297 45738 25938 7049 -24657 -44199 -53183 -32976 12856 20617 -44180 -91091 -43738
11059 -43738 -12792 56169 67142 88816 32866 -32887 -51138 -33988 -11067 20080 -5931 -64387
11047 -64387 -98481 -33996 8891 49165 77030 115246 112182 134829 129598 123387 130516 164996
11035 164996 170560 151102 166460 245900 280676 308389 296380 252442 259869 203013 203678 214781
11023 214781 240443 261757 293303 335435 369277 408728 404098 317649 224728 204551 197938 195633
11011 195633 167650 153122 167887 172527 184548 163523 151266 78463 30064 69051 56121 101013
10999 101013 150827 128932 90336 82525 82463 86388 38954 17841 34826 31782 -28620 -28086 1598
10986 1598 -23711 -76048 -100561 -94456 -105955 -97285 -8066 29541 -27184 -30846 -36326 13090 47358
10973 47358 41174 20104 -14323 7013 11658 -39681 -78292 -78735 -46748 -42290 -27702 -45593 -61068
10960 -61068 -59199 -65479 -69252 -39812 -37900 -27251 -26199 -49024 -75782 -27684 -4641 -26237 -31968
10947 -31968 5348 -878 -5058 13889 -31120 -76920 -52148 -64361 -98286 -61968 -26810 -16694
10935 -16694 21333 24510 10716 13839 3059 -6213 -27174 -22817 46411 70296 16198 -35324
10923 -35324 -32351 37652 80152 93481 68690 14114 61676 78683 102360 73561 73597 45768
10911 45768 -38873 -34527 3225 4608 16586 46829 -46034 -128342 -118050 -57232 -6749 39259
10899 39259 66658 53356 53852 14368 5363 2038 7477 1943 -8980 -1642 -11099 -12194 -31782
10886 -31782 -28113 -52889 -87809 -113544 -62441 1097 -46468 -74970 -80180 -80476 -62463 -69173 -92865
10873 -92865 -51793 -38325 -65041 -95011 -81630 -96868 -165912 -142805 -97783 -86461 -12609 34254
10861 34254 70801 88489 123830 83292 24192 47910 62806 26552 32332 20171 25959 3576
10849 3576 -35784 -57409 -84080 -64757 -32570 -28231 -14805 2950 -3355 -48775 -39845 -38771 -80000
10836 -80000 -65285 -93918 -57993 -59358 -61029 -54030 -44729 1097 2603 -24662 -3541 -72373 -112990
10823 -112990 -125975 -98989 -86637 -93887 -94643 -59587 -45250 -43063 -57585 -58479 -53773 -88829 -143996
10810 -143996 -146416 -122335 -64086 -32699 -33080 -93617 -8241 21576 -13679 -29421 -77873 -105046
10798 -105046 -126089 -114051 -101629 -68167 -50849 -101432 -121769 -161355 -202871 -180078 -185255 -219074
10786 -219074 -199794 -174398 -127976 -80245 -90298 -84368 -78648 -55732 -52007 -98712 -87917 -101336
10774 -101336 -68304 -50622 -31812 -52889 -124148 -135095 -86518 -58874 -48923 -28669 -27871 1541
10762 1541 -14566 -24629 -64571 -50559 -70612 -151411 -185862 -191926 -218005 -209365 -173395 -94047
10750 -94047 -94391 -120389 -143832 -149749 -94060 -47318 -73382 -111090 -135300 -118958 -135049 -98575
10738 -98575 -137027 -180443 -168958 -137029 -87564 -32672 -7173 3806 2092 -9612 -26820 -74921
10726 -74921 -82032 -77241 -131929 -141936 -134056 -111264 -68284 -116717 -109315 -55672 -45249 -39342 -22393
10713 -22393 -20724 -93594 -120858 -92773 -74632 -124736 -109064 -107612 -62887 -10173 -10828 -41352
10701 -41352 -57615 -51715 -60110 -63478 -57216 -99762 -139692 -148814 -134505 -150270 -133783 -77902 -33832
10688 -33832 3188 -3994 -79540 -57654 -27152 -49865 -73454 -113641 -132368 -119829 -58727 -30037
10676 -30037 -55727 -94514 -141369 -121062 -78904 -80138 -32857 1270 12061 -3176 -26523 -37569
10664 -37569 -73792 -34057 15036 53158 37448 -10697 -43335 -30544 -30783 -26876 -58379 -18653
10652 -18653 -38184 -17889 43768 68050 89880 88442 50309 21263 48154 55967 62237 72028
10640 72028 98995 105240 142620 191442 230617 232697 323465 424738 490182 582572 732175 857021
10628 857021 998322 1132434 1321725 1518298 1798591 2096722 2559901 3163407 4026164 5166080
10618 5166080 6751816 8787108 11390805 14426201 17509589 19896766 21102023 21196692
10610 21196692 20585276 19975293 19935531 20729300 22627087 25979009 30896370 37018499 43034150
10601 43034150 46940251 47698935 45702719 42428846 39391943 37496105 37304679 39133463
10593 39133463 43227885 49514190 57168299 64024767 67317537 65758563 60421630 53592320
10585 53592320 47287097 42514731 39637825 38768624 39872872 42640659 46328033 49330638
10577 49330638 49716670 46846739 41770220 36047899 30950893 26983172 24328699 22891012
10569 22891012 22557847 22949896 23601423 23876638 23029809 21011229 18234338 15287372 12528508
10560 12528508 10177049 8300288 6805585 5720219 4948595 4276501 3693718 3287935 2907121
10551 2907121 2618886 2408614 2197518 2078706 1926039 1810466 1695334 1596759 1438101 1311880
10541 1311880 1248913 1230243 1197726 1109848 1012013 943970 923962 866480 846037 806714 792150
10530 792150 823287 773895 704784 712647 668192 603266 576610 568057 630085 662558 613951 577309
10518 577309 587519 570171 494942 455268 456187 497425 514265 465447 471929 468587 452373 394205
10506 394205 380461 382689 380389 378846 380322 404742 358205 323081 316128 333909 338289 330770 306712
10493 306712 280841 286694 304749 299996 267647 273606 290971 328005 326300 329118 326436 338073 276073
10480 276073 225842 230602 268015 255564 219104 268490 275334 232705 186291 205609 268221 247907
10468 247907 243515 280790 271503 256426 270812 262371 230360 244143 245375 244756 245056 251036 237554
10455 237554 224862 237116 272594 326040 331013 274974 236306 242601 237133 253156 234652 194222
10443 194222 217359 189828 143232 193135 219811 196339 221586 209121 144921 148323 125019 64907
10431 64907 58013 88027 39257 30039 117639 196610 225088 235404 192932 149780 178234 182079
10419 182079 214730 197737 171718 99572 127199 140947 154230 185421 169960 145140 111135
10408 111135 126558 150542 138023 138820 116044 133124 181357 180647 120002 108050 121814 112757
10396 112757 51491 51743 122375 127281 105875 107214 101785 134146 116694 113487 157905 135936 137634
10383 137634 157427 118948 85014 83925 92208 113402 103090 83193 110872 96778 93443 133834
10371 133834 83016 59814 80775 74034 126538 218909 225779 185818 97171 18477 75248 59923
10359 59923 29684 17295 21556 7996 40141 53327 71902 75988 88137 71605 33119 -15343
10347 -15343 32546 25936 8105 -5843 20440 57740 100297 127703 115470 99183 124704 105613
10335 105613 54135 28259 10424 2949 -2495 -21025 -411 62102 118247 101488 118085 137714
10323 137714 96009 98812 153475 125471 109182 101080 113788 108861 116876 54618 -19147 -31387
10311 -31387 27942 27433 23796 62770 114233 161084 121710 87602 41599 56873 105924 92913
10299 92913 104318 124513 105466 64503 48849 44191 -914 9480 26408 73619 117860 65122
10287 65122 59480 63044 68252 12233 -25288 -41747 -38048 -39737 -27509 -22704 -10710 13890 28597
10274 28597 13088 29034 -4782 -11379 25764 25454 19325 24286 -26741 -28696 -4433 28339 9250
10261 9250 30456 48721 11926 18685 27143 11187 -29824 -16137 -9945 -38439 -30149 -42653 15086
10248 15086 18204 -6522 -13312 -16423 16265 19022 -32235 -71391 -70900 -55355 -25416 2165 -9080
10235 -9080 4498 27685 37624 55656 6120 -17270 -2374 -23022 -30017 -44400 -127347 -80733
10223 -80733 -26195 -1520 -12747 -30973 -19130 62773 99873 91025 81832 50652 48940 36077
10211 36077 2828 -9979 12691 -14671 -25412 38212 85285 80661 60226 59120 57176 8370
10199 8370 -44421 -58370 -48250 -63974 -42906 -21776 11786 4261 -15767 -53703 -36570 12294
10187 12294 -4127 54402 82393 87827 63452 55952 51848 74364 155311 211375 240717 214554
10175 214554 197538 194803 206293 223295 204992 170155 130342 192083 281001 322834 297760 275075
10163 275075 265179 305649 309233 288541 288340 237229 241517 292746 305617 370733 414642 449517
10151 449517 424709 316139 251646 240829 224352 161958 135198 147132 145848 167930 176553 239176
10139 239176 237564 189480 170327 168041 149582 89668 74346 81078 140408 175684 179131 178954 145086
10126 145086 129657 88005 98015 93817 159517 142925 70749 27576 14554 38705 10563 -20004
10114 -20004 -28984 782 23794 45854 89447 53129 48156 56493 44252 75211 61508 49366
10102 49366 32833 33134 50956 45172 27117 13406 5505 -35065 16949 68102 92984 109776
10090 109776 95431 57506 -5889 -45674 -29051 26817 -15443 -50409 -26027 7247 12780 -37941
10078 -37941 -99878 -140499 -60385 -307 681 -3923 -8542 -36366 -9202 43570 37912 53932 63232
10065 63232 -6312 -70673 -40796 -26017 -16733 -30340 -12686 41533 -9393 -20480 601 -31128
10053 -31128 -30215 -12614 -14773 -18249 10358 28074 -25762 -28780 -2594 -48697 -65145 -77902 -100395
10040 -100395 -112337 -82077 -20734 -22176 -19309 -11472 -36067 -34883 21754 69773 85515 63600
10028 63600 13805 -13161 -31607 -28310 19686 50888 91500 22375 -56043 -68162 -71947 -41858
10016 -41858 -12022 9280 -12051 -58881 -66335 -63710 -61401 -27613 -940 11777 10543 -21594
10004 -21594 -95004 -149503 -122200 -102808 -119273 -65957 -17461 -68054 -74928 -124173 -133858 -123337
9992 -123337 -103848 -54992 -53513 -30716 -49903 -16932 25825 17091 -26451 -42435 -40410 10818
9980 10818 55672 93597 50699 -20987 -33798 -31344 -43690 -20162 49713 59781 27674 -1531
9968 -1531 -9447 -18350 -15940 1440 48065 15480 -13246 -16686 -2140 -1261 -9056 30085 58074
9955 58074 63263 92050 48306 30152 31998 -13957 -14824 1296 9574 37887 83604 44423 6502
9942 6502 11644 54390 26195 35672 18008 11740 50143 38419 9468 -2842 -29477 -36185 -1632
9929 -1632 15474 42162 48693 34602 42025 36898 -5966 -66590 -55536 -39770 -42229 -70860 -99646
9916 -99646 -135806 -95686 -45780 5948 92059 188295 254984 310715 374671 363128 330465 358031
9904 358031 322930 295238 279739 246822 169106 113035 59296 30715 41572 27723 23184 61239
9892 61239 112182 102767 92866 72307 39129 16750 35318 -4030 -5085 7579 23692 37614
9880 37614 27262 9699 14457 -11556 6740 42481 55546 63945 99728 135381 152773 136175
9868 136175 22961 14679 13499 -18075 -26364 -1764 7347 9790 1730 -18544 -16013 -51617 -79629
9855 -79629 -74422 -22186 -23992 -44003 -10979 13736 31731 18805 35617 37291 1518 10868 21562
9842 21562 -29097 9041 38502 7289 -15766 18029 48252 48947 1620 -58508 -75787 -75270 -64580
9829 -64580 -32215 -82979 -92767 -71488 -16310 2579 -5025 -36445 -10667 -37660 -4177 23594
9817 23594 43325 48022 35079 43712 75272 63642 4537 32106 61879 62227 59086 50545 47714
9804 47714 53904 62139 98749 111519 167086 207131 146499 122561 102922 102770 112250 100043 100560
9791 100560 111918 120571 144373 172783 225144 286531 344277 375968 353138 362576 464062 566470
9779 566470 738068 1001848 1353178 2023740 3266608 5291980 8251927 11183456 12424230
9770 12424230 11376754 8979975 6469281 4496820 3135290 2223466 1668360 1345235 1081092
9761 1081092 904042 751389 577370 420359 388104 327018 313721 288358 266057 240650 271861
9750 271861 270163 228372 209781 222334 271300 248692 200280 212080 150483 100880 99515 99035
9738 99035 52679 39046 35542 65542 47925 25335 49855 86808 73861 81346 102315 56885
9726 56885 10787 -18502 39109 56756 106208 108730 111996 61944 40228 51447 34696 45650
9714 45650 77465 60474 59768 83319 35912 10452 46831 53915 63678 68371 92067 126648 163100
9701 163100 148774 73658 50820 30696 -10863 -4833 -20475 -24911 -290 30908 24910 64970
9689 64970 72903 65106 89880 96274 71429 58887 19405 -45420 -55900 -47316 -50124 -77407 -96515
9676 -96515 -83752 -88286 -82431 -40867 -34511 -24988 -42413 -224 45939 32619 40059 10214 -34771
9663 -34771 -62905 -65242 -74756 -65727 -53001 -21041 13082 41854 38368 24632 -1382 -39259 -19053
9650 -19053 -5778 -1084 41161 49960 48361 25428 9910 14712 7130 -32785 -9177 11290 -42707
9637 -42707 -69879 39058 30902 27391 41319 18984 7383 12311 42515 40748 42571 941 20512
9624 20512 26060 35665 29247 24774 54918 93543 112969 68652 2810 -13626 2100 -62453 -64574
9611 -64574 -19829 31434 15530 -50383 -68329 -41307 -12230 -22106 -39329 -22123 49257 92702
9599 92702 68938 66144 36105 -3177 -46120 -66697 -98503 -81420 -28601 1323 24944 47633
9587 47633 9156 -50707 -64483 -91084 -97941 -76607 -47832 21463 83944 87159 68416 70331
9575 70331 36073 16088 44310 33927 18264 15141 16931 13288 -4895 -43105 -30359 -62150
9563 -62150 -67681 -76653 -84218 -15981 7818 12861 -27095 -16437 8853 29562 63127 31690 -5052
9550 -5052 -24951 -54779 -57140 -42949 -70989 -56315 -30408 -38278 -47143 -49804 -13595 -18955 -60840
9537 -60840 -53917 -42921 -27071 10862 -17429 -26218 -7921 6873 4403 20410 -886 -8336 4713
9524 4713 -40184 13547 39321 27153 -23469 -51333 -35491 17055 -40051 -56189 -30655 -45955
9512 -45955 -65121 -61370 -32296 15169 -32704 -8560 1596 9646 12686 18407 40017 -3233 -6465
9499 -6465 5919 10256 -21423 -66941 -38041 -8825 6765 -51872 -70582 -2549 3048 7643 -9882
9486 -9882 10009 6450 11071 -17454 -61365 -47426 -31026 4935 59202 68144 62048 33711 70193
9473 70193 120298 105874 90222 89707 51518 7857 44514 43570 1809 -18744 36091 97750 147317
9460 147317 109272 91846 93371 79377 -7349 -50177 -48421 40084 90096 142355 126831 123170
9448 123170 101206 96600 68721 85027 59460 22872 -14565 -15807 -47863 -75644 -69689 -1110
9436 -1110 15120 5800 32097 35656 -425 81964 149595 128619 79627 46929 33449 26692 94736
9423 94736 145746 177830 170321 109727 59787 95709 143309 162682 110055 70612 73419 122623
9411 122623 157052 75579 70646 153981 187201 213252 258554 262733 217859 188614 149014 107768
9399 107768 105541 90182 69847 9149 -26793 24259 110020 143510 133755 107266 96029 119005
9387 119005 95102 87584 109281 136655 152111 120655 95623 46234 22500 56233 97334 81575
9375 81575 14259 -35444 -25647 -34522 -3738 48174 90502 178099 200841 208388 167245 146617
9363 146617 153895 173341 188195 162338 129638 92046 94870 115777 89523 87908 47893 20007
9351 20007 86394 107049 95355 164408 268265 278251 195897 208165 298264 334931 396096 439558
9339 439558 486792 508719 539237 656096 760579 896001 1117284 1289494 1421224 1525751
9329 1525751 1626147 1681062 1594365 1440491 1292782 1103226 938130 807194 721384 597976
9319 597976 532411 484751 467646 416069 306242 274913 221710 162503 149772 155201 147104 140514
9307 140514 200799 240953 265869 205591 153173 115927 67759 63042 71192 48239 39390 57437
9295 57437 31892 27199 30702 19593 -20003 31491 100669 107768 69457 35293 103427 96122 77670
9282 77670 51172 47318 92982 118783 121976 133753 136668 157996 113245 119698 169564 153649 142005
9269 142005 140361 98525 99472 113720 77625 59609 130599 152255 148406 115938 62859 95769
9257 95769 127789 166530 251305 244107 208501 197750 179150 147828 171209 204083 177231 167011
9245 167011 148879 126392 136940 106595 92678 115899 117301 127065 108250 118152 167732 174047
9233 174047 108493 110253 156375 121860 93250 72826 67281 69532 123595 166168 188817 110126
9221 110126 63293 41513 42051 70607 90581 151714 113221 76457 98790 175977 133734 114704
9209 114704 71242 54220 36782 -3936 59063 107277 87585 50611 5194 -47953 -53317 -31692
9197 -31692 29057 38712 11519 -7212 -47311 -70442 -40929 -49586 -46438 15014 3229 -58298
9185 -58298 -42397 -10082 24402 51727 71768 44812 84328 96463 29418 -22533 -99035 -105988
9173 -105988 -80100 -40423 -11034 14462 -15987 20121 29669 47725 21370 35908 59952 63737
9161 63737 72988 66963 116086 150304 140126 73510 20219 44054 35344 1843 5992 23101 10767
9148 10767 -11137 -18311 -967 -35159 1629 22478 14095 46498 43359 2083 42515 116473
9136 116473 105254 70582 49717 33183 -9043 19574 32972 89785 96915 94071 75958 21974
9124 21974 20004 21777 62412 72098 45793 35175 36818 66715 121823 187394 118961 38837 9156
9111 9156 -33185 -62145 -41041 -57246 -70669 -71553 7821 51849 68400 44404 64705 126573
9099 126573 110879 69937 44293 -34599 -72881 -121813 -85668 -57526 10147 29797 24787 6920
9087 6920 10058 -62867 -59735 -30194 1411 1238 -26506 -38991 -5127 31913 62349 111552 147049
9074 147049 81804 67372 -3957 -83958 -114832 -72794 -46092 -35263 -37386 14399 113 -46540
9062 -46540 -32046 -40618 -17852 -35278 -4504 -37756 -52250 -9932 24447 -31152 -72723 -11838
9050 -11838 7187 16956 33624 -26565 -73103 -64278 -26679 -14030 -4735 25943 -511 36896
9038 36896 52612 2113 -42811 -93799 -97887 -67110 -4610 -12772 -9594 -37311 -92444 -82879 -51357
9025 -51357 -29570 -62227 -74403 -31845 1806 -30964 -94735 -98597 -13897 16914 26085 -23082
9013 -23082 -32626 -20415 -63249 -42899 11380 64196 106401 47776 -13528 25630 84109 106648
9001 106648 129107 125174 45613 2113 -31370 -25690 6499 70527 122874 134285 96696 60043
8989 60043 52248 31556 45564 33549 72682 105420 72331 10342 -28687 27944 109836 98027
8977 98027 1168 -25081 26720 17977 -12688 -47737 -52167 -28364 8542 62497 94633 88727
8965 88727 77899 42736 65456 65130 74960 70991 31425 16322 85197 133745 103531 12139 -17570
8952 -17570 3527 2638 54809 93933 161518 216814 228912 273163 363136 437653 543276 631523
8940 631523 637306 607763 538663 529847 519038 524329 481869 473586 416294 372994 379749 346069 361671
8927 361671 465991 535911 605312 703771 749925 788988 823372 864838 905039 891768 873909
8916 873909 841441 742834 640979 572660 525864 542493 593974 649576 716859 824343 900616
8905 900616 973326 1232404 1655577 2057370 2212037 2059024 1751265 1447320 1202712 1027668
8895 1027668 939025 815315 742317 649182 603965 620604 629775 671095 760430 866064 889161
8884 889161 937256 967553 910735 855629 859347 845534 779010 711759 654905 585498 492790 435751
8872 435751 429557 363878 387385 438621 455120 479608 495217 505513 524143 627400 696878 672907
8860 672907 589960 487410 447752 374596 295154 267241 255647 185546 132621 158334 140239
8849 140239 82564 79315 64674 169270 210943 188696 139488 110024 66858 6229 4813 19663
8837 19663 -7858 -43124 -55448 -8901 34288 34466 19649 51535 46197 30047 -7040 -20948
8825 -20948 31865 25123 20279 3333 13419 9523 29875 73094 85298 124084 104617 84409
8813 84409 82343 49222 10817 -13550 -20103 21736 69679 64693 27924 8686 -7316 -3081 40564
8800 40564 35325 24371 835 -50526 -84223 -28035 28937 39380 -32969 -24041 14211 -43323
8788 -43323 -59829 -54895 -71324 -66591 -51798 -16575 -21522 -11230 -31738 -75919 -63403 -36733
8776 -36733 -31177 -44472 1873 -24584 -940 -5152 -56935 -80397 -48595 -29499 18210 15856
8764 15856 74428 48677 68147 43791 -45610 -55097 -2208 -6619 -49093 -9008 82773 77010
8752 77010 32542 -3250 -32155 -21958 -13938 21527 59115 47373 39707 22145 20398 19227 48707
8739 48707 30562 -25286 -23647 14346 54142 35950 16037 46875 23125 -2298 67187 47102
8727 47102 -16431 2874 15516 38075 52193 47085 39779 66427 107475 92803 53071 45224
8715 45224 59485 44536 -9106 -30479 -41227 -1870 20993 -9144 -31744 -54278 -20178 9712
8703 9712 22849 -2148 -88435 -86605 -44486 -11268 13838 27889 32704 11757 11015 60446 41555
8690 41555 35114 59284 110123 117775 54755 -38282 -47371 2245 61145 57305 56749 79411 84259
8677 84259 81954 42533 30612 13653 -46030 -69718 -44394 12518 5887 -808 -32704 -59078
8665 -59078 -86435 -68048 -70786 -84755 -12055 8645 -25822 -35447 -33187 5043 72050 105949
8653 105949 46309 46026 62021 73706 -339 -5400 -42726 -62180 -38701 25357 95683 75379
8641 75379 15831 -12697 -42042 -55149 -14498 -285 13045 62794 67368 39438 4435 -7573
8629 -7573 24414 37253 59668 74218 53941 -9762 10323 50719 96168 130517 68337 -529
8617 -529 -60657 -72105 -61042 -70137 -14502 43665 104910 156118 90111 53938 8481 -22396
8605 -22396 -30917 -28037 52483 68233 78149 89782 65021 14536 54251 115255 156844 97010
8593 97010 20791 22175 18439 25013 110969 158688 153172 165793 137312 110773 155448 184253 187476
8580 187476 152383 136546 81692 72157 62811 37787 62487 85299 96958 87223 65217 71909
8568 71909 62870 43595 83222 33513 -17281 -39287 38845 74328 76169 40283 51622 85507
8556 85507 65443 47242 40861 50268 81437 93444 110798 71328 41547 23133 -1250 -13074
8544 -13074 -2085 55208 85625 111396 166051 188692 171897 265252 407937 535682 795223
8533 795223 1316675 2137652 2949739 3246265 2880388 2218745 1625061 1135381 774713 629639
8523 629639 496477 277703 211417 259896 238791 189898 160973 135972 130438 82480 87651 107051
8511 107051 118451 132934 109837 103226 90762 138751 208949 199271 147544 118824 145488 191267
8499 191267 196511 251659 225173 192251 243195 320442 447702 579017 765423 1100921 1603078
8488 1603078 2503781 3974386 5690050 6441580 5775434 4423584 3175802 2203791 1603014
8479 1603014 1193217 925929 793358 686882 576818 469078 350833 323487 272574 227107
8469 227107 200298 174258 171358 196753 256950 226804 168716 116904 105375 120154 149425 154775
8457 154775 186196 270693 366201 392153 381053 360135 365379 296706 246502 300625 356497 475944
8445 475944 624547 839965 1233340 1934310 2773057 3160468 2875464 2269102 1681655 1255140
8435 1255140 917328 668927 551140 415025 308217 190991 112960 112988 116206 159973 145530
8424 145530 86075 82708 79120 54518 67212 74044 123925 73973 -28397 -7281 37180 -33271
8412 -33271 -50439 -17770 45247 80058 86018 42624 22016 -34768 -46430 -27212 -14327 16534
8400 16534 86992 125684 99809 69849 82406 74604 61743 84497 52224 26232 33370 3959
8388 3959 2079 60390 75541 53875 34333 53663 -15452 -44529 -58553 -34433 -48135 -12851
8376 -12851 33697 8769 9306 -27333 -3907 56455 24685 -5381 17913 -14242 12497 46904
8364 46904 126497 153103 172057 126132 85679 82318 85558 95790 73036 108022 137953 144316
8352 144316 181003 191782 173505 122974 89350 52261 78209 86789 127819 150376 162386 135652
8340 135652 61037 -23404 -40622 -19624 -11648 -4507 12538 -5572 -29335 -31904 2716 13060
8328 13060 13591 -18244 -27305 9873 51121 40670 -22960 -62581 -52840 -28424 16506 3298 -31768
8315 -31768 4473 -14679 -20155 -16297 -5926 15905 -4810 61377 99921 100014 132010 75712 52857
8302 52857 36626 82884 69531 24496 -263 50875 75266 72016 52903 -6220 -54454 -43699
8290 -43699 -37466 -59101 -37808 -41771 -44744 -47219 -62236 -80554 -91672 -72417 -35823 -33878 -79214
8277 -79214 -80222 -65233 -35066 9368 17277 72776 97823 88269 54285 71371 87827 60489
8265 60489 62988 135532 139272 121473 154085 90859 91887 85582 63231 14233 -34803 -54012 -25899
8252 -25899 -5784 -2290 -1238 -46324 -11373 14260 19571 28624 68172 63658 30431 -2179 -16190
8239 -16190 2434 -6698 37754 38326 -23322 -1291 15562 5494 20238 15018 -20930 -13450 19886
8226 19886 -22017 -98635 -109266 -60033 -15823 11447 62777 49231 28011 -7370 -2615 -4823
8214 -4823 -44948 -39578 -27249 -28107 -5284 -7234 -25649 2457 33596 37957 44974 106399 128517
8201 128517 121587 119880 57538 -2739 3087 -28367 -9692 22269 5934 -19143 -51980 -13460
8189 -13460 29084 10725 19552 58955 36511 47939 28640 40698 15015 -12459 12473 6669
8177 6669 20942 17631 67233 99498 85065 18717 -6958 -17809 -27771 18977 18350 -4314 37626
8164 37626 59497 54472 29535 11594 34798 22791 -9965 -28180 -34301 -24993 -9693 13283
8152 13283 25094 -27822 -21298 48446 92175 58905 29417 -7099 -8045 -60400 -50199 -19504
8140 -19504 -21599 -11415 14215 13818 -27968 -64455 -133190 -95777 -43576 -37481 -18661 -38950 -58328
8127 -58328 11441 33386 58443 43915 24739 30549 37162 45768 -7240 -41529 -36850 -80555 -68665
8114 -68665 -50536 -12943 34594 73504 79394 79407 39490 31531 44580 28118 25536 82752 117535
8101 117535 69883 58928 45195 7364 -15601 -33713 -50778 -8163 -15926 -21626 -6531 37881
8089 37881 39640 16564 -9075 -11646 38620 16687 -4633 -4005 26311 62348 56153 73356 67085
8076 67085 69854 79856 69692 72530 90453 88997 97933 65209 8741 -21028 -23291 -63965 -112327
8063 -112327 -81008 -53503 -11982 14239 -17798 -17366 8377 8825 27941 -15227 7152 37387
8051 37387 8891 -45987 -20249 4242 -22996 6432 -33827 -67845 -30726 894 13097 6490
8039 6490 -13219 6341 13583 23756 21980 35168 21229 35570 38745 6008 -37108 -20954 31663
8026 31663 65656 38654 -32106 -90733 -78316 -49439 13830 -6275 -46752 -71377 4345 55375
8014 55375 85736 118832 138068 108670 102196 111146 79961 77476 85900 71970 20758 8767 10520
8001 10520 30477 24175 10738 22597 -36431 11148 56292 54210 69151 81346 75921 87321
7989 87321 125206 159422 153126 118670 109386 36570 25534 8577 -60961 -80273 -82245 -43803
7977 -43803 -71284 -91561 -19523 40781 39774 42459 13379 6682 27597 32323 29962 11958 -49093
7964 -49093 -42573 -50555 -37289 -19627 20648 34540 81935 102213 131275 88409 46428 29415
7952 29415 30263 -30762 -10814 42149 53636 87758 89707 65255 77287 82264 77414 74779 63081
7939 63081 59140 45924 58411 64846 33719 23422 7684 10246 30186 18580 18375 18606 -40401
7926 -40401 -49855 -8485 6174 26690 22712 -13821 21174 36248 57896 17626 32593 14542
7914 14542 37876 22850 -21735 -63623 -10431 63209 30352 -15540 -20780 16754 58442 18837
7902 18837 -41069 -72588 -65268 -26960 -6670 -28459 -33039 -31517 -85953 -68343 2491 -6298 3847
7889 3847 -45976 -65607 -77468 -64517 24008 21733 -3410 -24322 -24517 -60687 -81440 -38341 11244
7876 11244 24220 36190 48446 37781 23802 21583 39307 89097 122399 105146 57679 12695
7864 12695 -35320 -24299 -31163 -42362 -27414 -27957 -12281 -2564 29349 75148 68940 17478 -1340
7851 -1340 18633 26334 8580 13146 -15745 -36488 -4768 41098 22193 -13955 -33885 -18005
7839 -18005 -32979 -62740 -64429 -60135 -30867 -33282 -29942 -14419 -8726 -1515 38072 65505 54870
7826 54870 50957 62365 34212 -2291 864 4022 25845 22421 11263 -52518 -85821 -27347 8719
7813 8719 12058 20105 -24691 -34807 -45346 -68394 -17171 3932 -1907 13915 19225 50663 44540
7800 44540 38281 26462 4200 15161 7810 -20920 -43071 -31471 -10487 -46845 -89183 -107975
7788 -107975 -69958 -49678 -61377 -35744 -26816 -21141 -38281 -64094 -46884 -23990 -40353 -69365
7776 -69365 -44518 -38052 -26201 -56735 -53721 -45790 -62212 -60836 -39082 -70431 -28912 45676 25121
7763 25121 32128 2405 -51623 -71591 -94322 -79120 -42428 -27248 -28190 -17569 -76830 -44866
7751 -44866 8689 -15137 -43349 -37183 -15827 -617 19978 27059 -10212 -34126 720 -27708
7739 -27708 5389 -6070 1395 -8652 -21176 -60993 -85464 -87077 -88953 -46942 -3084 26121
7727 26121 57895 32494 -2683 9662 -29247 -54306 -19315 9085 25659 35013 4811 -76090
7715 -76090 -72462 10250 51434 23034 47805 19590 -30464 -51289 -66566 -36383 -21659 -18569
7703 -18569 -26068 -29449 -50010 -47273 -3250 -35878 -19010 -480 25031 43708 17993 -26858
7691 -26858 -52440 -62840 -11686 -14189 -50802 -67645 -63251 -11212 -9868 -15468 -11945 -14528 2246
7678 2246 -8129 -26842 -61702 -85679 -86327 -75402 -56508 -54348 -20004 -4090 -32461 -66556 -105301
7665 -105301 -101596 -75232 -33120 60024 55241 -7741 -35929 -53020 -74706 -88949 -99308 -143548
7653 -143548 -135241 -54980 14344 -13686 -74876 -89973 -96311 -106366 -46960 -4149 -33734 -33128
7641 -33128 6003 5726 24937 36311 46575 65454 30351 -4447 -30605 -44848 -99754 -107924
7629 -107924 -125988 -147730 -137810 -130524 -143704 -146398 -97370 -46215 10395 42215 23412 -4281
7617 -4281 -27037 -25556 -39081 -21719 -7180 23311 -28012 -68796 -50055 -31949 25887 66686
7605 66686 13398 -71812 -109525 -85501 -42757 -19162 -60482 -55927 -65767 -18605 -9264 -40868
7593 -40868 -75487 -113040 -92664 -44937 15013 -943 -70063 -57579 -34358 9304 -23820 -7640
7581 -7640 6196 -47910 -29795 -10377 -5553 -40256 -2600 17609 -11474 -38696 -39078 -62150 -53284
7568 -53284 -19632 -43983 -54066 -17484 -29544 -25483 257 -7479 -30145 722 -22122 -16120
7556 -16120 -32526 24413 53435 1672 -37684 -31074 -25699 -41080 -45725 117 34045 33941 89901
7543 89901 113693 50104 21759 12744 3282 40582 -6633 -41933 -30204 -37881 -15976 -48790
7531 -48790 -52781 -8116 -9431 15310 11092 29160 41976 -16608 -15857 -4017 -39446 -45273 -48889
7518 -48889 -38960 -18508 -17260 21577 59578 27079 -39803 -19625 25799 79436 99058 64881
7506 64881 23046 -32178 -80066 -85199 -77331 -90249 -63540 -94736 -157110 -116657 -77453 -91105
7494 -91105 -106741 -96240 -104330 -84579 -34989 18578 52551 16090 -2356 -28817 -19329 -17293
7482 -17293 -19831 -53461 -86353 -82973 -55185 20175 19835 -10021 18374 -20757 -80274 -77943 -20962
7469 -20962 -15637 -50840 -35751 -13200 -67071 -63935 -51059 -70996 -59225 -24825 -17272 35155
7457 35155 81852 68448 70982 75462 95391 58995 52148 46484 10637 16081 58170 60480 26605
7444 26605 38806 52185 -33930 -44910 -26179 -25399 -43665 -29962 -5560 -3597 -43291 -57784
7432 -57784 -63698 -71642 -23022 -20502 -2062 -63209 -118580 -102690 -70633 -80632 -65096 -74225 -48217
7419 -48217 -19506 30386 64597 72773 13750 -9335 14129 18177 21690 18992 12194 17042 -16403
7406 -16403 -29587 -2198 29249 56991 58789 70697 22991 42838 -40126 -49554 1039 16952
7394 16952 -2177 49091 33692 20147 14527 38640 60106 118842 74153 15487 -19146 -60704
7382 -60704 -34616 -36493 2808 -38598 -44696 -10374 17454 56355 101484 113498 67505 25089
7370 25089 -29266 -48983 -30071 10348 4754 1875 -29932 -57150 -65320 -87122 -65615 -54621
7358 -54621 -33062 2708 13057 219 -13613 -20147 -26448 -34765 -53308 -67731 -35662 -52124
7346 -52124 -93241 -82545 -59616 -42982 -40319 16188 -3392 -6171 -38741 -37834 -39293 -38990 -88631
7333 -88631 -119610 -117045 -129555 -96878 -57601 -62106 -56098 -22745 -6027 -5061 -18085 -37353 -33892
7320 -33892 -87085 -134167 -92963 -44065 28536 21553 32924 -39096 -100413 -115576 -107503 -22664
7308 -22664 -51644 -58257 -56139 -100101 -105146 -50395 -58806 -137487 -149557 -56583 -41737 -53920 -18378
7295 -18378 -10993 -12501 16261 21152 -12939 -26272 -3826 6893 -12116 -6774 17609 26828 39901
7282 39901 -28917 -5542 2397 6845 40404 41618 66340 -4183 -28521 -34604 -53221 -78718 -41398
7269 -41398 -7088 25242 17819 -2261 -53085 -18229 20177 83283 79886 38167 7343 -3128
7257 -3128 -15002 -3958 14077 4940 -31272 -14156 -30783 -40453 -7348 -36300 -118309 -108082
7245 -108082 -44852 -59184 -33771 -19020 -60617 -36607 -21897 21539 29885 54852 60652 15592
7233 15592 -50657 -46081 -49404 -7449 36770 -3874 -32730 -18027 -4438 -32442 -36510 -38031 -37851
7220 -37851 -52255 -45504 -20101 -12324 -9405 -43514 -65949 -62276 -58014 -87647 -43123 -18120 -17664
7207 -17664 -40075 -20196 26644 26224 12379 -31348 -46695 -73384 -66172 -90201 -61686 -81100
7195 -81100 -87877 -84184 -96620 -4972 55287 61879 -17942 -25645 -64336 -103461 -116095 -116684 -62603
7182 -62603 10713 28987 -31911 -79044 -48348 -31212 3270 7570 -22847 -33739 -72173 -120976
7170 -120976 -62259 69791 101767 37520 6299 15502 -26218 -47314 -22939 -1846 2359 -8262
7158 -8262 -44174 -36446 -33351 54748 125741 82864 42434 -18912 -22317 45853 64875 33658 27412
7145 27412 21343 40273 324 -12045 25422 56320 27680 -1188 55265 96269 101271 57468
7133 57468 43610 5305 21735 3943 -57248 -102976 -40111 -13387 -30901 -51083 -41954 -84322
7121 -84322 -73133 -37903 -27851 -57034 -70818 -97988 -102009 -74812 -41987 -4753 -14555 32162
7109 32162 41439 3790 10451 -2397 -35846 -52715 -62173 -91641 -66268 -39093 -69987 -99285
7097 -99285 -97095 -73269 -57905 -29793 -7156 9549 23490 19727 33753 35037 49309 -4848
7085 -4848 26567 72792 76746 15618 11286 -36402 -96704 -43814 2236 31141 -5665 -44866
7073 -44866 -25375 -35680 -16483 3943 7331 -8427 -38550 -116236 -99036 -31176 -2735 19772
7061 19772 37128 41073 35241 49949 63412 25670 -15273 -8146 10556 45396 65727 63383 24949
7048 24949 14325 12287 21633 -2612 39115 62423 15942 -34436 -36370 -6264 -4382 -42515 -43693
7035 -43693 -17762 -29884 -95473 -98250 -29283 -9142 4253 -1442 -70247 -80659 -107859 -131520
7023 -131520 -106727 -61262 -55351 -83926 -50862 -87436 -131868 -151933 -86330 -4662 -9963 -56456
7011 -56456 -36642 -71279 -96839 -67647 -6992 44925 2713 -32626 -36889 -55320 -68002 -50583
6999 -50583 -58488 -51194 -36876 41388 -2529 -13242 1145 -28892 -8792 -18547 16700 41182
6987 41182 67875 98016 61013 18987 -53355 -51873 -36044 -61860 -57956 3671 -1445 13373
6975 13373 37742 -14555 15087 4155 -4174 -45574 -60880 1388 51285 52052 -5401 -57122
6963 -57122 -97815 -97644 -75563 -95460 -57957 8817 52900 32972 -78761 -47190 -58634 -20737
6951 -20737 1231 -23464 -57195 4385 34740 41099 29112 -32240 -22494 47161 52566 23614
6939 23614 9057 5619 35495 -1198 -13659 -10228 -29546 34796 38850 1115 -16417 -69156
6927 -69156 -61131 -40783 -54703 -46950 -51091 -46892 -39581 4216 71823 84743 58719 -3268 35577
6914 35577 9068 -34523 -92317 -120197 -63911 -27903 33530 39993 40981 8219 -41212 -55033
6902 -55033 -40165 -10349 -23732 -67848 -48951 48510 20247 -21861 37889 28138 -16600 -33335
6890 -33335 -16852 3163 7345 -1358 -6564 -28169 -44202 -42397 -46884 -36092 -10181 -25182 -46061
6877 -46061 -10045 -4830 -7346 24010 2962 -13481 -19283 9664 -14210 5041 38887 -18544
6865 -18544 -11590 35222 45069 67027 56015 48761 6510 -27155 -33051 -34349 -64916 -33562 -52105
6852 -52105 -57693 -38188 -53199 -141971 -162135 -102469 -73889 -58810 -44598 -5637 -15157 -34328
6840 -34328 -59590 -11990 -24486 -11272 37825 77206 97047 73170 10628 16655 -48732 -40721
6828 -40721 -4349 -48540 -22444 36652 -20132 -42319 -58660 -73854 -32787 -6099 -28129 -36039
6816 -36039 -52158 -61316 -58633 -84089 -94358 -117925 -114649 -44732 -24135 -11612 37208 46384 -28466
6803 -28466 -75387 -49126 -36239 16231 53655 47588 38519 -6990 -49835 -48502 -45912 -4705 -4577
6790 -4577 -3346 -30168 -99 27990 3793 24815 18706 31562 46125 45180 4896 -39794 -21735
6777 -21735 -3111 7328 -21613 -27678 -50026 -55523 3337 27368 7582 -8312 -21092 -71205
6765 -71205 -91532 -90696 -67101 -17313 34140 19667 19199 6384 -62308 -80126 -29944 -8730 11129
6752 11129 -25602 -40201 4761 34004 16280 52339 41053 47600 21294 -7382 -948 40543
6740 40543 91531 96076 89902 92989 65765 66620 78060 61250 37711 -17855 -59121 -95245 -46964
6727 -46964 -24827 -14332 5828 22531 63376 76209 85809 48330 39241 43636 5483 -48914
6715 -48914 -67941 -16677 51537 84987 56164 -9562 -56530 -61011 -71824 -70033 -47990 -14595
6703 -14595 51096 44835 13392 -28226 -2194 -1672 -9104 -61460 -73229 -40464 -45122 -32769 -68023
6690 -68023 -84410 -70172 -37521 37571 61649 91433 47582 -22911 7432 30611 19668 -28680
6678 -28680 -29706 -34795 -44299 -25953 -755 -15696 -30320 -33766 -29026 -29157 -33637 -27750 -43373 4684
6664 4684 76497 79515 27335 55371 66654 55953 69732 111698 61850 -11681 -57056 -53196
6652 -53196 -677 10119 -9617 4836 2181 30282 9121 7921 4863 -40529 -36594 -21342 -22876
6639 -22876 -5897 116 7556 -36369 -53778 7852 57976 70653 84206 90958 54022 20426
6627 20426 32663 30363 45801 12969 2451 31848 126396 143123 139898 81429 48232 47761 49161
6614 49161 43809 -2233 -25624 9467 60711 -9383 -4538 -10369 988 1573 -5810 7458 30290
6601 30290 59136 9739 -32578 -8451 14041 7354 -23525 -19920 44733 75539 45195 50741
6589 50741 56344 29312 12372 7030 22268 77090 65662 80813 90839 104313 98931 55213
6577 55213 34821 5923 -12115 49366 36943 5419 14681 67727 115175 89678 69346 66313
6565 66313 106927 150535 115380 54726 37966 55703 68620 74314 53613 87718 149997 160804
6553 160804 144699 147345 144661 108211 96207 127873 158808 159875 151069 121013 76592 53349
6541 53349 41982 30687 61041 81575 78920 71794 66417 77228 51623 -12104 -49474 -3506
6529 -3506 37793 68416 52810 52513 59771 29405 -28827 -23839 -17278 8613 -2191 -32719 -48141
6516 -48141 -70430 -86394 -41439 -63900 -24440 1391 -48476 -101839 -61542 -18902 18938 57266
6504 57266 23195 -40227 -84263 -39297 -1369 -5750 5192 41030 76463 18111 -3511 84
6492 84 -9737 10958 50493 35523 19537 -22102 -43396 -75417 -101012 -111731 -97189 -102592 -51752
6479 -51752 21896 13412 -1921 30731 76137 39245 -86390 -135180 -117651 -73981 -24385 -16413
6467 -16413 -12768 13694 -13823 -14616 1061 -6829 -37486 -35815 -6303 -12246 -8052 21906 13869
6454 13869 -38297 -61287 -72905 -42706 -19958 -37368 -15755 -33306 10176 21314 16595 40946
6442 40946 37676 -344 8269 42954 21445 -4552 -31877 -40850 -9520 32528 62768 -4298
6430 -4298 -45266 -38742 -20910 -46189 -81724 -65864 3313 38291 58842 43837 4193 -37918
6418 -37918 -52698 -49444 -31715 13653 8728 -48578 -89613 -67376 -2416 31831 -39593 -87224
6406 -87224 -62227 -10542 1316 -15207 18669 -3334 -43522 -45920 -32813 -20471 -8203 -30282
6394 -30282 -28734 -42805 -63054 -38761 -19840 -28091 -21428 17393 65822 73657 26011 21213 22842
6381 22842 7751 5092 16392 35907 37862 -3533 -15605 25950 -3150 -44979 -37362 -33065 21894
6368 21894 58528 94154 106873 49339 9262 57676 82825 57318 -44583 -119017 -134966 -126229
6356 -126229 -93351 -95295 -97597 -98615 -131014 -113406 -103957 -73544 -63167 -4366 36302 -7770
6344 -7770 -53585 -50544 -27848 -13657 -26616 18423 96048 88444 36666 -25567 -88362 -91535 -48464
6331 -48464 -47698 -32441 -40745 -35021 -12903 -4644 23698 11944 18547 -29857 -103339 -108667 -72428
6318 -72428 -75441 -76705 -65901 -46309 -10234 37738 107360 72553 54360 35818 -47868 -65237
6306 -65237 -47679 -33384 3542 26378 10847 -2793 -38265 -93069 -120715 -30161 19878 23449
6294 23449 -2936 -3660 3443 -2459 10291 9184 -18983 -4000 -41367 -110579 -86887 -35006 -2594
6281 -2594 13324 -12000 -28420 8430 6743 -3685 -34629 -78077 -69881 -24190 20333 17773 -21989
6268 -21989 -30792 -21870 -57364 -69226 -86928 -96800 -75098 -25417 5248 8935 21658 25042 8585
6255 8585 13052 22372 -1720 -41656 -25273 22016 -325 -4303 -46215 -54163 -51274 -23331 -46454
6242 -46454 -56202 22276 66043 42704 72772 113910 92965 52246 4632 -33502 -31582 -5900
6230 -5900 -16792 -36760 -21893 5043 18747 28452 20274 14546 18196 -8380 -53374 -66981 -50287
6217 -50287 -58435 -69157 -51881 -2082 23083 38927 -5000 -34684 -50980 -40916 -13496 -33280
6205 -33280 -13911 -37472 -115233 -119491 -119564 -119891 -152089 -143975 -83450 -23355 17723 -5305 -52379
6192 -52379 -31905 28812 70899 65036 22762 22036 25417 8429 4396 -6787 -24441 -38049 -18111
6179 -18111 37824 60669 68972 29722 -40552 -48816 -11848 -11696 -8329 -8770 6020 -662 13353
6166 13353 22375 -23400 -67466 -121563 -127841 -25224 7315 -11598 -46655 -87882 -131494 -75521
6154 -75521 -18620 -49621 -64381 -52266 -22775 -11630 -40909 9433 17460 4575 32563 16640
6142 16640 160 1034 37007 15723 -3372 -4595 -20956 -79750 -90667 -68904 -75961 -60847 -24544
6129 -24544 -9767 -8621 -35634 -76124 -79707 -78648 -76028 -36921 -24356 21646 23450 -53072 -80218
6116 -80218 -61959 -27424 -29265 -32021 -18824 -12291 15555 -2337 -10226 10451 -3867 -59949 -85527
6103 -85527 -30785 8119 21040 -410 -13576 -8264 -22619 -121925 -127211 -128390 -89880 -59232
$$ [...]
##END NTUPLES=NMR SPECTRUM
##END=
