##TITLE=Analysis number 310299
Compound Code mo 07504
Book Reference 425/180
Project Code adrs
Chemist Name geraint
##JCAMPDX= 6.0         $$ Bruker NMR JCAMP-DX V2.0
##DATA TYPE= NMR SPECTRUM
##DATA CLASS= NTUPLES
##ORIGIN= Bruker BioSpin GmbH
##OWNER= NMR
$$ XWIN-NMR		Version 3.5
$$ Thu Jun 16 14:50:46 2005 GMT Daylight Time (UT+1h)  MAYBRIDGE\NMR@NMR_250MHZ
##.OBSERVE FREQUENCY= 250.131544655141
##.OBSERVE NUCLEUS= ^1H
##.ACQUISITION MODE= SIMULTANEOUS (DQD)
##.ACQUISITION SCHEME= undefined
##.AVERAGES= 16
##.DIGITISER RES= 18
##SPECTROMETER/DATA SYSTEM= dpx250
##.PULSE SEQUENCE= zg30
##.SOLVENT NAME= DMSO
##.SHIFT REFERENCE= (INTERNAL, DMSO, 0, 16.565)
##AUDIT TRAIL= $$ (NUMBER, WHEN, WHO, WHERE, WHAT)
$$ ##TITLE= Audit trail, XWIN-NMR		Version 3.5
$$ ##JCAMPDX= 5.01
$$ ##ORIGIN= Bruker BioSpin GmbH
$$ ##OWNER= NMR
$$ C:\u/data/dgb/nmr/ADRS/4160/pdata/1/auditp.txt
$$ ##AUDIT TRAIL=  $$ (NUMBER, WHEN, WHO, WHERE, WHAT)
(   1,<2005-06-16 14:50:24.08 +100>,<MAYBRIDGE\NMR>,<NMR_250MHZ>,
      <created by zg, POWCHK disabled, PULCHK disabled
       configuration hash MD5:
       62 19 C7 07 E1 42 D1 B7 37 6C 3D D0 77 39 F9 E6
       data hash MD5: 64K
       1A 2E 65 2D 67 05 21 50 96 57 EC 48 34 99 66 60>)
(   2,<2005-06-16 14:50:36.79 +100>,<MAYBRIDGE\NMR>,<NMR_250MHZ>,
      <Start of raw data processing
       ef LB = 0.3 FT_mod = 6 PKNL = 1 SI = 32K 
       data hash MD5: 32K
       92 77 CB 80 5E A4 2E 78 5B 2D B6 7B 9A 78 E4 8F>)
(   3,<2005-06-16 14:50:38.63 +100>,<MAYBRIDGE\NMR>,<NMR_250MHZ>,
      <apk 
       data hash MD5: 32K
       03 49 EE 1D BF 7D 92 69 F3 F7 D3 D5 79 C3 91 68>)
(   4,<2005-06-16 14:50:39.32 +100>,<MAYBRIDGE\NMR>,<NMR_250MHZ>,
      <abs ABSG = 5 
       data hash MD5: 32K
       EF 62 B6 6B 8D AC 6F D1 78 51 2D 40 07 75 71 CE>)
$$ ##END=
$$ 
$$ hash MD5
$$ 3C 2F 0B 8E 17 62 B6 80 0A C0 D7 D2 60 CF 34 F6
##$RELAX= 
##$RELAX= 
##$RELAX= 
##$RELAX= 
##$RELAX= 
##$RELAX= 
##$RELAX= 
$$ Bruker specific parameters
$$ --------------------------
##$DU= <C:\u>
##$EXPNO= 4160
##$NAME= <ADRS>
##$PROCNO= 1
##$TYPE= <nmr>
##$USER= <dgb>
##$AMP= (0..31)
100 100 100 100 100 100 100 100 100 100 100 100 100 100 100 100 100 100 
100 100 100 100 100 100 100 100 100 100 100 100 100 100 
##$AQSEQ= 0
##$AQ_mod= 3
##$AUNM= <au_zg>
##$AUTOPOS= <42 >
##$BF1= 250.13
##$BF2= 250.13
##$BF3= 250.13
##$BF4= 250.13
##$BF5= 500.13
##$BF6= 500.13
##$BF7= 500.13
##$BF8= 500.13
##$BYTORDA= 1
##$CFDGTYP= 0
##$CFRGTYP= 5
##$CHEMSTR= <none>
##$CNST= (0..31)
1 1 145 1 1 1 1 1 1 1 1 1 1 1 1 1 1 1 1 1 1 1 1 1 1 1 1 1 1 1 1 1 
##$CPDPRG= <>
##$CPDPRG1= <>
##$CPDPRG2= <>
##$CPDPRG3= <>
##$CPDPRG4= <mlev>
##$CPDPRG5= <mlev>
##$CPDPRG6= <mlev>
##$CPDPRG7= <mlev>
##$CPDPRG8= <mlev>
##$CPDPRGB= <>
##$CPDPRGT= <>
##$D= (0..31)
0 1 0 0 0 0 0 0 0 0.06 0 0 0 0 0 0 0.0002 0 0 0 0 0 0 0 0 0 0 0 0 0 0 
0 
##$DATE= 1118929823
##$DBL= (0..7)
120 120 120 120 120 120 120 120 
##$DBP= (0..7)
150 150 150 150 150 150 150 150 
##$DBP07= 0
##$DBPNAM0= <>
##$DBPNAM1= <>
$$ [...]
##$SUBNAM7= <"">
##$SUBNAM8= <"">
##$SUBNAM9= <"">
##$SW= 20.6930455092707
##$SWIBOX= (0..15)
0 0 3 0 0 0 0 0 0 0 0 0 0 0 0 0 
##$SW_h= 5175.983436853
##$TD= 65536
##$TD0= 1
##$TE= 295.16
##$TE2= 300
##$TE3= 300
##$TEG= 300
##$TL= (0..7)
0 120 120 120 120 120 120 120 
##$TP= (0..7)
150 150 150 150 150 150 150 150 
##$TP07= 0
##$TPNAME0= <>
##$TPNAME1= <>
##$TPNAME2= <>
##$TPNAME3= <>
##$TPNAME4= <>
##$TPNAME5= <>
##$TPNAME6= <>
##$TPNAME7= <>
##$TPOAL= (0..7)
0.5 0.5 0.5 0.5 0.5 0.5 0.5 0.5 
##$TPOFFS= (0..7)
0 0 0 0 0 0 0 0 
##$TUNHIN= 0
##$TUNHOUT= 0
##$TUNXOUT= 0
##$USERA1= <user>
##$USERA2= <user>
##$USERA3= <user>
##$USERA4= <user>
##$USERA5= <user>
##$V9= 5
##$VALIST= <valist>
##$VCLIST= <CCCCCCCCCCCCCCC>
##$VD= 0
##$VDLIST= <DDDDDDDDDDDDDDD>
##$VPLIST= <PPPPPPPPPPPPPPP>
##$VTLIST= <TTTTTTTTTTTTTTT>
##$WBST= 1024
##$WBSW= 4
##$XGAIN= (0..3)
0 0 0 0 
##$XL= 0
##$YL= 0
##$YMAX_a= 501897
##$YMIN_a= -482232
##$ZGOPTNS= <>
##$ZL1= 120
##$ZL2= 120
##$ZL3= 120
##$ZL4= 120
##$ABSF1= 16.56501
##$ABSF2= -4.128164
##$ABSG= 5
##$ABSL= 3
##$ALPHA= 0
##$AQORDER= 0
##$ASSFAC= 0
##$ASSFACI= 0
##$ASSFACX= 0
##$ASSWID= 0
##$AUNMP= <proc_1d>
##$AZFE= 0.1
##$AZFW= 0.1
##$BCFW= 0
##$BC_mod= 0
##$BYTORDP= 0
##$COROFFS= 0
##$CY= 12.5
##$DATMOD= 1
##$DC= 0
##$DFILT= <>
##$DTYPP= 0
##$F1P= 14.0000005364418
##$F2P= -0.99999901652339
##$FCOR= 0.5
##$FTSIZE= 32768
##$FT_mod= 6
##$GAMMA= 0
##$GB= 0
##$INTBC= 1
##$INTSCL= 1
##$ISEN= 128
##$LB= 0.3
##$LEV0= 0
##$LPBIN= 0
##$MAXI= 10000
##$MC2= 0
##$MEAN= 0
##$ME_mod= 0
##$MI= 0
##$NCOEF= 0
##$NC_proc= -2
##$NLEV= 6
##$NOISF1= 0
##$NOISF2= 0
##$NSP= 0
##$NTH_PI= 0
##$NZP= 0
##$OFFSET= 16.56501
##$PC= 1
##$PHC0= -89.27496
##$PHC1= 5.877138
##$PH_mod= 1
##$PKNL= yes
##$PPARMOD= 0
##$PSCAL= 4
##$PSIGN= 0
##$REVERSE= no
##$SF= 250.129989241587
##$SI= 32768
##$SIGF1= 0
##$SIGF2= 0
##$SINO= 400
##$SIOLD= 32768
##$SREGLST= <1H.DMSO>
##$SSB= 0
##$STSI= 32768
##$STSR= 0
##$SW_p= 5175.98343685301
##$SYMM= 0
##$S_DEV= 0
##$TDeff= 65536
##$TDoff= 0
##$TI= <Analysis number 999999
Compound Code 99
Book Reference 9
Project Code 9>
##$TILT= no
##$TM1= 0
##$TM2= 0
##$TOPLEV= 0
##$USERP1= <user>
##$USERP2= <user>
##$USERP3= <user>
##$USERP4= <user>
##$USERP5= <user>
##$WDW= 1
##$XDIM= 32768
##$YMAX_p= 367491814
##$YMIN_p= -51657
$$ End of Bruker specific parameters
$$ ---------------------------------
##NTUPLES= NMR SPECTRUM
##VAR_NAME=  FREQUENCY,     SPECTRUM/REAL,   SPECTRUM/IMAG
##SYMBOL=    X,             R,               I
##VAR_TYPE=  INDEPENDENT,   DEPENDENT,       DEPENDENT
##VAR_FORM=  AFFN,          ASDF,            ASDF
##VAR_DIM=   32768,         32768,           32768
##UNITS=     HZ,            ARBITRARY UNITS, ARBITRARY UNITS
##FACTOR=    0.157963299565203, 1,           1
##FIRST=     4143.40579079618, 0,            0
##LAST=      -1032.57764605683, 0,           0
##MIN=       -1032.57764605683, -51657,      0
##MAX=       4143.40579079618, 367491814,    0
$$ Real data points
##PAGE= N=1
##DATA TABLE= (X++(R..R)), XYDATA
$$ [...]
15541a1599M443Q287J425l847l255J234j5765k140l362n133O257J4595K607m601
$$ -11599 -7156 1131 2556 -1291 -4546 -3312 -19077 -21217 -24579 -29712 -23455 -8860 -6253 -10854
15527a0854L588J2507k812k1553J001J1823P790N750o634J1704O788r256q576
$$ -10854 -7266 5241 2429 -19124 -18123 -6300 1490 7240 606 12310 19098 9842 1266
15514A266K234l000o911k425J815J4571R739r861l911j0485J03J617m827P15J1462
$$ 1266 3500 500 -6411 -8836 -7021 7550 17289 7428 3517 -6968 -6865 -5248 -10075 -9360 2102
15499B102o993j6025O500R391L789P378j5602k4054m701Q726M013o337N898J5326
$$ 2102 -4891 -20916 -14416 -5025 -1236 6142 -9460 -33514 -38215 -29489 -25476 -31813 -25915 -10589
15485a0589m503N392k275O61m331O11l90j127R786k675j5937j30j670Q522R98
$$ -10589 -15092 -9700 -11975 -11314 -15645 -15034 -15424 -16551 -6765 -9440 -25377 -25507 -27177 -18655 -17657
15470a7657L745K3932J1215j1064P00J955j4686j5246j8830q850O228M525O856
$$ -17657 -13912 10020 21235 10171 10871 12826 -1860 -17106 -35936 -44786 -38558 -34033 -27177
15457b7177J2665P529j6052j0415M567M997J1951J863N32l680K798K215r359j0553
$$ -27177 -14512 -6983 -23035 -33450 -28883 -23886 -11935 -10072 -9540 -13220 -10422 -8207 -17566 -28119
15443b8119O347J0117Q523L977j424r777L81L052M089l636k231o856n028J5492
$$ -28119 -21772 -11655 -3132 845 -579 -10356 -9975 -6923 -2834 -6470 -8701 -15557 -20585 -5093
15429e093M225q695o947l826N684J323m638O934Q912j4645j1434j1937M41n054
$$ -5093 -868 -9563 -16510 -20336 -14652 -13329 -17967 -11033 -2121 -16766 -28200 -40137 -39696 -44750
15415d4750J4600J7173P218R186J900q255M275K617q658O256L584J92Q713p70
$$ -44750 -30150 -12977 -5759 3427 5327 -2928 1347 3964 -4694 1562 5146 5338 14051 13281
15401A3281K758l742q806l236m237N331j273o894j5580k804M857M839l885K121
$$ 13281 16039 12297 3491 255 -3982 1349 76 -6818 -22398 -25202 -20345 -15506 -19391 -17270
15387a7270j489Q498M50o523n349K066m71k766J2753J6765k418o12J359l324j984
$$ -17270 -18759 -10261 -9811 -16334 -21683 -19617 -20088 -22854 -10101 6664 4246 3634 4993 1669 -315
15372c15j8704j0524P467J6602m61l816J0910j5939m411p010l410J6875j276o303
$$ -315 -19019 -29543 -22076 -5474 -5935 -9751 1159 -14780 -19191 -26201 -29611 -12736 -14012 -20315
15358b0315P279M601O48J517o994N861L481j3875n401L609j920j2559l812J3343
$$ -20315 -13036 -8435 -7787 -6270 -13264 -7403 -3922 -17797 -23198 -19589 -21509 -34068 -37880 -24537
15344b4537J581j387j228J4499l235L005J0443P184O86p13M309K584p378N42k943
$$ -24537 -22956 -24343 -25571 -11072 -14307 -11302 -859 6325 7011 6298 10607 13191 5813 6355 3412
15329C412j5040q104r655J440R917M087N240N301Q713o774j200R263n484R33L984
$$ 3412 -11628 -19732 -29387 -27947 -18030 -13943 -8703 -3402 5311 -1463 -2663 6600 1116 2049 6033
15314F033l298j1755j4157k192J583L170J0714O584P707j516L044q479k890O121
$$ 6033 2735 -9020 -23177 -25369 -23786 -20616 -9902 -3318 4389 2873 5917 -2562 -5452 669
15300F69Q493j3790m710p002J4144J2928k888j5236R264J1931o690j6743j1665
$$ 669 9162 -4628 -9338 -16340 -2196 10732 7844 -7392 1872 13803 7113 -9630 -21295
15287b1295j639p649K034J7527P011j228pN157M48l702J4473q707r236m290m280
$$ -21295 -22934 -30583 -28549 -11022 -4011 -5239 -5246 -89 359 -3343 11130 2423 -6813 -11103 -15383
15272a5383q3J3303R456K56J250j370k538j2354N872J2270K642l600j3079j5395
$$ -15383 -15466 -2163 7293 7549 8799 7429 4891 -7463 -1591 10679 13321 9721 -3358 -18753
15258a8753q190m444Q661r815L939J2742n141J1693L596p178m637q356O224m894
$$ -18753 -26943 -31387 -22726 -32541 -28602 -15860 -21001 -9308 -5712 -12890 -17527 -25883 -19659 -24553
15244b4553M346K540J100j852m55J795N185L71P959o646O9q37l952p2O667q67
$$ -24553 -20207 -17667 -16567 -18419 -18874 -17079 -11894 -11523 -3564 -10210 -10141 -10978 -14930 -15002 -8335 -9202
15228i202j478l85P169o814p202J3878R909o195k786J1728j253M51N63j1691l333
$$ -9202 -10680 -11065 -3896 -10710 -17912 -4034 5875 -320 -3106 8622 7369 7820 8383 -3308 -6641
15213f641J2989j036q853j954m571r214L117N382m15l388r836M036K714J871n119
$$ -6641 6348 5312 -3541 -5495 -10066 -19280 -16163 -10781 -11196 -14584 -24420 -20384 -17670 -15799 -20918
15198b0918n885q54k945J2854J3003Q399o131k743q79j904k154r77l07p22R34
$$ -20918 -26803 -27657 -30602 -17748 -4745 3654 -2477 -5220 -6099 -8003 -10157 -11134 -11441 -12163 -11229
15183a1229P23j467j978j633o556j0125N682N071n072O319J662m008P852M549
$$ -11229 -10506 -11973 -13951 -15584 -22140 -32265 -26583 -21512 -26584 -20265 -18603 -22611 -14759 -10210
15169a0210J854Q90p191O16J9076n176k1822N952J3770L588k534L311k944l677
$$ -10210 -8356 -7466 -14657 -14041 5035 -141 -21963 -16011 -2241 1347 -1187 2124 -820 -4497
15155d497L762K77J0309J482o443r007r460k950n288o971M668O219p023N098M747
$$ -4497 -735 -458 9851 11333 4890 -4117 -13577 -16527 -21815 -28786 -24118 -17899 -24922 -19824 -15077
15140a5077R474l705l829P97N665P309R56q373L072m552Q515J795o456J1722J231
$$ -15077 -5603 -9308 -13137 -12340 -6675 634 1590 -6783 -3711 -8263 252 2047 -4409 7313 8544
15125H544Q835j4270k0850j601J5647J2098M671l605K134k646k1524k2116j0338
$$ 8544 17379 3109 -17741 -19342 -3695 8403 13074 9469 11603 8957 -12567 -34683 -45021
15112d5021Q564K3196J7678J125l237k239J1781r79j4855j2414j1509J5005Q975
$$ -45021 -36457 -13261 4417 5542 2305 66 11847 10868 -3987 -16401 -27910 -12905 -3930
15099c930k372r674N801P510o296r23P449K682j7998k26J1079O357j402j2695
$$ -3930 -6302 -15976 -10175 -2665 -8961 -9884 -2435 247 -17751 -17977 -6898 -541 -1943 -14638
15085a4638m057N054R22R497j568L185N971l511o408o4J0840Q267o002j0041q811
$$ -14638 -18695 -13641 -12719 -3222 -4790 -1605 4366 855 -5553 -5617 5223 13490 7488 -2553 -11364
15070a1364k139O417n007l748R176J0686n02p801j229J026k855J203n487k955
$$ -11364 -13503 -7086 -12093 -15841 -6665 4021 3519 -4282 -5511 -4485 -7340 -6137 -11624 -14579
15056a4579l447p34Q97o789J0682L726j0599j5899j070J1015n8M843J8982K781
$$ -14579 -18026 -18760 -17863 -24652 -13970 -10244 -20843 -36742 -37812 -26797 -26855 -22012 -3030 -249
15042b49k891n837q52N694j649j6522J993N569J0082Q53L696P052k807j1009m724
$$ -249 -3140 -8977 -9829 -4135 -5784 -22306 -20313 -14744 -4662 -3809 -113 6939 4132 -6877 -11601
15027a1601j5264q639J0023K4134l688j4241m626P522L052J1860L449j362O31
$$ -11601 -26865 -35504 -25481 -1347 -5035 -19276 -23902 -16380 -13328 -1468 1981 619 1250
15014A250m80p70j1708j315J98J858M785j267m418M788J1612P035J890K879P477
$$ 1250 770 0 -11708 -13023 -12825 -10967 -6182 -7449 -11867 -7079 4533 11568 13458 16337 23814
14999B3814j1133M655J3944N263o843K826L210l174p479j7753k953J4307N187
$$ 23814 12681 17336 31280 36543 29700 32526 35736 32562 25083 7330 4377 18684 23871
14986B3871n158j4420L717N870M390l911q747P161j251P150j2920j5250o083J0618
$$ 23871 18713 4293 8010 13880 18270 14359 5612 12773 11522 18672 5752 -9498 -15581 -4963
14972d963K3496O507j3584o042m146M545J3621J8104j2430m714J438Q368J4980
$$ -4963 18533 25040 11456 5414 1268 5813 19434 37538 25108 20394 21832 30200 45180
14959D5180K1883K5919J7970O147O198m984j7327j9071p103j0645j2636j9367
$$ 45180 67063 92982 110952 117099 123297 118313 100986 81915 74812 64167 51531 32164
14947C2164m682k156J182L058o072j3390J0117j147j4415j0686R502P106L980
$$ 32164 27482 25326 26508 29566 23494 10104 20221 19074 4659 -6027 3475 10581 14561
14934A4561q26m055N43N988J2600M774j4775p254L345J676Q668K01N004J7595
$$ 14561 13735 9680 10223 16211 28811 33585 18810 11556 14901 16577 25245 25446 30450 48045
14920D8045J0270K5872K8886K9966K1751K6900L652j9820l2960k2128j7283j7456
$$ 48045 58315 84187 113073 143039 164790 191690 195342 175522 142562 120434 103151 85695
14908H5695j7592j6833j54j930j1343j8544o438m304K941m474r669P262l569Q741
$$ 85695 68103 51270 51116 49186 37843 19299 12861 8557 11498 7024 -2645 4617 1048 9789
14894I789J5L334J710M87m354J5166J5477j1458p493n47j0054L486P067K0818
$$ 9789 9804 13138 14848 15335 10981 26147 41624 30166 22673 22126 12072 15558 22625 43443
14880D3443K3560L3073J0274J387P635J2198j6019q908l157j1591j3713o023j5704
$$ 43443 67003 100076 110350 111737 119372 131570 115551 106643 103486 91895 78182 72159 56455
14867E6455j2955j1368J2406K670j084q82j0444j224R258J5264j1478j2128n72
$$ 56455 43500 32132 44538 47208 46124 45242 34798 33574 42832 58096 46618 34490 33918
14854C3918p40j580m683o709m274j711J4967R577j3877P8L408N866j1459k922
$$ 33918 33178 31598 26915 20206 15932 14221 29188 38765 24888 24966 28374 34240 22781 19859
14840A9859J6746J0422L733p758J949J727k630r156j2291m592j751k026N31j4
$$ 19859 36605 47027 50760 43002 44951 46678 44048 34892 22601 18009 16258 14232 14763 14749
14826A4749K830q308M832J1020Q20N783O64j053q75j9227L86K5898J7263p303
$$ 14749 17579 9271 14103 25123 25943 31726 32390 31337 30462 11235 11621 37519 54782 47479
14812D7479Po233j2829j2667l061J787k334r362Q33j93R956P971L033n654r83
$$ 47479 47486 41253 28424 15757 12696 14483 12149 2787 3620 3427 13383 21354 24387 18733 17750
14797A7750q037j0629l602J7332P537m706q61j2366j5789K309R605L400O165O025
$$ 17750 9713 -916 -4518 12814 20351 15645 14784 2418 -13371 -11062 -1457 1943 8108 14133
14783A4133o462r798m168K549n76O626o594k982l43R17M259K804K750n059J0591
$$ 14133 7671 -2127 -6295 -3746 -4322 2304 -4290 -7272 -7615 -6698 -2439 365 3115 -1944 8647
14768H647R805k763p429o504j651j5136o490j247J3125J3573j139l057k39K660
$$ 8647 18452 15689 8260 1756 105 -15031 -21521 -22768 -9643 3930 2791 -266 -505 2155
14754B155Q134O802J019l650j5679j2686j0350O390M022J9192k233j712K930j576
$$ 2155 10289 17091 18110 14460 -1219 -13905 -24255 -17865 -13843 5349 3116 1404 4334 2758
14740B758k663p829P819p717p485N416J7248P615q409l271K80j1162q534r605
$$ 2758 95 -7734 85 -7632 -15117 -9701 7547 15162 6753 3482 3762 -7400 -15934 -25539
14726b5539j1670Q27J4947J3292L821q799Q092k62j5177j0644Q683J2500R361
$$ -25539 -37209 -36382 -21435 -8143 -4322 -13121 -5029 -5291 -20468 -31112 -22429 -9929 -568
14713e68M651M060m858n992m896K227R546J9264L094k1048j7767m694J3903K685
$$ -568 4083 8143 3285 -2707 -7603 -5376 4170 23434 26528 5480 -12287 -16981 -3078 -393
14699c93o482l292l461K019N518o018L680O667J965p093l888K330R128L523N263
$$ -393 -6875 -10167 -13628 -11609 -6091 -12109 -8429 -1762 203 -6890 -10778 -8448 680 4203 9466
14684I466R4j1955J578J1483J1403l852O860p982n342M633j554l095M878l996
$$ 9466 9560 -2395 -817 10666 22069 18217 25077 17095 11753 16386 14832 11737 16615 12619
14670A2619r533m658j678L148n311P76J26k842J044O950j138j0018P194Q68K653
$$ 12619 3086 -1572 -3250 -102 -5413 -4637 -4511 -7353 -6309 641 -497 -10515 -3321 -2453 200
14655B00J1714l5j7786J1884L938j689l800k419l180k15J5785o993p886k866j730
$$ 200 11914 11879 -5907 5977 9915 8226 4426 2007 -1173 -1388 14397 7404 -482 -3348 -5078
14640e078k125Q38K180j172r115m59J7424L22j012M775Q791R498m915j266O204
$$ -5078 -7203 -6365 -4185 -5357 -14472 -14931 2493 2815 1803 6578 15369 24867 19952 18686 24890
14625B4890J2075k389m538M427L554R963J2597J0857k21l668q480j7175j6079
$$ 24890 36965 34576 30038 34465 38019 47982 60579 71436 71215 67547 59067 41892 25813
14612B5813j1526j115p498J1433k922R798J2758l202k381j4099l0942j0627K262
$$ 25813 14287 13172 5674 17107 14185 23983 36741 33539 31158 17059 -13883 -24510 -22248
14599b2248J2378J3490O867K719q758k038O35K315k165Q720m38n391J3473L383
$$ -22248 -9870 3620 10487 13206 4448 2410 3045 5360 3195 11915 11477 6086 19559 22942
14585B2942J8647K0827J19N598n304p876p30p951j3719j3457j3299M795L94L176
$$ 22942 41589 62416 62535 68133 62829 54953 54223 46272 32553 19096 5797 10592 10986 14162
14571A4162p72N483j3522n874L635r04q687n386J803j700J5035O82p928k852p3
$$ 14162 13390 18873 5351 -523 3112 2208 -6479 -11865 -10062 -11762 3273 3955 -3973 -6825 -6898
14556f898J4149J914J729J624j195n699j2734q119O347J4316k646n312p322J621
$$ -6898 7251 9165 10894 12518 11323 5624 -7110 -15229 -8882 5434 2788 -2524 -9846 -8225
14542h225N609l472k816R040p351k834l914J0816J274L212L351o293n341K701
$$ -8225 -2616 -6088 -8904 136 -7215 -10049 -13963 -3147 -1873 1339 4690 -1603 -6944 -4243
14528d243k432J290m488Q517J1695o78l50k2827k3728j826J2441J0032l070K544
$$ -4243 -6675 -5385 -9873 -1356 10339 9661 9311 -13516 -37244 -39070 -26629 -16597 -19667 -17123
14514a7123l487J0611J0716L177n744K472M578p917j3442r428j292J3120J5877
$$ -17123 -20610 -9999 717 3894 -1850 622 5200 -2717 -16159 -25587 -26879 -13759 2118
14501B118J203q820l945q77J527O768q834j108K719Q79Q396l835m17J097p526
$$ 2118 3321 -5499 -9444 -10321 -8794 -2026 -10860 -11968 -9249 -8370 26 -3809 -4226 -3129 -10655
14486a0655j0427j0053J2289M969j0270r565l020R265M730J373J5449n592r797
$$ -10655 -21082 -31135 -18846 -13877 -24147 -33712 -36732 -27467 -22737 -21364 -5915 -11507 -21304
14473b1304p529j627K503o251M054j762R492J5863n170j2747l806j11J31m731
$$ -21304 -28833 -30460 -27957 -34208 -30154 -31916 -22424 -6561 -11731 -24478 -28284 -28395 -28264 -32995
14459c2995j4758l844J0264J4927J5336L710J1135j1025l337L153P690r66K470
$$ -32995 -47753 -51597 -41333 -26406 -11070 -7360 3775 -7250 -10587 -7434 256 -710 1760
14446A760R144r452p326q573j1024P671J3502M813L502l008j233K493n695j1612
$$ 1760 10904 1452 -5874 -14447 -25471 -17800 -4298 515 4017 1009 -224 2269 -3426 -15038
14432a5038m493Q701J7689k083K981j0279j1446r315l081j759M890M591J5084
$$ -15038 -19531 -10830 6859 4776 7757 -2522 -13968 -23283 -26364 -28123 -23233 -18642 -3558
14419c558O816l300L881J271j1272j3102L908O441P304j0918Q970Q22N88m275
$$ -3558 3258 -42 3839 5110 -6162 -19264 -15356 -8915 -1611 -12529 -3559 -2737 -2149 -6424
14405f424R5J1505N85o68j1924m208O61L872j0241M897J1679M485p07M380o132
$$ -6424 -6329 5176 5761 5093 -6831 -11039 -10378 -6506 -16747 -11850 -171 4314 3607 7987 1855
14390A855J105j0431j1290Q22k59j517J2597J0287o931M687R013K765p261o586
$$ 1855 2960 -7471 -18761 -17939 -18198 -19715 -7118 3169 -3762 925 9938 12703 5442 -1144
14376a144k840L040j255j1568p565m181J6146J3913j711o770o867n744N557J4305
$$ -1144 -3984 -944 -2199 -13767 -21332 -25513 -9367 4546 2835 -3935 -10802 -16546 -10989 3316
14362C316J0688L936J126j7403j15J309O386m863k1026J959N316r912j1524M865
$$ 3316 14004 17940 19066 1663 1548 2857 9243 4380 -16646 -14687 -9371 -19283 -30807 -25942
14348b5942M61n098n205M338J0548J4023J2914M057r159k688M225N534M3J046
$$ -25942 -25481 -30579 -35784 -31446 -20898 -6875 6039 10096 937 -1751 2474 8008 8051 9097
14334I097r122j0015j208J0801p691k733m729l319L23k910R551j457r147k82J2093
$$ 9097 -25 -10040 -11248 -447 -8138 -10871 -15600 -18919 -18596 -21506 -11955 -13412 -22559 -22841 -10748
14319a0748k645o351R196K152j6323j773J827M098j797M369L200J095l727L657
$$ -10748 -13393 -19744 -10548 -8396 -24719 -26492 -24665 -20567 -22364 -17995 -14795 -13700 -17427 -13770
14305a3770J1754o401j7328o706J6913m152j353J690j041J1075n442q955Q486
$$ -13770 -2016 -8417 -25745 -32451 -15538 -19690 -21043 -19353 -20394 -9319 -14761 -23716 -15230
14292a5230J1689Q065n734j544n206M501J5094P413l951n754r407n556M844M000
$$ -15230 -3541 4524 -1210 -2754 -7960 -3459 11635 19048 15097 9343 -64 -5620 -776 3224
14278C224n319n996j0886j632P94j373J860m545N780N059k414j252J0928M010
$$ 3224 -2095 -8091 -18977 -20609 -19815 -21188 -19328 -23873 -18093 -13034 -15448 -16700 -5772 -1762
14264a762p189N195k421q736l838J0309M575l995O91R526j202j1985J616M174
$$ -1762 -8951 -3756 -6177 -14913 -18751 -8442 -3867 -7862 -7171 2355 1153 -10832 -9216 -5042
14250e042p8J5904O331p480j292l337N25J917N743j4592K233M753J153q067n471
$$ -5042 -5120 10784 17115 9635 8343 5006 5531 7448 13191 -1401 832 5585 6738 -1329 -6800
14235f800p094k631n891o95Q673M257R885q060j6307j3885J3342Q231k621M11
$$ -6800 -13894 -16525 -22416 -23111 -14438 -10181 -296 -8356 -24663 -38548 -25206 -16975 -19596 -19185
14221a9185J0325q50j3012O357L418k676J5408N534m53R819J7084n373j3095k606
$$ -19185 -8860 -9710 -22722 -16365 -12947 -15623 -215 5319 4866 14685 31769 26396 13301 10695
14207A0695j0467J22k635p703l997N46P099K802q445O618J1630P992o543j4566
$$ 10695 228 350 -2285 -9988 -13985 -13439 -6340 -3538 -11983 -5365 6265 14257 7714 -6852
14193f852j0816J6037O391l654q196m987n302j052L103m159k192o606J6169P319
$$ -6852 -17668 -1631 4760 1106 -7090 -12077 -17379 -18431 -15328 -19487 -21679 -28285 -12116 -4797
14179d797J598L764j0272L920k323q165O112J1384P170K857O649j1761j4405Q268
$$ -4797 -3199 565 -9707 -5787 -8110 -16275 -10163 1221 8391 11248 17897 6136 -8269 -1
14165aK672j5119n549L142j221L419J526J542n834K839J545n25k868j163n083
$$ -1 2671 -12448 -17997 -14855 -16076 -12657 -11131 -9589 -15423 -12584 -11039 -11564 -14432 -15595 -20678
14150b0678J0322P043O914j1195r105J3512J2414k977L192J5940n043n240p473
$$ -20678 -10356 -3313 3601 -7594 -16699 -3187 9227 6250 9442 25382 20339 15099 7626
14137G626p754k242P203p456j5417n57P979q61r901Q256N709m938m922M707J1410
$$ 7626 -128 -2370 4833 -2623 -18040 -18597 -10618 -11479 -21380 -13124 -7415 -12353 -17275 -12568 -1158
14122a158m382p701J2986N0n629j318J029J3500j615l526J7346R167k2485J109
$$ -1158 -5540 -13241 -255 -205 -5834 -7152 -6123 7377 5762 2236 19582 28749 6264 7373
14108G373K786P051R40k2662j5649J281L182j318O151P569L690L104j256J047
$$ 7373 10159 17210 18150 -4512 -20161 -18880 -15698 -17016 -10865 -3296 394 3498 2242 3289
14094C289O558K964m647m027j2291j158J1239n181l953k65r999M251q316k867
$$ 3289 9847 12811 8164 4137 -8154 -9312 1927 -3254 -7207 -7472 -17471 -13220 -21536 -24403
14080b4403n692m734m008O404R548J3820M643J575R701K869M017Q054j0539k0447
$$ -24403 -30095 -34829 -38837 -32433 -22885 -9065 -4422 -2847 6854 9723 13740 21794 11255 -9192
14066i192l780m433N363P179k572L72o749n445L385N33m40J558N605J638M346
$$ -9192 -12972 -17405 -12042 -4863 -7435 -7063 -13812 -19257 -15872 -15339 -15779 -14221 -8616 -6978 -2632
14051b632k51j3145l010r234J3545P886n326q023o011J4029l893m901j593j1216
$$ -2632 -2883 -16028 -19038 -28272 -14727 -6841 -12167 -20190 -26201 -12172 -16065 -20966 -22559 -33775
14037c3775J077J4728R257Q800j1304L545J1445o158j2046j0627l722J5764J3292
$$ -33775 -32698 -17970 -8713 87 -11217 -7672 3773 -2385 -14431 -25058 -28780 -13016 276
14024B76N118j754n440k0274Q001L462p563o451K339j063N91o974J5248J8763
$$ 276 5394 3640 -1800 -22074 -14073 -10611 -18174 -24625 -22286 -23349 -22758 -29732 -14484 4279
14010D279J941J341k635k993N545P9p06j3941l771l232R150p592M379K404j488
$$ 4279 6220 7561 4926 1933 7478 7557 6851 -7090 -10861 -14093 -4943 -12535 -8156 -5752 -7240
13995g240q23O414N5O18j951j1712J14N627M277O411q899j5811j513K695N74J1703
$$ -7240 -8063 -1649 -1594 -976 -2927 -14639 -14525 -8898 -4621 1790 -7109 -22920 -24433 -21738 -21164 -9461
13979i461P913Q61m788o245n420N083M983J963j1428J005J472m166J1194P956
$$ -9461 -1548 -687 -5475 -11720 -17140 -12057 -7074 -5111 -16539 -15534 -14062 -18228 -7034 922
13965I22j2374J108R887j1791j618N88K147L933o207j455J046J1236p225n401
$$ 922 -11452 -10344 -457 -12248 -13866 -13278 -11131 -7198 -13405 -14860 -13814 -2578 -9803 -15204
13951a5204J1687J0723L393j0736r692k748L290m850N130K889M342p154k794j5517
$$ -15204 -3517 7206 10599 -137 -9829 -12577 -9287 -14137 -9007 -6118 -1776 -8930 -11724 -27241
13937b7241j6626J546J3415l94L719n641J4494J6325j1343P641M736m446N597
$$ -27241 -43867 -42321 -28906 -29300 -25581 -31222 -16728 -403 -11746 -4105 631 -3815 1782
13924A782J950k884j1328p819L267j3381K115O942K305J807J7890j134P706l901
$$ 1782 3732 848 -10480 -18299 -15032 -28413 -26298 -19356 -17051 -15244 2646 1512 9218 5317
13910E317J632K947j0839j3874o484M529R683o78N169J3558Q104p597K370m951
$$ 5317 6949 9896 -943 -14817 -21301 -16772 -7089 -7767 -2598 10960 19064 11467 13837 8886
13896H886m415j1810r014Q907Q120O45M125J301O55j8449k047N398L196J1309
$$ 8886 4471 -7339 -16353 -7446 674 1319 5444 6745 7400 -11049 -13096 -7698 -4502 6807
13882F807O099j092l574q429n897j2239j081K952J0055J3938l574o821M862j5381
$$ 6807 12906 11814 8240 -189 -6086 -18325 -19406 -16454 -6399 7539 3965 -2856 2006 -13375
13868a3375l228N43o26O887o884Q480J2834L851J797R594k512r758j0781N497
$$ -13375 -16603 -16060 -16686 -9799 -16683 -8203 4631 8482 10279 19873 17361 7603 -3178 2319
13854B319n334k0197n697R554J3730J758n823l505J737P688J2807O730k28j0793
$$ 2319 -3015 -23212 -28909 -19355 -5625 -3867 -9690 -13195 -11458 -3770 9037 15767 15539 4746
13840D746k9084j0273J5276J4499J148K809R848J3971l085j2861q584J0445o02
$$ 4746 -24338 -34611 -19335 -4836 -3688 -879 8969 22940 19855 6994 -1590 8855 8253
13827H253j1064k0363n10J2557Q283q288r344k628K136k426l500k088j710Q521
$$ 8253 -2811 -23174 -23684 -11127 -2844 -11132 -20476 -23104 -20968 -23394 -26894 -28982 -30692 -22171
13813b2171p578r917Q52J9097J0324J2294P09j0078Q11r608j359P900k779j2278
$$ -22171 -29749 -39666 -38814 -19717 -9393 2901 3610 -6468 -5657 -15265 -16624 -8724 -11503 -23781
13799b3781J0055J3162M306l627J684J548j0945m371n064n001O690J7963k702
$$ -23781 -13726 -564 3742 115 1799 3347 -7598 -11969 -17033 -22034 -15344 2619 -83
13786h3K406N1L964m822l994K129k941R395R235l058q293j288P448j6944k0993
$$ -83 2323 2374 6338 1516 -2478 -349 -3290 6105 15340 12282 3989 2701 10149 -6795 -27788
13771b7788j0266J0199J9848m91j0951K803K2019k586j2122L76o468k184K529
$$ -27788 -38054 -27855 -8007 -8498 -19449 -16646 5373 2787 -9335 -8959 -15427 -17611 -15082
13758a5082K071J577K826M720K590J679R0n082n201j1976j6738R239J2626P524
$$ -15082 -13011 -11434 -8608 -3888 -1298 381 471 -4611 -9812 -21788 -38526 -29287 -16661 -9137
13744i137o836j343l751j14K237N057l776o696J2118O90o366J628L746P152L805
$$ -9137 -15973 -17316 -21067 -21181 -18944 -13887 -17663 -24359 -12241 -11551 -17917 -16289 -12543 -5391 -1586
13729a586n534q152Q495J0413N002j6839K795j0910m244n98l570M510J5047J0249
$$ -1586 -7120 -15272 -6777 3636 8638 -8201 -5406 -16316 -20560 -21158 -24728 -20218 -5171 5078
13715E078n439j2813r089j473l78P079J6432O213M242N488p826k0456L936Q224
$$ 5078 -361 -13174 -22263 -23736 -24114 -17035 -603 5610 9852 15340 7514 -12942 -9006 -782
13701g82K447K465j1858r344j2364m917J3464O540J1570P032m972n1n086K469
$$ -782 1665 4130 -7728 -17072 -29436 -34353 -20889 -14349 -2779 4253 -719 -770 -5856 -3387
13687c387R176L002j572j1035O954K561q956o14k241o587P95M749r03M411J2133
$$ -3387 5789 8791 7219 -3816 3138 5699 -3257 -3871 -6112 -12699 -11904 -7155 -8058 -3647 8486
13672H486n971j6435J81J772L770R350N75O681M605k647j923N973L182q607r636
$$ 8486 2515 -13920 -13739 -11967 -8197 1153 1728 8409 13014 10367 8444 14417 17599 8992 -644
13657f44l883Q982J2017r829j258r594j6285K692J4553Q677p445q909L76J911
$$ -644 -4527 4455 16472 6643 5385 -4209 -20494 -17802 -3249 5428 -2017 -10926 -10550 -8639
13643h639R647J4999o472r658n898k218j40l305j997K247L051J6150N255k2799
$$ -8639 1008 16007 9535 -123 -6021 -8239 -8379 -11684 -13681 -11434 -8383 7767 13022 -9777
13629i777k856p900P712J3793j250k0108o604J4270j1157q536J089N669N453J3653
$$ -9777 -12633 -20533 -12821 972 -278 -20386 -26990 -12720 -23877 -32413 -31324 -25655 -20202 -6549
13615f549P40J3566k312j0872r284N233L21R7K659N155j051N463J8494O316j5300
$$ -6549 -5809 7757 5445 -5427 -14711 -9478 -9157 -9060 -6401 -1246 -2297 3166 21660 27976 12676
13600A2676M949r912j4766P084Q840j0372o924j633m465K402n843K567m659J675
$$ 12676 17625 7713 -7053 31 8871 -1501 -8425 -10058 -14523 -12121 -17964 -15397 -20056 -18381
13586a8381M452J4688M366r028M480j0314L15N069Q017j0243q06l029n578J0164
$$ -18381 -13929 759 5125 -3903 577 -9737 -9422 -4353 3664 -6579 -7385 -10414 -15992 -5828
13572e828q802q036k787m364L845O913K4593R679j48k359K052K806j1671n883
$$ -5828 -14630 -22666 -25453 -29817 -25972 -19059 5534 15213 15065 12706 14758 17564 5893 10
13558A0o109p128M310j961Q16J1555j078j1840L97L110M700o544l011N972R317
$$ 10 -6099 -13227 -8917 -10878 -10062 1493 415 -11425 -11028 -7918 -3218 -9762 -12773 -6801 2516
13543B516Q303j618j0048k26P40j1730l984k054J5892l037J091K920r67j989P372
$$ 2516 10819 9201 -847 -1073 -333 -12063 -16047 -18101 -2209 -5246 -4155 -1235 -2202 -4191 3181
13528C181J8544o535j3876j1564j0890J060K062J8331O72j3061n479L889N708
$$ 3181 21725 15190 1314 -10250 -21140 -20080 -18018 313 985 -12076 -17555 -13666 -7958
13515g958k178K87r555l651O864P413j261m209k93l044N760P209K22j841R1M2
$$ -7958 -10136 -9849 -19404 -23055 -16191 -8778 -10039 -14248 -14541 -17585 -11825 -4616 -4394 -6235 -6144 -6102
13499f102j4129k622O456o647m630Q173J1061J8189k762n532o769p854L698J1508
$$ -6102 -20231 -22853 -16397 -23044 -27674 -19501 -8440 9749 6987 1455 -5314 -13168 -9470 2038
13485B038P177M813k4803j5590J0475J0937N738M65N814J551l891O510m834l649
$$ 2038 9215 14028 -10775 -26365 -15890 -4953 785 1250 7064 8615 4724 11234 6400 2751
13471B751M558n219L046l144j136j995J302j4669r746O742M053N810l390q883
$$ 2751 7309 2090 5136 1992 856 -1139 163 -14506 -24252 -17510 -13457 -7647 -11037 -19920
13457a9920K365O022l1n585L562R80j892J1977J2909L810l594j2504m333P95J0818
$$ -19920 -17555 -11533 -11564 -17149 -13587 -12607 -14499 -2522 10387 14197 10603 -1901 -6234 -5439 5379
13442E379J28m698k961M879J515k772M508j245M69K038l134o741o158k49m643
$$ 5379 5507 809 -2152 2727 4242 1470 5978 4733 5202 7240 4106 -2635 -8793 -9042 -13685
13427a3685Q105L132n410L816l47m679m133p401O843P847M718N383M462J0798
$$ -13685 -5580 -2448 -7858 -4042 -4389 -9068 -13201 -20602 -13759 -5912 -1194 4189 8651 19449
13413A9449m581o042o949n447M702N205j1356o743J8086q08k1245m245p30N445
$$ 19449 14868 8826 1877 -3570 1132 6337 -5019 -11762 6324 5516 -15729 -19974 -20704 -15259
13399a5259O781J0663J672m328q010O515K7470L234K649M80q902j2494Q287J2435
$$ -15259 -8478 2185 3857 -471 -8481 -1966 25504 28738 31387 31867 22965 10471 18758 31193
13385C1193j5343j0788m976l849J70j3893J5963J3925P043o103O869J0122j2448
$$ 31193 15850 5062 86 -3763 -3593 -17486 -1523 12402 19445 13342 20211 30333 17885
13372A7885j9365q059K356j992l512J3493n248o301j798n073Q487N172o597M362
$$ 17885 -1480 -9539 -7183 -9175 -12687 806 -4442 -10743 -12541 -17614 -9127 -3955 -10552 -6190
13358f190K2739J4404r275k3820l135N412Q221l838l578j0252N901J0783J5572
$$ -6190 16549 30953 21678 -2142 -5277 135 8356 4518 940 -9312 -3411 7372 22944
13345B2944P767P12j0207j5243j4145j2795L006Q113J3325J230p376J20k250K561
$$ 22944 30711 31423 21216 5973 -8172 -20967 -17961 -9848 3477 4707 -2669 -2549 -4799 -2238
13331b238k255j760n118K653O265Q725J3941j3050j4652m040l89O358P701L043
$$ -2238 -4493 -6253 -11371 -8718 -2453 6272 20213 7163 -7489 -11529 -11918 -5560 2141 5184
13317E184N438J3n552j0423r798K0288m288p040r91J1233o9K76L559N147p923
$$ 5184 10622 10635 5083 -5340 -15138 5150 862 -6178 -7169 4064 3995 4271 7830 12977 5054
13302E054L020j0454R38M068N30j050q547j283J738k153m093k607J4571J1030
$$ 5054 8074 -2380 -1442 2626 3156 2106 -6441 -7724 -5986 -8139 -12232 -14839 -268 10762
13288A0762Q52K26r163m747Q321K899j2995j6796k498K516J3033J1229j882M332
$$ 10762 11614 11840 2677 -2070 6251 9150 -3845 -20641 -23139 -20623 -7590 3639 1757 6089
13274F089n07M424n14r785l832k250J1784o702L67p247K225j215K169J4412L334
$$ 6089 5582 10006 9492 -293 -4125 -6375 5409 -1293 -926 -8173 -5948 -7163 -4994 9418 12752
13259A2752j342j2720q075O223J4487O775n826j0918k499O867K772j116K00o284
$$ 12752 11410 -1310 -9385 -3162 11325 18100 12274 1356 -1143 5724 8496 7380 7580 1296
13245A296j354J1316m53p023P492m963l613n376j5925m709j024J0886P159j558
$$ 1296 -58 11258 10805 3782 11274 6311 2698 -2678 -18603 -23312 -24336 -13450 -6291 -7849
13231g849q384K439P545K306q366r99l820r112O010R963J1127o148J72k947o341
$$ -7849 -16233 -13794 -6249 -3943 -12309 -13308 -17128 -26240 -20230 -10267 860 -5288 -5116 -8063 -14404
13216a4404Q693P11L548N758k250m598m317r39J087l21N293j139K084k363j5851
$$ -14404 -5711 -5000 -1452 4306 2056 -2542 -6859 -7798 -6711 -7032 -1739 -2878 -794 -3157 -19008
13201a9008n815O014K0265J3162J589n99L474L319p05J93j4210m483Q48K913j3419
$$ -19008 -24823 -18809 1456 14618 16207 15608 19082 22401 21696 21889 7679 3196 4044 6957 -6462
13186f462k936L175J3148P991l523p429j1476K148o08j0592R767L650n896n396
$$ -6462 -9398 -6223 6925 14916 11393 3964 -7512 -5364 -5972 -16564 -6797 -3147 -9043 -14439
13172a4439j159P66J588r499j558J2301J3775o929m513l31k590O112j326m509
$$ -14439 -15598 -14832 -13244 -22743 -24301 -12000 1775 -5154 -9667 -9998 -12588 -6476 -7802 -12311
13158a2311p367O427l83L399o568j330k752p920o133Q87J0403K0579N358L305
$$ -12311 -19678 -13251 -13634 -10235 -16803 -18133 -20885 -28805 -34938 -34051 -23648 -3069 2289 5594
13144E594k836M40n794j758n14r39L855n449j0790M206P810N072q568N769m399
$$ 5594 2758 3198 -2596 -4354 -4868 -5807 -1952 -7401 -18191 -13985 -6175 -1103 -9671 -3902 -8301
13129h301P816P277n857k097l798Q215Q563o90M086r559l990K653J5893M956j4744
$$ -8301 -485 6792 935 -1162 -4960 3255 11818 11128 15214 5655 1665 4318 20211 25167 10423
13114A0423q794k180j895j337N613r096p457O2N830J28o51O925l792k711j573
$$ 10423 1629 -551 -2446 -3783 1830 -7266 -14723 -14661 -8831 -8703 -9354 -2429 -6221 -8932 -10505
13099a0505l566J565J846L732j605r490n34J037p970L396J7595O649j2609J2336
$$ -10505 -14071 -12506 -10660 -6928 -8533 -18023 -18557 -17520 -25490 -22094 -4499 2150 -10459 1877
13085A877l85p458q99j1781J1793J1672n493M754K2585q17r550j4542q087J343
$$ 1877 1492 -5966 -6865 -18646 -6853 4819 -674 4080 26665 25848 16298 1756 -6331 -4988
13071d988J0238J332k389O953R628K644r163m298p770O483J9006J5748J0818K732
$$ -4988 5250 6582 4193 11146 20774 23418 14255 9957 2187 8670 27676 43424 54242 56974
13057E6974R4n953k3498k6446N215K087j6155q185L750n784m627p56O75R942N116
$$ 56974 57068 51115 27617 1171 6386 8473 -7682 -15867 -12117 -17901 -22528 -23284 -22609 -12667 -7551
13042g551M079J999J685J2797K82j2006l906N068O416k982j2705p994J736J0069
$$ -7551 -3472 -1473 212 13009 13291 1285 -2621 2447 8863 5881 -6824 -14818 -13082 -3013
13028c013K177l143K105J1041J3773N603j8942o683O250J8578J0001J7564L9463
$$ -3013 -836 -3979 -1874 9167 22940 28543 9601 2918 9168 27746 37747 55311 94774
13015I4774L4875J5694n023l2370k4287k6496j8542j0017j0649r374o74M074k887
$$ 94774 129649 145343 140320 107950 83663 57167 38625 28608 17959 8585 7911 11985 9098
13002I098L697m666o658J571K716p860o559n499j1251k893J5546m411K441J2219
$$ 9098 12795 8129 1471 3042 5758 -2102 -8661 -14160 -25411 -28304 -12758 -17169 -14728 -2509
12988b509j383l688K183K365L795o515j420m761p222M06K1874J7069J2064q724
$$ -2509 -3892 -7580 -5397 -3032 763 -5752 -7172 -11933 -19155 -18749 3125 20194 32258 23534
12974B3534o88J9081J3666L0736L5186K1711m726k4799j8986k2542j9551j8605
$$ 23534 22846 41927 55593 86329 121515 143226 138500 113701 94715 72173 52622 34017
12962C4017j7825k915n863J373l982N034K176m687n821m276n445n544j3974Q957
$$ 34017 16192 13277 7414 8787 4805 9839 12015 7328 1507 -2769 -8214 -13758 -27732 -18775
12948a8775J7714M753n73M083L452J0996K440n186j1699o116r051l503k92O457
$$ -18775 -1061 3692 3119 7202 10654 21650 24090 18904 7205 1089 -7962 -11465 -11757 -5300
12934e300L165p326M483M807J4140J2546M92J0545J3856P879m529n202n601j3677
$$ -5300 -2135 -9461 -4978 -171 13969 26515 27007 37552 51408 59287 54758 49556 43955 30278
12920C0278q168k16n353m876m513p478L831N197o061m548N948J4144n707q519
$$ 30278 22110 21894 16541 11665 7152 -326 3505 8702 2641 -1907 4041 18185 12478 3959
12906C959q79n24k017j2601k834j12m377j813p48M36R155k513o718J0614l724
$$ 3959 3080 2556 539 -12062 -14896 -15008 -19385 -21198 -21946 -21510 -12355 -14868 -21586 -10972 -14696
12891a4696o548N274m061m143K8127R811j3240j2099j7377o343J3650J2934j572
$$ -14696 -21244 -15970 -20031 -24174 3953 13764 524 -11575 -28952 -35295 -21645 -8711 -10283
12878a0283R766M945l006n513M804k535m256N479j983K999R467l452q566r57M580
$$ -10283 -517 4428 1422 -4091 713 -1822 -6078 -599 -2582 417 9884 6432 -2134 -3091 1489
12863A489K246j0250O59K679j753J0634j06J466j0472r529L927P477K529K84n081
$$ 1489 3735 -6515 -5856 -3177 -4930 5704 5598 7064 -3408 -12937 -9010 -1533 996 1280 -3801
12848c801j711L964L459p337n636l107L956r497k863J1267P380J6888J1152n086
$$ -3801 -5512 -1548 1911 -5426 -11062 -14169 -10213 -19710 -22573 -11306 -3926 12962 24114 19028
12834A9028o295l95q130q831M466M189L802N823K150j1433j3582L449M040j0570
$$ 19028 12733 12338 4208 -4623 -157 4032 7834 13657 15807 4374 -9208 -5759 -1719 -12289
12820a2289J591p51o477K825R539P782J2420m205j7445k004m457J182J5230J1016
$$ -12289 -10698 -11449 -17926 -15101 -5562 2220 14640 10435 -7010 -9014 -13471 -12289 2941 13957
12806A3957j3893q340j2731J963R889j803n264P215N589r41l848O689r784k222
$$ 13957 64 -8276 -21007 -19044 -9155 -10958 -16222 -9007 -3418 -4359 -8207 -1518 -11302 -13524
12792a3524J1244O847O883m332k564j550M135J734o644m346l566o277N547k695
$$ -13524 -2280 4567 11450 7118 4554 3004 7139 8873 2229 -2117 -5683 -11960 -6413 -9108
12778i108m432M307P253L482J3713J878p44m139k1053j2730n715O102N079n670
$$ -9108 -13540 -9233 -1980 1502 15215 17093 16349 12210 -8843 -21573 -27288 -21186 -16107 -21777
12764b1777J3617K901J6111N472n043l141q906j376J038J1311P453m228n278L036
$$ -21777 -8160 -5259 10852 16324 11281 8140 -766 -2142 -1104 10207 17660 13432 8154 11190
12750A1190j0256O148K934k529J1231K113j1875q641L955N723o676J538n057K591
$$ 11190 934 7082 10016 7487 18718 20831 8956 315 4270 9993 3317 4855 -202 2389
12736B389l693j5952n732O114N213O185L011P733P616P34m369P018j4758j5348
$$ 2389 -1304 -17256 -22988 -16874 -11661 -5476 -2465 5268 12884 13618 9249 16267 1509 -13839
12722a3839J918O102k144M921J0357P757m391o774m391N890k2718r750N333j213
$$ -13839 -11921 -5819 -7963 -3042 7315 15072 10681 3907 -484 5406 -17312 -27062 -21729 -22942
12708b2942J681Q760J408l669l129L55O697k786q636J238N834J6014Q109j2423
$$ -22942 -21261 -12501 -11093 -14762 -17891 -17536 -10839 -13625 -22261 -21023 -15189 825 8934 -3489
12694c489j6617P820j345Q525J892j148M619n25p066j0018J1077L478j306k990
$$ -3489 -20106 -12286 -13631 -5106 -3214 -4362 257 -268 -7334 -17352 -6275 -2797 -4103 -7093
12680g093l228K049K457m74k331N050J243n85M413L374o277j4166R839n543j5230
$$ -7093 -10321 -8272 -5815 -6289 -8620 -3570 -2327 -2912 1501 4875 -1402 -15568 -5729 -11272 -26502
12665b6502r401k442J1534P397J3312Q010j3605p897q12n089J5390M148o565j7092
$$ -26502 -35903 -38345 -26811 -19414 -6102 1908 -11697 -19594 -20406 -25495 -10105 -5957 -12522 -29614
12651b9614J904J2719J5486m292k806N037M07o866k117l197L315k500J2490O609
$$ -29614 -27710 -14991 495 -3797 -6603 -1566 -1159 -8025 -10142 -13339 -10024 -12524 -34 6575
12637F575r030p554j3507O438J8503J1584M476j0641o886K748Q627m892j5870
$$ 6575 -2455 -10009 -23516 -17078 1425 13009 17485 6844 -42 2706 11333 6441 -9429
12624i429p805P617N988M730P478n164j217O558K486n679k98m571M502O498l519
$$ -9429 -17234 -9617 -3629 1101 8579 3415 2198 8756 11242 5563 5265 694 5196 11694 8175
12609H175k008J05R39l876r61o04K658M80n600p539j8750j589K5146J5377Qj1232
$$ 8175 6167 6272 7211 3335 2374 1770 4428 4908 -692 -8231 -26981 -28570 -3424 11953 11961 729
12593G29j6946m841J2115K123K533R849n084k578J463J047j3662O640J9147J288
$$ 729 -16217 -21058 -8943 -6820 -4287 5562 478 -2100 -637 410 -13252 -6612 12535 13823
12579A3823k957l858q858L291j6o706n078j1129Q021J387n858k46M657P525K312
$$ 13823 10866 7008 -1850 1441 1425 -5281 -10359 -21488 -13467 -12080 -17938 -18184 -13527 -6002 -3690
12564c690J036j0824O011L534J801k502q215q399M075L125j77J1765J44j2589
$$ -3690 -2654 -13478 -7467 -3933 -2132 -4634 -12849 -21248 -17173 -14048 -14225 -2460 -2316 -14905
12550a4905o532J862O897R61L513J176r92N483o210o295M214P259R543r121k2549
$$ -14905 -21437 -19575 -12678 -11717 -8204 -7028 -8020 -2537 -8747 -15042 -10828 -3569 5974 -3147 -25696
12535b5696n159J7703J4639k731j312K29J5404l483q458J113p931j1386Q025J6087
$$ -25696 -30855 -13152 1487 -1244 -2556 -2327 13077 9594 1136 2249 -5682 -17068 -9043 7044
12521G044j1064j1977N630N076J0414O270o163l753r716L463M351p485m708Q421
$$ 7044 -4020 -15997 -10367 -5291 5123 11393 5230 1477 -8239 -4776 -425 -7910 -12618 -4197
12507d197J8150n256n558O28j2191N134L769j2080J636J4904O098Q93m251j6615
$$ -4197 13953 8697 3139 3767 -8424 -3290 479 -11601 -9965 4939 11037 11930 7679 -8936
12493h936j0237k66N975L592o471R033J088j0535K621M639n742L480K3466P168
$$ -8936 -19173 -19439 -13464 -9872 -16343 -7310 -6222 -16757 -14136 -9497 -15239 -11759 11707 18875
12479A8875j1802j6536q712J1019J1179l602K345M995L252p593p009L407K284
$$ 18875 7073 -9463 -18175 -7156 4023 421 2766 7761 11013 3420 -3589 -182 2102
12466B102n957j3123N926J5199p529Q644R261m558n315M434k399m653l598j8249
$$ 2102 -3855 -16978 -11052 4147 -3382 5262 14523 9965 4650 9084 6685 2032 -1566 -19815
12452a9815J7169Q866l975p553k957O615J170L484M899q679j999R623o13l062
$$ -19815 -2646 6220 2245 -5308 -8265 -1650 -480 3004 7903 -776 -2775 6848 6235 3173
12438C173n178J1683p963j5565N149Q637R051o201J0298J1500K524M009J105O736
$$ 3173 -2005 9678 1715 -13850 -8701 -64 8987 2786 13084 24584 27108 31117 32222 38958
12424C8958j256J664j3850j9085m909O767p40Q947p672r559k046j1354k011m275
$$ 38958 37702 39366 25516 6431 1522 8289 7549 16496 8824 -735 -2781 -14135 -16146 -20421
12410b0421J0587J6943R302l030o329m811M424l553Q61j0490r475j2494J1200
$$ -20421 -9834 7109 16411 13381 7052 2241 6665 3112 3973 -6517 -15992 -28486 -17286
12397a7286J0153L609p614J89M729q08j7658O265J878r141J1776Q352J1626J4735
$$ -17286 -7133 -3524 -11138 -10949 -6220 -7028 -24686 -18421 -16543 -25684 -13908 -5556 6070 20805
12383B0805p082m794j0899q668N411J2080Q462k102j8805o437J0233K6R06P374
$$ 20805 13723 8929 -1970 -10638 -5227 6853 15315 13213 -5592 -12029 -1796 -1770 -864 6510
12369F510m857q351n931O982J177m440K8J2092M312l677M617j1088P527J213o441
$$ 6510 1653 -6698 -12629 -5647 -4470 -8910 -8882 3210 7522 3845 8462 -2626 4901 6114 -327
12354c27Q596j966j5834j7356J835Q051k949J1530M628m841N504o115j22Q276
$$ -327 8269 6303 -9531 -26887 -25052 -17001 -19950 -8420 -3792 -8633 -3129 -9244 -9366 -1090
12340a090M190o388n612q340J240R041J5917o067K595J634j4404n716J4055M306
$$ -1090 3100 -3288 -8900 -17240 -16000 -6959 8958 2891 5486 7120 -7284 -13000 1055 5361
12326E361j140q906m349P803J695o62L294N494o193l0p436O759N853N323r29P476
$$ 5361 4221 -4685 -9034 -1231 464 -198 3096 8590 2397 2367 -5069 1690 7543 12866 11937 19413
12310A9413L525j3244n801K844R12K064M119M073L245M750J1699m606o545M99
$$ 19413 22938 9694 3893 6737 7649 9713 13832 17905 21150 25900 37599 32993 26448 26947
12296B6947j3445r356l440m859J4295J912l652m325j6728o064J413R962m595n792
$$ 26947 13502 4146 706 -4153 10142 12054 8402 4077 -12651 -18715 -17302 -7340 -11935 -17727
12282a7727Q910M004l710J0915j067j3802o782R767J1957R046r79m344p545m545
$$ -17727 -8817 -4813 -8523 2392 1325 -12477 -19259 -9492 2465 11511 10532 6188 -1357 -5902
12268e902k14k046J0056J2437j849j0389j0992j386J2549J2755p000r504N216
$$ -5902 -6116 -8162 1894 14331 12482 2093 -8899 -10285 2264 15019 8019 -1485 3731
12255C731O585l439j4635N23P383J966j784J0954k397j2328K396N912k698j308
$$ 3731 10316 6877 -7758 -7235 148 2114 330 11284 8887 -3441 -1045 4867 2169 861
12241H61N551L386N713q644j90J691o688j2844j3322J0489L871J205L963L58Q159
$$ 861 6412 9798 15511 6867 6677 8368 1680 -11164 -24486 -13997 -10126 -8921 -4958 -4600 3559
12226C559J0907J2737k1197j9081N836O861q759q072O256J9216J784q28m04P128
$$ 3559 14466 27203 6006 -13075 -7239 -378 -9137 -17209 -10953 8263 10047 9219 8815 15943
12212A5943J192k535o036o63j0J3059R723n598j432j0243j0960n320r582k324
$$ 15943 17135 14600 8564 7901 7891 20950 30673 25075 23643 13400 2440 -2880 -12462 -14786
12198a4786P113J1454O400O149p294r447O922P575J1659n367k864J5929J925q707
$$ -14786 -7673 3781 10181 16330 9036 -411 6511 14086 25745 20378 17514 33443 35368 26661
12184B6661j4567q480l015N744J0485L627L734r288j52J0317j0859j5463o69L664
$$ 26661 12094 3614 599 6343 16828 20455 24189 14901 14749 25066 14207 -1256 -1925 1739
12170A739O581P955P602q852j1963L89J399l558J6182J5605m850n245j1428l091
$$ 1739 8320 16275 23877 15025 3062 3451 4850 1292 17474 33079 28229 22984 11556 8465
12156H465K39m420k691o292l78L525K191p799L854L730M342Q222O724J309K938
$$ 8465 8704 4284 1593 -4699 -5077 -1552 639 -7160 -3306 424 4766 12988 19712 21021 23959
12141B3959o135j7494n578k921J9639k982o358K911L155K70J0775J9971j714j6282
$$ 23959 17824 330 -5248 -8169 11470 8488 2130 5041 8196 8466 19241 39212 37498 21216
12127B1216j395n752n225m94j0884q934N521n14J1386Q206p995m599N50q62k640
$$ 21216 19821 14069 8844 8350 -2534 -11468 -5947 -6461 4925 13131 5136 537 1087 225 -2415
12112b415o385L28k51M876Q672L308l330p398M341L118M620J1793N583p219p438
$$ -2415 -8800 -8472 -8723 -3847 4825 8133 4803 -2595 1746 4864 9484 21277 26860 19641 12203
12097A2203j109J7688l057j2757j1239K61J7443R630J586K394n787j3914j8282
$$ 12203 11094 28782 25725 12968 1729 1990 19433 29063 30649 33043 27256 13342 -4940
12084d940j4590J3837J2723J659J987J3018J1221p407o280o202j984P856R308
$$ -4940 -19530 -5693 7030 8689 10676 23694 34915 27508 21228 15026 13042 20898 30206
12071C0206m781o900N34J0592N79j1131J2837J8321J044o428o743n770j5816R448
$$ 30206 25425 18525 19059 29651 30230 19099 31936 50257 51301 44873 38130 32360 16544 25992
12057B5992Q318o26O623o948j867M559N163j980k221M128o609M881m179j1964
$$ 25992 34310 33684 40307 33359 31492 36051 41214 39234 37013 41141 34532 39413 35234 23270
12043B3270L934n08J998O799j4879jJ4513M293j3823j0300O145J6520J2199j8893
$$ 23270 27204 26696 28694 35493 20614 20613 35126 39419 25596 15296 21441 37961 50160 31267
12029C1267j5872r809j766M099J2844J6030J0774N455j2530j0909J654k045J7935
$$ 31267 15395 5586 3820 7919 20763 36793 47567 53022 40492 29583 31237 29192 47127
12016D7127Q594p047j3704n240J5043J0234j048o423J646J973O515O140m104N853
$$ 47127 55721 48674 34970 29730 44773 55007 53959 47536 49182 51155 57670 63810 59706 65559
12002F5559l536O540Q641j064n753q69p116L854Q252L413j4167m179J8746O712
$$ 65559 62023 68563 77204 76140 70387 69518 62402 66256 74508 77921 63754 59575 78321 85033
11988H5033L342J607J3084N740j1543j0214j061J6560P186p791P248J0435J1172
$$ 85033 88375 89982 103066 108806 97263 87049 85988 102548 109734 101943 109191 119626 130798
11975A30798J0746L545k366o245J2645J4529J3170K937p32n206J3867Q984l232
$$ 130798 141544 145089 142723 136478 149123 163652 176822 179759 179027 173821 187688 196672 193440
11962A93440J8629K1966J6565J3468J6999K4269K4266J9569K8834K5747K9870
$$ 193440 212069 234035 250600 264068 281067 305336 329602 349171 378005 403752 433622
11951D33622N0145O2348M1652L6161N5092O9333P2555R7561J09155J30680J78717
$$ 433622 483767 546115 587767 623928 679020 748353 820908 918469 1027624 1158304 1337021
11940A337021K08129K65656L39514M47570N90806P87627J059652J494311K135472
$$ 1337021 1545150 1810806 2150320 2597890 3188696 3976323 5035975 6530286 8665758
11931H665758L037424M110567N112152N101876K474036j915360m214394m261678
$$ 8665758 11703182 15813749 20925901 26027777 28501813 26586453 22372059 18110381
11923A8110381l676552k992149k307500j734003j303145r81406p53135n90374
$$ 18110381 14433829 11441680 9134180 7400177 6097032 5115626 4362491 3772117
11915C772117m66475l78262l21986k55817k01596j59551j38318j22154r9172q1599
$$ 3772117 3305642 2927380 2605394 2349577 2147981 1988430 1850112 1727958 1628786 1547187
11905A547187o9420n2669m9449l2620l7231n4545k3541j2336k8840k8473j3508
$$ 1547187 1477767 1425098 1375649 1343029 1305798 1251253 1227712 1215376 1186536 1158063 1144555
11894A144555j1312m535j5340k0353q381k1240l4764m3457m5838n1802o2189l7507
$$ 1144555 1133243 1128708 1113368 1093015 1084634 1063394 1028630 985173 939335 887533 825344 787837
11882G87837l4947m0175k2548k6561m1984l0430j0918l1658k6193k5198l0896
$$ 787837 752890 712715 690167 663606 621622 591192 580274 548616 522423 497225 466329
11871D66329k0099k1036k3635j2494k1187k2368j4889j5740k2164j3647n120n243
$$ 466329 446230 425194 401559 389065 367878 345510 330621 314881 292717 279070 273950 268707
11859B68707o212q048j7829o264k6121o158o170L294M903q141N88L140j9418j8292
$$ 268707 262495 254447 236618 230354 204233 198075 191905 195199 200102 191961 192549 195689 176271 157979
11845A57979o634l018n765J983j0097j3846j2796J423J2850l286j6827j7429n406
$$ 157979 151345 148327 142562 144545 134448 120602 107806 109229 122079 118793 101966 84537 79131
11832G9131J926J4929N32J802k68l820m622Q426j634j331k482M477r666N005j47
$$ 79131 81057 95986 96518 98320 98052 94232 89610 98036 96402 95071 92589 97066 87400 92405 92258
11817I2258l670m352n042p958O32P921J1216m788r097M658r243L172P662J222
$$ 92258 88588 84236 79194 71236 71868 79789 91005 86217 77120 81778 72535 75707 83369 84591
11803H4591M496P266M163j4104j6921q763O362n328k1267o172J4521j398k498
$$ 84591 89087 96353 100516 86412 69491 60728 67090 61762 40495 34323 48844 47446 44948
11790D4948j2532r543j173n788j683O039R990k33m992p134O55p482l58m013n908
$$ 44948 32416 22873 21700 15912 14229 20268 30258 30025 25033 17899 18554 11072 10714 6701 793
11775G93n008P48k343J0202J1698Q8K253l221j155N697Q716P389K786L158k782
$$ 793 -4215 -3467 -5810 4392 16090 16178 18431 15210 14055 19752 28468 35857 38643 41801 39019
11760C9019p134L022J521l997k308r60j436n908J3457N123q891K237p344k353
$$ 39019 31885 34907 36428 32431 30123 29163 27727 21819 35276 40399 31508 33745 26401 24048
11746B4048m415L377R8q78q46J9062R287K050m110j1950p072K790M198n371o158
$$ 24048 19633 23010 23108 22230 21384 40446 49733 51783 47673 35723 28651 31441 35639 30268 24110
11731B4110N936l499m298K719p722j3221N962J1810M988p387J0686J495o168M614
$$ 24110 30046 26547 22249 24968 17246 4025 9987 21797 26785 19398 30084 31579 25411 30025
11717C0025k484n512n06k856l056M614m856N562R29K481m810m551L036J0774n477
$$ 30025 27541 22029 21523 18667 15611 20225 15369 20931 21860 24341 19531 14980 18016 28790 23313
11702B3313n440j1543K748Q441r334j6674q076r102Q307J5827K0994M159J850
$$ 23313 17873 6330 9078 17519 8185 -8489 -16565 -25667 -17360 -1533 19461 23620 25470
11689B5470m749n512Q344K475k823m435J896Q037Q195n162L621j0001m303O88
$$ 25470 20721 15209 23553 26028 23205 18770 20666 28703 36898 31736 35357 25356 21053 21741
11675B1741r573j3960l746k518O83K701K5903K133j0197o308J932k30l832n958
$$ 21741 12168 -1792 -5538 -8056 -7373 -4672 21231 23364 13167 6859 8791 8561 4729 -1229
11661a229m311J3007j924q36O577L016j1660j7479k832M112M659K613m99q128
$$ -1229 -5540 7467 5543 4707 11284 14300 2640 -14839 -17671 -13559 -8900 -6287 -6786 -14914
11647a4914Jk403K014J0320m276j799j196m798K370J0471P476j1961J0691m486
$$ -14914 -14913 -17316 -15302 -4982 -9258 -11057 -12253 -17051 -14681 -4210 3266 -8695 1996 -2490
11633b490K417J9868N113k896p331o798j2359j2076Q39L579P595Q766J8665L222
$$ -2490 -73 19795 24908 22012 14681 7883 -4476 -16552 -15713 -12134 -4539 4227 22892 26114
11619B6114j6308j3563L40J0184J602l484L968K083m861l667m399o599N118o944
$$ 26114 9806 -3757 -3417 6767 8369 4885 8853 10936 6075 2408 -1991 -8590 -3472 -10416
11605a0416J956J065N340j5163q605k81O531p97k06J2273J0203L95J329k512J856
$$ -10416 -8460 -7395 -2055 -17218 -25823 -26104 -19573 -20370 -20576 -8303 1900 2295 3624 1112 2968
11590B968K19r35k488J0777q2o684J501J3676M827r359j5207n489k806J6113J759
$$ 2968 3187 2252 -236 10541 10459 3775 5276 18952 23779 14420 -787 -6276 -9082 7031 8790
11575H790o935k306J2455R653M645N587m332l450r055j3942J185J6176P73O874
$$ 8790 1855 -451 12004 21657 26302 31889 27557 24107 15052 1110 2295 18471 19244 26118
11561B6118j838r113j4703j95L752J035k0808l310r696k211J0113P803J5483K918
$$ 26118 24280 15167 464 269 4021 5056 -15752 -19062 -28758 -30969 -20856 -13053 2430 5348
11547E348M985l776j0198L106p969J807L213O444N82N405n718m228o85J504o299
$$ 5348 10333 6557 -3641 -535 -8504 -6697 -3484 2960 3542 8947 3229 -999 -1684 -180 -6479
11532f479l233N899r085J0182l033q408k186M899n805O912m813L041M730j638
$$ -6479 -9712 -3813 -12898 -2716 -5749 -14157 -16343 -11444 -17249 -10337 -15150 -12109 -7379 -9017
11518i017L914q667j14K294N827j554p990Q851j072N716N891j4850r008N773J0637
$$ -9017 -5103 -13770 -13884 -11590 -5763 -7317 -15307 -6456 -7528 -1812 4079 -10771 -19779 -14006 -3369
11503c369l401o57k521N964j970m850rP402k165R249N104m791O329Q607J471m35
$$ -3369 -6770 -7427 -9948 -3984 -5954 -10804 -10813 -3411 -5576 3673 8777 3986 10315 18922 20393 19958
11487A9958l181K910K468j0474j3224m161k123J2422R895m422n820j595j73K207
$$ 19958 16777 19687 22155 11681 -1543 -5704 -7827 4595 14490 10068 4248 2653 2480 4687
11473D687q48j80n768r065J2296P992J57j0284R62n943Q131l449n732J0438j0640
$$ 4687 3839 3659 -2109 -11174 1122 9114 9271 -1013 -51 -5994 2137 -1312 -7044 3394 -7246
11458g246p77n991j2808R904M353L313O109J801Q668J5974K852n098j1611p826
$$ -7246 -8023 -14014 -26822 -16918 -12565 -9252 -3143 -1342 7326 23300 26152 21054 9443 1617
11444A617M9q05q17J795J1392r750l456J834J547N070o208j0992k58J422M805
$$ 1617 1666 861 44 1839 13231 3481 25 1859 3406 8476 2268 -8724 -8982 -7560 -2755
11429b755O616j1025n221p989J0731P454j843J476P677N65K359j1217m515j791
$$ -2755 3861 -7164 -12385 -20374 -9643 -2189 -4032 -2556 5121 5686 8045 -3172 -7687 -9478
11415i478n511K827N608J456k397L720n107m46J4676N289J28O685j6151j2651
$$ -9478 -14989 -12162 -6554 -5098 -7495 -3775 -8882 -9328 5348 10637 10765 17450 1299 -11352
11401a1352P889q072n063j957j863J254l455K872N413K637K731M651J2484N92
$$ -11352 -3463 -11535 -16598 -18555 -20418 -19164 -22619 -19747 -14334 -11697 -8966 -4315 8169 8761
11387H761K009q377j085Q807j0777j2278O031O741N163m942N466q266o774J2656
$$ 8761 10770 2393 1308 10115 -662 -12940 -6909 -168 4995 53 5519 -2747 -9521 3135
11373C135N310J085l420j6876j3324J2117p346N731R655m295n956j372M159q199
$$ 3135 8445 9530 6110 -10766 -24090 -11973 -19319 -13588 -3933 -8228 -14184 -15556 -11397 -19596
11359a9596J2971J5650K825J92j1974m713m287j175m164j1412q362N591M330O671
$$ -19596 -6625 9025 11850 12042 68 -4645 -8932 -10107 -14271 -25683 -34045 -28454 -24124 -17453
11345a7453j627j2645l724J929L794M010Q124L828J6436P883o978j1323o458k945
$$ -17453 -19080 -31725 -35449 -33520 -29726 -25716 -17592 -13764 2672 10555 3577 -7746 -14204 -17149
11331a7149J271j0330p697M513R235O517j792P951J9273o449j7554k003M031j92
$$ -17149 -15878 -26208 -33905 -29392 -20157 -13640 -15432 -7481 11792 5343 -12211 -14214 -10183 -10375
11317a0375j207M965L345J7142j2943o882k263J347Q324n50q066J5271k218r801
$$ -10375 -11582 -6617 -3272 13870 927 -5955 -8218 -6871 1453 903 -7163 8108 5890 -3911
11303c911r65P076L944K34q541r143J4959J666p308q553k141m092L566p038K206
$$ -3911 -4876 2200 6144 6378 -2163 -11306 3653 5319 -1989 -10542 -12683 -16775 -13209 -20247 -18041
11288a8041K241J3528L326M327p127l79O418k876l478n994l988O33O640L814p30
$$ -18041 -15800 -2272 1054 5381 -1746 -2125 4293 1417 -2061 -8055 -12043 -11410 -4770 -956 -1686
11273a686r814j373r00J4397Q345M651j163k894m363k0104p038J0010J912K262
$$ -1686 -11500 -12873 -13773 624 8969 13620 12457 9563 5200 -14904 -21942 -11932 -10020 -7758
11259g758k276Q093Q753j302J971n87q196j4086l114n115M771j467J0224l659
$$ -7758 -10034 -1941 6812 5510 7481 6894 -1302 -15388 -18502 -23617 -18846 -20313 -10089 -13748
11245a3748N151J3288q372R45K2204m484j373M829J612p037L012p097m308J7947
$$ -13748 -8597 4691 -3681 -2736 19468 14984 13611 18440 20052 13015 16027 8930 4622 22569
11231B2569J1638k596o546j1175j4567M37n67r908j228J221l449J4105J1456L6
$$ 22569 34207 31611 25065 13890 -677 -240 -807 -10715 -11943 -10722 -14171 -66 11390 11426
11217A1426k369q982j2515M99k174o335K491J2652L333l048j1332j247J0138R106
$$ 11426 9057 75 -12440 -11941 -14115 -20450 -17959 -5307 -1974 -5022 -16354 -17601 -7463 1643
11203A643P215m718q226o503n757k462J4314J018K965j6530j0701j1056J2275
$$ 1643 8858 4140 -4086 -10589 -16346 -18808 -4494 -3476 -511 -17041 -27742 -38798 -26523
11190b6523N923M542Q591L142L767P744m302q994K747J4320P560P006Q398o916
$$ -26523 -20600 -16058 -7467 -4325 -558 7186 2884 -6110 -3363 10957 18517 25523 33921 27005
11176B7005j4793n671o669o045l290j218q045J5190J0065r444q076l215j313Q260
$$ 27005 12212 6541 -128 -6173 -9463 -10681 -18726 -3536 6529 -2915 -10991 -14206 -15519 -7259
11162g259p060L342K308L633K316J1845O378L224j034q727j0670o697K646P392
$$ -7259 -14319 -10977 -8669 -5036 -2720 9125 15503 18727 17693 8966 -1704 -8401 -5755 1637
11148A637n524K981N668p435j4980K0766k868j5383m618M469K0427J0281O797
$$ 1637 -3887 -906 4762 -2673 -17653 3113 245 -15138 -19756 -15287 5140 15421 22218
11135B2218l632j3663j6166J2321N059j05p605j884K974l300N581L613j1929L360
$$ 22218 18586 4923 -11243 1078 6137 6032 -1573 -3457 -483 -3783 1798 5411 -6518 -3158
11121c158n532p105L244J2046o355p843J42J7277L653k744K889m694k102r57n923
$$ -3158 -8690 -15795 -12551 -505 -6860 -14703 -14561 2716 6369 3625 6514 1820 -282 -1239 -7162
11106g162l689J2783J6825M067j3552m790J3932q503m720J3264K588j5110M44
$$ -7162 -10851 1932 18757 22824 9272 4482 18414 9911 5191 18455 21043 5933 6377
11093F377n958j9065O332K3751k239o073o955o621N744J0321K271M73p928R428
$$ 6377 419 -18646 -12314 11437 9198 3125 -3830 -10451 -4707 5614 7885 8358 430 9858
11079I858j27O74j270j4013o715n490R032P934R579R11j0718N856O209J2922r611
$$ 9858 9731 10405 9135 -4878 -11593 -17083 -8051 -117 9462 10373 -345 5511 11720 24642 15031
11064A5031k922K249j4705j1337N916J033L383j515Q408K150o257j7882M882J237
$$ 15031 12109 14358 -347 -11684 -5768 -4735 -1352 -2867 5541 7691 1434 -16448 -11566 -10329
11050a0329J327Q643J1826M556N613m467J574M179l073l726r541Q821J1815j618
$$ -10329 -9002 -359 11467 16023 21636 17169 18743 22922 19849 16123 6582 15403 27218 25600
11036B5600P734k218R090J3148N969N592J6805o463J792r432K22M131J0653q785
$$ 25600 33334 31116 40206 53354 59323 64915 81720 75257 77049 67617 67839 71970 82623 73838
11022G3838K2611J4957p40j705N243m374k8480r513M151j124q390L566J4303J243
$$ 73838 96449 111406 110666 108961 114204 109830 81350 71837 75988 74864 66474 70040 84343 85586
11008H5586K147q728j1338j1052o681k140o028L160n876o382L606o079l981j160
$$ 85586 87733 79005 67667 56615 49934 47794 41766 44926 39050 32668 36274 30195 26214 25054
10994B5054n660p789L28o05j252L963N371o065n147M561l528l447N444q632m776
$$ 25054 19394 11605 11933 11328 10076 14039 19410 13345 8198 12759 9231 5784 11228 2596 -2180
10979b180l671N872J0028J2614j498k636o738j2488k61J533N143R723n216m241
$$ -2180 -5851 21 10049 22663 21165 18529 11791 -697 -958 575 5718 15441 10225 5984
10965E984q597k975j4208r592L892N327M263K0309j1076l801j079P452J1591N236
$$ 5984 -2613 -5588 -19796 -29388 -25496 -20169 -15906 4403 -6673 -10474 -11553 -4101 7490 12726
10951A2726K925J3529N329p391k3426j7067j22r86P733N35Q983j0882l453K339
$$ 12726 15651 29180 34509 27118 3692 -13375 -13497 -14483 -6750 -6215 2768 -8114 -11567 -9228
10937i228k154L324P950Q68j026J0123j949q657N155o894M658J51j783r429M349
$$ -9228 -11382 -8058 -108 760 -266 9857 7908 -749 4406 -2488 2170 2321 538 -8891 -4542
10922d542k413j2408N479K346L95J5563N005k127j0731q953N571J0264J7775j2482
$$ -4542 -6955 -19363 -13884 -11538 -11143 4420 9425 7298 -3433 -12386 -6815 3449 21224 8742
10908H742j3102J5253L106K33k973n74j8875j3581J4760J6841M658j2673l31k130
$$ 8742 -4360 10893 13999 14232 11259 10685 -8190 -21771 -7011 9830 14488 1815 1484 -646
10894f46j1397l09O332J1752o738o343j0431j2151Q81N364Q29j028P892J920m966
$$ -646 -12043 -12352 -6020 5732 -1006 -7349 -17780 -29931 -29050 -23686 -22857 -23885 -15993 -14073 -19039
10879a9039Q818j080l821O96J6855J7349Q39o972M643j1069o500m10J4328q098
$$ -19039 -10221 -11301 -15122 -14426 2429 19778 20617 13645 18288 7219 719 309 14637 6539
10865F539j9209p623J4296J2934j475m673P573P266N162o86k368r277J288M065
$$ 6539 -12670 -20293 -5997 6937 5462 789 8362 15628 20790 20104 17736 8459 9747 13812
10851A3812J7510M154q085l680r031O940K745j8451m530R011k911L990J7925n786
$$ 13812 31322 35476 27391 23711 14680 21620 24365 5914 1384 10395 7484 11474 29399 23613
10837B3613o515m3o878m432o619P217R067J4290J5600m188r588j2138J132J4215
$$ 23613 17098 17055 10177 5745 -874 6343 15410 29700 45300 41112 31524 19386 20518 34733
10823C4733o076J091r942O383R033j6223j7803M219J3836o14j2282j446J0141
$$ 34733 28657 29748 19806 26189 35222 18999 1196 5415 19251 18637 6355 4909 15050
10810A5050p879Q759q273m543P177M474J494m707q286n115J585o036l866k414
$$ 15050 7171 15930 7657 3114 10291 14765 16259 11552 3266 -1849 -264 -6300 -10166 -12580
10796a2580N860J369p436K005O203j634j4585M611J0076J2960j4775j0403M875
$$ -12580 -6720 -5351 -12787 -10782 -4579 -6213 -20798 -16187 -6111 6849 -7926 -18329 -13454
10783a3454M093Q515P332M526l305J895n294j3440l289j2516o359l678J5211N342
$$ -13454 -9361 -846 6486 11012 7707 9602 4308 -9132 -12421 -24937 -31296 -34974 -19763 -14421
10769a4421l038M31J2380J0141l787p5rM808l938O288M205q017P767k700J432
$$ -14421 -17459 -17028 -4648 5493 1706 1631 1622 6430 2492 8780 12985 4968 12735 10035 11467
10754A1467J918O723J7439M882k985o441n609r935m56J0894j0096J721R009j643
$$ 11467 13385 20108 37547 42429 39444 33003 27394 17459 17003 27897 17801 19522 28531 26888
10740B6888j9751L019K667j5816o712R431K223L239J2380J659m740r651N398J612
$$ 26888 7137 10156 12823 -2993 -9705 -274 1949 5188 17568 19227 14487 4836 10234 11846
10726A1846J3888k27r389R820J2315M36n315O106j0658j3904q453L425K474O06
$$ 11846 25734 25507 16118 25938 38253 38689 33374 39480 28822 14918 6465 9890 12364 12970
10712A2970J171Q779J099N903j7078K902L959J1415O607n28j114P964p210P921
$$ 12970 14141 22920 24019 29922 12844 15746 19705 31120 37727 37199 36085 44049 36839 44760
10698D4760J0372o013p154J6921n525o927M369Q452j1020j011j796o085R668O238
$$ 44760 55132 49119 41965 58886 53361 46434 50803 59255 48235 47224 45428 39343 49011 55249
10684E5249k052k676q264j389P390P039P949j2966n973K1492L332r968R056Q266
$$ 55249 53197 50521 42257 40868 48258 55297 63246 50280 44307 65799 69131 59163 68219 76485
10670G6485q308K154P251R998P776J4430J651R839k896n531R33J5756J192L701
$$ 76485 68177 70331 77582 87580 95356 109786 111437 121276 118380 112849 113782 129538 130730 134431
10656A34431J7525J9703K6408M3587K4028k0432k8334k0932q717L64N544j0271
$$ 134431 151956 171659 198067 241654 265682 245250 216916 195984 187267 187631 193175 182904
10644A82904o033Q444J7076N317O493J0395N902K1689Q317K6642K3726J8024K7955
$$ 182904 176871 185315 202391 207708 214201 224596 230498 252187 260504 287146 310872 328896 356851
10631C56851M4393L4866J4397L7097N7559O3999P5068R2270J29334J71241K15596
$$ 356851 401244 436110 450507 487604 545163 609162 684230 776500 905834 1077075 1292671
10620A292671L02431L81999N00925O49973P75599Q21535O93170M08184J15612
$$ 1292671 1595102 1977101 2478026 3127999 3903598 4725133 5418303 5826487 5942099
10611E942099n2216p5285J6260J96750M72297P87650J144732J451688J538552
$$ 5942099 5889883 5814598 5830858 6027608 6499905 7287555 8432287 9883975 11422527
10602A1422527J215406M53464l08644o74807o68737m48757p7635L98003R00303
$$ 11422527 12637933 13091397 12782753 12107946 11439209 10990452 10912817 11310820 12211123
10593A2211123J404364J788365J812423J185996k0100j100261j562055j513933
$$ 12211123 13615487 15403852 17216275 18402271 18382171 17281910 15719855 14205922
10585A4205922j232081q25218l61360J25589N57518Q17696Q10956L20042m99647
$$ 14205922 12973841 12148623 11787263 11912852 12470370 13288066 14099022 14419064 13919417
10576A3919417j163256j387750j292642j058978p58071m63159k13468m689J12627
$$ 13919417 12756161 11368411 10075769 9016791 8258720 7795561 7582093 7577404 7690031
10567G690031O9959j35518m37131o65006p70461p28041o41727n22188m23472l32854
$$ 7690031 7759990 7624472 7187341 6522335 5751874 5023833 4382106 3859918 3436446 3103592
10557C103592k67359k19827j94717j58914j17182j01276r8773q1670o8294o7783
$$ 3103592 2836233 2616406 2421689 2262775 2145593 2044317 1945544 1863874 1795580 1727797
10547A727797p0968n9045o8212p8415m9975m7501n7673m2206l8314n2147m6725
$$ 1727797 1656829 1597784 1529572 1451157 1401182 1353681 1296008 1253802 1215488 1163341 1116616
10536A116616m8311m8534l8756m2030n0906m2322k3399k6802m0206l1162k4288
$$ 1116616 1068305 1019771 981015 938985 888079 845757 822358 795556 755350 724188 699900
10525F99900k7462l1468l7483m0304j9282k4781l8559k6338r226k0959k0672j1036
$$ 699900 672438 640970 603487 563183 543901 519120 480561 454223 444997 424038 403366 392330
10513C92330j5888l0884k6906j8618j0310j8559j5457q754p547j3486L55L232
$$ 392330 376442 345558 318652 300034 289724 271165 255708 246954 239407 225921 226276 229508
10501B29508j3085j3121l1534j5795O516K140l317j6735p903L368k009l337j2988
$$ 229508 216423 203302 171768 155973 162489 164629 161312 144577 136674 140042 138033 134696 121708
10488A21708r814Q06o485J4280N44r821m286p818o280n965j084O697L031K748
$$ 121708 111894 112700 106215 120495 121039 111218 106932 99114 92834 86869 85785 92482 95513 98261
10474I8261O815m540k526M018l318M945o655j0898J086m71L669j714j2399j3201
$$ 98261 105076 100536 98010 102028 98710 103655 97000 86102 87188 86717 90386 88672 76273 63072
10460F3072j2068l558l454j7299m758K808J2646O449r653m036R354O515J1953
$$ 63072 51004 47446 43992 26693 21935 24743 37389 43838 34185 30149 39503 46018 57971
10447E7971q183j4015n373J9739J278j2102p796k619L00q665O600M348k613q924
$$ 57971 49788 35773 30400 50139 51417 39315 31519 28900 29200 20535 27135 31483 28870 19946
10433A9946p64J7158J2760K191O431j594j0293p190K797l577L496k828O555M458
$$ 19946 19182 36340 49100 51291 57722 56128 45835 38645 41442 37865 41361 38533 45088 49546
10419D9546M309M090K267l820o767J765n761j0401Q159q799J3012Q310n446j4268
$$ 49546 53855 57945 60212 56392 49625 51390 45629 35228 43387 34588 47600 55910 50464 36196
10405C6196p46J8310Q803N308R07q64N31m505j0983K080J1364J325n231m832j5098
$$ 36196 35450 53760 62563 67871 68778 67914 68445 63940 52957 55037 66401 67726 62495 57663 42565
10390D2565j2393J3585R764J0629l616j3740m266K626k156M005j5793j036J8770
$$ 42565 30172 43757 53521 64150 60534 46794 42528 45154 42998 47003 31210 30174 48944
10377D8944Q754o197j2878m522L489M786M29J1078l136k917j0911n701l515J2654
$$ 48944 57698 51501 38623 34101 37590 42376 42805 53883 50747 47830 36919 31218 27703 40357
10363D0357K886m215l046k0157j9075P339J5137J669Q377p988n229J595O53n912
$$ 40357 43243 39028 35982 15825 -3250 4089 19226 20895 29272 21284 16055 17650 18303 12391
10349A2391J306J6672m918k197m195r025j5994N862J2503K796n246O483R817R929
$$ 12391 13697 30369 25451 23254 19059 10034 -5960 -98 12405 15201 9955 16438 26255 36184
10335C6184o534j9238l357J3341N759P529R209L648j0450p787o214K928j084J025
$$ 36184 29650 10412 7055 20396 26155 33684 42893 46541 36091 28304 22090 25018 23934 24959
10321B4959J178q991j4629m21K719M965n827l123N809P248P751j897O571n309
$$ 24959 26137 17146 2517 2096 4815 9780 3953 830 6639 13887 21638 19741 26312 21003
10307B1003j3849l55R672K319J249n370k405J343K0774l99j5097j2516M658J0611
$$ 21003 7154 6799 16471 18790 20039 14669 12264 13607 34381 33982 18885 6369 11027 21638
10293B1638o373j6211R481L821j3827j42O483J5653J3200P044m763p419o619l528
$$ 21638 15265 -946 8535 12356 -1471 -1613 4870 20523 33723 40767 36004 28585 21966 18438
10279A8438J4694Q269q653r116p134n322j462l246j1307l259J9523J6389M004
$$ 18438 33132 41401 32748 23632 16498 11176 9714 6468 -4839 -8098 11425 27814 31818
10266C1818R224j7064j6655j363J1101J5736l579N45l864Q172o823j0343L726
$$ 31818 41042 23978 7323 5960 17061 32797 29218 29763 25899 34071 27248 16905 20631
10253B0631m809k802j030Q575K592m232L330j2808K132M996r940k162Q267J1834
$$ 20631 15822 13020 11990 20565 23157 18925 22255 9447 11579 16575 6635 4473 12740 24574
10239B4574O151O725M486k5514j521M420r20J718M112J041K7J4884M379j689r525
$$ 24574 30725 37450 41936 16422 14901 19321 18401 20119 24231 25272 25299 40183 44562 42873 33348
10224C3348l740P936K299r513n23o739k979q489K750N16M401J293K120N172m151
$$ 33348 29608 37544 39843 30330 29807 23068 20089 11600 14350 14866 19267 20560 22680 27852 23701
10209B3701O798m305J1164Q952o492o525j3669q525O7j755M317M077K183n643
$$ 23701 30499 26194 37358 46310 39818 33293 19624 11099 11166 9411 13728 17805 19988 14345
10195A4345P239P679j838j293l149J2217k482q246o460K410N070j561J002J2140
$$ 14345 21584 29263 27425 26132 22983 35200 32718 24472 18012 20422 25492 23931 24933 37073
10181C7073q980M010J1157M210m103N023P930N342J355O638j441J395j439Q945
$$ 37073 28093 32103 43260 47470 43367 48390 56320 61662 63017 69655 68214 69609 68170 77115
10167G7115J1560J7441J1304Q532o307q645k2648j0793K223n990L436P669J3148
$$ 77115 88675 106116 117420 125952 119645 111000 88352 77559 79782 73792 77228 84897 98045
10154I8045K2095J0210m379j2820p167qp808j9052p466M167M922j6593J441J0907
$$ 98045 120140 130350 125971 113151 105984 105976 98168 79116 71650 75817 80739 64146 65587 76494
10140G6494M394j4072j6716o862P016J2448k264l976M815J658p550K290L93j1032
$$ 76494 80888 66816 50100 43238 50254 62702 60438 56462 61277 62935 55385 57675 58068 47036
10126D7036j0256M734N48k822k966J61n877o768M245k74P434K886o879k366J3963
$$ 47036 36780 41514 42062 39240 36274 36435 30558 23790 28035 27761 35195 38081 31202 28836 42799
10111D2799K645n302k224j653j008L973J7157R751q612o046n354j2868P119k133
$$ 42799 45444 40142 37918 36265 35257 39230 56387 66138 57526 51480 46126 33258 40377 38244
10097C8244m782Q54J086l378r365k857j3015J003Q160K252N595J3166l03r723
$$ 38244 33462 34316 35402 32024 22659 19802 6787 7790 15950 18202 23797 36963 36660 26937
10083B6937k997N44L393N972m005P113j3759j65r929N733N741J2670L939K903
$$ 26937 23940 24484 27877 33849 29844 36957 23198 23033 13104 18837 24578 37248 41187 44090
10069D4090j0744j2663k496M735J092j0653j0800o67K375j728Q002n388p894J3413
$$ 44090 33346 20683 18187 22922 24014 13361 2561 1894 4269 2541 10543 5155 -2739 10674
10055A0674O160M587Q732l865M123j183k858M109j553N861k987K780k730r284
$$ 10674 16834 21421 30153 26288 30411 29228 26370 30479 28926 34787 31800 34580 31850 22566
10041B2566R788J51j1480L880J438J0114p175n903K060n497l33J8431Q028l455
$$ 22566 32354 32505 21025 24905 26343 36457 29282 23379 25439 19942 19609 38040 46068 42613
10027D2613m845K873M069j2298j756M133o563o661N566q953j4988M130J3303k374
$$ 42613 37768 40641 44710 32412 30656 34789 28226 21565 27131 18178 3190 7320 20623 18249
10013A8249p942q81l293O507J3759m77K133j0792o588K474R563Q16q232J2908
$$ 18249 10307 9426 6133 12640 26399 25922 28055 17263 10675 13149 22712 23528 15296 28204
9999B8204n42j4834r87m635K525J925R22K304J128k802r913J0362J4707J2090
$$ 28204 27662 12828 11841 7206 9731 11656 12578 14882 16010 13208 3295 13657 28364 40454
9985D0454o576j085P494j3956p907P626Q298r387p650N828l904q550Q21O758p302
$$ 40454 33878 32793 40287 26331 18424 26050 34348 24961 17311 23139 19235 10685 11506 18264 10962
9970A0962Q354Q175O116j2584o741L818O123J728K062l317r88r090p432L112l815
$$ 10962 19316 27491 33607 21023 14282 18100 24223 25951 28013 24696 23708 14618 7186 10298 6483
9955F483M910M84N381K016K240o035m240l13P092J3899J1338m244o682J1073J1359
$$ 6483 11393 11877 17258 19274 21514 15479 11239 10926 18018 31917 43255 39011 32329 43402 54761
9940E4761o982J351n244j8705j3263k233n17J2121j310n948Q552m803k0161J744
$$ 54761 47779 49130 43886 25181 11918 9685 9168 21289 19979 14031 22583 17780 -2381 -637
9926f37O838r0Q555P908j4671l485O272O324N395J3181J1330o668L342j4169j5752
$$ -637 6201 6111 14666 22574 7903 4418 10690 17014 22409 35590 46920 40252 43594 29425 13673
9911A3673N801J6708r14r779j6302j4629l340k607R622R735P576L16l677P665
$$ 13673 19474 36182 35268 25489 9187 -5442 -8782 -11389 -1767 7968 15544 15860 12183 19848
9897A9848O765K868n159l426j2676p871j662J1331R281N161M211N124k0679p516
$$ 19848 26613 29481 24322 20896 8220 349 -1313 10018 19299 24460 28671 33795 13116 5600
9883E600Q581K303j620J840O610r425l963j2670k297L416O172J1534K799J204
$$ 5600 14181 16484 14864 16704 23314 13889 9926 -2744 -5041 -1625 4547 16081 18880 20084
9869B0084J210j78m842k525K981N28m66p74J4478K858j0648j0910k27J0484J2638
$$ 20084 21294 21116 16274 13749 16730 17258 16792 16018 30496 33354 22706 11796 11569 22053 34691
9854C4691m603n933p903k337k083P535N743m165j245J058J498j7563q468k717
$$ 34691 30088 24155 16252 13915 11832 19367 25110 20945 19700 20758 22256 4693 -3775 -6492
9840f492L942J614J1653J0421O200K065l636J6925M666n007J124J139j408l881
$$ -6492 -2550 -936 10717 21138 27338 29403 25767 42692 47358 42351 43475 44614 43206 39325
9826C9325Q204j2056n489K654m835M42R722J3421p071o159N989P693M110O31N826
$$ 39325 47529 35473 29984 32638 27803 28245 37967 51388 44317 38158 44147 51840 55950 56581 62407
9811F2407l485m755k257j325n252P513J8157J2837p526l966Q281j0333j1133l270
$$ 62407 58922 54167 51910 50585 45333 52846 71003 83840 76314 72348 80629 70296 59163 55893
9797E5893j0509j4570k115M318j904J9065J1378J778N119J822J2390K0170Q907
$$ 55893 45384 30814 28699 33017 31113 50178 61556 63334 68453 70275 82665 102835 111742
9784A11742l515O196j508k0494n412l160N981J5613J1690J2307K1073L6741N1068
$$ 111742 108227 114423 112915 92421 87009 83849 89830 105443 117133 129440 150513 187254 238322
9771B38322Q4505J25202J64158J44024K9575q7421j15142r7900p8529o2189l6017
$$ 238322 322827 448029 612187 756211 785786 698365 583223 485323 406794 344605 308588
9760C08588m4187k3045j2922j6303p445j5572p577L491j218N273l326m604j2686
$$ 308588 264401 241356 228434 212131 204686 189114 181537 185028 183810 189083 185757 181153 168467
9747A68467k781j2500l210l57o883j2232q194P895n848k346j0571j9347p363O951
$$ 168467 165686 153186 149976 149619 142736 130504 122310 130205 124357 122011 111440 92093 84730 91681
9733I1681o472q281J863N784Q888L852N329L824l226N819l613P685k960r249N333
$$ 91681 85209 76928 78791 84575 93463 97315 102644 106468 103242 109061 105448 113133 110173 100924 106257
9718A06257Q556O947n091L214K1972L784n289P925o60l160K11j3508n452J32K52
$$ 106257 114813 121760 116669 119883 141855 145639 140350 148275 147615 144455 144666 131158 125706 125838 126090
9703A26090j2306m725l488J74K035J0346K653L250p88k311O594R115J1544K2688
$$ 126090 113784 109059 105571 105745 107780 118126 120779 124029 123241 120930 127524 136639 148183 170871
9689A70871J549M633J0670r124j1969l048J844O897Q229M061j848p389q512o3
$$ 170871 172420 177053 187723 178599 166630 163582 165426 172323 180552 184613 182765 175376 166864 166801
9675A66801l50k4961j9372o14n870n24J0597r80o806j5394Q422N212l540j2153
$$ 166801 166451 141490 122118 121504 115634 115110 125707 124727 117921 102527 110949 116161 112621 100468
9661A00468r57N348J644k288m314j1349m790R237J1549q713R284L589N88o176
$$ 100468 99511 104859 106503 104215 99901 88552 83762 92999 104548 95835 105119 108708 109296 103120
9647A03120L996k933j7798k731l27J2174P243Q402L324K777O22Q707J5937J2723
$$ 103120 107116 104183 86385 83654 83327 95501 102744 111146 114470 117247 117869 126576 142513 155236
9633A55236k672O418k177m441l836n22j3657m564J1809n267j5328J539L364o956
$$ 155236 152564 158982 156805 152364 148528 148006 134349 129785 141594 136327 120999 122538 125902 118946
9619A18946L13l225j868O255L996J96k724K151p132J6395P724J97L333M41o052
$$ 118946 119259 116034 114166 120421 124417 124613 121889 124040 116908 133303 141027 141224 144557 144998 138946
9604A38946j919o055j775L868N675O438J4246M819n6J0296N971P79Q74J4055J0279
$$ 138946 137027 130972 129197 133065 138740 145178 159424 164243 164187 174483 180454 181233 182107 196162 206441
9589B06441K4050K3920K8526K4702K1362J9999M2628N5563M9949N0480O8686Q6011
$$ 206441 230491 254411 282937 307639 329001 349000 391628 447191 497140 547620 616306 702317
9577G02317J12902J23899J34842J22819J15024R0940N6226L4323J1465k3422o6075
$$ 702317 815219 939118 1073960 1196779 1311803 1402743 1458969 1493292 1504757 1481335 1415260
9566A415260j11021j15783j07843r9585r3720q2086o7988o3852n3085n3898m9362
$$ 1415260 1304239 1188456 1080613 981028 887308 805222 737234 673382 620297 566399 517037
9555E17037m9097l0721j7637k2997m7615j9449q664j4411j4411n526j4701j5079
$$ 517037 467940 437219 419582 396585 348970 329521 320857 306446 292035 286509 271808 256729
9543B56729l260q245k508j878j4361j4576m482K294k720r334j3768p808Q263O19
$$ 256729 253469 245224 242716 240838 226477 211901 207419 209713 206993 197659 183891 176083 184346 184965
9529A84965j104M764j6120r11j3478J703J1321K60j3647j2627M311N569K087n440
$$ 184965 183861 188625 172505 171594 158116 159819 171140 171400 157753 145126 149437 155006 157093 151653
9515A51653j933j6912j3792j974N39k926K044q428O515K796J764j3750o469J864
$$ 151653 149720 132808 119016 117042 117581 114655 116699 108271 114786 117582 119346 105596 99127 100991
9501A00991L749R762J5941L660r252p559p963O539R449N417r144L396n594o530
$$ 100991 104740 114502 130443 134103 124851 117292 109329 115868 125317 130734 121590 124986 119392 112862
9487A12862M93q682n141J5463k711o631m67r686J7556J6132j5412j5182L277o053
$$ 112862 113355 104673 99532 114995 112284 105653 105186 95500 113056 129188 113776 98594 101871 95818
9473I5818o249j2729k517J0965L2380K5312J128k722L959j1279j2146p824N425
$$ 95818 89569 76840 74323 85288 117668 142980 144108 141386 145345 134066 121920 114096 119521
9460A19521O51p065J57J5638m465j2363q59k394O507Q047O058j324l908j5126
$$ 119521 120172 113107 113264 128902 124437 112074 111215 108821 115328 123375 129433 128109 124201 109075
9446A09075O653J7657J3643J9214K1951K0846R568K879O511O059K3637K9194K8497
$$ 109075 115728 133385 147028 166242 188193 209039 218607 221486 227997 234056 257693 286887 315384
9433C15384K6514K1659J8263L3262J9088O639J0329N212q062k6417p589j21p770
$$ 315384 341898 363557 381820 415082 434170 440809 451138 456350 448288 421871 414282 414161 406391
9420D06391j2526j7553k7512j6283j6004j5399l564R47p751j4825k6811j6072
$$ 406391 393865 376312 348800 332517 316513 301114 297550 298497 290746 275921 249110 233038
9408B33038j5779j4106o586m236Q633K185r605j0399M166Q846N565j1944j4150
$$ 233038 217259 203153 196567 192331 200964 203149 193544 183145 187311 196157 201722 189778 175628
9395A75628k348P693P562J837N109N206M224N250m636N248K989o373j0110l264
$$ 175628 173280 180973 188535 190372 195481 200687 204911 210161 205525 210773 213762 207389 197279 194015
9381A94015m61j675Q745M333Q820R248O253n446o493j4215k04r896j8223l826
$$ 194015 193554 191879 200624 204957 213777 223025 229278 223832 217339 203124 202920 193024 174801 170975
9367A70975q511p08J73M462P83r273j1167n393k556q127l952R807J21O309J2620
$$ 170975 162464 161756 161929 166391 167174 157901 146734 141341 138785 130658 126706 136513 136634 142943 155563
9352A55563L1421K8064J1980J0289M600m541q04O11J4340J6137p60O797q755j6461
$$ 155563 186984 215048 227028 237317 241917 237376 236572 237183 251523 267660 266900 273697 264942 248481
9338B48481p908P179J309r872l44J2583M195K556J5170O047J5728J5302J3559
$$ 248481 240573 247752 249061 239189 238845 251428 255623 258179 273349 279396 295124 310426 323985
9325C23985L0807K9183K1009K233J1004R547J541n561r272n543J4523R707Q781
$$ 323985 354792 383975 404984 407217 418221 427768 429309 423748 414476 408933 423456 433163 441944
9312D41944J4246J6257J7140K1746K6147K9807L8068K5901K4334J5716J6385K0585
$$ 441944 456190 472447 489587 511333 537480 567287 605355 631256 655590 671306 687691 708276
9300G08276K43j0613j6061k7599k2918J604M591p618j312j2758K766Q853r950
$$ 708276 708519 697906 681845 654246 631328 632932 637523 629905 628593 615835 618601 627454 617504
9287F17504j0506m34J2599o691j512J8900J2835K069n476L184J4776J8290J7023
$$ 617504 606998 606564 619163 612472 610960 629860 642695 644764 639288 642472 657248 675538 692561
9274F92561K6969L3680J4769J4448L1143M4827L8530L0341L1553L9518M7060L0723
$$ 692561 719530 753210 767979 782427 813570 858397 896927 927268 958821 998339 1045399 1076122
9262A076122L0828L0805L9168L8623L0740M3073N2998L7377L1081L8561N4299
$$ 1076122 1106950 1137755 1176923 1215546 1246286 1289359 1342357 1379734 1410815 1449376 1503675
9251A503675M8691L5586M9060O0749N7709L9280N3039N2301O0080M3309L8414
$$ 1503675 1552366 1587952 1637012 1697761 1755470 1794750 1847789 1900090 1960170 2003479 2041893
9240B041893M8118O5446M8511L4383N4546O1733M8601M4850M3646N2223N4452
$$ 2041893 2090011 2155457 2203968 2238351 2292897 2354630 2403231 2448081 2491727 2543950 2598402
9229B598402M9137O6240P4948O2954P0493Q1137Q6016J02603J04993J15870J29149
$$ 2598402 2647539 2713779 2788727 2851681 2922174 3003311 3089327 3191930 3296923 3412793 3541942
9218C541942J29647J51695J69133J65169J78465K05784K15575K24717K47118K72420
$$ 3541942 3671589 3823284 3992417 4157586 4336051 4541835 4757410 4982127 5229245 5501665
9208E501665L07720L47730L55694L60327M05716M40538M85332N62695O25125O96586
$$ 5501665 5809385 6157115 6512809 6873136 7278852 7719390 8204722 8767417 9392542 10089128
9198A0089128P89145Q93969J019164J160201J310992J489505J705917J931170
$$ 10089128 10878273 11772242 12791406 13951607 15262599 16752104 18458021 20389191
9190B0389191K216803K553642K984291L498281M110554M797471N625323O627805
$$ 20389191 22605994 25159636 28143927 31642208 35752762 40550233 46175556 52803361
9182E2803361P978743R882850J2549883J6238297K1179356K7630829L5438684
$$ 52803361 60782104 70664954 83214837 99453134 120632490 148263319 183702003
9175A83702003M3488534M9296399M8378558L4730883P895437k0057936l6673576
$$ 183702003 227190537 276486936 324865494 359596377 367491814 347433878 310760302
9168C10760302m1899841m0739341l6299360l0501918k4739244j9691349j5604855
$$ 310760302 268860461 228121120 191821760 161319842 136580598 116889249 101284394
9161A01284394j2436291r983640q133285o774182n763753n026520m399923l827972
$$ 101284394 88848103 78864463 70731178 63956996 58193243 53166723 48766800 44938828
9153D4938828l328080k868133k457034k093545j805107j533572j309655j136566
$$ 44938828 41610748 38742615 36285581 34192036 32386929 30853357 29543702 28407136
9145B8407136r82385q64655p60266o82234n99511n40721m85338m23422l91278
$$ 28407136 27424751 26560096 25799830 25117596 24518085 23977364 23492026 23068604 22677326
9136B2677326l73775l92417m78111n86637o77729p64065q15919q25503q18842
$$ 22677326 22303551 21911134 21433023 20846386 20168657 19404592 18588673 17763170 16944328
9127A6944328p89408p64349p29283o95060o54519o16856n88230n52597n04329
$$ 16944328 16154920 15390571 14661288 13966228 13311709 12694853 12106623 11554026 11049697
9118A1049697m84002m81330m67266m49472m26256l98341l71822l58454l35390
$$ 11049697 10565695 10084365 9617099 9167627 8741371 8343030 7971208 7612754 7277364
9109G277364l23195k98910k71718k56925k47635k29724k31822k23143k12578j98256
$$ 7277364 6954169 6655259 6383541 6126616 5878981 5649257 5417435 5194292 4981714 4783458
9099D783458j98197j83879j64812j51080j49647j40121j46558j37237j23595j21572
$$ 4783458 4585261 4401382 4236570 4085490 3935843 3795722 3649164 3511927 3388332 3266760
9089C266760j03312j08368j06600j06391j09216r1028r2788q6211p5520p8493
$$ 3266760 3163448 3055080 2948480 2842089 2732873 2641845 2549057 2462846 2387326 2308833
9079B308833o4984o7387p8625p5913m6971m0755m5841k8924l6773m7578o1405
$$ 2308833 2243849 2176462 2097837 2021924 1974953 1934198 1888357 1859433 1822660 1775082 1713677
9068A713677n2521n7284m6382m0699l9639m1216k1667j7132k2062q822p633k083
$$ 1713677 1661156 1603872 1557490 1516791 1477152 1435936 1414269 1397137 1375075 1366253 1358620 1356537
9056A356537J5666Q654J211R400K1306J8909K4152K9123R670p796l1266m8813
$$ 1356537 1372203 1380857 1382068 1391468 1412774 1431683 1455835 1484958 1494628 1486832 1455566 1406753
9044A406753p0537n6364o5781o8078o3112n3165k6707k9472m1547m3517l8647
$$ 1406753 1336216 1279852 1214071 1145993 1082881 1029716 1003009 973537 931990 888473 849826
9033H49826l5176k4613l7757k5088j5533j7325j2634r770l0531k0428j7013j6183
$$ 849826 814650 790037 752280 727192 711659 694334 681700 671930 641399 620971 603958 587775
9021E87775J646J3056J2740K0421K8641K5140L8804M7144L9647K0875K1886K5365
$$ 587775 589421 602477 615217 635638 664279 689419 728223 775367 815014 835889 857775 883140
9009H83140L2567K6589J5309K1588J7897K1444J8234J8473K2919L2472K8652L379
$$ 883140 915707 942296 957605 979193 997090 1018534 1036768 1055241 1078160 1110632 1139284 1142663
8997A142663K0498R297R710J0326n696m654J3409J9290N041J1884K0880J153q21
$$ 1142663 1163161 1172458 1182168 1192494 1186798 1182144 1195553 1214843 1219884 1231768 1252648 1253801 1252980
8984A252980j0782j4053k2741k3703j7520Q327m843n222k141j477J099q627l4899
$$ 1252980 1242198 1228145 1205404 1181701 1164181 1172508 1167665 1162443 1160302 1158825 1159924 1151297 1116398
8971A116398k4812k6115l1670k2937j8066k7026j2745k0877j4553j2710j9566
$$ 1116398 1091586 1065471 1033801 1010864 992798 965772 953027 932150 917597 904887 885321
8960H85321j2782J163n424k8957k8234P599k980r666j4796k268j6556p80O48p983
$$ 885321 872539 873702 868278 839321 811087 818686 815706 806040 791244 788976 772420 771640 772288 764305
8946G64305j1381M30J0914J0635r781j2327j2552j5044p810j6334j4225p92k672
$$ 764305 752924 753354 764268 774903 765122 752795 740243 725199 717389 701055 686830 686038 683366
8933F83366M87L010m685l872l205N632j744J0013J5063r308r780j0148j1961q787
$$ 683366 683853 686863 682178 678306 675101 680733 678989 689002 704065 694757 684977 674829 662868 654081
8919F54081k494o601p629j5948m594o441j4583j1567q987N082q343j5421k1114
$$ 654081 651587 644986 637357 621409 616815 610374 595791 584224 575237 580319 571976 556555 535441
8906E35441q492k205j1614k5618j9341n422m940m316q68m657k0590j5657J267
$$ 535441 526949 524744 513130 487512 468171 462749 457809 453493 452625 447968 427378 411721 412988
8893D12988r15p821J250J0555l94J117j713N019K765O807o72J4560J1479J3514
$$ 412988 412073 404252 405502 416057 415663 416780 415067 420086 422851 429658 428986 443546 455025 468539
8879D68539J0296O231J4800j439J0775K1536J7704K426J775K5454K9286K0545
$$ 468539 478835 485066 499866 498427 509202 530738 548442 550868 552643 578097 607383 627928
8867F27928L4956L5380K7286K7694L2444L1833J9093J9752L8576L0835J9971M3835
$$ 627928 662884 698264 725550 753244 785688 817521 836614 856366 894942 925777 945748 989583
8855I89583K6276J7302L4779M5930O7505P2969R7067J16724J24555Q2416K5690
$$ 989583 1015859 1033161 1067940 1113870 1181375 1254344 1351411 1468135 1592690 1675106 1700796
8844A700796k3596o2074n5654n4736o6111o7335l5051M665M7911Q2140J25521
$$ 1700796 1677200 1615126 1559472 1504736 1438625 1371290 1336239 1340904 1388815 1470955 1596476
8833A596476J96887K78287L08270K36582N0461j50922k32623k64218k57664k14797
$$ 1596476 1793363 2071650 2379920 2616502 2666963 2516041 2283418 2019200 1761536 1546739
8823A546739j49202j11594q7300n4368n4720m1509m0159n1726n6160l5307j3859
$$ 1546739 1397537 1285943 1198643 1144275 1089555 1048046 1007887 956161 900001 864694 850835
8812H50835r712o442K3334K3953L1854Q924r079m590J2277L3306M8566N8385P6684
$$ 850835 841123 834681 858015 881968 913822 922746 913667 909077 921354 954660 1003226 1061611 1138295
8799A138295J07215J26163J22568J20490J17603J42766J75127K26498K31065J23022
$$ 1138295 1245510 1371673 1494241 1614731 1732334 1875100 2050227 2276725 2507790 2630812
8789B630812p2979k22744k54621k32251j96757j55705j32343q4237m2725j9887
$$ 2630812 2557833 2335089 2080468 1848217 1651460 1495755 1363412 1279175 1236450 1216563
8779A216563N233J1838J5530L4007O4043P1514J01399J16003J21603J15317J07954
$$ 1216563 1221796 1233634 1249164 1283171 1347214 1418728 1520127 1636130 1757733 1873050 1981004
8768A981004Q9961N8211L4317J881p093K593K0143N7929J18036J27067J29851
$$ 1981004 2070965 2129176 2163493 2165374 2158281 2160874 2181017 2238946 2356982 2484049 2613900
8757B613900J17759L8908j28643k37171k64572k25896j75392j63749j54081j11558
$$ 2613900 2731659 2770567 2641924 2404753 2140181 1914285 1738893 1575144 1421063 1309505
8747A309505j13544j00322q6057p8601p9390n3040m6985l4878k0616j9765k0846
$$ 1309505 1195961 1095639 1009582 930981 851591 798551 751566 716688 696072 676307 655461
8736F55461k0187j1215q334k2233j5899q932k2214j9093k3648k7834j1444n306
$$ 655461 635274 624059 615725 593492 577593 568661 546447 527354 503706 475872 464428 459122
8724D59122J859n283n901N667N381j4266O246R260J3542Q585j1129k2675j0494
$$ 459122 460981 455698 449797 455464 460845 446579 452825 462085 475627 484212 473083 450408 439914
8711D39914k6744k0482q363O380l215l081j5474j0665j3412j7008j7277k207q480
$$ 439914 413170 392688 384325 390705 387490 384409 368935 358270 344858 327850 310573 308366 299886
8698B99886o351Q478N698j3932M508j5114j4152k250M40j1212l985j355j828j3868
$$ 299886 293535 302013 307711 293779 298287 283173 269021 266771 267211 255999 252014 250659 248831 234963
8684B34963N124M487l337j5221p131m182N163M484l119r583J853j44M577Q080
$$ 234963 240087 244574 241237 226016 218885 214703 219866 224350 221231 211648 213501 213357 217934 226014
8670B26014N091J0527o546q616m699k346O265k024j495J1675O00o384L70j6989
$$ 226014 231105 241632 235086 226470 221771 219425 225690 223666 222171 233846 234446 228062 228432 211443
8656B11443n719j5298j1104j4661j0197l82K3630J9643J896N564J615j7190q536
$$ 211443 205724 190426 179322 164661 154464 154082 177712 197355 199251 204815 206430 189240 180704
8643A80704K80N858r610j2055J2786L162l828j3568r094J562J395J112M772L983
$$ 180704 180984 186842 177232 165177 177963 181125 177297 163729 154635 156197 157592 158704 163476 167459
8629A67459l7M598P104q842j896J7911P269j3787r555k825n928o577N310m997
$$ 167459 167422 172020 179124 170282 168386 186297 193566 179779 170224 167399 161471 154894 160204 155207
8615A55207J6726L148j8119n174j93O07k880j0595J3165M66r708p31O194O370
$$ 155207 171933 175081 156962 151788 151595 152202 149322 138727 151892 152358 142650 141919 148113 154483
8601A54483O244R185j3116N85J729j3501q813j2418q652j2495L737K0605J0003
$$ 154483 160727 169912 156796 157381 159110 145609 136796 124378 115726 103231 106968 127573 137576
8588A37576J3018J076o700l597J313o271Q089R112j400M568K810O756M714j4841
$$ 137576 150594 151670 144970 141373 142686 136415 144504 153616 152216 156784 159594 166350 171064 156223
8574A56223j5477l219P275J0877m027J1955P463n09J2112K309J0477K450k207
$$ 156223 140746 137527 144802 155679 151652 163607 171070 170561 182673 184982 195459 197909 195702
8561A95702j2834m252K763J3536P309K986j3878q675R198J4120N960k656J641
$$ 195702 182868 178616 181379 194915 202224 205210 191332 182657 191855 205975 211935 209279 210920
8548B10920K4412J3345J0020R421o1R05K2117J2306J2454r282p451K454Q758J1462
$$ 210920 235332 248677 258697 268118 268057 268962 291079 303385 315839 306557 299106 301560 310318 321780
8534C21780m151m147m488k531l302j2925q682m823j754j502n733l015Q432J3119
$$ 321780 317629 313482 308994 306463 303161 290236 281554 276731 274977 273475 267742 264727 273159 286278
8520B86278K6605L3964J3495l1597l3161j9961k0941k3496k6766j7320J666j4385
$$ 286278 312883 346847 360342 328745 295584 275623 254682 231186 204420 187100 188766 174381
8508A74381j4581r657m906m084K879j1339q546r305Q452M954k499K696M473j1599
$$ 174381 159800 150143 145237 141153 144032 132693 124147 114842 123294 128248 125749 128445 132918 121319
8494A21319K531K2788J0938j3655o776r135n321M638P020m53M015M708j0236m476
$$ 121319 123850 146638 157576 143921 137145 128010 122689 127327 134347 133894 137909 142617 132381 127905
8480A27905J6471N383P991L0999N7252Q3166R1426N6227m0735p9583o3383m5091
$$ 127905 144376 149759 157750 188749 246001 329167 420593 476820 436085 356502 293119 248028
8468B48028m7719m3493j6620K029n924m946R15o883r002q102j59J2432Q265p265
$$ 248028 200309 156816 140196 142225 136301 131355 132270 125387 116385 108283 108124 120556 128821 121556
8454A21556J253K326J95R876Q670l440p053j1824j3616R679m163j0934J0315Q922
$$ 121556 122809 125135 125330 135206 143876 140436 133383 121559 107943 117622 113459 102525 112840 121762
8440A21762l737n627o049M936J0810q231K774J1638K9049K3625K3696L6998L6966
$$ 121762 118025 112398 106349 111285 122095 113864 116638 128276 157325 180950 204646 241644 278610
8427B78610j6655l3061k2786k6443k5906j6970o182j9597p157m809Q975j2292
$$ 278610 261955 228894 206108 179665 153759 136789 130607 111010 103853 99044 108019 95727
8415I5727j3730Q355M171k773J1991k71N63j306K006m808R157k365j0136R99O728
$$ 95727 81997 90352 94523 91750 103741 103470 104033 102727 104733 99925 109082 106717 96581 97580 104308
8400A04308l198j1870j7326k469J1699R850Q420j88j0271n438p063m951L096o988
$$ 104308 101110 89240 71914 69445 81144 90994 99414 99226 88955 83517 76454 71503 74599 67611
8386F7611p587L475K182M163l820p605N124K931m322q326j529l015l555J8517
$$ 67611 60024 63499 65681 69844 66024 58419 63543 66474 62152 53826 52297 49282 45727 64244
8372F4244P959p104L244n276L552m440M367K1202j0597r952L161o348r460j140
$$ 64244 72203 65099 68343 63067 66619 62179 66546 87748 77151 67199 70360 64012 54552 53412
8358E3412J4043P53J296m775q496o782n661N758O814J6508N425j0629k0134j971
$$ 53412 67455 68208 69504 64729 56233 49451 43790 49548 56362 72870 78295 67666 47532 45561
8344D5561M929k714J1063P778j894Q16r809m814J291k121P697K69o920K506L078
$$ 45561 50490 47776 58839 66617 64723 65539 55730 50916 52207 50086 57783 58052 51132 53638 56716
8329E6716M00j1207j515N291O410j1644K564n110l04p384m914P695K079Q935P225
$$ 56716 57116 45909 44394 49685 56095 44451 47015 41905 41601 34217 29303 36998 39077 48012 55237
8314E5237r902q178R483L35J6342j460j7275N755O686p774L102n742k114q159
$$ 55237 45335 37157 46640 46975 63317 61857 44582 50337 57023 49249 52351 46609 44495 36336
8300C6336j0203L706J0324L419k510n857k612q92J0408J0193q088q624R974J942
$$ 36336 26133 29839 40163 43582 41072 35215 32603 31711 42119 52312 44224 35600 45574 47516
8286D7516L928O937j390K139P884J0386j0370p160j90q309L420J1063J2021o063
$$ 47516 51444 58381 56991 59130 67014 77400 67030 59870 59680 51371 54791 65854 77875 71812
8272G1812r870n939j393j2266r334P454J1280l46q938K77O78o319K405o376q024
$$ 71812 61942 56003 54610 42344 33010 40464 51744 51398 42460 42737 43415 37096 39501 33125 25101
8257B5101L868J3930K222j3788q433M613P252j8575L951J2548j286N797j00J0901
$$ 25101 28969 42899 45121 31333 22900 27513 34765 16190 20141 32689 31403 37200 37100 48001
8243D8001O621p522k0176n325J8561J5675K160p923j6312j4203N920M868k505
$$ 48001 54622 47100 26924 21599 40160 55835 57995 50072 33760 19557 25477 30345 27840
8230B7840J4511K084m017l343l926j7557L084J5527J182L859Q817m975k0741j0922
$$ 27840 42351 44435 40418 37075 33149 15592 18676 34203 35385 39244 48061 43086 22345 11423
8216A1423O060J5275J0161K954k046O695l191K858j4920j2516K275K822R7N178
$$ 11423 17483 32758 42919 45873 43827 50522 47331 50189 35269 22753 25028 27850 27947 33125
8202C3125R43q450N16N737N150l720j6385q726J911k168M794J5842N292J1961
$$ 33125 34068 25618 26134 31871 37021 33301 16916 8190 10101 7933 12727 28569 33861 45822
8188D5822j2212q113j0096j354R589N561J945j161j1771O920k019l085L329k596
$$ 45822 33610 25497 15401 14047 23636 29197 31142 29981 18210 25130 23111 20026 23355 20759
8174B0759J2350N566r514j2339J2159L757l678J2897r713m506J858Q175O392N565
$$ 20759 33109 38675 29161 16822 28981 32738 29060 41957 32244 27738 29596 37771 44163 49728
8160D9728J750n835n096K303J0735j00J606K584l662j0822j076L281o902n146
$$ 49728 51478 45643 40547 42850 53585 53485 55091 57675 54013 43191 42115 45396 38494 33348
8146C3348o735r846r58J3043L626M804m582j3918R711M325K775Q912L986Q492
$$ 33348 26613 16767 15809 28852 32478 37282 32700 18782 28493 32818 35593 44505 48491 56983
8132E6983r751j6022O948L327o250J120j0787l715J0668O691R681P680k56q21
$$ 56983 47232 31210 38158 41485 35235 36355 25568 21853 32521 39212 48893 56573 56317 55496
8118E5496L971l228k983q212r55J5980Q606J0564J305P107M005j121p9j1659j0994
$$ 55496 59467 56239 53256 45044 44089 60069 68675 79239 80544 87651 91656 90535 90456 78797 67803
8103F7803j4733M812L41j5770m388L617P557j337j6632k718j74Q3N612n004j626
$$ 67803 53070 57882 58223 42453 38065 41682 49239 47902 31270 28552 28378 28461 34073 29069 27443
8088B7443K60K1528K339p941o812p374o314n044L798M610M983n782N381R625J650
$$ 27443 27703 49231 51570 43629 36817 29443 23129 18085 21883 26493 31476 25694 31075 40700 42350
8073D2350M450r291K973L965Q446J2343n302o369n914L701L551q37j1401k325
$$ 42350 46800 37509 40482 44447 52893 65236 59934 53565 47651 51352 54903 54066 42665 40340
8059D0340K4089j382q086m154o312J6034J0933j60Q31j8811j6587J645k026O646
$$ 40340 64429 63047 54961 50807 44495 60529 71462 71302 72133 53322 36735 38380 36354 43000
8045D3000K354J164j921L066M466M169P14J354n647j882k544p635k302K902N408
$$ 43000 45354 46518 44597 47663 52129 56298 57012 58366 52719 50837 48293 40658 38356 41258 46666
8030D6666k605p584j204p30J781j477k139J6845J6371K030r564P280J153l170
$$ 46666 44061 36477 35273 34543 36324 34847 32708 49553 65924 67954 58390 65670 66823 63653
8016F3653N856m070j3236m587j607J2472J4365J5372O490q782Q12k211Q205p375
$$ 63653 69509 65439 52203 47616 46009 58481 72846 88218 94708 85926 86738 84527 92732 85357
8002H5357K980L958m997M089P819J1059k872M666r09j5600L517R375M935j192
$$ 85357 88337 92295 87298 91387 99206 110265 107393 112059 111150 95550 99067 108442 113377 112185
7988A12185j0733j1024r37p688J1414l358j3148k563R930J09K220Q54k220n855
$$ 112185 101452 90428 89491 81803 93217 89859 76711 74148 84078 84187 86407 87261 85041 79186
7974G9186o874j494N620O795k42L445j1268j1501J6647R346J2328P520R116n104
$$ 79186 72312 70818 76438 83233 82991 86436 75168 63667 80314 89660 101988 109508 118624 113520
7960A13520q704K551R523r60J0346J5650l25Q728m5L926q330m933J218j695j976
$$ 113520 104816 107367 116890 115930 126276 141926 141601 150329 150284 154210 145880 140947 142165 140470 138494
7945A38494q155j6124j5423N544J2194j5372j6748l27M319j5449o704K252O486
$$ 138494 130339 114215 98792 104336 116530 101158 84410 84083 88402 72953 66249 68501 74987
7932G4987J4009n067o618M08M37l060J4200N378q793j0153m79k93j5562q45P060
$$ 74987 88996 83929 77311 77719 78156 75096 89296 94674 85881 75728 75249 74956 59394 58549 65609
7917F5609J7667J7130K1665R398l609n712M715l4P868J2826m344k0041m561k0813
$$ 65609 83276 100406 122071 131469 127860 122148 126863 126829 134697 147523 143179 123138 118577 97764
7903I7764m655k255o506m921j3148M052k49j4607j1379K488J0961Q60q618N179
$$ 97764 93109 90854 84348 79427 66279 70331 70082 55475 44096 46584 57545 58405 49787 54966
7889E4966N045l208J3637J372j3994j797Q600J1567O125j4471K803Q26j2422m166
$$ 54966 60011 56803 70440 71812 57818 56021 64621 76188 82313 67842 70645 71471 59049 54883
7875E4883K671m463O435J7148J3258Q756q308j5679o220N151q03k993m003q232
$$ 54883 57554 53091 59526 76674 89932 98688 90380 74701 68481 73632 72829 69836 65833 57601
7861E7601j5517m79M39R0M323O722l181l910P838j003l534p008j2455j501n244
$$ 57601 42084 41605 42044 42134 46457 53179 49998 46088 53926 52923 49389 42381 29926 28425 23181
7846B3181r794K207L003k533R054P601K0443J0584k4528r689J074J0718o429j1316
$$ 23181 13387 15594 18597 16064 25118 32719 53162 63746 39218 29529 30603 41321 34892 23576
7832B3576k514r50k826k698K704J838j29N222j521k977J1207J0642M371j0812
$$ 23576 21062 20112 17286 14588 17292 19130 19001 24223 22702 19725 30932 41574 45945 35133
7818C5133p393j42J2824Q199j244j6356K027K719j8908j5403m39o805K622J4911
$$ 35133 27740 27598 40422 48621 47377 31021 33048 35767 16859 1456 1017 -5788 -3166 11745
7804A1745O001M615J062n148j3850j8181l34J5849J9691j786J738n1J457j2593
$$ 11745 17746 22361 23423 18275 4425 -13756 -14090 1759 21450 19664 21402 21351 22808 10215
7790A0215j6948O240J0022J0927J1993r410q179Q81L344N387Q702Q122k504q682
$$ 10215 -6733 -493 9529 20456 32449 23039 14860 15741 19085 24472 33174 41296 38792 30110
7776C0110P178M942p722k5735o753J7119L406m100J3579l499k1004m071Q288n32
$$ 30110 37288 42230 34508 8773 2020 19139 22545 18445 32024 28525 7521 3450 11738 11206
7762A1206O330L086n761j0049q185N307Q998J0979p50n134p631J1305P506k946
$$ 11206 17536 20622 14861 4812 -3373 1934 10932 21911 21161 16027 8396 19701 27207 24261
7748B4261j043o448L72n17p304J097k848L019N848q875q000M413J716N302j6251
$$ 24261 23218 16770 17142 16625 9321 10418 7570 10589 16437 7562 -438 3975 5691 10993 -5258
7733e258r090K930J2643O141J0683J4675N956n538j4539j0056m016L021o221n526
$$ -5258 -14348 -11418 1225 7366 18049 32724 38680 33142 18603 8547 4531 7552 1331 -4195
7719d195j315R16N113J2017M910k534o413r218l101J024M98N322q49J3527Q533
$$ -4195 -5510 -4594 519 12536 17446 14912 8499 -719 -3820 -2796 -2298 3024 2175 15702 24235
7704B4235N915j0518k0363q96N702N764P532L176m6m293R92r91o091p665j7482
$$ 24235 30150 19632 -731 -1627 4075 9839 17371 20547 20501 16208 17200 16209 10118 2453 -15029
7689a5029n704j221K551J879Q145J4752R87J442k222R74J0584j0944o745O597
$$ -15029 -20733 -21954 -19403 -17524 -9379 5373 6360 7802 5580 6554 17138 6194 -551 6046
7675F046J655K219j171j414q256K673J57J341l64Q573o440j424J0777j3249j3071
$$ 6046 7701 9920 8749 7335 -921 1752 1909 3250 2886 11459 5019 3595 14372 1123 -11948
7660a1948m286P122N018Q806q018j0173p1N384J340K159J487l254j332N965Q032
$$ -11948 -16234 -9112 -4094 4712 -3306 -13479 -13550 -8166 -6826 -4667 -3180 -6434 -7766 -1801 6231
7645F231n978J489o65k134P365l05n328j2011l317K688M506Q204k956J052k717
$$ 6231 253 1742 1077 -1057 6308 6003 675 -11336 -14653 -11965 -7459 745 -2211 -1159 -3876
7630c876j0953oQ475n34L743Q856J145j062q162j0508L320J1309N346J0892q144
$$ -3876 -14829 -14835 -6360 -6894 -3151 5705 6850 5788 -2374 -12882 -9562 1747 7093 17985 9841
7615I841j8061J206J3407r072o639p61J111L139J1465l746j0414J607J3823R656
$$ 9841 -8220 -7014 6393 -2679 -9318 -10079 -8968 -5829 5636 1890 -8524 -6917 6906 16562
7601A6562N534J4894P05j3813j4711j4620j1319q82O329R153J563o41r417L781
$$ 16562 22096 36990 37695 23882 9171 -5449 -16768 -17650 -11321 -2168 -605 -1246 -10663 -6882
7587f882O217Q640O124l440n000L925n778j2573q879p720J2968R891K28P21L150
$$ -6882 -665 7975 14099 10659 5659 9584 3806 -8767 -17646 -25366 -12398 -2507 -2279 -1558 1592
7572A592m696J185n07p91O719N625j0374j075l769J110J0566J2971K961n675r350
$$ 1592 -3104 -1919 -2426 -3217 3502 9127 -1247 -2322 -6091 -4981 5585 18556 21517 15842 6492
7557F492L66K951r804j1469j0280j039J222R857rJ796R663L034Q761j5020p346
$$ 6492 6858 9809 5 -11464 -21744 -22783 -21561 -11704 -11713 -9917 -254 2780 11541 -3479 -10825
7542a0825o19N405j711J270P266J1055K278j4347Q92K666J767q244n203M487J4219
$$ -10825 -11444 -6039 -7750 -6480 786 11841 14119 -228 664 3330 5097 -3147 -8350 -3863 10356
7527A0356p9j3720K556J3600p91p360L513L592o489j4530n715O994J400P008n812
$$ 10356 10277 -3443 -887 12713 11922 4562 8075 11667 5178 -9352 -15067 -8073 -6673 335 -5477
7512e477j4099L975J1418J0637O308m44m794r696k1693j543J4228Q651K704O989
$$ -5477 -19576 -15601 -4183 6454 12762 12318 7524 -2172 -23865 -25408 -11180 -2529 175 7164
7498G164L367R87M014o272o194j2319k935J5010K249l013N804N880O234j3334
$$ 7164 10531 11518 15532 9260 3066 -9253 -12188 2822 5071 2058 7862 13742 19976 6642
7484F642j1294P186l10j0269j927M930k778N740l408j2078J0632J1370J9888l630
$$ 6642 -4652 2534 2224 -8045 -9972 -5042 -7820 -2080 -5488 -17566 -6934 4436 24324 20694
7470B0694o424l463K383P739J0880N968j3158j4815J406k653m692l27N437J2988
$$ 20694 14270 10807 13190 20929 31809 37777 24619 9804 11210 8557 3865 3538 8975 21963
7456B1963j739r844R064Q882q284q440r086k796M360q813N554L470l668j2774
$$ 21963 20224 10380 19444 28326 20042 11602 2516 -280 4080 -4733 821 4291 623 -12151
7442a2151o089J4722J9053J6414o881m303j1044O39J2547j744j0402J024J2062
$$ -12151 -18240 -3518 15535 31949 25068 20765 9721 10360 22907 21163 10761 11785 23847
7429B3847n6K54l83j2409k3254q050J617q17Q389J3920J1156l463P305p412l196
$$ 23847 23791 24045 23662 11253 -12001 -20051 -18434 -19251 -10862 3058 14214 10751 18056 10644 7448
7414G448M720j879j1202r247j0774J3663O591n66n659O830q3M493K950J2070M591
$$ 7448 12168 10289 -913 -10160 -20934 -7271 -680 -1246 -6905 -75 -158 4335 7285 19355 23946
7399B3946j797P781l955j6522j3319j413K770O629J3435j0905N728j1071m807
$$ 23946 22149 29930 25975 9453 -3866 -5279 -2509 4120 17555 6650 12378 1307 -3500
7386c500r572J05Q261P503l572j2405N060Q462J1108O959k547j5390j0665j795
$$ -3500 -13072 -12967 -4706 2797 -775 -13180 -8120 342 11450 18409 15862 472 -10193 -11988
7372a1988R972p74j1026m339J1209M441M511J2297n064O411L843l906k927l244
$$ -11988 -2016 -2790 -13816 -18155 -6946 -2505 2006 14303 9239 15650 19493 15587 12660 9416
7358I416P168n004j1018P557Q052j0538p747l975j608J3540N113j4499j497n518
$$ 9416 16584 11580 562 8119 16171 5633 -2114 -6089 -7697 5843 10956 -3543 -5040 -10558
7344a0558L902J8324J5446L114q974j0173j6707N610O772r54K287n599Q272P064
$$ -10558 -6656 11668 27114 30228 21254 11081 -5626 -16 6756 5802 8089 2490 10762 17826
7330A7826j3423j1345m679O7o322J719M286P187N90L656p25L871q182l33N563
$$ 17826 4403 -6942 -11621 -11554 -17876 -16157 -11871 -4684 -4094 -438 -1163 2708 -5474 -5807 -244
7315b44J0980K1379N66j1678N349K247j4124j2026n164l062J132l899p763K353
$$ -244 10736 32115 32681 21003 26352 28599 14475 2449 -2715 -5777 -4645 -8544 -16307 -13954
7301a3954O7k65J0692k959k831l106k889J414N009J593j0152r928m574O739J4935
$$ -13954 -13887 -14152 -3460 -6419 -9250 -12356 -15245 -13831 -8822 -7229 -17381 -27309 -31883 -25144 -10209
7286a0209K843j480M267J466N766L304k250j7143N113J2209L551l183m254l661
$$ -10209 -7366 -8846 -4579 -3113 2653 5957 3707 -13436 -8323 3886 7437 4254 0 -3661
7272c661O188m13O625j1363j3635l885O634J2034m344J1389J0566p676n175n009
$$ -3661 2527 2114 8739 -2624 -16259 -20144 -13510 -1476 -5820 5569 16135 8459 3284 -1725
7258a725O895R104K697l739q341R692m815j2863J436M744N290p174q07Q221j3624
$$ -1725 5170 14274 16971 13232 4891 14583 9768 -3095 -1659 3085 8375 1201 394 8615 -5009
7243e009j2577R42J1811K3326J3088j3985j1192l23k851j3120n081R649R090l331
$$ -5009 -17586 -16644 -4833 18493 31581 17596 6404 6081 3230 -9890 -14971 -5322 3768 437
7229D37L749N630m903k059N239Q76m083J5571k129m361N553P1r360m197l637K176
$$ 437 4186 9816 4913 2854 8093 8969 4886 20457 18328 13967 19520 19591 10231 6034 2397 4573
7213D573R631J0657O423J835m537j1403j2399l406k011k458p23R26P184M667L223
$$ 4573 14204 24861 31284 33119 28582 17179 4780 1374 -637 -3095 -3818 -2892 4292 8959 12182
7198A2182n778K773j704L34l766j953M416k349J304J0133k101j0955j3119j870
$$ 12182 6404 9177 7473 7807 4041 2088 6504 4155 5459 15592 13491 2536 -10583 -12453
7184a2453J4173J1019r90Q12m304m103j3049n397j084P981K0928m712j2893j2679
$$ -12453 1720 12739 11749 12561 8257 4154 -8895 -14292 -15376 -7395 13533 8821 -4072 -16751
7170a6751n544q691Q94J9988Q613K898J4029n199j6985j6453j076J1962Q326k365
$$ -16751 -22295 -30986 -30092 -10104 -1491 1407 15436 10237 -6748 -23201 -24277 -12315 -3989 -6354
7156f354o465K204J9274M735j2254K034L763Q196m576p651p278J7867j4104q586
$$ -6354 -12819 -10615 8659 13394 1140 3174 6937 15133 10557 2906 -4372 13495 -609 -9195
7142i195R278n60l930k804o664L905R880P660J2178o349n086l639J1122o956r787
$$ -9195 83 -477 -4407 -7211 -13875 -9970 -90 7570 19748 13399 8313 4674 15796 8840 -947
7127i47R034m880n437q736K089J5719Q262K031l036O789j0515k0159K071J2918
$$ -947 8087 3207 -2230 -10966 -8877 6842 15104 17135 14099 20888 10373 -9786 -7715 5203
7113E203K077n818J799q01k233N900J6332j4799q334P537n798n387k0594L98J4945
$$ 5203 7280 1462 3261 2460 227 6127 22459 7660 -674 6863 1065 -4322 -24916 -24518 -9573
7098i573P921L068Q633k483k707l633m243K012r70m013N204L294j110o177J532
$$ -9573 -1652 1416 10049 7566 4859 1226 -3017 -1005 -1975 -5988 -784 2510 1400 -4777 -3245
7083c245j835n246l456m247J0508j052K166Q105k114q20J1306P338j5807o766
$$ -3245 -5080 -10326 -13782 -18029 -7521 -8573 -6407 1698 -416 -1236 10070 17408 1601 -5165
7069e165J1886p29n361j0421M774J759J558l912K08m10J543J3469n372n853M960
$$ -5165 6721 5992 631 -9790 -5016 -3257 -1699 -5611 -5403 -5813 -4270 9199 3827 -2026 2934
7054B934O038j1875n764L255J2729O152j2612m748j1107k999P152N016m430k11
$$ 2934 8972 -2903 -8667 -5412 7317 13469 857 -3891 -14998 -17997 -10845 -5829 -10259 -10470
7040a0470O585l84j712n64j3026m108M600O56O732n372j548R827N897r925P082
$$ -10470 -3885 -4269 -5981 -6545 -19571 -23679 -19079 -18423 -11691 -17063 -18611 -8784 -2887 -12812 -5730
7025e730J1896M763q38p2J607j9633o934q522P35J5227P168M740L488m601j7458
$$ -5730 6166 10929 10091 10019 11626 -8007 -14941 -23463 -22728 -7501 -333 4407 7895 3294 -14164
7010a4164j0043O113R53M142O80J3208L833q533j2079j33j407J2826J6701o088
$$ -14164 -24207 -18094 -17141 -12999 -12319 889 4722 -3811 -15890 -16023 -17430 -4604 12097 6009
6996F009l764J2453l634P889k881n003r101j1351O696L35n812n089j0811P224
$$ 6009 2245 14698 11064 18953 16072 11069 1968 -9383 -2687 -2352 -8164 -13253 -24064 -16840
6982a6840P609m65K470q327j520n60L188J0434M600P443J535k86L96j2222J362
$$ -16840 -9231 -9696 -7226 -15553 -17073 -17633 -14445 -4011 589 8032 9567 9281 9677 -2545 -1183
6967a183j791k354k730J709Q695l464K862m543l379l640lM136O240J1820p190
$$ -1183 -2974 -5328 -8058 -6349 2346 -1118 1744 -2799 -6178 -9818 -9821 -5685 555 12375 5185
6952E185l964m524p325K05q186N239Q088J4915R344n689m363r659N274J4823R52
$$ 5185 1221 -3303 -10628 -10423 -18609 -13370 -5282 9633 18977 13288 8925 -734 4540 19363 20315
6937B0315j454j1410j1160m623M546J0675l462j243q699J994L70p062O132J1842
$$ 20315 18861 7451 -3709 -8332 -3786 6889 3427 2184 -6515 -4521 -4151 -11213 -5081 6761
6923F761P847q000l850N153K497j1624Q291J2682K496m476n289J076j221r438
$$ 6761 14608 6608 2758 7911 10408 -1216 7075 19757 22253 17777 12488 13564 12343 2905
6909B905q97L797j1281J0232J5221j7112m451P852R358O083K042k495j2079m9
$$ 2905 2008 5805 -5476 4756 19977 2865 -1586 6266 15624 21707 23749 21254 9175 9126
6895I126J2886n348j9981l194j061r842R564R110q653P203j259J549l959N157
$$ 9126 22012 16664 -3317 -6511 -7572 -17414 -7850 1260 -7393 -190 -1449 100 -3859 1298
6881A298N381n639M226n588j5441j0075p998L31P30J0469P195q486r927j761J9106
$$ 1298 6679 1040 5266 -322 -15763 -25838 -33836 -33505 -32775 -22306 -15111 -23597 -33524 -35285 -16179
6866a6179J3401R476J402j0346m628j901N382q6K256J6355Q582J98n397j0187
$$ -16179 -2778 6698 8100 -2246 -6874 -8775 -3393 -3479 -1223 15132 23714 23912 18515 8328
6852H328L843J869n652j1823m537Q979M045O481r600j1031L109m61o985P069J3903
$$ 8328 12171 14040 8388 -3435 -7972 1007 5052 11533 1933 -9098 -5989 -6450 -13435 -6366 7537
6837G537J963O979K679R987K511j0786j2854n286o197o12j2270J3265L869K00
$$ 7537 9500 16479 19158 29145 31656 20870 8016 2730 -3467 -4079 -16349 -3084 785 985
6823I85M803p545j6967r579M233J5832R685M659M417k835L562r87J0897N284K688
$$ 985 5788 -1757 -18724 -28303 -24070 -8238 1447 6106 10523 7688 11250 10263 21160 26444 29132
6808B9132M823n278j8542M81O232N377N251p893j1282p976j4439l257K1351J1680
$$ 29132 33955 28677 10135 10616 16848 22225 27476 19583 8301 325 -14114 -17371 3980 15660
6794A5660m081p417L5L379L172o989K454n18P177M147j3708O961q881j3299n119
$$ 15660 11579 4162 4197 7576 10748 3759 6213 5695 12872 17019 3311 10272 1391 -11908 -17027
6779a7027N619P94J1648J1357m315j555Q949Om953j3525o326P978J2100q682j4304
$$ -17027 -11408 -10614 1034 12391 8076 6521 15470 15476 10523 -3002 -9328 -1350 10750 2068 -12236
6764a2236P452J2932J3896K34j0278n301J204n488j1251O924Q786q820r996N841
$$ -12236 -4784 8148 22044 22278 12000 6699 7903 2415 -8836 -1912 6874 -1946 -11942 -6101
6750f101j910j725M27N380o645j282L722J3039k357o042N687N659R393o620j4490
$$ -6101 -8011 -9736 -9309 -3929 -10574 -11856 -8134 4905 2548 -3494 2193 7852 17245 10625 -3865
6735c865Q79K918L464J2626O546k813n465m345j1130p916j0844j0692J50J1702
$$ -3865 -2986 -68 3396 16022 22568 19755 14290 9945 -1185 -9101 -19945 -30637 -30487 -18785
6721a8785J4725J2793J234j6706m698N678l807R220J2899O207J0031r33j3684
$$ -18785 -4060 8733 9967 -6739 -11437 -5759 -9566 -346 12553 18760 28791 27858 14174
6708A4174j4626j813J76J9554M006m976r958q819J4080l658j2612J682N870R72
$$ 14174 -452 -2265 -2089 17465 21471 16495 6537 -2282 11798 8140 -4472 -2790 3080 4052
6694D052n344n307Q76r451j3909Q107R983k366K395q553K194L79N156J1070N34
$$ 4052 -1292 -6599 -5723 -15174 -29083 -20976 -10993 -13359 -10964 -19517 -17323 -16944 -11788 -718 -184
6679a84j4895k559K1185J2810m52N78j2697k038M150J7982O165q580M064o581
$$ -184 -15079 -17638 3547 16357 15905 16483 3786 1748 5898 23880 30045 21465 25529 18948
6665A8948q746j4991m867J2131O076K478N973l964K222L001n548j4765j1197K497
$$ 18948 10202 -4789 -9656 2475 8551 11029 17002 13038 15260 18261 12713 -2052 -13249 -10752
6651a0752N736Q209Q930P302R838k733j1808j7095o555M139N757L621j2969k08
$$ -10752 -5016 3193 12123 19425 29263 26530 14722 -2373 -8928 -4789 968 4589 -8380 -8588
6637h588O083J4879M755q693o84N989Q241p12n144j4653l495l074j1030Q475K2305
$$ -8588 -2505 12374 17129 8436 7752 13741 21982 21270 16126 1473 -2022 -5096 -16126 -7651 14654
6622A4654J3119N329r142p829o409l80q12J3942R439q015m775l764j7744k94P769
$$ 14654 27773 33102 23960 16131 9722 9342 8530 22472 31911 23896 19121 15357 -2387 -2681 5088
6607E088J6413J1439l292j0909k0127M718R996R359p960j0100M191J513R42l496
$$ 5088 21501 32940 29648 18739 -1388 3330 13326 22685 14725 4625 8816 10329 11271 7775
6593G775k310P034n213L851J252k176J0144J7402O420m666K471P10J4978J0977
$$ 7775 5465 12499 7286 11137 12389 10213 20357 37759 44179 39513 41984 42694 57672 68649
6579F8649j5538j3630k586N133k737O169R681J1287M543j2395m989O581l28R16
$$ 68649 53111 39481 36895 42028 39291 45460 55141 66428 70971 58576 53587 60168 59840 60756
6565F0756l586J1569J2806o640j641p077J054Q241Q712M815m883J4375P634K384
$$ 60756 57170 68739 81545 74905 73264 66187 67241 75482 84194 89009 84126 98501 106135 108519
6551A08519R697M743P58J4906Q395m11J5613K1030J2719J7217N798P761O455L211
$$ 108519 118216 122959 123717 138623 147018 146607 162220 183250 195969 213186 218984 226745 233200 236411
6537B36411J0337j1334l631q898j7498j6167j539r685j4557j0062j579J117o885
$$ 236411 246748 235414 231783 222885 205387 189220 187681 177996 163439 153377 151798 152915 146030
6524A46030m41j0427o498j9095n069R905N544k831r248k0143j3589J145n08m799
$$ 146030 145589 135162 128664 109569 104500 114405 119949 117118 107870 87727 74138 75283 74775 69976
6510F9976j5176m679J5525J7596O957K338j2220j0956k1107j6634k233o5K125
$$ 69976 54800 50121 65646 83242 90199 92537 80317 69361 48254 31620 29387 29322 31447
6497C1447J3148J76O049l452j4399m555m935p374j206K0723j843j1414k849j704
$$ 31447 44595 44771 50820 47368 32969 28414 23479 16105 14899 35622 33779 22365 19516 17812
6483A7812J0305P43r514k67J3199J686q797p94J2325m7n421o768r400l747o538
$$ 17812 28117 28860 19346 19079 32278 33964 25167 24373 36698 36651 31230 24462 15062 11315 4777
6468D777J747m811o443Q458J3995L221J0382j85j7351J238p127p71Q045N150J280
$$ 4777 6524 1713 -4730 3728 17723 20944 31326 31141 13790 15028 7901 7130 15175 20325 21605
6453B1605K056L90R09o980j798j326J722j0074M869k945m604J7291K202l010l844
$$ 21605 23661 24051 24960 17980 16182 14856 16578 6504 11373 8428 3824 21115 23317 20307 16463
6438A6463j4638k551K731J3890p670p479L815K644Q994K491k034O934p336n938
$$ 16463 1825 -726 2005 15895 8225 746 4561 7205 16199 18690 16656 23590 16254 10316
6424A0316k108M015M53O987j1074j1599J1196m930p406J47Q792K252j0170j080
$$ 10316 8208 12223 12676 19663 8589 -3010 8186 3256 -4150 -4003 4789 7041 -3129 -4209
6410d209O691K791K671j0751o771K730J823o883Q457P748P90m327M890l613R584
$$ -4209 2482 5273 7944 -2807 -9578 -6848 -5025 -11908 -3451 4297 5087 760 5650 2037 11621
6395A1621q020j9300J6671R190j7097R36J1078R076M533L593L06J640r374J604
$$ 11621 3601 -15699 972 10162 -6935 -5999 5079 14155 18688 22281 22587 24227 14853 16457
6381A6457K971r310k017P92O567p942p008m517j2285K7874R847p356j510m899
$$ 16457 19428 10118 8101 8893 15460 7518 510 -4007 -16292 11582 21429 14073 12563 7664
6367G664j6989L08J4174l163M78NJ448j6428j0952M770K1737J0538o748K161n923
$$ 7664 -9325 -9017 5157 1994 2472 2477 3925 -12503 -23455 -18685 3052 13590 6842 9003 3080
6352C080j0498K590J4224r10K458r773j6183k16N439N558P983M349j3828r589
$$ 3080 -7418 -4828 9396 8486 10944 1171 -15012 -15228 -9789 -4231 3752 8101 -5727 -15316
6338a5316o817q06N916j612P566J3683O433n3J882j0773q432L991M528r28j9269
$$ -15316 -22133 -22939 -17023 -18635 -11069 2614 9047 8994 10876 103 -8329 -4338 190 -738 -20007
6323b0007L459J0454j539O863J431p626J1860J3760j0524j2263O958N30j0819
$$ -20007 -16548 -6094 -7633 -770 661 -6965 4895 18655 8131 -4132 2826 3356 -7463
6310g463J293M831k764N628n758j2083J1134M406J108n017L754L514Q940J0198
$$ -7463 -6170 -1339 -4103 1525 -4233 -16316 -5182 -776 332 -4685 -931 2583 11523 21721
6296B1721o482N008O265l460j2117n068o660j1178r19J1178O710J0371O582n165
$$ 21721 15239 20247 26512 23052 10935 5867 -793 -11971 -12890 -1712 4998 15369 21951 16786
6282A6786j2942o391o6R77J285r745K75P733L477k220q450o184Q966l898l51O693
$$ 16786 3844 -2547 -2613 -1636 -351 -10096 -9821 -2088 1389 -831 -9281 -15465 -6499 -10397 -10748 -4055
6266d055J1835J714p237o516p965M94J6869J960q059K51J9138N466j3953q047
$$ -4055 7780 9494 2257 -4259 -12224 -11730 5139 7099 -960 -709 18429 23895 9942 1895
6252A895l46O687p248m327p837m469J464p410j0030O688J2583j921o52J0769o423
$$ 1895 1549 8236 988 -3339 -11176 -15645 -14181 -21591 -31621 -24933 -12350 -14271 -14923 -4154 -10577
6237a0577Q006j438o607q602J280N718K845K1213M057p875j07J771q70J685p210
$$ -10577 -2571 -4009 -10616 -19218 -17938 -12220 -9375 11838 15895 8020 7913 9684 8814 10499 3289
6222C289q283Q55k612O688L518J1404N441j3814j2362K726J4254j1536r742P82
$$ 3289 -4994 -4139 -6751 -63 3455 14859 20300 6486 -5876 -3150 11104 -432 -10174 -9392
6208i392Q184O936k464l822L298N202N055o040J524J2329j215l443l106O495n428
$$ -9392 -1208 5728 3264 -558 2740 7942 12997 6957 8481 20810 19595 16152 13046 19541 14113
6193A4113r394l623j374M981k418P922j2268q992l33k083R968L189Q61J1803J355
$$ 14113 4719 1096 -278 4703 2285 10207 -2061 -11053 -11386 -13469 -3501 -312 549 12352 13707
6178A3707N99r256O70R751j1757J579N766l267j6297N732R386m640k381O56l486
$$ 13707 14306 5050 5720 15471 3714 5293 11059 7792 -8505 -2773 6613 1973 -408 248 -3238
6163c238r093J4811j501n591J0973q738l110k644N407K823j8493m607J8070N200
$$ -3238 -12331 2480 979 -4612 6361 -2377 -5487 -8131 -2724 99 -18394 -23001 -4931 269
6149B69j0719m784p877l394J0735l143n587p439O872P470J1182j066p709L798
$$ 269 -10450 -15234 -23111 -26505 -15770 -18913 -24500 -31939 -25067 -17597 -6415 -7481 -15190 -11392
6135a1392N900m995j2827P507K2642l010j5274K006Q790J6222l111K729q64m028
$$ -11392 -5492 -10487 -23314 -15807 6835 3825 -11449 -9443 -653 15569 12458 15187 14323 10295
6121A0295m128o924L516K579o197q527l158J284J0972M496N661R823N416k083
$$ 10295 6167 -757 2759 5338 -859 -9386 -12544 -11260 -288 4208 9869 19692 25108 23025
6107B3025j0329m045k660L716q230j0031p741Q007K460k178M662k923J136O202
$$ 23025 12696 8651 5991 9707 1477 -8554 -16295 -8288 -5828 -8006 -3344 -6267 -5131 1071
6093A071k345j7224q487J5040O903n594J0460n415j1435r21m664O940L802n978
$$ 1071 -1274 -18498 -26985 -11945 -5042 -10636 -176 -5591 -17026 -17947 -22611 -15671 -11869 -17847
6079a7847P053J5602O003r498k186M542O312O971o785j7118o810Q626O870k436
$$ -17847 -10794 4808 10811 1313 -873 3669 9981 16952 10167 -6951 -13761 -5135 1735 -701
6065g01j2350O358k169K966j0018n396L385J3222Q507Q798r036p889L301K0416
$$ -701 -13051 -6693 -8862 -5896 -15914 -21310 -17925 -4703 3804 12602 3566 -4323 -1022 19394
6051A9394J1659j0617j8258l548q9l817p025J430Q388J742M820N169r974p201
$$ 19394 31053 20436 2178 -1370 -1459 -5276 -12301 -10871 -2483 -741 4079 9248 -726 -7927
6037g927o990J0095k271j4344K044k003K870J0043J7505l320N546K192Q164O853
$$ -7927 -14917 -4822 -7093 -21437 -19393 -21396 -18526 -8483 9022 5702 11248 13440 21604 28457
6023B8457J677q247o298q724L529L822o882Q197j4906j571J4019k976l164K781
$$ 28457 30134 21887 15589 6865 10394 14216 7334 15531 625 -946 13073 10097 6933 9714
6009I714M041j4770J951J1241m615J69p672K6l749J581o673k2458j462K1072J9389
$$ 9714 13755 -1015 936 12177 7562 7731 59 85 -3664 -2083 -8756 -31214 -32676 -11604 7785
5994G785J750j0115o838K761l33K223k774M076P981p543j3507p481Q249P830n758
$$ 7785 9535 -580 -7418 -4657 -4990 -2767 -5541 -1465 6516 -1027 -14534 -22015 -13766 -5936 -11694
5979a1694K531j126L66L024j0J1637R549K227Q777J513j7477q890L031o64j614
$$ -11694 -9163 -10289 -9923 -6899 -6909 4728 14277 16504 25281 26794 9317 427 3458 2794 1180
5964A180n626K34m198o951O198N311rn798O105j1302N552J5564n290j3144L547
$$ 1180 -4446 -4212 -8410 -15361 -9163 -3852 -3861 -9659 -3554 -14856 -9304 6260 970 -12174 -8627
5949h627j2612J213p351n393O955J8273J8454j8756o952M287M767n616r301r377
$$ -8627 -21239 -20026 -27377 -32770 -25815 -7542 10912 -7844 -14796 -10509 -5742 -11358 -20659 -30036
5935c0036j631J3657J1710J3220r32k759p883J2012K069j7087K465J0069m795
$$ -30036 -31667 -18010 -6300 6920 5988 3229 -4654 7358 9427 -7660 -5195 4874 79
5922G9K113k373j082M965l809l714m393l673o412p88J94J2394L921O329J195j6323
$$ 79 2192 -181 -1263 3702 -107 -3821 -8214 -11887 -18299 -19087 -18893 -6499 -2578 3751 4946 -11377
5906a1377L228K154J448P288M143J052o154q549n08L412N681l446O72L608p65
$$ -11377 -8149 -5995 -4547 2741 6884 7936 1782 -6767 -7275 -3863 1818 -1628 -956 2652 1887
5891A887q977m241M708N393O535l46r471p018l265P803L388J0363L485j5693j7091
$$ 1887 -7090 -11331 -6623 -1230 5305 4959 -4512 -11530 -14795 -6992 -3604 6759 10244 -5449 -22540
5876b2540Q522J5689J0710o277j406p835q556Q971M699p578J208p615K259M5k365
$$ -22540 -14018 1671 12381 6104 4698 -3137 -11693 -2722 1977 -5601 -4393 -12008 -9749 -9704 -12069
5861a2069J1816Q701m970o31N914j042r955o764N093J1127N386p345j4839R24
$$ -12069 -253 8448 3478 2847 8761 7719 -2236 -9000 -3907 7220 12606 5261 -9578 -8654
5847h654l658j9724j987P666j7Q568J4459J121l06M766j2607L787J6992J341N829
$$ -8654 -12312 -32036 -34023 -26357 -26374 -17806 -3347 -2226 -2532 2234 -10373 -6586 10406 11747 17576
5832A7576N830o344j7949P404q78O55j5735o910P1j2187j484O959N548N336J3831
$$ 17576 23406 17062 -887 6517 5639 6294 -9441 -16351 -16280 -28467 -29951 -22992 -17444 -12108 1723
5817A723R701J0053k70j6550k954j416K001j02m972j4529p016j2233P071R275
$$ 1723 11424 21477 21207 4657 1703 287 2288 2186 -2786 -17315 -24331 -36564 -29493 -20218
5803b0218J3301j685j146P701o743r62J731K972l525p276Q093J654l008L014Q447
$$ -20218 -6917 -8602 -9748 -2047 -8790 -9752 -8021 -5049 -8574 -15850 -7757 -6103 -9111 -6097 2350
5788B350j3424j0206r041R409K0735P876m227m218P574k010j0774l974J769M073
$$ 2350 -11074 -21280 -30321 -20912 -177 7699 3472 -746 6828 4818 -5956 -9930 -8161 -4088
5774d088Q410j471j243R72p165L308j7147j1227J2106N407m428j148J14m626O286
$$ -4088 4322 2851 1608 2580 -4585 -1277 -18424 -29651 -17545 -12138 -16566 -17714 -17600 -22226 -15940
5759a5940J7019L70M353n187J063j910k202K179O561J0472j850l576m654L849
$$ -15940 1079 1449 5802 615 1678 -232 -2434 -255 6306 16778 14928 11352 6698 10547
5745A0547l166k480k190j665O090L679m861R14J0188r617r419j2143J098P116
$$ 10547 7381 4901 2711 1046 7136 10815 5954 6868 17056 7439 -1980 -14123 -13025 -5909
5731e909P82j2271J5851K6314P879N85j0224j6673j0478j823J8584k959l955j6605
$$ -5909 -5127 -17398 -1547 24767 32646 33231 23007 6334 -4144 -5967 12617 9658 5703 -10902
5717a0902M385J1663j1101p841Q883N024J8136j304p512R385k882p162O43J191
$$ -10902 -6517 5146 -5955 -13796 -4913 111 18247 16943 9431 18816 15934 8772 9415 10606
5703A0606m440k543n026P140K919M817R886j0626j924O023J8j2917J187R784n334
$$ 10606 6166 3623 -1403 5737 8656 13473 23359 12733 10809 16832 16850 3933 5120 14904 9570
5688I570m940n22j3390j1923J197j562J2030R923j264k265O937l699n778N93N932
$$ 9570 4630 4108 -9282 -21205 -20008 -21570 -9540 383 -881 -3146 3791 92 -5686 -5093 839
5673H39R481r947n977J3391R410l541o370j3622l925m052l067q231m172K224K2783
$$ 839 10320 373 -5604 7787 17197 13656 7286 -6336 -10261 -14313 -17380 -25611 -29783 -27559 -4776
5658d776N995m571m044l460O381N626N768p078k879Q312q842j0709L529K041j6553
$$ -4776 1219 -3352 -7396 -10856 -4475 1151 6919 -159 -3038 5274 -3568 -14277 -10748 -8707 -25260
5643b5260l131P392N453R463L788P181R582n924q862l04P449N51J386P956k0820
$$ -25260 -28391 -20999 -15546 -6083 -2295 4886 14468 8544 -318 -622 6827 7378 8764 16720 -4100
5628d100l233N359m532Q017n358j1867R262J5869J064r539o415n95N275N799j988
$$ -4100 -7333 -1974 -6506 1511 -3847 -15714 -6452 9417 10481 942 -5473 -6068 -793 5006 3018
5613C018l359N210k469j0796o0N58J534L423o99l317o285n344K774P884q647P11
$$ 3018 -341 4869 2400 -8396 -8456 -7898 -6364 -2941 -3640 -6957 -13242 -18586 -15812 -7928 -16575 -15864
5597a5864J0666J2171J0378r89M624k06n249l669j0096o274p304p315o574L972
$$ -15864 -5198 6973 17351 16362 20986 20780 15531 11862 1766 -4508 -11812 -19127 -25701 -21729
5583b1729M203J1543P133l347j5854j672M691M299M894J3455o580j4511n944Q525
$$ -21729 -17526 -5983 1150 -2197 -18051 -19723 -15032 -10733 -5839 7616 1036 -13475 -19419 -10894
5569a0894j853j033Q69l409R839M541j1967N428J956j625j872q036Q761J5022
$$ -10894 -12747 -13780 -12911 -16320 -6481 -1940 -13907 -8479 -6523 -8148 -10020 -18056 -9295 5727
5555E727L304m881m982q164o13k129p665J1881k802n838j24J879k603K933J466
$$ 5727 9031 4150 -832 -8996 -9609 -11738 -19403 -7522 -10324 -16162 -16286 -14407 -17010 -14077 -12611
5540a2611k121k512Q549R107k121o765k159R88o861m401j0608J3005O998j6959
$$ -12611 -14732 -17244 -8695 412 -1709 -8474 -10633 -9645 -16506 -20907 -31515 -18510 -11512 -28471
5526b8471l141M834J5809M429o744R032l481k226m619n965K7717O125m602j3544
$$ -28471 -31612 -26778 -10969 -6540 -13284 -4252 -7733 -9959 -14578 -20543 7174 13299 8697 -4847
5512d847m881Q567q15M790J965j62o966N49j412n762r88N570n842n701J418J5350
$$ -4847 -9728 -1161 -1976 2814 4779 4617 -2349 -1800 -3212 -8974 -9962 -4392 -10234 -15935 -14517 833
5496H33J5359J6013p110j2805K477q300j1781p41N815K687j3544J036M282q343
$$ 833 16192 32205 25095 12290 14767 6467 -5314 -6055 -240 2447 -11097 -10061 -5779 -14122
5482a4122K843K394n595r740J0954n76r410J618L816J2747J2966N16K832L045
$$ -14122 -11279 -8885 -14480 -24220 -13266 -13842 -23252 -21634 -17818 -5071 7895 8411 11243 14288
5468A4288k296j4528q574m546q527J4380N237j4790j969k948L507J184K37M097
$$ 14288 11992 -2536 -11110 -15656 -24183 -9803 -4566 -19356 -21325 -24273 -20766 -19582 -19345 -15248
5454a5248J6595J3816j0073j0512J544Q279M722r126P092M780k051j371r91j4159
$$ -15248 1347 15163 5090 -5422 -3878 4401 9123 -3 7089 11869 9818 8447 7456 -6703
5440f703j2060m571q56R37J529K764P157J4184J726o628o086K673n685p572k181
$$ -6703 -18763 -23334 -24190 -23253 -21724 -18960 -11803 2381 4107 -2521 -8607 -5934 -11619 -19191 -21372
5425b1372r301K924O465O834R59j9844l235K065K176n718K203J5796P21K255J2759
$$ -21372 -30673 -27749 -21284 -14450 -13491 -33335 -36570 -34505 -32329 -38047 -35844 -20048 -19327 -17072 -4313
5410d313J3115N574j1830j0922L344J0942L226J1402l353j2310j203J1710R166
$$ -4313 8802 14376 2546 -8376 -5032 5910 9136 20538 17185 4875 3672 15382 24548
5397B4548Q077P076j7744j4377j9631k737l700L815Q903m377k402j3395j960m38
$$ 24548 32625 39701 21957 7580 -12051 -14788 -18488 -14673 -5770 -10147 -12549 -25944 -27904 -28342
5383b8342L002P151j903M521R743j801p869L926N942L002k999j944r205o753J5892
$$ -28342 -25340 -18189 -20092 -15571 -5828 -7629 -15498 -11572 -5630 -2628 -5627 -7571 -16776 -23529 -7637
5368g637M988J1818j394j3387q57N700L062r679p045K865N240Q23K774n458m72
$$ -7637 -2649 9169 7775 -5612 -6469 -769 2293 -7386 -14431 -11566 -6326 -5503 -2729 -8187 -8659
5353h659J06j999J2420M688j270n634r074l571o981o988P468k957l058K0130J2857
$$ -8659 -8553 -10552 1868 6556 5286 -348 -9422 -12993 -19974 -26962 -19494 -22451 -25509 -5379 7478
5338G478q81N409o276j5439j1407O838J5110J0169J491L115k094q713k470J296
$$ 7478 6597 12006 5730 -9709 -21116 -14278 832 11001 12492 15607 13513 4800 2330 3626
5324C626k811O855m661r590n646j840j316K24O109K868J47J037J1373J3354N186
$$ 3626 815 7670 3009 -6581 -12227 -14067 -15383 -15159 -9050 -6182 -6035 -4998 6375 19729 24915
5309B4915j0338r888J656J3009J0007K417p452j3926r229R608N03J22o580j4761
$$ 24915 14577 4689 6345 19354 29361 31778 24326 10400 1171 10779 11282 11404 4824 -9937
5295i937k330J5300N597Q277N809L840j6011j4731J563j206Q533j3904O848N813
$$ -9937 -12267 3033 8630 16907 22716 26556 10545 -4186 -2623 -3829 4704 -9200 -2352 3461
5281C461j0656q060J1033Q601l65L231j3451J606J2318p957m355j8717L446J8392
$$ 3461 -7195 -15255 -4222 4379 4014 7245 -6206 -4600 7718 -239 -4594 -23311 -19865 -1473
5267a473K696j9562j5209J981J1565P984N06L220p327M885L816J551K627k015
$$ -1473 1223 -18339 -33548 -31567 -20002 -12018 -11512 -8292 -15619 -10734 -6918 -5367 -2740 -4755
5253d755J956j0167O909R288j003m095r52j0039m964J4228J901r007O594J5066
$$ -4755 -2799 -12966 -6057 3231 2228 -1867 -2819 -12858 -17822 -3594 -1693 -10700 -4106 10960
5239A0960Q36j8774L329R549M410o063m278J4764M668q766K186J4330N14j1582
$$ 10960 11796 -6978 -3649 5900 10310 4247 -31 14733 19401 10635 12821 27151 27665 16083
5225A6083j750L838j3423j6302q227K636J7090J1846N621O272k523m262l733l438
$$ 16083 14333 18171 4748 -11554 -19781 -17145 -55 11791 17412 23684 21161 16899 13166 9728
5211I728K396N510J333j4325j4716j5977m05Q963J0459R235J1247L521j0727r16
$$ 9728 12124 17634 18967 4642 -10074 -26051 -26456 -17493 -7034 2201 13448 16969 6242 5326
5197E326R799O94j582j3060j3605j8389J1332J0570J9905r73j3452p338O856Q159
$$ 5326 15125 15819 14237 1177 -12428 -30817 -19485 -8915 10990 10017 -3435 -10773 -3917 4242
5183D242K279K486k990M923j906j3310p094j0626l158j830N602R737o751J361
$$ 4242 6521 9007 6017 10940 9034 -4276 -11370 -21996 -25154 -26984 -21382 -11645 -18396 -17035
5169a7035j746R54P284J5399J9068Q002L849p544j6505j9776N932K522n543j0649
$$ -17035 -18781 -17827 -10543 4856 23924 31926 35775 28231 11726 -8050 -2118 404 -5139 -15788
5155a5788j301J7825n582J445P57r155m144j557O358O777J118p650O096O239n50
$$ -15788 -17089 736 -4846 -3401 -2644 -11799 -15943 -17500 -11142 -4365 -3247 -10897 -4801 1438 888
5140H88M022j834r925K686N655l170j0110o658M88K346K339Q3O030M407n900o497
$$ 888 4910 3076 -6849 -4163 1492 -1678 -11788 -18446 -17958 -15612 -13273 -13190 -7160 -2753 -8653 -15150
5124a5150R91m608J3886M581K159J0767l044j6654j40p89k487n867k46N555R296
$$ -15150 -14159 -18767 -4881 -300 1859 12626 9582 -7072 -7212 -8001 -10488 -16355 -16601 -11046 -1750
5109a750M908M259J202j0571j708O507q828p822l499q763O080L825m323M762J440
$$ -1750 3158 7417 8619 -1952 -3660 2847 -5981 -13803 -17302 -26065 -19985 -16160 -20483 -15721 -14281
5094a4281l644j276Q150R104L884n4o53O160p625J854j1325l961o249p077R63
$$ -14281 -17925 -19201 -11051 -1947 1937 1883 1230 7390 -235 1619 -9706 -13667 -19916 -26993 -26030
5079b6030J0231k064j1551l34J1327L290J247O19R955J3982J91n090j5807n221
$$ -26030 -15799 -17863 -29414 -29748 -18421 -15131 -13884 -13265 -3310 10672 10863 5773 -10034 -15255
5065a5255N297o08J4901j0809n305P160J5513K0210k3015k4544l346R91J934J487
$$ -15255 -9958 -10566 4335 -6474 -11779 -4619 10894 31104 8089 -16455 -19801 -18810 -16876 -15389
5051a5389J3784P850R959j101p127N06N23n539J2330J2466k901j4055j1198p032
$$ -15389 -1605 6245 16204 15103 7976 8482 9005 3466 15796 28262 25361 11306 108 -6924
5037f924J2865O42m229k999j0865L789J0434m948j6666k950J5899O126J156n833
$$ -6924 5941 6583 2354 -645 -11510 -7721 2713 -2235 -18901 -21851 -5952 174 1330 -4503
5023d503r840j670J222m341K251K042M373M780l115P397K079q026j1680Nj898
$$ -4503 -14343 -16013 -14791 -19132 -16881 -14839 -10466 -5686 -8801 -1404 675 -7351 -19031 -19026 -20924
5008b0924M660J0934O103j339j559j0357j0214N304O396P689N794k268j641J571
$$ -20924 -16264 -5330 773 -566 -2125 -12482 -22696 -17392 -10996 -3307 2487 219 -1422 149
4994A49L664o915m906J0029K123R059M098o919j642n266q736J1734J4959o38m476
$$ 149 3813 -3102 -8008 2021 4144 13203 17301 10382 8740 3474 -5262 6472 21431 20793 16317
4979A6317k287L488M726q72j1029k2483r489K801J6110R742n168m772j9815j60
$$ 16317 14030 17518 22244 21372 10343 -12140 -21629 -18828 -2718 7024 1856 -2916 -22731 -22891
4965b2891K0170n296n083n159N467J5705J2364P116o223n685j2484q156M102m165
$$ -22891 -2721 -8017 -13100 -18259 -12792 2913 15277 22393 16170 10485 -1999 -10155 -6053 -10218
4951a0218Q132j0861N302J2597m410j3348J2249J340N467R425L806L958k477l681
$$ -10218 -2086 -12947 -7645 4952 542 -12806 -557 783 6250 15675 19481 23439 20962 17281
4937A7281O689Q374j616r321k398r133P85M519j1694N913l37q701j748q921l359
$$ 17281 23970 32344 30728 21407 19009 9876 10661 15180 3486 9399 9062 361 -1387 -10308 -13667
4922a3667J2600P06R45L470J0543r47j521j75j148m732L101k93p346m593J3130
$$ -13667 -1067 -361 584 4054 14597 13650 12129 11954 10806 6074 9175 8882 1536 -3057 10073
4907A0073Q755o845j1661m878J1054q78Q116M755j8540j0419N310L0k99J5443
$$ 10073 18828 11983 322 -4556 6498 5620 13736 18491 -49 -10468 -5158 -5128 -5427 10016
4893A0016r348j2391K451J1088N911o383j3124j8463o862p03O609k808M579J2599
$$ 10016 668 -11723 -9272 1816 7727 1344 -11780 -30243 -37105 -37808 -31199 -34007 -29428 -16829
4879a6829J82Q072n52j4184r2J2852K503n576l725L830N520L987P840l127L982
$$ -16829 -16647 -8575 -9127 -23311 -23403 -10551 -8048 -13624 -17349 -13519 -7999 -4012 3828 701 4683
4864D683P715m530m743m579m620k5624j7585J4485K0004J2357O430j007l480r0
$$ 4683 12398 7868 3125 -1454 -6074 -31698 -49283 -34798 -14794 -2437 3993 2986 -494 -584
4850e84Q517j0785j4328k802J8121J8476j3343j1095r959q794q128l637J1746
$$ -584 7933 -2852 -17180 -19982 -1861 16615 3272 -7823 -17782 -26576 -34704 -38341 -26595
4837b6595L567P317P703j650O148L629j0597m288P373K432N540R387j1681k782
$$ -26595 -23028 -15711 -8008 -9658 -3510 119 -10478 -14766 -7393 -4961 579 9966 -1715 -4497
4823d497j647N773L033J1144n888j4129k648o135j644M712J5568N52J09M048k697
$$ -4497 -6144 -371 2662 13806 7918 -6211 -8859 -14994 -16638 -11926 3642 4194 4303 8351 5654
4808E654n248j1306M438L726o492m525N722P483r103o44K2837O496l826J5930
$$ 5654 406 -10900 -6462 -2736 -9228 -13753 -8031 -548 -9651 -10295 12542 19038 15212 31142
4794C1142k724r687r256k642j272j7471K016M033q501Q612J521k455L133K2635
$$ 31142 28418 18731 9475 6833 5561 -11910 -9894 -5861 -14362 -5750 -4229 -6684 -3551 19084
4780A9084N110o735j2409j1421l193j2099M40R826J1198L351r218o225Q698P695
$$ 19084 24194 17459 5050 -6371 -9564 -21663 -21223 -11397 -199 3152 -6066 -12291 -3593 4102
4766D102l298m905k423M015n23l579k92j756R70J1668j1055o721O85P667l419
$$ 4102 804 -4101 -6524 -2509 -3032 -6611 -6903 -8659 -7689 3979 -7076 -13797 -13112 -5445 -8864
4751h864j796O510K335K78l566K583o733P305J2714M431n886r924k278m969m436
$$ -8864 -10660 -4150 -1815 -1537 -5103 -2520 -9253 -1948 10766 15197 9311 -613 -2891 -7860 -12296
4736a2296M970L356m668l818Q1L308J1504L372M991j4209O543L246k1631n057
$$ -12296 -7326 -3970 -8638 -12456 -12375 -9067 2437 5809 10800 -3409 3134 6380 -15251 -20308
4722b0308P38K66O775P164M942q390n684J451J037O976R434N487J797m760l222
$$ -20308 -19570 -19304 -12529 -5365 -423 -8813 -14497 -13046 -12009 -5033 4401 9888 11685 6925 3703
4707C703o447p537Q313L879r404m639R547J6439P276m839p139k1647j2215n971
$$ 3703 -2744 -10281 -1968 1911 -7493 -12132 -2585 13854 21130 16291 9152 -12495 -24710 -30681
4693c0681N826J0059K0576M699j3447j5550j6790L336N263J1199J8218N816j790
$$ -30681 -24855 -14796 5780 10479 -2968 -18518 -35308 -31972 -26709 -15510 2708 8524 6734
4680F734o516K404N556p832l029O384O856o684j8316K550P93J552J1481p530P294
$$ 6734 218 2622 8178 346 -2683 3701 10557 3873 -14443 -11893 -11100 -9548 1933 -5597 1697
4665A697J8599J620o224p66O891r683l120J2404l211M179l97j5692j9056O610
$$ 1697 20296 21916 15692 14926 21817 12134 9014 21418 18207 22386 21989 6297 -12759 -6149
4651f149P844m850j2972J770R047l307l523J51J1743m947k575m061r473M053K558
$$ -6149 1695 -3155 -16127 -14357 -5310 -8617 -12140 -11989 -246 -5193 -7768 -11829 -21302 -17249 -14691
4636a4691j3366l120m69J5017m235N691J5754Q446j476j1877r060o983L946J1234
$$ -14691 -28057 -31177 -31646 -16629 -20864 -15173 581 9027 7551 -4326 -13386 -20369 -16423 -5189
4622e189L343Q210N68n323o459J0785J5861M765j1129k4243r151m050J3676q278
$$ -5189 -1846 6364 6932 1609 -4850 5935 21796 26561 15432 -8811 -17962 -22012 -8336 -16614
4608a6614M707l85J3070j4720j4137M783Q742O10L933P134M516o939L498m481
$$ -16614 -11907 -12292 778 -13942 -28079 -23296 -14554 -13944 -10011 -2877 1639 -5300 -1802 -6283
4594f283L800q685j0908r57P449J0855R866j790j4166m117n212k705J1752J2214
$$ -6283 -2483 -11168 -22076 -23033 -15584 -4729 5137 3347 -10819 -14936 -20148 -22853 -11101 1113
4580A113p427n4J5116l360r64n183J1739J379p475j2644p788J153M054J4895k386
$$ 1113 -6314 -6368 8748 5388 4424 -759 10980 12359 4884 -7760 -15548 -14395 -10341 4554 2168
4565B168Q211M772o248q443j2544K946J2557k149O525N914N54q321r646l187Q574
$$ 2168 10379 15151 8903 460 -12084 -9138 3419 1270 7795 13709 14263 5942 -3704 -6891 1683
4550A683O723m65j0083r439L828P136k315R640P036J0337l55j9934k510o326o108
$$ 1683 8406 7941 -2142 -11581 -7753 -617 -2932 6708 13744 24081 23726 3792 1282 -5044 -11152
4535a1152j9l366r7L533J1008J1490m300J191j1771m728L165l971P573J408m626
$$ -11152 -11171 -14537 -14634 -11101 -93 11397 7097 8288 -3483 -8211 -5046 -9017 -1444 -36 -4662
4520d662J510L042O013J0977j6194r06Q58p938M881l458L268N225m806o206J0395
$$ -4662 -3152 -110 5903 16880 686 -220 638 -7300 -2419 -5877 -2609 2616 -2190 -8396 1999
4505A999J2376p013q307Q560J4348j1016l865M151k268j313L710J2883R28j0989
$$ 1999 14375 7362 -945 7615 21963 10947 7082 11233 8965 7652 11362 24245 25173 14184
4491A4184M399k001p619r864JJ714K91J65J558J44j3876q262P101J5528m713j3000
$$ 14184 18583 16582 8963 -901 -900 814 1105 1270 2828 2972 -10904 -19166 -12065 3463 -1250 -14250
4475a4250L060M610O909M792n665j504n623q84J349J6428O189j1062n084P006
$$ -14250 -11190 -6580 329 5121 -544 -2048 -7671 -8555 -7206 9222 15411 4349 -735 6271
4461F271R251j2247r08J005K96L680j1420q215r511K054m301q002J3122K3936
$$ 6271 15522 3275 2367 3372 3668 7348 -4072 -12287 -21798 -19744 -24045 -32047 -18925 5011
4447E011N901j7197R197J9162m711r067r838R8j17J1320Q112J330J2187n900j3965
$$ 5011 10912 -6285 2912 22074 17363 8296 -1542 -1444 -1561 9759 17871 19201 31388 25488 11523
4432A1523O277M132n125k864j1596n764q490j0544R994O054P224l308j962J62
$$ 11523 17800 21932 16807 13943 2347 -3417 -11907 -22451 -12457 -6403 821 -2487 -4449 -4287
4418d287M45M31Op897j341R739O000J2131j2269L894o03o153J327j1798j7179
$$ -4287 -3842 -3411 -3405 -11302 -12643 -2904 3096 15227 2958 6852 6249 96 1423 -10375 -27554
4403b7554K0744R076o923n149j0763q196J0238L650q784P768O357p211Q87L817
$$ -27554 -6810 2266 -4657 -9806 -20569 -28765 -18527 -14877 -23661 -15893 -9536 -16747 -15860 -12043
4389a2043K771P858r7J3715o017o234J682J0032q31l388p276m488M897j0464m194
$$ -12043 -9272 -1414 -1511 12204 6187 -47 1635 11667 10836 7448 172 -4316 581 -9883 -14077
4374a4077J0138L745m869k961j053J039O843L226Q928J838O986r123n618J3165
$$ -14077 -3939 -194 -5063 -8024 -9077 -8038 -1195 2031 10959 12797 19783 10660 5042 18207
4360A8207M877Q7o274j5571r504R40J89J2460R899j4827k943P042J0790R771j827
$$ 18207 23084 23171 16897 1326 -8178 -7238 -7049 5411 15310 483 -2460 4582 15372 25143 23316
4345B3316N920n547j2419n491K320O160r265M990P09K861M403N131N461J452p665
$$ 23316 29236 23689 11270 5779 8099 14259 4994 9984 10693 13554 17957 23088 28549 30001 22336
4330B2336r118l269k902p52n379j4178O828Q832J574p123j1753q954J572j0110
$$ 22336 13218 9949 7047 6295 916 -13262 -6434 2398 3972 -3151 -14904 -23858 -22286 -32396
4316c2396n83P522N887p339K475k047o180p64j836Q901J0687J7038J2613r885
$$ -32396 -32979 -25457 -19570 -26909 -24434 -26481 -32661 -33425 -35261 -26360 -15673 1365 13978 4093
4302D093J622P619r409o699K362o086J1448J1821k079M646j214P085q48j4191
$$ 4093 5715 13334 3925 -2774 -412 -6498 4950 16771 14692 19338 18124 25209 24361 10170
4288A0170j5577J741r080m43o715Q650N313j0582q77J0612J0855P71q410m540
$$ 10170 -5407 -3666 -12746 -13189 -19904 -11254 -5941 -16523 -17400 -6788 4067 4838 -3572 -8112
4274h112k261k802J1825l325m946K645k418o648R918R281J524j710n863j348l103
$$ -8112 -10373 -13175 -1350 -4675 -9621 -6976 -9394 -16042 -6124 3157 4681 2971 -2892 -4240 -7343
4259g343K978J0063J1673K09l932j4582j3194K266R688J1755j2707q083L531j1825
$$ -7343 -4365 5698 17371 17580 13648 -934 -14128 -11862 -2174 9581 -3126 -11209 -7678 -19503
4245a9503N287K4308J0614j6282l085K446N447j24j0369j0787k899L927k484n614
$$ -19503 -14216 10092 20706 4424 1339 3785 9232 9108 -1261 -12048 -14947 -11020 -13504 -19118
4231a9118j531K221Q095N902L413J4229l870r35k178m223k43l537O670L490q084
$$ -19118 -20649 -18428 -10333 -4431 -1018 13211 9341 8406 6228 2005 1762 -1775 4895 8385 301
4216C01k567O328q377r790O168P934r150K649k564J3611P101R847k492j549n614
$$ 301 -2266 4062 -4315 -14105 -7937 -3 -9153 -6504 -9068 4543 11644 21491 18999 17450 11836
4201A1836j1257j6284n826l011k800O647Q858P158k470j813r93q307L804J5531
$$ 11836 579 -15705 -21531 -24542 -27342 -20695 -11837 -4679 -7149 -8962 -9955 -18262 -14458 1073
4187A073J3385l396k2359o378q830r310P705K700L576P638j082J397k99K384L011
$$ 1073 14458 11062 -11297 -17675 -26505 -35815 -28110 -25410 -21834 -14196 -15278 -13881 -14180 -11796 -8785
4172h785j640R223J2684M316j2409j664J2982Mo234q086J1385L642p757J594p947
$$ -8785 -10425 -1202 11482 15798 3389 1725 14707 14711 8477 391 11776 15418 7661 9255 1308
4157A308P13k132m229j2090l278j0104o123J073K0144J1333k922o03J632J0900
$$ 1308 2021 -111 -4340 -16430 -19708 -29812 -35935 -34862 -14718 -3385 -6307 -6910 -5278 5622
4143E622L042j2880N386J8780R586n463j2799p449M319J1648J328j5269q882L883
$$ 5622 8664 -4216 1170 19950 29536 24073 11274 3825 8144 19792 21120 5851 -3031 852
4129H52O933o705Q7m4o218L820j349q940o015L757Q762M443j244p27K309Q773
$$ 852 7785 1080 1167 1123 -5095 -1275 -2624 -11564 -17579 -13822 -5060 -617 -1861 -2588 -279 8494
4113H494r296q993m791L144P608J422j662o74O009M652K836m498J637p236o060
$$ 8494 -802 -9795 -14586 -11442 -3834 -2412 -4074 -4748 1261 5913 8749 4251 5888 -1348 -7408
4098g408p37m646Q130J380j1679m065R400J1450j733p382M264j0167O101K1876
$$ -7408 -8145 -12791 -4661 -3281 -14960 -19025 -9625 1825 92 -7290 -3026 -13193 -7092 14784
4084A4784R194o607j7946QJ0621O038l882J62n655N551k199k879L148l321j989
$$ 14784 23978 17371 -575 -567 10054 16092 12210 12372 6717 12268 10069 7190 10338 7017 5028
4069E028M089j490j4538j4517P559L670N43P300P835O968m53j1371q737l964N689
$$ 5028 9117 7627 -6911 -21428 -13869 -10199 -9656 -2356 5479 12447 11994 623 -8114 -12078 -6389
4054f389J6007j5914j5131P90L014M062O676M837N076n56m22r019p305o017j720
$$ -6389 9618 -6296 -21427 -20637 -17623 -13561 -6885 -2048 3028 2472 2050 -6969 -14274 -20291 -22011
4039b2011L580J802p885n496L602N997J0060J5579O341K3k489r595j2816o308
$$ -22011 -18431 -16629 -24514 -30010 -26408 -20411 -10351 5228 11569 11592 9103 -492 -13308 -19616
4025a9616k917l880J7269R848q375k257O012n710q340l473J2855J2089j3050o8
$$ -19616 -22533 -26413 -9144 704 -7671 -9928 -3916 -9626 -17966 -21439 -8584 3505 -9545 -9613
4011i613Q945M296L359o385o719O475M675O050j9155j2522P493m048R887J0463
$$ -9613 -668 3628 6987 602 -6117 358 5033 11083 -8072 -20594 -13101 -17149 -7262 3201
3997C201j427j3613k793L025N740N432n875n220R769L537N548j981k396q378k949
$$ 3201 1774 -11839 -14632 -11607 -5867 -435 -6310 -11530 -1761 1776 7324 5343 2947 -5431 -8380
3982h380J2998J2517m267j8455N960M254P14L924L41l709j1874j291m009N282
$$ -8380 4618 17135 12868 -5587 373 4627 5341 9265 9606 5897 -5977 -7268 -11277 -5995
3968e995k729n092m896J1227L0225M153j4338n865M25q56j1638l882K767o320
$$ -5995 -8724 -13816 -18712 -7485 22740 26893 12555 6690 7115 6259 -5379 -9261 -6494 -12814
3954a2814M226K830J2131p171j1456N444j082Q906L113m900K012j1467R224L946
$$ -12814 -8588 -5758 6373 -798 -12254 -6810 -7892 1014 4127 -773 1239 -10228 -1004 2942
3940B942j6694j1385J3933L211r589q112l802N453R294J0258k7J2492r03N807
$$ 2942 -13752 -25137 -11204 -7993 -17582 -25694 -29496 -24043 -14749 -4491 -4518 7974 7071 12878
3926A2878j1417j0227P510R131P009K09J0242Q844m611r350k451q142j8839J147
$$ 12878 1461 -8766 -1256 7875 14884 15093 25335 34179 29568 20218 17767 9625 -9214 -8067
3912h067l774m905J0498J4194k085k677R640k583r009k339k251r675K271O694
$$ -8067 -11841 -16746 -6248 7946 5861 3184 12824 10241 1232 -1107 -3358 -13033 -10762 -4068
3898d068J1226O181Q884N98p522Q111K567p298m506j2136o523N101p31l377K275
$$ -4068 7158 13339 22223 22821 15299 23410 25977 18679 14173 2037 -4486 615 -116 -3493 -1218
3883a218j0212m524o29L128M042N365M926K74J1573j1571o182P59Q746O764M417
$$ -1218 -11430 -15954 -16583 -13455 -9413 -4048 878 1152 12725 1154 -5028 -4269 4477 11241 15658
3868A5658P038N217p918o580j3541j3683k211K2388Q625q181l375j996L73L139
$$ 15658 22696 27913 19995 13415 -126 -13809 -16020 6368 14993 6812 3437 1441 1814 4953
3854D953q501l320m978K171P28k775K156J525j4485m161J3141m19N964p283j2215
$$ 4953 -3548 -6868 -11846 -9675 -8947 -11722 -9566 -8041 -22526 -26687 -13546 -13965 -8001 -15284 -27499
3839b7499l886Q973J536q536J2515O717Q096j374j756j101K111l150j0590p862
$$ -27499 -31385 -22412 -20876 -29412 -16897 -10180 -2084 -3458 -5214 -6315 -4204 -7354 -17944 -25806
3825b5806J6176J1496p12k008j0428J2640R37n893q690m742K922L408N905P054
$$ -25806 -9630 1866 1154 -854 -11282 1358 2295 -3598 -12288 -17030 -14108 -10700 -4795 2259
3811B259K837l673p588q143J508J1072N717L212J575R488o698K470N777r050j9674
$$ 2259 5096 1423 -6165 -14308 -12800 -1728 3989 7201 8776 18264 11566 14036 19813 10763 -8911
3796h911J7500L964P418o246o709k045m217o49J218j1307J031L999n58l209K092
$$ -8911 8589 12553 19971 13725 7016 4971 754 105 1323 -9984 -8953 -4954 -5512 -8721 -6629
3781f629k417j374M563J473j6259R7J1016J2764J400J938J164m733j1380r491
$$ -6629 -9046 -10420 -5857 -4384 -20643 -20546 -9530 3234 4634 6572 7736 3003 -8377 -17868
3767a7868n276R704J9182n693j0447M351l86q247L062P090p815r02J2170j36k590
$$ -17868 -23144 -13440 5742 49 -10398 -6047 -6433 -14680 -11618 -4528 -12343 -13245 -1075 -1211 -3801
3752c801N656L066o988k351q710m19l538J0010J4527k974K549N526j9459j4679
$$ -3801 1855 4921 -2067 -4418 -13128 -13547 -17085 -7075 7452 4478 7027 12553 -6906 -21585
3738b1585J0034L722l154r861j0746Q841J1456L91O282J622m484Q24O04P499R709
$$ -21585 -11551 -7829 -10983 -20844 -31590 -22749 -11293 -10902 -4620 -2998 -7482 -6658 -6054 1445 11154
3723A1154L081O4P112m398q638n733j267m260O256P252p68J405N958j783R022
$$ 11154 14235 14299 21411 17013 8375 2642 1375 -2885 3371 10623 9855 11260 17218 15435 24457
3708B4457J2885j700n937p198j5920o689j234m008J8854N997j5960J0016J1260
$$ 24457 37342 35642 29705 22507 6587 -102 -1336 -5344 13510 19507 3547 13563 24823
3695B4823p882o169J72l653j025l263m976R537O277k20p088K936M765j587p34
$$ 24823 16941 10772 10944 7291 6266 3003 -1973 7564 13841 13621 6533 9469 14234 12647 11913
3680A1913o097j0999k856O87K252k132M476n585m566Q818K68m757O459J5171o542
$$ 11913 5816 -5183 -8039 -7352 -5100 -7232 -2756 -8341 -12907 -4089 -3821 -8578 -2119 13052 6510
3665F510r965o278l73l401J042O138k403J0199J119j5088j0011r2J7464Q785L748
$$ 6510 -3455 -9733 -10106 -13507 -12465 -6327 -8730 1469 2588 -12500 -22511 -22603 -5139 3646 7394
3650G394l30o666L69l719M40M466k869l103N935J054Q915K876K502j2915j0388
$$ 7394 7064 398 767 -2952 -2512 1954 -915 -4018 1917 2971 11886 14762 17264 4349 -6039
3635f039K312R995J0835j2550J706O442m055j5716M212M096o639m54l069J368
$$ -6039 -3727 6268 17103 4553 6259 12701 8646 -7070 -2858 1238 -5401 -5855 -8924 -7556
3621g556l800o482l859K658m992J3592K41m053J970Q727P205K152l020Q833J067
$$ -7556 -11356 -17838 -21697 -19039 -24031 -10439 -10198 -14251 -12281 -3554 3651 5803 2783 11616 12683
3606A2683J485J905J1136m962j1226j4997j073q16P42L893o016j0105Q148J8010
$$ 12683 14168 16073 27209 22247 11021 -3976 -5049 -5865 -5123 -1230 -7246 -17351 -9203 8807
3592H807m930N987P075j478N6l416r359r022n429k51Q363Q392J540Q200j6213
$$ 8807 3877 9864 16939 15461 15517 12101 2742 -6280 -11709 -11960 -3597 4795 6335 14535 -1678
3577a678j360P4k83J3291N750o955q359r656L128m136p163q304q909J5679J4105
$$ -1678 -3038 -2964 -3247 10044 15794 8839 480 -9176 -6048 -10184 -17347 -25651 -34560 -18881 -4776
3562d776l135R331J1190q785r104M018K406j0802P463L510j953K378j2444o277
$$ -4776 -7911 1420 12610 3825 -5279 -1261 1145 -9657 -2194 1316 -637 1741 -10703 -16980
3548a6980K26P848J8353P416N536j2927q395J690L120o824M66M88K806J0444L77
$$ -16980 -16754 -8906 9447 16863 22399 9472 1077 2767 5887 -937 -471 17 2823 13267 13644
3533A3644j4846m814P093k6951q328J0357K990k583k668J7476J7998L633l32p918
$$ 13644 -1202 -6016 1077 -25874 -34202 -23845 -20855 -23438 -26106 -8630 9368 13001 12669 4751
3519D751P948j1667j5335R261P067K246P073n199n851p412j060J757J3093q080
$$ 4751 12699 1032 -14303 -5042 2025 4271 11344 6145 294 -7118 -8178 -6421 6672 -1408
3505a408M637j6743O22J1109K981q507J4682m214j1536J939R788q944l198K85
$$ -1408 3229 -13514 -12892 -1783 1198 -7309 7373 3159 -8377 -6438 3350 -5594 -8792 -8507
3491h507J6840J147p229Q766p614L270p528p729M894R551k916O946j697j3761
$$ -8507 8333 9480 2251 11017 3403 6673 -855 -8584 -3690 5861 2945 9891 8194 -5567
3477e567l19j1236o024j776O226P316J0465p261M807J1954l251m317o378J3082
$$ -5567 -5886 -17122 -23146 -24922 -18696 -11380 -915 -8176 -3369 8585 5334 1017 -5361 7721
3463G721J0597Q89n138k0343m474L930K609p103J380J8088K537O712L525k0884
$$ 7721 18318 19207 14069 -6274 -10748 -6818 -4209 -11312 -9932 8156 10693 17405 20930 46
3449D6J6L155O981j0769o417O866M108p391n02j488J795M600k435q353j2029m901
$$ 46 62 3217 10198 -571 -6988 -122 3986 -3405 -3907 -5395 -3600 1000 -1435 -9788 -21817 -26718
3433b6718K55J6632J5954n179p226o612l903J7411j734k702J6618P630N047q535
$$ -26718 -26463 -9831 6123 944 -6282 -12894 -16797 614 -1120 -3822 12796 20426 25473 16938
3419A6938p293k3746j3323K364J3520J1112K173J755M635j1755j70j673M693J827
$$ 16938 9645 -14101 -27424 -25060 -11540 -428 1745 3500 8135 -3620 -3790 -5463 -770 1057
3405A057p107n42M107L194q28j3025K0J0038L043j2307p695L016J4148j017M235
$$ 1057 -6050 -6592 -2485 709 -119 -13144 -13124 -3086 -43 -12350 -20045 -17029 -2881 -3898 337
3390C37l491K05M148n15N945K0507j0271r913L290n924j9573J2J091m374L35n724
$$ 337 -3154 -2949 1199 684 6629 27136 16865 6952 10242 4318 -15255 -15243 -14152 -18526 -18191 -23915
3374b3915k172N960Q291K306N511J1383M789k204Q35l069J883q254N60j1427k448
$$ -23915 -26087 -20127 -11836 -9530 -4019 7364 12153 9949 10784 7715 9598 1344 1904 -9523 -11971
3359a1971J0076M435K132m901J805n58L533j1562K325m381k284N148K569j798
$$ -11971 -1895 2540 4672 -229 1576 1018 4551 -7011 -4686 -9067 -11351 -6203 -3634 -5432
3345e432L649l988j7591J3417P443k616k478K582J4546L147j2761m629n479o696
$$ -5432 -1783 -5771 -23362 -9945 -2502 -5118 -7596 -5014 9532 12679 -82 -4711 -10190 -16886
3331a6886M980K476m642r63J3055Q383J921R91j0243r655n541J1438J987m661
$$ -16886 -11906 -9430 -14072 -15035 -1980 6403 8324 9315 -928 -10583 -16124 -4686 -2699 -7360
3317g360j3593q562J4519M062j8306o008M417Q850J1939N818M76J5809n499j3395
$$ -7360 -20953 -29515 -14996 -10934 -29240 -35248 -30831 -21981 -10042 -4224 -3748 12061 6562 -6833
3303f833p092L932N583p048J156l009k31R469J1698N011n105j5503j0947J1355
$$ -6833 -13925 -9993 -4410 -11458 -10302 -13311 -13542 -4073 7625 12636 7531 -7972 -18919 -7564
3289g564J987j2626q088N606P320J6669J799o984o853o638l502p233J0644J210
$$ -7564 -5577 -18203 -26291 -20685 -13365 3304 5103 -1881 -8734 -15372 -18874 -26107 -15463 -14253
3275a4253P892q265N143J3393R228j528l441o56k81o682j0298P824j413K438N309
$$ -14253 -6361 -14626 -9483 3910 13138 11610 8169 7513 7232 550 -9748 -1924 -3337 -899 4410
3260D410l945o977J1571J3260L323p431r340j2635L039l476N524K939J06j1128
$$ 4410 465 -6512 5059 18319 21642 14211 4871 -7764 -4725 -8201 -2677 262 368 -10760
3246a0760J2482J0562k663r055j31o891l483k086p09J7697O679N947p162o031
$$ -10760 1722 12284 9621 566 435 -6456 -9939 -12025 -12734 4963 11642 17589 10427 4396
3232D396n728l716R068p399l317l792J316L391p389O657m998m725J4505j320j2885
$$ 4396 -1332 -5048 4020 -3379 -6696 -10488 -9172 -5781 -13170 -6513 -11511 -16236 -1731 -3051 -15936
3217a5936P296J4176J499K473j6563q502J2686P105K777O232K202r026o229j9540
$$ -15936 -8640 5536 7035 9508 -7055 -15557 -2871 4234 7011 13243 15445 6419 190 -19350
3203a9350m319O871k14J636L484R329P394l86j0235k685O104J0144j638L609l916
$$ -19350 -23669 -16798 -17012 -15376 -11892 -2563 4831 4445 -5790 -8475 -2371 7773 6135 9744 5828
3188E828j0771j1665Q234O438l594Q322J409p653J351J0882n84m027L924p951
$$ 5828 -4943 -16608 -8374 -1936 -5530 2792 4201 -3452 -2101 8781 8197 4170 8094 143
3174A43L880J0813J858n547O913l557O029j121j3392J553M298M284l407j582l517
$$ 143 4023 14836 16694 11147 18060 14503 20532 19411 6019 7572 11870 16154 12747 11165 7648
3159G648J346k449L297m055m375k906o969M981m251q81q397k763R140L203N423
$$ 7648 8994 6545 9842 5787 1412 -1494 -8463 -3482 -7733 -8614 -17011 -19774 -10634 -7431 -2008
3144b008J6390N940j4142q804J560M375n329n159J803n549J782j981P509n51L862
$$ -2008 14382 20322 6180 -2624 -1064 3311 -2018 -7177 -5374 -10923 -9141 -11122 -3613 -4164 -302
3129c02l378Q361O648j1114j783N727O648m80j5103m191Q683k21k274l078m110
$$ -302 -3680 4681 11329 215 -1568 4159 10807 10327 -4776 -8967 -284 -505 -2779 -5857 -9967
3114i967m177R003J460j3977j1493j1219k497J6229K8394j48o737J0393M042j4683
$$ -9967 -14144 -5141 -3681 -17658 -29151 -40370 -42867 -26638 1756 1608 -5129 5264 9306 -5377
3100e377j0060j058O117L394p131R437J548j504j059N68k622M683O643j753k249
$$ -5377 -15437 -16495 -10378 -6984 -14115 -4678 -3130 -4634 -5693 -5125 -7747 -3064 3579 1826 -423
3085d23k354K77j368J766p12k412p070J1912M815O03n614q968R530O259O753M847
$$ -423 -2777 -2500 -3868 -2102 -2814 -5226 -12296 -384 4431 5034 -580 -9548 -18 6241 12994 17841
3069A7841n101m030R907J317r061o883R271n555j1655o979M791J0156R098L708
$$ 17841 12740 8710 18617 19934 10873 3990 13261 7706 -3949 -10928 -6137 4019 13117 16825
3055A6825m765m441k069M03O782j09n269J966M122p423o037K398m312m797P348
$$ 16825 12060 7619 5550 5953 12735 12626 7357 9323 13445 6022 -15 2383 -1929 -6726 622
3040F22j770o241J407M468k451j823n561j240J4253J7499j584M33j644P80j5680
$$ 622 -1148 -7389 -5982 -1514 -3965 -5788 -11349 -12589 1664 19163 17579 18012 16368 17148 1468
3025A468J2729N781o291j2426L13j0153n040m17k816m37P13J3918n155o080Q725
$$ 1468 14197 19978 13687 1261 1574 -8579 -13619 -14036 -16852 -17289 -16576 -2658 -7813 -13893 -5168
3010e168J5327k226n627o282p401j3495L920q04J2179m443K936R479P386K825
$$ -5168 10159 7933 2306 -3976 -11377 -24872 -20952 -21756 -9577 -14020 -11084 -1605 5781 8606
2996H606n518j0577K989P790n24k713r335L90n604l184R595n940r53J0092O649
$$ 8606 3088 -7489 -4500 3290 2766 53 -9282 -8892 -14496 -17680 -8085 -14025 -14978 -4886 1763
2981A763o351o552J314P438P519r348K812O29P36N114j1577j4265M178l793L984
$$ 1763 -4588 -11140 -9826 -2388 5131 -4217 -1405 -776 -40 5074 -6503 -20768 -16590 -20383 -16399
2966a6399J7501R696j556j3907O568l313J697P134m387l990n352R105J2973O707
$$ -16399 1102 10798 9242 -4665 1903 -1410 287 7421 3034 -956 -6308 2797 15770 22477
2952B2477n940j0198K726p514r773J0058J28j1193m430L266K487r162l000N002
$$ 22477 16537 6339 9065 1551 -8222 1836 1964 -9229 -13659 -10393 -7906 -17068 -20068 -15066
2938a5066q187q443J0948O491N303J9624l247n181N197L848J0171l084j1725J129
$$ -15066 -23253 -31696 -20748 -14257 -8954 10670 7423 2242 7439 11287 21458 18374 6649 7778
2924G778q318j279J0424L025j0652j0463r754L98O249J0770l962m963O18j3541
$$ 7778 -540 -1819 8605 11630 978 -9485 -19239 -18841 -12592 -1822 -5784 -10747 -10129 -23670
2910b3670O117J6712M897m21j2626J034Q010O491N539J399K050k702j5094j1136
$$ -23670 -17553 -841 4056 3635 -8991 -7957 53 6544 12083 13482 15532 12830 -2264 -13400
2896a3400j582q800M902P445J064j0123p33m218R976J7049J187k341J917k059
$$ -13400 -14982 -23782 -18880 -11435 -10371 -20494 -21227 -25445 -15469 1580 2767 426 2343 284
2882B84q386k937J1326J7848L88j0529N174R691J953j8237j2212q960m51O186
$$ 284 -8102 -11039 287 18135 18523 7994 13168 22859 24812 6575 -5637 -14597 -15048 -8862
2868h862k112L17Q630J6457q04m661j4390m579J3588J2928K350q059m357j066
$$ -8862 -10974 -10657 -2027 14430 13626 8965 -5425 -10004 3584 16512 18862 10803 6446 5380
2854E380r191m188M270J221Q370N737j3519q209j1797N400k593Q13k844m851K805
$$ 5380 -3811 -7999 -3729 -2508 5862 11599 -1920 -10129 -21926 -16526 -19119 -18306 -21150 -26001 -23196
2839b3196j951L488J5101K889K261l630j3637J548R229J2065n830r855j1471R407
$$ -23196 -25147 -21659 -6558 -3669 -1408 -5038 -18675 -17127 -7898 4167 -1663 -11518 -22989 -13582
2825a3582j606R924L447J62M812N359L040J316o304o051R706q309p595q163R611
$$ -13582 -15188 -5264 -1817 -1655 3157 8516 11556 12872 6568 517 10223 1914 -5681 -13844 -4233
2810d233J0973M99k939O587k858j544r912k3847J627R094L761K208J7062J1169
$$ -4233 6740 7239 4300 10887 8029 6485 -3427 -27274 -25647 -16553 -12792 -10584 6478 17647
2796A7647p258j1962k353M162j80m758J404o791J0111o274m386J2930m206m238
$$ 17647 10389 -1573 -3926 236 56 -4702 -3298 -10089 22 -6252 -10638 2292 -1914 -6152
2782f152J0076M768P803L771j0844j2874j417K1j8007R168P387l875q56P029j714
$$ -6152 3924 8692 16495 20266 9422 -3452 -4869 -4848 -22855 -13687 -6300 -10175 -11031 -4002 -5716
2767e716P611J0707n361N973O419p669j891K595l864p018k707L122O341o596l510
$$ -5716 1895 12602 7241 13214 19633 11964 10073 12668 8804 1786 -921 2201 8542 1946 -1564
2752a564j744N075J4456M795r334k2098l096J1253R70J577q930m225J3806j132
$$ -1564 -3308 1767 16223 21018 11684 -10414 -13510 -2257 -1287 290 -8640 -12865 941 -191
2738a91n468Q437O359J46n555j1862P789J2074O57k561J0860q034j2557l284L919
$$ -191 -5659 2778 9137 9283 3728 -8134 -345 11729 12386 9825 20685 12651 94 -3190 729
2723G29q081Q802M009n996J222k068n684p292J6867j555K196L486j4601p57J876
$$ 729 -7352 1450 5459 -537 685 -1383 -7067 -14359 2508 953 3149 6635 -7966 -8723 -6847
2708f847P869P033j554l311M692l933J263K281j8849q228J3080k94J30j4713k646
$$ -6847 1022 8055 6501 3190 7882 3949 5212 7493 -11356 -19584 -6504 -6798 -6668 -21381 -24027
2693b4027J6295P120M029L877J0144n325j436l078J0718q143j2516J6253M928
$$ -24027 -7732 -612 3417 7294 17438 12113 10677 7599 18317 10174 -2342 13911 18839
2680A8839j4458l438Q657n247q161j2606o909j3276L449J7279J8934M479Q42o819
$$ 18839 4381 943 9600 4353 -3808 -16414 -23323 -36599 -33150 -15871 3063 7542 8384 1565
2666A565k2746j010J2581M439O650J1099j0493r176l854J6426N376p88M41l868
$$ 1565 -21181 -22191 -9610 -5171 1479 12578 2085 -7091 -10945 5481 10857 10069 10510 6642
2652F642j5071r399L293J7419o465j5315m138M743r006J5100J5985K250L651o366
$$ 6642 -8429 -17828 -14535 2884 -3581 -18896 -23034 -18291 -27297 -12197 3788 6038 9689 3323
2638C323j959j3010M314Q016J1400o131p492k780k985R205J0817J390k158j0958
$$ 3323 1364 -11646 -7332 684 12084 5953 -1539 -4319 -7304 1901 12718 14108 11950 992
2624I92k041k822l498J938m900L362J6928J7480j5351N82j673j2626J2906M937
$$ 992 -1049 -3871 -7369 -5431 -10331 -6969 9959 27439 12088 12670 10997 -1629 11277 16214
$$ [...]
##END NTUPLES=NMR SPECTRUM
##END=
