##TITLE=Analysis number 307596
Compound Code mo 07557
Book Reference 413/126
Project Code adrs
Chemist Name stevem
##JCAMPDX= 6.0         $$ Bruker NMR JCAMP-DX V2.0
##DATA TYPE= NMR SPECTRUM
##DATA CLASS= NTUPLES
##ORIGIN= Bruker BioSpin GmbH
##OWNER= NMR
$$ XWIN-NMR		Version 3.5
$$ Mon May  9 11:37:17 2005 GMT Daylight Time (UT+1h)  MAYBRIDGE\NMR@NMR_250MHZ
##.OBSERVE FREQUENCY= 250.131544655141
##.OBSERVE NUCLEUS= ^1H
##.ACQUISITION MODE= SIMULTANEOUS (DQD)
##.ACQUISITION SCHEME= undefined
##.AVERAGES= 16
##.DIGITISER RES= 18
##SPECTROMETER/DATA SYSTEM= dpx250
##.PULSE SEQUENCE= zg30
##.SOLVENT NAME= CDCl3
##.SHIFT REFERENCE= (INTERNAL, CDCl3, 0, 16.4498)
##AUDIT TRAIL= $$ (NUMBER, WHEN, WHO, WHERE, WHAT)
$$ ##TITLE= Audit trail, XWIN-NMR		Version 3.5
$$ ##JCAMPDX= 5.01
$$ ##ORIGIN= Bruker BioSpin GmbH
$$ ##OWNER= NMR
$$ C:\u/data/dgb/nmr/ADRS/2770/pdata/1/auditp.txt
$$ ##AUDIT TRAIL=  $$ (NUMBER, WHEN, WHO, WHERE, WHAT)
(   1,<2005-05-09 11:36:44.90 +100>,<MAYBRIDGE\NMR>,<NMR_250MHZ>,
      <created by zg, POWCHK disabled, PULCHK disabled
       configuration hash MD5:
       62 19 C7 07 E1 42 D1 B7 37 6C 3D D0 77 39 F9 E6
       data hash MD5: 64K
       1F 64 1C D2 39 52 F3 25 FA 8F 70 22 37 5F 15 76>)
(   2,<2005-05-09 11:37:00.27 +100>,<MAYBRIDGE\NMR>,<NMR_250MHZ>,
      <Start of raw data processing
       ef LB = 0.3 FT_mod = 6 PKNL = 1 SI = 32K 
       data hash MD5: 32K
       E3 32 69 B6 DC F5 1D DB D4 DC 36 17 06 5C 56 D8>)
(   3,<2005-05-09 11:37:04.63 +100>,<MAYBRIDGE\NMR>,<NMR_250MHZ>,
      <apk 
       data hash MD5: 32K
       8D BD D8 30 9C 92 2B 03 B4 87 23 69 21 FB B9 C1>)
(   4,<2005-05-09 11:37:06.09 +100>,<MAYBRIDGE\NMR>,<NMR_250MHZ>,
      <abs ABSG = 5 
       data hash MD5: 32K
       D9 E3 44 74 5F 57 CE 1A 72 BB E0 B8 A9 F2 7D 4A>)
$$ ##END=
$$ 
$$ hash MD5
$$ 51 3B B1 D7 6F EA C3 68 D5 8A 50 C4 8A 0C 2F 5D
##$RELAX= 
##$RELAX= 
##$RELAX= 
##$RELAX= 
##$RELAX= 
##$RELAX= 
##$RELAX= 
$$ Bruker specific parameters
$$ --------------------------
##$DU= <C:\u>
##$EXPNO= 2770
##$NAME= <ADRS>
##$PROCNO= 1
##$TYPE= <nmr>
##$USER= <dgb>
##$AMP= (0..31)
100 100 100 100 100 100 100 100 100 100 100 100 100 100 100 100 100 100 
100 100 100 100 100 100 100 100 100 100 100 100 100 100 
##$AQSEQ= 0
##$AQ_mod= 3
##$AUNM= <au_zg>
##$AUTOPOS= <7 >
##$BF1= 250.13
##$BF2= 250.13
##$BF3= 250.13
##$BF4= 250.13
##$BF5= 500.13
##$BF6= 500.13
##$BF7= 500.13
##$BF8= 500.13
##$BYTORDA= 1
##$CFDGTYP= 0
##$CFRGTYP= 5
##$CHEMSTR= <none>
##$CNST= (0..31)
1 1 145 1 1 1 1 1 1 1 1 1 1 1 1 1 1 1 1 1 1 1 1 1 1 1 1 1 1 1 1 1 
##$CPDPRG= <>
##$CPDPRG1= <>
##$CPDPRG2= <>
##$CPDPRG3= <>
##$CPDPRG4= <mlev>
##$CPDPRG5= <mlev>
##$CPDPRG6= <mlev>
##$CPDPRG7= <mlev>
##$CPDPRG8= <mlev>
##$CPDPRGB= <>
##$CPDPRGT= <>
##$D= (0..31)
0 1 0 0 0 0 0 0 0 0.06 0 0 0 0 0 0 0.0002 0 0 0 0 0 0 0 0 0 0 0 0 0 0 
0 
##$DATE= 1115635004
##$DBL= (0..7)
120 120 120 120 120 120 120 120 
##$DBP= (0..7)
150 150 150 150 150 150 150 150 
##$DBP07= 0
##$DBPNAM0= <>
##$DBPNAM1= <>
$$ [...]
##$SUBNAM7= <"">
##$SUBNAM8= <"">
##$SUBNAM9= <"">
##$SW= 20.6930455092707
##$SWIBOX= (0..15)
0 0 3 0 0 0 0 0 0 0 0 0 0 0 0 0 
##$SW_h= 5175.983436853
##$TD= 65536
##$TD0= 1
##$TE= 295.16
##$TE2= 300
##$TE3= 300
##$TEG= 300
##$TL= (0..7)
0 120 120 120 120 120 120 120 
##$TP= (0..7)
150 150 150 150 150 150 150 150 
##$TP07= 0
##$TPNAME0= <>
##$TPNAME1= <>
##$TPNAME2= <>
##$TPNAME3= <>
##$TPNAME4= <>
##$TPNAME5= <>
##$TPNAME6= <>
##$TPNAME7= <>
##$TPOAL= (0..7)
0.5 0.5 0.5 0.5 0.5 0.5 0.5 0.5 
##$TPOFFS= (0..7)
0 0 0 0 0 0 0 0 
##$TUNHIN= 0
##$TUNHOUT= 0
##$TUNXOUT= 0
##$USERA1= <user>
##$USERA2= <user>
##$USERA3= <user>
##$USERA4= <user>
##$USERA5= <user>
##$V9= 5
##$VALIST= <valist>
##$VCLIST= <CCCCCCCCCCCCCCC>
##$VD= 0
##$VDLIST= <DDDDDDDDDDDDDDD>
##$VPLIST= <PPPPPPPPPPPPPPP>
##$VTLIST= <TTTTTTTTTTTTTTT>
##$WBST= 1024
##$WBSW= 4
##$XGAIN= (0..3)
0 0 0 0 
##$XL= 0
##$YL= 0
##$YMAX_a= 494183
##$YMIN_a= -499484
##$ZGOPTNS= <>
##$ZL1= 120
##$ZL2= 120
##$ZL3= 120
##$ZL4= 120
##$ABSF1= 16.44975
##$ABSF2= -4.243422
##$ABSG= 5
##$ABSL= 3
##$ALPHA= 0
##$AQORDER= 0
##$ASSFAC= 0
##$ASSFACI= 0
##$ASSFACX= 0
##$ASSWID= 0
##$AUNMP= <proc_1d>
##$AZFE= 0.1
##$AZFW= 0.1
##$BCFW= 0
##$BC_mod= 0
##$BYTORDP= 0
##$COROFFS= 0
##$CY= 12.5
##$DATMOD= 1
##$DC= 0
##$DFILT= <>
##$DTYPP= 0
##$F1P= 14.0000005364418
##$F2P= -0.99999901652339
##$FCOR= 0.5
##$FTSIZE= 32768
##$FT_mod= 6
##$GAMMA= 0
##$GB= 0
##$INTBC= 1
##$INTSCL= 1
##$ISEN= 128
##$LB= 0.3
##$LEV0= 0
##$LPBIN= 0
##$MAXI= 10000
##$MC2= 0
##$MEAN= 0
##$ME_mod= 0
##$MI= 0
##$NCOEF= 0
##$NC_proc= -2
##$NLEV= 6
##$NOISF1= 0
##$NOISF2= 0
##$NSP= 0
##$NTH_PI= 0
##$NZP= 0
##$OFFSET= 16.44975
##$PC= 1
##$PHC0= -72.82886
##$PHC1= 6.098175
##$PH_mod= 1
##$PKNL= yes
##$PPARMOD= 0
##$PSCAL= 4
##$PSIGN= 0
##$REVERSE= no
##$SF= 250.130018071786
##$SI= 32768
##$SIGF1= 0
##$SIGF2= 0
##$SINO= 400
##$SIOLD= 32768
##$SREGLST= <1H.CDCl3>
##$SSB= 0
##$STSI= 32768
##$STSR= 0
##$SW_p= 5175.98343685301
##$SYMM= 0
##$S_DEV= 0
##$TDeff= 65536
##$TDoff= 0
##$TI= <Analysis number 999999
Compound Code 99
Book Reference 9
Project Code 9>
##$TILT= no
##$TM1= 0
##$TM2= 0
##$TOPLEV= 0
##$USERP1= <user>
##$USERP2= <user>
##$USERP3= <user>
##$USERP4= <user>
##$USERP5= <user>
##$WDW= 1
##$XDIM= 32768
##$YMAX_p= 436365724
##$YMIN_p= -115471
$$ End of Bruker specific parameters
$$ ---------------------------------
##NTUPLES= NMR SPECTRUM
##VAR_NAME=  FREQUENCY,     SPECTRUM/REAL,   SPECTRUM/IMAG
##SYMBOL=    X,             R,               I
##VAR_TYPE=  INDEPENDENT,   DEPENDENT,       DEPENDENT
##VAR_FORM=  AFFN,          ASDF,            ASDF
##VAR_DIM=   32768,         32768,           32768
##UNITS=     HZ,            ARBITRARY UNITS, ARBITRARY UNITS
##FACTOR=    0.157963299565203, 1,           1
##FIRST=     4114.57648996055, 0,            0
##LAST=      -1061.40694689246, 0,           0
##MIN=       -1061.40694689246, -115471,     0
##MAX=       4114.57648996055, 436365724,    0
$$ Real data points
##PAGE= N=1
##DATA TABLE= (X++(R..R)), XYDATA
$$ [...]
15327b118J1639P060L89n588J786J654q76j496L1q338J4K365p088O407J3884N506
$$ -2118 9521 16581 16970 11382 13168 14822 13946 12450 12481 4143 4157 6522 -566 5841 19725 25231
15311B5231r557l150p893j446J1237M641j0627p692K35P500k431p382K710k386
$$ 25231 15674 12524 4631 3185 14422 19063 8436 744 979 8479 6048 -1334 1376 -1010
15297a010J8857M817n690l562k018j8310j2130P265J4615N808n145L697M566j663
$$ -1010 17847 22664 16974 13412 11394 -6916 -19046 -11781 2834 8642 3497 7194 11760 10097
15283A0097j011M576q044J952l056L860J717N853k082j485O844q450k609n117
$$ 10097 9086 13662 5618 7570 4514 8374 10091 15944 13862 12377 19221 10771 8162 3045
15269C045k026o80N634N089J030k093O713l849j3392m410J624N715j1990K083
$$ 3045 1019 339 5973 11062 12092 9999 16712 12863 -529 -4939 -3315 2400 -9590 -7507
15255g507Q89J3784J5863N109q196n711o94N139Q062k239J975k120r291M195L136
$$ -7507 -6618 7166 23029 28138 19942 14231 13537 18676 26738 24499 26474 24354 15063 19258 22394
15240B2394N310j0104n890l161L091K742P407N252m358j4246p132O221j1093n673
$$ 22394 27704 17600 11710 8549 11640 14382 21789 27041 22683 8437 1305 7526 -3567 -9240
15226i240Q985K808M034N779n053l611Q339r2P43j2497q515J1950J414J6876O04
$$ -9240 -255 2553 6587 12366 7313 3702 12041 11949 12692 195 -8320 3630 5044 21920 22524
15211B2524q586J888L712m431O777L998j1742o748j2291P250q67o909k600n430
$$ 22524 13938 15826 19538 15107 21884 25882 14140 7392 -4899 2351 1484 -5425 -8025 -13455
15197a3455M945l275N410Q871M433K929j096J0072O716p885j3012l030R096o47
$$ -13455 -8510 -11785 -6375 2496 6929 9858 8762 18834 25550 17665 4653 1623 10719 10072
15183A0072O695M06n082M753o545n110K605k127k62q96k133p983J640J4707O120
$$ 10072 16767 17173 12091 16844 10299 5189 7794 5667 5405 4509 2376 -5607 -3967 10740 16860
15168A6860N916K928p258r768o75P381N635m091M032j347N30k843l519O49O674
$$ 16860 22776 25704 18446 8678 8003 15384 21019 16928 20960 19613 20143 17300 13781 14430 21104
15153B1104j0322j2077R177O516R378K060j7414N45k695j5707k555J6366R039
$$ 21104 10782 -1295 7882 14398 23776 25836 8422 8967 6272 -9435 -11990 4376 13415
15140A3415l051Q367K002l526j2944p316K172R698P822J441P322k552j3769O518
$$ 13415 10364 18731 20733 17207 4263 -3053 -881 8817 16639 18080 25402 22850 9081 15599
15126A5599j3197l840O903N516M824l702l782k36m525M215q217r808R740Q072
$$ 15599 2402 -1438 5465 10981 15805 12103 8321 8085 3560 7775 -442 -10250 -510 7562
15112G562N275L749J57l452j3459k348M561J0710J290j0332N818R501P697m96
$$ 7562 12837 16586 16743 13291 -168 -2516 2045 12755 14045 3713 9531 19032 26729 26233
15098B6233o784N547R887j5512j0037j779N8M638O546M789o474K073R00L407L998
$$ 26233 19449 24996 34883 19371 9334 7555 7613 12251 18797 23586 17112 19185 20085 23492 27490
15083B7490j478J4725j060j2713K924k774q851l833J0796K747K575N492o544j0734
$$ 27490 26012 40737 39677 26964 29888 27114 18263 14430 25226 27973 30548 36040 29496 18762
15069A8762M014j1958q929j409l324l99O496J5191N024p862O023J2121M31j0242
$$ 18762 22776 10818 1889 480 -2844 -3243 3253 18444 23468 15606 21629 33750 34181 23939
15055B3939l661J235r439j47l774j437K857o94M414J3163k740j2037k987J2194
$$ 23939 20278 21513 12074 11927 8153 6716 9573 8879 13293 26456 23716 11679 8692 20886
15041B0886m545n143J608R812J1328Q356j0374j2800j0170o740L769P257N700
$$ 20886 16341 11198 12806 22618 33946 42302 31928 19128 8958 2218 5987 13244 18944
15028A8944j090m890P578R481N580n987j1700o23Q631k6n898P241l930o928m69
$$ 18944 17854 12964 20542 30023 35603 29616 17916 17293 25924 25898 20000 27241 23311 16383 15914
15013A5914r74N930J0069r58K485n886n819j86P864o35M90j225j280K684N106
$$ 15914 14940 20870 30939 29981 32466 26580 20761 20575 28439 27804 28294 27069 25789 28473 33579
14998C3579J1667n499j4527n28l213M747J3553q749j6571J546J0632P978J682
$$ 33579 45246 39747 25220 24692 21479 26226 39779 31030 14459 16005 26637 34615 36297
14985C6297R374J267p329o815l219J579j583o317j879l599N665N395p530N381
$$ 36297 45671 46938 39609 32794 29575 31154 29571 23254 21375 17776 23441 28836 21306 26687
14971B6687N562J1131O352m111Q938O68K243m001l83m481k763J3614j9116o762
$$ 26687 32249 43380 49732 45621 54559 55227 57470 53469 53086 48605 45842 59456 40340 33578
14957C3578P93N63o471m495L105k401k604K217J4418J4425q299L057L952p122
$$ 33578 34371 34934 28463 23968 27073 24672 22068 24285 38703 53128 44829 47886 51838 44716
14943D4716j1342o595K15K020m463N683M207L18J548l162m469K595p673k789R7
$$ 44716 33374 26779 26994 29014 24551 30234 34441 34759 36307 33145 28676 31271 23598 20809 20906
14928B0906O360Q232j7966j574J579J849m341K553Q384J7437M080o508k152j241
$$ 20906 27266 35498 17532 15958 17537 19386 15045 17598 25982 43419 47499 40991 38839 37598
14914C7598L62j534k693n274J376J351j1446p084Q158l32J3187J7674l79p025
$$ 37598 37960 36426 33733 28459 29835 31186 19740 12656 20814 20482 33669 51343 50964 43939
14900D3939k57J956O613o568J768L663m246k58n889Q249O772m134J0765m091k890
$$ 43939 43682 45638 52251 45683 47451 51114 46868 46610 40721 48970 55742 51608 62373 58282 55392
14885E5392J5930J11m058q570o118M958n579j1123O932n590o58J0685K880M624
$$ 55392 71322 71433 67375 58805 52687 57645 52066 40943 47875 42285 41627 52312 55192 59816
14871E9816J3722k165m139K201n715j1504Q194N398J2244P86q140M297j275K134
$$ 59816 73538 71373 67234 69435 63720 52216 60410 65808 78052 78838 70698 74995 73720 75854
14857G5854K977k758m945j24l911l474p950l06N532o224n0L959J803L116n454
$$ 75854 78831 76073 71128 71004 67093 63619 55669 55363 60895 54671 54621 58580 60383 63499 58045
14842E8045O248j992o957O769N608q493o56o667J9992J6004m334J579o897j7033
$$ 58045 64293 62301 55344 62113 67721 59228 58572 51905 71897 87901 83567 85146 78249 61216
14828F1216k233O385J3985P828q236K731j428M435l003J0480N588N874M98k0098
$$ 61216 58983 65368 79353 87181 78945 81676 80248 84683 81680 92160 97748 103622 104120 84022
14814H4022j937J2488K411k975Q324p924L575J4608J6018K264r367p220p706O188
$$ 84022 82085 94573 96984 94009 102333 94409 97984 112592 128610 130874 121507 114287 106581 112769
14800A12769R234L581m815j784N851k694M25j169o618M320m886J0323M809j0206
$$ 112769 122003 125584 120769 118985 124836 122142 122567 121398 114780 119100 114214 124537 129346 119140
14786A19140o463j1318J986L024j385k990P178J2179n059N463J999O019k281K82
$$ 119140 112677 101359 103345 106369 104984 101994 109172 121351 116292 121755 123754 129773 127492 127774
14772A27774Q59k484q375n03J3751O023O285j652l395O708P548p402n450K009
$$ 127774 128633 126149 117774 117271 131022 137045 143330 141678 138283 144991 152539 145137 139687 141696
14758A41696M947r813J554M206Q200Q198N737J205o11K903J9496q260j9573r599
$$ 141696 146643 136830 138384 142590 150790 158988 164725 165930 165319 168222 187718 179458 159885 150286
14744A50286J885R482J329O774R161P56n231k946M210J1762J4974J0483R27J044
$$ 150286 152171 161653 162982 169756 178917 179673 174442 171496 175706 187468 202442 212925 213852 214896
14730B14896k010r44R616j28m920k037j059J1451J451R41j6877j1584J531K2034
$$ 214896 212886 211942 221558 221430 216510 214473 213414 224865 226316 227257 210380 198796 200327 222361
14716B22361J0861J1803k180j811R031J5252R639O742l148J287J506N743R940
$$ 222361 233222 245025 242845 241034 250065 265317 274956 281698 278550 279837 281343 287086 297026
14703B97026O999n939L856J5926J3235K275l809j0317M159Q872J2692J5693J7323
$$ 297026 304025 298086 301942 317868 331103 333378 329569 319252 323411 332283 344975 360668 377991
14690C77991R603J2971O68l711J0228O618R123R013j458K960L645Q165J490J6441
$$ 377991 387594 400565 401233 397522 407750 414368 423491 432504 431046 434006 437651 445816 447306 463747
14676D63747L1043K3911J2058q058m803R567J9808J8132J7984R791j2651J4343
$$ 463747 494790 518701 530759 522701 517898 527465 547273 565405 583389 593180 580529 594872
14664E94872K0987O428J8628J8711J6755J4119J5661j952J6980L1506K0609K1183
$$ 594872 615859 622287 640915 659626 676381 690500 706161 704209 721189 752695 773304 794487
14652G94487J9177J5428K2826L0793K7103J5742J9431J5174K1575K0190K6415
$$ 794487 813664 829092 851918 882711 909814 925556 944987 960161 981736 1001926 1028341
14641A028341K6337J9328K4307L7621L8090L4534L3376L9172M8092M2778K2604
$$ 1028341 1054678 1074006 1098313 1135934 1174024 1208558 1241934 1281106 1329198 1371976 1394580
14630A394580L6524L7411L1714L7932L2859L6245L3536M2679L5224L1839L4364
$$ 1394580 1431104 1468515 1500229 1538161 1571020 1607265 1640801 1683480 1718704 1750543 1784907
14619A784907K6858M4583M9351L7765K4867K7407L1791L6347M4200L7242K9653
$$ 1784907 1811765 1856348 1905699 1943464 1968331 1995738 2027529 2063876 2108076 2145318 2174971
14608B174971L2140L5226L1684L4267L1192J7296J7422K3507M3177M1597L6375
$$ 2174971 2207111 2242337 2274021 2308288 2339480 2356776 2374198 2397705 2440882 2482479 2518854
14597B518854K7588K6154L4347K7176M1423L5207K8155L6441L3550K7943L1718
$$ 2518854 2546442 2572596 2606943 2634119 2675542 2710749 2738904 2775345 2808895 2836838 2868556
14586B868556M0709L3356L1080J9858J4943K1786J8055K5668L5859K4047K6037
$$ 2868556 2909265 2942621 2973701 2993559 3008502 3030288 3048343 3074011 3109870 3133917 3159954
14575C159954J8327J7158P462J2326J0014K629J1865J2114P119n78P588o457j5743
$$ 3159954 3178281 3195439 3202901 3215227 3225241 3227870 3239735 3251849 3258968 3258390 3265978 3259521 3243778
14562C243778q691j7408j0177j4316k2177j9831k1571k1539o093k1678l4415k7020
$$ 3243778 3235087 3217679 3207502 3193186 3171009 3151178 3129607 3108068 3101975 3080297 3045882 3018862
14550C018862j3357k0581k4488k1978l3157k7423j7979j8116j5896k2976k4154
$$ 3018862 3005505 2984924 2960436 2938458 2905301 2877878 2859899 2841783 2825887 2802911 2778757
14539B778757k9844j7511k2556k3747k9130k8909k5540l9052k7184k5274l5224
$$ 2778757 2748913 2731402 2708846 2685099 2655969 2627060 2601520 2562468 2535284 2510010 2474786
14528B474786k5602l2129l2678k8835l0280l7897l4756k3107l1397m3783l7690
$$ 2474786 2449184 2417055 2384377 2355542 2325262 2287365 2252609 2229502 2198105 2154322 2116632
14517B116632m3719m3208m2025k8326k3417m5254n6204m1398k2301l1195m1155
$$ 2116632 2072913 2029705 1987680 1959354 1935937 1890683 1834479 1793081 1770780 1739585 1698430
14506A698430l0678l9094l1359l0844k9228l7695l1188l1572k0466k8609l9131
$$ 1698430 1667752 1628658 1597299 1566455 1537227 1499532 1468344 1436772 1416306 1387697 1348566
14495A348566l1492l0434m5521k7808j6681k2692q579j7550m3088l7854l0739
$$ 1348566 1317074 1286640 1241119 1213311 1196630 1173938 1165359 1147809 1104721 1066867 1036128
14484A036128j5523k2683k1723q05j4453m791k2290k6806j7265k0217k1039k0125
$$ 1036128 1020605 997922 976199 975394 960941 956150 933860 907054 889789 869572 848533 828408
14472H28408j8981j7112j487m052j2189j0824j8333j1720L050j9197j4973n616
$$ 828408 809427 792315 790828 786776 774587 763763 745430 733710 736760 717563 702590 696974
14460F96974m687j9321p586r27j2467k4995j5713j2456n786O17l464j1341m237
$$ 696974 692287 672966 665380 664453 651986 626991 611278 598822 593036 593653 590189 578848 574611
14447E74611k788m8p757j772j1934o377l158j8288n454o249m934r852j8038q783
$$ 574611 571823 571775 564018 562246 550312 543935 540777 522489 517035 510786 505852 496000 477962 469179
14433D69179N035k018o502k732k890P149J0258k620p332q462N14J457J1911j2831
$$ 469179 474214 472196 465694 462962 460072 467221 477479 474859 467527 459065 459579 461036 472947 460116
14419D60116j7174n633m827n748n537M744q960l287M570o816p407l669j381q792
$$ 460116 442942 437309 432482 426734 421197 425941 416981 413694 418264 411448 404041 400372 398991 390199
14405C90199l769K751k439r020j7630j4843N173M397L360P922M571K696o157q624
$$ 390199 386430 389181 386742 377722 360092 345249 350422 354819 358179 366101 370672 373368 367211 358587
14391C58587j6537p419O818o41r426j841Q450L493n188o413O814q546k7j0858
$$ 358587 342050 334631 341449 340808 331382 329541 337991 341484 336296 329883 336697 328151 328124 317266
14377C17266J429L251K869q61N263k58p459n179j567o206P052J9262L600j9766
$$ 317266 318695 321946 324815 323954 329217 328959 321500 316321 314754 308548 315600 334862 338462 318696
14363C18696J342Q306L42q188j082m281o399L815m34R9p113j463N664j249M604
$$ 318696 320038 328344 328686 320498 319416 315135 308736 312551 312117 312216 305103 303640 309304 308055 312659
14348C12659N114L802k349n461K673j1652R82K131J0080O936j6740j1238J4522
$$ 312659 317773 321575 319226 313765 316438 304786 305768 307899 317979 324915 308175 296937 311459
14335C11459l254j309q52n327M070R703l855j503k853K241O1N340r32p48N491
$$ 311459 308205 306896 306044 300717 304787 314490 310635 309132 306279 308520 308581 313921 312989 312241 317732
14320C17732R846n493m223M530J1628N072R730O410n162k935M010K847m821j043
$$ 317732 327578 322085 317862 322392 334020 339092 348822 355232 350070 347135 351145 353992 349171 348128
14306C48128p812L284k946j9741j523O456J1810P475J0968m641j0311J98m438
$$ 348128 340316 343600 340654 320913 319390 325846 337656 345131 356099 351458 341147 341345 336907
14293C36907L846k097j198J1691Q93l723j0603j701Q972o251l790P956Q741J2352
$$ 336907 340753 338656 337458 349149 350042 346319 335716 334015 342987 336736 332946 340902 349643 361995
14279C61995L351Q377K122j010Q68j6790j2162J1431O66p558m273l056K103R906
$$ 361995 365346 373723 375845 374835 375703 358913 346751 358182 358848 351290 347017 343961 346064 355970
14265C55970N996M066J504O996k93j4643m066J6819J329J19M679l95j2852N25
$$ 355970 361966 366032 367536 374532 374239 359596 355530 372349 373678 373797 378476 378081 365229 365754
14251C65754J912L303L536j4814n768J508N248J6252K234k171l257r208k784K377
$$ 365754 367666 370969 374505 359691 353923 355431 360679 376931 379165 376994 373737 364529 361745 364122
14237C64122L341O424o056n400J031K975O17l654R938O441Q04O6k451j6151r704
$$ 364122 367463 373887 367831 362431 363462 366437 367054 363400 373338 379779 380583 380649 378198 362047 352343
14222C52343O215N742l108k344j1690n865K78K402k951J3869M233j3010k211k888
$$ 352343 358558 364300 361192 358848 347158 341293 341571 343973 341022 354891 359124 346114 343903 341015
14208C41015k059q099o51l235q186R275Q29J298m49j2345r339m573k667J54k744
$$ 341015 338956 330857 330206 326971 318785 328060 328889 330187 329738 317393 308054 303481 300814 300968 298224
14193B98224J0713N231n076l888j0390O137N203p196k130o011m180k220Q92p146
$$ 298224 308937 314168 309092 305204 294814 300951 306154 298958 296828 290817 286637 284417 285309 278163
14179B78163j1856n442J765j1819Q66L450j193m216l770p586p337O900P071K667
$$ 278163 266307 260865 262630 250811 251677 255127 253934 249718 245948 238362 231025 237925 244996 247663
14165B47663l905q184l358l899O40j1439j4037k559N126J2025k856j8405q19J2986
$$ 247663 243758 235574 232216 228317 228957 217518 203481 200922 206048 218073 215217 196812 195993 208979
14151B08979j075m678j322j2010m418O05j13j1871n786L493Q443L481N558p35
$$ 208979 207904 203226 201904 189894 185476 186081 185968 174097 168311 171804 180247 183728 189286 188551
14137A88551j8250l380J57p582N45q859n811N543R735L090k742n479j110o504
$$ 188551 170301 166921 167078 159496 160041 151182 145371 150914 160649 163739 160997 155518 154408 147904
14123A47904o670Q159J7456k119p603r433m419k765o742q790O889P105j6857o869
$$ 147904 141234 149393 166849 164730 157127 147694 143275 140510 133768 124978 131867 138972 122115 115246
14109A15246j479l253j313M196O801M607Q97m943p920M13j1072j3210j247J2540
$$ 115246 113767 110514 109201 113397 120198 124805 125702 120759 112839 113252 102180 88970 87723 100263
14095A00263Q231P25j4514p650R024Q384P819P882r259o867N105p586o652Q62
$$ 100263 108494 109219 94705 87055 96079 104463 112282 120164 110905 104038 109143 101557 94905 95767
14081I5767j589j4652P935J0839j866q50n190l184k390r258m238N247Q487J2123
$$ 95767 94178 79526 87461 98300 96434 95584 90394 87210 84820 75562 71324 76571 85058 97181
14067I7181L680j7161m056o171M234Q899o906p855k39N381p57o162o85j882r869
$$ 97181 100861 83700 79644 73473 77707 86606 79700 71845 71606 76987 76230 70068 69383 67501 57632
14052E7632j90M212L666M057k123O918J444K569n069j2940q95p801j219N743R094
$$ 57632 57442 61654 65320 69377 67254 74172 75616 78185 73116 60176 59281 51480 50261 56004 65098
14037F5098Q015L770o346n055M37P255P881Q717p230o170O487K886l976O423q48
$$ 65098 73113 76883 70537 65482 65919 73174 81055 89772 82542 76372 82859 85745 81769 88192 87344
14022H7344M085J6143K2846N748n391K402M531p259o388M06J414L955LO957m046
$$ 87344 91429 107572 130418 136166 130775 133177 137708 130449 124061 124467 125881 129836 129839 136796 132750
14007A32750n002N655l054j0088q156r049k47j285j776K143R61N120j0399r933
$$ 132750 127748 133403 130349 120261 112105 103056 102809 101524 99748 101891 102852 107972 97573 87640
13993H7640q378K337M73O001O522J019j741K80o438o549P70j72O151J3316K645
$$ 87640 79262 81599 82072 88073 94595 95614 93873 94153 87715 81166 81936 81764 87915 101231 103876
13978A03876q367o187J3125K5166O307o254N688Q136Q24m51r09l284k755j9161
$$ 103876 95509 89322 102447 127613 133920 127666 133354 141490 142314 141863 140954 137670 134915 115754
13964A15754k0628l735q03K528M592j1100j1622j1760l314Q308q668O594J1644
$$ 115754 95126 91391 90588 93116 97708 86608 74986 63226 59912 68220 59552 66146 77790
13951G7790p368j4555j874r19Q850r510k533M860M648J0311j5879j0937P024K59
$$ 77790 70422 55867 53993 53074 61924 52414 49881 54741 59389 69700 53821 42884 49908 50167
13937E0167J996r195j0935K251P08k891n558Q842N140p8j01J2599Q424k819K310
$$ 50167 52163 42968 32033 34284 34992 32101 26543 35385 40525 40447 40346 52945 61369 58550 60860
13922F0860p770p009k362P980j133N048j513m978M483j397n996Q264K468j0706
$$ 60860 53090 46081 43719 51699 50566 55614 54101 49123 53606 52209 46213 54477 56945 46239
13908D6239r579j1542o134J0570q95M472R116J1907n503r988q428p313J1228K107
$$ 46239 36660 25118 18984 29554 28659 33131 42247 54154 48651 38663 30235 22922 34150 36257
13894C6257o450l098J246k428N003l14n933J08L870R576K594j314J619J0240L806
$$ 36257 29807 26709 27955 25527 30530 30216 24283 24391 28261 37837 40431 39117 40736 50976 54782
13879E4782j553r160j1303o055j475K192k066L442L944M951O220O455n118j658
$$ 54782 53229 44069 32766 26711 25236 27428 25362 28804 32748 37699 43919 50374 45256 43598
13865D3598j951O902O355j0056k0714r039J2068j667m616N756r109r140j398n934
$$ 43598 41647 48549 54904 44848 24134 15095 27163 25496 20880 26636 17527 8387 6989 1055
13851A055j604J0557R963o525r880l04J2197N856J458J1975n60p500M537k852
$$ 1055 -549 10008 19971 13446 3566 3262 15459 21315 22773 34748 34188 26688 31225 28373
13837B8373m599j0303j422R568P592J232o964L411N483P022N639l299n526j8763
$$ 28373 23774 13471 12049 21617 29209 30441 23477 26888 32371 39393 45032 41733 36207 17444
13823A7444j4827J4403J7466k51p740K240k043J0096M932o786r46k607j0359q612
$$ 17444 2617 17020 34486 34235 26495 28735 26692 36788 41720 34934 33988 31381 21022 12410
13809A2410n369Q929O013K896l04N265m102l462j541J3805n27j2044n54J0343
$$ 12410 7041 15970 21983 24879 24575 29840 25738 22276 20735 34540 34013 21969 21415 31758
13795C1758J902O76J0043Q097q831l343Q416J59j5019L565J0934l987k091J745
$$ 31758 33660 34336 44379 52476 43645 40302 48718 48877 33858 37423 48357 44370 42279 44024
13781D4024j067N265m389n466k052O498q528M253Q400Q838P263j345o20j6785
$$ 44024 42957 48222 43833 38367 36315 42813 34285 38538 46938 55776 63039 61694 61074 44289
13767D4289K571J670k558q114l389O176K968L462n824J585o73l019L037k719m043
$$ 44289 46860 48530 45972 37858 34469 40645 43613 47075 41251 42836 42163 39144 42181 39462 35419
13752C5419L06J0228N766k733j5953l802K007L805o16M726N161k275k419J0351
$$ 35419 35725 45953 51719 48986 33033 29231 31238 35043 34427 39153 44314 42039 39620 49971
13738D9971l984j1227n645j518m463O379Q102J0724J0188J0087q22l816q074P74
$$ 49971 45987 34760 29115 27597 23134 29513 37615 48339 58527 68614 67792 63976 55902 56676
13724E6676O939k2327m117M144O496P673K922N845Q63p86k432J2627J6796N516
$$ 56676 63615 41288 37171 41315 47811 55484 58406 64251 65114 64328 61896 74523 91319 96835
13710I6835R70m424l381l131q54M625P88l48k984j925J0664k645j2099J8203J1948
$$ 96835 97805 93381 90000 86869 86015 90640 91428 91080 88096 86171 96835 94190 82091 100294 112242
13695A12242q932j0550j2612K499J3104N895m441j713J1360M324k346N670L557
$$ 112242 103310 92760 80148 82647 95751 101646 97205 95492 106852 111176 108830 114500 118057
13682A18057O3j2574L502K98J3760J4335P112J3973l498k459K833R823K0948J0318
$$ 118057 118120 105546 109048 109346 123106 137441 144553 158526 155028 152569 155402 165225 186173 196491
13668A96491l926l367j868R704o069j6619j56j332N741P852J0893O619Q802O846
$$ 196491 192565 189198 187330 197034 190965 174346 174190 172858 178599 186451 197344 203963 212765 219611
13654B19611q018N622O179J631n281Q807N437J0506J2548K0086N531p622j639
$$ 219611 211593 217215 223394 225025 219744 228551 233988 244494 257042 277128 282659 275037 273398
13641B73398J1270J5281Q600P254O911J7405P315N093J9317J6427K2939J5439
$$ 273398 284668 299949 308549 315803 322714 340119 347434 352527 371844 388271 411210 426649
13629D26649L1731K3023K4743K1773J6543M401J6266J6848K7403K6021R928J7668
$$ 426649 458380 481403 506146 527919 544462 548863 565129 581977 609380 635401 645329 662997
13617F62997L0842L9752L9399N0114N0359M6862N2565O2583P0306Q0703P1725
$$ 662997 693839 733591 772990 823104 873463 920325 972890 1035473 1105779 1186482 1258207
13606A258207Q3519R6025R7810J08156J22261J26412J38223J45516J74351J99676
$$ 1258207 1341726 1437751 1535561 1643717 1765978 1892390 2030613 2176129 2350480 2550156
13596B550156K23340K35782K51384K83471L18728L58506M03361M55243N10355
$$ 2550156 2773496 3009278 3260662 3544133 3862861 4221367 4624728 5079971 5590326
13587E590326N75026O33344P04801P62490Q27761Q80655R23518R60334R69249
$$ 5590326 6165352 6798696 7503497 8265987 9093748 9974403 10897921 11858255 12827504
13578A2827504R30396Q53633P51706O15060M25334K22450K2642j67767l36545
$$ 12827504 13757900 14611533 15363239 15978299 16403633 16626083 16648725 16480958 16144413
13569A6144413m90612o06792o81077p12353p28144p19442o75331o28120n75075
$$ 16144413 15653801 15047009 14365932 13653579 12925435 12205993 11530662 10902542 10327467
13560A0327467n08114m49684l76533l08163k43683j89200j16114o6482j6978M5890
$$ 10327467 9819353 9369669 8993136 8684973 8441290 8252090 8135976 8069494 8052516 8098406
13550H098406J27510J92614K47850L18537L87062M69214N25044N83182O61366
$$ 8098406 8225916 8418530 8666380 8984917 9371979 9841193 10366237 10949419 11610785
13541A1610785P15591P31106P39271P28070O61916N53566M23341K58485Q1108
$$ 11610785 12326376 13057482 13796753 14524823 15186739 15740305 16163646 16422131 16503239
13532A6503239r3420k51967m21215n56886o71763p49642p86401p98075q00643
$$ 16503239 16409819 16157852 15736637 15179751 14507988 13758346 12971945 12173870 11373227
13523A1373227p60620p17837o79099o15374n57158n31630m95718m19918l89665
$$ 11373227 10612607 9894770 9215671 8600297 8043139 7511509 7015791 6595873 6206208
13514F206208l60080l30905l11311k76893k44656k40903k05187j87132j82431
$$ 6206208 5846128 5515223 5203912 4927019 4682363 4441460 4236273 4049141 3866710
13505C866710j63520j41455j34063j26727j19778j10612r9671r0701r2409p7677
$$ 3866710 3703190 3561735 3427672 3300945 3181167 3070555 2970884 2880183 2787774 2710097
13495B710097q3241o9091n0889n7710o3967n7846o3834m5673l6192m0488n0639
$$ 2710097 2626856 2557765 2506876 2449166 2385199 2327353 2263519 2217846 2181654 2141166 2090527
13484B090527m6379k6939k7961k7119l0564l6850k4162m2447m4027j8494k1344
$$ 2090527 2044148 2017209 1989248 1962129 1931565 1894715 1870553 1828106 1784079 1765585 1744241
13473A744241k7192k4932k7579k0292j8973k0581k5942j7181j5594k5748j7017
$$ 1744241 1717049 1692117 1664538 1644246 1625273 1604692 1578750 1561569 1545975 1520227 1503210
13462A503210k9433j9143j3266k0361k9163j9918p367q589j6732j7957j9066j3435
$$ 1503210 1473777 1454634 1441368 1421007 1391844 1371926 1364559 1355970 1339238 1321281 1302215 1288780
13450A288780k6005j4742j2387k2431k8196n393j5204k2635k1822q237q174j597
$$ 1288780 1262775 1248033 1235646 1213215 1185019 1179626 1164422 1141787 1119965 1111728 1103554 1101957
13438A101957j9912m137j9850k0282j6536j4100j9187j3326k1050j4683j9217
$$ 1101957 1082045 1077908 1058058 1037776 1021240 1007140 987953 974627 953577 938894 919677
13427I19677j5789r260O41j0813j9364n580j2046o253j1240k1637j5338j1774
$$ 919677 903888 894628 895269 884456 865092 859512 847466 841213 829973 808336 792998 781224
13415G81224j1074j1275k1126k9519k0445j7848j7800m313j1265k7574k5601k0980
$$ 781224 770150 758875 737749 708230 687785 669937 652137 647824 636559 608985 583384 562404
13403E62404o028k530j3325k5973r58j2062J46j5837j1003n815j6110j1786j1561
$$ 562404 556376 553846 540521 514548 513590 501528 501674 485837 474834 469019 452909 441123 429562
13390D29562n973j1266j6319l340p976o208q048j528j629k1861k3186K249P711
$$ 429562 423589 412323 396004 392664 384688 378480 370432 368904 367275 345414 322228 324477 332188
13377C32188m108J309O951j0212q293j5040j1455j0554k1208o758k287j2150j1295
$$ 332188 328080 329389 336340 326128 317835 302795 291340 280786 259578 252820 250533 238383 227088
13364B27088j5578j2501O454l068m252P733p585p077O621n889j0131j0977l443
$$ 227088 211510 199009 205463 202395 198143 205876 198291 191214 197835 191946 181815 170838 167395
13351A67395J3637m767j1400n090l895r306P187l666n343O36J1995l512O091l876
$$ 167395 181032 176265 164865 159775 155880 146574 153761 150095 144752 145388 157383 153871 159962 156086
13337A56086r620j2477m140J5499j952q024N130n42N750m567j2915j690l411q360
$$ 156086 146466 133989 129849 145348 143396 135372 140502 139960 145710 141143 128228 126538 123127 114767
13323A14767m496o207o245o236K758K316J0655j4689L473m902j8424l419R142
$$ 114767 110271 104064 97819 91583 94341 96657 107312 92623 96096 91194 72770 69351 78493
13310G8493Q752M929l745P12N302k010p395j1032j7583L040l041k436o123J631
$$ 78493 87245 92174 88429 89141 94443 92433 85038 74006 56423 59463 56422 53986 47863 49494
13296D9494J2024M280j480k268l098N43p05o935p131p081P368R962M196o7n089
$$ 49494 61518 65798 64318 62050 58952 59495 58790 51855 44724 37643 45011 54973 59169 59102 54013
13281E4013j6122k933J0015L381n812q403l25J0266J9913N222J253p294r636q023
$$ 54013 37891 34958 44973 48354 42542 34139 33814 44080 63993 69215 70468 63174 53538 45515
13267D5515L39J833J921R22q48m171k642p5J1473N461o900k543l374o548l010
$$ 45515 45854 47687 49608 50530 49682 45511 42869 42794 54267 59728 52828 50285 46911 40363 37353
13252C7353k76K289n838j1199Q497L939N360R867L444j4485l929M12r655j1300
$$ 37353 37077 39366 33528 22329 30826 34765 40125 49992 53436 38951 35022 35434 25779 14479
13238A4479q36J0471J1745P470P24k096l634r831N908Q09J1641J0015j3945m578
$$ 14479 13643 24114 35859 43329 44053 41957 38323 28492 34400 35209 46850 56865 42920 38342
13224C8342K455l414j4019L484l643Q415J337R451P190p965M83o646j2744Q493
$$ 38342 40797 37383 23364 26848 23205 31620 32957 42408 49598 41633 42116 35470 22726 31219
13210C1219L642Q63j19j1786o848K003M021k498N458J1123k840j3946j3936K472
$$ 31219 34861 35724 35605 23819 16971 18974 22995 20497 25955 37078 34238 20292 6356 8828
13196H828K498M457P807J741m819K877l864m247K391N630O8k505k614j116n47
$$ 8828 11326 15783 23590 25331 20512 23389 19525 15278 17669 23299 23367 20862 18248 17132 16585
13181A6585n237n059L047J7433J0853m921p401J248p813m568j2643j391J4288
$$ 16585 11348 6289 9336 26769 37622 32701 25300 26548 18735 14167 1524 133 14421
13168A4421N783l226m205n910J1836R858j490P410J386l834Q241O604m427j109
$$ 14421 20204 16978 12773 6863 18699 28557 27067 34477 35863 32029 40270 46874 42447 41338
13154D1338L522J363o483N446L785j328N549K713l072o632o089J963J3636J2228
$$ 41338 44860 46223 39740 45186 48971 47643 53192 55905 52833 46201 40112 42075 55711 67939
13140F7939N56Q566L801r598q230Q845Q099n771P437J4090J4089q81r08j215j3297
$$ 67939 68495 77061 80862 71264 63034 71879 79978 74207 81644 95734 109823 108942 108034 106819 93522
13125I3522l207P73k05R78J0401L174j5058j7280j8737O91R595J239j0291p032
$$ 93522 90315 91088 90883 91861 102262 105436 90378 73098 54361 55052 64647 65886 55595 48563
13111D8563l17j021q536L33J2413N313J64M811R108o828p605m262N705J4953J913
$$ 48563 48246 47225 38689 39022 51435 56748 56912 61723 70831 64003 56398 52136 57841 72794 74707
13096G4707R545J3909J3659K448p685n132j0605j1094q42J3178M183j0061K988
$$ 74707 84252 98161 111820 114268 106583 101451 90846 79752 78910 92088 96271 86210 89198
13083H9198l024j3169j1042K836J1888j8413m189L580O690j616n360N1K147j871
$$ 89198 86174 73005 61963 64799 76687 58274 54085 57665 64355 62739 57379 57430 59577 57706
13069E7706j3702o538l696k459q210L38P327q918P836l112q276J2510P475j2486
$$ 57706 44004 37466 33770 31311 23101 23439 30766 21848 29684 26572 18296 30806 38281 25795
13055B5795j5986L663m547l252q169J4433J0391j944n715q650m308R651L882o965
$$ 25795 9809 13472 8925 5673 -2496 11937 22328 20384 14669 6019 1711 11362 15244 8279
13041H279m15J6693M808j3324r343q660k530P781J0525N678N612O202P98L448
$$ 8279 7864 24557 29365 16041 6698 -1962 -4492 3289 13814 19492 25104 31306 32104 35552
13027C5552n313j6245j307Q130q3k2643n486J1253P269m964j913K445o897j1093
$$ 35552 30239 13994 12687 20817 20734 -1909 -7395 3858 11127 6163 4250 6695 -202 -11295
13013a1295K77R603m100l865k272p201J0251P804N329j185n689k778K344R795
$$ -11295 -11018 -1415 -5515 -9380 -11652 -18853 -8602 -798 4531 3346 -2343 -5121 -2777 7018
12999G018p66J152p381Q550j346q790K649M289J0127p230r952n173J7228J0625
$$ 7018 6252 7404 23 8573 7227 -1563 1086 5375 15502 8272 -1680 -6853 10375 21000
12985B1000m530j4630N138R273J2869o038r36Q464M070j8846j8479K817K924J473
$$ 21000 16470 1840 6978 16251 29120 23082 22146 30610 34680 15834 -2645 172 3096 4569
12971D569j2835J203K1802r16r081L431O807M283j940r533M250p955o891k387
$$ 4569 -8266 -7063 14739 13823 4742 8173 14980 19263 17323 7790 12040 4085 -2806 -5193
12957e193j357k200J2847N466j0749m444J104J506n117J1762k643L767k603j2470
$$ -5193 -6550 -8750 4097 9563 -1186 -5630 -4526 -3020 -8137 3625 982 4749 2146 -10324
12943a0324m968Q450P748O46J602n270O547J652k064q105N155J989O13O352M154
$$ -10324 -15292 -6842 906 1552 3154 -2116 4431 6083 4019 -4086 1069 3058 3671 10023 14177
12928A4177L942l453j956o153q769N576O02l105m578O088M451O341P002k902N08
$$ 14177 18119 14666 12710 6557 -2212 3364 3966 861 -3717 2371 6822 13163 20165 17263 17771
12913A7771Q462k288N284j3755m239K864k273K404J1552p26j5470j0098M621L15
$$ 17771 26233 23945 29229 15474 11235 14099 11826 14230 25782 25056 9586 -512 4109 4424
12899D424N893N07p881n96m575M581j972j804M98R20K619O800K86l050M91M510
$$ 4424 10317 10824 2943 2347 -2228 2353 381 -1423 -925 -5 2614 9414 9700 6650 7141 11651
12883A1651J26O93n432j8983j168O950K905O02P407o943m463Q658N425K432J550
$$ 11651 11777 12470 7038 -11945 -13113 -6163 -3258 -2656 4751 -2192 -6655 2003 7428 9860 11410
12868A1410p381m489o673J254J514R390N426N935Q06o863q817N575R684N739k737
$$ 11410 4029 -460 -7133 -5879 -4365 5025 10451 16386 17192 10329 1512 7087 16771 22510 19773
12853A9773q679J582j0048J845K109l527K67p701r583L699N709Q748k786p190
$$ 19773 11094 12676 2628 4473 6582 3055 3322 -4379 -13962 -10263 -4554 4194 1408 -5782
12839e782j194j107q026m534L086J1117J0689L581j5015L047J0553k439n953p021
$$ -5782 -6976 -8083 -16109 -20643 -17557 -6440 4249 7830 -7185 -4138 6415 3976 -1977 -8998
12825h998m846J0308n205r217L334M934J3150J126M900l432k2267q320J3072K393
$$ -8998 -13844 -3536 -8741 -17958 -14624 -9690 3460 4586 9486 6054 -16213 -24533 -11461 -9068
12811i068J645r436l964J4581M207k53M474N967P333o28j516p97j2771j1877k390
$$ -9068 -7423 -16859 -20823 -6242 -2035 -2288 2186 8153 15486 14858 13342 12545 -226 -12103 -14493
12796a4493L812J1820J1904k972j460M85O845k33K646J169q593m414j3229j1573
$$ -14493 -10681 1139 13043 10071 8611 9096 15941 15708 18354 19523 10930 6516 -6713 -18286
12782a8286K228O260n075j148o66Q242R958l750l435N815J104o791o632R106J0174
$$ -18286 -16058 -9798 -14873 -16021 -16687 -8445 1513 -2237 -5672 143 1247 -5544 -12176 -3070 7104
12767G104L586k295o045q298J976j089L613N182j632M18k767J773L407J0940j0944
$$ 7104 10690 8395 2350 -5948 -3972 -5061 -1448 3734 2102 2520 -247 1526 4933 15873 4929
12752D929n140o48Q43K30q252J119Q132L336L564k186M637q644j1749O377L272
$$ 4929 -211 -859 -16 214 -8038 -6919 1213 4549 8113 5927 10564 1920 -9829 -3452 -180
12737a80j65n54J550P959N241J267J139n970n011k884Q066l917k504R724j513
$$ -180 -345 -899 651 8610 13851 15118 16257 10287 5276 2392 10458 6541 4037 13761 12248
12722A2248j3357l823p22k262l632L357R784j072n455Q750l216j525J0431p41
$$ 12248 -1109 -4932 -5654 -7916 -11548 -8191 1593 521 -4934 3816 600 -925 9506 8765
12708H765m244O35j0446K771J5528m38q849Q291L398J0471M69j0970N548j691
$$ 8765 4521 5156 -5290 -2519 13009 12571 3722 12013 15411 25882 26351 15381 20929 19238
12694A9238j2326j4129n344K263O383L83j001q444m9q243N499N293k391m791O387
$$ 19238 6912 -7217 -12561 -10298 -3915 -3532 -4533 -12977 -13026 -21269 -15770 -10477 -12868 -17659 -11272
12679a1272L971n558k464J0808L802J667J0181K901o587j906o607K172M293R359
$$ -11272 -7301 -12859 -15323 -4515 -713 954 11135 14036 7449 5543 -1064 1108 5401 14760
12665A4760m056j089j734l024L062Q86r36Q308l134j7265J149j0757j289J1228
$$ 14760 10704 9615 7881 4857 7919 8805 7869 16177 13043 -4222 -3073 -13830 -15119 -3891
12651c891K938j1668J800r331L821P145L02J333Q052J3769K168j2831m803j653
$$ -3891 -953 -12621 -10821 -20152 -16331 -9186 -8884 -7551 501 14270 16438 3607 -1196 -2849
12637b849j1005J0579L714q803O454m49R64L472n618J840M942q28P7k29N493m094
$$ -2849 -13854 -3275 439 -8364 -1910 -2359 -1395 2077 -3541 -1701 3241 2413 2490 2261 7754 3660
12621C660k464K129N621l667K27N751K930N208n09j3568j0232J309k363q398J2870
$$ 3660 1196 3325 8946 5279 5506 11257 14187 19395 18886 5318 -4914 -3605 -5968 -14366 -1496
12606a496J2491K431j2016m940p838p860J441J7206J745l075Q513J14m6m929J091
$$ -1496 10995 13426 1410 -3530 -11368 -19228 -17787 -581 1164 -1911 6602 6716 6670 1741 2832
12591B832N785m564J955j532n821j637m480l44l038K208R772O663j0224o087O49
$$ 2832 8617 4053 6008 4476 -1345 -2982 -7462 -7806 -10844 -8636 1136 7799 -2425 -8512 -7863
12576g863k990L668P927J2670K532j6693j8770r904L414M830J4703J3291L066
$$ -7863 -10853 -7185 742 13412 15944 -749 -19519 -29423 -26009 -21179 -6476 6815 9881
12563I881o934q046n515j3809M134P465J1747K446L769M212j2178n825R108O244
$$ 9881 2947 -5099 -10614 -24423 -20289 -12824 -1077 1369 5138 9350 -2828 -8653 455 6699
12549F699M503J696m771n486p854n333J858L594K016p197n61O64j510L699k67
$$ 6699 11202 12898 8127 2641 -5213 -10546 -8688 -5094 -3078 -10275 -10836 -10172 -11682 -7983 -8250
12534h250m289K167k379k164P853K638p793O349R424l813m419q338o636J9217
$$ -8250 -12539 -10372 -12751 -14915 -7062 -4424 -12217 -5868 3556 -257 -4676 -13014 -19650 -433
12520d33R928j5892P277J987K203O947l120j5806M676Q175L967m13l923j4498
$$ -433 9495 -6397 880 2867 5070 12017 8897 -6909 -2233 5942 9909 9496 5573 -8925
12506h925n491m237J3210j205n459N065J4473J3876j2476m722Q409o50q374q055
$$ -8925 -14416 -18653 -5443 -6648 -12107 -7042 7431 21307 8831 4109 12518 11868 3494 -4561
12492d561q368L133J3774J0464l495k79o122j736m121m615L207J2644L464o153
$$ -4561 -12929 -9796 3978 14442 10947 10668 4546 2810 -1311 -5926 -2719 9925 13389 7236
12478G236l443K455p933r327n13j632M200L635R575K368j2081N863m821k231j647
$$ 7236 3793 6248 -1685 -11012 -11525 -13157 -8957 -5322 4253 6621 -5460 403 -4418 -6649 -8296
12463h296M336J225J625J2378J3701l881j7268j845j656J5797K305j3142n231
$$ -8296 -3960 -2735 -1110 11268 24969 21088 3820 1975 319 16116 18421 5279 48
12450D8K25k716R006N874k586j0103o141m382J462R938k187P329O408K442l996
$$ 48 273 -2443 6563 12437 9851 -252 -6393 -10775 -9313 625 -1562 5767 12175 14617 10621
12435A0621n612K039j972l682q0N833M010p267j0714n489m996J570J713O886J42
$$ 10621 5009 7048 5076 1394 1314 7147 11157 3890 -6824 -12313 -17309 -15739 -14026 -7140 -6998
12420f998N195Q257K046l893K935M739j5247j4245k598M688J0200O285o514l848
$$ -6998 -1803 6454 8500 4607 7542 12281 -2966 -17211 -19809 -15121 -4921 1364 -5150 -8998
12406h998n653J1498k924M322O396n82K256j315j250l493Q458M84r57J233L799
$$ -8998 -14651 -3153 -6077 -1755 4641 4059 6315 5000 3750 257 8715 9199 8242 9475 13274
12391A3274l440P851R184k496j1206j0084l9Q234m352n183o990j1696J282m072
$$ 13274 9834 17685 26869 24373 13167 3083 3044 11278 6926 1743 -5247 -16943 -15661 -19733
12377a9733N097P508M599o516K798k76J1985J0050r261N086j2137k3437m102K5550
$$ -19733 -14636 -7128 -2529 -9045 -6247 -6523 5462 15512 6251 11337 -800 -24237 -28339 -2789
12363b789L801l445j021R248O783j0666O100K112j000j1572k537N175n015L225
$$ -2789 1012 -2433 -3454 5794 12577 1911 8011 10123 9123 -2449 -4986 189 -4826 -1601
12349a601j2483J442Q213J1938N841k875J591J2129k782m462j0537p485n536L250
$$ -1601 -14084 -12642 -4429 7509 13350 10475 12066 24195 21413 16951 6414 -1071 -6607 -3357
12335c357Kj1123P871Q685m203J65R237m403K854Q099O325k34Q574L13j2667o005
$$ -3357 -3355 -14478 -6607 2078 -2125 -1960 7277 2874 5728 13827 20152 19918 28492 28805 16138 10133
12319A0133L523J124l5M064j416m019k740O68K040K342K068j6656j3207P67j020
$$ 10133 13656 14780 14745 18809 17393 13374 10634 11302 13342 15684 17752 1096 -12111 -11344 -12364
12304a2364n116l231N504Q933J6149o971m645p518O398J4590J2665n799r943q762
$$ -12364 -17480 -20711 -15207 -6274 9875 2904 -1741 -9259 -2861 11729 24394 18595 8652 -110
12290a10l099l847J0208N844j042J756O214O428J0993M444j2067K824n682J2116
$$ -110 -3209 -7056 3152 8996 7954 9710 15924 22352 33345 37789 25722 28546 22864 34980
12276C4980J5892R234l10j4552j7380l268K682q018j2839o832J2414N678j515
$$ 34980 50872 60106 59796 45244 27864 24596 27278 19260 6421 -411 12003 17681 16166
12263A6166m177p986P657R89q97n029j0798N123P327l869K027J411l393k462m008
$$ 16166 11989 4003 11660 12649 11752 6723 -4075 1048 8375 4506 6533 7944 4551 2089 -1919
12248a919J586N063k301j407l05K713N121R665P067J493m433l629M569J5752L20
$$ -1919 -333 4730 2429 1022 717 3430 8551 18216 25283 26776 22343 18714 23283 39035 39355
12233C9355L702R233M371l038J1801q037j717j798p994Q06j665p418p501q280
$$ 39355 43057 52290 56661 53623 65424 57387 55670 53872 45878 46684 45019 37601 30100 21820
12219B1820N67k754l955l8L247q168j1556K402N189O863q43P168k667j8733j8333
$$ 21820 22387 19633 15678 15640 18887 10719 -837 1565 6754 13617 12774 19942 17275 -1458 -19791
12204a9791k562J4063R504N157j0186k75r887p08J1192L134L412M867K339n880
$$ -19791 -22353 -8290 1214 6371 -3815 -4090 -13977 -14685 -3493 -359 3053 7920 10259 4379
12190D379J489k362J681J2920O3n065K996R44n185K6N593R541O051j3447j8402
$$ 4379 5868 3506 5187 18107 18170 13105 16101 17045 11860 11886 17479 27020 33071 19624 1222
12175A222N106J119N078o209m052k54l042J675M419O079O732m439r559Q49J0953
$$ 1222 6328 7447 12525 6316 2264 2010 -1032 643 5062 11141 17873 13434 3875 4724 15677
12160A5677Q068n618q360J537K262L882L92l26q940j3847N310K72R713o785j711
$$ 15677 23745 18127 9767 11304 13566 17448 17840 17514 8574 -5273 37 309 10022 3237 1526
12145A526r830P574J1081k453j179M729r514L049Q23R847K155k657m20R666M3
$$ 1526 -8304 -730 10351 7898 6719 11448 1934 4983 5806 15653 17808 15151 14731 24397 24440
12130B4440j3332j8444m861L62J6276K483j0101K322L010M352M27l650r350m555
$$ 24440 11108 -7336 -12197 -11835 4441 6924 -3177 -855 2155 6507 6934 3284 -6066 -10621
12116a0621L856k724J1566r616j4461k251J134M560m049J0009k410L845J804J3396
$$ -10621 -6765 -9489 2077 -7539 -22000 -24251 -23117 -18557 -22606 -12597 -15007 -11162 -9358 4038
12102D038Q000r377k008K546k344P492L461N999m751j637KN29o315q020k684J564
$$ 4038 12038 2661 653 3199 855 8347 11808 17807 13056 11419 11421 11950 5635 -2385 -5069 -3505
12086c505J0788Q85j1845p544k48q080N773P654J0057J590j3111j2114J2256J3817
$$ -3505 7283 8168 -3677 -11221 -11469 -19549 -13776 -6122 3935 5525 -7586 -19700 -7444 6373
12072F373j374p086k43j195n698k939l205K71K0104n562j0432jK642P693j114
$$ 6373 4999 -2087 -2330 -3525 -9223 -12162 -15367 -15096 5008 -554 -10986 -10987 -8345 -652 -1766
12057a766j158R263j077J465n954M374j859j3846K411L928l52j1309P140K800
$$ -1766 -2924 6339 5262 6727 773 5147 3288 -10558 -8147 -4219 -4571 -15880 -8740 -5940
12043e940n521J196m076l136P506K966k449j0289O282K25m507N413J284m110N189
$$ -5940 -11461 -10265 -14341 -17477 -9971 -7005 -9454 -19743 -13461 -13236 -17743 -12330 -11046 -15156 -9967
12028i967N610k765L055P739m488J0309R26j4254n040O015L066L048L993j745
$$ -9967 -4357 -7122 -4067 3672 -816 9493 10419 -3835 -8875 -2860 206 3254 7247 5502
12014E502j0382q180N683O126p359Q527j573j242O517p105j985N64R430k991k225
$$ 5502 -4880 -13060 -7377 -1251 -8610 -83 -1656 -2898 3619 -3486 -5471 -4907 4523 1532 -693
11999f93J586Q61M483m142j0267N278m065j22J435n033k182M893l293r323q559
$$ -693 893 1754 6237 2095 -8172 -2894 -6959 -7081 -5646 -10679 -12861 -7968 -11261 -20584 -29143
11984b9143N088M529K0434n992O564J0150o89j0062j727n875j1548M063k025J025
$$ -29143 -24055 -19526 908 -5084 1480 11630 10941 879 -848 -6723 -18271 -14208 -16233 -15208
11970a5208R769J3296J0709r939j3321j0528K808J7871P404j2786j0110k561K455
$$ -15208 -5439 7857 18566 8627 -4694 -15222 -12414 5457 12861 75 -10035 -12596 -10141
11957a0141R926R387n652l122P354P720l518M020k002n823n094N827o055n043
$$ -10141 -215 9172 3520 398 7752 15472 11954 15974 13972 8149 3055 8882 2827 -2216
11943b216N333n245n162M767k976J6835q629n877L779m347k03L723O649j017o290
$$ -2216 3117 -2128 -7290 -2523 -5499 11336 2707 -3170 609 -3738 -3941 -218 6431 5414 -876
11928h76J484j0312m777M461N136M613o57j788L676n84q22m423n008j5810o785
$$ -876 608 -9704 -14481 -10020 -4884 -271 -928 -2716 960 376 -446 -4869 -9877 -25687 -32472
11913c2472R131J6164J0748J933k537o188o726N099m609O602m891p372R954N000
$$ -32472 -23341 -7177 3571 5504 2967 -3221 -9947 -4848 -9457 -2855 -7746 -15118 -5164 -164
11899a64j2937j247J851J894M532L088l623q790K618O232J423Q034M953j1768
$$ -164 -13101 -14348 -12497 -10603 -6071 -2983 -6606 -15396 -12778 -6546 -5123 2911 7864 -3904
11885c904j2423l948j876O084L485R825l661m505k427P357L857K589R968j4037
$$ -3904 -16327 -20275 -22151 -16067 -12582 -2757 -6418 -10923 -13350 -5993 -2136 453 10421 -3616
11871c616o068L143j900K537J5866O022k758o283K29m27o753M97Q010K414o034
$$ -3616 -9684 -6541 -8441 -5904 9962 15984 13226 6943 7172 6745 -8 489 8499 10913 4879
11856D879q394n195L295o968Q754N666m422j6466l675j0685j907Q09n478Q604
$$ 4879 -3515 -8710 -5415 -12383 -3629 2037 -2385 -18851 -22526 -33211 -35118 -34309 -39787 -31183
11842c1183J1552J5778O315K150P997R553l31q105o532l216k004N389o884r631
$$ -31183 -19631 -3853 2462 4612 12609 22162 21831 13726 7194 3978 1974 7363 479 -9152
11828i152K80r725M879p22m549L462k90L247P283J511q56m329M307j473j743k890
$$ -9152 -8872 -18597 -13718 -14440 -18989 -15527 -15817 -12570 -5287 -3776 -4632 -8961 -4654 -6127 -7870 -10760
11812a0760N395M991L609n243k043j627q32P160J0720K916n538o782j3834Q3J0257
$$ -10760 -5365 -374 3235 -2008 -4051 -5678 -6510 650 11370 14286 8748 1966 -11868 -11785 -1528
11797a528J4397P083k773j6090j384L477q345l590P766K00k633q402P618K2390
$$ -1528 12869 19952 17179 1089 -295 3182 -5163 -8753 -987 -787 -3420 -11822 -4204 18186
11783A8186j77J096k972j2233n728n59l816K752M306Q54K464j3653N668M22Q073
$$ 18186 18009 19105 16133 3900 -1828 -2387 -6203 -3451 855 1709 4173 -9480 -3812 -3390 4683
11768D683K174j1967R37M840P47Q109K437j7741n994o430J1175J4468q511K132
$$ 4683 6857 -5110 -4173 667 1414 9523 11960 -5781 -11775 -18205 -7030 7438 -1073 1059
11754A059N626k804Q17l134r003M73J47l029o84M203K663L234J936N299j648r22
$$ 1059 6685 3881 4698 1564 -7439 -6966 -6819 -9848 -10532 -6329 -3666 -432 1504 6803 5155 4233
11738D233J777j0468K400R19j276L04K254l719l49J0821m939j1837K436J2602
$$ 4233 6010 -4458 -2058 -1139 -2415 -2111 143 -3576 -3925 6896 1957 -9880 -7444 5158
11724E158r490l704r3p689O250J1016R471O765J173k143o357q182J322O215j587
$$ 5158 -4332 -8036 -8129 -15818 -9568 1448 10919 17684 18857 16714 10357 2175 3497 9712 8125
11709H125q298k942M926O103j0265j179J312M373N946K1R18k786J421n43K257
$$ 8125 -173 -3115 1811 7914 -2351 -3530 -2218 2155 8101 8122 9040 6254 7675 7132 9389
11694I389O884q7p927m116L698N457N042L353j5736r767k990m479j94J122J954
$$ 9389 16273 16186 8259 4143 7841 13298 18340 21693 5957 -3810 -6800 -11279 -11473 -10351 -8397
11679h397Q340P914k212k589m163N869M145O897r627j2952m51K288J294m455J577
$$ -8397 -57 7857 5645 3056 -1107 4762 8907 15804 6177 -6775 -7226 -4938 -3644 -8099 -6522
11664f522M071P120k312n171K395O095j404j3981r459j034j082P653K989J0436
$$ -6522 -2451 4669 2357 -2814 -419 5676 4272 -9709 -19168 -20202 -21284 -13631 -10642 -206
11650b06Q839j0481j595J7639J1005L309o267n573q307m129P090P078m175p117
$$ -206 8633 -1848 -3443 14196 25201 28510 22243 16670 8363 4234 11324 18402 14227 7110
11636G110l312j220n00n453l818P354R239q63p230p768J1857j938r155r113N908
$$ 7110 3798 2578 2078 -3375 -7193 161 9400 8537 1307 -6461 5396 3458 -5697 -14810 -8902
11621h902J000M382q349p676k6R12J0520P861o14o180p560O705J637K910q171
$$ -8902 -7902 -3520 -11869 -19545 -19571 -18659 -8139 -278 -892 -7072 -14632 -7927 -6290 -3380 -11551
11606a1551P825J6730L231n845N722J634j810j3657q744j599L496l762K965J2790
$$ -11551 -3726 13004 16235 10390 16112 17746 15936 2279 -6465 -8064 -4568 -8330 -5365 7425
11592G425Q611m935j0349p394O723O135j0648k629j323m063o064K328K930n271
$$ 7425 16036 11101 752 -6642 81 6216 -4432 -7061 -8384 -12447 -18511 -16183 -13253 -18524
11578a8524M050q56J693Q000l053o590Q304Q209q393J635r07r38J591K404p781
$$ -18524 -14474 -15330 -13637 -5637 -8690 -15280 -6976 1233 -7160 -5525 -6432 -7370 -5779 -3375 -11156
11563a1156N431O503l415j5723j4374K627N293N475K694K737J2270N157M822j6478
$$ -11156 -5725 778 -2637 -18360 -32734 -30107 -24814 -19339 -16645 -13908 -1638 3519 8341 -8137
11549h137L111N601r640o501J0188J3223l981q841j0571k247K185J7357R624m845
$$ -8137 -5026 575 -9065 -15566 -5378 7845 3864 -4977 -15548 -17795 -15610 1747 11371 6526
11535F526m754r591m549j5489Q911J0069P483M703o879j7816N962N272P673p53
$$ 6526 1772 -7819 -12368 -27857 -18946 -8877 -1394 3309 -3570 -21386 -15424 -10152 -2479 -3232
11521c232r72l731j3142r677K697M570M613M108K163K252j582K858J2667p3p656
$$ -3232 -4204 -7935 -21077 -30754 -28057 -23487 -18874 -14766 -12603 -10351 -11933 -9075 3592 3519 -4137
11506d137M467m49L963o461j7359p716j1147j81J5775M630k700M143J7476k624
$$ -4137 330 -119 3844 -2617 -19976 -27692 -38839 -39020 -23245 -18615 -21315 -17172 304 -2320
11492b320j195k401Q522K680j4196j303J1264n005O601J310k723l288P354r613
$$ -2320 -3515 -5916 2606 5286 -8910 -10213 1051 -3954 2647 3957 1234 -2054 5300 -4313
11478d313q311j0250o228P686N465j0747K675N928J1700J000j657K983o057p361
$$ -4313 -12624 -22874 -29102 -21416 -15951 -26698 -24023 -18095 -6395 -5395 -7052 -4069 -10126 -17487
11464a7487J071J3277K816q479j0004j1033M832O817J1230N844M104R77l678J022
$$ -17487 -16416 -3139 -323 -8802 -18806 -29839 -25007 -18190 -6960 -1116 2988 3965 287 1309
11450A309n741m199l925j765q196J834O945P10N947J1196q269q677k902J0386
$$ 1309 -4432 -8631 -12556 -14321 -22517 -20683 -13738 -13028 -7081 4115 -4154 -12831 -15733 -5347
11436e347L455m533j0406P621n925k411q510P632N28n30j351o53j584J0299R892
$$ -5347 -1892 -6425 -16831 -9210 -15135 -17546 -26056 -18424 -17896 -18426 -19777 -20430 -22014 -11715 -1823
11421a823L100K664r850j5588K393J3689m000o889O589P75p397P518K448L53Q271
$$ -1823 1277 3941 -5909 -21497 -19104 -5415 -9415 -16304 -9715 -8940 -16337 -8819 -6371 -6018 2253
11406B253j7788m011R398P872l42r81k865q318j0683M584J3931K002j6976l828
$$ 2253 -15535 -19546 -10148 -2276 -2618 -3599 -6464 -14782 -25465 -20881 -6950 -4948 -21924 -25752
11392b5752m337l352n119O693J5202P413P1j2336j4653p309R984K1737K0572P26
$$ -25752 -30089 -33441 -38560 -31867 -16665 -9252 -9181 -21517 -36170 -43479 -33495 -11758 8814 9540
11378I540n568n932N7k779p6k414q470n85O089l345J928P997J2713k844l513j720
$$ 9540 3972 -1960 -1903 -4682 -4758 -7172 -15642 -16227 -10138 -13483 -11555 -3558 9155 6311 2798 1078
11362A078r17R375o105l650L015K57O62q726M252O924M603J7K61L546q101r985
$$ 1078 161 9536 3431 -219 2796 3053 3715 -5011 -759 6165 10768 10785 11046 14592 6491 -3494
11346c494o785j327l98M775J2278M479Q75R06J848q773n399k355k096k185o49
$$ -3494 -10279 -11606 -12004 -7229 5049 9528 10403 11309 13157 4384 -1015 -3370 -5466 -7651 -8300
11331h300R791Q119l713j3109m946P23J811O735p859p488P178J6222K627j4144
$$ -8300 1491 9610 5897 -7212 -12158 -11435 -9624 -2889 -10748 -18236 -11058 5164 7791 -6353
11317f353l886N932J635L146j2134P036Q955j825n27r257L19k392Q212O997J4831
$$ -6353 -10239 -4307 -2672 474 -11660 -4624 4331 2506 1979 -7278 -6959 -9351 -1139 5858 20689
11302B0689R076j3048k0273o254J618P91J2938L477q212J111m370K198l255K194
$$ 20689 29765 16717 -3556 -9810 -8192 -7401 5537 9014 802 1913 -2457 -259 -3514 -1320
11288a320L064N097P31J836l788n249k570J644j009N090j487L063n784p856Q14
$$ -1320 1744 6841 7572 9408 5620 371 -2199 -555 -1564 3526 2039 5102 -682 -8538 -7724
11273g724J3972J929j1654j408l738M744L324M026r45M869M050n043j463n115
$$ -7724 6248 8177 -3477 -4885 -8623 -3879 -555 3471 2526 7395 11445 6402 4939 -176
11259a76m650p840q49J7671R661j2049k617o598m819j351O81J518M128O108N87
$$ -176 -4826 -12666 -13515 4156 13817 1768 -849 -7447 -12266 -13617 -12936 -11418 -7290 -1182 -595
11244e95N534O203N963J664o636j5154n295J2739O846j639k564j1220q591J351
$$ -595 4939 11142 17105 18769 12133 -3021 -8316 4423 11269 9630 7066 -4154 -12745 -11394
11230a1394k667m561o041k954K996J326P974P647J001Q059J926K807R279L480
$$ -11394 -14061 -18622 -24663 -27617 -24621 -23295 -15321 -7674 -6673 1386 3312 6119 15398 18878
11216A8878j7311j5620J2919M82p503l0L815j4644m611J3110J844O07J3551m30
$$ 18878 1567 -14053 -1134 -652 -8155 -8185 -4370 -19014 -23625 -10515 -8671 -8064 5487 5057
11202E057j2133m33R454L748j3026l032j766k26K934j414R763L078n493q505r768
$$ 5057 -7076 -7509 1945 5693 -7333 -10365 -12131 -12357 -9423 -10837 -1074 2004 -3489 -11994 -21762
11187b1762p73N912j959R42k821l272P692J5317M092j5295m131J5919m638o888
$$ -21762 -22535 -16623 -18582 -17640 -20461 -23733 -16041 -724 3368 -11927 -16058 -139 -4777 -11665
11173a1665o48m53l339l001p124q576l443J6014J4122l22M466P066j4368j371
$$ -11665 -12313 -12766 -16105 -19106 -26230 -34806 -38249 -22235 -8113 -8435 -3969 3097 -11271 -12642
11159a2642n448N068R110L902o83j961l829Q190M749J193J466r757r272q599o235
$$ -12642 -18090 -13022 -3912 -10 -693 -2654 -6483 1707 6456 7649 9115 -642 -9914 -18513 -24748
11144b4748l396P302L572L298o11P128J710P769M336o922j4046M54J5694M161
$$ -24748 -28144 -20842 -17270 -13972 -14583 -7455 -5745 2024 6360 -562 -14608 -14154 1540 5701
11130E701p05o661p312n710k270J733N524P518Q097M656r745r611N021n646Q34
$$ 5701 4996 -1665 -8977 -14687 -16957 -15224 -9700 -2182 5915 10571 826 -8785 -3764 -9410 -8576
11115h576O522j984o760j620K415P967n425o856l105J185Q808J261o534J692Q910
$$ -8576 -2054 -4038 -10798 -12418 -10003 -2036 -7461 -14317 -17422 -16237 -7429 -6168 -12702 -11010 -2100
11100b100l249o808l837q84m089P487J0243J0244K075L953m099j7906O69l850
$$ -2100 -5349 -12157 -15994 -16878 -20967 -13480 -3237 7007 9082 13035 8936 -8970 -8301 -12151
11086a2151j200K731M810N057N219l427j0933N531p756j828J261O299m234q318
$$ -12151 -13351 -10620 -5810 -753 4466 1039 -9894 -4363 -12119 -13947 -12686 -6387 -10621 -18939
11072a8939L899J156M612L771J1310l010r44j349r198q819J0416N96N285J4382
$$ -18939 -15040 -13884 -9272 -5501 5809 2799 1855 506 -8692 -17511 -7095 -6499 -1214 13168
11058A3168l772q57q148j3937q694J0097J4076N157J2401p726j3676r744K15N80
$$ 13168 9396 8539 391 -13546 -22240 -12143 1933 7090 19491 11765 -1911 -11655 -11440 -10860
11044a0860j42l481L470L882j667j6263j350J1199J6533J2348q210m247P706o733
$$ -10860 -11002 -14483 -11013 -7131 -8798 -25061 -26411 -15212 1321 13669 5459 1212 8918 2185
11030B185p081k384N323o894N943L428p284l173j0740J3531J4027K527q869j4325
$$ 2185 -4896 -7280 -1957 -8851 -2908 520 -6764 -9937 -20677 -7146 6881 9408 539 -13786
11016a3786p491L344P214m4j395J4620O556j2221m501O215J1574L666m989j815
$$ -13786 -21277 -17933 -10719 -10763 -12158 2462 9018 -3203 -7704 -1489 10085 13751 8762 6947
11002F947J57j1300o596l026n270Q705L292Q167j4614j5412J3864j450j017J736
$$ 6947 7104 -4196 -10792 -13818 -19088 -10383 -7091 1076 -13538 -28950 -15086 -16536 -17553 -15817
10988a5817Q927Q792J585n174o038k383k258O128j587L599J2589o057k17J10K19
$$ -15817 -6890 1902 3487 -1687 -7725 -10108 -12366 -6238 -7825 -4226 8363 2306 2089 2199 2418
10973B418j1456K222R524m842J0336M088j6507O125R025J162l187o241j245p95
$$ 2418 -9038 -6816 2708 -2134 8202 12290 -4217 1908 10933 12095 8908 2667 1422 627
10959F27k250q349p403j911K23n278Q523J8327M479o207j1403O532Q626m67p94
$$ 627 -1623 -9972 -17375 -19286 -19063 -24341 -15818 2509 6988 781 -10622 -4090 4536 4069 3275
10944C275j8110N532J7266r884o108p70q543j266P740J6116O001k59N053k121
$$ 3275 -14835 -9303 7963 -1921 -8029 -8799 -17342 -18608 -10868 5248 11249 10990 16043 13922
10930A3922Q30Q184l933r686p970K713K97j541n746r518J31J185R450P563N290
$$ 13922 14752 22936 19003 9317 1347 4060 4357 2816 -2930 -12448 -12317 -11132 -1682 5881 11171
10915A1171K643m836o929j1151r374L064M371L341N311L831q463p534R58J640
$$ 11171 13814 8978 2049 -9102 -18476 -15412 -11041 -7700 -2389 1442 -7021 -14555 -13597 -11957
10901a1957N30J970K565K248J73n423N46O750M523J712K079N084K214j3551j8465
$$ -11957 -11427 -9457 -6892 -4644 -4471 -9894 -9348 -2598 1925 3637 5716 10800 13014 -537 -19002
10886a9002p736M730L493j149J179J3275k891R42J694l2k823L091O045q60j4567
$$ -19002 -26738 -22008 -18515 -19664 -18485 -5210 -8101 -7159 -5465 -5497 -8320 -5229 816 -44 -14611
10871a4611J316M20k745J0173Q493L213m047l533J334l550j0305M771O53Q13O304
$$ -14611 -13295 -12875 -15620 -5447 3046 6259 2212 -1321 13 -3537 -13842 -9071 -8418 -7605 -1301
10856a301k945k040L344Q817j537j0690j015J1759P606m792q994r890N093J4549
$$ -1301 -4246 -6286 -2942 5875 4338 -6352 -7367 4392 11998 7206 -1788 -11678 -6585 7964
10842G964L83q773K204R416O91q111R99o538J3559O819K188n908n785j559k331
$$ 7964 8347 -426 1778 11194 11885 3774 4773 -1765 11794 18613 20801 14893 9108 7549 5218
10827E218L620L139o20m384n36N131L53o778j5624k483p437R287L638j4142j752
$$ 5218 8838 11977 11357 6973 6437 11568 11921 5143 -10481 -12964 -20401 -11114 -7476 -21618 -23370
10812b3370j048K0918j546o375J298m116N156L222m550r895J3968O672M606j0331
$$ -23370 -24418 -3500 -5046 -11421 -10123 -14239 -9083 -5861 -10411 -20306 -6338 334 4940 -5391
10798e391K765M355m793J282M701P49j2162N191O518o16j147m605L405M001N913
$$ -5391 -2626 1729 -3064 -1782 2919 3668 -8494 -3303 3215 2599 1452 -3153 252 4253 10166
10783A0166m842o194j3073J017J5657j241J35q24n084J1085K391m032j7957J779
$$ 10166 5324 -870 -13943 -12926 2731 1490 1625 801 -4283 6802 9193 5161 -12796 -11017
10769a1017L590j5272L653J1369J1156J229n245J458N522r526j9392q32J0783
$$ -11017 -7427 -22699 -19046 -7677 3479 4708 -537 921 6443 -3083 -22475 -23307 -12524
10756a2524L336o214j1307J133R805K130l170Q20O118Q316O787m58j2732r045
$$ -12524 -9188 -15402 -26709 -25576 -15771 -13641 -16811 -15991 -9873 -1557 5230 4772 -7960 -17005
10742a7005J0503Q623Q286j959m047K47j270O88l57R988l347l54J177L808N154
$$ -17005 -6502 2121 10407 8448 4401 4648 3378 4066 3709 13697 10350 9996 11173 14981 20135
10727B0135k922j0340q925j794N146r98l745p312j317k416J501k672M311N67O331
$$ 20135 17213 6873 -2052 -3846 1300 302 -3443 -10755 -12072 -14488 -12987 -15659 -11348 -10781 -4450
10712d450L540J693J1929l914j4117p670q898Q490J0358l851M756p051K824j1286
$$ -4450 -910 783 12712 8798 -5319 -12989 -21887 -13397 -3039 -6890 -2134 -9185 -6361 -17647
10698a7647p814j800p30M27J1190M647j115K269R082O701M858j4217p478M576
$$ -17647 -25461 -27261 -27991 -27564 -16374 -11727 -12842 -10573 -1491 5210 10068 -4149 -11627 -7051
10684g051N571m18L606j489M866Q239L01r338O950M52k71j135j5745K35J3757
$$ -7051 -1480 -1898 1708 219 5085 13324 13625 4287 11237 11689 11418 10283 -5462 -5227 8530
10669H530Q634q164r163L07M312J086l018L190J0883P523l930m490j1945j0033
$$ 8530 17164 9000 -163 144 4456 5542 2524 5714 16597 24120 20190 15700 3755 -6278
10655f278l086J2137J2454o040n37j3224N549L836p796L35k199L36O93L777k8
$$ -6278 -9364 2773 15227 9187 8650 -4574 975 4811 -2985 -2650 -4849 -4513 -3820 -43 -71
10640g1j889p90J2206l141n136N208M274l971r426k252J6100L613J2008J5667
$$ -71 -1960 -2750 9456 6315 1179 6387 10661 6690 -2736 -4988 11112 14725 26733 42400
10626D2400K1501J3864K002j7113k6169k167o250j6477o92O361Q598o827p315
$$ 42400 63901 77765 79767 62654 36485 34318 28068 11591 10899 17260 25858 19031 11716
10613A1716L1p775q556q928N116J661j429o622J701J505N195K796l537k933m284
$$ 11716 11747 3972 -4584 -13512 -8396 -6735 -8164 -14786 -13085 -11580 -6385 -3589 -7126 -10059 -14343
10598a4343K028n155Q81J6704J2639l913l454l893K175L691m162o361j146J2464
$$ -14343 -12315 -17470 -16589 115 12754 8841 5387 1494 3669 7360 3198 -3163 -4309 8155
10584H155O631J2572J5911Q587P500J2970o49j7188n937m76j0003j4613p981n610
$$ 8155 14786 27358 43269 51856 59356 72326 71677 54489 48552 48076 38073 23460 15479 9869
10570I869P945P53m888j5875j7092k420N200N601O47j404k963k480j723P784q451
$$ 9869 17814 18567 13679 -2196 -19288 -21708 -16508 -10907 -10260 -11664 -14627 -17107 -18830 -11046 -19497
10555a9497m784K06p217N539J4762M079J7241M98J943M234k45J0957j139m018
$$ -19497 -24281 -24075 -31292 -25753 -10991 -6912 10329 10827 12770 17004 16759 27716 26577 22559
10541B2559r138k98j2718R456P324J324j295n703n833l771j516M695q639Q885
$$ 22559 13421 13123 405 9861 17185 18509 17214 11511 5678 1907 391 5086 -3553 5332
10527E332P443q372j1416O208P848K746o557n147o042p415k731J7859O499p812
$$ 5332 12775 4403 -7013 -805 7043 9789 3232 -1915 -7957 -15372 -18103 -244 6255 -1557
10513a557o445R625O130R27m766K014O679N575r799j865K717j0524j4069j3561
$$ -1557 -8002 1623 7753 8680 3914 5928 12607 18182 8383 6518 9235 -1289 -15358 -28919
10499b8919P784J7256M386q399n838n090J1697p73j574K054K398P610J2392J081
$$ -28919 -21135 -3879 507 -7892 -13730 -18820 -7123 -7896 -9470 -7416 -5018 2592 14984 16065
10485A6065j3170l167J490l169j2882N475P767M260p094l335k31o437Q743J2850
$$ 16065 2895 -272 1218 -1951 -14833 -9358 -1591 2669 -4425 -7760 -7991 -14428 -5685 7165
10471G165N904NJ1036m591n053k014p680j4846j0312j322M435J2567O286k182
$$ 7165 13069 13074 24110 19519 14466 12452 4772 -10074 -20386 -21708 -17273 -4706 1580 -602
10457f02J0698J0377L07k432j7316L264L486J001J1855P947M105n1o364k271P74
$$ -602 10096 20473 20780 18348 1032 4296 7782 8783 20638 28585 32690 32639 26275 24004 24778
10442B4778K5036L1763K0143q44j0170j1072j8139k0333j3442j1668m147J140
$$ 24778 49814 81577 101720 100876 90706 79634 61495 41162 27720 16052 11905 13045
10430A3045N57j171L550K387J372k129j3377n640n958m680k639P828L682J192
$$ 13045 13602 12431 15981 18368 19740 17611 4234 -1406 -7364 -12044 -14683 -6855 -3173 -1981
10416a981K862N220M868k261N723Q636k0059j3429J917O05P932L820o156j308
$$ -1981 881 6101 10969 8708 14431 23067 3008 -10421 -8504 -7899 33 3853 -2303 -3611
10402c611O952J235J797K212j0934n772l870J704l926m777n82J3757O815J5308
$$ -3611 3341 4576 6373 8585 -2349 -8121 -11991 -10287 -14213 -18990 -19572 -5815 1000 16308
10388A6308L956k859q842j3659L104M46j0983L428O955K691j1736j3353l310O
$$ 16308 20264 17405 8563 -5096 -1992 -1546 -12529 -9101 -2146 545 -11191 -24544 -27854 -27848
10374b7848j482J9824M619j654L182l732j0838N238J325j225n400M72Q894M809
$$ -27848 -29330 -9506 -4887 -6541 -3359 -7091 -17929 -12691 -11366 -12591 -17991 -17519 -8625 -3816
10360c816P325R710l33j5422j4955P039j651N362k458j5453K211R664K576o036
$$ -3816 3509 13219 12886 -2536 -17491 -10452 -12103 -6741 -9199 -24652 -22441 -12777 -10201 -16237
10346a6237m306k354M313K514q379j581J1574R244J794m175j6597J946P886J6508
$$ -16237 -20543 -22897 -18584 -16070 -24449 -26030 -14456 -5212 -3418 -7593 -24190 -22244 -14358 2150
10332B150K516M325M681K86k0632j1271m717o658n806P934J1426K114n302M160
$$ 2150 4666 8991 13672 13958 -6674 -17945 -22662 -29320 -35126 -27192 -15766 -13652 -18954 -14794
10318a4794l482k073Q726N892R205J4876K665j2757j4521O61l679Q790j567L610
$$ -14794 -18276 -20349 -11623 -5731 3474 18350 21015 8258 -6263 -5602 -9281 -491 -2058 1552
10304A552L587J894P473l755P332K120n872m293P892O443j2218j3098l327o50
$$ 1552 5139 7033 14506 10751 18083 20203 14331 10038 17930 24373 12155 -943 -4270 -4920
10290d920o67L742L206j1530j389L240P727L184j75P187j2255K388N45q713j134
$$ -4920 -5587 -1845 1361 -10169 -11558 -8318 -591 2593 2418 9605 -2650 -262 283 -8430 -9564
10275i564p27N851J1678j0302k922j605J3330J0940L443q62j1632q617O163K776
$$ -9564 -10291 -4440 7238 -3064 -5986 -7591 5739 16679 20122 19260 7628 -989 5174 7950
10261G950k652o396j0930k682J0032J7213J3217M12n557J703k1085j1912j511
$$ 7950 5298 -1098 -12028 -14710 -4678 12535 25752 26164 20607 22310 1225 -10687 -12198
10248a2198q877M33J4638k722k857J5318R128j2380j1014L85K606L453M31P094
$$ -12198 -21075 -20642 -6004 -8726 -11583 3735 12863 483 -10531 -10146 -7540 -4087 -3656 3438
10234C438J0768J2752n84j3183m339j0445q33J005J4388N524j3705j5045J262
$$ 3438 14206 26958 26374 13191 8852 -1593 -2426 -1421 12967 18491 4786 -10259 -8997
10221h997j3746l384J3271J2239j091p823L262R730n898o692P495j0875l858m443
$$ -8997 -22743 -26127 -12856 -617 -1708 -9531 -6269 3461 -2437 -9129 -1634 -12509 -16367 -20810
10207b0810j2297O029K425O143P057k104Q555N736j31j918n59P346j0937o769
$$ -20810 -33107 -27078 -24653 -18510 -11453 -13557 -5002 734 603 -1315 -1874 5472 -5465 -12234
10193a2234K945j642k466j0350L311P102P064J428K470R91J282r12r393J74J0119
$$ -12234 -9289 -10931 -13397 -23747 -20436 -13334 -6270 -4842 -2372 -1381 -99 -1011 -10404 -10230 -111
10178a11P96K97M520M101l357k512p007q169N237J205Q803J927p55j827J035n132
$$ -111 685 982 5502 9603 6246 3734 -3273 -11442 -6205 -5000 3803 5730 4975 3148 4183 -949
10162i49j2235m809q45J2971K114j670o373K88J749P932N21R17p927j37O302J5
$$ -949 -13184 -17993 -18838 -5867 -3753 -5423 -11796 -11508 -9759 -1827 -1306 -389 -8316 -8453 -2151 -2136
10146b136q34J304j1799o731J0044L33q772L151N469n533J137J0927L720m90k31
$$ -2136 -2970 -1666 -13465 -20196 -10152 -9819 -18591 -15440 -9971 -15504 -14367 -3440 280 -210 -441
10131d41J1858R090J0328J615J3712L089n506k716q565o490r155L828r275l740
$$ -441 11417 20507 30835 32450 46162 49251 43745 41029 32464 25974 16819 20647 11372 7632
10117G632k864J183j18J01k499k535J4089R503j020M940j6020n911m734j2173
$$ 7632 4768 5951 5833 5934 3435 900 14989 24492 23472 28412 12392 6481 1747 -10426
10103a0426j0718o68j114Q03P350n66O784M576M155K211J419n950j1165J376R978
$$ -10426 -21144 -21812 -22926 -22123 -14773 -15339 -8555 -3979 176 2387 3806 -2144 -13309 -11933 -1955
10088a955K671N229O035j916J1208J1495j2471k4354m913J602K824M501J277R634
$$ -1955 716 5945 11980 10064 21272 32767 20296 -4058 -8971 -7369 -4545 -44 1233 10867
10074A0867j3927K338l896J353L243j102k703M348K0228Q108j7454j5820M854
$$ 10867 -3060 -722 -4618 -3265 -22 -1124 -3827 521 20749 28857 11403 -4417 437
10061D37k44M732n019o532J3479N786m879o161o836N922M220m931o296J5483J5200
$$ 437 193 4925 -94 -6626 6853 12639 7760 1599 -5237 685 4905 -26 -6322 9161 24361
10046B4361l063n785q471Q414q928r334p814K196K864R551l56M523M147p854L00
$$ 24361 21298 15513 7042 15456 6528 -2806 -10620 -8424 -5560 3991 3635 8158 12305 4451 4751
10031D751q540N446N165q263j0795p128R730J1220q14n727q320L572K1603q93
$$ 4751 -3789 1657 6822 -1441 -12236 -19364 -9634 1586 772 -4955 -13275 -9703 11900 11007
10017A1007j1399L728o72j6955j2311j194O381J2630J8095q64r134M639L967q118
$$ 11007 -392 3336 2664 -14291 -26602 -27796 -21415 -8785 9310 8446 -688 3951 7918 -200
10003b00K758L462J643p195q977q502M523j552j010l521l252R559Q676k644o546
$$ -200 2558 6020 7663 468 -8509 -17011 -12488 -14040 -15050 -18571 -21823 -12264 -3588 -6232 -12778
9988a2778K470K966r220r726q556J5470N576J1268J790N968j2117p639N621L318
$$ -12778 -10308 -7342 -16562 -26288 -34844 -19374 -13798 -2530 -740 5228 -6889 -14528 -8907 -5589
9974e589P922K706q377p193r204k583L384J4284P455j369P612m03n967j0379l27
$$ -5589 2333 5039 -3338 -10531 -19735 -22318 -18934 -4650 2805 1436 9048 8645 2678 -7701 -8028
9959h028k086p554q486M429P243n288K063M882Q451Q952K801o118j505l447J22
$$ -8028 -10114 -17668 -26154 -21725 -14482 -19770 -17707 -12825 -4374 4578 7379 1261 -244 -3691 -3569
9944c569N24J5223Q225M7j1290j5828j0483o522Q284J4799n550M500K733k982
$$ -3569 -3045 12178 20403 20450 9160 -6668 -17151 -23673 -15389 -590 -6140 -1640 1093 -1889
9930a889K712L597o468M359P545m035m544K942J132n685j9801j6559P042J4549
$$ -1889 823 4420 -2048 2311 9856 5821 1277 4219 5351 -334 -20135 -36694 -29652 -15103
9916a5103Q853m139J792K61k635N966J042p041L202Q713L543j3556o212Q669O619
$$ -15103 -6250 -10389 -8597 -8336 -10971 -5005 -3963 -11004 -7802 911 4454 -9102 -15314 -6645 -26
9901b6l08p845j0542J186Q607J5546J0562l414J4180k552j0817n254r66J0182
$$ -26 -334 -8179 -18721 -17535 -8928 6618 17180 13766 27946 25394 14577 9323 8357 18539
9887A8539o098j7501j0681n043J975O483j4644O823J1575o622m487L882J243k524
$$ 18539 12441 -5060 -15741 -20784 -18809 -12326 -26970 -20147 -8572 -15194 -19681 -15799 -14556 -17080
9873a7080J0189J064Q762L2J0604P316o390JK262m774q801J894j1205m075R462
$$ -17080 -6891 -5827 2935 2967 13571 20887 14497 14498 16760 11986 3185 5079 -6126 -10201 -739
9858g39k520L453R416j063J647J5004J3468m397j819j0773q970o158o102K160
$$ -739 -3259 194 9610 8547 10194 25198 38666 34269 32450 21677 12707 6549 447 2607
9844B607L200K26q512J3068J2437K829k11o918p111j1335r20M494K320O922J7431
$$ 2607 5807 6033 -2479 10589 23026 25855 25644 18726 11615 280 -640 3854 6174 13096 30527
9829C0527O623j8893j3971k289n183L336J1041L879j5767j4734J7219J1597j818
$$ 30527 37150 18257 4286 1997 -3186 150 11191 15070 -697 -15431 1788 13385 11567
9816A1567j0132r624q689N594J6413L46J710P355M652m289j268k312N733p11j4901
$$ 11567 1435 -8189 -16878 -11284 5129 5475 7185 14540 19192 14903 13635 11323 17056 16345 1444
9801A444J10J0008M567O242N899n958j0281k685n849r190O176J3160M501o681
$$ 1444 1554 11562 16129 22371 28270 22312 12031 9346 3497 -5693 483 13643 18144 11463
9787A1463p325j4705q301l656J1642J1415J8432J732k323o926J962j6147k213
$$ 11463 4138 -10567 -18868 -22524 -10882 533 18965 20697 18374 11448 13410 -2737 -4950
9774d950j4554J220K226M830Q474J3734N784L28n872j5654k571l261j3869j0789
$$ -4950 -19504 -18284 -16058 -11228 -2754 10980 16764 17092 11220 -4434 -7005 -10266 -24135 -34924
9760c4924J0159l267m848J3054N659m747P406Q885J2764o538q217r239L523J0338
$$ -34924 -24765 -28032 -32880 -19826 -14167 -18914 -11508 -2623 10141 3603 -4614 -13853 -10330 8
9746HR866j0975p661j142K05o943N382k257L447J1488N766N696j71l669n40R239
$$ 8 9874 -1101 -8762 -9904 -9699 -16642 -11260 -13517 -10070 1418 7184 12880 12709 9040 8500 17739
9730A7739L256n631L733k151m858j1672N942J1968M359l776j0555k392k396p580
$$ 17739 20995 15364 19097 16946 12088 416 6358 18326 22685 18909 8354 5962 3566 -4014
9716d014M030P305N953k705j1893n612J2497J0121j534m895k770M515m747J1958
$$ -4014 16 7321 13274 10569 -1324 -6936 5561 15682 14148 9253 6483 10998 6251 18209
9702A8209R706j1280n441q319j3009r482J0054J2496o287l63k037L12O018Q718
$$ 18209 27915 16635 11194 2875 -10134 -19616 -9562 2934 -3353 -3716 -5753 -5441 577 9295
9688I295L849K082l489L223P009j5582n228P452j275r884o141j375j541k613M982
$$ 9295 13144 15226 11737 14960 21969 6387 1159 8611 7336 -2548 -8689 -10064 -11605 -14218 -9236
9673i236r530L836Q930L950K183N562n027r257m727n860k103J3835N960j424J6380
$$ -9236 -18766 -14930 -6000 -2050 133 5695 668 -8589 -13316 -19176 -21279 -7444 -1484 -2908 13472
9658A3472R629n844j4503j5203Q245N172j4033k106J925J0648L918L206J419q359
$$ 13472 23101 17257 2754 -12449 -4204 968 -13065 -15171 -13246 -2598 1320 4526 5945 -2414
9644b414o165n554M326O723l931K645R53m113j0837P844J5452P88p590J945N886
$$ -2414 -8579 -14133 -9807 -3084 -7015 -4370 -3417 -7530 -18367 -10523 4929 5717 -1873 72 5958
9629E958O662j372l895O449k974n439r953n270N726k379M161m788Q10r076l380
$$ 5958 12620 11248 7353 13802 10828 5389 -4564 -9834 -4108 -6487 -2326 -7114 -6304 -15380 -18760
9614a8760Q993O579o177M254J1458L164j4338r669Q810J058k110p225j54P961
$$ -18760 -9767 -3188 -9365 -5111 6347 9511 -4827 -14496 -5686 -4628 -6738 -13963 -14117 -6156
9600f156O575M140m69l212L741q822j860K470K860n508q01n330K312P089L202
$$ -6156 419 4559 4090 878 4619 -4203 -6063 -3593 -733 -6241 -7042 -12372 -10060 -2971 231
9585B31P455j2004l826M756N33O064O833Q93j4312m349j720N150M479j979q467
$$ 231 7686 -4318 -8144 -3388 -2855 3209 10042 10935 -3377 -7726 -9446 -4296 183 -1796 -10263
9570a0263p628J046J1879M588J189J616n560J394L967Q645j755k385R310K431
$$ -10263 -17891 -16845 -4966 -378 811 2427 -3133 -1739 2228 10873 9118 6733 16043 18474
9556A8474L872o42m541n667J458J045p990o096K579Q090K375M482l490k554L603
$$ 18474 22346 21704 17163 11496 12954 13999 6009 -87 2492 10582 12957 17439 13949 11395 14998
9541A4998J91J025n917j479Q835o490o246L158N408n115J867M566j7330q005j922
$$ 14998 15189 16214 10297 8818 17653 11163 4917 8075 13483 8368 10235 14801 -2529 -10534 -12456
9526a2456n680l102k838Q491O881Q962N414O398M368j763n148p703n214M556j292
$$ -12456 -18136 -21238 -24076 -15585 -8704 258 5672 12070 16438 14675 9527 1824 -3390 1166 -126
9511a26m25L197J1054j52o333Q27P376K239j2886j4874k762J3072J8053o904j08
$$ -126 -551 2646 13700 13548 7215 8042 15418 17657 4771 -10103 -12865 207 18260 11356 11248
9496A1248J729K959l805m844J0025L554P372L158j187j4459j208l59q553l981
$$ 11248 12977 15936 12131 7287 17312 20866 28238 31396 30209 15750 14542 14183 5630 1649
9482A649M149j3805J097O430q185p856J107Q014n694Q578R959j102j368k415J621
$$ 1649 5798 -8007 -6910 -480 -8665 -16521 -15414 -7400 -13094 -4516 5443 4341 2973 558 2179
9467B179l939j2063K429Q994K004O0O421N007J057L640P36J0772K814o471N43
$$ 2179 -1760 -13823 -11394 -2400 -396 -336 6085 11092 12149 15789 16525 27297 30111 23640 24183
9452B4183L873r914K944O74j0264j451N006L664l333j818j312p172q72n36J5056
$$ 24183 28056 18142 21086 21760 11496 10045 15051 18715 15382 13564 12252 5080 4208 3672 18728
9437A8728O032n8q328l094k945l689j650j482K907k045j76L501P645J4779q25
$$ 18728 24760 24702 16374 13280 10335 6646 4996 3514 6421 4376 4200 7701 15346 30125 29300
9422B9300j0423q841r612l857j9R863K046N777J938L222K931m741r423m398R52
$$ 29300 18877 10036 424 -3433 -3452 6411 8457 14234 16172 19394 22325 17584 8161 3763 4715
9407D715J1019m539j8660n551N626J8778R352L328K924J926p43j6270l806L155
$$ 4715 15734 11195 -7465 -13016 -7390 11388 20740 24068 26992 28918 28175 11905 8099 11254
9393A1254L810m71O353P64n904o452j600j004L485m553O015m149j110P098J1457
$$ 11254 15064 14593 20946 21710 15806 9354 7754 6750 10235 5682 11697 7548 6438 13536 24993
9378B4993N948l875j7936p72o489k27k601n895q476l405L164j566J4661K673n855
$$ 24993 30941 27066 9130 8358 1869 1642 -959 -6854 -15330 -18735 -15571 -17137 -2476 197 -5658
9363e658j457L326r351q54Q824J3374M039J0463L621L584J730M652l520p35k32
$$ -5658 -7115 -3789 -13140 -13994 -5170 8204 12243 22706 26327 29911 31641 36293 32773 32038 31806
9348C1806M194N08q945j0823j5929K209O965k290m967R002m058M440K869l78O677
$$ 31806 36000 36508 27563 16740 811 3020 9985 7695 2728 11730 7672 12112 14981 14603 21280
9333B1280J0834Q916l662R325q58K374J5625O371Q226M486J1597P253J3431J1004
$$ 21280 32114 41030 37368 46693 45835 48209 63834 70205 78431 82917 94514 101767 115198 126202
9319A26202J7858L0921K6343M0020L7028N8324Q5748J01336J11057J27514J58019
$$ 126202 144060 174981 201324 241344 278372 336696 422444 523780 634837 762351 920370
9308I20370J71418J55213J36151J10996P6008L7273j8921p0839j04339j45749
$$ 920370 1091788 1247001 1383152 1494148 1570156 1607429 1588508 1517669 1413330 1267581
9298A267581j50970j46243j41765j32077j20594j07502p5611n4127m7798l9822
$$ 1267581 1116611 970368 828603 696526 575932 468430 392819 338692 290894 251072
9288B51072l9515l1141j4911k3360r801r354q106j8373k0274j3335N905p51J826
$$ 251072 211557 180416 165505 142145 132344 122990 114884 96511 76237 62902 68807 68056 69882
9275F9882R662K889j1324n380l632q181l354N923J0906o988l50R144Q71j3507
$$ 69882 79544 82433 71109 65729 62097 53916 50562 56485 67391 60403 60053 69197 70068 56561
9261E6561k794p144O650J3330j1751r981P906q85M363M018K992J9043J2952p512
$$ 56561 53767 46623 53273 66603 54852 44871 52777 51892 56255 60273 63265 82308 95260 87748
9247H7748M53Q726p812j1754K305R060O271L681j3639k1341m1485m9851m1045
$$ 87748 88201 96927 89115 77361 79666 88726 94997 98678 85039 63698 22213 -27638 -68683
9234f8683k3469k0247l072L281Q444J6977L505j298J1979J4705P848q197J620
$$ -68683 -92152 -112399 -115471 -112190 -103746 -86769 -83264 -84562 -72583 -57878 -50030 -58227 -56607
9221e6607J257J16p694L019P389M115J4633Q638R732J6552J0869J4684J7043J0139
$$ -56607 -55350 -55234 -62928 -59909 -52520 -48405 -33772 -25134 -15402 1150 12019 26703 43746 53885
9207E3885P531L772j2112J0099m447J0725L6833Q151l988j95P397J0520J6557
$$ 53885 61416 65188 53076 63175 58728 69453 106286 114437 110449 110254 117651 128171 144728
9194A44728L4269L8195K8573N6030O3171O6714P3738J02757J44963J96604K86689
$$ 144728 178997 217192 245765 301795 364966 431680 505418 608175 753138 949742 1236431
9183A236431M03261N46976O23475N03036J70033j77597m00336m76105m75440m11186
$$ 1236431 1639692 2186668 2810143 3313179 3483212 3305615 2905279 2429174 1953734 1542548
9173A542548l35996k63989j85569j43363j01747p9419m8753k7706k5791M58K8308
$$ 1542548 1206552 942563 756994 613631 511884 432465 383712 356006 330215 330673 358981
9162C58981L0320J3621N22l278m416j1097k4151l7797l2672l7668l5295k9636
$$ 358981 389301 402922 403444 400166 395750 384653 360502 322705 290033 252365 217070 187434
9150A87434j7221k3876p027o210r893j6478j4999r92J3706J6841n624k0293j5748
$$ 187434 170213 146337 139310 133100 123207 106729 91730 90738 104444 121285 115661 95368 79620
9137G9620j4223r837m330K258m704j9111m281O953J578J0125R379O753L161J2056
$$ 79620 65397 55560 51230 53488 48784 29673 25392 32345 33923 44048 53427 60180 63341 75397
9123G5397j689k54L39L004L219P131R12p264q80r59J211J2346J8878N444l131
$$ 75397 73708 73454 73793 76797 80016 87147 88059 80795 79915 78956 80167 92513 111391 116835 113704
9108A13704Q539J8356K8925J7680J2765m97Q269N188r344k9704k6360k6170j8205
$$ 113704 122243 140599 169524 187204 199969 199472 207741 212929 203585 173881 147521 121351 103146
9095A03146L580K625k6279l3023k576N655J1577Q219L679L560R970j033j1377
$$ 103146 106726 109351 83072 50049 47473 53128 64705 72924 76603 80163 90133 89100 77723
9082G7723n420K570j5941l866Q458R431J0308J6843j479L337N690j916o504R51
$$ 77723 72303 74873 58932 55066 63524 72955 83263 100106 98627 101964 107654 105738 99234 100185
9068A00185q48r047o820P47j1494M001L105N935J3255P852J2824P074l511N766
$$ 100185 99337 90290 83470 84217 72723 76724 79829 85764 99019 106871 119695 126769 123258 129024
9054A29024J647M572J3368K063N663P053J9006L3806M6245P3975R7554J08622
$$ 129024 130671 135243 148611 150674 156337 163390 182396 216202 262447 336422 433976 542598
9042E42598P7899L1243m227k2879n550J0398O9777J08341J18692P8047J0578m0420
$$ 542598 620497 651740 647513 624634 619084 629482 699259 807600 926292 1004339 1014917 974497
9030I74497o2243p5135p1786n9374m5823l6743j9128j3703R645K02k1493n0077
$$ 974497 912254 837119 765333 705959 660136 623393 604265 590562 600207 600409 578916 528839
9018E28839n1841m7115l9813k9747q560j2992j9483n129m406j1573k3021j9987
$$ 528839 476998 429883 390070 360323 351763 338771 319288 314159 309753 298180 275159 255172
9006B55172m350J7360J7281n912J7794K7908L1017P312K544o47j547K3736K5769
$$ 255172 250822 268182 285463 279551 297345 325253 356270 363582 366126 365479 363932 387668 413437
8993D13437K3363J3411J8602K5267J1171J2592J9928R417O204R161K090J2665
$$ 413437 436800 450211 468813 494080 505251 517843 537771 547188 553392 562553 564643 577308
8981E77308J1042O499J2813L2570L8134K2401K2712R243l243l074n379q11O556
$$ 577308 588350 594849 607662 640232 678366 700767 723479 732722 729479 726405 721026 720215 726771
8968G26771J4315L6729M0711N4168N0838M7721N6341O9432P7121Q5837O8074O5462
$$ 726771 741086 777815 818526 872694 923532 971253 1027594 1097026 1174147 1259984 1328058 1393520
8956A393520P1874P4119M5265N1226O2320Q0605Q9705J01456J31347J54675J59907
$$ 1393520 1465394 1539513 1584778 1636004 1698324 1778929 1868634 1970090 2101437 2256112 2416019
8945B416019J80556J69668J82729K11692K52741K98680L70547L89470L21131K83611
$$ 2416019 2596575 2766243 2948972 3160664 3413405 3712085 4082632 4472102 4793233 5076844
8935E076844K93041L10526L49806M15156M99026N87317P16873Q77477J039863
$$ 5076844 5369885 5680411 6030217 6445373 6944399 7531716 8248589 9126066 10165929
8926A0165929J258265J508220J805833K149804K545423K970918L484838M021734
$$ 10165929 11424194 12932414 14738247 16888051 19433474 22404392 25889230 29910964
8918B9910964M533635N083024N983982P525787J0025336J3914153J9823769K8663300
$$ 29910964 34444599 39527623 45511605 53037392 63062728 76976881 96800650 125463950
8910A25463950M1547905N8868757P6306419P9158607N1336059L684027l5379079
$$ 125463950 167011855 225880612 302187031 381345638 432681697 436365724 400986645
8903D00986645n5885647o2035858n8741168m9884698l9257014k9484712k1618604
$$ 400986645 345100998 283065140 224323972 174439274 135182260 105697548 84078944
8896H4078944j5742748j1479119q449847o388459n104406m368340l874200l440088
$$ 84078944 68336196 56857077 48407230 42018771 36914365 32546025 28671825 25231737
8888B5231737l010672k605366k240390j879541j564040j325255j129333r64547
$$ 25231737 22221065 19615699 17375309 15495768 13931728 12606473 11477140 10512593
8880A0512593q35415p38448o92221o52832n88950n34003m82046m14725l47507
$$ 10512593 9677178 8938730 8246509 7593677 7004727 6470724 5988678 5573953 5226446
8871E226446k84741k64140k60822k30860j99102j72271j66056j47125j30114j26301
$$ 5226446 4941705 4677565 4416743 4185883 3986781 3814510 3648454 3501329 3371215 3244914
8861C244914j38442j49791j55548j50333j28360j26799j09007r1390q3201n9939
$$ 3244914 3106472 2956681 2801133 2650800 2522440 2395641 2286634 2195244 2112043 2052104
8851B052104n3505m7787m0685o1122m2899m1272l3144l9131m0282l9774l8796
$$ 2052104 1998599 1950812 1910127 1849005 1806106 1764834 1731690 1692559 1652277 1612503 1573707
8840A573707m9349n6859p1596o6112m9894m2642m0644l6223k4456j7555l0739
$$ 1573707 1524358 1467499 1395903 1329791 1279897 1237255 1196611 1160388 1135932 1118377 1087638
8829A087638m3862m0810m1059m9331l1000j7075k0682l0385k6980J242j3383n195
$$ 1087638 1043776 1002966 961907 912576 881576 864501 843819 813434 786454 787696 774313 769118
8817G69118J0115M887q408o829j3619j0913J248N500q827j0643j7582j8874j7316
$$ 769118 779233 784120 775712 768883 755264 744351 745599 751099 742272 731629 714047 695173 677857
8804F77857j5146l835j3334l1671k2615j7443j0574j4819j6162j8692r422j9832
$$ 677857 662711 658876 645542 613871 591256 573813 563239 548420 532258 513566 504144 484312
8792D84312k5687k1366j1812n900L857N122r517j0981j4520k8704n9959q8767
$$ 484312 458625 437259 425447 419547 423404 428526 419009 408028 393508 364804 304845 216078
8780B16078j30069j07418o6252m473M1282M6369M9542M6765L2224K0164J5357
$$ 216078 86009 -21409 -87661 -92134 -50852 -4483 45059 91824 124048 144212 159569
8769A59569M671J585K899J3057K2049J9055J1209p772j425O082j745N257N422
$$ 159569 164240 165825 168724 181781 203830 222885 234094 226322 224897 230979 229234 234491 239913
8756B39913K383O606q609j3354L919l447j52R087J5001P516j2085p933j1000o10
$$ 239913 242296 248902 240293 226939 230858 227411 227259 236346 251347 258863 246778 238845 227845 227235
8742B27235m241J4573K0241m478k1444k4321o970L340m299k077N548R22j0816
$$ 227235 222994 237567 257808 253330 231886 207565 200595 203935 199636 197559 203107 204029 193213
8729A93213n914l50K091Q97n519N553o851p992m83N433l588j4981j0150q81q750
$$ 193213 187299 186949 189040 189937 184418 189971 183120 175128 174645 180078 176490 161509 151359 150478 141728
8714A41728j7554k5861j7967k3776j9665j2302r128M432J9229J9679P545K5599
$$ 141728 124174 98313 80346 56570 36905 24603 15475 19907 39136 58815 66360 91959
8702I1959K8512O632Q22J1127K1866K1977K4967K7754J9029J3871n277j2891j4084
$$ 91959 120471 127103 127925 139052 160918 182895 207862 235616 254645 268516 263239 250348 236264
8689B36264j9797o819k0145l262j4226k870J6182k446M74k409m652P64L937k352
$$ 236264 216467 209648 189503 186241 172015 169145 185327 182881 183355 180946 176294 177058 180995 178643
8675A78643j3575j7026j4753k2262r880K46M391Q00P261J3903J4996L717m571
$$ 178643 165068 148042 133289 111027 101147 101393 105784 106584 113845 127748 142744 146461 141890
8662A41890l120K221J1273j712L382L208M682J975N773J944j4289j5580r046P654
$$ 141890 138770 140991 152264 150552 153934 157142 161824 163799 169572 171516 157227 141647 132601 140255
8648A40255J3511N10J62l308j052J0899J5050J4972L069k580J0042L0577K3539
$$ 140255 153766 154276 154438 151130 150078 160977 176027 190999 194068 191488 201530 232107 255646
8635B55646O085K2551M3166K2609K1565K3179K4321N2106J02367K11684L95147
$$ 255646 261731 284282 327448 350057 371622 394801 419122 471228 573595 785279 1180426
8624A180426O48138N36416m5073l41119m00290l89346l36070k43213j40340q9900
$$ 1180426 1828564 2364980 2319907 1978788 1578498 1189152 853082 609869 469529 379629
8614C79629n5767m1754j4381l2329k6074o959j7699k0118j7468q48N310j806n126
$$ 379629 323862 282108 267727 235398 209324 202365 184666 164548 147080 146232 151542 149736 144610
8601A44610o781j389J118J6660J2456L960J3906P953k765l947J913m911n335q796
$$ 144610 137829 136440 137558 154218 166674 170634 184540 192493 189728 185781 187694 182783 177448 168652
8587A68652M247M419K618M33J0002P572O023K206K0957J3298n187k0014m3135
$$ 168652 172899 177318 179936 180369 190371 197943 203966 206172 227129 240427 235240 215226 172091
8574A72091m4784k4536l5427l1816l541K615P141n663m624m039l209N29N802K075
$$ 172091 127307 102771 67344 35528 31987 34602 41743 36080 31456 27417 24208 24737 30539 32614
8560C2614Q858K452l211k208p596k896P223k094o962J0999O866m019P294o26l356
$$ 32614 41472 43924 40713 38505 30909 28013 35236 33142 26180 37179 44045 40026 47320 46694 43338
8545D3338L035j257O174K385M615J2880R267L669P96j0481L992O146M468J058
$$ 43338 46373 45116 51290 53675 58290 71170 80437 84106 84902 74421 78413 84559 89027 90085
8531I0085L110J5231m978j4861p242J8183J1881j703l066J4225J8374N567K954
$$ 90085 93195 108426 103448 88587 81345 99528 111409 109706 106640 120865 139239 144806 147760
8518A47760J3503K4815L0073K0221K2229M9092O5206R1718J17604J26260J38928
$$ 147760 161263 186078 216151 236372 258601 307693 372899 464617 582221 708481 847409
8507H47409J45855J57738J59562J32721J12608O6603J6214l1405q3506j16576
$$ 847409 993264 1151002 1310564 1443285 1555893 1622496 1638710 1607305 1523799 1407223
8497A407223j45936j54921j51642j49005j22530j08450r4677p6521n3812l9705
$$ 1407223 1261287 1106366 954724 805719 683189 574739 480062 403541 349729 310024
8487C10024m6230l4073k3530j5901q344j0896j0883k502j961p637r639j4744m486
$$ 310024 263794 229721 206191 190290 181946 171050 160167 157665 155704 148067 138428 123684 119198
8474A19198l155Q508J2905j4033n732O931j3682j2860k089j3219j1287l973k137
$$ 119198 116043 124551 137456 123423 117691 124622 110940 98080 95991 82772 71485 67512 65375
8461F5375j916o417j1903q806K73R792N715j6167L647L805J470N666O463L200
$$ 65375 63459 57042 45139 36333 36606 46398 52113 35946 39593 43398 44868 50534 56997 60197
8447F0197J1374O431N998L322j869k31m529j3835q448o545p716r690j079m790
$$ 60197 71571 78002 84000 87322 85453 85222 80693 66858 58410 51865 44149 34459 33380 28590
8433B8590K92j274J232M501k985l942L637l122K950R538R786k364p972Q14J5272
$$ 28590 28882 27608 28840 33341 30356 26414 30051 26929 29879 39417 49203 46839 38867 39681 54953
8418E4953K114P270K204q172r544o021o273M738q91R316J0128k490j2769j3172
$$ 54953 57067 64337 66541 58369 48825 42804 36531 41269 40378 49694 59822 57332 44563 31391
8404C1391K042j0526J223J1798j636l388o846K885J1002K031j0968n464J1650
$$ 31391 33433 22907 24130 35928 34292 30904 24058 26943 37945 39976 29008 23544 35194
8391C5194K130o498K374Q524J043l895O429J2626k54j3964l550J3648L510j5260
$$ 35194 37324 30826 33200 41724 42767 38872 45301 57927 57673 43709 40159 53807 57317 42057
8377D2057Q286R087l213r926n437O672M568K1l923M847J212M355m793n895N319
$$ 42057 50343 59430 56217 46291 40854 47526 52094 52115 48192 53039 54251 58606 53813 47918 53237
8362E3237L966j627q087j0649K551m320q658q260j4256r618j076j723J7312J0407
$$ 53237 57203 55576 47489 36840 39391 35071 26413 18153 3897 -5721 -6797 -8520 8792 19199
8348A9199R201O567P894J1719Q617R913l691q275O196j640k751j5064o625O720
$$ 19199 28400 34967 42861 54580 63197 73110 69419 61144 67340 65700 62949 47885 41260 47980
8334D7980R627O086M256o424j524l192K198M440o927j5821j0224q753M028M176
$$ 47980 57607 63693 67949 61525 60001 56809 59007 63447 56520 40699 30475 21722 25750 29926
8320B9926M047J016j0460j1665q103m876m080O249O22P58R130J0473M159n022
$$ 29926 33973 34989 24529 12864 4761 -115 -4195 2054 2676 3434 12564 23037 27196 22174
8306B2174m109p279j2160j794J3659J4887J0321P149j451Q359J8533o263j6339
$$ 22174 18065 10786 -1374 -3168 10491 25378 35699 42848 41397 49756 68289 62026 45687
8293D5687m374M330r427j1998N010L26q01o536q846N806J5432P53p847L456O987
$$ 45687 41313 45643 36216 24218 29228 29554 28753 22217 13371 19177 34609 35362 27515 30971 37958
8278C7958J7402K4920J4447N363m689p203k0897k3789j0378L538J129K762m88
$$ 37958 55360 80280 94727 100090 95401 88198 67301 43512 33134 36672 37801 40563 40075
8265D0075O402p872j8138r45Q392L298o223n2J007j0644K438P807p15l138j000
$$ 40075 46477 38605 20467 19522 27914 31212 24989 24937 25944 15300 17738 25545 24830 21692 20692
8250B0692K917M890m513q981q232J0259R324K246Q412K178r26l30k859Q535P296
$$ 20692 23609 28499 23986 15005 6773 17032 26356 28602 37014 39192 38266 37936 35077 43612 50908
8235E0908J5128J6454J6620L2459L6516J3361k356k0168l6420l8812j6153j1469
$$ 50908 66036 82490 99110 131569 168085 181446 179090 158922 122502 83690 67537 56068
8223E6068m354l120o892j0555Q6M024l910j0491j5426l636j399K602J057m706
$$ 56068 51714 48594 41702 31147 31233 35257 31347 20856 5430 1794 395 2997 4054 -652
8209f52R313R054J2069K634n203j9037o487J147M676K530P275J759k297k766J010
$$ -652 8661 17715 29784 32418 27215 8178 1691 2838 7514 10044 17319 19078 16781 14015 15025
8194A5025L924P816J217j0217P751J0846Q246J8844J5604J1592J0351k985p029
$$ 15025 18949 26765 27982 17765 25516 36362 44608 63452 79056 90648 100999 98014 90985
8181I0985j2608k4396l0410p081J0747O458j499j2809j0527L557M459Q658k025
$$ 90985 78377 53981 23571 16490 27237 33695 32196 19387 8860 12417 16876 25534 23509
8168B3509n722j9071p620J540J8320J7483l492j2319p92K037N388m447M877J712
$$ 23509 17787 -1284 -8904 -7364 10956 28439 24947 12628 11836 13873 19261 14814 19691 21403
8154B1403k420k174l464J440P23r831k232m044O239r582M29J889J2986k618k61
$$ 21403 18983 16809 13345 14785 15508 5677 3445 -599 5640 -3942 -3513 -1624 11362 8744 8483
8139H483Q33L439J6184M192j689n553l950L025L064l893N535q120j4835p264o175
$$ 8483 9316 12755 28939 33131 31442 25889 21939 24964 28028 24135 29670 21550 6715 -549 -6724
8124f724o341Q384Q789Q333O931R823k559j0669K449P653L818q593j6787j0350
$$ -6724 -13065 -4681 4108 12441 19372 29195 26636 15967 18416 26069 29887 21294 4507 -5843
8110e843j352o386k840Q250J4592J104r23N290n843o892j2247p385J4245M860
$$ -5843 -7195 -13581 -16421 -8171 6421 7525 6602 11892 6049 -843 -13090 -20475 -6230 -1370
8096a370k709n366J1079L059l25M693n393j728o175J656Q421L623Q67L449J338
$$ -1370 -4079 -9445 1634 4693 4368 9061 3668 1940 -4235 -2579 5842 9465 10332 13781 15119
8081A5119q123M092j2246r909L715k183n654J6185J8270L228j075P39k49j849
$$ 15119 6996 11088 -1158 -11067 -7352 -9535 -15189 996 19266 22494 21419 22158 21909 20060
8067B0060l165O750N865q862l287m029l396Q971r53o265l54j0760M284L998m33
$$ 20060 16895 23645 29510 20648 17361 13332 9936 18907 17954 11689 11335 575 4859 8857 8424
8052H424K492J452J939K071Q540M611j3237j381L220l961r556O956J198m036m190
$$ 8424 10916 12368 14307 16378 24918 29529 16292 14911 18131 14170 4614 11570 12768 8732 4542
8037D542L924O468j550J552J2089K141r507m050q25J0391O605j724k128K166J0410
$$ 4542 8466 14934 13384 14936 27025 29166 19659 15609 14784 25175 31780 30056 27928 30094 40504
8022D0504n986L148n540q813L267k298M177j4769q917O85l632J0487J0153Q501
$$ 40504 34518 37666 32126 23313 26580 24282 28459 13690 4773 5458 1826 12313 22466 30967
8008C0967N769J8863M973m551j3201m313J860L987L1p864l804j994m073k344J6280
$$ 30967 36736 55599 60572 56021 42820 38507 40367 44354 44385 36521 32717 30723 26650 24306 40586
7993D0586j586m811j00O744J96K566J491p429j0818q690j2148O043J0728P563
$$ 40586 39000 34189 34089 40833 41029 43595 45086 37657 26839 18149 6001 12044 22772 30335
7979C0335J304o250n931M029K442L74K149K597K097k713n334p868n827j086R854
$$ 30335 31639 25389 19458 23487 25929 26303 28452 31049 33146 30433 25099 17231 11404 10318 20172
7964B0172L03J3551L446j001q37j0220n808R95n815l446R957J5166M353k870o773
$$ 20172 20475 34026 37472 36471 35634 25414 19606 20601 14786 11340 21297 36463 40816 37946 31173
7949C1173j0832j99m970J563K265L096N392o310j0239r43M902l273q970j587N75
$$ 31173 20341 20142 15172 16735 19000 22096 27488 21178 10939 9996 14898 11625 2655 1068 1643
7934A643P020o467k513k338k771j0851j549J0000J932k663Q966R923O667o258
$$ 1643 8663 2196 -317 -2655 -5426 -16277 -17826 -7826 -5894 -8557 409 10332 16999 10741
7920A0741p083M775J0710j84k229R608P976O009N225k407j9747j4350K1874j740
$$ 10741 3658 8433 19143 18959 16730 26338 34314 40323 45548 43141 23394 9044 30918 29178
7906B9178q696J838K736p326k67K712J303m497K997l963r848j276Q385P70M682
$$ 29178 20482 22320 25056 17730 17463 20175 21478 16981 19978 16015 6167 4891 13276 14046 18728
7891A8728N724j0135j016n204p347k999M606j1719j340J8422K0238j62n068j747
$$ 18728 24452 14317 13301 8097 750 -2249 2357 -9362 -10702 7720 27958 27796 22728 20981
7877B0981J319j5165p838P52L367n954n50P520L274j833j0505Q465J4454o336
$$ 20981 22300 7135 -703 49 3416 -2538 -3088 4432 7706 5873 -4632 3833 18287 11951
7863A1951J59l911n531j6604o32K0486M363m702j150j158M174O072J2367o964
$$ 11951 12110 8199 2668 -13936 -14568 5918 10281 5579 4429 3271 7445 13517 25884 18920
7849A8920o057Q802N365p329n184j373R051k127j5804j6410j793Q968l360n995
$$ 18920 12863 21665 27030 19701 14517 13144 22195 20068 4264 -12146 -13939 -4971 -8331 -14326
7835a4326K582N504J5997J9482m133q613j1287l966J2206M549J193M030r925j1849
$$ -14326 -11744 -6240 9757 29239 25106 16493 5206 1240 13446 17995 19188 23218 13293 1444
7821A444n556J846j477o330N040J0583k23R01P165j393P135j697j3980m839K288
$$ 1444 -4112 -2266 -3743 -10073 -5033 5550 5327 6228 13393 12000 19135 17438 3458 -1381 907
7806I07M017l544J2463J0154q164q519l566k33p320R403O078r75P024P94o924
$$ 907 4924 1380 13843 23997 15833 7314 3748 3515 -3805 5598 11676 10701 17725 18519 11595
7791A1595J0879k377j5686l789Q20k59m437r424K16K016r144n157R157J1939J2199
$$ 11595 22474 20097 4411 622 1442 1183 -3254 -12678 -12462 -10446 -19590 -24747 -15590 -3651 8548
7776H548Q556R17r376j300P410L539q378N387L730l690m060K010O44K973J3131
$$ 8548 17104 18021 8645 7345 14755 18294 9916 15303 19033 15343 11283 13293 13937 16910 30041
7761C0041L509j3712n970o171o599O522J0123J203M13j5084k776P03K271Q282
$$ 30041 33550 19838 13868 7697 1098 7620 17743 18946 19359 4275 1499 2202 4473 12755
7747A2755k337Q37j0726n30J918N772K769J0769J576L715r500m745L904O094o299
$$ 12755 10418 11255 529 -1 1917 7689 10458 21227 22803 26518 17018 12273 16177 22271 15972
7732A5972o749p500M623K098j0159j215O223N805o238K434P935m310j0096K480
$$ 15972 9223 1723 6346 8444 -1715 -2930 3293 9098 2860 5294 13229 8919 -1177 1303
7718A303R147n056L314O452n653J617K967J589p639m288J387N85l253K0863O768
$$ 1303 10450 5394 8708 15160 9507 11124 14091 15680 8041 3753 5140 5725 2472 23335 30103
7703C0103j1803j33m498j888j1090L75n129K563L847p732J5102M230O078R446
$$ 30103 18300 18167 13669 11781 691 1066 -4063 -1500 2347 -5385 9717 13947 20025 29471
7689B9471p265j1781L331r665o340R861N17m682m966j112K478J183M28J1816J1781
$$ 29471 22206 10425 13756 4091 -2249 7612 8129 3447 -1519 -2631 -153 1030 1458 13274 25055
7674B5055j0008n848K054k628n942k840L690K10p45m653J4430J2337l216N539
$$ 25055 15047 9199 11253 8625 2683 -157 3533 3743 2998 -1655 12775 25112 21896 27435
7660B7435j2662p814l115j751P956O479k559r713j5450J123J3356j817j0630k744
$$ 27435 14773 6959 3844 2093 10049 16528 13969 4256 -11194 -10071 3285 1468 -9162 -11906
7646a1906L861m966O86Q396L571n207Q298Q77j47m783n383j146Q517l808O135
$$ -11906 -8045 -13011 -12325 -3929 -358 -5565 2733 3610 3463 -1320 -6703 -7849 668 -3140 2995
7631B995n531n048j316L232O53j949O452k462q503k638J6187P926q030M79l664
$$ 2995 -2536 -7584 -8900 -5668 -5015 -6964 -512 -2974 -11477 -14115 2072 9998 1968 2447 -1217
7616a217n294n58M789j19j4301M406M531J0281P948l19j658k67m830m030N911
$$ -1217 -6511 -7069 -2280 -2399 -16700 -12294 -7763 2518 10466 10147 8489 8222 3392 -638 5273
7601E273M078p305j076M374J172q196O091L068L783m389p114J5069R780J739q823
$$ 5273 9351 2046 970 5344 6516 -1680 4411 7479 11262 6873 -241 14828 24608 26347 17524
7586A7524k4385n496M859K880R722J0003J087k87l227p200k536j864R054P691
$$ 17524 -6861 -12357 -7498 -4618 5104 15107 16194 15907 12680 5480 2944 1080 10134 17825
7572A7825K017j3266j967M698M874m87O79p694j2231j0071q40P427O768J8552
$$ 17825 19842 6576 4609 9307 14181 13694 14373 6679 -5552 -15623 -16463 -9036 -2268 16284
7558A6284Q628M395k0605l259m123n750j943k320N885N156m228j1381Q628J5715
$$ 16284 24912 29307 8702 5443 1320 -4430 -6373 -8693 -2808 2348 -1880 -13261 -4633 11082
7544A1082J690R264j869p523j2294j068J1392j067N189N891j0325j1347n351M182
$$ 11082 12772 22036 20167 12644 350 -718 10674 9607 14796 20687 10362 -985 -6336 -2154
7530b154J0245m711P13K269o663P398l481l680j421m936o789P484J4917Q434p2
$$ -2154 8091 3380 4093 6362 -301 7097 3616 -64 -1485 -6421 -13210 -5726 9191 17625 17553
7515A7553j1362j02M371R445M980k018l063q257l493n37l554o424J778k692j583
$$ 17553 6191 6089 10460 19905 24885 22867 19804 11547 8054 7517 3963 -2461 -683 -3375 -4958
7500d958L344P453J5860J0448n972j5646p362N465N002j0647r475m950M832Q924
$$ -4958 -1614 5839 21699 32147 26175 10529 3167 8632 13634 2987 -6488 -11438 -6606 2318
7486B318J47l355N079n360k729j1067j710L662O398n377K479k149r847J519Q925
$$ 2318 2465 -890 4189 -1171 -3900 -14967 -16677 -13015 -6617 -11994 -9515 -11664 -21511 -19992 -11067
7471a1067R438p73l035N346j089J1198P984N429j0138j0422k373M621j698l763
$$ -11067 -1629 -2402 -5437 -91 -1180 10018 18002 23431 13293 2871 498 5119 3421 -342
7457c42k018q057M983m528n641K092O025j157n402M512M379N641M600R526J72
$$ -342 -2360 -10417 -5434 -9962 -15603 -13511 -7486 -8643 -14045 -9533 -5154 487 5087 14613 14785
7442A4785o79r8J087J438j4652j2275O18Q858J0456K052j1959j678K265l919o442
$$ 14785 14106 14008 15095 16533 1881 -10394 -9776 -918 9538 11590 -369 -2047 218 -3701 -10143
7427a0143P849Q165j148m422p869J0731L824P557p383j5393o508K541N786J539
$$ -10143 -2294 5871 4723 301 -7568 3163 6987 14544 7161 -8232 -14740 -12199 -6413 -4874
7413d874J4954M721N687P01j6771j1062o781o244n210J9532P121m758m786l092
$$ -4874 10080 14801 20488 21189 4418 -6644 -13425 -19669 -24879 -5347 1774 -2984 -7770 -10862
7399a0862L582M381n360K824P733n575p410j113J0049k630j110L750m149N47O098
$$ -10862 -7280 -2899 -8259 -5435 2298 -3277 -10687 -11800 -1751 -4381 -5491 -1741 -5890 -5343 755
7384G55N295j778O110L011k83l890J0971n348j532O054K345m191j9028j3332n9
$$ 755 6050 4272 10382 13393 13110 9220 20191 14843 13311 19365 21710 17519 -1509 -14841 -14900
7369a4900O446P431J0749L045L361m097j097o596j959n086m548J893K691q693
$$ -14900 -8454 -1023 9726 12771 16132 12035 10938 4342 2383 -2703 -7251 -5358 -2667 -11360
7355a1360L728P600j91M243n42l133l891o765q195K783J8593J2308r795p024M03
$$ -11360 -7632 -32 -223 4020 3478 345 -3546 -10311 -18506 -15723 2870 15178 5383 -1641 -1238
7340a238L707j0506O302J2364l361j61k569n252l847n15J8793J5769p911j4097
$$ -1238 2469 -8037 -1735 10629 7268 7107 4538 -714 -4561 -5076 13717 29486 21575 7478
7326G478j9596R361J1380J889k461j4538j550J0710O226M237p386M918k492J981
$$ 7478 -12118 -2757 8623 10512 8051 -6487 -8037 2673 8899 13136 5750 10668 8176 10157
7312A0157M173R60k921j842K988p773J129P204N185J844k356k405j5838L400r346
$$ 10157 14330 15290 12369 10527 13515 5742 6871 14075 19260 21104 18748 16343 505 3905 -5441
7297e441o508O2k609L536P705r000m360J6048Q922o503o494K234N032k701K848
$$ -5441 -11949 -11887 -14496 -10960 -3255 -12255 -16615 -567 8355 1852 -4642 -2408 2624 -77 2771
7282B771Q948r27l861j19L47J07L909J3676r979N27m711M984m146n655j3567J46
$$ 2771 11719 10792 6931 6812 7159 7266 11175 24851 14872 15399 10688 15672 11526 5871 -7696 -7550
7266g550J9836P739j4182j6162n904J3019J0063j617k32O256M247j668K414L515
$$ -7550 12286 20025 5843 -10319 -16223 -3204 6859 5242 5010 11266 15513 13845 16259 19774
7252A9774j0009j0729O428K330p159j2411n941m368r176J3031K0653L100n499
$$ 19774 9765 -964 5464 7794 635 -11776 -17717 -22085 -31261 -18230 2423 5523 24
7239B4o754L240M370p309j193N571O594J0057K614r903K630l96o273j912m966
$$ 24 -6730 -3490 880 -6429 -7622 -2051 4543 14600 17214 7311 9941 9545 3272 1360 -3606
7224c606P31Q67M431J087P532J1545q052j780j0167l057P975N36j2323M71k348
$$ -3606 -2875 -2008 2423 3510 11042 22587 14535 12755 2588 -469 7506 8042 -4281 -3810 -6158
7209f158l309N346R83j86R719J7540q298j7372p123m427J403M518J8825k1l290
$$ -6158 -9467 -4121 -3138 -3324 6395 23935 15637 -1735 -8858 -13285 -11882 -7364 11461 11440 8150
7194H150M88l426l944K3MK735n588n69n226j228J0945k535L751R91j320j9934
$$ 8150 8638 5212 1268 1291 1295 4030 -1558 -2127 -7353 -8581 2364 -171 3580 4571 3251 -16683
7178a6683l577L804J3088L768l310r472N873J1803j5978L671N691o081K177N368
$$ -16683 -20260 -16456 -3368 400 -2910 -12382 -6509 5294 -10684 -7013 -1322 -7403 -5226 142
7164A42N057M620o43r565l163o370Q737K079r142k608m349N064J4337R536o169
$$ 142 5199 9819 9176 -389 -3552 -9922 -1185 894 -8248 -10856 -15205 -10141 4196 13732 7563
7149G563j204m745J98l31J247l346j1868p728J221J124n359O458J1862J2691O029
$$ 7563 6359 1614 1812 1481 2728 -618 -12486 -20214 -18993 -17869 -23228 -16770 -4908 7783 13812
7134A3812j1322j2642m056O124O786K546j243m926J287q0L160J1445j255n444
$$ 13812 2490 -10152 -14208 -8084 -1298 1248 5 -4921 -3634 -3714 -554 10891 9636 4192
7120D192j937p034P052n25P798L179k826p576q470N613Q754o329k579m18l99n984
$$ 4192 2255 -4779 2273 1748 9546 12725 9899 2323 -6147 -534 8220 1891 -688 -1106 -1505 -7489
7104g489n878q408j99J7152K1100j124m722P011q085o193R3J3374J455q397m320
$$ -7489 -13367 -21775 -21974 -4822 16278 15154 10432 17443 9358 3165 3258 16632 18087 9690 5370
7089E370k170l083N078R573J470J072j946m560o676l961M699J1001K015o180J398
$$ 5370 3200 117 5195 14768 16238 17310 15364 10804 4128 167 4866 15867 17882 11702 13100
7074A3100N62k063l703j5384j732o840M816J3362l831o831L389R760l174P564
$$ 13100 13662 11599 7896 -7488 -9220 -16060 -11244 2118 -1713 -8544 -5155 4605 1431 8995
7060H995K82o40r57j3018M680K529j8986k689J4991L680J1676K316q037j2089
$$ 8995 9277 8637 7680 -5338 -658 1871 -17115 -19804 -4813 -1133 10543 12859 4822 -7267
7046g267N590J89j981M402o903k820J0427n817p324O347j546l838j564L829M717
$$ -7267 -1677 -1488 -3469 933 -5970 -8790 1637 -4180 -11504 -5157 -6703 -10541 -12105 -8276 -3559
7031c559J4025J950j0889K483q463N742r55l620j158O86P751J682j4847p240O679
$$ -3559 10466 12416 1527 4010 -4453 1289 334 -3286 -4444 -3758 3993 5675 -9172 -16412 -9733
7016i733L484M811P750m604o790Q324R31L596o076q533p994J4519O993R662K264
$$ -9733 -6249 -1438 6312 1708 -5082 3242 4173 7769 1693 -6840 -14834 -315 6678 16340 18604
7001A8604K014r289o590n217k60k707j605j327K518p36J662Q43J0623j0714O190
$$ 18604 20618 11329 4739 -478 -738 -3445 -5050 -6377 -3859 -4595 -2933 -2090 8533 -2181 4009
6986D009J7831j556Q176n002m972L710j5624n096J3272j280J598K875j684p621
$$ 4009 21840 20284 28460 23458 18486 22196 6572 1476 14748 13468 15066 17941 16257 8636
6972H636r586j58n02j783r76O62R285n601P764k585r329q846M855J7557J985p286
$$ 8636 -950 -1108 -1610 -3393 -4369 -3707 5578 -23 7741 5156 -4173 -13019 -8164 9393 11378 4092
6956D092p263o051k685O689J265m904q657L931K065j333M741O901n6l8l515j5395
$$ 4092 -3171 -9222 -11907 -5218 -3953 -8857 -17514 -13583 -11518 -12851 -8110 -1209 -1265 -1303 -4818 -20213
6940b0213o73J2326J7890R042m563r106q706j686N012L351K882o422k718O722
$$ -20213 -20886 -8560 9330 18372 13809 4703 -4003 -5689 -677 2674 5556 -866 -3584 3138
6926C138N916q288j4355L679R362j774m712p05N139P064o195O568k858n358r22
$$ 3138 9054 766 -13589 -9910 -548 -2322 -7034 -7739 -2600 4464 -1731 4837 1979 -3379 -4301
6911d301j3092L825R951k899r02J2455P694P906J366o567j3871j1640j1538n819
$$ -4301 -17393 -13568 -3617 -6516 -7418 5037 12731 20637 22003 15436 1565 -10075 -21613 -27432
6897b7432R904P701J0886O963j0698j3190K492K297q859j112N913L991K914l253
$$ -27432 -17528 -9827 1059 8022 -2676 -15866 -13374 -11077 -19936 -21048 -15135 -11144 -8230 -11483
6883a1483L177n270j4592n5m568o475J107J0161J0835L14n701K480J0064O915
$$ -11483 -8306 -13576 -28168 -28223 -32791 -39266 -38159 -27998 -17163 -16849 -22550 -20070 -10006 -3091
6869c091m608k739M175m268J0702n826j0419Q161N870J71J1410N342m880l724
$$ -3091 -7699 -10438 -6263 -10531 171 -5655 -16074 -7913 -2043 -1872 9538 14880 10000 6276
6855F276K58Q27m589m347j798J92j1879j539J2268M00j5035n450R173l366m367
$$ 6276 6534 7361 2772 -1575 -3373 -3181 -15060 -16599 -4331 -3931 -18966 -24416 -15243 -18609 -22976
6840b2976j0283O670R046J4210K112K290P101P73m507L596P941M584n874p203
$$ -22976 -33259 -26589 -17543 -3333 -1221 1069 8170 8943 4436 8032 15973 20557 14683 7480
6826G480M299R434L840m402n068p059p84J208o413l282Q23M878j871J698n439
$$ 7480 11779 21213 25053 20651 15583 8524 7740 8948 2535 -747 76 4954 3083 4781 -658
6811f58l120k70P783L84J972M968J3253Q19j1211q819j1818P442O196N022k388
$$ -658 -3778 -4048 3735 4119 6091 11059 24312 25131 13920 5101 -6717 725 6921 11943 9555
6796I555m539L284N859K956l858q823q377m696N69J7028M52o609Q659q739q971
$$ 9555 5016 8300 14159 17115 13257 4434 -3943 -8639 -8070 8958 9410 2801 11460 2721 -6250
6781f250P251J2254M393K50J2075n713j9593j4778K966N64m252O069m326l001
$$ -6250 1001 13255 17648 17898 29973 24260 4667 -10111 -7145 -6581 -10833 -4764 -9090 -12091
6767a2091J3588j61p626J967j791k5j854l208j276J3822k195j3853N636P770m11
$$ -12091 1497 1336 -6290 -4323 -6114 -6139 -7993 -11201 -12477 1345 -850 -14703 -9067 -1297 -1708
6752a708Q75M585m699n597j156J4133l106k739l66K531L504m760l090o779j961
$$ -1708 -833 3752 -947 -6544 -7700 6433 3327 588 222 2753 6257 1497 -1593 -8372 -10333
6737a0333K0560R268K487M296N75r803J573m296j3182j772O785J0285N328P141
$$ -10333 10227 19495 21982 26278 26853 17050 18623 14327 1145 -627 6158 16443 21771 28912
6723B8912J0763J9345K1811K4231j052j3800k4632k3656k3038j0871L019m831
$$ 28912 39675 59020 80831 105062 104010 90210 65578 41922 18884 8013 11032 6201
6711F201J39p236j4251L908j09o463K972p44L562P650J2650K830n26p54j6435
$$ 6201 6340 -896 -15147 -11239 -11348 -17811 -14839 -15583 -12021 -4371 8279 11109 10583 9829 -6606
6696f606J691J1917o355K267L758k284M863Q579r574n688p823q656p092J037J0526
$$ -6606 -4915 7002 647 2914 6672 4388 9251 17830 8256 2568 -5255 -13911 -21003 -19966 -9440
6681i440R240r08j2568O148Q019K355j340m634K48r88M328J1694j455r810o548
$$ -9440 -200 -1108 -13676 -7528 491 2846 1506 -3128 -2880 -3868 460 12154 10699 889 -5659
6666e659N2N737k439l589j549K570o59j058O026l406q181J2685O198l485m948
$$ -5659 -5607 130 -2309 -5898 -7447 -4877 -5536 -6594 -568 -3974 -12155 530 6728 3243 -1705
6651a705o924J2322p807k003N495N01M604k933n351O846l448o618k058l83p064
$$ -1705 -8629 3693 -4114 -6117 -622 -121 4483 1550 -3801 3045 -403 -7021 -9079 -9462 -16526
6636a6526n701M677Q93N427J4762L814p526J179Q580m615q400l29k7p938L810
$$ -16526 -22227 -17550 -16657 -11230 3532 7346 -180 999 9579 4964 -3436 -3765 -3792 -11730 -7920
6621g920J0336k61n822j3252m097Q585R779k707l341P434K675K102l213O857N149
$$ -7920 2416 2155 -3667 -16919 -21016 -12431 -2652 -5359 -8700 -1266 1409 3511 298 7155 12304
6606A2304p037k867l002o060L771P517K773r73p420l608P309Q897L924p516P347
$$ 12304 5267 2400 -602 -6662 -2891 4626 7399 6426 -994 -4602 2707 11604 15528 8012 15359
6591A5359k036j1393k685J421r718L171Q727J0481Q463L47r232o94R861j0055
$$ 15359 13323 1930 -755 666 -9052 -5881 2846 13327 21790 22137 12905 12211 22072 12017
6577A2017p730K093j1889m442N369N62n739J1986J1395N050m108j744K26j0895
$$ 12017 4287 6380 -5509 -9951 -4582 -4020 -9759 2227 13622 18672 14564 12820 13046 2151
6563B151l815l295l471l764M41K509M435P196P286r72L559O559N629J2031O063
$$ 2151 -1664 -4959 -8430 -12194 -11753 -9244 -4809 2387 9673 8701 12260 18819 24448 36479 42542
6548D2542n194j2587k0113j1706n430j397J0757M089j91j553q520j721N419K970
$$ 42542 37348 24761 4648 -7058 -12488 -13885 -3128 961 770 -783 -9303 -11024 -5605 -2635
6534b635L638M598l766o080j5460l736j028Q690J2534N979m122P236j081n912
$$ -2635 1003 5601 1835 -4245 -19705 -23441 -24469 -15779 -3245 2734 -1388 5848 4767 -1145
6520a145M563Q807K054J963j1597k459j591m839K980Q39M996M147K84L374L814
$$ -1145 3418 12225 14279 16242 4645 2186 595 -4244 -1264 -425 4571 8718 9002 12376 16190
6505A6190K985j0046j0973R80M63m384k042J4606N123o550k309j883J902q90j086
$$ 16190 19175 9129 -1844 -864 -401 -4785 -6827 7779 12902 6352 4043 2160 4062 3172 2086
6490B086j1855l427J954Q730L242K81R681k901n730n955n690K662O995M595O666
$$ 2086 -9769 -13196 -11242 -2512 730 1011 10692 7791 2061 -3894 -9584 -6922 73 4668 11334
6475A1334n547k812j1776R23N697N671k463l141L291N844j4342R69J1629O92j5316
$$ 11334 5787 2975 -8801 -7878 -2181 3490 1027 -2114 1177 7021 -7321 -6352 5277 5969 -9347
6460i347J6355J4105j229l672j4900m491P675J0847j0728p371j3500l936J5563
$$ -9347 7008 21113 19884 16212 1312 -3179 4496 15343 4615 -2756 -16256 -20192 -4629
6447d629k464J605P401K384p54O236o559q962m415k76O094r88p827n39m020o117
$$ -4629 -7093 -5488 1913 4297 3543 9779 3220 -5742 -10157 -10433 -4339 -5327 -13154 -13693 -17713 -23830
6431b3830N371j111J3689J2976O199l327j6789m474r1J6335K546M867k03j6566
$$ -23830 -18459 -19570 -5881 7095 13294 9967 -6822 -11296 -11387 4948 7494 12361 12158 -4408
6417d408Q32O035N76k02m788n117k500m885o558j214N826J0360J8166M540n107
$$ -4408 -3576 2459 3035 2833 -1955 -7072 -9572 -14457 -21015 -22229 -16403 -6043 12123 16663 11556
6402A1556j7002J3541J3492q643P21K394j0460m360K328j1858j928J3460P469
$$ 11556 -5446 8095 21587 12944 13665 16059 5599 1239 3567 -8291 -10219 3241 10710
6389A0710M600m226k0958j2364J863M702q38J3287R656J469J040K753n668l07
$$ 10710 15310 11084 -9874 -22238 -20375 -15673 -16511 -3224 6432 7901 8941 11694 6026 5719
6375E719Q501P213m61m875j914l394N832L233r609k315Q163o138r181k903L332
$$ 5719 14220 21433 20972 16097 14183 10789 16621 19854 10245 7930 16093 9955 774 -2129 1203
6360A203K678o809r90M726L176n468p682n401R059L106j1999p080M322M609J417
$$ 1203 3881 -2928 -3918 808 3984 -1484 -9166 -14567 -5508 -2402 -14401 -21481 -17159 -12550 -11133
6345a1133J2305J5954K124r302n0Q760o158m990p838P164r443j585O334L374j4155
$$ -11133 1172 17126 19250 9948 9898 18658 12500 7510 -328 6836 -2607 -4192 2142 5516 -8639
6330h639m551j0099j613O562K952l067k041L76J0068J2137R77m333n923P765N108
$$ -8639 -13190 -23289 -24902 -18340 -15388 -18455 -20496 -20120 -10052 2085 3062 -1271 -7194 571 5679
6315E679j104N00Q679j3015j2773L90L654J3913K043n035q067K172M649m637M60
$$ 5679 4575 5075 13754 739 -12034 -11644 -7990 5923 7966 2931 -5136 -2964 1685 -2952 -2492
6300b492J773J502l888p361o821J927N532J8208P412k207q097o641j0700M2O782
$$ -2492 -719 783 -3105 -10466 -17287 -15360 -9828 8380 15792 13585 5488 -1153 -11853 -11811 -5029
6285e029r167R850k774K862L849M872n822m926p862m217J765J2220n298k790l722
$$ -5029 -14196 -4346 -7120 -4258 -409 4463 -1359 -6285 -14147 -18364 -16599 -4379 -9677 -12467 -16189
6270a6189L652O205R790q418k957L810L735p059o57N455O964qJ826J119l635L356
$$ -16189 -12537 -6332 3458 -4960 -7917 -4107 -372 -7431 -8088 -2633 4331 4323 6149 7268 3633 6989
6254F989N762Q065L452j3684k769J776k325m659L021p859O548M273l205K909P815
$$ 6989 12751 20816 24268 10584 7815 9591 7266 2607 5628 -2231 4317 8590 5385 8294 16109
6239A6109n430m301K001M99l977j129r527j7830m138J7097J2797K003n695j773
$$ 16109 10679 6378 8379 8878 4901 3772 -5755 -23585 -27723 -10626 2171 4174 -1521 -3294
6225c294M030J0579P616K336n770j1439j013Q873j1951j1021N13R431j401K904
$$ -3294 736 11315 18931 21267 15497 4058 3045 11918 -33 -11054 -10541 -1110 -2511 393
6211C93K754n052M01K421J0182L274K228r084k577l640o702R563J3849Q367p441
$$ 393 3147 -1905 -1504 917 11099 14373 16601 7517 4940 1300 -5402 4161 18010 26377 18936
6196A8936L51p043L752Q328K194R056o34j6263o534R176j067j2152Q67n81O663
$$ 18936 19287 12244 15996 24324 26518 35574 34940 18677 12143 21319 20252 8100 8967 8386 15049
6181A5049o709m484P377m411j6211K116K393M433J490l841p114R863Q967n506
$$ 15049 8340 3856 11233 6822 -9389 -7273 -4880 -447 1043 -2798 -9912 -49 8918 3412
6167C412M408l348m958J838J899o428L331J0601P941M537q400k393k794j7254
$$ 3412 7820 4472 -486 1352 3251 -3177 154 10755 18696 23233 14833 12440 9646 -7608
6153g608r672m16P751J3774K669R51J883N80m146o53j604M086J445Q203L402k708
$$ -7608 -17280 -17696 -9945 3829 6498 7449 9332 9912 5766 5113 3509 7595 9040 17243 20645 17937
6137A7937o000n760l065L044k444l816P474K920j3349p48J3651J2376p343j3811
$$ 17937 11937 6177 3112 6156 3712 -104 7370 10290 -3059 -3807 9844 22220 14877 1066
6123A066n366Q507j483j0578k430J0247L775p4K549J2792J144m064q660r507j1874
$$ 1066 -4300 4207 2724 -7854 -10284 -37 3738 3664 6213 19005 20149 16085 7425 -2082 -13956
6108a3956J4725L599j482j0003j281O269j04n06J4721L181q725j1973K320M691
$$ -13956 769 4368 2886 -7117 -8398 -2129 -2233 -2739 11982 15163 6438 -5535 -3215 1476
6094A476J8431L869m062o0j1264j0796m970K769Q800k524p472K576M86m881j341
$$ 1476 19907 23776 19714 19654 8390 -2406 -7376 -4607 4193 1669 -5803 -3227 -2741 -7622 -8963
6079h963M088K618K535K032Q844k94p86l678r390p565p487K131m754Q633R680
$$ -8963 -4875 -2257 278 2310 11154 10860 10074 6396 -2994 -10559 -18046 -15915 -20669 -12036 -2356
6064b356K684N133n306k13p790p448n221L208o521O302J5481J0491l939q214q236
$$ -2356 328 5461 155 -58 -7848 -15296 -20517 -17309 -23830 -17528 -2047 8444 4505 -3709 -11945
6049a1945K508l442j301N406l681N248M760L14m472n442O04O183k438O238o158
$$ -11945 -9437 -12879 -14180 -8774 -12455 -7207 -2447 -2133 -6605 -12047 -11443 -5260 -7698 -1460 -7618
6034g618p381P547m688m838R988Q668o891j3715m107O359m056N263J1261O259
$$ -7618 -14999 -7452 -12140 -16978 -6990 1678 -5213 -18928 -23035 -16676 -20732 -15469 -4208 2051
6020B051O779r539p078m432P493J9570Q761k34l548j1877q749n055j721o0P200
$$ 2051 8830 -709 -7787 -12219 -4726 14844 23605 23371 19823 7946 -803 -5858 -7579 -7639 -439
6005d39J0251J307K054k199k705j0800J836O325N980l570o935l274q352n817O30
$$ -439 9812 11119 13173 10974 8269 -2531 -695 5630 11610 8040 1105 -2169 -10521 -16338 -15708
5990a5708O481j108o239j743N244J702M005N573Q814k966q047K446J831p004j165
$$ -15708 -9227 -10335 -16574 -18317 -13073 -11371 -7366 -1793 7021 4055 -3992 -1546 285 -6719 -7884
5975g884N595M687n096l481L182J17j1028m833q463J836J12O698O790K040L620
$$ -7884 -2289 2398 -2698 -6179 -2997 -2880 -13908 -18741 -27204 -25368 -25256 -18558 -11768 -9728 -6108
5960f108N636J46M275l458L23r468L782M141K104k747j0290K755Q390l235m544
$$ -6108 -472 -326 3949 491 814 -8654 -4872 -731 1373 -1374 -11664 -8909 -519 -3754 -8298
5945h298K819K180Q068P00k207j532M074Q056M039K083N831q915j3151j2646J1269
$$ -8298 -5479 -3299 4769 5469 3262 1730 5804 13860 17899 19982 25813 16898 3747 -8899 2370
5930B370O657q609J285j2638p159k018J2418J0487O274R082o570o597j0274j2401
$$ 2370 9027 418 1703 -10935 -18094 -20112 -7694 2793 9067 18149 11579 4982 -5292 -17693
5916a7693M309J4206J4604p987l161p491M968j907n087j428J9767L898o395p142
$$ -17693 -13384 822 15426 7439 4278 -3213 1755 -152 -5239 -6667 13100 16998 10603 3461
5902C461k2693m689K9072R083j0329m147O14J349l102p106j343L765J378J2947
$$ 3461 -19232 -23921 5151 14234 3905 -242 372 1721 -1381 -8487 -9830 -6065 -4687 8260
5888H260r3j3906j850J0436p273m039m468R066K263M113j032N917p8p125j100
$$ 8260 8167 -5739 -7589 2847 -4426 -8465 -12933 -3867 -1604 2509 1477 7394 7316 191 -909
5873i09m357r83j264J088J070R572O17O035j0754j1187J7868n890l196J35K703
$$ -909 -5266 -6249 -7513 -6425 -5355 4217 4834 10869 115 -11072 6796 906 -2290 -2155 548
5858E48L790O685N569M15j4354j3764n421K15Q477R491n09m126m488O771k918
$$ 548 4338 11023 16592 17007 2653 -11111 -16532 -16317 -7840 1651 1142 -2984 -7472 -701 -3619
5843c619m538p26n550K382J1048q76K307l240K17K86n357l518N401L698m297J020
$$ -3619 -8157 -8883 -14433 -12051 -1003 -1879 428 -2812 -2595 -2309 -7666 -11184 -5783 -2085 -6382 -5362
5827e362O639K389r4m521J2399J948r347L157L643L771j1290j0198M003N268n693
$$ -5362 1277 3666 3572 -949 11450 13398 4051 7208 10851 14622 3332 -6866 -2863 2405 -3288
5812c288K307J3738p420p492L720L793O262L489p653M866R23j3787j5156j883
$$ -3288 -981 12757 5337 -2155 1565 5358 11620 15109 7456 12322 13245 -542 -15698 -17581
5798a7581J1945N1P51O561p576l781J402L254N534M055n55l809n103R540J519
$$ -17581 -5636 -5585 -4834 1727 -5849 -9630 -8228 -4974 560 4615 4060 251 -4852 4688 6207
5783F207j0659P45M207m671k1795K724J4894N641M579J489p031j843m102R731
$$ 6207 -4452 -3707 500 -4171 -25966 -23242 -8348 -2707 1872 3361 -3670 -5513 -9615 116
5769A16J0973R47J2714n261o770j816J754l532k522O467J645j0936m710r519M540
$$ 116 11089 12036 24750 19489 12719 10903 12657 9125 6603 13070 14715 3779 -931 -10450 -5910
5754e910J0985p2j3565L381J279K949L57m625k319L884M937o641P75N894k568
$$ -5910 5075 5003 -8562 -5181 -3902 -953 -596 -5221 -7540 -3656 1281 -5360 -4585 1309 -1259
5739a259l651k365O041J5320K595j867J048m880j20L014l587n021k313n75O8K176
$$ -1259 -4910 -7275 -1234 14086 16681 14814 15862 10982 10862 13876 10289 5268 2955 2380 2448 4624
5723D624l964N622l970L62p258j1212p193J556J1616P341J0002Q258N266p392
$$ 4624 660 6282 2312 2674 -4584 -15796 -22989 -21433 -9817 -2476 7526 15784 21050 13658
5709A3658L364k687q364l11K883m952n302P732l952j4126o182J638k52L658Q508
$$ 13658 17022 14335 5971 5660 8543 3591 -1711 6021 2069 -12057 -18239 -16601 -16853 -13195 -4687
5694d687R751k503n503N814J1038j3203p372L657J330J977R16o376O384l180l113
$$ -4687 5064 2561 -2942 2872 13910 707 -6665 -3008 -1678 299 1215 -5161 1223 -1957 -5070
5679e070j4395o179n935N197K0902R714n699r216r183n172O709K194N63P461M75
$$ -5070 -19465 -25644 -31579 -26382 -5480 4234 -1465 -10681 -19864 -25036 -18327 -16133 -15570 -8109 -7634
5664g634P093L617m82L594j984m003q728N473O762r026j1285R66M293r908K405
$$ -7634 -541 3076 2594 6188 4204 201 -8527 -3054 3708 -5318 -16603 -15637 -11344 -21252 -18847
5649a8847m858L709J023J547O271L431Q426k175o480l66K752J3149J2614l456
$$ -18847 -23705 -19996 -18973 -17426 -11155 -7724 702 -1473 -7953 -8319 -5567 7582 20196 16740
5635A6740j0625p516P249N22m984J594j026j0199j1491j909R115Q868K631n599
$$ 16740 6115 -1401 5848 6370 1386 2980 1954 -8245 -19736 -21645 -12530 -3662 -1031 -6630
5621f630O026L038M488k987j883o870q161j989O159k877m825M700k97m837j40
$$ -6630 -604 2434 6922 3935 2052 -4818 -12979 -14968 -8809 -11686 -16511 -11811 -12108 -16945 -17085
5606a7085P085R095P974n020p533N076N813q699q308K0513J1048n204k326j455
$$ -17085 -10000 -905 7069 2049 -5484 -408 5405 -3294 -11602 8911 19959 14755 12429 10974
5592A0974k74n877j241M724n305O97Q69k74n277r679P391j262J060J0555o096
$$ 10974 10700 4823 3582 8306 3001 3698 4567 4293 -984 -10663 -3272 -4534 -3474 7081 985
5577I85q32O420K263m681N59O096Q416o61r401l37j0514m350J3593p021K65L667
$$ 985 153 6573 8836 4155 4714 10810 19226 18565 9164 8827 -1687 -6037 7556 535 800 4467
5561D467M532P692j1520l094l382k849j624j982K736j2J4014J2322j0499J233
$$ 4467 8999 16691 5171 2077 -1305 -4154 -5778 -7760 -5024 -5036 8978 21300 10801 12034
5547A2034j0599L970J243J231j1845J547N280o485k837q044j1299k990L373M950
$$ 12034 1435 5405 6648 7879 -3966 -2419 2861 -3624 -6461 -14505 -25804 -28794 -25421 -20471
5533b0471n497J0836J0149J1815o260m590J08M548M657Q59M90m217r42Q272j0690
$$ -20471 -25968 -15132 -4983 6832 572 -4018 -3910 638 5295 6154 6644 2427 1485 9757 -933
5518i33r850Q973m389j387K365k927p016M49J074K13p140J0056N432r578M791
$$ -933 -10783 -1810 -6199 -7586 -5221 -8148 -15164 -14715 -13641 -13428 -20568 -10512 -5080 -14658 -9867
5503i867K594p700R21J568Q587J918k549m406N453J3879n801n186n635K165L812
$$ -9867 -7273 -14973 -14052 -12484 -3897 -1979 -4528 -8934 -3481 10398 4597 -589 -6224 -4059 -247
5488b47J737J0197Q157K905j687o362p115j32K040K464j0116k629j604j2744K259
$$ -247 1490 11687 19844 22749 21062 14700 7585 7453 9493 11957 1841 -788 -2392 -15136 -12877
5473a2877K794l019J842J26R623O84l431K692L211J093O796j1473k810n81j689
$$ -12877 -10083 -13102 -11260 -11134 -1511 -827 -4258 -1566 1645 2738 9534 -1939 -4749 -5330 -7019
5458g019O908M74M859J816J920m840l51M240k269l610K93O986J07j8346j3984
$$ -7019 -111 363 5222 7038 8958 4118 3767 8007 5738 2128 2421 9407 9514 -8832 -22816
5443b2816J6344J4597N445J911m35o521j0419j0407J577L717K446j47m732n228
$$ -22816 -6472 8125 13570 15481 15046 8525 -1894 -12301 -10724 -7007 -4561 -4708 -9440 -14668
5429a4668M333l148k768O343m042N11R56K161l062m616k114J9234O45r189L658
$$ -14668 -10335 -13483 -16251 -9908 -13950 -13439 -12483 -10322 -13384 -18000 -20114 -880 -235 -9424 -5766
5414e766l495M227Q088J387M22n049K182l679k824p115j0035J129j092j906r44
$$ -5766 -9261 -5034 3054 4441 4863 -186 1996 -1683 -4507 -11622 -21657 -20528 -21620 -23526 -24470
5399b4470M537L623R118j843L521O096O912r970o864J1475R635O74j4897q312
$$ -24470 -19933 -16310 -7192 -9035 -5514 582 7494 -2476 -9340 2135 11770 12444 -2453 -10765
5385a0765K887R698R452o229l966O631J357m367j0061K078m119P222N154m229
$$ -10765 -7878 1820 11272 5043 1077 7708 9065 4698 -5363 -3285 -7404 -182 4972 743
5371G43j272q568p106J2168K452l258q266Q748J2661m58m774J192N222k341j3732
$$ 743 -529 -9097 -16203 -4035 -1583 -4841 -13107 -4359 8302 7844 3070 4262 9484 7143 -6589
5356f589m456L222J7350Q579M580j461n937j818q40M048r428j9242j298J7570
$$ -6589 -11045 -7823 9527 18106 22686 21225 15288 13470 12630 16678 7250 -11992 -13290 4280
5342D280k099l081j130l988p976j208Q911O844M917N765j508j0733o718n820J1845
$$ 4280 2181 -900 -2030 -6018 -13994 -15202 -6291 553 5470 11235 9727 -1006 -7724 -13544 -1699
5327a699L440K050M475K906m424m504p602l418M389Q12j1549q580k890J1841P381
$$ -1699 1741 3791 8266 11172 6748 2244 -5358 -8776 -4387 -3575 -15124 -23704 -26594 -14753 -7372
5312g372Q58M142k414n882m884Q450l62l26p39L351O089J4121r273j5406j0306
$$ -7372 -6514 -2372 -4786 -10668 -15552 -7102 -7464 -7790 -8529 -5178 911 15032 5759 -9647 -19953
5297a9953m868N727J8040J2756O206k626n090j4602n362M013M81n395J26p764
$$ -19953 -24821 -19094 -1054 11702 17908 15282 10192 -4410 -9772 -5759 -5278 -10673 -10547 -18311
5283a8311j874J2303J2857n679o012L981K167n461R431J0736p334j1327n54J306
$$ -18311 -20185 -7882 4975 -704 -6716 -2735 -568 -6029 3402 14138 6804 -4523 -5077 -3771
5269c771J0989M753j4908R82J5159j428j279Q931l027n796J80m942j150J510q247
$$ -3771 7218 11971 -2937 -1955 13204 11776 10497 19428 16401 10605 10785 5843 4693 6203 -2044
5254b044j0418r17K646J3991J520K045k828L987j1630j6500K575R790M153J7617
$$ -2044 -12462 -13379 -10733 3258 4778 6823 3995 7982 -3648 -20148 -17573 -7783 -3630 13987
5240A3987J1447o62j5200o861K132q599N185O621r673o415J0179L189n351q067
$$ 13987 25434 24772 9572 2711 4843 -3756 1429 8050 -1623 -8038 2141 5330 -21 -8088
5226h088n471l635n301K473K744M256Q871j3298j3759M244J6460J5736m428n541
$$ -8088 -13559 -17194 -22495 -20022 -17278 -13022 -4151 -17449 -31208 -26964 -10504 5232 804 -4737
5212d737M678M294K555O13M319M676j741j1384o076j983j4463Q781K140N00J1304
$$ -4737 -59 4235 6790 7403 11722 16398 14657 3273 -2803 -4786 -19249 -10468 -8328 -7828 3476
5197C476k455N321J253j229l579p486R31Rr348J2876r8O182P689q887l487J984
$$ 3476 1021 6342 7595 6366 2787 -4699 -3768 -3759 -13107 -231 -329 5853 13542 4655 1168 3152
5181C152p722n097M57j429J798q549M447J2345J505p550m93J384P17j1184j32
$$ 3152 -4570 -9667 -9210 -10639 -8841 -17390 -12943 -598 907 -6643 -7136 -5752 -5035 -16219 -16351
5166a6351P155j315O129m65K24k613K514N837p844m851J1618j515j4456K204K394
$$ -16351 -9196 -10511 -4382 -4847 -4623 -7236 -4722 1115 -6729 -11580 38 -1477 -15933 -13729 -11335
5151a1335k584R606J5179P65j0169l046n060j914P820j247o092M536R086m462
$$ -11335 -13919 -4313 10866 11631 1462 -1584 -6644 -8558 -738 -1985 -8077 -3541 5545 1083
5137A083n82J306r47r553q738l14P296N954l234l790n504k480J0993J4165J358
$$ 1083 501 1807 860 -8693 -17431 -17745 -10449 -4495 -7729 -11519 -17023 -19503 -8510 5655 7013
5122G013l588m06R455j308j1461j934M58n962J980K301K456k743J602j1042N01
$$ 7013 3425 3019 12474 11166 -295 -2229 -1771 -7733 -5753 -3452 -996 -3739 -2137 -13179 -12678
5107a2678q088m536J3765K618J2878O612j1738j679j1515n424M909P44K221L295
$$ -12678 -20766 -25302 -11537 -8919 3959 10571 -1167 -2846 -14361 -19785 -14876 -14132 -11911 -8616
5093h616r01N06m964l933r510J100J3783j411o120N190J473j412j68P294l56L995
$$ -8616 -9517 -9011 -13975 -17908 -27418 -26318 -12535 -13946 -20066 -14876 -13403 -14815 -14983 -7689 -8045 -4050
5077d050l374J313L524P480K335r302M953J719M478n667q121P040n5j8343p867
$$ -4050 -7424 -6111 -2587 4893 7228 -2074 2879 4598 9076 3409 -4712 2328 2273 -16070 -23937
5062b3937K164L64l710P228J0431R513P586j1199q355K812J6566J228L133j4356
$$ -23937 -21773 -21409 -25119 -17891 -7460 2053 9639 -1560 -9915 -7103 9463 10691 13824 -532
5048e32r271M118R64L982J4446N788j3642l794N726L325p132o532m767j3118j802
$$ -532 -9803 -5685 -4721 -739 13707 19495 5853 2059 7785 11110 3978 -2554 -7321 -20439 -22241
5033b2241O681J1797L855o398N309j0342m177Q375J1124k808L729p937j7721L093
$$ -22241 -15560 -3763 92 -6306 -997 -11339 -15516 -7141 3983 1175 4904 -3033 -20754 -17661
5019a7661J3156o36L561P231p293m06l181j0721o801J1145P160N921R72R23P417
$$ -17661 -4505 -5141 -1580 5651 -1642 -2048 -5229 -15950 -22751 -11606 -4446 1475 2447 3370 10787
5004A0787O345n448l755R0j2730k265j3935j373L006J7288K0421K460j5011j0419
$$ 10787 17132 11684 7929 8019 -4711 -6976 -20911 -22284 -19278 -1990 18431 20891 5880 -4539
4990d539l88j993N35J87j662l885P717P867J9893K662j7616j9381p488m540K175
$$ -4539 -4927 -6920 -6385 -6198 -7860 -11745 -4028 3839 23732 26394 8778 -10603 -18091 -22631 -20456
4975b0456M322M874J0414j699k520q053J871M338j93m390J5331O172O033r685
$$ -20456 -16134 -11260 -846 -2545 -5065 -13118 -11247 -6909 -7102 -11492 3839 10011 16044 6359
4961F359p308k826l126m232p805j093R116m358M047m172j160L052J782l157M945
$$ 6359 -949 -3775 -6901 -11133 -18938 -20031 -10915 -15273 -11226 -15398 -16558 -13506 -11724 -14881 -9936
4946i936n443P749J653j918K887P308O652R842j4077q938L284L576J230Q474l793
$$ -9936 -15379 -7630 -5977 -7895 -5008 2300 8952 18794 4717 -4221 -937 2639 3869 12343 8550
4931H550P650R96N358n898P689k107L108o856j3314K609l333r019k58l611J2356
$$ 8550 16200 17196 22554 16656 24345 22238 25346 18490 5176 7785 4452 -4567 -4825 -8436 3920
4916C920J6483L148q749j6526r506R1K627J084r184j387J0645J9415n098o965
$$ 3920 20403 23551 14802 -1724 -11230 -11139 -8512 -7428 -16612 -17999 -7354 12061 6963 -2
4902bl483m103k236R756P150Q773R245l54j4179m093j2900N558J486J1009n15
$$ -2 -3485 -7588 -9824 -68 7082 15855 25100 24746 10567 6474 -6426 -868 618 11627 11112
4887A1112q003R067J3021N985j0773j4600j0156l09j0236O316L468J356k500j2776
$$ 11112 3109 12176 25197 31182 20409 5809 -4347 -4656 -14892 -8576 -5108 -3752 -6252 -19028
4873a9028J8K588J1420Q037j85M207K545j960P456L641o145P164J09j2543n073
$$ -19028 -19010 -16422 -5002 3035 2850 7057 9602 7642 15098 18739 12594 19758 19867 7324 2251
4858B251L515J220L326j0377q328O079M48q82J123p077p435J4906J2484m69J281
$$ 2251 5766 6986 10312 -65 -8393 -2314 -1866 -2748 -1625 -8702 -16137 -1231 11253 10784 12065
4843A2065n726n73l593m874N253j277m240l17J0384l909j3025j671n778M034L105
$$ 12065 6339 5766 2173 -2701 2552 1275 -2965 -3282 7102 3193 -9832 -11503 -17281 -13247 -10142
4828a0142l113M023j1866N022O982j461M88L647l090j520j374N431J3009N338
$$ -10142 -13255 -9232 -21098 -16076 -9094 -10555 -10067 -6420 -9510 -11030 -12404 -6973 6036 11374
4814A1374m346p941n807L825m961n252m820R9M105L142o645M196j1446J586J1887
$$ 11374 7028 -913 -6720 -2895 -7856 -13108 -17928 -17829 -13724 -10582 -17227 -13031 -24477 -22891 -11004
4799a1004L679n828N985J3991J557j5043j3682L081M012j5485r639l878j243J5892
$$ -11004 -7325 -13153 -7168 6823 8380 -6663 -20345 -17264 -13252 -28737 -38376 -42254 -43497 -27605
4785b7605K3190L044n166M488L404J2928l119j5242j1956Q856j031q262L118M980
$$ -27605 -4415 -1371 -6537 -2049 1355 14283 11164 -4078 -16034 -7178 -8209 -16471 -13353 -8373
4771h373K917n80K091J70M123M467P05J090j2611m702Q805M543n500o554N751
$$ -8373 -5456 -6036 -3945 -3775 348 4815 5520 6610 -6001 -10703 -1898 2645 -2855 -9409 -3658
4756c658J0670M559j659k558n922O133M18j616r811j437l875O897p700M799J2443
$$ -3658 7012 11571 9912 7354 1432 7565 7983 6367 -3444 -4881 -8756 -1859 -9559 -4760 7683
4741G683o38l419l955N932o745l916J1637j806n629j1734r180l843K40J8043J2737
$$ 7683 7045 3626 -329 5603 -1142 -5058 6579 4773 -856 -12590 -21770 -25613 -25373 -7330 5407
4726E407M57L041q355M31O319k610l619r914m717J1462O624j2085O775N262l1
$$ 5407 5864 8905 550 981 7300 4690 1071 -8843 -13560 -2098 4526 -7559 -784 4478 4447
4711D447N834r143M123o19M789k567l570P192k609l565l758r299n071j879M880
$$ 4447 10281 1138 5261 4642 9431 6864 3294 10486 7877 4312 554 -8745 -13816 -15695 -10815
4696a0815O568o187o420O918O623K274n208l808L920L408j356K946j048N564P886
$$ -10815 -4247 -10434 -16854 -9936 -3313 -1039 -6247 -10055 -6135 -2727 -4083 -1137 -2185 3379 11265
4681A1265p461q003j045l76J32O23N520J0231j291j1215l478k574P43o737n864
$$ 11265 3804 -4199 -5244 -5620 -5488 -4865 655 10886 9595 -1620 -5098 -7672 -6929 -13666 -19530
4666a9530p543k33J080L648J1013J277k590j183l258M132K502p043m670P271J2196
$$ -19530 -27073 -27306 -26226 -22578 -11565 -10288 -12878 -14061 -17319 -13187 -10685 -17728 -22398 -15127 -2931
4651b931P198n047K671n656q998N567P240j2209j3429j4283N593K2474J0318J4519
$$ -2931 4267 -780 1891 -3765 -12763 -7196 44 -12165 -25594 -39877 -34284 -11810 -1492 13027
4637A3027K936j035j1644J514J476m358n67L657o478K368R88R739m782q19J360
$$ 13027 15963 14928 3284 4798 6274 1916 1349 5006 -1472 896 1884 11623 6841 6022 7382
4622G382l939L173j038j980p053q873k395O435L248j3563K045J2425Q734j110
$$ 7382 3443 6616 5578 3598 -3455 -12328 -14723 -8288 -5040 -18603 -16558 -4133 4601 3491
4608C491m950Q660r645O476R869j387m307j194p128J1594J4463n651k0576j3790
$$ 3491 -1459 7201 -2444 4032 13901 12514 8207 7013 -115 11479 25942 20291 -285 -14075
4594a4075j1281q203N991L206J656L953J579J5042K1896L123k187j0006j0667
$$ -14075 -25356 -33559 -27568 -24362 -22706 -18753 -17174 -2132 19764 22887 20700 10694 27
4581B7j853R2j0509j3248J1274l897J01J636J584l795J0962Q881m75J153m196
$$ 27 -1826 -1734 -12243 -25491 -14217 -18114 -18013 -16377 -14793 -18588 -7626 1255 780 1933 -2263
4566b263N684J2704n393o648r70q454m86o335l395J7390J3978o643l056q81r96
$$ -2263 3421 16125 10732 4084 3114 -5340 -5826 -12161 -15556 1834 15812 9169 6113 5232 4236
4551D236K667j723J85J87o555Q63J0911M85n011l782l062m560O620l541K742M751
$$ 4236 6903 5180 5365 5552 -1003 -140 10771 11256 6245 2463 -599 -5159 1461 -2080 662 5413
4535E413J159j1036q713l089L788J1268J1817j458n165n126n405o591K937M165
$$ 5413 6572 -4464 -13177 -16266 -12478 -1210 10607 9149 3984 -1142 -6547 -13138 -10201 -6036
4521f036m769Q868J1107o1J356l861o896o694j0738Q543J4028J691L315m334r886
$$ -6036 -10805 -1937 9170 9109 10465 6604 -292 -6986 -17724 -9181 4847 6538 9853 5519 -4367
4506d367p150j6J589K868M454J1293k916K55j0685l407K827M365J54O959O57N089
$$ -4367 -11517 -11533 -9944 -7076 -2622 8671 5755 6010 -4675 -8082 -5255 -890 -736 6223 6880 11969
4490A1969P558j3087q075R283J017l372O282k183P120q482l062l719P872J419
$$ 11969 19527 6440 -1635 7648 8665 5293 11575 9392 16512 8030 4968 1249 9121 10540
4476A0540O095l016o220J19q085o799O631L483n803Q802J4902K989j3050j2842
$$ 10540 16635 13619 7399 7518 -567 -7366 -735 2748 -3055 5747 20649 23638 10588 -2254
4462b254r377J167O828p723L426Q485j124L208J262p395J743K59Q969K897P217
$$ -2254 -11631 -10464 -3636 -11359 -7933 552 -572 2636 3898 -3497 -1754 -1495 7474 10371 17588
4447A7588R060q448j6177m205l226l686P607j0122J240M388L790q36P290R280
$$ 17588 26648 18200 2023 -2182 -5408 -9094 -1487 -11609 -10369 -5981 -2191 -3027 4263 13543
4433A3543P403Q56P581j5436p152L825L783M76m058r128L948M963j165n835P570
$$ 13543 20946 21802 29383 13947 6795 10620 14403 14879 10821 1693 5641 10604 9439 3604 11174
4418A1174r026p667m547k788K0454L327l773O951J276q931o713J334l88L038Q280
$$ 11174 2148 -5519 -10066 -12854 7600 10927 7154 14105 15381 6450 -263 1071 683 3721 12001
4403A2001r547k422O495p491j983m699j881k498M738J0672q23q671j2921J192
$$ 12001 2454 32 6527 -964 -2947 -7646 -9527 -12025 -7287 3385 2562 -6109 -19030 -17838
4389a7838R123J689n339k092Q891P592N842M433n590n951m001J0003J096j219
$$ -17838 -8715 -7026 -12365 -14457 -5566 2026 7868 12301 6711 760 -3241 6762 7858 6639
4375F639Q97K252q671l809m470M476m428q807M575J0751Q875J756j0087q267K34
$$ 6639 7536 9788 1117 -2692 -7162 -2686 -7114 -15921 -11346 -595 8280 10036 -51 -8318 -8084
4360h084q5L378j745M726J4124m001m706M636L202K794l818o876m995j1697P051
$$ -8084 -8169 -4791 -6536 -1810 12314 8313 3607 8243 11445 14239 10421 3545 -1450 -13147 -6096
4345f096J0296K501N904j0963L133R95q190k1421p177L745K1719P969l978j0083
$$ -6096 4200 6701 12605 1642 4775 5770 -2420 -23841 -31018 -27273 -5554 2415 -1563 -11646
4331a1646l428Q63Q913R734P18l778K344P258o103k900K168j8629k81K574j0801
$$ -11646 -15074 -14211 -5298 4436 5154 1376 3720 10978 4875 1975 4143 -14486 -14767 -12193 -22994
4316b2994j3379J1844N167J0614k704p789J123L284n483K534O393k680O599J1163
$$ -22994 -36373 -24529 -19362 -8748 -11452 -19241 -18118 -14834 -20317 -17783 -11390 -14070 -7471 3692
4302C692m726j2389Q117J1006r061q246M348K294M221J32r08K533O317L765p224
$$ 3692 -1034 -13423 -5306 5700 -3361 -11607 -7259 -4965 -744 -612 -1520 1013 7330 11095 3871
4287C871k580N764M303o242n962k408m377M187O900K170J914j0003m306j0182
$$ 3871 1291 7055 11358 5116 -846 -3254 -7631 -3444 3456 5626 7540 -2463 -6769 -16951
4273a6951o727J2455J0513K870j388Q973j2036j7898M594J4199k072p192N954
$$ -16951 -23678 -11223 -710 2160 772 9745 -2291 -20189 -15595 -1396 -3468 -10660 -4706
4260d706K170J0262L278j0578k528N779q707Q68J403k703K1179O186q561j5279
$$ -4706 -2536 7726 11004 426 -2102 3677 -5030 -4162 -2759 -5462 15717 21903 13342 -1937
4246a937j1244J80L577j249J4295J4894p121j970O583q080j4213O584N641N763
$$ -1937 -13181 -13001 -9424 -10673 3622 18516 11395 9425 16008 7928 -6285 299 5940 11703
4232A1703M735J0140j1899j4338m404N240m824j1596L519L406k15K41j656J3011
$$ 11703 16438 26578 14679 341 -4063 1177 -3647 -15243 -11724 -8318 -8533 -8292 -9948 3063
4218C063Q853p137j0314O988J2145p737l950R35j0176m442R454J87j1677j836
$$ 3063 11916 4779 -5535 1453 13598 5861 1911 2846 -7330 -11772 -2318 -2131 -13808 -15644
4204a5644R656n9J866n849n328J0565J5816M748J6377m410k1832m155O660m495
$$ -15644 -5988 -6047 -4181 -10030 -15358 -4793 11023 15771 32148 27738 5906 1751 8411 3916
4190C916j241j3577l596M265K922M960p9K509L056j197O109L167K052J355j4012
$$ 3916 2675 -10902 -14498 -10233 -7311 -2351 -2430 79 3135 1938 8047 11214 13266 14621 609
4175F09K40Q95Q693Q751o432l702j841j0846N269Q314J828r125l156M288o017
$$ 609 849 1744 10437 19188 12756 9054 7213 -3633 1636 9950 11778 2653 -503 3785 -2232
4160b232J366J4585p187j1336K010L110K896L614k779j1329j331j489r381j8823
$$ -2232 -866 13719 6532 -4804 -2794 316 3212 6826 4047 -7282 -8613 -10102 -19483 -38306
4146c8306J599J4934R835O693J1453J0894K801j2672J004o141n064j2162r148
$$ -38306 -36707 -21773 -11938 -5245 6208 17102 19903 7231 8235 2094 -2970 -15132 -24280
4133b4280J391N061P867M583o185J678n959j1177Q268J0690N642M886N710j464
$$ -24280 -22889 -17828 -9961 -5378 -11563 -9885 -15844 -27021 -18753 -8063 -2421 2465 8175 6711
4119F711p96M633K080k751O751q41R36r144r70j749k295l867j3140p950J8646
$$ 6711 5915 10548 12628 9877 16628 15787 16723 7579 6609 4860 2565 -1302 -14442 -22392 -3746
4104c746R25j0436j003J2720m584r281N093J5392q180j890L062j0279J878Q456
$$ -3746 -2821 -13257 -14260 -1540 -6124 -15405 -10312 5080 -3100 -4990 -1928 -12207 -10329 -1873
4090a873R575k465j7149j517P005J6240P548m386j6256k3803J4079R223l769M752
$$ -1873 7702 5237 -11912 -13429 -6424 9816 17364 12978 -3278 -27081 -13002 -3779 -7548 -2796
4076b796q77O846o892M475J435k092n832o067K274K608L279J1148L814k239l68
$$ -2796 -3673 3173 -3719 756 2191 99 -5733 -11800 -9526 -6918 -3639 7509 11323 9084 8716
4061H716j591M404j0919j5048R1L025L176J1967J1260k203j0313o098j145l350
$$ 8716 7125 11529 610 -14438 -14347 -11322 -8146 3821 15081 12878 2565 -3533 -4678 -8028
4047h028m708N706N054N892k248l987o270P701n929n276Q387K015j1998p245P183
$$ -8028 -12736 -7030 -1976 3916 1668 -2319 -8589 -888 -6817 -12093 -3706 -1691 -13689 -20934 -13751
4032a3751J1695O858m012q458j221J1599m183j01M731O342m990o61n889l710j313
$$ -13751 -2056 4802 790 -7668 -8889 2710 -1473 -1574 3157 9499 4509 3848 -2041 -5751 -7064
4017g064L651M859n364o151J3710K741p641j924O351K541m09l370J2897K885J614
$$ -7064 -3413 1446 -3918 -10069 3641 6382 -1259 -3183 3168 5709 5300 1930 14827 17712 19326
4002A9326j5899m433p079j9819l122J2881M850r064J4955N638n742J7292J3340
$$ 19326 3427 -1006 -8085 -27904 -31026 -18145 -13295 -22359 -7404 -1766 -7508 9784 23124
3989B3124J869q19O616J082p582r847p161j2090k0201L906J2629M093j114l203
$$ 23124 24993 24174 30790 31872 24290 14443 7282 -4808 -25009 -21103 -8474 -4381 -5495 -8698
3975h698j549R56j0461J4025J2807j3319P124m419j830K231N199K300K059O346
$$ -8698 -10247 -9291 -19752 -5727 7080 -6239 885 -3534 -5364 -3133 2066 4366 6425 12771
3961A2771N05q365q913K880k931n890K244l235J372J0521J596j144q914j6280
$$ 12771 13276 4911 -4002 -1122 -4053 -9943 -7699 -10934 -9562 959 2555 1411 -7503 -23783
3947b3783O863O951O93M333J0197j423l961j707N590L157q476l255k190j265K854
$$ -23783 -16920 -9969 -9276 -4943 5254 3831 -130 -1837 3753 6910 -1566 -4821 -7011 -8276 -5422
3932e422O637P804j0605q606N355L7J2839J0712Q15O268r620j4365k485Q143j4645
$$ -5422 1215 9019 -1586 -10192 -4837 -4800 8039 18751 19566 25834 16214 1849 -636 7507 -7138
3917g138l194R208k825R205J3069o02q065M670p117n890m28K026q121j5572j2062
$$ -7138 -10332 -1124 -3949 5256 18325 17723 9658 14328 7211 1321 893 2919 -5202 -20774 -32836
3902c2836O408P343N767J2338J3118j1595l621k812j4074k86J4596J349Q42M012
$$ -32836 -26428 -19085 -13318 -980 12138 543 -3078 -5890 -19964 -20250 -5654 -4305 -3463 549
3888E49j0678L551J8034p15n049m407k087K31k204j82N289o82K665L167j851k328
$$ 549 -10129 -6578 11456 10741 5692 1285 -802 -571 -2775 -2957 2332 1650 4315 7482 5631 3303
3872C303m933L287p091j6590J1298J3362l273l20j008j0779O584P786J4791j450
$$ 3303 -1630 1657 -5434 -22024 -10726 2636 -637 -957 -1965 -12744 -6160 1626 16417 14967
3858A4967j3144O634m629j4409q199J3603k274o294K348K655J434m819J0746O569
$$ 14967 1823 8457 3828 -10581 -18780 -5177 -7451 -13745 -11397 -8742 -7308 -12127 -1381 5188
3844E188o506K732J670L90k428J74n682k946k68P470N493P730l287P284j682K510
$$ 5188 -1318 1414 3084 3474 1046 1220 -4462 -7408 -7676 -206 5287 13017 9730 17014 15332 17842
3828A7842j1071K214m952j5089O885M600J977K229j718p523K708l474J705L057
$$ 17842 6771 8985 4033 -11056 -4171 429 2406 4635 2917 -4606 -1898 -5372 -3667 -610
3814f10K810P71o58k177o805m970k149J629Q122N017J0210N89j169Q361l368p675
$$ -610 2200 2971 2313 136 -6669 -11639 -13788 -12159 -4037 980 11190 11779 10610 18971 15603 7928
3798G928M036n600J29q842J012O692j04l604j7559N904J3690k664Q69k910P730
$$ 7928 11964 6364 6493 -2349 -1337 5355 5251 1647 -15912 -10008 3682 1018 1887 -1023 6707
3783F707L104m179j3185j0245Q299J07K436O97o427r716q95M456O893J2172M026
$$ 6707 9811 5632 -7553 -17798 -9499 -9392 -6956 -6259 -12686 -22402 -23297 -18841 -11948 224 4250
3768D250j778m045P83J0227l839o528o49k648p769J681P402K083m501j659l233
$$ 4250 2472 -1573 -790 9437 5598 -930 -1579 -4227 -11996 -10315 -2913 -830 -5331 -6990 -10223
3753a0223n9R174O586k94l466P776j053m980N639j3l310p839k338M288n654r976
$$ -10223 -10282 -1108 5478 5184 1718 9494 8441 3461 9100 9087 5777 -2062 -4400 -112 -5766 -15742
3737a5742j080K803M808k111q461M08j22R449K1532j895n625M444J2295j268j4248
$$ -15742 -16822 -14019 -9211 -11322 -19783 -19375 -19497 -10048 11484 9589 3964 8408 20703 19435 5187
3722E187o944K31p074K423j0845P601J5660m522R17N900n663k1008O372M971q670
$$ 5187 -1757 -1526 -8600 -6177 -17022 -9421 6239 1717 2634 8534 2871 -18137 -11765 -6794 -15464
3707a5464j075O969K102o602o101J2910J0527k844l25R835M54L748p61o548j2864
$$ -15464 -16539 -9570 -7468 -14070 -20171 -7261 3266 422 97 9932 10386 14134 13373 6825 -6039
3692f039m673p388M071j781J5845J1678J33j453N29q373j3055o763P377N493N661
$$ -6039 -10712 -18100 -14029 -15810 35 11713 11846 10393 10922 2549 -10506 -17269 -9892 -4399 1262
3677A262J048L761o294k708l064l71P395J3730L087L661l486n224r922j750l762
$$ 1262 2310 6071 -223 -2931 -5995 -6366 1029 14759 17846 21507 18021 12797 2875 1125 -2637
3662b637k184m895J1094J2062J51Q098L841p523j5517q915J0689Q318L412Q762
$$ -2637 -4821 -9716 1378 13440 13591 21689 25530 18007 2490 -6425 4264 12582 15994 24756
3648B4756K851q023o375j7132p696r74J976J6150K3593M134j1800j4596j8630
$$ 24756 27607 19584 13209 -3923 -11619 -12593 -10617 5533 29126 33260 21460 6864 -11766
3635a1766n617k549L41J4869P664Q207K080j0293M698j59O90L659j1127o810Q238
$$ -11766 -17383 -19932 -19591 -4722 2942 11149 13229 2936 7634 7475 8165 11824 697 -6113 2125
3620B125J1736O14n309J859n486p247o298k625P477k670l12j344L623R4J6691
$$ 2125 13861 14475 9166 11025 5539 -1708 -8006 -10631 -3154 -5824 -6136 -7480 -3857 -3763 12928
3605A2928j947o646p819K315L741k165p457p372J694M057O67N391J295m518o949
$$ 12928 10981 4335 -3484 -1169 2572 407 -7050 -14422 -12728 -8671 -8004 -2613 -1318 -5836 -12785
3590a2785n977m01J0490J984K643O695R564n509m439K239q135r21N753J608J412
$$ -12785 -18762 -19163 -8673 -6689 -4046 2649 12213 6704 2265 4504 -3631 -4552 1201 2809 4221
3575D221l686M508N160P60j2234p394k008J0752O700m096o235L563J1748o093
$$ 4221 535 5043 10203 10963 -1271 -8665 -10673 79 6779 2683 -3552 11 11759 5666
3561E666N927r49m544M500p31n048J640o94L953j807m830n76N239K542j3736J069
$$ 5666 11593 10644 6100 10600 9869 4821 6461 5767 9720 7913 3083 2507 7746 10288 -3448 -2379
3545b379Q192p994M329K455m424J1993p369J549M563M603n57l540m742k195K854
$$ -2379 5813 -2181 2148 4603 179 12172 4803 6352 10915 15518 14961 11421 6679 4484 7338
3530G338k247k043k031o615L748J1164M220P752p329n936L597j471m20J93Q262
$$ 7338 5091 3048 1017 -5598 -1850 9314 13534 21286 13957 8021 11618 10147 9727 9920 18182
3515A8182k121q326Q021R006q736r164j18n878o932J470K379N86j799M894O346
$$ 18182 16061 7735 15756 24762 16026 6862 6744 866 -6066 -4596 -2217 -1631 -3430 1464 7810
3500G810M24o909k1999j3321J4443P164N423N537J52j598l328L70k537L228M629
$$ 7810 8234 1325 -20674 -33995 -19552 -12388 -6965 -1428 -1276 -2874 -6202 -5832 -8369 -5141 -512
3485e12P545L766j367K490j1104j4346J045L802P415M921q0K937O54r772n945
$$ -512 7033 10799 9432 11922 818 -13528 -12483 -8681 -1266 3655 3575 6512 7166 -2606 -8551
3470h551K986Q191K02K6j0962M708J0097M462N73N22j1852o714j076q438J0021
$$ -8551 -5565 2626 2828 2854 -8108 -3400 6697 11159 11732 12254 402 -6312 -7388 -15826 -5805
3455e805Q623J3575k005l101p844N366Q108l712N672p870l248J208K21j0247k143
$$ -5805 2818 16393 14388 11287 3443 8809 16917 13205 18877 11007 7759 8967 9188 -1059 -3202
3440c202N788L336P925j7283k836P567J2313P829q953J520k770m138l894j0425
$$ -3202 2586 5922 13847 -3436 -6272 1295 13608 21437 12484 14004 11234 7096 3202 -7223
3426g223j0089M803R92n414J1295n708l817P844L173j003p357r981J722Q993J0366
$$ -7223 -17312 -12509 -11517 -16931 -5636 -11344 -15161 -7317 -4144 -5147 -12504 -22485 -20763 -11770 -1404
3411a404L597k283J2129j766m729J2682m184j3820m639L980O900k664R00J0763
$$ -1404 2193 -90 12039 10273 5544 18226 14042 222 -4417 -437 6463 3799 4699 15462
3397A5462m493p364o63O933M755J027K852O57O694q900j758m519k13k457j610
$$ 15462 10969 3605 2942 9875 14630 15657 18509 19166 25860 16960 15202 10683 10470 8013 6403
3382F403j759m02M692L943J283n852j1789q163m424R39j341M485K389Q517k893
$$ 6403 4644 4242 8934 12877 14160 8308 -3481 -11644 -16068 -15129 -16470 -11985 -9596 -1079 -3972
3367c972J3041K899O622Q617j1411j1720l993l261M645N981j0012k533m786n13
$$ -3972 9069 11968 18590 27207 15796 4076 83 -3178 1467 7448 -2564 -5097 -9883 -10396
3353a0396J7559P089o649R398M7n443j185j0655L505P724q227M998k032o700j414
$$ -10396 7163 14252 7603 17001 17048 11605 10420 -235 3270 10994 2767 7765 5733 -967 -2381
3338b381l601J2720K566r182j3337k772J2712K02l323k912O55m620j343O373R940
$$ -2381 -5982 6738 9304 122 -13215 -15987 -3275 -3073 -6396 -9308 -8653 -13273 -14616 -8243 1697
3323A697q901j0477Q982Q081J011L993J4922k1592j958m374K408N242o344j21
$$ 1697 -7204 -17681 -8699 -618 393 4386 19308 -2284 -4242 -8616 -6208 -966 -7310 -7431
3309g431l160L177l442p683M703J9814L243N61j3845o027K412L471M977N065J790
$$ -7431 -10591 -7414 -10856 -18539 -13836 5978 9221 9782 -4063 -10090 -7678 -4207 770 5835 7625
3294G625J397m431q423m290O589j246p39O018m274k588q34K293L093Q163o977
$$ 7625 9022 4591 -3832 -8122 -1533 -2779 -3518 2500 -1774 -4362 -5196 -2903 190 8353 1376
3279A376j0002J0710N323m461j346r306n050Q162J4986L622q287m182m922K972
$$ 1376 -8626 2084 7407 2946 1600 -7706 -12756 -4594 10392 14014 5727 1545 -3377 -405
3265d05n79j623m364l712P61L916l6r629k003L247k616K231j9M844O372J070K394
$$ -405 -984 -2607 -6971 -10683 -9922 -6006 -6042 -15671 -17674 -14427 -17043 -14812 -14831 -9987 -3615 -2545 -151
3248a51K336m790k170J1293K036p830j162L609m583r411M633L357j42N080J6274
$$ -151 2185 -2605 -4775 6518 8554 724 -438 3171 -1412 -10823 -6190 -2833 -2975 2105 18379
3233A8379j870n239k547K920J53P161O118L435j0653j4289N876L302j842N046
$$ 18379 16509 11270 8723 11643 11796 18957 25075 28510 17857 3568 9444 12746 10904 15950
3219A5950J573j6197p776o289J1313J4659l013M997k903q772l843M21j3735j480
$$ 15950 17523 1326 -6450 -12739 -1426 13233 10220 15217 12314 3542 -301 120 -13615 -15095
3205a5095R201r898p581P67R046J3106K438j1251k379m8O658M625l055r40l389
$$ -15095 -5894 -15792 -23373 -22606 -13560 -454 1984 -9267 -11646 -11694 -5036 -411 -3466 -4406 -7795
3190g795l298n528k616o88R569k770P004j580k600l602J0602p44j342J4641M835
$$ -7795 -11093 -16621 -19237 -19925 -10356 -13126 -6122 -7702 -10302 -13904 -3302 -4046 -5388 9253 14088
3175A4088K260M887o093L747q961m719j455J007M914q538K582n582L94L761l382
$$ 14088 16348 21235 15142 18889 9928 5209 3754 4761 9675 1137 3719 -1863 -1469 2292 -1090
3160a090R350j2933j3917k148n249P230Q903m215q359J132m656M980J5152P727
$$ -1090 8260 -4673 -18590 -20738 -25987 -18757 -9854 -14069 -22428 -21296 -25952 -20972 -5820 1907
3146A907M039k528o113K825l567j189j2430k367J433M889n969M268R014k057R107
$$ 1907 5946 3418 -2695 130 -3437 -4626 -17056 -19423 -17990 -13101 -19070 -14802 -5788 -7845 1262
3131A262J59j414J923M990o997N759o125K819j752j0684o811J9031Q963q672n880
$$ 1262 1421 7 1930 6920 -77 5682 -443 2376 624 -10060 -16871 2160 11123 2451 -3429
3116c429K897O94q350j1061J597J8456J1937K525j5437j4013O141J480L849J0642
$$ -3429 -532 162 -8188 -19249 -17652 804 12741 15266 -171 -14184 -8043 -6563 -2714 7928
3102G928n816J6288o884q962j0011R060N261j5962j2065J36M563j4585P344J2490
$$ 7928 2112 18400 11516 2554 -7457 1603 6864 -9098 -21163 -21027 -16464 -31049 -23705 -11215
3088a1215j127n342n895k457J356M276K640J1723m46o919K475N211l093M697p630
$$ -11215 -12342 -17684 -23579 -26036 -24680 -20404 -17764 -6041 -6487 -13406 -10931 -5720 -8813 -4116 -11746
3073a1746j580N564P326r19J565l326K874J5498J0422M606o111r591l465n638
$$ -11746 -13326 -7762 -436 -1355 210 -3116 -242 15256 25678 30284 24173 14582 11117 5479
3059E479l765L040J865j0785p952j497m494J2019K4533l3J52L561n397o341k871
$$ 5479 1714 4754 6619 -4166 -12118 -13615 -18109 -6090 18443 18410 18562 22123 16726 10385 7514
3044G514r637J722R137l435j401Q56r943K641L073p498M316K239M624j352j4395
$$ 7514 -2123 -401 8736 5301 3900 4756 -5187 -2546 527 -6971 -2655 -416 4208 2856 -11539
3029a1539p508L822L420J5968J0677J355L247M285n865r580o386k259R42P576
$$ -11539 -19047 -15225 -11805 4163 14840 16195 19442 23727 17862 8282 1896 -363 579 8155
3015H155o062m770O194j0735l789J550R294J0713m5j3111K426R564J047j2744
$$ 8155 2093 -2677 3517 -7218 -11007 -9457 -163 10550 10505 -2606 -180 9384 10431 -2313
3001b313j299n61q65l908K531R64J3191Q097j1288j4802j1424O512J1279L653
$$ -2313 -3612 -4173 -5038 -8946 -6415 -5451 7740 15837 4549 -10253 -21677 -15165 -3886 -233
2987b33k232K976o444q249n670J5783J4222L070j0080k704J0672n49K02o439k048
$$ -233 -2465 511 -5933 -14182 -19852 -4069 10153 13223 3143 439 11111 10562 10764 4325 2277
2972B277j882J6462L130j2544l511p36J1334M970p238n20p726o641q11J529R154
$$ 2277 395 16857 19987 7443 3932 3196 14530 19500 12262 11742 4016 -2625 -3436 -1907 7247
2957G247j0390m016R225O305N881O382k422j1847r340l225j4m235Q172L405q331
$$ 7247 -3143 -7159 2066 8371 14252 20634 18212 6365 -2975 -6200 -6214 -10449 -2277 1128 -7203
2942g203J80j961Q558r235j4792R294J6356J7136J306o629j479j4104n608m396
$$ -7203 -7023 -8984 -426 -9661 -24453 -15159 1197 18333 19639 13010 11531 -2573 -8181 -12577
2928a2577M99M924J734N32k080O904J2647R938n977j7840k59n303m077q154J8945
$$ -12577 -12078 -7154 -5420 -4888 -6968 -64 12583 22521 16544 -1296 -1555 -6858 -10935 -19089 -144
2913a44J4477k33L646J63o062J545j8473r190j720J3856Q888r103j0963N898J5646
$$ -144 14333 14100 17746 17909 11847 13392 -5081 -14271 -15991 -2135 6753 -2350 -13313 -7415 8231
2898H231M683q602m123o46J4408R08j0575M217m493l892J0922m583k5359m515
$$ 8231 12914 4312 189 -457 13951 14859 4284 8501 4008 116 11038 6455 -18904 -23419
2884b3419J0940L484j2391p551R259N655o122r10P076M595O481R804O481l018
$$ -23419 -12479 -8995 -21386 -28937 -19678 -14023 -20145 -21055 -13979 -9384 -2903 6901 13382 10364
2870A0364R15m60J75j1636q723l578o406j524P555N311J4651J1530k838J995r979
$$ 10364 11279 10819 10994 -642 -9365 -12943 -19349 -20873 -13318 -8007 6644 18174 15336 17331 7352
2855G352m066o624R88Q277J6077M379j1581m296j115n545N414O815M841J892k5027
$$ 7352 3286 -3338 -2350 5927 22004 26383 14802 10506 9391 3846 9260 16075 20916 22808 -2219
2840b219m236l815o843M966N105L118J4669Q005r266j0548M832J879m139O638
$$ -2219 -6455 -10270 -17113 -12147 -7042 -3924 10745 18750 9484 -1064 3768 5647 1508 8146
2826H146l592j058L279pk690K885L346k702j439J497J1305p09j5190p593n160
$$ 8146 4554 3496 6775 6768 4078 6963 10309 7607 6168 7665 18970 18261 3071 -4522 -9682
2811i682K755n065l425n418J2580Q233O914M584n958j4619k360j709K963M484
$$ -9682 -6927 -11992 -15417 -20835 -8255 -22 6892 11476 5518 -9101 -11461 -13170 -10207 -5723
2797e723J2167k927o592o616o35L342r609m680J4583j924m621M729J5405K559
$$ -5723 6444 3517 -3075 -9691 -10326 -6984 -16593 -21273 -6690 -8614 -13235 -8506 6899 9458
2783I458m37M095n470q182j742k38K278n41l702M2K693p376q36P046M25J1734
$$ 9458 9021 13116 7646 -536 -2278 -2516 -238 -779 -4481 -4439 -1746 -9122 -9958 -2912 -2487 9247
2767I247p24L447p145p877m364l168M939N625j616J889R971J0067j0222j2284
$$ 9247 8523 11970 4825 -3052 -7416 -10584 -5645 -20 -1636 253 10224 20291 10069 -2215
2753b215l621N302n7r054N191J0481k743o062J286J253j759Q871l016p993M359
$$ -2215 -5836 -534 -591 -9645 -4454 6027 3284 -2778 -1492 -239 -1998 6873 3857 -4136 223
2738B23q07r201r945l438J6518K1822q39L812M468l573j1193j3120j2573K329
$$ 223 -584 -9785 -19730 -23168 -6650 15172 14333 18145 22613 19040 7847 -5273 -17846 -15517
2724a5517J3611o434J2999Q180j0456r020j136J285P446K804l094m134N175N332
$$ -15517 -1906 -8340 4659 12839 2383 -6637 -7773 -6488 958 3762 668 -3466 1709 7041
2710G041j381j7534P54N159k764N871J1234k874k0640P852R614r836N707J686
$$ 7041 5660 -11874 -11120 -5961 -8725 -2854 8380 5506 -15134 -7282 2332 -7504 -1797 -111
2696a11O93r938j796m561M577K272J0566M772N869j1220l822m314k766m225J7338
$$ -111 582 -9356 -11152 -15713 -11136 -8864 1702 6474 12343 1123 -2699 -7013 -9779 -14004 3334
2681C334P690R429L240l026j4176k460j0243r160N352l046l932O430o439P924
$$ 3334 11024 20453 23693 20667 6491 4031 -6212 -15372 -10020 -13066 -16998 -10568 -17007 -9083
2667i083O075m800J1551J186q216q797j098L243J2517O941j347j8367q802O231
$$ -9083 -3008 -7808 3743 4929 -3287 -12084 -13182 -9939 2578 9519 8172 -10195 -18997 -12766
2653a2766J6650j271q430j66J628N507L792m965m348j1510P878J3943m236j2917
$$ -12766 3884 2613 -5817 -5983 -4355 1152 4944 -21 -4369 -15879 -8001 5942 1706 -11211
2639a1211n46J1064P018R78j61m087o57L911k259l820r320r623r509O4N113l140
$$ -11211 -11757 -693 6325 7303 7142 3055 2398 6309 4050 230 -9090 -18713 -28222 -28158 -23045 -26185
2623b6185J2815J6893O403o789j151J3194O718J852r368k073n630o431M390L981
$$ -26185 -13370 3523 9926 3137 1986 15180 21898 23750 14382 12309 6679 248 4638 8619
2609H619j5438p907N985J3447j203j0106j779O039L822k344O885J313p115K161
$$ 8619 -6819 -14726 -8741 4706 3503 -6603 -8382 -2343 1479 -865 6020 7333 218 2379
2595B379j748m109M941l299Q299n640r073r58q131l184r296P027J9065N677m568
$$ 2379 631 -3478 1463 -1836 6463 823 -8250 -9208 -17339 -20523 -29819 -22792 -3727 1950 -2618
2580b618p541p211N801m65o998o18l803L731J0251O903O421j46j0864J748J3199
$$ -2618 -10159 -17370 -11569 -12034 -19032 -19650 -23453 -19722 -9471 -2568 3853 3707 -7157 -5409 7790
2565G790J0244j370r94O41j2055Q80M054P01j1501m310O489J2433r84M689Q510
$$ 7790 18034 16664 15670 16311 4256 5136 9190 9891 -1610 -5920 569 13002 12018 16707 25217
2550B5217l665l354j7401j2557M574J3825l31n483M287N856P41p673q864l920
$$ 25217 21552 18198 797 -11760 -7186 6639 6308 825 5112 10968 11709 4036 -4828 -8748
2536h748r872j5810L24R318J5913O926M239O770P865Q233l138j4675J0776O283
$$ -8748 -18620 -34430 -34106 -24788 -8875 -1949 2290 9060 16925 25158 22020 7345 18121 24404
2522B4404q738j4488j210J2259J0573r85k631j4976r52O663K48r758j553m337
$$ 24404 15666 1178 -32 12227 22800 21815 19184 4208 3256 9919 10167 409 -1144 -5481
2508e481J1020R709k888q000l906N819q319K663J830p234l291M002l321N717K026
$$ -5481 5539 15248 12360 4360 454 6273 -2046 617 2447 -4787 -8078 -4076 -7397 -1680 346
2493C46l884J8325Q880m823m203r259k629K105N924O31n848j065K54j415m209
$$ 346 -3538 14787 23667 18844 14641 5382 2753 4858 10782 11413 5565 4500 4754 3339 -870
2478h70p11R962K410q957l98J958K697l609O02p869r949R096n518j765N934q085
$$ -870 -1581 8381 10791 1834 1436 3394 6091 2482 3084 -4785 -14734 -5638 -11156 -12921 -6987 -15072
2462a5072m223J3287Q152P956J236P247P864n426K624j3501k445M483n002j1479
$$ -15072 -19295 -6008 2144 10100 11336 18583 26447 21021 23645 10144 7699 12182 7180 -4299
2448d299q613j62K112P961J095K504J1057J4395N615j0680k1792J955Q961J1476
$$ -4299 -12912 -13074 -10962 -3001 -1906 598 11655 26050 31665 20985 -807 1148 10109 21585
2434B1585j488M713m470j3592J102j084o077M577j71O51l449j2061l236k471l
$$ 21585 20097 24810 20340 6748 7850 6766 689 5266 5095 5746 2297 -9764 -13000 -15471 -15474
2419a5474n881O781M047o255o320k892K473J0663l441J1257J0157p346m430O959
$$ -15474 -21355 -14574 -10527 -16782 -23102 -25994 -23521 -12858 -16299 -5042 5115 -2231 -6661 298
2405B98n647n663J021K208q715k470Q275Q86n131R262R390K066J0438p203j3317
$$ 298 -5349 -11012 -9991 -7783 -16498 -18968 -10693 -9807 -14938 -5676 3714 5780 16218 9015 -4302
2390d302o643O343N738J326M039N291k370r35P217n858p251q13q00o374p080L025
$$ -4302 -10945 -4602 1136 2462 6501 11792 9422 8487 15704 9846 2595 1782 982 -5392 -12472 -9447
2374i447K515J79J0004J711j1066J0296P187l401M493p95r036l8N04P41q820R254
$$ -9447 -6932 -6753 3251 4962 -6104 4192 11379 7978 12471 11676 2640 2602 3106 3847 -4973 4281
2358D281R559q319J460r364l230L835P055j601j2481j2113p32o125J2424J2095
$$ 4281 13840 5521 6981 -2383 -5613 -1778 5277 3676 -8805 -20918 -21650 -27775 -15351 -3256
2344c256O450M597N722P451n470J1338j864o871o173q750J70Q93L689p668m494
$$ -3256 3194 7791 13513 20964 15494 26832 24968 18097 11924 3174 3344 4237 7926 258 -4236
2329d236K390R424O572o95L485j1732k3912Q397K2242Q022O000l803j5538n13
$$ -4236 -1846 7578 14150 13455 16940 5208 -18704 -10307 11935 19957 25957 22154 6616 6103
2315F103k904M12O348j378J1719j605j1396r25J052o786j396J2686k195k048r806
$$ 6103 3199 3611 9959 8581 20300 18695 7299 6374 7426 640 -756 11930 9735 7687 -2119
2300b119J073J6172j786o148k78l490n351P79o793k69R103K745p094n045N761
$$ -2119 -1046 15126 13340 7192 6914 3424 -1927 -1148 -7941 -8210 893 3638 -3456 -8501 -2740
2285b740k796r374P462J2309l768k328R11P514N008R349M304P79K611j920l253
$$ -2740 -5536 -14910 -7448 4861 1093 -1235 -324 7190 12198 21547 25851 26630 29241 27321 24068
2270B4068J185P8p467j5663p514j350l522J306Q782R375q7j5789q189J4816J6773
$$ 24068 25253 25331 17864 2201 -5313 -6663 -10185 -8879 -97 9278 9191 -6598 -14787 29 16802
2255A6802q813q312J789M798k576n409K47j844p75j6968P45K1953O992n33O679
$$ 16802 7989 -323 1466 6264 3688 -1721 -1474 -3318 -4093 -21061 -20316 1637 8629 8096 14775
2240A4775j1350j6255j3342N965l848q513Q244J1146R360M918O582J338o042n138
$$ 14775 3425 -12830 -26172 -20207 -24055 -32568 -24324 -13178 -3818 1100 7682 9020 2978 -2160
2226b160n949o041M424M727R218M522o759N068K461J463m43q493k303J2964K940
$$ -2160 -8109 -14150 -9726 -4999 4219 8741 1982 7050 9511 10974 10531 2038 -265 12699 15639
2211A5639j3488M247P335j943M676l789j3338j884K327q685N187M769L483M835
$$ 15639 2151 6398 13733 11790 16466 12677 -661 -2545 -218 -8903 -3716 1053 4536 9371
2197I371m160J339N17j2505j023q85N508j085J939p386P647J1333M194J601n270
$$ 9371 5211 6550 7067 -5438 -6461 -7346 -1838 -2923 -984 -8370 -723 10610 14804 16405 11135
$$ [...]
##END NTUPLES=NMR SPECTRUM
##END=
