##TITLE=Analysis number 310852
Compound Code mo 07706
Book Reference 439/19/29
Project Code adrs
Chemist Name ronp
##JCAMPDX= 6.0         $$ Bruker NMR JCAMP-DX V2.0
##DATA TYPE= NMR SPECTRUM
##DATA CLASS= NTUPLES
##ORIGIN= Bruker BioSpin GmbH
##OWNER= NMR
$$ XWIN-NMR		Version 3.5
$$ Fri Jun 24 08:36:35 2005 GMT Daylight Time (UT+1h)  MAYBRIDGE\NMR@NMR_250MHZ
##.OBSERVE FREQUENCY= 250.131544655141
##.OBSERVE NUCLEUS= ^1H
##.ACQUISITION MODE= SIMULTANEOUS (DQD)
##.ACQUISITION SCHEME= undefined
##.AVERAGES= 16
##.DIGITISER RES= 18
##SPECTROMETER/DATA SYSTEM= dpx250
##.PULSE SEQUENCE= zg30
##.SOLVENT NAME= CDCl3
##.SHIFT REFERENCE= (INTERNAL, CDCl3, 0, 16.522)
##AUDIT TRAIL= $$ (NUMBER, WHEN, WHO, WHERE, WHAT)
$$ ##TITLE= Audit trail, XWIN-NMR		Version 3.5
$$ ##JCAMPDX= 5.01
$$ ##ORIGIN= Bruker BioSpin GmbH
$$ ##OWNER= NMR
$$ C:\u/data/dgb/nmr/ADRS/4740/pdata/1/auditp.txt
$$ ##AUDIT TRAIL=  $$ (NUMBER, WHEN, WHO, WHERE, WHAT)
(   1,<2005-06-24 08:36:12.49 +100>,<MAYBRIDGE\NMR>,<NMR_250MHZ>,
      <created by zg, POWCHK disabled, PULCHK disabled
       configuration hash MD5:
       62 19 C7 07 E1 42 D1 B7 37 6C 3D D0 77 39 F9 E6
       data hash MD5: 64K
       E3 03 0E BF 60 6B 4A 71 A1 EE 5D 12 22 63 B0 1E>)
(   2,<2005-06-24 08:36:25.91 +100>,<MAYBRIDGE\NMR>,<NMR_250MHZ>,
      <Start of raw data processing
       ef LB = 0.3 FT_mod = 6 PKNL = 1 SI = 32K 
       data hash MD5: 32K
       2C CA E6 3B 35 B0 C7 96 45 74 A3 B9 01 76 61 DB>)
(   3,<2005-06-24 08:36:27.69 +100>,<MAYBRIDGE\NMR>,<NMR_250MHZ>,
      <apk 
       data hash MD5: 32K
       24 7C 0C 05 CC B1 5F D5 58 10 BD 78 F9 5E A6 23>)
(   4,<2005-06-24 08:36:28.50 +100>,<MAYBRIDGE\NMR>,<NMR_250MHZ>,
      <abs ABSG = 5 
       data hash MD5: 32K
       1F CC 2E A2 41 E6 AF 08 16 30 8A 74 C2 60 F3 14>)
$$ ##END=
$$ 
$$ hash MD5
$$ ED CC B7 3A 28 C3 96 91 0F 01 45 DD F4 30 D9 09
##$RELAX= 
##$RELAX= 
##$RELAX= 
##$RELAX= 
##$RELAX= 
##$RELAX= 
##$RELAX= 
$$ Bruker specific parameters
$$ --------------------------
##$DU= <C:\u>
##$EXPNO= 4740
##$NAME= <ADRS>
##$PROCNO= 1
##$TYPE= <nmr>
##$USER= <dgb>
##$AMP= (0..31)
100 100 100 100 100 100 100 100 100 100 100 100 100 100 100 100 100 100 
100 100 100 100 100 100 100 100 100 100 100 100 100 100 
##$AQSEQ= 0
##$AQ_mod= 3
##$AUNM= <au_zg>
##$AUTOPOS= <1 >
##$BF1= 250.13
##$BF2= 250.13
##$BF3= 250.13
##$BF4= 250.13
##$BF5= 500.13
##$BF6= 500.13
##$BF7= 500.13
##$BF8= 500.13
##$BYTORDA= 1
##$CFDGTYP= 0
##$CFRGTYP= 5
##$CHEMSTR= <none>
##$CNST= (0..31)
1 1 145 1 1 1 1 1 1 1 1 1 1 1 1 1 1 1 1 1 1 1 1 1 1 1 1 1 1 1 1 1 
##$CPDPRG= <>
##$CPDPRG1= <>
##$CPDPRG2= <>
##$CPDPRG3= <>
##$CPDPRG4= <mlev>
##$CPDPRG5= <mlev>
##$CPDPRG6= <mlev>
##$CPDPRG7= <mlev>
##$CPDPRG8= <mlev>
##$CPDPRGB= <>
##$CPDPRGT= <>
##$D= (0..31)
0 1 0 0 0 0 0 0 0 0.06 0 0 0 0 0 0 0.0002 0 0 0 0 0 0 0 0 0 0 0 0 0 0 
0 
##$DATE= 1119598571
##$DBL= (0..7)
120 120 120 120 120 120 120 120 
##$DBP= (0..7)
150 150 150 150 150 150 150 150 
##$DBP07= 0
##$DBPNAM0= <>
##$DBPNAM1= <>
$$ [...]
##$SUBNAM7= <"">
##$SUBNAM8= <"">
##$SUBNAM9= <"">
##$SW= 20.6930455092707
##$SWIBOX= (0..15)
0 0 3 0 0 0 0 0 0 0 0 0 0 0 0 0 
##$SW_h= 5175.983436853
##$TD= 65536
##$TD0= 1
##$TE= 295.16
##$TE2= 300
##$TE3= 300
##$TEG= 300
##$TL= (0..7)
0 120 120 120 120 120 120 120 
##$TP= (0..7)
150 150 150 150 150 150 150 150 
##$TP07= 0
##$TPNAME0= <>
##$TPNAME1= <>
##$TPNAME2= <>
##$TPNAME3= <>
##$TPNAME4= <>
##$TPNAME5= <>
##$TPNAME6= <>
##$TPNAME7= <>
##$TPOAL= (0..7)
0.5 0.5 0.5 0.5 0.5 0.5 0.5 0.5 
##$TPOFFS= (0..7)
0 0 0 0 0 0 0 0 
##$TUNHIN= 0
##$TUNHOUT= 0
##$TUNXOUT= 0
##$USERA1= <user>
##$USERA2= <user>
##$USERA3= <user>
##$USERA4= <user>
##$USERA5= <user>
##$V9= 5
##$VALIST= <valist>
##$VCLIST= <CCCCCCCCCCCCCCC>
##$VD= 0
##$VDLIST= <DDDDDDDDDDDDDDD>
##$VPLIST= <PPPPPPPPPPPPPPP>
##$VTLIST= <TTTTTTTTTTTTTTT>
##$WBST= 1024
##$WBSW= 4
##$XGAIN= (0..3)
0 0 0 0 
##$XL= 0
##$YL= 0
##$YMAX_a= 384520
##$YMIN_a= -440958
##$ZGOPTNS= <>
##$ZL1= 120
##$ZL2= 120
##$ZL3= 120
##$ZL4= 120
##$ABSF1= 16.522
##$ABSF2= -4.171173
##$ABSG= 5
##$ABSL= 3
##$ALPHA= 0
##$AQORDER= 0
##$ASSFAC= 0
##$ASSFACI= 0
##$ASSFACX= 0
##$ASSWID= 0
##$AUNMP= <proc_1d>
##$AZFE= 0.1
##$AZFW= 0.1
##$BCFW= 0
##$BC_mod= 0
##$BYTORDP= 0
##$COROFFS= 0
##$CY= 12.5
##$DATMOD= 1
##$DC= 0
##$DFILT= <>
##$DTYPP= 0
##$F1P= 14.0000005364418
##$F2P= -0.99999901652339
##$FCOR= 0.5
##$FTSIZE= 32768
##$FT_mod= 6
##$GAMMA= 0
##$GB= 0
##$INTBC= 1
##$INTSCL= 1
##$ISEN= 128
##$LB= 0.3
##$LEV0= 0
##$LPBIN= 0
##$MAXI= 10000
##$MC2= 0
##$MEAN= 0
##$ME_mod= 0
##$MI= 0
##$NCOEF= 0
##$NC_proc= -3
##$NLEV= 6
##$NOISF1= 0
##$NOISF2= 0
##$NSP= 0
##$NTH_PI= 0
##$NZP= 0
##$OFFSET= 16.522
##$PC= 1
##$PHC0= 129.7356
##$PHC1= 6.140859
##$PH_mod= 1
##$PKNL= yes
##$PPARMOD= 0
##$PSCAL= 4
##$PSIGN= 0
##$REVERSE= no
##$SF= 250.13
##$SI= 32768
##$SIGF1= 0
##$SIGF2= 0
##$SINO= 400
##$SIOLD= 32768
##$SREGLST= <1H.CDCl3>
##$SSB= 0
##$STSI= 32768
##$STSR= 0
##$SW_p= 5175.98343685301
##$SYMM= 0
##$S_DEV= 0
##$TDeff= 65536
##$TDoff= 0
##$TI= <Analysis number 999999
Compound Code 99
Book Reference 9
Project Code 9>
##$TILT= no
##$TM1= 0
##$TM2= 0
##$TOPLEV= 0
##$USERP1= <user>
##$USERP2= <user>
##$USERP3= <user>
##$USERP4= <user>
##$USERP5= <user>
##$WDW= 1
##$XDIM= 32768
##$YMAX_p= 454427542
##$YMIN_p= -91616
$$ End of Bruker specific parameters
$$ ---------------------------------
##NTUPLES= NMR SPECTRUM
##VAR_NAME=  FREQUENCY,     SPECTRUM/REAL,   SPECTRUM/IMAG
##SYMBOL=    X,             R,               I
##VAR_TYPE=  INDEPENDENT,   DEPENDENT,       DEPENDENT
##VAR_FORM=  AFFN,          ASDF,            ASDF
##VAR_DIM=   32768,         32768,           32768
##UNITS=     HZ,            ARBITRARY UNITS, ARBITRARY UNITS
##FACTOR=    0.157963299565203, 1,           1
##FIRST=     4132.6476996994, 0,             0
##LAST=      -1043.33573715361, 0,           0
##MIN=       -1043.33573715361, -91616,      0
##MAX=       4132.6476996994, 454427542,     0
$$ Real data points
##PAGE= N=1
##DATA TABLE= (X++(R..R)), XYDATA
$$ [...]
24013 -10430 -9735 -3529 1208 9789 9424 6830 6629 1092 -3432 -5209 -2195 4901 1617 -6794 -6402
23998 -6402 -1974 2423 5819 6462 -1082 -1119 2964 3370 5951 2829 2641 2869 -2314 -4407 -543 4602
23982 4602 10779 4944 463 2650 3648 -1839 -970 -185 9022 5035 -897 -779 -216 2064 -1049 -8933
23966 -8933 -11051 -9523 -7082 -2338 -5699 -9422 -10049 -8160 -8282 -4200 -4646 -4110 -1542 -1834 -4812 -4211
23950 -4211 -508 379 -1077 -5475 -1838 9942 16533 17577 10374 3605 1069 -908 -5479 -3744 -2691
23935 -2691 3284 5631 813 -2290 3984 447 2279 8416 3872 -2008 -8258 -3382 -945 399 -1626
23920 -1626 -3131 -1654 -2077 1069 1759 -5427 -5208 -4125 -611 2553 5344 8012 7265 5929 -344 -4594
23904 -4594 -4242 1910 1813 -3291 -3618 1920 -2376 -8537 -8394 -4180 1204 362 -3981 -5301 -3627 -947
23888 -947 514 -1901 793 235 2131 143 1312 234 -6162 -7168 -3676 -1118 1080 1346 2281 565
23872 565 2463 624 -357 -3719 -4939 -5206 -7342 -6726 -7828 -6105 -3843 2118 7123 8097 -606 -384
23856 -384 -2367 -612 785 1266 -895 -1770 -4835 -8394 -5338 -59 3130 -1393 -8885 -8701 -677 4639
23840 4639 5245 4198 8757 3136 1916 2634 417 1798 546 1252 3964 6026 4038 2720 3203 -3151
23824 -3151 -5779 -6978 -6847 -6073 -1574 4009 3312 -1555 -7181 -6347 -5320 -1561 1778 -102 -1827 -1798
23808 -1798 3025 896 -127 987 5581 2639 4318 2628 -9635 -10820 -3945 -1203 -6106 -4952
23794 -4952 -4477 2037 4614 2368 4035 4312 1453 26 2791 380 2090 2871 3348 4726 3099 369
23778 369 1225 2709 1105 606 4543 5904 10455 8145 5716 3260 1536 60 1037 2575 3926 5788
23762 5788 5372 186 -151 -1230 118 2298 4268 3860 2909 312 2803 8147 14685 9067 5130 4821
23746 4821 4331 -1194 2796 8645 14745 14786 10370 9473 18001 10031 -418 -1582 -539 24 2717 4704
23730 4704 7267 4075 1095 1414 624 -1108 2621 3383 681 6190 4665 5344 6123 6084 9358 8465 2876
23713 2876 -622 1335 2296 -1372 -6044 -6795 -8701 -6530 -6303 -7523 -8334 -5012 -3227 -524 -5617 -11566
23697 -11566 -11339 -6240 -3778 -9058 -4850 -3112 527 3067 5623 7760 7236 3867 -4033 -9691 -11587
23682 -11587 -13720 -14311 -8951 -3734 -22 1549 4948 3736 961 1764 6214 9711 5955 -3039 -6325
23667 -6325 3208 5034 1406 -75 3594 11157 8024 -1543 -5906 730 1177 2563 1720 1577 7028
23652 7028 4663 823 -1625 -6064 -4683 383 1299 251 4781 10333 6029 635 -3497 -10325 -11185
23637 -11185 -7856 -9036 -10529 -13276 -9454 -2329 6008 4194 222 1255 -1530 -3736 -6458 -4888
23623 -4888 -1411 -462 -4113 -1385 -75 4120 3846 5657 605 1343 -3158 -2389 -1691 -7122 -329 5529
23607 5529 6916 2757 2719 4322 658 -448 -689 1815 -3164 -559 1634 302 -297 -1255 -312 2498
23591 2498 -336 1107 -172 -5203 -6438 -3544 -5287 -1535 6130 6884 476 -850 -1372 -2214 -6335
23576 -6335 -9592 -8200 -2379 3061 5110 7492 2506 -4062 -5592 -3286 -3087 -4105 -3990 -4056 -7388 -7035
23560 -7035 -7058 164 4748 -1792 -5476 -22 5108 548 4771 9926 9865 294 796 -2441 4704 10231
23544 10231 10360 11014 16923 12948 2581 4666 9792 6991 5373 4204 -1016 -787 -577 5150 10227
23529 10227 6953 3175 7173 14696 13878 13058 10690 6120 7277 4824 2600 5651 -1059 -2695 -674
23514 -674 -6740 -7840 -9140 -5816 -1274 -3544 -9321 -6934 -4754 -6842 -7586 -3982 -3159 -141 1683
23499 1683 -402 1472 4048 8088 5870 9361 11108 7362 12389 12168 4317 -2692 2806 2360 -3961
23484 -3961 915 7239 7274 -3322 -3791 806 2119 2054 -2033 -8766 -12467 -1335 5392 6359 9003 5366
23468 5366 -700 -6929 -1039 4447 8481 7176 4774 6643 7566 7790 1919 -2773 4593 9821 12308
23453 12308 8116 1576 -3482 -5650 -4039 -6691 -7571 -3033 -5877 -5444 265 -401 3179 3661 873
23438 873 -1069 -1586 1868 4709 5585 7531 10878 7268 2486 47 3395 4942 8104 4931 2136
23423 2136 1514 2975 4245 5066 1829 3896 10289 12289 9315 7439 6097 2362 -52 -3084 1796
23408 1796 8436 10001 6612 7785 6838 5217 3985 4515 3608 -2611 -3183 -1180 4654 10643 8118 6406
23392 6406 3325 -551 794 5357 7631 6391 3798 672 -429 10878 14456 9876 3928 5216
23378 5216 3542 4258 -1221 -5167 -2221 -1227 1858 2024 3155 5670 11221 5899 -2081 -104 1675
23363 1675 -1472 1322 5319 9047 13980 13989 12967 3627 -4446 -6519 143 9806 9028 515 -750 -2176
23347 -2176 123 -230 2814 5990 857 357 1491 1660 3547 5539 6220 6777 4211 -729 -5469 -991
23331 -991 7472 10191 6067 2811 -1561 -2506 -1214 -884 -3901 4007 5108 -1659 -2069 6 5618 2893
23315 2893 -5612 -8768 -9221 -3732 -4868 -9124 -10788 -10797 -9342 -1337 5784 6527 10634 10167 5849 4908
23299 4908 -2522 -4855 -6995 -9467 -655 3252 5097 5740 4758 9697 11070 14052 2523 -7050 -1361
23284 -1361 -2691 -2536 -281 1366 -4052 3136 5418 9040 8601 1581 3365 7620 3049 2984 -250 -2296
23268 -2296 -5399 -460 508 -500 5659 4784 -7 306 -3531 -6300 -8348 -3809 -1218 2539 4190
23253 4190 1893 -1954 642 6322 8788 1858 -829 4088 12361 14948 9732 1710 636 -1161 -4479
23238 -4479 -9922 -3518 1347 -1688 -288 -3019 1366 2586 -6552 -3797 -3230 -5073 -8237 -2982 6781
23223 6781 4785 3520 5539 4417 7007 4167 2794 869 -1124 -2372 -5903 -5503 525 509 2071
23208 2071 5036 9436 9473 5607 7329 4175 3537 3567 45 1162 2020 4316 8379 11740 10594 7640
23192 7640 4426 -1013 3805 6218 5629 832 245 4107 6477 8300 6958 3051 1389 950 843 1603
23176 1603 1111 2508 -803 -2413 -2001 142 -1263 -3176 1436 -2178 -11225 -15209 -11316 -8273 -9968
23161 -9968 -7789 -838 -522 -4915 -2163 4993 5278 1621 2947 8183 9267 4991 -1330 1117 4424
23146 4424 3856 1588 1804 -2741 -5497 -5206 1502 2815 -1030 -4581 3993 2994 -191 3252 5335 5222
23130 5222 1424 9073 13918 12245 11461 3211 597 4610 2646 2655 -825 -14 -214 652 1311 4227 6376
23113 6376 6867 9370 -2792 -9996 -7860 -3074 -2470 4827 10980 7824 7504 9109 11697 18118 12717
23098 12717 3237 -201 2749 6353 4949 5512 2504 7801 12771 12358 10912 6720 2730 6325 9257
23083 9257 1601 1632 11027 16328 12821 7462 7587 9159 6956 3150 4294 13373 13424 6107 2917 3162
23067 3162 359 -48 5637 5489 1733 -3240 -3295 7245 10108 9216 8539 13045 6418 -1556 -2268 2274
23051 2274 443 -1278 232 2237 399 2118 3811 -1031 -3680 -4753 4724 11041 11197 9551 675
23036 675 965 7204 8014 7526 8186 12515 17347 18105 8695 -710 -2060 2606 7307 10794 6504 -182
23020 -182 -1552 1790 3117 1674 3895 -1591 -4165 -9282 -2384 4807 3737 6782 5944 4405 7860
23005 7860 6443 4251 7279 11566 17880 9861 2786 3925 10984 13260 13536 10954 5310 2638 1995
22990 1995 -1948 -1460 3707 7175 1331 -538 -466 3007 7909 9689 12894 8676 4703 5807 4418
22975 4418 1868 -3121 -2806 2626 3767 8276 12334 8353 2154 2746 6424 2844 6892 11371 8358
22960 8358 3706 3047 6354 4014 -1370 4198 17653 20050 18921 12503 11309 13703 11167 12828 10849
22945 10849 11912 9153 9006 7080 5592 4683 -423 1247 6739 6764 9445 16069 19808 13821 5778
22930 5778 7593 7242 4618 4469 5212 7817 12134 14851 9113 5537 11732 12162 6826 7006 5085 6077
22914 6077 13161 16659 9231 4499 5149 5836 -967 -1561 7538 6343 3355 3652 4239 4085 3503 493
22898 493 -2881 552 7242 8248 7421 3298 -801 -1002 -2557 4768 12550 10000 15552 18909 12733
22883 12733 7723 9642 15206 19545 19694 15952 8510 10235 9921 7762 15886 19441 16858 13228 8038
22868 8038 3795 -3108 -2623 5093 9933 11964 12987 13082 5630 3407 8817 8083 6909 3928 8337 14366
22852 14366 12916 11378 17677 19577 13970 11042 12746 15237 14994 14907 12775 6239 7387 6466 9906
22837 9906 9122 9594 11672 17623 20870 24622 26069 23575 34495 31769 32718 43432 51630 61484 72440
22822 72440 84337 106697 153251 213514 299641 400374 492010 556763 591993 605830 618126
22811 618126 631931 621229 589961 521839 421433 338424 280249 240092 215788 191966 175650
22800 175650 166330 154000 147639 138737 134183 131313 125430 120731 118490 111072 103097 101025 105431 106455
22786 106455 103691 104690 104643 99655 96105 96271 93476 95609 96962 89762 83254 83160 85394 87139 81059 75682
22770 75682 70977 74478 74941 67507 65569 57101 50179 47764 50293 51959 57182 57915 51631 48496 42685
22755 42685 46529 50983 52502 49057 45863 44103 41977 39545 31585 25682 26323 23527 17847 13726 7638
22740 7638 10611 16699 16904 19209 24936 22644 17116 17976 23501 20248 14142 9097 12287 14027 7627
22725 7627 2671 1223 1485 10236 12737 8770 6162 7982 9899 8064 7485 13146 12068 12156 13245 17774
22709 17774 19470 20320 25601 33452 32100 29123 25465 23184 30620 34111 35691 34211 29877 20887 13408
22694 13408 11502 14126 15717 7630 359 -123 1470 900 -1349 149 3532 10768 7106 4020 3997
22679 3997 4507 2800 4187 8742 9512 10606 13330 10379 7862 10237 12942 10714 5307 11228 12044
22664 12044 9515 2659 102 -1966 3163 3499 3867 8647 10723 10296 14558 17331 13846 3620 -2039
22649 -2039 1082 3237 1332 -3501 -5591 -940 10274 13918 13768 19288 23887 31506 34700 33217 25877
22634 25877 21936 24094 24211 20305 17946 13161 8625 9582 12801 23926 23891 19043 20410 15471 8478
22619 8478 8829 8546 16259 20941 20068 19010 15715 14485 16162 16535 15629 17214 15483 19661 21945 15481
22603 15481 8008 5838 7823 9567 12579 17458 11941 11391 15885 20109 14912 9897 14110 16588 15978
22588 15978 12904 13782 18024 10297 6327 11112 12534 5074 -3780 -4445 -2055 -3074 -5956 -10491 -14795
22573 -14795 -18243 -25901 -26703 -27545 -29640 -14629 -4567 -3411 2897 16634 21684 31496 43418 51348
22559 51348 55437 55154 55773 54549 50832 52199 55865 53929 53967 50837 51799 45916 38257 33171 36735 39513
22543 39513 44552 46266 50923 53555 54226 54014 56951 56886 55696 49925 47113 45826 42897 41561 47602
22528 47602 54161 50277 45817 42907 47529 55906 66048 68490 71123 84044 101461 120865 145686
22515 145686 177619 205317 218126 238418 250958 265987 274186 266521 245209 220757 205022 194621
22503 194621 179982 161825 139666 123463 113572 107203 103009 99958 94740 88306 82841 86401 90904
22490 90904 85585 84609 79311 75983 73980 62860 55360 54428 51742 52258 51768 50166 43300 34697 29393
22475 29393 33537 42584 51676 56598 51856 52030 57370 57267 59636 65875 69578 64224 59231 56835 53556
22460 53556 53244 54934 57055 50029 40522 34746 39575 43837 55042 65499 72154 79557 87371 86739
22446 86739 85797 79580 67171 51932 38392 28274 16896 5884 -4780 -12251 -15992 -12745 -22
22433 -22 11584 21755 28639 28779 36191 41389 40288 39327 33853 38636 43089 41173 43410 41545 37260
22418 37260 40887 37669 34442 36888 33743 32519 38529 46459 44603 42619 46733 49478 48464 57007
22404 57007 57161 56235 56587 61979 60998 60896 65515 65734 60553 59700 67654 83760 98441 106174 111961 122721
22388 122721 138121 158372 168916 174265 175766 172264 176847 174669 161936 157339 142955 132271 122739
22375 122739 111420 104130 108870 107392 109219 112288 113413 116174 118756 122247 122578 120106 124007 127199
22361 127199 128694 130541 136198 139232 142585 151519 154402 164332 174668 188308 206469 221330 237990
22348 237990 260856 278003 295989 314959 342450 370169 399696 438471 475104 509942 551613
22337 551613 605511 669193 761205 871219 982802 1063576 1106488 1126812 1140951 1166445 1198290
22326 1198290 1194334 1149239 1081834 1018991 977906 955360 936014 924040 915927 909207 908518 902778
22314 902778 892821 884533 878767 870946 873668 876816 888494 900006 914819 929647 946935 961895 983169
22301 983169 1004574 1027996 1044606 1050051 1062799 1078909 1087974 1096682 1110428 1132847 1158510 1186797
22289 1186797 1218984 1254334 1298382 1345116 1401071 1462019 1525630 1610497 1708096 1825948 1958209
22278 1958209 2107481 2285928 2505301 2791892 3157072 3608939 4144882 4766657 5507311
22269 5507311 6453527 7769624 9598534 12116535 15587129 20601381 28245088 39974285
22261 39974285 56369108 74925146 90679263 100098809 104154455 105459639 107566479 109860113
22253 109860113 108111731 100165420 86241742 70136749 56473925 46740046 40055526
22246 40055526 35314433 31797253 29057552 26857563 25032074 23494410 22175755 21043270
22238 21043270 20084828 19281611 18596743 18002231 17489567 17052263 16687849 16398424 16176487
22229 16176487 16028409 15961727 15904031 15818138 15697667 15523108 15356019 15199901 15006222 14750618
22219 14750618 14372135 13895751 13371230 12841929 12323656 11801909 11256442 10687324 10101955
22210 10101955 9526546 8983297 8465147 7969542 7506849 7079805 6685402 6310053 5958264
22201 5958264 5624571 5311167 5017540 4744885 4487376 4244401 4016081 3801112 3602053
22192 3602053 3421434 3262400 3127247 2998368 2888016 2818234 2778627 2763283 2740768 2694466
22182 2694466 2617133 2527974 2449088 2372207 2278100 2155211 2005984 1841557 1686932 1562399
22172 1562399 1462336 1379958 1312766 1251404 1191008 1139181 1091192 1042721 989891 943150 909465
22161 909465 878678 845063 812021 782113 753278 721329 686874 661188 637439 614937 596534
22150 596534 571608 550754 532840 522832 520364 521724 526494 535811 552134 579041 623934 703041
22138 703041 810976 957367 1170662 1484995 1942543 2523539 3025754 3135905 2798179 2269105
22128 2269105 1805562 1477384 1240659 1075311 944671 837225 748106 670950 614681 572867
22118 572867 535708 503639 475226 450240 432300 418111 410379 403451 394875 389834 383180 376928 375901
22105 375901 383308 389200 394961 401758 405233 411243 420714 419875 418913 423476 423885 430795 436728 440483 445211
22090 445211 446789 446722 448235 446337 443703 443488 447506 449312 448717 452111 460012 465294 469285 478492 481330
22075 481330 485204 480519 472187 461569 448533 433808 413193 389639 369977 355469 341209 336128
22063 336128 334320 335664 329092 328788 329617 332504 335805 324836 311978 305580 300929 291501 274961 264589
22049 264589 261243 256406 246803 239574 235093 225741 218311 212042 208263 209104 212418 213715 211999 203222
22035 203222 198979 197656 191505 185182 178826 167387 156846 156267 142030 135157 131553 124113 118235 109866
22021 109866 105110 98763 93161 93828 94854 97016 102035 108006 117423 126404 138256 149422 159987 166817
22007 166817 167105 170413 170832 160879 156355 143164 128693 111671 94391 82751 80083 73127 56257
21994 56257 49367 41818 37484 36265 33344 34112 34122 34240 33200 30546 24153 12605 2902 1385 -11
21979 -11 -1656 -6496 -9319 -10373 -11544 -7654 -8030 -4542 -4088 -5585 -10818 -9048 -6475 -3622 257 2150
21963 2150 288 -846 3453 9517 12972 13628 11574 5154 6335 8002 5572 7138 16367 31930 46104
21948 46104 63490 73859 77710 81711 87669 100353 108244 106104 106268 101335 98219 103291 96376 88761
21934 88761 85048 83145 76643 79005 80229 76839 74649 78380 73426 70667 69219 72171 77248 76099
21920 76099 71160 70600 71861 67010 62438 65379 65939 59618 60770 55776 55374 61438 67700 71265 72986
21905 72986 64677 55955 56412 50336 49320 49156 38577 35272 42125 53784 56018 50493 49089 48351 45343
21890 45343 49108 54802 60349 63951 60546 54329 51669 46767 45192 49144 57128 56716 52530 49825 41699
21875 41699 36834 33013 31300 37946 41426 43142 37290 30014 31212 27279 26484 32945 33671 26888 18318
21860 18318 13968 22067 24915 21542 21601 23241 19951 20763 24148 24642 21880 18127 14671 20475 20645 11799
21844 11799 51 1894 5149 7325 13265 13130 14735 11754 17598 19302 17638 10520 5417 3856
21830 3856 9808 20922 19668 19246 18979 19057 17728 15399 17943 23795 23343 24140 12798 10825 14152 17411
21814 17411 15918 13624 10116 6435 1050 6237 11198 5330 1467 6361 8531 6384 9949 16124
21800 16124 13768 19717 25670 30479 27456 24883 18829 18725 21060 23357 28793 27254 24953 29986 32530
21785 32530 35955 37084 37850 34718 29585 29541 28775 27969 30349 26502 25612 26897 25296 25206 29279 27982
21769 27982 29548 30439 26489 32057 35118 35499 30727 25373 22108 22342 26755 27780 25495 26369 25382 21407
21753 21407 22337 16431 16742 20054 15672 16350 17642 12305 6728 5774 5981 10631 12408 11035 12176 7045
21737 7045 7106 6989 8916 9328 5432 2934 11132 10900 6196 7313 12464 10358 3870 3573 8015 8596
21721 8596 6608 3403 933 3292 8397 6381 4618 4034 11215 19802 19825 12095 5482 3697 9657
21706 9657 13064 14878 19363 33543 38910 46093 57819 74212 99128 139213 201002 284947 383829
21693 383829 475896 539687 573721 583543 591856 609155 612535 582160 519113 429448 347061 290184
21681 290184 247674 215615 193126 171365 158709 149214 141785 127463 110218 99464 95050 94597
21669 94597 96824 93946 92101 98630 100904 103071 107939 108198 100613 95341 91644 88234 86077 85460 90361
21654 90361 89565 86014 85926 87732 83474 85051 83772 75015 70412 64174 66954 69424 63512 59795 56042
21639 56042 46314 41801 40863 41877 39378 36839 35111 30905 24964 23856 32715 31440 37558 40971 39770
21624 39770 31687 19168 10347 8090 11292 9070 3767 5695 9171 14622 18472 12014 12400 17803
21610 17803 17064 7855 6811 7096 5453 3506 3706 1958 2051 678 2365 -1410 -518 -277 -1032 6279
21594 6279 924 -4305 -1709 -3928 -4182 136 -986 2220 1259 -4353 -8604 -9422 -8648 -10222 -4707 -6206
21578 -6206 -10989 -7552 -2064 -1501 -4206 -3384 -841 -2246 -3455 -1914 -2640 -5020 -2542 841 2009
21563 2009 -1272 -4637 -4689 -3697 5267 13134 17543 16109 18995 12967 4551 1905 -4086 -2793 3953
21548 3953 3962 194 3825 5819 6367 6523 8682 7160 4212 5716 10226 12566 7495 516 643 3756
21532 3756 3129 6528 415 -1038 944 1871 1445 3245 7664 8300 5356 1888 -1722 -602 -1145 -3612
21516 -3612 -2641 -994 690 -2947 -4447 2027 6864 4428 1327 -6253 -2873 1770 2970 3512 1601
21501 1601 -641 -2387 -9616 -11784 -9913 -6838 -6177 -2755 -1178 198 -1059 2154 -2801 -5215 -6072
21486 -6072 -10707 -9515 -8034 -5343 -7803 -4337 7771 4266 -1740 2362 -2284 -5592 -5306 -6599 -10493
21471 -10493 -13552 -12257 -8938 -9122 -12864 -16024 -10472 -3527 -2183 -2773 -2635 2658 4128 1064 711
21456 711 3521 465 -2229 -885 -396 -199 767 -2388 -3045 -7455 -10658 -14310 -15046 -11729 -7114 -3035
21440 -3035 -8053 -15172 -17629 -17133 -16758 -6490 -1036 -2513 -8844 -12927 -6673 -7554 -5966 3292 5628
21425 5628 1035 -7992 -8053 -8953 -14114 -5647 7092 5401 1253 -792 -3041 -6301 -3357 -1060 -1090 -6434
21409 -6434 -9038 -7902 -7244 -2371 -1292 3873 15768 23162 18860 14587 12711 2744 1249 676 -6603
21394 -6603 -10492 -6805 -1585 2317 4446 4190 2102 -1044 -10921 -14495 -8695 -2516 -2439 -3439 1626
21379 1626 2818 4258 2223 -464 -3311 -7516 -3372 -4951 -12070 -11597 -6450 -2754 -2328 475 6301
21364 6301 6762 689 628 -816 -5550 -4354 -823 3550 6841 2582 -3793 -10437 -12533 -12553 -9169 -7446
21348 -7446 -6078 -4320 -1675 5012 8158 2245 -7831 -11679 -5786 -2125 -1601 -2134 -2957 -1471 -4744
21333 -4744 -5620 -7737 -6126 -8573 -2849 -4076 -7100 -9969 -8627 -4388 -2981 -9180 -12275 -9846 -6943
21318 -6943 -4230 -5880 -6607 -4945 -2841 -2861 -3332 -3345 2017 2650 3535 4771 5356 5723 2439 -1300 -802
21301 -802 -402 4095 292 2338 -545 -4696 -1389 -4085 -729 -1989 -5382 -5583 -9131 -9486 -7951 -4603
21285 -4603 3296 -3546 -6131 -13189 -13367 -11473 -12976 -13953 -17123 -9478 -7002 -6437 -9004 -16091 -18604
21270 -18604 -19170 -18802 -12626 -14627 -22262 -22993 -17100 -12623 -16190 -18370 -13445 -9544 -6157 -1945 2589
21255 2589 489 1075 -1128 -7826 -3284 -7314 -9645 -5142 -3545 -3680 -6262 -14347 -17754 -15339 -13645
21240 -13645 -8818 -12116 -20434 -23849 -20135 -11738 -10744 -12331 -9890 -9239 -3693 -1754 1481 879 -2722
21225 -2722 -1137 -1758 -4419 -9394 -13165 -16605 -15981 -10102 -5921 -4174 -189 -2334 -891 -1173 -2431
21210 -2431 -3915 -2262 -5676 -8391 -10434 -7457 -8730 -4865 -3019 -8037 -9890 -11391 -14044 -15453 -15580
21195 -15580 -8845 -6967 -10295 -5331 -2987 -7698 -8412 -6877 -8483 -12366 -10475 -7851 -8215 -8843 -10213
21180 -10213 -8253 -2994 -11037 -14966 -10651 -13818 -11652 -10628 -12537 -12045 -9572 -1640 -2641 -5312 -5797
21165 -5797 -6961 -3744 -4043 -9011 -9242 -9626 -10776 -15669 -14798 -13786 -11230 -8719 -4152 -3846 -1982 -5561
21149 -5561 -6131 -7476 -4900 -6815 -15692 -12613 -10491 -13504 -13845 -12912 -15820 -15218 -9493 -5288 -8583 -6107
21133 -6107 -8795 -10497 -9317 -6388 -3810 -9533 -14831 -17125 -17022 -19625 -19873 -19987 -14886 -11204 -13829
21118 -13829 -16349 -13365 -10945 -11558 -8191 -11959 -13257 -11268 -9217 -5212 -2699 -1241 -8229 -7407 -6548
21103 -6548 -6789 -9207 -10183 -9829 -13266 -18402 -20410 -16084 -12329 -10672 -9018 -6890 -13036 -11594 -9652
21088 -9652 -15240 -15200 -14899 -15526 -18700 -16045 -9634 -2669 -5474 -9747 -9175 -9478 -10498 -9095 -9876 -16540
21072 -16540 -15176 -16941 -19316 -19449 -20164 -13807 -6899 -699 -6300 -15564 -17694 -23322 -13897 -9948 -6312
21057 -6312 -3028 -5888 -8621 -10995 -6246 -11018 -11444 -8291 -3019 -2551 -6850 -6710 -8136 -11512 -12362 -11411
21041 -11411 -5299 -11296 -10244 -12750 -14849 -13905 -13199 -10624 -7398 -7148 -8830 -10529 -4616 -1996 -12291
21026 -12291 -10346 -10390 -13152 -13583 -10912 -9712 -7116 -73 785 -3504 -7735 -10951 -11206 -13852 -17276 -18411
21010 -18411 -11842 -3939 -5204 -8459 -6581 473 8044 7035 1022 -1780 -2624 -3479 -6543 -4153 -5101
20995 -5101 -5396 -3603 2519 -3663 -5726 -7538 -6974 -3805 -9803 -11767 -10925 -7189 -4751 -202 5127
20980 5127 5865 6549 777 -7525 -7526 -6986 -9392 -14233 -14773 -10445 -7795 -7983 -7441 -8868 -8157 -8553 -14038
20963 -14038 -9213 -11981 -10069 -3597 -3777 -7254 -10933 -9316 -9908 -4399 1575 -4028 -4078 -2358 -1539 1216
20947 1216 1235 -1834 -2574 -3330 -993 -1079 -3503 -4513 -7621 -4116 -6921 -6177 -3982 788 -1682 -8101
20931 -8101 -13636 -14161 -5977 -6783 -12512 -11093 -12758 -15559 -13841 -9201 -9123 -8034 -966 2831 4114 1945
20915 1945 -3033 -8521 -12610 -15506 -10622 -6847 -3765 2957 1345 -7531 -11579 -6836 -6855 -9798 -8434
20900 -8434 -6443 -4969 -6893 -7660 -9715 -7341 -5219 -9467 -4425 -1840 -8381 -10369 -13782 -8939 -3195
20885 -3195 2105 3599 4797 -651 -7060 -3964 -14167 -22282 -20733 -20324 -12821 -5665 -5823 -9875 -17192
20870 -17192 -15545 -18975 -24072 -18598 -14849 -13646 -13228 -10976 -9234 -7907 -12459 -17796 -10401 -7802 -7188
20855 -7188 -8456 -11906 -10335 -9143 -8411 -10522 -8611 -10816 -16747 -14326 -12708 -7736 -1170 -1712 -4463
20840 -4463 -8883 -7099 102 4143 2397 -4504 -8692 -14868 -13658 -12415 -7782 -636 -1508 -2079 -6530
20825 -6530 -8645 -4127 -690 -3198 -7054 -13857 -18951 -21171 -21279 -13307 -4134 -6259 -7140 -8890 -16995
20810 -16995 -23923 -21940 -14164 -9326 -10144 -14242 -13252 -9913 -10599 -8494 -10733 -7657 -7277 -10139 -11465
20795 -11465 -5853 -4148 -8118 -7880 -8145 -12437 -8822 -6773 -10226 -12447 -3378 -1704 -1721 2014 -1377
20780 -1377 -5111 -3135 -5051 -11802 -13640 -15115 -15724 -5452 -5193 -7582 -7082 -3735 -1394 -1991 -3460
20765 -3460 -943 -2912 -4179 -8831 -11537 -7961 -8733 -8739 -9633 -9066 -7362 -6432 -5473 -5492 -6961 -5323 -9192
20748 -9192 -8601 -1431 349 1669 -554 -5999 -5258 -6691 -8152 -8021 -3881 -2427 -4110 -3130 -2298 2458
20732 2458 10747 10682 4093 1223 488 -935 -5286 -11849 -15350 -15953 -10271 -12932 -16093 -8893 -1309 313
20716 313 1150 114 900 -4654 -9629 -16392 -11696 -10206 -10661 -12169 -9235 -10701 -15544 -11978 -11245 -12120
20700 -12120 -13377 -9271 -8726 -11331 -10783 -13299 -14112 -14100 -11666 -11724 -8465 -2359 -1230 -4220 -4482 -8116
20684 -8116 -7663 -8913 -10551 -7095 -10174 -13932 -14323 -17374 -16414 -13099 -11404 -16061 -19043 -20863 -17882
20669 -17882 -17085 -19806 -15533 -13922 -10326 -8339 -7736 -3281 -1978 -887 -2920 -1520 -2458 -5447 -10532
20654 -10532 -11236 -13505 -11429 -7712 -11587 -15957 -15890 -15015 -16781 -18418 -10530 -8036 -8944 -17471 -19790 -16279
20638 -16279 -12583 -8666 -4594 -4484 -7726 -14464 -12418 -8266 -4817 -6483 -8608 -9879 -9446 -8566 -67
20623 -67 -2838 -8680 -9909 -9667 -12355 -11355 -12102 -9358 -7421 -5021 -2770 -9328 -11134 -10145 -6720 -3983
20607 -3983 -6381 -8706 -14842 -13901 -11114 -5820 -7094 -6440 -8501 -11452 -14749 -12585 -7278 -4709 -2074
20592 -2074 -8124 -13498 -6594 -5089 -2081 -5690 -13650 -16490 -13511 -11850 -14665 -20159 -6444 -127
20578 -127 -3458 -3517 996 872 -3155 -5320 -5519 -5291 -9730 -6967 -7901 -13151 -12594 -5139 -5807 -7369 -4405
20561 -4405 -9593 -9776 -5088 -1297 2392 7999 -2413 -12683 -12740 -13520 -15134 -11127 -5315 -5535 -11255
20546 -11255 -13692 -13858 -19216 -21796 -14595 -13685 -12134 -10811 -8919 -8141 -6186 -4521 -2677 -7630 -14497
20531 -14497 -17580 -17273 -15563 -11417 -5622 -5646 -8969 -7902 -4257 -3672 -8899 -7573 -9638 -12611 -11566
20516 -11566 -9946 -10618 -8463 -3896 -5512 -9462 -7488 1200 2192 -2227 -3442 1389 -905 -6673 -9377
20501 -9377 -14880 -18541 -20657 -22077 -17786 -16499 -7456 -715 -7968 -12536 -12322 -15414 -13402 -13268 -11228
20486 -11228 -15915 -4931 -616 -4990 -5447 -3008 2393 5218 2265 -4239 -9318 -10089 -7614 -4040 -4898
20471 -4898 -13220 -10247 -13965 -16289 -7835 -2085 494 -4044 -11932 -10957 -4389 4139 6954 1079 -6781
20456 -6781 -14624 -22744 -18361 -9922 -8499 -8751 -10099 -6711 -3191 -6264 -8504 -2691 -9838 -13939 -13418
20441 -13418 -11843 -13080 -12496 -11978 -10158 -11304 -10674 -9562 -8022 -10510 -6976 -4412 -1961 -2708 -6348
20426 -6348 -11429 -11070 -7022 -6506 -4103 4472 4463 910 4159 3902 -5630 -11755 -12185 -15207 -14811 -7758 -7248
20409 -7248 -9644 -11424 -9548 -10258 -8262 -413 1045 -5138 -6688 -7413 -7550 -7537 -1809 29 -1151 -856
20393 -856 -331 -1992 -3142 -9559 -8853 -7221 -9369 -6173 -3160 -1530 -4176 -1250 -3063 -5547 -10332
20378 -10332 -15977 -19078 -18818 -14795 -16472 -19878 -14872 -15630 -15395 -13017 -4768 -3448 -7649 -11096 -15000
20363 -15000 -12910 -10638 -7000 -5065 -3098 159 2944 3724 749 1699 2656 1500 -2382 -9280 -10652
20348 -10652 -6110 -8289 -10700 -7391 -7849 -5922 -9700 -12571 -15203 -11642 -4228 -2962 -3578 -6664 -8720
20333 -8720 -4776 -4671 -7082 -10551 -13987 -12364 -6073 -2726 -6785 -11073 -11821 -10697 -6713 -9498 -13209
20318 -13209 -11024 -10291 -9761 -12064 -14366 -13203 -10863 -9759 -7516 -7835 -8573 -4584 395 2403 2369 -319
20302 -319 960 4797 2505 -3433 -7501 -5187 852 736 -4816 -7854 -4490 -4767 -684 970 -10192
20287 -10192 -15233 -11825 -13715 -16395 -16285 -16535 -14541 -13344 -11417 -5752 -2131 -6065 -5327 -4330 -5573
20272 -5573 -4150 -8027 -9754 -7708 -9952 -8671 -7322 -2966 -1601 -3709 -2604 -382 1024 2402 -49
20257 -49 -2277 3830 2991 3830 1556 -630 -1811 -5073 -5590 -6341 -6423 -5660 -4560 -9674 -12781 -15657 -23823
20240 -23823 -20137 -19499 -18511 -20462 -19435 -14281 -12948 -10226 -7357 -10749 -16789 -20068 -16164 -20003 -21422
20225 -21422 -14910 -10472 -9544 -6748 -5895 -2593 937 -6862 -11620 -13529 -12656 -6744 -1873 2134 1
20210 1 1159 -1159 -7454 -5405 -3714 -6950 -12815 -10863 -2481 -2204 -8818 -9544 -11519 -12018 -9913 -11720
20194 -11720 -15362 -12833 -12290 -12489 -5828 -6678 -4129 -3101 -7912 -12829 -14994 -12250 -9714 -9501 -9790 -8643
20178 -8643 -7081 -3729 -5890 -5186 -7657 -8111 1764 840 -4096 -5601 698 3376 -2023 -9504 -5096
20163 -5096 -5521 -4189 -9625 -9888 -7753 -7081 -5785 -2392 -6445 -5173 4659 3246 104 -1322 -3631
20148 -3631 -1197 -2677 -8783 -8481 -449 514 -7647 -15442 -14721 -12865 -7330 -4712 -5442 -11521 -13005 -8811
20132 -8811 -12064 -8138 -2096 -3090 -7694 -14273 -17365 -15352 -20178 -21275 -19367 -18934 -16632 -13861 -12139
20117 -12139 -6190 -5946 -231 -217 -3103 -8149 -17808 -18345 -11630 -11259 -7557 -2849 89 3583 6275 44
20101 44 -2557 -5881 -2717 -5386 -8838 -9729 -10299 -13631 -10315 -6887 507 505 3600 3791 -3890 -1507 2738
20084 2738 -555 -1809 2038 -2130 -1429 557 581 4506 10062 10014 -4623 -13158 -5959 -10160 -11724 -10302
20068 -10302 -10796 -9608 -3935 -8961 -9148 -5145 -8904 -15106 -14353 -12951 -14187 -14226 -12999 -5449 -2363 -6112
20052 -6112 -11975 -15507 -19106 -20369 -23637 -24154 -20701 -14928 -12104 -14990 -20886 -18796 -16087 -17872 -10434
20037 -10434 -9464 -14678 -15199 -18958 -13889 -7363 -10558 -14009 -8236 -12599 -13107 -4718 -6260 -11386 -9121
20022 -9121 -4926 -3307 -3481 -8070 -6989 -5546 -3231 -4052 -8220 -9928 -12119 -13725 -11494 -1092 820
20007 820 2864 -2005 -10498 -9779 -7863 -12011 -8475 -2086 -2627 -5350 -2977 -2242 -1911 -8250 -15656 -11481
19991 -11481 -7489 -1649 -1408 -3966 -6837 -13399 -12915 -14933 -10086 239 5126 704 -7092 -5393 -2476
19976 -2476 995 -992 -6722 -11043 -14496 -8943 -523 -40 -11185 -13482 -12870 -15847 -21958 -19932 -16381
19961 -16381 -13277 -10643 -10166 -9938 -7786 -10943 -7429 -3728 -3766 -5152 -9477 -11820 -9954 -7751 -5136
19946 -5136 -5762 -7069 -6220 -5676 -4293 -937 -5878 -9062 -13163 -10296 -5635 -9342 -9291 -8190 -12886 -10557
19930 -10557 -10741 -16639 -16804 -6929 -1534 545 -10290 -12883 -15852 -16890 -14829 -13310 -14391 -16270 -10724
19915 -10724 -6276 -10853 -9979 -7198 -2882 -281 1155 -3311 -6319 -5072 -3211 -2949 -6076 -6073 -6318 -7616
19899 -7616 -12270 -13426 -9247 -3950 -5697 -14685 -13101 -6855 -7608 -5134 1049 -1384 -6083 -6128 -5380 -6985
19883 -6985 -5051 1427 4853 4367 -1058 -8266 -13043 -8972 -5034 -7503 -9071 -6739 -9591 -11514 -14977
19868 -14977 -15206 -6955 -4729 -8202 -9394 -3417 917 -3653 -8933 -8776 -8856 -8872 -9002 -9635 -9775 -9350 -8109
19851 -8109 -9574 -8729 -5588 -5050 4191 1988 -5791 -9529 -5165 -827 -2743 -5313 -7525 -9942 -9691
19836 -9691 -7591 -338 -1177 2988 922 -2560 -1224 -1459 -4921 -1896 -1080 1850 3216 6478 4378
19821 4378 -2851 -4649 -465 -3054 -13566 -17617 -14706 -10458 -11121 -6629 -6868 -11655 -14601 -15913 -14648
19806 -14648 -9436 1113 2466 465 741 3192 -3462 -9597 -11949 -14453 -17523 -18000 -14419 -13392 -8383
19791 -8383 -3869 -4325 -4868 -1619 898 -2489 -8558 -10512 -9191 -8555 -11032 -12572 -7139 -5220 -3807
19776 -3807 -9483 -7713 -6811 -12496 -18135 -13650 -9078 -11389 -14556 -11459 -11689 -14294 -14899 -6790 2602
19761 2602 -1762 -8544 -10394 -9599 -3769 -2288 -5219 -7132 -9128 -10161 -5472 -4373 -7749 -8937 -5753
19746 -5753 -5530 -11012 -14728 -14126 -9240 -6300 -7297 -5689 -3034 -5805 -4974 -4441 -8655 -11766 -15679 -9890
19730 -9890 -4140 -12183 -18733 -20187 -9544 -4346 -7201 -6646 -6099 -3121 -3522 -4780 -5816 -11966 -14384
19715 -14384 -10308 -3524 -1120 -1926 -5793 -12691 -13659 -15965 -11382 -6591 -8836 -11832 -15376 -15512 -11024
19700 -11024 -8770 -7552 -3443 -1195 -2996 -6328 -2921 -8275 -7025 -5859 -5164 -4717 -5351 -6779 -11300
19685 -11300 -14355 -15384 -12788 -7530 -10024 -16311 -9363 -1623 -10707 -12982 -7667 -9490 -14351 -8882
19671 -8882 -6803 -7690 -7157 -12640 -21417 -12270 -9980 -9292 -12262 -14078 -15716 -16942 -14218 -11211 -13276
19656 -13276 -14748 -6708 -6421 -2192 436 308 -4063 -6490 -175 7075 9265 8231 -211 -3374 -5769
19641 -5769 -6131 -9447 -17024 -13325 -8709 -2225 -950 -3954 -6513 -4335 449 -2438 -2784 4020 3273
19626 3273 -2799 -549 778 -2100 -10558 -13133 -4304 3393 1663 -445 335 -1855 -7429 -8260 -6303
19611 -6303 -2394 1415 2611 1618 1465 6100 1420 -522 -2566 182 3639 2309 -2975 -4672 -2452
19596 -2452 -1548 -4076 -5995 -794 3042 -162 -7120 -11018 -15609 -9927 -2157 -6373 -10629 -9062 -9879
19581 -9879 -3651 -4164 -5348 -3681 -784 183 -470 -6711 -6101 -2926 -2579 -7506 -10956 -10165 -8821 -3664
19565 -3664 2749 5995 1887 -992 61 -4366 -2570 -3370 2724 -36 -4309 -8667 -8023 -3376 677
19550 677 -1321 -1213 1675 4360 -2885 -10762 -9133 -5851 -2509 -4381 -1624 1242 3805 3473 -677
19535 -677 215 -752 -5380 -2545 -4483 -9646 -9809 -4218 945 987 -6447 -9195 -8878 -1761 -1694 -5269 -7821
19518 -7821 -8834 -8723 -10768 -12440 -8280 -10177 -9462 -8813 -13584 -18588 -10512 -1881 -5990 -6595 -2181 -4085
19502 -4085 -6917 -5095 -3096 352 -1988 -3062 2244 3223 1971 6081 7192 2337 3182 4369 -1693
19487 -1693 -8063 -9763 -10868 -11097 -9288 -6462 -6586 -9926 -7489 752 3153 2587 6436 3227 -6218
19472 -6218 -6748 -4842 -4966 -6728 -4727 -4391 -6550 -1481 -1562 -3626 -4379 1781 -338 -5532 -6455 -349
19456 -349 -4003 -2816 462 576 6895 10222 3603 360 2604 8582 15963 15608 6895 883 -2996
19441 -2996 83 -862 -8275 -5012 -3752 -1620 130 -1790 92 6063 4889 2439 -3723 -7870 -4663
19426 -4663 -1059 532 -1693 -3467 -3358 2282 572 -7238 -5665 -2298 -5801 -7522 -7466 -7787 -8389 -5634
19410 -5634 -1896 -3890 -8546 -10562 -10391 -7756 -3791 -634 -3329 -2777 -6570 -7839 -11008 -7732 -10016
19395 -10016 -16105 -20301 -19422 -14591 -7494 -7842 -5629 -3562 -2529 -5638 -11556 -7252 -9540 -8682 -4805
19380 -4805 -5643 -3669 1057 -3519 -3985 2283 3053 1061 3043 11639 17377 14591 10329 8905 14492
19365 14492 14935 8344 3091 6708 12255 17851 13419 9713 10666 8239 -509 -2974 -92 -4828 -896
19350 -896 -2890 -4570 -1687 -3228 -3907 1043 3680 165 163 4386 3136 -701 -9048 -12486 -6072 -4466
19334 -4466 -759 2432 1284 -3515 -5858 -1802 854 6693 8157 5059 5231 2613 -2711 -7799 -22
19319 -22 553 4095 7746 3932 4247 2281 3121 2813 7695 8489 3574 10677 14067 8818 6079 5988 6300
19302 6300 1905 -6052 -9739 -5792 -4938 -4647 185 4121 1258 -3071 -1869 57 2161 -928 3534
19287 3534 11555 11338 8768 7355 923 -2818 390 -173 2557 8457 15612 13265 6915 4941 3353
19272 3353 -506 6249 7068 5252 4601 1022 -2380 -3458 -2653 1157 9391 13816 17365 15445 10656
19257 10656 8403 8434 7853 11373 17742 9738 4398 3072 2175 1130 2933 6051 5932 4513 6679 411
19241 411 -1550 4176 -173 -60 11009 16787 18875 14402 12693 13757 12477 13194 10027 6945 2084
19226 2084 2665 -3361 -4206 -4857 987 1204 -635 -721 3300 8851 14750 9886 8640 8247 7759 5663 2628
19209 2628 737 332 -3590 -4336 -1080 -10 2100 -3943 -3734 896 -1718 -767 -1108 -3754 -1488 -327
19193 -327 -1198 -3297 1170 5258 2067 -494 3358 5087 1118 1820 318 -1802 -2077 -363 5543 11491
19177 11491 -121 -6199 -1409 -4735 -11222 -13836 -13087 -12589 -13583 -12772 -8205 -2599 4327 5082 7902
19162 7902 2347 864 4049 2999 806 -1197 5562 15464 10593 -4015 -6422 -6591 -1914 -739 33
19147 33 6604 5318 -2054 92 -1018 -7850 -10183 -5568 -947 6174 9853 12025 13174 4976 3670
19132 3670 1817 3540 5384 4073 10533 13050 14086 4362 8795 5172 -317 5494 767 -173 -3255
19117 -3255 -2553 -3682 -5740 -3473 -5078 -8648 -11812 -5549 3542 3515 3461 4104 1993 3527 4644 468
19101 468 -5655 -2366 -422 -1088 1813 8485 9784 13396 14591 7994 3623 3439 4064 1820 8305 13400
19085 13400 15842 10632 -781 -2758 791 -2059 -3151 507 1768 -2784 -7387 -10022 -10574 -7759
19071 -7759 3003 3705 1172 7137 5584 3140 3396 -653 -3329 -6640 -7646 -8969 -12176 -8729 -2013
19056 -2013 -2355 -3389 -1457 -1904 -2423 -2751 -3377 -1869 -3224 2106 4138 8099 8412 6789 8758 7124
19040 7124 6474 9918 11959 9982 11165 9244 3488 -2731 -767 4214 3446 2402 4854 5528 3506
19025 3506 3042 2401 3826 7118 7166 7048 8318 3708 8436 7720 1410 1959 2376 587 3709 2475 7255
19008 7255 9296 1961 -3336 2485 4832 9524 8375 4714 6633 4270 3473 3222 3461 7383 6931 9574
18992 9574 11609 10103 6963 12823 9203 9690 2433 2490 13767 10230 1114 -1510 1041 8274 8375
18977 8375 9147 12094 15267 9909 9298 12606 13088 11170 11892 11617 11346 9623 14381 12203 13703 10369
18961 10369 7220 2460 1817 -188 748 3728 14592 18806 17594 15599 16765 21510 23807 20105 12958
18946 12958 9405 9412 6915 2480 -193 6293 7261 4887 1397 -1862 2569 8067 8089 6957 10953 13098
18930 13098 13470 17238 20652 22852 24712 21979 18050 22304 27415 32424 33409 37874 40093 47739 56367
18915 56367 67995 80983 110657 142910 170072 198945 232369 256294 270461 283666 292039 287860
18903 287860 279875 261173 250487 239813 224000 223287 237242 257606 285690 310020 321584 330916
18891 330916 336298 336618 330101 322639 304631 272387 238005 206752 185139 169207 156419 149734 143528
18878 143528 136039 124092 118881 115021 105710 99395 106438 109950 105875 96041 89130 87702 87916 89482
18864 89482 85408 80714 76179 72918 69023 65755 68013 69161 69344 65136 55309 51761 50537 55355 54171
18849 54171 51792 48810 46384 40945 41234 34258 33479 33438 30044 32532 35319 34082 32796 31186 29226
18834 29226 27137 24443 21677 18489 19370 26242 32351 31491 28316 26780 22718 23299 26458 34120 32534
18819 32534 22450 19341 27119 28510 23252 21200 22204 21324 19550 19471 18642 21031 20289 18281 17358 16783
18803 16783 20367 25224 30411 27386 16032 7316 8815 12161 8916 13074 18758 15848 10797 10961
18789 10961 6858 5228 3356 -372 1823 3938 5547 9771 13324 12434 10381 15870 22887 24032 24460
18774 24460 21972 20770 19624 24155 31768 36867 41043 45142 47101 44969 39200 33492 28187 24044
18760 24044 19026 25201 26702 20953 19166 20104 17909 14671 18448 22201 24198 21784 18535 15681 20331
18745 20331 19644 20550 18628 13770 14610 6974 4108 7170 5819 3032 5649 8531 7096 5219 7004
18730 7004 9497 13929 20004 18153 14476 17481 17382 17211 19511 22555 22439 21764 24012 24367 23203 25436
18714 25436 26574 25760 21369 23375 22101 18570 23890 24711 21997 22497 27627 28271 30976 33569 29747
18699 29747 26652 24750 20746 18512 20186 23946 25741 32506 34744 26735 18722 14850 14587 21274 22453
18684 22453 19645 21459 25406 23548 20205 14050 13325 13899 16867 14185 12391 12375 17137 14398 9296
18669 9296 6947 5376 8153 11828 14768 19968 18832 17944 15346 10778 16358 17564 17424 22995 23180
18654 23180 24016 18355 14668 19151 22653 25571 19840 20027 21792 20896 12679 8637 6398 10815 11209
18639 11209 14950 18561 17777 17155 19610 18289 16594 12644 11589 6121 -4019 -7644 -8141 -8056 -4135
18624 -4135 1701 4550 14180 17814 21497 23171 17176 17349 19462 21321 22319 23060 19712 23211 26067
18609 26067 30160 27979 31218 41469 48613 54891 58347 53757 50184 46235 45829 49167 46155 42027
18595 42027 44744 52389 47737 49092 52936 53024 50832 46098 51057 52496 52205 55859 54909 56045 59868
18580 59868 67034 74334 74332 77977 80239 91695 102781 109781 119018 136440 145084 153900 161753 167353
18566 167353 163676 164446 161498 162306 161813 161003 158926 155825 152601 158318 168392 172049 177566 185048 192849
18551 192849 189112 180154 172145 156185 141853 128138 118139 113175 104568 100530 95219 89721 83194
18538 83194 80519 80671 78332 74928 74532 78248 79044 67637 63758 64516 66664 70953 69166 66170 61864
18523 61864 55749 58127 58428 60252 66358 65789 66671 71276 68310 67511 66463 70885 71857 72555 72940 78189
18507 78189 92726 93736 84233 82791 81911 74531 63220 58592 54723 56819 52063 53650 54988 60035
18493 60035 65508 68977 76734 82966 84162 82085 84145 81968 71141 66969 70000 67759 64998 61973
18479 61973 54111 58867 55494 64718 75075 84265 88731 89117 88120 91295 97947 110046 114627 111617
18465 111617 112518 109538 109426 116973 124434 132856 135450 144404 152393 158174 167310 175275 185526 206229
18451 206229 231139 252606 283008 333449 388894 453659 539162 646031 766140 891428 996024
18440 996024 1050126 1043210 986529 917283 849291 803436 780557 788010 825351 890597 980928 1090296
18428 1090296 1183590 1220288 1201706 1133922 1035160 921673 822672 746072 686588 633206 595833
18417 595833 561253 535948 524212 511029 501113 489818 480159 470703 476159 485685 486897 493850 501944
18404 501944 505718 509188 513153 521120 529860 542334 551187 561538 571832 578920 586635 598000 616678
18391 616678 625845 633981 643182 650689 665457 679678 690183 707179 720019 729382 744968 764730
18379 764730 781063 788840 791243 799199 804876 816126 824122 835197 844154 857017 866436 876025 883593
18366 883593 904490 928919 952505 970417 985897 1001448 1009763 1020934 1037672 1055499 1069857 1084393
18354 1084393 1101060 1122843 1147754 1187048 1228175 1277939 1339631 1409138 1491643 1596082 1718841
18343 1718841 1838325 1946489 2042206 2140003 2240894 2350508 2456578 2555822 2664995 2789604
18333 2789604 2955063 3176786 3464747 3826611 4290354 4868242 5587715 6516036 7733399
18324 7733399 9380375 11638531 14763325 19036153 24564650 31054763 37745333 43665654
18316 43665654 48157936 51190063 53112051 54291013 54587892 53592426 51150182 47656875
18308 47656875 44124994 41701327 41240245 43047022 46800665 51596337 56254723 59821987
18300 59821987 62021079 63070797 63328951 62756860 60885961 57342196 52254612 46342255
18292 46342255 40565803 35600107 31680122 28698197 26440671 24699336 23315686 22174424
18284 22174424 21204561 20360115 19627408 18989011 18433212 17930508 17471170 17030257 16603112
18275 16603112 16188245 15794771 15420540 15055776 14696229 14326549 13943433 13551324 13148903
18266 13148903 12746400 12347892 11953678 11556063 11138046 10709266 10271047 9833556 9398202
18257 9398202 8965363 8537689 8108179 7688053 7282743 6897613 6534435 6190382 5866684
18248 5866684 5564944 5283799 5020436 4760957 4508224 4274705 4050655 3846378 3655091
18239 3655091 3469785 3292124 3125849 2973820 2831602 2697520 2563848 2440321 2326497
18230 2326497 2218857 2126695 2044312 1964301 1890185 1825922 1764825 1716943 1679585 1633518 1569652
18219 1569652 1491024 1408042 1332986 1266210 1220477 1176565 1138007 1118532 1105223 1087138 1062361
18208 1062361 1025838 976324 921223 860687 810914 772470 739884 710586 681986 660688 646268
18197 646268 637478 628240 617618 609511 602357 597248 587983 578545 566988 550243 537667 522137 504947
18184 504947 491136 484243 467627 456548 445249 442579 446951 443596 435658 433302 426409 415572 400257
18171 400257 384776 366560 351892 336210 319247 306454 301275 298243 290239 288969 288895 291002 298727
18158 298727 302627 305625 304878 303261 305947 309750 321068 336166 352922 370980 398062 428118 459843
18145 459843 492174 534770 593149 672083 772536 910558 1114446 1390170 1733559 2131743
18135 2131743 2533486 2860665 3054747 3083728 2959239 2726427 2455834 2214053 2049628 1987838
18125 1987838 2032223 2179941 2438557 2771697 3128150 3441492 3634119 3669451 3557720 3353728
18115 3353728 3133551 2973059 2917328 3026026 3382049 4109201 5313691 6802755 7842276
18106 7842276 7648430 6438556 5098731 4092807 3429499 2982740 2674471 2448661 2267181
18097 2267181 2122158 2000894 1892690 1802839 1729784 1668134 1613252 1556719 1501626 1456035 1406269
18086 1406269 1365512 1328060 1286872 1246332 1211315 1179859 1152125 1128305 1111825 1095106 1072993
18075 1072993 1065108 1039759 1003040 965322 930489 909694 891420 868254 838760 798914 761763
18064 761763 726625 684017 649952 621052 589661 561936 531461 497222 470784 451092 435453
18053 435453 420713 403150 388132 377351 360199 343023 324861 314088 301432 290355 274732
18042 274732 251797 233108 216839 196722 177941 170526 169613 159278 154057 145129 135354 127005 121357
18029 121357 117962 110629 105526 100414 96482 92567 85929 85753 85866 77825 73630 65057 57746 58794 59570
18014 59570 54876 50180 55829 61557 61994 65258 68297 68238 74831 79690 82821 87075 93877 99100 97979
17999 97979 88266 88004 91170 87893 94288 101976 102604 97279 98670 102375 104488 105741 114189 125193 129355
17984 129355 125006 121218 116348 113655 109798 107668 102610 101188 97189 96289 93128 90128 91169 89392
17970 89392 93599 89870 81072 78843 82263 87013 88715 89188 87191 89799 90104 88829 90767 91556 90117
17955 90117 94184 96170 92168 88618 85894 87284 94327 94371 88800 87636 88041 93943 94420 89601 90062 90545
17939 90545 88636 86022 84487 84990 83509 83381 83203 80398 78130 78438 77543 77037 72075 70751 66742 66560
17923 66560 61560 58716 60166 56496 55202 56120 54364 54719 56344 59361 59846 52463 47722 47100 48793
17908 48793 48978 44864 40421 37451 41423 42699 35965 30769 36061 38936 37772 32445 26965 26720 27209
17893 27209 31477 40813 37685 39003 42942 43305 37013 37572 40004 37009 32574 30925 31677 33791 38065
17878 38065 42584 44223 36608 35340 34874 34663 38889 44695 40782 39060 37137 35500 37228 37543 36081
17863 36081 36720 37042 39507 45969 52213 52480 46527 45855 44942 39989 34546 34944 34548 37216 37477 37864 48343
17846 48343 51925 53004 58405 65792 67608 72687 84204 92048 97087 103165 126396 147188 180509
17833 180509 235700 302950 359934 403562 420354 412345 384540 344023 304944 272286 256112 246309
17821 246309 239452 248722 272877 304582 352388 402895 432610 445491 432762 401505 363219 323866
17809 323866 285348 250867 226341 203421 182632 169755 160630 156540 153614 147194 138399 141771 140400
17796 140400 131093 116163 111194 115519 117772 120834 121045 119329 115958 113121 102001 95453 100583 99999
17782 99999 100225 98565 89137 88967 92645 91694 93955 91925 74678 65017 62849 66151 61515 58542 56180
17767 56180 54440 51940 49757 46223 43568 38682 34442 29257 28117 34498 42399 44325 42462 41082
17753 41082 41168 35556 30783 29083 30838 31505 33683 33990 32401 30560 30690 29153 29085 38359 42532 39932
17737 39932 34927 40305 42419 37814 33964 28459 36251 41568 40970 40085 45064 56003 66740 73540
17723 73540 87125 100374 115548 139205 170503 206311 245148 269257 287276 301195 311905 316245
17711 316245 319028 310946 294232 273329 256813 253576 262322 279296 300816 323434 348753 357741
17699 357741 363734 366317 357462 347350 338402 318005 296463 263511 224630 198415 182832 167866
17687 167866 155300 141333 132729 127119 125666 125900 120812 113483 107947 102779 100540 97669 96468 95792
17673 95792 100046 95389 86185 83062 87475 88789 84998 80157 77351 74250 68962 67122 64476 59953
17659 59953 50514 47357 48420 52807 58092 61069 58107 53768 51042 48403 48408 46957 40729 37213 41441
17644 41441 44267 41412 42875 42895 32824 31096 29455 28527 27514 29001 30911 24573 23293 28547 26445
17629 26445 26682 35663 44864 36184 24981 17760 13005 15560 16050 14712 20650 30270 33765 27860 25239
17614 25239 21723 21603 17355 13476 12265 13566 11421 13401 16108 13646 14811 15276 16198 24489 29057
17599 29057 26554 21380 21136 19744 17656 17529 17858 18284 10156 8396 10092 13522 15522 16945 16132 21016
17583 21016 16106 6514 8396 6831 7293 8342 2200 -3760 -8241 -4216 1781 3889 4775 11346 14514
17568 14514 17689 19830 23876 26286 27962 22914 14211 11682 6469 4352 6864 8724 15713 24165
17554 24165 31912 41806 50350 51047 54018 56337 56387 58861 54299 56680 61572 62477 57651 53169 53170 57397
17538 57397 62787 64356 69468 67811 63905 61010 60956 67005 75111 73234 71977 77058 81359 85274 85825
17523 85825 91496 95676 101482 116105 133855 146938 157293 170126 173155 178291 177641 170289 164702
17510 164702 157996 153626 154847 155873 161100 170331 179152 185399 193547 196062 206740 213180 207922 194205
17496 194205 179538 171069 162840 154415 139000 123562 109754 102284 103705 101630 101319 99501 94619
17483 94619 87384 80791 83655 92369 94144 91386 84503 82228 86469 84847 82066 84949 85387 78636 78894
17468 78894 85425 91889 92472 95326 103290 118828 136109 141216 149275 166032 186110 210033 251263
17455 251263 311571 397794 513824 680438 906327 1149140 1311217 1307512 1160032 963943
17445 963943 795890 684458 627706 613149 649556 725073 851894 1034464 1251225 1422440
17435 1422440 1457350 1325895 1113253 913810 761753 646228 565659 505914 459491 430210
17425 430210 413464 398905 389203 384365 375828 366989 356612 340995 334158 332103 326529 314781 304479
17412 304479 306482 298188 293580 299855 299786 295204 287934 278306 273713 270301 264493 260534 259953 256731 251567
17397 251567 250396 245922 242735 241568 241258 240741 244215 243529 247280 246333 242855 233852 226320 215435 203162
17382 203162 201696 198510 197320 198781 200058 202094 204173 205165 214280 220960 217405 208992 199633 186868
17368 186868 181167 174873 176267 173263 168316 168684 178030 181353 188363 193119 196950 205294 215153 229153
17354 229153 237999 251139 262069 272559 281743 296385 311694 329163 350771 372205 385978 400305
17342 400305 410940 423543 436898 449568 460585 476815 491541 508744 530369 557878 581612
17331 581612 603968 627870 655270 678544 695050 710341 726671 736306 744920 748885 760396 772706
17319 772706 785334 793730 806536 823644 841138 856607 875513 887415 906713 935599 952364 962888
17307 962888 982455 1005519 1025641 1045907 1071516 1094900 1119186 1136090 1159835 1187217 1216392
17296 1216392 1255164 1304202 1371153 1444065 1528644 1629896 1749191 1876358 2004426 2121357
17286 2121357 2220756 2306397 2396525 2508501 2650142 2819950 3027873 3279903 3587288 3969605
17276 3969605 4427379 4960636 5588312 6328740 7255443 8467518 10101944 12336118 15401564
17267 15401564 19643219 25518034 33421983 43256389 53847398 62945047 68168910 68249580
17259 68249580 63627245 56215564 48431036 42027911 37657869 35283255 34723817 35940227
17251 35940227 39118552 44535184 52169791 61132882 69405475 74537796 74903552 70463925
17243 70463925 62739392 53983797 46045742 39712961 34927021 31323046 28568387 26429330
17235 26429330 24737215 23385434 22332758 21483340 20776332 20164204 19584114 18992069 18398809
17226 18398809 17814345 17257640 16740284 16262196 15818111 15392506 14975768 14589263 14234360
17217 14234360 13901259 13579813 13261444 12932056 12566008 12164610 11729418 11287477 10863001
17208 10863001 10464716 10066858 9656267 9229074 8787187 8335050 7896056 7471468 7068554
17199 7068554 6689117 6330909 5995818 5687220 5390628 5105639 4838163 4593875 4369900
17190 4369900 4153406 3946748 3746558 3550647 3372771 3203326 3033563 2874083 2732647
17181 2732647 2600054 2473239 2354675 2245141 2144089 2050747 1963240 1879965 1799080 1720931
17171 1720931 1647197 1570393 1502212 1425754 1347942 1281039 1216944 1161071 1113552 1068588 1026977
17160 1026977 980930 936071 896761 859718 821425 786203 748693 715180 684012 663800 643093
17149 643093 621765 593450 578978 564598 554351 539556 530763 529426 530525 528089 522348 511327
17137 511327 502684 490062 477633 456252 433175 407830 390873 379536 368792 357465 345507 351317
17125 351317 355212 359782 363156 355179 346252 339223 316985 294429 281495 268224 249623 230244 215091
17112 215091 201400 190180 187018 183380 184677 188523 187690 183707 183470 189343 193550 199867 199969 204087
17098 204087 211489 216823 223577 230938 236032 244405 260316 268895 263056 269339 280320 287577 290659 298010
17084 298010 307020 319326 342697 356457 373028 381563 381993 373218 369100 369701 363954 353008 344103
17071 344103 341315 342669 346375 363091 377127 382778 393429 400517 392200 388347 376877 356101 341968
17058 341968 331644 314839 300052 287155 278658 285062 289663 293892 296764 294922 288489 279962 270636
17045 270636 271752 265396 252320 247709 244099 240364 238041 228181 218765 215217 203791 197100 190142 183274
17031 183274 170155 165231 166752 168218 165424 164471 167186 161547 153299 144195 152720 159168 157640 160373
17017 160373 164129 155045 146575 140976 144702 145162 141599 140450 140787 133038 126161 125140 120464 121980 132539
17002 132539 134583 124795 119551 120349 118028 111245 102541 98239 93714 90933 90680 86121 78173 76072 71592
16987 71592 65307 53941 40144 37821 38337 37381 37163 34190 27031 25564 19820 16917 15745 19203 18013
16972 18013 17296 18394 9637 10790 12299 15926 16838 11872 6813 -5756 -12944 -8859 -2220 3003 7451
16957 7451 6471 9326 10136 13474 19917 30252 42229 54228 57698 61629 56385 50652 45586 48662
16943 48662 49329 50687 50543 48285 51599 61622 66686 77226 82200 84887 89385 85637 76245 72526
16929 72526 71395 71962 74323 80187 81802 75378 78309 71225 76211 76404 72032 63471 57526 56521 63903
16914 63903 68670 62217 55728 57164 58771 60120 67812 67289 66488 63805 66001 65164 63761 65330 64619
16899 64619 59453 52531 48440 52375 56569 55883 54750 56688 61675 63559 54545 47509 51225 52520 56991
16884 56991 58236 58484 53101 48998 42271 43929 46400 42185 39229 34019 34189 41422 46923 49603 51999
16869 51999 49176 46028 47799 43923 39611 37226 32651 26027 16271 14459 15532 14616 12221 13956 15396
16854 15396 7185 12850 16652 14276 11452 12391 17930 14392 9348 4097 3869 4380 13314 15623 13602
16839 13602 11503 12606 11920 13481 13934 14286 15867 15430 11515 14139 12655 10625 9987 9239 11219 13540
16823 13540 11670 9085 11401 10137 9460 3813 3842 9304 16253 17638 19315 18057 17881 23012 24577
16808 24577 24886 17124 14692 11178 13148 11184 2630 5090 5708 7260 10809 10711 9601 13840 15366
16793 15366 16413 24394 26735 28672 31779 39251 31069 24305 25041 29053 31182 28189 28048 25998 20083
16778 20083 19357 26974 28610 27450 23813 17496 16488 28166 36353 38139 35592 28225 26318 23554
16764 23554 21578 19803 19183 19197 13128 3956 165 1337 5751 10660 10056 8826 10353 12601 13309 9851
16748 9851 10669 11929 7328 8702 3607 -1347 1007 3423 950 3039 6245 9950 5982 2781 1839
16733 1839 3371 4437 6491 15097 17908 11628 8519 9405 3191 447 8050 7635 10402 10720 7303
16718 7303 3978 6138 9917 17133 16474 8471 13214 12297 10396 7143 7550 11246 13002 14734 17875
16703 17875 22221 23871 22428 22987 19762 25862 38132 51493 63575 69940 84813 110354 141561
16690 141561 180663 236319 298610 348479 370480 372372 349279 307129 267081 236259 214361 200580
16678 200580 199188 205890 221137 252051 296134 345622 390886 420551 415047 391215 348506 298108
16666 298108 257631 224789 201599 177706 154177 144264 138198 136156 130561 125076 117662 109109 107071
16653 107071 106655 106323 100925 95608 92125 90097 82873 81772 82125 80544 83295 83060 76398 74438 78278
16638 78278 75981 70443 74180 74377 67944 59762 54336 53955 55997 50651 50097 54397 49710 51594 49353
16623 49353 37941 28067 24620 28547 29823 26216 23311 22590 29577 33557 28220 15362 14166 9885
16609 9885 6627 9777 17328 14254 16081 12530 14199 8766 4375 6222 9685 15869 8961 12576 13166
16594 13166 8133 6171 10442 16128 14812 14526 16165 14393 3627 -3757 436 4672 2223 3499
16580 3499 2595 1232 3038 4524 6776 9459 13569 13773 9973 8512 4791 1711 -620 -2095 -4831
16565 -4831 -1660 143 -902 638 2072 -1510 -2321 -1315 678 5146 9324 2173 -712 -2292 2261
16550 2261 10209 11553 8759 7682 10255 12753 10932 10818 8409 7620 14810 16046 18116 24842 21416
16535 21416 19614 17462 13370 23284 27657 30703 35393 34521 38681 49850 60559 67460 77954 92619
16521 92619 117328 154430 187817 208087 213208 217172 212024 197794 180515 154194 144752 155249
16509 155249 172334 196717 219842 240609 242485 239441 230650 209224 177588 149346 136498 128901
16497 128901 122183 119408 113749 111789 109909 113934 112730 107718 110402 115063 112448 114650 115425 117554
16483 117554 118588 117644 123042 131109 137187 144654 152489 161884 174632 194113 216975 237447 263372
16470 263372 302725 364394 444956 553705 708810 949965 1306459 1769453 2278219 2692428
16460 2692428 2915303 2921209 2708510 2344607 1968557 1675621 1502882 1437841 1459252 1583934
16450 1583934 1828251 2199905 2641005 3019559 3219435 3209152 2996951 2610826 2171563 1803293
16440 1803293 1537045 1345817 1205391 1096452 1017010 947433 887943 848643 824382 801093
16430 801093 779932 760434 736446 712764 704482 688848 669346 645860 630932 614850 597740 582232
16418 582232 570435 553402 540015 526836 511652 496561 485020 471275 449429 432162 414410
16407 414410 397573 378481 357220 338347 322030 305592 287514 269530 254598 240211 223973
16396 223973 214698 210272 204217 191206 180876 173785 161491 148456 139132 129742 117960 111216 111402
16383 111402 109172 100799 95328 92045 84540 74658 75593 76313 69405 67170 59862 56123 56235 51248 45401
16368 45401 39127 35303 37634 34230 28382 24168 25979 24442 26299 25669 20141 18308 17655 14100 10160
16353 10160 14357 16418 12517 10443 9062 11354 15563 20256 15705 10754 11282 11211 16579 16067 11728
16338 11728 12187 16581 14456 15942 11335 8018 2605 2084 4884 8613 4405 3714 3963 5342 6231 5270
16322 5270 -2240 -1620 3169 5847 757 -1197 -934 -2904 -5303 -10356 -9318 -7125 -5300 -4815 -5081 -9147
16306 -9147 -7939 -8488 -2260 3232 3688 1951 -151 5761 9398 881 -1181 159 746 2961 10248
16291 10248 11366 4627 -1230 354 5604 -213 -7473 -9868 -6583 -706 -3999 -3861 -362 9509 16330
16276 16330 17633 18524 10791 4379 4738 8801 6744 8205 8806 7625 1609 -609 -8380 -4876 -1066
16261 -1066 2400 7677 5228 5077 1100 -1053 323 -904 -2415 -2891 -6072 -2400 -48 -2615 -2876
16246 -2876 -510 3008 -270 756 7070 10724 8427 5506 4611 -865 3004 1565 2976 4677 -2059
16231 -2059 -6693 -8682 -10365 -6418 -4572 -4640 -4593 16 1417 -5556 -4981 -4707 -8345 -5579 -5129 -5371 -5209
16214 -5209 -3637 -4659 -4857 2784 7664 2049 2503 2306 4556 4507 4230 481 -4665 -2496 -201 -3782
16198 -3782 -1144 -1438 -2082 907 3220 -340 -5653 -7453 -9473 -15903 -17930 -15881 -13070 -16129 -11978
16183 -11978 -10559 -8268 -10215 -7619 -2378 -4545 -8287 -11946 -13795 -14267 -5208 895 7162 5946 2705
16168 2705 2559 6038 1043 -2753 -3473 -5716 -7323 -10927 -10294 -4152 376 12 -168 504 -333 2419
16152 2419 1318 -7756 -6901 -2863 1341 124 -1065 -1671 -5811 -9597 -9139 -7625 -13449 -13423 -10672 -8866
16136 -8866 -5924 -7577 -9988 -12699 -12633 -10858 -3439 1291 -1516 -5202 -6612 -2343 916 192 1686
16121 1686 -845 -7644 -11264 -17844 -15353 -11791 -9526 -9572 -9615 -7828 -9353 -13890 -16339 -18341 -15081 -11331
16105 -11331 -10905 -9300 -2800 261 -3659 -10043 -7628 -9945 -14721 -16557 -14108 -14118 -15844 -15831 -18661 -11882
16089 -11882 -10914 -11391 -10290 -5740 -5326 -5780 -5726 -1623 -199 641 -3899 -4864 -2539 -5799 -9567 -14158
16073 -14158 -12025 -8553 -5938 -6919 -10558 -6309 -8961 -12166 -9201 -7519 -6380 -6374 -7916 -10028 -10002 -17933
16057 -17933 -15908 -15203 -17408 -10530 -6636 -15088 -16481 -18285 -13423 -7593 -8387 -13405 -12855 -9545 -10865
16042 -10865 -16744 -16156 -7013 -3777 53 2076 -3200 -10869 -18788 -15486 -13908 -13269 -10120 -7754 -3545
16027 -3545 268 -909 -10535 -17396 -14947 -11616 -10613 -6227 -12812 -15122 -17639 -14570 -15358 -17074 -17010
16012 -17010 -15007 -11439 -9042 -10327 -13315 -14287 -9371 -12535 -14481 -9614 -8647 -8942 -4503 -4369 -4601 -7857
15996 -7857 -7121 -2146 -5035 -10966 -17900 -14006 -10639 -9365 -11723 -8197 -8673 -14841 -14449 -10765 -7118
15981 -7118 -8605 -9046 -8548 -8507 -16331 -13855 -5464 1127 -2992 -12136 -14103 -10408 -3690 -4874 -11464 -13629
15965 -13629 -7116 -5687 -8001 -13682 -13617 -9367 -7721 -4582 -7655 -9659 -14040 -9284 -4569 -2666 -5021
15950 -5021 -3610 -424 -1752 -9771 -8159 -1848 -2044 -5867 -11173 -11882 -6019 4141 3349 -3760 -4925
15935 -4925 -13312 -14265 -16641 -13771 -4662 -2047 -5940 -5640 -8688 -11282 -9947 -9235 -10747 -12983 -10828
15920 -10828 -8519 -12693 -12162 -9373 -9036 -11724 -12111 -5490 -8597 -3547 -3963 -4365 -4979 -7384 -8949 -11400
15904 -11400 -12015 -6801 -1545 -4875 -3127 1132 1462 10115 11624 11375 15297 12433 4756 -2496 676
15889 676 942 5418 5162 2887 4887 6225 8851 3620 -1086 -5081 -1398 -3703 -8022 -3957 -5060
15874 -5060 -8915 -5077 -2231 -4132 -6502 -6148 -3970 -4650 -1089 -331 -1105 -6418 -9489 -3773 -2013 -6608
15858 -6608 -4429 -1460 -3261 -4236 -6133 -7850 -10904 -10631 -5705 -1391 -6934 -7024 -6095 -14288 -13867 -5653
15842 -5653 -1701 -1427 1709 1863 3204 2504 -3572 -2080 -1362 -2294 -4201 -7290 -14378 -16331 -15584 -13323
15826 -13323 -11221 -14732 -14117 -10239 -7701 -5180 -7902 -5165 -9346 -11609 -6970 -7069 -10621 -8557 -6785
15811 -6785 -8258 -5876 -6847 -9308 -20369 -21168 -8959 -2753 -8134 -8805 -2082 1057 -2548 -6949 -6270
15796 -6270 -4332 -4684 -1244 -1642 -6460 -8340 -8201 -12364 -11909 -3193 3581 4432 6491 43 -1602 -3972
15780 -3972 -7420 -8405 -9047 -7958 -8839 -9602 -8289 -6824 -10395 -12024 -9056 -10049 -6196 -2671 -9660 -15927
15764 -15927 -13563 -12736 -8241 -6944 -5996 -1454 -2674 -7222 -7995 -2485 -9061 -10348 -6667 -3381 -5558
15749 -5558 -10371 -7752 -9539 -11575 -12466 -9351 -7590 -9384 -6812 -7999 -3474 -4226 -5404 -5994 -8656
15734 -8656 -11502 -11535 -8310 -7364 -2921 -3337 -1346 -2306 -12525 -15972 -21422 -18161 -15883 -10096 -6617 -3543
15718 -3543 -7201 -10677 -7780 -3235 2132 5638 -292 -7263 -10072 -8286 -11158 -14552 -8145 -1669 2977
15703 2977 3821 4793 4890 1633 -2950 -4302 994 3575 2241 -420 -264 1110 1815 6867 19325 28646
15687 28646 28513 25757 22189 18665 18663 18401 12865 6410 4158 2205 -2759 -7622 -7834 -12040 -9642 -8036
15671 -8036 -8582 -8181 -4529 -9634 -11270 -11172 -16213 -14482 -12853 -3977 -2534 -3710 -7067 -8947 -9678 -10951
15655 -10951 -10958 -8046 -3343 -42 -1626 -4833 -7945 -5883 -5366 -2136 2879 3783 -1745 -2730 -1224 -3845
15639 -3845 -9796 -13199 -17805 -13449 -4781 -7360 -6434 -3917 -394 -1434 -669 -2373 -13605 -20058 -21466
15624 -21466 -20986 -19053 -20911 -21236 -18881 -16023 -13484 -13252 -6929 -4124 -8970 -10843 -8561 -3517 -9450
15609 -9450 -12814 -13212 -14003 -15923 -21516 -22486 -15437 -12061 -13566 -9243 -13374 -17684 -16175 -12523 -12952 -10771
15593 -10771 -6897 -12327 -17070 -10405 -8882 -10343 -8480 -7222 -8654 -2520 545 -8 -1178 713 -4155
15578 -4155 -9062 -9824 -7398 -79 2 -2526 -8011 -14085 -19763 -21461 -22912 -20831 -16470 -14623 -13920 -6718
15562 -6718 -4749 -6912 -8026 -2677 -463 590 -4748 -13135 -12075 -12314 -14487 -7157 -3073 -5157 -4210
15547 -4210 545 340 -6404 -16484 -16301 -10176 -3879 -2515 -2392 -401 -703 -8237 -16408 -16546 -20774 -23490
15531 -23490 -20583 -15398 -12681 -9807 -7521 -5484 -5594 -2473 -1153 -461 -5559 -10639 -11606 -9675 -8508
15516 -8508 -8150 -9228 -11621 -16393 -15971 -15698 -13115 -17374 -18968 -13096 -17123 -17316 -14538 -17775 -17473 -16031
15500 -16031 -12226 -10077 -12621 -9660 814 4490 1281 -1445 -2658 -2397 -4945 2554 5367 -4462
15486 -4462 -12909 -11343 -15198 -18493 -17703 -19928 -19565 -16218 -15975 -10450 -14608 -18864 -11383 -5382 -6430
15471 -6430 -6691 -11347 -13226 -15138 -12095 -12875 -15889 -12980 -11439 -1361 3379 -3984 -7497 -7045 -4975
15456 -4975 -205 693 -1055 -2420 -1177 -6887 -9615 -4927 314 2681 -1826 -1537 -3733 -6377 -1568
15441 -1568 551 -1365 -5876 -9609 -6630 -8212 -11510 -8938 -3067 613 563 -8433 -8906 -7210 -865
15426 -865 3903 6381 5939 5142 1714 -67 -4489 -8356 -9068 -7584 -4642 -5103 -11458 -10617 -7165 -3013
15410 -3013 -4400 -6860 -6373 -4536 -3013 -6693 -12287 -11305 -8810 -7720 -7918 -11225 -11645 -1133 3473
15395 3473 1281 -1907 -4936 -3755 -6066 -8238 -10262 -14593 -11959 -6987 -8920 -13397 -13229 -3618 -1036
15380 -1036 -4044 -759 -1909 -8863 -15388 -15147 -14789 -8454 -3580 -636 -968 -4328 -5509 -426 2588
15365 2588 -812 3151 3558 1474 2521 5926 1032 -5753 -6348 -5231 2906 5088 3431 -2537 -9135
15350 -9135 -5192 -703 -659 -1590 -1424 -5274 -4679 -3911 -4743 -9327 -14148 -11658 -1321 -272 774 -104
15334 -104 -2575 -4203 -3490 -299 526 -2783 -4494 -6478 -6129 -3830 12 464 -3502 -6853 -7512 -6083
15318 -6083 -10184 -14000 -10209 -1826 -7991 -18373 -15118 -5150 -1624 1518 3794 5638 3163 -1478
15304 -1478 2283 -2736 -5000 -4554 -7588 -7093 -6498 -5454 -5865 -7374 -8489 -12668 -12529 -12420 -12125 -9672
15288 -9672 -4286 -3783 -7192 -7490 -8817 -11281 -5676 -3106 -6309 -8088 -10049 -16872 -9533 -4706 -10307
15273 -10307 -13710 -10236 -11123 -8979 -4149 2014 4979 7889 6360 2274 1276 7682 11402 7806 8488
15258 8488 7101 8210 10472 10132 7832 11460 12027 10917 9808 13142 13492 12692 18361 19983 19188 10855
15242 10855 7839 8219 8384 10911 12740 9274 13177 17150 15873 17948 21360 24059 23314 20266 17229
15227 17229 19208 20470 23247 20643 16260 18982 26385 30839 33585 35638 28417 25377 24811 26924 27159
15212 27159 23011 28436 34618 35185 37219 44036 50556 52473 51560 47777 51075 52856 61647 69413 75689
15197 75689 86168 99054 111791 126219 146783 171858 197060 219521 240816 275201 324794 390967
15185 390967 480943 615903 820708 1126011 1551132 2132559 2870389 3686069 4455318 5036681
15175 5036681 5307134 5217969 4815146 4219964 3573076 2998676 2550031 2219800 1994754 1822513
15165 1822513 1680892 1550156 1426430 1319912 1219979 1121531 1046753 985670 934361 892253
15155 892253 850623 812502 783592 754648 734875 721489 711557 699241 689088 682371 682778 683712 680912
15142 680912 672808 655808 642548 622752 605725 591039 575773 553608 528132 508471 474691 446917
15130 446917 421932 397109 379106 363441 340544 319315 304242 282373 259399 247411 235940
15119 235940 221372 208610 196676 187404 180205 171300 162592 148579 137463 136461 133566 124391 120218
15106 120218 111130 104582 95831 88594 79104 73461 73694 72489 67909 61363 53922 52691 51710 50682 50029
15091 50029 52493 48208 47419 46332 43192 37231 38243 31812 24588 27020 32599 33405 25113 23050 25905
15076 25905 27513 25732 18596 21906 18913 12441 12514 10729 9841 10757 9268 339 -1165 -922 4352 7322
15060 7322 7667 12812 11786 10775 6706 14994 16803 10137 12425 9687 14100 16924 15073 10827 10977
15045 10977 10181 11044 7356 2979 6764 6079 958 587 4449 -2474 -7365 354 5855 6514 2466 -1867
15029 -1867 -2130 -6139 -3611 -2577 -3555 -4098 -1825 -1615 -100 -6806 -8308 -8504 -5088 2413 2834 -5026
15013 -5026 -3883 -2254 -123 5576 5607 2269 3852 6213 2298 -2222 -4272 -5221 1735 3978 8525
14998 8525 17644 19134 11624 8009 8632 9118 15430 20901 17608 19428 14909 9965 14010 11656 13902
14983 13902 16422 11083 6123 5145 5160 5350 3605 5794 3920 3324 7779 12270 9321 3977 -852 -662
14967 -662 -1404 289 2261 5188 7785 12981 12502 11097 8918 6615 3929 14020 14722 14634 13134 7268
14951 7268 1485 -4448 -2886 -4871 -189 3680 5687 5860 4307 7789 1536 -1823 -2959 -9446 -10870
14936 -10870 -11642 -11495 -7161 -3723 -8298 -12773 -10980 -9103 -374 4975 5022 8172 8075 8027 11262 13537
14920 13537 15643 4274 1960 11006 11976 9714 10600 6276 4040 8316 4310 1666 -451 -4148 -6398
14905 -6398 -11041 -9548 -8302 -8993 -2580 -1837 -440 -7992 -11186 -12808 -11392 -8564 -7029 -8355 -5041
14890 -5041 -2469 -3989 -4874 -4783 -117 5934 6587 2056 504 3121 2753 4262 4022 -3898 -11832 -9946
14874 -9946 -6817 -7889 -10258 -11970 -8396 -10536 -5728 732 976 -1339 -5302 -2223 -2427 -6395 -7402
14859 -7402 -5734 -8070 -8091 -5609 1633 6449 5280 4179 1550 3217 8296 -2168 -11135 -10898 -8997
14844 -8997 -11143 -16840 -15590 -13076 -14394 -11940 -10742 -13169 -8143 -9359 -6699 -6363 -7473 -3548 -1394
14829 -1394 -7953 -7027 -3528 2135 1511 567 5186 8149 7230 3854 -6655 -4402 2701 7010 6219 1580
14813 1580 -1095 4125 3913 6749 14724 12428 10159 11020 12293 9623 14617 10613 6509 2033 4293
14798 4293 11939 9998 7153 921 1980 6059 5218 1246 5664 6238 632 -7288 -9522 -9673 -6697
14783 -6697 -4162 2075 816 3969 4877 7723 6106 538 -1648 -1117 -2925 -988 -3433 -9724 -9211
14768 -9211 -6077 -4367 -7680 -10233 -14090 -17239 -17906 -21106 -23304 -20799 -15918 -13506 -10134 -10304 -18943
14753 -18943 -13152 -3979 753 1048 220 836 -4181 -1793 1165 1005 418 -1508 -3760 -4404 -2866 -2058
14737 -2058 -4473 -3173 -958 -7844 -13958 -11679 -13703 -13091 -10869 -6756 -4695 -1494 -9021 -16722 -13111
14722 -13111 -7106 -2705 -3580 -6486 -2888 -3761 -9065 -8119 -8946 -8690 -7958 -4011 -12371 -19929 -17146 -14876
14706 -14876 -8821 -3160 -218 -1697 -2026 -3400 -3689 2038 2326 -1398 -4775 -4268 -2754 -2807 -4712 -438
14690 -438 -3612 -9676 -12669 -9923 4289 8091 3312 -1637 -4687 426 948 -6673 -9573 -11261 -14254
14675 -14254 -8145 -657 9506 18446 19465 15826 9368 1921 -2845 -4651 -209 6724 8826 7870
14661 7870 11495 8058 14684 26179 24409 21011 20673 15590 14167 16779 13205 8368 7515 10663 18674
14646 18674 19293 20619 15476 13648 10248 9258 12565 18843 15886 7563 7615 9419 7277 -3418 -7577
14631 -7577 -340 7224 14616 13013 4773 448 423 -2903 -1377 5356 3613 3713 2068 -2078 -1665 758
14615 758 2165 1677 7997 8478 2339 -8914 -10279 -3853 1217 4746 2384 1775 4261 3485 -4559 -9025
14599 -9025 -5741 -3185 -653 2099 985 2354 2115 6628 8661 9663 6600 7168 6381 3528 4486 1717
14583 1717 -2932 -2122 1198 2961 2084 3236 4531 3602 4732 3174 -2447 1244 7537 8105 2385 -5436
14567 -5436 -11227 -10670 -10207 -11915 -11474 -7509 -3720 -3449 1612 10506 13065 13398 17539 15795 12218 8100
14551 8100 -2470 -9176 -10102 -10962 -4495 -2685 3731 16767 14564 14450 12673 5017 2110 2682 -1092
14536 -1092 3525 1773 -5659 -13902 -17575 -13730 -9821 -5959 -4842 -1375 -5095 -12482 -8477 -7671 -485
14521 -485 7500 4013 -649 5858 6793 11317 13543 10938 3557 -2416 -8898 -8129 -5996 -6594 -1045 -587
14505 -587 -7034 -10738 -9819 -10236 -7506 -6956 -6728 -9178 -9856 -4970 4091 8638 5256 8903 12284 1245
14489 1245 -565 982 868 -396 -5864 -5988 -8539 -9286 -3765 -5503 -1881 -1343 1500 5234 5061 7131
14473 7131 5073 2734 2132 2052 3266 6099 2967 919 -1261 -930 -5144 -9215 -2157 8077 11548
14458 11548 6532 2506 4299 4006 7270 2163 2640 3800 4969 1231 4007 8580 9616 11640 8449
14443 8449 6150 6764 6040 7332 118 -1856 4275 3867 990 2565 -882 -7004 -7164 -4308 -3179 -7030
14427 -7030 -9987 -9642 -5077 -2507 -5234 -5564 -4068 1475 4000 3233 2576 1024 -268 880 1436 -1273
14411 -1273 -20 2542 8244 7463 5809 6397 1179 2100 1161 -133 3022 -3723 -9977 -9202 -2742 -2223
14395 -2223 -2910 -2834 -468 2978 -1153 -9556 -13649 -10129 -217 1837 -2151 121 2200 -712 -3595
14380 -3595 -3359 -7237 -15618 -13846 -11037 -5742 146 3426 1973 -6361 -1574 6075 7581 5080 1823
14365 1823 2180 5530 7520 5228 4948 11756 14872 13880 6128 738 -5805 -9953 -7884 -3793 563
14350 563 665 -1272 -2408 -1704 -2367 -6977 -4777 -6904 -4564 -4096 -7795 -10412 -9800 341 1694 -5156
14334 -5156 -5604 -4649 -3046 -5968 -13697 -15297 -4698 3730 4186 1528 3350 3661 7784 13213 12601 13414
14318 13414 11274 10574 10488 6872 800 3362 4749 3645 6287 10303 9523 15769 9748 3960 5795
14303 5795 6117 8002 4833 -1801 -754 -84 1363 2277 687 1414 4236 3211 2680 942 -6191 -2495
14287 -2495 2058 -390 1375 5248 6454 7370 10712 5412 2203 4749 842 -2450 -5696 -327 -90
14272 -90 4027 9520 12778 11093 5274 1679 591 3697 6554 12258 11346 7833 10984 14689 10837
14257 10837 7124 11388 17896 21763 22521 27128 28922 29702 27530 15879 11277 14631 15790 14724 13993
14242 13993 10434 4178 1672 6899 5889 10976 16951 17137 15399 11270 6895 7265 6598 10284 11400
14227 11400 16056 19036 19684 20944 29297 26776 19791 22917 25945 20692 16399 13170 12656 16948 20779
14212 20779 26108 19446 12818 14321 13564 9715 13127 6594 5565 6624 9008 7680 7036 11861 12052
14197 12052 11002 9734 11639 15146 11477 10991 8852 13833 11034 11680 13716 12180 15378 10296 5729
14182 5729 9374 9476 16542 20255 20696 22264 28683 28446 27121 33560 47479 53678 62389 72899 80324
14167 80324 92625 103463 108878 121329 138802 177954 230520 307254 412179 577503 841864
14156 841864 1227901 1717311 2198629 2474735 2414355 2078245 1640212 1260092 989950 808207
14146 808207 687881 607327 544999 499354 450474 410416 390760 376933 360179 345936 332856
14135 332856 318855 301180 288374 282032 272951 265447 266037 261598 257780 253816 244237 240213 243178 248209
14121 248209 249506 248605 243972 239538 232338 219949 215805 210566 203585 196805 182765 171926 161335
14108 161335 152615 136712 124656 119750 113883 107259 98883 94696 92439 93277 96815 91050 80685 73607
14094 73607 63505 59959 61948 62889 59122 54287 55771 52861 46480 34991 31694 36102 40033 33928
14080 33928 30714 31074 36461 32724 30094 29261 25522 21496 23032 24091 21709 24224 20939 16880 12902
14065 12902 12370 21776 22165 17299 17588 17633 20816 25532 18767 15613 21616 20067 17138 10755 6531 1296
14049 1296 -235 2193 4489 1884 -1350 -2806 4227 8980 14818 18867 20207 13574 12150 10873 9557
14034 9557 4976 4472 8126 14731 18500 18418 18724 19606 23541 26992 23798 19357 13861 13206 14689 11294
14018 11294 10158 11523 10312 11482 10894 7216 8648 5219 -16 -1359 3507 12216 11635 2664 -786
14003 -786 -8190 -17506 -16462 -12011 -8646 -630 9615 10937 11587 8872 12039 15182 19491 14603 7316
13988 7316 7458 8074 1376 1110 7838 10767 5387 -1598 -2168 1623 2273 964 -2512 -2263 -758 4212
13972 4212 9628 12334 10111 8712 12883 9267 6401 7292 7051 14535 12455 5254 2040 -1815 192
13957 192 6091 11091 12449 12500 6002 5508 5775 3563 -915 -2965 -1557 -4564 -2904 -3359 -3368 -691 6004
13940 6004 8776 11045 10287 7348 10848 14767 13632 8572 5992 4134 3358 7977 9019 10857 9580
13925 9580 6564 7250 10417 12591 15754 19989 22958 14804 11549 9649 13817 13325 6270 -889 -1042
13910 -1042 3219 5716 6579 9870 14548 14948 10743 6652 1354 4360 3977 -813 -1457 -1225 -219 -1564
13894 -1564 2316 7299 3357 4197 7302 5835 6514 893 -6308 -9038 -8727 -5924 -6187 -4923 -4146 -2325
13878 -2325 -1484 -5691 -13341 -18070 -17552 -7230 3320 15453 23210 25286 25236 17189 5388 -3688 -8258
13863 -8258 -4894 3059 11244 10555 5341 4096 5996 5585 2150 -265 -3865 -678 -1681 -1095 1111
13848 1111 -1779 3027 8039 7753 6557 3407 4353 13246 22973 19647 13745 8394 7312 9738 7777
13833 7777 3265 2635 -1095 -378 1108 -3242 -7117 -6648 -3962 -3525 -4445 -597 -637 3789 3511 -6193 -5339
13816 -5339 -1827 -2985 -9121 1379 3744 -2683 -1771 319 8024 8890 9315 7137 6126 10075 7163
13801 7163 5445 9186 11953 17683 15279 13703 15688 11527 5424 -2055 -3107 4581 9588 6101 4510
13786 4510 7854 11260 15295 21525 17498 8205 3071 9238 9307 5351 8155 13772 11193 5691 7338
13771 7338 11088 9111 1810 1107 -4466 -7388 -3899 1787 769 3546 -148 -4563 -5209 -3526 0
13756 0 2826 1887 1717 -3130 571 -1635 -4875 2464 4050 4660 6165 5584 3941 4444 1498 -2026 -9156
13739 -9156 -8144 5296 10518 6352 -2973 -2015 1226 5389 3727 6998 3095 49 -270 1294 3254
13724 3254 6009 8665 8040 3023 -729 -2392 -255 6659 15171 23884 23200 16576 11948 17041 20723
13709 20723 17551 13091 9592 8271 7800 10338 8664 3141 4192 14572 18159 20626 17451 7736
13695 7736 -234 2914 4746 10449 19035 19493 15592 12397 11408 13369 5145 2096 9702 15147 15153 14820
13679 14820 17677 16260 16552 13799 8054 9443 14672 11105 12018 14701 14426 15665 12283 6576 4086
13664 4086 9621 20873 27376 25371 23940 20218 20328 20286 25884 29692 26251 20008 16138 18302 19620
13649 19620 20220 14847 15168 14394 5579 9475 10546 11821 14298 18493 22957 18130 13254 18857 26508
13634 26508 20686 13571 13626 19741 20645 27648 29664 36359 38228 30563 21953 20902 20452 27819 30662
13619 30662 37238 35356 29162 27096 22081 17111 17778 19769 21190 24602 25450 26577 28087 26449 25838
13604 25838 21843 14281 15310 17282 19848 13744 15459 16138 11461 12057 15030 19799 18037 11901 11457
13589 11457 11770 11935 11244 12950 14746 14950 13017 7873 749 3525 9293 15530 14839 9606 12774 14319
13573 14319 13001 8936 15359 23350 25124 36794 51122 59050 64944 70371 66585 59700 54112 47991
13559 47991 45707 42175 44020 43441 37826 42615 39703 39409 37932 35392 39943 48301 45111 42923 43288
13544 43288 42653 38375 44939 47292 44091 44923 48854 42870 35342 30961 32047 35339 33320 34155 33368
13529 33368 32605 28069 28382 26613 25069 25104 34211 35295 31010 24636 27181 29013 24857 15922 13340
13514 13340 20094 23771 29275 31442 26733 24261 19510 17244 19258 24268 22423 21399 25781 34340
13500 34340 34384 33628 32700 37796 39901 26419 19644 24400 30982 32780 33300 34359 35730 37117 40104
13485 40104 40286 33970 30470 33460 37560 36088 31470 32580 33265 31476 30620 33006 35106 31318 31090
13470 31090 34550 28933 29762 28878 28239 29241 29948 26240 24677 26311 23883 25048 29274 28770 26239 29244
13454 29244 33585 30971 28496 24709 25144 34186 39258 38203 42516 41131 40243 42955 38932 32580 33768
13439 33768 36259 36795 33846 33878 39338 40626 39952 35175 30693 34591 40338 40367 40536 38058 32488 29498
13423 29498 29964 33399 36162 34732 33949 47614 54679 51531 47255 50688 49604 46756 40478 33959 30519
13408 30519 29997 39501 38326 35181 31387 32739 34703 29012 20043 20003 21397 24734 24540 22130 25297
13393 25297 24427 20781 25749 31993 29569 28252 34463 34674 37485 41176 43354 43489 46802 58437 65398
13378 65398 68782 71249 79802 80560 86817 90603 92473 85296 88634 92550 90747 85531 79896 74011 73552
13363 73552 68224 66608 68223 61689 59994 60209 63341 64124 61637 53306 47970 42956 43136 42124 44293
13348 44293 46916 48145 52150 54358 54198 48387 47784 52756 52004 51438 48838 45917 45783 42451 44294 44830
13332 44830 46673 50664 45083 44713 48204 52358 59620 74104 84385 100808 122356 138680 163266
13319 163266 191546 213594 245296 294231 356374 440869 551455 702668 936535 1283331 1739346
13308 1739346 2206992 2533751 2582151 2344160 1940061 1525098 1206271 991261 844701 738794
13298 738794 653429 583257 527530 485130 446376 420205 397724 377065 358346 348606 344267 336684
13286 336684 327826 328375 322529 316937 317907 318447 309366 300215 301503 306407 303146 301816 302333 295967 289412
13271 289412 279997 271136 262112 249408 240405 233676 227182 217445 210132 205555 190385 176890 170063
13258 170063 158789 147141 140508 141034 140879 143745 147225 154218 163131 173152 177890 171545 159646 148568
13244 148568 146306 143992 140401 127899 110733 93883 81783 77876 77472 70926 71527 67369 69588 72854
13230 72854 77077 74208 70881 72571 66334 64841 66032 68685 65713 60433 55133 53028 53341 47317 47739
13215 47739 51719 54416 59052 60688 56670 56700 62030 67880 70821 75290 85519 91332 95112 96279 89279
13200 89279 87836 88108 82920 78985 81059 81164 71378 68394 68658 60696 55284 52852 51306 46233 42276
13185 42276 34501 24945 10570 -11133 -34439 -52564 -67109 -85608 -91616 -70725 -26764 31086
13173 31086 87593 135059 168824 194987 201251 201580 200199 200330 199094 203773 212283 208179 207889 204280
13159 204280 193590 192696 196664 197472 192304 201898 218837 229042 231587 229246 234829 239891 239410 239086
13145 239086 239644 241873 244928 249992 261855 271057 281997 292963 314844 344410 373961 409720 461839
13132 461839 535998 639564 787579 990679 1271238 1635398 2140661 2885382 4045418 5732939
13122 5732939 7670071 9019764 8936387 7635501 6108585 4927656 4133769 3576603 3120667
13113 3120667 2718501 2372642 2091780 1881397 1722618 1604129 1512524 1439814 1382233 1329385
13103 1329385 1279683 1235435 1203855 1169605 1127077 1094105 1064936 1039648 1012449 984930 960681
13092 960681 938950 928549 933211 937163 922742 897786 871482 847298 829747 820843 827353 822800
13080 822800 803968 779293 747184 714994 681816 649289 621906 597394 576732 557527 525745
13069 525745 494940 464939 431725 411175 398333 383709 380720 381996 383714 382343 394701 423668
13057 423668 454766 470118 476146 470989 444141 385714 308908 221059 127158 49008 -1799 -12918
13045 -12918 4925 41438 91228 138466 171212 190596 194704 188990 182734 181239 181781 190586 199202
13032 199202 202848 202712 198039 193201 185524 183296 187310 187188 180725 180778 174928 170636 170478 169443 180224
13017 180224 186834 189236 193666 193814 193149 197473 198125 201981 213818 221012 228260 237925 248597 261364
13003 261364 275973 282227 306758 334462 368006 413594 467344 518721 564999 629628 704615 753696
12991 753696 752448 696801 601090 505730 423890 374569 355591 349254 348666 349930 346345 344499 341959
12978 341959 342560 349178 365349 383585 405461 417903 439895 453427 454189 453775 448288 453557 459219
12965 459219 473658 491201 519079 564430 612025 665160 714146 760323 813476 880469 955302
12954 955302 1036143 1116152 1197370 1272544 1351603 1433706 1517097 1595078 1665447 1725866 1767048
12943 1767048 1788797 1808956 1822371 1836826 1862106 1895632 1953225 2026609 2109213 2199125 2279545
12932 2279545 2354919 2421466 2478432 2524080 2562223 2593923 2616719 2634425 2639808 2640241 2647164 2656369
12920 2656369 2670323 2697105 2728972 2755359 2781925 2823742 2889289 2968367 3060401 3149096 3228666
12909 3228666 3303703 3387086 3470453 3550781 3622472 3684989 3734231 3792832 3862683 3944462 4045962
12898 4045962 4173702 4333008 4528788 4753114 4997217 5260939 5531922 5827530 6160627
12889 6160627 6529229 6958136 7479341 8108039 8851650 9708659 10716835 11917016 13393394
12880 13393394 15210151 17441105 20177096 23582942 28059355 34229283 42823729 54582236
12872 54582236 70343701 91631727 121530940 165247538 228116198 308408673 389411594
12865 389411594 444344087 454427542 419417410 354934330 285269627 228064725 187272092
12858 187272092 159078235 138905285 123544726 111145111 100812661 92187408 85080718
12851 85080718 79294844 74589514 70703810 67407225 64559502 62092428 59952822 58098891
12843 58098891 56488178 55073898 53841067 52784459 51910623 51229595 50753565 50536383 50614171
12834 50614171 50908574 51133727 50980182 50299328 49133341 47772733 46464449 45286337 44117552
12825 44117552 42781600 41164484 39254960 37177073 35096339 33094726 31205659 29450409
12817 29450409 27829505 26334038 24922653 23570011 22264298 21017354 19846489 18760885
12809 18760885 17754086 16804789 15915543 15079943 14285209 13526222 12802401 12115209 11467481
12800 11467481 10865140 10314985 9811815 9345838 8913008 8510975 8150105 7802232 7457597
12791 7457597 7121741 6779917 6444324 6121771 5799441 5502536 5225172 4968666 4730296
12782 4730296 4512713 4324344 4147567 3974130 3808553 3644507 3492503 3355319 3231679
12773 3231679 3109062 2985116 2865006 2740106 2620612 2513536 2419046 2320152 2223786 2121330
12763 2121330 2026985 1936842 1845425 1746276 1661226 1589316 1523407 1455987 1398084 1346255 1311376
12752 1311376 1291184 1276115 1272628 1283931 1314206 1363025 1437325 1530188 1620696 1717190 1801819
12741 1801819 1858161 1861508 1817036 1740284 1622879 1476217 1309150 1142325 1010349 920329
12731 920329 857009 805429 751727 700300 674057 653115 637502 623335 610408 599633 595382 591297
12719 591297 593185 595652 595778 602979 615512 630977 654036 675464 695588 721605 754178 790027
12707 790027 834841 881137 940283 1016304 1098719 1192092 1276401 1332094 1356043 1374749 1404931
12696 1404931 1456238 1524695 1604978 1704156 1812821 1926992 2053522 2232734 2498889 2872322
12686 2872322 3374907 4044957 4961372 6259423 8164305 10888192 14262968 17514710 19530318
12677 19530318 19603128 17802694 14921363 12025818 9768653 8218109 7174554 6436020
12669 6436020 5873443 5404736 4995463 4648968 4363853 4129433 3931939 3761853 3609745
12660 3609745 3474184 3355921 3261269 3179008 3098948 3033083 2979280 2939375 2912431 2900651 2924559
12649 2924559 2983584 3096355 3271161 3521974 3816345 4030947 4015615 3753180 3409395 3119075
12639 3119075 2898186 2719300 2554597 2396654 2245418 2102816 1968283 1848531 1743770
12630 1743770 1652009 1570533 1494030 1419683 1356541 1305494 1264638 1238618 1222469 1211786 1203040
12619 1203040 1198839 1196739 1189356 1191845 1189608 1165353 1117002 1060199 997793 945579 900805 853701
12607 853701 800382 750401 701493 650339 603145 560823 524538 496760 474137 448402 425166
12596 425166 409243 392667 374350 363020 342837 321078 296809 274577 258459 246941 234678
12585 234678 220943 205881 189695 177078 173673 167324 161415 166198 167668 171328 173551 173604 170637 164794
12571 164794 171389 169464 161095 157201 153130 158908 165333 167077 169091 172748 183690 197248 216964
12558 216964 248004 297031 361618 438946 521797 582887 616365 649356 698585 746120 782993
12547 782993 791061 751835 689688 641432 628051 632683 648161 688250 735159 779604 839697 938448
12535 938448 1092045 1318138 1636526 2113748 2853990 4012293 5641382 7377727 8370518
12526 8370518 7992038 6618654 5144455 4025994 3280493 2788135 2443874 2198458 2014976
12517 2014976 1864048 1742095 1643200 1556225 1478178 1406527 1339677 1287385 1239460 1198763 1163460
12506 1163460 1137617 1113384 1093743 1071184 1054542 1045461 1033216 1027820 1029546 1039734 1054874 1070396
12494 1070396 1065822 1042771 1014689 994147 968413 952005 931286 896208 851568 809103 770133
12483 770133 728292 695281 663936 624832 587478 567890 549511 529680 506483 479697 456742
12472 456742 430696 411788 397608 369671 351827 342159 333954 313716 300820 291797 290811 279674
12460 279674 268904 259436 256242 255042 247486 236314 227026 224498 209640 201746 196348 186168 181276
12447 181276 176051 175501 175580 169839 171909 173251 173691 177993 178886 176196 169205 175256 188709 199686 214036
12432 214036 221423 228263 245541 262071 278512 294909 316465 348480 391393 448103 548148 687945
12420 687945 902983 1224918 1663001 2140114 2503205 2610093 2425452 2050464 1649975 1330353
12410 1330353 1112044 958980 849731 777059 717605 666626 632582 597697 563415 536264 512676
12399 512676 495852 478820 462610 449846 442279 430506 414537 404482 395973 385022 379622 372912
12387 372912 376671 390542 409990 428954 451628 460365 451392 432849 408189 385870 371380 372489
12375 372489 362064 345982 326761 305276 288158 269725 257515 254022 254055 257116 252661 251560 243135
12362 243135 232932 225815 214314 204980 197474 191303 184865 178715 170798 161803 154012 150471 140242
12349 140242 134834 138531 138028 140012 133728 128573 118856 116680 118826 115214 114623 113832 113171 113581 114361 109389
12333 109389 102139 97557 96150 94671 93485 94117 89673 86748 84458 79123 77722 73855 64808 59474
12319 59474 67071 71682 83960 89975 99336 108233 116741 138914 169110 207112 250898 296196 308323
12306 308323 282499 230651 190300 160220 135562 127743 120244 115141 112362 111917 110844 107820 103570
12293 103570 97222 93648 93630 98250 98262 94314 85984 79104 68700 63872 68238 74739 74009 76468 81806
12278 81806 87855 94144 96565 98337 95312 89282 84841 75875 68173 71465 72820 67470 66293 66510 67520
12263 67520 72168 77297 73427 73700 74255 70221 65581 68525 64784 58385 60448 68956 66778 66240 61787
12248 61787 61031 60658 54444 55366 59520 61910 68719 67881 75024 81996 77448 81656 94851 112730 126146
12233 126146 137245 142207 139722 127529 103656 88070 84739 84490 80453 75688 70183 65797 61472
12220 61472 61642 64854 68138 67996 69789 72800 74221 77191 73967 72674 68406 62904 56185 52934 48732
12205 48732 46611 41717 42936 50134 52214 51329 54869 63143 62853 62202 60370 59717 55543 52569 46458
12190 46458 45321 51655 59963 59873 58626 58425 61995 62154 65928 57157 50400 39870 34796 26953 17685
12175 17685 10069 8927 11376 14590 14072 23213 32504 38097 41991 45547 37808 38299 38085 39018 39913 44392
12159 44392 42741 47320 48715 45004 45671 41742 36991 37488 42070 43631 43558 45177 43020 39968 37127
12144 37127 38277 39470 42115 39748 41273 36487 38708 38935 40528 39515 39225 39413 39511 44132 56151
12129 56151 63228 66145 57338 53767 52410 50928 54959 58319 57641 66617 76240 86248 94885 98504
12115 98504 96632 82087 83476 99206 103405 96818 83973 72221 64134 62367 66073 64446 55287
12102 55287 50262 54798 58246 55672 51068 48617 51492 54419 60047 57801 46760 46778 48444 43079 37808
12087 37808 35822 40341 41540 39744 39478 34940 33723 39720 37830 41188 45982 46518 43022 39902 36307
12072 36307 36908 31965 31722 38398 41346 37602 37555 45245 50934 55156 57262 56407 72087 84647 86492
12057 86492 88880 93114 97627 96691 93480 89806 85562 83619 82007 81516 76976 79807 86818 97530 124723
12042 124723 163137 216048 259379 267752 239003 191944 156186 134543 116806 104397 93812 87378
12030 87378 89248 94064 101265 108659 106925 109398 116370 122451 131663 134224 135198 144078 152565 170329
12016 170329 193006 219852 252442 278807 300078 326003 350853 376255 400860 415989 411917 388487
12004 388487 350802 314337 284138 261281 249307 246658 251935 251525 243239 234017 228965 230083 238331
11991 238331 243740 246048 248188 266413 283405 280697 271619 257243 246425 236613 227811 213828 209486
11978 209486 205052 201998 200053 201618 202635 202722 198286 201050 203245 205381 202046 206876 206000 203225 211483
11963 211483 224079 241999 248377 246069 248404 252205 260382 268947 278846 284565 300476 329928 363831
11950 363831 393359 426043 476808 550262 631813 705194 769901 852776 980918 1185744 1485781
11939 1485781 1906893 2480547 3304122 4560505 6543929 9557914 13283642 16195882 16426095
11930 16426095 13978199 10799285 8249129 6542701 5422330 4668317 4127046 3724803
11922 3724803 3401393 3125794 2898765 2720753 2581772 2476651 2373837 2272652 2180964 2108856
11912 2108856 2050129 2014633 1987113 1952443 1919160 1883210 1851427 1823164 1807568 1804021 1811134 1830579
11900 1830579 1854720 1860105 1832345 1788352 1740642 1698153 1663869 1638794 1613197 1568733 1516000
11889 1516000 1462560 1419745 1380068 1344095 1315440 1292174 1279769 1278173 1293008 1313550 1356590
11878 1356590 1430118 1526278 1651104 1799612 1952203 2097617 2272603 2537895 2966612 3632189
11868 3632189 4603252 5952483 7836673 10625265 14975008 21664722 30566891 39006217
11860 39006217 42370551 38521983 30841934 23614098 18419027 14954397 12620758 10985140
11852 10985140 9758688 8802059 8010249 7357617 6842852 6441469 6126876 5856878 5597062
11843 5597062 5343776 5105453 4908116 4743037 4598618 4473655 4372663 4272744 4198302 4138287
11833 4138287 4091536 4059778 4058816 4088596 4128880 4141406 4077041 3962221 3836778 3724630 3630532
11822 3630532 3549264 3448260 3313931 3156008 2985989 2815028 2653443 2499929 2357583 2229897
11812 2229897 2115364 2003073 1891742 1786493 1698208 1617316 1531378 1451086 1376677 1299205
11802 1299205 1222916 1151822 1086348 1030914 977124 931509 893666 852662 807961 770228 733141
11791 733141 699986 669188 642128 615776 594505 580203 557272 532395 511432 487878 471171
11780 471171 458678 451050 453124 453460 451398 449273 454013 468628 497331 537472 610387 711317 862913
11767 862913 1100757 1468259 2007312 2645637 3091250 3054216 2595738 2052425 1620203 1320436
11757 1320436 1122224 988142 886324 810662 753038 702532 657935 620058 592928 573770 558833
11746 558833 537291 517317 496342 481368 475351 469772 459571 459270 460398 460827 459391 448947 439812
11733 439812 438047 433230 424567 406348 392612 374015 356139 344196 335050 323954 313693 300063
11721 300063 289611 280744 269363 260766 238191 220847 210104 203505 197963 193796 185702 172944 166037
11708 166037 161611 165563 162598 152544 147398 141953 139191 139518 137559 129758 130276 133545 136048 137423
11694 137423 137308 133276 135101 135984 139311 142694 141496 136850 134954 133205 133478 138345 145564 154782 152939
11679 152939 151901 152224 146294 139367 139930 134650 124379 115376 104827 95507 91687 91885 88643 89980
11665 89980 89080 88308 90401 91150 90058 86429 85230 80983 71399 67401 67174 65590 65493 61580 58278 59358
11649 59358 56829 55531 52593 53903 52604 53625 59331 65136 60169 47169 46213 49565 59409 57720
11635 57720 48522 41035 41651 36861 32945 30233 25348 27560 33955 35382 31312 31055 34778 35014 32982
11620 32982 32708 30896 38587 40778 46764 51401 48154 44235 39452 43380 49667 49535 46422 37653 38849
11605 38849 36743 26236 26164 25615 23797 17076 14450 11955 17804 30370 35410 33617 22868 18422
11591 18422 21343 23653 24802 25688 24790 23993 14568 12332 13891 12965 17455 25377 27131 24895 15360
11576 15360 11426 12166 16804 14567 15164 17900 12881 11400 11230 11617 15383 11840 3503 6095 11266
11561 11266 14567 15356 15773 17850 20155 23610 13803 9073 10684 17603 25905 30418 25556 28369 28841
11546 28841 25072 27667 28880 25833 27028 22193 17661 19561 15040 9513 12735 13423 10301 11150 15169
11531 15169 11149 15915 19843 22539 24152 22032 24024 22937 20854 20307 18293 18537 20218 24117 19287
11516 19287 13732 13514 18494 13092 12302 17525 19128 12468 16257 21457 19756 20113 24159 19913 15865
11501 15865 16380 21987 24437 28017 26697 29159 28553 25640 22377 21326 23182 25457 29225 23545 15304
11486 15304 15795 19506 20870 28918 30574 29519 26335 26436 34097 49038 69326 85065 95550 99024
11472 99024 84855 66919 54956 43731 30805 27022 24952 18659 16924 14306 16078 17421 17228
11459 17228 18780 17385 13130 3140 3537 6507 8265 13236 18142 15947 14575 15203 12679 12026 14462
11444 14462 17483 14513 12800 11872 11213 8703 16744 24112 26706 25360 18275 13537 11685 15517 12818
11429 12818 12897 15060 16616 19251 22672 24217 18645 10863 12709 13965 18299 20678 18757 17764 21902
11414 21902 26891 33292 41815 54455 73367 102820 149318 198227 232393 226471 196504 157770
11402 157770 123440 101365 83060 72802 66128 60427 55752 47344 45355 44970 44284 42932 39063 39804
11388 39804 33661 27933 31266 33073 28054 27907 28749 27396 27932 29930 30044 29514 31973 29254 22838 25468
11372 25468 31172 28206 20487 17282 13059 14394 12173 10394 5971 8733 12791 17145 15629 21592
11358 21592 25717 30526 28652 24704 26265 28101 22049 15079 16726 19513 22682 17302 10516 12766
11344 12766 11721 8187 -264 -1129 4908 12301 14888 9307 1028 1339 4746 2765 3858 9299 9939
11329 9939 5230 6432 1559 2469 10314 14007 6437 3698 701 -1908 -654 -3085 -2198 -3856 -2885
11314 -2885 -200 -1899 5 3488 4632 11014 18229 18038 16653 14520 13667 9163 5228 2563 1222
11299 1222 1609 3266 15211 15952 5195 -755 -497 1493 202 -9221 -9732 -6050 -1433 3118 2107
11284 2107 -1252 -5927 -6345 -1697 0 -2827 1065 8777 11731 9685 7631 -1732 -775 1625 -3968
11269 -3968 -6157 -2180 5619 4072 -1629 -4509 -5342 -8591 -9793 -7734 -4964 2366 2098 4607 5695
11254 5695 3599 5380 5068 2473 461 551 4593 3520 4029 4244 4229 2261 -5933 -7039 -3727 -4471 -3435
11237 -3435 -3421 1163 -968 -4031 -6972 -6894 -5271 -15 1470 -1771 -551 1630 1908 4013 6740 7234
11221 7234 8694 7448 409 653 1514 -457 -3829 -2991 -5368 -8919 -6632 -4008 -3600 -4633 -3738 -5914
11205 -5914 -8723 -6222 -11037 -14118 -9981 -3854 -3233 -6684 -6653 -1449 3084 1250 -1307 1366 529 -1507
11189 -1507 -3009 5649 4823 9949 13294 16152 17670 14280 11550 9589 9265 6523 3828 -3180 -1163
11174 -1163 -6355 -6453 2656 6121 444 -3339 -2219 3898 -1372 -6199 -8577 -1452 4046 3550 102
11159 102 -420 -1639 -2820 2548 8803 8497 -717 -2712 3876 5557 218 -641 6594 4283 2977 3978
11143 3978 -564 -322 2883 6834 2952 4467 10463 10300 12232 8142 2085 2307 1003 -4709 -6438
11128 -6438 -6178 -2577 954 -898 -5721 -8206 -3264 -3664 -8946 -10119 -9610 -6744 690 881 -121 1321
11112 1321 -675 -2348 -3869 -2716 -4648 2375 6368 6798 -1280 3473 11878 9272 8484 9489 5715
11097 5715 -329 1327 6182 5672 1307 1862 -3925 -6807 -6907 -5493 -4042 -2283 -71 -3486 -1992
11082 -1992 -3003 34 -571 -1936 -1198 -3842 -7778 -5521 -2103 -3542 -841 -4881 -3691 -1499 -1666
11067 -1666 1445 2638 2560 2701 4980 8095 4133 1970 201 -363 3075 4499 3996 5643 8270 421
11051 421 1646 6563 10005 2345 -1669 -3602 -6615 -9233 -10920 -12367 -8936 -7149 -7655 -5472 -7025
11036 -7025 -6766 -3752 -1857 -994 387 4890 5658 -2505 -2803 3853 8900 10808 2605 -6247 -1150 5943
11020 5943 8082 4378 3413 6926 5528 3233 1604 89 -940 -4605 -1420 1434 -5703 -5471 2056
11005 2056 2830 108 -347 -3638 -1555 -1633 -2490 -2082 -3839 -4001 18 -5602 -5343 -6265 -10115 -8153 -695
10988 -695 -2490 171 -288 79 963 -2582 -1675 956 -1151 -10176 -11646 -8294 -5779 -8708 -10158 -6917
10972 -6917 -6491 -10624 -9174 -10405 -7800 -5825 -13420 -15641 -9415 -545 -5509 -3191 1797 -1043 -323
10957 -323 -3149 -5452 -12085 -9473 -5841 -5843 -7363 -11947 -8876 -6534 -5543 -67 1487 -7380 -14106 -12486
10941 -12486 -11000 -11933 -14428 -10783 -1025 5742 3434 -4962 -7032 -8543 -6274 711 3064 -1538 -5729
10926 -5729 -6289 -6301 -7637 -8242 -6309 -5332 -6689 -7577 -3476 -4674 -5754 -4959 -1495 -7526 -8365 -7080 -13370
10909 -13370 -18151 -17151 -9182 -1124 -1043 -5580 -7575 -3764 -1640 -2091 -8007 -9381 -184 -15 -808 -4663
10893 -4663 -2199 3207 1137 1815 3412 575 -5141 -9212 -5830 907 -5585 -11651 -10777 -8070 -7544
10878 -7544 -7745 -10266 -14048 -13775 -12871 -11408 -3722 2587 2927 -2512 -848 -6899 -7538 -5251 -5853 -1907
10862 -1907 2219 408 5957 3550 -15 1002 6813 -480 -6759 -9582 -10050 -4812 -2439 79 -8759
10847 -8759 -7822 -4835 -2218 -3739 -4757 -9313 -12200 -15245 -6506 3801 2378 -5248 -2582 -2633 -10035
10832 -10035 -17371 -17310 -16691 -16257 -16806 -15100 -14790 -9530 -12735 -15800 -9975 -10519 -16181 -15241 -10532 -7201
10816 -7201 -2874 -4145 -5221 -1841 1054 -852 55 -291 -6986 -11853 -11166 -6262 947 5188 6062 -607
10800 -607 -1195 -136 1687 -3335 -3980 806 2824 4170 1407 -1333 -6225 -9847 -12447 -10901 -3635
10785 -3635 -5855 -10348 -8556 -10067 -11398 -8290 -1104 -2809 -3742 -1177 -2530 -1299 -5531 -5351 -1947
10770 -1947 -4403 -10130 -5817 2267 1502 -2703 135 682 -5619 -6293 -8747 -10347 -1315 3772 1490
10755 1490 -1067 -4204 -15661 -21042 -12869 -14649 -15533 -12509 -6319 -6998 -8001 -3847 -2051 -1884 -6442
10740 -6442 -5108 -5509 -11948 -9346 -7269 -10221 -7954 -7800 -3899 275 -110 -5216 -9406 -11424 -9932
10725 -9932 -663 5226 5873 1025 -862 -19 -1639 -5851 -10077 -12240 -7443 -4751 -8762 -7891 -11967
10710 -11967 -13530 -9218 -1505 6966 9321 10405 2975 -2489 2418 1621 -2101 -3289 -1038 -1597 -6419
10695 -6419 -5855 -2081 3070 -964 -5545 -6505 -8724 -5725 -4267 -2900 3421 5581 5690 3641 -101
10680 -101 -3546 -4657 -3249 -5762 -7613 -5592 -6352 -5748 -7485 -4312 -3991 -669 3270 3240 -3817 -5130
10664 -5130 -8408 -7957 -6110 -7388 -7552 -13207 -19948 -12901 -4535 -7330 -6123 -11452 -11786 -7261 -5212
10649 -5212 -5247 -6986 -4224 -5835 -8012 -1749 -1005 818 -920 -847 -3465 -6450 -10577 -16742 -17656 -15273
10633 -15273 -16413 -22088 -20279 -12541 -7501 -588 3524 -4741 39 5358 910 1298 -1239 -8739 -8586
10618 -8586 -5622 -1868 -10029 -9006 -5096 -2304 -2507 -3353 2964 7026 4178 -2679 -4200 -3686 -4439 -5364
10602 -5364 -3307 -6037 -3924 -2719 -4261 319 147 -4330 -5880 -5587 -2174 5900 6365 6238 5981 4536
10586 4536 5762 8468 3617 1404 -2605 193 1251 2845 6426 -1233 2085 5099 5571 7707 7164
10571 7164 1711 -13449 -13325 -7949 -3520 -4273 -3713 -8411 -12187 -1670 5243 5672 5803 9597 6052
10556 6052 7352 1386 415 68 2367 4248 3029 -2118 -4298 -6317 -2535 2792 1230 6741 8359
10541 8359 8142 4213 -1361 -3405 -9155 -5803 -5690 -5950 -2192 1532 2544 4191 1477 -1802 -2922
10526 -2922 -1118 4325 9287 8599 2283 116 -2736 2991 9518 5219 -2948 -7950 -8956 -5354 -4302
10511 -4302 -6611 -9788 -11476 -8997 -1744 1551 -100 -464 -3111 -6945 -6870 -2426 -2397 -9406 -5534 1810
10495 1810 6594 10581 8801 7168 2015 -3163 -1271 -1166 -1747 -4730 -10304 -8695 -4652 -2353 -3289
10480 -3289 -3549 -1455 3801 5937 4200 4351 4268 5242 10132 13931 16905 12974 11547 9233 1781 -6309
10464 -6309 -3756 -3850 -6545 -757 3476 -1992 -3378 -2287 -2143 -7209 -6106 441 2654 -2348 -3661
10449 -3661 -2619 745 4711 6602 4291 -1301 -2273 762 -2980 2593 2791 3027 -1624 -433 2558
10434 2558 3709 5479 3444 2032 795 6890 10642 9905 -756 -8330 -11177 -9627 -5760 -6048 -10721
10419 -10721 -5176 -1132 4106 2217 3726 10981 13551 10356 7710 37 -2649 -1961 -3395 -12729 -14489
10404 -14489 -7257 219 -2540 -413 2768 2562 5427 6388 11082 10636 4592 -1737 -4975 1314 -813
10389 -813 -2084 1515 -2473 1987 3842 -1591 -1454 -3132 -4235 -409 -330 -4121 -3864 -7010 -10154 -11997
10373 -11997 -6446 -3645 -2440 -4481 -6536 -6053 290 5350 3232 1628 1097 -3519 -1640 3601 1135
10358 1135 3255 5765 4692 -1152 -778 -4024 -8813 -5405 -819 1931 2612 10092 11317 9330 8705
10343 8705 5714 4027 627 -700 3662 5162 1227 339 4662 4231 4400 6909 10913 13810 12284
10328 12284 9372 7737 3314 4339 1676 3046 4186 4818 12066 15070 14406 12021 9951 13900 6094
10313 6094 3504 7826 8755 12019 10152 5434 162 -2570 -2141 3051 2082 -1110 -577 413 3777 -535
10297 -535 -5077 -5603 -3931 -8541 -15397 -18518 -14774 -13344 -2813 7927 2852 1426 4177 2952 5398
10282 5398 4671 -114 -3238 -1632 1470 -852 -2542 4170 3388 -5247 -9634 -3104 11044 12167 9772
10267 9772 4892 -4076 132 9255 9005 8099 15231 16221 16238 13818 14110 7601 10339 11597 4896 1324
10251 1324 -1565 909 867 2983 4195 1961 6597 6924 10473 16898 13039 7587 4748 10737 13220
10236 13220 14382 12492 4610 1253 2436 4724 7627 10421 8851 6513 3310 -2171 -442 3798
10222 3798 9445 10675 6188 2182 828 9631 13287 9471 5696 4355 4175 7040 6876 6838 10548 13392
10206 13392 12011 4725 3302 3751 7291 7190 3232 -38 138 798 -5724 -4364 4719 5585 3882 -3766
10190 -3766 -1353 665 2421 3457 1522 -6907 -11796 -3716 7746 8114 628 -602 -7280 -8092 -7054
10175 -7054 -4378 -5421 -345 4663 6362 13797 19938 20718 12801 11885 12407 13687 11670 13036 14853
10160 14853 18172 11478 6069 4713 3268 2821 7441 7519 8077 13690 16900 12255 15146 21882 16644
10145 16644 20065 28399 29840 30257 26092 20058 21287 24233 26159 22531 21948 21189 17835 18295 17591 14619
10129 14619 13128 9718 12531 15909 14669 17095 12889 4833 6403 9128 7042 11281 13257 7412
10115 7412 -1167 234 4575 6838 3775 9556 16887 23294 22119 17507 11742 10990 20506 20018 15539
10100 15539 19966 19856 14866 15206 15292 14942 15463 16379 10296 11825 13788 16149 14966 6251 8776 17185
10084 17185 22654 22419 14007 9904 11890 19867 27061 23632 21312 17434 11426 15000 18432 21105 23507
10069 23507 23199 28978 32119 29937 26141 24654 23382 20806 29298 39827 38504 40633 38047 33090
10055 33090 30983 32296 27708 24276 28071 29097 22966 19637 19122 26923 31312 35502 36897 39221 36435
10040 36435 38013 37307 40802 43737 48476 60837 65325 60621 55052 55153 62496 63663 65118 59485 58187
10025 58187 63524 67502 67883 66083 65061 68254 69047 69833 72480 69283 63420 66013 68721 75096 79186
10010 79186 78859 77454 80035 85704 89500 89479 93134 99689 102561 101588 108515 116895 121132 119446 121807
9995 121807 127661 132846 139049 141083 146910 153642 162489 172616 176810 183986 189250 199571 214912 227404
9981 227404 239047 255712 274786 299374 314467 327508 331370 328108 343338 361954 382872 404730
9969 404730 422474 441304 463979 495211 523894 550163 572264 597869 624216 646743 666973 682366
9957 682366 697899 714682 726515 744025 757000 761722 767093 767485 764243 754355 743198 729893 715461
9944 715461 701349 686094 668736 645834 633673 615265 599234 583701 566493 546475 535123 523810
9932 523810 508081 498019 489449 481199 469117 452768 433369 423188 416861 405053 392345 381517
9920 381517 370398 354004 342995 336147 334432 330704 320087 312811 306234 299907 290505 277238 270128
9907 270128 264438 257492 249282 242566 237357 230712 218208 215756 211125 204151 202596 196182 189724 182468
9893 182468 170908 165351 157316 149943 146420 136536 134263 135979 136124 126851 117894 114723 113462 110733
9879 110733 99553 95586 97960 99169 95688 93570 94612 94449 90125 87007 80854 72883 75083 72773
9865 72773 73794 68041 59091 61032 59251 57456 60578 61603 60163 63643 62566 55420 54188 51378 45046
9850 45046 37909 32480 31981 36979 38184 33096 31855 38533 38331 37951 34264 31493 23680 25890 21365
9835 21365 19604 20290 26680 27849 24844 25343 28797 26089 25509 30900 31343 27838 23118 25207 30122 27350
9819 27350 26614 29280 29854 27285 25873 29721 31419 35483 36368 30173 29919 28996 27590 24233 20960 18879
9803 18879 19935 18679 16449 14897 13191 17861 19392 17769 21783 20773 20835 22551 21592 22092 20341 17171
9787 17171 12427 8197 4611 9125 13319 17890 19159 22353 21618 20141 18576 22321 27143 31351 32975
9772 32975 36711 29327 21172 21099 21282 19064 26295 30832 29301 24095 16572 12369 10766 16166 17676
9757 17676 15069 11081 9714 7092 5480 998 1171 10445 15011 9898 5888 16241 21620 21373 14757
9742 14757 5396 8234 12232 9458 9871 12508 11431 10772 5985 5382 4181 11690 13611 10494 13248
9727 13248 12572 13978 12083 8566 6265 9891 10965 9878 6904 1830 -2570 4459 7804 9179 14961
9712 14961 14259 9878 7122 933 2975 -293 3915 4863 4695 8887 14434 15774 8741 5878 5375 3277
9696 3277 6326 2463 1088 2601 5725 7318 14704 13827 10034 6687 11194 13751 11478 8279 13627
9681 13627 14571 13196 8329 4481 521 1081 1289 -992 4038 -580 -2950 -4693 2075 9627 9349 7871
9665 7871 13375 12246 10781 11597 8200 4321 1848 400 -1068 747 1171 -5956 -6674 -89 2692 1106
9649 1106 -1382 -4883 -278 -5831 -3935 1046 3712 8246 3943 -755 -7380 -2702 3018 4691 4349
9634 4349 2824 8296 6385 -778 3811 10834 13352 9742 5716 3963 -1183 -5635 3708 6616 5107
9619 5107 4845 5942 2331 -27 1715 -750 3383 5154 10273 12153 3593 2828 7360 3280 4742
9604 4742 1462 1002 4038 8218 14298 14500 8511 3777 3915 8471 7531 3240 299 12938 11931 -3376
9588 -3376 -5979 -118 -4289 -503 5720 14780 11146 8616 6418 6445 14476 12110 10595 14038 15904
9573 15904 16544 12692 6933 3433 3670 4137 7451 6835 9591 11855 13403 14578 19413 20706 21276 16095
9557 16095 9344 4294 6980 7298 10169 8209 8075 12038 9959 7312 9244 9983 7004 3424 2255
9542 2255 3843 5619 7407 8398 9944 9528 10540 10128 10776 14417 10979 6030 10172 11649 7948 5200
9526 5200 10759 13940 14116 13405 13140 10355 -245 -6734 -13474 -12971 -11685 -9053 -17005 -14848 -14376 -11371
9510 -11371 -5710 265 183 -1183 -5039 -1371 2475 -981 2574 3143 2681 -2692 -7226 -12669 -4809 5613
9494 5613 3097 1398 1226 -3086 2342 5904 8800 9465 3976 1741 1679 7853 12689 10655 11032 11958
9478 11958 9078 2985 -376 -11443 -12664 -6625 -7550 -6599 -7181 -5884 427 4487 4692 3457 7877
9463 7877 4775 2805 -1048 -1528 -6658 -10253 -5758 -2687 3405 5172 9854 7753 2604 -2593 1995
9448 1995 6144 2897 -2621 -5166 -4281 2933 3725 3799 -797 -660 1300 1546 7791 13893 12503 3691
9432 3691 -835 1392 436 2245 -1058 -3352 2223 8314 8474 6811 2149 4112 -95 907 1075 530
9416 530 -2191 -1048 3378 1605 2658 2210 -391 4541 3547 -420 -7767 -9187 1559 8244 7065
9401 7065 648 2911 5106 3835 1197 -1039 -1677 -1137 2420 6609 6414 5914 6184 13245 15699 10385
9385 10385 3570 -790 -2728 -3551 -3608 -368 3334 7836 8473 11489 15136 20785 18018 10415 1419 -3655
9369 -3655 -5787 -26 512 -1000 -905 1121 670 -315 -953 2295 1252 -3873 -4350 1502 1199 2760 7115
9352 7115 10793 10467 5969 732 -1385 -1163 -6320 -5023 -1294 2902 2506 2420 1990 -5195 -12271 -5343
9336 -5343 -2063 -4050 -528 1475 -192 2184 639 2179 1229 -3546 -8709 -12303 -11164 1191 -2128
9321 -2128 -2287 9214 14358 12384 13264 11085 8018 8005 2598 -907 -4638 -1444 1766 -1545 -6507 -7349
9305 -7349 -4865 -30 4628 6863 1924 -844 1861 7392 4355 2033 -1023 -2098 -5586 -9061 -6046
9290 -6046 2468 7234 4303 4801 12265 10812 1867 -4113 -7351 -6358 -2499 5366 2833 -939 -2425
9275 -2425 -4488 -9184 -8742 -11440 -13514 -10633 -12126 -11356 -7625 -1096 -315 -1997 -5694 -6221 -2527 -726
9259 -726 -531 138 -1037 -3762 20 1974 9255 11035 7598 3257 828 2270 2297 197 -984 -7784
9243 -7784 -14567 -12855 -4165 -1277 -3904 -6630 -3901 -8947 -7306 -707 638 -1142 -5018 -8673 -4639
9228 -4639 -9801 -15597 -13215 -11126 -9703 -10114 -12430 -10081 -4134 -2810 -8401 -13593 -11900 -5649 -5222
9213 -5222 -2420 831 2472 -808 -1250 2411 -956 -6190 -6841 -5629 -5021 -6055 -3579 -2672 2109 4561
9197 4561 776 -11330 -14587 -13959 -7866 -5835 -5852 -320 -68 -3561 -4287 -4761 -5158 -6720 -8021 -4529
9181 -4529 -5949 -1298 -56 -2471 -274 -3169 370 2566 -1926 -7417 -5531 -8314 -8533 -8207 -3796
9166 -3796 2254 2394 1565 -3121 -1211 4610 5163 -5657 -10121 -5139 1502 -2437 -5187 -3688 -461
9151 -461 2219 3955 4841 5752 1523 4312 1377 4907 10354 12979 2445 -2574 -1886 -1447 -1155 -1360
9135 -1360 2997 2955 1696 5717 11665 8471 7119 2680 4498 1356 601 767 6310 7095 5553 6606
9119 6606 7485 6827 4052 3793 3874 3103 2587 -40 2499 1760 3487 5503 28 -3244 -6687 -11587 -13799
9102 -13799 -17101 -9137 -3314 -4211 351 -2038 -596 -3514 -2311 -4414 -9027 -6851 -5032 -5395 -4130
9087 -4130 -1544 1546 1778 4000 1594 -1669 -3437 -7451 -15776 -17164 -14520 -15586 -9693 -3176 5748
9072 5748 13777 13092 -2160 -3311 -1386 -935 -5030 -59 397 -2243 -1892 -8684 -9846 -8948 -2977 -3799
9056 -3799 -4253 632 -4848 -111 961 -1258 -1420 3422 2407 4370 6583 6467 4681 5949 7750 7677
9040 7677 8104 10553 5231 3020 2115 531 4377 3297 3599 1812 1284 251 -4709 -7811 -6792 -3538
9024 -3538 -1082 4189 3926 -625 -6994 -7964 -10940 -8733 -6697 -2600 -2926 -3914 -5122 -6257 -7697 -8494
9008 -8494 1615 1742 592 -3695 -2315 -848 9 -1849 -8112 -2632 3774 1096 -6451 -8169 -12765
8993 -12765 -14044 -2756 2764 706 2811 3961 5499 4429 2232 1004 -5546 -8440 -4224 25
8979 25 -1912 2385 1785 813 -2183 -10177 -10576 -8061 -4281 -7452 -7620 -7352 -6688 -9694 -11213 -11398 -11309 -10342
8961 -10342 -7739 -1790 2046 38 -4503 -6958 -6415 -4123 -2816 -8334 -9864 -8246 -7867 -5140 -7084
8946 -7084 -5479 -828 4852 7470 3932 1132 3838 3556 -4869 -8443 -2914 -9741 -13538 -9495 -8534
8931 -8534 -3219 -281 988 3115 -5901 -8880 -11355 -13619 -8265 -4681 -2208 470 -1159 -5018 -7901
8916 -7901 -7354 -13093 -14107 -6884 -4287 -398 3941 3311 1752 1976 5253 2102 2781 -1563 -3331 -1020
8900 -1020 3202 5530 1627 -2113 -4872 -4269 -4227 -2267 -6330 -7466 -6772 -9111 -9659 -8498 -7002 -4861
8884 -4861 4787 7941 -962 -5726 -5838 -5576 -1205 -1813 -559 3415 1710 -2982 -1551 2884 4464 766
8868 766 -3011 -1328 -5166 -7565 -6481 -3308 -3897 -7084 -14450 -13120 -5837 2811 1877 -2726 -6221 -7965
8852 -7965 -5746 -2782 -4480 -3338 -4256 -3031 -1147 -4366 -12370 -13529 -15064 -14709 -9632 -8721 -10944 -8460
8836 -8460 -1166 -6183 -13325 -11477 -7983 -7757 -6957 518 -158 -3361 2221 1788 -2174 -11592 -11347 -5256
8820 -5256 -2337 -4220 -10288 -4565 -2982 -7659 -2265 -6075 -9187 -7626 -11 1450 5220 6019 963
8805 963 1409 1495 2735 -198 -2445 -4862 -1760 1644 -3368 -8432 2836 3149 3969 5141 3198 -4062
8789 -4062 -7963 -16864 -11666 -10101 -4007 -1950 -860 2299 -753 2850 6842 10775 7247 1642 -4730
8774 -4730 -1258 -4841 -658 3512 2561 1406 -4985 -7654 -2377 -3994 -2389 3751 3057 -1734 -2282 2672
8758 2672 5079 9018 8355 9140 1678 -4026 -1505 2535 6147 2810 -5796 -9252 -4095 1810 -4067
8743 -4067 -6439 -10184 -7238 -3922 37 3315 2539 3724 3382 1274 2382 4436 3636 -2982 -6450 -7733
8727 -7733 -1363 -1609 -1795 -5307 -5684 -1744 396 -5098 -14620 -14309 -10905 -8308 -330 1217 2289 927
8711 927 -2998 -5151 -5543 -4083 6935 5182 5228 2523 2558 5750 4004 1013 1051 1428 324 -780 847
8694 847 -1008 1628 3756 -4906 -12629 -12163 -4918 -410 -5123 -5594 -3849 1543 731 4435 2297 -1077
8678 -1077 2692 3397 -1333 -4869 -6706 -12042 -11470 -4023 -880 -2490 -3344 -2533 -3318 108 -64 -4280
8662 -4280 -7925 -8719 -4005 -5334 -13530 -11336 -8598 -7099 -6381 -7113 -5698 42 -3867 -2155 -3764 6255
8646 6255 9930 9793 7410 2990 494 5766 7721 9004 3709 2466 5188 4164 -340 6368 4005
8631 4005 -1856 -5084 -8815 -2054 358 -2975 -5080 -2524 3491 8980 8551 3152 1771 -902 -1074
8616 -1074 -2606 -3438 -483 4195 6500 -503 -2490 -194 1993 -4167 -9554 -12463 -9948 -4855 -6471
8601 -6471 -10602 -9583 -4727 -3784 -4691 -1403 5969 8279 7358 10680 14637 7849 3695 -4666 -4334 3498
8585 3498 4455 -2687 -5120 -5126 -284 -842 3430 6369 4027 4162 10411 9719 6387 6347 -1157 235 1204
8568 1204 -5990 -9079 -2648 9960 14044 9427 1320 -229 -2742 1143 2262 310 -3103 2242 3902
8553 3902 2474 -4554 200 2114 2668 -3298 -10474 -11590 -9305 -2 4494 2011 3300 6903 7320
8538 7320 8903 9815 5471 2946 -1417 -3184 -1555 3501 8314 10542 8905 7777 6836 9502 11730
8523 11730 13313 14936 10639 13540 15761 8200 5492 6296 5275 2460 3185 8090 8089 3325 5067 4630
8507 4630 7687 9361 3929 6274 10145 7339 13336 13177 12890 7243 5550 6806 3658 8328 11573
8492 11573 11277 5386 6285 9589 12522 25433 37501 48882 52962 53143 45159 29345 13388 2835
8478 2835 5354 7254 9645 9840 1886 5698 12215 20936 34199 33899 40690 48418 37061 22801 15368
8463 15368 11686 12137 5960 2226 6273 4794 10825 15826 13800 20529 21949 12720 11955 11683 5107
8448 5107 1151 6403 11549 12049 18108 20158 18456 9032 -2327 -5795 -293 2288 4933 9030 6791
8433 6791 5945 4269 -516 -4631 -1583 -338 4432 6495 2056 -133 815 1056 5243 3758 -572 -1115
8417 -1115 -4026 -5875 -2880 1274 7474 9739 5109 116 -602 102 2974 9470 9696 10018 8890 4777
8401 4777 3061 2165 1439 2033 6607 10471 7925 9353 6691 6301 6985 6264 2936 -1241 -1800 -5370 -3120
8384 -3120 -519 4167 8625 9941 7623 9962 14914 18207 12842 9092 6485 -384 -3641 -6250 -6908
8369 -6908 -2981 -2227 -2077 1707 3912 5529 177 -1258 3561 2884 6814 13760 13870 13953 11861 8919
8353 8919 8492 6655 3489 6346 6175 -2929 -4908 -6627 -8621 -2818 3162 2727 -1215 4119 6675 5934
8337 5934 6021 6829 8597 10589 8917 9038 15660 15083 13658 10906 3329 -574 4122 6118 7395 8091
8321 8091 5208 -901 -593 6047 5481 1938 1428 687 -3612 -3201 -3076 -1307 -447 -5705 -9408 -10462 -7537
8304 -7537 -397 3782 4226 3753 3385 4492 7734 13504 10266 8955 10215 7607 4189 -1054 -4458 -2024
8288 -2024 2833 4385 2656 -3260 -8273 -8485 -3997 -490 2634 6570 2762 5990 7628 5080 4741
8273 4741 2714 -588 13 -3276 -3053 911 -1672 -5989 -473 5734 1146 -6541 -5049 -5776 -7594 -9248
8257 -9248 -1799 11608 7060 -384 -822 2207 2061 3244 2853 6147 9208 12417 9058 5773 6426 3138
8241 3138 2263 -3461 -5798 -5127 -3620 2535 6647 4427 7497 3456 1335 1331 1144 5961 3234 3591 1360
8224 1360 2433 1561 3173 965 -3818 -985 6614 7842 8099 8657 11057 8368 -1083 715 4850 8129
8208 8129 8363 10587 12085 13027 10997 1355 2174 8383 8056 6531 4167 4294 8280 9817 9291 10981
8192 10981 16757 16630 15416 9677 6397 12752 16386 13819 16030 16632 10632 11032 12351 2113 2682
8177 2682 2806 3957 4062 9034 9677 5405 6026 10948 10817 6914 9460 14383 17997 9657 6645 14189
8161 14189 13187 12050 9441 10342 7335 3613 10200 12841 9881 7420 5981 9564 9927 5955 1664
8146 1664 -1233 -3812 -5118 -429 869 -27 2362 8503 8515 12076 8145 5911 6032 11267 9661 6151
8130 6151 9401 14820 19039 19494 19722 19712 16147 10998 8516 12051 11234 9186 5981 -1336 -624 3548
8114 3548 445 -1723 -1477 1192 5775 15593 20234 20020 13372 6165 4917 7004 10290 8034 8100 10380
8098 10380 11330 14525 15250 11873 6954 2343 2922 1509 2686 3608 5170 4168 8087 11993 16099 19162
8082 19162 17345 8284 9783 11613 13696 11529 5705 6095 15792 18979 21016 20722 12549 6281 9108
8067 9108 13113 5333 4409 2600 2383 8604 12875 13362 11149 8002 2043 2349 9230 6666 11686 20292
8051 20292 16284 11004 10852 10676 4654 5983 2292 347 2340 2912 3584 1002 -506 -4363 -4573 -3807
8035 -3807 3466 7360 -1128 -1751 3193 3015 3851 7878 12293 14202 11396 6294 -422 -1979 -2105 -2248
8019 -2248 -216 4436 4512 3277 6288 3467 6025 9869 5374 216 -1159 3075 6517 4700 -3782
8004 -3782 -8815 -11573 -4151 -2368 -337 239 -3265 4619 9040 3821 8327 4841 1116 2925 -907
7989 -907 -3607 -7869 -3609 6337 7601 -765 -1701 -963 8971 16339 21507 13966 3149 968 5125
7974 5125 4453 883 -8818 -9256 -6689 -2825 -2965 -1339 3071 3071 2336 -3560 -4257 -5768 -3917 1281 4077
7957 4077 8591 11486 12852 13955 9703 4532 2316 721 2131 6564 4393 -116 334 2983 5117
7942 5117 2510 5087 7777 13323 9226 11425 13249 11339 8019 7541 9730 4268 -4502 -3069 -3374
7927 -3374 -1203 2740 -436 -1803 -1227 -3052 732 1916 1115 87 -5001 -2965 -2773 -5248 -6544 -3191
7911 -3191 -3960 -4912 -1457 -451 -4670 -11120 -12598 -13665 -8941 -5813 -6172 -5858 -2381 -541 1031 1053
7895 1053 -3028 -4752 -4168 -2620 418 -274 -5063 -2181 1837 7032 8139 -1160 -3254 -1884 2803
7880 2803 -2779 -936 5053 7537 2698 2938 11289 9246 7391 -3109 4662 7636 7860 7256 12582
7865 12582 13700 6893 -5212 -2493 4912 315 309 4841 6006 4234 4422 9294 14882 12216 11660 12497
7849 12497 9921 9344 11389 8857 6296 6605 6752 7461 1944 -1537 -1791 390 506 4762 12546 13110
7833 13110 6061 2562 1659 -249 1368 -4014 -6729 -4055 -1250 1261 -2100 -4477 -3590 -2036 1243
7818 1243 4184 -1021 -3303 1244 1906 6132 4091 -6282 -7392 -2856 3402 2951 4044 7096 -1520
7803 -1520 -7862 -5633 4333 7531 5017 3619 4752 339 724 307 7478 4182 5446 8265 10388
7788 10388 10501 9499 3057 -49 -1759 -6879 -9882 -6816 2032 -2283 -4269 -5866 -13798 -19997 -18632
7773 -18632 -9821 -3867 -4488 -8087 -8668 -6524 1763 7494 3257 3190 738 1339 2954 6091 7124 6335
7757 6335 3025 -1936 90 5410 1874 -879 599 -1359 5762 8419 8808 13662 17552 14603 1872
7742 1872 -8331 -10185 -10005 -10257 -9957 -4639 -3514 -1674 3108 2844 2220 2386 -4444 -6554 -11935 -8771
7726 -8771 -5702 -4155 -2093 1142 -2657 -3671 -3561 -802 3030 7026 4849 -92 -6472 -9773 -5230
7711 -5230 -1491 2342 1286 4701 864 -7604 -10909 -4887 -4520 -5948 -2137 401 279 -2161 -6848
7696 -6848 -291 -871 -459 3870 12184 10758 2182 -2692 -10238 -11816 -11819 -11833 -11620 -8487 -5679 -5863 -6490
7679 -6490 -10201 -2887 1810 2321 -2066 2668 6374 6874 3144 -8467 -18207 -12834 -8600 -8298 -7890 -3798
7663 -3798 -3748 -781 -1695 -6765 -8277 -9354 -6598 -1821 -1556 -2676 4994 3202 -4348 -3036 632 1096
7647 1096 375 3817 3079 -1348 -2891 20 -677 -7809 -7688 -2773 1453 3188 5562 2706 -3328 -11022
7631 -11022 -7041 -4174 553 577 -2304 -284 -5288 -1830 1264 486 -3340 -8626 -15696 -10112 -3678
7616 -3678 -3504 1435 1366 -1199 -5010 -8946 -10356 -8316 -1676 2648 -2576 -5340 -345 299 -961 -3908
7600 -3908 -9890 -7862 -906 -287 -5150 -7677 -14968 -14645 -8217 -3679 1521 -688 -3652 -5917 -13316
7585 -13316 -10729 -4819 -7796 -9936 -13056 -10219 -8424 -4571 -1192 -3103 4733 3504 -142 -1120 2504
7570 2504 4447 2832 -2793 -4456 1674 4697 3197 -1925 -7697 -7261 -10249 -8426 -7863 -8694 -9604 -8765
7554 -8765 -5149 -2256 -1340 -6499 -9338 -8758 -10073 -12402 -14733 -10876 -9400 -8940 -4127 -7307 -8978 -9332
7538 -9332 -7340 -5212 683 2913 -3804 -5715 -5176 -800 -791 -337 -118 -2830 -6963 -11443 -8229 -11388
7522 -11388 -20640 -19226 -12275 -9521 -7294 -609 2329 -2747 -3350 -4828 -8544 -7199 -5216 -5541 -4792
7507 -4792 -2933 -4506 -8102 -12291 -10408 -8013 -4586 -1904 -1245 405 1066 1788 7781 9784 3468 376
7491 376 -826 893 2140 1954 -617 -2195 -3483 -4254 -4275 -2947 -711 -3913 -13637 -17242 -18493 -16804
7475 -16804 -7968 -4030 -10127 -6235 2558 1487 -2324 -5525 -7158 -9332 -11542 -10844 -5346 -9157 -15031
7460 -15031 -9880 -4063 -3738 -5729 -2576 -9806 -7279 2704 7088 6500 6790 5595 3632 -5256 -10327
7445 -10327 -9266 -11325 -14658 -15559 -12806 -4539 -2151 -4375 -3253 1376 7227 9130 10841 10152 9471
7430 9471 9958 5531 10865 11041 -2964 -15033 -20388 -15519 -8065 -2670 670 4070 5685 4662 5810
7415 5810 3872 2548 882 4923 5344 0 -2043 -3056 -3172 -1915 -1841 -7314 -9576 -9024 -8135 -3569
7399 -3569 -4353 -4948 -5538 -5845 1014 6007 3993 3359 3828 3423 -2602 -4713 -3253 -4407 -7895 -9159 -7943
7382 -7943 -2330 -924 2526 4 1681 -6503 -11247 -6789 -5636 -5233 -288 4399 5030 1193 -1178
7367 -1178 230 212 -2031 121 117 -126 -8690 -13957 -14333 -10934 -3999 -2661 -4373 -6532 -1086 194 806
7350 806 -1608 -2086 -2980 -6142 -2065 -973 -2059 -1059 -1332 -540 5255 5639 -1597 -4376 -7469 -6032
7334 -6032 -10 2068 -3526 -4152 -3119 -5615 -3981 317 2461 3121 4073 5065 6022 5451 2621 554
7318 554 1600 -3841 -3622 -1187 5061 3769 -2804 -5817 1241 857 -4527 -7809 790 3104 2510 2167
7302 2167 -1375 -5164 -6936 -7788 -5621 -10246 -12865 -9735 -6195 3965 8804 2201 -3491 -4107 -2112
7287 -2112 -1284 -8943 -2306 4173 902 -3004 -8536 -13302 -13602 -9924 -13534 -15879 -14031 -10088 -7564
7272 -7564 -6136 -7027 -5482 -7757 -3061 -435 -6626 -12114 -13549 -13398 -6930 -8455 -6799 -6048 -3129 -1298
7256 -1298 -4303 -1663 4022 6824 1754 -8401 -4191 -4467 589 1093 -3472 -7435 -5548 1920 7259
7241 7259 12415 8022 5035 -254 -2903 -4157 -7335 -9672 -1827 1028 -2304 -8956 -12341 -8452 -7750
7226 -7750 -9334 -4637 -2134 -1934 -2585 -1817 -3821 -7913 -2830 -4514 -7029 -9736 -15284 -18356 -19157 -12277
7210 -12277 -17313 -17032 -15198 -9596 -3655 -2971 -3644 -133 -1047 -2192 -3673 -6417 -8326 -8362 -4222 -7765
7194 -7765 -6838 -5371 -2889 -7979 -12842 -3375 -635 -2276 -6974 -4732 -746 -3048 -10269 -11438 -9397
7179 -9397 -5886 -10329 -15740 -13114 -12674 -15388 -14611 -12750 -7053 -4151 -5697 -4083 359 -4629 -9961
7164 -9961 -16354 -17127 -10465 -4015 -8018 -11314 -6872 -3451 -3673 -2751 3489 -4904 -16580 -16252 -12638 -8586
7148 -8586 -4813 -2998 2754 2747 5578 2479 2306 2863 -5047 -10027 -7733 -8637 -14938 -11047 -3633 -1871
7132 -1871 126 2175 7466 7634 6058 4531 3080 -7504 -13872 -16074 -9771 -7242 -9900 -3720 -7700
7117 -7700 -12773 -9546 -4752 -7116 -7980 -5943 3014 7331 7007 3362 -3074 -2945 -303 824 2835 7248
7101 7248 4393 1168 -3282 -3917 -1924 2593 4597 -2725 -2659 5957 6210 -716 -6682 -10701 -11527 -11209
7085 -11209 -11074 -10290 -7103 -7279 -9023 -9941 -8100 -4918 -12548 -11095 -5403 -3673 -11342 -18319 -11694 -4439
7069 -4439 -449 -3637 -4722 -11043 -16837 -17297 -18427 -23568 -27121 -22121 -12539 -8722 -9315 -2769 -3235 -3743
7053 -3743 -926 1470 353 -4083 -6880 -9697 -10805 -9076 -6592 -7276 -9577 -4571 -1208 289 3449
7038 3449 4008 892 -7128 -7348 -10659 -9236 -6245 -4272 5399 6454 -689 -6057 -7278 -14914 -13736
7023 -13736 -12930 -10090 -1131 2960 2145 7036 289 -5037 -5733 -2976 -6210 -7620 -4693 -8251 -13179
7008 -13179 -15797 -13518 -11482 -13427 -11640 -8191 -10022 -16210 -16930 -12815 -9128 -7986 -10411 -12233 -12051
6993 -12051 -6643 3779 3534 -1507 -5026 -5977 -5626 -4229 -3162 -5134 -5960 -5648 -4410 -2761 502 3692
6977 3692 1671 11 -3311 -4495 -6800 -5102 -3265 -4953 -5339 -2657 -7156 -6238 -10339 -7362 -8536
6962 -8536 -4578 -7417 -11093 -11142 -7746 -7487 -71 3694 1839 1931 -3511 -5788 -7598 -11051 -9783 -6906
6946 -6906 -8461 -11166 -11819 -13793 -14084 -13208 -9161 -6724 -9722 -14532 -19350 -15266 -9629 -11090 -7451 -6622
6930 -6622 -5307 -5986 -6428 -10386 -13129 -6280 358 4300 -2276 -9503 -11995 -11353 -9583 -8585 -9001 -3728
6914 -3728 -730 3778 5838 8651 5154 207 -382 -2843 -5364 -9253 -12895 -6581 3227 -670 -5953
6899 -5953 -5192 -1206 -184 2514 4506 2644 -4827 -11494 -13502 -15042 -13808 -14002 -12532 -13911 -15224
6884 -15224 -6498 -1198 -11212 -11068 -7861 -6814 -1022 2104 1797 322 -6779 -12734 -16990 -14997 -10466
6869 -10466 -12509 -13822 -15586 -13514 -13888 -17534 -18277 -14136 -9936 -5141 -4694 -8943 -9806 -8104 -7949 -3035
6853 -3035 1710 3353 243 -1834 -9529 -11337 -13764 -13141 -8782 -4916 -8789 -5336 -1253 -1145 5552
6838 5552 7366 5163 1207 712 3416 9502 3560 -762 -213 3932 2543 -3376 -3769 -259 3303 2628
6822 2628 6433 3581 2140 -250 -5076 -8547 -6309 -7594 -7197 -2051 -8420 -11086 -10162 -11712 -12410 -12128
6806 -12128 -9884 -6013 -4452 1109 1661 -2518 -3658 -3873 -7413 -3356 901 3357 5334 -1112 -3883
6791 -3883 -509 -1075 -6927 -4527 -2419 -7073 -11890 -17219 -18678 -16735 -12042 -13799 -8218 -6156 -11122
6776 -11122 -19505 -19568 -16206 -15230 -12310 -11279 -9417 -9636 -12298 -8616 -1083 -108 5217 3863 -4023 -6244
6760 -6244 -1170 -1970 -2039 -5481 -6010 -3817 -5213 -11042 -12202 -6200 3208 3688 3360 882 -6022 -7720
6744 -7720 -7617 -5025 2286 2273 -978 -2152 344 8308 8803 7817 7718 2866 -2371 -4334 -3773 -11153 -12581
6727 -12581 -10738 -10208 -5547 -5251 -10760 -12877 -13120 -11867 -7448 -7565 -7330 -4776 -4629 -2272 -4028 -8496
6711 -8496 -11015 -13370 -12844 -12476 -9463 -12431 -8932 -4632 -6757 -7669 -3308 340 -1241 1786 -2414 -5261
6695 -5261 -4222 -613 -105 845 1853 -4260 -8350 -6832 -3601 -5166 -4606 -4657 -2122 -619 452 1506
6679 1506 546 146 -1096 -6713 -4832 -2135 1644 -200 -10039 -12281 -9803 -10355 -9070 -5012 5563
6664 5563 3874 1741 8532 9284 7654 5888 7558 4445 -4233 -11082 -11724 -6949 711 -1968 -5523
6649 -5523 -6737 -2436 -5290 -3136 1553 3038 -2037 -3869 220 1296 679 -5588 -306 -746 -5577
6634 -5577 -8368 -6150 -6344 -3091 2567 4036 9310 9277 2367 3837 2703 4092 3716 4716 6279 4342
6618 4342 2631 5949 2288 -9737 -12083 -10962 -10948 -3869 834 1475 -3832 -7761 -11489 -16789 -15998 -10248
6602 -10248 -4097 -709 -596 -3631 -10718 -11052 -8216 -4564 -1426 -3492 -4006 -6686 -8648 -11005 -7202
6587 -7202 -4157 3994 5809 3794 465 -2354 -2735 1260 3119 4251 2543 -1499 -5401 -7388 -7851
6572 -7851 -7503 -4279 -1937 2271 -4319 -6495 -4868 4377 4229 -3983 -8199 -6807 -5314 -1380 -7436
6557 -7436 -8548 -7934 -390 -3891 -12733 -9907 -2064 1774 1907 6362 3490 2678 273 1852 7459 12185
6541 12185 9924 961 -5882 -10337 -10052 -10321 -12031 -13582 -8210 -5586 3529 6358 4369 1312 3403
6526 3403 -1427 3176 8554 5319 4232 -391 -7 -7175 -11949 -12941 -12161 -8570 -4887 -531 1434 -2065
6510 -2065 -4377 -5869 -5637 -3186 -5578 -7936 -9043 -3248 -474 1331 619 1260 4840 3329 165 -11197
6494 -11197 -9318 -7078 -10271 -9214 -11409 -8044 -7884 -12585 -10100 -8343 -8226 -13512 -15480 -11546 -10441
6479 -10441 -8416 -7582 -10401 -7851 -3316 -5715 -7373 -4698 -60 2408 2025 1277 -2000 -5207 -4859 -4993
6463 -4993 -1567 1686 1255 5123 2483 -3271 -3675 881 4677 -1396 -5012 -8578 -11040 -3749 -7047
6448 -7047 -15381 -14652 -5690 -2398 -3819 -5724 -9771 -9243 -3769 -3474 -799 -1836 -11142 -11218 -2920 -447
6432 -447 1148 1093 1037 2938 5793 2995 -135 2528 -1484 -4187 2182 2883 -2102 -11105 -10061 -3965
6416 -3965 -4123 402 12499 14357 7843 4619 6542 3243 -5637 -7881 -11063 -13483 -11945 -15315 -7946
6401 -7946 -3059 -3016 345 -3991 -945 -3175 -5189 -11837 -13267 -7231 -2180 -5708 -3263 1410 432 -833
6385 -833 -8088 -4082 -3588 -4181 -2542 -1376 -4963 477 1175 -583 1003 -2607 -2903 -854 2221 1050
6369 1050 -1648 -4595 -2606 -1575 -6587 -8741 -7370 -9047 -4628 -2626 -4740 -1763 2254 -3926 -7912
6354 -7912 -6843 -4805 -4293 -1447 -1243 -2653 -1123 -898 3679 1266 -347 -2739 -5281 -5508 -5203 -6646
6338 -6646 -10756 -10556 -6994 -1185 -1120 -4600 -2470 249 1469 603 -606 -466 262 -1136 401 -1073
6322 -1073 -993 -2954 -1553 417 3781 3112 4725 -876 -9583 -13966 -12462 -13835 -8947 -3058 -9613 -6207
6306 -6207 -4366 -4596 -431 1523 -5352 -2742 -1862 -5873 -4900 -6460 -10609 -10157 -8506 -3103 2754 2641
6290 2641 -2913 -7501 -8131 -3362 81 -3795 -3916 -5758 -8597 -7987 -3298 -1517 -6529 -6740 -12016 -8424
6274 -8424 -7177 -7651 -5970 -1239 3683 2998 -4724 -3927 1832 1663 -2776 -4680 -100 4342 2174 -1396
6258 -1396 -1002 -1037 -6082 -359 -182 -132 3992 928 1374 -3092 -4352 891 6906 3405 -708 -347 -1768
6241 -1768 3646 4808 -801 -7281 -1111 1777 174 -4629 -1179 -1999 -6657 -5801 -1955 -3721 323
6226 323 -199 -7072 275 4852 5344 3401 -1153 -672 5178 331 -6213 -4172 64 3093 2266 3464
6210 3464 1260 -4305 -1965 1201 2420 3821 3654 6356 5949 -2413 -4659 -6800 -5053 -9077 -3639
6195 -3639 -2035 -6058 -10575 -9586 -4614 -2099 -5348 -5848 -5393 3362 3210 3907 -3407 -13614 -18584 -14483
6179 -14483 -12014 -11948 -5493 -546 3581 5096 8116 9588 9180 -2652 -5723 -969 3882 1591 114
6164 114 13 -3612 -1392 -497 -3056 -1734 458 4151 4212 -2379 -12343 -7465 4866 5145 2643 3024
6148 3024 -1418 -4592 -7083 -8703 -6804 -2935 -2687 -5016 -7477 -5020 -586 -3775 -6636 -1508 983
6133 983 -728 -3342 -3304 2171 5930 -702 -4507 -836 2595 3466 2083 3971 -4682 -3974 -2018 -6399
6117 -6399 -11106 -10393 -12666 -12739 -11088 -2860 -2104 -7068 -5109 -10046 -11595 -11376 -12113 -6850 -4589 -902
6101 -902 -6455 -9702 -6370 -1468 -5585 -4268 2104 2144 -2702 -196 6062 5828 4585 -36 -2479 -209
6085 -209 -1738 -6906 -6341 -8203 -7093 -6563 -4710 -2793 -8289 -3051 679 -2201 -2787 3845 11075 15293
6069 15293 13881 9156 -545 1243 6851 11186 12721 4428 2522 1921 -2787 -10029 -12999 -12477 -12926
6054 -12926 -13665 -11050 -8606 -13755 -16848 -12012 -2378 5152 -1902 -3 3 -4112 -857 -2223 -1549 -5224
6038 -5224 -8503 -8114 -9501 -7780 -6187 -1900 -6101 -1794 5033 664 1532 5842 6023 913 6445 7962
6022 7962 7363 6833 7104 1669 -4392 -2885 1255 6401 6513 3921 -882 -6976 -151 5712 4400 -945
6006 -945 -8371 -8335 -1713 5518 2816 -273 -3056 -6240 1447 2442 1027 -411 -230 3601 -3329 -4832
5990 -4832 -2713 134 400 -306 575 1223 -3025 -4304 -4780 -5378 -1714 -5694 -11290 -980 790 -5026
5974 -5026 -1213 5321 5163 4762 5273 -1510 -4808 -7608 -7752 -6843 -3943 -7539 -6671 -5746 -4034 4186 2415
5957 2415 2649 875 -6690 -11917 -5290 -5205 -5684 -7500 -688 4180 891 3423 213 1171 8697 4638
5941 4638 -1197 -5179 -4838 688 936 4514 1212 -5239 -5706 -532 -2470 -6166 -5604 -4570 -5641 -7870
5925 -7870 -803 -1842 -1105 2868 7985 7872 -831 -8356 -4048 -7393 -7493 -597 2227 -345 -5512 -16982
5909 -16982 -11612 -3815 -8164 -7165 -1600 1292 -2107 -3110 4831 6089 -108 -4980 -2194 -656 1639
5894 1639 -2780 -3211 -3608 5344 3357 -9130 -12251 -4551 -977 2143 -1425 -4688 -1421 -4681 -4807
5879 -4807 -2619 -4076 -280 5468 10620 8605 7717 2047 -4693 -2831 1411 -795 -6413 -10733 -5345
5864 -5345 -8243 -9266 -6100 -3106 -949 -371 -5975 -10372 -9983 -11249 -11639 -5571 -7932 -8851 -10853 -7754
5848 -7754 -859 -363 -1735 -779 -1023 -308 2589 6319 536 -6375 -6362 -3487 -2804 -2901 118 2047 -1786
5831 -1786 -4012 2057 5420 4843 3158 -1464 -6818 -13091 -14175 -11172 -4739 -7082 -11143 -15077 -15064 -16599
5815 -16599 -11717 -10002 -9533 -4214 -1755 5825 4234 -308 -1914 -3518 -9524 -12168 -11647 -5271 790
5800 790 120 -2198 -3169 -6508 -3147 401 -3437 -1575 -4427 -5155 -8023 -8638 -8483 -4134 -4045 -5520 -10098
5783 -10098 -2719 3226 9552 11043 12880 11049 7635 8653 3326 3349 -745 -467 -1826 -455 -2779
5768 -2779 3492 8626 8030 8488 2351 -2457 -4212 -6879 -10211 -10951 -15966 -14021 -9837 -5425 -3643 -7491
5752 -7491 -8955 -7938 -2036 564 2054 2837 4107 3675 -2782 -9120 -9503 -11227 -5023 -3589 -2327 -1563
5736 -1563 -2388 -5183 -5596 -8626 -9453 -7294 -5989 -2070 -2874 1744 1298 2160 2869 3377 2260 -347 -2497
5719 -2497 -5062 -10280 -8575 -8749 -7806 -1839 -2186 -2100 -8140 -15311 -18194 -11827 -7971 -10441 -10098 -5578
5703 -5578 -2321 -5191 -9189 -12332 -14347 -9750 -5365 -9327 -2718 -996 -747 -3169 -1110 -1894 -607
5688 -607 5086 3701 1486 -2405 -5039 -10367 -9269 -1835 88 -3867 -5467 -3425 -4320 -2484 3109
5673 3109 6502 6586 -720 -4514 -897 -1318 -4027 1524 5625 5243 3309 1119 -4134 -1876 6817 5783
5657 5783 -783 -6888 -10429 -9435 -12171 -11651 -8128 -5951 -838 -2624 -7846 -8800 -5494 -1573 -868 -2210
5641 -2210 -5209 -4804 326 1277 -1226 -2131 -5694 -1199 -5026 -7689 -7674 -1123 3063 6000 -387 -6030
5625 -6030 -1996 -1539 -3415 -8753 -5532 -5315 -7540 -9924 -4571 3095 690 3327 88 -5600 -4197
5610 -4197 3351 7301 2152 1358 -2415 -7840 -11316 -8720 -6056 -4686 -7943 -6572 -5465 -7538 129
5595 129 -2204 -6135 -3821 630 122 1704 -1300 -450 -3288 -7977 -5230 -879 -5843 -3746 -78 2356
5579 2356 -1831 -2641 48 -2006 -64 -219 -687 -9694 -16433 -15423 -13971 -9123 -4119 -5700 -9950 -5970
5563 -5970 -10124 -9284 -2178 1689 -1649 -9501 -13234 -8330 -7184 -3420 1496 3539 1360 -4266 -4581
5548 -4581 -6289 -3786 1457 -2027 -3607 -9715 -7016 -1888 -5179 -2475 -574 -858 -3275 -4573 -3910
5533 -3910 -6028 -15220 -13250 -13385 -13081 -6751 4725 9270 3222 -4923 -5191 -3400 -7194 -7845 -7727 -4351
5517 -4351 -764 2399 775 -4147 -7083 -6350 -7712 -8223 -2615 -1983 -3638 -3127 -3473 -4299 -8020 -9251
5501 -9251 -5775 -4701 -8283 -5072 -6539 -4316 3065 5576 1455 5691 14066 13995 10195 8423 -1825
5486 -1825 602 2119 -3409 4747 7937 2037 13 2763 -5094 -6880 -4137 -1278 2401 -731 -3458
5471 -3458 -6546 -5105 716 -1756 -772 2115 3038 5473 2667 5672 8886 1604 -3630 -440 1925
5456 1925 3240 -2630 -6035 -2501 2502 1712 -144 -89 -197 -4572 -5866 -3672 -6991 -6488 -2884 2966
5440 2966 4840 -2527 -2811 2886 -891 -6731 -9187 -8107 -4501 -5069 -4043 -1831 172 5626 7591
5425 7591 10554 10918 5549 5922 10534 6304 604 2301 7982 5418 1032 -3990 -821 3804 2191
5410 2191 -1845 -1177 334 2781 -1936 -5133 -3483 -15 2889 6356 3364 917 -327 -3016 3927
5395 3927 7641 9727 9563 8844 2711 -3404 -1859 2276 1388 -4263 -1420 -4045 2765 3830 1538 2964
5379 2964 11175 15408 17751 12029 12909 11657 8738 8891 11229 7213 -84 452 -99 -5410 -8225 -4340
5363 -4340 -2023 -6610 -8495 -2358 -379 -4573 -4705 -3348 -3703 -6326 -1746 -1388 -5672 -2503 -5624 -6231
5347 -6231 -4430 -9253 -16013 -9300 -5444 21 -3733 -6897 -4518 -3302 -5672 -4077 -3662 -3667 -5645 -5036
5331 -5036 -1843 -1908 -2113 376 -2381 -881 3792 3122 452 -3631 -6775 -6334 22 3446 1073 -2647
5315 -2647 -880 -4602 132 3281 6619 2517 1325 3854 5169 5059 8637 1123 -943 -3309 -1344
5300 -1344 376 -2659 -4528 -2527 727 1575 -1232 -2762 -5917 -3346 -814 2422 -1137 -8716 -4228
5285 -4228 175 7373 10805 12747 11289 9444 12458 8804 13436 15254 10876 9486 9224 5379 -2815
5270 -2815 -1767 -250 -1101 -753 1444 5263 7561 6811 2300 -1702 3806 7691 8787 1351 -5736 -7949
5254 -7949 -11778 -11043 -3167 122 1872 6117 12614 14450 11574 12432 8728 -135 1385 3703 4002 8425
5238 8425 11369 4667 3950 3473 -1996 -9469 -7694 -4172 -2193 311 144 -1212 -2701 -3794 -1100 -5010
5222 -5010 -4611 557 -1558 -1646 719 -2527 4155 5564 3284 252 853 -1358 -5723 -7066 -4553 2749
5206 2749 3046 1184 -305 -1500 -1985 606 4632 -309 -1231 -4043 -9186 -12275 -8195 -6846 -10862 -1389
5190 -1389 1623 4149 5817 2154 98 6099 1371 3229 6250 7353 5366 1358 -8335 -5809 -10680
5175 -10680 -14183 -7994 -980 1546 -2569 1192 791 -1604 -1275 -407 -5775 -5566 -2065 -2561 -3670 -4209
5159 -4209 -8987 -482 5427 2287 2014 -317 -4726 -4877 -863 -2214 -5903 -3572 3115 4541 3779 9603
5143 9603 8049 4176 1504 -5240 -1081 1347 1568 -128 1032 2729 1269 2385 3299 -1750 467
5128 467 -2930 -6540 -1793 3431 5664 1410 3643 3075 2042 3948 2315 2771 1519 -872 -880 -4531
5112 -4531 -1648 2402 6180 10761 7799 2347 4589 6220 8737 7935 3750 3281 -786 -2924 8888
5097 8888 8794 5215 2179 315 -1942 -5561 -8462 -1673 -2229 -3699 2289 312 -6415 -5997 -1519 -2976
5081 -2976 -667 2445 -4318 -811 3844 3207 6518 5637 5225 6895 6421 6156 4561 3481 1273 944
5065 944 1672 2513 -1023 -4263 -3349 -4690 -3921 -4448 165 650 -424 -22 -5188 -6891 -6884 -2617 5336 1039
5047 1039 492 -3512 -6413 898 7695 3932 1703 2808 -2291 -6812 -2138 1157 259 6058 6266 319
5031 319 -1789 654 -5460 -12457 -10676 -7077 -6375 -1782 2679 1747 -3449 -3747 -676 4945 10725 9838
5015 9838 9747 6967 6433 2590 3562 6463 6370 781 4152 6286 1217 -2342 1124 7872 7455 2875 2684
4998 2684 4977 7122 4658 2780 2008 -4567 -9440 -6659 -5465 -2722 1300 2133 2790 4139 1742 -4487
4982 -4487 -4661 599 -1419 -5887 -11793 -9859 -1032 4302 2238 385 560 3872 -1304 -2321 -1240
4967 -1240 6871 11178 5303 -730 -3307 -1583 3632 4127 4220 3584 -1870 -5117 -3387 1972 1707 -396
4951 -396 1224 -1747 -3778 -4596 -4355 -2850 -668 1547 1134 -952 437 3603 2418 -5940 -9852 -12799
4935 -12799 -11115 -7541 2654 2546 692 4716 9467 10669 12589 12256 2595 689 -1473 -951 286
4920 286 -931 -2321 -7038 -6498 -8261 -5200 2799 2899 -1013 -148 -576 -607 980 -4958 -3269 -4256 -4929
4903 -4929 -2235 -3189 -4414 1952 7350 9239 9965 7145 534 -3906 -5545 -7616 -3482 -2240 1564
4888 1564 3739 943 3523 3812 1903 -842 2518 -716 -2243 -4261 -4070 -2904 -2752 -2118 -2299 -4534
4872 -4534 -4085 -4942 -5150 -6763 -7433 -4579 -3086 -1340 -118 929 1690 1860 1229 4836 3891 -3345 -5241
4855 -5241 -5667 -6390 -6920 -7285 -3495 -5935 -3251 -1217 -8131 -2832 -1497 -4414 -3144 72 8536 10789
4839 10789 423 -865 1331 191 -3771 -8174 -9520 -4581 -164 -1316 -5493 4083 7570 5066
4825 5066 2529 499 -650 40 2560 4358 -1980 -6098 -7802 -10739 -10981 -9573 -3851 851 2960
4810 2960 7174 -1467 -4952 -165 -1037 -4287 -1599 -3555 -3631 -3567 -3654 -2676 -5614 -1866 1322 -1061 630
4793 630 3701 2747 2589 1656 4460 5385 8517 7021 3290 585 3379 8516 8503 13554 18625 13651 8387
4776 8387 6666 8239 9192 7107 4141 2768 -1848 -4572 -9194 -5808 -6857 -5402 -3718 -2147 -5793
4761 -5793 -7248 -5625 -7116 -2180 -3818 431 -531 1284 4607 6404 5160 6764 3642 -3811 -6056
4746 -6056 -3312 -2402 309 528 1021 -452 -4401 -3873 -3206 -1398 147 -631 1675 2200 3346 5355 6430
4729 6430 10264 5723 4203 6062 6720 5056 12486 9246 10804 12992 10312 3657 3450 9561 4655
4714 4655 -1604 955 -919 -3258 3722 4445 901 135 1742 2354 2328 -1007 -1934 1431 652 6417 5889
4697 5889 -1427 -4122 -1494 1057 389 -5643 -9439 -5516 -7751 -13784 -16003 -6093 1299 762 -3719
4682 -3719 -2204 1560 -1164 -5973 -3879 -2060 5371 4311 4208 7107 6829 2841 120 2823 4304
4667 4304 2722 -4233 -7757 -11513 -3766 4468 3246 -4888 -6795 -2845 -499 5170 8094 6536 2439
4652 2439 1739 -3426 -8281 -8577 -3976 -1241 -890 636 -2150 -6462 -9301 -4916 -1052 -3053 -2264 418
4636 418 4193 7230 6141 6533 8339 5329 2821 499 1019 -5311 -6525 -3453 -1837 5133 1776 -7631
4620 -7631 -6991 -3435 562 4636 553 -1806 468 -2052 -4857 -6385 -5577 -3253 -205 904 2463
4605 2463 4362 4985 -2095 -815 348 1838 -199 -1275 2023 -4358 -650 3922 2891 3840 6184
4590 6184 5154 1214 -1853 1996 1914 3429 3048 95 -4590 -3580 678 1760 4185 3943 3419 3714
4574 3714 5659 6106 3952 565 3477 4682 2758 616 2316 6442 12241 9979 6652 4454 5489
4559 5489 1068 2951 7471 5692 5638 3871 5536 6401 10748 9882 3382 -1531 -6562 -4974 4003 7910
4543 7910 8517 2457 3372 -558 4319 10120 11277 8945 11571 4557 -1713 -5030 -1087 341 -2444
4528 -2444 -2084 6330 13499 14917 9251 3571 5051 3897 1608 321 -406 -1353 -2355 -5704 -3830 483
4512 483 5855 8018 3029 -679 -3376 -4062 3105 12260 8313 4477 -1438 -3788 2491 2827 7133 5072
4496 5072 5260 5238 6744 1902 -4006 -4985 -11032 -13339 -10582 -7592 -6592 -7720 -4121 909 104 222
4480 222 -3221 -7024 -7373 -11991 -11557 -9069 -7154 -5406 227 7844 2873 -831 -6589 -7651 -5329 -6546
4464 -6546 -5964 1340 5992 6473 61 -8072 -8480 -4023 -1032 -1381 -629 5700 9983 5327 -8050 -12087
4448 -12087 -2774 7917 7638 1671 -1399 1193 -1356 2972 4262 6790 6678 2271 6409 9730 3020
4433 3020 -4437 -11317 -11179 -4997 -687 2470 4403 -992 -8354 -5392 1555 4938 2291 1374 979 2408
4417 2408 -312 -3716 -3329 -4749 -6161 748 2247 -578 -429 400 1082 -563 -2483 827 -192 -4965
4401 -4965 -4220 -1314 3583 6777 3310 3768 397 -705 -44 2622 1223 -118 -281 2581 10125 10141
4385 10141 5217 944 4842 7406 5482 3557 3757 2535 4408 2467 1318 512 -2787 -9758 -10735
4370 -10735 -11370 -3337 4617 301 -1167 -2546 -3855 -3285 -3402 -6724 -9009 -11768 -7020 -1199 427
4355 427 4115 5404 -1799 -878 3996 4610 8704 8950 765 -609 408 3052 6188 6525 1806 -5195
4339 -5195 -10051 -6311 -278 -1988 2120 8844 14522 10963 6365 2559 -2534 -4066 1940 2633 2684 4490
4323 4490 8658 11786 11295 10359 5602 -433 -2992 -1060 -98 -3339 -411 9924 12675 5938 193
4308 193 1847 -500 -4228 -5320 -3742 -2619 -2167 -2160 -5216 -437 -2057 -3415 2111 5590 -81 52
4292 52 7204 7219 3365 2910 -525 -4522 -3888 261 4046 10527 9723 8998 6347 -573 885 1242 3944
4275 3944 1622 -1292 -835 -4361 -6467 -5919 -7719 -4265 -7205 -9635 -10266 -9579 -11041 -8799 -5824 -5378
4259 -5378 -4233 3422 7760 7780 4071 -3323 -9619 -10061 -2863 4064 11858 8720 6516 11699 7002 995
4243 995 4395 13330 12641 9862 10665 9843 7719 2536 4407 8722 7137 8551 7025 4191 2203 -2240
4227 -2240 -4100 4796 9129 12552 8510 6997 4649 4699 6892 7825 10458 7070 9765 5073 -3529 -7323
4211 -7323 -5422 -31 3616 1329 1236 -128 -764 2815 400 2544 768 1684 -3543 1242 1806 2668
4195 2668 2502 -3827 -4525 -7822 -4823 -2146 -865 -792 -861 -4506 -9997 -4728 -1738 7 -6294 -6930 -5369
4178 -5369 -7307 -531 -705 -3794 -9161 -6542 -3873 2199 3761 -2867 -6815 -1275 7933 4310 6146
4163 6146 9157 5458 3038 6987 11911 11012 9145 4917 723 1128 7910 8523 10229 9915 9265 13205
4147 13205 16988 15276 9358 11499 7590 1252 5391 6907 5772 7648 6403 -795 -4874 -10849 -8977
4132 -8977 -3469 -3447 -3917 -2440 -4264 1647 6592 11989 11091 9025 9409 5540 3480 3701 838 -833
4116 -833 -3868 -2195 -5428 -6804 -1643 2458 -401 -3673 -6161 -5682 -505 -2191 -3572 -2389 -5276
4101 -5276 -6211 -9083 -2988 -2459 -6388 -5023 3804 12151 13302 7635 2262 4248 5699 8497 2270
4086 2270 -3256 -2676 -2867 -3646 -4694 -2192 2842 1524 1914 1064 -3017 -4703 -5427 -3483 -3918 -4389 2795
4069 2795 -2400 -3243 -3764 -402 -1373 -1219 -3703 -3448 -7491 -3349 -3504 -2340 -7643 -10056 -10602 -11390 -4340
4052 -4340 -4456 -12647 -7074 -777 375 -4522 -6550 -2256 -2504 -4106 -4534 -6927 -9601 -4529 4569 11595
4036 11595 7308 4353 3290 -2314 -4770 -2282 3786 6914 8414 7580 5772 5623 -2699 853 706
4021 706 -769 -5012 -382 4701 231 -8938 -6821 -156 -511 3464 4442 5754 7293 11967 1717
4006 1717 -2896 1166 2634 5005 4476 2114 3328 1901 2091 4687 2214 2366 5773 12418 13879 7479
3990 7479 -1919 -3912 -2493 -142 10428 11501 5382 2440 -335 342 5383 7949 5407 3926 1413
3975 1413 -886 2789 3772 3075 8025 6675 3965 7644 5755 5993 -1437 -943 -2008 -5187 -5373 -3986
3959 -3986 3162 8096 7681 2967 3984 8450 3386 -7325 -9303 -8479 -3388 2653 439 -3875 -3243
3944 -3243 -20 6918 1659 -2508 -1943 -3029 -766 2421 6517 10512 9616 7311 5174 3530 800
3929 800 4982 3471 6316 10294 5356 276 7076 14386 9292 1147 -2334 4747 9199 8778 5414
3914 5414 4794 7705 11090 10624 11917 14254 15226 13428 17473 15077 9115 9759 11823 11179 4153 -2080
3898 -2080 -2427 -5794 -7491 -7250 -3045 -1049 -3142 -1126 -359 -1645 3175 4272 5479 16452 18291
3883 18291 11666 7519 6628 8639 7126 7681 7017 929 37 -5482 -1363 -765 2512 1461 2383 3487
3867 3487 -2538 2207 4962 4504 1444 -1078 1441 2369 4312 11097 9148 6843 7145 7091 5350 1515
3851 1515 1634 4850 7182 5155 4413 4186 6475 8080 8203 2280 -2356 -5067 2618 7601 1309 -4660
3835 -4660 -5815 859 8671 6901 5016 5480 1986 349 -7090 -2042 717 -1389 -1626 391 -1730
3820 -1730 -4182 -3882 2186 2766 -879 -5115 -7548 -7252 -209 -2683 254 340 115 -383 -619 853 1456
3803 1456 6026 6017 2353 1347 2634 -4778 -6700 -3353 -2361 -298 -865 -4901 -826 1007 3503 4960
3787 4960 1708 -3469 -4085 -4965 -1783 -3726 -11364 -3743 -2693 -6798 -2106 2052 3803 3082 2817 2748
3771 2748 -184 -85 -1831 -7763 -2104 2395 -4101 390 -3380 -4321 3251 -578 -5676 -3233 1350 1299
3755 1299 2279 4593 7706 6516 3836 5644 4527 -2055 -5351 -8725 -5846 2191 3088 66 -953
3740 -953 -4267 -4372 -1469 6849 9892 9028 1837 -4227 -4408 -3263 -8071 -9059 -5443 897 693 -5208
3724 -5208 -5912 -5551 -4884 5575 8665 3869 814 -298 -2098 -4250 -2320 3241 1827 891 3496 2752
3708 2752 3337 3884 4739 -3313 -1962 3782 3566 -2068 -3318 -2761 -77 1155 6782 5674 8894 7492
3692 7492 -495 -6326 -9563 -3122 -909 -3835 -5576 -2126 -743 -1441 -5891 1680 3600 -306 -1851
3677 -1851 -416 7049 7146 5841 3061 710 -907 4349 7644 10982 6844 8542 2525 -2873 74
3662 74 636 -1403 4734 6827 -2700 -6077 -8173 -8350 -4672 -5039 -163 792 6481 10310 6383 3193
3646 3193 2071 351 -3028 1493 4862 3777 6821 6832 5468 -2451 286 5011 9678 12882 14670
3631 14670 15515 18623 19511 14056 12626 10674 3894 -2007 82 -52 -404 1969 10551 8128 3743 1799
3615 1799 4548 7581 1510 -480 3536 2405 -6476 -9811 -7606 -6177 2574 1224 -1634 -244 -4457
3600 -4457 -1601 -3905 -5552 -2618 -419 -2339 -3043 620 2909 -1728 -1672 416 4052 931 2517 3610
3584 3610 1274 2258 -543 -1356 -1181 -758 -1128 -3826 -2272 -3782 -5474 -8970 -4935 4654 1209 -2877
3568 -2877 -11994 -4051 4367 905 -6594 -5422 1564 5964 5889 4059 2577 4305 3936 4185 11 7460
3552 7460 9209 6259 6259 1296 -3123 2689 -6427 -13999 -11623 -2631 4374 -1172 631 982 3807 3997
3536 3997 -2291 -3610 -5924 -7160 -5282 1872 4956 7488 9386 6896 4214 3524 422 -2092 -6961
3521 -6961 -6762 -1836 7206 2952 2805 1727 6438 9022 6573 9430 8346 5661 1891 3474 3660 -2379
3505 -2379 -4018 -1167 -5020 -4614 2130 2217 -1726 -107 -1252 -4762 -5575 -5140 -4334 2818 -1443 -5892
3489 -5892 -14563 -16154 -8421 3721 10855 269 -7021 -2181 9952 23509 30475 33566 29939 30676
3475 30676 39339 45021 39193 36498 37225 39047 34931 20629 5442 -8186 -9398 -2921 1058 4244
3461 4244 7880 5110 3170 -1397 -2388 -1407 385 4540 6409 1893 -1492 -4462 1001 3749 5096
3446 5096 6964 8401 6638 4702 3181 415 -1675 -477 -536 745 4654 5214 2201 -1333 -5166 -6283
3430 -6283 1120 -595 -994 -4092 -5458 -4777 -5172 -8185 -9430 -5069 -721 3532 5824 2366 3098 2400
3414 2400 -1170 -5649 -4743 300 278 -4566 -9662 -7482 -2628 -1438 4498 428 -898 403 -546 -1901
3398 -1901 4528 10309 12740 11737 7666 4136 1502 -2068 -1261 4313 3447 3572 4954 -79 -4582 -8904
3382 -8904 -10690 -5705 1575 6050 1602 -447 -2573 2432 6981 8426 10217 8132 9724 13806 11994
3367 11994 7296 8772 14214 10841 4033 5485 10648 11108 4929 759 -858 4808 5281 3124 5941
3352 5941 12039 14620 7080 1264 -1730 1220 554 1077 3135 5960 7675 5031 2546 5347 5561 1001
3336 1001 -1711 6355 10764 7567 7115 2396 -7129 -8932 -6709 -5586 -5827 -6398 -2645 -3999 3818 4946
3320 4946 5955 8100 8118 1947 -3454 -4441 -3901 -2573 5514 10861 8297 3942 705 2527 5050 0
3304 0 -3321 -1543 -1367 358 -1496 -1753 790 4667 -3339 -1708 1017 3677 5199 4511 -574 436
3288 436 7232 7757 2727 1593 2591 2424 -1022 -1502 -1216 2714 1678 2870 6036 12903 14804 17221
3272 17221 10699 3178 -1330 -1836 -6959 -5681 -2770 -2852 -114 -1928 -3927 1538 1861 293 -2204 -4090
3256 -4090 -2101 299 -573 -4146 -385 5041 5233 -889 -2094 4023 2781 -1944 -2325 4 4867 3318
3240 3318 867 -1552 -5786 -2425 -5578 -7866 -7124 -3640 -7038 -8679 -4811 -1511 7144 16077 10113
3225 10113 -1558 814 1919 2892 3544 -532 545 3549 2450 -4808 -6427 -3678 284 -509 214
3210 214 2427 -376 -3473 -6497 -6226 -6184 -1838 1871 2200 3613 3678 5215 5893 7523 3267 543 3126
3193 3126 5608 3753 3891 5774 8282 9556 6311 -2478 -7381 -6368 -5013 -1481 4502 3330 -3648
3178 -3648 -5963 -2521 1419 340 2968 6763 2857 -480 2783 932 -6384 -4328 750 -1478 45
3163 45 3029 2506 -1842 -3863 2231 2079 -3291 -2260 1031 7267 2699 -5460 -3723 -3474 360 2901
3147 2901 -14 -2539 -3313 -955 430 -4702 -3972 2049 2099 -632 2849 4935 3384 5940 6102 7433
3131 7433 5079 -414 -8228 -9822 -4039 1857 180 -1018 -3719 -5725 -6355 -7035 -3547 -1455 972
3116 972 845 2871 -1139 -1945 2505 6162 5275 7909 10933 2564 527 1569 -1364 -5378 -3074 4642
3100 4642 3706 506 -2076 -21 2486 5016 6859 10298 15354 16397 14336 4549 -282 555 7361
3085 7361 12876 14715 12432 8240 9756 10232 7422 9721 3730 746 4988 2946 1426 -3661 -891
3070 -891 4202 11062 9846 7950 12967 9489 4950 7660 14027 13373 13382 11312 4970 1938 -250 -1407
3054 -1407 -836 1357 4026 3493 2932 1508 -2036 909 6548 8044 5067 6372 4585 4904 6995 3446
3038 3446 -2127 -10112 -11462 -8139 -1200 6329 2458 -2960 4300 3147 -3805 -10837 -11858 -11736 -6632
3023 -6632 -5960 -7566 -9195 -3396 -209 -2430 -4126 5665 10615 1864 903 344 -4171 4233 5093 -767
3007 -767 -3827 -1961 1514 -5639 -13132 -10075 -4768 -2523 -4968 -3626 -7725 -8973 -1993 3432 -797
2992 -797 -618 232 3240 -68 1777 3839 4150 -684 -1234 2302 6076 2711 -2780 -4964 -3537 -1606
2976 -1606 2365 4115 6955 9867 5632 -2128 -3507 -1443 2419 -991 -5936 -4086 -5017 -2709 -3499
2961 -3499 -5064 -3119 -5809 -2436 2727 4897 1310 -1464 -4508 -4341 -2459 -4540 -2810 -1403 -2948
2946 -2948 3352 4274 4000 3142 6717 9582 11995 9522 6773 5863 1442 2108 3066 9631 14018 7846
2930 7846 5348 4736 1055 -2751 1296 2213 -1399 -2302 7181 8024 -2555 -8836 -4591 549 2011 1873
2914 1873 -8417 -5010 320 269 2054 -1790 -1489 2163 5017 -2802 -3943 -634 -5716 -9336 -10712
2899 -10712 -9186 -8403 -9038 -11174 -11164 -15817 -13625 -3339 2810 7674 4510 4661 7914 7265 2390 -1990
2883 -1990 2183 2650 -27 -1939 -2031 1962 4310 3051 2264 -2298 -4564 1538 7986 10153 9760 9360
2867 9360 5596 4889 -1706 -6873 -13796 -8964 -3193 -1631 -371 1188 1113 2932 1349 -2506 -4224 -6034
2851 -6034 -4111 -2948 -7972 -9025 -5510 -3045 -5169 -7653 -7181 -5957 -4925 -4109 -2658 -2506 -4531 -1834
2835 -1834 5658 9031 6882 2921 2268 395 1617 -599 -2362 -2162 -3062 3074 7054 2616 575 5
2819 5 2899 12615 13314 7967 6138 7547 10491 8114 5920 1014 2333 1840 1043 2200 2040 -2941 -277
2802 -277 2836 764 2987 6972 5874 3714 4476 5852 4510 3705 9994 13963 7558 -3266 -6730
2787 -6730 1050 6570 10002 8600 6031 3053 1577 -686 -3999 1812 -1058 -5200 -6456 -3386 -7385
2772 -7385 -6948 -4820 -7766 -9588 -7463 -3930 -2719 170 -1344 -108 -310 -2829 -1090 -287 2780 9246
2756 9246 13605 14025 15131 12302 1530 -9056 -7545 -4284 -6390 -8819 -8930 -5798 -4032 -275 2128
2741 2128 5621 4732 1955 -2713 -1243 576 1486 475 -4168 -2296 3389 6908 11243 12699 9114
2726 9114 5052 7888 6102 4008 -826 -2625 -2125 1567 2280 4450 4873 5125 2760 7752 10570 10925
2710 10925 2044 -2623 -4765 -5660 -3194 2239 3224 -2605 -5488 3613 13585 11747 8516 1358 1525
2695 1525 293 -2488 -3393 -165 2010 2036 402 2181 937 1646 -1005 3367 6431 1494 -2598 1348
2679 1348 2572 5605 7665 9121 10085 8684 1534 581 936 1695 923 756 -4465 -8993 -1724 -2839
2663 -2839 -1676 411 -6808 -12083 -6292 191 4494 2618 -270 -574 25 728 -570 -2302 -2123 331
2647 331 173 -518 -6196 -4261 553 -1454 -1499 -2418 -3916 -1810 -84 1708 2410 2298 2010 3846 7940
2630 7940 536 -2088 3142 3955 8227 9974 4316 1955 1121 -3 -5148 -7330 -11030 -9727 816
2615 816 -1002 -4624 -2212 6076 1571 -4670 -4178 -7377 -12145 -11931 -13757 -14013 -10118 -6619 2549 2643
2599 2643 -4445 -8360 -4261 3028 9529 6220 -455 -279 3683 1226 2302 317 2715 2913 3420 2202
2583 2202 -1593 -2337 -3705 236 365 -2437 -4884 -3854 -162 1388 3926 2898 2230 2204 1927 1884 445
2566 445 -3070 -4569 -3526 460 2735 -3968 462 2493 2500 -2565 -2678 -4609 480 -351 -1349 -4633 -8828
2549 -8828 -6462 -4565 -6619 -1469 5046 6081 6971 5251 3436 154 1253 6917 10505 8075 11715
2534 11715 11532 10437 11216 13009 10675 2577 408 2577 10335 11025 7212 3164 -5635 -3386 -531
2519 -531 -130 -3226 -5552 -4190 -3122 -823 1162 1412 3294 -1468 -266 -916 370 2684 -1762 -7106
2503 -7106 -4890 -6293 -14932 -17262 -10020 -7044 -477 -1245 -8976 -6329 -2538 -3763 -1396 -3840 -10458
2488 -10458 -6501 -5280 -6626 -1996 481 -1467 -2836 4381 7843 521 -9992 -7914 -3490 914
2474 914 3814 801 -4457 -9057 -3573 2662 2724 141 5895 6088 1090 -10119 -6906 -8446 -5608 -2495
2458 -2495 -3796 41 -2805 -1229 -1426 -1217 5496 7508 111 -1736 5278 9692 8040 2733 1437
2443 1437 -5605 -2686 2468 5458 7176 6502 2968 4389 9231 5311 3580 -1303 -8913 -8072 -7233 -8801
2427 -8801 -8938 -12634 -9581 -4195 2864 12815 13330 7726 5620 1668 -25 -64 2840 1321 -2181 -2372
2411 -2372 214 7736 9351 1925 -8192 -6635 -3656 -488 -2485 -249 -6461 -10681 -11175 -5895 -289
2396 -289 1997 1742 -1271 -506 900 -408 5539 9969 13787 14045 13844 6636 1488 -2014 -5340 -1791
2380 -1791 -1312 2635 6038 2407 505 -1417 -3320 -646 524 -5328 -6383 -6671 -838 4633 888
2365 888 955 6637 16464 16520 5633 621 2496 5346 951 -2812 -5073 -5132 3482 8280 4195 -4850
2349 -4850 -11631 -10135 -10644 -8611 -3173 -3566 -2820 -3584 -1087 -165 -2185 -1641 -1708 -1467 -3294 -3237 2321 3296
2331 3296 -675 -3855 -4306 -516 3808 2481 2484 1289 1836 2956 7194 5130 6110 8400 8364 10146 9392
2314 9392 4946 687 -2795 363 1820 210 2625 4396 387 -1279 -2964 -1450 3087 6890 3751
2299 3751 -1879 -874 33 -3215 -74 2376 3420 -839 -3440 -399 -3187 -7787 -6285 -4108 -3030
2284 -3030 -4850 -6908 -10 -789 -499 -1868 -874 1969 1854 -1003 -4036 -4726 -6647 -9168 -6432 -6085
2268 -6085 -1113 2734 4302 7725 14762 9837 5263 3202 9070 6937 -435 -942 5901 5420 4403
2253 4403 1104 4799 7315 6586 9065 2625 2335 6849 7387 5288 8787 6722 4907 572 -2448 -1141
2237 -1141 7365 10059 3762 262 3225 5857 -925 -1417 1971 6642 9114 5484 2043 -1288 -69
2222 -69 -6433 -11455 -1315 -903 1493 3237 1608 2476 2918 1660 -1693 -1085 -6163 -5923 1958 8465
2206 8465 1268 -1489 1540 659 -2130 -7923 -4794 -1994 528 -2128 -991 1771 3910 1514 94
2191 94 -4266 -5285 -3638 -3958 355 6889 6870 3032 243 2977 1285 817 215 -1613 -202 2919 2142
2174 2142 4143 7660 6471 4845 6367 5223 6353 10630 9896 3720 5524 6669 2770 9595 14259
2159 14259 9803 2377 2191 2627 2629 -2458 -3367 -2775 -3979 -1000 4978 4567 2797 1342 -439 -7726 -8842
2142 -8842 -7712 1999 3847 -2151 -12723 -15941 -10318 782 10470 565 -9365 -5147 3115 8998
2128 8998 9228 7825 998 2675 6164 8871 4636 4049 13559 9336 8494 6446 8831 9181 3765 2318
2112 2318 2123 3078 1743 3957 1464 -5301 -9422 -6885 -4590 -8547 -9651 -2896 1471 -2598 -2730 -1147
2096 -1147 -594 -2398 -1920 -5362 -6926 -3782 3404 7288 2629 5215 5519 4747 4817 5027 7639 1645 -1642
2079 -1642 -7056 -3396 4847 7799 2855 -5826 -5656 3390 5701 7734 10317 7997 6305 13342 15134
2064 15134 10181 912 -891 270 3227 716 -8744 -13576 -14200 -10901 -3350 -4661 -8285 -8884 -9691
2049 -9691 -8255 -10065 -15084 -6802 -1997 -8359 -8681 -5296 -6131 -8610 -9098 -5244 1885 1640 -941 -3792
2033 -3792 -10168 -8743 -5226 -5589 -2621 -2414 -188 1905 6010 3901 3411 -2232 -4461 -6791 -3811 -2517
2017 -2517 706 10624 13401 10809 4175 -2381 -1482 -3450 -5232 -1404 4998 6741 1776 -2085 -8036
2002 -8036 -9089 -7667 -210 3190 -1831 -5778 -12789 -13942 -10468 1594 7606 11431 9243 9119 9073
1987 9073 8347 3630 1776 -5257 -6461 -8256 -4849 -4214 -6923 -7627 -9080 -3119 -9116 -7930 2566
1972 2566 3791 5153 4249 -1904 -1871 554 930 -491 -5817 -3926 -1650 -328 2602 5987 -898 -2889
1956 -2889 -3360 -4047 277 3418 9073 7107 1039 -2832 -6764 -7503 -9100 -16462 -21477 -18941 -16862 -7056
1940 -7056 -10913 -10952 -6380 1974 1042 1746 3584 -535 4071 3919 1327 -4642 -1149 3735 4180 1713
1924 1713 6260 10743 7672 6671 8857 2970 1278 -817 2872 7757 2312 5582 13116 16835 15865
1909 15865 10320 7737 -892 -3664 -4531 -10883 -4861 1190 1079 -4024 -6072 -1681 330 -2102 -2137 405
1893 405 2419 5451 9027 6051 4133 381 7949 9854 4946 2481 4435 1920 -597 -918 -2637
1878 -2637 -3285 -1813 -4333 -5899 -6704 -5430 -4098 -8499 -8664 -5133 1294 7314 7383 65 -6238 -2682
1862 -2682 2645 2032 1249 4489 -5634 -18504 -17860 -7041 1500 3220 2134 -22 1367 5215 2593
1847 2593 3739 5477 8437 4062 -2308 -6204 -3083 876 3698 5995 6056 9709 6049 7717 7336 6654
1831 6654 -712 -6589 -10243 -4257 -1513 -3645 -2464 -2320 -2064 -4527 -7199 -4919 -7141 -5427 -2544
1816 -2544 756 3275 4290 5947 2063 -5464 -12911 -8581 -6002 -6797 -4426 -4817 -2271 -2310 -1621 1736
1800 1736 3765 870 13 3817 3429 5673 5029 2692 -1313 -2726 -3823 -4587 910 1446 -77 1651
1784 1651 5225 3997 -1548 -3562 4390 3950 3566 -1231 -6041 -234 3561 6781 5457 3776 2898 6757
1768 6757 8073 6381 3893 65 1181 -905 804 7441 734 -7719 -9431 -4107 6669 9019 2337
1753 2337 5271 6480 2919 8902 7157 2795 -77 4573 12374 10792 -279 -4031 -6493 -3010 -981
1738 -981 -7254 -5918 1836 1964 -9541 -12450 -8335 -5975 -4247 -3540 -388 -755 -633 -1508 -1170 -2723
1722 -2723 -7507 -8681 -3519 5449 4588 -3200 -1099 4736 3483 -3669 626 -2363 1038 4959 6107
1707 6107 6088 -288 -163 4339 829 2472 8700 7615 8310 8846 6866 3642 2755 -3719 991 7742
1691 7742 3042 5160 6437 1103 919 -6211 -7982 6191 15042 10980 6269 3537 3366 4258 3023
1676 3023 5510 4228 2216 -916 -1539 -425 3286 2174 4156 5600 -14 3362 -1425 -2036 2313
1661 2313 4734 635 4061 -1327 -2481 -2230 -3288 -4500 -5126 -704 -770 -2029 2610 9942 10537 8567
1645 8567 6137 4893 2370 -3537 -4510 -3102 -3070 168 -1358 1708 2975 1206 3121 -2690 -12361 -5718
1629 -5718 -3818 644 -1911 -861 1646 4210 -1061 -1571 -3603 -3549 -3323 -5244 -6096 426 3245 -2767
1613 -2767 -3878 -5233 -4624 1521 4391 4413 12802 9915 8888 6498 3378 -4861 -4332 3487 3327 -4020
1597 -4020 -6792 -4338 784 8561 8496 4820 3638 7240 3183 -439 -38 -5966 -12162 -13091 -9491 -2117
1581 -2117 -3077 -4799 -4515 -948 -962 4274 4392 -267 522 -1245 142 2433 -2656 -10429 -11928 -13806
1565 -13806 -12399 -6490 -2648 528 -4518 -2526 2864 614 -1719 1105 6978 3675 3130 5888 803
1550 803 3048 5177 8406 5812 2158 -2661 -1030 6063 10802 6599 2363 -247 -1665 -5870 -11739
1535 -11739 -7559 -1891 3197 1889 1724 1404 -3327 -2167 2493 3721 1181 -414 4741 13526 15842
1520 15842 11030 8797 6152 6478 8231 4565 4303 -991 -7295 -10305 -14324 -11417 -3874 -3821 -11119 -15888
1504 -15888 -14919 -10030 -8229 -5410 -6524 -9305 -6345 -4136 -7114 -6493 -7983 -7295 -1714 1443 549 2847
1488 2847 2933 -474 -2551 -730 6684 9947 8438 8005 6202 -4186 -6866 -148 2298 7390 8228 4064
1472 4064 -4772 -6572 -2099 -684 1577 2865 -476 174 -2767 -4104 -4932 1046 1531 3480 9089 7777
1456 7777 -1564 -3023 -2206 -8877 -10226 -10737 -7711 -6182 -1545 6425 14688 10792 4327 1214 -1332
1441 -1332 4079 8065 1005 -2021 -2017 -3237 -6133 149 2357 590 -259 1674 88 -4724 -7121 88
1425 88 6430 8281 5140 3420 651 -3634 -3880 -4403 -3313 -4076 -4339 -6391 -2211 -2229 -7078 -6194 -3924
1408 -3924 -1911 3430 3364 3028 1240 -2800 -2546 -8395 -9825 -9007 -5435 -4906 -4203 -1395 106 2416 8133
1391 8133 5799 10682 12223 8337 5552 6759 778 5 -1863 -4264 -8975 -8886 -6575 -8924 -7422 -3506
1375 -3506 -1694 1216 6783 10593 5854 3732 -2484 -3117 1944 8146 7855 6765 10777 12419 7146
1360 7146 4367 2537 -1603 5154 6031 296 2752 -957 -3841 1643 1207 1318 4114 -797 -4468 -6680
1344 -6680 -13772 -9901 2523 432 490 8373 3080 -436 -2170 -105 4350 1075 -2956 -5351 -4682
1329 -4682 -7712 -15511 -11719 -8515 -3789 -6311 -1773 2004 -1103 2254 4379 -1841 -2168 -3311 -1795
1314 -1795 -1238 -2943 2590 5179 -2306 -5119 -4435 -2311 -2295 1005 2828 5683 3172 1115 6764 11984
1298 11984 7045 5694 2191 -3122 845 7911 5795 2053 6168 5316 -723 -574 4811 3447 -1237
1283 -1237 -3610 -4747 -281 2605 -944 825 3291 2620 537 1454 356 385 709 646 -938 -6086 -7236
1266 -7236 -4485 -70 8394 6618 6740 5785 -2773 -4632 -468 -6396 -3526 2832 8305 8672 1564 -3927
1250 -3927 2946 12390 6471 3247 877 -4642 -7309 -6297 -3715 -1988 -2975 -699 1511 1483 -585 -1082
1234 -1082 2147 6781 6045 -4135 119 4585 3521 4499 5584 6117 8287 5707 6154 5272 10115 11780
1218 11780 9597 9147 1550 -902 3378 7387 3994 -686 -4962 -2280 -2373 -6196 -3026 -1070 -1574 -6553
1202 -6553 -7384 -1387 -997 -1204 5234 11742 10564 5271 2338 -2813 -3051 -199 1970 5952 5195 3782
1186 3782 4546 7433 9191 8719 4190 222 -2924 -1104 -2444 2733 6042 4648 5934 5771 6806 7249
1170 7249 7904 4261 1052 4601 3956 2892 -3542 -2198 828 2788 -984 -3199 -6156 -10139 -10357 -7056
1154 -7056 -7843 -10220 -8754 -4679 -1824 -6129 -4286 -1383 3881 3530 8930 5036 4256 8292 11577 7289
1138 7289 4141 583 -4131 -4341 -6755 -2898 1533 -1952 -3918 -9374 -13016 -13851 -11339 -8758 -6245
1123 -6245 2426 5212 5942 4438 1921 6274 3259 -2524 -2080 1209 1305 -562 -4162 -7358 -1789 -4594
$$ [...]
##END NTUPLES=NMR SPECTRUM
##END=
