##TITLE=Analysis number 308826
Compound Code nrb 01003
Book Reference 302/169
Project Code adrs
Chemist Name toml
##JCAMPDX= 6.0         $$ Bruker NMR JCAMP-DX V2.0
##DATA TYPE= NMR SPECTRUM
##DATA CLASS= NTUPLES
##ORIGIN= Bruker BioSpin GmbH
##OWNER= NMR
$$ XWIN-NMR		Version 3.5
$$ Wed May 25 14:33:27 2005 GMT Daylight Time (UT+1h)  MAYBRIDGE\NMR@NMR_250MHZ
##.OBSERVE FREQUENCY= 250.131544655141
##.OBSERVE NUCLEUS= ^1H
##.ACQUISITION MODE= SIMULTANEOUS (DQD)
##.ACQUISITION SCHEME= undefined
##.AVERAGES= 16
##.DIGITISER RES= 18
##SPECTROMETER/DATA SYSTEM= dpx250
##.PULSE SEQUENCE= zg30
##.SOLVENT NAME= DMSO
##.SHIFT REFERENCE= (INTERNAL, DMSO, 0, 16.522)
##AUDIT TRAIL= $$ (NUMBER, WHEN, WHO, WHERE, WHAT)
$$ ##TITLE= Audit trail, XWIN-NMR		Version 3.5
$$ ##JCAMPDX= 5.01
$$ ##ORIGIN= Bruker BioSpin GmbH
$$ ##OWNER= NMR
$$ C:\u/data/dgb/nmr/ADRS/3530/pdata/1/auditp.txt
$$ ##AUDIT TRAIL=  $$ (NUMBER, WHEN, WHO, WHERE, WHAT)
(   1,<2005-05-25 14:33:08.77 +100>,<MAYBRIDGE\NMR>,<NMR_250MHZ>,
      <created by zg, POWCHK disabled, PULCHK disabled
       configuration hash MD5:
       62 19 C7 07 E1 42 D1 B7 37 6C 3D D0 77 39 F9 E6
       data hash MD5: 64K
       CF D7 7F 11 6A DC B3 69 19 9A 30 E5 8F 72 0E 79>)
(   2,<2005-05-25 14:33:19.68 +100>,<MAYBRIDGE\NMR>,<NMR_250MHZ>,
      <Start of raw data processing
       ef LB = 0.3 FT_mod = 6 PKNL = 1 SI = 32K 
       data hash MD5: 32K
       AC DC 4B B4 29 32 7A A6 E9 0E 41 C9 80 24 85 B6>)
(   3,<2005-05-25 14:33:21.46 +100>,<MAYBRIDGE\NMR>,<NMR_250MHZ>,
      <apk 
       data hash MD5: 32K
       21 A4 4D ED C5 DA FC 41 59 0A D5 3A 1F FC C2 34>)
(   4,<2005-05-25 14:33:22.21 +100>,<MAYBRIDGE\NMR>,<NMR_250MHZ>,
      <abs ABSG = 5 
       data hash MD5: 32K
       ED A6 DB C6 DB B5 9E 62 56 6F 35 60 C0 A3 F6 0F>)
$$ ##END=
$$ 
$$ hash MD5
$$ E1 BA A1 E5 6D C7 F4 26 4B 2C B9 CD AD B7 FC D8
##$RELAX= 
##$RELAX= 
##$RELAX= 
##$RELAX= 
##$RELAX= 
##$RELAX= 
##$RELAX= 
$$ Bruker specific parameters
$$ --------------------------
##$DU= <C:\u>
##$EXPNO= 3530
##$NAME= <ADRS>
##$PROCNO= 1
##$TYPE= <nmr>
##$USER= <dgb>
##$AMP= (0..31)
100 100 100 100 100 100 100 100 100 100 100 100 100 100 100 100 100 100 
100 100 100 100 100 100 100 100 100 100 100 100 100 100 
##$AQSEQ= 0
##$AQ_mod= 3
##$AUNM= <au_zg>
##$AUTOPOS= <43 >
##$BF1= 250.13
##$BF2= 250.13
##$BF3= 250.13
##$BF4= 250.13
##$BF5= 500.13
##$BF6= 500.13
##$BF7= 500.13
##$BF8= 500.13
##$BYTORDA= 1
##$CFDGTYP= 0
##$CFRGTYP= 5
##$CHEMSTR= <none>
##$CNST= (0..31)
1 1 145 1 1 1 1 1 1 1 1 1 1 1 1 1 1 1 1 1 1 1 1 1 1 1 1 1 1 1 1 1 
##$CPDPRG= <>
##$CPDPRG1= <>
##$CPDPRG2= <>
##$CPDPRG3= <>
##$CPDPRG4= <mlev>
##$CPDPRG5= <mlev>
##$CPDPRG6= <mlev>
##$CPDPRG7= <mlev>
##$CPDPRG8= <mlev>
##$CPDPRGB= <>
##$CPDPRGT= <>
##$D= (0..31)
0 1 0 0 0 0 0 0 0 0.06 0 0 0 0 0 0 0.0002 0 0 0 0 0 0 0 0 0 0 0 0 0 0 
0 
##$DATE= 1117027987
##$DBL= (0..7)
120 120 120 120 120 120 120 120 
##$DBP= (0..7)
150 150 150 150 150 150 150 150 
##$DBP07= 0
##$DBPNAM0= <>
##$DBPNAM1= <>
$$ [...]
##$SUBNAM7= <"">
##$SUBNAM8= <"">
##$SUBNAM9= <"">
##$SW= 20.6930455092707
##$SWIBOX= (0..15)
0 0 3 0 0 0 0 0 0 0 0 0 0 0 0 0 
##$SW_h= 5175.983436853
##$TD= 65536
##$TD0= 1
##$TE= 295.16
##$TE2= 300
##$TE3= 300
##$TEG= 300
##$TL= (0..7)
0 120 120 120 120 120 120 120 
##$TP= (0..7)
150 150 150 150 150 150 150 150 
##$TP07= 0
##$TPNAME0= <>
##$TPNAME1= <>
##$TPNAME2= <>
##$TPNAME3= <>
##$TPNAME4= <>
##$TPNAME5= <>
##$TPNAME6= <>
##$TPNAME7= <>
##$TPOAL= (0..7)
0.5 0.5 0.5 0.5 0.5 0.5 0.5 0.5 
##$TPOFFS= (0..7)
0 0 0 0 0 0 0 0 
##$TUNHIN= 0
##$TUNHOUT= 0
##$TUNXOUT= 0
##$USERA1= <user>
##$USERA2= <user>
##$USERA3= <user>
##$USERA4= <user>
##$USERA5= <user>
##$V9= 5
##$VALIST= <valist>
##$VCLIST= <CCCCCCCCCCCCCCC>
##$VD= 0
##$VDLIST= <DDDDDDDDDDDDDDD>
##$VPLIST= <PPPPPPPPPPPPPPP>
##$VTLIST= <TTTTTTTTTTTTTTT>
##$WBST= 1024
##$WBSW= 4
##$XGAIN= (0..3)
0 0 0 0 
##$XL= 0
##$YL= 0
##$YMAX_a= 411016
##$YMIN_a= -489601
##$ZGOPTNS= <>
##$ZL1= 120
##$ZL2= 120
##$ZL3= 120
##$ZL4= 120
##$ABSF1= 16.522
##$ABSF2= -4.171173
##$ABSG= 5
##$ABSL= 3
##$ALPHA= 0
##$AQORDER= 0
##$ASSFAC= 0
##$ASSFACI= 0
##$ASSFACX= 0
##$ASSWID= 0
##$AUNMP= <proc_1d>
##$AZFE= 0.1
##$AZFW= 0.1
##$BCFW= 0
##$BC_mod= 0
##$BYTORDP= 0
##$COROFFS= 0
##$CY= 12.5
##$DATMOD= 1
##$DC= 0
##$DFILT= <>
##$DTYPP= 0
##$F1P= 14.0000005364418
##$F2P= -0.99999901652339
##$FCOR= 0.5
##$FTSIZE= 32768
##$FT_mod= 6
##$GAMMA= 0
##$GB= 0
##$INTBC= 1
##$INTSCL= 1
##$ISEN= 128
##$LB= 0.3
##$LEV0= 0
##$LPBIN= 0
##$MAXI= 10000
##$MC2= 0
##$MEAN= 0
##$ME_mod= 0
##$MI= 0
##$NCOEF= 0
##$NC_proc= -4
##$NLEV= 6
##$NOISF1= 0
##$NOISF2= 0
##$NSP= 0
##$NTH_PI= 0
##$NZP= 0
##$OFFSET= 16.522
##$PC= 1
##$PHC0= -84.20512
##$PHC1= 5.861403
##$PH_mod= 1
##$PKNL= yes
##$PPARMOD= 0
##$PSCAL= 4
##$PSIGN= 0
##$REVERSE= no
##$SF= 250.13
##$SI= 32768
##$SIGF1= 0
##$SIGF2= 0
##$SINO= 400
##$SIOLD= 32768
##$SREGLST= <1H.DMSO>
##$SSB= 0
##$STSI= 32768
##$STSR= 0
##$SW_p= 5175.98343685301
##$SYMM= 0
##$S_DEV= 0
##$TDeff= 65536
##$TDoff= 0
##$TI= <Analysis number 999999
Compound Code 99
Book Reference 9
Project Code 9>
##$TILT= no
##$TM1= 0
##$TM2= 0
##$TOPLEV= 0
##$USERP1= <user>
##$USERP2= <user>
##$USERP3= <user>
##$USERP4= <user>
##$USERP5= <user>
##$WDW= 1
##$XDIM= 32768
##$YMAX_p= 315614793
##$YMIN_p= -223608
$$ End of Bruker specific parameters
$$ ---------------------------------
##NTUPLES= NMR SPECTRUM
##VAR_NAME=  FREQUENCY,     SPECTRUM/REAL,   SPECTRUM/IMAG
##SYMBOL=    X,             R,               I
##VAR_TYPE=  INDEPENDENT,   DEPENDENT,       DEPENDENT
##VAR_FORM=  AFFN,          ASDF,            ASDF
##VAR_DIM=   32768,         32768,           32768
##UNITS=     HZ,            ARBITRARY UNITS, ARBITRARY UNITS
##FACTOR=    0.157963299565203, 1,           1
##FIRST=     4132.6476996994, 0,             0
##LAST=      -1043.33573715361, 0,           0
##MIN=       -1043.33573715361, -223608,     0
##MAX=       4132.6476996994, 315614793,     0
$$ Real data points
##PAGE= N=1
##DATA TABLE= (X++(R..R)), XYDATA
$$ [...]
$$ plain form
22596 -6326 15824 -1367 -43311 -41450 -50354 -23802 -34565 -27440 -51968 -53118 -17825 -23506 -37625
22583 -37625 -36013 -23903 -16962 1073 39202 49376 53984 15300 36848 21562 14729 -3438
22571 -3438 -26813 -51047 -49286 -28438 -34124 -45174 20041 61980 39555 19544 11519 26482
22559 26482 7131 64172 99612 56301 57836 22948 23791 -27012 -49212 -11429 9169 -41126
22547 -41126 -73729 -20062 -30247 -16770 -2706 29666 57165 73411 65467 15112 2370 -4241
22535 -4241 -23583 10623 12012 23579 65284 56598 16304 -5113 811 -22481 -24333 -24232 32728
22522 32728 65227 47961 7185 -34027 20330 112508 122395 88962 41182 44496 -23328 8849
22510 8849 25255 17633 31070 -13752 -105944 -105063 -68856 -64909 -46055 6271 -27052 -62176 40459
$$ packed form
22596f326K2150j7191m1944J861q904K6552j0763P125k4528j150L5293n681j4119
22583c7625J612J2110O941J8035L8129J0174M608l8684K1548j5286o833j8167
22571c438k3375k4234J761K0848n686j1050O5215M1939k2425k0011q025J4963
22559B6482j9351N7041L5440m3311J535l4888Q43n0803k2200L7783K0598n0295
22547d1126l2603N3667j0185J3477J4064L2372K7499J6246p944n0355j2742o611
22535d241j9342L4206J389J1567M1705q686m0294k1417N924k3292j852J01N6960
22522C2728L2499j7266m0776m1212N4357R2178R887l3433m7780L314o7824L2177
22510H849J6406p622J3437m4822r2192Q81L6207L947J8854N2326l3323l5124J02635
$$ plain form
22497 40459 26176 26000 -5772 -41691 -68037 -56371 -54454 -21248 -41648 -33368 -14797 -68196
22485 -68196 -70020 -55379 -51045 15952 42172 85972 81800 32183 28238 56117 27631 -7766
22473 -7766 -24936 -13522 -84934 -97600 -53680 -64595 -18269 -24179 -43566 -17463 71241 70150
22461 70150 -11001 -13145 -37376 -82459 -84186 -99853 -75087 -40304 -79931 -62940 -35994 -38307
22449 -38307 -66379 -61894 16879 18744 -22432 -68872 -69439 -46296 -79999 -124019 -76180 -85585 -95937
22436 -95937 -34146 6535 -21238 -6332 -948 -14928 925 36479 119010 102474 14252 -122997
22424 -122997 -134754 -55025 -17323 -42900 -58065 -14149 310 -2746 -8347 -24048 94 -30596
22412 -30596 -34367 1939 -24461 -32024 -64594 -55785 39264 31623 9365 10747 -12442 -49815 -97927
$$ packed form
22497D0459j4283j76l1772l5919k6346J1666J917L3206k0400Q280J8571n3399
22485f8196j824J4641M334O6997K6220M3800m172m9617l945K7879k8486l5397
22473g766j7170J1414p1412j2666M3920j0915M6326n910j9387K6103Q8704j091
22461G0150q1151k144k4231m5083j727j5667K4766L4783l9627J6991K6946k313
22449c8307k8072M485P8773J865m1176m6440n67K3143l3703m4020M7839r405j0352
22436i5937O1791M0681k7773J4906N384j3980J5853L5554Q2531j6536q8222j37249
22424a22997j1757P9729L7702k5577j5165M3916J4459l056n601j5701K4142l0690
22412c0596l771L6306k6400p563l2570Q809R5049p641k2258J382k3189l7373m8112
$$ plain form
22399 -97927 -55265 28178 -20490 -89999 -88399 -67081 -76112 -83707 -69684 -25304 -14697 -69549
22387 -69549 -132660 -69488 -4801 -13859 -28505 -14725 -57166 -49632 -12112 -757 28394 34586
22375 34586 -35036 -32971 -26240 6946 42092 53197 15276 31606 63233 38844 12497 5008
22363 5008 -7479 -13047 12376 36392 18327 5703 -20747 -38724 2602 64132 2149 -62207
22351 -62207 -100145 -24582 12326 -7655 35616 17565 -5561 16116 21955 39674 51450 14853
22339 14853 3951 4731 -21846 -44319 -31305 5911 36467 30409 -5403 -28025 -17850 -32953
22327 -32953 -31448 -4269 -12796 -7467 34286 22618 20687 -3989 -34877 -22296 1890 -32825
22315 -32825 -58561 -35648 49032 79984 7934 -85861 -111915 -124519 -81520 -33335 -11667 28724
$$ packed form
22399i7927M2662Q3443m8668o9509J600K1318r031p595J4023M4380J0607n4852
22387f9549o3111O3172O4687r058j4646J3780m2441P534L7520J1355K9151O192
22375C4586o9622K065O731L3186L5146J1105l7921J6330L1627k4389k6347p489
22363E008j2487n568K5423K4016j8065j2624k6450j7977M1326O1530o1983o4356
22351f2207l7938P5563L6908j9981M3271j8051k3126K1677N839J7719J1776l6597
22339A4853j0902P80k6577k2473J3014L7216L0556o058l5812k2622J0175j5103
22327c2953J505K7179q527N329M1753j1668j931k4676l0888J2581K4186l4715
22315c2825k5736K2913Q4680L0952p2050r3795k6054j2604M2999M8185K1668M0391
$$ plain form
22303 28724 18105 5863 32480 28708 28949 57824 59791 -30399 -37330 -30631 9744 32844 -37374
22290 -37374 -56794 -32089 19779 50858 41519 15514 53155 64940 113601 101879 38596 -24322
22278 -24322 -22704 -28990 -60553 -85874 -59692 -92449 -56958 -14622 -3143 -3289 24988 -24747
22266 -24747 -13290 9358 -22090 -58846 -71734 -60491 -31159 -37566 -65086 -76337 -47790 34466
22254 34466 42361 9374 8996 6906 -25664 -116968 -140933 -76709 -22809 -53798 -107227 -119329
22242 -119329 -159701 -163541 -115084 -124058 -142150 -120567 -42309 -12311 -24171 -67487 -104165 -112364
22230 -112364 -144464 -81383 -55623 -64723 -89221 -128226 -74756 -9404 -25086 -44493 -21889 -40967
22218 -40967 -41121 -47040 -48290 11244 55287 8934 1470 5676 38386 75464 72827 39093 44537
$$ packed form
22303B8724j0619j2242K6617l772K41K8875J967r0190o931O699M0375K3100p0218
22290c7374j9420K4705N1868L1079r339k6005L7641J1785M8661j1722o3283o2918
22278b4322J618o286l1563k5321K6182l2757L5491M2336J1479j46K8277m9735
22266b4747J1457K2648l1448l6756j2888J1243K9332o407k7520j1251K8547Q2256
22254C4466P895l2987l78k090l2570r1304k3965O4224N3900l0989n3429j2102
22242a19329m0372l840M8457q974j8092K1583P8258K9998j1860m3316l6678q199
22230a12364l2100O3081K5760r100k4498l9005N3470O5352j5682j9407K2604j9078
22218d0967j54n919j250N9534M4043m6353p464M206L2710L7078k637l3734N444
$$ plain form
22205 44537 10948 -50260 -29713 -23254 -12570 4309 63651 89162 56883 21215 22064 52929
22193 52929 33522 -32730 -121110 -109782 -112323 -65322 -65414 -68002 -37661 51131 26839 12036 9605
22180 9605 56338 30300 42211 57204 44414 74252 26356 -34554 -42651 -31864 -18289 -28307
22168 -28307 -67177 -80416 -74482 4986 82086 58540 -20569 -72740 33076 67375 22603 -33841
22156 -33841 -13146 -4910 -79909 -80648 -64120 -25490 -27384 -21736 19572 60 -27363 -51850 -19132
22143 -19132 -19742 -87046 -93682 -63801 49589 89459 37254 36038 51072 10082 6108 61734
22131 61734 92034 93146 11968 6111 -39528 -56038 -29394 -64029 -144434 -126518 -153493 -125421
22119 -125421 -88775 -119043 -97035 -31373 -50789 -62145 -5454 9227 -45540 -62233 -87826
$$ packed form
22205D4537l3589o1208K0547O459J0684J6879N9342K5511l2279l5668Q49L0865
22193E2929j9407o6252q8380J1328k541M7001r2k588L0341Q8792k4292j4803k431
22180I605M6733k6038J1911J4993j2790K9838m7896o0910q097J0787J3575j0018
22168b8307l8870j3239N934P9468P7100k3546p9109n2171J05816L4299m4772n6444
22156c3841K0695Q236p4999p39J6528L8630j894N648M1308j9512k7423k4487L2718
22143a9132o10o7304o636K9881J13390L9870n2205j216J5034m0990l974N5626
22131F1734L0300J112q1178n857m5639j6510K6644l4635q0405J7916k6975K8072
22119a25421L6646l0268K2008O5662j9416j1356N6691J4681n4767j6693k5593
$$ plain form
22108 -87826 -111478 -103705 -110580 -107080 -82918 -60852 -36520 -15042 -15209 -10839 -7559 -26498 -19271
22095 -19271 50376 78142 20302 14956 42740 78927 93414 78780 22212 40355 18404 -56541
22083 -56541 -30919 21621 77365 79033 92992 61955 55514 20472 2474 17246 -20939 -47533
22071 -47533 -34934 -24082 12568 62191 27183 -2710 -35545 -84396 -87375 -101628 -33654 24429
22059 24429 12365 8001 23755 21678 55761 53718 18937 -1762 -17187 21478 26554 -29127
22047 -29127 -30618 11931 52133 31858 13041 14587 -18269 4711 27784 27430 2767 -7021 -19527
22034 -19527 -29297 -41777 -54551 23593 60841 5167 -1579 -3088 -6780 -10950 -32953 -34635 -37674
22021 -37674 -34509 -20138 -7472 -4908 -21298 -66306 -47568 37318 54884 48756 14477 -34528
$$ packed form
22108h7826k3652P773o875L500K4162K2066K4332K1478j67M370L280j8939P227
22095a9271O9647K7766n7840n346K7784L6187J4487j4634n6568J8143k1951p4945
22083e6541K5622N2540N5744J668J3959l1037o441l5042j7998J4772l8185k6594
22071d7533J2599J0852L6650M9623l5008k9893l2835m8851k979j4253O7974N8083
22059B4429j2064m364J5754k077L4083k043l4781k0699j5425L8665N076n5681
22047b9127j491M2549M0202k0275j8817J546l2856K2980K3073l54k4663r788j2506
22034a9527r770j2480j2774P8144L7248n5674o746j509l692m170k2003j682l039
22021c7674L165J4371J2666K564j6390m5008J8738Q4886J7566o128l4279m9005
$$ plain form
22009 -34528 -51974 -35509 -4393 -4036 10292 31319 47087 41579 36193 23153 -4861 -17526
21997 -17526 1415 -1538 65464 68317 86479 142926 143540 89909 96546 108760 59629 43522 -4594
21984 -4594 -66449 -7962 42304 55421 100204 85175 52555 48997 1887 -45524 -67802 -48668
21972 -48668 -31303 -44673 -55394 -64048 -110326 -71912 -92748 -92611 -43847 22874 66976 55994
21960 55994 89671 108650 16028 -11730 268 27089 -6061 -88449 -94597 -77880 -67745 -24725
21948 -24725 -36773 -88092 -110234 -87248 -46544 -52466 15973 45868 48430 85804 82500 73353
21936 73353 77350 9807 4078 -9433 -52670 -72416 -37721 -9654 18820 -22110 -25630 -63343
21924 -63343 -100968 -110636 -116099 -73397 34505 50217 42102 -16010 -54501 -30748 5730 1710
$$ packed form
22009c4528j7446J6465L1116L57J4328K1027J5768n508n386j3040k8014j2665
21997a7526J8941k953O7002K853J8162N6447O14n3631O637J2214m9131j6107m8116
21984d594o1855N8487N0266J3117M4783j5029l2620l558m7110m7411k2278J9134
21972d8668J7365j3370j0721q654m6278L8414k0836J37M8764O6721M4102j0982
21960E5994L3677J8979r2622k7758J1998K6821l3150q2388o148J6717J0135M3020
21948b4725j2048n1319k2142K2986M0704n922O8439K9895K562L7374l304r147
21936G3353L997o7543n729j3511m3237j9746L4695K8067K8474m0930l520l7713
21924f3343l7625r668n463M2702J07902J5712q115n8112l8491K3753L6478m020
$$ plain form
21912 1710 -48944 -92307 -92371 -49123 -39206 -76837 -42736 -50473 -65173 -60174 -10032 12162 50268
21899 50268 56384 23195 -72827 -96688 -58967 -70691 -66677 -48603 36750 36643 -50687 -70865
21887 -70865 -62802 -13307 29015 19291 -14011 -506 19255 9385 -17434 -47862 -61740 -123005
21875 -123005 -148333 -109196 -54444 -56935 -107817 -119962 -88383 -92836 -109383 -70427 2369 44176
21863 44176 31425 5227 12237 -24846 -33680 -29743 -8344 -75428 -77004 -14185 20068 -1475
21851 -1475 -29109 -41230 -43254 15073 48489 -41516 -120453 -124663 -87890 -30506 84828 99152
21839 99152 46548 47330 43732 36058 -6966 -18842 4424 -7410 -13163 26216 7602 21264 -26640
21826 -26640 -83455 -84770 -12280 60933 52558 -3133 18867 -7928 26145 5184 -19514 34345
$$ packed form
21912A710n0654m3363o4M3248R917l7631L4101p737j4700M999N0142K2194L8106
21899E0268O116l3189r6022k3861L7721j1724M014J8074Q5353j07q7330k0178
21887g0865Q063M9495M2322r724l3302J3505J9761r870k6819l0428j3878o1265
21875a23005k5328L9137N4752k491n0882j2145L1579m453j6547L8956P2796M1807
21863D4176j2751k6198P010l7083q834L937K1399o7084j576O2819L4253k1543
21851a475k7634j2121k024N8327L3416r0005p8937m210L6773N7384J15334J4324
21839I9152n2604P82l598p674m3024j1876K3266j1834n753L9379j8614J3662m7904
21826b6640n6815j315P2490P3213q375n5691K2000k6795L4073k0961k4698N3859
$$ plain form
21814 34345 83745 48829 10722 -39712 -98319 -119834 -68554 -58325 -90982 -82160 7105 16478
21802 16478 -8419 -28812 -53084 -56125 -45626 -73279 -98341 -69045 -59850 -35561 -21040 -17760
21790 -17760 -29916 -37827 -10838 -12226 -9775 -30616 -45885 -73346 -60806 -31722 928 -32717
21778 -32717 -23208 -5384 23469 82332 53775 -7786 -38870 -85712 -151335 -175250 -114328 -9378
21766 -9378 -8791 -44573 -38104 -45946 -81760 -125344 -139974 -99679 -48380 -76762 -31781 22739 4156
21753 4156 -17423 -17052 -39874 -25696 -6018 -42218 -83390 -75589 -74298 -9235 -39131 -71805 -92301
21740 -92301 -57609 -15107 -8504 -34032 -39347 17892 -221 -58461 -68823 -49720 -35378 -15090
21728 -15090 27288 8034 18224 50582 44745 17385 39307 69949 71245 72359 95577 70408
$$ packed form
21814C4345M9400l4916l8107n0434n8607k1515N1280J0229l2657Q822Q9265R373
21802A6478k4897k0393k4272l041J0499k7653k5062K9296R195K4289J4521L280
21790a7760j2156p911K6989j388K451k0841j5269k7461J2540K9084L2650l3645
21778c2717R509J7824K8853N8863k8557o1561l1084m6842o5623k3915O0922J04950
21766i378N87l5782O469p842l5814m3584j4630M0295N1299k8382M4981N4520j8583
21753D156k1579L71k2822J4178J9678l6200m1172P801J291O5063k9896l2674k0496
21740i2301L4692M2502O603k5528n315N7239j8113n8240j0362J9103J4342K0288
21728a5090M2378j9254J0190L2358n837k7360K1922L0642J296J114K3218k5169
$$ plain form
21716 70408 68229 62606 438 -67991 -42052 -27768 -60811 -72552 -53788 -19569 -1772 14122
21704 14122 71338 76090 10953 -43020 -38285 -87490 -87273 -30007 -13358 -24360 -32630 17948 5432
21691 5432 -7430 4808 39067 78311 -23014 -70385 -77598 -93868 -48177 -5291 -17472 46800
21679 46800 78502 -17943 -57325 -5891 51446 55508 25374 -15114 -39394 21525 59235 68480
21667 68480 10581 -31884 -50891 -67066 -84295 -85251 -35727 24799 30203 48573 73547 85335
21655 85335 71217 47332 14847 80838 129693 82522 7662 -51782 -27561 -42326 -85881 -75899
21643 -75899 -50294 -57565 -35535 -31283 -65057 -97740 -81893 -99877 -70125 -50145 -37675 -75092
21631 -75092 -99205 -44261 5749 -24652 -22381 -31121 -61153 -20389 -20495 -52655 -57539 -29247 -10654
$$ packed form
21716G0408k179n623o2168o8429K5939J4284l3043j1741J8764L4219J7797J5894
21704A4122N7216M752o5137n3973M735m9205K17N7266J6649j1002q270N0578j2516
21691E432j2862J2238L4259L9244j01325m7371p213j6270M5691M2886j2181O4272
21679D6800L1702r6445l9382N1434N7337M062l0134m0488k4280O0919L7710R245
21667F8480n7899m2465j9007j6175j7229r56M9524O0526N404J8370K4974J1788
21655H5335j4118k3885l2485O5991M8855m7171p4860n9444K4221j4765m3555R982
21643g5899K5605p271K2030M252l3774l2683J5847j7984K9752J9980J2470l7417
21631g5092k4113N4944N0010l0401K271q740l0032M0764j06l2160m884K8292J8593
$$ plain form
21618 -10654 -38864 -27585 53921 32419 9325 -27008 -21674 -282 -24345 -55342 -91649 -72376
21606 -72376 -2691 53763 7038 -852 -23933 -80848 -77333 -56233 -31434 -4647 -19560 -1315
21594 -1315 -28423 -43854 -40544 -19326 21358 23533 34431 51431 15353 -26200 56358 81791
21582 81791 30210 -4449 -26280 -22769 34122 43137 29188 23703 32644 74496 55367 -1491
21570 -1491 -23585 -64964 -79643 -96012 -92056 -40446 -33791 -22054 -8659 11193 30401 43031
21558 43031 57612 37460 24802 38219 36844 59437 22275 -40407 -59893 -29011 27250 -4347
21546 -4347 -59746 -94223 -64737 -35632 -2778 -23549 9135 18766 30347 62298 26759 10087
21534 10087 29123 11536 -1465 -66547 -51790 5042 25795 12675 -63545 -74810 -56663 -11439
$$ packed form
21618a0654k8210J1279Q1506k1502k3094l6333N334K1392k4063l0997l6307J9273
21606g2376O9685N6454m6725p890k3081n6915L515K1100K4799K6787j4913J8245
21594a315k7108j5431L310K1218M0684K175J0898J7000l6078m1553Q2558K5433
21582H1791n1581l4659k1831L511N6891R015j3949n485Q941M1852j9129n6858
21570a491k2094m1379j4679j6369L956N1610O655J1737J3395J9852J9208J2630
21558D3031J4581k0152j2658J3417j375K2593l7162o2682j9486L0882N6261l1597
21546d347n5399l4477K9486K9105L2854k0771L2684R631J1581L1951l5539j6672
21534A0087J9036j7587j3001o5082J4757N6832K0753j3120p6220j1265J8147M5224
$$ plain form
21522 -11439 -49045 -90246 -139037 -104462 -73094 -83238 -43610 -27315 -19049 -27379 -69404 -64266
21510 -64266 -57575 -86036 -88396 -83155 -80399 -115078 -116732 -37998 27559 45008 69442 28272 -31430
21497 -31430 -50325 -15832 46207 1961 -32216 -79691 -118500 -70966 -17764 -67370 -110815 -96060
21485 -96060 -65566 8701 -30281 -100279 -87965 -89349 -95187 -127747 -71812 -57817 -36644 -4673
21473 -4673 -1557 -50287 -56589 -43256 -36263 17930 31421 2021 27602 106754 61509 -33756
21461 -33756 -20475 -6163 9874 24169 -26566 -24938 -38813 -49027 -40309 -105542 -124829 -79354
21449 -79354 -77581 -86262 -92993 -39427 -51558 -78492 -93281 -91054 -95722 -104817 -144559 -145699 -109126
21436 -109126 -73576 -75619 -119268 -52031 -36812 -29537 6470 -19463 -40075 -26077 -1971 -23684
$$ packed form
21522a1439l7606m1201m8791L4575L1368j0144L9628J6295Q266q330m2025N138
21510f4266O691k8461k360N241K756l4679j654P8734O5557J7449K4434m1170n9702
21497c1430j8895L4493O2039m4246l4177m7475l8809M7534N3202m9606m3445J4755
21485i6060L0494P4267l8982o9998J2314j384n838l2560N5935J3995K1173L1971
21473d673L116m8730o302J3333O993N4193J3491k9400K5581P9152m5245r5265
21461c3756J3281J4312J6037J4295n0735J628j3875j0214Q718o5233j9287M5475
21449g9354J773q681o731N3566j2131k6934j4789K227m668r095l9742j140L6573
21436a09126L5550k043m3649O7237J5219P275L6007k5933k0612J3998K4106k1713
$$ plain form
21424 -23684 -16454 2385 23806 19844 -25514 -3993 32028 -43175 -63750 -81266 -62314 21551
21412 21551 65482 76974 46957 -18740 -23690 -2177 -25777 -66082 -56646 -23988 -8890 30055
21400 30055 47115 16429 -8877 -14015 -34329 18816 43107 35335 9142 31245 120094 126504
21388 126504 86814 78720 76453 16035 -33331 -33198 16854 -3376 -38967 -100185 -93771 -61704
21376 -61704 44263 101382 113605 78961 65872 55291 64335 95215 63294 86189 88993 82300
21364 82300 67302 7275 -47177 -63522 -56573 -50740 -50670 -16092 13724 11134 -7864 -2558 613
21351 613 13309 -11291 -7261 50500 90803 33737 3938 41237 59585 42535 1886 34586
21339 34586 -26754 -97381 -107650 -101146 -54722 -7547 25169 -72158 -127615 -104804 -68128 -131642
$$ packed form
21424b3684P230J8839K1421l962m5358K1521L6021p5203k0575j7516J8952Q3865
21412B1551M3931J1492l0017o5697m950K1513k3600m0305R436L2658J5098L8945
21400C0055J7060l0686k5306n138k0314N3145K4291p772k6193K2103Q8849O410
21388A26504l9690q094k267o0418m9366J33N0052k0230l5591o1218O414L2067
21376f1704J05967N7119J2223l4644j3089j0581R044L0880l1921K2895K804o693
21364H2300j4998o0027n4452j6345O949N833P0L4578K9816k590j8998N306L171
21351F13J2696k4600M030N7761M0303n7066k9799L7299J8348j7050m0649L2700
21339C4586o1340p0627j0269O504M6424M7175L2716r7327n5457K2811L6676o3514
$$ plain form
21327 -131642 -169548 -123754 -24699 5767 -14424 -58994 -133932 -132019 -97848 -91678 -21671 19135
21315 19135 18557 56258 41725 12267 42964 36275 -4259 -23784 7830 22344 22308 -38331 -53185
21302 -53185 -6594 46907 8310 39115 69488 81091 112103 76727 34207 -13344 3906 -6601
21290 -6601 17706 60337 27426 3391 44275 21886 29373 -18706 -71136 -68872 -100695 -107705
21278 -107705 -67802 -34961 -25836 -40742 -83768 -66046 -20114 -21848 -47278 -34116 -29240 16736
21266 16736 37777 -34578 -50380 -25921 -4613 -20298 26142 51017 3 -18561 -80392 -147591
21254 -147591 -123023 -74370 -14066 34715 67075 43302 65392 37186 -5862 -6633 7 11895
21242 11895 5514 39978 12022 -40819 -40525 -36705 -9334 -28862 -77643 -113018 -83477 -50142
$$ packed form
21327a31642l7906M5794R9055L0466k0191m4570p4938J913L4171O170P0007M0806
21315A9135n78L7701j4533k9458L0697o689m0534j9525L1614J4514l6o0639j4854
21302e3185M6591N3501l8597L0805L0373J1603L1012l5376m2520m7551J7250j0507
21290f601K4307M2631l2911k4035M0884k2389P487m8079n2430K264l1823p010
21278a07705L9903L2841R125j4906m3026J7722M5932j734k5430J3162M876M5976
21266A6736K1041p2355j5802K4459K1308j5685M6440K4875n1014j8564o1831o7199
21254a47591K4568M8653O0304M8781L2360k3773K2090k8206m3048p71O640J1888
21242A1895o381L4464k7956n2841K94L820K7371j9528m8781l5375K9541L3335
$$ plain form
21230 -50142 -89093 -58122 -13324 -43728 -41434 -29398 -58679 -72565 -34269 -33898 -59064 -92236
21218 -92236 -49624 19456 75390 59967 43511 25608 29797 -17901 -89769 -65992 7221 35181
21206 35181 8428 62294 85721 31702 -35884 -58435 -5712 8886 20692 -12455 -96870 -84460
21194 -84460 -37131 -3128 34897 35465 3433 37270 46277 22433 10410 -10098 -5284 -10384 -10104
21181 -10104 -42842 -12758 35813 35108 -13291 -7612 14053 -3305 -82229 -59218 -50553 -63221
21169 -63221 -65706 -74618 -78879 -111699 -129473 -149762 -155687 -117248 -97709 -55707 -10711 -5175 18748
21156 18748 -13894 -3732 -25672 -102300 -62648 -27534 43224 54686 158 -35588 -73611 -81569
21144 -81569 -82532 -98242 -76503 -110718 -86237 -13334 3568 -671 14169 -35097 -98267 -101369
$$ packed form
21230e0142l8951L0971M4798l0404K294J2036k9281j3886L8296L71k5166l3172
21218i2236M2612O9080N5934j5423j6456j7903M189m7698p1868K3777P3213K7960
21206C5181k6753N3866K3427n4019o7586k2551N2723J4598J1806l3147q4415J2410
21194h4460M7329L4003L8025N68l2032L3837R007k3844j2023k0508M814n100K80
21181a0104l2738L0084M8571p05m8399N679K1665j7358p8924K3011Q665j2668
21169f3221k485q912m261l2820j7774k0289n925L8439J9539M2002M4996N536K3923
21156A8748l2642J0162k1940p6628L9652L5114P0758J1462n4528l5746l8023p958
21144h1569r63j5710K1739l4215K4481P2903J6902m239J4840m9266o3170l102
$$ plain form
21132 -101369 -25799 -35985 -28787 -28423 -33066 -14671 -5397 -86850 -97397 -28641 27568 -32478
21120 -32478 -54418 -55778 -35468 77785 28859 34158 34001 52346 42604 56300 64086 6202 -5077
21107 -5077 -60365 -86504 -36184 -8258 30792 38671 4543 -5726 -37798 -79978 -51601 -31968
21095 -31968 -36498 -24004 -537 -13439 -21872 -39254 -74849 -5729 26295 50397 4545 1154
21083 1154 20385 76904 35925 -36454 -81893 -95159 -120852 -118918 -77921 -95938 -58862 -23386
21071 -23386 25203 74153 55638 51812 15848 -26697 -25590 -17514 -49455 -78997 -35138 -19457
21059 -19457 -9156 -28653 -92419 -101314 -98373 -80830 -40158 -42500 28645 14084 5829 -8908
21047 -8908 670 -34713 -46766 -2527 2967 35696 7864 -30661 -41508 -87611 -92157 -79347
$$ packed form
21132a01369P5570j0186P198L64m643J8395R274q1453j0547O8756N6209o0046
21120c2478k1940j360K0310J13253m8926N299j57J8345r742J3696P786n7884j1279
21107e077n5288k6139N0320K7926L9050P879l4128j0269l2072m2180K8377J9633
21095c1968m530J2494K3467j2902q433j7382l5595O9120L2024K4102m5852l391
21083A154J9231N6519m0979p2379m5439j3266k5693J934M0997j8017L7076L5476
21071b3386M8589M8950j8515l826l5964m2545J107Q076l1941k9542M3859J5681
21059a9457J0301j9497o3766q895K941J7543M0672k342P1145j4561q255j4737
21047h908R578l5383j2053M4239N494L2729k7832l8525j0847m6103m546J2810
$$ plain form
21035 -79347 -74999 -98837 -88934 -71908 -89499 -109474 -109569 -136119 -113706 -102421 -70060 -14612 -23472
21022 -23472 -16346 -84151 -125250 -96279 -27129 4741 4918 -10262 -7568 -83991 -98492 -114883
21010 -114883 -53888 -8710 -44361 -42963 -34617 -82641 -78880 -42787 -73655 -81613 -7056 65839
20998 65839 56655 44704 38205 5592 -32431 9603 12354 -4033 -90145 -118157 -24178 -13894
20986 -13894 -25073 -31545 -43541 -75646 -75720 -27378 -37052 -22766 -46139 -40991 -45154 -70757 -137338
20973 -137338 -146175 -33855 12467 -22165 -13311 36350 73880 52990 13199 8408 23213 27879
20961 27879 -25565 -36834 -24048 2646 -38710 -76678 -27815 38 -9219 -83530 -73613 -58753
20949 -58753 -46465 8359 3305 -37239 -12210 -31397 -41638 -28987 -83720 -88672 -13044 -32181
$$ packed form
21035g9347M348k3838R903J7026j7591j9975r5k6550K2413J1285L2361N5448q860
21022b3472P126o7805m1099K8971O9150L1870J77j5180K694p6423j4501j6391
21010a14883O0995M5178l5651J398Q346m8024L761L6093l0868p958P4557P2895
20998F5839r184j1951o499l2613l8023M2034K751j6387q6112k8012R3979J0284
20986a3894j1179o472j1996l2105p4M8342r674J4286k3373N148m163k5603o6581
20973a37338q837J12320M6322l4632Q854M9661L7530k0890l9791m791J4805M666
20961B7879n3444j1269J2786K6694m1356l7968M8863K7853r257p4311R917J4860
20949e8753J2288N4824n054m0544K5029j9187j0241J2651n4733m952P5628j9137
$$ plain form
20937 -32181 -70827 -57366 -33475 -44485 -43893 -27916 -16208 -41096 -60333 -39286 -56477 -45667
20925 -45667 -34458 -62146 -82451 -25360 43959 12013 29327 15671 -13198 46753 37501 27021
20913 27021 -28207 -54058 -84364 -131097 -127760 -104262 -75930 -46822 -83818 -147168 -121259 -159485
20901 -159485 -185640 -148622 -103938 -117291 -119830 -66627 -46413 -40304 -7286 20197 18585 80668
20889 80668 47081 39764 -25212 -50246 -51693 -50797 -56493 -40142 -42202 -27401 -23739 -39875 -24900
20876 -24900 -16355 -47072 -74844 -87337 -103491 -78726 -82064 -101311 -90450 -74974 -66650 -99013
20864 -99013 -88028 -9487 31145 28978 24323 15350 6751 6578 -33341 -63436 -50993 -13809 -84490
20851 -84490 -77895 -61897 -92022 -83595 -62964 -31988 -32673 -25163 15315 44153 23739 -58700 -120039
$$ packed form
20937c2181l8646J3461K3891j1010N92J5977J1708k4888j9237K1047j7191J0810
20925d5667J1209k7688k0305N7091O9319l1946J7314j3656k8869N9951r252j0480
20913B7021n5228k5851l0306m6733L337K3498K8332K9108l6996o3350K5909l8226
20901a59485k6155L7018M4684j3353k539N3203K0214O109L3018K7483j612O2083
20889H0668l3587p317o4976k5034j447Q96n696J6351k060J4801L662j6136J4975
20876b4900Q545l0717k7772j2493j6154K4765l338j9247J0861J5476Q324l2363
20864i9013J0985P8541M0632k167m655q973q599j73l9919l0095J2443L7184p0681
20851h4490O595J5998l0125Q427K0631L0976o85P510M0478K8838k0414q2439o1339
$$ plain form
20838 -120039 -93616 -61736 42948 27295 -22697 -23218 -29504 -29162 -52926 -56532 -31707 14188
20826 14188 92108 108539 98858 36625 12048 -3705 -21501 -74151 -68509 -45278 -51593 -37344
20814 -37344 -46715 5226 11871 -15772 -17923 -16722 5151 48079 62485 61119 22721 -17580 21582
20801 21582 37510 19197 -30547 -29460 -20249 -32836 -66976 -43974 -30708 -35605 -27313 768
20789 768 -28035 -46264 -59620 -66112 -40836 -103953 -101724 -72496 -35247 46672 46057 15131 32739
20776 32739 70156 60214 34581 35582 60821 33789 53646 1259 29072 13919 -7557 17066
20764 17066 19098 35731 107670 67807 43029 77405 100520 46276 -29289 -58369 -63321 -31797
20752 -31797 -13116 3718 -420 16663 50398 18360 -34423 -45120 24565 87096 82085 24562
$$ packed form
20838a20039K6423L1880J04684j5653m9992n21o286L42k3764l606K4825M5895
20826A4188P7920J6431r681o2233k4577j5753j7796n2650N642K3231o315J4249
20814c7344r371N1941O645k7643k151J201K1873M2928J4406j366l8398m0301L9162
20801B1582J5928j8313m9744J087R211j2587l4140K3002J3266m897Q292K8081
20789G68k8803j8229j3356o492K5276o3117K229K9228L7249Q1919o15l0926J7608
20776C2739L7417r942k5633J001K5239k7032J9857n2387K7813j5153k1476K4623
20764A7066K032J6633P1939l9863k4778L4376K3115n4244p5565k9080m952L1524
20752c1797J8681J6834m138J7083L3735l2038n2783j0697O9685O2531n011n7523
$$ plain form
20740 24562 -740 6291 9540 4343 -1646 -21312 -28203 -29012 18610 36600 -21358 42995 95756
20727 95756 98376 94575 83482 66923 5809 -12003 -21569 -35886 1580 705 -6663 13289 60599
20714 60599 20280 -32887 20701 46871 17157 13079 -26601 -17709 -52786 -21997 -7065 -20783
20702 -20783 22063 -3217 -56576 -69479 -29533 -62270 -65738 -81390 -113509 -78955 -63441 -59575
20690 -59575 -82655 -47334 36663 -25064 -96293 -130472 -129308 -72150 -47320 -25746 -12198 -10453
20678 -10453 -2384 -65497 -73381 -13770 27668 29055 17403 -1596 28071 61067 77364 28029
20666 28029 -314 2759 -26841 -7023 -269 -486 15113 -27712 13700 69707 94036 69768
20654 69768 48593 101495 124665 29126 367 73889 90858 26915 9541 5764 -6648 -42624
$$ packed form
20740B4562k5302P031L249n197n989j9666o891q09M7622J7990n7958O4353N2761
20727I5756K620l801j1093j6559o1114j7812r566j4317L7466q75p368J9952M7310
20714F0599m0319n3167N3588K6170k9714m078l9680Q892l5077L0789J4932j3718
20702b0783M2846k5280n3359j2903L9946l2737l468j5652l2119L4554J5514L866
20690e9575k3080L5321Q3997o1727p1229l4179J164N7158K4830K1574J3548J745
20678a0453Q069o3113p884N9611M1438J387j1652j8999K9667L2996J6297m9335
20666B8029k8343L073k9600J9818O754k17J5599m2825M1412N6007K4329k4268
20654F9768k1175N2902K3170r5539k8759P3522J6969o3943j7374l777j2412l5976
$$ plain form
20642 -42624 -32933 -41743 -45786 -16244 24992 13412 -25327 -30519 -19594 -22194 6365 -15804 43880
20629 43880 105919 70951 48968 61123 -21337 -30677 53714 55304 21841 -32273 8102 -8885
20617 -8885 -23112 -48189 -82833 -47459 1887 14654 -36177 -67086 -51327 -36323 -41231 -26386
20605 -26386 -26884 -45316 -15105 -84686 -134369 -116772 -72029 -15715 -31011 6410 25416 5138
20593 5138 67259 33210 45409 47073 43436 16485 42040 53636 9595 -33489 -98001 -134084
20581 -134084 -142548 -113591 -67244 -38132 -45694 -102967 -121368 -141101 -89224 -44218 -61821 -90903
20569 -90903 -63237 -46383 -67057 -62112 -66861 6499 10163 -20408 -16708 -28169 -85064 -72511
20557 -72511 1260 27621 27980 -467 -35601 -8324 5064 -18627 -10620 -49889 -61223 -24819
$$ packed form
20642d2624R691q810m043K9542M1236j1580l8739n192J0925k600K8559k2169N9684
20629D3880O2039l4968k1983J2155q2460r340Q4391J590l3463n4114M0375j6987
20617h885j4227k5077l4644L5374M9346J2767n0831l0909J5759J5004m908J4845
20605b6386m98j8432L0211o9581m9683J7597M4743N6314j5296L7421J9006k0278
20593E138O2121l4049J2199J664l637k6951K5555J1596m4041m3084o4512l6083
20581a34084q464K8957M6347K9112p562n7273j8401j9733N1877M5006j7603k9082
20569i0903K7666J6854k0674M945m749P3360L664l0571L700j1461n6895J2553
20557g2511P3771K6361L59k8447l5134K7277J3388k3691Q007l9269j1334L6404
$$ plain form
20545 -24819 -17611 1090 -16836 -25968 -50216 -70014 -35340 -16487 -37078 -64778 -40204 1822
20533 1822 4760 30814 39135 37869 -19847 -69582 -86981 -77406 -68770 -125799 -118363 -28226 -7523
20520 -7523 -8720 -90706 -141602 -127501 -56741 -53504 -116047 -63661 -750 1132 -24369 -108982
20508 -108982 -82344 -10708 8083 -4910 -2024 27218 -9504 -22585 21074 -1140 15037 21677
20496 21677 3199 20253 -37791 -76159 -101854 -93425 -16246 53557 40763 6371 -10896 -3554
20484 -3554 27068 -24957 -70029 -52893 -45198 -23542 -59955 -41750 6540 67984 98979 20816
20472 20816 -64963 -118383 -82884 -60732 -69263 -49294 -28041 -27195 -64542 -67911 -51398 -78944
20460 -78944 -62409 -7501 20468 67527 103895 62429 -4870 -71315 -68085 -91147 -66286 -106066
$$ packed form
20545b4819P208J8701j7926r132k4248j9798L4674J8853k0591k7700K4574M2026
20533A822K938K6054Q321j266n7716m9735j7399R575Q636n7029P436R0137K0703
20520g523j197q1986n0896J4101P0760L237o2543N2386O2911J882k5501q4613
20508a08982K6638P1636J8791j2993K886K9242l6722j3081M3659k2214J6177O640
20496B1677j8478J7054n8044l8368k5695Q429P7179O9803j2794l4392j7267P342
20484c554L0622n2025m5072J7136P695K1656l6413J8205M8290O1444L0995p8163
20472B0816q5779n3420L5499K2152q531J9969K1253Q46l7347l369J6513k7546
20460g8944J6535N4908K7969M7059L6368m1466o7299o6445L230k3062K4861l9780
$$ plain form
20448 -106066 -38006 12461 -3859 -24964 -28151 -52975 -69452 -60675 -57178 -80795 -73656 -73269 -17736
20435 -17736 4848 35646 -3528 -19632 7022 14347 -62187 -69523 -34672 -45656 -30561 18030
20423 18030 54141 49125 74312 78111 91499 104481 76979 35722 23915 49727 89321 43884
20411 43884 23985 -19252 4602 39955 75125 72240 30018 11940 22203 18700 -21040 -95344
20399 -95344 -164965 -141507 -133346 -46091 28594 16200 -24953 -49919 -12277 -60388 -113274 -91699
20387 -91699 -92634 -62437 -40371 -80461 -96781 -87165 -64177 -35278 -57289 -10788 -1624 -33482
20375 -33482 -17615 -63818 -77009 -59755 -32507 26948 37546 17084 -3856 -33278 -76221 -110950
20363 -110950 -41264 15168 -16678 -61074 -19096 -9721 -1535 -63873 -106954 -84287 -48380 -36420
$$ packed form
20448a06066O8060N0467j6320k1105l187k4824j6477Q777L497k3617P139L87N5533
20435a7736K2584L0798l9174j6104K6654P325p6534p336L4851j0984J5095M8591
20423A8030L6111n016K5187L799J3388J2982k7502m1257j1807K5812L9594m5437
20411D3884j9899m3237K3854L5353L5170k885m2222j8078J0263l503l9740p4304
20399i5344o9621K3458Q161Q7255P4685j2394m1153k4966L7642m8111n2886K1575
20387i1699r35L0197K2066m0090j6320R616K2988K8899k2011M6501R164l1858
20375c3482J5867m6203j3191J7254K7248N9455J0598k0462k0940k9422m2943l4729
20363a10950O9686N6432l1846m4396M1978R375Q186o2338m3081K2667L5907J1960
$$ plain form
20351 -36420 -42148 -54038 -46486 -22112 5405 68911 44876 4592 8798 35145 50972 36458
20339 36458 -1793 -34054 -36517 -43385 -17218 4573 -1233 -29414 -7519 8196 -74298 -77648
20327 -77648 -24050 -7779 48192 46025 -12609 -84671 -62665 -22215 -34901 -99835 -143303 -135930
20315 -135930 -119712 -51045 36294 54825 49302 -45307 -53900 -14556 -21910 10802 4500 -10850
20303 -10850 18978 15442 46412 48329 -8191 -82504 -87868 -28063 1042 7634 7944 16124 47628
20290 47628 7063 26214 63923 1211 -33449 -23508 -12501 -55039 -111338 -123510 -96396 -132810
20278 -132810 -80905 -8612 21686 -1672 -54713 -45790 -53403 -16334 923 9828 28081 38418
20266 38418 14939 16876 -2040 -19703 -42589 -9974 -48692 -78022 -58609 -88403 -44650 -35135
$$ packed form
20351c6420n728j1890P552K4374K7517O3506k4035m0284M206K6347J5827j4514
20339C6458l8251l2261k463o868K6167K1791n806k8181K1895J5715q2494l350
20327g7648N3598J6271N5971k167n8634p2062K2006M0450j2686o4934m3468P373
20315a35930J6218O8667Q7339J8531n523r4609q593L9344p354L2712o302j5350
20303a0850K9828l536L0970J917n6520p4313n364N9805K9105O592L10Q180L1504
20290D7628m0565J9151L7709o2712l4660R941J1007m2538n6299j2172K7114l6414
20278a32810N1905P2293L0298k3358n3041Q923p613L7069J7257Q905J8253J0337
20266C8418k3479J937j8916j7663k2886L2615l8718k9330J9413k9794M3753R515
$$ plain form
20254 -35135 -31154 -45784 -55100 -72831 -89186 -107324 -107458 -72496 -73183 -113361 -119251 -51584 -17402
20241 -17402 -51974 3052 -20177 9266 -3874 -18373 -16755 -75117 -56261 -22562 7428 -29004
20229 -29004 -46910 2985 -6854 -38937 -79716 -72835 -52292 -72159 -74919 -106962 -98095 -96947 -76165
20216 -76165 -18992 -35088 -62612 -95165 -74324 -31434 -25770 32659 43373 64859 84608 26454
20204 26454 43298 4275 -60034 -88714 -63259 -102740 -117817 -155033 -188635 -201071 -167651 -84495
20192 -84495 -65953 -9657 16065 10535 -33960 -14554 -29899 -81400 -108306 -141650 -94744 -56440
20180 -56440 -32107 32024 75352 92526 102648 75382 40126 -17778 -4541 -30782 -50352 10903
20168 10903 4977 45824 73819 78426 61827 33893 -3778 -13208 -74349 -99925 -17360 -1880
$$ packed form
20254c5135L981j4630r316j7731j6355j8138j34L4962o87m0178n890O7667L4182
20241a7402l4572N5026k3229K9443j3140j4499J618n8362J8856L3699K9990l6432
20229b9004j7906M9895r839l2083m0779O881K0543j9867k760l2043Q867J148K0782
20216g6165N7173j6096k7524l2553K0841M2890N664N8429J0714K1486J9749n8154
20204B6454J6844l9023o4309k8680K5455l9481j5077l7216l3602j2436L3420Q3156
20192h4495J8542N6296K5722n530m4495J9406j5345n1501k6906l3344M6906L8304
20180e6440K4333O4131M3328J7174J0122k7266l5256n7904J3237k6241j9570O1255
20168A0903n926M0847K7995M607j6599k7934l7671r430o1141k5576Q2565J5480
$$ plain form
20156 -1880 26348 45521 66456 89460 30623 -53940 -75907 -45211 11505 28961 74641 31590
20144 31590 -78149 -73971 -23878 -34678 -32978 -5846 -18768 -22432 -25395 -38669 -47978 -132503
20132 -132503 -85051 -120412 -107280 -33536 956 -4991 -50307 -41432 9490 110446 109409 801
20120 801 -51820 -94750 -42113 -29321 -30042 -16981 -11564 24580 31712 20577 10817 2828 -31574
20107 -31574 -50761 -68152 -50867 4107 -5802 -33641 -33111 -103637 -112513 -149203 -115615 -45227
20095 -45227 -19119 -3742 -12548 -77205 -58797 14758 33958 48389 24716 14250 26685 -10134
20083 -10134 -51511 -39288 -9689 -60601 -59255 -80387 -83091 -86336 -38019 -9482 -32493 -67524
20071 -67524 -32518 -31362 -25088 -26662 -39180 -44799 27033 32762 -14096 -68047 -51304 11706 2847
$$ packed form
20156a880K8228J9173K0935K3004n8837q4563k1967L0696N6716J7456M5680m3051
20144C1590j09739M178N0093j0800J700K7132j2922l664k963j3274r309q4525
20132a32503M7452l5361J3132P3744L4492n947m5316Q875N0922J00956j037j08608
20120H01n2621m2930N2637J2792p21J3061N417L6144P132j1135r760p989l4402
20107c1574j9187j7391J7285N4974r909k7839N30p0526q876l6690L3588P0388
20095d5227K6108J5377q806o4657J8408P3555J9200J4431k3673j0466J2435l6819
20083a0134m1377J2223K9599n0912J346k1132k704l245M8317K8537k3011l5031
20071f7524L5006J156O274j574j2518n619P1832N729m6858n3951J6743O3010q859
$$ plain form
20058 2847 10289 21754 20209 -157 -19084 -8414 -24292 -16277 4711 -13355 464 -12627
20046 -12627 -60439 -49535 -63989 -1858 15225 47913 93296 115612 80626 19100 -31695 -6060
20034 -6060 58797 70277 42617 27572 55627 35791 -25227 -102169 -95419 -29792 -18693 -50631
20022 -50631 -67181 -64549 -41275 -2911 8681 24768 33066 21395 37747 69725 23608 -29944
20010 -29944 -28071 -12583 -29062 -43272 -85683 -91643 -67982 -31386 27742 2911 -90070 -47320
19998 -47320 -1022 -8332 -26309 -53257 -59362 -72624 -71786 -108143 -99288 -16413 25993 65029 79067
19985 79067 116449 7921 -105998 -126136 -78799 -44441 -52018 -70105 -73770 19339 89951 59703
19973 59703 67591 52049 43948 -14366 -48762 -66009 -56694 -7515 22966 15667 56436 49193 65257
$$ packed form
20058B847P442J1465j545k0366j8927J0670j5878Q015K0988j8066J3819j3091
20046a2627m7812J0904j4454O2131J7083L2688M5383K2316l4986o1526n0795K5635
20034f060O4857J1480k7660j5045K8055j9836o1018p6942O750O5627J1099l1938
20022e0631j6550K632K3274L8364J1592J6087Q298j1671J6352L1978m6117n3552
20010b9944J873J5488j6479j4210m2411n960K3661L6596N9128k4831r2981M2750
19998d7320M6298p310j7977k6948o105j3262Q38l6357Q855Q2875M2406L9036J4038
19985G9067L7382j08528j13919k0138M7337L4358p577j8087l665R3109P0612l0248
19973E9703P888j5542q101n8314l4396j7247R315M9179L0481p299M0769p243J6064
$$ plain form
19960 65257 104323 94685 78605 35243 -5513 -39826 -50174 -36484 6545 16123 7670 -20932
19948 -20932 -11953 2231 19403 11608 -8950 -33782 -48714 -31028 -49982 -128862 -126334 -84118
19936 -84118 18310 46205 -9524 -20430 -28018 -59936 -80575 -44798 5670 -1541 -35652 -40166
19924 -40166 -19624 49783 -14652 5854 23970 18239 -66550 -4419 19417 45284 34642 -30857
19912 -30857 -66007 -50766 -2840 -38503 -101903 -96080 -46211 -51272 -70335 -86903 -140369 -162332
19900 -162332 -116518 -48855 -42386 -57038 -22235 -12218 -23704 -49709 -60729 -75533 -87499 -68169
19888 -68169 -20247 4249 23421 -495 24114 32909 -25092 -49039 -74235 -68323 -61542 -112123
19876 -112123 -58816 -8652 -6423 -8304 10349 -12913 -76773 -76332 -50586 -21451 -48654 -3484
$$ packed form
19960F5257L9066r638j6080m3362m0756l4313j0348J3690M3029R578q453k8602
19948b0932Q979J4184J7172p795k0558k4832j4932J7686j8954p8880K528M2216
19936h4118J02428K7895n5729j0906p588l1918k0639L5777N0468p211l4111m514
19924d0166K0542O9407o4435K0506J8116n731q4789O2131K3836K5867j0642o5499
19912c0857l5150J5241M7926l5663o3400N823M9869n061j9063j6568n3466k1963
19900a62332M5814O7663O469j4652L4803J0017j1486k6005j1020j4804j1966J9330
19888f8169M7922K4496J9172k3916K4609Q795n8001k3947k5196N912O781n0581
19876a12123N3307N0164K229j881J8653k3262o3860M41K5746K9135k7203M5170
$$ plain form
19864 -3484 36237 26076 39902 31099 46737 -25920 -61126 -97611 -59928 20328 19677 -47804
19852 -47804 -50236 -52501 -71367 -34711 25583 54062 73129 -1562 -44426 -40173 -56315 -61778
19840 -61778 -45334 10684 15581 9138 40853 -51328 -77370 -40384 -64093 -41358 47134 64921
19828 64921 70038 31087 -30116 -22734 33689 89620 106495 24327 -83285 -59024 8363 36170
19816 36170 22757 10590 17829 20883 6733 6538 -416 -16379 -22789 -48706 -54649 25874 15367
19803 15367 41543 39054 37039 -2622 -9109 57383 66224 65700 85046 86864 103992 87829 76821
19790 76821 85747 94148 44420 98 -3728 -6659 -26046 -39867 -56946 -70998 -111666 -52326
19778 -52326 -44820 -6890 3834 -49429 -47086 -25271 -29290 -35974 -34815 37871 -16505 -46315 -41515
$$ packed form
19864c484L9721j0161J3826q803J5638p2657l5206l6485L7683Q0256o51o7481
19852d7804k432k265j8866L6656O0294K8479J9067p4691m2864M253j6142n463
19840f1778J6444N6018M897o443L1715r2181k6042L6986k3709K2735Q8492J7787
19828F4921N117l8951o1203P382N6423N5931J6875q2168j07612K4261O7387K7807
19816C6170j3413j2167P239L054j4150j95o954j5963o410k5917n943Q0523j0507
19803A5367K6176k489k015l9661o487O6492Q841n24J9346J818J7128j6163j1008
19790G6821Q926Q401m9728m4322l826k931j9387j3821j7079j4052m0668N9340
19778e2326P506L7930J0724n3263K343K1815m019o684J159P2686n4376k9810M800
$$ plain form
19765 -41515 -21905 -86446 -81043 -64297 -49256 -37016 -32631 -28608 -13107 -11452 -3361 16047 13092
19752 13092 -6907 -20732 -17494 -37898 -8438 -2334 -68222 -88280 -102622 -87730 -69163 -40596
19740 -40596 -60944 -65190 -17555 -10059 -55525 -86857 -81343 -86247 -131681 -119352 -46091 -80697
19728 -80697 -87151 6979 -17858 -75123 -73126 -68248 -53456 -84598 -95440 -150076 -109708 -103798
19716 -103798 -132041 -96645 -68944 -55875 6539 6116 -68946 -142731 -101999 -80601 -57017 7484
19704 7484 -3627 -32523 -84325 -99519 -136336 -109417 -55870 -83691 -69762 -36977 -81154 -133343
19692 -133343 -111546 -60034 5119 8571 38227 20966 -20562 553 -48480 -74922 -29049 5839
19680 5839 15684 -7906 9459 -55441 -136220 -180532 -95827 -57833 -63604 -96121 -135664 -99307
$$ packed form
19765d1515J9610o4541N403J6746J5041J2240M385M023J5501J655Q091J9408k955
19752A3092j9999j3825L238k0404K9460O104o5888k0058j4342J4892J8567K8567
19740d0596k0348m246M7635P496m5466l1332N514m904m5434J2329P3261l4606
19728h0697o454R4130k4837n7265J997M878J4792l1142j0842n4636M0368N910
19716a03798k8243L5396K7701J3069O2414m23p5062p3785M0732K1398K3584O4501
19704G484j1111k8896n1802j5194l6817K6919N3547k7821J3929L2785m4177n2189
19692a33343K1797N1512O5153L452K9656j7261m1528K1115m9033k6442M5873L4888
19680E839R845k3590J7365o4900q0779m4312Q4705L7994n771l2517l9543L6357
$$ plain form
19668 -99307 -74835 -94391 -43279 -14441 -42994 -82314 -61235 -40469 -62012 -81621 -96965 -102882
19656 -102882 -84308 -92996 -97010 -27335 18213 -10331 -75676 -108569 -71697 -38872 27252 -23197
19644 -23197 -94006 -102439 -130944 -147183 -72344 -16389 -37110 -39128 -33644 10910 21267 -15531
19632 -15531 -15701 -41087 -81779 -49988 -40824 -829 6703 -29094 -52476 -51643 -55534 -58815 -86498
19619 -86498 -93622 -30050 -31129 -43541 -66730 -108220 -123220 -128838 -126098 -149846 -84262 -102554
19607 -102554 -79756 -77864 -108252 -118228 -122383 -68974 -35874 -54387 -37264 7365 -44897 -93324
19595 -93324 -144251 -116981 -49627 25922 38731 -4804 -81610 -117107 -88290 -24675 27835 56266
19583 56266 79945 72348 61243 52109 23716 -40999 -39025 -81642 -92467 -85875 -58612 -79303
$$ packed form
19668i9307K4472j9556N1112K8838k8553l9320K1079K0766k1543j9609j5344n917
19656a02882J8574q688m014O9675M5548k8544o5345l2893L6872L2825O6124n0449
19644b3197p0809q433k8505j6239P4839N5955k0721k018N484M4554J0357l6798
19632a5531j70k5386m0692L1791R164L9995P532l5797k3382Q33l891l281k7683
19619h6498p124O3572j079j2412k3189m1490j5000n618K740k3748O5584j8292
19607a02554K2798J892l0388r976m155N3409L3100j8513J7123M4629n2262m8427
19595i3324n0927K7270O7354P5549J2809m3535p6806l5497K8817O3615N2510K8431
19583E6266K3679p597j1105r134k8393o4715J974m2617j0825O592K7263k0691
$$ plain form
19571 -79303 -64329 -59204 -78317 -87268 -94431 -93933 -68294 -114271 -148668 -113332 -74877 -98875 -87495
19558 -87495 -31551 -10898 -87414 -107802 -123137 -136488 -139782 -86566 -36157 -27418 -53812 -70829
19546 -70829 -143378 -115959 -43926 -26464 -11339 -68057 -79610 -44315 -10563 53628 42652 2105
19534 2105 -27707 -20355 -38146 -65855 -91957 -72567 59043 105510 35598 -20110 -26726 -52058
19522 -52058 -77965 -99597 -141788 -128564 -49692 -14152 -42174 -124737 -50096 47239 55448 38169
19510 38169 43807 36721 -8563 24238 57307 44515 88366 76876 27750 6118 -16818 -51497
19498 -51497 -91369 -92095 -88869 -45086 -29918 -26679 -56912 -25065 -43158 -55001 -46937 -42084 -62556
19485 -62556 -39141 -35483 -63227 -52922 -41278 -36744 -14851 -7048 -20077 5435 2447 24790
$$ packed form
19571g9303J4974N125j9113q951p163M98K5639m5977l4397L5336L8455k3998J1380
19558h7495N5944K0653p6516k0388j5335j3351l294N3216N0409Q739k6394j7017
19546g0829p2549K7419P2033J7462J5125n6718j1553L5295L3752O4191j0976m0547
19534B105k9812P352j7791k7709k6102J9390J31610M6467o9912n5708o616k5332
19522e2058k5907k1632m2191J3224P8872L5540k8022q2563P4641R7335Q209j7279
19510C8169N638p086m5284L2801L3069j2792M3851j1490m9126k1632k2936l4679
19498e1497l9872p26L226M3783J5168L239l0233L1847j8093j1843Q064M853k0472
19485f2556K3415L658k7744J0305J1644M534K1893P803j3029K5512k988K2343
$$ plain form
19473 24790 -4157 -3398 -37487 -17178 -53901 -68302 -80074 -63532 -91280 -44273 -48768 -61614
19461 -61614 -55531 -59287 -93048 -107742 -44972 -1455 -34676 -40371 3695 22045 -15133 41080
19449 41080 89032 132824 135801 71285 10164 -52171 -37294 -66780 -107036 -140579 -106703 -75181
19437 -75181 -72700 -81833 -22019 24503 22362 -274 -91775 -109921 -85012 -66267 -60714 -62955 -95571
19424 -95571 -119181 -128033 -102119 -65423 -87005 -109485 -69772 -60500 -41944 -38543 -75875 -124089
19412 -124089 -110970 -80005 -106584 -75234 -123141 -109813 -31387 8230 17018 2922 -48539 -86648
19400 -86648 -49961 -105283 -117596 -78059 -1663 62855 31233 -67426 -64285 4949 34473 -12746
19388 -12746 -94261 -137285 -95452 -82145 -62880 -5161 65937 64978 18513 -5119 -37061 -35542
$$ packed form
19473B4790k8947P59l4089K0309l6723j4401j1772J6542k7748M7007m495j2846
19461f1614O083l756l3761j4694O2770M3517l3221n695M4066J8350l7178N6213
19449D1080M7952M3792K977o4516o1121o2335J4877k9486m0256l3543L3876L1522
19437g5181K481r133N9814M6522k141k2636r1501j8146K4909J8745N553k241l2616
19424i5571k3610q852K5914L6696k1582k2480L9713R272J8556L401l7332m8214
19412a24089J3119L0965k6579L1350m7907J3328P8426L9617Q788j4096n1461l8109
19400h6648L6687n5322j2313L9537P6396O4518l1622r8659L141O9234K9524m7219
19388a2746q1515m3024M1833J3307J9265N7719P1098r59m6465k3632l1942J519
$$ plain form
19376 -35542 9435 27670 -3746 -26689 -20625 -15543 -34582 -48197 -83565 -86569 -55919 -25610
19364 -25610 31970 -20946 -46141 -32733 -88316 -73080 -78613 -141439 -115574 -97831 -115198 -130771
19352 -130771 -156909 -148695 -101071 -94525 -109443 -156669 -118128 -98676 -113310 -147755 -135676 -128205
19340 -128205 -106576 -41097 25454 62845 30167 26818 84802 73284 22894 -31129 -93605 -58460
19328 -58460 -26710 -42644 -76060 -109822 -112779 -91097 -62641 -44898 -60665 -18753 8281 -4440
19316 -4440 -6646 -21552 -59163 -120414 -155920 -150473 -161470 -120830 -77112 -98927 -116849 -113352
19304 -113352 -95190 -92801 -162100 -199298 -182158 -138444 -94198 -39043 -3974 -5259 -79520 -134428
19292 -134428 -103152 -96219 -113789 -175225 -197108 -183433 -183121 -126297 -53366 -20322 14954 -4476
$$ packed form
19376c5542M4977J8235l1416k2943O064N082j9039j3615l5368l004L0650L0309
19364b5610N7580n2916k5195J3408n5583J5236n533o2826K5865J7743j7367j5573
19352a30771k6138Q214M7624O546j4918m7226L8541J9452j4634l4445J2079P471
19340a28205K1629O5479O6551L7391l2678l349N7984j1518n0390n4023o2476L5145
19328e8460L1750j5934l3416l3762k957K1682K8456J7743j5767M1912K7034j2721
19316d440k206j4906l7611o1251l5506N447j0997M0640M3718k1815j7922L497
19304a13352J8162K389o9299l7198J7140M3714M4246N5155L5069j285p4261n4908
19292a34428L1276O933j7570o1436k1883J3675L12N6824P2931L3044L5276j9430
$$ plain form
19280 -4476 -87015 -119675 -75142 -72067 -89966 -76757 -108911 -82470 -54774 -65496 -86974 -52833
19268 -52833 -65079 -127357 -134870 -135864 -102584 -87230 -102046 -99539 -96369 -88869 -78380 -101234 -112204
19255 -112204 -82142 -80904 -64840 -33202 -7421 41093 37433 -3941 -1572 -11524 85736 117911
19243 117911 6409 -53594 -6752 13463 8439 20679 30981 27987 -76 -1839 -35423 -11487
19231 -11487 44011 6054 -49146 -63196 -72476 -68541 -54561 -12939 -21582 -49802 -51710 -48970 -65860
19218 -65860 -49846 -11909 27575 56912 31240 2181 1982 -3843 -7566 -89710 -146526 -158839
19206 -158839 -127413 -43067 -7274 -35455 -83787 -80926 -93989 -52875 -28600 -48906 -67265 -58630
19194 -58630 -47451 -53942 -47874 3438 37637 4125 1737 -50413 -51254 -31370 -28908 8864 62641
$$ packed form
19280d476q2539l2660M4533L075j7899J3209l2154K6441K7696j0722k1478L4141
19268e2833j2246o2278p513r94L3280J5354j4816K507L170P500J0489k2854j0970
19255a12204L0062J238J6064L1638K5781M8514l660m1374K369r952R7260L2175
19243A17911j11502o0003M6842K0215n024J2240J0302k994k8063j763l3584K3936
19231a1487N5498l7957n5200j4050r280L935J3980M1622q643k8220j908K740j6890
19218f5860J6014L7937L9484K9337k5672k9059j99n825l723q2144n6816j2313
19206a58839L1426Q4346L5793k8181m8332K861j3063M1114K4275k0306j8359Q635
19194e8630J1179o491O068N1312L4199l3512k388n2150q41J9884K462L7772N3777
$$ plain form
19181 62641 89587 127527 208273 244841 253021 327012 434969 491467 562609 712292 827784
19170 827784 866429 930331 1023545 1110958 1177094 1223371 1243919 1196547 1143921 1157616 1160878 1131038
19158 1131038 1162691 1173808 1084101 1062936 1053127 927108 858521 745100 619288 566001 467198
19147 467198 372371 329349 277934 277242 266817 253158 166846 92877 89297 91111 31811 -25754
19135 -25754 -84040 -97342 -51707 -3929 31140 55749 26447 1804 -24997 -17538 -34081 -15127
19123 -15127 -31452 -63652 -65056 -69852 -3989 23915 -1547 -50424 -39253 -63591 -46149 6830
19111 6830 22782 29342 -3630 -34567 -29547 -50710 -23065 16749 52164 70850 68056 9659
19099 9659 -23493 -1582 -49887 -55668 -48949 -79513 -80882 -54762 -75289 -85551 -116660 -64803
$$ packed form
19181F2641K6946L7940Q0746L6568Q180P3991J07957N6498P1142J49683J15492
19170H27784L8645O3902R3214Q7413O6136M6277K0548m7372n2626J3695L262k9840
19158A131038L1653J1117q9707k1165r809j26019o8587j13421j25812n3287r8803
19147D67198r4827m3022n1415o92j0425j3659q6312p3969l580J814n9300n7565
19135b5754n8286j3302M5635M7778L5069K4609k9302k4643k6801P459j6543J8954
19123a5127j6325l2200j404m796O5863K7904k5462m8877J1171k4338J7442N2979
19111F830J5952O560l2972l0937N020k1163K7645L9814L5415J8686k794n8397
19099I659l3152K1911m8305n781O719l0564j369K6120k0527j0262l1109N1857
$$ plain form
19087 -64803 -77155 -79959 -111822 -116531 -83935 -39169 25568 48138 56366 47671 -1429 -36359
19075 -36359 -39782 -85772 -122285 -77667 -43734 -64503 13669 82300 58404 21208 3662 -5292
19063 -5292 -1045 -11846 20143 22115 -12006 -18236 3811 19955 21558 -25231 -101406 -89228 -30903
19050 -30903 -58790 -51917 -32236 -22422 -45744 -111835 -94793 -31097 -17869 -31590 -11879 25321
19038 25321 1617 -43820 -67966 -67770 -107579 -99480 -23103 16337 -4112 7791 25214 -36473
19026 -36473 -29125 -68183 -71636 -83839 -87518 -54904 -51700 -39126 -7067 29500 37177 -5943 -39862
19013 -39862 -79926 -119517 -99815 -71409 -61470 -71937 -126797 -83624 16284 17580 -15862 -30997
19001 -30997 -89550 -79675 -44480 11653 1637 -69384 -80716 -36256 2297 -846 8449 -14610
$$ packed form
19087f4803j2352k804l1863m709L2596M4766O4737K2570Q228q695m9100l4930
19075c6359l423m5990l6513M4618L3933k0769P8172O8631k3896l7196j7546q954
19063e292M247j0801L1989J972l4121o230K2047J6144J603m6789p6175J2178N8325
19050c0903k7887O873J9681R814k3322o6091J7042O3696J3228j3721J9711L7200
19038B5321k3704m5437k4146J96l9809Q099P6377L9440k0449J1903J7423o1687
19026c6473P348l9058l453j2203l679L2614L204J2574L2059L6567P677m3120l3919
19013c9862m0064l9591J9702K8406R939j0467n4860M3173R9908J296l3442j5135
19001c0997n8553R875L5195N6133j0016p1021j1332M4460L8553l143R295k3059
$$ plain form
18989 -14610 -8867 -83839 -161708 -107445 -67244 -66867 -42790 -61789 -93822 -84721 -95571 -131625
18977 -131625 -141762 -149249 -110940 -26915 -5404 -27228 -17119 -23573 -10061 24427 33930 6928
18965 6928 -39899 -49927 -72853 -40268 25585 -22997 -86864 -114160 -45198 -46117 -61692 -10736
18953 -10736 10007 20131 12670 33899 48502 48063 11567 14108 -50821 -56660 -42643 -20718 1510
18940 1510 5071 52345 63574 25435 -15409 -10942 -27846 -54957 6477 17868 -40938 -55024
18928 -55024 -33332 -5273 56593 68217 52296 21617 85430 101315 73923 -7043 38093 44693
18916 44693 703 5885 -4491 -40262 -57633 -15519 2489 593 31964 45611 6327 -61737
18904 -61737 -74103 -42445 -75780 -32878 40700 20012 -83 -30427 -41462 -27030 -21295 -28146
$$ packed form
18989a4610N743p4972p7869N4263M0201L77K4077j8999l2033R101j0850l6054
18977a31625j0137p487L8309Q4025K1511k1824J0109o454J3512L4488R503k7002
18965F928m6827j0028k2926L2585O5853m8582o3867k7296O8962r19j5575N0956
18953a0736K0743J0124p461K1229J4603m39l6496K541o4929n839J4017K1925K2228
18940A510L561M7274J1229l8139m0844M467j6904k7111O1434J1391n8806j4086
18928e5024K1692K8059O1866J1624j5921l0679O3813J5885k7392q0966M5136O600
18916D4693m3990N182j0376l5771j7371M2114J8008j896L1371J3647l9284o8064
18904f1737j2366L1658l3335M2902P3578k0688k0095l0344j1035J4432N735o851
$$ plain form
18892 -28146 -28903 -7048 34856 57804 8640 560 6847 -13477 -20629 -19960 -54486 -30890 -28842
18879 -28842 -50846 -36021 -71348 -82713 159 41160 32761 6226 -24158 -48538 28120 37564
18867 37564 61934 82355 86298 43538 24511 -41136 -44085 -12929 -62565 -55895 -644 -23346
18855 -23346 -66902 -111198 -119823 -76516 1401 -14062 -86273 -49932 -53261 -70136 -42121 -81842
18843 -81842 -95793 -92795 -116704 -102703 9208 61057 33835 54993 72020 58792 35361 24431
18831 24431 -29819 -71481 -83667 -105184 -66279 -38661 -62909 -58289 -10522 20931 -37123 -63440
18819 -63440 -74647 -88775 -84691 -133384 -180960 -160499 -90960 -4753 24067 40025 21443 -32985
18807 -32985 -56805 -52513 -41391 -60353 -46399 -5671 -44769 -138831 -155299 -142694 -103569 -74195
$$ packed form
18892b8146p57K1855M1904K2948m9164q080O287k0324p152O69l4526K3596K048
18879b8842k2004J4825l5327j1365Q2872M1001q399k6535l0384k4380P6658R444
18867C7564K4370K0421L943m2760j9027o5647k949L1156m9636O670N5251k2702
18855b3346m3556m4296q625M3307P7917j5463p2211L6341l329j6875K8015l9721
18843h1842j3951K998k3909J4001J11911N1849k7222K1158J7027j3228k3431j0930
18831B4431n4250m1662j2186k1517L8905K7618k4248M620M7767L1453n8054k6317
18819f3440j1207j4128M084m8693m7576K0461O9539Q6207K8820J5958j8582n4428
18807c2985k3820M292J1122j8962J3954M0728l9098r4062j6468J2605L9125K9374
$$ plain form
18795 -74195 -84198 -79194 -43161 -67899 -50404 -16478 -30926 -4734 6688 -3300 -84573 -104337
18783 -104337 -65066 -70978 -68536 -30608 -58029 -90667 -83808 -42280 -3144 -34565 -59754 -59147
18771 -59147 -132745 -134076 -72321 -15840 16296 11689 -930 18162 43051 9832 -43547 -72747
18759 -72747 -73176 -77374 -80317 -98945 -64895 -27879 -34535 -30111 -77562 -98040 -120669 -100768 20945
18746 20945 78149 24404 -31847 6873 37330 72708 52552 26743 61828 50761 -19439 -9092
18734 -9092 46588 85525 69788 33806 -3115 27312 18555 -40672 -44538 -42390 -79591 -68340
18722 -68340 -472 35622 62806 185721 290881 288660 342611 408260 418247 371125 405060 391114
18710 391114 382715 331351 331410 351198 335460 308922 287154 249474 173582 104898 75389 96448
$$ packed form
18795g4195j0003N004L6033k4738J7495L3926j4448K6192J1422r988q1273j9764
18783a04337L9271n912K442L7928k7421l2638O859M1528L9136l1421k5189O07
18771e9147p3598j331O1755N6481L2136m607j2619J9092K4889l3219n3379k9200
18759g2747m29m198k943j8628L4050L7016o656M424m7451k0478k2629J9901J21713
18746B0945N7204n3745n6251L8720L0457L5378k0156k5809L5085j1067p0200J0347
18734i092N5680L8937j5737l5982l6921L0427q757n9227l866K148l7201J1251
18722f8340O7868L6094K7184J22915J05160k221N3951O5649R987m7122L3935j3946
18710C91114q399n1364N9J9788j5738k6538k1768l7680p5892o8684k9509K1059
$$ plain form
18698 96448 116680 108458 91459 80099 16906 -4548 -98454 -131672 -118321 -65071 -48920 -4843
18686 -4843 44684 -3508 -52307 -54923 23405 81093 51788 60320 83408 62355 95720 113965
18674 113965 68583 43546 -9773 58772 118301 143814 145207 160048 229834 258242 291011 296737
18662 296737 323039 330095 346690 403874 414359 475684 552289 555597 570734 596949 674361 775384
18650 775384 867901 962911 974521 909207 837180 782577 723655 607020 482634 425206 360961
18639 360961 257266 248874 226622 184935 141318 62289 67154 104692 138989 129609 122037 94848
18627 94848 69524 56313 36288 36929 58286 57046 15718 15741 -5703 -33105 -15846 32264 5758
18614 5758 10882 39444 29237 -10809 22656 31194 93601 136113 152631 160255 198820 246901
$$ packed form
18698I6448K0232q222j6999j1360o3193k1454r3906l3218J3351N3250J6151M4077
18686d843M9527m8192m8799k616P8328N7688k9305Q532K3088k1053L3365J8245
18674A13965m5382k5037n3319O8545N9529K5513J393J4841O9786K8408L2769N726
18662B96737K6302P056J6595N7184J0485O1325P6605L308J5137K6215P7412J01023
18650G75384R2517R5010J1610o5314p2027n4603n8922j16635j24386n7428o4245
18639C60961j03695q392k2252m1687m3617p9029M865L7538L4297r380p572k7189
18627I4848k5324j3211k0025O41K1357j240m1328K3k1444k7402J7259M8110k6506
18614E758N124K8562j0207m0046L3465Q538O2407M2512J6518P624L8565M8081
$$ plain form
18602 246901 369650 506956 636848 895630 1206497 1463412 1655793 1808141 1909178 1856740
18592 1856740 1674961 1484804 1225884 919686 632515 485414 375461 343498 324929 287586
18582 287586 204036 155565 196890 175542 139176 121450 150269 136877 119534 139626 162028
18571 162028 127707 90248 69612 71428 76804 47685 121203 151518 162227 107686 80396 87502
18559 87502 86330 106729 105314 94159 102520 90050 133760 142460 89193 70920 205944 275210
18547 275210 289094 340059 384432 388904 408092 424056 396598 327680 240085 225139 220129 241272
18535 241272 216611 221194 237514 301632 334992 324760 322554 337485 388470 488054 593408 707799
18523 707799 801034 894240 1019350 1094986 1089482 1079728 1048023 944171 894409 879155 923569
$$ packed form
18602B46901J22749J37306J29892K58782L10867K56915J92381J52348J01037n2438
18592A856740j81779j90157k58920l06198k87171j47101j09953l1963j8569l7343
18582B87586q3550m8471M1325k1348l6366j7726K8819j3392j7343K0092K2402
18571A62028l4321l7459k0636J816N376k9119P3518L0315J0709n4541k7290P106
18559H7502j172K0399j415j1155Q361j2470M3710Q700n3267j8273J35024O9266
18547B75210J3884N0965M4373M472J9188J5964k7458o8918q7595j4946n010K1143
18535B41272k4661M583J6320O4118L3360j0232k206J4931N0985R9584J05354J14391
18523G07799R3235R3206J25110P5636n504r754l1705j03852m9762j5254M4414
$$ plain form
18512 923569 989970 1069294 1155660 1185600 1211764 1115738 1048020 1007152 883340 726042 556047
18501 556047 429223 369008 387072 408915 363362 334768 347630 358730 340890 414213 430280
18490 430280 386028 391058 461636 543218 585565 588688 575462 573516 567197 511926 484801 463736
18478 463736 419343 350973 317830 385756 462717 461053 403778 463348 456139 482905 537399 574493
18466 574493 590343 617333 625742 607554 612248 540552 464906 462113 522161 566004 628742 609402
18454 609402 540051 464205 393939 381490 399273 370331 316553 252929 163700 182497 147585
18443 147585 127086 115190 144689 213489 222399 212960 241181 214915 214099 205668 251497 236254
18431 236254 196573 152475 148549 142801 171458 149283 146496 111938 60228 45296 71494 76870
$$ packed form
18512I23569O6401P9324Q6366K9940K6164r6026o7718m0868j23812j57298j69995
18501E56047j26824o0215J8064K1843m5553k8594J2862J1100j7840P3323J6067
18490D30280m4252N030P0578Q1582M2347L123j3226j946o319n5271k7125k1065
18478D63736m4393o8370l3143O7926P6961j664n7275N9570p209K6766N4494L7094
18466E74493J5850K6990Q409j8188M694p1696p5646k793O0048M3843O2738j9340
18454F09402o9351p5846p0266j2449J7783k8942n3778o3624q9229J8797l4912
18443A47585k0499j1896K9499O8800Q910r439K8221k6266q16q431M5829j5243
18431B36254l9681m4098l926n748K8657k2175k787l4558n1710j4932K6198N376
$$ plain form
18419 76870 83423 83992 19858 -64816 -76293 -31834 26091 39350 -13849 16137 20406 63093
18407 63093 94045 110772 91483 121129 101733 53675 20229 41668 60696 60271 29921 -11450
18395 -11450 -24931 -5739 22278 97543 83019 28053 108766 170071 85864 32883 91573 114834
18383 114834 80979 99006 119010 105527 23506 -35855 10573 37574 47273 65773 59965 12122
18371 12122 -472 11046 28982 46021 30032 -12690 -1938 6245 6244 25733 65174 87928 85282
18358 85282 104558 132846 180203 151179 87225 65629 45991 -1644 -27208 -92887 -95229 -26349
18346 -26349 17290 90324 103208 134206 82685 36733 -13142 -4517 49032 29180 30561 65892
18334 65892 74888 61612 52157 54698 140258 151130 119988 43856 -14094 25927 46931 65388
$$ packed form
18419G6870O553N69o4134q4674j1477M4459N7925J3259n3199K9986M269M2687
18407F3093L0952J6727j9289K9646j9396m8058l3446K1439J9028m25l0350m1371
18395a1450j3481J9192K8017P5265j4524n4966Q0713O1305q4207n2981N8690K3261
18383A14834l3855J8027K0004j3483q2021n9361M6428K7001R699J8500n808m7843
18371A2122j2594J1518J7936J7039j5989m2722J0752Q183jJ9489L9441K2754k646
18358H5282J9276K8288M7357k9024o3954k1596j9638m7635k5564o5679k342O8880
18346b6349M3639P3034J2884L0998n1521m5952m9875Q625N3549j9852J381L5331
18334F5892Q996j3276r455K541Q5560J0872l1142p6132n7950M0021K1004J8457
$$ plain form
18322 65388 17446 -39886 -29811 -34759 -26142 1698 -49263 -40808 -11956 -11673 67105 48366 34386
18309 34386 65527 112220 126889 90995 116843 119257 105032 72220 115462 124934 140968 131756
18297 131756 121006 79083 60388 81039 122849 130148 114530 73949 75328 44722 7356 45389
18285 45389 145885 232148 260376 236791 249420 284049 261639 202626 166738 152555 182449
18274 182449 204836 182291 153163 211041 146516 115541 114920 201013 213022 171225 233355 289322
18262 289322 298474 398072 569152 720210 839172 922368 886065 848541 787678 681533 588004
18251 588004 526836 499716 489425 441301 396882 395409 399321 477555 584145 716487 839466
18240 839466 968381 1110466 1213257 1262581 1378976 1508693 1581103 1706793 1958049 2103032
$$ packed form
18322F5388m7942n7332J0075m948Q617K7840n0961Q455K8852K83P8778j8739j3980
18309C4386L1141M6693J4669l5894K5848K414j4225l2812M3242R472J6034r212
18297A31756j0750m1923j8695K0651M1810P299j5618m0581J379l0606l7366L8033
18285D5389J00496Q6263K8228k3585J2629L4629k2410n9013l5888j4183K9894
18274A82449K2387k2545k9128N7878o4525l0975o21Q6093J2009m1797O2130N5967
18262B89322R152R9598J71080J51058J18962Q3196l6303l7524o0863j06145r3529
18251E88004o1168k7120j0291m8124m4419j473L912P8234J06590J32342J22979
18240H39466J28915J42085J02791M9324J16395J29717P2410J25690K51256J44983
$$ plain form
18230 2103032 2187897 2351414 2582482 2930214 3481686 4161930 5209452 6724693 8771049
18221 8771049 11401367 14904223 19452926 25380269 32918491 41918515 52062402 62763798
18213 62763798 72912542 80392474 83103506 80700923 74902592 68191183 62342067 58051008
18205 58051008 55097115 52384439 48746206 43678047 37742295 31688249 26023358 20915402
18197 20915402 16646644 13242403 10632474 8686959 7283187 6318805 5651115 5197358
18189 5197358 4792475 4512132 4415883 4330361 4300674 4280711 4184436 4047465 3918534 3827902
18179 3827902 3893630 4014448 4164038 4410859 4733950 5156176 5849640 6790741 8047721
18170 8047721 10033585 13213976 18031256 24965840 34097312 44378690 53562266 58948525
$$ packed form
18230B103032Q4865J63517K31068L47732N51472O80244J047522J515241K046356
18221H771049K630318L502856M548703N927343P538222R000024J0143887J0701396
18213F2763798J0148744P479932K711032k402583n798331o711409n849116m291059
18205E8051008k953893k712676l638233n068159n935752o054046n664891n107956
18197B0915402m268758l404241k609929j945515j403772r64382o67690m53757
18189E197358m04883k80343r6249q5522k9687j9963r6275j36971j28931r0632
18179C827902O5728J20818J49590K46821L23091M22226O93464R41101J256980
18170H047721J985864L180391M817280O934584R131472J0281378R183576N386259
$$ plain form
18162 58948525 59880959 58368271 57616100 59878425 65572946 73316233 80506834 84296644
18154 84296644 83556322 79304432 72971258 65191654 55974680 45768728 35704908 27090551
18146 27090551 20407978 15498735 11993959 9516125 7797005 6560247 5647570 4960669
18138 4960669 4389765 3927549 3613185 3270680 2968464 2800572 2673880 2530197 2444675 2402418
18128 2402418 2344598 2151448 1956294 1838405 1696473 1552945 1423108 1303689 1202199 1098859
18118 1098859 1034809 1024112 982292 931683 869434 821194 798506 793593 817493 829712 831470 783269
18106 783269 747148 746912 729454 739529 750639 695838 600879 575755 614994 616057 592144 606065
18094 606065 576222 575596 561906 542691 535276 572928 549520 510169 470154 462491 507241 491314
$$ packed form
18162E8948525R32434j512688p52171K262325N694521P743287P190601L789810
18154H4296644p40322m251890o333174p779604r216974j0205952j0063820q614357
18146B7090551o682573m909243l504776k477834j719120j236758r12677o86901
18138D960669n70904m62216l14364l42505l02216j67892j26692j43683q5522m2257
18128B402418n7820j93150j95154j17889j41932j43528j29837j19419j01490j03340
18118A098859o4050j0697m1820n0609o2249m8240k2688m913K3900J2219J758m8201
18106G83269l6121k36j7458J0075J1110n4801r4959k5124L9239J063k3913J3921
18094F06065k9843o26j3690j9215p415L7652k3408l9351m0015p663M4750j5927
$$ plain form
18082 491314 484421 448647 413651 461498 528654 476901 429859 401379 353179 329777 354123 379415
18070 379415 403435 378896 327553 328869 332356 357618 319642 325062 353938 355513 323208 261769
18058 261769 255463 302435 343789 332721 339291 320959 335569 325175 300255 285474 322591 277013
18046 277013 271398 288059 300129 237300 209336 242968 229607 157200 84676 151129 212005 172017
18034 172017 144504 195909 184878 193191 177518 230665 232199 183819 186540 201922 145266 139017
18022 139017 181858 189052 118932 85157 99174 80950 93019 85580 101258 104747 74703 60595
18010 60595 75561 56843 -3390 10795 65585 64082 102628 191428 188494 161869 143872 125089
17998 125089 174710 234864 198177 156157 153576 112462 112908 128456 139904 94394 33378 53633
$$ packed form
18082D91314o893l5774l4996M7847O7156n1753m7042k8480m8200k3402K4346K5292
18070C79415K4020k4539n1343J316L487K5262l7976N420K8876J575l2305o1439
18058B61769o306M6972M1354j1068O570j8332J4610j0394k4920j4781L7117m5578
18046B77013n615J6661J2070o2829k7964L3632j3361p2407p2524O6453O0876l9988
18034A72017k7513N1405j1031Q313j5673N3147J534m8380K721J5382n6656o249
18022A39017M2841P194p0120l3775J4017j8224J2069p439J5678L489l0044j4108
18010F0595J4966j8718o0233J4185N4790j503L8546Q8800k934k6625j7997j8783
17998A25089M9621O0154l6687m2020k581m1114M46J5548J1448m5510o1016K0255
$$ plain form
17986 53633 117956 134173 153181 145543 105625 60689 37906 52407 96746 85471 123887 143734
17974 143734 39582 20440 44774 11632 -14200 52244 131341 181899 121405 107185 125808
17963 125808 135792 86671 55879 76990 109132 79288 88319 146643 129785 130246 115904 58915
17951 58915 96273 102836 118754 114566 66260 74391 66347 131948 182217 157421 142581 93434
17939 93434 31680 -48640 -70208 -30793 304 10236 49343 74400 102774 119023 125325 114649
17927 114649 63372 -11994 -12082 15332 40055 -28598 -49830 -4629 18076 18309 3615 18055
17915 18055 12076 46519 113374 133112 121677 86061 57756 42291 30597 36807 6412 8498
17903 8498 -29152 -41644 -17921 1322 -3338 8305 11399 34767 89147 110101 93051 66948
$$ packed form
17986E3633O4323J6217J9008p638l9918m4936k2783J4501M4339j1275L8416J9847
17974A43734j04152j9142K4334l3142k5832O6444P9097N0558o0494j4220J8623
17963A25808R984m9121l0792K1111L2142k9844R031N8324j6858M61j4342n6989
17951E8915L7358O563J5918m188m8306Q131q044O5601N0269k4796j4840m9147
17939I3434o1754q0320k1568L9415L1097R932L9107K5057K8374J6249O302j0676
17927A14649n1277p5366q8K7414K4723o8653k1232M5201K2705K33j4694J4440
17915A8055n979L4443O6855J9738j1435l5616k8305j5465j1694O210l0395K086
17903H498l7650j2492K3723J9243m660J1643L094K3368N4380K0954j7050k6103
$$ plain form
17891 66948 59200 80969 94619 97835 43343 -11603 33413 57457 76373 27879 32087 54473
17879 54473 54942 78659 142604 156663 41379 -50611 -23030 54549 120132 105197 120820 124249
17867 124249 170262 107654 55751 30199 72463 87937 95380 87642 91515 61091 51183 11089
17855 11089 -69462 -42565 -7141 33506 59667 54582 63619 53003 13355 48202 90123 116423
17843 116423 99186 99125 89496 101581 71823 22154 43017 52824 30577 8667 25531 385
17831 385 3613 -23374 -6840 71158 103787 78093 52589 23292 -23444 16455 29587 45294
17819 45294 40620 23463 27329 5762 51508 30195 49973 12678 22628 81946 89821 68984
17807 68984 107938 115606 96660 95998 44267 15001 -17951 15047 86025 102417 89347 95760
$$ packed form
17891F6948p748K1769J3650L216n4492n4946M5016K4044J8916m8494M208K2386
17879E4473M69K3717O3945J4059j15284r1990K7581P7579O5583j4935J5623L429
17867A24249M6013o2608n1903k5552M2264J5474P443p738L873l0424r908m0094
17855A1089q0551K6897L5424M0647K6161n085R037j0616l9648L4847M1921K6300
17843A16423j7237o1r629J2085k9758m9669K0863R807k2247k1910J6864k5146
17831C85L228k6987J6534P7998L2629k5694k5504k9297m6736L9899J3132J5707
17819D5294m674j7157L866k1567M5746k1313J9778l7295R950N9318P875k0837
17807F8984L8954P668j8946o62n1731k9266l2952L2998P0978J6392j3070O413
$$ plain form
17795 95760 21273 65471 152572 136046 62369 27701 22983 24580 10060 19236 29665 12714
17783 12714 7751 21872 41426 40974 39193 -29152 -22254 -9491 -19457 -37511 -40926 -47171 316
17770 316 21304 73660 86826 25662 48969 71605 65791 68048 81381 128644 92132 70041
17758 70041 76867 82954 65597 25440 24598 59029 78620 58349 -6066 -36765 -19025 19802
17746 19802 27618 -5090 -11464 46127 89779 97214 48843 18306 66539 87955 81986 36072
17734 36072 100068 96057 52461 38987 1983 2946 -9127 -38855 -23566 71982 76437 45029
17722 45029 21161 57606 123061 64957 12373 55629 86888 73965 35227 21596 48894 147264
17710 147264 213356 216373 226803 245063 296922 381926 446793 478226 501648 439727 358211 294195
$$ packed form
17795I5760p4487M4198Q7101j6526p3677l4668m718J597j4520R176J0429j6951
17783A2714m963J4121J9554m52j781o8345O898J2763r966j8054l415o245M7487
17770C16K0988N2356J3166o1164K3307K2636n814K257J3333M7263l6512k2091
17758G0041O826O087j7357m0157q42L4431J9591k0271o4415l0699J7740L8827
17746A9802P816l2708o374N7591M3652P435m8371l0537M8233K1416n969m5914
17734C6072O3996m011m3596j3474l7004R63j2073k9728J5289R5548M455l1408
17722D5029k3868L6445O5455n8104n2584M3256L1259j2923l8738j3631K7298R8370
17710A47264O6092L017J0430J8260N1859Q5004O4867L1433K3422o1921q1516o4016
$$ plain form
17698 294195 247502 281791 304149 308753 236771 207439 223002 204898 191505 174959 144484 132590
17686 132590 95475 82262 83684 106910 157684 176768 132180 90651 97620 131685 109556 78719
17674 78719 63957 63939 104394 109783 104422 129981 79710 94029 179684 230238 244720 234570 251306
17661 251306 204199 188684 233666 294762 330020 332618 312225 281381 248127 253505 349073 442848
17649 442848 454148 435355 528736 572618 543463 540571 460166 362521 293642 265632 287358 237547
17637 237547 164830 169847 158521 162824 186209 249900 263381 213158 145154 75073 16767 73741
17625 73741 96094 49770 18315 24911 -26841 -11291 16545 83151 114100 142268 99912 78434
17613 78434 21018 6493 -11511 35023 114463 116052 139018 126884 158232 166403 138270 145103
$$ packed form
17698B94195m6693L4289K2358M604p1982k9332J5563j8104j3393j6546l0475j1894
17686A32590l7115j3213J422K3226N0774J9084m4588m1529O969L4065k2129l0837
17674G8719j4762j8M0455N389n361K5559n0271J4319Q5655N0554J4482j0150J6736
17661B51306m7107j5515M4982O1096L5258K598k0393l0844l3254N378R5568R3775
17649D42848J1300j8793R3381M3882k9155k892q0405r7645o8879k8010K1726m9811
17637B37547p2717N017j1326M303K3385O3691J3481n0223o8004p0081n8306N6974
17625G3741K2353m6324l1455O596n1752J5550K7836O6606L0949K8168m2356k1478
17613G8434n7416j4525j8004M6534P9440J589K2966j2134L1348Q171k8133O833
$$ plain form
17601 145103 70594 32856 38583 41753 83243 127772 170927 178471 156383 90969 33982 62577
17589 62577 86677 77155 112377 152854 133999 92875 91941 92759 104327 135399 92388 24745 40298
17576 40298 31753 29701 77294 39131 29765 44580 20745 -1773 17387 60257 70322 1085
17564 1085 14279 50622 53907 22380 33734 67759 30755 13290 13307 30446 43703 62042 55110
17551 55110 57651 59894 23370 47117 63296 48884 25147 2168 55500 36975 3052 -27276
17539 -27276 -23572 -44520 -15532 1233 -5179 32469 86909 54126 29931 98288 139437 117023
17527 117023 94452 70872 87053 39045 21188 51379 16717 52448 72955 115790 144792
17516 144792 144352 86815 102336 126517 199339 201988 192193 173520 202543 233957 282164 321880
$$ packed form
17601A45103p4509l7738N727L170M1490M4529M3155P544k2088o5414n6987K8595
17589F2577K4100r522L5222M0477j8855m1124r34Q18J1568L1072m3011o7643J5553
17576D0298q545k052M7593l8163r366J4815k3835k2518J9160M2870J0065o9237
17564A085J3194L6343L285l1527J1354L4025l7004j7465J7J7139J3257J8339o932
17551E5110K541K243l6524K3747J6179j4412k3737k2979N3332j8525l3923l0328
17539b7276L704k0948K8988J6765o412L7648N4440l2783k4195O8357M1149k2414
17527A17023k2571k3580J6181m8008j7857L0191l4662L5731K0507M2835K9002
17516A44792m40n7537J5521K4181P2822K649r795j8673K9023L1414M8207L9716
$$ plain form
17504 321880 337701 325270 246131 194003 179356 198660 198474 159502 186875 232512 258191 340635
17492 340635 348945 348519 338728 362754 384072 312616 274782 252406 225007 242923 192431 115745
17480 115745 92917 53442 60824 39333 64941 32792 32031 79234 113584 123247 108385 129627
17468 129627 143732 123890 100673 98302 73031 60261 99068 172971 105853 110731 189634 264923
17456 264923 247826 273896 356740 479162 576969 596171 639266 694657 698151 686809 718855
17445 718855 781062 742891 721773 736470 792235 822443 916736 941179 947813 876356 838029 822861
17433 822861 714312 607281 528681 507041 467050 411697 336161 313134 263502 233802 180707
17422 180707 129310 140186 164957 152389 141423 105293 67936 86372 141226 99239 27171
$$ packed form
17504C21880J5821j2431p9139n2128j4647J9304j86l8972K7373M5637K5679Q2444
17492C40635Q310m26r791K4026K1318p1456l7834k2376k7399J7916n0492p6686
17480A15745k2828l9475P382k1491K5608l2149p61M7203L4350R663j4862K1242
17468A29627J4105j9842k3217k371k5271j2770L8807P3903o7118M878P8903P5289
17456B64923j7097K6070Q2844J22422R7807J9202M3095N5391L494j1342L2046
17445G18855O2207l8171k1118J4697N5765L0208R4293K4443O634p1457l8327j5168
17433H22861j08549j07031p8600k1640l9991n5353p5536k3027m9632k9700n3095
17422A80707n1397J0876K4771j2568j0966l6130l7357J8436N4854m1987p2068
$$ plain form
17411 27171 7495 28480 1884 43356 52016 60164 78375 73108 44250 52538 37905 33379 20877
17398 20877 10577 -12903 -12531 -42405 -71716 -69570 -44755 -31328 -48152 -55910 -23119 16189
17386 16189 82086 102628 101130 139019 192664 130558 20606 19232 20740 -24906 -54155 -49091
17374 -49091 -45639 13308 53685 25320 23040 39388 37283 1722 -22874 -69575 -81318 -63027
17362 -63027 -29202 -3544 18870 7901 -848 59769 73431 -3795 -21899 -14413 -15858 -18441
17350 -18441 -17015 -15785 42320 53322 -29702 -42207 12977 29040 -28492 -58293 -16317 -9993
17338 -9993 32472 67049 78393 14195 -11970 -3704 32897 58565 44961 57464 77218 51891
17326 51891 61583 60247 -14482 -70584 -71832 -65506 -9173 17141 61844 97823 111439 79366
$$ packed form
17411B7171j9676K0985k6596M1472Q660Q148J8211n267k8858Q288j4633m526j2502
17398B0877j0300k3480L72k9874k9311K146K4815J3427j6824p758L2791L9308
17386A6189O5897K0542j498L7889N3645o2106j09952j374J508m5646k9249N064
17374d9091L452N8947M0377k8365k280J6348k105l5561k4596m6701j1743J8291
17362f3027L3825K5658K2414j0969q749O0617J3662p7226j8104P486j445k583
17350a8441J426J230N8105J1002q3024j2505N5184J6063n7532k9801M1976O324
17338i993M2465L4577J1344o4198k6165Q266L6601K5668j3604J2503J9754k5327
17326E1891R692j336p4729n6102j248O326N6333K6314M4703L5979J3616l2073
$$ plain form
17314 79366 75658 93887 100389 118915 140838 124026 111331 103555 88840 64791 57914 37777
17302 37777 27960 16516 43344 -8425 -34458 -3562 29070 10201 6621 35402 1184 -20364
17290 -20364 -16092 -31603 -62478 -54380 -68159 -81955 -37104 15793 18944 21092 68514 96918
17278 96918 63236 82485 133370 71323 3560 29028 112775 153084 131648 50616 63704 125812
17266 125812 194171 211342 157614 109177 45169 63550 121506 142439 173666 238106 304597
17255 304597 382817 371077 308051 272951 259474 224744 202702 170994 130712 194663 208451
17244 208451 156345 150149 179502 183009 155205 161702 174428 210255 157165 115634 84930 79158
17232 79158 53610 59812 145167 103963 9307 -15507 -57883 -28593 71074 139652 130355 151611
$$ packed form
17314G9366l708J8229O502J8526K1923j6812j2695p776j4715k4049o877k0137
17302C7777r817j1444K6828n1769k6033L0896L2632j8869l580K8781l4218k1548
17290b0364M272j5511l0875Q098j3779j3796M4851N2897L151K148M7422K8404
17278I6918l3682J9249N0885o2047o7763K5468Q3747M0309k1436q1032J3088O2108
17266A25812O8359J7171n3728m8437o4008J8381N7956K0933L1227O4440O6491
17255C04597P8220j1740o3026l5100j3477l4730k2042l1708m0282O3951J3788
17244B08451n2106o196K9353L507k7804O497J2726L5827n3090m1531l0704n772
17232G9158k5548O202Q5355m1204r4656k4814m2376K9290R9667O8578r297K1256
$$ plain form
17220 151611 178471 179275 112074 91450 71289 41958 72691 101158 174322 198058 202755 199350
17208 199350 212039 197339 185065 156531 154836 213491 249846 236058 207812 236754 236002 220273
17196 220273 254503 304874 280440 220511 242209 249676 235175 219162 155405 152681 151578 140419
17184 140419 85282 74565 5217 -8641 37831 64729 97199 124004 117318 170420 185840 147399
17172 147399 109700 61600 61506 45708 47908 26336 13834 33492 58377 52978 37256 41656 52488
17159 52488 36563 19936 -4432 25193 91752 155695 166933 112118 127703 117580 151521 148038
17147 148038 127345 186829 202073 142529 149306 151800 157548 187639 185542 219337 255023 175620
17135 175620 138974 121269 140680 128000 204160 245263 291918 244784 209812 232026 161459
$$ packed form
17220A51611K6860Q04o7201k0624k0161k9331L0733K8467P3164K3736M697l405
17208A99350J2689j4700j2274k8534j695N8655L6355j3788k8246K8942p52j5729
17196B20273L4230N0371k4434n9929K1698P467j4501j6013o3757k724j103j1159
17184A40419n5137j0717o9348j3858M6472K6898L2470K6805o686N3102J5420l8441
17172A47399l7699m8100r4j5798K200k1572j2502J9658K4885n399j5722M400J0832
17159E2488j5925j6627k4368K9625O6559O3943J1238n4815J5585j0123L3941l483
17147A48038k0693N9484J5244n9544O777K494N748L0091k097L3795L5686p9403
17135A75620l6646j7705J9411j2680P6160M1103M6655m7134l4972K2214p0567
$$ plain form
17124 161459 181589 264081 273837 237354 189082 233349 290741 325649 288557 254160 292722 287175
17112 287175 248027 256116 231044 283262 384782 420022 482485 597870 635831 648161 691178
17101 691178 768611 750785 722200 685860 714946 772169 806885 849432 859887 911495 944450
17090 944450 947662 891602 902373 921740 888260 827410 791491 730028 668403 634953 612294 589838
17078 589838 516261 432571 403718 429786 420395 407376 434422 460557 506432 532022 508626 518757
17066 518757 501261 559476 598187 527017 471127 463788 457858 529387 630912 651113 669329 667798
17054 667798 720794 761561 724780 643228 655414 667479 652799 625838 658619 665212 662095 625116
17042 625116 638129 688223 712614 699100 732160 804621 858599 935161 1090676 1232825 1378902
$$ packed form
17124A61459K0130Q2492R756l6483m8272M4267N7392L4908l7092l4397L8562n547
17112B87175l9148Q089k5072N2218J01520L5240O2463J15385L7961J2330M3017
17101F91178P7433j7826k8585l6340K9086N7223L4716M2547J0455N1608L2955
17090I44450L212n6060J0771J9367l3480o0850l5919o1463o1625l3450k2659k2456
17078E89838p3577q3690k8853K6068r391j3019K7046K6135M5875K5590k3396J0131
17066E18757j7496N8215L8711p1170n5890p339n930P1529J01525K0201J8216j531
17054F67798N2996M0767l6781q1552J2186J2065j4680k6961L2781O593l117l6979
17042F25116J3013N0094K4391j3514L3060P2461N3978P6562J55515J42149J46077
$$ plain form
17031 1378902 1523293 1638734 1704962 1843596 1912710 1970011 2103715 2237436 2420635 2648876
17021 2648876 2919902 3205948 3544424 3877925 4225965 4650493 5185908 5914324 7071068
17012 7071068 8843496 11431821 15131706 20138034 26161320 32836204 40076278 47339801
17004 47339801 52495329 53405365 50764595 46802183 43250079 40717503 39861196 41595055
16996 41595055 46212196 52779971 60608656 69676308 78443684 82582520 79630550 71490743
16988 71490743 61359784 51085211 41029899 31899445 24391552 18794549 14893227 12161024
16980 12161024 10293759 8989672 8086591 7385305 6882400 6561928 6383582 6383445 6548355
16971 6548355 6835370 7215486 7644480 8135714 8812239 9622454 10584224 11689437 13177094
$$ packed form
17031A378902J44391J15441O6228J38634O9114N7301J33704J33721J83199K28241
17021B648876K71026K86046L38476L33501L48040M24528N35415P28416J156744
17012G071068J772428K588325L699885N006328O023286O674884P240074P263523
17004D7339801N155528R10036k640770l962412l552104k532576q56307J733859
16996D1595055M617141O567775P828685R067652Q767376M138836k951970q139807
16988G1490743j0130959j0274573j0055312r130454p507893n597003l901322k732203
16980A2161024j867265j304087r03081p01286n02905l20472j78346j37J64910
16971F548355K87015L80116M28994M91234O76525Q10215R61770J105213J487657
$$ plain form
16962 13177094 15299856 18406702 22851080 28594236 34855383 40568946 45611678 51239197
16954 51239197 59734169 72910274 90356648 109027894 126810514 143716794 159471861
16947 159471861 174708180 192841671 217892208 246556671 263530152 256974776 233799529
16940 233799529 208911902 189906839 171629606 148512255 121720623 96411691 76542309
16933 76542309 62247937 51583691 42772891 35090991 28688469 23640568 19859798 17137469
16925 17137469 15071479 13457566 12169037 11142151 10193015 9251087 8334089 7493470 6921653
16916 6921653 6347228 5794236 5316117 4914931 4561342 4253774 3971951 3721356 3487007
16907 3487007 3286327 3110515 2913748 2824214 2761703 2631690 2571229 2453826 2359045 2325234
$$ packed form
16962A3177094K122762L106846M444378N743156O261147N713563N042732N627519
16954E1239197Q494972J3176105J7446374J8671246J7782620J6906280J5755067
16947A59471861J5236319J8133491K5050537K8664463J6973481o555376k3175247
16940B33799529k4887627j9005063j8277233k3117351k6791632k5308932j9869382
16933G6542309j4294372j0664246q810800p681900o402522n047901l780770k722329
16925A7137469k065990j613913j288529j026886r49136r41928r16998q40619n71817
16916F921653n74425n52992m78119m01186l53589l07568k81823k50595k34349
16907C487007k00680j75812j96767q9534o2511j30013o0461j17403r4781l3811
$$ plain form
16897 2325234 2266834 2224408 2177526 2161418 2101376 2079785 2022761 1955917 1920735 1799391 1721723
16886 1721723 1696640 1646087 1620401 1667547 1630430 1524962 1447088 1470213 1559848 1545813 1493600
16875 1493600 1501555 1427999 1380921 1322475 1285311 1207714 1193510 1174983 1180258 1115742 1077513 1092350
16863 1092350 1174768 1159890 1131077 1099299 1063968 1008587 1014242 1017382 957413 933823 935041 860825
16851 860825 815216 796405 806765 825307 831863 779001 753036 733476 725942 714750 674301 696549
16839 696549 700917 738146 776715 762689 707224 735033 735862 677677 716108 782984 814137 817214
16827 817214 790226 830730 829688 809593 833140 845341 855305 868477 951823 938511 886690 914701
16815 914701 899349 866396 841623 781635 762157 703318 622307 648497 636983 616145 561768
$$ packed form
16897B325234n8400m2426m6882j6108o0042k1591n7024o6844l5182j21344p7668
16886A721723k5083n0553k5686M7146l7117j05468p7874K3125Q9635j4035n2213
16875A493600P955p3556m7078n8446l7164p7597j4204j8527N275o4516l8229J4837
16863A092350Q2418j4878k8813l1778l5331n5381N655L140n9969k3590J218p4216
16851H60825m5609j8811J0360J8542O556n2862k5965j9560p534j1192m0449K2248
16839F96549M368L7229L8569j4026n5465K7809Q29n8185L8431O6876L1153L077
16827H17214k6988M0504j042k0095K3547J2201R964J3172Q3346j3312n1821K8011
16815I14701j5352l2953k4773n9988j9478n8839q1011K6190j1514k0838n4377
$$ plain form
16804 561768 553818 586201 643285 629309 584526 534931 517775 420951 350078 357960 434376 521266
16792 521266 534287 519858 516342 533729 530657 497009 456586 477342 497819 452814 440730 430401
16780 430401 444614 478392 494719 454424 470561 512336 520252 495637 459397 443645 447759 414996
16768 414996 435145 492761 540839 565081 540560 507637 498799 497213 455503 351163 352135 383184
16756 383184 433265 427116 464565 429944 410251 384301 353144 390338 387469 391561 384740 410029
16744 410029 426297 451279 444432 458597 464295 488415 560540 554025 509658 482473 504410 542835
16732 542835 534061 525003 522121 492478 488867 500098 453070 479776 530976 568932 590397 557545
16720 557545 521279 503605 522120 578845 579743 520427 438171 428460 457119 564222 633051 594390
$$ packed form
16804E61768p950L2383N7084j3976m4783m9595j7156r6824p0873P882P6416Q6890
16792E21266J3021j4429l516J7387l072l3648m0423K0756K0477m5005j2084j0329
16780D30401J4213L3778J6327m0295J6137M1775P916k4615l6240j5752M114l2763
16768D14996K0149N7616M8078K4242k4521l2923q838j586m1710j04340R72L1049
16756C83184N0081o149L7449l4621j9693k5950l1157L7194k869M092o821K5289
16744D10029J6268K4982o847J4165N698K4120P2125o515m4367k7185K1937L8425
16732E42835q774r058k882k9643l611J1231m7028K6706N1200L7956K1465l2852
16720E57545l6266j7674J8515N6725Q98n9316q2256r711K8659J07103O8829l8661
$$ plain form
16708 594390 571654 558793 598584 596084 542766 550306 577076 639443 719756 770808 860027 963313
16696 963313 1077033 1141046 1193078 1258567 1204161 1089536 986281 873668 818415 763233 727183
16685 727183 744809 739813 718569 672475 689184 737883 725199 707504 686154 692791 691263 609393
16673 609393 533129 540628 589361 648083 609898 623451 627185 626857 614071 604905 615709 571537
16661 571537 553982 572584 577482 599424 617056 636894 603726 577087 568913 552704 566574 532327
16649 532327 480452 485069 493501 525590 555233 548960 606414 607249 553780 565626 608324 651378
16637 651378 638074 590965 550854 530595 510251 513062 517995 517147 492169 473199 462564 485919
16625 485919 539212 616402 644139 654187 640906 694016 679553 681058 667722 706032 768935 770904
$$ packed form
16708E94390k2736j2861L9791k500n3318P540K6770O2367Q0313N1052Q9219J03286
16696I63313J13720O4013N2032O5489n4406j14625j03255j12613n5253n5182l6050
16685G27183J7626m996k1244m6094J6709M8699j2684j7695k1350O637j528q1870
16673F09393p6264P499M8733N8722l8185J3553L734l28j2786r166J0804m4172
16661E71537j7555J8602M898K1942J7632J9838l3168k6639q174j6209J3870l4247
16649E32327n1875M617Q432L2089K9643o273N7454Q35n3469J1846M2698M3054
16637F51378j3304m7109m0111k0259k0344K811M933q48k4978j8970j0635K3355
16625D85919N3293P7190K7737J0048j3281N3110j4463J505j3336L8310O2903J969
$$ plain form
16613 770904 726710 690303 688031 673776 681412 717660 740756 714366 740543 818460 861421 762481
16601 762481 703666 699915 689572 739627 843660 870027 842523 794787 761266 753379 793518 775062
16589 775062 741427 719185 733794 781904 778699 769740 812091 866425 935822 952584 954673 933426
16577 933426 973529 1042501 1075033 1075786 1122043 1105073 1134658 1139328 1141950 1178917 1194883 1238474
16565 1238474 1270444 1280350 1232702 1228438 1277494 1290143 1319014 1326142 1250472 1267137 1253805 1238271
16553 1238271 1224039 1246298 1264235 1279905 1262868 1288722 1357069 1370015 1365393 1439482 1532490
16542 1532490 1603695 1595210 1546689 1496132 1480270 1424798 1452859 1495867 1543605 1565242 1618507
16531 1618507 1697865 1717250 1750604 1773576 1787419 1874453 1937051 1961782 1977356 1903610 1880464
$$ packed form
16613G70904m4194l6407k272j4255P636L6248K3096k6390K6177P7917M2961r8940
16601G62481n8815l751j0343N0055J04033K6367k7504m7736l3521p887M0139j8456
16589G75062l3635k2242J4609M8110l205q959M2351N4334O9397J6762K089k1247
16577I33426M0103O8972L2532P53M6257j6970K9585M670K622L6967J5966M3591
16565A238474L1970R906m7648m264M9056J2649K8871P128p5670J6665j3332j5534
16553A238271j4232K2259J7937J5670j7037K5854O8347J2946m622P4089R3008
16542A532490P1205q485m8521n0557j5862n5472K8061M3008M7738K1637N3265
16531A618507P9358J9385L3354K2972J3843Q7034O2598K4731J5574p3746k3146
$$ plain form
16520 1880464 1948570 1997134 1990270 2087874 2122141 2214648 2269868 2309872 2338725 2371049 2430095
16509 2430095 2574564 2615306 2604581 2601266 2668295 2763088 2926234 3010138 3059304 3211330 3361888
16498 3361888 3443061 3461958 3560462 3693137 3734474 3724291 3847814 3961531 4072619 4117807
16488 4117807 4169492 4378516 4574872 4718750 4822941 4880985 4921413 5026014 5246501 5440203
16478 5440203 5545129 5699967 5873364 6055557 6268728 6493411 6718194 6962463 7233785
16469 7233785 7506058 7707545 7931132 8283164 8674954 9021728 9361879 9731679 10162564
16460 10162564 10607863 11112511 11679802 12221121 12871503 13586889 14287878 15031294 15874291
16451 15874291 16815108 17842663 18821854 19893441 21089885 22342830 23660425 25086831
$$ packed form
16520A880464O8106M8564o864R7604L4267R2507N5220M0004K8853L2324N9046
16509B430095J44469M0742j0725l315O7029R4793J63146Q3904M9166J52026J50558
16498C361888Q1173J8897R8504J32675M1337j0183J23523J13717J11088M5188
16488D117807N1685K09024J96356J43878J04191N8044M0428J04601K20487J93702
16478E440203J04926J54838J73397J82193K13171K24683K24783K44269K71322
16469G233785K72273K01487K23587L52032L91790L46774L40151L69800M30885
16460A0162564M45299N04648N67291N41319O50382P15386P00989P43416Q42997
16451A5874291R40817J027555R79191J071587J196444J252945J317595J426406
$$ plain form
16443 25086831 26636652 28284602 30089090 32152071 34341260 36762027 39381204 42182140
16435 42182140 45294613 48763078 52471862 56477039 60854635 65611008 70768836 76304226
16427 76304226 82235995 88533926 95146858 101993762 108831776 115524483 121859890 127490565
16419 127490565 132203076 135794014 137942719 138585022 137757117 135522992 131908909 127207416
16411 127207416 121733036 115564711 109040623 102394314 95778907 89384890 83301520 77524487
16403 77524487 72100514 67040803 62403460 58134418 54135967 50471670 47090437 44034637
16395 44034637 41170965 38523955 36134031 33948667 31950713 30128137 28357797 26760890
16387 26760890 25327028 23959694 22701982 21547752 20395925 19329760 18369159 17504395
$$ packed form
16443B5086831J549821J647950J804488K062981K189189K420767K619177K800936
16435D2182140L112473L468465L708784M005177M377596M756373N157828N535390
16427G6304226N931769O297931O612932O846904O838014O692707O335407N630675
16419A27490565M712511L590938K148705O42303q27905k234125l614083m701493
16411A27207416n474380o168325o524088o646309o615407o394017o083370n777033
16403G7524487n423973n059711m637343m269042l998451l664297l381233l055800
16395D4034637k863672k647010k389924k185364j997954j822576j770340j596907
16387B6760890j433862j367334j257712j154230j151827j066165r60601q64764
$$ plain form
16379 17504395 16771687 16023678 15345164 14676408 14030378 13443203 12915429 12388964 11926408
16370 11926408 11464588 11015916 10616402 10191104 9787113 9456315 9134010 8844001 8582050
16361 8582050 8338109 8092507 7875160 7596749 7256216 7043745 6885501 6655609 6438123
16352 6438123 6243075 6071412 5962940 5782202 5650418 5534813 5401887 5294103 5097370
16343 5097370 4919725 4825614 4755103 4668823 4582344 4493464 4421751 4302125 4253960 4170356 4073763
16332 4073763 3990447 3867549 3788940 3663583 3567155 3495640 3494586 3442800 3366350 3324544 3248397
16321 3248397 3150960 3080962 3027433 3004880 2921679 2866045 2863758 2887643 2873926 2790800 2711426
16310 2711426 2740263 2717683 2610070 2539736 2463261 2408877 2370646 2330375 2307098 2300635 2311489
$$ packed form
16379A7504395p32708p48009o78514o68756o46030n87175n27774n26465m62556
16370A1926408m61820m48672l99514m25298m03991l30798l22305k90009k61951
16361H582050k43941k45602k17347k78411l40533k12471j58244k29892k17486
16352F438123j95048j71663j08472j80738j31784j15605j32926j07784j96733
16343E097370j77645r4111p0511q6280q6479q8880p1713j19626m8165q3604r6593
16332D073763q3316j22898p8609j25357r6428p1515j054n1786p6450m1806p6147
16321C248397r7437o9998n3529k2553q3201n5634k287K3885j3717q3126p9374
16310B711426K8837k2580j07613p0334p6475n4384l8231m0271k3277o463J0854
$$ plain form
16299 2311489 2295242 2202846 2098309 2059841 2050822 2044846 2015078 2007285 2033348 2021777 1971342 1966543
16287 1966543 1925990 1865018 1821809 1761264 1814254 1803123 1712559 1654169 1618124 1657670 1698822
16276 1698822 1682742 1650933 1603782 1533440 1459711 1437780 1445225 1440007 1484429 1445207 1434302 1444171
16264 1444171 1397780 1363312 1358058 1323494 1269484 1252302 1290372 1282244 1254706 1192110 1179837 1182475
16252 1182475 1195727 1192034 1222485 1267421 1333310 1320193 1252733 1197671 1151810 1179312 1157107
16241 1157107 1150219 1135866 1108813 1059746 1107556 1175008 1130288 1046281 1136153 1182911 1169010
16230 1169010 1109204 1066065 1056819 1072607 1065899 1061706 1066301 1007832 1007494 1067536 1050079 1043562 1062467
16217 1062467 1025933 1010786 1039773 1084368 1103922 1091615 1084610 1105560 1152122 1168560 1166251 1155582
$$ packed form
16299B311489j6247r2396j04537l8468r019n976k9768p793K6063j1571n0435m799
16287A966543m0553o0972m3209o0545N2990j1131r0564n8390l6045L9546M1152
16276A698822j6080l1809m7151p0342p3729k1931P445n218M4422l9222j0905R869
16264A444171m6391l4468n254l4564n4010j7182L8070q128k7538o2596j2273K638
16252A182475J3252l693L0451M4936O5889j3117o7460n5062m5861K7502k2205
16241A157107o888j4353k7053m9067M7810O7452m4720q4007Q9872M6758j3901
16230A169010n9806m3139r246J5788o708m193M595n8469l38O0042j7457o517J8905
16217A062467l6534j5147K8987M4595J9554j2307p005K0950M6562J6438k309j0669
$$ plain form
16205 1155582 1195553 1242370 1273645 1326441 1400756 1448703 1516919 1573862 1568745 1583286 1640000
16194 1640000 1713999 1758724 1764431 1757815 1733571 1760413 1736182 1707029 1725147 1741936 1661954 1587441
16182 1587441 1492679 1390538 1309834 1286631 1279411 1261400 1188565 1150260 1159056 1152859 1137046 1091553
16170 1091553 1019554 934006 868107 835153 857193 854242 843905 843887 829762 829053 801988 710828
16158 710828 706434 717491 702293 671695 731373 755794 735474 763783 762302 711693 703040 728846
16146 728846 765508 801438 846066 901113 994548 1116797 1246663 1286929 1279733 1231385 1164659
16135 1164659 1091783 966593 817756 699212 598104 578735 639004 595474 565111 578314
16125 578314 543687 508566 475560 432428 408390 455546 478035 545108 538382 533488 475714 444336
$$ packed form
16205A155582L9971M6817L1275N2796P4315M7947O8216N6943n117J4541N6714
16194A640000P3999M4725N707o616k4244K6842k4231k9153J8118J6789p9982p4513
16182A587441r4762j02141q0704k3203p220j8011p2835l8305Q796o197j5813m5493
16170A091553p1999q5548o5899l2954K2040k951j0337j8j4125p09k7065r1160
16158G10828m394J1057j5198l0598N9678K4421k0320K8309j481n0609q653K5806
16146G28846L6662L5930M4628N5047R3435J22249J29866M0266p196m8348o6726
16135A164659p2876j25190j48837j18544j01108j9369O0269m3530l0363J3203
16125E78314l4627l5121l3006m3132k4038M7156K2489O7073o726m894n7774l1378
$$ plain form
16113 444336 503283 525392 514087 497114 476976 493534 509281 507389 530386 515039 503850 529334
16101 529334 458547 408991 398435 393407 393663 481955 498851 504412 526781 526714 502596 502895 507521
16088 507521 506414 512484 471332 439267 443018 442486 456369 442021 427236 461155 462480 454190 429198
16075 429198 433144 402964 411985 412071 392868 378043 352443 362727 365901 342731 405309 371682 336301
16062 336301 365193 360433 353235 318891 347621 376349 383954 414630 416223 356731 311344 331179
16050 331179 361962 401108 431297 452524 453671 491587 429217 360019 379537 415975 433811 440555
16038 440555 432527 473917 458017 460793 467054 371052 354623 414819 435013 413154 364282 322842
16026 322842 273179 319615 339330 383124 401071 383281 316755 337550 360563 326154 314095
$$ packed form
16113D44336N8947K2109j1305j6973k0138J6558J5747j892K2997j5347j1189K5484
16101E29334p0787m9556j0556n028K56Q8292J6896N561K2369o7k4118K99M626
16088E07521j107O070m1152l2065L751n32J3883j4348j4785L3919J325q290k4992
16075D29198L946l0180R021Q6j9203j4825k5600J0284L174k3170O2578l3627l5381
16062C36301K8892m760p198l4344K8730K8728P605L0676J593n9492m5387J9835
16050C31179L0783L9146L0189K1227J147L7916o2370o9198J9518L6438J7836O744
16038D40555q028M1390j5900K776O261r6002j6429O0196K0194k1859m8872m1440
16026C22842m9663M6436J9715M3794J7947j7790o6526K0795K3013l4409j2059
$$ plain form
16015 314095 353570 357611 372227 381747 364958 401822 401871 406243 411137 434213 414848 350224 367252
16002 367252 387806 387403 380818 360819 354737 338728 355188 396678 349607 310599 321281 322417
15990 322417 358332 354868 367309 399895 413751 413708 417487 387060 341732 360173 342563 333070 315124
15977 315124 298388 281714 321539 309764 307667 303645 268400 251323 278178 260999 277865 313260
15965 313260 347136 378118 381077 351031 340135 313648 345145 362898 340156 329246 331161 304882
15953 304882 336092 338637 279216 268556 303598 350806 364157 369354 391862 309098 310005 332626
15941 332626 343317 372534 334737 281060 285490 358799 357845 385410 380878 302962 326803 370588
15929 370588 346079 327047 321895 308761 305116 281070 236245 226959 259209 297639 259453 268129
$$ packed form
16015C14095L9475M041J4616R520j6789L6864M9M372M894K3076j9365o4624J7028
16002C67252K0554m03o585j9999o082j6009J6460M1490m7071l9008J0682J136
15990C22417L5915l464J2441L2586J3856m3L779l0427m5328J8441j7610r493j7946
15977C15124j6736j6674L9825j1775k097m022l5245j7077K6855j7179J6866L5395
15965C13260L3876L0982K959l0046j0896k6487L1497J7753k2742j0910J915k6279
15953C04882L1210K545n9421j0660L5042M7208J3351N197K2508q2764R07K2621
15941C32626J0691K9217l7797n3677M430P3309r54K7565m532p7916K3841M3785
15929C70588k4509j9032n152j3134l645k4046m4825r286L2250L8430l8186Q676
$$ plain form
15917 268129 320694 339717 310881 248952 242637 239163 241391 181764 185946 229645 234020 279063
15905 279063 278680 295861 289056 281717 237605 254171 261353 256034 264517 267858 267957 358189 414792 371112
15891 371112 324864 319209 345214 341684 336543 359279 312319 271269 260733 259256 326720 403388
15879 403388 397037 391020 442400 474411 429812 389313 411944 414920 426396 443642 423638 409449
15867 409449 362513 367833 368825 328089 319344 269908 251246 265594 273145 226883 205609 250800
15855 250800 313257 321704 291619 281689 282575 290264 245301 264930 263397 268325 271549 275192 247792
15842 247792 225274 259490 254268 221810 231317 232250 236227 249109 246097 242721 245038 249904 245498
15829 245498 238925 287097 253978 224014 227173 264717 312508 317693 275096 264194 268228 321030
$$ packed form
15917B68129N2565J9023k8836o1929o315l474K228n9627M182M3699M375M5043
15905B79063l83J7181o805p339m4112J6566P182n319Q483L341R9R0232N6603m3680
15891C71112m6248n655K6005l530n141K2736m6960m1050j0536j477O7464P6668
15879D03388o351o017N1380L2011m4599m0499K2631K976J1476J7246k0004j4189
15867D09449m6936N320R92m0736q745m9436j8662J4348P551m6262k1274M5191
15855B50800O2457Q447l0085r930Q86P689m4963J9629j533M928L224L643k7400
15842B47792k2518L4216n222l2458R507R33L977J2882l012l376K317M866m406
15829B45498o573M8172l3119k9964L159L7544M7791N185m2597j0902M034N2802
$$ plain form
15817 321030 310547 289121 248371 246072 294008 297487 229084 160206 143389 179223 175431 201035
15805 201035 241165 244444 241038 243876 267100 263895 246424 226650 211770 177077 171104 169063 141355
15792 141355 143483 143740 136081 134734 144788 128535 161602 222298 292410 320399 314111 286882 247807
15779 247807 235194 205793 241908 298725 328114 318801 315851 310708 326444 335211 331764 353878
15767 353878 389003 423501 451396 504554 517484 514607 512416 554470 608936 678147 751857 719640
15755 719640 713328 795067 855057 927668 1071134 1132541 1167213 1166536 1236434 1297514 1361860 1369581
15743 1369581 1308466 1212977 1120661 1088320 1034441 996364 952965 847435 818270 821303 777038
15732 777038 681662 596108 572627 570431 478819 427046 417377 437829 415252 434148 431459 376144
$$ packed form
15817C21030j0483k1426m0750k299M7936L479o8403o8878j6817L5834l792K5604
15805B01035M0130L279l406K838K3224l205j7471j9774j4880l4693n973k041k7708
15792A41355K128K57p659j347J0054j6253L3067O0696P0112K7989o288k7229l9075
15779B47807j2613k9401L6115N6817K9389r313k950n143J5736Q767l447K2114
15767C53878L5125L4498K7895N3158J2930k877k191M2054N4466O9211P3710l2217
15755G19640o312Q1739N9990P2611J43466O1407L4672o77O9898O1080O4346P721
15743A369581o1115r5489r2316l2341n3879l8077m3399j05530k9165L033m4265
15732G77038r5376q5554k3481k196r1612n1773r669K0452k2577J8896k689n5315
$$ plain form
15720 376144 331030 317503 361885 325403 281238 283909 224981 263961 309642 313508 304447 265039
15708 265039 200682 192270 176117 228439 257934 297799 263867 234749 263794 292720 272899 240970
15696 240970 201079 260810 309388 308952 219998 180573 253652 285733 261405 229037 234745 281992
15684 281992 309153 304297 228271 230450 241510 216203 179883 143532 113250 153307 216271 219706
15672 219706 151994 206980 192572 227829 251485 220758 259869 291297 244029 238949 207629 228104
15660 228104 242175 233815 142764 156581 238501 281437 268778 294123 287622 266629 294764 293144
15648 293144 292179 234541 200608 219529 224483 149057 104425 63149 23474 47399 99195 66117
15636 66117 99477 107711 115315 129876 104926 89487 80983 45725 107148 132926 109430 119220
$$ packed form
15720C76144m5114j3527M4382l6482m4165K671n8928L8980M5681L866r061l9408
15708B65039o4357q412j6153N2322K9495L9865l3932k9118K9045K8926j9821l1929
15696B40970l9891N9731M8578m36q8954l9425P3079L2081k4328l2368N708M7247
15684B81992K7161m856p6026K179J1060k5307l6320l6351l0282M0057O2964L435
15672B19706o7712N4986j4408L5257K3656l0727L9111L1428m7268n080l1320K0475
15660B28104J4071q360r1051J3817Q1920M2936j2659K5345o501k0993K8135j620
15648B93144r65n7638l3933J8921M954p5426m4632m1276l9675K3925N1796l3078
15636F6117L3360Q234P604J4561k4950j5439q504l5258O1423K5778k3496R790
$$ plain form
15624 119220 113801 97421 111609 185392 145334 188646 244178 230983 183439 141819 129074 124185
15612 124185 87465 105324 117539 129768 144606 169151 177931 161293 131943 189015 244686 290370
15600 290370 278812 235334 167395 132477 170963 181570 174004 201978 235206 269247 201755 137918
15588 137918 98183 75984 67274 100329 92645 85851 133331 112186 98356 160480 226434 254446
15576 254446 180240 148606 107123 123755 167076 178288 152781 117393 137772 205716 181584
15565 181584 146510 168957 158048 78635 72275 89086 78513 112571 131926 128704 90846 95670
15553 95670 118223 125147 115085 50850 3659 85506 96328 76109 151019 225684 242698 243129
15541 243129 208944 183860 206295 150103 125104 158756 218446 250933 229160 167169 177514
$$ packed form
15624A19220n419j6380J4188P3783m0058M3312N5532j3195m7544m1620j2745m889
15612A24185l6720J7859J2215J2229J4838K4545Q780j6638k9350N7072N5671M5684
15600B90370j1558m3478o7939l4918L8486J0607p566K7974L3228L4041o7492o3837
15588A37918l9735k2199q710L3055p684o794M7480k1145j3830O2124O5954K8012
15576B54446p4206l1634m1483J6632M3321J1212k5507l5388K0379O7944k4132
15565A81584l5074K2447j0909p9413o360J6811j0573L4058J9355l222l7858M824
15553I5670K2553O924j0062o4235m7191Q1847J0822k0219P4910P4665J7014M31
15541B43129l4185k5084K2435n6192k4999L3652N9690L2487k1773o1991J0345
$$ plain form
15530 177514 167246 128804 85471 68987 120407 104996 129687 152793 131068 105067 46957
15519 46957 -2025 72808 96796 79338 90279 94703 67073 92020 146910 205725 149822 77652
15507 77652 114214 162092 119791 76791 84950 103710 132927 136938 160021 155309 93714 127645
15495 127645 156545 178282 185383 157203 158676 141308 157630 107916 125515 126666 119479 130530
15483 130530 166388 157473 105657 48030 32888 77652 108292 100328 96231 57188 -10664 -18518
15471 -18518 22697 41438 32863 19255 1919 28180 53453 136958 161409 123757 87648 67647
15459 67647 43123 53593 50356 69523 75125 74975 69649 88936 57400 5047 21899 40869 -28738
15446 -28738 -58957 -54568 -43641 3297 33730 37604 19263 61286 105788 72525 82172 116523
$$ packed form
15530A77514j0268l8442m3333j6484N1420j5411K4691K3106k1725k6001n8110
15519D6957m8982P4833K3988j7458J0941M424k7630K4947N4890N8815n5903p2170
15507G7652L6562M7878m2301m3000Q159J8760K9217M011K3083m712o1595L3931
15495A27645K8900K1737P101k8180J473j7368J6322m9714J7599J151p187J1051
15483A30530L5858q915n1816n7627j5142M4764L0640p964m097l9043o7852p854
15471a8518M1215J8741q575j3608j7336K6261K5273Q3505K4451l7652l6109k0001
15459F7647k4524J0470l237J9167N602j50n326J9287l1536n2353J6852J8970o9607
15446b8738l0219M389J0927M6938L0433L874j8341M2023M4502l3263R647L4351
$$ plain form
15434 116523 154125 96227 131593 136954 131966 185720 240906 173946 163514 167765 158066 168365
15422 168365 161761 141282 146587 129312 52689 27830 19691 -5173 4883 72752 149866 174445
15410 174445 163784 153445 140589 123447 114938 86630 120513 127857 149039 154537 120529 106383
15398 106383 74845 97411 72029 93051 140802 170925 177057 118700 50171 -12200 35056 121963
15386 121963 144299 164163 157480 151945 141995 105311 136370 137229 121181 137670 150141 82480
15374 82480 114703 135225 149222 121930 3571 50343 151205 183710 152717 122978 124796
15363 124796 121413 85454 85113 5553 -29978 59114 128036 150267 141715 109791 84303 37665
15351 37665 51418 94374 84580 41688 17344 34360 23011 38611 49924 82334 122358 113590
$$ packed form
15434A16523L7602n7898L5366N361m988N3754N5186o6960j0432M251r699J0299
15422A68365o604k0479N305j7275p6623k4859q139k4864J0056O7869P7114K4579
15410A74445j0661j0339j2856j7142q509k8308L3883P344K1182N498l4008j4146
15398A06383l1538K2566k5382K1022M7751L0123O132n8357o8529o2371M7256Q6907
15386A21963K2336J9864o683n535r950l6684L1059Q59j6048J6489J2471o7661
15374H2480L2223K0522J3997k7292j18359M6772J00862L2505l0993k9739J818
15363A24796l383l5959l41p9560l5531Q9092O8922K2231q552l1924k5488m6638
15351C7665J3753M2956r794m2892k4344J7016j1349J5600J1313L2410M0024q768
$$ plain form
15339 113590 67058 45511 43154 34088 56079 112079 102007 117908 164932 115430 77704 99291
15327 99291 88218 52735 41575 54972 67865 105723 48312 18353 21949 42844 50741 53913
15315 53913 91731 102929 69211 17198 20414 31082 37639 105541 96257 34252 31068 -18700
15303 -18700 -40803 -5514 47713 50875 90946 79550 81198 106003 133648 110142 63811 3198
15291 3198 26281 33010 47053 70407 36788 3192 16246 39315 103557 130395 108965 53357
15279 53357 5231 31786 33417 2525 -33811 -32207 -19866 46140 98929 85521 77013 69454
15267 69454 53208 29575 13499 10795 31954 61629 91793 136083 80493 51043 82136 68828
15255 68828 90262 96941 53351 36556 67431 52756 43817 52733 32962 37487 34547 12137 -24547
$$ packed form
15339A13590m6532k1547k357r066K1991N6000j0072J5901M7024m9502l7726K1587
15327I9291j1073l5483j1160J3397J2893L7858n7411k9959L596K0895P897L172
15315E3913L7818J1198l3718n2013L216J0668O557O7902r284o2005l184m9768
15303a8700k2103L5289N3227L162M0071j1396J648K4805K7645k3506m6331o0613
15291C198K3083O729J4043K3354l3619l3596J3054K3069O4242K6838k1430n5608
15279E3357m8126K6555J631l0892l6336J604J2341O6006N2789j3408q508p559
15267F9454j6246k3633j6076k704K1159K9675L0164M4290n5590k9450L1093j3308
15255F8828K1434O679m3590j6795L0875j4675q939Q916j9771M525k940k2410l6684
$$ plain form
15242 -24547 -23481 15549 53915 74360 9040 23812 26697 17324 95443 205772 151364 78601
15230 78601 50600 40038 79414 62475 39774 8765 34339 103833 104976 57843 94871 109948
15218 109948 69137 65430 47947 52327 -6119 -9354 106208 101480 65105 50680 145013 188822
15206 188822 146226 97129 79313 138745 120529 57217 -1766 -9347 -3584 67825 85011 15439
15194 15439 1477 1411 -6422 -22713 -10918 -27716 -6465 -21334 -87130 -55641 -18755 -17476 -68394
15181 -68394 -72811 -2015 78919 135538 148195 89436 79088 76036 30435 -13327 -2451 49354
15169 49354 32157 -28970 -48312 -15615 26236 27803 31818 -36119 -59102 -63291 15206 83516
15157 83516 130587 143029 123992 89896 43418 88287 164139 174155 111783 42487 65368 73723
$$ packed form
15242b4547J066L9030L8366K0445o5320J4772K885r373P8119J10329n4408p2763
15230G8601k8001j0562L9376j6939k2701l1009K5574O9494J143m7133L7028J5077
15218A09948m0811l707j7483M380n8446l235J15562m728l6375j4425R4333M3809
15206A88822m2596m9097j7816N9432j8216o3312n8983p581N763P1409J7186o9572
15194A5439j3962o6p833j6291J1795j6798K1251j4869o5796L1489L6886J279n0918
15181f8394m417P0796Q0934N6619J2657n8759j0348l052m5601m3762J0876N1805
15169D9354j7197o1127j9342L2697M1851J567M015o7937k2983m189P8497O8310
15157H3516M7071J2442j9037l4096m6478M4869P5852J0016o2372o9296K2881Q355
$$ plain form
15145 73723 44370 1193 -20478 -34896 10375 88672 74262 58574 91602 110176 116518 130435
15133 130435 163455 143884 162916 173271 181171 144633 81127 102837 71574 13591 87912 78967
15121 78967 25853 -3216 36542 89375 133655 81494 37705 15839 7719 -1437 88705 81978
15109 81978 37207 -5 -11324 9329 3466 22242 19547 8826 -4153 -11236 -34193 8631
15097 8631 49308 57893 36082 11700 -4821 -27708 23417 76400 144748 176185 146427 90550
15085 90550 47918 60795 22842 -49197 9615 -3009 -30604 -9848 -25080 15504 112427 90589
15073 90589 40297 59001 58960 50543 35992 27903 31891 -34059 -99520 -113476 -85055 -64132 -39908
15060 -39908 -26890 11303 60973 65253 29412 39925 98041 99061 25422 -20216 -82362 -109592
$$ packed form
15145G3723k9353m3177k1671j4418M5271P8297j4410j5688L3028J8574O342J3917
15133A30435L3020j9571J9032J0355P900l6538o3506K1710l1263n7983P4321q945
15121G8967n3114k9069L9758N2833M4280n2161m3789k1866q120r156R0142o727
15109H1978m4771l7212j1319K0653n863J8776k695j0721j2979p083k2957M2824
15097H631M0677Q585k1811k4382j6521k2887N1125N2983O8348L1437k9758n5877
15085I0550m2632J2877l7953p2039N8812j2624k7595K0756j5232M0584R6923k1838
15073I0589n0292J8704m1q417j4551q089L988o5950o5461j3956K8421K0923K4224
15060c9908J3018L8193M9670M280l5841J0513N8116J020p3639m5638o2146k7230
$$ plain form
15048 -109592 -74104 -51547 -16999 14778 55588 44761 79506 59001 67631 -28503 -64033 -24394
15036 -24394 24519 81481 94359 67331 73338 100699 79172 77106 67680 17829 -49080 -85895
15024 -85895 -65837 -14660 193 46471 62515 13088 -26690 28680 95804 96063 110050 62843
15012 62843 57385 60646 47675 68156 34675 6839 49083 46932 40991 32909 -1293 38162 83233
14999 83233 107562 99538 131354 166277 131548 77135 71075 137736 140710 179261 187124 142246
14987 142246 85336 90851 114753 152333 159936 111469 28761 2568 42707 49456 62915 44932
14975 44932 7322 10107 23594 11901 18182 39152 66310 112921 132913 89042 92091 25411
14963 25411 -50981 -30427 42734 54298 32101 68086 86881 61500 29021 62138 106562 78338
$$ packed form
15048a09592L5488K2557L4548L1777M0810j0827L4745k0505Q630r6134l5530L9639
15036b4394M8913N6962J2878k7028O007K7361k1527k066r426m9851o6909l6815
15024h5895K0058N1177J4853M6278J6044m9427l9778N5370O7124K59J3987m7207
15012F2843n458L261j2971K0481l3481k7836M2244k151n941q082l4202L9455M5071
14999H3233K4329q024L1816L4923l4729n4413o060O6661K974L8551P863m4878
14987A42246n6910N515K3902L7580P603m8467q2708k6193M0139O749J3459j7983
14975D4932l7610K785J3487j1693O281K0970K7158M6611J9992m3871L049o6680
14963B5411p6392K0554P3161J1564k2197L5985J8795k5381l2479L3117M4424k8224
$$ plain form
14951 78338 71494 104553 77877 70418 58711 61060 57811 40118 43978 64710 29588 1754 22581
14938 22581 28944 25302 34559 8588 -31250 -78272 -80792 -48117 -3740 -20034 -33186 -49331
14926 -49331 9263 29173 25946 39231 97819 95928 101225 37375 28438 -18978 -10305 68343 95072
14913 95072 96480 93701 120179 115485 146082 119470 61191 17695 78950 82838 73042 69664 52457
14900 52457 9773 3723 33241 13297 18470 7411 21852 32817 41731 55839 50702 48547 81165
14887 81165 76481 21577 31260 58354 19931 -830 5828 2156 9666 18729 -26143 -3485 -11903
14874 -11903 -62188 -33494 17344 577 19099 36552 35320 -25121 1816 89564 133183 89696
14862 89696 34959 18414 73840 79887 86378 94253 111229 92276 18917 25311 60612 3310
$$ packed form
14951G8338o844L3059k6676p459j1707K349l249j7693L860K0732l5122k7834K0827
14938B2581O363l642R257k5971l9838m7022k520L2675M4377j6294j3152j6145
14926d9331N8594J9910l227J3285N8588j891N297o3850q937m7416Q673P8648K6729
14913I5072J408k779K6478m694L0597k6612n8279m3496O1255L888r796l378j7207
14900E2457m2684o050K9518j9944N173j1059J4441J0965Q914J4108n137k155L2618
14887H1165m684n4904R683K7094l8423k0761O658l672P510R063m4872K2658q418
14874a1903n0285K8694N0838j6767J8522J7453j232o0441K6937Q7748M3619m3487
14862H9696n4737j6545N5426O047O491P875J6976j8953p3359O394L5301n7302
$$ plain form
14850 3310 4243 19982 46337 68335 74098 49509 32156 47308 -8050 3010 10457 54173 47512
14837 47512 -31020 -58684 -21366 -27011 8004 7523 -32451 -51909 -30298 35641 82280 67730
14825 67730 65841 82637 75302 69616 89257 105109 92060 74502 25682 -40773 -50558 -38801
14813 -38801 529 -11603 63233 71295 24413 12755 65786 147338 131212 90462 55329 -4355
14801 -4355 17176 40408 51275 94157 123807 128403 107101 101158 34736 -37014 -37200 -34157 -13139
14788 -13139 -1548 -6186 -725 39325 33196 44340 62462 110519 43771 -9232 22706 65455
14776 65455 126489 123347 31636 -14004 7022 27246 75716 82551 50792 56169 18031 -25313
14764 -25313 -578 40646 35464 32762 -12640 -20969 -16362 71521 81886 46340 92809 110127
$$ packed form
14850C310R33J5739K6355K1998N763k4589j7353J5152n5358J1060P447M3716o661
14837D7512p8532k7664L7318n645L5015m81l9974j9458K1611O5939M6639j4550
14825F7730j889J6796p335n686J9641J5852j3049j7558m8820o6455r785J1757
14813c8801L9330j2132P4836Q062m6882j1658N3031Q1552j6126m0750l5133n9684
14801d355K1531K3232J0867M2882K9650M596k1302n943o6422p1750j86L043K1018
14788a3139J1591m638N461M0050o129J1144J8122M8057o6748n3003L1938M2749
14776F5455O1034l142r1711m5640K1026K0224M8470O835l1759N377l8138m3344
14764b5313K4735M1224n182k702m5402q329M607Q7883J0365l5546M6469J7318
$$ plain form
14752 110127 69817 89268 89146 76944 77531 86111 59041 49306 15726 7985 -29156 -23879 18168
14739 18168 -45015 -40447 -17924 -11381 -15874 -25700 -23889 -14660 -69740 -84865 -148809 -141336 -95267
14726 -95267 -123207 -106970 -40898 17430 29900 29920 17264 -5968 -6244 -6092 -48179 18784 45046
14713 45046 76570 60038 -1898 -9912 13500 48197 99235 61424 53433 17906 -59712 -35108
14701 -35108 32582 83519 54093 45914 28529 37996 75785 84093 115428 109412 148000 166689
14689 166689 107446 130191 88431 57517 2614 -52226 -29341 3716 11714 -42620 -41145 -19399
14677 -19399 18795 17016 42043 38133 124640 128638 134482 107407 56940 95435 130754 158482
14665 158482 135359 125072 97590 22539 15937 31202 23357 647 -2318 17939 70128 22421
$$ packed form
14752A10127m0310J9451j22j2202N87Q580k7070r735l3580p741l7141N277M2047
14739A8168o3183M568K2523O543m493r826J811R229n5080j5125o3944P473M6069
14726i5267k7940J6237O6072N8328J2470K0j2656k3232k76J52m2087O6963K6262
14713D5046L1524j6532o1936q014K3412L4697N1038l7811p991l5527p7618K4604
14701c5108O7690N0937k9426q179j7385R467L7789Q308L1335o016L8588J8689
14689A66689n9243K2745m1760l0914n4903n4840K2885L3057P998n4334J475K1746
14677a9399L8194j779K5027l910Q6507L998N844k7075n0467L8495L5319K7728
14665A58482k3123j0287k7482p5051o602J5265p845k2710k965K0257N2189m7707
$$ plain form
14653 22421 51353 55801 47679 22733 7457 21094 55592 20283 -52735 -79703 -58272 -63442
14641 -63442 -31334 -22406 -75098 -39250 22854 22731 -40286 -62282 -97768 -64565 -17795 -26126
14629 -26126 -41104 83117 99246 37707 61245 33209 14683 -4658 18510 -2468 -17782
14618 -17782 14611 15471 28093 63908 56235 15065 -11220 -66840 -53741 6198 76543 -5697
14606 -5697 -36140 -48517 -9407 -15931 -39909 -22499 -4433 -3044 81814 106134 100717 59038
14594 59038 51243 40215 12545 9692 29741 -4458 -25243 71985 98591 69421 93177 114109
14582 114109 90431 121751 120846 86110 48191 -33317 -12535 3028 17149 -26798 -98680 -99458
14570 -99458 -44012 3811 -9008 -37847 -77968 -75065 -46492 25909 56280 62085 11340 19078
$$ packed form
14653B2421K8932M448q122k4946j5276J3637L4498l5309p3018k6968K1431n170
14641f3442L2108Q928n2692L5848O2104j23o3017k1996l5486L3203M6770q331
14629b6126j4978J24221J6129o1539K3538k8036j8526j9341K3168k0978j5314
14618a7782L2393Q60J2622L5815p673m1170k6285n5620J3099N9939P0345q2240
14606e697l0443j2377L9110o524k3978J7410J8066J389Q4858K4320n417m1679
14594E9038p795j1028k7670k853K0049l4199k0785R7228K6606k9170K3756K0932
14582A14109k3678L1320r05l4736l7919q1508K0782J5563J4121m3947p1882p78
14570i9458N5446M7823j2819k8839m0121K903K8573P2401L0371N805n0745P738
$$ plain form
14558 19078 47037 9629 59048 108176 109508 88941 66202 26684 13140 138 12239 82185
14546 82185 52125 36800 39042 32064 4076 -19013 -31389 -56481 -87010 -17673 6243 -16779
14534 -16779 -10094 3087 43969 102832 104716 94136 38889 12618 9547 17333 -7759 -16838 21034
14521 21034 24118 28222 66745 18498 -4972 6105 23993 32681 22649 -15770 -3511 64400
14509 64400 75536 38650 -6911 14531 54656 74406 45806 27834 55715 115648 110279 108875
14497 108875 19795 -4157 32496 21710 72354 118745 76636 47132 28625 70933 59601
14486 59601 66788 45284 40690 -16053 -11302 -5946 23157 2369 -5293 19579 38185 53394 23216
14473 23216 -8587 -36103 -36081 -27553 -24430 -36926 -64476 -122314 -139848 -118552 -1979 56362
$$ packed form
14558A9078K7959l7408M9419M9128J332k0567k2739l9518j3544j3002J2101O9946
14546H2185l0060j5325K242o978k7988k3089j2376k5092l0529O9337K3916k3022
14534a6779O685J3181M0882N8863J884j0580n5247k6271l071P786k5092r079L7872
14521B1034L084M104L8523m8247k3470J1077J7888Q688j0032l8419J2259O7911
14509F4400J1136l6886m5561K1442M0125J9750k8600j7972K7881N9933n369j404
14497A08875q9080k3952L6653j0786N0644M6391m2109k9504j8507M2308j1332
14486E9601P187k1504m594n6743M751N356K9103k0788p662K4872J8606J5209l0178
14473B3216l1803k7516K2Q528L123j2496k7550n7838j7534K1296J16573N8341
$$ plain form
14461 56362 62553 107938 138836 60477 16986 4211 7256 -19676 -16332 -16498 -14788 -14737 -39526
14448 -39526 -47383 10250 7755 -4246 -82449 -82864 -37447 12508 60244 -9223 -42696 -18348
14436 -18348 -22466 -7097 18513 40087 51465 58549 53534 46168 1940 1719 -28872 -9447 51013
14423 51013 26327 -7958 15449 22218 -27252 -38752 27821 45453 -15167 -105100 -146427 -102913
14411 -102913 -54534 6002 46825 -7655 -43654 190 12513 -15720 17368 -14202 -13834 27071
14399 27071 80926 72805 61228 68621 83804 63256 37470 34152 40441 13137 -16702 -28011
14387 -28011 -11344 3305 12203 10881 -8020 29867 9107 -14431 -68017 -32867 -21819 -23931
14375 -23931 -33571 -45905 -47856 -33256 -35635 -49714 -73607 -87642 -51556 -23904 -33350 -28720 -11510
$$ packed form
14461E6362O191M5385L0898p8359m3491j2775L045k6932L344j66J710N1k4789
14448c9526p857N7633k495j2001p8203m15M5417M9955M7736o9467l3473K4348
14436a8348m118J5369K5610K1574J1378P084n015p366m4228k21l0591J9425O0460
14423E1013k4686l4285K3407O769m9470j1500O6573J7632o0620q9933m1327M3514
14411a02913M8379O0536M0823n4480l5999M3844J2323k8233L3088l1570L68M0905
14399B7071N3855q121j1577P393J5183k0548k5786l318O289k7304k9839j1309
14387b8011J6667J4649Q898j322j8901L7887k0760k3538n3586L5150J1048k112
14375b3931r640j2334j951J4600k379j4079k3893j4035L6086K7652r446M630J7210
$$ plain form
14362 -11510 64708 69470 21872 14875 10831 35780 57251 26494 -17481 32591 54033 17138
14350 17138 -10080 8267 25205 15861 30061 27929 360 -71439 -95527 -95867 -27074 -7782
14338 -7782 -19953 3196 2796 15470 40967 31760 -28937 -36800 -35096 -23765 39833 -3612 900
14325 900 36499 128477 199717 119587 -25808 -50759 -6687 26004 71372 106573 129407 153686
14313 153686 120405 68872 21681 4660 6192 -24631 -34078 -56779 -45063 -78220 -67692 -32841
14301 -32841 -8253 -14799 -19434 -28886 -17732 35751 90900 80186 74630 57269 25457 -12725
14289 -12725 -52734 -44196 -32266 -29751 -33929 -92505 -52751 25144 57521 73482 95402 57868
14277 57868 -8102 -30775 -25099 -19963 -17479 -38145 -39379 -11722 -31924 5085 -858 29078 40832
$$ packed form
14362a1510P6218M762m7598o997m044K4949K1471l0757m3975N0072K1442l6895
14350A7138k7218J8347J6938r344J4200k132k7569p1799k4088l40O8793J9292
14338g782j2171K3149m00J2674K5497r207o0697p863J704J1331O3598m3445M512
14325I00L5599R1978P1240q0130j45395k4951M4072L2691M5368L5201K2834K4279
14313A53686l3281n1533m7191j7021J532l0823r447k2701J1716l3157J0528L4851
14301c2841K4588o546m635r452J1154N3483N5149j0714n556j7361l1812l8182
14289a2725m0009Q538J1930K515m178n8576L9754P7895L2377J5961K1920l7534
14277E7868o5970k2673N676N136K484k0666j234K7657k0202L7009n943K9936J1754
$$ plain form
14264 40832 -1878 29426 64862 -37679 -103867 -97573 -9754 3674 -57090 -117829 -90501 -68749
14252 -68749 -18969 -62092 -106628 -108997 -84271 -99927 -97283 -89576 -62508 -24217 28846 -2133
14240 -2133 24826 78904 82907 49611 40278 44697 -8392 -13105 35295 54627 22384 -4918 -39714
14227 -39714 12396 33657 60408 74475 99222 81806 68986 33094 -1303 -5082 15980 37336
14215 37336 58110 17930 2575 32933 55697 85269 48496 -4180 -28343 12635 33836 37217
14203 37217 3716 -14019 -57944 -59989 -29177 -30403 -16062 39702 64608 6961 -6182 27807
14191 27807 44057 20009 16646 59742 139093 102146 81659 127954 141409 89082 76147 101141
14179 101141 100054 71859 12307 9662 13920 55122 -31167 -49209 -20105 -60447 -13729 11652
$$ packed form
14264D0832m2710L1304L5436j02541o6188O294Q7819J3428o0764o0739K7328K1752
14252f8749M9780m3123m4536k369K4726j5656K644P707K7068L8291N3063l0979
14240b133K6959N4078M003l3296r333M419n3089m713M8400J9332l2243k7302l4796
14227c9714N2110K1261K6751J4067K4747j7416j2820l5892l4397l779K1062K1356
14215C7336K0774m0180j5355L0358K2764K9572l6773n2676k4163M0978K1201L381
14203C7217l3501j7735m3925k045L0812j226J4341N5764K4906n7647j3143L3989
14191B7807J6250k4048l363M3096P9351l6947k0487M6295J3455n2327j2935K4994
14179A01141j087k8195n9552k645M258M1202q6289j8042K9104m0342M6718K5381
$$ plain form
14167 11652 40533 35244 50420 52630 -21856 -79433 -57538 -66824 -78218 -54272 -59846 -59131 -900
14154 -900 -7577 -57128 -64077 -32303 -14836 35169 19415 -70932 -83898 -41869 52988 91678
14142 91678 36457 -24093 9751 -9468 -4945 28271 122772 76033 -27858 -41890 -22921 8672
14130 8672 26031 20369 11036 2626 -10749 6399 -20312 -78190 -82528 -66562 -41026 -73292 -136890
14117 -136890 -99444 -35537 -25251 -33691 -19609 -14232 -16284 -22160 -25924 18854 20000 2769 9667
14104 9667 11093 -1884 54620 93567 76097 8060 -2743 -32650 -15135 20451 11179 -50076
14092 -50076 -18762 16592 -18490 -31758 -49141 -96260 -87628 -44759 -1223 7854 59747 71929
14080 71929 71374 68143 54990 3003 -29418 -26417 -65892 -28192 27718 30235 -46530 -57664 -10183
$$ packed form
14167A1652K8881n289J5176K210p4486n7577K1895r286j1394K3946n574P15N8231
14154i00o677m9551o949L1774J7467N0005j5754r0347j2966M2029R4857L8690
14142I1678n5221o0550L3844j9219M523L3216R4501m6739j03891j4032J8969L1593
14130H672J7359n662r333q410j3375J7148k6711n7878m338J5966K5536l2266o3598
14117a36890L7446O3907J0286q440J4082N377k052n876l764M4778J146j7231O898
14104I667J426j2977N6504L8947j7470o8037j0803k9907J7515L5586r272o1255
14092e0076L1314L5354l5082j3268j7383m7119Q632M2869M3536R077N1893J2182
14080G1929n55l231j3153n1987l2421L001l9475L7700N5910K517p6765j1134M7481
$$ plain form
14067 -10183 -2007 -15894 49283 5269 -50875 -35411 -23034 -44006 -37469 9154 11269 1453
14055 1453 -24719 15981 22028 19215 -42205 -55921 -104364 -79791 30921 42433 -13968 2708
14043 2708 50234 55553 89382 112737 175350 131925 61354 57354 92649 109870 77981 45398
14031 45398 -6356 14464 23735 49595 30504 14319 45887 111829 118376 108826 109252 48479 67348
14018 67348 73140 38205 27523 29892 16461 39566 9834 9111 49472 65902 18145 -22835
14006 -22835 -75975 -45997 -7493 -13951 -41200 -8314 -29623 -19646 -20467 -70644 -88610 -49918
13994 -49918 -27761 -27341 3197 -5563 -77421 -48920 -53492 -14224 17506 4736 -61877 -27531
13982 -27531 51999 90290 88389 31451 -20721 25111 45483 18754 -29242 -10140 -24774 -9011
$$ packed form
14067a0183Q176j3887O5177m4014n6144J5464J2377k0972O537M6623K115r816
14055A453k6172M0700O047k813o1420j3716m8443K4573J10712J1512n6401J6676
14043B708M7526N319L3829K3355O2613m3425p0571m000L5295J7221l1889l2583
14031D5398n1754K0820R271K5860j9091j6185L1568O5942O547r550M26o0773J8869
14018F7348N792l4935j0682K369j3431K3105k9732p23M0361J6430m7757m0980
14006b2835n3140K9978L8504o458k7249L2886k1309R977q21n0177j7966L8692
13994d9918K2157M20L0538q760p1858K8501m572L9268L1730j2770o6613L4346
13982b7531P9530L8291j901n6938n2172M5832K0372k6729m7996J9102j4634J5763
$$ plain form
13970 -9011 73675 73205 69660 68355 -10016 -13541 -22401 -39866 4527 30122 32030 13468 -15307
13957 -15307 29596 20034 39879 32698 64617 97986 119495 103503 69627 48812 69720 116982
13945 116982 73517 6285 -10649 53113 85856 38938 15157 -15584 38110 52274 13949
13934 13949 -53210 -34777 -9455 -54668 -66004 -63408 -12481 24731 17087 46119 45183 58218
13922 58218 75706 83497 35415 73072 33847 47128 37726 -10145 18640 30243 22440 23380 30071
13909 30071 104478 142074 125886 76684 68075 102728 89209 82909 32734 1459 -12163 4078
13897 4078 2782 32127 15847 80975 85737 24351 2284 10148 45699 45998 62957 73254 -4869
13884 -4869 -41595 -47499 -38022 -12125 -5504 -23494 -2916 7782 -14486 -42279 -16514 -14009 -52525
$$ packed form
13970i011Q2686m70l545j305p8371l525q860j7465M4393K5595J908j8562k8775
13957a5307M4903r562J9845p181L1919L3369K1509j5992l3876k0815K0908M7262
13945A16982m3465o7232j6934O3762L2743m6918k3781l0741N3694J4164l8325
13934A3949o7159J8433K5322m5213j1336K596N0927L7212p644K9032r36J3035
13922E8218J7488P791m8082L7657l9225J3281r402m7871K8785J1603p803R40O691
13909C0071P4407L7596j6188m9202q609L4653j3519o300n0175l1275j3622J6241
13897D078j296K9345j6280O5128M762o1386k2067P864L5551K99J6959J0297p8123
13884d869l6726n904R477K5897O621j7990K0578J0698k2268k7793K5765K505l8516
$$ plain form
13871 -52525 -30193 -51358 -80992 -129033 -108416 -69858 -72109 -51838 -53740 -39204 -62073 -29134
13859 -29134 8532 46509 -5478 20646 4490 9826 33989 57251 52902 47963 47074 76027 24670
13846 24670 29377 11807 -30384 -13572 -31673 -94510 -73761 -54287 -31405 -86677 -116949 -104384
13834 -104384 -106560 -121836 -94707 -24705 -35105 -40023 15522 45541 18241 -44672 -91222 -109123
13822 -109123 -124727 -100662 -98602 -120776 -122575 -67461 -64360 -66767 -59634 -8947 56835 46970 13733
13809 13733 37422 64014 399 -37470 -30646 -38555 -524 5826 18747 29969 69735 66487
13797 66487 10852 -21623 23947 11735 42132 16034 6668 43639 67395 52728 -3462 -27851
13785 -27851 28200 28863 42374 37898 14543 -2369 -27101 -57095 -34556 9789 22215 60819
$$ packed form
13871e2525K2332k1165k9634m8041K0617L8558k251K0271j902J4536k2869L2939
13859b9134L7666L7977n1987K6124j6156N336K4163K3262m349m939q89K8953n1357
13846B4670M707j7570m2191J6812j8101o2837K0749J9474K2882n5272l0272J2565
13834a04384k176j5276K7129P0002j0400m918N5545L0019k7300o2913m6550j7901
13822a09123j5604K4065K060k2174j799N5114L101k407P133N0687O5782r865l3237
13809A3733K3689K6592o3615l7869O824p909L8031O350J2921J1222L9766l248
13797F6487n5635l2475M5570j2212L0397k6098r366L6971K3756j4667n6190k4389
13785b7851N6051O63J3511m476k3355j6912k4732k9994K2539M4345J2426L8604
$$ plain form
13773 60819 27594 943 -29505 -48854 16195 94812 44771 -20710 2598 5902 -35249 -27413
13761 -27413 26133 72992 54334 26894 -32163 -33311 -38185 -66879 -87792 -61615 -24381 47515
13749 47515 51279 8263 -15182 -61128 -65008 -81030 -68106 -59265 -96805 -121646 -113939 -96437
13737 -96437 -115909 -86160 -67368 -22514 9769 44938 5626 -67331 -67179 -31931 -30409 -12410
13725 -12410 -14743 97 -30527 -23777 -64921 -104634 -96289 -128261 -139488 -100062 -40390 13486
13713 13486 46716 9134 -10965 -37388 -48729 -52254 -92593 -119865 -121539 -44695 -2697 75067
13701 75067 59904 50243 39937 -3857 -6704 -4401 -18878 -1151 3446 -58318 -54195 -52507 -15080
13688 -15080 -38928 -124384 -162050 -148796 -110384 -74586 -67125 -109429 -89730 -66363 -85805 -60639
$$ packed form
13773F0819l3225k6651l0448j9349O5049P8617n0041o5481K3308L304m1151P836
13761b7413N3546M6859j8658k7440n9057j148m874k8694k0913K6177L7234P1896
13749D7515L764m3016k3445m5946l880j6022J2924Q841l7540k4841P707J7502
13737i6437j9472K9749J8792M4854L2283L5169l9312p2957J52L5248J522J7999
13725a2410k333J4840l0624O750m1144l9713Q345l1972j1227L9426N9672N3876
13713A3486L3230l7582k0099k6423j1341l525m0339k7272j674P6844M1998P7764
13701G5067j5163r661j0306m3794k847K303j4477J7727M597o1764M123J688L7427
13688a5080k3848q5456l7666J3254L8412L5798P461m2304J9699K3367j9442K5166
$$ plain form
13676 -60639 -28559 -67891 -80156 -41294 14201 71649 50160 -12222 -43165 -94357 -136945 -121700
13664 -121700 -67298 -11675 -41900 -82408 -52665 -85788 -67533 -54341 -36652 -19622 -55598
13653 -55598 -34904 -8647 -25897 -847 25987 320 -42821 -20769 -55611 -55940 -46442 -25744
13641 -25744 -46126 -27843 -39409 -57480 -60836 -5808 -18239 -2145 -37740 -76146 -102284 -17283
13629 -17283 17236 -17146 -7852 28602 50534 47475 12922 1044 16620 28619 20336 -10706
13617 -10706 -65119 -45083 53943 65882 -673 -21369 -71523 -42155 -6369 844 -41916 -55467
13605 -55467 -48385 -18458 35409 25513 17105 -65458 -80066 -47178 -43117 -56831 -7089 12011
13593 12011 -1588 -16393 -29584 -20973 -14057 -49635 -80604 -70498 -38702 -65981 -117047 -115868
$$ packed form
13676f0639L2080l9332j2265L8862N5495N7448k1489o2382l0943n1192m2588J5245
13664a21700N4402N5623l0225m0508K9743l3123J8255J3192J7689J7030l5976
13653e5598K0694K6257j7250K5050K6834k5667m3141K2052l4842l29R498K0698
13641b5744k0382J8283j1566j8071l356N5028j2431J6094l5595l8406k6138Q5001
13629a7283L4519l4382R294L6454K1932l059l4553j1878J5576J1999q283l1042
13617a0706n4413K0036R9026J1939o6555k0696n0154K9368L5786P213m2760j3551
13605e5467P082K9927N3867r896q408q2563j4608L2888M061j3714M9742J9100
13593A2011j3599j4805j3191Q611O916l5578l0969J0106L1796k7279n1066J179
$$ plain form
13581 -115868 -91604 -62459 -78449 -53330 -63142 -10040 14553 37806 -40952 -45263 -79975 -115668
13569 -115668 -131192 -124077 -112536 -54326 42988 25663 -18375 -37045 -41320 -36256 -65325 -101498
13557 -101498 -61039 -24588 -32152 -12545 -43749 -48379 12857 -364 -66908 -49223 -51231 -63970
13545 -63970 -84873 -85028 -88675 -72554 -69410 -7247 -23178 -93543 -87693 -101775 -61790 -59448 -53543
13532 -53543 -28218 21296 11669 -73261 -115526 -98722 -58604 -59687 -88316 -37758 64015 39090
13520 39090 72245 67009 -33113 -30731 -43946 -25370 -11756 21807 54419 24914 -1249 -511
13508 -511 -28606 -44606 -28143 25873 11971 -28500 -24733 -93614 -154151 -122251 -87654 -65550
13496 -65550 34565 30778 -17542 -34244 -826 45642 71649 42220 17231 53090 44602 -4502
$$ packed form
13581a15868K4264K9145j5990K5119r812N3102K4593K3253p8758m311l4712l5693
13569a15668j5524P115J1541N8210R7314j7325m4038j8670m275N064k9069l6173
13557a01498M0459L6451p564J9607l1204m630O1236j3221o6544J7685k008j2739
13545f3970k0903j55l647J6121L144O2163j5931p0365N850j4082L9985K342N905
13532e3543K5325M9514r627q4930m2265J6804M0118j083k8629N0558J01773k4925
13520C9090L3155n236j00122K382j3215J8576J3614L3563L2612k9505k6163P38
13508e11k8095j6000J6463N4016j3902m0471L767o8881o0537L1900L4597K2104
13496f5550J00115l787m8320j6702L3418M6468K6007k9429k4989L5859q488m9104
$$ plain form
13484 -4502 10766 -7773 -48830 -79800 -57727 -66625 -62210 -40014 10287 -6718 -40402 -40761 11851
13471 11851 15615 -165 -50603 -25928 -17682 -86995 -114152 -94835 -62953 -6896 -24672 -95359
13459 -95359 -67977 21696 46072 15373 25726 23045 44279 53007 -12409 -44692 -112881 -85769
13447 -85769 -80334 -56004 -23901 -7787 -58588 -46898 -46824 -44548 -52272 -75936 -78417 -35702 -69308
13434 -69308 -35432 -3241 -13477 1425 -19068 -57552 -71555 -111544 -127967 -48524 -23015 -24225
13422 -24225 33454 58839 57097 67072 48821 9635 32535 33036 24547 -32590 -23054 -64330 -125672
13409 -125672 -65964 -57267 -56269 -68418 -54650 -50381 -49927 -50610 -74955 -43809 14059 29463 51215
13396 51215 45831 74813 76119 30471 9004 -75674 -26738 -31417 -31890 -14178 4596 -19408 -41154
$$ packed form
13484d502J5268j8539m1057l0970K2073q898M415K2196N0301j7005l3684l59N2612
13471A1851L764j5780n0438K4675Q246o9313k7157J9317L1882N6057j7776p0687
13459i5359K7382Q9673K4376l0699J0353k681K1234Q728o5416l2283o8189K7112
13447h5769N435K4330L2103J6114n0801J1690P4K276p724k3664k481M2715l3606
13434f9308L3876L2191j0236J4902k0493l8484j4003l9989j6423P9443K5509j210
13422b4225N7679K5385j742R975j8251l9186K2900N01q489n7137R536m1276o1342
13409a25672N9708Q697R98j2149J3768M269M54o83k4345L1146N7868J5404K1752
13396E1215n384K8982J306m5648k1467q4678M8936m679m73J7712J8774k4004k1746
$$ plain form
13383 -41154 -42369 -69638 -43823 -31458 -42748 -42323 -61025 -83549 -79457 -68705 -70901 -113622 -101164
13370 -101164 -99260 -97125 -67336 -26075 17554 18836 10297 -31055 -45442 -47815 -61188 -13277
13358 -13277 6457 -6616 24528 39056 15155 -52624 -50486 -3525 -28781 -88808 -86199 -54477
13346 -54477 -89669 8723 63883 -3796 21471 67688 85543 86116 66926 -53712 -155364 -172304
13334 -172304 -147934 -125940 -50366 -79674 -137197 -119437 -62528 -73705 -50635 -2660 9030
13323 9030 8665 -6595 3508 -40122 -62203 -4760 -3379 -41547 -15382 14118 25979 65603
13311 65603 110050 150047 74119 -9729 -93865 -96126 -97408 -60281 -69512 -85371 -36163 -24808
13299 -24808 -49500 -12245 -407 -27362 -47018 -47942 -68812 -71324 -96395 -52853 -3177 30011
$$ packed form
13383d1154j215k7269K5815J2365j1290M25j8702k2524M092J0752k196m2721J2458
13370a01164J904K135K9789M1261M3629J282q539m1352j4387k373j3373M7911
13358a3277J9734j3073L1144J4528k3901o7779K138M6961k5256o0027K609L1722
13346e4477l5192R8392N5160o7679K5267M6217J7855N73j9190j20638j01652j6940
13334a72304K4370K1994P5574k9308n7523J7760N6909j1177K3070M7975J1690
13323I030l65j5260J0103m3630k2081N7443J381l8168K6165K9500J1861L9624
13311F5603M4447L9997p5928q3848q4136k261j282L7127r231j5859M9208J1355
13299b4808k4692L7255J1838k6955j9656r24k0870k512k5071M3542M9676L3188
$$ plain form
13287 30011 28746 28358 28496 58593 77695 79063 61658 23222 9858 17943 22527 5377 47374
13274 47374 53876 18434 -25078 -1975 4259 25780 51161 3367 -41535 -22699 -2501 -27510
13262 -27510 -56149 -45784 -22088 33230 -17553 8886 -7347 -52691 -65647 -48955 -86214 -89816
13250 -89816 -81182 -86257 -66317 -3440 37225 -22652 -35308 -10931 3983 -4597 -26987 -65363
13238 -65363 -37514 -25590 -92590 -111978 -57405 -10413 23062 -6251 -87356 -129376 -86948 -123193
13226 -123193 -96213 -2268 -2803 7503 -10779 -76844 -45762 -32826 -42301 -88307 -77289 -37405
13214 -37405 -17034 29348 53580 50958 120104 157688 134968 107563 57101 14526 42349 84761
13202 84761 137323 184066 252666 342560 486117 627792 701114 1036163 1535503 2236634 3050670
$$ packed form
13287C0011j265l88J38L0097J9102J368j7405l8436j3364Q085M584j7150M1997
13274D7374O502l5442m3512K3103O234K1521K5381m7794m4902J8836K0198k5009
13262b7510k8639J0365K3696N5318n0783K6439j6233m5344j2956J6692l7259l602
13250h9816Q634n075J9940O2877M0665n9877j2656K4377J4914q580k2390l8376
13238f5363K7849J1924o7000j9388N4573M6992L3475k9313q1105m2020M2428l6245
13226a23193K6980R3945n35J0306j8282o6065L1082J2936r475m6006J1018L9884
13214c7405K0371M6382K4232k622O9146L7584k2720k7405n0462m2575K7823M2412
13202H4761N2562M6743O8600Q9894J43557J41675P3322L35049M99340P01131Q14036
$$ plain form
13191 3050670 3646919 3590924 3120837 2432768 1768594 1262007 895713 665984 514431 418621
13181 418621 284912 252133 315970 352527 304559 283978 290402 304726 318040 378568 428578
13170 428578 453454 477310 586643 728313 890545 1111379 1401314 1915816 2753738 4126157
13160 4126157 6108931 8622861 10862657 11567526 10362182 8090350 5812630 4123740
13152 4123740 3026854 2289780 1799948 1407065 1132464 911701 789448 721608 681608 598612
13142 598612 595728 563005 537674 512993 535401 642092 661676 764155 889252 985504 1231303
13131 1231303 1596235 2068109 2784481 3943861 5811407 8379172 10865203 12031114 11195290
13122 11195290 8961780 6506721 4641248 3350957 2495689 1924791 1543939 1306277 1134286
$$ packed form
13191C050670N96249n5995m70087o88069o64174n06587l66294k29729j51553r5810
13181D18621j33709l2779O3837L6557m7968k0581O424J4324J3314O0528N0010
13170D28578K4876K3856J09333J41670J62232K20834K89935N14502Q37922J372419
13160D126157J982774K513930K239796P04869j205344k271832k277720j688890
13152D123740j096886p37074m89832l92883k74601k20763j22253o7840m0000q2996
13142E98612k884l2723k5331k4681K2408J06691J9584J02479J25097R6252K45799
13131A231303L64932M71874P16372J159380J867546K567765K486031J165911q35824
13122A1195290k233510k455059j865473j290291q55268n70898l80852k37662j71991
$$ plain form
13113 1134286 920305 740799 574891 533985 470064 384048 407502 389517 349601 338871 376659
13102 376659 448877 548699 604490 623353 705185 831311 1037614 1410879 1999468 2804710
13092 2804710 3745566 4288079 4097589 3356635 2553591 1828746 1305442 973609 786119
13083 786119 660760 540529 434719 346137 258633 253016 243384 202560 205984 153574 81949
13072 81949 66626 105087 106326 58354 42333 38840 130050 136837 102554 82507 86583 67453
13060 67453 104399 111042 24893 21394 71343 60186 63868 103228 116373 85400 15529 -6281
13048 -6281 3940 4995 15473 3965 -36013 -14308 -8218 6336 -11099 -4826 13557 -29759
13036 -29759 -64695 -33799 20749 -39444 -34580 5515 5886 -29704 -10278 56345 43038 -8248
$$ packed form
13113A134286k13981j79506j65908m0906o3921q6016K3454j7985l9916j0730L7788
13102C76659P2218R9822N5791J8863Q1832J26126K06303L73265N88589Q05242
13092B804710R40856N42513j90490p40954q03044p24845n23304l31833j87490
13083G86119j25359j20231j05810q8582q7504n617r632m0824L424n2410p1625
13072H1949j5323L8461J239m7972j6021l493R1210O787l4283k0047M076j9130
13060F7453L6946O643q6149l499M9949j1157L682L9360J3145l0973o9871k1810
13048f281J0221J055J0478j1508l9978K1705O090J4554j7435O273J8383m3316
13036b9759l4936L0896N4548o0193M864M0095L71l5590J9426O6623j3307n1286
$$ plain form
13024 -8248 16672 98512 154668 119125 102393 62462 44363 16563 35739 57697 44250 60843
13012 60843 39923 -41597 -84212 -31398 -15663 -430 9192 -3854 8622 74313 54407 11258
13000 11258 -10402 -18135 -21400 62295 125852 158165 124220 76941 22540 34198 38184 26793
12988 26793 41810 50251 34662 -16311 38220 28753 2831 -35761 -55216 -108367 -67446 -22990
12976 -22990 -23639 -38906 -29447 -23970 -14341 -24000 -15188 9809 -15278 -48704 -75173 -90291 -45679
12963 -45679 -14069 -33276 -12489 -29693 -92834 -57310 -25012 9378 23841 -37151 -54151 -37833
12951 -37833 5042 48431 54674 95671 123570 109677 110588 117599 126561 74528 38806 -9830 13444
12938 13444 35839 24414 -51532 -65368 -10729 16201 -11168 -3117 34732 59371 39122 25246
$$ packed form
13024h248K4920Q1840N6156l5543j6732l9931j8099k7800J9176K1958j3447J6593
13012F0843k0920q1520m2615N2814J5735J5233R622j3046J2476O5691j9906m3149
13000A1258k1660p733l265Q3695O3557L2313l3945m7279n4401J1658L986j1391
12988B6793J5017Q441j5589n0973N4531r467k5922l8592j9455n3151M0921M4456
12976b2990o49j5267R459N477R629r659Q812K4997k5087l3426k6469j5118M4612
12963d5679L1610j9207K0787j7204o3141L5524L2298L4390J4463o0992j7000J6318
12951c7833M2875M3389O243M0997K7899j3893R11P011Q962n2033l5722m8636K3274
12938A3444K2395j1425p5946j3836N4639K6930k7369Q051L7849K4639k0249j3876
$$ plain form
12926 25246 92802 51180 23847 46048 62803 49327 62973 68155 45631 -5038 -81490 -56715
12914 -56715 -9111 6472 -32723 -18869 -29670 -62314 -61975 -30701 -9946 6732 37928 59612
12902 59612 68225 80581 7708 36331 40637 35874 27276 -19844 -98116 -109964 -110300 -121364 -93986
12889 -93986 -90596 -86402 -72847 -35950 -18312 10622 27847 -33199 -90686 -88565 -111926 -91679
12877 -91679 -48410 -30597 70684 63332 14879 35033 50738 17599 -1524 -44370 -67528 -78559
12865 -78559 -75847 -85625 -141677 -149712 -87065 -39214 -44063 -79603 -56664 20783 34125 39698 6288
12852 6288 27015 48540 72150 57458 -306 -52521 -108113 -85325 11544 21873 21081 16723
12840 16723 35781 46329 27980 29199 -10385 29848 45289 17812 -17731 -42573 7671 -26371
$$ packed form
12926B5246O7556m1622k7333K2201J6755j3476J3646N182k2524n0669p6452K4775
12914e6715M7604J5583l9195J3854j0801l2644L39L1274K0755J6678L1196K1684
12902E9612Q613J2356p2873K8623M306m763q598m7120p8272j1848l36j1064K7378
12889i3986L390M194J3555L6897J7638K8934J7225o1046n7487K121k3361K0247
12877i1679M3269J7813J01281p352m8453K0154J5705l3139j9123m2846k3158j1031
12865g8559K712r778n6052q035O2647M7851m849l5540K2939P7447J3342N573l3410
12852F288K0727K1525K3610j4692n7764n2215n5592K2788R6869J0329p92m358
12840A6723J9058J0548j8349J219l9584M0233J5441k7477l5543k4842N0244l4042
$$ plain form
12828 -26371 6652 25554 34762 20474 40095 62435 41558 26342 25446 30028 21890 14365 17400
12815 17400 43967 10004 -52742 -2334 35967 20351 36340 9995 -32921 -37198 29839 3192
12803 3192 -11479 40271 63743 38453 -4519 38544 30150 -16987 -36490 -32925 -5163 -6313
12791 -6313 -7967 -38383 -79800 -75764 -96037 -56183 6924 44323 64522 20970 -15483 -52710
12779 -52710 -63522 -105761 -100683 -94731 -79474 -99629 -156254 -191560 -138690 -122937 -101949 -23458
12767 -23458 11073 23870 -21137 -5850 26067 38098 12075 -30752 1015 -29205 -99678 -118179
12755 -118179 -147135 -157190 -106311 -107085 -86643 -83838 -104128 -78200 -32574 51373 88833 59093
12743 59093 -20826 -40139 14506 19390 50127 1365 6013 63360 16687 -19640 5908 43427
$$ packed form
12828b6371L3023J8902R208j4288J9621K2340k0877j5216q96M582q138p525L035
12815A7400K6567l3963o2746N0408L8301j5616J5989k6345m2916m277O7037k6647
12803C192j4671N1750K3472k5290m2972M3063q394m7137j9503L565K7762j150
12791f313j654l0416m1417M036k0273L9854O3107L7399K0199m3552l6453l7227
12779e2710j0812m2239N078N952J5257k0155n6625l5306N2870J5753K0988P8491
12767b3458L4531J2797m5007J5287L1917J2031k6023m2827L1767l0220p0473j8501
12755a18179k8956j0055N0879p74K0442K805k0290K5928M5626Q3947L7460k9740
12743E9093p9919j9313N4645M884L0737m8762M648N7347m6673l6327K5548L7519
$$ plain form
12731 43427 54374 52802 51756 16142 32473 85290 98455 91334 108857 76142 16749 1532
12719 1532 4356 79741 104391 45168 20468 10742 28016 65472 95242 136158 125032 64522
12707 64522 38601 -8414 -69819 -71479 -7541 -9480 32645 22019 -11176 -4743 19130 38635
12695 38635 62189 65844 38973 99844 61387 44159 -12099 -35184 -42192 -65840 -15778 64100
12683 64100 54732 44947 2529 -1781 -6426 18454 16072 -773 11922 -49354 -23084 23273 -65574
12670 -65574 -118738 -86452 -55235 -40451 -10122 -34092 -99000 -45745 -32022 -55535 -10523 28055
12658 28055 16750 11007 28210 21404 31660 18846 -5361 -5729 -35949 -40385 -49861 -14794 -64649
12645 -64649 -25239 -3931 -16722 -45487 -92842 -109738 -131986 -120048 -119184 -103269 -79017 -89391
$$ packed form
12731D3427J0947j572j046l5614J6331N2817J3165p121J7523l2715n9393j5217
12719A532K824P5385K4650n9223k4700r726J7274L7456K9770M0916j1126o0510
12707F4522k5921m7015o1405j660O3938j939M2125j0626l3195O433K3873J9505
12695C8635K3554L655k6871O0871l8457j7228n6258k3085p008k3648N0062P9878
12683F4100r368r785m2418m310m645K4880k382j6845J2695o1276K6270M6357q8847
12670f5574n3164L2286L1217J4784L0329k3970o4908N3255J3723k3513M5012L8578
12658B8055j1305n743J7203o806J0256j2814k4207l68l0220m436r476L5067m9855
12645f4649L9410K1308j2791k8765m7355j6896k2248J1938Q64J5915K4252j0374
$$ plain form
12633 -89391 -106687 -128852 -106883 -67851 -24370 8482 64838 43337 35529 51919 46769 54123
12621 54123 23706 -51017 -98813 -78023 -28956 -35844 -24416 -14783 -91849 -127076 -99003 -70724
12609 -70724 -64159 -94454 -120304 -171455 -204855 -149430 -104128 -68156 -89259 -49635 18185 43357
12597 43357 78242 145832 99595 23317 22616 2002 6453 47667 84824 133955 116865 69995
12585 69995 68919 37310 2025 -47346 -54739 -42443 33199 48051 13843 32294 1686 76126
12573 76126 88822 56320 54210 107673 88205 87433 83004 98160 60263 89081 102600 128009
12561 128009 137175 126296 138173 160096 224490 303313 308116 296568 347363 420552 463011 475220
12549 475220 497101 474033 541167 576963 625675 682309 723863 731565 774369 794346 901009
$$ packed form
12633h9391j7296k2165K1969L9032M3481L2852N6356k1501p808J6390n150P354
12621E4123l0417p4723m7796K0790M9067o888J1428R633p7066l5227K8073K8279
12609g0724O565l0295k5850n1151l3400N5425M5302L5972k1103L9624O7820K5172
12597D3357L4885O7590m6237p6278p01k0614M451M1214L7157M9131j7090m6870
12585F9995j076l1609l5285m9371p393J2296P5642J4852l4208J8451l0608P4440
12573G6126J2696l2502k110N3463j9468p72m429J5156l7897K8818J3519K5409
12561A28009R166j0879J1877K1923O4394P8823M803j1548N0795P3189M2459J2209
12549D75220K1881k3068O7134L5796M8712N6634M1554P702M2804J9977J06663
$$ plain form
12538 901009 984796 1020747 1000103 956284 948378 920058 856815 849669 860278 902917 941664 924487
12526 924487 808353 731420 620487 574213 524224 492379 450476 408431 408596 358654 319661
12515 319661 282000 225361 188451 152640 158515 187592 217047 233843 174750 66570 69769 89480
12503 89480 89533 54711 38950 37036 -5679 -29803 -17823 -22196 8154 48619 31374 -7196 11602
12490 11602 14091 11255 10790 1181 37736 66538 -7110 -59638 -69252 -104787 -69104 -32280 -5009
12477 -5009 25626 75239 50780 -908 -58969 -69761 -37394 -29995 -11163 9393 3902 -16481
12465 -16481 -41500 -30855 -54284 -52539 17076 -640 -67613 -131967 -169258 -170233 -119838 -76444
12453 -76444 -42672 -75642 -81864 -71899 -54544 -87243 -110746 -62954 -67405 -69552 -28086 -52085
$$ packed form
12538I01009Q3787L5951k0644m3819p906k8320o3243p146J0609M2639L8747j7177
12526I24487j16134p6933j10933m6274m9989l1845m1903m2045J65m9942l8993
12515C19661l7661n6639l6910l5811N875K9077K9455J6796n9093j08180L199J9711
12503H9480N3l4822j5761j914m2715k4124J1980m373L0350M0465j7245l8570J8798
12490A1602K489k836m65r609L6555K8802p3648n2528r614l5535L5683L6824K7271
12477e009L0635M9613k4459n1688n8061j0792L2367P399J8832K0556n491k0383
12465a6481k5019J0645k3429J745O9615j7716o6973o4354l7291r75N0395M3394
12453g6444L3772l2970o222R965J7355l2699k3503M7792m451k147M1466k3999
$$ plain form
12441 -52085 -115326 -123794 -93067 -97828 -106613 -123258 -117306 -145462 -110979 -62479 -91471 -120288
12429 -120288 -173569 -187536 -194467 -151702 -169515 -127752 -139874 -169367 -163182 -162771 -118072 -107019
12417 -107019 -81829 -60195 -60890 -75179 -70815 -113193 -107666 -97354 -105988 -63217 -51734 -52191 -38788
12404 -38788 -18288 -29593 -59242 -72018 -86691 -76180 -53440 -35503 -9028 16017 -19497 -42019
12392 -42019 -55974 -62555 -13301 -35490 -72975 -69009 -49754 -19396 -3510 -8520 -18843 -53155
12380 -53155 -40153 -38003 -84855 -95024 -54100 -64030 -78438 -59064 -61438 -52469 -47932 -81424 -52747
12367 -52747 -13754 -44319 -61407 -54432 -66115 -134259 -104282 -73232 -103523 -101349 -85691 -134161
12355 -134161 -106138 -112239 -106917 -58168 -137841 -162120 -83185 -18401 -964 -25957 -28633 -9662
$$ packed form
12441e2085o3241q468L0727m761q785j6645N952k8156L4483M8500k8992k8817
12429a20288n3281j3967o931M2765j7813M1763j2122k9493O185M11M4699J1053
12417a07019K5190K1634o95j4289M364m2378N527J0312q634M2771J1483m57J3403
12404c8788K0500j1305k9649j2776j4673J0511K2740J7937K6475K5045l5514k2522
12392d2019j3955o581M9254k2189l7485L966J9255L0358J5886n010j0323l4312
12380e3155J3002K150m6852j0169M0924r930j4408J9374k374Q969M537l3492K8677
12367e2747L8993l0565j7088O975j1683o8144K9977L1050l0291K174J5658m8470
12355a34161K8023o101N322M8749p9673k4279P8935O4784J7437k4993k676J8971
$$ plain form
12343 -9662 -7822 -90307 -106317 -83323 -75314 -59171 -292 -45806 -99945 -118371 -82835 -33136
12331 -33136 -44482 -87004 -70803 -109556 -86821 -89724 -119798 -72624 -30400 -73288 -36145 -13952
12319 -13952 -32429 -72890 -63730 -68938 -91061 -43152 -21692 -37050 -78285 -142634 -91675 -47895
12307 -47895 -38705 -68570 -108688 -62439 -40608 -62333 -21626 -39404 -58485 -63853 -33071 -32991 -26417
12294 -26417 -53070 -82173 -98362 -79155 -81786 -28338 -4714 -40231 -3181 7759 -13857 -32282
12282 -32282 -73542 -85150 -88031 -58025 -70097 -126320 -121330 -118037 -80893 -49137 -72705 -94566
12270 -94566 -93468 -49937 -33904 -20891 -10148 -20031 -7865 -4139 -56650 -133584 -193287 -162140
12258 -162140 -145405 -156280 -178310 -127841 -76135 -109294 -98311 -85645 -92903 -66223 14740 1858
$$ packed form
12343i662J840q2485j6010K2994Q009J6143N8879m5514n4139j8426L5536M9699
12331c3136j1346m2522J6201l8753K2735k903l0074M7174M2224m2888L7143K2193
12319a3952j8477m0461R160n208k2123M7909K1460j5358m1235o4349N0959M3780
12307d7895R190k9865m0118M6249K1831k1725M0707j7778j9081n368L0782Q0O574
12294b6417k6653k9103j6189J9207k631N3448K3624l5517L7050J0940k1616j8425
12282c2282m1260j1608k881L0006j2072n6223M990L293L7144L1756k3568k1861
12270i4566J098M3531J6033J3013J0743r883J2166L726n2511p6934n9703L1147
12258a62140J6735j0875k2030N0469N1706l3159J0983J2666p258K6680Q0963j2882
$$ plain form
12246 1858 5935 7032 1255 57393 90494 69517 14099 -616 -3645 -91 5395 31589 26752
12233 26752 71033 134524 129049 77088 23696 -16174 -24277 8366 -7498 -14486 8484 8627 -40738
12220 -40738 -81196 -52462 -52370 -60191 -38394 -27666 -10245 -43504 -64893 -84991 -93688 -24744 5957
12207 5957 -41411 -55251 -100312 -110872 -65111 -60520 -84967 -43365 9781 19166 30464 45849
12195 45849 48089 46512 41776 14243 -31488 48448 68458 117763 123706 130189 129491 143504 126336
12182 126336 132434 111802 55603 30881 74519 57444 68228 73105 92121 97003 50569 61616
12170 61616 65163 12694 -29414 -43117 -65680 -90517 -72358 -73097 -39286 -50033 -88157 -110293
12158 -110293 -77925 -58229 -66398 -96326 -101226 -69407 -60295 -75875 -59130 9378 12331 -35168
$$ packed form
12246A858M077J097n777N6138L3101k0977n5418j4715l029L554N486K6194m837
12233B6752M4281O3491n475n1961n3392l9870q103L2643j5864o988K2970J43m9365
12220d0738m0458K8734R2p821K1797J0728J7421l3259k1389k0098q697O8944L0701
12207E957m7368j3840m5061j0560M5761M591k4447M1602N3146R385J1298J5385
12195D5849K240j577m736k7533m5731P9936K0010M9305N943O483o98J4013j7168
12182A26336O098k0632n6199k4722M3638j7075J0784M877J9016M882m6434J1047
12170F1616L547n2469m2108j3703k2563k4837J8159p39L3811j0747l8124k2136
12158a10293L2368J9696q169k9928m900L1819R112j5580J6745O8508K953m7499
$$ plain form
12146 -35168 -52394 -44530 -101946 -84603 -13640 20276 -31865 -55517 -71996 -6917 24555 6805
12134 6805 25152 37053 11056 -25003 -72610 -76298 -29455 -63201 -74840 -75586 -100158 -110770
12122 -110770 -104276 -64139 -9949 29442 21429 -60642 -111664 -117622 -124920 -40245 42379 56457
12110 56457 18953 -76707 -81987 -32622 -23156 50627 69195 23853 -32916 -60650 16318 64987
12098 64987 143159 141002 134188 95327 94573 123633 67576 54056 28147 -22925 -21776 -6517 -21921
12085 -21921 -26110 -78122 -77669 -48518 18040 80333 96256 116745 156875 128143 77256 14986
12073 14986 -51389 -73529 -73225 -27946 26006 106051 160950 182127 310624 403392 340099 274824
12061 274824 222895 143969 36754 11555 -16698 -88267 -136416 -98679 -62234 -44910 24004
$$ packed form
12146c5168j7226P864n7416J7343P0963L3916n2141k3652j6479O5079L1472j7750
12134F805J8347J1901k5997l6059m7607l688M6843l3746j1639p46k4572j0612
12122a10770O494M0137N4190L9391q013q2071n1022n958p298Q4675Q2624J4078
12110E6457l7504r5660n280M9365R466P3783J8568m5342n6769k7734P6968M8669
12098F4987P8172k157o814l8861p54K9060n6057j3520k5909n1072J149J5259j5404
12085b1921m189n2012M53K9151O6558O2293J5923K0489M0130k8732n0887o2270
12073A4986o6375k2140L04M5279N3952Q0045N4899K1177J28497R2768o3293o5275
12061B74824n1929p8926j07215k5199k8253p1569m8149L7737L6445J7324O8914
$$ plain form
12050 24004 73476 76224 22760 7172 -20199 -51668 -82679 -157896 -158422 -117867 -105924 -126102
12038 -126102 -113135 -134973 -111045 -47331 -38490 -38930 -53351 -78824 -23951 4879 30941 53080
12026 53080 101041 144261 122366 108198 94508 18850 15002 49521 29586 25330 49769 93503
12014 93503 94743 146631 147590 111412 69733 89329 103844 87225 97963 118494 176284 165059
12002 165059 154379 118346 106965 77106 119234 182967 204184 142345 127932 138228 160155
11991 160155 182988 87294 4962 32242 61790 76608 109421 134139 142580 158344 189687 214700
11979 214700 226267 223278 196573 224321 320105 409610 440710 380796 417969 494851 568941 660460
11967 660460 678792 694071 784450 830757 859965 1018243 1049926 1093232 1247555 1379849 1534100
$$ packed form
12050B4004M9472K748n3464j5588k7371l1469l1011p5217n26M0555J1943k0178
12038a26102J2967k1838K3928O3714Q841m40j4421k5473N4873K8830K6062K2139
12026E3080M7961M3220k1895j4168j3690p5658l848L4519j9935m256K4439M3734
12014I3503J240N1888R59l6178m1679J9596J4515j6619J0738K0531N7790j1225
12002A65059j0680l6033j1381k9859M2128O3733K1217o1839j4413J0296K1927
11991A60155K2833r5694q2332K7280K9548J4818L2813K4718Q441J5764L1343K5013
11979B14700J1567k989k6705K7748R5784Q9505L1100n9914L7173P6882P4090R1519
11967F60460J8332J5279R0379M6307K9208J58278L1683M3306J54323J32294J54251
$$ plain form
11956 1534100 1673335 1791689 2000216 2286866 2532047 2721923 2984535 3295703 3769033
11947 3769033 4247428 4820881 5472893 6248209 7272945 8572366 10185069 12208540 14850657
11938 14850657 18431156 23535456 31046884 42509801 60884164 91197641 140051279
11931 140051279 209377783 280997537 315614793 293706608 233195015 167307308 116552541
11924 116552541 82396495 60051692 45229758 35014928 27742589 22382540 18442405
11917 18442405 15476944 13133774 11334489 9860597 8654574 7716142 6945286 6315219
11909 6315219 5790473 5342516 4911391 4548851 4222570 3989742 3724369 3474501 3248634
11900 3248634 3083552 2938569 2747653 2597303 2525319 2506846 2440740 2324804 2270859 2141706
$$ packed form
11956A534100J39235J18354K08527K86650K45181J89876K62612L11168M73330
11947C769033M78395N73453O52012P75316J024736J299421J612703K023471K642117
11938A4850657L580499N104300P511428J1462917J8374363L0313477M8853638
11931A40051279O9326504P1619754L4617256k1908185o0511593o5887707n0754767
11924A16552541l4156046k2344803j4821934j0214830p272339n360049l940135
11917A8442405k965461k343170j799285j473892j206023r38432p70856o30067
11909F315219n24746m47957m31125l62540l26281k32828k65373k49868k25867
11900C248634j65082j44983j90916j50350p1984j8473o6106j15936n3945j29153
$$ plain form
11890 2141706 1999258 1931621 1921783 1869828 1806436 1685476 1586982 1548465 1540791 1542894 1538222 1438767
11878 1438767 1401769 1414414 1408215 1345325 1291396 1318961 1361213 1359821 1273504 1246893 1228269 1228075
11866 1228075 1161706 1071759 1055185 1059082 1031934 1042494 1018451 954928 954020 995374 952186 906939
11854 906939 865978 856557 848455 819175 816966 812322 801638 794887 805128 736322 705372 716419
11842 716419 730155 693453 642417 650798 665897 620995 650978 712932 706134 694859 670408 669955
11830 669955 663241 717949 711898 703310 638888 593624 633758 667378 649387 628453 668731 642975
11818 642975 576668 498736 438055 392577 383482 396994 450036 452323 409696 442475 464762 467394
11806 467394 440635 432461 421355 488078 554598 537134 430192 353177 358384 271522 200704 208698
$$ packed form
11890B141706j42448o7637r838n1955o3392j20960r8494l8517p674K103m672r9455
11878A438767l6998J2645o199o2890n3929K7565M2252j392q6317k6611j8624j94
11866A228075o6369q9947j6574L897k7148J0560k4043o3523r08M1354m3188m5247
11854I06939m0961r421q102k9280k209m644j0684o751J0241o8806l0950J1047
11842G16419J3736l6702n1036Q381J5099m4902K9983O1954o798j1275k4451m53
11830F69955o714N4708o051q588o4422m5264M0134L3620j7991k0934M0278k5756
11818F42975o6307p7932o0681m5478r095J3512N3042K287m2627L2779K2287K632
11806D67394k6759q174j1106O6723O6520j7464j06942p7015N207q6862p0818P994
$$ plain form
11794 208698 223764 225556 202636 189247 135702 72342 90905 107622 116192 142649 183161 197793
11782 197793 191850 168488 192395 202545 185966 168765 154756 164744 119171 31333 19363 54573
11770 54573 129381 137604 125745 91311 43728 62605 59532 84285 164472 158457 136633 130695
11758 130695 128295 165265 178407 163616 85199 61121 126711 163867 119596 114670 63467 -1510
11746 -1510 -50056 -22162 46671 55111 61477 83041 72691 108838 142096 57852 -23992 -41266
11734 -41266 -19427 -23625 -9003 -6655 3603 82856 85255 57808 74406 130152 92640 61504
11722 61504 50379 -12256 -38465 9762 35329 38029 44197 86939 77532 81677 96613 138390
11710 138390 117801 133591 168506 134029 143904 129329 112985 31680 -30769 -11552 53231 61439
$$ packed form
11794B08698J5066J792k2920j3389n3545o3360J8563J6717Q570K6457M0512J4632
11782A97793n943k3362K3907J0150j6579j7201j4009R988m5573q7838j1970L5210
11770E4573P4808Q223j1859l4434m7583J8877l073K4753Q0187o015k1824n938
11758A30695k400L6970J3142j4791p8417k4078O5590L7156m4271m926n1203o4977
11746a510m8546K7894O8833Q440O366K1564j0350L6147L3258q4244q1844j7274
11734d1266K1839m198J4622K348J0258P9253K399k7447J6598N5746l7512l1136
11722F1504j1125o2635k6209M8227K5567K700O168M2742r407M145J4936M1777
11710A38390k0589J5790L4915l4477R875j4575j6344q1305o2449J9217O4783Q208
$$ plain form
11698 61439 79748 62978 -7128 3306 28848 48522 85852 123863 166768 204883 229635 285555
11686 285555 256561 190455 167532 226135 288414 362157 398805 522066 667474 752480 773327
11675 773327 824066 894587 1012049 1242476 1641554 2179047 2806448 3615501 4803848 6894295
11665 6894295 10740356 17612025 28988032 43451653 53173174 51499524 40980860 28594690
11657 28594690 19287847 13353059 9613178 7196090 5631080 4519140 3757063 3255223
11649 3255223 2877560 2574972 2335277 2228343 2105035 2000833 1985655 1991079 2079964 2254447
11639 2254447 2447772 2701892 3058865 3615136 4397934 5544138 7472674 10784474 16686442
11630 16686442 26647811 40080405 50693980 50814360 41544776 29213665 19378859 13050249
$$ packed form
11698F1439J8309j6770p0106J0434K5542J9674L7330L8011M2905L8115K4752N5920
11686B85555k8994o6106k2923N8603O2279P3743L6648J23261J45408Q5006K0847
11675G73327N0739P0521J17462K30427L99078N37493O27401Q09053J188347K090447
11665F894295L846061O871669J1376007J4463621R721521j673650j0518664j2386170
11657B8594690r306843n934788l739881k417088j565010j111940p62077n01840
11649C255223l77663l02588k39695j06934j23308j04202j5178N424Q8885J74483
11639B254447J93325K54120L56973N56271P82798J146204J928536L311800N901968
11630A6686442R961369J3432594J0613575J20380r269584j2331111r834806o328610
$$ plain form
11622 13050249 9154432 6659102 5045520 3942296 3140455 2467117 2032061 1804525 1590151
11613 1590151 1381972 1203945 1095864 1024571 993655 988102 944727 923647 893875 930016 946697
11602 946697 866976 824342 793505 754327 718598 728917 740809 712364 743494 729598 707078
11591 707078 722585 757395 741787 743197 765380 810229 770985 715541 671379 655160 590521 599329
11579 599329 591681 541853 482937 435592 442971 514081 525665 521201 448366 438770 418870 383667
11567 383667 333045 335822 346484 349527 356981 398179 433913 446624 440406 419592 371300 371862 384793
11554 384793 456252 514120 515415 466425 418326 433717 483705 480548 469914 420838 426495 416419
11542 416419 345810 287521 243855 231834 246352 244731 287677 228595 240165 250226 243932 235432
$$ packed form
11622A3050249l895817k495330j613582j103224q01841o73338m35056k27536k14374
11613A590151k08179j78027j08081p1293l0916n553m3375k1080k9772L6141J6681
11602I46697p9721m2634l0837l9178l5729J0319J1892k8445L1130j3896k2520
11591G07078J5507L4810j5608J410K2183M4849l9244n5444m4162j6219o4639Q808
11579E99329p648m9828n8916m7345P379P1110J1584m464p2835r596j9900l5203
11567C83667n0622K777J0662L043P454M1198L5734J2711o218k0814m8292N62J2931
11554C84793P1459N7868J295m8990m8099J5391M9988l157j0634m9076N657j0076
11542D16419p0609n8289m3666j2021J4518j621M2946n9082J1570J0061o294q500
$$ plain form
11530 235432 174049 128828 131463 150003 163058 132779 142162 131749 216103 345191 366232 288948
11518 288948 226942 203353 170842 159882 181201 211490 203873 155361 191742 263613 293604 293449
11506 293449 284022 328337 373100 364109 443738 522103 525138 574239 628748 686909 788739 882305
11494 882305 936597 986159 960201 956364 967797 966370 912438 884543 866035 804249 689823 624110
11482 624110 628919 617318 608718 610858 587855 581698 569890 637942 718437 729374 724538 752741
11470 752741 722004 696751 746736 773476 812281 902611 940223 959430 934272 926472 994085 1041720
11458 1041720 1145504 1168610 1134411 1135148 1138599 1114713 1020511 1014998 1039668 1062603 1013361 988254
11446 988254 1015680 939321 845996 767820 772301 796656 831056 891413 908056 806926 764468
$$ packed form
11530B35432o1383m5221K635J8540J3055l0279R383j0413Q4354J29088K1041p7284
11518B88948o2006k3589l2511j0960K1319L0289p617m8512L6381P1871K9991j55
11506B93449r427M4315M4763q991P9629P8365L035M9101N4509N8161J01830R3566
11494H82305N4292M9562k5958l837J1433j427n3932k7895j8508o1786j14426o5713
11482F24110M809j1601q600K140k3003o157j1808O8052Q0495J0937m836K8203
11470G52741l0737k5253M9985K6740L8805R0330L7612J9207k5158p800O7613M7635
11458A041720J03784K3106l4199P37L451k3886r4202n513K4670K2935m9242k5107
11446I88254K7426p6359r3325p8176M481K4355L4400O0357J6643j01130m2458
$$ plain form
11435 764468 780240 729761 686343 668723 688255 715694 726924 740904 760569 833578 857574
11424 857574 875652 913424 980067 1072125 1170492 1196733 1205227 1148741 1161980 1116218 1044937 954047
11412 954047 891451 889393 849612 782140 728891 694316 645153 621743 562264 509170 455896 395211
11400 395211 300327 258803 209951 202574 194615 203465 197579 304971 370828 344907 342012 327547
11388 327547 280397 244336 232117 167607 147949 137604 178765 207505 181067 114295 77732
11377 77732 119351 138255 146900 160531 127821 115748 106431 151260 144295 179619 184446 137199
11365 137199 76143 113170 154218 136547 113421 155000 188012 203482 208130 183478 143747 139931
$$ packed form
11435G64468J5772n0479m3418j7620J9532K7439J1230J3980J9665P3009K3996
11424H57574J8078L7772O6643R2058R8367K6241Q494n6486J3239m5762p1281r0890
11412I54047o2596k058l9781o7472n3249l4575m9163k3410n9479n3094n3274o0685
11400C95211r4884m1524m8852p377p959Q850n886J07392O5857k5921k895j4465
11388C27547m7150l6061j2219o4510j9658j0345M1161K8740k6438o6772l6563
11377G7732M1619J8904Q645J3631l2710j2073r317M4829o965L5324M827m7247
11365A37199o1056L7027M1048j7671k3126M1579L3012J5470M648k4652l9731l816
$$ [...]
##END NTUPLES=NMR SPECTRUM
##END=
